lucene-dev mailing list archives

Site index · List index
Message view « Date » · « Thread »
Top « Date » · « Thread »
From Apache Jenkins Server <jenk...@builds.apache.org>
Subject [JENKINS-MAVEN] Lucene-Solr-Maven-4.x #81: POMs out of sync
Date Sun, 02 Sep 2012 02:48:26 GMT
Build: https://builds.apache.org/job/Lucene-Solr-Maven-4.x/81/

3 tests failed.
FAILED:  org.apache.solr.handler.extraction.ExtractingRequestHandlerTest.testArabicPDF

Error Message:
ERROR: [doc=one] unknown field 'meta:creation-date'

Stack Trace:
org.apache.solr.common.SolrException: ERROR: [doc=one] unknown field 'meta:creation-date'
	at __randomizedtesting.SeedInfo.seed([CBBAEF9C751D61B0:A57C949376D8CAE5]:0)
	at org.apache.solr.update.DocumentBuilder.toDocument(DocumentBuilder.java:306)
	at org.apache.solr.update.AddUpdateCommand.getLuceneDocument(AddUpdateCommand.java:73)
	at org.apache.solr.update.DirectUpdateHandler2.addDoc(DirectUpdateHandler2.java:208)
	at org.apache.solr.update.processor.RunUpdateProcessor.processAdd(RunUpdateProcessorFactory.java:61)
	at org.apache.solr.update.processor.UpdateRequestProcessor.processAdd(UpdateRequestProcessor.java:51)
	at org.apache.solr.update.processor.DistributedUpdateProcessor.versionAdd(DistributedUpdateProcessor.java:463)
	at org.apache.solr.update.processor.DistributedUpdateProcessor.processAdd(DistributedUpdateProcessor.java:342)
	at org.apache.solr.handler.extraction.ExtractingDocumentLoader.doAdd(ExtractingDocumentLoader.java:121)
	at org.apache.solr.handler.extraction.ExtractingDocumentLoader.addDoc(ExtractingDocumentLoader.java:126)
	at org.apache.solr.handler.extraction.ExtractingDocumentLoader.load(ExtractingDocumentLoader.java:233)
	at org.apache.solr.handler.ContentStreamHandlerBase.handleRequestBody(ContentStreamHandlerBase.java:74)
	at org.apache.solr.handler.RequestHandlerBase.handleRequest(RequestHandlerBase.java:129)
	at org.apache.solr.core.SolrCore.execute(SolrCore.java:1692)
	at org.apache.solr.util.TestHarness.queryAndResponse(TestHarness.java:375)
	at org.apache.solr.handler.extraction.ExtractingRequestHandlerTest.loadLocal(ExtractingRequestHandlerTest.java:602)
	at org.apache.solr.handler.extraction.ExtractingRequestHandlerTest.testArabicPDF(ExtractingRequestHandlerTest.java:388)
	at sun.reflect.NativeMethodAccessorImpl.invoke0(Native Method)
	at sun.reflect.NativeMethodAccessorImpl.invoke(NativeMethodAccessorImpl.java:57)
	at sun.reflect.DelegatingMethodAccessorImpl.invoke(DelegatingMethodAccessorImpl.java:43)
	at java.lang.reflect.Method.invoke(Method.java:616)
	at com.carrotsearch.randomizedtesting.RandomizedRunner.invoke(RandomizedRunner.java:1559)
	at com.carrotsearch.randomizedtesting.RandomizedRunner.access$600(RandomizedRunner.java:79)
	at com.carrotsearch.randomizedtesting.RandomizedRunner$6.evaluate(RandomizedRunner.java:737)
	at com.carrotsearch.randomizedtesting.RandomizedRunner$7.evaluate(RandomizedRunner.java:773)
	at com.carrotsearch.randomizedtesting.RandomizedRunner$8.evaluate(RandomizedRunner.java:787)
	at com.carrotsearch.randomizedtesting.rules.SystemPropertiesRestoreRule$1.evaluate(SystemPropertiesRestoreRule.java:53)
	at org.apache.lucene.util.TestRuleSetupTeardownChained$1.evaluate(TestRuleSetupTeardownChained.java:50)
	at org.apache.lucene.util.TestRuleFieldCacheSanity$1.evaluate(TestRuleFieldCacheSanity.java:51)
	at org.apache.lucene.util.AbstractBeforeAfterRule$1.evaluate(AbstractBeforeAfterRule.java:45)
	at com.carrotsearch.randomizedtesting.rules.SystemPropertiesInvariantRule$1.evaluate(SystemPropertiesInvariantRule.java:55)
	at org.apache.lucene.util.TestRuleThreadAndTestName$1.evaluate(TestRuleThreadAndTestName.java:48)
	at org.apache.lucene.util.TestRuleIgnoreAfterMaxFailures$1.evaluate(TestRuleIgnoreAfterMaxFailures.java:70)
	at org.apache.lucene.util.TestRuleMarkFailure$1.evaluate(TestRuleMarkFailure.java:48)
	at com.carrotsearch.randomizedtesting.rules.StatementAdapter.evaluate(StatementAdapter.java:36)
	at com.carrotsearch.randomizedtesting.ThreadLeakControl$StatementRunner.run(ThreadLeakControl.java:345)
	at com.carrotsearch.randomizedtesting.ThreadLeakControl.forkTimeoutingTask(ThreadLeakControl.java:769)
	at com.carrotsearch.randomizedtesting.ThreadLeakControl$3.evaluate(ThreadLeakControl.java:429)
	at com.carrotsearch.randomizedtesting.RandomizedRunner.runSingleTest(RandomizedRunner.java:746)
	at com.carrotsearch.randomizedtesting.RandomizedRunner$3.evaluate(RandomizedRunner.java:648)
	at com.carrotsearch.randomizedtesting.RandomizedRunner$4.evaluate(RandomizedRunner.java:682)
	at com.carrotsearch.randomizedtesting.RandomizedRunner$5.evaluate(RandomizedRunner.java:693)
	at com.carrotsearch.randomizedtesting.rules.StatementAdapter.evaluate(StatementAdapter.java:36)
	at com.carrotsearch.randomizedtesting.rules.SystemPropertiesRestoreRule$1.evaluate(SystemPropertiesRestoreRule.java:53)
	at org.apache.lucene.util.AbstractBeforeAfterRule$1.evaluate(AbstractBeforeAfterRule.java:45)
	at org.apache.lucene.util.TestRuleStoreClassName$1.evaluate(TestRuleStoreClassName.java:42)
	at com.carrotsearch.randomizedtesting.rules.SystemPropertiesInvariantRule$1.evaluate(SystemPropertiesInvariantRule.java:55)
	at com.carrotsearch.randomizedtesting.rules.NoShadowingOrOverridesOnMethodsRule$1.evaluate(NoShadowingOrOverridesOnMethodsRule.java:39)
	at com.carrotsearch.randomizedtesting.rules.NoShadowingOrOverridesOnMethodsRule$1.evaluate(NoShadowingOrOverridesOnMethodsRule.java:39)
	at org.apache.lucene.util.TestRuleAssertionsRequired$1.evaluate(TestRuleAssertionsRequired.java:40)
	at org.apache.lucene.util.TestRuleMarkFailure$1.evaluate(TestRuleMarkFailure.java:48)
	at org.apache.lucene.util.TestRuleIgnoreAfterMaxFailures$1.evaluate(TestRuleIgnoreAfterMaxFailures.java:70)
	at org.apache.lucene.util.TestRuleIgnoreTestSuites$1.evaluate(TestRuleIgnoreTestSuites.java:55)
	at com.carrotsearch.randomizedtesting.rules.StatementAdapter.evaluate(StatementAdapter.java:36)
	at com.carrotsearch.randomizedtesting.ThreadLeakControl$StatementRunner.run(ThreadLeakControl.java:345)
	at java.lang.Thread.run(Thread.java:679)


FAILED:  org.apache.solr.handler.extraction.ExtractingRequestHandlerTest.testLiteralsOverride

Error Message:
ERROR: [doc=three] unknown field 'meta:save-date'

Stack Trace:
org.apache.solr.common.SolrException: ERROR: [doc=three] unknown field 'meta:save-date'
	at __randomizedtesting.SeedInfo.seed([CBBAEF9C751D61B0:F3D1AE72A7520D71]:0)
	at org.apache.solr.update.DocumentBuilder.toDocument(DocumentBuilder.java:306)
	at org.apache.solr.update.AddUpdateCommand.getLuceneDocument(AddUpdateCommand.java:73)
	at org.apache.solr.update.DirectUpdateHandler2.addDoc(DirectUpdateHandler2.java:208)
	at org.apache.solr.update.processor.RunUpdateProcessor.processAdd(RunUpdateProcessorFactory.java:61)
	at org.apache.solr.update.processor.UpdateRequestProcessor.processAdd(UpdateRequestProcessor.java:51)
	at org.apache.solr.update.processor.DistributedUpdateProcessor.versionAdd(DistributedUpdateProcessor.java:463)
	at org.apache.solr.update.processor.DistributedUpdateProcessor.processAdd(DistributedUpdateProcessor.java:342)
	at org.apache.solr.handler.extraction.ExtractingDocumentLoader.doAdd(ExtractingDocumentLoader.java:121)
	at org.apache.solr.handler.extraction.ExtractingDocumentLoader.addDoc(ExtractingDocumentLoader.java:126)
	at org.apache.solr.handler.extraction.ExtractingDocumentLoader.load(ExtractingDocumentLoader.java:233)
	at org.apache.solr.handler.ContentStreamHandlerBase.handleRequestBody(ContentStreamHandlerBase.java:74)
	at org.apache.solr.handler.RequestHandlerBase.handleRequest(RequestHandlerBase.java:129)
	at org.apache.solr.core.SolrCore.execute(SolrCore.java:1692)
	at org.apache.solr.util.TestHarness.queryAndResponse(TestHarness.java:375)
	at org.apache.solr.handler.extraction.ExtractingRequestHandlerTest.loadLocal(ExtractingRequestHandlerTest.java:602)
	at org.apache.solr.handler.extraction.ExtractingRequestHandlerTest.testLiteralsOverride(ExtractingRequestHandlerTest.java:469)
	at sun.reflect.NativeMethodAccessorImpl.invoke0(Native Method)
	at sun.reflect.NativeMethodAccessorImpl.invoke(NativeMethodAccessorImpl.java:57)
	at sun.reflect.DelegatingMethodAccessorImpl.invoke(DelegatingMethodAccessorImpl.java:43)
	at java.lang.reflect.Method.invoke(Method.java:616)
	at com.carrotsearch.randomizedtesting.RandomizedRunner.invoke(RandomizedRunner.java:1559)
	at com.carrotsearch.randomizedtesting.RandomizedRunner.access$600(RandomizedRunner.java:79)
	at com.carrotsearch.randomizedtesting.RandomizedRunner$6.evaluate(RandomizedRunner.java:737)
	at com.carrotsearch.randomizedtesting.RandomizedRunner$7.evaluate(RandomizedRunner.java:773)
	at com.carrotsearch.randomizedtesting.RandomizedRunner$8.evaluate(RandomizedRunner.java:787)
	at com.carrotsearch.randomizedtesting.rules.SystemPropertiesRestoreRule$1.evaluate(SystemPropertiesRestoreRule.java:53)
	at org.apache.lucene.util.TestRuleSetupTeardownChained$1.evaluate(TestRuleSetupTeardownChained.java:50)
	at org.apache.lucene.util.TestRuleFieldCacheSanity$1.evaluate(TestRuleFieldCacheSanity.java:51)
	at org.apache.lucene.util.AbstractBeforeAfterRule$1.evaluate(AbstractBeforeAfterRule.java:45)
	at com.carrotsearch.randomizedtesting.rules.SystemPropertiesInvariantRule$1.evaluate(SystemPropertiesInvariantRule.java:55)
	at org.apache.lucene.util.TestRuleThreadAndTestName$1.evaluate(TestRuleThreadAndTestName.java:48)
	at org.apache.lucene.util.TestRuleIgnoreAfterMaxFailures$1.evaluate(TestRuleIgnoreAfterMaxFailures.java:70)
	at org.apache.lucene.util.TestRuleMarkFailure$1.evaluate(TestRuleMarkFailure.java:48)
	at com.carrotsearch.randomizedtesting.rules.StatementAdapter.evaluate(StatementAdapter.java:36)
	at com.carrotsearch.randomizedtesting.ThreadLeakControl$StatementRunner.run(ThreadLeakControl.java:345)
	at com.carrotsearch.randomizedtesting.ThreadLeakControl.forkTimeoutingTask(ThreadLeakControl.java:769)
	at com.carrotsearch.randomizedtesting.ThreadLeakControl$3.evaluate(ThreadLeakControl.java:429)
	at com.carrotsearch.randomizedtesting.RandomizedRunner.runSingleTest(RandomizedRunner.java:746)
	at com.carrotsearch.randomizedtesting.RandomizedRunner$3.evaluate(RandomizedRunner.java:648)
	at com.carrotsearch.randomizedtesting.RandomizedRunner$4.evaluate(RandomizedRunner.java:682)
	at com.carrotsearch.randomizedtesting.RandomizedRunner$5.evaluate(RandomizedRunner.java:693)
	at com.carrotsearch.randomizedtesting.rules.StatementAdapter.evaluate(StatementAdapter.java:36)
	at com.carrotsearch.randomizedtesting.rules.SystemPropertiesRestoreRule$1.evaluate(SystemPropertiesRestoreRule.java:53)
	at org.apache.lucene.util.AbstractBeforeAfterRule$1.evaluate(AbstractBeforeAfterRule.java:45)
	at org.apache.lucene.util.TestRuleStoreClassName$1.evaluate(TestRuleStoreClassName.java:42)
	at com.carrotsearch.randomizedtesting.rules.SystemPropertiesInvariantRule$1.evaluate(SystemPropertiesInvariantRule.java:55)
	at com.carrotsearch.randomizedtesting.rules.NoShadowingOrOverridesOnMethodsRule$1.evaluate(NoShadowingOrOverridesOnMethodsRule.java:39)
	at com.carrotsearch.randomizedtesting.rules.NoShadowingOrOverridesOnMethodsRule$1.evaluate(NoShadowingOrOverridesOnMethodsRule.java:39)
	at org.apache.lucene.util.TestRuleAssertionsRequired$1.evaluate(TestRuleAssertionsRequired.java:40)
	at org.apache.lucene.util.TestRuleMarkFailure$1.evaluate(TestRuleMarkFailure.java:48)
	at org.apache.lucene.util.TestRuleIgnoreAfterMaxFailures$1.evaluate(TestRuleIgnoreAfterMaxFailures.java:70)
	at org.apache.lucene.util.TestRuleIgnoreTestSuites$1.evaluate(TestRuleIgnoreTestSuites.java:55)
	at com.carrotsearch.randomizedtesting.rules.StatementAdapter.evaluate(StatementAdapter.java:36)
	at com.carrotsearch.randomizedtesting.ThreadLeakControl$StatementRunner.run(ThreadLeakControl.java:345)
	at java.lang.Thread.run(Thread.java:679)


FAILED:  org.apache.solr.handler.extraction.ExtractingRequestHandlerTest.testExtraction

Error Message:
ERROR: [doc=one] unknown field 'meta:save-date'

Stack Trace:
org.apache.solr.common.SolrException: ERROR: [doc=one] unknown field 'meta:save-date'
	at __randomizedtesting.SeedInfo.seed([CBBAEF9C751D61B0:72C99BE20935B145]:0)
	at org.apache.solr.update.DocumentBuilder.toDocument(DocumentBuilder.java:306)
	at org.apache.solr.update.AddUpdateCommand.getLuceneDocument(AddUpdateCommand.java:73)
	at org.apache.solr.update.DirectUpdateHandler2.addDoc(DirectUpdateHandler2.java:208)
	at org.apache.solr.update.processor.RunUpdateProcessor.processAdd(RunUpdateProcessorFactory.java:61)
	at org.apache.solr.update.processor.UpdateRequestProcessor.processAdd(UpdateRequestProcessor.java:51)
	at org.apache.solr.update.processor.DistributedUpdateProcessor.versionAdd(DistributedUpdateProcessor.java:463)
	at org.apache.solr.update.processor.DistributedUpdateProcessor.processAdd(DistributedUpdateProcessor.java:342)
	at org.apache.solr.handler.extraction.ExtractingDocumentLoader.doAdd(ExtractingDocumentLoader.java:121)
	at org.apache.solr.handler.extraction.ExtractingDocumentLoader.addDoc(ExtractingDocumentLoader.java:126)
	at org.apache.solr.handler.extraction.ExtractingDocumentLoader.load(ExtractingDocumentLoader.java:233)
	at org.apache.solr.handler.ContentStreamHandlerBase.handleRequestBody(ContentStreamHandlerBase.java:74)
	at org.apache.solr.handler.RequestHandlerBase.handleRequest(RequestHandlerBase.java:129)
	at org.apache.solr.core.SolrCore.execute(SolrCore.java:1692)
	at org.apache.solr.util.TestHarness.queryAndResponse(TestHarness.java:375)
	at org.apache.solr.handler.extraction.ExtractingRequestHandlerTest.loadLocal(ExtractingRequestHandlerTest.java:602)
	at org.apache.solr.handler.extraction.ExtractingRequestHandlerTest.testExtraction(ExtractingRequestHandlerTest.java:62)
	at sun.reflect.NativeMethodAccessorImpl.invoke0(Native Method)
	at sun.reflect.NativeMethodAccessorImpl.invoke(NativeMethodAccessorImpl.java:57)
	at sun.reflect.DelegatingMethodAccessorImpl.invoke(DelegatingMethodAccessorImpl.java:43)
	at java.lang.reflect.Method.invoke(Method.java:616)
	at com.carrotsearch.randomizedtesting.RandomizedRunner.invoke(RandomizedRunner.java:1559)
	at com.carrotsearch.randomizedtesting.RandomizedRunner.access$600(RandomizedRunner.java:79)
	at com.carrotsearch.randomizedtesting.RandomizedRunner$6.evaluate(RandomizedRunner.java:737)
	at com.carrotsearch.randomizedtesting.RandomizedRunner$7.evaluate(RandomizedRunner.java:773)
	at com.carrotsearch.randomizedtesting.RandomizedRunner$8.evaluate(RandomizedRunner.java:787)
	at com.carrotsearch.randomizedtesting.rules.SystemPropertiesRestoreRule$1.evaluate(SystemPropertiesRestoreRule.java:53)
	at org.apache.lucene.util.TestRuleSetupTeardownChained$1.evaluate(TestRuleSetupTeardownChained.java:50)
	at org.apache.lucene.util.TestRuleFieldCacheSanity$1.evaluate(TestRuleFieldCacheSanity.java:51)
	at org.apache.lucene.util.AbstractBeforeAfterRule$1.evaluate(AbstractBeforeAfterRule.java:45)
	at com.carrotsearch.randomizedtesting.rules.SystemPropertiesInvariantRule$1.evaluate(SystemPropertiesInvariantRule.java:55)
	at org.apache.lucene.util.TestRuleThreadAndTestName$1.evaluate(TestRuleThreadAndTestName.java:48)
	at org.apache.lucene.util.TestRuleIgnoreAfterMaxFailures$1.evaluate(TestRuleIgnoreAfterMaxFailures.java:70)
	at org.apache.lucene.util.TestRuleMarkFailure$1.evaluate(TestRuleMarkFailure.java:48)
	at com.carrotsearch.randomizedtesting.rules.StatementAdapter.evaluate(StatementAdapter.java:36)
	at com.carrotsearch.randomizedtesting.ThreadLeakControl$StatementRunner.run(ThreadLeakControl.java:345)
	at com.carrotsearch.randomizedtesting.ThreadLeakControl.forkTimeoutingTask(ThreadLeakControl.java:769)
	at com.carrotsearch.randomizedtesting.ThreadLeakControl$3.evaluate(ThreadLeakControl.java:429)
	at com.carrotsearch.randomizedtesting.RandomizedRunner.runSingleTest(RandomizedRunner.java:746)
	at com.carrotsearch.randomizedtesting.RandomizedRunner$3.evaluate(RandomizedRunner.java:648)
	at com.carrotsearch.randomizedtesting.RandomizedRunner$4.evaluate(RandomizedRunner.java:682)
	at com.carrotsearch.randomizedtesting.RandomizedRunner$5.evaluate(RandomizedRunner.java:693)
	at com.carrotsearch.randomizedtesting.rules.StatementAdapter.evaluate(StatementAdapter.java:36)
	at com.carrotsearch.randomizedtesting.rules.SystemPropertiesRestoreRule$1.evaluate(SystemPropertiesRestoreRule.java:53)
	at org.apache.lucene.util.AbstractBeforeAfterRule$1.evaluate(AbstractBeforeAfterRule.java:45)
	at org.apache.lucene.util.TestRuleStoreClassName$1.evaluate(TestRuleStoreClassName.java:42)
	at com.carrotsearch.randomizedtesting.rules.SystemPropertiesInvariantRule$1.evaluate(SystemPropertiesInvariantRule.java:55)
	at com.carrotsearch.randomizedtesting.rules.NoShadowingOrOverridesOnMethodsRule$1.evaluate(NoShadowingOrOverridesOnMethodsRule.java:39)
	at com.carrotsearch.randomizedtesting.rules.NoShadowingOrOverridesOnMethodsRule$1.evaluate(NoShadowingOrOverridesOnMethodsRule.java:39)
	at org.apache.lucene.util.TestRuleAssertionsRequired$1.evaluate(TestRuleAssertionsRequired.java:40)
	at org.apache.lucene.util.TestRuleMarkFailure$1.evaluate(TestRuleMarkFailure.java:48)
	at org.apache.lucene.util.TestRuleIgnoreAfterMaxFailures$1.evaluate(TestRuleIgnoreAfterMaxFailures.java:70)
	at org.apache.lucene.util.TestRuleIgnoreTestSuites$1.evaluate(TestRuleIgnoreTestSuites.java:55)
	at com.carrotsearch.randomizedtesting.rules.StatementAdapter.evaluate(StatementAdapter.java:36)
	at com.carrotsearch.randomizedtesting.ThreadLeakControl$StatementRunner.run(ThreadLeakControl.java:345)
	at java.lang.Thread.run(Thread.java:679)




Build Log:
[...truncated 3160 lines...]
52 T3 oasc.SolrCore.finalize SEVERE REFCOUNT ERROR: unreferenced org.apache.solr.core.SolrCore@4dbb3e34 (col_bad) has a reference count of 1
Tests run: 1, Failures: 0, Errors: 0, Skipped: 0, Time elapsed: 0.383 sec
Running org.apache.solr.handler.component.SearchHandlerTest
Creating dataDir: /usr/home/hudson/hudson-slave/workspace/Lucene-Solr-Maven-4.x/maven-build/solr/core/target/test/./solrtest-SearchHandlerTest-1346552765340
Tests run: 1, Failures: 0, Errors: 0, Skipped: 0, Time elapsed: 0.673 sec
Running org.apache.solr.core.TestXIncludeConfig
Tests run: 1, Failures: 0, Errors: 0, Skipped: 0, Time elapsed: 0.453 sec
Running org.apache.solr.handler.component.DistributedQueryElevationComponentTest
Tests run: 1, Failures: 0, Errors: 0, Skipped: 0, Time elapsed: 1.832 sec
Running org.apache.solr.request.TestBinaryResponseWriter
Tests run: 2, Failures: 0, Errors: 0, Skipped: 0, Time elapsed: 0.746 sec
Running org.apache.solr.util.CircularListTest
Tests run: 1, Failures: 0, Errors: 0, Skipped: 0, Time elapsed: 0.013 sec
Running org.apache.solr.core.TestPropInject
Tests run: 2, Failures: 0, Errors: 0, Skipped: 0, Time elapsed: 0.561 sec
Running org.apache.solr.search.QueryParsingTest
Creating dataDir: /usr/home/hudson/hudson-slave/workspace/Lucene-Solr-Maven-4.x/maven-build/solr/core/target/test/./solrtest-QueryParsingTest-1346552769617
Tests run: 4, Failures: 0, Errors: 0, Skipped: 0, Time elapsed: 0.385 sec
Running org.apache.solr.core.TestSolrXMLSerializer
Tests run: 1, Failures: 0, Errors: 0, Skipped: 0, Time elapsed: 0.018 sec
Running org.apache.solr.cloud.BasicDistributedZk2Test
Creating dataDir: /usr/home/hudson/hudson-slave/workspace/Lucene-Solr-Maven-4.x/maven-build/solr/core/target/test/./solrtest-BasicDistributedZk2Test-1346552770034
52891 T229 oasc.SolrException.log SEVERE Sync request error: org.apache.solr.client.solrj.SolrServerException: IOException occured when talking to server at: http://127.0.0.1:10553/solr/collection1
97906 T229 oasc.SolrException.log SEVERE http://127.0.0.1:10557/solr/collection1/: Could not tell a replica to recover:org.apache.solr.client.solrj.SolrServerException: IOException occured when talking to server at: http://127.0.0.1:10553/solr
		at org.apache.solr.client.solrj.impl.HttpSolrServer.request(HttpSolrServer.java:414)
		at org.apache.solr.client.solrj.impl.HttpSolrServer.request(HttpSolrServer.java:182)
		at org.apache.solr.cloud.SyncStrategy.requestRecovery(SyncStrategy.java:282)
		at org.apache.solr.cloud.SyncStrategy.syncToMe(SyncStrategy.java:226)
		at org.apache.solr.cloud.SyncStrategy.syncReplicas(SyncStrategy.java:119)
		at org.apache.solr.cloud.SyncStrategy.sync(SyncStrategy.java:85)
		at org.apache.solr.cloud.ShardLeaderElectionContext.runLeaderProcess(ElectionContext.java:180)
		at org.apache.solr.cloud.LeaderElector.runIamLeaderProcess(LeaderElector.java:159)
		at org.apache.solr.cloud.LeaderElector.checkIfIamLeader(LeaderElector.java:103)
		at org.apache.solr.cloud.LeaderElector.access$000(LeaderElector.java:57)
		at org.apache.solr.cloud.LeaderElector$1.process(LeaderElector.java:132)
		at org.apache.zookeeper.ClientCnxn$EventThread.processEvent(ClientCnxn.java:526)
		at org.apache.zookeeper.ClientCnxn$EventThread.run(ClientCnxn.java:502)
	Caused by: org.apache.http.conn.ConnectTimeoutException: Connect to 127.0.0.1:10553 timed out
		at org.apache.http.conn.scheme.PlainSocketFactory.connectSocket(PlainSocketFactory.java:125)
		at org.apache.http.impl.conn.DefaultClientConnectionOperator.openConnection(DefaultClientConnectionOperator.java:148)
		at org.apache.http.impl.conn.AbstractPoolEntry.open(AbstractPoolEntry.java:150)
		at org.apache.http.impl.conn.AbstractPooledConnAdapter.open(AbstractPooledConnAdapter.java:121)
		at org.apache.http.impl.client.DefaultRequestDirector.tryConnect(DefaultRequestDirector.java:575)
		at org.apache.http.impl.client.DefaultRequestDirector.execute(DefaultRequestDirector.java:425)
		at org.apache.http.impl.client.AbstractHttpClient.execute(AbstractHttpClient.java:820)
		at org.apache.http.impl.client.AbstractHttpClient.execute(AbstractHttpClient.java:754)
		at org.apache.http.impl.client.AbstractHttpClient.execute(AbstractHttpClient.java:732)
		at org.apache.solr.client.solrj.impl.HttpSolrServer.request(HttpSolrServer.java:353)
		... 12 more
	
ASYNC  NEW_CORE C0 name=collection1 org.apache.solr.core.SolrCore@50d0843b url=http://127.0.0.1:10549/solr/collection1 node=127.0.0.1:10549_solr
138738 T170 C0 P10549 oasc.SolrException.log SEVERE org.apache.solr.common.SolrException: Document is missing mandatory uniqueKey field: id
		at org.apache.solr.update.AddUpdateCommand.getHashableId(AddUpdateCommand.java:132)
		at org.apache.solr.update.processor.DistributedUpdateProcessor.hash(DistributedUpdateProcessor.java:1067)
		at org.apache.solr.update.processor.DistributedUpdateProcessor.processAdd(DistributedUpdateProcessor.java:332)
		at org.apache.solr.handler.loader.XMLLoader.processUpdate(XMLLoader.java:230)
		at org.apache.solr.handler.loader.XMLLoader.load(XMLLoader.java:157)
		at org.apache.solr.handler.UpdateRequestHandler$1.load(UpdateRequestHandler.java:92)
		at org.apache.solr.handler.ContentStreamHandlerBase.handleRequestBody(ContentStreamHandlerBase.java:74)
		at org.apache.solr.handler.RequestHandlerBase.handleRequest(RequestHandlerBase.java:129)
		at org.apache.solr.core.SolrCore.execute(SolrCore.java:1692)
		at org.apache.solr.servlet.SolrDispatchFilter.execute(SolrDispatchFilter.java:454)
		at org.apache.solr.servlet.SolrDispatchFilter.doFilter(SolrDispatchFilter.java:275)
		at org.eclipse.jetty.servlet.ServletHandler$CachedChain.doFilter(ServletHandler.java:1337)
		at org.eclipse.jetty.servlet.ServletHandler.doHandle(ServletHandler.java:484)
		at org.eclipse.jetty.server.session.SessionHandler.doHandle(SessionHandler.java:231)
		at org.eclipse.jetty.server.handler.ScopedHandler.handle(ScopedHandler.java:119)
		at org.eclipse.jetty.server.handler.GzipHandler.handle(GzipHandler.java:267)
		at org.eclipse.jetty.server.handler.ContextHandler.doHandle(ContextHandler.java:1067)
		at org.eclipse.jetty.servlet.ServletHandler.doScope(ServletHandler.java:413)
		at org.eclipse.jetty.server.session.SessionHandler.doScope(SessionHandler.java:192)
		at org.eclipse.jetty.server.handler.ContextHandler.doScope(ContextHandler.java:999)
		at org.eclipse.jetty.server.handler.ScopedHandler.handle(ScopedHandler.java:117)
		at org.eclipse.jetty.server.handler.HandlerWrapper.handle(HandlerWrapper.java:111)
		at org.eclipse.jetty.server.Server.handle(Server.java:351)
		at org.eclipse.jetty.server.AbstractHttpConnection.handleRequest(AbstractHttpConnection.java:454)
		at org.eclipse.jetty.server.BlockingHttpConnection.handleRequest(BlockingHttpConnection.java:47)
		at org.eclipse.jetty.server.AbstractHttpConnection.content(AbstractHttpConnection.java:900)
		at org.eclipse.jetty.server.AbstractHttpConnection$RequestHandler.content(AbstractHttpConnection.java:954)
		at org.eclipse.jetty.http.HttpParser.parseNext(HttpParser.java:952)
		at org.eclipse.jetty.http.HttpParser.parseAvailable(HttpParser.java:235)
		at org.eclipse.jetty.server.BlockingHttpConnection.handle(BlockingHttpConnection.java:66)
		at org.eclipse.jetty.server.bio.SocketConnector$ConnectorEndPoint.run(SocketConnector.java:254)
		at org.eclipse.jetty.util.thread.QueuedThreadPool.runJob(QueuedThreadPool.java:599)
		at org.eclipse.jetty.util.thread.QueuedThreadPool$3.run(QueuedThreadPool.java:534)
		at java.lang.Thread.run(Thread.java:679)
	
138841 T216 oasc.SolrException.log SEVERE Sync Failed
140817 T346 oasc.SolrException.log SEVERE java.lang.InterruptedException: sleep interrupted
		at java.lang.Thread.sleep(Native Method)
		at org.apache.solr.handler.admin.CoreAdminHandler.handleWaitForStateAction(CoreAdminHandler.java:896)
		at org.apache.solr.handler.admin.CoreAdminHandler.handleRequestBody(CoreAdminHandler.java:185)
		at org.apache.solr.handler.RequestHandlerBase.handleRequest(RequestHandlerBase.java:129)
		at org.apache.solr.servlet.SolrDispatchFilter.handleAdminRequest(SolrDispatchFilter.java:371)
		at org.apache.solr.servlet.SolrDispatchFilter.doFilter(SolrDispatchFilter.java:180)
		at org.eclipse.jetty.servlet.ServletHandler$CachedChain.doFilter(ServletHandler.java:1337)
		at org.eclipse.jetty.servlet.ServletHandler.doHandle(ServletHandler.java:484)
		at org.eclipse.jetty.server.session.SessionHandler.doHandle(SessionHandler.java:231)
		at org.eclipse.jetty.server.handler.ScopedHandler.handle(ScopedHandler.java:119)
		at org.eclipse.jetty.server.handler.GzipHandler.handle(GzipHandler.java:267)
		at org.eclipse.jetty.server.handler.ContextHandler.doHandle(ContextHandler.java:1067)
		at org.eclipse.jetty.servlet.ServletHandler.doScope(ServletHandler.java:413)
		at org.eclipse.jetty.server.session.SessionHandler.doScope(SessionHandler.java:192)
		at org.eclipse.jetty.server.handler.ContextHandler.doScope(ContextHandler.java:999)
		at org.eclipse.jetty.server.handler.ScopedHandler.handle(ScopedHandler.java:117)
		at org.eclipse.jetty.server.handler.HandlerWrapper.handle(HandlerWrapper.java:111)
		at org.eclipse.jetty.server.Server.handle(Server.java:351)
		at org.eclipse.jetty.server.AbstractHttpConnection.handleRequest(AbstractHttpConnection.java:454)
		at org.eclipse.jetty.server.BlockingHttpConnection.handleRequest(BlockingHttpConnection.java:47)
		at org.eclipse.jetty.server.AbstractHttpConnection.headerComplete(AbstractHttpConnection.java:890)
		at org.eclipse.jetty.server.AbstractHttpConnection$RequestHandler.headerComplete(AbstractHttpConnection.java:944)
		at org.eclipse.jetty.http.HttpParser.parseNext(HttpParser.java:634)
		at org.eclipse.jetty.http.HttpParser.parseAvailable(HttpParser.java:230)
		at org.eclipse.jetty.server.BlockingHttpConnection.handle(BlockingHttpConnection.java:66)
		at org.eclipse.jetty.server.bio.SocketConnector$ConnectorEndPoint.run(SocketConnector.java:254)
		at org.eclipse.jetty.util.thread.QueuedThreadPool.runJob(QueuedThreadPool.java:599)
		at org.eclipse.jetty.util.thread.QueuedThreadPool$3.run(QueuedThreadPool.java:534)
		at java.lang.Thread.run(Thread.java:679)
	
140818 T346 oasc.SolrException.log SEVERE null:java.lang.InterruptedException: sleep interrupted
		at java.lang.Thread.sleep(Native Method)
		at org.apache.solr.handler.admin.CoreAdminHandler.handleWaitForStateAction(CoreAdminHandler.java:896)
		at org.apache.solr.handler.admin.CoreAdminHandler.handleRequestBody(CoreAdminHandler.java:185)
		at org.apache.solr.handler.RequestHandlerBase.handleRequest(RequestHandlerBase.java:129)
		at org.apache.solr.servlet.SolrDispatchFilter.handleAdminRequest(SolrDispatchFilter.java:371)
		at org.apache.solr.servlet.SolrDispatchFilter.doFilter(SolrDispatchFilter.java:180)
		at org.eclipse.jetty.servlet.ServletHandler$CachedChain.doFilter(ServletHandler.java:1337)
		at org.eclipse.jetty.servlet.ServletHandler.doHandle(ServletHandler.java:484)
		at org.eclipse.jetty.server.session.SessionHandler.doHandle(SessionHandler.java:231)
		at org.eclipse.jetty.server.handler.ScopedHandler.handle(ScopedHandler.java:119)
		at org.eclipse.jetty.server.handler.GzipHandler.handle(GzipHandler.java:267)
		at org.eclipse.jetty.server.handler.ContextHandler.doHandle(ContextHandler.java:1067)
		at org.eclipse.jetty.servlet.ServletHandler.doScope(ServletHandler.java:413)
		at org.eclipse.jetty.server.session.SessionHandler.doScope(SessionHandler.java:192)
		at org.eclipse.jetty.server.handler.ContextHandler.doScope(ContextHandler.java:999)
		at org.eclipse.jetty.server.handler.ScopedHandler.handle(ScopedHandler.java:117)
		at org.eclipse.jetty.server.handler.HandlerWrapper.handle(HandlerWrapper.java:111)
		at org.eclipse.jetty.server.Server.handle(Server.java:351)
		at org.eclipse.jetty.server.AbstractHttpConnection.handleRequest(AbstractHttpConnection.java:454)
		at org.eclipse.jetty.server.BlockingHttpConnection.handleRequest(BlockingHttpConnection.java:47)
		at org.eclipse.jetty.server.AbstractHttpConnection.headerComplete(AbstractHttpConnection.java:890)
		at org.eclipse.jetty.server.AbstractHttpConnection$RequestHandler.headerComplete(AbstractHttpConnection.java:944)
		at org.eclipse.jetty.http.HttpParser.parseNext(HttpParser.java:634)
		at org.eclipse.jetty.http.HttpParser.parseAvailable(HttpParser.java:230)
		at org.eclipse.jetty.server.BlockingHttpConnection.handle(BlockingHttpConnection.java:66)
		at org.eclipse.jetty.server.bio.SocketConnector$ConnectorEndPoint.run(SocketConnector.java:254)
		at org.eclipse.jetty.util.thread.QueuedThreadPool.runJob(QueuedThreadPool.java:599)
		at org.eclipse.jetty.util.thread.QueuedThreadPool$3.run(QueuedThreadPool.java:534)
		at java.lang.Thread.run(Thread.java:679)
	
140819 T346 oasc.SolrException.log SEVERE null:org.eclipse.jetty.io.EofException
		at org.eclipse.jetty.server.HttpOutput.write(HttpOutput.java:154)
		at org.eclipse.jetty.server.HttpOutput.write(HttpOutput.java:101)
		at org.apache.solr.common.util.FastOutputStream.flush(FastOutputStream.java:204)
		at org.apache.solr.common.util.FastOutputStream.flushBuffer(FastOutputStream.java:197)
		at org.apache.solr.common.util.JavaBinCodec.marshal(JavaBinCodec.java:94)
		at org.apache.solr.response.BinaryResponseWriter.write(BinaryResponseWriter.java:49)
		at org.apache.solr.servlet.SolrDispatchFilter.writeResponse(SolrDispatchFilter.java:403)
		at org.apache.solr.servlet.SolrDispatchFilter.handleAdminRequest(SolrDispatchFilter.java:381)
		at org.apache.solr.servlet.SolrDispatchFilter.doFilter(SolrDispatchFilter.java:180)
		at org.eclipse.jetty.servlet.ServletHandler$CachedChain.doFilter(ServletHandler.java:1337)
		at org.eclipse.jetty.servlet.ServletHandler.doHandle(ServletHandler.java:484)
		at org.eclipse.jetty.server.session.SessionHandler.doHandle(SessionHandler.java:231)
		at org.eclipse.jetty.server.handler.ScopedHandler.handle(ScopedHandler.java:119)
		at org.eclipse.jetty.server.handler.GzipHandler.handle(GzipHandler.java:267)
		at org.eclipse.jetty.server.handler.ContextHandler.doHandle(ContextHandler.java:1067)
		at org.eclipse.jetty.servlet.ServletHandler.doScope(ServletHandler.java:413)
		at org.eclipse.jetty.server.session.SessionHandler.doScope(SessionHandler.java:192)
		at org.eclipse.jetty.server.handler.ContextHandler.doScope(ContextHandler.java:999)
		at org.eclipse.jetty.server.handler.ScopedHandler.handle(ScopedHandler.java:117)
		at org.eclipse.jetty.server.handler.HandlerWrapper.handle(HandlerWrapper.java:111)
		at org.eclipse.jetty.server.Server.handle(Server.java:351)
		at org.eclipse.jetty.server.AbstractHttpConnection.handleRequest(AbstractHttpConnection.java:454)
		at org.eclipse.jetty.server.BlockingHttpConnection.handleRequest(BlockingHttpConnection.java:47)
		at org.eclipse.jetty.server.AbstractHttpConnection.headerComplete(AbstractHttpConnection.java:890)
		at org.eclipse.jetty.server.AbstractHttpConnection$RequestHandler.headerComplete(AbstractHttpConnection.java:944)
		at org.eclipse.jetty.http.HttpParser.parseNext(HttpParser.java:634)
		at org.eclipse.jetty.http.HttpParser.parseAvailable(HttpParser.java:230)
		at org.eclipse.jetty.server.BlockingHttpConnection.handle(BlockingHttpConnection.java:66)
		at org.eclipse.jetty.server.bio.SocketConnector$ConnectorEndPoint.run(SocketConnector.java:254)
		at org.eclipse.jetty.util.thread.QueuedThreadPool.runJob(QueuedThreadPool.java:599)
		at org.eclipse.jetty.util.thread.QueuedThreadPool$3.run(QueuedThreadPool.java:534)
		at java.lang.Thread.run(Thread.java:679)
	
183882 T341 oasc.SolrException.log SEVERE http://127.0.0.1:29853/solr/collection1/: Could not tell a replica to recover:org.apache.solr.client.solrj.SolrServerException: Timeout occured while waiting response from server at: http://127.0.0.1:10555/solr
		at org.apache.solr.client.solrj.impl.HttpSolrServer.request(HttpSolrServer.java:410)
		at org.apache.solr.client.solrj.impl.HttpSolrServer.request(HttpSolrServer.java:182)
		at org.apache.solr.cloud.SyncStrategy.requestRecovery(SyncStrategy.java:282)
		at org.apache.solr.cloud.SyncStrategy.syncToMe(SyncStrategy.java:226)
		at org.apache.solr.cloud.SyncStrategy.syncReplicas(SyncStrategy.java:119)
		at org.apache.solr.cloud.SyncStrategy.sync(SyncStrategy.java:85)
		at org.apache.solr.cloud.ShardLeaderElectionContext.runLeaderProcess(ElectionContext.java:180)
		at org.apache.solr.cloud.LeaderElector.runIamLeaderProcess(LeaderElector.java:159)
		at org.apache.solr.cloud.LeaderElector.checkIfIamLeader(LeaderElector.java:103)
		at org.apache.solr.cloud.LeaderElector.access$000(LeaderElector.java:57)
		at org.apache.solr.cloud.LeaderElector$1.process(LeaderElector.java:132)
		at org.apache.zookeeper.ClientCnxn$EventThread.processEvent(ClientCnxn.java:526)
		at org.apache.zookeeper.ClientCnxn$EventThread.run(ClientCnxn.java:502)
	Caused by: java.net.SocketTimeoutException: Read timed out
		at java.net.SocketInputStream.socketRead0(Native Method)
		at java.net.SocketInputStream.read(SocketInputStream.java:146)
		at org.apache.http.impl.io.AbstractSessionInputBuffer.fillBuffer(AbstractSessionInputBuffer.java:149)
		at org.apache.http.impl.io.SocketInputBuffer.fillBuffer(SocketInputBuffer.java:111)
		at org.apache.http.impl.io.AbstractSessionInputBuffer.readLine(AbstractSessionInputBuffer.java:264)
		at org.apache.http.impl.conn.DefaultResponseParser.parseHead(DefaultResponseParser.java:98)
		at org.apache.http.impl.io.AbstractMessageParser.parse(AbstractMessageParser.java:252)
		at org.apache.http.impl.AbstractHttpClientConnection.receiveResponseHeader(AbstractHttpClientConnection.java:282)
		at org.apache.http.impl.conn.DefaultClientConnection.receiveResponseHeader(DefaultClientConnection.java:247)
		at org.apache.http.impl.conn.AbstractClientConnAdapter.receiveResponseHeader(AbstractClientConnAdapter.java:216)
		at org.apache.http.protocol.HttpRequestExecutor.doReceiveResponse(HttpRequestExecutor.java:298)
		at org.apache.http.protocol.HttpRequestExecutor.execute(HttpRequestExecutor.java:125)
		at org.apache.http.impl.client.DefaultRequestDirector.tryExecute(DefaultRequestDirector.java:647)
		at org.apache.http.impl.client.DefaultRequestDirector.execute(DefaultRequestDirector.java:464)
		at org.apache.http.impl.client.AbstractHttpClient.execute(AbstractHttpClient.java:820)
		at org.apache.http.impl.client.AbstractHttpClient.execute(AbstractHttpClient.java:754)
		at org.apache.http.impl.client.AbstractHttpClient.execute(AbstractHttpClient.java:732)
		at org.apache.solr.client.solrj.impl.HttpSolrServer.request(HttpSolrServer.java:353)
		... 12 more
	
ASYNC  NEW_CORE C1 name=collection1 org.apache.solr.core.SolrCore@787ad957 url=http://127.0.0.1:10555/solr/collection1 node=127.0.0.1:10555_solr
185767 T358 C1 P10555 oasc.SolrException.log SEVERE Error while trying to recover. core=collection1:org.apache.solr.client.solrj.SolrServerException: IOException occured when talking to server at: http://127.0.0.1:10551/solr
		at org.apache.solr.client.solrj.impl.HttpSolrServer.request(HttpSolrServer.java:414)
		at org.apache.solr.client.solrj.impl.HttpSolrServer.request(HttpSolrServer.java:182)
		at org.apache.solr.cloud.RecoveryStrategy.sendPrepRecoveryCmd(RecoveryStrategy.java:191)
		at org.apache.solr.cloud.RecoveryStrategy.doRecovery(RecoveryStrategy.java:320)
		at org.apache.solr.cloud.RecoveryStrategy.run(RecoveryStrategy.java:212)
	Caused by: org.apache.http.conn.ConnectTimeoutException: Connect to 127.0.0.1:10551 timed out
		at org.apache.http.conn.scheme.PlainSocketFactory.connectSocket(PlainSocketFactory.java:125)
		at org.apache.http.impl.conn.DefaultClientConnectionOperator.openConnection(DefaultClientConnectionOperator.java:148)
		at org.apache.http.impl.conn.AbstractPoolEntry.open(AbstractPoolEntry.java:150)
		at org.apache.http.impl.conn.AbstractPooledConnAdapter.open(AbstractPooledConnAdapter.java:121)
		at org.apache.http.impl.client.DefaultRequestDirector.tryExecute(DefaultRequestDirector.java:636)
		at org.apache.http.impl.client.DefaultRequestDirector.execute(DefaultRequestDirector.java:464)
		at org.apache.http.impl.client.AbstractHttpClient.execute(AbstractHttpClient.java:820)
		at org.apache.http.impl.client.AbstractHttpClient.execute(AbstractHttpClient.java:754)
		at org.apache.http.impl.client.AbstractHttpClient.execute(AbstractHttpClient.java:732)
		at org.apache.solr.client.solrj.impl.HttpSolrServer.request(HttpSolrServer.java:353)
		... 4 more
	
185767 T358 C1 P10555 oasc.RecoveryStrategy.doRecovery SEVERE Recovery failed - trying again... core=collection1
Tests run: 1, Failures: 0, Errors: 0, Skipped: 0, Time elapsed: 188.241 sec
Running org.apache.solr.search.TestFiltering
Creating dataDir: /usr/home/hudson/hudson-slave/workspace/Lucene-Solr-Maven-4.x/maven-build/solr/core/target/test/./solrtest-TestFiltering-1346552958269
Tests run: 2, Failures: 0, Errors: 0, Skipped: 0, Time elapsed: 2.991 sec
Running org.apache.solr.internal.csv.CSVParserTest
Tests run: 23, Failures: 0, Errors: 0, Skipped: 0, Time elapsed: 0.006 sec
Running org.apache.solr.AnalysisAfterCoreReloadTest
Tests run: 1, Failures: 0, Errors: 0, Skipped: 0, Time elapsed: 1.588 sec
Running org.apache.solr.core.TestQuerySenderListener
Creating dataDir: /usr/home/hudson/hudson-slave/workspace/Lucene-Solr-Maven-4.x/maven-build/solr/core/target/test/./solrtest-TestQuerySenderListener-1346552962859
Tests run: 3, Failures: 0, Errors: 0, Skipped: 0, Time elapsed: 0.427 sec
Running org.apache.solr.handler.component.SpellCheckComponentTest
Creating dataDir: /usr/home/hudson/hudson-slave/workspace/Lucene-Solr-Maven-4.x/maven-build/solr/core/target/test/./solrtest-SpellCheckComponentTest-1346552963285
Tests run: 9, Failures: 0, Errors: 0, Skipped: 0, Time elapsed: 4.494 sec
Running org.apache.solr.update.processor.ScriptEngineTest
Tests run: 6, Failures: 0, Errors: 0, Skipped: 1, Time elapsed: 0.235 sec
Running org.apache.solr.handler.admin.ShowFileRequestHandlerTest
Creating dataDir: /usr/home/hudson/hudson-slave/workspace/Lucene-Solr-Maven-4.x/maven-build/solr/core/target/test/./solrtest-ShowFileRequestHandlerTest-1346552968015
Tests run: 2, Failures: 0, Errors: 0, Skipped: 0, Time elapsed: 0.866 sec
Running org.apache.solr.servlet.SolrRequestParserTest
Creating dataDir: /usr/home/hudson/hudson-slave/workspace/Lucene-Solr-Maven-4.x/maven-build/solr/core/target/test/./solrtest-SolrRequestParserTest-1346552968880
Tests run: 4, Failures: 0, Errors: 0, Skipped: 0, Time elapsed: 1.25 sec
Running org.apache.solr.core.TestBadConfig
Creating dataDir: /usr/home/hudson/hudson-slave/workspace/Lucene-Solr-Maven-4.x/maven-build/solr/core/target/test/./solrtest-TestBadConfig-1346552970136
683 T412 oasup.StatelessScriptUpdateProcessorFactory.inform SEVERE Unable to initialize scripts: No ScriptEngine found by name: giberish -- supported names: js, rhino, JavaScript, javascript, ECMAScript, ecmascript Ignoring exception matching \Qgiberish\E
Creating dataDir: /usr/home/hudson/hudson-slave/workspace/Lucene-Solr-Maven-4.x/maven-build/solr/core/target/test/./solrtest-TestBadConfig-1346552970827
1093 T412 oasup.StatelessScriptUpdateProcessorFactory.inform SEVERE Unable to initialize scripts: Unable to evaluate script: a-file-name-that-does-not-exist.js Ignoring exception matching \Qa-file-name-that-does-not-exist.js\E
Creating dataDir: /usr/home/hudson/hudson-slave/workspace/Lucene-Solr-Maven-4.x/maven-build/solr/core/target/test/./solrtest-TestBadConfig-1346552971234
1443 T412 oasup.StatelessScriptUpdateProcessorFactory.inform SEVERE Unable to initialize scripts: Unable to evaluate script: currency.xml Ignoring exception matching \Qcurrency.xml\E
Creating dataDir: /usr/home/hudson/hudson-slave/workspace/Lucene-Solr-Maven-4.x/maven-build/solr/core/target/test/./solrtest-TestBadConfig-1346552971577
1462 T3 oasc.CoreContainer.finalize SEVERE CoreContainer was not shutdown prior to finalize(), indicates a bug -- POSSIBLE RESOURCE LEAK!!!  instance=245029416
Creating dataDir: /usr/home/hudson/hudson-slave/workspace/Lucene-Solr-Maven-4.x/maven-build/solr/core/target/test/./solrtest-TestBadConfig-1346552971840
Tests run: 5, Failures: 0, Errors: 0, Skipped: 0, Time elapsed: 1.736 sec
Running org.apache.solr.util.DOMUtilTest
Tests run: 1, Failures: 0, Errors: 0, Skipped: 0, Time elapsed: 0.016 sec
Running org.apache.solr.search.TestReload
Creating dataDir: /usr/home/hudson/hudson-slave/workspace/Lucene-Solr-Maven-4.x/maven-build/solr/core/target/test/./solrtest-TestReload-1346552971880
!!! softCommitfalse
!!! softCommitfalse
!!! softCommittrue
!!! softCommitfalse
!!! softCommitfalse
!!! softCommittrue
Tests run: 1, Failures: 0, Errors: 0, Skipped: 0, Time elapsed: 4.043 sec
Running org.apache.solr.request.TestWriterPerf
4484 T3 oasc.CoreContainer.finalize SEVERE CoreContainer was not shutdown prior to finalize(), indicates a bug -- POSSIBLE RESOURCE LEAK!!!  instance=1309830940
4485 T3 oasc.CoreContainer.finalize SEVERE CoreContainer was not shutdown prior to finalize(), indicates a bug -- POSSIBLE RESOURCE LEAK!!!  instance=1346406963
Tests run: 1, Failures: 0, Errors: 0, Skipped: 0, Time elapsed: 0.866 sec
Running org.apache.solr.schema.TestOmitPositions
Creating dataDir: /usr/home/hudson/hudson-slave/workspace/Lucene-Solr-Maven-4.x/maven-build/solr/core/target/test/./solrtest-TestOmitPositions-1346552976795
Tests run: 2, Failures: 0, Errors: 0, Skipped: 0, Time elapsed: 0.529 sec
Running org.apache.solr.TestGroupingSearch
Creating dataDir: /usr/home/hudson/hudson-slave/workspace/Lucene-Solr-Maven-4.x/maven-build/solr/core/target/test/./solrtest-TestGroupingSearch-1346552977329
Tests run: 12, Failures: 0, Errors: 0, Skipped: 0, Time elapsed: 2.481 sec
Running org.apache.solr.internal.csv.writer.CSVFieldTest
Tests run: 2, Failures: 0, Errors: 0, Skipped: 0, Time elapsed: 0.001 sec
Running org.apache.solr.spelling.SpellCheckCollatorTest
Creating dataDir: /usr/home/hudson/hudson-slave/workspace/Lucene-Solr-Maven-4.x/maven-build/solr/core/target/test/./solrtest-SpellCheckCollatorTest-1346552979804
Tests run: 7, Failures: 0, Errors: 0, Skipped: 0, Time elapsed: 1.724 sec
Running org.apache.solr.analysis.PathHierarchyTokenizerFactoryTest
Creating dataDir: /usr/home/hudson/hudson-slave/workspace/Lucene-Solr-Maven-4.x/maven-build/solr/core/target/test/./solrtest-PathHierarchyTokenizerFactoryTest-1346552981531
Tests run: 2, Failures: 0, Errors: 0, Skipped: 0, Time elapsed: 0.584 sec
Running org.apache.solr.util.FileUtilsTest
Tests run: 1, Failures: 0, Errors: 0, Skipped: 0, Time elapsed: 0.015 sec
Running org.apache.solr.handler.TestCSVLoader
Creating dataDir: /usr/home/hudson/hudson-slave/workspace/Lucene-Solr-Maven-4.x/maven-build/solr/core/target/test/./solrtest-TestCSVLoader-1346552982131
Tests run: 5, Failures: 0, Errors: 0, Skipped: 0, Time elapsed: 0.771 sec
Running org.apache.solr.handler.component.TermVectorComponentTest
Creating dataDir: /usr/home/hudson/hudson-slave/workspace/Lucene-Solr-Maven-4.x/maven-build/solr/core/target/test/./solrtest-TermVectorComponentTest-1346552982899
Tests run: 3, Failures: 0, Errors: 0, Skipped: 0, Time elapsed: 0.653 sec
Running org.apache.solr.schema.IndexSchemaRuntimeFieldTest
Creating dataDir: /usr/home/hudson/hudson-slave/workspace/Lucene-Solr-Maven-4.x/maven-build/solr/core/target/test/./solrtest-IndexSchemaRuntimeFieldTest-1346552983557
Tests run: 1, Failures: 0, Errors: 0, Skipped: 0, Time elapsed: 0.52 sec
Running org.apache.solr.handler.component.QueryElevationComponentTest
Creating dataDir: /usr/home/hudson/hudson-slave/workspace/Lucene-Solr-Maven-4.x/maven-build/solr/core/target/test/./solrtest-QueryElevationComponentTest-1346552984087
Creating dataDir: /usr/home/hudson/hudson-slave/workspace/Lucene-Solr-Maven-4.x/maven-build/solr/core/target/test/./solrtest-QueryElevationComponentTest-1346552984490
Creating dataDir: /usr/home/hudson/hudson-slave/workspace/Lucene-Solr-Maven-4.x/maven-build/solr/core/target/test/./solrtest-QueryElevationComponentTest-1346552985002
Creating dataDir: /usr/home/hudson/hudson-slave/workspace/Lucene-Solr-Maven-4.x/maven-build/solr/core/target/test/./solrtest-QueryElevationComponentTest-1346552985257
Creating dataDir: /usr/home/hudson/hudson-slave/workspace/Lucene-Solr-Maven-4.x/maven-build/solr/core/target/test/./solrtest-QueryElevationComponentTest-1346552985638
Creating dataDir: /usr/home/hudson/hudson-slave/workspace/Lucene-Solr-Maven-4.x/maven-build/solr/core/target/test/./solrtest-QueryElevationComponentTest-1346552986081
Creating dataDir: /usr/home/hudson/hudson-slave/workspace/Lucene-Solr-Maven-4.x/maven-build/solr/core/target/test/./solrtest-QueryElevationComponentTest-1346552986468
Tests run: 7, Failures: 0, Errors: 0, Skipped: 0, Time elapsed: 2.697 sec
Running org.apache.solr.MinimalSchemaTest
Creating dataDir: /usr/home/hudson/hudson-slave/workspace/Lucene-Solr-Maven-4.x/maven-build/solr/core/target/test/./solrtest-MinimalSchemaTest-1346552986770
Tests run: 3, Failures: 0, Errors: 0, Skipped: 0, Time elapsed: 0.394 sec
Running org.apache.solr.spelling.suggest.SuggesterTest
Creating dataDir: /usr/home/hudson/hudson-slave/workspace/Lucene-Solr-Maven-4.x/maven-build/solr/core/target/test/./solrtest-SuggesterTest-1346552987177
NOTE: per solr.test.leavedatadir, dataDir will not be removed: /usr/home/hudson/hudson-slave/workspace/Lucene-Solr-Maven-4.x/maven-build/solr/core/target/test/./solrtest-SuggesterTest-1346552987177
Tests run: 4, Failures: 0, Errors: 0, Skipped: 0, Time elapsed: 0.907 sec
Running org.apache.solr.request.TestRemoteStreaming
Creating dataDir: /usr/home/hudson/hudson-slave/workspace/Lucene-Solr-Maven-4.x/maven-build/solr/core/target/test/./solrtest-TestRemoteStreaming-1346552988080
Tests run: 4, Failures: 0, Errors: 0, Skipped: 0, Time elapsed: 0.817 sec
Running org.apache.solr.schema.BadIndexSchemaTest
Creating dataDir: /usr/home/hudson/hudson-slave/workspace/Lucene-Solr-Maven-4.x/maven-build/solr/core/target/test/./solrtest-BadIndexSchemaTest-1346552988900
81 T501 oass.IndexSchema.readSchema SEVERE uniqueKey field (id) can not be the dest of a copyField (src=XXX)
Creating dataDir: /usr/home/hudson/hudson-slave/workspace/Lucene-Solr-Maven-4.x/maven-build/solr/core/target/test/./solrtest-BadIndexSchemaTest-1346552988980
160 T501 oass.IndexSchema.readSchema SEVERE uniqueKey field (null) can not be configured with a default value (XXX)
Creating dataDir: /usr/home/hudson/hudson-slave/workspace/Lucene-Solr-Maven-4.x/maven-build/solr/core/target/test/./solrtest-BadIndexSchemaTest-1346552989058
237 T501 oass.IndexSchema.readSchema SEVERE uniqueKey field (null) can not be configured to be multivalued
Creating dataDir: /usr/home/hudson/hudson-slave/workspace/Lucene-Solr-Maven-4.x/maven-build/solr/core/target/test/./solrtest-BadIndexSchemaTest-1346552989138
Creating dataDir: /usr/home/hudson/hudson-slave/workspace/Lucene-Solr-Maven-4.x/maven-build/solr/core/target/test/./solrtest-BadIndexSchemaTest-1346552989215
Creating dataDir: /usr/home/hudson/hudson-slave/workspace/Lucene-Solr-Maven-4.x/maven-build/solr/core/target/test/./solrtest-BadIndexSchemaTest-1346552989289
Creating dataDir: /usr/home/hudson/hudson-slave/workspace/Lucene-Solr-Maven-4.x/maven-build/solr/core/target/test/./solrtest-BadIndexSchemaTest-1346552989364
Creating dataDir: /usr/home/hudson/hudson-slave/workspace/Lucene-Solr-Maven-4.x/maven-build/solr/core/target/test/./solrtest-BadIndexSchemaTest-1346552989441
Creating dataDir: /usr/home/hudson/hudson-slave/workspace/Lucene-Solr-Maven-4.x/maven-build/solr/core/target/test/./solrtest-BadIndexSchemaTest-1346552989518
695 T501 oass.IndexSchema.readSchema SEVERE FieldType 'sim1' is configured with a similarity, but the global similarity does not support it: class org.apache.solr.search.similarities.DefaultSimilarityFactory
Creating dataDir: /usr/home/hudson/hudson-slave/workspace/Lucene-Solr-Maven-4.x/maven-build/solr/core/target/test/./solrtest-BadIndexSchemaTest-1346552989596
Creating dataDir: /usr/home/hudson/hudson-slave/workspace/Lucene-Solr-Maven-4.x/maven-build/solr/core/target/test/./solrtest-BadIndexSchemaTest-1346552989669
851 T501 oasc.SolrCore.initCodec SEVERE FieldType 'pulsing1' is configured with a postings format, but the codec does not support it: class org.apache.solr.core.SolrCore$3
Creating dataDir: /usr/home/hudson/hudson-slave/workspace/Lucene-Solr-Maven-4.x/maven-build/solr/core/target/test/./solrtest-BadIndexSchemaTest-1346552989752
Creating dataDir: /usr/home/hudson/hudson-slave/workspace/Lucene-Solr-Maven-4.x/maven-build/solr/core/target/test/./solrtest-BadIndexSchemaTest-1346552989821
Creating dataDir: /usr/home/hudson/hudson-slave/workspace/Lucene-Solr-Maven-4.x/maven-build/solr/core/target/test/./solrtest-BadIndexSchemaTest-1346552989894
1058 T3 oasc.CoreContainer.finalize SEVERE CoreContainer was not shutdown prior to finalize(), indicates a bug -- POSSIBLE RESOURCE LEAK!!!  instance=1960578141
1060 T3 oasc.SolrCore.finalize SEVERE REFCOUNT ERROR: unreferenced org.apache.solr.core.SolrCore@1aafe99b (collection1) has a reference count of 1
Creating dataDir: /usr/home/hudson/hudson-slave/workspace/Lucene-Solr-Maven-4.x/maven-build/solr/core/target/test/./solrtest-BadIndexSchemaTest-1346552989969
Tests run: 9, Failures: 0, Errors: 0, Skipped: 0, Time elapsed: 1.166 sec
Running org.apache.solr.search.TestStressRecovery
Creating dataDir: /usr/home/hudson/hudson-slave/workspace/Lucene-Solr-Maven-4.x/maven-build/solr/core/target/test/./solrtest-TestStressRecovery-1346552990063
5878 T3 oasc.CoreContainer.finalize SEVERE CoreContainer was not shutdown prior to finalize(), indicates a bug -- POSSIBLE RESOURCE LEAK!!!  instance=601548273
Tests run: 1, Failures: 0, Errors: 0, Skipped: 0, Time elapsed: 6.593 sec
Running org.apache.solr.search.TestExtendedDismaxParser
Tests run: 10, Failures: 0, Errors: 0, Skipped: 0, Time elapsed: 5.314 sec
Running org.apache.solr.handler.XmlUpdateRequestHandlerTest
Creating dataDir: /usr/home/hudson/hudson-slave/workspace/Lucene-Solr-Maven-4.x/maven-build/solr/core/target/test/./solrtest-XmlUpdateRequestHandlerTest-1346553001971
Tests run: 3, Failures: 0, Errors: 0, Skipped: 0, Time elapsed: 0.451 sec
Running org.apache.solr.update.DirectUpdateHandlerOptimizeTest
Tests run: 1, Failures: 0, Errors: 0, Skipped: 0, Time elapsed: 0.485 sec
Running org.apache.solr.util.TestFastWriter
Tests run: 1, Failures: 0, Errors: 0, Skipped: 0, Time elapsed: 0.248 sec
Running org.apache.solr.schema.PrimitiveFieldTypeTest
Tests run: 1, Failures: 0, Errors: 0, Skipped: 0, Time elapsed: 0.64 sec
Running org.apache.solr.cloud.ZkNodePropsTest
Tests run: 1, Failures: 0, Errors: 0, Skipped: 0, Time elapsed: 0.018 sec
Running org.apache.solr.search.function.SortByFunctionTest
Tests run: 2, Failures: 0, Errors: 0, Skipped: 0, Time elapsed: 1.075 sec
Running org.apache.solr.search.similarities.TestLMJelinekMercerSimilarityFactory
Creating dataDir: /usr/home/hudson/hudson-slave/workspace/Lucene-Solr-Maven-4.x/maven-build/solr/core/target/test/./solrtest-TestLMJelinekMercerSimilarityFactory-1346553004892
Tests run: 2, Failures: 0, Errors: 0, Skipped: 0, Time elapsed: 0.139 sec
Running org.apache.solr.cloud.BasicDistributedZkTest
Creating dataDir: /usr/home/hudson/hudson-slave/workspace/Lucene-Solr-Maven-4.x/maven-build/solr/core/target/test/./solrtest-BasicDistributedZkTest-1346553005042
76575 T599 oasc.SolrException.log SEVERE Sync Failed
107716 T599 oasc.SolrException.log SEVERE Sync request error: org.apache.solr.client.solrj.SolrServerException: Timeout occured while waiting response from server at: http://127.0.0.1:37972/solr/collection2
ASYNC  NEW_CORE C2 name=awholynewcollection_0 org.apache.solr.core.SolrCore@356076ed url=http://127.0.0.1:24212/solr/awholynewcollection_0 node=127.0.0.1:24212_solr
121606 T817 C2 P24212 oasc.SolrException.log SEVERE Error while trying to recover. core=awholynewcollection_0:org.apache.solr.client.solrj.SolrServerException: IOException occured when talking to server at: http://127.0.0.1:25990/solr
		at org.apache.solr.client.solrj.impl.HttpSolrServer.request(HttpSolrServer.java:414)
		at org.apache.solr.client.solrj.impl.HttpSolrServer.request(HttpSolrServer.java:182)
		at org.apache.solr.cloud.RecoveryStrategy.sendPrepRecoveryCmd(RecoveryStrategy.java:191)
		at org.apache.solr.cloud.RecoveryStrategy.doRecovery(RecoveryStrategy.java:320)
		at org.apache.solr.cloud.RecoveryStrategy.run(RecoveryStrategy.java:212)
	Caused by: org.apache.http.conn.ConnectTimeoutException: Connect to 127.0.0.1:25990 timed out
		at org.apache.http.conn.scheme.PlainSocketFactory.connectSocket(PlainSocketFactory.java:125)
		at org.apache.http.impl.conn.DefaultClientConnectionOperator.openConnection(DefaultClientConnectionOperator.java:148)
		at org.apache.http.impl.conn.AbstractPoolEntry.open(AbstractPoolEntry.java:150)
		at org.apache.http.impl.conn.AbstractPooledConnAdapter.open(AbstractPooledConnAdapter.java:121)
		at org.apache.http.impl.client.DefaultRequestDirector.tryConnect(DefaultRequestDirector.java:575)
		at org.apache.http.impl.client.DefaultRequestDirector.execute(DefaultRequestDirector.java:425)
		at org.apache.http.impl.client.AbstractHttpClient.execute(AbstractHttpClient.java:820)
		at org.apache.http.impl.client.AbstractHttpClient.execute(AbstractHttpClient.java:754)
		at org.apache.http.impl.client.AbstractHttpClient.execute(AbstractHttpClient.java:732)
		at org.apache.solr.client.solrj.impl.HttpSolrServer.request(HttpSolrServer.java:353)
		... 4 more
	
121610 T817 C2 P24212 oasc.RecoveryStrategy.doRecovery SEVERE Recovery failed - trying again... core=awholynewcollection_0
ASYNC  NEW_CORE C3 name=collection3 org.apache.solr.core.SolrCore@138684e7 url=http://127.0.0.1:37972/solr/collection3 node=127.0.0.1:37972_solr
122203 T825 C3 P37972 oasc.SolrException.log SEVERE Error while trying to recover. core=collection3:org.apache.solr.client.solrj.SolrServerException: IOException occured when talking to server at: http://127.0.0.1:30092/solr
		at org.apache.solr.client.solrj.impl.HttpSolrServer.request(HttpSolrServer.java:414)
		at org.apache.solr.client.solrj.impl.HttpSolrServer.request(HttpSolrServer.java:182)
		at org.apache.solr.cloud.RecoveryStrategy.sendPrepRecoveryCmd(RecoveryStrategy.java:191)
		at org.apache.solr.cloud.RecoveryStrategy.doRecovery(RecoveryStrategy.java:320)
		at org.apache.solr.cloud.RecoveryStrategy.run(RecoveryStrategy.java:212)
	Caused by: org.apache.http.conn.ConnectTimeoutException: Connect to 127.0.0.1:30092 timed out
		at org.apache.http.conn.scheme.PlainSocketFactory.connectSocket(PlainSocketFactory.java:125)
		at org.apache.http.impl.conn.DefaultClientConnectionOperator.openConnection(DefaultClientConnectionOperator.java:148)
		at org.apache.http.impl.conn.AbstractPoolEntry.open(AbstractPoolEntry.java:150)
		at org.apache.http.impl.conn.AbstractPooledConnAdapter.open(AbstractPooledConnAdapter.java:121)
		at org.apache.http.impl.client.DefaultRequestDirector.tryConnect(DefaultRequestDirector.java:575)
		at org.apache.http.impl.client.DefaultRequestDirector.execute(DefaultRequestDirector.java:425)
		at org.apache.http.impl.client.AbstractHttpClient.execute(AbstractHttpClient.java:820)
		at org.apache.http.impl.client.AbstractHttpClient.execute(AbstractHttpClient.java:754)
		at org.apache.http.impl.client.AbstractHttpClient.execute(AbstractHttpClient.java:732)
		at org.apache.solr.client.solrj.impl.HttpSolrServer.request(HttpSolrServer.java:353)
		... 4 more
	
122205 T825 C3 P37972 oasc.RecoveryStrategy.doRecovery SEVERE Recovery failed - trying again... core=collection3
ASYNC  NEW_CORE C4 name=collection2 org.apache.solr.core.SolrCore@3a577b23 url=http://127.0.0.1:37972/solr/collection2 node=127.0.0.1:37972_solr
153453 T829 C4 P37972 oasc.SolrException.log SEVERE Error while trying to recover. core=collection2:org.apache.solr.client.solrj.SolrServerException: IOException occured when talking to server at: http://127.0.0.1:24212/solr
		at org.apache.solr.client.solrj.impl.HttpSolrServer.request(HttpSolrServer.java:414)
		at org.apache.solr.client.solrj.impl.HttpSolrServer.request(HttpSolrServer.java:182)
		at org.apache.solr.cloud.RecoveryStrategy.sendPrepRecoveryCmd(RecoveryStrategy.java:191)
		at org.apache.solr.cloud.RecoveryStrategy.doRecovery(RecoveryStrategy.java:320)
		at org.apache.solr.cloud.RecoveryStrategy.run(RecoveryStrategy.java:212)
	Caused by: org.apache.http.conn.ConnectTimeoutException: Connect to 127.0.0.1:24212 timed out
		at org.apache.http.conn.scheme.PlainSocketFactory.connectSocket(PlainSocketFactory.java:125)
		at org.apache.http.impl.conn.DefaultClientConnectionOperator.openConnection(DefaultClientConnectionOperator.java:148)
		at org.apache.http.impl.conn.AbstractPoolEntry.open(AbstractPoolEntry.java:150)
		at org.apache.http.impl.conn.AbstractPooledConnAdapter.open(AbstractPooledConnAdapter.java:121)
		at org.apache.http.impl.client.DefaultRequestDirector.tryConnect(DefaultRequestDirector.java:575)
		at org.apache.http.impl.client.DefaultRequestDirector.execute(DefaultRequestDirector.java:425)
		at org.apache.http.impl.client.AbstractHttpClient.execute(AbstractHttpClient.java:820)
		at org.apache.http.impl.client.AbstractHttpClient.execute(AbstractHttpClient.java:754)
		at org.apache.http.impl.client.AbstractHttpClient.execute(AbstractHttpClient.java:732)
		at org.apache.solr.client.solrj.impl.HttpSolrServer.request(HttpSolrServer.java:353)
		... 4 more
	
153453 T829 C4 P37972 oasc.RecoveryStrategy.doRecovery SEVERE Recovery failed - trying again... core=collection2
 C3_STATE=coll:collection3 core:collection3 props:{shard=shard1, roles=null, state=active, core=collection3, collection=collection3, node_name=127.0.0.1:37972_solr, base_url=http://127.0.0.1:37972/solr}
169218 T825 C3 P37972 oasc.SolrException.log SEVERE Error while trying to recover. core=collection3:org.apache.solr.client.solrj.SolrServerException: IOException occured when talking to server at: http://127.0.0.1:24212/solr
		at org.apache.solr.client.solrj.impl.HttpSolrServer.request(HttpSolrServer.java:414)
		at org.apache.solr.client.solrj.impl.HttpSolrServer.request(HttpSolrServer.java:182)
		at org.apache.solr.cloud.RecoveryStrategy.sendPrepRecoveryCmd(RecoveryStrategy.java:191)
		at org.apache.solr.cloud.RecoveryStrategy.doRecovery(RecoveryStrategy.java:320)
		at org.apache.solr.cloud.RecoveryStrategy.run(RecoveryStrategy.java:212)
	Caused by: org.apache.http.conn.ConnectTimeoutException: Connect to 127.0.0.1:24212 timed out
		at org.apache.http.conn.scheme.PlainSocketFactory.connectSocket(PlainSocketFactory.java:125)
		at org.apache.http.impl.conn.DefaultClientConnectionOperator.openConnection(DefaultClientConnectionOperator.java:148)
		at org.apache.http.impl.conn.AbstractPoolEntry.open(AbstractPoolEntry.java:150)
		at org.apache.http.impl.conn.AbstractPooledConnAdapter.open(AbstractPooledConnAdapter.java:121)
		at org.apache.http.impl.client.DefaultRequestDirector.tryConnect(DefaultRequestDirector.java:575)
		at org.apache.http.impl.client.DefaultRequestDirector.execute(DefaultRequestDirector.java:425)
		at org.apache.http.impl.client.AbstractHttpClient.execute(AbstractHttpClient.java:820)
		at org.apache.http.impl.client.AbstractHttpClient.execute(AbstractHttpClient.java:754)
		at org.apache.http.impl.client.AbstractHttpClient.execute(AbstractHttpClient.java:732)
		at org.apache.solr.client.solrj.impl.HttpSolrServer.request(HttpSolrServer.java:353)
		... 4 more
	
169218 T825 C3 P37972 oasc.RecoveryStrategy.doRecovery SEVERE Recovery failed - trying again... core=collection3
Tests run: 1, Failures: 0, Errors: 0, Skipped: 0, Time elapsed: 172.218 sec
Running org.apache.solr.handler.component.DebugComponentTest
Creating dataDir: /usr/home/hudson/hudson-slave/workspace/Lucene-Solr-Maven-4.x/maven-build/solr/core/target/test/./solrtest-DebugComponentTest-1346553177252
Tests run: 2, Failures: 0, Errors: 0, Skipped: 0, Time elapsed: 0.576 sec
Running org.apache.solr.handler.admin.CoreAdminHandlerTest
Creating dataDir: /usr/home/hudson/hudson-slave/workspace/Lucene-Solr-Maven-4.x/maven-build/solr/core/target/test/./solrtest-CoreAdminHandlerTest-1346553177828
Tests run: 1, Failures: 0, Errors: 0, Skipped: 0, Time elapsed: 0.954 sec
Running org.apache.solr.SolrInfoMBeanTest
Creating dataDir: /usr/home/hudson/hudson-slave/workspace/Lucene-Solr-Maven-4.x/maven-build/solr/core/target/test/./solrtest-SolrInfoMBeanTest-1346553178783
Tests run: 1, Failures: 0, Errors: 0, Skipped: 0, Time elapsed: 0.552 sec
Running org.apache.solr.handler.DocumentAnalysisRequestHandlerTest
Creating dataDir: /usr/home/hudson/hudson-slave/workspace/Lucene-Solr-Maven-4.x/maven-build/solr/core/target/test/./solrtest-DocumentAnalysisRequestHandlerTest-1346553179336
Tests run: 4, Failures: 0, Errors: 0, Skipped: 0, Time elapsed: 0.504 sec
Running org.apache.solr.cloud.BasicZkTest
azt beforeclass
Creating dataDir: /usr/home/hudson/hudson-slave/workspace/Lucene-Solr-Maven-4.x/maven-build/solr/core/target/test/./solrtest-BasicZkTest-1346553179840
Tests run: 1, Failures: 0, Errors: 0, Skipped: 0, Time elapsed: 14.858 sec
Running org.apache.solr.cloud.LeaderElectionTest
Creating dataDir: /usr/home/hudson/hudson-slave/workspace/Lucene-Solr-Maven-4.x/maven-build/solr/core/target/test/./solrtest-LeaderElectionTest-1346553194700
3168 T901 oasc.LeaderElectionTest$ClientThread.run SEVERE setup failed org.apache.zookeeper.KeeperException$SessionExpiredException: KeeperErrorCode = Session expired for /collections/collection1/leader_elect/shard1/election
	at org.apache.zookeeper.KeeperException.create(KeeperException.java:118)
	at org.apache.zookeeper.KeeperException.create(KeeperException.java:42)
	at org.apache.zookeeper.ZooKeeper.exists(ZooKeeper.java:815)
	at org.apache.solr.common.cloud.SolrZkClient$4.execute(SolrZkClient.java:232)
	at org.apache.solr.common.cloud.SolrZkClient$4.execute(SolrZkClient.java:229)
	at org.apache.solr.common.cloud.ZkCmdExecutor.retryOperation(ZkCmdExecutor.java:67)
	at org.apache.solr.common.cloud.SolrZkClient.exists(SolrZkClient.java:229)
	at org.apache.solr.common.cloud.ZkCmdExecutor.ensureExists(ZkCmdExecutor.java:94)
	at org.apache.solr.common.cloud.ZkCmdExecutor.ensureExists(ZkCmdExecutor.java:88)
	at org.apache.solr.cloud.LeaderElector.setup(LeaderElector.java:279)
	at org.apache.solr.cloud.LeaderElectionTest$ClientThread.setupOnConnect(LeaderElectionTest.java:116)
	at org.apache.solr.cloud.LeaderElectionTest$ClientThread.run(LeaderElectionTest.java:125)
	at java.util.concurrent.Executors$RunnableAdapter.call(Executors.java:471)
	at java.util.concurrent.FutureTask$Sync.innerRun(FutureTask.java:334)
	at java.util.concurrent.FutureTask.run(FutureTask.java:166)
	at java.util.concurrent.ScheduledThreadPoolExecutor$ScheduledFutureTask.access$101(ScheduledThreadPoolExecutor.java:165)
	at java.util.concurrent.ScheduledThreadPoolExecutor$ScheduledFutureTask.run(ScheduledThreadPoolExecutor.java:266)
	at java.util.concurrent.ThreadPoolExecutor.runWorker(ThreadPoolExecutor.java:1110)
	at java.util.concurrent.ThreadPoolExecutor$Worker.run(ThreadPoolExecutor.java:603)
	at java.lang.Thread.run(Thread.java:679)

3187 T921 oasc.LeaderElectionTest$ClientThread.run SEVERE setup failed org.apache.zookeeper.KeeperException$SessionExpiredException: KeeperErrorCode = Session expired for /collections/collection1/leader_elect/shard1/election
	at org.apache.zookeeper.KeeperException.create(KeeperException.java:118)
	at org.apache.zookeeper.KeeperException.create(KeeperException.java:42)
	at org.apache.zookeeper.ZooKeeper.exists(ZooKeeper.java:815)
	at org.apache.solr.common.cloud.SolrZkClient$4.execute(SolrZkClient.java:232)
	at org.apache.solr.common.cloud.SolrZkClient$4.execute(SolrZkClient.java:229)
	at org.apache.solr.common.cloud.ZkCmdExecutor.retryOperation(ZkCmdExecutor.java:67)
	at org.apache.solr.common.cloud.SolrZkClient.exists(SolrZkClient.java:229)
	at org.apache.solr.common.cloud.ZkCmdExecutor.ensureExists(ZkCmdExecutor.java:94)
	at org.apache.solr.common.cloud.ZkCmdExecutor.ensureExists(ZkCmdExecutor.java:88)
	at org.apache.solr.cloud.LeaderElector.setup(LeaderElector.java:279)
	at org.apache.solr.cloud.LeaderElectionTest$ClientThread.setupOnConnect(LeaderElectionTest.java:116)
	at org.apache.solr.cloud.LeaderElectionTest$ClientThread.run(LeaderElectionTest.java:125)
	at java.util.concurrent.Executors$RunnableAdapter.call(Executors.java:471)
	at java.util.concurrent.FutureTask$Sync.innerRun(FutureTask.java:334)
	at java.util.concurrent.FutureTask.run(FutureTask.java:166)
	at java.util.concurrent.ScheduledThreadPoolExecutor$ScheduledFutureTask.access$101(ScheduledThreadPoolExecutor.java:165)
	at java.util.concurrent.ScheduledThreadPoolExecutor$ScheduledFutureTask.run(ScheduledThreadPoolExecutor.java:266)
	at java.util.concurrent.ThreadPoolExecutor.runWorker(ThreadPoolExecutor.java:1110)
	at java.util.concurrent.ThreadPoolExecutor$Worker.run(ThreadPoolExecutor.java:603)
	at java.lang.Thread.run(Thread.java:679)

3233 T894 oasc.LeaderElectionTest$ClientThread.run SEVERE setup failed org.apache.zookeeper.KeeperException$SessionExpiredException: KeeperErrorCode = Session expired for /collections/collection1/leader_elect/shard1/election
	at org.apache.zookeeper.KeeperException.create(KeeperException.java:118)
	at org.apache.zookeeper.KeeperException.create(KeeperException.java:42)
	at org.apache.zookeeper.ZooKeeper.exists(ZooKeeper.java:815)
	at org.apache.solr.common.cloud.SolrZkClient$4.execute(SolrZkClient.java:232)
	at org.apache.solr.common.cloud.SolrZkClient$4.execute(SolrZkClient.java:229)
	at org.apache.solr.common.cloud.ZkCmdExecutor.retryOperation(ZkCmdExecutor.java:67)
	at org.apache.solr.common.cloud.SolrZkClient.exists(SolrZkClient.java:229)
	at org.apache.solr.common.cloud.ZkCmdExecutor.ensureExists(ZkCmdExecutor.java:94)
	at org.apache.solr.common.cloud.ZkCmdExecutor.ensureExists(ZkCmdExecutor.java:88)
	at org.apache.solr.cloud.LeaderElector.setup(LeaderElector.java:279)
	at org.apache.solr.cloud.LeaderElectionTest$ClientThread.setupOnConnect(LeaderElectionTest.java:116)
	at org.apache.solr.cloud.LeaderElectionTest$ClientThread.run(LeaderElectionTest.java:125)
	at java.util.concurrent.Executors$RunnableAdapter.call(Executors.java:471)
	at java.util.concurrent.FutureTask$Sync.innerRun(FutureTask.java:334)
	at java.util.concurrent.FutureTask.run(FutureTask.java:166)
	at java.util.concurrent.ScheduledThreadPoolExecutor$ScheduledFutureTask.access$101(ScheduledThreadPoolExecutor.java:165)
	at java.util.concurrent.ScheduledThreadPoolExecutor$ScheduledFutureTask.run(ScheduledThreadPoolExecutor.java:266)
	at java.util.concurrent.ThreadPoolExecutor.runWorker(ThreadPoolExecutor.java:1110)
	at java.util.concurrent.ThreadPoolExecutor$Worker.run(ThreadPoolExecutor.java:603)
	at java.lang.Thread.run(Thread.java:679)

3292 T905 oasc.LeaderElectionTest$ClientThread.run SEVERE setup failed org.apache.zookeeper.KeeperException$SessionExpiredException: KeeperErrorCode = Session expired for /collections/collection1/leader_elect/shard1/election
	at org.apache.zookeeper.KeeperException.create(KeeperException.java:118)
	at org.apache.zookeeper.KeeperException.create(KeeperException.java:42)
	at org.apache.zookeeper.ZooKeeper.exists(ZooKeeper.java:815)
	at org.apache.solr.common.cloud.SolrZkClient$4.execute(SolrZkClient.java:232)
	at org.apache.solr.common.cloud.SolrZkClient$4.execute(SolrZkClient.java:229)
	at org.apache.solr.common.cloud.ZkCmdExecutor.retryOperation(ZkCmdExecutor.java:67)
	at org.apache.solr.common.cloud.SolrZkClient.exists(SolrZkClient.java:229)
	at org.apache.solr.common.cloud.ZkCmdExecutor.ensureExists(ZkCmdExecutor.java:94)
	at org.apache.solr.common.cloud.ZkCmdExecutor.ensureExists(ZkCmdExecutor.java:88)
	at org.apache.solr.cloud.LeaderElector.setup(LeaderElector.java:279)
	at org.apache.solr.cloud.LeaderElectionTest$ClientThread.setupOnConnect(LeaderElectionTest.java:116)
	at org.apache.solr.cloud.LeaderElectionTest$ClientThread.run(LeaderElectionTest.java:125)
	at java.util.concurrent.Executors$RunnableAdapter.call(Executors.java:471)
	at java.util.concurrent.FutureTask$Sync.innerRun(FutureTask.java:334)
	at java.util.concurrent.FutureTask.run(FutureTask.java:166)
	at java.util.concurrent.ScheduledThreadPoolExecutor$ScheduledFutureTask.access$101(ScheduledThreadPoolExecutor.java:165)
	at java.util.concurrent.ScheduledThreadPoolExecutor$ScheduledFutureTask.run(ScheduledThreadPoolExecutor.java:266)
	at java.util.concurrent.ThreadPoolExecutor.runWorker(ThreadPoolExecutor.java:1110)
	at java.util.concurrent.ThreadPoolExecutor$Worker.run(ThreadPoolExecutor.java:603)
	at java.lang.Thread.run(Thread.java:679)

6947 T894 oasc.LeaderElectionTest$ClientThread.run SEVERE setup failed java.lang.InterruptedException
	at java.lang.Object.wait(Native Method)
	at java.lang.Object.wait(Object.java:502)
	at org.apache.zookeeper.ClientCnxn.submitRequest(ClientCnxn.java:1345)
	at org.apache.zookeeper.ZooKeeper.exists(ZooKeeper.java:810)
	at org.apache.solr.common.cloud.SolrZkClient$4.execute(SolrZkClient.java:232)
	at org.apache.solr.common.cloud.SolrZkClient$4.execute(SolrZkClient.java:229)
	at org.apache.solr.common.cloud.ZkCmdExecutor.retryOperation(ZkCmdExecutor.java:67)
	at org.apache.solr.common.cloud.SolrZkClient.exists(SolrZkClient.java:229)
	at org.apache.solr.common.cloud.ZkCmdExecutor.ensureExists(ZkCmdExecutor.java:94)
	at org.apache.solr.common.cloud.ZkCmdExecutor.ensureExists(ZkCmdExecutor.java:88)
	at org.apache.solr.cloud.LeaderElector.setup(LeaderElector.java:279)
	at org.apache.solr.cloud.LeaderElectionTest$ClientThread.setupOnConnect(LeaderElectionTest.java:116)
	at org.apache.solr.cloud.LeaderElectionTest$ClientThread.run(LeaderElectionTest.java:125)
	at java.util.concurrent.Executors$RunnableAdapter.call(Executors.java:471)
	at java.util.concurrent.FutureTask$Sync.innerRun(FutureTask.java:334)
	at java.util.concurrent.FutureTask.run(FutureTask.java:166)
	at java.util.concurrent.ScheduledThreadPoolExecutor$ScheduledFutureTask.access$101(ScheduledThreadPoolExecutor.java:165)
	at java.util.concurrent.ScheduledThreadPoolExecutor$ScheduledFutureTask.run(ScheduledThreadPoolExecutor.java:266)
	at java.util.concurrent.ThreadPoolExecutor.runWorker(ThreadPoolExecutor.java:1110)
	at java.util.concurrent.ThreadPoolExecutor$Worker.run(ThreadPoolExecutor.java:603)
	at java.lang.Thread.run(Thread.java:679)

13080 T990 oasc.SolrException.log SEVERE Failed setting watch:org.apache.zookeeper.KeeperException$NoNodeException: KeeperErrorCode = NoNode for /collections/collection1/leader_elect/shard1/election/88247710901010442-7-n_0000000003
		at org.apache.zookeeper.KeeperException.create(KeeperException.java:102)
		at org.apache.zookeeper.KeeperException.create(KeeperException.java:42)
		at org.apache.zookeeper.ZooKeeper.getData(ZooKeeper.java:927)
		at org.apache.solr.common.cloud.SolrZkClient$7.execute(SolrZkClient.java:301)
		at org.apache.solr.common.cloud.SolrZkClient$7.execute(SolrZkClient.java:298)
		at org.apache.solr.common.cloud.ZkCmdExecutor.retryOperation(ZkCmdExecutor.java:67)
		at org.apache.solr.common.cloud.SolrZkClient.getData(SolrZkClient.java:298)
		at org.apache.solr.cloud.LeaderElector.checkIfIamLeader(LeaderElector.java:120)
		at org.apache.solr.cloud.LeaderElector.access$000(LeaderElector.java:57)
		at org.apache.solr.cloud.LeaderElector$1.process(LeaderElector.java:132)
		at org.apache.zookeeper.ClientCnxn$EventThread.processEvent(ClientCnxn.java:526)
		at org.apache.zookeeper.ClientCnxn$EventThread.run(ClientCnxn.java:502)
	
14085 T960 oasc.SolrException.log SEVERE Failed setting watch:org.apache.zookeeper.KeeperException$NoNodeException: KeeperErrorCode = NoNode for /collections/collection1/leader_elect/shard1/election/88247710901010440-5-n_0000000002
		at org.apache.zookeeper.KeeperException.create(KeeperException.java:102)
		at org.apache.zookeeper.KeeperException.create(KeeperException.java:42)
		at org.apache.zookeeper.ZooKeeper.getData(ZooKeeper.java:927)
		at org.apache.solr.common.cloud.SolrZkClient$7.execute(SolrZkClient.java:301)
		at org.apache.solr.common.cloud.SolrZkClient$7.execute(SolrZkClient.java:298)
		at org.apache.solr.common.cloud.ZkCmdExecutor.retryOperation(ZkCmdExecutor.java:67)
		at org.apache.solr.common.cloud.SolrZkClient.getData(SolrZkClient.java:298)
		at org.apache.solr.cloud.LeaderElector.checkIfIamLeader(LeaderElector.java:120)
		at org.apache.solr.cloud.LeaderElector.access$000(LeaderElector.java:57)
		at org.apache.solr.cloud.LeaderElector$1.process(LeaderElector.java:132)
		at org.apache.zookeeper.ClientCnxn$EventThread.processEvent(ClientCnxn.java:526)
		at org.apache.zookeeper.ClientCnxn$EventThread.run(ClientCnxn.java:502)
	
Tests run: 4, Failures: 0, Errors: 0, Skipped: 0, Time elapsed: 16.247 sec
Running org.apache.solr.analysis.LegacyHTMLStripCharFilterTest
Tests run: 13, Failures: 0, Errors: 0, Skipped: 1, Time elapsed: 0.283 sec
Running org.apache.solr.core.PluginInfoTest
Tests run: 9, Failures: 0, Errors: 0, Skipped: 0, Time elapsed: 0.082 sec
Running org.apache.solr.spelling.SpellPossibilityIteratorTest
Tests run: 3, Failures: 0, Errors: 0, Skipped: 0, Time elapsed: 0.653 sec
Running org.apache.solr.TestDocumentBuilder
doc1: SolrInputDocument[field1=value1, field2=value1, field3=value2, field4=15, field5=[45, 33, 20]]
clone: SolrInputDocument[field1=value1, field2=value1, field3=value2, field4=15, field5=[45, 33, 20]]
Tests run: 1, Failures: 0, Errors: 0, Skipped: 0, Time elapsed: 0.009 sec
Running org.apache.solr.handler.MoreLikeThisHandlerTest
Creating dataDir: /usr/home/hudson/hudson-slave/workspace/Lucene-Solr-Maven-4.x/maven-build/solr/core/target/test/./solrtest-MoreLikeThisHandlerTest-1346553211974
Tests run: 1, Failures: 0, Errors: 0, Skipped: 0, Time elapsed: 0.381 sec
Running org.apache.solr.cloud.ZkSolrClientTest
Tests run: 4, Failures: 0, Errors: 0, Skipped: 0, Time elapsed: 7.482 sec
Running org.apache.solr.core.TestJmxMonitoredMap
Tests run: 2, Failures: 0, Errors: 0, Skipped: 0, Time elapsed: 0.143 sec
Running org.apache.solr.schema.PreAnalyzedFieldTest
Tests run: 3, Failures: 0, Errors: 0, Skipped: 0, Time elapsed: 0.035 sec
Running org.apache.solr.core.TestSolrDeletionPolicy1
Creating dataDir: /usr/home/hudson/hudson-slave/workspace/Lucene-Solr-Maven-4.x/maven-build/solr/core/target/test/./solrtest-TestSolrDeletionPolicy1-1346553220024
Tests run: 3, Failures: 0, Errors: 0, Skipped: 0, Time elapsed: 0.776 sec
Running org.apache.solr.update.processor.SignatureUpdateProcessorFactoryTest
Creating dataDir: /usr/home/hudson/hudson-slave/workspace/Lucene-Solr-Maven-4.x/maven-build/solr/core/target/test/./solrtest-SignatureUpdateProcessorFactoryTest-1346553220803
Tests run: 6, Failures: 0, Errors: 0, Skipped: 0, Time elapsed: 1.162 sec
Running org.apache.solr.core.SOLR749Test
Creating dataDir: /usr/home/hudson/hudson-slave/workspace/Lucene-Solr-Maven-4.x/maven-build/solr/core/target/test/./solrtest-SOLR749Test-1346553221959
Tests run: 1, Failures: 0, Errors: 0, Skipped: 0, Time elapsed: 0.279 sec
Running org.apache.solr.cloud.ZkControllerTest
Creating dataDir: /usr/home/hudson/hudson-slave/workspace/Lucene-Solr-Maven-4.x/maven-build/solr/core/target/test/./solrtest-ZkControllerTest-1346553222237
Tests run: 2, Failures: 0, Errors: 0, Skipped: 0, Time elapsed: 3.442 sec
Running org.apache.solr.search.function.distance.DistanceFunctionTest
Creating dataDir: /usr/home/hudson/hudson-slave/workspace/Lucene-Solr-Maven-4.x/maven-build/solr/core/target/test/./solrtest-DistanceFunctionTest-1346553225685
Tests run: 3, Failures: 0, Errors: 0, Skipped: 0, Time elapsed: 0.642 sec
Running org.apache.solr.update.SolrIndexConfigTest
Tests run: 2, Failures: 0, Errors: 0, Skipped: 0, Time elapsed: 0.405 sec
Running org.apache.solr.update.AutoCommitTest
Tests run: 3, Failures: 0, Errors: 0, Skipped: 0, Time elapsed: 8.065 sec
Running org.apache.solr.cloud.LeaderElectionIntegrationTest
Creating dataDir: /usr/home/hudson/hudson-slave/workspace/Lucene-Solr-Maven-4.x/maven-build/solr/core/target/test/./solrtest-LeaderElectionIntegrationTest-1346553234803
7890 T1157 oasc.SyncStrategy.sync SEVERE No UpdateLog found - cannot sync
7895 T1160 oasc.SyncStrategy.sync SEVERE No UpdateLog found - cannot sync
7901 T1163 oasc.SyncStrategy.sync SEVERE No UpdateLog found - cannot sync
7906 T1166 oasc.SyncStrategy.sync SEVERE No UpdateLog found - cannot sync
7935 T1157 oasc.SyncStrategy.sync SEVERE No UpdateLog found - cannot sync
8994 T1160 oasc.SyncStrategy.sync SEVERE No UpdateLog found - cannot sync
10023 T1163 oasc.SyncStrategy.sync SEVERE No UpdateLog found - cannot sync
11026 T1166 oasc.SyncStrategy.sync SEVERE No UpdateLog found - cannot sync
Creating dataDir: /usr/home/hudson/hudson-slave/workspace/Lucene-Solr-Maven-4.x/maven-build/solr/core/target/test/./solrtest-LeaderElectionIntegrationTest-1346553246983
Tests run: 2, Failures: 0, Errors: 0, Skipped: 0, Time elapsed: 28.245 sec
Running org.apache.solr.search.TestFoldingMultitermQuery
Creating dataDir: /usr/home/hudson/hudson-slave/workspace/Lucene-Solr-Maven-4.x/maven-build/solr/core/target/test/./solrtest-TestFoldingMultitermQuery-1346553263049
Tests run: 18, Failures: 0, Errors: 0, Skipped: 0, Time elapsed: 0.808 sec
Running org.apache.solr.search.similarities.TestDFRSimilarityFactory
Creating dataDir: /usr/home/hudson/hudson-slave/workspace/Lucene-Solr-Maven-4.x/maven-build/solr/core/target/test/./solrtest-TestDFRSimilarityFactory-1346553263854
Tests run: 3, Failures: 0, Errors: 0, Skipped: 0, Time elapsed: 0.104 sec
Running org.apache.solr.update.DocumentBuilderTest
Creating dataDir: /usr/home/hudson/hudson-slave/workspace/Lucene-Solr-Maven-4.x/maven-build/solr/core/target/test/./solrtest-DocumentBuilderTest-1346553263962
Tests run: 11, Failures: 0, Errors: 0, Skipped: 0, Time elapsed: 0.552 sec
Running org.apache.solr.servlet.DirectSolrConnectionTest
Tests run: 2, Failures: 0, Errors: 0, Skipped: 0, Time elapsed: 0.228 sec
Running org.apache.solr.schema.NumericFieldsTest
Creating dataDir: /usr/home/hudson/hudson-slave/workspace/Lucene-Solr-Maven-4.x/maven-build/solr/core/target/test/./solrtest-NumericFieldsTest-1346553264741
Tests run: 1, Failures: 0, Errors: 0, Skipped: 0, Time elapsed: 0.266 sec
Running org.apache.solr.TestDistributedGrouping
Tests run: 1, Failures: 0, Errors: 0, Skipped: 0, Time elapsed: 12.954 sec
Running org.apache.solr.cloud.OverseerTest
Creating dataDir: /usr/home/hudson/hudson-slave/workspace/Lucene-Solr-Maven-4.x/maven-build/solr/core/target/test/./solrtest-OverseerTest-1346553277967
Tests run: 8, Failures: 0, Errors: 0, Skipped: 0, Time elapsed: 34.847 sec
Running org.apache.solr.spelling.suggest.SuggesterTSTTest
Creating dataDir: /usr/home/hudson/hudson-slave/workspace/Lucene-Solr-Maven-4.x/maven-build/solr/core/target/test/./solrtest-SuggesterTSTTest-1346553312813
NOTE: per solr.test.leavedatadir, dataDir will not be removed: /usr/home/hudson/hudson-slave/workspace/Lucene-Solr-Maven-4.x/maven-build/solr/core/target/test/./solrtest-SuggesterTSTTest-1346553312813
Tests run: 4, Failures: 0, Errors: 0, Skipped: 0, Time elapsed: 0.862 sec
Running org.apache.solr.response.TestPHPSerializedResponseWriter
Creating dataDir: /usr/home/hudson/hudson-slave/workspace/Lucene-Solr-Maven-4.x/maven-build/solr/core/target/test/./solrtest-TestPHPSerializedResponseWriter-1346553313674
Tests run: 2, Failures: 0, Errors: 0, Skipped: 0, Time elapsed: 0.497 sec
Running org.apache.solr.TestSolrCoreProperties
Tests run: 1, Failures: 0, Errors: 0, Skipped: 0, Time elapsed: 0.177 sec
Running org.apache.solr.DisMaxRequestHandlerTest
Creating dataDir: /usr/home/hudson/hudson-slave/workspace/Lucene-Solr-Maven-4.x/maven-build/solr/core/target/test/./solrtest-DisMaxRequestHandlerTest-1346553314349
Tests run: 2, Failures: 0, Errors: 0, Skipped: 0, Time elapsed: 0.594 sec
Running org.apache.solr.internal.csv.writer.CSVConfigTest
Tests run: 7, Failures: 0, Errors: 0, Skipped: 0, Time elapsed: 0.002 sec
Running org.apache.solr.schema.MultiTermTest
Creating dataDir: /usr/home/hudson/hudson-slave/workspace/Lucene-Solr-Maven-4.x/maven-build/solr/core/target/test/./solrtest-MultiTermTest-1346553314948
Tests run: 3, Failures: 0, Errors: 0, Skipped: 0, Time elapsed: 0.216 sec
Running org.apache.solr.TestDistributedSearch
Tests run: 1, Failures: 0, Errors: 0, Skipped: 0, Time elapsed: 90.456 sec
Running org.apache.solr.core.AlternateDirectoryTest
Creating dataDir: /usr/home/hudson/hudson-slave/workspace/Lucene-Solr-Maven-4.x/maven-build/solr/core/target/test/./solrtest-AlternateDirectoryTest-1346553405622
Tests run: 1, Failures: 0, Errors: 0, Skipped: 0, Time elapsed: 0.415 sec
Running org.apache.solr.search.TestStressVersions
Creating dataDir: /usr/home/hudson/hudson-slave/workspace/Lucene-Solr-Maven-4.x/maven-build/solr/core/target/test/./solrtest-TestStressVersions-1346553406038
Tests run: 1, Failures: 0, Errors: 0, Skipped: 0, Time elapsed: 3.752 sec
Running org.apache.solr.search.similarities.TestBM25SimilarityFactory
Creating dataDir: /usr/home/hudson/hudson-slave/workspace/Lucene-Solr-Maven-4.x/maven-build/solr/core/target/test/./solrtest-TestBM25SimilarityFactory-1346553409790
Tests run: 2, Failures: 0, Errors: 0, Skipped: 0, Time elapsed: 0.094 sec
Running org.apache.solr.search.TestQueryUtils
Tests run: 1, Failures: 0, Errors: 0, Skipped: 0, Time elapsed: 0.611 sec
Running org.apache.solr.handler.BinaryUpdateRequestHandlerTest
Creating dataDir: /usr/home/hudson/hudson-slave/workspace/Lucene-Solr-Maven-4.x/maven-build/solr/core/target/test/./solrtest-BinaryUpdateRequestHandlerTest-1346553410497
null
Tests run: 1, Failures: 0, Errors: 0, Skipped: 0, Time elapsed: 0.622 sec
Running org.apache.solr.schema.CurrencyFieldTest
Creating dataDir: /usr/home/hudson/hudson-slave/workspace/Lucene-Solr-Maven-4.x/maven-build/solr/core/target/test/./solrtest-CurrencyFieldTest-1346553411122
Tests run: 8, Failures: 0, Errors: 0, Skipped: 1, Time elapsed: 0.727 sec
Running org.apache.solr.search.TestRTGBase
Tests run: 0, Failures: 0, Errors: 0, Skipped: 0, Time elapsed: 0.017 sec
Running org.apache.solr.search.SpatialFilterTest
Creating dataDir: /usr/home/hudson/hudson-slave/workspace/Lucene-Solr-Maven-4.x/maven-build/solr/core/target/test/./solrtest-SpatialFilterTest-1346553411871
Tests run: 3, Failures: 0, Errors: 0, Skipped: 0, Time elapsed: 0.931 sec
Running org.apache.solr.core.RequestHandlersTest
Creating dataDir: /usr/home/hudson/hudson-slave/workspace/Lucene-Solr-Maven-4.x/maven-build/solr/core/target/test/./solrtest-RequestHandlersTest-1346553412797
Tests run: 3, Failures: 0, Errors: 0, Skipped: 0, Time elapsed: 0.522 sec
Running org.apache.solr.servlet.NoCacheHeaderTest
Creating dataDir: /usr/home/hudson/hudson-slave/workspace/Lucene-Solr-Maven-4.x/maven-build/solr/core/target/test/./solrtest-NoCacheHeaderTest-1346553413332
Tests run: 3, Failures: 0, Errors: 0, Skipped: 0, Time elapsed: 0.531 sec
Running org.apache.solr.search.TestSort
Creating dataDir: /usr/home/hudson/hudson-slave/workspace/Lucene-Solr-Maven-4.x/maven-build/solr/core/target/test/./solrtest-TestSort-1346553413849
Tests run: 2, Failures: 0, Errors: 0, Skipped: 0, Time elapsed: 4.064 sec
Running org.apache.solr.cloud.ZkCLITest
Creating dataDir: /usr/home/hudson/hudson-slave/workspace/Lucene-Solr-Maven-4.x/maven-build/solr/core/target/test/./solrtest-ZkCLITest-1346553417913
Creating dataDir: /usr/home/hudson/hudson-slave/workspace/Lucene-Solr-Maven-4.x/maven-build/solr/core/target/test/./solrtest-ZkCLITest-1346553419171
Creating dataDir: /usr/home/hudson/hudson-slave/workspace/Lucene-Solr-Maven-4.x/maven-build/solr/core/target/test/./solrtest-ZkCLITest-1346553419962
Tests run: 3, Failures: 0, Errors: 0, Skipped: 0, Time elapsed: 5.199 sec
Running org.apache.solr.OutputWriterTest
Creating dataDir: /usr/home/hudson/hudson-slave/workspace/Lucene-Solr-Maven-4.x/maven-build/solr/core/target/test/./solrtest-OutputWriterTest-1346553423116
Tests run: 5, Failures: 0, Errors: 0, Skipped: 0, Time elapsed: 0.266 sec
Running org.apache.solr.update.UpdateParamsTest
Tests run: 1, Failures: 0, Errors: 0, Skipped: 0, Time elapsed: 0.672 sec
Running org.apache.solr.BasicFunctionalityTest
Creating dataDir: /usr/home/hudson/hudson-slave/workspace/Lucene-Solr-Maven-4.x/maven-build/solr/core/target/test/./solrtest-BasicFunctionalityTest-1346553424057
Tests run: 23, Failures: 0, Errors: 0, Skipped: 1, Time elapsed: 1.58 sec
Running org.apache.solr.update.SoftAutoCommitTest
Tests run: 3, Failures: 0, Errors: 0, Skipped: 0, Time elapsed: 9.253 sec
Running org.apache.solr.search.TestRecovery
Creating dataDir: /usr/home/hudson/hudson-slave/workspace/Lucene-Solr-Maven-4.x/maven-build/solr/core/target/test/./solrtest-TestRecovery-1346553434890
Tests run: 9, Failures: 0, Errors: 0, Skipped: 0, Time elapsed: 6.241 sec
Running org.apache.solr.spelling.SpellingQueryConverterTest
Tests run: 5, Failures: 0, Errors: 0, Skipped: 0, Time elapsed: 0.035 sec
Running org.apache.solr.core.TestCodecSupport
Creating dataDir: /usr/home/hudson/hudson-slave/workspace/Lucene-Solr-Maven-4.x/maven-build/solr/core/target/test/./solrtest-TestCodecSupport-1346553441162
Tests run: 3, Failures: 0, Errors: 0, Skipped: 0, Time elapsed: 0.074 sec
Running org.apache.solr.util.TimeZoneUtilsTest
Tests run: 5, Failures: 0, Errors: 0, Skipped: 0, Time elapsed: 0.114 sec
Running org.apache.solr.core.TestQuerySenderNoQuery
Creating dataDir: /usr/home/hudson/hudson-slave/workspace/Lucene-Solr-Maven-4.x/maven-build/solr/core/target/test/./solrtest-TestQuerySenderNoQuery-1346553441681
Tests run: 3, Failures: 0, Errors: 0, Skipped: 0, Time elapsed: 0.725 sec
Running org.apache.solr.handler.component.DistributedSpellCheckComponentTest
Tests run: 1, Failures: 0, Errors: 0, Skipped: 0, Time elapsed: 7.274 sec
Running org.apache.solr.handler.component.StatsComponentTest
ASYNC  NEW_CORE C5 name=collection1 org.apache.solr.core.SolrCore@61133cac
9539 T2154 C5 oasc.SolrException.log SEVERE org.apache.solr.common.SolrException: Stats can only facet on single-valued fields, not: foo_ss
		at org.apache.solr.handler.component.SimpleStats.getFieldCacheStats(StatsComponent.java:261)
		at org.apache.solr.handler.component.SimpleStats.getStatsFields(StatsComponent.java:227)
		at org.apache.solr.handler.component.SimpleStats.getStatsCounts(StatsComponent.java:201)
		at org.apache.solr.handler.component.StatsComponent.process(StatsComponent.java:70)
		at org.apache.solr.handler.component.SearchHandler.handleRequestBody(SearchHandler.java:206)
		at org.apache.solr.handler.RequestHandlerBase.handleRequest(RequestHandlerBase.java:129)
		at org.apache.solr.core.SolrCore.execute(SolrCore.java:1692)
		at org.apache.solr.util.TestHarness.query(TestHarness.java:351)
		at org.apache.solr.util.TestHarness.query(TestHarness.java:333)
		at org.apache.solr.util.AbstractSolrTestCase.assertQEx(AbstractSolrTestCase.java:290)
		at org.apache.solr.handler.component.StatsComponentTest.testStatsFacetMultivaluedErrorHandling(StatsComponentTest.java:363)
		at sun.reflect.NativeMethodAccessorImpl.invoke0(Native Method)
		at sun.reflect.NativeMethodAccessorImpl.invoke(NativeMethodAccessorImpl.java:57)
		at sun.reflect.DelegatingMethodAccessorImpl.invoke(DelegatingMethodAccessorImpl.java:43)
		at java.lang.reflect.Method.invoke(Method.java:616)
		at com.carrotsearch.randomizedtesting.RandomizedRunner.invoke(RandomizedRunner.java:1559)
		at com.carrotsearch.randomizedtesting.RandomizedRunner.access$600(RandomizedRunner.java:79)
		at com.carrotsearch.randomizedtesting.RandomizedRunner$6.evaluate(RandomizedRunner.java:737)
		at com.carrotsearch.randomizedtesting.RandomizedRunner$7.evaluate(RandomizedRunner.java:773)
		at com.carrotsearch.randomizedtesting.RandomizedRunner$8.evaluate(RandomizedRunner.java:787)
		at com.carrotsearch.randomizedtesting.rules.SystemPropertiesRestoreRule$1.evaluate(SystemPropertiesRestoreRule.java:53)
		at org.apache.lucene.util.TestRuleSetupTeardownChained$1.evaluate(TestRuleSetupTeardownChained.java:50)
		at org.apache.lucene.util.TestRuleFieldCacheSanity$1.evaluate(TestRuleFieldCacheSanity.java:51)
		at org.apache.lucene.util.AbstractBeforeAfterRule$1.evaluate(AbstractBeforeAfterRule.java:45)
		at com.carrotsearch.randomizedtesting.rules.SystemPropertiesInvariantRule$1.evaluate(SystemPropertiesInvariantRule.java:55)
		at org.apache.lucene.util.TestRuleThreadAndTestName$1.evaluate(TestRuleThreadAndTestName.java:48)
		at org.apache.lucene.util.TestRuleIgnoreAfterMaxFailures$1.evaluate(TestRuleIgnoreAfterMaxFailures.java:70)
		at org.apache.lucene.util.TestRuleMarkFailure$1.evaluate(TestRuleMarkFailure.java:48)
		at com.carrotsearch.randomizedtesting.rules.StatementAdapter.evaluate(StatementAdapter.java:36)
		at com.carrotsearch.randomizedtesting.ThreadLeakControl$StatementRunner.run(ThreadLeakControl.java:345)
		at com.carrotsearch.randomizedtesting.ThreadLeakControl.forkTimeoutingTask(ThreadLeakControl.java:769)
		at com.carrotsearch.randomizedtesting.ThreadLeakControl$3.evaluate(ThreadLeakControl.java:429)
		at com.carrotsearch.randomizedtesting.RandomizedRunner.runSingleTest(RandomizedRunner.java:746)
		at com.carrotsearch.randomizedtesting.RandomizedRunner$3.evaluate(RandomizedRunner.java:648)
		at com.carrotsearch.randomizedtesting.RandomizedRunner$4.evaluate(RandomizedRunner.java:682)
		at com.carrotsearch.randomizedtesting.RandomizedRunner$5.evaluate(RandomizedRunner.java:693)
		at com.carrotsearch.randomizedtesting.rules.StatementAdapter.evaluate(StatementAdapter.java:36)
		at com.carrotsearch.randomizedtesting.rules.SystemPropertiesRestoreRule$1.evaluate(SystemPropertiesRestoreRule.java:53)
		at org.apache.lucene.util.AbstractBeforeAfterRule$1.evaluate(AbstractBeforeAfterRule.java:45)
		at org.apache.lucene.util.TestRuleStoreClassName$1.evaluate(TestRuleStoreClassName.java:42)
		at com.carrotsearch.randomizedtesting.rules.SystemPropertiesInvariantRule$1.evaluate(SystemPropertiesInvariantRule.java:55)
		at com.carrotsearch.randomizedtesting.rules.NoShadowingOrOverridesOnMethodsRule$1.evaluate(NoShadowingOrOverridesOnMethodsRule.java:39)
		at com.carrotsearch.randomizedtesting.rules.NoShadowingOrOverridesOnMethodsRule$1.evaluate(NoShadowingOrOverridesOnMethodsRule.java:39)
		at org.apache.lucene.util.TestRuleAssertionsRequired$1.evaluate(TestRuleAssertionsRequired.java:40)
		at org.apache.lucene.util.TestRuleMarkFailure$1.evaluate(TestRuleMarkFailure.java:48)
		at org.apache.lucene.util.TestRuleIgnoreAfterMaxFailures$1.evaluate(TestRuleIgnoreAfterMaxFailures.java:70)
		at org.apache.lucene.util.TestRuleIgnoreTestSuites$1.evaluate(TestRuleIgnoreTestSuites.java:55)
		at com.carrotsearch.randomizedtesting.rules.StatementAdapter.evaluate(StatementAdapter.java:36)
		at com.carrotsearch.randomizedtesting.ThreadLeakControl$StatementRunner.run(ThreadLeakControl.java:345)
		at java.lang.Thread.run(Thread.java:679)
	
Tests run: 7, Failures: 0, Errors: 0, Skipped: 0, Time elapsed: 3.391 sec
Running org.apache.solr.search.ReturnFieldsTest
Creating dataDir: /usr/home/hudson/hudson-slave/workspace/Lucene-Solr-Maven-4.x/maven-build/solr/core/target/test/./solrtest-ReturnFieldsTest-1346553452749
Tests run: 10, Failures: 0, Errors: 0, Skipped: 0, Time elapsed: 0.527 sec
Running org.apache.solr.core.TestPropInjectDefaults
Creating dataDir: /usr/home/hudson/hudson-slave/workspace/Lucene-Solr-Maven-4.x/maven-build/solr/core/target/test/./solrtest-TestPropInjectDefaults-1346553453276
Tests run: 2, Failures: 0, Errors: 0, Skipped: 0, Time elapsed: 0.402 sec
Running org.apache.solr.search.TestLRUCache
Tests run: 3, Failures: 0, Errors: 0, Skipped: 0, Time elapsed: 0.031 sec
Running org.apache.solr.core.SolrCoreTest
Creating dataDir: /usr/home/hudson/hudson-slave/workspace/Lucene-Solr-Maven-4.x/maven-build/solr/core/target/test/./solrtest-SolrCoreTest-1346553453713
Creating dataDir: /usr/home/hudson/hudson-slave/workspace/Lucene-Solr-Maven-4.x/maven-build/solr/core/target/test/./solrtest-SolrCoreTest-1346553455201
Creating dataDir: /usr/home/hudson/hudson-slave/workspace/Lucene-Solr-Maven-4.x/maven-build/solr/core/target/test/./solrtest-SolrCoreTest-1346553455677
Creating dataDir: /usr/home/hudson/hudson-slave/workspace/Lucene-Solr-Maven-4.x/maven-build/solr/core/target/test/./solrtest-SolrCoreTest-1346553456145
Creating dataDir: /usr/home/hudson/hudson-slave/workspace/Lucene-Solr-Maven-4.x/maven-build/solr/core/target/test/./solrtest-SolrCoreTest-1346553456602
Creating dataDir: /usr/home/hudson/hudson-slave/workspace/Lucene-Solr-Maven-4.x/maven-build/solr/core/target/test/./solrtest-SolrCoreTest-1346553457069
Tests run: 6, Failures: 0, Errors: 0, Skipped: 0, Time elapsed: 3.946 sec
Running org.apache.solr.analysis.TestReversedWildcardFilterFactory
Creating dataDir: /usr/home/hudson/hudson-slave/workspace/Lucene-Solr-Maven-4.x/maven-build/solr/core/target/test/./solrtest-TestReversedWildcardFilterFactory-1346553457663
Tests run: 4, Failures: 0, Errors: 0, Skipped: 0, Time elapsed: 0.399 sec
Running org.apache.solr.spelling.suggest.TestPhraseSuggestions
Creating dataDir: /usr/home/hudson/hudson-slave/workspace/Lucene-Solr-Maven-4.x/maven-build/solr/core/target/test/./solrtest-TestPhraseSuggestions-1346553458056
Tests run: 1, Failures: 0, Errors: 0, Skipped: 0, Time elapsed: 0.118 sec
Running org.apache.solr.search.QueryEqualityTest
Creating dataDir: /usr/home/hudson/hudson-slave/workspace/Lucene-Solr-Maven-4.x/maven-build/solr/core/target/test/./solrtest-QueryEqualityTest-1346553458181
Tests run: 60, Failures: 0, Errors: 0, Skipped: 0, Time elapsed: 0.722 sec
Running org.apache.solr.search.TestIndexSearcher
Creating dataDir: /usr/home/hudson/hudson-slave/workspace/Lucene-Solr-Maven-4.x/maven-build/solr/core/target/test/./solrtest-TestIndexSearcher-1346553458897
Tests run: 2, Failures: 0, Errors: 0, Skipped: 0, Time elapsed: 1.101 sec
Running org.apache.solr.cloud.FullSolrCloudDistribCmdsTest
Creating dataDir: /usr/home/hudson/hudson-slave/workspace/Lucene-Solr-Maven-4.x/maven-build/solr/core/target/test/./solrtest-FullSolrCloudDistribCmdsTest-1346553460011
ASYNC  NEW_CORE C6 name=collection1 org.apache.solr.core.SolrCore@73c3c8ff url=http://127.0.0.1:31468/solr/collection1 node=127.0.0.1:31468_solr
20861 T2267 C6 P31468 oasc.SolrException.log SEVERE java.lang.RuntimeException: No registered leader was found, collection:collection1 slice:shard1
		at org.apache.solr.common.cloud.ZkStateReader.getLeaderProps(ZkStateReader.java:413)
		at org.apache.solr.common.cloud.ZkStateReader.getLeaderProps(ZkStateReader.java:399)
		at org.apache.solr.update.processor.DistributedUpdateProcessor.setupRequest(DistributedUpdateProcessor.java:189)
		at org.apache.solr.update.processor.DistributedUpdateProcessor.processAdd(DistributedUpdateProcessor.java:333)
		at org.apache.solr.handler.loader.XMLLoader.processUpdate(XMLLoader.java:230)
		at org.apache.solr.handler.loader.XMLLoader.load(XMLLoader.java:157)
		at org.apache.solr.handler.UpdateRequestHandler$1.load(UpdateRequestHandler.java:92)
		at org.apache.solr.handler.ContentStreamHandlerBase.handleRequestBody(ContentStreamHandlerBase.java:74)
		at org.apache.solr.handler.RequestHandlerBase.handleRequest(RequestHandlerBase.java:129)
		at org.apache.solr.core.SolrCore.execute(SolrCore.java:1692)
		at org.apache.solr.servlet.SolrDispatchFilter.execute(SolrDispatchFilter.java:454)
		at org.apache.solr.servlet.SolrDispatchFilter.doFilter(SolrDispatchFilter.java:275)
		at org.eclipse.jetty.servlet.ServletHandler$CachedChain.doFilter(ServletHandler.java:1337)
		at org.eclipse.jetty.servlet.ServletHandler.doHandle(ServletHandler.java:484)
		at org.eclipse.jetty.server.session.SessionHandler.doHandle(SessionHandler.java:231)
		at org.eclipse.jetty.server.handler.ScopedHandler.handle(ScopedHandler.java:119)
		at org.eclipse.jetty.server.handler.GzipHandler.handle(GzipHandler.java:267)
		at org.eclipse.jetty.server.handler.ContextHandler.doHandle(ContextHandler.java:1067)
		at org.eclipse.jetty.servlet.ServletHandler.doScope(ServletHandler.java:413)
		at org.eclipse.jetty.server.session.SessionHandler.doScope(SessionHandler.java:192)
		at org.eclipse.jetty.server.handler.ContextHandler.doScope(ContextHandler.java:999)
		at org.eclipse.jetty.server.handler.ScopedHandler.handle(ScopedHandler.java:117)
		at org.eclipse.jetty.server.handler.HandlerWrapper.handle(HandlerWrapper.java:111)
		at org.eclipse.jetty.server.Server.handle(Server.java:351)
		at org.eclipse.jetty.server.AbstractHttpConnection.handleRequest(AbstractHttpConnection.java:454)
		at org.eclipse.jetty.server.BlockingHttpConnection.handleRequest(BlockingHttpConnection.java:47)
		at org.eclipse.jetty.server.AbstractHttpConnection.content(AbstractHttpConnection.java:900)
		at org.eclipse.jetty.server.AbstractHttpConnection$RequestHandler.content(AbstractHttpConnection.java:954)
		at org.eclipse.jetty.http.HttpParser.parseNext(HttpParser.java:952)
		at org.eclipse.jetty.http.HttpParser.parseAvailable(HttpParser.java:235)
		at org.eclipse.jetty.server.BlockingHttpConnection.handle(BlockingHttpConnection.java:66)
		at org.eclipse.jetty.server.bio.SocketConnector$ConnectorEndPoint.run(SocketConnector.java:254)
		at org.eclipse.jetty.util.thread.QueuedThreadPool.runJob(QueuedThreadPool.java:599)
		at org.eclipse.jetty.util.thread.QueuedThreadPool$3.run(QueuedThreadPool.java:534)
		at java.lang.Thread.run(Thread.java:679)
	
20864 T2267 C6 P31468 oasc.SolrException.log SEVERE null:java.lang.RuntimeException: No registered leader was found, collection:collection1 slice:shard1
		at org.apache.solr.common.cloud.ZkStateReader.getLeaderProps(ZkStateReader.java:413)
		at org.apache.solr.common.cloud.ZkStateReader.getLeaderProps(ZkStateReader.java:399)
		at org.apache.solr.update.processor.DistributedUpdateProcessor.setupRequest(DistributedUpdateProcessor.java:189)
		at org.apache.solr.update.processor.DistributedUpdateProcessor.processAdd(DistributedUpdateProcessor.java:333)
		at org.apache.solr.handler.loader.XMLLoader.processUpdate(XMLLoader.java:230)
		at org.apache.solr.handler.loader.XMLLoader.load(XMLLoader.java:157)
		at org.apache.solr.handler.UpdateRequestHandler$1.load(UpdateRequestHandler.java:92)
		at org.apache.solr.handler.ContentStreamHandlerBase.handleRequestBody(ContentStreamHandlerBase.java:74)
		at org.apache.solr.handler.RequestHandlerBase.handleRequest(RequestHandlerBase.java:129)
		at org.apache.solr.core.SolrCore.execute(SolrCore.java:1692)
		at org.apache.solr.servlet.SolrDispatchFilter.execute(SolrDispatchFilter.java:454)
		at org.apache.solr.servlet.SolrDispatchFilter.doFilter(SolrDispatchFilter.java:275)
		at org.eclipse.jetty.servlet.ServletHandler$CachedChain.doFilter(ServletHandler.java:1337)
		at org.eclipse.jetty.servlet.ServletHandler.doHandle(ServletHandler.java:484)
		at org.eclipse.jetty.server.session.SessionHandler.doHandle(SessionHandler.java:231)
		at org.eclipse.jetty.server.handler.ScopedHandler.handle(ScopedHandler.java:119)
		at org.eclipse.jetty.server.handler.GzipHandler.handle(GzipHandler.java:267)
		at org.eclipse.jetty.server.handler.ContextHandler.doHandle(ContextHandler.java:1067)
		at org.eclipse.jetty.servlet.ServletHandler.doScope(ServletHandler.java:413)
		at org.eclipse.jetty.server.session.SessionHandler.doScope(SessionHandler.java:192)
		at org.eclipse.jetty.server.handler.ContextHandler.doScope(ContextHandler.java:999)
		at org.eclipse.jetty.server.handler.ScopedHandler.handle(ScopedHandler.java:117)
		at org.eclipse.jetty.server.handler.HandlerWrapper.handle(HandlerWrapper.java:111)
		at org.eclipse.jetty.server.Server.handle(Server.java:351)
		at org.eclipse.jetty.server.AbstractHttpConnection.handleRequest(AbstractHttpConnection.java:454)
		at org.eclipse.jetty.server.BlockingHttpConnection.handleRequest(BlockingHttpConnection.java:47)
		at org.eclipse.jetty.server.AbstractHttpConnection.content(AbstractHttpConnection.java:900)
		at org.eclipse.jetty.server.AbstractHttpConnection$RequestHandler.content(AbstractHttpConnection.java:954)
		at org.eclipse.jetty.http.HttpParser.parseNext(HttpParser.java:952)
		at org.eclipse.jetty.http.HttpParser.parseAvailable(HttpParser.java:235)
		at org.eclipse.jetty.server.BlockingHttpConnection.handle(BlockingHttpConnection.java:66)
		at org.eclipse.jetty.server.bio.SocketConnector$ConnectorEndPoint.run(SocketConnector.java:254)
		at org.eclipse.jetty.util.thread.QueuedThreadPool.runJob(QueuedThreadPool.java:599)
		at org.eclipse.jetty.util.thread.QueuedThreadPool$3.run(QueuedThreadPool.java:534)
		at java.lang.Thread.run(Thread.java:679)
	
ASYNC  NEW_CORE C7 name=collection1 org.apache.solr.core.SolrCore@19302bd0 url=http://127.0.0.1:31473/solr/collection1 node=127.0.0.1:31473_solr
21887 T2290 C7 P31473 oasc.SolrException.log SEVERE java.lang.RuntimeException: No registered leader was found, collection:collection1 slice:shard1
		at org.apache.solr.common.cloud.ZkStateReader.getLeaderProps(ZkStateReader.java:413)
		at org.apache.solr.common.cloud.ZkStateReader.getLeaderProps(ZkStateReader.java:399)
		at org.apache.solr.update.processor.DistributedUpdateProcessor.setupRequest(DistributedUpdateProcessor.java:189)
		at org.apache.solr.update.processor.DistributedUpdateProcessor.processAdd(DistributedUpdateProcessor.java:333)
		at org.apache.solr.handler.loader.XMLLoader.processUpdate(XMLLoader.java:230)
		at org.apache.solr.handler.loader.XMLLoader.load(XMLLoader.java:157)
		at org.apache.solr.handler.UpdateRequestHandler$1.load(UpdateRequestHandler.java:92)
		at org.apache.solr.handler.ContentStreamHandlerBase.handleRequestBody(ContentStreamHandlerBase.java:74)
		at org.apache.solr.handler.RequestHandlerBase.handleRequest(RequestHandlerBase.java:129)
		at org.apache.solr.core.SolrCore.execute(SolrCore.java:1692)
		at org.apache.solr.servlet.SolrDispatchFilter.execute(SolrDispatchFilter.java:454)
		at org.apache.solr.servlet.SolrDispatchFilter.doFilter(SolrDispatchFilter.java:275)
		at org.eclipse.jetty.servlet.ServletHandler$CachedChain.doFilter(ServletHandler.java:1337)
		at org.eclipse.jetty.servlet.ServletHandler.doHandle(ServletHandler.java:484)
		at org.eclipse.jetty.server.session.SessionHandler.doHandle(SessionHandler.java:231)
		at org.eclipse.jetty.server.handler.ScopedHandler.handle(ScopedHandler.java:119)
		at org.eclipse.jetty.server.handler.GzipHandler.handle(GzipHandler.java:267)
		at org.eclipse.jetty.server.handler.ContextHandler.doHandle(ContextHandler.java:1067)
		at org.eclipse.jetty.servlet.ServletHandler.doScope(ServletHandler.java:413)
		at org.eclipse.jetty.server.session.SessionHandler.doScope(SessionHandler.java:192)
		at org.eclipse.jetty.server.handler.ContextHandler.doScope(ContextHandler.java:999)
		at org.eclipse.jetty.server.handler.ScopedHandler.handle(ScopedHandler.java:117)
		at org.eclipse.jetty.server.handler.HandlerWrapper.handle(HandlerWrapper.java:111)
		at org.eclipse.jetty.server.Server.handle(Server.java:351)
		at org.eclipse.jetty.server.AbstractHttpConnection.handleRequest(AbstractHttpConnection.java:454)
		at org.eclipse.jetty.server.BlockingHttpConnection.handleRequest(BlockingHttpConnection.java:47)
		at org.eclipse.jetty.server.AbstractHttpConnection.content(AbstractHttpConnection.java:900)
		at org.eclipse.jetty.server.AbstractHttpConnection$RequestHandler.content(AbstractHttpConnection.java:954)
		at org.eclipse.jetty.http.HttpParser.parseNext(HttpParser.java:952)
		at org.eclipse.jetty.http.HttpParser.parseAvailable(HttpParser.java:235)
		at org.eclipse.jetty.server.BlockingHttpConnection.handle(BlockingHttpConnection.java:66)
		at org.eclipse.jetty.server.bio.SocketConnector$ConnectorEndPoint.run(SocketConnector.java:254)
		at org.eclipse.jetty.util.thread.QueuedThreadPool.runJob(QueuedThreadPool.java:599)
		at org.eclipse.jetty.util.thread.QueuedThreadPool$3.run(QueuedThreadPool.java:534)
		at java.lang.Thread.run(Thread.java:679)
	
21892 T2290 C7 P31473 oasc.SolrException.log SEVERE null:java.lang.RuntimeException: No registered leader was found, collection:collection1 slice:shard1
		at org.apache.solr.common.cloud.ZkStateReader.getLeaderProps(ZkStateReader.java:413)
		at org.apache.solr.common.cloud.ZkStateReader.getLeaderProps(ZkStateReader.java:399)
		at org.apache.solr.update.processor.DistributedUpdateProcessor.setupRequest(DistributedUpdateProcessor.java:189)
		at org.apache.solr.update.processor.DistributedUpdateProcessor.processAdd(DistributedUpdateProcessor.java:333)
		at org.apache.solr.handler.loader.XMLLoader.processUpdate(XMLLoader.java:230)
		at org.apache.solr.handler.loader.XMLLoader.load(XMLLoader.java:157)
		at org.apache.solr.handler.UpdateRequestHandler$1.load(UpdateRequestHandler.java:92)
		at org.apache.solr.handler.ContentStreamHandlerBase.handleRequestBody(ContentStreamHandlerBase.java:74)
		at org.apache.solr.handler.RequestHandlerBase.handleRequest(RequestHandlerBase.java:129)
		at org.apache.solr.core.SolrCore.execute(SolrCore.java:1692)
		at org.apache.solr.servlet.SolrDispatchFilter.execute(SolrDispatchFilter.java:454)
		at org.apache.solr.servlet.SolrDispatchFilter.doFilter(SolrDispatchFilter.java:275)
		at org.eclipse.jetty.servlet.ServletHandler$CachedChain.doFilter(ServletHandler.java:1337)
		at org.eclipse.jetty.servlet.ServletHandler.doHandle(ServletHandler.java:484)
		at org.eclipse.jetty.server.session.SessionHandler.doHandle(SessionHandler.java:231)
		at org.eclipse.jetty.server.handler.ScopedHandler.handle(ScopedHandler.java:119)
		at org.eclipse.jetty.server.handler.GzipHandler.handle(GzipHandler.java:267)
		at org.eclipse.jetty.server.handler.ContextHandler.doHandle(ContextHandler.java:1067)
		at org.eclipse.jetty.servlet.ServletHandler.doScope(ServletHandler.java:413)
		at org.eclipse.jetty.server.session.SessionHandler.doScope(SessionHandler.java:192)
		at org.eclipse.jetty.server.handler.ContextHandler.doScope(ContextHandler.java:999)
		at org.eclipse.jetty.server.handler.ScopedHandler.handle(ScopedHandler.java:117)
		at org.eclipse.jetty.server.handler.HandlerWrapper.handle(HandlerWrapper.java:111)
		at org.eclipse.jetty.server.Server.handle(Server.java:351)
		at org.eclipse.jetty.server.AbstractHttpConnection.handleRequest(AbstractHttpConnection.java:454)
		at org.eclipse.jetty.server.BlockingHttpConnection.handleRequest(BlockingHttpConnection.java:47)
		at org.eclipse.jetty.server.AbstractHttpConnection.content(AbstractHttpConnection.java:900)
		at org.eclipse.jetty.server.AbstractHttpConnection$RequestHandler.content(AbstractHttpConnection.java:954)
		at org.eclipse.jetty.http.HttpParser.parseNext(HttpParser.java:952)
		at org.eclipse.jetty.http.HttpParser.parseAvailable(HttpParser.java:235)
		at org.eclipse.jetty.server.BlockingHttpConnection.handle(BlockingHttpConnection.java:66)
		at org.eclipse.jetty.server.bio.SocketConnector$ConnectorEndPoint.run(SocketConnector.java:254)
		at org.eclipse.jetty.util.thread.QueuedThreadPool.runJob(QueuedThreadPool.java:599)
		at org.eclipse.jetty.util.thread.QueuedThreadPool$3.run(QueuedThreadPool.java:534)
		at java.lang.Thread.run(Thread.java:679)
	
Tests run: 1, Failures: 0, Errors: 0, Skipped: 0, Time elapsed: 23.252 sec
Running org.apache.solr.analysis.TestWordDelimiterFilterFactory
Creating dataDir: /usr/home/hudson/hudson-slave/workspace/Lucene-Solr-Maven-4.x/maven-build/solr/core/target/test/./solrtest-TestWordDelimiterFilterFactory-1346553483258
Tests run: 7, Failures: 0, Errors: 0, Skipped: 0, Time elapsed: 0.79 sec
Running org.apache.solr.update.PeerSyncTest
Tests run: 1, Failures: 0, Errors: 0, Skipped: 0, Time elapsed: 2.609 sec
Running org.apache.solr.schema.RequiredFieldsTest
Creating dataDir: /usr/home/hudson/hudson-slave/workspace/Lucene-Solr-Maven-4.x/maven-build/solr/core/target/test/./solrtest-RequiredFieldsTest-1346553486655
Tests run: 3, Failures: 0, Errors: 0, Skipped: 0, Time elapsed: 0.482 sec
Running org.apache.solr.TestRandomFaceting
Creating dataDir: /usr/home/hudson/hudson-slave/workspace/Lucene-Solr-Maven-4.x/maven-build/solr/core/target/test/./solrtest-TestRandomFaceting-1346553487138
Tests run: 1, Failures: 0, Errors: 0, Skipped: 0, Time elapsed: 12.064 sec
Running org.apache.solr.search.TestStressReorder
Creating dataDir: /usr/home/hudson/hudson-slave/workspace/Lucene-Solr-Maven-4.x/maven-build/solr/core/target/test/./solrtest-TestStressReorder-1346553499204
Tests run: 1, Failures: 0, Errors: 0, Skipped: 0, Time elapsed: 2.928 sec
Running org.apache.solr.util.SolrPluginUtilsTest
Creating dataDir: /usr/home/hudson/hudson-slave/workspace/Lucene-Solr-Maven-4.x/maven-build/solr/core/target/test/./solrtest-SolrPluginUtilsTest-1346553502128
Tests run: 7, Failures: 0, Errors: 0, Skipped: 0, Time elapsed: 0.394 sec
Running org.apache.solr.cloud.SyncSliceTest
Creating dataDir: /usr/home/hudson/hudson-slave/workspace/Lucene-Solr-Maven-4.x/maven-build/solr/core/target/test/./solrtest-SyncSliceTest-1346553502529
check const of shard1
client0
PROPS:shard=shard1
leader=true
roles=null
state=active
core=collection1
collection=collection1
node_name=127.0.0.1:31527_solr
base_url=http://127.0.0.1:31527/solr

 live:true
 num:4

client1
PROPS:shard=shard1
roles=null
state=active
core=collection1
collection=collection1
node_name=127.0.0.1:31529_solr
base_url=http://127.0.0.1:31529/solr

 live:true
 num:2

######shard1 is not consistent.  Got 4 from http://127.0.0.1:31527/solr/collection1lastClient and got 2 from http://127.0.0.1:31529/solr/collection1
######http://127.0.0.1:31527/solr/collection1: {numFound=4,start=0,docs=[SolrDocument{id=0, _version_=1411963704913690624}, SolrDocument{id=1, _version_=1411963704924176384}, SolrDocument{id=2, _version_=1411963704934662144}, SolrDocument{id=3, _version_=1411963704945147904}]}
######http://127.0.0.1:31529/solr/collection1: {numFound=2,start=0,docs=[SolrDocument{id=0, _version_=1411963704913690624}, SolrDocument{id=1, _version_=1411963704924176384}]}
###### sizes=4,2
###### Only in http://127.0.0.1:31527/solr/collection1: [{id=2, _version_=1411963704934662144}, {id=3, _version_=1411963704945147904}]
client2
PROPS:shard=shard1
roles=null
state=active
core=collection1
collection=collection1
node_name=127.0.0.1:31532_solr
base_url=http://127.0.0.1:31532/solr

 live:true
 num:3

client3
PROPS:shard=shard1
roles=null
state=active
core=collection1
collection=collection1
node_name=127.0.0.1:31535_solr
base_url=http://127.0.0.1:31535/solr

 live:true
 num:4

Control Docs:4
check const of shard1
client0
PROPS:shard=shard1
leader=true
roles=null
state=active
core=collection1
collection=collection1
node_name=127.0.0.1:31527_solr
base_url=http://127.0.0.1:31527/solr

 live:true
 num:4

client1
PROPS:shard=shard1
roles=null
state=active
core=collection1
collection=collection1
node_name=127.0.0.1:31529_solr
base_url=http://127.0.0.1:31529/solr

 live:true
 num:4

client2
PROPS:shard=shard1
roles=null
state=active
core=collection1
collection=collection1
node_name=127.0.0.1:31532_solr
base_url=http://127.0.0.1:31532/solr

 live:true
 num:4

client3
PROPS:shard=shard1
roles=null
state=active
core=collection1
collection=collection1
node_name=127.0.0.1:31535_solr
base_url=http://127.0.0.1:31535/solr

 live:true
 num:4

Control Docs:5
check const of shard1
client0
PROPS:shard=shard1
roles=null
state=active
core=collection1
collection=collection1
node_name=127.0.0.1:31527_solr
base_url=http://127.0.0.1:31527/solr

error contacting client: IOException occured when talking to server at: http://localhost:31527/solr/collection1

client1
PROPS:shard=shard1
roles=null
leader=true
state=active
core=collection1
collection=collection1
node_name=127.0.0.1:31529_solr
base_url=http://127.0.0.1:31529/solr

 live:true
 num:5

client2
PROPS:shard=shard1
roles=null
state=active
core=collection1
collection=collection1
node_name=127.0.0.1:31532_solr
base_url=http://127.0.0.1:31532/solr

 live:true
 num:5

client3
PROPS:shard=shard1
roles=null
state=active
core=collection1
collection=collection1
node_name=127.0.0.1:31535_solr
base_url=http://127.0.0.1:31535/solr

 live:true
 num:5

check const of shard1
client0
PROPS:shard=shard1
roles=null
state=active
core=collection1
collection=collection1
node_name=127.0.0.1:31527_solr
base_url=http://127.0.0.1:31527/solr

 live:true
 num:305

client1
PROPS:shard=shard1
leader=true
roles=null
state=active
core=collection1
collection=collection1
node_name=127.0.0.1:31529_solr
base_url=http://127.0.0.1:31529/solr

 live:true
 num:305

client2
PROPS:shard=shard1
roles=null
state=active
core=collection1
collection=collection1
node_name=127.0.0.1:31532_solr
base_url=http://127.0.0.1:31532/solr

 live:true
 num:305

client3
PROPS:shard=shard1
roles=null
state=active
core=collection1
collection=collection1
node_name=127.0.0.1:31535_solr
base_url=http://127.0.0.1:31535/solr

 live:true
 num:5

######shard1 is not consistent.  Got 305 from http://127.0.0.1:31532/solr/collection1lastClient and got 5 from http://127.0.0.1:31535/solr/collection1
######http://127.0.0.1:31532/solr/collection1: {numFound=305,start=0,docs=[SolrDocument{id=0, _version_=1411963704913690624}, SolrDocument{id=1, _version_=1411963704924176384}, SolrDocument{id=2, _version_=1411963704934662144}, SolrDocument{id=3, _version_=1411963704945147904}, SolrDocument{id=4, _version_=1411963707646279680}, SolrDocument{id=5, _version_=1411963728615702528}, SolrDocument{id=6, _version_=1411963728627236864}, SolrDocument{id=7, _version_=1411963728636674048}, SolrDocument{id=8, _version_=1411963728646111232}, SolrDocument{id=9, _version_=1411963728655548416}, SolrDocument{id=10, _version_=1411963728664985600}, SolrDocument{id=11, _version_=1411963728674422784}, SolrDocument{id=12, _version_=1411963728683859968}, SolrDocument{id=13, _version_=1411963728693297152}, SolrDocument{id=14, _version_=1411963728705880064}, SolrDocument{id=15, _version_=1411963728722657280}, SolrDocument{id=16, _version_=1411963728733143040}, SolrDocument{id=17, _version_=1411963728742580224}, SolrDocument{id=18, _version_=1411963728752017408}, SolrDocument{id=19, _version_=1411963728761454592}, SolrDocument{id=20, _version_=1411963728770891776}, SolrDocument{id=21, _version_=1411963728780328960}, SolrDocument{id=22, _version_=1411963728789766144}, SolrDocument{id=23, _version_=1411963728799203328}, SolrDocument{id=24, _version_=1411963728811786240}, SolrDocument{id=25, _version_=1411963728828563456}, SolrDocument{id=26, _version_=1411963728839049216}, SolrDocument{id=27, _version_=1411963728848486400}, SolrDocument{id=28, _version_=1411963728857923584}, SolrDocument{id=29, _version_=1411963728867360768}, SolrDocument{id=30, _version_=1411963728877846528}, SolrDocument{id=31, _version_=1411963728887283712}, SolrDocument{id=32, _version_=1411963728896720896}, SolrDocument{id=33, _version_=1411963728907206656}, SolrDocument{id=34, _version_=1411963728919789568}, SolrDocument{id=35, _version_=1411963728936566784}, SolrDocument{id=36, _version_=1411963728947052544}, SolrDocument{id=37, _version_=1411963728956489728}, SolrDocument{id=38, _version_=1411963728965926912}, SolrDocument{id=39, _version_=1411963728975364096}, SolrDocument{id=40, _version_=1411963728984801280}, SolrDocument{id=41, _version_=1411963728994238464}, SolrDocument{id=42, _version_=1411963729003675648}, SolrDocument{id=43, _version_=1411963729013112832}, SolrDocument{id=44, _version_=1411963729025695744}, SolrDocument{id=45, _version_=1411963729043521536}, SolrDocument{id=46, _version_=1411963729054007296}, SolrDocument{id=47, _version_=1411963729063444480}, SolrDocument{id=48, _version_=1411963729072881664}, SolrDocument{id=49, _version_=1411963729082318848}, SolrDocument{id=50, _version_=1411963729091756032}, SolrDocument{id=51, _version_=1411963729101193216}, SolrDocument{id=52, _version_=1411963729110630400}, SolrDocument{id=53, _version_=1411963729120067584}, SolrDocument{id=54, _version_=1411963729132650496}, SolrDocument{id=55, _version_=1411963729165156352}, SolrDocument{id=56, _version_=1411963729175642112}, SolrDocument{id=57, _version_=1411963729185079296}, SolrDocument{id=58, _version_=1411963729194516480}, SolrDocument{id=59, _version_=1411963729203953664}, SolrDocument{id=60, _version_=1411963729213390848}, SolrDocument{id=61, _version_=1411963729222828032}, SolrDocument{id=62, _version_=1411963729232265216}, SolrDocument{id=63, _version_=1411963729241702400}, SolrDocument{id=64, _version_=1411963729260576768}, SolrDocument{id=65, _version_=1411963729290985472}, SolrDocument{id=66, _version_=1411963729301471232}, SolrDocument{id=67, _version_=1411963729310908416}, SolrDocument{id=68, _version_=1411963729321394176}, SolrDocument{id=69, _version_=1411963729331879936}, SolrDocument{id=70, _version_=1411963729341317120}, SolrDocument{id=71, _version_=1411963729351802880}, SolrDocument{id=72, _version_=1411963729362288640}, SolrDocument{id=73, _version_=1411963729372774400}, SolrDocument{id=74, _version_=1411963729385357312}, SolrDocument{id=75, _version_=1411963729402134528}, SolrDocument{id=76, _version_=1411963729412620288}, SolrDocument{id=77, _version_=1411963729422057472}, SolrDocument{id=78, _version_=1411963729432543232}, SolrDocument{id=79, _version_=1411963729441980416}, SolrDocument{id=80, _version_=1411963729451417600}, SolrDocument{id=81, _version_=1411963729460854784}, SolrDocument{id=82, _version_=1411963729470291968}, SolrDocument{id=83, _version_=1411963729479729152}, SolrDocument{id=84, _version_=1411963729492312064}, SolrDocument{id=85, _version_=1411963729508040704}, SolrDocument{id=86, _version_=1411963729518526464}, SolrDocument{id=87, _version_=1411963729527963648}, SolrDocument{id=88, _version_=1411963729537400832}, SolrDocument{id=89, _version_=1411963729546838016}, SolrDocument{id=90, _version_=1411963729556275200}, SolrDocument{id=91, _version_=1411963729566760960}, SolrDocument{id=92, _version_=1411963729577246720}, SolrDocument{id=93, _version_=1411963729586683904}, SolrDocument{id=94, _version_=1411963729599266816}, SolrDocument{id=95, _version_=1411963729613946880}, SolrDocument{id=96, _version_=1411963729624432640}, SolrDocument{id=97, _version_=1411963729633869824}, SolrDocument{id=98, _version_=1411963729643307008}, SolrDocument{id=99, _version_=1411963729653792768}, SolrDocument{id=100, _version_=1411963729663229952}, SolrDocument{id=101, _version_=1411963729672667136}, SolrDocument{id=102, _version_=1411963729682104320}, SolrDocument{id=103, _version_=1411963729691541504}, SolrDocument{id=104, _version_=1411963729706221568}, SolrDocument{id=105, _version_=1411963729726144512}, SolrDocument{id=106, _version_=1411963729736630272}, SolrDocument{id=107, _version_=1411963729746067456}, SolrDocument{id=108, _version_=1411963729755504640}, SolrDocument{id=109, _version_=1411963729764941824}, SolrDocument{id=110, _version_=1411963729774379008}, SolrDocument{id=111, _version_=1411963729783816192}, SolrDocument{id=112, _version_=1411963729793253376}, SolrDocument{id=113, _version_=1411963729802690560}, SolrDocument{id=114, _version_=1411963729815273472}, SolrDocument{id=115, _version_=1411963729832050688}, SolrDocument{id=116, _version_=1411963729843585024}, SolrDocument{id=117, _version_=1411963729853022208}, SolrDocument{id=118, _version_=1411963729862459392}, SolrDocument{id=119, _version_=1411963729871896576}, SolrDocument{id=120, _version_=1411963729881333760}, SolrDocument{id=121, _version_=1411963729890770944}, SolrDocument{id=122, _version_=1411963729900208128}, SolrDocument{id=123, _version_=1411963729909645312}, SolrDocument{id=124, _version_=1411963729922228224}, SolrDocument{id=125, _version_=1411963729949491200}, SolrDocument{id=126, _version_=1411963729959976960}, SolrDocument{id=127, _version_=1411963729970462720}, SolrDocument{id=128, _version_=1411963729979899904}, SolrDocument{id=129, _version_=1411963729989337088}, SolrDocument{id=130, _version_=1411963729998774272}, SolrDocument{id=131, _version_=1411963730008211456}, SolrDocument{id=132, _version_=1411963730017648640}, SolrDocument{id=133, _version_=1411963730027085824}, SolrDocument{id=134, _version_=1411963730044911616}, SolrDocument{id=135, _version_=1411963730069028864}, SolrDocument{id=136, _version_=1411963730079514624}, SolrDocument{id=137, _version_=1411963730088951808}, SolrDocument{id=138, _version_=1411963730099437568}, SolrDocument{id=139, _version_=1411963730108874752}, SolrDocument{id=140, _version_=1411963730118311936}, SolrDocument{id=141, _version_=1411963730127749120}, SolrDocument{id=142, _version_=1411963730137186304}, SolrDocument{id=143, _version_=1411963730147672064}, SolrDocument{id=144, _version_=1411963730161303552}, SolrDocument{id=145, _version_=1411963730179129344}, SolrDocument{id=146, _version_=1411963730189615104}, SolrDocument{id=147, _version_=1411963730199052288}, SolrDocument{id=148, _version_=1411963730208489472}, SolrDocument{id=149, _version_=1411963730217926656}, SolrDocument{id=150, _version_=1411963730227363840}, SolrDocument{id=151, _version_=1411963730236801024}, SolrDocument{id=152, _version_=1411963730246238208}, SolrDocument{id=153, _version_=1411963730255675392}, SolrDocument{id=154, _version_=1411963730268258304}, SolrDocument{id=155, _version_=1411963730282938368}, SolrDocument{id=156, _version_=1411963730292375552}, SolrDocument{id=157, _version_=1411963730301812736}, SolrDocument{id=158, _version_=1411963730311249920}, SolrDocument{id=159, _version_=1411963730320687104}, SolrDocument{id=160, _version_=1411963730330124288}, SolrDocument{id=161, _version_=1411963730339561472}, SolrDocument{id=162, _version_=1411963730348998656}, SolrDocument{id=163, _version_=1411963730358435840}, SolrDocument{id=164, _version_=1411963730371018752}, SolrDocument{id=165, _version_=1411963730386747392}, SolrDocument{id=166, _version_=1411963730397233152}, SolrDocument{id=167, _version_=1411963730406670336}, SolrDocument{id=168, _version_=1411963730416107520}, SolrDocument{id=169, _version_=1411963730425544704}, SolrDocument{id=170, _version_=1411963730434981888}, SolrDocument{id=171, _version_=1411963730444419072}, SolrDocument{id=172, _version_=1411963730453856256}, SolrDocument{id=173, _version_=1411963730463293440}, SolrDocument{id=174, _version_=1411963730475876352}, SolrDocument{id=175, _version_=1411963730491604992}, SolrDocument{id=176, _version_=1411963730501042176}, SolrDocument{id=177, _version_=1411963730510479360}, SolrDocument{id=178, _version_=1411963730519916544}, SolrDocument{id=179, _version_=1411963730529353728}, SolrDocument{id=180, _version_=1411963730538790912}, SolrDocument{id=181, _version_=1411963730548228096}, SolrDocument{id=182, _version_=1411963730557665280}, SolrDocument{id=183, _version_=1411963730567102464}, SolrDocument{id=184, _version_=1411963730578636800}, SolrDocument{id=185, _version_=1411963730594365440}, SolrDocument{id=186, _version_=1411963730603802624}, SolrDocument{id=187, _version_=1411963730613239808}, SolrDocument{id=188, _version_=1411963730622676992}, SolrDocument{id=189, _version_=1411963730632114176}, SolrDocument{id=190, _version_=1411963730641551360}, SolrDocument{id=191, _version_=1411963730650988544}, SolrDocument{id=192, _version_=1411963730660425728}, SolrDocument{id=193, _version_=1411963730669862912}, SolrDocument{id=194, _version_=1411963730682445824}, SolrDocument{id=195, _version_=1411963730709708800}, SolrDocument{id=196, _version_=1411963730720194560}, SolrDocument{id=197, _version_=1411963730729631744}, SolrDocument{id=198, _version_=1411963730739068928}, SolrDocument{id=199, _version_=1411963730748506112}, SolrDocument{id=200, _version_=1411963730757943296}, SolrDocument{id=201, _version_=1411963730767380480}, SolrDocument{id=202, _version_=1411963730777866240}, SolrDocument{id=203, _version_=1411963730787303424}, SolrDocument{id=204, _version_=1411963730805129216}, SolrDocument{id=205, _version_=1411963730825052160}, SolrDocument{id=206, _version_=1411963730835537920}, SolrDocument{id=207, _version_=1411963730844975104}, SolrDocument{id=208, _version_=1411963730854412288}, SolrDocument{id=209, _version_=1411963730863849472}, SolrDocument{id=210, _version_=1411963730873286656}, SolrDocument{id=211, _version_=1411963730882723840}, SolrDocument{id=212, _version_=1411963730892161024}, SolrDocument{id=213, _version_=1411963730901598208}, SolrDocument{id=214, _version_=1411963730914181120}, SolrDocument{id=215, _version_=1411963730928861184}, SolrDocument{id=216, _version_=1411963730938298368}, SolrDocument{id=217, _version_=1411963730947735552}, SolrDocument{id=218, _version_=1411963730957172736}, SolrDocument{id=219, _version_=1411963730966609920}, SolrDocument{id=220, _version_=1411963730976047104}, SolrDocument{id=221, _version_=1411963730985484288}, SolrDocument{id=222, _version_=1411963730994921472}, SolrDocument{id=223, _version_=1411963731004358656}, SolrDocument{id=224, _version_=1411963731016941568}, SolrDocument{id=225, _version_=1411963731032670208}, SolrDocument{id=226, _version_=1411963731042107392}, SolrDocument{id=227, _version_=1411963731051544576}, SolrDocument{id=228, _version_=1411963731060981760}, SolrDocument{id=229, _version_=1411963731070418944}, SolrDocument{id=230, _version_=1411963731079856128}, SolrDocument{id=231, _version_=1411963731089293312}, SolrDocument{id=232, _version_=1411963731098730496}, SolrDocument{id=233, _version_=1411963731108167680}, SolrDocument{id=234, _version_=1411963731120750592}, SolrDocument{id=235, _version_=1411963731135430656}, SolrDocument{id=236, _version_=1411963731145916416}, SolrDocument{id=237, _version_=1411963731155353600}, SolrDocument{id=238, _version_=1411963731164790784}, SolrDocument{id=239, _version_=1411963731174227968}, SolrDocument{id=240, _version_=1411963731183665152}, SolrDocument{id=241, _version_=1411963731193102336}, SolrDocument{id=242, _version_=1411963731202539520}, SolrDocument{id=243, _version_=1411963731211976704}, SolrDocument{id=244, _version_=1411963731224559616}, SolrDocument{id=245, _version_=1411963731240288256}, SolrDocument{id=246, _version_=1411963731250774016}, SolrDocument{id=247, _version_=1411963731260211200}, SolrDocument{id=248, _version_=1411963731269648384}, SolrDocument{id=249, _version_=1411963731279085568}, SolrDocument{id=250, _version_=1411963731288522752}, SolrDocument{id=251, _version_=1411963731297959936}, SolrDocument{id=252, _version_=1411963731307397120}, SolrDocument{id=253, _version_=1411963731316834304}, SolrDocument{id=254, _version_=1411963731329417216}, SolrDocument{id=255, _version_=1411963731345145856}, SolrDocument{id=256, _version_=1411963731359825920}, SolrDocument{id=257, _version_=1411963731369263104}, SolrDocument{id=258, _version_=1411963731378700288}, SolrDocument{id=259, _version_=1411963731388137472}, SolrDocument{id=260, _version_=1411963731397574656}, SolrDocument{id=261, _version_=1411963731407011840}, SolrDocument{id=262, _version_=1411963731416449024}, SolrDocument{id=263, _version_=1411963731425886208}, SolrDocument{id=264, _version_=1411963731438469120}, SolrDocument{id=265, _version_=1411963731467829248}, SolrDocument{id=266, _version_=1411963731477266432}, SolrDocument{id=267, _version_=1411963731486703616}, SolrDocument{id=268, _version_=1411963731496140800}, SolrDocument{id=269, _version_=1411963731505577984}, SolrDocument{id=270, _version_=1411963731515015168}, SolrDocument{id=271, _version_=1411963731524452352}, SolrDocument{id=272, _version_=1411963731533889536}, SolrDocument{id=273, _version_=1411963731543326720}, SolrDocument{id=274, _version_=1411963731561152512}, SolrDocument{id=275, _version_=1411963731582124032}, SolrDocument{id=276, _version_=1411963731592609792}, SolrDocument{id=277, _version_=1411963731602046976}, SolrDocument{id=278, _version_=1411963731611484160}, SolrDocument{id=279, _version_=1411963731620921344}, SolrDocument{id=280, _version_=1411963731630358528}, SolrDocument{id=281, _version_=1411963731639795712}, SolrDocument{id=282, _version_=1411963731649232896}, SolrDocument{id=283, _version_=1411963731658670080}, SolrDocument{id=284, _version_=1411963731671252992}, SolrDocument{id=285, _version_=1411963731685933056}, SolrDocument{id=286, _version_=1411963731696418816}, SolrDocument{id=287, _version_=1411963731705856000}, SolrDocument{id=288, _version_=1411963731715293184}, SolrDocument{id=289, _version_=1411963731724730368}, SolrDocument{id=290, _version_=1411963731734167552}, SolrDocument{id=291, _version_=1411963731743604736}, SolrDocument{id=292, _version_=1411963731753041920}, SolrDocument{id=293, _version_=1411963731762479104}, SolrDocument{id=294, _version_=1411963731775062016}, SolrDocument{id=295, _version_=1411963731789742080}, SolrDocument{id=296, _version_=1411963731800227840}, SolrDocument{id=297, _version_=1411963731809665024}, SolrDocument{id=298, _version_=1411963731819102208}, SolrDocument{id=299, _version_=1411963731828539392}, SolrDocument{id=300, _version_=1411963731837976576}, SolrDocument{id=301, _version_=1411963731847413760}, SolrDocument{id=302, _version_=1411963731857899520}, SolrDocument{id=303, _version_=1411963731867336704}, SolrDocument{id=304, _version_=1411963731879919616}]}
######http://127.0.0.1:31535/solr/collection1: {numFound=5,start=0,docs=[SolrDocument{id=0, _version_=1411963704913690624}, SolrDocument{id=1, _version_=1411963704924176384}, SolrDocument{id=2, _version_=1411963704934662144}, SolrDocument{id=3, _version_=1411963704945147904}, SolrDocument{id=4, _version_=1411963707646279680}]}
###### sizes=305,5
###### Only in http://127.0.0.1:31532/solr/collection1: [{id=154, _version_=1411963730268258304}, {id=113, _version_=1411963729802690560}, {id=204, _version_=1411963730805129216}, {id=169, _version_=1411963730425544704}, {id=42, _version_=1411963729003675648}, {id=28, _version_=1411963728857923584}, {id=55, _version_=1411963729165156352}, {id=92, _version_=1411963729577246720}, {id=280, _version_=1411963731630358528}, {id=190, _version_=1411963730641551360}, {id=161, _version_=1411963730339561472}, {id=78, _version_=1411963729432543232}, {id=203, _version_=1411963730787303424}, {id=117, _version_=1411963729853022208}, {id=53, _version_=1411963729120067584}, {id=207, _version_=1411963730844975104}, {id=215, _version_=1411963730928861184}, {id=74, _version_=1411963729385357312}, {id=82, _version_=1411963729470291968}, {id=221, _version_=1411963730985484288}, {id=103, _version_=1411963729691541504}, {id=201, _version_=1411963730767380480}, {id=170, _version_=1411963730434981888}, {id=130, _version_=1411963729998774272}, {id=16, _version_=1411963728733143040}, {id=101, _version_=1411963729672667136}, {id=188, _version_=1411963730622676992}, {id=236, _version_=1411963731145916416}, {id=152, _version_=1411963730246238208}, {id=281, _version_=1411963731639795712}, {id=250, _version_=1411963731288522752}, {id=121, _version_=1411963729890770944}, {id=13, _version_=1411963728693297152}, {id=122, _version_=1411963729900208128}, {id=224, _version_=1411963731016941568}, {id=36, _version_=1411963728947052544}, {id=41, _version_=1411963728994238464}, {id=299, _version_=1411963731828539392}, {id=147, _version_=1411963730199052288}, {id=145, _version_=1411963730179129344}, {id=57, _version_=1411963729185079296}, {id=287, _version_=1411963731705856000}, {id=9, _version_=1411963728655548416}, {id=262, _version_=1411963731416449024}, {id=23, _version_=1411963728799203328}, {id=139, _version_=1411963730108874752}, {id=269, _version_=1411963731505577984}, {id=196, _version_=1411963730720194560}, {id=243, _version_=1411963731211976704}, {id=125, _version_=1411963729949491200}, {id=37, _version_=1411963728956489728}, {id=290, _version_=1411963731734167552}, {id=144, _version_=1411963730161303552}, {id=229, _version_=1411963731070418944}, {id=212, _version_=1411963730892161024}, {id=268, _version_=1411963731496140800}, {id=123, _version_=1411963729909645312}, {id=46, _version_=1411963729054007296}, {id=258, _version_=1411963731378700288}, {id=284, _version_=1411963731671252992}, {id=89, _version_=1411963729546838016}, {id=272, _version_=1411963731533889536}, {id=31, _version_=1411963728887283712}, {id=19, _version_=1411963728761454592}, {id=178, _version_=1411963730519916544}, {id=70, _version_=1411963729341317120}, {id=294, _version_=1411963731775062016}, {id=187, _version_=1411963730613239808}, {id=63, _version_=1411963729241702400}, {id=233, _version_=1411963731108167680}, {id=151, _version_=1411963730236801024}, {id=50, _version_=1411963729091756032}, {id=156, _version_=1411963730292375552}, {id=285, _version_=1411963731685933056}, {id=109, _version_=1411963729764941824}, {id=71, _version_=1411963729351802880}, {id=273, _version_=1411963731543326720}, {id=79, _version_=1411963729441980416}, {id=15, _version_=1411963728722657280}, {id=264, _version_=1411963731438469120}, {id=102, _version_=1411963729682104320}, {id=17, _version_=1411963728742580224}, {id=40, _version_=1411963728984801280}, {id=249, _version_=1411963731279085568}, {id=232, _version_=1411963731098730496}, {id=136, _version_=1411963730079514624}, {id=162, _version_=1411963730348998656}, {id=202, _version_=1411963730777866240}, {id=274, _version_=1411963731561152512}, {id=191, _version_=1411963730650988544}, {id=58, _version_=1411963729194516480}, {id=108, _version_=1411963729755504640}, {id=276, _version_=1411963731592609792}, {id=25, _version_=1411963728828563456}, {id=235, _version_=1411963731135430656}, {id=83, _version_=1411963729479729152}, {id=291, _version_=1411963731743604736}, {id=220, _version_=1411963730976047104}, {id=124, _version_=1411963729922228224}, {id=228, _version_=1411963731060981760}, {id=157, _version_=1411963730301812736}, {id=96, _version_=1411963729624432640}, {id=194, _version_=1411963730682445824}, {id=182, _version_=1411963730557665280}, {id=118, _version_=1411963729862459392}, {id=62, _version_=1411963729232265216}, {id=35, _version_=1411963728936566784}, {id=304, _version_=1411963731879919616}, {id=216, _version_=1411963730938298368}, {id=253, _version_=1411963731316834304}, {id=263, _version_=1411963731425886208}, {id=104, _version_=1411963729706221568}, {id=205, _version_=1411963730825052160}, {id=140, _version_=1411963730118311936}, {id=150, _version_=1411963730227363840}, {id=12, _version_=1411963728683859968}, {id=27, _version_=1411963728848486400}, {id=208, _version_=1411963730854412288}, {id=183, _version_=1411963730567102464}, {id=298, _version_=1411963731819102208}, {id=239, _version_=1411963731174227968}, {id=237, _version_=1411963731155353600}, {id=69, _version_=1411963729331879936}, {id=200, _version_=1411963730757943296}, {id=33, _version_=1411963728907206656}, {id=177, _version_=1411963730510479360}, {id=88, _version_=1411963729537400832}, {id=259, _version_=1411963731388137472}, {id=302, _version_=1411963731857899520}, {id=49, _version_=1411963729082318848}, {id=30, _version_=1411963728877846528}, {id=73, _version_=1411963729372774400}, {id=166, _version_=1411963730397233152}, {id=146, _version_=1411963730189615104}, {id=76, _version_=1411963729412620288}, {id=8, _version_=1411963728646111232}, {id=20, _version_=1411963728770891776}, {id=143, _version_=1411963730147672064}, {id=129, _version_=1411963729989337088}, {id=94, _version_=1411963729599266816}, {id=141, _version_=1411963730127749120}, {id=126, _version_=1411963729959976960}, {id=107, _version_=1411963729746067456}, {id=54, _version_=1411963729132650496}, {id=172, _version_=1411963730453856256}, {id=110, _version_=1411963729774379008}, {id=271, _version_=1411963731524452352}, {id=214, _version_=1411963730914181120}, {id=51, _version_=1411963729101193216}, {id=267, _version_=1411963731486703616}, {id=184, _version_=1411963730578636800}, {id=245, _version_=1411963731240288256}, {id=192, _version_=1411963730660425728}, {id=185, _version_=1411963730594365440}, {id=155, _version_=1411963730282938368}, {id=164, _version_=1411963730371018752}, {id=80, _version_=1411963729451417600}, {id=223, _version_=1411963731004358656}, {id=256, _version_=1411963731359825920}, {id=277, _version_=1411963731602046976}, {id=227, _version_=1411963731051544576}, {id=128, _version_=1411963729979899904}, {id=292, _version_=1411963731753041920}, {id=135, _version_=1411963730069028864}, {id=119, _version_=1411963729871896576}, {id=241, _version_=1411963731193102336}, {id=24, _version_=1411963728811786240}, {id=137, _version_=1411963730088951808}, {id=219, _version_=1411963730966609920}, {id=32, _version_=1411963728896720896}, {id=198, _version_=1411963730739068928}, {id=173, _version_=1411963730463293440}, {id=65, _version_=1411963729290985472}, {id=248, _version_=1411963731269648384}, {id=158, _version_=1411963730311249920}, {id=97, _version_=1411963729633869824}, {id=288, _version_=1411963731715293184}, {id=132, _version_=1411963730017648640}, {id=39, _version_=1411963728975364096}, {id=26, _version_=1411963728839049216}, {id=231, _version_=1411963731089293312}, {id=59, _version_=1411963729203953664}, {id=95, _version_=1411963729613946880}, {id=163, _version_=1411963730358435840}, {id=44, _version_=1411963729025695744}, {id=45, _version_=1411963729043521536}, {id=111, _version_=1411963729783816192}, {id=105, _version_=1411963729726144512}, {id=149, _version_=1411963730217926656}, {id=266, _version_=1411963731477266432}, {id=11, _version_=1411963728674422784}, {id=167, _version_=1411963730406670336}, {id=99, _version_=1411963729653792768}, {id=176, _version_=1411963730501042176}, {id=217, _version_=1411963730947735552}, {id=85, _version_=1411963729508040704}, {id=252, _version_=1411963731307397120}, {id=199, _version_=1411963730748506112}, {id=67, _version_=1411963729310908416}, {id=61, _version_=1411963729222828032}, {id=181, _version_=1411963730548228096}, {id=21, _version_=1411963728780328960}, {id=297, _version_=1411963731809665024}, {id=240, _version_=1411963731183665152}, {id=238, _version_=1411963731164790784}, {id=87, _version_=1411963729527963648}, {id=260, _version_=1411963731397574656}, {id=295, _version_=1411963731789742080}, {id=265, _version_=1411963731467829248}, {id=283, _version_=1411963731658670080}, {id=75, _version_=1411963729402134528}, {id=142, _version_=1411963730137186304}, {id=77, _version_=1411963729422057472}, {id=209, _version_=1411963730863849472}, {id=159, _version_=1411963730320687104}, {id=7, _version_=1411963728636674048}, {id=301, _version_=1411963731847413760}, {id=303, _version_=1411963731867336704}, {id=60, _version_=1411963729213390848}, {id=84, _version_=1411963729492312064}, {id=275, _version_=1411963731582124032}, {id=48, _version_=1411963729072881664}, {id=64, _version_=1411963729260576768}, {id=38, _version_=1411963728965926912}, {id=43, _version_=1411963729013112832}, {id=230, _version_=1411963731079856128}, {id=171, _version_=1411963730444419072}, {id=131, _version_=1411963730008211456}, {id=52, _version_=1411963729110630400}, {id=91, _version_=1411963729566760960}, {id=279, _version_=1411963731620921344}, {id=289, _version_=1411963731724730368}, {id=120, _version_=1411963729881333760}, {id=195, _version_=1411963730709708800}, {id=153, _version_=1411963730255675392}, {id=210, _version_=1411963730873286656}, {id=226, _version_=1411963731042107392}, {id=282, _version_=1411963731649232896}, {id=68, _version_=1411963729321394176}, {id=293, _version_=1411963731762479104}, {id=72, _version_=1411963729362288640}, {id=29, _version_=1411963728867360768}, {id=246, _version_=1411963731250774016}, {id=222, _version_=1411963730994921472}, {id=112, _version_=1411963729793253376}, {id=81, _version_=1411963729460854784}, {id=98, _version_=1411963729643307008}, {id=244, _version_=1411963731224559616}, {id=175, _version_=1411963730491604992}, {id=116, _version_=1411963729843585024}, {id=254, _version_=1411963731329417216}, {id=160, _version_=1411963730330124288}, {id=189, _version_=1411963730632114176}, {id=100, _version_=1411963729663229952}, {id=127, _version_=1411963729970462720}, {id=56, _version_=1411963729175642112}, {id=234, _version_=1411963731120750592}, {id=148, _version_=1411963730208489472}, {id=218, _version_=1411963730957172736}, {id=10, _version_=1411963728664985600}, {id=278, _version_=1411963731611484160}, {id=165, _version_=1411963730386747392}, {id=193, _version_=1411963730669862912}, {id=255, _version_=1411963731345145856}, {id=106, _version_=1411963729736630272}, {id=180, _version_=1411963730538790912}, {id=133, _version_=1411963730027085824}, {id=251, _version_=1411963731297959936}, {id=270, _version_=1411963731515015168}, {id=22, _version_=1411963728789766144}, {id=213, _version_=1411963730901598208}, {id=286, _version_=1411963731696418816}, {id=296, _version_=1411963731800227840}, {id=225, _version_=1411963731032670208}, {id=66, _version_=1411963729301471232}, {id=261, _version_=1411963731407011840}, {id=14, _version_=1411963728705880064}, {id=86, _version_=1411963729518526464}, {id=93, _version_=1411963729586683904}, {id=247, _version_=1411963731260211200}, {id=6, _version_=1411963728627236864}, {id=211, _version_=1411963730882723840}, {id=168, _version_=1411963730416107520}, {id=114, _version_=1411963729815273472}, {id=18, _version_=1411963728752017408}, {id=300, _version_=1411963731837976576}, {id=197, _version_=1411963730729631744}, {id=242, _version_=1411963731202539520}, {id=179, _version_=1411963730529353728}, {id=115, _version_=1411963729832050688}, {id=257, _version_=1411963731369263104}, {id=186, _version_=1411963730603802624}, {id=34, _version_=1411963728919789568}, {id=138, _version_=1411963730099437568}, {id=47, _version_=1411963729063444480}, {id=174, _version_=1411963730475876352}, {id=90, _version_=1411963729556275200}, {id=206, _version_=1411963730835537920}, {id=134, _version_=1411963730044911616}, {id=5, _version_=1411963728615702528}]
ASYNC  NEW_CORE C8 name=collection1 org.apache.solr.core.SolrCore@5c65b3e8 url=http://127.0.0.1:31535/solr/collection1 node=127.0.0.1:31535_solr
90553 T2659 C8 P31535 oasc.SolrException.log SEVERE Error while trying to recover. core=collection1:org.apache.solr.client.solrj.SolrServerException: IOException occured when talking to server at: http://127.0.0.1:31529/solr
		at org.apache.solr.client.solrj.impl.HttpSolrServer.request(HttpSolrServer.java:414)
		at org.apache.solr.client.solrj.impl.HttpSolrServer.request(HttpSolrServer.java:182)
		at org.apache.solr.cloud.RecoveryStrategy.sendPrepRecoveryCmd(RecoveryStrategy.java:191)
		at org.apache.solr.cloud.RecoveryStrategy.doRecovery(RecoveryStrategy.java:320)
		at org.apache.solr.cloud.RecoveryStrategy.run(RecoveryStrategy.java:212)
	Caused by: org.apache.http.conn.ConnectTimeoutException: Connect to 127.0.0.1:31529 timed out
		at org.apache.http.conn.scheme.PlainSocketFactory.connectSocket(PlainSocketFactory.java:125)
		at org.apache.http.impl.conn.DefaultClientConnectionOperator.openConnection(DefaultClientConnectionOperator.java:148)
		at org.apache.http.impl.conn.AbstractPoolEntry.open(AbstractPoolEntry.java:150)
		at org.apache.http.impl.conn.AbstractPooledConnAdapter.open(AbstractPooledConnAdapter.java:121)
		at org.apache.http.impl.client.DefaultRequestDirector.tryConnect(DefaultRequestDirector.java:575)
		at org.apache.http.impl.client.DefaultRequestDirector.execute(DefaultRequestDirector.java:425)
		at org.apache.http.impl.client.AbstractHttpClient.execute(AbstractHttpClient.java:820)
		at org.apache.http.impl.client.AbstractHttpClient.execute(AbstractHttpClient.java:754)
		at org.apache.http.impl.client.AbstractHttpClient.execute(AbstractHttpClient.java:732)
		at org.apache.solr.client.solrj.impl.HttpSolrServer.request(HttpSolrServer.java:353)
		... 4 more
	
90554 T2659 C8 P31535 oasc.RecoveryStrategy.doRecovery SEVERE Recovery failed - trying again... core=collection1
Control Docs:305
check const of shard1
client0
PROPS:shard=shard1
roles=null
state=active
core=collection1
collection=collection1
node_name=127.0.0.1:31527_solr
base_url=http://127.0.0.1:31527/solr

 live:true
 num:305

client1
PROPS:shard=shard1
roles=null
state=active
core=collection1
collection=collection1
node_name=127.0.0.1:31529_solr
base_url=http://127.0.0.1:31529/solr

error contacting client: IOException occured when talking to server at: http://localhost:31529/solr/collection1

client2
PROPS:shard=shard1
roles=null
leader=true
state=active
core=collection1
collection=collection1
node_name=127.0.0.1:31532_solr
base_url=http://127.0.0.1:31532/solr

 live:true
 num:305

client3
PROPS:shard=shard1
roles=null
state=active
core=collection1
collection=collection1
node_name=127.0.0.1:31535_solr
base_url=http://127.0.0.1:31535/solr

 live:true
 num:305

http://127.0.0.1:31527/solr/collection1/ : 305
shard:shard1
130804 T2585 oasc.SolrException.log SEVERE Sync request error: org.apache.solr.client.solrj.SolrServerException: IOException occured when talking to server at: http://127.0.0.1:31532/solr/collection1
175814 T2585 oasc.SolrException.log SEVERE http://127.0.0.1:31535/solr/collection1/: Could not tell a replica to recover:org.apache.solr.client.solrj.SolrServerException: IOException occured when talking to server at: http://127.0.0.1:31532/solr
		at org.apache.solr.client.solrj.impl.HttpSolrServer.request(HttpSolrServer.java:414)
		at org.apache.solr.client.solrj.impl.HttpSolrServer.request(HttpSolrServer.java:182)
		at org.apache.solr.cloud.SyncStrategy.requestRecovery(SyncStrategy.java:282)
		at org.apache.solr.cloud.SyncStrategy.syncToMe(SyncStrategy.java:226)
		at org.apache.solr.cloud.SyncStrategy.syncReplicas(SyncStrategy.java:119)
		at org.apache.solr.cloud.SyncStrategy.sync(SyncStrategy.java:85)
		at org.apache.solr.cloud.ShardLeaderElectionContext.runLeaderProcess(ElectionContext.java:180)
		at org.apache.solr.cloud.LeaderElector.runIamLeaderProcess(LeaderElector.java:159)
		at org.apache.solr.cloud.LeaderElector.checkIfIamLeader(LeaderElector.java:103)
		at org.apache.solr.cloud.LeaderElector.access$000(LeaderElector.java:57)
		at org.apache.solr.cloud.LeaderElector$1.process(LeaderElector.java:132)
		at org.apache.zookeeper.ClientCnxn$EventThread.processEvent(ClientCnxn.java:526)
		at org.apache.zookeeper.ClientCnxn$EventThread.run(ClientCnxn.java:502)
	Caused by: org.apache.http.conn.ConnectTimeoutException: Connect to 127.0.0.1:31532 timed out
		at org.apache.http.conn.scheme.PlainSocketFactory.connectSocket(PlainSocketFactory.java:125)
		at org.apache.http.impl.conn.DefaultClientConnectionOperator.openConnection(DefaultClientConnectionOperator.java:148)
		at org.apache.http.impl.conn.AbstractPoolEntry.open(AbstractPoolEntry.java:150)
		at org.apache.http.impl.conn.AbstractPooledConnAdapter.open(AbstractPooledConnAdapter.java:121)
		at org.apache.http.impl.client.DefaultRequestDirector.tryConnect(DefaultRequestDirector.java:575)
		at org.apache.http.impl.client.DefaultRequestDirector.execute(DefaultRequestDirector.java:425)
		at org.apache.http.impl.client.AbstractHttpClient.execute(AbstractHttpClient.java:820)
		at org.apache.http.impl.client.AbstractHttpClient.execute(AbstractHttpClient.java:754)
		at org.apache.http.impl.client.AbstractHttpClient.execute(AbstractHttpClient.java:732)
		at org.apache.solr.client.solrj.impl.HttpSolrServer.request(HttpSolrServer.java:353)
		... 12 more
	
Tests run: 1, Failures: 0, Errors: 0, Skipped: 0, Time elapsed: 176.485 sec
Running org.apache.solr.search.TestPseudoReturnFields
Creating dataDir: /usr/home/hudson/hudson-slave/workspace/Lucene-Solr-Maven-4.x/maven-build/solr/core/target/test/./solrtest-TestPseudoReturnFields-1346553679014
Tests run: 13, Failures: 0, Errors: 0, Skipped: 0, Time elapsed: 0.749 sec
Running org.apache.solr.handler.component.DistributedTermsComponentTest
Tests run: 1, Failures: 0, Errors: 0, Skipped: 0, Time elapsed: 4.82 sec
Running org.apache.solr.TestJoin
Creating dataDir: /usr/home/hudson/hudson-slave/workspace/Lucene-Solr-Maven-4.x/maven-build/solr/core/target/test/./solrtest-TestJoin-1346553684584
Tests run: 2, Failures: 0, Errors: 0, Skipped: 0, Time elapsed: 4.633 sec
Running org.apache.solr.search.TestLFUCache
Creating dataDir: /usr/home/hudson/hudson-slave/workspace/Lucene-Solr-Maven-4.x/maven-build/solr/core/target/test/./solrtest-TestLFUCache-1346553689217
{39=39, 38=38, 37=37, 36=36, 35=35, 34=34, 33=33, 32=32, 31=31, 30=30}
Tests run: 5, Failures: 0, Errors: 0, Skipped: 0, Time elapsed: 0.417 sec
Running org.apache.solr.schema.TestCollationField
Creating dataDir: /usr/home/hudson/hudson-slave/workspace/Lucene-Solr-Maven-4.x/maven-build/solr/core/target/test/./solrtest-TestCollationField-1346553689650
Tests run: 8, Failures: 0, Errors: 0, Skipped: 0, Time elapsed: 0.334 sec
Running org.apache.solr.update.processor.FieldMutatingUpdateProcessorTest
Creating dataDir: /usr/home/hudson/hudson-slave/workspace/Lucene-Solr-Maven-4.x/maven-build/solr/core/target/test/./solrtest-FieldMutatingUpdateProcessorTest-1346553689971
Tests run: 26, Failures: 0, Errors: 0, Skipped: 0, Time elapsed: 0.514 sec
Running org.apache.solr.handler.component.TermVectorComponentDistributedTest
Tests run: 1, Failures: 0, Errors: 0, Skipped: 0, Time elapsed: 6.097 sec
Running org.apache.solr.internal.csv.CSVUtilsTest
Tests run: 14, Failures: 0, Errors: 0, Skipped: 0, Time elapsed: 0.007 sec
Running org.apache.solr.update.TestUpdate
Creating dataDir: /usr/home/hudson/hudson-slave/workspace/Lucene-Solr-Maven-4.x/maven-build/solr/core/target/test/./solrtest-TestUpdate-1346553696593
Tests run: 1, Failures: 0, Errors: 0, Skipped: 0, Time elapsed: 0.552 sec
Running org.apache.solr.ConvertedLegacyTest
Creating dataDir: /usr/home/hudson/hudson-slave/workspace/Lucene-Solr-Maven-4.x/maven-build/solr/core/target/test/./solrtest-ConvertedLegacyTest-1346553697145
Tests run: 1, Failures: 0, Errors: 0, Skipped: 0, Time elapsed: 1.771 sec
Running org.apache.solr.core.TestConfig
Creating dataDir: /usr/home/hudson/hudson-slave/workspace/Lucene-Solr-Maven-4.x/maven-build/solr/core/target/test/./solrtest-TestConfig-1346553698918
Tests run: 8, Failures: 0, Errors: 0, Skipped: 0, Time elapsed: 0.214 sec
Running org.apache.solr.internal.csv.ExtendedBufferedReaderTest
Tests run: 8, Failures: 0, Errors: 0, Skipped: 0, Time elapsed: 0.001 sec
Running org.apache.solr.core.TestMergePolicyConfig
Creating dataDir: /usr/home/hudson/hudson-slave/workspace/Lucene-Solr-Maven-4.x/maven-build/solr/core/target/test/./solrtest-TestMergePolicyConfig-1346553699137
Tests run: 1, Failures: 0, Errors: 0, Skipped: 0, Time elapsed: 0.406 sec
Running org.apache.solr.search.TestSurroundQueryParser
Tests run: 1, Failures: 0, Errors: 0, Skipped: 0, Time elapsed: 0.508 sec
Running org.apache.solr.update.processor.UpdateRequestProcessorFactoryTest
Tests run: 2, Failures: 0, Errors: 0, Skipped: 0, Time elapsed: 1.158 sec
Running org.apache.solr.handler.admin.MBeansHandlerTest
Creating dataDir: /usr/home/hudson/hudson-slave/workspace/Lucene-Solr-Maven-4.x/maven-build/solr/core/target/test/./solrtest-MBeansHandlerTest-1346553701209
Tests run: 1, Failures: 0, Errors: 0, Skipped: 0, Time elapsed: 0.505 sec
Running org.apache.solr.SampleTest
Creating dataDir: /usr/home/hudson/hudson-slave/workspace/Lucene-Solr-Maven-4.x/maven-build/solr/core/target/test/./solrtest-SampleTest-1346553701715
Tests run: 2, Failures: 0, Errors: 0, Skipped: 0, Time elapsed: 0.178 sec
Running org.apache.solr.update.processor.DefaultValueUpdateProcessorTest
Creating dataDir: /usr/home/hudson/hudson-slave/workspace/Lucene-Solr-Maven-4.x/maven-build/solr/core/target/test/./solrtest-DefaultValueUpdateProcessorTest-1346553701894
Tests run: 1, Failures: 0, Errors: 0, Skipped: 0, Time elapsed: 0.398 sec
Running org.apache.solr.schema.OpenExchangeRatesOrgProviderTest
Tests run: 5, Failures: 0, Errors: 0, Skipped: 0, Time elapsed: 0.064 sec
Running org.apache.solr.search.TestDocSet
Tests run: 2, Failures: 0, Errors: 0, Skipped: 0, Time elapsed: 0.741 sec
Running org.apache.solr.cloud.ChaosMonkeySafeLeaderTest
Tests run: 1, Failures: 0, Errors: 0, Skipped: 1, Time elapsed: 0 sec
Running org.apache.solr.util.TestNumberUtils
Tests run: 1, Failures: 0, Errors: 0, Skipped: 0, Time elapsed: 0.172 sec
Running org.apache.solr.request.SimpleFacetsTest
Creating dataDir: /usr/home/hudson/hudson-slave/workspace/Lucene-Solr-Maven-4.x/maven-build/solr/core/target/test/./solrtest-SimpleFacetsTest-1346553703274
ASYNC  NEW_CORE C9 name=collection1 org.apache.solr.core.SolrCore@10a58d05
1022 T2950 C9 oasc.SolrException.log SEVERE org.apache.solr.common.SolrException: Specify the group.field as parameter or local parameter
		at org.apache.solr.request.SimpleFacets.getGroupedCounts(SimpleFacets.java:360)
		at org.apache.solr.request.SimpleFacets.getTermCounts(SimpleFacets.java:319)
		at org.apache.solr.request.SimpleFacets.getFacetFieldCounts(SimpleFacets.java:423)
		at org.apache.solr.request.SimpleFacets.getFacetCounts(SimpleFacets.java:206)
		at org.apache.solr.handler.component.FacetComponent.process(FacetComponent.java:87)
		at org.apache.solr.handler.component.SearchHandler.handleRequestBody(SearchHandler.java:206)
		at org.apache.solr.handler.RequestHandlerBase.handleRequest(RequestHandlerBase.java:129)
		at org.apache.solr.core.SolrCore.execute(SolrCore.java:1692)
		at org.apache.solr.util.TestHarness.query(TestHarness.java:351)
		at org.apache.solr.util.TestHarness.query(TestHarness.java:333)
		at org.apache.solr.request.SimpleFacetsTest.testSimpleGroupedFacets(SimpleFacetsTest.java:211)
		at sun.reflect.NativeMethodAccessorImpl.invoke0(Native Method)
		at sun.reflect.NativeMethodAccessorImpl.invoke(NativeMethodAccessorImpl.java:57)
		at sun.reflect.DelegatingMethodAccessorImpl.invoke(DelegatingMethodAccessorImpl.java:43)
		at java.lang.reflect.Method.invoke(Method.java:616)
		at com.carrotsearch.randomizedtesting.RandomizedRunner.invoke(RandomizedRunner.java:1559)
		at com.carrotsearch.randomizedtesting.RandomizedRunner.access$600(RandomizedRunner.java:79)
		at com.carrotsearch.randomizedtesting.RandomizedRunner$6.evaluate(RandomizedRunner.java:737)
		at com.carrotsearch.randomizedtesting.RandomizedRunner$7.evaluate(RandomizedRunner.java:773)
		at com.carrotsearch.randomizedtesting.RandomizedRunner$8.evaluate(RandomizedRunner.java:787)
		at com.carrotsearch.randomizedtesting.rules.SystemPropertiesRestoreRule$1.evaluate(SystemPropertiesRestoreRule.java:53)
		at org.apache.lucene.util.TestRuleSetupTeardownChained$1.evaluate(TestRuleSetupTeardownChained.java:50)
		at org.apache.lucene.util.TestRuleFieldCacheSanity$1.evaluate(TestRuleFieldCacheSanity.java:51)
		at org.apache.lucene.util.AbstractBeforeAfterRule$1.evaluate(AbstractBeforeAfterRule.java:45)
		at com.carrotsearch.randomizedtesting.rules.SystemPropertiesInvariantRule$1.evaluate(SystemPropertiesInvariantRule.java:55)
		at org.apache.lucene.util.TestRuleThreadAndTestName$1.evaluate(TestRuleThreadAndTestName.java:48)
		at org.apache.lucene.util.TestRuleIgnoreAfterMaxFailures$1.evaluate(TestRuleIgnoreAfterMaxFailures.java:70)
		at org.apache.lucene.util.TestRuleMarkFailure$1.evaluate(TestRuleMarkFailure.java:48)
		at com.carrotsearch.randomizedtesting.rules.StatementAdapter.evaluate(StatementAdapter.java:36)
		at com.carrotsearch.randomizedtesting.ThreadLeakControl$StatementRunner.run(ThreadLeakControl.java:345)
		at com.carrotsearch.randomizedtesting.ThreadLeakControl.forkTimeoutingTask(ThreadLeakControl.java:769)
		at com.carrotsearch.randomizedtesting.ThreadLeakControl$3.evaluate(ThreadLeakControl.java:429)
		at com.carrotsearch.randomizedtesting.RandomizedRunner.runSingleTest(RandomizedRunner.java:746)
		at com.carrotsearch.randomizedtesting.RandomizedRunner$3.evaluate(RandomizedRunner.java:648)
		at com.carrotsearch.randomizedtesting.RandomizedRunner$4.evaluate(RandomizedRunner.java:682)
		at com.carrotsearch.randomizedtesting.RandomizedRunner$5.evaluate(RandomizedRunner.java:693)
		at com.carrotsearch.randomizedtesting.rules.StatementAdapter.evaluate(StatementAdapter.java:36)
		at com.carrotsearch.randomizedtesting.rules.SystemPropertiesRestoreRule$1.evaluate(SystemPropertiesRestoreRule.java:53)
		at org.apache.lucene.util.AbstractBeforeAfterRule$1.evaluate(AbstractBeforeAfterRule.java:45)
		at org.apache.lucene.util.TestRuleStoreClassName$1.evaluate(TestRuleStoreClassName.java:42)
		at com.carrotsearch.randomizedtesting.rules.SystemPropertiesInvariantRule$1.evaluate(SystemPropertiesInvariantRule.java:55)
		at com.carrotsearch.randomizedtesting.rules.NoShadowingOrOverridesOnMethodsRule$1.evaluate(NoShadowingOrOverridesOnMethodsRule.java:39)
		at com.carrotsearch.randomizedtesting.rules.NoShadowingOrOverridesOnMethodsRule$1.evaluate(NoShadowingOrOverridesOnMethodsRule.java:39)
		at org.apache.lucene.util.TestRuleAssertionsRequired$1.evaluate(TestRuleAssertionsRequired.java:40)
		at org.apache.lucene.util.TestRuleMarkFailure$1.evaluate(TestRuleMarkFailure.java:48)
		at org.apache.lucene.util.TestRuleIgnoreAfterMaxFailures$1.evaluate(TestRuleIgnoreAfterMaxFailures.java:70)
		at org.apache.lucene.util.TestRuleIgnoreTestSuites$1.evaluate(TestRuleIgnoreTestSuites.java:55)
		at com.carrotsearch.randomizedtesting.rules.StatementAdapter.evaluate(StatementAdapter.java:36)
		at com.carrotsearch.randomizedtesting.ThreadLeakControl$StatementRunner.run(ThreadLeakControl.java:345)
		at java.lang.Thread.run(Thread.java:679)
	
1406 T2950 C9 oasc.SolrException.log SEVERE org.apache.solr.common.SolrException: range facet infinite loop: gap is either zero, or too small relative start/end and caused underflow: 23.0 + 0 = 23.0
		at org.apache.solr.request.SimpleFacets.getFacetRangeCounts(SimpleFacets.java:1122)
		at org.apache.solr.request.SimpleFacets.getFacetRangeCounts(SimpleFacets.java:1074)
		at org.apache.solr.request.SimpleFacets.getFacetRangeCounts(SimpleFacets.java:1018)
		at org.apache.solr.request.SimpleFacets.getFacetCounts(SimpleFacets.java:208)
		at org.apache.solr.handler.component.FacetComponent.process(FacetComponent.java:87)
		at org.apache.solr.handler.component.SearchHandler.handleRequestBody(SearchHandler.java:206)
		at org.apache.solr.handler.RequestHandlerBase.handleRequest(RequestHandlerBase.java:129)
		at org.apache.solr.core.SolrCore.execute(SolrCore.java:1692)
		at org.apache.solr.util.TestHarness.query(TestHarness.java:351)
		at org.apache.solr.util.TestHarness.query(TestHarness.java:333)
		at org.apache.solr.SolrTestCaseJ4.assertQEx(SolrTestCaseJ4.java:601)
		at org.apache.solr.request.SimpleFacetsTest.testRangeFacetInfiniteLoopDetection(SimpleFacetsTest.java:2018)
		at sun.reflect.NativeMethodAccessorImpl.invoke0(Native Method)
		at sun.reflect.NativeMethodAccessorImpl.invoke(NativeMethodAccessorImpl.java:57)
		at sun.reflect.DelegatingMethodAccessorImpl.invoke(DelegatingMethodAccessorImpl.java:43)
		at java.lang.reflect.Method.invoke(Method.java:616)
		at com.carrotsearch.randomizedtesting.RandomizedRunner.invoke(RandomizedRunner.java:1559)
		at com.carrotsearch.randomizedtesting.RandomizedRunner.access$600(RandomizedRunner.java:79)
		at com.carrotsearch.randomizedtesting.RandomizedRunner$6.evaluate(RandomizedRunner.java:737)
		at com.carrotsearch.randomizedtesting.RandomizedRunner$7.evaluate(RandomizedRunner.java:773)
		at com.carrotsearch.randomizedtesting.RandomizedRunner$8.evaluate(RandomizedRunner.java:787)
		at com.carrotsearch.randomizedtesting.rules.SystemPropertiesRestoreRule$1.evaluate(SystemPropertiesRestoreRule.java:53)
		at org.apache.lucene.util.TestRuleSetupTeardownChained$1.evaluate(TestRuleSetupTeardownChained.java:50)
		at org.apache.lucene.util.TestRuleFieldCacheSanity$1.evaluate(TestRuleFieldCacheSanity.java:51)
		at org.apache.lucene.util.AbstractBeforeAfterRule$1.evaluate(AbstractBeforeAfterRule.java:45)
		at com.carrotsearch.randomizedtesting.rules.SystemPropertiesInvariantRule$1.evaluate(SystemPropertiesInvariantRule.java:55)
		at org.apache.lucene.util.TestRuleThreadAndTestName$1.evaluate(TestRuleThreadAndTestName.java:48)
		at org.apache.lucene.util.TestRuleIgnoreAfterMaxFailures$1.evaluate(TestRuleIgnoreAfterMaxFailures.java:70)
		at org.apache.lucene.util.TestRuleMarkFailure$1.evaluate(TestRuleMarkFailure.java:48)
		at com.carrotsearch.randomizedtesting.rules.StatementAdapter.evaluate(StatementAdapter.java:36)
		at com.carrotsearch.randomizedtesting.ThreadLeakControl$StatementRunner.run(ThreadLeakControl.java:345)
		at com.carrotsearch.randomizedtesting.ThreadLeakControl.forkTimeoutingTask(ThreadLeakControl.java:769)
		at com.carrotsearch.randomizedtesting.ThreadLeakControl$3.evaluate(ThreadLeakControl.java:429)
		at com.carrotsearch.randomizedtesting.RandomizedRunner.runSingleTest(RandomizedRunner.java:746)
		at com.carrotsearch.randomizedtesting.RandomizedRunner$3.evaluate(RandomizedRunner.java:648)
		at com.carrotsearch.randomizedtesting.RandomizedRunner$4.evaluate(RandomizedRunner.java:682)
		at com.carrotsearch.randomizedtesting.RandomizedRunner$5.evaluate(RandomizedRunner.java:693)
		at com.carrotsearch.randomizedtesting.rules.StatementAdapter.evaluate(StatementAdapter.java:36)
		at com.carrotsearch.randomizedtesting.rules.SystemPropertiesRestoreRule$1.evaluate(SystemPropertiesRestoreRule.java:53)
		at org.apache.lucene.util.AbstractBeforeAfterRule$1.evaluate(AbstractBeforeAfterRule.java:45)
		at org.apache.lucene.util.TestRuleStoreClassName$1.evaluate(TestRuleStoreClassName.java:42)
		at com.carrotsearch.randomizedtesting.rules.SystemPropertiesInvariantRule$1.evaluate(SystemPropertiesInvariantRule.java:55)
		at com.carrotsearch.randomizedtesting.rules.NoShadowingOrOverridesOnMethodsRule$1.evaluate(NoShadowingOrOverridesOnMethodsRule.java:39)
		at com.carrotsearch.randomizedtesting.rules.NoShadowingOrOverridesOnMethodsRule$1.evaluate(NoShadowingOrOverridesOnMethodsRule.java:39)
		at org.apache.lucene.util.TestRuleAssertionsRequired$1.evaluate(TestRuleAssertionsRequired.java:40)
		at org.apache.lucene.util.TestRuleMarkFailure$1.evaluate(TestRuleMarkFailure.java:48)
		at org.apache.lucene.util.TestRuleIgnoreAfterMaxFailures$1.evaluate(TestRuleIgnoreAfterMaxFailures.java:70)
		at org.apache.lucene.util.TestRuleIgnoreTestSuites$1.evaluate(TestRuleIgnoreTestSuites.java:55)
		at com.carrotsearch.randomizedtesting.rules.StatementAdapter.evaluate(StatementAdapter.java:36)
		at com.carrotsearch.randomizedtesting.ThreadLeakControl$StatementRunner.run(ThreadLeakControl.java:345)
		at java.lang.Thread.run(Thread.java:679)
	
1407 T2950 C9 oasc.SolrException.log SEVERE org.apache.solr.common.SolrException: range facet infinite loop: gap is either zero, or too small relative start/end and caused underflow: 23.0 + 0 = 23.0
		at org.apache.solr.request.SimpleFacets.getFacetRangeCounts(SimpleFacets.java:1122)
		at org.apache.solr.request.SimpleFacets.getFacetRangeCounts(SimpleFacets.java:1074)
		at org.apache.solr.request.SimpleFacets.getFacetRangeCounts(SimpleFacets.java:1018)
		at org.apache.solr.request.SimpleFacets.getFacetCounts(SimpleFacets.java:208)
		at org.apache.solr.handler.component.FacetComponent.process(FacetComponent.java:87)
		at org.apache.solr.handler.component.SearchHandler.handleRequestBody(SearchHandler.java:206)
		at org.apache.solr.handler.RequestHandlerBase.handleRequest(RequestHandlerBase.java:129)
		at org.apache.solr.core.SolrCore.execute(SolrCore.java:1692)
		at org.apache.solr.util.TestHarness.query(TestHarness.java:351)
		at org.apache.solr.util.TestHarness.query(TestHarness.java:333)
		at org.apache.solr.SolrTestCaseJ4.assertQEx(SolrTestCaseJ4.java:601)
		at org.apache.solr.request.SimpleFacetsTest.testRangeFacetInfiniteLoopDetection(SimpleFacetsTest.java:2018)
		at sun.reflect.NativeMethodAccessorImpl.invoke0(Native Method)
		at sun.reflect.NativeMethodAccessorImpl.invoke(NativeMethodAccessorImpl.java:57)
		at sun.reflect.DelegatingMethodAccessorImpl.invoke(DelegatingMethodAccessorImpl.java:43)
		at java.lang.reflect.Method.invoke(Method.java:616)
		at com.carrotsearch.randomizedtesting.RandomizedRunner.invoke(RandomizedRunner.java:1559)
		at com.carrotsearch.randomizedtesting.RandomizedRunner.access$600(RandomizedRunner.java:79)
		at com.carrotsearch.randomizedtesting.RandomizedRunner$6.evaluate(RandomizedRunner.java:737)
		at com.carrotsearch.randomizedtesting.RandomizedRunner$7.evaluate(RandomizedRunner.java:773)
		at com.carrotsearch.randomizedtesting.RandomizedRunner$8.evaluate(RandomizedRunner.java:787)
		at com.carrotsearch.randomizedtesting.rules.SystemPropertiesRestoreRule$1.evaluate(SystemPropertiesRestoreRule.java:53)
		at org.apache.lucene.util.TestRuleSetupTeardownChained$1.evaluate(TestRuleSetupTeardownChained.java:50)
		at org.apache.lucene.util.TestRuleFieldCacheSanity$1.evaluate(TestRuleFieldCacheSanity.java:51)
		at org.apache.lucene.util.AbstractBeforeAfterRule$1.evaluate(AbstractBeforeAfterRule.java:45)
		at com.carrotsearch.randomizedtesting.rules.SystemPropertiesInvariantRule$1.evaluate(SystemPropertiesInvariantRule.java:55)
		at org.apache.lucene.util.TestRuleThreadAndTestName$1.evaluate(TestRuleThreadAndTestName.java:48)
		at org.apache.lucene.util.TestRuleIgnoreAfterMaxFailures$1.evaluate(TestRuleIgnoreAfterMaxFailures.java:70)
		at org.apache.lucene.util.TestRuleMarkFailure$1.evaluate(TestRuleMarkFailure.java:48)
		at com.carrotsearch.randomizedtesting.rules.StatementAdapter.evaluate(StatementAdapter.java:36)
		at com.carrotsearch.randomizedtesting.ThreadLeakControl$StatementRunner.run(ThreadLeakControl.java:345)
		at com.carrotsearch.randomizedtesting.ThreadLeakControl.forkTimeoutingTask(ThreadLeakControl.java:769)
		at com.carrotsearch.randomizedtesting.ThreadLeakControl$3.evaluate(ThreadLeakControl.java:429)
		at com.carrotsearch.randomizedtesting.RandomizedRunner.runSingleTest(RandomizedRunner.java:746)
		at com.carrotsearch.randomizedtesting.RandomizedRunner$3.evaluate(RandomizedRunner.java:648)
		at com.carrotsearch.randomizedtesting.RandomizedRunner$4.evaluate(RandomizedRunner.java:682)
		at com.carrotsearch.randomizedtesting.RandomizedRunner$5.evaluate(RandomizedRunner.java:693)
		at com.carrotsearch.randomizedtesting.rules.StatementAdapter.evaluate(StatementAdapter.java:36)
		at com.carrotsearch.randomizedtesting.rules.SystemPropertiesRestoreRule$1.evaluate(SystemPropertiesRestoreRule.java:53)
		at org.apache.lucene.util.AbstractBeforeAfterRule$1.evaluate(AbstractBeforeAfterRule.java:45)
		at org.apache.lucene.util.TestRuleStoreClassName$1.evaluate(TestRuleStoreClassName.java:42)
		at com.carrotsearch.randomizedtesting.rules.SystemPropertiesInvariantRule$1.evaluate(SystemPropertiesInvariantRule.java:55)
		at com.carrotsearch.randomizedtesting.rules.NoShadowingOrOverridesOnMethodsRule$1.evaluate(NoShadowingOrOverridesOnMethodsRule.java:39)
		at com.carrotsearch.randomizedtesting.rules.NoShadowingOrOverridesOnMethodsRule$1.evaluate(NoShadowingOrOverridesOnMethodsRule.java:39)
		at org.apache.lucene.util.TestRuleAssertionsRequired$1.evaluate(TestRuleAssertionsRequired.java:40)
		at org.apache.lucene.util.TestRuleMarkFailure$1.evaluate(TestRuleMarkFailure.java:48)
		at org.apache.lucene.util.TestRuleIgnoreAfterMaxFailures$1.evaluate(TestRuleIgnoreAfterMaxFailures.java:70)
		at org.apache.lucene.util.TestRuleIgnoreTestSuites$1.evaluate(TestRuleIgnoreTestSuites.java:55)
		at com.carrotsearch.randomizedtesting.rules.StatementAdapter.evaluate(StatementAdapter.java:36)
		at com.carrotsearch.randomizedtesting.ThreadLeakControl$StatementRunner.run(ThreadLeakControl.java:345)
		at java.lang.Thread.run(Thread.java:679)
	
1408 T2950 C9 oasc.SolrException.log SEVERE org.apache.solr.common.SolrException: range facet infinite loop: gap is either zero, or too small relative start/end and caused underflow: 23.0 + 0 = 23.0
		at org.apache.solr.request.SimpleFacets.getFacetRangeCounts(SimpleFacets.java:1122)
		at org.apache.solr.request.SimpleFacets.getFacetRangeCounts(SimpleFacets.java:1074)
		at org.apache.solr.request.SimpleFacets.getFacetRangeCounts(SimpleFacets.java:1018)
		at org.apache.solr.request.SimpleFacets.getFacetCounts(SimpleFacets.java:208)
		at org.apache.solr.handler.component.FacetComponent.process(FacetComponent.java:87)
		at org.apache.solr.handler.component.SearchHandler.handleRequestBody(SearchHandler.java:206)
		at org.apache.solr.handler.RequestHandlerBase.handleRequest(RequestHandlerBase.java:129)
		at org.apache.solr.core.SolrCore.execute(SolrCore.java:1692)
		at org.apache.solr.util.TestHarness.query(TestHarness.java:351)
		at org.apache.solr.util.TestHarness.query(TestHarness.java:333)
		at org.apache.solr.SolrTestCaseJ4.assertQEx(SolrTestCaseJ4.java:601)
		at org.apache.solr.request.SimpleFacetsTest.testRangeFacetInfiniteLoopDetection(SimpleFacetsTest.java:2018)
		at sun.reflect.NativeMethodAccessorImpl.invoke0(Native Method)
		at sun.reflect.NativeMethodAccessorImpl.invoke(NativeMethodAccessorImpl.java:57)
		at sun.reflect.DelegatingMethodAccessorImpl.invoke(DelegatingMethodAccessorImpl.java:43)
		at java.lang.reflect.Method.invoke(Method.java:616)
		at com.carrotsearch.randomizedtesting.RandomizedRunner.invoke(RandomizedRunner.java:1559)
		at com.carrotsearch.randomizedtesting.RandomizedRunner.access$600(RandomizedRunner.java:79)
		at com.carrotsearch.randomizedtesting.RandomizedRunner$6.evaluate(RandomizedRunner.java:737)
		at com.carrotsearch.randomizedtesting.RandomizedRunner$7.evaluate(RandomizedRunner.java:773)
		at com.carrotsearch.randomizedtesting.RandomizedRunner$8.evaluate(RandomizedRunner.java:787)
		at com.carrotsearch.randomizedtesting.rules.SystemPropertiesRestoreRule$1.evaluate(SystemPropertiesRestoreRule.java:53)
		at org.apache.lucene.util.TestRuleSetupTeardownChained$1.evaluate(TestRuleSetupTeardownChained.java:50)
		at org.apache.lucene.util.TestRuleFieldCacheSanity$1.evaluate(TestRuleFieldCacheSanity.java:51)
		at org.apache.lucene.util.AbstractBeforeAfterRule$1.evaluate(AbstractBeforeAfterRule.java:45)
		at com.carrotsearch.randomizedtesting.rules.SystemPropertiesInvariantRule$1.evaluate(SystemPropertiesInvariantRule.java:55)
		at org.apache.lucene.util.TestRuleThreadAndTestName$1.evaluate(TestRuleThreadAndTestName.java:48)
		at org.apache.lucene.util.TestRuleIgnoreAfterMaxFailures$1.evaluate(TestRuleIgnoreAfterMaxFailures.java:70)
		at org.apache.lucene.util.TestRuleMarkFailure$1.evaluate(TestRuleMarkFailure.java:48)
		at com.carrotsearch.randomizedtesting.rules.StatementAdapter.evaluate(StatementAdapter.java:36)
		at com.carrotsearch.randomizedtesting.ThreadLeakControl$StatementRunner.run(ThreadLeakControl.java:345)
		at com.carrotsearch.randomizedtesting.ThreadLeakControl.forkTimeoutingTask(ThreadLeakControl.java:769)
		at com.carrotsearch.randomizedtesting.ThreadLeakControl$3.evaluate(ThreadLeakControl.java:429)
		at com.carrotsearch.randomizedtesting.RandomizedRunner.runSingleTest(RandomizedRunner.java:746)
		at com.carrotsearch.randomizedtesting.RandomizedRunner$3.evaluate(RandomizedRunner.java:648)
		at com.carrotsearch.randomizedtesting.RandomizedRunner$4.evaluate(RandomizedRunner.java:682)
		at com.carrotsearch.randomizedtesting.RandomizedRunner$5.evaluate(RandomizedRunner.java:693)
		at com.carrotsearch.randomizedtesting.rules.StatementAdapter.evaluate(StatementAdapter.java:36)
		at com.carrotsearch.randomizedtesting.rules.SystemPropertiesRestoreRule$1.evaluate(SystemPropertiesRestoreRule.java:53)
		at org.apache.lucene.util.AbstractBeforeAfterRule$1.evaluate(AbstractBeforeAfterRule.java:45)
		at org.apache.lucene.util.TestRuleStoreClassName$1.evaluate(TestRuleStoreClassName.java:42)
		at com.carrotsearch.randomizedtesting.rules.SystemPropertiesInvariantRule$1.evaluate(SystemPropertiesInvariantRule.java:55)
		at com.carrotsearch.randomizedtesting.rules.NoShadowingOrOverridesOnMethodsRule$1.evaluate(NoShadowingOrOverridesOnMethodsRule.java:39)
		at com.carrotsearch.randomizedtesting.rules.NoShadowingOrOverridesOnMethodsRule$1.evaluate(NoShadowingOrOverridesOnMethodsRule.java:39)
		at org.apache.lucene.util.TestRuleAssertionsRequired$1.evaluate(TestRuleAssertionsRequired.java:40)
		at org.apache.lucene.util.TestRuleMarkFailure$1.evaluate(TestRuleMarkFailure.java:48)
		at org.apache.lucene.util.TestRuleIgnoreAfterMaxFailures$1.evaluate(TestRuleIgnoreAfterMaxFailures.java:70)
		at org.apache.lucene.util.TestRuleIgnoreTestSuites$1.evaluate(TestRuleIgnoreTestSuites.java:55)
		at com.carrotsearch.randomizedtesting.rules.StatementAdapter.evaluate(StatementAdapter.java:36)
		at com.carrotsearch.randomizedtesting.ThreadLeakControl$StatementRunner.run(ThreadLeakControl.java:345)
		at java.lang.Thread.run(Thread.java:679)
	
1409 T2950 C9 oasc.SolrException.log SEVERE org.apache.solr.common.SolrException: range facet infinite loop: gap is either zero, or too small relative start/end and caused underflow: 23.0 + 0 = 23.0
		at org.apache.solr.request.SimpleFacets.getFacetRangeCounts(SimpleFacets.java:1122)
		at org.apache.solr.request.SimpleFacets.getFacetRangeCounts(SimpleFacets.java:1074)
		at org.apache.solr.request.SimpleFacets.getFacetRangeCounts(SimpleFacets.java:1018)
		at org.apache.solr.request.SimpleFacets.getFacetCounts(SimpleFacets.java:208)
		at org.apache.solr.handler.component.FacetComponent.process(FacetComponent.java:87)
		at org.apache.solr.handler.component.SearchHandler.handleRequestBody(SearchHandler.java:206)
		at org.apache.solr.handler.RequestHandlerBase.handleRequest(RequestHandlerBase.java:129)
		at org.apache.solr.core.SolrCore.execute(SolrCore.java:1692)
		at org.apache.solr.util.TestHarness.query(TestHarness.java:351)
		at org.apache.solr.util.TestHarness.query(TestHarness.java:333)
		at org.apache.solr.SolrTestCaseJ4.assertQEx(SolrTestCaseJ4.java:601)
		at org.apache.solr.request.SimpleFacetsTest.testRangeFacetInfiniteLoopDetection(SimpleFacetsTest.java:2018)
		at sun.reflect.NativeMethodAccessorImpl.invoke0(Native Method)
		at sun.reflect.NativeMethodAccessorImpl.invoke(NativeMethodAccessorImpl.java:57)
		at sun.reflect.DelegatingMethodAccessorImpl.invoke(DelegatingMethodAccessorImpl.java:43)
		at java.lang.reflect.Method.invoke(Method.java:616)
		at com.carrotsearch.randomizedtesting.RandomizedRunner.invoke(RandomizedRunner.java:1559)
		at com.carrotsearch.randomizedtesting.RandomizedRunner.access$600(RandomizedRunner.java:79)
		at com.carrotsearch.randomizedtesting.RandomizedRunner$6.evaluate(RandomizedRunner.java:737)
		at com.carrotsearch.randomizedtesting.RandomizedRunner$7.evaluate(RandomizedRunner.java:773)
		at com.carrotsearch.randomizedtesting.RandomizedRunner$8.evaluate(RandomizedRunner.java:787)
		at com.carrotsearch.randomizedtesting.rules.SystemPropertiesRestoreRule$1.evaluate(SystemPropertiesRestoreRule.java:53)
		at org.apache.lucene.util.TestRuleSetupTeardownChained$1.evaluate(TestRuleSetupTeardownChained.java:50)
		at org.apache.lucene.util.TestRuleFieldCacheSanity$1.evaluate(TestRuleFieldCacheSanity.java:51)
		at org.apache.lucene.util.AbstractBeforeAfterRule$1.evaluate(AbstractBeforeAfterRule.java:45)
		at com.carrotsearch.randomizedtesting.rules.SystemPropertiesInvariantRule$1.evaluate(SystemPropertiesInvariantRule.java:55)
		at org.apache.lucene.util.TestRuleThreadAndTestName$1.evaluate(TestRuleThreadAndTestName.java:48)
		at org.apache.lucene.util.TestRuleIgnoreAfterMaxFailures$1.evaluate(TestRuleIgnoreAfterMaxFailures.java:70)
		at org.apache.lucene.util.TestRuleMarkFailure$1.evaluate(TestRuleMarkFailure.java:48)
		at com.carrotsearch.randomizedtesting.rules.StatementAdapter.evaluate(StatementAdapter.java:36)
		at com.carrotsearch.randomizedtesting.ThreadLeakControl$StatementRunner.run(ThreadLeakControl.java:345)
		at com.carrotsearch.randomizedtesting.ThreadLeakControl.forkTimeoutingTask(ThreadLeakControl.java:769)
		at com.carrotsearch.randomizedtesting.ThreadLeakControl$3.evaluate(ThreadLeakControl.java:429)
		at com.carrotsearch.randomizedtesting.RandomizedRunner.runSingleTest(RandomizedRunner.java:746)
		at com.carrotsearch.randomizedtesting.RandomizedRunner$3.evaluate(RandomizedRunner.java:648)
		at com.carrotsearch.randomizedtesting.RandomizedRunner$4.evaluate(RandomizedRunner.java:682)
		at com.carrotsearch.randomizedtesting.RandomizedRunner$5.evaluate(RandomizedRunner.java:693)
		at com.carrotsearch.randomizedtesting.rules.StatementAdapter.evaluate(StatementAdapter.java:36)
		at com.carrotsearch.randomizedtesting.rules.SystemPropertiesRestoreRule$1.evaluate(SystemPropertiesRestoreRule.java:53)
		at org.apache.lucene.util.AbstractBeforeAfterRule$1.evaluate(AbstractBeforeAfterRule.java:45)
		at org.apache.lucene.util.TestRuleStoreClassName$1.evaluate(TestRuleStoreClassName.java:42)
		at com.carrotsearch.randomizedtesting.rules.SystemPropertiesInvariantRule$1.evaluate(SystemPropertiesInvariantRule.java:55)
		at com.carrotsearch.randomizedtesting.rules.NoShadowingOrOverridesOnMethodsRule$1.evaluate(NoShadowingOrOverridesOnMethodsRule.java:39)
		at com.carrotsearch.randomizedtesting.rules.NoShadowingOrOverridesOnMethodsRule$1.evaluate(NoShadowingOrOverridesOnMethodsRule.java:39)
		at org.apache.lucene.util.TestRuleAssertionsRequired$1.evaluate(TestRuleAssertionsRequired.java:40)
		at org.apache.lucene.util.TestRuleMarkFailure$1.evaluate(TestRuleMarkFailure.java:48)
		at org.apache.lucene.util.TestRuleIgnoreAfterMaxFailures$1.evaluate(TestRuleIgnoreAfterMaxFailures.java:70)
		at org.apache.lucene.util.TestRuleIgnoreTestSuites$1.evaluate(TestRuleIgnoreTestSuites.java:55)
		at com.carrotsearch.randomizedtesting.rules.StatementAdapter.evaluate(StatementAdapter.java:36)
		at com.carrotsearch.randomizedtesting.ThreadLeakControl$StatementRunner.run(ThreadLeakControl.java:345)
		at java.lang.Thread.run(Thread.java:679)
	
1411 T2950 C9 oasc.SolrException.log SEVERE org.apache.solr.common.SolrException: range facet infinite loop: gap is either zero, or too small relative start/end and caused underflow: 23 + 0 = 23
		at org.apache.solr.request.SimpleFacets.getFacetRangeCounts(SimpleFacets.java:1122)
		at org.apache.solr.request.SimpleFacets.getFacetRangeCounts(SimpleFacets.java:1074)
		at org.apache.solr.request.SimpleFacets.getFacetRangeCounts(SimpleFacets.java:1018)
		at org.apache.solr.request.SimpleFacets.getFacetCounts(SimpleFacets.java:208)
		at org.apache.solr.handler.component.FacetComponent.process(FacetComponent.java:87)
		at org.apache.solr.handler.component.SearchHandler.handleRequestBody(SearchHandler.java:206)
		at org.apache.solr.handler.RequestHandlerBase.handleRequest(RequestHandlerBase.java:129)
		at org.apache.solr.core.SolrCore.execute(SolrCore.java:1692)
		at org.apache.solr.util.TestHarness.query(TestHarness.java:351)
		at org.apache.solr.util.TestHarness.query(TestHarness.java:333)
		at org.apache.solr.SolrTestCaseJ4.assertQEx(SolrTestCaseJ4.java:601)
		at org.apache.solr.request.SimpleFacetsTest.testRangeFacetInfiniteLoopDetection(SimpleFacetsTest.java:2018)
		at sun.reflect.NativeMethodAccessorImpl.invoke0(Native Method)
		at sun.reflect.NativeMethodAccessorImpl.invoke(NativeMethodAccessorImpl.java:57)
		at sun.reflect.DelegatingMethodAccessorImpl.invoke(DelegatingMethodAccessorImpl.java:43)
		at java.lang.reflect.Method.invoke(Method.java:616)
		at com.carrotsearch.randomizedtesting.RandomizedRunner.invoke(RandomizedRunner.java:1559)
		at com.carrotsearch.randomizedtesting.RandomizedRunner.access$600(RandomizedRunner.java:79)
		at com.carrotsearch.randomizedtesting.RandomizedRunner$6.evaluate(RandomizedRunner.java:737)
		at com.carrotsearch.randomizedtesting.RandomizedRunner$7.evaluate(RandomizedRunner.java:773)
		at com.carrotsearch.randomizedtesting.RandomizedRunner$8.evaluate(RandomizedRunner.java:787)
		at com.carrotsearch.randomizedtesting.rules.SystemPropertiesRestoreRule$1.evaluate(SystemPropertiesRestoreRule.java:53)
		at org.apache.lucene.util.TestRuleSetupTeardownChained$1.evaluate(TestRuleSetupTeardownChained.java:50)
		at org.apache.lucene.util.TestRuleFieldCacheSanity$1.evaluate(TestRuleFieldCacheSanity.java:51)
		at org.apache.lucene.util.AbstractBeforeAfterRule$1.evaluate(AbstractBeforeAfterRule.java:45)
		at com.carrotsearch.randomizedtesting.rules.SystemPropertiesInvariantRule$1.evaluate(SystemPropertiesInvariantRule.java:55)
		at org.apache.lucene.util.TestRuleThreadAndTestName$1.evaluate(TestRuleThreadAndTestName.java:48)
		at org.apache.lucene.util.TestRuleIgnoreAfterMaxFailures$1.evaluate(TestRuleIgnoreAfterMaxFailures.java:70)
		at org.apache.lucene.util.TestRuleMarkFailure$1.evaluate(TestRuleMarkFailure.java:48)
		at com.carrotsearch.randomizedtesting.rules.StatementAdapter.evaluate(StatementAdapter.java:36)
		at com.carrotsearch.randomizedtesting.ThreadLeakControl$StatementRunner.run(ThreadLeakControl.java:345)
		at com.carrotsearch.randomizedtesting.ThreadLeakControl.forkTimeoutingTask(ThreadLeakControl.java:769)
		at com.carrotsearch.randomizedtesting.ThreadLeakControl$3.evaluate(ThreadLeakControl.java:429)
		at com.carrotsearch.randomizedtesting.RandomizedRunner.runSingleTest(RandomizedRunner.java:746)
		at com.carrotsearch.randomizedtesting.RandomizedRunner$3.evaluate(RandomizedRunner.java:648)
		at com.carrotsearch.randomizedtesting.RandomizedRunner$4.evaluate(RandomizedRunner.java:682)
		at com.carrotsearch.randomizedtesting.RandomizedRunner$5.evaluate(RandomizedRunner.java:693)
		at com.carrotsearch.randomizedtesting.rules.StatementAdapter.evaluate(StatementAdapter.java:36)
		at com.carrotsearch.randomizedtesting.rules.SystemPropertiesRestoreRule$1.evaluate(SystemPropertiesRestoreRule.java:53)
		at org.apache.lucene.util.AbstractBeforeAfterRule$1.evaluate(AbstractBeforeAfterRule.java:45)
		at org.apache.lucene.util.TestRuleStoreClassName$1.evaluate(TestRuleStoreClassName.java:42)
		at com.carrotsearch.randomizedtesting.rules.SystemPropertiesInvariantRule$1.evaluate(SystemPropertiesInvariantRule.java:55)
		at com.carrotsearch.randomizedtesting.rules.NoShadowingOrOverridesOnMethodsRule$1.evaluate(NoShadowingOrOverridesOnMethodsRule.java:39)
		at com.carrotsearch.randomizedtesting.rules.NoShadowingOrOverridesOnMethodsRule$1.evaluate(NoShadowingOrOverridesOnMethodsRule.java:39)
		at org.apache.lucene.util.TestRuleAssertionsRequired$1.evaluate(TestRuleAssertionsRequired.java:40)
		at org.apache.lucene.util.TestRuleMarkFailure$1.evaluate(TestRuleMarkFailure.java:48)
		at org.apache.lucene.util.TestRuleIgnoreAfterMaxFailures$1.evaluate(TestRuleIgnoreAfterMaxFailures.java:70)
		at org.apache.lucene.util.TestRuleIgnoreTestSuites$1.evaluate(TestRuleIgnoreTestSuites.java:55)
		at com.carrotsearch.randomizedtesting.rules.StatementAdapter.evaluate(StatementAdapter.java:36)
		at com.carrotsearch.randomizedtesting.ThreadLeakControl$StatementRunner.run(ThreadLeakControl.java:345)
		at java.lang.Thread.run(Thread.java:679)
	
1412 T2950 C9 oasc.SolrException.log SEVERE org.apache.solr.common.SolrException: range facet infinite loop: gap is either zero, or too small relative start/end and caused underflow: 23 + 0 = 23
		at org.apache.solr.request.SimpleFacets.getFacetRangeCounts(SimpleFacets.java:1122)
		at org.apache.solr.request.SimpleFacets.getFacetRangeCounts(SimpleFacets.java:1074)
		at org.apache.solr.request.SimpleFacets.getFacetRangeCounts(SimpleFacets.java:1018)
		at org.apache.solr.request.SimpleFacets.getFacetCounts(SimpleFacets.java:208)
		at org.apache.solr.handler.component.FacetComponent.process(FacetComponent.java:87)
		at org.apache.solr.handler.component.SearchHandler.handleRequestBody(SearchHandler.java:206)
		at org.apache.solr.handler.RequestHandlerBase.handleRequest(RequestHandlerBase.java:129)
		at org.apache.solr.core.SolrCore.execute(SolrCore.java:1692)
		at org.apache.solr.util.TestHarness.query(TestHarness.java:351)
		at org.apache.solr.util.TestHarness.query(TestHarness.java:333)
		at org.apache.solr.SolrTestCaseJ4.assertQEx(SolrTestCaseJ4.java:601)
		at org.apache.solr.request.SimpleFacetsTest.testRangeFacetInfiniteLoopDetection(SimpleFacetsTest.java:2018)
		at sun.reflect.NativeMethodAccessorImpl.invoke0(Native Method)
		at sun.reflect.NativeMethodAccessorImpl.invoke(NativeMethodAccessorImpl.java:57)
		at sun.reflect.DelegatingMethodAccessorImpl.invoke(DelegatingMethodAccessorImpl.java:43)
		at java.lang.reflect.Method.invoke(Method.java:616)
		at com.carrotsearch.randomizedtesting.RandomizedRunner.invoke(RandomizedRunner.java:1559)
		at com.carrotsearch.randomizedtesting.RandomizedRunner.access$600(RandomizedRunner.java:79)
		at com.carrotsearch.randomizedtesting.RandomizedRunner$6.evaluate(RandomizedRunner.java:737)
		at com.carrotsearch.randomizedtesting.RandomizedRunner$7.evaluate(RandomizedRunner.java:773)
		at com.carrotsearch.randomizedtesting.RandomizedRunner$8.evaluate(RandomizedRunner.java:787)
		at com.carrotsearch.randomizedtesting.rules.SystemPropertiesRestoreRule$1.evaluate(SystemPropertiesRestoreRule.java:53)
		at org.apache.lucene.util.TestRuleSetupTeardownChained$1.evaluate(TestRuleSetupTeardownChained.java:50)
		at org.apache.lucene.util.TestRuleFieldCacheSanity$1.evaluate(TestRuleFieldCacheSanity.java:51)
		at org.apache.lucene.util.AbstractBeforeAfterRule$1.evaluate(AbstractBeforeAfterRule.java:45)
		at com.carrotsearch.randomizedtesting.rules.SystemPropertiesInvariantRule$1.evaluate(SystemPropertiesInvariantRule.java:55)
		at org.apache.lucene.util.TestRuleThreadAndTestName$1.evaluate(TestRuleThreadAndTestName.java:48)
		at org.apache.lucene.util.TestRuleIgnoreAfterMaxFailures$1.evaluate(TestRuleIgnoreAfterMaxFailures.java:70)
		at org.apache.lucene.util.TestRuleMarkFailure$1.evaluate(TestRuleMarkFailure.java:48)
		at com.carrotsearch.randomizedtesting.rules.StatementAdapter.evaluate(StatementAdapter.java:36)
		at com.carrotsearch.randomizedtesting.ThreadLeakControl$StatementRunner.run(ThreadLeakControl.java:345)
		at com.carrotsearch.randomizedtesting.ThreadLeakControl.forkTimeoutingTask(ThreadLeakControl.java:769)
		at com.carrotsearch.randomizedtesting.ThreadLeakControl$3.evaluate(ThreadLeakControl.java:429)
		at com.carrotsearch.randomizedtesting.RandomizedRunner.runSingleTest(RandomizedRunner.java:746)
		at com.carrotsearch.randomizedtesting.RandomizedRunner$3.evaluate(RandomizedRunner.java:648)
		at com.carrotsearch.randomizedtesting.RandomizedRunner$4.evaluate(RandomizedRunner.java:682)
		at com.carrotsearch.randomizedtesting.RandomizedRunner$5.evaluate(RandomizedRunner.java:693)
		at com.carrotsearch.randomizedtesting.rules.StatementAdapter.evaluate(StatementAdapter.java:36)
		at com.carrotsearch.randomizedtesting.rules.SystemPropertiesRestoreRule$1.evaluate(SystemPropertiesRestoreRule.java:53)
		at org.apache.lucene.util.AbstractBeforeAfterRule$1.evaluate(AbstractBeforeAfterRule.java:45)
		at org.apache.lucene.util.TestRuleStoreClassName$1.evaluate(TestRuleStoreClassName.java:42)
		at com.carrotsearch.randomizedtesting.rules.SystemPropertiesInvariantRule$1.evaluate(SystemPropertiesInvariantRule.java:55)
		at com.carrotsearch.randomizedtesting.rules.NoShadowingOrOverridesOnMethodsRule$1.evaluate(NoShadowingOrOverridesOnMethodsRule.java:39)
		at com.carrotsearch.randomizedtesting.rules.NoShadowingOrOverridesOnMethodsRule$1.evaluate(NoShadowingOrOverridesOnMethodsRule.java:39)
		at org.apache.lucene.util.TestRuleAssertionsRequired$1.evaluate(TestRuleAssertionsRequired.java:40)
		at org.apache.lucene.util.TestRuleMarkFailure$1.evaluate(TestRuleMarkFailure.java:48)
		at org.apache.lucene.util.TestRuleIgnoreAfterMaxFailures$1.evaluate(TestRuleIgnoreAfterMaxFailures.java:70)
		at org.apache.lucene.util.TestRuleIgnoreTestSuites$1.evaluate(TestRuleIgnoreTestSuites.java:55)
		at com.carrotsearch.randomizedtesting.rules.StatementAdapter.evaluate(StatementAdapter.java:36)
		at com.carrotsearch.randomizedtesting.ThreadLeakControl$StatementRunner.run(ThreadLeakControl.java:345)
		at java.lang.Thread.run(Thread.java:679)
	
1413 T2950 C9 oasc.SolrException.log SEVERE org.apache.solr.common.SolrException: date facet infinite loop: gap is effectively zero
		at org.apache.solr.request.SimpleFacets.getFacetDateCounts(SimpleFacets.java:928)
		at org.apache.solr.request.SimpleFacets.getFacetDateCounts(SimpleFacets.java:837)
		at org.apache.solr.request.SimpleFacets.getFacetCounts(SimpleFacets.java:207)
		at org.apache.solr.handler.component.FacetComponent.process(FacetComponent.java:87)
		at org.apache.solr.handler.component.SearchHandler.handleRequestBody(SearchHandler.java:206)
		at org.apache.solr.handler.RequestHandlerBase.handleRequest(RequestHandlerBase.java:129)
		at org.apache.solr.core.SolrCore.execute(SolrCore.java:1692)
		at org.apache.solr.util.TestHarness.query(TestHarness.java:351)
		at org.apache.solr.util.TestHarness.query(TestHarness.java:333)
		at org.apache.solr.SolrTestCaseJ4.assertQEx(SolrTestCaseJ4.java:601)
		at org.apache.solr.request.SimpleFacetsTest.testRangeFacetInfiniteLoopDetection(SimpleFacetsTest.java:2029)
		at sun.reflect.NativeMethodAccessorImpl.invoke0(Native Method)
		at sun.reflect.NativeMethodAccessorImpl.invoke(NativeMethodAccessorImpl.java:57)
		at sun.reflect.DelegatingMethodAccessorImpl.invoke(DelegatingMethodAccessorImpl.java:43)
		at java.lang.reflect.Method.invoke(Method.java:616)
		at com.carrotsearch.randomizedtesting.RandomizedRunner.invoke(RandomizedRunner.java:1559)
		at com.carrotsearch.randomizedtesting.RandomizedRunner.access$600(RandomizedRunner.java:79)
		at

[...truncated too long message...]

ssName$1.evaluate(TestRuleStoreClassName.java:42)
	at com.carrotsearch.randomizedtesting.rules.SystemPropertiesInvariantRule$1.evaluate(SystemPropertiesInvariantRule.java:55)
	at com.carrotsearch.randomizedtesting.rules.NoShadowingOrOverridesOnMethodsRule$1.evaluate(NoShadowingOrOverridesOnMethodsRule.java:39)
	at com.carrotsearch.randomizedtesting.rules.NoShadowingOrOverridesOnMethodsRule$1.evaluate(NoShadowingOrOverridesOnMethodsRule.java:39)
	at org.apache.lucene.util.TestRuleAssertionsRequired$1.evaluate(TestRuleAssertionsRequired.java:40)
	at org.apache.lucene.util.TestRuleMarkFailure$1.evaluate(TestRuleMarkFailure.java:48)
	at org.apache.lucene.util.TestRuleIgnoreAfterMaxFailures$1.evaluate(TestRuleIgnoreAfterMaxFailures.java:70)
	at org.apache.lucene.util.TestRuleIgnoreTestSuites$1.evaluate(TestRuleIgnoreTestSuites.java:55)
	at com.carrotsearch.randomizedtesting.rules.StatementAdapter.evaluate(StatementAdapter.java:36)
	at com.carrotsearch.randomizedtesting.ThreadLeakControl$StatementRunner.run(ThreadLeakControl.java:345)
	at java.lang.Thread.run(Thread.java:679)

Tests run: 5, Failures: 0, Errors: 0, Skipped: 0, Time elapsed: 10.099 sec

Results :

Tests run: 9, Failures: 0, Errors: 0, Skipped: 0

[INFO] [jar:jar {execution: default-jar}]
[INFO] Building jar: /usr/home/hudson/hudson-slave/workspace/Lucene-Solr-Maven-4.x/maven-build/solr/contrib/uima/target/solr-uima-4.0-SNAPSHOT.jar
[INFO] [install:install {execution: default-install}]
[INFO] Installing /usr/home/hudson/hudson-slave/workspace/Lucene-Solr-Maven-4.x/maven-build/solr/contrib/uima/target/solr-uima-4.0-SNAPSHOT.jar to /home/hudson/.m2/repository/org/apache/solr/solr-uima/4.0-SNAPSHOT/solr-uima-4.0-SNAPSHOT.jar
[INFO] ------------------------------------------------------------------------
[INFO] Building Apache Solr Velocity
[INFO]    task-segment: [install]
[INFO] ------------------------------------------------------------------------
[INFO] [groovy:execute {execution: generate-timestamps}]
[INFO] [buildnumber:create {execution: default}]
[INFO] [enforcer:enforce {execution: enforce-java-compat-version-and-maven-2.2.1}]
[INFO] [remote-resources:process {execution: default}]
[debug] execute contextualize
[INFO] [resources:resources {execution: default-resources}]
[INFO] Using 'UTF-8' encoding to copy filtered resources.
[INFO] skip non existing resourceDirectory /usr/home/hudson/hudson-slave/workspace/Lucene-Solr-Maven-4.x/maven-build/solr/contrib/velocity/src/main/resources
[INFO] Copying 3 resources
[INFO] [compiler:compile {execution: default-compile}]
[INFO] Compiling 4 source files to /usr/home/hudson/hudson-slave/workspace/Lucene-Solr-Maven-4.x/maven-build/solr/contrib/velocity/target/classes
[INFO] [bundle:manifest {execution: bundle-manifest}]
[debug] execute contextualize
[INFO] [resources:testResources {execution: default-testResources}]
[INFO] Using 'UTF-8' encoding to copy filtered resources.
[INFO] Copying 3 resources
[INFO] Copying 148 resources
[INFO] Copying 1 resource
[INFO] Copying 3 resources
[INFO] [compiler:testCompile {execution: default-testCompile}]
[INFO] Compiling 1 source file to /usr/home/hudson/hudson-slave/workspace/Lucene-Solr-Maven-4.x/maven-build/solr/contrib/velocity/target/test-classes
[INFO] [surefire:test {execution: default-test}]
[INFO] Surefire report directory: /usr/home/hudson/hudson-slave/workspace/Lucene-Solr-Maven-4.x/maven-build/solr/contrib/velocity/target/surefire-reports

-------------------------------------------------------
 T E S T S
-------------------------------------------------------
Running org.apache.solr.velocity.VelocityResponseWriterTest
Creating dataDir: /usr/home/hudson/hudson-slave/workspace/Lucene-Solr-Maven-4.x/maven-build/solr/contrib/velocity/target/test/./solrtest-VelocityResponseWriterTest-1346554094747
Tests run: 1, Failures: 0, Errors: 0, Skipped: 0, Time elapsed: 1.551 sec

Results :

Tests run: 1, Failures: 0, Errors: 0, Skipped: 0

[INFO] [jar:jar {execution: default-jar}]
[INFO] Building jar: /usr/home/hudson/hudson-slave/workspace/Lucene-Solr-Maven-4.x/maven-build/solr/contrib/velocity/target/solr-velocity-4.0-SNAPSHOT.jar
[INFO] [install:install {execution: default-install}]
[INFO] Installing /usr/home/hudson/hudson-slave/workspace/Lucene-Solr-Maven-4.x/maven-build/solr/contrib/velocity/target/solr-velocity-4.0-SNAPSHOT.jar to /home/hudson/.m2/repository/org/apache/solr/solr-velocity/4.0-SNAPSHOT/solr-velocity-4.0-SNAPSHOT.jar
[INFO] ------------------------------------------------------------------------
[INFO] Building Apache Solr Contrib aggregator POM
[INFO]    task-segment: [install]
[INFO] ------------------------------------------------------------------------
[INFO] [groovy:execute {execution: generate-timestamps}]
[INFO] [buildnumber:create {execution: default}]
[INFO] [enforcer:enforce {execution: enforce-java-compat-version-and-maven-2.2.1}]
[INFO] [remote-resources:process {execution: default}]
[INFO] [bundle:manifest {execution: bundle-manifest}]
[WARNING] Ignoring project type pom - supportedProjectTypes = [jar, bundle]
[INFO] [site:attach-descriptor {execution: default-attach-descriptor}]
[INFO] [install:install {execution: default-install}]
[INFO] Installing /usr/home/hudson/hudson-slave/workspace/Lucene-Solr-Maven-4.x/maven-build/solr/contrib/pom.xml to /home/hudson/.m2/repository/org/apache/solr/solr-contrib-aggregator/4.0-SNAPSHOT/solr-contrib-aggregator-4.0-SNAPSHOT.pom
[INFO] 
[INFO] 
[INFO] ------------------------------------------------------------------------
[INFO] Reactor Summary:
[INFO] ------------------------------------------------------------------------
[INFO] Grandparent POM for Apache Lucene Core and Apache Solr  SUCCESS [7.223s]
[INFO] Lucene parent POM ..................................... SUCCESS [0.058s]
[INFO] Lucene Core ........................................... SUCCESS [4:42.329s]
[INFO] Lucene Test Framework ................................. SUCCESS [5.883s]
[INFO] Lucene Common Analyzers ............................... SUCCESS [2:01.063s]
[INFO] Lucene ICU Analysis Components ........................ SUCCESS [15.659s]
[INFO] Lucene Kuromoji Japanese Morphological Analyzer ....... SUCCESS [29.814s]
[INFO] Lucene Morfologik Polish Lemmatizer ................... SUCCESS [3.804s]
[INFO] Lucene Phonetic Filters ............................... SUCCESS [22.001s]
[INFO] Lucene Smart Chinese Analyzer ......................... SUCCESS [9.009s]
[INFO] Lucene Stempel Analyzer ............................... SUCCESS [4.673s]
[INFO] Lucene UIMA Analysis Components ....................... SUCCESS [22.902s]
[INFO] Lucene Analysis Modules aggregator POM ................ SUCCESS [0.230s]
[INFO] Lucene Queries ........................................ SUCCESS [12.568s]
[INFO] Lucene Sandbox ........................................ SUCCESS [14.310s]
[INFO] Lucene QueryParsers ................................... SUCCESS [21.282s]
[INFO] Lucene Memory ......................................... SUCCESS [10.433s]
[INFO] Lucene Highlighter .................................... SUCCESS [9.365s]
[INFO] Lucene Facets ......................................... SUCCESS [1:05.870s]
[INFO] Lucene Benchmark ...................................... SUCCESS [24.500s]
[INFO] Lucene Demo ........................................... SUCCESS [4.449s]
[INFO] Lucene Grouping ....................................... SUCCESS [17.249s]
[INFO] Lucene Join ........................................... SUCCESS [13.548s]
[INFO] Lucene Miscellaneous .................................. SUCCESS [6.062s]
[INFO] Lucene Spatial ........................................ SUCCESS [14.565s]
[INFO] Lucene Suggest ........................................ SUCCESS [15.130s]
[INFO] Apache Solr parent POM ................................ SUCCESS [0.107s]
[INFO] Apache Solr Solrj ..................................... SUCCESS [4:45.464s]
[INFO] Apache Solr Core ...................................... SUCCESS [19:30.603s]
[INFO] Apache Solr Search Server ............................. SUCCESS [5.471s]
[INFO] Apache Solr Test Framework ............................ SUCCESS [3.237s]
[INFO] Apache Solr Analysis Extras ........................... SUCCESS [8.142s]
[INFO] Apache Solr Clustering ................................ SUCCESS [18.885s]
[INFO] Apache Solr DataImportHandler ......................... SUCCESS [1:35.755s]
[INFO] Apache Solr DataImportHandler Extras .................. SUCCESS [9.571s]
[INFO] Apache Solr Content Extraction Library ................ FAILED [8.890s]
[INFO] Apache Solr Language Identifier ....................... SUCCESS [7.163s]
[INFO] Apache Solr UIMA integration .......................... SUCCESS [29.707s]
[INFO] Apache Solr Velocity .................................. SUCCESS [4.893s]
[INFO] Apache Solr Contrib aggregator POM .................... SUCCESS [0.086s]
[INFO] ------------------------------------------------------------------------
[INFO] Error for project: Apache Solr Content Extraction Library (during install)
[INFO] ------------------------------------------------------------------------
[INFO] There are test failures.

Please refer to /usr/home/hudson/hudson-slave/workspace/Lucene-Solr-Maven-4.x/maven-build/solr/contrib/extraction/target/surefire-reports for the individual test results.
[INFO] ------------------------------------------------------------------------
[INFO] For more information, run Maven with the -e switch
[INFO] ------------------------------------------------------------------------
[INFO] BUILD ERRORS
[INFO] ------------------------------------------------------------------------
[INFO] Total time: 40 minutes 3 seconds
[INFO] Finished at: Sun Sep 02 02:48:16 UTC 2012
[INFO] Final Memory: 233M/1676M
[INFO] ------------------------------------------------------------------------
Build step 'Invoke top-level Maven targets' marked build as failure
Recording test results
Email was triggered for: Failure
Sending email for trigger: Failure




Mime
View raw message