lucene-dev mailing list archives

Site index · List index
Message view « Date » · « Thread »
Top « Date » · « Thread »
From Apache Jenkins Server <jenk...@builds.apache.org>
Subject [JENKINS] Lucene-Solr-Tests-4.x-java7 - Build # 472 - Still Failing
Date Wed, 19 Sep 2012 14:36:18 GMT
Build: https://builds.apache.org/job/Lucene-Solr-Tests-4.x-java7/472/

1 tests failed.
FAILED:  org.apache.solr.cloud.BasicDistributedZk2Test.testDistribSearch

Error Message:
Shard still reported as live in zk

Stack Trace:
java.lang.AssertionError: Shard still reported as live in zk
	at __randomizedtesting.SeedInfo.seed([4DD480C1D05D49A2:CC320ED9A702299E]:0)
	at org.junit.Assert.fail(Assert.java:93)
	at org.apache.solr.cloud.AbstractFullDistribZkTestBase.waitToSeeNotLive(AbstractFullDistribZkTestBase.java:1220)
	at org.apache.solr.cloud.BasicDistributedZk2Test.brindDownShardIndexSomeDocsAndRecover(BasicDistributedZk2Test.java:190)
	at org.apache.solr.cloud.BasicDistributedZk2Test.doTest(BasicDistributedZk2Test.java:83)
	at org.apache.solr.BaseDistributedSearchTestCase.testDistribSearch(BaseDistributedSearchTestCase.java:695)
	at sun.reflect.NativeMethodAccessorImpl.invoke0(Native Method)
	at sun.reflect.NativeMethodAccessorImpl.invoke(NativeMethodAccessorImpl.java:57)
	at sun.reflect.DelegatingMethodAccessorImpl.invoke(DelegatingMethodAccessorImpl.java:43)
	at java.lang.reflect.Method.invoke(Method.java:601)
	at com.carrotsearch.randomizedtesting.RandomizedRunner.invoke(RandomizedRunner.java:1559)
	at com.carrotsearch.randomizedtesting.RandomizedRunner.access$600(RandomizedRunner.java:79)
	at com.carrotsearch.randomizedtesting.RandomizedRunner$6.evaluate(RandomizedRunner.java:737)
	at com.carrotsearch.randomizedtesting.RandomizedRunner$7.evaluate(RandomizedRunner.java:773)
	at com.carrotsearch.randomizedtesting.RandomizedRunner$8.evaluate(RandomizedRunner.java:787)
	at com.carrotsearch.randomizedtesting.rules.SystemPropertiesRestoreRule$1.evaluate(SystemPropertiesRestoreRule.java:53)
	at org.apache.lucene.util.TestRuleSetupTeardownChained$1.evaluate(TestRuleSetupTeardownChained.java:50)
	at org.apache.lucene.util.TestRuleFieldCacheSanity$1.evaluate(TestRuleFieldCacheSanity.java:51)
	at org.apache.lucene.util.AbstractBeforeAfterRule$1.evaluate(AbstractBeforeAfterRule.java:45)
	at com.carrotsearch.randomizedtesting.rules.SystemPropertiesInvariantRule$1.evaluate(SystemPropertiesInvariantRule.java:55)
	at org.apache.lucene.util.TestRuleThreadAndTestName$1.evaluate(TestRuleThreadAndTestName.java:48)
	at org.apache.lucene.util.TestRuleIgnoreAfterMaxFailures$1.evaluate(TestRuleIgnoreAfterMaxFailures.java:70)
	at org.apache.lucene.util.TestRuleMarkFailure$1.evaluate(TestRuleMarkFailure.java:48)
	at com.carrotsearch.randomizedtesting.rules.StatementAdapter.evaluate(StatementAdapter.java:36)
	at com.carrotsearch.randomizedtesting.ThreadLeakControl$StatementRunner.run(ThreadLeakControl.java:358)
	at com.carrotsearch.randomizedtesting.ThreadLeakControl.forkTimeoutingTask(ThreadLeakControl.java:782)
	at com.carrotsearch.randomizedtesting.ThreadLeakControl$3.evaluate(ThreadLeakControl.java:442)
	at com.carrotsearch.randomizedtesting.RandomizedRunner.runSingleTest(RandomizedRunner.java:746)
	at com.carrotsearch.randomizedtesting.RandomizedRunner$3.evaluate(RandomizedRunner.java:648)
	at com.carrotsearch.randomizedtesting.RandomizedRunner$4.evaluate(RandomizedRunner.java:682)
	at com.carrotsearch.randomizedtesting.RandomizedRunner$5.evaluate(RandomizedRunner.java:693)
	at com.carrotsearch.randomizedtesting.rules.StatementAdapter.evaluate(StatementAdapter.java:36)
	at com.carrotsearch.randomizedtesting.rules.SystemPropertiesRestoreRule$1.evaluate(SystemPropertiesRestoreRule.java:53)
	at org.apache.lucene.util.AbstractBeforeAfterRule$1.evaluate(AbstractBeforeAfterRule.java:45)
	at org.apache.lucene.util.TestRuleStoreClassName$1.evaluate(TestRuleStoreClassName.java:42)
	at com.carrotsearch.randomizedtesting.rules.SystemPropertiesInvariantRule$1.evaluate(SystemPropertiesInvariantRule.java:55)
	at com.carrotsearch.randomizedtesting.rules.NoShadowingOrOverridesOnMethodsRule$1.evaluate(NoShadowingOrOverridesOnMethodsRule.java:39)
	at com.carrotsearch.randomizedtesting.rules.NoShadowingOrOverridesOnMethodsRule$1.evaluate(NoShadowingOrOverridesOnMethodsRule.java:39)
	at com.carrotsearch.randomizedtesting.rules.StatementAdapter.evaluate(StatementAdapter.java:36)
	at org.apache.lucene.util.TestRuleAssertionsRequired$1.evaluate(TestRuleAssertionsRequired.java:43)
	at org.apache.lucene.util.TestRuleMarkFailure$1.evaluate(TestRuleMarkFailure.java:48)
	at org.apache.lucene.util.TestRuleIgnoreAfterMaxFailures$1.evaluate(TestRuleIgnoreAfterMaxFailures.java:70)
	at org.apache.lucene.util.TestRuleIgnoreTestSuites$1.evaluate(TestRuleIgnoreTestSuites.java:55)
	at com.carrotsearch.randomizedtesting.rules.StatementAdapter.evaluate(StatementAdapter.java:36)
	at com.carrotsearch.randomizedtesting.ThreadLeakControl$StatementRunner.run(ThreadLeakControl.java:358)
	at java.lang.Thread.run(Thread.java:722)




Build Log:
[...truncated 8226 lines...]
[junit4:junit4] Suite: org.apache.solr.cloud.BasicDistributedZk2Test
[junit4:junit4]   2> 4 T1412 oas.SolrTestCaseJ4.setUp ###Starting testDistribSearch
[junit4:junit4]   2> Creating dataDir: /usr/home/hudson/hudson-slave/workspace/Lucene-Solr-Tests-4.x-java7/solr/build/solr-core/test/J0/./solrtest-BasicDistributedZk2Test-1348065056487
[junit4:junit4]   2> 6 T1412 oasc.ZkTestServer.run STARTING ZK TEST SERVER
[junit4:junit4]   2> 9 T1413 oazs.ZooKeeperServer.setTickTime tickTime set to 1000
[junit4:junit4]   2> 10 T1413 oazs.NIOServerCnxn$Factory.<init> binding to port 0.0.0.0/0.0.0.0:0
[junit4:junit4]   2> 11 T1413 oazsp.FileTxnSnapLog.save Snapshotting: 0
[junit4:junit4]   2> 107 T1412 oasc.ZkTestServer.run start zk server on port:23109
[junit4:junit4]   2> 107 T1412 oaz.ZooKeeper.<init> Initiating client connection, connectString=127.0.0.1:23109 sessionTimeout=10000 watcher=org.apache.solr.common.cloud.ConnectionManager@454eed78
[junit4:junit4]   2> 108 T1418 oaz.ClientCnxn$SendThread.startConnect Opening socket connection to server /127.0.0.1:23109
[junit4:junit4]   2> 108 T1412 oascc.ConnectionManager.waitForConnected Waiting for client to connect to ZooKeeper
[junit4:junit4]   2> 109 T1418 oaz.ClientCnxn$SendThread.primeConnection Socket connection established to localhost/127.0.0.1:23109, initiating session
[junit4:junit4]   2> 110 T1414 oazs.NIOServerCnxn$Factory.run Accepted socket connection from /140.211.11.196:23110
[junit4:junit4]   2> 110 T1414 oazs.NIOServerCnxn.readConnectRequest Client attempting to establish new session at /140.211.11.196:23110
[junit4:junit4]   2> 111 T1416 oazsp.FileTxnLog.append Creating new log file: log.1
[junit4:junit4]   2> 114 T1416 oazs.NIOServerCnxn.finishSessionInit Established session 0x139def056ee0000 with negotiated timeout 10000 for client /140.211.11.196:23110
[junit4:junit4]   2> 114 T1418 oaz.ClientCnxn$SendThread.readConnectResult Session establishment complete on server localhost/127.0.0.1:23109, sessionid = 0x139def056ee0000, negotiated timeout = 10000
[junit4:junit4]   2> 115 T1419 oascc.ConnectionManager.process Watcher org.apache.solr.common.cloud.ConnectionManager@454eed78 name:ZooKeeperConnection Watcher:127.0.0.1:23109 got event WatchedEvent state:SyncConnected type:None path:null path:null type:None
[junit4:junit4]   2> 115 T1412 oascc.ConnectionManager.waitForConnected Client is connected to ZooKeeper
[junit4:junit4]   2> 116 T1412 oascc.SolrZkClient.makePath makePath: /solr
[junit4:junit4]   2> 118 T1417 oazs.PrepRequestProcessor.pRequest Processed session termination for sessionid: 0x139def056ee0000
[junit4:junit4]   2> 127 T1419 oaz.ClientCnxn$EventThread.run EventThread shut down
[junit4:junit4]   2> 127 T1412 oaz.ZooKeeper.close Session: 0x139def056ee0000 closed
[junit4:junit4]   2> 128 T1414 oazs.NIOServerCnxn.closeSock Closed socket connection for client /140.211.11.196:23110 which had sessionid 0x139def056ee0000
[junit4:junit4]   2> 128 T1412 oaz.ZooKeeper.<init> Initiating client connection, connectString=127.0.0.1:23109/solr sessionTimeout=10000 watcher=org.apache.solr.common.cloud.ConnectionManager@1377631
[junit4:junit4]   2> 129 T1420 oaz.ClientCnxn$SendThread.startConnect Opening socket connection to server /127.0.0.1:23109
[junit4:junit4]   2> 129 T1412 oascc.ConnectionManager.waitForConnected Waiting for client to connect to ZooKeeper
[junit4:junit4]   2> 130 T1420 oaz.ClientCnxn$SendThread.primeConnection Socket connection established to localhost/127.0.0.1:23109, initiating session
[junit4:junit4]   2> 130 T1414 oazs.NIOServerCnxn$Factory.run Accepted socket connection from /140.211.11.196:23111
[junit4:junit4]   2> 130 T1414 oazs.NIOServerCnxn.readConnectRequest Client attempting to establish new session at /140.211.11.196:23111
[junit4:junit4]   2> 132 T1416 oazs.NIOServerCnxn.finishSessionInit Established session 0x139def056ee0001 with negotiated timeout 10000 for client /140.211.11.196:23111
[junit4:junit4]   2> 132 T1420 oaz.ClientCnxn$SendThread.readConnectResult Session establishment complete on server localhost/127.0.0.1:23109, sessionid = 0x139def056ee0001, negotiated timeout = 10000
[junit4:junit4]   2> 132 T1421 oascc.ConnectionManager.process Watcher org.apache.solr.common.cloud.ConnectionManager@1377631 name:ZooKeeperConnection Watcher:127.0.0.1:23109/solr got event WatchedEvent state:SyncConnected type:None path:null path:null type:None
[junit4:junit4]   2> 133 T1412 oascc.ConnectionManager.waitForConnected Client is connected to ZooKeeper
[junit4:junit4]   2> 133 T1412 oascc.SolrZkClient.makePath makePath: /collections/collection1
[junit4:junit4]   2> 137 T1412 oascc.SolrZkClient.makePath makePath: /collections/collection1/shards
[junit4:junit4]   2> 141 T1412 oascc.SolrZkClient.makePath makePath: /collections/control_collection
[junit4:junit4]   2> 143 T1412 oascc.SolrZkClient.makePath makePath: /collections/control_collection/shards
[junit4:junit4]   2> 152 T1412 oasc.AbstractZkTestCase.putConfig put /usr/home/hudson/hudson-slave/workspace/Lucene-Solr-Tests-4.x-java7/solr/build/solr-core/test-files/solr/collection1/conf/solrconfig.xml to /configs/conf1/solrconfig.xml
[junit4:junit4]   2> 153 T1412 oascc.SolrZkClient.makePath makePath: /configs/conf1/solrconfig.xml
[junit4:junit4]   2> 167 T1412 oasc.AbstractZkTestCase.putConfig put /usr/home/hudson/hudson-slave/workspace/Lucene-Solr-Tests-4.x-java7/solr/build/solr-core/test-files/solr/collection1/conf/schema.xml to /configs/conf1/schema.xml
[junit4:junit4]   2> 168 T1412 oascc.SolrZkClient.makePath makePath: /configs/conf1/schema.xml
[junit4:junit4]   2> 271 T1412 oasc.AbstractZkTestCase.putConfig put /usr/home/hudson/hudson-slave/workspace/Lucene-Solr-Tests-4.x-java7/solr/build/solr-core/test-files/solr/collection1/conf/solrconfig.xml to /configs/conf1/solrconfig.xml
[junit4:junit4]   2> 273 T1412 oascc.SolrZkClient.makePath makePath: /configs/conf1/solrconfig.xml
[junit4:junit4]   2> 276 T1412 oasc.AbstractZkTestCase.putConfig put /usr/home/hudson/hudson-slave/workspace/Lucene-Solr-Tests-4.x-java7/solr/build/solr-core/test-files/solr/collection1/conf/stopwords.txt to /configs/conf1/stopwords.txt
[junit4:junit4]   2> 276 T1412 oascc.SolrZkClient.makePath makePath: /configs/conf1/stopwords.txt
[junit4:junit4]   2> 301 T1412 oasc.AbstractZkTestCase.putConfig put /usr/home/hudson/hudson-slave/workspace/Lucene-Solr-Tests-4.x-java7/solr/build/solr-core/test-files/solr/collection1/conf/protwords.txt to /configs/conf1/protwords.txt
[junit4:junit4]   2> 302 T1412 oascc.SolrZkClient.makePath makePath: /configs/conf1/protwords.txt
[junit4:junit4]   2> 341 T1412 oasc.AbstractZkTestCase.putConfig put /usr/home/hudson/hudson-slave/workspace/Lucene-Solr-Tests-4.x-java7/solr/build/solr-core/test-files/solr/collection1/conf/currency.xml to /configs/conf1/currency.xml
[junit4:junit4]   2> 342 T1412 oascc.SolrZkClient.makePath makePath: /configs/conf1/currency.xml
[junit4:junit4]   2> 345 T1412 oasc.AbstractZkTestCase.putConfig put /usr/home/hudson/hudson-slave/workspace/Lucene-Solr-Tests-4.x-java7/solr/build/solr-core/test-files/solr/collection1/conf/open-exchange-rates.json to /configs/conf1/open-exchange-rates.json
[junit4:junit4]   2> 346 T1412 oascc.SolrZkClient.makePath makePath: /configs/conf1/open-exchange-rates.json
[junit4:junit4]   2> 349 T1412 oasc.AbstractZkTestCase.putConfig put /usr/home/hudson/hudson-slave/workspace/Lucene-Solr-Tests-4.x-java7/solr/build/solr-core/test-files/solr/collection1/conf/mapping-ISOLatin1Accent.txt to /configs/conf1/mapping-ISOLatin1Accent.txt
[junit4:junit4]   2> 349 T1412 oascc.SolrZkClient.makePath makePath: /configs/conf1/mapping-ISOLatin1Accent.txt
[junit4:junit4]   2> 407 T1412 oasc.AbstractZkTestCase.putConfig put /usr/home/hudson/hudson-slave/workspace/Lucene-Solr-Tests-4.x-java7/solr/build/solr-core/test-files/solr/collection1/conf/old_synonyms.txt to /configs/conf1/old_synonyms.txt
[junit4:junit4]   2> 408 T1412 oascc.SolrZkClient.makePath makePath: /configs/conf1/old_synonyms.txt
[junit4:junit4]   2> 411 T1412 oasc.AbstractZkTestCase.putConfig put /usr/home/hudson/hudson-slave/workspace/Lucene-Solr-Tests-4.x-java7/solr/build/solr-core/test-files/solr/collection1/conf/synonyms.txt to /configs/conf1/synonyms.txt
[junit4:junit4]   2> 412 T1412 oascc.SolrZkClient.makePath makePath: /configs/conf1/synonyms.txt
[junit4:junit4]   2> 425 T1417 oazs.PrepRequestProcessor.pRequest Processed session termination for sessionid: 0x139def056ee0001
[junit4:junit4]   2> 427 T1421 oaz.ClientCnxn$EventThread.run EventThread shut down
[junit4:junit4]   2> 427 T1412 oaz.ZooKeeper.close Session: 0x139def056ee0001 closed
[junit4:junit4]   2> 427 T1414 oazs.NIOServerCnxn.closeSock Closed socket connection for client /140.211.11.196:23111 which had sessionid 0x139def056ee0001
[junit4:junit4]   2> 430 T1412 oejs.Server.doStart jetty-8.1.2.v20120308
[junit4:junit4]   2> 433 T1412 oejs.AbstractConnector.doStart Started SocketConnector@0.0.0.0:23112
[junit4:junit4]   2> 434 T1412 oasc.SolrResourceLoader.locateSolrHome JNDI not configured for solr (NoInitialContextEx)
[junit4:junit4]   2> 435 T1412 oasc.SolrResourceLoader.locateSolrHome using system property solr.solr.home: /usr/home/hudson/hudson-slave/workspace/Lucene-Solr-Tests-4.x-java7/solr/build/solr-core/test-files/solr
[junit4:junit4]   2> 435 T1412 oasc.SolrResourceLoader.<init> new SolrResourceLoader for deduced Solr Home: '/usr/home/hudson/hudson-slave/workspace/Lucene-Solr-Tests-4.x-java7/solr/build/solr-core/test-files/solr/'
[junit4:junit4]   2> 466 T1412 oass.SolrDispatchFilter.init SolrDispatchFilter.init()
[junit4:junit4]   2> 466 T1412 oasc.SolrResourceLoader.locateSolrHome JNDI not configured for solr (NoInitialContextEx)
[junit4:junit4]   2> 467 T1412 oasc.SolrResourceLoader.locateSolrHome using system property solr.solr.home: /usr/home/hudson/hudson-slave/workspace/Lucene-Solr-Tests-4.x-java7/solr/build/solr-core/test-files/solr
[junit4:junit4]   2> 467 T1412 oasc.CoreContainer$Initializer.initialize looking for solr.xml: /usr/home/hudson/hudson-slave/workspace/Lucene-Solr-Tests-4.x-java7/solr/build/solr-core/test-files/solr/solr.xml
[junit4:junit4]   2> 468 T1412 oasc.CoreContainer.<init> New CoreContainer 1213015044
[junit4:junit4]   2> 468 T1412 oasc.CoreContainer.load Loading CoreContainer using Solr Home: '/usr/home/hudson/hudson-slave/workspace/Lucene-Solr-Tests-4.x-java7/solr/build/solr-core/test-files/solr/'
[junit4:junit4]   2> 469 T1412 oasc.SolrResourceLoader.<init> new SolrResourceLoader for directory: '/usr/home/hudson/hudson-slave/workspace/Lucene-Solr-Tests-4.x-java7/solr/build/solr-core/test-files/solr/'
[junit4:junit4]   2> 503 T1412 oasc.CoreContainer.load Registering Log Listener
[junit4:junit4]   2> 520 T1412 oasc.CoreContainer.initZooKeeper Zookeeper client=127.0.0.1:23109/solr
[junit4:junit4]   2> 521 T1412 oaz.ZooKeeper.<init> Initiating client connection, connectString=127.0.0.1:23109/solr sessionTimeout=5000 watcher=org.apache.solr.common.cloud.ConnectionManager@29a224bb
[junit4:junit4]   2> 522 T1431 oaz.ClientCnxn$SendThread.startConnect Opening socket connection to server /127.0.0.1:23109
[junit4:junit4]   2> 522 T1412 oascc.ConnectionManager.waitForConnected Waiting for client to connect to ZooKeeper
[junit4:junit4]   2> 523 T1431 oaz.ClientCnxn$SendThread.primeConnection Socket connection established to localhost/127.0.0.1:23109, initiating session
[junit4:junit4]   2> 524 T1414 oazs.NIOServerCnxn$Factory.run Accepted socket connection from /140.211.11.196:23113
[junit4:junit4]   2> 524 T1414 oazs.NIOServerCnxn.readConnectRequest Client attempting to establish new session at /140.211.11.196:23113
[junit4:junit4]   2> 526 T1416 oazs.NIOServerCnxn.finishSessionInit Established session 0x139def056ee0002 with negotiated timeout 5000 for client /140.211.11.196:23113
[junit4:junit4]   2> 526 T1431 oaz.ClientCnxn$SendThread.readConnectResult Session establishment complete on server localhost/127.0.0.1:23109, sessionid = 0x139def056ee0002, negotiated timeout = 5000
[junit4:junit4]   2> 526 T1432 oascc.ConnectionManager.process Watcher org.apache.solr.common.cloud.ConnectionManager@29a224bb name:ZooKeeperConnection Watcher:127.0.0.1:23109/solr got event WatchedEvent state:SyncConnected type:None path:null path:null type:None
[junit4:junit4]   2> 526 T1412 oascc.ConnectionManager.waitForConnected Client is connected to ZooKeeper
[junit4:junit4]   2> 568 T1417 oazs.PrepRequestProcessor.pRequest Got user-level KeeperException when processing sessionid:0x139def056ee0002 type:create cxid:0x2 zxid:0xfffffffffffffffe txntype:unknown reqpath:n/a Error Path:/solr/overseer Error:KeeperErrorCode = NodeExists for /solr/overseer
[junit4:junit4]   2> 569 T1412 oascc.SolrZkClient.makePath makePath: /live_nodes
[junit4:junit4]   2> 626 T1412 oasc.ZkController.createEphemeralLiveNode Register node as live in ZooKeeper:/live_nodes/127.0.0.1:23112_solr
[junit4:junit4]   2> 628 T1417 oazs.PrepRequestProcessor.pRequest Got user-level KeeperException when processing sessionid:0x139def056ee0002 type:delete cxid:0x7 zxid:0xfffffffffffffffe txntype:unknown reqpath:n/a Error Path:/solr/live_nodes/127.0.0.1:23112_solr Error:KeeperErrorCode = NoNode for /solr/live_nodes/127.0.0.1:23112_solr
[junit4:junit4]   2> 630 T1412 oascc.SolrZkClient.makePath makePath: /live_nodes/127.0.0.1:23112_solr
[junit4:junit4]   2> 633 T1412 oashc.HttpShardHandlerFactory.getParameter Setting socketTimeout to: 0
[junit4:junit4]   2> 633 T1412 oashc.HttpShardHandlerFactory.getParameter Setting urlScheme to: http://
[junit4:junit4]   2> 634 T1412 oashc.HttpShardHandlerFactory.getParameter Setting connTimeout to: 0
[junit4:junit4]   2> 634 T1412 oashc.HttpShardHandlerFactory.getParameter Setting maxConnectionsPerHost to: 20
[junit4:junit4]   2> 635 T1412 oashc.HttpShardHandlerFactory.getParameter Setting corePoolSize to: 0
[junit4:junit4]   2> 636 T1412 oashc.HttpShardHandlerFactory.getParameter Setting maximumPoolSize to: 2147483647
[junit4:junit4]   2> 636 T1412 oashc.HttpShardHandlerFactory.getParameter Setting maxThreadIdleTime to: 5
[junit4:junit4]   2> 637 T1412 oashc.HttpShardHandlerFactory.getParameter Setting sizeOfQueue to: -1
[junit4:junit4]   2> 637 T1412 oashc.HttpShardHandlerFactory.getParameter Setting fairnessPolicy to: false
[junit4:junit4]   2> 638 T1412 oascsi.HttpClientUtil.createClient Creating new http client, config:maxConnectionsPerHost=20&maxConnections=10000&socketTimeout=0&connTimeout=0&retry=false
[junit4:junit4]   2> 653 T1412 oascc.SolrZkClient.makePath makePath: /overseer_elect/election
[junit4:junit4]   2> 658 T1417 oazs.PrepRequestProcessor.pRequest Got user-level KeeperException when processing sessionid:0x139def056ee0002 type:delete cxid:0x15 zxid:0xfffffffffffffffe txntype:unknown reqpath:n/a Error Path:/solr/overseer_elect/leader Error:KeeperErrorCode = NoNode for /solr/overseer_elect/leader
[junit4:junit4]   2> 659 T1412 oascc.SolrZkClient.makePath makePath: /overseer_elect/leader
[junit4:junit4]   2> 682 T1412 oasc.Overseer.start Overseer (id=88346791542390786-127.0.0.1:23112_solr-n_0000000000) starting
[junit4:junit4]   2> 683 T1417 oazs.PrepRequestProcessor.pRequest Got user-level KeeperException when processing sessionid:0x139def056ee0002 type:create cxid:0x1a zxid:0xfffffffffffffffe txntype:unknown reqpath:n/a Error Path:/solr/overseer Error:KeeperErrorCode = NodeExists for /solr/overseer
[junit4:junit4]   2> 684 T1417 oazs.PrepRequestProcessor.pRequest Got user-level KeeperException when processing sessionid:0x139def056ee0002 type:create cxid:0x1b zxid:0xfffffffffffffffe txntype:unknown reqpath:n/a Error Path:/solr/overseer Error:KeeperErrorCode = NodeExists for /solr/overseer
[junit4:junit4]   2> 685 T1417 oazs.PrepRequestProcessor.pRequest Got user-level KeeperException when processing sessionid:0x139def056ee0002 type:create cxid:0x1c zxid:0xfffffffffffffffe txntype:unknown reqpath:n/a Error Path:/solr/overseer Error:KeeperErrorCode = NodeExists for /solr/overseer
[junit4:junit4]   2> 695 T1417 oazs.PrepRequestProcessor.pRequest Got user-level KeeperException when processing sessionid:0x139def056ee0002 type:create cxid:0x1d zxid:0xfffffffffffffffe txntype:unknown reqpath:n/a Error Path:/solr/overseer Error:KeeperErrorCode = NodeExists for /solr/overseer
[junit4:junit4]   2> 696 T1434 oasc.OverseerCollectionProcessor.run Process current queue of collection creations
[junit4:junit4]   2> 697 T1412 oascc.SolrZkClient.makePath makePath: /clusterstate.json
[junit4:junit4]   2> 706 T1412 oascc.ZkStateReader.createClusterStateWatchersAndUpdate Updating cluster state from ZooKeeper... 
[junit4:junit4]   2> 713 T1433 oasc.Overseer$ClusterStateUpdater.run Starting to work on the main queue
[junit4:junit4]   2> 714 T1412 oasc.CoreContainer.create Creating SolrCore 'collection1' using instanceDir: /usr/home/hudson/hudson-slave/workspace/Lucene-Solr-Tests-4.x-java7/solr/build/solr-core/test-files/solr/collection1
[junit4:junit4]   2> 715 T1412 oasc.ZkController.createCollectionZkNode Check for collection zkNode:control_collection
[junit4:junit4]   2> 715 T1412 oasc.ZkController.createCollectionZkNode Collection zkNode exists
[junit4:junit4]   2> 716 T1412 oasc.ZkController.readConfigName Load collection config from:/collections/control_collection
[junit4:junit4]   2> 717 T1412 oasc.SolrResourceLoader.<init> new SolrResourceLoader for directory: '/usr/home/hudson/hudson-slave/workspace/Lucene-Solr-Tests-4.x-java7/solr/build/solr-core/test-files/solr/collection1/'
[junit4:junit4]   2> 719 T1412 oasc.SolrResourceLoader.replaceClassLoader Adding 'file:/usr/home/hudson/hudson-slave/workspace/Lucene-Solr-Tests-4.x-java7/solr/build/solr-core/test-files/solr/collection1/lib/classes/' to classloader
[junit4:junit4]   2> 720 T1412 oasc.SolrResourceLoader.replaceClassLoader Adding 'file:/usr/home/hudson/hudson-slave/workspace/Lucene-Solr-Tests-4.x-java7/solr/build/solr-core/test-files/solr/collection1/lib/README' to classloader
[junit4:junit4]   2> 780 T1412 oasc.SolrConfig.<init> Using Lucene MatchVersion: LUCENE_40
[junit4:junit4]   2> 864 T1412 oasc.SolrConfig.<init> Loaded SolrConfig: solrconfig.xml
[junit4:junit4]   2> 966 T1412 oass.IndexSchema.readSchema Reading Solr Schema
[junit4:junit4]   2> 976 T1412 oass.IndexSchema.readSchema Schema name=test
[junit4:junit4]   2> 1721 T1412 oass.OpenExchangeRatesOrgProvider.init Initialized with rates=open-exchange-rates.json, refreshInterval=1440.
[junit4:junit4]   2> 1734 T1412 oass.IndexSchema.readSchema default search field in schema is text
[junit4:junit4]   2> 1742 T1412 oass.IndexSchema.readSchema unique key field: id
[junit4:junit4]   2> 1756 T1412 oass.FileExchangeRateProvider.reload Reloading exchange rates from file currency.xml
[junit4:junit4]   2> 1762 T1412 oass.FileExchangeRateProvider.reload Reloading exchange rates from file currency.xml
[junit4:junit4]   2> 1767 T1412 oass.OpenExchangeRatesOrgProvider.reload Reloading exchange rates from open-exchange-rates.json
[junit4:junit4]   2> 1768 T1412 oass.OpenExchangeRatesOrgProvider.reload Reloading exchange rates from open-exchange-rates.json
[junit4:junit4]   2> 1769 T1412 oasc.SolrCore.<init> [collection1] Opening new SolrCore at /usr/home/hudson/hudson-slave/workspace/Lucene-Solr-Tests-4.x-java7/solr/build/solr-core/test-files/solr/collection1/, dataDir=./org.apache.solr.cloud.BasicDistributedZk2Test-1348065056487/control/data/
[junit4:junit4]   2> 1770 T1412 oasc.JmxMonitoredMap.<init> JMX monitoring is enabled. Adding Solr mbeans to JMX Server: com.sun.jmx.mbeanserver.JmxMBeanServer@758e7898
[junit4:junit4]   2> 1771 T1412 oasc.SolrCore.getNewIndexDir WARNING New index directory detected: old=null new=./org.apache.solr.cloud.BasicDistributedZk2Test-1348065056487/control/data/index/
[junit4:junit4]   2> 1772 T1412 oasc.SolrCore.initIndex WARNING [collection1] Solr index directory './org.apache.solr.cloud.BasicDistributedZk2Test-1348065056487/control/data/index' doesn't exist. Creating new index...
[junit4:junit4]   2> 1773 T1412 oasc.CachingDirectoryFactory.get return new directory for /usr/home/hudson/hudson-slave/workspace/Lucene-Solr-Tests-4.x-java7/solr/build/solr-core/test/J0/./org.apache.solr.cloud.BasicDistributedZk2Test-1348065056487/control/data/index forceNew:false
[junit4:junit4]   2> 1805 T1412 oasc.SolrDeletionPolicy.onCommit SolrDeletionPolicy.onCommit: commits:num=1
[junit4:junit4]   2> 		commit{dir=/usr/home/hudson/hudson-slave/workspace/Lucene-Solr-Tests-4.x-java7/solr/build/solr-core/test/J0/org.apache.solr.cloud.BasicDistributedZk2Test-1348065056487/control/data/index,segFN=segments_1,generation=1,filenames=[segments_1]
[junit4:junit4]   2> 1805 T1412 oasc.SolrDeletionPolicy.updateCommits newest commit = 1
[junit4:junit4]   2> 1806 T1412 oasc.SolrCore.initWriters created xml: solr.XMLResponseWriter
[junit4:junit4]   2> 1808 T1412 oasup.UpdateRequestProcessorChain.init inserting DistributedUpdateProcessorFactory into updateRequestProcessorChain "dedupe"
[junit4:junit4]   2> 1809 T1412 oasup.UpdateRequestProcessorChain.init inserting DistributedUpdateProcessorFactory into updateRequestProcessorChain "dedupe-allfields"
[junit4:junit4]   2> 1809 T1412 oasup.UpdateRequestProcessorChain.init inserting DistributedUpdateProcessorFactory into updateRequestProcessorChain "stored_sig"
[junit4:junit4]   2> 1810 T1412 oasup.UpdateRequestProcessorChain.init inserting DistributedUpdateProcessorFactory into updateRequestProcessorChain "uniq-fields"
[junit4:junit4]   2> 1811 T1412 oasup.UpdateRequestProcessorChain.init inserting DistributedUpdateProcessorFactory into updateRequestProcessorChain "distrib-dup-test-chain-implicit"
[junit4:junit4]   2> 1811 T1412 oasc.RequestHandlers.initHandlersFromConfig adding lazy requestHandler: solr.ReplicationHandler
[junit4:junit4]   2> 1812 T1412 oasc.RequestHandlers.initHandlersFromConfig created /replication: solr.ReplicationHandler
[junit4:junit4]   2> 1813 T1412 oasc.RequestHandlers.initHandlersFromConfig created standard: solr.StandardRequestHandler
[junit4:junit4]   2> 1813 T1412 oasc.RequestHandlers.initHandlersFromConfig created /get: solr.RealTimeGetHandler
[junit4:junit4]   2> 1814 T1412 oasc.RequestHandlers.initHandlersFromConfig created dismax: solr.SearchHandler
[junit4:junit4]   2> 1815 T1412 oasc.RequestHandlers.initHandlersFromConfig created mock: org.apache.solr.core.MockQuerySenderListenerReqHandler
[junit4:junit4]   2> 1815 T1412 oasc.RequestHandlers.initHandlersFromConfig created /admin/: org.apache.solr.handler.admin.AdminHandlers
[junit4:junit4]   2> 1816 T1412 oasc.RequestHandlers.initHandlersFromConfig created defaults: solr.StandardRequestHandler
[junit4:junit4]   2> 1817 T1412 oasc.RequestHandlers.initHandlersFromConfig adding lazy requestHandler: solr.StandardRequestHandler
[junit4:junit4]   2> 1817 T1412 oasc.RequestHandlers.initHandlersFromConfig created lazy: solr.StandardRequestHandler
[junit4:junit4]   2> 1818 T1412 oasc.RequestHandlers.initHandlersFromConfig created /update: solr.UpdateRequestHandler
[junit4:junit4]   2> 1819 T1412 oasc.RequestHandlers.initHandlersFromConfig created /terms: org.apache.solr.handler.component.SearchHandler
[junit4:junit4]   2> 1819 T1412 oasc.RequestHandlers.initHandlersFromConfig created spellCheckCompRH: org.apache.solr.handler.component.SearchHandler
[junit4:junit4]   2> 1820 T1412 oasc.RequestHandlers.initHandlersFromConfig created spellCheckCompRH_Direct: org.apache.solr.handler.component.SearchHandler
[junit4:junit4]   2> 1821 T1412 oasc.RequestHandlers.initHandlersFromConfig created spellCheckWithWordbreak: org.apache.solr.handler.component.SearchHandler
[junit4:junit4]   2> 1821 T1412 oasc.RequestHandlers.initHandlersFromConfig created spellCheckWithWordbreak_Direct: org.apache.solr.handler.component.SearchHandler
[junit4:junit4]   2> 1822 T1412 oasc.RequestHandlers.initHandlersFromConfig created spellCheckCompRH1: org.apache.solr.handler.component.SearchHandler
[junit4:junit4]   2> 1823 T1412 oasc.RequestHandlers.initHandlersFromConfig created tvrh: org.apache.solr.handler.component.SearchHandler
[junit4:junit4]   2> 1823 T1412 oasc.RequestHandlers.initHandlersFromConfig created /mlt: solr.MoreLikeThisHandler
[junit4:junit4]   2> 1824 T1412 oasc.RequestHandlers.initHandlersFromConfig created /debug/dump: solr.DumpRequestHandler
[junit4:junit4]   2> 1828 T1412 oashl.XMLLoader.init xsltCacheLifetimeSeconds=60
[junit4:junit4]   2> 1833 T1412 oasc.SolrCore.initDeprecatedSupport WARNING solrconfig.xml uses deprecated <admin/gettableFiles>, Please update your config to use the ShowFileRequestHandler.
[junit4:junit4]   2> 1834 T1412 oasc.SolrCore.initDeprecatedSupport WARNING adding ShowFileRequestHandler with hidden files: [SCHEMA.XML, OLD_SYNONYMS.TXT, STOPWORDS.TXT, PROTWORDS.TXT, OPEN-EXCHANGE-RATES.JSON, SYNONYMS.TXT, CURRENCY.XML, MAPPING-ISOLATIN1ACCENT.TXT]
[junit4:junit4]   2> 1839 T1412 oass.SolrIndexSearcher.<init> Opening Searcher@4fcb66e5 main
[junit4:junit4]   2> 1840 T1412 oasu.CommitTracker.<init> Hard AutoCommit: disabled
[junit4:junit4]   2> 1840 T1412 oasu.CommitTracker.<init> Soft AutoCommit: disabled
[junit4:junit4]   2> 1841 T1412 oashc.SpellCheckComponent.inform Initializing spell checkers
[junit4:junit4]   2> 1849 T1412 oass.DirectSolrSpellChecker.init init: {name=direct,classname=DirectSolrSpellChecker,field=lowerfilt,minQueryLength=3}
[junit4:junit4]   2> 1903 T1435 oasc.SolrCore.registerSearcher [collection1] Registered new searcher Searcher@4fcb66e5 main{StandardDirectoryReader(segments_1:1)}
[junit4:junit4]   2> 1910 T1417 oazs.PrepRequestProcessor.pRequest Got user-level KeeperException when processing sessionid:0x139def056ee0002 type:create cxid:0x56 zxid:0xfffffffffffffffe txntype:unknown reqpath:n/a Error Path:/solr/overseer/queue Error:KeeperErrorCode = NoNode for /solr/overseer/queue
[junit4:junit4]   2> 1921 T1412 oasc.CoreContainer.register registering core: collection1
[junit4:junit4]   2> 1922 T1412 oasc.ZkController.register Register shard - core:collection1 address:http://127.0.0.1:23112/solr shardId:control_shard
[junit4:junit4]   2> 1923 T1412 oascc.SolrZkClient.makePath makePath: /collections/control_collection/leader_elect/control_shard/election
[junit4:junit4]   2> 1936 T1417 oazs.PrepRequestProcessor.pRequest Got user-level KeeperException when processing sessionid:0x139def056ee0002 type:delete cxid:0x65 zxid:0xfffffffffffffffe txntype:unknown reqpath:n/a Error Path:/solr/collections/control_collection/leaders Error:KeeperErrorCode = NoNode for /solr/collections/control_collection/leaders
[junit4:junit4]   2> 1936 T1412 oasc.ShardLeaderElectionContext.runLeaderProcess Running the leader process.
[junit4:junit4]   2> 1937 T1417 oazs.PrepRequestProcessor.pRequest Got user-level KeeperException when processing sessionid:0x139def056ee0002 type:create cxid:0x66 zxid:0xfffffffffffffffe txntype:unknown reqpath:n/a Error Path:/solr/overseer Error:KeeperErrorCode = NodeExists for /solr/overseer
[junit4:junit4]   2> 2220 T1433 oascc.ZkStateReader.updateClusterState Updating cloud state from ZooKeeper... 
[junit4:junit4]   2> 2221 T1417 oazs.PrepRequestProcessor.pRequest Got user-level KeeperException when processing sessionid:0x139def056ee0002 type:create cxid:0x6d zxid:0xfffffffffffffffe txntype:unknown reqpath:n/a Error Path:/solr/overseer/queue-work Error:KeeperErrorCode = NoNode for /solr/overseer/queue-work
[junit4:junit4]   2> 2237 T1432 oascc.ZkStateReader$2.process A cluster state change has occurred - updating...
[junit4:junit4]   2> 2449 T1412 oasc.ShardLeaderElectionContext.waitForReplicasToComeUp Enough replicas found to continue.
[junit4:junit4]   2> 2450 T1412 oasc.ShardLeaderElectionContext.runLeaderProcess I may be the new leader - try and sync
[junit4:junit4]   2> 2451 T1412 oasc.SyncStrategy.sync Sync replicas to http://127.0.0.1:23112/solr/collection1/
[junit4:junit4]   2> 2451 T1412 oasc.SyncStrategy.syncReplicas Sync Success - now sync replicas to me
[junit4:junit4]   2> 2451 T1412 oasc.SyncStrategy.syncToMe http://127.0.0.1:23112/solr/collection1/ has no replicas
[junit4:junit4]   2> 2452 T1412 oasc.ShardLeaderElectionContext.runLeaderProcess I am the new leader: http://127.0.0.1:23112/solr/collection1/
[junit4:junit4]   2> 2452 T1412 oascc.SolrZkClient.makePath makePath: /collections/control_collection/leaders/control_shard
[junit4:junit4]   2> 2456 T1417 oazs.PrepRequestProcessor.pRequest Got user-level KeeperException when processing sessionid:0x139def056ee0002 type:create cxid:0x8b zxid:0xfffffffffffffffe txntype:unknown reqpath:n/a Error Path:/solr/overseer Error:KeeperErrorCode = NodeExists for /solr/overseer
[junit4:junit4]   2> 2749 T1433 oascc.ZkStateReader.updateClusterState Updating cloud state from ZooKeeper... 
[junit4:junit4]   2> 2763 T1432 oascc.ZkStateReader$2.process A cluster state change has occurred - updating...
[junit4:junit4]   2> 2774 T1412 oasc.ZkController.register We are http://127.0.0.1:23112/solr/collection1/ and leader is http://127.0.0.1:23112/solr/collection1/
[junit4:junit4]   2> 2774 T1412 oasc.ZkController.register No LogReplay needed for core=collection1 baseURL=http://127.0.0.1:23112/solr
[junit4:junit4]   2> 2775 T1412 oasc.ZkController.checkRecovery I am the leader, no recovery necessary
[junit4:junit4]   2> 2777 T1412 oascc.ZkStateReader.updateClusterState Updating cloud state from ZooKeeper... 
[junit4:junit4]   2> 2777 T1412 oass.SolrDispatchFilter.init user.dir=/usr/home/hudson/hudson-slave/workspace/Lucene-Solr-Tests-4.x-java7/solr/build/solr-core/test/J0
[junit4:junit4]   2> 2778 T1412 oass.SolrDispatchFilter.init SolrDispatchFilter.init() done
[junit4:junit4]   2> 2778 T1412 oascsi.HttpClientUtil.createClient Creating new http client, config:maxConnections=128&maxConnectionsPerHost=32&followRedirects=false
[junit4:junit4]   2> 3172 T1412 oejs.Server.doStart jetty-8.1.2.v20120308
[junit4:junit4]   2> 3175 T1412 oejs.AbstractConnector.doStart Started SocketConnector@0.0.0.0:23127
[junit4:junit4]   2> 3175 T1412 oasc.SolrResourceLoader.locateSolrHome JNDI not configured for solr (NoInitialContextEx)
[junit4:junit4]   2> 3176 T1412 oasc.SolrResourceLoader.locateSolrHome using system property solr.solr.home: /usr/home/hudson/hudson-slave/workspace/Lucene-Solr-Tests-4.x-java7/solr/build/solr-core/test/J0/./solrtest-jetty1-1348065059273
[junit4:junit4]   2> 3176 T1412 oasc.SolrResourceLoader.<init> new SolrResourceLoader for deduced Solr Home: '/usr/home/hudson/hudson-slave/workspace/Lucene-Solr-Tests-4.x-java7/solr/build/solr-core/test/J0/./solrtest-jetty1-1348065059273/'
[junit4:junit4]   2> 3211 T1412 oass.SolrDispatchFilter.init SolrDispatchFilter.init()
[junit4:junit4]   2> 3211 T1412 oasc.SolrResourceLoader.locateSolrHome JNDI not configured for solr (NoInitialContextEx)
[junit4:junit4]   2> 3212 T1412 oasc.SolrResourceLoader.locateSolrHome using system property solr.solr.home: /usr/home/hudson/hudson-slave/workspace/Lucene-Solr-Tests-4.x-java7/solr/build/solr-core/test/J0/./solrtest-jetty1-1348065059273
[junit4:junit4]   2> 3212 T1412 oasc.CoreContainer$Initializer.initialize looking for solr.xml: /usr/home/hudson/hudson-slave/workspace/Lucene-Solr-Tests-4.x-java7/solr/build/solr-core/test/J0/./solrtest-jetty1-1348065059273/solr.xml
[junit4:junit4]   2> 3212 T1412 oasc.CoreContainer.<init> New CoreContainer 422950118
[junit4:junit4]   2> 3213 T1412 oasc.CoreContainer.load Loading CoreContainer using Solr Home: '/usr/home/hudson/hudson-slave/workspace/Lucene-Solr-Tests-4.x-java7/solr/build/solr-core/test/J0/./solrtest-jetty1-1348065059273/'
[junit4:junit4]   2> 3213 T1412 oasc.SolrResourceLoader.<init> new SolrResourceLoader for directory: '/usr/home/hudson/hudson-slave/workspace/Lucene-Solr-Tests-4.x-java7/solr/build/solr-core/test/J0/./solrtest-jetty1-1348065059273/'
[junit4:junit4]   2> 3240 T1412 oasc.CoreContainer.load Registering Log Listener
[junit4:junit4]   2> 3254 T1412 oasc.CoreContainer.initZooKeeper Zookeeper client=127.0.0.1:23109/solr
[junit4:junit4]   2> 3255 T1412 oaz.ZooKeeper.<init> Initiating client connection, connectString=127.0.0.1:23109/solr sessionTimeout=5000 watcher=org.apache.solr.common.cloud.ConnectionManager@234b1d61
[junit4:junit4]   2> 3256 T1445 oaz.ClientCnxn$SendThread.startConnect Opening socket connection to server /127.0.0.1:23109
[junit4:junit4]   2> 3256 T1412 oascc.ConnectionManager.waitForConnected Waiting for client to connect to ZooKeeper
[junit4:junit4]   2> 3257 T1445 oaz.ClientCnxn$SendThread.primeConnection Socket connection established to localhost/127.0.0.1:23109, initiating session
[junit4:junit4]   2> 3257 T1414 oazs.NIOServerCnxn$Factory.run Accepted socket connection from /140.211.11.196:23128
[junit4:junit4]   2> 3258 T1414 oazs.NIOServerCnxn.readConnectRequest Client attempting to establish new session at /140.211.11.196:23128
[junit4:junit4]   2> 3260 T1416 oazs.NIOServerCnxn.finishSessionInit Established session 0x139def056ee0003 with negotiated timeout 5000 for client /140.211.11.196:23128
[junit4:junit4]   2> 3260 T1445 oaz.ClientCnxn$SendThread.readConnectResult Session establishment complete on server localhost/127.0.0.1:23109, sessionid = 0x139def056ee0003, negotiated timeout = 5000
[junit4:junit4]   2> 3261 T1446 oascc.ConnectionManager.process Watcher org.apache.solr.common.cloud.ConnectionManager@234b1d61 name:ZooKeeperConnection Watcher:127.0.0.1:23109/solr got event WatchedEvent state:SyncConnected type:None path:null path:null type:None
[junit4:junit4]   2> 3261 T1412 oascc.ConnectionManager.waitForConnected Client is connected to ZooKeeper
[junit4:junit4]   2> 3262 T1417 oazs.PrepRequestProcessor.pRequest Got user-level KeeperException when processing sessionid:0x139def056ee0003 type:create cxid:0x1 zxid:0xfffffffffffffffe txntype:unknown reqpath:n/a Error Path:/solr/overseer Error:KeeperErrorCode = NodeExists for /solr/overseer
[junit4:junit4]   2> 3263 T1417 oazs.PrepRequestProcessor.pRequest Got user-level KeeperException when processing sessionid:0x139def056ee0003 type:create cxid:0x2 zxid:0xfffffffffffffffe txntype:unknown reqpath:n/a Error Path:/solr/overseer Error:KeeperErrorCode = NodeExists for /solr/overseer
[junit4:junit4]   2> 3265 T1412 oasc.ZkController.createEphemeralLiveNode Register node as live in ZooKeeper:/live_nodes/127.0.0.1:23127_solr
[junit4:junit4]   2> 3266 T1417 oazs.PrepRequestProcessor.pRequest Got user-level KeeperException when processing sessionid:0x139def056ee0003 type:delete cxid:0x4 zxid:0xfffffffffffffffe txntype:unknown reqpath:n/a Error Path:/solr/live_nodes/127.0.0.1:23127_solr Error:KeeperErrorCode = NoNode for /solr/live_nodes/127.0.0.1:23127_solr
[junit4:junit4]   2> 3267 T1412 oascc.SolrZkClient.makePath makePath: /live_nodes/127.0.0.1:23127_solr
[junit4:junit4]   2> 3268 T1433 oascc.ZkStateReader.updateClusterState Updating cloud state from ZooKeeper... 
[junit4:junit4]   2> 3282 T1432 oascc.ZkStateReader$3.process Updating live nodes
[junit4:junit4]   2> 3283 T1412 oashc.HttpShardHandlerFactory.getParameter Setting socketTimeout to: 0
[junit4:junit4]   2> 3284 T1412 oashc.HttpShardHandlerFactory.getParameter Setting urlScheme to: http://
[junit4:junit4]   2> 3284 T1412 oashc.HttpShardHandlerFactory.getParameter Setting connTimeout to: 0
[junit4:junit4]   2> 3285 T1412 oashc.HttpShardHandlerFactory.getParameter Setting maxConnectionsPerHost to: 20
[junit4:junit4]   2> 3285 T1412 oashc.HttpShardHandlerFactory.getParameter Setting corePoolSize to: 0
[junit4:junit4]   2> 3286 T1412 oashc.HttpShardHandlerFactory.getParameter Setting maximumPoolSize to: 2147483647
[junit4:junit4]   2> 3287 T1412 oashc.HttpShardHandlerFactory.getParameter Setting maxThreadIdleTime to: 5
[junit4:junit4]   2> 3287 T1412 oashc.HttpShardHandlerFactory.getParameter Setting sizeOfQueue to: -1
[junit4:junit4]   2> 3288 T1412 oashc.HttpShardHandlerFactory.getParameter Setting fairnessPolicy to: false
[junit4:junit4]   2> 3288 T1412 oascsi.HttpClientUtil.createClient Creating new http client, config:maxConnectionsPerHost=20&maxConnections=10000&socketTimeout=0&connTimeout=0&retry=false
[junit4:junit4]   2> 3295 T1432 oascc.ZkStateReader$2.process A cluster state change has occurred - updating...
[junit4:junit4]   2> 3305 T1412 oascc.ZkStateReader.createClusterStateWatchersAndUpdate Updating cluster state from ZooKeeper... 
[junit4:junit4]   2> 3312 T1412 oasc.CoreContainer.create Creating SolrCore 'collection1' using instanceDir: /usr/home/hudson/hudson-slave/workspace/Lucene-Solr-Tests-4.x-java7/solr/build/solr-core/test/J0/./solrtest-jetty1-1348065059273/collection1
[junit4:junit4]   2> 3312 T1412 oasc.ZkController.createCollectionZkNode Check for collection zkNode:collection1
[junit4:junit4]   2> 3313 T1412 oasc.ZkController.createCollectionZkNode Collection zkNode exists
[junit4:junit4]   2> 3314 T1412 oasc.ZkController.readConfigName Load collection config from:/collections/collection1
[junit4:junit4]   2> 3315 T1412 oasc.SolrResourceLoader.<init> new SolrResourceLoader for directory: '/usr/home/hudson/hudson-slave/workspace/Lucene-Solr-Tests-4.x-java7/solr/build/solr-core/test/J0/./solrtest-jetty1-1348065059273/collection1/'
[junit4:junit4]   2> 3316 T1412 oasc.SolrResourceLoader.replaceClassLoader Adding 'file:/usr/home/hudson/hudson-slave/workspace/Lucene-Solr-Tests-4.x-java7/solr/build/solr-core/test/J0/solrtest-jetty1-1348065059273/collection1/lib/README' to classloader
[junit4:junit4]   2> 3317 T1412 oasc.SolrResourceLoader.replaceClassLoader Adding 'file:/usr/home/hudson/hudson-slave/workspace/Lucene-Solr-Tests-4.x-java7/solr/build/solr-core/test/J0/solrtest-jetty1-1348065059273/collection1/lib/classes/' to classloader
[junit4:junit4]   2> 3372 T1412 oasc.SolrConfig.<init> Using Lucene MatchVersion: LUCENE_40
[junit4:junit4]   2> 3447 T1412 oasc.SolrConfig.<init> Loaded SolrConfig: solrconfig.xml
[junit4:junit4]   2> 3548 T1412 oass.IndexSchema.readSchema Reading Solr Schema
[junit4:junit4]   2> 3558 T1412 oass.IndexSchema.readSchema Schema name=test
[junit4:junit4]   2> 4192 T1412 oass.OpenExchangeRatesOrgProvider.init Initialized with rates=open-exchange-rates.json, refreshInterval=1440.
[junit4:junit4]   2> 4207 T1412 oass.IndexSchema.readSchema default search field in schema is text
[junit4:junit4]   2> 4212 T1412 oass.IndexSchema.readSchema unique key field: id
[junit4:junit4]   2> 4227 T1412 oass.FileExchangeRateProvider.reload Reloading exchange rates from file currency.xml
[junit4:junit4]   2> 4232 T1412 oass.FileExchangeRateProvider.reload Reloading exchange rates from file currency.xml
[junit4:junit4]   2> 4237 T1412 oass.OpenExchangeRatesOrgProvider.reload Reloading exchange rates from open-exchange-rates.json
[junit4:junit4]   2> 4238 T1412 oass.OpenExchangeRatesOrgProvider.reload Reloading exchange rates from open-exchange-rates.json
[junit4:junit4]   2> 4240 T1412 oasc.SolrCore.<init> [collection1] Opening new SolrCore at /usr/home/hudson/hudson-slave/workspace/Lucene-Solr-Tests-4.x-java7/solr/build/solr-core/test/J0/./solrtest-jetty1-1348065059273/collection1/, dataDir=./org.apache.solr.cloud.BasicDistributedZk2Test-1348065056487/jetty1/
[junit4:junit4]   2> 4240 T1412 oasc.JmxMonitoredMap.<init> JMX monitoring is enabled. Adding Solr mbeans to JMX Server: com.sun.jmx.mbeanserver.JmxMBeanServer@758e7898
[junit4:junit4]   2> 4242 T1412 oasc.SolrCore.getNewIndexDir WARNING New index directory detected: old=null new=./org.apache.solr.cloud.BasicDistributedZk2Test-1348065056487/jetty1/index/
[junit4:junit4]   2> 4243 T1412 oasc.SolrCore.initIndex WARNING [collection1] Solr index directory './org.apache.solr.cloud.BasicDistributedZk2Test-1348065056487/jetty1/index' doesn't exist. Creating new index...
[junit4:junit4]   2> 4244 T1412 oasc.CachingDirectoryFactory.get return new directory for /usr/home/hudson/hudson-slave/workspace/Lucene-Solr-Tests-4.x-java7/solr/build/solr-core/test/J0/./org.apache.solr.cloud.BasicDistributedZk2Test-1348065056487/jetty1/index forceNew:false
[junit4:junit4]   2> 4250 T1412 oasc.SolrDeletionPolicy.onCommit SolrDeletionPolicy.onCommit: commits:num=1
[junit4:junit4]   2> 		commit{dir=/usr/home/hudson/hudson-slave/workspace/Lucene-Solr-Tests-4.x-java7/solr/build/solr-core/test/J0/org.apache.solr.cloud.BasicDistributedZk2Test-1348065056487/jetty1/index,segFN=segments_1,generation=1,filenames=[segments_1]
[junit4:junit4]   2> 4250 T1412 oasc.SolrDeletionPolicy.updateCommits newest commit = 1
[junit4:junit4]   2> 4251 T1412 oasc.SolrCore.initWriters created xml: solr.XMLResponseWriter
[junit4:junit4]   2> 4254 T1412 oasup.UpdateRequestProcessorChain.init inserting DistributedUpdateProcessorFactory into updateRequestProcessorChain "dedupe"
[junit4:junit4]   2> 4255 T1412 oasup.UpdateRequestProcessorChain.init inserting DistributedUpdateProcessorFactory into updateRequestProcessorChain "dedupe-allfields"
[junit4:junit4]   2> 4255 T1412 oasup.UpdateRequestProcessorChain.init inserting DistributedUpdateProcessorFactory into updateRequestProcessorChain "stored_sig"
[junit4:junit4]   2> 4256 T1412 oasup.UpdateRequestProcessorChain.init inserting DistributedUpdateProcessorFactory into updateRequestProcessorChain "uniq-fields"
[junit4:junit4]   2> 4257 T1412 oasup.UpdateRequestProcessorChain.init inserting DistributedUpdateProcessorFactory into updateRequestProcessorChain "distrib-dup-test-chain-implicit"
[junit4:junit4]   2> 4257 T1412 oasc.RequestHandlers.initHandlersFromConfig adding lazy requestHandler: solr.ReplicationHandler
[junit4:junit4]   2> 4258 T1412 oasc.RequestHandlers.initHandlersFromConfig created /replication: solr.ReplicationHandler
[junit4:junit4]   2> 4259 T1412 oasc.RequestHandlers.initHandlersFromConfig created standard: solr.StandardRequestHandler
[junit4:junit4]   2> 4260 T1412 oasc.RequestHandlers.initHandlersFromConfig created /get: solr.RealTimeGetHandler
[junit4:junit4]   2> 4261 T1412 oasc.RequestHandlers.initHandlersFromConfig created dismax: solr.SearchHandler
[junit4:junit4]   2> 4262 T1412 oasc.RequestHandlers.initHandlersFromConfig created mock: org.apache.solr.core.MockQuerySenderListenerReqHandler
[junit4:junit4]   2> 4263 T1412 oasc.RequestHandlers.initHandlersFromConfig created /admin/: org.apache.solr.handler.admin.AdminHandlers
[junit4:junit4]   2> 4264 T1412 oasc.RequestHandlers.initHandlersFromConfig created defaults: solr.StandardRequestHandler
[junit4:junit4]   2> 4264 T1412 oasc.RequestHandlers.initHandlersFromConfig adding lazy requestHandler: solr.StandardRequestHandler
[junit4:junit4]   2> 4265 T1412 oasc.RequestHandlers.initHandlersFromConfig created lazy: solr.StandardRequestHandler
[junit4:junit4]   2> 4266 T1412 oasc.RequestHandlers.initHandlersFromConfig created /update: solr.UpdateRequestHandler
[junit4:junit4]   2> 4267 T1412 oasc.RequestHandlers.initHandlersFromConfig created /terms: org.apache.solr.handler.component.SearchHandler
[junit4:junit4]   2> 4267 T1412 oasc.RequestHandlers.initHandlersFromConfig created spellCheckCompRH: org.apache.solr.handler.component.SearchHandler
[junit4:junit4]   2> 4268 T1412 oasc.RequestHandlers.initHandlersFromConfig created spellCheckCompRH_Direct: org.apache.solr.handler.component.SearchHandler
[junit4:junit4]   2> 4269 T1412 oasc.RequestHandlers.initHandlersFromConfig created spellCheckWithWordbreak: org.apache.solr.handler.component.SearchHandler
[junit4:junit4]   2> 4270 T1412 oasc.RequestHandlers.initHandlersFromConfig created spellCheckWithWordbreak_Direct: org.apache.solr.handler.component.SearchHandler
[junit4:junit4]   2> 4271 T1412 oasc.RequestHandlers.initHandlersFromConfig created spellCheckCompRH1: org.apache.solr.handler.component.SearchHandler
[junit4:junit4]   2> 4272 T1412 oasc.RequestHandlers.initHandlersFromConfig created tvrh: org.apache.solr.handler.component.SearchHandler
[junit4:junit4]   2> 4273 T1412 oasc.RequestHandlers.initHandlersFromConfig created /mlt: solr.MoreLikeThisHandler
[junit4:junit4]   2> 4274 T1412 oasc.RequestHandlers.initHandlersFromConfig created /debug/dump: solr.DumpRequestHandler
[junit4:junit4]   2> 4278 T1412 oashl.XMLLoader.init xsltCacheLifetimeSeconds=60
[junit4:junit4]   2> 4284 T1412 oasc.SolrCore.initDeprecatedSupport WARNING solrconfig.xml uses deprecated <admin/gettableFiles>, Please update your config to use the ShowFileRequestHandler.
[junit4:junit4]   2> 4286 T1412 oasc.SolrCore.initDeprecatedSupport WARNING adding ShowFileRequestHandler with hidden files: [SCHEMA.XML, OLD_SYNONYMS.TXT, STOPWORDS.TXT, PROTWORDS.TXT, OPEN-EXCHANGE-RATES.JSON, SYNONYMS.TXT, CURRENCY.XML, MAPPING-ISOLATIN1ACCENT.TXT]
[junit4:junit4]   2> 4290 T1412 oass.SolrIndexSearcher.<init> Opening Searcher@284a7507 main
[junit4:junit4]   2> 4292 T1412 oasu.CommitTracker.<init> Hard AutoCommit: disabled
[junit4:junit4]   2> 4292 T1412 oasu.CommitTracker.<init> Soft AutoCommit: disabled
[junit4:junit4]   2> 4293 T1412 oashc.SpellCheckComponent.inform Initializing spell checkers
[junit4:junit4]   2> 4302 T1412 oass.DirectSolrSpellChecker.init init: {name=direct,classname=DirectSolrSpellChecker,field=lowerfilt,minQueryLength=3}
[junit4:junit4]   2> 4352 T1447 oasc.SolrCore.registerSearcher [collection1] Registered new searcher Searcher@284a7507 main{StandardDirectoryReader(segments_1:1)}
[junit4:junit4]   2> 4800 T1433 oascc.ZkStateReader.updateClusterState Updating cloud state from ZooKeeper... 
[junit4:junit4]   2> 4813 T1432 oascc.ZkStateReader$2.process A cluster state change has occurred - updating...
[junit4:junit4]   2> 4813 T1446 oascc.ZkStateReader$2.process A cluster state change has occurred - updating...
[junit4:junit4]   2> 4862 T1412 oasc.CoreContainer.register registering core: collection1
[junit4:junit4]   2> 4862 T1412 oasc.ZkController.register Register shard - core:collection1 address:http://127.0.0.1:23127/solr shardId:shard1
[junit4:junit4]   2> 4863 T1412 oascc.SolrZkClient.makePath makePath: /collections/collection1/leader_elect/shard1/election
[junit4:junit4]   2> 4868 T1417 oazs.PrepRequestProcessor.pRequest Got user-level KeeperException when processing sessionid:0x139def056ee0003 type:delete cxid:0x42 zxid:0xfffffffffffffffe txntype:unknown reqpath:n/a Error Path:/solr/collections/collection1/leaders Error:KeeperErrorCode = NoNode for /solr/collections/collection1/leaders
[junit4:junit4]   2> 4869 T1412 oasc.ShardLeaderElectionContext.runLeaderProcess Running the leader process.
[junit4:junit4]   2> 4870 T1417 oazs.PrepRequestProcessor.pRequest Got user-level KeeperException when processing sessionid:0x139def056ee0003 type:create cxid:0x43 zxid:0xfffffffffffffffe txntype:unknown reqpath:n/a Error Path:/solr/overseer Error:KeeperErrorCode = NodeExists for /solr/overseer
[junit4:junit4]   2> 4871 T1412 oasc.ShardLeaderElectionContext.waitForReplicasToComeUp Enough replicas found to continue.
[junit4:junit4]   2> 4872 T1412 oasc.ShardLeaderElectionContext.runLeaderProcess I may be the new leader - try and sync
[junit4:junit4]   2> 4872 T1412 oasc.SyncStrategy.sync Sync replicas to http://127.0.0.1:23127/solr/collection1/
[junit4:junit4]   2> 4872 T1412 oasc.SyncStrategy.syncReplicas Sync Success - now sync replicas to me
[junit4:junit4]   2> 4873 T1412 oasc.SyncStrategy.syncToMe http://127.0.0.1:23127/solr/collection1/ has no replicas
[junit4:junit4]   2> 4873 T1412 oasc.ShardLeaderElectionContext.runLeaderProcess I am the new leader: http://127.0.0.1:23127/solr/collection1/
[junit4:junit4]   2> 4873 T1412 oascc.SolrZkClient.makePath makePath: /collections/collection1/leaders/shard1
[junit4:junit4]   2> 4876 T1417 oazs.PrepRequestProcessor.pRequest Got user-level KeeperException when processing sessionid:0x139def056ee0003 type:create cxid:0x4d zxid:0xfffffffffffffffe txntype:unknown reqpath:n/a Error Path:/solr/overseer Error:KeeperErrorCode = NodeExists for /solr/overseer
[junit4:junit4]   2> 5317 T1433 oascc.ZkStateReader.updateClusterState Updating cloud state from ZooKeeper... 
[junit4:junit4]   2> 5509 T1432 oascc.ZkStateReader$2.process A cluster state change has occurred - updating...
[junit4:junit4]   2> 5509 T1446 oascc.ZkStateReader$2.process A cluster state change has occurred - updating...
[junit4:junit4]   2> 5541 T1412 oasc.ZkController.register We are http://127.0.0.1:23127/solr/collection1/ and leader is http://127.0.0.1:23127/solr/collection1/
[junit4:junit4]   2> 5541 T1412 oasc.ZkController.register No LogReplay needed for core=collection1 baseURL=http://127.0.0.1:23127/solr
[junit4:junit4]   2> 5542 T1412 oasc.ZkController.checkRecovery I am the leader, no recovery necessary
[junit4:junit4]   2> 5560 T1412 oascc.ZkStateReader.updateClusterState Updating cloud state from ZooKeeper... 
[junit4:junit4]   2> 5561 T1412 oass.SolrDispatchFilter.init user.dir=/usr/home/hudson/hudson-slave/workspace/Lucene-Solr-Tests-4.x-java7/solr/build/solr-core/test/J0
[junit4:junit4]   2> 5561 T1412 oass.SolrDispatchFilter.init SolrDispatchFilter.init() done
[junit4:junit4]   2> 5562 T1412 oascsi.HttpClientUtil.createClient Creating new http client, config:maxConnections=128&maxConnectionsPerHost=32&followRedirects=false
[junit4:junit4]   2> 6038 T1412 oejs.Server.doStart jetty-8.1.2.v20120308
[junit4:junit4]   2> 6042 T1412 oejs.AbstractConnector.doStart Started SocketConnector@0.0.0.0:23135
[junit4:junit4]   2> 6042 T1412 oasc.SolrResourceLoader.locateSolrHome JNDI not configured for solr (NoInitialContextEx)
[junit4:junit4]   2> 6043 T1412 oasc.SolrResourceLoader.locateSolrHome using system property solr.solr.home: /usr/home/hudson/hudson-slave/workspace/Lucene-Solr-Tests-4.x-java7/solr/build/solr-core/test/J0/./solrtest-jetty2-1348065062058
[junit4:junit4]   2> 6043 T1412 oasc.SolrResourceLoader.<init> new SolrResourceLoader for deduced Solr Home: '/usr/home/hudson/hudson-slave/workspace/Lucene-Solr-Tests-4.x-java7/solr/build/solr-core/test/J0/./solrtest-jetty2-1348065062058/'
[junit4:junit4]   2> 6061 T1433 oascc.ZkStateReader.updateClusterState Updating cloud state from ZooKeeper... 
[junit4:junit4]   2> 6079 T1412 oass.SolrDispatchFilter.init SolrDispatchFilter.init()
[junit4:junit4]   2> 6080 T1412 oasc.SolrResourceLoader.locateSolrHome JNDI not configured for solr (NoInitialContextEx)
[junit4:junit4]   2> 6080 T1412 oasc.SolrResourceLoader.locateSolrHome using system property solr.solr.home: /usr/home/hudson/hudson-slave/workspace/Lucene-Solr-Tests-4.x-java7/solr/build/solr-core/test/J0/./solrtest-jetty2-1348065062058
[junit4:junit4]   2> 6081 T1412 oasc.CoreContainer$Initializer.initialize looking for solr.xml: /usr/home/hudson/hudson-slave/workspace/Lucene-Solr-Tests-4.x-java7/solr/build/solr-core/test/J0/./solrtest-jetty2-1348065062058/solr.xml
[junit4:junit4]   2> 6081 T1446 oascc.ZkStateReader$2.process A cluster state change has occurred - updating...
[junit4:junit4]   2> 6081 T1432 oascc.ZkStateReader$2.process A cluster state change has occurred - updating...
[junit4:junit4]   2> 6081 T1412 oasc.CoreContainer.<init> New CoreContainer 1340536584
[junit4:junit4]   2> 6082 T1412 oasc.CoreContainer.load Loading CoreContainer using Solr Home: '/usr/home/hudson/hudson-slave/workspace/Lucene-Solr-Tests-4.x-java7/solr/build/solr-core/test/J0/./solrtest-jetty2-1348065062058/'
[junit4:junit4]   2> 6082 T1412 oasc.SolrResourceLoader.<init> new SolrResourceLoader for directory: '/usr/home/hudson/hudson-slave/workspace/Lucene-Solr-Tests-4.x-java7/solr/build/solr-core/test/J0/./solrtest-jetty2-1348065062058/'
[junit4:junit4]   2> 6108 T1412 oasc.CoreContainer.load Registering Log Listener
[junit4:junit4]   2> 6121 T1412 oasc.CoreContainer.initZooKeeper Zookeeper client=127.0.0.1:23109/solr
[junit4:junit4]   2> 6122 T1412 oaz.ZooKeeper.<init> Initiating client connection, connectString=127.0.0.1:23109/solr sessionTimeout=5000 watcher=org.apache.solr.common.cloud.ConnectionManager@5bdc3aef
[junit4:junit4]   2> 6122 T1457 oaz.ClientCnxn$SendThread.startConnect Opening socket connection to server /127.0.0.1:23109
[junit4:junit4]   2> 6122 T1412 oascc.ConnectionManager.waitForConnected Waiting for client to connect to ZooKeeper
[junit4:junit4]   2> 6124 T1457 oaz.ClientCnxn$SendThread.primeConnection Socket connection established to localhost/127.0.0.1:23109, initiating session
[junit4:junit4]   2> 6124 T1414 oazs.NIOServerCnxn$Factory.run Accepted socket connection from /140.211.11.196:23136
[junit4:junit4]   2> 6124 T1414 oazs.NIOServerCnxn.readConnectRequest Client attempting to establish new session at /140.211.11.196:23136
[junit4:junit4]   2> 6127 T1416 oazs.NIOServerCnxn.finishSessionInit Established session 0x139def056ee0004 with negotiated timeout 5000 for client /140.211.11.196:23136
[junit4:junit4]   2> 6127 T1457 oaz.ClientCnxn$SendThread.readConnectResult Session establishment complete on server localhost/127.0.0.1:23109, sessionid = 0x139def056ee0004, negotiated timeout = 5000
[junit4:junit4]   2> 6127 T1458 oascc.ConnectionManager.process Watcher org.apache.solr.common.cloud.ConnectionManager@5bdc3aef name:ZooKeeperConnection Watcher:127.0.0.1:23109/solr got event WatchedEvent state:SyncConnected type:None path:null path:null type:None
[junit4:junit4]   2> 6127 T1412 oascc.ConnectionManager.waitForConnected Client is connected to ZooKeeper
[junit4:junit4]   2> 6128 T1417 oazs.PrepRequestProcessor.pRequest Got user-level KeeperException when processing sessionid:0x139def056ee0004 type:create cxid:0x1 zxid:0xfffffffffffffffe txntype:unknown reqpath:n/a Error Path:/solr/overseer Error:KeeperErrorCode = NodeExists for /solr/overseer
[junit4:junit4]   2> 6130 T1417 oazs.PrepRequestProcessor.pRequest Got user-level KeeperException when processing sessionid:0x139def056ee0004 type:create cxid:0x2 zxid:0xfffffffffffffffe txntype:unknown reqpath:n/a Error Path:/solr/overseer Error:KeeperErrorCode = NodeExists for /solr/overseer
[junit4:junit4]   2> 6131 T1412 oasc.ZkController.createEphemeralLiveNode Register node as live in ZooKeeper:/live_nodes/127.0.0.1:23135_solr
[junit4:junit4]   2> 6132 T1417 oazs.PrepRequestProcessor.pRequest Got user-level KeeperException when processing sessionid:0x139def056ee0004 type:delete cxid:0x4 zxid:0xfffffffffffffffe txntype:unknown reqpath:n/a Error Path:/solr/live_nodes/127.0.0.1:23135_solr Error:KeeperErrorCode = NoNode for /solr/live_nodes/127.0.0.1:23135_solr
[junit4:junit4]   2> 6133 T1412 oascc.SolrZkClient.makePath makePath: /live_nodes/127.0.0.1:23135_solr
[junit4:junit4]   2> 6141 T1446 oascc.ZkStateReader$3.process Updating live nodes
[junit4:junit4]   2> 6141 T1432 oascc.ZkStateReader$3.process Updating live nodes
[junit4:junit4]   2> 6141 T1412 oashc.HttpShardHandlerFactory.getParameter Setting socketTimeout to: 0
[junit4:junit4]   2> 6142 T1412 oashc.HttpShardHandlerFactory.getParameter Setting urlScheme to: http://
[junit4:junit4]   2> 6142 T1412 oashc.HttpShardHandlerFactory.getParameter Setting connTimeout to: 0
[junit4:junit4]   2> 6142 T1412 oashc.HttpShardHandlerFactory.getParameter Setting maxConnectionsPerHost to: 20
[junit4:junit4]   2> 6143 T1412 oashc.HttpShardHandlerFactory.getParameter Setting corePoolSize to: 0
[junit4:junit4]   2> 6143 T1412 oashc.HttpShardHandlerFactory.getParameter Setting maximumPoolSize to: 2147483647
[junit4:junit4]   2> 6143 T1412 oashc.HttpShardHandlerFactory.getParameter Setting maxThreadIdleTime to: 5
[junit4:junit4]   2> 6144 T1412 oashc.HttpShardHandlerFactory.getParameter Setting sizeOfQueue to: -1
[junit4:junit4]   2> 6144 T1412 oashc.HttpShardHandlerFactory.getParameter Setting fairnessPolicy to: false
[junit4:junit4]   2> 6144 T1412 oascsi.HttpClientUtil.createClient Creating new http client, config:maxConnectionsPerHost=20&maxConnections=10000&socketTimeout=0&connTimeout=0&retry=false
[junit4:junit4]   2> 6157 T1412 oascc.ZkStateReader.createClusterStateWatchersAndUpdate Updating cluster state from ZooKeeper... 
[junit4:junit4]   2> 6163 T1412 oasc.CoreContainer.create Creating SolrCore 'collection1' using instanceDir: /usr/home/hudson/hudson-slave/workspace/Lucene-Solr-Tests-4.x-java7/solr/build/solr-core/test/J0/./solrtest-jetty2-1348065062058/collection1
[junit4:junit4]   2> 6163 T1412 oasc.ZkController.createCollectionZkNode Check for collection zkNode:collection1
[junit4:junit4]   2> 6163 T1412 oasc.ZkController.createCollectionZkNode Collection zkNode exists
[junit4:junit4]   2> 6164 T1412 oasc.ZkController.readConfigName Load collection config from:/collections/collection1
[junit4:junit4]   2> 6165 T1412 oasc.SolrResourceLoader.<init> new SolrResourceLoader for directory: '/usr/home/hudson/hudson-slave/workspace/Lucene-Solr-Tests-4.x-java7/solr/build/solr-core/test/J0/./solrtest-jetty2-1348065062058/collection1/'
[junit4:junit4]   2> 6166 T1412 oasc.SolrResourceLoader.replaceClassLoader Adding 'file:/usr/home/hudson/hudson-slave/workspace/Lucene-Solr-Tests-4.x-java7/solr/build/solr-core/test/J0/solrtest-jetty2-1348065062058/collection1/lib/classes/' to classloader
[junit4:junit4]   2> 6166 T1412 oasc.SolrResourceLoader.replaceClassLoader Adding 'file:/usr/home/hudson/hudson-slave/workspace/Lucene-Solr-Tests-4.x-java7/solr/build/solr-core/test/J0/solrtest-jetty2-1348065062058/collection1/lib/README' to classloader
[junit4:junit4]   2> 6208 T1412 oasc.SolrConfig.<init> Using Lucene MatchVersion: LUCENE_40
[junit4:junit4]   2> 6268 T1412 oasc.SolrConfig.<init> Loaded SolrConfig: solrconfig.xml
[junit4:junit4]   2> 6369 T1412 oass.IndexSchema.readSchema Reading Solr Schema
[junit4:junit4]   2> 6375 T1412 oass.IndexSchema.readSchema Schema name=test
[junit4:junit4]   2> 6860 T1412 oass.OpenExchangeRatesOrgProvider.init Initialized with rates=open-exchange-rates.json, refreshInterval=1440.
[junit4:junit4]   2> 6869 T1412 oass.IndexSchema.readSchema default search field in schema is text
[junit4:junit4]   2> 6872 T1412 oass.IndexSchema.readSchema unique key field: id
[junit4:junit4]   2> 6883 T1412 oass.FileExchangeRateProvider.reload Reloading exchange rates from file currency.xml
[junit4:junit4]   2> 6887 T1412 oass.FileExchangeRateProvider.reload Reloading exchange rates from file currency.xml
[junit4:junit4]   2> 6890 T1412 oass.OpenExchangeRatesOrgProvider.reload Reloading exchange rates from open-exchange-rates.json
[junit4:junit4]   2> 6891 T1412 oass.OpenExchangeRatesOrgProvider.reload Reloading exchange rates from open-exchange-rates.json
[junit4:junit4]   2> 6892 T1412 oasc.SolrCore.<init> [collection1] Opening new SolrCore at /usr/home/hudson/hudson-slave/workspace/Lucene-Solr-Tests-4.x-java7/solr/build/solr-core/test/J0/./solrtest-jetty2-1348065062058/collection1/, dataDir=./org.apache.solr.cloud.BasicDistributedZk2Test-1348065056487/jetty2/
[junit4:junit4]   2> 6893 T1412 oasc.JmxMonitoredMap.<init> JMX monitoring is enabled. Adding Solr mbeans to JMX Server: com.sun.jmx.mbeanserver.JmxMBeanServer@758e7898
[junit4:junit4]   2> 6894 T1412 oasc.SolrCore.getNewIndexDir WARNING New index directory detected: old=null new=./org.apache.solr.cloud.BasicDistributedZk2Test-1348065056487/jetty2/index/
[junit4:junit4]   2> 6895 T1412 oasc.SolrCore.initIndex WARNING [collection1] Solr index directory './org.apache.solr.cloud.BasicDistributedZk2Test-1348065056487/jetty2/index' doesn't exist. Creating new index...
[junit4:junit4]   2> 6895 T1412 oasc.CachingDirectoryFactory.get return new directory for /usr/home/hudson/hudson-slave/workspace/Lucene-Solr-Tests-4.x-java7/solr/build/solr-core/test/J0/./org.apache.solr.cloud.BasicDistributedZk2Test-1348065056487/jetty2/index forceNew:false
[junit4:junit4]   2> 6899 T1412 oasc.SolrDeletionPolicy.onCommit SolrDeletionPolicy.onCommit: commits:num=1
[junit4:junit4]   2> 		commit{dir=/usr/home/hudson/hudson-slave/workspace/Lucene-Solr-Tests-4.x-java7/solr/build/solr-core/test/J0/org.apache.solr.cloud.BasicDistributedZk2Test-1348065056487/jetty2/index,segFN=segments_1,generation=1,filenames=[segments_1]
[junit4:junit4]   2> 6900 T1412 oasc.SolrDeletionPolicy.updateCommits newest commit = 1
[junit4:junit4]   2> 6900 T1412 oasc.SolrCore.initWriters created xml: solr.XMLResponseWriter
[junit4:junit4]   2> 6902 T1412 oasup.UpdateRequestProcessorChain.init inserting DistributedUpdateProcessorFactory into updateRequestProcessorChain "dedupe"
[junit4:junit4]   2> 6903 T1412 oasup.UpdateRequestProcessorChain.init inserting DistributedUpdateProcessorFactory into updateRequestProcessorChain "dedupe-allfields"
[junit4:junit4]   2> 6903 T1412 oasup.UpdateRequestProcessorChain.init inserting DistributedUpdateProcessorFactory into updateRequestProcessorChain "stored_sig"
[junit4:junit4]   2> 6904 T1412 oasup.UpdateRequestProcessorChain.init inserting DistributedUpdateProcessorFactory into updateRequestProcessorChain "uniq-fields"
[junit4:junit4]   2> 6904 T1412 oasup.UpdateRequestProcessorChain.init inserting DistributedUpdateProcessorFactory into updateRequestProcessorChain "distrib-dup-test-chain-implicit"
[junit4:junit4]   2> 6905 T1412 oasc.RequestHandlers.initHandlersFromConfig adding lazy requestHandler: solr.ReplicationHandler
[junit4:junit4]   2> 6905 T1412 oasc.RequestHandlers.initHandlersFromConfig created /replication: solr.ReplicationHandler
[junit4:junit4]   2> 6906 T1412 oasc.RequestHandlers.initHandlersFromConfig created standard: solr.StandardRequestHandler
[junit4:junit4]   2> 6906 T1412 oasc.RequestHandlers.initHandlersFromConfig created /get: solr.RealTimeGetHandler
[junit4:junit4]   2> 6907 T1412 oasc.RequestHandlers.initHandlersFromConfig created dismax: solr.SearchHandler
[junit4:junit4]   2> 6907 T1412 oasc.RequestHandlers.initHandlersFromConfig created mock: org.apache.solr.core.MockQuerySenderListenerReqHandler
[junit4:junit4]   2> 6908 T1412 oasc.RequestHandlers.initHandlersFromConfig created /admin/: org.apache.solr.handler.admin.AdminHandlers
[junit4:junit4]   2> 6909 T1412 oasc.RequestHandlers.initHandlersFromConfig created defaults: solr.StandardRequestHandler
[junit4:junit4]   2> 6909 T1412 oasc.RequestHandlers.initHandlersFromConfig adding lazy requestHandler: solr.StandardRequestHandler
[junit4:junit4]   2> 6909 T1412 oasc.RequestHandlers.initHandlersFromConfig created lazy: solr.StandardRequestHandler
[junit4:junit4]   2> 6910 T1412 oasc.RequestHandlers.initHandlersFromConfig created /update: solr.UpdateRequestHandler
[junit4:junit4]   2> 6911 T1412 oasc.RequestHandlers.initHandlersFromConfig created /terms: org.apache.solr.handler.component.SearchHandler
[junit4:junit4]   2> 6911 T1412 oasc.RequestHandlers.initHandlersFromConfig created spellCheckCompRH: org.apache.solr.handler.component.SearchHandler
[junit4:junit4]   2> 6912 T1412 oasc.RequestHandlers.initHandlersFromConfig created spellCheckCompRH_Direct: org.apache.solr.handler.component.SearchHandler
[junit4:junit4]   2> 6912 T1412 oasc.RequestHandlers.initHandlersFromConfig created spellCheckWithWordbreak: org.apache.solr.handler.component.SearchHandler
[junit4:junit4]   2> 6913 T1412 oasc.RequestHandlers.initHandlersFromConfig created spellCheckWithWordbreak_Direct: org.apache.solr.handler.component.SearchHandler
[junit4:junit4]   2> 6914 T1412 oasc.RequestHandlers.initHandlersFromConfig created spellCheckCompRH1: org.apache.solr.handler.component.SearchHandler
[junit4:junit4]   2> 6914 T1412 oasc.RequestHandlers.initHandlersFromConfig created tvrh: org.apache.solr.handler.component.SearchHandler
[junit4:junit4]   2> 6915 T1412 oasc.RequestHandlers.initHandlersFromConfig created /mlt: solr.MoreLikeThisHandler
[junit4:junit4]   2> 6915 T1412 oasc.RequestHandlers.initHandlersFromConfig created /debug/dump: solr.DumpRequestHandler
[junit4:junit4]   2> 6918 T1412 oashl.XMLLoader.init xsltCacheLifetimeSeconds=60
[junit4:junit4]   2> 6921 T1412 oasc.SolrCore.initDeprecatedSupport WARNING solrconfig.xml uses deprecated <admin/gettableFiles>, Please update your config to use the ShowFileRequestHandler.
[junit4:junit4]   2> 6922 T1412 oasc.SolrCore.initDeprecatedSupport WARNING adding ShowFileRequestHandler with hidden files: [SCHEMA.XML, OLD_SYNONYMS.TXT, STOPWORDS.TXT, PROTWORDS.TXT, OPEN-EXCHANGE-RATES.JSON, SYNONYMS.TXT, CURRENCY.XML, MAPPING-ISOLATIN1ACCENT.TXT]
[junit4:junit4]   2> 6925 T1412 oass.SolrIndexSearcher.<init> Opening Searcher@510842cb main
[junit4:junit4]   2> 6926 T1412 oasu.CommitTracker.<init> Hard AutoCommit: disabled
[junit4:junit4]   2> 6926 T1412 oasu.CommitTracker.<init> Soft AutoCommit: disabled
[junit4:junit4]   2> 6927 T1412 oashc.SpellCheckComponent.inform Initializing spell checkers
[junit4:junit4]   2> 6933 T1412 oass.DirectSolrSpellChecker.init init: {name=direct,classname=DirectSolrSpellChecker,field=lowerfilt,minQueryLength=3}
[junit4:junit4]   2> 6981 T1459 oasc.SolrCore.registerSearcher [collection1] Registered new searcher Searcher@510842cb main{StandardDirectoryReader(segments_1:1)}
[junit4:junit4]   2> 7087 T1433 oascc.ZkStateReader.updateClusterState Updating cloud state from ZooKeeper... 
[junit4:junit4]   2> 7100 T1432 oascc.ZkStateReader$2.process A cluster state change has occurred - updating...
[junit4:junit4]   2> 7100 T1446 oascc.ZkStateReader$2.process A cluster state change has occurred - updating...
[junit4:junit4]   2> 7100 T1458 oascc.ZkStateReader$2.process A cluster state change has occurred - updating...
[junit4:junit4]   2> 7488 T1412 oasc.CoreContainer.register registering core: collection1
[junit4:junit4]   2> 7488 T1412 oasc.ZkController.register Register shard - core:collection1 address:http://127.0.0.1:23135/solr shardId:shard2
[junit4:junit4]   2> 7489 T1412 oascc.SolrZkClient.makePath makePath: /collections/collection1/leader_elect/shard2/election
[junit4:junit4]   2> 7503 T1417 oazs.PrepRequestProcessor.pRequest Got user-level KeeperException when processing sessionid:0x139def056ee0004 type:delete cxid:0x41 zxid:0xfffffffffffffffe txntype:unknown reqpath:n/a Error Path:/solr/collections/collection1/leaders/shard2 Error:KeeperErrorCode = NoNode for /solr/collections/collection1/leaders/shard2
[junit4:junit4]   2> 7504 T1412 oasc.ShardLeaderElectionContext.runLeaderProcess Running the leader process.
[junit4:junit4]   2> 7505 T1417 oazs.PrepRequestProcessor.pRequest Got user-level KeeperException when processing sessionid:0x139def056ee0004 type:create cxid:0x42 zxid:0xfffffffffffffffe txntype:unknown reqpath:n/a Error Path:/solr/overseer Error:KeeperErrorCode = NodeExists for /solr/overseer
[junit4:junit4]   2> 7514 T1412 oasc.ShardLeaderElectionContext.waitForReplicasToComeUp Enough replicas found to continue.
[junit4:junit4]   2> 7515 T1412 oasc.ShardLeaderElectionContext.runLeaderProcess I may be the new leader - try and sync
[junit4:junit4]   2> 7515 T1412 oasc.SyncStrategy.sync Sync replicas to http://127.0.0.1:23135/solr/collection1/
[junit4:junit4]   2> 7516 T1412 oasc.SyncStrategy.syncReplicas Sync Success - now sync replicas to me
[junit4:junit4]   2> 7516 T1412 oasc.SyncStrategy.syncToMe http://127.0.0.1:23135/solr/collection1/ has no replicas
[junit4:junit4]   2> 7516 T1412 oasc.ShardLeaderElectionContext.runLeaderProcess I am the new leader: http://127.0.0.1:23135/solr/collection1/
[junit4:junit4]   2> 7517 T1412 oascc.SolrZkClient.makePath makePath: /collections/collection1/leaders/shard2
[junit4:junit4]   2> 7520 T1417 oazs.PrepRequestProcessor.pRequest Got user-level KeeperException when processing sessionid:0x139def056ee0004 type:create cxid:0x4b zxid:0xfffffffffffffffe txntype:unknown reqpath:n/a Error Path:/solr/overseer Error:KeeperErrorCode = NodeExists for /solr/overseer
[junit4:junit4]   2> 7613 T1433 oascc.ZkStateReader.updateClusterState Updating cloud state from ZooKeeper... 
[junit4:junit4]   2> 7644 T1432 oascc.ZkStateReader$2.process A cluster state change has occurred - updating...
[junit4:junit4]   2> 7644 T1458 oascc.ZkStateReader$2.process A cluster state change has occurred - updating...
[junit4:junit4]   2> 7644 T1446 oascc.ZkStateReader$2.process A cluster state change has occurred - updating...
[junit4:junit4]   2> 7683 T1412 oasc.ZkController.register We are http://127.0.0.1:23135/solr/collection1/ and leader is http://127.0.0.1:23135/solr/collection1/
[junit4:junit4]   2> 7683 T1412 oasc.ZkController.register No LogReplay needed for core=collection1 baseURL=http://127.0.0.1:23135/solr
[junit4:junit4]   2> 7684 T1412 oasc.ZkController.checkRecovery I am the leader, no recovery necessary
[junit4:junit4]   2> 7686 T1412 oascc.ZkStateReader.updateClusterState Updating cloud state from ZooKeeper... 
[junit4:junit4]   2> 7687 T1412 oass.SolrDispatchFilter.init user.dir=/usr/home/hudson/hudson-slave/workspace/Lucene-Solr-Tests-4.x-java7/solr/build/solr-core/test/J0
[junit4:junit4]   2> 7687 T1412 oass.SolrDispatchFilter.init SolrDispatchFilter.init() done
[junit4:junit4]   2> 7688 T1412 oascsi.HttpClientUtil.createClient Creating new http client, config:maxConnections=128&maxConnectionsPerHost=32&followRedirects=false
[junit4:junit4]   2> 8149 T1433 oascc.ZkStateReader.updateClusterState Updating cloud state from ZooKeeper... 
[junit4:junit4]   2> 8169 T1432 oascc.ZkStateReader$2.process A cluster state change has occurred - updating...
[junit4:junit4]   2> 8169 T1458 oascc.ZkStateReader$2.process A cluster state change has occurred - updating...
[junit4:junit4]   2> 8169 T1446 oascc.ZkStateReader$2.process A cluster state change has occurred - updating...
[junit4:junit4]   2> 8186 T1412 oejs.Server.doStart jetty-8.1.2.v20120308
[junit4:junit4]   2> 8189 T1412 oejs.AbstractConnector.doStart Started SocketConnector@0.0.0.0:23140
[junit4:junit4]   2> 8190 T1412 oasc.SolrResourceLoader.locateSolrHome JNDI not configured for solr (NoInitialContextEx)
[junit4:junit4]   2> 8190 T1412 oasc.SolrResourceLoader.locateSolrHome using system property solr.solr.home: /usr/home/hudson/hudson-slave/workspace/Lucene-Solr-Tests-4.x-java7/solr/build/solr-core/test/J0/./solrtest-jetty3-1348065064186
[junit4:junit4]   2> 8191 T1412 oasc.SolrResourceLoader.<init> new SolrResourceLoader for deduced Solr Home: '/usr/home/hudson/hudson-slave/workspace/Lucene-Solr-Tests-4.x-java7/solr/build/solr-core/test/J0/./solrtest-jetty3-1348065064186/'
[junit4:junit4]   2> 8238 T1412 oass.SolrDispatchFilter.init SolrDispatchFilter.init()
[junit4:junit4]   2> 8238 T1412 oasc.SolrResourceLoader.locateSolrHome JNDI not configured for solr (NoInitialContextEx)
[junit4:junit4]   2> 8239 T1412 oasc.SolrResourceLoader.locateSolrHome using system property solr.solr.home: /usr/home/hudson/hudson-slave/workspace/Lucene-Solr-Tests-4.x-java7/solr/build/solr-core/test/J0/./solrtest-jetty3-1348065064186
[junit4:junit4]   2> 8239 T1412 oasc.CoreContainer$Initializer.initialize looking for solr.xml: /usr/home/hudson/hudson-slave/workspace/Lucene-Solr-Tests-4.x-java7/solr/build/solr-core/test/J0/./solrtest-jetty3-1348065064186/solr.xml
[junit4:junit4]   2> 8240 T1412 oasc.CoreContainer.<init> New CoreContainer 103981064
[junit4:junit4]   2> 8241 T1412 oasc.CoreContainer.load Loading CoreContainer using Solr Home: '/usr/home/hudson/hudson-slave/workspace/Lucene-Solr-Tests-4.x-java7/solr/build/solr-core/test/J0/./solrtest-jetty3-1348065064186/'
[junit4:junit4]   2> 8241 T1412 oasc.SolrResourceLoader.<init> new SolrResourceLoader for directory: '/usr/home/hudson/hudson-slave/workspace/Lucene-Solr-Tests-4.x-java7/solr/build/solr-core/test/J0/./solrtest-jetty3-1348065064186/'
[junit4:junit4]   2> 8277 T1412 oasc.CoreContainer.load Registering Log Listener
[junit4:junit4]   2> 8295 T1412 oasc.CoreContainer.initZooKeeper Zookeeper client=127.0.0.1:23109/solr
[junit4:junit4]   2> 8295 T1412 oaz.ZooKeeper.<init> Initiating client connection, connectString=127.0.0.1:23109/solr sessionTimeout=5000 watcher=org.apache.solr.common.cloud.ConnectionManager@5a1c89bd
[junit4:junit4]   2> 8296 T1469 oaz.ClientCnxn$SendThread.startConnect Opening socket connection to server /127.0.0.1:23109
[junit4:junit4]   2> 8296 T1412 oascc.ConnectionManager.waitForConnected Waiting for client to connect to ZooKeeper
[junit4:junit4]   2> 8298 T1469 oaz.ClientCnxn$SendThread.primeConnection Socket connection established to localhost/127.0.0.1:23109, initiating session
[junit4:junit4]   2> 8298 T1414 oazs.NIOServerCnxn$Factory.run Accepted socket connection from /140.211.11.196:23141
[junit4:junit4]   2> 8298 T1414 oazs.NIOServerCnxn.readConnectRequest Client attempting to establish new session at /140.211.11.196:23141
[junit4:junit4]   2> 8300 T1416 oazs.NIOServerCnxn.finishSessionInit Established session 0x139def056ee0005 with negotiated timeout 5000 for client /140.211.11.196:23141
[junit4:junit4]   2> 8300 T1469 oaz.ClientCnxn$SendThread.readConnectResult Session establishment complete on server localhost/127.0.0.1:23109, sessionid = 0x139def056ee0005, negotiated timeout = 5000
[junit4:junit4]   2> 8301 T1470 oascc.ConnectionManager.process Watcher org.apache.solr.common.cloud.ConnectionManager@5a1c89bd name:ZooKeeperConnection Watcher:127.0.0.1:23109/solr got event WatchedEvent state:SyncConnected type:None path:null path:null type:None
[junit4:junit4]   2> 8301 T1412 oascc.ConnectionManager.waitForConnected Client is connected to ZooKeeper
[junit4:junit4]   2> 8302 T1417 oazs.PrepRequestProcessor.pRequest Got user-level KeeperException when processing sessionid:0x139def056ee0005 type:create cxid:0x1 zxid:0xfffffffffffffffe txntype:unknown reqpath:n/a Error Path:/solr/overseer Error:KeeperErrorCode = NodeExists for /solr/overseer
[junit4:junit4]   2> 8303 T1417 oazs.PrepRequestProcessor.pRequest Got user-level KeeperException when processing sessionid:0x139def056ee0005 type:create cxid:0x2 zxid:0xfffffffffffffffe txntype:unknown reqpath:n/a Error Path:/solr/overseer Error:KeeperErrorCode = NodeExists for /solr/overseer
[junit4:junit4]   2> 8313 T1412 oasc.ZkController.createEphemeralLiveNode Register node as live in ZooKeeper:/live_nodes/127.0.0.1:23140_solr
[junit4:junit4]   2> 8314 T1417 oazs.PrepRequestProcessor.pRequest Got user-level KeeperException when processing sessionid:0x139def056ee0005 type:delete cxid:0x4 zxid:0xfffffffffffffffe txntype:unknown reqpath:n/a Error Path:/solr/live_nodes/127.0.0.1:23140_solr Error:KeeperErrorCode = NoNode for /solr/live_nodes/127.0.0.1:23140_solr
[junit4:junit4]   2> 8315 T1412 oascc.SolrZkClient.makePath makePath: /live_nodes/127.0.0.1:23140_solr
[junit4:junit4]   2> 8317 T1432 oascc.ZkStateReader$3.process Updating live nodes
[junit4:junit4]   2> 8317 T1446 oascc.ZkStateReader$3.process Updating live nodes
[junit4:junit4]   2> 8317 T1458 oascc.ZkStateReader$3.process Updating live nodes
[junit4:junit4]   2> 8318 T1412 oashc.HttpShardHandlerFactory.getParameter Setting socketTimeout to: 0
[junit4:junit4]   2> 8318 T1412 oashc.HttpShardHandlerFactory.getParameter Setting urlScheme to: http://
[junit4:junit4]   2> 8319 T1412 oashc.HttpShardHandlerFactory.getParameter Setting connTimeout to: 0
[junit4:junit4]   2> 8319 T1412 oashc.HttpShardHandlerFactory.getParameter Setting maxConnectionsPerHost to: 20
[junit4:junit4]   2> 8320 T1412 oashc.HttpShardHandlerFactory.getParameter Setting corePoolSize to: 0
[junit4:junit4]   2> 8320 T1412 oashc.HttpShardHandlerFactory.getParameter Setting maximumPoolSize to: 2147483647
[junit4:junit4]   2> 8321 T1412 oashc.HttpShardHandlerFactory.getParameter Setting maxThreadIdleTime to: 5
[junit4:junit4]   2> 8321 T1412 oashc.HttpShardHandlerFactory.getParameter Setting sizeOfQueue to: -1
[junit4:junit4]   2> 8322 T1412 oashc.HttpShardHandlerFactory.getParameter Setting fairnessPolicy to: false
[junit4:junit4]   2> 8322 T1412 oascsi.HttpClientUtil.createClient Creating new http client, config:maxConnectionsPerHost=20&maxConnections=10000&socketTimeout=0&connTimeout=0&retry=false
[junit4:junit4]   2> 8349 T1412 oascc.ZkStateReader.createClusterStateWatchersAndUpdate Updating cluster state from ZooKeeper... 
[junit4:junit4]   2> 8356 T1412 oasc.CoreContainer.create Creating SolrCore 'collection1' using instanceDir: /usr/home/hudson/hudson-slave/workspace/Lucene-Solr-Tests-4.x-java7/solr/build/solr-core/test/J0/./solrtest-jetty3-1348065064186/collection1
[junit4:junit4]   2> 8356 T1412 oasc.ZkController.createCollectionZkNode Check for collection zkNode:collection1
[junit4:junit4]   2> 8357 T1412 oasc.ZkController.createCollectionZkNode Collection zkNode exists
[junit4:junit4]   2> 8358 T1412 oasc.ZkController.readConfigName Load collection config from:/collections/collection1
[junit4:junit4]   2> 8359 T1412 oasc.SolrResourceLoader.<init> new SolrResourceLoader for directory: '/usr/home/hudson/hudson-slave/workspace/Lucene-Solr-Tests-4.x-java7/solr/build/solr-core/test/J0/./solrtest-jetty3-1348065064186/collection1/'
[junit4:junit4]   2> 8360 T1412 oasc.SolrResourceLoader.replaceClassLoader Adding 'file:/usr/home/hudson/hudson-slave/workspace/Lucene-Solr-Tests-4.x-java7/solr/build/solr-core/test/J0/solrtest-jetty3-1348065064186/collection1/lib/README' to classloader
[junit4:junit4]   2> 8361 T1412 oasc.SolrResourceLoader.replaceClassLoader Adding 'file:/usr/home/hudson/hudson-slave/workspace/Lucene-Solr-Tests-4.x-java7/solr/build/solr-core/test/J0/solrtest-jetty3-1348065064186/collection1/lib/classes/' to classloader
[junit4:junit4]   2> 8417 T1412 oasc.SolrConfig.<init> Using Lucene MatchVersion: LUCENE_40
[junit4:junit4]   2> 8513 T1412 oasc.SolrConfig.<init> Loaded SolrConfig: solrconfig.xml
[junit4:junit4]   2> 8614 T1412 oass.IndexSchema.readSchema Reading Solr Schema
[junit4:junit4]   2> 8623 T1412 oass.IndexSchema.readSchema Schema name=test
[junit4:junit4]   2> 9306 T1412 oass.OpenExchangeRatesOrgProvider.init Initialized with rates=open-exchange-rates.json, refreshInterval=1440.
[junit4:junit4]   2> 9320 T1412 oass.IndexSchema.readSchema default search field in schema is text
[junit4:junit4]   2> 9325 T1412 oass.IndexSchema.readSchema unique key field: id
[junit4:junit4]   2> 9339 T1412 oass.FileExchangeRateProvider.reload Reloading exchange rates from file currency.xml
[junit4:junit4]   2> 9344 T1412 oass.FileExchangeRateProvider.reload Reloading exchange rates from file currency.xml
[junit4:junit4]   2> 9349 T1412 oass.OpenExchangeRatesOrgProvider.reload Reloading exchange rates from open-exchange-rates.json
[junit4:junit4]   2> 9351 T1412 oass.OpenExchangeRatesOrgProvider.reload Reloading exchange rates from open-exchange-rates.json
[junit4:junit4]   2> 9352 T1412 oasc.SolrCore.<init> [collection1] Opening new SolrCore at /usr/home/hudson/hudson-slave/workspace/Lucene-Solr-Tests-4.x-java7/solr/build/solr-core/test/J0/./solrtest-jetty3-1348065064186/collection1/, dataDir=./org.apache.solr.cloud.BasicDistributedZk2Test-1348065056487/jetty3/
[junit4:junit4]   2> 9352 T1412 oasc.JmxMonitoredMap.<init> JMX monitoring is enabled. Adding Solr mbeans to JMX Server: com.sun.jmx.mbeanserver.JmxMBeanServer@758e7898
[junit4:junit4]   2> 9354 T1412 oasc.SolrCore.getNewIndexDir WARNING New index directory detected: old=null new=./org.apache.solr.cloud.BasicDistributedZk2Test-1348065056487/jetty3/index/
[junit4:junit4]   2> 9355 T1412 oasc.SolrCore.initIndex WARNING [collection1] Solr index directory './org.apache.solr.cloud.BasicDistributedZk2Test-1348065056487/jetty3/index' doesn't exist. Creating new index...
[junit4:junit4]   2> 9356 T1412 oasc.CachingDirectoryFactory.get return new directory for /usr/home/hudson/hudson-slave/workspace/Lucene-Solr-Tests-4.x-java7/solr/build/solr-core/test/J0/./org.apache.solr.cloud.BasicDistributedZk2Test-1348065056487/jetty3/index forceNew:false
[junit4:junit4]   2> 9362 T1412 oasc.SolrDeletionPolicy.onCommit SolrDeletionPolicy.onCommit: commits:num=1
[junit4:junit4]   2> 		commit{dir=/usr/home/hudson/hudson-slave/workspace/Lucene-Solr-Tests-4.x-java7/solr/build/solr-core/test/J0/org.apache.solr.cloud.BasicDistributedZk2Test-1348065056487/jetty3/index,segFN=segments_1,generation=1,filenames=[segments_1]
[junit4:junit4]   2> 9362 T1412 oasc.SolrDeletionPolicy.updateCommits newest commit = 1
[junit4:junit4]   2> 9363 T1412 oasc.SolrCore.initWriters created xml: solr.XMLResponseWriter
[junit4:junit4]   2> 9366 T1412 oasup.UpdateRequestProcessorChain.init inserting DistributedUpdateProcessorFactory into updateRequestProcessorChain "dedupe"
[junit4:junit4]   2> 9367 T1412 oasup.UpdateRequestProcessorChain.init inserting DistributedUpdateProcessorFactory into updateRequestProcessorChain "dedupe-allfields"
[junit4:junit4]   2> 9367 T1412 oasup.UpdateRequestProcessorChain.init inserting DistributedUpdateProcessorFactory into updateRequestProcessorChain "stored_sig"
[junit4:junit4]   2> 9368 T1412 oasup.UpdateRequestProcessorChain.init inserting DistributedUpdateProcessorFactory into updateRequestProcessorChain "uniq-fields"
[junit4:junit4]   2> 9369 T1412 oasup.UpdateRequestProcessorChain.init inserting DistributedUpdateProcessorFactory into updateRequestProcessorChain "distrib-dup-test-chain-implicit"
[junit4:junit4]   2> 9369 T1412 oasc.RequestHandlers.initHandlersFromConfig adding lazy requestHandler: solr.ReplicationHandler
[junit4:junit4]   2> 9370 T1412 oasc.RequestHandlers.initHandlersFromConfig created /replication: solr.ReplicationHandler
[junit4:junit4]   2> 9371 T1412 oasc.RequestHandlers.initHandlersFromConfig created standard: solr.StandardRequestHandler
[junit4:junit4]   2> 9372 T1412 oasc.RequestHandlers.initHandlersFromConfig created /get: solr.RealTimeGetHandler
[junit4:junit4]   2> 9372 T1412 oasc.RequestHandlers.initHandlersFromConfig created dismax: solr.SearchHandler
[junit4:junit4]   2> 9373 T1412 oasc.RequestHandlers.initHandlersFromConfig created mock: org.apache.solr.core.MockQuerySenderListenerReqHandler
[junit4:junit4]   2> 9374 T1412 oasc.RequestHandlers.initHandlersFromConfig created /admin/: org.apache.solr.handler.admin.AdminHandlers
[junit4:junit4]   2> 9375 T1412 oasc.RequestHandlers.initHandlersFromConfig created defaults: solr.StandardRequestHandler
[junit4:junit4]   2> 9375 T1412 oasc.RequestHandlers.initHandlersFromConfig adding lazy requestHandler: solr.StandardRequestHandler
[junit4:junit4]   2> 9376 T1412 oasc.RequestHandlers.initHandlersFromConfig created lazy: solr.StandardRequestHandler
[junit4:junit4]   2> 9377 T1412 oasc.RequestHandlers.initHandlersFromConfig created /update: solr.UpdateRequestHandler
[junit4:junit4]   2> 9378 T1412 oasc.RequestHandlers.initHandlersFromConfig created /terms: org.apache.solr.handler.component.SearchHandler
[junit4:junit4]   2> 9378 T1412 oasc.RequestHandlers.initHandlersFromConfig created spellCheckCompRH: org.apache.solr.handler.component.SearchHandler
[junit4:junit4]   2> 9379 T1412 oasc.RequestHandlers.initHandlersFromConfig created spellCheckCompRH_Direct: org.apache.solr.handler.component.SearchHandler
[junit4:junit4]   2> 9380 T1412 oasc.RequestHandlers.initHandlersFromConfig created spellCheckWithWordbreak: org.apache.solr.handler.component.SearchHandler
[junit4:junit4]   2> 9381 T1412 oasc.RequestHandlers.initHandlersFromConfig created spellCheckWithWordbreak_Direct: org.apache.solr.handler.component.SearchHandler
[junit4:junit4]   2> 9382 T1412 oasc.RequestHandlers.initHandlersFromConfig created spellCheckCompRH1: org.apache.solr.handler.component.SearchHandler
[junit4:junit4]   2> 9382 T1412 oasc.RequestHandlers.initHandlersFromConfig created tvrh: org.apache.solr.handler.component.SearchHandler
[junit4:junit4]   2> 9383 T1412 oasc.RequestHandlers.initHandlersFromConfig created /mlt: solr.MoreLikeThisHandler
[junit4:junit4]   2> 9384 T1412 oasc.RequestHandlers.initHandlersFromConfig created /debug/dump: solr.DumpRequestHandler
[junit4:junit4]   2> 9388 T1412 oashl.XMLLoader.init xsltCacheLifetimeSeconds=60
[junit4:junit4]   2> 9394 T1412 oasc.SolrCore.initDeprecatedSupport WARNING solrconfig.xml uses deprecated <admin/gettableFiles>, Please update your config to use the ShowFileRequestHandler.
[junit4:junit4]   2> 9395 T1412 oasc.SolrCore.initDeprecatedSupport WARNING adding ShowFileRequestHandler with hidden files: [SCHEMA.XML, OLD_SYNONYMS.TXT, STOPWORDS.TXT, PROTWORDS.TXT, OPEN-EXCHANGE-RATES.JSON, SYNONYMS.TXT, CURRENCY.XML, MAPPING-ISOLATIN1ACCENT.TXT]
[junit4:junit4]   2> 9400 T1412 oass.SolrIndexSearcher.<init> Opening Searcher@298983ec main
[junit4:junit4]   2> 9401 T1412 oasu.CommitTracker.<init> Hard AutoCommit: disabled
[junit4:junit4]   2> 9402 T1412 oasu.CommitTracker.<init> Soft AutoCommit: disabled
[junit4:junit4]   2> 9403 T1412 oashc.SpellCheckComponent.inform Initializing spell checkers
[junit4:junit4]   2> 9420 T1412 oass.DirectSolrSpellChecker.init init: {name=direct,classname=DirectSolrSpellChecker,field=lowerfilt,minQueryLength=3}
[junit4:junit4]   2> 9468 T1471 oasc.SolrCore.registerSearcher [collection1] Registered new searcher Searcher@298983ec main{StandardDirectoryReader(segments_1:1)}
[junit4:junit4]   2> 9678 T1433 oascc.ZkStateReader.updateClusterState Updating cloud state from ZooKeeper... 
[junit4:junit4]   2> 9691 T1432 oascc.ZkStateReader$2.process A cluster state change has occurred - updating...
[junit4:junit4]   2> 9691 T1446 oascc.ZkStateReader$2.process A cluster state change has occurred - updating...
[junit4:junit4]   2> 9691 T1470 oascc.ZkStateReader$2.process A cluster state change has occurred - updating...
[junit4:junit4]   2> 9691 T1458 oascc.ZkStateReader$2.process A cluster state change has occurred - updating...
[junit4:junit4]   2> 9978 T1412 oasc.CoreContainer.register registering core: collection1
[junit4:junit4]   2> 9978 T1412 oasc.ZkController.register Register shard - core:collection1 address:http://127.0.0.1:23140/solr shardId:shard1
[junit4:junit4]   2> 9982 T1412 oasc.ZkController.register We are http://127.0.0.1:23140/solr/collection1/ and leader is http://127.0.0.1:23127/solr/collection1/
[junit4:junit4]   2> 9982 T1412 oasc.ZkController.register No LogReplay needed for core=collection1 baseURL=http://127.0.0.1:23140/solr
[junit4:junit4]   2> 9983 T1412 oasc.ZkController.checkRecovery Core needs to recover:collection1
[junit4:junit4]   2> 9983 T1412 oasu.DefaultSolrCoreState.doRecovery Running recovery - first canceling any ongoing recovery
[junit4:junit4]   2> ASYNC  NEW_CORE C137 name=collection1 org.apache.solr.core.SolrCore@3b16ec7c url=http://127.0.0.1:23140/solr/collection1 node=127.0.0.1:23140_solr
[junit4:junit4]   2> 9984 T1472 C137 P23140 oasc.RecoveryStrategy.run Starting recovery process.  core=collection1 recoveringAfterStartup=true
[junit4:junit4]   2> 9985 T1472 C137 P23140 oasc.RecoveryStrategy.doRecovery ###### startupVersions=[]
[junit4:junit4]   2> 9985 T1412 oascc.ZkStateReader.updateClusterState Updating cloud state from ZooKeeper... 
[junit4:junit4]   2> 9986 T1472 C137 P23140 oasc.RecoveryStrategy.doRecovery Attempting to PeerSync from http://127.0.0.1:23127/solr/collection1/ core=collection1 - recoveringAfterStartup=true
[junit4:junit4]   2> 9986 T1472 C137 P23140 oasu.PeerSync.sync PeerSync: core=collection1 url=http://127.0.0.1:23140/solr START replicas=[http://127.0.0.1:23127/solr/collection1/] nUpdates=100
[junit4:junit4]   2> 9986 T1412 oass.SolrDispatchFilter.init user.dir=/usr/home/hudson/hudson-slave/workspace/Lucene-Solr-Tests-4.x-java7/solr/build/solr-core/test/J0
[junit4:junit4]   2> 9987 T1472 C137 P23140 oasu.PeerSync.sync WARNING no frame of reference to tell of we've missed updates
[junit4:junit4]   2> 9987 T1412 oass.SolrDispatchFilter.init SolrDispatchFilter.init() done
[junit4:junit4]   2> 9987 T1472 C137 P23140 oasc.RecoveryStrategy.doRecovery PeerSync Recovery was not successful - trying replication. core=collection1
[junit4:junit4]   2> 9987 T1472 C137 P23140 oasc.RecoveryStrategy.doRecovery Starting Replication Recovery. core=collection1
[junit4:junit4]   2> 9987 T1412 oascsi.HttpClientUtil.createClient Creating new http client, config:maxConnections=128&maxConnectionsPerHost=32&followRedirects=false
[junit4:junit4]   2> 9988 T1472 C137 P23140 oascsi.HttpClientUtil.createClient Creating new http client, config:maxConnections=128&maxConnectionsPerHost=32&followRedirects=false
[junit4:junit4]   2> ASYNC  NEW_CORE C138 name=collection1 org.apache.solr.core.SolrCore@77899515 url=http://127.0.0.1:23127/solr/collection1 node=127.0.0.1:23127_solr
[junit4:junit4]   2> 9996 T1438 C138 P23127 REQ /get {distrib=false&qt=/get&wt=javabin&version=2&getVersions=100} status=0 QTime=0 
[junit4:junit4]   2> 10196 T1433 oascc.ZkStateReader.updateClusterState Updating cloud state from ZooKeeper... 
[junit4:junit4]   2> 10269 T1446 oascc.ZkStateReader$2.process A cluster state change has occurred - updating...
[junit4:junit4]   2> 10269 T1432 oascc.ZkStateReader$2.process A cluster state change has occurred - updating...
[junit4:junit4]   2> 10269 T1458 oascc.ZkStateReader$2.process A cluster state change has occurred - updating...
[junit4:junit4]   2> 10269 T1470 oascc.ZkStateReader$2.process A cluster state change has occurred - updating...
[junit4:junit4]   2> 10411 T1412 oejs.Server.doStart jetty-8.1.2.v20120308
[junit4:junit4]   2> 10414 T1412 oejs.AbstractConnector.doStart Started SocketConnector@0.0.0.0:23146
[junit4:junit4]   2> 10415 T1412 oasc.SolrResourceLoader.locateSolrHome JNDI not configured for solr (NoInitialContextEx)
[junit4:junit4]   2> 10415 T1412 oasc.SolrResourceLoader.locateSolrHome using system property solr.solr.home: /usr/home/hudson/hudson-slave/workspace/Lucene-Solr-Tests-4.x-java7/solr/build/solr-core/test/J0/./solrtest-jetty4-1348065066489
[junit4:junit4]   2> 10416 T1412 oasc.SolrResourceLoader.<init> new SolrResourceLoader for deduced Solr Home: '/usr/home/hudson/hudson-slave/workspace/Lucene-Solr-Tests-4.x-java7/solr/build/solr-core/test/J0/./solrtest-jetty4-1348065066489/'
[junit4:junit4]   2> 10454 T1412 oass.SolrDispatchFilter.init SolrDispatchFilter.init()
[junit4:junit4]   2> 10454 T1412 oasc.SolrResourceLoader.locateSolrHome JNDI not configured for solr (NoInitialContextEx)
[junit4:junit4]   2> 10455 T1412 oasc.SolrResourceLoader.locateSolrHome using system property solr.solr.home: /usr/home/hudson/hudson-slave/workspace/Lucene-Solr-Tests-4.x-java7/solr/build/solr-core/test/J0/./solrtest-jetty4-1348065066489
[junit4:junit4]   2> 10455 T1412 oasc.CoreContainer$Initializer.initialize looking for solr.xml: /usr/home/hudson/hudson-slave/workspace/Lucene-Solr-Tests-4.x-java7/solr/build/solr-core/test/J0/./solrtest-jetty4-1348065066489/solr.xml
[junit4:junit4]   2> 10456 T1412 oasc.CoreContainer.<init> New CoreContainer 884518107
[junit4:junit4]   2> 10457 T1412 oasc.CoreContainer.load Loading CoreContainer using Solr Home: '/usr/home/hudson/hudson-slave/workspace/Lucene-Solr-Tests-4.x-java7/solr/build/solr-core/test/J0/./solrtest-jetty4-1348065066489/'
[junit4:junit4]   2> 10457 T1412 oasc.SolrResourceLoader.<init> new SolrResourceLoader for directory: '/usr/home/hudson/hudson-slave/workspace/Lucene-Solr-Tests-4.x-java7/solr/build/solr-core/test/J0/./solrtest-jetty4-1348065066489/'
[junit4:junit4]   2> 10487 T1412 oasc.CoreContainer.load Registering Log Listener
[junit4:junit4]   2> 10503 T1412 oasc.CoreContainer.initZooKeeper Zookeeper client=127.0.0.1:23109/solr
[junit4:junit4]   2> 10504 T1412 oaz.ZooKeeper.<init> Initiating client connection, connectString=127.0.0.1:23109/solr sessionTimeout=5000 watcher=org.apache.solr.common.cloud.ConnectionManager@24a72ec1
[junit4:junit4]   2> 10505 T1483 oaz.ClientCnxn$SendThread.startConnect Opening socket connection to server /127.0.0.1:23109
[junit4:junit4]   2> 10505 T1412 oascc.ConnectionManager.waitForConnected Waiting for client to connect to ZooKeeper
[junit4:junit4]   2> 10506 T1483 oaz.ClientCnxn$SendThread.primeConnection Socket connection established to localhost/127.0.0.1:23109, initiating session
[junit4:junit4]   2> 10506 T1414 oazs.NIOServerCnxn$Factory.run Accepted socket connection from /140.211.11.196:23147
[junit4:junit4]   2> 10507 T1414 oazs.NIOServerCnxn.readConnectRequest Client attempting to establish new session at /140.211.11.196:23147
[junit4:junit4]   2> 10536 T1416 oazs.NIOServerCnxn.finishSessionInit Established session 0x139def056ee0006 with negotiated timeout 5000 for client /140.211.11.196:23147
[junit4:junit4]   2> 10536 T1483 oaz.ClientCnxn$SendThread.readConnectResult Session establishment complete on server localhost/127.0.0.1:23109, sessionid = 0x139def056ee0006, negotiated timeout = 5000
[junit4:junit4]   2> 10537 T1484 oascc.ConnectionManager.process Watcher org.apache.solr.common.cloud.ConnectionManager@24a72ec1 name:ZooKeeperConnection Watcher:127.0.0.1:23109/solr got event WatchedEvent state:SyncConnected type:None path:null path:null type:None
[junit4:junit4]   2> 10537 T1412 oascc.ConnectionManager.waitForConnected Client is connected to ZooKeeper
[junit4:junit4]   2> 10538 T1417 oazs.PrepRequestProcessor.pRequest Got user-level KeeperException when processing sessionid:0x139def056ee0006 type:create cxid:0x1 zxid:0xfffffffffffffffe txntype:unknown reqpath:n/a Error Path:/solr/overseer Error:KeeperErrorCode = NodeExists for /solr/overseer
[junit4:junit4]   2> 10576 T1417 oazs.PrepRequestProcessor.pRequest Got user-level KeeperException when processing sessionid:0x139def056ee0006 type:create cxid:0x2 zxid:0xfffffffffffffffe txntype:unknown reqpath:n/a Error Path:/solr/overseer Error:KeeperErrorCode = NodeExists for /solr/overseer
[junit4:junit4]   2> 10624 T1412 oasc.ZkController.createEphemeralLiveNode Register node as live in ZooKeeper:/live_nodes/127.0.0.1:23146_solr
[junit4:junit4]   2> 10625 T1417 oazs.PrepRequestProcessor.pRequest Got user-level KeeperException when processing sessionid:0x139def056ee0006 type:delete cxid:0x4 zxid:0xfffffffffffffffe txntype:unknown reqpath:n/a Error Path:/solr/live_nodes/127.0.0.1:23146_solr Error:KeeperErrorCode = NoNode for /solr/live_nodes/127.0.0.1:23146_solr
[junit4:junit4]   2> 10647 T1412 oascc.SolrZkClient.makePath makePath: /live_nodes/127.0.0.1:23146_solr
[junit4:junit4]   2> 10686 T1432 oascc.ZkStateReader$3.process Updating live nodes
[junit4:junit4]   2> 10686 T1446 oascc.ZkStateReader$3.process Updating live nodes
[junit4:junit4]   2> 10686 T1470 oascc.ZkStateReader$3.process Updating live nodes
[junit4:junit4]   2> 10686 T1458 oascc.ZkStateReader$3.process Updating live nodes
[junit4:junit4]   2> 10687 T1412 oashc.HttpShardHandlerFactory.getParameter Setting socketTimeout to: 0
[junit4:junit4]   2> 10687 T1412 oashc.HttpShardHandlerFactory.getParameter Setting urlScheme to: http://
[junit4:junit4]   2> 10688 T1412 oashc.HttpShardHandlerFactory.getParameter Setting connTimeout to: 0
[junit4:junit4]   2> 10688 T1412 oashc.HttpShardHandlerFactory.getParameter Setting maxConnectionsPerHost to: 20
[junit4:junit4]   2> 10689 T1412 oashc.HttpShardHandlerFactory.getParameter Setting corePoolSize to: 0
[junit4:junit4]   2> 10689 T1412 oashc.HttpShardHandlerFactory.getParameter Setting maximumPoolSize to: 2147483647
[junit4:junit4]   2> 10690 T1412 oashc.HttpShardHandlerFactory.getParameter Setting maxThreadIdleTime to: 5
[junit4:junit4]   2> 10690 T1412 oashc.HttpShardHandlerFactory.getParameter Setting sizeOfQueue to: -1
[junit4:junit4]   2> 10691 T1412 oashc.HttpShardHandlerFactory.getParameter Setting fairnessPolicy to: false
[junit4:junit4]   2> 10691 T1412 oascsi.HttpClientUtil.createClient Creating new http client, config:maxConnectionsPerHost=20&maxConnections=10000&socketTimeout=0&connTimeout=0&retry=false
[junit4:junit4]   2> 10708 T1412 oascc.ZkStateReader.createClusterStateWatchersAndUpdate Updating cluster state from ZooKeeper... 
[junit4:junit4]   2> 10715 T1412 oasc.CoreContainer.create Creating SolrCore 'collection1' using instanceDir: /usr/home/hudson/hudson-slave/workspace/Lucene-Solr-Tests-4.x-java7/solr/build/solr-core/test/J0/./solrtest-jetty4-1348065066489/collection1
[junit4:junit4]   2> 10715 T1412 oasc.ZkController.createCollectionZkNode Check for collection zkNode:collection1
[junit4:junit4]   2> 10716 T1412 oasc.ZkController.createCollectionZkNode Collection zkNode exists
[junit4:junit4]   2> 10717 T1412 oasc.ZkController.readConfigName Load collection config from:/collections/collection1
[junit4:junit4]   2> 10718 T1412 oasc.SolrResourceLoader.<init> new SolrResourceLoader for directory: '/usr/home/hudson/hudson-slave/workspace/Lucene-Solr-Tests-4.x-java7/solr/build/solr-core/test/J0/./solrtest-jetty4-1348065066489/collection1/'
[junit4:junit4]   2> 10719 T1412 oasc.SolrResourceLoader.replaceClassLoader Adding 'file:/usr/home/hudson/hudson-slave/workspace/Lucene-Solr-Tests-4.x-java7/solr/build/solr-core/test/J0/solrtest-jetty4-1348065066489/collection1/lib/classes/' to classloader
[junit4:junit4]   2> 10720 T1412 oasc.SolrResourceLoader.replaceClassLoader Adding 'file:/usr/home/hudson/hudson-slave/workspace/Lucene-Solr-Tests-4.x-java7/solr/build/solr-core/test/J0/solrtest-jetty4-1348065066489/collection1/lib/README' to classloader
[junit4:junit4]   2> 10774 T1412 oasc.SolrConfig.<init> Using Lucene MatchVersion: LUCENE_40
[junit4:junit4]   2> 10860 T1412 oasc.SolrConfig.<init> Loaded SolrConfig: solrconfig.xml
[junit4:junit4]   2> 10962 T1412 oass.IndexSchema.readSchema Reading Solr Schema
[junit4:junit4]   2> 10971 T1412 oass.IndexSchema.readSchema Schema name=test
[junit4:junit4]   2> 11678 T1412 oass.OpenExchangeRatesOrgProvider.init Initialized with rates=open-exchange-rates.json, refreshInterval=1440.
[junit4:junit4]   2> 11698 T1412 oass.IndexSchema.readSchema default search field in schema is text
[junit4:junit4]   2> 11705 T1412 oass.IndexSchema.readSchema unique key field: id
[junit4:junit4]   2> 11721 T1412 oass.FileExchangeRateProvider.reload Reloading exchange rates from file currency.xml
[junit4:junit4]   2> 11728 T1412 oass.FileExchangeRateProvider.reload Reloading exchange rates from file currency.xml
[junit4:junit4]   2> 11732 T1412 oass.OpenExchangeRatesOrgProvider.reload Reloading exchange rates from open-exchange-rates.json
[junit4:junit4]   2> 11734 T1412 oass.OpenExchangeRatesOrgProvider.reload Reloading exchange rates from open-exchange-rates.json
[junit4:junit4]   2> 11735 T1412 oasc.SolrCore.<init> [collection1] Opening new SolrCore at /usr/home/hudson/hudson-slave/workspace/Lucene-Solr-Tests-4.x-java7/solr/build/solr-core/test/J0/./solrtest-jetty4-1348065066489/collection1/, dataDir=./org.apache.solr.cloud.BasicDistributedZk2Test-1348065056487/jetty4/
[junit4:junit4]   2> 11735 T1412 oasc.JmxMonitoredMap.<init> JMX monitoring is enabled. Adding Solr mbeans to JMX Server: com.sun.jmx.mbeanserver.JmxMBeanServer@758e7898
[junit4:junit4]   2> 11737 T1412 oasc.SolrCore.getNewIndexDir WARNING New index directory detected: old=null new=./org.apache.solr.cloud.BasicDistributedZk2Test-1348065056487/jetty4/index/
[junit4:junit4]   2> 11738 T1412 oasc.SolrCore.initIndex WARNING [collection1] Solr index directory './org.apache.solr.cloud.BasicDistributedZk2Test-1348065056487/jetty4/index' doesn't exist. Creating new index...
[junit4:junit4]   2> 11739 T1412 oasc.CachingDirectoryFactory.get return new directory for /usr/home/hudson/hudson-slave/workspace/Lucene-Solr-Tests-4.x-java7/solr/build/solr-core/test/J0/./org.apache.solr.cloud.BasicDistributedZk2Test-1348065056487/jetty4/index forceNew:false
[junit4:junit4]   2> 11770 T1412 oasc.SolrDeletionPolicy.onCommit SolrDeletionPolicy.onCommit: commits:num=1
[junit4:junit4]   2> 		commit{dir=/usr/home/hudson/hudson-slave/workspace/Lucene-Solr-Tests-4.x-java7/solr/build/solr-core/test/J0/org.apache.solr.cloud.BasicDistributedZk2Test-1348065056487/jetty4/index,segFN=segments_1,generation=1,filenames=[segments_1]
[junit4:junit4]   2> 11771 T1412 oasc.SolrDeletionPolicy.updateCommits newest commit = 1
[junit4:junit4]   2> 11771 T1412 oasc.SolrCore.initWriters created xml: solr.XMLResponseWriter
[junit4:junit4]   2> 11774 T1412 oasup.UpdateRequestProcessorChain.init inserting DistributedUpdateProcessorFactory into updateRequestProcessorChain "dedupe"
[junit4:junit4]   2> 11775 T1412 oasup.UpdateRequestProcessorChain.init inserting DistributedUpdateProcessorFactory into updateRequestProcessorChain "dedupe-allfields"
[junit4:junit4]   2> 11775 T1412 oasup.UpdateRequestProcessorChain.init inserting DistributedUpdateProcessorFactory into updateRequestProcessorChain "stored_sig"
[junit4:junit4]   2> 11776 T1412 oasup.UpdateRequestProcessorChain.init inserting DistributedUpdateProcessorFactory into updateRequestProcessorChain "uniq-fields"
[junit4:junit4]   2> 11777 T1412 oasup.UpdateRequestProcessorChain.init inserting DistributedUpdateProcessorFactory into updateRequestProcessorChain "distrib-dup-test-chain-implicit"
[junit4:junit4]   2> 11777 T1412 oasc.RequestHandlers.initHandlersFromConfig adding lazy requestHandler: solr.ReplicationHandler
[junit4:junit4]   2> 11778 T1412 oasc.RequestHandlers.initHandlersFromConfig created /replication: solr.ReplicationHandler
[junit4:junit4]   2> 11778 T1412 oasc.RequestHandlers.initHandlersFromConfig created standard: solr.StandardRequestHandler
[junit4:junit4]   2> 11779 T1412 oasc.RequestHandlers.initHandlersFromConfig created /get: solr.RealTimeGetHandler
[junit4:junit4]   2> 11780 T1412 oasc.RequestHandlers.initHandlersFromConfig created dismax: solr.SearchHandler
[junit4:junit4]   2> 11781 T1412 oasc.RequestHandlers.initHandlersFromConfig created mock: org.apache.solr.core.MockQuerySenderListenerReqHandler
[junit4:junit4]   2> 11781 T1412 oasc.RequestHandlers.initHandlersFromConfig created /admin/: org.apache.solr.handler.admin.AdminHandlers
[junit4:junit4]   2> 11782 T1412 oasc.RequestHandlers.initHandlersFromConfig created defaults: solr.StandardRequestHandler
[junit4:junit4]   2> 11783 T1412 oasc.RequestHandlers.initHandlersFromConfig adding lazy requestHandler: solr.StandardRequestHandler
[junit4:junit4]   2> 11783 T1412 oasc.RequestHandlers.initHandlersFromConfig created lazy: solr.StandardRequestHandler
[junit4:junit4]   2> 11784 T1412 oasc.RequestHandlers.initHandlersFromConfig created /update: solr.UpdateRequestHandler
[junit4:junit4]   2> 11785 T1412 oasc.RequestHandlers.initHandlersFromConfig created /terms: org.apache.solr.handler.component.SearchHandler
[junit4:junit4]   2> 11785 T1412 oasc.RequestHandlers.initHandlersFromConfig created spellCheckCompRH: org.apache.solr.handler.component.SearchHandler
[junit4:junit4]   2> 11786 T1412 oasc.RequestHandlers.initHandlersFromConfig created spellCheckCompRH_Direct: org.apache.solr.handler.component.SearchHandler
[junit4:junit4]   2> 11787 T1412 oasc.RequestHandlers.initHandlersFromConfig created spellCheckWithWordbreak: org.apache.solr.handler.component.SearchHandler
[junit4:junit4]   2> 11788 T1412 oasc.RequestHandlers.initHandlersFromConfig created spellCheckWithWordbreak_Direct: org.apache.solr.handler.component.SearchHandler
[junit4:junit4]   2> 11788 T1412 oasc.RequestHandlers.initHandlersFromConfig created spellCheckCompRH1: org.apache.solr.handler.component.SearchHandler
[junit4:junit4]   2> 11789 T1412 oasc.RequestHandlers.initHandlersFromConfig created tvrh: org.apache.solr.handler.component.SearchHandler
[junit4:junit4]   2> 11790 T1412 oasc.RequestHandlers.initHandlersFromConfig created /mlt: solr.MoreLikeThisHandler
[junit4:junit4]   2> 11791 T1412 oasc.RequestHandlers.initHandlersFromConfig created /debug/dump: solr.DumpRequestHandler
[junit4:junit4]   2> 11795 T1412 oashl.XMLLoader.init xsltCacheLifetimeSeconds=60
[junit4:junit4]   2> 11800 T1412 oasc.SolrCore.initDeprecatedSupport WARNING solrconfig.xml uses deprecated <admin/gettableFiles>, Please update your config to use the ShowFileRequestHandler.
[junit4:junit4]   2> 11801 T1412 oasc.SolrCore.initDeprecatedSupport WARNING adding ShowFileRequestHandler with hidden files: [SCHEMA.XML, OLD_SYNONYMS.TXT, STOPWORDS.TXT, PROTWORDS.TXT, OPEN-EXCHANGE-RATES.JSON, SYNONYMS.TXT, CURRENCY.XML, MAPPING-ISOLATIN1ACCENT.TXT]
[junit4:junit4]   2> 11805 T1412 oass.SolrIndexSearcher.<init> Opening Searcher@2416024 main
[junit4:junit4]   2> 11807 T1412 oasu.CommitTracker.<init> Hard AutoCommit: disabled
[junit4:junit4]   2> 11807 T1412 oasu.CommitTracker.<init> Soft AutoCommit: disabled
[junit4:junit4]   2> 11808 T1412 oashc.SpellCheckComponent.inform Initializing spell checkers
[junit4:junit4]   2> 11817 T1412 oass.DirectSolrSpellChecker.init init: {name=direct,classname=DirectSolrSpellChecker,field=lowerfilt,minQueryLength=3}
[junit4:junit4]   2> 11868 T1485 oasc.SolrCore.registerSearcher [collection1] Registered new searcher Searcher@2416024 main{StandardDirectoryReader(segments_1:1)}
[junit4:junit4]   2> 12305 T1433 oascc.ZkStateReader.updateClusterState Updating cloud state from ZooKeeper... 
[junit4:junit4]   2> 12318 T1432 oascc.ZkStateReader$2.process A cluster state change has occurred - updating...
[junit4:junit4]   2> 12318 T1484 oascc.ZkStateReader$2.process A cluster state change has occurred - updating...
[junit4:junit4]   2> 12318 T1470 oascc.ZkStateReader$2.process A cluster state change has occurred - updating...
[junit4:junit4]   2> 12318 T1458 oascc.ZkStateReader$2.process A cluster state change has occurred - updating...
[junit4:junit4]   2> 12318 T1446 oascc.ZkStateReader$2.process A cluster state change has occurred - updating...
[junit4:junit4]   2> 12376 T1412 oasc.CoreContainer.register registering core: collection1
[junit4:junit4]   2> 12376 T1412 oasc.ZkController.register Register shard - core:collection1 address:http://127.0.0.1:23146/solr shardId:shard2
[junit4:junit4]   2> 12379 T1412 oasc.ZkController.register We are http://127.0.0.1:23146/solr/collection1/ and leader is http://127.0.0.1:23135/solr/collection1/
[junit4:junit4]   2> 12379 T1412 oasc.ZkController.register No LogReplay needed for core=collection1 baseURL=http://127.0.0.1:23146/solr
[junit4:junit4]   2> 12379 T1412 oasc.ZkController.checkRecovery Core needs to recover:collection1
[junit4:junit4]   2> 12380 T1412 oasu.DefaultSolrCoreState.doRecovery Running recovery - first canceling any ongoing recovery
[junit4:junit4]   2> ASYNC  NEW_CORE C139 name=collection1 org.apache.solr.core.SolrCore@767aa528 url=http://127.0.0.1:23146/solr/collection1 node=127.0.0.1:23146_solr
[junit4:junit4]   2> 12381 T1486 C139 P23146 oasc.RecoveryStrategy.run Starting recovery process.  core=collection1 recoveringAfterStartup=true
[junit4:junit4]   2> 12381 T1486 C139 P23146 oasc.RecoveryStrategy.doRecovery ###### startupVersions=[]
[junit4:junit4]   2> 12381 T1412 oascc.ZkStateReader.updateClusterState Updating cloud state from ZooKeeper... 
[junit4:junit4]   2> 12382 T1486 C139 P23146 oasc.RecoveryStrategy.doRecovery Attempting to PeerSync from http://127.0.0.1:23135/solr/collection1/ core=collection1 - recoveringAfterStartup=true
[junit4:junit4]   2> 12383 T1486 C139 P23146 oasu.PeerSync.sync PeerSync: core=collection1 url=http://127.0.0.1:23146/solr START replicas=[http://127.0.0.1:23135/solr/collection1/] nUpdates=100
[junit4:junit4]   2> 12383 T1412 oass.SolrDispatchFilter.init user.dir=/usr/home/hudson/hudson-slave/workspace/Lucene-Solr-Tests-4.x-java7/solr/build/solr-core/test/J0
[junit4:junit4]   2> 12383 T1412 oass.SolrDispatchFilter.init SolrDispatchFilter.init() done
[junit4:junit4]   2> 12383 T1486 C139 P23146 oasu.PeerSync.sync WARNING no frame of reference to tell of we've missed updates
[junit4:junit4]   2> 12383 T1486 C139 P23146 oasc.RecoveryStrategy.doRecovery PeerSync Recovery was not successful - trying replication. core=collection1
[junit4:junit4]   2> 12383 T1412 oascsi.HttpClientUtil.createClient Creating new http client, config:maxConnections=128&maxConnectionsPerHost=32&followRedirects=false
[junit4:junit4]   2> 12384 T1486 C139 P23146 oasc.RecoveryStrategy.doRecovery Starting Replication Recovery. core=collection1
[junit4:junit4]   2> 12384 T1486 C139 P23146 oascsi.HttpClientUtil.createClient Creating new http client, config:maxConnections=128&maxConnectionsPerHost=32&followRedirects=false
[junit4:junit4]   2> ASYNC  NEW_CORE C140 name=collection1 org.apache.solr.core.SolrCore@7d8eae97 url=http://127.0.0.1:23135/solr/collection1 node=127.0.0.1:23135_solr
[junit4:junit4]   2> 12392 T1450 C140 P23135 REQ /get {distrib=false&qt=/get&wt=javabin&version=2&getVersions=100} status=0 QTime=0 
[junit4:junit4]   2> 12406 T1412 oaz.ZooKeeper.<init> Initiating client connection, connectString=127.0.0.1:23109/solr sessionTimeout=10000 watcher=org.apache.solr.common.cloud.ConnectionManager@41bcead5
[junit4:junit4]   2> 12407 T1488 oaz.ClientCnxn$SendThread.startConnect Opening socket connection to server /127.0.0.1:23109
[junit4:junit4]   2> 12407 T1412 oascc.ConnectionManager.waitForConnected Waiting for client to connect to ZooKeeper
[junit4:junit4]   2> 12408 T1488 oaz.ClientCnxn$SendThread.primeConnection Socket connection established to localhost/127.0.0.1:23109, initiating session
[junit4:junit4]   2> 12408 T1414 oazs.NIOServerCnxn$Factory.run Accepted socket connection from /140.211.11.196:23152
[junit4:junit4]   2> 12408 T1414 oazs.NIOServerCnxn.readConnectRequest Client attempting to establish new session at /140.211.11.196:23152
[junit4:junit4]   2> 12409 T1416 oazs.NIOServerCnxn.finishSessionInit Established session 0x139def056ee0007 with negotiated timeout 10000 for client /140.211.11.196:23152
[junit4:junit4]   2> 12409 T1488 oaz.ClientCnxn$SendThread.readConnectResult Session establishment complete on server localhost/127.0.0.1:23109, sessionid = 0x139def056ee0007, negotiated timeout = 10000
[junit4:junit4]   2> 12410 T1489 oascc.ConnectionManager.process Watcher org.apache.solr.common.cloud.ConnectionManager@41bcead5 name:ZooKeeperConnection Watcher:127.0.0.1:23109/solr got event WatchedEvent state:SyncConnected type:None path:null path:null type:None
[junit4:junit4]   2> 12410 T1412 oascc.ConnectionManager.waitForConnected Client is connected to ZooKeeper
[junit4:junit4]   2> 12411 T1412 oascc.ZkStateReader.createClusterStateWatchersAndUpdate Updating cluster state from ZooKeeper... 
[junit4:junit4]   2> 12412 T1412 oasc.ChaosMonkey.monkeyLog monkey: init - expire sessions:true cause connection loss:true
[junit4:junit4]   2> 12412 T1412 oascsi.HttpClientUtil.createClient Creating new http client, config:
[junit4:junit4]   2> 12419 T1412 oascc.ZkStateReader.updateClusterState Updating cloud state from ZooKeeper... 
[junit4:junit4]   2> ASYNC  NEW_CORE C141 name=collection1 org.apache.solr.core.SolrCore@1b400443 url=http://127.0.0.1:23112/solr/collection1 node=127.0.0.1:23112_solr
[junit4:junit4]   2> 12430 T1424 C141 P23112 oasc.SolrDeletionPolicy.onInit SolrDeletionPolicy.onInit: commits:num=1
[junit4:junit4]   2> 		commit{dir=/usr/home/hudson/hudson-slave/workspace/Lucene-Solr-Tests-4.x-java7/solr/build/solr-core/test/J0/org.apache.solr.cloud.BasicDistributedZk2Test-1348065056487/control/data/index,segFN=segments_1,generation=1,filenames=[segments_1]
[junit4:junit4]   2> 12430 T1424 C141 P23112 oasc.SolrDeletionPolicy.updateCommits newest commit = 1
[junit4:junit4]   2> 12435 T1424 C141 P23112 /update {wt=javabin&version=2} {add=[1 (1413548677695275008)]} 0 9
[junit4:junit4]   2> 12435 T1412 oaz.ZooKeeper.<init> Initiating client connection, connectString=127.0.0.1:23109/solr sessionTimeout=10000 watcher=org.apache.solr.common.cloud.ConnectionManager@3c4995c3
[junit4:junit4]   2> 12436 T1490 oaz.ClientCnxn$SendThread.startConnect Opening socket connection to server /127.0.0.1:23109
[junit4:junit4]   2> 12436 T1412 oascc.ConnectionManager.waitForConnected Waiting for client to connect to ZooKeeper
[junit4:junit4]   2> 12437 T1490 oaz.ClientCnxn$SendThread.primeConnection Socket connection established to localhost/127.0.0.1:23109, initiating session
[junit4:junit4]   2> 12437 T1414 oazs.NIOServerCnxn$Factory.run Accepted socket connection from /140.211.11.196:23154
[junit4:junit4]   2> 12438 T1414 oazs.NIOServerCnxn.readConnectRequest Client attempting to establish new session at /140.211.11.196:23154
[junit4:junit4]   2> 12439 T1416 oazs.NIOServerCnxn.finishSessionInit Established session 0x139def056ee0008 with negotiated timeout 10000 for client /140.211.11.196:23154
[junit4:junit4]   2> 12439 T1490 oaz.ClientCnxn$SendThread.readConnectResult Session establishment complete on server localhost/127.0.0.1:23109, sessionid = 0x139def056ee0008, negotiated timeout = 10000
[junit4:junit4]   2> 12439 T1491 oascc.ConnectionManager.process Watcher org.apache.solr.common.cloud.ConnectionManager@3c4995c3 name:ZooKeeperConnection Watcher:127.0.0.1:23109/solr got event WatchedEvent state:SyncConnected type:None path:null path:null type:None
[junit4:junit4]   2> 12439 T1412 oascc.ConnectionManager.waitForConnected Client is connected to ZooKeeper
[junit4:junit4]   2> 12440 T1412 oascc.ZkStateReader.createClusterStateWatchersAndUpdate Updating cluster state from ZooKeeper... 
[junit4:junit4]   2> 12448 T1440 C138 P23127 oasc.SolrDeletionPolicy.onInit SolrDeletionPolicy.onInit: commits:num=1
[junit4:junit4]   2> 		commit{dir=/usr/home/hudson/hudson-slave/workspace/Lucene-Solr-Tests-4.x-java7/solr/build/solr-core/test/J0/org.apache.solr.cloud.BasicDistributedZk2Test-1348065056487/jetty1/index,segFN=segments_1,generation=1,filenames=[segments_1]
[junit4:junit4]   2> 12448 T1440 C138 P23127 oasc.SolrDeletionPolicy.updateCommits newest commit = 1
[junit4:junit4]   2>  C137_STATE=coll:collection1 core:collection1 props:{shard=shard1, roles=null, state=recovering, core=collection1, collection=collection1, node_name=127.0.0.1:23140_solr, base_url=http://127.0.0.1:23140/solr}
[junit4:junit4]   2> 12459 T1462 C137 P23140 oasc.SolrDeletionPolicy.onInit SolrDeletionPolicy.onInit: commits:num=1
[junit4:junit4]   2> 		commit{dir=/usr/home/hudson/hudson-slave/workspace/Lucene-Solr-Tests-4.x-java7/solr/build/solr-core/test/J0/org.apache.solr.cloud.BasicDistributedZk2Test-1348065056487/jetty3/index,segFN=segments_1,generation=1,filenames=[segments_1]
[junit4:junit4]   2> 12460 T1462 C137 P23140 oasc.SolrDeletionPolicy.updateCommits newest commit = 1
[junit4:junit4]   2> 12462 T1462 C137 P23140 REQ /update {update.distrib=FROMLEADER&distrib.from=http://127.0.0.1:23127/solr/collection1/&wt=javabin&version=2} status=0 QTime=6 
[junit4:junit4]   2> 12463 T1440 C138 P23127 REQ /update {distrib.from=http://127.0.0.1:23135/solr/collection1/&update.distrib=TOLEADER&wt=javabin&version=2} status=0 QTime=19 
[junit4:junit4]   2> 12464 T1452 C140 P23135 /update {wt=javabin&version=2} {add=[1]} 0 21
[junit4:junit4]   2> 12464 T1412 oasc.AbstractDistribZkTestBase.waitForRecoveriesToFinish Wait for recoveries to finish - collection: collection1 failOnTimeout:true timeout (sec):1800
[junit4:junit4]   2> 12465 T1412 oascc.ZkStateReader.updateClusterState Updating cloud state from ZooKeeper... 
[junit4:junit4]   2> 12832 T1433 oascc.ZkStateReader.updateClusterState Updating cloud state from ZooKeeper... 
[junit4:junit4]   2> 12846 T1432 oascc.ZkStateReader$2.process A cluster state change has occurred - updating...
[junit4:junit4]   2> 12846 T1489 oascc.ZkStateReader$2.process A cluster state change has occurred - updating...
[junit4:junit4]   2> 12846 T1491 oascc.ZkStateReader$2.process A cluster state change has occurred - updating...
[junit4:junit4]   2> 12846 T1470 oascc.ZkStateReader$2.process A cluster state change has occurred - updating...
[junit4:junit4]   2> 12846 T1458 oascc.ZkStateReader$2.process A cluster state change has occurred - updating...
[junit4:junit4]   2> 12846 T1484 oascc.ZkStateReader$2.process A cluster state change has occurred - updating...
[junit4:junit4]   2> 12846 T1446 oascc.ZkStateReader$2.process A cluster state change has occurred - updating...
[junit4:junit4]   2> 13010 T1472 C137 P23140 oasc.RecoveryStrategy.doRecovery Begin buffering updates. core=collection1
[junit4:junit4]   2> 13010 T1472 C137 P23140 oasu.UpdateLog.bufferUpdates Starting to buffer updates. FSUpdateLog{state=ACTIVE, tlog=tlog{file=./org.apache.solr.cloud.BasicDistributedZk2Test-1348065056487/jetty3/tlog/tlog.0000000000000000000 refcount=1}}
[junit4:junit4]   2> 13010 T1472 C137 P23140 oasc.RecoveryStrategy.replicate Attempting to replicate from http://127.0.0.1:23127/solr/collection1/. core=collection1
[junit4:junit4]   2> 13010 T1472 C137 P23140 oascsi.HttpClientUtil.createClient Creating new http client, config:maxConnections=128&maxConnectionsPerHost=32&followRedirects=false
[junit4:junit4]   2> 13020 T1441 C138 P23127 oasu.DirectUpdateHandler2.commit start commit{flags=0,_version_=0,optimize=false,openSearcher=true,waitSearcher=true,expungeDeletes=false,softCommit=false}
[junit4:junit4]   2> 13103 T1441 C138 P23127 oasc.SolrDeletionPolicy.onCommit SolrDeletionPolicy.onCommit: commits:num=2
[junit4:junit4]   2> 		commit{dir=/usr/home/hudson/hudson-slave/workspace/Lucene-Solr-Tests-4.x-java7/solr/build/solr-core/test/J0/org.apache.solr.cloud.BasicDistributedZk2Test-1348065056487/jetty1/index,segFN=segments_1,generation=1,filenames=[segments_1]
[junit4:junit4]   2> 		commit{dir=/usr/home/hudson/hudson-slave/workspace/Lucene-Solr-Tests-4.x-java7/solr/build/solr-core/test/J0/org.apache.solr.cloud.BasicDistributedZk2Test-1348065056487/jetty1/index,segFN=segments_2,generation=2,filenames=[_0_Asserting_0.tim, _0.fnm, _0_Pulsing40_0.tim, _0_Asserting_0.tip, _0_Memory_0.ram, _0_NestedPulsing_0.frq, _0_nrm.cfs, _0_Pulsing40_0.prx, _0_NestedPulsing_0.tip, _0_Pulsing40_0.frq, _0_NestedPulsing_0.prx, _0_NestedPulsing_0.tim, _0_Asserting_0.prx, _0_Asserting_0.frq, _0_nrm.cfe, _0_Pulsing40_0.tip, segments_2, _0.fdx, _0.si, _0.fdt]
[junit4:junit4]   2> 13104 T1441 C138 P23127 oasc.SolrDeletionPolicy.updateCommits newest commit = 2
[junit4:junit4]   2> 13117 T1441 C138 P23127 oass.SolrIndexSearcher.<init> Opening Searcher@4793e4bb main
[junit4:junit4]   2> 13118 T1441 C138 P23127 oasu.DirectUpdateHandler2.commit end_commit_flush
[junit4:junit4]   2> 13119 T1447 oasc.SolrCore.registerSearcher [collection1] Registered new searcher Searcher@4793e4bb main{StandardDirectoryReader(segments_2:3 _0(4.0.0.2):C1)}
[junit4:junit4]   2> 13120 T1441 C138 P23127 /update {waitSearcher=true&commit=true&commit_end_point=true&wt=javabin&softCommit=false&version=2} {commit=} 0 100
[junit4:junit4]   2> 13121 T1472 C137 P23140 oash.ReplicationHandler.inform Commits will be reserved for  10000
[junit4:junit4]   2> 13121 T1472 C137 P23140 oash.SnapPuller.<init>  No value set for 'pollInterval'. Timer Task not started.
[junit4:junit4]   2> 13123 T1442 C138 P23127 oash.ReplicationHandler.inform Commits will be reserved for  10000
[junit4:junit4]   2> 13124 T1442 C138 P23127 REQ /replication {command=indexversion&wt=javabin&qt=/replication&version=2} status=0 QTime=2 
[junit4:junit4]   2> 13124 T1472 C137 P23140 oash.SnapPuller.fetchLatestIndex Master's generation: 2
[junit4:junit4]   2> 13124 T1472 C137 P23140 oash.SnapPuller.fetchLatestIndex Slave's generation: 1
[junit4:junit4]   2> 13125 T1472 C137 P23140 oash.SnapPuller.fetchLatestIndex Starting replication process
[junit4:junit4]   2> 13129 T1442 C138 P23127 REQ /replication {command=filelist&generation=2&wt=javabin&qt=/replication&version=2} status=0 QTime=2 
[junit4:junit4]   2> 13130 T1472 C137 P23140 oash.SnapPuller.fetchLatestIndex Number of files in latest index in master: 20
[junit4:junit4]   2> 13136 T1472 C137 P23140 oash.SnapPuller.fetchLatestIndex Starting download to ./org.apache.solr.cloud.BasicDistributedZk2Test-1348065056487/jetty3/index.20120919073109613 fullCopy=true
[junit4:junit4]   2> 13140 T1442 C138 P23127 REQ /replication {file=_0_Asserting_0.tim&command=filecontent&checksum=true&generation=2&qt=/replication&wt=filestream} status=0 QTime=0 
[junit4:junit4]   2> 13146 T1442 C138 P23127 REQ /replication {file=_0_Pulsing40_0.tim&command=filecontent&checksum=true&generation=2&qt=/replication&wt=filestream} status=0 QTime=0 
[junit4:junit4]   2> 13150 T1442 C138 P23127 REQ /replication {file=_0.fnm&command=filecontent&checksum=true&generation=2&qt=/replication&wt=filestream} status=0 QTime=0 
[junit4:junit4]   2> 13154 T1442 C138 P23127 REQ /replication {file=_0_Asserting_0.tip&command=filecontent&checksum=true&generation=2&qt=/replication&wt=filestream} status=0 QTime=0 
[junit4:junit4]   2> 13158 T1442 C138 P23127 REQ /replication {file=_0_Memory_0.ram&command=filecontent&checksum=true&generation=2&qt=/replication&wt=filestream} status=0 QTime=0 
[junit4:junit4]   2> 13162 T1442 C138 P23127 REQ /replication {file=_0_NestedPulsing_0.frq&command=filecontent&checksum=true&generation=2&qt=/replication&wt=filestream} status=0 QTime=0 
[junit4:junit4]   2> 13166 T1442 C138 P23127 REQ /replication {file=_0_nrm.cfs&command=filecontent&checksum=true&generation=2&qt=/replication&wt=filestream} status=0 QTime=0 
[junit4:junit4]   2> 13170 T1442 C138 P23127 REQ /replication {file=_0_NestedPulsing_0.tip&command=filecontent&checksum=true&generation=2&qt=/replication&wt=filestream} status=0 QTime=0 
[junit4:junit4]   2> 13174 T1442 C138 P23127 REQ /replication {file=_0_Pulsing40_0.prx&command=filecontent&checksum=true&generation=2&qt=/replication&wt=filestream} status=0 QTime=0 
[junit4:junit4]   2> 13178 T1442 C138 P23127 REQ /replication {file=_0_Pulsing40_0.frq&command=filecontent&checksum=true&generation=2&qt=/replication&wt=filestream} status=0 QTime=0 
[junit4:junit4]   2> 13183 T1442 C138 P23127 REQ /replication {file=_0_NestedPulsing_0.prx&command=filecontent&checksum=true&generation=2&qt=/replication&wt=filestream} status=0 QTime=0 
[junit4:junit4]   2> 13187 T1442 C138 P23127 REQ /replication {file=_0_NestedPulsing_0.tim&command=filecontent&checksum=true&generation=2&qt=/replication&wt=filestream} status=0 QTime=0 
[junit4:junit4]   2> 13191 T1442 C138 P23127 REQ /replication {file=_0_Asserting_0.prx&command=filecontent&checksum=true&generation=2&qt=/replication&wt=filestream} status=0 QTime=0 
[junit4:junit4]   2> 13195 T1442 C138 P23127 REQ /replication {file=_0_Asserting_0.frq&command=filecontent&checksum=true&generation=2&qt=/replication&wt=filestream} status=0 QTime=0 
[junit4:junit4]   2> 13199 T1442 C138 P23127 REQ /replication {file=_0_nrm.cfe&command=filecontent&checksum=true&generation=2&qt=/replication&wt=filestream} status=0 QTime=0 
[junit4:junit4]   2> 13203 T1442 C138 P23127 REQ /replication {file=segments_2&command=filecontent&checksum=true&generation=2&qt=/replication&wt=filestream} status=0 QTime=0 
[junit4:junit4]   2> 13207 T1442 C138 P23127 REQ /replication {file=_0_Pulsing40_0.tip&command=filecontent&checksum=true&generation=2&qt=/replication&wt=filestream} status=0 QTime=0 
[junit4:junit4]   2> 13211 T1442 C138 P23127 REQ /replication {file=_0.fdx&command=filecontent&checksum=true&generation=2&qt=/replication&wt=filestream} status=0 QTime=0 
[junit4:junit4]   2> 13216 T1442 C138 P23127 REQ /replication {file=_0.si&command=filecontent&checksum=true&generation=2&qt=/replication&wt=filestream} status=0 QTime=0 
[junit4:junit4]   2> 13220 T1442 C138 P23127 REQ /replication {file=_0.fdt&command=filecontent&checksum=true&generation=2&qt=/replication&wt=filestream} status=0 QTime=0 
[junit4:junit4]   2> 13221 T1472 C137 P23140 oash.SnapPuller.fetchLatestIndex Total time taken for download : 0 secs
[junit4:junit4]   2> 13222 T1472 C137 P23140 oash.SnapPuller.modifyIndexProps New index installed. Updating index properties... index=index.20120919073109613
[junit4:junit4]   2> 13224 T1472 C137 P23140 oasu.DefaultSolrCoreState.newIndexWriter Creating new IndexWriter...
[junit4:junit4]   2> 13225 T1472 C137 P23140 oasu.DefaultSolrCoreState.newIndexWriter Waiting until IndexWriter is unused... core=collection1
[junit4:junit4]   2> 13225 T1472 C137 P23140 oasu.DefaultSolrCoreState.newIndexWriter Rollback old IndexWriter... core=collection1
[junit4:junit4]   2> 13230 T1472 C137 P23140 oasc.SolrCore.getNewIndexDir WARNING New index directory detected: old=./org.apache.solr.cloud.BasicDistributedZk2Test-1348065056487/jetty3/index/ new=./org.apache.solr.cloud.BasicDistributedZk2Test-1348065056487/jetty3/index.20120919073109613
[junit4:junit4]   2> 13231 T1472 C137 P23140 oasc.CachingDirectoryFactory.get return new directory for /usr/home/hudson/hudson-slave/workspace/Lucene-Solr-Tests-4.x-java7/solr/build/solr-core/test/J0/./org.apache.solr.cloud.BasicDistributedZk2Test-1348065056487/jetty3/index.20120919073109613 forceNew:true
[junit4:junit4]   2> 13241 T1472 C137 P23140 oasc.SolrDeletionPolicy.onInit SolrDeletionPolicy.onInit: commits:num=1
[junit4:junit4]   2> 		commit{dir=/usr/home/hudson/hudson-slave/workspace/Lucene-Solr-Tests-4.x-java7/solr/build/solr-core/test/J0/org.apache.solr.cloud.BasicDistributedZk2Test-1348065056487/jetty3/index.20120919073109613,segFN=segments_2,generation=2,filenames=[_0_Asserting_0.tim, _0.fnm, _0_Pulsing40_0.tim, _0_Asserting_0.tip, _0_Memory_0.ram, _0_NestedPulsing_0.frq, _0_nrm.cfs, _0_Pulsing40_0.prx, _0_NestedPulsing_0.tip, _0_Pulsing40_0.frq, _0_NestedPulsing_0.prx, _0_NestedPulsing_0.tim, _0_Asserting_0.prx, _0_Asserting_0.frq, _0_nrm.cfe, _0_Pulsing40_0.tip, segments_2, _0.fdx, _0.si, _0.fdt]
[junit4:junit4]   2> 13241 T1472 C137 P23140 oasc.SolrDeletionPolicy.updateCommits newest commit = 2
[junit4:junit4]   2> 13242 T1472 C137 P23140 oasu.DefaultSolrCoreState.newIndexWriter New IndexWriter is ready to be used.
[junit4:junit4]   2> 13245 T1472 C137 P23140 oass.SolrIndexSearcher.<init> Opening Searcher@229964fa main
[junit4:junit4]   2> 13247 T1471 oasc.SolrCore.registerSearcher [collection1] Registered new searcher Searcher@229964fa main{StandardDirectoryReader(segments_2:3:nrt _0(4.0.0.2):C1)}
[junit4:junit4]   2> 13247 T1471 oasc.CachingDirectoryFactory.close Closing directory:/usr/home/hudson/hudson-slave/workspace/Lucene-Solr-Tests-4.x-java7/solr/build/solr-core/test/J0/./org.apache.solr.cloud.BasicDistributedZk2Test-1348065056487/jetty3/index
[junit4:junit4]   2> 13247 T1471 oash.SnapPuller$2.onClose removing old index directory ./org.apache.solr.cloud.BasicDistributedZk2Test-1348065056487/jetty3/index
[junit4:junit4]   2> 13249 T1472 C137 P23140 oasu.DirectUpdateHandler2.commit start commit{flags=0,_version_=0,optimize=false,openSearcher=false,waitSearcher=false,expungeDeletes=false,softCommit=false}
[junit4:junit4]   2> 13250 T1472 C137 P23140 oasu.DirectUpdateHandler2.commit end_commit_flush
[junit4:junit4]   2> 13256 T1472 C137 P23140 oasc.RecoveryStrategy.replay Replaying buffered documents. core=collection1
[junit4:junit4]   2> 13256 T1495 C137 P23140 oasu.UpdateLog$LogReplayer.doReplay WARNING Starting log replay tlog{file=./org.apache.solr.cloud.BasicDistributedZk2Test-1348065056487/jetty3/tlog/tlog.0000000000000000000 refcount=2} active=true starting pos=432
[junit4:junit4]   2> 13261 T1495 C137 P23140 oasu.DirectUpdateHandler2.commit start commit{flags=2,_version_=0,optimize=false,openSearcher=true,waitSearcher=true,expungeDeletes=false,softCommit=false}
[junit4:junit4]   2> 13263 T1495 C137 P23140 oass.SolrIndexSearcher.<init> Opening Searcher@6f93b2a1 main
[junit4:junit4]   2> 13264 T1495 C137 P23140 oasu.DirectUpdateHandler2.commit end_commit_flush
[junit4:junit4]   2> 13265 T1471 oasc.SolrCore.registerSearcher [collection1] Registered new searcher Searcher@6f93b2a1 main{StandardDirectoryReader(segments_2:3:nrt _0(4.0.0.2):C1)}
[junit4:junit4]   2> 13266 T1495 C137 P23140 oasu.UpdateLog$LogReplayer.run WARNING Log replay finished. recoveryInfo=RecoveryInfo{adds=0 deletes=0 deleteByQuery=0 errors=0 positionOfStart=432}
[junit4:junit4]   2> 13266 T1472 C137 P23140 oasc.RecoveryStrategy.doRecovery Replication Recovery was successful - registering as Active. core=collection1
[junit4:junit4]   2> 13267 T1472 C137 P23140 oasc.RecoveryStrategy.doRecovery Finished recovery process. core=collection1
[junit4:junit4]   2> 13350 T1433 oascc.ZkStateReader.updateClusterState Updating cloud state from ZooKeeper... 
[junit4:junit4]   2> 13362 T1484 oascc.ZkStateReader$2.process A cluster state change has occurred - updating...
[junit4:junit4]   2> 13362 T1491 oascc.ZkStateReader$2.process A cluster state change has occurred - updating...
[junit4:junit4]   2> 13362 T1470 oascc.ZkStateReader$2.process A cluster state change has occurred - updating...
[junit4:junit4]   2> 13362 T1458 oascc.ZkStateReader$2.process A cluster state change has occurred - updating...
[junit4:junit4]   2> 13362 T1446 oascc.ZkStateReader$2.process A cluster state change has occurred - updating...
[junit4:junit4]   2> 13362 T1489 oascc.ZkStateReader$2.process A cluster state change has occurred - updating...
[junit4:junit4]   2> 13362 T1432 oascc.ZkStateReader$2.process A cluster state change has occurred - updating...
[junit4:junit4]   2> 13467 T1412 oascc.ZkStateReader.updateClusterState Updating cloud state from ZooKeeper... 
[junit4:junit4]   2> 14469 T1412 oascc.ZkStateReader.updateClusterState Updating cloud state from ZooKeeper... 
[junit4:junit4]   2>  C139_STATE=coll:collection1 core:collection1 props:{shard=shard2, roles=null, state=recovering, core=collection1, collection=collection1, node_name=127.0.0.1:23146_solr, base_url=http://127.0.0.1:23146/solr}
[junit4:junit4]   2> 15410 T1486 C139 P23146 oasc.RecoveryStrategy.doRecovery Begin buffering updates. core=collection1
[junit4:junit4]   2> 15410 T1486 C139 P23146 oasu.UpdateLog.bufferUpdates Starting to buffer updates. FSUpdateLog{state=ACTIVE, tlog=null}
[junit4:junit4]   2> 15410 T1486 C139 P23146 oasc.RecoveryStrategy.replicate Attempting to replicate from http://127.0.0.1:23135/solr/collection1/. core=collection1
[junit4:junit4]   2> 15411 T1486 C139 P23146 oascsi.HttpClientUtil.createClient Creating new http client, config:maxConnections=128&maxConnectionsPerHost=32&followRedirects=false
[junit4:junit4]   2> 15427 T1453 C140 P23135 oasu.DirectUpdateHandler2.commit start commit{flags=0,_version_=0,optimize=false,openSearcher=true,waitSearcher=true,expungeDeletes=false,softCommit=false}
[junit4:junit4]   2> 15431 T1453 C140 P23135 oasc.SolrDeletionPolicy.onInit SolrDeletionPolicy.onInit: commits:num=1
[junit4:junit4]   2> 		commit{dir=/usr/home/hudson/hudson-slave/workspace/Lucene-Solr-Tests-4.x-java7/solr/build/solr-core/test/J0/org.apache.solr.cloud.BasicDistributedZk2Test-1348065056487/jetty2/index,segFN=segments_1,generation=1,filenames=[segments_1]
[junit4:junit4]   2> 15432 T1453 C140 P23135 oasc.SolrDeletionPolicy.updateCommits newest commit = 1
[junit4:junit4]   2> 15433 T1453 C140 P23135 oass.SolrIndexSearcher.<init> Opening Searcher@5a18ca80 main
[junit4:junit4]   2> 15434 T1453 C140 P23135 oasu.DirectUpdateHandler2.commit end_commit_flush
[junit4:junit4]   2> 15436 T1459 oasc.SolrCore.registerSearcher [collection1] Registered new searcher Searcher@5a18ca80 main{StandardDirectoryReader(segments_1:1)}
[junit4:junit4]   2> 15437 T1453 C140 P23135 /update {waitSearcher=true&commit=true&commit_end_point=true&wt=javabin&softCommit=false&version=2} {commit=} 0 10
[junit4:junit4]   2> 15438 T1486 C139 P23146 oash.ReplicationHandler.inform Commits will be reserved for  10000
[junit4:junit4]   2> 15438 T1486 C139 P23146 oash.SnapPuller.<init>  No value set for 'pollInterval'. Timer Task not started.
[junit4:junit4]   2> 15441 T1454 C140 P23135 oash.ReplicationHandler.inform Commits will be reserved for  10000
[junit4:junit4]   2> 15441 T1454 C140 P23135 REQ /replication {command=indexversion&wt=javabin&qt=/replication&version=2} status=0 QTime=1 
[junit4:junit4]   2> 15446 T1486 C139 P23146 oasc.SolrDeletionPolicy.onInit SolrDeletionPolicy.onInit: commits:num=1
[junit4:junit4]   2> 		commit{dir=/usr/home/hudson/hudson-slave/workspace/Lucene-Solr-Tests-4.x-java7/solr/build/solr-core/test/J0/org.apache.solr.cloud.BasicDistributedZk2Test-1348065056487/jetty4/index,segFN=segments_1,generation=1,filenames=[segments_1]
[junit4:junit4]   2> 15446 T1486 C139 P23146 oasc.SolrDeletionPolicy.updateCommits newest commit = 1
[junit4:junit4]   2> 15447 T1486 C139 P23146 oasu.DirectUpdateHandler2.commit start commit{flags=0,_version_=0,optimize=false,openSearcher=true,waitSearcher=true,expungeDeletes=false,softCommit=false}
[junit4:junit4]   2> 15455 T1486 C139 P23146 oasc.SolrDeletionPolicy.onCommit SolrDeletionPolicy.onCommit: commits:num=2
[junit4:junit4]   2> 		commit{dir=/usr/home/hudson/hudson-slave/workspace/Lucene-Solr-Tests-4.x-java7/solr/build/solr-core/test/J0/org.apache.solr.cloud.BasicDistributedZk2Test-1348065056487/jetty4/index,segFN=segments_1,generation=1,filenames=[segments_1]
[junit4:junit4]   2> 		commit{dir=/usr/home/hudson/hudson-slave/workspace/Lucene-Solr-Tests-4.x-java7/solr/build/solr-core/test/J0/org.apache.solr.cloud.BasicDistributedZk2Test-1348065056487/jetty4/index,segFN=segments_2,generation=2,filenames=[segments_2]
[junit4:junit4]   2> 15456 T1486 C139 P23146 oasc.SolrDeletionPolicy.updateCommits newest commit = 2
[junit4:junit4]   2> 15459 T1486 C139 P23146 oass.SolrIndexSearcher.<init> Opening Searcher@6bd87f3c main
[junit4:junit4]   2> 15459 T1486 C139 P23146 oasu.DirectUpdateHandler2.commit end_commit_flush
[junit4:junit4]   2> 15462 T1485 oasc.SolrCore.registerSearcher [collection1] Registered new searcher Searcher@6bd87f3c main{StandardDirectoryReader(segments_2:2)}
[junit4:junit4]   2> 15463 T1486 C139 P23146 oasc.RecoveryStrategy.replay No replay needed. core=collection1
[junit4:junit4]   2> 15463 T1486 C139 P23146 oasc.RecoveryStrategy.doRecovery Replication Recovery was successful - registering as Active. core=collection1
[junit4:junit4]   2> 15478 T1486 C139 P23146 oasc.RecoveryStrategy.doRecovery Finished recovery process. core=collection1
[junit4:junit4]   2> 15478 T1412 oascc.ZkStateReader.updateClusterState Updating cloud state from ZooKeeper... 
[junit4:junit4]   2> 15874 T1433 oascc.ZkStateReader.updateClusterState Updating cloud state from ZooKeeper... 
[junit4:junit4]   2> 15909 T1458 oascc.ZkStateReader$2.process A cluster state change has occurred - updating...
[junit4:junit4]   2> 15909 T1470 oascc.ZkStateReader$2.process A cluster state change has occurred - updating...
[junit4:junit4]   2> 15909 T1446 oascc.ZkStateReader$2.process A cluster state change has occurred - updating...
[junit4:junit4]   2> 15909 T1491 oascc.ZkStateReader$2.process A cluster state change has occurred - updating...
[junit4:junit4]   2> 15909 T1484 oascc.ZkStateReader$2.process A cluster state change has occurred - updating...
[junit4:junit4]   2> 15909 T1489 oascc.ZkStateReader$2.process A cluster state change has occurred - updating...
[junit4:junit4]   2> 15909 T1432 oascc.ZkStateReader$2.process A cluster state change has occurred - updating...
[junit4:junit4]   2> 16481 T1412 oascc.ZkStateReader.updateClusterState Updating cloud state from ZooKeeper... 
[junit4:junit4]   2> 16484 T1424 C141 P23112 oasu.DirectUpdateHandler2.commit start commit{flags=0,_version_=0,optimize=false,openSearcher=true,waitSearcher=true,expungeDeletes=false,softCommit=false}
[junit4:junit4]   2> 16558 T1424 C141 P23112 oasc.SolrDeletionPolicy.onCommit SolrDeletionPolicy.onCommit: commits:num=2
[junit4:junit4]   2> 		commit{dir=/usr/home/hudson/hudson-slave/workspace/Lucene-Solr-Tests-4.x-java7/solr/build/solr-core/test/J0/org.apache.solr.cloud.BasicDistributedZk2Test-1348065056487/control/data/index,segFN=segments_1,generation=1,filenames=[segments_1]
[junit4:junit4]   2> 		commit{dir=/usr/home/hudson/hudson-slave/workspace/Lucene-Solr-Tests-4.x-java7/solr/build/solr-core/test/J0/org.apache.solr.cloud.BasicDistributedZk2Test-1348065056487/control/data/index,segFN=segments_2,generation=2,filenames=[_0_Asserting_0.tim, _0.fnm, _0_Pulsing40_0.tim, _0_Asserting_0.tip, _0_Memory_0.ram, _0_NestedPulsing_0.frq, _0_nrm.cfs, _0_Pulsing40_0.prx, _0_NestedPulsing_0.tip, _0_Pulsing40_0.frq, _0_NestedPulsing_0.prx, _0_NestedPulsing_0.tim, _0_Asserting_0.prx, _0_Asserting_0.frq, _0_nrm.cfe, _0_Pulsing40_0.tip, segments_2, _0.fdx, _0.si, _0.fdt]
[junit4:junit4]   2> 16559 T1424 C141 P23112 oasc.SolrDeletionPolicy.updateCommits newest commit = 2
[junit4:junit4]   2> 16568 T1424 C141 P23112 oass.SolrIndexSearcher.<init> Opening Searcher@327011e1 main
[junit4:junit4]   2> 16568 T1424 C141 P23112 oasu.DirectUpdateHandler2.commit end_commit_flush
[junit4:junit4]   2> 16569 T1435 oasc.SolrCore.registerSearcher [collection1] Registered new searcher Searcher@327011e1 main{StandardDirectoryReader(segments_2:3 _0(4.0.0.2):C1)}
[junit4:junit4]   2> 16570 T1424 C141 P23112 /update {waitSearcher=true&wt=javabin&commit=true&softCommit=false&version=2} {commit=} 0 86
[junit4:junit4]   2> 16573 T1452 C140 P23135 oasu.DirectUpdateHandler2.commit start commit{flags=0,_version_=0,optimize=false,openSearcher=true,waitSearcher=true,expungeDeletes=false,softCommit=false}
[junit4:junit4]   2> 16577 T1452 C140 P23135 oass.SolrIndexSearcher.<init> Opening Searcher@325532b1 main
[junit4:junit4]   2> 16577 T1452 C140 P23135 oasu.DirectUpdateHandler2.commit end_commit_flush
[junit4:junit4]   2> 16579 T1459 oasc.SolrCore.registerSearcher [collection1] Registered new searcher Searcher@325532b1 main{StandardDirectoryReader(segments_1:1)}
[junit4:junit4]   2> 16579 T1452 C140 P23135 oasu.SolrCmdDistributor.distribCommit Distrib commit to:[StdNode: http://127.0.0.1:23127/solr/collection1/, StdNode: http://127.0.0.1:23140/solr/collection1/, StdNode: http://127.0.0.1:23146/solr/collection1/]
[junit4:junit4]   2> 16582 T1440 C138 P23127 oasu.DirectUpdateHandler2.commit start commit{flags=0,_version_=0,optimize=false,openSearcher=true,waitSearcher=true,expungeDeletes=false,softCommit=false}
[junit4:junit4]   2>  C137_STATE=coll:collection1 core:collection1 props:{shard=shard1, roles=null, state=active, core=collection1, collection=collection1, node_name=127.0.0.1:23140_solr, base_url=http://127.0.0.1:23140/solr}
[junit4:junit4]   2> 16582 T1462 C137 P23140 oasu.DirectUpdateHandler2.commit start commit{flags=0,_version_=0,optimize=false,openSearcher=true,waitSearcher=true,expungeDeletes=false,softCommit=false}
[junit4:junit4]   2> 16585 T1462 C137 P23140 oass.SolrIndexSearcher.<init> Opening Searcher@24776f8c main
[junit4:junit4]   2> 16586 T1462 C137 P23140 oasu.DirectUpdateHandler2.commit end_commit_flush
[junit4:junit4]   2> 16587 T1471 oasc.SolrCore.registerSearcher [collection1] Registered new searcher Searcher@24776f8c main{StandardDirectoryReader(segments_2:3:nrt _0(4.0.0.2):C1)}
[junit4:junit4]   2> 16588 T1462 C137 P23140 /update {waitSearcher=true&commit=true&wt=javabin&commit_end_point=true&expungeDeletes=false&softCommit=false&version=2} {commit=} 0 6
[junit4:junit4]   2>  C139_STATE=coll:collection1 core:collection1 props:{shard=shard2, roles=null, state=active, core=collection1, collection=collection1, node_name=127.0.0.1:23146_solr, base_url=http://127.0.0.1:23146/solr}
[junit4:junit4]   2> 16588 T1476 C139 P23146 oasu.DirectUpdateHandler2.commit start commit{flags=0,_version_=0,optimize=false,openSearcher=true,waitSearcher=true,expungeDeletes=false,softCommit=false}
[junit4:junit4]   2> 16592 T1476 C139 P23146 oass.SolrIndexSearcher.<init> Opening Searcher@d58d1f9 main
[junit4:junit4]   2> 16592 T1476 C139 P23146 oasu.DirectUpdateHandler2.commit end_commit_flush
[junit4:junit4]   2> 16593 T1440 C138 P23127 oass.SolrIndexSearcher.<init> Opening Searcher@4817864c main
[junit4:junit4]   2> 16594 T1485 oasc.SolrCore.registerSearcher [collection1] Registered new searcher Searcher@d58d1f9 main{StandardDirectoryReader(segments_2:2)}
[junit4:junit4]   2> 16594 T1440 C138 P23127 oasu.DirectUpdateHandler2.commit end_commit_flush
[junit4:junit4]   2> 16594 T1476 C139 P23146 /update {waitSearcher=true&commit=true&wt=javabin&commit_end_point=true&expungeDeletes=false&softCommit=false&version=2} {commit=} 0 6
[junit4:junit4]   2> 16595 T1447 oasc.SolrCore.registerSearcher [collection1] Registered new searcher Searcher@4817864c main{StandardDirectoryReader(segments_2:3 _0(4.0.0.2):C1)}
[junit4:junit4]   2> 16595 T1440 C138 P23127 /update {waitSearcher=true&commit=true&wt=javabin&commit_end_point=true&expungeDeletes=false&softCommit=false&version=2} {commit=} 0 13
[junit4:junit4]   2> 16596 T1452 C140 P23135 /update {waitSearcher=true&wt=javabin&commit=true&softCommit=false&version=2} {commit=} 0 23
[junit4:junit4]   2> 16601 T1425 C141 P23112 REQ /select {fl=id,score&shard.url=127.0.0.1:23112/solr/collection1/&NOW=1348065073080&start=0&q=*:*&distrib=false&isShard=true&wt=javabin&fsv=true&rows=10&version=2} hits=1 status=0 QTime=0 
[junit4:junit4]   2> 16604 T1425 C141 P23112 REQ /select {shard.url=127.0.0.1:23112/solr/collection1/&NOW=1348065073080&q=*:*&ids=1&distrib=false&isShard=true&wt=javabin&version=2} status=0 QTime=0 
[junit4:junit4]   2> 16605 T1424 C141 P23112 REQ /select {wt=javabin&q=*:*&version=2} hits=1 status=0 QTime=7 
[junit4:junit4]   2> 16606 T1412 oaz.ZooKeeper.<init> Initiating client connection, connectString=127.0.0.1:23109/solr sessionTimeout=10000 watcher=org.apache.solr.common.cloud.ConnectionManager@3d8b8140
[junit4:junit4]   2> 16607 T1499 oaz.ClientCnxn$SendThread.startConnect Opening socket connection to server /127.0.0.1:23109
[junit4:junit4]   2> 16607 T1412 oascc.ConnectionManager.waitForConnected Waiting for client to connect to ZooKeeper
[junit4:junit4]   2> 16607 T1499 oaz.ClientCnxn$SendThread.primeConnection Socket connection established to localhost/127.0.0.1:23109, initiating session
[junit4:junit4]   2> 16608 T1414 oazs.NIOServerCnxn$Factory.run Accepted socket connection from /140.211.11.196:23165
[junit4:junit4]   2> 16608 T1414 oazs.NIOServerCnxn.readConnectRequest Client attempting to establish new session at /140.211.11.196:23165
[junit4:junit4]   2> 16609 T1416 oazs.NIOServerCnxn.finishSessionInit Established session 0x139def056ee0009 with negotiated timeout 10000 for client /140.211.11.196:23165
[junit4:junit4]   2> 16609 T1499 oaz.ClientCnxn$SendThread.readConnectResult Session establishment complete on server localhost/127.0.0.1:23109, sessionid = 0x139def056ee0009, negotiated timeout = 10000
[junit4:junit4]   2> 16610 T1500 oascc.ConnectionManager.process Watcher org.apache.solr.common.cloud.ConnectionManager@3d8b8140 name:ZooKeeperConnection Watcher:127.0.0.1:23109/solr got event WatchedEvent state:SyncConnected type:None path:null path:null type:None
[junit4:junit4]   2> 16610 T1412 oascc.ConnectionManager.waitForConnected Client is connected to ZooKeeper
[junit4:junit4]   2> 16611 T1412 oascc.ZkStateReader.createClusterStateWatchersAndUpdate Updating cluster state from ZooKeeper... 
[junit4:junit4]   2> 16612 T1417 oazs.PrepRequestProcessor.pRequest Processed session termination for sessionid: 0x139def056ee0009
[junit4:junit4]   2> 16613 T1500 oaz.ClientCnxn$EventThread.run EventThread shut down
[junit4:junit4]   2> 16613 T1414 oazs.NIOServerCnxn.closeSock Closed socket connection for client /140.211.11.196:23165 which had sessionid 0x139def056ee0009
[junit4:junit4]   2> 16613 T1412 oaz.ZooKeeper.close Session: 0x139def056ee0009 closed
[junit4:junit4]   2> 16615 T1443 C138 P23127 REQ /select {distrib=false&wt=javabin&q=*:*&version=2} hits=1 status=0 QTime=0 
[junit4:junit4]   2> 16617 T1455 C140 P23135 REQ /select {distrib=false&wt=javabin&q=*:*&version=2} hits=0 status=0 QTime=0 
[junit4:junit4]   2> 16622 T1463 C137 P23140 REQ /select {fl=id,score&shard.url=127.0.0.1:23127/solr/collection1/|127.0.0.1:23140/solr/collection1/&NOW=1348065073102&start=0&q=*:*&distrib=false&isShard=true&wt=javabin&fsv=true&rows=10&version=2} hits=1 status=0 QTime=0 
[junit4:junit4]   2> 16622 T1456 C140 P23135 REQ /select {fl=id,score&shard.url=127.0.0.1:23135/solr/collection1/|127.0.0.1:23146/solr/collection1/&NOW=1348065073102&start=0&q=*:*&distrib=false&isShard=true&wt=javabin&fsv=true&rows=10&version=2} hits=0 status=0 QTime=0 
[junit4:junit4]   2> 16625 T1463 C137 P23140 REQ /select {shard.url=127.0.0.1:23127/solr/collection1/|127.0.0.1:23140/solr/collection1/&NOW=1348065073102&q=*:*&ids=1&distrib=false&isShard=true&wt=javabin&version=2} status=0 QTime=0 
[junit4:junit4]   2> 16626 T1452 C140 P23135 REQ /select {wt=javabin&q=*:*&version=2} hits=1 status=0 QTime=6 
[junit4:junit4]   2> 16636 T1424 C141 P23112 /update {wt=javabin&version=2} {add=[2 (1413548682103488512)]} 0 7
[junit4:junit4]   2> 16650 T1476 C139 P23146 REQ /update {update.distrib=FROMLEADER&distrib.from=http://127.0.0.1:23135/solr/collection1/&wt=javabin&version=2} status=0 QTime=3 
[junit4:junit4]   2> 16651 T1451 C140 P23135 REQ /update {distrib.from=http://127.0.0.1:23127/solr/collection1/&update.distrib=TOLEADER&wt=javabin&version=2} status=0 QTime=11 
[junit4:junit4]   2> 16652 T1444 C138 P23127 /update {wt=javabin&version=2} {add=[2]} 0 13
[junit4:junit4]   2> 16657 T1424 C141 P23112 /update {wt=javabin&version=2} {add=[3 (1413548682129702912)]} 0 2
[junit4:junit4]   2> 16665 T1476 C139 P23146 REQ /update {update.distrib=FROMLEADER&distrib.from=http://127.0.0.1:23135/solr/collection1/&wt=javabin&version=2} status=0 QTime=1 
[junit4:junit4]   2> 16665 T1451 C140 P23135 REQ /update {distrib.from=http://127.0.0.1:23127/solr/collection1/&update.distrib=TOLEADER&wt=javabin&version=2} status=0 QTime=4 
[junit4:junit4]   2> 16666 T1444 C138 P23127 /update {wt=javabin&version=2} {add=[3]} 0 7
[junit4:junit4]   2> 16670 T1424 C141 P23112 /update {wt=javabin&version=2} {add=[4 (1413548682144382976)]} 0 1
[junit4:junit4]   2> 16685 T1462 C137 P23140 REQ /update {update.distrib=FROMLEADER&distrib.from=http://127.0.0.1:23127/solr/collection1/&wt=javabin&version=2} status=0 QTime=4 
[junit4:junit4]   2> 16686 T1440 C138 P23127 REQ /update {distrib.from=http://127.0.0.1:23135/solr/collection1/&update.distrib=TOLEADER&wt=javabin&version=2} status=0 QTime=11 
[junit4:junit4]   2> 16686 T1452 C140 P23135 /update {wt=javabin&version=2} {add=[4]} 0 13
[junit4:junit4]   2> 16690 T1424 C141 P23112 /update {wt=javabin&version=2} {add=[5 (1413548682165354496)]} 0 1
[junit4:junit4]   2> 16697 T1476 C139 P23146 REQ /update {distrib.from=http://127.0.0.1:23135/solr/collection1/&update.distrib=FROMLEADER&wt=javabin&version=2} status=0 QTime=1 
[junit4:junit4]   2> 16698 T1452 C140 P23135 /update {wt=javabin&version=2} {add=[5 (1413548682169548800)]} 0 5
[junit4:junit4]   2> 16701 T1424 C141 P23112 /update {wt=javabin&version=2} {add=[6 (1413548682176888832)]} 0 1
[junit4:junit4]   2> 16710 T1476 C139 P23146 REQ /update {update.distrib=FROMLEADER&distrib.from=http://127.0.0.1:23135/solr/collection1/&wt=javabin&version=2} status=0 QTime=1 
[junit4:junit4]   2> 16710 T1451 C140 P23135 REQ /update {distrib.from=http://127.0.0.1:23127/solr/collection1/&update.distrib=TOLEADER&wt=javabin&version=2} status=0 QTime=4 
[junit4:junit4]   2> 16711 T1444 C138 P23127 /update {wt=javabin&version=2} {add=[6]} 0 8
[junit4:junit4]   2> 16715 T1424 C141 P23112 /update {wt=javabin&version=2} {add=[7 (1413548682191568896)]} 0 1
[junit4:junit4]   2> 16724 T1476 C139 P23146 REQ /update {update.distrib=FROMLEADER&distrib.from=http://127.0.0.1:23135/solr/collection1/&wt=javabin&version=2} status=0 QTime=1 
[junit4:junit4]   2> 16724 T1451 C140 P23135 REQ /update {distrib.from=http://127.0.0.1:23127/solr/collection1/&update.distrib=TOLEADER&wt=javabin&version=2} status=0 QTime=4 
[junit4:junit4]   2> 16725 T1444 C138 P23127 /update {wt=javabin&version=2} {add=[7]} 0 7
[junit4:junit4]   2> 16728 T1424 C141 P23112 /update {wt=javabin&version=2} {add=[8 (1413548682205200384)]} 0 1
[junit4:junit4]   2> 16737 T1462 C137 P23140 REQ /update {distrib.from=http://127.0.0.1:23127/solr/collection1/&update.distrib=FROMLEADER&wt=javabin&version=2} status=0 QTime=2 
[junit4:junit4]   2> 16737 T1444 C138 P23127 /update {wt=javabin&version=2} {add=[8 (1413548682209394688)]} 0 6
[junit4:junit4]   2> 16741 T1424 C141 P23112 /update {wt=javabin&version=2} {add=[9 (1413548682218831872)]} 0 1
[junit4:junit4]   2> 16748 T1476 C139 P23146 REQ /update {distrib.from=http://127.0.0.1:23135/solr/collection1/&update.distrib=FROMLEADER&wt=javabin&version=2} status=0 QTime=1 
[junit4:junit4]   2> 16748 T1452 C140 P23135 /update {wt=javabin&version=2} {add=[9 (1413548682223026176)]} 0 4
[junit4:junit4]   2> 16753 T1424 C141 P23112 /update {wt=javabin&version=2} {add=[10 (1413548682230366208)]} 0 2
[junit4:junit4]   2> 16762 T1462 C137 P23140 REQ /update {update.distrib=FROMLEADER&distrib.from=http://127.0.0.1:23127/solr/collection1/&wt=javabin&version=2} status=0 QTime=1 
[junit4:junit4]   2> 16763 T1440 C138 P23127 REQ /update {distrib.from=http://127.0.0.1:23135/solr/collection1/&update.distrib=TOLEADER&wt=javabin&version=2} status=0 QTime=6 
[junit4:junit4]   2> 16764 T1452 C140 P23135 /update {wt=javabin&version=2} {add=[10]} 0 9
[junit4:junit4]   2> 16799 T1424 C141 P23112 /update {wt=javabin&version=2} {add=[11 (1413548682246094848)]} 0 33
[junit4:junit4]   2> 16811 T1462 C137 P23140 REQ /update {update.distrib=FROMLEADER&distrib.from=http://127.0.0.1:23127/solr/collection1/&wt=javabin&version=2} status=0 QTime=2 
[junit4:junit4]   2> 16812 T1440 C138 P23127 REQ /update {distrib.from=http://127.0.0.1:23135/solr/collection1/&update.distrib=TOLEADER&wt=javabin&version=2} status=0 QTime=7 
[junit4:junit4]   2> 16812 T1452 C140 P23135 /update {wt=javabin&version=2} {add=[11]} 0 10
[junit4:junit4]   2> 16818 T1424 C141 P23112 /update {wt=javabin&version=2} {add=[12 (1413548682297475072)]} 0 3
[junit4:junit4]   2> 16830 T1462 C137 P23140 REQ /update {update.distrib=FROMLEADER&distrib.from=http://127.0.0.1:23127/solr/collection1/&wt=javabin&version=2} status=0 QTime=2 
[junit4:junit4]   2> 16831 T1440 C138 P23127 REQ /update {distrib.from=http://127.0.0.1:23135/solr/collection1/&update.distrib=TOLEADER&wt=javabin&version=2} status=0 QTime=7 
[junit4:junit4]   2> 16831 T1452 C140 P23135 /update {wt=javabin&version=2} {add=[12]} 0 10
[junit4:junit4]   2> 16835 T1424 C141 P23112 /update {wt=javabin&version=2} {add=[13 (1413548682317398016)]} 0 1
[junit4:junit4]   2> 16846 T1462 C137 P23140 REQ /update {update.distrib=FROMLEADER&distrib.from=http://127.0.0.1:23127/solr/collection1/&wt=javabin&version=2} status=0 QTime=2 
[junit4:junit4]   2> 16847 T1440 C138 P23127 REQ /update {distrib.from=http://127.0.0.1:23135/solr/collection1/&update.distrib=TOLEADER&wt=javabin&version=2} status=0 QTime=7 
[junit4:junit4]   2> 16847 T1452 C140 P23135 /update {wt=javabin&version=2} {add=[13]} 0 9
[junit4:junit4]   2> 16852 T1424 C141 P23112 /update {wt=javabin&version=2} {add=[14 (1413548682335223808)]} 0 2
[junit4:junit4]   2> 16862 T1462 C137 P23140 REQ /update {update.distrib=FROMLEADER&distrib.from=http://127.0.0.1:23127/solr/collection1/&wt=javabin&version=2} status=0 QTime=2 
[junit4:junit4]   2> 16862 T1440 C138 P23127 REQ /update {distrib.from=http://127.0.0.1:23135/solr/collection1/&update.distrib=TOLEADER&wt=javabin&version=2} status=0 QTime=6 
[junit4:junit4]   2> 16863 T1452 C140 P23135 /update {wt=javabin&version=2} {add=[14]} 0 9
[junit4:junit4]   2> 16867 T1424 C141 P23112 /update {wt=javabin&version=2} {add=[15 (1413548682350952448)]} 0 1
[junit4:junit4]   2> 16877 T1462 C137 P23140 REQ /update {update.distrib=FROMLEADER&distrib.from=http://127.0.0.1:23127/solr/collection1/&wt=javabin&version=2} status=0 QTime=2 
[junit4:junit4]   2> 16877 T1440 C138 P23127 REQ /update {distrib.from=http://127.0.0.1:23135/solr/collection1/&update.distrib=TOLEADER&wt=javabin&version=2} status=0 QTime=5 
[junit4:junit4]   2> 16878 T1452 C140 P23135 /update {wt=javabin&version=2} {add=[15]} 0 8
[junit4:junit4]   2> 16882 T1424 C141 P23112 /update {wt=javabin&version=2} {add=[16 (1413548682366681088)]} 0 1
[junit4:junit4]   2> 16889 T1462 C137 P23140 REQ /update {distrib.from=http://127.0.0.1:23127/solr/collection1/&update.distrib=FROMLEADER&wt=javabin&version=2} status=0 QTime=1 
[junit4:junit4]   2> 16890 T1444 C138 P23127 /update {wt=javabin&version=2} {add=[16 (1413548682370875392)]} 0 5
[junit4:junit4]   2> 16895 T1424 C141 P23112 /update {wt=javabin&version=2} {add=[17 (1413548682379264000)]} 0 2
[junit4:junit4]   2> 16905 T1476 C139 P23146 REQ /update {distrib.from=http://127.0.0.1:23135/solr/collection1/&update.distrib=FROMLEADER&wt=javabin&version=2} status=0 QTime=2 
[junit4:junit4]   2> 16906 T1452 C140 P23135 /update {wt=javabin&version=2} {add=[17 (1413548682385555456)]} 0 8
[junit4:junit4]   2> 16910 T1424 C141 P23112 /update {wt=javabin&version=2} {add=[100 (1413548682396041216)]} 0 1
[junit4:junit4]   2> 16983 T1462 C137 P23140 REQ /update {update.distrib=FROMLEADER&distrib.from=http://127.0.0.1:23127/solr/collection1/&wt=javabin&version=2} status=0 QTime=33 
[junit4:junit4]   2> 16983 T1440 C138 P23127 REQ /update {distrib.from=http://127.0.0.1:23135/solr/collection1/&update.distrib=TOLEADER&wt=javabin&version=2} status=0 QTime=68 
[junit4:junit4]   2> 16984 T1452 C140 P23135 /update {wt=javabin&version=2} {add=[100]} 0 71
[junit4:junit4]   2> 16988 T1424 C141 P23112 /update {wt=javabin&version=2} {add=[101 (1413548682477830144)]} 0 1
[junit4:junit4]   2> 16999 T1462 C137 P23140 REQ /update {distrib.from=http://127.0.0.1:23127/solr/collection1/&update.distrib=FROMLEADER&wt=javabin&version=2} status=0 QTime=3 
[junit4:junit4]   2> 16999 T1444 C138 P23127 /update {wt=javabin&version=2} {add=[101 (1413548682483073024)]} 0 8
[junit4:junit4]   2> 17003 T1424 C141 P23112 /update {wt=javabin&version=2} {add=[102 (1413548682493558784)]} 0 1
[junit4:junit4]   2> 17014 T1462 C137 P23140 REQ /update {update.distrib=FROMLEADER&distrib.from=http://127.0.0.1:23127/solr/collection1/&wt=javabin&version=2} status=0 QTime=1 
[junit4:junit4]   2> 17015 T1440 C138 P23127 REQ /update {distrib.from=http://127.0.0.1:23135/solr/collection1/&update.distrib=TOLEADER&wt=javabin&version=2} status=0 QTime=6 
[junit4:junit4]   2> 17015 T1452 C140 P23135 /update {wt=javabin&version=2} {add=[102]} 0 9
[junit4:junit4]   2> 17053 T1424 C141 P23112 /update {wt=javabin&version=2} {add=[103 (1413548682511384576)]} 0 34
[junit4:junit4]   2> 17061 T1476 C139 P23146 REQ /update {distrib.from=http://127.0.0.1:23135/solr/collection1/&update.distrib=FROMLEADER&wt=javabin&version=2} status=0 QTime=1 
[junit4:junit4]   2> 17062 T1452 C140 P23135 /update {wt=javabin&version=2} {add=[103 (1413548682550181888)]} 0 6
[junit4:junit4]   2> 17068 T1424 C141 P23112 /update {wt=javabin&version=2} {add=[104 (1413548682559619072)]} 0 3
[junit4:junit4]   2> 17075 T1476 C139 P23146 REQ /update {distrib.from=http://127.0.0.1:23135/solr/collection1/&update.distrib=FROMLEADER&wt=javabin&version=2} status=0 QTime=1 
[junit4:junit4]   2> 17076 T1452 C140 P23135 /update {wt=javabin&version=2} {add=[104 (1413548682565910528)]} 0 5
[junit4:junit4]   2> 17079 T1424 C141 P23112 /update {wt=javabin&version=2} {add=[105 (1413548682573250560)]} 0 1
[junit4:junit4]   2> 17130 T1476 C139 P23146 REQ /update {update.distrib=FROMLEADER&distrib.from=http://127.0.0.1:23135/solr/collection1/&wt=javabin&version=2} status=0 QTime=22 
[junit4:junit4]   2> 17130 T1451 C140 P23135 REQ /update {distrib.from=http://127.0.0.1:23127/solr/collection1/&update.distrib=TOLEADER&wt=javabin&version=2} status=0 QTime=46 
[junit4:junit4]   2> 17131 T1444 C138 P23127 /update {wt=javabin&version=2} {add=[105]} 0 49
[junit4:junit4]   2> 17135 T1424 C141 P23112 /update {wt=javabin&version=2} {add=[106 (1413548682631970816)]} 0 1
[junit4:junit4]   2> 17145 T1476 C139 P23146 REQ /update {distrib.from=http://127.0.0.1:23135/solr/collection1/&update.distrib=FROMLEADER&wt=javabin&version=2} status=0 QTime=2 
[junit4:junit4]   2> 17146 T1452 C140 P23135 /update {wt=javabin&version=2} {add=[106 (1413548682636165120)]} 0 8
[junit4:junit4]   2> 17150 T1424 C141 P23112 /update {wt=javabin&version=2} {add=[107 (1413548682647699456)]} 0 1
[junit4:junit4]   2> 17160 T1462 C137 P23140 REQ /update {update.distrib=FROMLEADER&distrib.from=http://127.0.0.1:23127/solr/collection1/&wt=javabin&version=2} status=0 QTime=1 
[junit4:junit4]   2> 17161 T1440 C138 P23127 REQ /update {distrib.from=http://127.0.0.1:23135/solr/collection1/&update.distrib=TOLEADER&wt=javabin&version=2} status=0 QTime=5 
[junit4:junit4]   2> 17161 T1452 C140 P23135 /update {wt=javabin&version=2} {add=[107]} 0 8
[junit4:junit4]   2> 17165 T1424 C141 P23112 /update {wt=javabin&version=2} {add=[108 (1413548682663428096)]} 0 1
[junit4:junit4]   2> 17175 T1462 C137 P23140 REQ /update {update.distrib=FROMLEADER&distrib.from=http://127.0.0.1:23127/solr/collection1/&wt=javabin&version=2} status=0 QTime=1 
[junit4:junit4]   2> 17176 T1440 C138 P23127 REQ /update {distrib.from=http://127.0.0.1:23135/solr/collection1/&update.distrib=TOLEADER&wt=javabin&version=2} status=0 QTime=5 
[junit4:junit4]   2> 17176 T1452 C140 P23135 /update {wt=javabin&version=2} {add=[108]} 0 8
[junit4:junit4]   2> 17180 T1424 C141 P23112 /update {wt=javabin&version=2} {add=[109 (1413548682679156736)]} 0 1
[junit4:junit4]   2> 17190 T1462 C137 P23140 REQ /update {update.distrib=FROMLEADER&distrib.from=http://127.0.0.1:23127/solr/collection1/&wt=javabin&version=2} status=0 QTime=1 
[junit4:junit4]   2> 17191 T1440 C138 P23127 REQ /update {distrib.from=http://127.0.0.1:23135/solr/collection1/&update.distrib=TOLEADER&wt=javabin&version=2} status=0 QTime=5 
[junit4:junit4]   2> 17191 T1452 C140 P23135 /update {wt=javabin&version=2} {add=[109]} 0 8
[junit4:junit4]   2> 17195 T1424 C141 P23112 /update {wt=javabin&version=2} {add=[110 (1413548682694885376)]} 0 1
[junit4:junit4]   2> 17202 T1462 C137 P23140 REQ /update {distrib.from=http://127.0.0.1:23127/solr/collection1/&update.distrib=FROMLEADER&wt=javabin&version=2} status=0 QTime=1 
[junit4:junit4]   2> 17203 T1444 C138 P23127 /update {wt=javabin&version=2} {add=[110 (1413548682699079680)]} 0 5
[junit4:junit4]   2> 17206 T1424 C141 P23112 /update {wt=javabin&version=2} {add=[111 (1413548682706419712)]} 0 1
[junit4:junit4]   2> 17216 T1462 C137 P23140 REQ /update {update.distrib=FROMLEADER&distrib.from=http://127.0.0.1:23127/solr/collection1/&wt=javabin&version=2} status=0 QTime=1 
[junit4:junit4]   2> 17217 T1440 C138 P23127 REQ /update {distrib.from=http://127.0.0.1:23135/solr/collection1/&update.distrib=TOLEADER&wt=javabin&version=2} status=0 QTime=5 
[junit4:junit4]   2> 17217 T1452 C140 P23135 /update {wt=javabin&version=2} {add=[111]} 0 8
[junit4:junit4]   2> 17221 T1424 C141 P23112 /update {wt=javabin&version=2} {add=[112 (1413548682722148352)]} 0 1
[junit4:junit4]   2> 17231 T1476 C139 P23146 REQ /update {update.distrib=FROMLEADER&distrib.from=http://127.0.0.1:23135/solr/collection1/&wt=javabin&version=2} status=0 QTime=1 
[junit4:junit4]   2> 17232 T1451 C140 P23135 REQ /update {distrib.from=http://127.0.0.1:23127/solr/collection1/&update.distrib=TOLEADER&wt=javabin&version=2} status=0 QTime=6 
[junit4:junit4]   2> 17232 T1444 C138 P23127 /update {wt=javabin&version=2} {add=[112]} 0 8
[junit4:junit4]   2> 17267 T1424 C141 P23112 /update {wt=javabin&version=2} {add=[113 (1413548682737876992)]} 0 32
[junit4:junit4]   2> 17274 T1462 C137 P23140 REQ /update {distrib.from=http://127.0.0.1:23127/solr/collection1/&update.distrib=FROMLEADER&wt=javabin&version=2} status=0 QTime=1 
[junit4:junit4]   2> 17275 T1444 C138 P23127 /update {wt=javabin&version=2} {add=[113 (1413548682774577152)]} 0 5
[junit4:junit4]   2> 17281 T1424 C141 P23112 /update {wt=javabin&version=2} {add=[114 (1413548682782965760)]} 0 3
[junit4:junit4]   2> 17290 T1462 C137 P23140 REQ /update {update.distrib=FROMLEADER&distrib.from=http://127.0.0.1:23127/solr/collection1/&wt=javabin&version=2} status=0 QTime=1 
[junit4:junit4]   2> 17291 T1440 C138 P23127 REQ /update {distrib.from=http://127.0.0.1:23135/solr/collection1/&update.distrib=TOLEADER&wt=javabin&version=2} status=0 QTime=5 
[junit4:junit4]   2> 17291 T1452 C140 P23135 /update {wt=javabin&version=2} {add=[114]} 0 8
[junit4:junit4]   2> 17296 T1424 C141 P23112 /update {wt=javabin&version=2} {add=[115 (1413548682800791552)]} 0 1
[junit4:junit4]   2> 17304 T1476 C139 P23146 REQ /update {distrib.from=http://127.0.0.1:23135/solr/collection1/&update.distrib=FROMLEADER&wt=javabin&version=2} status=0 QTime=1 
[junit4:junit4]   2> 17305 T1452 C140 P23135 /update {wt=javabin&version=2} {add=[115 (1413548682804985856)]} 0 6
[junit4:junit4]   2> 17308 T1424 C141 P23112 /update {wt=javabin&version=2} {add=[116 (1413548682813374464)]} 0 1
[junit4:junit4]   2> 17318 T1476 C139 P23146 REQ /update {update.distrib=FROMLEADER&distrib.from=http://127.0.0.1:23135/solr/collection1/&wt=javabin&version=2} status=0 QTime=1 
[junit4:junit4]   2> 17319 T1451 C140 P23135 REQ /update {distrib.from=http://127.0.0.1:23127/solr/collection1/&update.distrib=TOLEADER&wt=javabin&version=2} status=0 QTime=6 
[junit4:junit4]   2> 17319 T1444 C138 P23127 /update {wt=javabin&version=2} {add=[116]} 0 8
[junit4:junit4]   2> 17323 T1424 C141 P23112 /update {wt=javabin&version=2} {add=[117 (1413548682829103104)]} 0 1
[junit4:junit4]   2> 17330 T1476 C139 P23146 REQ /update {distrib.from=http://127.0.0.1:23135/solr/collection1/&update.distrib=FROMLEADER&wt=javabin&version=2} status=0 QTime=1 
[junit4:junit4]   2> 17331 T1452 C140 P23135 /update {wt=javabin&version=2} {add=[117 (1413548682833297408)]} 0 5
[junit4:junit4]   2> 17334 T1424 C141 P23112 /update {wt=javabin&version=2} {add=[118 (1413548682840637440)]} 0 1
[junit4:junit4]   2> 17394 T1462 C137 P23140 REQ /update {distrib.from=http://127.0.0.1:23127/solr/collection1/&update.distrib=FROMLEADER&wt=javabin&version=2} status=0 QTime=28 
[junit4:junit4]   2> 17395 T1444 C138 P23127 /update {wt=javabin&version=2} {add=[118 (1413548682844831744)]} 0 58
[junit4:junit4]   2> 17399 T1424 C141 P23112 /update {wt=javabin&version=2} {add=[119 (1413548682908794880)]} 0 1
[junit4:junit4]   2> 17407 T1476 C139 P23146 REQ /update {update.distrib=FROMLEADER&distrib.from=http://127.0.0.1:23135/solr/collection1/&wt=javabin&version=2} status=0 QTime=1 
[junit4:junit4]   2> 17408 T1451 C140 P23135 REQ /update {distrib.from=http://127.0.0.1:23127/solr/collection1/&update.distrib=TOLEADER&wt=javabin&version=2} status=0 QTime=4 
[junit4:junit4]   2> 17408 T1444 C138 P23127 /update {wt=javabin&version=2} {add=[119]} 0 6
[junit4:junit4]   2> 17412 T1424 C141 P23112 /update {wt=javabin&version=2} {add=[120 (1413548682922426368)]} 0 1
[junit4:junit4]   2> 17420 T1476 C139 P23146 REQ /update {distrib.from=http://127.0.0.1:23135/solr/collection1/&update.distrib=FROMLEADER&wt=javabin&version=2} status=0 QTime=1 
[junit4:junit4]   2> 17421 T1452 C140 P23135 /update {wt=javabin&version=2} {add=[120 (1413548682926620672)]} 0 6
[junit4:junit4]   2> 17424 T1424 C141 P23112 /update {wt=javabin&version=2} {add=[121 (1413548682935009280)]} 0 1
[junit4:junit4]   2> 17431 T1476 C139 P23146 REQ /update {distrib.from=http://127.0.0.1:23135/solr/collection1/&update.distrib=FROMLEADER&wt=javabin&version=2} status=0 QTime=1 
[junit4:junit4]   2> 17431 T1452 C140 P23135 /update {wt=javabin&version=2} {add=[121 (1413548682939203584)]} 0 4
[junit4:junit4]   2> 17435 T1424 C141 P23112 /update {wt=javabin&version=2} {add=[122 (1413548682946543616)]} 0 1
[junit4:junit4]   2> 17448 T1462 C137 P23140 REQ /update {update.distrib=FROMLEADER&distrib.from=http://127.0.0.1:23127/solr/collection1/&wt=javabin&version=2} status=0 QTime=3 
[junit4:junit4]   2> 17448 T1440 C138 P23127 REQ /update {distrib.from=http://127.0.0.1:23135/solr/collection1/&update.distrib=TOLEADER&wt=javabin&version=2} status=0 QTime=8 
[junit4:junit4]   2> 17449 T1452 C140 P23135 /update {wt=javabin&version=2} {add=[122]} 0 11
[junit4:junit4]   2> 17479 T1424 C141 P23112 /update {wt=javabin&version=2} {add=[123 (1413548682965417984)]} 0 27
[junit4:junit4]   2> 17487 T1462 C137 P23140 REQ /update {distrib.from=http://127.0.0.1:23127/solr/collection1/&update.distrib=FROMLEADER&wt=javabin&version=2} status=0 QTime=1 
[junit4:junit4]   2> 17488 T1444 C138 P23127 /update {wt=javabin&version=2} {add=[123 (1413548682996875264)]} 0 6
[junit4:junit4]   2> 17494 T1424 C141 P23112 /update {wt=javabin&version=2} {add=[124 (1413548683006312448)]} 0 3
[junit4:junit4]   2> 17500 T1462 C137 P23140 REQ /update {distrib.from=http://127.0.0.1:23127/solr/collection1/&update.distrib=FROMLEADER&wt=javabin&version=2} status=0 QTime=1 
[junit4:junit4]   2> 17501 T1444 C138 P23127 /update {wt=javabin&version=2} {add=[124 (1413548683011555328)]} 0 5
[junit4:junit4]   2> 17505 T1424 C141 P23112 /update {wt=javabin&version=2} {add=[125 (1413548683019943936)]} 0 1
[junit4:junit4]   2> 17515 T1462 C137 P23140 REQ /update {update.distrib=FROMLEADER&distrib.from=http://127.0.0.1:23127/solr/collection1/&wt=javabin&version=2} status=0 QTime=1 
[junit4:junit4]   2> 17516 T1440 C138 P23127 REQ /update {distrib.from=http://127.0.0.1:23135/solr/collection1/&update.distrib=TOLEADER&wt=javabin&version=2} status=0 QTime=5 
[junit4:junit4]   2> 17516 T1452 C140 P23135 /update {wt=javabin&version=2} {add=[125]} 0 8
[junit4:junit4]   2> 17520 T1424 C141 P23112 /update {wt=javabin&version=2} {add=[126 (1413548683035672576)]} 0 1
[junit4:junit4]   2> 17529 T1476 C139 P23146 REQ /update {update.distrib=FROMLEADER&distrib.from=http://127.0.0.1:23135/solr/collection1/&wt=javabin&version=2} status=0 QTime=1 
[junit4:junit4]   2> 17530 T1451 C140 P23135 REQ /update {distrib.from=http://127.0.0.1:23127/solr/collection1/&update.distrib=TOLEADER&wt=javabin&version=2} status=0 QTime=5 
[junit4:junit4]   2> 17530 T1444 C138 P23127 /update {wt=javabin&version=2} {add=[126]} 0 7
[junit4:junit4]   2> 17534 T1424 C141 P23112 /update {wt=javabin&version=2} {add=[127 (1413548683050352640)]} 0 1
[junit4:junit4]   2> 17578 T1476 C139 P23146 REQ /update {update.distrib=FROMLEADER&distrib.from=http://127.0.0.1:23135/solr/collection1/&wt=javabin&version=2} status=0 QTime=19 
[junit4:junit4]   2> 17579 T1451 C140 P23135 REQ /update {distrib.from=http://127.0.0.1:23127/solr/collection1/&update.distrib=TOLEADER&wt=javabin&version=2} status=0 QTime=40 
[junit4:junit4]   2> 17579 T1444 C138 P23127 /update {wt=javabin&version=2} {add=[127]} 0 42
[junit4:junit4]   2> 17583 T1424 C141 P23112 /update {wt=javabin&version=2} {add=[128 (1413548683101732864)]} 0 1
[junit4:junit4]   2> 17593 T1476 C139 P23146 REQ /update {distrib.from=http://127.0.0.1:23135/solr/collection1/&update.distrib=FROMLEADER&wt=javabin&version=2} status=0 QTime=2 
[junit4:junit4]   2> 17594 T1452 C140 P23135 /update {wt=javabin&version=2} {add=[128 (1413548683105927168)]} 0 8
[junit4:junit4]   2> 17598 T1424 C141 P23112 /update {wt=javabin&version=2} {add=[129 (1413548683117461504)]} 0 1
[junit4:junit4]   2> 17605 T1462 C137 P23140 REQ /update {distrib.from=http://127.0.0.1:23127/solr/collection1/&update.distrib=FROMLEADER&wt=javabin&version=2} status=0 QTime=1 
[junit4:junit4]   2> 17606 T1444 C138 P23127 /update {wt=javabin&version=2} {add=[129 (1413548683121655808)]} 0 5
[junit4:junit4]   2> 17610 T1424 C141 P23112 /update {wt=javabin&version=2} {add=[130 (1413548683130044416)]} 0 1
[junit4:junit4]   2> 17620 T1476 C139 P23146 REQ /update {update.distrib=FROMLEADER&distrib.from=http://127.0.0.1:23135/solr/collection1/&wt=javabin&version=2} status=0 QTime=1 
[junit4:junit4]   2> 17621 T1451 C140 P23135 REQ /update {distrib.from=http://127.0.0.1:23127/solr/collection1/&update.distrib=TOLEADER&wt=javabin&version=2} status=0 QTime=6 
[junit4:junit4]   2> 17621 T1444 C138 P23127 /update {wt=javabin&version=2} {add=[130]} 0 8
[junit4:junit4]   2> 17625 T1424 C141 P23112 /update {wt=javabin&version=2} {add=[131 (1413548683145773056)]} 0 1
[junit4:junit4]   2> 17634 T1476 C139 P23146 REQ /update {update.distrib=FROMLEADER&distrib.from=http://127.0.0.1:23135/solr/collection1/&wt=javabin&version=2} status=0 QTime=1 
[junit4:junit4]   2> 17635 T1451 C140 P23135 REQ /update {distrib.from=http://127.0.0.1:23127/solr/collection1/&update.distrib=TOLEADER&wt=javabin&version=2} status=0 QTime=4 
[junit4:junit4]   2> 17635 T1444 C138 P23127 /update {wt=javabin&version=2} {add=[131]} 0 7
[junit4:junit4]   2> 17639 T1424 C141 P23112 /update {wt=javabin&version=2} {add=[132 (1413548683160453120)]} 0 1
[junit4:junit4]   2> 17649 T1462 C137 P23140 REQ /update {update.distrib=FROMLEADER&distrib.from=http://127.0.0.1:23127/solr/collection1/&wt=javabin&version=2} status=0 QTime=1 
[junit4:junit4]   2> 17650 T1440 C138 P23127 REQ /update {distrib.from=http://127.0.0.1:23135/solr/collection1/&update.distrib=TOLEADER&wt=javabin&version=2} status=0 QTime=5 
[junit4:junit4]   2> 17650 T1452 C140 P23135 /update {wt=javabin&version=2} {add=[132]} 0 8
[junit4:junit4]   2> 17680 T1424 C141 P23112 /update {wt=javabin&version=2} {add=[133 (1413548683176181760)]} 0 27
[junit4:junit4]   2> 17689 T1462 C137 P23140 REQ /update {distrib.from=http://127.0.0.1:23127/solr/collection1/&update.distrib=FROMLEADER&wt=javabin&version=2} status=0 QTime=2 
[junit4:junit4]   2> 17689 T1444 C138 P23127 /update {wt=javabin&version=2} {add=[133 (1413548683208687616)]} 0 6
[junit4:junit4]   2> 17695 T1424 C141 P23112 /update {wt=javabin&version=2} {add=[134 (1413548683217076224)]} 0 3
[junit4:junit4]   2> 17764 T1476 C139 P23146 REQ /update {update.distrib=FROMLEADER&distrib.from=http://127.0.0.1:23135/solr/collection1/&wt=javabin&version=2} status=0 QTime=2 
[junit4:junit4]   2> 17765 T1451 C140 P23135 REQ /update {distrib.from=http://127.0.0.1:23127/solr/collection1/&update.distrib=TOLEADER&wt=javabin&version=2} status=0 QTime=65 
[junit4:junit4]   2> 17766 T1444 C138 P23127 /update {wt=javabin&version=2} {add=[134]} 0 69
[junit4:junit4]   2> 17771 T1424 C141 P23112 /update {wt=javabin&version=2} {add=[135 (1413548683297816576)]} 0 2
[junit4:junit4]   2> 17789 T1462 C137 P23140 REQ /update {distrib.from=http://127.0.0.1:23127/solr/collection1/&update.distrib=FROMLEADER&wt=javabin&version=2} status=0 QTime=2 
[junit4:junit4]   2> 17790 T1444 C138 P23127 /update {wt=javabin&version=2} {add=[135 (1413548683312496640)]} 0 8
[junit4:junit4]   2> 17794 T1424 C141 P23112 /update {wt=javabin&version=2} {add=[136 (1413548683322982400)]} 0 1
[junit4:junit4]   2> 17804 T1476 C139 P23146 REQ /update {update.distrib=FROMLEADER&distrib.from=http://127.0.0.1:23135/solr/collection1/&wt=javabin&version=2} status=0 QTime=1 
[junit4:junit4]   2> 17805 T1451 C140 P23135 REQ /update {distrib.from=http://127.0.0.1:23127/solr/collection1/&update.distrib=TOLEADER&wt=javabin&version=2} status=0 QTime=5 
[junit4:junit4]   2> 17805 T1444 C138 P23127 /update {wt=javabin&version=2} {add=[136]} 0 8
[junit4:junit4]   2> 17810 T1424 C141 P23112 /update {wt=javabin&version=2} {add=[137 (1413548683339759616)]} 0 1
[junit4:junit4]   2> 17821 T1476 C139 P23146 REQ /update {update.distrib=FROMLEADER&distrib.from=http://127.0.0.1:23135/solr/collection1/&wt=javabin&version=2} status=0 QTime=1 
[junit4:junit4]   2> 17822 T1451 C140 P23135 REQ /update {distrib.from=http://127.0.0.1:23127/solr/collection1/&update.distrib=TOLEADER&wt=javabin&version=2} status=0 QTime=6 
[junit4:junit4]   2> 17823 T1444 C138 P23127 /update {wt=javabin&version=2} {add=[137]} 0 10
[junit4:junit4]   2> 17827 T1424 C141 P23112 /update {wt=javabin&version=2} {add=[138 (1413548683357585408)]} 0 1
[junit4:junit4]   2> 17835 T1462 C137 P23140 REQ /update {distrib.from=http://127.0.0.1:23127/solr/collection1/&update.distrib=FROMLEADER&wt=javabin&version=2} status=0 QTime=1 
[junit4:junit4]   2> 17836 T1444 C138 P23127 /update {wt=javabin&version=2} {add=[138 (1413548683361779712)]} 0 6
[junit4:junit4]   2> 17840 T1424 C141 P23112 /update {wt=javabin&version=2} {add=[139 (1413548683371216896)]} 0 1
[junit4:junit4]   2> 17850 T1476 C139 P23146 REQ /update {update.distrib=FROMLEADER&distrib.from=http://127.0.0.1:23135/solr/collection1/&wt=javabin&version=2} status=0 QTime=1 
[junit4:junit4]   2> 17852 T1451 C140 P23135 REQ /update {distrib.from=http://127.0.0.1:23127/solr/collection1/&update.distrib=TOLEADER&wt=javabin&version=2} status=0 QTime=6 
[junit4:junit4]   2> 17852 T1444 C138 P23127 /update {wt=javabin&version=2} {add=[139]} 0 9
[junit4:junit4]   2> 17859 T1424 C141 P23112 /update {wt=javabin&version=2} {add=[140 (1413548683389042688)]} 0 3
[junit4:junit4]   2> 17870 T1476 C139 P23146 REQ /update {update.distrib=FROMLEADER&distrib.from=http://127.0.0.1:23135/solr/collection1/&wt=javabin&version=2} status=0 QTime=1 
[junit4:junit4]   2> 17871 T1451 C140 P23135 REQ /update {distrib.from=http://127.0.0.1:23127/solr/collection1/&update.distrib=TOLEADER&wt=javabin&version=2} status=0 QTime=6 
[junit4:junit4]   2> 17872 T1444 C138 P23127 /update {wt=javabin&version=2} {add=[140]} 0 10
[junit4:junit4]   2> 17876 T1424 C141 P23112 /update {wt=javabin&version=2} {add=[141 (1413548683408965632)]} 0 1
[junit4:junit4]   2> 17883 T1476 C139 P23146 REQ /update {distrib.from=http://127.0.0.1:23135/solr/collection1/&update.distrib=FROMLEADER&wt=javabin&version=2} status=0 QTime=1 
[junit4:junit4]   2> 17884 T1452 C140 P23135 /update {wt=javabin&version=2} {add=[141 (1413548683413159936)]} 0 5
[junit4:junit4]   2> 17888 T1424 C141 P23112 /update {wt=javabin&version=2} {add=[142 (1413548683421548544)]} 0 1
[junit4:junit4]   2> 17940 T1476 C139 P23146 REQ /update {distrib.from=http://127.0.0.1:23135/solr/collection1/&update.distrib=FROMLEADER&wt=javabin&version=2} status=0 QTime=28 
[junit4:junit4]   2> 17941 T1452 C140 P23135 /update {wt=javabin&version=2} {add=[142 (1413548683425742848)]} 0 50
[junit4:junit4]   2> 17972 T1424 C141 P23112 /update {wt=javabin&version=2} {add=[143 (1413548683482365952)]} 0 28
[junit4:junit4]   2> 17986 T1476 C139 P23146 REQ /update {update.distrib=FROMLEADER&distrib.from=http://127.0.0.1:23135/solr/collection1/&wt=javabin&version=2} status=0 QTime=3 
[junit4:junit4]   2> 17987 T1451 C140 P23135 REQ /update {distrib.from=http://127.0.0.1:23127/solr/collection1/&update.distrib=TOLEADER&wt=javabin&version=2} status=0 QTime=9 
[junit4:junit4]   2> 17988 T1444 C138 P23127 /update {wt=javabin&version=2} {add=[143]} 0 13
[junit4:junit4]   2> 17994 T1424 C141 P23112 /update {wt=javabin&version=2} {add=[144 (1413548683530600448)]} 0 3
[junit4:junit4]   2> 18004 T1476 C139 P23146 REQ /update {update.distrib=FROMLEADER&distrib.from=http://127.0.0.1:23135/solr/collection1/&wt=javabin&version=2} status=0 QTime=1 
[junit4:junit4]   2> 18005 T1451 C140 P23135 REQ /update {distrib.from=http://127.0.0.1:23127/solr/collection1/&update.distrib=TOLEADER&wt=javabin&version=2} status=0 QTime=5 
[junit4:junit4]   2> 18006 T1444 C138 P23127 /update {wt=javabin&version=2} {add=[144]} 0 9
[junit4:junit4]   2> 18010 T1424 C141 P23112 /update {wt=javabin&version=2} {add=[145 (1413548683549474816)]} 0 1
[junit4:junit4]   2> 18018 T1476 C139 P23146 REQ /update {distrib.from=http://127.0.0.1:23135/solr/collection1/&update.distrib=FROMLEADER&wt=javabin&version=2} status=0 QTime=1 
[junit4:junit4]   2> 18019 T1452 C140 P23135 /update {wt=javabin&version=2} {add=[145 (1413548683554717696)]} 0 6
[junit4:junit4]   2> 18023 T1424 C141 P23112 /update {wt=javabin&version=2} {add=[146 (1413548683563106304)]} 0 1
[junit4:junit4]   2> 18097 T1462 C137 P23140 REQ /update {update.distrib=FROMLEADER&distrib.from=http://127.0.0.1:23127/solr/collection1/&wt=javabin&version=2} status=0 QTime=27 
[junit4:junit4]   2> 18098 T1440 C138 P23127 REQ /update {distrib.from=http://127.0.0.1:23135/solr/collection1/&update.distrib=TOLEADER&wt=javabin&version=2} status=0 QTime=69 
[junit4:junit4]   2> 18099 T1452 C140 P23135 /update {wt=javabin&version=2} {add=[146]} 0 73
[junit4:junit4]   2> 18104 T1424 C141 P23112 /update {wt=javabin&version=2} {add=[147 (1413548683648040960)]} 0 2
[junit4:junit4]   2> 18113 T1476 C139 P23146 REQ /update {update.distrib=FROMLEADER&distrib.from=http://127.0.0.1:23135/solr/collection1/&wt=javabin&version=2} status=0 QTime=1 
[junit4:junit4]   2> 18114 T1451 C140 P23135 REQ /update {distrib.from=http://127.0.0.1:23127/solr/collection1/&update.distrib=TOLEADER&wt=javabin&version=2} status=0 QTime=5 
[junit4:junit4]   2> 18115 T1444 C138 P23127 /update {wt=javabin&version=2} {add=[147]} 0 9
[junit4:junit4]   2> 18119 T1424 C141 P23112 /update {wt=javabin&version=2} {add=[148 (1413548683663769600)]} 0 1
[junit4:junit4]   2> 18136 T1462 C137 P23140 REQ /update {update.distrib=FROMLEADER&distrib.from=http://127.0.0.1:23127/solr/collection1/&wt=javabin&version=2} status=0 QTime=4 
[junit4:junit4]   2> 18137 T1440 C138 P23127 REQ /update {distrib.from=http://127.0.0.1:23135/solr/collection1/&update.distrib=TOLEADER&wt=javabin&version=2} status=0 QTime=11 
[junit4:junit4]   2> 18137 T1452 C140 P23135 /update {wt=javabin&version=2} {add=[148]} 0 15
[junit4:junit4]   2> 18142 T1424 C141 P23112 /update {wt=javabin&version=2} {add=[149 (1413548683688935424)]} 0 1
[junit4:junit4]   2> 18150 T1476 C139 P23146 REQ /update {distrib.from=http://127.0.0.1:23135/solr/collection1/&update.distrib=FROMLEADER&wt=javabin&version=2} status=0 QTime=1 
[junit4:junit4]   2> 18151 T1452 C140 P23135 /update {wt=javabin&version=2} {add=[149 (1413548683693129728)]} 0 6
[junit4:junit4]   2> 18152 T1412 oasc.AbstractDistribZkTestBase.waitForRecoveriesToFinish Wait for recoveries to finish - collection: collection1 failOnTimeout:true timeout (sec):1800
[junit4:junit4]   2> 18153 T1412 oascc.ZkStateReader.updateClusterState Updating cloud state from ZooKeeper... 
[junit4:junit4]   2> 18156 T1424 C141 P23112 oasu.DirectUpdateHandler2.commit start commit{flags=0,_version_=0,optimize=false,openSearcher=true,waitSearcher=true,expungeDeletes=false,softCommit=false}
[junit4:junit4]   2> 18619 T1424 C141 P23112 oasc.SolrDeletionPolicy.onCommit SolrDeletionPolicy.onCommit: commits:num=2
[junit4:junit4]   2> 		commit{dir=/usr/home/hudson/hudson-slave/workspace/Lucene-Solr-Tests-4.x-java7/solr/build/solr-core/test/J0/org.apache.solr.cloud.BasicDistributedZk2Test-1348065056487/control/data/index,segFN=segments_2,generation=2,filenames=[_0_Asserting_0.tim, _0.fnm, _0_Pulsing40_0.tim, _0_Asserting_0.tip, _0_Memory_0.ram, _0_NestedPulsing_0.frq, _0_nrm.cfs, _0_Pulsing40_0.prx, _0_NestedPulsing_0.tip, _0_Pulsing40_0.frq, _0_NestedPulsing_0.prx, _0_NestedPulsing_0.tim, _0_Asserting_0.prx, _0_Asserting_0.frq, _0_nrm.cfe, _0_Pulsing40_0.tip, segments_2, _0.fdx, _0.si, _0.fdt]
[junit4:junit4]   2> 		commit{dir=/usr/home/hudson/hudson-slave/workspace/Lucene-Solr-Tests-4.x-java7/solr/build/solr-core/test/J0/org.apache.solr.cloud.BasicDistributedZk2Test-1348065056487/control/data/index,segFN=segments_3,generation=3,filenames=[_5_nrm.cfe, _2_NestedPulsing_0.tim, _1_NestedPulsing_0.tip, _5_Memory_0.ram, _5_NestedPulsing_0.tip, _5_NestedPulsing_0.tim, _6_Asserting_0.frq, _7.si, _3.fdt, _3_NestedPulsing_0.prx, _0_Pulsing40_0.frq, _7_Memory_0.ram, _7.fnm, _1_Asserting_0.tim, _7_NestedPulsing_0.frq, _6_NestedPulsing_0.prx, _1_Asserting_0.tip, _5_Pulsing40_0.tip, _1_NestedPulsing_0.tim, _2_NestedPulsing_0.tip, _5_Pulsing40_0.tim, _4_Asserting_0.frq, _0_Pulsing40_0.tim, _0_Memory_0.ram, _2.fdt, _3_NestedPulsing_0.tim, _3_Pulsing40_0.tip, _7.fdx, _2.fdx, _7.fdt, _3_Pulsing40_0.tim, _1.fdx, _2_Asserting_0.tim, _0_Asserting_0.frq, _7_Pulsing40_0.frq, _2_Asserting_0.tip, _5_nrm.cfs, _1.fdt, _3_NestedPulsing_0.tip, _7_NestedPulsing_0.tim, _3.si, _4_NestedPulsing_0.frq, _6.fdt, _7_NestedPulsing_0.tip, _6_Memory_0.ram, _2.si, _0_Asserting_0.tim, _3_Pulsing40_0.frq, _6_NestedPulsing_0.frq, _2_Pulsing40_0.tim, _0_Asserting_0.tip, _6.fdx, _2_Pulsing40_0.tip, _4_Asserting_0.tip, _3.fnm, _0_NestedPulsing_0.tip, _7_Asserting_0.frq, _0_NestedPulsing_0.tim, _4_Pulsing40_0.prx, _1_Memory_0.ram, _2_nrm.cfe, _4_Asserting_0.prx, _5_Pulsing40_0.frq, _4_Asserting_0.tim, _0_Pulsing40_0.tip, _4_NestedPulsing_0.tip, _4_NestedPulsing_0.tim, _2_nrm.cfs, _6_Asserting_0.prx, _2_NestedPulsing_0.prx, _1_Asserting_0.frq, _0_NestedPulsing_0.frq, _0_NestedPulsing_0.prx, _2.fnm, _7_Pulsing40_0.tim, _3.fdx, _4_Pulsing40_0.tip, _1_NestedPulsing_0.frq, _4_Pulsing40_0.tim, _5_NestedPulsing_0.frq, _5_Pulsing40_0.prx, _1_Asserting_0.prx, _1.si, _2_NestedPulsing_0.frq, _6_NestedPulsing_0.tip, _6.si, _6.fnm, _6_NestedPulsing_0.tim, _7_Pulsing40_0.tip, _3_nrm.cfe, _5.fdt, _1_Pulsing40_0.tip, _6_Pulsing40_0.frq, _1_Pulsing40_0.tim, _4.fnm, _4_nrm.cfe, _0_Pulsing40_0.prx, _7_Pulsing40_0.prx, _1.fnm, _1_Pulsing40_0.frq, _0_Asserting_0.prx, _4.fdx, _3_Asserting_0.prx, _6_Pulsing40_0.tim, _1_Pulsing40_0.prx, _6_Pulsing40_0.tip, _2_Asserting_0.prx, _4_NestedPulsing_0.prx, _7_Asserting_0.tip, _2_Pulsing40_0.prx, _7_Asserting_0.tim, _0.fnm, _5_Asserting_0.tim, _2_Pulsing40_0.frq, _5.si, _3_nrm.cfs, _3_NestedPulsing_0.frq, _6_Pulsing40_0.prx, _4_Memory_0.ram, _4_nrm.cfs, _5_Asserting_0.tip, _5_Asserting_0.prx, _1_NestedPulsing_0.prx, _6_Asserting_0.tim, _6_Asserting_0.tip, _6_nrm.cfs, _7_nrm.cfs, _5_Asserting_0.frq, _2_Asserting_0.frq, _2_Memory_0.ram, _0.si, _3_Memory_0.ram, _1_nrm.cfs, _5.fnm, _7_NestedPulsing_0.prx, _7_nrm.cfe, _7_Asserting_0.prx, _6_nrm.cfe, _0_nrm.cfs, _4.fdt, _4.si, _1_nrm.cfe, _3_Asserting_0.frq, _5_NestedPulsing_0.prx, _3_Pulsing40_0.prx, _4_Pulsing40_0.frq, _3_Asserting_0.tim, _3_Asserting_0.tip, _0_nrm.cfe, _5.fdx, _0.fdx, segments_3, _0.fdt]
[junit4:junit4]   2> 18620 T1424 C141 P23112 oasc.SolrDeletionPolicy.updateCommits newest commit = 3
[junit4:junit4]   2> 18686 T1424 C141 P23112 oass.SolrIndexSearcher.<init> Opening Searcher@1c2109b0 main
[junit4:junit4]   2> 18687 T1424 C141 P23112 oasu.DirectUpdateHandler2.commit end_commit_flush
[junit4:junit4]   2> 18688 T1435 oasc.SolrCore.registerSearcher [collection1] Registered new searcher Searcher@1c2109b0 main{StandardDirectoryReader(segments_3:17 _0(4.0.0.2):C1 _1(4.0.0.2):C10 _2(4.0.0.2):C10 _3(4.0.0.2):C10 _4(4.0.0.2):C10 _5(4.0.0.2):C10 _6(4.0.0.2):C10 _7(4.0.0.2):C6)}
[junit4:junit4]   2> 18689 T1424 C141 P23112 /update {waitSearcher=true&wt=javabin&commit=true&softCommit=false&version=2} {commit=} 0 533
[junit4:junit4]   2> 18692 T1444 C138 P23127 oasu.DirectUpdateHandler2.commit start commit{flags=0,_version_=0,optimize=false,openSearcher=true,waitSearcher=true,expungeDeletes=false,softCommit=false}
[junit4:junit4]   2> 18892 T1444 C138 P23127 oasc.SolrDeletionPolicy.onCommit SolrDeletionPolicy.onCommit: commits:num=2
[junit4:junit4]   2> 		commit{dir=/usr/home/hudson/hudson-slave/workspace/Lucene-Solr-Tests-4.x-java7/solr/build/solr-core/test/J0/org.apache.solr.cloud.BasicDistributedZk2Test-1348065056487/jetty1/index,segFN=segments_2,generation=2,filenames=[_0_Asserting_0.tim, _0.fnm, _0_Pulsing40_0.tim, _0_Asserting_0.tip, _0_Memory_0.ram, _0_NestedPulsing_0.frq, _0_nrm.cfs, _0_Pulsing40_0.prx, _0_NestedPulsing_0.tip, _0_Pulsing40_0.frq, _0_NestedPulsing_0.prx, _0_NestedPulsing_0.tim, _0_Asserting_0.prx, _0_Asserting_0.frq, _0_nrm.cfe, _0_Pulsing40_0.tip, segments_2, _0.fdx, _0.si, _0.fdt]
[junit4:junit4]   2> 		commit{dir=/usr/home/hudson/hudson-slave/workspace/Lucene-Solr-Tests-4.x-java7/solr/build/solr-core/test/J0/org.apache.solr.cloud.BasicDistributedZk2Test-1348065056487/jetty1/index,segFN=segments_3,generation=3,filenames=[_3_nrm.cfe, _1_NestedPulsing_0.tip, _2_NestedPulsing_0.tim, _1_Pulsing40_0.tip, _1_Pulsing40_0.tim, _4_nrm.cfe, _4.fnm, _3.fdt, _3_NestedPulsing_0.prx, _0_Pulsing40_0.prx, _0_Pulsing40_0.frq, _1.fnm, _4.fdx, _0_Asserting_0.prx, _1_Pulsing40_0.frq, _1_Asserting_0.tim, _3_Asserting_0.prx, _1_Asserting_0.tip, _1_Pulsing40_0.prx, _2_Asserting_0.prx, _4_NestedPulsing_0.prx, _1_NestedPulsing_0.tim, _2_Pulsing40_0.prx, _2_NestedPulsing_0.tip, _4_Asserting_0.frq, _0.fnm, _0_Pulsing40_0.tim, _0_Memory_0.ram, _3_Pulsing40_0.tip, _3_NestedPulsing_0.tim, _2.fdt, _2.fdx, _3_Pulsing40_0.tim, _2_Pulsing40_0.frq, _3_nrm.cfs, _2_Asserting_0.tim, _1.fdx, _0_Asserting_0.frq, _3_NestedPulsing_0.frq, _2_Asserting_0.tip, _3_NestedPulsing_0.tip, _1.fdt, _4_Memory_0.ram, _4_nrm.cfs, _3.si, _4_NestedPulsing_0.frq, _3_Pulsing40_0.frq, _0_Asserting_0.tim, _2.si, _2_Pulsing40_0.tim, _1_NestedPulsing_0.prx, _0_Asserting_0.tip, _2_Pulsing40_0.tip, _4_Asserting_0.tip, _3.fnm, _0_NestedPulsing_0.tip, _0_NestedPulsing_0.tim, _4_Pulsing40_0.prx, _4_Asserting_0.prx, _2_nrm.cfe, _1_Memory_0.ram, _4_Asserting_0.tim, _2_Asserting_0.frq, _4_NestedPulsing_0.tip, _0_Pulsing40_0.tip, _4_NestedPulsing_0.tim, _2_Memory_0.ram, _3_Memory_0.ram, _2_nrm.cfs, _0.si, _1_nrm.cfs, _2_NestedPulsing_0.prx, _0_NestedPulsing_0.frq, _1_Asserting_0.frq, _4.si, _4.fdt, _0_nrm.cfs, _0_NestedPulsing_0.prx, _1_nrm.cfe, _2.fnm, _3_Asserting_0.frq, _3.fdx, _4_Pulsing40_0.tip, _4_Pulsing40_0.frq, _3_Pulsing40_0.prx, _4_Pulsing40_0.tim, _1_NestedPulsing_0.frq, _3_Asserting_0.tim, _3_Asserting_0.tip, _1_Asserting_0.prx, _1.si, _2_NestedPulsing_0.frq, _0_nrm.cfe, _0.fdx, _0.fdt, segments_3]
[junit4:junit4]   2> 18894 T1444 C138 P23127 oasc.SolrDeletionPolicy.updateCommits newest commit = 3
[junit4:junit4]   2> 18964 T1444 C138 P23127 oass.SolrIndexSearcher.<init> Opening Searcher@745cfc20 main
[junit4:junit4]   2> 18965 T1444 C138 P23127 oasu.DirectUpdateHandler2.commit end_commit_flush
[junit4:junit4]   2> 18967 T1447 oasc.SolrCore.registerSearcher [collection1] Registered new searcher Searcher@745cfc20 main{StandardDirectoryReader(segments_3:11 _0(4.0.0.2):C1 _1(4.0.0.2):C10 _2(4.0.0.2):C10 _3(4.0.0.2):C10 _4(4.0.0.2):C1)}
[junit4:junit4]   2> 18967 T1444 C138 P23127 oasu.SolrCmdDistributor.distribCommit Distrib commit to:[StdNode: http://127.0.0.1:23140/solr/collection1/, StdNode: http://127.0.0.1:23135/solr/collection1/, StdNode: http://127.0.0.1:23146/solr/collection1/]
[junit4:junit4]   2> 18970 T1476 C139 P23146 oasu.DirectUpdateHandler2.commit start commit{flags=0,_version_=0,optimize=false,openSearcher=true,waitSearcher=true,expungeDeletes=false,softCommit=false}
[junit4:junit4]   2> 18970 T1451 C140 P23135 oasu.DirectUpdateHandler2.commit start commit{flags=0,_version_=0,optimize=false,openSearcher=true,waitSearcher=true,expungeDeletes=false

[...truncated too long message...]

ntext.runLeaderProcess(ElectionContext.java:213)
[junit4:junit4]   2> 	at org.apache.solr.cloud.LeaderElector.runIamLeaderProcess(LeaderElector.java:158)
[junit4:junit4]   2> 	at org.apache.solr.cloud.LeaderElector.checkIfIamLeader(LeaderElector.java:102)
[junit4:junit4]   2> 	at org.apache.solr.cloud.LeaderElector.access$000(LeaderElector.java:56)
[junit4:junit4]   2> 	at org.apache.solr.cloud.LeaderElector$1.process(LeaderElector.java:131)
[junit4:junit4]   2> 	at org.apache.zookeeper.ClientCnxn$EventThread.processEvent(ClientCnxn.java:526)
[junit4:junit4]   2> 	at org.apache.zookeeper.ClientCnxn$EventThread.run(ClientCnxn.java:502)
[junit4:junit4]   2> 
[junit4:junit4]   2> 314135 T1484 oasc.JmxMonitoredMap$SolrDynamicMBean.getMBeanInfo WARNING Could not getStatistics on info bean Lazy[solr.ReplicationHandler] java.lang.IllegalArgumentException: /usr/home/hudson/hudson-slave/workspace/Lucene-Solr-Tests-4.x-java7/solr/build/solr-core/test/J0/org.apache.solr.cloud.BasicDistributedZk2Test-1348065056487/jetty4/index does not exist
[junit4:junit4]   2> 	at org.apache.commons.io.FileUtils.sizeOfDirectory(FileUtils.java:2074)
[junit4:junit4]   2> 	at org.apache.solr.handler.ReplicationHandler.getIndexSize(ReplicationHandler.java:477)
[junit4:junit4]   2> 	at org.apache.solr.handler.ReplicationHandler.getStatistics(ReplicationHandler.java:525)
[junit4:junit4]   2> 	at org.apache.solr.core.RequestHandlers$LazyRequestHandlerWrapper.getStatistics(RequestHandlers.java:310)
[junit4:junit4]   2> 	at org.apache.solr.core.JmxMonitoredMap$SolrDynamicMBean.getMBeanInfo(JmxMonitoredMap.java:231)
[junit4:junit4]   2> 	at com.sun.jmx.interceptor.DefaultMBeanServerInterceptor.getClassName(DefaultMBeanServerInterceptor.java:1804)
[junit4:junit4]   2> 	at com.sun.jmx.interceptor.DefaultMBeanServerInterceptor.safeGetClassName(DefaultMBeanServerInterceptor.java:1595)
[junit4:junit4]   2> 	at com.sun.jmx.interceptor.DefaultMBeanServerInterceptor.checkMBeanPermission(DefaultMBeanServerInterceptor.java:1813)
[junit4:junit4]   2> 	at com.sun.jmx.interceptor.DefaultMBeanServerInterceptor.exclusiveUnregisterMBean(DefaultMBeanServerInterceptor.java:430)
[junit4:junit4]   2> 	at com.sun.jmx.interceptor.DefaultMBeanServerInterceptor.unregisterMBean(DefaultMBeanServerInterceptor.java:415)
[junit4:junit4]   2> 	at com.sun.jmx.mbeanserver.JmxMBeanServer.unregisterMBean(JmxMBeanServer.java:536)
[junit4:junit4]   2> 	at org.apache.solr.core.JmxMonitoredMap.unregister(JmxMonitoredMap.java:175)
[junit4:junit4]   2> 	at org.apache.solr.core.JmxMonitoredMap.clear(JmxMonitoredMap.java:116)
[junit4:junit4]   2> 	at org.apache.solr.core.SolrCore.close(SolrCore.java:864)
[junit4:junit4]   2> 	at org.apache.solr.cloud.ShardLeaderElectionContext.runLeaderProcess(ElectionContext.java:213)
[junit4:junit4]   2> 	at org.apache.solr.cloud.LeaderElector.runIamLeaderProcess(LeaderElector.java:158)
[junit4:junit4]   2> 	at org.apache.solr.cloud.LeaderElector.checkIfIamLeader(LeaderElector.java:102)
[junit4:junit4]   2> 	at org.apache.solr.cloud.LeaderElector.access$000(LeaderElector.java:56)
[junit4:junit4]   2> 	at org.apache.solr.cloud.LeaderElector$1.process(LeaderElector.java:131)
[junit4:junit4]   2> 	at org.apache.zookeeper.ClientCnxn$EventThread.processEvent(ClientCnxn.java:526)
[junit4:junit4]   2> 	at org.apache.zookeeper.ClientCnxn$EventThread.run(ClientCnxn.java:502)
[junit4:junit4]   2> 
[junit4:junit4]   2> 314140 T1484 oasc.SolrCore.closeSearcher [collection1] Closing main searcher on request.
[junit4:junit4]   2> 314143 T1484 oasu.DirectUpdateHandler2.close closing DirectUpdateHandler2{commits=5,autocommits=0,soft autocommits=0,optimizes=0,rollbacks=0,expungeDeletes=0,docsPending=0,adds=0,deletesById=0,deletesByQuery=0,errors=0,cumulative_adds=35,cumulative_deletesById=0,cumulative_deletesByQuery=0,cumulative_errors=0}
[junit4:junit4]   2> 314143 T1484 oasu.DefaultSolrCoreState.decref SolrCoreState ref count has reached 0 - closing IndexWriter
[junit4:junit4]   2> 314146 T1484 oasu.DefaultSolrCoreState.decref Closing SolrCoreState - canceling any ongoing recovery
[junit4:junit4]   2> 314146 T1484 oascc.ZkStateReader$3.process Updating live nodes
[junit4:junit4]   2> 314146 T1484 oascc.ZkStateReader$3.process WARNING ZooKeeper watch triggered, but Solr cannot talk to ZK
[junit4:junit4]   2> 314146 T1484 oascc.ZkStateReader$2.process A cluster state change has occurred - updating...
[junit4:junit4]   2> 314147 T1484 oascc.ZkStateReader$2.process WARNING ZooKeeper watch triggered, but Solr cannot talk to ZK
[junit4:junit4]   2> 314147 T1484 oascc.ConnectionManager.process Watcher org.apache.solr.common.cloud.ConnectionManager@24a72ec1 name:ZooKeeperConnection Watcher:127.0.0.1:23109/solr got event WatchedEvent state:Disconnected type:None path:null path:null type:None
[junit4:junit4]   2> 314147 T1484 oascc.ConnectionManager.process Client->ZooKeeper status change trigger but we are already closed
[junit4:junit4]   2> 314147 T1484 oaz.ClientCnxn$EventThread.run EventThread shut down
[junit4:junit4]   2> NOTE: test params are: codec=Lucene40: {n_f1=PostingsFormat(name=Memory doPackFST= true), foo_b=PostingsFormat(name=NestedPulsing), foo_d=Pulsing40(freqCutoff=16 minBlockSize=17 maxBlockSize=55), foo_f=PostingsFormat(name=NestedPulsing), n_tl1=PostingsFormat(name=Memory doPackFST= true), n_d1=PostingsFormat(name=Asserting), rnd_b=Pulsing40(freqCutoff=16 minBlockSize=17 maxBlockSize=55), intDefault=PostingsFormat(name=Asserting), n_td1=PostingsFormat(name=Memory doPackFST= true), timestamp=PostingsFormat(name=Asserting), id=Pulsing40(freqCutoff=16 minBlockSize=17 maxBlockSize=55), range_facet_sl=PostingsFormat(name=NestedPulsing), range_facet_si=PostingsFormat(name=Memory doPackFST= true), oddField_s=PostingsFormat(name=NestedPulsing), multiDefault=PostingsFormat(name=Memory doPackFST= true), n_tf1=PostingsFormat(name=Asserting), n_dt1=PostingsFormat(name=Memory doPackFST= true), n_ti1=Pulsing40(freqCutoff=16 minBlockSize=17 maxBlockSize=55), range_facet_l=PostingsFormat(name=Asserting), text=PostingsFormat(name=NestedPulsing), _version_=PostingsFormat(name=Asserting), SubjectTerms_mfacet=PostingsFormat(name=Asserting), a_t=PostingsFormat(name=Asserting), n_tdt1=PostingsFormat(name=Asserting), other_tl1=PostingsFormat(name=Asserting), n_l1=PostingsFormat(name=Asserting), a_si=PostingsFormat(name=Memory doPackFST= true)}, sim=RandomSimilarityProvider(queryNorm=false,coord=crazy): {}, locale=en_SG, timezone=America/Ensenada
[junit4:junit4]   2> NOTE: FreeBSD 9.0-RELEASE amd64/Oracle Corporation 1.7.0_06 (64-bit)/cpus=16,threads=2,free=168604464,total=429916160
[junit4:junit4]   2> NOTE: All tests run in this JVM: [JSONWriterTest, TestLuceneMatchVersion, BadComponentTest, MoreLikeThisHandlerTest, BinaryUpdateRequestHandlerTest, ResourceLoaderTest, TestLFUCache, TestCollationField, LeaderElectionIntegrationTest, UniqFieldsUpdateProcessorFactoryTest, NotRequiredUniqueKeyTest, TestNumberUtils, ClusterStateTest, TestIBSimilarityFactory, CircularListTest, TestBinaryResponseWriter, TestCoreContainer, HighlighterConfigTest, TestBadConfig, TestRangeQuery, TestSystemIdResolver, DateMathParserTest, NumericFieldsTest, TestSearchPerf, SolrCoreCheckLockOnStartupTest, TestCollationKeyRangeQueries, PreAnalyzedFieldTest, SOLR749Test, TestQuerySenderNoQuery, SpatialFilterTest, MBeansHandlerTest, SampleTest, ZkCLITest, UpdateRequestProcessorFactoryTest, TestQueryTypes, CoreAdminHandlerTest, CoreContainerCoreInitFailuresTest, QueryElevationComponentTest, TestFastLRUCache, MinimalSchemaTest, TestConfig, JsonLoaderTest, SortByFunctionTest, IndexBasedSpellCheckerTest, AlternateDirectoryTest, TestElisionMultitermQuery, TestPHPSerializedResponseWriter, TestLMDirichletSimilarityFactory, TestFiltering, TestIndexSearcher, BasicDistributedZkTest, SpellCheckComponentTest, TestReplicationHandler, ZkControllerTest, TestRandomFaceting, SpellCheckCollatorTest, TestExtendedDismaxParser, AutoCommitTest, BasicZkTest, ZkSolrClientTest, WordBreakSolrSpellCheckerTest, TestHashPartitioner, TestJoin, TestFunctionQuery, DirectSolrConnectionTest, CacheHeaderTest, TestCSVLoader, TestCSVResponseWriter, TestPseudoReturnFields, QueryParsingTest, DistanceFunctionTest, StandardRequestHandlerTest, PingRequestHandlerTest, TestSurroundQueryParser, DocumentAnalysisRequestHandlerTest, TestSolrQueryParser, FastVectorHighlighterTest, ReturnFieldsTest, SearchHandlerTest, CopyFieldTest, LoggingHandlerTest, CSVRequestHandlerTest, ShowFileRequestHandlerTest, TestWriterPerf, TestIndexingPerformance, PrimitiveFieldTypeTest, TestUpdate, DefaultValueUpdateProcessorTest, IndexReaderFactoryTest, TestJmxMonitoredMap, SpellPossibilityIteratorTest, TestPerFieldSimilarity, TestLMJelinekMercerSimilarityFactory, TestCodecSupport, TimeZoneUtilsTest, URLClassifyProcessorTest, TestSuggestSpellingConverter, DOMUtilTest, SystemInfoHandlerTest, TestDocumentBuilder, BasicDistributedZk2Test]
[junit4:junit4] Completed on J0 in 314.80s, 1 test, 1 failure <<< FAILURES!

[...truncated 10 lines...]
BUILD FAILED
/usr/home/hudson/hudson-slave/workspace/Lucene-Solr-Tests-4.x-java7/build.xml:32: The following error occurred while executing this line:
/usr/home/hudson/hudson-slave/workspace/Lucene-Solr-Tests-4.x-java7/solr/build.xml:146: The following error occurred while executing this line:
/usr/home/hudson/hudson-slave/workspace/Lucene-Solr-Tests-4.x-java7/lucene/module-build.xml:63: The following error occurred while executing this line:
/usr/home/hudson/hudson-slave/workspace/Lucene-Solr-Tests-4.x-java7/lucene/common-build.xml:1140: The following error occurred while executing this line:
/usr/home/hudson/hudson-slave/workspace/Lucene-Solr-Tests-4.x-java7/lucene/common-build.xml:813: There were test failures: 230 suites, 951 tests, 1 failure, 7 ignored (2 assumptions)

Total time: 32 minutes 37 seconds
Build step 'Invoke Ant' marked build as failure
Recording test results
Email was triggered for: Failure
Sending email for trigger: Failure



Mime
View raw message