lucene-dev mailing list archives

Site index · List index
Message view « Date » · « Thread »
Top « Date » · « Thread »
From Apache Jenkins Server <jenk...@builds.apache.org>
Subject [JENKINS] Lucene-Solr-Tests-4.x-Java6 - Build # 641 - Still Failing
Date Sat, 15 Sep 2012 04:31:20 GMT
Build: https://builds.apache.org/job/Lucene-Solr-Tests-4.x-Java6/641/

1 tests failed.
REGRESSION:  org.apache.solr.cloud.BasicDistributedZk2Test.testDistribSearch

Error Message:
Shard still reported as live in zk

Stack Trace:
java.lang.AssertionError: Shard still reported as live in zk
	at __randomizedtesting.SeedInfo.seed([4BFC51A35AEB7673:CA1ADFBB2DB4164F]:0)
	at org.junit.Assert.fail(Assert.java:93)
	at org.apache.solr.cloud.AbstractFullDistribZkTestBase.waitToSeeNotLive(AbstractFullDistribZkTestBase.java:1215)
	at org.apache.solr.cloud.BasicDistributedZk2Test.brindDownShardIndexSomeDocsAndRecover(BasicDistributedZk2Test.java:190)
	at org.apache.solr.cloud.BasicDistributedZk2Test.doTest(BasicDistributedZk2Test.java:83)
	at org.apache.solr.BaseDistributedSearchTestCase.testDistribSearch(BaseDistributedSearchTestCase.java:691)
	at sun.reflect.NativeMethodAccessorImpl.invoke0(Native Method)
	at sun.reflect.NativeMethodAccessorImpl.invoke(NativeMethodAccessorImpl.java:57)
	at sun.reflect.DelegatingMethodAccessorImpl.invoke(DelegatingMethodAccessorImpl.java:43)
	at java.lang.reflect.Method.invoke(Method.java:616)
	at com.carrotsearch.randomizedtesting.RandomizedRunner.invoke(RandomizedRunner.java:1559)
	at com.carrotsearch.randomizedtesting.RandomizedRunner.access$600(RandomizedRunner.java:79)
	at com.carrotsearch.randomizedtesting.RandomizedRunner$6.evaluate(RandomizedRunner.java:737)
	at com.carrotsearch.randomizedtesting.RandomizedRunner$7.evaluate(RandomizedRunner.java:773)
	at com.carrotsearch.randomizedtesting.RandomizedRunner$8.evaluate(RandomizedRunner.java:787)
	at com.carrotsearch.randomizedtesting.rules.SystemPropertiesRestoreRule$1.evaluate(SystemPropertiesRestoreRule.java:53)
	at org.apache.lucene.util.TestRuleSetupTeardownChained$1.evaluate(TestRuleSetupTeardownChained.java:50)
	at org.apache.lucene.util.TestRuleFieldCacheSanity$1.evaluate(TestRuleFieldCacheSanity.java:51)
	at org.apache.lucene.util.AbstractBeforeAfterRule$1.evaluate(AbstractBeforeAfterRule.java:45)
	at com.carrotsearch.randomizedtesting.rules.SystemPropertiesInvariantRule$1.evaluate(SystemPropertiesInvariantRule.java:55)
	at org.apache.lucene.util.TestRuleThreadAndTestName$1.evaluate(TestRuleThreadAndTestName.java:48)
	at org.apache.lucene.util.TestRuleIgnoreAfterMaxFailures$1.evaluate(TestRuleIgnoreAfterMaxFailures.java:70)
	at org.apache.lucene.util.TestRuleMarkFailure$1.evaluate(TestRuleMarkFailure.java:48)
	at com.carrotsearch.randomizedtesting.rules.StatementAdapter.evaluate(StatementAdapter.java:36)
	at com.carrotsearch.randomizedtesting.ThreadLeakControl$StatementRunner.run(ThreadLeakControl.java:358)
	at com.carrotsearch.randomizedtesting.ThreadLeakControl.forkTimeoutingTask(ThreadLeakControl.java:782)
	at com.carrotsearch.randomizedtesting.ThreadLeakControl$3.evaluate(ThreadLeakControl.java:442)
	at com.carrotsearch.randomizedtesting.RandomizedRunner.runSingleTest(RandomizedRunner.java:746)
	at com.carrotsearch.randomizedtesting.RandomizedRunner$3.evaluate(RandomizedRunner.java:648)
	at com.carrotsearch.randomizedtesting.RandomizedRunner$4.evaluate(RandomizedRunner.java:682)
	at com.carrotsearch.randomizedtesting.RandomizedRunner$5.evaluate(RandomizedRunner.java:693)
	at com.carrotsearch.randomizedtesting.rules.StatementAdapter.evaluate(StatementAdapter.java:36)
	at com.carrotsearch.randomizedtesting.rules.SystemPropertiesRestoreRule$1.evaluate(SystemPropertiesRestoreRule.java:53)
	at org.apache.lucene.util.AbstractBeforeAfterRule$1.evaluate(AbstractBeforeAfterRule.java:45)
	at org.apache.lucene.util.TestRuleStoreClassName$1.evaluate(TestRuleStoreClassName.java:42)
	at com.carrotsearch.randomizedtesting.rules.SystemPropertiesInvariantRule$1.evaluate(SystemPropertiesInvariantRule.java:55)
	at com.carrotsearch.randomizedtesting.rules.NoShadowingOrOverridesOnMethodsRule$1.evaluate(NoShadowingOrOverridesOnMethodsRule.java:39)
	at com.carrotsearch.randomizedtesting.rules.NoShadowingOrOverridesOnMethodsRule$1.evaluate(NoShadowingOrOverridesOnMethodsRule.java:39)
	at com.carrotsearch.randomizedtesting.rules.StatementAdapter.evaluate(StatementAdapter.java:36)
	at org.apache.lucene.util.TestRuleAssertionsRequired$1.evaluate(TestRuleAssertionsRequired.java:43)
	at org.apache.lucene.util.TestRuleMarkFailure$1.evaluate(TestRuleMarkFailure.java:48)
	at org.apache.lucene.util.TestRuleIgnoreAfterMaxFailures$1.evaluate(TestRuleIgnoreAfterMaxFailures.java:70)
	at org.apache.lucene.util.TestRuleIgnoreTestSuites$1.evaluate(TestRuleIgnoreTestSuites.java:55)
	at com.carrotsearch.randomizedtesting.rules.StatementAdapter.evaluate(StatementAdapter.java:36)
	at com.carrotsearch.randomizedtesting.ThreadLeakControl$StatementRunner.run(ThreadLeakControl.java:358)
	at java.lang.Thread.run(Thread.java:679)




Build Log:
[...truncated 6860 lines...]
[junit4:junit4] Suite: org.apache.solr.cloud.BasicDistributedZk2Test
[junit4:junit4]   2> 5 T430 oas.SolrTestCaseJ4.setUp ###Starting testDistribSearch
[junit4:junit4]   2> Creating dataDir: /usr/home/hudson/hudson-slave/workspace/Lucene-Solr-Tests-4.x-Java6/solr/build/solr-core/test/J1/./solrtest-BasicDistributedZk2Test-1347682455959
[junit4:junit4]   2> 6 T430 oasc.ZkTestServer.run STARTING ZK TEST SERVER
[junit4:junit4]   2> 11 T431 oazs.ZooKeeperServer.setTickTime tickTime set to 1000
[junit4:junit4]   2> 12 T431 oazs.NIOServerCnxn$Factory.<init> binding to port 0.0.0.0/0.0.0.0:0
[junit4:junit4]   2> 13 T431 oazsp.FileTxnSnapLog.save Snapshotting: 0
[junit4:junit4]   2> 108 T430 oasc.ZkTestServer.run start zk server on port:58780
[junit4:junit4]   2> 108 T430 oaz.ZooKeeper.<init> Initiating client connection, connectString=127.0.0.1:58780 sessionTimeout=10000 watcher=org.apache.solr.common.cloud.ConnectionManager@d5c4ee6
[junit4:junit4]   2> 109 T436 oaz.ClientCnxn$SendThread.startConnect Opening socket connection to server /127.0.0.1:58780
[junit4:junit4]   2> 109 T430 oascc.ConnectionManager.waitForConnected Waiting for client to connect to ZooKeeper
[junit4:junit4]   2> 111 T436 oaz.ClientCnxn$SendThread.primeConnection Socket connection established to localhost/127.0.0.1:58780, initiating session
[junit4:junit4]   2> 111 T432 oazs.NIOServerCnxn$Factory.run Accepted socket connection from /140.211.11.196:58781
[junit4:junit4]   2> 112 T432 oazs.NIOServerCnxn.readConnectRequest Client attempting to establish new session at /140.211.11.196:58781
[junit4:junit4]   2> 113 T434 oazsp.FileTxnLog.append Creating new log file: log.1
[junit4:junit4]   2> 116 T434 oazs.NIOServerCnxn.finishSessionInit Established session 0x139c822519f0000 with negotiated timeout 10000 for client /140.211.11.196:58781
[junit4:junit4]   2> 116 T436 oaz.ClientCnxn$SendThread.readConnectResult Session establishment complete on server localhost/127.0.0.1:58780, sessionid = 0x139c822519f0000, negotiated timeout = 10000
[junit4:junit4]   2> 117 T437 oascc.ConnectionManager.process Watcher org.apache.solr.common.cloud.ConnectionManager@d5c4ee6 name:ZooKeeperConnection Watcher:127.0.0.1:58780 got event WatchedEvent state:SyncConnected type:None path:null path:null type:None
[junit4:junit4]   2> 117 T430 oascc.ConnectionManager.waitForConnected Client is connected to ZooKeeper
[junit4:junit4]   2> 118 T430 oascc.SolrZkClient.makePath makePath: /solr
[junit4:junit4]   2> 123 T435 oazs.PrepRequestProcessor.pRequest Processed session termination for sessionid: 0x139c822519f0000
[junit4:junit4]   2> 124 T437 oaz.ClientCnxn$EventThread.run EventThread shut down
[junit4:junit4]   2> 124 T430 oaz.ZooKeeper.close Session: 0x139c822519f0000 closed
[junit4:junit4]   2> 125 T432 oazs.NIOServerCnxn.closeSock Closed socket connection for client /140.211.11.196:58781 which had sessionid 0x139c822519f0000
[junit4:junit4]   2> 125 T430 oaz.ZooKeeper.<init> Initiating client connection, connectString=127.0.0.1:58780/solr sessionTimeout=10000 watcher=org.apache.solr.common.cloud.ConnectionManager@2843d653
[junit4:junit4]   2> 126 T438 oaz.ClientCnxn$SendThread.startConnect Opening socket connection to server /127.0.0.1:58780
[junit4:junit4]   2> 126 T430 oascc.ConnectionManager.waitForConnected Waiting for client to connect to ZooKeeper
[junit4:junit4]   2> 127 T438 oaz.ClientCnxn$SendThread.primeConnection Socket connection established to localhost/127.0.0.1:58780, initiating session
[junit4:junit4]   2> 127 T432 oazs.NIOServerCnxn$Factory.run Accepted socket connection from /140.211.11.196:58782
[junit4:junit4]   2> 128 T432 oazs.NIOServerCnxn.readConnectRequest Client attempting to establish new session at /140.211.11.196:58782
[junit4:junit4]   2> 129 T434 oazs.NIOServerCnxn.finishSessionInit Established session 0x139c822519f0001 with negotiated timeout 10000 for client /140.211.11.196:58782
[junit4:junit4]   2> 129 T438 oaz.ClientCnxn$SendThread.readConnectResult Session establishment complete on server localhost/127.0.0.1:58780, sessionid = 0x139c822519f0001, negotiated timeout = 10000
[junit4:junit4]   2> 130 T439 oascc.ConnectionManager.process Watcher org.apache.solr.common.cloud.ConnectionManager@2843d653 name:ZooKeeperConnection Watcher:127.0.0.1:58780/solr got event WatchedEvent state:SyncConnected type:None path:null path:null type:None
[junit4:junit4]   2> 130 T430 oascc.ConnectionManager.waitForConnected Client is connected to ZooKeeper
[junit4:junit4]   2> 131 T430 oascc.SolrZkClient.makePath makePath: /collections/collection1
[junit4:junit4]   2> 145 T430 oascc.SolrZkClient.makePath makePath: /collections/collection1/shards
[junit4:junit4]   2> 148 T430 oascc.SolrZkClient.makePath makePath: /collections/control_collection
[junit4:junit4]   2> 151 T430 oascc.SolrZkClient.makePath makePath: /collections/control_collection/shards
[junit4:junit4]   2> 160 T430 oasc.AbstractZkTestCase.putConfig put /usr/home/hudson/hudson-slave/workspace/Lucene-Solr-Tests-4.x-Java6/solr/build/solr-core/test-files/solr/collection1/conf/solrconfig.xml to /configs/conf1/solrconfig.xml
[junit4:junit4]   2> 163 T430 oascc.SolrZkClient.makePath makePath: /configs/conf1/solrconfig.xml
[junit4:junit4]   2> 177 T430 oasc.AbstractZkTestCase.putConfig put /usr/home/hudson/hudson-slave/workspace/Lucene-Solr-Tests-4.x-Java6/solr/build/solr-core/test-files/solr/collection1/conf/schema.xml to /configs/conf1/schema.xml
[junit4:junit4]   2> 179 T430 oascc.SolrZkClient.makePath makePath: /configs/conf1/schema.xml
[junit4:junit4]   2> 284 T430 oasc.AbstractZkTestCase.putConfig put /usr/home/hudson/hudson-slave/workspace/Lucene-Solr-Tests-4.x-Java6/solr/build/solr-core/test-files/solr/collection1/conf/solrconfig.xml to /configs/conf1/solrconfig.xml
[junit4:junit4]   2> 285 T430 oascc.SolrZkClient.makePath makePath: /configs/conf1/solrconfig.xml
[junit4:junit4]   2> 288 T430 oasc.AbstractZkTestCase.putConfig put /usr/home/hudson/hudson-slave/workspace/Lucene-Solr-Tests-4.x-Java6/solr/build/solr-core/test-files/solr/collection1/conf/stopwords.txt to /configs/conf1/stopwords.txt
[junit4:junit4]   2> 289 T430 oascc.SolrZkClient.makePath makePath: /configs/conf1/stopwords.txt
[junit4:junit4]   2> 298 T430 oasc.AbstractZkTestCase.putConfig put /usr/home/hudson/hudson-slave/workspace/Lucene-Solr-Tests-4.x-Java6/solr/build/solr-core/test-files/solr/collection1/conf/protwords.txt to /configs/conf1/protwords.txt
[junit4:junit4]   2> 298 T430 oascc.SolrZkClient.makePath makePath: /configs/conf1/protwords.txt
[junit4:junit4]   2> 302 T430 oasc.AbstractZkTestCase.putConfig put /usr/home/hudson/hudson-slave/workspace/Lucene-Solr-Tests-4.x-Java6/solr/build/solr-core/test-files/solr/collection1/conf/currency.xml to /configs/conf1/currency.xml
[junit4:junit4]   2> 302 T430 oascc.SolrZkClient.makePath makePath: /configs/conf1/currency.xml
[junit4:junit4]   2> 306 T430 oasc.AbstractZkTestCase.putConfig put /usr/home/hudson/hudson-slave/workspace/Lucene-Solr-Tests-4.x-Java6/solr/build/solr-core/test-files/solr/collection1/conf/open-exchange-rates.json to /configs/conf1/open-exchange-rates.json
[junit4:junit4]   2> 307 T430 oascc.SolrZkClient.makePath makePath: /configs/conf1/open-exchange-rates.json
[junit4:junit4]   2> 310 T430 oasc.AbstractZkTestCase.putConfig put /usr/home/hudson/hudson-slave/workspace/Lucene-Solr-Tests-4.x-Java6/solr/build/solr-core/test-files/solr/collection1/conf/mapping-ISOLatin1Accent.txt to /configs/conf1/mapping-ISOLatin1Accent.txt
[junit4:junit4]   2> 311 T430 oascc.SolrZkClient.makePath makePath: /configs/conf1/mapping-ISOLatin1Accent.txt
[junit4:junit4]   2> 314 T430 oasc.AbstractZkTestCase.putConfig put /usr/home/hudson/hudson-slave/workspace/Lucene-Solr-Tests-4.x-Java6/solr/build/solr-core/test-files/solr/collection1/conf/old_synonyms.txt to /configs/conf1/old_synonyms.txt
[junit4:junit4]   2> 315 T430 oascc.SolrZkClient.makePath makePath: /configs/conf1/old_synonyms.txt
[junit4:junit4]   2> 319 T430 oasc.AbstractZkTestCase.putConfig put /usr/home/hudson/hudson-slave/workspace/Lucene-Solr-Tests-4.x-Java6/solr/build/solr-core/test-files/solr/collection1/conf/synonyms.txt to /configs/conf1/synonyms.txt
[junit4:junit4]   2> 319 T430 oascc.SolrZkClient.makePath makePath: /configs/conf1/synonyms.txt
[junit4:junit4]   2> 323 T435 oazs.PrepRequestProcessor.pRequest Processed session termination for sessionid: 0x139c822519f0001
[junit4:junit4]   2> 324 T439 oaz.ClientCnxn$EventThread.run EventThread shut down
[junit4:junit4]   2> 324 T430 oaz.ZooKeeper.close Session: 0x139c822519f0001 closed
[junit4:junit4]   2> 324 T432 oazs.NIOServerCnxn.closeSock Closed socket connection for client /140.211.11.196:58782 which had sessionid 0x139c822519f0001
[junit4:junit4]   2> 1008 T430 oejs.Server.doStart jetty-8.1.2.v20120308
[junit4:junit4]   2> 1376 T430 oejs.AbstractConnector.doStart Started SocketConnector@0.0.0.0:58784
[junit4:junit4]   2> 1423 T430 oasc.SolrResourceLoader.locateSolrHome JNDI not configured for solr (NoInitialContextEx)
[junit4:junit4]   2> 1424 T430 oasc.SolrResourceLoader.locateSolrHome using system property solr.solr.home: /usr/home/hudson/hudson-slave/workspace/Lucene-Solr-Tests-4.x-Java6/solr/build/solr-core/test-files/solr
[junit4:junit4]   2> 1424 T430 oasc.SolrResourceLoader.<init> new SolrResourceLoader for deduced Solr Home: '/usr/home/hudson/hudson-slave/workspace/Lucene-Solr-Tests-4.x-Java6/solr/build/solr-core/test-files/solr/'
[junit4:junit4]   2> 1472 T430 oass.SolrDispatchFilter.init SolrDispatchFilter.init()
[junit4:junit4]   2> 1473 T430 oasc.SolrResourceLoader.locateSolrHome JNDI not configured for solr (NoInitialContextEx)
[junit4:junit4]   2> 1473 T430 oasc.SolrResourceLoader.locateSolrHome using system property solr.solr.home: /usr/home/hudson/hudson-slave/workspace/Lucene-Solr-Tests-4.x-Java6/solr/build/solr-core/test-files/solr
[junit4:junit4]   2> 1474 T430 oasc.CoreContainer$Initializer.initialize looking for solr.xml: /usr/home/hudson/hudson-slave/workspace/Lucene-Solr-Tests-4.x-Java6/solr/build/solr-core/test-files/solr/solr.xml
[junit4:junit4]   2> 1474 T430 oasc.CoreContainer.<init> New CoreContainer 1111700275
[junit4:junit4]   2> 1475 T430 oasc.CoreContainer.load Loading CoreContainer using Solr Home: '/usr/home/hudson/hudson-slave/workspace/Lucene-Solr-Tests-4.x-Java6/solr/build/solr-core/test-files/solr/'
[junit4:junit4]   2> 1476 T430 oasc.SolrResourceLoader.<init> new SolrResourceLoader for directory: '/usr/home/hudson/hudson-slave/workspace/Lucene-Solr-Tests-4.x-Java6/solr/build/solr-core/test-files/solr/'
[junit4:junit4]   2> 1508 T430 oasc.CoreContainer.load Registering Log Listener
[junit4:junit4]   2> 1529 T430 oasc.CoreContainer.initZooKeeper Zookeeper client=127.0.0.1:58780/solr
[junit4:junit4]   2> 1529 T430 oaz.ZooKeeper.<init> Initiating client connection, connectString=127.0.0.1:58780/solr sessionTimeout=5000 watcher=org.apache.solr.common.cloud.ConnectionManager@53cdad73
[junit4:junit4]   2> 1530 T450 oaz.ClientCnxn$SendThread.startConnect Opening socket connection to server /127.0.0.1:58780
[junit4:junit4]   2> 1530 T430 oascc.ConnectionManager.waitForConnected Waiting for client to connect to ZooKeeper
[junit4:junit4]   2> 1533 T450 oaz.ClientCnxn$SendThread.primeConnection Socket connection established to localhost/127.0.0.1:58780, initiating session
[junit4:junit4]   2> 1533 T432 oazs.NIOServerCnxn$Factory.run Accepted socket connection from /140.211.11.196:58785
[junit4:junit4]   2> 1534 T432 oazs.NIOServerCnxn.readConnectRequest Client attempting to establish new session at /140.211.11.196:58785
[junit4:junit4]   2> 1536 T434 oazs.NIOServerCnxn.finishSessionInit Established session 0x139c822519f0002 with negotiated timeout 5000 for client /140.211.11.196:58785
[junit4:junit4]   2> 1536 T450 oaz.ClientCnxn$SendThread.readConnectResult Session establishment complete on server localhost/127.0.0.1:58780, sessionid = 0x139c822519f0002, negotiated timeout = 5000
[junit4:junit4]   2> 1536 T451 oascc.ConnectionManager.process Watcher org.apache.solr.common.cloud.ConnectionManager@53cdad73 name:ZooKeeperConnection Watcher:127.0.0.1:58780/solr got event WatchedEvent state:SyncConnected type:None path:null path:null type:None
[junit4:junit4]   2> 1537 T430 oascc.ConnectionManager.waitForConnected Client is connected to ZooKeeper
[junit4:junit4]   2> 1557 T435 oazs.PrepRequestProcessor.pRequest Got user-level KeeperException when processing sessionid:0x139c822519f0002 type:create cxid:0x2 zxid:0xfffffffffffffffe txntype:unknown reqpath:n/a Error Path:/solr/overseer Error:KeeperErrorCode = NodeExists for /solr/overseer
[junit4:junit4]   2> 1558 T430 oascc.SolrZkClient.makePath makePath: /live_nodes
[junit4:junit4]   2> 1561 T430 oasc.ZkController.createEphemeralLiveNode Register node as live in ZooKeeper:/live_nodes/127.0.0.1:58784_solr
[junit4:junit4]   2> 1561 T435 oazs.PrepRequestProcessor.pRequest Got user-level KeeperException when processing sessionid:0x139c822519f0002 type:delete cxid:0x7 zxid:0xfffffffffffffffe txntype:unknown reqpath:n/a Error Path:/solr/live_nodes/127.0.0.1:58784_solr Error:KeeperErrorCode = NoNode for /solr/live_nodes/127.0.0.1:58784_solr
[junit4:junit4]   2> 1571 T430 oascc.SolrZkClient.makePath makePath: /live_nodes/127.0.0.1:58784_solr
[junit4:junit4]   2> 1578 T430 oashc.HttpShardHandlerFactory.getParameter Setting socketTimeout to: 0
[junit4:junit4]   2> 1579 T430 oashc.HttpShardHandlerFactory.getParameter Setting urlScheme to: http://
[junit4:junit4]   2> 1579 T430 oashc.HttpShardHandlerFactory.getParameter Setting connTimeout to: 0
[junit4:junit4]   2> 1579 T430 oashc.HttpShardHandlerFactory.getParameter Setting maxConnectionsPerHost to: 20
[junit4:junit4]   2> 1580 T430 oashc.HttpShardHandlerFactory.getParameter Setting corePoolSize to: 0
[junit4:junit4]   2> 1580 T430 oashc.HttpShardHandlerFactory.getParameter Setting maximumPoolSize to: 2147483647
[junit4:junit4]   2> 1581 T430 oashc.HttpShardHandlerFactory.getParameter Setting maxThreadIdleTime to: 5
[junit4:junit4]   2> 1581 T430 oashc.HttpShardHandlerFactory.getParameter Setting sizeOfQueue to: -1
[junit4:junit4]   2> 1582 T430 oashc.HttpShardHandlerFactory.getParameter Setting fairnessPolicy to: false
[junit4:junit4]   2> 1582 T430 oascsi.HttpClientUtil.createClient Creating new http client, config:maxConnectionsPerHost=20&maxConnections=10000&socketTimeout=0&connTimeout=0&retry=false
[junit4:junit4]   2> 1600 T430 oascc.SolrZkClient.makePath makePath: /overseer_elect/election
[junit4:junit4]   2> 1613 T435 oazs.PrepRequestProcessor.pRequest Got user-level KeeperException when processing sessionid:0x139c822519f0002 type:delete cxid:0x15 zxid:0xfffffffffffffffe txntype:unknown reqpath:n/a Error Path:/solr/overseer_elect/leader Error:KeeperErrorCode = NoNode for /solr/overseer_elect/leader
[junit4:junit4]   2> 1620 T430 oascc.SolrZkClient.makePath makePath: /overseer_elect/leader
[junit4:junit4]   2> 1635 T430 oasc.Overseer.start Overseer (id=88321717434253314-127.0.0.1:58784_solr-n_0000000000) starting
[junit4:junit4]   2> 1636 T435 oazs.PrepRequestProcessor.pRequest Got user-level KeeperException when processing sessionid:0x139c822519f0002 type:create cxid:0x1a zxid:0xfffffffffffffffe txntype:unknown reqpath:n/a Error Path:/solr/overseer Error:KeeperErrorCode = NodeExists for /solr/overseer
[junit4:junit4]   2> 1638 T435 oazs.PrepRequestProcessor.pRequest Got user-level KeeperException when processing sessionid:0x139c822519f0002 type:create cxid:0x1b zxid:0xfffffffffffffffe txntype:unknown reqpath:n/a Error Path:/solr/overseer Error:KeeperErrorCode = NodeExists for /solr/overseer
[junit4:junit4]   2> 1649 T435 oazs.PrepRequestProcessor.pRequest Got user-level KeeperException when processing sessionid:0x139c822519f0002 type:create cxid:0x1c zxid:0xfffffffffffffffe txntype:unknown reqpath:n/a Error Path:/solr/overseer Error:KeeperErrorCode = NodeExists for /solr/overseer
[junit4:junit4]   2> 1651 T435 oazs.PrepRequestProcessor.pRequest Got user-level KeeperException when processing sessionid:0x139c822519f0002 type:create cxid:0x1d zxid:0xfffffffffffffffe txntype:unknown reqpath:n/a Error Path:/solr/overseer Error:KeeperErrorCode = NodeExists for /solr/overseer
[junit4:junit4]   2> 1661 T453 oasc.OverseerCollectionProcessor.run Process current queue of collection creations
[junit4:junit4]   2> 1661 T430 oascc.SolrZkClient.makePath makePath: /clusterstate.json
[junit4:junit4]   2> 1666 T430 oascc.ZkStateReader.createClusterStateWatchersAndUpdate Updating cluster state from ZooKeeper... 
[junit4:junit4]   2> 1668 T452 oasc.Overseer$ClusterStateUpdater.run Starting to work on the main queue
[junit4:junit4]   2> 1681 T430 oasc.CoreContainer.create Creating SolrCore 'collection1' using instanceDir: /usr/home/hudson/hudson-slave/workspace/Lucene-Solr-Tests-4.x-Java6/solr/build/solr-core/test-files/solr/collection1
[junit4:junit4]   2> 1682 T430 oasc.ZkController.createCollectionZkNode Check for collection zkNode:control_collection
[junit4:junit4]   2> 1683 T430 oasc.ZkController.createCollectionZkNode Collection zkNode exists
[junit4:junit4]   2> 1683 T430 oasc.ZkController.readConfigName Load collection config from:/collections/control_collection
[junit4:junit4]   2> 1685 T430 oasc.SolrResourceLoader.<init> new SolrResourceLoader for directory: '/usr/home/hudson/hudson-slave/workspace/Lucene-Solr-Tests-4.x-Java6/solr/build/solr-core/test-files/solr/collection1/'
[junit4:junit4]   2> 1686 T430 oasc.SolrResourceLoader.replaceClassLoader Adding 'file:/usr/home/hudson/hudson-slave/workspace/Lucene-Solr-Tests-4.x-Java6/solr/build/solr-core/test-files/solr/collection1/lib/classes/' to classloader
[junit4:junit4]   2> 1688 T430 oasc.SolrResourceLoader.replaceClassLoader Adding 'file:/usr/home/hudson/hudson-slave/workspace/Lucene-Solr-Tests-4.x-Java6/solr/build/solr-core/test-files/solr/collection1/lib/README' to classloader
[junit4:junit4]   2> 1843 T430 oasc.SolrConfig.<init> Using Lucene MatchVersion: LUCENE_40
[junit4:junit4]   2> 1993 T430 oasc.SolrConfig.<init> Loaded SolrConfig: solrconfig.xml
[junit4:junit4]   2> 2095 T430 oass.IndexSchema.readSchema Reading Solr Schema
[junit4:junit4]   2> 2163 T430 oass.IndexSchema.readSchema Schema name=test
[junit4:junit4]   2> 3278 T430 oass.OpenExchangeRatesOrgProvider.init Initialized with rates=open-exchange-rates.json, refreshInterval=1440.
[junit4:junit4]   2> 3305 T430 oass.IndexSchema.readSchema default search field in schema is text
[junit4:junit4]   2> 3312 T430 oass.IndexSchema.readSchema unique key field: id
[junit4:junit4]   2> 3348 T430 oass.FileExchangeRateProvider.reload Reloading exchange rates from file currency.xml
[junit4:junit4]   2> 3355 T430 oass.FileExchangeRateProvider.reload Reloading exchange rates from file currency.xml
[junit4:junit4]   2> 3361 T430 oass.OpenExchangeRatesOrgProvider.reload Reloading exchange rates from open-exchange-rates.json
[junit4:junit4]   2> 3363 T430 oass.OpenExchangeRatesOrgProvider.reload Reloading exchange rates from open-exchange-rates.json
[junit4:junit4]   2> 3366 T430 oasc.SolrCore.<init> [collection1] Opening new SolrCore at /usr/home/hudson/hudson-slave/workspace/Lucene-Solr-Tests-4.x-Java6/solr/build/solr-core/test-files/solr/collection1/, dataDir=./org.apache.solr.cloud.BasicDistributedZk2Test-1347682455958/control/data/
[junit4:junit4]   2> 3366 T430 oasc.JmxMonitoredMap.<init> JMX monitoring is enabled. Adding Solr mbeans to JMX Server: com.sun.jmx.mbeanserver.JmxMBeanServer@256eb6bc
[junit4:junit4]   2> 3402 T430 oasc.SolrCore.getNewIndexDir WARNING New index directory detected: old=null new=./org.apache.solr.cloud.BasicDistributedZk2Test-1347682455958/control/data/index/
[junit4:junit4]   2> 3404 T430 oasc.SolrCore.initIndex WARNING [collection1] Solr index directory './org.apache.solr.cloud.BasicDistributedZk2Test-1347682455958/control/data/index' doesn't exist. Creating new index...
[junit4:junit4]   2> 3405 T430 oasc.CachingDirectoryFactory.get return new directory for /usr/home/hudson/hudson-slave/workspace/Lucene-Solr-Tests-4.x-Java6/solr/build/solr-core/test/J1/./org.apache.solr.cloud.BasicDistributedZk2Test-1347682455958/control/data/index forceNew:false
[junit4:junit4]   2> 3425 T430 oasc.SolrDeletionPolicy.onCommit SolrDeletionPolicy.onCommit: commits:num=1
[junit4:junit4]   2> 		commit{dir=NRTCachingDirectory(org.apache.lucene.store.NIOFSDirectory@/usr/home/hudson/hudson-slave/workspace/Lucene-Solr-Tests-4.x-Java6/solr/build/solr-core/test/J1/org.apache.solr.cloud.BasicDistributedZk2Test-1347682455958/control/data/index lockFactory=org.apache.lucene.store.NativeFSLockFactory@5cda2610; maxCacheMB=48.0 maxMergeSizeMB=4.0),segFN=segments_1,generation=1,filenames=[segments_1]
[junit4:junit4]   2> 3426 T430 oasc.SolrDeletionPolicy.updateCommits newest commit = 1
[junit4:junit4]   2> 3429 T430 oasc.SolrCore.initWriters created xml: solr.XMLResponseWriter
[junit4:junit4]   2> 3431 T430 oasup.UpdateRequestProcessorChain.init inserting DistributedUpdateProcessorFactory into updateRequestProcessorChain "dedupe"
[junit4:junit4]   2> 3432 T430 oasup.UpdateRequestProcessorChain.init inserting DistributedUpdateProcessorFactory into updateRequestProcessorChain "dedupe-allfields"
[junit4:junit4]   2> 3433 T430 oasup.UpdateRequestProcessorChain.init inserting DistributedUpdateProcessorFactory into updateRequestProcessorChain "stored_sig"
[junit4:junit4]   2> 3433 T430 oasup.UpdateRequestProcessorChain.init inserting DistributedUpdateProcessorFactory into updateRequestProcessorChain "uniq-fields"
[junit4:junit4]   2> 3434 T430 oasup.UpdateRequestProcessorChain.init inserting DistributedUpdateProcessorFactory into updateRequestProcessorChain "distrib-dup-test-chain-implicit"
[junit4:junit4]   2> 3435 T430 oasc.RequestHandlers.initHandlersFromConfig adding lazy requestHandler: solr.ReplicationHandler
[junit4:junit4]   2> 3435 T430 oasc.RequestHandlers.initHandlersFromConfig created /replication: solr.ReplicationHandler
[junit4:junit4]   2> 3437 T430 oasc.RequestHandlers.initHandlersFromConfig created standard: solr.StandardRequestHandler
[junit4:junit4]   2> 3438 T430 oasc.RequestHandlers.initHandlersFromConfig created /get: solr.RealTimeGetHandler
[junit4:junit4]   2> 3439 T430 oasc.RequestHandlers.initHandlersFromConfig created dismax: solr.SearchHandler
[junit4:junit4]   2> 3440 T430 oasc.RequestHandlers.initHandlersFromConfig created mock: org.apache.solr.core.MockQuerySenderListenerReqHandler
[junit4:junit4]   2> 3440 T430 oasc.RequestHandlers.initHandlersFromConfig created /admin/: org.apache.solr.handler.admin.AdminHandlers
[junit4:junit4]   2> 3441 T430 oasc.RequestHandlers.initHandlersFromConfig created defaults: solr.StandardRequestHandler
[junit4:junit4]   2> 3442 T430 oasc.RequestHandlers.initHandlersFromConfig adding lazy requestHandler: solr.StandardRequestHandler
[junit4:junit4]   2> 3442 T430 oasc.RequestHandlers.initHandlersFromConfig created lazy: solr.StandardRequestHandler
[junit4:junit4]   2> 3443 T430 oasc.RequestHandlers.initHandlersFromConfig created /update: solr.UpdateRequestHandler
[junit4:junit4]   2> 3444 T430 oasc.RequestHandlers.initHandlersFromConfig created /terms: org.apache.solr.handler.component.SearchHandler
[junit4:junit4]   2> 3445 T430 oasc.RequestHandlers.initHandlersFromConfig created spellCheckCompRH: org.apache.solr.handler.component.SearchHandler
[junit4:junit4]   2> 3446 T430 oasc.RequestHandlers.initHandlersFromConfig created spellCheckCompRH_Direct: org.apache.solr.handler.component.SearchHandler
[junit4:junit4]   2> 3446 T430 oasc.RequestHandlers.initHandlersFromConfig created spellCheckWithWordbreak: org.apache.solr.handler.component.SearchHandler
[junit4:junit4]   2> 3447 T430 oasc.RequestHandlers.initHandlersFromConfig created spellCheckWithWordbreak_Direct: org.apache.solr.handler.component.SearchHandler
[junit4:junit4]   2> 3448 T430 oasc.RequestHandlers.initHandlersFromConfig created spellCheckCompRH1: org.apache.solr.handler.component.SearchHandler
[junit4:junit4]   2> 3449 T430 oasc.RequestHandlers.initHandlersFromConfig created tvrh: org.apache.solr.handler.component.SearchHandler
[junit4:junit4]   2> 3450 T430 oasc.RequestHandlers.initHandlersFromConfig created /mlt: solr.MoreLikeThisHandler
[junit4:junit4]   2> 3451 T430 oasc.RequestHandlers.initHandlersFromConfig created /debug/dump: solr.DumpRequestHandler
[junit4:junit4]   2> 3460 T430 oashl.XMLLoader.init xsltCacheLifetimeSeconds=60
[junit4:junit4]   2> 3464 T430 oasc.SolrCore.initDeprecatedSupport WARNING solrconfig.xml uses deprecated <admin/gettableFiles>, Please update your config to use the ShowFileRequestHandler.
[junit4:junit4]   2> 3466 T430 oasc.SolrCore.initDeprecatedSupport WARNING adding ShowFileRequestHandler with hidden files: [SCHEMA.XML, OLD_SYNONYMS.TXT, STOPWORDS.TXT, PROTWORDS.TXT, OPEN-EXCHANGE-RATES.JSON, SYNONYMS.TXT, CURRENCY.XML, MAPPING-ISOLATIN1ACCENT.TXT]
[junit4:junit4]   2> 3471 T430 oass.SolrIndexSearcher.<init> Opening Searcher@719b619e main
[junit4:junit4]   2> 3473 T430 oasu.CommitTracker.<init> Hard AutoCommit: disabled
[junit4:junit4]   2> 3473 T430 oasu.CommitTracker.<init> Soft AutoCommit: disabled
[junit4:junit4]   2> 3474 T430 oashc.SpellCheckComponent.inform Initializing spell checkers
[junit4:junit4]   2> 3483 T430 oass.DirectSolrSpellChecker.init init: {name=direct,classname=DirectSolrSpellChecker,field=lowerfilt,minQueryLength=3}
[junit4:junit4]   2> 3568 T454 oasc.SolrCore.registerSearcher [collection1] Registered new searcher Searcher@719b619e main{StandardDirectoryReader(segments_1:1)}
[junit4:junit4]   2> 3577 T435 oazs.PrepRequestProcessor.pRequest Got user-level KeeperException when processing sessionid:0x139c822519f0002 type:create cxid:0x59 zxid:0xfffffffffffffffe txntype:unknown reqpath:n/a Error Path:/solr/overseer/queue Error:KeeperErrorCode = NoNode for /solr/overseer/queue
[junit4:junit4]   2> 3592 T430 oasc.CoreContainer.register registering core: collection1
[junit4:junit4]   2> 3593 T430 oasc.ZkController.register Register shard - core:collection1 address:http://127.0.0.1:58784/solr shardId:control_shard
[junit4:junit4]   2> 3594 T430 oascc.SolrZkClient.makePath makePath: /collections/control_collection/leader_elect/control_shard/election
[junit4:junit4]   2> 3619 T435 oazs.PrepRequestProcessor.pRequest Got user-level KeeperException when processing sessionid:0x139c822519f0002 type:delete cxid:0x68 zxid:0xfffffffffffffffe txntype:unknown reqpath:n/a Error Path:/solr/collections/control_collection/leaders Error:KeeperErrorCode = NoNode for /solr/collections/control_collection/leaders
[junit4:junit4]   2> 3626 T430 oasc.ShardLeaderElectionContext.runLeaderProcess Running the leader process.
[junit4:junit4]   2> 3627 T435 oazs.PrepRequestProcessor.pRequest Got user-level KeeperException when processing sessionid:0x139c822519f0002 type:create cxid:0x69 zxid:0xfffffffffffffffe txntype:unknown reqpath:n/a Error Path:/solr/overseer Error:KeeperErrorCode = NodeExists for /solr/overseer
[junit4:junit4]   2> 3682 T452 oascc.ZkStateReader.updateClusterState Updating cloud state from ZooKeeper... 
[junit4:junit4]   2> 3683 T435 oazs.PrepRequestProcessor.pRequest Got user-level KeeperException when processing sessionid:0x139c822519f0002 type:create cxid:0x70 zxid:0xfffffffffffffffe txntype:unknown reqpath:n/a Error Path:/solr/overseer/queue-work Error:KeeperErrorCode = NoNode for /solr/overseer/queue-work
[junit4:junit4]   2> 3730 T451 oascc.ZkStateReader$2.process A cluster state change has occurred - updating...
[junit4:junit4]   2> 4138 T430 oasc.ShardLeaderElectionContext.waitForReplicasToComeUp Enough replicas found to continue.
[junit4:junit4]   2> 4139 T430 oasc.ShardLeaderElectionContext.runLeaderProcess I may be the new leader - try and sync
[junit4:junit4]   2> 4140 T430 oasc.SyncStrategy.sync Sync replicas to http://127.0.0.1:58784/solr/collection1/
[junit4:junit4]   2> 4140 T430 oasc.SyncStrategy.syncReplicas Sync Success - now sync replicas to me
[junit4:junit4]   2> 4141 T430 oasc.SyncStrategy.syncToMe http://127.0.0.1:58784/solr/collection1/ has no replicas
[junit4:junit4]   2> 4141 T430 oasc.ShardLeaderElectionContext.runLeaderProcess I am the new leader: http://127.0.0.1:58784/solr/collection1/
[junit4:junit4]   2> 4142 T430 oascc.SolrZkClient.makePath makePath: /collections/control_collection/leaders/control_shard
[junit4:junit4]   2> 4177 T435 oazs.PrepRequestProcessor.pRequest Got user-level KeeperException when processing sessionid:0x139c822519f0002 type:create cxid:0x8e zxid:0xfffffffffffffffe txntype:unknown reqpath:n/a Error Path:/solr/overseer Error:KeeperErrorCode = NodeExists for /solr/overseer
[junit4:junit4]   2> 4235 T452 oascc.ZkStateReader.updateClusterState Updating cloud state from ZooKeeper... 
[junit4:junit4]   2> 4260 T451 oascc.ZkStateReader$2.process A cluster state change has occurred - updating...
[junit4:junit4]   2> 4301 T430 oasc.ZkController.register We are http://127.0.0.1:58784/solr/collection1/ and leader is http://127.0.0.1:58784/solr/collection1/
[junit4:junit4]   2> 4301 T430 oasc.ZkController.register No LogReplay needed for core=collection1 baseURL=http://127.0.0.1:58784/solr
[junit4:junit4]   2> 4302 T430 oasc.ZkController.checkRecovery I am the leader, no recovery necessary
[junit4:junit4]   2> 4309 T430 oascc.ZkStateReader.updateClusterState Updating cloud state from ZooKeeper... 
[junit4:junit4]   2> 4310 T430 oass.SolrDispatchFilter.init user.dir=/usr/home/hudson/hudson-slave/workspace/Lucene-Solr-Tests-4.x-Java6/solr/build/solr-core/test/J1
[junit4:junit4]   2> 4311 T430 oass.SolrDispatchFilter.init SolrDispatchFilter.init() done
[junit4:junit4]   2> 4405 T430 oascsi.HttpClientUtil.createClient Creating new http client, config:maxConnections=128&maxConnectionsPerHost=32&followRedirects=false
[junit4:junit4]   2> 4448 T430 oejs.Server.doStart jetty-8.1.2.v20120308
[junit4:junit4]   2> 4451 T430 oejs.AbstractConnector.doStart Started SocketConnector@0.0.0.0:31791
[junit4:junit4]   2> 4452 T430 oasc.SolrResourceLoader.locateSolrHome JNDI not configured for solr (NoInitialContextEx)
[junit4:junit4]   2> 4452 T430 oasc.SolrResourceLoader.locateSolrHome using system property solr.solr.home: /usr/home/hudson/hudson-slave/workspace/Lucene-Solr-Tests-4.x-Java6/solr/build/solr-core/test-files/solr
[junit4:junit4]   2> 4453 T430 oasc.SolrResourceLoader.<init> new SolrResourceLoader for deduced Solr Home: '/usr/home/hudson/hudson-slave/workspace/Lucene-Solr-Tests-4.x-Java6/solr/build/solr-core/test-files/solr/'
[junit4:junit4]   2> 4514 T430 oass.SolrDispatchFilter.init SolrDispatchFilter.init()
[junit4:junit4]   2> 4514 T430 oasc.SolrResourceLoader.locateSolrHome JNDI not configured for solr (NoInitialContextEx)
[junit4:junit4]   2> 4515 T430 oasc.SolrResourceLoader.locateSolrHome using system property solr.solr.home: /usr/home/hudson/hudson-slave/workspace/Lucene-Solr-Tests-4.x-Java6/solr/build/solr-core/test-files/solr
[junit4:junit4]   2> 4515 T430 oasc.CoreContainer$Initializer.initialize looking for solr.xml: /usr/home/hudson/hudson-slave/workspace/Lucene-Solr-Tests-4.x-Java6/solr/build/solr-core/test-files/solr/solr.xml
[junit4:junit4]   2> 4516 T430 oasc.CoreContainer.<init> New CoreContainer 780701029
[junit4:junit4]   2> 4517 T430 oasc.CoreContainer.load Loading CoreContainer using Solr Home: '/usr/home/hudson/hudson-slave/workspace/Lucene-Solr-Tests-4.x-Java6/solr/build/solr-core/test-files/solr/'
[junit4:junit4]   2> 4517 T430 oasc.SolrResourceLoader.<init> new SolrResourceLoader for directory: '/usr/home/hudson/hudson-slave/workspace/Lucene-Solr-Tests-4.x-Java6/solr/build/solr-core/test-files/solr/'
[junit4:junit4]   2> 4557 T430 oasc.CoreContainer.load Registering Log Listener
[junit4:junit4]   2> 4581 T430 oasc.CoreContainer.initZooKeeper Zookeeper client=127.0.0.1:58780/solr
[junit4:junit4]   2> 4582 T430 oaz.ZooKeeper.<init> Initiating client connection, connectString=127.0.0.1:58780/solr sessionTimeout=5000 watcher=org.apache.solr.common.cloud.ConnectionManager@bdf6623
[junit4:junit4]   2> 4583 T464 oaz.ClientCnxn$SendThread.startConnect Opening socket connection to server /127.0.0.1:58780
[junit4:junit4]   2> 4583 T430 oascc.ConnectionManager.waitForConnected Waiting for client to connect to ZooKeeper
[junit4:junit4]   2> 4584 T464 oaz.ClientCnxn$SendThread.primeConnection Socket connection established to localhost/127.0.0.1:58780, initiating session
[junit4:junit4]   2> 4585 T432 oazs.NIOServerCnxn$Factory.run Accepted socket connection from /140.211.11.196:40872
[junit4:junit4]   2> 4585 T432 oazs.NIOServerCnxn.readConnectRequest Client attempting to establish new session at /140.211.11.196:40872
[junit4:junit4]   2> 4588 T434 oazs.NIOServerCnxn.finishSessionInit Established session 0x139c822519f0003 with negotiated timeout 5000 for client /140.211.11.196:40872
[junit4:junit4]   2> 4588 T464 oaz.ClientCnxn$SendThread.readConnectResult Session establishment complete on server localhost/127.0.0.1:58780, sessionid = 0x139c822519f0003, negotiated timeout = 5000
[junit4:junit4]   2> 4589 T465 oascc.ConnectionManager.process Watcher org.apache.solr.common.cloud.ConnectionManager@bdf6623 name:ZooKeeperConnection Watcher:127.0.0.1:58780/solr got event WatchedEvent state:SyncConnected type:None path:null path:null type:None
[junit4:junit4]   2> 4589 T430 oascc.ConnectionManager.waitForConnected Client is connected to ZooKeeper
[junit4:junit4]   2> 4590 T435 oazs.PrepRequestProcessor.pRequest Got user-level KeeperException when processing sessionid:0x139c822519f0003 type:create cxid:0x1 zxid:0xfffffffffffffffe txntype:unknown reqpath:n/a Error Path:/solr/overseer Error:KeeperErrorCode = NodeExists for /solr/overseer
[junit4:junit4]   2> 4592 T435 oazs.PrepRequestProcessor.pRequest Got user-level KeeperException when processing sessionid:0x139c822519f0003 type:create cxid:0x2 zxid:0xfffffffffffffffe txntype:unknown reqpath:n/a Error Path:/solr/overseer Error:KeeperErrorCode = NodeExists for /solr/overseer
[junit4:junit4]   2> 4605 T430 oasc.ZkController.createEphemeralLiveNode Register node as live in ZooKeeper:/live_nodes/127.0.0.1:31791_solr
[junit4:junit4]   2> 4606 T435 oazs.PrepRequestProcessor.pRequest Got user-level KeeperException when processing sessionid:0x139c822519f0003 type:delete cxid:0x4 zxid:0xfffffffffffffffe txntype:unknown reqpath:n/a Error Path:/solr/live_nodes/127.0.0.1:31791_solr Error:KeeperErrorCode = NoNode for /solr/live_nodes/127.0.0.1:31791_solr
[junit4:junit4]   2> 4607 T430 oascc.SolrZkClient.makePath makePath: /live_nodes/127.0.0.1:31791_solr
[junit4:junit4]   2> 4609 T451 oascc.ZkStateReader$3.process Updating live nodes
[junit4:junit4]   2> 4610 T430 oashc.HttpShardHandlerFactory.getParameter Setting socketTimeout to: 0
[junit4:junit4]   2> 4611 T430 oashc.HttpShardHandlerFactory.getParameter Setting urlScheme to: http://
[junit4:junit4]   2> 4611 T430 oashc.HttpShardHandlerFactory.getParameter Setting connTimeout to: 0
[junit4:junit4]   2> 4612 T430 oashc.HttpShardHandlerFactory.getParameter Setting maxConnectionsPerHost to: 20
[junit4:junit4]   2> 4612 T430 oashc.HttpShardHandlerFactory.getParameter Setting corePoolSize to: 0
[junit4:junit4]   2> 4613 T430 oashc.HttpShardHandlerFactory.getParameter Setting maximumPoolSize to: 2147483647
[junit4:junit4]   2> 4613 T430 oashc.HttpShardHandlerFactory.getParameter Setting maxThreadIdleTime to: 5
[junit4:junit4]   2> 4614 T430 oashc.HttpShardHandlerFactory.getParameter Setting sizeOfQueue to: -1
[junit4:junit4]   2> 4614 T430 oashc.HttpShardHandlerFactory.getParameter Setting fairnessPolicy to: false
[junit4:junit4]   2> 4615 T430 oascsi.HttpClientUtil.createClient Creating new http client, config:maxConnectionsPerHost=20&maxConnections=10000&socketTimeout=0&connTimeout=0&retry=false
[junit4:junit4]   2> 4630 T430 oascc.ZkStateReader.createClusterStateWatchersAndUpdate Updating cluster state from ZooKeeper... 
[junit4:junit4]   2> 4637 T430 oasc.CoreContainer.create Creating SolrCore 'collection1' using instanceDir: /usr/home/hudson/hudson-slave/workspace/Lucene-Solr-Tests-4.x-Java6/solr/build/solr-core/test-files/solr/collection1
[junit4:junit4]   2> 4638 T430 oasc.ZkController.createCollectionZkNode Check for collection zkNode:collection1
[junit4:junit4]   2> 4638 T430 oasc.ZkController.createCollectionZkNode Collection zkNode exists
[junit4:junit4]   2> 4639 T430 oasc.ZkController.readConfigName Load collection config from:/collections/collection1
[junit4:junit4]   2> 4640 T430 oasc.SolrResourceLoader.<init> new SolrResourceLoader for directory: '/usr/home/hudson/hudson-slave/workspace/Lucene-Solr-Tests-4.x-Java6/solr/build/solr-core/test-files/solr/collection1/'
[junit4:junit4]   2> 4642 T430 oasc.SolrResourceLoader.replaceClassLoader Adding 'file:/usr/home/hudson/hudson-slave/workspace/Lucene-Solr-Tests-4.x-Java6/solr/build/solr-core/test-files/solr/collection1/lib/classes/' to classloader
[junit4:junit4]   2> 4643 T430 oasc.SolrResourceLoader.replaceClassLoader Adding 'file:/usr/home/hudson/hudson-slave/workspace/Lucene-Solr-Tests-4.x-Java6/solr/build/solr-core/test-files/solr/collection1/lib/README' to classloader
[junit4:junit4]   2> 4718 T430 oasc.SolrConfig.<init> Using Lucene MatchVersion: LUCENE_40
[junit4:junit4]   2> 4771 T452 oascc.ZkStateReader.updateClusterState Updating cloud state from ZooKeeper... 
[junit4:junit4]   2> 4787 T465 oascc.ZkStateReader$2.process A cluster state change has occurred - updating...
[junit4:junit4]   2> 4787 T451 oascc.ZkStateReader$2.process A cluster state change has occurred - updating...
[junit4:junit4]   2> 4803 T430 oasc.SolrConfig.<init> Loaded SolrConfig: solrconfig.xml
[junit4:junit4]   2> 4904 T430 oass.IndexSchema.readSchema Reading Solr Schema
[junit4:junit4]   2> 4943 T430 oass.IndexSchema.readSchema Schema name=test
[junit4:junit4]   2> 5882 T430 oass.OpenExchangeRatesOrgProvider.init Initialized with rates=open-exchange-rates.json, refreshInterval=1440.
[junit4:junit4]   2> 5899 T430 oass.IndexSchema.readSchema default search field in schema is text
[junit4:junit4]   2> 5909 T430 oass.IndexSchema.readSchema unique key field: id
[junit4:junit4]   2> 5937 T430 oass.FileExchangeRateProvider.reload Reloading exchange rates from file currency.xml
[junit4:junit4]   2> 5952 T430 oass.FileExchangeRateProvider.reload Reloading exchange rates from file currency.xml
[junit4:junit4]   2> 5961 T430 oass.OpenExchangeRatesOrgProvider.reload Reloading exchange rates from open-exchange-rates.json
[junit4:junit4]   2> 5965 T430 oass.OpenExchangeRatesOrgProvider.reload Reloading exchange rates from open-exchange-rates.json
[junit4:junit4]   2> 5970 T430 oasc.SolrCore.<init> [collection1] Opening new SolrCore at /usr/home/hudson/hudson-slave/workspace/Lucene-Solr-Tests-4.x-Java6/solr/build/solr-core/test-files/solr/collection1/, dataDir=./org.apache.solr.cloud.BasicDistributedZk2Test-1347682455958/jetty1/
[junit4:junit4]   2> 5971 T430 oasc.JmxMonitoredMap.<init> JMX monitoring is enabled. Adding Solr mbeans to JMX Server: com.sun.jmx.mbeanserver.JmxMBeanServer@256eb6bc
[junit4:junit4]   2> 5973 T430 oasc.SolrCore.getNewIndexDir WARNING New index directory detected: old=null new=./org.apache.solr.cloud.BasicDistributedZk2Test-1347682455958/jetty1/index/
[junit4:junit4]   2> 5974 T430 oasc.SolrCore.initIndex WARNING [collection1] Solr index directory './org.apache.solr.cloud.BasicDistributedZk2Test-1347682455958/jetty1/index' doesn't exist. Creating new index...
[junit4:junit4]   2> 5975 T430 oasc.CachingDirectoryFactory.get return new directory for /usr/home/hudson/hudson-slave/workspace/Lucene-Solr-Tests-4.x-Java6/solr/build/solr-core/test/J1/./org.apache.solr.cloud.BasicDistributedZk2Test-1347682455958/jetty1/index forceNew:false
[junit4:junit4]   2> 5987 T430 oasc.SolrDeletionPolicy.onCommit SolrDeletionPolicy.onCommit: commits:num=1
[junit4:junit4]   2> 		commit{dir=NRTCachingDirectory(org.apache.lucene.store.NIOFSDirectory@/usr/home/hudson/hudson-slave/workspace/Lucene-Solr-Tests-4.x-Java6/solr/build/solr-core/test/J1/org.apache.solr.cloud.BasicDistributedZk2Test-1347682455958/jetty1/index lockFactory=org.apache.lucene.store.NativeFSLockFactory@2b439bd9; maxCacheMB=48.0 maxMergeSizeMB=4.0),segFN=segments_1,generation=1,filenames=[segments_1]
[junit4:junit4]   2> 5987 T430 oasc.SolrDeletionPolicy.updateCommits newest commit = 1
[junit4:junit4]   2> 5989 T430 oasc.SolrCore.initWriters created xml: solr.XMLResponseWriter
[junit4:junit4]   2> 5992 T430 oasup.UpdateRequestProcessorChain.init inserting DistributedUpdateProcessorFactory into updateRequestProcessorChain "dedupe"
[junit4:junit4]   2> 5992 T430 oasup.UpdateRequestProcessorChain.init inserting DistributedUpdateProcessorFactory into updateRequestProcessorChain "dedupe-allfields"
[junit4:junit4]   2> 5993 T430 oasup.UpdateRequestProcessorChain.init inserting DistributedUpdateProcessorFactory into updateRequestProcessorChain "stored_sig"
[junit4:junit4]   2> 5994 T430 oasup.UpdateRequestProcessorChain.init inserting DistributedUpdateProcessorFactory into updateRequestProcessorChain "uniq-fields"
[junit4:junit4]   2> 5995 T430 oasup.UpdateRequestProcessorChain.init inserting DistributedUpdateProcessorFactory into updateRequestProcessorChain "distrib-dup-test-chain-implicit"
[junit4:junit4]   2> 5996 T430 oasc.RequestHandlers.initHandlersFromConfig adding lazy requestHandler: solr.ReplicationHandler
[junit4:junit4]   2> 5997 T430 oasc.RequestHandlers.initHandlersFromConfig created /replication: solr.ReplicationHandler
[junit4:junit4]   2> 5998 T430 oasc.RequestHandlers.initHandlersFromConfig created standard: solr.StandardRequestHandler
[junit4:junit4]   2> 5999 T430 oasc.RequestHandlers.initHandlersFromConfig created /get: solr.RealTimeGetHandler
[junit4:junit4]   2> 6000 T430 oasc.RequestHandlers.initHandlersFromConfig created dismax: solr.SearchHandler
[junit4:junit4]   2> 6001 T430 oasc.RequestHandlers.initHandlersFromConfig created mock: org.apache.solr.core.MockQuerySenderListenerReqHandler
[junit4:junit4]   2> 6002 T430 oasc.RequestHandlers.initHandlersFromConfig created /admin/: org.apache.solr.handler.admin.AdminHandlers
[junit4:junit4]   2> 6003 T430 oasc.RequestHandlers.initHandlersFromConfig created defaults: solr.StandardRequestHandler
[junit4:junit4]   2> 6003 T430 oasc.RequestHandlers.initHandlersFromConfig adding lazy requestHandler: solr.StandardRequestHandler
[junit4:junit4]   2> 6004 T430 oasc.RequestHandlers.initHandlersFromConfig created lazy: solr.StandardRequestHandler
[junit4:junit4]   2> 6005 T430 oasc.RequestHandlers.initHandlersFromConfig created /update: solr.UpdateRequestHandler
[junit4:junit4]   2> 6006 T430 oasc.RequestHandlers.initHandlersFromConfig created /terms: org.apache.solr.handler.component.SearchHandler
[junit4:junit4]   2> 6007 T430 oasc.RequestHandlers.initHandlersFromConfig created spellCheckCompRH: org.apache.solr.handler.component.SearchHandler
[junit4:junit4]   2> 6008 T430 oasc.RequestHandlers.initHandlersFromConfig created spellCheckCompRH_Direct: org.apache.solr.handler.component.SearchHandler
[junit4:junit4]   2> 6008 T430 oasc.RequestHandlers.initHandlersFromConfig created spellCheckWithWordbreak: org.apache.solr.handler.component.SearchHandler
[junit4:junit4]   2> 6009 T430 oasc.RequestHandlers.initHandlersFromConfig created spellCheckWithWordbreak_Direct: org.apache.solr.handler.component.SearchHandler
[junit4:junit4]   2> 6010 T430 oasc.RequestHandlers.initHandlersFromConfig created spellCheckCompRH1: org.apache.solr.handler.component.SearchHandler
[junit4:junit4]   2> 6011 T430 oasc.RequestHandlers.initHandlersFromConfig created tvrh: org.apache.solr.handler.component.SearchHandler
[junit4:junit4]   2> 6012 T430 oasc.RequestHandlers.initHandlersFromConfig created /mlt: solr.MoreLikeThisHandler
[junit4:junit4]   2> 6013 T430 oasc.RequestHandlers.initHandlersFromConfig created /debug/dump: solr.DumpRequestHandler
[junit4:junit4]   2> 6019 T430 oashl.XMLLoader.init xsltCacheLifetimeSeconds=60
[junit4:junit4]   2> 6025 T430 oasc.SolrCore.initDeprecatedSupport WARNING solrconfig.xml uses deprecated <admin/gettableFiles>, Please update your config to use the ShowFileRequestHandler.
[junit4:junit4]   2> 6027 T430 oasc.SolrCore.initDeprecatedSupport WARNING adding ShowFileRequestHandler with hidden files: [SCHEMA.XML, OLD_SYNONYMS.TXT, STOPWORDS.TXT, PROTWORDS.TXT, OPEN-EXCHANGE-RATES.JSON, SYNONYMS.TXT, CURRENCY.XML, MAPPING-ISOLATIN1ACCENT.TXT]
[junit4:junit4]   2> 6033 T430 oass.SolrIndexSearcher.<init> Opening Searcher@111de95a main
[junit4:junit4]   2> 6034 T430 oasu.CommitTracker.<init> Hard AutoCommit: disabled
[junit4:junit4]   2> 6035 T430 oasu.CommitTracker.<init> Soft AutoCommit: disabled
[junit4:junit4]   2> 6036 T430 oashc.SpellCheckComponent.inform Initializing spell checkers
[junit4:junit4]   2> 6057 T430 oass.DirectSolrSpellChecker.init init: {name=direct,classname=DirectSolrSpellChecker,field=lowerfilt,minQueryLength=3}
[junit4:junit4]   2> 6168 T466 oasc.SolrCore.registerSearcher [collection1] Registered new searcher Searcher@111de95a main{StandardDirectoryReader(segments_1:1)}
[junit4:junit4]   2> 6295 T452 oascc.ZkStateReader.updateClusterState Updating cloud state from ZooKeeper... 
[junit4:junit4]   2> 6308 T451 oascc.ZkStateReader$2.process A cluster state change has occurred - updating...
[junit4:junit4]   2> 6308 T465 oascc.ZkStateReader$2.process A cluster state change has occurred - updating...
[junit4:junit4]   2> 6680 T430 oasc.CoreContainer.register registering core: collection1
[junit4:junit4]   2> 6680 T430 oasc.ZkController.register Register shard - core:collection1 address:http://127.0.0.1:31791/solr shardId:shard1
[junit4:junit4]   2> 6683 T430 oascc.SolrZkClient.makePath makePath: /collections/collection1/leader_elect/shard1/election
[junit4:junit4]   2> 6794 T435 oazs.PrepRequestProcessor.pRequest Got user-level KeeperException when processing sessionid:0x139c822519f0003 type:delete cxid:0x43 zxid:0xfffffffffffffffe txntype:unknown reqpath:n/a Error Path:/solr/collections/collection1/leaders Error:KeeperErrorCode = NoNode for /solr/collections/collection1/leaders
[junit4:junit4]   2> 6796 T430 oasc.ShardLeaderElectionContext.runLeaderProcess Running the leader process.
[junit4:junit4]   2> 6797 T435 oazs.PrepRequestProcessor.pRequest Got user-level KeeperException when processing sessionid:0x139c822519f0003 type:create cxid:0x44 zxid:0xfffffffffffffffe txntype:unknown reqpath:n/a Error Path:/solr/overseer Error:KeeperErrorCode = NodeExists for /solr/overseer
[junit4:junit4]   2> 6812 T430 oasc.ShardLeaderElectionContext.waitForReplicasToComeUp Enough replicas found to continue.
[junit4:junit4]   2> 6813 T452 oascc.ZkStateReader.updateClusterState Updating cloud state from ZooKeeper... 
[junit4:junit4]   2> 6813 T430 oasc.ShardLeaderElectionContext.runLeaderProcess I may be the new leader - try and sync
[junit4:junit4]   2> 6814 T430 oasc.SyncStrategy.sync Sync replicas to http://127.0.0.1:31791/solr/collection1/
[junit4:junit4]   2> 6814 T430 oasc.SyncStrategy.syncReplicas Sync Success - now sync replicas to me
[junit4:junit4]   2> 6815 T430 oasc.SyncStrategy.syncToMe http://127.0.0.1:31791/solr/collection1/ has no replicas
[junit4:junit4]   2> 6815 T430 oasc.ShardLeaderElectionContext.runLeaderProcess I am the new leader: http://127.0.0.1:31791/solr/collection1/
[junit4:junit4]   2> 6816 T430 oascc.SolrZkClient.makePath makePath: /collections/collection1/leaders/shard1
[junit4:junit4]   2> 6838 T451 oascc.ZkStateReader$2.process A cluster state change has occurred - updating...
[junit4:junit4]   2> 6838 T465 oascc.ZkStateReader$2.process A cluster state change has occurred - updating...
[junit4:junit4]   2> 6842 T435 oazs.PrepRequestProcessor.pRequest Got user-level KeeperException when processing sessionid:0x139c822519f0003 type:create cxid:0x4f zxid:0xfffffffffffffffe txntype:unknown reqpath:n/a Error Path:/solr/overseer Error:KeeperErrorCode = NodeExists for /solr/overseer
[junit4:junit4]   2> 7391 T452 oascc.ZkStateReader.updateClusterState Updating cloud state from ZooKeeper... 
[junit4:junit4]   2> 7436 T465 oascc.ZkStateReader$2.process A cluster state change has occurred - updating...
[junit4:junit4]   2> 7436 T451 oascc.ZkStateReader$2.process A cluster state change has occurred - updating...
[junit4:junit4]   2> 7461 T430 oasc.ZkController.register We are http://127.0.0.1:31791/solr/collection1/ and leader is http://127.0.0.1:31791/solr/collection1/
[junit4:junit4]   2> 7461 T430 oasc.ZkController.register No LogReplay needed for core=collection1 baseURL=http://127.0.0.1:31791/solr
[junit4:junit4]   2> 7462 T430 oasc.ZkController.checkRecovery I am the leader, no recovery necessary
[junit4:junit4]   2> 7465 T430 oascc.ZkStateReader.updateClusterState Updating cloud state from ZooKeeper... 
[junit4:junit4]   2> 7466 T430 oass.SolrDispatchFilter.init user.dir=/usr/home/hudson/hudson-slave/workspace/Lucene-Solr-Tests-4.x-Java6/solr/build/solr-core/test/J1
[junit4:junit4]   2> 7466 T430 oass.SolrDispatchFilter.init SolrDispatchFilter.init() done
[junit4:junit4]   2> 7467 T430 oascsi.HttpClientUtil.createClient Creating new http client, config:maxConnections=128&maxConnectionsPerHost=32&followRedirects=false
[junit4:junit4]   2> 7486 T430 oejs.Server.doStart jetty-8.1.2.v20120308
[junit4:junit4]   2> 7489 T430 oejs.AbstractConnector.doStart Started SocketConnector@0.0.0.0:31395
[junit4:junit4]   2> 7490 T430 oasc.SolrResourceLoader.locateSolrHome JNDI not configured for solr (NoInitialContextEx)
[junit4:junit4]   2> 7490 T430 oasc.SolrResourceLoader.locateSolrHome using system property solr.solr.home: /usr/home/hudson/hudson-slave/workspace/Lucene-Solr-Tests-4.x-Java6/solr/build/solr-core/test-files/solr
[junit4:junit4]   2> 7491 T430 oasc.SolrResourceLoader.<init> new SolrResourceLoader for deduced Solr Home: '/usr/home/hudson/hudson-slave/workspace/Lucene-Solr-Tests-4.x-Java6/solr/build/solr-core/test-files/solr/'
[junit4:junit4]   2> 7539 T430 oass.SolrDispatchFilter.init SolrDispatchFilter.init()
[junit4:junit4]   2> 7540 T430 oasc.SolrResourceLoader.locateSolrHome JNDI not configured for solr (NoInitialContextEx)
[junit4:junit4]   2> 7540 T430 oasc.SolrResourceLoader.locateSolrHome using system property solr.solr.home: /usr/home/hudson/hudson-slave/workspace/Lucene-Solr-Tests-4.x-Java6/solr/build/solr-core/test-files/solr
[junit4:junit4]   2> 7541 T430 oasc.CoreContainer$Initializer.initialize looking for solr.xml: /usr/home/hudson/hudson-slave/workspace/Lucene-Solr-Tests-4.x-Java6/solr/build/solr-core/test-files/solr/solr.xml
[junit4:junit4]   2> 7541 T430 oasc.CoreContainer.<init> New CoreContainer 1313403690
[junit4:junit4]   2> 7542 T430 oasc.CoreContainer.load Loading CoreContainer using Solr Home: '/usr/home/hudson/hudson-slave/workspace/Lucene-Solr-Tests-4.x-Java6/solr/build/solr-core/test-files/solr/'
[junit4:junit4]   2> 7543 T430 oasc.SolrResourceLoader.<init> new SolrResourceLoader for directory: '/usr/home/hudson/hudson-slave/workspace/Lucene-Solr-Tests-4.x-Java6/solr/build/solr-core/test-files/solr/'
[junit4:junit4]   2> 7572 T430 oasc.CoreContainer.load Registering Log Listener
[junit4:junit4]   2> 7596 T430 oasc.CoreContainer.initZooKeeper Zookeeper client=127.0.0.1:58780/solr
[junit4:junit4]   2> 7597 T430 oaz.ZooKeeper.<init> Initiating client connection, connectString=127.0.0.1:58780/solr sessionTimeout=5000 watcher=org.apache.solr.common.cloud.ConnectionManager@292c92f2
[junit4:junit4]   2> 7598 T476 oaz.ClientCnxn$SendThread.startConnect Opening socket connection to server /127.0.0.1:58780
[junit4:junit4]   2> 7598 T430 oascc.ConnectionManager.waitForConnected Waiting for client to connect to ZooKeeper
[junit4:junit4]   2> 7600 T476 oaz.ClientCnxn$SendThread.primeConnection Socket connection established to localhost/127.0.0.1:58780, initiating session
[junit4:junit4]   2> 7600 T432 oazs.NIOServerCnxn$Factory.run Accepted socket connection from /140.211.11.196:24941
[junit4:junit4]   2> 7601 T432 oazs.NIOServerCnxn.readConnectRequest Client attempting to establish new session at /140.211.11.196:24941
[junit4:junit4]   2> 7602 T434 oazs.NIOServerCnxn.finishSessionInit Established session 0x139c822519f0004 with negotiated timeout 5000 for client /140.211.11.196:24941
[junit4:junit4]   2> 7602 T476 oaz.ClientCnxn$SendThread.readConnectResult Session establishment complete on server localhost/127.0.0.1:58780, sessionid = 0x139c822519f0004, negotiated timeout = 5000
[junit4:junit4]   2> 7603 T477 oascc.ConnectionManager.process Watcher org.apache.solr.common.cloud.ConnectionManager@292c92f2 name:ZooKeeperConnection Watcher:127.0.0.1:58780/solr got event WatchedEvent state:SyncConnected type:None path:null path:null type:None
[junit4:junit4]   2> 7603 T430 oascc.ConnectionManager.waitForConnected Client is connected to ZooKeeper
[junit4:junit4]   2> 7604 T435 oazs.PrepRequestProcessor.pRequest Got user-level KeeperException when processing sessionid:0x139c822519f0004 type:create cxid:0x1 zxid:0xfffffffffffffffe txntype:unknown reqpath:n/a Error Path:/solr/overseer Error:KeeperErrorCode = NodeExists for /solr/overseer
[junit4:junit4]   2> 7606 T435 oazs.PrepRequestProcessor.pRequest Got user-level KeeperException when processing sessionid:0x139c822519f0004 type:create cxid:0x2 zxid:0xfffffffffffffffe txntype:unknown reqpath:n/a Error Path:/solr/overseer Error:KeeperErrorCode = NodeExists for /solr/overseer
[junit4:junit4]   2> 7615 T430 oasc.ZkController.createEphemeralLiveNode Register node as live in ZooKeeper:/live_nodes/127.0.0.1:31395_solr
[junit4:junit4]   2> 7615 T435 oazs.PrepRequestProcessor.pRequest Got user-level KeeperException when processing sessionid:0x139c822519f0004 type:delete cxid:0x4 zxid:0xfffffffffffffffe txntype:unknown reqpath:n/a Error Path:/solr/live_nodes/127.0.0.1:31395_solr Error:KeeperErrorCode = NoNode for /solr/live_nodes/127.0.0.1:31395_solr
[junit4:junit4]   2> 7616 T430 oascc.SolrZkClient.makePath makePath: /live_nodes/127.0.0.1:31395_solr
[junit4:junit4]   2> 7628 T465 oascc.ZkStateReader$3.process Updating live nodes
[junit4:junit4]   2> 7628 T451 oascc.ZkStateReader$3.process Updating live nodes
[junit4:junit4]   2> 7629 T430 oashc.HttpShardHandlerFactory.getParameter Setting socketTimeout to: 0
[junit4:junit4]   2> 7629 T430 oashc.HttpShardHandlerFactory.getParameter Setting urlScheme to: http://
[junit4:junit4]   2> 7630 T430 oashc.HttpShardHandlerFactory.getParameter Setting connTimeout to: 0
[junit4:junit4]   2> 7630 T430 oashc.HttpShardHandlerFactory.getParameter Setting maxConnectionsPerHost to: 20
[junit4:junit4]   2> 7631 T430 oashc.HttpShardHandlerFactory.getParameter Setting corePoolSize to: 0
[junit4:junit4]   2> 7631 T430 oashc.HttpShardHandlerFactory.getParameter Setting maximumPoolSize to: 2147483647
[junit4:junit4]   2> 7632 T430 oashc.HttpShardHandlerFactory.getParameter Setting maxThreadIdleTime to: 5
[junit4:junit4]   2> 7632 T430 oashc.HttpShardHandlerFactory.getParameter Setting sizeOfQueue to: -1
[junit4:junit4]   2> 7633 T430 oashc.HttpShardHandlerFactory.getParameter Setting fairnessPolicy to: false
[junit4:junit4]   2> 7634 T430 oascsi.HttpClientUtil.createClient Creating new http client, config:maxConnectionsPerHost=20&maxConnections=10000&socketTimeout=0&connTimeout=0&retry=false
[junit4:junit4]   2> 7695 T430 oascc.ZkStateReader.createClusterStateWatchersAndUpdate Updating cluster state from ZooKeeper... 
[junit4:junit4]   2> 7704 T430 oasc.CoreContainer.create Creating SolrCore 'collection1' using instanceDir: /usr/home/hudson/hudson-slave/workspace/Lucene-Solr-Tests-4.x-Java6/solr/build/solr-core/test-files/solr/collection1
[junit4:junit4]   2> 7704 T430 oasc.ZkController.createCollectionZkNode Check for collection zkNode:collection1
[junit4:junit4]   2> 7705 T430 oasc.ZkController.createCollectionZkNode Collection zkNode exists
[junit4:junit4]   2> 7705 T430 oasc.ZkController.readConfigName Load collection config from:/collections/collection1
[junit4:junit4]   2> 7707 T430 oasc.SolrResourceLoader.<init> new SolrResourceLoader for directory: '/usr/home/hudson/hudson-slave/workspace/Lucene-Solr-Tests-4.x-Java6/solr/build/solr-core/test-files/solr/collection1/'
[junit4:junit4]   2> 7708 T430 oasc.SolrResourceLoader.replaceClassLoader Adding 'file:/usr/home/hudson/hudson-slave/workspace/Lucene-Solr-Tests-4.x-Java6/solr/build/solr-core/test-files/solr/collection1/lib/classes/' to classloader
[junit4:junit4]   2> 7709 T430 oasc.SolrResourceLoader.replaceClassLoader Adding 'file:/usr/home/hudson/hudson-slave/workspace/Lucene-Solr-Tests-4.x-Java6/solr/build/solr-core/test-files/solr/collection1/lib/README' to classloader
[junit4:junit4]   2> 7794 T430 oasc.SolrConfig.<init> Using Lucene MatchVersion: LUCENE_40
[junit4:junit4]   2> 7878 T430 oasc.SolrConfig.<init> Loaded SolrConfig: solrconfig.xml
[junit4:junit4]   2> 7941 T452 oascc.ZkStateReader.updateClusterState Updating cloud state from ZooKeeper... 
[junit4:junit4]   2> 7957 T451 oascc.ZkStateReader$2.process A cluster state change has occurred - updating...
[junit4:junit4]   2> 7957 T465 oascc.ZkStateReader$2.process A cluster state change has occurred - updating...
[junit4:junit4]   2> 7979 T477 oascc.ZkStateReader$2.process A cluster state change has occurred - updating...
[junit4:junit4]   2> 7979 T430 oass.IndexSchema.readSchema Reading Solr Schema
[junit4:junit4]   2> 8003 T430 oass.IndexSchema.readSchema Schema name=test
[junit4:junit4]   2> 8809 T430 oass.OpenExchangeRatesOrgProvider.init Initialized with rates=open-exchange-rates.json, refreshInterval=1440.
[junit4:junit4]   2> 8826 T430 oass.IndexSchema.readSchema default search field in schema is text
[junit4:junit4]   2> 8831 T430 oass.IndexSchema.readSchema unique key field: id
[junit4:junit4]   2> 8854 T430 oass.FileExchangeRateProvider.reload Reloading exchange rates from file currency.xml
[junit4:junit4]   2> 8861 T430 oass.FileExchangeRateProvider.reload Reloading exchange rates from file currency.xml
[junit4:junit4]   2> 8866 T430 oass.OpenExchangeRatesOrgProvider.reload Reloading exchange rates from open-exchange-rates.json
[junit4:junit4]   2> 8868 T430 oass.OpenExchangeRatesOrgProvider.reload Reloading exchange rates from open-exchange-rates.json
[junit4:junit4]   2> 8871 T430 oasc.SolrCore.<init> [collection1] Opening new SolrCore at /usr/home/hudson/hudson-slave/workspace/Lucene-Solr-Tests-4.x-Java6/solr/build/solr-core/test-files/solr/collection1/, dataDir=./org.apache.solr.cloud.BasicDistributedZk2Test-1347682455958/jetty2/
[junit4:junit4]   2> 8871 T430 oasc.JmxMonitoredMap.<init> JMX monitoring is enabled. Adding Solr mbeans to JMX Server: com.sun.jmx.mbeanserver.JmxMBeanServer@256eb6bc
[junit4:junit4]   2> 8876 T430 oasc.SolrCore.getNewIndexDir WARNING New index directory detected: old=null new=./org.apache.solr.cloud.BasicDistributedZk2Test-1347682455958/jetty2/index/
[junit4:junit4]   2> 8877 T430 oasc.SolrCore.initIndex WARNING [collection1] Solr index directory './org.apache.solr.cloud.BasicDistributedZk2Test-1347682455958/jetty2/index' doesn't exist. Creating new index...
[junit4:junit4]   2> 8878 T430 oasc.CachingDirectoryFactory.get return new directory for /usr/home/hudson/hudson-slave/workspace/Lucene-Solr-Tests-4.x-Java6/solr/build/solr-core/test/J1/./org.apache.solr.cloud.BasicDistributedZk2Test-1347682455958/jetty2/index forceNew:false
[junit4:junit4]   2> 8893 T430 oasc.SolrDeletionPolicy.onCommit SolrDeletionPolicy.onCommit: commits:num=1
[junit4:junit4]   2> 		commit{dir=NRTCachingDirectory(org.apache.lucene.store.NIOFSDirectory@/usr/home/hudson/hudson-slave/workspace/Lucene-Solr-Tests-4.x-Java6/solr/build/solr-core/test/J1/org.apache.solr.cloud.BasicDistributedZk2Test-1347682455958/jetty2/index lockFactory=org.apache.lucene.store.NativeFSLockFactory@52a7478f; maxCacheMB=48.0 maxMergeSizeMB=4.0),segFN=segments_1,generation=1,filenames=[segments_1]
[junit4:junit4]   2> 8894 T430 oasc.SolrDeletionPolicy.updateCommits newest commit = 1
[junit4:junit4]   2> 8895 T430 oasc.SolrCore.initWriters created xml: solr.XMLResponseWriter
[junit4:junit4]   2> 8899 T430 oasup.UpdateRequestProcessorChain.init inserting DistributedUpdateProcessorFactory into updateRequestProcessorChain "dedupe"
[junit4:junit4]   2> 8900 T430 oasup.UpdateRequestProcessorChain.init inserting DistributedUpdateProcessorFactory into updateRequestProcessorChain "dedupe-allfields"
[junit4:junit4]   2> 8900 T430 oasup.UpdateRequestProcessorChain.init inserting DistributedUpdateProcessorFactory into updateRequestProcessorChain "stored_sig"
[junit4:junit4]   2> 8901 T430 oasup.UpdateRequestProcessorChain.init inserting DistributedUpdateProcessorFactory into updateRequestProcessorChain "uniq-fields"
[junit4:junit4]   2> 8903 T430 oasup.UpdateRequestProcessorChain.init inserting DistributedUpdateProcessorFactory into updateRequestProcessorChain "distrib-dup-test-chain-implicit"
[junit4:junit4]   2> 8903 T430 oasc.RequestHandlers.initHandlersFromConfig adding lazy requestHandler: solr.ReplicationHandler
[junit4:junit4]   2> 8904 T430 oasc.RequestHandlers.initHandlersFromConfig created /replication: solr.ReplicationHandler
[junit4:junit4]   2> 8905 T430 oasc.RequestHandlers.initHandlersFromConfig created standard: solr.StandardRequestHandler
[junit4:junit4]   2> 8906 T430 oasc.RequestHandlers.initHandlersFromConfig created /get: solr.RealTimeGetHandler
[junit4:junit4]   2> 8907 T430 oasc.RequestHandlers.initHandlersFromConfig created dismax: solr.SearchHandler
[junit4:junit4]   2> 8908 T430 oasc.RequestHandlers.initHandlersFromConfig created mock: org.apache.solr.core.MockQuerySenderListenerReqHandler
[junit4:junit4]   2> 8909 T430 oasc.RequestHandlers.initHandlersFromConfig created /admin/: org.apache.solr.handler.admin.AdminHandlers
[junit4:junit4]   2> 8910 T430 oasc.RequestHandlers.initHandlersFromConfig created defaults: solr.StandardRequestHandler
[junit4:junit4]   2> 8911 T430 oasc.RequestHandlers.initHandlersFromConfig adding lazy requestHandler: solr.StandardRequestHandler
[junit4:junit4]   2> 8911 T430 oasc.RequestHandlers.initHandlersFromConfig created lazy: solr.StandardRequestHandler
[junit4:junit4]   2> 8912 T430 oasc.RequestHandlers.initHandlersFromConfig created /update: solr.UpdateRequestHandler
[junit4:junit4]   2> 8913 T430 oasc.RequestHandlers.initHandlersFromConfig created /terms: org.apache.solr.handler.component.SearchHandler
[junit4:junit4]   2> 8914 T430 oasc.RequestHandlers.initHandlersFromConfig created spellCheckCompRH: org.apache.solr.handler.component.SearchHandler
[junit4:junit4]   2> 8916 T430 oasc.RequestHandlers.initHandlersFromConfig created spellCheckCompRH_Direct: org.apache.solr.handler.component.SearchHandler
[junit4:junit4]   2> 8917 T430 oasc.RequestHandlers.initHandlersFromConfig created spellCheckWithWordbreak: org.apache.solr.handler.component.SearchHandler
[junit4:junit4]   2> 8918 T430 oasc.RequestHandlers.initHandlersFromConfig created spellCheckWithWordbreak_Direct: org.apache.solr.handler.component.SearchHandler
[junit4:junit4]   2> 8919 T430 oasc.RequestHandlers.initHandlersFromConfig created spellCheckCompRH1: org.apache.solr.handler.component.SearchHandler
[junit4:junit4]   2> 8920 T430 oasc.RequestHandlers.initHandlersFromConfig created tvrh: org.apache.solr.handler.component.SearchHandler
[junit4:junit4]   2> 8921 T430 oasc.RequestHandlers.initHandlersFromConfig created /mlt: solr.MoreLikeThisHandler
[junit4:junit4]   2> 8922 T430 oasc.RequestHandlers.initHandlersFromConfig created /debug/dump: solr.DumpRequestHandler
[junit4:junit4]   2> 8927 T430 oashl.XMLLoader.init xsltCacheLifetimeSeconds=60
[junit4:junit4]   2> 8932 T430 oasc.SolrCore.initDeprecatedSupport WARNING solrconfig.xml uses deprecated <admin/gettableFiles>, Please update your config to use the ShowFileRequestHandler.
[junit4:junit4]   2> 8934 T430 oasc.SolrCore.initDeprecatedSupport WARNING adding ShowFileRequestHandler with hidden files: [SCHEMA.XML, OLD_SYNONYMS.TXT, STOPWORDS.TXT, PROTWORDS.TXT, OPEN-EXCHANGE-RATES.JSON, SYNONYMS.TXT, CURRENCY.XML, MAPPING-ISOLATIN1ACCENT.TXT]
[junit4:junit4]   2> 8939 T430 oass.SolrIndexSearcher.<init> Opening Searcher@36d5e4c7 main
[junit4:junit4]   2> 8941 T430 oasu.CommitTracker.<init> Hard AutoCommit: disabled
[junit4:junit4]   2> 8941 T430 oasu.CommitTracker.<init> Soft AutoCommit: disabled
[junit4:junit4]   2> 8943 T430 oashc.SpellCheckComponent.inform Initializing spell checkers
[junit4:junit4]   2> 8976 T430 oass.DirectSolrSpellChecker.init init: {name=direct,classname=DirectSolrSpellChecker,field=lowerfilt,minQueryLength=3}
[junit4:junit4]   2> 9039 T478 oasc.SolrCore.registerSearcher [collection1] Registered new searcher Searcher@36d5e4c7 main{StandardDirectoryReader(segments_1:1)}
[junit4:junit4]   2> 9467 T452 oascc.ZkStateReader.updateClusterState Updating cloud state from ZooKeeper... 
[junit4:junit4]   2> 9486 T451 oascc.ZkStateReader$2.process A cluster state change has occurred - updating...
[junit4:junit4]   2> 9486 T477 oascc.ZkStateReader$2.process A cluster state change has occurred - updating...
[junit4:junit4]   2> 9486 T465 oascc.ZkStateReader$2.process A cluster state change has occurred - updating...
[junit4:junit4]   2> 9551 T430 oasc.CoreContainer.register registering core: collection1
[junit4:junit4]   2> 9551 T430 oasc.ZkController.register Register shard - core:collection1 address:http://127.0.0.1:31395/solr shardId:shard2
[junit4:junit4]   2> 9553 T430 oascc.SolrZkClient.makePath makePath: /collections/collection1/leader_elect/shard2/election
[junit4:junit4]   2> 9580 T435 oazs.PrepRequestProcessor.pRequest Got user-level KeeperException when processing sessionid:0x139c822519f0004 type:delete cxid:0x42 zxid:0xfffffffffffffffe txntype:unknown reqpath:n/a Error Path:/solr/collections/collection1/leaders/shard2 Error:KeeperErrorCode = NoNode for /solr/collections/collection1/leaders/shard2
[junit4:junit4]   2> 9588 T430 oasc.ShardLeaderElectionContext.runLeaderProcess Running the leader process.
[junit4:junit4]   2> 9588 T435 oazs.PrepRequestProcessor.pRequest Got user-level KeeperException when processing sessionid:0x139c822519f0004 type:create cxid:0x43 zxid:0xfffffffffffffffe txntype:unknown reqpath:n/a Error Path:/solr/overseer Error:KeeperErrorCode = NodeExists for /solr/overseer
[junit4:junit4]   2> 9629 T430 oasc.ShardLeaderElectionContext.waitForReplicasToComeUp Enough replicas found to continue.
[junit4:junit4]   2> 9629 T430 oasc.ShardLeaderElectionContext.runLeaderProcess I may be the new leader - try and sync
[junit4:junit4]   2> 9630 T430 oasc.SyncStrategy.sync Sync replicas to http://127.0.0.1:31395/solr/collection1/
[junit4:junit4]   2> 9630 T430 oasc.SyncStrategy.syncReplicas Sync Success - now sync replicas to me
[junit4:junit4]   2> 9631 T430 oasc.SyncStrategy.syncToMe http://127.0.0.1:31395/solr/collection1/ has no replicas
[junit4:junit4]   2> 9631 T430 oasc.ShardLeaderElectionContext.runLeaderProcess I am the new leader: http://127.0.0.1:31395/solr/collection1/
[junit4:junit4]   2> 9632 T430 oascc.SolrZkClient.makePath makePath: /collections/collection1/leaders/shard2
[junit4:junit4]   2> 9651 T435 oazs.PrepRequestProcessor.pRequest Got user-level KeeperException when processing sessionid:0x139c822519f0004 type:create cxid:0x4c zxid:0xfffffffffffffffe txntype:unknown reqpath:n/a Error Path:/solr/overseer Error:KeeperErrorCode = NodeExists for /solr/overseer
[junit4:junit4]   2> 9991 T452 oascc.ZkStateReader.updateClusterState Updating cloud state from ZooKeeper... 
[junit4:junit4]   2> 10017 T451 oascc.ZkStateReader$2.process A cluster state change has occurred - updating...
[junit4:junit4]   2> 10017 T477 oascc.ZkStateReader$2.process A cluster state change has occurred - updating...
[junit4:junit4]   2> 10017 T465 oascc.ZkStateReader$2.process A cluster state change has occurred - updating...
[junit4:junit4]   2> 10027 T430 oasc.ZkController.register We are http://127.0.0.1:31395/solr/collection1/ and leader is http://127.0.0.1:31395/solr/collection1/
[junit4:junit4]   2> 10028 T430 oasc.ZkController.register No LogReplay needed for core=collection1 baseURL=http://127.0.0.1:31395/solr
[junit4:junit4]   2> 10028 T430 oasc.ZkController.checkRecovery I am the leader, no recovery necessary
[junit4:junit4]   2> 10031 T430 oascc.ZkStateReader.updateClusterState Updating cloud state from ZooKeeper... 
[junit4:junit4]   2> 10032 T430 oass.SolrDispatchFilter.init user.dir=/usr/home/hudson/hudson-slave/workspace/Lucene-Solr-Tests-4.x-Java6/solr/build/solr-core/test/J1
[junit4:junit4]   2> 10032 T430 oass.SolrDispatchFilter.init SolrDispatchFilter.init() done
[junit4:junit4]   2> 10033 T430 oascsi.HttpClientUtil.createClient Creating new http client, config:maxConnections=128&maxConnectionsPerHost=32&followRedirects=false
[junit4:junit4]   2> 10052 T430 oejs.Server.doStart jetty-8.1.2.v20120308
[junit4:junit4]   2> 10055 T430 oejs.AbstractConnector.doStart Started SocketConnector@0.0.0.0:25929
[junit4:junit4]   2> 10055 T430 oasc.SolrResourceLoader.locateSolrHome JNDI not configured for solr (NoInitialContextEx)
[junit4:junit4]   2> 10056 T430 oasc.SolrResourceLoader.locateSolrHome using system property solr.solr.home: /usr/home/hudson/hudson-slave/workspace/Lucene-Solr-Tests-4.x-Java6/solr/build/solr-core/test-files/solr
[junit4:junit4]   2> 10057 T430 oasc.SolrResourceLoader.<init> new SolrResourceLoader for deduced Solr Home: '/usr/home/hudson/hudson-slave/workspace/Lucene-Solr-Tests-4.x-Java6/solr/build/solr-core/test-files/solr/'
[junit4:junit4]   2> 10107 T430 oass.SolrDispatchFilter.init SolrDispatchFilter.init()
[junit4:junit4]   2> 10108 T430 oasc.SolrResourceLoader.locateSolrHome JNDI not configured for solr (NoInitialContextEx)
[junit4:junit4]   2> 10108 T430 oasc.SolrResourceLoader.locateSolrHome using system property solr.solr.home: /usr/home/hudson/hudson-slave/workspace/Lucene-Solr-Tests-4.x-Java6/solr/build/solr-core/test-files/solr
[junit4:junit4]   2> 10109 T430 oasc.CoreContainer$Initializer.initialize looking for solr.xml: /usr/home/hudson/hudson-slave/workspace/Lucene-Solr-Tests-4.x-Java6/solr/build/solr-core/test-files/solr/solr.xml
[junit4:junit4]   2> 10109 T430 oasc.CoreContainer.<init> New CoreContainer 1309911630
[junit4:junit4]   2> 10110 T430 oasc.CoreContainer.load Loading CoreContainer using Solr Home: '/usr/home/hudson/hudson-slave/workspace/Lucene-Solr-Tests-4.x-Java6/solr/build/solr-core/test-files/solr/'
[junit4:junit4]   2> 10111 T430 oasc.SolrResourceLoader.<init> new SolrResourceLoader for directory: '/usr/home/hudson/hudson-slave/workspace/Lucene-Solr-Tests-4.x-Java6/solr/build/solr-core/test-files/solr/'
[junit4:junit4]   2> 10139 T430 oasc.CoreContainer.load Registering Log Listener
[junit4:junit4]   2> 10156 T430 oasc.CoreContainer.initZooKeeper Zookeeper client=127.0.0.1:58780/solr
[junit4:junit4]   2> 10157 T430 oaz.ZooKeeper.<init> Initiating client connection, connectString=127.0.0.1:58780/solr sessionTimeout=5000 watcher=org.apache.solr.common.cloud.ConnectionManager@3c92218c
[junit4:junit4]   2> 10158 T488 oaz.ClientCnxn$SendThread.startConnect Opening socket connection to server /127.0.0.1:58780
[junit4:junit4]   2> 10158 T430 oascc.ConnectionManager.waitForConnected Waiting for client to connect to ZooKeeper
[junit4:junit4]   2> 10160 T488 oaz.ClientCnxn$SendThread.primeConnection Socket connection established to localhost/127.0.0.1:58780, initiating session
[junit4:junit4]   2> 10160 T432 oazs.NIOServerCnxn$Factory.run Accepted socket connection from /140.211.11.196:45143
[junit4:junit4]   2> 10161 T432 oazs.NIOServerCnxn.readConnectRequest Client attempting to establish new session at /140.211.11.196:45143
[junit4:junit4]   2> 10162 T434 oazs.NIOServerCnxn.finishSessionInit Established session 0x139c822519f0005 with negotiated timeout 5000 for client /140.211.11.196:45143
[junit4:junit4]   2> 10162 T488 oaz.ClientCnxn$SendThread.readConnectResult Session establishment complete on server localhost/127.0.0.1:58780, sessionid = 0x139c822519f0005, negotiated timeout = 5000
[junit4:junit4]   2> 10163 T489 oascc.ConnectionManager.process Watcher org.apache.solr.common.cloud.ConnectionManager@3c92218c name:ZooKeeperConnection Watcher:127.0.0.1:58780/solr got event WatchedEvent state:SyncConnected type:None path:null path:null type:None
[junit4:junit4]   2> 10163 T430 oascc.ConnectionManager.waitForConnected Client is connected to ZooKeeper
[junit4:junit4]   2> 10164 T435 oazs.PrepRequestProcessor.pRequest Got user-level KeeperException when processing sessionid:0x139c822519f0005 type:create cxid:0x1 zxid:0xfffffffffffffffe txntype:unknown reqpath:n/a Error Path:/solr/overseer Error:KeeperErrorCode = NodeExists for /solr/overseer
[junit4:junit4]   2> 10166 T435 oazs.PrepRequestProcessor.pRequest Got user-level KeeperException when processing sessionid:0x139c822519f0005 type:create cxid:0x2 zxid:0xfffffffffffffffe txntype:unknown reqpath:n/a Error Path:/solr/overseer Error:KeeperErrorCode = NodeExists for /solr/overseer
[junit4:junit4]   2> 10187 T430 oasc.ZkController.createEphemeralLiveNode Register node as live in ZooKeeper:/live_nodes/127.0.0.1:25929_solr
[junit4:junit4]   2> 10189 T435 oazs.PrepRequestProcessor.pRequest Got user-level KeeperException when processing sessionid:0x139c822519f0005 type:delete cxid:0x4 zxid:0xfffffffffffffffe txntype:unknown reqpath:n/a Error Path:/solr/live_nodes/127.0.0.1:25929_solr Error:KeeperErrorCode = NoNode for /solr/live_nodes/127.0.0.1:25929_solr
[junit4:junit4]   2> 10190 T430 oascc.SolrZkClient.makePath makePath: /live_nodes/127.0.0.1:25929_solr
[junit4:junit4]   2> 10195 T477 oascc.ZkStateReader$3.process Updating live nodes
[junit4:junit4]   2> 10195 T465 oascc.ZkStateReader$3.process Updating live nodes
[junit4:junit4]   2> 10195 T451 oascc.ZkStateReader$3.process Updating live nodes
[junit4:junit4]   2> 10195 T430 oashc.HttpShardHandlerFactory.getParameter Setting socketTimeout to: 0
[junit4:junit4]   2> 10196 T430 oashc.HttpShardHandlerFactory.getParameter Setting urlScheme to: http://
[junit4:junit4]   2> 10197 T430 oashc.HttpShardHandlerFactory.getParameter Setting connTimeout to: 0
[junit4:junit4]   2> 10197 T430 oashc.HttpShardHandlerFactory.getParameter Setting maxConnectionsPerHost to: 20
[junit4:junit4]   2> 10198 T430 oashc.HttpShardHandlerFactory.getParameter Setting corePoolSize to: 0
[junit4:junit4]   2> 10198 T430 oashc.HttpShardHandlerFactory.getParameter Setting maximumPoolSize to: 2147483647
[junit4:junit4]   2> 10198 T430 oashc.HttpShardHandlerFactory.getParameter Setting maxThreadIdleTime to: 5
[junit4:junit4]   2> 10199 T430 oashc.HttpShardHandlerFactory.getParameter Setting sizeOfQueue to: -1
[junit4:junit4]   2> 10199 T430 oashc.HttpShardHandlerFactory.getParameter Setting fairnessPolicy to: false
[junit4:junit4]   2> 10200 T430 oascsi.HttpClientUtil.createClient Creating new http client, config:maxConnectionsPerHost=20&maxConnections=10000&socketTimeout=0&connTimeout=0&retry=false
[junit4:junit4]   2> 10221 T430 oascc.ZkStateReader.createClusterStateWatchersAndUpdate Updating cluster state from ZooKeeper... 
[junit4:junit4]   2> 10228 T430 oasc.CoreContainer.create Creating SolrCore 'collection1' using instanceDir: /usr/home/hudson/hudson-slave/workspace/Lucene-Solr-Tests-4.x-Java6/solr/build/solr-core/test-files/solr/collection1
[junit4:junit4]   2> 10228 T430 oasc.ZkController.createCollectionZkNode Check for collection zkNode:collection1
[junit4:junit4]   2> 10229 T430 oasc.ZkController.createCollectionZkNode Collection zkNode exists
[junit4:junit4]   2> 10229 T430 oasc.ZkController.readConfigName Load collection config from:/collections/collection1
[junit4:junit4]   2> 10231 T430 oasc.SolrResourceLoader.<init> new SolrResourceLoader for directory: '/usr/home/hudson/hudson-slave/workspace/Lucene-Solr-Tests-4.x-Java6/solr/build/solr-core/test-files/solr/collection1/'
[junit4:junit4]   2> 10232 T430 oasc.SolrResourceLoader.replaceClassLoader Adding 'file:/usr/home/hudson/hudson-slave/workspace/Lucene-Solr-Tests-4.x-Java6/solr/build/solr-core/test-files/solr/collection1/lib/classes/' to classloader
[junit4:junit4]   2> 10233 T430 oasc.SolrResourceLoader.replaceClassLoader Adding 'file:/usr/home/hudson/hudson-slave/workspace/Lucene-Solr-Tests-4.x-Java6/solr/build/solr-core/test-files/solr/collection1/lib/README' to classloader
[junit4:junit4]   2> 10301 T430 oasc.SolrConfig.<init> Using Lucene MatchVersion: LUCENE_40
[junit4:junit4]   2> 10422 T430 oasc.SolrConfig.<init> Loaded SolrConfig: solrconfig.xml
[junit4:junit4]   2> 10523 T430 oass.IndexSchema.readSchema Reading Solr Schema
[junit4:junit4]   2> 10531 T452 oascc.ZkStateReader.updateClusterState Updating cloud state from ZooKeeper... 
[junit4:junit4]   2> 10545 T430 oass.IndexSchema.readSchema Schema name=test
[junit4:junit4]   2> 10603 T477 oascc.ZkStateReader$2.process A cluster state change has occurred - updating...
[junit4:junit4]   2> 10603 T489 oascc.ZkStateReader$2.process A cluster state change has occurred - updating...
[junit4:junit4]   2> 10603 T465 oascc.ZkStateReader$2.process A cluster state change has occurred - updating...
[junit4:junit4]   2> 10603 T451 oascc.ZkStateReader$2.process A cluster state change has occurred - updating...
[junit4:junit4]   2> 11361 T430 oass.OpenExchangeRatesOrgProvider.init Initialized with rates=open-exchange-rates.json, refreshInterval=1440.
[junit4:junit4]   2> 11382 T430 oass.IndexSchema.readSchema default search field in schema is text
[junit4:junit4]   2> 11387 T430 oass.IndexSchema.readSchema unique key field: id
[junit4:junit4]   2> 11409 T430 oass.FileExchangeRateProvider.reload Reloading exchange rates from file currency.xml
[junit4:junit4]   2> 11415 T430 oass.FileExchangeRateProvider.reload Reloading exchange rates from file currency.xml
[junit4:junit4]   2> 11421 T430 oass.OpenExchangeRatesOrgProvider.reload Reloading exchange rates from open-exchange-rates.json
[junit4:junit4]   2> 11423 T430 oass.OpenExchangeRatesOrgProvider.reload Reloading exchange rates from open-exchange-rates.json
[junit4:junit4]   2> 11425 T430 oasc.SolrCore.<init> [collection1] Opening new SolrCore at /usr/home/hudson/hudson-slave/workspace/Lucene-Solr-Tests-4.x-Java6/solr/build/solr-core/test-files/solr/collection1/, dataDir=./org.apache.solr.cloud.BasicDistributedZk2Test-1347682455958/jetty3/
[junit4:junit4]   2> 11426 T430 oasc.JmxMonitoredMap.<init> JMX monitoring is enabled. Adding Solr mbeans to JMX Server: com.sun.jmx.mbeanserver.JmxMBeanServer@256eb6bc
[junit4:junit4]   2> 11427 T430 oasc.SolrCore.getNewIndexDir WARNING New index directory detected: old=null new=./org.apache.solr.cloud.BasicDistributedZk2Test-1347682455958/jetty3/index/
[junit4:junit4]   2> 11428 T430 oasc.SolrCore.initIndex WARNING [collection1] Solr index directory './org.apache.solr.cloud.BasicDistributedZk2Test-1347682455958/jetty3/index' doesn't exist. Creating new index...
[junit4:junit4]   2> 11429 T430 oasc.CachingDirectoryFactory.get return new directory for /usr/home/hudson/hudson-slave/workspace/Lucene-Solr-Tests-4.x-Java6/solr/build/solr-core/test/J1/./org.apache.solr.cloud.BasicDistributedZk2Test-1347682455958/jetty3/index forceNew:false
[junit4:junit4]   2> 11439 T430 oasc.SolrDeletionPolicy.onCommit SolrDeletionPolicy.onCommit: commits:num=1
[junit4:junit4]   2> 		commit{dir=NRTCachingDirectory(org.apache.lucene.store.NIOFSDirectory@/usr/home/hudson/hudson-slave/workspace/Lucene-Solr-Tests-4.x-Java6/solr/build/solr-core/test/J1/org.apache.solr.cloud.BasicDistributedZk2Test-1347682455958/jetty3/index lockFactory=org.apache.lucene.store.NativeFSLockFactory@4383cee3; maxCacheMB=48.0 maxMergeSizeMB=4.0),segFN=segments_1,generation=1,filenames=[segments_1]
[junit4:junit4]   2> 11440 T430 oasc.SolrDeletionPolicy.updateCommits newest commit = 1
[junit4:junit4]   2> 11441 T430 oasc.SolrCore.initWriters created xml: solr.XMLResponseWriter
[junit4:junit4]   2> 11444 T430 oasup.UpdateRequestProcessorChain.init inserting DistributedUpdateProcessorFactory into updateRequestProcessorChain "dedupe"
[junit4:junit4]   2> 11444 T430 oasup.UpdateRequestProcessorChain.init inserting DistributedUpdateProcessorFactory into updateRequestProcessorChain "dedupe-allfields"
[junit4:junit4]   2> 11445 T430 oasup.UpdateRequestProcessorChain.init inserting DistributedUpdateProcessorFactory into updateRequestProcessorChain "stored_sig"
[junit4:junit4]   2> 11446 T430 oasup.UpdateRequestProcessorChain.init inserting DistributedUpdateProcessorFactory into updateRequestProcessorChain "uniq-fields"
[junit4:junit4]   2> 11447 T430 oasup.UpdateRequestProcessorChain.init inserting DistributedUpdateProcessorFactory into updateRequestProcessorChain "distrib-dup-test-chain-implicit"
[junit4:junit4]   2> 11447 T430 oasc.RequestHandlers.initHandlersFromConfig adding lazy requestHandler: solr.ReplicationHandler
[junit4:junit4]   2> 11448 T430 oasc.RequestHandlers.initHandlersFromConfig created /replication: solr.ReplicationHandler
[junit4:junit4]   2> 11449 T430 oasc.RequestHandlers.initHandlersFromConfig created standard: solr.StandardRequestHandler
[junit4:junit4]   2> 11450 T430 oasc.RequestHandlers.initHandlersFromConfig created /get: solr.RealTimeGetHandler
[junit4:junit4]   2> 11451 T430 oasc.RequestHandlers.initHandlersFromConfig created dismax: solr.SearchHandler
[junit4:junit4]   2> 11452 T430 oasc.RequestHandlers.initHandlersFromConfig created mock: org.apache.solr.core.MockQuerySenderListenerReqHandler
[junit4:junit4]   2> 11453 T430 oasc.RequestHandlers.initHandlersFromConfig created /admin/: org.apache.solr.handler.admin.AdminHandlers
[junit4:junit4]   2> 11453 T430 oasc.RequestHandlers.initHandlersFromConfig created defaults: solr.StandardRequestHandler
[junit4:junit4]   2> 11454 T430 oasc.RequestHandlers.initHandlersFromConfig adding lazy requestHandler: solr.StandardRequestHandler
[junit4:junit4]   2> 11455 T430 oasc.RequestHandlers.initHandlersFromConfig created lazy: solr.StandardRequestHandler
[junit4:junit4]   2> 11456 T430 oasc.RequestHandlers.initHandlersFromConfig created /update: solr.UpdateRequestHandler
[junit4:junit4]   2> 11457 T430 oasc.RequestHandlers.initHandlersFromConfig created /terms: org.apache.solr.handler.component.SearchHandler
[junit4:junit4]   2> 11457 T430 oasc.RequestHandlers.initHandlersFromConfig created spellCheckCompRH: org.apache.solr.handler.component.SearchHandler
[junit4:junit4]   2> 11458 T430 oasc.RequestHandlers.initHandlersFromConfig created spellCheckCompRH_Direct: org.apache.solr.handler.component.SearchHandler
[junit4:junit4]   2> 11459 T430 oasc.RequestHandlers.initHandlersFromConfig created spellCheckWithWordbreak: org.apache.solr.handler.component.SearchHandler
[junit4:junit4]   2> 11460 T430 oasc.RequestHandlers.initHandlersFromConfig created spellCheckWithWordbreak_Direct: org.apache.solr.handler.component.SearchHandler
[junit4:junit4]   2> 11461 T430 oasc.RequestHandlers.initHandlersFromConfig created spellCheckCompRH1: org.apache.solr.handler.component.SearchHandler
[junit4:junit4]   2> 11462 T430 oasc.RequestHandlers.initHandlersFromConfig created tvrh: org.apache.solr.handler.component.SearchHandler
[junit4:junit4]   2> 11463 T430 oasc.RequestHandlers.initHandlersFromConfig created /mlt: solr.MoreLikeThisHandler
[junit4:junit4]   2> 11464 T430 oasc.RequestHandlers.initHandlersFromConfig created /debug/dump: solr.DumpRequestHandler
[junit4:junit4]   2> 11468 T430 oashl.XMLLoader.init xsltCacheLifetimeSeconds=60
[junit4:junit4]   2> 11474 T430 oasc.SolrCore.initDeprecatedSupport WARNING solrconfig.xml uses deprecated <admin/gettableFiles>, Please update your config to use the ShowFileRequestHandler.
[junit4:junit4]   2> 11476 T430 oasc.SolrCore.initDeprecatedSupport WARNING adding ShowFileRequestHandler with hidden files: [SCHEMA.XML, OLD_SYNONYMS.TXT, STOPWORDS.TXT, PROTWORDS.TXT, OPEN-EXCHANGE-RATES.JSON, SYNONYMS.TXT, CURRENCY.XML, MAPPING-ISOLATIN1ACCENT.TXT]
[junit4:junit4]   2> 11480 T430 oass.SolrIndexSearcher.<init> Opening Searcher@c01c7d1 main
[junit4:junit4]   2> 11482 T430 oasu.CommitTracker.<init> Hard AutoCommit: disabled
[junit4:junit4]   2> 11482 T430 oasu.CommitTracker.<init> Soft AutoCommit: disabled
[junit4:junit4]   2> 11484 T430 oashc.SpellCheckComponent.inform Initializing spell checkers
[junit4:junit4]   2> 11506 T430 oass.DirectSolrSpellChecker.init init: {name=direct,classname=DirectSolrSpellChecker,field=lowerfilt,minQueryLength=3}
[junit4:junit4]   2> 11599 T490 oasc.SolrCore.registerSearcher [collection1] Registered new searcher Searcher@c01c7d1 main{StandardDirectoryReader(segments_1:1)}
[junit4:junit4]   2> 11616 T452 oascc.ZkStateReader.updateClusterState Updating cloud state from ZooKeeper... 
[junit4:junit4]   2> 11622 T477 oascc.ZkStateReader$2.process A cluster state change has occurred - updating...
[junit4:junit4]   2> 11622 T451 oascc.ZkStateReader$2.process A cluster state change has occurred - updating...
[junit4:junit4]   2> 11622 T489 oascc.ZkStateReader$2.process A cluster state change has occurred - updating...
[junit4:junit4]   2> 11622 T465 oascc.ZkStateReader$2.process A cluster state change has occurred - updating...
[junit4:junit4]   2> 12111 T430 oasc.CoreContainer.register registering core: collection1
[junit4:junit4]   2> 12112 T430 oasc.ZkController.register Register shard - core:collection1 address:http://127.0.0.1:25929/solr shardId:shard1
[junit4:junit4]   2> 12155 T430 oasc.ZkController.register We are http://127.0.0.1:25929/solr/collection1/ and leader is http://127.0.0.1:31791/solr/collection1/
[junit4:junit4]   2> 12156 T430 oasc.ZkController.register No LogReplay needed for core=collection1 baseURL=http://127.0.0.1:25929/solr
[junit4:junit4]   2> 12157 T430 oasc.ZkController.checkRecovery Core needs to recover:collection1
[junit4:junit4]   2> 12158 T430 oasu.DefaultSolrCoreState.doRecovery Running recovery - first canceling any ongoing recovery
[junit4:junit4]   2> ASYNC  NEW_CORE C3 name=collection1 org.apache.solr.core.SolrCore@2dda6548 url=http://127.0.0.1:25929/solr/collection1 node=127.0.0.1:25929_solr
[junit4:junit4]   2> 12175 T491 C3 P25929 oasc.RecoveryStrategy.run Starting recovery process.  core=collection1 recoveringAfterStartup=true
[junit4:junit4]   2> 12175 T430 oascc.ZkStateReader.updateClusterState Updating cloud state from ZooKeeper... 
[junit4:junit4]   2> 12176 T491 C3 P25929 oasc.RecoveryStrategy.doRecovery ###### startupVersions=[]
[junit4:junit4]   2> 12177 T430 oass.SolrDispatchFilter.init user.dir=/usr/home/hudson/hudson-slave/workspace/Lucene-Solr-Tests-4.x-Java6/solr/build/solr-core/test/J1
[junit4:junit4]   2> 12178 T430 oass.SolrDispatchFilter.init SolrDispatchFilter.init() done
[junit4:junit4]   2> 12178 T430 oascsi.HttpClientUtil.createClient Creating new http client, config:maxConnections=128&maxConnectionsPerHost=32&followRedirects=false
[junit4:junit4]   2> 12181 T491 C3 P25929 oasc.RecoveryStrategy.doRecovery Attempting to PeerSync from http://127.0.0.1:31791/solr/collection1/ core=collection1 - recoveringAfterStartup=true
[junit4:junit4]   2> 12191 T491 C3 P25929 oascsi.HttpClientUtil.createClient Creating new http client, config:maxConnectionsPerHost=20&maxConnections=10000&connTimeout=30000&socketTimeout=30000&retry=false
[junit4:junit4]   2> 12198 T430 oejs.Server.doStart jetty-8.1.2.v20120308
[junit4:junit4]   2> 12201 T430 oejs.AbstractConnector.doStart Started SocketConnector@0.0.0.0:30247
[junit4:junit4]   2> 12202 T430 oasc.SolrResourceLoader.locateSolrHome JNDI not configured for solr (NoInitialContextEx)
[junit4:junit4]   2> 12202 T430 oasc.SolrResourceLoader.locateSolrHome using system property solr.solr.home: /usr/home/hudson/hudson-slave/workspace/Lucene-Solr-Tests-4.x-Java6/solr/build/solr-core/test-files/solr
[junit4:junit4]   2> 12203 T430 oasc.SolrResourceLoader.<init> new SolrResourceLoader for deduced Solr Home: '/usr/home/hudson/hudson-slave/workspace/Lucene-Solr-Tests-4.x-Java6/solr/build/solr-core/test-files/solr/'
[junit4:junit4]   2> 12212 T491 C3 P25929 oasu.PeerSync.sync PeerSync: core=collection1 url=http://127.0.0.1:25929/solr START replicas=[http://127.0.0.1:31791/solr/collection1/] nUpdates=100
[junit4:junit4]   2> 12228 T491 C3 P25929 oasu.PeerSync.sync WARNING no frame of reference to tell of we've missed updates
[junit4:junit4]   2> 12229 T491 C3 P25929 oasc.RecoveryStrategy.doRecovery PeerSync Recovery was not successful - trying replication. core=collection1
[junit4:junit4]   2> 12229 T491 C3 P25929 oasc.RecoveryStrategy.doRecovery Starting Replication Recovery. core=collection1
[junit4:junit4]   2> 12230 T491 C3 P25929 oascsi.HttpClientUtil.createClient Creating new http client, config:maxConnections=128&maxConnectionsPerHost=32&followRedirects=false
[junit4:junit4]   2> 12606 T430 oass.SolrDispatchFilter.init SolrDispatchFilter.init()
[junit4:junit4]   2> 12607 T430 oasc.SolrResourceLoader.locateSolrHome JNDI not configured for solr (NoInitialContextEx)
[junit4:junit4]   2> 12608 T430 oasc.SolrResourceLoader.locateSolrHome using system property solr.solr.home: /usr/home/hudson/hudson-slave/workspace/Lucene-Solr-Tests-4.x-Java6/solr/build/solr-core/test-files/solr
[junit4:junit4]   2> 12609 T430 oasc.CoreContainer$Initializer.initialize looking for solr.xml: /usr/home/hudson/hudson-slave/workspace/Lucene-Solr-Tests-4.x-Java6/solr/build/solr-core/test-files/solr/solr.xml
[junit4:junit4]   2> 12609 T430 oasc.CoreContainer.<init> New CoreContainer 1421398837
[junit4:junit4]   2> 12611 T430 oasc.CoreContainer.load Loading CoreContainer using Solr Home: '/usr/home/hudson/hudson-slave/workspace/Lucene-Solr-Tests-4.x-Java6/solr/build/solr-core/test-files/solr/'
[junit4:junit4]   2> 12612 T430 oasc.SolrResourceLoader.<init> new SolrResourceLoader for directory: '/usr/home/hudson/hudson-slave/workspace/Lucene-Solr-Tests-4.x-Java6/solr/build/solr-core/test-files/solr/'
[junit4:junit4]   2> 12661 T452 oascc.ZkStateReader.updateClusterState Updating cloud state from ZooKeeper... 
[junit4:junit4]   2> 12683 T477 oascc.ZkStateReader$2.process A cluster state change has occurred - updating...
[junit4:junit4]   2> 12683 T465 oascc.ZkStateReader$2.process A cluster state change has occurred - updating...
[junit4:junit4]   2> 12683 T451 oascc.ZkStateReader$2.process A cluster state change has occurred - updating...
[junit4:junit4]   2> 12683 T489 oascc.ZkStateReader$2.process A cluster state change has occurred - updating...
[junit4:junit4]   2> 12919 T430 oasc.CoreContainer.load Registering Log Listener
[junit4:junit4]   2> 13039 T430 oasc.CoreContainer.initZooKeeper Zookeeper client=127.0.0.1:58780/solr
[junit4:junit4]   2> 13040 T430 oaz.ZooKeeper.<init> Initiating client connection, connectString=127.0.0.1:58780/solr sessionTimeout=5000 watcher=org.apache.solr.common.cloud.ConnectionManager@3f7a04af
[junit4:junit4]   2> 13041 T502 oaz.ClientCnxn$SendThread.startConnect Opening socket connection to server /127.0.0.1:58780
[junit4:junit4]   2> 13041 T430 oascc.ConnectionManager.waitForConnected Waiting for client to connect to ZooKeeper
[junit4:junit4]   2> 13043 T502 oaz.ClientCnxn$SendThread.primeConnection Socket connection established to localhost/127.0.0.1:58780, initiating session
[junit4:junit4]   2> 13043 T432 oazs.NIOServerCnxn$Factory.run Accepted socket connection from /140.211.11.196:37750
[junit4:junit4]   2> 13044 T432 oazs.NIOServerCnxn.readConnectRequest Client attempting to establish new session at /140.211.11.196:37750
[junit4:junit4]   2> 13045 T434 oazs.NIOServerCnxn.finishSessionInit Established session 0x139c822519f0006 with negotiated timeout 5000 for client /140.211.11.196:37750
[junit4:junit4]   2> 13046 T502 oaz.ClientCnxn$SendThread.readConnectResult Session establishment complete on server localhost/127.0.0.1:58780, sessionid = 0x139c822519f0006, negotiated timeout = 5000
[junit4:junit4]   2> 13046 T503 oascc.ConnectionManager.process Watcher org.apache.solr.common.cloud.ConnectionManager@3f7a04af name:ZooKeeperConnection Watcher:127.0.0.1:58780/solr got event WatchedEvent state:SyncConnected type:None path:null path:null type:None
[junit4:junit4]   2> 13046 T430 oascc.ConnectionManager.waitForConnected Client is connected to ZooKeeper
[junit4:junit4]   2> 13047 T435 oazs.PrepRequestProcessor.pRequest Got user-level KeeperException when processing sessionid:0x139c822519f0006 type:create cxid:0x1 zxid:0xfffffffffffffffe txntype:unknown reqpath:n/a Error Path:/solr/overseer Error:KeeperErrorCode = NodeExists for /solr/overseer
[junit4:junit4]   2> 13048 T435 oazs.PrepRequestProcessor.pRequest Got user-level KeeperException when processing sessionid:0x139c822519f0006 type:create cxid:0x2 zxid:0xfffffffffffffffe txntype:unknown reqpath:n/a Error Path:/solr/overseer Error:KeeperErrorCode = NodeExists for /solr/overseer
[junit4:junit4]   2> 13063 T430 oasc.ZkController.createEphemeralLiveNode Register node as live in ZooKeeper:/live_nodes/127.0.0.1:30247_solr
[junit4:junit4]   2> 13064 T435 oazs.PrepRequestProcessor.pRequest Got user-level KeeperException when processing sessionid:0x139c822519f0006 type:delete cxid:0x4 zxid:0xfffffffffffffffe txntype:unknown reqpath:n/a Error Path:/solr/live_nodes/127.0.0.1:30247_solr Error:KeeperErrorCode = NoNode for /solr/live_nodes/127.0.0.1:30247_solr
[junit4:junit4]   2> 13065 T430 oascc.SolrZkClient.makePath makePath: /live_nodes/127.0.0.1:30247_solr
[junit4:junit4]   2> 13072 T489 oascc.ZkStateReader$3.process Updating live nodes
[junit4:junit4]   2> 13072 T465 oascc.ZkStateReader$3.process Updating live nodes
[junit4:junit4]   2> 13072 T477 oascc.ZkStateReader$3.process Updating live nodes
[junit4:junit4]   2> 13072 T451 oascc.ZkStateReader$3.process Updating live nodes
[junit4:junit4]   2> 13073 T430 oashc.HttpShardHandlerFactory.getParameter Setting socketTimeout to: 0
[junit4:junit4]   2> 13074 T430 oashc.HttpShardHandlerFactory.getParameter Setting urlScheme to: http://
[junit4:junit4]   2> 13075 T430 oashc.HttpShardHandlerFactory.getParameter Setting connTimeout to: 0
[junit4:junit4]   2> 13075 T430 oashc.HttpShardHandlerFactory.getParameter Setting maxConnectionsPerHost to: 20
[junit4:junit4]   2> 13076 T430 oashc.HttpShardHandlerFactory.getParameter Setting corePoolSize to: 0
[junit4:junit4]   2> 13076 T430 oashc.HttpShardHandlerFactory.getParameter Setting maximumPoolSize to: 2147483647
[junit4:junit4]   2> 13076 T430 oashc.HttpShardHandlerFactory.getParameter Setting maxThreadIdleTime to: 5
[junit4:junit4]   2> 13077 T430 oashc.HttpShardHandlerFactory.getParameter Setting sizeOfQueue to: -1
[junit4:junit4]   2> 13077 T430 oashc.HttpShardHandlerFactory.getParameter Setting fairnessPolicy to: false
[junit4:junit4]   2> 13078 T430 oascsi.HttpClientUtil.createClient Creating new http client, config:maxConnectionsPerHost=20&maxConnections=10000&socketTimeout=0&connTimeout=0&retry=false
[junit4:junit4]   2> 13107 T430 oascc.ZkStateReader.createClusterStateWatchersAndUpdate Updating cluster state from ZooKeeper... 
[junit4:junit4]   2> 13142 T430 oasc.CoreContainer.create Creating SolrCore 'collection1' using instanceDir: /usr/home/hudson/hudson-slave/workspace/Lucene-Solr-Tests-4.x-Java6/solr/build/solr-core/test-files/solr/collection1
[junit4:junit4]   2> 13142 T430 oasc.ZkController.createCollectionZkNode Check for collection zkNode:collection1
[junit4:junit4]   2> 13143 T430 oasc.ZkController.createCollectionZkNode Collection zkNode exists
[junit4:junit4]   2> 13144 T430 oasc.ZkController.readConfigName Load collection config from:/collections/collection1
[junit4:junit4]   2> 13145 T430 oasc.SolrResourceLoader.<init> new SolrResourceLoader for directory: '/usr/home/hudson/hudson-slave/workspace/Lucene-Solr-Tests-4.x-Java6/solr/build/solr-core/test-files/solr/collection1/'
[junit4:junit4]   2> 13147 T430 oasc.SolrResourceLoader.replaceClassLoader Adding 'file:/usr/home/hudson/hudson-slave/workspace/Lucene-Solr-Tests-4.x-Java6/solr/build/solr-core/test-files/solr/collection1/lib/classes/' to classloader
[junit4:junit4]   2> 13148 T430 oasc.SolrResourceLoader.replaceClassLoader Adding 'file:/usr/home/hudson/hudson-slave/workspace/Lucene-Solr-Tests-4.x-Java6/solr/build/solr-core/test-files/solr/collection1/lib/README' to classloader
[junit4:junit4]   2> 13936 T430 oasc.SolrConfig.<init> Using Lucene MatchVersion: LUCENE_40
[junit4:junit4]   2> ASYNC  NEW_CORE C4 name=collection1 org.apache.solr.core.SolrCore@73c9c556 url=http://127.0.0.1:31791/solr/collection1 node=127.0.0.1:31791_solr
[junit4:junit4]   2> 14036 T457 C4 P31791 REQ /get {distrib=false&qt=/get&wt=javabin&version=2&getVersions=100} status=0 QTime=21 
[junit4:junit4]   2> 14273 T430 oasc.SolrConfig.<init> Loaded SolrConfig: solrconfig.xml
[junit4:junit4]   2> 14374 T430 oass.IndexSchema.readSchema Reading Solr Schema
[junit4:junit4]   2> 14403 T430 oass.IndexSchema.readSchema Schema name=test
[junit4:junit4]   2> 15258 T430 oass.OpenExchangeRatesOrgProvider.init Initialized with rates=open-exchange-rates.json, refreshInterval=1440.
[junit4:junit4]   2> 15274 T430 oass.IndexSchema.readSchema default search field in schema is text
[junit4:junit4]   2> 15279 T430 oass.IndexSchema.readSchema unique key field: id
[junit4:junit4]   2> 15300 T430 oass.FileExchangeRateProvider.reload Reloading exchange rates from file currency.xml
[junit4:junit4]   2> 15306 T430 oass.FileExchangeRateProvider.reload Reloading exchange rates from file currency.xml
[junit4:junit4]   2> 15315 T430 oass.OpenExchangeRatesOrgProvider.reload Reloading exchange rates from open-exchange-rates.json
[junit4:junit4]   2> 15317 T430 oass.OpenExchangeRatesOrgProvider.reload Reloading exchange rates from open-exchange-rates.json
[junit4:junit4]   2> 15319 T430 oasc.SolrCore.<init> [collection1] Opening new SolrCore at /usr/home/hudson/hudson-slave/workspace/Lucene-Solr-Tests-4.x-Java6/solr/build/solr-core/test-files/solr/collection1/, dataDir=./org.apache.solr.cloud.BasicDistributedZk2Test-1347682455958/jetty4/
[junit4:junit4]   2> 15319 T430 oasc.JmxMonitoredMap.<init> JMX monitoring is enabled. Adding Solr mbeans to JMX Server: com.sun.jmx.mbeanserver.JmxMBeanServer@256eb6bc
[junit4:junit4]   2> 15321 T430 oasc.SolrCore.getNewIndexDir WARNING New index directory detected: old=null new=./org.apache.solr.cloud.BasicDistributedZk2Test-1347682455958/jetty4/index/
[junit4:junit4]   2> 15322 T430 oasc.SolrCore.initIndex WARNING [collection1] Solr index directory './org.apache.solr.cloud.BasicDistributedZk2Test-1347682455958/jetty4/index' doesn't exist. Creating new index...
[junit4:junit4]   2> 15323 T430 oasc.CachingDirectoryFactory.get return new directory for /usr/home/hudson/hudson-slave/workspace/Lucene-Solr-Tests-4.x-Java6/solr/build/solr-core/test/J1/./org.apache.solr.cloud.BasicDistributedZk2Test-1347682455958/jetty4/index forceNew:false
[junit4:junit4]   2> 15332 T430 oasc.SolrDeletionPolicy.onCommit SolrDeletionPolicy.onCommit: commits:num=1
[junit4:junit4]   2> 		commit{dir=NRTCachingDirectory(org.apache.lucene.store.NIOFSDirectory@/usr/home/hudson/hudson-slave/workspace/Lucene-Solr-Tests-4.x-Java6/solr/build/solr-core/test/J1/org.apache.solr.cloud.BasicDistributedZk2Test-1347682455958/jetty4/index lockFactory=org.apache.lucene.store.NativeFSLockFactory@35242cc9; maxCacheMB=48.0 maxMergeSizeMB=4.0),segFN=segments_1,generation=1,filenames=[segments_1]
[junit4:junit4]   2> 15333 T430 oasc.SolrDeletionPolicy.updateCommits newest commit = 1
[junit4:junit4]   2> 15334 T430 oasc.SolrCore.initWriters created xml: solr.XMLResponseWriter
[junit4:junit4]   2> 15337 T430 oasup.UpdateRequestProcessorChain.init inserting DistributedUpdateProcessorFactory into updateRequestProcessorChain "dedupe"
[junit4:junit4]   2> 15338 T430 oasup.UpdateRequestProcessorChain.init inserting DistributedUpdateProcessorFactory into updateRequestProcessorChain "dedupe-allfields"
[junit4:junit4]   2> 15338 T430 oasup.UpdateRequestProcessorChain.init inserting DistributedUpdateProcessorFactory into updateRequestProcessorChain "stored_sig"
[junit4:junit4]   2> 15339 T430 oasup.UpdateRequestProcessorChain.init inserting DistributedUpdateProcessorFactory into updateRequestProcessorChain "uniq-fields"
[junit4:junit4]   2> 15340 T430 oasup.UpdateRequestProcessorChain.init inserting DistributedUpdateProcessorFactory into updateRequestProcessorChain "distrib-dup-test-chain-implicit"
[junit4:junit4]   2> 15340 T430 oasc.RequestHandlers.initHandlersFromConfig adding lazy requestHandler: solr.ReplicationHandler
[junit4:junit4]   2> 15341 T430 oasc.RequestHandlers.initHandlersFromConfig created /replication: solr.ReplicationHandler
[junit4:junit4]   2> 15342 T430 oasc.RequestHandlers.initHandlersFromConfig created standard: solr.StandardRequestHandler
[junit4:junit4]   2> 15343 T430 oasc.RequestHandlers.initHandlersFromConfig created /get: solr.RealTimeGetHandler
[junit4:junit4]   2> 15344 T430 oasc.RequestHandlers.initHandlersFromConfig created dismax: solr.SearchHandler
[junit4:junit4]   2> 15345 T430 oasc.RequestHandlers.initHandlersFromConfig created mock: org.apache.solr.core.MockQuerySenderListenerReqHandler
[junit4:junit4]   2> 15346 T430 oasc.RequestHandlers.initHandlersFromConfig created /admin/: org.apache.solr.handler.admin.AdminHandlers
[junit4:junit4]   2> 15347 T430 oasc.RequestHandlers.initHandlersFromConfig created defaults: solr.StandardRequestHandler
[junit4:junit4]   2> 15347 T430 oasc.RequestHandlers.initHandlersFromConfig adding lazy requestHandler: solr.StandardRequestHandler
[junit4:junit4]   2> 15348 T430 oasc.RequestHandlers.initHandlersFromConfig created lazy: solr.StandardRequestHandler
[junit4:junit4]   2> 15349 T430 oasc.RequestHandlers.initHandlersFromConfig created /update: solr.UpdateRequestHandler
[junit4:junit4]   2> 15350 T430 oasc.RequestHandlers.initHandlersFromConfig created /terms: org.apache.solr.handler.component.SearchHandler
[junit4:junit4]   2> 15351 T430 oasc.RequestHandlers.initHandlersFromConfig created spellCheckCompRH: org.apache.solr.handler.component.SearchHandler
[junit4:junit4]   2> 15352 T430 oasc.RequestHandlers.initHandlersFromConfig created spellCheckCompRH_Direct: org.apache.solr.handler.component.SearchHandler
[junit4:junit4]   2> 15353 T430 oasc.RequestHandlers.initHandlersFromConfig created spellCheckWithWordbreak: org.apache.solr.handler.component.SearchHandler
[junit4:junit4]   2> 15354 T430 oasc.RequestHandlers.initHandlersFromConfig created spellCheckWithWordbreak_Direct: org.apache.solr.handler.component.SearchHandler
[junit4:junit4]   2> 15355 T430 oasc.RequestHandlers.initHandlersFromConfig created spellCheckCompRH1: org.apache.solr.handler.component.SearchHandler
[junit4:junit4]   2> 15356 T430 oasc.RequestHandlers.initHandlersFromConfig created tvrh: org.apache.solr.handler.component.SearchHandler
[junit4:junit4]   2> 15356 T430 oasc.RequestHandlers.initHandlersFromConfig created /mlt: solr.MoreLikeThisHandler
[junit4:junit4]   2> 15357 T430 oasc.RequestHandlers.initHandlersFromConfig created /debug/dump: solr.DumpRequestHandler
[junit4:junit4]   2> 15362 T430 oashl.XMLLoader.init xsltCacheLifetimeSeconds=60
[junit4:junit4]   2> 15367 T430 oasc.SolrCore.initDeprecatedSupport WARNING solrconfig.xml uses deprecated <admin/gettableFiles>, Please update your config to use the ShowFileRequestHandler.
[junit4:junit4]   2> 15369 T430 oasc.SolrCore.initDeprecatedSupport WARNING adding ShowFileRequestHandler with hidden files: [SCHEMA.XML, OLD_SYNONYMS.TXT, STOPWORDS.TXT, PROTWORDS.TXT, OPEN-EXCHANGE-RATES.JSON, SYNONYMS.TXT, CURRENCY.XML, MAPPING-ISOLATIN1ACCENT.TXT]
[junit4:junit4]   2> 15373 T430 oass.SolrIndexSearcher.<init> Opening Searcher@39ffbc2e main
[junit4:junit4]   2> 15375 T430 oasu.CommitTracker.<init> Hard AutoCommit: disabled
[junit4:junit4]   2> 15375 T430 oasu.CommitTracker.<init> Soft AutoCommit: disabled
[junit4:junit4]   2> 15377 T430 oashc.SpellCheckComponent.inform Initializing spell checkers
[junit4:junit4]   2> 15389 T430 oass.DirectSolrSpellChecker.init init: {name=direct,classname=DirectSolrSpellChecker,field=lowerfilt,minQueryLength=3}
[junit4:junit4]   2> 15486 T504 oasc.SolrCore.registerSearcher [collection1] Registered new searcher Searcher@39ffbc2e main{StandardDirectoryReader(segments_1:1)}
[junit4:junit4]   2> 15700 T452 oascc.ZkStateReader.updateClusterState Updating cloud state from ZooKeeper... 
[junit4:junit4]   2> 15706 T489 oascc.ZkStateReader$2.process A cluster state change has occurred - updating...
[junit4:junit4]   2> 15706 T477 oascc.ZkStateReader$2.process A cluster state change has occurred - updating...
[junit4:junit4]   2> 15706 T465 oascc.ZkStateReader$2.process A cluster state change has occurred - updating...
[junit4:junit4]   2> 15706 T503 oascc.ZkStateReader$2.process A cluster state change has occurred - updating...
[junit4:junit4]   2> 15706 T451 oascc.ZkStateReader$2.process A cluster state change has occurred - updating...
[junit4:junit4]   2> 15997 T430 oasc.CoreContainer.register registering core: collection1
[junit4:junit4]   2> 15997 T430 oasc.ZkController.register Register shard - core:collection1 address:http://127.0.0.1:30247/solr shardId:shard2
[junit4:junit4]   2> 16001 T430 oasc.ZkController.register We are http://127.0.0.1:30247/solr/collection1/ and leader is http://127.0.0.1:31395/solr/collection1/
[junit4:junit4]   2> 16002 T430 oasc.ZkController.register No LogReplay needed for core=collection1 baseURL=http://127.0.0.1:30247/solr
[junit4:junit4]   2> 16002 T430 oasc.ZkController.checkRecovery Core needs to recover:collection1
[junit4:junit4]   2> 16003 T430 oasu.DefaultSolrCoreState.doRecovery Running recovery - first canceling any ongoing recovery
[junit4:junit4]   2> ASYNC  NEW_CORE C5 name=collection1 org.apache.solr.core.SolrCore@7aa68180 url=http://127.0.0.1:30247/solr/collection1 node=127.0.0.1:30247_solr
[junit4:junit4]   2> 16004 T505 C5 P30247 oasc.RecoveryStrategy.run Starting recovery process.  core=collection1 recoveringAfterStartup=true
[junit4:junit4]   2> 16004 T430 oascc.ZkStateReader.updateClusterState Updating cloud state from ZooKeeper... 
[junit4:junit4]   2> 16005 T505 C5 P30247 oasc.RecoveryStrategy.doRecovery ###### startupVersions=[]
[junit4:junit4]   2> 16006 T430 oass.SolrDispatchFilter.init user.dir=/usr/home/hudson/hudson-slave/workspace/Lucene-Solr-Tests-4.x-Java6/solr/build/solr-core/test/J1
[junit4:junit4]   2> 16006 T430 oass.SolrDispatchFilter.init SolrDispatchFilter.init() done
[junit4:junit4]   2> 16007 T430 oascsi.HttpClientUtil.createClient Creating new http client, config:maxConnections=128&maxConnectionsPerHost=32&followRedirects=false
[junit4:junit4]   2> 16007 T505 C5 P30247 oasc.RecoveryStrategy.doRecovery Attempting to PeerSync from http://127.0.0.1:31395/solr/collection1/ core=collection1 - recoveringAfterStartup=true
[junit4:junit4]   2> 16008 T505 C5 P30247 oasu.PeerSync.sync PeerSync: core=collection1 url=http://127.0.0.1:30247/solr START replicas=[http://127.0.0.1:31395/solr/collection1/] nUpdates=100
[junit4:junit4]   2> 16008 T505 C5 P30247 oasu.PeerSync.sync WARNING no frame of reference to tell of we've missed updates
[junit4:junit4]   2> 16009 T505 C5 P30247 oasc.RecoveryStrategy.doRecovery PeerSync Recovery was not successful - trying replication. core=collection1
[junit4:junit4]   2> 16009 T505 C5 P30247 oasc.RecoveryStrategy.doRecovery Starting Replication Recovery. core=collection1
[junit4:junit4]   2> 16009 T505 C5 P30247 oascsi.HttpClientUtil.createClient Creating new http client, config:maxConnections=128&maxConnectionsPerHost=32&followRedirects=false
[junit4:junit4]   2> ASYNC  NEW_CORE C6 name=collection1 org.apache.solr.core.SolrCore@5ab9bfe url=http://127.0.0.1:31395/solr/collection1 node=127.0.0.1:31395_solr
[junit4:junit4]   2> 16020 T469 C6 P31395 REQ /get {distrib=false&qt=/get&wt=javabin&version=2&getVersions=100} status=0 QTime=0 
[junit4:junit4]   2> 16035 T430 oaz.ZooKeeper.<init> Initiating client connection, connectString=127.0.0.1:58780/solr sessionTimeout=10000 watcher=org.apache.solr.common.cloud.ConnectionManager@64171cdc
[junit4:junit4]   2> 16036 T507 oaz.ClientCnxn$SendThread.startConnect Opening socket connection to server /127.0.0.1:58780
[junit4:junit4]   2> 16036 T430 oascc.ConnectionManager.waitForConnected Waiting for client to connect to ZooKeeper
[junit4:junit4]   2> 16037 T507 oaz.ClientCnxn$SendThread.primeConnection Socket connection established to localhost/127.0.0.1:58780, initiating session
[junit4:junit4]   2> 16037 T432 oazs.NIOServerCnxn$Factory.run Accepted socket connection from /140.211.11.196:14251
[junit4:junit4]   2> 16038 T432 oazs.NIOServerCnxn.readConnectRequest Client attempting to establish new session at /140.211.11.196:14251
[junit4:junit4]   2> 16039 T434 oazs.NIOServerCnxn.finishSessionInit Established session 0x139c822519f0007 with negotiated timeout 10000 for client /140.211.11.196:14251
[junit4:junit4]   2> 16039 T507 oaz.ClientCnxn$SendThread.readConnectResult Session establishment complete on server localhost/127.0.0.1:58780, sessionid = 0x139c822519f0007, negotiated timeout = 10000
[junit4:junit4]   2> 16040 T508 oascc.ConnectionManager.process Watcher org.apache.solr.common.cloud.ConnectionManager@64171cdc name:ZooKeeperConnection Watcher:127.0.0.1:58780/solr got event WatchedEvent state:SyncConnected type:None path:null path:null type:None
[junit4:junit4]   2> 16040 T430 oascc.ConnectionManager.waitForConnected Client is connected to ZooKeeper
[junit4:junit4]   2> 16041 T430 oascc.ZkStateReader.createClusterStateWatchersAndUpdate Updating cluster state from ZooKeeper... 
[junit4:junit4]   2> 16045 T430 oasc.ChaosMonkey.monkeyLog monkey: init - expire sessions:true cause connection loss:true
[junit4:junit4]   2> 16046 T430 oascsi.HttpClientUtil.createClient Creating new http client, config:
[junit4:junit4]   2> 16058 T430 oascc.ZkStateReader.updateClusterState Updating cloud state from ZooKeeper... 
[junit4:junit4]   2> ASYNC  NEW_CORE C7 name=collection1 org.apache.solr.core.SolrCore@101b8d82 url=http://127.0.0.1:58784/solr/collection1 node=127.0.0.1:58784_solr
[junit4:junit4]   2> 16166 T444 C7 P58784 oascsi.HttpClientUtil.createClient Creating new http client, config:maxConnections=500&maxConnectionsPerHost=16
[junit4:junit4]   2> 16211 T452 oascc.ZkStateReader.updateClusterState Updating cloud state from ZooKeeper... 
[junit4:junit4]   2> 16225 T444 C7 P58784 oasc.SolrDeletionPolicy.onInit SolrDeletionPolicy.onInit: commits:num=1
[junit4:junit4]   2> 		commit{dir=NRTCachingDirectory(org.apache.lucene.store.NIOFSDirectory@/usr/home/hudson/hudson-slave/workspace/Lucene-Solr-Tests-4.x-Java6/solr/build/solr-core/test/J1/org.apache.solr.cloud.BasicDistributedZk2Test-1347682455958/control/data/index lockFactory=org.apache.lucene.store.NativeFSLockFactory@5cda2610; maxCacheMB=48.0 maxMergeSizeMB=4.0),segFN=segments_1,generation=1,filenames=[segments_1]
[junit4:junit4]   2> 16226 T444 C7 P58784 oasc.SolrDeletionPolicy.updateCommits newest commit = 1
[junit4:junit4]   2> 16228 T508 oascc.ZkStateReader$2.process A cluster state change has occurred - updating...
[junit4:junit4]   2> 16228 T451 oascc.ZkStateReader$2.process A cluster state change has occurred - updating...
[junit4:junit4]   2> 16228 T477 oascc.ZkStateReader$2.process A cluster state change has occurred - updating...
[junit4:junit4]   2> 16228 T503 oascc.ZkStateReader$2.process A cluster state change has occurred - updating...
[junit4:junit4]   2> 16228 T465 oascc.ZkStateReader$2.process A cluster state change has occurred - updating...
[junit4:junit4]   2> 16228 T489 oascc.ZkStateReader$2.process A cluster state change has occurred - updating...
[junit4:junit4]   2>  C3_STATE=coll:collection1 core:collection1 props:{shard=shard1, roles=null, state=recovering, core=collection1, collection=collection1, node_name=127.0.0.1:25929_solr, base_url=http://127.0.0.1:25929/solr}
[junit4:junit4]   2> 16261 T491 C3 P25929 oasc.RecoveryStrategy.doRecovery Begin buffering updates. core=collection1
[junit4:junit4]   2> 16261 T491 C3 P25929 oasu.UpdateLog.bufferUpdates Starting to buffer updates. FSUpdateLog{state=ACTIVE, tlog=null}
[junit4:junit4]   2> 16261 T491 C3 P25929 oasc.RecoveryStrategy.replicate Attempting to replicate from http://127.0.0.1:31791/solr/collection1/. core=collection1
[junit4:junit4]   2> 16262 T491 C3 P25929 oascsi.HttpClientUtil.createClient Creating new http client, config:maxConnections=128&maxConnectionsPerHost=32&followRedirects=false
[junit4:junit4]   2> 16278 T444 C7 P58784 /update {wt=javabin&version=2} {add=[1 (1413147495940227072)]} 0 127
[junit4:junit4]   2> 16279 T430 oaz.ZooKeeper.<init> Initiating client connection, connectString=127.0.0.1:58780/solr sessionTimeout=10000 watcher=org.apache.solr.common.cloud.ConnectionManager@11b9eb34
[junit4:junit4]   2> 16281 T509 oaz.ClientCnxn$SendThread.startConnect Opening socket connection to server /127.0.0.1:58780
[junit4:junit4]   2> 16281 T430 oascc.ConnectionManager.waitForConnected Waiting for client to connect to ZooKeeper
[junit4:junit4]   2> 16282 T509 oaz.ClientCnxn$SendThread.primeConnection Socket connection established to localhost/127.0.0.1:58780, initiating session
[junit4:junit4]   2> 16282 T432 oazs.NIOServerCnxn$Factory.run Accepted socket connection from /140.211.11.196:27835
[junit4:junit4]   2> 16282 T432 oazs.NIOServerCnxn.readConnectRequest Client attempting to establish new session at /140.211.11.196:27835
[junit4:junit4]   2> 16287 T434 oazs.NIOServerCnxn.finishSessionInit Established session 0x139c822519f0008 with negotiated timeout 10000 for client /140.211.11.196:27835
[junit4:junit4]   2> 16287 T509 oaz.ClientCnxn$SendThread.readConnectResult Session establishment complete on server localhost/127.0.0.1:58780, sessionid = 0x139c822519f0008, negotiated timeout = 10000
[junit4:junit4]   2> 16288 T510 oascc.ConnectionManager.process Watcher org.apache.solr.common.cloud.ConnectionManager@11b9eb34 name:ZooKeeperConnection Watcher:127.0.0.1:58780/solr got event WatchedEvent state:SyncConnected type:None path:null path:null type:None
[junit4:junit4]   2> 16288 T430 oascc.ConnectionManager.waitForConnected Client is connected to ZooKeeper
[junit4:junit4]   2> 16289 T430 oascc.ZkStateReader.createClusterStateWatchersAndUpdate Updating cluster state from ZooKeeper... 
[junit4:junit4]   2> 16304 T459 C4 P31791 oasu.DirectUpdateHandler2.commit start commit{flags=0,_version_=0,optimize=false,openSearcher=true,waitSearcher=true,expungeDeletes=false,softCommit=false}
[junit4:junit4]   2> 16310 T459 C4 P31791 oasc.SolrDeletionPolicy.onInit SolrDeletionPolicy.onInit: commits:num=1
[junit4:junit4]   2> 		commit{dir=NRTCachingDirectory(org.apache.lucene.store.NIOFSDirectory@/usr/home/hudson/hudson-slave/workspace/Lucene-Solr-Tests-4.x-Java6/solr/build/solr-core/test/J1/org.apache.solr.cloud.BasicDistributedZk2Test-1347682455958/jetty1/index lockFactory=org.apache.lucene.store.NativeFSLockFactory@2b439bd9; maxCacheMB=48.0 maxMergeSizeMB=4.0),segFN=segments_1,generation=1,filenames=[segments_1]
[junit4:junit4]   2> 16311 T459 C4 P31791 oasc.SolrDeletionPolicy.updateCommits newest commit = 1
[junit4:junit4]   2> 16312 T459 C4 P31791 oass.SolrIndexSearcher.<init> Opening Searcher@339cefd6 main
[junit4:junit4]   2> 16313 T459 C4 P31791 oasu.DirectUpdateHandler2.commit end_commit_flush
[junit4:junit4]   2> 16315 T466 oasc.SolrCore.registerSearcher [collection1] Registered new searcher Searcher@339cefd6 main{StandardDirectoryReader(segments_1:1)}
[junit4:junit4]   2> 16316 T459 C4 P31791 /update {waitSearcher=true&commit=true&commit_end_point=true&wt=javabin&softCommit=false&version=2} {commit=} 0 13
[junit4:junit4]   2> 16412 T491 C3 P25929 oash.ReplicationHandler.inform Commits will be reserved for  10000
[junit4:junit4]   2> 16413 T491 C3 P25929 oascsi.HttpClientUtil.createClient Creating new http client, config:connTimeout=5000&socketTimeout=20000&allowCompression=false&maxConnections=10000&maxConnectionsPerHost=10000
[junit4:junit4]   2> 16447 T491 C3 P25929 oash.SnapPuller.<init>  No value set for 'pollInterval'. Timer Task not started.
[junit4:junit4]   2> 16451 T481 C3 P25929 REQ /update {update.distrib=FROMLEADER&distrib.from=http://127.0.0.1:31791/solr/collection1/&wt=javabin&version=2} status=0 QTime=3 
[junit4:junit4]   2> 16452 T460 C4 P31791 REQ /update {distrib.from=http://127.0.0.1:31395/solr/collection1/&update.distrib=TOLEADER&wt=javabin&version=2} status=0 QTime=63 
[junit4:junit4]   2> 16453 T471 C6 P31395 /update {wt=javabin&version=2} {add=[1]} 0 143
[junit4:junit4]   2> 16454 T430 oasc.AbstractDistribZkTestBase.waitForRecoveriesToFinish Wait for recoveries to finish - collection: collection1 failOnTimeout:true timeout (sec):1440
[junit4:junit4]   2> 16455 T430 oascc.ZkStateReader.updateClusterState Updating cloud state from ZooKeeper... 
[junit4:junit4]   2> 16513 T461 C4 P31791 oash.ReplicationHandler.inform Commits will be reserved for  10000
[junit4:junit4]   2> 16514 T461 C4 P31791 REQ /replication {command=indexversion&wt=javabin&qt=/replication&version=2} status=0 QTime=64 
[junit4:junit4]   2> 16521 T491 C3 P25929 oasc.SolrDeletionPolicy.onInit SolrDeletionPolicy.onInit: commits:num=1
[junit4:junit4]   2> 		commit{dir=NRTCachingDirectory(org.apache.lucene.store.NIOFSDirectory@/usr/home/hudson/hudson-slave/workspace/Lucene-Solr-Tests-4.x-Java6/solr/build/solr-core/test/J1/org.apache.solr.cloud.BasicDistributedZk2Test-1347682455958/jetty3/index lockFactory=org.apache.lucene.store.NativeFSLockFactory@4383cee3; maxCacheMB=48.0 maxMergeSizeMB=4.0),segFN=segments_1,generation=1,filenames=[segments_1]
[junit4:junit4]   2> 16522 T491 C3 P25929 oasc.SolrDeletionPolicy.updateCommits newest commit = 1
[junit4:junit4]   2> 16523 T491 C3 P25929 oasu.DirectUpdateHandler2.commit start commit{flags=0,_version_=0,optimize=false,openSearcher=true,waitSearcher=true,expungeDeletes=false,softCommit=false}
[junit4:junit4]   2> 16527 T491 C3 P25929 oasc.SolrDeletionPolicy.onCommit SolrDeletionPolicy.onCommit: commits:num=2
[junit4:junit4]   2> 		commit{dir=NRTCachingDirectory(org.apache.lucene.store.NIOFSDirectory@/usr/home/hudson/hudson-slave/workspace/Lucene-Solr-Tests-4.x-Java6/solr/build/solr-core/test/J1/org.apache.solr.cloud.BasicDistributedZk2Test-1347682455958/jetty3/index lockFactory=org.apache.lucene.store.NativeFSLockFactory@4383cee3; maxCacheMB=48.0 maxMergeSizeMB=4.0),segFN=segments_1,generation=1,filenames=[segments_1]
[junit4:junit4]   2> 		commit{dir=NRTCachingDirectory(org.apache.lucene.store.NIOFSDirectory@/usr/home/hudson/hudson-slave/workspace/Lucene-Solr-Tests-4.x-Java6/solr/build/solr-core/test/J1/org.apache.solr.cloud.BasicDistributedZk2Test-1347682455958/jetty3/index lockFactory=org.apache.lucene.store.NativeFSLockFactory@4383cee3; maxCacheMB=48.0 maxMergeSizeMB=4.0),segFN=segments_2,generation=2,filenames=[segments_2]
[junit4:junit4]   2> 16527 T491 C3 P25929 oasc.SolrDeletionPolicy.updateCommits newest commit = 2
[junit4:junit4]   2> 16531 T491 C3 P25929 oass.SolrIndexSearcher.<init> Opening Searcher@772edf9a main
[junit4:junit4]   2> 16532 T491 C3 P25929 oasu.DirectUpdateHandler2.commit end_commit_flush
[junit4:junit4]   2> 16534 T490 oasc.SolrCore.registerSearcher [collection1] Registered new searcher Searcher@772edf9a main{StandardDirectoryReader(segments_2:2)}
[junit4:junit4]   2> 16541 T491 C3 P25929 oasc.RecoveryStrategy.replay Replaying buffered documents. core=collection1
[junit4:junit4]   2> 16541 T513 C3 P25929 oasu.UpdateLog$LogReplayer.doReplay WARNING Starting log replay tlog{file=./org.apache.solr.cloud.BasicDistributedZk2Test-1347682455958/jetty3/tlog/tlog.0000000000000000000 refcount=2} active=true starting pos=0
[junit4:junit4]   2> 16556 T513 C3 P25929 oasu.DirectUpdateHandler2.commit start commit{flags=2,_version_=0,optimize=false,openSearcher=true,waitSearcher=true,expungeDeletes=false,softCommit=false}
[junit4:junit4]   2> 16976 T513 C3 P25929 oasc.SolrDeletionPolicy.onCommit SolrDeletionPolicy.onCommit: commits:num=2
[junit4:junit4]   2> 		commit{dir=NRTCachingDirectory(org.apache.lucene.store.NIOFSDirectory@/usr/home/hudson/hudson-slave/workspace/Lucene-Solr-Tests-4.x-Java6/solr/build/solr-core/test/J1/org.apache.solr.cloud.BasicDistributedZk2Test-1347682455958/jetty3/index lockFactory=org.apache.lucene.store.NativeFSLockFactory@4383cee3; maxCacheMB=48.0 maxMergeSizeMB=4.0),segFN=segments_2,generation=2,filenames=[segments_2]
[junit4:junit4]   2> 		commit{dir=NRTCachingDirectory(org.apache.lucene.store.NIOFSDirectory@/usr/home/hudson/hudson-slave/workspace/Lucene-Solr-Tests-4.x-Java6/solr/build/solr-core/test/J1/org.apache.solr.cloud.BasicDistributedZk2Test-1347682455958/jetty3/index lockFactory=org.apache.lucene.store.NativeFSLockFactory@4383cee3; maxCacheMB=48.0 maxMergeSizeMB=4.0),segFN=segments_3,generation=3,filenames=[_0.fnm, _0_Pulsing40_0.tim, _0_MockFixedIntBlock_0.pos, _0_nrm.cfs, _0_MockFixedIntBlock_0.tib, _0_Pulsing40_0.prx, _0_Pulsing40_0.frq, _0_MockFixedIntBlock_0.frq, _0_Lucene40WithOrds_0.tii, _0_MockFixedIntBlock_0.skp, _0_MockFixedIntBlock_0.pyl, _0_Lucene40WithOrds_0.frq, _0_MockFixedIntBlock_0.doc, _0_MockFixedIntBlock_0.tii, _0_SimpleText_0.pst, _0_nrm.cfe, _0_Pulsing40_0.tip, _0.fdx, _0_Lucene40WithOrds_0.prx, _0.si, _0_Lucene40WithOrds_0.tib, _0.fdt, segments_3]
[junit4:junit4]   2> 16977 T513 C3 P25929 oasc.SolrDeletionPolicy.updateCommits newest commit = 3
[junit4:junit4]   2> 17072 T513 C3 P25929 oass.SolrIndexSearcher.<init> Opening Searcher@55afc1de main
[junit4:junit4]   2> 17073 T513 C3 P25929 oasu.DirectUpdateHandler2.commit end_commit_flush
[junit4:junit4]   2> 17075 T490 oasc.SolrCore.registerSearcher [collection1] Registered new searcher Searcher@55afc1de main{StandardDirectoryReader(segments_3:4 _0(4.0.0.2):C1)}
[junit4:junit4]   2> 17076 T513 C3 P25929 oasu.UpdateLog$LogReplayer.run WARNING Log replay finished. recoveryInfo=RecoveryInfo{adds=1 deletes=0 deleteByQuery=0 errors=0 positionOfStart=0}
[junit4:junit4]   2> 17076 T491 C3 P25929 oasc.RecoveryStrategy.doRecovery Replication Recovery was successful - registering as Active. core=collection1
[junit4:junit4]   2> 17088 T491 C3 P25929 oasc.RecoveryStrategy.doRecovery Finished recovery process. core=collection1
[junit4:junit4]   2> 17242 T452 oascc.ZkStateReader.updateClusterState Updating cloud state from ZooKeeper... 
[junit4:junit4]   2> 17295 T510 oascc.ZkStateReader$2.process A cluster state change has occurred - updating...
[junit4:junit4]   2> 17295 T451 oascc.ZkStateReader$2.process A cluster state change has occurred - updating...
[junit4:junit4]   2> 17295 T477 oascc.ZkStateReader$2.process A cluster state change has occurred - updating...
[junit4:junit4]   2> 17295 T508 oascc.ZkStateReader$2.process A cluster state change has occurred - updating...
[junit4:junit4]   2> 17295 T465 oascc.ZkStateReader$2.process A cluster state change has occurred - updating...
[junit4:junit4]   2> 17295 T489 oascc.ZkStateReader$2.process A cluster state change has occurred - updating...
[junit4:junit4]   2> 17295 T503 oascc.ZkStateReader$2.process A cluster state change has occurred - updating...
[junit4:junit4]   2> 17457 T430 oascc.ZkStateReader.updateClusterState Updating cloud state from ZooKeeper... 
[junit4:junit4]   2> 18459 T430 oascc.ZkStateReader.updateClusterState Updating cloud state from ZooKeeper... 
[junit4:junit4]   2>  C5_STATE=coll:collection1 core:collection1 props:{shard=shard2, roles=null, state=recovering, core=collection1, collection=collection1, node_name=127.0.0.1:30247_solr, base_url=http://127.0.0.1:30247/solr}
[junit4:junit4]   2> 19034 T505 C5 P30247 oasc.RecoveryStrategy.doRecovery Begin buffering updates. core=collection1
[junit4:junit4]   2> 19034 T505 C5 P30247 oasu.UpdateLog.bufferUpdates Starting to buffer updates. FSUpdateLog{state=ACTIVE, tlog=null}
[junit4:junit4]   2> 19034 T505 C5 P30247 oasc.RecoveryStrategy.replicate Attempting to replicate from http://127.0.0.1:31395/solr/collection1/. core=collection1
[junit4:junit4]   2> 19035 T505 C5 P30247 oascsi.HttpClientUtil.createClient Creating new http client, config:maxConnections=128&maxConnectionsPerHost=32&followRedirects=false
[junit4:junit4]   2> 19048 T472 C6 P31395 oasu.DirectUpdateHandler2.commit start commit{flags=0,_version_=0,optimize=false,openSearcher=true,waitSearcher=true,expungeDeletes=false,softCommit=false}
[junit4:junit4]   2> 19053 T472 C6 P31395 oasc.SolrDeletionPolicy.onInit SolrDeletionPolicy.onInit: commits:num=1
[junit4:junit4]   2> 		commit{dir=NRTCachingDirectory(org.apache.lucene.store.NIOFSDirectory@/usr/home/hudson/hudson-slave/workspace/Lucene-Solr-Tests-4.x-Java6/solr/build/solr-core/test/J1/org.apache.solr.cloud.BasicDistributedZk2Test-1347682455958/jetty2/index lockFactory=org.apache.lucene.store.NativeFSLockFactory@52a7478f; maxCacheMB=48.0 maxMergeSizeMB=4.0),segFN=segments_1,generation=1,filenames=[segments_1]
[junit4:junit4]   2> 19056 T472 C6 P31395 oasc.SolrDeletionPolicy.updateCommits newest commit = 1
[junit4:junit4]   2> 19058 T472 C6 P31395 oass.SolrIndexSearcher.<init> Opening Searcher@3675463 main
[junit4:junit4]   2> 19059 T472 C6 P31395 oasu.DirectUpdateHandler2.commit end_commit_flush
[junit4:junit4]   2> 19061 T478 oasc.SolrCore.registerSearcher [collection1] Registered new searcher Searcher@3675463 main{StandardDirectoryReader(segments_1:1)}
[junit4:junit4]   2> 19061 T472 C6 P31395 /update {waitSearcher=true&commit=true&commit_end_point=true&wt=javabin&softCommit=false&version=2} {commit=} 0 13
[junit4:junit4]   2> 19062 T505 C5 P30247 oash.ReplicationHandler.inform Commits will be reserved for  10000
[junit4:junit4]   2> 19063 T505 C5 P30247 oash.SnapPuller.<init>  No value set for 'pollInterval'. Timer Task not started.
[junit4:junit4]   2> 19065 T473 C6 P31395 oash.ReplicationHandler.inform Commits will be reserved for  10000
[junit4:junit4]   2> 19066 T473 C6 P31395 REQ /replication {command=indexversion&wt=javabin&qt=/replication&version=2} status=0 QTime=1 
[junit4:junit4]   2> 19076 T505 C5 P30247 oasc.SolrDeletionPolicy.onInit SolrDeletionPolicy.onInit: commits:num=1
[junit4:junit4]   2> 		commit{dir=NRTCachingDirectory(org.apache.lucene.store.NIOFSDirectory@/usr/home/hudson/hudson-slave/workspace/Lucene-Solr-Tests-4.x-Java6/solr/build/solr-core/test/J1/org.apache.solr.cloud.BasicDistributedZk2Test-1347682455958/jetty4/index lockFactory=org.apache.lucene.store.NativeFSLockFactory@35242cc9; maxCacheMB=48.0 maxMergeSizeMB=4.0),segFN=segments_1,generation=1,filenames=[segments_1]
[junit4:junit4]   2> 19077 T505 C5 P30247 oasc.SolrDeletionPolicy.updateCommits newest commit = 1
[junit4:junit4]   2> 19078 T505 C5 P30247 oasu.DirectUpdateHandler2.commit start commit{flags=0,_version_=0,optimize=false,openSearcher=true,waitSearcher=true,expungeDeletes=false,softCommit=false}
[junit4:junit4]   2> 19116 T505 C5 P30247 oasc.SolrDeletionPolicy.onCommit SolrDeletionPolicy.onCommit: commits:num=2
[junit4:junit4]   2> 		commit{dir=NRTCachingDirectory(org.apache.lucene.store.NIOFSDirectory@/usr/home/hudson/hudson-slave/workspace/Lucene-Solr-Tests-4.x-Java6/solr/build/solr-core/test/J1/org.apache.solr.cloud.BasicDistributedZk2Test-1347682455958/jetty4/index lockFactory=org.apache.lucene.store.NativeFSLockFactory@35242cc9; maxCacheMB=48.0 maxMergeSizeMB=4.0),segFN=segments_1,generation=1,filenames=[segments_1]
[junit4:junit4]   2> 		commit{dir=NRTCachingDirectory(org.apache.lucene.store.NIOFSDirectory@/usr/home/hudson/hudson-slave/workspace/Lucene-Solr-Tests-4.x-Java6/solr/build/solr-core/test/J1/org.apache.solr.cloud.BasicDistributedZk2Test-1347682455958/jetty4/index lockFactory=org.apache.lucene.store.NativeFSLockFactory@35242cc9; maxCacheMB=48.0 maxMergeSizeMB=4.0),segFN=segments_2,generation=2,filenames=[segments_2]
[junit4:junit4]   2> 19117 T505 C5 P30247 oasc.SolrDeletionPolicy.updateCommits newest commit = 2
[junit4:junit4]   2> 19120 T505 C5 P30247 oass.SolrIndexSearcher.<init> Opening Searcher@2b136abc main
[junit4:junit4]   2> 19121 T505 C5 P30247 oasu.DirectUpdateHandler2.commit end_commit_flush
[junit4:junit4]   2> 19122 T504 oasc.SolrCore.registerSearcher [collection1] Registered new searcher Searcher@2b136abc main{StandardDirectoryReader(segments_2:2)}
[junit4:junit4]   2> 19123 T505 C5 P30247 oasc.RecoveryStrategy.replay No replay needed. core=collection1
[junit4:junit4]   2> 19123 T505 C5 P30247 oasc.RecoveryStrategy.doRecovery Replication Recovery was successful - registering as Active. core=collection1
[junit4:junit4]   2> 19135 T505 C5 P30247 oasc.RecoveryStrategy.doRecovery Finished recovery process. core=collection1
[junit4:junit4]   2> 19319 T452 oascc.ZkStateReader.updateClusterState Updating cloud state from ZooKeeper... 
[junit4:junit4]   2> 19348 T489 oascc.ZkStateReader$2.process A cluster state change has occurred - updating...
[junit4:junit4]   2> 19348 T465 oascc.ZkStateReader$2.process A cluster state change has occurred - updating...
[junit4:junit4]   2> 19348 T477 oascc.ZkStateReader$2.process A cluster state change has occurred - updating...
[junit4:junit4]   2> 19348 T503 oascc.ZkStateReader$2.process A cluster state change has occurred - updating...
[junit4:junit4]   2> 19348 T451 oascc.ZkStateReader$2.process A cluster state change has occurred - updating...
[junit4:junit4]   2> 19348 T510 oascc.ZkStateReader$2.process A cluster state change has occurred - updating...
[junit4:junit4]   2> 19348 T508 oascc.ZkStateReader$2.process A cluster state change has occurred - updating...
[junit4:junit4]   2> 19461 T430 oascc.ZkStateReader.updateClusterState Updating cloud state from ZooKeeper... 
[junit4:junit4]   2> 19465 T444 C7 P58784 oasu.DirectUpdateHandler2.commit start commit{flags=0,_version_=0,optimize=false,openSearcher=true,waitSearcher=true,expungeDeletes=false,softCommit=false}
[junit4:junit4]   2> 19680 T444 C7 P58784 oasc.SolrDeletionPolicy.onCommit SolrDeletionPolicy.onCommit: commits:num=2
[junit4:junit4]   2> 		commit{dir=NRTCachingDirectory(org.apache.lucene.store.NIOFSDirectory@/usr/home/hudson/hudson-slave/workspace/Lucene-Solr-Tests-4.x-Java6/solr/build/solr-core/test/J1/org.apache.solr.cloud.BasicDistributedZk2Test-1347682455958/control/data/index lockFactory=org.apache.lucene.store.NativeFSLockFactory@5cda2610; maxCacheMB=48.0 maxMergeSizeMB=4.0),segFN=segments_1,generation=1,filenames=[segments_1]
[junit4:junit4]   2> 		commit{dir=NRTCachingDirectory(org.apache.lucene.store.NIOFSDirectory@/usr/home/hudson/hudson-slave/workspace/Lucene-Solr-Tests-4.x-Java6/solr/build/solr-core/test/J1/org.apache.solr.cloud.BasicDistributedZk2Test-1347682455958/control/data/index lockFactory=org.apache.lucene.store.NativeFSLockFactory@5cda2610; maxCacheMB=48.0 maxMergeSizeMB=4.0),segFN=segments_2,generation=2,filenames=[_0.fnm, _0_Pulsing40_0.tim, _0_MockFixedIntBlock_0.pos, _0_nrm.cfs, _0_MockFixedIntBlock_0.tib, _0_Pulsing40_0.prx, _0_Pulsing40_0.frq, _0_MockFixedIntBlock_0.frq, _0_Lucene40WithOrds_0.tii, _0_MockFixedIntBlock_0.skp, _0_MockFixedIntBlock_0.pyl, _0_Lucene40WithOrds_0.frq, _0_MockFixedIntBlock_0.doc, _0_MockFixedIntBlock_0.tii, _0_SimpleText_0.pst, _0_nrm.cfe, _0_Pulsing40_0.tip, segments_2, _0.fdx, _0_Lucene40WithOrds_0.prx, _0.si, _0_Lucene40WithOrds_0.tib, _0.fdt]
[junit4:junit4]   2> 19681 T444 C7 P58784 oasc.SolrDeletionPolicy.updateCommits newest commit = 2
[junit4:junit4]   2> 19708 T444 C7 P58784 oass.SolrIndexSearcher.<init> Opening Searcher@4bb1c978 main
[junit4:junit4]   2> 19709 T444 C7 P58784 oasu.DirectUpdateHandler2.commit end_commit_flush
[junit4:junit4]   2> 19711 T454 oasc.SolrCore.registerSearcher [collection1] Registered new searcher Searcher@4bb1c978 main{StandardDirectoryReader(segments_2:3 _0(4.0.0.2):C1)}
[junit4:junit4]   2> 19711 T444 C7 P58784 /update {waitSearcher=true&wt=javabin&commit=true&softCommit=false&version=2} {commit=} 0 246
[junit4:junit4]   2> 19715 T462 C4 P31791 oasu.DirectUpdateHandler2.commit start commit{flags=0,_version_=0,optimize=false,openSearcher=true,waitSearcher=true,expungeDeletes=false,softCommit=false}
[junit4:junit4]   2> 19903 T462 C4 P31791 oasc.SolrDeletionPolicy.onCommit SolrDeletionPolicy.onCommit: commits:num=2
[junit4:junit4]   2> 		commit{dir=NRTCachingDirectory(org.apache.lucene.store.NIOFSDirectory@/usr/home/hudson/hudson-slave/workspace/Lucene-Solr-Tests-4.x-Java6/solr/build/solr-core/test/J1/org.apache.solr.cloud.BasicDistributedZk2Test-1347682455958/jetty1/index lockFactory=org.apache.lucene.store.NativeFSLockFactory@2b439bd9; maxCacheMB=48.0 maxMergeSizeMB=4.0),segFN=segments_1,generation=1,filenames=[segments_1]
[junit4:junit4]   2> 		commit{dir=NRTCachingDirectory(org.apache.lucene.store.NIOFSDirectory@/usr/home/hudson/hudson-slave/workspace/Lucene-Solr-Tests-4.x-Java6/solr/build/solr-core/test/J1/org.apache.solr.cloud.BasicDistributedZk2Test-1347682455958/jetty1/index lockFactory=org.apache.lucene.store.NativeFSLockFactory@2b439bd9; maxCacheMB=48.0 maxMergeSizeMB=4.0),segFN=segments_2,generation=2,filenames=[_0.fnm, _0_Pulsing40_0.tim, _0_MockFixedIntBlock_0.pos, _0_nrm.cfs, _0_MockFixedIntBlock_0.tib, _0_Pulsing40_0.prx, _0_Pulsing40_0.frq, _0_MockFixedIntBlock_0.frq, _0_Lucene40WithOrds_0.tii, _0_MockFixedIntBlock_0.skp, _0_MockFixedIntBlock_0.pyl, _0_Lucene40WithOrds_0.frq, _0_MockFixedIntBlock_0.doc, _0_MockFixedIntBlock_0.tii, _0_SimpleText_0.pst, _0_nrm.cfe, _0_Pulsing40_0.tip, segments_2, _0.fdx, _0_Lucene40WithOrds_0.prx, _0.si, _0_Lucene40WithOrds_0.tib, _0.fdt]
[junit4:junit4]   2> 19904 T462 C4 P31791 oasc.SolrDeletionPolicy.updateCommits newest commit = 2
[junit4:junit4]   2> 19929 T462 C4 P31791 oass.SolrIndexSearcher.<init> Opening Searcher@dbb073 main
[junit4:junit4]   2> 19930 T462 C4 P31791 oasu.DirectUpdateHandler2.commit end_commit_flush
[junit4:junit4]   2> 19932 T466 oasc.SolrCore.registerSearcher [collection1] Registered new searcher Searcher@dbb073 main{StandardDirectoryReader(segments_2:3 _0(4.0.0.2):C1)}
[junit4:junit4]   2> 19933 T462 C4 P31791 oasu.SolrCmdDistributor.distribCommit Distrib commit to:[StdNode: http://127.0.0.1:25929/solr/collection1/, StdNode: http://127.0.0.1:31395/solr/collection1/, StdNode: http://127.0.0.1:30247/solr/collection1/]
[junit4:junit4]   2> 19936 T474 C6 P31395 oasu.DirectUpdateHandler2.commit start commit{flags=0,_version_=0,optimize=false,openSearcher=true,waitSearcher=true,expungeDeletes=false,softCommit=false}
[junit4:junit4]   2>  C3_STATE=coll:collection1 core:collection1 props:{shard=shard1, roles=null, state=active, core=collection1, collection=collection1, node_name=127.0.0.1:25929_solr, base_url=http://127.0.0.1:25929/solr}
[junit4:junit4]   2> 19938 T481 C3 P25929 oasu.DirectUpdateHandler2.commit start commit{flags=0,_version_=0,optimize=false,openSearcher=true,waitSearcher=true,expungeDeletes=false,softCommit=false}
[junit4:junit4]   2> 19940 T474 C6 P31395 oass.SolrIndexSearcher.<init> Opening Searcher@5c602d9d main
[junit4:junit4]   2> 19940 T474 C6 P31395 oasu.DirectUpdateHandler2.commit end_commit_flush
[junit4:junit4]   2> 19947 T478 oasc.SolrCore.registerSearcher [collection1] Registered new searcher Searcher@5c602d9d main{StandardDirectoryReader(segments_1:1)}
[junit4:junit4]   2> 19947 T474 C6 P31395 /update {waitSearcher=true&commit=true&wt=javabin&commit_end_point=true&expungeDeletes=false&softCommit=false&version=2} {commit=} 0 11
[junit4:junit4]   2>  C5_STATE=coll:collection1 core:collection1 props:{shard=shard2, roles=null, state=active, core=collection1, collection=collection1, node_name=127.0.0.1:30247_solr, base_url=http://127.0.0.1:30247/solr}
[junit4:junit4]   2> 19951 T494 C5 P30247 oasu.DirectUpdateHandler2.commit start commit{flags=0,_version_=0,optimize=false,openSearcher=true,waitSearcher=true,expungeDeletes=false,softCommit=false}
[junit4:junit4]   2> 19954 T481 C3 P25929 oass.SolrIndexSearcher.<init> Opening Searcher@65b07961 main
[junit4:junit4]   2> 19954 T494 C5 P30247 oass.SolrIndexSearcher.<init> Opening Searcher@4b187f5b main
[junit4:junit4]   2> 19955 T494 C5 P30247 oasu.DirectUpdateHandler2.commit end_commit_flush
[junit4:junit4]   2> 19955 T481 C3 P25929 oasu.DirectUpdateHandler2.commit end_commit_flush
[junit4:junit4]   2> 19955 T490 oasc.JmxMonitoredMap.put WARNING Failed to register info bean: searcher javax.management.InstanceNotFoundException: solr/collection1:type=searcher,id=org.apache.solr.search.SolrIndexSearcher
[junit4:junit4]   2> 	at com.sun.jmx.interceptor.DefaultMBeanServerInterceptor.getMBean(DefaultMBeanServerInterceptor.java:1118)
[junit4:junit4]   2> 	at com.sun.jmx.interceptor.DefaultMBeanServerInterceptor.exclusiveUnregisterMBean(DefaultMBeanServerInterceptor.java:433)
[junit4:junit4]   2> 	at com.sun.jmx.interceptor.DefaultMBeanServerInterceptor.unregisterMBean(DefaultMBeanServerInterceptor.java:421)
[junit4:junit4]   2> 	at com.sun.jmx.mbeanserver.JmxMBeanServer.unregisterMBean(JmxMBeanServer.java:540)
[junit4:junit4]   2> 	at org.apache.solr.core.JmxMonitoredMap.put(JmxMonitoredMap.java:138)
[junit4:junit4]   2> 	at org.apache.solr.core.JmxMonitoredMap.put(JmxMonitoredMap.java:51)
[junit4:junit4]   2> 	at org.apache.solr.search.SolrIndexSearcher.register(SolrIndexSearcher.java:242)
[junit4:junit4]   2> 	at org.apache.solr.core.SolrCore.registerSearcher(SolrCore.java:1642)
[junit4:junit4]   2> 	at org.apache.solr.core.SolrCore.access$000(SolrCore.java:121)
[junit4:junit4]   2> 	at org.apache.solr.core.SolrCore$7.call(SolrCore.java:1519)
[junit4:junit4]   2> 	at java.util.concurrent.FutureTask$Sync.innerRun(FutureTask.java:334)
[junit4:junit4]   2> 	at java.util.concurrent.FutureTask.run(FutureTask.java:166)
[junit4:junit4]   2> 	at java.util.concurrent.ThreadPoolExecutor.runWorker(ThreadPoolExecutor.java:1110)
[junit4:junit4]   2> 	at java.util.concurrent.ThreadPoolExecutor$Worker.run(ThreadPoolExecutor.java:603)
[junit4:junit4]   2> 	at java.lang.Thread.run(Thread.java:679)
[junit4:junit4]   2> 
[junit4:junit4]   2> 19957 T504 oasc.SolrCore.registerSearcher [collection1] Registered new searcher Searcher@4b187f5b main{StandardDirectoryReader(segments_2:2)}
[junit4:junit4]   2> 19957 T494 C5 P30247 /update {waitSearcher=true&commit=true&wt=javabin&commit_end_point=true&expungeDeletes=false&softCommit=false&version=2} {commit=} 0 6
[junit4:junit4]   2> 19957 T490 oasc.SolrCore.registerSearcher [collection1] Registered new searcher Searcher@65b07961 main{StandardDirectoryReader(segments_3:4 _0(4.0.0.2):C1)}
[junit4:junit4]   2> 19958 T481 C3 P25929 /update {waitSearcher=true&commit=true&wt=javabin&commit_end_point=true&expungeDeletes=false&softCommit=false&version=2} {commit=} 0 20
[junit4:junit4]   2> 19959 T462 C4 P31791 /update {waitSearcher=true&wt=javabin&commit=true&softCommit=false&version=2} {commit=} 0 244
[junit4:junit4]   2> 19988 T442 C7 P58784 REQ /select {fl=id,score&shard.url=127.0.0.1:58784/solr/collection1/&NOW=1347682475936&start=0&q=*:*&distrib=false&isShard=true&wt=javabin&fsv=true&rows=10&version=2} hits=1 status=0 QTime=1 
[junit4:junit4]   2> 20014 T442 C7 P58784 REQ /select {shard.url=127.0.0.1:58784/solr/collection1/&NOW=1347682475936&q=*:*&ids=1&distrib=false&isShard=true&wt=javabin&version=2} status=0 QTime=7 
[junit4:junit4]   2> 20016 T444 C7 P58784 REQ /select {wt=javabin&q=*:*&version=2} hits=1 status=0 QTime=33 
[junit4:junit4]   2> 20017 T430 oaz.ZooKeeper.<init> Initiating client connection, connectString=127.0.0.1:58780/solr sessionTimeout=10000 watcher=org.apache.solr.common.cloud.ConnectionManager@250f9a46
[junit4:junit4]   2> 20017 T517 oaz.ClientCnxn$SendThread.startConnect Opening socket connection to server /127.0.0.1:58780
[junit4:junit4]   2> 20017 T430 oascc.ConnectionManager.waitForConnected Waiting for client to connect to ZooKeeper
[junit4:junit4]   2> 20018 T517 oaz.ClientCnxn$SendThread.primeConnection Socket connection established to localhost/127.0.0.1:58780, initiating session
[junit4:junit4]   2> 20018 T432 oazs.NIOServerCnxn$Factory.run Accepted socket connection from /140.211.11.196:25786
[junit4:junit4]   2> 20019 T432 oazs.NIOServerCnxn.readConnectRequest Client attempting to establish new session at /140.211.11.196:25786
[junit4:junit4]   2> 20021 T434 oazs.NIOServerCnxn.finishSessionInit Established session 0x139c822519f0009 with negotiated timeout 10000 for client /140.211.11.196:25786
[junit4:junit4]   2> 20021 T517 oaz.ClientCnxn$SendThread.readConnectResult Session establishment complete on server localhost/127.0.0.1:58780, sessionid = 0x139c822519f0009, negotiated timeout = 10000
[junit4:junit4]   2> 20022 T518 oascc.ConnectionManager.process Watcher org.apache.solr.common.cloud.ConnectionManager@250f9a46 name:ZooKeeperConnection Watcher:127.0.0.1:58780/solr got event WatchedEvent state:SyncConnected type:None path:null path:null type:None
[junit4:junit4]   2> 20022 T430 oascc.ConnectionManager.waitForConnected Client is connected to ZooKeeper
[junit4:junit4]   2> 20023 T430 oascc.ZkStateReader.createClusterStateWatchersAndUpdate Updating cluster state from ZooKeeper... 
[junit4:junit4]   2> 20024 T435 oazs.PrepRequestProcessor.pRequest Processed session termination for sessionid: 0x139c822519f0009
[junit4:junit4]   2> 20034 T518 oaz.ClientCnxn$EventThread.run EventThread shut down
[junit4:junit4]   2> 20034 T430 oaz.ZooKeeper.close Session: 0x139c822519f0009 closed
[junit4:junit4]   2> 20034 T432 oazs.NIOServerCnxn.closeSock Closed socket connection for client /140.211.11.196:25786 which had sessionid 0x139c822519f0009
[junit4:junit4]   2> 20038 T463 C4 P31791 REQ /select {distrib=false&wt=javabin&q=*:*&version=2} hits=1 status=0 QTime=1 
[junit4:junit4]   2> 20042 T475 C6 P31395 REQ /select {distrib=false&wt=javabin&q=*:*&version=2} hits=0 status=0 QTime=1 
[junit4:junit4]   2> 20051 T458 C4 P31791 REQ /select {fl=id,score&shard.url=127.0.0.1:31791/solr/collection1/|127.0.0.1:25929/solr/collection1/&NOW=1347682475998&start=0&q=*:*&distrib=false&isShard=true&wt=javabin&fsv=true&rows=10&version=2} hits=1 status=0 QTime=1 
[junit4:junit4]   2> 20051 T470 C6 P31395 REQ /select {fl=id,score&shard.url=127.0.0.1:31395/solr/collection1/|127.0.0.1:30247/solr/collection1/&NOW=1347682475998&start=0&q=*:*&distrib=false&isShard=true&wt=javabin&fsv=true&rows=10&version=2} hits=0 status=0 QTime=0 
[junit4:junit4]   2> 20056 T458 C4 P31791 REQ /select {shard.url=127.0.0.1:31791/solr/collection1/|127.0.0.1:25929/solr/collection1/&NOW=1347682475998&q=*:*&ids=1&distrib=false&isShard=true&wt=javabin&version=2} status=0 QTime=0 
[junit4:junit4]   2> 20058 T482 C3 P25929 REQ /select {wt=javabin&q=*:*&version=2} hits=1 status=0 QTime=13 
[junit4:junit4]   2> 20069 T444 C7 P58784 /update {wt=javabin&version=2} {add=[2 (1413147499969904640)]} 0 8
[junit4:junit4]   2> 20100 T494 C5 P30247 REQ /update {update.distrib=FROMLEADER&distrib.from=http://127.0.0.1:31395/solr/collection1/&wt=javabin&version=2} status=0 QTime=12 
[junit4:junit4]   2> 20101 T474 C6 P31395 REQ /update {distrib.from=http://127.0.0.1:31791/solr/collection1/&update.distrib=TOLEADER&wt=javabin&version=2} status=0 QTime=24 
[junit4:junit4]   2> 20102 T462 C4 P31791 /update {wt=javabin&version=2} {add=[2]} 0 30
[junit4:junit4]   2> 20110 T444 C7 P58784 /update {wt=javabin&version=2} {add=[3 (1413147500016041984)]} 0 5
[junit4:junit4]   2> 20129 T494 C5 P30247 REQ /update {update.distrib=FROMLEADER&distrib.from=http://127.0.0.1:31395/solr/collection1/&wt=javabin&version=2} status=0 QTime=4 
[junit4:junit4]   2> 20130 T474 C6 P31395 REQ /update {distrib.from=http://127.0.0.1:31791/solr/collection1/&update.distrib=TOLEADER&wt=javabin&version=2} status=0 QTime=13 
[junit4:junit4]   2> 20131 T462 C4 P31791 /update {wt=javabin&version=2} {add=[3]} 0 18
[junit4:junit4]   2> 20139 T444 C7 P58784 /update {wt=javabin&version=2} {add=[4 (1413147500046450688)]} 0 5
[junit4:junit4]   2> 20167 T481 C3 P25929 REQ /update {distrib.from=http://127.0.0.1:31791/solr/collection1/&update.distrib=FROMLEADER&wt=javabin&version=2} status=0 QTime=8 
[junit4:junit4]   2> 20168 T462 C4 P31791 /update {wt=javabin&version=2} {add=[4 (1413147500054839296)]} 0 26
[junit4:junit4]   2> 20177 T444 C7 P58784 /update {wt=javabin&version=2} {add=[5 (1413147500086296576)]} 0 5
[junit4:junit4]   2> 20195 T494 C5 P30247 REQ /update {distrib.from=http://127.0.0.1:31395/solr/collection1/&update.distrib=FROMLEADER&wt=javabin&version=2} status=0 QTime=5 
[junit4:junit4]   2> 20196 T471 C6 P31395 /update {wt=javabin&version=2} {add=[5 (1413147500094685184)]} 0 15
[junit4:junit4]   2> 20204 T444 C7 P58784 /update {wt=javabin&version=2} {add=[6 (1413147500114608128)]} 0 5
[junit4:junit4]   2> 20220 T494 C5 P30247 REQ /update {distrib.from=http://127.0.0.1:31395/solr/collection1/&update.distrib=FROMLEADER&wt=javabin&version=2} status=0 QTime=4 
[junit4:junit4]   2> 20221 T471 C6 P31395 /update {wt=javabin&version=2} {add=[6 (1413147500122996736)]} 0 14
[junit4:junit4]   2> 20229 T444 C7 P58784 /update {wt=javabin&version=2} {add=[7 (1413147500140822528)]} 0 5
[junit4:junit4]   2> 20248 T494 C5 P30247 REQ /update {update.distrib=FROMLEADER&distrib.from=http://127.0.0.1:31395/solr/collection1/&wt=javabin&version=2} status=0 QTime=4 
[junit4:junit4]   2> 20249 T474 C6 P31395 REQ /update {distrib.from=http://127.0.0.1:31791/solr/collection1/&update.distrib=TOLEADER&wt=javabin&version=2} status=0 QTime=13 
[junit4:junit4]   2> 20250 T462 C4 P31791 /update {wt=javabin&version=2} {add=[7]} 0 17
[junit4:junit4]   2> 20258 T444 C7 P58784 /update {wt=javabin&version=2} {add=[8 (1413147500171231232)]} 0 5
[junit4:junit4]   2> 20279 T481 C3 P25929 REQ /update {update.distrib=FROMLEADER&distrib.from=http://127.0.0.1:31791/solr/collection1/&wt=javabin&version=2} status=0 QTime=5 
[junit4:junit4]   2> 20280 T460 C4 P31791 REQ /update {distrib.from=http://127.0.0.1:31395/solr/collection1/&update.distrib=TOLEADER&wt=javabin&version=2} status=0 QTime=15 
[junit4:junit4]   2> 20281 T471 C6 P31395 /update {wt=javabin&version=2} {add=[8]} 0 20
[junit4:junit4]   2> 20289 T444 C7 P58784 /update {wt=javabin&version=2} {add=[9 (1413147500203737088)]} 0 5
[junit4:junit4]   2> 20304 T494 C5 P30247 REQ /update {distrib.from=http://127.0.0.1:31395/solr/collection1/&update.distrib=FROMLEADER&wt=javabin&version=2} status=0 QTime=5 
[junit4:junit4]   2> 20305 T471 C6 P31395 /update {wt=javabin&version=2} {add=[9 (1413147500212125696)]} 0 13
[junit4:junit4]   2> 20313 T444 C7 P58784 /update {wt=javabin&version=2} {add=[10 (1413147500228902912)]} 0 5
[junit4:junit4]   2> 20328 T481 C3 P25929 REQ /update {distrib.from=http://127.0.0.1:31791/solr/collection1/&update.distrib=FROMLEADER&wt=javabin&version=2} status=0 QTime=5 
[junit4:junit4]   2> 20329 T462 C4 P31791 /update {wt=javabin&version=2} {add=[10 (1413147500237291520)]} 0 13
[junit4:junit4]   2> 20382 T444 C7 P58784 /update {wt=javabin&version=2} {add=[11 (1413147500254068736)]} 0 50
[junit4:junit4]   2> 20402 T481 C3 P25929 REQ /update {update.distrib=FROMLEADER&distrib.from=http://127.0.0.1:31791/solr/collection1/&wt=javabin&version=2} status=0 QTime=4 
[junit4:junit4]   2> 20403 T460 C4 P31791 REQ /update {distrib.from=http://127.0.0.1:31395/solr/collection1/&update.distrib=TOLEADER&wt=javabin&version=2} status=0 QTime=14 
[junit4:junit4]   2> 20404 T471 C6 P31395 /update {wt=javabin&version=2} {add=[11]} 0 18
[junit4:junit4]   2> 20415 T444 C7 P58784 /update {wt=javabin&version=2} {add=[12 (1413147500333760512)]} 0 7
[junit4:junit4]   2> 20430 T481 C3 P25929 REQ /update {distrib.from=http://127.0.0.1:31791/solr/collection1/&update.distrib=FROMLEADER&wt=javabin&version=2} status=0 QTime=4 
[junit4:junit4]   2> 20431 T462 C4 P31791 /update {wt=javabin&version=2} {add=[12 (1413147500344246272)]} 0 13
[junit4:junit4]   2> 20440 T444 C7 P58784 /update {wt=javabin&version=2} {add=[13 (1413147500359974912)]} 0 7
[junit4:junit4]   2> 20461 T481 C3 P25929 REQ /update {update.distrib=FROMLEADER&distrib.from=http://127.0.0.1:31791/solr/collection1/&wt=javabin&version=2} status=0 QTime=4 
[junit4:junit4]   2> 20462 T460 C4 P31791 REQ /update {distrib.from=http://127.0.0.1:31395/solr/collection1/&update.distrib=TOLEADER&wt=javabin&version=2} status=0 QTime=15 
[junit4:junit4]   2> 20463 T471 C6 P31395 /update {wt=javabin&version=2} {add=[13]} 0 20
[junit4:junit4]   2> 20470 T444 C7 P58784 /update {wt=javabin&version=2} {add=[14 (1413147500394577920)]} 0 4
[junit4:junit4]   2> 20485 T481 C3 P25929 REQ /update {distrib.from=http://127.0.0.1:31791/solr/collection1/&update.distrib=FROMLEADER&wt=javabin&version=2} status=0 QTime=5 
[junit4:junit4]   2> 20486 T462 C4 P31791 /update {wt=javabin&version=2} {add=[14 (1413147500401917952)]} 0 13
[junit4:junit4]   2> 20494 T444 C7 P58784 /update {wt=javabin&version=2} {add=[15 (1413147500418695168)]} 0 5
[junit4:junit4]   2> 20512 T481 C3 P25929 REQ /update {update.distrib=FROMLEADER&distrib.from=http://127.0.0.1:31791/solr/collection1/&wt=javabin&version=2} status=0 QTime=4 
[junit4:junit4]   2> 20513 T460 C4 P31791 REQ /update {distrib.from=http://127.0.0.1:31395/solr/collection1/&update.distrib=TOLEADER&wt=javabin&version=2} status=0 QTime=13 
[junit4:junit4]   2> 20514 T471 C6 P31395 /update {wt=javabin&version=2} {add=[15]} 0 17
[junit4:junit4]   2> 20521 T444 C7 P58784 /update {wt=javabin&version=2} {add=[16 (1413147500448055296)]} 0 4
[junit4:junit4]   2> 20540 T481 C3 P25929 REQ /update {update.distrib=FROMLEADER&distrib.from=http://127.0.0.1:31791/solr/collection1/&wt=javabin&version=2} status=0 QTime=3 
[junit4:junit4]   2> 20540 T460 C4 P31791 REQ /update {distrib.from=http://127.0.0.1:31395/solr/collection1/&update.distrib=TOLEADER&wt=javabin&version=2} status=0 QTime=12 
[junit4:junit4]   2> 20541 T471 C6 P31395 /update {wt=javabin&version=2} {add=[16]} 0 16
[junit4:junit4]   2> 20562 T444 C7 P58784 /update {wt=javabin&version=2} {add=[17 (1413147500481609728)]} 0 17
[junit4:junit4]   2> 20604 T494 C5 P30247 REQ /update {update.distrib=FROMLEADER&distrib.from=http://127.0.0.1:31395/solr/collection1/&wt=javabin&version=2} status=0 QTime=14 
[junit4:junit4]   2> 20605 T474 C6 P31395 REQ /update {distrib.from=http://127.0.0.1:31791/solr/collection1/&update.distrib=TOLEADER&wt=javabin&version=2} status=0 QTime=33 
[junit4:junit4]   2> 20606 T462 C4 P31791 /update {wt=javabin&version=2} {add=[17]} 0 41
[junit4:junit4]   2> 20613 T444 C7 P58784 /update {wt=javabin&version=2} {add=[100 (1413147500544524288)]} 0 4
[junit4:junit4]   2> 20674 T481 C3 P25929 REQ /update {distrib.from=http://127.0.0.1:31791/solr/collection1/&update.distrib=FROMLEADER&wt=javabin&version=2} status=0 QTime=29 
[junit4:junit4]   2> 20675 T462 C4 P31791 /update {wt=javabin&version=2} {add=[100 (1413147500551864320)]} 0 59
[junit4:junit4]   2> 20681 T444 C7 P58784 /update {wt=javabin&version=2} {add=[101 (1413147500616876032)]} 0 3
[junit4:junit4]   2> 20696 T481 C3 P25929 REQ /update {distrib.from=http://127.0.0.1:31791/solr/collection1/&update.distrib=FROMLEADER&wt=javabin&version=2} status=0 QTime=5 
[junit4:junit4]   2> 20696 T462 C4 P31791 /update {wt=javabin&version=2} {add=[101 (1413147500623167488)]} 0 12
[junit4:junit4]   2> 20703 T444 C7 P58784 /update {wt=javabin&version=2} {add=[102 (1413147500639944704)]} 0 3
[junit4:junit4]   2> 20715 T481 C3 P25929 REQ /update {distrib.from=http://127.0.0.1:31791/solr/collection1/&update.distrib=FROMLEADER&wt=javabin&version=2} status=0 QTime=3 
[junit4:junit4]   2> 20716 T462 C4 P31791 /update {wt=javabin&version=2} {add=[102 (1413147500646236160)]} 0 10
[junit4:junit4]   2> 20749 T444 C7 P58784 /update {wt=javabin&version=2} {add=[103 (1413147500659867648)]} 0 29
[junit4:junit4]   2> 20762 T494 C5 P30247 REQ /update {distrib.from=http://127.0.0.1:31395/solr/collection1/&update.distrib=FROMLEADER&wt=javabin&version=2} status=0 QTime=3 
[junit4:junit4]   2> 20763 T471 C6 P31395 /update {wt=javabin&version=2} {add=[103 (1413147500694470656)]} 0 11
[junit4:junit4]   2> 20775 T444 C7 P58784 /update {wt=javabin&version=2} {add=[104 (1413147500709150720)]} 0 9
[junit4:junit4]   2> 20790 T494 C5 P30247 REQ /update {update.distrib=FROMLEADER&distrib.from=http://127.0.0.1:31395/solr/collection1/&wt=javabin&version=2} status=0 QTime=3 
[junit4:junit4]   2> 20792 T474 C6 P31395 REQ /update {distrib.from=http://127.0.0.1:31791/solr/collection1/&update.distrib=TOLEADER&wt=javabin&version=2} status=0 QTime=9 
[junit4:junit4]   2> 20793 T462 C4 P31791 /update {wt=javabin&version=2} {add=[104]} 0 15
[junit4:junit4]   2> 20800 T444 C7 P58784 /update {wt=javabin&version=2} {add=[105 (1413147500740608000)]} 0 4
[junit4:junit4]   2> 20865 T494 C5 P30247 REQ /update {distrib.from=http://127.0.0.1:31395/solr/collection1/&update.distrib=FROMLEADER&wt=javabin&version=2} status=0 QTime=27 
[junit4:junit4]   2> 20866 T471 C6 P31395 /update {wt=javabin&version=2} {add=[105 (1413147500747948032)]} 0 63
[junit4:junit4]   2> 20873 T444 C7 P58784 /update {wt=javabin&version=2} {add=[106 (1413147500818202624)]} 0 3
[junit4:junit4]   2> 20903 T494 C5 P30247 REQ /update {update.distrib=FROMLEADER&distrib.from=http://127.0.0.1:31395/solr/collection1/&wt=javabin&version=2} status=0 QTime=14 
[junit4:junit4]   2> 20904 T474 C6 P31395 REQ /update {distrib.from=http://127.0.0.1:31791/solr/collection1/&update.distrib=TOLEADER&wt=javabin&version=2} status=0 QTime=23 
[junit4:junit4]   2> 20905 T462 C4 P31791 /update {wt=javabin&version=2} {add=[106]} 0 28
[junit4:junit4]   2> 20912 T444 C7 P58784 /update {wt=javabin&version=2} {add=[107 (1413147500858048512)]} 0 3
[junit4:junit4]   2> 20925 T481 C3 P25929 REQ /update {distrib.from=http://127.0.0.1:31791/solr/collection1/&update.distrib=FROMLEADER&wt=javabin&version=2} status=0 QTime=3 
[junit4:junit4]   2> 20926 T462 C4 P31791 /update {wt=javabin&version=2} {add=[107 (1413147500865388544)]} 0 11
[junit4:junit4]   2> 20932 T444 C7 P58784 /update {wt=javabin&version=2} {add=[108 (1413147500880068608)]} 0 3
[junit4:junit4]   2> 20944 T481 C3 P25929 REQ /update {distrib.from=http://127.0.0.1:31791/solr/collection1/&update.distrib=FROMLEADER&wt=javabin&version=2} status=0 QTime=3 
[junit4:junit4]   2> 20945 T462 C4 P31791 /update {wt=javabin&version=2} {add=[108 (1413147500886360064)]} 0 9
[junit4:junit4]   2> 20951 T444 C7 P58784 /update {wt=javabin&version=2} {add=[109 (1413147500899991552)]} 0 3
[junit4:junit4]   2> 20967 T481 C3 P25929 REQ /update {update.distrib=FROMLEADER&distrib.from=http://127.0.0.1:31791/solr/collection1/&wt=javabin&version=2} status=0 QTime=4 
[junit4:junit4]   2> 20968 T460 C4 P31791 REQ /update {distrib.from=http://127.0.0.1:31395/solr/collection1/&update.distrib=TOLEADER&wt=javabin&version=2} status=0 QTime=10 
[junit4:junit4]   2> 20969 T471 C6 P31395 /update {wt=javabin&version=2} {add=[109]} 0 14
[junit4:junit4]   2> 20976 T444 C7 P58784 /update {wt=javabin&version=2} {add=[110 (1413147500926205952)]} 0 3
[junit4:junit4]   2> 20990 T481 C3 P25929 REQ /update {distrib.from=http://127.0.0.1:31791/solr/collection1/&update.distrib=FROMLEADER&wt=javabin&version=2} status=0 QTime=3 
[junit4:junit4]   2> 20991 T462 C4 P31791 /update {wt=javabin&version=2} {add=[110 (1413147500933545984)]} 0 11
[junit4:junit4]   2> 20999 T444 C7 P58784 /update {wt=javabin&version=2} {add=[111 (1413147500949274624)]} 0 4
[junit4:junit4]   2> 21016 T481 C3 P25929 REQ /update {update.distrib=FROMLEADER&distrib.from=http://127.0.0.1:31791/solr/collection1/&wt=javabin&version=2} status=0 QTime=3 
[junit4:junit4]   2> 21017 T460 C4 P31791 REQ /update {distrib.from=http://127.0.0.1:31395/solr/collection1/&update.distrib=TOLEADER&wt=javabin&version=2} status=0 QTime=11 
[junit4:junit4]   2> 21018 T471 C6 P31395 /update {wt=javabin&version=2} {add=[111]} 0 15
[junit4:junit4]   2> 21026 T444 C7 P58784 /update {wt=javabin&version=2} {add=[112 (1413147500977586176)]} 0 3
[junit4:junit4]   2> 21043 T494 C5 P30247 REQ /update {update.distrib=FROMLEADER&distrib.from=http://127.0.0.1:31395/solr/collection1/&wt=javabin&version=2} status=0 QTime=3 
[junit4:junit4]   2> 21044 T474 C6 P31395 REQ /update {distrib.from=http://127.0.0.1:31791/solr/collection1/&update.distrib=TOLEADER&wt=javabin&version=2} status=0 QTime=10 
[junit4:junit4]   2> 21045 T462 C4 P31791 /update {wt=javabin&version=2} {add=[112]} 0 15
[junit4:junit4]   2> 21064 T444 C7 P58784 /update {wt=javabin&version=2} {add=[113 (1413147501004849152)]} 0 16
[junit4:junit4]   2> 21077 T481 C3 P25929 REQ /update {distrib.from=http://127.0.0.1:31791/solr/collection1/&update.distrib=FROMLEADER&wt=javabin&version=2} status=0 QTime=3 
[junit4:junit4]   2> 21078 T462 C4 P31791 /update {wt=javabin&version=2} {add=[113 (1413147501024772096)]} 0 10
[junit4:junit4]   2> 21085 T444 C7 P58784 /update {wt=javabin&version=2} {add=[114 (1413147501039452160)]} 0 4
[junit4:junit4]   2> 21097 T481 C3 P25929 REQ /update {distrib.from=http://127.0.0.1:31791/solr/collection1/&update.distrib=FROMLEADER&wt=javabin&version=2} status=0 QTime=3 
[junit4:junit4]   2> 21098 T462 C4 P31791 /update {wt=javabin&version=2} {add=[114 (1413147501046792192)]} 0 9
[junit4:junit4]   2> 21104 T444 C7 P58784 /update {wt=javabin&version=2} {add=[115 (1413147501060423680)]} 0 2
[junit4:junit4]   2> 21120 T494 C5 P30247 REQ /update {update.distrib=FROMLEADER&distrib.from=http://127.0.0.1:31395/solr/collection1/&wt=javabin&version=2} status=0 QTime=3 
[junit4:junit4]   2> 21121 T474 C6 P31395 REQ /update {distrib.from=http://127.0.0.1:31791/solr/collection1/&update.distrib=TOLEADER&wt=javabin&version=2} status=0 QTime=10 
[junit4:junit4]   2> 21122 T462 C4 P31791 /update {wt=javabin&version=2} {add=[115]} 0 14
[junit4:junit4]   2> 21127 T444 C7 P58784 /update {wt=javabin&version=2} {add=[116 (1413147501085589504)]} 0 2
[junit4:junit4]   2> 21143 T494 C5 P30247 REQ /update {distrib.from=http://127.0.0.1:31395/solr/collection1/&update.distrib=FROMLEADER&wt=javabin&version=2} status=0 QTime=4 
[junit4:junit4]   2> 21144 T471 C6 P31395 /update {wt=javabin&version=2} {add=[116 (1413147501091880960)]} 0 12
[junit4:junit4]   2> 21150 T444 C7 P58784 /update {wt=javabin&version=2} {add=[117 (1413147501108658176)]} 0 3
[junit4:junit4]   2> 21165 T494 C5 P30247 REQ /update {update.distrib=FROMLEADER&distrib.from=http://127.0.0.1:31395/solr/collection1/&wt=javabin&version=2} status=0 QTime=3 
[junit4:junit4]   2> 21167 T474 C6 P31395 REQ /update {distrib.from=http://127.0.0.1:31791/solr/collection1/&update.distrib=TOLEADER&wt=javabin&version=2} status=0 QTime=10 
[junit4:junit4]   2> 21167 T462 C4 P31791 /update {wt=javabin&version=2} {add=[117]} 0 13
[junit4:junit4]   2> 21173 T444 C7 P58784 /update {wt=javabin&version=2} {add=[118 (1413147501132775424)]} 0 3
[junit4:junit4]   2> 21220 T481 C3 P25929 REQ /update {update.distrib=FROMLEADER&distrib.from=http://127.0.0.1:31791/solr/collection1/&wt=javabin&version=2} status=0 QTime=20 
[junit4:junit4]   2> 21221 T460 C4 P31791 REQ /update {distrib.from=http://127.0.0.1:31395/solr/collection1/&update.distrib=TOLEADER&wt=javabin&version=2} status=0 QTime=42 
[junit4:junit4]   2> 21222 T471 C6 P31395 /update {wt=javabin&version=2} {add=[118]} 0 46
[junit4:junit4]   2> 21228 T444 C7 P58784 /update {wt=javabin&version=2} {add=[119 (1413147501190447104)]} 0 2
[junit4:junit4]   2> 21241 T494 C5 P30247 REQ /update {distrib.from=http://127.0.0.1:31395/solr/collection1/&update.distrib=FROMLEADER&wt=javabin&version=2} status=0 QTime=3 
[junit4:junit4]   2> 21242 T471 C6 P31395 /update {wt=javabin&version=2} {add=[119 (1413147501196738560)]} 0 11
[junit4:junit4]   2> 21247 T444 C7 P58784 /update {wt=javabin&version=2} {add=[120 (1413147501211418624)]} 0 2
[junit4:junit4]   2> 21261 T494 C5 P30247 REQ /update {update.distrib=FROMLEADER&distrib.from=http://127.0.0.1:31395/solr/collection1/&wt=javabin&version=2} status=0 QTime=3 
[junit4:junit4]   2> 21262 T474 C6 P31395 REQ /update {distrib.from=http://127.0.0.1:31791/solr/collection1/&update.distrib=TOLEADER&wt=javabin&version=2} status=0 QTime=9 
[junit4:junit4]   2> 21263 T462 C4 P31791 /update {wt=javabin&version=2} {add=[120]} 0 13
[junit4:junit4]   2> 21268 T444 C7 P58784 /update {wt=javabin&version=2} {add=[121 (1413147501233438720)]} 0 2
[junit4:junit4]   2> 21282 T494 C5 P30247 REQ /update {update.distrib=FROMLEADER&distrib.from=http://127.0.0.1:31395/solr/collection1/&wt=javabin&version=2} status=0 QTime=3 
[junit4:junit4]   2> 21283 T474 C6 P31395 REQ /update {distrib.from=http://127.0.0.1:31791/solr/collection1/&update.distrib=TOLEADER&wt=javabin&version=2} status=0 QTime=9 
[junit4:junit4]   2> 21283 T462 C4 P31791 /update {wt=javabin&version=2} {add=[121]} 0 12
[junit4:junit4]   2> 21289 T444 C7 P58784 /update {wt=javabin&version=2} {add=[122 (1413147501254410240)]} 0 2
[junit4:junit4]   2> 21305 T481 C3 P25929 REQ /update {update.distrib=FROMLEADER&distrib.from=http://127.0.0.1:31791/solr/collection1/&wt=javabin&version=2} status=0 QTime=4 
[junit4:junit4]   2> 21305 T460 C4 P31791 REQ /update {distrib.from=http://127.0.0.1:31395/solr/collection1/&update.distrib=TOLEADER&wt=javabin&version=2} status=0 QTime=10 
[junit4:junit4]   2> 21306 T471 C6 P31395 /update {wt=javabin&version=2} {add=[122]} 0 14
[junit4:junit4]   2> 21320 T444 C7 P58784 /update {wt=javabin&version=2} {add=[123 (1413147501277478912)]} 0 11
[junit4:junit4]   2> 21332 T481 C3 P25929 REQ /update {distrib.from=http://127.0.0.1:31791/solr/collection1/&update.distrib=FROMLEADER&wt=javabin&version=2} status=0 QTime=3 
[junit4:junit4]   2> 21333 T462 C4 P31791 /update {wt=javabin&version=2} {add=[123 (1413147501293207552)]} 0 10
[junit4:junit4]   2> 21339 T444 C7 P58784 /update {wt=javabin&version=2} {add=[124 (1413147501306839040)]} 0 3
[junit4:junit4]   2> 21350 T481 C3 P25929 REQ /update {distrib.from=http://127.0.0.1:31791/solr/collection1/&update.distrib=FROMLEADER&wt=javabin&version=2} status=0 QTime=3 
[junit4:junit4]   2> 21351 T462 C4 P31791 /update {wt=javabin&version=2} {add=[124 (1413147501313130496)]} 0 9
[junit4:junit4]   2> 21356 T444 C7 P58784 /update {wt=javabin&version=2} {add=[125 (1413147501324664832)]} 0 2
[junit4:junit4]   2> 21367 T481 C3 P25929 REQ /update {distrib.from=http://127.0.0.1:31791/solr/collection1/&update.distrib=FROMLEADER&wt=javabin&version=2} status=0 QTime=3 
[junit4:junit4]   2> 21368 T462 C4 P31791 /update {wt=javabin&version=2} {add=[125 (1413147501330956288)]} 0 9
[junit4:junit4]   2> 21373 T444 C7 P58784 /update {wt=javabin&version=2} {add=[126 (1413147501342490624)]} 0 2
[junit4:junit4]   2> 21386 T494 C5 P30247 REQ /update {update.distrib=FROMLEADER&distrib.from=http://127.0.0.1:31395/solr/collection1/&wt=javabin&version=2} status=0 QTime=2 
[junit4:junit4]   2> 21388 T474 C6 P31395 REQ /update {distrib.from=http://127.0.0.1:31791/solr/collection1/&update.distrib=TOLEADER&wt=javabin&version=2} status=0 QTime=10 
[junit4:junit4]   2> 21388 T462 C4 P31791 /update {wt=javabin&version=2} {add=[126]} 0 13
[junit4:junit4]   2> 21393 T444 C7 P58784 /update {wt=javabin&version=2} {add=[127 (1413147501363462144)]} 0 2
[junit4:junit4]   2> 21438 T494 C5 P30247 REQ /update {update.distrib=FROMLEADER&distrib.from=http://127.0.0.1:31395/solr/collection1/&wt=javabin&version=2} status=0 QTime=18 
[junit4:junit4]   2> 21439 T474 C6 P31395 REQ /update {distrib.from=http://127.0.0.1:31791/solr/collection1/&update.distrib=TOLEADER&wt=javabin&version=2} status=0 QTime=40 
[junit4:junit4]   2> 21440 T462 C4 P31791 /update {wt=javabin&version=2} {add=[127]} 0 44
[junit4:junit4]   2> 21446 T444 C7 P58784 /update {wt=javabin&version=2} {add=[128 (1413147501419036672)]} 0 3
[junit4:junit4]   2> 21473 T494 C5 P30247 REQ /update {update.distrib=FROMLEADER&distrib.from=http://127.0.0.1:31395/solr/collection1/&wt=javabin&version=2} status=0 QTime=7 
[junit4:junit4]   2> 21474 T474 C6 P31395 REQ /update {distrib.from=http://127.0.0.1:31791/solr/collection1/&update.distrib=TOLEADER&wt=javabin&version=2} status=0 QTime=22 
[junit4:junit4]   2> 21475 T462 C4 P31791 /update {wt=javabin&version=2} {add=[128]} 0 26
[junit4:junit4]   2> 21481 T444 C7 P58784 /update {wt=javabin&version=2} {add=[129 (1413147501455736832)]} 0 3
[junit4:junit4]   2> 21492 T481 C3 P25929 REQ /update {distrib.from=http://127.0.0.1:31791/solr/collection1/&update.distrib=FROMLEADER&wt=javabin&version=2} status=0 QTime=3 
[junit4:junit4]   2> 21492 T462 C4 P31791 /update {wt=javabin&version=2} {add=[129 (1413147501462028288)]} 0 8
[junit4:junit4]   2> 21498 T444 C7 P58784 /update {wt=javabin&version=2} {add=[130 (1413147501474611200)]} 0 2
[junit4:junit4]   2> 21512 T494 C5 P30247 REQ /update {update.distrib=FROMLEADER&distrib.from=http://127.0.0.1:31395/solr/collection1/&wt=javabin&version=2} status=0 QTime=3 
[junit4:junit4]   2> 21512 T474 C6 P31395 REQ /update {distrib.from=http://127.0.0.1:31791/solr/collection1/&update.distrib=TOLEADER&wt=javabin&version=2} status=0 QTime=8 
[junit4:junit4]   2> 21513 T462 C4 P31791 /update {wt=javabin&version=2} {add=[130]} 0 12
[junit4:junit4]   2> 21518 T444 C7 P58784 /update {wt=javabin&version=2} {add=[131 (1413147501495582720)]} 0 2
[junit4:junit4]   2> 21532 T494 C5 P30247 REQ /update {distrib.from=http://127.0.0.1:31395/solr/collection1/&update.distrib=FROMLEADER&wt=javabin&version=2} status=0 QTime=3 
[junit4:junit4]   2> 21533 T471 C6 P31395 /update {wt=javabin&version=2} {add=[131 (1413147501501874176)]} 0 11
[junit4:junit4]   2> 21538 T444 C7 P58784 /update {wt=javabin&version=2} {add=[132 (1413147501516554240)]} 0 2
[junit4:junit4]   2> 21548 T481 C3 P25929 REQ /update {distrib.from=http://127.0.0.1:31791/solr/collection1/&update.distrib=FROMLEADER&wt=javabin&version=2} status=0 QTime=3 
[junit4:junit4]   2> 21548 T462 C4 P31791 /update {wt=javabin&version=2} {add=[132 (1413147501521797120)]} 0 7
[junit4:junit4]   2> 21569 T444 C7 P58784 /update {wt=javabin&version=2} {add=[133 (1413147501533331456)]} 0 17
[junit4:junit4]   2> 21582 T481 C3 P25929 REQ /update {update.distrib=FROMLEADER&distrib.from=http://127.0.0.1:31791/solr/collection1/&wt=javabin&version=2} status=0 QTime=3 
[junit4:junit4]   2> 21583 T460 C4 P31791 REQ /update {distrib.from=http://127.0.0.1:31395/solr/collection1/&update.distrib=TOLEADER&wt=javabin&version=2} status=0 QTime=8 
[junit4:junit4]   2> 21584 T471 C6 P31395 /update {wt=javabin&version=2} {add=[133]} 0 12
[junit4:junit4]   2> 21591 T444 C7 P58784 /update {wt=javabin&version=2} {add=[134 (1413147501570031616)]} 0 4
[junit4:junit4]   2> 21602 T494 C5 P30247 REQ /update {distrib.from=http://127.0.0.1:31395/solr/collection1/&update.distrib=FROMLEADER&wt=javabin&version=2} status=0 QTime=3 
[junit4:junit4]   2> 21602 T471 C6 P31395 /update {wt=javabin&version=2} {add=[134 (1413147501577371648)]} 0 8
[junit4:junit4]   2> 21607 T444 C7 P58784 /update {wt=javabin&version=2} {add=[135 (1413147501587857408)]} 0 2
[junit4:junit4]   2> 21617 T481 C3 P25929 REQ /update {distrib.from=http://127.0.0.1:31791/solr/collection1/&update.distrib=FROMLEADER&wt=javabin&version=2} status=0 QTime=3 
[junit4:junit4]   2> 21617 T462 C4 P31791 /update {wt=javabin&version=2} {add=[135 (1413147501593100288)]} 0 8
[junit4:junit4]   2> 21622 T444 C7 P58784 /update {wt=javabin&version=2} {add=[136 (1413147501604634624)]} 0 2
[junit4:junit4]   2> 21636 T494 C5 P30247 REQ /update {update.distrib=FROMLEADER&distrib.from=http://127.0.0.1:31395/solr/collection1/&wt=javabin&version=2} status=0 QTime=2 
[junit4:junit4]   2> 21637 T474 C6 P31395 REQ /update {distrib.from=http://127.0.0.1:31791/solr/collection1/&update.distrib=TOLEADER&wt=javabin&version=2} status=0 QTime=9 
[junit4:junit4]   2> 21638 T462 C4 P31791 /update {wt=javabin&version=2} {add=[136]} 0 13
[junit4:junit4]   2> 21643 T444 C7 P58784 /update {wt=javabin&version=2} {add=[137 (1413147501626654720)]} 0 2
[junit4:junit4]   2> 21653 T494 C5 P30247 REQ /update {distrib.from=http://127.0.0.1:31395/solr/collection1/&update.distrib=FROMLEADER&wt=javabin&version=2} status=0 QTime=2 
[junit4:junit4]   2> 21654 T471 C6 P31395 /update {wt=javabin&version=2} {add=[137 (1413147501631897600)]} 0 8
[junit4:junit4]   2> 21659 T444 C7 P58784 /update {wt=javabin&version=2} {add=[138 (1413147501642383360)]} 0 2
[junit4:junit4]   2> 21671 T481 C3 P25929 REQ /update {update.distrib=FROMLEADER&distrib.from=http://127.0.0.1:31791/solr/collection1/&wt=javabin&version=2} status=0 QTime=3 
[junit4:junit4]   2> 21671 T460 C4 P31791 REQ /update {distrib.from=http://127.0.0.1:31395/solr/collection1/&update.distrib=TOLEADER&wt=javabin&version=2} status=0 QTime=7 
[junit4:junit4]   2> 21672 T471 C6 P31395 /update {wt=javabin&version=2} {add=[138]} 0 11
[junit4:junit4]   2> 21677 T444 C7 P58784 /update {wt=javabin&version=2} {add=[139 (1413147501662306304)]} 0 2
[junit4:junit4]   2> 21686 T494 C5 P30247 REQ /update {distrib.from=http://127.0.0.1:31395/solr/collection1/&update.distrib=FROMLEADER&wt=javabin&version=2} status=0 QTime=2 
[junit4:junit4]   2> 21687 T471 C6 P31395 /update {wt=javabin&version=2} {add=[139 (1413147501666500608)]} 0 7
[junit4:junit4]   2> 21693 T444 C7 P58784 /update {wt=javabin&version=2} {add=[140 (1413147501678034944)]} 0 3
[junit4:junit4]   2> 21718 T494 C5 P30247 REQ /update {update.distrib=FROMLEADER&distrib.from=http://127.0.0.1:31395/solr/collection1/&wt=javabin&version=2} status=0 QTime=3 
[junit4:junit4]   2> 21719 T474 C6 P31395 REQ /update {distrib.from=http://127.0.0.1:31791/solr/collection1/&update.distrib=TOLEADER&wt=javabin&version=2} status=0 QTime=19 
[junit4:junit4]   2> 21720 T462 C4 P31791 /update {wt=javabin&version=2} {add=[140]} 0 23
[junit4:junit4]   2> 21727 T444 C7 P58784 /update {wt=javabin&version=2} {add=[141 (1413147501713686528)]} 0 2
[junit4:junit4]   2> 21740 T494 C5 P30247 REQ /update {distrib.from=http://127.0.0.1:31395/solr/collection1/&update.distrib=FROMLEADER&wt=javabin&version=2} status=0 QTime=2 
[junit4:junit4]   2> 21741 T471 C6 P31395 /update {wt=javabin&version=2} {add=[141 (1413147501721026560)]} 0 9
[junit4:junit4]   2> 21748 T444 C7 P58784 /update {wt=javabin&version=2} {add=[142 (1413147501735706624)]} 0 3
[junit4:junit4]   2> 21813 T494 C5 P30247 REQ /update {update.distrib=FROMLEADER&distrib.from=http://127.0.0.1:31395/solr/collection1/&wt=javabin&version=2} status=0 QTime=19 
[junit4:junit4]   2> 21814 T474 C6 P31395 REQ /update {distrib.from=http://127.0.0.1:31791/solr/collection1/&update.distrib=TOLEADER&wt=javabin&version=2} status=0 QTime=60 
[junit4:junit4]   2> 21815 T462 C4 P31791 /update {wt=javabin&version=2} {add=[142]} 0 64
[junit4:junit4]   2> 21840 T444 C7 P58784 /update {wt=javabin&version=2} {add=[143 (1413147501812252672)]} 0 22
[junit4:junit4]   2> 21854 T494 C5 P30247 REQ /update {distrib.from=http://127.0.0.1:31395/solr/collection1/&update.distrib=FROMLEADER&wt=javabin&version=2} status=0 QTime=4 
[junit4:junit4]   2> 21855 T471 C6 P31395 /update {wt=javabin&version=2} {add=[143 (1413147501838467072)]} 0 12
[junit4:junit4]   2> 21861 T444 C7 P58784 /update {wt=javabin&version=2} {add=[144 (1413147501853147136)]} 0 3
[junit4:junit4]   2> 21873 T494 C5 P30247 REQ /update {update.distrib=FROMLEADER&distrib.from=http://127.0.0.1:31395/solr/collection1/&wt=javabin&version=2} status=0 QTime=2 
[junit4:junit4]   2> 21874 T474 C6 P31395 REQ /update {distrib.from=http://127.0.0.1:31791/solr/collection1/&update.distrib=TOLEADER&wt=javabin&version=2} status=0 QTime=8 
[junit4:junit4]   2> 21875 T462 C4 P31791 /update {wt=javabin&version=2} {add=[144]} 0 12
[junit4:junit4]   2> 21880 T444 C7 P58784 /update {wt=javabin&version=2} {add=[145 (1413147501875167232)]} 0 2
[junit4:junit4]   2> 21893 T494 C5 P30247 REQ /update {update.distrib=FROMLEADER&distrib.from=http://127.0.0.1:31395/solr/collection1/&wt=javabin&version=2} status=0 QTime=2 
[junit4:junit4]   2> 21894 T474 C6 P31395 REQ /update {distrib.from=http://127.0.0.1:31791/solr/collection1/&update.distrib=TOLEADER&wt=javabin&version=2} status=0 QTime=8 
[junit4:junit4]   2> 21895 T462 C4 P31791 /update {wt=javabin&version=2} {add=[145]} 0 12
[junit4:junit4]   2> 21900 T444 C7 P58784 /update {wt=javabin&version=2} {add=[146 (1413147501895090176)]} 0 2
[junit4:junit4]   2> 21961 T481 C3 P25929 REQ /update {distrib.from=http://127.0.0.1:31791/solr/collection1/&update.distrib=FROMLEADER&wt=javabin&version=2} status=0 QTime=31 
[junit4:junit4]   2> 21963 T462 C4 P31791 /update {wt=javabin&version=2} {add=[146 (1413147501900333056)]} 0 60
[junit4:junit4]   2> 21969 T444 C7 P58784 /update {wt=javabin&version=2} {add=[147 (1413147501967441920)]} 0 3
[junit4:junit4]   2> 21982 T494 C5 P30247 REQ /update {update.distrib=FROMLEADER&distrib.from=http://127.0.0.1:31395/solr/collection1/&wt=javabin&version=2} status=0 QTime=2 
[junit4:junit4]   2> 21983 T474 C6 P31395 REQ /update {distrib.from=http://127.0.0.1:31791/solr/collection1/&update.distrib=TOLEADER&wt=javabin&version=2} status=0 QTime=8 
[junit4:junit4]   2> 21984 T462 C4 P31791 /update {wt=javabin&version=2} {add=[147]} 0 12
[junit4:junit4]   2> 21989 T444 C7 P58784 /update {wt=javabin&version=2} {add=[148 (1413147501989462016)]} 0 2
[junit4:junit4]   2> 22007 T481 C3 P25929 REQ /update {distrib.from=http://127.0.0.1:31791/solr/collection1/&update.distrib=FROMLEADER&wt=javabin&version=2} status=0 QTime=9 
[junit4:junit4]   2> 22008 T462 C4 P31791 /update {wt=javabin&version=2} {add=[148 (1413147501993656320)]} 0 16
[junit4:junit4]   2> 22013 T444 C7 P58784 /update {wt=javabin&version=2} {add=[149 (1413147502014627840)]} 0 2
[junit4:junit4]   2> 22025 T494 C5 P30247 REQ /update {update.distrib=FROMLEADER&distrib.from=http://127.0.0.1:31395/solr/collection1/&wt=javabin&version=2} status=0 QTime=2 
[junit4:junit4]   2> 22026 T474 C6 P31395 REQ /update {distrib.from=http://127.0.0.1:31791/solr/collection1/&update.distrib=TOLEADER&wt=javabin&version=2} status=0 QTime=7 
[junit4:junit4]   2> 22027 T462 C4 P31791 /update {wt=javabin&version=2} {add=[149]} 0 11
[junit4:junit4]   2> 22027 T430 oasc.AbstractDistribZkTestBase.waitForRecoveriesToFinish Wait for recoveries to finish - collection: collection1 failOnTimeout:true timeout (sec):1440
[junit4:junit4]   2> 22028 T430 oascc.ZkStateReader.updateClusterState Updating cloud state from ZooKeeper... 
[junit4:junit4]   2> 22032 T444 C7 P58784 oasu.DirectUpdateHandler2.commit start commit{flags=0,_version_=0,optimize=false,openSearcher=true,waitSearcher=true,expungeDeletes=false,softCommit=false}
[junit4:junit4]   2> 23084 T444 C7 P58784 oasc.SolrDeletionPolicy.onCommit SolrDeletionPolicy.onCommit: commits:num=2
[junit4:junit4]   2> 		commit{dir=NRTCachingDirectory(org.apache.lucene.store.NIOFSDirectory@/usr/home/hudson/hudson-slave/workspace/Lucene-Solr-Tests-4.x-Java6/solr/build/solr-core/test/J1/org.apache.solr.cloud.BasicDistributedZk2Test-1347682455958/control/data/index lockFactory=org.apache.lucene.store.NativeFSLockFactory@5cda2610; maxCacheMB=48.0 maxMergeSizeMB=4.0),segFN=segments_2,generation=2,filenames=[_0.fnm, _0_Pulsing40_0.tim, _0_MockFixedIntBlock_0.pos, _0_nrm.cfs, _0_MockFixedIntBlock_0.tib, _0_Pulsing40_0.prx, _0_Pulsing40_0.frq, _0_MockFixedIntBlock_0.frq, _0_Lucene40WithOrds_0.tii, _0_MockFixedIntBlock_0.skp, _0_MockFixedIntBlock_0.pyl, _0_Lucene40WithOrds_0.frq, _0_MockFixedIntBlock_0.doc, _0_MockFixedIntBlock_0.tii, _0_SimpleText_0.pst, _0_nrm.cfe, _0_Pulsing40_0.tip, segments_2, _0.fdx, _0_Lucene40WithOrds_0.prx, _0.si, _0_Lucene40WithOrds_0.tib, _0.fdt]
[junit4:junit4]   2> 		commit{dir=NRTCachingDirectory(org.apache.lucene.store.NIOFSDirectory@/usr/home/hudson/hudson-slave/workspace/Lucene-Solr-Tests-4.x-Java6/solr/build/solr-core/test/J1/org.apache.solr.cloud.BasicDistributedZk2Test-1347682455958/control/data/index lockFactory=org.apache.lucene.store.NativeFSLockFactory@5cda2610; maxCacheMB=48.0 maxMergeSizeMB=4.0),segFN=segments_3,generation=3,filenames=[_5_nrm.cfe, _6_MockFixedIntBlock_0.pyl, _2_SimpleText_0.pst, _6_MockFixedIntBlock_0.frq, _7.si, _3.fdt, _5_Lucene40WithOrds_0.tib, _0_MockFixedIntBlock_0.tib, _0_Pulsing40_0.frq, _7.fnm, _6_MockFixedIntBlock_0.skp, _0_Lucene40WithOrds_0.tii, _5_Lucene40WithOrds_0.tii, _0_Lucene40WithOrds_0.frq, _1_Lucene40WithOrds_0.tib, _0_MockFixedIntBlock_0.tii, _0_SimpleText_0.pst, _7_Lucene40WithOrds_0.frq, _5_Pulsing40_0.tip, _1_Lucene40WithOrds_0.tii, _0_Lucene40WithOrds_0.tib, _7_MockFixedIntBlock_0.pos, _7_MockFixedIntBlock_0.skp, _5_Pulsing40_0.tim, _1_Lucene40WithOrds_0.frq, _0_Pulsing40_0.tim, _4_MockFixedIntBlock_0.pos, _2.fdt, _3_Pulsing40_0.tip, _7.fdx, _2.fdx, _7.fdt, _3_Pulsing40_0.tim, _1.fdx, _7_Pulsing40_0.frq, _5_nrm.cfs, _1.fdt, _4_MockFixedIntBlock_0.frq, _2_MockFixedIntBlock_0.doc, _3.si, _1_MockFixedIntBlock_0.pos, _6.fdt, _5_Lucene40WithOrds_0.prx, _1_SimpleText_0.pst, _2.si, _3_Pulsing40_0.frq, _2_Pulsing40_0.tim, _4_Lucene40WithOrds_0.tib, _4_Lucene40WithOrds_0.tii, _3_MockFixedIntBlock_0.frq, _6.fdx, _2_Pulsing40_0.tip, _1_Lucene40WithOrds_0.prx, _2_MockFixedIntBlock_0.skp, _6_MockFixedIntBlock_0.tib, _3.fnm, _6_MockFixedIntBlock_0.tii, _4_Pulsing40_0.prx, _2_nrm.cfe, _5_Pulsing40_0.frq, _0_MockFixedIntBlock_0.pyl, _0_Pulsing40_0.tip, _2_nrm.cfs, _6_MockFixedIntBlock_0.doc, _5_MockFixedIntBlock_0.frq, _2_Lucene40WithOrds_0.frq, _5_MockFixedIntBlock_0.tib, _7_MockFixedIntBlock_0.doc, _3_MockFixedIntBlock_0.pos, _2.fnm, _7_Pulsing40_0.tim, _3.fdx, _4_Pulsing40_0.tip, _4_Pulsing40_0.tim, _5_Pulsing40_0.prx, _0_MockFixedIntBlock_0.doc, _1.si, _6.si, _6.fnm, _0_Lucene40WithOrds_0.prx, _3_Lucene40WithOrds_0.prx, _5_MockFixedIntBlock_0.tii, _7_Pulsing40_0.tip, _3_nrm.cfe, _5.fdt, _3_MockFixedIntBlock_0.skp, _4_MockFixedIntBlock_0.tib, _1_Pulsing40_0.tip, _6_Pulsing40_0.frq, _1_Pulsing40_0.tim, _3_Lucene40WithOrds_0.tii, _1_MockFixedIntBlock_0.pyl, _6_Lucene40WithOrds_0.prx, _4.fnm, _4_nrm.cfe, _0_Pulsing40_0.prx, _7_Pulsing40_0.prx, _1.fnm, _2_MockFixedIntBlock_0.tii, _3_Lucene40WithOrds_0.tib, _4.fdx, _1_Pulsing40_0.frq, _3_MockFixedIntBlock_0.pyl, _2_MockFixedIntBlock_0.tib, _2_MockFixedIntBlock_0.pyl, _6_Pulsing40_0.tim, _1_Pulsing40_0.prx, _4_MockFixedIntBlock_0.tii, _2_MockFixedIntBlock_0.frq, _6_Pulsing40_0.tip, _2_Pulsing40_0.prx, _6_Lucene40WithOrds_0.frq, _0.fnm, _1_MockFixedIntBlock_0.frq, _5_MockFixedIntBlock_0.pyl, _4_MockFixedIntBlock_0.skp, _7_Lucene40WithOrds_0.tib, _0_MockFixedIntBlock_0.pos, _6_Lucene40WithOrds_0.tii, _2_Pulsing40_0.frq, _5.si, _5_Lucene40WithOrds_0.frq, _3_nrm.cfs, _7_Lucene40WithOrds_0.tii, _6_MockFixedIntBlock_0.pos, _5_MockFixedIntBlock_0.skp, _1_MockFixedIntBlock_0.skp, _4_Lucene40WithOrds_0.prx, _2_MockFixedIntBlock_0.pos, _6_Lucene40WithOrds_0.tib, _6_Pulsing40_0.prx, _4_MockFixedIntBlock_0.doc, _4_nrm.cfs, _1_MockFixedIntBlock_0.doc, _7_MockFixedIntBlock_0.frq, _4_Lucene40WithOrds_0.frq, _3_MockFixedIntBlock_0.doc, _7_MockFixedIntBlock_0.tib, _6_nrm.cfs, _0_MockFixedIntBlock_0.skp, _2_Lucene40WithOrds_0.prx, _7_nrm.cfs, _7_Lucene40WithOrds_0.prx, _7_MockFixedIntBlock_0.tii, _4_MockFixedIntBlock_0.pyl, _0.si, _1_nrm.cfs, _1_MockFixedIntBlock_0.tii, _5.fnm, _7_nrm.cfe, _6_nrm.cfe, _5_MockFixedIntBlock_0.pos, _3_MockFixedIntBlock_0.tib, _5_MockFixedIntBlock_0.doc, _7_MockFixedIntBlock_0.pyl, _4.si, _0_nrm.cfs, _3_Lucene40WithOrds_0.frq, _4.fdt, _1_nrm.cfe, _0_MockFixedIntBlock_0.frq, _2_Lucene40WithOrds_0.tii, _4_Pulsing40_0.frq, _3_Pulsing40_0.prx, _0_nrm.cfe, _5.fdx, _1_MockFixedIntBlock_0.tib, _0.fdx, _2_Lucene40WithOrds_0.tib, segments_3, _0.fdt, _3_MockFixedIntBlock_0.tii]
[junit4:junit4]   2> 23085 T444 C7 P58784 oasc.SolrDeletionPolicy.updateCommits newest commit = 3
[junit4:junit4]   2> 23218 T444 C7 P58784 oass.SolrIndexSearcher.<init> Opening Searcher@3770bf4d main
[junit4:junit4]   2> 23219 T444 C7 P58784 oasu.DirectUpdateHandler2.commit end_commit_flush
[junit4:junit4]   2> 23222 T454 oasc.SolrCore.registerSearcher [collection1] Registered new searcher Searcher@3770bf4d main{StandardDirectoryReader(segments_3:17 _0(4.0.0.2):C1 _1(4.0.0.2):C10 _2(4.0.0.2):C10 _3(4.0.0.2):C10 _4(4.0.0.2):C10 _5(4.0.0.2):C10 _6(4.0.0.2):C10 _7(4.0.0.2):C6)}
[junit4:junit4]   2> 23222 T444 C7 P58784 /update {waitSearcher=true&wt=javabin&commit=true&softCommit=false&version=2} {commit=} 0 1190
[junit4:junit4]   2> 23225 T462 C4 P31791 oasu.DirectUpdateHandler2.commit start commit{flags=0,_version_=0,optimize=false,openSearcher=true,waitSearcher=true,expungeDeletes=false,softCommit=false}
[junit4:junit4]   2> 23747 T462 C4 P31791 oasc.SolrDeletionPolicy.onCommit SolrDeletionPolicy.onCommit: commits:num=3
[junit4:junit4]   2> 		commit{dir=NRTCachingDirectory(org.apache.lucene.store.NIOFSDirectory@/usr/home/hudson/hudson-slave/workspace/Lucene-Solr-Tests-4.x-Java6/solr/build/solr-core/test/J1/org.apache.solr.cloud.BasicDistributedZk2Test-1347682455958/jetty1/index lockFactory=org.apache.lucene.store.NativeFSLockFactory@2b439bd9; maxCacheMB=48.0 maxMergeSizeMB=4.0),segFN=segments_1,generation=1,filenames=[segments_1]
[junit4:junit4]   2> 		commit{dir=NRTCachingDirectory(org.apache.lucene.store.NIOFSDirectory@/usr/home/hudson/hudson-slave/workspace/Lucene-Solr-Tests-4.x-Java6/solr/build/solr-core/test/J1/org.apache.solr.cloud.BasicDistributedZk2Test-1347682455958/jetty1/index lockFactory=org.apache.lucene.store.NativeFSLockFactory@2b439bd9; maxCacheMB=48.0 maxMergeSizeMB=4.0),segFN=segments_2,generation=2,filenames=[_0.fnm, _0_Pulsing40_0.tim, _0_MockFixedIntBlock_0.pos, _0_nrm.cfs, _0_MockFixedIntBlock_0.tib, _0_Pulsing40_0.prx, _0_Pulsing40_0.frq, _0_MockFixedIntBlock_0.frq, _0_Lucene40WithOrds_0.tii, _0_MockFixedIntBlock_0.skp, _0_MockFixedIntBlock_0.pyl, _0_Lucene40WithOrds_0.frq, _0_MockFixedIntBlock_0.doc, _0_MockFixedIntBlock_0.tii, _0_SimpleText_0.pst, _0_nrm.cfe, _0_Pulsing40_0.tip, segments_2, _0.fdx, _0_Lucene40WithOrds_0.prx, _0.si, _0_Lucene40WithOrds_0.tib, _0.fdt]
[junit4:junit4]   2> 		commit{dir=NRTCachingDirectory(org.apache.lucene.store.NIOFSDirectory@/usr/home/hudson/hudson-slave/workspace/Lucene-Solr-Tests-4.x-Java6/solr/build/solr-core/test/J1/org.apache.solr.cloud.BasicDistributedZk2Test-1347682455958/jetty1/index lockFactory=org.apache.lucene.store.NativeFSLockFactory@2b439bd9; maxCacheMB=48.0 maxMergeSizeMB=4.0),segFN=segments_3,generation=3,filenames=[_3.fdt, _0_MockFixedIntBlock_0.tib, _0_Pulsing40_0.frq, _0_Lucene40WithOrds_0.tii, _0_Lucene40WithOrds_0.frq, _1_Lucene40WithOrds_0.tib, _0_MockFixedIntBlock_0.tii, _0_SimpleText_0.pst, _1_Lucene40WithOrds_0.tii, _0_Lucene40WithOrds_0.tib, _1_Lucene40WithOrds_0.frq, _0_Pulsing40_0.tim, _4_MockFixedIntBlock_0.pos, _2.fdt, _3_Pulsing40_0.tip, _2.fdx, _3_Pulsing40_0.tim, _1.fdx, _1.fdt, _4_MockFixedIntBlock_0.frq, _2_MockFixedIntBlock_0.doc, _3.si, _1_MockFixedIntBlock_0.pos, _1_SimpleText_0.pst, _2.si, _3_Pulsing40_0.frq, _2_Pulsing40_0.tim, _4_Lucene40WithOrds_0.tib, _4_Lucene40WithOrds_0.tii, _3_MockFixedIntBlock_0.frq, _2_Pulsing40_0.tip, _1_Lucene40WithOrds_0.prx, _2_MockFixedIntBlock_0.skp, _3.fnm, _4_Pulsing40_0.prx, _2_nrm.cfe, _0_MockFixedIntBlock_0.pyl, _0_Pulsing40_0.tip, _2_nrm.cfs, _2_Lucene40WithOrds_0.frq, _3_MockFixedIntBlock_0.pos, _2.fnm, _3.fdx, _4_Pulsing40_0.tip, _4_Pulsing40_0.tim, _0_MockFixedIntBlock_0.doc, _1.si, _0_Lucene40WithOrds_0.prx, _3_Lucene40WithOrds_0.prx, _3_nrm.cfe, _3_MockFixedIntBlock_0.skp, _4_MockFixedIntBlock_0.tib, _1_Pulsing40_0.tip, _1_Pulsing40_0.tim, _3_Lucene40WithOrds_0.tii, _1_MockFixedIntBlock_0.pyl, _4.fnm, _4_nrm.cfe, _0_Pulsing40_0.prx, _1.fnm, _2_MockFixedIntBlock_0.tii, _3_Lucene40WithOrds_0.tib, _4.fdx, _1_Pulsing40_0.frq, _3_MockFixedIntBlock_0.pyl, _2_MockFixedIntBlock_0.tib, _2_MockFixedIntBlock_0.pyl, _1_Pulsing40_0.prx, _4_MockFixedIntBlock_0.tii, _2_MockFixedIntBlock_0.frq, _2_Pulsing40_0.prx, _0.fnm, _1_MockFixedIntBlock_0.frq, _4_MockFixedIntBlock_0.skp, _0_MockFixedIntBlock_0.pos, _2_Pulsing40_0.frq, _3_nrm.cfs, _1_MockFixedIntBlock_0.skp, _4_Lucene40WithOrds_0.prx, _2_MockFixedIntBlock_0.pos, _4_MockFixedIntBlock_0.doc, _4_nrm.cfs, _1_MockFixedIntBlock_0.doc, _4_Lucene40WithOrds_0.frq, _3_MockFixedIntBlock_0.doc, _0_MockFixedIntBlock_0.skp, _2_Lucene40WithOrds_0.prx, _4_MockFixedIntBlock_0.pyl, _0.si, _1_nrm.cfs, _1_MockFixedIntBlock_0.tii, _3_MockFixedIntBlock_0.tib, _0_nrm.cfs, _3_Lucene40WithOrds_0.frq, _4.fdt, _4.si, _1_nrm.cfe, _0_MockFixedIntBlock_0.frq, _2_Lucene40WithOrds_0.tii, _4_Pulsing40_0.frq, _3_Pulsing40_0.prx, _0_nrm.cfe, _1_MockFixedIntBlock_0.tib, _0.fdx, _2_Lucene40WithOrds_0.tib, segments_3, _0.fdt, _3_MockFixedIntBlock_0.tii]
[junit4:junit4]   2> 23748 T462 C4 P31791 oasc.SolrDeletionPolicy.updateCommits newest commit = 3
[junit4:junit4]   2> 23810 T462 C4 P31791 oass.SolrIndexSearcher.<init> Opening Searcher@e046ccf main
[junit4:junit4]   2> 23811 T462 C4 P31791 oasu.DirectUpdateHandler2.commit end_commit_flush
[junit4:junit4]   2> 23813 T466 oasc.SolrCore.registerSearcher [collection1] Registered new searcher Searcher@e046ccf main{StandardDirectoryReader(segments_3:11 _0(4.0.0.2):C1 _1(4.0.0.2):C10 _2(4.0.0.2):C10 _3(4.0.0.2):C10 _4(4.0.0.2):C1)}
[junit4:junit4]   2> 23814 T462 C4 P31791 oasu.SolrCmdDistributor.distribCommit Distrib commit to:[StdNode: http://127.0.0.1:25929/solr/collection1/, StdNode: http://127.0.0.1:31395/solr/collection1/, StdNode: http://127.0.0.1:30247/solr/collection1/]
[junit4:junit4]   2> 23818 T474 C6 P31395 oasu.DirectUpdateHandler2.co

[...truncated too long message...]

nit4:junit4]   1>               "roles":null,
[junit4:junit4]   1>               "state":"recovering",
[junit4:junit4]   1>               "core":"collection1",
[junit4:junit4]   1>               "collection":"collection1",
[junit4:junit4]   1>               "node_name":"127.0.0.1:30247_solr",
[junit4:junit4]   1>               "base_url":"http://127.0.0.1:30247/solr"}}},
[junit4:junit4]   1>         "control_collection":{"control_shard":{"127.0.0.1:58784_solr_collection1":{
[junit4:junit4]   1>               "shard":"control_shard",
[junit4:junit4]   1>               "leader":"true",
[junit4:junit4]   1>               "roles":null,
[junit4:junit4]   1>               "state":"active",
[junit4:junit4]   1>               "core":"collection1",
[junit4:junit4]   1>               "collection":"control_collection",
[junit4:junit4]   1>               "node_name":"127.0.0.1:58784_solr",
[junit4:junit4]   1>               "base_url":"http://127.0.0.1:58784/solr"}}}}
[junit4:junit4]   1>  /zookeeper (1)
[junit4:junit4]   1>  DATA:
[junit4:junit4]   1>      
[junit4:junit4]   1> 
[junit4:junit4]   2> NOTE: reproduce with: ant test  -Dtestcase=BasicDistributedZk2Test -Dtests.method=testDistribSearch -Dtests.seed=4BFC51A35AEB7673 -Dtests.multiplier=3 -Dtests.slow=true -Dtests.locale=sr -Dtests.timezone=Australia/Perth -Dtests.file.encoding=ISO8859-1
[junit4:junit4] FAILURE  193s J1 | BasicDistributedZk2Test.testDistribSearch <<<
[junit4:junit4]    > Throwable #1: java.lang.AssertionError: Shard still reported as live in zk
[junit4:junit4]    > 	at __randomizedtesting.SeedInfo.seed([4BFC51A35AEB7673:CA1ADFBB2DB4164F]:0)
[junit4:junit4]    > 	at org.junit.Assert.fail(Assert.java:93)
[junit4:junit4]    > 	at org.apache.solr.cloud.AbstractFullDistribZkTestBase.waitToSeeNotLive(AbstractFullDistribZkTestBase.java:1215)
[junit4:junit4]    > 	at org.apache.solr.cloud.BasicDistributedZk2Test.brindDownShardIndexSomeDocsAndRecover(BasicDistributedZk2Test.java:190)
[junit4:junit4]    > 	at org.apache.solr.cloud.BasicDistributedZk2Test.doTest(BasicDistributedZk2Test.java:83)
[junit4:junit4]    > 	at org.apache.solr.BaseDistributedSearchTestCase.testDistribSearch(BaseDistributedSearchTestCase.java:691)
[junit4:junit4]    > 	at sun.reflect.NativeMethodAccessorImpl.invoke0(Native Method)
[junit4:junit4]    > 	at sun.reflect.NativeMethodAccessorImpl.invoke(NativeMethodAccessorImpl.java:57)
[junit4:junit4]    > 	at sun.reflect.DelegatingMethodAccessorImpl.invoke(DelegatingMethodAccessorImpl.java:43)
[junit4:junit4]    > 	at java.lang.reflect.Method.invoke(Method.java:616)
[junit4:junit4]    > 	at com.carrotsearch.randomizedtesting.RandomizedRunner.invoke(RandomizedRunner.java:1559)
[junit4:junit4]    > 	at com.carrotsearch.randomizedtesting.RandomizedRunner.access$600(RandomizedRunner.java:79)
[junit4:junit4]    > 	at com.carrotsearch.randomizedtesting.RandomizedRunner$6.evaluate(RandomizedRunner.java:737)
[junit4:junit4]    > 	at com.carrotsearch.randomizedtesting.RandomizedRunner$7.evaluate(RandomizedRunner.java:773)
[junit4:junit4]    > 	at com.carrotsearch.randomizedtesting.RandomizedRunner$8.evaluate(RandomizedRunner.java:787)
[junit4:junit4]    > 	at com.carrotsearch.randomizedtesting.rules.SystemPropertiesRestoreRule$1.evaluate(SystemPropertiesRestoreRule.java:53)
[junit4:junit4]    > 	at org.apache.lucene.util.TestRuleSetupTeardownChained$1.evaluate(TestRuleSetupTeardownChained.java:50)
[junit4:junit4]    > 	at org.apache.lucene.util.TestRuleFieldCacheSanity$1.evaluate(TestRuleFieldCacheSanity.java:51)
[junit4:junit4]    > 	at org.apache.lucene.util.AbstractBeforeAfterRule$1.evaluate(AbstractBeforeAfterRule.java:45)
[junit4:junit4]    > 	at com.carrotsearch.randomizedtesting.rules.SystemPropertiesInvariantRule$1.evaluate(SystemPropertiesInvariantRule.java:55)
[junit4:junit4]    > 	at org.apache.lucene.util.TestRuleThreadAndTestName$1.evaluate(TestRuleThreadAndTestName.java:48)
[junit4:junit4]    > 	at org.apache.lucene.util.TestRuleIgnoreAfterMaxFailures$1.evaluate(TestRuleIgnoreAfterMaxFailures.java:70)
[junit4:junit4]    > 	at org.apache.lucene.util.TestRuleMarkFailure$1.evaluate(TestRuleMarkFailure.java:48)
[junit4:junit4]    > 	at com.carrotsearch.randomizedtesting.rules.StatementAdapter.evaluate(StatementAdapter.java:36)
[junit4:junit4]    > 	at com.carrotsearch.randomizedtesting.ThreadLeakControl$StatementRunner.run(ThreadLeakControl.java:358)
[junit4:junit4]    > 	at com.carrotsearch.randomizedtesting.ThreadLeakControl.forkTimeoutingTask(ThreadLeakControl.java:782)
[junit4:junit4]    > 	at com.carrotsearch.randomizedtesting.ThreadLeakControl$3.evaluate(ThreadLeakControl.java:442)
[junit4:junit4]    > 	at com.carrotsearch.randomizedtesting.RandomizedRunner.runSingleTest(RandomizedRunner.java:746)
[junit4:junit4]    > 	at com.carrotsearch.randomizedtesting.RandomizedRunner$3.evaluate(RandomizedRunner.java:648)
[junit4:junit4]    > 	at com.carrotsearch.randomizedtesting.RandomizedRunner$4.evaluate(RandomizedRunner.java:682)
[junit4:junit4]    > 	at com.carrotsearch.randomizedtesting.RandomizedRunner$5.evaluate(RandomizedRunner.java:693)
[junit4:junit4]    > 	at com.carrotsearch.randomizedtesting.rules.StatementAdapter.evaluate(StatementAdapter.java:36)
[junit4:junit4]    > 	at com.carrotsearch.randomizedtesting.rules.SystemPropertiesRestoreRule$1.evaluate(SystemPropertiesRestoreRule.java:53)
[junit4:junit4]    > 	at org.apache.lucene.util.AbstractBeforeAfterRule$1.evaluate(AbstractBeforeAfterRule.java:45)
[junit4:junit4]    > 	at org.apache.lucene.util.TestRuleStoreClassName$1.evaluate(TestRuleStoreClassName.java:42)
[junit4:junit4]    > 	at com.carrotsearch.randomizedtesting.rules.SystemPropertiesInvariantRule$1.evaluate(SystemPropertiesInvariantRule.java:55)
[junit4:junit4]    > 	at com.carrotsearch.randomizedtesting.rules.NoShadowingOrOverridesOnMethodsRule$1.evaluate(NoShadowingOrOverridesOnMethodsRule.java:39)
[junit4:junit4]    > 	at com.carrotsearch.randomizedtesting.rules.NoShadowingOrOverridesOnMethodsRule$1.evaluate(NoShadowingOrOverridesOnMethodsRule.java:39)
[junit4:junit4]    > 	at com.carrotsearch.randomizedtesting.rules.StatementAdapter.evaluate(StatementAdapter.java:36)
[junit4:junit4]    > 	at org.apache.lucene.util.TestRuleAssertionsRequired$1.evaluate(TestRuleAssertionsRequired.java:43)
[junit4:junit4]    > 	at org.apache.lucene.util.TestRuleMarkFailure$1.evaluate(TestRuleMarkFailure.java:48)
[junit4:junit4]    > 	at org.apache.lucene.util.TestRuleIgnoreAfterMaxFailures$1.evaluate(TestRuleIgnoreAfterMaxFailures.java:70)
[junit4:junit4]    > 	at org.apache.lucene.util.TestRuleIgnoreTestSuites$1.evaluate(TestRuleIgnoreTestSuites.java:55)
[junit4:junit4]    > 	at com.carrotsearch.randomizedtesting.rules.StatementAdapter.evaluate(StatementAdapter.java:36)
[junit4:junit4]    > 	at com.carrotsearch.randomizedtesting.ThreadLeakControl$StatementRunner.run(ThreadLeakControl.java:358)
[junit4:junit4]    > 	at java.lang.Thread.run(Thread.java:679)
[junit4:junit4]   2> 192981 T430 oas.SolrTestCaseJ4.deleteCore ###deleteCore
[junit4:junit4]   2> NOTE: test params are: codec=Lucene40: {n_f1=PostingsFormat(name=Lucene40WithOrds), foo_b=PostingsFormat(name=SimpleText), foo_d=MockFixedIntBlock(blockSize=667), foo_f=PostingsFormat(name=SimpleText), n_tl1=PostingsFormat(name=Lucene40WithOrds), n_d1=Pulsing40(freqCutoff=14 minBlockSize=86 maxBlockSize=233), rnd_b=MockFixedIntBlock(blockSize=667), intDefault=PostingsFormat(name=Lucene40WithOrds), n_td1=PostingsFormat(name=Lucene40WithOrds), id=MockFixedIntBlock(blockSize=667), timestamp=Pulsing40(freqCutoff=14 minBlockSize=86 maxBlockSize=233), range_facet_sl=MockFixedIntBlock(blockSize=667), range_facet_si=Pulsing40(freqCutoff=14 minBlockSize=86 maxBlockSize=233), oddField_s=MockFixedIntBlock(blockSize=667), multiDefault=Pulsing40(freqCutoff=14 minBlockSize=86 maxBlockSize=233), n_tf1=Pulsing40(freqCutoff=14 minBlockSize=86 maxBlockSize=233), n_dt1=PostingsFormat(name=Lucene40WithOrds), n_ti1=MockFixedIntBlock(blockSize=667), range_facet_l=Pulsing40(freqCutoff=14 minBlockSize=86 maxBlockSize=233), text=PostingsFormat(name=SimpleText), _version_=PostingsFormat(name=Lucene40WithOrds), SubjectTerms_mfacet=PostingsFormat(name=Lucene40WithOrds), a_t=Pulsing40(freqCutoff=14 minBlockSize=86 maxBlockSize=233), n_tdt1=PostingsFormat(name=Lucene40WithOrds), other_tl1=PostingsFormat(name=Lucene40WithOrds), n_l1=Pulsing40(freqCutoff=14 minBlockSize=86 maxBlockSize=233), a_si=PostingsFormat(name=Lucene40WithOrds)}, sim=RandomSimilarityProvider(queryNorm=false,coord=no): {}, locale=sr, timezone=Australia/Perth
[junit4:junit4]   2> NOTE: FreeBSD 9.0-RELEASE amd64/Sun Microsystems Inc. 1.6.0_32 (64-bit)/cpus=16,threads=1,free=55043080,total=126681088
[junit4:junit4]   2> NOTE: All tests run in this JVM: [OverseerTest, TestMultiCoreConfBootstrap, SolrIndexConfigTest, HighlighterTest, EchoParamsTest, TestCollationKeyRangeQueries, BasicDistributedZk2Test]
[junit4:junit4] Completed on J1 in 193.08s, 1 test, 1 failure <<< FAILURES!

[...truncated 655 lines...]
BUILD FAILED
/usr/home/hudson/hudson-slave/workspace/Lucene-Solr-Tests-4.x-Java6/build.xml:29: The following error occurred while executing this line:
/usr/home/hudson/hudson-slave/workspace/Lucene-Solr-Tests-4.x-Java6/solr/build.xml:146: The following error occurred while executing this line:
/usr/home/hudson/hudson-slave/workspace/Lucene-Solr-Tests-4.x-Java6/lucene/module-build.xml:63: The following error occurred while executing this line:
/usr/home/hudson/hudson-slave/workspace/Lucene-Solr-Tests-4.x-Java6/lucene/common-build.xml:1133: The following error occurred while executing this line:
/usr/home/hudson/hudson-slave/workspace/Lucene-Solr-Tests-4.x-Java6/lucene/common-build.xml:810: There were test failures: 229 suites, 927 tests, 1 failure, 6 ignored (1 assumption)

Total time: 33 minutes 57 seconds
Build step 'Invoke Ant' marked build as failure
Recording test results
Email was triggered for: Failure
Sending email for trigger: Failure



Mime
View raw message