lucene-dev mailing list archives

Site index · List index
Message view « Date » · « Thread »
Top « Date » · « Thread »
From Apache Jenkins Server <jenk...@builds.apache.org>
Subject [JENKINS-MAVEN] Lucene-Solr-Maven-trunk #622: POMs out of sync
Date Sat, 22 Sep 2012 16:09:03 GMT
Build: https://builds.apache.org/job/Lucene-Solr-Maven-trunk/622/

1 tests failed.
REGRESSION:  org.apache.solr.cloud.BasicDistributedZk2Test.testDistribSearch

Error Message:
Shard still reported as live in zk

Stack Trace:
java.lang.AssertionError: Shard still reported as live in zk
	at __randomizedtesting.SeedInfo.seed([9A13519CD9ADDCD:8847BB01BAC5BDF1]:0)
	at org.junit.Assert.fail(Assert.java:93)
	at org.apache.solr.cloud.AbstractFullDistribZkTestBase.waitToSeeNotLive(AbstractFullDistribZkTestBase.java:1225)
	at org.apache.solr.cloud.BasicDistributedZk2Test.brindDownShardIndexSomeDocsAndRecover(BasicDistributedZk2Test.java:190)
	at org.apache.solr.cloud.BasicDistributedZk2Test.doTest(BasicDistributedZk2Test.java:83)
	at org.apache.solr.BaseDistributedSearchTestCase.testDistribSearch(BaseDistributedSearchTestCase.java:695)
	at sun.reflect.NativeMethodAccessorImpl.invoke0(Native Method)
	at sun.reflect.NativeMethodAccessorImpl.invoke(NativeMethodAccessorImpl.java:57)
	at sun.reflect.DelegatingMethodAccessorImpl.invoke(DelegatingMethodAccessorImpl.java:43)
	at java.lang.reflect.Method.invoke(Method.java:616)
	at com.carrotsearch.randomizedtesting.RandomizedRunner.invoke(RandomizedRunner.java:1559)
	at com.carrotsearch.randomizedtesting.RandomizedRunner.access$600(RandomizedRunner.java:79)
	at com.carrotsearch.randomizedtesting.RandomizedRunner$6.evaluate(RandomizedRunner.java:737)
	at com.carrotsearch.randomizedtesting.RandomizedRunner$7.evaluate(RandomizedRunner.java:773)
	at com.carrotsearch.randomizedtesting.RandomizedRunner$8.evaluate(RandomizedRunner.java:787)
	at com.carrotsearch.randomizedtesting.rules.SystemPropertiesRestoreRule$1.evaluate(SystemPropertiesRestoreRule.java:53)
	at org.apache.lucene.util.TestRuleSetupTeardownChained$1.evaluate(TestRuleSetupTeardownChained.java:50)
	at org.apache.lucene.util.TestRuleFieldCacheSanity$1.evaluate(TestRuleFieldCacheSanity.java:51)
	at org.apache.lucene.util.AbstractBeforeAfterRule$1.evaluate(AbstractBeforeAfterRule.java:45)
	at com.carrotsearch.randomizedtesting.rules.SystemPropertiesInvariantRule$1.evaluate(SystemPropertiesInvariantRule.java:55)
	at org.apache.lucene.util.TestRuleThreadAndTestName$1.evaluate(TestRuleThreadAndTestName.java:48)
	at org.apache.lucene.util.TestRuleIgnoreAfterMaxFailures$1.evaluate(TestRuleIgnoreAfterMaxFailures.java:70)
	at org.apache.lucene.util.TestRuleMarkFailure$1.evaluate(TestRuleMarkFailure.java:48)
	at com.carrotsearch.randomizedtesting.rules.StatementAdapter.evaluate(StatementAdapter.java:36)
	at com.carrotsearch.randomizedtesting.ThreadLeakControl$StatementRunner.run(ThreadLeakControl.java:358)
	at com.carrotsearch.randomizedtesting.ThreadLeakControl.forkTimeoutingTask(ThreadLeakControl.java:782)
	at com.carrotsearch.randomizedtesting.ThreadLeakControl$3.evaluate(ThreadLeakControl.java:442)
	at com.carrotsearch.randomizedtesting.RandomizedRunner.runSingleTest(RandomizedRunner.java:746)
	at com.carrotsearch.randomizedtesting.RandomizedRunner$3.evaluate(RandomizedRunner.java:648)
	at com.carrotsearch.randomizedtesting.RandomizedRunner$4.evaluate(RandomizedRunner.java:682)
	at com.carrotsearch.randomizedtesting.RandomizedRunner$5.evaluate(RandomizedRunner.java:693)
	at com.carrotsearch.randomizedtesting.rules.StatementAdapter.evaluate(StatementAdapter.java:36)
	at com.carrotsearch.randomizedtesting.rules.SystemPropertiesRestoreRule$1.evaluate(SystemPropertiesRestoreRule.java:53)
	at org.apache.lucene.util.AbstractBeforeAfterRule$1.evaluate(AbstractBeforeAfterRule.java:45)
	at org.apache.lucene.util.TestRuleStoreClassName$1.evaluate(TestRuleStoreClassName.java:42)
	at com.carrotsearch.randomizedtesting.rules.SystemPropertiesInvariantRule$1.evaluate(SystemPropertiesInvariantRule.java:55)
	at com.carrotsearch.randomizedtesting.rules.NoShadowingOrOverridesOnMethodsRule$1.evaluate(NoShadowingOrOverridesOnMethodsRule.java:39)
	at com.carrotsearch.randomizedtesting.rules.NoShadowingOrOverridesOnMethodsRule$1.evaluate(NoShadowingOrOverridesOnMethodsRule.java:39)
	at com.carrotsearch.randomizedtesting.rules.StatementAdapter.evaluate(StatementAdapter.java:36)
	at org.apache.lucene.util.TestRuleAssertionsRequired$1.evaluate(TestRuleAssertionsRequired.java:43)
	at org.apache.lucene.util.TestRuleMarkFailure$1.evaluate(TestRuleMarkFailure.java:48)
	at org.apache.lucene.util.TestRuleIgnoreAfterMaxFailures$1.evaluate(TestRuleIgnoreAfterMaxFailures.java:70)
	at org.apache.lucene.util.TestRuleIgnoreTestSuites$1.evaluate(TestRuleIgnoreTestSuites.java:55)
	at com.carrotsearch.randomizedtesting.rules.StatementAdapter.evaluate(StatementAdapter.java:36)
	at com.carrotsearch.randomizedtesting.ThreadLeakControl$StatementRunner.run(ThreadLeakControl.java:358)
	at java.lang.Thread.run(Thread.java:679)




Build Log:
[...truncated 3350 lines...]
      [mvn] 266 T3 oasc.SolrCore.finalize SEVERE REFCOUNT ERROR: unreferenced org.apache.solr.core.SolrCore@766b0524 (collection1) has a reference count of 1
      [mvn] Creating dataDir: /usr/home/hudson/hudson-slave/workspace/Lucene-Solr-Maven-trunk/maven-build/solr/core/src/test/target/test/./solrtest-BadIndexSchemaTest-1348328744210
      [mvn] 369 T208 oass.IndexSchema.readSchema SEVERE uniqueKey field (id) can not be the dest of a copyField (src=XXX)
      [mvn] Creating dataDir: /usr/home/hudson/hudson-slave/workspace/Lucene-Solr-Maven-trunk/maven-build/solr/core/src/test/target/test/./solrtest-BadIndexSchemaTest-1348328744277
      [mvn] 435 T208 oass.IndexSchema.readSchema SEVERE uniqueKey field (null) can not be configured with a default value (XXX)
      [mvn] Creating dataDir: /usr/home/hudson/hudson-slave/workspace/Lucene-Solr-Maven-trunk/maven-build/solr/core/src/test/target/test/./solrtest-BadIndexSchemaTest-1348328744343
      [mvn] 502 T208 oass.IndexSchema.readSchema SEVERE uniqueKey field (null) can not be configured to be multivalued
      [mvn] Creating dataDir: /usr/home/hudson/hudson-slave/workspace/Lucene-Solr-Maven-trunk/maven-build/solr/core/src/test/target/test/./solrtest-BadIndexSchemaTest-1348328744413
      [mvn] Creating dataDir: /usr/home/hudson/hudson-slave/workspace/Lucene-Solr-Maven-trunk/maven-build/solr/core/src/test/target/test/./solrtest-BadIndexSchemaTest-1348328744485
      [mvn] 654 T208 oass.IndexSchema.readSchema SEVERE FieldType 'sim1' is configured with a similarity, but the global similarity does not support it: class org.apache.solr.search.similarities.DefaultSimilarityFactory
      [mvn] Creating dataDir: /usr/home/hudson/hudson-slave/workspace/Lucene-Solr-Maven-trunk/maven-build/solr/core/src/test/target/test/./solrtest-BadIndexSchemaTest-1348328744565
      [mvn] Creating dataDir: /usr/home/hudson/hudson-slave/workspace/Lucene-Solr-Maven-trunk/maven-build/solr/core/src/test/target/test/./solrtest-BadIndexSchemaTest-1348328744634
      [mvn] Creating dataDir: /usr/home/hudson/hudson-slave/workspace/Lucene-Solr-Maven-trunk/maven-build/solr/core/src/test/target/test/./solrtest-BadIndexSchemaTest-1348328744706
      [mvn] Creating dataDir: /usr/home/hudson/hudson-slave/workspace/Lucene-Solr-Maven-trunk/maven-build/solr/core/src/test/target/test/./solrtest-BadIndexSchemaTest-1348328744780
      [mvn] Creating dataDir: /usr/home/hudson/hudson-slave/workspace/Lucene-Solr-Maven-trunk/maven-build/solr/core/src/test/target/test/./solrtest-BadIndexSchemaTest-1348328744861
      [mvn] Creating dataDir: /usr/home/hudson/hudson-slave/workspace/Lucene-Solr-Maven-trunk/maven-build/solr/core/src/test/target/test/./solrtest-BadIndexSchemaTest-1348328744925
      [mvn] Creating dataDir: /usr/home/hudson/hudson-slave/workspace/Lucene-Solr-Maven-trunk/maven-build/solr/core/src/test/target/test/./solrtest-BadIndexSchemaTest-1348328744997
      [mvn] Creating dataDir: /usr/home/hudson/hudson-slave/workspace/Lucene-Solr-Maven-trunk/maven-build/solr/core/src/test/target/test/./solrtest-BadIndexSchemaTest-1348328745096
      [mvn] Creating dataDir: /usr/home/hudson/hudson-slave/workspace/Lucene-Solr-Maven-trunk/maven-build/solr/core/src/test/target/test/./solrtest-BadIndexSchemaTest-1348328745180
      [mvn] Tests run: 10, Failures: 0, Errors: 0, Skipped: 0, Time elapsed: 1.39 sec
      [mvn] Running org.apache.solr.search.TestElisionMultitermQuery
      [mvn] Creating dataDir: /usr/home/hudson/hudson-slave/workspace/Lucene-Solr-Maven-trunk/maven-build/solr/core/src/test/target/test/./solrtest-TestElisionMultitermQuery-1348328745298
      [mvn] Tests run: 1, Failures: 0, Errors: 0, Skipped: 0, Time elapsed: 0.248 sec
      [mvn] Running org.apache.solr.update.SolrIndexConfigTest
      [mvn] Tests run: 2, Failures: 0, Errors: 0, Skipped: 0, Time elapsed: 0.392 sec
      [mvn] Running org.apache.solr.handler.PingRequestHandlerTest
      [mvn] Creating dataDir: /usr/home/hudson/hudson-slave/workspace/Lucene-Solr-Maven-trunk/maven-build/solr/core/src/test/target/test/./solrtest-PingRequestHandlerTest-1348328745942
      [mvn] Tests run: 5, Failures: 0, Errors: 0, Skipped: 0, Time elapsed: 0.541 sec
      [mvn] Running org.apache.solr.request.TestRemoteStreaming
      [mvn] Creating dataDir: /usr/home/hudson/hudson-slave/workspace/Lucene-Solr-Maven-trunk/maven-build/solr/core/src/test/target/test/./solrtest-TestRemoteStreaming-1348328746484
      [mvn] Tests run: 4, Failures: 0, Errors: 0, Skipped: 0, Time elapsed: 0.704 sec
      [mvn] Running org.apache.solr.update.AutoCommitTest
      [mvn] Tests run: 3, Failures: 0, Errors: 0, Skipped: 0, Time elapsed: 8.69 sec
      [mvn] Running org.apache.solr.spelling.DirectSolrSpellCheckerTest
      [mvn] Creating dataDir: /usr/home/hudson/hudson-slave/workspace/Lucene-Solr-Maven-trunk/maven-build/solr/core/src/test/target/test/./solrtest-DirectSolrSpellCheckerTest-1348328755880
      [mvn] Tests run: 2, Failures: 0, Errors: 0, Skipped: 0, Time elapsed: 1.023 sec
      [mvn] Running org.apache.solr.servlet.SolrRequestParserTest
      [mvn] Creating dataDir: /usr/home/hudson/hudson-slave/workspace/Lucene-Solr-Maven-trunk/maven-build/solr/core/src/test/target/test/./solrtest-SolrRequestParserTest-1348328756899
      [mvn] Tests run: 4, Failures: 0, Errors: 0, Skipped: 0, Time elapsed: 1.13 sec
      [mvn] Running org.apache.solr.handler.component.BadComponentTest
      [mvn] Creating dataDir: /usr/home/hudson/hudson-slave/workspace/Lucene-Solr-Maven-trunk/maven-build/solr/core/src/test/target/test/./solrtest-BadComponentTest-1348328758036
      [mvn] Tests run: 1, Failures: 0, Errors: 0, Skipped: 0, Time elapsed: 0.377 sec
      [mvn] Running org.apache.solr.core.TestSolrDeletionPolicy2
      [mvn] Creating dataDir: /usr/home/hudson/hudson-slave/workspace/Lucene-Solr-Maven-trunk/maven-build/solr/core/src/test/target/test/./solrtest-TestSolrDeletionPolicy2-1348328758415
      [mvn] Tests run: 1, Failures: 0, Errors: 0, Skipped: 0, Time elapsed: 0.649 sec
      [mvn] Running org.apache.solr.spelling.TestSuggestSpellingConverter
      [mvn] Tests run: 2, Failures: 0, Errors: 0, Skipped: 0, Time elapsed: 0.057 sec
      [mvn] Running org.apache.solr.request.SimpleFacetsTest
      [mvn] Creating dataDir: /usr/home/hudson/hudson-slave/workspace/Lucene-Solr-Maven-trunk/maven-build/solr/core/src/test/target/test/./solrtest-SimpleFacetsTest-1348328759177
      [mvn] ASYNC  NEW_CORE C1 name=collection1 org.apache.solr.core.SolrCore@3bd78ffd
      [mvn] 3360 T254 C1 oasc.SolrException.log SEVERE org.apache.solr.common.SolrException: range facet infinite loop: gap is either zero, or too small relative start/end and caused underflow: 23.0 + 0 = 23.0
      [mvn] 		at org.apache.solr.request.SimpleFacets.getFacetRangeCounts(SimpleFacets.java:1122)
      [mvn] 		at org.apache.solr.request.SimpleFacets.getFacetRangeCounts(SimpleFacets.java:1074)
      [mvn] 		at org.apache.solr.request.SimpleFacets.getFacetRangeCounts(SimpleFacets.java:1018)
      [mvn] 		at org.apache.solr.request.SimpleFacets.getFacetCounts(SimpleFacets.java:208)
      [mvn] 		at org.apache.solr.handler.component.FacetComponent.process(FacetComponent.java:87)
      [mvn] 		at org.apache.solr.handler.component.SearchHandler.handleRequestBody(SearchHandler.java:206)
      [mvn] 		at org.apache.solr.handler.RequestHandlerBase.handleRequest(RequestHandlerBase.java:129)
      [mvn] 		at org.apache.solr.core.SolrCore.execute(SolrCore.java:1701)
      [mvn] 		at org.apache.solr.util.TestHarness.query(TestHarness.java:364)
      [mvn] 		at org.apache.solr.util.TestHarness.query(TestHarness.java:346)
      [mvn] 		at org.apache.solr.SolrTestCaseJ4.assertQEx(SolrTestCaseJ4.java:618)
      [mvn] 		at org.apache.solr.request.SimpleFacetsTest.testRangeFacetInfiniteLoopDetection(SimpleFacetsTest.java:2052)
      [mvn] 		at sun.reflect.NativeMethodAccessorImpl.invoke0(Native Method)
      [mvn] 		at sun.reflect.NativeMethodAccessorImpl.invoke(NativeMethodAccessorImpl.java:57)
      [mvn] 		at sun.reflect.DelegatingMethodAccessorImpl.invoke(DelegatingMethodAccessorImpl.java:43)
      [mvn] 		at java.lang.reflect.Method.invoke(Method.java:616)
      [mvn] 		at com.carrotsearch.randomizedtesting.RandomizedRunner.invoke(RandomizedRunner.java:1559)
      [mvn] 		at com.carrotsearch.randomizedtesting.RandomizedRunner.access$600(RandomizedRunner.java:79)
      [mvn] 		at com.carrotsearch.randomizedtesting.RandomizedRunner$6.evaluate(RandomizedRunner.java:737)
      [mvn] 		at com.carrotsearch.randomizedtesting.RandomizedRunner$7.evaluate(RandomizedRunner.java:773)
      [mvn] 		at com.carrotsearch.randomizedtesting.RandomizedRunner$8.evaluate(RandomizedRunner.java:787)
      [mvn] 		at com.carrotsearch.randomizedtesting.rules.SystemPropertiesRestoreRule$1.evaluate(SystemPropertiesRestoreRule.java:53)
      [mvn] 		at org.apache.lucene.util.TestRuleSetupTeardownChained$1.evaluate(TestRuleSetupTeardownChained.java:50)
      [mvn] 		at org.apache.lucene.util.TestRuleFieldCacheSanity$1.evaluate(TestRuleFieldCacheSanity.java:51)
      [mvn] 		at org.apache.lucene.util.AbstractBeforeAfterRule$1.evaluate(AbstractBeforeAfterRule.java:45)
      [mvn] 		at com.carrotsearch.randomizedtesting.rules.SystemPropertiesInvariantRule$1.evaluate(SystemPropertiesInvariantRule.java:55)
      [mvn] 		at org.apache.lucene.util.TestRuleThreadAndTestName$1.evaluate(TestRuleThreadAndTestName.java:48)
      [mvn] 		at org.apache.lucene.util.TestRuleIgnoreAfterMaxFailures$1.evaluate(TestRuleIgnoreAfterMaxFailures.java:70)
      [mvn] 		at org.apache.lucene.util.TestRuleMarkFailure$1.evaluate(TestRuleMarkFailure.java:48)
      [mvn] 		at com.carrotsearch.randomizedtesting.rules.StatementAdapter.evaluate(StatementAdapter.java:36)
      [mvn] 		at com.carrotsearch.randomizedtesting.ThreadLeakControl$StatementRunner.run(ThreadLeakControl.java:358)
      [mvn] 		at com.carrotsearch.randomizedtesting.ThreadLeakControl.forkTimeoutingTask(ThreadLeakControl.java:782)
      [mvn] 		at com.carrotsearch.randomizedtesting.ThreadLeakControl$3.evaluate(ThreadLeakControl.java:442)
      [mvn] 		at com.carrotsearch.randomizedtesting.RandomizedRunner.runSingleTest(RandomizedRunner.java:746)
      [mvn] 		at com.carrotsearch.randomizedtesting.RandomizedRunner$3.evaluate(RandomizedRunner.java:648)
      [mvn] 		at com.carrotsearch.randomizedtesting.RandomizedRunner$4.evaluate(RandomizedRunner.java:682)
      [mvn] 		at com.carrotsearch.randomizedtesting.RandomizedRunner$5.evaluate(RandomizedRunner.java:693)
      [mvn] 		at com.carrotsearch.randomizedtesting.rules.StatementAdapter.evaluate(StatementAdapter.java:36)
      [mvn] 		at com.carrotsearch.randomizedtesting.rules.SystemPropertiesRestoreRule$1.evaluate(SystemPropertiesRestoreRule.java:53)
      [mvn] 		at org.apache.lucene.util.AbstractBeforeAfterRule$1.evaluate(AbstractBeforeAfterRule.java:45)
      [mvn] 		at org.apache.lucene.util.TestRuleStoreClassName$1.evaluate(TestRuleStoreClassName.java:42)
      [mvn] 		at com.carrotsearch.randomizedtesting.rules.SystemPropertiesInvariantRule$1.evaluate(SystemPropertiesInvariantRule.java:55)
      [mvn] 		at com.carrotsearch.randomizedtesting.rules.NoShadowingOrOverridesOnMethodsRule$1.evaluate(NoShadowingOrOverridesOnMethodsRule.java:39)
      [mvn] 		at com.carrotsearch.randomizedtesting.rules.NoShadowingOrOverridesOnMethodsRule$1.evaluate(NoShadowingOrOverridesOnMethodsRule.java:39)
      [mvn] 		at com.carrotsearch.randomizedtesting.rules.StatementAdapter.evaluate(StatementAdapter.java:36)
      [mvn] 		at org.apache.lucene.util.TestRuleAssertionsRequired$1.evaluate(TestRuleAssertionsRequired.java:43)
      [mvn] 		at org.apache.lucene.util.TestRuleMarkFailure$1.evaluate(TestRuleMarkFailure.java:48)
      [mvn] 		at org.apache.lucene.util.TestRuleIgnoreAfterMaxFailures$1.evaluate(TestRuleIgnoreAfterMaxFailures.java:70)
      [mvn] 		at org.apache.lucene.util.TestRuleIgnoreTestSuites$1.evaluate(TestRuleIgnoreTestSuites.java:55)
      [mvn] 		at com.carrotsearch.randomizedtesting.rules.StatementAdapter.evaluate(StatementAdapter.java:36)
      [mvn] 		at com.carrotsearch.randomizedtesting.ThreadLeakControl$StatementRunner.run(ThreadLeakControl.java:358)
      [mvn] 		at java.lang.Thread.run(Thread.java:679)
      [mvn] 	
      [mvn] 3361 T254 C1 oasc.SolrException.log SEVERE org.apache.solr.common.SolrException: range facet infinite loop: gap is either zero, or too small relative start/end and caused underflow: 23.0 + 0 = 23.0
      [mvn] 		at org.apache.solr.request.SimpleFacets.getFacetRangeCounts(SimpleFacets.java:1122)
      [mvn] 		at org.apache.solr.request.SimpleFacets.getFacetRangeCounts(SimpleFacets.java:1074)
      [mvn] 		at org.apache.solr.request.SimpleFacets.getFacetRangeCounts(SimpleFacets.java:1018)
      [mvn] 		at org.apache.solr.request.SimpleFacets.getFacetCounts(SimpleFacets.java:208)
      [mvn] 		at org.apache.solr.handler.component.FacetComponent.process(FacetComponent.java:87)
      [mvn] 		at org.apache.solr.handler.component.SearchHandler.handleRequestBody(SearchHandler.java:206)
      [mvn] 		at org.apache.solr.handler.RequestHandlerBase.handleRequest(RequestHandlerBase.java:129)
      [mvn] 		at org.apache.solr.core.SolrCore.execute(SolrCore.java:1701)
      [mvn] 		at org.apache.solr.util.TestHarness.query(TestHarness.java:364)
      [mvn] 		at org.apache.solr.util.TestHarness.query(TestHarness.java:346)
      [mvn] 		at org.apache.solr.SolrTestCaseJ4.assertQEx(SolrTestCaseJ4.java:618)
      [mvn] 		at org.apache.solr.request.SimpleFacetsTest.testRangeFacetInfiniteLoopDetection(SimpleFacetsTest.java:2052)
      [mvn] 		at sun.reflect.NativeMethodAccessorImpl.invoke0(Native Method)
      [mvn] 		at sun.reflect.NativeMethodAccessorImpl.invoke(NativeMethodAccessorImpl.java:57)
      [mvn] 		at sun.reflect.DelegatingMethodAccessorImpl.invoke(DelegatingMethodAccessorImpl.java:43)
      [mvn] 		at java.lang.reflect.Method.invoke(Method.java:616)
      [mvn] 		at com.carrotsearch.randomizedtesting.RandomizedRunner.invoke(RandomizedRunner.java:1559)
      [mvn] 		at com.carrotsearch.randomizedtesting.RandomizedRunner.access$600(RandomizedRunner.java:79)
      [mvn] 		at com.carrotsearch.randomizedtesting.RandomizedRunner$6.evaluate(RandomizedRunner.java:737)
      [mvn] 		at com.carrotsearch.randomizedtesting.RandomizedRunner$7.evaluate(RandomizedRunner.java:773)
      [mvn] 		at com.carrotsearch.randomizedtesting.RandomizedRunner$8.evaluate(RandomizedRunner.java:787)
      [mvn] 		at com.carrotsearch.randomizedtesting.rules.SystemPropertiesRestoreRule$1.evaluate(SystemPropertiesRestoreRule.java:53)
      [mvn] 		at org.apache.lucene.util.TestRuleSetupTeardownChained$1.evaluate(TestRuleSetupTeardownChained.java:50)
      [mvn] 		at org.apache.lucene.util.TestRuleFieldCacheSanity$1.evaluate(TestRuleFieldCacheSanity.java:51)
      [mvn] 		at org.apache.lucene.util.AbstractBeforeAfterRule$1.evaluate(AbstractBeforeAfterRule.java:45)
      [mvn] 		at com.carrotsearch.randomizedtesting.rules.SystemPropertiesInvariantRule$1.evaluate(SystemPropertiesInvariantRule.java:55)
      [mvn] 		at org.apache.lucene.util.TestRuleThreadAndTestName$1.evaluate(TestRuleThreadAndTestName.java:48)
      [mvn] 		at org.apache.lucene.util.TestRuleIgnoreAfterMaxFailures$1.evaluate(TestRuleIgnoreAfterMaxFailures.java:70)
      [mvn] 		at org.apache.lucene.util.TestRuleMarkFailure$1.evaluate(TestRuleMarkFailure.java:48)
      [mvn] 		at com.carrotsearch.randomizedtesting.rules.StatementAdapter.evaluate(StatementAdapter.java:36)
      [mvn] 		at com.carrotsearch.randomizedtesting.ThreadLeakControl$StatementRunner.run(ThreadLeakControl.java:358)
      [mvn] 		at com.carrotsearch.randomizedtesting.ThreadLeakControl.forkTimeoutingTask(ThreadLeakControl.java:782)
      [mvn] 		at com.carrotsearch.randomizedtesting.ThreadLeakControl$3.evaluate(ThreadLeakControl.java:442)
      [mvn] 		at com.carrotsearch.randomizedtesting.RandomizedRunner.runSingleTest(RandomizedRunner.java:746)
      [mvn] 		at com.carrotsearch.randomizedtesting.RandomizedRunner$3.evaluate(RandomizedRunner.java:648)
      [mvn] 		at com.carrotsearch.randomizedtesting.RandomizedRunner$4.evaluate(RandomizedRunner.java:682)
      [mvn] 		at com.carrotsearch.randomizedtesting.RandomizedRunner$5.evaluate(RandomizedRunner.java:693)
      [mvn] 		at com.carrotsearch.randomizedtesting.rules.StatementAdapter.evaluate(StatementAdapter.java:36)
      [mvn] 		at com.carrotsearch.randomizedtesting.rules.SystemPropertiesRestoreRule$1.evaluate(SystemPropertiesRestoreRule.java:53)
      [mvn] 		at org.apache.lucene.util.AbstractBeforeAfterRule$1.evaluate(AbstractBeforeAfterRule.java:45)
      [mvn] 		at org.apache.lucene.util.TestRuleStoreClassName$1.evaluate(TestRuleStoreClassName.java:42)
      [mvn] 		at com.carrotsearch.randomizedtesting.rules.SystemPropertiesInvariantRule$1.evaluate(SystemPropertiesInvariantRule.java:55)
      [mvn] 		at com.carrotsearch.randomizedtesting.rules.NoShadowingOrOverridesOnMethodsRule$1.evaluate(NoShadowingOrOverridesOnMethodsRule.java:39)
      [mvn] 		at com.carrotsearch.randomizedtesting.rules.NoShadowingOrOverridesOnMethodsRule$1.evaluate(NoShadowingOrOverridesOnMethodsRule.java:39)
      [mvn] 		at com.carrotsearch.randomizedtesting.rules.StatementAdapter.evaluate(StatementAdapter.java:36)
      [mvn] 		at org.apache.lucene.util.TestRuleAssertionsRequired$1.evaluate(TestRuleAssertionsRequired.java:43)
      [mvn] 		at org.apache.lucene.util.TestRuleMarkFailure$1.evaluate(TestRuleMarkFailure.java:48)
      [mvn] 		at org.apache.lucene.util.TestRuleIgnoreAfterMaxFailures$1.evaluate(TestRuleIgnoreAfterMaxFailures.java:70)
      [mvn] 		at org.apache.lucene.util.TestRuleIgnoreTestSuites$1.evaluate(TestRuleIgnoreTestSuites.java:55)
      [mvn] 		at com.carrotsearch.randomizedtesting.rules.StatementAdapter.evaluate(StatementAdapter.java:36)
      [mvn] 		at com.carrotsearch.randomizedtesting.ThreadLeakControl$StatementRunner.run(ThreadLeakControl.java:358)
      [mvn] 		at java.lang.Thread.run(Thread.java:679)
      [mvn] 	
      [mvn] 3363 T254 C1 oasc.SolrException.log SEVERE org.apache.solr.common.SolrException: range facet infinite loop: gap is either zero, or too small relative start/end and caused underflow: 23.0 + 0 = 23.0
      [mvn] 		at org.apache.solr.request.SimpleFacets.getFacetRangeCounts(SimpleFacets.java:1122)
      [mvn] 		at org.apache.solr.request.SimpleFacets.getFacetRangeCounts(SimpleFacets.java:1074)
      [mvn] 		at org.apache.solr.request.SimpleFacets.getFacetRangeCounts(SimpleFacets.java:1018)
      [mvn] 		at org.apache.solr.request.SimpleFacets.getFacetCounts(SimpleFacets.java:208)
      [mvn] 		at org.apache.solr.handler.component.FacetComponent.process(FacetComponent.java:87)
      [mvn] 		at org.apache.solr.handler.component.SearchHandler.handleRequestBody(SearchHandler.java:206)
      [mvn] 		at org.apache.solr.handler.RequestHandlerBase.handleRequest(RequestHandlerBase.java:129)
      [mvn] 		at org.apache.solr.core.SolrCore.execute(SolrCore.java:1701)
      [mvn] 		at org.apache.solr.util.TestHarness.query(TestHarness.java:364)
      [mvn] 		at org.apache.solr.util.TestHarness.query(TestHarness.java:346)
      [mvn] 		at org.apache.solr.SolrTestCaseJ4.assertQEx(SolrTestCaseJ4.java:618)
      [mvn] 		at org.apache.solr.request.SimpleFacetsTest.testRangeFacetInfiniteLoopDetection(SimpleFacetsTest.java:2052)
      [mvn] 		at sun.reflect.NativeMethodAccessorImpl.invoke0(Native Method)
      [mvn] 		at sun.reflect.NativeMethodAccessorImpl.invoke(NativeMethodAccessorImpl.java:57)
      [mvn] 		at sun.reflect.DelegatingMethodAccessorImpl.invoke(DelegatingMethodAccessorImpl.java:43)
      [mvn] 		at java.lang.reflect.Method.invoke(Method.java:616)
      [mvn] 		at com.carrotsearch.randomizedtesting.RandomizedRunner.invoke(RandomizedRunner.java:1559)
      [mvn] 		at com.carrotsearch.randomizedtesting.RandomizedRunner.access$600(RandomizedRunner.java:79)
      [mvn] 		at com.carrotsearch.randomizedtesting.RandomizedRunner$6.evaluate(RandomizedRunner.java:737)
      [mvn] 		at com.carrotsearch.randomizedtesting.RandomizedRunner$7.evaluate(RandomizedRunner.java:773)
      [mvn] 		at com.carrotsearch.randomizedtesting.RandomizedRunner$8.evaluate(RandomizedRunner.java:787)
      [mvn] 		at com.carrotsearch.randomizedtesting.rules.SystemPropertiesRestoreRule$1.evaluate(SystemPropertiesRestoreRule.java:53)
      [mvn] 		at org.apache.lucene.util.TestRuleSetupTeardownChained$1.evaluate(TestRuleSetupTeardownChained.java:50)
      [mvn] 		at org.apache.lucene.util.TestRuleFieldCacheSanity$1.evaluate(TestRuleFieldCacheSanity.java:51)
      [mvn] 		at org.apache.lucene.util.AbstractBeforeAfterRule$1.evaluate(AbstractBeforeAfterRule.java:45)
      [mvn] 		at com.carrotsearch.randomizedtesting.rules.SystemPropertiesInvariantRule$1.evaluate(SystemPropertiesInvariantRule.java:55)
      [mvn] 		at org.apache.lucene.util.TestRuleThreadAndTestName$1.evaluate(TestRuleThreadAndTestName.java:48)
      [mvn] 		at org.apache.lucene.util.TestRuleIgnoreAfterMaxFailures$1.evaluate(TestRuleIgnoreAfterMaxFailures.java:70)
      [mvn] 		at org.apache.lucene.util.TestRuleMarkFailure$1.evaluate(TestRuleMarkFailure.java:48)
      [mvn] 		at com.carrotsearch.randomizedtesting.rules.StatementAdapter.evaluate(StatementAdapter.java:36)
      [mvn] 		at com.carrotsearch.randomizedtesting.ThreadLeakControl$StatementRunner.run(ThreadLeakControl.java:358)
      [mvn] 		at com.carrotsearch.randomizedtesting.ThreadLeakControl.forkTimeoutingTask(ThreadLeakControl.java:782)
      [mvn] 		at com.carrotsearch.randomizedtesting.ThreadLeakControl$3.evaluate(ThreadLeakControl.java:442)
      [mvn] 		at com.carrotsearch.randomizedtesting.RandomizedRunner.runSingleTest(RandomizedRunner.java:746)
      [mvn] 		at com.carrotsearch.randomizedtesting.RandomizedRunner$3.evaluate(RandomizedRunner.java:648)
      [mvn] 		at com.carrotsearch.randomizedtesting.RandomizedRunner$4.evaluate(RandomizedRunner.java:682)
      [mvn] 		at com.carrotsearch.randomizedtesting.RandomizedRunner$5.evaluate(RandomizedRunner.java:693)
      [mvn] 		at com.carrotsearch.randomizedtesting.rules.StatementAdapter.evaluate(StatementAdapter.java:36)
      [mvn] 		at com.carrotsearch.randomizedtesting.rules.SystemPropertiesRestoreRule$1.evaluate(SystemPropertiesRestoreRule.java:53)
      [mvn] 		at org.apache.lucene.util.AbstractBeforeAfterRule$1.evaluate(AbstractBeforeAfterRule.java:45)
      [mvn] 		at org.apache.lucene.util.TestRuleStoreClassName$1.evaluate(TestRuleStoreClassName.java:42)
      [mvn] 		at com.carrotsearch.randomizedtesting.rules.SystemPropertiesInvariantRule$1.evaluate(SystemPropertiesInvariantRule.java:55)
      [mvn] 		at com.carrotsearch.randomizedtesting.rules.NoShadowingOrOverridesOnMethodsRule$1.evaluate(NoShadowingOrOverridesOnMethodsRule.java:39)
      [mvn] 		at com.carrotsearch.randomizedtesting.rules.NoShadowingOrOverridesOnMethodsRule$1.evaluate(NoShadowingOrOverridesOnMethodsRule.java:39)
      [mvn] 		at com.carrotsearch.randomizedtesting.rules.StatementAdapter.evaluate(StatementAdapter.java:36)
      [mvn] 		at org.apache.lucene.util.TestRuleAssertionsRequired$1.evaluate(TestRuleAssertionsRequired.java:43)
      [mvn] 		at org.apache.lucene.util.TestRuleMarkFailure$1.evaluate(TestRuleMarkFailure.java:48)
      [mvn] 		at org.apache.lucene.util.TestRuleIgnoreAfterMaxFailures$1.evaluate(TestRuleIgnoreAfterMaxFailures.java:70)
      [mvn] 		at org.apache.lucene.util.TestRuleIgnoreTestSuites$1.evaluate(TestRuleIgnoreTestSuites.java:55)
      [mvn] 		at com.carrotsearch.randomizedtesting.rules.StatementAdapter.evaluate(StatementAdapter.java:36)
      [mvn] 		at com.carrotsearch.randomizedtesting.ThreadLeakControl$StatementRunner.run(ThreadLeakControl.java:358)
      [mvn] 		at java.lang.Thread.run(Thread.java:679)
      [mvn] 	
      [mvn] 3364 T254 C1 oasc.SolrException.log SEVERE org.apache.solr.common.SolrException: range facet infinite loop: gap is either zero, or too small relative start/end and caused underflow: 23.0 + 0 = 23.0
      [mvn] 		at org.apache.solr.request.SimpleFacets.getFacetRangeCounts(SimpleFacets.java:1122)
      [mvn] 		at org.apache.solr.request.SimpleFacets.getFacetRangeCounts(SimpleFacets.java:1074)
      [mvn] 		at org.apache.solr.request.SimpleFacets.getFacetRangeCounts(SimpleFacets.java:1018)
      [mvn] 		at org.apache.solr.request.SimpleFacets.getFacetCounts(SimpleFacets.java:208)
      [mvn] 		at org.apache.solr.handler.component.FacetComponent.process(FacetComponent.java:87)
      [mvn] 		at org.apache.solr.handler.component.SearchHandler.handleRequestBody(SearchHandler.java:206)
      [mvn] 		at org.apache.solr.handler.RequestHandlerBase.handleRequest(RequestHandlerBase.java:129)
      [mvn] 		at org.apache.solr.core.SolrCore.execute(SolrCore.java:1701)
      [mvn] 		at org.apache.solr.util.TestHarness.query(TestHarness.java:364)
      [mvn] 		at org.apache.solr.util.TestHarness.query(TestHarness.java:346)
      [mvn] 		at org.apache.solr.SolrTestCaseJ4.assertQEx(SolrTestCaseJ4.java:618)
      [mvn] 		at org.apache.solr.request.SimpleFacetsTest.testRangeFacetInfiniteLoopDetection(SimpleFacetsTest.java:2052)
      [mvn] 		at sun.reflect.NativeMethodAccessorImpl.invoke0(Native Method)
      [mvn] 		at sun.reflect.NativeMethodAccessorImpl.invoke(NativeMethodAccessorImpl.java:57)
      [mvn] 		at sun.reflect.DelegatingMethodAccessorImpl.invoke(DelegatingMethodAccessorImpl.java:43)
      [mvn] 		at java.lang.reflect.Method.invoke(Method.java:616)
      [mvn] 		at com.carrotsearch.randomizedtesting.RandomizedRunner.invoke(RandomizedRunner.java:1559)
      [mvn] 		at com.carrotsearch.randomizedtesting.RandomizedRunner.access$600(RandomizedRunner.java:79)
      [mvn] 		at com.carrotsearch.randomizedtesting.RandomizedRunner$6.evaluate(RandomizedRunner.java:737)
      [mvn] 		at com.carrotsearch.randomizedtesting.RandomizedRunner$7.evaluate(RandomizedRunner.java:773)
      [mvn] 		at com.carrotsearch.randomizedtesting.RandomizedRunner$8.evaluate(RandomizedRunner.java:787)
      [mvn] 		at com.carrotsearch.randomizedtesting.rules.SystemPropertiesRestoreRule$1.evaluate(SystemPropertiesRestoreRule.java:53)
      [mvn] 		at org.apache.lucene.util.TestRuleSetupTeardownChained$1.evaluate(TestRuleSetupTeardownChained.java:50)
      [mvn] 		at org.apache.lucene.util.TestRuleFieldCacheSanity$1.evaluate(TestRuleFieldCacheSanity.java:51)
      [mvn] 		at org.apache.lucene.util.AbstractBeforeAfterRule$1.evaluate(AbstractBeforeAfterRule.java:45)
      [mvn] 		at com.carrotsearch.randomizedtesting.rules.SystemPropertiesInvariantRule$1.evaluate(SystemPropertiesInvariantRule.java:55)
      [mvn] 		at org.apache.lucene.util.TestRuleThreadAndTestName$1.evaluate(TestRuleThreadAndTestName.java:48)
      [mvn] 		at org.apache.lucene.util.TestRuleIgnoreAfterMaxFailures$1.evaluate(TestRuleIgnoreAfterMaxFailures.java:70)
      [mvn] 		at org.apache.lucene.util.TestRuleMarkFailure$1.evaluate(TestRuleMarkFailure.java:48)
      [mvn] 		at com.carrotsearch.randomizedtesting.rules.StatementAdapter.evaluate(StatementAdapter.java:36)
      [mvn] 		at com.carrotsearch.randomizedtesting.ThreadLeakControl$StatementRunner.run(ThreadLeakControl.java:358)
      [mvn] 		at com.carrotsearch.randomizedtesting.ThreadLeakControl.forkTimeoutingTask(ThreadLeakControl.java:782)
      [mvn] 		at com.carrotsearch.randomizedtesting.ThreadLeakControl$3.evaluate(ThreadLeakControl.java:442)
      [mvn] 		at com.carrotsearch.randomizedtesting.RandomizedRunner.runSingleTest(RandomizedRunner.java:746)
      [mvn] 		at com.carrotsearch.randomizedtesting.RandomizedRunner$3.evaluate(RandomizedRunner.java:648)
      [mvn] 		at com.carrotsearch.randomizedtesting.RandomizedRunner$4.evaluate(RandomizedRunner.java:682)
      [mvn] 		at com.carrotsearch.randomizedtesting.RandomizedRunner$5.evaluate(RandomizedRunner.java:693)
      [mvn] 		at com.carrotsearch.randomizedtesting.rules.StatementAdapter.evaluate(StatementAdapter.java:36)
      [mvn] 		at com.carrotsearch.randomizedtesting.rules.SystemPropertiesRestoreRule$1.evaluate(SystemPropertiesRestoreRule.java:53)
      [mvn] 		at org.apache.lucene.util.AbstractBeforeAfterRule$1.evaluate(AbstractBeforeAfterRule.java:45)
      [mvn] 		at org.apache.lucene.util.TestRuleStoreClassName$1.evaluate(TestRuleStoreClassName.java:42)
      [mvn] 		at com.carrotsearch.randomizedtesting.rules.SystemPropertiesInvariantRule$1.evaluate(SystemPropertiesInvariantRule.java:55)
      [mvn] 		at com.carrotsearch.randomizedtesting.rules.NoShadowingOrOverridesOnMethodsRule$1.evaluate(NoShadowingOrOverridesOnMethodsRule.java:39)
      [mvn] 		at com.carrotsearch.randomizedtesting.rules.NoShadowingOrOverridesOnMethodsRule$1.evaluate(NoShadowingOrOverridesOnMethodsRule.java:39)
      [mvn] 		at com.carrotsearch.randomizedtesting.rules.StatementAdapter.evaluate(StatementAdapter.java:36)
      [mvn] 		at org.apache.lucene.util.TestRuleAssertionsRequired$1.evaluate(TestRuleAssertionsRequired.java:43)
      [mvn] 		at org.apache.lucene.util.TestRuleMarkFailure$1.evaluate(TestRuleMarkFailure.java:48)
      [mvn] 		at org.apache.lucene.util.TestRuleIgnoreAfterMaxFailures$1.evaluate(TestRuleIgnoreAfterMaxFailures.java:70)
      [mvn] 		at org.apache.lucene.util.TestRuleIgnoreTestSuites$1.evaluate(TestRuleIgnoreTestSuites.java:55)
      [mvn] 		at com.carrotsearch.randomizedtesting.rules.StatementAdapter.evaluate(StatementAdapter.java:36)
      [mvn] 		at com.carrotsearch.randomizedtesting.ThreadLeakControl$StatementRunner.run(ThreadLeakControl.java:358)
      [mvn] 		at java.lang.Thread.run(Thread.java:679)
      [mvn] 	
      [mvn] 3365 T254 C1 oasc.SolrException.log SEVERE org.apache.solr.common.SolrException: range facet infinite loop: gap is either zero, or too small relative start/end and caused underflow: 23 + 0 = 23
      [mvn] 		at org.apache.solr.request.SimpleFacets.getFacetRangeCounts(SimpleFacets.java:1122)
      [mvn] 		at org.apache.solr.request.SimpleFacets.getFacetRangeCounts(SimpleFacets.java:1074)
      [mvn] 		at org.apache.solr.request.SimpleFacets.getFacetRangeCounts(SimpleFacets.java:1018)
      [mvn] 		at org.apache.solr.request.SimpleFacets.getFacetCounts(SimpleFacets.java:208)
      [mvn] 		at org.apache.solr.handler.component.FacetComponent.process(FacetComponent.java:87)
      [mvn] 		at org.apache.solr.handler.component.SearchHandler.handleRequestBody(SearchHandler.java:206)
      [mvn] 		at org.apache.solr.handler.RequestHandlerBase.handleRequest(RequestHandlerBase.java:129)
      [mvn] 		at org.apache.solr.core.SolrCore.execute(SolrCore.java:1701)
      [mvn] 		at org.apache.solr.util.TestHarness.query(TestHarness.java:364)
      [mvn] 		at org.apache.solr.util.TestHarness.query(TestHarness.java:346)
      [mvn] 		at org.apache.solr.SolrTestCaseJ4.assertQEx(SolrTestCaseJ4.java:618)
      [mvn] 		at org.apache.solr.request.SimpleFacetsTest.testRangeFacetInfiniteLoopDetection(SimpleFacetsTest.java:2052)
      [mvn] 		at sun.reflect.NativeMethodAccessorImpl.invoke0(Native Method)
      [mvn] 		at sun.reflect.NativeMethodAccessorImpl.invoke(NativeMethodAccessorImpl.java:57)
      [mvn] 		at sun.reflect.DelegatingMethodAccessorImpl.invoke(DelegatingMethodAccessorImpl.java:43)
      [mvn] 		at java.lang.reflect.Method.invoke(Method.java:616)
      [mvn] 		at com.carrotsearch.randomizedtesting.RandomizedRunner.invoke(RandomizedRunner.java:1559)
      [mvn] 		at com.carrotsearch.randomizedtesting.RandomizedRunner.access$600(RandomizedRunner.java:79)
      [mvn] 		at com.carrotsearch.randomizedtesting.RandomizedRunner$6.evaluate(RandomizedRunner.java:737)
      [mvn] 		at com.carrotsearch.randomizedtesting.RandomizedRunner$7.evaluate(RandomizedRunner.java:773)
      [mvn] 		at com.carrotsearch.randomizedtesting.RandomizedRunner$8.evaluate(RandomizedRunner.java:787)
      [mvn] 		at com.carrotsearch.randomizedtesting.rules.SystemPropertiesRestoreRule$1.evaluate(SystemPropertiesRestoreRule.java:53)
      [mvn] 		at org.apache.lucene.util.TestRuleSetupTeardownChained$1.evaluate(TestRuleSetupTeardownChained.java:50)
      [mvn] 		at org.apache.lucene.util.TestRuleFieldCacheSanity$1.evaluate(TestRuleFieldCacheSanity.java:51)
      [mvn] 		at org.apache.lucene.util.AbstractBeforeAfterRule$1.evaluate(AbstractBeforeAfterRule.java:45)
      [mvn] 		at com.carrotsearch.randomizedtesting.rules.SystemPropertiesInvariantRule$1.evaluate(SystemPropertiesInvariantRule.java:55)
      [mvn] 		at org.apache.lucene.util.TestRuleThreadAndTestName$1.evaluate(TestRuleThreadAndTestName.java:48)
      [mvn] 		at org.apache.lucene.util.TestRuleIgnoreAfterMaxFailures$1.evaluate(TestRuleIgnoreAfterMaxFailures.java:70)
      [mvn] 		at org.apache.lucene.util.TestRuleMarkFailure$1.evaluate(TestRuleMarkFailure.java:48)
      [mvn] 		at com.carrotsearch.randomizedtesting.rules.StatementAdapter.evaluate(StatementAdapter.java:36)
      [mvn] 		at com.carrotsearch.randomizedtesting.ThreadLeakControl$StatementRunner.run(ThreadLeakControl.java:358)
      [mvn] 		at com.carrotsearch.randomizedtesting.ThreadLeakControl.forkTimeoutingTask(ThreadLeakControl.java:782)
      [mvn] 		at com.carrotsearch.randomizedtesting.ThreadLeakControl$3.evaluate(ThreadLeakControl.java:442)
      [mvn] 		at com.carrotsearch.randomizedtesting.RandomizedRunner.runSingleTest(RandomizedRunner.java:746)
      [mvn] 		at com.carrotsearch.randomizedtesting.RandomizedRunner$3.evaluate(RandomizedRunner.java:648)
      [mvn] 		at com.carrotsearch.randomizedtesting.RandomizedRunner$4.evaluate(RandomizedRunner.java:682)
      [mvn] 		at com.carrotsearch.randomizedtesting.RandomizedRunner$5.evaluate(RandomizedRunner.java:693)
      [mvn] 		at com.carrotsearch.randomizedtesting.rules.StatementAdapter.evaluate(StatementAdapter.java:36)
      [mvn] 		at com.carrotsearch.randomizedtesting.rules.SystemPropertiesRestoreRule$1.evaluate(SystemPropertiesRestoreRule.java:53)
      [mvn] 		at org.apache.lucene.util.AbstractBeforeAfterRule$1.evaluate(AbstractBeforeAfterRule.java:45)
      [mvn] 		at org.apache.lucene.util.TestRuleStoreClassName$1.evaluate(TestRuleStoreClassName.java:42)
      [mvn] 		at com.carrotsearch.randomizedtesting.rules.SystemPropertiesInvariantRule$1.evaluate(SystemPropertiesInvariantRule.java:55)
      [mvn] 		at com.carrotsearch.randomizedtesting.rules.NoShadowingOrOverridesOnMethodsRule$1.evaluate(NoShadowingOrOverridesOnMethodsRule.java:39)
      [mvn] 		at com.carrotsearch.randomizedtesting.rules.NoShadowingOrOverridesOnMethodsRule$1.evaluate(NoShadowingOrOverridesOnMethodsRule.java:39)
      [mvn] 		at com.carrotsearch.randomizedtesting.rules.StatementAdapter.evaluate(StatementAdapter.java:36)
      [mvn] 		at org.apache.lucene.util.TestRuleAssertionsRequired$1.evaluate(TestRuleAssertionsRequired.java:43)
      [mvn] 		at org.apache.lucene.util.TestRuleMarkFailure$1.evaluate(TestRuleMarkFailure.java:48)
      [mvn] 		at org.apache.lucene.util.TestRuleIgnoreAfterMaxFailures$1.evaluate(TestRuleIgnoreAfterMaxFailures.java:70)
      [mvn] 		at org.apache.lucene.util.TestRuleIgnoreTestSuites$1.evaluate(TestRuleIgnoreTestSuites.java:55)
      [mvn] 		at com.carrotsearch.randomizedtesting.rules.StatementAdapter.evaluate(StatementAdapter.java:36)
      [mvn] 		at com.carrotsearch.randomizedtesting.ThreadLeakControl$StatementRunner.run(ThreadLeakControl.java:358)
      [mvn] 		at java.lang.Thread.run(Thread.java:679)
      [mvn] 	
      [mvn] 3366 T254 C1 oasc.SolrException.log SEVERE org.apache.solr.common.SolrException: range facet infinite loop: gap is either zero, or too small relative start/end and caused underflow: 23 + 0 = 23
      [mvn] 		at org.apache.solr.request.SimpleFacets.getFacetRangeCounts(SimpleFacets.java:1122)
      [mvn] 		at org.apache.solr.request.SimpleFacets.getFacetRangeCounts(SimpleFacets.java:1074)
      [mvn] 		at org.apache.solr.request.SimpleFacets.getFacetRangeCounts(SimpleFacets.java:1018)
      [mvn] 		at org.apache.solr.request.SimpleFacets.getFacetCounts(SimpleFacets.java:208)
      [mvn] 		at org.apache.solr.handler.component.FacetComponent.process(FacetComponent.java:87)
      [mvn] 		at org.apache.solr.handler.component.SearchHandler.handleRequestBody(SearchHandler.java:206)
      [mvn] 		at org.apache.solr.handler.RequestHandlerBase.handleRequest(RequestHandlerBase.java:129)
      [mvn] 		at org.apache.solr.core.SolrCore.execute(SolrCore.java:1701)
      [mvn] 		at org.apache.solr.util.TestHarness.query(TestHarness.java:364)
      [mvn] 		at org.apache.solr.util.TestHarness.query(TestHarness.java:346)
      [mvn] 		at org.apache.solr.SolrTestCaseJ4.assertQEx(SolrTestCaseJ4.java:618)
      [mvn] 		at org.apache.solr.request.SimpleFacetsTest.testRangeFacetInfiniteLoopDetection(SimpleFacetsTest.java:2052)
      [mvn] 		at sun.reflect.NativeMethodAccessorImpl.invoke0(Native Method)
      [mvn] 		at sun.reflect.NativeMethodAccessorImpl.invoke(NativeMethodAccessorImpl.java:57)
      [mvn] 		at sun.reflect.DelegatingMethodAccessorImpl.invoke(DelegatingMethodAccessorImpl.java:43)
      [mvn] 		at java.lang.reflect.Method.invoke(Method.java:616)
      [mvn] 		at com.carrotsearch.randomizedtesting.RandomizedRunner.invoke(RandomizedRunner.java:1559)
      [mvn] 		at com.carrotsearch.randomizedtesting.RandomizedRunner.access$600(RandomizedRunner.java:79)
      [mvn] 		at com.carrotsearch.randomizedtesting.RandomizedRunner$6.evaluate(RandomizedRunner.java:737)
      [mvn] 		at com.carrotsearch.randomizedtesting.RandomizedRunner$7.evaluate(RandomizedRunner.java:773)
      [mvn] 		at com.carrotsearch.randomizedtesting.RandomizedRunner$8.evaluate(RandomizedRunner.java:787)
      [mvn] 		at com.carrotsearch.randomizedtesting.rules.SystemPropertiesRestoreRule$1.evaluate(SystemPropertiesRestoreRule.java:53)
      [mvn] 		at org.apache.lucene.util.TestRuleSetupTeardownChained$1.evaluate(TestRuleSetupTeardownChained.java:50)
      [mvn] 		at org.apache.lucene.util.TestRuleFieldCacheSanity$1.evaluate(TestRuleFieldCacheSanity.java:51)
      [mvn] 		at org.apache.lucene.util.AbstractBeforeAfterRule$1.evaluate(AbstractBeforeAfterRule.java:45)
      [mvn] 		at com.carrotsearch.randomizedtesting.rules.SystemPropertiesInvariantRule$1.evaluate(SystemPropertiesInvariantRule.java:55)
      [mvn] 		at org.apache.lucene.util.TestRuleThreadAndTestName$1.evaluate(TestRuleThreadAndTestName.java:48)
      [mvn] 		at org.apache.lucene.util.TestRuleIgnoreAfterMaxFailures$1.evaluate(TestRuleIgnoreAfterMaxFailures.java:70)
      [mvn] 		at org.apache.lucene.util.TestRuleMarkFailure$1.evaluate(TestRuleMarkFailure.java:48)
      [mvn] 		at com.carrotsearch.randomizedtesting.rules.StatementAdapter.evaluate(StatementAdapter.java:36)
      [mvn] 		at com.carrotsearch.randomizedtesting.ThreadLeakControl$StatementRunner.run(ThreadLeakControl.java:358)
      [mvn] 		at com.carrotsearch.randomizedtesting.ThreadLeakControl.forkTimeoutingTask(ThreadLeakControl.java:782)
      [mvn] 		at com.carrotsearch.randomizedtesting.ThreadLeakControl$3.evaluate(ThreadLeakControl.java:442)
      [mvn] 		at com.carrotsearch.randomizedtesting.RandomizedRunner.runSingleTest(RandomizedRunner.java:746)
      [mvn] 		at com.carrotsearch.randomizedtesting.RandomizedRunner$3.evaluate(RandomizedRunner.java:648)
      [mvn] 		at com.carrotsearch.randomizedtesting.RandomizedRunner$4.evaluate(RandomizedRunner.java:682)
      [mvn] 		at com.carrotsearch.randomizedtesting.RandomizedRunner$5.evaluate(RandomizedRunner.java:693)
      [mvn] 		at com.carrotsearch.randomizedtesting.rules.StatementAdapter.evaluate(StatementAdapter.java:36)
      [mvn] 		at com.carrotsearch.randomizedtesting.rules.SystemPropertiesRestoreRule$1.evaluate(SystemPropertiesRestoreRule.java:53)
      [mvn] 		at org.apache.lucene.util.AbstractBeforeAfterRule$1.evaluate(AbstractBeforeAfterRule.java:45)
      [mvn] 		at org.apache.lucene.util.TestRuleStoreClassName$1.evaluate(TestRuleStoreClassName.java:42)
      [mvn] 		at com.carrotsearch.randomizedtesting.rules.SystemPropertiesInvariantRule$1.evaluate(SystemPropertiesInvariantRule.java:55)
      [mvn] 		at com.carrotsearch.randomizedtesting.rules.NoShadowingOrOverridesOnMethodsRule$1.evaluate(NoShadowingOrOverridesOnMethodsRule.java:39)
      [mvn] 		at com.carrotsearch.randomizedtesting.rules.NoShadowingOrOverridesOnMethodsRule$1.evaluate(NoShadowingOrOverridesOnMethodsRule.java:39)
      [mvn] 		at com.carrotsearch.randomizedtesting.rules.StatementAdapter.evaluate(StatementAdapter.java:36)
      [mvn] 		at org.apache.lucene.util.TestRuleAssertionsRequired$1.evaluate(TestRuleAssertionsRequired.java:43)
      [mvn] 		at org.apache.lucene.util.TestRuleMarkFailure$1.evaluate(TestRuleMarkFailure.java:48)
      [mvn] 		at org.apache.lucene.util.TestRuleIgnoreAfterMaxFailures$1.evaluate(TestRuleIgnoreAfterMaxFailures.java:70)
      [mvn] 		at org.apache.lucene.util.TestRuleIgnoreTestSuites$1.evaluate(TestRuleIgnoreTestSuites.java:55)
      [mvn] 		at com.carrotsearch.randomizedtesting.rules.StatementAdapter.evaluate(StatementAdapter.java:36)
      [mvn] 		at com.carrotsearch.randomizedtesting.ThreadLeakControl$StatementRunner.run(ThreadLeakControl.java:358)
      [mvn] 		at java.lang.Thread.run(Thread.java:679)
      [mvn] 	
      [mvn] 3367 T254 C1 oasc.SolrException.log SEVERE org.apache.solr.common.SolrException: date facet infinite loop: gap is effectively zero
      [mvn] 		at org.apache.solr.request.SimpleFacets.getFacetDateCounts(SimpleFacets.java:928)
      [mvn] 		at org.apache.solr.request.SimpleFacets.getFacetDateCounts(SimpleFacets.java:837)
      [mvn] 		at org.apache.solr.request.SimpleFacets.getFacetCounts(SimpleFacets.java:207)
      [mvn] 		at org.apache.solr.handler.component.FacetComponent.process(FacetComponent.java:87)
      [mvn] 		at org.apache.solr.handler.component.SearchHandler.handleRequestBody(SearchHandler.java:206)
      [mvn] 		at org.apache.solr.handler.RequestHandlerBase.handleRequest(RequestHandlerBase.java:129)
      [mvn] 		at org.apache.solr.core.SolrCore.execute(SolrCore.java:1701)
      [mvn] 		at org.apache.solr.util.TestHarness.query(TestHarness.java:364)
      [mvn] 		at org.apache.solr.util.TestHarness.query(TestHarness.java:346)
      [mvn] 		at org.apache.solr.SolrTestCaseJ4.assertQEx(SolrTestCaseJ4.java:618)
      [mvn] 		at org.apache.solr.request.SimpleFacetsTest.testRangeFacetInfiniteLoopDetection(SimpleFacetsTest.java:2063)
      [mvn] 		at sun.reflect.NativeMethodAccessorImpl.invoke0(Native Method)
      [mvn] 		at sun.reflect.NativeMethodAccessorImpl.invoke(NativeMethodAccessorImpl.java:57)
      [mvn] 		at sun.reflect.DelegatingMethodAccessorImpl.invoke(DelegatingMethodAccessorImpl.java:43)
      [mvn] 		at java.lang.reflect.Method.invoke(Method.java:616)
      [mvn] 		at com.carrotsearch.randomizedtesting.RandomizedRunner.invoke(RandomizedRunner.java:1559)
      [mvn] 		at com.carrotsearch.randomizedtesting.RandomizedRunner.access$600(RandomizedRunner.java:79)
      [mvn] 		at com.carrotsearch.randomizedtesting.RandomizedRunner$6.evaluate(RandomizedRunner.java:737)
      [mvn] 		at com.carrotsearch.randomizedtesting.RandomizedRunner$7.evaluate(RandomizedRunner.java:773)
      [mvn] 		at com.carrotsearch.randomizedtesting.RandomizedRunner$8.evaluate(RandomizedRunner.java:787)
      [mvn] 		at com.carrotsearch.randomizedtesting.rules.SystemPropertiesRestoreRule$1.evaluate(SystemPropertiesRestoreRule.java:53)
      [mvn] 		at org.apache.lucene.util.TestRuleSetupTeardownChained$1.evaluate(TestRuleSetupTeardownChained.java:50)
      [mvn] 		at org.apache.lucene.util.TestRuleFieldCacheSanity$1.evaluate(TestRuleFieldCacheSanity.java:51)
      [mvn] 		at org.apache.lucene.util.AbstractBeforeAfterRule$1.evaluate(AbstractBeforeAfterRule.java:45)
      [mvn] 		at com.carrotsearch.randomizedtesting.rules.SystemPropertiesInvariantRule$1.evaluate(SystemPropertiesInvariantRule.java:55)
      [mvn] 		at org.apache.lucene.util.TestRuleThreadAndTestName$1.evaluate(TestRuleThreadAndTestName.java:48)
      [mvn] 		at org.apache.lucene.util.TestRuleIgnoreAfterMaxFailures$1.evaluate(TestRuleIgnoreAfterMaxFailures.java:70)
      [mvn] 		at org.apache.lucene.util.TestRuleMarkFailure$1.evaluate(TestRuleMarkFailure.java:48)
      [mvn] 		at com.carrotsearch.randomizedtesting.rules.StatementAdapter.evaluate(StatementAdapter.java:36)
      [mvn] 		at com.carrotsearch.randomizedtesting.ThreadLeakControl$StatementRunner.run(ThreadLeakControl.java:358)
      [mvn] 		at com.carrotsearch.randomizedtesting.ThreadLeakControl.forkTimeoutingTask(ThreadLeakControl.java:782)
      [mvn] 		at com.carrotsearch.randomizedtesting.ThreadLeakControl$3.evaluate(ThreadLeakControl.java:442)
      [mvn] 		at com.carrotsearch.randomizedtesting.RandomizedRunner.runSingleTest(RandomizedRunner.java:746)
      [mvn] 		at com.carrotsearch.randomizedtesting.RandomizedRunner$3.evaluate(RandomizedRunner.java:648)
      [mvn] 		at com.carrotsearch.randomizedtesting.RandomizedRunner$4.evaluate(RandomizedRunner.java:682)
      [mvn] 		at com.carrotsearch.randomizedtesting.RandomizedRunner$5.evaluate(RandomizedRunner.java:693)
      [mvn] 		at com.carrotsearch.randomizedtesting.rules.StatementAdapter.evaluate(StatementAdapter.java:36)
      [mvn] 		at com.carrotsearch.randomizedtesting.rules.SystemPropertiesRestoreRule$1.evaluate(SystemPropertiesRestoreRule.java:53)
      [mvn] 		at org.apache.lucene.util.AbstractBeforeAfterRule$1.evaluate(AbstractBeforeAfterRule.java:45)
      [mvn] 		at org.apache.lucene.util.TestRuleStoreClassName$1.evaluate(TestRuleStoreClassName.java:42)
      [mvn] 		at com.carrotsearch.randomizedtesting.rules.SystemPropertiesInvariantRule$1.evaluate(SystemPropertiesInvariantRule.java:55)
      [mvn] 		at com.carrotsearch.randomizedtesting.rules.NoShadowingOrOverridesOnMethodsRule$1.evaluate(NoShadowingOrOverridesOnMethodsRule.java:39)
      [mvn] 		at com.carrotsearch.randomizedtesting.rules.NoShadowingOrOverridesOnMethodsRule$1.evaluate(NoShadowingOrOverridesOnMethodsRule.java:39)
      [mvn] 		at com.carrotsearch.randomizedtesting.rules.StatementAdapter.evaluate(StatementAdapter.java:36)
      [mvn] 		at org.apache.lucene.util.TestRuleAssertionsRequired$1.evaluate(TestRuleAssertionsRequired.java:43)
      [mvn] 		at org.apache.lucene.util.TestRuleMarkFailure$1.evaluate(TestRuleMarkFailure.java:48)
      [mvn] 		at org.apache.lucene.util.TestRuleIgnoreAfterMaxFailures$1.evaluate(TestRuleIgnoreAfterMaxFailures.java:70)
      [mvn] 		at org.apache.lucene.util.TestRuleIgnoreTestSuites$1.evaluate(TestRuleIgnoreTestSuites.java:55)
      [mvn] 		at com.carrotsearch.randomizedtesting.rules.StatementAdapter.evaluate(StatementAdapter.java:36)
      [mvn] 		at com.carrotsearch.randomizedtesting.ThreadLeakControl$StatementRunner.run(ThreadLeakControl.java:358)
      [mvn] 		at java.lang.Thread.run(Thread.java:679)
      [mvn] 	
      [mvn] 3369 T254 C1 oasc.SolrException.log SEVERE org.apache.solr.common.SolrException: range facet infinite loop: gap is either zero, or too small relative start/end and caused underflow: Sat Sep 22 10:46:02 CDT 2012 + +0DAYS = Sat Sep 22 10:46:02 CDT 2012
      [mvn] 		at org.apache.solr.request.SimpleFacets.getFacetRangeCounts(SimpleFacets.java:1122)
      [mvn] 		at org.apache.solr.request.SimpleFacets.getFacetRangeCounts(SimpleFacets.java:1074)
      [mvn] 		at org.apache.solr.request.SimpleFacets.getFacetRangeCounts(SimpleFacets.java:1018)
      [mvn] 		at org.apache.solr.request.SimpleFacets.getFacetCounts(SimpleFacets.java:208)
      [mvn] 		at org.apache.solr.handler.component.FacetComponent.process(FacetComponent.java:87)
      [mvn] 		at org.apache.solr.handler.component.SearchHandler.handleRequestBody(SearchHandler.java:206)
      [mvn] 		at org.apache.solr.handler.RequestHandlerBase.handleRequest(RequestHandlerBase.java:129)
      [mvn] 		at org.apache.solr.core.SolrCore.execute(SolrCore.java:1701)
      [mvn] 		at org.apache.solr.util.TestHarness.query(TestHarness.java:364)
      [mvn] 		at org.apache.solr.util.TestHarness.query(TestHarness.java:346)
      [mvn] 		at org.apache.solr.SolrTestCaseJ4.assertQEx(SolrTestCaseJ4.java:618)
      [mvn] 		at org.apache.solr.request.SimpleFacetsTest.testRangeFacetInfiniteLoopDetection(SimpleFacetsTest.java:2063)
      [mvn] 		at sun.reflect.NativeMethodAccessorImpl.invoke0(Native Method)
      [mvn] 		at sun.reflect.NativeMethodAccessorImpl.invoke(NativeMethodAccessorImpl.java:57)
      [mvn] 		at sun.reflect.DelegatingMethodAccessorImpl.invoke(DelegatingMethodAccessorImpl.java:43)
      [mvn] 		at java.lang.reflect.Method.invoke(Method.java:616)
      [mvn] 		at com.carrotsearch.randomizedtesting.RandomizedRunner.invoke(RandomizedRunner.java:1559)
      [mvn] 		at com.carrotsearch.randomizedtesting.RandomizedRunner.access$600(RandomizedRunner.java:79)
      [mvn] 		at com.carrotsearch.randomizedtesting.RandomizedRunner$6.evaluate(RandomizedRunner.java:737)
      [mvn] 		at com.carrotsearch.randomizedtesting.RandomizedRunner$7.evaluate(RandomizedRunner.java:773)
      [mvn] 		at com.carrotsearch.randomizedtesting.RandomizedRunner$8.evaluate(RandomizedRunner.java:787)
      [mvn] 		at com.carrotsearch.randomizedtesting.rules.SystemPropertiesRestoreRule$1.evaluate(SystemPropertiesRestoreRule.java:53)
      [mvn] 		at org.apache.lucene.util.TestRuleSetupTeardownChained$1.evaluate(TestRuleSetupTeardownChained.java:50)
      [mvn] 		at org.apache.lucene.util.TestRuleFieldCacheSanity$1.evaluate(TestRuleFieldCacheSanity.java:51)
      [mvn] 		at org.apache.lucene.util.AbstractBeforeAfterRule$1.evaluate(AbstractBeforeAfterRule.java:45)
      [mvn] 		at com.carrotsearch.randomizedtesting.rules.SystemPropertiesInvariantRule$1.evaluate(SystemPropertiesInvariantRule.java:55)
      [mvn] 		at org.apache.lucene.util.TestRuleThreadAndTestName$1.evaluate(TestRuleThreadAndTestName.java:48)
      [mvn] 		at org.apache.lucene.util.TestRuleIgnoreAfterMaxFailures$1.evaluate(TestRuleIgnoreAfterMaxFailures.java:70)
      [mvn] 		at org.apache.lucene.util.TestRuleMarkFailure$1.evaluate(TestRuleMarkFailure.java:48)
      [mvn] 		at com.carrotsearch.randomizedtesting.rules.StatementAdapter.evaluate(StatementAdapter.java:36)
      [mvn] 		at com.carrotsearch.randomizedtesting.ThreadLeakControl$StatementRunner.run(ThreadLeakControl.java:358)
      [mvn] 		at com.carrotsearch.randomizedtesting.ThreadLeakControl.forkTimeoutingTask(ThreadLeakControl.java:782)
      [mvn] 		at com.carrotsearch.randomizedtesting.ThreadLeakControl$3.evaluate(ThreadLeakControl.java:442)
      [mvn] 		at com.carrotsearch.randomizedtesting.RandomizedRunner.runSingleTest(RandomizedRunner.java:746)
      [mvn] 		at com.carrotsearch.randomizedtesting.RandomizedRunner$3.evaluate(RandomizedRunner.java:648)
      [mvn] 		at com.carrotsearch.randomizedtesting.RandomizedRunner$4.evaluate(RandomizedRunner.java:682)
      [mvn] 		at com.carrotsearch.randomizedtesting.RandomizedRunner$5.evaluate(RandomizedRunner.java:693)
      [mvn] 		at com.carrotsearch.randomizedtesting.rules.StatementAdapter.evaluate(StatementAdapter.java:36)
      [mvn] 		at com.carrotsearch.randomizedtesting.rules.SystemPropertiesRestoreRule$1.evaluate(SystemPropertiesRestoreRule.java:53)
      [mvn] 		at org.apache.lucene.util.AbstractBeforeAfterRule$1.evaluate(AbstractBeforeAfterRule.java:45)
      [mvn] 		at org.apache.lucene.util.TestRuleStoreClassName$1.evaluate(TestRuleStoreClassName.java:42)
      [mvn] 		at com.carrotsearch.randomizedtesting.rules.SystemPropertiesInvariantRule$1.evaluate(SystemPropertiesInvariantRule.java:55)
      [mvn] 		at com.carrotsearch.randomizedtesting.rules.NoShadowingOrOverridesOnMethodsRule$1.evaluate(NoShadowingOrOverridesOnMethodsRule.java:39)
      [mvn] 		at com.carrotsearch.randomizedtesting.rules.NoShadowingOrOverridesOnMethodsRule$1.evaluate(NoShadowingOrOverridesOnMethodsRule.java:39)
      [mvn] 		at com.carrotsearch.randomizedtesting.rules.StatementAdapter.evaluate(StatementAdapter.java:36)
      [mvn] 		at org.apache.lucene.util.TestRuleAssertionsRequired$1.evaluate(TestRuleAssertionsRequired.java:43)
      [mvn] 		at org.apache.lucene.util.TestRuleMarkFailure$1.evaluate(TestRuleMarkFailure.java:48)
      [mvn] 		at org.apache.lucene.util.TestRuleIgnoreAfterMaxFailures$1.evaluate(TestRuleIgnoreAfterMaxFailures.java:70)
      [mvn] 		at org.apache.lucene.util.TestRuleIgnoreTestSuites$1.evaluate(TestRuleIgnoreTestSuites.java:55)
      [mvn] 		at com.carrotsearch.randomizedtesting.rules.StatementAdapter.evaluate(StatementAdapter.java:36)
      [mvn] 		at com.carrotsearch.randomizedtesting.ThreadLeakControl$StatementRunner.run(ThreadLeakControl.java:358)
      [mvn] 		at java.lang.Thread.run(Thread.java:679)
      [mvn] 	
      [mvn] 3370 T254 C1 oasc.SolrException.log SEVERE org.apache.solr.common.SolrException: date facet infinite loop: gap is effectively zero
      [mvn] 		at org.apache.solr.request.SimpleFacets.getFacetDateCounts(SimpleFacets.java:928)
      [mvn] 		at org.apache.solr.request.SimpleFacets.getFacetDateCounts(SimpleFacets.java:837)
      [mvn] 		at org.apache.solr.request.SimpleFacets.getFacetCounts(SimpleFacets.java:207)
      [mvn] 		at org.apache.solr.handler.component.FacetComponent.process(FacetComponent.java:87)
      [mvn] 		at org.apache.solr.handler.component.SearchHandler.handleRequestBody(SearchHandler.java:206)
      [mvn] 		at org.apache.solr.handler.RequestHandlerBase.handleRequest(RequestHandlerBase.java:129)
      [mvn] 		at org.apache.solr.core.SolrCore.execute(SolrCore.java:1701)
      [mvn] 		at org.apache.solr.util.TestHarness.query(TestHarness.java:364)
      [mvn] 		at org.apache.solr.util.TestHarness.query(TestHarness.java:346)
      [mvn] 		at org.apache.solr.SolrTestCaseJ4.assertQEx(SolrTestCaseJ4.java:618)
      [mvn] 		at org.apache.solr.request.SimpleFacetsTest.testRangeFacetInfiniteLoopDetection(SimpleFacetsTest.java:2063)
      [mvn] 		at sun.reflect.NativeMethodAccessorImpl.invoke0(Native Method)
      [mvn] 		at sun.reflect.NativeMethodAccessorImpl.invoke(NativeMethodAccessorImpl.java:57)
      [mvn] 		at sun.reflect.DelegatingMethodAccessorImpl.invoke(DelegatingMethodAccessorImpl.java:43)
      [mvn] 		at java.lang.reflect.Method.invoke(Method.java:616)
      [mvn] 		at com.carrotsearch.randomizedtesting.RandomizedRunner.invoke(RandomizedRunner.java:1559)
      [mvn] 		at com.carrotsearch.randomizedtesting.RandomizedRunner.access$600(RandomizedRunner.java:79)
      [mvn] 		at com.carrotsearch.randomizedtesting.RandomizedRunner$6.evaluate(RandomizedRunner.java:737)
      [mvn] 		at com.carrotsearch.randomizedtesting.RandomizedRunner$7.evaluate(RandomizedRunner.java:773)
      [mvn] 		at com.carrotsearch.randomizedtesting.RandomizedRunner$8.evaluate(RandomizedRunner.java:787)
      [mvn] 		at com.carrotsearch.randomizedtesting.rules.SystemPropertiesRestoreRule$1.evaluate(SystemPropertiesRestoreRule.java:53)
      [mvn] 		at org.apache.lucene.util.TestRuleSetupTeardownChained$1.evaluate(TestRuleSetupTeardownChained.java:50)
      [mvn] 		at org.apache.lucene.util.TestRuleFieldCacheSanity$1.evaluate(TestRuleFieldCacheSanity.java:51)
      [mvn] 		at org.apache.lucene.util.AbstractBeforeAfterRule$1.evaluate(AbstractBeforeAfterRule.java:45)
      [mvn] 		at com.carrotsearch.randomizedtesting.rules.SystemPropertiesInvariantRule$1.evaluate(SystemPropertiesInvariantRule.java:55)
      [mvn] 		at org.apache.lucene.util.TestRuleThreadAndTestName$1.evaluate(TestRuleThreadAndTestName.java:48)
      [mvn] 		at org.apache.lucene.util.TestRuleIgnoreAfterMaxFailures$1.evaluate(TestRuleIgnoreAfterMaxFailures.java:70)
      [mvn] 		at org.apache.lucene.util.TestRuleMarkFailure$1.evaluate(TestRuleMarkFailure.java:48)
      [mvn] 		at com.carrotsearch.randomizedtesting.rules.StatementAdapter.evaluate(StatementAdapter.java:36)
      [mvn] 		at com.carrotsearch.randomizedtesting.ThreadLeakControl$StatementRunner.run(ThreadLeakControl.java:358)
      [mvn] 		at com.carrotsearch.randomizedtesting.ThreadLeakControl.forkTimeoutingTask(ThreadLeakControl.java:782)
      [mvn] 		at com.carrotsearch.randomizedtesting.ThreadLeakControl$3.evaluate(ThreadLeakControl.java:442)
      [mvn] 		at com.carrotsearch.randomizedtesting.RandomizedRunner.runSingleTest(RandomizedRunner.java:746)
      [mvn] 		at com.carrotsearch.randomizedtesting.RandomizedRunner$3.evaluate(RandomizedRunner.java:648)
      [mvn] 		at com.carrotsearch.randomizedtesting.RandomizedRunner$4.evaluate(RandomizedRunner.java:682)
      [mvn] 		at com.carrotsearch.randomizedtesting.RandomizedRunner$5.evaluate(RandomizedRunner.java:693)
      [mvn] 		at com.carrotsearch.randomizedtesting.rules.StatementAdapter.evaluate(StatementAdapter.java:36)
      [mvn] 		at com.carrotsearch.randomizedtesting.rules.SystemPropertiesRestoreRule$1.evaluate(SystemPropertiesRestoreRule.java:53)
      [mvn] 		at org.apache.lucene.util.AbstractBeforeAfterRule$1.evaluate(AbstractBeforeAfterRule.java:45)
      [mvn] 		at org.apache.lucene.util.TestRuleStoreClassName$1.evaluate(TestRuleStoreClassName.java:42)
      [mvn] 		at com.carrotsearch.randomizedtesting.rules.SystemPropertiesInvariantRule$1.evaluate(SystemPropertiesInvariantRule.java:55)
      [mvn] 		at com.carrotsearch.randomizedtesting.rules.NoShadowingOrOverridesOnMethodsRule$1.evaluate(NoShadowingOrOverridesOnMethodsRule.java:39)
      [mvn] 		at com.carrotsearch.randomizedtesting.rules.NoShadowingOrOverridesOnMethodsRule$1.evaluate(NoShadowingOrOverridesOnMethodsRule.java:39)
      [mvn] 		at com.carrotsearch.randomizedtesting.rules.StatementAdapter.evaluate(StatementAdapter.java:36)
      [mvn] 		at org.apache.lucene.util.TestRuleAssertionsRequired$1.evaluate(TestRuleAssertionsRequired.java:43)
      [mvn] 		at org.apache.lucene.util.TestRuleMarkFailure$1.evaluate(TestRuleMarkFailure.java:48)
      [mvn] 		at org.apache.lucene.util.TestRuleIgnoreAfterMaxFailures$1.evaluate(TestRuleIgnoreAfterMaxFailures.java:70)
      [mvn] 		at org.apache.lucene.util.TestRuleIgnoreTestSuites$1.evaluate(TestRuleIgnoreTestSuites.java:55)
      [mvn] 		at com.carrotsearch.randomizedtesting.rules.StatementAdapter.evaluate(StatementAdapter.java:36)
      [mvn] 		at com.carrotsearch.randomizedtesting.ThreadLeakControl$StatementRunner.run(ThreadLeakControl.java:358)
      [mvn] 		at java.lang.Thread.run(Thread.java:679)
      [mvn] 	
      [mvn] 3371 T254 C1 oasc.SolrException.log SEVERE org.apache.solr.common.SolrException: range facet infinite loop: gap is either zero, or too small relative start/end and caused underflow: Sat Sep 22 10:46:02 CDT 2012 + +0DAYS = Sat Sep 22 10:46:02 CDT 2012
      [mvn] 		at org.apache.solr.request.SimpleFacets.getFacetRangeCounts(SimpleFacets.java:1122)
      [mvn] 		at org.apache.solr.request.SimpleFacets.getFacetRangeCounts(SimpleFacets.java:1074)
      [mvn] 		at org.apache.solr.request.SimpleFacets.getFacetRangeCounts(SimpleFacets.java:1018)
      [mvn] 		at org.apache.solr.request.SimpleFacets.getFacetCounts(SimpleFacets.java:208)
      [mvn] 		at org.apache.solr.handler.component.FacetComponent.process(FacetComponent.java:87)
      [mvn] 		at org.apache.solr.handler.component.SearchHandler.handleRequestBody(SearchHandler.java:206)
      [mvn] 		at org.apache.solr.handler.RequestHandlerBase.handleRequest(RequestHandlerBase.java:129)
      [mvn] 		at org.apache.solr.core.SolrCore.execute(SolrCore.java:1701)
      [mvn] 		at org.apache.solr.util.TestHarness.query(TestHarness.java:364)
      [mvn] 		at org.apache.solr.util.TestHarness.query(TestHarness.java:346)
      [mvn] 		at org.apache.solr.SolrTestCaseJ4.assertQEx(SolrTestCaseJ4.java:618)
      [mvn] 		at org.apache.solr.request.SimpleFacetsTest.testRangeFacetInfiniteLoopDetection(SimpleFacetsTest.java:2063)
      [mvn] 		at sun.reflect.NativeMethodAccessorImpl.invoke0(Native Method)
      [mvn] 		at sun.reflect.NativeMethodAccessorImpl.invoke(NativeMethodAccessorImpl.java:57)
      [mvn] 		at sun.reflect.DelegatingMethodAccessorImpl.invoke(DelegatingMethodAccessorImpl.java:43)
      [mvn] 		at java.lang.reflect.Method.invoke(Method.java:616)
      [mvn] 		at com.carrotsearch.randomizedtesting.RandomizedRunner.invoke(RandomizedRunner.java:1559)
      [mvn] 		at com.carrotsearch.randomizedtesting.RandomizedRunner.access$600(RandomizedRunner.java:79)
      [mvn] 		at com.carrotsearch.randomizedtesting.RandomizedRunner$6.evaluate(RandomizedRunner.java:737)
      [mvn] 		at com.carrotsearch.randomizedtesting.RandomizedRunner$7.evaluate(RandomizedRunner.java:773)
      [mvn] 		at com.carrotsearch.randomizedtesting.RandomizedRunner$8.evaluate(RandomizedRunner.java:787)
      [mvn] 		at com.carrotsearch.randomizedtesting.rules.SystemPropertiesRestoreRule$1.evaluate(SystemPropertiesRestoreRule.java:53)
      [mvn] 		at org.apache.lucene.util.TestRuleSetupTeardownChained$1.evaluate(TestRuleSetupTeardownChained.java:50)
      [mvn] 		at org.apache.lucene.util.TestRuleFieldCacheSanity$1.evaluate(TestRuleFieldCacheSanity.java:51)
      [mvn] 		at org.apache.lucene.util.AbstractBeforeAfterRule$1.evaluate(AbstractBeforeAfterRule.java:45)
      [mvn] 		at com.carrotsearch.randomizedtesting.rules.SystemPropertiesInvariantRule$1.evaluate(SystemPropertiesInvariantRule.java:55)
      [mvn] 		at org.apache.lucene.util.TestRuleThreadAndTestName$1.evaluate(TestRuleThreadAndTestName.java:48)
      [mvn] 		at org.apache.lucene.util.TestRuleIgnoreAfterMaxFailures$1.evaluate(TestRuleIgnoreAfterMaxFailures.java:70)
      [mvn] 		at org.apache.lucene.util.TestRuleMarkFailure$1.evaluate(TestRuleMarkFailure.java:48)
      [mvn] 		at com.carrotsearch.randomizedtesting.rules.StatementAdapter.evaluate(StatementAdapter.java:36)
      [mvn] 		at com.carrotsearch.randomizedtesting.ThreadLeakControl$StatementRunner.run(ThreadLeakControl.java:358)
      [mvn] 		at com.carrotsearch.randomizedtesting.ThreadLeakControl.forkTimeoutingTask(ThreadLeakControl.java:782)
      [mvn] 		at com.carrotsearch.randomizedtesting.ThreadLeakControl$3.evaluate(ThreadLeakControl.java:442)
      [mvn] 		at com.carrotsearch.randomizedtesting.RandomizedRunner.runSingleTest(RandomizedRunner.java:746)
      [mvn] 		at com.carrotsearch.randomizedtesting.RandomizedRunner$3.evaluate(RandomizedRunner.java:648)
      [mvn] 		at com.carrotsearch.randomizedtesting.RandomizedRunner$4.evaluate(RandomizedRunner.java:682)
      [mvn] 		at com.carrotsearch.randomizedtesting.RandomizedRunner$5.evaluate(RandomizedRunner.java:693)
      [mvn] 		at com.carrotsearch.randomizedtesting.rules.StatementAdapter.evaluate(StatementAdapter.java:36)
      [mvn] 		at com.carrotsearch.randomizedtesting.rules.SystemPropertiesRestoreRule$1.evaluate(SystemPropertiesRestoreRule.java:53)
      [mvn] 		at org.apache.lucene.util.AbstractBeforeAfterRule$1.evaluate(AbstractBeforeAfterRule.java:45)
      [mvn] 		at org.apache.lucene.util.TestRuleStoreClassName$1.evaluate(TestRuleStoreClassName.java:42)
      [mvn] 		at com.carrotsearch.randomizedtesting.rules.SystemPropertiesInvariantRule$1.evaluate(SystemPropertiesInvariantRule.java:55)
      [mvn] 		at com.carrotsearch.randomizedtesting.rules.NoShadowingOrOverridesOnMethodsRule$1.evaluate(NoShadowingOrOverridesOnMethodsRule.java:39)
      [mvn] 		at com.carrotsearch.randomizedtesting.rules.NoShadowingOrOverridesOnMethodsRule$1.evaluate(NoShadowingOrOverridesOnMethodsRule.java:39)
      [mvn] 		at com.carrotsearch.randomizedtesting.rules.StatementAdapter.evaluate(StatementAdapter.java:36)
      [mvn] 		at org.apache.lucene.util.TestRuleAssertionsRequired$1.evaluate(TestRuleAssertionsRequired.java:43)
      [mvn] 		at org.apache.lucene.util.TestRuleMarkFailure$1.evaluate(TestRuleMarkFailure.java:48)
      [mvn] 		at org.apache.lucene.util.TestRuleIgnoreAfterMaxFailures$1.evaluate(TestRuleIgnoreAfterMaxFailures.java:70)
      [mvn] 		at org.apache.lucene.util.TestRuleIgnoreTestSuites$1.evaluate(TestRuleIgnoreTestSuites.java:55)
      [mvn] 		at com.carrotsearch.randomizedtesting.rules.StatementAdapter.evaluate(StatementAdapter.java:36)
      [mvn] 		at com.carrotsearch.randomizedtesting.ThreadLeakControl$StatementRunner.run(ThreadLeakControl.java:358)
      [mvn] 		at java.lang.Thread.run(Thread.java:679)
      [mvn] 	
      [mvn] 3372 T254 C1 oasc.SolrException.log SEVERE org.apache.solr.common.SolrException: range facet infinite loop: gap is either zero, or too small relative start/end and caused underflow: 9.9999998E10 + 2160 = 9.9999998E10
      [mvn] 		at org.apache.solr.request.SimpleFacets.getFacetRangeCounts(SimpleFacets.java:1122)
      [mvn] 		at org.apache.solr.request.SimpleFacets.getFacetRangeCounts(SimpleFacets.java:1074)
      [mvn] 		at org.apache.solr.request.SimpleFacets.getFacetRangeCounts(SimpleFacets.java:1018)
      [mvn] 		at org.apache.solr.request.SimpleFacets.getFacetCounts(SimpleFacets.java:208)
      [mvn] 		at org.apache.solr.handler.component.FacetComponent.process(FacetComponent.java:87)
      [mvn] 		at org.apache.solr.handler.component.SearchHandler.handleRequestBody(SearchHandler.java:206)
      [mvn] 		at org.apache.solr.handler.RequestHandlerBase.handleRequest(RequestHandlerBase.java:129)
      [mvn] 		at org.apache.solr.core.SolrCore.execute(SolrCore.java:1701)
      [mvn] 		at org.apache.solr.util.TestHarness.query(TestHarness.java:364)
      [mvn] 		at org.apache.solr.util.TestHarness.query(TestHarness.java:346)
      [mvn] 		at org.apache.solr.SolrTestCaseJ4.assertQEx(SolrTestCaseJ4.java:618)
      [mvn] 		at org.apache.solr.request.SimpleFacetsTest.testRangeFacetInfiniteLoopDetection(SimpleFacetsTest.java:2075)
      [mvn] 		at sun.reflect.NativeMethodAccessorImpl.invoke0(Native Method)
      [mvn] 		at sun.reflect.NativeMethodAccessorImpl.invoke(NativeMethodAccessorImpl.java:57)
      [mvn] 		at sun.reflect.DelegatingMethodAccessorImpl.invoke(DelegatingMethodAccessorImpl.java:43)
      [mvn] 		at java.lang.reflect.Method.invoke(Method.java:616)
      [mvn] 		at com.carrotsearch.randomizedtesting.RandomizedRunner.invoke(RandomizedRunner.java:1559)
      [mvn] 		at com.carrotsearch.randomizedtesting.RandomizedRunner.access$600(RandomizedRunner.java:79)
      [mvn] 		at com.carrotsearch.randomizedtesting.RandomizedRunner$6.evaluate(RandomizedRunner.java:737)
      [mvn] 		at com.carrotsearch.randomizedtesting.RandomizedRunner$7.evaluate(RandomizedRunner.java:773)
      [mvn] 		at com.carrotsearch.randomizedtesting.RandomizedRunner$8.evaluate(RandomizedRunner.java:787)
      [mvn] 		at com.carrotsearch.randomizedtesting.rules.SystemPropertiesRestoreRule$1.evaluate(SystemPropertiesRestoreRule.java:53)
      [mvn] 		at org.apache.lucene.util.TestRuleSetupTeardownChained$1.evaluate(TestRuleSetupTeardownChained.java:50)
      [mvn] 		at org.apache.lucene.util.TestRuleFieldCacheSanity$1.evaluate(TestRuleFieldCacheSanity.java:51)
      [mvn] 		at org.apache.lucene.util.AbstractBeforeAfterRule$1.evaluate(AbstractBeforeAfterRule.java:45)
      [mvn] 		at com.carrotsearch.randomizedtesting.rules.SystemPropertiesInvariantRule$1.evaluate(SystemPropertiesInvariantRule.java:55)
      [mvn] 		at org.apache.lucene.util.TestRuleThreadAndTestName$1.evaluate(TestRuleThreadAndTestName.java:48)
      [mvn] 		at org.apache.lucene.util.TestRuleIgnoreAfterMaxFailures$1.evaluate(TestRuleIgnoreAfterMaxFailures.java:70)
      [mvn] 		at org.apache.lucene.util.TestRuleMarkFailure$1.evaluate(TestRuleMarkFailure.java:48)
      [mvn] 		at com.carrotsearch.randomizedtesting.rules.StatementAdapter.evaluate(StatementAdapter.java:36)
      [mvn] 		at com.carrotsearch.randomizedtesting.ThreadLeakControl$StatementRunner.run(ThreadLeakControl.java:358)
      [mvn] 		at com.carrotsearch.randomizedtesting.ThreadLeakControl.forkTimeoutingTask(ThreadLeakControl.java:782)
      [mvn] 		at com.carrotsearch.randomizedtesting.ThreadLeakControl$3.evaluate(ThreadLeakControl.java:442)
      [mvn] 		at com.carrotsearch.randomizedtesting.RandomizedRunner.runSingleTest(RandomizedRunner.java:746)
      [mvn] 		at com.carrotsearch.randomizedtesting.RandomizedRunner$3.evaluate(RandomizedRunner.java:648)
      [mvn] 		at com.carrotsearch.randomizedtesting.RandomizedRunner$4.evaluate(RandomizedRunner.java:682)
      [mvn] 		at com.carrotsearch.randomizedtesting.RandomizedRunner$5.evaluate(RandomizedRunner.java:693)
      [mvn] 		at com.carrotsearch.randomizedtesting.rules.StatementAdapter.evaluate(StatementAdapter.java:36)
      [mvn] 		at com.carrotsearch.randomizedtesting.rules.SystemPropertiesRestoreRule$1.evaluate(SystemPropertiesRestoreRule.java:53)
      [mvn] 		at org.apache.lucene.util.AbstractBeforeAfterRule$1.evaluate(AbstractBeforeAfterRule.java:45)
      [mvn] 		at org.apache.lucene.util.TestRuleStoreClassName$1.evaluate(TestRuleStoreClassName.java:42)
      [mvn] 		at com.carrotsearch.randomizedtesting.rules.SystemPropertiesInvariantRule$1.evaluate(SystemPropertiesInvariantRule.java:55)
      [mvn] 		at com.carrotsearch.randomizedtesting.rules.NoShadowingOrOverridesOnMethodsRule$1.evaluate(NoShadowingOrOverridesOnMethodsRule.java:39)
      [mvn] 		at com.carrotsearch.randomizedtesting.rules.NoShadowingOrOverridesOnMethodsRule$1.evaluate(NoShadowingOrOverridesOnMethodsRule.java:39)
      [mvn] 		at com.carrotsearch.randomizedtesting.rules.StatementAdapter.evaluate(StatementAdapter.java:36)
      [mvn] 		at org.apache.lucene.util.TestRuleAssertionsRequired$1.evaluate(TestRuleAssertionsRequired.java:43)
      [mvn] 		at org.apache.lucene.util.TestRuleMarkFailure$1.evaluate(TestRuleMarkFailure.java:48)
      [mvn] 		at org.apache.lucene.util.TestRuleIgnoreAfterMaxFailures$1.evaluate(TestRuleIgnoreAfterMaxFailures.java:70)
      [mvn] 		at org.apache.lucene.util.TestRuleIgnoreTestSuites$1.evaluate(TestRuleIgnoreTestSuites.java:55)
      [mvn] 		at com.carrotsearch.randomizedtesting.rules.StatementAdapter.evaluate(StatementAdapter.java:36)
      [mvn] 		at com.carrotsearch.randomizedtesting.ThreadLeakControl$StatementRunner.run(ThreadLeakControl.java:358)
      [mvn] 		at java.lang.Thread.run(Thread.java:679)
      [mvn] 	
      [mvn] 3373 T254 C1 oasc.SolrException.log SEVERE org.apache.solr.common.SolrException: range facet infinite loop: gap is either zero, or too small relative start/end and caused underflow: 9.9999998E10 + 2160 = 9.9999998E10
      [mvn] 		at org.apache.solr.request.SimpleFacets.getFacetRangeCounts(SimpleFacets.java:1122)
      [mvn] 		at org.apache.solr.request.SimpleFacets.getFacetRangeCounts(SimpleFacets.java:1074)
      [mvn] 		at org.apache.solr.request.SimpleFacets.getFacetRangeCounts(SimpleFacets.java:1018)
      [mvn] 		at org.apache.solr.request.SimpleFacets.getFacetCounts(SimpleFacets.java:208)
      [mvn] 		at org.apache.solr.handler.component.FacetComponent.process(FacetComponent.java:87)
      [mvn] 		at org.apache.solr.handler.component.SearchHandler.handleRequestBody(SearchHandler.java:206)
      [mvn] 		at org.apache.solr.handler.RequestHandlerBase.handleRequest(RequestHandlerBase.java:129)
      [mvn] 		at org.apache.solr.core.SolrCore.execute(SolrCore.java:1701)
      [mvn] 		at org.apache.solr.util.TestHarness.query(TestHarness.java:364)
      [mvn] 		at org.apache.solr.util.TestHarness.query(TestHarness.java:346)
      [mvn] 		at org.apache.solr.SolrTestCaseJ4.assertQEx(SolrTestCaseJ4.java:618)
      [mvn] 		at org.apache.solr.request.SimpleFacetsTest.testRangeFacetInfiniteLoopDetection(SimpleFacetsTest.java:2075)
      [mvn] 		at sun.reflect.NativeMethodAccessorImpl.invoke0(Native Method)
      [mvn] 		at sun.reflect.NativeMethodAccessorImpl.invoke(NativeMethodAccessorImpl.java:57)
      [mvn] 		at sun.reflect.DelegatingMethodAccessorImpl.invoke(DelegatingMethodAccessorImpl.java:43)
      [mvn] 		at java.lang.reflect.Method.invoke(Method.java:616)
      [mvn] 		at com.carrotsearch.randomizedtesting.RandomizedRunner.invoke(RandomizedRunner.java:1559)
      [mvn] 		at com.carrotsearch.randomizedtesting.RandomizedRunner.access$600(RandomizedRunner.java:79)
      [mvn] 		at com.carrotsearch.randomizedtesting.RandomizedRunner$6.evaluate(RandomizedRunner.java:737)
      [mvn] 		at com.carrotsearch.randomizedtesting.RandomizedRunner$7.evaluate(RandomizedRunner.java:773)
      [mvn] 		at com.carrotsearch.randomizedtesting.RandomizedRunner$8.evaluate(RandomizedRunner.java:787)
      [mvn] 		at com.carrotsearch.randomizedtesting.rules.SystemPropertiesRestoreRule$1.evaluate(SystemPropertiesRestoreRule.java:53)
      [mvn] 		at org.apache.lucene.util.TestRuleSetupTeardownChained$1.evaluate(TestRuleSetupTeardownChained.java:50)
      [mvn] 		at org.apache.lucene.util.TestRuleFieldCacheSanity$1.evaluate(TestRuleFieldCacheSanity.java:51)
      [mvn] 		at org.apache.lucene.util.AbstractBeforeAfterRule$1.evaluate(AbstractBeforeAfterRule.java:45)
      [mvn] 		at com.carrotsearch.randomizedtesting.rules.SystemPropertiesInvariantRule$1.evaluate(SystemPropertiesInvariantRule.java:55)
      [mvn] 		at org.apache.lucene.util.TestRuleThreadAndTestName$1.evaluate(TestRuleThreadAndTestName.java:48)
      [mvn] 		at org.apache.lucene.util.TestRuleIgnoreAfterMaxFailures$1.evaluate(TestRuleIgnoreAfterMaxFailures.java:70)
      [mvn] 		at org.apache.lucene.util.TestRuleMarkFailure$1.evaluate(TestRuleMarkFailure.java:48)
      [mvn] 		at com.carrotsearch.randomizedtesting.rules.StatementAdapter.evaluate(StatementAdapter.java:36)
      [mvn] 		at com.carrotsearch.randomizedtesting.ThreadLeakControl$StatementRunner.run(ThreadLeakControl.java:358)
      [mvn] 		at com.carrotsearch.randomizedtesting.ThreadLeakControl.forkTimeoutingTask(ThreadLeakControl.java:782)
      [mvn] 		at com.carrotsearch.randomizedtesting.ThreadLeakControl$3.evaluate(ThreadLeakControl.java:442)
      [mvn] 		at com.carrotsearch.randomizedtesting.RandomizedRunner.runSingleTest(RandomizedRunner.java:746)
      [mvn] 		at com.carrotsearch.randomizedtesting.RandomizedRunner$3.evaluate(RandomizedRunner.java:648)
      [mvn] 		at com.carrotsearch.randomizedtesting.RandomizedRunner$4.evaluate(RandomizedRunner.java:682)
      [mvn] 		at com.carrotsearch.randomizedtesting.RandomizedRunner$5.evaluate(RandomizedRunner.java:693)
      [mvn] 		at com.carrotsearch.randomizedtesting.rules.StatementAdapter.evaluate(StatementAdapter.java:36)
      [mvn] 		at com.carrotsearch.randomizedtesting.rules.SystemPropertiesRestoreRule$1.evaluate(SystemPropertiesRestoreRule.java:53)
      [mvn] 		at org.apache.lucene.util.AbstractBeforeAfterRule$1.evaluate(AbstractBeforeAfterRule.java:45)
      [mvn] 		at org.apache.lucene.util.TestRuleStoreClassName$1.evaluate(TestRuleStoreClassName.java:42)
      [mvn] 		at com.carrotsearch.randomizedtesting.rules.SystemPropertiesInvariantRule$1.evaluate(SystemPropertiesInvariantRule.java:55)
      [mvn] 		at com.carrotsearch.randomizedtesting.rules.NoShadowingOrOverridesOnMethodsRule$1.evaluate(NoShadowingOrOverridesOnMethodsRule.java:39)
      [mvn] 		at com.carrotsearch.randomizedtesting.rules.NoShadowingOrOverridesOnMethodsRule$1.evaluate(NoShadowingOrOverridesOnMethodsRule.java:39)
      [mvn] 		at com.carrotsearch.randomizedtesting.rules.StatementAdapter.evaluate(StatementAdapter.java:36)
      [mvn] 		at org.apache.lucene.util.TestRuleAssertionsRequired$1.evaluate(TestRuleAssertionsRequired.java:43)
      [mvn] 		at org.apache.lucene.util.TestRuleMarkFailure$1.evaluate(TestRuleMarkFailure.java:48)
      [mvn] 		at org.apache.lucene.util.TestRuleIgnoreAfterMaxFailures$1.evaluate(TestRuleIgnoreAfterMaxFailures.java:70)
      [mvn] 		at org.apache.lucene.util.TestRuleIgnoreTestSuites$1.evaluate(TestRuleIgnoreTestSuites.java:55)
      [mvn] 		at com.carrotsearch.randomizedtesting.rules.StatementAdapter.evaluate(StatementAdapter.java:36)
      [mvn] 		at com.carrotsearch.randomizedtesting.ThreadLeakControl$StatementRunner.run(ThreadLeakControl.java:358)
      [mvn] 		at java.lang.Thread.run(Thread.java:679)
      [mvn] 	
      [mvn] 3374 T254 C1 oasc.SolrException.log SEVERE org.apache.solr.common.SolrException: range facet infinite loop: gap is either zero, or too small relative start/end and caused underflow: 9.9E12 + 0.0003 = 9.9E12
      [mvn] 		at org.apache.solr.request.SimpleFacets.getFacetRangeCounts(SimpleFacets.java:1122)
      [mvn] 		at org.apache.solr.request.SimpleFacets.getFacetRangeCounts(SimpleFacets.java:1074)
      [mvn] 		at org.apache.solr.request.SimpleFacets.getFacetRangeCounts(SimpleFacets.java:1018)
      [mvn] 		at org.apache.solr.request.SimpleFacets.getFacetCounts(SimpleFacets.java:208)
      [mvn] 		at org.apache.solr.handler.component.FacetComponent.process(FacetComponent.java:87)
      [mvn] 		at org.apache.solr.handler.component.SearchHandler.handleRequestBody(SearchHandler.java:206)
      [mvn] 		at org.apache.solr.handler.RequestHandlerBase.handleRequest(RequestHandlerBase.java:129)
      [mvn] 		at org.apache.solr.core.SolrCore.execute(SolrCore.java:1701)
      [mvn] 		at org.apache.solr.util.TestHarness.query(TestHarness.java:364)
      [mvn] 		at org.apache.solr.util.TestHarness.query(TestHarness.java:346)
      [mvn] 		at org.apache.solr.SolrTestCaseJ4.assertQEx(SolrTestCaseJ4.java:618)
      [mvn] 		at org.apache.solr.request.SimpleFacetsTest.testRangeFacetInfiniteLoopDetection(SimpleFacetsTest.java:2086)
      [mvn] 		at sun.reflect.NativeMethodAccessorImpl.invoke0(Native Method)
      [mvn] 		at sun.reflect.NativeMethodAccessorImpl.invoke(NativeMethodAccessorImpl.java:57)
      [mvn] 		at sun.reflect.DelegatingMethodAccessorImpl.invoke(DelegatingMethodAccessorImpl.java:43)
      [mvn] 		at java.lang.reflect.Method.invoke(Method.java:616)
      [mvn] 		at com.carrotsearch.randomizedtesting.RandomizedRunner.invoke(RandomizedRunner.java:1559)
      [mvn] 		at com.carrotsearch.randomizedtesting.RandomizedRunner.access$600(RandomizedRunner.java:79)
      [mvn] 		at com.carrotsearch.randomizedtesting.RandomizedRunner$6.evaluate(RandomizedRunner.java:737)
      [mvn] 		at com.carrotsearch.randomizedtesting.RandomizedRunner$7.evaluate(RandomizedRunner.java:773)
      [mvn] 		at com.carrotsearch.randomizedtesting.RandomizedRunner$8.evaluate(RandomizedRunner.java:787)
      [mvn] 		at com.carrotsearch.randomizedtesting.rules.SystemPropertiesRestoreRule$1.evaluate(SystemPropertiesRestoreRule.java:53)
      [mvn] 		at org.apache.lucene.util.TestRuleSetupTeardownChained$1.evaluate(TestRuleSetupTeardownChained.java:50)
      [mvn] 		at org.apache.lucene.util.TestRuleFieldCacheSanity$1.evaluate(TestRuleFieldCacheSanity.java:51)
      [mvn] 		at org.apache.lucene.util.AbstractBeforeAfterRule$1.evaluate(AbstractBeforeAfterRule.java:45)
      [mvn] 		at com.carrotsearch.randomizedtesting.rules.SystemPropertiesInvariantRule$1.evaluate(SystemPropertiesInvariantRule.java:55)
      [mvn] 		at org.apache.lucene.util.TestRuleThreadAndTestName$1.evaluate(TestRuleThreadAndTestName.java:48)
      [mvn] 		at org.apache.lucene.util.TestRuleIgnoreAfterMaxFailures$1.evaluate(TestRuleIgnoreAfterMaxFailures.java:70)
      [mvn] 		at org.apache.lucene.util.TestRuleMarkFailure$1.evaluate(TestRuleMarkFailure.java:48)
      [mvn] 		at com.carrotsearch.randomizedtesting.rules.StatementAdapter.evaluate(StatementAdapter.java:36)
      [mvn] 		at com.carrotsearch.randomizedtesting.ThreadLeakControl$StatementRunner.run(ThreadLeakControl.java:358)
      [mvn] 		at com.carrotsearch.randomizedtesting.ThreadLeakControl.forkTimeoutingTask(ThreadLeakControl.java:782)
      [mvn] 		at com.carrotsearch.randomizedtesting.ThreadLeakControl$3.evaluate(ThreadLeakControl.java:442)
      [mvn] 		at com.carrotsearch.randomizedtesting.RandomizedRunner.runSingleTest(RandomizedRunner.java:746)
      [mvn] 		at com.carrotsearch.randomizedtesting.RandomizedRunner$3.evaluate(RandomizedRunner.java:648)
      [mvn] 		at com.carrotsearch.randomizedtesting.RandomizedRunner$4.evaluate(RandomizedRunner.java:682)
      [mvn] 		at com.carrotsearch.randomizedtesting.RandomizedRunner$5.evaluate(RandomizedRunner.java:693)
      [mvn] 		at com.carrotsearch.randomizedtesting.rules.StatementAdapter.evaluate(StatementAdapter.java:36)
      [mvn] 		at com.carrotsearch.randomizedtesting.rules.SystemPropertiesRestoreRule$1.evaluate(SystemPropertiesRestoreRule.java:53)
      [mvn] 		at org.apache.lucene.util.AbstractBeforeAfterRule$1.evaluate(AbstractBeforeAfterRule.java:45)
      [mvn] 		at org.apache.lucene.util.TestRuleStoreClassName$1.evaluate(TestRuleStoreClassName.java:42)
      [mvn] 		at com.carrotsearch.randomizedtesting.rules.SystemPropertiesInvariantRule$1.evaluate(SystemPropertiesInvariantRule.java:55)
      [mvn] 		at com.carrotsearch.randomizedtesting.rules.NoShadowingOrOverridesOnMethodsRule$1.evaluate(NoShadowingOrOverridesOnMethodsRule.java:39)
      [mvn] 		at com.carrotsearch.randomizedtesting.rules.NoShadowingOrOverridesOnMethodsRule$1.evaluate(NoShadowingOrOverridesOnMethodsRule.java:39)
      [mvn] 		at com.carrotsearch.randomizedtesting.rules.StatementAdapter.evaluate(StatementAdapter.java:36)
      [mvn] 		at org.apache.lucene.util.TestRuleAssertionsRequired$1.evaluate(TestRuleAssertionsRequired.java:43)
      [mvn] 		at org.apache.lucene.util.TestRuleMarkFailure$1.evaluate(TestRuleMarkFailure.java:48)
      [mvn] 		at org.apache.lucene.util.TestRuleIgnoreAfterMaxFailures$1.evaluate(TestRuleIgnoreAfterMaxFailures.java:70)
      [mvn] 		at org.apache.lucene.util.TestRuleIgnoreTestSuites$1.evaluate(TestRuleIgnoreTestSuites.java:55)
      [mvn] 		at com.carrotsearch.randomizedtesting.rules.StatementAdapter.evaluate(StatementAdapter.java:36)
      [mvn] 		at com.carrotsearch.randomizedtesting.ThreadLeakControl$StatementRunner.run(ThreadLeakControl.java:358)
      [mvn] 		at java.lang.Thread.run(Thread.java:679)
      [mvn] 	
      [mvn] 3375 T254 C1 oasc.SolrException.log SEVERE org.apache.solr.common.SolrException: range facet infinite loop: gap is either zero, or too small relative start/end and caused underflow: 9.9E12 + 0.0003 = 9.9E12
      [mvn] 		at org.apache.solr.request.SimpleFacets.getFacetRangeCounts(SimpleFacets.java:1122)
      [mvn] 		at org.apache.solr.request.SimpleFacets.getFacetRangeCounts(SimpleFacets.java:1074)
      [mvn] 		at org.apache.solr.request.SimpleFacets.getFacetRangeCounts(SimpleFacets.java:1018)
      [mvn] 		at org.apache.solr.request.SimpleFacets.getFacetCounts(SimpleFacets.java:208)
      [mvn] 		at org.apache.solr.handler.component.FacetComponent.process(FacetComponent.java:87)
      [mvn] 		at org.apache.solr.handler.component.SearchHandler.handleRequestBody(SearchHandler.java:206)
      [mvn] 		at org.apache.solr.handler.RequestHandlerBase.handleRequest(RequestHandlerBase.java:129)
      [mvn] 		at org.apache.solr.core.SolrCore.execute(SolrCore.java:1701)
      [mvn] 		at org.apache.solr.util.TestHarness.query(TestHarness.java:364)
      [mvn] 		at org.apache.solr.util.TestHarness.query(TestHarness.java:346)
      [mvn] 		at org.apache.solr.SolrTestCaseJ4.assertQEx(SolrTestCaseJ4.java:618)
      [mvn] 		at org.apache.solr.request.SimpleFacetsTest.testRangeFacetInfiniteLoopDetection(SimpleFacetsTest.java:2086)
      [mvn] 		at sun.reflect.NativeMethodAccessorImpl.invoke0(Native Method)
      [mvn] 		at sun.reflect.NativeMethodAccessorImpl.invoke(NativeMethodAccessorImpl.java:57)
      [mvn] 		at sun.reflect.DelegatingMethodAccessorImpl.invoke(DelegatingMethodAccessorImpl.java:43)
      [mvn] 		at java.lang.reflect.Method.invoke(Method.java:616)
      [mvn] 		at com.carrotsearch.randomizedtesting.RandomizedRunner.invoke(RandomizedRunner.java:1559)
      [mvn] 		at com.carrotsearch.randomizedtesting.RandomizedRunner.access$600(RandomizedRunner.java:79)
      [mvn] 		at com.carrotsearch.randomizedtesting.RandomizedRunner$6.evaluate(RandomizedRunner.java:737)
      [mvn] 		at com.carrotsearch.randomizedtesting.RandomizedRunner$7.evaluate(RandomizedRunner.java:773)
      [mvn] 		at com.carrotsearch.randomizedtesting.RandomizedRunner$8.evaluate(RandomizedRunner.java:787)
      [mvn] 		at com.carrotsearch.randomizedtesting.rules.SystemPropertiesRestoreRule$1.evaluate(SystemPropertiesRestoreRule.java:53)
      [mvn] 		at org.apache.lucene.util.TestRuleSetupTeardownChained$1.evaluate(TestRuleSetupTeardownChained.java:50)
      [mvn] 		at org.apache.lucene.util.TestRuleFieldCacheSanity$1.evaluate(TestRuleFieldCacheSanity.java:51)
      [mvn] 		at org.apache.lucene.util.AbstractBeforeAfterRule$1.evaluate(AbstractBeforeAfterRule.java:45)
      [mvn] 		at com.carrotsearch.randomizedtesting.rules.SystemPropertiesInvariantRule$1.evaluate(SystemPropertiesInvariantRule.java:55)
      [mvn] 		at org.apache.lucene.util.TestRuleThreadAndTestName$1.evaluate(TestRuleThreadAndTestName.java:48)
      [mvn] 		at org.apache.lucene.util.TestRuleIgnoreAfterMaxFailures$1.evaluate(TestRuleIgnoreAfterMaxFailures.java:70)
      [mvn] 		at org.apache.lucene.util.TestRuleMarkFailure$1.evaluate(TestRuleMarkFailure.java:48)
      [mvn] 		at com.carrotsearch.randomizedtesting.rules.StatementAdapter.evaluate(StatementAdapter.java:36)
      [mvn] 		at com.carrotsearch.randomizedtesting.ThreadLeakControl$StatementRunner.run(ThreadLeakControl.java:358)
      [mvn] 		at com.carrotsearch.randomizedtesting.ThreadLeakControl.forkTimeoutingTask(ThreadLeakControl.java:782)
      [mvn] 		at com.carrotsearch.randomizedtesting.ThreadLeakControl$3.evaluate(ThreadLeakControl.java:442)
      [mvn] 		at com.carrotsearch.randomizedtesting.RandomizedRunner.runSingleTest(RandomizedRunner.java:746)
      [mvn] 		at com.carrotsearch.randomizedtesting.RandomizedRunner$3.evaluate(RandomizedRunner.java:648)
      [mvn] 		at com.carrotsearch.randomizedtesting.RandomizedRunner$4.evaluate(RandomizedRunner.java:682)
      [mvn] 		at com.carrotsearch.randomizedtesting.RandomizedRunner$5.evaluate(RandomizedRunner.java:693)
      [mvn] 		at com.carrotsearch.randomizedtesting.rules.StatementAdapter.evaluate(StatementAdapter.java:36)
      [mvn] 		at com.carrotsearch.randomizedtesting.rules.SystemPropertiesRestoreRule$1.evaluate(SystemPropertiesRestoreRule.java:53)
      [mvn] 		at org.apache.lucene.util.AbstractBeforeAfterRule$1.evaluate(AbstractBeforeAfterRule.java:45)
      [mvn] 		at org.apache.lucene.util.TestRuleStoreClassName$1.evaluate(TestRuleStoreClassName.java:42)
      [mvn] 		at com.carrotsearch.randomizedtesting.rules.SystemPropertiesInvariantRule$1.evaluate(SystemPropertiesInvariantRule.java:55)
      [mvn] 		at com.carrotsearch.randomizedtesting.rules.NoShadowingOrOverridesOnMethodsRule$1.evaluate(NoShadowingOrOverridesOnMethodsRule.java:39)
      [mvn] 		at com.carrotsearch.randomizedtesting.rules.NoShadowingOrOverridesOnMethodsRule$1.evaluate(NoShadowingOrOverridesOnMethodsRule.java:39)
      [mvn] 		at com.carrotsearch.randomizedtesting.rules.StatementAdapter.evaluate(StatementAdapter.java:36)
      [mvn] 		at org.apache.lucene.util.TestRuleAssertionsRequired$1.evaluate(TestRuleAssertionsRequired.java:43)
      [mvn] 		at org.apache.lucene.util.TestRuleMarkFailure$1.evaluate(TestRuleMarkFailure.java:48)
      [mvn] 		at org.apache.lucene.util.TestRuleIgnoreAfterMaxFailures$1.evaluate(TestRuleIgnoreAfterMaxFailures.java:70)
      [mvn] 		at org.apache.lucene.util.TestRuleIgnoreTestSuites$1.evaluate(TestRuleIgnoreTestSuites.java:55)
      [mvn] 		at com.carrotsearch.randomizedtesting.rules.StatementAdapter.evaluate(StatementAdapter.java:36)
      [mvn] 		at com.carrotsearch.randomizedtesting.ThreadLeakControl$StatementRunner.run(ThreadLeakControl.java:358)
      [mvn] 		at java.lang.Thread.run(Thread.java:679)
      [mvn] 	
      [mvn] 3738 T254 C1 oasc.SolrException.log SEVERE org.apache.solr.common.SolrException: Specify the group.field as parameter or local parameter
      [mvn] 		at org.apache.solr.request.SimpleFacets.getGroupedCounts(SimpleFacets.java:360)
      [mvn] 		at org.apache.solr.request.SimpleFacets.getTermCounts(SimpleFacets.java:319)
      [mvn] 		at org.apache.solr.request.SimpleFacets.getFacetFieldCounts(SimpleFacets.java:423)
      [mvn] 		at org.apache.solr.request.SimpleFacets.getFacetCounts(SimpleFacets.java:206)
      [mvn] 		at org.apache.solr.handler.component.FacetComponent.process(FacetComponent.java:87)
      [mvn] 		at org.apache.solr.handler.component.SearchHandler.handleRequestBody(SearchHandler.java:206)
      [mvn] 		at org.apache.solr.handler.RequestHandlerBase.handleRequest(RequestHandlerBase.java:129)
      [mvn] 		at org.apache.solr.core.SolrCore.execute(SolrCore.java:1701)
      [mvn] 		at org.apache.solr.util.TestHarness.query(TestHarness.java:364)
      [mvn] 		at org.apache.solr.util.TestHarness.query(TestHarness.java:346)
      [mvn] 		at org.apache.solr.request.SimpleFacetsTest.testSimpleGroupedFacets(SimpleFacetsTest.java:245)
      [mvn] 		at sun.reflect.NativeMethodAccessorImpl.invoke0(Native Method)
      [mvn] 		at sun.reflect.NativeMethodAccessorImpl.invoke(NativeMethodAccessorImpl.java:57)
      [mvn] 		at sun.reflect.DelegatingMethodAccessorImpl.invoke(DelegatingMethodAccessorImpl.java:43)
      [mvn] 		at java.lang.reflect.Method.invoke(Method.java:616)
      [mvn] 		at com.carrotsearch.randomizedtesting.RandomizedRunner.invoke(RandomizedRunner.java:1559)
      [mvn] 		at com.carrotsearch.randomizedtesting.RandomizedRunner.access$600(RandomizedRunner.java:79)
      [mvn] 		at com.carrotsearch.randomizedtesting.RandomizedRunner$6.evaluate(RandomizedRunner.java:737)
      [mvn] 		at com.carrotsearch.randomizedtesting.RandomizedRunner$7.evaluate(RandomizedRunner.java:773)
      [mvn] 		at com.carrotsearch.randomizedtesting.RandomizedRunner$8.evaluate(RandomizedRunner.java:787)
      [mvn] 		at com.carrotsearch.randomizedtesting.rules.SystemPropertiesRestoreRule$1.evaluate(SystemPropertiesRestoreRule.java:53)
      [mvn] 		at org.apache.lucene.util.TestRuleSetupTeardownChained$1.evaluate(TestRuleSetupTeardownChained.java:50)
      [mvn] 		at org.apache.lucene.util.TestRuleFieldCacheSanity$1.evaluate(TestRuleFieldCacheSanity.java:51)
      [mvn] 		at org.apache.lucene.util.AbstractBeforeAfterRule$1.evaluate(AbstractBeforeAfterRule.java:45)
      [mvn] 		at com.carrotsearch.randomizedtesting.rules.SystemPropertiesInvariantRule$1.evaluate(SystemPropertiesInvariantRule.java:55)
      [mvn] 		at org.apache.lucene.util.TestRuleThreadAndTestName$1.evaluate(TestRuleThreadAndTestName.java:48)
      [mvn] 		at org.apache.lucene.util.TestRuleIgnoreAfterMaxFailures$1.evaluate(TestRuleIgnoreAfterMaxFailures.java:70)
      [mvn] 		at org.apache.lucene.util.TestRuleMarkFailure$1.evaluate(TestRuleMarkFailure.java:48)
      [mvn] 		at com.carrotsearch.randomizedtesting.rules.StatementAdapter.evaluate(StatementAdapter.java:36)
      [mvn] 		at com.carrotsearch.randomizedtesting.ThreadLeakControl$StatementRunner.run(ThreadLeakControl.java:358)
      [mvn] 		at com.carrotsearch.randomizedtesting.ThreadLeakControl.forkTimeoutingTask(ThreadLeakControl.java:782)
      [mvn] 		at com.carrotsearch.randomizedtesting.ThreadLeakControl$3.evaluate(ThreadLeakControl.java:442)
      [mvn] 		at com.carrotsearch.randomizedtesting.RandomizedRunner.runSingleTest(RandomizedRunner.java:746)
      [mvn] 		at com.carrotsearch.randomizedtesting.RandomizedRunner$3.evaluate(RandomizedRunner.java:648)
      [mvn] 		at com.carrotsearch.randomizedtesting.RandomizedRunner$4.evaluate(RandomizedRunner.java:682)
      [mvn] 		at com.carrotsearch.randomizedtesting.RandomizedRunner$5.evaluate(RandomizedRunner.java:693)
      [mvn] 		at com.carrotsearch.randomizedtesting.rules.StatementAdapter.evaluate(StatementAdapter.java:36)
      [mvn] 		at com.carrotsearch.randomizedtesting.rules.SystemPropertiesRestoreRule$1.evaluate(SystemPropertiesRestoreRule.java:53)
      [mvn] 		at org.apache.lucene.util.AbstractBeforeAfterRule$1.evaluate(AbstractBeforeAfterRule.java:45)
      [mvn] 		at org.apache.lucene.util.TestRuleStoreClassName$1.evaluate(TestRuleStoreClassName.java:42)
      [mvn] 		at com.carrotsearch.randomizedtesting.rules.SystemPropertiesInvariantRule$1.evaluate(SystemPropertiesInvariantRule.java:55)
      [mvn] 		at com.carrotsearch.randomizedtesting.rules.NoShadowingOrOverridesOnMethodsRule$1.evaluate(NoShadowingOrOverridesOnMethodsRule.java:39)
      [mvn] 		at com.carrotsearch.randomizedtesting.rules.NoShadowingOrOverridesOnMethodsRule$1.evaluate(NoShadowingOrOverridesOnMethodsRule.java:39)
      [mvn] 		at com.carrotsearch.randomizedtesting.rules.StatementAdapter.evaluate(StatementAdapter.java:36)
      [mvn] 		at org.apache.lucene.util.TestRuleAssertionsRequired$1.evaluate(TestRuleAssertionsRequired.java:43)
      [mvn] 		at org.apache.lucene.util.TestRuleMarkFailure$1.evaluate(TestRuleMarkFailure.java:48)
      [mvn] 		at org.apache.lucene.util.TestRuleIgnoreAfterMaxFailures$1.evaluate(TestRuleIgnoreAfterMaxFailures.java:70)
      [mvn] 		at org.apache.lucene.util.TestRuleIgnoreTestSuites$1.evaluate(TestRuleIgnoreTestSuites.java:55)
      [mvn] 		at com.carrotsearch.randomizedtesting.rules.StatementAdapter.evaluate(StatementAdapter.java:36)
      [mvn] 		at com.carrotsearch.randomizedtesting.ThreadLeakControl$StatementRunner.run(ThreadLeakControl.java:358)
      [mvn] 		at java.lang.Thread.run(Thread.java:679)
      [mvn] 	
      [mvn] Tests run: 32, Failures: 0, Errors: 0, Skipped: 0, Time elapsed: 3.857 sec
      [mvn] Running org.apache.solr.schema.UUIDFieldTest
      [mvn] Tests run: 1, Failures: 0, Errors: 0, Skipped: 0, Time elapsed: 0.011 sec
      [mvn] Running org.apache.solr.search.TestValueSourceCache
      [mvn] Creating dataDir: /usr/home/hudson/hudson-slave/workspace/Lucene-Solr-Maven-trunk/maven-build/solr/core/src/test/target/test/./solrtest-TestValueSourceCache-1348328762987
      [mvn] Tests run: 2, Failures: 0, Errors: 0, Skipped: 0, Time elapsed: 0.527 sec
      [mvn] Running org.apache.solr.core.TestQuerySenderListener
      [mvn] Creating dataDir: /usr/home/hudson/hudson-slave/workspace/Lucene-Solr-Maven-trunk/maven-build/solr/core/src/test/target/test/./solrtest-TestQuerySenderListener-1348328763515
      [mvn] Tests run: 3, Failures: 0, Errors: 0, Skipped: 0, Time elapsed: 0.283 sec
      [mvn] Running org.apache.solr.cloud.ZkControllerTest
      [mvn] Creating dataDir: /usr/home/hudson/hudson-slave/workspace/Lucene-Solr-Maven-trunk/maven-build/solr/core/src/test/target/test/./solrtest-ZkControllerTest-1348328763798
      [mvn] Tests run: 2, Failures: 0, Errors: 0, Skipped: 0, Time elapsed: 3.995 sec
      [mvn] Running org.apache.solr.servlet.DirectSolrConnectionTest
      [mvn] Tests run: 2, Failures: 0, Errors: 0, Skipped: 0, Time elapsed: 0.239 sec
      [mvn] Running org.apache.solr.search.ReturnFieldsTest
      [mvn] Creating dataDir: /usr/home/hudson/hudson-slave/workspace/Lucene-Solr-Maven-trunk/maven-build/solr/core/src/test/target/test/./solrtest-ReturnFieldsTest-1348328768040
      [mvn] Tests run: 10, Failures: 0, Errors: 0, Skipped: 0, Time elapsed: 0.631 sec
      [mvn] Running org.apache.solr.update.PeerSyncTest
      [mvn] Tests run: 1, Failures: 0, Errors: 0, Skipped: 0, Time elapsed: 2.52 sec
      [mvn] Running org.apache.solr.internal.csv.writer.CSVConfigTest
      [mvn] Tests run: 7, Failures: 0, Errors: 0, Skipped: 0, Time elapsed: 0.001 sec
      [mvn] Running org.apache.solr.spelling.IndexBasedSpellCheckerTest
      [mvn] Creating dataDir: /usr/home/hudson/hudson-slave/workspace/Lucene-Solr-Maven-trunk/maven-build/solr/core/src/test/target/test/./solrtest-IndexBasedSpellCheckerTest-1348328771190
      [mvn] Tests run: 5, Failures: 0, Errors: 0, Skipped: 0, Time elapsed: 0.647 sec
      [mvn] Running org.apache.solr.core.SolrCoreCheckLockOnStartupTest
      [mvn] Creating dataDir: /usr/home/hudson/hudson-slave/workspace/Lucene-Solr-Maven-trunk/maven-build/solr/core/src/test/target/test/./solrtest-SolrCoreCheckLockOnStartupTest-1348328771840
      [mvn] 267 T361 oasc.SolrCore.initIndex SEVERE [collection1] Solr index directory '/usr/home/hudson/hudson-slave/workspace/Lucene-Solr-Maven-trunk/maven-build/solr/core/src/test/target/test/./solrtest-SolrCoreCheckLockOnStartupTest-1348328771840/index/' is locked.  Throwing exception
      [mvn] Creating dataDir: /usr/home/hudson/hudson-slave/workspace/Lucene-Solr-Maven-trunk/maven-build/solr/core/src/test/target/test/./solrtest-SolrCoreCheckLockOnStartupTest-1348328772113
      [mvn] 330 T3 oasc.SolrCore.finalize SEVERE REFCOUNT ERROR: unreferenced org.apache.solr.core.SolrCore@7fb46468 (collection1) has a reference count of 1
      [mvn] 334 T3 oasc.CoreContainer.finalize SEVERE CoreContainer was not shutdown prior to finalize(), indicates a bug -- POSSIBLE RESOURCE LEAK!!!  instance=1694527469
      [mvn] 535 T361 oasc.SolrCore.initIndex SEVERE [collection1] Solr index directory '/usr/home/hudson/hudson-slave/workspace/Lucene-Solr-Maven-trunk/maven-build/solr/core/src/test/target/test/./solrtest-SolrCoreCheckLockOnStartupTest-1348328772113/index/' is locked.  Throwing exception
      [mvn] Tests run: 2, Failures: 0, Errors: 0, Skipped: 0, Time elapsed: 0.555 sec
      [mvn] Running org.apache.solr.TestSolrCoreProperties
      [mvn] 607 T3 oasc.SolrCore.finalize SEVERE REFCOUNT ERROR: unreferenced org.apache.solr.core.SolrCore@6ed70792 (collection1) has a reference count of 1
      [mvn] 607 T3 oasc.CoreContainer.finalize SEVERE CoreContainer was not shutdown prior to finalize(), indicates a bug -- POSSIBLE RESOURCE LEAK!!!  instance=1631518462
      [mvn] Tests run: 1, Failures: 0, Errors: 0, Skipped: 0, Time elapsed: 0.155 sec
      [mvn] Running org.apache.solr.TestPluginEnable
      [mvn] Creating dataDir: /usr/home/hudson/hudson-slave/workspace/Lucene-Solr-Maven-trunk/maven-build/solr/core/src/test/target/test/./solrtest-TestPluginEnable-1348328772547
      [mvn] Tests run: 1, Failures: 0, Errors: 0, Skipped: 0, Time elapsed: 0.065 sec
      [mvn] Running org.apache.solr.SampleTest
      [mvn] Creating dataDir: /usr/home/hudson/hudson-slave/workspace/Lucene-Solr-Maven-trunk/maven-build/solr/core/src/test/target/test/./solrtest-SampleTest-1348328772615
      [mvn] Tests run: 2, Failures: 0, Errors: 0, Skipped: 0, Time elapsed: 0.339 sec
      [mvn] Running org.apache.solr.core.TestJmxMonitoredMap
      [mvn] Tests run: 2, Failures: 0, Errors: 0, Skipped: 0, Time elapsed: 0.126 sec
      [mvn] Running org.apache.solr.search.similarities.TestLMJelinekMercerSimilarityFactory
      [mvn] Creating dataDir: /usr/home/hudson/hudson-slave/workspace/Lucene-Solr-Maven-trunk/maven-build/solr/core/src/test/target/test/./solrtest-TestLMJelinekMercerSimilarityFactory-1348328773083
      [mvn] Tests run: 2, Failures: 0, Errors: 0, Skipped: 0, Time elapsed: 0.092 sec
      [mvn] Running org.apache.solr.internal.csv.CSVStrategyTest
      [mvn] Tests run: 5, Failures: 0, Errors: 0, Skipped: 0, Time elapsed: 0.001 sec
      [mvn] Running org.apache.solr.schema.TestCollationField
      [mvn] Creating dataDir: /usr/home/hudson/hudson-slave/workspace/Lucene-Solr-Maven-trunk/maven-build/solr/core/src/test/target/test/./solrtest-TestCollationField-1348328773231
      [mvn] Tests run: 8, Failures: 0, Errors: 0, Skipped: 0, Time elapsed: 0.362 sec
      [mvn] Running org.apache.solr.core.TestQuerySenderNoQuery
      [mvn] Creating dataDir: /usr/home/hudson/hudson-slave/workspace/Lucene-Solr-Maven-trunk/maven-build/solr/core/src/test/target/test/./solrtest-TestQuerySenderNoQuery-1348328773540
      [mvn] Tests run: 3, Failures: 0, Errors: 0, Skipped: 0, Time elapsed: 0.373 sec
      [mvn] Running org.apache.solr.EchoParamsTest
      [mvn] Creating dataDir: /usr/home/hudson/hudson-slave/workspace/Lucene-Solr-Maven-trunk/maven-build/solr/core/src/test/target/test/./solrtest-EchoParamsTest-1348328773919
      [mvn] Tests run: 1, Failures: 0, Errors: 0, Skipped: 0, Time elapsed: 0.117 sec
      [mvn] Running org.apache.solr.handler.XsltUpdateRequestHandlerTest
      [mvn] Creating dataDir: /usr/home/hudson/hudson-slave/workspace/Lucene-Solr-Maven-trunk/maven-build/solr/core/src/test/target/test/./solrtest-XsltUpdateRequestHandlerTest-1348328774032
      [mvn] Tests run: 1, Failures: 0, Errors: 0, Skipped: 0, Time elapsed: 0.601 sec
      [mvn] Running org.apache.solr.cloud.ClusterStateTest
      [mvn] Tests run: 1, Failures: 0, Errors: 0, Skipped: 0, Time elapsed: 0.019 sec
      [mvn] Running org.apache.solr.schema.IndexSchemaTest
      [mvn] Creating dataDir: /usr/home/hudson/hudson-slave/workspace/Lucene-Solr-Maven-trunk/maven-build/solr/core/src/test/target/test/./solrtest-IndexSchemaTest-1348328774656
      [mvn] Tests run: 3, Failures: 0, Errors: 0, Skipped: 0, Time elapsed: 1.095 sec
      [mvn] Running org.apache.solr.search.TestSort
      [mvn] Creating dataDir: /usr/home/hudson/hudson-slave/workspace/Lucene-Solr-Maven-trunk/maven-build/solr/core/src/test/target/test/./solrtest-TestSort-1348328775748
      [mvn] Tests run: 2, Failures: 0, Errors: 0, Skipped: 0, Time elapsed: 3.945 sec
      [mvn] Running org.apache.solr.util.SimplePostToolTest
      [mvn] Indexing directory /usr/home/hudson/hudson-slave/workspace/Lucene-Solr-Maven-trunk/maven-build/solr/core/src/test/target/test-classes/exampledocs (2 files, depth=0)
      [mvn] POSTing file example.txt (text/plain)
      [mvn] POSTing file example.html (text/html)
      [mvn] Entering crawl at level 0 (1 links total, 1 new)
      [mvn] POSTed web resource http://example.com (depth: 0)
      [mvn] Entering crawl at level 1 (2 links total, 2 new)
      [mvn] POSTed web resource http://example.com/page2 (depth: 1)
      [mvn] POSTed web resource http://example.com/page1 (depth: 1)
      [mvn] Entering crawl at level 2 (2 links total, 2 new)
      [mvn] SimplePostTool: WARNING: The URL http://example.com/disallowed returned a HTTP result status of 403
      [mvn] POSTed web resource http://example.com/page1/foo (depth: 2)
      [mvn] Entering crawl at level 3 (1 links total, 1 new)
      [mvn] POSTed web resource http://example.com/page1/foo/bar (depth: 3)
      [mvn] Entering crawl at level 0 (1 links total, 1 new)
      [mvn] POSTed web resource http://example.com (depth: 0)
      [mvn] Entering crawl at level 1 (2 links total, 2 new)
      [mvn] POSTed web resource http://example.com/page2 (depth: 1)
      [mvn] POSTed web resource http://example.com/page1 (depth: 1)
      [mvn] Entering crawl at level 0 (1 links total, 1 new)
      [mvn] POSTed web resource http://example.com (depth: 0)
      [mvn] Entering crawl at level 1 (2 links total, 2 new)
      [mvn] POSTed web resource http://example.com/page2 (depth: 1)
      [mvn] POSTed web resource http://example.com/page1 (depth: 1)
      [mvn] Entering crawl at level 2 (2 links total, 2 new)
      [mvn] POSTed web resource http://example.com/disallowed (depth: 2)
      [mvn] POSTed web resource http://example.com/page1/foo (depth: 2)
      [mvn] Entering crawl at level 3 (1 links total, 1 new)
      [mvn] POSTed web resource http://example.com/page1/foo/bar (depth: 3)
      [mvn] Tests run: 11, Failures: 0, Errors: 0, Skipped: 0, Time elapsed: 0.641 sec
      [mvn] Running org.apache.solr.schema.TestBinaryField
      [mvn] Tests run: 1, Failures: 0, Errors: 0, Skipped: 0, Time elapsed: 0.218 sec
      [mvn] Running org.apache.solr.core.IndexReaderFactoryTest
      [mvn] Tests run: 1, Failures: 0, Errors: 0, Skipped: 0, Time elapsed: 0.293 sec
      [mvn] Running org.apache.solr.response.TestCSVResponseWriter
      [mvn] Creating dataDir: /usr/home/hudson/hudson-slave/workspace/Lucene-Solr-Maven-trunk/maven-build/solr/core/src/test/target/test/./solrtest-TestCSVResponseWriter-1348328780854
      [mvn] Tests run: 1, Failures: 0, Errors: 0, Skipped: 0, Time elapsed: 0.498 sec
      [mvn] Running org.apache.solr.analysis.TestWordDelimiterFilterFactory
      [mvn] Creating dataDir: /usr/home/hudson/hudson-slave/workspace/Lucene-Solr-Maven-trunk/maven-build/solr/core/src/test/target/test/./solrtest-TestWordDelimiterFilterFactory-1348328781349
      [mvn] Tests run: 7, Failures: 0, Errors: 0, Skipped: 0, Time elapsed: 0.83 sec
      [mvn] Running org.apache.solr.search.similarities.TestPerFieldSimilarity
      [mvn] Creating dataDir: /usr/home/hudson/hudson-slave/workspace/Lucene-Solr-Maven-trunk/maven-build/solr/core/src/test/target/test/./solrtest-TestPerFieldSimilarity-1348328782180
      [mvn] Tests run: 7, Failures: 0, Errors: 0, Skipped: 0, Time elapsed: 0.087 sec
      [mvn] Running org.apache.solr.update.SolrCmdDistributorTest
      [mvn] node props:{
      [mvn]   "base_url":"http://127.0.0.1:34573/solr",
      [mvn]   "core":""}
      [mvn] node props:{
      [mvn]   "base_url":"http://127.0.0.1:27603/solr",
      [mvn]   "core":""}
      [mvn] node props:{
      [mvn]   "base_url":"http://127.0.0.1:40381/solr",
      [mvn]   "core":""}
      [mvn] node props:{
      [mvn]   "base_url":"http://127.0.0.1:34573/solr",
      [mvn]   "core":""}
      [mvn] node props:{
      [mvn]   "base_url":"http://127.0.0.1:27603/solr",
      [mvn]   "core":""}
      [mvn] node props:{
      [mvn]   "base_url":"http://127.0.0.1:40381/solr",
      [mvn]   "core":""}
      [mvn] node props:{
      [mvn]   "base_url":"http://127.0.0.1:62441/solr",
      [mvn]   "core":""}
      [mvn] node props:{
      [mvn]   "base_url":"http://127.0.0.1:27603/solr",
      [mvn]   "core":""}
      [mvn] node props:{
      [mvn]   "base_url":"http://127.0.0.1:40381/solr",
      [mvn]   "core":""}
      [mvn] node props:{
      [mvn]   "base_url":"http://127.0.0.1:62441/solr",
      [mvn]   "core":""}
      [mvn] node props:{
      [mvn]   "base_url":"http://127.0.0.1:27603/solr",
      [mvn]   "core":""}
      [mvn] node props:{
      [mvn]   "base_url":"http://127.0.0.1:62441/solr",
      [mvn]   "core":""}
      [mvn] node props:{
      [mvn]   "base_url":"http://127.0.0.1:34573/solr",
      [mvn]   "core":""}
      [mvn] node props:{
      [mvn]   "base_url":"http://127.0.0.1:40381/solr",
      [mvn]   "core":""}
      [mvn] node props:{
      [mvn]   "base_url":"http://127.0.0.1:62441/solr",
      [mvn]   "core":""}
      [mvn] node props:{
      [mvn]   "base_url":"http://127.0.0.1:34573/solr",
      [mvn]   "core":""}
      [mvn] node props:{
      [mvn]   "base_url":"http://127.0.0.1:62441/solr",
      [mvn]   "core":""}
      [mvn] node props:{
      [mvn]   "base_url":"http://127.0.0.1:34573/solr",
      [mvn]   "core":""}
      [mvn] node props:{
      [mvn]   "base_url":"http://127.0.0.1:27603/solr",
      [mvn]   "core":""}
      [mvn] node props:{
      [mvn]   "base_url":"http://127.0.0.1:34573/solr",
      [mvn]   "core":""}
      [mvn] node props:{
      [mvn]   "base_url":"http://127.0.0.1:27603/solr",
      [mvn]   "core":""}
      [mvn] node props:{
      [mvn]   "base_url":"http://127.0.0.1:62441/solr",
      [mvn]   "core":""}
      [mvn] node props:{
      [mvn]   "base_url":"http://127.0.0.1:27603/solr",
      [mvn]   "core":""}
      [mvn] node props:{
      [mvn]   "base_url":"http://127.0.0.1:40381/solr",
      [mvn]   "core":""}
      [mvn] node props:{
      [mvn]   "base_url":"http://127.0.0.1:34573/solr",
      [mvn]   "core":""}
      [mvn] node props:{
      [mvn]   "base_url":"http://127.0.0.1:27603/solr",
      [mvn]   "core":""}
      [mvn] node props:{
      [mvn]   "base_url":"http://127.0.0.1:27603/solr",
      [mvn]   "core":""}
      [mvn] node props:{
      [mvn]   "base_url":"http://127.0.0.1:62441/solr",
      [mvn]   "core":""}
      [mvn] node props:{
      [mvn]   "base_url":"http://127.0.0.1:62441/solr",
      [mvn]   "core":""}
      [mvn] node props:{
      [mvn]   "base_url":"http://127.0.0.1:34573/solr",
      [mvn]   "core":""}
      [mvn] node props:{
      [mvn]   "base_url":"http://127.0.0.1:34573/solr",
      [mvn]   "core":""}
      [mvn] node props:{
      [mvn]   "base_url":"http://127.0.0.1:27603/solr",
      [mvn]   "core":""}
      [mvn] node props:{
      [mvn]   "base_url":"http://127.0.0.1:34573/solr",
      [mvn]   "core":""}
      [mvn] node props:{
      [mvn]   "base_url":"http://127.0.0.1:40381/solr",
      [mvn]   "core":""}
      [mvn] node props:{
      [mvn]   "base_url":"http://127.0.0.1:27603/solr",
      [mvn]   "core":""}
      [mvn] node props:{
      [mvn]   "base_url":"http://127.0.0.1:62441/solr",
      [mvn]   "core":""}
      [mvn] node props:{
      [mvn]   "base_url":"http://127.0.0.1:27603/solr",
      [mvn]   "core":""}
      [mvn] node props:{
      [mvn]   "base_url":"http://127.0.0.1:62441/solr",
      [mvn]   "core":""}
      [mvn] node props:{
      [mvn]   "base_url":"http://127.0.0.1:34573/solr",
      [mvn]   "core":""}
      [mvn] node props:{
      [mvn]   "base_url":"http://127.0.0.1:27603/solr",
      [mvn]   "core":""}
      [mvn] node props:{
      [mvn]   "base_url":"http://127.0.0.1:62441/solr",
      [mvn]   "core":""}
      [mvn] node props:{
      [mvn]   "base_url":"http://127.0.0.1:34573/solr",
      [mvn]   "core":""}
      [mvn] node props:{
      [mvn]   "base_url":"http://127.0.0.1:27603/solr",
      [mvn]   "core":""}
      [mvn] node props:{
      [mvn]   "base_url":"http://127.0.0.1:40381/solr",
      [mvn]   "core":""}
      [mvn] node props:{
      [mvn]   "base_url":"http://127.0.0.1:62441/solr",
      [mvn]   "core":""}
      [mvn] node props:{
      [mvn]   "base_url":"http://127.0.0.1:34573/solr",
      [mvn]   "core":""}
      [mvn] node props:{
      [mvn]   "base_url":"http://127.0.0.1:27603/solr",
      [mvn]   "core":""}
      [mvn] node props:{
      [mvn]   "base_url":"http://127.0.0.1:62441/solr",
      [mvn]   "core":""}
      [mvn] node props:{
      [mvn]   "base_url":"http://127.0.0.1:34573/solr",
      [mvn]   "core":""}
      [mvn] node props:{
      [mvn]   "base_url":"http://127.0.0.1:62441/solr",
      [mvn]   "core":""}
      [mvn] node props:{
      [mvn]   "base_url":"http://127.0.0.1:34573/solr",
      [mvn]   "core":""}
      [mvn] node props:{
      [mvn]   "base_url":"http://127.0.0.1:62441/solr",
      [mvn]   "core":""}
      [mvn] node props:{
      [mvn]   "base_url":"http://127.0.0.1:27603/solr",
      [mvn]   "core":""}
      [mvn] node props:{
      [mvn]   "base_url":"http://127.0.0.1:62441/solr",
      [mvn]   "core":""}
      [mvn] node props:{
      [mvn]   "base_url":"http://127.0.0.1:27603/solr",
      [mvn]   "core":""}
      [mvn] node props:{
      [mvn]   "base_url":"http://127.0.0.1:62441/solr",
      [mvn]   "core":""}
      [mvn] node props:{
      [mvn]   "base_url":"http://127.0.0.1:34573/solr",
      [mvn]   "core":""}
      [mvn] node props:{
      [mvn]   "base_url":"http://127.0.0.1:62441/solr",
      [mvn]   "core":""}
      [mvn] node props:{
      [mvn]   "base_url":"http://127.0.0.1:34573/solr",
      [mvn]   "core":""}
      [mvn] node props:{
      [mvn]   "base_url":"http://127.0.0.1:62441/solr",
      [mvn]   "core":""}
      [mvn] node props:{
      [mvn]   "base_url":"http://127.0.0.1:27603/solr",
      [mvn]   "core":""}
      [mvn] node props:{
      [mvn]   "base_url":"http://127.0.0.1:40381/solr",
      [mvn]   "core":""}
      [mvn] node props:{
      [mvn]   "base_url":"http://127.0.0.1:62441/solr",
      [mvn]   "core":""}
      [mvn] node props:{
      [mvn]   "base_url":"http://127.0.0.1:40381/solr",
      [mvn]   "core":""}
      [mvn] node props:{
      [mvn]   "base_url":"http://127.0.0.1:62441/solr",
      [mvn]   "core":""}
      [mvn] node props:{
      [mvn]   "base_url":"http://127.0.0.1:27603/solr",
      [mvn]   "core":""}
      [mvn] node props:{
      [mvn]   "base_url":"http://127.0.0.1:40381/solr",
      [mvn]   "core":""}
      [mvn] node props:{
      [mvn]   "base_url":"http://127.0.0.1:62441/solr",
      [mvn]   "core":""}
      [mvn] node props:{
      [mvn]   "base_url":"http://127.0.0.1:34573/solr",
      [mvn]   "core":""}
      [mvn] node props:{
      [mvn]   "base_url":"http://127.0.0.1:34573/solr",
      [mvn]   "core":""}
      [mvn] node props:{
      [mvn]   "base_url":"http://127.0.0.1:27603/solr",
      [mvn]   "core":""}
      [mvn] node props:{
      [mvn]   "base_url":"http://127.0.0.1:62441/solr",
      [mvn]   "core":""}
      [mvn] node props:{
      [mvn]   "base_url":"http://127.0.0.1:34573/solr",
      [mvn]   "core":""}
      [mvn] node props:{
      [mvn]   "base_url":"http://127.0.0.1:27603/solr",
      [mvn]   "core":""}
      [mvn] node props:{
      [mvn]   "base_url":"http://127.0.0.1:40381/solr",
      [mvn]   "core":""}
      [mvn] node props:{
      [mvn]   "base_url":"http://127.0.0.1:62441/solr",
      [mvn]   "core":""}
      [mvn] node props:{
      [mvn]   "base_url":"http://127.0.0.1:27603/solr",
      [mvn]   "core":""}
      [mvn] node props:{
      [mvn]   "base_url":"http://127.0.0.1:27603/solr",
      [mvn]   "core":""}
      [mvn] node props:{
      [mvn]   "base_url":"http://127.0.0.1:62441/solr",
      [mvn]   "core":""}
      [mvn] node props:{
      [mvn]   "base_url":"http://127.0.0.1:34573/solr",
      [mvn]   "core":""}
      [mvn] node props:{
      [mvn]   "base_url":"http://127.0.0.1:27603/solr",
      [mvn]   "core":""}
      [mvn] node props:{
      [mvn]   "base_url":"http://127.0.0.1:27603/solr",
      [mvn]   "core":""}
      [mvn] node props:{
      [mvn]   "base_url":"http://127.0.0.1:34573/solr",
      [mvn]   "core":""}
      [mvn] node props:{
      [mvn]   "base_url":"http://127.0.0.1:62441/solr",
      [mvn]   "core":""}
      [mvn] node props:{
      [mvn]   "base_url":"http://127.0.0.1:34573/solr",
      [mvn]   "core":""}
      [mvn] node props:{
      [mvn]   "base_url":"http://127.0.0.1:62441/solr",
      [mvn]   "core":""}
      [mvn] node props:{
      [mvn]   "base_url":"http://127.0.0.1:34573/solr",
      [mvn]   "core":""}
      [mvn] node props:{
      [mvn]   "base_url":"http://127.0.0.1:27603/solr",
      [mvn]   "core":""}
      [mvn] node props:{
      [mvn]   "base_url":"http://127.0.0.1:34573/solr",
      [mvn]   "core":""}
      [mvn] node props:{
      [mvn]   "base_url":"http://127.0.0.1:27603/solr",
      [mvn]   "core":""}
      [mvn] node props:{
      [mvn]   "base_url":"http://127.0.0.1:40381/solr",
      [mvn]   "core":""}
      [mvn] node props:{
      [mvn]   "base_url":"http://127.0.0.1:27603/solr",
      [mvn]   "core":""}
      [mvn] node props:{
      [mvn]   "base_url":"http://127.0.0.1:40381/solr",
      [mvn]   "core":""}
      [mvn] node props:{
      [mvn]   "base_url":"http://127.0.0.1:27603/solr",
      [mvn]   "core":""}
      [mvn] node props:{
      [mvn]   "base_url":"http://127.0.0.1:34573/solr",
      [mvn]   "core":""}
      [mvn] node props:{
      [mvn]   "base_url":"http://127.0.0.1:40381/solr",
      [mvn]   "core":""}
      [mvn] node props:{
      [mvn]   "base_url":"http://127.0.0.1:62441/solr",
      [mvn]   "core":""}
      [mvn] node props:{
      [mvn]   "base_url":"http://127.0.0.1:34573/solr",
      [mvn]   "core":""}
      [mvn] node props:{
      [mvn]   "base_url":"http://127.0.0.1:27603/solr",
      [mvn]   "core":""}
      [mvn] node props:{
      [mvn]   "base_url":"http://127.0.0.1:62441/solr",
      [mvn]   "core":""}
      [mvn] node props:{
      [mvn]   "base_url":"http://127.0.0.1:34573/solr",
      [mvn]   "core":""}
      [mvn] node props:{
      [mvn]   "base_url":"http://127.0.0.1:27603/solr",
      [mvn]   "core":""}
      [mvn] node props:{
      [mvn]   "base_url":"http://127.0.0.1:27603/solr",
      [mvn]   "core":""}
      [mvn] node props:{
      [mvn]   "base_url":"http://127.0.0.1:40381/solr",
      [mvn]   "core":""}
      [mvn] node props:{
      [mvn]   "base_url":"http://127.0.0.1:62441/solr",
      [mvn]   "core":""}
      [mvn] node props:{
      [mvn]   "base_url":"http://127.0.0.1:40381/solr",
      [mvn]   "core":""}
      [mvn] node props:{
      [mvn]   "base_url":"http://127.0.0.1:62441/solr",
      [mvn]   "core":""}
      [mvn] node props:{
      [mvn]   "base_url":"http://127.0.0.1:40381/solr",
      [mvn]   "core":""}
      [mvn] node props:{
      [mvn]   "base_url":"http://127.0.0.1:62441/solr",
      [mvn]   "core":""}
      [mvn] node props:{
      [mvn]   "base_url":"http://127.0.0.1:34573/solr",
      [mvn]   "core":""}
      [mvn] node props:{
      [mvn]   "base_url":"http://127.0.0.1:27603/solr",
      [mvn]   "core":""}
      [mvn] node props:{
      [mvn]   "base_url":"http://127.0.0.1:40381/solr",
      [mvn]   "core":""}
      [mvn] node props:{
      [mvn]   "base_url":"http://127.0.0.1:62441/solr",
      [mvn]   "core":""}
      [mvn] node props:{
      [mvn]   "base_url":"http://127.0.0.1:27603/solr",
      [mvn]   "core":""}
      [mvn] node props:{
      [mvn]   "base_url":"http://127.0.0.1:40381/solr",
      [mvn]   "core":""}
      [mvn] node props:{
      [mvn]   "base_url":"http://127.0.0.1:62441/solr",
      [mvn]   "core":""}
      [mvn] node props:{
      [mvn]   "base_url":"http://127.0.0.1:34573/solr",
      [mvn]   "core":""}
      [mvn] node props:{
      [mvn]   "base_url":"http://127.0.0.1:27603/solr",
      [mvn]   "core":""}
      [mvn] node props:{
      [mvn]   "base_url":"http://127.0.0.1:34573/solr",
      [mvn]   "core":""}
      [mvn] node props:{
      [mvn]   "base_url":"http://127.0.0.1:34573/solr",
      [mvn]   "core":""}
      [mvn] node props:{
      [mvn]   "base_url":"http://127.0.0.1:27603/solr",
      [mvn]   "core":""}
      [mvn] node props:{
      [mvn]   "base_url":"http://127.0.0.1:40381/solr",
      [mvn]   "core":""}
      [mvn] node props:{
      [mvn]   "base_url":"http://127.0.0.1:62441/solr",
      [mvn]   "core":""}
      [mvn] node props:{
      [mvn]   "base_url":"http://127.0.0.1:40381/solr",
      [mvn]   "core":""}
      [mvn] node props:{
      [mvn]   "base_url":"http://127.0.0.1:27603/solr",
      [mvn]   "core":""}
      [mvn] node props:{
      [mvn]   "base_url":"http://127.0.0.1:40381/solr",
      [mvn]   "core":""}
      [mvn] node props:{
      [mvn]   "base_url":"http://127.0.0.1:62441/solr",
      [mvn]   "core":""}
      [mvn] node props:{
      [mvn]   "base_url":"http://127.0.0.1:27603/solr",
      [mvn]   "core":""}
      [mvn] node props:{
      [mvn]   "base_url":"http://127.0.0.1:62441/solr",
      [mvn]   "core":""}
      [mvn] node props:{
      [mvn]   "base_url":"http://127.0.0.1:40381/solr",
      [mvn]   "core":""}
      [mvn] node props:{
      [mvn]   "base_url":"http://127.0.0.1:62441/solr",
      [mvn]   "core":""}
      [mvn] node props:{
      [mvn]   "base_url":"http://127.0.0.1:40381/solr",
      [mvn]   "core":""}
      [mvn] node props:{
      [mvn]   "base_url":"http://127.0.0.1:62441/solr",
      [mvn]   "core":""}
      [mvn] node props:{
      [mvn]   "base_url":"http://127.0.0.1:27603/solr",
      [mvn]   "core":""}
      [mvn] node props:{
      [mvn]   "base_url":"http://127.0.0.1:40381/solr",
      [mvn]   "core":""}
      [mvn] node props:{
      [mvn]   "base_url":"http://127.0.0.1:62441/solr",
      [mvn]   "core":""}
      [mvn] node props:{
      [mvn]   "base_url":"http://127.0.0.1:62441/solr",
      [mvn]   "core":""}
      [mvn] node props:{
      [mvn]   "base_url":"http://127.0.0.1:40381/solr",
      [mvn]   "core":""}
      [mvn] node props:{
      [mvn]   "base_url":"http://127.0.0.1:27603/solr",
      [mvn]   "core":""}
      [mvn] node props:{
      [mvn]   "base_url":"http://127.0.0.1:62441/solr",
      [mvn]   "core":""}
      [mvn] node props:{
      [mvn]   "base_url":"http://127.0.0.1:34573/solr",
      [mvn]   "core":""}
      [mvn] node props:{
      [mvn]   "base_url":"http://127.0.0.1:27603/solr",
      [mvn]   "core":""}
      [mvn] node props:{
      [mvn]   "base_url":"http://127.0.0.1:34573/solr",
      [mvn]   "core":""}
      [mvn] node props:{
      [mvn]   "base_url":"http://127.0.0.1:27603/solr",
      [mvn]   "core":""}
      [mvn] node props:{
      [mvn]   "base_url":"http://127.0.0.1:40381/solr",
      [mvn]   "core":""}
      [mvn] node props:{
      [mvn]   "base_url":"http://127.0.0.1:62441/solr",
      [mvn]   "core":""}
      [mvn] node props:{
      [mvn]   "base_url":"http://127.0.0.1:34573/solr",
      [mvn]   "core":""}
      [mvn] node props:{
      [mvn]   "base_url":"http://127.0.0.1:40381/solr",
      [mvn]   "core":""}
      [mvn] node props:{
      [mvn]   "base_url":"http://127.0.0.1:62441/solr",
      [mvn]   "core":""}
      [mvn] node props:{
      [mvn]   "base_url":"http://127.0.0.1:34573/solr",
      [mvn]   "core":""}
      [mvn] node props:{
      [mvn]   "base_url":"http://127.0.0.1:27603/solr",
      [mvn]   "core":""}
      [mvn] node props:{
      [mvn]   "base_url":"http://127.0.0.1:34573/solr",
      [mvn]   "core":""}
      [mvn] node props:{
      [mvn]   "base_url":"http://127.0.0.1:40381/solr",
      [mvn]   "core":""}
      [mvn] node props:{
      [mvn]   "base_url":"http://127.0.0.1:34573/solr",
      [mvn]   "core":""}
      [mvn] node props:{
      [mvn]   "base_url":"http://127.0.0.1:27603/solr",
      [mvn]   "core":""}
      [mvn] node props:{
      [mvn]   "base_url":"http://127.0.0.1:40381/solr",
      [mvn]   "core":""}
      [mvn] node props:{
      [mvn]   "base_url":"http://127.0.0.1:62441/solr",
      [mvn]   "core":""}
      [mvn] node props:{
      [mvn]   "base_url":"http://127.0.0.1:34573/solr",
      [mvn]   "core":""}
      [mvn] node props:{
      [mvn]   "base_url":"http://127.0.0.1:40381/solr",
      [mvn]   "core":""}
      [mvn] node props:{
      [mvn]   "base_url":"http://127.0.0.1:62441/solr",
      [mvn]   "core":""}
      [mvn] node props:{
      [mvn]   "base_url":"http://127.0.0.1:34573/solr",
      [mvn]   "core":""}
      [mvn] node props:{
      [mvn]   "base_url":"http://127.0.0.1:62441/solr",
      [mvn]   "core":""}
      [mvn] node props:{
      [mvn]   "base_url":"http://127.0.0.1:34573/solr",
      [mvn]   "core":""}
      [mvn] node props:{
      [mvn]   "base_url":"http://127.0.0.1:27603/solr",
      [mvn]   "core":""}
      [mvn] node props:{
      [mvn]   "base_url":"http://127.0.0.1:40381/solr",
      [mvn]   "core":""}
      [mvn] node props:{
      [mvn]   "base_url":"http://127.0.0.1:62441/solr",
      [mvn]   "core":""}
      [mvn] node props:{
      [mvn]   "base_url":"http://127.0.0.1:62441/solr",
      [mvn]   "core":""}
      [mvn] node props:{
      [mvn]   "base_url":"http://127.0.0.1:34573/solr",
      [mvn]   "core":""}
      [mvn] node props:{
      [mvn]   "base_url":"http://127.0.0.1:40381/solr",
      [mvn]   "core":""}
      [mvn] node props:{
      [mvn]   "base_url":"http://127.0.0.1:27603/solr",
      [mvn]   "core":""}
      [mvn] node props:{
      [mvn]   "base_url":"http://127.0.0.1:40381/solr",
      [mvn]   "core":""}
      [mvn] node props:{
      [mvn]   "base_url":"http://127.0.0.1:62441/solr",
      [mvn]   "core":""}
      [mvn] node props:{
      [mvn]   "base_url":"http://127.0.0.1:40381/solr",
      [mvn]   "core":""}
      [mvn] node props:{
      [mvn]   "base_url":"http://127.0.0.1:62441/solr",
      [mvn]   "core":""}
      [mvn] node props:{
      [mvn]   "base_url":"http://127.0.0.1:34573/solr",
      [mvn]   "core":""}
      [mvn] node props:{
      [mvn]   "base_url":"http://127.0.0.1:62441/solr",
      [mvn]   "core":""}
      [mvn] node props:{
      [mvn]   "base_url":"http://127.0.0.1:34573/solr",
      [mvn]   "core":""}
      [mvn] node props:{
      [mvn]   "base_url":"http://127.0.0.1:27603/solr",
      [mvn]   "core":""}
      [mvn] node props:{
      [mvn]   "base_url":"http://127.0.0.1:40381/solr",
      [mvn]   "core":""}
      [mvn] node props:{
      [mvn]   "base_url":"http://127.0.0.1:34573/solr",
      [mvn]   "core":""}
      [mvn] node props:{
      [mvn]   "base_url":"http://127.0.0.1:27603/solr",
      [mvn]   "core":""}
      [mvn] node props:{
      [mvn]   "base_url":"http://127.0.0.1:27603/solr",
      [mvn]   "core":""}
      [mvn] node props:{
      [mvn]   "base_url":"http://127.0.0.1:34573/solr",
      [mvn]   "core":""}
      [mvn] node props:{
      [mvn]   "base_url":"http://127.0.0.1:27603/solr",
      [mvn]   "core":""}
      [mvn] node props:{
      [mvn]   "base_url":"http://127.0.0.1:27603/solr",
      [mvn]   "core":""}
      [mvn] node props:{
      [mvn]   "base_url":"http://127.0.0.1:40381/solr",
      [mvn]   "core":""}
      [mvn] node props:{
      [mvn]   "base_url":"http://127.0.0.1:62441/solr",
      [mvn]   "core":""}
      [mvn] node props:{
      [mvn]   "base_url":"http://127.0.0.1:27603/solr",
      [mvn]   "core":""}
      [mvn] node props:{
      [mvn]   "base_url":"http://127.0.0.1:40381/solr",
      [mvn]   "core":""}
      [mvn] node props:{
      [mvn]   "base_url":"http://127.0.0.1:40381/solr",
      [mvn]   "core":""}
      [mvn] node props:{
      [mvn]   "base_url":"http://127.0.0.1:34573/solr",
      [mvn]   "core":""}
      [mvn] node props:{
      [mvn]   "base_url":"http://127.0.0.1:27603/solr",
      [mvn]   "core":""}
      [mvn] node props:{
      [mvn]   "base_url":"http://127.0.0.1:62441/solr",
      [mvn]   "core":""}
      [mvn] node props:{
      [mvn]   "base_url":"http://127.0.0.1:34573/solr",
      [mvn]   "core":""}
      [mvn] node props:{
      [mvn]   "base_url":"http://127.0.0.1:40381/solr",
      [mvn]   "core":""}
      [mvn] node props:{
      [mvn]   "base_url":"http://127.0.0.1:62441/solr",
      [mvn]   "core":""}
      [mvn] node props:{
      [mvn]   "base_url":"http://127.0.0.1:27603/solr",
      [mvn]   "core":""}
      [mvn] node props:{
      [mvn]   "base_url":"http://127.0.0.1:40381/solr",
      [mvn]   "core":""}
      [mvn] node props:{
      [mvn]   "base_url":"http://127.0.0.1:62441/solr",
      [mvn]   "core":""}
      [mvn] node props:{
      [mvn]   "base_url":"http://127.0.0.1:27603/solr",
      [mvn]   "core":""}
      [mvn] node props:{
      [mvn]   "base_url":"http://127.0.0.1:62441/solr",
      [mvn]   "core":""}
      [mvn] node props:{
      [mvn]   "base_url":"http://127.0.0.1:27603/solr",
      [mvn]   "core":""}
      [mvn] node props:{
      [mvn]   "base_url":"http://127.0.0.1:40381/solr",
      [mvn]   "core":""}
      [mvn] node props:{
      [mvn]   "base_url":"http://127.0.0.1:40381/solr",
      [mvn]   "core":""}
      [mvn] node props:{
      [mvn]   "base_url":"http://127.0.0.1:34573/solr",
      [mvn]   "core":""}
      [mvn] node props:{
      [mvn]   "base_url":"http://127.0.0.1:27603/solr",
      [mvn]   "core":""}
      [mvn] node props:{
      [mvn]   "base_url":"http://127.0.0.1:62441/solr",
      [mvn]   "core":""}
      [mvn] node props:{
      [mvn]   "base_url":"http://127.0.0.1:34573/solr",
      [mvn]   "core":""}
      [mvn] node props:{
      [mvn]   "base_url":"http://127.0.0.1:62441/solr",
      [mvn]   "core":""}
      [mvn] node props:{
      [mvn]   "base_url":"http://127.0.0.1:27603/solr",
      [mvn]   "core":""}
      [mvn] node props:{
      [mvn]   "base_url":"http://127.0.0.1:40381/solr",
      [mvn]   "core":""}
      [mvn] node props:{
      [mvn]   "base_url":"http://127.0.0.1:62441/solr",
      [mvn]   "core":""}
      [mvn] node props:{
      [mvn]   "base_url":"http://127.0.0.1:34573/solr",
      [mvn]   "core":""}
      [mvn] node props:{
      [mvn]   "base_url":"http://127.0.0.1:40381/solr",
      [mvn]   "core":""}
      [mvn] node props:{
      [mvn]   "base_url":"http://127.0.0.1:34573/solr",
      [mvn]   "core":""}
      [mvn] node props:{
      [mvn]   "base_url":"http://127.0.0.1:40381/solr",
      [mvn]   "core":""}
      [mvn] node props:{
      [mvn]   "base_url":"http://127.0.0.1:62441/solr",
      [mvn]   "core":""}
      [mvn] node props:{
      [mvn]   "base_url":"http://127.0.0.1:34573/solr",
      [mvn]   "core":""}
      [mvn] node props:{
      [mvn]   "base_url":"http://127.0.0.1:27603/solr",
      [mvn]   "core":""}
      [mvn] node props:{
      [mvn]   "base_url":"http://127.0.0.1:40381/solr",
      [mvn]   "core":""}
      [mvn] node props:{
      [mvn]   "base_url":"http://127.0.0.1:62441/solr",
      [mvn]   "core":""}
      [mvn] node props:{
      [mvn]   "base_url":"http://127.0.0.1:27603/solr",
      [mvn]   "core":""}
      [mvn] node props:{
      [mvn]   "base_url":"http://127.0.0.1:40381/solr",
      [mvn]   "core":""}
      [mvn] node props:{
      [mvn]   "base_url":"http://127.0.0.1:62441/solr",
      [mvn]   "core":""}
      [mvn] node props:{
      [mvn]   "base_url":"http://127.0.0.1:40381/solr",
      [mvn]   "core":""}
      [mvn] node props:{
      [mvn]   "base_url":"http://127.0.0.1:62441/solr",
      [mvn]   "core":""}
      [mvn] node props:{
      [mvn]   "base_url":"http://127.0.0.1:27603/solr",
      [mvn]   "core":""}
      [mvn] node props:{
      [mvn]   "base_url":"http://127.0.0.1:34573/solr",
      [mvn]   "core":""}
      [mvn] node props:{
      [mvn]   "base_url":"http://127.0.0.1:27603/solr",
      [mvn]   "core":""}
      [mvn] node props:{
      [mvn]   "base_url":"http://127.0.0.1:40381/solr",
      [mvn]   "core":""}
      [mvn] node props:{
      [mvn]   "base_url":"http://127.0.0.1:62441/solr",
      [mvn]   "core":""}
      [mvn] node props:{
      [mvn]   "base_url":"http://127.0.0.1:34573/solr",
      [mvn]   "core":""}
      [mvn] node props:{
      [mvn]   "base_url":"http://127.0.0.1:27603/solr",
      [mvn]   "core":""}
      [mvn] node props:{
      [mvn]   "base_url":"http://127.0.0.1:62441/solr",
      [mvn]   "core":""}
      [mvn] node props:{
      [mvn]   "base_url":"http://127.0.0.1:34573/solr",
      [mvn]   "core":""}
      [mvn] node props:{
      [mvn]   "base_url":"http://127.0.0.1:40381/solr",
      [mvn]   "core":""}
      [mvn] node props:{
      [mvn]   "base_url":"http://127.0.0.1:62441/solr",
      [mvn]   "core":""}
      [mvn] node props:{
      [mvn]   "base_url":"http://127.0.0.1:27603/solr",
      [mvn]   "core":""}
      [mvn] node props:{
      [mvn]   "base_url":"http://127.0.0.1:62441/solr",
      [mvn]   "core":""}
      [mvn] node props:{
      [mvn]   "base_url":"http://127.0.0.1:34573/solr",
      [mvn]   "core":""}
      [mvn] node props:{
      [mvn]   "base_url":"http://127.0.0.1:27603/solr",
      [mvn]   "core":""}
      [mvn] node props:{
      [mvn]   "base_url":"http://127.0.0.1:34573/solr",
      [mvn]   "core":""}
      [mvn] node props:{
      [mvn]   "base_url":"http://127.0.0.1:34573/solr",
      [mvn]   "core":""}
      [mvn] node props:{
      [mvn]   "base_url":"http://127.0.0.1:34573/solr",
      [mvn]   "core":""}
      [mvn] node props:{
      [mvn]   "base_url":"http://127.0.0.1:27603/solr",
      [mvn]   "core":""}
      [mvn] node props:{
      [mvn]   "base_url":"http://127.0.0.1:62441/solr",
      [mvn]   "core":""}
      [mvn] node props:{
      [mvn]   "base_url":"http://127.0.0.1:40381/solr",
      [mvn]   "core":""}
      [mvn] node props:{
      [mvn]   "base_url":"http://127.0.0.1:27603/solr",
      [mvn]   "core":""}
      [mvn] node props:{
      [mvn]   "base_url":"http://127.0.0.1:62441/solr",
      [mvn]   "core":""}
      [mvn] node props:{
      [mvn]   "base_url":"http://127.0.0.1:34573/solr",
      [mvn]   "core":""}
      [mvn] node props:{
      [mvn]   "base_url":"http://127.0.0.1:62441/solr",
      [mvn]   "core":""}
      [mvn] node props:{
      [mvn]   "base_url":"http://127.0.0.1:34573/solr",
      [mvn]   "core":""}
      [mvn] node props:{
      [mvn]   "base_url":"http://127.0.0.1:62441/solr",
      [mvn]   "core":""}
      [mvn] node props:{
      [mvn]   "base_url":"http://127.0.0.1:27603/solr",
      [mvn]   "core":""}
      [mvn] node props:{
      [mvn]   "base_url":"http://127.0.0.1:40381/solr",
      [mvn]   "core":""}
      [mvn] node props:{
      [mvn]   "base_url":"http://127.0.0.1:34573/solr",
      [mvn]   "core":""}
      [mvn] node props:{
      [mvn]   "base_url":"http://127.0.0.1:40381/solr",
      [mvn]   "core":""}
      [mvn] node props:{
      [mvn]   "base_url":"http://127.0.0.1:62441/solr",
      [mvn]   "core":""}
      [mvn] node props:{
      [mvn]   "base_url":"http://127.0.0.1:34573/solr",
      [mvn]   "core":""}
      [mvn] node props:{
      [mvn]   "base_url":"http://127.0.0.1:27603/solr",
      [mvn]   "core":""}
      [mvn] node props:{
      [mvn]   "base_url":"http://127.0.0.1:40381/solr",
      [mvn]   "core":""}
      [mvn] node props:{
      [mvn]   "base_url":"http://127.0.0.1:62441/solr",
      [mvn]   "core":""}
      [mvn] node props:{
      [mvn]   "base_url":"http://127.0.0.1:34573/solr",
      [mvn]   "core":""}
      [mvn] node props:{
      [mvn]   "base_url":"http://127.0.0.1:40381/solr",
      [mvn]   "core":""}
      [mvn] node props:{
      [mvn]   "base_url":"http://127.0.0.1:62441/solr",
      [mvn]   "core":""}
      [mvn] node props:{
      [mvn]   "base_url":"http://127.0.0.1:27603/solr",
      [mvn]   "core":""}
      [mvn] node props:{
      [mvn]   "base_url":"http://127.0.0.1:40381/solr",
      [mvn]   "core":""}
      [mvn] node props:{
      [mvn]   "base_url":"http://127.0.0.1:34573/solr",
      [mvn]   "core":""}
      [mvn] node props:{
      [mvn]   "base_url":"http://127.0.0.1:27603/solr",
      [mvn]   "core":""}
      [mvn] node props:{
      [mvn]   "base_url":"http://127.0.0.1:62441/solr",
      [mvn]   "core":""}
      [mvn] node props:{
      [mvn]   "base_url":"http://127.0.0.1:34573/solr",
      [mvn]   "core":""}
      [mvn] node props:{
      [mvn]   "base_url":"http://127.0.0.1:27603/solr",
      [mvn]   "core":""}
      [mvn] node props:{
      [mvn]   "base_url":"http://127.0.0.1:62441/solr",
      [mvn]   "core":""}
      [mvn] node props:{
      [mvn]   "base_url":"http://127.0.0.1:34573/solr",
      [mvn]   "core":""}
      [mvn] node props:{
      [mvn]   "base_url":"http://127.0.0.1:27603/solr",
      [mvn]   "core":""}
      [mvn] node props:{
      [mvn]   "base_url":"http://127.0.0.1:40381/solr",
      [mvn]   "core":""}
      [mvn] node props:{
      [mvn]   "base_url":"http://127.0.0.1:27603/solr",
      [mvn]   "core":""}
      [mvn] node props:{
      [mvn]   "base_url":"http://127.0.0.1:40381/solr",
      [mvn]   "core":""}
      [mvn] node props:{
      [mvn]   "base_url":"http://127.0.0.1:62441/solr",
      [mvn]   "core":""}
      [mvn] node props:{
      [mvn]   "base_url":"http://127.0.0.1:27603/solr",
      [mvn]   "core":""}
      [mvn] node props:{
      [mvn]   "base_url":"http://127.0.0.1:62441/solr",
      [mvn]   "core":""}
      [mvn] node props:{
      [mvn]   "base_url":"http://127.0.0.1:34573/solr",
      [mvn]   "core":""}
      [mvn] node props:{
      [mvn]   "base_url":"http://127.0.0.1:62441/solr",
      [mvn]   "core":""}
      [mvn] node props:{
      [mvn]   "base_url":"http://127.0.0.1:34573/solr",
      [mvn]   "core":""}
      [mvn] node props:{
      [mvn]   "base_url":"http://127.0.0.1:40381/solr",
      [mvn]   "core":""}
      [mvn] node props:{
      [mvn]   "base_url":"http://127.0.0.1:34573/solr",
      [mvn]   "core":""}
      [mvn] node props:{
      [mvn]   "base_url":"http://127.0.0.1:27603/solr",
      [mvn]   "core":""}
      [mvn] node props:{
      [mvn]   "base_url":"http://127.0.0.1:62441/solr",
      [mvn]   "core":""}
      [mvn] node props:{
      [mvn]   "base_url":"http://127.0.0.1:34573/solr",
      [mvn]   "core":""}
      [mvn] node props:{
      [mvn]   "base_url":"http://127.0.0.1:40381/solr",
      [mvn]   "core":""}
      [mvn] node props:{
      [mvn]   "base_url":"http://127.0.0.1:62441/solr",
      [mvn]   "core":""}
      [mvn] node props:{
      [mvn]   "base_url":"http://127.0.0.1:34573/solr",
      [mvn]   "core":""}
      [mvn] node props:{
      [mvn]   "base_url":"http://127.0.0.1:27603/solr",
      [mvn]   "core":""}
      [mvn] node props:{
      [mvn]   "base_url":"http://127.0.0.1:27603/solr",
      [mvn]   "core":""}
      [mvn] node props:{
      [mvn]   "base_url":"http://127.0.0.1:40381/solr",
      [mvn]   "core":""}
      [mvn] node props:{
      [mvn]   "base_url":"http://127.0.0.1:34573/solr",
      [mvn]   "core":""}
      [mvn] node props:{
      [mvn]   "base_url":"http://127.0.0.1:27603/solr",
      [mvn]   "core":""}
      [mvn] node props:{
      [mvn]   "base_url":"http://127.0.0.1:40381/solr",
      [mvn]   "core":""}
      [mvn] node props:{
      [mvn]   "base_url":"http://127.0.0.1:62441/solr",
      [mvn]   "core":""}
      [mvn] node props:{
      [mvn]   "base_url":"http://127.0.0.1:34573/solr",
      [mvn]   "core":""}
      [mvn] node props:{
      [mvn]   "base_url":"http://127.0.0.1:27603/solr",
      [mvn]   "core":""}
      [mvn] node props:{
      [mvn]   "base_url":"http://127.0.0.1:62441/solr",
      [mvn]   "core":""}
      [mvn] node props:{
      [mvn]   "base_url":"http://127.0.0.1:34573/solr",
      [mvn]   "core":""}
      [mvn] node props:{
      [mvn]   "base_url":"http://127.0.0.1:40381/solr",
      [mvn]   "core":""}
      [mvn] node props:{
      [mvn]   "base_url":"http://127.0.0.1:62441/solr",
      [mvn]   "core":""}
      [mvn] node props:{
      [mvn]   "base_url":"http://127.0.0.1:34573/solr",
      [mvn]   "core":""}
      [mvn] node props:{
      [mvn]   "base_url":"http://127.0.0.1:27603/solr",
      [mvn]   "core":""}
      [mvn] node props:{
      [mvn]   "base_url":"http://127.0.0.1:40381/solr",
      [mvn]   "core":""}
      [mvn] node props:{
      [mvn]   "base_url":"http://127.0.0.1:27603/solr",
      [mvn]   "core":""}
      [mvn] node props:{
      [mvn]   "base_url":"http://127.0.0.1:40381/solr",
      [mvn]   "core":""}
      [mvn] node props:{
      [mvn]   "base_url":"http://127.0.0.1:34573/solr",
      [mvn]   "core":""}
      [mvn] node props:{
      [mvn]   "base_url":"http://127.0.0.1:34573/solr",
      [mvn]   "core":""}
      [mvn] node props:{
      [mvn]   "base_url":"http://127.0.0.1:27603/solr",
      [mvn]   "core":""}
      [mvn] node props:{
      [mvn]   "base_url":"http://127.0.0.1:40381/solr",
      [mvn]   "core":""}
      [mvn] node props:{
      [mvn]   "base_url":"http://127.0.0.1:34573/solr",
      [mvn]   "core":""}
      [mvn] node props:{
      [mvn]   "base_url":"http://127.0.0.1:27603/solr",
      [mvn]   "core":""}
      [mvn] node props:{
      [mvn]   "base_url":"http://127.0.0.1:40381/solr",
      [mvn]   "core":""}
      [mvn] node props:{
      [mvn]   "base_url":"http://127.0.0.1:34573/solr",
      [mvn]   "core":""}
      [mvn] node props:{
      [mvn]   "base_url":"http://127.0.0.1:27603/solr",
      [mvn]   "core":""}
      [mvn] node props:{
      [mvn]   "base_url":"http://127.0.0.1:40381/solr",
      [mvn]   "core":""}
      [mvn] node props:{
      [mvn]   "base_url":"http://127.0.0.1:40381/solr",
      [mvn]   "core":""}
      [mvn] node props:{
      [mvn]   "base_url":"http://127.0.0.1:62441/solr",
      [mvn]   "core":""}
      [mvn] node props:{
      [mvn]   "base_url":"http://127.0.0.1:34573/solr",
      [mvn]   "core":""}
      [mvn] node props:{
      [mvn]   "base_url":"http://127.0.0.1:34573/solr",
      [mvn]   "core":""}
      [mvn] node props:{
      [mvn]   "base_url":"http://127.0.0.1:27603/solr",
      [mvn]   "core":""}
      [mvn] node props:{
      [mvn]   "base_url":"http://127.0.0.1:34573/solr",
      [mvn]   "core":""}
      [mvn] node props:{
      [mvn]   "base_url":"http://127.0.0.1:27603/solr",
      [mvn]   "core":""}
      [mvn] node props:{
      [mvn]   "base_url":"http://127.0.0.1:40381/solr",
      [mvn]   "core":""}
      [mvn] node props:{
      [mvn]   "base_url":"http://127.0.0.1:62441/solr",
      [mvn]   "core":""}
      [mvn] node props:{
      [mvn]   "base_url":"http://127.0.0.1:34573/solr",
      [mvn]   "core":""}
      [mvn] node props:{
      [mvn]   "base_url":"http://127.0.0.1:27603/solr",
      [mvn]   "core":""}
      [mvn] node props:{
      [mvn]   "base_url":"http://127.0.0.1:40381/solr",
      [mvn]   "core":""}
      [mvn] node props:{
      [mvn]   "base_url":"http://127.0.0.1:62441/solr",
      [mvn]   "core":""}
      [mvn] node props:{
      [mvn]   "base_url":"http://127.0.0.1:34573/solr",
      [mvn]   "core":""}
      [mvn] node props:{
      [mvn]   "base_url":"http://127.0.0.1:40381/solr",
      [mvn]   "core":""}
      [mvn] node props:{
      [mvn]   "base_url":"http://127.0.0.1:62441/solr",
      [mvn]   "core":""}
      [mvn] node props:{
      [mvn]   "base_url":"http://127.0.0.1:34573/solr",
      [mvn]   "core":""}
      [mvn] node props:{
      [mvn]   "base_url":"http://127.0.0.1:62441/solr",
      [mvn]   "core":""}
      [mvn] node props:{
      [mvn]   "base_url":"http://127.0.0.1:27603/solr",
      [mvn]   "core":""}
      [mvn] node props:{
      [mvn]   "base_url":"http://127.0.0.1:62441/solr",
      [mvn]   "core":""}
      [mvn] node props:{
      [mvn]   "base_url":"http://127.0.0.1:34573/solr",
      [mvn]   "core":""}
      [mvn] node props:{
      [mvn]   "base_url":"http://127.0.0.1:27603/solr",
      [mvn]   "core":""}
      [mvn] node props:{
      [mvn]   "base_url":"http://127.0.0.1:40381/solr",
      [mvn]   "core":""}
      [mvn] node props:{
      [mvn]   "base_url":"http://127.0.0.1:40381/solr",
      [mvn]   "core":""}
      [mvn] node props:{
      [mvn]   "base_url":"http://127.0.0.1:62441/solr",
      [mvn]   "core":""}
      [mvn] node props:{
      [mvn]   "base_url":"http://127.0.0.1:27603/solr",
      [mvn]   "core":""}
      [mvn] node props:{
      [mvn]   "base_url":"http://127.0.0.1:62441/solr",
      [mvn]   "core":""}
      [mvn] node props:{
      [mvn]   "base_url":"http://127.0.0.1:34573/solr",
      [mvn]   "core":""}
      [mvn] node props:{
      [mvn]   "base_url":"http://127.0.0.1:40381/solr",
      [mvn]   "core":""}
      [mvn] node props:{
      [mvn]   "base_url":"http://127.0.0.1:34573/solr",
      [mvn]   "core":""}
      [mvn] node props:{
      [mvn]   "base_url":"http://127.0.0.1:40381/solr",
      [mvn]   "core":""}
      [mvn] node props:{
      [mvn]   "base_url":"http://127.0.0.1:34573/solr",
      [mvn]   "core":""}
      [mvn] node props:{
      [mvn]   "base_url":"http://127.0.0.1:27603/solr",
      [mvn]   "core":""}
      [mvn] node props:{
      [mvn]   "base_url":"http://127.0.0.1:62441/solr",
      [mvn]   "core":""}
      [mvn] node props:{
      [mvn]   "base_url":"http://127.0.0.1:34573/solr",
      [mvn]   "core":""}
      [mvn] node props:{
      [mvn]   "base_url":"http://127.0.0.1:27603/solr",
      [mvn]   "core":""}
      [mvn] node props:{
      [mvn]   "base_url":"http://127.0.0.1:40381/solr",
      [mvn]   "core":""}
      [mvn] node props:{
      [mvn]   "base_url":"http://127.0.0.1:62441/solr",
      [mvn]   "core":""}
      [mvn] node props:{
      [mvn]   "base_url":"http://127.0.0.1:34573/solr",
      [mvn]   "core":""}
      [mvn] node props:{
      [mvn]   "base_url":"http://127.0.0.1:27603/solr",
      [mvn]   "core":""}
      [mvn] node props:{
      [mvn]   "base_url":"http://127.0.0.1:62441/solr",
      [mvn]   "core":""}
      [mvn] node props:{
      [mvn]   "base_url":"http://127.0.0.1:40381/solr",
      [mvn]   "core":""}
      [mvn] node props:{
      [mvn]   "base_url":"http://127.0.0.1:34573/solr",
      [mvn]   "core":""}
      [mvn] node props:{
      [mvn]   "base_url":"http://127.0.0.1:27603/solr",
      [mvn]   "core":""}
      [mvn] node props:{
      [mvn]   "base_url":"http://127.0.0.1:34573/solr",
      [mvn]   "core":""}
      [mvn] node props:{
      [mvn]   "base_url":"http://127.0.0.1:40381/solr",
      [mvn]   "core":""}
      [mvn] node props:{
      [mvn]   "base_url":"http://127.0.0.1:62441/solr",
      [mvn]   "core":""}
      [mvn] node props:{
      [mvn]   "base_url":"http://127.0.0.1:34573/solr",
      [mvn]   "core":""}
      [mvn] node props:{
      [mvn]   "base_url":"http://127.0.0.1:27603/solr",
      [mvn]   "core":""}
      [mvn] node props:{
      [mvn]   "base_url":"http://127.0.0.1:40381/solr",
      [mvn]   "core":""}
      [mvn] node props:{
      [mvn]   "base_url":"http://127.0.0.1:62441/solr",
      [mvn]   "core":""}
      [mvn] node props:{
      [mvn]   "base_url":"http://127.0.0.1:27603/solr",
      [mvn]   "core":""}
      [mvn] node props:{
      [mvn]   "base_url":"http://127.0.0.1:34573/solr",
      [mvn]   "core":""}
      [mvn] node props:{
      [mvn]   "base_url":"http://127.0.0.1:40381/solr",
      [mvn]   "core":""}
      [mvn] node props:{
      [mvn]   "base_url":"http://127.0.0.1:62441/solr",
      [mvn]   "core":""}
      [mvn] node props:{
      [mvn]   "base_url":"http://127.0.0.1:40381/solr",
      [mvn]   "core":""}
      [mvn] node props:{
      [mvn]   "base_url":"http://127.0.0.1:27603/solr",
      [mvn]   "core":""}
      [mvn] node props:{
      [mvn]   "base_url":"http://127.0.0.1:62441/solr",
      [mvn]   "core":""}
      [mvn] node props:{
      [mvn]   "base_url":"http://127.0.0.1:40381/solr",
      [mvn]   "core":""}
      [mvn] node props:{
      [mvn]   "base_url":"http://127.0.0.1:62441/solr",
      [mvn]   "core":""}
      [mvn] node props:{
      [mvn]   "base_url":"http://127.0.0.1:34573/solr",
      [mvn]   "core":""}
      [mvn] node props:{
      [mvn]   "base_url":"http://127.0.0.1:27603/solr",
      [mvn]   "core":""}
      [mvn] node props:{
      [mvn]   "base_url":"http://127.0.0.1:40381/solr",
      [mvn]   "core":""}
      [mvn] node props:{
      [mvn]   "base_url":"http://127.0.0.1:34573/solr",
      [mvn]   "core":""}
      [mvn] node props:{
      [mvn]   "base_url":"http://127.0.0.1:27603/solr",
      [mvn]   "core":""}
      [mvn] node props:{
      [mvn]   "base_url":"http://127.0.0.1:62441/solr",
      [mvn]   "core":""}
      [mvn] node props:{
      [mvn]   "base_url":"http://127.0.0.1:34573/solr",
      [mvn]   "core":""}
      [mvn] node props:{
      [mvn]   "base_url":"http://127.0.0.1:27603/solr",
      [mvn]   "core":""}
      [mvn] node props:{
      [mvn]   "base_url":"http://127.0.0.1:40381/solr",
      [mvn]   "core":""}
      [mvn] node props:{
      [mvn]   "base_url":"http://127.0.0.1:34573/solr",
      [mvn]   "core":""}
      [mvn] node props:{
      [mvn]   "base_url":"http://127.0.0.1:27603/solr",
      [mvn]   "core":""}
      [mvn] node props:{
      [mvn]   "base_url":"http://127.0.0.1:40381/solr",
      [mvn]   "core":""}
      [mvn] node props:{
      [mvn]   "base_url":"http://127.0.0.1:62441/solr",
      [mvn]   "core":""}
      [mvn] node props:{
      [mvn]   "base_url":"http://127.0.0.1:27603/solr",
      [mvn]   "core":""}
      [mvn] node props:{
      [mvn]   "base_url":"http://127.0.0.1:34573/solr",
      [mvn]   "core":""}
      [mvn] node props:{
      [mvn]   "base_url":"http://127.0.0.1:27603/solr",
      [mvn]   "core":""}
      [mvn] node props:{
      [mvn]   "base_url":"http://127.0.0.1:40381/solr",
      [mvn]   "core":""}
      [mvn] node props:{
      [mvn]   "base_url":"http://127.0.0.1:62441/solr",
      [mvn]   "core":""}
      [mvn] node props:{
      [mvn]   "base_url":"http://127.0.0.1:34573/solr",
      [mvn]   "core":""}
      [mvn] node props:{
      [mvn]   "base_url":"http://127.0.0.1:27603/solr",
      [mvn]   "core":""}
      [mvn] node props:{
      [mvn]   "base_url":"http://127.0.0.1:62441/solr",
      [mvn]   "core":""}
      [mvn] node props:{
      [mvn]   "base_url":"http://127.0.0.1:34573/solr",
      [mvn]   "core":""}
      [mvn] node props:{
      [mvn]   "base_url":"http://127.0.0.1:27603/solr",
      [mvn]   "core":""}
      [mvn] node props:{
      [mvn]   "base_url":"http://127.0.0.1:62441/solr",
      [mvn]   "core":""}
      [mvn] node props:{
      [mvn]   "base_url":"http://127.0.0.1:27603/solr",
      [mvn]   "core":""}
      [mvn] node props:{
      [mvn]   "base_url":"http://127.0.0.1:62441/solr",
      [mvn]   "core":""}
      [mvn] node props:{
      [mvn]   "base_url":"http://127.0.0.1:34573/solr",
      [mvn]   "core":""}
      [mvn] node props:{
      [mvn]   "base_url":"http://127.0.0.1:27603/solr",
      [mvn]   "core":""}
      [mvn] node props:{
      [mvn]   "base_url":"http://127.0.0.1:40381/solr",
      [mvn]   "core":""}
      [mvn] node props:{
      [mvn]   "base_url":"http://127.0.0.1:62441/solr",
      [mvn]   "core":""}
      [mvn] node props:{
      [mvn]   "base_url":"http://127.0.0.1:34573/solr",
      [mvn]   "core":""}
      [mvn] node props:{
      [mvn]   "base_url":"http://127.0.0.1:27603/solr",
      [mvn]   "core":""}
      [mvn] node props:{
      [mvn]   "base_url":"http://127.0.0.1:40381/solr",
      [mvn]   "core":""}
      [mvn] node props:{
      [mvn]   "base_url":"http://127.0.0.1:40381/solr",
      [mvn]   "core":""}
      [mvn] node props:{
      [mvn]   "base_url":"http://127.0.0.1:62441/solr",
      [mvn]   "core":""}
      [mvn] node props:{
      [mvn]   "base_url":"http://127.0.0.1:34573/solr",
      [mvn]   "core":""}
      [mvn] node props:{
      [mvn]   "base_url":"http://127.0.0.1:40381/solr",
      [mvn]   "core":""}
      [mvn] node props:{
      [mvn]   "base_url":"http://127.0.0.1:34573/solr",
      [mvn]   "core":""}
      [mvn] node props:{
      [mvn]   "base_url":"http://127.0.0.1:40381/solr",
      [mvn]   "core":""}
      [mvn] node props:{
      [mvn]   "base_url":"http://127.0.0.1:40381/solr",
      [mvn]   "core":""}
      [mvn] node props:{
      [mvn]   "base_url":"http://127.0.0.1:62441/solr",
      [mvn]   "core":""}
      [mvn] node props:{
      [mvn]   "base_url":"http://127.0.0.1:62441/solr",
      [mvn]   "core":""}
      [mvn] node props:{
      [mvn]   "base_url":"http://127.0.0.1:34573/solr",
      [mvn]   "core":""}
      [mvn] node props:{
      [mvn]   "base_url":"http://127.0.0.1:40381/solr",
      [mvn]   "core":""}
      [mvn] node props:{
      [mvn]   "base_url":"http://127.0.0.1:34573/solr",
      [mvn]   "core":""}
      [mvn] node props:{
      [mvn]   "base_url":"http://127.0.0.1:27603/solr",
      [mvn]   "core":""}
      [mvn] node props:{
      [mvn]   "base_url":"http://127.0.0.1:40381/solr",
      [mvn]   "core":""}
      [mvn] node props:{
      [mvn]   "base_url":"http://127.0.0.1:34573/solr",
      [mvn]   "core":""}
      [mvn] node props:{
      [mvn]   "base_url":"http://127.0.0.1:40381/solr",
      [mvn]   "core":""}
      [mvn] node props:{
      [mvn]   "base_url":"http://127.0.0.1:62441/solr",
      [mvn]   "core":""}
      [mvn] node props:{
      [mvn]   "base_url":"http://127.0.0.1:34573/solr",
      [mvn]   "core":""}
      [mvn] node props:{
      [mvn]   "base_url":"http://127.0.0.1:27603/solr",
      [mvn]   "core":""}
      [mvn] node props:{
      [mvn]   "base_url":"http://127.0.0.1:34573/solr",
      [mvn]   "core":""}
      [mvn] node props:{
      [mvn]   "base_url":"http://127.0.0.1:40381/solr",
      [mvn]   "core":""}
      [mvn] node props:{
      [mvn]   "base_url":"http://127.0.0.1:27603/solr",
      [mvn]   "core":""}
      [mvn] node props:{
      [mvn]   "base_url":"http://127.0.0.1:34573/solr",
      [mvn]   "core":""}
      [mvn] node props:{
      [mvn]   "base_url":"http://127.0.0.1:40381/solr",
      [mvn]   "core":""}
      [mvn] node props:{
      [mvn]   "base_url":"http://127.0.0.1:62441/solr",
      [mvn]   "core":""}
      [mvn] node props:{
      [mvn]   "base_url":"http://127.0.0.1:27603/solr",
      [mvn]   "core":""}
      [mvn] node props:{
      [mvn]   "base_url":"http://127.0.0.1:40381/solr",
      [mvn]   "core":""}
      [mvn] node props:{
      [mvn]   "base_url":"http://127.0.0.1:62441/solr",
      [mvn]   "core":""}
      [mvn] node props:{
      [mvn]   "base_url":"http://127.0.0.1:34573/solr",
      [mvn]   "core":""}
      [mvn] node props:{
      [mvn]   "base_url":"http://127.0.0.1:34573/solr",
      [mvn]   "core":""}
      [mvn] node props:{
      [mvn]   "base_url":"http://127.0.0.1:62441/solr",
      [mvn]   "core":""}
      [mvn] node props:{
      [mvn]   "base_url":"http://127.0.0.1:34573/solr",
      [mvn]   "core":""}
      [mvn] node props:{
      [mvn]   "base_url":"http://127.0.0.1:27603/solr",
      [mvn]   "core":""}
      [mvn] node props:{
      [mvn]   "base_url":"http://127.0.0.1:40381/solr",
      [mvn]   "core":""}
      [mvn] node props:{
      [mvn]   "base_url":"http://127.0.0.1:34573/solr",
      [mvn]   "core":""}
      [mvn] node props:{
      [mvn]   "base_url":"http://127.0.0.1:40381/solr",
      [mvn]   "core":""}
      [mvn] node props:{
      [mvn]   "base_url":"http://127.0.0.1:27603/solr",
      [mvn]   "core":""}
      [mvn] node props:{
      [mvn]   "base_url":"http://127.0.0.1:40381/solr",
      [mvn]   "core":""}
      [mvn] node props:{
      [mvn]   "base_url":"http://127.0.0.1:34573/solr",
      [mvn]   "core":""}
      [mvn] node props:{
      [mvn]   "base_url":"http://127.0.0.1:40381/solr",
      [mvn]   "core":""}
      [mvn] node props:{
      [mvn]   "base_url":"http://127.0.0.1:62441/solr",
      [mvn]   "core":""}
      [mvn] node props:{
      [mvn]   "base_url":"http://127.0.0.1:34573/solr",
      [mvn]   "core":""}
      [mvn] node props:{
      [mvn]   "base_url":"http://127.0.0.1:27603/solr",
      [mvn]   "core":""}
      [mvn] node props:{
      [mvn]   "base_url":"http://127.0.0.1:40381/solr",
      [mvn]   "core":""}
      [mvn] node props:{
      [mvn]   "base_url":"http://127.0.0.1:40381/solr",
      [mvn]   "core":""}
      [mvn] node props:{
      [mvn]   "base_url":"http://127.0.0.1:62441/solr",
      [mvn]   "core":""}
      [mvn] node props:{
      [mvn]   "base_url":"http://127.0.0.1:34573/solr",
      [mvn]   "core":""}
      [mvn] node props:{
      [mvn]   "base_url":"http://127.0.0.1:27603/solr",
      [mvn]   "core":""}
      [mvn] node props:{
      [mvn]   "base_url":"http://127.0.0.1:40381/solr",
      [mvn]   "core":""}
      [mvn] node props:{
      [mvn]   "base_url":"http://127.0.0.1:40381/solr",
      [mvn]   "core":""}
      [mvn] node props:{
      [mvn]   "base_url":"http://127.0.0.1:62441/solr",
      [mvn]   "core":""}
      [mvn] node props:{
      [mvn]   "base_url":"http://127.0.0.1:34573/solr",
      [mvn]   "core":""}
      [mvn] node props:{
      [mvn]   "base_url":"http://127.0.0.1:62441/solr",
      [mvn]   "core":""}
      [mvn] node props:{
      [mvn]   "base_url":"http://127.0.0.1:40381/solr",
      [mvn]   "core":""}
      [mvn] node props:{
      [mvn]   "base_url":"http://127.0.0.1:34573/solr",
      [mvn]   "core":""}
      [mvn] node props:{
      [mvn]   "base_url":"http://127.0.0.1:27603/solr",
      [mvn]   "core":""}
      [mvn] node props:{
      [mvn]   "base_url":"http://127.0.0.1:40381/solr",
      [mvn]   "core":""}
      [mvn] node props:{
      [mvn]   "base_url":"http://127.0.0.1:40381/solr",
      [mvn]   "core":""}
      [mvn] node props:{
      [mvn]   "base_url":"http://127.0.0.1:62441/solr",
      [mvn]   "core":""}
      [mvn] node props:{
      [mvn]   "base_url":"http://127.0.0.1:27603/solr",
      [mvn]   "core":""}
      [mvn] node props:{
      [mvn]   "base_url":"http://127.0.0.1:40381/solr",
      [mvn]   "core":""}
      [mvn] node props:{
      [mvn]   "base_url":"http://127.0.0.1:62441/solr",
      [mvn]   "core":""}
      [mvn] node props:{
      [mvn]   "base_url":"http://127.0.0.1:34573/solr",
      [mvn]   "core":""}
      [mvn] node props:{
      [mvn]   "base_url":"http://127.0.0.1:27603/solr",
      [mvn]   "core":""}
      [mvn] node props:{
      [mvn]   "base_url":"http://127.0.0.1:40381/solr",
      [mvn]   "core":""}
      [mvn] node props:{
      [mvn]   "base_url":"http://127.0.0.1:34573/solr",
      [mvn]   "core":""}
      [mvn] node props:{
      [mvn]   "base_url":"http://127.0.0.1:62441/solr",
      [mvn]   "core":""}
      [mvn] node props:{
      [mvn]   "base_url":"http://127.0.0.1:34573/solr",
      [mvn]   "core":""}
      [mvn] node props:{
      [mvn]   "base_url":"http://127.0.0.1:27603/solr",
      [mvn]   "core":""}
      [mvn] node props:{
      [mvn]   "base_url":"http://127.0.0.1:27603/solr",
      [mvn]   "core":""}
      [mvn] node props:{
      [mvn]   "base_url":"http://127.0.0.1:62441/solr",
      [mvn]   "core":""}
      [mvn] node props:{
      [mvn]   "base_url":"http://127.0.0.1:34573/solr",
      [mvn]   "core":""}
      [mvn] node props:{
      [mvn]   "base_url":"http://127.0.0.1:62441/solr",
      [mvn]   "core":""}
      [mvn] node props:{
      [mvn]   "base_url":"http://127.0.0.1:34573/solr",
      [mvn]   "core":""}
      [mvn] node props:{
      [mvn]   "base_url":"http://127.0.0.1:34573/solr",
      [mvn]   "core":""}
      [mvn] node props:{
      [mvn]   "base_url":"http://127.0.0.1:40381/solr",
      [mvn]   "core":""}
      [mvn] node props:{
      [mvn]   "base_url":"http://127.0.0.1:34573/solr",
      [mvn]   "core":""}
      [mvn] node props:{
      [mvn]   "base_url":"http://127.0.0.1:40381/solr",
      [mvn]   "core":""}
      [mvn] node props:{
      [mvn]   "base_url":"http://127.0.0.1:62441/solr",
      [mvn]   "core":""}
      [mvn] node props:{
      [mvn]   "base_url":"http://127.0.0.1:27603/solr",
      [mvn]   "core":""}
      [mvn] node props:{
      [mvn]   "base_url":"http://127.0.0.1:34573/solr",
      [mvn]   "core":""}
      [mvn] node props:{
      [mvn]   "base_url":"http://127.0.0.1:27603/solr",
      [mvn]   "core":""}
      [mvn] node props:{
      [mvn]   "base_url":"http://127.0.0.1:40381/solr",
      [mvn]   "core":""}
      [mvn] node props:{
      [mvn]   "base_url":"http://127.0.0.1:27603/solr",
      [mvn]   "core":""}
      [mvn] node props:{
      [mvn]   "base_url":"http://127.0.0.1:40381/solr",
      [mvn]   "core":""}
      [mvn] node props:{
      [mvn]   "base_url":"http://127.0.0.1:62441/solr",
      [mvn]   "core":""}
      [mvn] node props:{
      [mvn]   "base_url":"http://127.0.0.1:40381/solr",
      [mvn]   "core":""}
      [mvn] node props:{
      [mvn]   "base_url":"http://127.0.0.1:34573/solr",
      [mvn]   "core":""}
      [mvn] node props:{
      [mvn]   "base_url":"http://127.0.0.1:62441/solr",
      [mvn]   "core":""}
      [mvn] node props:{
      [mvn]   "base_url":"http://127.0.0.1:34573/solr",
      [mvn]   "core":""}
      [mvn] node props:{
      [mvn]   "base_url":"http://127.0.0.1:27603/solr",
      [mvn]   "core":""}
      [mvn] node props:{
      [mvn]   "base_url":"http://127.0.0.1:40381/solr",
      [mvn]   "core":""}
      [mvn] node props:{
      [mvn]   "base_url":"http://127.0.0.1:62441/solr",
      [mvn]   "core":""}
      [mvn] node props:{
      [mvn]   "base_url":"http://127.0.0.1:34573/solr",
      [mvn]   "core":""}
      [mvn] node props:{
      [mvn]   "base_url":"http://127.0.0.1:27603/solr",
      [mvn]   "core":""}
      [mvn] node props:{
      [mvn]   "base_url":"http://127.0.0.1:40381/solr",
      [mvn]   "core":""}
      [mvn] node props:{
      [mvn]   "base_url":"http://127.0.0.1:40381/solr",
      [mvn]   "core":""}
      [mvn] node props:{
      [mvn]   "base_url":"http://127.0.0.1:62441/solr",
      [mvn]   "core":""}
      [mvn] node props:{
      [mvn]   "base_url":"http://127.0.0.1:34573/solr",
      [mvn]   "core":""}
      [mvn] node props:{
      [mvn]   "base_url":"http://127.0.0.1:40381/solr",
      [mvn]   "core":""}
      [mvn] node props:{
      [mvn]   "base_url":"http://127.0.0.1:34573/solr",
      [mvn]   "core":""}
      [mvn] node props:{
      [mvn]   "base_url":"http://127.0.0.1:27603/solr",
      [mvn]   "core":""}
      [mvn] node props:{
      [mvn]   "base_url":"http://127.0.0.1:40381/solr",
      [mvn]   "core":""}
      [mvn] node props:{
      [mvn]   "base_url":"http://127.0.0.1:34573/solr",
      [mvn]   "core":""}
      [mvn] node props:{
      [mvn]   "base_url":"http://127.0.0.1:27603/solr",
      [mvn]   "core":""}
      [mvn] node props:{
      [mvn]   "base_url":"http://127.0.0.1:40381/solr",
      [mvn]   "core":""}
      [mvn] node props:{
      [mvn]   "base_url":"http://127.0.0.1:62441/solr",
      [mvn]   "core":""}
      [mvn] node props:{
      [mvn]   "base_url":"http://127.0.0.1:62441/solr",
      [mvn]   "core":""}
      [mvn] node props:{
      [mvn]   "base_url":"http://127.0.0.1:34573/solr",
      [mvn]   "core":""}
      [mvn] node props:{
      [mvn]   "base_url":"http://127.0.0.1:27603/solr",
      [mvn]   "core":""}
      [mvn] node props:{
      [mvn]   "base_url":"http://127.0.0.1:62441/solr",
      [mvn]   "core":""}
      [mvn] node props:{
      [mvn]   "base_url":"http://127.0.0.1:34573/solr",
      [mvn]   "core":""}
      [mvn] node props:{
      [mvn]   "base_url":"http://127.0.0.1:40381/solr",
      [mvn]   "core":""}
      [mvn] node props:{
      [mvn]   "base_url":"http://127.0.0.1:34573/solr",
      [mvn]   "core":""}
      [mvn] node props:{
      [mvn]   "base_url":"http://127.0.0.1:40381/solr",
      [mvn]   "core":""}
      [mvn] node props:{
      [mvn]   "base_url":"http://127.0.0.1:62441/solr",
      [mvn]   "core":""}
      [mvn] node props:{
      [mvn]   "base_url":"http://127.0.0.1:27603/solr",
      [mvn]   "core":""}
      [mvn] node props:{
      [mvn]   "base_url":"http://127.0.0.1:62441/solr",
      [mvn]   "core":""}
      [mvn] node props:{
      [mvn]   "base_url":"http://127.0.0.1:27603/solr",
      [mvn]   "core":""}
      [mvn] node props:{
      [mvn]   "base_url":"http://127.0.0.1:62441/solr",
      [mvn]   "core":""}
      [mvn] node props:{
      [mvn]   "base_url":"http://127.0.0.1:62441/solr",
      [mvn]   "core":""}
      [mvn] node props:{
      [mvn]   "base_url":"http://127.0.0.1:34573/solr",
      [mvn]   "core":""}
      [mvn] node props:{
      [mvn]   "base_url":"http://127.0.0.1:27603/solr",
      [mvn]   "core":""}
      [mvn] node props:{
      [mvn]   "base_url":"http://127.0.0.1:34573/solr",
      [mvn]   "core":""}
      [mvn] node props:{
      [mvn]   "base_url":"http://127.0.0.1:27603/solr",
      [mvn]   "core":""}
      [mvn] node props:{
      [mvn]   "base_url":"http://127.0.0.1:62441/solr",
      [mvn]   "core":""}
      [mvn] node props:{
      [mvn]   "base_url":"http://127.0.0.1:34573/solr",
      [mvn]   "core":""}
      [mvn] node props:{
      [mvn]   "base_url":"http://127.0.0.1:40381/solr",
      [mvn]   "core":""}
      [mvn] node props:{
      [mvn]   "base_url":"http://127.0.0.1:62441/solr",
      [mvn]   "core":""}
      [mvn] node props:{
      [mvn]   "base_url":"http://127.0.0.1:27603/solr",
      [mvn]   "core":""}
      [mvn] node props:{
      [mvn]   "base_url":"http://127.0.0.1:40381/solr",
      [mvn]   "core":""}
      [mvn] node props:{
      [mvn]   "base_url":"http://127.0.0.1:62441/solr",
      [mvn]   "core":""}
      [mvn] node props:{
      [mvn]   "base_url":"http://127.0.0.1:34573/solr",
      [mvn]   "core":""}
      [mvn] node props:{
      [mvn]   "base_url":"http://127.0.0.1:27603/solr",
      [mvn]   "core":""}
      [mvn] node props:{
      [mvn]   "base_url":"http://127.0.0.1:40381/solr",
      [mvn]   "core":""}
      [mvn] node props:{
      [mvn]   "base_url":"http://127.0.0.1:62441/solr",
      [mvn]   "core":""}
      [mvn] node props:{
      [mvn]   "base_url":"http://127.0.0.1:40381/solr",
      [mvn]   "core":""}
      [mvn] node props:{
      [mvn]   "base_url":"http://127.0.0.1:34573/solr",
      [mvn]   "core":""}
      [mvn] node props:{
      [mvn]   "base_url":"http://127.0.0.1:40381/solr",
      [mvn]   "core":""}
      [mvn] node props:{
      [mvn]   "base_url":"http://127.0.0.1:34573/solr",
      [mvn]   "core":""}
      [mvn] node props:{
      [mvn]   "base_url":"http://127.0.0.1:40381/solr",
      [mvn]   "core":""}
      [mvn] node props:{
      [mvn]   "base_url":"http://127.0.0.1:62441/solr",
      [mvn]   "core":""}
      [mvn] node props:{
      [mvn]   "base_url":"http://127.0.0.1:34573/solr",
      [mvn]   "core":""}
      [mvn] node props:{
      [mvn]   "base_url":"http://127.0.0.1:34573/solr",
      [mvn]   "core":""}
      [mvn] node props:{
      [mvn]   "base_url":"http://127.0.0.1:27603/solr",
      [mvn]   "core":""}
      [mvn] node props:{
      [mvn]   "base_url":"http://127.0.0.1:40381/solr",
      [mvn]   "core":""}
      [mvn] node props:{
      [mvn]   "base_url":"http://127.0.0.1:34573/solr",
      [mvn]   "core":""}
      [mvn] node props:{
      [mvn]   "base_url":"http://127.0.0.1:27603/solr",
      [mvn]   "core":""}
      [mvn] node props:{
      [mvn]   "base_url":"http://127.0.0.1:40381/solr",
      [mvn]   "core":""}
      [mvn] node props:{
      [mvn]   "base_url":"http://127.0.0.1:62441/solr",
      [mvn]   "core":""}
      [mvn] node props:{
      [mvn]   "base_url":"http://127.0.0.1:34573/solr",
      [mvn]   "core":""}
      [mvn] node props:{
      [mvn]   "base_url":"http://127.0.0.1:40381/solr",
      [mvn]   "core":""}
      [mvn] node props:{
      [mvn]   "base_url":"http://127.0.0.1:62441/solr",
      [mvn]   "core":""}
      [mvn] node props:{
      [mvn]   "base_url":"http://127.0.0.1:27603/solr",
      [mvn]   "core":""}
      [mvn] node props:{
      [mvn]   "base_url":"http://127.0.0.1:40381/solr",
      [mvn]   "core":""}
      [mvn] node props:{
      [mvn]   "base_url":"http://127.0.0.1:34573/solr",
      [mvn]   "core":""}
      [mvn] node props:{
      [mvn]   "base_url":"http://127.0.0.1:40381/solr",
      [mvn]   "core":""}
      [mvn] node props:{
      [mvn]   "base_url":"http://127.0.0.1:27603/solr",
      [mvn]   "core":""}
      [mvn] node props:{
      [mvn]   "base_url":"http://127.0.0.1:62441/solr",
      [mvn]   "core":""}
      [mvn] node props:{
      [mvn]   "base_url":"http://127.0.0.1:27603/solr",
      [mvn]   "core":""}
      [mvn] node props:{
      [mvn]   "base_url":"http://127.0.0.1:62441/solr",
      [mvn]   "core":""}
      [mvn] node props:{
      [mvn]   "base_url":"http://127.0.0.1:34573/solr",
      [mvn]   "core":""}
      [mvn] node props:{
      [mvn]   "base_url":"http://127.0.0.1:27603/solr",
      [mvn]   "core":""}
      [mvn] node props:{
      [mvn]   "base_url":"http://127.0.0.1:40381/solr",
      [mvn]   "core":""}
      [mvn] node props:{
      [mvn]   "base_url":"http://127.0.0.1:62441/solr",
      [mvn]   "core":""}
      [mvn] node props:{
      [mvn]   "base_url":"http://127.0.0.1:34573/solr",
      [mvn]   "core":""}
      [mvn] node props:{
      [mvn]   "base_url":"http://127.0.0.1:27603/solr",
      [mvn]   "core":""}
      [mvn] node props:{
      [mvn]   "base_url":"http://127.0.0.1:40381/solr",
      [mvn]   "core":""}
      [mvn] node props:{
      [mvn]   "base_url":"http://127.0.0.1:27603/solr",
      [mvn]   "core":""}
      [mvn] node props:{
      [mvn]   "base_url":"http://127.0.0.1:40381/solr",
      [mvn]   "core":""}
      [mvn] node props:{
      [mvn]   "base_url":"http://127.0.0.1:27603/solr",
      [mvn]   "core":""}
      [mvn] node props:{
      [mvn]   "base_url":"http://127.0.0.1:40381/solr",
      [mvn]   "core":""}
      [mvn] node props:{
      [mvn]   "base_url":"http://127.0.0.1:62441/solr",
      [mvn]   "core":""}
      [mvn] node props:{
      [mvn]   "base_url":"http://127.0.0.1:27603/solr",
      [mvn]   "core":""}
      [mvn] node props:{
      [mvn]   "base_url":"http://127.0.0.1:40381/solr",
      [mvn]   "core":""}
      [mvn] node props:{
      [mvn]   "base_url":"http://127.0.0.1:62441/solr",
      [mvn]   "core":""}
      [mvn] node props:{
      [mvn]   "base_url":"http://127.0.0.1:27603/solr",
      [mvn]   "core":""}
      [mvn] node props:{
      [mvn]   "base_url":"http://127.0.0.1:27603/solr",
      [mvn]   "core":""}
      [mvn] node props:{
      [mvn]   "base_url":"http://127.0.0.1:62441/solr",
      [mvn]   "core":""}
      [mvn] node props:{
      [mvn]   "base_url":"http://127.0.0.1:34573/solr",
      [mvn]   "core":""}
      [mvn] node props:{
      [mvn]   "base_url":"http://127.0.0.1:27603/solr",
      [mvn]   "core":""}
      [mvn] node props:{
      [mvn]   "base_url":"http://127.0.0.1:40381/solr",
      [mvn]   "core":""}
      [mvn] node props:{
      [mvn]   "base_url":"http://127.0.0.1:62441/solr",
      [mvn]   "core":""}
      [mvn] node props:{
      [mvn]   "base_url":"http://127.0.0.1:34573/solr",
      [mvn]   "core":""}
      [mvn] node props:{
      [mvn]   "base_url":"http://127.0.0.1:27603/solr",
      [mvn]   "core":""}
      [mvn] node props:{
      [mvn]   "base_url":"http://127.0.0.1:62441/solr",
      [mvn]   "core":""}
      [mvn] node props:{
      [mvn]   "base_url":"http://127.0.0.1:40381/solr",
      [mvn]   "core":""}
      [mvn] Tests run: 1, Failures: 0, Errors: 0, Skipped: 0, Time elapsed: 3.179 sec
      [mvn] Running org.apache.solr.schema.NotRequiredUniqueKeyTest
      [mvn] Creating dataDir: /usr/home/hudson/hudson-slave/workspace/Lucene-Solr-Maven-trunk/maven-build/solr/core/src/test/target/test/./solrtest-NotRequiredUniqueKeyTest-1348328785448
      [mvn] Tests run: 1, Failures: 0, Errors: 0, Skipped: 0, Time elapsed: 0.156 sec
      [mvn] Running org.apache.solr.core.TestPropInjectDefaults
      [mvn] Creating dataDir: /usr/home/hudson/hudson-slave/workspace/Lucene-Solr-Maven-trunk/maven-build/solr/core/src/test/target/test/./solrtest-TestPropInjectDefaults-1348328785606
      [mvn] Tests run: 2, Failures: 0, Errors: 0, Skipped: 0, Time elapsed: 0.307 sec
      [mvn] Running org.apache.solr.search.TestSolrQueryParser
      [mvn] Creating dataDir: /usr/home/hudson/hudson-slave/workspace/Lucene-Solr-Maven-trunk/maven-build/solr/core/src/test/target/test/./solrtest-TestSolrQueryParser-1348328785917
      [mvn] Tests run: 1, Failures: 0, Errors: 0, Skipped: 0, Time elapsed: 0.379 sec
      [mvn] Running org.apache.solr.core.RequestHandlersTest
      [mvn] Creating dataDir: /usr/home/hudson/hudson-slave/workspace/Lucene-Solr-Maven-trunk/maven-build/solr/core/src/test/target/test/./solrtest-RequestHandlersTest-1348328786291
      [mvn] Tests run: 3, Failures: 0, Errors: 0, Skipped: 0, Time elapsed: 0.437 sec
      [mvn] Running org.apache.solr.util.TestUtils
      [mvn] Tests run: 3, Failures: 0, Errors: 0, Skipped: 0, Time elapsed: 0.011 sec
      [mvn] Running org.apache.solr.cloud.TestHashPartitioner
      [mvn] Tests run: 1, Failures: 0, Errors: 0, Skipped: 0, Time elapsed: 16.649 sec
      [mvn] Running org.apache.solr.search.TestLRUCache
      [mvn] Tests run: 3, Failures: 0, Errors: 0, Skipped: 0, Time elapsed: 0.017 sec
      [mvn] Running org.apache.solr.update.UpdateParamsTest
      [mvn] Tests run: 1, Failures: 0, Errors: 0, Skipped: 0, Time elapsed: 0.483 sec
      [mvn] Running org.apache.solr.update.processor.UniqFieldsUpdateProcessorFactoryTest
      [mvn] Creating dataDir: /usr/home/hudson/hudson-slave/workspace/Lucene-Solr-Maven-trunk/maven-build/solr/core/src/test/target/test/./solrtest-UniqFieldsUpdateProcessorFactoryTest-1348328803893
      [mvn] Tests run: 1, Failures: 0, Errors: 0, Skipped: 0, Time elapsed: 0.368 sec
      [mvn] Running org.apache.solr.handler.component.DistributedTermsComponentTest
      [mvn] Tests run: 1, Failures: 0, Errors: 0, Skipped: 0, Time elapsed: 4.061 sec
      [mvn] Running org.apache.solr.core.PluginInfoTest
      [mvn] Tests run: 9, Failures: 0, Errors: 0, Skipped: 0, Time elapsed: 0.036 sec
      [mvn] Running org.apache.solr.search.TestStressRecovery
      [mvn] Creating dataDir: /usr/home/hudson/hudson-slave/workspace/Lucene-Solr-Maven-trunk/maven-build/solr/core/src/test/target/test/./solrtest-TestStressRecovery-1348328808369
      [mvn] Tests run: 1, Failures: 0, Errors: 0, Skipped: 0, Time elapsed: 5.175 sec
      [mvn] Running org.apache.solr.update.processor.UpdateRequestProcessorFactoryTest
      [mvn] Tests run: 2, Failures: 0, Errors: 0, Skipped: 0, Time elapsed: 0.769 sec
      [mvn] Running org.apache.solr.handler.JsonLoaderTest
      [mvn] Creating dataDir: /usr/home/hudson/hudson-slave/workspace/Lucene-Solr-Maven-trunk/maven-build/solr/core/src/test/target/test/./solrtest-JsonLoaderTest-1348328814314
      [mvn] Tests run: 6, Failures: 0, Errors: 0, Skipped: 0, Time elapsed: 0.487 sec
      [mvn] Running org.apache.solr.TestRandomFaceting
      [mvn] Creating dataDir: /usr/home/hudson/hudson-slave/workspace/Lucene-Solr-Maven-trunk/maven-build/solr/core/src/test/target/test/./solrtest-TestRandomFaceting-1348328814799
      [mvn] Tests run: 1, Failures: 0, Errors: 0, Skipped: 0, Time elapsed: 9.54 sec
      [mvn] Running org.apache.solr.schema.CurrencyFieldTest
      [mvn] Creating dataDir: /usr/home/hudson/hudson-slave/workspace/Lucene-Solr-Maven-trunk/maven-build/solr/core/src/test/target/test/./solrtest-CurrencyFieldTest-1348328824338
      [mvn] Tests run: 8, Failures: 0, Errors: 0, Skipped: 1, Time elapsed: 0.519 sec
      [mvn] Running org.apache.solr.update.DocumentBuilderTest
      [mvn] Creating dataDir: /usr/home/hudson/hudson-slave/workspace/Lucene-Solr-Maven-trunk/maven-build/solr/core/src/test/target/test/./solrtest-DocumentBuilderTest-1348328824857
      [mvn] Tests run: 11, Failures: 0, Errors: 0, Skipped: 0, Time elapsed: 0.415 sec
      [mvn] Running org.apache.solr.core.SOLR749Test
      [mvn] Creating dataDir: /usr/home/hudson/hudson-slave/workspace/Lucene-Solr-Maven-trunk/maven-build/solr/core/src/test/target/test/./solrtest-SOLR749Test-1348328825273
      [mvn] Tests run: 1, Failures: 0, Errors: 0, Skipped: 0, Time elapsed: 0.329 sec
      [mvn] Running org.apache.solr.internal.csv.CSVParserTest
      [mvn] Tests run: 23, Failures: 0, Errors: 0, Skipped: 0, Time elapsed: 0.008 sec
      [mvn] Running org.apache.solr.handler.StandardRequestHandlerTest
      [mvn] Tests run: 1, Failures: 0, Errors: 0, Skipped: 0, Time elapsed: 0.38 sec
      [mvn] Running org.apache.solr.util.TestFastWriter
      [mvn] Tests run: 1, Failures: 0, Errors: 0, Skipped: 0, Time elapsed: 0.184 sec
      [mvn] Running org.apache.solr.core.CoreContainerCoreInitFailuresTest
      [mvn] 96 T819 oasc.CoreContainer.create SEVERE Unable to create core: col_bad Ignoring exception matching \QDummyMergePolicy\E
      [mvn] 124 T3 oasc.SolrCore.finalize SEVERE REFCOUNT ERROR: unreferenced org.apache.solr.core.SolrCore@4e9ceaa9 (col_bad) has a reference count of 1
      [mvn] 141 T819 oasc.CoreContainer.create SEVERE Unable to create core: bogus Ignoring exception matching \Qbogus_path\E
      [mvn] 151 T819 oasc.CoreContainer.reload SEVERE Unable to reload core: col_bad Ignoring exception matching \QSAX\E
      [mvn] 210 T819 oasc.CoreContainer.create SEVERE Unable to create core: bogus Ignoring exception matching \Qbogus_path\E
      [mvn] Tests run: 2, Failures: 0, Errors: 0, Skipped: 0, Time elapsed: 0.223 sec
      [mvn] Running org.apache.solr.TestGroupingSearch
      [mvn] Creating dataDir: /usr/home/hudson/hudson-slave/workspace/Lucene-Solr-Maven-trunk/maven-build/solr/core/src/test/target/test/./solrtest-TestGroupingSearch-1348328826411
      [mvn] Tests run: 12, Failures: 0, Errors: 0, Skipped: 0, Time elapsed: 2.363 sec
      [mvn] Running org.apache.solr.TestJoin
      [mvn] Creating dataDir: /usr/home/hudson/hudson-slave/workspace/Lucene-Solr-Maven-trunk/maven-build/solr/core/src/test/target/test/./solrtest-TestJoin-1348328828768
      [mvn] Tests run: 2, Failures: 0, Errors: 0, Skipped: 0, Time elapsed: 4.538 sec
      [mvn] Running org.apache.solr.core.AlternateDirectoryTest
      [mvn] Creating dataDir: /usr/home/hudson/hudson-slave/workspace/Lucene-Solr-Maven-trunk/maven-build/solr/core/src/test/target/test/./solrtest-AlternateDirectoryTest-1348328833304
      [mvn] Tests run: 1, Failures: 0, Errors: 0, Skipped: 0, Time elapsed: 0.294 sec
      [mvn] Running org.apache.solr.search.TestSolrJ
      [mvn] Tests run: 1, Failures: 0, Errors: 0, Skipped: 0, Time elapsed: 0.012 sec
      [mvn] Running org.apache.solr.handler.component.TermsComponentTest
      [mvn] Creating dataDir: /usr/home/hudson/hudson-slave/workspace/Lucene-Solr-Maven-trunk/maven-build/solr/core/src/test/target/test/./solrtest-TermsComponentTest-1348328833614
      [mvn] Tests run: 13, Failures: 0, Errors: 0, Skipped: 0, Time elapsed: 0.444 sec
      [mvn] Running org.apache.solr.request.JSONWriterTest
      [mvn] Creating dataDir: /usr/home/hudson/hudson-slave/workspace/Lucene-Solr-Maven-trunk/maven-build/solr/core/src/test/target/test/./solrtest-JSONWriterTest-1348328834062
      [mvn] Tests run: 3, Failures: 0, Errors: 0, Skipped: 0, Time elapsed: 0.369 sec
      [mvn] Running org.apache.solr.analysis.TestReversedWildcardFilterFactory
      [mvn] Creating dataDir: /usr/home/hudson/hudson-slave/workspace/Lucene-Solr-Maven-trunk/maven-build/solr/core/src/test/target/test/./solrtest-TestReversedWildcardFilterFactory-1348328834431
      [mvn] Tests run: 4, Failures: 0, Errors: 0, Skipped: 0, Time elapsed: 0.324 sec
      [mvn] Running org.apache.solr.internal.csv.ExtendedBufferedReaderTest
      [mvn] Tests run: 8, Failures: 0, Errors: 0, Skipped: 0, Time elapsed: 0.003 sec
      [mvn] Running org.apache.solr.handler.admin.LukeRequestHandlerTest
      [mvn] Tests run: 4, Failures: 0, Errors: 0, Skipped: 0, Time elapsed: 1.921 sec
      [mvn] Running org.apache.solr.util.FileUtilsTest
      [mvn] Tests run: 1, Failures: 0, Errors: 0, Skipped: 0, Time elapsed: 0.016 sec
      [mvn] Running org.apache.solr.highlight.FastVectorHighlighterTest
      [mvn] Creating dataDir: /usr/home/hudson/hudson-slave/workspace/Lucene-Solr-Maven-trunk/maven-build/solr/core/src/test/target/test/./solrtest-FastVectorHighlighterTest-1348328836701
      [mvn] Tests run: 2, Failures: 0, Errors: 0, Skipped: 0, Time elapsed: 0.506 sec
      [mvn] Running org.apache.solr.search.TestDocSet
      [mvn] Tests run: 2, Failures: 0, Errors: 0, Skipped: 0, Time elapsed: 0.711 sec
      [mvn] Running org.apache.solr.search.TestExtendedDismaxParser
      [mvn] Tests run: 10, Failures: 0, Errors: 0, Skipped: 0, Time elapsed: 4.541 sec
      [mvn] Running org.apache.solr.core.TestSolrDeletionPolicy1
      [mvn] Creating dataDir: /usr/home/hudson/hudson-slave/workspace/Lucene-Solr-Maven-trunk/maven-build/solr/core/src/test/target/test/./solrtest-TestSolrDeletionPolicy1-1348328842461
      [mvn] Tests run: 3, Failures: 0, Errors: 0, Skipped: 0, Time elapsed: 0.694 sec
      [mvn] Running org.apache.solr.handler.admin.CoreAdminHandlerTest
      [mvn] Creating dataDir: /usr/home/hudson/hudson-slave/workspace/Lucene-Solr-Maven-trunk/maven-build/solr/core/src/test/target/test/./solrtest-CoreAdminHandlerTest-1348328843152
      [mvn] 1046 T892 oasc.CoreContainer.create SEVERE Unable to create core: bogus_dir_core java.io.IOException: Can't find resource 'solrconfig.xml' in classpath or '/usr/home/hudson/hudson-slave/workspace/Lucene-Solr-Maven-trunk/maven-build/solr/core/src/test/target/test-classes/solr/dir_does_not_exist_127896/conf/', cwd=/usr/home/hudson/hudson-slave/workspace/Lucene-Solr-Maven-trunk/maven-build/solr/core/src/test/target/test
      [mvn] 	at org.apache.solr.core.SolrResourceLoader.openResource(SolrResourceLoader.java:314)
      [mvn] 	at org.apache.solr.core.SolrResourceLoader.openConfig(SolrResourceLoader.java:280)
      [mvn] 	at org.apache.solr.core.Config.<init>(Config.java:111)
      [mvn] 	at org.apache.solr.core.Config.<init>(Config.java:78)
      [mvn] 	at org.apache.solr.core.SolrConfig.<init>(SolrConfig.java:117)
      [mvn] 	at org.apache.solr.core.CoreContainer.create(CoreContainer.java:791)
      [mvn] 	at org.apache.solr.handler.admin.CoreAdminHandler.handleCreateAction(CoreAdminHandler.java:519)
      [mvn] 	at org.apache.solr.handler.admin.CoreAdminHandler.handleRequestBody(CoreAdminHandler.java:142)
      [mvn] 	at org.apache.solr.handler.admin.CoreAdminHandlerTest.testCoreAdminHandler(CoreAdminHandlerTest.java:105)
      [mvn] 	at sun.reflect.NativeMethodAccessorImpl.invoke0(Native Method)
      [mvn] 	at sun.reflect.NativeMethodAccessorImpl.invoke(NativeMethodAccessorImpl.java:57)
      [mvn] 	at sun.reflect.DelegatingMethodAccessorImpl.invoke(DelegatingMethodAccessorImpl.java:43)
      [mvn] 	at java.lang.reflect.Method.invoke(Method.java:616)
      [mvn] 	at com.carrotsearch.randomizedtesting.RandomizedRunner.invoke(RandomizedRunner.java:1559)
      [mvn] 	at com.carrotsearch.randomizedtesting.RandomizedRunner.access$600(RandomizedRunner.java:79)
      [mvn] 	at com.carrotsearch.randomizedtesting.RandomizedRunner$6.evaluate(RandomizedRunner.java:737)
      [mvn] 	at com.carrotsearch.randomizedtesting.RandomizedRunner$7.evaluate(RandomizedRunner.java:773)
      [mvn] 	at com.carrotsearch.randomizedtesting.RandomizedRunner$8.evaluate(RandomizedRunner.java:787)
      [mvn] 	at com.carrotsearch.randomizedtesting.rules.SystemPropertiesRestoreRule$1.evaluate(SystemPropertiesRestoreRule.java:53)
      [mvn] 	at org.apache.lucene.util.TestRuleSetupTeardownChained$1.evaluate(TestRuleSetupTeardownChained.java:50)
      [mvn] 	at org.apache.lucene.util.TestRuleFieldCacheSanity$1.evaluate(TestRuleFieldCacheSanity.java:51)
      [mvn] 	at org.apache.lucene.util.AbstractBeforeAfterRule$1.evaluate(AbstractBeforeAfterRule.java:45)
      [mvn] 	at com.carrotsearch.randomizedtesting.rules.SystemPropertiesInvariantRule$1.evaluate(SystemPropertiesInvariantRule.java:55)
      [mvn] 	at org.apache.lucene.util.TestRuleThreadAndTestName$1.evaluate(TestRuleThreadAndTestName.java:48)
      [mvn] 	at org.apache.lucene.util.TestRuleIgnoreAfterMaxFailures$1.evaluate(TestRuleIgnoreAfterMaxFailures.java:70)
      [mvn] 	at org.apache.lucene.util.TestRuleMarkFailure$1.evaluate(TestRuleMarkFailure.java:48)
      [mvn] 	at com.carrotsearch.randomizedtesting.rules.StatementAdapter.evaluate(StatementAdapter.java:36)
      [mvn] 	at com.carrotsearch.randomizedtesting.ThreadLeakControl$StatementRunner.run(ThreadLeakControl.java:358)
      [mvn] 	at com.carrotsearch.randomizedtesting.ThreadLeakControl.forkTimeoutingTask(ThreadLeakControl.java:782)
      [mvn] 	at com.carrotsearch.randomizedtesting.ThreadLeakControl$3.evaluate(ThreadLeakControl.java:442)
      [mvn] 	at com.carrotsearch.randomizedtesting.RandomizedRunner.runSingleTest(RandomizedRunner.java:746)
      [mvn] 	at com.carrotsearch.randomizedtesting.RandomizedRunner$3.evaluate(RandomizedRunner.java:648)
      [mvn] 	at com.carrotsearch.randomizedtesting.RandomizedRunner$4.evaluate(RandomizedRunner.java:682)
      [mvn] 	at com.carrotsearch.randomizedtesting.RandomizedRunner$5.evaluate(RandomizedRunner.java:693)
      [mvn] 	at com.carrotsearch.randomizedtesting.rules.StatementAdapter.evaluate(StatementAdapter.java:36)
      [mvn] 	at com.carrotsearch.randomizedtesting.rules.SystemPropertiesRestoreRule$1.evaluate(SystemPropertiesRestoreRule.java:53)
      [mvn] 	at org.apache.lucene.util.AbstractBeforeAfterRule$1.evaluate(AbstractBeforeAfterRule.java:45)
      [mvn] 	at org.apache.lucene.util.TestRuleStoreClassName$1.evaluate(TestRuleStoreClassName.java:42)
      [mvn] 	at com.carrotsearch.randomizedtesting.rules.SystemPropertiesInvariantRule$1.evaluate(SystemPropertiesInvariantRule.java:55)
      [mvn] 	at com.carrotsearch.randomizedtesting.rules.NoShadowingOrOverridesOnMethodsRule$1.evaluate(NoShadowingOrOverridesOnMethodsRule.java:39)
      [mvn] 	at com.carrotsearch.randomizedtesting.rules.NoShadowingOrOverridesOnMethodsRule$1.evaluate(NoShadowingOrOverridesOnMethodsRule.java:39)
      [mvn] 	at com.carrotsearch.randomizedtesting.rules.StatementAdapter.evaluate(StatementAdapter.java:36)
      [mvn] 	at org.apache.lucene.util.TestRuleAssertionsRequired$1.evaluate(TestRuleAssertionsRequired.java:43)
      [mvn] 	at org.apache.lucene.util.TestRuleMarkFailure$1.evaluate(TestRuleMarkFailure.java:48)
      [mvn] 	at org.apache.lucene.util.TestRuleIgnoreAfterMaxFailures$1.evaluate(TestRuleIgnoreAfterMaxFailures.java:70)
      [mvn] 	at org.apache.lucene.util.TestRuleIgnoreTestSuites$1.evaluate(TestRuleIgnoreTestSuites.java:55)
      [mvn] 	at com.carrotsearch.randomizedtesting.rules.StatementAdapter.evaluate(StatementAdapter.java:36)
      [mvn] 	at com.carrotsearch.randomizedtesting.ThreadLeakControl$StatementRunner.run(ThreadLeakControl.java:358)
      [mvn] 	at java.lang.Thread.run(Thread.java:679)
      [mvn] 
      [mvn] Tests run: 1, Failures: 0, Errors: 0, Skipped: 0, Time elapsed: 1.067 sec
      [mvn] Running org.apache.solr.analysis.LegacyHTMLStripCharFilterTest
      [mvn] Tests run: 13, Failures: 0, Errors: 0, Skipped: 1, Time elapsed: 0.158 sec
      [mvn] Running org.apache.solr.cloud.LeaderElectionTest
      [mvn] Creating dataDir: /usr/home/hudson/hudson-slave/workspace/Lucene-Solr-Maven-trunk/maven-build/solr/core/src/test/target/test/./solrtest-LeaderElectionTest-1348328844380
      [mvn] 823 T915 oasc.SolrException.log SEVERE Failed setting watch:org.apache.zookeeper.KeeperException$NoNodeException: KeeperErrorCode = NoNode for /collections/collection1/leader_elect/shard1/election/88364079145615372-9-n_0000000003
      [mvn] 		at org.apache.zookeeper.KeeperException.create(KeeperException.java:102)
      [mvn] 		at org.apache.zookeeper.KeeperException.create(KeeperException.java:42)
      [mvn] 		at org.apache.zookeeper.ZooKeeper.getData(ZooKeeper.java:927)
      [mvn] 		at org.apache.solr.common.cloud.SolrZkClient$7.execute(SolrZkClient.java:291)
      [mvn] 		at org.apache.solr.common.cloud.SolrZkClient$7.execute(SolrZkClient.java:288)
      [mvn] 		at org.apache.solr.common.cloud.ZkCmdExecutor.retryOperation(ZkCmdExecutor.java:67)
      [mvn] 		at org.apache.solr.common.cloud.SolrZkClient.getData(SolrZkClient.java:288)
      [mvn] 		at org.apache.solr.cloud.LeaderElector.checkIfIamLeader(LeaderElector.java:119)
      [mvn] 		at org.apache.solr.cloud.LeaderElector.access$000(LeaderElector.java:56)
      [mvn] 		at org.apache.solr.cloud.LeaderElector$1.process(LeaderElector.java:131)
      [mvn] 		at org.apache.zookeeper.ClientCnxn$EventThread.processEvent(ClientCnxn.java:526)
      [mvn] 		at org.apache.zookeeper.ClientCnxn$EventThread.run(ClientCnxn.java:502)
      [mvn] 	
      [mvn] 1859 T954 oasc.SolrException.log SEVERE Failed setti

[...truncated too long message...]

hudson-slave/workspace/Lucene-Solr-Maven-trunk/maven-build/solr/contrib/velocity/src/main/resources
      [mvn] [INFO] Copying 3 resources
      [mvn] [INFO] [compiler:compile {execution: default-compile}]
      [mvn] [INFO] Compiling 4 source files to /usr/home/hudson/hudson-slave/workspace/Lucene-Solr-Maven-trunk/maven-build/solr/contrib/velocity/target/classes
      [mvn] [INFO] [bundle:manifest {execution: bundle-manifest}]
      [mvn] [debug] execute contextualize
      [mvn] [INFO] [resources:testResources {execution: default-testResources}]
      [mvn] [INFO] Using 'UTF-8' encoding to copy filtered resources.
      [mvn] [INFO] Copying 3 resources
      [mvn] [INFO] Copying 1 resource
      [mvn] [INFO] Copying 3 resources
      [mvn] [INFO] [compiler:testCompile {execution: default-testCompile}]
      [mvn] [INFO] Compiling 1 source file to /usr/home/hudson/hudson-slave/workspace/Lucene-Solr-Maven-trunk/maven-build/solr/contrib/velocity/target/test-classes
      [mvn] [INFO] [surefire:test {execution: default-test}]
      [mvn] [INFO] Surefire report directory: /usr/home/hudson/hudson-slave/workspace/Lucene-Solr-Maven-trunk/maven-build/solr/contrib/velocity/target/surefire-reports
      [mvn] 
      [mvn] -------------------------------------------------------
      [mvn]  T E S T S
      [mvn] -------------------------------------------------------
      [mvn] Running org.apache.solr.velocity.VelocityResponseWriterTest
      [mvn] Creating dataDir: /usr/home/hudson/hudson-slave/workspace/Lucene-Solr-Maven-trunk/maven-build/solr/contrib/velocity/target/test/./solrtest-VelocityResponseWriterTest-1348330134827
      [mvn] Tests run: 1, Failures: 0, Errors: 0, Skipped: 0, Time elapsed: 1.676 sec
      [mvn] 
      [mvn] Results :
      [mvn] 
      [mvn] Tests run: 1, Failures: 0, Errors: 0, Skipped: 0
      [mvn] 
      [mvn] [INFO] [jar:jar {execution: default-jar}]
      [mvn] [INFO] Building jar: /usr/home/hudson/hudson-slave/workspace/Lucene-Solr-Maven-trunk/maven-build/solr/contrib/velocity/target/solr-velocity-5.0-SNAPSHOT.jar
      [mvn] [INFO] [install:install {execution: default-install}]
      [mvn] [INFO] Installing /usr/home/hudson/hudson-slave/workspace/Lucene-Solr-Maven-trunk/maven-build/solr/contrib/velocity/target/solr-velocity-5.0-SNAPSHOT.jar to /home/hudson/.m2/repository/org/apache/solr/solr-velocity/5.0-SNAPSHOT/solr-velocity-5.0-SNAPSHOT.jar
      [mvn] [INFO] ------------------------------------------------------------------------
      [mvn] [INFO] Building Apache Solr Contrib aggregator POM
      [mvn] [INFO]    task-segment: [install]
      [mvn] [INFO] ------------------------------------------------------------------------
      [mvn] [INFO] [groovy:execute {execution: generate-timestamps}]
      [mvn] [INFO] [buildnumber:create {execution: default}]
      [mvn] [INFO] [enforcer:enforce {execution: enforce-java-compat-version-and-maven-2.2.1}]
      [mvn] [INFO] [remote-resources:process {execution: default}]
      [mvn] [INFO] [bundle:manifest {execution: bundle-manifest}]
      [mvn] [WARNING] Ignoring project type pom - supportedProjectTypes = [jar, bundle]
      [mvn] [INFO] [site:attach-descriptor {execution: default-attach-descriptor}]
      [mvn] [INFO] [install:install {execution: default-install}]
      [mvn] [INFO] Installing /usr/home/hudson/hudson-slave/workspace/Lucene-Solr-Maven-trunk/maven-build/solr/contrib/pom.xml to /home/hudson/.m2/repository/org/apache/solr/solr-contrib-aggregator/5.0-SNAPSHOT/solr-contrib-aggregator-5.0-SNAPSHOT.pom
      [mvn] [INFO] 
      [mvn] [INFO] 
      [mvn] [INFO] ------------------------------------------------------------------------
      [mvn] [INFO] Reactor Summary:
      [mvn] [INFO] ------------------------------------------------------------------------
      [mvn] [INFO] Grandparent POM for Apache Lucene Core and Apache Solr  SUCCESS [7.712s]
      [mvn] [INFO] Lucene parent POM ..................................... SUCCESS [0.060s]
      [mvn] [INFO] Lucene Core ........................................... SUCCESS [14.249s]
      [mvn] [INFO] Lucene codecs ......................................... SUCCESS [3.972s]
      [mvn] [INFO] Lucene Test Framework ................................. SUCCESS [6.453s]
      [mvn] [INFO] Lucene Core tests ..................................... SUCCESS [4:13.747s]
      [mvn] [INFO] Lucene Core aggregator POM ............................ SUCCESS [0.065s]
      [mvn] [INFO] Lucene codecs tests ................................... SUCCESS [2.811s]
      [mvn] [INFO] Lucene codecs aggregator POM .......................... SUCCESS [0.082s]
      [mvn] [INFO] Lucene Common Analyzers ............................... SUCCESS [1:56.246s]
      [mvn] [INFO] Lucene ICU Analysis Components ........................ SUCCESS [11.695s]
      [mvn] [INFO] Lucene Kuromoji Japanese Morphological Analyzer ....... SUCCESS [24.820s]
      [mvn] [INFO] Lucene Morfologik Polish Lemmatizer ................... SUCCESS [3.641s]
      [mvn] [INFO] Lucene Phonetic Filters ............................... SUCCESS [24.476s]
      [mvn] [INFO] Lucene Smart Chinese Analyzer ......................... SUCCESS [7.727s]
      [mvn] [INFO] Lucene Stempel Analyzer ............................... SUCCESS [6.854s]
      [mvn] [INFO] Lucene UIMA Analysis Components ....................... SUCCESS [23.604s]
      [mvn] [INFO] Lucene Analysis Modules aggregator POM ................ SUCCESS [0.092s]
      [mvn] [INFO] Lucene Queries ........................................ SUCCESS [11.847s]
      [mvn] [INFO] Lucene Sandbox ........................................ SUCCESS [8.194s]
      [mvn] [INFO] Lucene QueryParsers ................................... SUCCESS [17.041s]
      [mvn] [INFO] Lucene Memory ......................................... SUCCESS [8.977s]
      [mvn] [INFO] Lucene Highlighter .................................... SUCCESS [8.197s]
      [mvn] [INFO] Lucene Facets ......................................... SUCCESS [1:10.590s]
      [mvn] [INFO] Lucene Benchmark ...................................... SUCCESS [24.962s]
      [mvn] [INFO] Lucene Classification ................................. SUCCESS [4.461s]
      [mvn] [INFO] Lucene Demo ........................................... SUCCESS [3.942s]
      [mvn] [INFO] Lucene Grouping ....................................... SUCCESS [16.402s]
      [mvn] [INFO] Lucene Join ........................................... SUCCESS [13.157s]
      [mvn] [INFO] Lucene Miscellaneous .................................. SUCCESS [5.666s]
      [mvn] [INFO] Lucene Spatial ........................................ SUCCESS [13.435s]
      [mvn] [INFO] Lucene Suggest ........................................ SUCCESS [16.408s]
      [mvn] [INFO] Apache Solr parent POM ................................ SUCCESS [0.078s]
      [mvn] [INFO] Apache Solr Solrj ..................................... SUCCESS [4.460s]
      [mvn] [INFO] Apache Solr Core ...................................... SUCCESS [15.059s]
      [mvn] [INFO] Apache Solr Test Framework ............................ SUCCESS [3.652s]
      [mvn] [INFO] Apache Solr Core tests ................................ FAILED [18:46.950s]
      [mvn] [INFO] Apache Solr Core aggregator POM ....................... SUCCESS [0.078s]
      [mvn] [INFO] Apache Solr Solrj tests ............................... SUCCESS [3:46.120s]
      [mvn] [INFO] Apache Solr Solrj aggregator POM ...................... SUCCESS [0.066s]
      [mvn] [INFO] Apache Solr Search Server ............................. SUCCESS [5.038s]
      [mvn] [INFO] Apache Solr Analysis Extras ........................... SUCCESS [6.461s]
      [mvn] [INFO] Apache Solr Clustering ................................ SUCCESS [16.399s]
      [mvn] [INFO] Apache Solr DataImportHandler ......................... SUCCESS [1:34.120s]
      [mvn] [INFO] Apache Solr DataImportHandler Extras .................. SUCCESS [7.983s]
      [mvn] [INFO] Apache Solr Content Extraction Library ................ SUCCESS [9.973s]
      [mvn] [INFO] Apache Solr Language Identifier ....................... SUCCESS [6.888s]
      [mvn] [INFO] Apache Solr UIMA integration .......................... SUCCESS [33.036s]
      [mvn] [INFO] Apache Solr Velocity .................................. SUCCESS [5.277s]
      [mvn] [INFO] Apache Solr Contrib aggregator POM .................... SUCCESS [0.073s]
      [mvn] [INFO] ------------------------------------------------------------------------
      [mvn] [INFO] Error for project: Apache Solr Core tests (during install)
      [mvn] [INFO] ------------------------------------------------------------------------
      [mvn] [INFO] There are test failures.
      [mvn] 
      [mvn] Please refer to /usr/home/hudson/hudson-slave/workspace/Lucene-Solr-Maven-trunk/maven-build/solr/core/src/test/target/surefire-reports for the individual test results.
      [mvn] [INFO] ------------------------------------------------------------------------
      [mvn] [INFO] For more information, run Maven with the -e switch
      [mvn] [INFO] ------------------------------------------------------------------------
      [mvn] [INFO] BUILD ERRORS
      [mvn] [INFO] ------------------------------------------------------------------------
      [mvn] [INFO] Total time: 38 minutes 14 seconds
      [mvn] [INFO] Finished at: Sat Sep 22 16:08:56 UTC 2012
      [mvn] [INFO] Final Memory: 214M/1554M
      [mvn] [INFO] ------------------------------------------------------------------------

BUILD FAILED
/usr/home/hudson/hudson-slave/workspace/Lucene-Solr-Maven-trunk/build.xml:160: The following error occurred while executing this line:
/usr/home/hudson/hudson-slave/workspace/Lucene-Solr-Maven-trunk/extra-targets.xml:56: Java returned: 1

Total time: 38 minutes 20 seconds
Build step 'Invoke Ant' marked build as failure
Recording test results
Email was triggered for: Failure
Sending email for trigger: Failure




Mime
View raw message