lucene-dev mailing list archives

Site index · List index
Message view « Date » · « Thread »
Top « Date » · « Thread »
From Apache Jenkins Server <jenk...@builds.apache.org>
Subject [JENKINS] Lucene-Solr-Tests-trunk-java7 - Build # 3208 - Still Failing
Date Sat, 15 Sep 2012 10:53:58 GMT
Build: https://builds.apache.org/job/Lucene-Solr-Tests-trunk-java7/3208/

1 tests failed.
FAILED:  org.apache.solr.cloud.BasicDistributedZk2Test.testDistribSearch

Error Message:
Shard still reported as live in zk

Stack Trace:
java.lang.AssertionError: Shard still reported as live in zk
	at __randomizedtesting.SeedInfo.seed([EC22404A6C6513E1:6DC4CE521B3A73DD]:0)
	at org.junit.Assert.fail(Assert.java:93)
	at org.apache.solr.cloud.AbstractFullDistribZkTestBase.waitToSeeNotLive(AbstractFullDistribZkTestBase.java:1215)
	at org.apache.solr.cloud.BasicDistributedZk2Test.brindDownShardIndexSomeDocsAndRecover(BasicDistributedZk2Test.java:190)
	at org.apache.solr.cloud.BasicDistributedZk2Test.doTest(BasicDistributedZk2Test.java:83)
	at org.apache.solr.BaseDistributedSearchTestCase.testDistribSearch(BaseDistributedSearchTestCase.java:691)
	at sun.reflect.NativeMethodAccessorImpl.invoke0(Native Method)
	at sun.reflect.NativeMethodAccessorImpl.invoke(NativeMethodAccessorImpl.java:57)
	at sun.reflect.DelegatingMethodAccessorImpl.invoke(DelegatingMethodAccessorImpl.java:43)
	at java.lang.reflect.Method.invoke(Method.java:601)
	at com.carrotsearch.randomizedtesting.RandomizedRunner.invoke(RandomizedRunner.java:1559)
	at com.carrotsearch.randomizedtesting.RandomizedRunner.access$600(RandomizedRunner.java:79)
	at com.carrotsearch.randomizedtesting.RandomizedRunner$6.evaluate(RandomizedRunner.java:737)
	at com.carrotsearch.randomizedtesting.RandomizedRunner$7.evaluate(RandomizedRunner.java:773)
	at com.carrotsearch.randomizedtesting.RandomizedRunner$8.evaluate(RandomizedRunner.java:787)
	at com.carrotsearch.randomizedtesting.rules.SystemPropertiesRestoreRule$1.evaluate(SystemPropertiesRestoreRule.java:53)
	at org.apache.lucene.util.TestRuleSetupTeardownChained$1.evaluate(TestRuleSetupTeardownChained.java:50)
	at org.apache.lucene.util.TestRuleFieldCacheSanity$1.evaluate(TestRuleFieldCacheSanity.java:51)
	at org.apache.lucene.util.AbstractBeforeAfterRule$1.evaluate(AbstractBeforeAfterRule.java:45)
	at com.carrotsearch.randomizedtesting.rules.SystemPropertiesInvariantRule$1.evaluate(SystemPropertiesInvariantRule.java:55)
	at org.apache.lucene.util.TestRuleThreadAndTestName$1.evaluate(TestRuleThreadAndTestName.java:48)
	at org.apache.lucene.util.TestRuleIgnoreAfterMaxFailures$1.evaluate(TestRuleIgnoreAfterMaxFailures.java:70)
	at org.apache.lucene.util.TestRuleMarkFailure$1.evaluate(TestRuleMarkFailure.java:48)
	at com.carrotsearch.randomizedtesting.rules.StatementAdapter.evaluate(StatementAdapter.java:36)
	at com.carrotsearch.randomizedtesting.ThreadLeakControl$StatementRunner.run(ThreadLeakControl.java:358)
	at com.carrotsearch.randomizedtesting.ThreadLeakControl.forkTimeoutingTask(ThreadLeakControl.java:782)
	at com.carrotsearch.randomizedtesting.ThreadLeakControl$3.evaluate(ThreadLeakControl.java:442)
	at com.carrotsearch.randomizedtesting.RandomizedRunner.runSingleTest(RandomizedRunner.java:746)
	at com.carrotsearch.randomizedtesting.RandomizedRunner$3.evaluate(RandomizedRunner.java:648)
	at com.carrotsearch.randomizedtesting.RandomizedRunner$4.evaluate(RandomizedRunner.java:682)
	at com.carrotsearch.randomizedtesting.RandomizedRunner$5.evaluate(RandomizedRunner.java:693)
	at com.carrotsearch.randomizedtesting.rules.StatementAdapter.evaluate(StatementAdapter.java:36)
	at com.carrotsearch.randomizedtesting.rules.SystemPropertiesRestoreRule$1.evaluate(SystemPropertiesRestoreRule.java:53)
	at org.apache.lucene.util.AbstractBeforeAfterRule$1.evaluate(AbstractBeforeAfterRule.java:45)
	at org.apache.lucene.util.TestRuleStoreClassName$1.evaluate(TestRuleStoreClassName.java:42)
	at com.carrotsearch.randomizedtesting.rules.SystemPropertiesInvariantRule$1.evaluate(SystemPropertiesInvariantRule.java:55)
	at com.carrotsearch.randomizedtesting.rules.NoShadowingOrOverridesOnMethodsRule$1.evaluate(NoShadowingOrOverridesOnMethodsRule.java:39)
	at com.carrotsearch.randomizedtesting.rules.NoShadowingOrOverridesOnMethodsRule$1.evaluate(NoShadowingOrOverridesOnMethodsRule.java:39)
	at com.carrotsearch.randomizedtesting.rules.StatementAdapter.evaluate(StatementAdapter.java:36)
	at org.apache.lucene.util.TestRuleAssertionsRequired$1.evaluate(TestRuleAssertionsRequired.java:43)
	at org.apache.lucene.util.TestRuleMarkFailure$1.evaluate(TestRuleMarkFailure.java:48)
	at org.apache.lucene.util.TestRuleIgnoreAfterMaxFailures$1.evaluate(TestRuleIgnoreAfterMaxFailures.java:70)
	at org.apache.lucene.util.TestRuleIgnoreTestSuites$1.evaluate(TestRuleIgnoreTestSuites.java:55)
	at com.carrotsearch.randomizedtesting.rules.StatementAdapter.evaluate(StatementAdapter.java:36)
	at com.carrotsearch.randomizedtesting.ThreadLeakControl$StatementRunner.run(ThreadLeakControl.java:358)
	at java.lang.Thread.run(Thread.java:722)




Build Log:
[...truncated 7905 lines...]
[junit4:junit4] Suite: org.apache.solr.cloud.BasicDistributedZk2Test
[junit4:junit4]   2> 3 T779 oas.SolrTestCaseJ4.setUp ###Starting testDistribSearch
[junit4:junit4]   2> Creating dataDir: /usr/home/hudson/hudson-slave/workspace/Lucene-Solr-Tests-trunk-java7/solr/build/solr-core/test/J1/./solrtest-BasicDistributedZk2Test-1347705787709
[junit4:junit4]   2> 5 T779 oasc.ZkTestServer.run STARTING ZK TEST SERVER
[junit4:junit4]   2> 8 T780 oazs.ZooKeeperServer.setTickTime tickTime set to 1000
[junit4:junit4]   2> 8 T780 oazs.NIOServerCnxn$Factory.<init> binding to port 0.0.0.0/0.0.0.0:0
[junit4:junit4]   2> 9 T780 oazsp.FileTxnSnapLog.save Snapshotting: 0
[junit4:junit4]   2> 106 T779 oasc.ZkTestServer.run start zk server on port:19442
[junit4:junit4]   2> 106 T779 oaz.ZooKeeper.<init> Initiating client connection, connectString=127.0.0.1:19442 sessionTimeout=10000 watcher=org.apache.solr.common.cloud.ConnectionManager@75ef8a98
[junit4:junit4]   2> 107 T785 oaz.ClientCnxn$SendThread.startConnect Opening socket connection to server /127.0.0.1:19442
[junit4:junit4]   2> 107 T779 oascc.ConnectionManager.waitForConnected Waiting for client to connect to ZooKeeper
[junit4:junit4]   2> 108 T785 oaz.ClientCnxn$SendThread.primeConnection Socket connection established to localhost/127.0.0.1:19442, initiating session
[junit4:junit4]   2> 109 T781 oazs.NIOServerCnxn$Factory.run Accepted socket connection from /140.211.11.196:19444
[junit4:junit4]   2> 109 T781 oazs.NIOServerCnxn.readConnectRequest Client attempting to establish new session at /140.211.11.196:19444
[junit4:junit4]   2> 109 T783 oazsp.FileTxnLog.append Creating new log file: log.1
[junit4:junit4]   2> 113 T783 oazs.NIOServerCnxn.finishSessionInit Established session 0x139c98655430000 with negotiated timeout 10000 for client /140.211.11.196:19444
[junit4:junit4]   2> 113 T785 oaz.ClientCnxn$SendThread.readConnectResult Session establishment complete on server localhost/127.0.0.1:19442, sessionid = 0x139c98655430000, negotiated timeout = 10000
[junit4:junit4]   2> 114 T786 oascc.ConnectionManager.process Watcher org.apache.solr.common.cloud.ConnectionManager@75ef8a98 name:ZooKeeperConnection Watcher:127.0.0.1:19442 got event WatchedEvent state:SyncConnected type:None path:null path:null type:None
[junit4:junit4]   2> 114 T779 oascc.ConnectionManager.waitForConnected Client is connected to ZooKeeper
[junit4:junit4]   2> 114 T779 oascc.SolrZkClient.makePath makePath: /solr
[junit4:junit4]   2> 124 T784 oazs.PrepRequestProcessor.pRequest Processed session termination for sessionid: 0x139c98655430000
[junit4:junit4]   2> 125 T786 oaz.ClientCnxn$EventThread.run EventThread shut down
[junit4:junit4]   2> 125 T779 oaz.ZooKeeper.close Session: 0x139c98655430000 closed
[junit4:junit4]   2> 125 T781 oazs.NIOServerCnxn.closeSock Closed socket connection for client /140.211.11.196:19444 which had sessionid 0x139c98655430000
[junit4:junit4]   2> 125 T779 oaz.ZooKeeper.<init> Initiating client connection, connectString=127.0.0.1:19442/solr sessionTimeout=10000 watcher=org.apache.solr.common.cloud.ConnectionManager@15a137a4
[junit4:junit4]   2> 126 T787 oaz.ClientCnxn$SendThread.startConnect Opening socket connection to server /127.0.0.1:19442
[junit4:junit4]   2> 126 T779 oascc.ConnectionManager.waitForConnected Waiting for client to connect to ZooKeeper
[junit4:junit4]   2> 127 T787 oaz.ClientCnxn$SendThread.primeConnection Socket connection established to localhost/127.0.0.1:19442, initiating session
[junit4:junit4]   2> 127 T781 oazs.NIOServerCnxn$Factory.run Accepted socket connection from /140.211.11.196:19445
[junit4:junit4]   2> 127 T781 oazs.NIOServerCnxn.readConnectRequest Client attempting to establish new session at /140.211.11.196:19445
[junit4:junit4]   2> 128 T783 oazs.NIOServerCnxn.finishSessionInit Established session 0x139c98655430001 with negotiated timeout 10000 for client /140.211.11.196:19445
[junit4:junit4]   2> 128 T787 oaz.ClientCnxn$SendThread.readConnectResult Session establishment complete on server localhost/127.0.0.1:19442, sessionid = 0x139c98655430001, negotiated timeout = 10000
[junit4:junit4]   2> 129 T788 oascc.ConnectionManager.process Watcher org.apache.solr.common.cloud.ConnectionManager@15a137a4 name:ZooKeeperConnection Watcher:127.0.0.1:19442/solr got event WatchedEvent state:SyncConnected type:None path:null path:null type:None
[junit4:junit4]   2> 129 T779 oascc.ConnectionManager.waitForConnected Client is connected to ZooKeeper
[junit4:junit4]   2> 129 T779 oascc.SolrZkClient.makePath makePath: /collections/collection1
[junit4:junit4]   2> 139 T779 oascc.SolrZkClient.makePath makePath: /collections/collection1/shards
[junit4:junit4]   2> 142 T779 oascc.SolrZkClient.makePath makePath: /collections/control_collection
[junit4:junit4]   2> 144 T779 oascc.SolrZkClient.makePath makePath: /collections/control_collection/shards
[junit4:junit4]   2> 147 T779 oasc.AbstractZkTestCase.putConfig put /usr/home/hudson/hudson-slave/workspace/Lucene-Solr-Tests-trunk-java7/solr/build/solr-core/test-files/solr/collection1/conf/solrconfig.xml to /configs/conf1/solrconfig.xml
[junit4:junit4]   2> 148 T779 oascc.SolrZkClient.makePath makePath: /configs/conf1/solrconfig.xml
[junit4:junit4]   2> 163 T779 oasc.AbstractZkTestCase.putConfig put /usr/home/hudson/hudson-slave/workspace/Lucene-Solr-Tests-trunk-java7/solr/build/solr-core/test-files/solr/collection1/conf/schema.xml to /configs/conf1/schema.xml
[junit4:junit4]   2> 164 T779 oascc.SolrZkClient.makePath makePath: /configs/conf1/schema.xml
[junit4:junit4]   2> 267 T779 oasc.AbstractZkTestCase.putConfig put /usr/home/hudson/hudson-slave/workspace/Lucene-Solr-Tests-trunk-java7/solr/build/solr-core/test-files/solr/collection1/conf/solrconfig.xml to /configs/conf1/solrconfig.xml
[junit4:junit4]   2> 268 T779 oascc.SolrZkClient.makePath makePath: /configs/conf1/solrconfig.xml
[junit4:junit4]   2> 271 T779 oasc.AbstractZkTestCase.putConfig put /usr/home/hudson/hudson-slave/workspace/Lucene-Solr-Tests-trunk-java7/solr/build/solr-core/test-files/solr/collection1/conf/stopwords.txt to /configs/conf1/stopwords.txt
[junit4:junit4]   2> 272 T779 oascc.SolrZkClient.makePath makePath: /configs/conf1/stopwords.txt
[junit4:junit4]   2> 297 T779 oasc.AbstractZkTestCase.putConfig put /usr/home/hudson/hudson-slave/workspace/Lucene-Solr-Tests-trunk-java7/solr/build/solr-core/test-files/solr/collection1/conf/protwords.txt to /configs/conf1/protwords.txt
[junit4:junit4]   2> 298 T779 oascc.SolrZkClient.makePath makePath: /configs/conf1/protwords.txt
[junit4:junit4]   2> 309 T779 oasc.AbstractZkTestCase.putConfig put /usr/home/hudson/hudson-slave/workspace/Lucene-Solr-Tests-trunk-java7/solr/build/solr-core/test-files/solr/collection1/conf/currency.xml to /configs/conf1/currency.xml
[junit4:junit4]   2> 309 T779 oascc.SolrZkClient.makePath makePath: /configs/conf1/currency.xml
[junit4:junit4]   2> 318 T779 oasc.AbstractZkTestCase.putConfig put /usr/home/hudson/hudson-slave/workspace/Lucene-Solr-Tests-trunk-java7/solr/build/solr-core/test-files/solr/collection1/conf/open-exchange-rates.json to /configs/conf1/open-exchange-rates.json
[junit4:junit4]   2> 319 T779 oascc.SolrZkClient.makePath makePath: /configs/conf1/open-exchange-rates.json
[junit4:junit4]   2> 322 T779 oasc.AbstractZkTestCase.putConfig put /usr/home/hudson/hudson-slave/workspace/Lucene-Solr-Tests-trunk-java7/solr/build/solr-core/test-files/solr/collection1/conf/mapping-ISOLatin1Accent.txt to /configs/conf1/mapping-ISOLatin1Accent.txt
[junit4:junit4]   2> 323 T779 oascc.SolrZkClient.makePath makePath: /configs/conf1/mapping-ISOLatin1Accent.txt
[junit4:junit4]   2> 326 T779 oasc.AbstractZkTestCase.putConfig put /usr/home/hudson/hudson-slave/workspace/Lucene-Solr-Tests-trunk-java7/solr/build/solr-core/test-files/solr/collection1/conf/old_synonyms.txt to /configs/conf1/old_synonyms.txt
[junit4:junit4]   2> 327 T779 oascc.SolrZkClient.makePath makePath: /configs/conf1/old_synonyms.txt
[junit4:junit4]   2> 330 T779 oasc.AbstractZkTestCase.putConfig put /usr/home/hudson/hudson-slave/workspace/Lucene-Solr-Tests-trunk-java7/solr/build/solr-core/test-files/solr/collection1/conf/synonyms.txt to /configs/conf1/synonyms.txt
[junit4:junit4]   2> 331 T779 oascc.SolrZkClient.makePath makePath: /configs/conf1/synonyms.txt
[junit4:junit4]   2> 333 T784 oazs.PrepRequestProcessor.pRequest Processed session termination for sessionid: 0x139c98655430001
[junit4:junit4]   2> 334 T788 oaz.ClientCnxn$EventThread.run EventThread shut down
[junit4:junit4]   2> 334 T779 oaz.ZooKeeper.close Session: 0x139c98655430001 closed
[junit4:junit4]   2> 334 T781 oazs.NIOServerCnxn.closeSock Closed socket connection for client /140.211.11.196:19445 which had sessionid 0x139c98655430001
[junit4:junit4]   2> 337 T779 oejs.Server.doStart jetty-8.1.2.v20120308
[junit4:junit4]   2> 347 T779 oejs.AbstractConnector.doStart Started SocketConnector@0.0.0.0:19446
[junit4:junit4]   2> 348 T779 oasc.SolrResourceLoader.locateSolrHome JNDI not configured for solr (NoInitialContextEx)
[junit4:junit4]   2> 348 T779 oasc.SolrResourceLoader.locateSolrHome using system property solr.solr.home: /usr/home/hudson/hudson-slave/workspace/Lucene-Solr-Tests-trunk-java7/solr/build/solr-core/test-files/solr
[junit4:junit4]   2> 349 T779 oasc.SolrResourceLoader.<init> new SolrResourceLoader for deduced Solr Home: '/usr/home/hudson/hudson-slave/workspace/Lucene-Solr-Tests-trunk-java7/solr/build/solr-core/test-files/solr/'
[junit4:junit4]   2> 391 T779 oass.SolrDispatchFilter.init SolrDispatchFilter.init()
[junit4:junit4]   2> 392 T779 oasc.SolrResourceLoader.locateSolrHome JNDI not configured for solr (NoInitialContextEx)
[junit4:junit4]   2> 393 T779 oasc.SolrResourceLoader.locateSolrHome using system property solr.solr.home: /usr/home/hudson/hudson-slave/workspace/Lucene-Solr-Tests-trunk-java7/solr/build/solr-core/test-files/solr
[junit4:junit4]   2> 393 T779 oasc.CoreContainer$Initializer.initialize looking for solr.xml: /usr/home/hudson/hudson-slave/workspace/Lucene-Solr-Tests-trunk-java7/solr/build/solr-core/test-files/solr/solr.xml
[junit4:junit4]   2> 393 T779 oasc.CoreContainer.<init> New CoreContainer 1401620927
[junit4:junit4]   2> 394 T779 oasc.CoreContainer.load Loading CoreContainer using Solr Home: '/usr/home/hudson/hudson-slave/workspace/Lucene-Solr-Tests-trunk-java7/solr/build/solr-core/test-files/solr/'
[junit4:junit4]   2> 395 T779 oasc.SolrResourceLoader.<init> new SolrResourceLoader for directory: '/usr/home/hudson/hudson-slave/workspace/Lucene-Solr-Tests-trunk-java7/solr/build/solr-core/test-files/solr/'
[junit4:junit4]   2> 429 T779 oasc.CoreContainer.load Registering Log Listener
[junit4:junit4]   2> 447 T779 oasc.CoreContainer.initZooKeeper Zookeeper client=127.0.0.1:19442/solr
[junit4:junit4]   2> 448 T779 oaz.ZooKeeper.<init> Initiating client connection, connectString=127.0.0.1:19442/solr sessionTimeout=5000 watcher=org.apache.solr.common.cloud.ConnectionManager@725dc8e1
[junit4:junit4]   2> 449 T798 oaz.ClientCnxn$SendThread.startConnect Opening socket connection to server /127.0.0.1:19442
[junit4:junit4]   2> 449 T779 oascc.ConnectionManager.waitForConnected Waiting for client to connect to ZooKeeper
[junit4:junit4]   2> 450 T798 oaz.ClientCnxn$SendThread.primeConnection Socket connection established to localhost/127.0.0.1:19442, initiating session
[junit4:junit4]   2> 451 T781 oazs.NIOServerCnxn$Factory.run Accepted socket connection from /140.211.11.196:19447
[junit4:junit4]   2> 451 T781 oazs.NIOServerCnxn.readConnectRequest Client attempting to establish new session at /140.211.11.196:19447
[junit4:junit4]   2> 453 T783 oazs.NIOServerCnxn.finishSessionInit Established session 0x139c98655430002 with negotiated timeout 5000 for client /140.211.11.196:19447
[junit4:junit4]   2> 453 T798 oaz.ClientCnxn$SendThread.readConnectResult Session establishment complete on server localhost/127.0.0.1:19442, sessionid = 0x139c98655430002, negotiated timeout = 5000
[junit4:junit4]   2> 454 T799 oascc.ConnectionManager.process Watcher org.apache.solr.common.cloud.ConnectionManager@725dc8e1 name:ZooKeeperConnection Watcher:127.0.0.1:19442/solr got event WatchedEvent state:SyncConnected type:None path:null path:null type:None
[junit4:junit4]   2> 454 T779 oascc.ConnectionManager.waitForConnected Client is connected to ZooKeeper
[junit4:junit4]   2> 456 T784 oazs.PrepRequestProcessor.pRequest Got user-level KeeperException when processing sessionid:0x139c98655430002 type:create cxid:0x2 zxid:0xfffffffffffffffe txntype:unknown reqpath:n/a Error Path:/solr/overseer Error:KeeperErrorCode = NodeExists for /solr/overseer
[junit4:junit4]   2> 463 T779 oascc.SolrZkClient.makePath makePath: /live_nodes
[junit4:junit4]   2> 466 T779 oasc.ZkController.createEphemeralLiveNode Register node as live in ZooKeeper:/live_nodes/127.0.0.1:19446_solr
[junit4:junit4]   2> 467 T784 oazs.PrepRequestProcessor.pRequest Got user-level KeeperException when processing sessionid:0x139c98655430002 type:delete cxid:0x7 zxid:0xfffffffffffffffe txntype:unknown reqpath:n/a Error Path:/solr/live_nodes/127.0.0.1:19446_solr Error:KeeperErrorCode = NoNode for /solr/live_nodes/127.0.0.1:19446_solr
[junit4:junit4]   2> 468 T779 oascc.SolrZkClient.makePath makePath: /live_nodes/127.0.0.1:19446_solr
[junit4:junit4]   2> 471 T779 oashc.HttpShardHandlerFactory.getParameter Setting socketTimeout to: 0
[junit4:junit4]   2> 472 T779 oashc.HttpShardHandlerFactory.getParameter Setting urlScheme to: http://
[junit4:junit4]   2> 472 T779 oashc.HttpShardHandlerFactory.getParameter Setting connTimeout to: 0
[junit4:junit4]   2> 473 T779 oashc.HttpShardHandlerFactory.getParameter Setting maxConnectionsPerHost to: 20
[junit4:junit4]   2> 473 T779 oashc.HttpShardHandlerFactory.getParameter Setting corePoolSize to: 0
[junit4:junit4]   2> 474 T779 oashc.HttpShardHandlerFactory.getParameter Setting maximumPoolSize to: 2147483647
[junit4:junit4]   2> 474 T779 oashc.HttpShardHandlerFactory.getParameter Setting maxThreadIdleTime to: 5
[junit4:junit4]   2> 475 T779 oashc.HttpShardHandlerFactory.getParameter Setting sizeOfQueue to: -1
[junit4:junit4]   2> 475 T779 oashc.HttpShardHandlerFactory.getParameter Setting fairnessPolicy to: false
[junit4:junit4]   2> 476 T779 oascsi.HttpClientUtil.createClient Creating new http client, config:maxConnectionsPerHost=20&maxConnections=10000&socketTimeout=0&connTimeout=0&retry=false
[junit4:junit4]   2> 495 T779 oascc.SolrZkClient.makePath makePath: /overseer_elect/election
[junit4:junit4]   2> 509 T784 oazs.PrepRequestProcessor.pRequest Got user-level KeeperException when processing sessionid:0x139c98655430002 type:delete cxid:0x15 zxid:0xfffffffffffffffe txntype:unknown reqpath:n/a Error Path:/solr/overseer_elect/leader Error:KeeperErrorCode = NoNode for /solr/overseer_elect/leader
[junit4:junit4]   2> 510 T779 oascc.SolrZkClient.makePath makePath: /overseer_elect/leader
[junit4:junit4]   2> 518 T779 oasc.Overseer.start Overseer (id=88323246503690242-127.0.0.1:19446_solr-n_0000000000) starting
[junit4:junit4]   2> 518 T784 oazs.PrepRequestProcessor.pRequest Got user-level KeeperException when processing sessionid:0x139c98655430002 type:create cxid:0x1a zxid:0xfffffffffffffffe txntype:unknown reqpath:n/a Error Path:/solr/overseer Error:KeeperErrorCode = NodeExists for /solr/overseer
[junit4:junit4]   2> 522 T784 oazs.PrepRequestProcessor.pRequest Got user-level KeeperException when processing sessionid:0x139c98655430002 type:create cxid:0x1b zxid:0xfffffffffffffffe txntype:unknown reqpath:n/a Error Path:/solr/overseer Error:KeeperErrorCode = NodeExists for /solr/overseer
[junit4:junit4]   2> 524 T784 oazs.PrepRequestProcessor.pRequest Got user-level KeeperException when processing sessionid:0x139c98655430002 type:create cxid:0x1c zxid:0xfffffffffffffffe txntype:unknown reqpath:n/a Error Path:/solr/overseer Error:KeeperErrorCode = NodeExists for /solr/overseer
[junit4:junit4]   2> 530 T784 oazs.PrepRequestProcessor.pRequest Got user-level KeeperException when processing sessionid:0x139c98655430002 type:create cxid:0x1d zxid:0xfffffffffffffffe txntype:unknown reqpath:n/a Error Path:/solr/overseer Error:KeeperErrorCode = NodeExists for /solr/overseer
[junit4:junit4]   2> 533 T801 oasc.OverseerCollectionProcessor.run Process current queue of collection creations
[junit4:junit4]   2> 534 T779 oascc.SolrZkClient.makePath makePath: /clusterstate.json
[junit4:junit4]   2> 544 T779 oascc.ZkStateReader.createClusterStateWatchersAndUpdate Updating cluster state from ZooKeeper... 
[junit4:junit4]   2> 546 T800 oasc.Overseer$ClusterStateUpdater.run Starting to work on the main queue
[junit4:junit4]   2> 551 T779 oasc.CoreContainer.create Creating SolrCore 'collection1' using instanceDir: /usr/home/hudson/hudson-slave/workspace/Lucene-Solr-Tests-trunk-java7/solr/build/solr-core/test-files/solr/collection1
[junit4:junit4]   2> 552 T779 oasc.ZkController.createCollectionZkNode Check for collection zkNode:control_collection
[junit4:junit4]   2> 553 T779 oasc.ZkController.createCollectionZkNode Collection zkNode exists
[junit4:junit4]   2> 553 T779 oasc.ZkController.readConfigName Load collection config from:/collections/control_collection
[junit4:junit4]   2> 555 T779 oasc.SolrResourceLoader.<init> new SolrResourceLoader for directory: '/usr/home/hudson/hudson-slave/workspace/Lucene-Solr-Tests-trunk-java7/solr/build/solr-core/test-files/solr/collection1/'
[junit4:junit4]   2> 556 T779 oasc.SolrResourceLoader.replaceClassLoader Adding 'file:/usr/home/hudson/hudson-slave/workspace/Lucene-Solr-Tests-trunk-java7/solr/build/solr-core/test-files/solr/collection1/lib/classes/' to classloader
[junit4:junit4]   2> 557 T779 oasc.SolrResourceLoader.replaceClassLoader Adding 'file:/usr/home/hudson/hudson-slave/workspace/Lucene-Solr-Tests-trunk-java7/solr/build/solr-core/test-files/solr/collection1/lib/README' to classloader
[junit4:junit4]   2> 609 T779 oasc.SolrConfig.<init> Using Lucene MatchVersion: LUCENE_50
[junit4:junit4]   2> 685 T779 oasc.SolrConfig.<init> Loaded SolrConfig: solrconfig.xml
[junit4:junit4]   2> 786 T779 oass.IndexSchema.readSchema Reading Solr Schema
[junit4:junit4]   2> 793 T779 oass.IndexSchema.readSchema Schema name=test
[junit4:junit4]   2> 1458 T779 oass.OpenExchangeRatesOrgProvider.init Initialized with rates=open-exchange-rates.json, refreshInterval=1440.
[junit4:junit4]   2> 1476 T779 oass.IndexSchema.readSchema default search field in schema is text
[junit4:junit4]   2> 1481 T779 oass.IndexSchema.readSchema unique key field: id
[junit4:junit4]   2> 1493 T779 oass.FileExchangeRateProvider.reload Reloading exchange rates from file currency.xml
[junit4:junit4]   2> 1499 T779 oass.FileExchangeRateProvider.reload Reloading exchange rates from file currency.xml
[junit4:junit4]   2> 1504 T779 oass.OpenExchangeRatesOrgProvider.reload Reloading exchange rates from open-exchange-rates.json
[junit4:junit4]   2> 1512 T779 oass.OpenExchangeRatesOrgProvider.reload Reloading exchange rates from open-exchange-rates.json
[junit4:junit4]   2> 1514 T779 oasc.SolrCore.<init> [collection1] Opening new SolrCore at /usr/home/hudson/hudson-slave/workspace/Lucene-Solr-Tests-trunk-java7/solr/build/solr-core/test-files/solr/collection1/, dataDir=./org.apache.solr.cloud.BasicDistributedZk2Test-1347705787709/control/data/
[junit4:junit4]   2> 1515 T779 oasc.JmxMonitoredMap.<init> JMX monitoring is enabled. Adding Solr mbeans to JMX Server: com.sun.jmx.mbeanserver.JmxMBeanServer@dd83d58
[junit4:junit4]   2> 1565 T779 oasc.SolrCore.getNewIndexDir WARNING New index directory detected: old=null new=./org.apache.solr.cloud.BasicDistributedZk2Test-1347705787709/control/data/index/
[junit4:junit4]   2> 1567 T779 oasc.SolrCore.initIndex WARNING [collection1] Solr index directory './org.apache.solr.cloud.BasicDistributedZk2Test-1347705787709/control/data/index' doesn't exist. Creating new index...
[junit4:junit4]   2> 1568 T779 oasc.CachingDirectoryFactory.get return new directory for /usr/home/hudson/hudson-slave/workspace/Lucene-Solr-Tests-trunk-java7/solr/build/solr-core/test/J1/./org.apache.solr.cloud.BasicDistributedZk2Test-1347705787709/control/data/index forceNew:false
[junit4:junit4]   2> 1654 T779 oasc.SolrDeletionPolicy.onCommit SolrDeletionPolicy.onCommit: commits:num=1
[junit4:junit4]   2> 		commit{dir=/usr/home/hudson/hudson-slave/workspace/Lucene-Solr-Tests-trunk-java7/solr/build/solr-core/test/J1/org.apache.solr.cloud.BasicDistributedZk2Test-1347705787709/control/data/index,segFN=segments_1,generation=1,filenames=[segments_1]
[junit4:junit4]   2> 1655 T779 oasc.SolrDeletionPolicy.updateCommits newest commit = 1
[junit4:junit4]   2> 1656 T779 oasc.SolrCore.initWriters created xml: solr.XMLResponseWriter
[junit4:junit4]   2> 1658 T779 oasup.UpdateRequestProcessorChain.init inserting DistributedUpdateProcessorFactory into updateRequestProcessorChain "dedupe"
[junit4:junit4]   2> 1659 T779 oasup.UpdateRequestProcessorChain.init inserting DistributedUpdateProcessorFactory into updateRequestProcessorChain "dedupe-allfields"
[junit4:junit4]   2> 1660 T779 oasup.UpdateRequestProcessorChain.init inserting DistributedUpdateProcessorFactory into updateRequestProcessorChain "stored_sig"
[junit4:junit4]   2> 1660 T779 oasup.UpdateRequestProcessorChain.init inserting DistributedUpdateProcessorFactory into updateRequestProcessorChain "uniq-fields"
[junit4:junit4]   2> 1661 T779 oasup.UpdateRequestProcessorChain.init inserting DistributedUpdateProcessorFactory into updateRequestProcessorChain "distrib-dup-test-chain-implicit"
[junit4:junit4]   2> 1662 T779 oasc.RequestHandlers.initHandlersFromConfig adding lazy requestHandler: solr.ReplicationHandler
[junit4:junit4]   2> 1662 T779 oasc.RequestHandlers.initHandlersFromConfig created /replication: solr.ReplicationHandler
[junit4:junit4]   2> 1663 T779 oasc.RequestHandlers.initHandlersFromConfig created standard: solr.StandardRequestHandler
[junit4:junit4]   2> 1664 T779 oasc.RequestHandlers.initHandlersFromConfig created /get: solr.RealTimeGetHandler
[junit4:junit4]   2> 1665 T779 oasc.RequestHandlers.initHandlersFromConfig created dismax: solr.SearchHandler
[junit4:junit4]   2> 1665 T779 oasc.RequestHandlers.initHandlersFromConfig created mock: org.apache.solr.core.MockQuerySenderListenerReqHandler
[junit4:junit4]   2> 1666 T779 oasc.RequestHandlers.initHandlersFromConfig created /admin/: org.apache.solr.handler.admin.AdminHandlers
[junit4:junit4]   2> 1667 T779 oasc.RequestHandlers.initHandlersFromConfig created defaults: solr.StandardRequestHandler
[junit4:junit4]   2> 1667 T779 oasc.RequestHandlers.initHandlersFromConfig adding lazy requestHandler: solr.StandardRequestHandler
[junit4:junit4]   2> 1668 T779 oasc.RequestHandlers.initHandlersFromConfig created lazy: solr.StandardRequestHandler
[junit4:junit4]   2> 1669 T779 oasc.RequestHandlers.initHandlersFromConfig created /update: solr.UpdateRequestHandler
[junit4:junit4]   2> 1669 T779 oasc.RequestHandlers.initHandlersFromConfig created /terms: org.apache.solr.handler.component.SearchHandler
[junit4:junit4]   2> 1670 T779 oasc.RequestHandlers.initHandlersFromConfig created spellCheckCompRH: org.apache.solr.handler.component.SearchHandler
[junit4:junit4]   2> 1671 T779 oasc.RequestHandlers.initHandlersFromConfig created spellCheckCompRH_Direct: org.apache.solr.handler.component.SearchHandler
[junit4:junit4]   2> 1672 T779 oasc.RequestHandlers.initHandlersFromConfig created spellCheckWithWordbreak: org.apache.solr.handler.component.SearchHandler
[junit4:junit4]   2> 1672 T779 oasc.RequestHandlers.initHandlersFromConfig created spellCheckWithWordbreak_Direct: org.apache.solr.handler.component.SearchHandler
[junit4:junit4]   2> 1673 T779 oasc.RequestHandlers.initHandlersFromConfig created spellCheckCompRH1: org.apache.solr.handler.component.SearchHandler
[junit4:junit4]   2> 1674 T779 oasc.RequestHandlers.initHandlersFromConfig created tvrh: org.apache.solr.handler.component.SearchHandler
[junit4:junit4]   2> 1675 T779 oasc.RequestHandlers.initHandlersFromConfig created /mlt: solr.MoreLikeThisHandler
[junit4:junit4]   2> 1675 T779 oasc.RequestHandlers.initHandlersFromConfig created /debug/dump: solr.DumpRequestHandler
[junit4:junit4]   2> 1679 T779 oashl.XMLLoader.init xsltCacheLifetimeSeconds=60
[junit4:junit4]   2> 1684 T779 oasc.SolrCore.initDeprecatedSupport WARNING solrconfig.xml uses deprecated <admin/gettableFiles>, Please update your config to use the ShowFileRequestHandler.
[junit4:junit4]   2> 1685 T779 oasc.SolrCore.initDeprecatedSupport WARNING adding ShowFileRequestHandler with hidden files: [SCHEMA.XML, OLD_SYNONYMS.TXT, STOPWORDS.TXT, PROTWORDS.TXT, OPEN-EXCHANGE-RATES.JSON, SYNONYMS.TXT, CURRENCY.XML, MAPPING-ISOLATIN1ACCENT.TXT]
[junit4:junit4]   2> 1689 T779 oass.SolrIndexSearcher.<init> Opening Searcher@514e2278 main
[junit4:junit4]   2> 1691 T779 oasu.CommitTracker.<init> Hard AutoCommit: disabled
[junit4:junit4]   2> 1691 T779 oasu.CommitTracker.<init> Soft AutoCommit: disabled
[junit4:junit4]   2> 1692 T779 oashc.SpellCheckComponent.inform Initializing spell checkers
[junit4:junit4]   2> 1749 T779 oass.DirectSolrSpellChecker.init init: {name=direct,classname=DirectSolrSpellChecker,field=lowerfilt,minQueryLength=3}
[junit4:junit4]   2> 1905 T802 oasc.SolrCore.registerSearcher [collection1] Registered new searcher Searcher@514e2278 main{StandardDirectoryReader(segments_1:1)}
[junit4:junit4]   2> 1912 T784 oazs.PrepRequestProcessor.pRequest Got user-level KeeperException when processing sessionid:0x139c98655430002 type:create cxid:0x56 zxid:0xfffffffffffffffe txntype:unknown reqpath:n/a Error Path:/solr/overseer/queue Error:KeeperErrorCode = NoNode for /solr/overseer/queue
[junit4:junit4]   2> 1933 T779 oasc.CoreContainer.register registering core: collection1
[junit4:junit4]   2> 1934 T779 oasc.ZkController.register Register shard - core:collection1 address:http://127.0.0.1:19446/solr shardId:control_shard
[junit4:junit4]   2> 1935 T779 oascc.SolrZkClient.makePath makePath: /collections/control_collection/leader_elect/control_shard/election
[junit4:junit4]   2> 1968 T784 oazs.PrepRequestProcessor.pRequest Got user-level KeeperException when processing sessionid:0x139c98655430002 type:delete cxid:0x65 zxid:0xfffffffffffffffe txntype:unknown reqpath:n/a Error Path:/solr/collections/control_collection/leaders Error:KeeperErrorCode = NoNode for /solr/collections/control_collection/leaders
[junit4:junit4]   2> 1977 T779 oasc.ShardLeaderElectionContext.runLeaderProcess Running the leader process.
[junit4:junit4]   2> 1978 T784 oazs.PrepRequestProcessor.pRequest Got user-level KeeperException when processing sessionid:0x139c98655430002 type:create cxid:0x66 zxid:0xfffffffffffffffe txntype:unknown reqpath:n/a Error Path:/solr/overseer Error:KeeperErrorCode = NodeExists for /solr/overseer
[junit4:junit4]   2> 2054 T800 oascc.ZkStateReader.updateClusterState Updating cloud state from ZooKeeper... 
[junit4:junit4]   2> 2055 T784 oazs.PrepRequestProcessor.pRequest Got user-level KeeperException when processing sessionid:0x139c98655430002 type:create cxid:0x6d zxid:0xfffffffffffffffe txntype:unknown reqpath:n/a Error Path:/solr/overseer/queue-work Error:KeeperErrorCode = NoNode for /solr/overseer/queue-work
[junit4:junit4]   2> 2063 T799 oascc.ZkStateReader$2.process A cluster state change has occurred - updating...
[junit4:junit4]   2> 2491 T779 oasc.ShardLeaderElectionContext.waitForReplicasToComeUp Enough replicas found to continue.
[junit4:junit4]   2> 2492 T779 oasc.ShardLeaderElectionContext.runLeaderProcess I may be the new leader - try and sync
[junit4:junit4]   2> 2493 T779 oasc.SyncStrategy.sync Sync replicas to http://127.0.0.1:19446/solr/collection1/
[junit4:junit4]   2> 2493 T779 oasc.SyncStrategy.syncReplicas Sync Success - now sync replicas to me
[junit4:junit4]   2> 2494 T779 oasc.SyncStrategy.syncToMe http://127.0.0.1:19446/solr/collection1/ has no replicas
[junit4:junit4]   2> 2494 T779 oasc.ShardLeaderElectionContext.runLeaderProcess I am the new leader: http://127.0.0.1:19446/solr/collection1/
[junit4:junit4]   2> 2495 T779 oascc.SolrZkClient.makePath makePath: /collections/control_collection/leaders/control_shard
[junit4:junit4]   2> 2526 T784 oazs.PrepRequestProcessor.pRequest Got user-level KeeperException when processing sessionid:0x139c98655430002 type:create cxid:0x8b zxid:0xfffffffffffffffe txntype:unknown reqpath:n/a Error Path:/solr/overseer Error:KeeperErrorCode = NodeExists for /solr/overseer
[junit4:junit4]   2> 2568 T800 oascc.ZkStateReader.updateClusterState Updating cloud state from ZooKeeper... 
[junit4:junit4]   2> 2579 T799 oascc.ZkStateReader$2.process A cluster state change has occurred - updating...
[junit4:junit4]   2> 2607 T779 oasc.ZkController.register We are http://127.0.0.1:19446/solr/collection1/ and leader is http://127.0.0.1:19446/solr/collection1/
[junit4:junit4]   2> 2607 T779 oasc.ZkController.register No LogReplay needed for core=collection1 baseURL=http://127.0.0.1:19446/solr
[junit4:junit4]   2> 2608 T779 oasc.ZkController.checkRecovery I am the leader, no recovery necessary
[junit4:junit4]   2> 2610 T779 oascc.ZkStateReader.updateClusterState Updating cloud state from ZooKeeper... 
[junit4:junit4]   2> 2611 T779 oass.SolrDispatchFilter.init user.dir=/usr/home/hudson/hudson-slave/workspace/Lucene-Solr-Tests-trunk-java7/solr/build/solr-core/test/J1
[junit4:junit4]   2> 2611 T779 oass.SolrDispatchFilter.init SolrDispatchFilter.init() done
[junit4:junit4]   2> 2612 T779 oascsi.HttpClientUtil.createClient Creating new http client, config:maxConnections=128&maxConnectionsPerHost=32&followRedirects=false
[junit4:junit4]   2> 2634 T779 oejs.Server.doStart jetty-8.1.2.v20120308
[junit4:junit4]   2> 2637 T779 oejs.AbstractConnector.doStart Started SocketConnector@0.0.0.0:19462
[junit4:junit4]   2> 2638 T779 oasc.SolrResourceLoader.locateSolrHome JNDI not configured for solr (NoInitialContextEx)
[junit4:junit4]   2> 2638 T779 oasc.SolrResourceLoader.locateSolrHome using system property solr.solr.home: /usr/home/hudson/hudson-slave/workspace/Lucene-Solr-Tests-trunk-java7/solr/build/solr-core/test-files/solr
[junit4:junit4]   2> 2639 T779 oasc.SolrResourceLoader.<init> new SolrResourceLoader for deduced Solr Home: '/usr/home/hudson/hudson-slave/workspace/Lucene-Solr-Tests-trunk-java7/solr/build/solr-core/test-files/solr/'
[junit4:junit4]   2> 2686 T779 oass.SolrDispatchFilter.init SolrDispatchFilter.init()
[junit4:junit4]   2> 2687 T779 oasc.SolrResourceLoader.locateSolrHome JNDI not configured for solr (NoInitialContextEx)
[junit4:junit4]   2> 2687 T779 oasc.SolrResourceLoader.locateSolrHome using system property solr.solr.home: /usr/home/hudson/hudson-slave/workspace/Lucene-Solr-Tests-trunk-java7/solr/build/solr-core/test-files/solr
[junit4:junit4]   2> 2688 T779 oasc.CoreContainer$Initializer.initialize looking for solr.xml: /usr/home/hudson/hudson-slave/workspace/Lucene-Solr-Tests-trunk-java7/solr/build/solr-core/test-files/solr/solr.xml
[junit4:junit4]   2> 2688 T779 oasc.CoreContainer.<init> New CoreContainer 521378214
[junit4:junit4]   2> 2689 T779 oasc.CoreContainer.load Loading CoreContainer using Solr Home: '/usr/home/hudson/hudson-slave/workspace/Lucene-Solr-Tests-trunk-java7/solr/build/solr-core/test-files/solr/'
[junit4:junit4]   2> 2690 T779 oasc.SolrResourceLoader.<init> new SolrResourceLoader for directory: '/usr/home/hudson/hudson-slave/workspace/Lucene-Solr-Tests-trunk-java7/solr/build/solr-core/test-files/solr/'
[junit4:junit4]   2> 2724 T779 oasc.CoreContainer.load Registering Log Listener
[junit4:junit4]   2> 2741 T779 oasc.CoreContainer.initZooKeeper Zookeeper client=127.0.0.1:19442/solr
[junit4:junit4]   2> 2742 T779 oaz.ZooKeeper.<init> Initiating client connection, connectString=127.0.0.1:19442/solr sessionTimeout=5000 watcher=org.apache.solr.common.cloud.ConnectionManager@60d65c46
[junit4:junit4]   2> 2744 T812 oaz.ClientCnxn$SendThread.startConnect Opening socket connection to server /127.0.0.1:19442
[junit4:junit4]   2> 2744 T779 oascc.ConnectionManager.waitForConnected Waiting for client to connect to ZooKeeper
[junit4:junit4]   2> 2745 T812 oaz.ClientCnxn$SendThread.primeConnection Socket connection established to localhost/127.0.0.1:19442, initiating session
[junit4:junit4]   2> 2745 T781 oazs.NIOServerCnxn$Factory.run Accepted socket connection from /140.211.11.196:19464
[junit4:junit4]   2> 2746 T781 oazs.NIOServerCnxn.readConnectRequest Client attempting to establish new session at /140.211.11.196:19464
[junit4:junit4]   2> 2748 T783 oazs.NIOServerCnxn.finishSessionInit Established session 0x139c98655430003 with negotiated timeout 5000 for client /140.211.11.196:19464
[junit4:junit4]   2> 2748 T812 oaz.ClientCnxn$SendThread.readConnectResult Session establishment complete on server localhost/127.0.0.1:19442, sessionid = 0x139c98655430003, negotiated timeout = 5000
[junit4:junit4]   2> 2748 T813 oascc.ConnectionManager.process Watcher org.apache.solr.common.cloud.ConnectionManager@60d65c46 name:ZooKeeperConnection Watcher:127.0.0.1:19442/solr got event WatchedEvent state:SyncConnected type:None path:null path:null type:None
[junit4:junit4]   2> 2749 T779 oascc.ConnectionManager.waitForConnected Client is connected to ZooKeeper
[junit4:junit4]   2> 2749 T784 oazs.PrepRequestProcessor.pRequest Got user-level KeeperException when processing sessionid:0x139c98655430003 type:create cxid:0x1 zxid:0xfffffffffffffffe txntype:unknown reqpath:n/a Error Path:/solr/overseer Error:KeeperErrorCode = NodeExists for /solr/overseer
[junit4:junit4]   2> 2751 T784 oazs.PrepRequestProcessor.pRequest Got user-level KeeperException when processing sessionid:0x139c98655430003 type:create cxid:0x2 zxid:0xfffffffffffffffe txntype:unknown reqpath:n/a Error Path:/solr/overseer Error:KeeperErrorCode = NodeExists for /solr/overseer
[junit4:junit4]   2> 2761 T779 oasc.ZkController.createEphemeralLiveNode Register node as live in ZooKeeper:/live_nodes/127.0.0.1:19462_solr
[junit4:junit4]   2> 2761 T784 oazs.PrepRequestProcessor.pRequest Got user-level KeeperException when processing sessionid:0x139c98655430003 type:delete cxid:0x4 zxid:0xfffffffffffffffe txntype:unknown reqpath:n/a Error Path:/solr/live_nodes/127.0.0.1:19462_solr Error:KeeperErrorCode = NoNode for /solr/live_nodes/127.0.0.1:19462_solr
[junit4:junit4]   2> 2762 T779 oascc.SolrZkClient.makePath makePath: /live_nodes/127.0.0.1:19462_solr
[junit4:junit4]   2> 2765 T799 oascc.ZkStateReader$3.process Updating live nodes
[junit4:junit4]   2> 2766 T779 oashc.HttpShardHandlerFactory.getParameter Setting socketTimeout to: 0
[junit4:junit4]   2> 2766 T779 oashc.HttpShardHandlerFactory.getParameter Setting urlScheme to: http://
[junit4:junit4]   2> 2767 T779 oashc.HttpShardHandlerFactory.getParameter Setting connTimeout to: 0
[junit4:junit4]   2> 2767 T779 oashc.HttpShardHandlerFactory.getParameter Setting maxConnectionsPerHost to: 20
[junit4:junit4]   2> 2768 T779 oashc.HttpShardHandlerFactory.getParameter Setting corePoolSize to: 0
[junit4:junit4]   2> 2768 T779 oashc.HttpShardHandlerFactory.getParameter Setting maximumPoolSize to: 2147483647
[junit4:junit4]   2> 2769 T779 oashc.HttpShardHandlerFactory.getParameter Setting maxThreadIdleTime to: 5
[junit4:junit4]   2> 2769 T779 oashc.HttpShardHandlerFactory.getParameter Setting sizeOfQueue to: -1
[junit4:junit4]   2> 2770 T779 oashc.HttpShardHandlerFactory.getParameter Setting fairnessPolicy to: false
[junit4:junit4]   2> 2770 T779 oascsi.HttpClientUtil.createClient Creating new http client, config:maxConnectionsPerHost=20&maxConnections=10000&socketTimeout=0&connTimeout=0&retry=false
[junit4:junit4]   2> 2787 T779 oascc.ZkStateReader.createClusterStateWatchersAndUpdate Updating cluster state from ZooKeeper... 
[junit4:junit4]   2> 2797 T779 oasc.CoreContainer.create Creating SolrCore 'collection1' using instanceDir: /usr/home/hudson/hudson-slave/workspace/Lucene-Solr-Tests-trunk-java7/solr/build/solr-core/test-files/solr/collection1
[junit4:junit4]   2> 2798 T779 oasc.ZkController.createCollectionZkNode Check for collection zkNode:collection1
[junit4:junit4]   2> 2799 T779 oasc.ZkController.createCollectionZkNode Collection zkNode exists
[junit4:junit4]   2> 2800 T779 oasc.ZkController.readConfigName Load collection config from:/collections/collection1
[junit4:junit4]   2> 2802 T779 oasc.SolrResourceLoader.<init> new SolrResourceLoader for directory: '/usr/home/hudson/hudson-slave/workspace/Lucene-Solr-Tests-trunk-java7/solr/build/solr-core/test-files/solr/collection1/'
[junit4:junit4]   2> 2804 T779 oasc.SolrResourceLoader.replaceClassLoader Adding 'file:/usr/home/hudson/hudson-slave/workspace/Lucene-Solr-Tests-trunk-java7/solr/build/solr-core/test-files/solr/collection1/lib/classes/' to classloader
[junit4:junit4]   2> 2805 T779 oasc.SolrResourceLoader.replaceClassLoader Adding 'file:/usr/home/hudson/hudson-slave/workspace/Lucene-Solr-Tests-trunk-java7/solr/build/solr-core/test-files/solr/collection1/lib/README' to classloader
[junit4:junit4]   2> 2866 T779 oasc.SolrConfig.<init> Using Lucene MatchVersion: LUCENE_50
[junit4:junit4]   2> 2938 T779 oasc.SolrConfig.<init> Loaded SolrConfig: solrconfig.xml
[junit4:junit4]   2> 3039 T779 oass.IndexSchema.readSchema Reading Solr Schema
[junit4:junit4]   2> 3046 T779 oass.IndexSchema.readSchema Schema name=test
[junit4:junit4]   2> 3083 T800 oascc.ZkStateReader.updateClusterState Updating cloud state from ZooKeeper... 
[junit4:junit4]   2> 3090 T813 oascc.ZkStateReader$2.process A cluster state change has occurred - updating...
[junit4:junit4]   2> 3090 T799 oascc.ZkStateReader$2.process A cluster state change has occurred - updating...
[junit4:junit4]   2> 3586 T779 oass.OpenExchangeRatesOrgProvider.init Initialized with rates=open-exchange-rates.json, refreshInterval=1440.
[junit4:junit4]   2> 3595 T779 oass.IndexSchema.readSchema default search field in schema is text
[junit4:junit4]   2> 3598 T779 oass.IndexSchema.readSchema unique key field: id
[junit4:junit4]   2> 3608 T779 oass.FileExchangeRateProvider.reload Reloading exchange rates from file currency.xml
[junit4:junit4]   2> 3612 T779 oass.FileExchangeRateProvider.reload Reloading exchange rates from file currency.xml
[junit4:junit4]   2> 3616 T779 oass.OpenExchangeRatesOrgProvider.reload Reloading exchange rates from open-exchange-rates.json
[junit4:junit4]   2> 3617 T779 oass.OpenExchangeRatesOrgProvider.reload Reloading exchange rates from open-exchange-rates.json
[junit4:junit4]   2> 3618 T779 oasc.SolrCore.<init> [collection1] Opening new SolrCore at /usr/home/hudson/hudson-slave/workspace/Lucene-Solr-Tests-trunk-java7/solr/build/solr-core/test-files/solr/collection1/, dataDir=./org.apache.solr.cloud.BasicDistributedZk2Test-1347705787709/jetty1/
[junit4:junit4]   2> 3618 T779 oasc.JmxMonitoredMap.<init> JMX monitoring is enabled. Adding Solr mbeans to JMX Server: com.sun.jmx.mbeanserver.JmxMBeanServer@dd83d58
[junit4:junit4]   2> 3620 T779 oasc.SolrCore.getNewIndexDir WARNING New index directory detected: old=null new=./org.apache.solr.cloud.BasicDistributedZk2Test-1347705787709/jetty1/index/
[junit4:junit4]   2> 3620 T779 oasc.SolrCore.initIndex WARNING [collection1] Solr index directory './org.apache.solr.cloud.BasicDistributedZk2Test-1347705787709/jetty1/index' doesn't exist. Creating new index...
[junit4:junit4]   2> 3621 T779 oasc.CachingDirectoryFactory.get return new directory for /usr/home/hudson/hudson-slave/workspace/Lucene-Solr-Tests-trunk-java7/solr/build/solr-core/test/J1/./org.apache.solr.cloud.BasicDistributedZk2Test-1347705787709/jetty1/index forceNew:false
[junit4:junit4]   2> 3643 T779 oasc.SolrDeletionPolicy.onCommit SolrDeletionPolicy.onCommit: commits:num=1
[junit4:junit4]   2> 		commit{dir=/usr/home/hudson/hudson-slave/workspace/Lucene-Solr-Tests-trunk-java7/solr/build/solr-core/test/J1/org.apache.solr.cloud.BasicDistributedZk2Test-1347705787709/jetty1/index,segFN=segments_1,generation=1,filenames=[segments_1]
[junit4:junit4]   2> 3643 T779 oasc.SolrDeletionPolicy.updateCommits newest commit = 1
[junit4:junit4]   2> 3644 T779 oasc.SolrCore.initWriters created xml: solr.XMLResponseWriter
[junit4:junit4]   2> 3646 T779 oasup.UpdateRequestProcessorChain.init inserting DistributedUpdateProcessorFactory into updateRequestProcessorChain "dedupe"
[junit4:junit4]   2> 3647 T779 oasup.UpdateRequestProcessorChain.init inserting DistributedUpdateProcessorFactory into updateRequestProcessorChain "dedupe-allfields"
[junit4:junit4]   2> 3647 T779 oasup.UpdateRequestProcessorChain.init inserting DistributedUpdateProcessorFactory into updateRequestProcessorChain "stored_sig"
[junit4:junit4]   2> 3648 T779 oasup.UpdateRequestProcessorChain.init inserting DistributedUpdateProcessorFactory into updateRequestProcessorChain "uniq-fields"
[junit4:junit4]   2> 3648 T779 oasup.UpdateRequestProcessorChain.init inserting DistributedUpdateProcessorFactory into updateRequestProcessorChain "distrib-dup-test-chain-implicit"
[junit4:junit4]   2> 3649 T779 oasc.RequestHandlers.initHandlersFromConfig adding lazy requestHandler: solr.ReplicationHandler
[junit4:junit4]   2> 3649 T779 oasc.RequestHandlers.initHandlersFromConfig created /replication: solr.ReplicationHandler
[junit4:junit4]   2> 3650 T779 oasc.RequestHandlers.initHandlersFromConfig created standard: solr.StandardRequestHandler
[junit4:junit4]   2> 3650 T779 oasc.RequestHandlers.initHandlersFromConfig created /get: solr.RealTimeGetHandler
[junit4:junit4]   2> 3651 T779 oasc.RequestHandlers.initHandlersFromConfig created dismax: solr.SearchHandler
[junit4:junit4]   2> 3652 T779 oasc.RequestHandlers.initHandlersFromConfig created mock: org.apache.solr.core.MockQuerySenderListenerReqHandler
[junit4:junit4]   2> 3652 T779 oasc.RequestHandlers.initHandlersFromConfig created /admin/: org.apache.solr.handler.admin.AdminHandlers
[junit4:junit4]   2> 3653 T779 oasc.RequestHandlers.initHandlersFromConfig created defaults: solr.StandardRequestHandler
[junit4:junit4]   2> 3653 T779 oasc.RequestHandlers.initHandlersFromConfig adding lazy requestHandler: solr.StandardRequestHandler
[junit4:junit4]   2> 3653 T779 oasc.RequestHandlers.initHandlersFromConfig created lazy: solr.StandardRequestHandler
[junit4:junit4]   2> 3654 T779 oasc.RequestHandlers.initHandlersFromConfig created /update: solr.UpdateRequestHandler
[junit4:junit4]   2> 3655 T779 oasc.RequestHandlers.initHandlersFromConfig created /terms: org.apache.solr.handler.component.SearchHandler
[junit4:junit4]   2> 3655 T779 oasc.RequestHandlers.initHandlersFromConfig created spellCheckCompRH: org.apache.solr.handler.component.SearchHandler
[junit4:junit4]   2> 3656 T779 oasc.RequestHandlers.initHandlersFromConfig created spellCheckCompRH_Direct: org.apache.solr.handler.component.SearchHandler
[junit4:junit4]   2> 3656 T779 oasc.RequestHandlers.initHandlersFromConfig created spellCheckWithWordbreak: org.apache.solr.handler.component.SearchHandler
[junit4:junit4]   2> 3657 T779 oasc.RequestHandlers.initHandlersFromConfig created spellCheckWithWordbreak_Direct: org.apache.solr.handler.component.SearchHandler
[junit4:junit4]   2> 3657 T779 oasc.RequestHandlers.initHandlersFromConfig created spellCheckCompRH1: org.apache.solr.handler.component.SearchHandler
[junit4:junit4]   2> 3658 T779 oasc.RequestHandlers.initHandlersFromConfig created tvrh: org.apache.solr.handler.component.SearchHandler
[junit4:junit4]   2> 3658 T779 oasc.RequestHandlers.initHandlersFromConfig created /mlt: solr.MoreLikeThisHandler
[junit4:junit4]   2> 3659 T779 oasc.RequestHandlers.initHandlersFromConfig created /debug/dump: solr.DumpRequestHandler
[junit4:junit4]   2> 3662 T779 oashl.XMLLoader.init xsltCacheLifetimeSeconds=60
[junit4:junit4]   2> 3666 T779 oasc.SolrCore.initDeprecatedSupport WARNING solrconfig.xml uses deprecated <admin/gettableFiles>, Please update your config to use the ShowFileRequestHandler.
[junit4:junit4]   2> 3667 T779 oasc.SolrCore.initDeprecatedSupport WARNING adding ShowFileRequestHandler with hidden files: [SCHEMA.XML, OLD_SYNONYMS.TXT, STOPWORDS.TXT, PROTWORDS.TXT, OPEN-EXCHANGE-RATES.JSON, SYNONYMS.TXT, CURRENCY.XML, MAPPING-ISOLATIN1ACCENT.TXT]
[junit4:junit4]   2> 3670 T779 oass.SolrIndexSearcher.<init> Opening Searcher@5305a38b main
[junit4:junit4]   2> 3671 T779 oasu.CommitTracker.<init> Hard AutoCommit: disabled
[junit4:junit4]   2> 3671 T779 oasu.CommitTracker.<init> Soft AutoCommit: disabled
[junit4:junit4]   2> 3672 T779 oashc.SpellCheckComponent.inform Initializing spell checkers
[junit4:junit4]   2> 3684 T779 oass.DirectSolrSpellChecker.init init: {name=direct,classname=DirectSolrSpellChecker,field=lowerfilt,minQueryLength=3}
[junit4:junit4]   2> 3763 T814 oasc.SolrCore.registerSearcher [collection1] Registered new searcher Searcher@5305a38b main{StandardDirectoryReader(segments_1:1)}
[junit4:junit4]   2> 4106 T800 oascc.ZkStateReader.updateClusterState Updating cloud state from ZooKeeper... 
[junit4:junit4]   2> 4121 T813 oascc.ZkStateReader$2.process A cluster state change has occurred - updating...
[junit4:junit4]   2> 4121 T799 oascc.ZkStateReader$2.process A cluster state change has occurred - updating...
[junit4:junit4]   2> 4270 T779 oasc.CoreContainer.register registering core: collection1
[junit4:junit4]   2> 4271 T779 oasc.ZkController.register Register shard - core:collection1 address:http://127.0.0.1:19462/solr shardId:shard1
[junit4:junit4]   2> 4272 T779 oascc.SolrZkClient.makePath makePath: /collections/collection1/leader_elect/shard1/election
[junit4:junit4]   2> 4286 T784 oazs.PrepRequestProcessor.pRequest Got user-level KeeperException when processing sessionid:0x139c98655430003 type:delete cxid:0x43 zxid:0xfffffffffffffffe txntype:unknown reqpath:n/a Error Path:/solr/collections/collection1/leaders Error:KeeperErrorCode = NoNode for /solr/collections/collection1/leaders
[junit4:junit4]   2> 4287 T779 oasc.ShardLeaderElectionContext.runLeaderProcess Running the leader process.
[junit4:junit4]   2> 4288 T784 oazs.PrepRequestProcessor.pRequest Got user-level KeeperException when processing sessionid:0x139c98655430003 type:create cxid:0x44 zxid:0xfffffffffffffffe txntype:unknown reqpath:n/a Error Path:/solr/overseer Error:KeeperErrorCode = NodeExists for /solr/overseer
[junit4:junit4]   2> 4300 T779 oasc.ShardLeaderElectionContext.waitForReplicasToComeUp Enough replicas found to continue.
[junit4:junit4]   2> 4301 T779 oasc.ShardLeaderElectionContext.runLeaderProcess I may be the new leader - try and sync
[junit4:junit4]   2> 4301 T779 oasc.SyncStrategy.sync Sync replicas to http://127.0.0.1:19462/solr/collection1/
[junit4:junit4]   2> 4302 T779 oasc.SyncStrategy.syncReplicas Sync Success - now sync replicas to me
[junit4:junit4]   2> 4302 T779 oasc.SyncStrategy.syncToMe http://127.0.0.1:19462/solr/collection1/ has no replicas
[junit4:junit4]   2> 4303 T779 oasc.ShardLeaderElectionContext.runLeaderProcess I am the new leader: http://127.0.0.1:19462/solr/collection1/
[junit4:junit4]   2> 4304 T779 oascc.SolrZkClient.makePath makePath: /collections/collection1/leaders/shard1
[junit4:junit4]   2> 4312 T784 oazs.PrepRequestProcessor.pRequest Got user-level KeeperException when processing sessionid:0x139c98655430003 type:create cxid:0x4e zxid:0xfffffffffffffffe txntype:unknown reqpath:n/a Error Path:/solr/overseer Error:KeeperErrorCode = NodeExists for /solr/overseer
[junit4:junit4]   2> 4625 T800 oascc.ZkStateReader.updateClusterState Updating cloud state from ZooKeeper... 
[junit4:junit4]   2> 4643 T813 oascc.ZkStateReader$2.process A cluster state change has occurred - updating...
[junit4:junit4]   2> 4643 T799 oascc.ZkStateReader$2.process A cluster state change has occurred - updating...
[junit4:junit4]   2> 4672 T779 oasc.ZkController.register We are http://127.0.0.1:19462/solr/collection1/ and leader is http://127.0.0.1:19462/solr/collection1/
[junit4:junit4]   2> 4672 T779 oasc.ZkController.register No LogReplay needed for core=collection1 baseURL=http://127.0.0.1:19462/solr
[junit4:junit4]   2> 4673 T779 oasc.ZkController.checkRecovery I am the leader, no recovery necessary
[junit4:junit4]   2> 4676 T779 oascc.ZkStateReader.updateClusterState Updating cloud state from ZooKeeper... 
[junit4:junit4]   2> 4677 T779 oass.SolrDispatchFilter.init user.dir=/usr/home/hudson/hudson-slave/workspace/Lucene-Solr-Tests-trunk-java7/solr/build/solr-core/test/J1
[junit4:junit4]   2> 4677 T779 oass.SolrDispatchFilter.init SolrDispatchFilter.init() done
[junit4:junit4]   2> 4677 T779 oascsi.HttpClientUtil.createClient Creating new http client, config:maxConnections=128&maxConnectionsPerHost=32&followRedirects=false
[junit4:junit4]   2> 4690 T779 oejs.Server.doStart jetty-8.1.2.v20120308
[junit4:junit4]   2> 4692 T779 oejs.AbstractConnector.doStart Started SocketConnector@0.0.0.0:19467
[junit4:junit4]   2> 4693 T779 oasc.SolrResourceLoader.locateSolrHome JNDI not configured for solr (NoInitialContextEx)
[junit4:junit4]   2> 4693 T779 oasc.SolrResourceLoader.locateSolrHome using system property solr.solr.home: /usr/home/hudson/hudson-slave/workspace/Lucene-Solr-Tests-trunk-java7/solr/build/solr-core/test-files/solr
[junit4:junit4]   2> 4694 T779 oasc.SolrResourceLoader.<init> new SolrResourceLoader for deduced Solr Home: '/usr/home/hudson/hudson-slave/workspace/Lucene-Solr-Tests-trunk-java7/solr/build/solr-core/test-files/solr/'
[junit4:junit4]   2> 4727 T779 oass.SolrDispatchFilter.init SolrDispatchFilter.init()
[junit4:junit4]   2> 4727 T779 oasc.SolrResourceLoader.locateSolrHome JNDI not configured for solr (NoInitialContextEx)
[junit4:junit4]   2> 4727 T779 oasc.SolrResourceLoader.locateSolrHome using system property solr.solr.home: /usr/home/hudson/hudson-slave/workspace/Lucene-Solr-Tests-trunk-java7/solr/build/solr-core/test-files/solr
[junit4:junit4]   2> 4728 T779 oasc.CoreContainer$Initializer.initialize looking for solr.xml: /usr/home/hudson/hudson-slave/workspace/Lucene-Solr-Tests-trunk-java7/solr/build/solr-core/test-files/solr/solr.xml
[junit4:junit4]   2> 4728 T779 oasc.CoreContainer.<init> New CoreContainer 652064656
[junit4:junit4]   2> 4729 T779 oasc.CoreContainer.load Loading CoreContainer using Solr Home: '/usr/home/hudson/hudson-slave/workspace/Lucene-Solr-Tests-trunk-java7/solr/build/solr-core/test-files/solr/'
[junit4:junit4]   2> 4729 T779 oasc.SolrResourceLoader.<init> new SolrResourceLoader for directory: '/usr/home/hudson/hudson-slave/workspace/Lucene-Solr-Tests-trunk-java7/solr/build/solr-core/test-files/solr/'
[junit4:junit4]   2> 4754 T779 oasc.CoreContainer.load Registering Log Listener
[junit4:junit4]   2> 4766 T779 oasc.CoreContainer.initZooKeeper Zookeeper client=127.0.0.1:19442/solr
[junit4:junit4]   2> 4767 T779 oaz.ZooKeeper.<init> Initiating client connection, connectString=127.0.0.1:19442/solr sessionTimeout=5000 watcher=org.apache.solr.common.cloud.ConnectionManager@126158d3
[junit4:junit4]   2> 4767 T824 oaz.ClientCnxn$SendThread.startConnect Opening socket connection to server /127.0.0.1:19442
[junit4:junit4]   2> 4767 T779 oascc.ConnectionManager.waitForConnected Waiting for client to connect to ZooKeeper
[junit4:junit4]   2> 4769 T824 oaz.ClientCnxn$SendThread.primeConnection Socket connection established to localhost/127.0.0.1:19442, initiating session
[junit4:junit4]   2> 4769 T781 oazs.NIOServerCnxn$Factory.run Accepted socket connection from /140.211.11.196:19468
[junit4:junit4]   2> 4770 T781 oazs.NIOServerCnxn.readConnectRequest Client attempting to establish new session at /140.211.11.196:19468
[junit4:junit4]   2> 4771 T783 oazs.NIOServerCnxn.finishSessionInit Established session 0x139c98655430004 with negotiated timeout 5000 for client /140.211.11.196:19468
[junit4:junit4]   2> 4771 T824 oaz.ClientCnxn$SendThread.readConnectResult Session establishment complete on server localhost/127.0.0.1:19442, sessionid = 0x139c98655430004, negotiated timeout = 5000
[junit4:junit4]   2> 4771 T825 oascc.ConnectionManager.process Watcher org.apache.solr.common.cloud.ConnectionManager@126158d3 name:ZooKeeperConnection Watcher:127.0.0.1:19442/solr got event WatchedEvent state:SyncConnected type:None path:null path:null type:None
[junit4:junit4]   2> 4772 T779 oascc.ConnectionManager.waitForConnected Client is connected to ZooKeeper
[junit4:junit4]   2> 4772 T784 oazs.PrepRequestProcessor.pRequest Got user-level KeeperException when processing sessionid:0x139c98655430004 type:create cxid:0x1 zxid:0xfffffffffffffffe txntype:unknown reqpath:n/a Error Path:/solr/overseer Error:KeeperErrorCode = NodeExists for /solr/overseer
[junit4:junit4]   2> 4774 T784 oazs.PrepRequestProcessor.pRequest Got user-level KeeperException when processing sessionid:0x139c98655430004 type:create cxid:0x2 zxid:0xfffffffffffffffe txntype:unknown reqpath:n/a Error Path:/solr/overseer Error:KeeperErrorCode = NodeExists for /solr/overseer
[junit4:junit4]   2> 4782 T779 oasc.ZkController.createEphemeralLiveNode Register node as live in ZooKeeper:/live_nodes/127.0.0.1:19467_solr
[junit4:junit4]   2> 4782 T784 oazs.PrepRequestProcessor.pRequest Got user-level KeeperException when processing sessionid:0x139c98655430004 type:delete cxid:0x4 zxid:0xfffffffffffffffe txntype:unknown reqpath:n/a Error Path:/solr/live_nodes/127.0.0.1:19467_solr Error:KeeperErrorCode = NoNode for /solr/live_nodes/127.0.0.1:19467_solr
[junit4:junit4]   2> 4783 T779 oascc.SolrZkClient.makePath makePath: /live_nodes/127.0.0.1:19467_solr
[junit4:junit4]   2> 4785 T813 oascc.ZkStateReader$3.process Updating live nodes
[junit4:junit4]   2> 4785 T799 oascc.ZkStateReader$3.process Updating live nodes
[junit4:junit4]   2> 4786 T779 oashc.HttpShardHandlerFactory.getParameter Setting socketTimeout to: 0
[junit4:junit4]   2> 4786 T779 oashc.HttpShardHandlerFactory.getParameter Setting urlScheme to: http://
[junit4:junit4]   2> 4787 T779 oashc.HttpShardHandlerFactory.getParameter Setting connTimeout to: 0
[junit4:junit4]   2> 4787 T779 oashc.HttpShardHandlerFactory.getParameter Setting maxConnectionsPerHost to: 20
[junit4:junit4]   2> 4787 T779 oashc.HttpShardHandlerFactory.getParameter Setting corePoolSize to: 0
[junit4:junit4]   2> 4788 T779 oashc.HttpShardHandlerFactory.getParameter Setting maximumPoolSize to: 2147483647
[junit4:junit4]   2> 4788 T779 oashc.HttpShardHandlerFactory.getParameter Setting maxThreadIdleTime to: 5
[junit4:junit4]   2> 4788 T779 oashc.HttpShardHandlerFactory.getParameter Setting sizeOfQueue to: -1
[junit4:junit4]   2> 4789 T779 oashc.HttpShardHandlerFactory.getParameter Setting fairnessPolicy to: false
[junit4:junit4]   2> 4789 T779 oascsi.HttpClientUtil.createClient Creating new http client, config:maxConnectionsPerHost=20&maxConnections=10000&socketTimeout=0&connTimeout=0&retry=false
[junit4:junit4]   2> 4799 T779 oascc.ZkStateReader.createClusterStateWatchersAndUpdate Updating cluster state from ZooKeeper... 
[junit4:junit4]   2> 4805 T779 oasc.CoreContainer.create Creating SolrCore 'collection1' using instanceDir: /usr/home/hudson/hudson-slave/workspace/Lucene-Solr-Tests-trunk-java7/solr/build/solr-core/test-files/solr/collection1
[junit4:junit4]   2> 4806 T779 oasc.ZkController.createCollectionZkNode Check for collection zkNode:collection1
[junit4:junit4]   2> 4806 T779 oasc.ZkController.createCollectionZkNode Collection zkNode exists
[junit4:junit4]   2> 4807 T779 oasc.ZkController.readConfigName Load collection config from:/collections/collection1
[junit4:junit4]   2> 4808 T779 oasc.SolrResourceLoader.<init> new SolrResourceLoader for directory: '/usr/home/hudson/hudson-slave/workspace/Lucene-Solr-Tests-trunk-java7/solr/build/solr-core/test-files/solr/collection1/'
[junit4:junit4]   2> 4809 T779 oasc.SolrResourceLoader.replaceClassLoader Adding 'file:/usr/home/hudson/hudson-slave/workspace/Lucene-Solr-Tests-trunk-java7/solr/build/solr-core/test-files/solr/collection1/lib/classes/' to classloader
[junit4:junit4]   2> 4809 T779 oasc.SolrResourceLoader.replaceClassLoader Adding 'file:/usr/home/hudson/hudson-slave/workspace/Lucene-Solr-Tests-trunk-java7/solr/build/solr-core/test-files/solr/collection1/lib/README' to classloader
[junit4:junit4]   2> 4847 T779 oasc.SolrConfig.<init> Using Lucene MatchVersion: LUCENE_50
[junit4:junit4]   2> 4909 T779 oasc.SolrConfig.<init> Loaded SolrConfig: solrconfig.xml
[junit4:junit4]   2> 5010 T779 oass.IndexSchema.readSchema Reading Solr Schema
[junit4:junit4]   2> 5017 T779 oass.IndexSchema.readSchema Schema name=test
[junit4:junit4]   2> 5154 T800 oascc.ZkStateReader.updateClusterState Updating cloud state from ZooKeeper... 
[junit4:junit4]   2> 5173 T825 oascc.ZkStateReader$2.process A cluster state change has occurred - updating...
[junit4:junit4]   2> 5173 T813 oascc.ZkStateReader$2.process A cluster state change has occurred - updating...
[junit4:junit4]   2> 5173 T799 oascc.ZkStateReader$2.process A cluster state change has occurred - updating...
[junit4:junit4]   2> 5653 T779 oass.OpenExchangeRatesOrgProvider.init Initialized with rates=open-exchange-rates.json, refreshInterval=1440.
[junit4:junit4]   2> 5665 T779 oass.IndexSchema.readSchema default search field in schema is text
[junit4:junit4]   2> 5669 T779 oass.IndexSchema.readSchema unique key field: id
[junit4:junit4]   2> 5682 T779 oass.FileExchangeRateProvider.reload Reloading exchange rates from file currency.xml
[junit4:junit4]   2> 5688 T779 oass.FileExchangeRateProvider.reload Reloading exchange rates from file currency.xml
[junit4:junit4]   2> 5692 T779 oass.OpenExchangeRatesOrgProvider.reload Reloading exchange rates from open-exchange-rates.json
[junit4:junit4]   2> 5694 T779 oass.OpenExchangeRatesOrgProvider.reload Reloading exchange rates from open-exchange-rates.json
[junit4:junit4]   2> 5695 T779 oasc.SolrCore.<init> [collection1] Opening new SolrCore at /usr/home/hudson/hudson-slave/workspace/Lucene-Solr-Tests-trunk-java7/solr/build/solr-core/test-files/solr/collection1/, dataDir=./org.apache.solr.cloud.BasicDistributedZk2Test-1347705787709/jetty2/
[junit4:junit4]   2> 5696 T779 oasc.JmxMonitoredMap.<init> JMX monitoring is enabled. Adding Solr mbeans to JMX Server: com.sun.jmx.mbeanserver.JmxMBeanServer@dd83d58
[junit4:junit4]   2> 5697 T779 oasc.SolrCore.getNewIndexDir WARNING New index directory detected: old=null new=./org.apache.solr.cloud.BasicDistributedZk2Test-1347705787709/jetty2/index/
[junit4:junit4]   2> 5698 T779 oasc.SolrCore.initIndex WARNING [collection1] Solr index directory './org.apache.solr.cloud.BasicDistributedZk2Test-1347705787709/jetty2/index' doesn't exist. Creating new index...
[junit4:junit4]   2> 5699 T779 oasc.CachingDirectoryFactory.get return new directory for /usr/home/hudson/hudson-slave/workspace/Lucene-Solr-Tests-trunk-java7/solr/build/solr-core/test/J1/./org.apache.solr.cloud.BasicDistributedZk2Test-1347705787709/jetty2/index forceNew:false
[junit4:junit4]   2> 5705 T779 oasc.SolrDeletionPolicy.onCommit SolrDeletionPolicy.onCommit: commits:num=1
[junit4:junit4]   2> 		commit{dir=/usr/home/hudson/hudson-slave/workspace/Lucene-Solr-Tests-trunk-java7/solr/build/solr-core/test/J1/org.apache.solr.cloud.BasicDistributedZk2Test-1347705787709/jetty2/index,segFN=segments_1,generation=1,filenames=[segments_1]
[junit4:junit4]   2> 5706 T779 oasc.SolrDeletionPolicy.updateCommits newest commit = 1
[junit4:junit4]   2> 5707 T779 oasc.SolrCore.initWriters created xml: solr.XMLResponseWriter
[junit4:junit4]   2> 5709 T779 oasup.UpdateRequestProcessorChain.init inserting DistributedUpdateProcessorFactory into updateRequestProcessorChain "dedupe"
[junit4:junit4]   2> 5710 T779 oasup.UpdateRequestProcessorChain.init inserting DistributedUpdateProcessorFactory into updateRequestProcessorChain "dedupe-allfields"
[junit4:junit4]   2> 5711 T779 oasup.UpdateRequestProcessorChain.init inserting DistributedUpdateProcessorFactory into updateRequestProcessorChain "stored_sig"
[junit4:junit4]   2> 5711 T779 oasup.UpdateRequestProcessorChain.init inserting DistributedUpdateProcessorFactory into updateRequestProcessorChain "uniq-fields"
[junit4:junit4]   2> 5712 T779 oasup.UpdateRequestProcessorChain.init inserting DistributedUpdateProcessorFactory into updateRequestProcessorChain "distrib-dup-test-chain-implicit"
[junit4:junit4]   2> 5713 T779 oasc.RequestHandlers.initHandlersFromConfig adding lazy requestHandler: solr.ReplicationHandler
[junit4:junit4]   2> 5714 T779 oasc.RequestHandlers.initHandlersFromConfig created /replication: solr.ReplicationHandler
[junit4:junit4]   2> 5714 T779 oasc.RequestHandlers.initHandlersFromConfig created standard: solr.StandardRequestHandler
[junit4:junit4]   2> 5715 T779 oasc.RequestHandlers.initHandlersFromConfig created /get: solr.RealTimeGetHandler
[junit4:junit4]   2> 5716 T779 oasc.RequestHandlers.initHandlersFromConfig created dismax: solr.SearchHandler
[junit4:junit4]   2> 5717 T779 oasc.RequestHandlers.initHandlersFromConfig created mock: org.apache.solr.core.MockQuerySenderListenerReqHandler
[junit4:junit4]   2> 5718 T779 oasc.RequestHandlers.initHandlersFromConfig created /admin/: org.apache.solr.handler.admin.AdminHandlers
[junit4:junit4]   2> 5719 T779 oasc.RequestHandlers.initHandlersFromConfig created defaults: solr.StandardRequestHandler
[junit4:junit4]   2> 5719 T779 oasc.RequestHandlers.initHandlersFromConfig adding lazy requestHandler: solr.StandardRequestHandler
[junit4:junit4]   2> 5720 T779 oasc.RequestHandlers.initHandlersFromConfig created lazy: solr.StandardRequestHandler
[junit4:junit4]   2> 5721 T779 oasc.RequestHandlers.initHandlersFromConfig created /update: solr.UpdateRequestHandler
[junit4:junit4]   2> 5721 T779 oasc.RequestHandlers.initHandlersFromConfig created /terms: org.apache.solr.handler.component.SearchHandler
[junit4:junit4]   2> 5722 T779 oasc.RequestHandlers.initHandlersFromConfig created spellCheckCompRH: org.apache.solr.handler.component.SearchHandler
[junit4:junit4]   2> 5723 T779 oasc.RequestHandlers.initHandlersFromConfig created spellCheckCompRH_Direct: org.apache.solr.handler.component.SearchHandler
[junit4:junit4]   2> 5724 T779 oasc.RequestHandlers.initHandlersFromConfig created spellCheckWithWordbreak: org.apache.solr.handler.component.SearchHandler
[junit4:junit4]   2> 5725 T779 oasc.RequestHandlers.initHandlersFromConfig created spellCheckWithWordbreak_Direct: org.apache.solr.handler.component.SearchHandler
[junit4:junit4]   2> 5726 T779 oasc.RequestHandlers.initHandlersFromConfig created spellCheckCompRH1: org.apache.solr.handler.component.SearchHandler
[junit4:junit4]   2> 5726 T779 oasc.RequestHandlers.initHandlersFromConfig created tvrh: org.apache.solr.handler.component.SearchHandler
[junit4:junit4]   2> 5727 T779 oasc.RequestHandlers.initHandlersFromConfig created /mlt: solr.MoreLikeThisHandler
[junit4:junit4]   2> 5728 T779 oasc.RequestHandlers.initHandlersFromConfig created /debug/dump: solr.DumpRequestHandler
[junit4:junit4]   2> 5732 T779 oashl.XMLLoader.init xsltCacheLifetimeSeconds=60
[junit4:junit4]   2> 5737 T779 oasc.SolrCore.initDeprecatedSupport WARNING solrconfig.xml uses deprecated <admin/gettableFiles>, Please update your config to use the ShowFileRequestHandler.
[junit4:junit4]   2> 5738 T779 oasc.SolrCore.initDeprecatedSupport WARNING adding ShowFileRequestHandler with hidden files: [SCHEMA.XML, OLD_SYNONYMS.TXT, STOPWORDS.TXT, PROTWORDS.TXT, OPEN-EXCHANGE-RATES.JSON, SYNONYMS.TXT, CURRENCY.XML, MAPPING-ISOLATIN1ACCENT.TXT]
[junit4:junit4]   2> 5742 T779 oass.SolrIndexSearcher.<init> Opening Searcher@1dd42575 main
[junit4:junit4]   2> 5744 T779 oasu.CommitTracker.<init> Hard AutoCommit: disabled
[junit4:junit4]   2> 5744 T779 oasu.CommitTracker.<init> Soft AutoCommit: disabled
[junit4:junit4]   2> 5745 T779 oashc.SpellCheckComponent.inform Initializing spell checkers
[junit4:junit4]   2> 5761 T779 oass.DirectSolrSpellChecker.init init: {name=direct,classname=DirectSolrSpellChecker,field=lowerfilt,minQueryLength=3}
[junit4:junit4]   2> 5842 T826 oasc.SolrCore.registerSearcher [collection1] Registered new searcher Searcher@1dd42575 main{StandardDirectoryReader(segments_1:1)}
[junit4:junit4]   2> 6179 T800 oascc.ZkStateReader.updateClusterState Updating cloud state from ZooKeeper... 
[junit4:junit4]   2> 6192 T825 oascc.ZkStateReader$2.process A cluster state change has occurred - updating...
[junit4:junit4]   2> 6192 T813 oascc.ZkStateReader$2.process A cluster state change has occurred - updating...
[junit4:junit4]   2> 6192 T799 oascc.ZkStateReader$2.process A cluster state change has occurred - updating...
[junit4:junit4]   2> 6351 T779 oasc.CoreContainer.register registering core: collection1
[junit4:junit4]   2> 6352 T779 oasc.ZkController.register Register shard - core:collection1 address:http://127.0.0.1:19467/solr shardId:shard2
[junit4:junit4]   2> 6353 T779 oascc.SolrZkClient.makePath makePath: /collections/collection1/leader_elect/shard2/election
[junit4:junit4]   2> 6416 T784 oazs.PrepRequestProcessor.pRequest Got user-level KeeperException when processing sessionid:0x139c98655430004 type:delete cxid:0x42 zxid:0xfffffffffffffffe txntype:unknown reqpath:n/a Error Path:/solr/collections/collection1/leaders/shard2 Error:KeeperErrorCode = NoNode for /solr/collections/collection1/leaders/shard2
[junit4:junit4]   2> 6417 T779 oasc.ShardLeaderElectionContext.runLeaderProcess Running the leader process.
[junit4:junit4]   2> 6418 T784 oazs.PrepRequestProcessor.pRequest Got user-level KeeperException when processing sessionid:0x139c98655430004 type:create cxid:0x43 zxid:0xfffffffffffffffe txntype:unknown reqpath:n/a Error Path:/solr/overseer Error:KeeperErrorCode = NodeExists for /solr/overseer
[junit4:junit4]   2> 6428 T779 oasc.ShardLeaderElectionContext.waitForReplicasToComeUp Enough replicas found to continue.
[junit4:junit4]   2> 6429 T779 oasc.ShardLeaderElectionContext.runLeaderProcess I may be the new leader - try and sync
[junit4:junit4]   2> 6429 T779 oasc.SyncStrategy.sync Sync replicas to http://127.0.0.1:19467/solr/collection1/
[junit4:junit4]   2> 6430 T779 oasc.SyncStrategy.syncReplicas Sync Success - now sync replicas to me
[junit4:junit4]   2> 6430 T779 oasc.SyncStrategy.syncToMe http://127.0.0.1:19467/solr/collection1/ has no replicas
[junit4:junit4]   2> 6431 T779 oasc.ShardLeaderElectionContext.runLeaderProcess I am the new leader: http://127.0.0.1:19467/solr/collection1/
[junit4:junit4]   2> 6431 T779 oascc.SolrZkClient.makePath makePath: /collections/collection1/leaders/shard2
[junit4:junit4]   2> 6435 T784 oazs.PrepRequestProcessor.pRequest Got user-level KeeperException when processing sessionid:0x139c98655430004 type:create cxid:0x4c zxid:0xfffffffffffffffe txntype:unknown reqpath:n/a Error Path:/solr/overseer Error:KeeperErrorCode = NodeExists for /solr/overseer
[junit4:junit4]   2> 6696 T800 oascc.ZkStateReader.updateClusterState Updating cloud state from ZooKeeper... 
[junit4:junit4]   2> 6759 T813 oascc.ZkStateReader$2.process A cluster state change has occurred - updating...
[junit4:junit4]   2> 6759 T825 oascc.ZkStateReader$2.process A cluster state change has occurred - updating...
[junit4:junit4]   2> 6759 T799 oascc.ZkStateReader$2.process A cluster state change has occurred - updating...
[junit4:junit4]   2> 6794 T779 oasc.ZkController.register We are http://127.0.0.1:19467/solr/collection1/ and leader is http://127.0.0.1:19467/solr/collection1/
[junit4:junit4]   2> 6794 T779 oasc.ZkController.register No LogReplay needed for core=collection1 baseURL=http://127.0.0.1:19467/solr
[junit4:junit4]   2> 6795 T779 oasc.ZkController.checkRecovery I am the leader, no recovery necessary
[junit4:junit4]   2> 6822 T779 oascc.ZkStateReader.updateClusterState Updating cloud state from ZooKeeper... 
[junit4:junit4]   2> 6823 T779 oass.SolrDispatchFilter.init user.dir=/usr/home/hudson/hudson-slave/workspace/Lucene-Solr-Tests-trunk-java7/solr/build/solr-core/test/J1
[junit4:junit4]   2> 6823 T779 oass.SolrDispatchFilter.init SolrDispatchFilter.init() done
[junit4:junit4]   2> 6824 T779 oascsi.HttpClientUtil.createClient Creating new http client, config:maxConnections=128&maxConnectionsPerHost=32&followRedirects=false
[junit4:junit4]   2> 6842 T779 oejs.Server.doStart jetty-8.1.2.v20120308
[junit4:junit4]   2> 6845 T779 oejs.AbstractConnector.doStart Started SocketConnector@0.0.0.0:19470
[junit4:junit4]   2> 6846 T779 oasc.SolrResourceLoader.locateSolrHome JNDI not configured for solr (NoInitialContextEx)
[junit4:junit4]   2> 6846 T779 oasc.SolrResourceLoader.locateSolrHome using system property solr.solr.home: /usr/home/hudson/hudson-slave/workspace/Lucene-Solr-Tests-trunk-java7/solr/build/solr-core/test-files/solr
[junit4:junit4]   2> 6847 T779 oasc.SolrResourceLoader.<init> new SolrResourceLoader for deduced Solr Home: '/usr/home/hudson/hudson-slave/workspace/Lucene-Solr-Tests-trunk-java7/solr/build/solr-core/test-files/solr/'
[junit4:junit4]   2> 6890 T779 oass.SolrDispatchFilter.init SolrDispatchFilter.init()
[junit4:junit4]   2> 6890 T779 oasc.SolrResourceLoader.locateSolrHome JNDI not configured for solr (NoInitialContextEx)
[junit4:junit4]   2> 6891 T779 oasc.SolrResourceLoader.locateSolrHome using system property solr.solr.home: /usr/home/hudson/hudson-slave/workspace/Lucene-Solr-Tests-trunk-java7/solr/build/solr-core/test-files/solr
[junit4:junit4]   2> 6891 T779 oasc.CoreContainer$Initializer.initialize looking for solr.xml: /usr/home/hudson/hudson-slave/workspace/Lucene-Solr-Tests-trunk-java7/solr/build/solr-core/test-files/solr/solr.xml
[junit4:junit4]   2> 6892 T779 oasc.CoreContainer.<init> New CoreContainer 815785988
[junit4:junit4]   2> 6893 T779 oasc.CoreContainer.load Loading CoreContainer using Solr Home: '/usr/home/hudson/hudson-slave/workspace/Lucene-Solr-Tests-trunk-java7/solr/build/solr-core/test-files/solr/'
[junit4:junit4]   2> 6893 T779 oasc.SolrResourceLoader.<init> new SolrResourceLoader for directory: '/usr/home/hudson/hudson-slave/workspace/Lucene-Solr-Tests-trunk-java7/solr/build/solr-core/test-files/solr/'
[junit4:junit4]   2> 6928 T779 oasc.CoreContainer.load Registering Log Listener
[junit4:junit4]   2> 6945 T779 oasc.CoreContainer.initZooKeeper Zookeeper client=127.0.0.1:19442/solr
[junit4:junit4]   2> 6946 T779 oaz.ZooKeeper.<init> Initiating client connection, connectString=127.0.0.1:19442/solr sessionTimeout=5000 watcher=org.apache.solr.common.cloud.ConnectionManager@4827dda7
[junit4:junit4]   2> 6947 T836 oaz.ClientCnxn$SendThread.startConnect Opening socket connection to server /127.0.0.1:19442
[junit4:junit4]   2> 6947 T779 oascc.ConnectionManager.waitForConnected Waiting for client to connect to ZooKeeper
[junit4:junit4]   2> 6948 T836 oaz.ClientCnxn$SendThread.primeConnection Socket connection established to localhost/127.0.0.1:19442, initiating session
[junit4:junit4]   2> 6948 T781 oazs.NIOServerCnxn$Factory.run Accepted socket connection from /140.211.11.196:19471
[junit4:junit4]   2> 6949 T781 oazs.NIOServerCnxn.readConnectRequest Client attempting to establish new session at /140.211.11.196:19471
[junit4:junit4]   2> 6950 T783 oazs.NIOServerCnxn.finishSessionInit Established session 0x139c98655430005 with negotiated timeout 5000 for client /140.211.11.196:19471
[junit4:junit4]   2> 6950 T836 oaz.ClientCnxn$SendThread.readConnectResult Session establishment complete on server localhost/127.0.0.1:19442, sessionid = 0x139c98655430005, negotiated timeout = 5000
[junit4:junit4]   2> 6951 T837 oascc.ConnectionManager.process Watcher org.apache.solr.common.cloud.ConnectionManager@4827dda7 name:ZooKeeperConnection Watcher:127.0.0.1:19442/solr got event WatchedEvent state:SyncConnected type:None path:null path:null type:None
[junit4:junit4]   2> 6951 T779 oascc.ConnectionManager.waitForConnected Client is connected to ZooKeeper
[junit4:junit4]   2> 6952 T784 oazs.PrepRequestProcessor.pRequest Got user-level KeeperException when processing sessionid:0x139c98655430005 type:create cxid:0x1 zxid:0xfffffffffffffffe txntype:unknown reqpath:n/a Error Path:/solr/overseer Error:KeeperErrorCode = NodeExists for /solr/overseer
[junit4:junit4]   2> 6961 T784 oazs.PrepRequestProcessor.pRequest Got user-level KeeperException when processing sessionid:0x139c98655430005 type:create cxid:0x2 zxid:0xfffffffffffffffe txntype:unknown reqpath:n/a Error Path:/solr/overseer Error:KeeperErrorCode = NodeExists for /solr/overseer
[junit4:junit4]   2> 6969 T779 oasc.ZkController.createEphemeralLiveNode Register node as live in ZooKeeper:/live_nodes/127.0.0.1:19470_solr
[junit4:junit4]   2> 6970 T784 oazs.PrepRequestProcessor.pRequest Got user-level KeeperException when processing sessionid:0x139c98655430005 type:delete cxid:0x4 zxid:0xfffffffffffffffe txntype:unknown reqpath:n/a Error Path:/solr/live_nodes/127.0.0.1:19470_solr Error:KeeperErrorCode = NoNode for /solr/live_nodes/127.0.0.1:19470_solr
[junit4:junit4]   2> 6971 T779 oascc.SolrZkClient.makePath makePath: /live_nodes/127.0.0.1:19470_solr
[junit4:junit4]   2> 6983 T825 oascc.ZkStateReader$3.process Updating live nodes
[junit4:junit4]   2> 6983 T813 oascc.ZkStateReader$3.process Updating live nodes
[junit4:junit4]   2> 6983 T799 oascc.ZkStateReader$3.process Updating live nodes
[junit4:junit4]   2> 6984 T779 oashc.HttpShardHandlerFactory.getParameter Setting socketTimeout to: 0
[junit4:junit4]   2> 6984 T779 oashc.HttpShardHandlerFactory.getParameter Setting urlScheme to: http://
[junit4:junit4]   2> 6985 T779 oashc.HttpShardHandlerFactory.getParameter Setting connTimeout to: 0
[junit4:junit4]   2> 6985 T779 oashc.HttpShardHandlerFactory.getParameter Setting maxConnectionsPerHost to: 20
[junit4:junit4]   2> 6986 T779 oashc.HttpShardHandlerFactory.getParameter Setting corePoolSize to: 0
[junit4:junit4]   2> 6986 T779 oashc.HttpShardHandlerFactory.getParameter Setting maximumPoolSize to: 2147483647
[junit4:junit4]   2> 6987 T779 oashc.HttpShardHandlerFactory.getParameter Setting maxThreadIdleTime to: 5
[junit4:junit4]   2> 6987 T779 oashc.HttpShardHandlerFactory.getParameter Setting sizeOfQueue to: -1
[junit4:junit4]   2> 6988 T779 oashc.HttpShardHandlerFactory.getParameter Setting fairnessPolicy to: false
[junit4:junit4]   2> 6988 T779 oascsi.HttpClientUtil.createClient Creating new http client, config:maxConnectionsPerHost=20&maxConnections=10000&socketTimeout=0&connTimeout=0&retry=false
[junit4:junit4]   2> 7003 T779 oascc.ZkStateReader.createClusterStateWatchersAndUpdate Updating cluster state from ZooKeeper... 
[junit4:junit4]   2> 7009 T779 oasc.CoreContainer.create Creating SolrCore 'collection1' using instanceDir: /usr/home/hudson/hudson-slave/workspace/Lucene-Solr-Tests-trunk-java7/solr/build/solr-core/test-files/solr/collection1
[junit4:junit4]   2> 7009 T779 oasc.ZkController.createCollectionZkNode Check for collection zkNode:collection1
[junit4:junit4]   2> 7010 T779 oasc.ZkController.createCollectionZkNode Collection zkNode exists
[junit4:junit4]   2> 7011 T779 oasc.ZkController.readConfigName Load collection config from:/collections/collection1
[junit4:junit4]   2> 7012 T779 oasc.SolrResourceLoader.<init> new SolrResourceLoader for directory: '/usr/home/hudson/hudson-slave/workspace/Lucene-Solr-Tests-trunk-java7/solr/build/solr-core/test-files/solr/collection1/'
[junit4:junit4]   2> 7013 T779 oasc.SolrResourceLoader.replaceClassLoader Adding 'file:/usr/home/hudson/hudson-slave/workspace/Lucene-Solr-Tests-trunk-java7/solr/build/solr-core/test-files/solr/collection1/lib/classes/' to classloader
[junit4:junit4]   2> 7014 T779 oasc.SolrResourceLoader.replaceClassLoader Adding 'file:/usr/home/hudson/hudson-slave/workspace/Lucene-Solr-Tests-trunk-java7/solr/build/solr-core/test-files/solr/collection1/lib/README' to classloader
[junit4:junit4]   2> 7064 T779 oasc.SolrConfig.<init> Using Lucene MatchVersion: LUCENE_50
[junit4:junit4]   2> 7134 T779 oasc.SolrConfig.<init> Loaded SolrConfig: solrconfig.xml
[junit4:junit4]   2> 7235 T779 oass.IndexSchema.readSchema Reading Solr Schema
[junit4:junit4]   2> 7241 T779 oass.IndexSchema.readSchema Schema name=test
[junit4:junit4]   2> 7291 T800 oascc.ZkStateReader.updateClusterState Updating cloud state from ZooKeeper... 
[junit4:junit4]   2> 7310 T813 oascc.ZkStateReader$2.process A cluster state change has occurred - updating...
[junit4:junit4]   2> 7310 T799 oascc.ZkStateReader$2.process A cluster state change has occurred - updating...
[junit4:junit4]   2> 7310 T825 oascc.ZkStateReader$2.process A cluster state change has occurred - updating...
[junit4:junit4]   2> 7310 T837 oascc.ZkStateReader$2.process A cluster state change has occurred - updating...
[junit4:junit4]   2> 7883 T779 oass.OpenExchangeRatesOrgProvider.init Initialized with rates=open-exchange-rates.json, refreshInterval=1440.
[junit4:junit4]   2> 7892 T779 oass.IndexSchema.readSchema default search field in schema is text
[junit4:junit4]   2> 7895 T779 oass.IndexSchema.readSchema unique key field: id
[junit4:junit4]   2> 7906 T779 oass.FileExchangeRateProvider.reload Reloading exchange rates from file currency.xml
[junit4:junit4]   2> 7910 T779 oass.FileExchangeRateProvider.reload Reloading exchange rates from file currency.xml
[junit4:junit4]   2> 7914 T779 oass.OpenExchangeRatesOrgProvider.reload Reloading exchange rates from open-exchange-rates.json
[junit4:junit4]   2> 7915 T779 oass.OpenExchangeRatesOrgProvider.reload Reloading exchange rates from open-exchange-rates.json
[junit4:junit4]   2> 7916 T779 oasc.SolrCore.<init> [collection1] Opening new SolrCore at /usr/home/hudson/hudson-slave/workspace/Lucene-Solr-Tests-trunk-java7/solr/build/solr-core/test-files/solr/collection1/, dataDir=./org.apache.solr.cloud.BasicDistributedZk2Test-1347705787709/jetty3/
[junit4:junit4]   2> 7917 T779 oasc.JmxMonitoredMap.<init> JMX monitoring is enabled. Adding Solr mbeans to JMX Server: com.sun.jmx.mbeanserver.JmxMBeanServer@dd83d58
[junit4:junit4]   2> 7918 T779 oasc.SolrCore.getNewIndexDir WARNING New index directory detected: old=null new=./org.apache.solr.cloud.BasicDistributedZk2Test-1347705787709/jetty3/index/
[junit4:junit4]   2> 7919 T779 oasc.SolrCore.initIndex WARNING [collection1] Solr index directory './org.apache.solr.cloud.BasicDistributedZk2Test-1347705787709/jetty3/index' doesn't exist. Creating new index...
[junit4:junit4]   2> 7919 T779 oasc.CachingDirectoryFactory.get return new directory for /usr/home/hudson/hudson-slave/workspace/Lucene-Solr-Tests-trunk-java7/solr/build/solr-core/test/J1/./org.apache.solr.cloud.BasicDistributedZk2Test-1347705787709/jetty3/index forceNew:false
[junit4:junit4]   2> 7944 T779 oasc.SolrDeletionPolicy.onCommit SolrDeletionPolicy.onCommit: commits:num=1
[junit4:junit4]   2> 		commit{dir=/usr/home/hudson/hudson-slave/workspace/Lucene-Solr-Tests-trunk-java7/solr/build/solr-core/test/J1/org.apache.solr.cloud.BasicDistributedZk2Test-1347705787709/jetty3/index,segFN=segments_1,generation=1,filenames=[segments_1]
[junit4:junit4]   2> 7944 T779 oasc.SolrDeletionPolicy.updateCommits newest commit = 1
[junit4:junit4]   2> 7945 T779 oasc.SolrCore.initWriters created xml: solr.XMLResponseWriter
[junit4:junit4]   2> 7947 T779 oasup.UpdateRequestProcessorChain.init inserting DistributedUpdateProcessorFactory into updateRequestProcessorChain "dedupe"
[junit4:junit4]   2> 7947 T779 oasup.UpdateRequestProcessorChain.init inserting DistributedUpdateProcessorFactory into updateRequestProcessorChain "dedupe-allfields"
[junit4:junit4]   2> 7947 T779 oasup.UpdateRequestProcessorChain.init inserting DistributedUpdateProcessorFactory into updateRequestProcessorChain "stored_sig"
[junit4:junit4]   2> 7948 T779 oasup.UpdateRequestProcessorChain.init inserting DistributedUpdateProcessorFactory into updateRequestProcessorChain "uniq-fields"
[junit4:junit4]   2> 7949 T779 oasup.UpdateRequestProcessorChain.init inserting DistributedUpdateProcessorFactory into updateRequestProcessorChain "distrib-dup-test-chain-implicit"
[junit4:junit4]   2> 7949 T779 oasc.RequestHandlers.initHandlersFromConfig adding lazy requestHandler: solr.ReplicationHandler
[junit4:junit4]   2> 7949 T779 oasc.RequestHandlers.initHandlersFromConfig created /replication: solr.ReplicationHandler
[junit4:junit4]   2> 7950 T779 oasc.RequestHandlers.initHandlersFromConfig created standard: solr.StandardRequestHandler
[junit4:junit4]   2> 7951 T779 oasc.RequestHandlers.initHandlersFromConfig created /get: solr.RealTimeGetHandler
[junit4:junit4]   2> 7951 T779 oasc.RequestHandlers.initHandlersFromConfig created dismax: solr.SearchHandler
[junit4:junit4]   2> 7952 T779 oasc.RequestHandlers.initHandlersFromConfig created mock: org.apache.solr.core.MockQuerySenderListenerReqHandler
[junit4:junit4]   2> 7952 T779 oasc.RequestHandlers.initHandlersFromConfig created /admin/: org.apache.solr.handler.admin.AdminHandlers
[junit4:junit4]   2> 7953 T779 oasc.RequestHandlers.initHandlersFromConfig created defaults: solr.StandardRequestHandler
[junit4:junit4]   2> 7953 T779 oasc.RequestHandlers.initHandlersFromConfig adding lazy requestHandler: solr.StandardRequestHandler
[junit4:junit4]   2> 7954 T779 oasc.RequestHandlers.initHandlersFromConfig created lazy: solr.StandardRequestHandler
[junit4:junit4]   2> 7954 T779 oasc.RequestHandlers.initHandlersFromConfig created /update: solr.UpdateRequestHandler
[junit4:junit4]   2> 7955 T779 oasc.RequestHandlers.initHandlersFromConfig created /terms: org.apache.solr.handler.component.SearchHandler
[junit4:junit4]   2> 7955 T779 oasc.RequestHandlers.initHandlersFromConfig created spellCheckCompRH: org.apache.solr.handler.component.SearchHandler
[junit4:junit4]   2> 7956 T779 oasc.RequestHandlers.initHandlersFromConfig created spellCheckCompRH_Direct: org.apache.solr.handler.component.SearchHandler
[junit4:junit4]   2> 7956 T779 oasc.RequestHandlers.initHandlersFromConfig created spellCheckWithWordbreak: org.apache.solr.handler.component.SearchHandler
[junit4:junit4]   2> 7957 T779 oasc.RequestHandlers.initHandlersFromConfig created spellCheckWithWordbreak_Direct: org.apache.solr.handler.component.SearchHandler
[junit4:junit4]   2> 7958 T779 oasc.RequestHandlers.initHandlersFromConfig created spellCheckCompRH1: org.apache.solr.handler.component.SearchHandler
[junit4:junit4]   2> 7958 T779 oasc.RequestHandlers.initHandlersFromConfig created tvrh: org.apache.solr.handler.component.SearchHandler
[junit4:junit4]   2> 7959 T779 oasc.RequestHandlers.initHandlersFromConfig created /mlt: solr.MoreLikeThisHandler
[junit4:junit4]   2> 7959 T779 oasc.RequestHandlers.initHandlersFromConfig created /debug/dump: solr.DumpRequestHandler
[junit4:junit4]   2> 7963 T779 oashl.XMLLoader.init xsltCacheLifetimeSeconds=60
[junit4:junit4]   2> 7967 T779 oasc.SolrCore.initDeprecatedSupport WARNING solrconfig.xml uses deprecated <admin/gettableFiles>, Please update your config to use the ShowFileRequestHandler.
[junit4:junit4]   2> 7968 T779 oasc.SolrCore.initDeprecatedSupport WARNING adding ShowFileRequestHandler with hidden files: [SCHEMA.XML, OLD_SYNONYMS.TXT, STOPWORDS.TXT, PROTWORDS.TXT, OPEN-EXCHANGE-RATES.JSON, SYNONYMS.TXT, CURRENCY.XML, MAPPING-ISOLATIN1ACCENT.TXT]
[junit4:junit4]   2> 7971 T779 oass.SolrIndexSearcher.<init> Opening Searcher@7a4ff3d8 main
[junit4:junit4]   2> 7972 T779 oasu.CommitTracker.<init> Hard AutoCommit: disabled
[junit4:junit4]   2> 7972 T779 oasu.CommitTracker.<init> Soft AutoCommit: disabled
[junit4:junit4]   2> 7973 T779 oashc.SpellCheckComponent.inform Initializing spell checkers
[junit4:junit4]   2> 7979 T779 oass.DirectSolrSpellChecker.init init: {name=direct,classname=DirectSolrSpellChecker,field=lowerfilt,minQueryLength=3}
[junit4:junit4]   2> 8025 T838 oasc.SolrCore.registerSearcher [collection1] Registered new searcher Searcher@7a4ff3d8 main{StandardDirectoryReader(segments_1:1)}
[junit4:junit4]   2> 8316 T800 oascc.ZkStateReader.updateClusterState Updating cloud state from ZooKeeper... 
[junit4:junit4]   2> 8321 T837 oascc.ZkStateReader$2.process A cluster state change has occurred - updating...
[junit4:junit4]   2> 8321 T799 oascc.ZkStateReader$2.process A cluster state change has occurred - updating...
[junit4:junit4]   2> 8321 T813 oascc.ZkStateReader$2.process A cluster state change has occurred - updating...
[junit4:junit4]   2> 8321 T825 oascc.ZkStateReader$2.process A cluster state change has occurred - updating...
[junit4:junit4]   2> 8532 T779 oasc.CoreContainer.register registering core: collection1
[junit4:junit4]   2> 8532 T779 oasc.ZkController.register Register shard - core:collection1 address:http://127.0.0.1:19470/solr shardId:shard1
[junit4:junit4]   2> 8536 T779 oasc.ZkController.register We are http://127.0.0.1:19470/solr/collection1/ and leader is http://127.0.0.1:19462/solr/collection1/
[junit4:junit4]   2> 8536 T779 oasc.ZkController.register No LogReplay needed for core=collection1 baseURL=http://127.0.0.1:19470/solr
[junit4:junit4]   2> 8537 T779 oasc.ZkController.checkRecovery Core needs to recover:collection1
[junit4:junit4]   2> 8537 T779 oasu.DefaultSolrCoreState.doRecovery Running recovery - first canceling any ongoing recovery
[junit4:junit4]   2> ASYNC  NEW_CORE C83 name=collection1 org.apache.solr.core.SolrCore@47db07d0 url=http://127.0.0.1:19470/solr/collection1 node=127.0.0.1:19470_solr
[junit4:junit4]   2> 8544 T839 C83 P19470 oasc.RecoveryStrategy.run Starting recovery process.  core=collection1 recoveringAfterStartup=true
[junit4:junit4]   2> 8544 T779 oascc.ZkStateReader.updateClusterState Updating cloud state from ZooKeeper... 
[junit4:junit4]   2> 8545 T839 C83 P19470 oasc.RecoveryStrategy.doRecovery ###### startupVersions=[]
[junit4:junit4]   2> 8546 T779 oass.SolrDispatchFilter.init user.dir=/usr/home/hudson/hudson-slave/workspace/Lucene-Solr-Tests-trunk-java7/solr/build/solr-core/test/J1
[junit4:junit4]   2> 8546 T779 oass.SolrDispatchFilter.init SolrDispatchFilter.init() done
[junit4:junit4]   2> 8546 T839 C83 P19470 oasc.RecoveryStrategy.doRecovery Attempting to PeerSync from http://127.0.0.1:19462/solr/collection1/ core=collection1 - recoveringAfterStartup=true
[junit4:junit4]   2> 8547 T779 oascsi.HttpClientUtil.createClient Creating new http client, config:maxConnections=128&maxConnectionsPerHost=32&followRedirects=false
[junit4:junit4]   2> 8553 T839 C83 P19470 oascsi.HttpClientUtil.createClient Creating new http client, config:maxConnectionsPerHost=20&maxConnections=10000&connTimeout=30000&socketTimeout=30000&retry=false
[junit4:junit4]   2> 8569 T779 oejs.Server.doStart jetty-8.1.2.v20120308
[junit4:junit4]   2> 8572 T779 oejs.AbstractConnector.doStart Started SocketConnector@0.0.0.0:19475
[junit4:junit4]   2> 8573 T779 oasc.SolrResourceLoader.locateSolrHome JNDI not configured for solr (NoInitialContextEx)
[junit4:junit4]   2> 8573 T779 oasc.SolrResourceLoader.locateSolrHome using system property solr.solr.home: /usr/home/hudson/hudson-slave/workspace/Lucene-Solr-Tests-trunk-java7/solr/build/solr-core/test-files/solr
[junit4:junit4]   2> 8574 T839 C83 P19470 oasu.PeerSync.sync PeerSync: core=collection1 url=http://127.0.0.1:19470/solr START replicas=[http://127.0.0.1:19462/solr/collection1/] nUpdates=100
[junit4:junit4]   2> 8574 T779 oasc.SolrResourceLoader.<init> new SolrResourceLoader for deduced Solr Home: '/usr/home/hudson/hudson-slave/workspace/Lucene-Solr-Tests-trunk-java7/solr/build/solr-core/test-files/solr/'
[junit4:junit4]   2> 8574 T839 C83 P19470 oasu.PeerSync.sync WARNING no frame of reference to tell of we've missed updates
[junit4:junit4]   2> 8575 T839 C83 P19470 oasc.RecoveryStrategy.doRecovery PeerSync Recovery was not successful - trying replication. core=collection1
[junit4:junit4]   2> 8576 T839 C83 P19470 oasc.RecoveryStrategy.doRecovery Starting Replication Recovery. core=collection1
[junit4:junit4]   2> 8576 T839 C83 P19470 oascsi.HttpClientUtil.createClient Creating new http client, config:maxConnections=128&maxConnectionsPerHost=32&followRedirects=false
[junit4:junit4]   2> ASYNC  NEW_CORE C84 name=collection1 org.apache.solr.core.SolrCore@43312863 url=http://127.0.0.1:19462/solr/collection1 node=127.0.0.1:19462_solr
[junit4:junit4]   2> 8585 T805 C84 P19462 REQ /get {distrib=false&qt=/get&wt=javabin&version=2&getVersions=100} status=0 QTime=0 
[junit4:junit4]   2> 8615 T779 oass.SolrDispatchFilter.init SolrDispatchFilter.init()
[junit4:junit4]   2> 8615 T779 oasc.SolrResourceLoader.locateSolrHome JNDI not configured for solr (NoInitialContextEx)
[junit4:junit4]   2> 8616 T779 oasc.SolrResourceLoader.locateSolrHome using system property solr.solr.home: /usr/home/hudson/hudson-slave/workspace/Lucene-Solr-Tests-trunk-java7/solr/build/solr-core/test-files/solr
[junit4:junit4]   2> 8616 T779 oasc.CoreContainer$Initializer.initialize looking for solr.xml: /usr/home/hudson/hudson-slave/workspace/Lucene-Solr-Tests-trunk-java7/solr/build/solr-core/test-files/solr/solr.xml
[junit4:junit4]   2> 8617 T779 oasc.CoreContainer.<init> New CoreContainer 1212215282
[junit4:junit4]   2> 8618 T779 oasc.CoreContainer.load Loading CoreContainer using Solr Home: '/usr/home/hudson/hudson-slave/workspace/Lucene-Solr-Tests-trunk-java7/solr/build/solr-core/test-files/solr/'
[junit4:junit4]   2> 8618 T779 oasc.SolrResourceLoader.<init> new SolrResourceLoader for directory: '/usr/home/hudson/hudson-slave/workspace/Lucene-Solr-Tests-trunk-java7/solr/build/solr-core/test-files/solr/'
[junit4:junit4]   2> 8648 T779 oasc.CoreContainer.load Registering Log Listener
[junit4:junit4]   2> 8675 T779 oasc.CoreContainer.initZooKeeper Zookeeper client=127.0.0.1:19442/solr
[junit4:junit4]   2> 8676 T779 oaz.ZooKeeper.<init> Initiating client connection, connectString=127.0.0.1:19442/solr sessionTimeout=5000 watcher=org.apache.solr.common.cloud.ConnectionManager@1e3d7730
[junit4:junit4]   2> 8677 T850 oaz.ClientCnxn$SendThread.startConnect Opening socket connection to server /127.0.0.1:19442
[junit4:junit4]   2> 8677 T779 oascc.ConnectionManager.waitForConnected Waiting for client to connect to ZooKeeper
[junit4:junit4]   2> 8678 T850 oaz.ClientCnxn$SendThread.primeConnection Socket connection established to localhost/127.0.0.1:19442, initiating session
[junit4:junit4]   2> 8679 T781 oazs.NIOServerCnxn$Factory.run Accepted socket connection from /140.211.11.196:19479
[junit4:junit4]   2> 8679 T781 oazs.NIOServerCnxn.readConnectRequest Client attempting to establish new session at /140.211.11.196:19479
[junit4:junit4]   2> 8681 T783 oazs.NIOServerCnxn.finishSessionInit Established session 0x139c98655430006 with negotiated timeout 5000 for client /140.211.11.196:19479
[junit4:junit4]   2> 8681 T850 oaz.ClientCnxn$SendThread.readConnectResult Session establishment complete on server localhost/127.0.0.1:19442, sessionid = 0x139c98655430006, negotiated timeout = 5000
[junit4:junit4]   2> 8681 T851 oascc.ConnectionManager.process Watcher org.apache.solr.common.cloud.ConnectionManager@1e3d7730 name:ZooKeeperConnection Watcher:127.0.0.1:19442/solr got event WatchedEvent state:SyncConnected type:None path:null path:null type:None
[junit4:junit4]   2> 8682 T779 oascc.ConnectionManager.waitForConnected Client is connected to ZooKeeper
[junit4:junit4]   2> 8682 T784 oazs.PrepRequestProcessor.pRequest Got user-level KeeperException when processing sessionid:0x139c98655430006 type:create cxid:0x1 zxid:0xfffffffffffffffe txntype:unknown reqpath:n/a Error Path:/solr/overseer Error:KeeperErrorCode = NodeExists for /solr/overseer
[junit4:junit4]   2> 8683 T784 oazs.PrepRequestProcessor.pRequest Got user-level KeeperException when processing sessionid:0x139c98655430006 type:create cxid:0x2 zxid:0xfffffffffffffffe txntype:unknown reqpath:n/a Error Path:/solr/overseer Error:KeeperErrorCode = NodeExists for /solr/overseer
[junit4:junit4]   2> 8694 T779 oasc.ZkController.createEphemeralLiveNode Register node as live in ZooKeeper:/live_nodes/127.0.0.1:19475_solr
[junit4:junit4]   2> 8695 T784 oazs.PrepRequestProcessor.pRequest Got user-level KeeperException when processing sessionid:0x139c98655430006 type:delete cxid:0x4 zxid:0xfffffffffffffffe txntype:unknown reqpath:n/a Error Path:/solr/live_nodes/127.0.0.1:19475_solr Error:KeeperErrorCode = NoNode for /solr/live_nodes/127.0.0.1:19475_solr
[junit4:junit4]   2> 8696 T779 oascc.SolrZkClient.makePath makePath: /live_nodes/127.0.0.1:19475_solr
[junit4:junit4]   2> 8698 T825 oascc.ZkStateReader$3.process Updating live nodes
[junit4:junit4]   2> 8698 T813 oascc.ZkStateReader$3.process Updating live nodes
[junit4:junit4]   2> 8698 T837 oascc.ZkStateReader$3.process Updating live nodes
[junit4:junit4]   2> 8698 T799 oascc.ZkStateReader$3.process Updating live nodes
[junit4:junit4]   2> 8699 T779 oashc.HttpShardHandlerFactory.getParameter Setting socketTimeout to: 0
[junit4:junit4]   2> 8699 T779 oashc.HttpShardHandlerFactory.getParameter Setting urlScheme to: http://
[junit4:junit4]   2> 8700 T779 oashc.HttpShardHandlerFactory.getParameter Setting connTimeout to: 0
[junit4:junit4]   2> 8700 T779 oashc.HttpShardHandlerFactory.getParameter Setting maxConnectionsPerHost to: 20
[junit4:junit4]   2> 8701 T779 oashc.HttpShardHandlerFactory.getParameter Setting corePoolSize to: 0
[junit4:junit4]   2> 8701 T779 oashc.HttpShardHandlerFactory.getParameter Setting maximumPoolSize to: 2147483647
[junit4:junit4]   2> 8702 T779 oashc.HttpShardHandlerFactory.getParameter Setting maxThreadIdleTime to: 5
[junit4:junit4]   2> 8702 T779 oashc.HttpShardHandlerFactory.getParameter Setting sizeOfQueue to: -1
[junit4:junit4]   2> 8703 T779 oashc.HttpShardHandlerFactory.getParameter Setting fairnessPolicy to: false
[junit4:junit4]   2> 8703 T779 oascsi.HttpClientUtil.createClient Creating new http client, config:maxConnectionsPerHost=20&maxConnections=10000&socketTimeout=0&connTimeout=0&retry=false
[junit4:junit4]   2> 8719 T779 oascc.ZkStateReader.createClusterStateWatchersAndUpdate Updating cluster state from ZooKeeper... 
[junit4:junit4]   2> 8725 T779 oasc.CoreContainer.create Creating SolrCore 'collection1' using instanceDir: /usr/home/hudson/hudson-slave/workspace/Lucene-Solr-Tests-trunk-java7/solr/build/solr-core/test-files/solr/collection1
[junit4:junit4]   2> 8725 T779 oasc.ZkController.createCollectionZkNode Check for collection zkNode:collection1
[junit4:junit4]   2> 8726 T779 oasc.ZkController.createCollectionZkNode Collection zkNode exists
[junit4:junit4]   2> 8727 T779 oasc.ZkController.readConfigName Load collection config from:/collections/collection1
[junit4:junit4]   2> 8728 T779 oasc.SolrResourceLoader.<init> new SolrResourceLoader for directory: '/usr/home/hudson/hudson-slave/workspace/Lucene-Solr-Tests-trunk-java7/solr/build/solr-core/test-files/solr/collection1/'
[junit4:junit4]   2> 8729 T779 oasc.SolrResourceLoader.replaceClassLoader Adding 'file:/usr/home/hudson/hudson-slave/workspace/Lucene-Solr-Tests-trunk-java7/solr/build/solr-core/test-files/solr/collection1/lib/classes/' to classloader
[junit4:junit4]   2> 8730 T779 oasc.SolrResourceLoader.replaceClassLoader Adding 'file:/usr/home/hudson/hudson-slave/workspace/Lucene-Solr-Tests-trunk-java7/solr/build/solr-core/test-files/solr/collection1/lib/README' to classloader
[junit4:junit4]   2> 8778 T779 oasc.SolrConfig.<init> Using Lucene MatchVersion: LUCENE_50
[junit4:junit4]   2> 8836 T800 oascc.ZkStateReader.updateClusterState Updating cloud state from ZooKeeper... 
[junit4:junit4]   2> 8846 T779 oasc.SolrConfig.<init> Loaded SolrConfig: solrconfig.xml
[junit4:junit4]   2> 8848 T825 oascc.ZkStateReader$2.process A cluster state change has occurred - updating...
[junit4:junit4]   2> 8848 T851 oascc.ZkStateReader$2.process A cluster state change has occurred - updating...
[junit4:junit4]   2> 8848 T799 oascc.ZkStateReader$2.process A cluster state change has occurred - updating...
[junit4:junit4]   2> 8849 T779 oass.IndexSchema.readSchema Reading Solr Schema
[junit4:junit4]   2> 8848 T837 oascc.ZkStateReader$2.process A cluster state change has occurred - updating...
[junit4:junit4]   2> 8848 T813 oascc.ZkStateReader$2.process A cluster state change has occurred - updating...
[junit4:junit4]   2> 8855 T779 oass.IndexSchema.readSchema Schema name=test
[junit4:junit4]   2> 9416 T779 oass.OpenExchangeRatesOrgProvider.init Initialized with rates=open-exchange-rates.json, refreshInterval=1440.
[junit4:junit4]   2> 9425 T779 oass.IndexSchema.readSchema default search field in schema is text
[junit4:junit4]   2> 9428 T779 oass.IndexSchema.readSchema unique key field: id
[junit4:junit4]   2> 9438 T779 oass.FileExchangeRateProvider.reload Reloading exchange rates from file currency.xml
[junit4:junit4]   2> 9442 T779 oass.FileExchangeRateProvider.reload Reloading exchange rates from file currency.xml
[junit4:junit4]   2> 9445 T779 oass.OpenExchangeRatesOrgProvider.reload Reloading exchange rates from open-exchange-rates.json
[junit4:junit4]   2> 9446 T779 oass.OpenExchangeRatesOrgProvider.reload Reloading exchange rates from open-exchange-rates.json
[junit4:junit4]   2> 9447 T779 oasc.SolrCore.<init> [collection1] Opening new SolrCore at /usr/home/hudson/hudson-slave/workspace/Lucene-Solr-Tests-trunk-java7/solr/build/solr-core/test-files/solr/collection1/, dataDir=./org.apache.solr.cloud.BasicDistributedZk2Test-1347705787709/jetty4/
[junit4:junit4]   2> 9447 T779 oasc.JmxMonitoredMap.<init> JMX monitoring is enabled. Adding Solr mbeans to JMX Server: com.sun.jmx.mbeanserver.JmxMBeanServer@dd83d58
[junit4:junit4]   2> 9449 T779 oasc.SolrCore.getNewIndexDir WARNING New index directory detected: old=null new=./org.apache.solr.cloud.BasicDistributedZk2Test-1347705787709/jetty4/index/
[junit4:junit4]   2> 9449 T779 oasc.SolrCore.initIndex WARNING [collection1] Solr index directory './org.apache.solr.cloud.BasicDistributedZk2Test-1347705787709/jetty4/index' doesn't exist. Creating new index...
[junit4:junit4]   2> 9450 T779 oasc.CachingDirectoryFactory.get return new directory for /usr/home/hudson/hudson-slave/workspace/Lucene-Solr-Tests-trunk-java7/solr/build/solr-core/test/J1/./org.apache.solr.cloud.BasicDistributedZk2Test-1347705787709/jetty4/index forceNew:false
[junit4:junit4]   2> 9455 T779 oasc.SolrDeletionPolicy.onCommit SolrDeletionPolicy.onCommit: commits:num=1
[junit4:junit4]   2> 		commit{dir=/usr/home/hudson/hudson-slave/workspace/Lucene-Solr-Tests-trunk-java7/solr/build/solr-core/test/J1/org.apache.solr.cloud.BasicDistributedZk2Test-1347705787709/jetty4/index,segFN=segments_1,generation=1,filenames=[segments_1]
[junit4:junit4]   2> 9455 T779 oasc.SolrDeletionPolicy.updateCommits newest commit = 1
[junit4:junit4]   2> 9456 T779 oasc.SolrCore.initWriters created xml: solr.XMLResponseWriter
[junit4:junit4]   2> 9458 T779 oasup.UpdateRequestProcessorChain.init inserting DistributedUpdateProcessorFactory into updateRequestProcessorChain "dedupe"
[junit4:junit4]   2> 9458 T779 oasup.UpdateRequestProcessorChain.init inserting DistributedUpdateProcessorFactory into updateRequestProcessorChain "dedupe-allfields"
[junit4:junit4]   2> 9459 T779 oasup.UpdateRequestProcessorChain.init inserting DistributedUpdateProcessorFactory into updateRequestProcessorChain "stored_sig"
[junit4:junit4]   2> 9459 T779 oasup.UpdateRequestProcessorChain.init inserting DistributedUpdateProcessorFactory into updateRequestProcessorChain "uniq-fields"
[junit4:junit4]   2> 9460 T779 oasup.UpdateRequestProcessorChain.init inserting DistributedUpdateProcessorFactory into updateRequestProcessorChain "distrib-dup-test-chain-implicit"
[junit4:junit4]   2> 9460 T779 oasc.RequestHandlers.initHandlersFromConfig adding lazy requestHandler: solr.ReplicationHandler
[junit4:junit4]   2> 9460 T779 oasc.RequestHandlers.initHandlersFromConfig created /replication: solr.ReplicationHandler
[junit4:junit4]   2> 9461 T779 oasc.RequestHandlers.initHandlersFromConfig created standard: solr.StandardRequestHandler
[junit4:junit4]   2> 9462 T779 oasc.RequestHandlers.initHandlersFromConfig created /get: solr.RealTimeGetHandler
[junit4:junit4]   2> 9462 T779 oasc.RequestHandlers.initHandlersFromConfig created dismax: solr.SearchHandler
[junit4:junit4]   2> 9463 T779 oasc.RequestHandlers.initHandlersFromConfig created mock: org.apache.solr.core.MockQuerySenderListenerReqHandler
[junit4:junit4]   2> 9463 T779 oasc.RequestHandlers.initHandlersFromConfig created /admin/: org.apache.solr.handler.admin.AdminHandlers
[junit4:junit4]   2> 9464 T779 oasc.RequestHandlers.initHandlersFromConfig created defaults: solr.StandardRequestHandler
[junit4:junit4]   2> 9464 T779 oasc.RequestHandlers.initHandlersFromConfig adding lazy requestHandler: solr.StandardRequestHandler
[junit4:junit4]   2> 9465 T779 oasc.RequestHandlers.initHandlersFromConfig created lazy: solr.StandardRequestHandler
[junit4:junit4]   2> 9465 T779 oasc.RequestHandlers.initHandlersFromConfig created /update: solr.UpdateRequestHandler
[junit4:junit4]   2> 9466 T779 oasc.RequestHandlers.initHandlersFromConfig created /terms: org.apache.solr.handler.component.SearchHandler
[junit4:junit4]   2> 9466 T779 oasc.RequestHandlers.initHandlersFromConfig created spellCheckCompRH: org.apache.solr.handler.component.SearchHandler
[junit4:junit4]   2> 9467 T779 oasc.RequestHandlers.initHandlersFromConfig created spellCheckCompRH_Direct: org.apache.solr.handler.component.SearchHandler
[junit4:junit4]   2> 9468 T779 oasc.RequestHandlers.initHandlersFromConfig created spellCheckWithWordbreak: org.apache.solr.handler.component.SearchHandler
[junit4:junit4]   2> 9468 T779 oasc.RequestHandlers.initHandlersFromConfig created spellCheckWithWordbreak_Direct: org.apache.solr.handler.component.SearchHandler
[junit4:junit4]   2> 9469 T779 oasc.RequestHandlers.initHandlersFromConfig created spellCheckCompRH1: org.apache.solr.handler.component.SearchHandler
[junit4:junit4]   2> 9469 T779 oasc.RequestHandlers.initHandlersFromConfig created tvrh: org.apache.solr.handler.component.SearchHandler
[junit4:junit4]   2> 9470 T779 oasc.RequestHandlers.initHandlersFromConfig created /mlt: solr.MoreLikeThisHandler
[junit4:junit4]   2> 9470 T779 oasc.RequestHandlers.initHandlersFromConfig created /debug/dump: solr.DumpRequestHandler
[junit4:junit4]   2> 9473 T779 oashl.XMLLoader.init xsltCacheLifetimeSeconds=60
[junit4:junit4]   2> 9476 T779 oasc.SolrCore.initDeprecatedSupport WARNING solrconfig.xml uses deprecated <admin/gettableFiles>, Please update your config to use the ShowFileRequestHandler.
[junit4:junit4]   2> 9477 T779 oasc.SolrCore.initDeprecatedSupport WARNING adding ShowFileRequestHandler with hidden files: [SCHEMA.XML, OLD_SYNONYMS.TXT, STOPWORDS.TXT, PROTWORDS.TXT, OPEN-EXCHANGE-RATES.JSON, SYNONYMS.TXT, CURRENCY.XML, MAPPING-ISOLATIN1ACCENT.TXT]
[junit4:junit4]   2> 9481 T779 oass.SolrIndexSearcher.<init> Opening Searcher@6e892f9d main
[junit4:junit4]   2> 9482 T779 oasu.CommitTracker.<init> Hard AutoCommit: disabled
[junit4:junit4]   2> 9482 T779 oasu.CommitTracker.<init> Soft AutoCommit: disabled
[junit4:junit4]   2> 9483 T779 oashc.SpellCheckComponent.inform Initializing spell checkers
[junit4:junit4]   2> 9496 T779 oass.DirectSolrSpellChecker.init init: {name=direct,classname=DirectSolrSpellChecker,field=lowerfilt,minQueryLength=3}
[junit4:junit4]   2> 9545 T852 oasc.SolrCore.registerSearcher [collection1] Registered new searcher Searcher@6e892f9d main{StandardDirectoryReader(segments_1:1)}
[junit4:junit4]   2> 9854 T800 oascc.ZkStateReader.updateClusterState Updating cloud state from ZooKeeper... 
[junit4:junit4]   2> 9866 T813 oascc.ZkStateReader$2.process A cluster state change has occurred - updating...
[junit4:junit4]   2> 9866 T825 oascc.ZkStateReader$2.process A cluster state change has occurred - updating...
[junit4:junit4]   2> 9866 T837 oascc.ZkStateReader$2.process A cluster state change has occurred - updating...
[junit4:junit4]   2> 9866 T851 oascc.ZkStateReader$2.process A cluster state change has occurred - updating...
[junit4:junit4]   2> 9866 T799 oascc.ZkStateReader$2.process A cluster state change has occurred - updating...
[junit4:junit4]   2> 10054 T779 oasc.CoreContainer.register registering core: collection1
[junit4:junit4]   2> 10054 T779 oasc.ZkController.register Register shard - core:collection1 address:http://127.0.0.1:19475/solr shardId:shard2
[junit4:junit4]   2> 10057 T779 oasc.ZkController.register We are http://127.0.0.1:19475/solr/collection1/ and leader is http://127.0.0.1:19467/solr/collection1/
[junit4:junit4]   2> 10058 T779 oasc.ZkController.register No LogReplay needed for core=collection1 baseURL=http://127.0.0.1:19475/solr
[junit4:junit4]   2> 10058 T779 oasc.ZkController.checkRecovery Core needs to recover:collection1
[junit4:junit4]   2> 10058 T779 oasu.DefaultSolrCoreState.doRecovery Running recovery - first canceling any ongoing recovery
[junit4:junit4]   2> ASYNC  NEW_CORE C85 name=collection1 org.apache.solr.core.SolrCore@51b84106 url=http://127.0.0.1:19475/solr/collection1 node=127.0.0.1:19475_solr
[junit4:junit4]   2> 10059 T853 C85 P19475 oasc.RecoveryStrategy.run Starting recovery process.  core=collection1 recoveringAfterStartup=true
[junit4:junit4]   2> 10059 T779 oascc.ZkStateReader.updateClusterState Updating cloud state from ZooKeeper... 
[junit4:junit4]   2> 10060 T853 C85 P19475 oasc.RecoveryStrategy.doRecovery ###### startupVersions=[]
[junit4:junit4]   2> 10060 T779 oass.SolrDispatchFilter.init user.dir=/usr/home/hudson/hudson-slave/workspace/Lucene-Solr-Tests-trunk-java7/solr/build/solr-core/test/J1
[junit4:junit4]   2> 10061 T779 oass.SolrDispatchFilter.init SolrDispatchFilter.init() done
[junit4:junit4]   2> 10061 T853 C85 P19475 oasc.RecoveryStrategy.doRecovery Attempting to PeerSync from http://127.0.0.1:19467/solr/collection1/ core=collection1 - recoveringAfterStartup=true
[junit4:junit4]   2> 10061 T779 oascsi.HttpClientUtil.createClient Creating new http client, config:maxConnections=128&maxConnectionsPerHost=32&followRedirects=false
[junit4:junit4]   2> 10062 T853 C85 P19475 oasu.PeerSync.sync PeerSync: core=collection1 url=http://127.0.0.1:19475/solr START replicas=[http://127.0.0.1:19467/solr/collection1/] nUpdates=100
[junit4:junit4]   2> 10062 T853 C85 P19475 oasu.PeerSync.sync WARNING no frame of reference to tell of we've missed updates
[junit4:junit4]   2> 10062 T853 C85 P19475 oasc.RecoveryStrategy.doRecovery PeerSync Recovery was not successful - trying replication. core=collection1
[junit4:junit4]   2> 10063 T853 C85 P19475 oasc.RecoveryStrategy.doRecovery Starting Replication Recovery. core=collection1
[junit4:junit4]   2> 10063 T853 C85 P19475 oascsi.HttpClientUtil.createClient Creating new http client, config:maxConnections=128&maxConnectionsPerHost=32&followRedirects=false
[junit4:junit4]   2> ASYNC  NEW_CORE C86 name=collection1 org.apache.solr.core.SolrCore@17e4e9da url=http://127.0.0.1:19467/solr/collection1 node=127.0.0.1:19467_solr
[junit4:junit4]   2> 10079 T817 C86 P19467 REQ /get {distrib=false&qt=/get&wt=javabin&version=2&getVersions=100} status=0 QTime=0 
[junit4:junit4]   2> 10080 T779 oaz.ZooKeeper.<init> Initiating client connection, connectString=127.0.0.1:19442/solr sessionTimeout=10000 watcher=org.apache.solr.common.cloud.ConnectionManager@411e850d
[junit4:junit4]   2> 10081 T855 oaz.ClientCnxn$SendThread.startConnect Opening socket connection to server /127.0.0.1:19442
[junit4:junit4]   2> 10081 T779 oascc.ConnectionManager.waitForConnected Waiting for client to connect to ZooKeeper
[junit4:junit4]   2> 10081 T855 oaz.ClientCnxn$SendThread.primeConnection Socket connection established to localhost/127.0.0.1:19442, initiating session
[junit4:junit4]   2> 10082 T781 oazs.NIOServerCnxn$Factory.run Accepted socket connection from /140.211.11.196:19484
[junit4:junit4]   2> 10082 T781 oazs.NIOServerCnxn.readConnectRequest Client attempting to establish new session at /140.211.11.196:19484
[junit4:junit4]   2> 10083 T783 oazs.NIOServerCnxn.finishSessionInit Established session 0x139c98655430007 with negotiated timeout 10000 for client /140.211.11.196:19484
[junit4:junit4]   2> 10083 T855 oaz.ClientCnxn$SendThread.readConnectResult Session establishment complete on server localhost/127.0.0.1:19442, sessionid = 0x139c98655430007, negotiated timeout = 10000
[junit4:junit4]   2> 10083 T856 oascc.ConnectionManager.process Watcher org.apache.solr.common.cloud.ConnectionManager@411e850d name:ZooKeeperConnection Watcher:127.0.0.1:19442/solr got event WatchedEvent state:SyncConnected type:None path:null path:null type:None
[junit4:junit4]   2> 10084 T779 oascc.ConnectionManager.waitForConnected Client is connected to ZooKeeper
[junit4:junit4]   2> 10085 T779 oascc.ZkStateReader.createClusterStateWatchersAndUpdate Updating cluster state from ZooKeeper... 
[junit4:junit4]   2> 10086 T779 oasc.ChaosMonkey.monkeyLog monkey: init - expire sessions:true cause connection loss:true
[junit4:junit4]   2> 10087 T779 oascsi.HttpClientUtil.createClient Creating new http client, config:
[junit4:junit4]   2> 10095 T779 oascc.ZkStateReader.updateClusterState Updating cloud state from ZooKeeper... 
[junit4:junit4]   2> ASYNC  NEW_CORE C87 name=collection1 org.apache.solr.core.SolrCore@1cfdd24d url=http://127.0.0.1:19446/solr/collection1 node=127.0.0.1:19446_solr
[junit4:junit4]   2> 10119 T791 C87 P19446 oascsi.HttpClientUtil.createClient Creating new http client, config:maxConnections=500&maxConnectionsPerHost=16
[junit4:junit4]   2> 10140 T791 C87 P19446 oasc.SolrDeletionPolicy.onInit SolrDeletionPolicy.onInit: commits:num=1
[junit4:junit4]   2> 		commit{dir=/usr/home/hudson/hudson-slave/workspace/Lucene-Solr-Tests-trunk-java7/solr/build/solr-core/test/J1/org.apache.solr.cloud.BasicDistributedZk2Test-1347705787709/control/data/index,segFN=segments_1,generation=1,filenames=[segments_1]
[junit4:junit4]   2> 10140 T791 C87 P19446 oasc.SolrDeletionPolicy.updateCommits newest commit = 1
[junit4:junit4]   2> 10147 T791 C87 P19446 /update {wt=javabin&version=2} {add=[1 (1413171954674827264)]} 0 43
[junit4:junit4]   2> 10148 T779 oaz.ZooKeeper.<init> Initiating client connection, connectString=127.0.0.1:19442/solr sessionTimeout=10000 watcher=org.apache.solr.common.cloud.ConnectionManager@2871d843
[junit4:junit4]   2> 10149 T857 oaz.ClientCnxn$SendThread.startConnect Opening socket connection to server /127.0.0.1:19442
[junit4:junit4]   2> 10149 T779 oascc.ConnectionManager.waitForConnected Waiting for client to connect to ZooKeeper
[junit4:junit4]   2> 10150 T857 oaz.ClientCnxn$SendThread.primeConnection Socket connection established to localhost/127.0.0.1:19442, initiating session
[junit4:junit4]   2> 10150 T781 oazs.NIOServerCnxn$Factory.run Accepted socket connection from /140.211.11.196:19487
[junit4:junit4]   2> 10150 T781 oazs.NIOServerCnxn.readConnectRequest Client attempting to establish new session at /140.211.11.196:19487
[junit4:junit4]   2> 10186 T783 oazs.NIOServerCnxn.finishSessionInit Established session 0x139c98655430008 with negotiated timeout 10000 for client /140.211.11.196:19487
[junit4:junit4]   2> 10186 T857 oaz.ClientCnxn$SendThread.readConnectResult Session establishment complete on server localhost/127.0.0.1:19442, sessionid = 0x139c98655430008, negotiated timeout = 10000
[junit4:junit4]   2> 10186 T858 oascc.ConnectionManager.process Watcher org.apache.solr.common.cloud.ConnectionManager@2871d843 name:ZooKeeperConnection Watcher:127.0.0.1:19442/solr got event WatchedEvent state:SyncConnected type:None path:null path:null type:None
[junit4:junit4]   2> 10187 T779 oascc.ConnectionManager.waitForConnected Client is connected to ZooKeeper
[junit4:junit4]   2> 10187 T779 oascc.ZkStateReader.createClusterStateWatchersAndUpdate Updating cluster state from ZooKeeper... 
[junit4:junit4]   2> 10227 T807 C84 P19462 oasc.SolrDeletionPolicy.onInit SolrDeletionPolicy.onInit: commits:num=1
[junit4:junit4]   2> 		commit{dir=/usr/home/hudson/hudson-slave/workspace/Lucene-Solr-Tests-trunk-java7/solr/build/solr-core/test/J1/org.apache.solr.cloud.BasicDistributedZk2Test-1347705787709/jetty1/index,segFN=segments_1,generation=1,filenames=[segments_1]
[junit4:junit4]   2> 10227 T807 C84 P19462 oasc.SolrDeletionPolicy.updateCommits newest commit = 1
[junit4:junit4]   2>  C83_STATE=coll:collection1 core:collection1 props:{shard=shard1, roles=null, state=recovering, core=collection1, collection=collection1, node_name=127.0.0.1:19470_solr, base_url=http://127.0.0.1:19470/solr}
[junit4:junit4]   2> 10240 T829 C83 P19470 oasc.SolrDeletionPolicy.onInit SolrDeletionPolicy.onInit: commits:num=1
[junit4:junit4]   2> 		commit{dir=/usr/home/hudson/hudson-slave/workspace/Lucene-Solr-Tests-trunk-java7/solr/build/solr-core/test/J1/org.apache.solr.cloud.BasicDistributedZk2Test-1347705787709/jetty3/index,segFN=segments_1,generation=1,filenames=[segments_1]
[junit4:junit4]   2> 10241 T829 C83 P19470 oasc.SolrDeletionPolicy.updateCommits newest commit = 1
[junit4:junit4]   2> 10245 T829 C83 P19470 REQ /update {update.distrib=FROMLEADER&distrib.from=http://127.0.0.1:19462/solr/collection1/&wt=javabin&version=2} status=0 QTime=8 
[junit4:junit4]   2> 10246 T807 C84 P19462 REQ /update {distrib.from=http://127.0.0.1:19467/solr/collection1/&update.distrib=TOLEADER&wt=javabin&version=2} status=0 QTime=23 
[junit4:junit4]   2> 10246 T819 C86 P19467 /update {wt=javabin&version=2} {add=[1]} 0 55
[junit4:junit4]   2> 10247 T779 oasc.AbstractDistribZkTestBase.waitForRecoveriesToFinish Wait for recoveries to finish - collection: collection1 failOnTimeout:true timeout (sec):1440
[junit4:junit4]   2> 10248 T779 oascc.ZkStateReader.updateClusterState Updating cloud state from ZooKeeper... 
[junit4:junit4]   2> 10369 T800 oascc.ZkStateReader.updateClusterState Updating cloud state from ZooKeeper... 
[junit4:junit4]   2> 10382 T837 oascc.ZkStateReader$2.process A cluster state change has occurred - updating...
[junit4:junit4]   2> 10382 T825 oascc.ZkStateReader$2.process A cluster state change has occurred - updating...
[junit4:junit4]   2> 10382 T851 oascc.ZkStateReader$2.process A cluster state change has occurred - updating...
[junit4:junit4]   2> 10382 T856 oascc.ZkStateReader$2.process A cluster state change has occurred - updating...
[junit4:junit4]   2> 10382 T799 oascc.ZkStateReader$2.process A cluster state change has occurred - updating...
[junit4:junit4]   2> 10382 T858 oascc.ZkStateReader$2.process A cluster state change has occurred - updating...
[junit4:junit4]   2> 10382 T813 oascc.ZkStateReader$2.process A cluster state change has occurred - updating...
[junit4:junit4]   2> 11249 T779 oascc.ZkStateReader.updateClusterState Updating cloud state from ZooKeeper... 
[junit4:junit4]   2> 11595 T839 C83 P19470 oasc.RecoveryStrategy.doRecovery Begin buffering updates. core=collection1
[junit4:junit4]   2> 11595 T839 C83 P19470 oasu.UpdateLog.bufferUpdates Starting to buffer updates. FSUpdateLog{state=ACTIVE, tlog=tlog{file=./org.apache.solr.cloud.BasicDistributedZk2Test-1347705787709/jetty3/tlog/tlog.0000000000000000000 refcount=1}}
[junit4:junit4]   2> 11596 T839 C83 P19470 oasc.RecoveryStrategy.replicate Attempting to replicate from http://127.0.0.1:19462/solr/collection1/. core=collection1
[junit4:junit4]   2> 11597 T839 C83 P19470 oascsi.HttpClientUtil.createClient Creating new http client, config:maxConnections=128&maxConnectionsPerHost=32&followRedirects=false
[junit4:junit4]   2> 11610 T808 C84 P19462 oasu.DirectUpdateHandler2.commit start commit{flags=0,_version_=0,optimize=false,openSearcher=true,waitSearcher=true,expungeDeletes=false,softCommit=false}
[junit4:junit4]   2> 11823 T808 C84 P19462 oasc.SolrDeletionPolicy.onCommit SolrDeletionPolicy.onCommit: commits:num=2
[junit4:junit4]   2> 		commit{dir=/usr/home/hudson/hudson-slave/workspace/Lucene-Solr-Tests-trunk-java7/solr/build/solr-core/test/J1/org.apache.solr.cloud.BasicDistributedZk2Test-1347705787709/jetty1/index,segFN=segments_1,generation=1,filenames=[segments_1]
[junit4:junit4]   2> 		commit{dir=/usr/home/hudson/hudson-slave/workspace/Lucene-Solr-Tests-trunk-java7/solr/build/solr-core/test/J1/org.apache.solr.cloud.BasicDistributedZk2Test-1347705787709/jetty1/index,segFN=segments_2,generation=2,filenames=[_0_MockVariableIntBlock_0.doc, _0_MockVariableIntBlock_0.skp, _0_Lucene40_0.prx, _0_Pulsing40_0.prx, _0_Pulsing40_0.frq, _0_MockVariableIntBlock_0.pyl, _0_Lucene40_0.frq, _0_MockVariableIntBlock_0.tib, _0_Pulsing40_0.tip, _0_MockVariableIntBlock_0.pos, _0.si, _0_MockVariableIntBlock_0.tii, _0_Lucene40_0.tim, _0.fnm, _0_Pulsing40_0.tim, _0_nrm.cfs, _0_Direct_0.frq, _0_Lucene40_0.tip, _0_nrm.cfe, _0_MockVariableIntBlock_0.frq, segments_2, _0_Direct_0.tip, _0.fdx, _0_Direct_0.prx, _0_Direct_0.tim, _0.fdt]
[junit4:junit4]   2> 11824 T808 C84 P19462 oasc.SolrDeletionPolicy.updateCommits newest commit = 2
[junit4:junit4]   2> 11845 T808 C84 P19462 oass.SolrIndexSearcher.<init> Opening Searcher@25e805e2 main
[junit4:junit4]   2> 11846 T808 C84 P19462 oasu.DirectUpdateHandler2.commit end_commit_flush
[junit4:junit4]   2> 11848 T814 oasc.SolrCore.registerSearcher [collection1] Registered new searcher Searcher@25e805e2 main{StandardDirectoryReader(segments_2:3 _0(5.0):C1)}
[junit4:junit4]   2> 11849 T808 C84 P19462 /update {waitSearcher=true&commit=true&commit_end_point=true&wt=javabin&softCommit=false&version=2} {commit=} 0 238
[junit4:junit4]   2> 11869 T839 C83 P19470 oash.ReplicationHandler.inform Commits will be reserved for  10000
[junit4:junit4]   2> 11870 T839 C83 P19470 oascsi.HttpClientUtil.createClient Creating new http client, config:connTimeout=5000&socketTimeout=20000&allowCompression=false&maxConnections=10000&maxConnectionsPerHost=10000
[junit4:junit4]   2> 11891 T839 C83 P19470 oash.SnapPuller.<init>  No value set for 'pollInterval'. Timer Task not started.
[junit4:junit4]   2> 11894 T809 C84 P19462 oash.ReplicationHandler.inform Commits will be reserved for  10000
[junit4:junit4]   2> 11894 T809 C84 P19462 REQ /replication {command=indexversion&wt=javabin&qt=/replication&version=2} status=0 QTime=1 
[junit4:junit4]   2> 11896 T839 C83 P19470 oash.SnapPuller.fetchLatestIndex Master's generation: 2
[junit4:junit4]   2> 11896 T839 C83 P19470 oash.SnapPuller.fetchLatestIndex Slave's generation: 1
[junit4:junit4]   2> 11896 T839 C83 P19470 oash.SnapPuller.fetchLatestIndex Starting replication process
[junit4:junit4]   2> 11901 T809 C84 P19462 REQ /replication {command=filelist&generation=2&wt=javabin&qt=/replication&version=2} status=0 QTime=3 
[junit4:junit4]   2> 11903 T839 C83 P19470 oash.SnapPuller.fetchLatestIndex Number of files in latest index in master: 26
[junit4:junit4]   2> 11911 T839 C83 P19470 oash.SnapPuller.fetchLatestIndex Starting download to ./org.apache.solr.cloud.BasicDistributedZk2Test-1347705787709/jetty3/index.20120915114319608 fullCopy=true
[junit4:junit4]   2> 11915 T809 C84 P19462 REQ /replication {file=_0_MockVariableIntBlock_0.doc&command=filecontent&checksum=true&generation=2&qt=/replication&wt=filestream} status=0 QTime=0 
[junit4:junit4]   2> 11931 T809 C84 P19462 REQ /replication {file=_0_MockVariableIntBlock_0.skp&command=filecontent&checksum=true&generation=2&qt=/replication&wt=filestream} status=0 QTime=0 
[junit4:junit4]   2> 11933 T839 C83 P19470 oash.SnapPuller$FileFetcher.fetchPackets WARNING No content recieved for file: {name=_0_MockVariableIntBlock_0.skp, lastmodified=1347705799000, size=0}
[junit4:junit4]   2> 11936 T809 C84 P19462 REQ /replication {file=_0_Pulsing40_0.prx&command=filecontent&checksum=true&generation=2&qt=/replication&wt=filestream} status=0 QTime=0 
[junit4:junit4]   2> 11940 T809 C84 P19462 REQ /replication {file=_0_Lucene40_0.prx&command=filecontent&checksum=true&generation=2&qt=/replication&wt=filestream} status=0 QTime=0 
[junit4:junit4]   2> 11944 T809 C84 P19462 REQ /replication {file=_0_Pulsing40_0.frq&command=filecontent&checksum=true&generation=2&qt=/replication&wt=filestream} status=0 QTime=0 
[junit4:junit4]   2> 11948 T809 C84 P19462 REQ /replication {file=_0_MockVariableIntBlock_0.pyl&command=filecontent&checksum=true&generation=2&qt=/replication&wt=filestream} status=0 QTime=0 
[junit4:junit4]   2> 11949 T839 C83 P19470 oash.SnapPuller$FileFetcher.fetchPackets WARNING No content recieved for file: {name=_0_MockVariableIntBlock_0.pyl, lastmodified=1347705799000, size=0}
[junit4:junit4]   2> 11953 T809 C84 P19462 REQ /replication {file=_0_Lucene40_0.frq&command=filecontent&checksum=true&generation=2&qt=/replication&wt=filestream} status=0 QTime=0 
[junit4:junit4]   2> 11957 T809 C84 P19462 REQ /replication {file=_0_MockVariableIntBlock_0.tib&command=filecontent&checksum=true&generation=2&qt=/replication&wt=filestream} status=0 QTime=0 
[junit4:junit4]   2> 11962 T809 C84 P19462 REQ /replication {file=_0_MockVariableIntBlock_0.pos&command=filecontent&checksum=true&generation=2&qt=/replication&wt=filestream} status=0 QTime=0 
[junit4:junit4]   2> 11966 T809 C84 P19462 REQ /replication {file=_0_Pulsing40_0.tip&command=filecontent&checksum=true&generation=2&qt=/replication&wt=filestream} status=0 QTime=0 
[junit4:junit4]   2> 11970 T809 C84 P19462 REQ /replication {file=_0.si&command=filecontent&checksum=true&generation=2&qt=/replication&wt=filestream} status=0 QTime=0 
[junit4:junit4]   2> 11976 T809 C84 P19462 REQ /replication {file=_0_MockVariableIntBlock_0.tii&command=filecontent&checksum=true&generation=2&qt=/replication&wt=filestream} status=0 QTime=0 
[junit4:junit4]   2> 11982 T809 C84 P19462 REQ /replication {file=_0_Lucene40_0.tim&command=filecontent&checksum=true&generation=2&qt=/replication&wt=filestream} status=0 QTime=0 
[junit4:junit4]   2> 11988 T809 C84 P19462 REQ /replication {file=_0_Pulsing40_0.tim&command=filecontent&checksum=true&generation=2&qt=/replication&wt=filestream} status=0 QTime=0 
[junit4:junit4]   2> 11994 T809 C84 P19462 REQ /replication {file=_0.fnm&command=filecontent&checksum=true&generation=2&qt=/replication&wt=filestream} status=0 QTime=0 
[junit4:junit4]   2> 12000 T809 C84 P19462 REQ /replication {file=_0_nrm.cfs&command=filecontent&checksum=true&generation=2&qt=/replication&wt=filestream} status=0 QTime=0 
[junit4:junit4]   2> 12006 T809 C84 P19462 REQ /replication {file=_0_Direct_0.frq&command=filecontent&checksum=true&generation=2&qt=/replication&wt=filestream} status=0 QTime=0 
[junit4:junit4]   2> 12012 T809 C84 P19462 REQ /replication {file=_0_Lucene40_0.tip&command=filecontent&checksum=true&generation=2&qt=/replication&wt=filestream} status=0 QTime=0 
[junit4:junit4]   2> 12018 T809 C84 P19462 REQ /replication {file=_0_MockVariableIntBlock_0.frq&command=filecontent&checksum=true&generation=2&qt=/replication&wt=filestream} status=0 QTime=0 
[junit4:junit4]   2> 12024 T809 C84 P19462 REQ /replication {file=_0_nrm.cfe&command=filecontent&checksum=true&generation=2&qt=/replication&wt=filestream} status=0 QTime=0 
[junit4:junit4]   2> 12029 T809 C84 P19462 REQ /replication {file=segments_2&command=filecontent&checksum=true&generation=2&qt=/replication&wt=filestream} status=0 QTime=0 
[junit4:junit4]   2> 12035 T809 C84 P19462 REQ /replication {file=_0.fdx&command=filecontent&checksum=true&generation=2&qt=/replication&wt=filestream} status=0 QTime=0 
[junit4:junit4]   2> 12041 T809 C84 P19462 REQ /replication {file=_0_Direct_0.tip&command=filecontent&checksum=true&generation=2&qt=/replication&wt=filestream} status=0 QTime=0 
[junit4:junit4]   2> 12047 T809 C84 P19462 REQ /replication {file=_0_Direct_0.prx&command=filecontent&checksum=true&generation=2&qt=/replication&wt=filestream} status=0 QTime=0 
[junit4:junit4]   2> 12053 T809 C84 P19462 REQ /replication {file=_0_Direct_0.tim&command=filecontent&checksum=true&generation=2&qt=/replication&wt=filestream} status=0 QTime=0 
[junit4:junit4]   2> 12059 T809 C84 P19462 REQ /replication {file=_0.fdt&command=filecontent&checksum=true&generation=2&qt=/replication&wt=filestream} status=0 QTime=0 
[junit4:junit4]   2> 12061 T839 C83 P19470 oash.SnapPuller.fetchLatestIndex Total time taken for download : 0 secs
[junit4:junit4]   2> 12066 T839 C83 P19470 oash.SnapPuller.modifyIndexProps New index installed. Updating index properties... index=index.20120915114319608
[junit4:junit4]   2> 12068 T839 C83 P19470 oasu.DefaultSolrCoreState.newIndexWriter Creating new IndexWriter...
[junit4:junit4]   2> 12069 T839 C83 P19470 oasu.DefaultSolrCoreState.newIndexWriter Waiting until IndexWriter is unused... core=collection1
[junit4:junit4]   2> 12069 T839 C83 P19470 oasu.DefaultSolrCoreState.newIndexWriter Rollback old IndexWriter... core=collection1
[junit4:junit4]   2> 12076 T839 C83 P19470 oasc.SolrCore.getNewIndexDir WARNING New index directory detected: old=./org.apache.solr.cloud.BasicDistributedZk2Test-1347705787709/jetty3/index/ new=./org.apache.solr.cloud.BasicDistributedZk2Test-1347705787709/jetty3/index.20120915114319608
[junit4:junit4]   2> 12076 T839 C83 P19470 oasc.CachingDirectoryFactory.get return new directory for /usr/home/hudson/hudson-slave/workspace/Lucene-Solr-Tests-trunk-java7/solr/build/solr-core/test/J1/./org.apache.solr.cloud.BasicDistributedZk2Test-1347705787709/jetty3/index.20120915114319608 forceNew:true
[junit4:junit4]   2> 12091 T839 C83 P19470 oasc.SolrDeletionPolicy.onInit SolrDeletionPolicy.onInit: commits:num=1
[junit4:junit4]   2> 		commit{dir=/usr/home/hudson/hudson-slave/workspace/Lucene-Solr-Tests-trunk-java7/solr/build/solr-core/test/J1/org.apache.solr.cloud.BasicDistributedZk2Test-1347705787709/jetty3/index.20120915114319608,segFN=segments_2,generation=2,filenames=[_0_MockVariableIntBlock_0.doc, _0_MockVariableIntBlock_0.skp, _0_Pulsing40_0.prx, _0_Lucene40_0.prx, _0_Pulsing40_0.frq, _0_MockVariableIntBlock_0.pyl, _0_Lucene40_0.frq, _0_MockVariableIntBlock_0.tib, _0_MockVariableIntBlock_0.pos, _0_Pulsing40_0.tip, _0.si, _0_MockVariableIntBlock_0.tii, _0_Lucene40_0.tim, _0.fnm, _0_Pulsing40_0.tim, _0_nrm.cfs, _0_Direct_0.frq, _0_Lucene40_0.tip, _0_nrm.cfe, _0_MockVariableIntBlock_0.frq, segments_2, _0_Direct_0.tip, _0.fdx, _0_Direct_0.prx, _0_Direct_0.tim, _0.fdt]
[junit4:junit4]   2> 12092 T839 C83 P19470 oasc.SolrDeletionPolicy.updateCommits newest commit = 2
[junit4:junit4]   2> 12092 T839 C83 P19470 oasu.DefaultSolrCoreState.newIndexWriter New IndexWriter is ready to be used.
[junit4:junit4]   2> 12099 T839 C83 P19470 oass.SolrIndexSearcher.<init> Opening Searcher@52699839 main
[junit4:junit4]   2> 12101 T838 oasc.SolrCore.registerSearcher [collection1] Registered new searcher Searcher@52699839 main{StandardDirectoryReader(segments_2:3:nrt _0(5.0):C1)}
[junit4:junit4]   2> 12102 T838 oasc.CachingDirectoryFactory.close Closing directory:/usr/home/hudson/hudson-slave/workspace/Lucene-Solr-Tests-trunk-java7/solr/build/solr-core/test/J1/./org.apache.solr.cloud.BasicDistributedZk2Test-1347705787709/jetty3/index
[junit4:junit4]   2> 12102 T838 oash.SnapPuller$2.onClose removing old index directory ./org.apache.solr.cloud.BasicDistributedZk2Test-1347705787709/jetty3/index
[junit4:junit4]   2> 12104 T839 C83 P19470 oasu.DirectUpdateHandler2.commit start commit{flags=0,_version_=0,optimize=false,openSearcher=true,waitSearcher=true,expungeDeletes=false,softCommit=false}
[junit4:junit4]   2> 12105 T839 C83 P19470 oass.SolrIndexSearcher.<init> Opening Searcher@5c62592d main
[junit4:junit4]   2> 12106 T839 C83 P19470 oasu.DirectUpdateHandler2.commit end_commit_flush
[junit4:junit4]   2> 12108 T838 oasc.SolrCore.registerSearcher [collection1] Registered new searcher Searcher@5c62592d main{StandardDirectoryReader(segments_2:3:nrt _0(5.0):C1)}
[junit4:junit4]   2> 12114 T839 C83 P19470 oasc.RecoveryStrategy.replay Replaying buffered documents. core=collection1
[junit4:junit4]   2> 12114 T862 C83 P19470 oasu.UpdateLog$LogReplayer.doReplay WARNING Starting log replay tlog{file=./org.apache.solr.cloud.BasicDistributedZk2Test-1347705787709/jetty3/tlog/tlog.0000000000000000000 refcount=2} active=true starting pos=433
[junit4:junit4]   2> 12119 T862 C83 P19470 oasu.DirectUpdateHandler2.commit start commit{flags=2,_version_=0,optimize=false,openSearcher=true,waitSearcher=true,expungeDeletes=false,softCommit=false}
[junit4:junit4]   2> 12122 T862 C83 P19470 oass.SolrIndexSearcher.<init> Opening Searcher@36888e59 main
[junit4:junit4]   2> 12124 T838 oasc.SolrCore.registerSearcher [collection1] Registered new searcher Searcher@36888e59 main{StandardDirectoryReader(segments_2:3:nrt _0(5.0):C1)}
[junit4:junit4]   2> 12125 T862 C83 P19470 oasu.DirectUpdateHandler2.commit end_commit_flush
[junit4:junit4]   2> 12126 T862 C83 P19470 oasu.UpdateLog$LogReplayer.run WARNING Log replay finished. recoveryInfo=RecoveryInfo{adds=0 deletes=0 deleteByQuery=0 errors=0 positionOfStart=433}
[junit4:junit4]   2> 12126 T839 C83 P19470 oasc.RecoveryStrategy.doRecovery Replication Recovery was successful - registering as Active. core=collection1
[junit4:junit4]   2> 12132 T839 C83 P19470 oasc.RecoveryStrategy.doRecovery Finished recovery process. core=collection1
[junit4:junit4]   2> 12251 T779 oascc.ZkStateReader.updateClusterState Updating cloud state from ZooKeeper... 
[junit4:junit4]   2> 12392 T800 oascc.ZkStateReader.updateClusterState Updating cloud state from ZooKeeper... 
[junit4:junit4]   2> 12404 T858 oascc.ZkStateReader$2.process A cluster state change has occurred - updating...
[junit4:junit4]   2> 12404 T825 oascc.ZkStateReader$2.process A cluster state change has occurred - updating...
[junit4:junit4]   2> 12404 T813 oascc.ZkStateReader$2.process A cluster state change has occurred - updating...
[junit4:junit4]   2> 12404 T856 oascc.ZkStateReader$2.process A cluster state change has occurred - updating...
[junit4:junit4]   2> 12404 T837 oascc.ZkStateReader$2.process A cluster state change has occurred - updating...
[junit4:junit4]   2> 12404 T799 oascc.ZkStateReader$2.process A cluster state change has occurred - updating...
[junit4:junit4]   2> 12404 T851 oascc.ZkStateReader$2.process A cluster state change has occurred - updating...
[junit4:junit4]   2>  C85_STATE=coll:collection1 core:collection1 props:{shard=shard2, roles=null, state=recovering, core=collection1, collection=collection1, node_name=127.0.0.1:19475_solr, base_url=http://127.0.0.1:19475/solr}
[junit4:junit4]   2> 13086 T853 C85 P19475 oasc.RecoveryStrategy.doRecovery Begin buffering updates. core=collection1
[junit4:junit4]   2> 13086 T853 C85 P19475 oasu.UpdateLog.bufferUpdates Starting to buffer updates. FSUpdateLog{state=ACTIVE, tlog=null}
[junit4:junit4]   2> 13086 T853 C85 P19475 oasc.RecoveryStrategy.replicate Attempting to replicate from http://127.0.0.1:19467/solr/collection1/. core=collection1
[junit4:junit4]   2> 13087 T853 C85 P19475 oascsi.HttpClientUtil.createClient Creating new http client, config:maxConnections=128&maxConnectionsPerHost=32&followRedirects=false
[junit4:junit4]   2> 13126 T820 C86 P19467 oasu.DirectUpdateHandler2.commit start commit{flags=0,_version_=0,optimize=false,openSearcher=true,waitSearcher=true,expungeDeletes=false,softCommit=false}
[junit4:junit4]   2> 13134 T820 C86 P19467 oasc.SolrDeletionPolicy.onInit SolrDeletionPolicy.onInit: commits:num=1
[junit4:junit4]   2> 		commit{dir=/usr/home/hudson/hudson-slave/workspace/Lucene-Solr-Tests-trunk-java7/solr/build/solr-core/test/J1/org.apache.solr.cloud.BasicDistributedZk2Test-1347705787709/jetty2/index,segFN=segments_1,generation=1,filenames=[segments_1]
[junit4:junit4]   2> 13135 T820 C86 P19467 oasc.SolrDeletionPolicy.updateCommits newest commit = 1
[junit4:junit4]   2> 13137 T820 C86 P19467 oass.SolrIndexSearcher.<init> Opening Searcher@34199e83 main
[junit4:junit4]   2> 13138 T820 C86 P19467 oasu.DirectUpdateHandler2.commit end_commit_flush
[junit4:junit4]   2> 13140 T826 oasc.SolrCore.registerSearcher [collection1] Registered new searcher Searcher@34199e83 main{StandardDirectoryReader(segments_1:1)}
[junit4:junit4]   2> 13140 T820 C86 P19467 /update {waitSearcher=true&commit=true&commit_end_point=true&wt=javabin&softCommit=false&version=2} {commit=} 0 14
[junit4:junit4]   2> 13142 T853 C85 P19475 oash.ReplicationHandler.inform Commits will be reserved for  10000
[junit4:junit4]   2> 13142 T853 C85 P19475 oash.SnapPuller.<init>  No value set for 'pollInterval'. Timer Task not started.
[junit4:junit4]   2> 13156 T821 C86 P19467 oash.ReplicationHandler.inform Commits will be reserved for  10000
[junit4:junit4]   2> 13157 T821 C86 P19467 REQ /replication {command=indexversion&wt=javabin&qt=/replication&version=2} status=0 QTime=2 
[junit4:junit4]   2> 13162 T853 C85 P19475 oasc.SolrDeletionPolicy.onInit SolrDeletionPolicy.onInit: commits:num=1
[junit4:junit4]   2> 		commit{dir=/usr/home/hudson/hudson-slave/workspace/Lucene-Solr-Tests-trunk-java7/solr/build/solr-core/test/J1/org.apache.solr.cloud.BasicDistributedZk2Test-1347705787709/jetty4/index,segFN=segments_1,generation=1,filenames=[segments_1]
[junit4:junit4]   2> 13163 T853 C85 P19475 oasc.SolrDeletionPolicy.updateCommits newest commit = 1
[junit4:junit4]   2> 13163 T853 C85 P19475 oasu.DirectUpdateHandler2.commit start commit{flags=0,_version_=0,optimize=false,openSearcher=true,waitSearcher=true,expungeDeletes=false,softCommit=false}
[junit4:junit4]   2> 13168 T853 C85 P19475 oasc.SolrDeletionPolicy.onCommit SolrDeletionPolicy.onCommit: commits:num=2
[junit4:junit4]   2> 		commit{dir=/usr/home/hudson/hudson-slave/workspace/Lucene-Solr-Tests-trunk-java7/solr/build/solr-core/test/J1/org.apache.solr.cloud.BasicDistributedZk2Test-1347705787709/jetty4/index,segFN=segments_1,generation=1,filenames=[segments_1]
[junit4:junit4]   2> 		commit{dir=/usr/home/hudson/hudson-slave/workspace/Lucene-Solr-Tests-trunk-java7/solr/build/solr-core/test/J1/org.apache.solr.cloud.BasicDistributedZk2Test-1347705787709/jetty4/index,segFN=segments_2,generation=2,filenames=[segments_2]
[junit4:junit4]   2> 13169 T853 C85 P19475 oasc.SolrDeletionPolicy.updateCommits newest commit = 2
[junit4:junit4]   2> 13172 T853 C85 P19475 oass.SolrIndexSearcher.<init> Opening Searcher@59fc5ea2 main
[junit4:junit4]   2> 13173 T853 C85 P19475 oasu.DirectUpdateHandler2.commit end_commit_flush
[junit4:junit4]   2> 13175 T852 oasc.SolrCore.registerSearcher [collection1] Registered new searcher Searcher@59fc5ea2 main{StandardDirectoryReader(segments_2:2)}
[junit4:junit4]   2> 13175 T853 C85 P19475 oasc.RecoveryStrategy.replay No replay needed. core=collection1
[junit4:junit4]   2> 13175 T853 C85 P19475 oasc.RecoveryStrategy.doRecovery Replication Recovery was successful - registering as Active. core=collection1
[junit4:junit4]   2> 13180 T853 C85 P19475 oasc.RecoveryStrategy.doRecovery Finished recovery process. core=collection1
[junit4:junit4]   2> 13253 T779 oascc.ZkStateReader.updateClusterState Updating cloud state from ZooKeeper... 
[junit4:junit4]   2> 13410 T800 oascc.ZkStateReader.updateClusterState Updating cloud state from ZooKeeper... 
[junit4:junit4]   2> 13425 T856 oascc.ZkStateReader$2.process A cluster state change has occurred - updating...
[junit4:junit4]   2> 13425 T813 oascc.ZkStateReader$2.process A cluster state change has occurred - updating...
[junit4:junit4]   2> 13425 T851 oascc.ZkStateReader$2.process A cluster state change has occurred - updating...
[junit4:junit4]   2> 13425 T858 oascc.ZkStateReader$2.process A cluster state change has occurred - updating...
[junit4:junit4]   2> 13425 T837 oascc.ZkStateReader$2.process A cluster state change has occurred - updating...
[junit4:junit4]   2> 13425 T825 oascc.ZkStateReader$2.process A cluster state change has occurred - updating...
[junit4:junit4]   2> 13425 T799 oascc.ZkStateReader$2.process A cluster state change has occurred - updating...
[junit4:junit4]   2> 14255 T779 oascc.ZkStateReader.updateClusterState Updating cloud state from ZooKeeper... 
[junit4:junit4]   2> 14259 T791 C87 P19446 oasu.DirectUpdateHandler2.commit start commit{flags=0,_version_=0,optimize=false,openSearcher=true,waitSearcher=true,expungeDeletes=false,softCommit=false}
[junit4:junit4]   2> 14356 T791 C87 P19446 oasc.SolrDeletionPolicy.onCommit SolrDeletionPolicy.onCommit: commits:num=2
[junit4:junit4]   2> 		commit{dir=/usr/home/hudson/hudson-slave/workspace/Lucene-Solr-Tests-trunk-java7/solr/build/solr-core/test/J1/org.apache.solr.cloud.BasicDistributedZk2Test-1347705787709/control/data/index,segFN=segments_1,generation=1,filenames=[segments_1]
[junit4:junit4]   2> 		commit{dir=/usr/home/hudson/hudson-slave/workspace/Lucene-Solr-Tests-trunk-java7/solr/build/solr-core/test/J1/org.apache.solr.cloud.BasicDistributedZk2Test-1347705787709/control/data/index,segFN=segments_2,generation=2,filenames=[_0_MockVariableIntBlock_0.doc, _0_MockVariableIntBlock_0.skp, _0_Lucene40_0.prx, _0_Pulsing40_0.prx, _0_Pulsing40_0.frq, _0_MockVariableIntBlock_0.pyl, _0_Lucene40_0.frq, _0_MockVariableIntBlock_0.tib, _0_Pulsing40_0.tip, _0_MockVariableIntBlock_0.pos, _0.si, _0_MockVariableIntBlock_0.tii, _0_Lucene40_0.tim, _0.fnm, _0_Pulsing40_0.tim, _0_nrm.cfs, _0_Direct_0.frq, _0_Lucene40_0.tip, _0_nrm.cfe, _0_MockVariableIntBlock_0.frq, segments_2, _0_Direct_0.tip, _0.fdx, _0_Direct_0.prx, _0_Direct_0.tim, _0.fdt]
[junit4:junit4]   2> 14357 T791 C87 P19446 oasc.SolrDeletionPolicy.updateCommits newest commit = 2
[junit4:junit4]   2> 14376 T791 C87 P19446 oass.SolrIndexSearcher.<init> Opening Searcher@19c79ded main
[junit4:junit4]   2> 14377 T791 C87 P19446 oasu.DirectUpdateHandler2.commit end_commit_flush
[junit4:junit4]   2> 14379 T802 oasc.SolrCore.registerSearcher [collection1] Registered new searcher Searcher@19c79ded main{StandardDirectoryReader(segments_2:3 _0(5.0):C1)}
[junit4:junit4]   2> 14380 T791 C87 P19446 /update {waitSearcher=true&wt=javabin&commit=true&softCommit=false&version=2} {commit=} 0 121
[junit4:junit4]   2> 14383 T810 C84 P19462 oasu.DirectUpdateHandler2.commit start commit{flags=0,_version_=0,optimize=false,openSearcher=true,waitSearcher=true,expungeDeletes=false,softCommit=false}
[junit4:junit4]   2> 14406 T810 C84 P19462 oass.SolrIndexSearcher.<init> Opening Searcher@7cb6f09c main
[junit4:junit4]   2> 14408 T810 C84 P19462 oasu.DirectUpdateHandler2.commit end_commit_flush
[junit4:junit4]   2> 14410 T814 oasc.SolrCore.registerSearcher [collection1] Registered new searcher Searcher@7cb6f09c main{StandardDirectoryReader(segments_2:3 _0(5.0):C1)}
[junit4:junit4]   2> 14411 T810 C84 P19462 oasu.SolrCmdDistributor.distribCommit Distrib commit to:[StdNode: http://127.0.0.1:19470/solr/collection1/, StdNode: http://127.0.0.1:19467/solr/collection1/, StdNode: http://127.0.0.1:19475/solr/collection1/]
[junit4:junit4]   2> 14415 T822 C86 P19467 oasu.DirectUpdateHandler2.commit start commit{flags=0,_version_=0,optimize=false,openSearcher=true,waitSearcher=true,expungeDeletes=false,softCommit=false}
[junit4:junit4]   2>  C83_STATE=coll:collection1 core:collection1 props:{shard=shard1, roles=null, state=active, core=collection1, collection=collection1, node_name=127.0.0.1:19470_solr, base_url=http://127.0.0.1:19470/solr}
[junit4:junit4]   2> 14415 T829 C83 P19470 oasu.DirectUpdateHandler2.commit start commit{flags=0,_version_=0,optimize=false,openSearcher=true,waitSearcher=true,expungeDeletes=false,softCommit=false}
[junit4:junit4]   2> 14419 T829 C83 P19470 oass.SolrIndexSearcher.<init> Opening Searcher@27cc6b45 main
[junit4:junit4]   2> 14420 T829 C83 P19470 oasu.DirectUpdateHandler2.commit end_commit_flush
[junit4:junit4]   2> 14421 T822 C86 P19467 oass.SolrIndexSearcher.<init> Opening Searcher@48a8c774 main
[junit4:junit4]   2> 14422 T822 C86 P19467 oasu.DirectUpdateHandler2.commit end_commit_flush
[junit4:junit4]   2> 14422 T838 oasc.SolrCore.registerSearcher [collection1] Registered new searcher Searcher@27cc6b45 main{StandardDirectoryReader(segments_2:3:nrt _0(5.0):C1)}
[junit4:junit4]   2> 14423 T829 C83 P19470 /update {waitSearcher=true&commit=true&wt=javabin&commit_end_point=true&expungeDeletes=false&softCommit=false&version=2} {commit=} 0 8
[junit4:junit4]   2> 14424 T826 oasc.SolrCore.registerSearcher [collection1] Registered new searcher Searcher@48a8c774 main{StandardDirectoryReader(segments_1:1)}
[junit4:junit4]   2> 14424 T822 C86 P19467 /update {waitSearcher=true&commit=true&wt=javabin&commit_end_point=true&expungeDeletes=false&softCommit=false&version=2} {commit=} 0 10
[junit4:junit4]   2>  C85_STATE=coll:collection1 core:collection1 props:{shard=shard2, roles=null, state=active, core=collection1, collection=collection1, node_name=127.0.0.1:19475_solr, base_url=http://127.0.0.1:19475/solr}
[junit4:junit4]   2> 14424 T842 C85 P19475 oasu.DirectUpdateHandler2.commit start commit{flags=0,_version_=0,optimize=false,openSearcher=true,waitSearcher=true,expungeDeletes=false,softCommit=false}
[junit4:junit4]   2> 14429 T842 C85 P19475 oass.SolrIndexSearcher.<init> Opening Searcher@240a1343 main
[junit4:junit4]   2> 14430 T842 C85 P19475 oasu.DirectUpdateHandler2.commit end_commit_flush
[junit4:junit4]   2> 14431 T852 oasc.SolrCore.registerSearcher [collection1] Registered new searcher Searcher@240a1343 main{StandardDirectoryReader(segments_2:2)}
[junit4:junit4]   2> 14432 T842 C85 P19475 /update {waitSearcher=true&commit=true&wt=javabin&commit_end_point=true&expungeDeletes=false&softCommit=false&version=2} {commit=} 0 8
[junit4:junit4]   2> 14433 T810 C84 P19462 /update {waitSearcher=true&wt=javabin&commit=true&softCommit=false&version=2} {commit=} 0 50
[junit4:junit4]   2> 14440 T792 C87 P19446 REQ /select {fl=id,score&shard.url=127.0.0.1:19446/solr/collection1/&NOW=1347705802141&start=0&q=*:*&distrib=false&isShard=true&wt=javabin&fsv=true&rows=10&version=2} hits=1 status=0 QTime=0 
[junit4:junit4]   2> 14445 T792 C87 P19446 REQ /select {shard.url=127.0.0.1:19446/solr/collection1/&NOW=1347705802141&q=*:*&ids=1&distrib=false&isShard=true&wt=javabin&version=2} status=0 QTime=1 
[junit4:junit4]   2> 14446 T791 C87 P19446 REQ /select {wt=javabin&q=*:*&version=2} hits=1 status=0 QTime=10 
[junit4:junit4]   2> 14447 T779 oaz.ZooKeeper.<init> Initiating client connection, connectString=127.0.0.1:19442/solr sessionTimeout=10000 watcher=org.apache.solr.common.cloud.ConnectionManager@4719b925
[junit4:junit4]   2> 14448 T866 oaz.ClientCnxn$SendThread.startConnect Opening socket connection to server /127.0.0.1:19442
[junit4:junit4]   2> 14448 T779 oascc.ConnectionManager.waitForConnected Waiting for client to connect to ZooKeeper
[junit4:junit4]   2> 14449 T866 oaz.ClientCnxn$SendThread.primeConnection Socket connection established to localhost/127.0.0.1:19442, initiating session
[junit4:junit4]   2> 14450 T781 oazs.NIOServerCnxn$Factory.run Accepted socket connection from /140.211.11.196:19513
[junit4:junit4]   2> 14450 T781 oazs.NIOServerCnxn.readConnectRequest Client attempting to establish new session at /140.211.11.196:19513
[junit4:junit4]   2> 14452 T783 oazs.NIOServerCnxn.finishSessionInit Established session 0x139c98655430009 with negotiated timeout 10000 for client /140.211.11.196:19513
[junit4:junit4]   2> 14452 T866 oaz.ClientCnxn$SendThread.readConnectResult Session establishment complete on server localhost/127.0.0.1:19442, sessionid = 0x139c98655430009, negotiated timeout = 10000
[junit4:junit4]   2> 14452 T867 oascc.ConnectionManager.process Watcher org.apache.solr.common.cloud.ConnectionManager@4719b925 name:ZooKeeperConnection Watcher:127.0.0.1:19442/solr got event WatchedEvent state:SyncConnected type:None path:null path:null type:None
[junit4:junit4]   2> 14452 T779 oascc.ConnectionManager.waitForConnected Client is connected to ZooKeeper
[junit4:junit4]   2> 14453 T779 oascc.ZkStateReader.createClusterStateWatchersAndUpdate Updating cluster state from ZooKeeper... 
[junit4:junit4]   2> 14455 T784 oazs.PrepRequestProcessor.pRequest Processed session termination for sessionid: 0x139c98655430009
[junit4:junit4]   2> 14462 T867 oaz.ClientCnxn$EventThread.run EventThread shut down
[junit4:junit4]   2> 14462 T781 oazs.NIOServerCnxn.closeSock Closed socket connection for client /140.211.11.196:19513 which had sessionid 0x139c98655430009
[junit4:junit4]   2> 14462 T779 oaz.ZooKeeper.close Session: 0x139c98655430009 closed
[junit4:junit4]   2> 14465 T811 C84 P19462 REQ /select {distrib=false&wt=javabin&q=*:*&version=2} hits=1 status=0 QTime=0 
[junit4:junit4]   2> 14470 T823 C86 P19467 REQ /select {distrib=false&wt=javabin&q=*:*&version=2} hits=0 status=0 QTime=1 
[junit4:junit4]   2> 14478 T806 C84 P19462 REQ /select {fl=id,score&shard.url=127.0.0.1:19462/solr/collection1/|127.0.0.1:19470/solr/collection1/&NOW=1347705802178&start=0&q=*:*&distrib=false&isShard=true&wt=javabin&fsv=true&rows=10&version=2} hits=1 status=0 QTime=1 
[junit4:junit4]   2> 14478 T818 C86 P19467 REQ /select {fl=id,score&shard.url=127.0.0.1:19467/solr/collection1/|127.0.0.1:19475/solr/collection1/&NOW=1347705802178&start=0&q=*:*&distrib=false&isShard=true&wt=javabin&fsv=true&rows=10&version=2} hits=0 status=0 QTime=0 
[junit4:junit4]   2> 14484 T806 C84 P19462 REQ /select {shard.url=127.0.0.1:19462/solr/collection1/|127.0.0.1:19470/solr/collection1/&NOW=1347705802178&q=*:*&ids=1&distrib=false&isShard=true&wt=javabin&version=2} status=0 QTime=2 
[junit4:junit4]   2> 14485 T819 C86 P19467 REQ /select {wt=javabin&q=*:*&version=2} hits=1 status=0 QTime=12 
[junit4:junit4]   2> 14494 T791 C87 P19446 /update {wt=javabin&version=2} {add=[2 (1413171959241375744)]} 0 6
[junit4:junit4]   2> 14515 T842 C85 P19475 REQ /update {update.distrib=FROMLEADER&distrib.from=http://127.0.0.1:19467/solr/collection1/&wt=javabin&version=2} status=0 QTime=6 
[junit4:junit4]   2> 14516 T822 C86 P19467 REQ /update {distrib.from=http://127.0.0.1:19462/solr/collection1/&update.distrib=TOLEADER&wt=javabin&version=2} status=0 QTime=15 
[junit4:junit4]   2> 14516 T810 C84 P19462 /update {wt=javabin&version=2} {add=[2]} 0 19
[junit4:junit4]   2> 14523 T791 C87 P19446 /update {wt=javabin&version=2} {add=[3 (1413171959274930176)]} 0 3
[junit4:junit4]   2> 14535 T842 C85 P19475 REQ /update {distrib.from=http://127.0.0.1:19467/solr/collection1/&update.distrib=FROMLEADER&wt=javabin&version=2} status=0 QTime=3 
[junit4:junit4]   2> 14535 T819 C86 P19467 /update {wt=javabin&version=2} {add=[3 (1413171959281221632)]} 0 9
[junit4:junit4]   2> 14541 T791 C87 P19446 /update {wt=javabin&version=2} {add=[4 (1413171959292755968)]} 0 3
[junit4:junit4]   2> 14559 T829 C83 P19470 REQ /update {distrib.from=http://127.0.0.1:19462/solr/collection1/&update.distrib=FROMLEADER&wt=javabin&version=2} status=0 QTime=5 
[junit4:junit4]   2> 14560 T810 C84 P19462 /update {wt=javabin&version=2} {add=[4 (1413171959299047424)]} 0 17
[junit4:junit4]   2> 14567 T791 C87 P19446 /update {wt=javabin&version=2} {add=[5 (1413171959320018944)]} 0 2
[junit4:junit4]   2> 14580 T842 C85 P19475 REQ /update {update.distrib=FROMLEADER&distrib.from=http://127.0.0.1:19467/solr/collection1/&wt=javabin&version=2} status=0 QTime=3 
[junit4:junit4]   2> 14580 T822 C86 P19467 REQ /update {distrib.from=http://127.0.0.1:19462/solr/collection1/&update.distrib=TOLEADER&wt=javabin&version=2} status=0 QTime=8 
[junit4:junit4]   2> 14581 T810 C84 P19462 /update {wt=javabin&version=2} {add=[5]} 0 12
[junit4:junit4]   2> 14586 T791 C87 P19446 /update {wt=javabin&version=2} {add=[6 (1413171959340990464)]} 0 2
[junit4:junit4]   2> 14599 T842 C85 P19475 REQ /update {update.distrib=FROMLEADER&distrib.from=http://127.0.0.1:19467/solr/collection1/&wt=javabin&version=2} status=0 QTime=2 
[junit4:junit4]   2> 14600 T822 C86 P19467 REQ /update {distrib.from=http://127.0.0.1:19462/solr/collection1/&update.distrib=TOLEADER&wt=javabin&version=2} status=0 QTime=8 
[junit4:junit4]   2> 14601 T810 C84 P19462 /update {wt=javabin&version=2} {add=[6]} 0 12
[junit4:junit4]   2> 14606 T791 C87 P19446 /update {wt=javabin&version=2} {add=[7 (1413171959361961984)]} 0 2
[junit4:junit4]   2> 14618 T842 C85 P19475 REQ /update {distrib.from=http://127.0.0.1:19467/solr/collection1/&update.distrib=FROMLEADER&wt=javabin&version=2} status=0 QTime=4 
[junit4:junit4]   2> 14619 T819 C86 P19467 /update {wt=javabin&version=2} {add=[7 (1413171959367204864)]} 0 10
[junit4:junit4]   2> 14625 T791 C87 P19446 /update {wt=javabin&version=2} {add=[8 (1413171959380836352)]} 0 3
[junit4:junit4]   2> 14639 T829 C83 P19470 REQ /update {update.distrib=FROMLEADER&distrib.from=http://127.0.0.1:19462/solr/collection1/&wt=javabin&version=2} status=0 QTime=3 
[junit4:junit4]   2> 14640 T807 C84 P19462 REQ /update {distrib.from=http://127.0.0.1:19467/solr/collection1/&update.distrib=TOLEADER&wt=javabin&version=2} status=0 QTime=9 
[junit4:junit4]   2> 14641 T819 C86 P19467 /update {wt=javabin&version=2} {add=[8]} 0 12
[junit4:junit4]   2> 14647 T791 C87 P19446 /update {wt=javabin&version=2} {add=[9 (1413171959404953600)]} 0 3
[junit4:junit4]   2> 14661 T842 C85 P19475 REQ /update {update.distrib=FROMLEADER&distrib.from=http://127.0.0.1:19467/solr/collection1/&wt=javabin&version=2} status=0 QTime=3 
[junit4:junit4]   2> 14662 T822 C86 P19467 REQ /update {distrib.from=http://127.0.0.1:19462/solr/collection1/&update.distrib=TOLEADER&wt=javabin&version=2} status=0 QTime=9 
[junit4:junit4]   2> 14663 T810 C84 P19462 /update {wt=javabin&version=2} {add=[9]} 0 13
[junit4:junit4]   2> 14670 T791 C87 P19446 /update {wt=javabin&version=2} {add=[10 (1413171959429070848)]} 0 3
[junit4:junit4]   2> 14685 T829 C83 P19470 REQ /update {update.distrib=FROMLEADER&distrib.from=http://127.0.0.1:19462/solr/collection1/&wt=javabin&version=2} status=0 QTime=3 
[junit4:junit4]   2> 14686 T807 C84 P19462 REQ /update {distrib.from=http://127.0.0.1:19467/solr/collection1/&update.distrib=TOLEADER&wt=javabin&version=2} status=0 QTime=9 
[junit4:junit4]   2> 14687 T819 C86 P19467 /update {wt=javabin&version=2} {add=[10]} 0 14
[junit4:junit4]   2> 14718 T791 C87 P19446 /update {wt=javabin&version=2} {add=[11 (1413171959453188096)]} 0 28
[junit4:junit4]   2> 14729 T829 C83 P19470 REQ /update {distrib.from=http://127.0.0.1:19462/solr/collection1/&update.distrib=FROMLEADER&wt=javabin&version=2} status=0 QTime=3 
[junit4:junit4]   2> 14730 T810 C84 P19462 /update {wt=javabin&version=2} {add=[11 (1413171959485693952)]} 0 9
[junit4:junit4]   2> 14737 T791 C87 P19446 /update {wt=javabin&version=2} {add=[12 (1413171959498276864)]} 0 4
[junit4:junit4]   2> 14749 T829 C83 P19470 REQ /update {distrib.from=http://127.0.0.1:19462/solr/collection1/&update.distrib=FROMLEADER&wt=javabin&version=2} status=0 QTime=3 
[junit4:junit4]   2> 14749 T810 C84 P19462 /update {wt=javabin&version=2} {add=[12 (1413171959506665472)]} 0 8
[junit4:junit4]   2> 14756 T791 C87 P19446 /update {wt=javabin&version=2} {add=[13 (1413171959519248384)]} 0 3
[junit4:junit4]   2> 14767 T829 C83 P19470 REQ /update {distrib.from=http://127.0.0.1:19462/solr/collection1/&update.distrib=FROMLEADER&wt=javabin&version=2} status=0 QTime=3 
[junit4:junit4]   2> 14768 T810 C84 P19462 /update {wt=javabin&version=2} {add=[13 (1413171959525539840)]} 0 9
[junit4:junit4]   2> 14774 T791 C87 P19446 /update {wt=javabin&version=2} {add=[14 (1413171959538122752)]} 0 3
[junit4:junit4]   2> 14789 T829 C83 P19470 REQ /update {update.distrib=FROMLEADER&distrib.from=http://127.0.0.1:19462/solr/collection1/&wt=javabin&version=2} status=0 QTime=2 
[junit4:junit4]   2> 14790 T807 C84 P19462 REQ /update {distrib.from=http://127.0.0.1:19467/solr/collection1/&update.distrib=TOLEADER&wt=javabin&version=2} status=0 QTime=10 
[junit4:junit4]   2> 14791 T819 C86 P19467 /update {wt=javabin&version=2} {add=[14]} 0 14
[junit4:junit4]   2> 14798 T791 C87 P19446 /update {wt=javabin&version=2} {add=[15 (1413171959562240000)]} 0 4
[junit4:junit4]   2> 14809 T829 C83 P19470 REQ /update {distrib.from=http://127.0.0.1:19462/solr/collection1/&update.distrib=FROMLEADER&wt=javabin&version=2} status=0 QTime=3 
[junit4:junit4]   2> 14811 T810 C84 P19462 /update {wt=javabin&version=2} {add=[15 (1413171959569580032)]} 0 10
[junit4:junit4]   2> 14818 T791 C87 P19446 /update {wt=javabin&version=2} {add=[16 (1413171959583211520)]} 0 4
[junit4:junit4]   2> 14835 T829 C83 P19470 REQ /update {update.distrib=FROMLEADER&distrib.from=http://127.0.0.1:19462/solr/collection1/&wt=javabin&version=2} status=0 QTime=3 
[junit4:junit4]   2> 14846 T807 C84 P19462 REQ /update {distrib.from=http://127.0.0.1:19467/solr/collection1/&update.distrib=TOLEADER&wt=javabin&version=2} status=0 QTime=20 
[junit4:junit4]   2> 14847 T819 C86 P19467 /update {wt=javabin&version=2} {add=[16]} 0 26
[junit4:junit4]   2> 14859 T791 C87 P19446 /update {wt=javabin&version=2} {add=[17 (1413171959623057408)]} 0 8
[junit4:junit4]   2> 14892 T842 C85 P19475 REQ /update {update.distrib=FROMLEADER&distrib.from=http://127.0.0.1:19467/solr/collection1/&wt=javabin&version=2} status=0 QTime=9 
[junit4:junit4]   2> 14894 T822 C86 P19467 REQ /update {distrib.from=http://127.0.0.1:19462/solr/collection1/&update.distrib=TOLEADER&wt=javabin&version=2} status=0 QTime=20 
[junit4:junit4]   2> 14895 T810 C84 P19462 /update {wt=javabin&version=2} {add=[17]} 0 24
[junit4:junit4]   2> 14900 T791 C87 P19446 /update {wt=javabin&version=2} {add=[100 (1413171959671291904)]} 0 2
[junit4:junit4]   2> 14971 T829 C83 P19470 REQ /update {distrib.from=http://127.0.0.1:19462/solr/collection1/&update.distrib=FROMLEADER&wt=javabin&version=2} status=0 QTime=21 
[junit4:junit4]   2> 14972 T810 C84 P19462 /update {wt=javabin&version=2} {add=[100 (1413171959676534784)]} 0 69
[junit4:junit4]   2> 14978 T791 C87 P19446 /update {wt=javabin&version=2} {add=[101 (1413171959753080832)]} 0 2
[junit4:junit4]   2> 14992 T829 C83 P19470 REQ /update {distrib.from=http://127.0.0.1:19462/solr/collection1/&update.distrib=FROMLEADER&wt=javabin&version=2} status=0 QTime=3 
[junit4:junit4]   2> 14993 T810 C84 P19462 /update {wt=javabin&version=2} {add=[101 (1413171959758323712)]} 0 12
[junit4:junit4]   2> 14999 T791 C87 P19446 /update {wt=javabin&version=2} {add=[102 (1413171959775100928)]} 0 2
[junit4:junit4]   2> 15010 T829 C83 P19470 REQ /update {distrib.from=http://127.0.0.1:19462/solr/collection1/&update.distrib=FROMLEADER&wt=javabin&version=2} status=0 QTime=2 
[junit4:junit4]   2> 15012 T810 C84 P19462 /update {wt=javabin&version=2} {add=[102 (1413171959780343808)]} 0 10
[junit4:junit4]   2> 15050 T791 C87 P19446 /update {wt=javabin&version=2} {add=[103 (1413171959793975296)]} 0 34
[junit4:junit4]   2> 15061 T842 C85 P19475 REQ /update {distrib.from=http://127.0.0.1:19467/solr/collection1/&update.distrib=FROMLEADER&wt=javabin&version=2} status=0 QTime=3 
[junit4:junit4]   2> 15063 T819 C86 P19467 /update {wt=javabin&version=2} {add=[103 (1413171959833821184)]} 0 10
[junit4:junit4]   2> 15071 T791 C87 P19446 /update {wt=javabin&version=2} {add=[104 (1413171959847452672)]} 0 5
[junit4:junit4]   2> 15082 T842 C85 P19475 REQ /update {distrib.from=http://127.0.0.1:19467/solr/collection1/&update.distrib=FROMLEADER&wt=javabin&version=2} status=0 QTime=3 
[junit4:junit4]   2> 15084 T819 C86 P19467 /update {wt=javabin&version=2} {add=[104 (1413171959855841280)]} 0 10
[junit4:junit4]   2> 15089 T791 C87 P19446 /update {wt=javabin&version=2} {add=[105 (1413171959869472768)]} 0 2
[junit4:junit4]   2> 15189 T842 C85 P19475 REQ /update {update.distrib=FROMLEADER&distrib.from=http://127.0.0.1:19467/solr/collection1/&wt=javabin&version=2} status=0 QTime=47 
[junit4:junit4]   2> 15190 T822 C86 P19467 REQ /update {distrib.from=http://127.0.0.1:19462/solr/collection1/&update.distrib=TOLEADER&wt=javabin&version=2} status=0 QTime=95 
[junit4:junit4]   2> 15191 T810 C84 P19462 /update {wt=javabin&version=2} {add=[105]} 0 99
[junit4:junit4]   2> 15196 T791 C87 P19446 /update {wt=javabin&version=2} {add=[106 (1413171959981670400)]} 0 2
[junit4:junit4]   2> 15214 T842 C85 P19475 REQ /update {update.distrib=FROMLEADER&distrib.from=http://127.0.0.1:19467/solr/collection1/&wt=javabin&version=2} status=0 QTime=6 
[junit4:junit4]   2> 15215 T822 C86 P19467 REQ /update {distrib.from=http://127.0.0.1:19462/solr/collection1/&update.distrib=TOLEADER&wt=javabin&version=2} status=0 QTime=13 
[junit4:junit4]   2> 15215 T810 C84 P19462 /update {wt=javabin&version=2} {add=[106]} 0 16
[junit4:junit4]   2> 15221 T791 C87 P19446 /update {wt=javabin&version=2} {add=[107 (1413171960007884800)]} 0 2
[junit4:junit4]   2> 15231 T829 C83 P19470 REQ /update {distrib.from=http://127.0.0.1:19462/solr/collection1/&update.distrib=FROMLEADER&wt=javabin&version=2} status=0 QTime=3 
[junit4:junit4]   2> 15232 T810 C84 P19462 /update {wt=javabin&version=2} {add=[107 (1413171960012079104)]} 0 8
[junit4:junit4]   2> 15237 T791 C87 P19446 /update {wt=javabin&version=2} {add=[108 (1413171960023613440)]} 0 2
[junit4:junit4]   2> 15248 T829 C83 P19470 REQ /update {distrib.from=http://127.0.0.1:19462/solr/collection1/&update.distrib=FROMLEADER&wt=javabin&version=2} status=0 QTime=3 
[junit4:junit4]   2> 15249 T810 C84 P19462 /update {wt=javabin&version=2} {add=[108 (1413171960029904896)]} 0 9
[junit4:junit4]   2> 15256 T791 C87 P19446 /update {wt=javabin&version=2} {add=[109 (1413171960043536384)]} 0 2
[junit4:junit4]   2> 15268 T829 C83 P19470 REQ /update {distrib.from=http://127.0.0.1:19462/solr/collection1/&update.distrib=FROMLEADER&wt=javabin&version=2} status=0 QTime=3 
[junit4:junit4]   2> 15269 T810 C84 P19462 /update {wt=javabin&version=2} {add=[109 (1413171960051924992)]} 0 8
[junit4:junit4]   2> 15275 T791 C87 P19446 /update {wt=javabin&version=2} {add=[110 (1413171960063459328)]} 0 3
[junit4:junit4]   2> 15288 T829 C83 P19470 REQ /update {update.distrib=FROMLEADER&distrib.from=http://127.0.0.1:19462/solr/collection1/&wt=javabin&version=2} status=0 QTime=3 
[junit4:junit4]   2> 15289 T807 C84 P19462 REQ /update {distrib.from=http://127.0.0.1:19467/solr/collection1/&update.distrib=TOLEADER&wt=javabin&version=2} status=0 QTime=8 
[junit4:junit4]   2> 15290 T819 C86 P19467 /update {wt=javabin&version=2} {add=[110]} 0 12
[junit4:junit4]   2> 15296 T791 C87 P19446 /update {wt=javabin&version=2} {add=[111 (1413171960085479424)]} 0 3
[junit4:junit4]   2> 15306 T829 C83 P19470 REQ /update {distrib.from=http://127.0.0.1:19462/solr/collection1/&update.distrib=FROMLEADER&wt=javabin&version=2} status=0 QTime=3 
[junit4:junit4]   2> 15307 T810 C84 P19462 /update {wt=javabin&version=2} {add=[111 (1413171960090722304)]} 0 8
[junit4:junit4]   2> 15313 T791 C87 P19446 /update {wt=javabin&version=2} {add=[112 (1413171960103305216)]} 0 3
[junit4:junit4]   2> 15323 T842 C85 P19475 REQ /update {distrib.from=http://127.0.0.1:19467/solr/collection1/&update.distrib=FROMLEADER&wt=javabin&version=2} status=0 QTime=2 
[junit4:junit4]   2> 15324 T819 C86 P19467 /update {wt=javabin&version=2} {add=[112 (1413171960109596672)]} 0 8
[junit4:junit4]   2> 15356 T791 C87 P19446 /update {wt=javabin&version=2} {add=[113 (1413171960121131008)]} 0 29
[junit4:junit4]   2> 15366 T829 C83 P19470 REQ /update {distrib.from=http://127.0.0.1:19462/solr/collection1/&update.distrib=FROMLEADER&wt=javabin&version=2} status=0 QTime=3 
[junit4:junit4]   2> 15367 T810 C84 P19462 /update {wt=javabin&version=2} {add=[113 (1413171960153636864)]} 0 8
[junit4:junit4]   2> 15373 T791 C87 P19446 /update {wt=javabin&version=2} {add=[114 (1413171960165171200)]} 0 4
[junit4:junit4]   2> 15383 T829 C83 P19470 REQ /update {distrib.from=http://127.0.0.1:19462/solr/collection1/&update.distrib=FROMLEADER&wt=javabin&version=2} status=0 QTime=1 
[junit4:junit4]   2> 15384 T810 C84 P19462 /update {wt=javabin&version=2} {add=[114 (1413171960173559808)]} 0 6
[junit4:junit4]   2> 15390 T791 C87 P19446 /update {wt=javabin&version=2} {add=[115 (1413171960185094144)]} 0 2
[junit4:junit4]   2> 15403 T842 C85 P19475 REQ /update {update.distrib=FROMLEADER&distrib.from=http://127.0.0.1:19467/solr/collection1/&wt=javabin&version=2} status=0 QTime=2 
[junit4:junit4]   2> 15404 T822 C86 P19467 REQ /update {distrib.from=http://127.0.0.1:19462/solr/collection1/&update.distrib=TOLEADER&wt=javabin&version=2} status=0 QTime=8 
[junit4:junit4]   2> 15405 T810 C84 P19462 /update {wt=javabin&version=2} {add=[115]} 0 12
[junit4:junit4]   2> 15410 T791 C87 P19446 /update {wt=javabin&version=2} {add=[116 (1413171960206065664)]} 0 2
[junit4:junit4]   2> 15423 T842 C85 P19475 REQ /update {update.distrib=FROMLEADER&distrib.from=http://127.0.0.1:19467/solr/collection1/&wt=javabin&version=2} status=0 QTime=2 
[junit4:junit4]   2> 15424 T822 C86 P19467 REQ /update {distrib.from=http://127.0.0.1:19462/solr/collection1/&update.distrib=TOLEADER&wt=javabin&version=2} status=0 QTime=8 
[junit4:junit4]   2> 15424 T810 C84 P19462 /update {wt=javabin&version=2} {add=[116]} 0 11
[junit4:junit4]   2> 15429 T791 C87 P19446 /update {wt=javabin&version=2} {add=[117 (1413171960224940032)]} 0 2
[junit4:junit4]   2> 15442 T842 C85 P19475 REQ /update {update.distrib=FROMLEADER&distrib.from=http://127.0.0.1:19467/solr/collection1/&wt=javabin&version=2} status=0 QTime=2 
[junit4:junit4]   2> 15443 T822 C86 P19467 REQ /update {distrib.from=http://127.0.0.1:19462/solr/collection1/&update.distrib=TOLEADER&wt=javabin&version=2} status=0 QTime=8 
[junit4:junit4]   2> 15444 T810 C84 P19462 /update {wt=javabin&version=2} {add=[117]} 0 12
[junit4:junit4]   2> 15449 T791 C87 P19446 /update {wt=javabin&version=2} {add=[118 (1413171960245911552)]} 0 2
[junit4:junit4]   2> 15509 T829 C83 P19470 REQ /update {update.distrib=FROMLEADER&distrib.from=http://127.0.0.1:19462/solr/collection1/&wt=javabin&version=2} status=0 QTime=23 
[junit4:junit4]   2> 15510 T807 C84 P19462 REQ /update {distrib.from=http://127.0.0.1:19467/solr/collection1/&update.distrib=TOLEADER&wt=javabin&version=2} status=0 QTime=55 
[junit4:junit4]   2> 15511 T819 C86 P19467 /update {wt=javabin&version=2} {add=[118]} 0 59
[junit4:junit4]   2> 15516 T791 C87 P19446 /update {wt=javabin&version=2} {add=[119 (1413171960317214720)]} 0 2
[junit4:junit4]   2> 15525 T842 C85 P19475 REQ /update {distrib.from=http://127.0.0.1:19467/solr/collection1/&update.distrib=FROMLEADER&wt=javabin&version=2} status=0 QTime=2 
[junit4:junit4]   2> 15526 T819 C86 P19467 /update {wt=javabin&version=2} {add=[119 (1413171960321409024)]} 0 7
[junit4:junit4]   2> 15531 T791 C87 P19446 /update {wt=javabin&version=2} {add=[120 (1413171960332943360)]} 0 2
[junit4:junit4]   2> 15543 T842 C85 P19475 REQ /update {update.distrib=FROMLEADER&distrib.from=http://127.0.0.1:19467/solr/collection1/&wt=javabin&version=2} status=0 QTime=2 
[junit4:junit4]   2> 15544 T822 C86 P19467 REQ /update {distrib.from=http://127.0.0.1:19462/solr/collection1/&update.distrib=TOLEADER&wt=javabin&version=2} status=0 QTime=7 
[junit4:junit4]   2> 15544 T810 C84 P19462 /update {wt=javabin&version=2} {add=[120]} 0 10
[junit4:junit4]   2> 15549 T791 C87 P19446 /update {wt=javabin&version=2} {add=[121 (1413171960351817728)]} 0 2
[junit4:junit4]   2> 15558 T842 C85 P19475 REQ /update {distrib.from=http://127.0.0.1:19467/solr/collection1/&update.distrib=FROMLEADER&wt=javabin&version=2} status=0 QTime=2 
[junit4:junit4]   2> 15559 T819 C86 P19467 /update {wt=javabin&version=2} {add=[121 (1413171960357060608)]} 0 7
[junit4:junit4]   2> 15564 T791 C87 P19446 /update {wt=javabin&version=2} {add=[122 (1413171960367546368)]} 0 2
[junit4:junit4]   2> 15576 T829 C83 P19470 REQ /update {distrib.from=http://127.0.0.1:19462/solr/collection1/&update.distrib=FROMLEADER&wt=javabin&version=2} status=0 QTime=3 
[junit4:junit4]   2> 15577 T810 C84 P19462 /update {wt=javabin&version=2} {add=[122 (1413171960372789248)]} 0 10
[junit4:junit4]   2> 15609 T791 C87 P19446 /update {wt=javabin&version=2} {add=[123 (1413171960386420736)]} 0 29
[junit4:junit4]   2> 15617 T829 C83 P19470 REQ /update {distrib.from=http://127.0.0.1:19462/solr/collection1/&update.distrib=FROMLEADER&wt=javabin&version=2} status=0 QTime=1 
[junit4:junit4]   2> 15618 T810 C84 P19462 /update {wt=javabin&version=2} {add=[123 (1413171960419975168)]} 0 6
[junit4:junit4]   2> 15625 T791 C87 P19446 /update {wt=javabin&version=2} {add=[124 (1413171960429412352)]} 0 4
[junit4:junit4]   2> 15639 T829 C83 P19470 REQ /update {update.distrib=FROMLEADER&distrib.from=http://127.0.0.1:19462/solr/collection1/&wt=javabin&version=2} status=0 QTime=2 
[junit4:junit4]   2> 15640 T807 C84 P19462 REQ /update {distrib.from=http://127.0.0.1:19467/solr/collection1/&update.distrib=TOLEADER&wt=javabin&version=2} status=0 QTime=8 
[junit4:junit4]   2> 15641 T819 C86 P19467 /update {wt=javabin&version=2} {add=[124]} 0 13
[junit4:junit4]   2> 15646 T791 C87 P19446 /update {wt=javabin&version=2} {add=[125 (1413171960452481024)]} 0 1
[junit4:junit4]   2> 15655 T829 C83 P19470 REQ /update {distrib.from=http://127.0.0.1:19462/solr/collection1/&update.distrib=FROMLEADER&wt=javabin&version=2} status=0 QTime=3 
[junit4:junit4]   2> 15656 T810 C84 P19462 /update {wt=javabin&version=2} {add=[125 (1413171960456675328)]} 0 8
[junit4:junit4]   2> 15661 T791 C87 P19446 /update {wt=javabin&version=2} {add=[126 (1413171960468209664)]} 0 2
[junit4:junit4]   2> 15667 T842 C85 P19475 REQ /update {distrib.from=http://127.0.0.1:19467/solr/collection1/&update.distrib=FROMLEADER&wt=javabin&version=2} status=0 QTime=1 
[junit4:junit4]   2> 15668 T819 C86 P19467 /update {wt=javabin&version=2} {add=[126 (1413171960472403968)]} 0 5
[junit4:junit4]   2> 15672 T791 C87 P19446 /update {wt=javabin&version=2} {add=[127 (1413171960480792576)]} 0 1
[junit4:junit4]   2> 15720 T842 C85 P19475 REQ /update {update.distrib=FROMLEADER&distrib.from=http://127.0.0.1:19467/solr/collection1/&wt=javabin&version=2} status=0 QTime=21 
[junit4:junit4]   2> 15721 T822 C86 P19467 REQ /update {distrib.from=http://127.0.0.1:19462/solr/collection1/&update.distrib=TOLEADER&wt=javabin&version=2} status=0 QTime=44 
[junit4:junit4]   2> 15722 T810 C84 P19462 /update {wt=javabin&version=2} {add=[127]} 0 47
[junit4:junit4]   2> 15727 T791 C87 P19446 /update {wt=javabin&version=2} {add=[128 (1413171960538464256)]} 0 2
[junit4:junit4]   2> 15739 T842 C85 P19475 REQ /update {distrib.from=http://127.0.0.1:19467/solr/collection1/&update.distrib=FROMLEADER&wt=javabin&version=2} status=0 QTime=3 
[junit4:junit4]   2> 15740 T819 C86 P19467 /update {wt=javabin&version=2} {add=[128 (1413171960542658560)]} 0 10
[junit4:junit4]   2> 15744 T791 C87 P19446 /update {wt=javabin&version=2} {add=[129 (1413171960556290048)]} 0 1
[junit4:junit4]   2> 15752 T829 C83 P19470 REQ /update {distrib.from=http://127.0.0.1:19462/solr/collection1/&update.distrib=FROMLEADER&wt=javabin&version=2} status=0 QTime=2 
[junit4:junit4]   2> 15752 T810 C84 P19462 /update {wt=javabin&version=2} {add=[129 (1413171960560484352)]} 0 5
[junit4:junit4]   2> 15756 T791 C87 P19446 /update {wt=javabin&version=2} {add=[130 (1413171960568872960)]} 0 1
[junit4:junit4]   2> 15765 T842 C85 P19475 REQ /update {update.distrib=FROMLEADER&distrib.from=http://127.0.0.1:19467/solr/collection1/&wt=javabin&version=2} status=0 QTime=1 
[junit4:junit4]   2> 15766 T822 C86 P19467 REQ /update {distrib.from=http://127.0.0.1:19462/solr/collection1/&update.distrib=TOLEADER&wt=javabin&version=2} status=0 QTime=5 
[junit4:junit4]   2> 15767 T810 C84 P19462 /update {wt=javabin&version=2} {add=[130]} 0 8
[junit4:junit4]   2> 15771 T791 C87 P19446 /update {wt=javabin&version=2} {add=[131 (1413171960583553024)]} 0 1
[junit4:junit4]   2> 15778 T842 C85 P19475 REQ /update {distrib.from=http://127.0.0.1:19467/solr/collection1/&update.distrib=FROMLEADER&wt=javabin&version=2} status=0 QTime=1 
[junit4:junit4]   2> 15779 T819 C86 P19467 /update {wt=javabin&version=2} {add=[131 (1413171960587747328)]} 0 6
[junit4:junit4]   2> 15784 T791 C87 P19446 /update {wt=javabin&version=2} {add=[132 (1413171960598233088)]} 0 2
[junit4:junit4]   2> 15794 T829 C83 P19470 REQ /update {update.distrib=FROMLEADER&distrib.from=http://127.0.0.1:19462/solr/collection1/&wt=javabin&version=2} status=0 QTime=1 
[junit4:junit4]   2> 15795 T807 C84 P19462 REQ /update {distrib.from=http://127.0.0.1:19467/solr/collection1/&update.distrib=TOLEADER&wt=javabin&version=2} status=0 QTime=5 
[junit4:junit4]   2> 15796 T819 C86 P19467 /update {wt=javabin&version=2} {add=[132]} 0 9
[junit4:junit4]   2> 15826 T791 C87 P19446 /update {wt=javabin&version=2} {add=[133 (1413171960615010304)]} 0 28
[junit4:junit4]   2> 15838 T829 C83 P19470 REQ /update {update.distrib=FROMLEADER&distrib.from=http://127.0.0.1:19462/solr/collection1/&wt=javabin&version=2} status=0 QTime=2 
[junit4:junit4]   2> 15839 T807 C84 P19462 REQ /update {distrib.from=http://127.0.0.1:19467/solr/collection1/&update.distrib=TOLEADER&wt=javabin&version=2} status=0 QTime=7 
[junit4:junit4]   2> 15848 T819 C86 P19467 /update {wt=javabin&version=2} {add=[133]} 0 19
[junit4:junit4]   2> 15856 T791 C87 P19446 /update {wt=javabin&version=2} {add=[134 (1413171960670584832)]} 0 5
[junit4:junit4]   2> 15866 T842 C85 P19475 REQ /update {distrib.from=http://127.0.0.1:19467/solr/collection1/&update.distrib=FROMLEADER&wt=javabin&version=2} status=0 QTime=2 
[junit4:junit4]   2> 15867 T819 C86 P19467 /update {wt=javabin&version=2} {add=[134 (1413171960678973440)]} 0 8
[junit4:junit4]   2> 15872 T791 C87 P19446 /update {wt=javabin&version=2} {add=[135 (1413171960689459200)]} 0 2
[junit4:junit4]   2> 15885 T829 C83 P19470 REQ /update {update.distrib=FROMLEADER&distrib.from=http://127.0.0.1:19462/solr/collection1/&wt=javabin&version=2} status=0 QTime=2 
[junit4:junit4]   2> 15886 T807 C84 P19462 REQ /update {distrib.from=http://127.0.0.1:19467/solr/collection1/&update.distrib=TOLEADER&wt=javabin&version=2} status=0 QTime=8 
[junit4:junit4]   2> 15887 T819 C86 P19467 /update {wt=javabin&version=2} {add=[135]} 0 12
[junit4:junit4]   2> 15892 T791 C87 P19446 /update {wt=javabin&version=2} {add=[136 (1413171960711479296)]} 0 2
[junit4:junit4]   2> 15901 T842 C85 P19475 REQ /update {distrib.from=http://127.0.0.1:19467/solr/collection1/&update.distrib=FROMLEADER&wt=javabin&version=2} status=0 QTime=1 
[junit4:junit4]   2> 15901 T819 C86 P19467 /update {wt=javabin&version=2} {add=[136 (1413171960715673600)]} 0 6
[junit4:junit4]   2> 15906 T791 C87 P19446 /update {wt=javabin&version=2} {add=[137 (1413171960725110784)]} 0 2
[junit4:junit4]   2> 15915 T842 C85 P19475 REQ /update {update.distrib=FROMLEADER&distrib.from=http://127.0.0.1:19467/solr/collection1/&wt=javabin&version=2} status=0 QTime=2 
[junit4:junit4]   2> 15915 T822 C86 P19467 REQ /update {distrib.from=http://127.0.0.1:19462/solr/collection1/&update.distrib=TOLEADER&wt=javabin&version=2} status=0 QTime=6 
[junit4:junit4]   2> 15916 T810 C84 P19462 /update {wt=javabin&version=2} {add=[137]} 0 9
[junit4:junit4]   2> 15921 T791 C87 P19446 /update {wt=javabin&version=2} {add=[138 (1413171960740839424)]} 0 2
[junit4:junit4]   2> 15930 T829 C83 P19470 REQ /update {distrib.from=http://127.0.0.1:19462/solr/collection1/&update.distrib=FROMLEADER&wt=javabin&version=2} status=0 QTime=1 
[junit4:junit4]   2> 15931 T810 C84 P19462 /update {wt=javabin&version=2} {add=[138 (1413171960747130880)]} 0 7
[junit4:junit4]   2> 15935 T791 C87 P19446 /update {wt=javabin&version=2} {add=[139 (1413171960756568064)]} 0 1
[junit4:junit4]   2> 15944 T842 C85 P19475 REQ /update {distrib.from=http://127.0.0.1:19467/solr/collection1/&update.distrib=FROMLEADER&wt=javabin&version=2} status=0 QTime=2 
[junit4:junit4]   2> 15945 T819 C86 P19467 /update {wt=javabin&version=2} {add=[139 (1413171960760762368)]} 0 7
[junit4:junit4]   2> 15950 T791 C87 P19446 /update {wt=javabin&version=2} {add=[140 (1413171960771248128)]} 0 2
[junit4:junit4]   2> 15957 T842 C85 P19475 REQ /update {distrib.from=http://127.0.0.1:19467/solr/collection1/&update.distrib=FROMLEADER&wt=javabin&version=2} status=0 QTime=2 
[junit4:junit4]   2> 15957 T819 C86 P19467 /update {wt=javabin&version=2} {add=[140 (1413171960775442432)]} 0 5
[junit4:junit4]   2> 15961 T791 C87 P19446 /update {wt=javabin&version=2} {add=[141 (1413171960783831040)]} 0 1
[junit4:junit4]   2> 15972 T842 C85 P19475 REQ /update {update.distrib=FROMLEADER&distrib.from=http://127.0.0.1:19467/solr/collection1/&wt=javabin&version=2} status=0 QTime=1 
[junit4:junit4]   2> 15973 T822 C86 P19467 REQ /update {distrib.from=http://127.0.0.1:19462/solr/collection1/&update.distrib=TOLEADER&wt=javabin&version=2} status=0 QTime=7 
[junit4:junit4]   2> 15974 T810 C84 P19462 /update {wt=javabin&version=2} {add=[141]} 0 10
[junit4:junit4]   2> 15978 T791 C87 P19446 /update {wt=javabin&version=2} {add=[142 (1413171960801656832)]} 0 1
[junit4:junit4]   2> 16018 T842 C85 P19475 REQ /update {distrib.from=http://127.0.0.1:19467/solr/collection1/&update.distrib=FROMLEADER&wt=javabin&version=2} status=0 QTime=16 
[junit4:junit4]   2> 16019 T819 C86 P19467 /update {wt=javabin&version=2} {add=[142 (1413171960805851136)]} 0 38
[junit4:junit4]   2> 16037 T791 C87 P19446 /update {wt=javabin&version=2} {add=[143 (1413171960847794176)]} 0 16
[junit4:junit4]   2> 16047 T842 C85 P19475 REQ /update {distrib.from=http://127.0.0.1:19467/solr/collection1/&update.distrib=FROMLEADER&wt=javabin&version=2} status=0 QTime=2 
[junit4:junit4]   2> 16048 T819 C86 P19467 /update {wt=javabin&version=2} {add=[143 (1413171960867717120)]} 0 8
[junit4:junit4]   2> 16052 T791 C87 P19446 /update {wt=javabin&version=2} {add=[144 (1413171960878202880)]} 0 2
[junit4:junit4]   2> 16062 T842 C85 P19475 REQ /update {update.distrib=FROMLEADER&distrib.from=http://127.0.0.1:19467/solr/collection1/&wt=javabin&version=2} status=0 QTime=1 
[junit4:junit4]   2> 16063 T822 C86 P19467 REQ /update {distrib.from=http://127.0.0.1:19462/solr/collection1/&update.distrib=TOLEADER&wt=javabin&version=2} status=0 QTime=6 
[junit4:junit4]   2> 16063 T810 C84 P19462 /update {wt=javabin&version=2} {add=[144]} 0 8
[junit4:junit4]   2> 16067 T791 C87 P19446 /update {wt=javabin&version=2} {add=[145 (1413171960894980096)]} 0 1
[junit4:junit4]   2> 16074 T842 C85 P19475 REQ /update {distrib.from=http://127.0.0.1:19467/solr/collection1/&update.distrib=FROMLEADER&wt=javabin&version=2} status=0 QTime=1 
[junit4:junit4]   2> 16075 T819 C86 P19467 /update {wt=javabin&version=2} {add=[145 (1413171960899174400)]} 0 5
[junit4:junit4]   2> 16078 T791 C87 P19446 /update {wt=javabin&version=2} {add=[146 (1413171960906514432)]} 0 1
[junit4:junit4]   2> 16114 T829 C83 P19470 REQ /update {distrib.from=http://127.0.0.1:19462/solr/collection1/&update.distrib=FROMLEADER&wt=javabin&version=2} status=0 QTime=15 
[junit4:junit4]   2> 16115 T810 C84 P19462 /update {wt=javabin&version=2} {add=[146 (1413171960910708736)]} 0 34
[junit4:junit4]   2> 16119 T791 C87 P19446 /update {wt=javabin&version=2} {add=[147 (1413171960949506048)]} 0 1
[junit4:junit4]   2> 16129 T842 C85 P19475 REQ /update {update.distrib=FROMLEADER&distrib.from=http://127.0.0.1:19467/solr/collection1/&wt=javabin&version=2} status=0 QTime=1 
[junit4:junit4]   2> 16130 T822 C86 P19467 REQ /update {distrib.from=http://127.0.0.1:19462/solr/collection1/&update.distrib=TOLEADER&wt=javabin&version=2} status=0 QTime=6 
[junit4:junit4]   2> 16130 T810 C84 P19462 /update {wt=javabin&version=2} {add=[147]} 0 8
[junit4:junit4]   2> 16134 T791 C87 P19446 /update {wt=javabin&version=2} {add=[148 (1413171960965234688)]} 0 1
[junit4:junit4]   2> 16149 T829 C83 P19470 REQ /update {update.distrib=FROMLEADER&distrib.from=http://127.0.0.1:19462/solr/collection1/&wt=javabin&version=2} status=0 QTime=3 
[junit4:junit4]   2> 16150 T807 C84 P19462 REQ /update {distrib.from=http://127.0.0.1:19467/solr/collection1/&update.distrib=TOLEADER&wt=javabin&version=2} status=0 QTime=9 
[junit4:junit4]   2> 16150 T819 C86 P19467 /update {wt=javabin&version=2} {add=[148]} 0 13
[junit4:junit4]   2> 16154 T791 C87 P19446 /update {wt=javabin&version=2} {add=[149 (1413171960986206208)]} 0 1
[junit4:junit4]   2> 16163 T842 C85 P19475 REQ /update {distrib.from=http://127.0.0.1:19467/solr/collection1/&update.distrib=FROMLEADER&wt=javabin&version=2} status=0 QTime=2 
[junit4:junit4]   2> 16163 T819 C86 P19467 /update {wt=javabin&version=2} {add=[149 (1413171960991449088)]} 0 6
[junit4:junit4]   2> 16164 T779 oasc.AbstractDistribZkTestBase.waitForRecoveriesToFinish Wait for recoveries to finish - collection: collection1 failOnTimeout:true timeout (sec):1440
[junit4:junit4]   2> 16165 T779 oascc.ZkStateReader.updateClusterState Updating cloud state from ZooKeeper... 
[junit4:junit4]   2> 16168 T791 C87 P19446 oasu.DirectUpdateHandler2.commit start commit{flags=0,_version_=0,optimize=false,openSearcher=true,waitSearcher=true,expungeDeletes=false,softCommit=false}
[junit4:junit4]   2> 17060 T791 C87 P19446 oasc.SolrDeletionPolicy.onCommit SolrDeletionPolicy.onCommit: commits:num=2
[junit4:junit4]   2> 		commit{dir=/usr/home/hudson/hudson-slave/workspace/Lucene-Solr-Tests-trunk-java7/solr/build/solr-core/test/J1/org.apache.solr.cloud.BasicDistributedZk2Test-1347705787709/control/data/index,segFN=segments_2,generation=2,filenames=[_0_MockVariableIntBlock_0.doc, _0_MockVariableIntBlock_0.skp, _0_Lucene40_0.prx, _0_Pulsing40_0.prx, _0_Pulsing40_0.frq, _0_MockVariableIntBlock_0.pyl, _0_Lucene40_0.frq, _0_MockVariableIntBlock_0.tib, _0_Pulsing40_0.tip, _0_MockVariableIntBlock_0.pos, _0.si, _0_MockVariableIntBlock_0.tii, _0_Lucene40_0.tim, _0.fnm, _0_Pulsing40_0.tim, _0_nrm.cfs, _0_Direct_0.frq, _0_Lucene40_0.tip, _0_nrm.cfe, _0_MockVariableIntBlock_0.frq, segments_2, _0_Direct_0.tip, _0.fdx, _0_Direct_0.prx, _0_Direct_0.tim, _0.fdt]
[junit4:junit4]   2> 		commit{dir=/usr/home/hudson/hudson-slave/workspace/Lucene-Solr-Tests-trunk-java7/solr/build/solr-core/test/J1/org.apache.solr.cloud.BasicDistributedZk2Test-1347705787709/control/data/index,segFN=segments_3,generation=3,filenames=[_5_nrm.cfe, _3_MockVariableIntBlock_0.frq, _6_Direct_0.tip, _6_Direct_0.tim, _3.fdt, _4_MockVariableIntBlock_0.tii, _7.fnm, _3_Lucene40_0.frq, _5_Pulsing40_0.tip, _5_Pulsing40_0.tim, _6_MockVariableIntBlock_0.tii, _0_Lucene40_0.tim, _5_Direct_0.prx, _0_Pulsing40_0.tim, _6_MockVariableIntBlock_0.tib, _1_MockVariableIntBlock_0.tii, _0_Lucene40_0.tip, _1_MockVariableIntBlock_0.tib, _1.fdx, _4_MockVariableIntBlock_0.tib, _1.fdt, _5_nrm.cfs, _0_MockVariableIntBlock_0.frq, _6.fdt, _3_Pulsing40_0.frq, _2.si, _1_MockVariableIntBlock_0.skp, _2_Pulsing40_0.tim, _7_MockVariableIntBlock_0.pos, _0_MockVariableIntBlock_0.doc, _2_Pulsing40_0.tip, _6.fdx, _1_MockVariableIntBlock_0.pyl, _3_MockVariableIntBlock_0.tii, _2_nrm.cfe, _5_Pulsing40_0.frq, _0_MockVariableIntBlock_0.pos, _0_Pulsing40_0.tip, _2_nrm.cfs, _7_MockVariableIntBlock_0.skp, _4_MockVariableIntBlock_0.frq, _1_Direct_0.prx, _2.fnm, _5_MockVariableIntBlock_0.frq, _7_Pulsing40_0.tim, _3.fdx, _4_Pulsing40_0.tip, _4_Pulsing40_0.tim, _1.si, _0_Direct_0.tip, _0_Direct_0.prx, _5_Lucene40_0.prx, _0_Direct_0.tim, _7_Pulsing40_0.tip, _1_Direct_0.frq, _3_MockVariableIntBlock_0.pos, _3_nrm.cfe, _5_MockVariableIntBlock_0.pyl, _4_nrm.cfe, _0_Pulsing40_0.prx, _4.fdx, _4_Direct_0.frq, _1_Pulsing40_0.prx, _7_Direct_0.tim, _7_MockVariableIntBlock_0.tii, _1_Direct_0.tim, _6_MockVariableIntBlock_0.frq, _7_Direct_0.tip, _1_Direct_0.tip, _3_Direct_0.tip, _3_MockVariableIntBlock_0.doc, _0_Direct_0.frq, _6_Lucene40_0.frq, _1_Lucene40_0.prx, _5.si, _3_nrm.cfs, _4_MockVariableIntBlock_0.pyl, _6_Pulsing40_0.prx, _4_nrm.cfs, _3_MockVariableIntBlock_0.tib, _6_Lucene40_0.prx, _3_Direct_0.tim, _5_MockVariableIntBlock_0.doc, _6_MockVariableIntBlock_0.pyl, _2_MockVariableIntBlock_0.frq, _6_nrm.cfs, _7_nrm.cfs, _3_Lucene40_0.prx, _1_nrm.cfs, _5.fnm, _7_nrm.cfe, _6_nrm.cfe, _4.fdt, _4.si, _1_nrm.cfe, _2_Direct_0.prx, _4_Pulsing40_0.frq, _2_Direct_0.frq, _2_Direct_0.tip, _2_Direct_0.tim, _7.si, _0_Lucene40_0.prx, _0_Pulsing40_0.frq, _5_MockVariableIntBlock_0.tii, _4_MockVariableIntBlock_0.doc, _3_Pulsing40_0.tip, _2.fdt, _7.fdx, _7_MockVariableIntBlock_0.frq, _2.fdx, _7.fdt, _3_Pulsing40_0.tim, _7_Pulsing40_0.frq, _2_Lucene40_0.prx, _3.si, _2_MockVariableIntBlock_0.skp, _5_Direct_0.tim, _2_MockVariableIntBlock_0.pyl, _3.fnm, _2_MockVariableIntBlock_0.doc, _0_MockVariableIntBlock_0.pyl, _4_Pulsing40_0.prx, _5_Lucene40_0.tim, _0_Lucene40_0.frq, _5_Lucene40_0.tip, _1_MockVariableIntBlock_0.doc, _7_Lucene40_0.tim, _5_Direct_0.tip, _7_Lucene40_0.tip, _3_Lucene40_0.tip, _2_MockVariableIntBlock_0.tii, _7_MockVariableIntBlock_0.pyl, _3_Lucene40_0.tim, _5_MockVariableIntBlock_0.tib, _7_Lucene40_0.frq, _2_MockVariableIntBlock_0.tib, _1_MockVariableIntBlock_0.pos, _1_Lucene40_0.frq, _6_Direct_0.prx, _2_Lucene40_0.frq, _5_Pulsing40_0.prx, _3_MockVariableIntBlock_0.pyl, _6.fnm, _6.si, _7_MockVariableIntBlock_0.tib, _1_Lucene40_0.tim, _3_Direct_0.frq, _5.fdt, _6_Lucene40_0.tim, _1_Pulsing40_0.tip, _6_Pulsing40_0.frq, _6_Lucene40_0.tip, _1_Pulsing40_0.tim, _4.fnm, _0_MockVariableIntBlock_0.skp, _1.fnm, _7_Pulsing40_0.prx, _7_MockVariableIntBlock_0.doc, _1_Lucene40_0.tip, _1_Pulsing40_0.frq, _2_Lucene40_0.tip, _6_Pulsing40_0.tim, _6_Pulsing40_0.tip, _3_Direct_0.prx, _2_Lucene40_0.tim, _2_Pulsing40_0.prx, _6_MockVariableIntBlock_0.doc, _2_MockVariableIntBlock_0.pos, _5_Lucene40_0.frq, _0.fnm, _5_MockVariableIntBlock_0.pos, _4_Direct_0.tim, _5_Direct_0.frq, _2_Pulsing40_0.frq, _4_Direct_0.prx, _7_Direct_0.frq, _4_Lucene40_0.frq, _4_Direct_0.tip, _7_Lucene40_0.prx, _4_MockVariableIntBlock_0.skp, _0_MockVariableIntBlock_0.tib, _5_MockVariableIntBlock_0.skp, _4_MockVariableIntBlock_0.pos, _6_MockVariableIntBlock_0.pos, _4_Lucene40_0.tip, _0.si, _4_Lucene40_0.tim, _0_MockVariableIntBlock_0.tii, _4_Lucene40_0.prx, _0_nrm.cfs, _6_MockVariableIntBlock_0.skp, _1_MockVariableIntBlock_0.frq, _3_Pulsing40_0.prx, _7_Direct_0.prx, _0_nrm.cfe, _5.fdx, _0.fdx, _3_MockVariableIntBlock_0.skp, _6_Direct_0.frq, segments_3, _0.fdt]
[junit4:junit4]   2> 17062 T791 C87 P19446 oasc.SolrDeletionPolicy.updateCommits newest commit = 3
[junit4:junit4]   2> 17267 T791 C87 P19446 oass.SolrIndexSearcher.<init> Opening Searcher@60d502cf main
[junit4:junit4]   2> 17268 T791 C87 P19446 oasu.DirectUpdateHandler2.commit end_commit_flush
[junit4:junit4]   2> 17271 T802 oasc.SolrCore.registerSearcher [collection1] Registered new searcher Searcher@60d502cf main{StandardDirectoryReader(segments_3:17 _0(5.0):C1 _1(5.0):C10 _2(5.0):C10 _3(5.0):C10 _4(5.0):C10 _5(5.0):C10 _6(5.0):C10 _7(5.0):C6)}
[junit4:junit4]   2> 17272 T791 C87 P19446 /update {waitSearcher=true&wt=javabin&commit=true&softCommit=false&version=2} {commit=} 0 1104
[junit4:junit4]   2> 17275 T810 C84 P19462 oasu.DirectUpdateHandler2.commit start commit{flags=0,_version_=0,optimize=false,openSearcher=true,waitSearcher=true,expungeDeletes=false,softCommit=false}
[junit4:junit4]   2> 17419 T810 C84 P19462 oasc.SolrDeletionPolicy.onCommit SolrDeletionPolicy.onCommit: commits:num=2
[junit4:junit4]   2> 		commit{dir=/usr/home/hudson/hudson-slave/workspace/Lucene-Solr-Tests-trunk-java7/solr/build/solr-core/test/J1/org.apache.solr.cloud.BasicDistributedZk2Test-1347705787709/jetty1/index,segFN=segments_2,generation=2,filenames=[_0_MockVariableIntBlock_0.doc, _0_MockVariableIntBlock_0.skp, _0_Lucene40_0.prx, _0_Pulsing40_0.prx, _0_Pulsing40_0.frq, _0_MockVariableIntBlock_0.pyl, _0_Lucene40_0.frq, _0_MockVariableIntBlock_0.tib, _0_Pulsing40_0.tip, _0_MockVariableIntBlock_0.pos, _0.si, _0_MockVariableIntBlock_0.tii, _0_Lucene40_0.tim, _0.fnm, _0_Pulsing40_0.tim, _0_nrm.cfs, _0_Direct_0.frq, _0_Lucene40_0.tip, _0_nrm.cfe, _0_MockVariableIntBlock_0.frq, segments_2, _0_Direct_0.tip, _0.fdx, _0_Direct_0.prx, _0_Direct_0.tim, _0.fdt]
[junit4:junit4]   2> 		commit{dir=/usr/home/hudson/hudson-slave/workspace/Lucene-Solr-Tests-trunk-java7/solr/build/solr-core/test/J1/org.apache.solr.cloud.BasicDistributedZk2Test-1347705787709/jetty1/index,segFN=segments_3,generation=3,filenames=[_2_Direct_0.tip, _2_Direct_0.tim, _3_MockVariableIntBlock_0.frq, _3.fdt, _4_MockVariableIntBlock_0.tii, _0_Lucene40_0.prx, _0_Pulsing40_0.frq, _3_Lucene40_0.frq, _0_Lucene40_0.tim, _0_Pulsing40_0.tim, _1_MockVariableIntBlock_0.tii, _4_MockVariableIntBlock_0.doc, _2.fdt, _3_Pulsing40_0.tip, _2.fdx, _3_Pulsing40_0.tim, _1_MockVariableIntBlock_0.tib, _0_Lucene40_0.tip, _1.fdx, _4_MockVariableIntBlock_0.tib, _1.fdt, _2_Lucene40_0.prx, _0_MockVariableIntBlock_0.frq, _3.si, _2_MockVariableIntBlock_0.skp, _1_MockVariableIntBlock_0.skp, _2.si, _3_Pulsing40_0.frq, _2_Pulsing40_0.tim, _2_MockVariableIntBlock_0.pyl, _0_MockVariableIntBlock_0.doc, _2_Pulsing40_0.tip, _1_MockVariableIntBlock_0.pyl, _3.fnm, _2_MockVariableIntBlock_0.doc, _3_MockVariableIntBlock_0.tii, _4_Pulsing40_0.prx, _0_MockVariableIntBlock_0.pyl, _2_nrm.cfe, _0_Lucene40_0.frq, _1_MockVariableIntBlock_0.doc, _0_Pulsing40_0.tip, _0_MockVariableIntBlock_0.pos, _2_nrm.cfs, _2_MockVariableIntBlock_0.tii, _3_Lucene40_0.tip, _3_Lucene40_0.tim, _2_MockVariableIntBlock_0.tib, _1_MockVariableIntBlock_0.pos, _4_MockVariableIntBlock_0.frq, _1_Lucene40_0.frq, _1_Direct_0.prx, _2.fnm, _3.fdx, _4_Pulsing40_0.tip, _4_Pulsing40_0.tim, _2_Lucene40_0.frq, _1.si, _3_MockVariableIntBlock_0.pyl, _0_Direct_0.tip, _0_Direct_0.prx, _0_Direct_0.tim, _3_MockVariableIntBlock_0.pos, _1_Direct_0.frq, _1_Lucene40_0.tim, _3_nrm.cfe, _3_Direct_0.frq, _1_Pulsing40_0.tip, _1_Pulsing40_0.tim, _4_nrm.cfe, _4.fnm, _0_MockVariableIntBlock_0.skp, _0_Pulsing40_0.prx, _1.fnm, _1_Lucene40_0.tip, _4.fdx, _1_Pulsing40_0.frq, _2_Lucene40_0.tip, _4_Direct_0.frq, _1_Pulsing40_0.prx, _1_Direct_0.tim, _3_Direct_0.prx, _2_Lucene40_0.tim, _1_Direct_0.tip, _2_Pulsing40_0.prx, _2_MockVariableIntBlock_0.pos, _3_Direct_0.tip, _0.fnm, _4_Direct_0.tim, _3_MockVariableIntBlock_0.doc, _0_Direct_0.frq, _2_Pulsing40_0.frq, _1_Lucene40_0.prx, _3_nrm.cfs, _4_MockVariableIntBlock_0.pyl, _4_Direct_0.prx, _4_Lucene40_0.frq, _4_nrm.cfs, _4_Direct_0.tip, _3_MockVariableIntBlock_0.tib, _3_Direct_0.tim, _2_MockVariableIntBlock_0.frq, _4_Moc

[...truncated too long message...]

unit4]   2> 	at org.apache.solr.handler.ReplicationHandler.getIndexSize(ReplicationHandler.java:477)
[junit4:junit4]   2> 	at org.apache.solr.handler.ReplicationHandler.getStatistics(ReplicationHandler.java:525)
[junit4:junit4]   2> 	at org.apache.solr.core.RequestHandlers$LazyRequestHandlerWrapper.getStatistics(RequestHandlers.java:310)
[junit4:junit4]   2> 	at org.apache.solr.core.JmxMonitoredMap$SolrDynamicMBean.getMBeanInfo(JmxMonitoredMap.java:231)
[junit4:junit4]   2> 	at com.sun.jmx.interceptor.DefaultMBeanServerInterceptor.getClassName(DefaultMBeanServerInterceptor.java:1804)
[junit4:junit4]   2> 	at com.sun.jmx.interceptor.DefaultMBeanServerInterceptor.safeGetClassName(DefaultMBeanServerInterceptor.java:1595)
[junit4:junit4]   2> 	at com.sun.jmx.interceptor.DefaultMBeanServerInterceptor.checkMBeanPermission(DefaultMBeanServerInterceptor.java:1813)
[junit4:junit4]   2> 	at com.sun.jmx.interceptor.DefaultMBeanServerInterceptor.exclusiveUnregisterMBean(DefaultMBeanServerInterceptor.java:430)
[junit4:junit4]   2> 	at com.sun.jmx.interceptor.DefaultMBeanServerInterceptor.unregisterMBean(DefaultMBeanServerInterceptor.java:415)
[junit4:junit4]   2> 	at com.sun.jmx.mbeanserver.JmxMBeanServer.unregisterMBean(JmxMBeanServer.java:536)
[junit4:junit4]   2> 	at org.apache.solr.core.JmxMonitoredMap.unregister(JmxMonitoredMap.java:175)
[junit4:junit4]   2> 	at org.apache.solr.core.JmxMonitoredMap.clear(JmxMonitoredMap.java:116)
[junit4:junit4]   2> 	at org.apache.solr.core.SolrCore.close(SolrCore.java:864)
[junit4:junit4]   2> 	at org.apache.solr.cloud.ShardLeaderElectionContext.runLeaderProcess(ElectionContext.java:213)
[junit4:junit4]   2> 	at org.apache.solr.cloud.LeaderElector.runIamLeaderProcess(LeaderElector.java:158)
[junit4:junit4]   2> 	at org.apache.solr.cloud.LeaderElector.checkIfIamLeader(LeaderElector.java:102)
[junit4:junit4]   2> 	at org.apache.solr.cloud.LeaderElector.access$000(LeaderElector.java:56)
[junit4:junit4]   2> 	at org.apache.solr.cloud.LeaderElector$1.process(LeaderElector.java:131)
[junit4:junit4]   2> 	at org.apache.zookeeper.ClientCnxn$EventThread.processEvent(ClientCnxn.java:526)
[junit4:junit4]   2> 	at org.apache.zookeeper.ClientCnxn$EventThread.run(ClientCnxn.java:502)
[junit4:junit4]   2> 
[junit4:junit4]   2> 185448 T851 oasc.SolrCore.closeSearcher [collection1] Closing main searcher on request.
[junit4:junit4]   2> 185451 T851 oasu.DirectUpdateHandler2.close closing DirectUpdateHandler2{commits=5,autocommits=0,soft autocommits=0,optimizes=0,rollbacks=0,expungeDeletes=0,docsPending=0,adds=0,deletesById=0,deletesByQuery=0,errors=0,cumulative_adds=35,cumulative_deletesById=0,cumulative_deletesByQuery=0,cumulative_errors=0}
[junit4:junit4]   2> 185452 T851 oasu.DefaultSolrCoreState.decref SolrCoreState ref count has reached 0 - closing IndexWriter
[junit4:junit4]   2> 185454 T851 oasu.DefaultSolrCoreState.decref Closing SolrCoreState - canceling any ongoing recovery
[junit4:junit4]   2> 185454 T851 oasc.LeaderElector$1.process WARNING  org.apache.zookeeper.KeeperException$SessionExpiredException: KeeperErrorCode = Session expired for /collections/collection1/leader_elect/shard2/election/88323246503690246-127.0.0.1:19475_solr_collection1-n_0000000004
[junit4:junit4]   2> 	at org.apache.zookeeper.KeeperException.create(KeeperException.java:118)
[junit4:junit4]   2> 	at org.apache.zookeeper.KeeperException.create(KeeperException.java:42)
[junit4:junit4]   2> 	at org.apache.zookeeper.ZooKeeper.delete(ZooKeeper.java:734)
[junit4:junit4]   2> 	at org.apache.solr.common.cloud.SolrZkClient$2.execute(SolrZkClient.java:178)
[junit4:junit4]   2> 	at org.apache.solr.common.cloud.SolrZkClient$2.execute(SolrZkClient.java:175)
[junit4:junit4]   2> 	at org.apache.solr.common.cloud.ZkCmdExecutor.retryOperation(ZkCmdExecutor.java:67)
[junit4:junit4]   2> 	at org.apache.solr.common.cloud.SolrZkClient.delete(SolrZkClient.java:175)
[junit4:junit4]   2> 	at org.apache.solr.cloud.ElectionContext.cancelElection(ElectionContext.java:60)
[junit4:junit4]   2> 	at org.apache.solr.cloud.ShardLeaderElectionContext.runLeaderProcess(ElectionContext.java:151)
[junit4:junit4]   2> 	at org.apache.solr.cloud.LeaderElector.runIamLeaderProcess(LeaderElector.java:158)
[junit4:junit4]   2> 	at org.apache.solr.cloud.LeaderElector.checkIfIamLeader(LeaderElector.java:102)
[junit4:junit4]   2> 	at org.apache.solr.cloud.LeaderElector.joinElection(LeaderElector.java:275)
[junit4:junit4]   2> 	at org.apache.solr.cloud.ShardLeaderElectionContext.rejoinLeaderElection(ElectionContext.java:326)
[junit4:junit4]   2> 	at org.apache.solr.cloud.ShardLeaderElectionContext.runLeaderProcess(ElectionContext.java:204)
[junit4:junit4]   2> 	at org.apache.solr.cloud.LeaderElector.runIamLeaderProcess(LeaderElector.java:158)
[junit4:junit4]   2> 	at org.apache.solr.cloud.LeaderElector.checkIfIamLeader(LeaderElector.java:102)
[junit4:junit4]   2> 	at org.apache.solr.cloud.LeaderElector.access$000(LeaderElector.java:56)
[junit4:junit4]   2> 	at org.apache.solr.cloud.LeaderElector$1.process(LeaderElector.java:131)
[junit4:junit4]   2> 	at org.apache.zookeeper.ClientCnxn$EventThread.processEvent(ClientCnxn.java:526)
[junit4:junit4]   2> 	at org.apache.zookeeper.ClientCnxn$EventThread.run(ClientCnxn.java:502)
[junit4:junit4]   2> 
[junit4:junit4]   2> 185455 T851 oascc.ZkStateReader$3.process Updating live nodes
[junit4:junit4]   2> 185455 T851 oascc.ZkStateReader$3.process WARNING ZooKeeper watch triggered, but Solr cannot talk to ZK
[junit4:junit4]   2> 185456 T851 oascc.ZkStateReader$2.process A cluster state change has occurred - updating...
[junit4:junit4]   2> 185456 T851 oascc.ZkStateReader$2.process WARNING ZooKeeper watch triggered, but Solr cannot talk to ZK
[junit4:junit4]   2> 185456 T851 oascc.ConnectionManager.process Watcher org.apache.solr.common.cloud.ConnectionManager@1e3d7730 name:ZooKeeperConnection Watcher:127.0.0.1:19442/solr got event WatchedEvent state:Disconnected type:None path:null path:null type:None
[junit4:junit4]   2> 185456 T851 oascc.ConnectionManager.process Client->ZooKeeper status change trigger but we are already closed
[junit4:junit4]   2> 185456 T851 oaz.ClientCnxn$EventThread.run EventThread shut down
[junit4:junit4]   2> NOTE: test params are: codec=Lucene40: {n_f1=Lucene40(minBlockSize=30 maxBlockSize=125), foo_b=PostingsFormat(name=Direct), foo_d=MockVariableIntBlock(baseBlockSize=67), foo_f=PostingsFormat(name=Direct), n_tl1=Lucene40(minBlockSize=30 maxBlockSize=125), n_d1=Pulsing40(freqCutoff=11 minBlockSize=30 maxBlockSize=125), rnd_b=MockVariableIntBlock(baseBlockSize=67), intDefault=Pulsing40(freqCutoff=11 minBlockSize=30 maxBlockSize=125), n_td1=Lucene40(minBlockSize=30 maxBlockSize=125), timestamp=Pulsing40(freqCutoff=11 minBlockSize=30 maxBlockSize=125), id=MockVariableIntBlock(baseBlockSize=67), range_facet_sl=PostingsFormat(name=Direct), range_facet_si=Lucene40(minBlockSize=30 maxBlockSize=125), oddField_s=PostingsFormat(name=Direct), multiDefault=Lucene40(minBlockSize=30 maxBlockSize=125), n_tf1=Pulsing40(freqCutoff=11 minBlockSize=30 maxBlockSize=125), n_dt1=Lucene40(minBlockSize=30 maxBlockSize=125), n_ti1=MockVariableIntBlock(baseBlockSize=67), range_facet_l=Pulsing40(freqCutoff=11 minBlockSize=30 maxBlockSize=125), text=PostingsFormat(name=Direct), _version_=Pulsing40(freqCutoff=11 minBlockSize=30 maxBlockSize=125), SubjectTerms_mfacet=Pulsing40(freqCutoff=11 minBlockSize=30 maxBlockSize=125), a_t=Pulsing40(freqCutoff=11 minBlockSize=30 maxBlockSize=125), n_tdt1=Pulsing40(freqCutoff=11 minBlockSize=30 maxBlockSize=125), other_tl1=Pulsing40(freqCutoff=11 minBlockSize=30 maxBlockSize=125), n_l1=Pulsing40(freqCutoff=11 minBlockSize=30 maxBlockSize=125), a_si=Lucene40(minBlockSize=30 maxBlockSize=125)}, sim=RandomSimilarityProvider(queryNorm=false,coord=yes): {}, locale=vi_VN, timezone=Africa/Douala
[junit4:junit4]   2> NOTE: FreeBSD 9.0-RELEASE amd64/Oracle Corporation 1.7.0_06 (64-bit)/cpus=16,threads=1,free=281891264,total=459276288
[junit4:junit4]   2> NOTE: All tests run in this JVM: [OverseerTest, QueryParsingTest, TestCSVLoader, TestArbitraryIndexDir, StandardRequestHandlerTest, OutputWriterTest, DirectUpdateHandlerTest, FieldMutatingUpdateProcessorTest, LegacyHTMLStripCharFilterTest, IndexSchemaTest, TestDistributedSearch, TestPropInject, TestHashPartitioner, ConvertedLegacyTest, TestFoldingMultitermQuery, SolrIndexConfigTest, TestQuerySenderListener, DirectSolrSpellCheckerTest, PathHierarchyTokenizerFactoryTest, TestCSVResponseWriter, PolyFieldTest, ReturnFieldsTest, ZkNodePropsTest, PrimUtilsTest, BadIndexSchemaTest, TestPluginEnable, TestCodecSupport, TestPhraseSuggestions, StatsComponentTest, TestPropInjectDefaults, TestSurroundQueryParser, TestFunctionQuery, TestReload, TestSolrDeletionPolicy1, UUIDFieldTest, TestLRUCache, TestMultiCoreConfBootstrap, RequiredFieldsTest, TestStressLucene, SolrInfoMBeanTest, BasicDistributedZk2Test]
[junit4:junit4] Completed on J1 in 185.82s, 1 test, 1 failure <<< FAILURES!

[...truncated 392 lines...]
BUILD FAILED
/usr/home/hudson/hudson-slave/workspace/Lucene-Solr-Tests-trunk-java7/build.xml:29: The following error occurred while executing this line:
/usr/home/hudson/hudson-slave/workspace/Lucene-Solr-Tests-trunk-java7/solr/build.xml:146: The following error occurred while executing this line:
/usr/home/hudson/hudson-slave/workspace/Lucene-Solr-Tests-trunk-java7/lucene/module-build.xml:63: The following error occurred while executing this line:
/usr/home/hudson/hudson-slave/workspace/Lucene-Solr-Tests-trunk-java7/lucene/common-build.xml:1133: The following error occurred while executing this line:
/usr/home/hudson/hudson-slave/workspace/Lucene-Solr-Tests-trunk-java7/lucene/common-build.xml:810: There were test failures: 228 suites, 923 tests, 1 failure, 6 ignored (1 assumption)

Total time: 29 minutes 48 seconds
Build step 'Invoke Ant' marked build as failure
Recording test results
Email was triggered for: Failure
Sending email for trigger: Failure



Mime
View raw message