lucene-dev mailing list archives

Site index · List index
Message view « Date » · « Thread »
Top « Date » · « Thread »
From Apache Jenkins Server <jenk...@builds.apache.org>
Subject [JENKINS] Lucene-Solr-Tests-trunk-java7 - Build # 3209 - Still Failing
Date Sat, 15 Sep 2012 14:53:56 GMT
Build: https://builds.apache.org/job/Lucene-Solr-Tests-trunk-java7/3209/

1 tests failed.
FAILED:  org.apache.solr.cloud.BasicDistributedZk2Test.testDistribSearch

Error Message:
Shard still reported as live in zk

Stack Trace:
java.lang.AssertionError: Shard still reported as live in zk
	at __randomizedtesting.SeedInfo.seed([6D8A932B706398F2:EC6C1D33073CF8CE]:0)
	at org.junit.Assert.fail(Assert.java:93)
	at org.apache.solr.cloud.AbstractFullDistribZkTestBase.waitToSeeNotLive(AbstractFullDistribZkTestBase.java:1215)
	at org.apache.solr.cloud.BasicDistributedZk2Test.brindDownShardIndexSomeDocsAndRecover(BasicDistributedZk2Test.java:190)
	at org.apache.solr.cloud.BasicDistributedZk2Test.doTest(BasicDistributedZk2Test.java:83)
	at org.apache.solr.BaseDistributedSearchTestCase.testDistribSearch(BaseDistributedSearchTestCase.java:691)
	at sun.reflect.NativeMethodAccessorImpl.invoke0(Native Method)
	at sun.reflect.NativeMethodAccessorImpl.invoke(NativeMethodAccessorImpl.java:57)
	at sun.reflect.DelegatingMethodAccessorImpl.invoke(DelegatingMethodAccessorImpl.java:43)
	at java.lang.reflect.Method.invoke(Method.java:601)
	at com.carrotsearch.randomizedtesting.RandomizedRunner.invoke(RandomizedRunner.java:1559)
	at com.carrotsearch.randomizedtesting.RandomizedRunner.access$600(RandomizedRunner.java:79)
	at com.carrotsearch.randomizedtesting.RandomizedRunner$6.evaluate(RandomizedRunner.java:737)
	at com.carrotsearch.randomizedtesting.RandomizedRunner$7.evaluate(RandomizedRunner.java:773)
	at com.carrotsearch.randomizedtesting.RandomizedRunner$8.evaluate(RandomizedRunner.java:787)
	at com.carrotsearch.randomizedtesting.rules.SystemPropertiesRestoreRule$1.evaluate(SystemPropertiesRestoreRule.java:53)
	at org.apache.lucene.util.TestRuleSetupTeardownChained$1.evaluate(TestRuleSetupTeardownChained.java:50)
	at org.apache.lucene.util.TestRuleFieldCacheSanity$1.evaluate(TestRuleFieldCacheSanity.java:51)
	at org.apache.lucene.util.AbstractBeforeAfterRule$1.evaluate(AbstractBeforeAfterRule.java:45)
	at com.carrotsearch.randomizedtesting.rules.SystemPropertiesInvariantRule$1.evaluate(SystemPropertiesInvariantRule.java:55)
	at org.apache.lucene.util.TestRuleThreadAndTestName$1.evaluate(TestRuleThreadAndTestName.java:48)
	at org.apache.lucene.util.TestRuleIgnoreAfterMaxFailures$1.evaluate(TestRuleIgnoreAfterMaxFailures.java:70)
	at org.apache.lucene.util.TestRuleMarkFailure$1.evaluate(TestRuleMarkFailure.java:48)
	at com.carrotsearch.randomizedtesting.rules.StatementAdapter.evaluate(StatementAdapter.java:36)
	at com.carrotsearch.randomizedtesting.ThreadLeakControl$StatementRunner.run(ThreadLeakControl.java:358)
	at com.carrotsearch.randomizedtesting.ThreadLeakControl.forkTimeoutingTask(ThreadLeakControl.java:782)
	at com.carrotsearch.randomizedtesting.ThreadLeakControl$3.evaluate(ThreadLeakControl.java:442)
	at com.carrotsearch.randomizedtesting.RandomizedRunner.runSingleTest(RandomizedRunner.java:746)
	at com.carrotsearch.randomizedtesting.RandomizedRunner$3.evaluate(RandomizedRunner.java:648)
	at com.carrotsearch.randomizedtesting.RandomizedRunner$4.evaluate(RandomizedRunner.java:682)
	at com.carrotsearch.randomizedtesting.RandomizedRunner$5.evaluate(RandomizedRunner.java:693)
	at com.carrotsearch.randomizedtesting.rules.StatementAdapter.evaluate(StatementAdapter.java:36)
	at com.carrotsearch.randomizedtesting.rules.SystemPropertiesRestoreRule$1.evaluate(SystemPropertiesRestoreRule.java:53)
	at org.apache.lucene.util.AbstractBeforeAfterRule$1.evaluate(AbstractBeforeAfterRule.java:45)
	at org.apache.lucene.util.TestRuleStoreClassName$1.evaluate(TestRuleStoreClassName.java:42)
	at com.carrotsearch.randomizedtesting.rules.SystemPropertiesInvariantRule$1.evaluate(SystemPropertiesInvariantRule.java:55)
	at com.carrotsearch.randomizedtesting.rules.NoShadowingOrOverridesOnMethodsRule$1.evaluate(NoShadowingOrOverridesOnMethodsRule.java:39)
	at com.carrotsearch.randomizedtesting.rules.NoShadowingOrOverridesOnMethodsRule$1.evaluate(NoShadowingOrOverridesOnMethodsRule.java:39)
	at com.carrotsearch.randomizedtesting.rules.StatementAdapter.evaluate(StatementAdapter.java:36)
	at org.apache.lucene.util.TestRuleAssertionsRequired$1.evaluate(TestRuleAssertionsRequired.java:43)
	at org.apache.lucene.util.TestRuleMarkFailure$1.evaluate(TestRuleMarkFailure.java:48)
	at org.apache.lucene.util.TestRuleIgnoreAfterMaxFailures$1.evaluate(TestRuleIgnoreAfterMaxFailures.java:70)
	at org.apache.lucene.util.TestRuleIgnoreTestSuites$1.evaluate(TestRuleIgnoreTestSuites.java:55)
	at com.carrotsearch.randomizedtesting.rules.StatementAdapter.evaluate(StatementAdapter.java:36)
	at com.carrotsearch.randomizedtesting.ThreadLeakControl$StatementRunner.run(ThreadLeakControl.java:358)
	at java.lang.Thread.run(Thread.java:722)




Build Log:
[...truncated 7833 lines...]
[junit4:junit4] Suite: org.apache.solr.cloud.BasicDistributedZk2Test
[junit4:junit4]   2> 5 T423 oas.SolrTestCaseJ4.setUp ###Starting testDistribSearch
[junit4:junit4]   2> Creating dataDir: /usr/home/hudson/hudson-slave/workspace/Lucene-Solr-Tests-trunk-java7/solr/build/solr-core/test/J1/./solrtest-BasicDistributedZk2Test-1347719940162
[junit4:junit4]   2> 6 T423 oasc.ZkTestServer.run STARTING ZK TEST SERVER
[junit4:junit4]   2> 8 T424 oazs.ZooKeeperServer.setTickTime tickTime set to 1000
[junit4:junit4]   2> 9 T424 oazs.NIOServerCnxn$Factory.<init> binding to port 0.0.0.0/0.0.0.0:0
[junit4:junit4]   2> 9 T424 oazsp.FileTxnSnapLog.save Snapshotting: 0
[junit4:junit4]   2> 107 T423 oasc.ZkTestServer.run start zk server on port:11942
[junit4:junit4]   2> 107 T423 oaz.ZooKeeper.<init> Initiating client connection, connectString=127.0.0.1:11942 sessionTimeout=10000 watcher=org.apache.solr.common.cloud.ConnectionManager@51a10b2b
[junit4:junit4]   2> 108 T429 oaz.ClientCnxn$SendThread.startConnect Opening socket connection to server /127.0.0.1:11942
[junit4:junit4]   2> 108 T423 oascc.ConnectionManager.waitForConnected Waiting for client to connect to ZooKeeper
[junit4:junit4]   2> 109 T429 oaz.ClientCnxn$SendThread.primeConnection Socket connection established to localhost/127.0.0.1:11942, initiating session
[junit4:junit4]   2> 110 T425 oazs.NIOServerCnxn$Factory.run Accepted socket connection from /140.211.11.196:11943
[junit4:junit4]   2> 110 T425 oazs.NIOServerCnxn.readConnectRequest Client attempting to establish new session at /140.211.11.196:11943
[junit4:junit4]   2> 110 T427 oazsp.FileTxnLog.append Creating new log file: log.1
[junit4:junit4]   2> 113 T427 oazs.NIOServerCnxn.finishSessionInit Established session 0x139ca5e48470000 with negotiated timeout 10000 for client /140.211.11.196:11943
[junit4:junit4]   2> 113 T429 oaz.ClientCnxn$SendThread.readConnectResult Session establishment complete on server localhost/127.0.0.1:11942, sessionid = 0x139ca5e48470000, negotiated timeout = 10000
[junit4:junit4]   2> 113 T430 oascc.ConnectionManager.process Watcher org.apache.solr.common.cloud.ConnectionManager@51a10b2b name:ZooKeeperConnection Watcher:127.0.0.1:11942 got event WatchedEvent state:SyncConnected type:None path:null path:null type:None
[junit4:junit4]   2> 113 T423 oascc.ConnectionManager.waitForConnected Client is connected to ZooKeeper
[junit4:junit4]   2> 114 T423 oascc.SolrZkClient.makePath makePath: /solr
[junit4:junit4]   2> 126 T428 oazs.PrepRequestProcessor.pRequest Processed session termination for sessionid: 0x139ca5e48470000
[junit4:junit4]   2> 127 T430 oaz.ClientCnxn$EventThread.run EventThread shut down
[junit4:junit4]   2> 127 T423 oaz.ZooKeeper.close Session: 0x139ca5e48470000 closed
[junit4:junit4]   2> 127 T425 oazs.NIOServerCnxn.closeSock Closed socket connection for client /140.211.11.196:11943 which had sessionid 0x139ca5e48470000
[junit4:junit4]   2> 127 T423 oaz.ZooKeeper.<init> Initiating client connection, connectString=127.0.0.1:11942/solr sessionTimeout=10000 watcher=org.apache.solr.common.cloud.ConnectionManager@3d892152
[junit4:junit4]   2> 128 T431 oaz.ClientCnxn$SendThread.startConnect Opening socket connection to server /127.0.0.1:11942
[junit4:junit4]   2> 128 T423 oascc.ConnectionManager.waitForConnected Waiting for client to connect to ZooKeeper
[junit4:junit4]   2> 129 T431 oaz.ClientCnxn$SendThread.primeConnection Socket connection established to localhost/127.0.0.1:11942, initiating session
[junit4:junit4]   2> 129 T425 oazs.NIOServerCnxn$Factory.run Accepted socket connection from /140.211.11.196:11944
[junit4:junit4]   2> 129 T425 oazs.NIOServerCnxn.readConnectRequest Client attempting to establish new session at /140.211.11.196:11944
[junit4:junit4]   2> 131 T427 oazs.NIOServerCnxn.finishSessionInit Established session 0x139ca5e48470001 with negotiated timeout 10000 for client /140.211.11.196:11944
[junit4:junit4]   2> 131 T431 oaz.ClientCnxn$SendThread.readConnectResult Session establishment complete on server localhost/127.0.0.1:11942, sessionid = 0x139ca5e48470001, negotiated timeout = 10000
[junit4:junit4]   2> 131 T432 oascc.ConnectionManager.process Watcher org.apache.solr.common.cloud.ConnectionManager@3d892152 name:ZooKeeperConnection Watcher:127.0.0.1:11942/solr got event WatchedEvent state:SyncConnected type:None path:null path:null type:None
[junit4:junit4]   2> 132 T423 oascc.ConnectionManager.waitForConnected Client is connected to ZooKeeper
[junit4:junit4]   2> 132 T423 oascc.SolrZkClient.makePath makePath: /collections/collection1
[junit4:junit4]   2> 142 T423 oascc.SolrZkClient.makePath makePath: /collections/collection1/shards
[junit4:junit4]   2> 144 T423 oascc.SolrZkClient.makePath makePath: /collections/control_collection
[junit4:junit4]   2> 147 T423 oascc.SolrZkClient.makePath makePath: /collections/control_collection/shards
[junit4:junit4]   2> 156 T423 oasc.AbstractZkTestCase.putConfig put /usr/home/hudson/hudson-slave/workspace/Lucene-Solr-Tests-trunk-java7/solr/build/solr-core/test-files/solr/collection1/conf/solrconfig.xml to /configs/conf1/solrconfig.xml
[junit4:junit4]   2> 156 T423 oascc.SolrZkClient.makePath makePath: /configs/conf1/solrconfig.xml
[junit4:junit4]   2> 169 T423 oasc.AbstractZkTestCase.putConfig put /usr/home/hudson/hudson-slave/workspace/Lucene-Solr-Tests-trunk-java7/solr/build/solr-core/test-files/solr/collection1/conf/schema.xml to /configs/conf1/schema.xml
[junit4:junit4]   2> 170 T423 oascc.SolrZkClient.makePath makePath: /configs/conf1/schema.xml
[junit4:junit4]   2> 275 T423 oasc.AbstractZkTestCase.putConfig put /usr/home/hudson/hudson-slave/workspace/Lucene-Solr-Tests-trunk-java7/solr/build/solr-core/test-files/solr/collection1/conf/solrconfig.xml to /configs/conf1/solrconfig.xml
[junit4:junit4]   2> 276 T423 oascc.SolrZkClient.makePath makePath: /configs/conf1/solrconfig.xml
[junit4:junit4]   2> 290 T423 oasc.AbstractZkTestCase.putConfig put /usr/home/hudson/hudson-slave/workspace/Lucene-Solr-Tests-trunk-java7/solr/build/solr-core/test-files/solr/collection1/conf/stopwords.txt to /configs/conf1/stopwords.txt
[junit4:junit4]   2> 291 T423 oascc.SolrZkClient.makePath makePath: /configs/conf1/stopwords.txt
[junit4:junit4]   2> 300 T423 oasc.AbstractZkTestCase.putConfig put /usr/home/hudson/hudson-slave/workspace/Lucene-Solr-Tests-trunk-java7/solr/build/solr-core/test-files/solr/collection1/conf/protwords.txt to /configs/conf1/protwords.txt
[junit4:junit4]   2> 300 T423 oascc.SolrZkClient.makePath makePath: /configs/conf1/protwords.txt
[junit4:junit4]   2> 308 T423 oasc.AbstractZkTestCase.putConfig put /usr/home/hudson/hudson-slave/workspace/Lucene-Solr-Tests-trunk-java7/solr/build/solr-core/test-files/solr/collection1/conf/currency.xml to /configs/conf1/currency.xml
[junit4:junit4]   2> 309 T423 oascc.SolrZkClient.makePath makePath: /configs/conf1/currency.xml
[junit4:junit4]   2> 316 T423 oasc.AbstractZkTestCase.putConfig put /usr/home/hudson/hudson-slave/workspace/Lucene-Solr-Tests-trunk-java7/solr/build/solr-core/test-files/solr/collection1/conf/open-exchange-rates.json to /configs/conf1/open-exchange-rates.json
[junit4:junit4]   2> 317 T423 oascc.SolrZkClient.makePath makePath: /configs/conf1/open-exchange-rates.json
[junit4:junit4]   2> 327 T423 oasc.AbstractZkTestCase.putConfig put /usr/home/hudson/hudson-slave/workspace/Lucene-Solr-Tests-trunk-java7/solr/build/solr-core/test-files/solr/collection1/conf/mapping-ISOLatin1Accent.txt to /configs/conf1/mapping-ISOLatin1Accent.txt
[junit4:junit4]   2> 328 T423 oascc.SolrZkClient.makePath makePath: /configs/conf1/mapping-ISOLatin1Accent.txt
[junit4:junit4]   2> 335 T423 oasc.AbstractZkTestCase.putConfig put /usr/home/hudson/hudson-slave/workspace/Lucene-Solr-Tests-trunk-java7/solr/build/solr-core/test-files/solr/collection1/conf/old_synonyms.txt to /configs/conf1/old_synonyms.txt
[junit4:junit4]   2> 335 T423 oascc.SolrZkClient.makePath makePath: /configs/conf1/old_synonyms.txt
[junit4:junit4]   2> 342 T423 oasc.AbstractZkTestCase.putConfig put /usr/home/hudson/hudson-slave/workspace/Lucene-Solr-Tests-trunk-java7/solr/build/solr-core/test-files/solr/collection1/conf/synonyms.txt to /configs/conf1/synonyms.txt
[junit4:junit4]   2> 343 T423 oascc.SolrZkClient.makePath makePath: /configs/conf1/synonyms.txt
[junit4:junit4]   2> 351 T428 oazs.PrepRequestProcessor.pRequest Processed session termination for sessionid: 0x139ca5e48470001
[junit4:junit4]   2> 357 T432 oaz.ClientCnxn$EventThread.run EventThread shut down
[junit4:junit4]   2> 357 T423 oaz.ZooKeeper.close Session: 0x139ca5e48470001 closed
[junit4:junit4]   2> 358 T425 oazs.NIOServerCnxn.closeSock Closed socket connection for client /140.211.11.196:11944 which had sessionid 0x139ca5e48470001
[junit4:junit4]   2> 359 T423 oejs.Server.doStart jetty-8.1.2.v20120308
[junit4:junit4]   2> 363 T423 oejs.AbstractConnector.doStart Started SocketConnector@0.0.0.0:11945
[junit4:junit4]   2> 363 T423 oasc.SolrResourceLoader.locateSolrHome JNDI not configured for solr (NoInitialContextEx)
[junit4:junit4]   2> 364 T423 oasc.SolrResourceLoader.locateSolrHome using system property solr.solr.home: /usr/home/hudson/hudson-slave/workspace/Lucene-Solr-Tests-trunk-java7/solr/build/solr-core/test-files/solr
[junit4:junit4]   2> 364 T423 oasc.SolrResourceLoader.<init> new SolrResourceLoader for deduced Solr Home: '/usr/home/hudson/hudson-slave/workspace/Lucene-Solr-Tests-trunk-java7/solr/build/solr-core/test-files/solr/'
[junit4:junit4]   2> 390 T423 oass.SolrDispatchFilter.init SolrDispatchFilter.init()
[junit4:junit4]   2> 391 T423 oasc.SolrResourceLoader.locateSolrHome JNDI not configured for solr (NoInitialContextEx)
[junit4:junit4]   2> 391 T423 oasc.SolrResourceLoader.locateSolrHome using system property solr.solr.home: /usr/home/hudson/hudson-slave/workspace/Lucene-Solr-Tests-trunk-java7/solr/build/solr-core/test-files/solr
[junit4:junit4]   2> 392 T423 oasc.CoreContainer$Initializer.initialize looking for solr.xml: /usr/home/hudson/hudson-slave/workspace/Lucene-Solr-Tests-trunk-java7/solr/build/solr-core/test-files/solr/solr.xml
[junit4:junit4]   2> 392 T423 oasc.CoreContainer.<init> New CoreContainer 1314793496
[junit4:junit4]   2> 392 T423 oasc.CoreContainer.load Loading CoreContainer using Solr Home: '/usr/home/hudson/hudson-slave/workspace/Lucene-Solr-Tests-trunk-java7/solr/build/solr-core/test-files/solr/'
[junit4:junit4]   2> 393 T423 oasc.SolrResourceLoader.<init> new SolrResourceLoader for directory: '/usr/home/hudson/hudson-slave/workspace/Lucene-Solr-Tests-trunk-java7/solr/build/solr-core/test-files/solr/'
[junit4:junit4]   2> 414 T423 oasc.CoreContainer.load Registering Log Listener
[junit4:junit4]   2> 425 T423 oasc.CoreContainer.initZooKeeper Zookeeper client=127.0.0.1:11942/solr
[junit4:junit4]   2> 426 T423 oaz.ZooKeeper.<init> Initiating client connection, connectString=127.0.0.1:11942/solr sessionTimeout=5000 watcher=org.apache.solr.common.cloud.ConnectionManager@3753449
[junit4:junit4]   2> 426 T442 oaz.ClientCnxn$SendThread.startConnect Opening socket connection to server /127.0.0.1:11942
[junit4:junit4]   2> 426 T423 oascc.ConnectionManager.waitForConnected Waiting for client to connect to ZooKeeper
[junit4:junit4]   2> 427 T442 oaz.ClientCnxn$SendThread.primeConnection Socket connection established to localhost/127.0.0.1:11942, initiating session
[junit4:junit4]   2> 428 T425 oazs.NIOServerCnxn$Factory.run Accepted socket connection from /140.211.11.196:11947
[junit4:junit4]   2> 428 T425 oazs.NIOServerCnxn.readConnectRequest Client attempting to establish new session at /140.211.11.196:11947
[junit4:junit4]   2> 429 T427 oazs.NIOServerCnxn.finishSessionInit Established session 0x139ca5e48470002 with negotiated timeout 5000 for client /140.211.11.196:11947
[junit4:junit4]   2> 429 T442 oaz.ClientCnxn$SendThread.readConnectResult Session establishment complete on server localhost/127.0.0.1:11942, sessionid = 0x139ca5e48470002, negotiated timeout = 5000
[junit4:junit4]   2> 430 T443 oascc.ConnectionManager.process Watcher org.apache.solr.common.cloud.ConnectionManager@3753449 name:ZooKeeperConnection Watcher:127.0.0.1:11942/solr got event WatchedEvent state:SyncConnected type:None path:null path:null type:None
[junit4:junit4]   2> 430 T423 oascc.ConnectionManager.waitForConnected Client is connected to ZooKeeper
[junit4:junit4]   2> 432 T428 oazs.PrepRequestProcessor.pRequest Got user-level KeeperException when processing sessionid:0x139ca5e48470002 type:create cxid:0x2 zxid:0xfffffffffffffffe txntype:unknown reqpath:n/a Error Path:/solr/overseer Error:KeeperErrorCode = NodeExists for /solr/overseer
[junit4:junit4]   2> 434 T423 oascc.SolrZkClient.makePath makePath: /live_nodes
[junit4:junit4]   2> 444 T423 oasc.ZkController.createEphemeralLiveNode Register node as live in ZooKeeper:/live_nodes/127.0.0.1:11945_solr
[junit4:junit4]   2> 445 T428 oazs.PrepRequestProcessor.pRequest Got user-level KeeperException when processing sessionid:0x139ca5e48470002 type:delete cxid:0x7 zxid:0xfffffffffffffffe txntype:unknown reqpath:n/a Error Path:/solr/live_nodes/127.0.0.1:11945_solr Error:KeeperErrorCode = NoNode for /solr/live_nodes/127.0.0.1:11945_solr
[junit4:junit4]   2> 446 T423 oascc.SolrZkClient.makePath makePath: /live_nodes/127.0.0.1:11945_solr
[junit4:junit4]   2> 448 T423 oashc.HttpShardHandlerFactory.getParameter Setting socketTimeout to: 0
[junit4:junit4]   2> 449 T423 oashc.HttpShardHandlerFactory.getParameter Setting urlScheme to: http://
[junit4:junit4]   2> 449 T423 oashc.HttpShardHandlerFactory.getParameter Setting connTimeout to: 0
[junit4:junit4]   2> 449 T423 oashc.HttpShardHandlerFactory.getParameter Setting maxConnectionsPerHost to: 20
[junit4:junit4]   2> 450 T423 oashc.HttpShardHandlerFactory.getParameter Setting corePoolSize to: 0
[junit4:junit4]   2> 450 T423 oashc.HttpShardHandlerFactory.getParameter Setting maximumPoolSize to: 2147483647
[junit4:junit4]   2> 451 T423 oashc.HttpShardHandlerFactory.getParameter Setting maxThreadIdleTime to: 5
[junit4:junit4]   2> 451 T423 oashc.HttpShardHandlerFactory.getParameter Setting sizeOfQueue to: -1
[junit4:junit4]   2> 451 T423 oashc.HttpShardHandlerFactory.getParameter Setting fairnessPolicy to: false
[junit4:junit4]   2> 452 T423 oascsi.HttpClientUtil.createClient Creating new http client, config:maxConnectionsPerHost=20&maxConnections=10000&socketTimeout=0&connTimeout=0&retry=false
[junit4:junit4]   2> 464 T423 oascc.SolrZkClient.makePath makePath: /overseer_elect/election
[junit4:junit4]   2> 469 T428 oazs.PrepRequestProcessor.pRequest Got user-level KeeperException when processing sessionid:0x139ca5e48470002 type:delete cxid:0x15 zxid:0xfffffffffffffffe txntype:unknown reqpath:n/a Error Path:/solr/overseer_elect/leader Error:KeeperErrorCode = NoNode for /solr/overseer_elect/leader
[junit4:junit4]   2> 470 T423 oascc.SolrZkClient.makePath makePath: /overseer_elect/leader
[junit4:junit4]   2> 472 T423 oasc.Overseer.start Overseer (id=88324173998784514-127.0.0.1:11945_solr-n_0000000000) starting
[junit4:junit4]   2> 473 T428 oazs.PrepRequestProcessor.pRequest Got user-level KeeperException when processing sessionid:0x139ca5e48470002 type:create cxid:0x1a zxid:0xfffffffffffffffe txntype:unknown reqpath:n/a Error Path:/solr/overseer Error:KeeperErrorCode = NodeExists for /solr/overseer
[junit4:junit4]   2> 474 T428 oazs.PrepRequestProcessor.pRequest Got user-level KeeperException when processing sessionid:0x139ca5e48470002 type:create cxid:0x1b zxid:0xfffffffffffffffe txntype:unknown reqpath:n/a Error Path:/solr/overseer Error:KeeperErrorCode = NodeExists for /solr/overseer
[junit4:junit4]   2> 475 T428 oazs.PrepRequestProcessor.pRequest Got user-level KeeperException when processing sessionid:0x139ca5e48470002 type:create cxid:0x1c zxid:0xfffffffffffffffe txntype:unknown reqpath:n/a Error Path:/solr/overseer Error:KeeperErrorCode = NodeExists for /solr/overseer
[junit4:junit4]   2> 476 T428 oazs.PrepRequestProcessor.pRequest Got user-level KeeperException when processing sessionid:0x139ca5e48470002 type:create cxid:0x1d zxid:0xfffffffffffffffe txntype:unknown reqpath:n/a Error Path:/solr/overseer Error:KeeperErrorCode = NodeExists for /solr/overseer
[junit4:junit4]   2> 477 T445 oasc.OverseerCollectionProcessor.run Process current queue of collection creations
[junit4:junit4]   2> 478 T423 oascc.SolrZkClient.makePath makePath: /clusterstate.json
[junit4:junit4]   2> 480 T423 oascc.ZkStateReader.createClusterStateWatchersAndUpdate Updating cluster state from ZooKeeper... 
[junit4:junit4]   2> 482 T444 oasc.Overseer$ClusterStateUpdater.run Starting to work on the main queue
[junit4:junit4]   2> 485 T423 oasc.CoreContainer.create Creating SolrCore 'collection1' using instanceDir: /usr/home/hudson/hudson-slave/workspace/Lucene-Solr-Tests-trunk-java7/solr/build/solr-core/test-files/solr/collection1
[junit4:junit4]   2> 486 T423 oasc.ZkController.createCollectionZkNode Check for collection zkNode:control_collection
[junit4:junit4]   2> 487 T423 oasc.ZkController.createCollectionZkNode Collection zkNode exists
[junit4:junit4]   2> 487 T423 oasc.ZkController.readConfigName Load collection config from:/collections/control_collection
[junit4:junit4]   2> 488 T423 oasc.SolrResourceLoader.<init> new SolrResourceLoader for directory: '/usr/home/hudson/hudson-slave/workspace/Lucene-Solr-Tests-trunk-java7/solr/build/solr-core/test-files/solr/collection1/'
[junit4:junit4]   2> 489 T423 oasc.SolrResourceLoader.replaceClassLoader Adding 'file:/usr/home/hudson/hudson-slave/workspace/Lucene-Solr-Tests-trunk-java7/solr/build/solr-core/test-files/solr/collection1/lib/README' to classloader
[junit4:junit4]   2> 490 T423 oasc.SolrResourceLoader.replaceClassLoader Adding 'file:/usr/home/hudson/hudson-slave/workspace/Lucene-Solr-Tests-trunk-java7/solr/build/solr-core/test-files/solr/collection1/lib/classes/' to classloader
[junit4:junit4]   2> 563 T423 oasc.SolrConfig.<init> Using Lucene MatchVersion: LUCENE_50
[junit4:junit4]   2> 617 T423 oasc.SolrConfig.<init> Loaded SolrConfig: solrconfig.xml
[junit4:junit4]   2> 719 T423 oass.IndexSchema.readSchema Reading Solr Schema
[junit4:junit4]   2> 725 T423 oass.IndexSchema.readSchema Schema name=test
[junit4:junit4]   2> 1197 T423 oass.OpenExchangeRatesOrgProvider.init Initialized with rates=open-exchange-rates.json, refreshInterval=1440.
[junit4:junit4]   2> 1206 T423 oass.IndexSchema.readSchema default search field in schema is text
[junit4:junit4]   2> 1209 T423 oass.IndexSchema.readSchema unique key field: id
[junit4:junit4]   2> 1226 T423 oass.FileExchangeRateProvider.reload Reloading exchange rates from file currency.xml
[junit4:junit4]   2> 1231 T423 oass.FileExchangeRateProvider.reload Reloading exchange rates from file currency.xml
[junit4:junit4]   2> 1235 T423 oass.OpenExchangeRatesOrgProvider.reload Reloading exchange rates from open-exchange-rates.json
[junit4:junit4]   2> 1237 T423 oass.OpenExchangeRatesOrgProvider.reload Reloading exchange rates from open-exchange-rates.json
[junit4:junit4]   2> 1239 T423 oasc.SolrCore.<init> [collection1] Opening new SolrCore at /usr/home/hudson/hudson-slave/workspace/Lucene-Solr-Tests-trunk-java7/solr/build/solr-core/test-files/solr/collection1/, dataDir=./org.apache.solr.cloud.BasicDistributedZk2Test-1347719940162/control/data/
[junit4:junit4]   2> 1239 T423 oasc.JmxMonitoredMap.<init> JMX monitoring is enabled. Adding Solr mbeans to JMX Server: com.sun.jmx.mbeanserver.JmxMBeanServer@6cd827df
[junit4:junit4]   2> 1265 T423 oasc.SolrCore.getNewIndexDir WARNING New index directory detected: old=null new=./org.apache.solr.cloud.BasicDistributedZk2Test-1347719940162/control/data/index/
[junit4:junit4]   2> 1266 T423 oasc.SolrCore.initIndex WARNING [collection1] Solr index directory './org.apache.solr.cloud.BasicDistributedZk2Test-1347719940162/control/data/index' doesn't exist. Creating new index...
[junit4:junit4]   2> 1267 T423 oasc.CachingDirectoryFactory.get return new directory for /usr/home/hudson/hudson-slave/workspace/Lucene-Solr-Tests-trunk-java7/solr/build/solr-core/test/J1/./org.apache.solr.cloud.BasicDistributedZk2Test-1347719940162/control/data/index forceNew:false
[junit4:junit4]   2> 1282 T423 oasc.SolrDeletionPolicy.onCommit SolrDeletionPolicy.onCommit: commits:num=1
[junit4:junit4]   2> 		commit{dir=/usr/home/hudson/hudson-slave/workspace/Lucene-Solr-Tests-trunk-java7/solr/build/solr-core/test/J1/org.apache.solr.cloud.BasicDistributedZk2Test-1347719940162/control/data/index,segFN=segments_1,generation=1,filenames=[segments_1]
[junit4:junit4]   2> 1283 T423 oasc.SolrDeletionPolicy.updateCommits newest commit = 1
[junit4:junit4]   2> 1283 T423 oasc.SolrCore.initWriters created xml: solr.XMLResponseWriter
[junit4:junit4]   2> 1286 T423 oasup.UpdateRequestProcessorChain.init inserting DistributedUpdateProcessorFactory into updateRequestProcessorChain "dedupe"
[junit4:junit4]   2> 1286 T423 oasup.UpdateRequestProcessorChain.init inserting DistributedUpdateProcessorFactory into updateRequestProcessorChain "dedupe-allfields"
[junit4:junit4]   2> 1287 T423 oasup.UpdateRequestProcessorChain.init inserting DistributedUpdateProcessorFactory into updateRequestProcessorChain "stored_sig"
[junit4:junit4]   2> 1287 T423 oasup.UpdateRequestProcessorChain.init inserting DistributedUpdateProcessorFactory into updateRequestProcessorChain "uniq-fields"
[junit4:junit4]   2> 1288 T423 oasup.UpdateRequestProcessorChain.init inserting DistributedUpdateProcessorFactory into updateRequestProcessorChain "distrib-dup-test-chain-implicit"
[junit4:junit4]   2> 1288 T423 oasc.RequestHandlers.initHandlersFromConfig adding lazy requestHandler: solr.ReplicationHandler
[junit4:junit4]   2> 1289 T423 oasc.RequestHandlers.initHandlersFromConfig created /replication: solr.ReplicationHandler
[junit4:junit4]   2> 1289 T423 oasc.RequestHandlers.initHandlersFromConfig created standard: solr.StandardRequestHandler
[junit4:junit4]   2> 1290 T423 oasc.RequestHandlers.initHandlersFromConfig created /get: solr.RealTimeGetHandler
[junit4:junit4]   2> 1291 T423 oasc.RequestHandlers.initHandlersFromConfig created dismax: solr.SearchHandler
[junit4:junit4]   2> 1291 T423 oasc.RequestHandlers.initHandlersFromConfig created mock: org.apache.solr.core.MockQuerySenderListenerReqHandler
[junit4:junit4]   2> 1292 T423 oasc.RequestHandlers.initHandlersFromConfig created /admin/: org.apache.solr.handler.admin.AdminHandlers
[junit4:junit4]   2> 1292 T423 oasc.RequestHandlers.initHandlersFromConfig created defaults: solr.StandardRequestHandler
[junit4:junit4]   2> 1293 T423 oasc.RequestHandlers.initHandlersFromConfig adding lazy requestHandler: solr.StandardRequestHandler
[junit4:junit4]   2> 1293 T423 oasc.RequestHandlers.initHandlersFromConfig created lazy: solr.StandardRequestHandler
[junit4:junit4]   2> 1294 T423 oasc.RequestHandlers.initHandlersFromConfig created /update: solr.UpdateRequestHandler
[junit4:junit4]   2> 1295 T423 oasc.RequestHandlers.initHandlersFromConfig created /terms: org.apache.solr.handler.component.SearchHandler
[junit4:junit4]   2> 1295 T423 oasc.RequestHandlers.initHandlersFromConfig created spellCheckCompRH: org.apache.solr.handler.component.SearchHandler
[junit4:junit4]   2> 1296 T423 oasc.RequestHandlers.initHandlersFromConfig created spellCheckCompRH_Direct: org.apache.solr.handler.component.SearchHandler
[junit4:junit4]   2> 1296 T423 oasc.RequestHandlers.initHandlersFromConfig created spellCheckWithWordbreak: org.apache.solr.handler.component.SearchHandler
[junit4:junit4]   2> 1297 T423 oasc.RequestHandlers.initHandlersFromConfig created spellCheckWithWordbreak_Direct: org.apache.solr.handler.component.SearchHandler
[junit4:junit4]   2> 1297 T423 oasc.RequestHandlers.initHandlersFromConfig created spellCheckCompRH1: org.apache.solr.handler.component.SearchHandler
[junit4:junit4]   2> 1298 T423 oasc.RequestHandlers.initHandlersFromConfig created tvrh: org.apache.solr.handler.component.SearchHandler
[junit4:junit4]   2> 1299 T423 oasc.RequestHandlers.initHandlersFromConfig created /mlt: solr.MoreLikeThisHandler
[junit4:junit4]   2> 1299 T423 oasc.RequestHandlers.initHandlersFromConfig created /debug/dump: solr.DumpRequestHandler
[junit4:junit4]   2> 1302 T423 oashl.XMLLoader.init xsltCacheLifetimeSeconds=60
[junit4:junit4]   2> 1307 T423 oasc.SolrCore.initDeprecatedSupport WARNING solrconfig.xml uses deprecated <admin/gettableFiles>, Please update your config to use the ShowFileRequestHandler.
[junit4:junit4]   2> 1308 T423 oasc.SolrCore.initDeprecatedSupport WARNING adding ShowFileRequestHandler with hidden files: [SCHEMA.XML, OLD_SYNONYMS.TXT, STOPWORDS.TXT, PROTWORDS.TXT, OPEN-EXCHANGE-RATES.JSON, SYNONYMS.TXT, CURRENCY.XML, MAPPING-ISOLATIN1ACCENT.TXT]
[junit4:junit4]   2> 1313 T423 oass.SolrIndexSearcher.<init> Opening Searcher@4eabb313 main
[junit4:junit4]   2> 1314 T423 oasu.CommitTracker.<init> Hard AutoCommit: disabled
[junit4:junit4]   2> 1315 T423 oasu.CommitTracker.<init> Soft AutoCommit: disabled
[junit4:junit4]   2> 1315 T423 oashc.SpellCheckComponent.inform Initializing spell checkers
[junit4:junit4]   2> 1322 T423 oass.DirectSolrSpellChecker.init init: {name=direct,classname=DirectSolrSpellChecker,field=lowerfilt,minQueryLength=3}
[junit4:junit4]   2> 1374 T446 oasc.SolrCore.registerSearcher [collection1] Registered new searcher Searcher@4eabb313 main{StandardDirectoryReader(segments_1:1)}
[junit4:junit4]   2> 1381 T428 oazs.PrepRequestProcessor.pRequest Got user-level KeeperException when processing sessionid:0x139ca5e48470002 type:create cxid:0x53 zxid:0xfffffffffffffffe txntype:unknown reqpath:n/a Error Path:/solr/overseer/queue Error:KeeperErrorCode = NoNode for /solr/overseer/queue
[junit4:junit4]   2> 1394 T423 oasc.CoreContainer.register registering core: collection1
[junit4:junit4]   2> 1394 T423 oasc.ZkController.register Register shard - core:collection1 address:http://127.0.0.1:11945/solr shardId:control_shard
[junit4:junit4]   2> 1396 T423 oascc.SolrZkClient.makePath makePath: /collections/control_collection/leader_elect/control_shard/election
[junit4:junit4]   2> 1413 T428 oazs.PrepRequestProcessor.pRequest Got user-level KeeperException when processing sessionid:0x139ca5e48470002 type:delete cxid:0x62 zxid:0xfffffffffffffffe txntype:unknown reqpath:n/a Error Path:/solr/collections/control_collection/leaders Error:KeeperErrorCode = NoNode for /solr/collections/control_collection/leaders
[junit4:junit4]   2> 1414 T423 oasc.ShardLeaderElectionContext.runLeaderProcess Running the leader process.
[junit4:junit4]   2> 1415 T428 oazs.PrepRequestProcessor.pRequest Got user-level KeeperException when processing sessionid:0x139ca5e48470002 type:create cxid:0x63 zxid:0xfffffffffffffffe txntype:unknown reqpath:n/a Error Path:/solr/overseer Error:KeeperErrorCode = NodeExists for /solr/overseer
[junit4:junit4]   2> 1489 T444 oascc.ZkStateReader.updateClusterState Updating cloud state from ZooKeeper... 
[junit4:junit4]   2> 1490 T428 oazs.PrepRequestProcessor.pRequest Got user-level KeeperException when processing sessionid:0x139ca5e48470002 type:create cxid:0x6a zxid:0xfffffffffffffffe txntype:unknown reqpath:n/a Error Path:/solr/overseer/queue-work Error:KeeperErrorCode = NoNode for /solr/overseer/queue-work
[junit4:junit4]   2> 1517 T443 oascc.ZkStateReader$2.process A cluster state change has occurred - updating...
[junit4:junit4]   2> 1926 T423 oasc.ShardLeaderElectionContext.waitForReplicasToComeUp Enough replicas found to continue.
[junit4:junit4]   2> 1927 T423 oasc.ShardLeaderElectionContext.runLeaderProcess I may be the new leader - try and sync
[junit4:junit4]   2> 1928 T423 oasc.SyncStrategy.sync Sync replicas to http://127.0.0.1:11945/solr/collection1/
[junit4:junit4]   2> 1928 T423 oasc.SyncStrategy.syncReplicas Sync Success - now sync replicas to me
[junit4:junit4]   2> 1929 T423 oasc.SyncStrategy.syncToMe http://127.0.0.1:11945/solr/collection1/ has no replicas
[junit4:junit4]   2> 1930 T423 oasc.ShardLeaderElectionContext.runLeaderProcess I am the new leader: http://127.0.0.1:11945/solr/collection1/
[junit4:junit4]   2> 1930 T423 oascc.SolrZkClient.makePath makePath: /collections/control_collection/leaders/control_shard
[junit4:junit4]   2> 1936 T428 oazs.PrepRequestProcessor.pRequest Got user-level KeeperException when processing sessionid:0x139ca5e48470002 type:create cxid:0x88 zxid:0xfffffffffffffffe txntype:unknown reqpath:n/a Error Path:/solr/overseer Error:KeeperErrorCode = NodeExists for /solr/overseer
[junit4:junit4]   2> 2030 T444 oascc.ZkStateReader.updateClusterState Updating cloud state from ZooKeeper... 
[junit4:junit4]   2> 2042 T443 oascc.ZkStateReader$2.process A cluster state change has occurred - updating...
[junit4:junit4]   2> 2055 T423 oasc.ZkController.register We are http://127.0.0.1:11945/solr/collection1/ and leader is http://127.0.0.1:11945/solr/collection1/
[junit4:junit4]   2> 2055 T423 oasc.ZkController.register No LogReplay needed for core=collection1 baseURL=http://127.0.0.1:11945/solr
[junit4:junit4]   2> 2056 T423 oasc.ZkController.checkRecovery I am the leader, no recovery necessary
[junit4:junit4]   2> 2058 T423 oascc.ZkStateReader.updateClusterState Updating cloud state from ZooKeeper... 
[junit4:junit4]   2> 2059 T423 oass.SolrDispatchFilter.init user.dir=/usr/home/hudson/hudson-slave/workspace/Lucene-Solr-Tests-trunk-java7/solr/build/solr-core/test/J1
[junit4:junit4]   2> 2060 T423 oass.SolrDispatchFilter.init SolrDispatchFilter.init() done
[junit4:junit4]   2> 2061 T423 oascsi.HttpClientUtil.createClient Creating new http client, config:maxConnections=128&maxConnectionsPerHost=32&followRedirects=false
[junit4:junit4]   2> 2081 T423 oejs.Server.doStart jetty-8.1.2.v20120308
[junit4:junit4]   2> 2084 T423 oejs.AbstractConnector.doStart Started SocketConnector@0.0.0.0:11953
[junit4:junit4]   2> 2085 T423 oasc.SolrResourceLoader.locateSolrHome JNDI not configured for solr (NoInitialContextEx)
[junit4:junit4]   2> 2085 T423 oasc.SolrResourceLoader.locateSolrHome using system property solr.solr.home: /usr/home/hudson/hudson-slave/workspace/Lucene-Solr-Tests-trunk-java7/solr/build/solr-core/test-files/solr
[junit4:junit4]   2> 2086 T423 oasc.SolrResourceLoader.<init> new SolrResourceLoader for deduced Solr Home: '/usr/home/hudson/hudson-slave/workspace/Lucene-Solr-Tests-trunk-java7/solr/build/solr-core/test-files/solr/'
[junit4:junit4]   2> 2133 T423 oass.SolrDispatchFilter.init SolrDispatchFilter.init()
[junit4:junit4]   2> 2134 T423 oasc.SolrResourceLoader.locateSolrHome JNDI not configured for solr (NoInitialContextEx)
[junit4:junit4]   2> 2134 T423 oasc.SolrResourceLoader.locateSolrHome using system property solr.solr.home: /usr/home/hudson/hudson-slave/workspace/Lucene-Solr-Tests-trunk-java7/solr/build/solr-core/test-files/solr
[junit4:junit4]   2> 2135 T423 oasc.CoreContainer$Initializer.initialize looking for solr.xml: /usr/home/hudson/hudson-slave/workspace/Lucene-Solr-Tests-trunk-java7/solr/build/solr-core/test-files/solr/solr.xml
[junit4:junit4]   2> 2135 T423 oasc.CoreContainer.<init> New CoreContainer 161041480
[junit4:junit4]   2> 2136 T423 oasc.CoreContainer.load Loading CoreContainer using Solr Home: '/usr/home/hudson/hudson-slave/workspace/Lucene-Solr-Tests-trunk-java7/solr/build/solr-core/test-files/solr/'
[junit4:junit4]   2> 2137 T423 oasc.SolrResourceLoader.<init> new SolrResourceLoader for directory: '/usr/home/hudson/hudson-slave/workspace/Lucene-Solr-Tests-trunk-java7/solr/build/solr-core/test-files/solr/'
[junit4:junit4]   2> 2172 T423 oasc.CoreContainer.load Registering Log Listener
[junit4:junit4]   2> 2190 T423 oasc.CoreContainer.initZooKeeper Zookeeper client=127.0.0.1:11942/solr
[junit4:junit4]   2> 2190 T423 oaz.ZooKeeper.<init> Initiating client connection, connectString=127.0.0.1:11942/solr sessionTimeout=5000 watcher=org.apache.solr.common.cloud.ConnectionManager@ba5418f
[junit4:junit4]   2> 2191 T456 oaz.ClientCnxn$SendThread.startConnect Opening socket connection to server /127.0.0.1:11942
[junit4:junit4]   2> 2192 T423 oascc.ConnectionManager.waitForConnected Waiting for client to connect to ZooKeeper
[junit4:junit4]   2> 2193 T456 oaz.ClientCnxn$SendThread.primeConnection Socket connection established to localhost/127.0.0.1:11942, initiating session
[junit4:junit4]   2> 2193 T425 oazs.NIOServerCnxn$Factory.run Accepted socket connection from /140.211.11.196:11954
[junit4:junit4]   2> 2194 T425 oazs.NIOServerCnxn.readConnectRequest Client attempting to establish new session at /140.211.11.196:11954
[junit4:junit4]   2> 2197 T427 oazs.NIOServerCnxn.finishSessionInit Established session 0x139ca5e48470003 with negotiated timeout 5000 for client /140.211.11.196:11954
[junit4:junit4]   2> 2197 T456 oaz.ClientCnxn$SendThread.readConnectResult Session establishment complete on server localhost/127.0.0.1:11942, sessionid = 0x139ca5e48470003, negotiated timeout = 5000
[junit4:junit4]   2> 2198 T457 oascc.ConnectionManager.process Watcher org.apache.solr.common.cloud.ConnectionManager@ba5418f name:ZooKeeperConnection Watcher:127.0.0.1:11942/solr got event WatchedEvent state:SyncConnected type:None path:null path:null type:None
[junit4:junit4]   2> 2198 T423 oascc.ConnectionManager.waitForConnected Client is connected to ZooKeeper
[junit4:junit4]   2> 2199 T428 oazs.PrepRequestProcessor.pRequest Got user-level KeeperException when processing sessionid:0x139ca5e48470003 type:create cxid:0x1 zxid:0xfffffffffffffffe txntype:unknown reqpath:n/a Error Path:/solr/overseer Error:KeeperErrorCode = NodeExists for /solr/overseer
[junit4:junit4]   2> 2201 T428 oazs.PrepRequestProcessor.pRequest Got user-level KeeperException when processing sessionid:0x139ca5e48470003 type:create cxid:0x2 zxid:0xfffffffffffffffe txntype:unknown reqpath:n/a Error Path:/solr/overseer Error:KeeperErrorCode = NodeExists for /solr/overseer
[junit4:junit4]   2> 2208 T423 oasc.ZkController.createEphemeralLiveNode Register node as live in ZooKeeper:/live_nodes/127.0.0.1:11953_solr
[junit4:junit4]   2> 2209 T428 oazs.PrepRequestProcessor.pRequest Got user-level KeeperException when processing sessionid:0x139ca5e48470003 type:delete cxid:0x4 zxid:0xfffffffffffffffe txntype:unknown reqpath:n/a Error Path:/solr/live_nodes/127.0.0.1:11953_solr Error:KeeperErrorCode = NoNode for /solr/live_nodes/127.0.0.1:11953_solr
[junit4:junit4]   2> 2210 T423 oascc.SolrZkClient.makePath makePath: /live_nodes/127.0.0.1:11953_solr
[junit4:junit4]   2> 2212 T443 oascc.ZkStateReader$3.process Updating live nodes
[junit4:junit4]   2> 2214 T423 oashc.HttpShardHandlerFactory.getParameter Setting socketTimeout to: 0
[junit4:junit4]   2> 2214 T423 oashc.HttpShardHandlerFactory.getParameter Setting urlScheme to: http://
[junit4:junit4]   2> 2215 T423 oashc.HttpShardHandlerFactory.getParameter Setting connTimeout to: 0
[junit4:junit4]   2> 2215 T423 oashc.HttpShardHandlerFactory.getParameter Setting maxConnectionsPerHost to: 20
[junit4:junit4]   2> 2216 T423 oashc.HttpShardHandlerFactory.getParameter Setting corePoolSize to: 0
[junit4:junit4]   2> 2216 T423 oashc.HttpShardHandlerFactory.getParameter Setting maximumPoolSize to: 2147483647
[junit4:junit4]   2> 2217 T423 oashc.HttpShardHandlerFactory.getParameter Setting maxThreadIdleTime to: 5
[junit4:junit4]   2> 2217 T423 oashc.HttpShardHandlerFactory.getParameter Setting sizeOfQueue to: -1
[junit4:junit4]   2> 2218 T423 oashc.HttpShardHandlerFactory.getParameter Setting fairnessPolicy to: false
[junit4:junit4]   2> 2218 T423 oascsi.HttpClientUtil.createClient Creating new http client, config:maxConnectionsPerHost=20&maxConnections=10000&socketTimeout=0&connTimeout=0&retry=false
[junit4:junit4]   2> 2235 T423 oascc.ZkStateReader.createClusterStateWatchersAndUpdate Updating cluster state from ZooKeeper... 
[junit4:junit4]   2> 2243 T423 oasc.CoreContainer.create Creating SolrCore 'collection1' using instanceDir: /usr/home/hudson/hudson-slave/workspace/Lucene-Solr-Tests-trunk-java7/solr/build/solr-core/test-files/solr/collection1
[junit4:junit4]   2> 2244 T423 oasc.ZkController.createCollectionZkNode Check for collection zkNode:collection1
[junit4:junit4]   2> 2245 T423 oasc.ZkController.createCollectionZkNode Collection zkNode exists
[junit4:junit4]   2> 2245 T423 oasc.ZkController.readConfigName Load collection config from:/collections/collection1
[junit4:junit4]   2> 2247 T423 oasc.SolrResourceLoader.<init> new SolrResourceLoader for directory: '/usr/home/hudson/hudson-slave/workspace/Lucene-Solr-Tests-trunk-java7/solr/build/solr-core/test-files/solr/collection1/'
[junit4:junit4]   2> 2249 T423 oasc.SolrResourceLoader.replaceClassLoader Adding 'file:/usr/home/hudson/hudson-slave/workspace/Lucene-Solr-Tests-trunk-java7/solr/build/solr-core/test-files/solr/collection1/lib/README' to classloader
[junit4:junit4]   2> 2249 T423 oasc.SolrResourceLoader.replaceClassLoader Adding 'file:/usr/home/hudson/hudson-slave/workspace/Lucene-Solr-Tests-trunk-java7/solr/build/solr-core/test-files/solr/collection1/lib/classes/' to classloader
[junit4:junit4]   2> 2304 T423 oasc.SolrConfig.<init> Using Lucene MatchVersion: LUCENE_50
[junit4:junit4]   2> 2379 T423 oasc.SolrConfig.<init> Loaded SolrConfig: solrconfig.xml
[junit4:junit4]   2> 2481 T423 oass.IndexSchema.readSchema Reading Solr Schema
[junit4:junit4]   2> 2488 T423 oass.IndexSchema.readSchema Schema name=test
[junit4:junit4]   2> 2547 T444 oascc.ZkStateReader.updateClusterState Updating cloud state from ZooKeeper... 
[junit4:junit4]   2> 2562 T443 oascc.ZkStateReader$2.process A cluster state change has occurred - updating...
[junit4:junit4]   2> 2562 T457 oascc.ZkStateReader$2.process A cluster state change has occurred - updating...
[junit4:junit4]   2> 3111 T423 oass.OpenExchangeRatesOrgProvider.init Initialized with rates=open-exchange-rates.json, refreshInterval=1440.
[junit4:junit4]   2> 3119 T423 oass.IndexSchema.readSchema default search field in schema is text
[junit4:junit4]   2> 3123 T423 oass.IndexSchema.readSchema unique key field: id
[junit4:junit4]   2> 3136 T423 oass.FileExchangeRateProvider.reload Reloading exchange rates from file currency.xml
[junit4:junit4]   2> 3141 T423 oass.FileExchangeRateProvider.reload Reloading exchange rates from file currency.xml
[junit4:junit4]   2> 3145 T423 oass.OpenExchangeRatesOrgProvider.reload Reloading exchange rates from open-exchange-rates.json
[junit4:junit4]   2> 3146 T423 oass.OpenExchangeRatesOrgProvider.reload Reloading exchange rates from open-exchange-rates.json
[junit4:junit4]   2> 3148 T423 oasc.SolrCore.<init> [collection1] Opening new SolrCore at /usr/home/hudson/hudson-slave/workspace/Lucene-Solr-Tests-trunk-java7/solr/build/solr-core/test-files/solr/collection1/, dataDir=./org.apache.solr.cloud.BasicDistributedZk2Test-1347719940162/jetty1/
[junit4:junit4]   2> 3148 T423 oasc.JmxMonitoredMap.<init> JMX monitoring is enabled. Adding Solr mbeans to JMX Server: com.sun.jmx.mbeanserver.JmxMBeanServer@6cd827df
[junit4:junit4]   2> 3149 T423 oasc.SolrCore.getNewIndexDir WARNING New index directory detected: old=null new=./org.apache.solr.cloud.BasicDistributedZk2Test-1347719940162/jetty1/index/
[junit4:junit4]   2> 3150 T423 oasc.SolrCore.initIndex WARNING [collection1] Solr index directory './org.apache.solr.cloud.BasicDistributedZk2Test-1347719940162/jetty1/index' doesn't exist. Creating new index...
[junit4:junit4]   2> 3151 T423 oasc.CachingDirectoryFactory.get return new directory for /usr/home/hudson/hudson-slave/workspace/Lucene-Solr-Tests-trunk-java7/solr/build/solr-core/test/J1/./org.apache.solr.cloud.BasicDistributedZk2Test-1347719940162/jetty1/index forceNew:false
[junit4:junit4]   2> 3181 T423 oasc.SolrDeletionPolicy.onCommit SolrDeletionPolicy.onCommit: commits:num=1
[junit4:junit4]   2> 		commit{dir=/usr/home/hudson/hudson-slave/workspace/Lucene-Solr-Tests-trunk-java7/solr/build/solr-core/test/J1/org.apache.solr.cloud.BasicDistributedZk2Test-1347719940162/jetty1/index,segFN=segments_1,generation=1,filenames=[segments_1]
[junit4:junit4]   2> 3181 T423 oasc.SolrDeletionPolicy.updateCommits newest commit = 1
[junit4:junit4]   2> 3182 T423 oasc.SolrCore.initWriters created xml: solr.XMLResponseWriter
[junit4:junit4]   2> 3184 T423 oasup.UpdateRequestProcessorChain.init inserting DistributedUpdateProcessorFactory into updateRequestProcessorChain "dedupe"
[junit4:junit4]   2> 3184 T423 oasup.UpdateRequestProcessorChain.init inserting DistributedUpdateProcessorFactory into updateRequestProcessorChain "dedupe-allfields"
[junit4:junit4]   2> 3185 T423 oasup.UpdateRequestProcessorChain.init inserting DistributedUpdateProcessorFactory into updateRequestProcessorChain "stored_sig"
[junit4:junit4]   2> 3185 T423 oasup.UpdateRequestProcessorChain.init inserting DistributedUpdateProcessorFactory into updateRequestProcessorChain "uniq-fields"
[junit4:junit4]   2> 3186 T423 oasup.UpdateRequestProcessorChain.init inserting DistributedUpdateProcessorFactory into updateRequestProcessorChain "distrib-dup-test-chain-implicit"
[junit4:junit4]   2> 3186 T423 oasc.RequestHandlers.initHandlersFromConfig adding lazy requestHandler: solr.ReplicationHandler
[junit4:junit4]   2> 3187 T423 oasc.RequestHandlers.initHandlersFromConfig created /replication: solr.ReplicationHandler
[junit4:junit4]   2> 3187 T423 oasc.RequestHandlers.initHandlersFromConfig created standard: solr.StandardRequestHandler
[junit4:junit4]   2> 3188 T423 oasc.RequestHandlers.initHandlersFromConfig created /get: solr.RealTimeGetHandler
[junit4:junit4]   2> 3189 T423 oasc.RequestHandlers.initHandlersFromConfig created dismax: solr.SearchHandler
[junit4:junit4]   2> 3189 T423 oasc.RequestHandlers.initHandlersFromConfig created mock: org.apache.solr.core.MockQuerySenderListenerReqHandler
[junit4:junit4]   2> 3190 T423 oasc.RequestHandlers.initHandlersFromConfig created /admin/: org.apache.solr.handler.admin.AdminHandlers
[junit4:junit4]   2> 3190 T423 oasc.RequestHandlers.initHandlersFromConfig created defaults: solr.StandardRequestHandler
[junit4:junit4]   2> 3191 T423 oasc.RequestHandlers.initHandlersFromConfig adding lazy requestHandler: solr.StandardRequestHandler
[junit4:junit4]   2> 3191 T423 oasc.RequestHandlers.initHandlersFromConfig created lazy: solr.StandardRequestHandler
[junit4:junit4]   2> 3192 T423 oasc.RequestHandlers.initHandlersFromConfig created /update: solr.UpdateRequestHandler
[junit4:junit4]   2> 3192 T423 oasc.RequestHandlers.initHandlersFromConfig created /terms: org.apache.solr.handler.component.SearchHandler
[junit4:junit4]   2> 3193 T423 oasc.RequestHandlers.initHandlersFromConfig created spellCheckCompRH: org.apache.solr.handler.component.SearchHandler
[junit4:junit4]   2> 3193 T423 oasc.RequestHandlers.initHandlersFromConfig created spellCheckCompRH_Direct: org.apache.solr.handler.component.SearchHandler
[junit4:junit4]   2> 3194 T423 oasc.RequestHandlers.initHandlersFromConfig created spellCheckWithWordbreak: org.apache.solr.handler.component.SearchHandler
[junit4:junit4]   2> 3195 T423 oasc.RequestHandlers.initHandlersFromConfig created spellCheckWithWordbreak_Direct: org.apache.solr.handler.component.SearchHandler
[junit4:junit4]   2> 3195 T423 oasc.RequestHandlers.initHandlersFromConfig created spellCheckCompRH1: org.apache.solr.handler.component.SearchHandler
[junit4:junit4]   2> 3196 T423 oasc.RequestHandlers.initHandlersFromConfig created tvrh: org.apache.solr.handler.component.SearchHandler
[junit4:junit4]   2> 3196 T423 oasc.RequestHandlers.initHandlersFromConfig created /mlt: solr.MoreLikeThisHandler
[junit4:junit4]   2> 3197 T423 oasc.RequestHandlers.initHandlersFromConfig created /debug/dump: solr.DumpRequestHandler
[junit4:junit4]   2> 3200 T423 oashl.XMLLoader.init xsltCacheLifetimeSeconds=60
[junit4:junit4]   2> 3204 T423 oasc.SolrCore.initDeprecatedSupport WARNING solrconfig.xml uses deprecated <admin/gettableFiles>, Please update your config to use the ShowFileRequestHandler.
[junit4:junit4]   2> 3205 T423 oasc.SolrCore.initDeprecatedSupport WARNING adding ShowFileRequestHandler with hidden files: [SCHEMA.XML, OLD_SYNONYMS.TXT, STOPWORDS.TXT, PROTWORDS.TXT, OPEN-EXCHANGE-RATES.JSON, SYNONYMS.TXT, CURRENCY.XML, MAPPING-ISOLATIN1ACCENT.TXT]
[junit4:junit4]   2> 3208 T423 oass.SolrIndexSearcher.<init> Opening Searcher@7c359f5e main
[junit4:junit4]   2> 3209 T423 oasu.CommitTracker.<init> Hard AutoCommit: disabled
[junit4:junit4]   2> 3210 T423 oasu.CommitTracker.<init> Soft AutoCommit: disabled
[junit4:junit4]   2> 3210 T423 oashc.SpellCheckComponent.inform Initializing spell checkers
[junit4:junit4]   2> 3216 T423 oass.DirectSolrSpellChecker.init init: {name=direct,classname=DirectSolrSpellChecker,field=lowerfilt,minQueryLength=3}
[junit4:junit4]   2> 3262 T458 oasc.SolrCore.registerSearcher [collection1] Registered new searcher Searcher@7c359f5e main{StandardDirectoryReader(segments_1:1)}
[junit4:junit4]   2> 3570 T444 oascc.ZkStateReader.updateClusterState Updating cloud state from ZooKeeper... 
[junit4:junit4]   2> 3584 T443 oascc.ZkStateReader$2.process A cluster state change has occurred - updating...
[junit4:junit4]   2> 3584 T457 oascc.ZkStateReader$2.process A cluster state change has occurred - updating...
[junit4:junit4]   2> 3769 T423 oasc.CoreContainer.register registering core: collection1
[junit4:junit4]   2> 3769 T423 oasc.ZkController.register Register shard - core:collection1 address:http://127.0.0.1:11953/solr shardId:shard1
[junit4:junit4]   2> 3770 T423 oascc.SolrZkClient.makePath makePath: /collections/collection1/leader_elect/shard1/election
[junit4:junit4]   2> 3786 T428 oazs.PrepRequestProcessor.pRequest Got user-level KeeperException when processing sessionid:0x139ca5e48470003 type:delete cxid:0x43 zxid:0xfffffffffffffffe txntype:unknown reqpath:n/a Error Path:/solr/collections/collection1/leaders Error:KeeperErrorCode = NoNode for /solr/collections/collection1/leaders
[junit4:junit4]   2> 3792 T423 oasc.ShardLeaderElectionContext.runLeaderProcess Running the leader process.
[junit4:junit4]   2> 3793 T428 oazs.PrepRequestProcessor.pRequest Got user-level KeeperException when processing sessionid:0x139ca5e48470003 type:create cxid:0x44 zxid:0xfffffffffffffffe txntype:unknown reqpath:n/a Error Path:/solr/overseer Error:KeeperErrorCode = NodeExists for /solr/overseer
[junit4:junit4]   2> 3795 T423 oasc.ShardLeaderElectionContext.waitForReplicasToComeUp Enough replicas found to continue.
[junit4:junit4]   2> 3796 T423 oasc.ShardLeaderElectionContext.runLeaderProcess I may be the new leader - try and sync
[junit4:junit4]   2> 3796 T423 oasc.SyncStrategy.sync Sync replicas to http://127.0.0.1:11953/solr/collection1/
[junit4:junit4]   2> 3797 T423 oasc.SyncStrategy.syncReplicas Sync Success - now sync replicas to me
[junit4:junit4]   2> 3797 T423 oasc.SyncStrategy.syncToMe http://127.0.0.1:11953/solr/collection1/ has no replicas
[junit4:junit4]   2> 3797 T423 oasc.ShardLeaderElectionContext.runLeaderProcess I am the new leader: http://127.0.0.1:11953/solr/collection1/
[junit4:junit4]   2> 3798 T423 oascc.SolrZkClient.makePath makePath: /collections/collection1/leaders/shard1
[junit4:junit4]   2> 3807 T428 oazs.PrepRequestProcessor.pRequest Got user-level KeeperException when processing sessionid:0x139ca5e48470003 type:create cxid:0x4e zxid:0xfffffffffffffffe txntype:unknown reqpath:n/a Error Path:/solr/overseer Error:KeeperErrorCode = NodeExists for /solr/overseer
[junit4:junit4]   2> 4089 T444 oascc.ZkStateReader.updateClusterState Updating cloud state from ZooKeeper... 
[junit4:junit4]   2> 4107 T443 oascc.ZkStateReader$2.process A cluster state change has occurred - updating...
[junit4:junit4]   2> 4107 T457 oascc.ZkStateReader$2.process A cluster state change has occurred - updating...
[junit4:junit4]   2> 4120 T423 oasc.ZkController.register We are http://127.0.0.1:11953/solr/collection1/ and leader is http://127.0.0.1:11953/solr/collection1/
[junit4:junit4]   2> 4120 T423 oasc.ZkController.register No LogReplay needed for core=collection1 baseURL=http://127.0.0.1:11953/solr
[junit4:junit4]   2> 4121 T423 oasc.ZkController.checkRecovery I am the leader, no recovery necessary
[junit4:junit4]   2> 4123 T423 oascc.ZkStateReader.updateClusterState Updating cloud state from ZooKeeper... 
[junit4:junit4]   2> 4125 T423 oass.SolrDispatchFilter.init user.dir=/usr/home/hudson/hudson-slave/workspace/Lucene-Solr-Tests-trunk-java7/solr/build/solr-core/test/J1
[junit4:junit4]   2> 4125 T423 oass.SolrDispatchFilter.init SolrDispatchFilter.init() done
[junit4:junit4]   2> 4126 T423 oascsi.HttpClientUtil.createClient Creating new http client, config:maxConnections=128&maxConnectionsPerHost=32&followRedirects=false
[junit4:junit4]   2> 4145 T423 oejs.Server.doStart jetty-8.1.2.v20120308
[junit4:junit4]   2> 4147 T423 oejs.AbstractConnector.doStart Started SocketConnector@0.0.0.0:11959
[junit4:junit4]   2> 4149 T423 oasc.SolrResourceLoader.locateSolrHome JNDI not configured for solr (NoInitialContextEx)
[junit4:junit4]   2> 4149 T423 oasc.SolrResourceLoader.locateSolrHome using system property solr.solr.home: /usr/home/hudson/hudson-slave/workspace/Lucene-Solr-Tests-trunk-java7/solr/build/solr-core/test-files/solr
[junit4:junit4]   2> 4150 T423 oasc.SolrResourceLoader.<init> new SolrResourceLoader for deduced Solr Home: '/usr/home/hudson/hudson-slave/workspace/Lucene-Solr-Tests-trunk-java7/solr/build/solr-core/test-files/solr/'
[junit4:junit4]   2> 4197 T423 oass.SolrDispatchFilter.init SolrDispatchFilter.init()
[junit4:junit4]   2> 4198 T423 oasc.SolrResourceLoader.locateSolrHome JNDI not configured for solr (NoInitialContextEx)
[junit4:junit4]   2> 4198 T423 oasc.SolrResourceLoader.locateSolrHome using system property solr.solr.home: /usr/home/hudson/hudson-slave/workspace/Lucene-Solr-Tests-trunk-java7/solr/build/solr-core/test-files/solr
[junit4:junit4]   2> 4199 T423 oasc.CoreContainer$Initializer.initialize looking for solr.xml: /usr/home/hudson/hudson-slave/workspace/Lucene-Solr-Tests-trunk-java7/solr/build/solr-core/test-files/solr/solr.xml
[junit4:junit4]   2> 4199 T423 oasc.CoreContainer.<init> New CoreContainer 144203833
[junit4:junit4]   2> 4200 T423 oasc.CoreContainer.load Loading CoreContainer using Solr Home: '/usr/home/hudson/hudson-slave/workspace/Lucene-Solr-Tests-trunk-java7/solr/build/solr-core/test-files/solr/'
[junit4:junit4]   2> 4201 T423 oasc.SolrResourceLoader.<init> new SolrResourceLoader for directory: '/usr/home/hudson/hudson-slave/workspace/Lucene-Solr-Tests-trunk-java7/solr/build/solr-core/test-files/solr/'
[junit4:junit4]   2> 4237 T423 oasc.CoreContainer.load Registering Log Listener
[junit4:junit4]   2> 4255 T423 oasc.CoreContainer.initZooKeeper Zookeeper client=127.0.0.1:11942/solr
[junit4:junit4]   2> 4256 T423 oaz.ZooKeeper.<init> Initiating client connection, connectString=127.0.0.1:11942/solr sessionTimeout=5000 watcher=org.apache.solr.common.cloud.ConnectionManager@7ab9cd24
[junit4:junit4]   2> 4257 T468 oaz.ClientCnxn$SendThread.startConnect Opening socket connection to server /127.0.0.1:11942
[junit4:junit4]   2> 4257 T423 oascc.ConnectionManager.waitForConnected Waiting for client to connect to ZooKeeper
[junit4:junit4]   2> 4258 T468 oaz.ClientCnxn$SendThread.primeConnection Socket connection established to localhost/127.0.0.1:11942, initiating session
[junit4:junit4]   2> 4258 T425 oazs.NIOServerCnxn$Factory.run Accepted socket connection from /140.211.11.196:11960
[junit4:junit4]   2> 4259 T425 oazs.NIOServerCnxn.readConnectRequest Client attempting to establish new session at /140.211.11.196:11960
[junit4:junit4]   2> 4260 T427 oazs.NIOServerCnxn.finishSessionInit Established session 0x139ca5e48470004 with negotiated timeout 5000 for client /140.211.11.196:11960
[junit4:junit4]   2> 4260 T468 oaz.ClientCnxn$SendThread.readConnectResult Session establishment complete on server localhost/127.0.0.1:11942, sessionid = 0x139ca5e48470004, negotiated timeout = 5000
[junit4:junit4]   2> 4261 T469 oascc.ConnectionManager.process Watcher org.apache.solr.common.cloud.ConnectionManager@7ab9cd24 name:ZooKeeperConnection Watcher:127.0.0.1:11942/solr got event WatchedEvent state:SyncConnected type:None path:null path:null type:None
[junit4:junit4]   2> 4261 T423 oascc.ConnectionManager.waitForConnected Client is connected to ZooKeeper
[junit4:junit4]   2> 4262 T428 oazs.PrepRequestProcessor.pRequest Got user-level KeeperException when processing sessionid:0x139ca5e48470004 type:create cxid:0x1 zxid:0xfffffffffffffffe txntype:unknown reqpath:n/a Error Path:/solr/overseer Error:KeeperErrorCode = NodeExists for /solr/overseer
[junit4:junit4]   2> 4264 T428 oazs.PrepRequestProcessor.pRequest Got user-level KeeperException when processing sessionid:0x139ca5e48470004 type:create cxid:0x2 zxid:0xfffffffffffffffe txntype:unknown reqpath:n/a Error Path:/solr/overseer Error:KeeperErrorCode = NodeExists for /solr/overseer
[junit4:junit4]   2> 4272 T423 oasc.ZkController.createEphemeralLiveNode Register node as live in ZooKeeper:/live_nodes/127.0.0.1:11959_solr
[junit4:junit4]   2> 4273 T428 oazs.PrepRequestProcessor.pRequest Got user-level KeeperException when processing sessionid:0x139ca5e48470004 type:delete cxid:0x4 zxid:0xfffffffffffffffe txntype:unknown reqpath:n/a Error Path:/solr/live_nodes/127.0.0.1:11959_solr Error:KeeperErrorCode = NoNode for /solr/live_nodes/127.0.0.1:11959_solr
[junit4:junit4]   2> 4274 T423 oascc.SolrZkClient.makePath makePath: /live_nodes/127.0.0.1:11959_solr
[junit4:junit4]   2> 4277 T443 oascc.ZkStateReader$3.process Updating live nodes
[junit4:junit4]   2> 4277 T457 oascc.ZkStateReader$3.process Updating live nodes
[junit4:junit4]   2> 4278 T423 oashc.HttpShardHandlerFactory.getParameter Setting socketTimeout to: 0
[junit4:junit4]   2> 4278 T423 oashc.HttpShardHandlerFactory.getParameter Setting urlScheme to: http://
[junit4:junit4]   2> 4279 T423 oashc.HttpShardHandlerFactory.getParameter Setting connTimeout to: 0
[junit4:junit4]   2> 4279 T423 oashc.HttpShardHandlerFactory.getParameter Setting maxConnectionsPerHost to: 20
[junit4:junit4]   2> 4280 T423 oashc.HttpShardHandlerFactory.getParameter Setting corePoolSize to: 0
[junit4:junit4]   2> 4281 T423 oashc.HttpShardHandlerFactory.getParameter Setting maximumPoolSize to: 2147483647
[junit4:junit4]   2> 4281 T423 oashc.HttpShardHandlerFactory.getParameter Setting maxThreadIdleTime to: 5
[junit4:junit4]   2> 4282 T423 oashc.HttpShardHandlerFactory.getParameter Setting sizeOfQueue to: -1
[junit4:junit4]   2> 4282 T423 oashc.HttpShardHandlerFactory.getParameter Setting fairnessPolicy to: false
[junit4:junit4]   2> 4283 T423 oascsi.HttpClientUtil.createClient Creating new http client, config:maxConnectionsPerHost=20&maxConnections=10000&socketTimeout=0&connTimeout=0&retry=false
[junit4:junit4]   2> 4298 T423 oascc.ZkStateReader.createClusterStateWatchersAndUpdate Updating cluster state from ZooKeeper... 
[junit4:junit4]   2> 4305 T423 oasc.CoreContainer.create Creating SolrCore 'collection1' using instanceDir: /usr/home/hudson/hudson-slave/workspace/Lucene-Solr-Tests-trunk-java7/solr/build/solr-core/test-files/solr/collection1
[junit4:junit4]   2> 4306 T423 oasc.ZkController.createCollectionZkNode Check for collection zkNode:collection1
[junit4:junit4]   2> 4307 T423 oasc.ZkController.createCollectionZkNode Collection zkNode exists
[junit4:junit4]   2> 4307 T423 oasc.ZkController.readConfigName Load collection config from:/collections/collection1
[junit4:junit4]   2> 4309 T423 oasc.SolrResourceLoader.<init> new SolrResourceLoader for directory: '/usr/home/hudson/hudson-slave/workspace/Lucene-Solr-Tests-trunk-java7/solr/build/solr-core/test-files/solr/collection1/'
[junit4:junit4]   2> 4310 T423 oasc.SolrResourceLoader.replaceClassLoader Adding 'file:/usr/home/hudson/hudson-slave/workspace/Lucene-Solr-Tests-trunk-java7/solr/build/solr-core/test-files/solr/collection1/lib/README' to classloader
[junit4:junit4]   2> 4311 T423 oasc.SolrResourceLoader.replaceClassLoader Adding 'file:/usr/home/hudson/hudson-slave/workspace/Lucene-Solr-Tests-trunk-java7/solr/build/solr-core/test-files/solr/collection1/lib/classes/' to classloader
[junit4:junit4]   2> 4366 T423 oasc.SolrConfig.<init> Using Lucene MatchVersion: LUCENE_50
[junit4:junit4]   2> 4445 T423 oasc.SolrConfig.<init> Loaded SolrConfig: solrconfig.xml
[junit4:junit4]   2> 4546 T423 oass.IndexSchema.readSchema Reading Solr Schema
[junit4:junit4]   2> 4554 T423 oass.IndexSchema.readSchema Schema name=test
[junit4:junit4]   2> 4621 T444 oascc.ZkStateReader.updateClusterState Updating cloud state from ZooKeeper... 
[junit4:junit4]   2> 4635 T443 oascc.ZkStateReader$2.process A cluster state change has occurred - updating...
[junit4:junit4]   2> 4635 T469 oascc.ZkStateReader$2.process A cluster state change has occurred - updating...
[junit4:junit4]   2> 4635 T457 oascc.ZkStateReader$2.process A cluster state change has occurred - updating...
[junit4:junit4]   2> 5207 T423 oass.OpenExchangeRatesOrgProvider.init Initialized with rates=open-exchange-rates.json, refreshInterval=1440.
[junit4:junit4]   2> 5218 T423 oass.IndexSchema.readSchema default search field in schema is text
[junit4:junit4]   2> 5222 T423 oass.IndexSchema.readSchema unique key field: id
[junit4:junit4]   2> 5241 T423 oass.FileExchangeRateProvider.reload Reloading exchange rates from file currency.xml
[junit4:junit4]   2> 5246 T423 oass.FileExchangeRateProvider.reload Reloading exchange rates from file currency.xml
[junit4:junit4]   2> 5252 T423 oass.OpenExchangeRatesOrgProvider.reload Reloading exchange rates from open-exchange-rates.json
[junit4:junit4]   2> 5253 T423 oass.OpenExchangeRatesOrgProvider.reload Reloading exchange rates from open-exchange-rates.json
[junit4:junit4]   2> 5255 T423 oasc.SolrCore.<init> [collection1] Opening new SolrCore at /usr/home/hudson/hudson-slave/workspace/Lucene-Solr-Tests-trunk-java7/solr/build/solr-core/test-files/solr/collection1/, dataDir=./org.apache.solr.cloud.BasicDistributedZk2Test-1347719940162/jetty2/
[junit4:junit4]   2> 5256 T423 oasc.JmxMonitoredMap.<init> JMX monitoring is enabled. Adding Solr mbeans to JMX Server: com.sun.jmx.mbeanserver.JmxMBeanServer@6cd827df
[junit4:junit4]   2> 5258 T423 oasc.SolrCore.getNewIndexDir WARNING New index directory detected: old=null new=./org.apache.solr.cloud.BasicDistributedZk2Test-1347719940162/jetty2/index/
[junit4:junit4]   2> 5259 T423 oasc.SolrCore.initIndex WARNING [collection1] Solr index directory './org.apache.solr.cloud.BasicDistributedZk2Test-1347719940162/jetty2/index' doesn't exist. Creating new index...
[junit4:junit4]   2> 5260 T423 oasc.CachingDirectoryFactory.get return new directory for /usr/home/hudson/hudson-slave/workspace/Lucene-Solr-Tests-trunk-java7/solr/build/solr-core/test/J1/./org.apache.solr.cloud.BasicDistributedZk2Test-1347719940162/jetty2/index forceNew:false
[junit4:junit4]   2> 5277 T423 oasc.SolrDeletionPolicy.onCommit SolrDeletionPolicy.onCommit: commits:num=1
[junit4:junit4]   2> 		commit{dir=/usr/home/hudson/hudson-slave/workspace/Lucene-Solr-Tests-trunk-java7/solr/build/solr-core/test/J1/org.apache.solr.cloud.BasicDistributedZk2Test-1347719940162/jetty2/index,segFN=segments_1,generation=1,filenames=[segments_1]
[junit4:junit4]   2> 5278 T423 oasc.SolrDeletionPolicy.updateCommits newest commit = 1
[junit4:junit4]   2> 5278 T423 oasc.SolrCore.initWriters created xml: solr.XMLResponseWriter
[junit4:junit4]   2> 5282 T423 oasup.UpdateRequestProcessorChain.init inserting DistributedUpdateProcessorFactory into updateRequestProcessorChain "dedupe"
[junit4:junit4]   2> 5282 T423 oasup.UpdateRequestProcessorChain.init inserting DistributedUpdateProcessorFactory into updateRequestProcessorChain "dedupe-allfields"
[junit4:junit4]   2> 5283 T423 oasup.UpdateRequestProcessorChain.init inserting DistributedUpdateProcessorFactory into updateRequestProcessorChain "stored_sig"
[junit4:junit4]   2> 5284 T423 oasup.UpdateRequestProcessorChain.init inserting DistributedUpdateProcessorFactory into updateRequestProcessorChain "uniq-fields"
[junit4:junit4]   2> 5285 T423 oasup.UpdateRequestProcessorChain.init inserting DistributedUpdateProcessorFactory into updateRequestProcessorChain "distrib-dup-test-chain-implicit"
[junit4:junit4]   2> 5285 T423 oasc.RequestHandlers.initHandlersFromConfig adding lazy requestHandler: solr.ReplicationHandler
[junit4:junit4]   2> 5286 T423 oasc.RequestHandlers.initHandlersFromConfig created /replication: solr.ReplicationHandler
[junit4:junit4]   2> 5287 T423 oasc.RequestHandlers.initHandlersFromConfig created standard: solr.StandardRequestHandler
[junit4:junit4]   2> 5288 T423 oasc.RequestHandlers.initHandlersFromConfig created /get: solr.RealTimeGetHandler
[junit4:junit4]   2> 5289 T423 oasc.RequestHandlers.initHandlersFromConfig created dismax: solr.SearchHandler
[junit4:junit4]   2> 5289 T423 oasc.RequestHandlers.initHandlersFromConfig created mock: org.apache.solr.core.MockQuerySenderListenerReqHandler
[junit4:junit4]   2> 5290 T423 oasc.RequestHandlers.initHandlersFromConfig created /admin/: org.apache.solr.handler.admin.AdminHandlers
[junit4:junit4]   2> 5291 T423 oasc.RequestHandlers.initHandlersFromConfig created defaults: solr.StandardRequestHandler
[junit4:junit4]   2> 5292 T423 oasc.RequestHandlers.initHandlersFromConfig adding lazy requestHandler: solr.StandardRequestHandler
[junit4:junit4]   2> 5292 T423 oasc.RequestHandlers.initHandlersFromConfig created lazy: solr.StandardRequestHandler
[junit4:junit4]   2> 5293 T423 oasc.RequestHandlers.initHandlersFromConfig created /update: solr.UpdateRequestHandler
[junit4:junit4]   2> 5294 T423 oasc.RequestHandlers.initHandlersFromConfig created /terms: org.apache.solr.handler.component.SearchHandler
[junit4:junit4]   2> 5295 T423 oasc.RequestHandlers.initHandlersFromConfig created spellCheckCompRH: org.apache.solr.handler.component.SearchHandler
[junit4:junit4]   2> 5296 T423 oasc.RequestHandlers.initHandlersFromConfig created spellCheckCompRH_Direct: org.apache.solr.handler.component.SearchHandler
[junit4:junit4]   2> 5297 T423 oasc.RequestHandlers.initHandlersFromConfig created spellCheckWithWordbreak: org.apache.solr.handler.component.SearchHandler
[junit4:junit4]   2> 5298 T423 oasc.RequestHandlers.initHandlersFromConfig created spellCheckWithWordbreak_Direct: org.apache.solr.handler.component.SearchHandler
[junit4:junit4]   2> 5299 T423 oasc.RequestHandlers.initHandlersFromConfig created spellCheckCompRH1: org.apache.solr.handler.component.SearchHandler
[junit4:junit4]   2> 5299 T423 oasc.RequestHandlers.initHandlersFromConfig created tvrh: org.apache.solr.handler.component.SearchHandler
[junit4:junit4]   2> 5300 T423 oasc.RequestHandlers.initHandlersFromConfig created /mlt: solr.MoreLikeThisHandler
[junit4:junit4]   2> 5301 T423 oasc.RequestHandlers.initHandlersFromConfig created /debug/dump: solr.DumpRequestHandler
[junit4:junit4]   2> 5305 T423 oashl.XMLLoader.init xsltCacheLifetimeSeconds=60
[junit4:junit4]   2> 5310 T423 oasc.SolrCore.initDeprecatedSupport WARNING solrconfig.xml uses deprecated <admin/gettableFiles>, Please update your config to use the ShowFileRequestHandler.
[junit4:junit4]   2> 5312 T423 oasc.SolrCore.initDeprecatedSupport WARNING adding ShowFileRequestHandler with hidden files: [SCHEMA.XML, OLD_SYNONYMS.TXT, STOPWORDS.TXT, PROTWORDS.TXT, OPEN-EXCHANGE-RATES.JSON, SYNONYMS.TXT, CURRENCY.XML, MAPPING-ISOLATIN1ACCENT.TXT]
[junit4:junit4]   2> 5316 T423 oass.SolrIndexSearcher.<init> Opening Searcher@5046497b main
[junit4:junit4]   2> 5317 T423 oasu.CommitTracker.<init> Hard AutoCommit: disabled
[junit4:junit4]   2> 5318 T423 oasu.CommitTracker.<init> Soft AutoCommit: disabled
[junit4:junit4]   2> 5319 T423 oashc.SpellCheckComponent.inform Initializing spell checkers
[junit4:junit4]   2> 5338 T423 oass.DirectSolrSpellChecker.init init: {name=direct,classname=DirectSolrSpellChecker,field=lowerfilt,minQueryLength=3}
[junit4:junit4]   2> 5424 T470 oasc.SolrCore.registerSearcher [collection1] Registered new searcher Searcher@5046497b main{StandardDirectoryReader(segments_1:1)}
[junit4:junit4]   2> 5644 T444 oascc.ZkStateReader.updateClusterState Updating cloud state from ZooKeeper... 
[junit4:junit4]   2> 5667 T443 oascc.ZkStateReader$2.process A cluster state change has occurred - updating...
[junit4:junit4]   2> 5667 T469 oascc.ZkStateReader$2.process A cluster state change has occurred - updating...
[junit4:junit4]   2> 5667 T457 oascc.ZkStateReader$2.process A cluster state change has occurred - updating...
[junit4:junit4]   2> 5934 T423 oasc.CoreContainer.register registering core: collection1
[junit4:junit4]   2> 5934 T423 oasc.ZkController.register Register shard - core:collection1 address:http://127.0.0.1:11959/solr shardId:shard2
[junit4:junit4]   2> 5936 T423 oascc.SolrZkClient.makePath makePath: /collections/collection1/leader_elect/shard2/election
[junit4:junit4]   2> 5952 T428 oazs.PrepRequestProcessor.pRequest Got user-level KeeperException when processing sessionid:0x139ca5e48470004 type:delete cxid:0x42 zxid:0xfffffffffffffffe txntype:unknown reqpath:n/a Error Path:/solr/collections/collection1/leaders/shard2 Error:KeeperErrorCode = NoNode for /solr/collections/collection1/leaders/shard2
[junit4:junit4]   2> 5962 T423 oasc.ShardLeaderElectionContext.runLeaderProcess Running the leader process.
[junit4:junit4]   2> 5963 T428 oazs.PrepRequestProcessor.pRequest Got user-level KeeperException when processing sessionid:0x139ca5e48470004 type:create cxid:0x43 zxid:0xfffffffffffffffe txntype:unknown reqpath:n/a Error Path:/solr/overseer Error:KeeperErrorCode = NodeExists for /solr/overseer
[junit4:junit4]   2> 5979 T423 oasc.ShardLeaderElectionContext.waitForReplicasToComeUp Enough replicas found to continue.
[junit4:junit4]   2> 5980 T423 oasc.ShardLeaderElectionContext.runLeaderProcess I may be the new leader - try and sync
[junit4:junit4]   2> 5980 T423 oasc.SyncStrategy.sync Sync replicas to http://127.0.0.1:11959/solr/collection1/
[junit4:junit4]   2> 5981 T423 oasc.SyncStrategy.syncReplicas Sync Success - now sync replicas to me
[junit4:junit4]   2> 5981 T423 oasc.SyncStrategy.syncToMe http://127.0.0.1:11959/solr/collection1/ has no replicas
[junit4:junit4]   2> 5982 T423 oasc.ShardLeaderElectionContext.runLeaderProcess I am the new leader: http://127.0.0.1:11959/solr/collection1/
[junit4:junit4]   2> 5982 T423 oascc.SolrZkClient.makePath makePath: /collections/collection1/leaders/shard2
[junit4:junit4]   2> 5988 T428 oazs.PrepRequestProcessor.pRequest Got user-level KeeperException when processing sessionid:0x139ca5e48470004 type:create cxid:0x4c zxid:0xfffffffffffffffe txntype:unknown reqpath:n/a Error Path:/solr/overseer Error:KeeperErrorCode = NodeExists for /solr/overseer
[junit4:junit4]   2> 6176 T444 oascc.ZkStateReader.updateClusterState Updating cloud state from ZooKeeper... 
[junit4:junit4]   2> 6192 T443 oascc.ZkStateReader$2.process A cluster state change has occurred - updating...
[junit4:junit4]   2> 6192 T469 oascc.ZkStateReader$2.process A cluster state change has occurred - updating...
[junit4:junit4]   2> 6192 T457 oascc.ZkStateReader$2.process A cluster state change has occurred - updating...
[junit4:junit4]   2> 6209 T423 oasc.ZkController.register We are http://127.0.0.1:11959/solr/collection1/ and leader is http://127.0.0.1:11959/solr/collection1/
[junit4:junit4]   2> 6209 T423 oasc.ZkController.register No LogReplay needed for core=collection1 baseURL=http://127.0.0.1:11959/solr
[junit4:junit4]   2> 6210 T423 oasc.ZkController.checkRecovery I am the leader, no recovery necessary
[junit4:junit4]   2> 6213 T423 oascc.ZkStateReader.updateClusterState Updating cloud state from ZooKeeper... 
[junit4:junit4]   2> 6214 T423 oass.SolrDispatchFilter.init user.dir=/usr/home/hudson/hudson-slave/workspace/Lucene-Solr-Tests-trunk-java7/solr/build/solr-core/test/J1
[junit4:junit4]   2> 6215 T423 oass.SolrDispatchFilter.init SolrDispatchFilter.init() done
[junit4:junit4]   2> 6215 T423 oascsi.HttpClientUtil.createClient Creating new http client, config:maxConnections=128&maxConnectionsPerHost=32&followRedirects=false
[junit4:junit4]   2> 6238 T423 oejs.Server.doStart jetty-8.1.2.v20120308
[junit4:junit4]   2> 6241 T423 oejs.AbstractConnector.doStart Started SocketConnector@0.0.0.0:11969
[junit4:junit4]   2> 6241 T423 oasc.SolrResourceLoader.locateSolrHome JNDI not configured for solr (NoInitialContextEx)
[junit4:junit4]   2> 6242 T423 oasc.SolrResourceLoader.locateSolrHome using system property solr.solr.home: /usr/home/hudson/hudson-slave/workspace/Lucene-Solr-Tests-trunk-java7/solr/build/solr-core/test-files/solr
[junit4:junit4]   2> 6243 T423 oasc.SolrResourceLoader.<init> new SolrResourceLoader for deduced Solr Home: '/usr/home/hudson/hudson-slave/workspace/Lucene-Solr-Tests-trunk-java7/solr/build/solr-core/test-files/solr/'
[junit4:junit4]   2> 6290 T423 oass.SolrDispatchFilter.init SolrDispatchFilter.init()
[junit4:junit4]   2> 6290 T423 oasc.SolrResourceLoader.locateSolrHome JNDI not configured for solr (NoInitialContextEx)
[junit4:junit4]   2> 6291 T423 oasc.SolrResourceLoader.locateSolrHome using system property solr.solr.home: /usr/home/hudson/hudson-slave/workspace/Lucene-Solr-Tests-trunk-java7/solr/build/solr-core/test-files/solr
[junit4:junit4]   2> 6291 T423 oasc.CoreContainer$Initializer.initialize looking for solr.xml: /usr/home/hudson/hudson-slave/workspace/Lucene-Solr-Tests-trunk-java7/solr/build/solr-core/test-files/solr/solr.xml
[junit4:junit4]   2> 6292 T423 oasc.CoreContainer.<init> New CoreContainer 660305905
[junit4:junit4]   2> 6293 T423 oasc.CoreContainer.load Loading CoreContainer using Solr Home: '/usr/home/hudson/hudson-slave/workspace/Lucene-Solr-Tests-trunk-java7/solr/build/solr-core/test-files/solr/'
[junit4:junit4]   2> 6293 T423 oasc.SolrResourceLoader.<init> new SolrResourceLoader for directory: '/usr/home/hudson/hudson-slave/workspace/Lucene-Solr-Tests-trunk-java7/solr/build/solr-core/test-files/solr/'
[junit4:junit4]   2> 6325 T423 oasc.CoreContainer.load Registering Log Listener
[junit4:junit4]   2> 6340 T423 oasc.CoreContainer.initZooKeeper Zookeeper client=127.0.0.1:11942/solr
[junit4:junit4]   2> 6341 T423 oaz.ZooKeeper.<init> Initiating client connection, connectString=127.0.0.1:11942/solr sessionTimeout=5000 watcher=org.apache.solr.common.cloud.ConnectionManager@44f9051c
[junit4:junit4]   2> 6342 T480 oaz.ClientCnxn$SendThread.startConnect Opening socket connection to server /127.0.0.1:11942
[junit4:junit4]   2> 6342 T423 oascc.ConnectionManager.waitForConnected Waiting for client to connect to ZooKeeper
[junit4:junit4]   2> 6344 T480 oaz.ClientCnxn$SendThread.primeConnection Socket connection established to localhost/127.0.0.1:11942, initiating session
[junit4:junit4]   2> 6344 T425 oazs.NIOServerCnxn$Factory.run Accepted socket connection from /140.211.11.196:11970
[junit4:junit4]   2> 6345 T425 oazs.NIOServerCnxn.readConnectRequest Client attempting to establish new session at /140.211.11.196:11970
[junit4:junit4]   2> 6350 T427 oazs.NIOServerCnxn.finishSessionInit Established session 0x139ca5e48470005 with negotiated timeout 5000 for client /140.211.11.196:11970
[junit4:junit4]   2> 6350 T480 oaz.ClientCnxn$SendThread.readConnectResult Session establishment complete on server localhost/127.0.0.1:11942, sessionid = 0x139ca5e48470005, negotiated timeout = 5000
[junit4:junit4]   2> 6351 T481 oascc.ConnectionManager.process Watcher org.apache.solr.common.cloud.ConnectionManager@44f9051c name:ZooKeeperConnection Watcher:127.0.0.1:11942/solr got event WatchedEvent state:SyncConnected type:None path:null path:null type:None
[junit4:junit4]   2> 6351 T423 oascc.ConnectionManager.waitForConnected Client is connected to ZooKeeper
[junit4:junit4]   2> 6352 T428 oazs.PrepRequestProcessor.pRequest Got user-level KeeperException when processing sessionid:0x139ca5e48470005 type:create cxid:0x1 zxid:0xfffffffffffffffe txntype:unknown reqpath:n/a Error Path:/solr/overseer Error:KeeperErrorCode = NodeExists for /solr/overseer
[junit4:junit4]   2> 6361 T428 oazs.PrepRequestProcessor.pRequest Got user-level KeeperException when processing sessionid:0x139ca5e48470005 type:create cxid:0x2 zxid:0xfffffffffffffffe txntype:unknown reqpath:n/a Error Path:/solr/overseer Error:KeeperErrorCode = NodeExists for /solr/overseer
[junit4:junit4]   2> 6372 T423 oasc.ZkController.createEphemeralLiveNode Register node as live in ZooKeeper:/live_nodes/127.0.0.1:11969_solr
[junit4:junit4]   2> 6372 T428 oazs.PrepRequestProcessor.pRequest Got user-level KeeperException when processing sessionid:0x139ca5e48470005 type:delete cxid:0x4 zxid:0xfffffffffffffffe txntype:unknown reqpath:n/a Error Path:/solr/live_nodes/127.0.0.1:11969_solr Error:KeeperErrorCode = NoNode for /solr/live_nodes/127.0.0.1:11969_solr
[junit4:junit4]   2> 6381 T423 oascc.SolrZkClient.makePath makePath: /live_nodes/127.0.0.1:11969_solr
[junit4:junit4]   2> 6383 T457 oascc.ZkStateReader$3.process Updating live nodes
[junit4:junit4]   2> 6384 T469 oascc.ZkStateReader$3.process Updating live nodes
[junit4:junit4]   2> 6383 T443 oascc.ZkStateReader$3.process Updating live nodes
[junit4:junit4]   2> 6385 T423 oashc.HttpShardHandlerFactory.getParameter Setting socketTimeout to: 0
[junit4:junit4]   2> 6385 T423 oashc.HttpShardHandlerFactory.getParameter Setting urlScheme to: http://
[junit4:junit4]   2> 6386 T423 oashc.HttpShardHandlerFactory.getParameter Setting connTimeout to: 0
[junit4:junit4]   2> 6386 T423 oashc.HttpShardHandlerFactory.getParameter Setting maxConnectionsPerHost to: 20
[junit4:junit4]   2> 6387 T423 oashc.HttpShardHandlerFactory.getParameter Setting corePoolSize to: 0
[junit4:junit4]   2> 6387 T423 oashc.HttpShardHandlerFactory.getParameter Setting maximumPoolSize to: 2147483647
[junit4:junit4]   2> 6388 T423 oashc.HttpShardHandlerFactory.getParameter Setting maxThreadIdleTime to: 5
[junit4:junit4]   2> 6389 T423 oashc.HttpShardHandlerFactory.getParameter Setting sizeOfQueue to: -1
[junit4:junit4]   2> 6389 T423 oashc.HttpShardHandlerFactory.getParameter Setting fairnessPolicy to: false
[junit4:junit4]   2> 6390 T423 oascsi.HttpClientUtil.createClient Creating new http client, config:maxConnectionsPerHost=20&maxConnections=10000&socketTimeout=0&connTimeout=0&retry=false
[junit4:junit4]   2> 6407 T423 oascc.ZkStateReader.createClusterStateWatchersAndUpdate Updating cluster state from ZooKeeper... 
[junit4:junit4]   2> 6416 T423 oasc.CoreContainer.create Creating SolrCore 'collection1' using instanceDir: /usr/home/hudson/hudson-slave/workspace/Lucene-Solr-Tests-trunk-java7/solr/build/solr-core/test-files/solr/collection1
[junit4:junit4]   2> 6417 T423 oasc.ZkController.createCollectionZkNode Check for collection zkNode:collection1
[junit4:junit4]   2> 6418 T423 oasc.ZkController.createCollectionZkNode Collection zkNode exists
[junit4:junit4]   2> 6418 T423 oasc.ZkController.readConfigName Load collection config from:/collections/collection1
[junit4:junit4]   2> 6439 T423 oasc.SolrResourceLoader.<init> new SolrResourceLoader for directory: '/usr/home/hudson/hudson-slave/workspace/Lucene-Solr-Tests-trunk-java7/solr/build/solr-core/test-files/solr/collection1/'
[junit4:junit4]   2> 6441 T423 oasc.SolrResourceLoader.replaceClassLoader Adding 'file:/usr/home/hudson/hudson-slave/workspace/Lucene-Solr-Tests-trunk-java7/solr/build/solr-core/test-files/solr/collection1/lib/README' to classloader
[junit4:junit4]   2> 6442 T423 oasc.SolrResourceLoader.replaceClassLoader Adding 'file:/usr/home/hudson/hudson-slave/workspace/Lucene-Solr-Tests-trunk-java7/solr/build/solr-core/test-files/solr/collection1/lib/classes/' to classloader
[junit4:junit4]   2> 6495 T423 oasc.SolrConfig.<init> Using Lucene MatchVersion: LUCENE_50
[junit4:junit4]   2> 6566 T423 oasc.SolrConfig.<init> Loaded SolrConfig: solrconfig.xml
[junit4:junit4]   2> 6667 T423 oass.IndexSchema.readSchema Reading Solr Schema
[junit4:junit4]   2> 6678 T423 oass.IndexSchema.readSchema Schema name=test
[junit4:junit4]   2> 6705 T444 oascc.ZkStateReader.updateClusterState Updating cloud state from ZooKeeper... 
[junit4:junit4]   2> 6741 T469 oascc.ZkStateReader$2.process A cluster state change has occurred - updating...
[junit4:junit4]   2> 6741 T481 oascc.ZkStateReader$2.process A cluster state change has occurred - updating...
[junit4:junit4]   2> 6741 T457 oascc.ZkStateReader$2.process A cluster state change has occurred - updating...
[junit4:junit4]   2> 6741 T443 oascc.ZkStateReader$2.process A cluster state change has occurred - updating...
[junit4:junit4]   2> 7305 T423 oass.OpenExchangeRatesOrgProvider.init Initialized with rates=open-exchange-rates.json, refreshInterval=1440.
[junit4:junit4]   2> 7318 T423 oass.IndexSchema.readSchema default search field in schema is text
[junit4:junit4]   2> 7322 T423 oass.IndexSchema.readSchema unique key field: id
[junit4:junit4]   2> 7347 T423 oass.FileExchangeRateProvider.reload Reloading exchange rates from file currency.xml
[junit4:junit4]   2> 7353 T423 oass.FileExchangeRateProvider.reload Reloading exchange rates from file currency.xml
[junit4:junit4]   2> 7358 T423 oass.OpenExchangeRatesOrgProvider.reload Reloading exchange rates from open-exchange-rates.json
[junit4:junit4]   2> 7360 T423 oass.OpenExchangeRatesOrgProvider.reload Reloading exchange rates from open-exchange-rates.json
[junit4:junit4]   2> 7362 T423 oasc.SolrCore.<init> [collection1] Opening new SolrCore at /usr/home/hudson/hudson-slave/workspace/Lucene-Solr-Tests-trunk-java7/solr/build/solr-core/test-files/solr/collection1/, dataDir=./org.apache.solr.cloud.BasicDistributedZk2Test-1347719940162/jetty3/
[junit4:junit4]   2> 7363 T423 oasc.JmxMonitoredMap.<init> JMX monitoring is enabled. Adding Solr mbeans to JMX Server: com.sun.jmx.mbeanserver.JmxMBeanServer@6cd827df
[junit4:junit4]   2> 7365 T423 oasc.SolrCore.getNewIndexDir WARNING New index directory detected: old=null new=./org.apache.solr.cloud.BasicDistributedZk2Test-1347719940162/jetty3/index/
[junit4:junit4]   2> 7366 T423 oasc.SolrCore.initIndex WARNING [collection1] Solr index directory './org.apache.solr.cloud.BasicDistributedZk2Test-1347719940162/jetty3/index' doesn't exist. Creating new index...
[junit4:junit4]   2> 7367 T423 oasc.CachingDirectoryFactory.get return new directory for /usr/home/hudson/hudson-slave/workspace/Lucene-Solr-Tests-trunk-java7/solr/build/solr-core/test/J1/./org.apache.solr.cloud.BasicDistributedZk2Test-1347719940162/jetty3/index forceNew:false
[junit4:junit4]   2> 7374 T423 oasc.SolrDeletionPolicy.onCommit SolrDeletionPolicy.onCommit: commits:num=1
[junit4:junit4]   2> 		commit{dir=/usr/home/hudson/hudson-slave/workspace/Lucene-Solr-Tests-trunk-java7/solr/build/solr-core/test/J1/org.apache.solr.cloud.BasicDistributedZk2Test-1347719940162/jetty3/index,segFN=segments_1,generation=1,filenames=[segments_1]
[junit4:junit4]   2> 7375 T423 oasc.SolrDeletionPolicy.updateCommits newest commit = 1
[junit4:junit4]   2> 7376 T423 oasc.SolrCore.initWriters created xml: solr.XMLResponseWriter
[junit4:junit4]   2> 7379 T423 oasup.UpdateRequestProcessorChain.init inserting DistributedUpdateProcessorFactory into updateRequestProcessorChain "dedupe"
[junit4:junit4]   2> 7380 T423 oasup.UpdateRequestProcessorChain.init inserting DistributedUpdateProcessorFactory into updateRequestProcessorChain "dedupe-allfields"
[junit4:junit4]   2> 7381 T423 oasup.UpdateRequestProcessorChain.init inserting DistributedUpdateProcessorFactory into updateRequestProcessorChain "stored_sig"
[junit4:junit4]   2> 7381 T423 oasup.UpdateRequestProcessorChain.init inserting DistributedUpdateProcessorFactory into updateRequestProcessorChain "uniq-fields"
[junit4:junit4]   2> 7382 T423 oasup.UpdateRequestProcessorChain.init inserting DistributedUpdateProcessorFactory into updateRequestProcessorChain "distrib-dup-test-chain-implicit"
[junit4:junit4]   2> 7383 T423 oasc.RequestHandlers.initHandlersFromConfig adding lazy requestHandler: solr.ReplicationHandler
[junit4:junit4]   2> 7384 T423 oasc.RequestHandlers.initHandlersFromConfig created /replication: solr.ReplicationHandler
[junit4:junit4]   2> 7384 T423 oasc.RequestHandlers.initHandlersFromConfig created standard: solr.StandardRequestHandler
[junit4:junit4]   2> 7385 T423 oasc.RequestHandlers.initHandlersFromConfig created /get: solr.RealTimeGetHandler
[junit4:junit4]   2> 7386 T423 oasc.RequestHandlers.initHandlersFromConfig created dismax: solr.SearchHandler
[junit4:junit4]   2> 7387 T423 oasc.RequestHandlers.initHandlersFromConfig created mock: org.apache.solr.core.MockQuerySenderListenerReqHandler
[junit4:junit4]   2> 7388 T423 oasc.RequestHandlers.initHandlersFromConfig created /admin/: org.apache.solr.handler.admin.AdminHandlers
[junit4:junit4]   2> 7389 T423 oasc.RequestHandlers.initHandlersFromConfig created defaults: solr.StandardRequestHandler
[junit4:junit4]   2> 7389 T423 oasc.RequestHandlers.initHandlersFromConfig adding lazy requestHandler: solr.StandardRequestHandler
[junit4:junit4]   2> 7390 T423 oasc.RequestHandlers.initHandlersFromConfig created lazy: solr.StandardRequestHandler
[junit4:junit4]   2> 7391 T423 oasc.RequestHandlers.initHandlersFromConfig created /update: solr.UpdateRequestHandler
[junit4:junit4]   2> 7392 T423 oasc.RequestHandlers.initHandlersFromConfig created /terms: org.apache.solr.handler.component.SearchHandler
[junit4:junit4]   2> 7393 T423 oasc.RequestHandlers.initHandlersFromConfig created spellCheckCompRH: org.apache.solr.handler.component.SearchHandler
[junit4:junit4]   2> 7394 T423 oasc.RequestHandlers.initHandlersFromConfig created spellCheckCompRH_Direct: org.apache.solr.handler.component.SearchHandler
[junit4:junit4]   2> 7394 T423 oasc.RequestHandlers.initHandlersFromConfig created spellCheckWithWordbreak: org.apache.solr.handler.component.SearchHandler
[junit4:junit4]   2> 7395 T423 oasc.RequestHandlers.initHandlersFromConfig created spellCheckWithWordbreak_Direct: org.apache.solr.handler.component.SearchHandler
[junit4:junit4]   2> 7396 T423 oasc.RequestHandlers.initHandlersFromConfig created spellCheckCompRH1: org.apache.solr.handler.component.SearchHandler
[junit4:junit4]   2> 7397 T423 oasc.RequestHandlers.initHandlersFromConfig created tvrh: org.apache.solr.handler.component.SearchHandler
[junit4:junit4]   2> 7398 T423 oasc.RequestHandlers.initHandlersFromConfig created /mlt: solr.MoreLikeThisHandler
[junit4:junit4]   2> 7399 T423 oasc.RequestHandlers.initHandlersFromConfig created /debug/dump: solr.DumpRequestHandler
[junit4:junit4]   2> 7404 T423 oashl.XMLLoader.init xsltCacheLifetimeSeconds=60
[junit4:junit4]   2> 7410 T423 oasc.SolrCore.initDeprecatedSupport WARNING solrconfig.xml uses deprecated <admin/gettableFiles>, Please update your config to use the ShowFileRequestHandler.
[junit4:junit4]   2> 7411 T423 oasc.SolrCore.initDeprecatedSupport WARNING adding ShowFileRequestHandler with hidden files: [SCHEMA.XML, OLD_SYNONYMS.TXT, STOPWORDS.TXT, PROTWORDS.TXT, OPEN-EXCHANGE-RATES.JSON, SYNONYMS.TXT, CURRENCY.XML, MAPPING-ISOLATIN1ACCENT.TXT]
[junit4:junit4]   2> 7416 T423 oass.SolrIndexSearcher.<init> Opening Searcher@5a4f4dd1 main
[junit4:junit4]   2> 7417 T423 oasu.CommitTracker.<init> Hard AutoCommit: disabled
[junit4:junit4]   2> 7418 T423 oasu.CommitTracker.<init> Soft AutoCommit: disabled
[junit4:junit4]   2> 7419 T423 oashc.SpellCheckComponent.inform Initializing spell checkers
[junit4:junit4]   2> 7428 T423 oass.DirectSolrSpellChecker.init init: {name=direct,classname=DirectSolrSpellChecker,field=lowerfilt,minQueryLength=3}
[junit4:junit4]   2> 7499 T482 oasc.SolrCore.registerSearcher [collection1] Registered new searcher Searcher@5a4f4dd1 main{StandardDirectoryReader(segments_1:1)}
[junit4:junit4]   2> 7751 T444 oascc.ZkStateReader.updateClusterState Updating cloud state from ZooKeeper... 
[junit4:junit4]   2> 7768 T443 oascc.ZkStateReader$2.process A cluster state change has occurred - updating...
[junit4:junit4]   2> 7768 T469 oascc.ZkStateReader$2.process A cluster state change has occurred - updating...
[junit4:junit4]   2> 7768 T481 oascc.ZkStateReader$2.process A cluster state change has occurred - updating...
[junit4:junit4]   2> 7768 T457 oascc.ZkStateReader$2.process A cluster state change has occurred - updating...
[junit4:junit4]   2> 8008 T423 oasc.CoreContainer.register registering core: collection1
[junit4:junit4]   2> 8009 T423 oasc.ZkController.register Register shard - core:collection1 address:http://127.0.0.1:11969/solr shardId:shard1
[junit4:junit4]   2> 8014 T423 oasc.ZkController.register We are http://127.0.0.1:11969/solr/collection1/ and leader is http://127.0.0.1:11953/solr/collection1/
[junit4:junit4]   2> 8015 T423 oasc.ZkController.register No LogReplay needed for core=collection1 baseURL=http://127.0.0.1:11969/solr
[junit4:junit4]   2> 8015 T423 oasc.ZkController.checkRecovery Core needs to recover:collection1
[junit4:junit4]   2> 8016 T423 oasu.DefaultSolrCoreState.doRecovery Running recovery - first canceling any ongoing recovery
[junit4:junit4]   2> ASYNC  NEW_CORE C45 name=collection1 org.apache.solr.core.SolrCore@5465f4d9 url=http://127.0.0.1:11969/solr/collection1 node=127.0.0.1:11969_solr
[junit4:junit4]   2> 8017 T483 C45 P11969 oasc.RecoveryStrategy.run Starting recovery process.  core=collection1 recoveringAfterStartup=true
[junit4:junit4]   2> 8018 T483 C45 P11969 oasc.RecoveryStrategy.doRecovery ###### startupVersions=[]
[junit4:junit4]   2> 8018 T423 oascc.ZkStateReader.updateClusterState Updating cloud state from ZooKeeper... 
[junit4:junit4]   2> 8020 T483 C45 P11969 oasc.RecoveryStrategy.doRecovery Attempting to PeerSync from http://127.0.0.1:11953/solr/collection1/ core=collection1 - recoveringAfterStartup=true
[junit4:junit4]   2> 8020 T483 C45 P11969 oasu.PeerSync.sync PeerSync: core=collection1 url=http://127.0.0.1:11969/solr START replicas=[http://127.0.0.1:11953/solr/collection1/] nUpdates=100
[junit4:junit4]   2> 8020 T423 oass.SolrDispatchFilter.init user.dir=/usr/home/hudson/hudson-slave/workspace/Lucene-Solr-Tests-trunk-java7/solr/build/solr-core/test/J1
[junit4:junit4]   2> 8021 T483 C45 P11969 oasu.PeerSync.sync WARNING no frame of reference to tell of we've missed updates
[junit4:junit4]   2> 8021 T423 oass.SolrDispatchFilter.init SolrDispatchFilter.init() done
[junit4:junit4]   2> 8022 T483 C45 P11969 oasc.RecoveryStrategy.doRecovery PeerSync Recovery was not successful - trying replication. core=collection1
[junit4:junit4]   2> 8022 T423 oascsi.HttpClientUtil.createClient Creating new http client, config:maxConnections=128&maxConnectionsPerHost=32&followRedirects=false
[junit4:junit4]   2> 8022 T483 C45 P11969 oasc.RecoveryStrategy.doRecovery Starting Replication Recovery. core=collection1
[junit4:junit4]   2> 8023 T483 C45 P11969 oascsi.HttpClientUtil.createClient Creating new http client, config:maxConnections=128&maxConnectionsPerHost=32&followRedirects=false
[junit4:junit4]   2> ASYNC  NEW_CORE C46 name=collection1 org.apache.solr.core.SolrCore@2fd492e8 url=http://127.0.0.1:11953/solr/collection1 node=127.0.0.1:11953_solr
[junit4:junit4]   2> 8036 T449 C46 P11953 REQ /get {distrib=false&qt=/get&wt=javabin&version=2&getVersions=100} status=0 QTime=0 
[junit4:junit4]   2> 8047 T423 oejs.Server.doStart jetty-8.1.2.v20120308
[junit4:junit4]   2> 8050 T423 oejs.AbstractConnector.doStart Started SocketConnector@0.0.0.0:11979
[junit4:junit4]   2> 8051 T423 oasc.SolrResourceLoader.locateSolrHome JNDI not configured for solr (NoInitialContextEx)
[junit4:junit4]   2> 8052 T423 oasc.SolrResourceLoader.locateSolrHome using system property solr.solr.home: /usr/home/hudson/hudson-slave/workspace/Lucene-Solr-Tests-trunk-java7/solr/build/solr-core/test-files/solr
[junit4:junit4]   2> 8052 T423 oasc.SolrResourceLoader.<init> new SolrResourceLoader for deduced Solr Home: '/usr/home/hudson/hudson-slave/workspace/Lucene-Solr-Tests-trunk-java7/solr/build/solr-core/test-files/solr/'
[junit4:junit4]   2> 8096 T423 oass.SolrDispatchFilter.init SolrDispatchFilter.init()
[junit4:junit4]   2> 8097 T423 oasc.SolrResourceLoader.locateSolrHome JNDI not configured for solr (NoInitialContextEx)
[junit4:junit4]   2> 8098 T423 oasc.SolrResourceLoader.locateSolrHome using system property solr.solr.home: /usr/home/hudson/hudson-slave/workspace/Lucene-Solr-Tests-trunk-java7/solr/build/solr-core/test-files/solr
[junit4:junit4]   2> 8098 T423 oasc.CoreContainer$Initializer.initialize looking for solr.xml: /usr/home/hudson/hudson-slave/workspace/Lucene-Solr-Tests-trunk-java7/solr/build/solr-core/test-files/solr/solr.xml
[junit4:junit4]   2> 8099 T423 oasc.CoreContainer.<init> New CoreContainer 47374189
[junit4:junit4]   2> 8100 T423 oasc.CoreContainer.load Loading CoreContainer using Solr Home: '/usr/home/hudson/hudson-slave/workspace/Lucene-Solr-Tests-trunk-java7/solr/build/solr-core/test-files/solr/'
[junit4:junit4]   2> 8100 T423 oasc.SolrResourceLoader.<init> new SolrResourceLoader for directory: '/usr/home/hudson/hudson-slave/workspace/Lucene-Solr-Tests-trunk-java7/solr/build/solr-core/test-files/solr/'
[junit4:junit4]   2> 8133 T423 oasc.CoreContainer.load Registering Log Listener
[junit4:junit4]   2> 8149 T423 oasc.CoreContainer.initZooKeeper Zookeeper client=127.0.0.1:11942/solr
[junit4:junit4]   2> 8150 T423 oaz.ZooKeeper.<init> Initiating client connection, connectString=127.0.0.1:11942/solr sessionTimeout=5000 watcher=org.apache.solr.common.cloud.ConnectionManager@9444a20
[junit4:junit4]   2> 8151 T494 oaz.ClientCnxn$SendThread.startConnect Opening socket connection to server /127.0.0.1:11942
[junit4:junit4]   2> 8151 T423 oascc.ConnectionManager.waitForConnected Waiting for client to connect to ZooKeeper
[junit4:junit4]   2> 8153 T494 oaz.ClientCnxn$SendThread.primeConnection Socket connection established to localhost/127.0.0.1:11942, initiating session
[junit4:junit4]   2> 8153 T425 oazs.NIOServerCnxn$Factory.run Accepted socket connection from /140.211.11.196:11980
[junit4:junit4]   2> 8154 T425 oazs.NIOServerCnxn.readConnectRequest Client attempting to establish new session at /140.211.11.196:11980
[junit4:junit4]   2> 8155 T427 oazs.NIOServerCnxn.finishSessionInit Established session 0x139ca5e48470006 with negotiated timeout 5000 for client /140.211.11.196:11980
[junit4:junit4]   2> 8155 T494 oaz.ClientCnxn$SendThread.readConnectResult Session establishment complete on server localhost/127.0.0.1:11942, sessionid = 0x139ca5e48470006, negotiated timeout = 5000
[junit4:junit4]   2> 8156 T495 oascc.ConnectionManager.process Watcher org.apache.solr.common.cloud.ConnectionManager@9444a20 name:ZooKeeperConnection Watcher:127.0.0.1:11942/solr got event WatchedEvent state:SyncConnected type:None path:null path:null type:None
[junit4:junit4]   2> 8156 T423 oascc.ConnectionManager.waitForConnected Client is connected to ZooKeeper
[junit4:junit4]   2> 8157 T428 oazs.PrepRequestProcessor.pRequest Got user-level KeeperException when processing sessionid:0x139ca5e48470006 type:create cxid:0x1 zxid:0xfffffffffffffffe txntype:unknown reqpath:n/a Error Path:/solr/overseer Error:KeeperErrorCode = NodeExists for /solr/overseer
[junit4:junit4]   2> 8159 T428 oazs.PrepRequestProcessor.pRequest Got user-level KeeperException when processing sessionid:0x139ca5e48470006 type:create cxid:0x2 zxid:0xfffffffffffffffe txntype:unknown reqpath:n/a Error Path:/solr/overseer Error:KeeperErrorCode = NodeExists for /solr/overseer
[junit4:junit4]   2> 8166 T423 oasc.ZkController.createEphemeralLiveNode Register node as live in ZooKeeper:/live_nodes/127.0.0.1:11979_solr
[junit4:junit4]   2> 8167 T428 oazs.PrepRequestProcessor.pRequest Got user-level KeeperException when processing sessionid:0x139ca5e48470006 type:delete cxid:0x4 zxid:0xfffffffffffffffe txntype:unknown reqpath:n/a Error Path:/solr/live_nodes/127.0.0.1:11979_solr Error:KeeperErrorCode = NoNode for /solr/live_nodes/127.0.0.1:11979_solr
[junit4:junit4]   2> 8168 T423 oascc.SolrZkClient.makePath makePath: /live_nodes/127.0.0.1:11979_solr
[junit4:junit4]   2> 8171 T469 oascc.ZkStateReader$3.process Updating live nodes
[junit4:junit4]   2> 8171 T457 oascc.ZkStateReader$3.process Updating live nodes
[junit4:junit4]   2> 8171 T481 oascc.ZkStateReader$3.process Updating live nodes
[junit4:junit4]   2> 8171 T443 oascc.ZkStateReader$3.process Updating live nodes
[junit4:junit4]   2> 8172 T423 oashc.HttpShardHandlerFactory.getParameter Setting socketTimeout to: 0
[junit4:junit4]   2> 8173 T423 oashc.HttpShardHandlerFactory.getParameter Setting urlScheme to: http://
[junit4:junit4]   2> 8173 T423 oashc.HttpShardHandlerFactory.getParameter Setting connTimeout to: 0
[junit4:junit4]   2> 8174 T423 oashc.HttpShardHandlerFactory.getParameter Setting maxConnectionsPerHost to: 20
[junit4:junit4]   2> 8174 T423 oashc.HttpShardHandlerFactory.getParameter Setting corePoolSize to: 0
[junit4:junit4]   2> 8175 T423 oashc.HttpShardHandlerFactory.getParameter Setting maximumPoolSize to: 2147483647
[junit4:junit4]   2> 8175 T423 oashc.HttpShardHandlerFactory.getParameter Setting maxThreadIdleTime to: 5
[junit4:junit4]   2> 8176 T423 oashc.HttpShardHandlerFactory.getParameter Setting sizeOfQueue to: -1
[junit4:junit4]   2> 8176 T423 oashc.HttpShardHandlerFactory.getParameter Setting fairnessPolicy to: false
[junit4:junit4]   2> 8177 T423 oascsi.HttpClientUtil.createClient Creating new http client, config:maxConnectionsPerHost=20&maxConnections=10000&socketTimeout=0&connTimeout=0&retry=false
[junit4:junit4]   2> 8194 T423 oascc.ZkStateReader.createClusterStateWatchersAndUpdate Updating cluster state from ZooKeeper... 
[junit4:junit4]   2> 8202 T423 oasc.CoreContainer.create Creating SolrCore 'collection1' using instanceDir: /usr/home/hudson/hudson-slave/workspace/Lucene-Solr-Tests-trunk-java7/solr/build/solr-core/test-files/solr/collection1
[junit4:junit4]   2> 8202 T423 oasc.ZkController.createCollectionZkNode Check for collection zkNode:collection1
[junit4:junit4]   2> 8203 T423 oasc.ZkController.createCollectionZkNode Collection zkNode exists
[junit4:junit4]   2> 8204 T423 oasc.ZkController.readConfigName Load collection config from:/collections/collection1
[junit4:junit4]   2> 8205 T423 oasc.SolrResourceLoader.<init> new SolrResourceLoader for directory: '/usr/home/hudson/hudson-slave/workspace/Lucene-Solr-Tests-trunk-java7/solr/build/solr-core/test-files/solr/collection1/'
[junit4:junit4]   2> 8207 T423 oasc.SolrResourceLoader.replaceClassLoader Adding 'file:/usr/home/hudson/hudson-slave/workspace/Lucene-Solr-Tests-trunk-java7/solr/build/solr-core/test-files/solr/collection1/lib/README' to classloader
[junit4:junit4]   2> 8208 T423 oasc.SolrResourceLoader.replaceClassLoader Adding 'file:/usr/home/hudson/hudson-slave/workspace/Lucene-Solr-Tests-trunk-java7/solr/build/solr-core/test-files/solr/collection1/lib/classes/' to classloader
[junit4:junit4]   2> 8260 T423 oasc.SolrConfig.<init> Using Lucene MatchVersion: LUCENE_50
[junit4:junit4]   2> 8282 T444 oascc.ZkStateReader.updateClusterState Updating cloud state from ZooKeeper... 
[junit4:junit4]   2> 8333 T423 oasc.SolrConfig.<init> Loaded SolrConfig: solrconfig.xml
[junit4:junit4]   2> 8339 T495 oascc.ZkStateReader$2.process A cluster state change has occurred - updating...
[junit4:junit4]   2> 8339 T457 oascc.ZkStateReader$2.process A cluster state change has occurred - updating...
[junit4:junit4]   2> 8339 T481 oascc.ZkStateReader$2.process A cluster state change has occurred - updating...
[junit4:junit4]   2> 8339 T443 oascc.ZkStateReader$2.process A cluster state change has occurred - updating...
[junit4:junit4]   2> 8339 T469 oascc.ZkStateReader$2.process A cluster state change has occurred - updating...
[junit4:junit4]   2> 8340 T423 oass.IndexSchema.readSchema Reading Solr Schema
[junit4:junit4]   2> 8348 T423 oass.IndexSchema.readSchema Schema name=test
[junit4:junit4]   2> 9009 T423 oass.OpenExchangeRatesOrgProvider.init Initialized with rates=open-exchange-rates.json, refreshInterval=1440.
[junit4:junit4]   2> 9017 T423 oass.IndexSchema.readSchema default search field in schema is text
[junit4:junit4]   2> 9020 T423 oass.IndexSchema.readSchema unique key field: id
[junit4:junit4]   2> 9035 T423 oass.FileExchangeRateProvider.reload Reloading exchange rates from file currency.xml
[junit4:junit4]   2> 9039 T423 oass.FileExchangeRateProvider.reload Reloading exchange rates from file currency.xml
[junit4:junit4]   2> 9044 T423 oass.OpenExchangeRatesOrgProvider.reload Reloading exchange rates from open-exchange-rates.json
[junit4:junit4]   2> 9045 T423 oass.OpenExchangeRatesOrgProvider.reload Reloading exchange rates from open-exchange-rates.json
[junit4:junit4]   2> 9047 T423 oasc.SolrCore.<init> [collection1] Opening new SolrCore at /usr/home/hudson/hudson-slave/workspace/Lucene-Solr-Tests-trunk-java7/solr/build/solr-core/test-files/solr/collection1/, dataDir=./org.apache.solr.cloud.BasicDistributedZk2Test-1347719940162/jetty4/
[junit4:junit4]   2> 9047 T423 oasc.JmxMonitoredMap.<init> JMX monitoring is enabled. Adding Solr mbeans to JMX Server: com.sun.jmx.mbeanserver.JmxMBeanServer@6cd827df
[junit4:junit4]   2> 9048 T423 oasc.SolrCore.getNewIndexDir WARNING New index directory detected: old=null new=./org.apache.solr.cloud.BasicDistributedZk2Test-1347719940162/jetty4/index/
[junit4:junit4]   2> 9049 T423 oasc.SolrCore.initIndex WARNING [collection1] Solr index directory './org.apache.solr.cloud.BasicDistributedZk2Test-1347719940162/jetty4/index' doesn't exist. Creating new index...
[junit4:junit4]   2> 9050 T423 oasc.CachingDirectoryFactory.get return new directory for /usr/home/hudson/hudson-slave/workspace/Lucene-Solr-Tests-trunk-java7/solr/build/solr-core/test/J1/./org.apache.solr.cloud.BasicDistributedZk2Test-1347719940162/jetty4/index forceNew:false
[junit4:junit4]   2> 9062 T423 oasc.SolrDeletionPolicy.onCommit SolrDeletionPolicy.onCommit: commits:num=1
[junit4:junit4]   2> 		commit{dir=/usr/home/hudson/hudson-slave/workspace/Lucene-Solr-Tests-trunk-java7/solr/build/solr-core/test/J1/org.apache.solr.cloud.BasicDistributedZk2Test-1347719940162/jetty4/index,segFN=segments_1,generation=1,filenames=[segments_1]
[junit4:junit4]   2> 9063 T423 oasc.SolrDeletionPolicy.updateCommits newest commit = 1
[junit4:junit4]   2> 9063 T423 oasc.SolrCore.initWriters created xml: solr.XMLResponseWriter
[junit4:junit4]   2> 9065 T423 oasup.UpdateRequestProcessorChain.init inserting DistributedUpdateProcessorFactory into updateRequestProcessorChain "dedupe"
[junit4:junit4]   2> 9066 T423 oasup.UpdateRequestProcessorChain.init inserting DistributedUpdateProcessorFactory into updateRequestProcessorChain "dedupe-allfields"
[junit4:junit4]   2> 9066 T423 oasup.UpdateRequestProcessorChain.init inserting DistributedUpdateProcessorFactory into updateRequestProcessorChain "stored_sig"
[junit4:junit4]   2> 9067 T423 oasup.UpdateRequestProcessorChain.init inserting DistributedUpdateProcessorFactory into updateRequestProcessorChain "uniq-fields"
[junit4:junit4]   2> 9067 T423 oasup.UpdateRequestProcessorChain.init inserting DistributedUpdateProcessorFactory into updateRequestProcessorChain "distrib-dup-test-chain-implicit"
[junit4:junit4]   2> 9068 T423 oasc.RequestHandlers.initHandlersFromConfig adding lazy requestHandler: solr.ReplicationHandler
[junit4:junit4]   2> 9068 T423 oasc.RequestHandlers.initHandlersFromConfig created /replication: solr.ReplicationHandler
[junit4:junit4]   2> 9069 T423 oasc.RequestHandlers.initHandlersFromConfig created standard: solr.StandardRequestHandler
[junit4:junit4]   2> 9069 T423 oasc.RequestHandlers.initHandlersFromConfig created /get: solr.RealTimeGetHandler
[junit4:junit4]   2> 9070 T423 oasc.RequestHandlers.initHandlersFromConfig created dismax: solr.SearchHandler
[junit4:junit4]   2> 9071 T423 oasc.RequestHandlers.initHandlersFromConfig created mock: org.apache.solr.core.MockQuerySenderListenerReqHandler
[junit4:junit4]   2> 9071 T423 oasc.RequestHandlers.initHandlersFromConfig created /admin/: org.apache.solr.handler.admin.AdminHandlers
[junit4:junit4]   2> 9072 T423 oasc.RequestHandlers.initHandlersFromConfig created defaults: solr.StandardRequestHandler
[junit4:junit4]   2> 9072 T423 oasc.RequestHandlers.initHandlersFromConfig adding lazy requestHandler: solr.StandardRequestHandler
[junit4:junit4]   2> 9073 T423 oasc.RequestHandlers.initHandlersFromConfig created lazy: solr.StandardRequestHandler
[junit4:junit4]   2> 9073 T423 oasc.RequestHandlers.initHandlersFromConfig created /update: solr.UpdateRequestHandler
[junit4:junit4]   2> 9074 T423 oasc.RequestHandlers.initHandlersFromConfig created /terms: org.apache.solr.handler.component.SearchHandler
[junit4:junit4]   2> 9074 T423 oasc.RequestHandlers.initHandlersFromConfig created spellCheckCompRH: org.apache.solr.handler.component.SearchHandler
[junit4:junit4]   2> 9075 T423 oasc.RequestHandlers.initHandlersFromConfig created spellCheckCompRH_Direct: org.apache.solr.handler.component.SearchHandler
[junit4:junit4]   2> 9075 T423 oasc.RequestHandlers.initHandlersFromConfig created spellCheckWithWordbreak: org.apache.solr.handler.component.SearchHandler
[junit4:junit4]   2> 9076 T423 oasc.RequestHandlers.initHandlersFromConfig created spellCheckWithWordbreak_Direct: org.apache.solr.handler.component.SearchHandler
[junit4:junit4]   2> 9077 T423 oasc.RequestHandlers.initHandlersFromConfig created spellCheckCompRH1: org.apache.solr.handler.component.SearchHandler
[junit4:junit4]   2> 9077 T423 oasc.RequestHandlers.initHandlersFromConfig created tvrh: org.apache.solr.handler.component.SearchHandler
[junit4:junit4]   2> 9078 T423 oasc.RequestHandlers.initHandlersFromConfig created /mlt: solr.MoreLikeThisHandler
[junit4:junit4]   2> 9078 T423 oasc.RequestHandlers.initHandlersFromConfig created /debug/dump: solr.DumpRequestHandler
[junit4:junit4]   2> 9081 T423 oashl.XMLLoader.init xsltCacheLifetimeSeconds=60
[junit4:junit4]   2> 9084 T423 oasc.SolrCore.initDeprecatedSupport WARNING solrconfig.xml uses deprecated <admin/gettableFiles>, Please update your config to use the ShowFileRequestHandler.
[junit4:junit4]   2> 9086 T423 oasc.SolrCore.initDeprecatedSupport WARNING adding ShowFileRequestHandler with hidden files: [SCHEMA.XML, OLD_SYNONYMS.TXT, STOPWORDS.TXT, PROTWORDS.TXT, OPEN-EXCHANGE-RATES.JSON, SYNONYMS.TXT, CURRENCY.XML, MAPPING-ISOLATIN1ACCENT.TXT]
[junit4:junit4]   2> 9089 T423 oass.SolrIndexSearcher.<init> Opening Searcher@679a339e main
[junit4:junit4]   2> 9090 T423 oasu.CommitTracker.<init> Hard AutoCommit: disabled
[junit4:junit4]   2> 9090 T423 oasu.CommitTracker.<init> Soft AutoCommit: disabled
[junit4:junit4]   2> 9091 T423 oashc.SpellCheckComponent.inform Initializing spell checkers
[junit4:junit4]   2> 9105 T423 oass.DirectSolrSpellChecker.init init: {name=direct,classname=DirectSolrSpellChecker,field=lowerfilt,minQueryLength=3}
[junit4:junit4]   2> 9157 T496 oasc.SolrCore.registerSearcher [collection1] Registered new searcher Searcher@679a339e main{StandardDirectoryReader(segments_1:1)}
[junit4:junit4]   2> 9347 T444 oascc.ZkStateReader.updateClusterState Updating cloud state from ZooKeeper... 
[junit4:junit4]   2> 9366 T495 oascc.ZkStateReader$2.process A cluster state change has occurred - updating...
[junit4:junit4]   2> 9366 T457 oascc.ZkStateReader$2.process A cluster state change has occurred - updating...
[junit4:junit4]   2> 9366 T443 oascc.ZkStateReader$2.process A cluster state change has occurred - updating...
[junit4:junit4]   2> 9366 T481 oascc.ZkStateReader$2.process A cluster state change has occurred - updating...
[junit4:junit4]   2> 9366 T469 oascc.ZkStateReader$2.process A cluster state change has occurred - updating...
[junit4:junit4]   2> 9668 T423 oasc.CoreContainer.register registering core: collection1
[junit4:junit4]   2> 9669 T423 oasc.ZkController.register Register shard - core:collection1 address:http://127.0.0.1:11979/solr shardId:shard2
[junit4:junit4]   2> 9673 T423 oasc.ZkController.register We are http://127.0.0.1:11979/solr/collection1/ and leader is http://127.0.0.1:11959/solr/collection1/
[junit4:junit4]   2> 9673 T423 oasc.ZkController.register No LogReplay needed for core=collection1 baseURL=http://127.0.0.1:11979/solr
[junit4:junit4]   2> 9674 T423 oasc.ZkController.checkRecovery Core needs to recover:collection1
[junit4:junit4]   2> 9674 T423 oasu.DefaultSolrCoreState.doRecovery Running recovery - first canceling any ongoing recovery
[junit4:junit4]   2> ASYNC  NEW_CORE C47 name=collection1 org.apache.solr.core.SolrCore@f01ba81 url=http://127.0.0.1:11979/solr/collection1 node=127.0.0.1:11979_solr
[junit4:junit4]   2> 9676 T497 C47 P11979 oasc.RecoveryStrategy.run Starting recovery process.  core=collection1 recoveringAfterStartup=true
[junit4:junit4]   2> 9676 T497 C47 P11979 oasc.RecoveryStrategy.doRecovery ###### startupVersions=[]
[junit4:junit4]   2> 9676 T423 oascc.ZkStateReader.updateClusterState Updating cloud state from ZooKeeper... 
[junit4:junit4]   2> 9678 T497 C47 P11979 oasc.RecoveryStrategy.doRecovery Attempting to PeerSync from http://127.0.0.1:11959/solr/collection1/ core=collection1 - recoveringAfterStartup=true
[junit4:junit4]   2> 9678 T497 C47 P11979 oasu.PeerSync.sync PeerSync: core=collection1 url=http://127.0.0.1:11979/solr START replicas=[http://127.0.0.1:11959/solr/collection1/] nUpdates=100
[junit4:junit4]   2> 9678 T423 oass.SolrDispatchFilter.init user.dir=/usr/home/hudson/hudson-slave/workspace/Lucene-Solr-Tests-trunk-java7/solr/build/solr-core/test/J1
[junit4:junit4]   2> 9678 T497 C47 P11979 oasu.PeerSync.sync WARNING no frame of reference to tell of we've missed updates
[junit4:junit4]   2> 9679 T423 oass.SolrDispatchFilter.init SolrDispatchFilter.init() done
[junit4:junit4]   2> 9679 T497 C47 P11979 oasc.RecoveryStrategy.doRecovery PeerSync Recovery was not successful - trying replication. core=collection1
[junit4:junit4]   2> 9680 T497 C47 P11979 oasc.RecoveryStrategy.doRecovery Starting Replication Recovery. core=collection1
[junit4:junit4]   2> 9680 T497 C47 P11979 oascsi.HttpClientUtil.createClient Creating new http client, config:maxConnections=128&maxConnectionsPerHost=32&followRedirects=false
[junit4:junit4]   2> 9680 T423 oascsi.HttpClientUtil.createClient Creating new http client, config:maxConnections=128&maxConnectionsPerHost=32&followRedirects=false
[junit4:junit4]   2> ASYNC  NEW_CORE C48 name=collection1 org.apache.solr.core.SolrCore@63031e0f url=http://127.0.0.1:11959/solr/collection1 node=127.0.0.1:11959_solr
[junit4:junit4]   2> 9686 T461 C48 P11959 REQ /get {distrib=false&qt=/get&wt=javabin&version=2&getVersions=100} status=0 QTime=0 
[junit4:junit4]   2> 9695 T423 oaz.ZooKeeper.<init> Initiating client connection, connectString=127.0.0.1:11942/solr sessionTimeout=10000 watcher=org.apache.solr.common.cloud.ConnectionManager@2a57eb6c
[junit4:junit4]   2> 9697 T499 oaz.ClientCnxn$SendThread.startConnect Opening socket connection to server /127.0.0.1:11942
[junit4:junit4]   2> 9697 T423 oascc.ConnectionManager.waitForConnected Waiting for client to connect to ZooKeeper
[junit4:junit4]   2> 9697 T499 oaz.ClientCnxn$SendThread.primeConnection Socket connection established to localhost/127.0.0.1:11942, initiating session
[junit4:junit4]   2> 9697 T425 oazs.NIOServerCnxn$Factory.run Accepted socket connection from /140.211.11.196:11990
[junit4:junit4]   2> 9698 T425 oazs.NIOServerCnxn.readConnectRequest Client attempting to establish new session at /140.211.11.196:11990
[junit4:junit4]   2> 9699 T427 oazs.NIOServerCnxn.finishSessionInit Established session 0x139ca5e48470007 with negotiated timeout 10000 for client /140.211.11.196:11990
[junit4:junit4]   2> 9699 T499 oaz.ClientCnxn$SendThread.readConnectResult Session establishment complete on server localhost/127.0.0.1:11942, sessionid = 0x139ca5e48470007, negotiated timeout = 10000
[junit4:junit4]   2> 9700 T500 oascc.ConnectionManager.process Watcher org.apache.solr.common.cloud.ConnectionManager@2a57eb6c name:ZooKeeperConnection Watcher:127.0.0.1:11942/solr got event WatchedEvent state:SyncConnected type:None path:null path:null type:None
[junit4:junit4]   2> 9700 T423 oascc.ConnectionManager.waitForConnected Client is connected to ZooKeeper
[junit4:junit4]   2> 9701 T423 oascc.ZkStateReader.createClusterStateWatchersAndUpdate Updating cluster state from ZooKeeper... 
[junit4:junit4]   2> 9703 T423 oasc.ChaosMonkey.monkeyLog monkey: init - expire sessions:true cause connection loss:true
[junit4:junit4]   2> 9703 T423 oascsi.HttpClientUtil.createClient Creating new http client, config:
[junit4:junit4]   2> 9715 T423 oascc.ZkStateReader.updateClusterState Updating cloud state from ZooKeeper... 
[junit4:junit4]   2> ASYNC  NEW_CORE C49 name=collection1 org.apache.solr.core.SolrCore@259af560 url=http://127.0.0.1:11945/solr/collection1 node=127.0.0.1:11945_solr
[junit4:junit4]   2> 9728 T435 C49 P11945 oasc.SolrDeletionPolicy.onInit SolrDeletionPolicy.onInit: commits:num=1
[junit4:junit4]   2> 		commit{dir=/usr/home/hudson/hudson-slave/workspace/Lucene-Solr-Tests-trunk-java7/solr/build/solr-core/test/J1/org.apache.solr.cloud.BasicDistributedZk2Test-1347719940162/control/data/index,segFN=segments_1,generation=1,filenames=[segments_1]
[junit4:junit4]   2> 9729 T435 C49 P11945 oasc.SolrDeletionPolicy.updateCommits newest commit = 1
[junit4:junit4]   2> 9734 T435 C49 P11945 /update {wt=javabin&version=2} {add=[1 (1413186794165370880)]} 0 11
[junit4:junit4]   2> 9735 T423 oaz.ZooKeeper.<init> Initiating client connection, connectString=127.0.0.1:11942/solr sessionTimeout=10000 watcher=org.apache.solr.common.cloud.ConnectionManager@3e5933f3
[junit4:junit4]   2> 9736 T501 oaz.ClientCnxn$SendThread.startConnect Opening socket connection to server /127.0.0.1:11942
[junit4:junit4]   2> 9736 T423 oascc.ConnectionManager.waitForConnected Waiting for client to connect to ZooKeeper
[junit4:junit4]   2> 9737 T501 oaz.ClientCnxn$SendThread.primeConnection Socket connection established to localhost/127.0.0.1:11942, initiating session
[junit4:junit4]   2> 9737 T425 oazs.NIOServerCnxn$Factory.run Accepted socket connection from /140.211.11.196:11992
[junit4:junit4]   2> 9738 T425 oazs.NIOServerCnxn.readConnectRequest Client attempting to establish new session at /140.211.11.196:11992
[junit4:junit4]   2> 9739 T427 oazs.NIOServerCnxn.finishSessionInit Established session 0x139ca5e48470008 with negotiated timeout 10000 for client /140.211.11.196:11992
[junit4:junit4]   2> 9739 T501 oaz.ClientCnxn$SendThread.readConnectResult Session establishment complete on server localhost/127.0.0.1:11942, sessionid = 0x139ca5e48470008, negotiated timeout = 10000
[junit4:junit4]   2> 9740 T502 oascc.ConnectionManager.process Watcher org.apache.solr.common.cloud.ConnectionManager@3e5933f3 name:ZooKeeperConnection Watcher:127.0.0.1:11942/solr got event WatchedEvent state:SyncConnected type:None path:null path:null type:None
[junit4:junit4]   2> 9740 T423 oascc.ConnectionManager.waitForConnected Client is connected to ZooKeeper
[junit4:junit4]   2> 9756 T423 oascc.ZkStateReader.createClusterStateWatchersAndUpdate Updating cluster state from ZooKeeper... 
[junit4:junit4]   2> 9765 T451 C46 P11953 oasc.SolrDeletionPolicy.onInit SolrDeletionPolicy.onInit: commits:num=1
[junit4:junit4]   2> 		commit{dir=/usr/home/hudson/hudson-slave/workspace/Lucene-Solr-Tests-trunk-java7/solr/build/solr-core/test/J1/org.apache.solr.cloud.BasicDistributedZk2Test-1347719940162/jetty1/index,segFN=segments_1,generation=1,filenames=[segments_1]
[junit4:junit4]   2> 9766 T451 C46 P11953 oasc.SolrDeletionPolicy.updateCommits newest commit = 1
[junit4:junit4]   2>  C45_STATE=coll:collection1 core:collection1 props:{shard=shard1, roles=null, state=recovering, core=collection1, collection=collection1, node_name=127.0.0.1:11969_solr, base_url=http://127.0.0.1:11969/solr}
[junit4:junit4]   2> 9777 T473 C45 P11969 oasc.SolrDeletionPolicy.onInit SolrDeletionPolicy.onInit: commits:num=1
[junit4:junit4]   2> 		commit{dir=/usr/home/hudson/hudson-slave/workspace/Lucene-Solr-Tests-trunk-java7/solr/build/solr-core/test/J1/org.apache.solr.cloud.BasicDistributedZk2Test-1347719940162/jetty3/index,segFN=segments_1,generation=1,filenames=[segments_1]
[junit4:junit4]   2> 9777 T473 C45 P11969 oasc.SolrDeletionPolicy.updateCommits newest commit = 1
[junit4:junit4]   2> 9780 T473 C45 P11969 REQ /update {update.distrib=FROMLEADER&distrib.from=http://127.0.0.1:11953/solr/collection1/&wt=javabin&version=2} status=0 QTime=6 
[junit4:junit4]   2> 9781 T451 C46 P11953 REQ /update {distrib.from=http://127.0.0.1:11959/solr/collection1/&update.distrib=TOLEADER&wt=javabin&version=2} status=0 QTime=19 
[junit4:junit4]   2> 9782 T463 C48 P11959 /update {wt=javabin&version=2} {add=[1]} 0 22
[junit4:junit4]   2> 9782 T423 oasc.AbstractDistribZkTestBase.waitForRecoveriesToFinish Wait for recoveries to finish - collection: collection1 failOnTimeout:true timeout (sec):1440
[junit4:junit4]   2> 9783 T423 oascc.ZkStateReader.updateClusterState Updating cloud state from ZooKeeper... 
[junit4:junit4]   2> 9871 T444 oascc.ZkStateReader.updateClusterState Updating cloud state from ZooKeeper... 
[junit4:junit4]   2> 9884 T469 oascc.ZkStateReader$2.process A cluster state change has occurred - updating...
[junit4:junit4]   2> 9884 T495 oascc.ZkStateReader$2.process A cluster state change has occurred - updating...
[junit4:junit4]   2> 9884 T481 oascc.ZkStateReader$2.process A cluster state change has occurred - updating...
[junit4:junit4]   2> 9884 T457 oascc.ZkStateReader$2.process A cluster state change has occurred - updating...
[junit4:junit4]   2> 9884 T443 oascc.ZkStateReader$2.process A cluster state change has occurred - updating...
[junit4:junit4]   2> 9884 T500 oascc.ZkStateReader$2.process A cluster state change has occurred - updating...
[junit4:junit4]   2> 9884 T502 oascc.ZkStateReader$2.process A cluster state change has occurred - updating...
[junit4:junit4]   2> 10785 T423 oascc.ZkStateReader.updateClusterState Updating cloud state from ZooKeeper... 
[junit4:junit4]   2> 11049 T483 C45 P11969 oasc.RecoveryStrategy.doRecovery Begin buffering updates. core=collection1
[junit4:junit4]   2> 11049 T483 C45 P11969 oasu.UpdateLog.bufferUpdates Starting to buffer updates. FSUpdateLog{state=ACTIVE, tlog=tlog{file=./org.apache.solr.cloud.BasicDistributedZk2Test-1347719940162/jetty3/tlog/tlog.0000000000000000000 refcount=1}}
[junit4:junit4]   2> 11050 T483 C45 P11969 oasc.RecoveryStrategy.replicate Attempting to replicate from http://127.0.0.1:11953/solr/collection1/. core=collection1
[junit4:junit4]   2> 11050 T483 C45 P11969 oascsi.HttpClientUtil.createClient Creating new http client, config:maxConnections=128&maxConnectionsPerHost=32&followRedirects=false
[junit4:junit4]   2> 11062 T452 C46 P11953 oasu.DirectUpdateHandler2.commit start commit{flags=0,_version_=0,optimize=false,openSearcher=true,waitSearcher=true,expungeDeletes=false,softCommit=false}
[junit4:junit4]   2> 11138 T452 C46 P11953 oasc.SolrDeletionPolicy.onCommit SolrDeletionPolicy.onCommit: commits:num=2
[junit4:junit4]   2> 		commit{dir=/usr/home/hudson/hudson-slave/workspace/Lucene-Solr-Tests-trunk-java7/solr/build/solr-core/test/J1/org.apache.solr.cloud.BasicDistributedZk2Test-1347719940162/jetty1/index,segFN=segments_1,generation=1,filenames=[segments_1]
[junit4:junit4]   2> 		commit{dir=/usr/home/hudson/hudson-slave/workspace/Lucene-Solr-Tests-trunk-java7/solr/build/solr-core/test/J1/org.apache.solr.cloud.BasicDistributedZk2Test-1347719940162/jetty1/index,segFN=segments_2,generation=2,filenames=[_0_MockRandom_0.tib, _0.fnm, _0_MockVariableIntBlock_0.doc, _0_MockRandom_0.prx, _0_nrm.cfs, _0_MockVariableIntBlock_0.skp, _0_Direct_0.frq, _0_MockVariableIntBlock_0.pyl, _0_MockRandom_0.sd, _0_MockRandom_0.frq, _0_MockVariableIntBlock_0.tib, _0_MockVariableIntBlock_0.frq, _0_SimpleText_0.pst, _0_nrm.cfe, _0_MockVariableIntBlock_0.pos, _0_MockRandom_0.tii, segments_2, _0.fdx, _0_Direct_0.tip, _0_Direct_0.prx, _0.si, _0_Direct_0.tim, _0.fdt, _0_MockVariableIntBlock_0.tii]
[junit4:junit4]   2> 11139 T452 C46 P11953 oasc.SolrDeletionPolicy.updateCommits newest commit = 2
[junit4:junit4]   2> 11167 T452 C46 P11953 oass.SolrIndexSearcher.<init> Opening Searcher@66321800 main
[junit4:junit4]   2> 11168 T452 C46 P11953 oasu.DirectUpdateHandler2.commit end_commit_flush
[junit4:junit4]   2> 11169 T458 oasc.SolrCore.registerSearcher [collection1] Registered new searcher Searcher@66321800 main{StandardDirectoryReader(segments_2:3 _0(5.0):C1)}
[junit4:junit4]   2> 11170 T452 C46 P11953 /update {waitSearcher=true&commit=true&commit_end_point=true&wt=javabin&softCommit=false&version=2} {commit=} 0 108
[junit4:junit4]   2> 11171 T483 C45 P11969 oash.ReplicationHandler.inform Commits will be reserved for  10000
[junit4:junit4]   2> 11171 T483 C45 P11969 oash.SnapPuller.<init>  No value set for 'pollInterval'. Timer Task not started.
[junit4:junit4]   2> 11173 T453 C46 P11953 oash.ReplicationHandler.inform Commits will be reserved for  10000
[junit4:junit4]   2> 11174 T453 C46 P11953 REQ /replication {command=indexversion&wt=javabin&qt=/replication&version=2} status=0 QTime=2 
[junit4:junit4]   2> 11175 T483 C45 P11969 oash.SnapPuller.fetchLatestIndex Master's generation: 2
[junit4:junit4]   2> 11175 T483 C45 P11969 oash.SnapPuller.fetchLatestIndex Slave's generation: 1
[junit4:junit4]   2> 11175 T483 C45 P11969 oash.SnapPuller.fetchLatestIndex Starting replication process
[junit4:junit4]   2> 11179 T453 C46 P11953 REQ /replication {command=filelist&generation=2&wt=javabin&qt=/replication&version=2} status=0 QTime=2 
[junit4:junit4]   2> 11179 T483 C45 P11969 oash.SnapPuller.fetchLatestIndex Number of files in latest index in master: 24
[junit4:junit4]   2> 11186 T483 C45 P11969 oash.SnapPuller.fetchLatestIndex Starting download to ./org.apache.solr.cloud.BasicDistributedZk2Test-1347719940162/jetty3/index.20120915103911337 fullCopy=true
[junit4:junit4]   2> 11189 T453 C46 P11953 REQ /replication {file=_0_MockVariableIntBlock_0.doc&command=filecontent&checksum=true&generation=2&qt=/replication&wt=filestream} status=0 QTime=0 
[junit4:junit4]   2> 11194 T453 C46 P11953 REQ /replication {file=_0_MockRandom_0.prx&command=filecontent&checksum=true&generation=2&qt=/replication&wt=filestream} status=0 QTime=0 
[junit4:junit4]   2> 11198 T453 C46 P11953 REQ /replication {file=_0_MockVariableIntBlock_0.skp&command=filecontent&checksum=true&generation=2&qt=/replication&wt=filestream} status=0 QTime=0 
[junit4:junit4]   2> 11199 T483 C45 P11969 oash.SnapPuller$FileFetcher.fetchPackets WARNING No content recieved for file: {name=_0_MockVariableIntBlock_0.skp, lastmodified=1347719951000, size=0}
[junit4:junit4]   2> 11202 T453 C46 P11953 REQ /replication {file=_0_MockVariableIntBlock_0.pyl&command=filecontent&checksum=true&generation=2&qt=/replication&wt=filestream} status=0 QTime=0 
[junit4:junit4]   2> 11203 T483 C45 P11969 oash.SnapPuller$FileFetcher.fetchPackets WARNING No content recieved for file: {name=_0_MockVariableIntBlock_0.pyl, lastmodified=1347719951000, size=0}
[junit4:junit4]   2> 11206 T453 C46 P11953 REQ /replication {file=_0_MockVariableIntBlock_0.tib&command=filecontent&checksum=true&generation=2&qt=/replication&wt=filestream} status=0 QTime=0 
[junit4:junit4]   2> 11210 T453 C46 P11953 REQ /replication {file=_0_SimpleText_0.pst&command=filecontent&checksum=true&generation=2&qt=/replication&wt=filestream} status=0 QTime=0 
[junit4:junit4]   2> 11214 T453 C46 P11953 REQ /replication {file=_0_MockVariableIntBlock_0.pos&command=filecontent&checksum=true&generation=2&qt=/replication&wt=filestream} status=0 QTime=0 
[junit4:junit4]   2> 11218 T453 C46 P11953 REQ /replication {file=_0.si&command=filecontent&checksum=true&generation=2&qt=/replication&wt=filestream} status=0 QTime=0 
[junit4:junit4]   2> 11222 T453 C46 P11953 REQ /replication {file=_0_MockVariableIntBlock_0.tii&command=filecontent&checksum=true&generation=2&qt=/replication&wt=filestream} status=0 QTime=0 
[junit4:junit4]   2> 11226 T453 C46 P11953 REQ /replication {file=_0_MockRandom_0.tib&command=filecontent&checksum=true&generation=2&qt=/replication&wt=filestream} status=0 QTime=0 
[junit4:junit4]   2> 11230 T453 C46 P11953 REQ /replication {file=_0.fnm&command=filecontent&checksum=true&generation=2&qt=/replication&wt=filestream} status=0 QTime=0 
[junit4:junit4]   2> 11234 T453 C46 P11953 REQ /replication {file=_0_nrm.cfs&command=filecontent&checksum=true&generation=2&qt=/replication&wt=filestream} status=0 QTime=0 
[junit4:junit4]   2> 11238 T453 C46 P11953 REQ /replication {file=_0_Direct_0.frq&command=filecontent&checksum=true&generation=2&qt=/replication&wt=filestream} status=0 QTime=0 
[junit4:junit4]   2> 11243 T453 C46 P11953 REQ /replication {file=_0_MockRandom_0.frq&command=filecontent&checksum=true&generation=2&qt=/replication&wt=filestream} status=0 QTime=0 
[junit4:junit4]   2> 11247 T453 C46 P11953 REQ /replication {file=_0_MockRandom_0.sd&command=filecontent&checksum=true&generation=2&qt=/replication&wt=filestream} status=0 QTime=0 
[junit4:junit4]   2> 11251 T453 C46 P11953 REQ /replication {file=_0_nrm.cfe&command=filecontent&checksum=true&generation=2&qt=/replication&wt=filestream} status=0 QTime=0 
[junit4:junit4]   2> 11255 T453 C46 P11953 REQ /replication {file=_0_MockVariableIntBlock_0.frq&command=filecontent&checksum=true&generation=2&qt=/replication&wt=filestream} status=0 QTime=0 
[junit4:junit4]   2> 11259 T453 C46 P11953 REQ /replication {file=segments_2&command=filecontent&checksum=true&generation=2&qt=/replication&wt=filestream} status=0 QTime=0 
[junit4:junit4]   2> 11263 T453 C46 P11953 REQ /replication {file=_0_MockRandom_0.tii&command=filecontent&checksum=true&generation=2&qt=/replication&wt=filestream} status=0 QTime=0 
[junit4:junit4]   2> 11267 T453 C46 P11953 REQ /replication {file=_0_Direct_0.tip&command=filecontent&checksum=true&generation=2&qt=/replication&wt=filestream} status=0 QTime=0 
[junit4:junit4]   2> 11271 T453 C46 P11953 REQ /replication {file=_0.fdx&command=filecontent&checksum=true&generation=2&qt=/replication&wt=filestream} status=0 QTime=0 
[junit4:junit4]   2> 11275 T453 C46 P11953 REQ /replication {file=_0_Direct_0.prx&command=filecontent&checksum=true&generation=2&qt=/replication&wt=filestream} status=0 QTime=0 
[junit4:junit4]   2> 11279 T453 C46 P11953 REQ /replication {file=_0_Direct_0.tim&command=filecontent&checksum=true&generation=2&qt=/replication&wt=filestream} status=0 QTime=0 
[junit4:junit4]   2> 11283 T453 C46 P11953 REQ /replication {file=_0.fdt&command=filecontent&checksum=true&generation=2&qt=/replication&wt=filestream} status=0 QTime=0 
[junit4:junit4]   2> 11285 T483 C45 P11969 oash.SnapPuller.fetchLatestIndex Total time taken for download : 0 secs
[junit4:junit4]   2> 11285 T483 C45 P11969 oash.SnapPuller.modifyIndexProps New index installed. Updating index properties... index=index.20120915103911337
[junit4:junit4]   2> 11286 T483 C45 P11969 oasu.DefaultSolrCoreState.newIndexWriter Creating new IndexWriter...
[junit4:junit4]   2> 11287 T483 C45 P11969 oasu.DefaultSolrCoreState.newIndexWriter Waiting until IndexWriter is unused... core=collection1
[junit4:junit4]   2> 11287 T483 C45 P11969 oasu.DefaultSolrCoreState.newIndexWriter Rollback old IndexWriter... core=collection1
[junit4:junit4]   2> 11291 T483 C45 P11969 oasc.SolrCore.getNewIndexDir WARNING New index directory detected: old=./org.apache.solr.cloud.BasicDistributedZk2Test-1347719940162/jetty3/index/ new=./org.apache.solr.cloud.BasicDistributedZk2Test-1347719940162/jetty3/index.20120915103911337
[junit4:junit4]   2> 11292 T483 C45 P11969 oasc.CachingDirectoryFactory.get return new directory for /usr/home/hudson/hudson-slave/workspace/Lucene-Solr-Tests-trunk-java7/solr/build/solr-core/test/J1/./org.apache.solr.cloud.BasicDistributedZk2Test-1347719940162/jetty3/index.20120915103911337 forceNew:true
[junit4:junit4]   2> 11299 T483 C45 P11969 oasc.SolrDeletionPolicy.onInit SolrDeletionPolicy.onInit: commits:num=1
[junit4:junit4]   2> 		commit{dir=/usr/home/hudson/hudson-slave/workspace/Lucene-Solr-Tests-trunk-java7/solr/build/solr-core/test/J1/org.apache.solr.cloud.BasicDistributedZk2Test-1347719940162/jetty3/index.20120915103911337,segFN=segments_2,generation=2,filenames=[_0_MockRandom_0.tib, _0.fnm, _0_MockVariableIntBlock_0.doc, _0_MockRandom_0.prx, _0_nrm.cfs, _0_MockVariableIntBlock_0.skp, _0_Direct_0.frq, _0_MockVariableIntBlock_0.pyl, _0_MockRandom_0.sd, _0_MockRandom_0.frq, _0_MockVariableIntBlock_0.tib, _0_nrm.cfe, _0_SimpleText_0.pst, _0_MockVariableIntBlock_0.frq, _0_MockRandom_0.tii, _0_MockVariableIntBlock_0.pos, segments_2, _0_Direct_0.tip, _0.fdx, _0_Direct_0.prx, _0.si, _0_Direct_0.tim, _0_MockVariableIntBlock_0.tii, _0.fdt]
[junit4:junit4]   2> 11299 T483 C45 P11969 oasc.SolrDeletionPolicy.updateCommits newest commit = 2
[junit4:junit4]   2> 11299 T483 C45 P11969 oasu.DefaultSolrCoreState.newIndexWriter New IndexWriter is ready to be used.
[junit4:junit4]   2> 11303 T483 C45 P11969 oass.SolrIndexSearcher.<init> Opening Searcher@7a583e1e main
[junit4:junit4]   2> 11305 T482 oasc.SolrCore.registerSearcher [collection1] Registered new searcher Searcher@7a583e1e main{StandardDirectoryReader(segments_2:3:nrt _0(5.0):C1)}
[junit4:junit4]   2> 11306 T482 oasc.CachingDirectoryFactory.close Closing directory:/usr/home/hudson/hudson-slave/workspace/Lucene-Solr-Tests-trunk-java7/solr/build/solr-core/test/J1/./org.apache.solr.cloud.BasicDistributedZk2Test-1347719940162/jetty3/index
[junit4:junit4]   2> 11306 T482 oash.SnapPuller$2.onClose removing old index directory ./org.apache.solr.cloud.BasicDistributedZk2Test-1347719940162/jetty3/index
[junit4:junit4]   2> 11308 T483 C45 P11969 oasu.DirectUpdateHandler2.commit start commit{flags=0,_version_=0,optimize=false,openSearcher=true,waitSearcher=true,expungeDeletes=false,softCommit=false}
[junit4:junit4]   2> 11309 T483 C45 P11969 oass.SolrIndexSearcher.<init> Opening Searcher@85111e0 main
[junit4:junit4]   2> 11309 T483 C45 P11969 oasu.DirectUpdateHandler2.commit end_commit_flush
[junit4:junit4]   2> 11311 T482 oasc.SolrCore.registerSearcher [collection1] Registered new searcher Searcher@85111e0 main{StandardDirectoryReader(segments_2:3:nrt _0(5.0):C1)}
[junit4:junit4]   2> 11312 T483 C45 P11969 oasc.RecoveryStrategy.replay Replaying buffered documents. core=collection1
[junit4:junit4]   2> 11312 T506 C45 P11969 oasu.UpdateLog$LogReplayer.doReplay WARNING Starting log replay tlog{file=./org.apache.solr.cloud.BasicDistributedZk2Test-1347719940162/jetty3/tlog/tlog.0000000000000000000 refcount=2} active=true starting pos=433
[junit4:junit4]   2> 11312 T506 C45 P11969 oasu.DirectUpdateHandler2.commit start commit{flags=2,_version_=0,optimize=false,openSearcher=true,waitSearcher=true,expungeDeletes=false,softCommit=false}
[junit4:junit4]   2> 11313 T506 C45 P11969 oass.SolrIndexSearcher.<init> Opening Searcher@5fefe724 main
[junit4:junit4]   2> 11315 T482 oasc.SolrCore.registerSearcher [collection1] Registered new searcher Searcher@5fefe724 main{StandardDirectoryReader(segments_2:3:nrt _0(5.0):C1)}
[junit4:junit4]   2> 11316 T506 C45 P11969 oasu.DirectUpdateHandler2.commit end_commit_flush
[junit4:junit4]   2> 11316 T506 C45 P11969 oasu.UpdateLog$LogReplayer.run WARNING Log replay finished. recoveryInfo=RecoveryInfo{adds=0 deletes=0 deleteByQuery=0 errors=0 positionOfStart=433}
[junit4:junit4]   2> 11316 T483 C45 P11969 oasc.RecoveryStrategy.doRecovery Replication Recovery was successful - registering as Active. core=collection1
[junit4:junit4]   2> 11318 T483 C45 P11969 oasc.RecoveryStrategy.doRecovery Finished recovery process. core=collection1
[junit4:junit4]   2> 11394 T444 oascc.ZkStateReader.updateClusterState Updating cloud state from ZooKeeper... 
[junit4:junit4]   2> 11400 T502 oascc.ZkStateReader$2.process A cluster state change has occurred - updating...
[junit4:junit4]   2> 11400 T495 oascc.ZkStateReader$2.process A cluster state change has occurred - updating...
[junit4:junit4]   2> 11400 T481 oascc.ZkStateReader$2.process A cluster state change has occurred - updating...
[junit4:junit4]   2> 11400 T443 oascc.ZkStateReader$2.process A cluster state change has occurred - updating...
[junit4:junit4]   2> 11400 T457 oascc.ZkStateReader$2.process A cluster state change has occurred - updating...
[junit4:junit4]   2> 11400 T469 oascc.ZkStateReader$2.process A cluster state change has occurred - updating...
[junit4:junit4]   2> 11400 T500 oascc.ZkStateReader$2.process A cluster state change has occurred - updating...
[junit4:junit4]   2> 11787 T423 oascc.ZkStateReader.updateClusterState Updating cloud state from ZooKeeper... 
[junit4:junit4]   2>  C47_STATE=coll:collection1 core:collection1 props:{shard=shard2, roles=null, state=recovering, core=collection1, collection=collection1, node_name=127.0.0.1:11979_solr, base_url=http://127.0.0.1:11979/solr}
[junit4:junit4]   2> 12698 T497 C47 P11979 oasc.RecoveryStrategy.doRecovery Begin buffering updates. core=collection1
[junit4:junit4]   2> 12698 T497 C47 P11979 oasu.UpdateLog.bufferUpdates Starting to buffer updates. FSUpdateLog{state=ACTIVE, tlog=null}
[junit4:junit4]   2> 12699 T497 C47 P11979 oasc.RecoveryStrategy.replicate Attempting to replicate from http://127.0.0.1:11959/solr/collection1/. core=collection1
[junit4:junit4]   2> 12699 T497 C47 P11979 oascsi.HttpClientUtil.createClient Creating new http client, config:maxConnections=128&maxConnectionsPerHost=32&followRedirects=false
[junit4:junit4]   2> 12719 T464 C48 P11959 oasu.DirectUpdateHandler2.commit start commit{flags=0,_version_=0,optimize=false,openSearcher=true,waitSearcher=true,expungeDeletes=false,softCommit=false}
[junit4:junit4]   2> 12725 T464 C48 P11959 oasc.SolrDeletionPolicy.onInit SolrDeletionPolicy.onInit: commits:num=1
[junit4:junit4]   2> 		commit{dir=/usr/home/hudson/hudson-slave/workspace/Lucene-Solr-Tests-trunk-java7/solr/build/solr-core/test/J1/org.apache.solr.cloud.BasicDistributedZk2Test-1347719940162/jetty2/index,segFN=segments_1,generation=1,filenames=[segments_1]
[junit4:junit4]   2> 12726 T464 C48 P11959 oasc.SolrDeletionPolicy.updateCommits newest commit = 1
[junit4:junit4]   2> 12727 T464 C48 P11959 oass.SolrIndexSearcher.<init> Opening Searcher@43810d51 main
[junit4:junit4]   2> 12728 T464 C48 P11959 oasu.DirectUpdateHandler2.commit end_commit_flush
[junit4:junit4]   2> 12729 T470 oasc.SolrCore.registerSearcher [collection1] Registered new searcher Searcher@43810d51 main{StandardDirectoryReader(segments_1:1)}
[junit4:junit4]   2> 12730 T464 C48 P11959 /update {waitSearcher=true&commit=true&commit_end_point=true&wt=javabin&softCommit=false&version=2} {commit=} 0 11
[junit4:junit4]   2> 12731 T497 C47 P11979 oash.ReplicationHandler.inform Commits will be reserved for  10000
[junit4:junit4]   2> 12731 T497 C47 P11979 oash.SnapPuller.<init>  No value set for 'pollInterval'. Timer Task not started.
[junit4:junit4]   2> 12733 T465 C48 P11959 oash.ReplicationHandler.inform Commits will be reserved for  10000
[junit4:junit4]   2> 12734 T465 C48 P11959 REQ /replication {command=indexversion&wt=javabin&qt=/replication&version=2} status=0 QTime=1 
[junit4:junit4]   2> 12739 T497 C47 P11979 oasc.SolrDeletionPolicy.onInit SolrDeletionPolicy.onInit: commits:num=1
[junit4:junit4]   2> 		commit{dir=/usr/home/hudson/hudson-slave/workspace/Lucene-Solr-Tests-trunk-java7/solr/build/solr-core/test/J1/org.apache.solr.cloud.BasicDistributedZk2Test-1347719940162/jetty4/index,segFN=segments_1,generation=1,filenames=[segments_1]
[junit4:junit4]   2> 12740 T497 C47 P11979 oasc.SolrDeletionPolicy.updateCommits newest commit = 1
[junit4:junit4]   2> 12741 T497 C47 P11979 oasu.DirectUpdateHandler2.commit start commit{flags=0,_version_=0,optimize=false,openSearcher=true,waitSearcher=true,expungeDeletes=false,softCommit=false}
[junit4:junit4]   2> 12745 T497 C47 P11979 oasc.SolrDeletionPolicy.onCommit SolrDeletionPolicy.onCommit: commits:num=2
[junit4:junit4]   2> 		commit{dir=/usr/home/hudson/hudson-slave/workspace/Lucene-Solr-Tests-trunk-java7/solr/build/solr-core/test/J1/org.apache.solr.cloud.BasicDistributedZk2Test-1347719940162/jetty4/index,segFN=segments_1,generation=1,filenames=[segments_1]
[junit4:junit4]   2> 		commit{dir=/usr/home/hudson/hudson-slave/workspace/Lucene-Solr-Tests-trunk-java7/solr/build/solr-core/test/J1/org.apache.solr.cloud.BasicDistributedZk2Test-1347719940162/jetty4/index,segFN=segments_2,generation=2,filenames=[segments_2]
[junit4:junit4]   2> 12745 T497 C47 P11979 oasc.SolrDeletionPolicy.updateCommits newest commit = 2
[junit4:junit4]   2> 12749 T497 C47 P11979 oass.SolrIndexSearcher.<init> Opening Searcher@63f65011 main
[junit4:junit4]   2> 12750 T497 C47 P11979 oasu.DirectUpdateHandler2.commit end_commit_flush
[junit4:junit4]   2> 12752 T496 oasc.SolrCore.registerSearcher [collection1] Registered new searcher Searcher@63f65011 main{StandardDirectoryReader(segments_2:2)}
[junit4:junit4]   2> 12753 T497 C47 P11979 oasc.RecoveryStrategy.replay No replay needed. core=collection1
[junit4:junit4]   2> 12753 T497 C47 P11979 oasc.RecoveryStrategy.doRecovery Replication Recovery was successful - registering as Active. core=collection1
[junit4:junit4]   2> 12756 T497 C47 P11979 oasc.RecoveryStrategy.doRecovery Finished recovery process. core=collection1
[junit4:junit4]   2> 12790 T423 oascc.ZkStateReader.updateClusterState Updating cloud state from ZooKeeper... 
[junit4:junit4]   2> 12909 T444 oascc.ZkStateReader.updateClusterState Updating cloud state from ZooKeeper... 
[junit4:junit4]   2> 12925 T500 oascc.ZkStateReader$2.process A cluster state change has occurred - updating...
[junit4:junit4]   2> 12925 T457 oascc.ZkStateReader$2.process A cluster state change has occurred - updating...
[junit4:junit4]   2> 12925 T481 oascc.ZkStateReader$2.process A cluster state change has occurred - updating...
[junit4:junit4]   2> 12925 T443 oascc.ZkStateReader$2.process A cluster state change has occurred - updating...
[junit4:junit4]   2> 12925 T469 oascc.ZkStateReader$2.process A cluster state change has occurred - updating...
[junit4:junit4]   2> 12925 T495 oascc.ZkStateReader$2.process A cluster state change has occurred - updating...
[junit4:junit4]   2> 12925 T502 oascc.ZkStateReader$2.process A cluster state change has occurred - updating...
[junit4:junit4]   2> 13793 T423 oascc.ZkStateReader.updateClusterState Updating cloud state from ZooKeeper... 
[junit4:junit4]   2> 13797 T435 C49 P11945 oasu.DirectUpdateHandler2.commit start commit{flags=0,_version_=0,optimize=false,openSearcher=true,waitSearcher=true,expungeDeletes=false,softCommit=false}
[junit4:junit4]   2> 13863 T435 C49 P11945 oasc.SolrDeletionPolicy.onCommit SolrDeletionPolicy.onCommit: commits:num=2
[junit4:junit4]   2> 		commit{dir=/usr/home/hudson/hudson-slave/workspace/Lucene-Solr-Tests-trunk-java7/solr/build/solr-core/test/J1/org.apache.solr.cloud.BasicDistributedZk2Test-1347719940162/control/data/index,segFN=segments_1,generation=1,filenames=[segments_1]
[junit4:junit4]   2> 		commit{dir=/usr/home/hudson/hudson-slave/workspace/Lucene-Solr-Tests-trunk-java7/solr/build/solr-core/test/J1/org.apache.solr.cloud.BasicDistributedZk2Test-1347719940162/control/data/index,segFN=segments_2,generation=2,filenames=[_0_MockRandom_0.tib, _0.fnm, _0_MockVariableIntBlock_0.doc, _0_MockRandom_0.prx, _0_nrm.cfs, _0_MockVariableIntBlock_0.skp, _0_Direct_0.frq, _0_MockVariableIntBlock_0.pyl, _0_MockRandom_0.sd, _0_MockRandom_0.frq, _0_MockRandom_0.tiv, _0_MockVariableIntBlock_0.tib, _0_MockVariableIntBlock_0.frq, _0_SimpleText_0.pst, _0_nrm.cfe, _0_MockVariableIntBlock_0.pos, segments_2, _0.fdx, _0_Direct_0.tip, _0_Direct_0.prx, _0.si, _0_Direct_0.tim, _0.fdt, _0_MockVariableIntBlock_0.tii]
[junit4:junit4]   2> 13863 T435 C49 P11945 oasc.SolrDeletionPolicy.updateCommits newest commit = 2
[junit4:junit4]   2> 13895 T435 C49 P11945 oass.SolrIndexSearcher.<init> Opening Searcher@f6ba5a1 main
[junit4:junit4]   2> 13895 T435 C49 P11945 oasu.DirectUpdateHandler2.commit end_commit_flush
[junit4:junit4]   2> 13897 T446 oasc.SolrCore.registerSearcher [collection1] Registered new searcher Searcher@f6ba5a1 main{StandardDirectoryReader(segments_2:3 _0(5.0):C1)}
[junit4:junit4]   2> 13898 T435 C49 P11945 /update {waitSearcher=true&wt=javabin&commit=true&softCommit=false&version=2} {commit=} 0 101
[junit4:junit4]   2> 13900 T454 C46 P11953 oasu.DirectUpdateHandler2.commit start commit{flags=0,_version_=0,optimize=false,openSearcher=true,waitSearcher=true,expungeDeletes=false,softCommit=false}
[junit4:junit4]   2> 13912 T454 C46 P11953 oass.SolrIndexSearcher.<init> Opening Searcher@24e18779 main
[junit4:junit4]   2> 13913 T454 C46 P11953 oasu.DirectUpdateHandler2.commit end_commit_flush
[junit4:junit4]   2> 13915 T458 oasc.SolrCore.registerSearcher [collection1] Registered new searcher Searcher@24e18779 main{StandardDirectoryReader(segments_2:3 _0(5.0):C1)}
[junit4:junit4]   2> 13916 T454 C46 P11953 oasu.SolrCmdDistributor.distribCommit Distrib commit to:[StdNode: http://127.0.0.1:11969/solr/collection1/, StdNode: http://127.0.0.1:11959/solr/collection1/, StdNode: http://127.0.0.1:11979/solr/collection1/]
[junit4:junit4]   2> 13917 T466 C48 P11959 oasu.DirectUpdateHandler2.commit start commit{flags=0,_version_=0,optimize=false,openSearcher=true,waitSearcher=true,expungeDeletes=false,softCommit=false}
[junit4:junit4]   2>  C45_STATE=coll:collection1 core:collection1 props:{shard=shard1, roles=null, state=active, core=collection1, collection=collection1, node_name=127.0.0.1:11969_solr, base_url=http://127.0.0.1:11969/solr}
[junit4:junit4]   2> 13919 T473 C45 P11969 oasu.DirectUpdateHandler2.commit start commit{flags=0,_version_=0,optimize=false,openSearcher=true,waitSearcher=true,expungeDeletes=false,softCommit=false}
[junit4:junit4]   2> 13921 T473 C45 P11969 oass.SolrIndexSearcher.<init> Opening Searcher@2d1551f4 main
[junit4:junit4]   2> 13922 T466 C48 P11959 oass.SolrIndexSearcher.<init> Opening Searcher@d898d5a main
[junit4:junit4]   2> 13922 T473 C45 P11969 oasu.DirectUpdateHandler2.commit end_commit_flush
[junit4:junit4]   2> 13922 T466 C48 P11959 oasu.DirectUpdateHandler2.commit end_commit_flush
[junit4:junit4]   2> 13924 T482 oasc.SolrCore.registerSearcher [collection1] Registered new searcher Searcher@2d1551f4 main{StandardDirectoryReader(segments_2:3:nrt _0(5.0):C1)}
[junit4:junit4]   2> 13924 T470 oasc.SolrCore.registerSearcher [collection1] Registered new searcher Searcher@d898d5a main{StandardDirectoryReader(segments_1:1)}
[junit4:junit4]   2> 13924 T473 C45 P11969 /update {waitSearcher=true&commit=true&wt=javabin&commit_end_point=true&expungeDeletes=false&softCommit=false&version=2} {commit=} 0 5
[junit4:junit4]   2> 13925 T466 C48 P11959 /update {waitSearcher=true&commit=true&wt=javabin&commit_end_point=true&expungeDeletes=false&softCommit=false&version=2} {commit=} 0 8
[junit4:junit4]   2>  C47_STATE=coll:collection1 core:collection1 props:{shard=shard2, roles=null, state=active, core=collection1, collection=collection1, node_name=127.0.0.1:11979_solr, base_url=http://127.0.0.1:11979/solr}
[junit4:junit4]   2> 13927 T487 C47 P11979 oasu.DirectUpdateHandler2.commit start commit{flags=0,_version_=0,optimize=false,openSearcher=true,waitSearcher=true,expungeDeletes=false,softCommit=false}
[junit4:junit4]   2> 13931 T487 C47 P11979 oass.SolrIndexSearcher.<init> Opening Searcher@17dc390b main
[junit4:junit4]   2> 13932 T487 C47 P11979 oasu.DirectUpdateHandler2.commit end_commit_flush
[junit4:junit4]   2> 13933 T496 oasc.SolrCore.registerSearcher [collection1] Registered new searcher Searcher@17dc390b main{StandardDirectoryReader(segments_2:2)}
[junit4:junit4]   2> 13934 T487 C47 P11979 /update {waitSearcher=true&commit=true&wt=javabin&commit_end_point=true&expungeDeletes=false&softCommit=false&version=2} {commit=} 0 7
[junit4:junit4]   2> 13934 T454 C46 P11953 /update {waitSearcher=true&wt=javabin&commit=true&softCommit=false&version=2} {commit=} 0 34
[junit4:junit4]   2> 13941 T436 C49 P11945 REQ /select {fl=id,score&shard.url=127.0.0.1:11945/solr/collection1/&NOW=1347719954094&start=0&q=*:*&distrib=false&isShard=true&wt=javabin&fsv=true&rows=10&version=2} hits=1 status=0 QTime=1 
[junit4:junit4]   2> 13964 T436 C49 P11945 REQ /select {shard.url=127.0.0.1:11945/solr/collection1/&NOW=1347719954094&q=*:*&ids=1&distrib=false&isShard=true&wt=javabin&version=2} status=0 QTime=0 
[junit4:junit4]   2> 13966 T435 C49 P11945 REQ /select {wt=javabin&q=*:*&version=2} hits=1 status=0 QTime=29 
[junit4:junit4]   2> 13967 T423 oaz.ZooKeeper.<init> Initiating client connection, connectString=127.0.0.1:11942/solr sessionTimeout=10000 watcher=org.apache.solr.common.cloud.ConnectionManager@3c43372a
[junit4:junit4]   2> 13968 T510 oaz.ClientCnxn$SendThread.startConnect Opening socket connection to server /127.0.0.1:11942
[junit4:junit4]   2> 13968 T423 oascc.ConnectionManager.waitForConnected Waiting for client to connect to ZooKeeper
[junit4:junit4]   2> 13969 T510 oaz.ClientCnxn$SendThread.primeConnection Socket connection established to localhost/127.0.0.1:11942, initiating session
[junit4:junit4]   2> 13969 T425 oazs.NIOServerCnxn$Factory.run Accepted socket connection from /140.211.11.196:12008
[junit4:junit4]   2> 13969 T425 oazs.NIOServerCnxn.readConnectRequest Client attempting to establish new session at /140.211.11.196:12008
[junit4:junit4]   2> 13972 T427 oazs.NIOServerCnxn.finishSessionInit Established session 0x139ca5e48470009 with negotiated timeout 10000 for client /140.211.11.196:12008
[junit4:junit4]   2> 13972 T510 oaz.ClientCnxn$SendThread.readConnectResult Session establishment complete on server localhost/127.0.0.1:11942, sessionid = 0x139ca5e48470009, negotiated timeout = 10000
[junit4:junit4]   2> 13972 T511 oascc.ConnectionManager.process Watcher org.apache.solr.common.cloud.ConnectionManager@3c43372a name:ZooKeeperConnection Watcher:127.0.0.1:11942/solr got event WatchedEvent state:SyncConnected type:None path:null path:null type:None
[junit4:junit4]   2> 13973 T423 oascc.ConnectionManager.waitForConnected Client is connected to ZooKeeper
[junit4:junit4]   2> 13974 T423 oascc.ZkStateReader.createClusterStateWatchersAndUpdate Updating cluster state from ZooKeeper... 
[junit4:junit4]   2> 13976 T428 oazs.PrepRequestProcessor.pRequest Processed session termination for sessionid: 0x139ca5e48470009
[junit4:junit4]   2> 13977 T511 oaz.ClientCnxn$EventThread.run EventThread shut down
[junit4:junit4]   2> 13977 T423 oaz.ZooKeeper.close Session: 0x139ca5e48470009 closed
[junit4:junit4]   2> 13977 T425 oazs.NIOServerCnxn.closeSock Closed socket connection for client /140.211.11.196:12008 which had sessionid 0x139ca5e48470009
[junit4:junit4]   2> 13979 T455 C46 P11953 REQ /select {distrib=false&wt=javabin&q=*:*&version=2} hits=1 status=0 QTime=0 
[junit4:junit4]   2> 13982 T467 C48 P11959 REQ /select {distrib=false&wt=javabin&q=*:*&version=2} hits=0 status=0 QTime=1 
[junit4:junit4]   2> 13987 T475 C45 P11969 REQ /select {fl=id,score&shard.url=127.0.0.1:11953/solr/collection1/|127.0.0.1:11969/solr/collection1/&NOW=1347719954141&start=0&q=*:*&distrib=false&isShard=true&wt=javabin&fsv=true&rows=10&version=2} hits=1 status=0 QTime=1 
[junit4:junit4]   2> 13987 T488 C47 P11979 REQ /select {fl=id,score&shard.url=127.0.0.1:11959/solr/collection1/|127.0.0.1:11979/solr/collection1/&NOW=1347719954141&start=0&q=*:*&distrib=false&isShard=true&wt=javabin&fsv=true&rows=10&version=2} hits=0 status=0 QTime=0 
[junit4:junit4]   2> 13991 T475 C45 P11969 REQ /select {shard.url=127.0.0.1:11953/solr/collection1/|127.0.0.1:11969/solr/collection1/&NOW=1347719954141&q=*:*&ids=1&distrib=false&isShard=true&wt=javabin&version=2} status=0 QTime=0 
[junit4:junit4]   2> 13992 T474 C45 P11969 REQ /select {wt=javabin&q=*:*&version=2} hits=1 status=0 QTime=8 
[junit4:junit4]   2> 13999 T435 C49 P11945 /update {wt=javabin&version=2} {add=[2 (1413186798644887552)]} 0 4
[junit4:junit4]   2> 14015 T487 C47 P11979 REQ /update {update.distrib=FROMLEADER&distrib.from=http://127.0.0.1:11959/solr/collection1/&wt=javabin&version=2} status=0 QTime=4 
[junit4:junit4]   2> 14015 T466 C48 P11959 REQ /update {distrib.from=http://127.0.0.1:11953/solr/collection1/&update.distrib=TOLEADER&wt=javabin&version=2} status=0 QTime=10 
[junit4:junit4]   2> 14016 T454 C46 P11953 /update {wt=javabin&version=2} {add=[2]} 0 14
[junit4:junit4]   2> 14020 T435 C49 P11945 /update {wt=javabin&version=2} {add=[3 (1413186798670053376)]} 0 1
[junit4:junit4]   2> 14028 T487 C47 P11979 REQ /update {distrib.from=http://127.0.0.1:11959/solr/collection1/&update.distrib=FROMLEADER&wt=javabin&version=2} status=0 QTime=1 
[junit4:junit4]   2> 14029 T463 C48 P11959 /update {wt=javabin&version=2} {add=[3 (1413186798674247680)]} 0 6
[junit4:junit4]   2> 14033 T435 C49 P11945 /update {wt=javabin&version=2} {add=[4 (1413186798683684864)]} 0 1
[junit4:junit4]   2> 14048 T473 C45 P11969 REQ /update {update.distrib=FROMLEADER&distrib.from=http://127.0.0.1:11953/solr/collection1/&wt=javabin&version=2} status=0 QTime=3 
[junit4:junit4]   2> 14048 T451 C46 P11953 REQ /update {distrib.from=http://127.0.0.1:11959/solr/collection1/&update.distrib=TOLEADER&wt=javabin&version=2} status=0 QTime=10 
[junit4:junit4]   2> 14049 T463 C48 P11959 /update {wt=javabin&version=2} {add=[4]} 0 13
[junit4:junit4]   2> 14053 T435 C49 P11945 /update {wt=javabin&version=2} {add=[5 (1413186798704656384)]} 0 1
[junit4:junit4]   2> 14062 T487 C47 P11979 REQ /update {update.distrib=FROMLEADER&distrib.from=http://127.0.0.1:11959/solr/collection1/&wt=javabin&version=2} status=0 QTime=1 
[junit4:junit4]   2> 14063 T466 C48 P11959 REQ /update {distrib.from=http://127.0.0.1:11953/solr/collection1/&update.distrib=TOLEADER&wt=javabin&version=2} status=0 QTime=5 
[junit4:junit4]   2> 14063 T454 C46 P11953 /update {wt=javabin&version=2} {add=[5]} 0 7
[junit4:junit4]   2> 14067 T435 C49 P11945 /update {wt=javabin&version=2} {add=[6 (1413186798719336448)]} 0 1
[junit4:junit4]   2> 14074 T487 C47 P11979 REQ /update {distrib.from=http://127.0.0.1:11959/solr/collection1/&update.distrib=FROMLEADER&wt=javabin&version=2} status=0 QTime=1 
[junit4:junit4]   2> 14075 T463 C48 P11959 /update {wt=javabin&version=2} {add=[6 (1413186798723530752)]} 0 5
[junit4:junit4]   2> 14079 T435 C49 P11945 /update {wt=javabin&version=2} {add=[7 (1413186798731919360)]} 0 1
[junit4:junit4]   2> 14088 T487 C47 P11979 REQ /update {update.distrib=FROMLEADER&distrib.from=http://127.0.0.1:11959/solr/collection1/&wt=javabin&version=2} status=0 QTime=1 
[junit4:junit4]   2> 14089 T466 C48 P11959 REQ /update {distrib.from=http://127.0.0.1:11953/solr/collection1/&update.distrib=TOLEADER&wt=javabin&version=2} status=0 QTime=5 
[junit4:junit4]   2> 14089 T454 C46 P11953 /update {wt=javabin&version=2} {add=[7]} 0 7
[junit4:junit4]   2> 14093 T435 C49 P11945 /update {wt=javabin&version=2} {add=[8 (1413186798746599424)]} 0 1
[junit4:junit4]   2> 14101 T473 C45 P11969 REQ /update {distrib.from=http://127.0.0.1:11953/solr/collection1/&update.distrib=FROMLEADER&wt=javabin&version=2} status=0 QTime=1 
[junit4:junit4]   2> 14102 T454 C46 P11953 /update {wt=javabin&version=2} {add=[8 (1413186798750793728)]} 0 6
[junit4:junit4]   2> 14106 T435 C49 P11945 /update {wt=javabin&version=2} {add=[9 (1413186798760230912)]} 0 1
[junit4:junit4]   2> 14113 T487 C47 P11979 REQ /update {distrib.from=http://127.0.0.1:11959/solr/collection1/&update.distrib=FROMLEADER&wt=javabin&version=2} status=0 QTime=1 
[junit4:junit4]   2> 14114 T463 C48 P11959 /update {wt=javabin&version=2} {add=[9 (1413186798764425216)]} 0 5
[junit4:junit4]   2> 14117 T435 C49 P11945 /update {wt=javabin&version=2} {add=[10 (1413186798771765248)]} 0 1
[junit4:junit4]   2> 14124 T473 C45 P11969 REQ /update {distrib.from=http://127.0.0.1:11953/solr/collection1/&update.distrib=FROMLEADER&wt=javabin&version=2} status=0 QTime=1 
[junit4:junit4]   2> 14125 T454 C46 P11953 /update {wt=javabin&version=2} {add=[10 (1413186798775959552)]} 0 5
[junit4:junit4]   2> 14157 T435 C49 P11945 /update {wt=javabin&version=2} {add=[11 (1413186798783299584)]} 0 30
[junit4:junit4]   2> 14165 T473 C45 P11969 REQ /update {update.distrib=FROMLEADER&distrib.from=http://127.0.0.1:11953/solr/collection1/&wt=javabin&version=2} status=0 QTime=1 
[junit4:junit4]   2> 14166 T451 C46 P11953 REQ /update {distrib.from=http://127.0.0.1:11959/solr/collection1/&update.distrib=TOLEADER&wt=javabin&version=2} status=0 QTime=5 
[junit4:junit4]   2> 14166 T463 C48 P11959 /update {wt=javabin&version=2} {add=[11]} 0 7
[junit4:junit4]   2> 14172 T435 C49 P11945 /update {wt=javabin&version=2} {add=[12 (1413186798827339776)]} 0 3
[junit4:junit4]   2> 14181 T473 C45 P11969 REQ /update {update.distrib=FROMLEADER&distrib.from=http://127.0.0.1:11953/solr/collection1/&wt=javabin&version=2} status=0 QTime=1 
[junit4:junit4]   2> 14182 T451 C46 P11953 REQ /update {distrib.from=http://127.0.0.1:11959/solr/collection1/&update.distrib=TOLEADER&wt=javabin&version=2} status=0 QTime=5 
[junit4:junit4]   2> 14183 T463 C48 P11959 /update {wt=javabin&version=2} {add=[12]} 0 9
[junit4:junit4]   2> 14187 T435 C49 P11945 /update {wt=javabin&version=2} {add=[13 (1413186798845165568)]} 0 1
[junit4:junit4]   2> 14196 T473 C45 P11969 REQ /update {update.distrib=FROMLEADER&distrib.from=http://127.0.0.1:11953/solr/collection1/&wt=javabin&version=2} status=0 QTime=1 
[junit4:junit4]   2> 14197 T451 C46 P11953 REQ /update {distrib.from=http://127.0.0.1:11959/solr/collection1/&update.distrib=TOLEADER&wt=javabin&version=2} status=0 QTime=5 
[junit4:junit4]   2> 14197 T463 C48 P11959 /update {wt=javabin&version=2} {add=[13]} 0 7
[junit4:junit4]   2> 14201 T435 C49 P11945 /update {wt=javabin&version=2} {add=[14 (1413186798859845632)]} 0 1
[junit4:junit4]   2> 14208 T473 C45 P11969 REQ /update {distrib.from=http://127.0.0.1:11953/solr/collection1/&update.distrib=FROMLEADER&wt=javabin&version=2} status=0 QTime=1 
[junit4:junit4]   2> 14209 T454 C46 P11953 /update {wt=javabin&version=2} {add=[14 (1413186798864039936)]} 0 5
[junit4:junit4]   2> 14214 T435 C49 P11945 /update {wt=javabin&version=2} {add=[15 (1413186798873477120)]} 0 1
[junit4:junit4]   2> 14221 T473 C45 P11969 REQ /update {distrib.from=http://127.0.0.1:11953/solr/collection1/&update.distrib=FROMLEADER&wt=javabin&version=2} status=0 QTime=1 
[junit4:junit4]   2> 14222 T454 C46 P11953 /update {wt=javabin&version=2} {add=[15 (1413186798877671424)]} 0 5
[junit4:junit4]   2> 14225 T435 C49 P11945 /update {wt=javabin&version=2} {add=[16 (1413186798885011456)]} 0 1
[junit4:junit4]   2> 14234 T473 C45 P11969 REQ /update {update.distrib=FROMLEADER&distrib.from=http://127.0.0.1:11953/solr/collection1/&wt=javabin&version=2} status=0 QTime=1 
[junit4:junit4]   2> 14235 T451 C46 P11953 REQ /update {distrib.from=http://127.0.0.1:11959/solr/collection1/&update.distrib=TOLEADER&wt=javabin&version=2} status=0 QTime=5 
[junit4:junit4]   2> 14235 T463 C48 P11959 /update {wt=javabin&version=2} {add=[16]} 0 7
[junit4:junit4]   2> 14240 T435 C49 P11945 /update {wt=javabin&version=2} {add=[17 (1413186798899691520)]} 0 2
[junit4:junit4]   2> 14254 T487 C47 P11979 REQ /update {update.distrib=FROMLEADER&distrib.from=http://127.0.0.1:11959/solr/collection1/&wt=javabin&version=2} status=0 QTime=3 
[junit4:junit4]   2> 14254 T466 C48 P11959 REQ /update {distrib.from=http://127.0.0.1:11953/solr/collection1/&update.distrib=TOLEADER&wt=javabin&version=2} status=0 QTime=8 
[junit4:junit4]   2> 14255 T454 C46 P11953 /update {wt=javabin&version=2} {add=[17]} 0 12
[junit4:junit4]   2> 14259 T435 C49 P11945 /update {wt=javabin&version=2} {add=[100 (1413186798920663040)]} 0 1
[junit4:junit4]   2> 14315 T473 C45 P11969 REQ /update {update.distrib=FROMLEADER&distrib.from=http://127.0.0.1:11953/solr/collection1/&wt=javabin&version=2} status=0 QTime=22 
[junit4:junit4]   2> 14316 T451 C46 P11953 REQ /update {distrib.from=http://127.0.0.1:11959/solr/collection1/&update.distrib=TOLEADER&wt=javabin&version=2} status=0 QTime=52 
[junit4:junit4]   2> 14316 T463 C48 P11959 /update {wt=javabin&version=2} {add=[100]} 0 54
[junit4:junit4]   2> 14322 T435 C49 P11945 /update {wt=javabin&version=2} {add=[101 (1413186798985674752)]} 0 2
[junit4:junit4]   2> 14334 T473 C45 P11969 REQ /update {update.distrib=FROMLEADER&distrib.from=http://127.0.0.1:11953/solr/collection1/&wt=javabin&version=2} status=0 QTime=3 
[junit4:junit4]   2> 14334 T451 C46 P11953 REQ /update {distrib.from=http://127.0.0.1:11959/solr/collection1/&update.distrib=TOLEADER&wt=javabin&version=2} status=0 QTime=8 
[junit4:junit4]   2> 14335 T463 C48 P11959 /update {wt=javabin&version=2} {add=[101]} 0 11
[junit4:junit4]   2> 14339 T435 C49 P11945 /update {wt=javabin&version=2} {add=[102 (1413186799004549120)]} 0 1
[junit4:junit4]   2> 14347 T473 C45 P11969 REQ /update {distrib.from=http://127.0.0.1:11953/solr/collection1/&update.distrib=FROMLEADER&wt=javabin&version=2} status=0 QTime=1 
[junit4:junit4]   2> 14348 T454 C46 P11953 /update {wt=javabin&version=2} {add=[102 (1413186799008743424)]} 0 6
[junit4:junit4]   2> 14385 T435 C49 P11945 /update {wt=javabin&version=2} {add=[103 (1413186799018180608)]} 0 34
[junit4:junit4]   2> 14395 T487 C47 P11979 REQ /update {update.distrib=FROMLEADER&distrib.from=http://127.0.0.1:11959/solr/collection1/&wt=javabin&version=2} status=0 QTime=1 
[junit4:junit4]   2> 14396 T466 C48 P11959 REQ /update {distrib.from=http://127.0.0.1:11953/solr/collection1/&update.distrib=TOLEADER&wt=javabin&version=2} status=0 QTime=5 
[junit4:junit4]   2> 14396 T454 C46 P11953 /update {wt=javabin&version=2} {add=[103]} 0 8
[junit4:junit4]   2> 14402 T435 C49 P11945 /update {wt=javabin&version=2} {add=[104 (1413186799068512256)]} 0 3
[junit4:junit4]   2> 14412 T487 C47 P11979 REQ /update {update.distrib=FROMLEADER&distrib.from=http://127.0.0.1:11959/solr/collection1/&wt=javabin&version=2} status=0 QTime=1 
[junit4:junit4]   2> 14413 T466 C48 P11959 REQ /update {distrib.from=http://127.0.0.1:11953/solr/collection1/&update.distrib=TOLEADER&wt=javabin&version=2} status=0 QTime=5 
[junit4:junit4]   2> 14414 T454 C46 P11953 /update {wt=javabin&version=2} {add=[104]} 0 9
[junit4:junit4]   2> 14418 T435 C49 P11945 /update {wt=javabin&version=2} {add=[105 (1413186799087386624)]} 0 1
[junit4:junit4]   2> 14483 T487 C47 P11979 REQ /update {distrib.from=http://127.0.0.1:11959/solr/collection1/&update.distrib=FROMLEADER&wt=javabin&version=2} status=0 QTime=31 
[junit4:junit4]   2> 14484 T463 C48 P11959 /update {wt=javabin&version=2} {add=[105 (1413186799091580928)]} 0 63
[junit4:junit4]   2> 14488 T435 C49 P11945 /update {wt=javabin&version=2} {add=[106 (1413186799160786944)]} 0 1
[junit4:junit4]   2> 14503 T487 C47 P11979 REQ /update {update.distrib=FROMLEADER&distrib.from=http://127.0.0.1:11959/solr/collection1/&wt=javabin&version=2} status=0 QTime=3 
[junit4:junit4]   2> 14504 T466 C48 P11959 REQ /update {distrib.from=http://127.0.0.1:11953/solr/collection1/&update.distrib=TOLEADER&wt=javabin&version=2} status=0 QTime=10 
[junit4:junit4]   2> 14504 T454 C46 P11953 /update {wt=javabin&version=2} {add=[106]} 0 13
[junit4:junit4]   2> 14509 T435 C49 P11945 /update {wt=javabin&version=2} {add=[107 (1413186799182807040)]} 0 1
[junit4:junit4]   2> 14517 T473 C45 P11969 REQ /update {distrib.from=http://127.0.0.1:11953/solr/collection1/&update.distrib=FROMLEADER&wt=javabin&version=2} status=0 QTime=1 
[junit4:junit4]   2> 14518 T454 C46 P11953 /update {wt=javabin&version=2} {add=[107 (1413186799187001344)]} 0 6
[junit4:junit4]   2> 14522 T435 C49 P11945 /update {wt=javabin&version=2} {add=[108 (1413186799196438528)]} 0 1
[junit4:junit4]   2> 14530 T473 C45 P11969 REQ /update {distrib.from=http://127.0.0.1:11953/solr/collection1/&update.distrib=FROMLEADER&wt=javabin&version=2} status=0 QTime=1 
[junit4:junit4]   2> 14531 T454 C46 P11953 /update {wt=javabin&version=2} {add=[108 (1413186799200632832)]} 0 6
[junit4:junit4]   2> 14535 T435 C49 P11945 /update {wt=javabin&version=2} {add=[109 (1413186799210070016)]} 0 1
[junit4:junit4]   2> 14545 T473 C45 P11969 REQ /update {update.distrib=FROMLEADER&distrib.from=http://127.0.0.1:11953/solr/collection1/&wt=javabin&version=2} status=0 QTime=1 
[junit4:junit4]   2> 14546 T451 C46 P11953 REQ /update {distrib.from=http://127.0.0.1:11959/solr/collection1/&update.distrib=TOLEADER&wt=javabin&version=2} status=0 QTime=6 
[junit4:junit4]   2> 14547 T463 C48 P11959 /update {wt=javabin&version=2} {add=[109]} 0 9
[junit4:junit4]   2> 14551 T435 C49 P11945 /update {wt=javabin&version=2} {add=[110 (1413186799226847232)]} 0 1
[junit4:junit4]   2> 14561 T473 C45 P11969 REQ /update {update.distrib=FROMLEADER&distrib.from=http://127.0.0.1:11953/solr/collection1/&wt=javabin&version=2} status=0 QTime=1 
[junit4:junit4]   2> 14562 T451 C46 P11953 REQ /update {distrib.from=http://127.0.0.1:11959/solr/collection1/&update.distrib=TOLEADER&wt=javabin&version=2} status=0 QTime=6 
[junit4:junit4]   2> 14563 T463 C48 P11959 /update {wt=javabin&version=2} {add=[110]} 0 9
[junit4:junit4]   2> 14566 T435 C49 P11945 /update {wt=javabin&version=2} {add=[111 (1413186799242575872)]} 0 1
[junit4:junit4]   2> 14573 T473 C45 P11969 REQ /update {distrib.from=http://127.0.0.1:11953/solr/collection1/&update.distrib=FROMLEADER&wt=javabin&version=2} status=0 QTime=1 
[junit4:junit4]   2> 14574 T454 C46 P11953 /update {wt=javabin&version=2} {add=[111 (1413186799246770176)]} 0 5
[junit4:junit4]   2> 14578 T435 C49 P11945 /update {wt=javabin&version=2} {add=[112 (1413186799255158784)]} 0 1
[junit4:junit4]   2> 14586 T487 C47 P11979 REQ /update {distrib.from=http://127.0.0.1:11959/solr/collection1/&update.distrib=FROMLEADER&wt=javabin&version=2} status=0 QTime=1 
[junit4:junit4]   2> 14587 T463 C48 P11959 /update {wt=javabin&version=2} {add=[112 (1413186799259353088)]} 0 6
[junit4:junit4]   2> 14617 T435 C49 P11945 /update {wt=javabin&version=2} {add=[113 (1413186799268790272)]} 0 27
[junit4:junit4]   2> 14625 T473 C45 P11969 REQ /update {distrib.from=http://127.0.0.1:11953/solr/collection1/&update.distrib=FROMLEADER&wt=javabin&version=2} status=0 QTime=1 
[junit4:junit4]   2> 14626 T454 C46 P11953 /update {wt=javabin&version=2} {add=[113 (1413186799301296128)]} 0 6
[junit4:junit4]   2> 14632 T435 C49 P11945 /update {wt=javabin&version=2} {add=[114 (1413186799309684736)]} 0 3
[junit4:junit4]   2> 14641 T473 C45 P11969 REQ /update {update.distrib=FROMLEADER&distrib.from=http://127.0.0.1:11953/solr/collection1/&wt=javabin&version=2} status=0 QTime=1 
[junit4:junit4]   2> 14642 T451 C46 P11953 REQ /update {distrib.from=http://127.0.0.1:11959/solr/collection1/&update.distrib=TOLEADER&wt=javabin&version=2} status=0 QTime=5 
[junit4:junit4]   2> 14643 T463 C48 P11959 /update {wt=javabin&version=2} {add=[114]} 0 8
[junit4:junit4]   2> 14647 T435 C49 P11945 /update {wt=javabin&version=2} {add=[115 (1413186799327510528)]} 0 1
[junit4:junit4]   2> 14654 T487 C47 P11979 REQ /update {distrib.from=http://127.0.0.1:11959/solr/collection1/&update.distrib=FROMLEADER&wt=javabin&version=2} status=0 QTime=1 
[junit4:junit4]   2> 14655 T463 C48 P11959 /update {wt=javabin&version=2} {add=[115 (1413186799331704832)]} 0 5
[junit4:junit4]   2> 14659 T435 C49 P11945 /update {wt=javabin&version=2} {add=[116 (1413186799340093440)]} 0 1
[junit4:junit4]   2> 14666 T487 C47 P11979 REQ /update {distrib.from=http://127.0.0.1:11959/solr/collection1/&update.distrib=FROMLEADER&wt=javabin&version=2} status=0 QTime=1 
[junit4:junit4]   2> 14667 T463 C48 P11959 /update {wt=javabin&version=2} {add=[116 (1413186799344287744)]} 0 5
[junit4:junit4]   2> 14671 T435 C49 P11945 /update {wt=javabin&version=2} {add=[117 (1413186799352676352)]} 0 1
[junit4:junit4]   2> 14678 T487 C47 P11979 REQ /update {distrib.from=http://127.0.0.1:11959/solr/collection1/&update.distrib=FROMLEADER&wt=javabin&version=2} status=0 QTime=1 
[junit4:junit4]   2> 14679 T463 C48 P11959 /update {wt=javabin&version=2} {add=[117 (1413186799356870656)]} 0 5
[junit4:junit4]   2> 14684 T435 C49 P11945 /update {wt=javabin&version=2} {add=[118 (1413186799366307840)]} 0 1
[junit4:junit4]   2> 14738 T473 C45 P11969 REQ /update {distrib.from=http://127.0.0.1:11953/solr/collection1/&update.distrib=FROMLEADER&wt=javabin&version=2} status=0 QTime=24 
[junit4:junit4]   2> 14739 T454 C46 P11953 /update {wt=javabin&version=2} {add=[118 (1413186799369453568)]} 0 53
[junit4:junit4]   2> 14745 T435 C49 P11945 /update {wt=javabin&version=2} {add=[119 (1413186799429222400)]} 0 2
[junit4:junit4]   2> 14755 T487 C47 P11979 REQ /update {update.distrib=FROMLEADER&distrib.from=http://127.0.0.1:11959/solr/collection1/&wt=javabin&version=2} status=0 QTime=1 
[junit4:junit4]   2> 14756 T466 C48 P11959 REQ /update {distrib.from=http://127.0.0.1:11953/solr/collection1/&update.distrib=TOLEADER&wt=javabin&version=2} status=0 QTime=5 
[junit4:junit4]   2> 14756 T454 C46 P11953 /update {wt=javabin&version=2} {add=[119]} 0 8
[junit4:junit4]   2> 14760 T435 C49 P11945 /update {wt=javabin&version=2} {add=[120 (1413186799445999616)]} 0 1
[junit4:junit4]   2> 14769 T487 C47 P11979 REQ /update {update.distrib=FROMLEADER&distrib.from=http://127.0.0.1:11959/solr/collection1/&wt=javabin&version=2} status=0 QTime=1 
[junit4:junit4]   2> 14770 T466 C48 P11959 REQ /update {distrib.from=http://127.0.0.1:11953/solr/collection1/&update.distrib=TOLEADER&wt=javabin&version=2} status=0 QTime=5 
[junit4:junit4]   2> 14770 T454 C46 P11953 /update {wt=javabin&version=2} {add=[120]} 0 7
[junit4:junit4]   2> 14774 T435 C49 P11945 /update {wt=javabin&version=2} {add=[121 (1413186799460679680)]} 0 1
[junit4:junit4]   2> 14781 T487 C47 P11979 REQ /update {distrib.from=http://127.0.0.1:11959/solr/collection1/&update.distrib=FROMLEADER&wt=javabin&version=2} status=0 QTime=1 
[junit4:junit4]   2> 14782 T463 C48 P11959 /update {wt=javabin&version=2} {add=[121 (1413186799464873984)]} 0 4
[junit4:junit4]   2> 14785 T435 C49 P11945 /update {wt=javabin&version=2} {add=[122 (1413186799472214016)]} 0 1
[junit4:junit4]   2> 14796 T473 C45 P11969 REQ /update {distrib.from=http://127.0.0.1:11953/solr/collection1/&update.distrib=FROMLEADER&wt=javabin&version=2} status=0 QTime=2 
[junit4:junit4]   2> 14797 T454 C46 P11953 /update {wt=javabin&version=2} {add=[122 (1413186799476408320)]} 0 9
[junit4:junit4]   2> 14820 T435 C49 P11945 /update {wt=javabin&version=2} {add=[123 (1413186799488991232)]} 0 20
[junit4:junit4]   2> 14831 T473 C45 P11969 REQ /update {update.distrib=FROMLEADER&distrib.from=http://127.0.0.1:11953/solr/collection1/&wt=javabin&version=2} status=0 QTime=1 
[junit4:junit4]   2> 14832 T451 C46 P11953 REQ /update {distrib.from=http://127.0.0.1:11959/solr/collection1/&update.distrib=TOLEADER&wt=javabin&version=2} status=0 QTime=6 
[junit4:junit4]   2> 14832 T463 C48 P11959 /update {wt=javabin&version=2} {add=[123]} 0 9
[junit4:junit4]   2> 14838 T435 C49 P11945 /update {wt=javabin&version=2} {add=[124 (1413186799525691392)]} 0 3
[junit4:junit4]   2> 14845 T473 C45 P11969 REQ /update {distrib.from=http://127.0.0.1:11953/solr/collection1/&update.distrib=FROMLEADER&wt=javabin&version=2} status=0 QTime=1 
[junit4:junit4]   2> 14846 T454 C46 P11953 /update {wt=javabin&version=2} {add=[124 (1413186799531982848)]} 0 5
[junit4:junit4]   2> 14850 T435 C49 P11945 /update {wt=javabin&version=2} {add=[125 (1413186799540371456)]} 0 1
[junit4:junit4]   2> 14866 T473 C45 P11969 REQ /update {update.distrib=FROMLEADER&distrib.from=http://127.0.0.1:11953/solr/collection1/&wt=javabin&version=2} status=0 QTime=1 
[junit4:junit4]   2> 14867 T451 C46 P11953 REQ /update {distrib.from=http://127.0.0.1:11959/solr/collection1/&update.distrib=TOLEADER&wt=javabin&version=2} status=0 QTime=6 
[junit4:junit4]   2> 14868 T463 C48 P11959 /update {wt=javabin&version=2} {add=[125]} 0 14
[junit4:junit4]   2> 14872 T435 C49 P11945 /update {wt=javabin&version=2} {add=[126 (1413186799563440128)]} 0 1
[junit4:junit4]   2> 14879 T487 C47 P11979 REQ /update {distrib.from=http://127.0.0.1:11959/solr/collection1/&update.distrib=FROMLEADER&wt=javabin&version=2} status=0 QTime=1 
[junit4:junit4]   2> 14880 T463 C48 P11959 /update {wt=javabin&version=2} {add=[126 (1413186799567634432)]} 0 5
[junit4:junit4]   2> 14884 T435 C49 P11945 /update {wt=javabin&version=2} {add=[127 (1413186799576023040)]} 0 1
[junit4:junit4]   2> 14925 T487 C47 P11979 REQ /update {update.distrib=FROMLEADER&distrib.from=http://127.0.0.1:11959/solr/collection1/&wt=javabin&version=2} status=0 QTime=15 
[junit4:junit4]   2> 14926 T466 C48 P11959 REQ /update {distrib.from=http://127.0.0.1:11953/solr/collection1/&update.distrib=TOLEADER&wt=javabin&version=2} status=0 QTime=37 
[junit4:junit4]   2> 14926 T454 C46 P11953 /update {wt=javabin&version=2} {add=[127]} 0 39
[junit4:junit4]   2> 14930 T435 C49 P11945 /update {wt=javabin&version=2} {add=[128 (1413186799624257536)]} 0 1
[junit4:junit4]   2> 14942 T487 C47 P11979 REQ /update {update.distrib=FROMLEADER&distrib.from=http://127.0.0.1:11959/solr/collection1/&wt=javabin&version=2} status=0 QTime=2 
[junit4:junit4]   2> 14943 T466 C48 P11959 REQ /update {distrib.from=http://127.0.0.1:11953/solr/collection1/&update.distrib=TOLEADER&wt=javabin&version=2} status=0 QTime=8 
[junit4:junit4]   2> 14943 T454 C46 P11953 /update {wt=javabin&version=2} {add=[128]} 0 10
[junit4:junit4]   2> 14947 T435 C49 P11945 /update {wt=javabin&version=2} {add=[129 (1413186799642083328)]} 0 1
[junit4:junit4]   2> 14956 T473 C45 P11969 REQ /update {update.distrib=FROMLEADER&distrib.from=http://127.0.0.1:11953/solr/collection1/&wt=javabin&version=2} status=0 QTime=1 
[junit4:junit4]   2> 14957 T451 C46 P11953 REQ /update {distrib.from=http://127.0.0.1:11959/solr/collection1/&update.distrib=TOLEADER&wt=javabin&version=2} status=0 QTime=5 
[junit4:junit4]   2> 14957 T463 C48 P11959 /update {wt=javabin&version=2} {add=[129]} 0 7
[junit4:junit4]   2> 14961 T435 C49 P11945 /update {wt=javabin&version=2} {add=[130 (1413186799656763392)]} 0 1
[junit4:junit4]   2> 14968 T487 C47 P11979 REQ /update {distrib.from=http://127.0.0.1:11959/solr/collection1/&update.distrib=FROMLEADER&wt=javabin&version=2} status=0 QTime=1 
[junit4:junit4]   2> 14969 T463 C48 P11959 /update {wt=javabin&version=2} {add=[130 (1413186799660957696)]} 0 5
[junit4:junit4]   2> 14972 T435 C49 P11945 /update {wt=javabin&version=2} {add=[131 (1413186799668297728)]} 0 1
[junit4:junit4]   2> 14979 T487 C47 P11979 REQ /update {distrib.from=http://127.0.0.1:11959/solr/collection1/&update.distrib=FROMLEADER&wt=javabin&version=2} status=0 QTime=1 
[junit4:junit4]   2> 14979 T463 C48 P11959 /update {wt=javabin&version=2} {add=[131 (1413186799672492032)]} 0 4
[junit4:junit4]   2> 14983 T435 C49 P11945 /update {wt=javabin&version=2} {add=[132 (1413186799679832064)]} 0 1
[junit4:junit4]   2> 14992 T473 C45 P11969 REQ /update {update.distrib=FROMLEADER&distrib.from=http://127.0.0.1:11953/solr/collection1/&wt=javabin&version=2} status=0 QTime=1 
[junit4:junit4]   2> 14993 T451 C46 P11953 REQ /update {distrib.from=http://127.0.0.1:11959/solr/collection1/&update.distrib=TOLEADER&wt=javabin&version=2} status=0 QTime=5 
[junit4:junit4]   2> 14993 T463 C48 P11959 /update {wt=javabin&version=2} {add=[132]} 0 7
[junit4:junit4]   2> 15014 T435 C49 P11945 /update {wt=javabin&version=2} {add=[133 (1413186799694512128)]} 0 18
[junit4:junit4]   2> 15024 T473 C45 P11969 REQ /update {update.distrib=FROMLEADER&distrib.from=http://127.0.0.1:11953/solr/collection1/&wt=javabin&version=2} status=0 QTime=1 
[junit4:junit4]   2> 15025 T451 C46 P11953 REQ /update {distrib.from=http://127.0.0.1:11959/solr/collection1/&update.distrib=TOLEADER&wt=javabin&version=2} status=0 QTime=5 
[junit4:junit4]   2> 15025 T463 C48 P11959 /update {wt=javabin&version=2} {add=[133]} 0 8
[junit4:junit4]   2> 15031 T435 C49 P11945 /update {wt=javabin&version=2} {add=[134 (1413186799728066560)]} 0 3
[junit4:junit4]   2> 15037 T487 C47 P11979 REQ /update {distrib.from=http://127.0.0.1:11959/solr/collection1/&update.distrib=FROMLEADER&wt=javabin&version=2} status=0 QTime=1 
[junit4:junit4]   2> 15038 T463 C48 P11959 /update {wt=javabin&version=2} {add=[134 (1413186799733309440)]} 0 5
[junit4:junit4]   2> 15042 T435 C49 P11945 /update {wt=javabin&version=2} {add=[135 (1413186799741698048)]} 0 1
[junit4:junit4]   2> 15052 T473 C45 P11969 REQ /update {update.distrib=FROMLEADER&distrib.from=http://127.0.0.1:11953/solr/collection1/&wt=javabin&version=2} status=0 QTime=1 
[junit4:junit4]   2> 15053 T451 C46 P11953 REQ /update {distrib.from=http://127.0.0.1:11959/solr/collection1/&update.distrib=TOLEADER&wt=javabin&version=2} status=0 QTime=5 
[junit4:junit4]   2> 15053 T463 C48 P11959 /update {wt=javabin&version=2} {add=[135]} 0 8
[junit4:junit4]   2> 15057 T435 C49 P11945 /update {wt=javabin&version=2} {add=[136 (1413186799757426688)]} 0 1
[junit4:junit4]   2> 15064 T487 C47 P11979 REQ /update {distrib.from=http://127.0.0.1:11959/solr/collection1/&update.distrib=FROMLEADER&wt=javabin&version=2} status=0 QTime=1 
[junit4:junit4]   2> 15065 T463 C48 P11959 /update {wt=javabin&version=2} {add=[136 (1413186799761620992)]} 0 5
[junit4:junit4]   2> 15069 T435 C49 P11945 /update {wt=javabin&version=2} {add=[137 (1413186799770009600)]} 0 1
[junit4:junit4]   2> 15078 T487 C47 P11979 REQ /update {update.distrib=FROMLEADER&distrib.from=http://127.0.0.1:11959/solr/collection1/&wt=javabin&version=2} status=0 QTime=1 
[junit4:junit4]   2> 15079 T466 C48 P11959 REQ /update {distrib.from=http://127.0.0.1:11953/solr/collection1/&update.distrib=TOLEADER&wt=javabin&version=2} status=0 QTime=5 
[junit4:junit4]   2> 15080 T454 C46 P11953 /update {wt=javabin&version=2} {add=[137]} 0 8
[junit4:junit4]   2> 15083 T435 C49 P11945 /update {wt=javabin&version=2} {add=[138 (1413186799784689664)]} 0 1
[junit4:junit4]   2> 15090 T473 C45 P11969 REQ /update {distrib.from=http://127.0.0.1:11953/solr/collection1/&update.distrib=FROMLEADER&wt=javabin&version=2} status=0 QTime=1 
[junit4:junit4]   2> 15091 T454 C46 P11953 /update {wt=javabin&version=2} {add=[138 (1413186799788883968)]} 0 5
[junit4:junit4]   2> 15095 T435 C49 P11945 /update {wt=javabin&version=2} {add=[139 (1413186799797272576)]} 0 1
[junit4:junit4]   2> 15105 T487 C47 P11979 REQ /update {update.distrib=FROMLEADER&distrib.from=http://127.0.0.1:11959/solr/collection1/&wt=javabin&version=2} status=0 QTime=1 
[junit4:junit4]   2> 15106 T466 C48 P11959 REQ /update {distrib.from=http://127.0.0.1:11953/solr/collection1/&update.distrib=TOLEADER&wt=javabin&version=2} status=0 QTime=6 
[junit4:junit4]   2> 15107 T454 C46 P11953 /update {wt=javabin&version=2} {add=[139]} 0 9
[junit4:junit4]   2> 15111 T435 C49 P11945 /update {wt=javabin&version=2} {add=[140 (1413186799814049792)]} 0 1
[junit4:junit4]   2> 15121 T487 C47 P11979 REQ /update {update.distrib=FROMLEADER&distrib.from=http://127.0.0.1:11959/solr/collection1/&wt=javabin&version=2} status=0 QTime=1 
[junit4:junit4]   2> 15122 T466 C48 P11959 REQ /update {distrib.from=http://127.0.0.1:11953/solr/collection1/&update.distrib=TOLEADER&wt=javabin&version=2} status=0 QTime=5 
[junit4:junit4]   2> 15123 T454 C46 P11953 /update {wt=javabin&version=2} {add=[140]} 0 9
[junit4:junit4]   2> 15127 T435 C49 P11945 /update {wt=javabin&version=2} {add=[141 (1413186799830827008)]} 0 1
[junit4:junit4]   2> 15137 T487 C47 P11979 REQ /update {update.distrib=FROMLEADER&distrib.from=http://127.0.0.1:11959/solr/collection1/&wt=javabin&version=2} status=0 QTime=1 
[junit4:junit4]   2> 15138 T466 C48 P11959 REQ /update {distrib.from=http://127.0.0.1:11953/solr/collection1/&update.distrib=TOLEADER&wt=javabin&version=2} status=0 QTime=5 
[junit4:junit4]   2> 15139 T454 C46 P11953 /update {wt=javabin&version=2} {add=[141]} 0 9
[junit4:junit4]   2> 15143 T435 C49 P11945 /update {wt=javabin&version=2} {add=[142 (1413186799847604224)]} 0 1
[junit4:junit4]   2> 15197 T487 C47 P11979 REQ /update {update.distrib=FROMLEADER&distrib.from=http://127.0.0.1:11959/solr/collection1/&wt=javabin&version=2} status=0 QTime=18 
[junit4:junit4]   2> 15197 T466 C48 P11959 REQ /update {distrib.from=http://127.0.0.1:11953/solr/collection1/&update.distrib=TOLEADER&wt=javabin&version=2} status=0 QTime=48 
[junit4:junit4]   2> 15198 T454 C46 P11953 /update {wt=javabin&version=2} {add=[142]} 0 52
[junit4:junit4]   2> 15220 T435 C49 P11945 /update {wt=javabin&version=2} {add=[143 (1413186799910518784)]} 0 18
[junit4:junit4]   2> 15234 T487 C47 P11979 REQ /update {update.distrib=FROMLEADER&distrib.from=http://127.0.0.1:11959/solr/collection1/&wt=javabin&version=2} status=0 QTime=3 
[junit4:junit4]   2> 15234 T466 C48 P11959 REQ /update {distrib.from=http://127.0.0.1:11953/solr/collection1/&update.distrib=TOLEADER&wt=javabin&version=2} status=0 QTime=8 
[junit4:junit4]   2> 15235 T454 C46 P11953 /update {wt=javabin&version=2} {add=[143]} 0 12
[junit4:junit4]   2> 15241 T435 C49 P11945 /update {wt=javabin&version=2} {add=[144 (1413186799948267520)]} 0 3
[junit4:junit4]   2> 15248 T487 C47 P11979 REQ /update {distrib.from=http://127.0.0.1:11959/solr/collection1/&update.distrib=FROMLEADER&wt=javabin&version=2} status=0 QTime=1 
[junit4:junit4]   2> 15249 T463 C48 P11959 /update {wt=javabin&version=2} {add=[144 (1413186799954558976)]} 0 5
[junit4:junit4]   2> 15253 T435 C49 P11945 /update {wt=javabin&version=2} {add=[145 (1413186799962947584)]} 0 1
[junit4:junit4]   2> 15260 T487 C47 P11979 REQ /update {distrib.from=http://127.0.0.1:11959/solr/collection1/&update.distrib=FROMLEADER&wt=javabin&version=2} status=0 QTime=1 
[junit4:junit4]   2> 15261 T463 C48 P11959 /update {wt=javabin&version=2} {add=[145 (1413186799967141888)]} 0 5
[junit4:junit4]   2> 15264 T435 C49 P11945 /update {wt=javabin&version=2} {add=[146 (1413186799974481920)]} 0 1
[junit4:junit4]   2> 15317 T473 C45 P11969 REQ /update {distrib.from=http://127.0.0.1:11953/solr/collection1/&update.distrib=FROMLEADER&wt=javabin&version=2} status=0 QTime=26 
[junit4:junit4]   2> 15318 T454 C46 P11953 /update {wt=javabin&version=2} {add=[146 (1413186799978676224)]} 0 51
[junit4:junit4]   2> 15322 T435 C49 P11945 /update {wt=javabin&version=2} {add=[147 (1413186800035299328)]} 0 1
[junit4:junit4]   2> 15329 T487 C47 P11979 REQ /update {distrib.from=http://127.0.0.1:11959/solr/collection1/&update.distrib=FROMLEADER&wt=javabin&version=2} status=0 QTime=1 
[junit4:junit4]   2> 15330 T463 C48 P11959 /update {wt=javabin&version=2} {add=[147 (1413186800039493632)]} 0 5
[junit4:junit4]   2> 15334 T435 C49 P11945 /update {wt=javabin&version=2} {add=[148 (1413186800047882240)]} 0 1
[junit4:junit4]   2> 15347 T473 C45 P11969 REQ /update {update.distrib=FROMLEADER&distrib.from=http://127.0.0.1:11953/solr/collection1/&wt=javabin&version=2} status=0 QTime=3 
[junit4:junit4]   2> 15348 T451 C46 P11953 REQ /update {distrib.from=http://127.0.0.1:11959/solr/collection1/&update.distrib=TOLEADER&wt=javabin&version=2} status=0 QTime=9 
[junit4:junit4]   2> 15349 T463 C48 P11959 /update {wt=javabin&version=2} {add=[148]} 0 12
[junit4:junit4]   2> 15354 T435 C49 P11945 /update {wt=javabin&version=2} {add=[149 (1413186800068853760)]} 0 2
[junit4:junit4]   2> 15365 T487 C47 P11979 REQ /update {update.distrib=FROMLEADER&distrib.from=http://127.0.0.1:11959/solr/collection1/&wt=javabin&version=2} status=0 QTime=3 
[junit4:junit4]   2> 15366 T466 C48 P11959 REQ /update {distrib.from=http://127.0.0.1:11953/solr/collection1/&update.distrib=TOLEADER&wt=javabin&version=2} status=0 QTime=7 
[junit4:junit4]   2> 15367 T454 C46 P11953 /update {wt=javabin&version=2} {add=[149]} 0 11
[junit4:junit4]   2> 15367 T423 oasc.AbstractDistribZkTestBase.waitForRecoveriesToFinish Wait for recoveries to finish - collection: collection1 failOnTimeout:true timeout (sec):1440
[junit4:junit4]   2> 15368 T423 oascc.ZkStateReader.updateClusterState Updating cloud state from ZooKeeper... 
[junit4:junit4]   2> 15372 T435 C49 P11945 oasu.DirectUpdateHandler2.commit start commit{flags=0,_version_=0,optimize=false,openSearcher=true,waitSearcher=true,expungeDeletes=false,softCommit=false}
[junit4:junit4]   2> 16075 T435 C49 P11945 oasc.SolrDeletionPolicy.onCommit SolrDeletionPolicy.onCommit: commits:num=2
[junit4:junit4]   2> 		commit{dir=/usr/home/hudson/hudson-slave/workspace/Lucene-Solr-Tests-trunk-java7/solr/build/solr-core/test/J1/org.apache.solr.cloud.BasicDistributedZk2Test-1347719940162/control/data/index,segFN=segments_2,generation=2,filenames=[_0_MockRandom_0.tib, _0.fnm, _0_MockVariableIntBlock_0.doc, _0_MockRandom_0.prx, _0_nrm.cfs, _0_MockVariableIntBlock_0.skp, _0_Direct_0.frq, _0_MockVariableIntBlock_0.pyl, _0_MockRandom_0.sd, _0_MockRandom_0.frq, _0_MockRandom_0.tiv, _0_MockVariableIntBlock_0.tib, _0_MockVariableIntBlock_0.frq, _0_SimpleText_0.pst, _0_nrm.cfe, _0_MockVariableIntBlock_0.pos, segments_2, _0.fdx, _0_Direct_0.tip, _0_Direct_0.prx, _0.si, _0_Direct_0.tim, _0.fdt, _0_MockVariableIntBlock_0.tii]
[junit4:junit4]   2> 		commit{dir=/usr/home/hudson/hudson-slave/workspace/Lucene-Solr-Tests-trunk-java7/solr/build/solr-core/test/J1/org.apache.solr.cloud.BasicDistributedZk2Test-1347719940162/control/data/index,segFN=segments_3,generation=3,filenames=[_5_nrm.cfe, _2_Direct_0.tip, _2_Direct_0.tim, _2_SimpleText_0.pst, _0_MockRandom_0.prx, _7.si, _6_Direct_0.tip, _6_Direct_0.tim, _3.fdt, _1_MockRandom_0.pos, _7.fnm, _0_SimpleText_0.pst, _3_MockRandom_0.skp, _5_MockRandom_0.pyl, _5_MockRandom_0.pos, _5_Direct_0.prx, _1_MockVariableIntBlock_0.tii, _2.fdt, _7.fdx, _1_MockRandom_0.sd, _2.fdx, _7.fdt, _1_MockRandom_0.tii, _1_MockVariableIntBlock_0.tib, _7_MockRandom_0.prx, _1.fdx, _0_MockRandom_0.frq, _4_MockRandom_0.prx, _1_MockRandom_0.tib, _5_nrm.cfs, _1.fdt, _4_MockRandom_0.sd, _0_MockVariableIntBlock_0.frq, _7_MockRandom_0.sd, _1_MockRandom_0.doc, _3.si, _6.fdt, _2_MockVariableIntBlock_0.skp, _1_SimpleText_0.pst, _1_MockVariableIntBlock_0.skp, _2.si, _5_Direct_0.tim, _2_MockRandom_0.tii, _2_MockVariableIntBlock_0.pyl, _0_MockVariableIntBlock_0.doc, _6.fdx, _1_MockVariableIntBlock_0.pyl, _3_MockRandom_0.frq, _3.fnm, _2_MockVariableIntBlock_0.doc, _0_MockVariableIntBlock_0.pyl, _2_nrm.cfe, _6_MockRandom_0.tib, _1_MockVariableIntBlock_0.doc, _2_MockRandom_0.pyl, _0_MockVariableIntBlock_0.pos, _6_MockRandom_0.tii, _2_MockRandom_0.tib, _2_nrm.cfs, _5_MockRandom_0.doc, _5_Direct_0.tip, _2_MockVariableIntBlock_0.tii, _2_MockVariableIntBlock_0.tib, _1_MockVariableIntBlock_0.pos, _5_MockRandom_0.skp, _1_Direct_0.prx, _6_Direct_0.prx, _2.fnm, _3.fdx, _2_MockRandom_0.sd, _2_MockRandom_0.skp, _1.si, _6_MockRandom_0.prx, _3_MockRandom_0.pyl, _6.si, _6.fnm, _0_Direct_0.tip, _0_Direct_0.prx, _0_Direct_0.tim, _2_MockRandom_0.doc, _3_MockRandom_0.pos, _1_Direct_0.frq, _6_MockRandom_0.frq, _3_nrm.cfe, _3_Direct_0.frq, _5.fdt, _4_nrm.cfe, _4.fnm, _0_MockVariableIntBlock_0.skp, _1.fnm, _4.fdx, _7_MockRandom_0.frq, _4_Direct_0.frq, _3_SimpleText_0.pst, _7_MockRandom_0.tii, _5_MockRandom_0.sd, _7_Direct_0.tim, _7_MockRandom_0.tib, _4_MockRandom_0.tip, _1_Direct_0.tim, _3_Direct_0.prx, _7_Direct_0.tip, _4_MockRandom_0.tim, _1_Direct_0.tip, _2_MockVariableIntBlock_0.pos, _3_Direct_0.tip, _0.fnm, _4_Direct_0.tim, _5_Direct_0.frq, _0_Direct_0.frq, _5.si, _3_nrm.cfs, _6_MockRandom_0.sd, _3_MockRandom_0.tip, _4_Direct_0.prx, _3_MockRandom_0.tim, _7_Direct_0.frq, _4_nrm.cfs, _4_Direct_0.tip, _1_MockRandom_0.frq, _3_Direct_0.tim, _5_MockRandom_0.frq, _3_MockRandom_0.doc, _2_MockVariableIntBlock_0.frq, _5_MockRandom_0.tip, _6_nrm.cfs, _5_MockRandom_0.tim, _7_nrm.cfs, _0_MockVariableIntBlock_0.tib, _2_MockRandom_0.pos, _0.si, _0_MockVariableIntBlock_0.tii, _5_SimpleText_0.pst, _1_nrm.cfs, _0_MockRandom_0.tib, _5.fnm, _7_nrm.cfe, _6_nrm.cfe, _4.si, _4.fdt, _1_MockRandom_0.skp, _0_nrm.cfs, _6_SimpleText_0.pst, _1_nrm.cfe, _3_MockRandom_0.sd, _7_SimpleText_0.pst, _4_SimpleText_0.pst, _1_MockVariableIntBlock_0.frq, _2_Direct_0.prx, _0_MockRandom_0.sd, _1_MockRandom_0.pyl, _0_MockRandom_0.tiv, _7_Direct_0.prx, _4_MockRandom_0.frq, _0_nrm.cfe, _5.fdx, _2_MockRandom_0.frq, _0.fdx, _2_Direct_0.frq, _6_Direct_0.frq, segments_3, _0.fdt]
[junit4:junit4]   2> 16076 T435 C49 P11945 oasc.SolrDeletionPolicy.updateCommits newest commit = 3
[junit4:junit4]   2> 16196 T435 C49 P11945 oass.SolrIndexSearcher.<init> Opening Searcher@239e7b78 main
[junit4:junit4]   2> 16198 T435 C49 P11945 oasu.DirectUpdateHandler2.commit end_commit_flush
[junit4:junit4]   2> 16200 T446 oasc.SolrCore.registerSearcher [collection1] Registered new searcher Searcher@239e7b78 main{StandardDirectoryReader(segments_3:17 _0(5.0):C1 _1(5.0):C10 _2(5.0):C10 _3(5.0):C10 _4(5.0):C10 _5(5.0):C10 _6(5.0):C10 _7(5.0):C6)}
[junit4:junit4]   2> 16200 T435 C49 P11945 /update {waitSearcher=true&wt=javabin&commit=true&softCommit=false&version=2} {commit=} 0 828
[junit4:junit4]   2> 16203 T454 C46 P11953 oasu.DirectUpdateHandler2.commit start commit{flags=0,_version_=0,optimize=false,openSearcher=true,waitSearcher=true,expungeDeletes=false,softCommit=false}
[junit4:junit4]   2> 16554 T454 C46 P11953 oasc.SolrDeletionPolicy.onCommit SolrDeletionPolicy.onCommit: commits:num=2
[junit4:junit4]   2> 		commit{dir=/usr/home/hudson/hudson-slave/workspace/Lucene-Solr-Tests-trunk-java7/solr/build/solr-core/test/J1/org.apache.solr.cloud.BasicDistributedZk2Test-1347719940162/jetty1/index,segFN=segments_2,generation=2,filenames=[_0_MockRandom_0.tib, _0.fnm, _0_MockVariableIntBlock_0.doc, _0_MockRandom_0.prx, _0_nrm.cfs, _0_MockVariableIntBlock_0.skp, _0_Direct_0.frq, _0_MockVariableIntBlock_0.pyl, _0_MockRandom_0.sd, _0_MockRandom_0.frq, _0_MockVariableIntBlock_0.tib, _0_MockVariableIntBlock_0.frq, _0_SimpleText_0.pst, _0_nrm.cfe, _0_MockVariableIntBlock_0.pos, _0_MockRandom_0.tii, segments_2, _0.fdx, _0_Direct_0.tip, _0_Direct_0.prx, _0.si, _0_Direct_0.tim, _0.fdt, _0_MockVariableIntBlock_0.tii]
[junit4:junit4]   2> 		commit{dir=/usr/home/hudson/hudson-slave/workspace/Lucene-Solr-Tests-trunk-java7/solr/build/solr-core/test/J1/org.apache.solr.cloud.BasicDistributedZk2Test-1347719940162/jetty1/index,segFN=segments_3,generation=3,filenames=[_2_Direct_0.tip, _2_Direct_0.tim, _2_SimpleText_0.pst, _3_MockRandom_0.prx, _0_MockRandom_0.prx, _3.fdt, _0_SimpleText_0.pst, _1_MockVariableIntBlock_0.tii, _1_MockRandom_0.tip, _2.fdt, _1_MockRandom_0.tim, _1_MockRandom_0.sd, _2.fdx, _1_MockVariableIntBlock_0.tib, _1.fdx, _0_MockRandom_0.frq, _4_MockRandom_0.prx, _1.fdt, _4_MockRandom_0.sd, _0_MockVariableIntBlock_0.frq, _3.si, _1_SimpleText_0.pst, _1_MockVariableIntBlock_0.skp, _2.si, _2_MockRandom_0.tip, _0_MockVariableIntBlock_0.doc, _2_MockRandom_0.tim, _1_MockVariableIntBlock_0.pyl, _3_MockRandom_0.frq, _3.fnm, _0_MockVariableIntBlock_0.pyl, _2_nrm.cfe, _1_MockVariableIntBlock_0.doc, _2_MockRandom_0.pyl, _0_MockVariableIntBlock_0.pos, _2_nrm.cfs, _1_MockVariableIntBlock_0.pos, _1_Direct_0.prx, _2.fnm, _3.fdx, _2_MockRandom_0.sd, _2_MockRandom_0.skp, _1.si, _0_Direct_0.tip, _0_Direct_0.prx, _0_Direct_0.tim, _2_MockRandom_0.doc, _1_Direct_0.frq, _3_nrm.cfe, _3_Direct_0.frq, _4.fnm, _4_nrm.cfe, _0_MockVariableIntBlock_0.skp, _1.fnm, _4.fdx, _4_Direct_0.frq, _3_SimpleText_0.pst, _4_MockRandom_0.tip, _1_Direct_0.tim, _3_Direct_0.prx, _4_MockRandom_0.tim, _1_Direct_0.tip, _3_Direct_0.tip, _0.fnm, _4_Direct_0.tim, _0_Direct_0.frq, _3_nrm.cfs, _3_MockRandom_0.tip, _3_MockRandom_0.tim, _4_Direct_0.prx, _4_nrm.cfs, _4_Direct_0.tip, _1_MockRandom_0.frq, _3_Direct_0.tim, _0_MockVariableIntBlock_0.tib, _2_MockRandom_0.pos, _0.si, _0_MockVariableIntBlock_0.tii, _1_nrm.cfs, _0_MockRandom_0.tib, _0_nrm.cfs, _4.fdt, _4.si, _1_nrm.cfe, _3_MockRandom_0.sd, _1_MockVariableIntBlock_0.frq, _2_Direct_0.prx, _4_SimpleText_0.pst, _1_MockRandom_0.prx, _0_MockRandom_0.sd, _4_MockRandom_0.frq, _0_nrm.cfe, _0_MockRandom_0.tii, _2_MockRandom_0.frq, _0.fdx, _2_Direct_0.frq, segments_3, _0.fdt]
[junit4:junit4]   2> 16555 T454 C46 P11953 oasc.SolrDeletionPolicy.updateCommits newest commit = 3
[junit4:junit4]   2> 16607 T454 C46 P11953 oass.SolrIndexSearcher.<init> Opening Searcher@5cf8706 main
[junit4:junit4]   2> 16610 T454 C46 P11953 oasu.DirectUpdateHandler2.commit end_commit_flush
[junit4:junit4]   2> 16612 T458 oasc.SolrCore.registerSearcher [collection1] Registered new searcher Searcher@5cf8706 main{StandardDirectoryReader(segments_3:11 _0(5.0):C1 _1(5.0):C10 _2(5.0):C10 _3(5.0):C10 _4(5.0):C1)}
[junit4:junit4]   2> 16612 T454 C46 P11953 oasu.SolrCmdDistributor.distribCommit Distrib commit to:[StdNode: http://127.0.0.1:11969/solr/collection1/, StdNode: http://127.0.0.1:11959/solr/collection1/, StdNode: http://127.0.0.1:11979/solr/collection1/]
[junit4:junit4]   2> 16615 T466 C48 P11959 oasu.DirectUpdateHandler2.commit start commit{flags=0,_version_=0,optimize=false,openSearcher=true,waitSearcher=true,expungeDeletes=false,softCommit=false}
[junit4:junit4]   2> 16615 T473 C45 P11969 oasu.DirectUpdateHandler2.commit start commit{flags=0,_version_=0,optimize=false,openSearcher=true,waitSearcher=true,expungeDeletes=false,softCommit=false}
[junit4:junit4]   2> 16615 T487 C47 P11979 oasu.DirectUpdateHandler2.commit start commit{flags=0,_version_=0,optimize=false,openSearcher=true,waitSearcher=true,expungeDeletes=false,softCommit=false}
[junit4:junit4]   2> 17323 T473 C45 P11969 oasc.SolrDeletionPolicy.onCommit SolrDeletionPolicy.onCommit: commits:num=2
[junit4:junit4]   2> 		commit{dir=

[...truncated too long message...]

llection1]  CLOSING SolrCore org.apache.solr.core.SolrCore@f01ba81
[junit4:junit4]   2> 308918 T495 oasc.JmxMonitoredMap$SolrDynamicMBean.getMBeanInfo WARNING Could not getStatistics on info bean Lazy[solr.ReplicationHandler] java.lang.IllegalArgumentException: /usr/home/hudson/hudson-slave/workspace/Lucene-Solr-Tests-trunk-java7/solr/build/solr-core/test/J1/org.apache.solr.cloud.BasicDistributedZk2Test-1347719940162/jetty4/index does not exist
[junit4:junit4]   2> 	at org.apache.commons.io.FileUtils.sizeOfDirectory(FileUtils.java:2074)
[junit4:junit4]   2> 	at org.apache.solr.handler.ReplicationHandler.getIndexSize(ReplicationHandler.java:477)
[junit4:junit4]   2> 	at org.apache.solr.handler.ReplicationHandler.getStatistics(ReplicationHandler.java:525)
[junit4:junit4]   2> 	at org.apache.solr.core.RequestHandlers$LazyRequestHandlerWrapper.getStatistics(RequestHandlers.java:310)
[junit4:junit4]   2> 	at org.apache.solr.core.JmxMonitoredMap$SolrDynamicMBean.getMBeanInfo(JmxMonitoredMap.java:231)
[junit4:junit4]   2> 	at com.sun.jmx.interceptor.DefaultMBeanServerInterceptor.getClassName(DefaultMBeanServerInterceptor.java:1804)
[junit4:junit4]   2> 	at com.sun.jmx.interceptor.DefaultMBeanServerInterceptor.safeGetClassName(DefaultMBeanServerInterceptor.java:1595)
[junit4:junit4]   2> 	at com.sun.jmx.interceptor.DefaultMBeanServerInterceptor.checkMBeanPermission(DefaultMBeanServerInterceptor.java:1813)
[junit4:junit4]   2> 	at com.sun.jmx.interceptor.DefaultMBeanServerInterceptor.getAttribute(DefaultMBeanServerInterceptor.java:644)
[junit4:junit4]   2> 	at com.sun.jmx.mbeanserver.JmxMBeanServer.getAttribute(JmxMBeanServer.java:668)
[junit4:junit4]   2> 	at org.apache.solr.core.JmxMonitoredMap.unregister(JmxMonitoredMap.java:174)
[junit4:junit4]   2> 	at org.apache.solr.core.JmxMonitoredMap.clear(JmxMonitoredMap.java:116)
[junit4:junit4]   2> 	at org.apache.solr.core.SolrCore.close(SolrCore.java:864)
[junit4:junit4]   2> 	at org.apache.solr.cloud.ShardLeaderElectionContext.runLeaderProcess(ElectionContext.java:213)
[junit4:junit4]   2> 	at org.apache.solr.cloud.LeaderElector.runIamLeaderProcess(LeaderElector.java:158)
[junit4:junit4]   2> 	at org.apache.solr.cloud.LeaderElector.checkIfIamLeader(LeaderElector.java:102)
[junit4:junit4]   2> 	at org.apache.solr.cloud.LeaderElector.access$000(LeaderElector.java:56)
[junit4:junit4]   2> 	at org.apache.solr.cloud.LeaderElector$1.process(LeaderElector.java:131)
[junit4:junit4]   2> 	at org.apache.zookeeper.ClientCnxn$EventThread.processEvent(ClientCnxn.java:526)
[junit4:junit4]   2> 	at org.apache.zookeeper.ClientCnxn$EventThread.run(ClientCnxn.java:502)
[junit4:junit4]   2> 
[junit4:junit4]   2> 308919 T495 oasc.JmxMonitoredMap$SolrDynamicMBean.getMBeanInfo WARNING Could not getStatistics on info bean Lazy[solr.ReplicationHandler] java.lang.IllegalArgumentException: /usr/home/hudson/hudson-slave/workspace/Lucene-Solr-Tests-trunk-java7/solr/build/solr-core/test/J1/org.apache.solr.cloud.BasicDistributedZk2Test-1347719940162/jetty4/index does not exist
[junit4:junit4]   2> 	at org.apache.commons.io.FileUtils.sizeOfDirectory(FileUtils.java:2074)
[junit4:junit4]   2> 	at org.apache.solr.handler.ReplicationHandler.getIndexSize(ReplicationHandler.java:477)
[junit4:junit4]   2> 	at org.apache.solr.handler.ReplicationHandler.getStatistics(ReplicationHandler.java:525)
[junit4:junit4]   2> 	at org.apache.solr.core.RequestHandlers$LazyRequestHandlerWrapper.getStatistics(RequestHandlers.java:310)
[junit4:junit4]   2> 	at org.apache.solr.core.JmxMonitoredMap$SolrDynamicMBean.getMBeanInfo(JmxMonitoredMap.java:231)
[junit4:junit4]   2> 	at com.sun.jmx.interceptor.DefaultMBeanServerInterceptor.getClassName(DefaultMBeanServerInterceptor.java:1804)
[junit4:junit4]   2> 	at com.sun.jmx.interceptor.DefaultMBeanServerInterceptor.safeGetClassName(DefaultMBeanServerInterceptor.java:1595)
[junit4:junit4]   2> 	at com.sun.jmx.interceptor.DefaultMBeanServerInterceptor.checkMBeanPermission(DefaultMBeanServerInterceptor.java:1813)
[junit4:junit4]   2> 	at com.sun.jmx.interceptor.DefaultMBeanServerInterceptor.exclusiveUnregisterMBean(DefaultMBeanServerInterceptor.java:430)
[junit4:junit4]   2> 	at com.sun.jmx.interceptor.DefaultMBeanServerInterceptor.unregisterMBean(DefaultMBeanServerInterceptor.java:415)
[junit4:junit4]   2> 	at com.sun.jmx.mbeanserver.JmxMBeanServer.unregisterMBean(JmxMBeanServer.java:536)
[junit4:junit4]   2> 	at org.apache.solr.core.JmxMonitoredMap.unregister(JmxMonitoredMap.java:175)
[junit4:junit4]   2> 	at org.apache.solr.core.JmxMonitoredMap.clear(JmxMonitoredMap.java:116)
[junit4:junit4]   2> 	at org.apache.solr.core.SolrCore.close(SolrCore.java:864)
[junit4:junit4]   2> 	at org.apache.solr.cloud.ShardLeaderElectionContext.runLeaderProcess(ElectionContext.java:213)
[junit4:junit4]   2> 	at org.apache.solr.cloud.LeaderElector.runIamLeaderProcess(LeaderElector.java:158)
[junit4:junit4]   2> 	at org.apache.solr.cloud.LeaderElector.checkIfIamLeader(LeaderElector.java:102)
[junit4:junit4]   2> 	at org.apache.solr.cloud.LeaderElector.access$000(LeaderElector.java:56)
[junit4:junit4]   2> 	at org.apache.solr.cloud.LeaderElector$1.process(LeaderElector.java:131)
[junit4:junit4]   2> 	at org.apache.zookeeper.ClientCnxn$EventThread.processEvent(ClientCnxn.java:526)
[junit4:junit4]   2> 	at org.apache.zookeeper.ClientCnxn$EventThread.run(ClientCnxn.java:502)
[junit4:junit4]   2> 
[junit4:junit4]   2> 308923 T495 oasc.SolrCore.closeSearcher [collection1] Closing main searcher on request.
[junit4:junit4]   2> 308925 T495 oasu.DirectUpdateHandler2.close closing DirectUpdateHandler2{commits=5,autocommits=0,soft autocommits=0,optimizes=0,rollbacks=0,expungeDeletes=0,docsPending=0,adds=0,deletesById=0,deletesByQuery=0,errors=0,cumulative_adds=35,cumulative_deletesById=0,cumulative_deletesByQuery=0,cumulative_errors=0}
[junit4:junit4]   2> 308926 T495 oasu.DefaultSolrCoreState.decref SolrCoreState ref count has reached 0 - closing IndexWriter
[junit4:junit4]   2> 308927 T495 oasu.DefaultSolrCoreState.decref Closing SolrCoreState - canceling any ongoing recovery
[junit4:junit4]   2> 308927 T495 oascc.ZkStateReader$3.process Updating live nodes
[junit4:junit4]   2> 308927 T495 oascc.ZkStateReader$3.process WARNING ZooKeeper watch triggered, but Solr cannot talk to ZK
[junit4:junit4]   2> 308928 T495 oascc.ZkStateReader$2.process A cluster state change has occurred - updating...
[junit4:junit4]   2> 308928 T495 oascc.ZkStateReader$2.process WARNING ZooKeeper watch triggered, but Solr cannot talk to ZK
[junit4:junit4]   2> 308928 T495 oascc.ConnectionManager.process Watcher org.apache.solr.common.cloud.ConnectionManager@9444a20 name:ZooKeeperConnection Watcher:127.0.0.1:11942/solr got event WatchedEvent state:Disconnected type:None path:null path:null type:None
[junit4:junit4]   2> 308928 T495 oascc.ConnectionManager.process Client->ZooKeeper status change trigger but we are already closed
[junit4:junit4]   2> 308928 T495 oaz.ClientCnxn$EventThread.run EventThread shut down
[junit4:junit4]   2> NOTE: test params are: codec=Lucene40: {n_f1=PostingsFormat(name=MockRandom), foo_b=MockVariableIntBlock(baseBlockSize=101), foo_d=PostingsFormat(name=Direct), foo_f=MockVariableIntBlock(baseBlockSize=101), n_tl1=PostingsFormat(name=MockRandom), n_d1=PostingsFormat(name=SimpleText), rnd_b=PostingsFormat(name=Direct), intDefault=PostingsFormat(name=MockRandom), n_td1=PostingsFormat(name=MockRandom), timestamp=PostingsFormat(name=SimpleText), id=PostingsFormat(name=Direct), range_facet_sl=PostingsFormat(name=Direct), range_facet_si=PostingsFormat(name=SimpleText), oddField_s=PostingsFormat(name=Direct), multiDefault=PostingsFormat(name=SimpleText), n_tf1=PostingsFormat(name=SimpleText), n_dt1=PostingsFormat(name=MockRandom), n_ti1=PostingsFormat(name=Direct), range_facet_l=PostingsFormat(name=SimpleText), text=MockVariableIntBlock(baseBlockSize=101), _version_=PostingsFormat(name=MockRandom), SubjectTerms_mfacet=PostingsFormat(name=MockRandom), a_t=PostingsFormat(name=SimpleText), n_tdt1=PostingsFormat(name=MockRandom), other_tl1=PostingsFormat(name=MockRandom), n_l1=PostingsFormat(name=SimpleText), a_si=PostingsFormat(name=MockRandom)}, sim=RandomSimilarityProvider(queryNorm=false,coord=yes): {}, locale=pl_PL, timezone=America/Dominica
[junit4:junit4]   2> NOTE: FreeBSD 9.0-RELEASE amd64/Oracle Corporation 1.7.0_06 (64-bit)/cpus=16,threads=2,free=287742328,total=533725184
[junit4:junit4]   2> NOTE: All tests run in this JVM: [SignatureUpdateProcessorFactoryTest, TestArbitraryIndexDir, TestCSVResponseWriter, PingRequestHandlerTest, TestReload, UUIDFieldTest, ScriptEngineTest, RecoveryZkTest, FileUtilsTest, LegacyHTMLStripCharFilterTest, TestPluginEnable, TestStressLucene, TestSolrDeletionPolicy1, TestBM25SimilarityFactory, BasicFunctionalityTest, TestJmxIntegration, EchoParamsTest, TestDistributedGrouping, TestSurroundQueryParser, BasicDistributedZk2Test]
[junit4:junit4] Completed on J1 in 309.43s, 1 test, 1 failure <<< FAILURES!

[...truncated 474 lines...]
BUILD FAILED
/usr/home/hudson/hudson-slave/workspace/Lucene-Solr-Tests-trunk-java7/build.xml:32: The following error occurred while executing this line:
/usr/home/hudson/hudson-slave/workspace/Lucene-Solr-Tests-trunk-java7/solr/build.xml:146: The following error occurred while executing this line:
/usr/home/hudson/hudson-slave/workspace/Lucene-Solr-Tests-trunk-java7/lucene/module-build.xml:63: The following error occurred while executing this line:
/usr/home/hudson/hudson-slave/workspace/Lucene-Solr-Tests-trunk-java7/lucene/common-build.xml:1133: The following error occurred while executing this line:
/usr/home/hudson/hudson-slave/workspace/Lucene-Solr-Tests-trunk-java7/lucene/common-build.xml:810: There were test failures: 228 suites, 923 tests, 1 failure, 6 ignored (1 assumption)

Total time: 33 minutes 42 seconds
Build step 'Invoke Ant' marked build as failure
Recording test results
Email was triggered for: Failure
Sending email for trigger: Failure



Mime
View raw message