lucene-dev mailing list archives

Site index · List index
Message view « Date » · « Thread »
Top « Date » · « Thread »
From Apache Jenkins Server <jenk...@builds.apache.org>
Subject [JENKINS] Lucene-Solr-Tests-4.x-Java6 - Build # 676 - Still Failing
Date Thu, 20 Sep 2012 00:06:31 GMT
Build: https://builds.apache.org/job/Lucene-Solr-Tests-4.x-Java6/676/

1 tests failed.
REGRESSION:  org.apache.solr.cloud.BasicDistributedZk2Test.testDistribSearch

Error Message:
Shard still reported as live in zk

Stack Trace:
java.lang.AssertionError: Shard still reported as live in zk
	at __randomizedtesting.SeedInfo.seed([5E354DF5C0B0B326:DFD3C3EDB7EFD31A]:0)
	at org.junit.Assert.fail(Assert.java:93)
	at org.apache.solr.cloud.AbstractFullDistribZkTestBase.waitToSeeNotLive(AbstractFullDistribZkTestBase.java:1220)
	at org.apache.solr.cloud.BasicDistributedZk2Test.brindDownShardIndexSomeDocsAndRecover(BasicDistributedZk2Test.java:190)
	at org.apache.solr.cloud.BasicDistributedZk2Test.doTest(BasicDistributedZk2Test.java:83)
	at org.apache.solr.BaseDistributedSearchTestCase.testDistribSearch(BaseDistributedSearchTestCase.java:695)
	at sun.reflect.NativeMethodAccessorImpl.invoke0(Native Method)
	at sun.reflect.NativeMethodAccessorImpl.invoke(NativeMethodAccessorImpl.java:57)
	at sun.reflect.DelegatingMethodAccessorImpl.invoke(DelegatingMethodAccessorImpl.java:43)
	at java.lang.reflect.Method.invoke(Method.java:616)
	at com.carrotsearch.randomizedtesting.RandomizedRunner.invoke(RandomizedRunner.java:1559)
	at com.carrotsearch.randomizedtesting.RandomizedRunner.access$600(RandomizedRunner.java:79)
	at com.carrotsearch.randomizedtesting.RandomizedRunner$6.evaluate(RandomizedRunner.java:737)
	at com.carrotsearch.randomizedtesting.RandomizedRunner$7.evaluate(RandomizedRunner.java:773)
	at com.carrotsearch.randomizedtesting.RandomizedRunner$8.evaluate(RandomizedRunner.java:787)
	at com.carrotsearch.randomizedtesting.rules.SystemPropertiesRestoreRule$1.evaluate(SystemPropertiesRestoreRule.java:53)
	at org.apache.lucene.util.TestRuleSetupTeardownChained$1.evaluate(TestRuleSetupTeardownChained.java:50)
	at org.apache.lucene.util.TestRuleFieldCacheSanity$1.evaluate(TestRuleFieldCacheSanity.java:51)
	at org.apache.lucene.util.AbstractBeforeAfterRule$1.evaluate(AbstractBeforeAfterRule.java:45)
	at com.carrotsearch.randomizedtesting.rules.SystemPropertiesInvariantRule$1.evaluate(SystemPropertiesInvariantRule.java:55)
	at org.apache.lucene.util.TestRuleThreadAndTestName$1.evaluate(TestRuleThreadAndTestName.java:48)
	at org.apache.lucene.util.TestRuleIgnoreAfterMaxFailures$1.evaluate(TestRuleIgnoreAfterMaxFailures.java:70)
	at org.apache.lucene.util.TestRuleMarkFailure$1.evaluate(TestRuleMarkFailure.java:48)
	at com.carrotsearch.randomizedtesting.rules.StatementAdapter.evaluate(StatementAdapter.java:36)
	at com.carrotsearch.randomizedtesting.ThreadLeakControl$StatementRunner.run(ThreadLeakControl.java:358)
	at com.carrotsearch.randomizedtesting.ThreadLeakControl.forkTimeoutingTask(ThreadLeakControl.java:782)
	at com.carrotsearch.randomizedtesting.ThreadLeakControl$3.evaluate(ThreadLeakControl.java:442)
	at com.carrotsearch.randomizedtesting.RandomizedRunner.runSingleTest(RandomizedRunner.java:746)
	at com.carrotsearch.randomizedtesting.RandomizedRunner$3.evaluate(RandomizedRunner.java:648)
	at com.carrotsearch.randomizedtesting.RandomizedRunner$4.evaluate(RandomizedRunner.java:682)
	at com.carrotsearch.randomizedtesting.RandomizedRunner$5.evaluate(RandomizedRunner.java:693)
	at com.carrotsearch.randomizedtesting.rules.StatementAdapter.evaluate(StatementAdapter.java:36)
	at com.carrotsearch.randomizedtesting.rules.SystemPropertiesRestoreRule$1.evaluate(SystemPropertiesRestoreRule.java:53)
	at org.apache.lucene.util.AbstractBeforeAfterRule$1.evaluate(AbstractBeforeAfterRule.java:45)
	at org.apache.lucene.util.TestRuleStoreClassName$1.evaluate(TestRuleStoreClassName.java:42)
	at com.carrotsearch.randomizedtesting.rules.SystemPropertiesInvariantRule$1.evaluate(SystemPropertiesInvariantRule.java:55)
	at com.carrotsearch.randomizedtesting.rules.NoShadowingOrOverridesOnMethodsRule$1.evaluate(NoShadowingOrOverridesOnMethodsRule.java:39)
	at com.carrotsearch.randomizedtesting.rules.NoShadowingOrOverridesOnMethodsRule$1.evaluate(NoShadowingOrOverridesOnMethodsRule.java:39)
	at com.carrotsearch.randomizedtesting.rules.StatementAdapter.evaluate(StatementAdapter.java:36)
	at org.apache.lucene.util.TestRuleAssertionsRequired$1.evaluate(TestRuleAssertionsRequired.java:43)
	at org.apache.lucene.util.TestRuleMarkFailure$1.evaluate(TestRuleMarkFailure.java:48)
	at org.apache.lucene.util.TestRuleIgnoreAfterMaxFailures$1.evaluate(TestRuleIgnoreAfterMaxFailures.java:70)
	at org.apache.lucene.util.TestRuleIgnoreTestSuites$1.evaluate(TestRuleIgnoreTestSuites.java:55)
	at com.carrotsearch.randomizedtesting.rules.StatementAdapter.evaluate(StatementAdapter.java:36)
	at com.carrotsearch.randomizedtesting.ThreadLeakControl$StatementRunner.run(ThreadLeakControl.java:358)
	at java.lang.Thread.run(Thread.java:679)




Build Log:
[...truncated 7618 lines...]
[junit4:junit4] Suite: org.apache.solr.cloud.BasicDistributedZk2Test
[junit4:junit4]   2> 3 T1772 oas.SolrTestCaseJ4.setUp ###Starting testDistribSearch
[junit4:junit4]   2> Creating dataDir: /usr/home/hudson/hudson-slave/workspace/Lucene-Solr-Tests-4.x-Java6/solr/build/solr-core/test/J1/./solrtest-BasicDistributedZk2Test-1348099276813
[junit4:junit4]   2> 4 T1772 oasc.ZkTestServer.run STARTING ZK TEST SERVER
[junit4:junit4]   2> 6 T1773 oazs.ZooKeeperServer.setTickTime tickTime set to 1000
[junit4:junit4]   2> 6 T1773 oazs.NIOServerCnxn$Factory.<init> binding to port 0.0.0.0/0.0.0.0:0
[junit4:junit4]   2> 7 T1773 oazsp.FileTxnSnapLog.save Snapshotting: 0
[junit4:junit4]   2> 105 T1772 oasc.ZkTestServer.run start zk server on port:28218
[junit4:junit4]   2> 105 T1772 oaz.ZooKeeper.<init> Initiating client connection, connectString=127.0.0.1:28218 sessionTimeout=10000 watcher=org.apache.solr.common.cloud.ConnectionManager@6e796c2e
[junit4:junit4]   2> 106 T1778 oaz.ClientCnxn$SendThread.startConnect Opening socket connection to server /127.0.0.1:28218
[junit4:junit4]   2> 106 T1772 oascc.ConnectionManager.waitForConnected Waiting for client to connect to ZooKeeper
[junit4:junit4]   2> 107 T1778 oaz.ClientCnxn$SendThread.primeConnection Socket connection established to localhost/127.0.0.1:28218, initiating session
[junit4:junit4]   2> 107 T1774 oazs.NIOServerCnxn$Factory.run Accepted socket connection from /140.211.11.196:28219
[junit4:junit4]   2> 108 T1774 oazs.NIOServerCnxn.readConnectRequest Client attempting to establish new session at /140.211.11.196:28219
[junit4:junit4]   2> 108 T1776 oazsp.FileTxnLog.append Creating new log file: log.1
[junit4:junit4]   2> 125 T1776 oazs.NIOServerCnxn.finishSessionInit Established session 0x139e0fa80120000 with negotiated timeout 10000 for client /140.211.11.196:28219
[junit4:junit4]   2> 125 T1778 oaz.ClientCnxn$SendThread.readConnectResult Session establishment complete on server localhost/127.0.0.1:28218, sessionid = 0x139e0fa80120000, negotiated timeout = 10000
[junit4:junit4]   2> 126 T1779 oascc.ConnectionManager.process Watcher org.apache.solr.common.cloud.ConnectionManager@6e796c2e name:ZooKeeperConnection Watcher:127.0.0.1:28218 got event WatchedEvent state:SyncConnected type:None path:null path:null type:None
[junit4:junit4]   2> 126 T1772 oascc.ConnectionManager.waitForConnected Client is connected to ZooKeeper
[junit4:junit4]   2> 126 T1772 oascc.SolrZkClient.makePath makePath: /solr
[junit4:junit4]   2> 129 T1777 oazs.PrepRequestProcessor.pRequest Processed session termination for sessionid: 0x139e0fa80120000
[junit4:junit4]   2> 131 T1779 oaz.ClientCnxn$EventThread.run EventThread shut down
[junit4:junit4]   2> 131 T1772 oaz.ZooKeeper.close Session: 0x139e0fa80120000 closed
[junit4:junit4]   2> 131 T1774 oazs.NIOServerCnxn.closeSock Closed socket connection for client /140.211.11.196:28219 which had sessionid 0x139e0fa80120000
[junit4:junit4]   2> 131 T1772 oaz.ZooKeeper.<init> Initiating client connection, connectString=127.0.0.1:28218/solr sessionTimeout=10000 watcher=org.apache.solr.common.cloud.ConnectionManager@589701d8
[junit4:junit4]   2> 132 T1780 oaz.ClientCnxn$SendThread.startConnect Opening socket connection to server /127.0.0.1:28218
[junit4:junit4]   2> 132 T1772 oascc.ConnectionManager.waitForConnected Waiting for client to connect to ZooKeeper
[junit4:junit4]   2> 132 T1780 oaz.ClientCnxn$SendThread.primeConnection Socket connection established to localhost/127.0.0.1:28218, initiating session
[junit4:junit4]   2> 132 T1774 oazs.NIOServerCnxn$Factory.run Accepted socket connection from /140.211.11.196:28220
[junit4:junit4]   2> 133 T1774 oazs.NIOServerCnxn.readConnectRequest Client attempting to establish new session at /140.211.11.196:28220
[junit4:junit4]   2> 134 T1776 oazs.NIOServerCnxn.finishSessionInit Established session 0x139e0fa80120001 with negotiated timeout 10000 for client /140.211.11.196:28220
[junit4:junit4]   2> 134 T1780 oaz.ClientCnxn$SendThread.readConnectResult Session establishment complete on server localhost/127.0.0.1:28218, sessionid = 0x139e0fa80120001, negotiated timeout = 10000
[junit4:junit4]   2> 134 T1781 oascc.ConnectionManager.process Watcher org.apache.solr.common.cloud.ConnectionManager@589701d8 name:ZooKeeperConnection Watcher:127.0.0.1:28218/solr got event WatchedEvent state:SyncConnected type:None path:null path:null type:None
[junit4:junit4]   2> 135 T1772 oascc.ConnectionManager.waitForConnected Client is connected to ZooKeeper
[junit4:junit4]   2> 135 T1772 oascc.SolrZkClient.makePath makePath: /collections/collection1
[junit4:junit4]   2> 186 T1772 oascc.SolrZkClient.makePath makePath: /collections/collection1/shards
[junit4:junit4]   2> 189 T1772 oascc.SolrZkClient.makePath makePath: /collections/control_collection
[junit4:junit4]   2> 192 T1772 oascc.SolrZkClient.makePath makePath: /collections/control_collection/shards
[junit4:junit4]   2> 194 T1772 oasc.AbstractZkTestCase.putConfig put /usr/home/hudson/hudson-slave/workspace/Lucene-Solr-Tests-4.x-Java6/solr/build/solr-core/test-files/solr/collection1/conf/solrconfig.xml to /configs/conf1/solrconfig.xml
[junit4:junit4]   2> 195 T1772 oascc.SolrZkClient.makePath makePath: /configs/conf1/solrconfig.xml
[junit4:junit4]   2> 264 T1772 oasc.AbstractZkTestCase.putConfig put /usr/home/hudson/hudson-slave/workspace/Lucene-Solr-Tests-4.x-Java6/solr/build/solr-core/test-files/solr/collection1/conf/schema.xml to /configs/conf1/schema.xml
[junit4:junit4]   2> 265 T1772 oascc.SolrZkClient.makePath makePath: /configs/conf1/schema.xml
[junit4:junit4]   2> 371 T1772 oasc.AbstractZkTestCase.putConfig put /usr/home/hudson/hudson-slave/workspace/Lucene-Solr-Tests-4.x-Java6/solr/build/solr-core/test-files/solr/collection1/conf/solrconfig.xml to /configs/conf1/solrconfig.xml
[junit4:junit4]   2> 373 T1772 oascc.SolrZkClient.makePath makePath: /configs/conf1/solrconfig.xml
[junit4:junit4]   2> 376 T1772 oasc.AbstractZkTestCase.putConfig put /usr/home/hudson/hudson-slave/workspace/Lucene-Solr-Tests-4.x-Java6/solr/build/solr-core/test-files/solr/collection1/conf/stopwords.txt to /configs/conf1/stopwords.txt
[junit4:junit4]   2> 377 T1772 oascc.SolrZkClient.makePath makePath: /configs/conf1/stopwords.txt
[junit4:junit4]   2> 380 T1772 oasc.AbstractZkTestCase.putConfig put /usr/home/hudson/hudson-slave/workspace/Lucene-Solr-Tests-4.x-Java6/solr/build/solr-core/test-files/solr/collection1/conf/protwords.txt to /configs/conf1/protwords.txt
[junit4:junit4]   2> 380 T1772 oascc.SolrZkClient.makePath makePath: /configs/conf1/protwords.txt
[junit4:junit4]   2> 388 T1772 oasc.AbstractZkTestCase.putConfig put /usr/home/hudson/hudson-slave/workspace/Lucene-Solr-Tests-4.x-Java6/solr/build/solr-core/test-files/solr/collection1/conf/currency.xml to /configs/conf1/currency.xml
[junit4:junit4]   2> 390 T1772 oascc.SolrZkClient.makePath makePath: /configs/conf1/currency.xml
[junit4:junit4]   2> 393 T1772 oasc.AbstractZkTestCase.putConfig put /usr/home/hudson/hudson-slave/workspace/Lucene-Solr-Tests-4.x-Java6/solr/build/solr-core/test-files/solr/collection1/conf/open-exchange-rates.json to /configs/conf1/open-exchange-rates.json
[junit4:junit4]   2> 395 T1772 oascc.SolrZkClient.makePath makePath: /configs/conf1/open-exchange-rates.json
[junit4:junit4]   2> 399 T1772 oasc.AbstractZkTestCase.putConfig put /usr/home/hudson/hudson-slave/workspace/Lucene-Solr-Tests-4.x-Java6/solr/build/solr-core/test-files/solr/collection1/conf/mapping-ISOLatin1Accent.txt to /configs/conf1/mapping-ISOLatin1Accent.txt
[junit4:junit4]   2> 400 T1772 oascc.SolrZkClient.makePath makePath: /configs/conf1/mapping-ISOLatin1Accent.txt
[junit4:junit4]   2> 404 T1772 oasc.AbstractZkTestCase.putConfig put /usr/home/hudson/hudson-slave/workspace/Lucene-Solr-Tests-4.x-Java6/solr/build/solr-core/test-files/solr/collection1/conf/old_synonyms.txt to /configs/conf1/old_synonyms.txt
[junit4:junit4]   2> 404 T1772 oascc.SolrZkClient.makePath makePath: /configs/conf1/old_synonyms.txt
[junit4:junit4]   2> 408 T1772 oasc.AbstractZkTestCase.putConfig put /usr/home/hudson/hudson-slave/workspace/Lucene-Solr-Tests-4.x-Java6/solr/build/solr-core/test-files/solr/collection1/conf/synonyms.txt to /configs/conf1/synonyms.txt
[junit4:junit4]   2> 408 T1772 oascc.SolrZkClient.makePath makePath: /configs/conf1/synonyms.txt
[junit4:junit4]   2> 412 T1777 oazs.PrepRequestProcessor.pRequest Processed session termination for sessionid: 0x139e0fa80120001
[junit4:junit4]   2> 413 T1781 oaz.ClientCnxn$EventThread.run EventThread shut down
[junit4:junit4]   2> 413 T1774 oazs.NIOServerCnxn.closeSock Closed socket connection for client /140.211.11.196:28220 which had sessionid 0x139e0fa80120001
[junit4:junit4]   2> 413 T1772 oaz.ZooKeeper.close Session: 0x139e0fa80120001 closed
[junit4:junit4]   2> 415 T1772 oejs.Server.doStart jetty-8.1.2.v20120308
[junit4:junit4]   2> 419 T1772 oejs.AbstractConnector.doStart Started SocketConnector@0.0.0.0:28221
[junit4:junit4]   2> 420 T1772 oasc.SolrResourceLoader.locateSolrHome JNDI not configured for solr (NoInitialContextEx)
[junit4:junit4]   2> 420 T1772 oasc.SolrResourceLoader.locateSolrHome using system property solr.solr.home: /usr/home/hudson/hudson-slave/workspace/Lucene-Solr-Tests-4.x-Java6/solr/build/solr-core/test-files/solr
[junit4:junit4]   2> 421 T1772 oasc.SolrResourceLoader.<init> new SolrResourceLoader for deduced Solr Home: '/usr/home/hudson/hudson-slave/workspace/Lucene-Solr-Tests-4.x-Java6/solr/build/solr-core/test-files/solr/'
[junit4:junit4]   2> 451 T1772 oass.SolrDispatchFilter.init SolrDispatchFilter.init()
[junit4:junit4]   2> 452 T1772 oasc.SolrResourceLoader.locateSolrHome JNDI not configured for solr (NoInitialContextEx)
[junit4:junit4]   2> 452 T1772 oasc.SolrResourceLoader.locateSolrHome using system property solr.solr.home: /usr/home/hudson/hudson-slave/workspace/Lucene-Solr-Tests-4.x-Java6/solr/build/solr-core/test-files/solr
[junit4:junit4]   2> 453 T1772 oasc.CoreContainer$Initializer.initialize looking for solr.xml: /usr/home/hudson/hudson-slave/workspace/Lucene-Solr-Tests-4.x-Java6/solr/build/solr-core/test-files/solr/solr.xml
[junit4:junit4]   2> 453 T1772 oasc.CoreContainer.<init> New CoreContainer 349546060
[junit4:junit4]   2> 454 T1772 oasc.CoreContainer.load Loading CoreContainer using Solr Home: '/usr/home/hudson/hudson-slave/workspace/Lucene-Solr-Tests-4.x-Java6/solr/build/solr-core/test-files/solr/'
[junit4:junit4]   2> 454 T1772 oasc.SolrResourceLoader.<init> new SolrResourceLoader for directory: '/usr/home/hudson/hudson-slave/workspace/Lucene-Solr-Tests-4.x-Java6/solr/build/solr-core/test-files/solr/'
[junit4:junit4]   2> 479 T1772 oasc.CoreContainer.load Registering Log Listener
[junit4:junit4]   2> 496 T1772 oasc.CoreContainer.initZooKeeper Zookeeper client=127.0.0.1:28218/solr
[junit4:junit4]   2> 497 T1772 oaz.ZooKeeper.<init> Initiating client connection, connectString=127.0.0.1:28218/solr sessionTimeout=5000 watcher=org.apache.solr.common.cloud.ConnectionManager@4b14591f
[junit4:junit4]   2> 498 T1791 oaz.ClientCnxn$SendThread.startConnect Opening socket connection to server /127.0.0.1:28218
[junit4:junit4]   2> 498 T1772 oascc.ConnectionManager.waitForConnected Waiting for client to connect to ZooKeeper
[junit4:junit4]   2> 498 T1791 oaz.ClientCnxn$SendThread.primeConnection Socket connection established to localhost/127.0.0.1:28218, initiating session
[junit4:junit4]   2> 499 T1774 oazs.NIOServerCnxn$Factory.run Accepted socket connection from /140.211.11.196:28223
[junit4:junit4]   2> 499 T1774 oazs.NIOServerCnxn.readConnectRequest Client attempting to establish new session at /140.211.11.196:28223
[junit4:junit4]   2> 505 T1776 oazs.NIOServerCnxn.finishSessionInit Established session 0x139e0fa80120002 with negotiated timeout 5000 for client /140.211.11.196:28223
[junit4:junit4]   2> 505 T1791 oaz.ClientCnxn$SendThread.readConnectResult Session establishment complete on server localhost/127.0.0.1:28218, sessionid = 0x139e0fa80120002, negotiated timeout = 5000
[junit4:junit4]   2> 505 T1792 oascc.ConnectionManager.process Watcher org.apache.solr.common.cloud.ConnectionManager@4b14591f name:ZooKeeperConnection Watcher:127.0.0.1:28218/solr got event WatchedEvent state:SyncConnected type:None path:null path:null type:None
[junit4:junit4]   2> 505 T1772 oascc.ConnectionManager.waitForConnected Client is connected to ZooKeeper
[junit4:junit4]   2> 507 T1777 oazs.PrepRequestProcessor.pRequest Got user-level KeeperException when processing sessionid:0x139e0fa80120002 type:create cxid:0x2 zxid:0xfffffffffffffffe txntype:unknown reqpath:n/a Error Path:/solr/overseer Error:KeeperErrorCode = NodeExists for /solr/overseer
[junit4:junit4]   2> 517 T1772 oascc.SolrZkClient.makePath makePath: /live_nodes
[junit4:junit4]   2> 519 T1772 oasc.ZkController.createEphemeralLiveNode Register node as live in ZooKeeper:/live_nodes/127.0.0.1:28221_solr
[junit4:junit4]   2> 519 T1777 oazs.PrepRequestProcessor.pRequest Got user-level KeeperException when processing sessionid:0x139e0fa80120002 type:delete cxid:0x7 zxid:0xfffffffffffffffe txntype:unknown reqpath:n/a Error Path:/solr/live_nodes/127.0.0.1:28221_solr Error:KeeperErrorCode = NoNode for /solr/live_nodes/127.0.0.1:28221_solr
[junit4:junit4]   2> 520 T1772 oascc.SolrZkClient.makePath makePath: /live_nodes/127.0.0.1:28221_solr
[junit4:junit4]   2> 530 T1772 oashc.HttpShardHandlerFactory.getParameter Setting socketTimeout to: 0
[junit4:junit4]   2> 530 T1772 oashc.HttpShardHandlerFactory.getParameter Setting urlScheme to: http://
[junit4:junit4]   2> 531 T1772 oashc.HttpShardHandlerFactory.getParameter Setting connTimeout to: 0
[junit4:junit4]   2> 531 T1772 oashc.HttpShardHandlerFactory.getParameter Setting maxConnectionsPerHost to: 20
[junit4:junit4]   2> 532 T1772 oashc.HttpShardHandlerFactory.getParameter Setting corePoolSize to: 0
[junit4:junit4]   2> 532 T1772 oashc.HttpShardHandlerFactory.getParameter Setting maximumPoolSize to: 2147483647
[junit4:junit4]   2> 533 T1772 oashc.HttpShardHandlerFactory.getParameter Setting maxThreadIdleTime to: 5
[junit4:junit4]   2> 533 T1772 oashc.HttpShardHandlerFactory.getParameter Setting sizeOfQueue to: -1
[junit4:junit4]   2> 534 T1772 oashc.HttpShardHandlerFactory.getParameter Setting fairnessPolicy to: false
[junit4:junit4]   2> 534 T1772 oascsi.HttpClientUtil.createClient Creating new http client, config:maxConnectionsPerHost=20&maxConnections=10000&socketTimeout=0&connTimeout=0&retry=false
[junit4:junit4]   2> 553 T1772 oascc.SolrZkClient.makePath makePath: /overseer_elect/election
[junit4:junit4]   2> 570 T1777 oazs.PrepRequestProcessor.pRequest Got user-level KeeperException when processing sessionid:0x139e0fa80120002 type:delete cxid:0x15 zxid:0xfffffffffffffffe txntype:unknown reqpath:n/a Error Path:/solr/overseer_elect/leader Error:KeeperErrorCode = NoNode for /solr/overseer_elect/leader
[junit4:junit4]   2> 571 T1772 oascc.SolrZkClient.makePath makePath: /overseer_elect/leader
[junit4:junit4]   2> 574 T1772 oasc.Overseer.start Overseer (id=88349034205544450-127.0.0.1:28221_solr-n_0000000000) starting
[junit4:junit4]   2> 575 T1777 oazs.PrepRequestProcessor.pRequest Got user-level KeeperException when processing sessionid:0x139e0fa80120002 type:create cxid:0x1a zxid:0xfffffffffffffffe txntype:unknown reqpath:n/a Error Path:/solr/overseer Error:KeeperErrorCode = NodeExists for /solr/overseer
[junit4:junit4]   2> 576 T1777 oazs.PrepRequestProcessor.pRequest Got user-level KeeperException when processing sessionid:0x139e0fa80120002 type:create cxid:0x1b zxid:0xfffffffffffffffe txntype:unknown reqpath:n/a Error Path:/solr/overseer Error:KeeperErrorCode = NodeExists for /solr/overseer
[junit4:junit4]   2> 577 T1777 oazs.PrepRequestProcessor.pRequest Got user-level KeeperException when processing sessionid:0x139e0fa80120002 type:create cxid:0x1c zxid:0xfffffffffffffffe txntype:unknown reqpath:n/a Error Path:/solr/overseer Error:KeeperErrorCode = NodeExists for /solr/overseer
[junit4:junit4]   2> 578 T1777 oazs.PrepRequestProcessor.pRequest Got user-level KeeperException when processing sessionid:0x139e0fa80120002 type:create cxid:0x1d zxid:0xfffffffffffffffe txntype:unknown reqpath:n/a Error Path:/solr/overseer Error:KeeperErrorCode = NodeExists for /solr/overseer
[junit4:junit4]   2> 580 T1794 oasc.OverseerCollectionProcessor.run Process current queue of collection creations
[junit4:junit4]   2> 580 T1772 oascc.SolrZkClient.makePath makePath: /clusterstate.json
[junit4:junit4]   2> 591 T1772 oascc.ZkStateReader.createClusterStateWatchersAndUpdate Updating cluster state from ZooKeeper... 
[junit4:junit4]   2> 593 T1793 oasc.Overseer$ClusterStateUpdater.run Starting to work on the main queue
[junit4:junit4]   2> 601 T1772 oasc.CoreContainer.create Creating SolrCore 'collection1' using instanceDir: /usr/home/hudson/hudson-slave/workspace/Lucene-Solr-Tests-4.x-Java6/solr/build/solr-core/test-files/solr/collection1
[junit4:junit4]   2> 602 T1772 oasc.ZkController.createCollectionZkNode Check for collection zkNode:control_collection
[junit4:junit4]   2> 602 T1772 oasc.ZkController.createCollectionZkNode Collection zkNode exists
[junit4:junit4]   2> 603 T1772 oasc.ZkController.readConfigName Load collection config from:/collections/control_collection
[junit4:junit4]   2> 604 T1772 oasc.SolrResourceLoader.<init> new SolrResourceLoader for directory: '/usr/home/hudson/hudson-slave/workspace/Lucene-Solr-Tests-4.x-Java6/solr/build/solr-core/test-files/solr/collection1/'
[junit4:junit4]   2> 606 T1772 oasc.SolrResourceLoader.replaceClassLoader Adding 'file:/usr/home/hudson/hudson-slave/workspace/Lucene-Solr-Tests-4.x-Java6/solr/build/solr-core/test-files/solr/collection1/lib/classes/' to classloader
[junit4:junit4]   2> 606 T1772 oasc.SolrResourceLoader.replaceClassLoader Adding 'file:/usr/home/hudson/hudson-slave/workspace/Lucene-Solr-Tests-4.x-Java6/solr/build/solr-core/test-files/solr/collection1/lib/README' to classloader
[junit4:junit4]   2> 665 T1772 oasc.SolrConfig.<init> Using Lucene MatchVersion: LUCENE_40
[junit4:junit4]   2> 744 T1772 oasc.SolrConfig.<init> Loaded SolrConfig: solrconfig.xml
[junit4:junit4]   2> 845 T1772 oass.IndexSchema.readSchema Reading Solr Schema
[junit4:junit4]   2> 853 T1772 oass.IndexSchema.readSchema Schema name=test
[junit4:junit4]   2> 1535 T1772 oass.OpenExchangeRatesOrgProvider.init Initialized with rates=open-exchange-rates.json, refreshInterval=1440.
[junit4:junit4]   2> 1549 T1772 oass.IndexSchema.readSchema default search field in schema is text
[junit4:junit4]   2> 1554 T1772 oass.IndexSchema.readSchema unique key field: id
[junit4:junit4]   2> 1570 T1772 oass.FileExchangeRateProvider.reload Reloading exchange rates from file currency.xml
[junit4:junit4]   2> 1576 T1772 oass.FileExchangeRateProvider.reload Reloading exchange rates from file currency.xml
[junit4:junit4]   2> 1581 T1772 oass.OpenExchangeRatesOrgProvider.reload Reloading exchange rates from open-exchange-rates.json
[junit4:junit4]   2> 1583 T1772 oass.OpenExchangeRatesOrgProvider.reload Reloading exchange rates from open-exchange-rates.json
[junit4:junit4]   2> 1585 T1772 oasc.SolrCore.<init> [collection1] Opening new SolrCore at /usr/home/hudson/hudson-slave/workspace/Lucene-Solr-Tests-4.x-Java6/solr/build/solr-core/test-files/solr/collection1/, dataDir=./org.apache.solr.cloud.BasicDistributedZk2Test-1348099276813/control/data/
[junit4:junit4]   2> 1585 T1772 oasc.JmxMonitoredMap.<init> JMX monitoring is enabled. Adding Solr mbeans to JMX Server: com.sun.jmx.mbeanserver.JmxMBeanServer@4f682a53
[junit4:junit4]   2> 1587 T1772 oasc.SolrCore.getNewIndexDir WARNING New index directory detected: old=null new=./org.apache.solr.cloud.BasicDistributedZk2Test-1348099276813/control/data/index/
[junit4:junit4]   2> 1588 T1772 oasc.SolrCore.initIndex WARNING [collection1] Solr index directory './org.apache.solr.cloud.BasicDistributedZk2Test-1348099276813/control/data/index' doesn't exist. Creating new index...
[junit4:junit4]   2> 1589 T1772 oasc.CachingDirectoryFactory.get return new directory for /usr/home/hudson/hudson-slave/workspace/Lucene-Solr-Tests-4.x-Java6/solr/build/solr-core/test/J1/./org.apache.solr.cloud.BasicDistributedZk2Test-1348099276813/control/data/index forceNew:false
[junit4:junit4]   2> 1596 T1772 oasc.SolrDeletionPolicy.onCommit SolrDeletionPolicy.onCommit: commits:num=1
[junit4:junit4]   2> 		commit{dir=/usr/home/hudson/hudson-slave/workspace/Lucene-Solr-Tests-4.x-Java6/solr/build/solr-core/test/J1/org.apache.solr.cloud.BasicDistributedZk2Test-1348099276813/control/data/index,segFN=segments_1,generation=1,filenames=[segments_1]
[junit4:junit4]   2> 1597 T1772 oasc.SolrDeletionPolicy.updateCommits newest commit = 1
[junit4:junit4]   2> 1598 T1772 oasc.SolrCore.initWriters created xml: solr.XMLResponseWriter
[junit4:junit4]   2> 1600 T1772 oasup.UpdateRequestProcessorChain.init inserting DistributedUpdateProcessorFactory into updateRequestProcessorChain "dedupe"
[junit4:junit4]   2> 1600 T1772 oasup.UpdateRequestProcessorChain.init inserting DistributedUpdateProcessorFactory into updateRequestProcessorChain "dedupe-allfields"
[junit4:junit4]   2> 1601 T1772 oasup.UpdateRequestProcessorChain.init inserting DistributedUpdateProcessorFactory into updateRequestProcessorChain "stored_sig"
[junit4:junit4]   2> 1602 T1772 oasup.UpdateRequestProcessorChain.init inserting DistributedUpdateProcessorFactory into updateRequestProcessorChain "uniq-fields"
[junit4:junit4]   2> 1602 T1772 oasup.UpdateRequestProcessorChain.init inserting DistributedUpdateProcessorFactory into updateRequestProcessorChain "distrib-dup-test-chain-implicit"
[junit4:junit4]   2> 1603 T1772 oasc.RequestHandlers.initHandlersFromConfig adding lazy requestHandler: solr.ReplicationHandler
[junit4:junit4]   2> 1603 T1772 oasc.RequestHandlers.initHandlersFromConfig created /replication: solr.ReplicationHandler
[junit4:junit4]   2> 1604 T1772 oasc.RequestHandlers.initHandlersFromConfig created standard: solr.StandardRequestHandler
[junit4:junit4]   2> 1605 T1772 oasc.RequestHandlers.initHandlersFromConfig created /get: solr.RealTimeGetHandler
[junit4:junit4]   2> 1606 T1772 oasc.RequestHandlers.initHandlersFromConfig created dismax: solr.SearchHandler
[junit4:junit4]   2> 1606 T1772 oasc.RequestHandlers.initHandlersFromConfig created mock: org.apache.solr.core.MockQuerySenderListenerReqHandler
[junit4:junit4]   2> 1607 T1772 oasc.RequestHandlers.initHandlersFromConfig created /admin/: org.apache.solr.handler.admin.AdminHandlers
[junit4:junit4]   2> 1608 T1772 oasc.RequestHandlers.initHandlersFromConfig created defaults: solr.StandardRequestHandler
[junit4:junit4]   2> 1608 T1772 oasc.RequestHandlers.initHandlersFromConfig adding lazy requestHandler: solr.StandardRequestHandler
[junit4:junit4]   2> 1609 T1772 oasc.RequestHandlers.initHandlersFromConfig created lazy: solr.StandardRequestHandler
[junit4:junit4]   2> 1610 T1772 oasc.RequestHandlers.initHandlersFromConfig created /update: solr.UpdateRequestHandler
[junit4:junit4]   2> 1610 T1772 oasc.RequestHandlers.initHandlersFromConfig created /terms: org.apache.solr.handler.component.SearchHandler
[junit4:junit4]   2> 1611 T1772 oasc.RequestHandlers.initHandlersFromConfig created spellCheckCompRH: org.apache.solr.handler.component.SearchHandler
[junit4:junit4]   2> 1612 T1772 oasc.RequestHandlers.initHandlersFromConfig created spellCheckCompRH_Direct: org.apache.solr.handler.component.SearchHandler
[junit4:junit4]   2> 1612 T1772 oasc.RequestHandlers.initHandlersFromConfig created spellCheckWithWordbreak: org.apache.solr.handler.component.SearchHandler
[junit4:junit4]   2> 1613 T1772 oasc.RequestHandlers.initHandlersFromConfig created spellCheckWithWordbreak_Direct: org.apache.solr.handler.component.SearchHandler
[junit4:junit4]   2> 1614 T1772 oasc.RequestHandlers.initHandlersFromConfig created spellCheckCompRH1: org.apache.solr.handler.component.SearchHandler
[junit4:junit4]   2> 1614 T1772 oasc.RequestHandlers.initHandlersFromConfig created tvrh: org.apache.solr.handler.component.SearchHandler
[junit4:junit4]   2> 1615 T1772 oasc.RequestHandlers.initHandlersFromConfig created /mlt: solr.MoreLikeThisHandler
[junit4:junit4]   2> 1616 T1772 oasc.RequestHandlers.initHandlersFromConfig created /debug/dump: solr.DumpRequestHandler
[junit4:junit4]   2> 1620 T1772 oashl.XMLLoader.init xsltCacheLifetimeSeconds=60
[junit4:junit4]   2> 1625 T1772 oasc.SolrCore.initDeprecatedSupport WARNING solrconfig.xml uses deprecated <admin/gettableFiles>, Please update your config to use the ShowFileRequestHandler.
[junit4:junit4]   2> 1627 T1772 oasc.SolrCore.initDeprecatedSupport WARNING adding ShowFileRequestHandler with hidden files: [SCHEMA.XML, OLD_SYNONYMS.TXT, STOPWORDS.TXT, PROTWORDS.TXT, OPEN-EXCHANGE-RATES.JSON, SYNONYMS.TXT, CURRENCY.XML, MAPPING-ISOLATIN1ACCENT.TXT]
[junit4:junit4]   2> 1631 T1772 oass.SolrIndexSearcher.<init> Opening Searcher@799cdb48 main
[junit4:junit4]   2> 1633 T1772 oasu.CommitTracker.<init> Hard AutoCommit: disabled
[junit4:junit4]   2> 1633 T1772 oasu.CommitTracker.<init> Soft AutoCommit: disabled
[junit4:junit4]   2> 1634 T1772 oashc.SpellCheckComponent.inform Initializing spell checkers
[junit4:junit4]   2> 1653 T1772 oass.DirectSolrSpellChecker.init init: {name=direct,classname=DirectSolrSpellChecker,field=lowerfilt,minQueryLength=3}
[junit4:junit4]   2> 1707 T1795 oasc.SolrCore.registerSearcher [collection1] Registered new searcher Searcher@799cdb48 main{StandardDirectoryReader(segments_1:1)}
[junit4:junit4]   2> 1712 T1777 oazs.PrepRequestProcessor.pRequest Got user-level KeeperException when processing sessionid:0x139e0fa80120002 type:create cxid:0x56 zxid:0xfffffffffffffffe txntype:unknown reqpath:n/a Error Path:/solr/overseer/queue Error:KeeperErrorCode = NoNode for /solr/overseer/queue
[junit4:junit4]   2> 1723 T1772 oasc.CoreContainer.register registering core: collection1
[junit4:junit4]   2> 1724 T1772 oasc.ZkController.register Register shard - core:collection1 address:http://127.0.0.1:28221/solr shardId:control_shard
[junit4:junit4]   2> 1725 T1772 oascc.SolrZkClient.makePath makePath: /collections/control_collection/leader_elect/control_shard/election
[junit4:junit4]   2> 1744 T1777 oazs.PrepRequestProcessor.pRequest Got user-level KeeperException when processing sessionid:0x139e0fa80120002 type:delete cxid:0x65 zxid:0xfffffffffffffffe txntype:unknown reqpath:n/a Error Path:/solr/collections/control_collection/leaders Error:KeeperErrorCode = NoNode for /solr/collections/control_collection/leaders
[junit4:junit4]   2> 1745 T1772 oasc.ShardLeaderElectionContext.runLeaderProcess Running the leader process.
[junit4:junit4]   2> 1746 T1777 oazs.PrepRequestProcessor.pRequest Got user-level KeeperException when processing sessionid:0x139e0fa80120002 type:create cxid:0x66 zxid:0xfffffffffffffffe txntype:unknown reqpath:n/a Error Path:/solr/overseer Error:KeeperErrorCode = NodeExists for /solr/overseer
[junit4:junit4]   2> 2102 T1793 oascc.ZkStateReader.updateClusterState Updating cloud state from ZooKeeper... 
[junit4:junit4]   2> 2103 T1777 oazs.PrepRequestProcessor.pRequest Got user-level KeeperException when processing sessionid:0x139e0fa80120002 type:create cxid:0x6d zxid:0xfffffffffffffffe txntype:unknown reqpath:n/a Error Path:/solr/overseer/queue-work Error:KeeperErrorCode = NoNode for /solr/overseer/queue-work
[junit4:junit4]   2> 2133 T1792 oascc.ZkStateReader$2.process A cluster state change has occurred - updating...
[junit4:junit4]   2> 2249 T1772 oasc.ShardLeaderElectionContext.waitForReplicasToComeUp Enough replicas found to continue.
[junit4:junit4]   2> 2250 T1772 oasc.ShardLeaderElectionContext.runLeaderProcess I may be the new leader - try and sync
[junit4:junit4]   2> 2251 T1772 oasc.SyncStrategy.sync Sync replicas to http://127.0.0.1:28221/solr/collection1/
[junit4:junit4]   2> 2251 T1772 oasc.SyncStrategy.syncReplicas Sync Success - now sync replicas to me
[junit4:junit4]   2> 2252 T1772 oasc.SyncStrategy.syncToMe http://127.0.0.1:28221/solr/collection1/ has no replicas
[junit4:junit4]   2> 2252 T1772 oasc.ShardLeaderElectionContext.runLeaderProcess I am the new leader: http://127.0.0.1:28221/solr/collection1/
[junit4:junit4]   2> 2253 T1772 oascc.SolrZkClient.makePath makePath: /collections/control_collection/leaders/control_shard
[junit4:junit4]   2> 2267 T1777 oazs.PrepRequestProcessor.pRequest Got user-level KeeperException when processing sessionid:0x139e0fa80120002 type:create cxid:0x8b zxid:0xfffffffffffffffe txntype:unknown reqpath:n/a Error Path:/solr/overseer Error:KeeperErrorCode = NodeExists for /solr/overseer
[junit4:junit4]   2> 2645 T1793 oascc.ZkStateReader.updateClusterState Updating cloud state from ZooKeeper... 
[junit4:junit4]   2> 2657 T1792 oascc.ZkStateReader$2.process A cluster state change has occurred - updating...
[junit4:junit4]   2> 2682 T1772 oasc.ZkController.register We are http://127.0.0.1:28221/solr/collection1/ and leader is http://127.0.0.1:28221/solr/collection1/
[junit4:junit4]   2> 2682 T1772 oasc.ZkController.register No LogReplay needed for core=collection1 baseURL=http://127.0.0.1:28221/solr
[junit4:junit4]   2> 2683 T1772 oasc.ZkController.checkRecovery I am the leader, no recovery necessary
[junit4:junit4]   2> 2685 T1772 oascc.ZkStateReader.updateClusterState Updating cloud state from ZooKeeper... 
[junit4:junit4]   2> 2686 T1772 oass.SolrDispatchFilter.init user.dir=/usr/home/hudson/hudson-slave/workspace/Lucene-Solr-Tests-4.x-Java6/solr/build/solr-core/test/J1
[junit4:junit4]   2> 2686 T1772 oass.SolrDispatchFilter.init SolrDispatchFilter.init() done
[junit4:junit4]   2> 2686 T1772 oascsi.HttpClientUtil.createClient Creating new http client, config:maxConnections=128&maxConnectionsPerHost=32&followRedirects=false
[junit4:junit4]   2> 3019 T1772 oejs.Server.doStart jetty-8.1.2.v20120308
[junit4:junit4]   2> 3022 T1772 oejs.AbstractConnector.doStart Started SocketConnector@0.0.0.0:28229
[junit4:junit4]   2> 3022 T1772 oasc.SolrResourceLoader.locateSolrHome JNDI not configured for solr (NoInitialContextEx)
[junit4:junit4]   2> 3023 T1772 oasc.SolrResourceLoader.locateSolrHome using system property solr.solr.home: /usr/home/hudson/hudson-slave/workspace/Lucene-Solr-Tests-4.x-Java6/solr/build/solr-core/test/J1/./solrtest-jetty1-1348099279505
[junit4:junit4]   2> 3023 T1772 oasc.SolrResourceLoader.<init> new SolrResourceLoader for deduced Solr Home: '/usr/home/hudson/hudson-slave/workspace/Lucene-Solr-Tests-4.x-Java6/solr/build/solr-core/test/J1/./solrtest-jetty1-1348099279505/'
[junit4:junit4]   2> 3046 T1772 oass.SolrDispatchFilter.init SolrDispatchFilter.init()
[junit4:junit4]   2> 3047 T1772 oasc.SolrResourceLoader.locateSolrHome JNDI not configured for solr (NoInitialContextEx)
[junit4:junit4]   2> 3047 T1772 oasc.SolrResourceLoader.locateSolrHome using system property solr.solr.home: /usr/home/hudson/hudson-slave/workspace/Lucene-Solr-Tests-4.x-Java6/solr/build/solr-core/test/J1/./solrtest-jetty1-1348099279505
[junit4:junit4]   2> 3047 T1772 oasc.CoreContainer$Initializer.initialize looking for solr.xml: /usr/home/hudson/hudson-slave/workspace/Lucene-Solr-Tests-4.x-Java6/solr/build/solr-core/test/J1/./solrtest-jetty1-1348099279505/solr.xml
[junit4:junit4]   2> 3048 T1772 oasc.CoreContainer.<init> New CoreContainer 1916624349
[junit4:junit4]   2> 3048 T1772 oasc.CoreContainer.load Loading CoreContainer using Solr Home: '/usr/home/hudson/hudson-slave/workspace/Lucene-Solr-Tests-4.x-Java6/solr/build/solr-core/test/J1/./solrtest-jetty1-1348099279505/'
[junit4:junit4]   2> 3049 T1772 oasc.SolrResourceLoader.<init> new SolrResourceLoader for directory: '/usr/home/hudson/hudson-slave/workspace/Lucene-Solr-Tests-4.x-Java6/solr/build/solr-core/test/J1/./solrtest-jetty1-1348099279505/'
[junit4:junit4]   2> 3068 T1772 oasc.CoreContainer.load Registering Log Listener
[junit4:junit4]   2> 3079 T1772 oasc.CoreContainer.initZooKeeper Zookeeper client=127.0.0.1:28218/solr
[junit4:junit4]   2> 3080 T1772 oaz.ZooKeeper.<init> Initiating client connection, connectString=127.0.0.1:28218/solr sessionTimeout=5000 watcher=org.apache.solr.common.cloud.ConnectionManager@48ce4dfc
[junit4:junit4]   2> 3081 T1805 oaz.ClientCnxn$SendThread.startConnect Opening socket connection to server /127.0.0.1:28218
[junit4:junit4]   2> 3081 T1772 oascc.ConnectionManager.waitForConnected Waiting for client to connect to ZooKeeper
[junit4:junit4]   2> 3082 T1805 oaz.ClientCnxn$SendThread.primeConnection Socket connection established to localhost/127.0.0.1:28218, initiating session
[junit4:junit4]   2> 3082 T1774 oazs.NIOServerCnxn$Factory.run Accepted socket connection from /140.211.11.196:28230
[junit4:junit4]   2> 3082 T1774 oazs.NIOServerCnxn.readConnectRequest Client attempting to establish new session at /140.211.11.196:28230
[junit4:junit4]   2> 3186 T1776 oazs.NIOServerCnxn.finishSessionInit Established session 0x139e0fa80120003 with negotiated timeout 5000 for client /140.211.11.196:28230
[junit4:junit4]   2> 3186 T1805 oaz.ClientCnxn$SendThread.readConnectResult Session establishment complete on server localhost/127.0.0.1:28218, sessionid = 0x139e0fa80120003, negotiated timeout = 5000
[junit4:junit4]   2> 3187 T1806 oascc.ConnectionManager.process Watcher org.apache.solr.common.cloud.ConnectionManager@48ce4dfc name:ZooKeeperConnection Watcher:127.0.0.1:28218/solr got event WatchedEvent state:SyncConnected type:None path:null path:null type:None
[junit4:junit4]   2> 3187 T1772 oascc.ConnectionManager.waitForConnected Client is connected to ZooKeeper
[junit4:junit4]   2> 3188 T1793 oascc.ZkStateReader.updateClusterState Updating cloud state from ZooKeeper... 
[junit4:junit4]   2> 3188 T1777 oazs.PrepRequestProcessor.pRequest Got user-level KeeperException when processing sessionid:0x139e0fa80120003 type:create cxid:0x1 zxid:0xfffffffffffffffe txntype:unknown reqpath:n/a Error Path:/solr/overseer Error:KeeperErrorCode = NodeExists for /solr/overseer
[junit4:junit4]   2> 3205 T1777 oazs.PrepRequestProcessor.pRequest Got user-level KeeperException when processing sessionid:0x139e0fa80120003 type:create cxid:0x2 zxid:0xfffffffffffffffe txntype:unknown reqpath:n/a Error Path:/solr/overseer Error:KeeperErrorCode = NodeExists for /solr/overseer
[junit4:junit4]   2> 3218 T1772 oasc.ZkController.createEphemeralLiveNode Register node as live in ZooKeeper:/live_nodes/127.0.0.1:28229_solr
[junit4:junit4]   2> 3219 T1777 oazs.PrepRequestProcessor.pRequest Got user-level KeeperException when processing sessionid:0x139e0fa80120003 type:delete cxid:0x4 zxid:0xfffffffffffffffe txntype:unknown reqpath:n/a Error Path:/solr/live_nodes/127.0.0.1:28229_solr Error:KeeperErrorCode = NoNode for /solr/live_nodes/127.0.0.1:28229_solr
[junit4:junit4]   2> 3228 T1772 oascc.SolrZkClient.makePath makePath: /live_nodes/127.0.0.1:28229_solr
[junit4:junit4]   2> 3229 T1792 oascc.ZkStateReader$2.process A cluster state change has occurred - updating...
[junit4:junit4]   2> 3232 T1772 oashc.HttpShardHandlerFactory.getParameter Setting socketTimeout to: 0
[junit4:junit4]   2> 3233 T1792 oascc.ZkStateReader$3.process Updating live nodes
[junit4:junit4]   2> 3233 T1772 oashc.HttpShardHandlerFactory.getParameter Setting urlScheme to: http://
[junit4:junit4]   2> 3233 T1772 oashc.HttpShardHandlerFactory.getParameter Setting connTimeout to: 0
[junit4:junit4]   2> 3233 T1772 oashc.HttpShardHandlerFactory.getParameter Setting maxConnectionsPerHost to: 20
[junit4:junit4]   2> 3234 T1772 oashc.HttpShardHandlerFactory.getParameter Setting corePoolSize to: 0
[junit4:junit4]   2> 3234 T1772 oashc.HttpShardHandlerFactory.getParameter Setting maximumPoolSize to: 2147483647
[junit4:junit4]   2> 3234 T1772 oashc.HttpShardHandlerFactory.getParameter Setting maxThreadIdleTime to: 5
[junit4:junit4]   2> 3235 T1772 oashc.HttpShardHandlerFactory.getParameter Setting sizeOfQueue to: -1
[junit4:junit4]   2> 3235 T1772 oashc.HttpShardHandlerFactory.getParameter Setting fairnessPolicy to: false
[junit4:junit4]   2> 3235 T1772 oascsi.HttpClientUtil.createClient Creating new http client, config:maxConnectionsPerHost=20&maxConnections=10000&socketTimeout=0&connTimeout=0&retry=false
[junit4:junit4]   2> 3248 T1772 oascc.ZkStateReader.createClusterStateWatchersAndUpdate Updating cluster state from ZooKeeper... 
[junit4:junit4]   2> 3253 T1772 oasc.CoreContainer.create Creating SolrCore 'collection1' using instanceDir: /usr/home/hudson/hudson-slave/workspace/Lucene-Solr-Tests-4.x-Java6/solr/build/solr-core/test/J1/./solrtest-jetty1-1348099279505/collection1
[junit4:junit4]   2> 3253 T1772 oasc.ZkController.createCollectionZkNode Check for collection zkNode:collection1
[junit4:junit4]   2> 3254 T1772 oasc.ZkController.createCollectionZkNode Collection zkNode exists
[junit4:junit4]   2> 3254 T1772 oasc.ZkController.readConfigName Load collection config from:/collections/collection1
[junit4:junit4]   2> 3256 T1772 oasc.SolrResourceLoader.<init> new SolrResourceLoader for directory: '/usr/home/hudson/hudson-slave/workspace/Lucene-Solr-Tests-4.x-Java6/solr/build/solr-core/test/J1/./solrtest-jetty1-1348099279505/collection1/'
[junit4:junit4]   2> 3256 T1772 oasc.SolrResourceLoader.replaceClassLoader Adding 'file:/usr/home/hudson/hudson-slave/workspace/Lucene-Solr-Tests-4.x-Java6/solr/build/solr-core/test/J1/solrtest-jetty1-1348099279505/collection1/lib/README' to classloader
[junit4:junit4]   2> 3257 T1772 oasc.SolrResourceLoader.replaceClassLoader Adding 'file:/usr/home/hudson/hudson-slave/workspace/Lucene-Solr-Tests-4.x-Java6/solr/build/solr-core/test/J1/solrtest-jetty1-1348099279505/collection1/lib/classes/' to classloader
[junit4:junit4]   2> 3304 T1772 oasc.SolrConfig.<init> Using Lucene MatchVersion: LUCENE_40
[junit4:junit4]   2> 3356 T1772 oasc.SolrConfig.<init> Loaded SolrConfig: solrconfig.xml
[junit4:junit4]   2> 3457 T1772 oass.IndexSchema.readSchema Reading Solr Schema
[junit4:junit4]   2> 3465 T1772 oass.IndexSchema.readSchema Schema name=test
[junit4:junit4]   2> 3928 T1772 oass.OpenExchangeRatesOrgProvider.init Initialized with rates=open-exchange-rates.json, refreshInterval=1440.
[junit4:junit4]   2> 3941 T1772 oass.IndexSchema.readSchema default search field in schema is text
[junit4:junit4]   2> 3946 T1772 oass.IndexSchema.readSchema unique key field: id
[junit4:junit4]   2> 3974 T1772 oass.FileExchangeRateProvider.reload Reloading exchange rates from file currency.xml
[junit4:junit4]   2> 3980 T1772 oass.FileExchangeRateProvider.reload Reloading exchange rates from file currency.xml
[junit4:junit4]   2> 3985 T1772 oass.OpenExchangeRatesOrgProvider.reload Reloading exchange rates from open-exchange-rates.json
[junit4:junit4]   2> 3986 T1772 oass.OpenExchangeRatesOrgProvider.reload Reloading exchange rates from open-exchange-rates.json
[junit4:junit4]   2> 3987 T1772 oasc.SolrCore.<init> [collection1] Opening new SolrCore at /usr/home/hudson/hudson-slave/workspace/Lucene-Solr-Tests-4.x-Java6/solr/build/solr-core/test/J1/./solrtest-jetty1-1348099279505/collection1/, dataDir=./org.apache.solr.cloud.BasicDistributedZk2Test-1348099276813/jetty1/
[junit4:junit4]   2> 3987 T1772 oasc.JmxMonitoredMap.<init> JMX monitoring is enabled. Adding Solr mbeans to JMX Server: com.sun.jmx.mbeanserver.JmxMBeanServer@4f682a53
[junit4:junit4]   2> 3988 T1772 oasc.SolrCore.getNewIndexDir WARNING New index directory detected: old=null new=./org.apache.solr.cloud.BasicDistributedZk2Test-1348099276813/jetty1/index/
[junit4:junit4]   2> 3989 T1772 oasc.SolrCore.initIndex WARNING [collection1] Solr index directory './org.apache.solr.cloud.BasicDistributedZk2Test-1348099276813/jetty1/index' doesn't exist. Creating new index...
[junit4:junit4]   2> 3989 T1772 oasc.CachingDirectoryFactory.get return new directory for /usr/home/hudson/hudson-slave/workspace/Lucene-Solr-Tests-4.x-Java6/solr/build/solr-core/test/J1/./org.apache.solr.cloud.BasicDistributedZk2Test-1348099276813/jetty1/index forceNew:false
[junit4:junit4]   2> 3994 T1772 oasc.SolrDeletionPolicy.onCommit SolrDeletionPolicy.onCommit: commits:num=1
[junit4:junit4]   2> 		commit{dir=/usr/home/hudson/hudson-slave/workspace/Lucene-Solr-Tests-4.x-Java6/solr/build/solr-core/test/J1/org.apache.solr.cloud.BasicDistributedZk2Test-1348099276813/jetty1/index,segFN=segments_1,generation=1,filenames=[segments_1]
[junit4:junit4]   2> 3994 T1772 oasc.SolrDeletionPolicy.updateCommits newest commit = 1
[junit4:junit4]   2> 3995 T1772 oasc.SolrCore.initWriters created xml: solr.XMLResponseWriter
[junit4:junit4]   2> 3997 T1772 oasup.UpdateRequestProcessorChain.init inserting DistributedUpdateProcessorFactory into updateRequestProcessorChain "dedupe"
[junit4:junit4]   2> 3997 T1772 oasup.UpdateRequestProcessorChain.init inserting DistributedUpdateProcessorFactory into updateRequestProcessorChain "dedupe-allfields"
[junit4:junit4]   2> 3998 T1772 oasup.UpdateRequestProcessorChain.init inserting DistributedUpdateProcessorFactory into updateRequestProcessorChain "stored_sig"
[junit4:junit4]   2> 3998 T1772 oasup.UpdateRequestProcessorChain.init inserting DistributedUpdateProcessorFactory into updateRequestProcessorChain "uniq-fields"
[junit4:junit4]   2> 3999 T1772 oasup.UpdateRequestProcessorChain.init inserting DistributedUpdateProcessorFactory into updateRequestProcessorChain "distrib-dup-test-chain-implicit"
[junit4:junit4]   2> 3999 T1772 oasc.RequestHandlers.initHandlersFromConfig adding lazy requestHandler: solr.ReplicationHandler
[junit4:junit4]   2> 3999 T1772 oasc.RequestHandlers.initHandlersFromConfig created /replication: solr.ReplicationHandler
[junit4:junit4]   2> 4000 T1772 oasc.RequestHandlers.initHandlersFromConfig created standard: solr.StandardRequestHandler
[junit4:junit4]   2> 4000 T1772 oasc.RequestHandlers.initHandlersFromConfig created /get: solr.RealTimeGetHandler
[junit4:junit4]   2> 4001 T1772 oasc.RequestHandlers.initHandlersFromConfig created dismax: solr.SearchHandler
[junit4:junit4]   2> 4002 T1772 oasc.RequestHandlers.initHandlersFromConfig created mock: org.apache.solr.core.MockQuerySenderListenerReqHandler
[junit4:junit4]   2> 4002 T1772 oasc.RequestHandlers.initHandlersFromConfig created /admin/: org.apache.solr.handler.admin.AdminHandlers
[junit4:junit4]   2> 4003 T1772 oasc.RequestHandlers.initHandlersFromConfig created defaults: solr.StandardRequestHandler
[junit4:junit4]   2> 4003 T1772 oasc.RequestHandlers.initHandlersFromConfig adding lazy requestHandler: solr.StandardRequestHandler
[junit4:junit4]   2> 4003 T1772 oasc.RequestHandlers.initHandlersFromConfig created lazy: solr.StandardRequestHandler
[junit4:junit4]   2> 4004 T1772 oasc.RequestHandlers.initHandlersFromConfig created /update: solr.UpdateRequestHandler
[junit4:junit4]   2> 4004 T1772 oasc.RequestHandlers.initHandlersFromConfig created /terms: org.apache.solr.handler.component.SearchHandler
[junit4:junit4]   2> 4005 T1772 oasc.RequestHandlers.initHandlersFromConfig created spellCheckCompRH: org.apache.solr.handler.component.SearchHandler
[junit4:junit4]   2> 4006 T1772 oasc.RequestHandlers.initHandlersFromConfig created spellCheckCompRH_Direct: org.apache.solr.handler.component.SearchHandler
[junit4:junit4]   2> 4006 T1772 oasc.RequestHandlers.initHandlersFromConfig created spellCheckWithWordbreak: org.apache.solr.handler.component.SearchHandler
[junit4:junit4]   2> 4007 T1772 oasc.RequestHandlers.initHandlersFromConfig created spellCheckWithWordbreak_Direct: org.apache.solr.handler.component.SearchHandler
[junit4:junit4]   2> 4007 T1772 oasc.RequestHandlers.initHandlersFromConfig created spellCheckCompRH1: org.apache.solr.handler.component.SearchHandler
[junit4:junit4]   2> 4008 T1772 oasc.RequestHandlers.initHandlersFromConfig created tvrh: org.apache.solr.handler.component.SearchHandler
[junit4:junit4]   2> 4008 T1772 oasc.RequestHandlers.initHandlersFromConfig created /mlt: solr.MoreLikeThisHandler
[junit4:junit4]   2> 4009 T1772 oasc.RequestHandlers.initHandlersFromConfig created /debug/dump: solr.DumpRequestHandler
[junit4:junit4]   2> 4012 T1772 oashl.XMLLoader.init xsltCacheLifetimeSeconds=60
[junit4:junit4]   2> 4015 T1772 oasc.SolrCore.initDeprecatedSupport WARNING solrconfig.xml uses deprecated <admin/gettableFiles>, Please update your config to use the ShowFileRequestHandler.
[junit4:junit4]   2> 4017 T1772 oasc.SolrCore.initDeprecatedSupport WARNING adding ShowFileRequestHandler with hidden files: [SCHEMA.XML, OLD_SYNONYMS.TXT, STOPWORDS.TXT, PROTWORDS.TXT, OPEN-EXCHANGE-RATES.JSON, SYNONYMS.TXT, CURRENCY.XML, MAPPING-ISOLATIN1ACCENT.TXT]
[junit4:junit4]   2> 4020 T1772 oass.SolrIndexSearcher.<init> Opening Searcher@53e06762 main
[junit4:junit4]   2> 4021 T1772 oasu.CommitTracker.<init> Hard AutoCommit: disabled
[junit4:junit4]   2> 4021 T1772 oasu.CommitTracker.<init> Soft AutoCommit: disabled
[junit4:junit4]   2> 4021 T1772 oashc.SpellCheckComponent.inform Initializing spell checkers
[junit4:junit4]   2> 4027 T1772 oass.DirectSolrSpellChecker.init init: {name=direct,classname=DirectSolrSpellChecker,field=lowerfilt,minQueryLength=3}
[junit4:junit4]   2> 4082 T1807 oasc.SolrCore.registerSearcher [collection1] Registered new searcher Searcher@53e06762 main{StandardDirectoryReader(segments_1:1)}
[junit4:junit4]   2> 4236 T1793 oascc.ZkStateReader.updateClusterState Updating cloud state from ZooKeeper... 
[junit4:junit4]   2> 4250 T1792 oascc.ZkStateReader$2.process A cluster state change has occurred - updating...
[junit4:junit4]   2> 4250 T1806 oascc.ZkStateReader$2.process A cluster state change has occurred - updating...
[junit4:junit4]   2> 4588 T1772 oasc.CoreContainer.register registering core: collection1
[junit4:junit4]   2> 4588 T1772 oasc.ZkController.register Register shard - core:collection1 address:http://127.0.0.1:28229/solr shardId:shard1
[junit4:junit4]   2> 4590 T1772 oascc.SolrZkClient.makePath makePath: /collections/collection1/leader_elect/shard1/election
[junit4:junit4]   2> 4605 T1777 oazs.PrepRequestProcessor.pRequest Got user-level KeeperException when processing sessionid:0x139e0fa80120003 type:delete cxid:0x42 zxid:0xfffffffffffffffe txntype:unknown reqpath:n/a Error Path:/solr/collections/collection1/leaders Error:KeeperErrorCode = NoNode for /solr/collections/collection1/leaders
[junit4:junit4]   2> 4606 T1772 oasc.ShardLeaderElectionContext.runLeaderProcess Running the leader process.
[junit4:junit4]   2> 4607 T1777 oazs.PrepRequestProcessor.pRequest Got user-level KeeperException when processing sessionid:0x139e0fa80120003 type:create cxid:0x43 zxid:0xfffffffffffffffe txntype:unknown reqpath:n/a Error Path:/solr/overseer Error:KeeperErrorCode = NodeExists for /solr/overseer
[junit4:junit4]   2> 4616 T1772 oasc.ShardLeaderElectionContext.waitForReplicasToComeUp Enough replicas found to continue.
[junit4:junit4]   2> 4617 T1772 oasc.ShardLeaderElectionContext.runLeaderProcess I may be the new leader - try and sync
[junit4:junit4]   2> 4617 T1772 oasc.SyncStrategy.sync Sync replicas to http://127.0.0.1:28229/solr/collection1/
[junit4:junit4]   2> 4618 T1772 oasc.SyncStrategy.syncReplicas Sync Success - now sync replicas to me
[junit4:junit4]   2> 4618 T1772 oasc.SyncStrategy.syncToMe http://127.0.0.1:28229/solr/collection1/ has no replicas
[junit4:junit4]   2> 4618 T1772 oasc.ShardLeaderElectionContext.runLeaderProcess I am the new leader: http://127.0.0.1:28229/solr/collection1/
[junit4:junit4]   2> 4619 T1772 oascc.SolrZkClient.makePath makePath: /collections/collection1/leaders/shard1
[junit4:junit4]   2> 4622 T1777 oazs.PrepRequestProcessor.pRequest Got user-level KeeperException when processing sessionid:0x139e0fa80120003 type:create cxid:0x4d zxid:0xfffffffffffffffe txntype:unknown reqpath:n/a Error Path:/solr/overseer Error:KeeperErrorCode = NodeExists for /solr/overseer
[junit4:junit4]   2> 4754 T1793 oascc.ZkStateReader.updateClusterState Updating cloud state from ZooKeeper... 
[junit4:junit4]   2> 4760 T1806 oascc.ZkStateReader$2.process A cluster state change has occurred - updating...
[junit4:junit4]   2> 4760 T1792 oascc.ZkStateReader$2.process A cluster state change has occurred - updating...
[junit4:junit4]   2> 4786 T1772 oasc.ZkController.register We are http://127.0.0.1:28229/solr/collection1/ and leader is http://127.0.0.1:28229/solr/collection1/
[junit4:junit4]   2> 4787 T1772 oasc.ZkController.register No LogReplay needed for core=collection1 baseURL=http://127.0.0.1:28229/solr
[junit4:junit4]   2> 4787 T1772 oasc.ZkController.checkRecovery I am the leader, no recovery necessary
[junit4:junit4]   2> 4909 T1772 oascc.ZkStateReader.updateClusterState Updating cloud state from ZooKeeper... 
[junit4:junit4]   2> 4910 T1772 oass.SolrDispatchFilter.init user.dir=/usr/home/hudson/hudson-slave/workspace/Lucene-Solr-Tests-4.x-Java6/solr/build/solr-core/test/J1
[junit4:junit4]   2> 4910 T1772 oass.SolrDispatchFilter.init SolrDispatchFilter.init() done
[junit4:junit4]   2> 4911 T1772 oascsi.HttpClientUtil.createClient Creating new http client, config:maxConnections=128&maxConnectionsPerHost=32&followRedirects=false
[junit4:junit4]   2> 5265 T1793 oascc.ZkStateReader.updateClusterState Updating cloud state from ZooKeeper... 
[junit4:junit4]   2> 5286 T1772 oejs.Server.doStart jetty-8.1.2.v20120308
[junit4:junit4]   2> 5289 T1772 oejs.AbstractConnector.doStart Started SocketConnector@0.0.0.0:28237
[junit4:junit4]   2> 5289 T1772 oasc.SolrResourceLoader.locateSolrHome JNDI not configured for solr (NoInitialContextEx)
[junit4:junit4]   2> 5289 T1772 oasc.SolrResourceLoader.locateSolrHome using system property solr.solr.home: /usr/home/hudson/hudson-slave/workspace/Lucene-Solr-Tests-4.x-Java6/solr/build/solr-core/test/J1/./solrtest-jetty2-1348099281731
[junit4:junit4]   2> 5290 T1772 oasc.SolrResourceLoader.<init> new SolrResourceLoader for deduced Solr Home: '/usr/home/hudson/hudson-slave/workspace/Lucene-Solr-Tests-4.x-Java6/solr/build/solr-core/test/J1/./solrtest-jetty2-1348099281731/'
[junit4:junit4]   2> 5291 T1792 oascc.ZkStateReader$2.process A cluster state change has occurred - updating...
[junit4:junit4]   2> 5291 T1806 oascc.ZkStateReader$2.process A cluster state change has occurred - updating...
[junit4:junit4]   2> 5322 T1772 oass.SolrDispatchFilter.init SolrDispatchFilter.init()
[junit4:junit4]   2> 5322 T1772 oasc.SolrResourceLoader.locateSolrHome JNDI not configured for solr (NoInitialContextEx)
[junit4:junit4]   2> 5322 T1772 oasc.SolrResourceLoader.locateSolrHome using system property solr.solr.home: /usr/home/hudson/hudson-slave/workspace/Lucene-Solr-Tests-4.x-Java6/solr/build/solr-core/test/J1/./solrtest-jetty2-1348099281731
[junit4:junit4]   2> 5323 T1772 oasc.CoreContainer$Initializer.initialize looking for solr.xml: /usr/home/hudson/hudson-slave/workspace/Lucene-Solr-Tests-4.x-Java6/solr/build/solr-core/test/J1/./solrtest-jetty2-1348099281731/solr.xml
[junit4:junit4]   2> 5323 T1772 oasc.CoreContainer.<init> New CoreContainer 814790366
[junit4:junit4]   2> 5324 T1772 oasc.CoreContainer.load Loading CoreContainer using Solr Home: '/usr/home/hudson/hudson-slave/workspace/Lucene-Solr-Tests-4.x-Java6/solr/build/solr-core/test/J1/./solrtest-jetty2-1348099281731/'
[junit4:junit4]   2> 5324 T1772 oasc.SolrResourceLoader.<init> new SolrResourceLoader for directory: '/usr/home/hudson/hudson-slave/workspace/Lucene-Solr-Tests-4.x-Java6/solr/build/solr-core/test/J1/./solrtest-jetty2-1348099281731/'
[junit4:junit4]   2> 5347 T1772 oasc.CoreContainer.load Registering Log Listener
[junit4:junit4]   2> 5367 T1772 oasc.CoreContainer.initZooKeeper Zookeeper client=127.0.0.1:28218/solr
[junit4:junit4]   2> 5368 T1772 oaz.ZooKeeper.<init> Initiating client connection, connectString=127.0.0.1:28218/solr sessionTimeout=5000 watcher=org.apache.solr.common.cloud.ConnectionManager@12d9e3e8
[junit4:junit4]   2> 5369 T1817 oaz.ClientCnxn$SendThread.startConnect Opening socket connection to server /127.0.0.1:28218
[junit4:junit4]   2> 5369 T1772 oascc.ConnectionManager.waitForConnected Waiting for client to connect to ZooKeeper
[junit4:junit4]   2> 5370 T1817 oaz.ClientCnxn$SendThread.primeConnection Socket connection established to localhost/127.0.0.1:28218, initiating session
[junit4:junit4]   2> 5370 T1774 oazs.NIOServerCnxn$Factory.run Accepted socket connection from /140.211.11.196:28238
[junit4:junit4]   2> 5371 T1774 oazs.NIOServerCnxn.readConnectRequest Client attempting to establish new session at /140.211.11.196:28238
[junit4:junit4]   2> 5373 T1776 oazs.NIOServerCnxn.finishSessionInit Established session 0x139e0fa80120004 with negotiated timeout 5000 for client /140.211.11.196:28238
[junit4:junit4]   2> 5373 T1817 oaz.ClientCnxn$SendThread.readConnectResult Session establishment complete on server localhost/127.0.0.1:28218, sessionid = 0x139e0fa80120004, negotiated timeout = 5000
[junit4:junit4]   2> 5373 T1818 oascc.ConnectionManager.process Watcher org.apache.solr.common.cloud.ConnectionManager@12d9e3e8 name:ZooKeeperConnection Watcher:127.0.0.1:28218/solr got event WatchedEvent state:SyncConnected type:None path:null path:null type:None
[junit4:junit4]   2> 5373 T1772 oascc.ConnectionManager.waitForConnected Client is connected to ZooKeeper
[junit4:junit4]   2> 5374 T1777 oazs.PrepRequestProcessor.pRequest Got user-level KeeperException when processing sessionid:0x139e0fa80120004 type:create cxid:0x1 zxid:0xfffffffffffffffe txntype:unknown reqpath:n/a Error Path:/solr/overseer Error:KeeperErrorCode = NodeExists for /solr/overseer
[junit4:junit4]   2> 5376 T1777 oazs.PrepRequestProcessor.pRequest Got user-level KeeperException when processing sessionid:0x139e0fa80120004 type:create cxid:0x2 zxid:0xfffffffffffffffe txntype:unknown reqpath:n/a Error Path:/solr/overseer Error:KeeperErrorCode = NodeExists for /solr/overseer
[junit4:junit4]   2> 5383 T1772 oasc.ZkController.createEphemeralLiveNode Register node as live in ZooKeeper:/live_nodes/127.0.0.1:28237_solr
[junit4:junit4]   2> 5384 T1777 oazs.PrepRequestProcessor.pRequest Got user-level KeeperException when processing sessionid:0x139e0fa80120004 type:delete cxid:0x4 zxid:0xfffffffffffffffe txntype:unknown reqpath:n/a Error Path:/solr/live_nodes/127.0.0.1:28237_solr Error:KeeperErrorCode = NoNode for /solr/live_nodes/127.0.0.1:28237_solr
[junit4:junit4]   2> 5385 T1772 oascc.SolrZkClient.makePath makePath: /live_nodes/127.0.0.1:28237_solr
[junit4:junit4]   2> 5388 T1806 oascc.ZkStateReader$3.process Updating live nodes
[junit4:junit4]   2> 5388 T1792 oascc.ZkStateReader$3.process Updating live nodes
[junit4:junit4]   2> 5389 T1772 oashc.HttpShardHandlerFactory.getParameter Setting socketTimeout to: 0
[junit4:junit4]   2> 5389 T1772 oashc.HttpShardHandlerFactory.getParameter Setting urlScheme to: http://
[junit4:junit4]   2> 5390 T1772 oashc.HttpShardHandlerFactory.getParameter Setting connTimeout to: 0
[junit4:junit4]   2> 5390 T1772 oashc.HttpShardHandlerFactory.getParameter Setting maxConnectionsPerHost to: 20
[junit4:junit4]   2> 5391 T1772 oashc.HttpShardHandlerFactory.getParameter Setting corePoolSize to: 0
[junit4:junit4]   2> 5391 T1772 oashc.HttpShardHandlerFactory.getParameter Setting maximumPoolSize to: 2147483647
[junit4:junit4]   2> 5392 T1772 oashc.HttpShardHandlerFactory.getParameter Setting maxThreadIdleTime to: 5
[junit4:junit4]   2> 5392 T1772 oashc.HttpShardHandlerFactory.getParameter Setting sizeOfQueue to: -1
[junit4:junit4]   2> 5393 T1772 oashc.HttpShardHandlerFactory.getParameter Setting fairnessPolicy to: false
[junit4:junit4]   2> 5393 T1772 oascsi.HttpClientUtil.createClient Creating new http client, config:maxConnectionsPerHost=20&maxConnections=10000&socketTimeout=0&connTimeout=0&retry=false
[junit4:junit4]   2> 5412 T1772 oascc.ZkStateReader.createClusterStateWatchersAndUpdate Updating cluster state from ZooKeeper... 
[junit4:junit4]   2> 5420 T1772 oasc.CoreContainer.create Creating SolrCore 'collection1' using instanceDir: /usr/home/hudson/hudson-slave/workspace/Lucene-Solr-Tests-4.x-Java6/solr/build/solr-core/test/J1/./solrtest-jetty2-1348099281731/collection1
[junit4:junit4]   2> 5420 T1772 oasc.ZkController.createCollectionZkNode Check for collection zkNode:collection1
[junit4:junit4]   2> 5421 T1772 oasc.ZkController.createCollectionZkNode Collection zkNode exists
[junit4:junit4]   2> 5422 T1772 oasc.ZkController.readConfigName Load collection config from:/collections/collection1
[junit4:junit4]   2> 5423 T1772 oasc.SolrResourceLoader.<init> new SolrResourceLoader for directory: '/usr/home/hudson/hudson-slave/workspace/Lucene-Solr-Tests-4.x-Java6/solr/build/solr-core/test/J1/./solrtest-jetty2-1348099281731/collection1/'
[junit4:junit4]   2> 5425 T1772 oasc.SolrResourceLoader.replaceClassLoader Adding 'file:/usr/home/hudson/hudson-slave/workspace/Lucene-Solr-Tests-4.x-Java6/solr/build/solr-core/test/J1/solrtest-jetty2-1348099281731/collection1/lib/README' to classloader
[junit4:junit4]   2> 5426 T1772 oasc.SolrResourceLoader.replaceClassLoader Adding 'file:/usr/home/hudson/hudson-slave/workspace/Lucene-Solr-Tests-4.x-Java6/solr/build/solr-core/test/J1/solrtest-jetty2-1348099281731/collection1/lib/classes/' to classloader
[junit4:junit4]   2> 5482 T1772 oasc.SolrConfig.<init> Using Lucene MatchVersion: LUCENE_40
[junit4:junit4]   2> 5565 T1772 oasc.SolrConfig.<init> Loaded SolrConfig: solrconfig.xml
[junit4:junit4]   2> 5666 T1772 oass.IndexSchema.readSchema Reading Solr Schema
[junit4:junit4]   2> 5674 T1772 oass.IndexSchema.readSchema Schema name=test
[junit4:junit4]   2> 6366 T1772 oass.OpenExchangeRatesOrgProvider.init Initialized with rates=open-exchange-rates.json, refreshInterval=1440.
[junit4:junit4]   2> 6376 T1772 oass.IndexSchema.readSchema default search field in schema is text
[junit4:junit4]   2> 6379 T1772 oass.IndexSchema.readSchema unique key field: id
[junit4:junit4]   2> 6391 T1772 oass.FileExchangeRateProvider.reload Reloading exchange rates from file currency.xml
[junit4:junit4]   2> 6396 T1772 oass.FileExchangeRateProvider.reload Reloading exchange rates from file currency.xml
[junit4:junit4]   2> 6400 T1772 oass.OpenExchangeRatesOrgProvider.reload Reloading exchange rates from open-exchange-rates.json
[junit4:junit4]   2> 6401 T1772 oass.OpenExchangeRatesOrgProvider.reload Reloading exchange rates from open-exchange-rates.json
[junit4:junit4]   2> 6402 T1772 oasc.SolrCore.<init> [collection1] Opening new SolrCore at /usr/home/hudson/hudson-slave/workspace/Lucene-Solr-Tests-4.x-Java6/solr/build/solr-core/test/J1/./solrtest-jetty2-1348099281731/collection1/, dataDir=./org.apache.solr.cloud.BasicDistributedZk2Test-1348099276813/jetty2/
[junit4:junit4]   2> 6403 T1772 oasc.JmxMonitoredMap.<init> JMX monitoring is enabled. Adding Solr mbeans to JMX Server: com.sun.jmx.mbeanserver.JmxMBeanServer@4f682a53
[junit4:junit4]   2> 6404 T1772 oasc.SolrCore.getNewIndexDir WARNING New index directory detected: old=null new=./org.apache.solr.cloud.BasicDistributedZk2Test-1348099276813/jetty2/index/
[junit4:junit4]   2> 6404 T1772 oasc.SolrCore.initIndex WARNING [collection1] Solr index directory './org.apache.solr.cloud.BasicDistributedZk2Test-1348099276813/jetty2/index' doesn't exist. Creating new index...
[junit4:junit4]   2> 6405 T1772 oasc.CachingDirectoryFactory.get return new directory for /usr/home/hudson/hudson-slave/workspace/Lucene-Solr-Tests-4.x-Java6/solr/build/solr-core/test/J1/./org.apache.solr.cloud.BasicDistributedZk2Test-1348099276813/jetty2/index forceNew:false
[junit4:junit4]   2> 6410 T1772 oasc.SolrDeletionPolicy.onCommit SolrDeletionPolicy.onCommit: commits:num=1
[junit4:junit4]   2> 		commit{dir=/usr/home/hudson/hudson-slave/workspace/Lucene-Solr-Tests-4.x-Java6/solr/build/solr-core/test/J1/org.apache.solr.cloud.BasicDistributedZk2Test-1348099276813/jetty2/index,segFN=segments_1,generation=1,filenames=[segments_1]
[junit4:junit4]   2> 6411 T1772 oasc.SolrDeletionPolicy.updateCommits newest commit = 1
[junit4:junit4]   2> 6411 T1772 oasc.SolrCore.initWriters created xml: solr.XMLResponseWriter
[junit4:junit4]   2> 6413 T1772 oasup.UpdateRequestProcessorChain.init inserting DistributedUpdateProcessorFactory into updateRequestProcessorChain "dedupe"
[junit4:junit4]   2> 6413 T1772 oasup.UpdateRequestProcessorChain.init inserting DistributedUpdateProcessorFactory into updateRequestProcessorChain "dedupe-allfields"
[junit4:junit4]   2> 6414 T1772 oasup.UpdateRequestProcessorChain.init inserting DistributedUpdateProcessorFactory into updateRequestProcessorChain "stored_sig"
[junit4:junit4]   2> 6414 T1772 oasup.UpdateRequestProcessorChain.init inserting DistributedUpdateProcessorFactory into updateRequestProcessorChain "uniq-fields"
[junit4:junit4]   2> 6415 T1772 oasup.UpdateRequestProcessorChain.init inserting DistributedUpdateProcessorFactory into updateRequestProcessorChain "distrib-dup-test-chain-implicit"
[junit4:junit4]   2> 6415 T1772 oasc.RequestHandlers.initHandlersFromConfig adding lazy requestHandler: solr.ReplicationHandler
[junit4:junit4]   2> 6416 T1772 oasc.RequestHandlers.initHandlersFromConfig created /replication: solr.ReplicationHandler
[junit4:junit4]   2> 6416 T1772 oasc.RequestHandlers.initHandlersFromConfig created standard: solr.StandardRequestHandler
[junit4:junit4]   2> 6417 T1772 oasc.RequestHandlers.initHandlersFromConfig created /get: solr.RealTimeGetHandler
[junit4:junit4]   2> 6417 T1772 oasc.RequestHandlers.initHandlersFromConfig created dismax: solr.SearchHandler
[junit4:junit4]   2> 6418 T1772 oasc.RequestHandlers.initHandlersFromConfig created mock: org.apache.solr.core.MockQuerySenderListenerReqHandler
[junit4:junit4]   2> 6418 T1772 oasc.RequestHandlers.initHandlersFromConfig created /admin/: org.apache.solr.handler.admin.AdminHandlers
[junit4:junit4]   2> 6419 T1772 oasc.RequestHandlers.initHandlersFromConfig created defaults: solr.StandardRequestHandler
[junit4:junit4]   2> 6419 T1772 oasc.RequestHandlers.initHandlersFromConfig adding lazy requestHandler: solr.StandardRequestHandler
[junit4:junit4]   2> 6420 T1772 oasc.RequestHandlers.initHandlersFromConfig created lazy: solr.StandardRequestHandler
[junit4:junit4]   2> 6420 T1772 oasc.RequestHandlers.initHandlersFromConfig created /update: solr.UpdateRequestHandler
[junit4:junit4]   2> 6421 T1772 oasc.RequestHandlers.initHandlersFromConfig created /terms: org.apache.solr.handler.component.SearchHandler
[junit4:junit4]   2> 6421 T1772 oasc.RequestHandlers.initHandlersFromConfig created spellCheckCompRH: org.apache.solr.handler.component.SearchHandler
[junit4:junit4]   2> 6422 T1772 oasc.RequestHandlers.initHandlersFromConfig created spellCheckCompRH_Direct: org.apache.solr.handler.component.SearchHandler
[junit4:junit4]   2> 6422 T1772 oasc.RequestHandlers.initHandlersFromConfig created spellCheckWithWordbreak: org.apache.solr.handler.component.SearchHandler
[junit4:junit4]   2> 6423 T1772 oasc.RequestHandlers.initHandlersFromConfig created spellCheckWithWordbreak_Direct: org.apache.solr.handler.component.SearchHandler
[junit4:junit4]   2> 6423 T1772 oasc.RequestHandlers.initHandlersFromConfig created spellCheckCompRH1: org.apache.solr.handler.component.SearchHandler
[junit4:junit4]   2> 6424 T1772 oasc.RequestHandlers.initHandlersFromConfig created tvrh: org.apache.solr.handler.component.SearchHandler
[junit4:junit4]   2> 6424 T1772 oasc.RequestHandlers.initHandlersFromConfig created /mlt: solr.MoreLikeThisHandler
[junit4:junit4]   2> 6425 T1772 oasc.RequestHandlers.initHandlersFromConfig created /debug/dump: solr.DumpRequestHandler
[junit4:junit4]   2> 6428 T1772 oashl.XMLLoader.init xsltCacheLifetimeSeconds=60
[junit4:junit4]   2> 6432 T1772 oasc.SolrCore.initDeprecatedSupport WARNING solrconfig.xml uses deprecated <admin/gettableFiles>, Please update your config to use the ShowFileRequestHandler.
[junit4:junit4]   2> 6433 T1772 oasc.SolrCore.initDeprecatedSupport WARNING adding ShowFileRequestHandler with hidden files: [SCHEMA.XML, OLD_SYNONYMS.TXT, STOPWORDS.TXT, PROTWORDS.TXT, OPEN-EXCHANGE-RATES.JSON, SYNONYMS.TXT, CURRENCY.XML, MAPPING-ISOLATIN1ACCENT.TXT]
[junit4:junit4]   2> 6436 T1772 oass.SolrIndexSearcher.<init> Opening Searcher@30f60c15 main
[junit4:junit4]   2> 6437 T1772 oasu.CommitTracker.<init> Hard AutoCommit: disabled
[junit4:junit4]   2> 6437 T1772 oasu.CommitTracker.<init> Soft AutoCommit: disabled
[junit4:junit4]   2> 6438 T1772 oashc.SpellCheckComponent.inform Initializing spell checkers
[junit4:junit4]   2> 6444 T1772 oass.DirectSolrSpellChecker.init init: {name=direct,classname=DirectSolrSpellChecker,field=lowerfilt,minQueryLength=3}
[junit4:junit4]   2> 6492 T1819 oasc.SolrCore.registerSearcher [collection1] Registered new searcher Searcher@30f60c15 main{StandardDirectoryReader(segments_1:1)}
[junit4:junit4]   2> 6805 T1793 oascc.ZkStateReader.updateClusterState Updating cloud state from ZooKeeper... 
[junit4:junit4]   2> 6819 T1818 oascc.ZkStateReader$2.process A cluster state change has occurred - updating...
[junit4:junit4]   2> 6819 T1806 oascc.ZkStateReader$2.process A cluster state change has occurred - updating...
[junit4:junit4]   2> 6819 T1792 oascc.ZkStateReader$2.process A cluster state change has occurred - updating...
[junit4:junit4]   2> 6999 T1772 oasc.CoreContainer.register registering core: collection1
[junit4:junit4]   2> 6999 T1772 oasc.ZkController.register Register shard - core:collection1 address:http://127.0.0.1:28237/solr shardId:shard2
[junit4:junit4]   2> 7000 T1772 oascc.SolrZkClient.makePath makePath: /collections/collection1/leader_elect/shard2/election
[junit4:junit4]   2> 7014 T1777 oazs.PrepRequestProcessor.pRequest Got user-level KeeperException when processing sessionid:0x139e0fa80120004 type:delete cxid:0x41 zxid:0xfffffffffffffffe txntype:unknown reqpath:n/a Error Path:/solr/collections/collection1/leaders/shard2 Error:KeeperErrorCode = NoNode for /solr/collections/collection1/leaders/shard2
[junit4:junit4]   2> 7022 T1772 oasc.ShardLeaderElectionContext.runLeaderProcess Running the leader process.
[junit4:junit4]   2> 7023 T1777 oazs.PrepRequestProcessor.pRequest Got user-level KeeperException when processing sessionid:0x139e0fa80120004 type:create cxid:0x42 zxid:0xfffffffffffffffe txntype:unknown reqpath:n/a Error Path:/solr/overseer Error:KeeperErrorCode = NodeExists for /solr/overseer
[junit4:junit4]   2> 7031 T1772 oasc.ShardLeaderElectionContext.waitForReplicasToComeUp Enough replicas found to continue.
[junit4:junit4]   2> 7031 T1772 oasc.ShardLeaderElectionContext.runLeaderProcess I may be the new leader - try and sync
[junit4:junit4]   2> 7032 T1772 oasc.SyncStrategy.sync Sync replicas to http://127.0.0.1:28237/solr/collection1/
[junit4:junit4]   2> 7032 T1772 oasc.SyncStrategy.syncReplicas Sync Success - now sync replicas to me
[junit4:junit4]   2> 7032 T1772 oasc.SyncStrategy.syncToMe http://127.0.0.1:28237/solr/collection1/ has no replicas
[junit4:junit4]   2> 7032 T1772 oasc.ShardLeaderElectionContext.runLeaderProcess I am the new leader: http://127.0.0.1:28237/solr/collection1/
[junit4:junit4]   2> 7033 T1772 oascc.SolrZkClient.makePath makePath: /collections/collection1/leaders/shard2
[junit4:junit4]   2> 7042 T1777 oazs.PrepRequestProcessor.pRequest Got user-level KeeperException when processing sessionid:0x139e0fa80120004 type:create cxid:0x4b zxid:0xfffffffffffffffe txntype:unknown reqpath:n/a Error Path:/solr/overseer Error:KeeperErrorCode = NodeExists for /solr/overseer
[junit4:junit4]   2> 7323 T1793 oascc.ZkStateReader.updateClusterState Updating cloud state from ZooKeeper... 
[junit4:junit4]   2> 7332 T1792 oascc.ZkStateReader$2.process A cluster state change has occurred - updating...
[junit4:junit4]   2> 7332 T1818 oascc.ZkStateReader$2.process A cluster state change has occurred - updating...
[junit4:junit4]   2> 7332 T1806 oascc.ZkStateReader$2.process A cluster state change has occurred - updating...
[junit4:junit4]   2> 7360 T1772 oasc.ZkController.register We are http://127.0.0.1:28237/solr/collection1/ and leader is http://127.0.0.1:28237/solr/collection1/
[junit4:junit4]   2> 7360 T1772 oasc.ZkController.register No LogReplay needed for core=collection1 baseURL=http://127.0.0.1:28237/solr
[junit4:junit4]   2> 7361 T1772 oasc.ZkController.checkRecovery I am the leader, no recovery necessary
[junit4:junit4]   2> 7363 T1772 oascc.ZkStateReader.updateClusterState Updating cloud state from ZooKeeper... 
[junit4:junit4]   2> 7363 T1772 oass.SolrDispatchFilter.init user.dir=/usr/home/hudson/hudson-slave/workspace/Lucene-Solr-Tests-4.x-Java6/solr/build/solr-core/test/J1
[junit4:junit4]   2> 7364 T1772 oass.SolrDispatchFilter.init SolrDispatchFilter.init() done
[junit4:junit4]   2> 7364 T1772 oascsi.HttpClientUtil.createClient Creating new http client, config:maxConnections=128&maxConnectionsPerHost=32&followRedirects=false
[junit4:junit4]   2> 7744 T1772 oejs.Server.doStart jetty-8.1.2.v20120308
[junit4:junit4]   2> 7747 T1772 oejs.AbstractConnector.doStart Started SocketConnector@0.0.0.0:28254
[junit4:junit4]   2> 7747 T1772 oasc.SolrResourceLoader.locateSolrHome JNDI not configured for solr (NoInitialContextEx)
[junit4:junit4]   2> 7748 T1772 oasc.SolrResourceLoader.locateSolrHome using system property solr.solr.home: /usr/home/hudson/hudson-slave/workspace/Lucene-Solr-Tests-4.x-Java6/solr/build/solr-core/test/J1/./solrtest-jetty3-1348099284184
[junit4:junit4]   2> 7748 T1772 oasc.SolrResourceLoader.<init> new SolrResourceLoader for deduced Solr Home: '/usr/home/hudson/hudson-slave/workspace/Lucene-Solr-Tests-4.x-Java6/solr/build/solr-core/test/J1/./solrtest-jetty3-1348099284184/'
[junit4:junit4]   2> 7779 T1772 oass.SolrDispatchFilter.init SolrDispatchFilter.init()
[junit4:junit4]   2> 7779 T1772 oasc.SolrResourceLoader.locateSolrHome JNDI not configured for solr (NoInitialContextEx)
[junit4:junit4]   2> 7780 T1772 oasc.SolrResourceLoader.locateSolrHome using system property solr.solr.home: /usr/home/hudson/hudson-slave/workspace/Lucene-Solr-Tests-4.x-Java6/solr/build/solr-core/test/J1/./solrtest-jetty3-1348099284184
[junit4:junit4]   2> 7780 T1772 oasc.CoreContainer$Initializer.initialize looking for solr.xml: /usr/home/hudson/hudson-slave/workspace/Lucene-Solr-Tests-4.x-Java6/solr/build/solr-core/test/J1/./solrtest-jetty3-1348099284184/solr.xml
[junit4:junit4]   2> 7780 T1772 oasc.CoreContainer.<init> New CoreContainer 10434939
[junit4:junit4]   2> 7781 T1772 oasc.CoreContainer.load Loading CoreContainer using Solr Home: '/usr/home/hudson/hudson-slave/workspace/Lucene-Solr-Tests-4.x-Java6/solr/build/solr-core/test/J1/./solrtest-jetty3-1348099284184/'
[junit4:junit4]   2> 7781 T1772 oasc.SolrResourceLoader.<init> new SolrResourceLoader for directory: '/usr/home/hudson/hudson-slave/workspace/Lucene-Solr-Tests-4.x-Java6/solr/build/solr-core/test/J1/./solrtest-jetty3-1348099284184/'
[junit4:junit4]   2> 7801 T1772 oasc.CoreContainer.load Registering Log Listener
[junit4:junit4]   2> 7814 T1772 oasc.CoreContainer.initZooKeeper Zookeeper client=127.0.0.1:28218/solr
[junit4:junit4]   2> 7814 T1772 oaz.ZooKeeper.<init> Initiating client connection, connectString=127.0.0.1:28218/solr sessionTimeout=5000 watcher=org.apache.solr.common.cloud.ConnectionManager@65d1ec77
[junit4:junit4]   2> 7815 T1829 oaz.ClientCnxn$SendThread.startConnect Opening socket connection to server /127.0.0.1:28218
[junit4:junit4]   2> 7815 T1772 oascc.ConnectionManager.waitForConnected Waiting for client to connect to ZooKeeper
[junit4:junit4]   2> 7816 T1829 oaz.ClientCnxn$SendThread.primeConnection Socket connection established to localhost/127.0.0.1:28218, initiating session
[junit4:junit4]   2> 7816 T1774 oazs.NIOServerCnxn$Factory.run Accepted socket connection from /140.211.11.196:28256
[junit4:junit4]   2> 7816 T1774 oazs.NIOServerCnxn.readConnectRequest Client attempting to establish new session at /140.211.11.196:28256
[junit4:junit4]   2> 7818 T1776 oazs.NIOServerCnxn.finishSessionInit Established session 0x139e0fa80120005 with negotiated timeout 5000 for client /140.211.11.196:28256
[junit4:junit4]   2> 7818 T1829 oaz.ClientCnxn$SendThread.readConnectResult Session establishment complete on server localhost/127.0.0.1:28218, sessionid = 0x139e0fa80120005, negotiated timeout = 5000
[junit4:junit4]   2> 7818 T1830 oascc.ConnectionManager.process Watcher org.apache.solr.common.cloud.ConnectionManager@65d1ec77 name:ZooKeeperConnection Watcher:127.0.0.1:28218/solr got event WatchedEvent state:SyncConnected type:None path:null path:null type:None
[junit4:junit4]   2> 7819 T1772 oascc.ConnectionManager.waitForConnected Client is connected to ZooKeeper
[junit4:junit4]   2> 7819 T1777 oazs.PrepRequestProcessor.pRequest Got user-level KeeperException when processing sessionid:0x139e0fa80120005 type:create cxid:0x1 zxid:0xfffffffffffffffe txntype:unknown reqpath:n/a Error Path:/solr/overseer Error:KeeperErrorCode = NodeExists for /solr/overseer
[junit4:junit4]   2> 7821 T1777 oazs.PrepRequestProcessor.pRequest Got user-level KeeperException when processing sessionid:0x139e0fa80120005 type:create cxid:0x2 zxid:0xfffffffffffffffe txntype:unknown reqpath:n/a Error Path:/solr/overseer Error:KeeperErrorCode = NodeExists for /solr/overseer
[junit4:junit4]   2> 7830 T1772 oasc.ZkController.createEphemeralLiveNode Register node as live in ZooKeeper:/live_nodes/127.0.0.1:28254_solr
[junit4:junit4]   2> 7831 T1777 oazs.PrepRequestProcessor.pRequest Got user-level KeeperException when processing sessionid:0x139e0fa80120005 type:delete cxid:0x4 zxid:0xfffffffffffffffe txntype:unknown reqpath:n/a Error Path:/solr/live_nodes/127.0.0.1:28254_solr Error:KeeperErrorCode = NoNode for /solr/live_nodes/127.0.0.1:28254_solr
[junit4:junit4]   2> 7839 T1772 oascc.SolrZkClient.makePath makePath: /live_nodes/127.0.0.1:28254_solr
[junit4:junit4]   2> 7840 T1793 oascc.ZkStateReader.updateClusterState Updating cloud state from ZooKeeper... 
[junit4:junit4]   2> 7847 T1818 oascc.ZkStateReader$3.process Updating live nodes
[junit4:junit4]   2> 7847 T1806 oascc.ZkStateReader$3.process Updating live nodes
[junit4:junit4]   2> 7847 T1792 oascc.ZkStateReader$3.process Updating live nodes
[junit4:junit4]   2> 7848 T1772 oashc.HttpShardHandlerFactory.getParameter Setting socketTimeout to: 0
[junit4:junit4]   2> 7848 T1772 oashc.HttpShardHandlerFactory.getParameter Setting urlScheme to: http://
[junit4:junit4]   2> 7849 T1772 oashc.HttpShardHandlerFactory.getParameter Setting connTimeout to: 0
[junit4:junit4]   2> 7849 T1772 oashc.HttpShardHandlerFactory.getParameter Setting maxConnectionsPerHost to: 20
[junit4:junit4]   2> 7850 T1772 oashc.HttpShardHandlerFactory.getParameter Setting corePoolSize to: 0
[junit4:junit4]   2> 7850 T1772 oashc.HttpShardHandlerFactory.getParameter Setting maximumPoolSize to: 2147483647
[junit4:junit4]   2> 7851 T1772 oashc.HttpShardHandlerFactory.getParameter Setting maxThreadIdleTime to: 5
[junit4:junit4]   2> 7851 T1772 oashc.HttpShardHandlerFactory.getParameter Setting sizeOfQueue to: -1
[junit4:junit4]   2> 7852 T1772 oashc.HttpShardHandlerFactory.getParameter Setting fairnessPolicy to: false
[junit4:junit4]   2> 7852 T1772 oascsi.HttpClientUtil.createClient Creating new http client, config:maxConnectionsPerHost=20&maxConnections=10000&socketTimeout=0&connTimeout=0&retry=false
[junit4:junit4]   2> 7858 T1818 oascc.ZkStateReader$2.process A cluster state change has occurred - updating...
[junit4:junit4]   2> 7858 T1806 oascc.ZkStateReader$2.process A cluster state change has occurred - updating...
[junit4:junit4]   2> 7861 T1792 oascc.ZkStateReader$2.process A cluster state change has occurred - updating...
[junit4:junit4]   2> 7871 T1772 oascc.ZkStateReader.createClusterStateWatchersAndUpdate Updating cluster state from ZooKeeper... 
[junit4:junit4]   2> 7878 T1772 oasc.CoreContainer.create Creating SolrCore 'collection1' using instanceDir: /usr/home/hudson/hudson-slave/workspace/Lucene-Solr-Tests-4.x-Java6/solr/build/solr-core/test/J1/./solrtest-jetty3-1348099284184/collection1
[junit4:junit4]   2> 7879 T1772 oasc.ZkController.createCollectionZkNode Check for collection zkNode:collection1
[junit4:junit4]   2> 7880 T1772 oasc.ZkController.createCollectionZkNode Collection zkNode exists
[junit4:junit4]   2> 7880 T1772 oasc.ZkController.readConfigName Load collection config from:/collections/collection1
[junit4:junit4]   2> 7882 T1772 oasc.SolrResourceLoader.<init> new SolrResourceLoader for directory: '/usr/home/hudson/hudson-slave/workspace/Lucene-Solr-Tests-4.x-Java6/solr/build/solr-core/test/J1/./solrtest-jetty3-1348099284184/collection1/'
[junit4:junit4]   2> 7883 T1772 oasc.SolrResourceLoader.replaceClassLoader Adding 'file:/usr/home/hudson/hudson-slave/workspace/Lucene-Solr-Tests-4.x-Java6/solr/build/solr-core/test/J1/solrtest-jetty3-1348099284184/collection1/lib/classes/' to classloader
[junit4:junit4]   2> 7884 T1772 oasc.SolrResourceLoader.replaceClassLoader Adding 'file:/usr/home/hudson/hudson-slave/workspace/Lucene-Solr-Tests-4.x-Java6/solr/build/solr-core/test/J1/solrtest-jetty3-1348099284184/collection1/lib/README' to classloader
[junit4:junit4]   2> 7936 T1772 oasc.SolrConfig.<init> Using Lucene MatchVersion: LUCENE_40
[junit4:junit4]   2> 8013 T1772 oasc.SolrConfig.<init> Loaded SolrConfig: solrconfig.xml
[junit4:junit4]   2> 8114 T1772 oass.IndexSchema.readSchema Reading Solr Schema
[junit4:junit4]   2> 8121 T1772 oass.IndexSchema.readSchema Schema name=test
[junit4:junit4]   2> 8783 T1772 oass.OpenExchangeRatesOrgProvider.init Initialized with rates=open-exchange-rates.json, refreshInterval=1440.
[junit4:junit4]   2> 8796 T1772 oass.IndexSchema.readSchema default search field in schema is text
[junit4:junit4]   2> 8801 T1772 oass.IndexSchema.readSchema unique key field: id
[junit4:junit4]   2> 8815 T1772 oass.FileExchangeRateProvider.reload Reloading exchange rates from file currency.xml
[junit4:junit4]   2> 8820 T1772 oass.FileExchangeRateProvider.reload Reloading exchange rates from file currency.xml
[junit4:junit4]   2> 8825 T1772 oass.OpenExchangeRatesOrgProvider.reload Reloading exchange rates from open-exchange-rates.json
[junit4:junit4]   2> 8826 T1772 oass.OpenExchangeRatesOrgProvider.reload Reloading exchange rates from open-exchange-rates.json
[junit4:junit4]   2> 8828 T1772 oasc.SolrCore.<init> [collection1] Opening new SolrCore at /usr/home/hudson/hudson-slave/workspace/Lucene-Solr-Tests-4.x-Java6/solr/build/solr-core/test/J1/./solrtest-jetty3-1348099284184/collection1/, dataDir=./org.apache.solr.cloud.BasicDistributedZk2Test-1348099276813/jetty3/
[junit4:junit4]   2> 8828 T1772 oasc.JmxMonitoredMap.<init> JMX monitoring is enabled. Adding Solr mbeans to JMX Server: com.sun.jmx.mbeanserver.JmxMBeanServer@4f682a53
[junit4:junit4]   2> 8830 T1772 oasc.SolrCore.getNewIndexDir WARNING New index directory detected: old=null new=./org.apache.solr.cloud.BasicDistributedZk2Test-1348099276813/jetty3/index/
[junit4:junit4]   2> 8831 T1772 oasc.SolrCore.initIndex WARNING [collection1] Solr index directory './org.apache.solr.cloud.BasicDistributedZk2Test-1348099276813/jetty3/index' doesn't exist. Creating new index...
[junit4:junit4]   2> 8832 T1772 oasc.CachingDirectoryFactory.get return new directory for /usr/home/hudson/hudson-slave/workspace/Lucene-Solr-Tests-4.x-Java6/solr/build/solr-core/test/J1/./org.apache.solr.cloud.BasicDistributedZk2Test-1348099276813/jetty3/index forceNew:false
[junit4:junit4]   2> 8864 T1772 oasc.SolrDeletionPolicy.onCommit SolrDeletionPolicy.onCommit: commits:num=1
[junit4:junit4]   2> 		commit{dir=/usr/home/hudson/hudson-slave/workspace/Lucene-Solr-Tests-4.x-Java6/solr/build/solr-core/test/J1/org.apache.solr.cloud.BasicDistributedZk2Test-1348099276813/jetty3/index,segFN=segments_1,generation=1,filenames=[segments_1]
[junit4:junit4]   2> 8865 T1772 oasc.SolrDeletionPolicy.updateCommits newest commit = 1
[junit4:junit4]   2> 8865 T1772 oasc.SolrCore.initWriters created xml: solr.XMLResponseWriter
[junit4:junit4]   2> 8868 T1772 oasup.UpdateRequestProcessorChain.init inserting DistributedUpdateProcessorFactory into updateRequestProcessorChain "dedupe"
[junit4:junit4]   2> 8868 T1772 oasup.UpdateRequestProcessorChain.init inserting DistributedUpdateProcessorFactory into updateRequestProcessorChain "dedupe-allfields"
[junit4:junit4]   2> 8869 T1772 oasup.UpdateRequestProcessorChain.init inserting DistributedUpdateProcessorFactory into updateRequestProcessorChain "stored_sig"
[junit4:junit4]   2> 8869 T1772 oasup.UpdateRequestProcessorChain.init inserting DistributedUpdateProcessorFactory into updateRequestProcessorChain "uniq-fields"
[junit4:junit4]   2> 8870 T1772 oasup.UpdateRequestProcessorChain.init inserting DistributedUpdateProcessorFactory into updateRequestProcessorChain "distrib-dup-test-chain-implicit"
[junit4:junit4]   2> 8871 T1772 oasc.RequestHandlers.initHandlersFromConfig adding lazy requestHandler: solr.ReplicationHandler
[junit4:junit4]   2> 8871 T1772 oasc.RequestHandlers.initHandlersFromConfig created /replication: solr.ReplicationHandler
[junit4:junit4]   2> 8872 T1772 oasc.RequestHandlers.initHandlersFromConfig created standard: solr.StandardRequestHandler
[junit4:junit4]   2> 8873 T1772 oasc.RequestHandlers.initHandlersFromConfig created /get: solr.RealTimeGetHandler
[junit4:junit4]   2> 8873 T1772 oasc.RequestHandlers.initHandlersFromConfig created dismax: solr.SearchHandler
[junit4:junit4]   2> 8874 T1772 oasc.RequestHandlers.initHandlersFromConfig created mock: org.apache.solr.core.MockQuerySenderListenerReqHandler
[junit4:junit4]   2> 8875 T1772 oasc.RequestHandlers.initHandlersFromConfig created /admin/: org.apache.solr.handler.admin.AdminHandlers
[junit4:junit4]   2> 8875 T1772 oasc.RequestHandlers.initHandlersFromConfig created defaults: solr.StandardRequestHandler
[junit4:junit4]   2> 8876 T1772 oasc.RequestHandlers.initHandlersFromConfig adding lazy requestHandler: solr.StandardRequestHandler
[junit4:junit4]   2> 8876 T1772 oasc.RequestHandlers.initHandlersFromConfig created lazy: solr.StandardRequestHandler
[junit4:junit4]   2> 8877 T1772 oasc.RequestHandlers.initHandlersFromConfig created /update: solr.UpdateRequestHandler
[junit4:junit4]   2> 8878 T1772 oasc.RequestHandlers.initHandlersFromConfig created /terms: org.apache.solr.handler.component.SearchHandler
[junit4:junit4]   2> 8878 T1772 oasc.RequestHandlers.initHandlersFromConfig created spellCheckCompRH: org.apache.solr.handler.component.SearchHandler
[junit4:junit4]   2> 8879 T1772 oasc.RequestHandlers.initHandlersFromConfig created spellCheckCompRH_Direct: org.apache.solr.handler.component.SearchHandler
[junit4:junit4]   2> 8880 T1772 oasc.RequestHandlers.initHandlersFromConfig created spellCheckWithWordbreak: org.apache.solr.handler.component.SearchHandler
[junit4:junit4]   2> 8880 T1772 oasc.RequestHandlers.initHandlersFromConfig created spellCheckWithWordbreak_Direct: org.apache.solr.handler.component.SearchHandler
[junit4:junit4]   2> 8881 T1772 oasc.RequestHandlers.initHandlersFromConfig created spellCheckCompRH1: org.apache.solr.handler.component.SearchHandler
[junit4:junit4]   2> 8882 T1772 oasc.RequestHandlers.initHandlersFromConfig created tvrh: org.apache.solr.handler.component.SearchHandler
[junit4:junit4]   2> 8883 T1772 oasc.RequestHandlers.initHandlersFromConfig created /mlt: solr.MoreLikeThisHandler
[junit4:junit4]   2> 8883 T1772 oasc.RequestHandlers.initHandlersFromConfig created /debug/dump: solr.DumpRequestHandler
[junit4:junit4]   2> 8887 T1772 oashl.XMLLoader.init xsltCacheLifetimeSeconds=60
[junit4:junit4]   2> 8892 T1772 oasc.SolrCore.initDeprecatedSupport WARNING solrconfig.xml uses deprecated <admin/gettableFiles>, Please update your config to use the ShowFileRequestHandler.
[junit4:junit4]   2> 8893 T1772 oasc.SolrCore.initDeprecatedSupport WARNING adding ShowFileRequestHandler with hidden files: [SCHEMA.XML, OLD_SYNONYMS.TXT, STOPWORDS.TXT, PROTWORDS.TXT, OPEN-EXCHANGE-RATES.JSON, SYNONYMS.TXT, CURRENCY.XML, MAPPING-ISOLATIN1ACCENT.TXT]
[junit4:junit4]   2> 8897 T1772 oass.SolrIndexSearcher.<init> Opening Searcher@167f420a main
[junit4:junit4]   2> 8898 T1772 oasu.CommitTracker.<init> Hard AutoCommit: disabled
[junit4:junit4]   2> 8899 T1772 oasu.CommitTracker.<init> Soft AutoCommit: disabled
[junit4:junit4]   2> 8900 T1772 oashc.SpellCheckComponent.inform Initializing spell checkers
[junit4:junit4]   2> 8907 T1772 oass.DirectSolrSpellChecker.init init: {name=direct,classname=DirectSolrSpellChecker,field=lowerfilt,minQueryLength=3}
[junit4:junit4]   2> 8968 T1831 oasc.SolrCore.registerSearcher [collection1] Registered new searcher Searcher@167f420a main{StandardDirectoryReader(segments_1:1)}
[junit4:junit4]   2> 9367 T1793 oascc.ZkStateReader.updateClusterState Updating cloud state from ZooKeeper... 
[junit4:junit4]   2> 9387 T1792 oascc.ZkStateReader$2.process A cluster state change has occurred - updating...
[junit4:junit4]   2> 9387 T1818 oascc.ZkStateReader$2.process A cluster state change has occurred - updating...
[junit4:junit4]   2> 9387 T1830 oascc.ZkStateReader$2.process A cluster state change has occurred - updating...
[junit4:junit4]   2> 9387 T1806 oascc.ZkStateReader$2.process A cluster state change has occurred - updating...
[junit4:junit4]   2> 9475 T1772 oasc.CoreContainer.register registering core: collection1
[junit4:junit4]   2> 9475 T1772 oasc.ZkController.register Register shard - core:collection1 address:http://127.0.0.1:28254/solr shardId:shard1
[junit4:junit4]   2> 9479 T1772 oasc.ZkController.register We are http://127.0.0.1:28254/solr/collection1/ and leader is http://127.0.0.1:28229/solr/collection1/
[junit4:junit4]   2> 9479 T1772 oasc.ZkController.register No LogReplay needed for core=collection1 baseURL=http://127.0.0.1:28254/solr
[junit4:junit4]   2> 9480 T1772 oasc.ZkController.checkRecovery Core needs to recover:collection1
[junit4:junit4]   2> 9480 T1772 oasu.DefaultSolrCoreState.doRecovery Running recovery - first canceling any ongoing recovery
[junit4:junit4]   2> ASYNC  NEW_CORE C164 name=collection1 org.apache.solr.core.SolrCore@113e3c72 url=http://127.0.0.1:28254/solr/collection1 node=127.0.0.1:28254_solr
[junit4:junit4]   2> 9481 T1832 C164 P28254 oasc.RecoveryStrategy.run Starting recovery process.  core=collection1 recoveringAfterStartup=true
[junit4:junit4]   2> 9482 T1832 C164 P28254 oasc.RecoveryStrategy.doRecovery ###### startupVersions=[]
[junit4:junit4]   2> 9482 T1772 oascc.ZkStateReader.updateClusterState Updating cloud state from ZooKeeper... 
[junit4:junit4]   2> 9483 T1832 C164 P28254 oasc.RecoveryStrategy.doRecovery Attempting to PeerSync from http://127.0.0.1:28229/solr/collection1/ core=collection1 - recoveringAfterStartup=true
[junit4:junit4]   2> 9483 T1832 C164 P28254 oasu.PeerSync.sync PeerSync: core=collection1 url=http://127.0.0.1:28254/solr START replicas=[http://127.0.0.1:28229/solr/collection1/] nUpdates=100
[junit4:junit4]   2> 9483 T1772 oass.SolrDispatchFilter.init user.dir=/usr/home/hudson/hudson-slave/workspace/Lucene-Solr-Tests-4.x-Java6/solr/build/solr-core/test/J1
[junit4:junit4]   2> 9484 T1832 C164 P28254 oasu.PeerSync.sync WARNING no frame of reference to tell of we've missed updates
[junit4:junit4]   2> 9484 T1772 oass.SolrDispatchFilter.init SolrDispatchFilter.init() done
[junit4:junit4]   2> 9484 T1832 C164 P28254 oasc.RecoveryStrategy.doRecovery PeerSync Recovery was not successful - trying replication. core=collection1
[junit4:junit4]   2> 9484 T1832 C164 P28254 oasc.RecoveryStrategy.doRecovery Starting Replication Recovery. core=collection1
[junit4:junit4]   2> 9484 T1832 C164 P28254 oascsi.HttpClientUtil.createClient Creating new http client, config:maxConnections=128&maxConnectionsPerHost=32&followRedirects=false
[junit4:junit4]   2> 9484 T1772 oascsi.HttpClientUtil.createClient Creating new http client, config:maxConnections=128&maxConnectionsPerHost=32&followRedirects=false
[junit4:junit4]   2> ASYNC  NEW_CORE C165 name=collection1 org.apache.solr.core.SolrCore@6c034090 url=http://127.0.0.1:28229/solr/collection1 node=127.0.0.1:28229_solr
[junit4:junit4]   2> 9493 T1798 C165 P28229 REQ /get {distrib=false&qt=/get&wt=javabin&version=2&getVersions=100} status=0 QTime=0 
[junit4:junit4]   2> 9891 T1793 oascc.ZkStateReader.updateClusterState Updating cloud state from ZooKeeper... 
[junit4:junit4]   2> 9952 T1792 oascc.ZkStateReader$2.process A cluster state change has occurred - updating...
[junit4:junit4]   2> 9952 T1806 oascc.ZkStateReader$2.process A cluster state change has occurred - updating...
[junit4:junit4]   2> 9952 T1830 oascc.ZkStateReader$2.process A cluster state change has occurred - updating...
[junit4:junit4]   2> 9952 T1818 oascc.ZkStateReader$2.process A cluster state change has occurred - updating...
[junit4:junit4]   2> 10026 T1772 oejs.Server.doStart jetty-8.1.2.v20120308
[junit4:junit4]   2> 10028 T1772 oejs.AbstractConnector.doStart Started SocketConnector@0.0.0.0:28284
[junit4:junit4]   2> 10029 T1772 oasc.SolrResourceLoader.locateSolrHome JNDI not configured for solr (NoInitialContextEx)
[junit4:junit4]   2> 10030 T1772 oasc.SolrResourceLoader.locateSolrHome using system property solr.solr.home: /usr/home/hudson/hudson-slave/workspace/Lucene-Solr-Tests-4.x-Java6/solr/build/solr-core/test/J1/./solrtest-jetty4-1348099286310
[junit4:junit4]   2> 10030 T1772 oasc.SolrResourceLoader.<init> new SolrResourceLoader for deduced Solr Home: '/usr/home/hudson/hudson-slave/workspace/Lucene-Solr-Tests-4.x-Java6/solr/build/solr-core/test/J1/./solrtest-jetty4-1348099286310/'
[junit4:junit4]   2> 10069 T1772 oass.SolrDispatchFilter.init SolrDispatchFilter.init()
[junit4:junit4]   2> 10070 T1772 oasc.SolrResourceLoader.locateSolrHome JNDI not configured for solr (NoInitialContextEx)
[junit4:junit4]   2> 10071 T1772 oasc.SolrResourceLoader.locateSolrHome using system property solr.solr.home: /usr/home/hudson/hudson-slave/workspace/Lucene-Solr-Tests-4.x-Java6/solr/build/solr-core/test/J1/./solrtest-jetty4-1348099286310
[junit4:junit4]   2> 10071 T1772 oasc.CoreContainer$Initializer.initialize looking for solr.xml: /usr/home/hudson/hudson-slave/workspace/Lucene-Solr-Tests-4.x-Java6/solr/build/solr-core/test/J1/./solrtest-jetty4-1348099286310/solr.xml
[junit4:junit4]   2> 10071 T1772 oasc.CoreContainer.<init> New CoreContainer 1874465856
[junit4:junit4]   2> 10072 T1772 oasc.CoreContainer.load Loading CoreContainer using Solr Home: '/usr/home/hudson/hudson-slave/workspace/Lucene-Solr-Tests-4.x-Java6/solr/build/solr-core/test/J1/./solrtest-jetty4-1348099286310/'
[junit4:junit4]   2> 10073 T1772 oasc.SolrResourceLoader.<init> new SolrResourceLoader for directory: '/usr/home/hudson/hudson-slave/workspace/Lucene-Solr-Tests-4.x-Java6/solr/build/solr-core/test/J1/./solrtest-jetty4-1348099286310/'
[junit4:junit4]   2> 10100 T1772 oasc.CoreContainer.load Registering Log Listener
[junit4:junit4]   2> 10116 T1772 oasc.CoreContainer.initZooKeeper Zookeeper client=127.0.0.1:28218/solr
[junit4:junit4]   2> 10117 T1772 oaz.ZooKeeper.<init> Initiating client connection, connectString=127.0.0.1:28218/solr sessionTimeout=5000 watcher=org.apache.solr.common.cloud.ConnectionManager@52f5d154
[junit4:junit4]   2> 10118 T1843 oaz.ClientCnxn$SendThread.startConnect Opening socket connection to server /127.0.0.1:28218
[junit4:junit4]   2> 10118 T1772 oascc.ConnectionManager.waitForConnected Waiting for client to connect to ZooKeeper
[junit4:junit4]   2> 10119 T1843 oaz.ClientCnxn$SendThread.primeConnection Socket connection established to localhost/127.0.0.1:28218, initiating session
[junit4:junit4]   2> 10119 T1774 oazs.NIOServerCnxn$Factory.run Accepted socket connection from /140.211.11.196:28286
[junit4:junit4]   2> 10120 T1774 oazs.NIOServerCnxn.readConnectRequest Client attempting to establish new session at /140.211.11.196:28286
[junit4:junit4]   2> 10121 T1776 oazs.NIOServerCnxn.finishSessionInit Established session 0x139e0fa80120006 with negotiated timeout 5000 for client /140.211.11.196:28286
[junit4:junit4]   2> 10121 T1843 oaz.ClientCnxn$SendThread.readConnectResult Session establishment complete on server localhost/127.0.0.1:28218, sessionid = 0x139e0fa80120006, negotiated timeout = 5000
[junit4:junit4]   2> 10122 T1844 oascc.ConnectionManager.process Watcher org.apache.solr.common.cloud.ConnectionManager@52f5d154 name:ZooKeeperConnection Watcher:127.0.0.1:28218/solr got event WatchedEvent state:SyncConnected type:None path:null path:null type:None
[junit4:junit4]   2> 10122 T1772 oascc.ConnectionManager.waitForConnected Client is connected to ZooKeeper
[junit4:junit4]   2> 10123 T1777 oazs.PrepRequestProcessor.pRequest Got user-level KeeperException when processing sessionid:0x139e0fa80120006 type:create cxid:0x1 zxid:0xfffffffffffffffe txntype:unknown reqpath:n/a Error Path:/solr/overseer Error:KeeperErrorCode = NodeExists for /solr/overseer
[junit4:junit4]   2> 10124 T1777 oazs.PrepRequestProcessor.pRequest Got user-level KeeperException when processing sessionid:0x139e0fa80120006 type:create cxid:0x2 zxid:0xfffffffffffffffe txntype:unknown reqpath:n/a Error Path:/solr/overseer Error:KeeperErrorCode = NodeExists for /solr/overseer
[junit4:junit4]   2> 10126 T1772 oasc.ZkController.createEphemeralLiveNode Register node as live in ZooKeeper:/live_nodes/127.0.0.1:28284_solr
[junit4:junit4]   2> 10127 T1777 oazs.PrepRequestProcessor.pRequest Got user-level KeeperException when processing sessionid:0x139e0fa80120006 type:delete cxid:0x4 zxid:0xfffffffffffffffe txntype:unknown reqpath:n/a Error Path:/solr/live_nodes/127.0.0.1:28284_solr Error:KeeperErrorCode = NoNode for /solr/live_nodes/127.0.0.1:28284_solr
[junit4:junit4]   2> 10137 T1772 oascc.SolrZkClient.makePath makePath: /live_nodes/127.0.0.1:28284_solr
[junit4:junit4]   2> 10163 T1806 oascc.ZkStateReader$3.process Updating live nodes
[junit4:junit4]   2> 10163 T1830 oascc.ZkStateReader$3.process Updating live nodes
[junit4:junit4]   2> 10163 T1818 oascc.ZkStateReader$3.process Updating live nodes
[junit4:junit4]   2> 10163 T1792 oascc.ZkStateReader$3.process Updating live nodes
[junit4:junit4]   2> 10164 T1772 oashc.HttpShardHandlerFactory.getParameter Setting socketTimeout to: 0
[junit4:junit4]   2> 10165 T1772 oashc.HttpShardHandlerFactory.getParameter Setting urlScheme to: http://
[junit4:junit4]   2> 10165 T1772 oashc.HttpShardHandlerFactory.getParameter Setting connTimeout to: 0
[junit4:junit4]   2> 10166 T1772 oashc.HttpShardHandlerFactory.getParameter Setting maxConnectionsPerHost to: 20
[junit4:junit4]   2> 10166 T1772 oashc.HttpShardHandlerFactory.getParameter Setting corePoolSize to: 0
[junit4:junit4]   2> 10167 T1772 oashc.HttpShardHandlerFactory.getParameter Setting maximumPoolSize to: 2147483647
[junit4:junit4]   2> 10167 T1772 oashc.HttpShardHandlerFactory.getParameter Setting maxThreadIdleTime to: 5
[junit4:junit4]   2> 10168 T1772 oashc.HttpShardHandlerFactory.getParameter Setting sizeOfQueue to: -1
[junit4:junit4]   2> 10168 T1772 oashc.HttpShardHandlerFactory.getParameter Setting fairnessPolicy to: false
[junit4:junit4]   2> 10169 T1772 oascsi.HttpClientUtil.createClient Creating new http client, config:maxConnectionsPerHost=20&maxConnections=10000&socketTimeout=0&connTimeout=0&retry=false
[junit4:junit4]   2> 10215 T1772 oascc.ZkStateReader.createClusterStateWatchersAndUpdate Updating cluster state from ZooKeeper... 
[junit4:junit4]   2> 10223 T1772 oasc.CoreContainer.create Creating SolrCore 'collection1' using instanceDir: /usr/home/hudson/hudson-slave/workspace/Lucene-Solr-Tests-4.x-Java6/solr/build/solr-core/test/J1/./solrtest-jetty4-1348099286310/collection1
[junit4:junit4]   2> 10224 T1772 oasc.ZkController.createCollectionZkNode Check for collection zkNode:collection1
[junit4:junit4]   2> 10224 T1772 oasc.ZkController.createCollectionZkNode Collection zkNode exists
[junit4:junit4]   2> 10225 T1772 oasc.ZkController.readConfigName Load collection config from:/collections/collection1
[junit4:junit4]   2> 10227 T1772 oasc.SolrResourceLoader.<init> new SolrResourceLoader for directory: '/usr/home/hudson/hudson-slave/workspace/Lucene-Solr-Tests-4.x-Java6/solr/build/solr-core/test/J1/./solrtest-jetty4-1348099286310/collection1/'
[junit4:junit4]   2> 10228 T1772 oasc.SolrResourceLoader.replaceClassLoader Adding 'file:/usr/home/hudson/hudson-slave/workspace/Lucene-Solr-Tests-4.x-Java6/solr/build/solr-core/test/J1/solrtest-jetty4-1348099286310/collection1/lib/README' to classloader
[junit4:junit4]   2> 10229 T1772 oasc.SolrResourceLoader.replaceClassLoader Adding 'file:/usr/home/hudson/hudson-slave/workspace/Lucene-Solr-Tests-4.x-Java6/solr/build/solr-core/test/J1/solrtest-jetty4-1348099286310/collection1/lib/classes/' to classloader
[junit4:junit4]   2> 10281 T1772 oasc.SolrConfig.<init> Using Lucene MatchVersion: LUCENE_40
[junit4:junit4]   2> 10362 T1772 oasc.SolrConfig.<init> Loaded SolrConfig: solrconfig.xml
[junit4:junit4]   2> 10463 T1772 oass.IndexSchema.readSchema Reading Solr Schema
[junit4:junit4]   2> 10470 T1772 oass.IndexSchema.readSchema Schema name=test
[junit4:junit4]   2> 11159 T1772 oass.OpenExchangeRatesOrgProvider.init Initialized with rates=open-exchange-rates.json, refreshInterval=1440.
[junit4:junit4]   2> 11172 T1772 oass.IndexSchema.readSchema default search field in schema is text
[junit4:junit4]   2> 11178 T1772 oass.IndexSchema.readSchema unique key field: id
[junit4:junit4]   2> 11192 T1772 oass.FileExchangeRateProvider.reload Reloading exchange rates from file currency.xml
[junit4:junit4]   2> 11198 T1772 oass.FileExchangeRateProvider.reload Reloading exchange rates from file currency.xml
[junit4:junit4]   2> 11203 T1772 oass.OpenExchangeRatesOrgProvider.reload Reloading exchange rates from open-exchange-rates.json
[junit4:junit4]   2> 11204 T1772 oass.OpenExchangeRatesOrgProvider.reload Reloading exchange rates from open-exchange-rates.json
[junit4:junit4]   2> 11206 T1772 oasc.SolrCore.<init> [collection1] Opening new SolrCore at /usr/home/hudson/hudson-slave/workspace/Lucene-Solr-Tests-4.x-Java6/solr/build/solr-core/test/J1/./solrtest-jetty4-1348099286310/collection1/, dataDir=./org.apache.solr.cloud.BasicDistributedZk2Test-1348099276813/jetty4/
[junit4:junit4]   2> 11206 T1772 oasc.JmxMonitoredMap.<init> JMX monitoring is enabled. Adding Solr mbeans to JMX Server: com.sun.jmx.mbeanserver.JmxMBeanServer@4f682a53
[junit4:junit4]   2> 11208 T1772 oasc.SolrCore.getNewIndexDir WARNING New index directory detected: old=null new=./org.apache.solr.cloud.BasicDistributedZk2Test-1348099276813/jetty4/index/
[junit4:junit4]   2> 11209 T1772 oasc.SolrCore.initIndex WARNING [collection1] Solr index directory './org.apache.solr.cloud.BasicDistributedZk2Test-1348099276813/jetty4/index' doesn't exist. Creating new index...
[junit4:junit4]   2> 11210 T1772 oasc.CachingDirectoryFactory.get return new directory for /usr/home/hudson/hudson-slave/workspace/Lucene-Solr-Tests-4.x-Java6/solr/build/solr-core/test/J1/./org.apache.solr.cloud.BasicDistributedZk2Test-1348099276813/jetty4/index forceNew:false
[junit4:junit4]   2> 11216 T1772 oasc.SolrDeletionPolicy.onCommit SolrDeletionPolicy.onCommit: commits:num=1
[junit4:junit4]   2> 		commit{dir=/usr/home/hudson/hudson-slave/workspace/Lucene-Solr-Tests-4.x-Java6/solr/build/solr-core/test/J1/org.apache.solr.cloud.BasicDistributedZk2Test-1348099276813/jetty4/index,segFN=segments_1,generation=1,filenames=[segments_1]
[junit4:junit4]   2> 11217 T1772 oasc.SolrDeletionPolicy.updateCommits newest commit = 1
[junit4:junit4]   2> 11218 T1772 oasc.SolrCore.initWriters created xml: solr.XMLResponseWriter
[junit4:junit4]   2> 11220 T1772 oasup.UpdateRequestProcessorChain.init inserting DistributedUpdateProcessorFactory into updateRequestProcessorChain "dedupe"
[junit4:junit4]   2> 11221 T1772 oasup.UpdateRequestProcessorChain.init inserting DistributedUpdateProcessorFactory into updateRequestProcessorChain "dedupe-allfields"
[junit4:junit4]   2> 11221 T1772 oasup.UpdateRequestProcessorChain.init inserting DistributedUpdateProcessorFactory into updateRequestProcessorChain "stored_sig"
[junit4:junit4]   2> 11222 T1772 oasup.UpdateRequestProcessorChain.init inserting DistributedUpdateProcessorFactory into updateRequestProcessorChain "uniq-fields"
[junit4:junit4]   2> 11223 T1772 oasup.UpdateRequestProcessorChain.init inserting DistributedUpdateProcessorFactory into updateRequestProcessorChain "distrib-dup-test-chain-implicit"
[junit4:junit4]   2> 11223 T1772 oasc.RequestHandlers.initHandlersFromConfig adding lazy requestHandler: solr.ReplicationHandler
[junit4:junit4]   2> 11224 T1772 oasc.RequestHandlers.initHandlersFromConfig created /replication: solr.ReplicationHandler
[junit4:junit4]   2> 11225 T1772 oasc.RequestHandlers.initHandlersFromConfig created standard: solr.StandardRequestHandler
[junit4:junit4]   2> 11225 T1772 oasc.RequestHandlers.initHandlersFromConfig created /get: solr.RealTimeGetHandler
[junit4:junit4]   2> 11226 T1772 oasc.RequestHandlers.initHandlersFromConfig created dismax: solr.SearchHandler
[junit4:junit4]   2> 11227 T1772 oasc.RequestHandlers.initHandlersFromConfig created mock: org.apache.solr.core.MockQuerySenderListenerReqHandler
[junit4:junit4]   2> 11228 T1772 oasc.RequestHandlers.initHandlersFromConfig created /admin/: org.apache.solr.handler.admin.AdminHandlers
[junit4:junit4]   2> 11228 T1772 oasc.RequestHandlers.initHandlersFromConfig created defaults: solr.StandardRequestHandler
[junit4:junit4]   2> 11229 T1772 oasc.RequestHandlers.initHandlersFromConfig adding lazy requestHandler: solr.StandardRequestHandler
[junit4:junit4]   2> 11229 T1772 oasc.RequestHandlers.initHandlersFromConfig created lazy: solr.StandardRequestHandler
[junit4:junit4]   2> 11230 T1772 oasc.RequestHandlers.initHandlersFromConfig created /update: solr.UpdateRequestHandler
[junit4:junit4]   2> 11231 T1772 oasc.RequestHandlers.initHandlersFromConfig created /terms: org.apache.solr.handler.component.SearchHandler
[junit4:junit4]   2> 11232 T1772 oasc.RequestHandlers.initHandlersFromConfig created spellCheckCompRH: org.apache.solr.handler.component.SearchHandler
[junit4:junit4]   2> 11232 T1772 oasc.RequestHandlers.initHandlersFromConfig created spellCheckCompRH_Direct: org.apache.solr.handler.component.SearchHandler
[junit4:junit4]   2> 11233 T1772 oasc.RequestHandlers.initHandlersFromConfig created spellCheckWithWordbreak: org.apache.solr.handler.component.SearchHandler
[junit4:junit4]   2> 11234 T1772 oasc.RequestHandlers.initHandlersFromConfig created spellCheckWithWordbreak_Direct: org.apache.solr.handler.component.SearchHandler
[junit4:junit4]   2> 11235 T1772 oasc.RequestHandlers.initHandlersFromConfig created spellCheckCompRH1: org.apache.solr.handler.component.SearchHandler
[junit4:junit4]   2> 11235 T1772 oasc.RequestHandlers.initHandlersFromConfig created tvrh: org.apache.solr.handler.component.SearchHandler
[junit4:junit4]   2> 11236 T1772 oasc.RequestHandlers.initHandlersFromConfig created /mlt: solr.MoreLikeThisHandler
[junit4:junit4]   2> 11237 T1772 oasc.RequestHandlers.initHandlersFromConfig created /debug/dump: solr.DumpRequestHandler
[junit4:junit4]   2> 11241 T1772 oashl.XMLLoader.init xsltCacheLifetimeSeconds=60
[junit4:junit4]   2> 11247 T1772 oasc.SolrCore.initDeprecatedSupport WARNING solrconfig.xml uses deprecated <admin/gettableFiles>, Please update your config to use the ShowFileRequestHandler.
[junit4:junit4]   2> 11248 T1772 oasc.SolrCore.initDeprecatedSupport WARNING adding ShowFileRequestHandler with hidden files: [SCHEMA.XML, OLD_SYNONYMS.TXT, STOPWORDS.TXT, PROTWORDS.TXT, OPEN-EXCHANGE-RATES.JSON, SYNONYMS.TXT, CURRENCY.XML, MAPPING-ISOLATIN1ACCENT.TXT]
[junit4:junit4]   2> 11253 T1772 oass.SolrIndexSearcher.<init> Opening Searcher@315c927a main
[junit4:junit4]   2> 11254 T1772 oasu.CommitTracker.<init> Hard AutoCommit: disabled
[junit4:junit4]   2> 11255 T1772 oasu.CommitTracker.<init> Soft AutoCommit: disabled
[junit4:junit4]   2> 11255 T1772 oashc.SpellCheckComponent.inform Initializing spell checkers
[junit4:junit4]   2> 11263 T1772 oass.DirectSolrSpellChecker.init init: {name=direct,classname=DirectSolrSpellChecker,field=lowerfilt,minQueryLength=3}
[junit4:junit4]   2> 11323 T1845 oasc.SolrCore.registerSearcher [collection1] Registered new searcher Searcher@315c927a main{StandardDirectoryReader(segments_1:1)}
[junit4:junit4]   2> 11465 T1793 oascc.ZkStateReader.updateClusterState Updating cloud state from ZooKeeper... 
[junit4:junit4]   2> 11483 T1806 oascc.ZkStateReader$2.process A cluster state change has occurred - updating...
[junit4:junit4]   2> 11483 T1844 oascc.ZkStateReader$2.process A cluster state change has occurred - updating...
[junit4:junit4]   2> 11483 T1818 oascc.ZkStateReader$2.process A cluster state change has occurred - updating...
[junit4:junit4]   2> 11483 T1830 oascc.ZkStateReader$2.process A cluster state change has occurred - updating...
[junit4:junit4]   2> 11483 T1792 oascc.ZkStateReader$2.process A cluster state change has occurred - updating...
[junit4:junit4]   2> 11830 T1772 oasc.CoreContainer.register registering core: collection1
[junit4:junit4]   2> 11830 T1772 oasc.ZkController.register Register shard - core:collection1 address:http://127.0.0.1:28284/solr shardId:shard2
[junit4:junit4]   2> 11837 T1772 oasc.ZkController.register We are http://127.0.0.1:28284/solr/collection1/ and leader is http://127.0.0.1:28237/solr/collection1/
[junit4:junit4]   2> 11838 T1772 oasc.ZkController.register No LogReplay needed for core=collection1 baseURL=http://127.0.0.1:28284/solr
[junit4:junit4]   2> 11838 T1772 oasc.ZkController.checkRecovery Core needs to recover:collection1
[junit4:junit4]   2> 11838 T1772 oasu.DefaultSolrCoreState.doRecovery Running recovery - first canceling any ongoing recovery
[junit4:junit4]   2> ASYNC  NEW_CORE C166 name=collection1 org.apache.solr.core.SolrCore@2b5e1db5 url=http://127.0.0.1:28284/solr/collection1 node=127.0.0.1:28284_solr
[junit4:junit4]   2> 11839 T1846 C166 P28284 oasc.RecoveryStrategy.run Starting recovery process.  core=collection1 recoveringAfterStartup=true
[junit4:junit4]   2> 11840 T1846 C166 P28284 oasc.RecoveryStrategy.doRecovery ###### startupVersions=[]
[junit4:junit4]   2> 11840 T1772 oascc.ZkStateReader.updateClusterState Updating cloud state from ZooKeeper... 
[junit4:junit4]   2> 11841 T1846 C166 P28284 oasc.RecoveryStrategy.doRecovery Attempting to PeerSync from http://127.0.0.1:28237/solr/collection1/ core=collection1 - recoveringAfterStartup=true
[junit4:junit4]   2> 11842 T1846 C166 P28284 oasu.PeerSync.sync PeerSync: core=collection1 url=http://127.0.0.1:28284/solr START replicas=[http://127.0.0.1:28237/solr/collection1/] nUpdates=100
[junit4:junit4]   2> 11842 T1772 oass.SolrDispatchFilter.init user.dir=/usr/home/hudson/hudson-slave/workspace/Lucene-Solr-Tests-4.x-Java6/solr/build/solr-core/test/J1
[junit4:junit4]   2> 11842 T1846 C166 P28284 oasu.PeerSync.sync WARNING no frame of reference to tell of we've missed updates
[junit4:junit4]   2> 11842 T1846 C166 P28284 oasc.RecoveryStrategy.doRecovery PeerSync Recovery was not successful - trying replication. core=collection1
[junit4:junit4]   2> 11842 T1772 oass.SolrDispatchFilter.init SolrDispatchFilter.init() done
[junit4:junit4]   2> 11842 T1846 C166 P28284 oasc.RecoveryStrategy.doRecovery Starting Replication Recovery. core=collection1
[junit4:junit4]   2> 11843 T1846 C166 P28284 oascsi.HttpClientUtil.createClient Creating new http client, config:maxConnections=128&maxConnectionsPerHost=32&followRedirects=false
[junit4:junit4]   2> 11843 T1772 oascsi.HttpClientUtil.createClient Creating new http client, config:maxConnections=128&maxConnectionsPerHost=32&followRedirects=false
[junit4:junit4]   2> ASYNC  NEW_CORE C167 name=collection1 org.apache.solr.core.SolrCore@88bdcd0 url=http://127.0.0.1:28237/solr/collection1 node=127.0.0.1:28237_solr
[junit4:junit4]   2> 11852 T1810 C167 P28237 REQ /get {distrib=false&qt=/get&wt=javabin&version=2&getVersions=100} status=0 QTime=0 
[junit4:junit4]   2> 11863 T1772 oaz.ZooKeeper.<init> Initiating client connection, connectString=127.0.0.1:28218/solr sessionTimeout=10000 watcher=org.apache.solr.common.cloud.ConnectionManager@30b35316
[junit4:junit4]   2> 11864 T1848 oaz.ClientCnxn$SendThread.startConnect Opening socket connection to server /127.0.0.1:28218
[junit4:junit4]   2> 11864 T1772 oascc.ConnectionManager.waitForConnected Waiting for client to connect to ZooKeeper
[junit4:junit4]   2> 11865 T1848 oaz.ClientCnxn$SendThread.primeConnection Socket connection established to localhost/127.0.0.1:28218, initiating session
[junit4:junit4]   2> 11865 T1774 oazs.NIOServerCnxn$Factory.run Accepted socket connection from /140.211.11.196:28302
[junit4:junit4]   2> 11865 T1774 oazs.NIOServerCnxn.readConnectRequest Client attempting to establish new session at /140.211.11.196:28302
[junit4:junit4]   2> 11867 T1776 oazs.NIOServerCnxn.finishSessionInit Established session 0x139e0fa80120007 with negotiated timeout 10000 for client /140.211.11.196:28302
[junit4:junit4]   2> 11867 T1848 oaz.ClientCnxn$SendThread.readConnectResult Session establishment complete on server localhost/127.0.0.1:28218, sessionid = 0x139e0fa80120007, negotiated timeout = 10000
[junit4:junit4]   2> 11867 T1849 oascc.ConnectionManager.process Watcher org.apache.solr.common.cloud.ConnectionManager@30b35316 name:ZooKeeperConnection Watcher:127.0.0.1:28218/solr got event WatchedEvent state:SyncConnected type:None path:null path:null type:None
[junit4:junit4]   2> 11867 T1772 oascc.ConnectionManager.waitForConnected Client is connected to ZooKeeper
[junit4:junit4]   2> 11868 T1772 oascc.ZkStateReader.createClusterStateWatchersAndUpdate Updating cluster state from ZooKeeper... 
[junit4:junit4]   2> 11870 T1772 oasc.ChaosMonkey.monkeyLog monkey: init - expire sessions:true cause connection loss:true
[junit4:junit4]   2> 11870 T1772 oascsi.HttpClientUtil.createClient Creating new http client, config:
[junit4:junit4]   2> 11880 T1772 oascc.ZkStateReader.updateClusterState Updating cloud state from ZooKeeper... 
[junit4:junit4]   2> ASYNC  NEW_CORE C168 name=collection1 org.apache.solr.core.SolrCore@71f88f0f url=http://127.0.0.1:28221/solr/collection1 node=127.0.0.1:28221_solr
[junit4:junit4]   2> 11891 T1784 C168 P28221 oasc.SolrDeletionPolicy.onInit SolrDeletionPolicy.onInit: commits:num=1
[junit4:junit4]   2> 		commit{dir=/usr/home/hudson/hudson-slave/workspace/Lucene-Solr-Tests-4.x-Java6/solr/build/solr-core/test/J1/org.apache.solr.cloud.BasicDistributedZk2Test-1348099276813/control/data/index,segFN=segments_1,generation=1,filenames=[segments_1]
[junit4:junit4]   2> 11892 T1784 C168 P28221 oasc.SolrDeletionPolicy.updateCommits newest commit = 1
[junit4:junit4]   2> 11896 T1784 C168 P28221 /update {wt=javabin&version=2} {add=[1 (1413584559744745472)]} 0 9
[junit4:junit4]   2> 11897 T1772 oaz.ZooKeeper.<init> Initiating client connection, connectString=127.0.0.1:28218/solr sessionTimeout=10000 watcher=org.apache.solr.common.cloud.ConnectionManager@52657562
[junit4:junit4]   2> 11898 T1850 oaz.ClientCnxn$SendThread.startConnect Opening socket connection to server /127.0.0.1:28218
[junit4:junit4]   2> 11898 T1772 oascc.ConnectionManager.waitForConnected Waiting for client to connect to ZooKeeper
[junit4:junit4]   2> 11898 T1850 oaz.ClientCnxn$SendThread.primeConnection Socket connection established to localhost/127.0.0.1:28218, initiating session
[junit4:junit4]   2> 11899 T1774 oazs.NIOServerCnxn$Factory.run Accepted socket connection from /140.211.11.196:28304
[junit4:junit4]   2> 11899 T1774 oazs.NIOServerCnxn.readConnectRequest Client attempting to establish new session at /140.211.11.196:28304
[junit4:junit4]   2> 11900 T1776 oazs.NIOServerCnxn.finishSessionInit Established session 0x139e0fa80120008 with negotiated timeout 10000 for client /140.211.11.196:28304
[junit4:junit4]   2> 11900 T1850 oaz.ClientCnxn$SendThread.readConnectResult Session establishment complete on server localhost/127.0.0.1:28218, sessionid = 0x139e0fa80120008, negotiated timeout = 10000
[junit4:junit4]   2> 11901 T1851 oascc.ConnectionManager.process Watcher org.apache.solr.common.cloud.ConnectionManager@52657562 name:ZooKeeperConnection Watcher:127.0.0.1:28218/solr got event WatchedEvent state:SyncConnected type:None path:null path:null type:None
[junit4:junit4]   2> 11901 T1772 oascc.ConnectionManager.waitForConnected Client is connected to ZooKeeper
[junit4:junit4]   2> 11902 T1772 oascc.ZkStateReader.createClusterStateWatchersAndUpdate Updating cluster state from ZooKeeper... 
[junit4:junit4]   2> 11910 T1800 C165 P28229 oasc.SolrDeletionPolicy.onInit SolrDeletionPolicy.onInit: commits:num=1
[junit4:junit4]   2> 		commit{dir=/usr/home/hudson/hudson-slave/workspace/Lucene-Solr-Tests-4.x-Java6/solr/build/solr-core/test/J1/org.apache.solr.cloud.BasicDistributedZk2Test-1348099276813/jetty1/index,segFN=segments_1,generation=1,filenames=[segments_1]
[junit4:junit4]   2> 11910 T1800 C165 P28229 oasc.SolrDeletionPolicy.updateCommits newest commit = 1
[junit4:junit4]   2>  C164_STATE=coll:collection1 core:collection1 props:{shard=shard1, roles=null, state=recovering, core=collection1, collection=collection1, node_name=127.0.0.1:28254_solr, base_url=http://127.0.0.1:28254/solr}
[junit4:junit4]   2> 11923 T1822 C164 P28254 oasc.SolrDeletionPolicy.onInit SolrDeletionPolicy.onInit: commits:num=1
[junit4:junit4]   2> 		commit{dir=/usr/home/hudson/hudson-slave/workspace/Lucene-Solr-Tests-4.x-Java6/solr/build/solr-core/test/J1/org.apache.solr.cloud.BasicDistributedZk2Test-1348099276813/jetty3/index,segFN=segments_1,generation=1,filenames=[segments_1]
[junit4:junit4]   2> 11924 T1822 C164 P28254 oasc.SolrDeletionPolicy.updateCommits newest commit = 1
[junit4:junit4]   2> 11927 T1822 C164 P28254 REQ /update {update.distrib=FROMLEADER&distrib.from=http://127.0.0.1:28229/solr/collection1/&wt=javabin&version=2} status=0 QTime=7 
[junit4:junit4]   2> 11928 T1800 C165 P28229 REQ /update {distrib.from=http://127.0.0.1:28237/solr/collection1/&update.distrib=TOLEADER&wt=javabin&version=2} status=0 QTime=22 
[junit4:junit4]   2> 11928 T1812 C167 P28237 /update {wt=javabin&version=2} {add=[1]} 0 24
[junit4:junit4]   2> 11929 T1772 oasc.AbstractDistribZkTestBase.waitForRecoveriesToFinish Wait for recoveries to finish - collection: collection1 failOnTimeout:true timeout (sec):1800
[junit4:junit4]   2> 11930 T1772 oascc.ZkStateReader.updateClusterState Updating cloud state from ZooKeeper... 
[junit4:junit4]   2> 11996 T1793 oascc.ZkStateReader.updateClusterState Updating cloud state from ZooKeeper... 
[junit4:junit4]   2> 12009 T1806 oascc.ZkStateReader$2.process A cluster state change has occurred - updating...
[junit4:junit4]   2> 12009 T1830 oascc.ZkStateReader$2.process A cluster state change has occurred - updating...
[junit4:junit4]   2> 12009 T1844 oascc.ZkStateReader$2.process A cluster state change has occurred - updating...
[junit4:junit4]   2> 12009 T1851 oascc.ZkStateReader$2.process A cluster state change has occurred - updating...
[junit4:junit4]   2> 12009 T1818 oascc.ZkStateReader$2.process A cluster state change has occurred - updating...
[junit4:junit4]   2> 12009 T1849 oascc.ZkStateReader$2.process A cluster state change has occurred - updating...
[junit4:junit4]   2> 12009 T1792 oascc.ZkStateReader$2.process A cluster state change has occurred - updating...
[junit4:junit4]   2> 12504 T1832 C164 P28254 oasc.RecoveryStrategy.doRecovery Begin buffering updates. core=collection1
[junit4:junit4]   2> 12504 T1832 C164 P28254 oasu.UpdateLog.bufferUpdates Starting to buffer updates. FSUpdateLog{state=ACTIVE, tlog=tlog{file=./org.apache.solr.cloud.BasicDistributedZk2Test-1348099276813/jetty3/tlog/tlog.0000000000000000000 refcount=1}}
[junit4:junit4]   2> 12504 T1832 C164 P28254 oasc.RecoveryStrategy.replicate Attempting to replicate from http://127.0.0.1:28229/solr/collection1/. core=collection1
[junit4:junit4]   2> 12504 T1832 C164 P28254 oascsi.HttpClientUtil.createClient Creating new http client, config:maxConnections=128&maxConnectionsPerHost=32&followRedirects=false
[junit4:junit4]   2> 12515 T1801 C165 P28229 oasu.DirectUpdateHandler2.commit start commit{flags=0,_version_=0,optimize=false,openSearcher=true,waitSearcher=true,expungeDeletes=false,softCommit=false}
[junit4:junit4]   2> 12556 T1801 C165 P28229 oasc.SolrDeletionPolicy.onCommit SolrDeletionPolicy.onCommit: commits:num=2
[junit4:junit4]   2> 		commit{dir=/usr/home/hudson/hudson-slave/workspace/Lucene-Solr-Tests-4.x-Java6/solr/build/solr-core/test/J1/org.apache.solr.cloud.BasicDistributedZk2Test-1348099276813/jetty1/index,segFN=segments_1,generation=1,filenames=[segments_1]
[junit4:junit4]   2> 		commit{dir=/usr/home/hudson/hudson-slave/workspace/Lucene-Solr-Tests-4.x-Java6/solr/build/solr-core/test/J1/org.apache.solr.cloud.BasicDistributedZk2Test-1348099276813/jetty1/index,segFN=segments_2,generation=2,filenames=[_0_MockSep_0.pos, _0_MockRandom_0.prx, _0_NestedPulsing_0.tip, _0_NestedPulsing_0.tim, _0_Lucene40WithOrds_0.tii, _0_Lucene40WithOrds_0.frq, _0_MockSep_0.skp, _0.si, _0_MockSep_0.doc, _0_Lucene40WithOrds_0.tib, _0.fnm, _0_NestedPulsing_0.frq, _0_nrm.cfs, _0_NestedPulsing_0.prx, _0_MockSep_0.tib, _0_MockRandom_0.tip, _0_MockRandom_0.frq, _0_MockRandom_0.sd, _0_nrm.cfe, segments_2, _0_MockSep_0.frq, _0.fdx, _0_Lucene40WithOrds_0.prx, _0_MockSep_0.tii, _0_MockSep_0.pyl, _0_MockRandom_0.tim, _0.fdt]
[junit4:junit4]   2> 12557 T1801 C165 P28229 oasc.SolrDeletionPolicy.updateCommits newest commit = 2
[junit4:junit4]   2> 12573 T1801 C165 P28229 oass.SolrIndexSearcher.<init> Opening Searcher@2b359bef main
[junit4:junit4]   2> 12573 T1801 C165 P28229 oasu.DirectUpdateHandler2.commit end_commit_flush
[junit4:junit4]   2> 12575 T1807 oasc.SolrCore.registerSearcher [collection1] Registered new searcher Searcher@2b359bef main{StandardDirectoryReader(segments_2:3 _0(4.0.0.2):C1)}
[junit4:junit4]   2> 12575 T1801 C165 P28229 /update {waitSearcher=true&commit=true&commit_end_point=true&wt=javabin&softCommit=false&version=2} {commit=} 0 60
[junit4:junit4]   2> 12576 T1832 C164 P28254 oash.ReplicationHandler.inform Commits will be reserved for  10000
[junit4:junit4]   2> 12576 T1832 C164 P28254 oash.SnapPuller.<init>  No value set for 'pollInterval'. Timer Task not started.
[junit4:junit4]   2> 12579 T1802 C165 P28229 oash.ReplicationHandler.inform Commits will be reserved for  10000
[junit4:junit4]   2> 12579 T1802 C165 P28229 REQ /replication {command=indexversion&wt=javabin&qt=/replication&version=2} status=0 QTime=1 
[junit4:junit4]   2> 12580 T1832 C164 P28254 oash.SnapPuller.fetchLatestIndex Master's generation: 2
[junit4:junit4]   2> 12580 T1832 C164 P28254 oash.SnapPuller.fetchLatestIndex Slave's generation: 1
[junit4:junit4]   2> 12580 T1832 C164 P28254 oash.SnapPuller.fetchLatestIndex Starting replication process
[junit4:junit4]   2> 12585 T1802 C165 P28229 REQ /replication {command=filelist&generation=2&wt=javabin&qt=/replication&version=2} status=0 QTime=3 
[junit4:junit4]   2> 12586 T1832 C164 P28254 oash.SnapPuller.fetchLatestIndex Number of files in latest index in master: 27
[junit4:junit4]   2> 12592 T1832 C164 P28254 oash.SnapPuller.fetchLatestIndex Starting download to ./org.apache.solr.cloud.BasicDistributedZk2Test-1348099276813/jetty3/index.20120919150129396 fullCopy=true
[junit4:junit4]   2> 12596 T1802 C165 P28229 REQ /replication {file=_0_MockSep_0.pos&command=filecontent&checksum=true&generation=2&qt=/replication&wt=filestream} status=0 QTime=0 
[junit4:junit4]   2> 12601 T1802 C165 P28229 REQ /replication {file=_0_MockRandom_0.prx&command=filecontent&checksum=true&generation=2&qt=/replication&wt=filestream} status=0 QTime=0 
[junit4:junit4]   2> 12605 T1802 C165 P28229 REQ /replication {file=_0_NestedPulsing_0.tip&command=filecontent&checksum=true&generation=2&qt=/replication&wt=filestream} status=0 QTime=0 
[junit4:junit4]   2> 12609 T1802 C165 P28229 REQ /replication {file=_0_NestedPulsing_0.tim&command=filecontent&checksum=true&generation=2&qt=/replication&wt=filestream} status=0 QTime=0 
[junit4:junit4]   2> 12613 T1802 C165 P28229 REQ /replication {file=_0_Lucene40WithOrds_0.tii&command=filecontent&checksum=true&generation=2&qt=/replication&wt=filestream} status=0 QTime=0 
[junit4:junit4]   2> 12617 T1802 C165 P28229 REQ /replication {file=_0_Lucene40WithOrds_0.frq&command=filecontent&checksum=true&generation=2&qt=/replication&wt=filestream} status=0 QTime=0 
[junit4:junit4]   2> 12621 T1802 C165 P28229 REQ /replication {file=_0_MockSep_0.skp&command=filecontent&checksum=true&generation=2&qt=/replication&wt=filestream} status=0 QTime=0 
[junit4:junit4]   2> 12622 T1832 C164 P28254 oash.SnapPuller$FileFetcher.fetchPackets WARNING No content recieved for file: {name=_0_MockSep_0.skp, lastmodified=1348099289000, size=0}
[junit4:junit4]   2> 12625 T1802 C165 P28229 REQ /replication {file=_0_MockSep_0.doc&command=filecontent&checksum=true&generation=2&qt=/replication&wt=filestream} status=0 QTime=0 
[junit4:junit4]   2> 12629 T1802 C165 P28229 REQ /replication {file=_0.si&command=filecontent&checksum=true&generation=2&qt=/replication&wt=filestream} status=0 QTime=0 
[junit4:junit4]   2> 12633 T1802 C165 P28229 REQ /replication {file=_0_Lucene40WithOrds_0.tib&command=filecontent&checksum=true&generation=2&qt=/replication&wt=filestream} status=0 QTime=0 
[junit4:junit4]   2> 12637 T1802 C165 P28229 REQ /replication {file=_0.fnm&command=filecontent&checksum=true&generation=2&qt=/replication&wt=filestream} status=0 QTime=0 
[junit4:junit4]   2> 12641 T1802 C165 P28229 REQ /replication {file=_0_NestedPulsing_0.frq&command=filecontent&checksum=true&generation=2&qt=/replication&wt=filestream} status=0 QTime=0 
[junit4:junit4]   2> 12645 T1802 C165 P28229 REQ /replication {file=_0_nrm.cfs&command=filecontent&checksum=true&generation=2&qt=/replication&wt=filestream} status=0 QTime=0 
[junit4:junit4]   2> 12649 T1802 C165 P28229 REQ /replication {file=_0_NestedPulsing_0.prx&command=filecontent&checksum=true&generation=2&qt=/replication&wt=filestream} status=0 QTime=0 
[junit4:junit4]   2> 12653 T1802 C165 P28229 REQ /replication {file=_0_MockSep_0.tib&command=filecontent&checksum=true&generation=2&qt=/replication&wt=filestream} status=0 QTime=0 
[junit4:junit4]   2> 12657 T1802 C165 P28229 REQ /replication {file=_0_MockRandom_0.sd&command=filecontent&checksum=true&generation=2&qt=/replication&wt=filestream} status=0 QTime=0 
[junit4:junit4]   2> 12661 T1802 C165 P28229 REQ /replication {file=_0_MockRandom_0.frq&command=filecontent&checksum=true&generation=2&qt=/replication&wt=filestream} status=0 QTime=0 
[junit4:junit4]   2> 12665 T1802 C165 P28229 REQ /replication {file=_0_MockRandom_0.tip&command=filecontent&checksum=true&generation=2&qt=/replication&wt=filestream} status=0 QTime=0 
[junit4:junit4]   2> 12669 T1802 C165 P28229 REQ /replication {file=_0_nrm.cfe&command=filecontent&checksum=true&generation=2&qt=/replication&wt=filestream} status=0 QTime=0 
[junit4:junit4]   2> 12673 T1802 C165 P28229 REQ /replication {file=_0_MockSep_0.frq&command=filecontent&checksum=true&generation=2&qt=/replication&wt=filestream} status=0 QTime=0 
[junit4:junit4]   2> 12677 T1802 C165 P28229 REQ /replication {file=segments_2&command=filecontent&checksum=true&generation=2&qt=/replication&wt=filestream} status=0 QTime=0 
[junit4:junit4]   2> 12681 T1802 C165 P28229 REQ /replication {file=_0.fdx&command=filecontent&checksum=true&generation=2&qt=/replication&wt=filestream} status=0 QTime=0 
[junit4:junit4]   2> 12685 T1802 C165 P28229 REQ /replication {file=_0_MockSep_0.tii&command=filecontent&checksum=true&generation=2&qt=/replication&wt=filestream} status=0 QTime=0 
[junit4:junit4]   2> 12689 T1802 C165 P28229 REQ /replication {file=_0_Lucene40WithOrds_0.prx&command=filecontent&checksum=true&generation=2&qt=/replication&wt=filestream} status=0 QTime=0 
[junit4:junit4]   2> 12693 T1802 C165 P28229 REQ /replication {file=_0_MockSep_0.pyl&command=filecontent&checksum=true&generation=2&qt=/replication&wt=filestream} status=0 QTime=0 
[junit4:junit4]   2> 12698 T1832 C164 P28254 oash.SnapPuller$FileFetcher.fetchPackets WARNING No content recieved for file: {name=_0_MockSep_0.pyl, lastmodified=1348099289000, size=0}
[junit4:junit4]   2> 12702 T1802 C165 P28229 REQ /replication {file=_0_MockRandom_0.tim&command=filecontent&checksum=true&generation=2&qt=/replication&wt=filestream} status=0 QTime=0 
[junit4:junit4]   2> 12707 T1802 C165 P28229 REQ /replication {file=_0.fdt&command=filecontent&checksum=true&generation=2&qt=/replication&wt=filestream} status=0 QTime=0 
[junit4:junit4]   2> 12708 T1832 C164 P28254 oash.SnapPuller.fetchLatestIndex Total time taken for download : 0 secs
[junit4:junit4]   2> 12709 T1832 C164 P28254 oash.SnapPuller.modifyIndexProps New index installed. Updating index properties... index=index.20120919150129396
[junit4:junit4]   2> 12710 T1832 C164 P28254 oasu.DefaultSolrCoreState.newIndexWriter Creating new IndexWriter...
[junit4:junit4]   2> 12710 T1832 C164 P28254 oasu.DefaultSolrCoreState.newIndexWriter Waiting until IndexWriter is unused... core=collection1
[junit4:junit4]   2> 12710 T1832 C164 P28254 oasu.DefaultSolrCoreState.newIndexWriter Rollback old IndexWriter... core=collection1
[junit4:junit4]   2> 12716 T1832 C164 P28254 oasc.SolrCore.getNewIndexDir WARNING New index directory detected: old=./org.apache.solr.cloud.BasicDistributedZk2Test-1348099276813/jetty3/index/ new=./org.apache.solr.cloud.BasicDistributedZk2Test-1348099276813/jetty3/index.20120919150129396
[junit4:junit4]   2> 12717 T1832 C164 P28254 oasc.CachingDirectoryFactory.get return new directory for /usr/home/hudson/hudson-slave/workspace/Lucene-Solr-Tests-4.x-Java6/solr/build/solr-core/test/J1/./org.apache.solr.cloud.BasicDistributedZk2Test-1348099276813/jetty3/index.20120919150129396 forceNew:true
[junit4:junit4]   2> 12728 T1832 C164 P28254 oasc.SolrDeletionPolicy.onInit SolrDeletionPolicy.onInit: commits:num=1
[junit4:junit4]   2> 		commit{dir=/usr/home/hudson/hudson-slave/workspace/Lucene-Solr-Tests-4.x-Java6/solr/build/solr-core/test/J1/org.apache.solr.cloud.BasicDistributedZk2Test-1348099276813/jetty3/index.20120919150129396,segFN=segments_2,generation=2,filenames=[_0_MockSep_0.pos, _0_MockRandom_0.prx, _0_NestedPulsing_0.tip, _0_NestedPulsing_0.tim, _0_Lucene40WithOrds_0.tii, _0_Lucene40WithOrds_0.frq, _0_MockSep_0.skp, _0_MockSep_0.doc, _0.si, _0_Lucene40WithOrds_0.tib, _0.fnm, _0_NestedPulsing_0.frq, _0_nrm.cfs, _0_NestedPulsing_0.prx, _0_MockSep_0.tib, _0_MockRandom_0.tip, _0_MockRandom_0.frq, _0_MockRandom_0.sd, _0_nrm.cfe, segments_2, _0_MockSep_0.frq, _0.fdx, _0_Lucene40WithOrds_0.prx, _0_MockSep_0.tii, _0_MockSep_0.pyl, _0_MockRandom_0.tim, _0.fdt]
[junit4:junit4]   2> 12728 T1832 C164 P28254 oasc.SolrDeletionPolicy.updateCommits newest commit = 2
[junit4:junit4]   2> 12729 T1832 C164 P28254 oasu.DefaultSolrCoreState.newIndexWriter New IndexWriter is ready to be used.
[junit4:junit4]   2> 12732 T1832 C164 P28254 oass.SolrIndexSearcher.<init> Opening Searcher@4ca807e2 main
[junit4:junit4]   2> 12734 T1831 oasc.SolrCore.registerSearcher [collection1] Registered new searcher Searcher@4ca807e2 main{StandardDirectoryReader(segments_2:3:nrt _0(4.0.0.2):C1)}
[junit4:junit4]   2> 12734 T1831 oasc.CachingDirectoryFactory.close Closing directory:/usr/home/hudson/hudson-slave/workspace/Lucene-Solr-Tests-4.x-Java6/solr/build/solr-core/test/J1/./org.apache.solr.cloud.BasicDistributedZk2Test-1348099276813/jetty3/index
[junit4:junit4]   2> 12735 T1831 oash.SnapPuller$2.onClose removing old index directory ./org.apache.solr.cloud.BasicDistributedZk2Test-1348099276813/jetty3/index
[junit4:junit4]   2> 12737 T1832 C164 P28254 oasu.DirectUpdateHandler2.commit start commit{flags=0,_version_=0,optimize=false,openSearcher=false,waitSearcher=false,expungeDeletes=false,softCommit=false}
[junit4:junit4]   2> 12738 T1832 C164 P28254 oasu.DirectUpdateHandler2.commit end_commit_flush
[junit4:junit4]   2> 12738 T1832 C164 P28254 oasc.RecoveryStrategy.replay Replaying buffered documents. core=collection1
[junit4:junit4]   2> 12738 T1855 C164 P28254 oasu.UpdateLog$LogReplayer.doReplay WARNING Starting log replay tlog{file=./org.apache.solr.cloud.BasicDistributedZk2Test-1348099276813/jetty3/tlog/tlog.0000000000000000000 refcount=2} active=true starting pos=429
[junit4:junit4]   2> 12738 T1855 C164 P28254 oasu.DirectUpdateHandler2.commit start commit{flags=2,_version_=0,optimize=false,openSearcher=true,waitSearcher=true,expungeDeletes=false,softCommit=false}
[junit4:junit4]   2> 12740 T1855 C164 P28254 oass.SolrIndexSearcher.<init> Opening Searcher@592b372a main
[junit4:junit4]   2> 12740 T1855 C164 P28254 oasu.DirectUpdateHandler2.commit end_commit_flush
[junit4:junit4]   2> 12741 T1831 oasc.SolrCore.registerSearcher [collection1] Registered new searcher Searcher@592b372a main{StandardDirectoryReader(segments_2:3:nrt _0(4.0.0.2):C1)}
[junit4:junit4]   2> 12742 T1855 C164 P28254 oasu.UpdateLog$LogReplayer.run WARNING Log replay finished. recoveryInfo=RecoveryInfo{adds=0 deletes=0 deleteByQuery=0 errors=0 positionOfStart=429}
[junit4:junit4]   2> 12742 T1832 C164 P28254 oasc.RecoveryStrategy.doRecovery Replication Recovery was successful - registering as Active. core=collection1
[junit4:junit4]   2> 12744 T1832 C164 P28254 oasc.RecoveryStrategy.doRecovery Finished recovery process. core=collection1
[junit4:junit4]   2> 12933 T1772 oascc.ZkStateReader.updateClusterState Updating cloud state from ZooKeeper... 
[junit4:junit4]   2> 13016 T1793 oascc.ZkStateReader.updateClusterState Updating cloud state from ZooKeeper... 
[junit4:junit4]   2> 13021 T1806 oascc.ZkStateReader$2.process A cluster state change has occurred - updating...
[junit4:junit4]   2> 13021 T1818 oascc.ZkStateReader$2.process A cluster state change has occurred - updating...
[junit4:junit4]   2> 13021 T1830 oascc.ZkStateReader$2.process A cluster state change has occurred - updating...
[junit4:junit4]   2> 13021 T1851 oascc.ZkStateReader$2.process A cluster state change has occurred - updating...
[junit4:junit4]   2> 13021 T1844 oascc.ZkStateReader$2.process A cluster state change has occurred - updating...
[junit4:junit4]   2> 13021 T1849 oascc.ZkStateReader$2.process A cluster state change has occurred - updating...
[junit4:junit4]   2> 13021 T1792 oascc.ZkStateReader$2.process A cluster state change has occurred - updating...
[junit4:junit4]   2> 13935 T1772 oascc.ZkStateReader.updateClusterState Updating cloud state from ZooKeeper... 
[junit4:junit4]   2>  C166_STATE=coll:collection1 core:collection1 props:{shard=shard2, roles=null, state=recovering, core=collection1, collection=collection1, node_name=127.0.0.1:28284_solr, base_url=http://127.0.0.1:28284/solr}
[junit4:junit4]   2> 14866 T1846 C166 P28284 oasc.RecoveryStrategy.doRecovery Begin buffering updates. core=collection1
[junit4:junit4]   2> 14866 T1846 C166 P28284 oasu.UpdateLog.bufferUpdates Starting to buffer updates. FSUpdateLog{state=ACTIVE, tlog=null}
[junit4:junit4]   2> 14866 T1846 C166 P28284 oasc.RecoveryStrategy.replicate Attempting to replicate from http://127.0.0.1:28237/solr/collection1/. core=collection1
[junit4:junit4]   2> 14867 T1846 C166 P28284 oascsi.HttpClientUtil.createClient Creating new http client, config:maxConnections=128&maxConnectionsPerHost=32&followRedirects=false
[junit4:junit4]   2> 14882 T1813 C167 P28237 oasu.DirectUpdateHandler2.commit start commit{flags=0,_version_=0,optimize=false,openSearcher=true,waitSearcher=true,expungeDeletes=false,softCommit=false}
[junit4:junit4]   2> 14888 T1813 C167 P28237 oasc.SolrDeletionPolicy.onInit SolrDeletionPolicy.onInit: commits:num=1
[junit4:junit4]   2> 		commit{dir=/usr/home/hudson/hudson-slave/workspace/Lucene-Solr-Tests-4.x-Java6/solr/build/solr-core/test/J1/org.apache.solr.cloud.BasicDistributedZk2Test-1348099276813/jetty2/index,segFN=segments_1,generation=1,filenames=[segments_1]
[junit4:junit4]   2> 14889 T1813 C167 P28237 oasc.SolrDeletionPolicy.updateCommits newest commit = 1
[junit4:junit4]   2> 14890 T1813 C167 P28237 oass.SolrIndexSearcher.<init> Opening Searcher@4913bd38 main
[junit4:junit4]   2> 14891 T1813 C167 P28237 oasu.DirectUpdateHandler2.commit end_commit_flush
[junit4:junit4]   2> 14892 T1819 oasc.SolrCore.registerSearcher [collection1] Registered new searcher Searcher@4913bd38 main{StandardDirectoryReader(segments_1:1)}
[junit4:junit4]   2> 14893 T1813 C167 P28237 /update {waitSearcher=true&commit=true&commit_end_point=true&wt=javabin&softCommit=false&version=2} {commit=} 0 11
[junit4:junit4]   2> 14894 T1846 C166 P28284 oash.ReplicationHandler.inform Commits will be reserved for  10000
[junit4:junit4]   2> 14894 T1846 C166 P28284 oash.SnapPuller.<init>  No value set for 'pollInterval'. Timer Task not started.
[junit4:junit4]   2> 14895 T1814 C167 P28237 oash.ReplicationHandler.inform Commits will be reserved for  10000
[junit4:junit4]   2> 14896 T1814 C167 P28237 REQ /replication {command=indexversion&wt=javabin&qt=/replication&version=2} status=0 QTime=1 
[junit4:junit4]   2> 14900 T1846 C166 P28284 oasc.SolrDeletionPolicy.onInit SolrDeletionPolicy.onInit: commits:num=1
[junit4:junit4]   2> 		commit{dir=/usr/home/hudson/hudson-slave/workspace/Lucene-Solr-Tests-4.x-Java6/solr/build/solr-core/test/J1/org.apache.solr.cloud.BasicDistributedZk2Test-1348099276813/jetty4/index,segFN=segments_1,generation=1,filenames=[segments_1]
[junit4:junit4]   2> 14900 T1846 C166 P28284 oasc.SolrDeletionPolicy.updateCommits newest commit = 1
[junit4:junit4]   2> 14901 T1846 C166 P28284 oasu.DirectUpdateHandler2.commit start commit{flags=0,_version_=0,optimize=false,openSearcher=true,waitSearcher=true,expungeDeletes=false,softCommit=false}
[junit4:junit4]   2> 14908 T1846 C166 P28284 oasc.SolrDeletionPolicy.onCommit SolrDeletionPolicy.onCommit: commits:num=2
[junit4:junit4]   2> 		commit{dir=/usr/home/hudson/hudson-slave/workspace/Lucene-Solr-Tests-4.x-Java6/solr/build/solr-core/test/J1/org.apache.solr.cloud.BasicDistributedZk2Test-1348099276813/jetty4/index,segFN=segments_1,generation=1,filenames=[segments_1]
[junit4:junit4]   2> 		commit{dir=/usr/home/hudson/hudson-slave/workspace/Lucene-Solr-Tests-4.x-Java6/solr/build/solr-core/test/J1/org.apache.solr.cloud.BasicDistributedZk2Test-1348099276813/jetty4/index,segFN=segments_2,generation=2,filenames=[segments_2]
[junit4:junit4]   2> 14908 T1846 C166 P28284 oasc.SolrDeletionPolicy.updateCommits newest commit = 2
[junit4:junit4]   2> 14911 T1846 C166 P28284 oass.SolrIndexSearcher.<init> Opening Searcher@5ddbef9 main
[junit4:junit4]   2> 14912 T1846 C166 P28284 oasu.DirectUpdateHandler2.commit end_commit_flush
[junit4:junit4]   2> 14913 T1845 oasc.SolrCore.registerSearcher [collection1] Registered new searcher Searcher@5ddbef9 main{StandardDirectoryReader(segments_2:2)}
[junit4:junit4]   2> 14913 T1846 C166 P28284 oasc.RecoveryStrategy.replay No replay needed. core=collection1
[junit4:junit4]   2> 14913 T1846 C166 P28284 oasc.RecoveryStrategy.doRecovery Replication Recovery was successful - registering as Active. core=collection1
[junit4:junit4]   2> 14927 T1846 C166 P28284 oasc.RecoveryStrategy.doRecovery Finished recovery process. core=collection1
[junit4:junit4]   2> 14937 T1772 oascc.ZkStateReader.updateClusterState Updating cloud state from ZooKeeper... 
[junit4:junit4]   2> 15031 T1793 oascc.ZkStateReader.updateClusterState Updating cloud state from ZooKeeper... 
[junit4:junit4]   2> 15122 T1844 oascc.ZkStateReader$2.process A cluster state change has occurred - updating...
[junit4:junit4]   2> 15122 T1849 oascc.ZkStateReader$2.process A cluster state change has occurred - updating...
[junit4:junit4]   2> 15122 T1806 oascc.ZkStateReader$2.process A cluster state change has occurred - updating...
[junit4:junit4]   2> 15122 T1830 oascc.ZkStateReader$2.process A cluster state change has occurred - updating...
[junit4:junit4]   2> 15122 T1818 oascc.ZkStateReader$2.process A cluster state change has occurred - updating...
[junit4:junit4]   2> 15122 T1851 oascc.ZkStateReader$2.process A cluster state change has occurred - updating...
[junit4:junit4]   2> 15122 T1792 oascc.ZkStateReader$2.process A cluster state change has occurred - updating...
[junit4:junit4]   2> 15939 T1772 oascc.ZkStateReader.updateClusterState Updating cloud state from ZooKeeper... 
[junit4:junit4]   2> 15943 T1784 C168 P28221 oasu.DirectUpdateHandler2.commit start commit{flags=0,_version_=0,optimize=false,openSearcher=true,waitSearcher=true,expungeDeletes=false,softCommit=false}
[junit4:junit4]   2> 16005 T1784 C168 P28221 oasc.SolrDeletionPolicy.onCommit SolrDeletionPolicy.onCommit: commits:num=2
[junit4:junit4]   2> 		commit{dir=/usr/home/hudson/hudson-slave/workspace/Lucene-Solr-Tests-4.x-Java6/solr/build/solr-core/test/J1/org.apache.solr.cloud.BasicDistributedZk2Test-1348099276813/control/data/index,segFN=segments_1,generation=1,filenames=[segments_1]
[junit4:junit4]   2> 		commit{dir=/usr/home/hudson/hudson-slave/workspace/Lucene-Solr-Tests-4.x-Java6/solr/build/solr-core/test/J1/org.apache.solr.cloud.BasicDistributedZk2Test-1348099276813/control/data/index,segFN=segments_2,generation=2,filenames=[_0_MockSep_0.pos, _0_NestedPulsing_0.tip, _0_NestedPulsing_0.tim, _0_Lucene40WithOrds_0.tii, _0_Lucene40WithOrds_0.frq, _0_MockSep_0.skp, _0.si, _0_MockSep_0.doc, _0_Lucene40WithOrds_0.tib, _0_MockRandom_0.tib, _0.fnm, _0_NestedPulsing_0.frq, _0_nrm.cfs, _0_MockRandom_0.skp, _0_NestedPulsing_0.prx, _0_MockSep_0.tib, _0_MockRandom_0.frq, _0_MockRandom_0.sd, _0_MockRandom_0.doc, _0_nrm.cfe, _0_MockRandom_0.pos, segments_2, _0_MockRandom_0.tii, _0_MockSep_0.frq, _0.fdx, _0_MockSep_0.tii, _0_Lucene40WithOrds_0.prx, _0_MockSep_0.pyl, _0_MockRandom_0.pyl, _0.fdt]
[junit4:junit4]   2> 16006 T1784 C168 P28221 oasc.SolrDeletionPolicy.updateCommits newest commit = 2
[junit4:junit4]   2> 16024 T1784 C168 P28221 oass.SolrIndexSearcher.<init> Opening Searcher@1f481712 main
[junit4:junit4]   2> 16025 T1784 C168 P28221 oasu.DirectUpdateHandler2.commit end_commit_flush
[junit4:junit4]   2> 16026 T1795 oasc.SolrCore.registerSearcher [collection1] Registered new searcher Searcher@1f481712 main{StandardDirectoryReader(segments_2:3 _0(4.0.0.2):C1)}
[junit4:junit4]   2> 16026 T1784 C168 P28221 /update {waitSearcher=true&wt=javabin&commit=true&softCommit=false&version=2} {commit=} 0 83
[junit4:junit4]   2> 16028 T1803 C165 P28229 oasu.DirectUpdateHandler2.commit start commit{flags=0,_version_=0,optimize=false,openSearcher=true,waitSearcher=true,expungeDeletes=false,softCommit=false}
[junit4:junit4]   2> 16039 T1803 C165 P28229 oass.SolrIndexSearcher.<init> Opening Searcher@7370359e main
[junit4:junit4]   2> 16040 T1803 C165 P28229 oasu.DirectUpdateHandler2.commit end_commit_flush
[junit4:junit4]   2> 16041 T1807 oasc.SolrCore.registerSearcher [collection1] Registered new searcher Searcher@7370359e main{StandardDirectoryReader(segments_2:3 _0(4.0.0.2):C1)}
[junit4:junit4]   2> 16041 T1803 C165 P28229 oasu.SolrCmdDistributor.distribCommit Distrib commit to:[StdNode: http://127.0.0.1:28254/solr/collection1/, StdNode: http://127.0.0.1:28237/solr/collection1/, StdNode: http://127.0.0.1:28284/solr/collection1/]
[junit4:junit4]   2> 16043 T1815 C167 P28237 oasu.DirectUpdateHandler2.commit start commit{flags=0,_version_=0,optimize=false,openSearcher=true,waitSearcher=true,expungeDeletes=false,softCommit=false}
[junit4:junit4]   2>  C164_STATE=coll:collection1 core:collection1 props:{shard=shard1, roles=null, state=active, core=collection1, collection=collection1, node_name=127.0.0.1:28254_solr, base_url=http://127.0.0.1:28254/solr}
[junit4:junit4]   2> 16045 T1822 C164 P28254 oasu.DirectUpdateHandler2.commit start commit{flags=0,_version_=0,optimize=false,openSearcher=true,waitSearcher=true,expungeDeletes=false,softCommit=false}
[junit4:junit4]   2> 16048 T1822 C164 P28254 oass.SolrIndexSearcher.<init> Opening Searcher@5ccf674a main
[junit4:junit4]   2> 16048 T1815 C167 P28237 oass.SolrIndexSearcher.<init> Opening Searcher@60b84310 main
[junit4:junit4]   2> 16048 T1822 C164 P28254 oasu.DirectUpdateHandler2.commit end_commit_flush
[junit4:junit4]   2> 16049 T1819 oasc.JmxMonitoredMap.put WARNING Failed to register info bean: searcher javax.management.InstanceAlreadyExistsException: solr/collection1:type=searcher,id=org.apache.solr.search.SolrIndexSearcher
[junit4:junit4]   2> 	at com.sun.jmx.mbeanserver.Repository.addMBean(Repository.java:467)
[junit4:junit4]   2> 	at com.sun.jmx.interceptor.DefaultMBeanServerInterceptor.internal_addObject(DefaultMBeanServerInterceptor.java:1520)
[junit4:junit4]   2> 	at com.sun.jmx.interceptor.DefaultMBeanServerInterceptor.registerDynamicMBean(DefaultMBeanServerInterceptor.java:986)
[junit4:junit4]   2> 	at com.sun.jmx.interceptor.DefaultMBeanServerInterceptor.registerObject(DefaultMBeanServerInterceptor.java:938)
[junit4:junit4]   2> 	at com.sun.jmx.interceptor.DefaultMBeanServerInterceptor.registerMBean(DefaultMBeanServerInterceptor.java:330)
[junit4:junit4]   2> 	at com.sun.jmx.mbeanserver.JmxMBeanServer.registerMBean(JmxMBeanServer.java:516)
[junit4:junit4]   2> 	at org.apache.solr.core.JmxMonitoredMap.put(JmxMonitoredMap.java:140)
[junit4:junit4]   2> 	at org.apache.solr.core.JmxMonitoredMap.put(JmxMonitoredMap.java:51)
[junit4:junit4]   2> 	at org.apache.solr.search.SolrIndexSearcher.register(SolrIndexSearcher.java:242)
[junit4:junit4]   2> 	at org.apache.solr.core.SolrCore.registerSearcher(SolrCore.java:1642)
[junit4:junit4]   2> 	at org.apache.solr.core.SolrCore.access$000(SolrCore.java:121)
[junit4:junit4]   2> 	at org.apache.solr.core.SolrCore$7.call(SolrCore.java:1519)
[junit4:junit4]   2> 	at java.util.concurrent.FutureTask$Sync.innerRun(FutureTask.java:334)
[junit4:junit4]   2> 	at java.util.concurrent.FutureTask.run(FutureTask.java:166)
[junit4:junit4]   2> 	at java.util.concurrent.ThreadPoolExecutor.runWorker(ThreadPoolExecutor.java:1110)
[junit4:junit4]   2> 	at java.util.concurrent.ThreadPoolExecutor$Worker.run(ThreadPoolExecutor.java:603)
[junit4:junit4]   2> 	at java.lang.Thread.run(Thread.java:679)
[junit4:junit4]   2> 
[junit4:junit4]   2> 16049 T1815 C167 P28237 oasu.DirectUpdateHandler2.commit end_commit_flush
[junit4:junit4]   2> 16050 T1831 oasc.SolrCore.registerSearcher [collection1] Registered new searcher Searcher@5ccf674a main{StandardDirectoryReader(segments_2:3:nrt _0(4.0.0.2):C1)}
[junit4:junit4]   2> 16051 T1819 oasc.SolrCore.registerSearcher [collection1] Registered new searcher Searcher@60b84310 main{StandardDirectoryReader(segments_1:1)}
[junit4:junit4]   2> 16050 T1822 C164 P28254 /update {waitSearcher=true&commit=true&wt=javabin&commit_end_point=true&expungeDeletes=false&softCommit=false&version=2} {commit=} 0 5
[junit4:junit4]   2> 16051 T1815 C167 P28237 /update {waitSearcher=true&commit=true&wt=javabin&commit_end_point=true&expungeDeletes=false&softCommit=false&version=2} {commit=} 0 8
[junit4:junit4]   2>  C166_STATE=coll:collection1 core:collection1 props:{shard=shard2, roles=null, state=active, core=collection1, collection=collection1, node_name=127.0.0.1:28284_solr, base_url=http://127.0.0.1:28284/solr}
[junit4:junit4]   2> 16054 T1836 C166 P28284 oasu.DirectUpdateHandler2.commit start commit{flags=0,_version_=0,optimize=false,openSearcher=true,waitSearcher=true,expungeDeletes=false,softCommit=false}
[junit4:junit4]   2> 16057 T1836 C166 P28284 oass.SolrIndexSearcher.<init> Opening Searcher@1026f824 main
[junit4:junit4]   2> 16058 T1836 C166 P28284 oasu.DirectUpdateHandler2.commit end_commit_flush
[junit4:junit4]   2> 16059 T1845 oasc.SolrCore.registerSearcher [collection1] Registered new searcher Searcher@1026f824 main{StandardDirectoryReader(segments_2:2)}
[junit4:junit4]   2> 16060 T1836 C166 P28284 /update {waitSearcher=true&commit=true&wt=javabin&commit_end_point=true&expungeDeletes=false&softCommit=false&version=2} {commit=} 0 6
[junit4:junit4]   2> 16060 T1803 C165 P28229 /update {waitSearcher=true&wt=javabin&commit=true&softCommit=false&version=2} {commit=} 0 32
[junit4:junit4]   2> 16066 T1785 C168 P28221 REQ /select {fl=id,score&shard.url=127.0.0.1:28221/solr/collection1/&NOW=1348099292873&start=0&q=*:*&distrib=false&isShard=true&wt=javabin&fsv=true&rows=10&version=2} hits=1 status=0 QTime=0 
[junit4:junit4]   2> 16069 T1785 C168 P28221 REQ /select {shard.url=127.0.0.1:28221/solr/collection1/&NOW=1348099292873&q=*:*&ids=1&distrib=false&isShard=true&wt=javabin&version=2} status=0 QTime=0 
[junit4:junit4]   2> 16070 T1784 C168 P28221 REQ /select {wt=javabin&q=*:*&version=2} hits=1 status=0 QTime=7 
[junit4:junit4]   2> 16071 T1772 oaz.ZooKeeper.<init> Initiating client connection, connectString=127.0.0.1:28218/solr sessionTimeout=10000 watcher=org.apache.solr.common.cloud.ConnectionManager@ec9944
[junit4:junit4]   2> 16072 T1859 oaz.ClientCnxn$SendThread.startConnect Opening socket connection to server /127.0.0.1:28218
[junit4:junit4]   2> 16072 T1772 oascc.ConnectionManager.waitForConnected Waiting for client to connect to ZooKeeper
[junit4:junit4]   2> 16073 T1859 oaz.ClientCnxn$SendThread.primeConnection Socket connection established to localhost/127.0.0.1:28218, initiating session
[junit4:junit4]   2> 16073 T1774 oazs.NIOServerCnxn$Factory.run Accepted socket connection from /140.211.11.196:28348
[junit4:junit4]   2> 16073 T1774 oazs.NIOServerCnxn.readConnectRequest Client attempting to establish new session at /140.211.11.196:28348
[junit4:junit4]   2> 16074 T1776 oazs.NIOServerCnxn.finishSessionInit Established session 0x139e0fa80120009 with negotiated timeout 10000 for client /140.211.11.196:28348
[junit4:junit4]   2> 16074 T1859 oaz.ClientCnxn$SendThread.readConnectResult Session establishment complete on server localhost/127.0.0.1:28218, sessionid = 0x139e0fa80120009, negotiated timeout = 10000
[junit4:junit4]   2> 16075 T1860 oascc.ConnectionManager.process Watcher org.apache.solr.common.cloud.ConnectionManager@ec9944 name:ZooKeeperConnection Watcher:127.0.0.1:28218/solr got event WatchedEvent state:SyncConnected type:None path:null path:null type:None
[junit4:junit4]   2> 16075 T1772 oascc.ConnectionManager.waitForConnected Client is connected to ZooKeeper
[junit4:junit4]   2> 16076 T1772 oascc.ZkStateReader.createClusterStateWatchersAndUpdate Updating cluster state from ZooKeeper... 
[junit4:junit4]   2> 16078 T1777 oazs.PrepRequestProcessor.pRequest Processed session termination for sessionid: 0x139e0fa80120009
[junit4:junit4]   2> 16080 T1860 oaz.ClientCnxn$EventThread.run EventThread shut down
[junit4:junit4]   2> 16080 T1772 oaz.ZooKeeper.close Session: 0x139e0fa80120009 closed
[junit4:junit4]   2> 16080 T1774 oazs.NIOServerCnxn.closeSock Closed socket connection for client /140.211.11.196:28348 which had sessionid 0x139e0fa80120009
[junit4:junit4]   2> 16082 T1804 C165 P28229 REQ /select {distrib=false&wt=javabin&q=*:*&version=2} hits=1 status=0 QTime=1 
[junit4:junit4]   2> 16084 T1816 C167 P28237 REQ /select {distrib=false&wt=javabin&q=*:*&version=2} hits=0 status=0 QTime=0 
[junit4:junit4]   2> 16090 T1799 C165 P28229 REQ /select {fl=id,score&shard.url=127.0.0.1:28229/solr/collection1/|127.0.0.1:28254/solr/collection1/&NOW=1348099292897&start=0&q=*:*&distrib=false&isShard=true&wt=javabin&fsv=true&rows=10&version=2} hits=1 status=0 QTime=1 
[junit4:junit4]   2> 16090 T1837 C166 P28284 REQ /select {fl=id,score&shard.url=127.0.0.1:28237/solr/collection1/|127.0.0.1:28284/solr/collection1/&NOW=1348099292897&start=0&q=*:*&distrib=false&isShard=true&wt=javabin&fsv=true&rows=10&version=2} hits=0 status=0 QTime=0 
[junit4:junit4]   2> 16093 T1799 C165 P28229 REQ /select {shard.url=127.0.0.1:28229/solr/collection1/|127.0.0.1:28254/solr/collection1/&NOW=1348099292897&q=*:*&ids=1&distrib=false&isShard=true&wt=javabin&version=2} status=0 QTime=0 
[junit4:junit4]   2> 16094 T1812 C167 P28237 REQ /select {wt=javabin&q=*:*&version=2} hits=1 status=0 QTime=7 
[junit4:junit4]   2> 16101 T1784 C168 P28221 /update {wt=javabin&version=2} {add=[2 (1413584564159250432)]} 0 4
[junit4:junit4]   2> 16112 T1836 C166 P28284 REQ /update {distrib.from=http://127.0.0.1:28237/solr/collection1/&update.distrib=FROMLEADER&wt=javabin&version=2} status=0 QTime=3 
[junit4:junit4]   2> 16113 T1812 C167 P28237 /update {wt=javabin&version=2} {add=[2 (1413584564166590464)]} 0 9
[junit4:junit4]   2> 16117 T1784 C168 P28221 /update {wt=javabin&version=2} {add=[3 (1413584564179173376)]} 0 1
[junit4:junit4]   2> 16126 T1836 C166 P28284 REQ /update {update.distrib=FROMLEADER&distrib.from=http://127.0.0.1:28237/solr/collection1/&wt=javabin&version=2} status=0 QTime=1 
[junit4:junit4]   2> 16126 T1815 C167 P28237 REQ /update {distrib.from=http://127.0.0.1:28229/solr/collection1/&update.distrib=TOLEADER&wt=javabin&version=2} status=0 QTime=4 
[junit4:junit4]   2> 16127 T1803 C165 P28229 /update {wt=javabin&version=2} {add=[3]} 0 7
[junit4:junit4]   2> 16131 T1784 C168 P28221 /update {wt=javabin&version=2} {add=[4 (1413584564193853440)]} 0 1
[junit4:junit4]   2> 16144 T1822 C164 P28254 REQ /update {update.distrib=FROMLEADER&distrib.from=http://127.0.0.1:28229/solr/collection1/&wt=javabin&version=2} status=0 QTime=3 
[junit4:junit4]   2> 16145 T1800 C165 P28229 REQ /update {distrib.from=http://127.0.0.1:28237/solr/collection1/&update.distrib=TOLEADER&wt=javabin&version=2} status=0 QTime=9 
[junit4:junit4]   2> 16145 T1812 C167 P28237 /update {wt=javabin&version=2} {add=[4]} 0 11
[junit4:junit4]   2> 16149 T1784 C168 P28221 /update {wt=javabin&version=2} {add=[5 (1413584564212727808)]} 0 1
[junit4:junit4]   2> 16158 T1836 C166 P28284 REQ /update {update.distrib=FROMLEADER&distrib.from=http://127.0.0.1:28237/solr/collection1/&wt=javabin&version=2} status=0 QTime=1 
[junit4:junit4]   2> 16158 T1815 C167 P28237 REQ /update {distrib.from=http://127.0.0.1:28229/solr/collection1/&update.distrib=TOLEADER&wt=javabin&version=2} status=0 QTime=4 
[junit4:junit4]   2> 16159 T1803 C165 P28229 /update {wt=javabin&version=2} {add=[5]} 0 7
[junit4:junit4]   2> 16163 T1784 C168 P28221 /update {wt=javabin&version=2} {add=[6 (1413584564227407872)]} 0 1
[junit4:junit4]   2> 16171 T1836 C166 P28284 REQ /update {update.distrib=FROMLEADER&distrib.from=http://127.0.0.1:28237/solr/collection1/&wt=javabin&version=2} status=0 QTime=1 
[junit4:junit4]   2> 16171 T1815 C167 P28237 REQ /update {distrib.from=http://127.0.0.1:28229/solr/collection1/&update.distrib=TOLEADER&wt=javabin&version=2} status=0 QTime=4 
[junit4:junit4]   2> 16172 T1803 C165 P28229 /update {wt=javabin&version=2} {add=[6]} 0 7
[junit4:junit4]   2> 16176 T1784 C168 P28221 /update {wt=javabin&version=2} {add=[7 (1413584564241039360)]} 0 1
[junit4:junit4]   2> 16182 T1836 C166 P28284 REQ /update {distrib.from=http://127.0.0.1:28237/solr/collection1/&update.distrib=FROMLEADER&wt=javabin&version=2} status=0 QTime=1 
[junit4:junit4]   2> 16182 T1812 C167 P28237 /update {wt=javabin&version=2} {add=[7 (1413584564244185088)]} 0 4
[junit4:junit4]   2> 16186 T1784 C168 P28221 /update {wt=javabin&version=2} {add=[8 (1413584564251525120)]} 0 1
[junit4:junit4]   2> 16194 T1822 C164 P28254 REQ /update {update.distrib=FROMLEADER&distrib.from=http://127.0.0.1:28229/solr/collection1/&wt=javabin&version=2} status=0 QTime=1 
[junit4:junit4]   2> 16194 T1800 C165 P28229 REQ /update {distrib.from=http://127.0.0.1:28237/solr/collection1/&update.distrib=TOLEADER&wt=javabin&version=2} status=0 QTime=4 
[junit4:junit4]   2> 16195 T1812 C167 P28237 /update {wt=javabin&version=2} {add=[8]} 0 7
[junit4:junit4]   2> 16199 T1784 C168 P28221 /update {wt=javabin&version=2} {add=[9 (1413584564265156608)]} 0 1
[junit4:junit4]   2> 16207 T1836 C166 P28284 REQ /update {update.distrib=FROMLEADER&distrib.from=http://127.0.0.1:28237/solr/collection1/&wt=javabin&version=2} status=0 QTime=1 
[junit4:junit4]   2> 16207 T1815 C167 P28237 REQ /update {distrib.from=http://127.0.0.1:28229/solr/collection1/&update.distrib=TOLEADER&wt=javabin&version=2} status=0 QTime=4 
[junit4:junit4]   2> 16208 T1803 C165 P28229 /update {wt=javabin&version=2} {add=[9]} 0 7
[junit4:junit4]   2> 16212 T1784 C168 P28221 /update {wt=javabin&version=2} {add=[10 (1413584564278788096)]} 0 1
[junit4:junit4]   2> 16220 T1822 C164 P28254 REQ /update {update.distrib=FROMLEADER&distrib.from=http://127.0.0.1:28229/solr/collection1/&wt=javabin&version=2} status=0 QTime=1 
[junit4:junit4]   2> 16220 T1800 C165 P28229 REQ /update {distrib.from=http://127.0.0.1:28237/solr/collection1/&update.distrib=TOLEADER&wt=javabin&version=2} status=0 QTime=4 
[junit4:junit4]   2> 16221 T1812 C167 P28237 /update {wt=javabin&version=2} {add=[10]} 0 7
[junit4:junit4]   2> 16243 T1784 C168 P28221 /update {wt=javabin&version=2} {add=[11 (1413584564292419584)]} 0 19
[junit4:junit4]   2> 16250 T1822 C164 P28254 REQ /update {distrib.from=http://127.0.0.1:28229/solr/collection1/&update.distrib=FROMLEADER&wt=javabin&version=2} status=0 QTime=1 
[junit4:junit4]   2> 16251 T1803 C165 P28229 /update {wt=javabin&version=2} {add=[11 (1413584564315488256)]} 0 5
[junit4:junit4]   2> 16255 T1784 C168 P28221 /update {wt=javabin&version=2} {add=[12 (1413584564322828288)]} 0 2
[junit4:junit4]   2> 16262 T1822 C164 P28254 REQ /update {distrib.from=http://127.0.0.1:28229/solr/collection1/&update.distrib=FROMLEADER&wt=javabin&version=2} status=0 QTime=1 
[junit4:junit4]   2> 16263 T1803 C165 P28229 /update {wt=javabin&version=2} {add=[12 (1413584564328071168)]} 0 5
[junit4:junit4]   2> 16266 T1784 C168 P28221 /update {wt=javabin&version=2} {add=[13 (1413584564335411200)]} 0 1
[junit4:junit4]   2> 16278 T1822 C164 P28254 REQ /update {distrib.from=http://127.0.0.1:28229/solr/collection1/&update.distrib=FROMLEADER&wt=javabin&version=2} status=0 QTime=1 
[junit4:junit4]   2> 16279 T1803 C165 P28229 /update {wt=javabin&version=2} {add=[13 (1413584564339605504)]} 0 10
[junit4:junit4]   2> 16282 T1784 C168 P28221 /update {wt=javabin&version=2} {add=[14 (1413584564352188416)]} 0 1
[junit4:junit4]   2> 16288 T1822 C164 P28254 REQ /update {distrib.from=http://127.0.0.1:28229/solr/collection1/&update.distrib=FROMLEADER&wt=javabin&version=2} status=0 QTime=1 
[junit4:junit4]   2> 16288 T1803 C165 P28229 /update {wt=javabin&version=2} {add=[14 (1413584564355334144)]} 0 4
[junit4:junit4]   2> 16292 T1784 C168 P28221 /update {wt=javabin&version=2} {add=[15 (1413584564362674176)]} 0 1
[junit4:junit4]   2> 16301 T1822 C164 P28254 REQ /update {update.distrib=FROMLEADER&distrib.from=http://127.0.0.1:28229/solr/collection1/&wt=javabin&version=2} status=0 QTime=1 
[junit4:junit4]   2> 16301 T1800 C165 P28229 REQ /update {distrib.from=http://127.0.0.1:28237/solr/collection1/&update.distrib=TOLEADER&wt=javabin&version=2} status=0 QTime=4 
[junit4:junit4]   2> 16302 T1812 C167 P28237 /update {wt=javabin&version=2} {add=[15]} 0 8
[junit4:junit4]   2> 16306 T1784 C168 P28221 /update {wt=javabin&version=2} {add=[16 (1413584564377354240)]} 0 1
[junit4:junit4]   2> 16314 T1822 C164 P28254 REQ /update {update.distrib=FROMLEADER&distrib.from=http://127.0.0.1:28229/solr/collection1/&wt=javabin&version=2} status=0 QTime=1 
[junit4:junit4]   2> 16314 T1800 C165 P28229 REQ /update {distrib.from=http://127.0.0.1:28237/solr/collection1/&update.distrib=TOLEADER&wt=javabin&version=2} status=0 QTime=4 
[junit4:junit4]   2> 16315 T1812 C167 P28237 /update {wt=javabin&version=2} {add=[16]} 0 7
[junit4:junit4]   2> 16320 T1784 C168 P28221 /update {wt=javabin&version=2} {add=[17 (1413584564390985728)]} 0 2
[junit4:junit4]   2> 16332 T1836 C166 P28284 REQ /update {update.distrib=FROMLEADER&distrib.from=http://127.0.0.1:28237/solr/collection1/&wt=javabin&version=2} status=0 QTime=2 
[junit4:junit4]   2> 16333 T1815 C167 P28237 REQ /update {distrib.from=http://127.0.0.1:28229/solr/collection1/&update.distrib=TOLEADER&wt=javabin&version=2} status=0 QTime=8 
[junit4:junit4]   2> 16334 T1803 C165 P28229 /update {wt=javabin&version=2} {add=[17]} 0 11
[junit4:junit4]   2> 16337 T1784 C168 P28221 /update {wt=javabin&version=2} {add=[100 (1413584564409860096)]} 0 1
[junit4:junit4]   2> 16389 T1822 C164 P28254 REQ /update {update.distrib=FROMLEADER&distrib.from=http://127.0.0.1:28229/solr/collection1/&wt=javabin&version=2} status=0 QTime=22 
[junit4:junit4]   2> 16390 T1800 C165 P28229 REQ /update {distrib.from=http://127.0.0.1:28237/solr/collection1/&update.distrib=TOLEADER&wt=javabin&version=2} status=0 QTime=48 
[junit4:junit4]   2> 16391 T1812 C167 P28237 /update {wt=javabin&version=2} {add=[100]} 0 52
[junit4:junit4]   2> 16395 T1784 C168 P28221 /update {wt=javabin&version=2} {add=[101 (1413584564470677504)]} 0 1
[junit4:junit4]   2> 16407 T1822 C164 P28254 REQ /update {update.distrib=FROMLEADER&distrib.from=http://127.0.0.1:28229/solr/collection1/&wt=javabin&version=2} status=0 QTime=2 
[junit4:junit4]   2> 16408 T1800 C165 P28229 REQ /update {distrib.from=http://127.0.0.1:28237/solr/collection1/&update.distrib=TOLEADER&wt=javabin&version=2} status=0 QTime=7 
[junit4:junit4]   2> 16409 T1812 C167 P28237 /update {wt=javabin&version=2} {add=[101]} 0 11
[junit4:junit4]   2> 16413 T1784 C168 P28221 /update {wt=javabin&version=2} {add=[102 (1413584564489551872)]} 0 1
[junit4:junit4]   2> 16422 T1822 C164 P28254 REQ /update {update.distrib=FROMLEADER&distrib.from=http://127.0.0.1:28229/solr/collection1/&wt=javabin&version=2} status=0 QTime=1 
[junit4:junit4]   2> 16423 T1800 C165 P28229 REQ /update {distrib.from=http://127.0.0.1:28237/solr/collection1/&update.distrib=TOLEADER&wt=javabin&version=2} status=0 QTime=5 
[junit4:junit4]   2> 16423 T1812 C167 P28237 /update {wt=javabin&version=2} {add=[102]} 0 7
[junit4:junit4]   2> 16447 T1784 C168 P28221 /update {wt=javabin&version=2} {add=[103 (1413584564504231936)]} 0 21
[junit4:junit4]   2> 16455 T1836 C166 P28284 REQ /update {distrib.from=http://127.0.0.1:28237/solr/collection1/&update.distrib=FROMLEADER&wt=javabin&version=2} status=0 QTime=1 
[junit4:junit4]   2> 16456 T1812 C167 P28237 /update {wt=javabin&version=2} {add=[103 (1413584564529397760)]} 0 6
[junit4:junit4]   2> 16461 T1784 C168 P28221 /update {wt=javabin&version=2} {add=[104 (1413584564538834944)]} 0 2
[junit4:junit4]   2> 16470 T1836 C166 P28284 REQ /update {update.distrib=FROMLEADER&distrib.from=http://127.0.0.1:28237/solr/collection1/&wt=javabin&version=2} status=0 QTime=1 
[junit4:junit4]   2> 16470 T1815 C167 P28237 REQ /update {distrib.from=http://127.0.0.1:28229/solr/collection1/&update.distrib=TOLEADER&wt=javabin&version=2} status=0 QTime=4 
[junit4:junit4]   2> 16471 T1803 C165 P28229 /update {wt=javabin&version=2} {add=[104]} 0 7
[junit4:junit4]   2> 16475 T1784 C168 P28221 /update {wt=javabin&version=2} {add=[105 (1413584564554563584)]} 0 1
[junit4:junit4]   2> 16527 T1836 C166 P28284 REQ /update {distrib.from=http://127.0.0.1:28237/solr/collection1/&update.distrib=FROMLEADER&wt=javabin&version=2} status=0 QTime=19 
[junit4:junit4]   2> 16528 T1812 C167 P28237 /update {wt=javabin&version=2} {add=[105 (1413584564557709312)]} 0 51
[junit4:junit4]   2> 16532 T1784 C168 P28221 /update {wt=javabin&version=2} {add=[106 (1413584564614332416)]} 0 1
[junit4:junit4]   2> 16544 T1836 C166 P28284 REQ /update {update.distrib=FROMLEADER&distrib.from=http://127.0.0.1:28237/solr/collection1/&wt=javabin&version=2} status=0 QTime=2 
[junit4:junit4]   2> 16545 T1815 C167 P28237 REQ /update {distrib.from=http://127.0.0.1:28229/solr/collection1/&update.distrib=TOLEADER&wt=javabin&version=2} status=0 QTime=8 
[junit4:junit4]   2> 16546 T1803 C165 P28229 /update {wt=javabin&version=2} {add=[106]} 0 11
[junit4:junit4]   2> 16549 T1784 C168 P28221 /update {wt=javabin&version=2} {add=[107 (1413584564632158208)]} 0 1
[junit4:junit4]   2> 16555 T1822 C164 P28254 REQ /update {distrib.from=http://127.0.0.1:28229/solr/collection1/&update.distrib=FROMLEADER&wt=javabin&version=2} status=0 QTime=1 
[junit4:junit4]   2> 16556 T1803 C165 P28229 /update {wt=javabin&version=2} {add=[107 (1413584564635303936)]} 0 5
[junit4:junit4]   2> 16559 T1784 C168 P28221 /update {wt=javabin&version=2} {add=[108 (1413584564642643968)]} 0 1
[junit4:junit4]   2> 16567 T1822 C164 P28254 REQ /update {update.distrib=FROMLEADER&distrib.from=http://127.0.0.1:28229/solr/collection1/&wt=javabin&version=2} status=0 QTime=1 
[junit4:junit4]   2> 16567 T1800 C165 P28229 REQ /update {distrib.from=http://127.0.0.1:28237/solr/collection1/&update.distrib=TOLEADER&wt=javabin&version=2} status=0 QTime=4 
[junit4:junit4]   2> 16568 T1812 C167 P28237 /update {wt=javabin&version=2} {add=[108]} 0 7
[junit4:junit4]   2> 16572 T1784 C168 P28221 /update {wt=javabin&version=2} {add=[109 (1413584564656275456)]} 0 1
[junit4:junit4]   2> 16578 T1822 C164 P28254 REQ /update {distrib.from=http://127.0.0.1:28229/solr/collection1/&update.distrib=FROMLEADER&wt=javabin&version=2} status=0 QTime=1 
[junit4:junit4]   2> 16578 T1803 C165 P28229 /update {wt=javabin&version=2} {add=[109 (1413584564659421184)]} 0 4
[junit4:junit4]   2> 16582 T1784 C168 P28221 /update {wt=javabin&version=2} {add=[110 (1413584564666761216)]} 0 1
[junit4:junit4]   2> 16588 T1822 C164 P28254 REQ /update {distrib.from=http://127.0.0.1:28229/solr/collection1/&update.distrib=FROMLEADER&wt=javabin&version=2} status=0 QTime=1 
[junit4:junit4]   2> 16588 T1803 C165 P28229 /update {wt=javabin&version=2} {add=[110 (1413584564669906944)]} 0 4
[junit4:junit4]   2> 16592 T1784 C168 P28221 /update {wt=javabin&version=2} {add=[111 (1413584564677246976)]} 0 1
[junit4:junit4]   2> 16601 T1822 C164 P28254 REQ /update {update.distrib=FROMLEADER&distrib.from=http://127.0.0.1:28229/solr/collection1/&wt=javabin&version=2} status=0 QTime=1 
[junit4:junit4]   2> 16601 T1800 C165 P28229 REQ /update {distrib.from=http://127.0.0.1:28237/solr/collection1/&update.distrib=TOLEADER&wt=javabin&version=2} status=0 QTime=4 
[junit4:junit4]   2> 16602 T1812 C167 P28237 /update {wt=javabin&version=2} {add=[111]} 0 8
[junit4:junit4]   2> 16606 T1784 C168 P28221 /update {wt=javabin&version=2} {add=[112 (1413584564691927040)]} 0 1
[junit4:junit4]   2> 16612 T1836 C166 P28284 REQ /update {distrib.from=http://127.0.0.1:28237/solr/collection1/&update.distrib=FROMLEADER&wt=javabin&version=2} status=0 QTime=1 
[junit4:junit4]   2> 16612 T1812 C167 P28237 /update {wt=javabin&version=2} {add=[112 (1413584564695072768)]} 0 4
[junit4:junit4]   2> 16634 T1784 C168 P28221 /update {wt=javabin&version=2} {add=[113 (1413584564702412800)]} 0 19
[junit4:junit4]   2> 16641 T1822 C164 P28254 REQ /update {distrib.from=http://127.0.0.1:28229/solr/collection1/&update.distrib=FROMLEADER&wt=javabin&version=2} status=0 QTime=1 
[junit4:junit4]   2> 16641 T1803 C165 P28229 /update {wt=javabin&version=2} {add=[113 (1413584564725481472)]} 0 4
[junit4:junit4]   2> 16646 T1784 C168 P28221 /update {wt=javabin&version=2} {add=[114 (1413584564732821504)]} 0 2
[junit4:junit4]   2> 16656 T1822 C164 P28254 REQ /update {update.distrib=FROMLEADER&distrib.from=http://127.0.0.1:28229/solr/collection1/&wt=javabin&version=2} status=0 QTime=1 
[junit4:junit4]   2> 16656 T1800 C165 P28229 REQ /update {distrib.from=http://127.0.0.1:28237/solr/collection1/&update.distrib=TOLEADER&wt=javabin&version=2} status=0 QTime=4 
[junit4:junit4]   2> 16657 T1812 C167 P28237 /update {wt=javabin&version=2} {add=[114]} 0 8
[junit4:junit4]   2> 16661 T1784 C168 P28221 /update {wt=javabin&version=2} {add=[115 (1413584564749598720)]} 0 1
[junit4:junit4]   2> 16670 T1836 C166 P28284 REQ /update {update.distrib=FROMLEADER&distrib.from=http://127.0.0.1:28237/solr/collection1/&wt=javabin&version=2} status=0 QTime=1 
[junit4:junit4]   2> 16670 T1815 C167 P28237 REQ /update {distrib.from=http://127.0.0.1:28229/solr/collection1/&update.distrib=TOLEADER&wt=javabin&version=2} status=0 QTime=4 
[junit4:junit4]   2> 16671 T1803 C165 P28229 /update {wt=javabin&version=2} {add=[115]} 0 7
[junit4:junit4]   2> 16675 T1784 C168 P28221 /update {wt=javabin&version=2} {add=[116 (1413584564764278784)]} 0 1
[junit4:junit4]   2> 16682 T1836 C166 P28284 REQ /update {distrib.from=http://127.0.0.1:28237/solr/collection1/&update.distrib=FROMLEADER&wt=javabin&version=2} status=0 QTime=1 
[junit4:junit4]   2> 16682 T1812 C167 P28237 /update {wt=javabin&version=2} {add=[116 (1413584564767424512)]} 0 5
[junit4:junit4]   2> 16687 T1784 C168 P28221 /update {wt=javabin&version=2} {add=[117 (1413584564776861696)]} 0 1
[junit4:junit4]   2> 16694 T1836 C166 P28284 REQ /update {distrib.from=http://127.0.0.1:28237/solr/collection1/&update.distrib=FROMLEADER&wt=javabin&version=2} status=0 QTime=1 
[junit4:junit4]   2> 16694 T1812 C167 P28237 /update {wt=javabin&version=2} {add=[117 (1413584564780007424)]} 0 5
[junit4:junit4]   2> 16699 T1784 C168 P28221 /update {wt=javabin&version=2} {add=[118 (1413584564789444608)]} 0 1
[junit4:junit4]   2> 16748 T1822 C164 P28254 REQ /update {distrib.from=http://127.0.0.1:28229/solr/collection1/&update.distrib=FROMLEADER&wt=javabin&version=2} status=0 QTime=22 
[junit4:junit4]   2> 16749 T1803 C165 P28229 /update {wt=javabin&version=2} {add=[118 (1413584564793638912)]} 0 47
[junit4:junit4]   2> 16753 T1784 C168 P28221 /update {wt=javabin&version=2} {add=[119 (1413584564846067712)]} 0 1
[junit4:junit4]   2> 16762 T1836 C166 P28284 REQ /update {update.distrib=FROMLEADER&distrib.from=http://127.0.0.1:28237/solr/collection1/&wt=javabin&version=2} status=0 QTime=1 
[junit4:junit4]   2> 16763 T1815 C167 P28237 REQ /update {distrib.from=http://127.0.0.1:28229/solr/collection1/&update.distrib=TOLEADER&wt=javabin&version=2} status=0 QTime=5 
[junit4:junit4]   2> 16763 T1803 C165 P28229 /update {wt=javabin&version=2} {add=[119]} 0 7
[junit4:junit4]   2> 16767 T1784 C168 P28221 /update {wt=javabin&version=2} {add=[120 (1413584564860747776)]} 0 1
[junit4:junit4]   2> 16774 T1836 C166 P28284 REQ /update {distrib.from=http://127.0.0.1:28237/solr/collection1/&update.distrib=FROMLEADER&wt=javabin&version=2} status=0 QTime=1 
[junit4:junit4]   2> 16774 T1812 C167 P28237 /update {wt=javabin&version=2} {add=[120 (1413584564863893504)]} 0 5
[junit4:junit4]   2> 16778 T1784 C168 P28221 /update {wt=javabin&version=2} {add=[121 (1413584564872282112)]} 0 1
[junit4:junit4]   2> 16787 T1836 C166 P28284 REQ /update {update.distrib=FROMLEADER&distrib.from=http://127.0.0.1:28237/solr/collection1/&wt=javabin&version=2} status=0 QTime=1 
[junit4:junit4]   2> 16787 T1815 C167 P28237 REQ /update {distrib.from=http://127.0.0.1:28229/solr/collection1/&update.distrib=TOLEADER&wt=javabin&version=2} status=0 QTime=4 
[junit4:junit4]   2> 16788 T1803 C165 P28229 /update {wt=javabin&version=2} {add=[121]} 0 7
[junit4:junit4]   2> 16792 T1784 C168 P28221 /update {wt=javabin&version=2} {add=[122 (1413584564886962176)]} 0 1
[junit4:junit4]   2> 16802 T1822 C164 P28254 REQ /update {update.distrib=FROMLEADER&distrib.from=http://127.0.0.1:28229/solr/collection1/&wt=javabin&version=2} status=0 QTime=2 
[junit4:junit4]   2> 16803 T1800 C165 P28229 REQ /update {distrib.from=http://127.0.0.1:28237/solr/collection1/&update.distrib=TOLEADER&wt=javabin&version=2} status=0 QTime=7 
[junit4:junit4]   2> 16803 T1812 C167 P28237 /update {wt=javabin&version=2} {add=[122]} 0 9
[junit4:junit4]   2> 16825 T1784 C168 P28221 /update {wt=javabin&version=2} {add=[123 (1413584564902690816)]} 0 19
[junit4:junit4]   2> 16833 T1822 C164 P28254 REQ /update {update.distrib=FROMLEADER&distrib.from=http://127.0.0.1:28229/solr/collection1/&wt=javabin&version=2} status=0 QTime=1 
[junit4:junit4]   2> 16833 T1800 C165 P28229 REQ /update {distrib.from=http://127.0.0.1:28237/solr/collection1/&update.distrib=TOLEADER&wt=javabin&version=2} status=0 QTime=4 
[junit4:junit4]   2> 16834 T1812 C167 P28237 /update {wt=javabin&version=2} {add=[123]} 0 7
[junit4:junit4]   2> 16838 T1784 C168 P28221 /update {wt=javabin&version=2} {add=[124 (1413584564934148096)]} 0 2
[junit4:junit4]   2> 16843 T1822 C164 P28254 REQ /update {distrib.from=http://127.0.0.1:28229/solr/collection1/&update.distrib=FROMLEADER&wt=javabin&version=2} status=0 QTime=1 
[junit4:junit4]   2> 16843 T1803 C165 P28229 /update {wt=javabin&version=2} {add=[124 (1413584564937293824)]} 0 4
[junit4:junit4]   2> 16847 T1784 C168 P28221 /update {wt=javabin&version=2} {add=[125 (1413584564944633856)]} 0 1
[junit4:junit4]   2> 16853 T1822 C164 P28254 REQ /update {distrib.from=http://127.0.0.1:28229/solr/collection1/&update.distrib=FROMLEADER&wt=javabin&version=2} status=0 QTime=1 
[junit4:junit4]   2> 16853 T1803 C165 P28229 /update {wt=javabin&version=2} {add=[125 (1413584564947779584)]} 0 4
[junit4:junit4]   2> 16857 T1784 C168 P28221 /update {wt=javabin&version=2} {add=[126 (1413584564955119616)]} 0 1
[junit4:junit4]   2> 16863 T1836 C166 P28284 REQ /update {distrib.from=http://127.0.0.1:28237/solr/collection1/&update.distrib=FROMLEADER&wt=javabin&version=2} status=0 QTime=1 
[junit4:junit4]   2> 16863 T1812 C167 P28237 /update {wt=javabin&version=2} {add=[126 (1413584564958265344)]} 0 4
[junit4:junit4]   2> 16867 T1784 C168 P28221 /update {wt=javabin&version=2} {add=[127 (1413584564965605376)]} 0 1
[junit4:junit4]   2> 16911 T1836 C166 P28284 REQ /update {distrib.from=http://127.0.0.1:28237/solr/collection1/&update.distrib=FROMLEADER&wt=javabin&version=2} status=0 QTime=20 
[junit4:junit4]   2> 16911 T1812 C167 P28237 /update {wt=javabin&version=2} {add=[127 (1413584564968751104)]} 0 42
[junit4:junit4]   2> 16915 T1784 C168 P28221 /update {wt=javabin&version=2} {add=[128 (1413584565015937024)]} 0 1
[junit4:junit4]   2> 16926 T1836 C166 P28284 REQ /update {update.distrib=FROMLEADER&distrib.from=http://127.0.0.1:28237/solr/collection1/&wt=javabin&version=2} status=0 QTime=2 
[junit4:junit4]   2> 16926 T1815 C167 P28237 REQ /update {distrib.from=http://127.0.0.1:28229/solr/collection1/&update.distrib=TOLEADER&wt=javabin&version=2} status=0 QTime=6 
[junit4:junit4]   2> 16927 T1803 C165 P28229 /update {wt=javabin&version=2} {add=[128]} 0 9
[junit4:junit4]   2> 16931 T1784 C168 P28221 /update {wt=javabin&version=2} {add=[129 (1413584565032714240)]} 0 1
[junit4:junit4]   2> 16937 T1822 C164 P28254 REQ /update {distrib.from=http://127.0.0.1:28229/solr/collection1/&update.distrib=FROMLEADER&wt=javabin&version=2} status=0 QTime=1 
[junit4:junit4]   2> 16937 T1803 C165 P28229 /update {wt=javabin&version=2} {add=[129 (1413584565035859968)]} 0 4
[junit4:junit4]   2> 16941 T1784 C168 P28221 /update {wt=javabin&version=2} {add=[130 (1413584565043200000)]} 0 1
[junit4:junit4]   2> 16947 T1836 C166 P28284 REQ /update {distrib.from=http://127.0.0.1:28237/solr/collection1/&update.distrib=FROMLEADER&wt=javabin&version=2} status=0 QTime=1 
[junit4:junit4]   2> 16947 T1812 C167 P28237 /update {wt=javabin&version=2} {add=[130 (1413584565046345728)]} 0 4
[junit4:junit4]   2> 16951 T1784 C168 P28221 /update {wt=javabin&version=2} {add=[131 (1413584565053685760)]} 0 1
[junit4:junit4]   2> 16957 T1836 C166 P28284 REQ /update {distrib.from=http://127.0.0.1:28237/solr/collection1/&update.distrib=FROMLEADER&wt=javabin&version=2} status=0 QTime=1 
[junit4:junit4]   2> 16957 T1812 C167 P28237 /update {wt=javabin&version=2} {add=[131 (1413584565056831488)]} 0 4
[junit4:junit4]   2> 16961 T1784 C168 P28221 /update {wt=javabin&version=2} {add=[132 (1413584565064171520)]} 0 1
[junit4:junit4]   2> 16969 T1822 C164 P28254 REQ /update {update.distrib=FROMLEADER&distrib.from=http://127.0.0.1:28229/solr/collection1/&wt=javabin&version=2} status=0 QTime=1 
[junit4:junit4]   2> 16969 T1800 C165 P28229 REQ /update {distrib.from=http://127.0.0.1:28237/solr/collection1/&update.distrib=TOLEADER&wt=javabin&version=2} status=0 QTime=4 
[junit4:junit4]   2> 16970 T1812 C167 P28237 /update {wt=javabin&version=2} {add=[132]} 0 7
[junit4:junit4]   2> 16991 T1784 C168 P28221 /update {wt=javabin&version=2} {add=[133 (1413584565076754432)]} 0 19
[junit4:junit4]   2> 17000 T1822 C164 P28254 REQ /update {update.distrib=FROMLEADER&distrib.from=http://127.0.0.1:28229/solr/collection1/&wt=javabin&version=2} status=0 QTime=1 
[junit4:junit4]   2> 17000 T1800 C165 P28229 REQ /update {distrib.from=http://127.0.0.1:28237/solr/collection1/&update.distrib=TOLEADER&wt=javabin&version=2} status=0 QTime=4 
[junit4:junit4]   2> 17001 T1812 C167 P28237 /update {wt=javabin&version=2} {add=[133]} 0 7
[junit4:junit4]   2> 17006 T1784 C168 P28221 /update {wt=javabin&version=2} {add=[134 (1413584565110308864)]} 0 2
[junit4:junit4]   2> 17013 T1836 C166 P28284 REQ /update {distrib.from=http://127.0.0.1:28237/solr/collection1/&update.distrib=FROMLEADER&wt=javabin&version=2} status=0 QTime=1 
[junit4:junit4]   2> 17014 T1812 C167 P28237 /update {wt=javabin&version=2} {add=[134 (1413584565115551744)]} 0 5
[junit4:junit4]   2> 17017 T1784 C168 P28221 /update {wt=javabin&version=2} {add=[135 (1413584565122891776)]} 0 1
[junit4:junit4]   2> 17025 T1822 C164 P28254 REQ /update {update.distrib=FROMLEADER&distrib.from=http://127.0.0.1:28229/solr/collection1/&wt=javabin&version=2} status=0 QTime=1 
[junit4:junit4]   2> 17025 T1800 C165 P28229 REQ /update {distrib.from=http://127.0.0.1:28237/solr/collection1/&update.distrib=TOLEADER&wt=javabin&version=2} status=0 QTime=4 
[junit4:junit4]   2> 17026 T1812 C167 P28237 /update {wt=javabin&version=2} {add=[135]} 0 7
[junit4:junit4]   2> 17029 T1784 C168 P28221 /update {wt=javabin&version=2} {add=[136 (1413584565135474688)]} 0 1
[junit4:junit4]   2> 17037 T1836 C166 P28284 REQ /update {update.distrib=FROMLEADER&distrib.from=http://127.0.0.1:28237/solr/collection1/&wt=javabin&version=2} status=0 QTime=1 
[junit4:junit4]   2> 17037 T1815 C167 P28237 REQ /update {distrib.from=http://127.0.0.1:28229/solr/collection1/&update.distrib=TOLEADER&wt=javabin&version=2} status=0 QTime=4 
[junit4:junit4]   2> 17038 T1803 C165 P28229 /update {wt=javabin&version=2} {add=[136]} 0 7
[junit4:junit4]   2> 17041 T1784 C168 P28221 /update {wt=javabin&version=2} {add=[137 (1413584565148057600)]} 0 1
[junit4:junit4]   2> 17049 T1836 C166 P28284 REQ /update {update.distrib=FROMLEADER&distrib.from=http://127.0.0.1:28237/solr/collection1/&wt=javabin&version=2} status=0 QTime=1 
[junit4:junit4]   2> 17049 T1815 C167 P28237 REQ /update {distrib.from=http://127.0.0.1:28229/solr/collection1/&update.distrib=TOLEADER&wt=javabin&version=2} status=0 QTime=4 
[junit4:junit4]   2> 17050 T1803 C165 P28229 /update {wt=javabin&version=2} {add=[137]} 0 7
[junit4:junit4]   2> 17053 T1784 C168 P28221 /update {wt=javabin&version=2} {add=[138 (1413584565160640512)]} 0 1
[junit4:junit4]   2> 17059 T1822 C164 P28254 REQ /update {distrib.from=http://127.0.0.1:28229/solr/collection1/&update.distrib=FROMLEADER&wt=javabin&version=2} status=0 QTime=1 
[junit4:junit4]   2> 17059 T1803 C165 P28229 /update {wt=javabin&version=2} {add=[138 (1413584565163786240)]} 0 4
[junit4:junit4]   2> 17063 T1784 C168 P28221 /update {wt=javabin&version=2} {add=[139 (1413584565171126272)]} 0 1
[junit4:junit4]   2> 17069 T1836 C166 P28284 REQ /update {distrib.from=http://127.0.0.1:28237/solr/collection1/&update.distrib=FROMLEADER&wt=javabin&version=2} status=0 QTime=1 
[junit4:junit4]   2> 17069 T1812 C167 P28237 /update {wt=javabin&version=2} {add=[139 (1413584565174272000)]} 0 4
[junit4:junit4]   2> 17073 T1784 C168 P28221 /update {wt=javabin&version=2} {add=[140 (1413584565181612032)]} 0 1
[junit4:junit4]   2> 17081 T1836 C166 P28284 REQ /update {update.distrib=FROMLEADER&distrib.from=http://127.0.0.1:28237/solr/collection1/&wt=javabin&version=2} status=0 QTime=1 
[junit4:junit4]   2> 17081 T1815 C167 P28237 REQ /update {distrib.from=http://127.0.0.1:28229/solr/collection1/&update.distrib=TOLEADER&wt=javabin&version=2} status=0 QTime=4 
[junit4:junit4]   2> 17082 T1803 C165 P28229 /update {wt=javabin&version=2} {add=[140]} 0 7
[junit4:junit4]   2> 17086 T1784 C168 P28221 /update {wt=javabin&version=2} {add=[141 (1413584565195243520)]} 0 1
[junit4:junit4]   2> 17094 T1836 C166 P28284 REQ /update {update.distrib=FROMLEADER&distrib.from=http://127.0.0.1:28237/solr/collection1/&wt=javabin&version=2} status=0 QTime=1 
[junit4:junit4]   2> 17094 T1815 C167 P28237 REQ /update {distrib.from=http://127.0.0.1:28229/solr/collection1/&update.distrib=TOLEADER&wt=javabin&version=2} status=0 QTime=4 
[junit4:junit4]   2> 17095 T1803 C165 P28229 /update {wt=javabin&version=2} {add=[141]} 0 7
[junit4:junit4]   2> 17099 T1784 C168 P28221 /update {wt=javabin&version=2} {add=[142 (1413584565208875008)]} 0 1
[junit4:junit4]   2> 17143 T1836 C166 P28284 REQ /update {update.distrib=FROMLEADER&distrib.from=http://127.0.0.1:28237/solr/collection1/&wt=javabin&version=2} status=0 QTime=18 
[junit4:junit4]   2> 17144 T1815 C167 P28237 REQ /update {distrib.from=http://127.0.0.1:28229/solr/collection1/&update.distrib=TOLEADER&wt=javabin&version=2} status=0 QTime=41 
[junit4:junit4]   2> 17144 T1803 C165 P28229 /update {wt=javabin&version=2} {add=[142]} 0 43
[junit4:junit4]   2> 17169 T1784 C168 P28221 /update {wt=javabin&version=2} {add=[143 (1413584565260255232)]} 0 22
[junit4:junit4]   2> 17178 T1836 C166 P28284 REQ /update {distrib.from=http://127.0.0.1:28237/solr/collection1/&update.distrib=FROMLEADER&wt=javabin&version=2} status=0 QTime=2 
[junit4:junit4]   2> 17179 T1812 C167 P28237 /update {wt=javabin&version=2} {add=[143 (1413584565286469632)]} 0 7
[junit4:junit4]   2> 17184 T1784 C168 P28221 /update {wt=javabin&version=2} {add=[144 (1413584565296955392)]} 0 2
[junit4:junit4]   2> 17193 T1836 C166 P28284 REQ /update {update.distrib=FROMLEADER&distrib.from=http://127.0.0.1:28237/solr/collection1/&wt=javabin&version=2} status=0 QTime=1 
[junit4:junit4]   2> 17193 T1815 C167 P28237 REQ /update {distrib.from=http://127.0.0.1:28229/solr/collection1/&update.distrib=TOLEADER&wt=javabin&version=2} status=0 QTime=4 
[junit4:junit4]   2> 17194 T1803 C165 P28229 /update {wt=javabin&version=2} {add=[144]} 0 7
[junit4:junit4]   2> 17197 T1784 C168 P28221 /update {wt=javabin&version=2} {add=[145 (1413584565311635456)]} 0 1
[junit4:junit4]   2> 17205 T1836 C166 P28284 REQ /update {update.distrib=FROMLEADER&distrib.from=http://127.0.0.1:28237/solr/collection1/&wt=javabin&version=2} status=0 QTime=1 
[junit4:junit4]   2> 17205 T1815 C167 P28237 REQ /update {distrib.from=http://127.0.0.1:28229/solr/collection1/&update.distrib=TOLEADER&wt=javabin&version=2} status=0 QTime=4 
[junit4:junit4]   2> 17206 T1803 C165 P28229 /update {wt=javabin&version=2} {add=[145]} 0 7
[junit4:junit4]   2> 17209 T1784 C168 P28221 /update {wt=javabin&version=2} {add=[146 (1413584565324218368)]} 0 1
[junit4:junit4]   2> 17253 T1822 C164 P28254 REQ /update {update.distrib=FROMLEADER&distrib.from=http://127.0.0.1:28229/solr/collection1/&wt=javabin&version=2} status=0 QTime=18 
[junit4:junit4]   2> 17254 T1800 C165 P28229 REQ /update {distrib.from=http://127.0.0.1:28237/solr/collection1/&update.distrib=TOLEADER&wt=javabin&version=2} status=0 QTime=41 
[junit4:junit4]   2> 17255 T1812 C167 P28237 /update {wt=javabin&version=2} {add=[146]} 0 44
[junit4:junit4]   2> 17259 T1784 C168 P28221 /update {wt=javabin&version=2} {add=[147 (1413584565376647168)]} 0 1
[junit4:junit4]   2> 17267 T1836 C166 P28284 REQ /update {update.distrib=FROMLEADER&distrib.from=http://127.0.0.1:28237/solr/collection1/&wt=javabin&version=2} status=0 QTime=1 
[junit4:junit4]   2> 17267 T1815 C167 P28237 REQ /update {distrib.from=http://127.0.0.1:28229/solr/collection1/&update.distrib=TOLEADER&wt=javabin&version=2} status=0 QTime=4 
[junit4:junit4]   2> 17268 T1803 C165 P28229 /update {wt=javabin&version=2} {add=[147]} 0 7
[junit4:junit4]   2> 17271 T1784 C168 P28221 /update {wt=javabin&version=2} {add=[148 (1413584565389230080)]} 0 1
[junit4:junit4]   2> 17281 T1822 C164 P28254 REQ /update {update.distrib=FROMLEADER&distrib.from=http://127.0.0.1:28229/solr/collection1/&wt=javabin&version=2} status=0 QTime=2 
[junit4:junit4]   2> 17281 T1800 C165 P28229 REQ /update {distrib.from=http://127.0.0.1:28237/solr/collection1/&update.distrib=TOLEADER&wt=javabin&version=2} status=0 QTime=6 
[junit4:junit4]   2> 17282 T1812 C167 P28237 /update {wt=javabin&version=2} {add=[148]} 0 9
[junit4:junit4]   2> 17286 T1784 C168 P28221 /update {wt=javabin&version=2} {add=[149 (1413584565404958720)]} 0 1
[junit4:junit4]   2> 17294 T1836 C166 P28284 REQ /update {update.distrib=FROMLEADER&distrib.from=http://127.0.0.1:28237/solr/collection1/&wt=javabin&version=2} status=0 QTime=1 
[junit4:junit4]   2> 17294 T1815 C167 P28237 REQ /update {distrib.from=http://127.0.0.1:28229/solr/collection1/&update.distrib=TOLEADER&wt=javabin&version=2} status=0 QTime=4 
[junit4:junit4]   2> 17295 T1803 C165 P28229 /update {wt=javabin&version=2} {add=[149]} 0 7
[junit4:junit4]   2> 17295 T1772 oasc.AbstractDistribZkTestBase.waitForRecoveriesToFinish Wait for recoveries to finish - collection: collection1 failOnTimeout:true timeout (sec):1800
[junit4:junit4]   2> 17296 T1772 oascc.ZkStateReader.updateClusterState Updating cloud state from ZooKeeper... 
[junit4:junit4]   2> 17299 T1784 C168 P28221 oasu.DirectUpdateHandler2.commit start commit{flags=0,_version_=0,optimize=false,openSearcher=true,waitSearcher=true,expungeDeletes=false,softCommit=false}
[junit4:junit4]   2> 17628 T1784 C168 P28221 oasc.SolrDeletionPolicy.onCommit SolrDeletionPolicy.onCommit: commits:num=2
[junit4:junit4]   2> 		commit{dir=/usr/home/hudson/hudson-slave/workspace/Lucene-Solr-Tests-4.x-Java6/solr/build/solr-core/test/J1/org.apache.solr.cloud.BasicDistributedZk2Test-1348099276813/control/data/index,segFN=segments_2,generation=2,filenames=[_0_MockSep_0.pos, _0_NestedPulsing_0.tip, _0_NestedPulsing_0.tim, _0_Lucene40WithOrds_0.tii, _0_Lucene40WithOrds_0.frq, _0_MockSep_0.skp, _0.si, _0_MockSep_0.doc, _0_Lucene40WithOrds_0.tib, _0_MockRandom_0.tib, _0.fnm, _0_NestedPulsing_0.frq, _0_nrm.cfs, _0_MockRandom_0.skp, _0_NestedPulsing_0.prx, _0_MockSep_0.tib, _0_MockRandom_0.frq, _0_MockRandom_0.sd, _0_MockRandom_0.doc, _0_nrm.cfe, _0_MockRandom_0.pos, segments_2, _0_MockRandom_0.tii, _0_MockSep_0.frq, _0.fdx, _0_MockSep_0.tii, _0_Lucene40WithOrds_0.prx, _0_MockSep_0.pyl, _0_MockRandom_0.pyl, _0.fdt]
[junit4:junit4]   2> 		commit{dir=/usr/home/hudson/hudson-slave/workspace/Lucene-Solr-Tests-4.x-Java6/solr/build/solr-core/test/J1/org.apache.solr.cloud.BasicDistributedZk2Test-1348099276813/control/data/index,segFN=segments_3,generation=3,filenames=[_1_NestedPulsing_0.tip, _5_nrm.cfe, _5_NestedPulsing_0.tip, _3_MockRandom_0.prx, _5_NestedPulsing_0.tim, _4_MockSep_0.skp, _3.fdt, _5_Lucene40WithOrds_0.tib, _2_MockSep_0.doc, _7.fnm, _7_NestedPulsing_0.frq, _0_Lucene40WithOrds_0.frq, _5_Lucene40WithOrds_0.tii, _1_Lucene40WithOrds_0.tib, _6_MockSep_0.doc, _5_MockSep_0.skp, _1_Lucene40WithOrds_0.tii, _1_NestedPulsing_0.tim, _6_MockSep_0.frq, _7_MockSep_0.tib, _1_MockSep_0.pyl, _1_Lucene40WithOrds_0.frq, _7_MockSep_0.tii, _1_MockSep_0.tib, _3_NestedPulsing_0.tim, _1_MockRandom_0.sd, _5_MockSep_0.doc, _1_MockSep_0.tii, _1.fdx, _0_MockRandom_0.frq, _1.fdt, _3_MockSep_0.pos, _3_NestedPulsing_0.tip, _5_nrm.cfs, _4_MockRandom_0.sd, _7_NestedPulsing_0.tim, _7_MockRandom_0.sd, _6.fdt, _7_NestedPulsing_0.tip, _5_Lucene40WithOrds_0.prx, _2.si, _6_MockSep_0.pyl, _2_MockSep_0.skp, _6.fdx, _1_Lucene40WithOrds_0.prx, _5_MockSep_0.tii, _2_nrm.cfe, _6_MockRandom_0.tib, _6_MockRandom_0.pyl, _6_MockRandom_0.doc, _6_MockRandom_0.tii, _2_nrm.cfs, _2_MockRandom_0.prx, _2_NestedPulsing_0.prx, _0_NestedPulsing_0.frq, _0_NestedPulsing_0.prx, _2.fnm, _3.fdx, _2_MockRandom_0.sd, _2_MockSep_0.pyl, _1.si, _5_MockSep_0.tib, _6_NestedPulsing_0.tip, _0_Lucene40WithOrds_0.prx, _3_MockSep_0.skp, _6_NestedPulsing_0.tim, _3_nrm.cfe, _3_MockSep_0.doc, _3_Lucene40WithOrds_0.tii, _4_nrm.cfe, _6_Lucene40WithOrds_0.prx, _3_Lucene40WithOrds_0.tib, _4.fdx, _7_MockRandom_0.frq, _5_MockRandom_0.sd, _4_MockRandom_0.tip, _7_MockSep_0.pos, _4_MockRandom_0.tim, _6_MockSep_0.tii, _1_MockSep_0.doc, _6_MockSep_0.tib, _7_Lucene40WithOrds_0.tib, _3_MockRandom_0.tii, _3_MockRandom_0.tib, _5.si, _3_nrm.cfs, _7_Lucene40WithOrds_0.tii, _6_MockRandom_0.sd, _4_Lucene40WithOrds_0.prx, _0_MockRandom_0.doc, _4_nrm.cfs, _1_MockRandom_0.frq, _5_MockSep_0.pyl, _5_MockRandom_0.frq, _5_MockRandom_0.tib, _1_NestedPulsing_0.prx, _5_MockRandom_0.tii, _6_nrm.cfs, _2_Lucene40WithOrds_0.prx, _7_nrm.cfs, _0_MockSep_0.doc, _0_MockRandom_0.tib, _1_nrm.cfs, _5.fnm, _7_nrm.cfe, _7_NestedPulsing_0.prx, _6_nrm.cfe, _2_MockSep_0.frq, _3_Lucene40WithOrds_0.frq, _4.fdt, _4.si, _1_nrm.cfe, _3_MockRandom_0.sd, _5_NestedPulsing_0.prx, _2_MockRandom_0.frq, _0_MockSep_0.frq, _0_MockRandom_0.tii, _0_MockRandom_0.pyl, _2_NestedPulsing_0.tim, _0_MockSep_0.pos, _4_MockSep_0.tib, _7.si, _3_NestedPulsing_0.prx, _3_MockSep_0.frq, _0_Lucene40WithOrds_0.tii, _6_NestedPulsing_0.prx, _7_Lucene40WithOrds_0.frq, _4_MockSep_0.doc, _0_Lucene40WithOrds_0.tib, _2_NestedPulsing_0.tip, _6_MockRandom_0.skp, _1_MockSep_0.skp, _2.fdt, _7.fdx, _2.fdx, _7.fdt, _0_MockRandom_0.skp, _1_MockRandom_0.tii, _7_MockRandom_0.prx, _1_MockRandom_0.tib, _4_MockRandom_0.prx, _7_MockSep_0.doc, _4_MockSep_0.pyl, _3.si, _4_NestedPulsing_0.frq, _4_MockSep_0.tii, _6_NestedPulsing_0.frq, _4_Lucene40WithOrds_0.tib, _4_Lucene40WithOrds_0.tii, _3_MockRandom_0.frq, _3.fnm, _0_NestedPulsing_0.tip, _3_MockSep_0.pyl, _2_MockRandom_0.tiv, _0_NestedPulsing_0.tim, _7_MockSep_0.frq, _6_MockSep_0.pos, _4_NestedPulsing_0.tip, _4_NestedPulsing_0.tim, _2_MockRandom_0.tib, _1_MockSep_0.pos, _2_Lucene40WithOrds_0.frq, _6_MockSep_0.skp, _1_Nest

[...truncated too long message...]

t org.apache.solr.cloud.ShardLeaderElectionContext.runLeaderProcess(ElectionContext.java:213)
[junit4:junit4]   2> 	at org.apache.solr.cloud.LeaderElector.runIamLeaderProcess(LeaderElector.java:158)
[junit4:junit4]   2> 	at org.apache.solr.cloud.LeaderElector.checkIfIamLeader(LeaderElector.java:102)
[junit4:junit4]   2> 	at org.apache.solr.cloud.LeaderElector.access$000(LeaderElector.java:56)
[junit4:junit4]   2> 	at org.apache.solr.cloud.LeaderElector$1.process(LeaderElector.java:131)
[junit4:junit4]   2> 	at org.apache.zookeeper.ClientCnxn$EventThread.processEvent(ClientCnxn.java:526)
[junit4:junit4]   2> 	at org.apache.zookeeper.ClientCnxn$EventThread.run(ClientCnxn.java:502)
[junit4:junit4]   2> 
[junit4:junit4]   2> 308004 T1844 oasc.JmxMonitoredMap$SolrDynamicMBean.getMBeanInfo WARNING Could not getStatistics on info bean Lazy[solr.ReplicationHandler] java.lang.IllegalArgumentException: /usr/home/hudson/hudson-slave/workspace/Lucene-Solr-Tests-4.x-Java6/solr/build/solr-core/test/J1/org.apache.solr.cloud.BasicDistributedZk2Test-1348099276813/jetty4/index does not exist
[junit4:junit4]   2> 	at org.apache.commons.io.FileUtils.sizeOfDirectory(FileUtils.java:2074)
[junit4:junit4]   2> 	at org.apache.solr.handler.ReplicationHandler.getIndexSize(ReplicationHandler.java:477)
[junit4:junit4]   2> 	at org.apache.solr.handler.ReplicationHandler.getStatistics(ReplicationHandler.java:525)
[junit4:junit4]   2> 	at org.apache.solr.core.RequestHandlers$LazyRequestHandlerWrapper.getStatistics(RequestHandlers.java:310)
[junit4:junit4]   2> 	at org.apache.solr.core.JmxMonitoredMap$SolrDynamicMBean.getMBeanInfo(JmxMonitoredMap.java:231)
[junit4:junit4]   2> 	at com.sun.jmx.interceptor.DefaultMBeanServerInterceptor.getClassName(DefaultMBeanServerInterceptor.java:1824)
[junit4:junit4]   2> 	at com.sun.jmx.interceptor.DefaultMBeanServerInterceptor.safeGetClassName(DefaultMBeanServerInterceptor.java:1661)
[junit4:junit4]   2> 	at com.sun.jmx.interceptor.DefaultMBeanServerInterceptor.checkMBeanPermission(DefaultMBeanServerInterceptor.java:1833)
[junit4:junit4]   2> 	at com.sun.jmx.interceptor.DefaultMBeanServerInterceptor.exclusiveUnregisterMBean(DefaultMBeanServerInterceptor.java:436)
[junit4:junit4]   2> 	at com.sun.jmx.interceptor.DefaultMBeanServerInterceptor.unregisterMBean(DefaultMBeanServerInterceptor.java:421)
[junit4:junit4]   2> 	at com.sun.jmx.mbeanserver.JmxMBeanServer.unregisterMBean(JmxMBeanServer.java:540)
[junit4:junit4]   2> 	at org.apache.solr.core.JmxMonitoredMap.unregister(JmxMonitoredMap.java:175)
[junit4:junit4]   2> 	at org.apache.solr.core.JmxMonitoredMap.clear(JmxMonitoredMap.java:116)
[junit4:junit4]   2> 	at org.apache.solr.core.SolrCore.close(SolrCore.java:864)
[junit4:junit4]   2> 	at org.apache.solr.cloud.ShardLeaderElectionContext.runLeaderProcess(ElectionContext.java:213)
[junit4:junit4]   2> 	at org.apache.solr.cloud.LeaderElector.runIamLeaderProcess(LeaderElector.java:158)
[junit4:junit4]   2> 	at org.apache.solr.cloud.LeaderElector.checkIfIamLeader(LeaderElector.java:102)
[junit4:junit4]   2> 	at org.apache.solr.cloud.LeaderElector.access$000(LeaderElector.java:56)
[junit4:junit4]   2> 	at org.apache.solr.cloud.LeaderElector$1.process(LeaderElector.java:131)
[junit4:junit4]   2> 	at org.apache.zookeeper.ClientCnxn$EventThread.processEvent(ClientCnxn.java:526)
[junit4:junit4]   2> 	at org.apache.zookeeper.ClientCnxn$EventThread.run(ClientCnxn.java:502)
[junit4:junit4]   2> 
[junit4:junit4]   2> 308008 T1844 oasc.SolrCore.closeSearcher [collection1] Closing main searcher on request.
[junit4:junit4]   2> 308011 T1844 oasu.DirectUpdateHandler2.close closing DirectUpdateHandler2{commits=5,autocommits=0,soft autocommits=0,optimizes=0,rollbacks=0,expungeDeletes=0,docsPending=0,adds=0,deletesById=0,deletesByQuery=0,errors=0,cumulative_adds=35,cumulative_deletesById=0,cumulative_deletesByQuery=0,cumulative_errors=0}
[junit4:junit4]   2> 308012 T1844 oasu.DefaultSolrCoreState.decref SolrCoreState ref count has reached 0 - closing IndexWriter
[junit4:junit4]   2> 308014 T1844 oasu.DefaultSolrCoreState.decref Closing SolrCoreState - canceling any ongoing recovery
[junit4:junit4]   2> 308014 T1844 oascc.ZkStateReader$3.process Updating live nodes
[junit4:junit4]   2> 308014 T1844 oascc.ZkStateReader$3.process WARNING ZooKeeper watch triggered, but Solr cannot talk to ZK
[junit4:junit4]   2> 308014 T1844 oascc.ZkStateReader$2.process A cluster state change has occurred - updating...
[junit4:junit4]   2> 308014 T1844 oascc.ZkStateReader$2.process WARNING ZooKeeper watch triggered, but Solr cannot talk to ZK
[junit4:junit4]   2> 308015 T1844 oascc.ConnectionManager.process Watcher org.apache.solr.common.cloud.ConnectionManager@52f5d154 name:ZooKeeperConnection Watcher:127.0.0.1:28218/solr got event WatchedEvent state:Disconnected type:None path:null path:null type:None
[junit4:junit4]   2> 308015 T1844 oascc.ConnectionManager.process Client->ZooKeeper status change trigger but we are already closed
[junit4:junit4]   2> 308015 T1844 oaz.ClientCnxn$EventThread.run EventThread shut down
[junit4:junit4]   2> NOTE: test params are: codec=Lucene40: {n_f1=PostingsFormat(name=MockRandom), foo_b=PostingsFormat(name=NestedPulsing), foo_d=PostingsFormat(name=MockSep), foo_f=PostingsFormat(name=NestedPulsing), n_tl1=PostingsFormat(name=MockRandom), n_d1=PostingsFormat(name=Lucene40WithOrds), rnd_b=PostingsFormat(name=MockSep), intDefault=PostingsFormat(name=Lucene40WithOrds), n_td1=PostingsFormat(name=MockRandom), id=PostingsFormat(name=MockSep), timestamp=PostingsFormat(name=Lucene40WithOrds), range_facet_sl=PostingsFormat(name=NestedPulsing), range_facet_si=PostingsFormat(name=MockRandom), oddField_s=PostingsFormat(name=NestedPulsing), multiDefault=PostingsFormat(name=MockRandom), n_tf1=PostingsFormat(name=Lucene40WithOrds), n_dt1=PostingsFormat(name=MockRandom), n_ti1=PostingsFormat(name=MockSep), range_facet_l=PostingsFormat(name=Lucene40WithOrds), text=PostingsFormat(name=NestedPulsing), _version_=PostingsFormat(name=Lucene40WithOrds), SubjectTerms_mfacet=PostingsFormat(name=Lucene40WithOrds), a_t=PostingsFormat(name=Lucene40WithOrds), n_tdt1=PostingsFormat(name=Lucene40WithOrds), other_tl1=PostingsFormat(name=Lucene40WithOrds), n_l1=PostingsFormat(name=Lucene40WithOrds), a_si=PostingsFormat(name=MockRandom)}, sim=RandomSimilarityProvider(queryNorm=false,coord=no): {}, locale=ko, timezone=America/Adak
[junit4:junit4]   2> NOTE: FreeBSD 9.0-RELEASE amd64/Sun Microsystems Inc. 1.6.0_32 (64-bit)/cpus=16,threads=2,free=84894664,total=193921024
[junit4:junit4]   2> NOTE: All tests run in this JVM: [DebugComponentTest, TimeZoneUtilsTest, SuggesterTSTTest, TestSolrCoreProperties, PingRequestHandlerTest, IndexSchemaRuntimeFieldTest, LeaderElectionTest, TestSolrXMLSerializer, XmlUpdateRequestHandlerTest, TestFunctionQuery, DistributedQueryElevationComponentTest, ClusterStateUpdateTest, MultiTermTest, TestDocSet, BadIndexSchemaTest, QueryParsingTest, DirectSolrSpellCheckerTest, TestUtils, TestSolrDeletionPolicy1, ReturnFieldsTest, OpenExchangeRatesOrgProviderTest, TestDistributedSearch, DisMaxRequestHandlerTest, TestStressRecovery, DocumentBuilderTest, ShowFileRequestHandlerTest, TestArbitraryIndexDir, TestUpdate, PathHierarchyTokenizerFactoryTest, TestJmxIntegration, RequiredFieldsTest, TestFoldingMultitermQuery, StatsComponentTest, DOMUtilTest, FieldMutatingUpdateProcessorTest, SolrCoreTest, FileUtilsTest, TestCharFilters, TestReload, TestValueSourceCache, BasicFunctionalityTest, TestPhraseSuggestions, TestMultiCoreConfBootstrap, RAMDirectoryFactoryTest, LukeRequestHandlerTest, TestHashPartitioner, SoftAutoCommitTest, DocumentAnalysisRequestHandlerTest, TestSort, ZkNodePropsTest, FullSolrCloudDistribCmdsTest, TestRealTimeGet, LegacyHTMLStripCharFilterTest, TermVectorComponentTest, RecoveryZkTest, ZkControllerTest, TestDistributedGrouping, SpellCheckCollatorTest, TestExtendedDismaxParser, BasicZkTest, ZkSolrClientTest, TestFaceting, TestRecovery, TestJoin, HighlighterTest, CoreAdminHandlerTest, DirectSolrConnectionTest, TestRemoteStreaming, QueryEqualityTest, TestCSVLoader, TestCSVResponseWriter, TestPseudoReturnFields, BinaryUpdateRequestHandlerTest, XsltUpdateRequestHandlerTest, SuggesterWFSTTest, DirectUpdateHandlerOptimizeTest, TestReversedWildcardFilterFactory, SearchHandlerTest, CopyFieldTest, SolrCmdDistributorTest, TestLuceneMatchVersion, TestPropInject, PrimitiveFieldTypeTest, BadComponentTest, TestSolrDeletionPolicy2, TestPropInjectDefaults, TestLFUCache, SolrIndexConfigTest, NumericFieldsTest, TestNumberUtils, TestJmxMonitoredMap, SpellPossibilityIteratorTest, TestBM25SimilarityFactory, TestLMJelinekMercerSimilarityFactory, TestCodecSupport, DateMathParserTest, PluginInfoTest, PrimUtilsTest, DateFieldTest, TestSuggestSpellingConverter, TestLRUCache, UUIDFieldTest, SystemInfoHandlerTest, PreAnalyzedFieldTest, CircularListTest, TestDocumentBuilder, BasicDistributedZk2Test]
[junit4:junit4] Completed on J1 in 308.43s, 1 test, 1 failure <<< FAILURES!

[...truncated 10 lines...]
BUILD FAILED
/usr/home/hudson/hudson-slave/workspace/Lucene-Solr-Tests-4.x-Java6/build.xml:32: The following error occurred while executing this line:
/usr/home/hudson/hudson-slave/workspace/Lucene-Solr-Tests-4.x-Java6/solr/build.xml:146: The following error occurred while executing this line:
/usr/home/hudson/hudson-slave/workspace/Lucene-Solr-Tests-4.x-Java6/lucene/module-build.xml:63: The following error occurred while executing this line:
/usr/home/hudson/hudson-slave/workspace/Lucene-Solr-Tests-4.x-Java6/lucene/common-build.xml:1140: The following error occurred while executing this line:
/usr/home/hudson/hudson-slave/workspace/Lucene-Solr-Tests-4.x-Java6/lucene/common-build.xml:813: There were test failures: 230 suites, 951 tests, 1 failure, 8 ignored (3 assumptions)

Total time: 32 minutes 5 seconds
Build step 'Invoke Ant' marked build as failure
Recording test results
Email was triggered for: Failure
Sending email for trigger: Failure



Mime
View raw message