lucene-dev mailing list archives

Site index · List index
Message view « Date » · « Thread »
Top « Date » · « Thread »
From Mark Miller <markrmil...@gmail.com>
Subject Re: [JENKINS] Lucene-Solr-NightlyTests-4.x - Build # 43 - Failure
Date Sun, 23 Sep 2012 22:12:29 GMT
I'll get these fails cleaned up on the freebsd jenkins - SOLR-3869 is a big part of it I think.

My old machine that runs my freebsd virtual box went down, but I just got it back up on another machine - working through any issues now.

- Mark

On Sep 23, 2012, at 5:44 PM, Apache Jenkins Server <jenkins@builds.apache.org> wrote:

> Build: https://builds.apache.org/job/Lucene-Solr-NightlyTests-4.x/43/
> 
> 2 tests failed.
> REGRESSION:  org.apache.solr.cloud.SyncSliceTest.testDistribSearch
> 
> Error Message:
> There are still nodes recoverying
> 
> Stack Trace:
> java.lang.AssertionError: There are still nodes recoverying
> 	at __randomizedtesting.SeedInfo.seed([7D33AFC3368A2564:FCD521DB41D54558]:0)
> 	at org.junit.Assert.fail(Assert.java:93)
> 	at org.apache.solr.cloud.AbstractDistribZkTestBase.waitForRecoveriesToFinish(AbstractDistribZkTestBase.java:154)
> 	at org.apache.solr.cloud.AbstractFullDistribZkTestBase.waitForRecoveriesToFinish(AbstractFullDistribZkTestBase.java:560)
> 	at org.apache.solr.cloud.AbstractFullDistribZkTestBase.waitForThingsToLevelOut(AbstractFullDistribZkTestBase.java:1135)
> 	at org.apache.solr.cloud.SyncSliceTest.doTest(SyncSliceTest.java:162)
> 	at org.apache.solr.BaseDistributedSearchTestCase.testDistribSearch(BaseDistributedSearchTestCase.java:695)
> 	at sun.reflect.NativeMethodAccessorImpl.invoke0(Native Method)
> 	at sun.reflect.NativeMethodAccessorImpl.invoke(NativeMethodAccessorImpl.java:57)
> 	at sun.reflect.DelegatingMethodAccessorImpl.invoke(DelegatingMethodAccessorImpl.java:43)
> 	at java.lang.reflect.Method.invoke(Method.java:616)
> 	at com.carrotsearch.randomizedtesting.RandomizedRunner.invoke(RandomizedRunner.java:1559)
> 	at com.carrotsearch.randomizedtesting.RandomizedRunner.access$600(RandomizedRunner.java:79)
> 	at com.carrotsearch.randomizedtesting.RandomizedRunner$6.evaluate(RandomizedRunner.java:737)
> 	at com.carrotsearch.randomizedtesting.RandomizedRunner$7.evaluate(RandomizedRunner.java:773)
> 	at com.carrotsearch.randomizedtesting.RandomizedRunner$8.evaluate(RandomizedRunner.java:787)
> 	at com.carrotsearch.randomizedtesting.rules.SystemPropertiesRestoreRule$1.evaluate(SystemPropertiesRestoreRule.java:53)
> 	at org.apache.lucene.util.TestRuleSetupTeardownChained$1.evaluate(TestRuleSetupTeardownChained.java:50)
> 	at org.apache.lucene.util.TestRuleFieldCacheSanity$1.evaluate(TestRuleFieldCacheSanity.java:51)
> 	at org.apache.lucene.util.AbstractBeforeAfterRule$1.evaluate(AbstractBeforeAfterRule.java:45)
> 	at com.carrotsearch.randomizedtesting.rules.SystemPropertiesInvariantRule$1.evaluate(SystemPropertiesInvariantRule.java:55)
> 	at org.apache.lucene.util.TestRuleThreadAndTestName$1.evaluate(TestRuleThreadAndTestName.java:48)
> 	at org.apache.lucene.util.TestRuleIgnoreAfterMaxFailures$1.evaluate(TestRuleIgnoreAfterMaxFailures.java:70)
> 	at org.apache.lucene.util.TestRuleMarkFailure$1.evaluate(TestRuleMarkFailure.java:48)
> 	at com.carrotsearch.randomizedtesting.rules.StatementAdapter.evaluate(StatementAdapter.java:36)
> 	at com.carrotsearch.randomizedtesting.ThreadLeakControl$StatementRunner.run(ThreadLeakControl.java:358)
> 	at com.carrotsearch.randomizedtesting.ThreadLeakControl.forkTimeoutingTask(ThreadLeakControl.java:782)
> 	at com.carrotsearch.randomizedtesting.ThreadLeakControl$3.evaluate(ThreadLeakControl.java:442)
> 	at com.carrotsearch.randomizedtesting.RandomizedRunner.runSingleTest(RandomizedRunner.java:746)
> 	at com.carrotsearch.randomizedtesting.RandomizedRunner$3.evaluate(RandomizedRunner.java:648)
> 	at com.carrotsearch.randomizedtesting.RandomizedRunner$4.evaluate(RandomizedRunner.java:682)
> 	at com.carrotsearch.randomizedtesting.RandomizedRunner$5.evaluate(RandomizedRunner.java:693)
> 	at com.carrotsearch.randomizedtesting.rules.StatementAdapter.evaluate(StatementAdapter.java:36)
> 	at com.carrotsearch.randomizedtesting.rules.SystemPropertiesRestoreRule$1.evaluate(SystemPropertiesRestoreRule.java:53)
> 	at org.apache.lucene.util.AbstractBeforeAfterRule$1.evaluate(AbstractBeforeAfterRule.java:45)
> 	at org.apache.lucene.util.TestRuleStoreClassName$1.evaluate(TestRuleStoreClassName.java:42)
> 	at com.carrotsearch.randomizedtesting.rules.SystemPropertiesInvariantRule$1.evaluate(SystemPropertiesInvariantRule.java:55)
> 	at com.carrotsearch.randomizedtesting.rules.NoShadowingOrOverridesOnMethodsRule$1.evaluate(NoShadowingOrOverridesOnMethodsRule.java:39)
> 	at com.carrotsearch.randomizedtesting.rules.NoShadowingOrOverridesOnMethodsRule$1.evaluate(NoShadowingOrOverridesOnMethodsRule.java:39)
> 	at com.carrotsearch.randomizedtesting.rules.StatementAdapter.evaluate(StatementAdapter.java:36)
> 	at org.apache.lucene.util.TestRuleAssertionsRequired$1.evaluate(TestRuleAssertionsRequired.java:43)
> 	at org.apache.lucene.util.TestRuleMarkFailure$1.evaluate(TestRuleMarkFailure.java:48)
> 	at org.apache.lucene.util.TestRuleIgnoreAfterMaxFailures$1.evaluate(TestRuleIgnoreAfterMaxFailures.java:70)
> 	at org.apache.lucene.util.TestRuleIgnoreTestSuites$1.evaluate(TestRuleIgnoreTestSuites.java:55)
> 	at com.carrotsearch.randomizedtesting.rules.StatementAdapter.evaluate(StatementAdapter.java:36)
> 	at com.carrotsearch.randomizedtesting.ThreadLeakControl$StatementRunner.run(ThreadLeakControl.java:358)
> 	at java.lang.Thread.run(Thread.java:679)
> 
> 
> FAILED:  org.apache.solr.cloud.BasicDistributedZk2Test.testDistribSearch
> 
> Error Message:
> Shard still reported as live in zk
> 
> Stack Trace:
> java.lang.AssertionError: Shard still reported as live in zk
> 	at __randomizedtesting.SeedInfo.seed([7D33AFC3368A2564:FCD521DB41D54558]:0)
> 	at org.junit.Assert.fail(Assert.java:93)
> 	at org.apache.solr.cloud.AbstractFullDistribZkTestBase.waitToSeeNotLive(AbstractFullDistribZkTestBase.java:1220)
> 	at org.apache.solr.cloud.BasicDistributedZk2Test.brindDownShardIndexSomeDocsAndRecover(BasicDistributedZk2Test.java:190)
> 	at org.apache.solr.cloud.BasicDistributedZk2Test.doTest(BasicDistributedZk2Test.java:83)
> 	at org.apache.solr.BaseDistributedSearchTestCase.testDistribSearch(BaseDistributedSearchTestCase.java:695)
> 	at sun.reflect.NativeMethodAccessorImpl.invoke0(Native Method)
> 	at sun.reflect.NativeMethodAccessorImpl.invoke(NativeMethodAccessorImpl.java:57)
> 	at sun.reflect.DelegatingMethodAccessorImpl.invoke(DelegatingMethodAccessorImpl.java:43)
> 	at java.lang.reflect.Method.invoke(Method.java:616)
> 	at com.carrotsearch.randomizedtesting.RandomizedRunner.invoke(RandomizedRunner.java:1559)
> 	at com.carrotsearch.randomizedtesting.RandomizedRunner.access$600(RandomizedRunner.java:79)
> 	at com.carrotsearch.randomizedtesting.RandomizedRunner$6.evaluate(RandomizedRunner.java:737)
> 	at com.carrotsearch.randomizedtesting.RandomizedRunner$7.evaluate(RandomizedRunner.java:773)
> 	at com.carrotsearch.randomizedtesting.RandomizedRunner$8.evaluate(RandomizedRunner.java:787)
> 	at com.carrotsearch.randomizedtesting.rules.SystemPropertiesRestoreRule$1.evaluate(SystemPropertiesRestoreRule.java:53)
> 	at org.apache.lucene.util.TestRuleSetupTeardownChained$1.evaluate(TestRuleSetupTeardownChained.java:50)
> 	at org.apache.lucene.util.TestRuleFieldCacheSanity$1.evaluate(TestRuleFieldCacheSanity.java:51)
> 	at org.apache.lucene.util.AbstractBeforeAfterRule$1.evaluate(AbstractBeforeAfterRule.java:45)
> 	at com.carrotsearch.randomizedtesting.rules.SystemPropertiesInvariantRule$1.evaluate(SystemPropertiesInvariantRule.java:55)
> 	at org.apache.lucene.util.TestRuleThreadAndTestName$1.evaluate(TestRuleThreadAndTestName.java:48)
> 	at org.apache.lucene.util.TestRuleIgnoreAfterMaxFailures$1.evaluate(TestRuleIgnoreAfterMaxFailures.java:70)
> 	at org.apache.lucene.util.TestRuleMarkFailure$1.evaluate(TestRuleMarkFailure.java:48)
> 	at com.carrotsearch.randomizedtesting.rules.StatementAdapter.evaluate(StatementAdapter.java:36)
> 	at com.carrotsearch.randomizedtesting.ThreadLeakControl$StatementRunner.run(ThreadLeakControl.java:358)
> 	at com.carrotsearch.randomizedtesting.ThreadLeakControl.forkTimeoutingTask(ThreadLeakControl.java:782)
> 	at com.carrotsearch.randomizedtesting.ThreadLeakControl$3.evaluate(ThreadLeakControl.java:442)
> 	at com.carrotsearch.randomizedtesting.RandomizedRunner.runSingleTest(RandomizedRunner.java:746)
> 	at com.carrotsearch.randomizedtesting.RandomizedRunner$3.evaluate(RandomizedRunner.java:648)
> 	at com.carrotsearch.randomizedtesting.RandomizedRunner$4.evaluate(RandomizedRunner.java:682)
> 	at com.carrotsearch.randomizedtesting.RandomizedRunner$5.evaluate(RandomizedRunner.java:693)
> 	at com.carrotsearch.randomizedtesting.rules.StatementAdapter.evaluate(StatementAdapter.java:36)
> 	at com.carrotsearch.randomizedtesting.rules.SystemPropertiesRestoreRule$1.evaluate(SystemPropertiesRestoreRule.java:53)
> 	at org.apache.lucene.util.AbstractBeforeAfterRule$1.evaluate(AbstractBeforeAfterRule.java:45)
> 	at org.apache.lucene.util.TestRuleStoreClassName$1.evaluate(TestRuleStoreClassName.java:42)
> 	at com.carrotsearch.randomizedtesting.rules.SystemPropertiesInvariantRule$1.evaluate(SystemPropertiesInvariantRule.java:55)
> 	at com.carrotsearch.randomizedtesting.rules.NoShadowingOrOverridesOnMethodsRule$1.evaluate(NoShadowingOrOverridesOnMethodsRule.java:39)
> 	at com.carrotsearch.randomizedtesting.rules.NoShadowingOrOverridesOnMethodsRule$1.evaluate(NoShadowingOrOverridesOnMethodsRule.java:39)
> 	at com.carrotsearch.randomizedtesting.rules.StatementAdapter.evaluate(StatementAdapter.java:36)
> 	at org.apache.lucene.util.TestRuleAssertionsRequired$1.evaluate(TestRuleAssertionsRequired.java:43)
> 	at org.apache.lucene.util.TestRuleMarkFailure$1.evaluate(TestRuleMarkFailure.java:48)
> 	at org.apache.lucene.util.TestRuleIgnoreAfterMaxFailures$1.evaluate(TestRuleIgnoreAfterMaxFailures.java:70)
> 	at org.apache.lucene.util.TestRuleIgnoreTestSuites$1.evaluate(TestRuleIgnoreTestSuites.java:55)
> 	at com.carrotsearch.randomizedtesting.rules.StatementAdapter.evaluate(StatementAdapter.java:36)
> 	at com.carrotsearch.randomizedtesting.ThreadLeakControl$StatementRunner.run(ThreadLeakControl.java:358)
> 	at java.lang.Thread.run(Thread.java:679)
> 
> 
> 
> 
> Build Log:
> [...truncated 7414 lines...]
> [junit4:junit4] Suite: org.apache.solr.cloud.SyncSliceTest
> [junit4:junit4]   2> 7 T2425 oas.SolrTestCaseJ4.setUp ###Starting testDistribSearch
> [junit4:junit4]   2> Creating dataDir: /usr/home/hudson/hudson-slave/workspace/Lucene-Solr-NightlyTests-4.x/solr/build/solr-core/test/J1/./solrtest-SyncSliceTest-1348435918933
> [junit4:junit4]   2> 8 T2425 oasc.ZkTestServer.run STARTING ZK TEST SERVER
> [junit4:junit4]   2> 11 T2426 oazs.ZooKeeperServer.setTickTime tickTime set to 1000
> [junit4:junit4]   2> 11 T2426 oazs.NIOServerCnxn$Factory.<init> binding to port 0.0.0.0/0.0.0.0:0
> [junit4:junit4]   2> 12 T2426 oazsp.FileTxnSnapLog.save Snapshotting: 0
> [junit4:junit4]   2> 109 T2425 oasc.ZkTestServer.run start zk server on port:24639
> [junit4:junit4]   2> 109 T2425 oaz.ZooKeeper.<init> Initiating client connection, connectString=127.0.0.1:24639 sessionTimeout=10000 watcher=org.apache.solr.common.cloud.ConnectionManager@5b1b39ea
> [junit4:junit4]   2> 110 T2431 oaz.ClientCnxn$SendThread.startConnect Opening socket connection to server /127.0.0.1:24639
> [junit4:junit4]   2> 110 T2425 oascc.ConnectionManager.waitForConnected Waiting for client to connect to ZooKeeper
> [junit4:junit4]   2> 111 T2431 oaz.ClientCnxn$SendThread.primeConnection Socket connection established to localhost/127.0.0.1:24639, initiating session
> [junit4:junit4]   2> 111 T2427 oazs.NIOServerCnxn$Factory.run Accepted socket connection from /140.211.11.196:24640
> [junit4:junit4]   2> 112 T2427 oazs.NIOServerCnxn.readConnectRequest Client attempting to establish new session at /140.211.11.196:24640
> [junit4:junit4]   2> 112 T2429 oazsp.FileTxnLog.append Creating new log file: log.1
> [junit4:junit4]   2> 116 T2429 oazs.NIOServerCnxn.finishSessionInit Established session 0x139f50b40590000 with negotiated timeout 10000 for client /140.211.11.196:24640
> [junit4:junit4]   2> 116 T2431 oaz.ClientCnxn$SendThread.readConnectResult Session establishment complete on server localhost/127.0.0.1:24639, sessionid = 0x139f50b40590000, negotiated timeout = 10000
> [junit4:junit4]   2> 116 T2432 oascc.ConnectionManager.process Watcher org.apache.solr.common.cloud.ConnectionManager@5b1b39ea name:ZooKeeperConnection Watcher:127.0.0.1:24639 got event WatchedEvent state:SyncConnected type:None path:null path:null type:None
> [junit4:junit4]   2> 117 T2425 oascc.ConnectionManager.waitForConnected Client is connected to ZooKeeper
> [junit4:junit4]   2> 117 T2425 oascc.SolrZkClient.makePath makePath: /solr
> [junit4:junit4]   2> 120 T2430 oazs.PrepRequestProcessor.pRequest Processed session termination for sessionid: 0x139f50b40590000
> [junit4:junit4]   2> 132 T2432 oaz.ClientCnxn$EventThread.run EventThread shut down
> [junit4:junit4]   2> 132 T2427 oazs.NIOServerCnxn.closeSock Closed socket connection for client /140.211.11.196:24640 which had sessionid 0x139f50b40590000
> [junit4:junit4]   2> 132 T2425 oaz.ZooKeeper.close Session: 0x139f50b40590000 closed
> [junit4:junit4]   2> 133 T2425 oaz.ZooKeeper.<init> Initiating client connection, connectString=127.0.0.1:24639/solr sessionTimeout=10000 watcher=org.apache.solr.common.cloud.ConnectionManager@6ca2a729
> [junit4:junit4]   2> 133 T2433 oaz.ClientCnxn$SendThread.startConnect Opening socket connection to server /127.0.0.1:24639
> [junit4:junit4]   2> 133 T2425 oascc.ConnectionManager.waitForConnected Waiting for client to connect to ZooKeeper
> [junit4:junit4]   2> 134 T2433 oaz.ClientCnxn$SendThread.primeConnection Socket connection established to localhost/127.0.0.1:24639, initiating session
> [junit4:junit4]   2> 134 T2427 oazs.NIOServerCnxn$Factory.run Accepted socket connection from /140.211.11.196:24641
> [junit4:junit4]   2> 135 T2427 oazs.NIOServerCnxn.readConnectRequest Client attempting to establish new session at /140.211.11.196:24641
> [junit4:junit4]   2> 136 T2429 oazs.NIOServerCnxn.finishSessionInit Established session 0x139f50b40590001 with negotiated timeout 10000 for client /140.211.11.196:24641
> [junit4:junit4]   2> 136 T2433 oaz.ClientCnxn$SendThread.readConnectResult Session establishment complete on server localhost/127.0.0.1:24639, sessionid = 0x139f50b40590001, negotiated timeout = 10000
> [junit4:junit4]   2> 136 T2434 oascc.ConnectionManager.process Watcher org.apache.solr.common.cloud.ConnectionManager@6ca2a729 name:ZooKeeperConnection Watcher:127.0.0.1:24639/solr got event WatchedEvent state:SyncConnected type:None path:null path:null type:None
> [junit4:junit4]   2> 136 T2425 oascc.ConnectionManager.waitForConnected Client is connected to ZooKeeper
> [junit4:junit4]   2> 137 T2425 oascc.SolrZkClient.makePath makePath: /collections/collection1
> [junit4:junit4]   2> 147 T2425 oascc.SolrZkClient.makePath makePath: /collections/collection1/shards
> [junit4:junit4]   2> 149 T2425 oascc.SolrZkClient.makePath makePath: /collections/control_collection
> [junit4:junit4]   2> 151 T2425 oascc.SolrZkClient.makePath makePath: /collections/control_collection/shards
> [junit4:junit4]   2> 159 T2425 oasc.AbstractZkTestCase.putConfig put /usr/home/hudson/hudson-slave/workspace/Lucene-Solr-NightlyTests-4.x/solr/build/solr-core/test-files/solr/collection1/conf/solrconfig.xml to /configs/conf1/solrconfig.xml
> [junit4:junit4]   2> 160 T2425 oascc.SolrZkClient.makePath makePath: /configs/conf1/solrconfig.xml
> [junit4:junit4]   2> 172 T2425 oasc.AbstractZkTestCase.putConfig put /usr/home/hudson/hudson-slave/workspace/Lucene-Solr-NightlyTests-4.x/solr/build/solr-core/test-files/solr/collection1/conf/schema.xml to /configs/conf1/schema.xml
> [junit4:junit4]   2> 173 T2425 oascc.SolrZkClient.makePath makePath: /configs/conf1/schema.xml
> [junit4:junit4]   2> 277 T2425 oasc.AbstractZkTestCase.putConfig put /usr/home/hudson/hudson-slave/workspace/Lucene-Solr-NightlyTests-4.x/solr/build/solr-core/test-files/solr/collection1/conf/solrconfig.xml to /configs/conf1/solrconfig.xml
> [junit4:junit4]   2> 278 T2425 oascc.SolrZkClient.makePath makePath: /configs/conf1/solrconfig.xml
> [junit4:junit4]   2> 281 T2425 oasc.AbstractZkTestCase.putConfig put /usr/home/hudson/hudson-slave/workspace/Lucene-Solr-NightlyTests-4.x/solr/build/solr-core/test-files/solr/collection1/conf/stopwords.txt to /configs/conf1/stopwords.txt
> [junit4:junit4]   2> 281 T2425 oascc.SolrZkClient.makePath makePath: /configs/conf1/stopwords.txt
> [junit4:junit4]   2> 292 T2425 oasc.AbstractZkTestCase.putConfig put /usr/home/hudson/hudson-slave/workspace/Lucene-Solr-NightlyTests-4.x/solr/build/solr-core/test-files/solr/collection1/conf/protwords.txt to /configs/conf1/protwords.txt
> [junit4:junit4]   2> 293 T2425 oascc.SolrZkClient.makePath makePath: /configs/conf1/protwords.txt
> [junit4:junit4]   2> 295 T2425 oasc.AbstractZkTestCase.putConfig put /usr/home/hudson/hudson-slave/workspace/Lucene-Solr-NightlyTests-4.x/solr/build/solr-core/test-files/solr/collection1/conf/currency.xml to /configs/conf1/currency.xml
> [junit4:junit4]   2> 296 T2425 oascc.SolrZkClient.makePath makePath: /configs/conf1/currency.xml
> [junit4:junit4]   2> 303 T2425 oasc.AbstractZkTestCase.putConfig put /usr/home/hudson/hudson-slave/workspace/Lucene-Solr-NightlyTests-4.x/solr/build/solr-core/test-files/solr/collection1/conf/open-exchange-rates.json to /configs/conf1/open-exchange-rates.json
> [junit4:junit4]   2> 303 T2425 oascc.SolrZkClient.makePath makePath: /configs/conf1/open-exchange-rates.json
> [junit4:junit4]   2> 306 T2425 oasc.AbstractZkTestCase.putConfig put /usr/home/hudson/hudson-slave/workspace/Lucene-Solr-NightlyTests-4.x/solr/build/solr-core/test-files/solr/collection1/conf/mapping-ISOLatin1Accent.txt to /configs/conf1/mapping-ISOLatin1Accent.txt
> [junit4:junit4]   2> 306 T2425 oascc.SolrZkClient.makePath makePath: /configs/conf1/mapping-ISOLatin1Accent.txt
> [junit4:junit4]   2> 309 T2425 oasc.AbstractZkTestCase.putConfig put /usr/home/hudson/hudson-slave/workspace/Lucene-Solr-NightlyTests-4.x/solr/build/solr-core/test-files/solr/collection1/conf/old_synonyms.txt to /configs/conf1/old_synonyms.txt
> [junit4:junit4]   2> 310 T2425 oascc.SolrZkClient.makePath makePath: /configs/conf1/old_synonyms.txt
> [junit4:junit4]   2> 312 T2425 oasc.AbstractZkTestCase.putConfig put /usr/home/hudson/hudson-slave/workspace/Lucene-Solr-NightlyTests-4.x/solr/build/solr-core/test-files/solr/collection1/conf/synonyms.txt to /configs/conf1/synonyms.txt
> [junit4:junit4]   2> 313 T2425 oascc.SolrZkClient.makePath makePath: /configs/conf1/synonyms.txt
> [junit4:junit4]   2> 320 T2430 oazs.PrepRequestProcessor.pRequest Processed session termination for sessionid: 0x139f50b40590001
> [junit4:junit4]   2> 321 T2434 oaz.ClientCnxn$EventThread.run EventThread shut down
> [junit4:junit4]   2> 321 T2425 oaz.ZooKeeper.close Session: 0x139f50b40590001 closed
> [junit4:junit4]   2> 321 T2427 oazs.NIOServerCnxn.closeSock Closed socket connection for client /140.211.11.196:24641 which had sessionid 0x139f50b40590001
> [junit4:junit4]   2> 323 T2425 oejs.Server.doStart jetty-8.1.2.v20120308
> [junit4:junit4]   2> 328 T2425 oejs.AbstractConnector.doStart Started SocketConnector@0.0.0.0:24642
> [junit4:junit4]   2> 328 T2425 oasc.SolrResourceLoader.locateSolrHome JNDI not configured for solr (NoInitialContextEx)
> [junit4:junit4]   2> 329 T2425 oasc.SolrResourceLoader.locateSolrHome using system property solr.solr.home: /usr/home/hudson/hudson-slave/workspace/Lucene-Solr-NightlyTests-4.x/solr/build/solr-core/test-files/solr
> [junit4:junit4]   2> 329 T2425 oasc.SolrResourceLoader.<init> new SolrResourceLoader for deduced Solr Home: '/usr/home/hudson/hudson-slave/workspace/Lucene-Solr-NightlyTests-4.x/solr/build/solr-core/test-files/solr/'
> [junit4:junit4]   2> 369 T2425 oass.SolrDispatchFilter.init SolrDispatchFilter.init()
> [junit4:junit4]   2> 370 T2425 oasc.SolrResourceLoader.locateSolrHome JNDI not configured for solr (NoInitialContextEx)
> [junit4:junit4]   2> 371 T2425 oasc.SolrResourceLoader.locateSolrHome using system property solr.solr.home: /usr/home/hudson/hudson-slave/workspace/Lucene-Solr-NightlyTests-4.x/solr/build/solr-core/test-files/solr
> [junit4:junit4]   2> 371 T2425 oasc.CoreContainer$Initializer.initialize looking for solr.xml: /usr/home/hudson/hudson-slave/workspace/Lucene-Solr-NightlyTests-4.x/solr/build/solr-core/test-files/solr/solr.xml
> [junit4:junit4]   2> 371 T2425 oasc.CoreContainer.<init> New CoreContainer 55723812
> [junit4:junit4]   2> 372 T2425 oasc.CoreContainer.load Loading CoreContainer using Solr Home: '/usr/home/hudson/hudson-slave/workspace/Lucene-Solr-NightlyTests-4.x/solr/build/solr-core/test-files/solr/'
> [junit4:junit4]   2> 373 T2425 oasc.SolrResourceLoader.<init> new SolrResourceLoader for directory: '/usr/home/hudson/hudson-slave/workspace/Lucene-Solr-NightlyTests-4.x/solr/build/solr-core/test-files/solr/'
> [junit4:junit4]   2> 398 T2425 oasc.CoreContainer.load Registering Log Listener
> [junit4:junit4]   2> 413 T2425 oasc.CoreContainer.initZooKeeper Zookeeper client=127.0.0.1:24639/solr
> [junit4:junit4]   2> 413 T2425 oaz.ZooKeeper.<init> Initiating client connection, connectString=127.0.0.1:24639/solr sessionTimeout=5000 watcher=org.apache.solr.common.cloud.ConnectionManager@7d1af8de
> [junit4:junit4]   2> 414 T2444 oaz.ClientCnxn$SendThread.startConnect Opening socket connection to server /127.0.0.1:24639
> [junit4:junit4]   2> 414 T2425 oascc.ConnectionManager.waitForConnected Waiting for client to connect to ZooKeeper
> [junit4:junit4]   2> 416 T2444 oaz.ClientCnxn$SendThread.primeConnection Socket connection established to localhost/127.0.0.1:24639, initiating session
> [junit4:junit4]   2> 416 T2427 oazs.NIOServerCnxn$Factory.run Accepted socket connection from /140.211.11.196:24643
> [junit4:junit4]   2> 416 T2427 oazs.NIOServerCnxn.readConnectRequest Client attempting to establish new session at /140.211.11.196:24643
> [junit4:junit4]   2> 418 T2429 oazs.NIOServerCnxn.finishSessionInit Established session 0x139f50b40590002 with negotiated timeout 5000 for client /140.211.11.196:24643
> [junit4:junit4]   2> 418 T2444 oaz.ClientCnxn$SendThread.readConnectResult Session establishment complete on server localhost/127.0.0.1:24639, sessionid = 0x139f50b40590002, negotiated timeout = 5000
> [junit4:junit4]   2> 419 T2445 oascc.ConnectionManager.process Watcher org.apache.solr.common.cloud.ConnectionManager@7d1af8de name:ZooKeeperConnection Watcher:127.0.0.1:24639/solr got event WatchedEvent state:SyncConnected type:None path:null path:null type:None
> [junit4:junit4]   2> 419 T2425 oascc.ConnectionManager.waitForConnected Client is connected to ZooKeeper
> [junit4:junit4]   2> 421 T2430 oazs.PrepRequestProcessor.pRequest Got user-level KeeperException when processing sessionid:0x139f50b40590002 type:create cxid:0x2 zxid:0xfffffffffffffffe txntype:unknown reqpath:n/a Error Path:/solr/overseer Error:KeeperErrorCode = NodeExists for /solr/overseer
> [junit4:junit4]   2> 429 T2425 oascc.SolrZkClient.makePath makePath: /live_nodes
> [junit4:junit4]   2> 431 T2425 oasc.ZkController.createEphemeralLiveNode Register node as live in ZooKeeper:/live_nodes/127.0.0.1:24642_solr
> [junit4:junit4]   2> 431 T2430 oazs.PrepRequestProcessor.pRequest Got user-level KeeperException when processing sessionid:0x139f50b40590002 type:delete cxid:0x7 zxid:0xfffffffffffffffe txntype:unknown reqpath:n/a Error Path:/solr/live_nodes/127.0.0.1:24642_solr Error:KeeperErrorCode = NoNode for /solr/live_nodes/127.0.0.1:24642_solr
> [junit4:junit4]   2> 437 T2425 oascc.SolrZkClient.makePath makePath: /live_nodes/127.0.0.1:24642_solr
> [junit4:junit4]   2> 439 T2425 oashc.HttpShardHandlerFactory.getParameter Setting socketTimeout to: 0
> [junit4:junit4]   2> 440 T2425 oashc.HttpShardHandlerFactory.getParameter Setting urlScheme to: http://
> [junit4:junit4]   2> 440 T2425 oashc.HttpShardHandlerFactory.getParameter Setting connTimeout to: 0
> [junit4:junit4]   2> 441 T2425 oashc.HttpShardHandlerFactory.getParameter Setting maxConnectionsPerHost to: 20
> [junit4:junit4]   2> 441 T2425 oashc.HttpShardHandlerFactory.getParameter Setting corePoolSize to: 0
> [junit4:junit4]   2> 441 T2425 oashc.HttpShardHandlerFactory.getParameter Setting maximumPoolSize to: 2147483647
> [junit4:junit4]   2> 442 T2425 oashc.HttpShardHandlerFactory.getParameter Setting maxThreadIdleTime to: 5
> [junit4:junit4]   2> 442 T2425 oashc.HttpShardHandlerFactory.getParameter Setting sizeOfQueue to: -1
> [junit4:junit4]   2> 443 T2425 oashc.HttpShardHandlerFactory.getParameter Setting fairnessPolicy to: false
> [junit4:junit4]   2> 443 T2425 oascsi.HttpClientUtil.createClient Creating new http client, config:maxConnectionsPerHost=20&maxConnections=10000&socketTimeout=0&connTimeout=0&retry=false
> [junit4:junit4]   2> 460 T2425 oascc.SolrZkClient.makePath makePath: /overseer_elect/election
> [junit4:junit4]   2> 465 T2430 oazs.PrepRequestProcessor.pRequest Got user-level KeeperException when processing sessionid:0x139f50b40590002 type:delete cxid:0x15 zxid:0xfffffffffffffffe txntype:unknown reqpath:n/a Error Path:/solr/overseer_elect/leader Error:KeeperErrorCode = NoNode for /solr/overseer_elect/leader
> [junit4:junit4]   2> 476 T2425 oascc.SolrZkClient.makePath makePath: /overseer_elect/leader
> [junit4:junit4]   2> 478 T2425 oasc.Overseer.start Overseer (id=88371096383455234-127.0.0.1:24642_solr-n_0000000000) starting
> [junit4:junit4]   2> 478 T2430 oazs.PrepRequestProcessor.pRequest Got user-level KeeperException when processing sessionid:0x139f50b40590002 type:create cxid:0x1a zxid:0xfffffffffffffffe txntype:unknown reqpath:n/a Error Path:/solr/overseer Error:KeeperErrorCode = NodeExists for /solr/overseer
> [junit4:junit4]   2> 480 T2430 oazs.PrepRequestProcessor.pRequest Got user-level KeeperException when processing sessionid:0x139f50b40590002 type:create cxid:0x1b zxid:0xfffffffffffffffe txntype:unknown reqpath:n/a Error Path:/solr/overseer Error:KeeperErrorCode = NodeExists for /solr/overseer
> [junit4:junit4]   2> 481 T2430 oazs.PrepRequestProcessor.pRequest Got user-level KeeperException when processing sessionid:0x139f50b40590002 type:create cxid:0x1c zxid:0xfffffffffffffffe txntype:unknown reqpath:n/a Error Path:/solr/overseer Error:KeeperErrorCode = NodeExists for /solr/overseer
> [junit4:junit4]   2> 493 T2430 oazs.PrepRequestProcessor.pRequest Got user-level KeeperException when processing sessionid:0x139f50b40590002 type:create cxid:0x1d zxid:0xfffffffffffffffe txntype:unknown reqpath:n/a Error Path:/solr/overseer Error:KeeperErrorCode = NodeExists for /solr/overseer
> [junit4:junit4]   2> 494 T2447 oasc.OverseerCollectionProcessor.run Process current queue of collection creations
> [junit4:junit4]   2> 494 T2425 oascc.SolrZkClient.makePath makePath: /clusterstate.json
> [junit4:junit4]   2> 505 T2425 oascc.ZkStateReader.createClusterStateWatchersAndUpdate Updating cluster state from ZooKeeper... 
> [junit4:junit4]   2> 506 T2446 oasc.Overseer$ClusterStateUpdater.run Starting to work on the main queue
> [junit4:junit4]   2> 511 T2425 oasc.CoreContainer.create Creating SolrCore 'collection1' using instanceDir: /usr/home/hudson/hudson-slave/workspace/Lucene-Solr-NightlyTests-4.x/solr/build/solr-core/test-files/solr/collection1
> [junit4:junit4]   2> 511 T2425 oasc.ZkController.createCollectionZkNode Check for collection zkNode:control_collection
> [junit4:junit4]   2> 512 T2425 oasc.ZkController.createCollectionZkNode Collection zkNode exists
> [junit4:junit4]   2> 512 T2425 oasc.ZkController.readConfigName Load collection config from:/collections/control_collection
> [junit4:junit4]   2> 514 T2425 oasc.SolrResourceLoader.<init> new SolrResourceLoader for directory: '/usr/home/hudson/hudson-slave/workspace/Lucene-Solr-NightlyTests-4.x/solr/build/solr-core/test-files/solr/collection1/'
> [junit4:junit4]   2> 515 T2425 oasc.SolrResourceLoader.replaceClassLoader Adding 'file:/usr/home/hudson/hudson-slave/workspace/Lucene-Solr-NightlyTests-4.x/solr/build/solr-core/test-files/solr/collection1/lib/README' to classloader
> [junit4:junit4]   2> 516 T2425 oasc.SolrResourceLoader.replaceClassLoader Adding 'file:/usr/home/hudson/hudson-slave/workspace/Lucene-Solr-NightlyTests-4.x/solr/build/solr-core/test-files/solr/collection1/lib/classes/' to classloader
> [junit4:junit4]   2> 564 T2425 oasc.SolrConfig.<init> Using Lucene MatchVersion: LUCENE_41
> [junit4:junit4]   2> 623 T2425 oasc.SolrConfig.<init> Loaded SolrConfig: solrconfig.xml
> [junit4:junit4]   2> 724 T2425 oass.IndexSchema.readSchema Reading Solr Schema
> [junit4:junit4]   2> 729 T2425 oass.IndexSchema.readSchema Schema name=test
> [junit4:junit4]   2> 1127 T2425 oass.OpenExchangeRatesOrgProvider.init Initialized with rates=open-exchange-rates.json, refreshInterval=1440.
> [junit4:junit4]   2> 1136 T2425 oass.IndexSchema.readSchema default search field in schema is text
> [junit4:junit4]   2> 1139 T2425 oass.IndexSchema.readSchema unique key field: id
> [junit4:junit4]   2> 1148 T2425 oass.FileExchangeRateProvider.reload Reloading exchange rates from file currency.xml
> [junit4:junit4]   2> 1152 T2425 oass.FileExchangeRateProvider.reload Reloading exchange rates from file currency.xml
> [junit4:junit4]   2> 1155 T2425 oass.OpenExchangeRatesOrgProvider.reload Reloading exchange rates from open-exchange-rates.json
> [junit4:junit4]   2> 1156 T2425 oass.OpenExchangeRatesOrgProvider.reload Reloading exchange rates from open-exchange-rates.json
> [junit4:junit4]   2> 1157 T2425 oasc.SolrCore.<init> [collection1] Opening new SolrCore at /usr/home/hudson/hudson-slave/workspace/Lucene-Solr-NightlyTests-4.x/solr/build/solr-core/test-files/solr/collection1/, dataDir=./org.apache.solr.cloud.SyncSliceTest-1348435918932/control/data/
> [junit4:junit4]   2> 1157 T2425 oasc.JmxMonitoredMap.<init> JMX monitoring is enabled. Adding Solr mbeans to JMX Server: com.sun.jmx.mbeanserver.JmxMBeanServer@785e8d7d
> [junit4:junit4]   2> 1158 T2425 oasc.SolrCore.getNewIndexDir WARNING New index directory detected: old=null new=./org.apache.solr.cloud.SyncSliceTest-1348435918932/control/data/index/
> [junit4:junit4]   2> 1165 T2425 oasc.SolrCore.initIndex WARNING [collection1] Solr index directory './org.apache.solr.cloud.SyncSliceTest-1348435918932/control/data/index' doesn't exist. Creating new index...
> [junit4:junit4]   2> 1166 T2425 oasc.CachingDirectoryFactory.get return new directory for /usr/home/hudson/hudson-slave/workspace/Lucene-Solr-NightlyTests-4.x/solr/build/solr-core/test/J1/./org.apache.solr.cloud.SyncSliceTest-1348435918932/control/data/index forceNew:false
> [junit4:junit4]   2> 1182 T2425 oasc.SolrDeletionPolicy.onCommit SolrDeletionPolicy.onCommit: commits:num=1
> [junit4:junit4]   2> 		commit{dir=NRTCachingDirectory(org.apache.lucene.store.NIOFSDirectory@/usr/home/hudson/hudson-slave/workspace/Lucene-Solr-NightlyTests-4.x/solr/build/solr-core/test/J1/org.apache.solr.cloud.SyncSliceTest-1348435918932/control/data/index lockFactory=org.apache.lucene.store.NativeFSLockFactory@514bce63; maxCacheMB=48.0 maxMergeSizeMB=4.0),segFN=segments_1,generation=1,filenames=[segments_1]
> [junit4:junit4]   2> 1182 T2425 oasc.SolrDeletionPolicy.updateCommits newest commit = 1
> [junit4:junit4]   2> 1183 T2425 oasc.SolrCore.initWriters created xml: solr.XMLResponseWriter
> [junit4:junit4]   2> 1185 T2425 oasup.UpdateRequestProcessorChain.init inserting DistributedUpdateProcessorFactory into updateRequestProcessorChain "dedupe"
> [junit4:junit4]   2> 1185 T2425 oasup.UpdateRequestProcessorChain.init inserting DistributedUpdateProcessorFactory into updateRequestProcessorChain "dedupe-allfields"
> [junit4:junit4]   2> 1186 T2425 oasup.UpdateRequestProcessorChain.init inserting DistributedUpdateProcessorFactory into updateRequestProcessorChain "stored_sig"
> [junit4:junit4]   2> 1186 T2425 oasup.UpdateRequestProcessorChain.init inserting DistributedUpdateProcessorFactory into updateRequestProcessorChain "uniq-fields"
> [junit4:junit4]   2> 1187 T2425 oasup.UpdateRequestProcessorChain.init inserting DistributedUpdateProcessorFactory into updateRequestProcessorChain "distrib-dup-test-chain-implicit"
> [junit4:junit4]   2> 1187 T2425 oasc.RequestHandlers.initHandlersFromConfig adding lazy requestHandler: solr.ReplicationHandler
> [junit4:junit4]   2> 1187 T2425 oasc.RequestHandlers.initHandlersFromConfig created /replication: solr.ReplicationHandler
> [junit4:junit4]   2> 1188 T2425 oasc.RequestHandlers.initHandlersFromConfig created standard: solr.StandardRequestHandler
> [junit4:junit4]   2> 1188 T2425 oasc.RequestHandlers.initHandlersFromConfig created /get: solr.RealTimeGetHandler
> [junit4:junit4]   2> 1189 T2425 oasc.RequestHandlers.initHandlersFromConfig created dismax: solr.SearchHandler
> [junit4:junit4]   2> 1189 T2425 oasc.RequestHandlers.initHandlersFromConfig created mock: org.apache.solr.core.MockQuerySenderListenerReqHandler
> [junit4:junit4]   2> 1189 T2425 oasc.RequestHandlers.initHandlersFromConfig created /admin/: org.apache.solr.handler.admin.AdminHandlers
> [junit4:junit4]   2> 1190 T2425 oasc.RequestHandlers.initHandlersFromConfig created defaults: solr.StandardRequestHandler
> [junit4:junit4]   2> 1190 T2425 oasc.RequestHandlers.initHandlersFromConfig adding lazy requestHandler: solr.StandardRequestHandler
> [junit4:junit4]   2> 1191 T2425 oasc.RequestHandlers.initHandlersFromConfig created lazy: solr.StandardRequestHandler
> [junit4:junit4]   2> 1191 T2425 oasc.RequestHandlers.initHandlersFromConfig created /update: solr.UpdateRequestHandler
> [junit4:junit4]   2> 1191 T2425 oasc.RequestHandlers.initHandlersFromConfig created /terms: org.apache.solr.handler.component.SearchHandler
> [junit4:junit4]   2> 1192 T2425 oasc.RequestHandlers.initHandlersFromConfig created spellCheckCompRH: org.apache.solr.handler.component.SearchHandler
> [junit4:junit4]   2> 1192 T2425 oasc.RequestHandlers.initHandlersFromConfig created spellCheckCompRH_Direct: org.apache.solr.handler.component.SearchHandler
> [junit4:junit4]   2> 1193 T2425 oasc.RequestHandlers.initHandlersFromConfig created spellCheckWithWordbreak: org.apache.solr.handler.component.SearchHandler
> [junit4:junit4]   2> 1193 T2425 oasc.RequestHandlers.initHandlersFromConfig created spellCheckWithWordbreak_Direct: org.apache.solr.handler.component.SearchHandler
> [junit4:junit4]   2> 1193 T2425 oasc.RequestHandlers.initHandlersFromConfig created spellCheckCompRH1: org.apache.solr.handler.component.SearchHandler
> [junit4:junit4]   2> 1194 T2425 oasc.RequestHandlers.initHandlersFromConfig created tvrh: org.apache.solr.handler.component.SearchHandler
> [junit4:junit4]   2> 1194 T2425 oasc.RequestHandlers.initHandlersFromConfig created /mlt: solr.MoreLikeThisHandler
> [junit4:junit4]   2> 1195 T2425 oasc.RequestHandlers.initHandlersFromConfig created /debug/dump: solr.DumpRequestHandler
> [junit4:junit4]   2> 1198 T2425 oashl.XMLLoader.init xsltCacheLifetimeSeconds=60
> [junit4:junit4]   2> 1201 T2425 oasc.SolrCore.initDeprecatedSupport WARNING solrconfig.xml uses deprecated <admin/gettableFiles>, Please update your config to use the ShowFileRequestHandler.
> [junit4:junit4]   2> 1202 T2425 oasc.SolrCore.initDeprecatedSupport WARNING adding ShowFileRequestHandler with hidden files: [SCHEMA.XML, OLD_SYNONYMS.TXT, STOPWORDS.TXT, PROTWORDS.TXT, OPEN-EXCHANGE-RATES.JSON, SYNONYMS.TXT, CURRENCY.XML, MAPPING-ISOLATIN1ACCENT.TXT]
> [junit4:junit4]   2> 1205 T2425 oass.SolrIndexSearcher.<init> Opening Searcher@6976d951 main
> [junit4:junit4]   2> 1206 T2425 oasu.CommitTracker.<init> Hard AutoCommit: disabled
> [junit4:junit4]   2> 1206 T2425 oasu.CommitTracker.<init> Soft AutoCommit: disabled
> [junit4:junit4]   2> 1207 T2425 oashc.SpellCheckComponent.inform Initializing spell checkers
> [junit4:junit4]   2> 1223 T2425 oass.DirectSolrSpellChecker.init init: {name=direct,classname=DirectSolrSpellChecker,field=lowerfilt,minQueryLength=3}
> [junit4:junit4]   2> 1269 T2448 oasc.SolrCore.registerSearcher [collection1] Registered new searcher Searcher@6976d951 main{StandardDirectoryReader(segments_1:1)}
> [junit4:junit4]   2> 1272 T2430 oazs.PrepRequestProcessor.pRequest Got user-level KeeperException when processing sessionid:0x139f50b40590002 type:create cxid:0x53 zxid:0xfffffffffffffffe txntype:unknown reqpath:n/a Error Path:/solr/overseer/queue Error:KeeperErrorCode = NoNode for /solr/overseer/queue
> [junit4:junit4]   2> 1286 T2425 oasc.CoreContainer.register registering core: collection1
> [junit4:junit4]   2> 1287 T2425 oasc.ZkController.register Register shard - core:collection1 address:http://127.0.0.1:24642/solr shardId:control_shard
> [junit4:junit4]   2> 1288 T2425 oascc.SolrZkClient.makePath makePath: /collections/control_collection/leader_elect/control_shard/election
> [junit4:junit4]   2> 1301 T2430 oazs.PrepRequestProcessor.pRequest Got user-level KeeperException when processing sessionid:0x139f50b40590002 type:delete cxid:0x62 zxid:0xfffffffffffffffe txntype:unknown reqpath:n/a Error Path:/solr/collections/control_collection/leaders Error:KeeperErrorCode = NoNode for /solr/collections/control_collection/leaders
> [junit4:junit4]   2> 1302 T2425 oasc.ShardLeaderElectionContext.runLeaderProcess Running the leader process.
> [junit4:junit4]   2> 1302 T2430 oazs.PrepRequestProcessor.pRequest Got user-level KeeperException when processing sessionid:0x139f50b40590002 type:create cxid:0x63 zxid:0xfffffffffffffffe txntype:unknown reqpath:n/a Error Path:/solr/overseer Error:KeeperErrorCode = NodeExists for /solr/overseer
> [junit4:junit4]   2> 1511 T2446 oascc.ZkStateReader.updateClusterState Updating cloud state from ZooKeeper... 
> [junit4:junit4]   2> 1512 T2430 oazs.PrepRequestProcessor.pRequest Got user-level KeeperException when processing sessionid:0x139f50b40590002 type:create cxid:0x6a zxid:0xfffffffffffffffe txntype:unknown reqpath:n/a Error Path:/solr/overseer/queue-work Error:KeeperErrorCode = NoNode for /solr/overseer/queue-work
> [junit4:junit4]   2> 1530 T2445 oascc.ZkStateReader$2.process A cluster state change has occurred - updating...
> [junit4:junit4]   2> 1811 T2425 oasc.ShardLeaderElectionContext.waitForReplicasToComeUp Enough replicas found to continue.
> [junit4:junit4]   2> 1812 T2425 oasc.ShardLeaderElectionContext.runLeaderProcess I may be the new leader - try and sync
> [junit4:junit4]   2> 1812 T2425 oasc.SyncStrategy.sync Sync replicas to http://127.0.0.1:24642/solr/collection1/
> [junit4:junit4]   2> 1812 T2425 oasc.SyncStrategy.syncReplicas Sync Success - now sync replicas to me
> [junit4:junit4]   2> 1813 T2425 oasc.SyncStrategy.syncToMe http://127.0.0.1:24642/solr/collection1/ has no replicas
> [junit4:junit4]   2> 1813 T2425 oasc.ShardLeaderElectionContext.runLeaderProcess I am the new leader: http://127.0.0.1:24642/solr/collection1/
> [junit4:junit4]   2> 1813 T2425 oascc.SolrZkClient.makePath makePath: /collections/control_collection/leaders/control_shard
> [junit4:junit4]   2> 1828 T2430 oazs.PrepRequestProcessor.pRequest Got user-level KeeperException when processing sessionid:0x139f50b40590002 type:create cxid:0x88 zxid:0xfffffffffffffffe txntype:unknown reqpath:n/a Error Path:/solr/overseer Error:KeeperErrorCode = NodeExists for /solr/overseer
> [junit4:junit4]   2> 2042 T2446 oascc.ZkStateReader.updateClusterState Updating cloud state from ZooKeeper... 
> [junit4:junit4]   2> 2056 T2445 oascc.ZkStateReader$2.process A cluster state change has occurred - updating...
> [junit4:junit4]   2> 2085 T2425 oasc.ZkController.register We are http://127.0.0.1:24642/solr/collection1/ and leader is http://127.0.0.1:24642/solr/collection1/
> [junit4:junit4]   2> 2085 T2425 oasc.ZkController.register No LogReplay needed for core=collection1 baseURL=http://127.0.0.1:24642/solr
> [junit4:junit4]   2> 2085 T2425 oasc.ZkController.checkRecovery I am the leader, no recovery necessary
> [junit4:junit4]   2> 2088 T2425 oascc.ZkStateReader.updateClusterState Updating cloud state from ZooKeeper... 
> [junit4:junit4]   2> 2088 T2425 oass.SolrDispatchFilter.init user.dir=/usr/home/hudson/hudson-slave/workspace/Lucene-Solr-NightlyTests-4.x/solr/build/solr-core/test/J1
> [junit4:junit4]   2> 2089 T2425 oass.SolrDispatchFilter.init SolrDispatchFilter.init() done
> [junit4:junit4]   2> 2089 T2425 oascsi.HttpClientUtil.createClient Creating new http client, config:maxConnections=128&maxConnectionsPerHost=32&followRedirects=false
> [junit4:junit4]   2> 2559 T2446 oascc.ZkStateReader.updateClusterState Updating cloud state from ZooKeeper... 
> [junit4:junit4]   2> 2573 T2445 oascc.ZkStateReader$2.process A cluster state change has occurred - updating...
> [junit4:junit4]   2> 2735 T2425 oejs.Server.doStart jetty-8.1.2.v20120308
> [junit4:junit4]   2> 2738 T2425 oejs.AbstractConnector.doStart Started SocketConnector@0.0.0.0:24653
> [junit4:junit4]   2> 2738 T2425 oasc.SolrResourceLoader.locateSolrHome JNDI not configured for solr (NoInitialContextEx)
> [junit4:junit4]   2> 2739 T2425 oasc.SolrResourceLoader.locateSolrHome using system property solr.solr.home: /usr/home/hudson/hudson-slave/workspace/Lucene-Solr-NightlyTests-4.x/solr/build/solr-core/test/J1/./solrtest-jetty1-1348435921025
> [junit4:junit4]   2> 2739 T2425 oasc.SolrResourceLoader.<init> new SolrResourceLoader for deduced Solr Home: '/usr/home/hudson/hudson-slave/workspace/Lucene-Solr-NightlyTests-4.x/solr/build/solr-core/test/J1/./solrtest-jetty1-1348435921025/'
> [junit4:junit4]   2> 2762 T2425 oass.SolrDispatchFilter.init SolrDispatchFilter.init()
> [junit4:junit4]   2> 2762 T2425 oasc.SolrResourceLoader.locateSolrHome JNDI not configured for solr (NoInitialContextEx)
> [junit4:junit4]   2> 2763 T2425 oasc.SolrResourceLoader.locateSolrHome using system property solr.solr.home: /usr/home/hudson/hudson-slave/workspace/Lucene-Solr-NightlyTests-4.x/solr/build/solr-core/test/J1/./solrtest-jetty1-1348435921025
> [junit4:junit4]   2> 2763 T2425 oasc.CoreContainer$Initializer.initialize looking for solr.xml: /usr/home/hudson/hudson-slave/workspace/Lucene-Solr-NightlyTests-4.x/solr/build/solr-core/test/J1/./solrtest-jetty1-1348435921025/solr.xml
> [junit4:junit4]   2> 2763 T2425 oasc.CoreContainer.<init> New CoreContainer 888064904
> [junit4:junit4]   2> 2764 T2425 oasc.CoreContainer.load Loading CoreContainer using Solr Home: '/usr/home/hudson/hudson-slave/workspace/Lucene-Solr-NightlyTests-4.x/solr/build/solr-core/test/J1/./solrtest-jetty1-1348435921025/'
> [junit4:junit4]   2> 2764 T2425 oasc.SolrResourceLoader.<init> new SolrResourceLoader for directory: '/usr/home/hudson/hudson-slave/workspace/Lucene-Solr-NightlyTests-4.x/solr/build/solr-core/test/J1/./solrtest-jetty1-1348435921025/'
> [junit4:junit4]   2> 2781 T2425 oasc.CoreContainer.load Registering Log Listener
> [junit4:junit4]   2> 2791 T2425 oasc.CoreContainer.initZooKeeper Zookeeper client=127.0.0.1:24639/solr
> [junit4:junit4]   2> 2791 T2425 oaz.ZooKeeper.<init> Initiating client connection, connectString=127.0.0.1:24639/solr sessionTimeout=5000 watcher=org.apache.solr.common.cloud.ConnectionManager@1990dc15
> [junit4:junit4]   2> 2792 T2458 oaz.ClientCnxn$SendThread.startConnect Opening socket connection to server /127.0.0.1:24639
> [junit4:junit4]   2> 2792 T2425 oascc.ConnectionManager.waitForConnected Waiting for client to connect to ZooKeeper
> [junit4:junit4]   2> 2793 T2458 oaz.ClientCnxn$SendThread.primeConnection Socket connection established to localhost/127.0.0.1:24639, initiating session
> [junit4:junit4]   2> 2793 T2427 oazs.NIOServerCnxn$Factory.run Accepted socket connection from /140.211.11.196:24654
> [junit4:junit4]   2> 2794 T2427 oazs.NIOServerCnxn.readConnectRequest Client attempting to establish new session at /140.211.11.196:24654
> [junit4:junit4]   2> 2795 T2429 oazs.NIOServerCnxn.finishSessionInit Established session 0x139f50b40590003 with negotiated timeout 5000 for client /140.211.11.196:24654
> [junit4:junit4]   2> 2795 T2458 oaz.ClientCnxn$SendThread.readConnectResult Session establishment complete on server localhost/127.0.0.1:24639, sessionid = 0x139f50b40590003, negotiated timeout = 5000
> [junit4:junit4]   2> 2795 T2459 oascc.ConnectionManager.process Watcher org.apache.solr.common.cloud.ConnectionManager@1990dc15 name:ZooKeeperConnection Watcher:127.0.0.1:24639/solr got event WatchedEvent state:SyncConnected type:None path:null path:null type:None
> [junit4:junit4]   2> 2795 T2425 oascc.ConnectionManager.waitForConnected Client is connected to ZooKeeper
> [junit4:junit4]   2> 2796 T2430 oazs.PrepRequestProcessor.pRequest Got user-level KeeperException when processing sessionid:0x139f50b40590003 type:create cxid:0x1 zxid:0xfffffffffffffffe txntype:unknown reqpath:n/a Error Path:/solr/overseer Error:KeeperErrorCode = NodeExists for /solr/overseer
> [junit4:junit4]   2> 2797 T2430 oazs.PrepRequestProcessor.pRequest Got user-level KeeperException when processing sessionid:0x139f50b40590003 type:create cxid:0x2 zxid:0xfffffffffffffffe txntype:unknown reqpath:n/a Error Path:/solr/overseer Error:KeeperErrorCode = NodeExists for /solr/overseer
> [junit4:junit4]   2> 2806 T2425 oasc.ZkController.createEphemeralLiveNode Register node as live in ZooKeeper:/live_nodes/127.0.0.1:24653_solr
> [junit4:junit4]   2> 2807 T2430 oazs.PrepRequestProcessor.pRequest Got user-level KeeperException when processing sessionid:0x139f50b40590003 type:delete cxid:0x4 zxid:0xfffffffffffffffe txntype:unknown reqpath:n/a Error Path:/solr/live_nodes/127.0.0.1:24653_solr Error:KeeperErrorCode = NoNode for /solr/live_nodes/127.0.0.1:24653_solr
> [junit4:junit4]   2> 2808 T2425 oascc.SolrZkClient.makePath makePath: /live_nodes/127.0.0.1:24653_solr
> [junit4:junit4]   2> 2809 T2445 oascc.ZkStateReader$3.process Updating live nodes
> [junit4:junit4]   2> 2810 T2425 oashc.HttpShardHandlerFactory.getParameter Setting socketTimeout to: 0
> [junit4:junit4]   2> 2810 T2425 oashc.HttpShardHandlerFactory.getParameter Setting urlScheme to: http://
> [junit4:junit4]   2> 2810 T2425 oashc.HttpShardHandlerFactory.getParameter Setting connTimeout to: 0
> [junit4:junit4]   2> 2811 T2425 oashc.HttpShardHandlerFactory.getParameter Setting maxConnectionsPerHost to: 20
> [junit4:junit4]   2> 2811 T2425 oashc.HttpShardHandlerFactory.getParameter Setting corePoolSize to: 0
> [junit4:junit4]   2> 2811 T2425 oashc.HttpShardHandlerFactory.getParameter Setting maximumPoolSize to: 2147483647
> [junit4:junit4]   2> 2812 T2425 oashc.HttpShardHandlerFactory.getParameter Setting maxThreadIdleTime to: 5
> [junit4:junit4]   2> 2812 T2425 oashc.HttpShardHandlerFactory.getParameter Setting sizeOfQueue to: -1
> [junit4:junit4]   2> 2812 T2425 oashc.HttpShardHandlerFactory.getParameter Setting fairnessPolicy to: false
> [junit4:junit4]   2> 2813 T2425 oascsi.HttpClientUtil.createClient Creating new http client, config:maxConnectionsPerHost=20&maxConnections=10000&socketTimeout=0&connTimeout=0&retry=false
> [junit4:junit4]   2> 2824 T2425 oascc.ZkStateReader.createClusterStateWatchersAndUpdate Updating cluster state from ZooKeeper... 
> [junit4:junit4]   2> 2828 T2425 oasc.CoreContainer.create Creating SolrCore 'collection1' using instanceDir: /usr/home/hudson/hudson-slave/workspace/Lucene-Solr-NightlyTests-4.x/solr/build/solr-core/test/J1/./solrtest-jetty1-1348435921025/collection1
> [junit4:junit4]   2> 2828 T2425 oasc.ZkController.createCollectionZkNode Check for collection zkNode:collection1
> [junit4:junit4]   2> 2829 T2425 oasc.ZkController.createCollectionZkNode Collection zkNode exists
> [junit4:junit4]   2> 2829 T2425 oasc.ZkController.readConfigName Load collection config from:/collections/collection1
> [junit4:junit4]   2> 2830 T2425 oasc.SolrResourceLoader.<init> new SolrResourceLoader for directory: '/usr/home/hudson/hudson-slave/workspace/Lucene-Solr-NightlyTests-4.x/solr/build/solr-core/test/J1/./solrtest-jetty1-1348435921025/collection1/'
> [junit4:junit4]   2> 2831 T2425 oasc.SolrResourceLoader.replaceClassLoader Adding 'file:/usr/home/hudson/hudson-slave/workspace/Lucene-Solr-NightlyTests-4.x/solr/build/solr-core/test/J1/solrtest-jetty1-1348435921025/collection1/lib/README' to classloader
> [junit4:junit4]   2> 2832 T2425 oasc.SolrResourceLoader.replaceClassLoader Adding 'file:/usr/home/hudson/hudson-slave/workspace/Lucene-Solr-NightlyTests-4.x/solr/build/solr-core/test/J1/solrtest-jetty1-1348435921025/collection1/lib/classes/' to classloader
> [junit4:junit4]   2> 2869 T2425 oasc.SolrConfig.<init> Using Lucene MatchVersion: LUCENE_41
> [junit4:junit4]   2> 2914 T2425 oasc.SolrConfig.<init> Loaded SolrConfig: solrconfig.xml
> [junit4:junit4]   2> 3015 T2425 oass.IndexSchema.readSchema Reading Solr Schema
> [junit4:junit4]   2> 3020 T2425 oass.IndexSchema.readSchema Schema name=test
> [junit4:junit4]   2> 3447 T2425 oass.OpenExchangeRatesOrgProvider.init Initialized with rates=open-exchange-rates.json, refreshInterval=1440.
> [junit4:junit4]   2> 3457 T2425 oass.IndexSchema.readSchema default search field in schema is text
> [junit4:junit4]   2> 3460 T2425 oass.IndexSchema.readSchema unique key field: id
> [junit4:junit4]   2> 3470 T2425 oass.FileExchangeRateProvider.reload Reloading exchange rates from file currency.xml
> [junit4:junit4]   2> 3473 T2425 oass.FileExchangeRateProvider.reload Reloading exchange rates from file currency.xml
> [junit4:junit4]   2> 3477 T2425 oass.OpenExchangeRatesOrgProvider.reload Reloading exchange rates from open-exchange-rates.json
> [junit4:junit4]   2> 3478 T2425 oass.OpenExchangeRatesOrgProvider.reload Reloading exchange rates from open-exchange-rates.json
> [junit4:junit4]   2> 3479 T2425 oasc.SolrCore.<init> [collection1] Opening new SolrCore at /usr/home/hudson/hudson-slave/workspace/Lucene-Solr-NightlyTests-4.x/solr/build/solr-core/test/J1/./solrtest-jetty1-1348435921025/collection1/, dataDir=./org.apache.solr.cloud.SyncSliceTest-1348435918932/jetty1/
> [junit4:junit4]   2> 3479 T2425 oasc.JmxMonitoredMap.<init> JMX monitoring is enabled. Adding Solr mbeans to JMX Server: com.sun.jmx.mbeanserver.JmxMBeanServer@785e8d7d
> [junit4:junit4]   2> 3480 T2425 oasc.SolrCore.getNewIndexDir WARNING New index directory detected: old=null new=./org.apache.solr.cloud.SyncSliceTest-1348435918932/jetty1/index/
> [junit4:junit4]   2> 3481 T2425 oasc.SolrCore.initIndex WARNING [collection1] Solr index directory './org.apache.solr.cloud.SyncSliceTest-1348435918932/jetty1/index' doesn't exist. Creating new index...
> [junit4:junit4]   2> 3481 T2425 oasc.CachingDirectoryFactory.get return new directory for /usr/home/hudson/hudson-slave/workspace/Lucene-Solr-NightlyTests-4.x/solr/build/solr-core/test/J1/./org.apache.solr.cloud.SyncSliceTest-1348435918932/jetty1/index forceNew:false
> [junit4:junit4]   2> 3487 T2425 oasc.SolrDeletionPolicy.onCommit SolrDeletionPolicy.onCommit: commits:num=1
> [junit4:junit4]   2> 		commit{dir=NRTCachingDirectory(org.apache.lucene.store.NIOFSDirectory@/usr/home/hudson/hudson-slave/workspace/Lucene-Solr-NightlyTests-4.x/solr/build/solr-core/test/J1/org.apache.solr.cloud.SyncSliceTest-1348435918932/jetty1/index lockFactory=org.apache.lucene.store.NativeFSLockFactory@4ca78915; maxCacheMB=48.0 maxMergeSizeMB=4.0),segFN=segments_1,generation=1,filenames=[segments_1]
> [junit4:junit4]   2> 3488 T2425 oasc.SolrDeletionPolicy.updateCommits newest commit = 1
> [junit4:junit4]   2> 3489 T2425 oasc.SolrCore.initWriters created xml: solr.XMLResponseWriter
> [junit4:junit4]   2> 3490 T2425 oasup.UpdateRequestProcessorChain.init inserting DistributedUpdateProcessorFactory into updateRequestProcessorChain "dedupe"
> [junit4:junit4]   2> 3491 T2425 oasup.UpdateRequestProcessorChain.init inserting DistributedUpdateProcessorFactory into updateRequestProcessorChain "dedupe-allfields"
> [junit4:junit4]   2> 3491 T2425 oasup.UpdateRequestProcessorChain.init inserting DistributedUpdateProcessorFactory into updateRequestProcessorChain "stored_sig"
> [junit4:junit4]   2> 3491 T2425 oasup.UpdateRequestProcessorChain.init inserting DistributedUpdateProcessorFactory into updateRequestProcessorChain "uniq-fields"
> [junit4:junit4]   2> 3492 T2425 oasup.UpdateRequestProcessorChain.init inserting DistributedUpdateProcessorFactory into updateRequestProcessorChain "distrib-dup-test-chain-implicit"
> [junit4:junit4]   2> 3492 T2425 oasc.RequestHandlers.initHandlersFromConfig adding lazy requestHandler: solr.ReplicationHandler
> [junit4:junit4]   2> 3493 T2425 oasc.RequestHandlers.initHandlersFromConfig created /replication: solr.ReplicationHandler
> [junit4:junit4]   2> 3493 T2425 oasc.RequestHandlers.initHandlersFromConfig created standard: solr.StandardRequestHandler
> [junit4:junit4]   2> 3494 T2425 oasc.RequestHandlers.initHandlersFromConfig created /get: solr.RealTimeGetHandler
> [junit4:junit4]   2> 3494 T2425 oasc.RequestHandlers.initHandlersFromConfig created dismax: solr.SearchHandler
> [junit4:junit4]   2> 3495 T2425 oasc.RequestHandlers.initHandlersFromConfig created mock: org.apache.solr.core.MockQuerySenderListenerReqHandler
> [junit4:junit4]   2> 3495 T2425 oasc.RequestHandlers.initHandlersFromConfig created /admin/: org.apache.solr.handler.admin.AdminHandlers
> [junit4:junit4]   2> 3496 T2425 oasc.RequestHandlers.initHandlersFromConfig created defaults: solr.StandardRequestHandler
> [junit4:junit4]   2> 3496 T2425 oasc.RequestHandlers.initHandlersFromConfig adding lazy requestHandler: solr.StandardRequestHandler
> [junit4:junit4]   2> 3496 T2425 oasc.RequestHandlers.initHandlersFromConfig created lazy: solr.StandardRequestHandler
> [junit4:junit4]   2> 3497 T2425 oasc.RequestHandlers.initHandlersFromConfig created /update: solr.UpdateRequestHandler
> [junit4:junit4]   2> 3497 T2425 oasc.RequestHandlers.initHandlersFromConfig created /terms: org.apache.solr.handler.component.SearchHandler
> [junit4:junit4]   2> 3498 T2425 oasc.RequestHandlers.initHandlersFromConfig created spellCheckCompRH: org.apache.solr.handler.component.SearchHandler
> [junit4:junit4]   2> 3498 T2425 oasc.RequestHandlers.initHandlersFromConfig created spellCheckCompRH_Direct: org.apache.solr.handler.component.SearchHandler
> [junit4:junit4]   2> 3499 T2425 oasc.RequestHandlers.initHandlersFromConfig created spellCheckWithWordbreak: org.apache.solr.handler.component.SearchHandler
> [junit4:junit4]   2> 3499 T2425 oasc.RequestHandlers.initHandlersFromConfig created spellCheckWithWordbreak_Direct: org.apache.solr.handler.component.SearchHandler
> [junit4:junit4]   2> 3499 T2425 oasc.RequestHandlers.initHandlersFromConfig created spellCheckCompRH1: org.apache.solr.handler.component.SearchHandler
> [junit4:junit4]   2> 3500 T2425 oasc.RequestHandlers.initHandlersFromConfig created tvrh: org.apache.solr.handler.component.SearchHandler
> [junit4:junit4]   2> 3500 T2425 oasc.RequestHandlers.initHandlersFromConfig created /mlt: solr.MoreLikeThisHandler
> [junit4:junit4]   2> 3501 T2425 oasc.RequestHandlers.initHandlersFromConfig created /debug/dump: solr.DumpRequestHandler
> [junit4:junit4]   2> 3505 T2425 oashl.XMLLoader.init xsltCacheLifetimeSeconds=60
> [junit4:junit4]   2> 3509 T2425 oasc.SolrCore.initDeprecatedSupport WARNING solrconfig.xml uses deprecated <admin/gettableFiles>, Please update your config to use the ShowFileRequestHandler.
> [junit4:junit4]   2> 3510 T2425 oasc.SolrCore.initDeprecatedSupport WARNING adding ShowFileRequestHandler with hidden files: [SCHEMA.XML, OLD_SYNONYMS.TXT, STOPWORDS.TXT, PROTWORDS.TXT, OPEN-EXCHANGE-RATES.JSON, SYNONYMS.TXT, CURRENCY.XML, MAPPING-ISOLATIN1ACCENT.TXT]
> [junit4:junit4]   2> 3513 T2425 oass.SolrIndexSearcher.<init> Opening Searcher@5afe8885 main
> [junit4:junit4]   2> 3514 T2425 oasu.CommitTracker.<init> Hard AutoCommit: disabled
> [junit4:junit4]   2> 3514 T2425 oasu.CommitTracker.<init> Soft AutoCommit: disabled
> [junit4:junit4]   2> 3515 T2425 oashc.SpellCheckComponent.inform Initializing spell checkers
> [junit4:junit4]   2> 3522 T2425 oass.DirectSolrSpellChecker.init init: {name=direct,classname=DirectSolrSpellChecker,field=lowerfilt,minQueryLength=3}
> [junit4:junit4]   2> 3576 T2460 oasc.SolrCore.registerSearcher [collection1] Registered new searcher Searcher@5afe8885 main{StandardDirectoryReader(segments_1:1)}
> [junit4:junit4]   2> 3583 T2446 oascc.ZkStateReader.updateClusterState Updating cloud state from ZooKeeper... 
> [junit4:junit4]   2> 3594 T2445 oascc.ZkStateReader$2.process A cluster state change has occurred - updating...
> [junit4:junit4]   2> 3594 T2459 oascc.ZkStateReader$2.process A cluster state change has occurred - updating...
> [junit4:junit4]   2> 4082 T2425 oasc.CoreContainer.register registering core: collection1
> [junit4:junit4]   2> 4082 T2425 oasc.ZkController.register Register shard - core:collection1 address:http://127.0.0.1:24653/solr shardId:shard1
> [junit4:junit4]   2> 4083 T2425 oascc.SolrZkClient.makePath makePath: /collections/collection1/leader_elect/shard1/election
> [junit4:junit4]   2> 4099 T2430 oazs.PrepRequestProcessor.pRequest Got user-level KeeperException when processing sessionid:0x139f50b40590003 type:delete cxid:0x42 zxid:0xfffffffffffffffe txntype:unknown reqpath:n/a Error Path:/solr/collections/collection1/leaders Error:KeeperErrorCode = NoNode for /solr/collections/collection1/leaders
> [junit4:junit4]   2> 4100 T2425 oasc.ShardLeaderElectionContext.runLeaderProcess Running the leader process.
> [junit4:junit4]   2> 4100 T2430 oazs.PrepRequestProcessor.pRequest Got user-level KeeperException when processing sessionid:0x139f50b40590003 type:create cxid:0x43 zxid:0xfffffffffffffffe txntype:unknown reqpath:n/a Error Path:/solr/overseer Error:KeeperErrorCode = NodeExists for /solr/overseer
> [junit4:junit4]   2> 4102 T2425 oasc.ShardLeaderElectionContext.waitForReplicasToComeUp Enough replicas found to continue.
> [junit4:junit4]   2> 4103 T2425 oasc.ShardLeaderElectionContext.runLeaderProcess I may be the new leader - try and sync
> [junit4:junit4]   2> 4103 T2425 oasc.SyncStrategy.sync Sync replicas to http://127.0.0.1:24653/solr/collection1/
> [junit4:junit4]   2> 4103 T2425 oasc.SyncStrategy.syncReplicas Sync Success - now sync replicas to me
> [junit4:junit4]   2> 4104 T2425 oasc.SyncStrategy.syncToMe http://127.0.0.1:24653/solr/collection1/ has no replicas
> [junit4:junit4]   2> 4104 T2425 oasc.ShardLeaderElectionContext.runLeaderProcess I am the new leader: http://127.0.0.1:24653/solr/collection1/
> [junit4:junit4]   2> 4105 T2425 oascc.SolrZkClient.makePath makePath: /collections/collection1/leaders/shard1
> [junit4:junit4]   2> 4116 T2430 oazs.PrepRequestProcessor.pRequest Got user-level KeeperException when processing sessionid:0x139f50b40590003 type:create cxid:0x4d zxid:0xfffffffffffffffe txntype:unknown reqpath:n/a Error Path:/solr/overseer Error:KeeperErrorCode = NodeExists for /solr/overseer
> [junit4:junit4]   2> 4600 T2446 oascc.ZkStateReader.updateClusterState Updating cloud state from ZooKeeper... 
> [junit4:junit4]   2> 4696 T2459 oascc.ZkStateReader$2.process A cluster state change has occurred - updating...
> [junit4:junit4]   2> 4696 T2445 oascc.ZkStateReader$2.process A cluster state change has occurred - updating...
> [junit4:junit4]   2> 4730 T2425 oasc.ZkController.register We are http://127.0.0.1:24653/solr/collection1/ and leader is http://127.0.0.1:24653/solr/collection1/
> [junit4:junit4]   2> 4730 T2425 oasc.ZkController.register No LogReplay needed for core=collection1 baseURL=http://127.0.0.1:24653/solr
> [junit4:junit4]   2> 4731 T2425 oasc.ZkController.checkRecovery I am the leader, no recovery necessary
> [junit4:junit4]   2> 4769 T2425 oascc.ZkStateReader.updateClusterState Updating cloud state from ZooKeeper... 
> [junit4:junit4]   2> 4826 T2425 oass.SolrDispatchFilter.init user.dir=/usr/home/hudson/hudson-slave/workspace/Lucene-Solr-NightlyTests-4.x/solr/build/solr-core/test/J1
> [junit4:junit4]   2> 4827 T2425 oass.SolrDispatchFilter.init SolrDispatchFilter.init() done
> [junit4:junit4]   2> 4827 T2425 oascsi.HttpClientUtil.createClient Creating new http client, config:maxConnections=128&maxConnectionsPerHost=32&followRedirects=false
> [junit4:junit4]   2> 5330 T2446 oascc.ZkStateReader.updateClusterState Updating cloud state from ZooKeeper... 
> [junit4:junit4]   2> 5357 T2445 oascc.ZkStateReader$2.process A cluster state change has occurred - updating...
> [junit4:junit4]   2> 5357 T2459 oascc.ZkStateReader$2.process A cluster state change has occurred - updating...
> [junit4:junit4]   2> 5517 T2425 oejs.Server.doStart jetty-8.1.2.v20120308
> [junit4:junit4]   2> 5520 T2425 oejs.AbstractConnector.doStart Started SocketConnector@0.0.0.0:24660
> [junit4:junit4]   2> 5521 T2425 oasc.SolrResourceLoader.locateSolrHome JNDI not configured for solr (NoInitialContextEx)
> [junit4:junit4]   2> 5521 T2425 oasc.SolrResourceLoader.locateSolrHome using system property solr.solr.home: /usr/home/hudson/hudson-slave/workspace/Lucene-Solr-NightlyTests-4.x/solr/build/solr-core/test/J1/./solrtest-jetty2-1348435923767
> [junit4:junit4]   2> 5521 T2425 oasc.SolrResourceLoader.<init> new SolrResourceLoader for deduced Solr Home: '/usr/home/hudson/hudson-slave/workspace/Lucene-Solr-NightlyTests-4.x/solr/build/solr-core/test/J1/./solrtest-jetty2-1348435923767/'
> [junit4:junit4]   2> 5556 T2425 oass.SolrDispatchFilter.init SolrDispatchFilter.init()
> [junit4:junit4]   2> 5557 T2425 oasc.SolrResourceLoader.locateSolrHome JNDI not configured for solr (NoInitialContextEx)
> [junit4:junit4]   2> 5557 T2425 oasc.SolrResourceLoader.locateSolrHome using system property solr.solr.home: /usr/home/hudson/hudson-slave/workspace/Lucene-Solr-NightlyTests-4.x/solr/build/solr-core/test/J1/./solrtest-jetty2-1348435923767
> [junit4:junit4]   2> 5557 T2425 oasc.CoreContainer$Initializer.initialize looking for solr.xml: /usr/home/hudson/hudson-slave/workspace/Lucene-Solr-NightlyTests-4.x/solr/build/solr-core/test/J1/./solrtest-jetty2-1348435923767/solr.xml
> [junit4:junit4]   2> 5558 T2425 oasc.CoreContainer.<init> New CoreContainer 1299179705
> [junit4:junit4]   2> 5559 T2425 oasc.CoreContainer.load Loading CoreContainer using Solr Home: '/usr/home/hudson/hudson-slave/workspace/Lucene-Solr-NightlyTests-4.x/solr/build/solr-core/test/J1/./solrtest-jetty2-1348435923767/'
> [junit4:junit4]   2> 5559 T2425 oasc.SolrResourceLoader.<init> new SolrResourceLoader for directory: '/usr/home/hudson/hudson-slave/workspace/Lucene-Solr-NightlyTests-4.x/solr/build/solr-core/test/J1/./solrtest-jetty2-1348435923767/'
> [junit4:junit4]   2> 5584 T2425 oasc.CoreContainer.load Registering Log Listener
> [junit4:junit4]   2> 5599 T2425 oasc.CoreContainer.initZooKeeper Zookeeper client=127.0.0.1:24639/solr
> [junit4:junit4]   2> 5599 T2425 oaz.ZooKeeper.<init> Initiating client connection, connectString=127.0.0.1:24639/solr sessionTimeout=5000 watcher=org.apache.solr.common.cloud.ConnectionManager@65e99801
> [junit4:junit4]   2> 5600 T2470 oaz.ClientCnxn$SendThread.startConnect Opening socket connection to server /127.0.0.1:24639
> [junit4:junit4]   2> 5600 T2425 oascc.ConnectionManager.waitForConnected Waiting for client to connect to ZooKeeper
> [junit4:junit4]   2> 5602 T2470 oaz.ClientCnxn$SendThread.primeConnection Socket connection established to localhost/127.0.0.1:24639, initiating session
> [junit4:junit4]   2> 5602 T2427 oazs.NIOServerCnxn$Factory.run Accepted socket connection from /140.211.11.196:24661
> [junit4:junit4]   2> 5602 T2427 oazs.NIOServerCnxn.readConnectRequest Client attempting to establish new session at /140.211.11.196:24661
> [junit4:junit4]   2> 5604 T2429 oazs.NIOServerCnxn.finishSessionInit Established session 0x139f50b40590004 with negotiated timeout 5000 for client /140.211.11.196:24661
> [junit4:junit4]   2> 5604 T2470 oaz.ClientCnxn$SendThread.readConnectResult Session establishment complete on server localhost/127.0.0.1:24639, sessionid = 0x139f50b40590004, negotiated timeout = 5000
> [junit4:junit4]   2> 5604 T2471 oascc.ConnectionManager.process Watcher org.apache.solr.common.cloud.ConnectionManager@65e99801 name:ZooKeeperConnection Watcher:127.0.0.1:24639/solr got event WatchedEvent state:SyncConnected type:None path:null path:null type:None
> [junit4:junit4]   2> 5605 T2425 oascc.ConnectionManager.waitForConnected Client is connected to ZooKeeper
> [junit4:junit4]   2> 5605 T2430 oazs.PrepRequestProcessor.pRequest Got user-level KeeperException when processing sessionid:0x139f50b40590004 type:create cxid:0x1 zxid:0xfffffffffffffffe txntype:unknown reqpath:n/a Error Path:/solr/overseer Error:KeeperErrorCode = NodeExists for /solr/overseer
> [junit4:junit4]   2> 5607 T2430 oazs.PrepRequestProcessor.pRequest Got user-level KeeperException when processing sessionid:0x139f50b40590004 type:create cxid:0x2 zxid:0xfffffffffffffffe txntype:unknown reqpath:n/a Error Path:/solr/overseer Error:KeeperErrorCode = NodeExists for /solr/overseer
> [junit4:junit4]   2> 5608 T2425 oasc.ZkController.createEphemeralLiveNode Register node as live in ZooKeeper:/live_nodes/127.0.0.1:24660_solr
> [junit4:junit4]   2> 5608 T2430 oazs.PrepRequestProcessor.pRequest Got user-level KeeperException when processing sessionid:0x139f50b40590004 type:delete cxid:0x4 zxid:0xfffffffffffffffe txntype:unknown reqpath:n/a Error Path:/solr/live_nodes/127.0.0.1:24660_solr Error:KeeperErrorCode = NoNode for /solr/live_nodes/127.0.0.1:24660_solr
> [junit4:junit4]   2> 5609 T2425 oascc.SolrZkClient.makePath makePath: /live_nodes/127.0.0.1:24660_solr
> [junit4:junit4]   2> 5621 T2445 oascc.ZkStateReader$3.process Updating live nodes
> [junit4:junit4]   2> 5621 T2459 oascc.ZkStateReader$3.process Updating live nodes
> [junit4:junit4]   2> 5622 T2425 oashc.HttpShardHandlerFactory.getParameter Setting socketTimeout to: 0
> [junit4:junit4]   2> 5622 T2425 oashc.HttpShardHandlerFactory.getParameter Setting urlScheme to: http://
> [junit4:junit4]   2> 5622 T2425 oashc.HttpShardHandlerFactory.getParameter Setting connTimeout to: 0
> [junit4:junit4]   2> 5623 T2425 oashc.HttpShardHandlerFactory.getParameter Setting maxConnectionsPerHost to: 20
> [junit4:junit4]   2> 5623 T2425 oashc.HttpShardHandlerFactory.getParameter Setting corePoolSize to: 0
> [junit4:junit4]   2> 5623 T2425 oashc.HttpShardHandlerFactory.getParameter Setting maximumPoolSize to: 2147483647
> [junit4:junit4]   2> 5624 T2425 oashc.HttpShardHandlerFactory.getParameter Setting maxThreadIdleTime to: 5
> [junit4:junit4]   2> 5624 T2425 oashc.HttpShardHandlerFactory.getParameter Setting sizeOfQueue to: -1
> [junit4:junit4]   2> 5624 T2425 oashc.HttpShardHandlerFactory.getParameter Setting fairnessPolicy to: false
> [junit4:junit4]   2> 5624 T2425 oascsi.HttpClientUtil.createClient Creating new http client, config:maxConnectionsPerHost=20&maxConnections=10000&socketTimeout=0&connTimeout=0&retry=false
> [junit4:junit4]   2> 5637 T2425 oascc.ZkStateReader.createClusterStateWatchersAndUpdate Updating cluster state from ZooKeeper... 
> [junit4:junit4]   2> 5641 T2425 oasc.CoreContainer.create Creating SolrCore 'collection1' using instanceDir: /usr/home/hudson/hudson-slave/workspace/Lucene-Solr-NightlyTests-4.x/solr/build/solr-core/test/J1/./solrtest-jetty2-1348435923767/collection1
> [junit4:junit4]   2> 5641 T2425 oasc.ZkController.createCollectionZkNode Check for collection zkNode:collection1
> [junit4:junit4]   2> 5642 T2425 oasc.ZkController.createCollectionZkNode Collection zkNode exists
> [junit4:junit4]   2> 5642 T2425 oasc.ZkController.readConfigName Load collection config from:/collections/collection1
> [junit4:junit4]   2> 5643 T2425 oasc.SolrResourceLoader.<init> new SolrResourceLoader for directory: '/usr/home/hudson/hudson-slave/workspace/Lucene-Solr-NightlyTests-4.x/solr/build/solr-core/test/J1/./solrtest-jetty2-1348435923767/collection1/'
> [junit4:junit4]   2> 5644 T2425 oasc.SolrResourceLoader.replaceClassLoader Adding 'file:/usr/home/hudson/hudson-slave/workspace/Lucene-Solr-NightlyTests-4.x/solr/build/solr-core/test/J1/solrtest-jetty2-1348435923767/collection1/lib/classes/' to classloader
> [junit4:junit4]   2> 5645 T2425 oasc.SolrResourceLoader.replaceClassLoader Adding 'file:/usr/home/hudson/hudson-slave/workspace/Lucene-Solr-NightlyTests-4.x/solr/build/solr-core/test/J1/solrtest-jetty2-1348435923767/collection1/lib/README' to classloader
> [junit4:junit4]   2> 5677 T2425 oasc.SolrConfig.<init> Using Lucene MatchVersion: LUCENE_41
> [junit4:junit4]   2> 5727 T2425 oasc.SolrConfig.<init> Loaded SolrConfig: solrconfig.xml
> [junit4:junit4]   2> 5828 T2425 oass.IndexSchema.readSchema Reading Solr Schema
> [junit4:junit4]   2> 5833 T2425 oass.IndexSchema.readSchema Schema name=test
> [junit4:junit4]   2> 6229 T2425 oass.OpenExchangeRatesOrgProvider.init Initialized with rates=open-exchange-rates.json, refreshInterval=1440.
> [junit4:junit4]   2> 6237 T2425 oass.IndexSchema.readSchema default search field in schema is text
> [junit4:junit4]   2> 6240 T2425 oass.IndexSchema.readSchema unique key field: id
> [junit4:junit4]   2> 6248 T2425 oass.FileExchangeRateProvider.reload Reloading exchange rates from file currency.xml
> [junit4:junit4]   2> 6252 T2425 oass.FileExchangeRateProvider.reload Reloading exchange rates from file currency.xml
> [junit4:junit4]   2> 6255 T2425 oass.OpenExchangeRatesOrgProvider.reload Reloading exchange rates from open-exchange-rates.json
> [junit4:junit4]   2> 6255 T2425 oass.OpenExchangeRatesOrgProvider.reload Reloading exchange rates from open-exchange-rates.json
> [junit4:junit4]   2> 6256 T2425 oasc.SolrCore.<init> [collection1] Opening new SolrCore at /usr/home/hudson/hudson-slave/workspace/Lucene-Solr-NightlyTests-4.x/solr/build/solr-core/test/J1/./solrtest-jetty2-1348435923767/collection1/, dataDir=./org.apache.solr.cloud.SyncSliceTest-1348435918932/jetty2/
> [junit4:junit4]   2> 6256 T2425 oasc.JmxMonitoredMap.<init> JMX monitoring is enabled. Adding Solr mbeans to JMX Server: com.sun.jmx.mbeanserver.JmxMBeanServer@785e8d7d
> [junit4:junit4]   2> 6257 T2425 oasc.SolrCore.getNewIndexDir WARNING New index directory detected: old=null new=./org.apache.solr.cloud.SyncSliceTest-1348435918932/jetty2/index/
> [junit4:junit4]   2> 6258 T2425 oasc.SolrCore.initIndex WARNING [collection1] Solr index directory './org.apache.solr.cloud.SyncSliceTest-1348435918932/jetty2/index' doesn't exist. Creating new index...
> [junit4:junit4]   2> 6259 T2425 oasc.CachingDirectoryFactory.get return new directory for /usr/home/hudson/hudson-slave/workspace/Lucene-Solr-NightlyTests-4.x/solr/build/solr-core/test/J1/./org.apache.solr.cloud.SyncSliceTest-1348435918932/jetty2/index forceNew:false
> [junit4:junit4]   2> 6263 T2425 oasc.SolrDeletionPolicy.onCommit SolrDeletionPolicy.onCommit: commits:num=1
> [junit4:junit4]   2> 		commit{dir=NRTCachingDirectory(org.apache.lucene.store.NIOFSDirectory@/usr/home/hudson/hudson-slave/workspace/Lucene-Solr-NightlyTests-4.x/solr/build/solr-core/test/J1/org.apache.solr.cloud.SyncSliceTest-1348435918932/jetty2/index lockFactory=org.apache.lucene.store.NativeFSLockFactory@8fe234b; maxCacheMB=48.0 maxMergeSizeMB=4.0),segFN=segments_1,generation=1,filenames=[segments_1]
> [junit4:junit4]   2> 6263 T2425 oasc.SolrDeletionPolicy.updateCommits newest commit = 1
> [junit4:junit4]   2> 6264 T2425 oasc.SolrCore.initWriters created xml: solr.XMLResponseWriter
> [junit4:junit4]   2> 6266 T2425 oasup.UpdateRequestProcessorChain.init inserting DistributedUpdateProcessorFactory into updateRequestProcessorChain "dedupe"
> [junit4:junit4]   2> 6266 T2425 oasup.UpdateRequestProcessorChain.init inserting DistributedUpdateProcessorFactory into updateRequestProcessorChain "dedupe-allfields"
> [junit4:junit4]   2> 6267 T2425 oasup.UpdateRequestProcessorChain.init inserting DistributedUpdateProcessorFactory into updateRequestProcessorChain "stored_sig"
> [junit4:junit4]   2> 6267 T2425 oasup.UpdateRequestProcessorChain.init inserting DistributedUpdateProcessorFactory into updateRequestProcessorChain "uniq-fields"
> [junit4:junit4]   2> 6267 T2425 oasup.UpdateRequestProcessorChain.init inserting DistributedUpdateProcessorFactory into updateRequestProcessorChain "distrib-dup-test-chain-implicit"
> [junit4:junit4]   2> 6268 T2425 oasc.RequestHandlers.initHandlersFromConfig adding lazy requestHandler: solr.ReplicationHandler
> [junit4:junit4]   2> 6268 T2425 oasc.RequestHandlers.initHandlersFromConfig created /replication: solr.ReplicationHandler
> [junit4:junit4]   2> 6269 T2425 oasc.RequestHandlers.initHandlersFromConfig created standard: solr.StandardRequestHandler
> [junit4:junit4]   2> 6269 T2425 oasc.RequestHandlers.initHandlersFromConfig created /get: solr.RealTimeGetHandler
> [junit4:junit4]   2> 6270 T2425 oasc.RequestHandlers.initHandlersFromConfig created dismax: solr.SearchHandler
> [junit4:junit4]   2> 6270 T2425 oasc.RequestHandlers.initHandlersFromConfig created mock: org.apache.solr.core.MockQuerySenderListenerReqHandler
> [junit4:junit4]   2> 6271 T2425 oasc.RequestHandlers.initHandlersFromConfig created /admin/: org.apache.solr.handler.admin.AdminHandlers
> [junit4:junit4]   2> 6271 T2425 oasc.RequestHandlers.initHandlersFromConfig created defaults: solr.StandardRequestHandler
> [junit4:junit4]   2> 6271 T2425 oasc.RequestHandlers.initHandlersFromConfig adding lazy requestHandler: solr.StandardRequestHandler
> [junit4:junit4]   2> 6272 T2425 oasc.RequestHandlers.initHandlersFromConfig created lazy: solr.StandardRequestHandler
> [junit4:junit4]   2> 6272 T2425 oasc.RequestHandlers.initHandlersFromConfig created /update: solr.UpdateRequestHandler
> [junit4:junit4]   2> 6273 T2425 oasc.RequestHandlers.initHandlersFromConfig created /terms: org.apache.solr.handler.component.SearchHandler
> [junit4:junit4]   2> 6273 T2425 oasc.RequestHandlers.initHandlersFromConfig created spellCheckCompRH: org.apache.solr.handler.component.SearchHandler
> [junit4:junit4]   2> 6274 T2425 oasc.RequestHandlers.initHandlersFromConfig created spellCheckCompRH_Direct: org.apache.solr.handler.component.SearchHandler
> [junit4:junit4]   2> 6274 T2425 oasc.RequestHandlers.initHandlersFromConfig created spellCheckWithWordbreak: org.apache.solr.handler.component.SearchHandler
> [junit4:junit4]   2> 6275 T2425 oasc.RequestHandlers.initHandlersFromConfig created spellCheckWithWordbreak_Direct: org.apache.solr.handler.component.SearchHandler
> [junit4:junit4]   2> 6275 T2425 oasc.RequestHandlers.initHandlersFromConfig created spellCheckCompRH1: org.apache.solr.handler.component.SearchHandler
> [junit4:junit4]   2> 6276 T2425 oasc.RequestHandlers.initHandlersFromConfig created tvrh: org.apache.solr.handler.component.SearchHandler
> [junit4:junit4]   2> 6276 T2425 oasc.RequestHandlers.initHandlersFromConfig created /mlt: solr.MoreLikeThisHandler
> [junit4:junit4]   2> 6277 T2425 oasc.RequestHandlers.initHandlersFromConfig created /debug/dump: solr.DumpRequestHandler
> [junit4:junit4]   2> 6279 T2425 oashl.XMLLoader.init xsltCacheLifetimeSeconds=60
> [junit4:junit4]   2> 6282 T2425 oasc.SolrCore.initDeprecatedSupport WARNING solrconfig.xml uses deprecated <admin/gettableFiles>, Please update your config to use the ShowFileRequestHandler.
> [junit4:junit4]   2> 6283 T2425 oasc.SolrCore.initDeprecatedSupport WARNING adding ShowFileRequestHandler with hidden files: [SCHEMA.XML, OLD_SYNONYMS.TXT, STOPWORDS.TXT, PROTWORDS.TXT, OPEN-EXCHANGE-RATES.JSON, SYNONYMS.TXT, CURRENCY.XML, MAPPING-ISOLATIN1ACCENT.TXT]
> [junit4:junit4]   2> 6286 T2425 oass.SolrIndexSearcher.<init> Opening Searcher@5e8667b1 main
> [junit4:junit4]   2> 6287 T2425 oasu.CommitTracker.<init> Hard AutoCommit: disabled
> [junit4:junit4]   2> 6287 T2425 oasu.CommitTracker.<init> Soft AutoCommit: disabled
> [junit4:junit4]   2> 6287 T2425 oashc.SpellCheckComponent.inform Initializing spell checkers
> [junit4:junit4]   2> 6293 T2425 oass.DirectSolrSpellChecker.init init: {name=direct,classname=DirectSolrSpellChecker,field=lowerfilt,minQueryLength=3}
> [junit4:junit4]   2> 6346 T2472 oasc.SolrCore.registerSearcher [collection1] Registered new searcher Searcher@5e8667b1 main{StandardDirectoryReader(segments_1:1)}
> [junit4:junit4]   2> 6363 T2446 oascc.ZkStateReader.updateClusterState Updating cloud state from ZooKeeper... 
> [junit4:junit4]   2> 6374 T2445 oascc.ZkStateReader$2.process A cluster state change has occurred - updating...
> [junit4:junit4]   2> 6374 T2459 oascc.ZkStateReader$2.process A cluster state change has occurred - updating...
> [junit4:junit4]   2> 6374 T2471 oascc.ZkStateReader$2.process A cluster state change has occurred - updating...
> [junit4:junit4]   2> 6851 T2425 oasc.CoreContainer.register registering core: collection1
> [junit4:junit4]   2> 6851 T2425 oasc.ZkController.register Register shard - core:collection1 address:http://127.0.0.1:24660/solr shardId:shard1
> [junit4:junit4]   2> 6855 T2425 oasc.ZkController.register We are http://127.0.0.1:24660/solr/collection1/ and leader is http://127.0.0.1:24653/solr/collection1/
> [junit4:junit4]   2> 6855 T2425 oasc.ZkController.register No LogReplay needed for core=collection1 baseURL=http://127.0.0.1:24660/solr
> [junit4:junit4]   2> 6856 T2425 oasc.ZkController.checkRecovery Core needs to recover:collection1
> [junit4:junit4]   2> 6856 T2425 oasu.DefaultSolrCoreState.doRecovery Running recovery - first canceling any ongoing recovery
> [junit4:junit4]   2> ASYNC  NEW_CORE C49 name=collection1 org.apache.solr.core.SolrCore@27313524 url=http://127.0.0.1:24660/solr/collection1 node=127.0.0.1:24660_solr
> [junit4:junit4]   2> 6857 T2473 C49 P24660 oasc.RecoveryStrategy.run Starting recovery process.  core=collection1 recoveringAfterStartup=true
> [junit4:junit4]   2> 6857 T2425 oascc.ZkStateReader.updateClusterState Updating cloud state from ZooKeeper... 
> [junit4:junit4]   2> 6866 T2473 C49 P24660 oasc.RecoveryStrategy.doRecovery ###### startupVersions=[]
> [junit4:junit4]   2> 6867 T2425 oass.SolrDispatchFilter.init user.dir=/usr/home/hudson/hudson-slave/workspace/Lucene-Solr-NightlyTests-4.x/solr/build/solr-core/test/J1
> [junit4:junit4]   2> 6867 T2425 oass.SolrDispatchFilter.init SolrDispatchFilter.init() done
> [junit4:junit4]   2> 6868 T2425 oascsi.HttpClientUtil.createClient Creating new http client, config:maxConnections=128&maxConnectionsPerHost=32&followRedirects=false
> [junit4:junit4]   2> 6868 T2473 C49 P24660 oasc.RecoveryStrategy.doRecovery Attempting to PeerSync from http://127.0.0.1:24653/solr/collection1/ core=collection1 - recoveringAfterStartup=true
> [junit4:junit4]   2> 6868 T2473 C49 P24660 oasu.PeerSync.sync PeerSync: core=collection1 url=http://127.0.0.1:24660/solr START replicas=[http://127.0.0.1:24653/solr/collection1/] nUpdates=100
> [junit4:junit4]   2> 6869 T2473 C49 P24660 oasu.PeerSync.sync WARNING no frame of reference to tell of we've missed updates
> [junit4:junit4]   2> 6870 T2473 C49 P24660 oasc.RecoveryStrategy.doRecovery PeerSync Recovery was not successful - trying replication. core=collection1
> [junit4:junit4]   2> 6870 T2473 C49 P24660 oasc.RecoveryStrategy.doRecovery Starting Replication Recovery. core=collection1
> [junit4:junit4]   2> 6870 T2473 C49 P24660 oascsi.HttpClientUtil.createClient Creating new http client, config:maxConnections=128&maxConnectionsPerHost=32&followRedirects=false
> [junit4:junit4]   2> 6879 T2446 oascc.ZkStateReader.updateClusterState Updating cloud state from ZooKeeper... 
> [junit4:junit4]   2> 6883 T2471 oascc.ZkStateReader$2.process A cluster state change has occurred - updating...
> [junit4:junit4]   2> 6883 T2445 oascc.ZkStateReader$2.process A cluster state change has occurred - updating...
> [junit4:junit4]   2> 6883 T2459 oascc.ZkStateReader$2.process A cluster state change has occurred - updating...
> [junit4:junit4]   2> ASYNC  NEW_CORE C50 name=collection1 org.apache.solr.core.SolrCore@500d165 url=http://127.0.0.1:24653/solr/collection1 node=127.0.0.1:24653_solr
> [junit4:junit4]   2> 6886 T2451 C50 P24653 REQ /get {distrib=false&qt=/get&wt=javabin&version=2&getVersions=100} status=0 QTime=0 
> [junit4:junit4]   2> 7391 T2425 oejs.Server.doStart jetty-8.1.2.v20120308
> [junit4:junit4]   2> 7394 T2425 oejs.AbstractConnector.doStart Started SocketConnector@0.0.0.0:24670
> [junit4:junit4]   2> 7394 T2425 oasc.SolrResourceLoader.locateSolrHome JNDI not configured for solr (NoInitialContextEx)
> [junit4:junit4]   2> 7395 T2425 oasc.SolrResourceLoader.locateSolrHome using system property solr.solr.home: /usr/home/hudson/hudson-slave/workspace/Lucene-Solr-NightlyTests-4.x/solr/build/solr-core/test/J1/./solrtest-jetty3-1348435925811
> [junit4:junit4]   2> 7395 T2425 oasc.SolrResourceLoader.<init> new SolrResourceLoader for deduced Solr Home: '/usr/home/hudson/hudson-slave/workspace/Lucene-Solr-NightlyTests-4.x/solr/build/solr-core/test/J1/./solrtest-jetty3-1348435925811/'
> [junit4:junit4]   2> 7420 T2425 oass.SolrDispatchFilter.init SolrDispatchFilter.init()
> [junit4:junit4]   2> 7420 T2425 oasc.SolrResourceLoader.locateSolrHome JNDI not configured for solr (NoInitialContextEx)
> [junit4:junit4]   2> 7420 T2425 oasc.SolrResourceLoader.locateSolrHome using system property solr.solr.home: /usr/home/hudson/hudson-slave/workspace/Lucene-Solr-NightlyTests-4.x/solr/build/solr-core/test/J1/./solrtest-jetty3-1348435925811
> [junit4:junit4]   2> 7421 T2425 oasc.CoreContainer$Initializer.initialize looking for solr.xml: /usr/home/hudson/hudson-slave/workspace/Lucene-Solr-NightlyTests-4.x/solr/build/solr-core/test/J1/./solrtest-jetty3-1348435925811/solr.xml
> [junit4:junit4]   2> 7421 T2425 oasc.CoreContainer.<init> New CoreContainer 1404127272
> [junit4:junit4]   2> 7422 T2425 oasc.CoreContainer.load Loading CoreContainer using Solr Home: '/usr/home/hudson/hudson-slave/workspace/Lucene-Solr-NightlyTests-4.x/solr/build/solr-core/test/J1/./solrtest-jetty3-1348435925811/'
> [junit4:junit4]   2> 7422 T2425 oasc.SolrResourceLoader.<init> new SolrResourceLoader for directory: '/usr/home/hudson/hudson-slave/workspace/Lucene-Solr-NightlyTests-4.x/solr/build/solr-core/test/J1/./solrtest-jetty3-1348435925811/'
> [junit4:junit4]   2> 7440 T2425 oasc.CoreContainer.load Registering Log Listener
> [junit4:junit4]   2> 7450 T2425 oasc.CoreContainer.initZooKeeper Zookeeper client=127.0.0.1:24639/solr
> [junit4:junit4]   2> 7451 T2425 oaz.ZooKeeper.<init> Initiating client connection, connectString=127.0.0.1:24639/solr sessionTimeout=5000 watcher=org.apache.solr.common.cloud.ConnectionManager@50b0399b
> [junit4:junit4]   2> 7452 T2484 oaz.ClientCnxn$SendThread.startConnect Opening socket connection to server /127.0.0.1:24639
> [junit4:junit4]   2> 7452 T2425 oascc.ConnectionManager.waitForConnected Waiting for client to connect to ZooKeeper
> [junit4:junit4]   2> 7453 T2484 oaz.ClientCnxn$SendThread.primeConnection Socket connection established to localhost/127.0.0.1:24639, initiating session
> [junit4:junit4]   2> 7453 T2427 oazs.NIOServerCnxn$Factory.run Accepted socket connection from /140.211.11.196:24671
> [junit4:junit4]   2> 7453 T2427 oazs.NIOServerCnxn.readConnectRequest Client attempting to establish new session at /140.211.11.196:24671
> [junit4:junit4]   2> 7480 T2429 oazs.NIOServerCnxn.finishSessionInit Established session 0x139f50b40590005 with negotiated timeout 5000 for client /140.211.11.196:24671
> [junit4:junit4]   2> 7480 T2484 oaz.ClientCnxn$SendThread.readConnectResult Session establishment complete on server localhost/127.0.0.1:24639, sessionid = 0x139f50b40590005, negotiated timeout = 5000
> [junit4:junit4]   2> 7480 T2485 oascc.ConnectionManager.process Watcher org.apache.solr.common.cloud.ConnectionManager@50b0399b name:ZooKeeperConnection Watcher:127.0.0.1:24639/solr got event WatchedEvent state:SyncConnected type:None path:null path:null type:None
> [junit4:junit4]   2> 7481 T2425 oascc.ConnectionManager.waitForConnected Client is connected to ZooKeeper
> [junit4:junit4]   2> 7481 T2430 oazs.PrepRequestProcessor.pRequest Got user-level KeeperException when processing sessionid:0x139f50b40590005 type:create cxid:0x1 zxid:0xfffffffffffffffe txntype:unknown reqpath:n/a Error Path:/solr/overseer Error:KeeperErrorCode = NodeExists for /solr/overseer
> [junit4:junit4]   2> 7483 T2430 oazs.PrepRequestProcessor.pRequest Got user-level KeeperException when processing sessionid:0x139f50b40590005 type:create cxid:0x2 zxid:0xfffffffffffffffe txntype:unknown reqpath:n/a Error Path:/solr/overseer Error:KeeperErrorCode = NodeExists for /solr/overseer
> [junit4:junit4]   2> 7493 T2425 oasc.ZkController.createEphemeralLiveNode Register node as live in ZooKeeper:/live_nodes/127.0.0.1:24670_solr
> [junit4:junit4]   2> 7493 T2430 oazs.PrepRequestProcessor.pRequest Got user-level KeeperException when processing sessionid:0x139f50b40590005 type:delete cxid:0x4 zxid:0xfffffffffffffffe txntype:unknown reqpath:n/a Error Path:/solr/live_nodes/127.0.0.1:24670_solr Error:KeeperErrorCode = NoNode for /solr/live_nodes/127.0.0.1:24670_solr
> [junit4:junit4]   2> 7494 T2425 oascc.SolrZkClient.makePath makePath: /live_nodes/127.0.0.1:24670_solr
> [junit4:junit4]   2> 7501 T2445 oascc.ZkStateReader$3.process Updating live nodes
> [junit4:junit4]   2> 7501 T2471 oascc.ZkStateReader$3.process Updating live nodes
> [junit4:junit4]   2> 7501 T2459 oascc.ZkStateReader$3.process Updating live nodes
> [junit4:junit4]   2> 7501 T2425 oashc.HttpShardHandlerFactory.getParameter Setting socketTimeout to: 0
> [junit4:junit4]   2> 7501 T2425 oashc.HttpShardHandlerFactory.getParameter Setting urlScheme to: http://
> [junit4:junit4]   2> 7502 T2425 oashc.HttpShardHandlerFactory.getParameter Setting connTimeout to: 0
> [junit4:junit4]   2> 7502 T2425 oashc.HttpShardHandlerFactory.getParameter Setting maxConnectionsPerHost to: 20
> [junit4:junit4]   2> 7502 T2425 oashc.HttpShardHandlerFactory.getParameter Setting corePoolSize to: 0
> [junit4:junit4]   2> 7503 T2425 oashc.HttpShardHandlerFactory.getParameter Setting maximumPoolSize to: 2147483647
> [junit4:junit4]   2> 7503 T2425 oashc.HttpShardHandlerFactory.getParameter Setting maxThreadIdleTime to: 5
> [junit4:junit4]   2> 7503 T2425 oashc.HttpShardHandlerFactory.getParameter Setting sizeOfQueue to: -1
> [junit4:junit4]   2> 7503 T2425 oashc.HttpShardHandlerFactory.getParameter Setting fairnessPolicy to: false
> [junit4:junit4]   2> 7504 T2425 oascsi.HttpClientUtil.createClient Creating new http client, config:maxConnectionsPerHost=20&maxConnections=10000&socketTimeout=0&connTimeout=0&retry=false
> [junit4:junit4]   2> 7517 T2425 oascc.ZkStateReader.createClusterStateWatchersAndUpdate Updating cluster state from ZooKeeper... 
> [junit4:junit4]   2> 7521 T2425 oasc.CoreContainer.create Creating SolrCore 'collection1' using instanceDir: /usr/home/hudson/hudson-slave/workspace/Lucene-Solr-NightlyTests-4.x/solr/build/solr-core/test/J1/./solrtest-jetty3-1348435925811/collection1
> [junit4:junit4]   2> 7521 T2425 oasc.ZkController.createCollectionZkNode Check for collection zkNode:collection1
> [junit4:junit4]   2> 7522 T2425 oasc.ZkController.createCollectionZkNode Collection zkNode exists
> [junit4:junit4]   2> 7522 T2425 oasc.ZkController.readConfigName Load collection config from:/collections/collection1
> [junit4:junit4]   2> 7523 T2425 oasc.SolrResourceLoader.<init> new SolrResourceLoader for directory: '/usr/home/hudson/hudson-slave/workspace/Lucene-Solr-NightlyTests-4.x/solr/build/solr-core/test/J1/./solrtest-jetty3-1348435925811/collection1/'
> [junit4:junit4]   2> 7524 T2425 oasc.SolrResourceLoader.replaceClassLoader Adding 'file:/usr/home/hudson/hudson-slave/workspace/Lucene-Solr-NightlyTests-4.x/solr/build/solr-core/test/J1/solrtest-jetty3-1348435925811/collection1/lib/classes/' to classloader
> [junit4:junit4]   2> 7525 T2425 oasc.SolrResourceLoader.replaceClassLoader Adding 'file:/usr/home/hudson/hudson-slave/workspace/Lucene-Solr-NightlyTests-4.x/solr/build/solr-core/test/J1/solrtest-jetty3-1348435925811/collection1/lib/README' to classloader
> [junit4:junit4]   2> 7558 T2425 oasc.SolrConfig.<init> Using Lucene MatchVersion: LUCENE_41
> [junit4:junit4]   2> 7605 T2425 oasc.SolrConfig.<init> Loaded SolrConfig: solrconfig.xml
> [junit4:junit4]   2> 7706 T2425 oass.IndexSchema.readSchema Reading Solr Schema
> [junit4:junit4]   2> 7712 T2425 oass.IndexSchema.readSchema Schema name=test
> [junit4:junit4]   2> 8121 T2425 oass.OpenExchangeRatesOrgProvider.init Initialized with rates=open-exchange-rates.json, refreshInterval=1440.
> [junit4:junit4]   2> 8130 T2425 oass.IndexSchema.readSchema default search field in schema is text
> [junit4:junit4]   2> 8133 T2425 oass.IndexSchema.readSchema unique key field: id
> [junit4:junit4]   2> 8142 T2425 oass.FileExchangeRateProvider.reload Reloading exchange rates from file currency.xml
> [junit4:junit4]   2> 8146 T2425 oass.FileExchangeRateProvider.reload Reloading exchange rates from file currency.xml
> [junit4:junit4]   2> 8149 T2425 oass.OpenExchangeRatesOrgProvider.reload Reloading exchange rates from open-exchange-rates.json
> [junit4:junit4]   2> 8150 T2425 oass.OpenExchangeRatesOrgProvider.reload Reloading exchange rates from open-exchange-rates.json
> [junit4:junit4]   2> 8151 T2425 oasc.SolrCore.<init> [collection1] Opening new SolrCore at /usr/home/hudson/hudson-slave/workspace/Lucene-Solr-NightlyTests-4.x/solr/build/solr-core/test/J1/./solrtest-jetty3-1348435925811/collection1/, dataDir=./org.apache.solr.cloud.SyncSliceTest-1348435918932/jetty3/
> [junit4:junit4]   2> 8151 T2425 oasc.JmxMonitoredMap.<init> JMX monitoring is enabled. Adding Solr mbeans to JMX Server: com.sun.jmx.mbeanserver.JmxMBeanServer@785e8d7d
> [junit4:junit4]   2> 8152 T2425 oasc.SolrCore.getNewIndexDir WARNING New index directory detected: old=null new=./org.apache.solr.cloud.SyncSliceTest-1348435918932/jetty3/index/
> [junit4:junit4]   2> 8153 T2425 oasc.SolrCore.initIndex WARNING [collection1] Solr index directory './org.apache.solr.cloud.SyncSliceTest-1348435918932/jetty3/index' doesn't exist. Creating new index...
> [junit4:junit4]   2> 8154 T2425 oasc.CachingDirectoryFactory.get return new directory for /usr/home/hudson/hudson-slave/workspace/Lucene-Solr-NightlyTests-4.x/solr/build/solr-core/test/J1/./org.apache.solr.cloud.SyncSliceTest-1348435918932/jetty3/index forceNew:false
> [junit4:junit4]   2> 8162 T2425 oasc.SolrDeletionPolicy.onCommit SolrDeletionPolicy.onCommit: commits:num=1
> [junit4:junit4]   2> 		commit{dir=NRTCachingDirectory(org.apache.lucene.store.NIOFSDirectory@/usr/home/hudson/hudson-slave/workspace/Lucene-Solr-NightlyTests-4.x/solr/build/solr-core/test/J1/org.apache.solr.cloud.SyncSliceTest-1348435918932/jetty3/index lockFactory=org.apache.lucene.store.NativeFSLockFactory@28c73b0; maxCacheMB=48.0 maxMergeSizeMB=4.0),segFN=segments_1,generation=1,filenames=[segments_1]
> [junit4:junit4]   2> 8162 T2425 oasc.SolrDeletionPolicy.updateCommits newest commit = 1
> [junit4:junit4]   2> 8163 T2425 oasc.SolrCore.initWriters created xml: solr.XMLResponseWriter
> [junit4:junit4]   2> 8164 T2425 oasup.UpdateRequestProcessorChain.init inserting DistributedUpdateProcessorFactory into updateRequestProcessorChain "dedupe"
> [junit4:junit4]   2> 8165 T2425 oasup.UpdateRequestProcessorChain.init inserting DistributedUpdateProcessorFactory into updateRequestProcessorChain "dedupe-allfields"
> [junit4:junit4]   2> 8165 T2425 oasup.UpdateRequestProcessorChain.init inserting DistributedUpdateProcessorFactory into updateRequestProcessorChain "stored_sig"
> [junit4:junit4]   2> 8165 T2425 oasup.UpdateRequestProcessorChain.init inserting DistributedUpdateProcessorFactory into updateRequestProcessorChain "uniq-fields"
> [junit4:junit4]   2> 8166 T2425 oasup.UpdateRequestProcessorChain.init inserting DistributedUpdateProcessorFactory into updateRequestProcessorChain "distrib-dup-test-chain-implicit"
> [junit4:junit4]   2> 8166 T2425 oasc.RequestHandlers.initHandlersFromConfig adding lazy requestHandler: solr.ReplicationHandler
> [junit4:junit4]   2> 8167 T2425 oasc.RequestHandlers.initHandlersFromConfig created /replication: solr.ReplicationHandler
> [junit4:junit4]   2> 8167 T2425 oasc.RequestHandlers.initHandlersFromConfig created standard: solr.StandardRequestHandler
> [junit4:junit4]   2> 8168 T2425 oasc.RequestHandlers.initHandlersFromConfig created /get: solr.RealTimeGetHandler
> [junit4:junit4]   2> 8168 T2425 oasc.RequestHandlers.initHandlersFromConfig created dismax: solr.SearchHandler
> [junit4:junit4]   2> 8169 T2425 oasc.RequestHandlers.initHandlersFromConfig created mock: org.apache.solr.core.MockQuerySenderListenerReqHandler
> [junit4:junit4]   2> 8169 T2425 oasc.RequestHandlers.initHandlersFromConfig created /admin/: org.apache.solr.handler.admin.AdminHandlers
> [junit4:junit4]   2> 8170 T2425 oasc.RequestHandlers.initHandlersFromConfig created defaults: solr.StandardRequestHandler
> [junit4:junit4]   2> 8170 T2425 oasc.RequestHandlers.initHandlersFromConfig adding lazy requestHandler: solr.StandardRequestHandler
> [junit4:junit4]   2> 8170 T2425 oasc.RequestHandlers.initHandlersFromConfig created lazy: solr.StandardRequestHandler
> [junit4:junit4]   2> 8171 T2425 oasc.RequestHandlers.initHandlersFromConfig created /update: solr.UpdateRequestHandler
> [junit4:junit4]   2> 8171 T2425 oasc.RequestHandlers.initHandlersFromConfig created /terms: org.apache.solr.handler.component.SearchHandler
> [junit4:junit4]   2> 8172 T2425 oasc.RequestHandlers.initHandlersFromConfig created spellCheckCompRH: org.apache.solr.handler.component.SearchHandler
> [junit4:junit4]   2> 8172 T2425 oasc.RequestHandlers.initHandlersFromConfig created spellCheckCompRH_Direct: org.apache.solr.handler.component.SearchHandler
> [junit4:junit4]   2> 8173 T2425 oasc.RequestHandlers.initHandlersFromConfig created spellCheckWithWordbreak: org.apache.solr.handler.component.SearchHandler
> [junit4:junit4]   2> 8173 T2425 oasc.RequestHandlers.initHandlersFromConfig created spellCheckWithWordbreak_Direct: org.apache.solr.handler.component.SearchHandler
> [junit4:junit4]   2> 8174 T2425 oasc.RequestHandlers.initHandlersFromConfig created spellCheckCompRH1: org.apache.solr.handler.component.SearchHandler
> [junit4:junit4]   2> 8174 T2425 oasc.RequestHandlers.initHandlersFromConfig created tvrh: org.apache.solr.handler.component.SearchHandler
> [junit4:junit4]   2> 8175 T2425 oasc.RequestHandlers.initHandlersFromConfig created /mlt: solr.MoreLikeThisHandler
> [junit4:junit4]   2> 8175 T2425 oasc.RequestHandlers.initHandlersFromConfig created /debug/dump: solr.DumpRequestHandler
> [junit4:junit4]   2> 8178 T2425 oashl.XMLLoader.init xsltCacheLifetimeSeconds=60
> [junit4:junit4]   2> 8181 T2425 oasc.SolrCore.initDeprecatedSupport WARNING solrconfig.xml uses deprecated <admin/gettableFiles>, Please update your config to use the ShowFileRequestHandler.
> [junit4:junit4]   2> 8182 T2425 oasc.SolrCore.initDeprecatedSupport WARNING adding ShowFileRequestHandler with hidden files: [SCHEMA.XML, OLD_SYNONYMS.TXT, STOPWORDS.TXT, PROTWORDS.TXT, OPEN-EXCHANGE-RATES.JSON, SYNONYMS.TXT, CURRENCY.XML, MAPPING-ISOLATIN1ACCENT.TXT]
> [junit4:junit4]   2> 8184 T2425 oass.SolrIndexSearcher.<init> Opening Searcher@7a6de317 main
> [junit4:junit4]   2> 8185 T2425 oasu.CommitTracker.<init> Hard AutoCommit: disabled
> [junit4:junit4]   2> 8186 T2425 oasu.CommitTracker.<init> Soft AutoCommit: disabled
> [junit4:junit4]   2> 8186 T2425 oashc.SpellCheckComponent.inform Initializing spell checkers
> [junit4:junit4]   2> 8199 T2425 oass.DirectSolrSpellChecker.init init: {name=direct,classname=DirectSolrSpellChecker,field=lowerfilt,minQueryLength=3}
> [junit4:junit4]   2> 8247 T2486 oasc.SolrCore.registerSearcher [collection1] Registered new searcher Searcher@7a6de317 main{StandardDirectoryReader(segments_1:1)}
> [junit4:junit4]   2> 8393 T2446 oascc.ZkStateReader.updateClusterState Updating cloud state from ZooKeeper... 
> [junit4:junit4]   2> 8412 T2445 oascc.ZkStateReader$2.process A cluster state change has occurred - updating...
> [junit4:junit4]   2> 8412 T2471 oascc.ZkStateReader$2.process A cluster state change has occurred - updating...
> [junit4:junit4]   2> 8412 T2459 oascc.ZkStateReader$2.process A cluster state change has occurred - updating...
> [junit4:junit4]   2> 8412 T2485 oascc.ZkStateReader$2.process A cluster state change has occurred - updating...
> [junit4:junit4]   2> 8752 T2425 oasc.CoreContainer.register registering core: collection1
> [junit4:junit4]   2> 8752 T2425 oasc.ZkController.register Register shard - core:collection1 address:http://127.0.0.1:24670/solr shardId:shard1
> [junit4:junit4]   2> 8756 T2425 oasc.ZkController.register We are http://127.0.0.1:24670/solr/collection1/ and leader is http://127.0.0.1:24653/solr/collection1/
> [junit4:junit4]   2> 8756 T2425 oasc.ZkController.register No LogReplay needed for core=collection1 baseURL=http://127.0.0.1:24670/solr
> [junit4:junit4]   2> 8757 T2425 oasc.ZkController.checkRecovery Core needs to recover:collection1
> [junit4:junit4]   2> 8757 T2425 oasu.DefaultSolrCoreState.doRecovery Running recovery - first canceling any ongoing recovery
> [junit4:junit4]   2> ASYNC  NEW_CORE C51 name=collection1 org.apache.solr.core.SolrCore@b3b5805 url=http://127.0.0.1:24670/solr/collection1 node=127.0.0.1:24670_solr
> [junit4:junit4]   2> 8759 T2487 C51 P24670 oasc.RecoveryStrategy.run Starting recovery process.  core=collection1 recoveringAfterStartup=true
> [junit4:junit4]   2> 8759 T2487 C51 P24670 oasc.RecoveryStrategy.doRecovery ###### startupVersions=[]
> [junit4:junit4]   2> 8759 T2425 oascc.ZkStateReader.updateClusterState Updating cloud state from ZooKeeper... 
> [junit4:junit4]   2> 8767 T2487 C51 P24670 oasc.RecoveryStrategy.doRecovery Attempting to PeerSync from http://127.0.0.1:24653/solr/collection1/ core=collection1 - recoveringAfterStartup=true
> [junit4:junit4]   2> 8767 T2487 C51 P24670 oasu.PeerSync.sync PeerSync: core=collection1 url=http://127.0.0.1:24670/solr START replicas=[http://127.0.0.1:24653/solr/collection1/] nUpdates=100
> [junit4:junit4]   2> 8767 T2425 oass.SolrDispatchFilter.init user.dir=/usr/home/hudson/hudson-slave/workspace/Lucene-Solr-NightlyTests-4.x/solr/build/solr-core/test/J1
> [junit4:junit4]   2> 8768 T2487 C51 P24670 oasu.PeerSync.sync WARNING no frame of reference to tell of we've missed updates
> [junit4:junit4]   2> 8768 T2425 oass.SolrDispatchFilter.init SolrDispatchFilter.init() done
> [junit4:junit4]   2> 8768 T2487 C51 P24670 oasc.RecoveryStrategy.doRecovery PeerSync Recovery was not successful - trying replication. core=collection1
> [junit4:junit4]   2> 8768 T2487 C51 P24670 oasc.RecoveryStrategy.doRecovery Starting Replication Recovery. core=collection1
> [junit4:junit4]   2> 8768 T2425 oascsi.HttpClientUtil.createClient Creating new http client, config:maxConnections=128&maxConnectionsPerHost=32&followRedirects=false
> [junit4:junit4]   2> 8769 T2487 C51 P24670 oascsi.HttpClientUtil.createClient Creating new http client, config:maxConnections=128&maxConnectionsPerHost=32&followRedirects=false
> [junit4:junit4]   2> 8770 T2451 C50 P24653 REQ /get {distrib=false&qt=/get&wt=javabin&version=2&getVersions=100} status=0 QTime=0 
> [junit4:junit4]   2>  C49_STATE=coll:collection1 core:collection1 props:{shard=shard1, roles=null, state=recovering, core=collection1, collection=collection1, node_name=127.0.0.1:24660_solr, base_url=http://127.0.0.1:24660/solr}
> [junit4:junit4]   2> 8892 T2473 C49 P24660 oasc.RecoveryStrategy.doRecovery Begin buffering updates. core=collection1
> [junit4:junit4]   2> 8892 T2473 C49 P24660 oasu.UpdateLog.bufferUpdates Starting to buffer updates. FSUpdateLog{state=ACTIVE, tlog=null}
> [junit4:junit4]   2> 8892 T2473 C49 P24660 oasc.RecoveryStrategy.replicate Attempting to replicate from http://127.0.0.1:24653/solr/collection1/. core=collection1
> [junit4:junit4]   2> 8892 T2473 C49 P24660 oascsi.HttpClientUtil.createClient Creating new http client, config:maxConnections=128&maxConnectionsPerHost=32&followRedirects=false
> [junit4:junit4]   2> 8910 T2454 C50 P24653 oasu.DirectUpdateHandler2.commit start commit{flags=0,_version_=0,optimize=false,openSearcher=true,waitSearcher=true,expungeDeletes=false,softCommit=false}
> [junit4:junit4]   2> 8916 T2454 C50 P24653 oasc.SolrDeletionPolicy.onInit SolrDeletionPolicy.onInit: commits:num=1
> [junit4:junit4]   2> 		commit{dir=NRTCachingDirectory(org.apache.lucene.store.NIOFSDirectory@/usr/home/hudson/hudson-slave/workspace/Lucene-Solr-NightlyTests-4.x/solr/build/solr-core/test/J1/org.apache.solr.cloud.SyncSliceTest-1348435918932/jetty1/index lockFactory=org.apache.lucene.store.NativeFSLockFactory@4ca78915; maxCacheMB=48.0 maxMergeSizeMB=4.0),segFN=segments_1,generation=1,filenames=[segments_1]
> [junit4:junit4]   2> 8916 T2446 oascc.ZkStateReader.updateClusterState Updating cloud state from ZooKeeper... 
> [junit4:junit4]   2> 8916 T2454 C50 P24653 oasc.SolrDeletionPolicy.updateCommits newest commit = 1
> [junit4:junit4]   2> 8917 T2454 C50 P24653 oass.SolrIndexSearcher.<init> Opening Searcher@6d5c362a main
> [junit4:junit4]   2> 8918 T2454 C50 P24653 oasu.DirectUpdateHandler2.commit end_commit_flush
> [junit4:junit4]   2> 8919 T2460 oasc.SolrCore.registerSearcher [collection1] Registered new searcher Searcher@6d5c362a main{StandardDirectoryReader(segments_1:1)}
> [junit4:junit4]   2> 8920 T2454 C50 P24653 /update {waitSearcher=true&commit=true&commit_end_point=true&wt=javabin&softCommit=false&version=2} {commit=} 0 10
> [junit4:junit4]   2> 8920 T2473 C49 P24660 oash.ReplicationHandler.inform Commits will be reserved for  10000
> [junit4:junit4]   2> 8921 T2473 C49 P24660 oash.SnapPuller.<init>  No value set for 'pollInterval'. Timer Task not started.
> [junit4:junit4]   2> 8922 T2455 C50 P24653 oash.ReplicationHandler.inform Commits will be reserved for  10000
> [junit4:junit4]   2> 8923 T2455 C50 P24653 REQ /replication {command=indexversion&wt=javabin&qt=/replication&version=2} status=0 QTime=2 
> [junit4:junit4]   2> 8927 T2473 C49 P24660 oasc.SolrDeletionPolicy.onInit SolrDeletionPolicy.onInit: commits:num=1
> [junit4:junit4]   2> 		commit{dir=NRTCachingDirectory(org.apache.lucene.store.NIOFSDirectory@/usr/home/hudson/hudson-slave/workspace/Lucene-Solr-NightlyTests-4.x/solr/build/solr-core/test/J1/org.apache.solr.cloud.SyncSliceTest-1348435918932/jetty2/index lockFactory=org.apache.lucene.store.NativeFSLockFactory@8fe234b; maxCacheMB=48.0 maxMergeSizeMB=4.0),segFN=segments_1,generation=1,filenames=[segments_1]
> [junit4:junit4]   2> 8928 T2473 C49 P24660 oasc.SolrDeletionPolicy.updateCommits newest commit = 1
> [junit4:junit4]   2> 8928 T2473 C49 P24660 oasu.DirectUpdateHandler2.commit start commit{flags=0,_version_=0,optimize=false,openSearcher=true,waitSearcher=true,expungeDeletes=false,softCommit=false}
> [junit4:junit4]   2> 8934 T2471 oascc.ZkStateReader$2.process A cluster state change has occurred - updating...
> [junit4:junit4]   2> 8934 T2485 oascc.ZkStateReader$2.process A cluster state change has occurred - updating...
> [junit4:junit4]   2> 8934 T2459 oascc.ZkStateReader$2.process A cluster state change has occurred - updating...
> [junit4:junit4]   2> 8934 T2445 oascc.ZkStateReader$2.process A cluster state change has occurred - updating...
> [junit4:junit4]   2> 8935 T2473 C49 P24660 oasc.SolrDeletionPolicy.onCommit SolrDeletionPolicy.onCommit: commits:num=2
> [junit4:junit4]   2> 		commit{dir=NRTCachingDirectory(org.apache.lucene.store.NIOFSDirectory@/usr/home/hudson/hudson-slave/workspace/Lucene-Solr-NightlyTests-4.x/solr/build/solr-core/test/J1/org.apache.solr.cloud.SyncSliceTest-1348435918932/jetty2/index lockFactory=org.apache.lucene.store.NativeFSLockFactory@8fe234b; maxCacheMB=48.0 maxMergeSizeMB=4.0),segFN=segments_1,generation=1,filenames=[segments_1]
> [junit4:junit4]   2> 		commit{dir=NRTCachingDirectory(org.apache.lucene.store.NIOFSDirectory@/usr/home/hudson/hudson-slave/workspace/Lucene-Solr-NightlyTests-4.x/solr/build/solr-core/test/J1/org.apache.solr.cloud.SyncSliceTest-1348435918932/jetty2/index lockFactory=org.apache.lucene.store.NativeFSLockFactory@8fe234b; maxCacheMB=48.0 maxMergeSizeMB=4.0),segFN=segments_2,generation=2,filenames=[segments_2]
> [junit4:junit4]   2> 8936 T2473 C49 P24660 oasc.SolrDeletionPolicy.updateCommits newest commit = 2
> [junit4:junit4]   2> 8941 T2473 C49 P24660 oass.SolrIndexSearcher.<init> Opening Searcher@7bd0119e main
> [junit4:junit4]   2> 8942 T2473 C49 P24660 oasu.DirectUpdateHandler2.commit end_commit_flush
> [junit4:junit4]   2> 8943 T2472 oasc.SolrCore.registerSearcher [collection1] Registered new searcher Searcher@7bd0119e main{StandardDirectoryReader(segments_2:2)}
> [junit4:junit4]   2> 8947 T2473 C49 P24660 oasc.RecoveryStrategy.replay No replay needed. core=collection1
> [junit4:junit4]   2> 8947 T2473 C49 P24660 oasc.RecoveryStrategy.doRecovery Replication Recovery was successful - registering as Active. core=collection1
> [junit4:junit4]   2> 8948 T2473 C49 P24660 oasc.RecoveryStrategy.doRecovery Finished recovery process. core=collection1
> [junit4:junit4]   2> 9438 T2446 oascc.ZkStateReader.updateClusterState Updating cloud state from ZooKeeper... 
> [junit4:junit4]   2> 9535 T2445 oascc.ZkStateReader$2.process A cluster state change has occurred - updating...
> [junit4:junit4]   2> 9535 T2485 oascc.ZkStateReader$2.process A cluster state change has occurred - updating...
> [junit4:junit4]   2> 9535 T2459 oascc.ZkStateReader$2.process A cluster state change has occurred - updating...
> [junit4:junit4]   2> 9535 T2471 oascc.ZkStateReader$2.process A cluster state change has occurred - updating...
> [junit4:junit4]   2> 9623 T2425 oejs.Server.doStart jetty-8.1.2.v20120308
> [junit4:junit4]   2> 9626 T2425 oejs.AbstractConnector.doStart Started SocketConnector@0.0.0.0:24682
> [junit4:junit4]   2> 9627 T2425 oasc.SolrResourceLoader.locateSolrHome JNDI not configured for solr (NoInitialContextEx)
> [junit4:junit4]   2> 9628 T2425 oasc.SolrResourceLoader.locateSolrHome using system property solr.solr.home: /usr/home/hudson/hudson-slave/workspace/Lucene-Solr-NightlyTests-4.x/solr/build/solr-core/test/J1/./solrtest-jetty4-1348435927715
> [junit4:junit4]   2> 9628 T2425 oasc.SolrResourceLoader.<init> new SolrResourceLoader for deduced Solr Home: '/usr/home/hudson/hudson-slave/workspace/Lucene-Solr-NightlyTests-4.x/solr/build/solr-core/test/J1/./solrtest-jetty4-1348435927715/'
> [junit4:junit4]   2> 9671 T2425 oass.SolrDispatchFilter.init SolrDispatchFilter.init()
> [junit4:junit4]   2> 9672 T2425 oasc.SolrResourceLoader.locateSolrHome JNDI not configured for solr (NoInitialContextEx)
> [junit4:junit4]   2> 9673 T2425 oasc.SolrResourceLoader.locateSolrHome using system property solr.solr.home: /usr/home/hudson/hudson-slave/workspace/Lucene-Solr-NightlyTests-4.x/solr/build/solr-core/test/J1/./solrtest-jetty4-1348435927715
> [junit4:junit4]   2> 9673 T2425 oasc.CoreContainer$Initializer.initialize looking for solr.xml: /usr/home/hudson/hudson-slave/workspace/Lucene-Solr-NightlyTests-4.x/solr/build/solr-core/test/J1/./solrtest-jetty4-1348435927715/solr.xml
> [junit4:junit4]   2> 9673 T2425 oasc.CoreContainer.<init> New CoreContainer 752818466
> [junit4:junit4]   2> 9674 T2425 oasc.CoreContainer.load Loading CoreContainer using Solr Home: '/usr/home/hudson/hudson-slave/workspace/Lucene-Solr-NightlyTests-4.x/solr/build/solr-core/test/J1/./solrtest-jetty4-1348435927715/'
> [junit4:junit4]   2> 9675 T2425 oasc.SolrResourceLoader.<init> new SolrResourceLoader for directory: '/usr/home/hudson/hudson-slave/workspace/Lucene-Solr-NightlyTests-4.x/solr/build/solr-core/test/J1/./solrtest-jetty4-1348435927715/'
> [junit4:junit4]   2> 9703 T2425 oasc.CoreContainer.load Registering Log Listener
> [junit4:junit4]   2> 9720 T2425 oasc.CoreContainer.initZooKeeper Zookeeper client=127.0.0.1:24639/solr
> [junit4:junit4]   2> 9720 T2425 oaz.ZooKeeper.<init> Initiating client connection, connectString=127.0.0.1:24639/solr sessionTimeout=5000 watcher=org.apache.solr.common.cloud.ConnectionManager@720b59cd
> [junit4:junit4]   2> 9721 T2498 oaz.ClientCnxn$SendThread.startConnect Opening socket connection to server /127.0.0.1:24639
> [junit4:junit4]   2> 9721 T2425 oascc.ConnectionManager.waitForConnected Waiting for client to connect to ZooKeeper
> [junit4:junit4]   2> 9723 T2498 oaz.ClientCnxn$SendThread.primeConnection Socket connection established to localhost/127.0.0.1:24639, initiating session
> [junit4:junit4]   2> 9723 T2427 oazs.NIOServerCnxn$Factory.run Accepted socket connection from /140.211.11.196:24683
> [junit4:junit4]   2> 9723 T2427 oazs.NIOServerCnxn.readConnectRequest Client attempting to establish new session at /140.211.11.196:24683
> [junit4:junit4]   2> 9727 T2429 oazs.NIOServerCnxn.finishSessionInit Established session 0x139f50b40590006 with negotiated timeout 5000 for client /140.211.11.196:24683
> [junit4:junit4]   2> 9727 T2498 oaz.ClientCnxn$SendThread.readConnectResult Session establishment complete on server localhost/127.0.0.1:24639, sessionid = 0x139f50b40590006, negotiated timeout = 5000
> [junit4:junit4]   2> 9728 T2499 oascc.ConnectionManager.process Watcher org.apache.solr.common.cloud.ConnectionManager@720b59cd name:ZooKeeperConnection Watcher:127.0.0.1:24639/solr got event WatchedEvent state:SyncConnected type:None path:null path:null type:None
> [junit4:junit4]   2> 9728 T2425 oascc.ConnectionManager.waitForConnected Client is connected to ZooKeeper
> [junit4:junit4]   2> 9729 T2430 oazs.PrepRequestProcessor.pRequest Got user-level KeeperException when processing sessionid:0x139f50b40590006 type:create cxid:0x1 zxid:0xfffffffffffffffe txntype:unknown reqpath:n/a Error Path:/solr/overseer Error:KeeperErrorCode = NodeExists for /solr/overseer
> [junit4:junit4]   2> 9730 T2430 oazs.PrepRequestProcessor.pRequest Got user-level KeeperException when processing sessionid:0x139f50b40590006 type:create cxid:0x2 zxid:0xfffffffffffffffe txntype:unknown reqpath:n/a Error Path:/solr/overseer Error:KeeperErrorCode = NodeExists for /solr/overseer
> [junit4:junit4]   2> 9757 T2425 oasc.ZkController.createEphemeralLiveNode Register node as live in ZooKeeper:/live_nodes/127.0.0.1:24682_solr
> [junit4:junit4]   2> 9758 T2430 oazs.PrepRequestProcessor.pRequest Got user-level KeeperException when processing sessionid:0x139f50b40590006 type:delete cxid:0x4 zxid:0xfffffffffffffffe txntype:unknown reqpath:n/a Error Path:/solr/live_nodes/127.0.0.1:24682_solr Error:KeeperErrorCode = NoNode for /solr/live_nodes/127.0.0.1:24682_solr
> [junit4:junit4]   2> 9759 T2425 oascc.SolrZkClient.makePath makePath: /live_nodes/127.0.0.1:24682_solr
> [junit4:junit4]   2> 9797 T2445 oascc.ZkStateReader$3.process Updating live nodes
> [junit4:junit4]   2> 9797 T2485 oascc.ZkStateReader$3.process Updating live nodes
> [junit4:junit4]   2> 9797 T2471 oascc.ZkStateReader$3.process Updating live nodes
> [junit4:junit4]   2> 9797 T2459 oascc.ZkStateReader$3.process Updating live nodes
> [junit4:junit4]   2> 9798 T2425 oashc.HttpShardHandlerFactory.getParameter Setting socketTimeout to: 0
> [junit4:junit4]   2> 9799 T2425 oashc.HttpShardHandlerFactory.getParameter Setting urlScheme to: http://
> [junit4:junit4]   2> 9799 T2425 oashc.HttpShardHandlerFactory.getParameter Setting connTimeout to: 0
> [junit4:junit4]   2> 9799 T2425 oashc.HttpShardHandlerFactory.getParameter Setting maxConnectionsPerHost to: 20
> [junit4:junit4]   2> 9800 T2425 oashc.HttpShardHandlerFactory.getParameter Setting corePoolSize to: 0
> [junit4:junit4]   2> 9800 T2425 oashc.HttpShardHandlerFactory.getParameter Setting maximumPoolSize to: 2147483647
> [junit4:junit4]   2> 9801 T2425 oashc.HttpShardHandlerFactory.getParameter Setting maxThreadIdleTime to: 5
> [junit4:junit4]   2> 9801 T2425 oashc.HttpShardHandlerFactory.getParameter Setting sizeOfQueue to: -1
> [junit4:junit4]   2> 9802 T2425 oashc.HttpShardHandlerFactory.getParameter Setting fairnessPolicy to: false
> [junit4:junit4]   2> 9802 T2425 oascsi.HttpClientUtil.createClient Creating new http client, config:maxConnectionsPerHost=20&maxConnections=10000&socketTimeout=0&connTimeout=0&retry=false
> [junit4:junit4]   2> 9832 T2425 oascc.ZkStateReader.createClusterStateWatchersAndUpdate Updating cluster state from ZooKeeper... 
> [junit4:junit4]   2> 9839 T2425 oasc.CoreContainer.create Creating SolrCore 'collection1' using instanceDir: /usr/home/hudson/hudson-slave/workspace/Lucene-Solr-NightlyTests-4.x/solr/build/solr-core/test/J1/./solrtest-jetty4-1348435927715/collection1
> [junit4:junit4]   2> 9839 T2425 oasc.ZkController.createCollectionZkNode Check for collection zkNode:collection1
> [junit4:junit4]   2> 9840 T2425 oasc.ZkController.createCollectionZkNode Collection zkNode exists
> [junit4:junit4]   2> 9840 T2425 oasc.ZkController.readConfigName Load collection config from:/collections/collection1
> [junit4:junit4]   2> 9842 T2425 oasc.SolrResourceLoader.<init> new SolrResourceLoader for directory: '/usr/home/hudson/hudson-slave/workspace/Lucene-Solr-NightlyTests-4.x/solr/build/solr-core/test/J1/./solrtest-jetty4-1348435927715/collection1/'
> [junit4:junit4]   2> 9843 T2425 oasc.SolrResourceLoader.replaceClassLoader Adding 'file:/usr/home/hudson/hudson-slave/workspace/Lucene-Solr-NightlyTests-4.x/solr/build/solr-core/test/J1/solrtest-jetty4-1348435927715/collection1/lib/README' to classloader
> [junit4:junit4]   2> 9844 T2425 oasc.SolrResourceLoader.replaceClassLoader Adding 'file:/usr/home/hudson/hudson-slave/workspace/Lucene-Solr-NightlyTests-4.x/solr/build/solr-core/test/J1/solrtest-jetty4-1348435927715/collection1/lib/classes/' to classloader
> [junit4:junit4]   2> 9900 T2425 oasc.SolrConfig.<init> Using Lucene MatchVersion: LUCENE_41
> [junit4:junit4]   2> 9975 T2425 oasc.SolrConfig.<init> Loaded SolrConfig: solrconfig.xml
> [junit4:junit4]   2> 10076 T2425 oass.IndexSchema.readSchema Reading Solr Schema
> [junit4:junit4]   2> 10081 T2425 oass.IndexSchema.readSchema Schema name=test
> [junit4:junit4]   2> 10647 T2425 oass.OpenExchangeRatesOrgProvider.init Initialized with rates=open-exchange-rates.json, refreshInterval=1440.
> [junit4:junit4]   2> 10656 T2425 oass.IndexSchema.readSchema default search field in schema is text
> [junit4:junit4]   2> 10658 T2425 oass.IndexSchema.readSchema unique key field: id
> [junit4:junit4]   2> 10667 T2425 oass.FileExchangeRateProvider.reload Reloading exchange rates from file currency.xml
> [junit4:junit4]   2> 10671 T2425 oass.FileExchangeRateProvider.reload Reloading exchange rates from file currency.xml
> [junit4:junit4]   2> 10674 T2425 oass.OpenExchangeRatesOrgProvider.reload Reloading exchange rates from open-exchange-rates.json
> [junit4:junit4]   2> 10675 T2425 oass.OpenExchangeRatesOrgProvider.reload Reloading exchange rates from open-exchange-rates.json
> [junit4:junit4]   2> 10676 T2425 oasc.SolrCore.<init> [collection1] Opening new SolrCore at /usr/home/hudson/hudson-slave/workspace/Lucene-Solr-NightlyTests-4.x/solr/build/solr-core/test/J1/./solrtest-jetty4-1348435927715/collection1/, dataDir=./org.apache.solr.cloud.SyncSliceTest-1348435918932/jetty4/
> [junit4:junit4]   2> 10676 T2425 oasc.JmxMonitoredMap.<init> JMX monitoring is enabled. Adding Solr mbeans to JMX Server: com.sun.jmx.mbeanserver.JmxMBeanServer@785e8d7d
> [junit4:junit4]   2> 10677 T2425 oasc.SolrCore.getNewIndexDir WARNING New index directory detected: old=null new=./org.apache.solr.cloud.SyncSliceTest-1348435918932/jetty4/index/
> [junit4:junit4]   2> 10678 T2425 oasc.SolrCore.initIndex WARNING [collection1] Solr index directory './org.apache.solr.cloud.SyncSliceTest-1348435918932/jetty4/index' doesn't exist. Creating new index...
> [junit4:junit4]   2> 10678 T2425 oasc.CachingDirectoryFactory.get return new directory for /usr/home/hudson/hudson-slave/workspace/Lucene-Solr-NightlyTests-4.x/solr/build/solr-core/test/J1/./org.apache.solr.cloud.SyncSliceTest-1348435918932/jetty4/index forceNew:false
> [junit4:junit4]   2> 10683 T2425 oasc.SolrDeletionPolicy.onCommit SolrDeletionPolicy.onCommit: commits:num=1
> [junit4:junit4]   2> 		commit{dir=NRTCachingDirectory(org.apache.lucene.store.NIOFSDirectory@/usr/home/hudson/hudson-slave/workspace/Lucene-Solr-NightlyTests-4.x/solr/build/solr-core/test/J1/org.apache.solr.cloud.SyncSliceTest-1348435918932/jetty4/index lockFactory=org.apache.lucene.store.NativeFSLockFactory@51b4af2c; maxCacheMB=48.0 maxMergeSizeMB=4.0),segFN=segments_1,generation=1,filenames=[segments_1]
> [junit4:junit4]   2> 10683 T2425 oasc.SolrDeletionPolicy.updateCommits newest commit = 1
> [junit4:junit4]   2> 10684 T2425 oasc.SolrCore.initWriters created xml: solr.XMLResponseWriter
> [junit4:junit4]   2> 10686 T2425 oasup.UpdateRequestProcessorChain.init inserting DistributedUpdateProcessorFactory into updateRequestProcessorChain "dedupe"
> [junit4:junit4]   2> 10686 T2425 oasup.UpdateRequestProcessorChain.init inserting DistributedUpdateProcessorFactory into updateRequestProcessorChain "dedupe-allfields"
> [junit4:junit4]   2> 10687 T2425 oasup.UpdateRequestProcessorChain.init inserting DistributedUpdateProcessorFactory into updateRequestProcessorChain "stored_sig"
> [junit4:junit4]   2> 10687 T2425 oasup.UpdateRequestProcessorChain.init inserting DistributedUpdateProcessorFactory into updateRequestProcessorChain "uniq-fields"
> [junit4:junit4]   2> 10687 T2425 oasup.UpdateRequestProcessorChain.init inserting DistributedUpdateProcessorFactory into updateRequestProcessorChain "distrib-dup-test-chain-implicit"
> [junit4:junit4]   2> 10688 T2425 oasc.RequestHandlers.initHandlersFromConfig adding lazy requestHandler: solr.ReplicationHandler
> [junit4:junit4]   2> 10688 T2425 oasc.RequestHandlers.initHandlersFromConfig created /replication: solr.ReplicationHandler
> [junit4:junit4]   2> 10689 T2425 oasc.RequestHandlers.initHandlersFromConfig created standard: solr.StandardRequestHandler
> [junit4:junit4]   2> 10689 T2425 oasc.RequestHandlers.initHandlersFromConfig created /get: solr.RealTimeGetHandler
> [junit4:junit4]   2> 10690 T2425 oasc.RequestHandlers.initHandlersFromConfig created dismax: solr.SearchHandler
> [junit4:junit4]   2> 10690 T2425 oasc.RequestHandlers.initHandlersFromConfig created mock: org.apache.solr.core.MockQuerySenderListenerReqHandler
> [junit4:junit4]   2> 10691 T2425 oasc.RequestHandlers.initHandlersFromConfig created /admin/: org.apache.solr.handler.admin.AdminHandlers
> [junit4:junit4]   2> 10691 T2425 oasc.RequestHandlers.initHandlersFromConfig created defaults: solr.StandardRequestHandler
> [junit4:junit4]   2> 10691 T2425 oasc.RequestHandlers.initHandlersFromConfig adding lazy requestHandler: solr.StandardRequestHandler
> [junit4:junit4]   2> 10692 T2425 oasc.RequestHandlers.initHandlersFromConfig created lazy: solr.StandardRequestHandler
> [junit4:junit4]   2> 10692 T2425 oasc.RequestHandlers.initHandlersFromConfig created /update: solr.UpdateRequestHandler
> [junit4:junit4]   2> 10693 T2425 oasc.RequestHandlers.initHandlersFromConfig created /terms: org.apache.solr.handler.component.SearchHandler
> [junit4:junit4]   2> 10693 T2425 oasc.RequestHandlers.initHandlersFromConfig created spellCheckCompRH: org.apache.solr.handler.component.SearchHandler
> [junit4:junit4]   2> 10694 T2425 oasc.RequestHandlers.initHandlersFromConfig created spellCheckCompRH_Direct: org.apache.solr.handler.component.SearchHandler
> [junit4:junit4]   2> 10694 T2425 oasc.RequestHandlers.initHandlersFromConfig created spellCheckWithWordbreak: org.apache.solr.handler.component.SearchHandler
> [junit4:junit4]   2> 10695 T2425 oasc.RequestHandlers.initHandlersFromConfig created spellCheckWithWordbreak_Direct: org.apache.solr.handler.component.SearchHandler
> [junit4:junit4]   2> 10695 T2425 oasc.RequestHandlers.initHandlersFromConfig created spellCheckCompRH1: org.apache.solr.handler.component.SearchHandler
> [junit4:junit4]   2> 10695 T2425 oasc.RequestHandlers.initHandlersFromConfig created tvrh: org.apache.solr.handler.component.SearchHandler
> [junit4:junit4]   2> 10696 T2425 oasc.RequestHandlers.initHandlersFromConfig created /mlt: solr.MoreLikeThisHandler
> [junit4:junit4]   2> 10696 T2425 oasc.RequestHandlers.initHandlersFromConfig created /debug/dump: solr.DumpRequestHandler
> [junit4:junit4]   2> 10699 T2425 oashl.XMLLoader.init xsltCacheLifetimeSeconds=60
> [junit4:junit4]   2> 10702 T2425 oasc.SolrCore.initDeprecatedSupport WARNING solrconfig.xml uses deprecated <admin/gettableFiles>, Please update your config to use the ShowFileRequestHandler.
> [junit4:junit4]   2> 10703 T2425 oasc.SolrCore.initDeprecatedSupport WARNING adding ShowFileRequestHandler with hidden files: [SCHEMA.XML, OLD_SYNONYMS.TXT, STOPWORDS.TXT, PROTWORDS.TXT, OPEN-EXCHANGE-RATES.JSON, SYNONYMS.TXT, CURRENCY.XML, MAPPING-ISOLATIN1ACCENT.TXT]
> [junit4:junit4]   2> 10705 T2425 oass.SolrIndexSearcher.<init> Opening Searcher@5fc9f555 main
> [junit4:junit4]   2> 10706 T2425 oasu.CommitTracker.<init> Hard AutoCommit: disabled
> [junit4:junit4]   2> 10706 T2425 oasu.CommitTracker.<init> Soft AutoCommit: disabled
> [junit4:junit4]   2> 10707 T2425 oashc.SpellCheckComponent.inform Initializing spell checkers
> [junit4:junit4]   2> 10712 T2425 oass.DirectSolrSpellChecker.init init: {name=direct,classname=DirectSolrSpellChecker,field=lowerfilt,minQueryLength=3}
> [junit4:junit4]   2> 10755 T2500 oasc.SolrCore.registerSearcher [collection1] Registered new searcher Searcher@5fc9f555 main{StandardDirectoryReader(segments_1:1)}
> [junit4:junit4]   2> 11064 T2446 oascc.ZkStateReader.updateClusterState Updating cloud state from ZooKeeper... 
> [junit4:junit4]   2> 11079 T2499 oascc.ZkStateReader$2.process A cluster state change has occurred - updating...
> [junit4:junit4]   2> 11079 T2445 oascc.ZkStateReader$2.process A cluster state change has occurred - updating...
> [junit4:junit4]   2> 11079 T2471 oascc.ZkStateReader$2.process A cluster state change has occurred - updating...
> [junit4:junit4]   2> 11079 T2459 oascc.ZkStateReader$2.process A cluster state change has occurred - updating...
> [junit4:junit4]   2> 11079 T2485 oascc.ZkStateReader$2.process A cluster state change has occurred - updating...
> [junit4:junit4]   2> 11260 T2425 oasc.CoreContainer.register registering core: collection1
> [junit4:junit4]   2> 11260 T2425 oasc.ZkController.register Register shard - core:collection1 address:http://127.0.0.1:24682/solr shardId:shard1
> [junit4:junit4]   2> 11264 T2425 oasc.ZkController.register We are http://127.0.0.1:24682/solr/collection1/ and leader is http://127.0.0.1:24653/solr/collection1/
> [junit4:junit4]   2> 11264 T2425 oasc.ZkController.register No LogReplay needed for core=collection1 baseURL=http://127.0.0.1:24682/solr
> [junit4:junit4]   2> 11264 T2425 oasc.ZkController.checkRecovery Core needs to recover:collection1
> [junit4:junit4]   2> 11265 T2425 oasu.DefaultSolrCoreState.doRecovery Running recovery - first canceling any ongoing recovery
> [junit4:junit4]   2> ASYNC  NEW_CORE C52 name=collection1 org.apache.solr.core.SolrCore@67b1dc31 url=http://127.0.0.1:24682/solr/collection1 node=127.0.0.1:24682_solr
> [junit4:junit4]   2> 11266 T2501 C52 P24682 oasc.RecoveryStrategy.run Starting recovery process.  core=collection1 recoveringAfterStartup=true
> [junit4:junit4]   2> 11266 T2501 C52 P24682 oasc.RecoveryStrategy.doRecovery ###### startupVersions=[]
> [junit4:junit4]   2> 11266 T2425 oascc.ZkStateReader.updateClusterState Updating cloud state from ZooKeeper... 
> [junit4:junit4]   2> 11276 T2501 C52 P24682 oasc.RecoveryStrategy.doRecovery Attempting to PeerSync from http://127.0.0.1:24653/solr/collection1/ core=collection1 - recoveringAfterStartup=true
> [junit4:junit4]   2> 11277 T2501 C52 P24682 oasu.PeerSync.sync PeerSync: core=collection1 url=http://127.0.0.1:24682/solr START replicas=[http://127.0.0.1:24653/solr/collection1/] nUpdates=100
> [junit4:junit4]   2> 11277 T2501 C52 P24682 oasu.PeerSync.sync WARNING no frame of reference to tell of we've missed updates
> [junit4:junit4]   2> 11277 T2425 oass.SolrDispatchFilter.init user.dir=/usr/home/hudson/hudson-slave/workspace/Lucene-Solr-NightlyTests-4.x/solr/build/solr-core/test/J1
> [junit4:junit4]   2> 11277 T2501 C52 P24682 oasc.RecoveryStrategy.doRecovery PeerSync Recovery was not successful - trying replication. core=collection1
> [junit4:junit4]   2> 11278 T2501 C52 P24682 oasc.RecoveryStrategy.doRecovery Starting Replication Recovery. core=collection1
> [junit4:junit4]   2> 11277 T2425 oass.SolrDispatchFilter.init SolrDispatchFilter.init() done
> [junit4:junit4]   2> 11278 T2501 C52 P24682 oascsi.HttpClientUtil.createClient Creating new http client, config:maxConnections=128&maxConnectionsPerHost=32&followRedirects=false
> [junit4:junit4]   2> 11278 T2425 oascsi.HttpClientUtil.createClient Creating new http client, config:maxConnections=128&maxConnectionsPerHost=32&followRedirects=false
> [junit4:junit4]   2> 11279 T2451 C50 P24653 REQ /get {distrib=false&qt=/get&wt=javabin&version=2&getVersions=100} status=0 QTime=0 
> [junit4:junit4]   2> 11583 T2446 oascc.ZkStateReader.updateClusterState Updating cloud state from ZooKeeper... 
> [junit4:junit4]   2> 11588 T2445 oascc.ZkStateReader$2.process A cluster state change has occurred - updating...
> [junit4:junit4]   2> 11588 T2459 oascc.ZkStateReader$2.process A cluster state change has occurred - updating...
> [junit4:junit4]   2> 11588 T2485 oascc.ZkStateReader$2.process A cluster state change has occurred - updating...
> [junit4:junit4]   2> 11588 T2471 oascc.ZkStateReader$2.process A cluster state change has occurred - updating...
> [junit4:junit4]   2> 11588 T2499 oascc.ZkStateReader$2.process A cluster state change has occurred - updating...
> [junit4:junit4]   2>  C51_STATE=coll:collection1 core:collection1 props:{shard=shard1, roles=null, state=recovering, core=collection1, collection=collection1, node_name=127.0.0.1:24670_solr, base_url=http://127.0.0.1:24670/solr}
> [junit4:junit4]   2> 11793 T2487 C51 P24670 oasc.RecoveryStrategy.doRecovery Begin buffering updates. core=collection1
> [junit4:junit4]   2> 11793 T2487 C51 P24670 oasu.UpdateLog.bufferUpdates Starting to buffer updates. FSUpdateLog{state=ACTIVE, tlog=null}
> [junit4:junit4]   2> 11793 T2487 C51 P24670 oasc.RecoveryStrategy.replicate Attempting to replicate from http://127.0.0.1:24653/solr/collection1/. core=collection1
> [junit4:junit4]   2> 11793 T2487 C51 P24670 oascsi.HttpClientUtil.createClient Creating new http client, config:maxConnections=128&maxConnectionsPerHost=32&followRedirects=false
> [junit4:junit4]   2> 11809 T2457 C50 P24653 oasu.DirectUpdateHandler2.commit start commit{flags=0,_version_=0,optimize=false,openSearcher=true,waitSearcher=true,expungeDeletes=false,softCommit=false}
> [junit4:junit4]   2> 11813 T2457 C50 P24653 oass.SolrIndexSearcher.<init> Opening Searcher@1ad01aeb main
> [junit4:junit4]   2> 11814 T2457 C50 P24653 oasu.DirectUpdateHandler2.commit end_commit_flush
> [junit4:junit4]   2> 11815 T2460 oasc.SolrCore.registerSearcher [collection1] Registered new searcher Searcher@1ad01aeb main{StandardDirectoryReader(segments_1:1)}
> [junit4:junit4]   2> 11815 T2457 C50 P24653 /update {waitSearcher=true&commit=true&commit_end_point=true&wt=javabin&softCommit=false&version=2} {commit=} 0 6
> [junit4:junit4]   2> 11816 T2487 C51 P24670 oash.ReplicationHandler.inform Commits will be reserved for  10000
> [junit4:junit4]   2> 11817 T2487 C51 P24670 oash.SnapPuller.<init>  No value set for 'pollInterval'. Timer Task not started.
> [junit4:junit4]   2> 11819 T2455 C50 P24653 REQ /replication {command=indexversion&wt=javabin&qt=/replication&version=2} status=0 QTime=0 
> [junit4:junit4]   2> 11824 T2487 C51 P24670 oasc.SolrDeletionPolicy.onInit SolrDeletionPolicy.onInit: commits:num=1
> [junit4:junit4]   2> 		commit{dir=NRTCachingDirectory(org.apache.lucene.store.NIOFSDirectory@/usr/home/hudson/hudson-slave/workspace/Lucene-Solr-NightlyTests-4.x/solr/build/solr-core/test/J1/org.apache.solr.cloud.SyncSliceTest-1348435918932/jetty3/index lockFactory=org.apache.lucene.store.NativeFSLockFactory@28c73b0; maxCacheMB=48.0 maxMergeSizeMB=4.0),segFN=segments_1,generation=1,filenames=[segments_1]
> [junit4:junit4]   2> 11825 T2487 C51 P24670 oasc.SolrDeletionPolicy.updateCommits newest commit = 1
> [junit4:junit4]   2> 11825 T2487 C51 P24670 oasu.DirectUpdateHandler2.commit start commit{flags=0,_version_=0,optimize=false,openSearcher=true,waitSearcher=true,expungeDeletes=false,softCommit=false}
> [junit4:junit4]   2> 11830 T2487 C51 P24670 oasc.SolrDeletionPolicy.onCommit SolrDeletionPolicy.onCommit: commits:num=2
> [junit4:junit4]   2> 		commit{dir=NRTCachingDirectory(org.apache.lucene.store.NIOFSDirectory@/usr/home/hudson/hudson-slave/workspace/Lucene-Solr-NightlyTests-4.x/solr/build/solr-core/test/J1/org.apache.solr.cloud.SyncSliceTest-1348435918932/jetty3/index lockFactory=org.apache.lucene.store.NativeFSLockFactory@28c73b0; maxCacheMB=48.0 maxMergeSizeMB=4.0),segFN=segments_1,generation=1,filenames=[segments_1]
> [junit4:junit4]   2> 		commit{dir=NRTCachingDirectory(org.apache.lucene.store.NIOFSDirectory@/usr/home/hudson/hudson-slave/workspace/Lucene-Solr-NightlyTests-4.x/solr/build/solr-core/test/J1/org.apache.solr.cloud.SyncSliceTest-1348435918932/jetty3/index lockFactory=org.apache.lucene.store.NativeFSLockFactory@28c73b0; maxCacheMB=48.0 maxMergeSizeMB=4.0),segFN=segments_2,generation=2,filenames=[segments_2]
> [junit4:junit4]   2> 11830 T2487 C51 P24670 oasc.SolrDeletionPolicy.updateCommits newest commit = 2
> [junit4:junit4]   2> 11834 T2487 C51 P24670 oass.SolrIndexSearcher.<init> Opening Searcher@4e21b11 main
> [junit4:junit4]   2> 11834 T2487 C51 P24670 oasu.DirectUpdateHandler2.commit end_commit_flush
> [junit4:junit4]   2> 11836 T2486 oasc.SolrCore.registerSearcher [collection1] Registered new searcher Searcher@4e21b11 main{StandardDirectoryReader(segments_2:2)}
> [junit4:junit4]   2> 11836 T2487 C51 P24670 oasc.RecoveryStrategy.replay No replay needed. core=collection1
> [junit4:junit4]   2> 11836 T2487 C51 P24670 oasc.RecoveryStrategy.doRecovery Replication Recovery was successful - registering as Active. core=collection1
> [junit4:junit4]   2> 11838 T2487 C51 P24670 oasc.RecoveryStrategy.doRecovery Finished recovery process. core=collection1
> [junit4:junit4]   2> 12032 T2425 oejs.Server.doStart jetty-8.1.2.v20120308
> [junit4:junit4]   2> 12035 T2425 oejs.AbstractConnector.doStart Started SocketConnector@0.0.0.0:24691
> [junit4:junit4]   2> 12035 T2425 oasc.SolrResourceLoader.locateSolrHome JNDI not configured for solr (NoInitialContextEx)
> [junit4:junit4]   2> 12036 T2425 oasc.SolrResourceLoader.locateSolrHome using system property solr.solr.home: /usr/home/hudson/hudson-slave/workspace/Lucene-Solr-NightlyTests-4.x/solr/build/solr-core/test/J1/./solrtest-jetty5-1348435930219
> [junit4:junit4]   2> 12036 T2425 oasc.SolrResourceLoader.<init> new SolrResourceLoader for deduced Solr Home: '/usr/home/hudson/hudson-slave/workspace/Lucene-Solr-NightlyTests-4.x/solr/build/solr-core/test/J1/./solrtest-jetty5-1348435930219/'
> [junit4:junit4]   2> 12070 T2425 oass.SolrDispatchFilter.init SolrDispatchFilter.init()
> [junit4:junit4]   2> 12071 T2425 oasc.SolrResourceLoader.locateSolrHome JNDI not configured for solr (NoInitialContextEx)
> [junit4:junit4]   2> 12071 T2425 oasc.SolrResourceLoader.locateSolrHome using system property solr.solr.home: /usr/home/hudson/hudson-slave/workspace/Lucene-Solr-NightlyTests-4.x/solr/build/solr-core/test/J1/./solrtest-jetty5-1348435930219
> [junit4:junit4]   2> 12072 T2425 oasc.CoreContainer$Initializer.initialize looking for solr.xml: /usr/home/hudson/hudson-slave/workspace/Lucene-Solr-NightlyTests-4.x/solr/build/solr-core/test/J1/./solrtest-jetty5-1348435930219/solr.xml
> [junit4:junit4]   2> 12072 T2425 oasc.CoreContainer.<init> New CoreContainer 2013673854
> [junit4:junit4]   2> 12073 T2425 oasc.CoreContainer.load Loading CoreContainer using Solr Home: '/usr/home/hudson/hudson-slave/workspace/Lucene-Solr-NightlyTests-4.x/solr/build/solr-core/test/J1/./solrtest-jetty5-1348435930219/'
> [junit4:junit4]   2> 12073 T2425 oasc.SolrResourceLoader.<init> new SolrResourceLoader for directory: '/usr/home/hudson/hudson-slave/workspace/Lucene-Solr-NightlyTests-4.x/solr/build/solr-core/test/J1/./solrtest-jetty5-1348435930219/'
> [junit4:junit4]   2> 12098 T2425 oasc.CoreContainer.load Registering Log Listener
> [junit4:junit4]   2> 12104 T2446 oascc.ZkStateReader.updateClusterState Updating cloud state from ZooKeeper... 
> [junit4:junit4]   2> 12110 T2425 oasc.CoreContainer.initZooKeeper Zookeeper client=127.0.0.1:24639/solr
> [junit4:junit4]   2> 12111 T2425 oaz.ZooKeeper.<init> Initiating client connection, connectString=127.0.0.1:24639/solr sessionTimeout=5000 watcher=org.apache.solr.common.cloud.ConnectionManager@1faa49e7
> [junit4:junit4]   2> 12111 T2512 oaz.ClientCnxn$SendThread.startConnect Opening socket connection to server /127.0.0.1:24639
> [junit4:junit4]   2> 12111 T2425 oascc.ConnectionManager.waitForConnected Waiting for client to connect to ZooKeeper
> [junit4:junit4]   2> 12112 T2512 oaz.ClientCnxn$SendThread.primeConnection Socket connection established to localhost/127.0.0.1:24639, initiating session
> [junit4:junit4]   2> 12112 T2427 oazs.NIOServerCnxn$Factory.run Accepted socket connection from /140.211.11.196:24692
> [junit4:junit4]   2> 12112 T2427 oazs.NIOServerCnxn.readConnectRequest Client attempting to establish new session at /140.211.11.196:24692
> [junit4:junit4]   2> 12117 T2445 oascc.ZkStateReader$2.process A cluster state change has occurred - updating...
> [junit4:junit4]   2> 12117 T2471 oascc.ZkStateReader$2.process A cluster state change has occurred - updating...
> [junit4:junit4]   2> 12117 T2485 oascc.ZkStateReader$2.process A cluster state change has occurred - updating...
> [junit4:junit4]   2> 12117 T2499 oascc.ZkStateReader$2.process A cluster state change has occurred - updating...
> [junit4:junit4]   2> 12117 T2459 oascc.ZkStateReader$2.process A cluster state change has occurred - updating...
> [junit4:junit4]   2> 12118 T2429 oazs.NIOServerCnxn.finishSessionInit Established session 0x139f50b40590007 with negotiated timeout 5000 for client /140.211.11.196:24692
> [junit4:junit4]   2> 12118 T2512 oaz.ClientCnxn$SendThread.readConnectResult Session establishment complete on server localhost/127.0.0.1:24639, sessionid = 0x139f50b40590007, negotiated timeout = 5000
> [junit4:junit4]   2> 12118 T2513 oascc.ConnectionManager.process Watcher org.apache.solr.common.cloud.ConnectionManager@1faa49e7 name:ZooKeeperConnection Watcher:127.0.0.1:24639/solr got event WatchedEvent state:SyncConnected type:None path:null path:null type:None
> [junit4:junit4]   2> 12119 T2425 oascc.ConnectionManager.waitForConnected Client is connected to ZooKeeper
> [junit4:junit4]   2> 12119 T2430 oazs.PrepRequestProcessor.pRequest Got user-level KeeperException when processing sessionid:0x139f50b40590007 type:create cxid:0x1 zxid:0xfffffffffffffffe txntype:unknown reqpath:n/a Error Path:/solr/overseer Error:KeeperErrorCode = NodeExists for /solr/overseer
> [junit4:junit4]   2> 12128 T2430 oazs.PrepRequestProcessor.pRequest Got user-level KeeperException when processing sessionid:0x139f50b40590007 type:create cxid:0x2 zxid:0xfffffffffffffffe txntype:unknown reqpath:n/a Error Path:/solr/overseer Error:KeeperErrorCode = NodeExists for /solr/overseer
> [junit4:junit4]   2> 12129 T2425 oasc.ZkController.createEphemeralLiveNode Register node as live in ZooKeeper:/live_nodes/127.0.0.1:24691_solr
> [junit4:junit4]   2> 12130 T2430 oazs.PrepRequestProcessor.pRequest Got user-level KeeperException when processing sessionid:0x139f50b40590007 type:delete cxid:0x4 zxid:0xfffffffffffffffe txntype:unknown reqpath:n/a Error Path:/solr/live_nodes/127.0.0.1:24691_solr Error:KeeperErrorCode = NoNode for /solr/live_nodes/127.0.0.1:24691_solr
> [junit4:junit4]   2> 12131 T2425 oascc.SolrZkClient.makePath makePath: /live_nodes/127.0.0.1:24691_solr
> [junit4:junit4]   2> 12132 T2445 oascc.ZkStateReader$3.process Updating live nodes
> [junit4:junit4]   2> 12132 T2485 oascc.ZkStateReader$3.process Updating live nodes
> [junit4:junit4]   2> 12132 T2459 oascc.ZkStateReader$3.process Updating live nodes
> [junit4:junit4]   2> 12132 T2499 oascc.ZkStateReader$3.process Updating live nodes
> [junit4:junit4]   2> 12132 T2471 oascc.ZkStateReader$3.process Updating live nodes
> [junit4:junit4]   2> 12133 T2425 oashc.HttpShardHandlerFactory.getParameter Setting socketTimeout to: 0
> [junit4:junit4]   2> 12133 T2425 oashc.HttpShardHandlerFactory.getParameter Setting urlScheme to: http://
> [junit4:junit4]   2> 12134 T2425 oashc.HttpShardHandlerFactory.getParameter Setting connTimeout to: 0
> [junit4:junit4]   2> 12134 T2425 oashc.HttpShardHandlerFactory.getParameter Setting maxConnectionsPerHost to: 20
> [junit4:junit4]   2> 12134 T2425 oashc.HttpShardHandlerFactory.getParameter Setting corePoolSize to: 0
> [junit4:junit4]   2> 12134 T2425 oashc.HttpShardHandlerFactory.getParameter Setting maximumPoolSize to: 2147483647
> [junit4:junit4]   2> 12135 T2425 oashc.HttpShardHandlerFactory.getParameter Setting maxThreadIdleTime to: 5
> [junit4:junit4]   2> 12135 T2425 oashc.HttpShardHandlerFactory.getParameter Setting sizeOfQueue to: -1
> [junit4:junit4]   2> 12135 T2425 oashc.HttpShardHandlerFactory.getParameter Setting fairnessPolicy to: false
> [junit4:junit4]   2> 12136 T2425 oascsi.HttpClientUtil.createClient Creating new http client, config:maxConnectionsPerHost=20&maxConnections=10000&socketTimeout=0&connTimeout=0&retry=false
> [junit4:junit4]   2> 12151 T2425 oascc.ZkStateReader.createClusterStateWatchersAndUpdate Updating cluster state from ZooKeeper... 
> [junit4:junit4]   2> 12157 T2425 oasc.CoreContainer.create Creating SolrCore 'collection1' using instanceDir: /usr/home/hudson/hudson-slave/workspace/Lucene-Solr-NightlyTests-4.x/solr/build/solr-core/test/J1/./solrtest-jetty5-1348435930219/collection1
> [junit4:junit4]   2> 12157 T2425 oasc.ZkController.createCollectionZkNode Check for collection zkNode:collection1
> [junit4:junit4]   2> 12158 T2425 oasc.ZkController.createCollectionZkNode Collection zkNode exists
> [junit4:junit4]   2> 12158 T2425 oasc.ZkController.readConfigName Load collection config from:/collections/collection1
> [junit4:junit4]   2> 12159 T2425 oasc.SolrResourceLoader.<init> new SolrResourceLoader for directory: '/usr/home/hudson/hudson-slave/workspace/Lucene-Solr-NightlyTests-4.x/solr/build/solr-core/test/J1/./solrtest-jetty5-1348435930219/collection1/'
> [junit4:junit4]   2> 12160 T2425 oasc.SolrResourceLoader.replaceClassLoader Adding 'file:/usr/home/hudson/hudson-slave/workspace/Lucene-Solr-NightlyTests-4.x/solr/build/solr-core/test/J1/solrtest-jetty5-1348435930219/collection1/lib/README' to classloader
> [junit4:junit4]   2> 12161 T2425 oasc.SolrResourceLoader.replaceClassLoader Adding 'file:/usr/home/hudson/hudson-slave/workspace/Lucene-Solr-NightlyTests-4.x/solr/build/solr-core/test/J1/solrtest-jetty5-1348435930219/collection1/lib/classes/' to classloader
> [junit4:junit4]   2> 12213 T2425 oasc.SolrConfig.<init> Using Lucene MatchVersion: LUCENE_41
> [junit4:junit4]   2> 12271 T2425 oasc.SolrConfig.<init> Loaded SolrConfig: solrconfig.xml
> [junit4:junit4]   2> 12372 T2425 oass.IndexSchema.readSchema Reading Solr Schema
> [junit4:junit4]   2> 12378 T2425 oass.IndexSchema.readSchema Schema name=test
> [junit4:junit4]   2> 12816 T2425 oass.OpenExchangeRatesOrgProvider.init Initialized with rates=open-exchange-rates.json, refreshInterval=1440.
> [junit4:junit4]   2> 12824 T2425 oass.IndexSchema.readSchema default search field in schema is text
> [junit4:junit4]   2> 12827 T2425 oass.IndexSchema.readSchema unique key field: id
> [junit4:junit4]   2> 12835 T2425 oass.FileExchangeRateProvider.reload Reloading exchange rates from file currency.xml
> [junit4:junit4]   2> 12839 T2425 oass.FileExchangeRateProvider.reload Reloading exchange rates from file currency.xml
> [junit4:junit4]   2> 12842 T2425 oass.OpenExchangeRatesOrgProvider.reload Reloading exchange rates from open-exchange-rates.json
> [junit4:junit4]   2> 12843 T2425 oass.OpenExchangeRatesOrgProvider.reload Reloading exchange rates from open-exchange-rates.json
> [junit4:junit4]   2> 12844 T2425 oasc.SolrCore.<init> [collection1] Opening new SolrCore at /usr/home/hudson/hudson-slave/workspace/Lucene-Solr-NightlyTests-4.x/solr/build/solr-core/test/J1/./solrtest-jetty5-1348435930219/collection1/, dataDir=./org.apache.solr.cloud.SyncSliceTest-1348435918932/jetty5/
> [junit4:junit4]   2> 12844 T2425 oasc.JmxMonitoredMap.<init> JMX monitoring is enabled. Adding Solr mbeans to JMX Server: com.sun.jmx.mbeanserver.JmxMBeanServer@785e8d7d
> [junit4:junit4]   2> 12845 T2425 oasc.SolrCore.getNewIndexDir WARNING New index directory detected: old=null new=./org.apache.solr.cloud.SyncSliceTest-1348435918932/jetty5/index/
> [junit4:junit4]   2> 12845 T2425 oasc.SolrCore.initIndex WARNING [collection1] Solr index directory './org.apache.solr.cloud.SyncSliceTest-1348435918932/jetty5/index' doesn't exist. Creating new index...
> [junit4:junit4]   2> 12846 T2425 oasc.CachingDirectoryFactory.get return new directory for /usr/home/hudson/hudson-slave/workspace/Lucene-Solr-NightlyTests-4.x/solr/build/solr-core/test/J1/./org.apache.solr.cloud.SyncSliceTest-1348435918932/jetty5/index forceNew:false
> [junit4:junit4]   2> 12851 T2425 oasc.SolrDeletionPolicy.onCommit SolrDeletionPolicy.onCommit: commits:num=1
> [junit4:junit4]   2> 		commit{dir=NRTCachingDirectory(org.apache.lucene.store.NIOFSDirectory@/usr/home/hudson/hudson-slave/workspace/Lucene-Solr-NightlyTests-4.x/solr/build/solr-core/test/J1/org.apache.solr.cloud.SyncSliceTest-1348435918932/jetty5/index lockFactory=org.apache.lucene.store.NativeFSLockFactory@1ce70b2e; maxCacheMB=48.0 maxMergeSizeMB=4.0),segFN=segments_1,generation=1,filenames=[segments_1]
> [junit4:junit4]   2> 12851 T2425 oasc.SolrDeletionPolicy.updateCommits newest commit = 1
> [junit4:junit4]   2> 12852 T2425 oasc.SolrCore.initWriters created xml: solr.XMLResponseWriter
> [junit4:junit4]   2> 12853 T2425 oasup.UpdateRequestProcessorChain.init inserting DistributedUpdateProcessorFactory into updateRequestProcessorChain "dedupe"
> [junit4:junit4]   2> 12854 T2425 oasup.UpdateRequestProcessorChain.init inserting DistributedUpdateProcessorFactory into updateRequestProcessorChain "dedupe-allfields"
> [junit4:junit4]   2> 12854 T2425 oasup.UpdateRequestProcessorChain.init inserting DistributedUpdateProcessorFactory into updateRequestProcessorChain "stored_sig"
> [junit4:junit4]   2> 12855 T2425 oasup.UpdateRequestProcessorChain.init inserting DistributedUpdateProcessorFactory into updateRequestProcessorChain "uniq-fields"
> [junit4:junit4]   2> 12855 T2425 oasup.UpdateRequestProcessorChain.init inserting DistributedUpdateProcessorFactory into updateRequestProcessorChain "distrib-dup-test-chain-implicit"
> [junit4:junit4]   2> 12855 T2425 oasc.RequestHandlers.initHandlersFromConfig adding lazy requestHandler: solr.ReplicationHandler
> [junit4:junit4]   2> 12856 T2425 oasc.RequestHandlers.initHandlersFromConfig created /replication: solr.ReplicationHandler
> [junit4:junit4]   2> 12856 T2425 oasc.RequestHandlers.initHandlersFromConfig created standard: solr.StandardRequestHandler
> [junit4:junit4]   2> 12857 T2425 oasc.RequestHandlers.initHandlersFromConfig created /get: solr.RealTimeGetHandler
> [junit4:junit4]   2> 12857 T2425 oasc.RequestHandlers.initHandlersFromConfig created dismax: solr.SearchHandler
> [junit4:junit4]   2> 12858 T2425 oasc.RequestHandlers.initHandlersFromConfig created mock: org.apache.solr.core.MockQuerySenderListenerReqHandler
> [junit4:junit4]   2> 12858 T2425 oasc.RequestHandlers.initHandlersFromConfig created /admin/: org.apache.solr.handler.admin.AdminHandlers
> [junit4:junit4]   2> 12859 T2425 oasc.RequestHandlers.initHandlersFromConfig created defaults: solr.StandardRequestHandler
> [junit4:junit4]   2> 12859 T2425 oasc.RequestHandlers.initHandlersFromConfig adding lazy requestHandler: solr.StandardRequestHandler
> [junit4:junit4]   2> 12859 T2425 oasc.RequestHandlers.initHandlersFromConfig created lazy: solr.StandardRequestHandler
> [junit4:junit4]   2> 12860 T2425 oasc.RequestHandlers.initHandlersFromConfig created /update: solr.UpdateRequestHandler
> [junit4:junit4]   2> 12860 T2425 oasc.RequestHandlers.initHandlersFromConfig created /terms: org.apache.solr.handler.component.SearchHandler
> [junit4:junit4]   2> 12861 T2425 oasc.RequestHandlers.initHandlersFromConfig created spellCheckCompRH: org.apache.solr.handler.component.SearchHandler
> [junit4:junit4]   2> 12861 T2425 oasc.RequestHandlers.initHandlersFromConfig created spellCheckCompRH_Direct: org.apache.solr.handler.component.SearchHandler
> [junit4:junit4]   2> 12862 T2425 oasc.RequestHandlers.initHandlersFromConfig created spellCheckWithWordbreak: org.apache.solr.handler.component.SearchHandler
> [junit4:junit4]   2> 12862 T2425 oasc.RequestHandlers.initHandlersFromConfig created spellCheckWithWordbreak_Direct: org.apache.solr.handler.component.SearchHandler
> [junit4:junit4]   2> 12863 T2425 oasc.RequestHandlers.initHandlersFromConfig created spellCheckCompRH1: org.apache.solr.handler.component.SearchHandler
> [junit4:junit4]   2> 12863 T2425 oasc.RequestHandlers.initHandlersFromConfig created tvrh: org.apache.solr.handler.component.SearchHandler
> [junit4:junit4]   2> 12864 T2425 oasc.RequestHandlers.initHandlersFromConfig created /mlt: solr.MoreLikeThisHandler
> [junit4:junit4]   2> 12864 T2425 oasc.RequestHandlers.initHandlersFromConfig created /debug/dump: solr.DumpRequestHandler
> [junit4:junit4]   2> 12867 T2425 oashl.XMLLoader.init xsltCacheLifetimeSeconds=60
> [junit4:junit4]   2> 12870 T2425 oasc.SolrCore.initDeprecatedSupport WARNING solrconfig.xml uses deprecated <admin/gettableFiles>, Please update your config to use the ShowFileRequestHandler.
> [junit4:junit4]   2> 12870 T2425 oasc.SolrCore.initDeprecatedSupport WARNING adding ShowFileRequestHandler with hidden files: [SCHEMA.XML, OLD_SYNONYMS.TXT, STOPWORDS.TXT, PROTWORDS.TXT, OPEN-EXCHANGE-RATES.JSON, SYNONYMS.TXT, CURRENCY.XML, MAPPING-ISOLATIN1ACCENT.TXT]
> [junit4:junit4]   2> 12873 T2425 oass.SolrIndexSearcher.<init> Opening Searcher@cc98901 main
> [junit4:junit4]   2> 12874 T2425 oasu.CommitTracker.<init> Hard AutoCommit: disabled
> [junit4:junit4]   2> 12874 T2425 oasu.CommitTracker.<init> Soft AutoCommit: disabled
> [junit4:junit4]   2> 12875 T2425 oashc.SpellCheckComponent.inform Initializing spell checkers
> [junit4:junit4]   2> 12880 T2425 oass.DirectSolrSpellChecker.init init: {name=direct,classname=DirectSolrSpellChecker,field=lowerfilt,minQueryLength=3}
> [junit4:junit4]   2> 12926 T2514 oasc.SolrCore.registerSearcher [collection1] Registered new searcher Searcher@cc98901 main{StandardDirectoryReader(segments_1:1)}
> [junit4:junit4]   2> 13130 T2446 oascc.ZkStateReader.updateClusterState Updating cloud state from ZooKeeper... 
> [junit4:junit4]   2> 13134 T2471 oascc.ZkStateReader$2.process A cluster state change has occurred - updating...
> [junit4:junit4]   2> 13134 T2459 oascc.ZkStateReader$2.process A cluster state change has occurred - updating...
> [junit4:junit4]   2> 13134 T2499 oascc.ZkStateReader$2.process A cluster state change has occurred - updating...
> [junit4:junit4]   2> 13134 T2445 oascc.ZkStateReader$2.process A cluster state change has occurred - updating...
> [junit4:junit4]   2> 13135 T2513 oascc.ZkStateReader$2.process A cluster state change has occurred - updating...
> [junit4:junit4]   2> 13135 T2485 oascc.ZkStateReader$2.process A cluster state change has occurred - updating...
> [junit4:junit4]   2> 13432 T2425 oasc.CoreContainer.register registering core: collection1
> [junit4:junit4]   2> 13432 T2425 oasc.ZkController.register Register shard - core:collection1 address:http://127.0.0.1:24691/solr shardId:shard1
> [junit4:junit4]   2> 13437 T2425 oasc.ZkController.register We are http://127.0.0.1:24691/solr/collection1/ and leader is http://127.0.0.1:24653/solr/collection1/
> [junit4:junit4]   2> 13437 T2425 oasc.ZkController.register No LogReplay needed for core=collection1 baseURL=http://127.0.0.1:24691/solr
> [junit4:junit4]   2> 13437 T2425 oasc.ZkController.checkRecovery Core needs to recover:collection1
> [junit4:junit4]   2> 13438 T2425 oasu.DefaultSolrCoreState.doRecovery Running recovery - first canceling any ongoing recovery
> [junit4:junit4]   2> ASYNC  NEW_CORE C53 name=collection1 org.apache.solr.core.SolrCore@7d24a9a2 url=http://127.0.0.1:24691/solr/collection1 node=127.0.0.1:24691_solr
> [junit4:junit4]   2> 13439 T2515 C53 P24691 oasc.RecoveryStrategy.run Starting recovery process.  core=collection1 recoveringAfterStartup=true
> [junit4:junit4]   2> 13439 T2515 C53 P24691 oasc.RecoveryStrategy.doRecovery ###### startupVersions=[]
> [junit4:junit4]   2> 13439 T2425 oascc.ZkStateReader.updateClusterState Updating cloud state from ZooKeeper... 
> [junit4:junit4]   2> 13440 T2425 oass.SolrDispatchFilter.init user.dir=/usr/home/hudson/hudson-slave/workspace/Lucene-Solr-NightlyTests-4.x/solr/build/solr-core/test/J1
> [junit4:junit4]   2> 13440 T2515 C53 P24691 oasc.RecoveryStrategy.doRecovery Attempting to PeerSync from http://127.0.0.1:24653/solr/collection1/ core=collection1 - recoveringAfterStartup=true
> [junit4:junit4]   2> 13440 T2425 oass.SolrDispatchFilter.init SolrDispatchFilter.init() done
> [junit4:junit4]   2> 13441 T2515 C53 P24691 oasu.PeerSync.sync PeerSync: core=collection1 url=http://127.0.0.1:24691/solr START replicas=[http://127.0.0.1:24653/solr/collection1/] nUpdates=100
> [junit4:junit4]   2> 13441 T2425 oascsi.HttpClientUtil.createClient Creating new http client, config:maxConnections=128&maxConnectionsPerHost=32&followRedirects=false
> [junit4:junit4]   2> 13441 T2515 C53 P24691 oasu.PeerSync.sync WARNING no frame of reference to tell of we've missed updates
> [junit4:junit4]   2> 13441 T2515 C53 P24691 oasc.RecoveryStrategy.doRecovery PeerSync Recovery was not successful - trying replication. core=collection1
> [junit4:junit4]   2> 13442 T2515 C53 P24691 oasc.RecoveryStrategy.doRecovery Starting Replication Recovery. core=collection1
> [junit4:junit4]   2> 13442 T2515 C53 P24691 oascsi.HttpClientUtil.createClient Creating new http client, config:maxConnections=128&maxConnectionsPerHost=32&followRedirects=false
> [junit4:junit4]   2> 13443 T2451 C50 P24653 REQ /get {distrib=false&qt=/get&wt=javabin&version=2&getVersions=100} status=0 QTime=0 
> [junit4:junit4]   2> 13646 T2446 oascc.ZkStateReader.updateClusterState Updating cloud state from ZooKeeper... 
> [junit4:junit4]   2> 13662 T2445 oascc.ZkStateReader$2.process A cluster state change has occurred - updating...
> [junit4:junit4]   2> 13662 T2513 oascc.ZkStateReader$2.process A cluster state change has occurred - updating...
> [junit4:junit4]   2> 13662 T2471 oascc.ZkStateReader$2.process A cluster state change has occurred - updating...
> [junit4:junit4]   2> 13662 T2485 oascc.ZkStateReader$2.process A cluster state change has occurred - updating...
> [junit4:junit4]   2> 13662 T2499 oascc.ZkStateReader$2.process A cluster state change has occurred - updating...
> [junit4:junit4]   2> 13662 T2459 oascc.ZkStateReader$2.process A cluster state change has occurred - updating...
> [junit4:junit4]   2> 14120 T2425 oejs.Server.doStart jetty-8.1.2.v20120308
> [junit4:junit4]   2> 14123 T2425 oejs.AbstractConnector.doStart Started SocketConnector@0.0.0.0:24705
> [junit4:junit4]   2> 14123 T2425 oasc.SolrResourceLoader.locateSolrHome JNDI not configured for solr (NoInitialContextEx)
> [junit4:junit4]   2> 14124 T2425 oasc.SolrResourceLoader.locateSolrHome using system property solr.solr.home: /usr/home/hudson/hudson-slave/workspace/Lucene-Solr-NightlyTests-4.x/solr/build/solr-core/test/J1/./solrtest-jetty6-1348435932382
> [junit4:junit4]   2> 14124 T2425 oasc.SolrResourceLoader.<init> new SolrResourceLoader for deduced Solr Home: '/usr/home/hudson/hudson-slave/workspace/Lucene-Solr-NightlyTests-4.x/solr/build/solr-core/test/J1/./solrtest-jetty6-1348435932382/'
> [junit4:junit4]   2> 14147 T2425 oass.SolrDispatchFilter.init SolrDispatchFilter.init()
> [junit4:junit4]   2> 14148 T2425 oasc.SolrResourceLoader.locateSolrHome JNDI not configured for solr (NoInitialContextEx)
> [junit4:junit4]   2> 14148 T2425 oasc.SolrResourceLoader.locateSolrHome using system property solr.solr.home: /usr/home/hudson/hudson-slave/workspace/Lucene-Solr-NightlyTests-4.x/solr/build/solr-core/test/J1/./solrtest-jetty6-1348435932382
> [junit4:junit4]   2> 14148 T2425 oasc.CoreContainer$Initializer.initialize looking for solr.xml: /usr/home/hudson/hudson-slave/workspace/Lucene-Solr-NightlyTests-4.x/solr/build/solr-core/test/J1/./solrtest-jetty6-1348435932382/solr.xml
> [junit4:junit4]   2> 14149 T2425 oasc.CoreContainer.<init> New CoreContainer 1713971662
> [junit4:junit4]   2> 14149 T2425 oasc.CoreContainer.load Loading CoreContainer using Solr Home: '/usr/home/hudson/hudson-slave/workspace/Lucene-Solr-NightlyTests-4.x/solr/build/solr-core/test/J1/./solrtest-jetty6-1348435932382/'
> [junit4:junit4]   2> 14149 T2425 oasc.SolrResourceLoader.<init> new SolrResourceLoader for directory: '/usr/home/hudson/hudson-slave/workspace/Lucene-Solr-NightlyTests-4.x/solr/build/solr-core/test/J1/./solrtest-jetty6-1348435932382/'
> [junit4:junit4]   2> 14167 T2425 oasc.CoreContainer.load Registering Log Listener
> [junit4:junit4]   2> 14177 T2425 oasc.CoreContainer.initZooKeeper Zookeeper client=127.0.0.1:24639/solr
> [junit4:junit4]   2> 14177 T2425 oaz.ZooKeeper.<init> Initiating client connection, connectString=127.0.0.1:24639/solr sessionTimeout=5000 watcher=org.apache.solr.common.cloud.ConnectionManager@2e059ef7
> [junit4:junit4]   2> 14182 T2425 oascc.ConnectionManager.waitForConnected Waiting for client to connect to ZooKeeper
> [junit4:junit4]   2> 14182 T2526 oaz.ClientCnxn$SendThread.startConnect Opening socket connection to server /127.0.0.1:24639
> [junit4:junit4]   2> 14185 T2526 oaz.ClientCnxn$SendThread.primeConnection Socket connection established to localhost/127.0.0.1:24639, initiating session
> [junit4:junit4]   2> 14185 T2427 oazs.NIOServerCnxn$Factory.run Accepted socket connection from /140.211.11.196:24706
> [junit4:junit4]   2> 14186 T2427 oazs.NIOServerCnxn.readConnectRequest Client attempting to establish new session at /140.211.11.196:24706
> [junit4:junit4]   2> 14204 T2429 oazs.NIOServerCnxn.finishSessionInit Established session 0x139f50b40590008 with negotiated timeout 5000 for client /140.211.11.196:24706
> [junit4:junit4]   2> 14204 T2526 oaz.ClientCnxn$SendThread.readConnectResult Session establishment complete on server localhost/127.0.0.1:24639, sessionid = 0x139f50b40590008, negotiated timeout = 5000
> [junit4:junit4]   2> 14204 T2527 oascc.ConnectionManager.process Watcher org.apache.solr.common.cloud.ConnectionManager@2e059ef7 name:ZooKeeperConnection Watcher:127.0.0.1:24639/solr got event WatchedEvent state:SyncConnected type:None path:null path:null type:None
> [junit4:junit4]   2> 14204 T2425 oascc.ConnectionManager.waitForConnected Client is connected to ZooKeeper
> [junit4:junit4]   2> 14205 T2430 oazs.PrepRequestProcessor.pRequest Got user-level KeeperException when processing sessionid:0x139f50b40590008 type:create cxid:0x1 zxid:0xfffffffffffffffe txntype:unknown reqpath:n/a Error Path:/solr/overseer Error:KeeperErrorCode = NodeExists for /solr/overseer
> [junit4:junit4]   2> 14207 T2430 oazs.PrepRequestProcessor.pRequest Got user-level KeeperException when processing sessionid:0x139f50b40590008 type:create cxid:0x2 zxid:0xfffffffffffffffe txntype:unknown reqpath:n/a Error Path:/solr/overseer Error:KeeperErrorCode = NodeExists for /solr/overseer
> [junit4:junit4]   2> 14217 T2425 oasc.ZkController.createEphemeralLiveNode Register node as live in ZooKeeper:/live_nodes/127.0.0.1:24705_solr
> [junit4:junit4]   2> 14217 T2430 oazs.PrepRequestProcessor.pRequest Got user-level KeeperException when processing sessionid:0x139f50b40590008 type:delete cxid:0x4 zxid:0xfffffffffffffffe txntype:unknown reqpath:n/a Error Path:/solr/live_nodes/127.0.0.1:24705_solr Error:KeeperErrorCode = NoNode for /solr/live_nodes/127.0.0.1:24705_solr
> [junit4:junit4]   2> 14227 T2425 oascc.SolrZkClient.makePath makePath: /live_nodes/127.0.0.1:24705_solr
> [junit4:junit4]   2> 14229 T2445 oascc.ZkStateReader$3.process Updating live nodes
> [junit4:junit4]   2> 14229 T2471 oascc.ZkStateReader$3.process Updating live nodes
> [junit4:junit4]   2> 14229 T2513 oascc.ZkStateReader$3.process Updating live nodes
> [junit4:junit4]   2> 14229 T2485 oascc.ZkStateReader$3.process Updating live nodes
> [junit4:junit4]   2> 14229 T2459 oascc.ZkStateReader$3.process Updating live nodes
> [junit4:junit4]   2> 14229 T2499 oascc.ZkStateReader$3.process Updating live nodes
> [junit4:junit4]   2> 14230 T2425 oashc.HttpShardHandlerFactory.getParameter Setting socketTimeout to: 0
> [junit4:junit4]   2> 14230 T2425 oashc.HttpShardHandlerFactory.getParameter Setting urlScheme to: http://
> [junit4:junit4]   2> 14231 T2425 oashc.HttpShardHandlerFactory.getParameter Setting connTimeout to: 0
> [junit4:junit4]   2> 14231 T2425 oashc.HttpShardHandlerFactory.getParameter Setting maxConnectionsPerHost to: 20
> [junit4:junit4]   2> 14231 T2425 oashc.HttpShardHandlerFactory.getParameter Setting corePoolSize to: 0
> [junit4:junit4]   2> 14232 T2425 oashc.HttpShardHandlerFactory.getParameter Setting maximumPoolSize to: 2147483647
> [junit4:junit4]   2> 14232 T2425 oashc.HttpShardHandlerFactory.getParameter Setting maxThreadIdleTime to: 5
> [junit4:junit4]   2> 14232 T2425 oashc.HttpShardHandlerFactory.getParameter Setting sizeOfQueue to: -1
> [junit4:junit4]   2> 14232 T2425 oashc.HttpShardHandlerFactory.getParameter Setting fairnessPolicy to: false
> [junit4:junit4]   2> 14233 T2425 oascsi.HttpClientUtil.createClient Creating new http client, config:maxConnectionsPerHost=20&maxConnections=10000&socketTimeout=0&connTimeout=0&retry=false
> [junit4:junit4]   2> 14245 T2425 oascc.ZkStateReader.createClusterStateWatchersAndUpdate Updating cluster state from ZooKeeper... 
> [junit4:junit4]   2> 14249 T2425 oasc.CoreContainer.create Creating SolrCore 'collection1' using instanceDir: /usr/home/hudson/hudson-slave/workspace/Lucene-Solr-NightlyTests-4.x/solr/build/solr-core/test/J1/./solrtest-jetty6-1348435932382/collection1
> [junit4:junit4]   2> 14249 T2425 oasc.ZkController.createCollectionZkNode Check for collection zkNode:collection1
> [junit4:junit4]   2> 14250 T2425 oasc.ZkController.createCollectionZkNode Collection zkNode exists
> [junit4:junit4]   2> 14250 T2425 oasc.ZkController.readConfigName Load collection config from:/collections/collection1
> [junit4:junit4]   2> 14251 T2425 oasc.SolrResourceLoader.<init> new SolrResourceLoader for directory: '/usr/home/hudson/hudson-slave/workspace/Lucene-Solr-NightlyTests-4.x/solr/build/solr-core/test/J1/./solrtest-jetty6-1348435932382/collection1/'
> [junit4:junit4]   2> 14252 T2425 oasc.SolrResourceLoader.replaceClassLoader Adding 'file:/usr/home/hudson/hudson-slave/workspace/Lucene-Solr-NightlyTests-4.x/solr/build/solr-core/test/J1/solrtest-jetty6-1348435932382/collection1/lib/README' to classloader
> [junit4:junit4]   2> 14253 T2425 oasc.SolrResourceLoader.replaceClassLoader Adding 'file:/usr/home/hudson/hudson-slave/workspace/Lucene-Solr-NightlyTests-4.x/solr/build/solr-core/test/J1/solrtest-jetty6-1348435932382/collection1/lib/classes/' to classloader
> [junit4:junit4]   2> 14285 T2425 oasc.SolrConfig.<init> Using Lucene MatchVersion: LUCENE_41
> [junit4:junit4]   2>  C52_STATE=coll:collection1 core:collection1 props:{shard=shard1, roles=null, state=recovering, core=collection1, collection=collection1, node_name=127.0.0.1:24682_solr, base_url=http://127.0.0.1:24682/solr}
> [junit4:junit4]   2> 14296 T2501 C52 P24682 oasc.RecoveryStrategy.doRecovery Begin buffering updates. core=collection1
> [junit4:junit4]   2> 14296 T2501 C52 P24682 oasu.UpdateLog.bufferUpdates Starting to buffer updates. FSUpdateLog{state=ACTIVE, tlog=null}
> [junit4:junit4]   2> 14296 T2501 C52 P24682 oasc.RecoveryStrategy.replicate Attempting to replicate from http://127.0.0.1:24653/solr/collection1/. core=collection1
> [junit4:junit4]   2> 14296 T2501 C52 P24682 oascsi.HttpClientUtil.createClient Creating new http client, config:maxConnections=128&maxConnectionsPerHost=32&followRedirects=false
> [junit4:junit4]   2> 14307 T2454 C50 P24653 oasu.DirectUpdateHandler2.commit start commit{flags=0,_version_=0,optimize=false,openSearcher=true,waitSearcher=true,expungeDeletes=false,softCommit=false}
> [junit4:junit4]   2> 14309 T2454 C50 P24653 oass.SolrIndexSearcher.<init> Opening Searcher@14a18178 main
> [junit4:junit4]   2> 14314 T2454 C50 P24653 oasu.DirectUpdateHandler2.commit end_commit_flush
> [junit4:junit4]   2> 14316 T2460 oasc.SolrCore.registerSearcher [collection1] Registered new searcher Searcher@14a18178 main{StandardDirectoryReader(segments_1:1)}
> [junit4:junit4]   2> 14316 T2454 C50 P24653 /update {waitSearcher=true&commit=true&commit_end_point=true&wt=javabin&softCommit=false&version=2} {commit=} 0 9
> [junit4:junit4]   2> 14317 T2501 C52 P24682 oash.ReplicationHandler.inform Commits will be reserved for  10000
> [junit4:junit4]   2> 14317 T2501 C52 P24682 oash.SnapPuller.<init>  No value set for 'pollInterval'. Timer Task not started.
> [junit4:junit4]   2> 14319 T2455 C50 P24653 REQ /replication {command=indexversion&wt=javabin&qt=/replication&version=2} status=0 QTime=0 
> [junit4:junit4]   2> 14323 T2501 C52 P24682 oasc.SolrDeletionPolicy.onInit SolrDeletionPolicy.onInit: commits:num=1
> [junit4:junit4]   2> 		commit{dir=NRTCachingDirectory(org.apache.lucene.store.NIOFSDirectory@/usr/home/hudson/hudson-slave/workspace/Lucene-Solr-NightlyTests-4.x/solr/build/solr-core/test/J1/org.apache.solr.cloud.SyncSliceTest-1348435918932/jetty4/index lockFactory=org.apache.lucene.store.NativeFSLockFactory@51b4af2c; maxCacheMB=48.0 maxMergeSizeMB=4.0),segFN=segments_1,generation=1,filenames=[segments_1]
> [junit4:junit4]   2> 14323 T2501 C52 P24682 oasc.SolrDeletionPolicy.updateCommits newest commit = 1
> [junit4:junit4]   2> 14324 T2501 C52 P24682 oasu.DirectUpdateHandler2.commit start commit{flags=0,_version_=0,optimize=false,openSearcher=true,waitSearcher=true,expungeDeletes=false,softCommit=false}
> [junit4:junit4]   2> 14332 T2501 C52 P24682 oasc.SolrDeletionPolicy.onCommit SolrDeletionPolicy.onCommit: commits:num=2
> [junit4:junit4]   2> 		commit{dir=NRTCachingDirectory(org.apache.lucene.store.NIOFSDirectory@/usr/home/hudson/hudson-slave/workspace/Lucene-Solr-NightlyTests-4.x/solr/build/solr-core/test/J1/org.apache.solr.cloud.SyncSliceTest-1348435918932/jetty4/index lockFactory=org.apache.lucene.store.NativeFSLockFactory@51b4af2c; maxCacheMB=48.0 maxMergeSizeMB=4.0),segFN=segments_1,generation=1,filenames=[segments_1]
> [junit4:junit4]   2> 		commit{dir=NRTCachingDirectory(org.apache.lucene.store.NIOFSDirectory@/usr/home/hudson/hudson-slave/workspace/Lucene-Solr-NightlyTests-4.x/solr/build/solr-core/test/J1/org.apache.solr.cloud.SyncSliceTest-1348435918932/jetty4/index lockFactory=org.apache.lucene.store.NativeFSLockFactory@51b4af2c; maxCacheMB=48.0 maxMergeSizeMB=4.0),segFN=segments_2,generation=2,filenames=[segments_2]
> [junit4:junit4]   2> 14333 T2501 C52 P24682 oasc.SolrDeletionPolicy.updateCommits newest commit = 2
> [junit4:junit4]   2> 14338 T2501 C52 P24682 oass.SolrIndexSearcher.<init> Opening Searcher@1a3b76d0 main
> [junit4:junit4]   2> 14338 T2501 C52 P24682 oasu.DirectUpdateHandler2.commit end_commit_flush
> [junit4:junit4]   2> 14341 T2500 oasc.SolrCore.registerSearcher [collection1] Registered new searcher Searcher@1a3b76d0 main{StandardDirectoryReader(segments_2:2)}
> [junit4:junit4]   2> 14342 T2501 C52 P24682 oasc.RecoveryStrategy.replay No replay needed. core=collection1
> [junit4:junit4]   2> 14342 T2501 C52 P24682 oasc.RecoveryStrategy.doRecovery Replication Recovery was successful - registering as Active. core=collection1
> [junit4:junit4]   2> 14362 T2425 oasc.SolrConfig.<init> Loaded SolrConfig: solrconfig.xml
> [junit4:junit4]   2> 14383 T2501 C52 P24682 oasc.RecoveryStrategy.doRecovery Finished recovery process. core=collection1
> [junit4:junit4]   2> 14483 T2425 oass.IndexSchema.readSchema Reading Solr Schema
> [junit4:junit4]   2> 14493 T2425 oass.IndexSchema.readSchema Schema name=test
> [junit4:junit4]   2> 14668 T2446 oascc.ZkStateReader.updateClusterState Updating cloud state from ZooKeeper... 
> [junit4:junit4]   2> 14712 T2445 oascc.ZkStateReader$2.process A cluster state change has occurred - updating...
> [junit4:junit4]   2> 14712 T2499 oascc.ZkStateReader$2.process A cluster state change has occurred - updating...
> [junit4:junit4]   2> 14712 T2459 oascc.ZkStateReader$2.process A cluster state change has occurred - updating...
> [junit4:junit4]   2> 14712 T2513 oascc.ZkStateReader$2.process A cluster state change has occurred - updating...
> [junit4:junit4]   2> 14712 T2485 oascc.ZkStateReader$2.process A cluster state change has occurred - updating...
> [junit4:junit4]   2> 14712 T2527 oascc.ZkStateReader$2.process A cluster state change has occurred - updating...
> [junit4:junit4]   2> 14712 T2471 oascc.ZkStateReader$2.process A cluster state change has occurred - updating...
> [junit4:junit4]   2> 15079 T2425 oass.OpenExchangeRatesOrgProvider.init Initialized with rates=open-exchange-rates.json, refreshInterval=1440.
> [junit4:junit4]   2> 15091 T2425 oass.IndexSchema.readSchema default search field in schema is text
> [junit4:junit4]   2> 15095 T2425 oass.IndexSchema.readSchema unique key field: id
> [junit4:junit4]   2> 15106 T2425 oass.FileExchangeRateProvider.reload Reloading exchange rates from file currency.xml
> [junit4:junit4]   2> 15110 T2425 oass.FileExchangeRateProvider.reload Reloading exchange rates from file currency.xml
> [junit4:junit4]   2> 15113 T2425 oass.OpenExchangeRatesOrgProvider.reload Reloading exchange rates from open-exchange-rates.json
> [junit4:junit4]   2> 15114 T2425 oass.OpenExchangeRatesOrgProvider.reload Reloading exchange rates from open-exchange-rates.json
> [junit4:junit4]   2> 15114 T2425 oasc.SolrCore.<init> [collection1] Opening new SolrCore at /usr/home/hudson/hudson-slave/workspace/Lucene-Solr-NightlyTests-4.x/solr/build/solr-core/test/J1/./solrtest-jetty6-1348435932382/collection1/, dataDir=./org.apache.solr.cloud.SyncSliceTest-1348435918932/jetty6/
> [junit4:junit4]   2> 15115 T2425 oasc.JmxMonitoredMap.<init> JMX monitoring is enabled. Adding Solr mbeans to JMX Server: com.sun.jmx.mbeanserver.JmxMBeanServer@785e8d7d
> [junit4:junit4]   2> 15116 T2425 oasc.SolrCore.getNewIndexDir WARNING New index directory detected: old=null new=./org.apache.solr.cloud.SyncSliceTest-1348435918932/jetty6/index/
> [junit4:junit4]   2> 15116 T2425 oasc.SolrCore.initIndex WARNING [collection1] Solr index directory './org.apache.solr.cloud.SyncSliceTest-1348435918932/jetty6/index' doesn't exist. Creating new index...
> [junit4:junit4]   2> 15117 T2425 oasc.CachingDirectoryFactory.get return new directory for /usr/home/hudson/hudson-slave/workspace/Lucene-Solr-NightlyTests-4.x/solr/build/solr-core/test/J1/./org.apache.solr.cloud.SyncSliceTest-1348435918932/jetty6/index forceNew:false
> [junit4:junit4]   2> 15122 T2425 oasc.SolrDeletionPolicy.onCommit SolrDeletionPolicy.onCommit: commits:num=1
> [junit4:junit4]   2> 		commit{dir=NRTCachingDirectory(org.apache.lucene.store.NIOFSDirectory@/usr/home/hudson/hudson-slave/workspace/Lucene-Solr-NightlyTests-4.x/solr/build/solr-core/test/J1/org.apache.solr.cloud.SyncSliceTest-1348435918932/jetty6/index lockFactory=org.apache.lucene.store.NativeFSLockFactory@406876; maxCacheMB=48.0 maxMergeSizeMB=4.0),segFN=segments_1,generation=1,filenames=[segments_1]
> [junit4:junit4]   2> 15122 T2425 oasc.SolrDeletionPolicy.updateCommits newest commit = 1
> [junit4:junit4]   2> 15123 T2425 oasc.SolrCore.initWriters created xml: solr.XMLResponseWriter
> [junit4:junit4]   2> 15125 T2425 oasup.UpdateRequestProcessorChain.init inserting DistributedUpdateProcessorFactory into updateRequestProcessorChain "dedupe"
> [junit4:junit4]   2> 15125 T2425 oasup.UpdateRequestProcessorChain.init inserting DistributedUpdateProcessorFactory into updateRequestProcessorChain "dedupe-allfields"
> [junit4:junit4]   2> 15126 T2425 oasup.UpdateRequestProcessorChain.init inserting DistributedUpdateProcessorFactory into updateRequestProcessorChain "stored_sig"
> [junit4:junit4]   2> 15126 T2425 oasup.UpdateRequestProcessorChain.init inserting DistributedUpdateProcessorFactory into updateRequestProcessorChain "uniq-fields"
> [junit4:junit4]   2> 15127 T2425 oasup.UpdateRequestProcessorChain.init inserting DistributedUpdateProcessorFactory into updateRequestProcessorChain "distrib-dup-test-chain-implicit"
> [junit4:junit4]   2> 15127 T2425 oasc.RequestHandlers.initHandlersFromConfig adding lazy requestHandler: solr.ReplicationHandler
> [junit4:junit4]   2> 15127 T2425 oasc.RequestHandlers.initHandlersFromConfig created /replication: solr.ReplicationHandler
> [junit4:junit4]   2> 15128 T2425 oasc.RequestHandlers.initHandlersFromConfig created standard: solr.StandardRequestHandler
> [junit4:junit4]   2> 15128 T2425 oasc.RequestHandlers.initHandlersFromConfig created /get: solr.RealTimeGetHandler
> [junit4:junit4]   2> 15129 T2425 oasc.RequestHandlers.initHandlersFromConfig created dismax: solr.SearchHandler
> [junit4:junit4]   2> 15129 T2425 oasc.RequestHandlers.initHandlersFromConfig created mock: org.apache.solr.core.MockQuerySenderListenerReqHandler
> [junit4:junit4]   2> 15130 T2425 oasc.RequestHandlers.initHandlersFromConfig created /admin/: org.apache.solr.handler.admin.AdminHandlers
> [junit4:junit4]   2> 15130 T2425 oasc.RequestHandlers.initHandlersFromConfig created defaults: solr.StandardRequestHandler
> [junit4:junit4]   2> 15130 T2425 oasc.RequestHandlers.initHandlersFromConfig adding lazy requestHandler: solr.StandardRequestHandler
> [junit4:junit4]   2> 15131 T2425 oasc.RequestHandlers.initHandlersFromConfig created lazy: solr.StandardRequestHandler
> [junit4:junit4]   2> 15131 T2425 oasc.RequestHandlers.initHandlersFromConfig created /update: solr.UpdateRequestHandler
> [junit4:junit4]   2> 15132 T2425 oasc.RequestHandlers.initHandlersFromConfig created /terms: org.apache.solr.handler.component.SearchHandler
> [junit4:junit4]   2> 15132 T2425 oasc.RequestHandlers.initHandlersFromConfig created spellCheckCompRH: org.apache.solr.handler.component.SearchHandler
> [junit4:junit4]   2> 15133 T2425 oasc.RequestHandlers.initHandlersFromConfig created spellCheckCompRH_Direct: org.apache.solr.handler.component.SearchHandler
> [junit4:junit4]   2> 15133 T2425 oasc.RequestHandlers.initHandlersFromConfig created spellCheckWithWordbreak: org.apache.solr.handler.component.SearchHandler
> [junit4:junit4]   2> 15134 T2425 oasc.RequestHandlers.initHandlersFromConfig created spellCheckWithWordbreak_Direct: org.apache.solr.handler.component.SearchHandler
> [junit4:junit4]   2> 15134 T2425 oasc.RequestHandlers.initHandlersFromConfig created spellCheckCompRH1: org.apache.solr.handler.component.SearchHandler
> [junit4:junit4]   2> 15135 T2425 oasc.RequestHandlers.initHandlersFromConfig created tvrh: org.apache.solr.handler.component.SearchHandler
> [junit4:junit4]   2> 15135 T2425 oasc.RequestHandlers.initHandlersFromConfig created /mlt: solr.MoreLikeThisHandler
> [junit4:junit4]   2> 15136 T2425 oasc.RequestHandlers.initHandlersFromConfig created /debug/dump: solr.DumpRequestHandler
> [junit4:junit4]   2> 15138 T2425 oashl.XMLLoader.init xsltCacheLifetimeSeconds=60
> [junit4:junit4]   2> 15141 T2425 oasc.SolrCore.initDeprecatedSupport WARNING solrconfig.xml uses deprecated <admin/gettableFiles>, Please update your config to use the ShowFileRequestHandler.
> [junit4:junit4]   2> 15142 T2425 oasc.SolrCore.initDeprecatedSupport WARNING adding ShowFileRequestHandler with hidden files: [SCHEMA.XML, OLD_SYNONYMS.TXT, STOPWORDS.TXT, PROTWORDS.TXT, OPEN-EXCHANGE-RATES.JSON, SYNONYMS.TXT, CURRENCY.XML, MAPPING-ISOLATIN1ACCENT.TXT]
> [junit4:junit4]   2> 15145 T2425 oass.SolrIndexSearcher.<init> Opening Searcher@1f4609c5 main
> [junit4:junit4]   2> 15146 T2425 oasu.CommitTracker.<init> Hard AutoCommit: disabled
> [junit4:junit4]   2> 15146 T2425 oasu.CommitTracker.<init> Soft AutoCommit: disabled
> [junit4:junit4]   2> 15147 T2425 oashc.SpellCheckComponent.inform Initializing spell checkers
> [junit4:junit4]   2> 15162 T2425 oass.DirectSolrSpellChecker.init init: {name=direct,classname=DirectSolrSpellChecker,field=lowerfilt,minQueryLength=3}
> [junit4:junit4]   2> 15209 T2528 oasc.SolrCore.registerSearcher [collection1] Registered new searcher Searcher@1f4609c5 main{StandardDirectoryReader(segments_1:1)}
> [junit4:junit4]   2> 15243 T2446 oascc.ZkStateReader.updateClusterState Updating cloud state from ZooKeeper... 
> [junit4:junit4]   2> 15255 T2445 oascc.ZkStateReader$2.process A cluster state change has occurred - updating...
> [junit4:junit4]   2> 15255 T2459 oascc.ZkStateReader$2.process A cluster state change has occurred - updating...
> [junit4:junit4]   2> 15255 T2513 oascc.ZkStateReader$2.process A cluster state change has occurred - updating...
> [junit4:junit4]   2> 15255 T2485 oascc.ZkStateReader$2.process A cluster state change has occurred - updating...
> [junit4:junit4]   2> 15255 T2471 oascc.ZkStateReader$2.process A cluster state change has occurred - updating...
> [junit4:junit4]   2> 15255 T2499 oascc.ZkStateReader$2.process A cluster state change has occurred - updating...
> [junit4:junit4]   2> 15255 T2527 oascc.ZkStateReader$2.process A cluster state change has occurred - updating...
> [junit4:junit4]   2> 15715 T2425 oasc.CoreContainer.register registering core: collection1
> [junit4:junit4]   2> 15715 T2425 oasc.ZkController.register Register shard - core:collection1 address:http://127.0.0.1:24705/solr shardId:shard1
> [junit4:junit4]   2> 15722 T2425 oasc.ZkController.register We are http://127.0.0.1:24705/solr/collection1/ and leader is http://127.0.0.1:24653/solr/collection1/
> [junit4:junit4]   2> 15722 T2425 oasc.ZkController.register No LogReplay needed for core=collection1 baseURL=http://127.0.0.1:24705/solr
> [junit4:junit4]   2> 15723 T2425 oasc.ZkController.checkRecovery Core needs to recover:collection1
> [junit4:junit4]   2> 15723 T2425 oasu.DefaultSolrCoreState.doRecovery Running recovery - first canceling any ongoing recovery
> [junit4:junit4]   2> ASYNC  NEW_CORE C54 name=collection1 org.apache.solr.core.SolrCore@3e8b0765 url=http://127.0.0.1:24705/solr/collection1 node=127.0.0.1:24705_solr
> [junit4:junit4]   2> 15724 T2529 C54 P24705 oasc.RecoveryStrategy.run Starting recovery process.  core=collection1 recoveringAfterStartup=true
> [junit4:junit4]   2> 15725 T2529 C54 P24705 oasc.RecoveryStrategy.doRecovery ###### startupVersions=[]
> [junit4:junit4]   2> 15725 T2425 oascc.ZkStateReader.updateClusterState Updating cloud state from ZooKeeper... 
> [junit4:junit4]   2> 15726 T2529 C54 P24705 oasc.RecoveryStrategy.doRecovery Attempting to PeerSync from http://127.0.0.1:24653/solr/collection1/ core=collection1 - recoveringAfterStartup=true
> [junit4:junit4]   2> 15726 T2529 C54 P24705 oasu.PeerSync.sync PeerSync: core=collection1 url=http://127.0.0.1:24705/solr START replicas=[http://127.0.0.1:24653/solr/collection1/] nUpdates=100
> [junit4:junit4]   2> 15726 T2425 oass.SolrDispatchFilter.init user.dir=/usr/home/hudson/hudson-slave/workspace/Lucene-Solr-NightlyTests-4.x/solr/build/solr-core/test/J1
> [junit4:junit4]   2> 15726 T2529 C54 P24705 oasu.PeerSync.sync WARNING no frame of reference to tell of we've missed updates
> [junit4:junit4]   2> 15727 T2529 C54 P24705 oasc.RecoveryStrategy.doRecovery PeerSync Recovery was not successful - trying replication. core=collection1
> [junit4:junit4]   2> 15727 T2425 oass.SolrDispatchFilter.init SolrDispatchFilter.init() done
> [junit4:junit4]   2> 15727 T2529 C54 P24705 oasc.RecoveryStrategy.doRecovery Starting Replication Recovery. core=collection1
> [junit4:junit4]   2> 15727 T2529 C54 P24705 oascsi.HttpClientUtil.createClient Creating new http client, config:maxConnections=128&maxConnectionsPerHost=32&followRedirects=false
> [junit4:junit4]   2> 15727 T2425 oascsi.HttpClientUtil.createClient Creating new http client, config:maxConnections=128&maxConnectionsPerHost=32&followRedirects=false
> [junit4:junit4]   2> 15728 T2451 C50 P24653 REQ /get {distrib=false&qt=/get&wt=javabin&version=2&getVersions=100} status=0 QTime=0 
> [junit4:junit4]   2> 15759 T2446 oascc.ZkStateReader.updateClusterState Updating cloud state from ZooKeeper... 
> [junit4:junit4]   2> 15771 T2445 oascc.ZkStateReader$2.process A cluster state change has occurred - updating...
> [junit4:junit4]   2> 15771 T2527 oascc.ZkStateReader$2.process A cluster state change has occurred - updating...
> [junit4:junit4]   2> 15771 T2513 oascc.ZkStateReader$2.process A cluster state change has occurred - updating...
> [junit4:junit4]   2> 15771 T2499 oascc.ZkStateReader$2.process A cluster state change has occurred - updating...
> [junit4:junit4]   2> 15771 T2459 oascc.ZkStateReader$2.process A cluster state change has occurred - updating...
> [junit4:junit4]   2> 15771 T2485 oascc.ZkStateReader$2.process A cluster state change has occurred - updating...
> [junit4:junit4]   2> 15771 T2471 oascc.ZkStateReader$2.process A cluster state change has occurred - updating...
> [junit4:junit4]   2> 16435 T2425 oejs.Server.doStart jetty-8.1.2.v20120308
> [junit4:junit4]   2> 16439 T2425 oejs.AbstractConnector.doStart Started SocketConnector@0.0.0.0:24716
> [junit4:junit4]   2> 16439 T2425 oasc.SolrResourceLoader.locateSolrHome JNDI not configured for solr (NoInitialContextEx)
> [junit4:junit4]   2> 16440 T2425 oasc.SolrResourceLoader.locateSolrHome using system property solr.solr.home: /usr/home/hudson/hudson-slave/workspace/Lucene-Solr-NightlyTests-4.x/solr/build/solr-core/test/J1/./solrtest-jetty7-1348435934666
> [junit4:junit4]   2> 16440 T2425 oasc.SolrResourceLoader.<init> new SolrResourceLoader for deduced Solr Home: '/usr/home/hudson/hudson-slave/workspace/Lucene-Solr-NightlyTests-4.x/solr/build/solr-core/test/J1/./solrtest-jetty7-1348435934666/'
> [junit4:junit4]   2>  C53_STATE=coll:collection1 core:collection1 props:{shard=shard1, roles=null, state=recovering, core=collection1, collection=collection1, node_name=127.0.0.1:24691_solr, base_url=http://127.0.0.1:24691/solr}
> [junit4:junit4]   2> 16460 T2515 C53 P24691 oasc.RecoveryStrategy.doRecovery Begin buffering updates. core=collection1
> [junit4:junit4]   2> 16460 T2515 C53 P24691 oasu.UpdateLog.bufferUpdates Starting to buffer updates. FSUpdateLog{state=ACTIVE, tlog=null}
> [junit4:junit4]   2> 16460 T2515 C53 P24691 oasc.RecoveryStrategy.replicate Attempting to replicate from http://127.0.0.1:24653/solr/collection1/. core=collection1
> [junit4:junit4]   2> 16460 T2515 C53 P24691 oascsi.HttpClientUtil.createClient Creating new http client, config:maxConnections=128&maxConnectionsPerHost=32&followRedirects=false
> [junit4:junit4]   2> 16477 T2425 oass.SolrDispatchFilter.init SolrDispatchFilter.init()
> [junit4:junit4]   2> 16477 T2457 C50 P24653 oasu.DirectUpdateHandler2.commit start commit{flags=0,_version_=0,optimize=false,openSearcher=true,waitSearcher=true,expungeDeletes=false,softCommit=false}
> [junit4:junit4]   2> 16477 T2425 oasc.SolrResourceLoader.locateSolrHome JNDI not configured for solr (NoInitialContextEx)
> [junit4:junit4]   2> 16478 T2425 oasc.SolrResourceLoader.locateSolrHome using system property solr.solr.home: /usr/home/hudson/hudson-slave/workspace/Lucene-Solr-NightlyTests-4.x/solr/build/solr-core/test/J1/./solrtest-jetty7-1348435934666
> [junit4:junit4]   2> 16478 T2425 oasc.CoreContainer$Initializer.initialize looking for solr.xml: /usr/home/hudson/hudson-slave/workspace/Lucene-Solr-NightlyTests-4.x/solr/build/solr-core/test/J1/./solrtest-jetty7-1348435934666/solr.xml
> [junit4:junit4]   2> 16479 T2425 oasc.CoreContainer.<init> New CoreContainer 513096112
> [junit4:junit4]   2> 16480 T2425 oasc.CoreContainer.load Loading CoreContainer using Solr Home: '/usr/home/hudson/hudson-slave/workspace/Lucene-Solr-NightlyTests-4.x/solr/build/solr-core/test/J1/./solrtest-jetty7-1348435934666/'
> [junit4:junit4]   2> 16480 T2457 C50 P24653 oass.SolrIndexSearcher.<init> Opening Searcher@56b30577 main
> [junit4:junit4]   2> 16480 T2425 oasc.SolrResourceLoader.<init> new SolrResourceLoader for directory: '/usr/home/hudson/hudson-slave/workspace/Lucene-Solr-NightlyTests-4.x/solr/build/solr-core/test/J1/./solrtest-jetty7-1348435934666/'
> [junit4:junit4]   2> 16481 T2457 C50 P24653 oasu.DirectUpdateHandler2.commit end_commit_flush
> [junit4:junit4]   2> 16482 T2460 oasc.SolrCore.registerSearcher [collection1] Registered new searcher Searcher@56b30577 main{StandardDirectoryReader(segments_1:1)}
> [junit4:junit4]   2> 16483 T2457 C50 P24653 /update {waitSearcher=true&commit=true&commit_end_point=true&wt=javabin&softCommit=false&version=2} {commit=} 0 6
> [junit4:junit4]   2> 16483 T2515 C53 P24691 oash.ReplicationHandler.inform Commits will be reserved for  10000
> [junit4:junit4]   2> 16483 T2515 C53 P24691 oash.SnapPuller.<init>  No value set for 'pollInterval'. Timer Task not started.
> [junit4:junit4]   2> 16486 T2455 C50 P24653 REQ /replication {command=indexversion&wt=javabin&qt=/replication&version=2} status=0 QTime=0 
> [junit4:junit4]   2> 16491 T2515 C53 P24691 oasc.SolrDeletionPolicy.onInit SolrDeletionPolicy.onInit: commits:num=1
> [junit4:junit4]   2> 		commit{dir=NRTCachingDirectory(org.apache.lucene.store.NIOFSDirectory@/usr/home/hudson/hudson-slave/workspace/Lucene-Solr-NightlyTests-4.x/solr/build/solr-core/test/J1/org.apache.solr.cloud.SyncSliceTest-1348435918932/jetty5/index lockFactory=org.apache.lucene.store.NativeFSLockFactory@1ce70b2e; maxCacheMB=48.0 maxMergeSizeMB=4.0),segFN=segments_1,generation=1,filenames=[segments_1]
> [junit4:junit4]   2> 16491 T2515 C53 P24691 oasc.SolrDeletionPolicy.updateCommits newest commit = 1
> [junit4:junit4]   2> 16492 T2515 C53 P24691 oasu.DirectUpdateHandler2.commit start commit{flags=0,_version_=0,optimize=false,openSearcher=true,waitSearcher=true,expungeDeletes=false,softCommit=false}
> [junit4:junit4]   2> 16497 T2515 C53 P24691 oasc.SolrDeletionPolicy.onCommit SolrDeletionPolicy.onCommit: commits:num=2
> [junit4:junit4]   2> 		commit{dir=NRTCachingDirectory(org.apache.lucene.store.NIOFSDirectory@/usr/home/hudson/hudson-slave/workspace/Lucene-Solr-NightlyTests-4.x/solr/build/solr-core/test/J1/org.apache.solr.cloud.SyncSliceTest-1348435918932/jetty5/index lockFactory=org.apache.lucene.store.NativeFSLockFactory@1ce70b2e; maxCacheMB=48.0 maxMergeSizeMB=4.0),segFN=segments_1,generation=1,filenames=[segments_1]
> [junit4:junit4]   2> 		commit{dir=NRTCachingDirectory(org.apache.lucene.store.NIOFSDirectory@/usr/home/hudson/hudson-slave/workspace/Lucene-Solr-NightlyTests-4.x/solr/build/solr-core/test/J1/org.apache.solr.cloud.SyncSliceTest-1348435918932/jetty5/index lockFactory=org.apache.lucene.store.NativeFSLockFactory@1ce70b2e; maxCacheMB=48.0 maxMergeSizeMB=4.0),segFN=segments_2,generation=2,filenames=[segments_2]
> [junit4:junit4]   2> 16497 T2515 C53 P24691 oasc.SolrDeletionPolicy.updateCommits newest commit = 2
> [junit4:junit4]   2> 16501 T2515 C53 P24691 oass.SolrIndexSearcher.<init> Opening Searcher@55c89f29 main
> [junit4:junit4]   2> 16502 T2515 C53 P24691 oasu.DirectUpdateHandler2.commit end_commit_flush
> [junit4:junit4]   2> 16503 T2514 oasc.SolrCore.registerSearcher [collection1] Registered new searcher Searcher@55c89f29 main{StandardDirectoryReader(segments_2:2)}
> [junit4:junit4]   2> 16504 T2515 C53 P24691 oasc.RecoveryStrategy.replay No replay needed. core=collection1
> [junit4:junit4]   2> 16504 T2515 C53 P24691 oasc.RecoveryStrategy.doRecovery Replication Recovery was successful - registering as Active. core=collection1
> [junit4:junit4]   2> 16505 T2515 C53 P24691 oasc.RecoveryStrategy.doRecovery Finished recovery process. core=collection1
> [junit4:junit4]   2> 16512 T2425 oasc.CoreContainer.load Registering Log Listener
> [junit4:junit4]   2> 16526 T2425 oasc.CoreContainer.initZooKeeper Zookeeper client=127.0.0.1:24639/solr
> [junit4:junit4]   2> 16527 T2425 oaz.ZooKeeper.<init> Initiating client connection, connectString=127.0.0.1:24639/solr sessionTimeout=5000 watcher=org.apache.solr.common.cloud.ConnectionManager@5d7bc668
> [junit4:junit4]   2> 16528 T2540 oaz.ClientCnxn$SendThread.startConnect Opening socket connection to server /127.0.0.1:24639
> [junit4:junit4]   2> 16528 T2425 oascc.ConnectionManager.waitForConnected Waiting for client to connect to ZooKeeper
> [junit4:junit4]   2> 16529 T2540 oaz.ClientCnxn$SendThread.primeConnection Socket connection established to localhost/127.0.0.1:24639, initiating session
> [junit4:junit4]   2> 16529 T2427 oazs.NIOServerCnxn$Factory.run Accepted socket connection from /140.211.11.196:24718
> [junit4:junit4]   2> 16530 T2427 oazs.NIOServerCnxn.readConnectRequest Client attempting to establish new session at /140.211.11.196:24718
> [junit4:junit4]   2> 16531 T2429 oazs.NIOServerCnxn.finishSessionInit Established session 0x139f50b40590009 with negotiated timeout 5000 for client /140.211.11.196:24718
> [junit4:junit4]   2> 16531 T2540 oaz.ClientCnxn$SendThread.readConnectResult Session establishment complete on server localhost/127.0.0.1:24639, sessionid = 0x139f50b40590009, negotiated timeout = 5000
> [junit4:junit4]   2> 16532 T2541 oascc.ConnectionManager.process Watcher org.apache.solr.common.cloud.ConnectionManager@5d7bc668 name:ZooKeeperConnection Watcher:127.0.0.1:24639/solr got event WatchedEvent state:SyncConnected type:None path:null path:null type:None
> [junit4:junit4]   2> 16532 T2425 oascc.ConnectionManager.waitForConnected Client is connected to ZooKeeper
> [junit4:junit4]   2> 16532 T2430 oazs.PrepRequestProcessor.pRequest Got user-level KeeperException when processing sessionid:0x139f50b40590009 type:create cxid:0x1 zxid:0xfffffffffffffffe txntype:unknown reqpath:n/a Error Path:/solr/overseer Error:KeeperErrorCode = NodeExists for /solr/overseer
> [junit4:junit4]   2> 16534 T2430 oazs.PrepRequestProcessor.pRequest Got user-level KeeperException when processing sessionid:0x139f50b40590009 type:create cxid:0x2 zxid:0xfffffffffffffffe txntype:unknown reqpath:n/a Error Path:/solr/overseer Error:KeeperErrorCode = NodeExists for /solr/overseer
> [junit4:junit4]   2> 16543 T2425 oasc.ZkController.createEphemeralLiveNode Register node as live in ZooKeeper:/live_nodes/127.0.0.1:24716_solr
> [junit4:junit4]   2> 16543 T2430 oazs.PrepRequestProcessor.pRequest Got user-level KeeperException when processing sessionid:0x139f50b40590009 type:delete cxid:0x4 zxid:0xfffffffffffffffe txntype:unknown reqpath:n/a Error Path:/solr/live_nodes/127.0.0.1:24716_solr Error:KeeperErrorCode = NoNode for /solr/live_nodes/127.0.0.1:24716_solr
> [junit4:junit4]   2> 16544 T2425 oascc.SolrZkClient.makePath makePath: /live_nodes/127.0.0.1:24716_solr
> [junit4:junit4]   2> 16546 T2459 oascc.ZkStateReader$3.process Updating live nodes
> [junit4:junit4]   2> 16546 T2485 oascc.ZkStateReader$3.process Updating live nodes
> [junit4:junit4]   2> 16546 T2527 oascc.ZkStateReader$3.process Updating live nodes
> [junit4:junit4]   2> 16546 T2513 oascc.ZkStateReader$3.process Updating live nodes
> [junit4:junit4]   2> 16546 T2499 oascc.ZkStateReader$3.process Updating live nodes
> [junit4:junit4]   2> 16547 T2425 oashc.HttpShardHandlerFactory.getParameter Setting socketTimeout to: 0
> [junit4:junit4]   2> 16546 T2445 oascc.ZkStateReader$3.process Updating live nodes
> [junit4:junit4]   2> 16548 T2425 oashc.HttpShardHandlerFactory.getParameter Setting urlScheme to: http://
> [junit4:junit4]   2> 16548 T2425 oashc.HttpShardHandlerFactory.getParameter Setting connTimeout to: 0
> [junit4:junit4]   2> 16549 T2425 oashc.HttpShardHandlerFactory.getParameter Setting maxConnectionsPerHost to: 20
> [junit4:junit4]   2> 16549 T2425 oashc.HttpShardHandlerFactory.getParameter Setting corePoolSize to: 0
> [junit4:junit4]   2> 16549 T2425 oashc.HttpShardHandlerFactory.getParameter Setting maximumPoolSize to: 2147483647
> [junit4:junit4]   2> 16550 T2425 oashc.HttpShardHandlerFactory.getParameter Setting maxThreadIdleTime to: 5
> [junit4:junit4]   2> 16550 T2425 oashc.HttpShardHandlerFactory.getParameter Setting sizeOfQueue to: -1
> [junit4:junit4]   2> 16551 T2425 oashc.HttpShardHandlerFactory.getParameter Setting fairnessPolicy to: false
> [junit4:junit4]   2> 16551 T2425 oascsi.HttpClientUtil.createClient Creating new http client, config:maxConnectionsPerHost=20&maxConnections=10000&socketTimeout=0&connTimeout=0&retry=false
> [junit4:junit4]   2> 16546 T2471 oascc.ZkStateReader$3.process Updating live nodes
> [junit4:junit4]   2> 16568 T2425 oascc.ZkStateReader.createClusterStateWatchersAndUpdate Updating cluster state from ZooKeeper... 
> [junit4:junit4]   2> 16573 T2425 oasc.CoreContainer.create Creating SolrCore 'collection1' using instanceDir: /usr/home/hudson/hudson-slave/workspace/Lucene-Solr-NightlyTests-4.x/solr/build/solr-core/test/J1/./solrtest-jetty7-1348435934666/collection1
> [junit4:junit4]   2> 16574 T2425 oasc.ZkController.createCollectionZkNode Check for collection zkNode:collection1
> [junit4:junit4]   2> 16574 T2425 oasc.ZkController.createCollectionZkNode Collection zkNode exists
> [junit4:junit4]   2> 16575 T2425 oasc.ZkController.readConfigName Load collection config from:/collections/collection1
> [junit4:junit4]   2> 16576 T2425 oasc.SolrResourceLoader.<init> new SolrResourceLoader for directory: '/usr/home/hudson/hudson-slave/workspace/Lucene-Solr-NightlyTests-4.x/solr/build/solr-core/test/J1/./solrtest-jetty7-1348435934666/collection1/'
> [junit4:junit4]   2> 16577 T2425 oasc.SolrResourceLoader.replaceClassLoader Adding 'file:/usr/home/hudson/hudson-slave/workspace/Lucene-Solr-NightlyTests-4.x/solr/build/solr-core/test/J1/solrtest-jetty7-1348435934666/collection1/lib/classes/' to classloader
> [junit4:junit4]   2> 16578 T2425 oasc.SolrResourceLoader.replaceClassLoader Adding 'file:/usr/home/hudson/hudson-slave/workspace/Lucene-Solr-NightlyTests-4.x/solr/build/solr-core/test/J1/solrtest-jetty7-1348435934666/collection1/lib/README' to classloader
> [junit4:junit4]   2> 16646 T2425 oasc.SolrConfig.<init> Using Lucene MatchVersion: LUCENE_41
> [junit4:junit4]   2> 16713 T2425 oasc.SolrConfig.<init> Loaded SolrConfig: solrconfig.xml
> [junit4:junit4]   2> 16776 T2446 oascc.ZkStateReader.updateClusterState Updating cloud state from ZooKeeper... 
> [junit4:junit4]   2> 16791 T2459 oascc.ZkStateReader$2.process A cluster state change has occurred - updating...
> [junit4:junit4]   2> 16791 T2499 oascc.ZkStateReader$2.process A cluster state change has occurred - updating...
> [junit4:junit4]   2> 16791 T2485 oascc.ZkStateReader$2.process A cluster state change has occurred - updating...
> [junit4:junit4]   2> 16791 T2513 oascc.ZkStateReader$2.process A cluster state change has occurred - updating...
> [junit4:junit4]   2> 16791 T2527 oascc.ZkStateReader$2.process A cluster state change has occurred - updating...
> [junit4:junit4]   2> 16791 T2445 oascc.ZkStateReader$2.process A cluster state change has occurred - updating...
> [junit4:junit4]   2> 16791 T2471 oascc.ZkStateReader$2.process A cluster state change has occurred - updating...
> [junit4:junit4]   2> 16814 T2541 oascc.ZkStateReader$2.process A cluster state change has occurred - updating...
> [junit4:junit4]   2> 16814 T2425 oass.IndexSchema.readSchema Reading Solr Schema
> [junit4:junit4]   2> 16821 T2425 oass.IndexSchema.readSchema Schema name=test
> [junit4:junit4]   2> 17413 T2425 oass.OpenExchangeRatesOrgProvider.init Initialized with rates=open-exchange-rates.json, refreshInterval=1440.
> [junit4:junit4]   2> 17425 T2425 oass.IndexSchema.readSchema default search field in schema is text
> [junit4:junit4]   2> 17429 T2425 oass.IndexSchema.readSchema unique key field: id
> [junit4:junit4]   2> 17445 T2425 oass.FileExchangeRateProvider.reload Reloading exchange rates from file currency.xml
> [junit4:junit4]   2> 17450 T2425 oass.FileExchangeRateProvider.reload Reloading exchange rates from file currency.xml
> [junit4:junit4]   2> 17455 T2425 oass.OpenExchangeRatesOrgProvider.reload Reloading exchange rates from open-exchange-rates.json
> [junit4:junit4]   2> 17456 T2425 oass.OpenExchangeRatesOrgProvider.reload Reloading exchange rates from open-exchange-rates.json
> [junit4:junit4]   2> 17457 T2425 oasc.SolrCore.<init> [collection1] Opening new SolrCore at /usr/home/hudson/hudson-slave/workspace/Lucene-Solr-NightlyTests-4.x/solr/build/solr-core/test/J1/./solrtest-jetty7-1348435934666/collection1/, dataDir=./org.apache.solr.cloud.SyncSliceTest-1348435918932/jetty7/
> [junit4:junit4]   2> 17458 T2425 oasc.JmxMonitoredMap.<init> JMX monitoring is enabled. Adding Solr mbeans to JMX Server
> 
> [...truncated too long message...]
> 
> r$1.process(LeaderElector.java:131)
> [junit4:junit4]   2> 	at org.apache.zookeeper.ClientCnxn$EventThread.processEvent(ClientCnxn.java:526)
> [junit4:junit4]   2> 	at org.apache.zookeeper.ClientCnxn$EventThread.run(ClientCnxn.java:502)
> [junit4:junit4]   2> 
> [junit4:junit4]   2> 308121 T2444 oasc.JmxMonitoredMap$SolrDynamicMBean.getMBeanInfo WARNING Could not getStatistics on info bean Lazy[solr.ReplicationHandler] java.lang.IllegalArgumentException: /usr/home/hudson/hudson-slave/workspace/Lucene-Solr-NightlyTests-4.x/solr/build/solr-core/test/J0/org.apache.solr.cloud.BasicDistributedZk2Test-1348436349023/jetty4/index does not exist
> [junit4:junit4]   2> 	at org.apache.commons.io.FileUtils.sizeOfDirectory(FileUtils.java:2074)
> [junit4:junit4]   2> 	at org.apache.solr.handler.ReplicationHandler.getIndexSize(ReplicationHandler.java:477)
> [junit4:junit4]   2> 	at org.apache.solr.handler.ReplicationHandler.getStatistics(ReplicationHandler.java:525)
> [junit4:junit4]   2> 	at org.apache.solr.core.RequestHandlers$LazyRequestHandlerWrapper.getStatistics(RequestHandlers.java:310)
> [junit4:junit4]   2> 	at org.apache.solr.core.JmxMonitoredMap$SolrDynamicMBean.getMBeanInfo(JmxMonitoredMap.java:231)
> [junit4:junit4]   2> 	at com.sun.jmx.interceptor.DefaultMBeanServerInterceptor.getClassName(DefaultMBeanServerInterceptor.java:1824)
> [junit4:junit4]   2> 	at com.sun.jmx.interceptor.DefaultMBeanServerInterceptor.safeGetClassName(DefaultMBeanServerInterceptor.java:1661)
> [junit4:junit4]   2> 	at com.sun.jmx.interceptor.DefaultMBeanServerInterceptor.checkMBeanPermission(DefaultMBeanServerInterceptor.java:1833)
> [junit4:junit4]   2> 	at com.sun.jmx.interceptor.DefaultMBeanServerInterceptor.exclusiveUnregisterMBean(DefaultMBeanServerInterceptor.java:436)
> [junit4:junit4]   2> 	at com.sun.jmx.interceptor.DefaultMBeanServerInterceptor.unregisterMBean(DefaultMBeanServerInterceptor.java:421)
> [junit4:junit4]   2> 	at com.sun.jmx.mbeanserver.JmxMBeanServer.unregisterMBean(JmxMBeanServer.java:540)
> [junit4:junit4]   2> 	at org.apache.solr.core.JmxMonitoredMap.unregister(JmxMonitoredMap.java:175)
> [junit4:junit4]   2> 	at org.apache.solr.core.JmxMonitoredMap.clear(JmxMonitoredMap.java:116)
> [junit4:junit4]   2> 	at org.apache.solr.core.SolrCore.close(SolrCore.java:864)
> [junit4:junit4]   2> 	at org.apache.solr.cloud.ShardLeaderElectionContext.runLeaderProcess(ElectionContext.java:213)
> [junit4:junit4]   2> 	at org.apache.solr.cloud.LeaderElector.runIamLeaderProcess(LeaderElector.java:158)
> [junit4:junit4]   2> 	at org.apache.solr.cloud.LeaderElector.checkIfIamLeader(LeaderElector.java:102)
> [junit4:junit4]   2> 	at org.apache.solr.cloud.LeaderElector.access$000(LeaderElector.java:56)
> [junit4:junit4]   2> 	at org.apache.solr.cloud.LeaderElector$1.process(LeaderElector.java:131)
> [junit4:junit4]   2> 	at org.apache.zookeeper.ClientCnxn$EventThread.processEvent(ClientCnxn.java:526)
> [junit4:junit4]   2> 	at org.apache.zookeeper.ClientCnxn$EventThread.run(ClientCnxn.java:502)
> [junit4:junit4]   2> 
> [junit4:junit4]   2> 308124 T2444 oasc.SolrCore.closeSearcher [collection1] Closing main searcher on request.
> [junit4:junit4]   2> 308126 T2444 oasu.DirectUpdateHandler2.close closing DirectUpdateHandler2{commits=5,autocommits=0,soft autocommits=0,optimizes=0,rollbacks=0,expungeDeletes=0,docsPending=0,adds=0,deletesById=0,deletesByQuery=0,errors=0,cumulative_adds=35,cumulative_deletesById=0,cumulative_deletesByQuery=0,cumulative_errors=0}
> [junit4:junit4]   2> 308126 T2444 oasu.DefaultSolrCoreState.decref SolrCoreState ref count has reached 0 - closing IndexWriter
> [junit4:junit4]   2> 308128 T2444 oasu.DefaultSolrCoreState.decref Closing SolrCoreState - canceling any ongoing recovery
> [junit4:junit4]   2> 308129 T2444 oascc.ZkStateReader$3.process Updating live nodes
> [junit4:junit4]   2> 308129 T2444 oascc.ZkStateReader$3.process WARNING ZooKeeper watch triggered, but Solr cannot talk to ZK
> [junit4:junit4]   2> 308129 T2444 oascc.ZkStateReader$2.process A cluster state change has occurred - updating...
> [junit4:junit4]   2> 308129 T2444 oascc.ZkStateReader$2.process WARNING ZooKeeper watch triggered, but Solr cannot talk to ZK
> [junit4:junit4]   2> 308129 T2444 oascc.ConnectionManager.process Watcher org.apache.solr.common.cloud.ConnectionManager@4b257d86 name:ZooKeeperConnection Watcher:127.0.0.1:22816/solr got event WatchedEvent state:Disconnected type:None path:null path:null type:None
> [junit4:junit4]   2> 308129 T2444 oascc.ConnectionManager.process Client->ZooKeeper status change trigger but we are already closed
> [junit4:junit4]   2> 308130 T2444 oaz.ClientCnxn$EventThread.run EventThread shut down
> [junit4:junit4]   2> NOTE: test params are: codec=Lucene40: {n_f1=PostingsFormat(name=Asserting), foo_b=PostingsFormat(name=Memory doPackFST= false), foo_d=Lucene40(minBlockSize=59 maxBlockSize=147), foo_f=PostingsFormat(name=Memory doPackFST= false), n_tl1=PostingsFormat(name=Asserting), n_d1=Pulsing40(freqCutoff=7 minBlockSize=59 maxBlockSize=147), rnd_b=Lucene40(minBlockSize=59 maxBlockSize=147), intDefault=PostingsFormat(name=Asserting), n_td1=PostingsFormat(name=Asserting), id=Lucene40(minBlockSize=59 maxBlockSize=147), timestamp=Pulsing40(freqCutoff=7 minBlockSize=59 maxBlockSize=147), range_facet_sl=Lucene40(minBlockSize=59 maxBlockSize=147), range_facet_si=Pulsing40(freqCutoff=7 minBlockSize=59 maxBlockSize=147), oddField_s=Lucene40(minBlockSize=59 maxBlockSize=147), multiDefault=Pulsing40(freqCutoff=7 minBlockSize=59 maxBlockSize=147), n_tf1=Pulsing40(freqCutoff=7 minBlockSize=59 maxBlockSize=147), n_dt1=PostingsFormat(name=Asserting), n_ti1=Lucene40(minBlockSize=59 maxBlockSize=147), range_facet_l=Pulsing40(freqCutoff=7 minBlockSize=59 maxBlockSize=147), text=PostingsFormat(name=Memory doPackFST= false), _version_=PostingsFormat(name=Asserting), SubjectTerms_mfacet=PostingsFormat(name=Asserting), a_t=Pulsing40(freqCutoff=7 minBlockSize=59 maxBlockSize=147), n_tdt1=PostingsFormat(name=Asserting), other_tl1=PostingsFormat(name=Asserting), n_l1=Pulsing40(freqCutoff=7 minBlockSize=59 maxBlockSize=147), a_si=PostingsFormat(name=Asserting)}, sim=DefaultSimilarity, locale=ar_MA, timezone=Europe/Uzhgorod
> [junit4:junit4]   2> NOTE: FreeBSD 9.0-RELEASE amd64/Sun Microsystems Inc. 1.6.0_32 (64-bit)/cpus=16,threads=2,free=107752864,total=285147136
> [junit4:junit4]   2> NOTE: All tests run in this JVM: [PluginInfoTest, DistributedSpellCheckComponentTest, NoCacheHeaderTest, TestFastOutputStream, TestCoreContainer, TestNumberUtils, ZkControllerTest, FileBasedSpellCheckerTest, SolrPluginUtilsTest, ClusterStateTest, SortByFunctionTest, CoreContainerCoreInitFailuresTest, AutoCommitTest, SimplePostToolTest, RequestHandlersTest, TestLFUCache, SimpleFacetsTest, TestBadConfig, DirectSolrConnectionTest, FastVectorHighlighterTest, BasicDistributedZkTest, TestElisionMultitermQuery, TestIBSimilarityFactory, TestSolrQueryParser, SolrCoreCheckLockOnStartupTest, TestRangeQuery, TestFastLRUCache, TestSystemIdResolver, TestFaceting, BadComponentTest, TestConfig, JsonLoaderTest, TestLMDirichletSimilarityFactory, TestWordDelimiterFilterFactory, CacheHeaderTest, TestPerFieldSimilarity, SystemInfoHandlerTest, TestExtendedDismaxParser, CurrencyFieldTest, SuggesterWFSTTest, TestDefaultSimilarityFactory, SpellCheckComponentTest, TestLMJelinekMercerSimilarityFactory, DistanceFunctionTest, TestReload, TermsComponentTest, MoreLikeThisHandlerTest, PreAnalyzedFieldTest, SpatialFilterTest, UpdateRequestProcessorFactoryTest, SOLR749Test, TestPHPSerializedResponseWriter, TestBinaryResponseWriter, TestFiltering, SuggesterFSTTest, FullSolrCloudDistribCmdsTest, TestReplicationHandler, LeaderElectionIntegrationTest, TestRealTimeGet, TestRandomFaceting, DirectSolrSpellCheckerTest, ConvertedLegacyTest, PeerSyncTest, QueryElevationComponentTest, BasicFunctionalityTest, SignatureUpdateProcessorFactoryTest, TestJmxIntegration, SampleTest, TestIndexSearcher, CoreAdminHandlerTest, SolrRequestParserTest, PolyFieldTest, MBeansHandlerTest, TestPseudoReturnFields, IndexSchemaTest, QueryParsingTest, TestQueryTypes, PingRequestHandlerTest, TestSurroundQueryParser, IndexSchemaRuntimeFieldTest, SearchHandlerTest, CopyFieldTest, LoggingHandlerTest, SuggesterTSTTest, UniqFieldsUpdateProcessorFactoryTest, UpdateParamsTest, CSVRequestHandlerTest, ShowFileRequestHandlerTest, TestSearchPerf, NotRequiredUniqueKeyTest, TestSolrDeletionPolicy1, TestLuceneMatchVersion, TestIndexingPerformance, AlternateDirectoryTest, FieldMutatingUpdateProcessorTest, HighlighterConfigTest, DefaultValueUpdateProcessorTest, TestMergePolicyConfig, TestXIncludeConfig, TestQuerySenderListener, TestCollationField, SolrIndexConfigTest, NumericFieldsTest, OutputWriterTest, EchoParamsTest, LegacyHTMLStripCharFilterTest, DateFieldTest, TestSuggestSpellingConverter, DOMUtilTest, TestUtils, ZkNodePropsTest, CircularListTest, TestDocumentBuilder, TestCharFilters, TestCollationKeyRangeQueries, BasicDistributedZk2Test]
> [junit4:junit4] Completed on J0 in 308.57s, 1 test, 1 failure <<< FAILURES!
> 
> [...truncated 11 lines...]
> BUILD FAILED
> /usr/home/hudson/hudson-slave/workspace/Lucene-Solr-NightlyTests-4.x/build.xml:32: The following error occurred while executing this line:
> /usr/home/hudson/hudson-slave/workspace/Lucene-Solr-NightlyTests-4.x/solr/build.xml:179: The following error occurred while executing this line:
> /usr/home/hudson/hudson-slave/workspace/Lucene-Solr-NightlyTests-4.x/lucene/module-build.xml:63: The following error occurred while executing this line:
> /usr/home/hudson/hudson-slave/workspace/Lucene-Solr-NightlyTests-4.x/lucene/common-build.xml:1141: The following error occurred while executing this line:
> /usr/home/hudson/hudson-slave/workspace/Lucene-Solr-NightlyTests-4.x/lucene/common-build.xml:814: There were test failures: 231 suites, 954 tests, 2 failures, 21 ignored (3 assumptions)
> 
> Total time: 112 minutes 33 seconds
> Build step 'Invoke Ant' marked build as failure
> Recording test results
> Email was triggered for: Failure
> Sending email for trigger: Failure
> 
> 
> 
> ---------------------------------------------------------------------
> To unsubscribe, e-mail: dev-unsubscribe@lucene.apache.org
> For additional commands, e-mail: dev-help@lucene.apache.org


---------------------------------------------------------------------
To unsubscribe, e-mail: dev-unsubscribe@lucene.apache.org
For additional commands, e-mail: dev-help@lucene.apache.org


Mime
View raw message