lucene-dev mailing list archives

Site index · List index
Message view « Date » · « Thread »
Top « Date » · « Thread »
From Policeman Jenkins Server <jenk...@sd-datasolutions.de>
Subject [JENKINS] Lucene-Solr-trunk-Linux (64bit/ibm-j9-jdk6) - Build # 792 - Still Failing!
Date Sat, 01 Sep 2012 00:41:51 GMT
Build: http://jenkins.sd-datasolutions.de/job/Lucene-Solr-trunk-Linux/792/
Java: 64bit/ibm-j9-jdk6 -Xjit:exclude={org/apache/lucene/util/fst/FST.pack(IIF)Lorg/apache/lucene/util/fst/FST;}

1 tests failed.
REGRESSION:  org.apache.lucene.search.TestShardSearching.testSimple

Error Message:


Stack Trace:
java.lang.AssertionError
	at __randomizedtesting.SeedInfo.seed([477363D918E6C65:3CC412C3B67DB8B4]:0)
	at org.apache.lucene.search.TestShardSearching.testSimple(TestShardSearching.java:247)
	at sun.reflect.NativeMethodAccessorImpl.invoke0(Native Method)
	at sun.reflect.NativeMethodAccessorImpl.invoke(NativeMethodAccessorImpl.java:48)
	at sun.reflect.DelegatingMethodAccessorImpl.invoke(DelegatingMethodAccessorImpl.java:25)
	at java.lang.reflect.Method.invoke(Method.java:600)
	at com.carrotsearch.randomizedtesting.RandomizedRunner.invoke(RandomizedRunner.java:1559)
	at com.carrotsearch.randomizedtesting.RandomizedRunner.access$600(RandomizedRunner.java:79)
	at com.carrotsearch.randomizedtesting.RandomizedRunner$6.evaluate(RandomizedRunner.java:737)
	at com.carrotsearch.randomizedtesting.RandomizedRunner$7.evaluate(RandomizedRunner.java:773)
	at com.carrotsearch.randomizedtesting.RandomizedRunner$8.evaluate(RandomizedRunner.java:787)
	at org.apache.lucene.util.TestRuleSetupTeardownChained$1.evaluate(TestRuleSetupTeardownChained.java:50)
	at org.apache.lucene.util.TestRuleFieldCacheSanity$1.evaluate(TestRuleFieldCacheSanity.java:51)
	at org.apache.lucene.util.AbstractBeforeAfterRule$1.evaluate(AbstractBeforeAfterRule.java:45)
	at com.carrotsearch.randomizedtesting.rules.SystemPropertiesInvariantRule$1.evaluate(SystemPropertiesInvariantRule.java:55)
	at org.apache.lucene.util.TestRuleThreadAndTestName$1.evaluate(TestRuleThreadAndTestName.java:48)
	at org.apache.lucene.util.TestRuleIgnoreAfterMaxFailures$1.evaluate(TestRuleIgnoreAfterMaxFailures.java:70)
	at org.apache.lucene.util.TestRuleMarkFailure$1.evaluate(TestRuleMarkFailure.java:48)
	at com.carrotsearch.randomizedtesting.rules.StatementAdapter.evaluate(StatementAdapter.java:36)
	at com.carrotsearch.randomizedtesting.ThreadLeakControl$StatementRunner.run(ThreadLeakControl.java:345)
	at com.carrotsearch.randomizedtesting.ThreadLeakControl.forkTimeoutingTask(ThreadLeakControl.java:769)
	at com.carrotsearch.randomizedtesting.ThreadLeakControl$3.evaluate(ThreadLeakControl.java:429)
	at com.carrotsearch.randomizedtesting.RandomizedRunner.runSingleTest(RandomizedRunner.java:746)
	at com.carrotsearch.randomizedtesting.RandomizedRunner$3.evaluate(RandomizedRunner.java:648)
	at com.carrotsearch.randomizedtesting.RandomizedRunner$4.evaluate(RandomizedRunner.java:682)
	at com.carrotsearch.randomizedtesting.RandomizedRunner$5.evaluate(RandomizedRunner.java:693)
	at org.apache.lucene.util.AbstractBeforeAfterRule$1.evaluate(AbstractBeforeAfterRule.java:45)
	at org.apache.lucene.util.TestRuleStoreClassName$1.evaluate(TestRuleStoreClassName.java:42)
	at com.carrotsearch.randomizedtesting.rules.SystemPropertiesInvariantRule$1.evaluate(SystemPropertiesInvariantRule.java:55)
	at com.carrotsearch.randomizedtesting.rules.NoShadowingOrOverridesOnMethodsRule$1.evaluate(NoShadowingOrOverridesOnMethodsRule.java:39)
	at com.carrotsearch.randomizedtesting.rules.NoShadowingOrOverridesOnMethodsRule$1.evaluate(NoShadowingOrOverridesOnMethodsRule.java:39)
	at org.apache.lucene.util.TestRuleAssertionsRequired$1.evaluate(TestRuleAssertionsRequired.java:40)
	at org.apache.lucene.util.TestRuleMarkFailure$1.evaluate(TestRuleMarkFailure.java:48)
	at org.apache.lucene.util.TestRuleIgnoreAfterMaxFailures$1.evaluate(TestRuleIgnoreAfterMaxFailures.java:70)
	at org.apache.lucene.util.TestRuleIgnoreTestSuites$1.evaluate(TestRuleIgnoreTestSuites.java:55)
	at com.carrotsearch.randomizedtesting.rules.StatementAdapter.evaluate(StatementAdapter.java:36)
	at com.carrotsearch.randomizedtesting.ThreadLeakControl$StatementRunner.run(ThreadLeakControl.java:345)
	at java.lang.Thread.run(Thread.java:736)




Build Log:
[...truncated 547 lines...]
[junit4:junit4] Suite: org.apache.lucene.search.TestShardSearching
[junit4:junit4]   2> NOTE: reproduce with: ant test  -Dtestcase=TestShardSearching -Dtests.method=testSimple
-Dtests.seed=477363D918E6C65 -Dtests.multiplier=3 -Dtests.slow=true -Dtests.locale=es_MX -Dtests.timezone=Etc/GMT-2
-Dtests.file.encoding=US-ASCII
[junit4:junit4] FAILURE 2.84s J0 | TestShardSearching.testSimple <<<
[junit4:junit4]    > Throwable #1: java.lang.AssertionError
[junit4:junit4]    > 	at __randomizedtesting.SeedInfo.seed([477363D918E6C65:3CC412C3B67DB8B4]:0)
[junit4:junit4]    > 	at org.apache.lucene.search.TestShardSearching.testSimple(TestShardSearching.java:247)
[junit4:junit4]    > 	at sun.reflect.NativeMethodAccessorImpl.invoke0(Native Method)
[junit4:junit4]    > 	at sun.reflect.NativeMethodAccessorImpl.invoke(NativeMethodAccessorImpl.java:48)
[junit4:junit4]    > 	at sun.reflect.DelegatingMethodAccessorImpl.invoke(DelegatingMethodAccessorImpl.java:25)
[junit4:junit4]    > 	at java.lang.reflect.Method.invoke(Method.java:600)
[junit4:junit4]    > 	at com.carrotsearch.randomizedtesting.RandomizedRunner.invoke(RandomizedRunner.java:1559)
[junit4:junit4]    > 	at com.carrotsearch.randomizedtesting.RandomizedRunner.access$600(RandomizedRunner.java:79)
[junit4:junit4]    > 	at com.carrotsearch.randomizedtesting.RandomizedRunner$6.evaluate(RandomizedRunner.java:737)
[junit4:junit4]    > 	at com.carrotsearch.randomizedtesting.RandomizedRunner$7.evaluate(RandomizedRunner.java:773)
[junit4:junit4]    > 	at com.carrotsearch.randomizedtesting.RandomizedRunner$8.evaluate(RandomizedRunner.java:787)
[junit4:junit4]    > 	at org.apache.lucene.util.TestRuleSetupTeardownChained$1.evaluate(TestRuleSetupTeardownChained.java:50)
[junit4:junit4]    > 	at org.apache.lucene.util.TestRuleFieldCacheSanity$1.evaluate(TestRuleFieldCacheSanity.java:51)
[junit4:junit4]    > 	at org.apache.lucene.util.AbstractBeforeAfterRule$1.evaluate(AbstractBeforeAfterRule.java:45)
[junit4:junit4]    > 	at com.carrotsearch.randomizedtesting.rules.SystemPropertiesInvariantRule$1.evaluate(SystemPropertiesInvariantRule.java:55)
[junit4:junit4]    > 	at org.apache.lucene.util.TestRuleThreadAndTestName$1.evaluate(TestRuleThreadAndTestName.java:48)
[junit4:junit4]    > 	at org.apache.lucene.util.TestRuleIgnoreAfterMaxFailures$1.evaluate(TestRuleIgnoreAfterMaxFailures.java:70)
[junit4:junit4]    > 	at org.apache.lucene.util.TestRuleMarkFailure$1.evaluate(TestRuleMarkFailure.java:48)
[junit4:junit4]    > 	at com.carrotsearch.randomizedtesting.rules.StatementAdapter.evaluate(StatementAdapter.java:36)
[junit4:junit4]    > 	at com.carrotsearch.randomizedtesting.ThreadLeakControl$StatementRunner.run(ThreadLeakControl.java:345)
[junit4:junit4]    > 	at com.carrotsearch.randomizedtesting.ThreadLeakControl.forkTimeoutingTask(ThreadLeakControl.java:769)
[junit4:junit4]    > 	at com.carrotsearch.randomizedtesting.ThreadLeakControl$3.evaluate(ThreadLeakControl.java:429)
[junit4:junit4]    > 	at com.carrotsearch.randomizedtesting.RandomizedRunner.runSingleTest(RandomizedRunner.java:746)
[junit4:junit4]    > 	at com.carrotsearch.randomizedtesting.RandomizedRunner$3.evaluate(RandomizedRunner.java:648)
[junit4:junit4]    > 	at com.carrotsearch.randomizedtesting.RandomizedRunner$4.evaluate(RandomizedRunner.java:682)
[junit4:junit4]    > 	at com.carrotsearch.randomizedtesting.RandomizedRunner$5.evaluate(RandomizedRunner.java:693)
[junit4:junit4]    > 	at org.apache.lucene.util.AbstractBeforeAfterRule$1.evaluate(AbstractBeforeAfterRule.java:45)
[junit4:junit4]    > 	at org.apache.lucene.util.TestRuleStoreClassName$1.evaluate(TestRuleStoreClassName.java:42)
[junit4:junit4]    > 	at com.carrotsearch.randomizedtesting.rules.SystemPropertiesInvariantRule$1.evaluate(SystemPropertiesInvariantRule.java:55)
[junit4:junit4]    > 	at com.carrotsearch.randomizedtesting.rules.NoShadowingOrOverridesOnMethodsRule$1.evaluate(NoShadowingOrOverridesOnMethodsRule.java:39)
[junit4:junit4]    > 	at com.carrotsearch.randomizedtesting.rules.NoShadowingOrOverridesOnMethodsRule$1.evaluate(NoShadowingOrOverridesOnMethodsRule.java:39)
[junit4:junit4]    > 	at org.apache.lucene.util.TestRuleAssertionsRequired$1.evaluate(TestRuleAssertionsRequired.java:40)
[junit4:junit4]    > 	at org.apache.lucene.util.TestRuleMarkFailure$1.evaluate(TestRuleMarkFailure.java:48)
[junit4:junit4]    > 	at org.apache.lucene.util.TestRuleIgnoreAfterMaxFailures$1.evaluate(TestRuleIgnoreAfterMaxFailures.java:70)
[junit4:junit4]    > 	at org.apache.lucene.util.TestRuleIgnoreTestSuites$1.evaluate(TestRuleIgnoreTestSuites.java:55)
[junit4:junit4]    > 	at com.carrotsearch.randomizedtesting.rules.StatementAdapter.evaluate(StatementAdapter.java:36)
[junit4:junit4]    > 	at com.carrotsearch.randomizedtesting.ThreadLeakControl$StatementRunner.run(ThreadLeakControl.java:345)
[junit4:junit4]    > 	at java.lang.Thread.run(Thread.java:736)
[junit4:junit4]   2> NOTE: test params are: codec=Lucene40: {titleTokenized=PostingsFormat(name=Lucene40WithOrds),
body=Pulsing40(freqCutoff=2 minBlockSize=48 maxBlockSize=136), docid=PostingsFormat(name=NestedPulsing),
title=MockFixedIntBlock(blockSize=162), date=Pulsing40(freqCutoff=2 minBlockSize=48 maxBlockSize=136)},
sim=RandomSimilarityProvider(queryNorm=false,coord=no): {}, locale=es_MX, timezone=Etc/GMT-2
[junit4:junit4]   2> NOTE: Linux 3.2.0-29-generic amd64/IBM Corporation 1.6.0 (64-bit)/cpus=8,threads=1,free=24459440,total=52143104
[junit4:junit4]   2> NOTE: All tests run in this JVM: [TestSimpleExplanationsOfNonMatches,
TestFieldInfos, TestOmitPositions, TestExplanations, TestIndexWriterLockRelease, TestNoMergeScheduler,
TestPerSegmentDeletes, TestAtomicUpdate, Nested1, Nested2, Nested3, TestDirectory, TestMatchAllDocsQuery,
TestNumericUtils, TestBooleanScorer, TestSpanSearchEquivalence, TestDeterminism, TestSpanFirstQuery,
TestSearchAfter, TestField, TestMultiTermConstantScore, TestIndexWriter, TestNRTThreads, TestCrashCausesCorruptIndex,
TestDisjunctionMaxQuery, TestLevenshteinAutomata, TestRegexpRandom, TestAllFilesHaveCodecHeader,
TestMaxTermFrequency, TestIdentityHashSet, TestBackwardsCompatibility, TestParallelTermEnum,
TestMockCharFilter, TestPhrasePrefixQuery, TestIndexWriterConfig, TestTermScorer, TestWildcard,
TestBooleanOr, TestIndexWriterExceptions, TestDocCount, TestConjunctions, TestNoMergePolicy,
TestVersionComparator, TestDocValues, TestDocsAndPositions, TestWindowsMMap, TestGraphTokenizers,
TestSameTokenSamePosition, TestAutomatonQuery, TestUnicodeUtil, TestDeletionPolicy, TestUniqueTermCount,
TestTermsEnum2, TestRollingUpdates, TestIndexableField, TestIndexWriterNRTIsCurrent, TestMultiTermQueryRewrites,
TestSearch, TestArrayUtil, TestSetOnce, TestMultiMMap, TestShardSearching]
[junit4:junit4] Completed on J0 in 11.16s, 1 test, 1 failure <<< FAILURES!

[...truncated 611 lines...]
BUILD FAILED
/mnt/ssd/jenkins/workspace/Lucene-Solr-trunk-Linux/build.xml:29: The following error occurred
while executing this line:
/mnt/ssd/jenkins/workspace/Lucene-Solr-trunk-Linux/lucene/build.xml:49: The following error
occurred while executing this line:
/mnt/ssd/jenkins/workspace/Lucene-Solr-trunk-Linux/lucene/common-build.xml:1056: The following
error occurred while executing this line:
/mnt/ssd/jenkins/workspace/Lucene-Solr-trunk-Linux/lucene/common-build.xml:741: There were
test failures: 312 suites, 1776 tests, 1 failure, 19 ignored (11 assumptions)

Total time: 6 minutes 47 seconds
Build step 'Invoke Ant' marked build as failure
Recording test results
Description set: Java: 64bit/ibm-j9-jdk6 -Xjit:exclude={org/apache/lucene/util/fst/FST.pack(IIF)Lorg/apache/lucene/util/fst/FST;}
Email was triggered for: Failure
Sending email for trigger: Failure



Mime
View raw message