lucene-dev mailing list archives

Site index · List index
Message view « Date » · « Thread »
Top « Date » · « Thread »
From Apache Jenkins Server <jenk...@builds.apache.org>
Subject [JENKINS] Lucene-Solr-NightlyTests-trunk - Build # 42 - Still Failing
Date Sun, 23 Sep 2012 06:16:01 GMT
Build: https://builds.apache.org/job/Lucene-Solr-NightlyTests-trunk/42/

1 tests failed.
FAILED:  org.apache.solr.cloud.BasicDistributedZk2Test.testDistribSearch

Error Message:
Shard still reported as live in zk

Stack Trace:
java.lang.AssertionError: Shard still reported as live in zk
	at __randomizedtesting.SeedInfo.seed([F154E04B59402CE:8EF3C01CC2CB62F2]:0)
	at org.junit.Assert.fail(Assert.java:93)
	at org.apache.solr.cloud.AbstractFullDistribZkTestBase.waitToSeeNotLive(AbstractFullDistribZkTestBase.java:1225)
	at org.apache.solr.cloud.BasicDistributedZk2Test.brindDownShardIndexSomeDocsAndRecover(BasicDistributedZk2Test.java:190)
	at org.apache.solr.cloud.BasicDistributedZk2Test.doTest(BasicDistributedZk2Test.java:83)
	at org.apache.solr.BaseDistributedSearchTestCase.testDistribSearch(BaseDistributedSearchTestCase.java:695)
	at sun.reflect.NativeMethodAccessorImpl.invoke0(Native Method)
	at sun.reflect.NativeMethodAccessorImpl.invoke(NativeMethodAccessorImpl.java:57)
	at sun.reflect.DelegatingMethodAccessorImpl.invoke(DelegatingMethodAccessorImpl.java:43)
	at java.lang.reflect.Method.invoke(Method.java:616)
	at com.carrotsearch.randomizedtesting.RandomizedRunner.invoke(RandomizedRunner.java:1559)
	at com.carrotsearch.randomizedtesting.RandomizedRunner.access$600(RandomizedRunner.java:79)
	at com.carrotsearch.randomizedtesting.RandomizedRunner$6.evaluate(RandomizedRunner.java:737)
	at com.carrotsearch.randomizedtesting.RandomizedRunner$7.evaluate(RandomizedRunner.java:773)
	at com.carrotsearch.randomizedtesting.RandomizedRunner$8.evaluate(RandomizedRunner.java:787)
	at com.carrotsearch.randomizedtesting.rules.SystemPropertiesRestoreRule$1.evaluate(SystemPropertiesRestoreRule.java:53)
	at org.apache.lucene.util.TestRuleSetupTeardownChained$1.evaluate(TestRuleSetupTeardownChained.java:50)
	at org.apache.lucene.util.TestRuleFieldCacheSanity$1.evaluate(TestRuleFieldCacheSanity.java:51)
	at org.apache.lucene.util.AbstractBeforeAfterRule$1.evaluate(AbstractBeforeAfterRule.java:45)
	at com.carrotsearch.randomizedtesting.rules.SystemPropertiesInvariantRule$1.evaluate(SystemPropertiesInvariantRule.java:55)
	at org.apache.lucene.util.TestRuleThreadAndTestName$1.evaluate(TestRuleThreadAndTestName.java:48)
	at org.apache.lucene.util.TestRuleIgnoreAfterMaxFailures$1.evaluate(TestRuleIgnoreAfterMaxFailures.java:70)
	at org.apache.lucene.util.TestRuleMarkFailure$1.evaluate(TestRuleMarkFailure.java:48)
	at com.carrotsearch.randomizedtesting.rules.StatementAdapter.evaluate(StatementAdapter.java:36)
	at com.carrotsearch.randomizedtesting.ThreadLeakControl$StatementRunner.run(ThreadLeakControl.java:358)
	at com.carrotsearch.randomizedtesting.ThreadLeakControl.forkTimeoutingTask(ThreadLeakControl.java:782)
	at com.carrotsearch.randomizedtesting.ThreadLeakControl$3.evaluate(ThreadLeakControl.java:442)
	at com.carrotsearch.randomizedtesting.RandomizedRunner.runSingleTest(RandomizedRunner.java:746)
	at com.carrotsearch.randomizedtesting.RandomizedRunner$3.evaluate(RandomizedRunner.java:648)
	at com.carrotsearch.randomizedtesting.RandomizedRunner$4.evaluate(RandomizedRunner.java:682)
	at com.carrotsearch.randomizedtesting.RandomizedRunner$5.evaluate(RandomizedRunner.java:693)
	at com.carrotsearch.randomizedtesting.rules.StatementAdapter.evaluate(StatementAdapter.java:36)
	at com.carrotsearch.randomizedtesting.rules.SystemPropertiesRestoreRule$1.evaluate(SystemPropertiesRestoreRule.java:53)
	at org.apache.lucene.util.AbstractBeforeAfterRule$1.evaluate(AbstractBeforeAfterRule.java:45)
	at org.apache.lucene.util.TestRuleStoreClassName$1.evaluate(TestRuleStoreClassName.java:42)
	at com.carrotsearch.randomizedtesting.rules.SystemPropertiesInvariantRule$1.evaluate(SystemPropertiesInvariantRule.java:55)
	at com.carrotsearch.randomizedtesting.rules.NoShadowingOrOverridesOnMethodsRule$1.evaluate(NoShadowingOrOverridesOnMethodsRule.java:39)
	at com.carrotsearch.randomizedtesting.rules.NoShadowingOrOverridesOnMethodsRule$1.evaluate(NoShadowingOrOverridesOnMethodsRule.java:39)
	at com.carrotsearch.randomizedtesting.rules.StatementAdapter.evaluate(StatementAdapter.java:36)
	at org.apache.lucene.util.TestRuleAssertionsRequired$1.evaluate(TestRuleAssertionsRequired.java:43)
	at org.apache.lucene.util.TestRuleMarkFailure$1.evaluate(TestRuleMarkFailure.java:48)
	at org.apache.lucene.util.TestRuleIgnoreAfterMaxFailures$1.evaluate(TestRuleIgnoreAfterMaxFailures.java:70)
	at org.apache.lucene.util.TestRuleIgnoreTestSuites$1.evaluate(TestRuleIgnoreTestSuites.java:55)
	at com.carrotsearch.randomizedtesting.rules.StatementAdapter.evaluate(StatementAdapter.java:36)
	at com.carrotsearch.randomizedtesting.ThreadLeakControl$StatementRunner.run(ThreadLeakControl.java:358)
	at java.lang.Thread.run(Thread.java:679)




Build Log:
[...truncated 7768 lines...]
[junit4:junit4] Suite: org.apache.solr.cloud.BasicDistributedZk2Test
[junit4:junit4]   2> 3 T2874 oas.SolrTestCaseJ4.setUp ###Starting testDistribSearch
[junit4:junit4]   2> Creating dataDir: /usr/home/hudson/hudson-slave/workspace/Lucene-Solr-NightlyTests-trunk/solr/build/solr-core/test/J0/./solrtest-BasicDistributedZk2Test-1348380648427
[junit4:junit4]   2> 5 T2874 oasc.ZkTestServer.run STARTING ZK TEST SERVER
[junit4:junit4]   2> 8 T2875 oazs.ZooKeeperServer.setTickTime tickTime set to 1000
[junit4:junit4]   2> 9 T2875 oazs.NIOServerCnxn$Factory.<init> binding to port 0.0.0.0/0.0.0.0:0
[junit4:junit4]   2> 10 T2875 oazsp.FileTxnSnapLog.save Snapshotting: 0
[junit4:junit4]   2> 106 T2874 oasc.ZkTestServer.run start zk server on port:10308
[junit4:junit4]   2> 106 T2874 oaz.ZooKeeper.<init> Initiating client connection, connectString=127.0.0.1:10308 sessionTimeout=10000 watcher=org.apache.solr.common.cloud.ConnectionManager@37fb94b7
[junit4:junit4]   2> 107 T2880 oaz.ClientCnxn$SendThread.startConnect Opening socket connection to server /127.0.0.1:10308
[junit4:junit4]   2> 107 T2874 oascc.ConnectionManager.waitForConnected Waiting for client to connect to ZooKeeper
[junit4:junit4]   2> 108 T2880 oaz.ClientCnxn$SendThread.primeConnection Socket connection established to localhost/127.0.0.1:10308, initiating session
[junit4:junit4]   2> 109 T2876 oazs.NIOServerCnxn$Factory.run Accepted socket connection from /140.211.11.196:10309
[junit4:junit4]   2> 110 T2876 oazs.NIOServerCnxn.readConnectRequest Client attempting to establish new session at /140.211.11.196:10309
[junit4:junit4]   2> 110 T2878 oazsp.FileTxnLog.append Creating new log file: log.1
[junit4:junit4]   2> 119 T2878 oazs.NIOServerCnxn.finishSessionInit Established session 0x139f1bfe3f20000 with negotiated timeout 10000 for client /140.211.11.196:10309
[junit4:junit4]   2> 119 T2880 oaz.ClientCnxn$SendThread.readConnectResult Session establishment complete on server localhost/127.0.0.1:10308, sessionid = 0x139f1bfe3f20000, negotiated timeout = 10000
[junit4:junit4]   2> 119 T2881 oascc.ConnectionManager.process Watcher org.apache.solr.common.cloud.ConnectionManager@37fb94b7 name:ZooKeeperConnection Watcher:127.0.0.1:10308 got event WatchedEvent state:SyncConnected type:None path:null path:null type:None
[junit4:junit4]   2> 119 T2874 oascc.ConnectionManager.waitForConnected Client is connected to ZooKeeper
[junit4:junit4]   2> 120 T2874 oascc.SolrZkClient.makePath makePath: /solr
[junit4:junit4]   2> 122 T2879 oazs.PrepRequestProcessor.pRequest Processed session termination for sessionid: 0x139f1bfe3f20000
[junit4:junit4]   2> 123 T2881 oaz.ClientCnxn$EventThread.run EventThread shut down
[junit4:junit4]   2> 123 T2874 oaz.ZooKeeper.close Session: 0x139f1bfe3f20000 closed
[junit4:junit4]   2> 124 T2876 oazs.NIOServerCnxn.closeSock Closed socket connection for client /140.211.11.196:10309 which had sessionid 0x139f1bfe3f20000
[junit4:junit4]   2> 125 T2874 oaz.ZooKeeper.<init> Initiating client connection, connectString=127.0.0.1:10308/solr sessionTimeout=10000 watcher=org.apache.solr.common.cloud.ConnectionManager@6586b82
[junit4:junit4]   2> 125 T2882 oaz.ClientCnxn$SendThread.startConnect Opening socket connection to server /127.0.0.1:10308
[junit4:junit4]   2> 125 T2874 oascc.ConnectionManager.waitForConnected Waiting for client to connect to ZooKeeper
[junit4:junit4]   2> 126 T2882 oaz.ClientCnxn$SendThread.primeConnection Socket connection established to localhost/127.0.0.1:10308, initiating session
[junit4:junit4]   2> 127 T2876 oazs.NIOServerCnxn$Factory.run Accepted socket connection from /140.211.11.196:10310
[junit4:junit4]   2> 127 T2876 oazs.NIOServerCnxn.readConnectRequest Client attempting to establish new session at /140.211.11.196:10310
[junit4:junit4]   2> 128 T2878 oazs.NIOServerCnxn.finishSessionInit Established session 0x139f1bfe3f20001 with negotiated timeout 10000 for client /140.211.11.196:10310
[junit4:junit4]   2> 128 T2882 oaz.ClientCnxn$SendThread.readConnectResult Session establishment complete on server localhost/127.0.0.1:10308, sessionid = 0x139f1bfe3f20001, negotiated timeout = 10000
[junit4:junit4]   2> 129 T2883 oascc.ConnectionManager.process Watcher org.apache.solr.common.cloud.ConnectionManager@6586b82 name:ZooKeeperConnection Watcher:127.0.0.1:10308/solr got event WatchedEvent state:SyncConnected type:None path:null path:null type:None
[junit4:junit4]   2> 129 T2874 oascc.ConnectionManager.waitForConnected Client is connected to ZooKeeper
[junit4:junit4]   2> 129 T2874 oascc.SolrZkClient.makePath makePath: /collections/collection1
[junit4:junit4]   2> 133 T2874 oascc.SolrZkClient.makePath makePath: /collections/collection1/shards
[junit4:junit4]   2> 143 T2874 oascc.SolrZkClient.makePath makePath: /collections/control_collection
[junit4:junit4]   2> 145 T2874 oascc.SolrZkClient.makePath makePath: /collections/control_collection/shards
[junit4:junit4]   2> 148 T2874 oasc.AbstractZkTestCase.putConfig put /usr/home/hudson/hudson-slave/workspace/Lucene-Solr-NightlyTests-trunk/solr/build/solr-core/test-files/solr/collection1/conf/solrconfig.xml to /configs/conf1/solrconfig.xml
[junit4:junit4]   2> 148 T2874 oascc.SolrZkClient.makePath makePath: /configs/conf1/solrconfig.xml
[junit4:junit4]   2> 167 T2874 oasc.AbstractZkTestCase.putConfig put /usr/home/hudson/hudson-slave/workspace/Lucene-Solr-NightlyTests-trunk/solr/build/solr-core/test-files/solr/collection1/conf/schema.xml to /configs/conf1/schema.xml
[junit4:junit4]   2> 168 T2874 oascc.SolrZkClient.makePath makePath: /configs/conf1/schema.xml
[junit4:junit4]   2> 282 T2874 oasc.AbstractZkTestCase.putConfig put /usr/home/hudson/hudson-slave/workspace/Lucene-Solr-NightlyTests-trunk/solr/build/solr-core/test-files/solr/collection1/conf/solrconfig.xml to /configs/conf1/solrconfig.xml
[junit4:junit4]   2> 283 T2874 oascc.SolrZkClient.makePath makePath: /configs/conf1/solrconfig.xml
[junit4:junit4]   2> 286 T2874 oasc.AbstractZkTestCase.putConfig put /usr/home/hudson/hudson-slave/workspace/Lucene-Solr-NightlyTests-trunk/solr/build/solr-core/test-files/solr/collection1/conf/stopwords.txt to /configs/conf1/stopwords.txt
[junit4:junit4]   2> 287 T2874 oascc.SolrZkClient.makePath makePath: /configs/conf1/stopwords.txt
[junit4:junit4]   2> 289 T2874 oasc.AbstractZkTestCase.putConfig put /usr/home/hudson/hudson-slave/workspace/Lucene-Solr-NightlyTests-trunk/solr/build/solr-core/test-files/solr/collection1/conf/protwords.txt to /configs/conf1/protwords.txt
[junit4:junit4]   2> 290 T2874 oascc.SolrZkClient.makePath makePath: /configs/conf1/protwords.txt
[junit4:junit4]   2> 298 T2874 oasc.AbstractZkTestCase.putConfig put /usr/home/hudson/hudson-slave/workspace/Lucene-Solr-NightlyTests-trunk/solr/build/solr-core/test-files/solr/collection1/conf/currency.xml to /configs/conf1/currency.xml
[junit4:junit4]   2> 298 T2874 oascc.SolrZkClient.makePath makePath: /configs/conf1/currency.xml
[junit4:junit4]   2> 301 T2874 oasc.AbstractZkTestCase.putConfig put /usr/home/hudson/hudson-slave/workspace/Lucene-Solr-NightlyTests-trunk/solr/build/solr-core/test-files/solr/collection1/conf/open-exchange-rates.json to /configs/conf1/open-exchange-rates.json
[junit4:junit4]   2> 301 T2874 oascc.SolrZkClient.makePath makePath: /configs/conf1/open-exchange-rates.json
[junit4:junit4]   2> 304 T2874 oasc.AbstractZkTestCase.putConfig put /usr/home/hudson/hudson-slave/workspace/Lucene-Solr-NightlyTests-trunk/solr/build/solr-core/test-files/solr/collection1/conf/mapping-ISOLatin1Accent.txt to /configs/conf1/mapping-ISOLatin1Accent.txt
[junit4:junit4]   2> 305 T2874 oascc.SolrZkClient.makePath makePath: /configs/conf1/mapping-ISOLatin1Accent.txt
[junit4:junit4]   2> 308 T2874 oasc.AbstractZkTestCase.putConfig put /usr/home/hudson/hudson-slave/workspace/Lucene-Solr-NightlyTests-trunk/solr/build/solr-core/test-files/solr/collection1/conf/old_synonyms.txt to /configs/conf1/old_synonyms.txt
[junit4:junit4]   2> 309 T2874 oascc.SolrZkClient.makePath makePath: /configs/conf1/old_synonyms.txt
[junit4:junit4]   2> 311 T2874 oasc.AbstractZkTestCase.putConfig put /usr/home/hudson/hudson-slave/workspace/Lucene-Solr-NightlyTests-trunk/solr/build/solr-core/test-files/solr/collection1/conf/synonyms.txt to /configs/conf1/synonyms.txt
[junit4:junit4]   2> 312 T2874 oascc.SolrZkClient.makePath makePath: /configs/conf1/synonyms.txt
[junit4:junit4]   2> 319 T2879 oazs.PrepRequestProcessor.pRequest Processed session termination for sessionid: 0x139f1bfe3f20001
[junit4:junit4]   2> 321 T2883 oaz.ClientCnxn$EventThread.run EventThread shut down
[junit4:junit4]   2> 321 T2874 oaz.ZooKeeper.close Session: 0x139f1bfe3f20001 closed
[junit4:junit4]   2> 321 T2876 oazs.NIOServerCnxn.closeSock Closed socket connection for client /140.211.11.196:10310 which had sessionid 0x139f1bfe3f20001
[junit4:junit4]   2> 457 T2874 oejs.Server.doStart jetty-8.1.2.v20120308
[junit4:junit4]   2> 460 T2874 oejs.AbstractConnector.doStart Started SocketConnector@0.0.0.0:10311
[junit4:junit4]   2> 461 T2874 oasc.SolrResourceLoader.locateSolrHome JNDI not configured for solr (NoInitialContextEx)
[junit4:junit4]   2> 461 T2874 oasc.SolrResourceLoader.locateSolrHome using system property solr.solr.home: /usr/home/hudson/hudson-slave/workspace/Lucene-Solr-NightlyTests-trunk/solr/build/solr-core/test/J0/./org.apache.solr.cloud.BasicDistributedZk2Test-controljetty-1348380648745
[junit4:junit4]   2> 462 T2874 oasc.SolrResourceLoader.<init> new SolrResourceLoader for deduced Solr Home: '/usr/home/hudson/hudson-slave/workspace/Lucene-Solr-NightlyTests-trunk/solr/build/solr-core/test/J0/./org.apache.solr.cloud.BasicDistributedZk2Test-controljetty-1348380648745/'
[junit4:junit4]   2> 494 T2874 oass.SolrDispatchFilter.init SolrDispatchFilter.init()
[junit4:junit4]   2> 495 T2874 oasc.SolrResourceLoader.locateSolrHome JNDI not configured for solr (NoInitialContextEx)
[junit4:junit4]   2> 495 T2874 oasc.SolrResourceLoader.locateSolrHome using system property solr.solr.home: /usr/home/hudson/hudson-slave/workspace/Lucene-Solr-NightlyTests-trunk/solr/build/solr-core/test/J0/./org.apache.solr.cloud.BasicDistributedZk2Test-controljetty-1348380648745
[junit4:junit4]   2> 495 T2874 oasc.CoreContainer$Initializer.initialize looking for solr.xml: /usr/home/hudson/hudson-slave/workspace/Lucene-Solr-NightlyTests-trunk/solr/build/solr-core/test/J0/./org.apache.solr.cloud.BasicDistributedZk2Test-controljetty-1348380648745/solr.xml
[junit4:junit4]   2> 496 T2874 oasc.CoreContainer.<init> New CoreContainer 1045213624
[junit4:junit4]   2> 497 T2874 oasc.CoreContainer.load Loading CoreContainer using Solr Home: '/usr/home/hudson/hudson-slave/workspace/Lucene-Solr-NightlyTests-trunk/solr/build/solr-core/test/J0/./org.apache.solr.cloud.BasicDistributedZk2Test-controljetty-1348380648745/'
[junit4:junit4]   2> 497 T2874 oasc.SolrResourceLoader.<init> new SolrResourceLoader for directory: '/usr/home/hudson/hudson-slave/workspace/Lucene-Solr-NightlyTests-trunk/solr/build/solr-core/test/J0/./org.apache.solr.cloud.BasicDistributedZk2Test-controljetty-1348380648745/'
[junit4:junit4]   2> 520 T2874 oasc.CoreContainer.load Registering Log Listener
[junit4:junit4]   2> 535 T2874 oasc.CoreContainer.initZooKeeper Zookeeper client=127.0.0.1:10308/solr
[junit4:junit4]   2> 535 T2874 oaz.ZooKeeper.<init> Initiating client connection, connectString=127.0.0.1:10308/solr sessionTimeout=5000 watcher=org.apache.solr.common.cloud.ConnectionManager@1e78d958
[junit4:junit4]   2> 536 T2893 oaz.ClientCnxn$SendThread.startConnect Opening socket connection to server /127.0.0.1:10308
[junit4:junit4]   2> 536 T2874 oascc.ConnectionManager.waitForConnected Waiting for client to connect to ZooKeeper
[junit4:junit4]   2> 538 T2893 oaz.ClientCnxn$SendThread.primeConnection Socket connection established to localhost/127.0.0.1:10308, initiating session
[junit4:junit4]   2> 538 T2876 oazs.NIOServerCnxn$Factory.run Accepted socket connection from /140.211.11.196:10313
[junit4:junit4]   2> 538 T2876 oazs.NIOServerCnxn.readConnectRequest Client attempting to establish new session at /140.211.11.196:10313
[junit4:junit4]   2> 540 T2878 oazs.NIOServerCnxn.finishSessionInit Established session 0x139f1bfe3f20002 with negotiated timeout 5000 for client /140.211.11.196:10313
[junit4:junit4]   2> 540 T2893 oaz.ClientCnxn$SendThread.readConnectResult Session establishment complete on server localhost/127.0.0.1:10308, sessionid = 0x139f1bfe3f20002, negotiated timeout = 5000
[junit4:junit4]   2> 541 T2894 oascc.ConnectionManager.process Watcher org.apache.solr.common.cloud.ConnectionManager@1e78d958 name:ZooKeeperConnection Watcher:127.0.0.1:10308/solr got event WatchedEvent state:SyncConnected type:None path:null path:null type:None
[junit4:junit4]   2> 541 T2874 oascc.ConnectionManager.waitForConnected Client is connected to ZooKeeper
[junit4:junit4]   2> 543 T2879 oazs.PrepRequestProcessor.pRequest Got user-level KeeperException when processing sessionid:0x139f1bfe3f20002 type:create cxid:0x2 zxid:0xfffffffffffffffe txntype:unknown reqpath:n/a Error Path:/solr/overseer Error:KeeperErrorCode = NodeExists for /solr/overseer
[junit4:junit4]   2> 552 T2874 oascc.SolrZkClient.makePath makePath: /live_nodes
[junit4:junit4]   2> 554 T2874 oasc.ZkController.createEphemeralLiveNode Register node as live in ZooKeeper:/live_nodes/127.0.0.1:10311_solr
[junit4:junit4]   2> 554 T2879 oazs.PrepRequestProcessor.pRequest Got user-level KeeperException when processing sessionid:0x139f1bfe3f20002 type:delete cxid:0x7 zxid:0xfffffffffffffffe txntype:unknown reqpath:n/a Error Path:/solr/live_nodes/127.0.0.1:10311_solr Error:KeeperErrorCode = NoNode for /solr/live_nodes/127.0.0.1:10311_solr
[junit4:junit4]   2> 555 T2874 oascc.SolrZkClient.makePath makePath: /live_nodes/127.0.0.1:10311_solr
[junit4:junit4]   2> 564 T2874 oashc.HttpShardHandlerFactory.getParameter Setting socketTimeout to: 0
[junit4:junit4]   2> 564 T2874 oashc.HttpShardHandlerFactory.getParameter Setting urlScheme to: http://
[junit4:junit4]   2> 565 T2874 oashc.HttpShardHandlerFactory.getParameter Setting connTimeout to: 0
[junit4:junit4]   2> 565 T2874 oashc.HttpShardHandlerFactory.getParameter Setting maxConnectionsPerHost to: 20
[junit4:junit4]   2> 566 T2874 oashc.HttpShardHandlerFactory.getParameter Setting corePoolSize to: 0
[junit4:junit4]   2> 566 T2874 oashc.HttpShardHandlerFactory.getParameter Setting maximumPoolSize to: 2147483647
[junit4:junit4]   2> 566 T2874 oashc.HttpShardHandlerFactory.getParameter Setting maxThreadIdleTime to: 5
[junit4:junit4]   2> 567 T2874 oashc.HttpShardHandlerFactory.getParameter Setting sizeOfQueue to: -1
[junit4:junit4]   2> 567 T2874 oashc.HttpShardHandlerFactory.getParameter Setting fairnessPolicy to: false
[junit4:junit4]   2> 568 T2874 oascsi.HttpClientUtil.createClient Creating new http client, config:maxConnectionsPerHost=20&maxConnections=10000&socketTimeout=0&connTimeout=0&retry=false
[junit4:junit4]   2> 581 T2874 oascc.SolrZkClient.makePath makePath: /overseer_elect/election
[junit4:junit4]   2> 594 T2879 oazs.PrepRequestProcessor.pRequest Got user-level KeeperException when processing sessionid:0x139f1bfe3f20002 type:delete cxid:0x15 zxid:0xfffffffffffffffe txntype:unknown reqpath:n/a Error Path:/solr/overseer_elect/leader Error:KeeperErrorCode = NoNode for /solr/overseer_elect/leader
[junit4:junit4]   2> 595 T2874 oascc.SolrZkClient.makePath makePath: /overseer_elect/leader
[junit4:junit4]   2> 602 T2874 oasc.Overseer.start Overseer (id=88367474175770626-127.0.0.1:10311_solr-n_0000000000) starting
[junit4:junit4]   2> 602 T2879 oazs.PrepRequestProcessor.pRequest Got user-level KeeperException when processing sessionid:0x139f1bfe3f20002 type:create cxid:0x1a zxid:0xfffffffffffffffe txntype:unknown reqpath:n/a Error Path:/solr/overseer Error:KeeperErrorCode = NodeExists for /solr/overseer
[junit4:junit4]   2> 604 T2879 oazs.PrepRequestProcessor.pRequest Got user-level KeeperException when processing sessionid:0x139f1bfe3f20002 type:create cxid:0x1b zxid:0xfffffffffffffffe txntype:unknown reqpath:n/a Error Path:/solr/overseer Error:KeeperErrorCode = NodeExists for /solr/overseer
[junit4:junit4]   2> 605 T2879 oazs.PrepRequestProcessor.pRequest Got user-level KeeperException when processing sessionid:0x139f1bfe3f20002 type:create cxid:0x1c zxid:0xfffffffffffffffe txntype:unknown reqpath:n/a Error Path:/solr/overseer Error:KeeperErrorCode = NodeExists for /solr/overseer
[junit4:junit4]   2> 614 T2879 oazs.PrepRequestProcessor.pRequest Got user-level KeeperException when processing sessionid:0x139f1bfe3f20002 type:create cxid:0x1d zxid:0xfffffffffffffffe txntype:unknown reqpath:n/a Error Path:/solr/overseer Error:KeeperErrorCode = NodeExists for /solr/overseer
[junit4:junit4]   2> 616 T2896 oasc.OverseerCollectionProcessor.run Process current queue of collection creations
[junit4:junit4]   2> 617 T2874 oascc.SolrZkClient.makePath makePath: /clusterstate.json
[junit4:junit4]   2> 626 T2874 oascc.ZkStateReader.createClusterStateWatchersAndUpdate Updating cluster state from ZooKeeper... 
[junit4:junit4]   2> 628 T2895 oasc.Overseer$ClusterStateUpdater.run Starting to work on the main queue
[junit4:junit4]   2> 633 T2874 oasc.CoreContainer.create Creating SolrCore 'collection1' using instanceDir: /usr/home/hudson/hudson-slave/workspace/Lucene-Solr-NightlyTests-trunk/solr/build/solr-core/test/J0/./org.apache.solr.cloud.BasicDistributedZk2Test-controljetty-1348380648745/collection1
[junit4:junit4]   2> 633 T2874 oasc.ZkController.createCollectionZkNode Check for collection zkNode:control_collection
[junit4:junit4]   2> 634 T2874 oasc.ZkController.createCollectionZkNode Collection zkNode exists
[junit4:junit4]   2> 634 T2874 oasc.ZkController.readConfigName Load collection config from:/collections/control_collection
[junit4:junit4]   2> 636 T2874 oasc.SolrResourceLoader.<init> new SolrResourceLoader for directory: '/usr/home/hudson/hudson-slave/workspace/Lucene-Solr-NightlyTests-trunk/solr/build/solr-core/test/J0/./org.apache.solr.cloud.BasicDistributedZk2Test-controljetty-1348380648745/collection1/'
[junit4:junit4]   2> 637 T2874 oasc.SolrResourceLoader.replaceClassLoader Adding 'file:/usr/home/hudson/hudson-slave/workspace/Lucene-Solr-NightlyTests-trunk/solr/build/solr-core/test/J0/org.apache.solr.cloud.BasicDistributedZk2Test-controljetty-1348380648745/collection1/lib/README' to classloader
[junit4:junit4]   2> 638 T2874 oasc.SolrResourceLoader.replaceClassLoader Adding 'file:/usr/home/hudson/hudson-slave/workspace/Lucene-Solr-NightlyTests-trunk/solr/build/solr-core/test/J0/org.apache.solr.cloud.BasicDistributedZk2Test-controljetty-1348380648745/collection1/lib/classes/' to classloader
[junit4:junit4]   2> 689 T2874 oasc.SolrConfig.<init> Using Lucene MatchVersion: LUCENE_50
[junit4:junit4]   2> 767 T2874 oasc.SolrConfig.<init> Loaded SolrConfig: solrconfig.xml
[junit4:junit4]   2> 868 T2874 oass.IndexSchema.readSchema Reading Solr Schema
[junit4:junit4]   2> 887 T2874 oass.IndexSchema.readSchema Schema name=test
[junit4:junit4]   2> 1538 T2874 oass.OpenExchangeRatesOrgProvider.init Initialized with rates=open-exchange-rates.json, refreshInterval=1440.
[junit4:junit4]   2> 1549 T2874 oass.IndexSchema.readSchema default search field in schema is text
[junit4:junit4]   2> 1554 T2874 oass.IndexSchema.readSchema unique key field: id
[junit4:junit4]   2> 1571 T2874 oass.FileExchangeRateProvider.reload Reloading exchange rates from file currency.xml
[junit4:junit4]   2> 1576 T2874 oass.FileExchangeRateProvider.reload Reloading exchange rates from file currency.xml
[junit4:junit4]   2> 1581 T2874 oass.OpenExchangeRatesOrgProvider.reload Reloading exchange rates from open-exchange-rates.json
[junit4:junit4]   2> 1583 T2874 oass.OpenExchangeRatesOrgProvider.reload Reloading exchange rates from open-exchange-rates.json
[junit4:junit4]   2> 1584 T2874 oasc.SolrCore.<init> [collection1] Opening new SolrCore at /usr/home/hudson/hudson-slave/workspace/Lucene-Solr-NightlyTests-trunk/solr/build/solr-core/test/J0/./org.apache.solr.cloud.BasicDistributedZk2Test-controljetty-1348380648745/collection1/, dataDir=./org.apache.solr.cloud.BasicDistributedZk2Test-1348380648427/control/data/
[junit4:junit4]   2> 1584 T2874 oasc.JmxMonitoredMap.<init> JMX monitoring is enabled. Adding Solr mbeans to JMX Server: com.sun.jmx.mbeanserver.JmxMBeanServer@c191e4c
[junit4:junit4]   2> 1586 T2874 oasc.SolrCore.getNewIndexDir WARNING New index directory detected: old=null new=./org.apache.solr.cloud.BasicDistributedZk2Test-1348380648427/control/data/index/
[junit4:junit4]   2> 1587 T2874 oasc.SolrCore.initIndex WARNING [collection1] Solr index directory './org.apache.solr.cloud.BasicDistributedZk2Test-1348380648427/control/data/index' doesn't exist. Creating new index...
[junit4:junit4]   2> 1588 T2874 oasc.CachingDirectoryFactory.get return new directory for /usr/home/hudson/hudson-slave/workspace/Lucene-Solr-NightlyTests-trunk/solr/build/solr-core/test/J0/./org.apache.solr.cloud.BasicDistributedZk2Test-1348380648427/control/data/index forceNew:false
[junit4:junit4]   2> 1611 T2874 oasc.SolrDeletionPolicy.onCommit SolrDeletionPolicy.onCommit: commits:num=1
[junit4:junit4]   2> 		commit{dir=/usr/home/hudson/hudson-slave/workspace/Lucene-Solr-NightlyTests-trunk/solr/build/solr-core/test/J0/org.apache.solr.cloud.BasicDistributedZk2Test-1348380648427/control/data/index,segFN=segments_1,generation=1,filenames=[segments_1]
[junit4:junit4]   2> 1612 T2874 oasc.SolrDeletionPolicy.updateCommits newest commit = 1
[junit4:junit4]   2> 1612 T2874 oasc.SolrCore.initWriters created xml: solr.XMLResponseWriter
[junit4:junit4]   2> 1615 T2874 oasup.UpdateRequestProcessorChain.init inserting DistributedUpdateProcessorFactory into updateRequestProcessorChain "dedupe"
[junit4:junit4]   2> 1615 T2874 oasup.UpdateRequestProcessorChain.init inserting DistributedUpdateProcessorFactory into updateRequestProcessorChain "dedupe-allfields"
[junit4:junit4]   2> 1616 T2874 oasup.UpdateRequestProcessorChain.init inserting DistributedUpdateProcessorFactory into updateRequestProcessorChain "stored_sig"
[junit4:junit4]   2> 1616 T2874 oasup.UpdateRequestProcessorChain.init inserting DistributedUpdateProcessorFactory into updateRequestProcessorChain "uniq-fields"
[junit4:junit4]   2> 1617 T2874 oasup.UpdateRequestProcessorChain.init inserting DistributedUpdateProcessorFactory into updateRequestProcessorChain "distrib-dup-test-chain-implicit"
[junit4:junit4]   2> 1617 T2874 oasc.RequestHandlers.initHandlersFromConfig adding lazy requestHandler: solr.ReplicationHandler
[junit4:junit4]   2> 1618 T2874 oasc.RequestHandlers.initHandlersFromConfig created /replication: solr.ReplicationHandler
[junit4:junit4]   2> 1619 T2874 oasc.RequestHandlers.initHandlersFromConfig created standard: solr.StandardRequestHandler
[junit4:junit4]   2> 1619 T2874 oasc.RequestHandlers.initHandlersFromConfig created /get: solr.RealTimeGetHandler
[junit4:junit4]   2> 1620 T2874 oasc.RequestHandlers.initHandlersFromConfig created dismax: solr.SearchHandler
[junit4:junit4]   2> 1621 T2874 oasc.RequestHandlers.initHandlersFromConfig created mock: org.apache.solr.core.MockQuerySenderListenerReqHandler
[junit4:junit4]   2> 1621 T2874 oasc.RequestHandlers.initHandlersFromConfig created /admin/: org.apache.solr.handler.admin.AdminHandlers
[junit4:junit4]   2> 1622 T2874 oasc.RequestHandlers.initHandlersFromConfig created defaults: solr.StandardRequestHandler
[junit4:junit4]   2> 1623 T2874 oasc.RequestHandlers.initHandlersFromConfig adding lazy requestHandler: solr.StandardRequestHandler
[junit4:junit4]   2> 1623 T2874 oasc.RequestHandlers.initHandlersFromConfig created lazy: solr.StandardRequestHandler
[junit4:junit4]   2> 1624 T2874 oasc.RequestHandlers.initHandlersFromConfig created /update: solr.UpdateRequestHandler
[junit4:junit4]   2> 1624 T2874 oasc.RequestHandlers.initHandlersFromConfig created /terms: org.apache.solr.handler.component.SearchHandler
[junit4:junit4]   2> 1625 T2874 oasc.RequestHandlers.initHandlersFromConfig created spellCheckCompRH: org.apache.solr.handler.component.SearchHandler
[junit4:junit4]   2> 1626 T2874 oasc.RequestHandlers.initHandlersFromConfig created spellCheckCompRH_Direct: org.apache.solr.handler.component.SearchHandler
[junit4:junit4]   2> 1626 T2874 oasc.RequestHandlers.initHandlersFromConfig created spellCheckWithWordbreak: org.apache.solr.handler.component.SearchHandler
[junit4:junit4]   2> 1627 T2874 oasc.RequestHandlers.initHandlersFromConfig created spellCheckWithWordbreak_Direct: org.apache.solr.handler.component.SearchHandler
[junit4:junit4]   2> 1628 T2874 oasc.RequestHandlers.initHandlersFromConfig created spellCheckCompRH1: org.apache.solr.handler.component.SearchHandler
[junit4:junit4]   2> 1629 T2874 oasc.RequestHandlers.initHandlersFromConfig created tvrh: org.apache.solr.handler.component.SearchHandler
[junit4:junit4]   2> 1629 T2874 oasc.RequestHandlers.initHandlersFromConfig created /mlt: solr.MoreLikeThisHandler
[junit4:junit4]   2> 1630 T2874 oasc.RequestHandlers.initHandlersFromConfig created /debug/dump: solr.DumpRequestHandler
[junit4:junit4]   2> 1634 T2874 oashl.XMLLoader.init xsltCacheLifetimeSeconds=60
[junit4:junit4]   2> 1639 T2874 oasc.SolrCore.initDeprecatedSupport WARNING solrconfig.xml uses deprecated <admin/gettableFiles>, Please update your config to use the ShowFileRequestHandler.
[junit4:junit4]   2> 1640 T2874 oasc.SolrCore.initDeprecatedSupport WARNING adding ShowFileRequestHandler with hidden files: [SCHEMA.XML, OLD_SYNONYMS.TXT, STOPWORDS.TXT, PROTWORDS.TXT, OPEN-EXCHANGE-RATES.JSON, SYNONYMS.TXT, CURRENCY.XML, MAPPING-ISOLATIN1ACCENT.TXT]
[junit4:junit4]   2> 1645 T2874 oass.SolrIndexSearcher.<init> Opening Searcher@34534588 main
[junit4:junit4]   2> 1646 T2874 oasu.CommitTracker.<init> Hard AutoCommit: disabled
[junit4:junit4]   2> 1647 T2874 oasu.CommitTracker.<init> Soft AutoCommit: disabled
[junit4:junit4]   2> 1647 T2874 oashc.SpellCheckComponent.inform Initializing spell checkers
[junit4:junit4]   2> 1655 T2874 oass.DirectSolrSpellChecker.init init: {name=direct,classname=DirectSolrSpellChecker,field=lowerfilt,minQueryLength=3}
[junit4:junit4]   2> 1717 T2897 oasc.SolrCore.registerSearcher [collection1] Registered new searcher Searcher@34534588 main{StandardDirectoryReader(segments_1:1)}
[junit4:junit4]   2> 1723 T2879 oazs.PrepRequestProcessor.pRequest Got user-level KeeperException when processing sessionid:0x139f1bfe3f20002 type:create cxid:0x56 zxid:0xfffffffffffffffe txntype:unknown reqpath:n/a Error Path:/solr/overseer/queue Error:KeeperErrorCode = NoNode for /solr/overseer/queue
[junit4:junit4]   2> 1734 T2874 oasc.CoreContainer.register registering core: collection1
[junit4:junit4]   2> 1734 T2874 oasc.ZkController.register Register shard - core:collection1 address:http://127.0.0.1:10311/solr shardId:control_shard
[junit4:junit4]   2> 1735 T2874 oascc.SolrZkClient.makePath makePath: /collections/control_collection/leader_elect/control_shard/election
[junit4:junit4]   2> 1741 T2879 oazs.PrepRequestProcessor.pRequest Got user-level KeeperException when processing sessionid:0x139f1bfe3f20002 type:delete cxid:0x65 zxid:0xfffffffffffffffe txntype:unknown reqpath:n/a Error Path:/solr/collections/control_collection/leaders Error:KeeperErrorCode = NoNode for /solr/collections/control_collection/leaders
[junit4:junit4]   2> 1742 T2874 oasc.ShardLeaderElectionContext.runLeaderProcess Running the leader process.
[junit4:junit4]   2> 1742 T2879 oazs.PrepRequestProcessor.pRequest Got user-level KeeperException when processing sessionid:0x139f1bfe3f20002 type:create cxid:0x66 zxid:0xfffffffffffffffe txntype:unknown reqpath:n/a Error Path:/solr/overseer Error:KeeperErrorCode = NodeExists for /solr/overseer
[junit4:junit4]   2> 2135 T2895 oascc.ZkStateReader.updateClusterState Updating cloud state from ZooKeeper... 
[junit4:junit4]   2> 2136 T2879 oazs.PrepRequestProcessor.pRequest Got user-level KeeperException when processing sessionid:0x139f1bfe3f20002 type:create cxid:0x6d zxid:0xfffffffffffffffe txntype:unknown reqpath:n/a Error Path:/solr/overseer/queue-work Error:KeeperErrorCode = NoNode for /solr/overseer/queue-work
[junit4:junit4]   2> 2153 T2894 oascc.ZkStateReader$2.process A cluster state change has occurred - updating...
[junit4:junit4]   2> 2245 T2874 oasc.ShardLeaderElectionContext.waitForReplicasToComeUp Enough replicas found to continue.
[junit4:junit4]   2> 2245 T2874 oasc.ShardLeaderElectionContext.runLeaderProcess I may be the new leader - try and sync
[junit4:junit4]   2> 2246 T2874 oasc.SyncStrategy.sync Sync replicas to http://127.0.0.1:10311/solr/collection1/
[junit4:junit4]   2> 2246 T2874 oasc.SyncStrategy.syncReplicas Sync Success - now sync replicas to me
[junit4:junit4]   2> 2246 T2874 oasc.SyncStrategy.syncToMe http://127.0.0.1:10311/solr/collection1/ has no replicas
[junit4:junit4]   2> 2247 T2874 oasc.ShardLeaderElectionContext.runLeaderProcess I am the new leader: http://127.0.0.1:10311/solr/collection1/
[junit4:junit4]   2> 2247 T2874 oascc.SolrZkClient.makePath makePath: /collections/control_collection/leaders/control_shard
[junit4:junit4]   2> 2250 T2879 oazs.PrepRequestProcessor.pRequest Got user-level KeeperException when processing sessionid:0x139f1bfe3f20002 type:create cxid:0x8b zxid:0xfffffffffffffffe txntype:unknown reqpath:n/a Error Path:/solr/overseer Error:KeeperErrorCode = NodeExists for /solr/overseer
[junit4:junit4]   2> 2657 T2895 oascc.ZkStateReader.updateClusterState Updating cloud state from ZooKeeper... 
[junit4:junit4]   2> 2671 T2894 oascc.ZkStateReader$2.process A cluster state change has occurred - updating...
[junit4:junit4]   2> 2720 T2874 oasc.ZkController.register We are http://127.0.0.1:10311/solr/collection1/ and leader is http://127.0.0.1:10311/solr/collection1/
[junit4:junit4]   2> 2720 T2874 oasc.ZkController.register No LogReplay needed for core=collection1 baseURL=http://127.0.0.1:10311/solr
[junit4:junit4]   2> 2720 T2874 oasc.ZkController.checkRecovery I am the leader, no recovery necessary
[junit4:junit4]   2> 2722 T2874 oascc.ZkStateReader.updateClusterState Updating cloud state from ZooKeeper... 
[junit4:junit4]   2> 2723 T2874 oass.SolrDispatchFilter.init user.dir=/usr/home/hudson/hudson-slave/workspace/Lucene-Solr-NightlyTests-trunk/solr/build/solr-core/test/J0
[junit4:junit4]   2> 2723 T2874 oass.SolrDispatchFilter.init SolrDispatchFilter.init() done
[junit4:junit4]   2> 2723 T2874 oascsi.HttpClientUtil.createClient Creating new http client, config:maxConnections=128&maxConnectionsPerHost=32&followRedirects=false
[junit4:junit4]   2> 2838 T2874 oejs.Server.doStart jetty-8.1.2.v20120308
[junit4:junit4]   2> 2840 T2874 oejs.AbstractConnector.doStart Started SocketConnector@0.0.0.0:10323
[junit4:junit4]   2> 2841 T2874 oasc.SolrResourceLoader.locateSolrHome JNDI not configured for solr (NoInitialContextEx)
[junit4:junit4]   2> 2841 T2874 oasc.SolrResourceLoader.locateSolrHome using system property solr.solr.home: /usr/home/hudson/hudson-slave/workspace/Lucene-Solr-NightlyTests-trunk/solr/build/solr-core/test/J0/./org.apache.solr.cloud.BasicDistributedZk2Test-jetty1-1348380651156
[junit4:junit4]   2> 2842 T2874 oasc.SolrResourceLoader.<init> new SolrResourceLoader for deduced Solr Home: '/usr/home/hudson/hudson-slave/workspace/Lucene-Solr-NightlyTests-trunk/solr/build/solr-core/test/J0/./org.apache.solr.cloud.BasicDistributedZk2Test-jetty1-1348380651156/'
[junit4:junit4]   2> 2866 T2874 oass.SolrDispatchFilter.init SolrDispatchFilter.init()
[junit4:junit4]   2> 2867 T2874 oasc.SolrResourceLoader.locateSolrHome JNDI not configured for solr (NoInitialContextEx)
[junit4:junit4]   2> 2867 T2874 oasc.SolrResourceLoader.locateSolrHome using system property solr.solr.home: /usr/home/hudson/hudson-slave/workspace/Lucene-Solr-NightlyTests-trunk/solr/build/solr-core/test/J0/./org.apache.solr.cloud.BasicDistributedZk2Test-jetty1-1348380651156
[junit4:junit4]   2> 2867 T2874 oasc.CoreContainer$Initializer.initialize looking for solr.xml: /usr/home/hudson/hudson-slave/workspace/Lucene-Solr-NightlyTests-trunk/solr/build/solr-core/test/J0/./org.apache.solr.cloud.BasicDistributedZk2Test-jetty1-1348380651156/solr.xml
[junit4:junit4]   2> 2868 T2874 oasc.CoreContainer.<init> New CoreContainer 847116471
[junit4:junit4]   2> 2868 T2874 oasc.CoreContainer.load Loading CoreContainer using Solr Home: '/usr/home/hudson/hudson-slave/workspace/Lucene-Solr-NightlyTests-trunk/solr/build/solr-core/test/J0/./org.apache.solr.cloud.BasicDistributedZk2Test-jetty1-1348380651156/'
[junit4:junit4]   2> 2868 T2874 oasc.SolrResourceLoader.<init> new SolrResourceLoader for directory: '/usr/home/hudson/hudson-slave/workspace/Lucene-Solr-NightlyTests-trunk/solr/build/solr-core/test/J0/./org.apache.solr.cloud.BasicDistributedZk2Test-jetty1-1348380651156/'
[junit4:junit4]   2> 2889 T2874 oasc.CoreContainer.load Registering Log Listener
[junit4:junit4]   2> 2906 T2874 oasc.CoreContainer.initZooKeeper Zookeeper client=127.0.0.1:10308/solr
[junit4:junit4]   2> 2907 T2874 oaz.ZooKeeper.<init> Initiating client connection, connectString=127.0.0.1:10308/solr sessionTimeout=5000 watcher=org.apache.solr.common.cloud.ConnectionManager@728edb39
[junit4:junit4]   2> 2908 T2907 oaz.ClientCnxn$SendThread.startConnect Opening socket connection to server /127.0.0.1:10308
[junit4:junit4]   2> 2908 T2874 oascc.ConnectionManager.waitForConnected Waiting for client to connect to ZooKeeper
[junit4:junit4]   2> 2909 T2907 oaz.ClientCnxn$SendThread.primeConnection Socket connection established to localhost/127.0.0.1:10308, initiating session
[junit4:junit4]   2> 2909 T2876 oazs.NIOServerCnxn$Factory.run Accepted socket connection from /140.211.11.196:10324
[junit4:junit4]   2> 2910 T2876 oazs.NIOServerCnxn.readConnectRequest Client attempting to establish new session at /140.211.11.196:10324
[junit4:junit4]   2> 2912 T2878 oazs.NIOServerCnxn.finishSessionInit Established session 0x139f1bfe3f20003 with negotiated timeout 5000 for client /140.211.11.196:10324
[junit4:junit4]   2> 2912 T2907 oaz.ClientCnxn$SendThread.readConnectResult Session establishment complete on server localhost/127.0.0.1:10308, sessionid = 0x139f1bfe3f20003, negotiated timeout = 5000
[junit4:junit4]   2> 2912 T2908 oascc.ConnectionManager.process Watcher org.apache.solr.common.cloud.ConnectionManager@728edb39 name:ZooKeeperConnection Watcher:127.0.0.1:10308/solr got event WatchedEvent state:SyncConnected type:None path:null path:null type:None
[junit4:junit4]   2> 2912 T2874 oascc.ConnectionManager.waitForConnected Client is connected to ZooKeeper
[junit4:junit4]   2> 2914 T2879 oazs.PrepRequestProcessor.pRequest Got user-level KeeperException when processing sessionid:0x139f1bfe3f20003 type:create cxid:0x1 zxid:0xfffffffffffffffe txntype:unknown reqpath:n/a Error Path:/solr/overseer Error:KeeperErrorCode = NodeExists for /solr/overseer
[junit4:junit4]   2> 2934 T2879 oazs.PrepRequestProcessor.pRequest Got user-level KeeperException when processing sessionid:0x139f1bfe3f20003 type:create cxid:0x2 zxid:0xfffffffffffffffe txntype:unknown reqpath:n/a Error Path:/solr/overseer Error:KeeperErrorCode = NodeExists for /solr/overseer
[junit4:junit4]   2> 2952 T2874 oasc.ZkController.createEphemeralLiveNode Register node as live in ZooKeeper:/live_nodes/127.0.0.1:10323_solr
[junit4:junit4]   2> 2953 T2879 oazs.PrepRequestProcessor.pRequest Got user-level KeeperException when processing sessionid:0x139f1bfe3f20003 type:delete cxid:0x4 zxid:0xfffffffffffffffe txntype:unknown reqpath:n/a Error Path:/solr/live_nodes/127.0.0.1:10323_solr Error:KeeperErrorCode = NoNode for /solr/live_nodes/127.0.0.1:10323_solr
[junit4:junit4]   2> 2969 T2874 oascc.SolrZkClient.makePath makePath: /live_nodes/127.0.0.1:10323_solr
[junit4:junit4]   2> 2979 T2894 oascc.ZkStateReader$3.process Updating live nodes
[junit4:junit4]   2> 2979 T2874 oashc.HttpShardHandlerFactory.getParameter Setting socketTimeout to: 0
[junit4:junit4]   2> 2980 T2874 oashc.HttpShardHandlerFactory.getParameter Setting urlScheme to: http://
[junit4:junit4]   2> 2980 T2874 oashc.HttpShardHandlerFactory.getParameter Setting connTimeout to: 0
[junit4:junit4]   2> 2981 T2874 oashc.HttpShardHandlerFactory.getParameter Setting maxConnectionsPerHost to: 20
[junit4:junit4]   2> 2981 T2874 oashc.HttpShardHandlerFactory.getParameter Setting corePoolSize to: 0
[junit4:junit4]   2> 2982 T2874 oashc.HttpShardHandlerFactory.getParameter Setting maximumPoolSize to: 2147483647
[junit4:junit4]   2> 2982 T2874 oashc.HttpShardHandlerFactory.getParameter Setting maxThreadIdleTime to: 5
[junit4:junit4]   2> 2982 T2874 oashc.HttpShardHandlerFactory.getParameter Setting sizeOfQueue to: -1
[junit4:junit4]   2> 2983 T2874 oashc.HttpShardHandlerFactory.getParameter Setting fairnessPolicy to: false
[junit4:junit4]   2> 2983 T2874 oascsi.HttpClientUtil.createClient Creating new http client, config:maxConnectionsPerHost=20&maxConnections=10000&socketTimeout=0&connTimeout=0&retry=false
[junit4:junit4]   2> 3036 T2874 oascc.ZkStateReader.createClusterStateWatchersAndUpdate Updating cluster state from ZooKeeper... 
[junit4:junit4]   2> 3043 T2874 oasc.CoreContainer.create Creating SolrCore 'collection1' using instanceDir: /usr/home/hudson/hudson-slave/workspace/Lucene-Solr-NightlyTests-trunk/solr/build/solr-core/test/J0/./org.apache.solr.cloud.BasicDistributedZk2Test-jetty1-1348380651156/collection1
[junit4:junit4]   2> 3043 T2874 oasc.ZkController.createCollectionZkNode Check for collection zkNode:collection1
[junit4:junit4]   2> 3044 T2874 oasc.ZkController.createCollectionZkNode Collection zkNode exists
[junit4:junit4]   2> 3044 T2874 oasc.ZkController.readConfigName Load collection config from:/collections/collection1
[junit4:junit4]   2> 3046 T2874 oasc.SolrResourceLoader.<init> new SolrResourceLoader for directory: '/usr/home/hudson/hudson-slave/workspace/Lucene-Solr-NightlyTests-trunk/solr/build/solr-core/test/J0/./org.apache.solr.cloud.BasicDistributedZk2Test-jetty1-1348380651156/collection1/'
[junit4:junit4]   2> 3047 T2874 oasc.SolrResourceLoader.replaceClassLoader Adding 'file:/usr/home/hudson/hudson-slave/workspace/Lucene-Solr-NightlyTests-trunk/solr/build/solr-core/test/J0/org.apache.solr.cloud.BasicDistributedZk2Test-jetty1-1348380651156/collection1/lib/README' to classloader
[junit4:junit4]   2> 3048 T2874 oasc.SolrResourceLoader.replaceClassLoader Adding 'file:/usr/home/hudson/hudson-slave/workspace/Lucene-Solr-NightlyTests-trunk/solr/build/solr-core/test/J0/org.apache.solr.cloud.BasicDistributedZk2Test-jetty1-1348380651156/collection1/lib/classes/' to classloader
[junit4:junit4]   2> 3106 T2874 oasc.SolrConfig.<init> Using Lucene MatchVersion: LUCENE_50
[junit4:junit4]   2> 3180 T2895 oascc.ZkStateReader.updateClusterState Updating cloud state from ZooKeeper... 
[junit4:junit4]   2> 3184 T2874 oasc.SolrConfig.<init> Loaded SolrConfig: solrconfig.xml
[junit4:junit4]   2> 3197 T2894 oascc.ZkStateReader$2.process A cluster state change has occurred - updating...
[junit4:junit4]   2> 3285 T2908 oascc.ZkStateReader$2.process A cluster state change has occurred - updating...
[junit4:junit4]   2> 3285 T2874 oass.IndexSchema.readSchema Reading Solr Schema
[junit4:junit4]   2> 3311 T2874 oass.IndexSchema.readSchema Schema name=test
[junit4:junit4]   2> 3965 T2874 oass.OpenExchangeRatesOrgProvider.init Initialized with rates=open-exchange-rates.json, refreshInterval=1440.
[junit4:junit4]   2> 3976 T2874 oass.IndexSchema.readSchema default search field in schema is text
[junit4:junit4]   2> 3981 T2874 oass.IndexSchema.readSchema unique key field: id
[junit4:junit4]   2> 3992 T2874 oass.FileExchangeRateProvider.reload Reloading exchange rates from file currency.xml
[junit4:junit4]   2> 3997 T2874 oass.FileExchangeRateProvider.reload Reloading exchange rates from file currency.xml
[junit4:junit4]   2> 4002 T2874 oass.OpenExchangeRatesOrgProvider.reload Reloading exchange rates from open-exchange-rates.json
[junit4:junit4]   2> 4004 T2874 oass.OpenExchangeRatesOrgProvider.reload Reloading exchange rates from open-exchange-rates.json
[junit4:junit4]   2> 4005 T2874 oasc.SolrCore.<init> [collection1] Opening new SolrCore at /usr/home/hudson/hudson-slave/workspace/Lucene-Solr-NightlyTests-trunk/solr/build/solr-core/test/J0/./org.apache.solr.cloud.BasicDistributedZk2Test-jetty1-1348380651156/collection1/, dataDir=./org.apache.solr.cloud.BasicDistributedZk2Test-1348380648427/jetty1/
[junit4:junit4]   2> 4005 T2874 oasc.JmxMonitoredMap.<init> JMX monitoring is enabled. Adding Solr mbeans to JMX Server: com.sun.jmx.mbeanserver.JmxMBeanServer@c191e4c
[junit4:junit4]   2> 4007 T2874 oasc.SolrCore.getNewIndexDir WARNING New index directory detected: old=null new=./org.apache.solr.cloud.BasicDistributedZk2Test-1348380648427/jetty1/index/
[junit4:junit4]   2> 4008 T2874 oasc.SolrCore.initIndex WARNING [collection1] Solr index directory './org.apache.solr.cloud.BasicDistributedZk2Test-1348380648427/jetty1/index' doesn't exist. Creating new index...
[junit4:junit4]   2> 4009 T2874 oasc.CachingDirectoryFactory.get return new directory for /usr/home/hudson/hudson-slave/workspace/Lucene-Solr-NightlyTests-trunk/solr/build/solr-core/test/J0/./org.apache.solr.cloud.BasicDistributedZk2Test-1348380648427/jetty1/index forceNew:false
[junit4:junit4]   2> 4014 T2874 oasc.SolrDeletionPolicy.onCommit SolrDeletionPolicy.onCommit: commits:num=1
[junit4:junit4]   2> 		commit{dir=/usr/home/hudson/hudson-slave/workspace/Lucene-Solr-NightlyTests-trunk/solr/build/solr-core/test/J0/org.apache.solr.cloud.BasicDistributedZk2Test-1348380648427/jetty1/index,segFN=segments_1,generation=1,filenames=[segments_1]
[junit4:junit4]   2> 4015 T2874 oasc.SolrDeletionPolicy.updateCommits newest commit = 1
[junit4:junit4]   2> 4016 T2874 oasc.SolrCore.initWriters created xml: solr.XMLResponseWriter
[junit4:junit4]   2> 4018 T2874 oasup.UpdateRequestProcessorChain.init inserting DistributedUpdateProcessorFactory into updateRequestProcessorChain "dedupe"
[junit4:junit4]   2> 4019 T2874 oasup.UpdateRequestProcessorChain.init inserting DistributedUpdateProcessorFactory into updateRequestProcessorChain "dedupe-allfields"
[junit4:junit4]   2> 4019 T2874 oasup.UpdateRequestProcessorChain.init inserting DistributedUpdateProcessorFactory into updateRequestProcessorChain "stored_sig"
[junit4:junit4]   2> 4020 T2874 oasup.UpdateRequestProcessorChain.init inserting DistributedUpdateProcessorFactory into updateRequestProcessorChain "uniq-fields"
[junit4:junit4]   2> 4020 T2874 oasup.UpdateRequestProcessorChain.init inserting DistributedUpdateProcessorFactory into updateRequestProcessorChain "distrib-dup-test-chain-implicit"
[junit4:junit4]   2> 4021 T2874 oasc.RequestHandlers.initHandlersFromConfig adding lazy requestHandler: solr.ReplicationHandler
[junit4:junit4]   2> 4022 T2874 oasc.RequestHandlers.initHandlersFromConfig created /replication: solr.ReplicationHandler
[junit4:junit4]   2> 4022 T2874 oasc.RequestHandlers.initHandlersFromConfig created standard: solr.StandardRequestHandler
[junit4:junit4]   2> 4023 T2874 oasc.RequestHandlers.initHandlersFromConfig created /get: solr.RealTimeGetHandler
[junit4:junit4]   2> 4024 T2874 oasc.RequestHandlers.initHandlersFromConfig created dismax: solr.SearchHandler
[junit4:junit4]   2> 4025 T2874 oasc.RequestHandlers.initHandlersFromConfig created mock: org.apache.solr.core.MockQuerySenderListenerReqHandler
[junit4:junit4]   2> 4026 T2874 oasc.RequestHandlers.initHandlersFromConfig created /admin/: org.apache.solr.handler.admin.AdminHandlers
[junit4:junit4]   2> 4026 T2874 oasc.RequestHandlers.initHandlersFromConfig created defaults: solr.StandardRequestHandler
[junit4:junit4]   2> 4027 T2874 oasc.RequestHandlers.initHandlersFromConfig adding lazy requestHandler: solr.StandardRequestHandler
[junit4:junit4]   2> 4028 T2874 oasc.RequestHandlers.initHandlersFromConfig created lazy: solr.StandardRequestHandler
[junit4:junit4]   2> 4028 T2874 oasc.RequestHandlers.initHandlersFromConfig created /update: solr.UpdateRequestHandler
[junit4:junit4]   2> 4029 T2874 oasc.RequestHandlers.initHandlersFromConfig created /terms: org.apache.solr.handler.component.SearchHandler
[junit4:junit4]   2> 4030 T2874 oasc.RequestHandlers.initHandlersFromConfig created spellCheckCompRH: org.apache.solr.handler.component.SearchHandler
[junit4:junit4]   2> 4031 T2874 oasc.RequestHandlers.initHandlersFromConfig created spellCheckCompRH_Direct: org.apache.solr.handler.component.SearchHandler
[junit4:junit4]   2> 4032 T2874 oasc.RequestHandlers.initHandlersFromConfig created spellCheckWithWordbreak: org.apache.solr.handler.component.SearchHandler
[junit4:junit4]   2> 4032 T2874 oasc.RequestHandlers.initHandlersFromConfig created spellCheckWithWordbreak_Direct: org.apache.solr.handler.component.SearchHandler
[junit4:junit4]   2> 4033 T2874 oasc.RequestHandlers.initHandlersFromConfig created spellCheckCompRH1: org.apache.solr.handler.component.SearchHandler
[junit4:junit4]   2> 4034 T2874 oasc.RequestHandlers.initHandlersFromConfig created tvrh: org.apache.solr.handler.component.SearchHandler
[junit4:junit4]   2> 4035 T2874 oasc.RequestHandlers.initHandlersFromConfig created /mlt: solr.MoreLikeThisHandler
[junit4:junit4]   2> 4036 T2874 oasc.RequestHandlers.initHandlersFromConfig created /debug/dump: solr.DumpRequestHandler
[junit4:junit4]   2> 4040 T2874 oashl.XMLLoader.init xsltCacheLifetimeSeconds=60
[junit4:junit4]   2> 4044 T2874 oasc.SolrCore.initDeprecatedSupport WARNING solrconfig.xml uses deprecated <admin/gettableFiles>, Please update your config to use the ShowFileRequestHandler.
[junit4:junit4]   2> 4046 T2874 oasc.SolrCore.initDeprecatedSupport WARNING adding ShowFileRequestHandler with hidden files: [SCHEMA.XML, OLD_SYNONYMS.TXT, STOPWORDS.TXT, PROTWORDS.TXT, OPEN-EXCHANGE-RATES.JSON, SYNONYMS.TXT, CURRENCY.XML, MAPPING-ISOLATIN1ACCENT.TXT]
[junit4:junit4]   2> 4050 T2874 oass.SolrIndexSearcher.<init> Opening Searcher@558145ad main
[junit4:junit4]   2> 4052 T2874 oasu.CommitTracker.<init> Hard AutoCommit: disabled
[junit4:junit4]   2> 4052 T2874 oasu.CommitTracker.<init> Soft AutoCommit: disabled
[junit4:junit4]   2> 4053 T2874 oashc.SpellCheckComponent.inform Initializing spell checkers
[junit4:junit4]   2> 4060 T2874 oass.DirectSolrSpellChecker.init init: {name=direct,classname=DirectSolrSpellChecker,field=lowerfilt,minQueryLength=3}
[junit4:junit4]   2> 4124 T2909 oasc.SolrCore.registerSearcher [collection1] Registered new searcher Searcher@558145ad main{StandardDirectoryReader(segments_1:1)}
[junit4:junit4]   2> 4202 T2895 oascc.ZkStateReader.updateClusterState Updating cloud state from ZooKeeper... 
[junit4:junit4]   2> 4214 T2894 oascc.ZkStateReader$2.process A cluster state change has occurred - updating...
[junit4:junit4]   2> 4214 T2908 oascc.ZkStateReader$2.process A cluster state change has occurred - updating...
[junit4:junit4]   2> 4634 T2874 oasc.CoreContainer.register registering core: collection1
[junit4:junit4]   2> 4634 T2874 oasc.ZkController.register Register shard - core:collection1 address:http://127.0.0.1:10323/solr shardId:shard1
[junit4:junit4]   2> 4635 T2874 oascc.SolrZkClient.makePath makePath: /collections/collection1/leader_elect/shard1/election
[junit4:junit4]   2> 4656 T2879 oazs.PrepRequestProcessor.pRequest Got user-level KeeperException when processing sessionid:0x139f1bfe3f20003 type:delete cxid:0x43 zxid:0xfffffffffffffffe txntype:unknown reqpath:n/a Error Path:/solr/collections/collection1/leaders Error:KeeperErrorCode = NoNode for /solr/collections/collection1/leaders
[junit4:junit4]   2> 4666 T2874 oasc.ShardLeaderElectionContext.runLeaderProcess Running the leader process.
[junit4:junit4]   2> 4667 T2879 oazs.PrepRequestProcessor.pRequest Got user-level KeeperException when processing sessionid:0x139f1bfe3f20003 type:create cxid:0x44 zxid:0xfffffffffffffffe txntype:unknown reqpath:n/a Error Path:/solr/overseer Error:KeeperErrorCode = NodeExists for /solr/overseer
[junit4:junit4]   2> 4675 T2874 oasc.ShardLeaderElectionContext.waitForReplicasToComeUp Enough replicas found to continue.
[junit4:junit4]   2> 4676 T2874 oasc.ShardLeaderElectionContext.runLeaderProcess I may be the new leader - try and sync
[junit4:junit4]   2> 4676 T2874 oasc.SyncStrategy.sync Sync replicas to http://127.0.0.1:10323/solr/collection1/
[junit4:junit4]   2> 4677 T2874 oasc.SyncStrategy.syncReplicas Sync Success - now sync replicas to me
[junit4:junit4]   2> 4677 T2874 oasc.SyncStrategy.syncToMe http://127.0.0.1:10323/solr/collection1/ has no replicas
[junit4:junit4]   2> 4678 T2874 oasc.ShardLeaderElectionContext.runLeaderProcess I am the new leader: http://127.0.0.1:10323/solr/collection1/
[junit4:junit4]   2> 4678 T2874 oascc.SolrZkClient.makePath makePath: /collections/collection1/leaders/shard1
[junit4:junit4]   2> 4682 T2879 oazs.PrepRequestProcessor.pRequest Got user-level KeeperException when processing sessionid:0x139f1bfe3f20003 type:create cxid:0x4e zxid:0xfffffffffffffffe txntype:unknown reqpath:n/a Error Path:/solr/overseer Error:KeeperErrorCode = NodeExists for /solr/overseer
[junit4:junit4]   2> 4718 T2895 oascc.ZkStateReader.updateClusterState Updating cloud state from ZooKeeper... 
[junit4:junit4]   2> 4739 T2908 oascc.ZkStateReader$2.process A cluster state change has occurred - updating...
[junit4:junit4]   2> 4739 T2894 oascc.ZkStateReader$2.process A cluster state change has occurred - updating...
[junit4:junit4]   2> 4744 T2874 oasc.ZkController.register We are http://127.0.0.1:10323/solr/collection1/ and leader is http://127.0.0.1:10323/solr/collection1/
[junit4:junit4]   2> 4744 T2874 oasc.ZkController.register No LogReplay needed for core=collection1 baseURL=http://127.0.0.1:10323/solr
[junit4:junit4]   2> 4745 T2874 oasc.ZkController.checkRecovery I am the leader, no recovery necessary
[junit4:junit4]   2> 4746 T2874 oascc.ZkStateReader.updateClusterState Updating cloud state from ZooKeeper... 
[junit4:junit4]   2> 4747 T2874 oass.SolrDispatchFilter.init user.dir=/usr/home/hudson/hudson-slave/workspace/Lucene-Solr-NightlyTests-trunk/solr/build/solr-core/test/J0
[junit4:junit4]   2> 4747 T2874 oass.SolrDispatchFilter.init SolrDispatchFilter.init() done
[junit4:junit4]   2> 4748 T2874 oascsi.HttpClientUtil.createClient Creating new http client, config:maxConnections=128&maxConnectionsPerHost=32&followRedirects=false
[junit4:junit4]   2> 4930 T2874 oejs.Server.doStart jetty-8.1.2.v20120308
[junit4:junit4]   2> 4933 T2874 oejs.AbstractConnector.doStart Started SocketConnector@0.0.0.0:10326
[junit4:junit4]   2> 4933 T2874 oasc.SolrResourceLoader.locateSolrHome JNDI not configured for solr (NoInitialContextEx)
[junit4:junit4]   2> 4934 T2874 oasc.SolrResourceLoader.locateSolrHome using system property solr.solr.home: /usr/home/hudson/hudson-slave/workspace/Lucene-Solr-NightlyTests-trunk/solr/build/solr-core/test/J0/./org.apache.solr.cloud.BasicDistributedZk2Test-jetty2-1348380653185
[junit4:junit4]   2> 4934 T2874 oasc.SolrResourceLoader.<init> new SolrResourceLoader for deduced Solr Home: '/usr/home/hudson/hudson-slave/workspace/Lucene-Solr-NightlyTests-trunk/solr/build/solr-core/test/J0/./org.apache.solr.cloud.BasicDistributedZk2Test-jetty2-1348380653185/'
[junit4:junit4]   2> 4973 T2874 oass.SolrDispatchFilter.init SolrDispatchFilter.init()
[junit4:junit4]   2> 4974 T2874 oasc.SolrResourceLoader.locateSolrHome JNDI not configured for solr (NoInitialContextEx)
[junit4:junit4]   2> 4974 T2874 oasc.SolrResourceLoader.locateSolrHome using system property solr.solr.home: /usr/home/hudson/hudson-slave/workspace/Lucene-Solr-NightlyTests-trunk/solr/build/solr-core/test/J0/./org.apache.solr.cloud.BasicDistributedZk2Test-jetty2-1348380653185
[junit4:junit4]   2> 4975 T2874 oasc.CoreContainer$Initializer.initialize looking for solr.xml: /usr/home/hudson/hudson-slave/workspace/Lucene-Solr-NightlyTests-trunk/solr/build/solr-core/test/J0/./org.apache.solr.cloud.BasicDistributedZk2Test-jetty2-1348380653185/solr.xml
[junit4:junit4]   2> 4975 T2874 oasc.CoreContainer.<init> New CoreContainer 282523287
[junit4:junit4]   2> 4976 T2874 oasc.CoreContainer.load Loading CoreContainer using Solr Home: '/usr/home/hudson/hudson-slave/workspace/Lucene-Solr-NightlyTests-trunk/solr/build/solr-core/test/J0/./org.apache.solr.cloud.BasicDistributedZk2Test-jetty2-1348380653185/'
[junit4:junit4]   2> 4976 T2874 oasc.SolrResourceLoader.<init> new SolrResourceLoader for directory: '/usr/home/hudson/hudson-slave/workspace/Lucene-Solr-NightlyTests-trunk/solr/build/solr-core/test/J0/./org.apache.solr.cloud.BasicDistributedZk2Test-jetty2-1348380653185/'
[junit4:junit4]   2> 5003 T2874 oasc.CoreContainer.load Registering Log Listener
[junit4:junit4]   2> 5020 T2874 oasc.CoreContainer.initZooKeeper Zookeeper client=127.0.0.1:10308/solr
[junit4:junit4]   2> 5020 T2874 oaz.ZooKeeper.<init> Initiating client connection, connectString=127.0.0.1:10308/solr sessionTimeout=5000 watcher=org.apache.solr.common.cloud.ConnectionManager@22ad681f
[junit4:junit4]   2> 5021 T2919 oaz.ClientCnxn$SendThread.startConnect Opening socket connection to server /127.0.0.1:10308
[junit4:junit4]   2> 5021 T2874 oascc.ConnectionManager.waitForConnected Waiting for client to connect to ZooKeeper
[junit4:junit4]   2> 5023 T2919 oaz.ClientCnxn$SendThread.primeConnection Socket connection established to localhost/127.0.0.1:10308, initiating session
[junit4:junit4]   2> 5023 T2876 oazs.NIOServerCnxn$Factory.run Accepted socket connection from /140.211.11.196:10327
[junit4:junit4]   2> 5023 T2876 oazs.NIOServerCnxn.readConnectRequest Client attempting to establish new session at /140.211.11.196:10327
[junit4:junit4]   2> 5025 T2878 oazs.NIOServerCnxn.finishSessionInit Established session 0x139f1bfe3f20004 with negotiated timeout 5000 for client /140.211.11.196:10327
[junit4:junit4]   2> 5026 T2919 oaz.ClientCnxn$SendThread.readConnectResult Session establishment complete on server localhost/127.0.0.1:10308, sessionid = 0x139f1bfe3f20004, negotiated timeout = 5000
[junit4:junit4]   2> 5026 T2920 oascc.ConnectionManager.process Watcher org.apache.solr.common.cloud.ConnectionManager@22ad681f name:ZooKeeperConnection Watcher:127.0.0.1:10308/solr got event WatchedEvent state:SyncConnected type:None path:null path:null type:None
[junit4:junit4]   2> 5026 T2874 oascc.ConnectionManager.waitForConnected Client is connected to ZooKeeper
[junit4:junit4]   2> 5027 T2879 oazs.PrepRequestProcessor.pRequest Got user-level KeeperException when processing sessionid:0x139f1bfe3f20004 type:create cxid:0x1 zxid:0xfffffffffffffffe txntype:unknown reqpath:n/a Error Path:/solr/overseer Error:KeeperErrorCode = NodeExists for /solr/overseer
[junit4:junit4]   2> 5037 T2879 oazs.PrepRequestProcessor.pRequest Got user-level KeeperException when processing sessionid:0x139f1bfe3f20004 type:create cxid:0x2 zxid:0xfffffffffffffffe txntype:unknown reqpath:n/a Error Path:/solr/overseer Error:KeeperErrorCode = NodeExists for /solr/overseer
[junit4:junit4]   2> 5038 T2874 oasc.ZkController.createEphemeralLiveNode Register node as live in ZooKeeper:/live_nodes/127.0.0.1:10326_solr
[junit4:junit4]   2> 5039 T2879 oazs.PrepRequestProcessor.pRequest Got user-level KeeperException when processing sessionid:0x139f1bfe3f20004 type:delete cxid:0x4 zxid:0xfffffffffffffffe txntype:unknown reqpath:n/a Error Path:/solr/live_nodes/127.0.0.1:10326_solr Error:KeeperErrorCode = NoNode for /solr/live_nodes/127.0.0.1:10326_solr
[junit4:junit4]   2> 5040 T2874 oascc.SolrZkClient.makePath makePath: /live_nodes/127.0.0.1:10326_solr
[junit4:junit4]   2> 5049 T2894 oascc.ZkStateReader$3.process Updating live nodes
[junit4:junit4]   2> 5049 T2908 oascc.ZkStateReader$3.process Updating live nodes
[junit4:junit4]   2> 5049 T2874 oashc.HttpShardHandlerFactory.getParameter Setting socketTimeout to: 0
[junit4:junit4]   2> 5050 T2874 oashc.HttpShardHandlerFactory.getParameter Setting urlScheme to: http://
[junit4:junit4]   2> 5050 T2874 oashc.HttpShardHandlerFactory.getParameter Setting connTimeout to: 0
[junit4:junit4]   2> 5051 T2874 oashc.HttpShardHandlerFactory.getParameter Setting maxConnectionsPerHost to: 20
[junit4:junit4]   2> 5051 T2874 oashc.HttpShardHandlerFactory.getParameter Setting corePoolSize to: 0
[junit4:junit4]   2> 5052 T2874 oashc.HttpShardHandlerFactory.getParameter Setting maximumPoolSize to: 2147483647
[junit4:junit4]   2> 5052 T2874 oashc.HttpShardHandlerFactory.getParameter Setting maxThreadIdleTime to: 5
[junit4:junit4]   2> 5052 T2874 oashc.HttpShardHandlerFactory.getParameter Setting sizeOfQueue to: -1
[junit4:junit4]   2> 5053 T2874 oashc.HttpShardHandlerFactory.getParameter Setting fairnessPolicy to: false
[junit4:junit4]   2> 5053 T2874 oascsi.HttpClientUtil.createClient Creating new http client, config:maxConnectionsPerHost=20&maxConnections=10000&socketTimeout=0&connTimeout=0&retry=false
[junit4:junit4]   2> 5069 T2874 oascc.ZkStateReader.createClusterStateWatchersAndUpdate Updating cluster state from ZooKeeper... 
[junit4:junit4]   2> 5076 T2874 oasc.CoreContainer.create Creating SolrCore 'collection1' using instanceDir: /usr/home/hudson/hudson-slave/workspace/Lucene-Solr-NightlyTests-trunk/solr/build/solr-core/test/J0/./org.apache.solr.cloud.BasicDistributedZk2Test-jetty2-1348380653185/collection1
[junit4:junit4]   2> 5076 T2874 oasc.ZkController.createCollectionZkNode Check for collection zkNode:collection1
[junit4:junit4]   2> 5077 T2874 oasc.ZkController.createCollectionZkNode Collection zkNode exists
[junit4:junit4]   2> 5077 T2874 oasc.ZkController.readConfigName Load collection config from:/collections/collection1
[junit4:junit4]   2> 5079 T2874 oasc.SolrResourceLoader.<init> new SolrResourceLoader for directory: '/usr/home/hudson/hudson-slave/workspace/Lucene-Solr-NightlyTests-trunk/solr/build/solr-core/test/J0/./org.apache.solr.cloud.BasicDistributedZk2Test-jetty2-1348380653185/collection1/'
[junit4:junit4]   2> 5080 T2874 oasc.SolrResourceLoader.replaceClassLoader Adding 'file:/usr/home/hudson/hudson-slave/workspace/Lucene-Solr-NightlyTests-trunk/solr/build/solr-core/test/J0/org.apache.solr.cloud.BasicDistributedZk2Test-jetty2-1348380653185/collection1/lib/README' to classloader
[junit4:junit4]   2> 5081 T2874 oasc.SolrResourceLoader.replaceClassLoader Adding 'file:/usr/home/hudson/hudson-slave/workspace/Lucene-Solr-NightlyTests-trunk/solr/build/solr-core/test/J0/org.apache.solr.cloud.BasicDistributedZk2Test-jetty2-1348380653185/collection1/lib/classes/' to classloader
[junit4:junit4]   2> 5135 T2874 oasc.SolrConfig.<init> Using Lucene MatchVersion: LUCENE_50
[junit4:junit4]   2> 5211 T2874 oasc.SolrConfig.<init> Loaded SolrConfig: solrconfig.xml
[junit4:junit4]   2> 5244 T2895 oascc.ZkStateReader.updateClusterState Updating cloud state from ZooKeeper... 
[junit4:junit4]   2> 5256 T2894 oascc.ZkStateReader$2.process A cluster state change has occurred - updating...
[junit4:junit4]   2> 5256 T2908 oascc.ZkStateReader$2.process A cluster state change has occurred - updating...
[junit4:junit4]   2> 5312 T2920 oascc.ZkStateReader$2.process A cluster state change has occurred - updating...
[junit4:junit4]   2> 5312 T2874 oass.IndexSchema.readSchema Reading Solr Schema
[junit4:junit4]   2> 5323 T2874 oass.IndexSchema.readSchema Schema name=test
[junit4:junit4]   2> 5947 T2874 oass.OpenExchangeRatesOrgProvider.init Initialized with rates=open-exchange-rates.json, refreshInterval=1440.
[junit4:junit4]   2> 5956 T2874 oass.IndexSchema.readSchema default search field in schema is text
[junit4:junit4]   2> 5959 T2874 oass.IndexSchema.readSchema unique key field: id
[junit4:junit4]   2> 5968 T2874 oass.FileExchangeRateProvider.reload Reloading exchange rates from file currency.xml
[junit4:junit4]   2> 5972 T2874 oass.FileExchangeRateProvider.reload Reloading exchange rates from file currency.xml
[junit4:junit4]   2> 5979 T2874 oass.OpenExchangeRatesOrgProvider.reload Reloading exchange rates from open-exchange-rates.json
[junit4:junit4]   2> 5980 T2874 oass.OpenExchangeRatesOrgProvider.reload Reloading exchange rates from open-exchange-rates.json
[junit4:junit4]   2> 5981 T2874 oasc.SolrCore.<init> [collection1] Opening new SolrCore at /usr/home/hudson/hudson-slave/workspace/Lucene-Solr-NightlyTests-trunk/solr/build/solr-core/test/J0/./org.apache.solr.cloud.BasicDistributedZk2Test-jetty2-1348380653185/collection1/, dataDir=./org.apache.solr.cloud.BasicDistributedZk2Test-1348380648427/jetty2/
[junit4:junit4]   2> 5981 T2874 oasc.JmxMonitoredMap.<init> JMX monitoring is enabled. Adding Solr mbeans to JMX Server: com.sun.jmx.mbeanserver.JmxMBeanServer@c191e4c
[junit4:junit4]   2> 5983 T2874 oasc.SolrCore.getNewIndexDir WARNING New index directory detected: old=null new=./org.apache.solr.cloud.BasicDistributedZk2Test-1348380648427/jetty2/index/
[junit4:junit4]   2> 5983 T2874 oasc.SolrCore.initIndex WARNING [collection1] Solr index directory './org.apache.solr.cloud.BasicDistributedZk2Test-1348380648427/jetty2/index' doesn't exist. Creating new index...
[junit4:junit4]   2> 5984 T2874 oasc.CachingDirectoryFactory.get return new directory for /usr/home/hudson/hudson-slave/workspace/Lucene-Solr-NightlyTests-trunk/solr/build/solr-core/test/J0/./org.apache.solr.cloud.BasicDistributedZk2Test-1348380648427/jetty2/index forceNew:false
[junit4:junit4]   2> 5988 T2874 oasc.SolrDeletionPolicy.onCommit SolrDeletionPolicy.onCommit: commits:num=1
[junit4:junit4]   2> 		commit{dir=/usr/home/hudson/hudson-slave/workspace/Lucene-Solr-NightlyTests-trunk/solr/build/solr-core/test/J0/org.apache.solr.cloud.BasicDistributedZk2Test-1348380648427/jetty2/index,segFN=segments_1,generation=1,filenames=[segments_1]
[junit4:junit4]   2> 5989 T2874 oasc.SolrDeletionPolicy.updateCommits newest commit = 1
[junit4:junit4]   2> 5989 T2874 oasc.SolrCore.initWriters created xml: solr.XMLResponseWriter
[junit4:junit4]   2> 5991 T2874 oasup.UpdateRequestProcessorChain.init inserting DistributedUpdateProcessorFactory into updateRequestProcessorChain "dedupe"
[junit4:junit4]   2> 5991 T2874 oasup.UpdateRequestProcessorChain.init inserting DistributedUpdateProcessorFactory into updateRequestProcessorChain "dedupe-allfields"
[junit4:junit4]   2> 5992 T2874 oasup.UpdateRequestProcessorChain.init inserting DistributedUpdateProcessorFactory into updateRequestProcessorChain "stored_sig"
[junit4:junit4]   2> 5992 T2874 oasup.UpdateRequestProcessorChain.init inserting DistributedUpdateProcessorFactory into updateRequestProcessorChain "uniq-fields"
[junit4:junit4]   2> 5992 T2874 oasup.UpdateRequestProcessorChain.init inserting DistributedUpdateProcessorFactory into updateRequestProcessorChain "distrib-dup-test-chain-implicit"
[junit4:junit4]   2> 5993 T2874 oasc.RequestHandlers.initHandlersFromConfig adding lazy requestHandler: solr.ReplicationHandler
[junit4:junit4]   2> 5993 T2874 oasc.RequestHandlers.initHandlersFromConfig created /replication: solr.ReplicationHandler
[junit4:junit4]   2> 5994 T2874 oasc.RequestHandlers.initHandlersFromConfig created standard: solr.StandardRequestHandler
[junit4:junit4]   2> 5994 T2874 oasc.RequestHandlers.initHandlersFromConfig created /get: solr.RealTimeGetHandler
[junit4:junit4]   2> 5995 T2874 oasc.RequestHandlers.initHandlersFromConfig created dismax: solr.SearchHandler
[junit4:junit4]   2> 5995 T2874 oasc.RequestHandlers.initHandlersFromConfig created mock: org.apache.solr.core.MockQuerySenderListenerReqHandler
[junit4:junit4]   2> 5996 T2874 oasc.RequestHandlers.initHandlersFromConfig created /admin/: org.apache.solr.handler.admin.AdminHandlers
[junit4:junit4]   2> 5996 T2874 oasc.RequestHandlers.initHandlersFromConfig created defaults: solr.StandardRequestHandler
[junit4:junit4]   2> 5997 T2874 oasc.RequestHandlers.initHandlersFromConfig adding lazy requestHandler: solr.StandardRequestHandler
[junit4:junit4]   2> 5997 T2874 oasc.RequestHandlers.initHandlersFromConfig created lazy: solr.StandardRequestHandler
[junit4:junit4]   2> 5997 T2874 oasc.RequestHandlers.initHandlersFromConfig created /update: solr.UpdateRequestHandler
[junit4:junit4]   2> 5998 T2874 oasc.RequestHandlers.initHandlersFromConfig created /terms: org.apache.solr.handler.component.SearchHandler
[junit4:junit4]   2> 5998 T2874 oasc.RequestHandlers.initHandlersFromConfig created spellCheckCompRH: org.apache.solr.handler.component.SearchHandler
[junit4:junit4]   2> 5999 T2874 oasc.RequestHandlers.initHandlersFromConfig created spellCheckCompRH_Direct: org.apache.solr.handler.component.SearchHandler
[junit4:junit4]   2> 6000 T2874 oasc.RequestHandlers.initHandlersFromConfig created spellCheckWithWordbreak: org.apache.solr.handler.component.SearchHandler
[junit4:junit4]   2> 6000 T2874 oasc.RequestHandlers.initHandlersFromConfig created spellCheckWithWordbreak_Direct: org.apache.solr.handler.component.SearchHandler
[junit4:junit4]   2> 6001 T2874 oasc.RequestHandlers.initHandlersFromConfig created spellCheckCompRH1: org.apache.solr.handler.component.SearchHandler
[junit4:junit4]   2> 6001 T2874 oasc.RequestHandlers.initHandlersFromConfig created tvrh: org.apache.solr.handler.component.SearchHandler
[junit4:junit4]   2> 6002 T2874 oasc.RequestHandlers.initHandlersFromConfig created /mlt: solr.MoreLikeThisHandler
[junit4:junit4]   2> 6002 T2874 oasc.RequestHandlers.initHandlersFromConfig created /debug/dump: solr.DumpRequestHandler
[junit4:junit4]   2> 6005 T2874 oashl.XMLLoader.init xsltCacheLifetimeSeconds=60
[junit4:junit4]   2> 6009 T2874 oasc.SolrCore.initDeprecatedSupport WARNING solrconfig.xml uses deprecated <admin/gettableFiles>, Please update your config to use the ShowFileRequestHandler.
[junit4:junit4]   2> 6010 T2874 oasc.SolrCore.initDeprecatedSupport WARNING adding ShowFileRequestHandler with hidden files: [SCHEMA.XML, OLD_SYNONYMS.TXT, STOPWORDS.TXT, PROTWORDS.TXT, OPEN-EXCHANGE-RATES.JSON, SYNONYMS.TXT, CURRENCY.XML, MAPPING-ISOLATIN1ACCENT.TXT]
[junit4:junit4]   2> 6013 T2874 oass.SolrIndexSearcher.<init> Opening Searcher@59abbb3b main
[junit4:junit4]   2> 6014 T2874 oasu.CommitTracker.<init> Hard AutoCommit: disabled
[junit4:junit4]   2> 6015 T2874 oasu.CommitTracker.<init> Soft AutoCommit: disabled
[junit4:junit4]   2> 6015 T2874 oashc.SpellCheckComponent.inform Initializing spell checkers
[junit4:junit4]   2> 6032 T2874 oass.DirectSolrSpellChecker.init init: {name=direct,classname=DirectSolrSpellChecker,field=lowerfilt,minQueryLength=3}
[junit4:junit4]   2> 6084 T2921 oasc.SolrCore.registerSearcher [collection1] Registered new searcher Searcher@59abbb3b main{StandardDirectoryReader(segments_1:1)}
[junit4:junit4]   2> 6262 T2895 oascc.ZkStateReader.updateClusterState Updating cloud state from ZooKeeper... 
[junit4:junit4]   2> 6273 T2894 oascc.ZkStateReader$2.process A cluster state change has occurred - updating...
[junit4:junit4]   2> 6273 T2920 oascc.ZkStateReader$2.process A cluster state change has occurred - updating...
[junit4:junit4]   2> 6273 T2908 oascc.ZkStateReader$2.process A cluster state change has occurred - updating...
[junit4:junit4]   2> 6590 T2874 oasc.CoreContainer.register registering core: collection1
[junit4:junit4]   2> 6590 T2874 oasc.ZkController.register Register shard - core:collection1 address:http://127.0.0.1:10326/solr shardId:shard2
[junit4:junit4]   2> 6591 T2874 oascc.SolrZkClient.makePath makePath: /collections/collection1/leader_elect/shard2/election
[junit4:junit4]   2> 6671 T2879 oazs.PrepRequestProcessor.pRequest Got user-level KeeperException when processing sessionid:0x139f1bfe3f20004 type:delete cxid:0x42 zxid:0xfffffffffffffffe txntype:unknown reqpath:n/a Error Path:/solr/collections/collection1/leaders/shard2 Error:KeeperErrorCode = NoNode for /solr/collections/collection1/leaders/shard2
[junit4:junit4]   2> 6672 T2874 oasc.ShardLeaderElectionContext.runLeaderProcess Running the leader process.
[junit4:junit4]   2> 6672 T2879 oazs.PrepRequestProcessor.pRequest Got user-level KeeperException when processing sessionid:0x139f1bfe3f20004 type:create cxid:0x43 zxid:0xfffffffffffffffe txntype:unknown reqpath:n/a Error Path:/solr/overseer Error:KeeperErrorCode = NodeExists for /solr/overseer
[junit4:junit4]   2> 6683 T2874 oasc.ShardLeaderElectionContext.waitForReplicasToComeUp Enough replicas found to continue.
[junit4:junit4]   2> 6683 T2874 oasc.ShardLeaderElectionContext.runLeaderProcess I may be the new leader - try and sync
[junit4:junit4]   2> 6683 T2874 oasc.SyncStrategy.sync Sync replicas to http://127.0.0.1:10326/solr/collection1/
[junit4:junit4]   2> 6684 T2874 oasc.SyncStrategy.syncReplicas Sync Success - now sync replicas to me
[junit4:junit4]   2> 6684 T2874 oasc.SyncStrategy.syncToMe http://127.0.0.1:10326/solr/collection1/ has no replicas
[junit4:junit4]   2> 6684 T2874 oasc.ShardLeaderElectionContext.runLeaderProcess I am the new leader: http://127.0.0.1:10326/solr/collection1/
[junit4:junit4]   2> 6685 T2874 oascc.SolrZkClient.makePath makePath: /collections/collection1/leaders/shard2
[junit4:junit4]   2> 6687 T2879 oazs.PrepRequestProcessor.pRequest Got user-level KeeperException when processing sessionid:0x139f1bfe3f20004 type:create cxid:0x4c zxid:0xfffffffffffffffe txntype:unknown reqpath:n/a Error Path:/solr/overseer Error:KeeperErrorCode = NodeExists for /solr/overseer
[junit4:junit4]   2> 6777 T2895 oascc.ZkStateReader.updateClusterState Updating cloud state from ZooKeeper... 
[junit4:junit4]   2> 6791 T2894 oascc.ZkStateReader$2.process A cluster state change has occurred - updating...
[junit4:junit4]   2> 6791 T2920 oascc.ZkStateReader$2.process A cluster state change has occurred - updating...
[junit4:junit4]   2> 6791 T2908 oascc.ZkStateReader$2.process A cluster state change has occurred - updating...
[junit4:junit4]   2> 6800 T2874 oasc.ZkController.register We are http://127.0.0.1:10326/solr/collection1/ and leader is http://127.0.0.1:10326/solr/collection1/
[junit4:junit4]   2> 6800 T2874 oasc.ZkController.register No LogReplay needed for core=collection1 baseURL=http://127.0.0.1:10326/solr
[junit4:junit4]   2> 6800 T2874 oasc.ZkController.checkRecovery I am the leader, no recovery necessary
[junit4:junit4]   2> 6803 T2874 oascc.ZkStateReader.updateClusterState Updating cloud state from ZooKeeper... 
[junit4:junit4]   2> 6803 T2874 oass.SolrDispatchFilter.init user.dir=/usr/home/hudson/hudson-slave/workspace/Lucene-Solr-NightlyTests-trunk/solr/build/solr-core/test/J0
[junit4:junit4]   2> 6804 T2874 oass.SolrDispatchFilter.init SolrDispatchFilter.init() done
[junit4:junit4]   2> 6804 T2874 oascsi.HttpClientUtil.createClient Creating new http client, config:maxConnections=128&maxConnectionsPerHost=32&followRedirects=false
[junit4:junit4]   2> 6911 T2874 oejs.Server.doStart jetty-8.1.2.v20120308
[junit4:junit4]   2> 6913 T2874 oejs.AbstractConnector.doStart Started SocketConnector@0.0.0.0:10331
[junit4:junit4]   2> 6913 T2874 oasc.SolrResourceLoader.locateSolrHome JNDI not configured for solr (NoInitialContextEx)
[junit4:junit4]   2> 6914 T2874 oasc.SolrResourceLoader.locateSolrHome using system property solr.solr.home: /usr/home/hudson/hudson-slave/workspace/Lucene-Solr-NightlyTests-trunk/solr/build/solr-core/test/J0/./org.apache.solr.cloud.BasicDistributedZk2Test-jetty3-1348380655235
[junit4:junit4]   2> 6914 T2874 oasc.SolrResourceLoader.<init> new SolrResourceLoader for deduced Solr Home: '/usr/home/hudson/hudson-slave/workspace/Lucene-Solr-NightlyTests-trunk/solr/build/solr-core/test/J0/./org.apache.solr.cloud.BasicDistributedZk2Test-jetty3-1348380655235/'
[junit4:junit4]   2> 6937 T2874 oass.SolrDispatchFilter.init SolrDispatchFilter.init()
[junit4:junit4]   2> 6937 T2874 oasc.SolrResourceLoader.locateSolrHome JNDI not configured for solr (NoInitialContextEx)
[junit4:junit4]   2> 6937 T2874 oasc.SolrResourceLoader.locateSolrHome using system property solr.solr.home: /usr/home/hudson/hudson-slave/workspace/Lucene-Solr-NightlyTests-trunk/solr/build/solr-core/test/J0/./org.apache.solr.cloud.BasicDistributedZk2Test-jetty3-1348380655235
[junit4:junit4]   2> 6938 T2874 oasc.CoreContainer$Initializer.initialize looking for solr.xml: /usr/home/hudson/hudson-slave/workspace/Lucene-Solr-NightlyTests-trunk/solr/build/solr-core/test/J0/./org.apache.solr.cloud.BasicDistributedZk2Test-jetty3-1348380655235/solr.xml
[junit4:junit4]   2> 6938 T2874 oasc.CoreContainer.<init> New CoreContainer 1188659908
[junit4:junit4]   2> 6938 T2874 oasc.CoreContainer.load Loading CoreContainer using Solr Home: '/usr/home/hudson/hudson-slave/workspace/Lucene-Solr-NightlyTests-trunk/solr/build/solr-core/test/J0/./org.apache.solr.cloud.BasicDistributedZk2Test-jetty3-1348380655235/'
[junit4:junit4]   2> 6939 T2874 oasc.SolrResourceLoader.<init> new SolrResourceLoader for directory: '/usr/home/hudson/hudson-slave/workspace/Lucene-Solr-NightlyTests-trunk/solr/build/solr-core/test/J0/./org.apache.solr.cloud.BasicDistributedZk2Test-jetty3-1348380655235/'
[junit4:junit4]   2> 6955 T2874 oasc.CoreContainer.load Registering Log Listener
[junit4:junit4]   2> 6965 T2874 oasc.CoreContainer.initZooKeeper Zookeeper client=127.0.0.1:10308/solr
[junit4:junit4]   2> 6966 T2874 oaz.ZooKeeper.<init> Initiating client connection, connectString=127.0.0.1:10308/solr sessionTimeout=5000 watcher=org.apache.solr.common.cloud.ConnectionManager@138e4723
[junit4:junit4]   2> 6967 T2931 oaz.ClientCnxn$SendThread.startConnect Opening socket connection to server /127.0.0.1:10308
[junit4:junit4]   2> 6967 T2874 oascc.ConnectionManager.waitForConnected Waiting for client to connect to ZooKeeper
[junit4:junit4]   2> 6968 T2931 oaz.ClientCnxn$SendThread.primeConnection Socket connection established to localhost/127.0.0.1:10308, initiating session
[junit4:junit4]   2> 6968 T2876 oazs.NIOServerCnxn$Factory.run Accepted socket connection from /140.211.11.196:10332
[junit4:junit4]   2> 6968 T2876 oazs.NIOServerCnxn.readConnectRequest Client attempting to establish new session at /140.211.11.196:10332
[junit4:junit4]   2> 6970 T2878 oazs.NIOServerCnxn.finishSessionInit Established session 0x139f1bfe3f20005 with negotiated timeout 5000 for client /140.211.11.196:10332
[junit4:junit4]   2> 6970 T2931 oaz.ClientCnxn$SendThread.readConnectResult Session establishment complete on server localhost/127.0.0.1:10308, sessionid = 0x139f1bfe3f20005, negotiated timeout = 5000
[junit4:junit4]   2> 6971 T2932 oascc.ConnectionManager.process Watcher org.apache.solr.common.cloud.ConnectionManager@138e4723 name:ZooKeeperConnection Watcher:127.0.0.1:10308/solr got event WatchedEvent state:SyncConnected type:None path:null path:null type:None
[junit4:junit4]   2> 6971 T2874 oascc.ConnectionManager.waitForConnected Client is connected to ZooKeeper
[junit4:junit4]   2> 6971 T2879 oazs.PrepRequestProcessor.pRequest Got user-level KeeperException when processing sessionid:0x139f1bfe3f20005 type:create cxid:0x1 zxid:0xfffffffffffffffe txntype:unknown reqpath:n/a Error Path:/solr/overseer Error:KeeperErrorCode = NodeExists for /solr/overseer
[junit4:junit4]   2> 6980 T2879 oazs.PrepRequestProcessor.pRequest Got user-level KeeperException when processing sessionid:0x139f1bfe3f20005 type:create cxid:0x2 zxid:0xfffffffffffffffe txntype:unknown reqpath:n/a Error Path:/solr/overseer Error:KeeperErrorCode = NodeExists for /solr/overseer
[junit4:junit4]   2> 6981 T2874 oasc.ZkController.createEphemeralLiveNode Register node as live in ZooKeeper:/live_nodes/127.0.0.1:10331_solr
[junit4:junit4]   2> 6982 T2879 oazs.PrepRequestProcessor.pRequest Got user-level KeeperException when processing sessionid:0x139f1bfe3f20005 type:delete cxid:0x4 zxid:0xfffffffffffffffe txntype:unknown reqpath:n/a Error Path:/solr/live_nodes/127.0.0.1:10331_solr Error:KeeperErrorCode = NoNode for /solr/live_nodes/127.0.0.1:10331_solr
[junit4:junit4]   2> 6983 T2874 oascc.SolrZkClient.makePath makePath: /live_nodes/127.0.0.1:10331_solr
[junit4:junit4]   2> 6991 T2894 oascc.ZkStateReader$3.process Updating live nodes
[junit4:junit4]   2> 6991 T2908 oascc.ZkStateReader$3.process Updating live nodes
[junit4:junit4]   2> 6991 T2920 oascc.ZkStateReader$3.process Updating live nodes
[junit4:junit4]   2> 6991 T2874 oashc.HttpShardHandlerFactory.getParameter Setting socketTimeout to: 0
[junit4:junit4]   2> 6992 T2874 oashc.HttpShardHandlerFactory.getParameter Setting urlScheme to: http://
[junit4:junit4]   2> 6992 T2874 oashc.HttpShardHandlerFactory.getParameter Setting connTimeout to: 0
[junit4:junit4]   2> 6992 T2874 oashc.HttpShardHandlerFactory.getParameter Setting maxConnectionsPerHost to: 20
[junit4:junit4]   2> 6993 T2874 oashc.HttpShardHandlerFactory.getParameter Setting corePoolSize to: 0
[junit4:junit4]   2> 6993 T2874 oashc.HttpShardHandlerFactory.getParameter Setting maximumPoolSize to: 2147483647
[junit4:junit4]   2> 6993 T2874 oashc.HttpShardHandlerFactory.getParameter Setting maxThreadIdleTime to: 5
[junit4:junit4]   2> 6993 T2874 oashc.HttpShardHandlerFactory.getParameter Setting sizeOfQueue to: -1
[junit4:junit4]   2> 6994 T2874 oashc.HttpShardHandlerFactory.getParameter Setting fairnessPolicy to: false
[junit4:junit4]   2> 6994 T2874 oascsi.HttpClientUtil.createClient Creating new http client, config:maxConnectionsPerHost=20&maxConnections=10000&socketTimeout=0&connTimeout=0&retry=false
[junit4:junit4]   2> 7004 T2874 oascc.ZkStateReader.createClusterStateWatchersAndUpdate Updating cluster state from ZooKeeper... 
[junit4:junit4]   2> 7009 T2874 oasc.CoreContainer.create Creating SolrCore 'collection1' using instanceDir: /usr/home/hudson/hudson-slave/workspace/Lucene-Solr-NightlyTests-trunk/solr/build/solr-core/test/J0/./org.apache.solr.cloud.BasicDistributedZk2Test-jetty3-1348380655235/collection1
[junit4:junit4]   2> 7009 T2874 oasc.ZkController.createCollectionZkNode Check for collection zkNode:collection1
[junit4:junit4]   2> 7010 T2874 oasc.ZkController.createCollectionZkNode Collection zkNode exists
[junit4:junit4]   2> 7010 T2874 oasc.ZkController.readConfigName Load collection config from:/collections/collection1
[junit4:junit4]   2> 7011 T2874 oasc.SolrResourceLoader.<init> new SolrResourceLoader for directory: '/usr/home/hudson/hudson-slave/workspace/Lucene-Solr-NightlyTests-trunk/solr/build/solr-core/test/J0/./org.apache.solr.cloud.BasicDistributedZk2Test-jetty3-1348380655235/collection1/'
[junit4:junit4]   2> 7012 T2874 oasc.SolrResourceLoader.replaceClassLoader Adding 'file:/usr/home/hudson/hudson-slave/workspace/Lucene-Solr-NightlyTests-trunk/solr/build/solr-core/test/J0/org.apache.solr.cloud.BasicDistributedZk2Test-jetty3-1348380655235/collection1/lib/README' to classloader
[junit4:junit4]   2> 7012 T2874 oasc.SolrResourceLoader.replaceClassLoader Adding 'file:/usr/home/hudson/hudson-slave/workspace/Lucene-Solr-NightlyTests-trunk/solr/build/solr-core/test/J0/org.apache.solr.cloud.BasicDistributedZk2Test-jetty3-1348380655235/collection1/lib/classes/' to classloader
[junit4:junit4]   2> 7046 T2874 oasc.SolrConfig.<init> Using Lucene MatchVersion: LUCENE_50
[junit4:junit4]   2> 7094 T2874 oasc.SolrConfig.<init> Loaded SolrConfig: solrconfig.xml
[junit4:junit4]   2> 7195 T2874 oass.IndexSchema.readSchema Reading Solr Schema
[junit4:junit4]   2> 7201 T2874 oass.IndexSchema.readSchema Schema name=test
[junit4:junit4]   2> 7304 T2895 oascc.ZkStateReader.updateClusterState Updating cloud state from ZooKeeper... 
[junit4:junit4]   2> 7316 T2908 oascc.ZkStateReader$2.process A cluster state change has occurred - updating...
[junit4:junit4]   2> 7316 T2932 oascc.ZkStateReader$2.process A cluster state change has occurred - updating...
[junit4:junit4]   2> 7316 T2894 oascc.ZkStateReader$2.process A cluster state change has occurred - updating...
[junit4:junit4]   2> 7316 T2920 oascc.ZkStateReader$2.process A cluster state change has occurred - updating...
[junit4:junit4]   2> 7675 T2874 oass.OpenExchangeRatesOrgProvider.init Initialized with rates=open-exchange-rates.json, refreshInterval=1440.
[junit4:junit4]   2> 7684 T2874 oass.IndexSchema.readSchema default search field in schema is text
[junit4:junit4]   2> 7688 T2874 oass.IndexSchema.readSchema unique key field: id
[junit4:junit4]   2> 7698 T2874 oass.FileExchangeRateProvider.reload Reloading exchange rates from file currency.xml
[junit4:junit4]   2> 7702 T2874 oass.FileExchangeRateProvider.reload Reloading exchange rates from file currency.xml
[junit4:junit4]   2> 7706 T2874 oass.OpenExchangeRatesOrgProvider.reload Reloading exchange rates from open-exchange-rates.json
[junit4:junit4]   2> 7707 T2874 oass.OpenExchangeRatesOrgProvider.reload Reloading exchange rates from open-exchange-rates.json
[junit4:junit4]   2> 7708 T2874 oasc.SolrCore.<init> [collection1] Opening new SolrCore at /usr/home/hudson/hudson-slave/workspace/Lucene-Solr-NightlyTests-trunk/solr/build/solr-core/test/J0/./org.apache.solr.cloud.BasicDistributedZk2Test-jetty3-1348380655235/collection1/, dataDir=./org.apache.solr.cloud.BasicDistributedZk2Test-1348380648427/jetty3/
[junit4:junit4]   2> 7709 T2874 oasc.JmxMonitoredMap.<init> JMX monitoring is enabled. Adding Solr mbeans to JMX Server: com.sun.jmx.mbeanserver.JmxMBeanServer@c191e4c
[junit4:junit4]   2> 7710 T2874 oasc.SolrCore.getNewIndexDir WARNING New index directory detected: old=null new=./org.apache.solr.cloud.BasicDistributedZk2Test-1348380648427/jetty3/index/
[junit4:junit4]   2> 7710 T2874 oasc.SolrCore.initIndex WARNING [collection1] Solr index directory './org.apache.solr.cloud.BasicDistributedZk2Test-1348380648427/jetty3/index' doesn't exist. Creating new index...
[junit4:junit4]   2> 7711 T2874 oasc.CachingDirectoryFactory.get return new directory for /usr/home/hudson/hudson-slave/workspace/Lucene-Solr-NightlyTests-trunk/solr/build/solr-core/test/J0/./org.apache.solr.cloud.BasicDistributedZk2Test-1348380648427/jetty3/index forceNew:false
[junit4:junit4]   2> 7716 T2874 oasc.SolrDeletionPolicy.onCommit SolrDeletionPolicy.onCommit: commits:num=1
[junit4:junit4]   2> 		commit{dir=/usr/home/hudson/hudson-slave/workspace/Lucene-Solr-NightlyTests-trunk/solr/build/solr-core/test/J0/org.apache.solr.cloud.BasicDistributedZk2Test-1348380648427/jetty3/index,segFN=segments_1,generation=1,filenames=[segments_1]
[junit4:junit4]   2> 7716 T2874 oasc.SolrDeletionPolicy.updateCommits newest commit = 1
[junit4:junit4]   2> 7717 T2874 oasc.SolrCore.initWriters created xml: solr.XMLResponseWriter
[junit4:junit4]   2> 7719 T2874 oasup.UpdateRequestProcessorChain.init inserting DistributedUpdateProcessorFactory into updateRequestProcessorChain "dedupe"
[junit4:junit4]   2> 7719 T2874 oasup.UpdateRequestProcessorChain.init inserting DistributedUpdateProcessorFactory into updateRequestProcessorChain "dedupe-allfields"
[junit4:junit4]   2> 7720 T2874 oasup.UpdateRequestProcessorChain.init inserting DistributedUpdateProcessorFactory into updateRequestProcessorChain "stored_sig"
[junit4:junit4]   2> 7720 T2874 oasup.UpdateRequestProcessorChain.init inserting DistributedUpdateProcessorFactory into updateRequestProcessorChain "uniq-fields"
[junit4:junit4]   2> 7721 T2874 oasup.UpdateRequestProcessorChain.init inserting DistributedUpdateProcessorFactory into updateRequestProcessorChain "distrib-dup-test-chain-implicit"
[junit4:junit4]   2> 7721 T2874 oasc.RequestHandlers.initHandlersFromConfig adding lazy requestHandler: solr.ReplicationHandler
[junit4:junit4]   2> 7721 T2874 oasc.RequestHandlers.initHandlersFromConfig created /replication: solr.ReplicationHandler
[junit4:junit4]   2> 7722 T2874 oasc.RequestHandlers.initHandlersFromConfig created standard: solr.StandardRequestHandler
[junit4:junit4]   2> 7723 T2874 oasc.RequestHandlers.initHandlersFromConfig created /get: solr.RealTimeGetHandler
[junit4:junit4]   2> 7723 T2874 oasc.RequestHandlers.initHandlersFromConfig created dismax: solr.SearchHandler
[junit4:junit4]   2> 7724 T2874 oasc.RequestHandlers.initHandlersFromConfig created mock: org.apache.solr.core.MockQuerySenderListenerReqHandler
[junit4:junit4]   2> 7724 T2874 oasc.RequestHandlers.initHandlersFromConfig created /admin/: org.apache.solr.handler.admin.AdminHandlers
[junit4:junit4]   2> 7725 T2874 oasc.RequestHandlers.initHandlersFromConfig created defaults: solr.StandardRequestHandler
[junit4:junit4]   2> 7725 T2874 oasc.RequestHandlers.initHandlersFromConfig adding lazy requestHandler: solr.StandardRequestHandler
[junit4:junit4]   2> 7726 T2874 oasc.RequestHandlers.initHandlersFromConfig created lazy: solr.StandardRequestHandler
[junit4:junit4]   2> 7727 T2874 oasc.RequestHandlers.initHandlersFromConfig created /update: solr.UpdateRequestHandler
[junit4:junit4]   2> 7727 T2874 oasc.RequestHandlers.initHandlersFromConfig created /terms: org.apache.solr.handler.component.SearchHandler
[junit4:junit4]   2> 7728 T2874 oasc.RequestHandlers.initHandlersFromConfig created spellCheckCompRH: org.apache.solr.handler.component.SearchHandler
[junit4:junit4]   2> 7728 T2874 oasc.RequestHandlers.initHandlersFromConfig created spellCheckCompRH_Direct: org.apache.solr.handler.component.SearchHandler
[junit4:junit4]   2> 7729 T2874 oasc.RequestHandlers.initHandlersFromConfig created spellCheckWithWordbreak: org.apache.solr.handler.component.SearchHandler
[junit4:junit4]   2> 7730 T2874 oasc.RequestHandlers.initHandlersFromConfig created spellCheckWithWordbreak_Direct: org.apache.solr.handler.component.SearchHandler
[junit4:junit4]   2> 7730 T2874 oasc.RequestHandlers.initHandlersFromConfig created spellCheckCompRH1: org.apache.solr.handler.component.SearchHandler
[junit4:junit4]   2> 7731 T2874 oasc.RequestHandlers.initHandlersFromConfig created tvrh: org.apache.solr.handler.component.SearchHandler
[junit4:junit4]   2> 7732 T2874 oasc.RequestHandlers.initHandlersFromConfig created /mlt: solr.MoreLikeThisHandler
[junit4:junit4]   2> 7733 T2874 oasc.RequestHandlers.initHandlersFromConfig created /debug/dump: solr.DumpRequestHandler
[junit4:junit4]   2> 7735 T2874 oashl.XMLLoader.init xsltCacheLifetimeSeconds=60
[junit4:junit4]   2> 7739 T2874 oasc.SolrCore.initDeprecatedSupport WARNING solrconfig.xml uses deprecated <admin/gettableFiles>, Please update your config to use the ShowFileRequestHandler.
[junit4:junit4]   2> 7740 T2874 oasc.SolrCore.initDeprecatedSupport WARNING adding ShowFileRequestHandler with hidden files: [SCHEMA.XML, OLD_SYNONYMS.TXT, STOPWORDS.TXT, PROTWORDS.TXT, OPEN-EXCHANGE-RATES.JSON, SYNONYMS.TXT, CURRENCY.XML, MAPPING-ISOLATIN1ACCENT.TXT]
[junit4:junit4]   2> 7744 T2874 oass.SolrIndexSearcher.<init> Opening Searcher@3d8999fa main
[junit4:junit4]   2> 7745 T2874 oasu.CommitTracker.<init> Hard AutoCommit: disabled
[junit4:junit4]   2> 7745 T2874 oasu.CommitTracker.<init> Soft AutoCommit: disabled
[junit4:junit4]   2> 7746 T2874 oashc.SpellCheckComponent.inform Initializing spell checkers
[junit4:junit4]   2> 7752 T2874 oass.DirectSolrSpellChecker.init init: {name=direct,classname=DirectSolrSpellChecker,field=lowerfilt,minQueryLength=3}
[junit4:junit4]   2> 7806 T2933 oasc.SolrCore.registerSearcher [collection1] Registered new searcher Searcher@3d8999fa main{StandardDirectoryReader(segments_1:1)}
[junit4:junit4]   2> 7838 T2895 oascc.ZkStateReader.updateClusterState Updating cloud state from ZooKeeper... 
[junit4:junit4]   2> 7881 T2920 oascc.ZkStateReader$2.process A cluster state change has occurred - updating...
[junit4:junit4]   2> 7881 T2908 oascc.ZkStateReader$2.process A cluster state change has occurred - updating...
[junit4:junit4]   2> 7881 T2894 oascc.ZkStateReader$2.process A cluster state change has occurred - updating...
[junit4:junit4]   2> 7881 T2932 oascc.ZkStateReader$2.process A cluster state change has occurred - updating...
[junit4:junit4]   2> 8338 T2874 oasc.CoreContainer.register registering core: collection1
[junit4:junit4]   2> 8338 T2874 oasc.ZkController.register Register shard - core:collection1 address:http://127.0.0.1:10331/solr shardId:shard1
[junit4:junit4]   2> 8341 T2874 oasc.ZkController.register We are http://127.0.0.1:10331/solr/collection1/ and leader is http://127.0.0.1:10323/solr/collection1/
[junit4:junit4]   2> 8341 T2874 oasc.ZkController.register No LogReplay needed for core=collection1 baseURL=http://127.0.0.1:10331/solr
[junit4:junit4]   2> 8341 T2874 oasc.ZkController.checkRecovery Core needs to recover:collection1
[junit4:junit4]   2> 8342 T2874 oasu.DefaultSolrCoreState.doRecovery Running recovery - first canceling any ongoing recovery
[junit4:junit4]   2> ASYNC  NEW_CORE C233 name=collection1 org.apache.solr.core.SolrCore@68881cf4 url=http://127.0.0.1:10331/solr/collection1 node=127.0.0.1:10331_solr
[junit4:junit4]   2> 8343 T2934 C233 P10331 oasc.RecoveryStrategy.run Starting recovery process.  core=collection1 recoveringAfterStartup=true
[junit4:junit4]   2> 8343 T2874 oascc.ZkStateReader.updateClusterState Updating cloud state from ZooKeeper... 
[junit4:junit4]   2> 8344 T2934 C233 P10331 oasc.RecoveryStrategy.doRecovery ###### startupVersions=[]
[junit4:junit4]   2> 8344 T2874 oass.SolrDispatchFilter.init user.dir=/usr/home/hudson/hudson-slave/workspace/Lucene-Solr-NightlyTests-trunk/solr/build/solr-core/test/J0
[junit4:junit4]   2> 8344 T2874 oass.SolrDispatchFilter.init SolrDispatchFilter.init() done
[junit4:junit4]   2> 8345 T2874 oascsi.HttpClientUtil.createClient Creating new http client, config:maxConnections=128&maxConnectionsPerHost=32&followRedirects=false
[junit4:junit4]   2> 8345 T2934 C233 P10331 oasc.RecoveryStrategy.doRecovery Attempting to PeerSync from http://127.0.0.1:10323/solr/collection1/ core=collection1 - recoveringAfterStartup=true
[junit4:junit4]   2> 8345 T2934 C233 P10331 oasu.PeerSync.sync PeerSync: core=collection1 url=http://127.0.0.1:10331/solr START replicas=[http://127.0.0.1:10323/solr/collection1/] nUpdates=100
[junit4:junit4]   2> 8346 T2934 C233 P10331 oasu.PeerSync.sync WARNING no frame of reference to tell of we've missed updates
[junit4:junit4]   2> 8346 T2934 C233 P10331 oasc.RecoveryStrategy.doRecovery PeerSync Recovery was not successful - trying replication. core=collection1
[junit4:junit4]   2> 8346 T2934 C233 P10331 oasc.RecoveryStrategy.doRecovery Starting Replication Recovery. core=collection1
[junit4:junit4]   2> 8346 T2934 C233 P10331 oascsi.HttpClientUtil.createClient Creating new http client, config:maxConnections=128&maxConnectionsPerHost=32&followRedirects=false
[junit4:junit4]   2> ASYNC  NEW_CORE C234 name=collection1 org.apache.solr.core.SolrCore@504c9399 url=http://127.0.0.1:10323/solr/collection1 node=127.0.0.1:10323_solr
[junit4:junit4]   2> 8353 T2900 C234 P10323 REQ /get {distrib=false&qt=/get&wt=javabin&version=2&getVersions=100} status=0 QTime=0 
[junit4:junit4]   2> 8415 T2895 oascc.ZkStateReader.updateClusterState Updating cloud state from ZooKeeper... 
[junit4:junit4]   2> 8434 T2894 oascc.ZkStateReader$2.process A cluster state change has occurred - updating...
[junit4:junit4]   2> 8434 T2908 oascc.ZkStateReader$2.process A cluster state change has occurred - updating...
[junit4:junit4]   2> 8434 T2920 oascc.ZkStateReader$2.process A cluster state change has occurred - updating...
[junit4:junit4]   2> 8434 T2932 oascc.ZkStateReader$2.process A cluster state change has occurred - updating...
[junit4:junit4]   2> 8513 T2874 oejs.Server.doStart jetty-8.1.2.v20120308
[junit4:junit4]   2> 8516 T2874 oejs.AbstractConnector.doStart Started SocketConnector@0.0.0.0:10337
[junit4:junit4]   2> 8516 T2874 oasc.SolrResourceLoader.locateSolrHome JNDI not configured for solr (NoInitialContextEx)
[junit4:junit4]   2> 8517 T2874 oasc.SolrResourceLoader.locateSolrHome using system property solr.solr.home: /usr/home/hudson/hudson-slave/workspace/Lucene-Solr-NightlyTests-trunk/solr/build/solr-core/test/J0/./org.apache.solr.cloud.BasicDistributedZk2Test-jetty4-1348380656781
[junit4:junit4]   2> 8517 T2874 oasc.SolrResourceLoader.<init> new SolrResourceLoader for deduced Solr Home: '/usr/home/hudson/hudson-slave/workspace/Lucene-Solr-NightlyTests-trunk/solr/build/solr-core/test/J0/./org.apache.solr.cloud.BasicDistributedZk2Test-jetty4-1348380656781/'
[junit4:junit4]   2> 8541 T2874 oass.SolrDispatchFilter.init SolrDispatchFilter.init()
[junit4:junit4]   2> 8541 T2874 oasc.SolrResourceLoader.locateSolrHome JNDI not configured for solr (NoInitialContextEx)
[junit4:junit4]   2> 8541 T2874 oasc.SolrResourceLoader.locateSolrHome using system property solr.solr.home: /usr/home/hudson/hudson-slave/workspace/Lucene-Solr-NightlyTests-trunk/solr/build/solr-core/test/J0/./org.apache.solr.cloud.BasicDistributedZk2Test-jetty4-1348380656781
[junit4:junit4]   2> 8542 T2874 oasc.CoreContainer$Initializer.initialize looking for solr.xml: /usr/home/hudson/hudson-slave/workspace/Lucene-Solr-NightlyTests-trunk/solr/build/solr-core/test/J0/./org.apache.solr.cloud.BasicDistributedZk2Test-jetty4-1348380656781/solr.xml
[junit4:junit4]   2> 8542 T2874 oasc.CoreContainer.<init> New CoreContainer 1028648809
[junit4:junit4]   2> 8543 T2874 oasc.CoreContainer.load Loading CoreContainer using Solr Home: '/usr/home/hudson/hudson-slave/workspace/Lucene-Solr-NightlyTests-trunk/solr/build/solr-core/test/J0/./org.apache.solr.cloud.BasicDistributedZk2Test-jetty4-1348380656781/'
[junit4:junit4]   2> 8543 T2874 oasc.SolrResourceLoader.<init> new SolrResourceLoader for directory: '/usr/home/hudson/hudson-slave/workspace/Lucene-Solr-NightlyTests-trunk/solr/build/solr-core/test/J0/./org.apache.solr.cloud.BasicDistributedZk2Test-jetty4-1348380656781/'
[junit4:junit4]   2> 8560 T2874 oasc.CoreContainer.load Registering Log Listener
[junit4:junit4]   2> 8571 T2874 oasc.CoreContainer.initZooKeeper Zookeeper client=127.0.0.1:10308/solr
[junit4:junit4]   2> 8572 T2874 oaz.ZooKeeper.<init> Initiating client connection, connectString=127.0.0.1:10308/solr sessionTimeout=5000 watcher=org.apache.solr.common.cloud.ConnectionManager@e54c7a6
[junit4:junit4]   2> 8573 T2874 oascc.ConnectionManager.waitForConnected Waiting for client to connect to ZooKeeper
[junit4:junit4]   2> 8574 T2945 oaz.ClientCnxn$SendThread.startConnect Opening socket connection to server /127.0.0.1:10308
[junit4:junit4]   2> 8576 T2945 oaz.ClientCnxn$SendThread.primeConnection Socket connection established to localhost/127.0.0.1:10308, initiating session
[junit4:junit4]   2> 8577 T2876 oazs.NIOServerCnxn$Factory.run Accepted socket connection from /140.211.11.196:10338
[junit4:junit4]   2> 8577 T2876 oazs.NIOServerCnxn.readConnectRequest Client attempting to establish new session at /140.211.11.196:10338
[junit4:junit4]   2> 8579 T2878 oazs.NIOServerCnxn.finishSessionInit Established session 0x139f1bfe3f20006 with negotiated timeout 5000 for client /140.211.11.196:10338
[junit4:junit4]   2> 8579 T2945 oaz.ClientCnxn$SendThread.readConnectResult Session establishment complete on server localhost/127.0.0.1:10308, sessionid = 0x139f1bfe3f20006, negotiated timeout = 5000
[junit4:junit4]   2> 8579 T2946 oascc.ConnectionManager.process Watcher org.apache.solr.common.cloud.ConnectionManager@e54c7a6 name:ZooKeeperConnection Watcher:127.0.0.1:10308/solr got event WatchedEvent state:SyncConnected type:None path:null path:null type:None
[junit4:junit4]   2> 8579 T2874 oascc.ConnectionManager.waitForConnected Client is connected to ZooKeeper
[junit4:junit4]   2> 8580 T2879 oazs.PrepRequestProcessor.pRequest Got user-level KeeperException when processing sessionid:0x139f1bfe3f20006 type:create cxid:0x1 zxid:0xfffffffffffffffe txntype:unknown reqpath:n/a Error Path:/solr/overseer Error:KeeperErrorCode = NodeExists for /solr/overseer
[junit4:junit4]   2> 8581 T2879 oazs.PrepRequestProcessor.pRequest Got user-level KeeperException when processing sessionid:0x139f1bfe3f20006 type:create cxid:0x2 zxid:0xfffffffffffffffe txntype:unknown reqpath:n/a Error Path:/solr/overseer Error:KeeperErrorCode = NodeExists for /solr/overseer
[junit4:junit4]   2> 8590 T2874 oasc.ZkController.createEphemeralLiveNode Register node as live in ZooKeeper:/live_nodes/127.0.0.1:10337_solr
[junit4:junit4]   2> 8591 T2879 oazs.PrepRequestProcessor.pRequest Got user-level KeeperException when processing sessionid:0x139f1bfe3f20006 type:delete cxid:0x4 zxid:0xfffffffffffffffe txntype:unknown reqpath:n/a Error Path:/solr/live_nodes/127.0.0.1:10337_solr Error:KeeperErrorCode = NoNode for /solr/live_nodes/127.0.0.1:10337_solr
[junit4:junit4]   2> 8591 T2874 oascc.SolrZkClient.makePath makePath: /live_nodes/127.0.0.1:10337_solr
[junit4:junit4]   2> 8598 T2908 oascc.ZkStateReader$3.process Updating live nodes
[junit4:junit4]   2> 8598 T2894 oascc.ZkStateReader$3.process Updating live nodes
[junit4:junit4]   2> 8598 T2932 oascc.ZkStateReader$3.process Updating live nodes
[junit4:junit4]   2> 8598 T2920 oascc.ZkStateReader$3.process Updating live nodes
[junit4:junit4]   2> 8599 T2874 oashc.HttpShardHandlerFactory.getParameter Setting socketTimeout to: 0
[junit4:junit4]   2> 8599 T2874 oashc.HttpShardHandlerFactory.getParameter Setting urlScheme to: http://
[junit4:junit4]   2> 8599 T2874 oashc.HttpShardHandlerFactory.getParameter Setting connTimeout to: 0
[junit4:junit4]   2> 8600 T2874 oashc.HttpShardHandlerFactory.getParameter Setting maxConnectionsPerHost to: 20
[junit4:junit4]   2> 8600 T2874 oashc.HttpShardHandlerFactory.getParameter Setting corePoolSize to: 0
[junit4:junit4]   2> 8600 T2874 oashc.HttpShardHandlerFactory.getParameter Setting maximumPoolSize to: 2147483647
[junit4:junit4]   2> 8601 T2874 oashc.HttpShardHandlerFactory.getParameter Setting maxThreadIdleTime to: 5
[junit4:junit4]   2> 8601 T2874 oashc.HttpShardHandlerFactory.getParameter Setting sizeOfQueue to: -1
[junit4:junit4]   2> 8601 T2874 oashc.HttpShardHandlerFactory.getParameter Setting fairnessPolicy to: false
[junit4:junit4]   2> 8602 T2874 oascsi.HttpClientUtil.createClient Creating new http client, config:maxConnectionsPerHost=20&maxConnections=10000&socketTimeout=0&connTimeout=0&retry=false
[junit4:junit4]   2> 8612 T2874 oascc.ZkStateReader.createClusterStateWatchersAndUpdate Updating cluster state from ZooKeeper... 
[junit4:junit4]   2> 8617 T2874 oasc.CoreContainer.create Creating SolrCore 'collection1' using instanceDir: /usr/home/hudson/hudson-slave/workspace/Lucene-Solr-NightlyTests-trunk/solr/build/solr-core/test/J0/./org.apache.solr.cloud.BasicDistributedZk2Test-jetty4-1348380656781/collection1
[junit4:junit4]   2> 8617 T2874 oasc.ZkController.createCollectionZkNode Check for collection zkNode:collection1
[junit4:junit4]   2> 8617 T2874 oasc.ZkController.createCollectionZkNode Collection zkNode exists
[junit4:junit4]   2> 8618 T2874 oasc.ZkController.readConfigName Load collection config from:/collections/collection1
[junit4:junit4]   2> 8619 T2874 oasc.SolrResourceLoader.<init> new SolrResourceLoader for directory: '/usr/home/hudson/hudson-slave/workspace/Lucene-Solr-NightlyTests-trunk/solr/build/solr-core/test/J0/./org.apache.solr.cloud.BasicDistributedZk2Test-jetty4-1348380656781/collection1/'
[junit4:junit4]   2> 8620 T2874 oasc.SolrResourceLoader.replaceClassLoader Adding 'file:/usr/home/hudson/hudson-slave/workspace/Lucene-Solr-NightlyTests-trunk/solr/build/solr-core/test/J0/org.apache.solr.cloud.BasicDistributedZk2Test-jetty4-1348380656781/collection1/lib/README' to classloader
[junit4:junit4]   2> 8620 T2874 oasc.SolrResourceLoader.replaceClassLoader Adding 'file:/usr/home/hudson/hudson-slave/workspace/Lucene-Solr-NightlyTests-trunk/solr/build/solr-core/test/J0/org.apache.solr.cloud.BasicDistributedZk2Test-jetty4-1348380656781/collection1/lib/classes/' to classloader
[junit4:junit4]   2> 8654 T2874 oasc.SolrConfig.<init> Using Lucene MatchVersion: LUCENE_50
[junit4:junit4]   2> 8702 T2874 oasc.SolrConfig.<init> Loaded SolrConfig: solrconfig.xml
[junit4:junit4]   2> 8802 T2874 oass.IndexSchema.readSchema Reading Solr Schema
[junit4:junit4]   2> 8809 T2874 oass.IndexSchema.readSchema Schema name=test
[junit4:junit4]   2> 9234 T2874 oass.OpenExchangeRatesOrgProvider.init Initialized with rates=open-exchange-rates.json, refreshInterval=1440.
[junit4:junit4]   2> 9241 T2874 oass.IndexSchema.readSchema default search field in schema is text
[junit4:junit4]   2> 9244 T2874 oass.IndexSchema.readSchema unique key field: id
[junit4:junit4]   2> 9253 T2874 oass.FileExchangeRateProvider.reload Reloading exchange rates from file currency.xml
[junit4:junit4]   2> 9257 T2874 oass.FileExchangeRateProvider.reload Reloading exchange rates from file currency.xml
[junit4:junit4]   2> 9260 T2874 oass.OpenExchangeRatesOrgProvider.reload Reloading exchange rates from open-exchange-rates.json
[junit4:junit4]   2> 9261 T2874 oass.OpenExchangeRatesOrgProvider.reload Reloading exchange rates from open-exchange-rates.json
[junit4:junit4]   2> 9261 T2874 oasc.SolrCore.<init> [collection1] Opening new SolrCore at /usr/home/hudson/hudson-slave/workspace/Lucene-Solr-NightlyTests-trunk/solr/build/solr-core/test/J0/./org.apache.solr.cloud.BasicDistributedZk2Test-jetty4-1348380656781/collection1/, dataDir=./org.apache.solr.cloud.BasicDistributedZk2Test-1348380648427/jetty4/
[junit4:junit4]   2> 9262 T2874 oasc.JmxMonitoredMap.<init> JMX monitoring is enabled. Adding Solr mbeans to JMX Server: com.sun.jmx.mbeanserver.JmxMBeanServer@c191e4c
[junit4:junit4]   2> 9263 T2874 oasc.SolrCore.getNewIndexDir WARNING New index directory detected: old=null new=./org.apache.solr.cloud.BasicDistributedZk2Test-1348380648427/jetty4/index/
[junit4:junit4]   2> 9263 T2874 oasc.SolrCore.initIndex WARNING [collection1] Solr index directory './org.apache.solr.cloud.BasicDistributedZk2Test-1348380648427/jetty4/index' doesn't exist. Creating new index...
[junit4:junit4]   2> 9264 T2874 oasc.CachingDirectoryFactory.get return new directory for /usr/home/hudson/hudson-slave/workspace/Lucene-Solr-NightlyTests-trunk/solr/build/solr-core/test/J0/./org.apache.solr.cloud.BasicDistributedZk2Test-1348380648427/jetty4/index forceNew:false
[junit4:junit4]   2> 9268 T2874 oasc.SolrDeletionPolicy.onCommit SolrDeletionPolicy.onCommit: commits:num=1
[junit4:junit4]   2> 		commit{dir=/usr/home/hudson/hudson-slave/workspace/Lucene-Solr-NightlyTests-trunk/solr/build/solr-core/test/J0/org.apache.solr.cloud.BasicDistributedZk2Test-1348380648427/jetty4/index,segFN=segments_1,generation=1,filenames=[segments_1]
[junit4:junit4]   2> 9268 T2874 oasc.SolrDeletionPolicy.updateCommits newest commit = 1
[junit4:junit4]   2> 9269 T2874 oasc.SolrCore.initWriters created xml: solr.XMLResponseWriter
[junit4:junit4]   2> 9270 T2874 oasup.UpdateRequestProcessorChain.init inserting DistributedUpdateProcessorFactory into updateRequestProcessorChain "dedupe"
[junit4:junit4]   2> 9271 T2874 oasup.UpdateRequestProcessorChain.init inserting DistributedUpdateProcessorFactory into updateRequestProcessorChain "dedupe-allfields"
[junit4:junit4]   2> 9271 T2874 oasup.UpdateRequestProcessorChain.init inserting DistributedUpdateProcessorFactory into updateRequestProcessorChain "stored_sig"
[junit4:junit4]   2> 9272 T2874 oasup.UpdateRequestProcessorChain.init inserting DistributedUpdateProcessorFactory into updateRequestProcessorChain "uniq-fields"
[junit4:junit4]   2> 9272 T2874 oasup.UpdateRequestProcessorChain.init inserting DistributedUpdateProcessorFactory into updateRequestProcessorChain "distrib-dup-test-chain-implicit"
[junit4:junit4]   2> 9272 T2874 oasc.RequestHandlers.initHandlersFromConfig adding lazy requestHandler: solr.ReplicationHandler
[junit4:junit4]   2> 9273 T2874 oasc.RequestHandlers.initHandlersFromConfig created /replication: solr.ReplicationHandler
[junit4:junit4]   2> 9273 T2874 oasc.RequestHandlers.initHandlersFromConfig created standard: solr.StandardRequestHandler
[junit4:junit4]   2> 9274 T2874 oasc.RequestHandlers.initHandlersFromConfig created /get: solr.RealTimeGetHandler
[junit4:junit4]   2> 9275 T2874 oasc.RequestHandlers.initHandlersFromConfig created dismax: solr.SearchHandler
[junit4:junit4]   2> 9275 T2874 oasc.RequestHandlers.initHandlersFromConfig created mock: org.apache.solr.core.MockQuerySenderListenerReqHandler
[junit4:junit4]   2> 9276 T2874 oasc.RequestHandlers.initHandlersFromConfig created /admin/: org.apache.solr.handler.admin.AdminHandlers
[junit4:junit4]   2> 9276 T2874 oasc.RequestHandlers.initHandlersFromConfig created defaults: solr.StandardRequestHandler
[junit4:junit4]   2> 9276 T2874 oasc.RequestHandlers.initHandlersFromConfig adding lazy requestHandler: solr.StandardRequestHandler
[junit4:junit4]   2> 9277 T2874 oasc.RequestHandlers.initHandlersFromConfig created lazy: solr.StandardRequestHandler
[junit4:junit4]   2> 9277 T2874 oasc.RequestHandlers.initHandlersFromConfig created /update: solr.UpdateRequestHandler
[junit4:junit4]   2> 9278 T2874 oasc.RequestHandlers.initHandlersFromConfig created /terms: org.apache.solr.handler.component.SearchHandler
[junit4:junit4]   2> 9278 T2874 oasc.RequestHandlers.initHandlersFromConfig created spellCheckCompRH: org.apache.solr.handler.component.SearchHandler
[junit4:junit4]   2> 9279 T2874 oasc.RequestHandlers.initHandlersFromConfig created spellCheckCompRH_Direct: org.apache.solr.handler.component.SearchHandler
[junit4:junit4]   2> 9279 T2874 oasc.RequestHandlers.initHandlersFromConfig created spellCheckWithWordbreak: org.apache.solr.handler.component.SearchHandler
[junit4:junit4]   2> 9280 T2874 oasc.RequestHandlers.initHandlersFromConfig created spellCheckWithWordbreak_Direct: org.apache.solr.handler.component.SearchHandler
[junit4:junit4]   2> 9280 T2874 oasc.RequestHandlers.initHandlersFromConfig created spellCheckCompRH1: org.apache.solr.handler.component.SearchHandler
[junit4:junit4]   2> 9281 T2874 oasc.RequestHandlers.initHandlersFromConfig created tvrh: org.apache.solr.handler.component.SearchHandler
[junit4:junit4]   2> 9281 T2874 oasc.RequestHandlers.initHandlersFromConfig created /mlt: solr.MoreLikeThisHandler
[junit4:junit4]   2> 9282 T2874 oasc.RequestHandlers.initHandlersFromConfig created /debug/dump: solr.DumpRequestHandler
[junit4:junit4]   2> 9284 T2874 oashl.XMLLoader.init xsltCacheLifetimeSeconds=60
[junit4:junit4]   2> 9288 T2874 oasc.SolrCore.initDeprecatedSupport WARNING solrconfig.xml uses deprecated <admin/gettableFiles>, Please update your config to use the ShowFileRequestHandler.
[junit4:junit4]   2> 9289 T2874 oasc.SolrCore.initDeprecatedSupport WARNING adding ShowFileRequestHandler with hidden files: [SCHEMA.XML, OLD_SYNONYMS.TXT, STOPWORDS.TXT, PROTWORDS.TXT, OPEN-EXCHANGE-RATES.JSON, SYNONYMS.TXT, CURRENCY.XML, MAPPING-ISOLATIN1ACCENT.TXT]
[junit4:junit4]   2> 9298 T2874 oass.SolrIndexSearcher.<init> Opening Searcher@2195e29 main
[junit4:junit4]   2> 9299 T2874 oasu.CommitTracker.<init> Hard AutoCommit: disabled
[junit4:junit4]   2> 9299 T2874 oasu.CommitTracker.<init> Soft AutoCommit: disabled
[junit4:junit4]   2> 9299 T2874 oashc.SpellCheckComponent.inform Initializing spell checkers
[junit4:junit4]   2> 9315 T2874 oass.DirectSolrSpellChecker.init init: {name=direct,classname=DirectSolrSpellChecker,field=lowerfilt,minQueryLength=3}
[junit4:junit4]   2> 9361 T2947 oasc.SolrCore.registerSearcher [collection1] Registered new searcher Searcher@2195e29 main{StandardDirectoryReader(segments_1:1)}
[junit4:junit4]   2> 9441 T2895 oascc.ZkStateReader.updateClusterState Updating cloud state from ZooKeeper... 
[junit4:junit4]   2> 9454 T2946 oascc.ZkStateReader$2.process A cluster state change has occurred - updating...
[junit4:junit4]   2> 9454 T2908 oascc.ZkStateReader$2.process A cluster state change has occurred - updating...
[junit4:junit4]   2> 9454 T2920 oascc.ZkStateReader$2.process A cluster state change has occurred - updating...
[junit4:junit4]   2> 9454 T2932 oascc.ZkStateReader$2.process A cluster state change has occurred - updating...
[junit4:junit4]   2> 9454 T2894 oascc.ZkStateReader$2.process A cluster state change has occurred - updating...
[junit4:junit4]   2> 9867 T2874 oasc.CoreContainer.register registering core: collection1
[junit4:junit4]   2> 9867 T2874 oasc.ZkController.register Register shard - core:collection1 address:http://127.0.0.1:10337/solr shardId:shard2
[junit4:junit4]   2> 9870 T2874 oasc.ZkController.register We are http://127.0.0.1:10337/solr/collection1/ and leader is http://127.0.0.1:10326/solr/collection1/
[junit4:junit4]   2> 9870 T2874 oasc.ZkController.register No LogReplay needed for core=collection1 baseURL=http://127.0.0.1:10337/solr
[junit4:junit4]   2> 9870 T2874 oasc.ZkController.checkRecovery Core needs to recover:collection1
[junit4:junit4]   2> 9871 T2874 oasu.DefaultSolrCoreState.doRecovery Running recovery - first canceling any ongoing recovery
[junit4:junit4]   2> ASYNC  NEW_CORE C235 name=collection1 org.apache.solr.core.SolrCore@4bf22762 url=http://127.0.0.1:10337/solr/collection1 node=127.0.0.1:10337_solr
[junit4:junit4]   2> 9872 T2948 C235 P10337 oasc.RecoveryStrategy.run Starting recovery process.  core=collection1 recoveringAfterStartup=true
[junit4:junit4]   2> 9872 T2874 oascc.ZkStateReader.updateClusterState Updating cloud state from ZooKeeper... 
[junit4:junit4]   2> 9872 T2948 C235 P10337 oasc.RecoveryStrategy.doRecovery ###### startupVersions=[]
[junit4:junit4]   2> 9872 T2874 oass.SolrDispatchFilter.init user.dir=/usr/home/hudson/hudson-slave/workspace/Lucene-Solr-NightlyTests-trunk/solr/build/solr-core/test/J0
[junit4:junit4]   2> 9873 T2874 oass.SolrDispatchFilter.init SolrDispatchFilter.init() done
[junit4:junit4]   2> 9873 T2874 oascsi.HttpClientUtil.createClient Creating new http client, config:maxConnections=128&maxConnectionsPerHost=32&followRedirects=false
[junit4:junit4]   2> 9873 T2948 C235 P10337 oasc.RecoveryStrategy.doRecovery Attempting to PeerSync from http://127.0.0.1:10326/solr/collection1/ core=collection1 - recoveringAfterStartup=true
[junit4:junit4]   2> 9874 T2948 C235 P10337 oasu.PeerSync.sync PeerSync: core=collection1 url=http://127.0.0.1:10337/solr START replicas=[http://127.0.0.1:10326/solr/collection1/] nUpdates=100
[junit4:junit4]   2> 9874 T2948 C235 P10337 oasu.PeerSync.sync WARNING no frame of reference to tell of we've missed updates
[junit4:junit4]   2> 9874 T2948 C235 P10337 oasc.RecoveryStrategy.doRecovery PeerSync Recovery was not successful - trying replication. core=collection1
[junit4:junit4]   2> 9874 T2948 C235 P10337 oasc.RecoveryStrategy.doRecovery Starting Replication Recovery. core=collection1
[junit4:junit4]   2> 9874 T2948 C235 P10337 oascsi.HttpClientUtil.createClient Creating new http client, config:maxConnections=128&maxConnectionsPerHost=32&followRedirects=false
[junit4:junit4]   2> 9886 T2874 oaz.ZooKeeper.<init> Initiating client connection, connectString=127.0.0.1:10308/solr sessionTimeout=10000 watcher=org.apache.solr.common.cloud.ConnectionManager@dc8d019
[junit4:junit4]   2> 9887 T2950 oaz.ClientCnxn$SendThread.startConnect Opening socket connection to server /127.0.0.1:10308
[junit4:junit4]   2> 9887 T2874 oascc.ConnectionManager.waitForConnected Waiting for client to connect to ZooKeeper
[junit4:junit4]   2> 9887 T2950 oaz.ClientCnxn$SendThread.primeConnection Socket connection established to localhost/127.0.0.1:10308, initiating session
[junit4:junit4]   2> 9887 T2876 oazs.NIOServerCnxn$Factory.run Accepted socket connection from /140.211.11.196:10343
[junit4:junit4]   2> 9888 T2876 oazs.NIOServerCnxn.readConnectRequest Client attempting to establish new session at /140.211.11.196:10343
[junit4:junit4]   2> ASYNC  NEW_CORE C236 name=collection1 org.apache.solr.core.SolrCore@40833c48 url=http://127.0.0.1:10326/solr/collection1 node=127.0.0.1:10326_solr
[junit4:junit4]   2> 9889 T2912 C236 P10326 REQ /get {distrib=false&qt=/get&wt=javabin&version=2&getVersions=100} status=0 QTime=0 
[junit4:junit4]   2> 9890 T2878 oazs.NIOServerCnxn.finishSessionInit Established session 0x139f1bfe3f20007 with negotiated timeout 10000 for client /140.211.11.196:10343
[junit4:junit4]   2> 9890 T2950 oaz.ClientCnxn$SendThread.readConnectResult Session establishment complete on server localhost/127.0.0.1:10308, sessionid = 0x139f1bfe3f20007, negotiated timeout = 10000
[junit4:junit4]   2> 9890 T2951 oascc.ConnectionManager.process Watcher org.apache.solr.common.cloud.ConnectionManager@dc8d019 name:ZooKeeperConnection Watcher:127.0.0.1:10308/solr got event WatchedEvent state:SyncConnected type:None path:null path:null type:None
[junit4:junit4]   2> 9891 T2874 oascc.ConnectionManager.waitForConnected Client is connected to ZooKeeper
[junit4:junit4]   2> 9891 T2874 oascc.ZkStateReader.createClusterStateWatchersAndUpdate Updating cluster state from ZooKeeper... 
[junit4:junit4]   2> 9892 T2874 oasc.ChaosMonkey.monkeyLog monkey: init - expire sessions:true cause connection loss:true
[junit4:junit4]   2> 9893 T2874 oascsi.HttpClientUtil.createClient Creating new http client, config:
[junit4:junit4]   2> 9899 T2874 oascc.ZkStateReader.updateClusterState Updating cloud state from ZooKeeper... 
[junit4:junit4]   2> ASYNC  NEW_CORE C237 name=collection1 org.apache.solr.core.SolrCore@7f9d490a url=http://127.0.0.1:10311/solr/collection1 node=127.0.0.1:10311_solr
[junit4:junit4]   2> 9909 T2886 C237 P10311 oasc.SolrDeletionPolicy.onInit SolrDeletionPolicy.onInit: commits:num=1
[junit4:junit4]   2> 		commit{dir=/usr/home/hudson/hudson-slave/workspace/Lucene-Solr-NightlyTests-trunk/solr/build/solr-core/test/J0/org.apache.solr.cloud.BasicDistributedZk2Test-1348380648427/control/data/index,segFN=segments_1,generation=1,filenames=[segments_1]
[junit4:junit4]   2> 9909 T2886 C237 P10311 oasc.SolrDeletionPolicy.updateCommits newest commit = 1
[junit4:junit4]   2> 9913 T2886 C237 P10311 /update {wt=javabin&version=2} {add=[1 (1413879597187989504)]} 0 8
[junit4:junit4]   2> 9913 T2874 oaz.ZooKeeper.<init> Initiating client connection, connectString=127.0.0.1:10308/solr sessionTimeout=10000 watcher=org.apache.solr.common.cloud.ConnectionManager@2b4d1a55
[junit4:junit4]   2> 9914 T2952 oaz.ClientCnxn$SendThread.startConnect Opening socket connection to server /127.0.0.1:10308
[junit4:junit4]   2> 9914 T2874 oascc.ConnectionManager.waitForConnected Waiting for client to connect to ZooKeeper
[junit4:junit4]   2> 9915 T2952 oaz.ClientCnxn$SendThread.primeConnection Socket connection established to localhost/127.0.0.1:10308, initiating session
[junit4:junit4]   2> 9915 T2876 oazs.NIOServerCnxn$Factory.run Accepted socket connection from /140.211.11.196:10345
[junit4:junit4]   2> 9915 T2876 oazs.NIOServerCnxn.readConnectRequest Client attempting to establish new session at /140.211.11.196:10345
[junit4:junit4]   2> 9917 T2878 oazs.NIOServerCnxn.finishSessionInit Established session 0x139f1bfe3f20008 with negotiated timeout 10000 for client /140.211.11.196:10345
[junit4:junit4]   2> 9917 T2952 oaz.ClientCnxn$SendThread.readConnectResult Session establishment complete on server localhost/127.0.0.1:10308, sessionid = 0x139f1bfe3f20008, negotiated timeout = 10000
[junit4:junit4]   2> 9917 T2953 oascc.ConnectionManager.process Watcher org.apache.solr.common.cloud.ConnectionManager@2b4d1a55 name:ZooKeeperConnection Watcher:127.0.0.1:10308/solr got event WatchedEvent state:SyncConnected type:None path:null path:null type:None
[junit4:junit4]   2> 9917 T2874 oascc.ConnectionManager.waitForConnected Client is connected to ZooKeeper
[junit4:junit4]   2> 9918 T2874 oascc.ZkStateReader.createClusterStateWatchersAndUpdate Updating cluster state from ZooKeeper... 
[junit4:junit4]   2> 9923 T2902 C234 P10323 oasc.SolrDeletionPolicy.onInit SolrDeletionPolicy.onInit: commits:num=1
[junit4:junit4]   2> 		commit{dir=/usr/home/hudson/hudson-slave/workspace/Lucene-Solr-NightlyTests-trunk/solr/build/solr-core/test/J0/org.apache.solr.cloud.BasicDistributedZk2Test-1348380648427/jetty1/index,segFN=segments_1,generation=1,filenames=[segments_1]
[junit4:junit4]   2> 9924 T2902 C234 P10323 oasc.SolrDeletionPolicy.updateCommits newest commit = 1
[junit4:junit4]   2>  C233_STATE=coll:collection1 core:collection1 props:{shard=shard1, roles=null, state=recovering, core=collection1, collection=collection1, node_name=127.0.0.1:10331_solr, base_url=http://127.0.0.1:10331/solr}
[junit4:junit4]   2> 9934 T2924 C233 P10331 oasc.SolrDeletionPolicy.onInit SolrDeletionPolicy.onInit: commits:num=1
[junit4:junit4]   2> 		commit{dir=/usr/home/hudson/hudson-slave/workspace/Lucene-Solr-NightlyTests-trunk/solr/build/solr-core/test/J0/org.apache.solr.cloud.BasicDistributedZk2Test-1348380648427/jetty3/index,segFN=segments_1,generation=1,filenames=[segments_1]
[junit4:junit4]   2> 9935 T2924 C233 P10331 oasc.SolrDeletionPolicy.updateCommits newest commit = 1
[junit4:junit4]   2> 9938 T2924 C233 P10331 REQ /update {distrib.from=http://127.0.0.1:10323/solr/collection1/&update.distrib=FROMLEADER&wt=javabin&version=2} status=0 QTime=7 
[junit4:junit4]   2> 9938 T2902 C234 P10323 /update {wt=javabin&version=2} {add=[1 (1413879597202669568)]} 0 18
[junit4:junit4]   2> 9938 T2874 oasc.AbstractDistribZkTestBase.waitForRecoveriesToFinish Wait for recoveries to finish - collection: collection1 failOnTimeout:true timeout (sec):3600
[junit4:junit4]   2> 9939 T2874 oascc.ZkStateReader.updateClusterState Updating cloud state from ZooKeeper... 
[junit4:junit4]   2> 9958 T2895 oascc.ZkStateReader.updateClusterState Updating cloud state from ZooKeeper... 
[junit4:junit4]   2> 9969 T2908 oascc.ZkStateReader$2.process A cluster state change has occurred - updating...
[junit4:junit4]   2> 9969 T2946 oascc.ZkStateReader$2.process A cluster state change has occurred - updating...
[junit4:junit4]   2> 9969 T2951 oascc.ZkStateReader$2.process A cluster state change has occurred - updating...
[junit4:junit4]   2> 9969 T2932 oascc.ZkStateReader$2.process A cluster state change has occurred - updating...
[junit4:junit4]   2> 9969 T2894 oascc.ZkStateReader$2.process A cluster state change has occurred - updating...
[junit4:junit4]   2> 9969 T2953 oascc.ZkStateReader$2.process A cluster state change has occurred - updating...
[junit4:junit4]   2> 9969 T2920 oascc.ZkStateReader$2.process A cluster state change has occurred - updating...
[junit4:junit4]   2> 10941 T2874 oascc.ZkStateReader.updateClusterState Updating cloud state from ZooKeeper... 
[junit4:junit4]   2> 11362 T2934 C233 P10331 oasc.RecoveryStrategy.doRecovery Begin buffering updates. core=collection1
[junit4:junit4]   2> 11362 T2934 C233 P10331 oasu.UpdateLog.bufferUpdates Starting to buffer updates. FSUpdateLog{state=ACTIVE, tlog=tlog{file=./org.apache.solr.cloud.BasicDistributedZk2Test-1348380648427/jetty3/tlog/tlog.0000000000000000000 refcount=1}}
[junit4:junit4]   2> 11362 T2934 C233 P10331 oasc.RecoveryStrategy.replicate Attempting to replicate from http://127.0.0.1:10323/solr/collection1/. core=collection1
[junit4:junit4]   2> 11363 T2934 C233 P10331 oascsi.HttpClientUtil.createClient Creating new http client, config:maxConnections=128&maxConnectionsPerHost=32&followRedirects=false
[junit4:junit4]   2> 11374 T2903 C234 P10323 oasu.DirectUpdateHandler2.commit start commit{flags=0,_version_=0,optimize=false,openSearcher=true,waitSearcher=true,expungeDeletes=false,softCommit=false}
[junit4:junit4]   2> 11502 T2903 C234 P10323 oasc.SolrDeletionPolicy.onCommit SolrDeletionPolicy.onCommit: commits:num=2
[junit4:junit4]   2> 		commit{dir=/usr/home/hudson/hudson-slave/workspace/Lucene-Solr-NightlyTests-trunk/solr/build/solr-core/test/J0/org.apache.solr.cloud.BasicDistributedZk2Test-1348380648427/jetty1/index,segFN=segments_1,generation=1,filenames=[segments_1]
[junit4:junit4]   2> 		commit{dir=/usr/home/hudson/hudson-slave/workspace/Lucene-Solr-NightlyTests-trunk/solr/build/solr-core/test/J0/org.apache.solr.cloud.BasicDistributedZk2Test-1348380648427/jetty1/index,segFN=segments_2,generation=2,filenames=[_0_MockSep_0.pos, _0_Pulsing40_0.prx, _0_Pulsing40_0.frq, _0_Lucene40WithOrds_0.tii, _0_Lucene40WithOrds_0.frq, _0_MockSep_0.skp, _0_Pulsing40_0.tip, _0.si, _0_MockSep_0.doc, _0_Lucene40WithOrds_0.tib, _0_MockRandom_0.tib, _0.fnm, _0_Pulsing40_0.tim, _0_nrm.cfs, _0_MockRandom_0.skp, _0_MockSep_0.tib, _0_MockRandom_0.frq, _0_MockRandom_0.sd, _0_MockRandom_0.tiv, _0_MockRandom_0.doc, _0_nrm.cfe, _0_MockRandom_0.pos, segments_2, _0_MockSep_0.frq, _0.fdx, _0_Lucene40WithOrds_0.prx, _0_MockSep_0.tii, _0_MockSep_0.pyl, _0_MockRandom_0.pyl, _0.fdt]
[junit4:junit4]   2> 11503 T2903 C234 P10323 oasc.SolrDeletionPolicy.updateCommits newest commit = 2
[junit4:junit4]   2> 11515 T2903 C234 P10323 oass.SolrIndexSearcher.<init> Opening Searcher@4776fbae main
[junit4:junit4]   2> 11516 T2903 C234 P10323 oasu.DirectUpdateHandler2.commit end_commit_flush
[junit4:junit4]   2> 11517 T2909 oasc.SolrCore.registerSearcher [collection1] Registered new searcher Searcher@4776fbae main{StandardDirectoryReader(segments_2:3 _0(5.0):C1)}
[junit4:junit4]   2> 11517 T2903 C234 P10323 /update {waitSearcher=true&commit=true&commit_end_point=true&wt=javabin&softCommit=false&version=2} {commit=} 0 143
[junit4:junit4]   2> 11518 T2934 C233 P10331 oash.ReplicationHandler.inform Commits will be reserved for  10000
[junit4:junit4]   2> 11518 T2934 C233 P10331 oash.SnapPuller.<init>  No value set for 'pollInterval'. Timer Task not started.
[junit4:junit4]   2> 11519 T2904 C234 P10323 oash.ReplicationHandler.inform Commits will be reserved for  10000
[junit4:junit4]   2> 11520 T2904 C234 P10323 REQ /replication {command=indexversion&wt=javabin&qt=/replication&version=2} status=0 QTime=1 
[junit4:junit4]   2> 11520 T2934 C233 P10331 oash.SnapPuller.fetchLatestIndex Master's generation: 2
[junit4:junit4]   2> 11520 T2934 C233 P10331 oash.SnapPuller.fetchLatestIndex Slave's generation: 1
[junit4:junit4]   2> 11521 T2934 C233 P10331 oash.SnapPuller.fetchLatestIndex Starting replication process
[junit4:junit4]   2> 11525 T2904 C234 P10323 REQ /replication {command=filelist&generation=2&wt=javabin&qt=/replication&version=2} status=0 QTime=2 
[junit4:junit4]   2> 11525 T2934 C233 P10331 oash.SnapPuller.fetchLatestIndex Number of files in latest index in master: 30
[junit4:junit4]   2> 11533 T2934 C233 P10331 oash.SnapPuller.fetchLatestIndex Starting download to ./org.apache.solr.cloud.BasicDistributedZk2Test-1348380648427/jetty3/index.20120923181059949 fullCopy=true
[junit4:junit4]   2> 11536 T2904 C234 P10323 REQ /replication {file=_0_MockSep_0.pos&command=filecontent&checksum=true&generation=2&qt=/replication&wt=filestream} status=0 QTime=0 
[junit4:junit4]   2> 11540 T2904 C234 P10323 REQ /replication {file=_0_Pulsing40_0.prx&command=filecontent&checksum=true&generation=2&qt=/replication&wt=filestream} status=0 QTime=0 
[junit4:junit4]   2> 11545 T2904 C234 P10323 REQ /replication {file=_0_Pulsing40_0.frq&command=filecontent&checksum=true&generation=2&qt=/replication&wt=filestream} status=0 QTime=0 
[junit4:junit4]   2> 11548 T2904 C234 P10323 REQ /replication {file=_0_Lucene40WithOrds_0.tii&command=filecontent&checksum=true&generation=2&qt=/replication&wt=filestream} status=0 QTime=0 
[junit4:junit4]   2> 11551 T2904 C234 P10323 REQ /replication {file=_0_Lucene40WithOrds_0.frq&command=filecontent&checksum=true&generation=2&qt=/replication&wt=filestream} status=0 QTime=0 
[junit4:junit4]   2> 11555 T2904 C234 P10323 REQ /replication {file=_0_MockSep_0.skp&command=filecontent&checksum=true&generation=2&qt=/replication&wt=filestream} status=0 QTime=0 
[junit4:junit4]   2> 11556 T2934 C233 P10331 oash.SnapPuller$FileFetcher.fetchPackets WARNING No content recieved for file: {name=_0_MockSep_0.skp, lastmodified=1348380659000, size=0}
[junit4:junit4]   2> 11559 T2904 C234 P10323 REQ /replication {file=_0_Pulsing40_0.tip&command=filecontent&checksum=true&generation=2&qt=/replication&wt=filestream} status=0 QTime=0 
[junit4:junit4]   2> 11563 T2904 C234 P10323 REQ /replication {file=_0_MockSep_0.doc&command=filecontent&checksum=true&generation=2&qt=/replication&wt=filestream} status=0 QTime=0 
[junit4:junit4]   2> 11567 T2904 C234 P10323 REQ /replication {file=_0.si&command=filecontent&checksum=true&generation=2&qt=/replication&wt=filestream} status=0 QTime=0 
[junit4:junit4]   2> 11571 T2904 C234 P10323 REQ /replication {file=_0_Lucene40WithOrds_0.tib&command=filecontent&checksum=true&generation=2&qt=/replication&wt=filestream} status=0 QTime=0 
[junit4:junit4]   2> 11575 T2904 C234 P10323 REQ /replication {file=_0_MockRandom_0.tib&command=filecontent&checksum=true&generation=2&qt=/replication&wt=filestream} status=0 QTime=0 
[junit4:junit4]   2> 11579 T2904 C234 P10323 REQ /replication {file=_0_Pulsing40_0.tim&command=filecontent&checksum=true&generation=2&qt=/replication&wt=filestream} status=0 QTime=0 
[junit4:junit4]   2> 11583 T2904 C234 P10323 REQ /replication {file=_0.fnm&command=filecontent&checksum=true&generation=2&qt=/replication&wt=filestream} status=0 QTime=0 
[junit4:junit4]   2> 11587 T2904 C234 P10323 REQ /replication {file=_0_nrm.cfs&command=filecontent&checksum=true&generation=2&qt=/replication&wt=filestream} status=0 QTime=0 
[junit4:junit4]   2> 11591 T2904 C234 P10323 REQ /replication {file=_0_MockRandom_0.skp&command=filecontent&checksum=true&generation=2&qt=/replication&wt=filestream} status=0 QTime=0 
[junit4:junit4]   2> 11592 T2934 C233 P10331 oash.SnapPuller$FileFetcher.fetchPackets WARNING No content recieved for file: {name=_0_MockRandom_0.skp, lastmodified=1348380659000, size=0}
[junit4:junit4]   2> 11595 T2904 C234 P10323 REQ /replication {file=_0_MockSep_0.tib&command=filecontent&checksum=true&generation=2&qt=/replication&wt=filestream} status=0 QTime=0 
[junit4:junit4]   2> 11599 T2904 C234 P10323 REQ /replication {file=_0_MockRandom_0.sd&command=filecontent&checksum=true&generation=2&qt=/replication&wt=filestream} status=0 QTime=0 
[junit4:junit4]   2> 11603 T2904 C234 P10323 REQ /replication {file=_0_MockRandom_0.frq&command=filecontent&checksum=true&generation=2&qt=/replication&wt=filestream} status=0 QTime=0 
[junit4:junit4]   2> 11607 T2904 C234 P10323 REQ /replication {file=_0_MockRandom_0.tiv&command=filecontent&checksum=true&generation=2&qt=/replication&wt=filestream} status=0 QTime=0 
[junit4:junit4]   2> 11611 T2904 C234 P10323 REQ /replication {file=_0_MockRandom_0.doc&command=filecontent&checksum=true&generation=2&qt=/replication&wt=filestream} status=0 QTime=0 
[junit4:junit4]   2> 11615 T2904 C234 P10323 REQ /replication {file=_0_MockRandom_0.pos&command=filecontent&checksum=true&generation=2&qt=/replication&wt=filestream} status=0 QTime=0 
[junit4:junit4]   2> 11619 T2904 C234 P10323 REQ /replication {file=_0_nrm.cfe&command=filecontent&checksum=true&generation=2&qt=/replication&wt=filestream} status=0 QTime=0 
[junit4:junit4]   2> 11623 T2904 C234 P10323 REQ /replication {file=_0_MockSep_0.frq&command=filecontent&checksum=true&generation=2&qt=/replication&wt=filestream} status=0 QTime=0 
[junit4:junit4]   2> 11627 T2904 C234 P10323 REQ /replication {file=segments_2&command=filecontent&checksum=true&generation=2&qt=/replication&wt=filestream} status=0 QTime=0 
[junit4:junit4]   2> 11631 T2904 C234 P10323 REQ /replication {file=_0.fdx&command=filecontent&checksum=true&generation=2&qt=/replication&wt=filestream} status=0 QTime=0 
[junit4:junit4]   2> 11635 T2904 C234 P10323 REQ /replication {file=_0_MockSep_0.tii&command=filecontent&checksum=true&generation=2&qt=/replication&wt=filestream} status=0 QTime=0 
[junit4:junit4]   2> 11639 T2904 C234 P10323 REQ /replication {file=_0_Lucene40WithOrds_0.prx&command=filecontent&checksum=true&generation=2&qt=/replication&wt=filestream} status=0 QTime=0 
[junit4:junit4]   2> 11643 T2904 C234 P10323 REQ /replication {file=_0_MockRandom_0.pyl&command=filecontent&checksum=true&generation=2&qt=/replication&wt=filestream} status=0 QTime=0 
[junit4:junit4]   2> 11644 T2934 C233 P10331 oash.SnapPuller$FileFetcher.fetchPackets WARNING No content recieved for file: {name=_0_MockRandom_0.pyl, lastmodified=1348380659000, size=0}
[junit4:junit4]   2> 11647 T2904 C234 P10323 REQ /replication {file=_0_MockSep_0.pyl&command=filecontent&checksum=true&generation=2&qt=/replication&wt=filestream} status=0 QTime=0 
[junit4:junit4]   2> 11648 T2934 C233 P10331 oash.SnapPuller$FileFetcher.fetchPackets WARNING No content recieved for file: {name=_0_MockSep_0.pyl, lastmodified=1348380659000, size=0}
[junit4:junit4]   2> 11651 T2904 C234 P10323 REQ /replication {file=_0.fdt&command=filecontent&checksum=true&generation=2&qt=/replication&wt=filestream} status=0 QTime=0 
[junit4:junit4]   2> 11652 T2934 C233 P10331 oash.SnapPuller.fetchLatestIndex Total time taken for download : 0 secs
[junit4:junit4]   2> 11652 T2934 C233 P10331 oash.SnapPuller.modifyIndexProps New index installed. Updating index properties... index=index.20120923181059949
[junit4:junit4]   2> 11654 T2934 C233 P10331 oasu.DefaultSolrCoreState.newIndexWriter Creating new IndexWriter...
[junit4:junit4]   2> 11654 T2934 C233 P10331 oasu.DefaultSolrCoreState.newIndexWriter Waiting until IndexWriter is unused... core=collection1
[junit4:junit4]   2> 11654 T2934 C233 P10331 oasu.DefaultSolrCoreState.newIndexWriter Rollback old IndexWriter... core=collection1
[junit4:junit4]   2> 11658 T2934 C233 P10331 oasc.SolrCore.getNewIndexDir WARNING New index directory detected: old=./org.apache.solr.cloud.BasicDistributedZk2Test-1348380648427/jetty3/index/ new=./org.apache.solr.cloud.BasicDistributedZk2Test-1348380648427/jetty3/index.20120923181059949
[junit4:junit4]   2> 11659 T2934 C233 P10331 oasc.CachingDirectoryFactory.get return new directory for /usr/home/hudson/hudson-slave/workspace/Lucene-Solr-NightlyTests-trunk/solr/build/solr-core/test/J0/./org.apache.solr.cloud.BasicDistributedZk2Test-1348380648427/jetty3/index.20120923181059949 forceNew:true
[junit4:junit4]   2> 11668 T2934 C233 P10331 oasc.SolrDeletionPolicy.onInit SolrDeletionPolicy.onInit: commits:num=1
[junit4:junit4]   2> 		commit{dir=/usr/home/hudson/hudson-slave/workspace/Lucene-Solr-NightlyTests-trunk/solr/build/solr-core/test/J0/org.apache.solr.cloud.BasicDistributedZk2Test-1348380648427/jetty3/index.20120923181059949,segFN=segments_2,generation=2,filenames=[_0_MockSep_0.pos, _0_Pulsing40_0.prx, _0_Pulsing40_0.frq, _0_Lucene40WithOrds_0.tii, _0_Lucene40WithOrds_0.frq, _0_MockSep_0.skp, _0_Pulsing40_0.tip, _0_MockSep_0.doc, _0.si, _0_Lucene40WithOrds_0.tib, _0_MockRandom_0.tib, _0_Pulsing40_0.tim, _0.fnm, _0_nrm.cfs, _0_MockRandom_0.skp, _0_MockSep_0.tib, _0_MockRandom_0.frq, _0_MockRandom_0.sd, _0_MockRandom_0.tiv, _0_MockRandom_0.doc, _0_nrm.cfe, _0_MockRandom_0.pos, segments_2, _0_MockSep_0.frq, _0.fdx, _0_MockSep_0.tii, _0_Lucene40WithOrds_0.prx, _0_MockRandom_0.pyl, _0_MockSep_0.pyl, _0.fdt]
[junit4:junit4]   2> 11669 T2934 C233 P10331 oasc.SolrDeletionPolicy.updateCommits newest commit = 2
[junit4:junit4]   2> 11669 T2934 C233 P10331 oasu.DefaultSolrCoreState.newIndexWriter New IndexWriter is ready to be used.
[junit4:junit4]   2> 11673 T2934 C233 P10331 oass.SolrIndexSearcher.<init> Opening Searcher@27a48e75 main
[junit4:junit4]   2> 11676 T2933 oasc.SolrCore.registerSearcher [collection1] Registered new searcher Searcher@27a48e75 main{StandardDirectoryReader(segments_2:3:nrt _0(5.0):C1)}
[junit4:junit4]   2> 11676 T2933 oasc.CachingDirectoryFactory.close Closing directory:/usr/home/hudson/hudson-slave/workspace/Lucene-Solr-NightlyTests-trunk/solr/build/solr-core/test/J0/./org.apache.solr.cloud.BasicDistributedZk2Test-1348380648427/jetty3/index
[junit4:junit4]   2> 11676 T2933 oash.SnapPuller$2.onClose removing old index directory ./org.apache.solr.cloud.BasicDistributedZk2Test-1348380648427/jetty3/index
[junit4:junit4]   2> 11678 T2934 C233 P10331 oasu.DirectUpdateHandler2.commit start commit{flags=0,_version_=0,optimize=false,openSearcher=false,waitSearcher=false,expungeDeletes=false,softCommit=false}
[junit4:junit4]   2> 11679 T2934 C233 P10331 oasu.DirectUpdateHandler2.commit end_commit_flush
[junit4:junit4]   2> 11687 T2934 C233 P10331 oasc.RecoveryStrategy.replay Replaying buffered documents. core=collection1
[junit4:junit4]   2> 11687 T2956 C233 P10331 oasu.UpdateLog$LogReplayer.doReplay WARNING Starting log replay tlog{file=./org.apache.solr.cloud.BasicDistributedZk2Test-1348380648427/jetty3/tlog/tlog.0000000000000000000 refcount=2} active=true starting pos=434
[junit4:junit4]   2> 11691 T2956 C233 P10331 oasu.DirectUpdateHandler2.commit start commit{flags=2,_version_=0,optimize=false,openSearcher=true,waitSearcher=true,expungeDeletes=false,softCommit=false}
[junit4:junit4]   2> 11692 T2956 C233 P10331 oass.SolrIndexSearcher.<init> Opening Searcher@708c0b8b main
[junit4:junit4]   2> 11692 T2956 C233 P10331 oasu.DirectUpdateHandler2.commit end_commit_flush
[junit4:junit4]   2> 11694 T2933 oasc.SolrCore.registerSearcher [collection1] Registered new searcher Searcher@708c0b8b main{StandardDirectoryReader(segments_2:3:nrt _0(5.0):C1)}
[junit4:junit4]   2> 11695 T2956 C233 P10331 oasu.UpdateLog$LogReplayer.run WARNING Log replay finished. recoveryInfo=RecoveryInfo{adds=0 deletes=0 deleteByQuery=0 errors=0 positionOfStart=434}
[junit4:junit4]   2> 11695 T2934 C233 P10331 oasc.RecoveryStrategy.doRecovery Replication Recovery was successful - registering as Active. core=collection1
[junit4:junit4]   2> 11696 T2934 C233 P10331 oasc.RecoveryStrategy.doRecovery Finished recovery process. core=collection1
[junit4:junit4]   2> 11943 T2874 oascc.ZkStateReader.updateClusterState Updating cloud state from ZooKeeper... 
[junit4:junit4]   2> 11979 T2895 oascc.ZkStateReader.updateClusterState Updating cloud state from ZooKeeper... 
[junit4:junit4]   2> 11992 T2953 oascc.ZkStateReader$2.process A cluster state change has occurred - updating...
[junit4:junit4]   2> 11992 T2946 oascc.ZkStateReader$2.process A cluster state change has occurred - updating...
[junit4:junit4]   2> 11992 T2894 oascc.ZkStateReader$2.process A cluster state change has occurred - updating...
[junit4:junit4]   2> 11992 T2920 oascc.ZkStateReader$2.process A cluster state change has occurred - updating...
[junit4:junit4]   2> 11992 T2908 oascc.ZkStateReader$2.process A cluster state change has occurred - updating...
[junit4:junit4]   2> 11992 T2932 oascc.ZkStateReader$2.process A cluster state change has occurred - updating...
[junit4:junit4]   2> 11992 T2951 oascc.ZkStateReader$2.process A cluster state change has occurred - updating...
[junit4:junit4]   2>  C235_STATE=coll:collection1 core:collection1 props:{shard=shard2, roles=null, state=recovering, core=collection1, collection=collection1, node_name=127.0.0.1:10337_solr, base_url=http://127.0.0.1:10337/solr}
[junit4:junit4]   2> 12889 T2948 C235 P10337 oasc.RecoveryStrategy.doRecovery Begin buffering updates. core=collection1
[junit4:junit4]   2> 12889 T2948 C235 P10337 oasu.UpdateLog.bufferUpdates Starting to buffer updates. FSUpdateLog{state=ACTIVE, tlog=null}
[junit4:junit4]   2> 12889 T2948 C235 P10337 oasc.RecoveryStrategy.replicate Attempting to replicate from http://127.0.0.1:10326/solr/collection1/. core=collection1
[junit4:junit4]   2> 12889 T2948 C235 P10337 oascsi.HttpClientUtil.createClient Creating new http client, config:maxConnections=128&maxConnectionsPerHost=32&followRedirects=false
[junit4:junit4]   2> 12900 T2914 C236 P10326 oasu.DirectUpdateHandler2.commit start commit{flags=0,_version_=0,optimize=false,openSearcher=true,waitSearcher=true,expungeDeletes=false,softCommit=false}
[junit4:junit4]   2> 12904 T2914 C236 P10326 oasc.SolrDeletionPolicy.onInit SolrDeletionPolicy.onInit: commits:num=1
[junit4:junit4]   2> 		commit{dir=/usr/home/hudson/hudson-slave/workspace/Lucene-Solr-NightlyTests-trunk/solr/build/solr-core/test/J0/org.apache.solr.cloud.BasicDistributedZk2Test-1348380648427/jetty2/index,segFN=segments_1,generation=1,filenames=[segments_1]
[junit4:junit4]   2> 12905 T2914 C236 P10326 oasc.SolrDeletionPolicy.updateCommits newest commit = 1
[junit4:junit4]   2> 12907 T2914 C236 P10326 oass.SolrIndexSearcher.<init> Opening Searcher@41240c0d main
[junit4:junit4]   2> 12907 T2914 C236 P10326 oasu.DirectUpdateHandler2.commit end_commit_flush
[junit4:junit4]   2> 12909 T2921 oasc.SolrCore.registerSearcher [collection1] Registered new searcher Searcher@41240c0d main{StandardDirectoryReader(segments_1:1)}
[junit4:junit4]   2> 12909 T2914 C236 P10326 /update {waitSearcher=true&commit=true&commit_end_point=true&wt=javabin&softCommit=false&version=2} {commit=} 0 9
[junit4:junit4]   2> 12910 T2948 C235 P10337 oash.ReplicationHandler.inform Commits will be reserved for  10000
[junit4:junit4]   2> 12910 T2948 C235 P10337 oash.SnapPuller.<init>  No value set for 'pollInterval'. Timer Task not started.
[junit4:junit4]   2> 12911 T2915 C236 P10326 oash.ReplicationHandler.inform Commits will be reserved for  10000
[junit4:junit4]   2> 12911 T2915 C236 P10326 REQ /replication {command=indexversion&wt=javabin&qt=/replication&version=2} status=0 QTime=0 
[junit4:junit4]   2> 12914 T2948 C235 P10337 oasc.SolrDeletionPolicy.onInit SolrDeletionPolicy.onInit: commits:num=1
[junit4:junit4]   2> 		commit{dir=/usr/home/hudson/hudson-slave/workspace/Lucene-Solr-NightlyTests-trunk/solr/build/solr-core/test/J0/org.apache.solr.cloud.BasicDistributedZk2Test-1348380648427/jetty4/index,segFN=segments_1,generation=1,filenames=[segments_1]
[junit4:junit4]   2> 12915 T2948 C235 P10337 oasc.SolrDeletionPolicy.updateCommits newest commit = 1
[junit4:junit4]   2> 12915 T2948 C235 P10337 oasu.DirectUpdateHandler2.commit start commit{flags=0,_version_=0,optimize=false,openSearcher=true,waitSearcher=true,expungeDeletes=false,softCommit=false}
[junit4:junit4]   2> 12939 T2948 C235 P10337 oasc.SolrDeletionPolicy.onCommit SolrDeletionPolicy.onCommit: commits:num=2
[junit4:junit4]   2> 		commit{dir=/usr/home/hudson/hudson-slave/workspace/Lucene-Solr-NightlyTests-trunk/solr/build/solr-core/test/J0/org.apache.solr.cloud.BasicDistributedZk2Test-1348380648427/jetty4/index,segFN=segments_1,generation=1,filenames=[segments_1]
[junit4:junit4]   2> 		commit{dir=/usr/home/hudson/hudson-slave/workspace/Lucene-Solr-NightlyTests-trunk/solr/build/solr-core/test/J0/org.apache.solr.cloud.BasicDistributedZk2Test-1348380648427/jetty4/index,segFN=segments_2,generation=2,filenames=[segments_2]
[junit4:junit4]   2> 12939 T2948 C235 P10337 oasc.SolrDeletionPolicy.updateCommits newest commit = 2
[junit4:junit4]   2> 12942 T2948 C235 P10337 oass.SolrIndexSearcher.<init> Opening Searcher@3e1cdd31 main
[junit4:junit4]   2> 12942 T2948 C235 P10337 oasu.DirectUpdateHandler2.commit end_commit_flush
[junit4:junit4]   2> 12943 T2947 oasc.SolrCore.registerSearcher [collection1] Registered new searcher Searcher@3e1cdd31 main{StandardDirectoryReader(segments_2:2)}
[junit4:junit4]   2> 12944 T2948 C235 P10337 oasc.RecoveryStrategy.replay No replay needed. core=collection1
[junit4:junit4]   2> 12944 T2948 C235 P10337 oasc.RecoveryStrategy.doRecovery Replication Recovery was successful - registering as Active. core=collection1
[junit4:junit4]   2> 12946 T2948 C235 P10337 oasc.RecoveryStrategy.doRecovery Finished recovery process. core=collection1
[junit4:junit4]   2> 12946 T2874 oascc.ZkStateReader.updateClusterState Updating cloud state from ZooKeeper... 
[junit4:junit4]   2> 12998 T2895 oascc.ZkStateReader.updateClusterState Updating cloud state from ZooKeeper... 
[junit4:junit4]   2> 13029 T2908 oascc.ZkStateReader$2.process A cluster state change has occurred - updating...
[junit4:junit4]   2> 13029 T2946 oascc.ZkStateReader$2.process A cluster state change has occurred - updating...
[junit4:junit4]   2> 13029 T2951 oascc.ZkStateReader$2.process A cluster state change has occurred - updating...
[junit4:junit4]   2> 13029 T2932 oascc.ZkStateReader$2.process A cluster state change has occurred - updating...
[junit4:junit4]   2> 13029 T2894 oascc.ZkStateReader$2.process A cluster state change has occurred - updating...
[junit4:junit4]   2> 13029 T2920 oascc.ZkStateReader$2.process A cluster state change has occurred - updating...
[junit4:junit4]   2> 13030 T2953 oascc.ZkStateReader$2.process A cluster state change has occurred - updating...
[junit4:junit4]   2> 13948 T2874 oascc.ZkStateReader.updateClusterState Updating cloud state from ZooKeeper... 
[junit4:junit4]   2> 13951 T2886 C237 P10311 oasu.DirectUpdateHandler2.commit start commit{flags=0,_version_=0,optimize=false,openSearcher=true,waitSearcher=true,expungeDeletes=false,softCommit=false}
[junit4:junit4]   2> 14064 T2886 C237 P10311 oasc.SolrDeletionPolicy.onCommit SolrDeletionPolicy.onCommit: commits:num=2
[junit4:junit4]   2> 		commit{dir=/usr/home/hudson/hudson-slave/workspace/Lucene-Solr-NightlyTests-trunk/solr/build/solr-core/test/J0/org.apache.solr.cloud.BasicDistributedZk2Test-1348380648427/control/data/index,segFN=segments_1,generation=1,filenames=[segments_1]
[junit4:junit4]   2> 		commit{dir=/usr/home/hudson/hudson-slave/workspace/Lucene-Solr-NightlyTests-trunk/solr/build/solr-core/test/J0/org.apache.solr.cloud.BasicDistributedZk2Test-1348380648427/control/data/index,segFN=segments_2,generation=2,filenames=[_0_MockSep_0.pos, _0_Pulsing40_0.prx, _0_Pulsing40_0.frq, _0_Lucene40WithOrds_0.tii, _0_Lucene40WithOrds_0.frq, _0_MockSep_0.skp, _0_Pulsing40_0.tip, _0.si, _0_MockSep_0.doc, _0_Lucene40WithOrds_0.tib, _0_Pulsing40_0.tim, _0.fnm, _0_nrm.cfs, _0_MockRandom_0.skp, _0_MockSep_0.tib, _0_MockRandom_0.tip, _0_MockRandom_0.frq, _0_MockRandom_0.sd, _0_MockRandom_0.doc, _0_nrm.cfe, _0_MockRandom_0.pos, segments_2, _0_MockSep_0.frq, _0.fdx, _0_Lucene40WithOrds_0.prx, _0_MockSep_0.tii, _0_MockSep_0.pyl, _0_MockRandom_0.pyl, _0_MockRandom_0.tim, _0.fdt]
[junit4:junit4]   2> 14065 T2886 C237 P10311 oasc.SolrDeletionPolicy.updateCommits newest commit = 2
[junit4:junit4]   2> 14081 T2886 C237 P10311 oass.SolrIndexSearcher.<init> Opening Searcher@22c00434 main
[junit4:junit4]   2> 14082 T2886 C237 P10311 oasu.DirectUpdateHandler2.commit end_commit_flush
[junit4:junit4]   2> 14083 T2897 oasc.SolrCore.registerSearcher [collection1] Registered new searcher Searcher@22c00434 main{StandardDirectoryReader(segments_2:3 _0(5.0):C1)}
[junit4:junit4]   2> 14084 T2886 C237 P10311 /update {waitSearcher=true&wt=javabin&commit=true&softCommit=false&version=2} {commit=} 0 133
[junit4:junit4]   2> 14086 T2902 C234 P10323 oasu.DirectUpdateHandler2.commit start commit{flags=0,_version_=0,optimize=false,openSearcher=true,waitSearcher=true,expungeDeletes=false,softCommit=false}
[junit4:junit4]   2> 14097 T2902 C234 P10323 oass.SolrIndexSearcher.<init> Opening Searcher@22fee65a main
[junit4:junit4]   2> 14097 T2902 C234 P10323 oasu.DirectUpdateHandler2.commit end_commit_flush
[junit4:junit4]   2> 14099 T2909 oasc.SolrCore.registerSearcher [collection1] Registered new searcher Searcher@22fee65a main{StandardDirectoryReader(segments_2:3 _0(5.0):C1)}
[junit4:junit4]   2> 14099 T2902 C234 P10323 oasu.SolrCmdDistributor.distribCommit Distrib commit to:[StdNode: http://127.0.0.1:10331/solr/collection1/, StdNode: http://127.0.0.1:10326/solr/collection1/, StdNode: http://127.0.0.1:10337/solr/collection1/]
[junit4:junit4]   2> 14101 T2916 C236 P10326 oasu.DirectUpdateHandler2.commit start commit{flags=0,_version_=0,optimize=false,openSearcher=true,waitSearcher=true,expungeDeletes=false,softCommit=false}
[junit4:junit4]   2>  C233_STATE=coll:collection1 core:collection1 props:{shard=shard1, roles=null, state=active, core=collection1, collection=collection1, node_name=127.0.0.1:10331_solr, base_url=http://127.0.0.1:10331/solr}
[junit4:junit4]   2> 14103 T2924 C233 P10331 oasu.DirectUpdateHandler2.commit start commit{flags=0,_version_=0,optimize=false,openSearcher=true,waitSearcher=true,expungeDeletes=false,softCommit=false}
[junit4:junit4]   2> 14105 T2916 C236 P10326 oass.SolrIndexSearcher.<init> Opening Searcher@426f22f1 main
[junit4:junit4]   2> 14105 T2924 C233 P10331 oass.SolrIndexSearcher.<init> Opening Searcher@6bd93a5 main
[junit4:junit4]   2> 14105 T2916 C236 P10326 oasu.DirectUpdateHandler2.commit end_commit_flush
[junit4:junit4]   2> 14106 T2924 C233 P10331 oasu.DirectUpdateHandler2.commit end_commit_flush
[junit4:junit4]   2> 14106 T2933 oasc.JmxMonitoredMap.put WARNING Failed to register info bean: searcher javax.management.InstanceAlreadyExistsException: solr/collection1:type=searcher,id=org.apache.solr.search.SolrIndexSearcher
[junit4:junit4]   2> 	at com.sun.jmx.mbeanserver.Repository.addMBean(Repository.java:467)
[junit4:junit4]   2> 	at com.sun.jmx.interceptor.DefaultMBeanServerInterceptor.internal_addObject(DefaultMBeanServerInterceptor.java:1520)
[junit4:junit4]   2> 	at com.sun.jmx.interceptor.DefaultMBeanServerInterceptor.registerDynamicMBean(DefaultMBeanServerInterceptor.java:986)
[junit4:junit4]   2> 	at com.sun.jmx.interceptor.DefaultMBeanServerInterceptor.registerObject(DefaultMBeanServerInterceptor.java:938)
[junit4:junit4]   2> 	at com.sun.jmx.interceptor.DefaultMBeanServerInterceptor.registerMBean(DefaultMBeanServerInterceptor.java:330)
[junit4:junit4]   2> 	at com.sun.jmx.mbeanserver.JmxMBeanServer.registerMBean(JmxMBeanServer.java:516)
[junit4:junit4]   2> 	at org.apache.solr.core.JmxMonitoredMap.put(JmxMonitoredMap.java:140)
[junit4:junit4]   2> 	at org.apache.solr.core.JmxMonitoredMap.put(JmxMonitoredMap.java:51)
[junit4:junit4]   2> 	at org.apache.solr.search.SolrIndexSearcher.register(SolrIndexSearcher.java:242)
[junit4:junit4]   2> 	at org.apache.solr.core.SolrCore.registerSearcher(SolrCore.java:1642)
[junit4:junit4]   2> 	at org.apache.solr.core.SolrCore.access$000(SolrCore.java:121)
[junit4:junit4]   2> 	at org.apache.solr.core.SolrCore$7.call(SolrCore.java:1519)
[junit4:junit4]   2> 	at java.util.concurrent.FutureTask$Sync.innerRun(FutureTask.java:334)
[junit4:junit4]   2> 	at java.util.concurrent.FutureTask.run(FutureTask.java:166)
[junit4:junit4]   2> 	at java.util.concurrent.ThreadPoolExecutor.runWorker(ThreadPoolExecutor.java:1110)
[junit4:junit4]   2> 	at java.util.concurrent.ThreadPoolExecutor$Worker.run(ThreadPoolExecutor.java:603)
[junit4:junit4]   2> 	at java.lang.Thread.run(Thread.java:679)
[junit4:junit4]   2> 
[junit4:junit4]   2> 14107 T2921 oasc.SolrCore.registerSearcher [collection1] Registered new searcher Searcher@426f22f1 main{StandardDirectoryReader(segments_1:1)}
[junit4:junit4]   2> 14107 T2933 oasc.SolrCore.registerSearcher [collection1] Registered new searcher Searcher@6bd93a5 main{StandardDirectoryReader(segments_2:3:nrt _0(5.0):C1)}
[junit4:junit4]   2> 14108 T2916 C236 P10326 /update {waitSearcher=true&commit=true&wt=javabin&commit_end_point=true&expungeDeletes=false&softCommit=false&version=2} {commit=} 0 7
[junit4:junit4]   2> 14108 T2924 C233 P10331 /update {waitSearcher=true&commit=true&wt=javabin&commit_end_point=true&expungeDeletes=false&softCommit=false&version=2} {commit=} 0 5
[junit4:junit4]   2>  C235_STATE=coll:collection1 core:collection1 props:{shard=shard2, roles=null, state=active, core=collection1, collection=collection1, node_name=127.0.0.1:10337_solr, base_url=http://127.0.0.1:10337/solr}
[junit4:junit4]   2> 14108 T2938 C235 P10337 oasu.DirectUpdateHandler2.commit start commit{flags=0,_version_=0,optimize=false,openSearcher=true,waitSearcher=true,expungeDeletes=false,softCommit=false}
[junit4:junit4]   2> 14112 T2938 C235 P10337 oass.SolrIndexSearcher.<init> Opening Searcher@5f75b999 main
[junit4:junit4]   2> 14113 T2938 C235 P10337 oasu.DirectUpdateHandler2.commit end_commit_flush
[junit4:junit4]   2> 14114 T2947 oasc.SolrCore.registerSearcher [collection1] Registered new searcher Searcher@5f75b999 main{StandardDirectoryReader(segments_2:2)}
[junit4:junit4]   2> 14115 T2938 C235 P10337 /update {waitSearcher=true&commit=true&wt=javabin&commit_end_point=true&expungeDeletes=false&softCommit=false&version=2} {commit=} 0 7
[junit4:junit4]   2> 14115 T2902 C234 P10323 /update {waitSearcher=true&wt=javabin&commit=true&softCommit=false&version=2} {commit=} 0 29
[junit4:junit4]   2> 14121 T2887 C237 P10311 REQ /select {fl=id,score&shard.url=127.0.0.1:10311/solr/collection1/&NOW=1348380662541&start=0&q=*:*&distrib=false&isShard=true&wt=javabin&fsv=true&rows=10&version=2} hits=1 status=0 QTime=0 
[junit4:junit4]   2> 14124 T2887 C237 P10311 REQ /select {shard.url=127.0.0.1:10311/solr/collection1/&NOW=1348380662541&q=*:*&ids=1&distrib=false&isShard=true&wt=javabin&version=2} status=0 QTime=0 
[junit4:junit4]   2> 14125 T2886 C237 P10311 REQ /select {wt=javabin&q=*:*&version=2} hits=1 status=0 QTime=7 
[junit4:junit4]   2> 14126 T2874 oaz.ZooKeeper.<init> Initiating client connection, connectString=127.0.0.1:10308/solr sessionTimeout=10000 watcher=org.apache.solr.common.cloud.ConnectionManager@5347d68a
[junit4:junit4]   2> 14126 T2960 oaz.ClientCnxn$SendThread.startConnect Opening socket connection to server /127.0.0.1:10308
[junit4:junit4]   2> 14126 T2874 oascc.ConnectionManager.waitForConnected Waiting for client to connect to ZooKeeper
[junit4:junit4]   2> 14128 T2960 oaz.ClientCnxn$SendThread.primeConnection Socket connection established to localhost/127.0.0.1:10308, initiating session
[junit4:junit4]   2> 14128 T2876 oazs.NIOServerCnxn$Factory.run Accepted socket connection from /140.211.11.196:10369
[junit4:junit4]   2> 14128 T2876 oazs.NIOServerCnxn.readConnectRequest Client attempting to establish new session at /140.211.11.196:10369
[junit4:junit4]   2> 14129 T2878 oazs.NIOServerCnxn.finishSessionInit Established session 0x139f1bfe3f20009 with negotiated timeout 10000 for client /140.211.11.196:10369
[junit4:junit4]   2> 14129 T2960 oaz.ClientCnxn$SendThread.readConnectResult Session establishment complete on server localhost/127.0.0.1:10308, sessionid = 0x139f1bfe3f20009, negotiated timeout = 10000
[junit4:junit4]   2> 14130 T2961 oascc.ConnectionManager.process Watcher org.apache.solr.common.cloud.ConnectionManager@5347d68a name:ZooKeeperConnection Watcher:127.0.0.1:10308/solr got event WatchedEvent state:SyncConnected type:None path:null path:null type:None
[junit4:junit4]   2> 14130 T2874 oascc.ConnectionManager.waitForConnected Client is connected to ZooKeeper
[junit4:junit4]   2> 14131 T2874 oascc.ZkStateReader.createClusterStateWatchersAndUpdate Updating cluster state from ZooKeeper... 
[junit4:junit4]   2> 14132 T2879 oazs.PrepRequestProcessor.pRequest Processed session termination for sessionid: 0x139f1bfe3f20009
[junit4:junit4]   2> 14133 T2961 oaz.ClientCnxn$EventThread.run EventThread shut down
[junit4:junit4]   2> 14133 T2874 oaz.ZooKeeper.close Session: 0x139f1bfe3f20009 closed
[junit4:junit4]   2> 14133 T2876 oazs.NIOServerCnxn.closeSock Closed socket connection for client /140.211.11.196:10369 which had sessionid 0x139f1bfe3f20009
[junit4:junit4]   2> 14135 T2905 C234 P10323 REQ /select {distrib=false&wt=javabin&q=*:*&version=2} hits=1 status=0 QTime=1 
[junit4:junit4]   2> 14136 T2917 C236 P10326 REQ /select {distrib=false&wt=javabin&q=*:*&version=2} hits=0 status=0 QTime=0 
[junit4:junit4]   2> 14139 T2918 C236 P10326 REQ /select {fl=id,score&shard.url=127.0.0.1:10326/solr/collection1/|127.0.0.1:10337/solr/collection1/&NOW=1348380662560&start=0&q=*:*&distrib=false&isShard=true&wt=javabin&fsv=true&rows=10&version=2} hits=0 status=0 QTime=0 
[junit4:junit4]   2> 14139 T2906 C234 P10323 REQ /select {fl=id,score&shard.url=127.0.0.1:10323/solr/collection1/|127.0.0.1:10331/solr/collection1/&NOW=1348380662560&start=0&q=*:*&distrib=false&isShard=true&wt=javabin&fsv=true&rows=10&version=2} hits=1 status=0 QTime=0 
[junit4:junit4]   2> 14142 T2906 C234 P10323 REQ /select {shard.url=127.0.0.1:10323/solr/collection1/|127.0.0.1:10331/solr/collection1/&NOW=1348380662560&q=*:*&ids=1&distrib=false&isShard=true&wt=javabin&version=2} status=0 QTime=0 
[junit4:junit4]   2> 14142 T2939 C235 P10337 REQ /select {wt=javabin&q=*:*&version=2} hits=1 status=0 QTime=5 
[junit4:junit4]   2> 14148 T2886 C237 P10311 /update {wt=javabin&version=2} {add=[2 (1413879601632903168)]} 0 3
[junit4:junit4]   2> 14159 T2938 C235 P10337 REQ /update {update.distrib=FROMLEADER&distrib.from=http://127.0.0.1:10326/solr/collection1/&wt=javabin&version=2} status=0 QTime=2 
[junit4:junit4]   2> 14160 T2916 C236 P10326 REQ /update {distrib.from=http://127.0.0.1:10323/solr/collection1/&update.distrib=TOLEADER&wt=javabin&version=2} status=0 QTime=8 
[junit4:junit4]   2> 14160 T2902 C234 P10323 /update {wt=javabin&version=2} {add=[2]} 0 10
[junit4:junit4]   2> 14164 T2886 C237 P10311 /update {wt=javabin&version=2} {add=[3 (1413879601651777536)]} 0 1
[junit4:junit4]   2> 14169 T2938 C235 P10337 REQ /update {distrib.from=http://127.0.0.1:10326/solr/collection1/&update.distrib=FROMLEADER&wt=javabin&version=2} status=0 QTime=1 
[junit4:junit4]   2> 14169 T2913 C236 P10326 /update {wt=javabin&version=2} {add=[3 (1413879601653874688)]} 0 4
[junit4:junit4]   2> 14172 T2886 C237 P10311 /update {wt=javabin&version=2} {add=[4 (1413879601660166144)]} 0 1
[junit4:junit4]   2> 14181 T2924 C233 P10331 REQ /update {distrib.from=http://127.0.0.1:10323/solr/collection1/&update.distrib=FROMLEADER&wt=javabin&version=2} status=0 QTime=3 
[junit4:junit4]   2> 14182 T2902 C234 P10323 /update {wt=javabin&version=2} {add=[4 (1413879601663311872)]} 0 8
[junit4:junit4]   2> 14185 T2886 C237 P10311 /update {wt=javabin&version=2} {add=[5 (1413879601673797632)]} 0 1
[junit4:junit4]   2> 14191 T2938 C235 P10337 REQ /update {distrib.from=http://127.0.0.1:10326/solr/collection1/&update.distrib=FROMLEADER&wt=javabin&version=2} status=0 QTime=1 
[junit4:junit4]   2> 14191 T2913 C236 P10326 /update {wt=javabin&version=2} {add=[5 (1413879601676943360)]} 0 4
[junit4:junit4]   2> 14195 T2886 C237 P10311 /update {wt=javabin&version=2} {add=[6 (1413879601684283392)]} 0 1
[junit4:junit4]   2> 14203 T2938 C235 P10337 REQ /update {update.distrib=FROMLEADER&distrib.from=http://127.0.0.1:10326/solr/collection1/&wt=javabin&version=2} status=0 QTime=1 
[junit4:junit4]   2> 14203 T2916 C236 P10326 REQ /update {distrib.from=http://127.0.0.1:10323/solr/collection1/&update.distrib=TOLEADER&wt=javabin&version=2} status=0 QTime=4 
[junit4:junit4]   2> 14204 T2902 C234 P10323 /update {wt=javabin&version=2} {add=[6]} 0 7
[junit4:junit4]   2> 14207 T2886 C237 P10311 /update {wt=javabin&version=2} {add=[7 (1413879601696866304)]} 0 1
[junit4:junit4]   2> 14216 T2938 C235 P10337 REQ /update {update.distrib=FROMLEADER&distrib.from=http://127.0.0.1:10326/solr/collection1/&wt=javabin&version=2} status=0 QTime=1 
[junit4:junit4]   2> 14216 T2916 C236 P10326 REQ /update {distrib.from=http://127.0.0.1:10323/solr/collection1/&update.distrib=TOLEADER&wt=javabin&version=2} status=0 QTime=4 
[junit4:junit4]   2> 14216 T2902 C234 P10323 /update {wt=javabin&version=2} {add=[7]} 0 6
[junit4:junit4]   2> 14220 T2886 C237 P10311 /update {wt=javabin&version=2} {add=[8 (1413879601710497792)]} 0 1
[junit4:junit4]   2> 14227 T2924 C233 P10331 REQ /update {update.distrib=FROMLEADER&distrib.from=http://127.0.0.1:10323/solr/collection1/&wt=javabin&version=2} status=0 QTime=1 
[junit4:junit4]   2> 14227 T2901 C234 P10323 REQ /update {distrib.from=http://127.0.0.1:10326/solr/collection1/&update.distrib=TOLEADER&wt=javabin&version=2} status=0 QTime=4 
[junit4:junit4]   2> 14228 T2913 C236 P10326 /update {wt=javabin&version=2} {add=[8]} 0 6
[junit4:junit4]   2> 14231 T2886 C237 P10311 /update {wt=javabin&version=2} {add=[9 (1413879601722032128)]} 0 1
[junit4:junit4]   2> 14239 T2938 C235 P10337 REQ /update {update.distrib=FROMLEADER&distrib.from=http://127.0.0.1:10326/solr/collection1/&wt=javabin&version=2} status=0 QTime=1 
[junit4:junit4]   2> 14239 T2916 C236 P10326 REQ /update {distrib.from=http://127.0.0.1:10323/solr/collection1/&update.distrib=TOLEADER&wt=javabin&version=2} status=0 QTime=4 
[junit4:junit4]   2> 14239 T2902 C234 P10323 /update {wt=javabin&version=2} {add=[9]} 0 6
[junit4:junit4]   2> 14243 T2886 C237 P10311 /update {wt=javabin&version=2} {add=[10 (1413879601734615040)]} 0 1
[junit4:junit4]   2> 14252 T2924 C233 P10331 REQ /update {update.distrib=FROMLEADER&distrib.from=http://127.0.0.1:10323/solr/collection1/&wt=javabin&version=2} status=0 QTime=1 
[junit4:junit4]   2> 14252 T2901 C234 P10323 REQ /update {distrib.from=http://127.0.0.1:10326/solr/collection1/&update.distrib=TOLEADER&wt=javabin&version=2} status=0 QTime=5 
[junit4:junit4]   2> 14253 T2913 C236 P10326 /update {wt=javabin&version=2} {add=[10]} 0 8
[junit4:junit4]   2> 14274 T2886 C237 P10311 /update {wt=javabin&version=2} {add=[11 (1413879601748246528)]} 0 19
[junit4:junit4]   2> 14283 T2924 C233 P10331 REQ /update {update.distrib=FROMLEADER&distrib.from=http://127.0.0.1:10323/solr/collection1/&wt=javabin&version=2} status=0 QTime=1 
[junit4:junit4]   2> 14283 T2901 C234 P10323 REQ /update {distrib.from=http://127.0.0.1:10326/solr/collection1/&update.distrib=TOLEADER&wt=javabin&version=2} status=0 QTime=4 
[junit4:junit4]   2> 14284 T2913 C236 P10326 /update {wt=javabin&version=2} {add=[11]} 0 7
[junit4:junit4]   2> 14288 T2886 C237 P10311 /update {wt=javabin&version=2} {add=[12 (1413879601780752384)]} 0 2
[junit4:junit4]   2> 14294 T2924 C233 P10331 REQ /update {distrib.from=http://127.0.0.1:10323/solr/collection1/&update.distrib=FROMLEADER&wt=javabin&version=2} status=0 QTime=1 
[junit4:junit4]   2> 14294 T2902 C234 P10323 /update {wt=javabin&version=2} {add=[12 (1413879601784946688)]} 0 4
[junit4:junit4]   2> 14298 T2886 C237 P10311 /update {wt=javabin&version=2} {add=[13 (1413879601792286720)]} 0 1
[junit4:junit4]   2> 14304 T2924 C233 P10331 REQ /update {distrib.from=http://127.0.0.1:10323/solr/collection1/&update.distrib=FROMLEADER&wt=javabin&version=2} status=0 QTime=1 
[junit4:junit4]   2> 14304 T2902 C234 P10323 /update {wt=javabin&version=2} {add=[13 (1413879601795432448)]} 0 4
[junit4:junit4]   2> 14308 T2886 C237 P10311 /update {wt=javabin&version=2} {add=[14 (1413879601802772480)]} 0 1
[junit4:junit4]   2> 14316 T2924 C233 P10331 REQ /update {update.distrib=FROMLEADER&distrib.from=http://127.0.0.1:10323/solr/collection1/&wt=javabin&version=2} status=0 QTime=1 
[junit4:junit4]   2> 14316 T2901 C234 P10323 REQ /update {distrib.from=http://127.0.0.1:10326/solr/collection1/&update.distrib=TOLEADER&wt=javabin&version=2} status=0 QTime=4 
[junit4:junit4]   2> 14316 T2913 C236 P10326 /update {wt=javabin&version=2} {add=[14]} 0 6
[junit4:junit4]   2> 14319 T2886 C237 P10311 /update {wt=javabin&version=2} {add=[15 (1413879601815355392)]} 0 0
[junit4:junit4]   2> 14326 T2924 C233 P10331 REQ /update {distrib.from=http://127.0.0.1:10323/solr/collection1/&update.distrib=FROMLEADER&wt=javabin&version=2} status=0 QTime=0 
[junit4:junit4]   2> 14326 T2902 C234 P10323 /update {wt=javabin&version=2} {add=[15 (1413879601818501120)]} 0 4
[junit4:junit4]   2> 14328 T2886 C237 P10311 /update {wt=javabin&version=2} {add=[16 (1413879601824792576)]} 0 0
[junit4:junit4]   2> 14337 T2924 C233 P10331 REQ /update {update.distrib=FROMLEADER&distrib.from=http://127.0.0.1:10323/solr/collection1/&wt=javabin&version=2} status=0 QTime=1 
[junit4:junit4]   2> 14337 T2901 C234 P10323 REQ /update {distrib.from=http://127.0.0.1:10326/solr/collection1/&update.distrib=TOLEADER&wt=javabin&version=2} status=0 QTime=4 
[junit4:junit4]   2> 14337 T2913 C236 P10326 /update {wt=javabin&version=2} {add=[16]} 0 6
[junit4:junit4]   2> 14342 T2886 C237 P10311 /update {wt=javabin&version=2} {add=[17 (1413879601837375488)]} 0 2
[junit4:junit4]   2> 14354 T2938 C235 P10337 REQ /update {update.distrib=FROMLEADER&distrib.from=http://127.0.0.1:10326/solr/collection1/&wt=javabin&version=2} status=0 QTime=2 
[junit4:junit4]   2> 14354 T2916 C236 P10326 REQ /update {distrib.from=http://127.0.0.1:10323/solr/collection1/&update.distrib=TOLEADER&wt=javabin&version=2} status=0 QTime=7 
[junit4:junit4]   2> 14355 T2902 C234 P10323 /update {wt=javabin&version=2} {add=[17]} 0 11
[junit4:junit4]   2> 14358 T2886 C237 P10311 /update {wt=javabin&version=2} {add=[100 (1413879601855201280)]} 0 1
[junit4:junit4]   2> 14405 T2924 C233 P10331 REQ /update {distrib.from=http://127.0.0.1:10323/solr/collection1/&update.distrib=FROMLEADER&wt=javabin&version=2} status=0 QTime=20 
[junit4:junit4]   2> 14406 T2902 C234 P10323 /update {wt=javabin&version=2} {add=[100 (1413879601858347008)]} 0 46
[junit4:junit4]   2> 14409 T2886 C237 P10311 /update {wt=javabin&version=2} {add=[101 (1413879601908678656)]} 0 1
[junit4:junit4]   2> 14417 T2924 C233 P10331 REQ /update {distrib.from=http://127.0.0.1:10323/solr/collection1/&update.distrib=FROMLEADER&wt=javabin&version=2} status=0 QTime=2 
[junit4:junit4]   2> 14417 T2902 C234 P10323 /update {wt=javabin&version=2} {add=[101 (1413879601911824384)]} 0 6
[junit4:junit4]   2> 14421 T2886 C237 P10311 /update {wt=javabin&version=2} {add=[102 (1413879601921261568)]} 0 1
[junit4:junit4]   2> 14430 T2924 C233 P10331 REQ /update {update.distrib=FROMLEADER&distrib.from=http://127.0.0.1:10323/solr/collection1/&wt=javabin&version=2} status=0 QTime=1 
[junit4:junit4]   2> 14430 T2901 C234 P10323 REQ /update {distrib.from=http://127.0.0.1:10326/solr/collection1/&update.distrib=TOLEADER&wt=javabin&version=2} status=0 QTime=4 
[junit4:junit4]   2> 14431 T2913 C236 P10326 /update {wt=javabin&version=2} {add=[102]} 0 7
[junit4:junit4]   2> 14453 T2886 C237 P10311 /update {wt=javabin&version=2} {add=[103 (1413879601934893056)]} 0 20
[junit4:junit4]   2> 14463 T2938 C235 P10337 REQ /update {distrib.from=http://127.0.0.1:10326/solr/collection1/&update.distrib=FROMLEADER&wt=javabin&version=2} status=0 QTime=1 
[junit4:junit4]   2> 14464 T2913 C236 P10326 /update {wt=javabin&version=2} {add=[103 (1413879601959010304)]} 0 8
[junit4:junit4]   2> 14468 T2886 C237 P10311 /update {wt=javabin&version=2} {add=[104 (1413879601969496064)]} 0 2
[junit4:junit4]   2> 14475 T2938 C235 P10337 REQ /update {distrib.from=http://127.0.0.1:10326/solr/collection1/&update.distrib=FROMLEADER&wt=javabin&version=2} status=0 QTime=1 
[junit4:junit4]   2> 14475 T2913 C236 P10326 /update {wt=javabin&version=2} {add=[104 (1413879601974738944)]} 0 4
[junit4:junit4]   2> 14478 T2886 C237 P10311 /update {wt=javabin&version=2} {add=[105 (1413879601982078976)]} 0 0
[junit4:junit4]   2> 14523 T2938 C235 P10337 REQ /update {distrib.from=http://127.0.0.1:10326/solr/collection1/&update.distrib=FROMLEADER&wt=javabin&version=2} status=0 QTime=22 
[junit4:junit4]   2> 14523 T2913 C236 P10326 /update {wt=javabin&version=2} {add=[105 (1413879601985224704)]} 0 42
[junit4:junit4]   2> 14527 T2886 C237 P10311 /update {wt=javabin&version=2} {add=[106 (1413879602032410624)]} 0 1
[junit4:junit4]   2> 14535 T2938 C235 P10337 REQ /update {distrib.from=http://127.0.0.1:10326/solr/collection1/&update.distrib=FROMLEADER&wt=javabin&version=2} status=0 QTime=2 
[junit4:junit4]   2> 14535 T2913 C236 P10326 /update {wt=javabin&version=2} {add=[106 (1413879602035556352)]} 0 6
[junit4:junit4]   2> 14539 T2886 C237 P10311 /update {wt=javabin&version=2} {add=[107 (1413879602044993536)]} 0 1
[junit4:junit4]   2> 14547 T2924 C233 P10331 REQ /update {update.distrib=FROMLEADER&distrib.from=http://127.0.0.1:10323/solr/collection1/&wt=javabin&version=2} status=0 QTime=1 
[junit4:junit4]   2> 14547 T2901 C234 P10323 REQ /update {distrib.from=http://127.0.0.1:10326/solr/collection1/&update.distrib=TOLEADER&wt=javabin&version=2} status=0 QTime=4 
[junit4:junit4]   2> 14547 T2913 C236 P10326 /update {wt=javabin&version=2} {add=[107]} 0 6
[junit4:junit4]   2> 14551 T2886 C237 P10311 /update {wt=javabin&version=2} {add=[108 (1413879602057576448)]} 0 1
[junit4:junit4]   2> 14556 T2924 C233 P10331 REQ /update {distrib.from=http://127.0.0.1:10323/solr/collection1/&update.distrib=FROMLEADER&wt=javabin&version=2} status=0 QTime=0 
[junit4:junit4]   2> 14557 T2902 C234 P10323 /update {wt=javabin&version=2} {add=[108 (1413879602060722176)]} 0 4
[junit4:junit4]   2> 14560 T2886 C237 P10311 /update {wt=javabin&version=2} {add=[109 (1413879602067013632)]} 0 1
[junit4:junit4]   2> 14566 T2924 C233 P10331 REQ /update {update.distrib=FROMLEADER&distrib.from=http://127.0.0.1:10323/solr/collection1/&wt=javabin&version=2} status=0 QTime=0 
[junit4:junit4]   2> 14567 T2901 C234 P10323 REQ /update {distrib.from=http://127.0.0.1:10326/solr/collection1/&update.distrib=TOLEADER&wt=javabin&version=2} status=0 QTime=3 
[junit4:junit4]   2> 14567 T2913 C236 P10326 /update {wt=javabin&version=2} {add=[109]} 0 5
[junit4:junit4]   2> 14570 T2886 C237 P10311 /update {wt=javabin&version=2} {add=[110 (1413879602078547968)]} 0 0
[junit4:junit4]   2> 14583 T2924 C233 P10331 REQ /update {distrib.from=http://127.0.0.1:10323/solr/collection1/&update.distrib=FROMLEADER&wt=javabin&version=2} status=0 QTime=7 
[junit4:junit4]   2> 14583 T2902 C234 P10323 /update {wt=javabin&version=2} {add=[110 (1413879602081693696)]} 0 10
[junit4:junit4]   2> 14587 T2886 C237 P10311 /update {wt=javabin&version=2} {add=[111 (1413879602095325184)]} 0 1
[junit4:junit4]   2> 14593 T2924 C233 P10331 REQ /update {distrib.from=http://127.0.0.1:10323/solr/collection1/&update.distrib=FROMLEADER&wt=javabin&version=2} status=0 QTime=1 
[junit4:junit4]   2> 14593 T2902 C234 P10323 /update {wt=javabin&version=2} {add=[111 (1413879602098470912)]} 0 4
[junit4:junit4]   2> 14596 T2886 C237 P10311 /update {wt=javabin&version=2} {add=[112 (1413879602105810944)]} 0 0
[junit4:junit4]   2> 14602 T2938 C235 P10337 REQ /update {distrib.from=http://127.0.0.1:10326/solr/collection1/&update.distrib=FROMLEADER&wt=javabin&version=2} status=0 QTime=1 
[junit4:junit4]   2> 14602 T2913 C236 P10326 /update {wt=javabin&version=2} {add=[112 (1413879602108956672)]} 0 3
[junit4:junit4]   2> 14620 T2886 C237 P10311 /update {wt=javabin&version=2} {add=[113 (1413879602115248128)]} 0 15
[junit4:junit4]   2> 14628 T2924 C233 P10331 REQ /update {update.distrib=FROMLEADER&distrib.from=http://127.0.0.1:10323/solr/collection1/&wt=javabin&version=2} status=0 QTime=1 
[junit4:junit4]   2> 14628 T2901 C234 P10323 REQ /update {distrib.from=http://127.0.0.1:10326/solr/collection1/&update.distrib=TOLEADER&wt=javabin&version=2} status=0 QTime=4 
[junit4:junit4]   2> 14629 T2913 C236 P10326 /update {wt=javabin&version=2} {add=[113]} 0 7
[junit4:junit4]   2> 14633 T2886 C237 P10311 /update {wt=javabin&version=2} {add=[114 (1413879602142511104)]} 0 2
[junit4:junit4]   2> 14641 T2924 C233 P10331 REQ /update {update.distrib=FROMLEADER&distrib.from=http://127.0.0.1:10323/solr/collection1/&wt=javabin&version=2} status=0 QTime=1 
[junit4:junit4]   2> 14641 T2901 C234 P10323 REQ /update {distrib.from=http://127.0.0.1:10326/solr/collection1/&update.distrib=TOLEADER&wt=javabin&version=2} status=0 QTime=4 
[junit4:junit4]   2> 14642 T2913 C236 P10326 /update {wt=javabin&version=2} {add=[114]} 0 7
[junit4:junit4]   2> 14644 T2886 C237 P10311 /update {wt=javabin&version=2} {add=[115 (1413879602156142592)]} 0 0
[junit4:junit4]   2> 14649 T2938 C235 P10337 REQ /update {distrib.from=http://127.0.0.1:10326/solr/collection1/&update.distrib=FROMLEADER&wt=javabin&version=2} status=0 QTime=0 
[junit4:junit4]   2> 14650 T2913 C236 P10326 /update {wt=javabin&version=2} {add=[115 (1413879602159288320)]} 0 3
[junit4:junit4]   2> 14652 T2886 C237 P10311 /update {wt=javabin&version=2} {add=[116 (1413879602164531200)]} 0 0
[junit4:junit4]   2> 14658 T2938 C235 P10337 REQ /update {distrib.from=http://127.0.0.1:10326/solr/collection1/&update.distrib=FROMLEADER&wt=javabin&version=2} status=0 QTime=1 
[junit4:junit4]   2> 14659 T2913 C236 P10326 /update {wt=javabin&version=2} {add=[116 (1413879602167676928)]} 0 4
[junit4:junit4]   2> 14662 T2886 C237 P10311 /update {wt=javabin&version=2} {add=[117 (1413879602175016960)]} 0 0
[junit4:junit4]   2> 14669 T2938 C235 P10337 REQ /update {update.distrib=FROMLEADER&distrib.from=http://127.0.0.1:10326/solr/collection1/&wt=javabin&version=2} status=0 QTime=0 
[junit4:junit4]   2> 14670 T2916 C236 P10326 REQ /update {distrib.from=http://127.0.0.1:10323/solr/collection1/&update.distrib=TOLEADER&wt=javabin&version=2} status=0 QTime=3 
[junit4:junit4]   2> 14670 T2902 C234 P10323 /update {wt=javabin&version=2} {add=[117]} 0 5
[junit4:junit4]   2> 14673 T2886 C237 P10311 /update {wt=javabin&version=2} {add=[118 (1413879602186551296)]} 0 0
[junit4:junit4]   2> 14712 T2924 C233 P10331 REQ /update {distrib.from=http://127.0.0.1:10323/solr/collection1/&update.distrib=FROMLEADER&wt=javabin&version=2} status=0 QTime=20 
[junit4:junit4]   2> 14713 T2902 C234 P10323 /update {wt=javabin&version=2} {add=[118 (1413879602189697024)]} 0 37
[junit4:junit4]   2> 14717 T2886 C237 P10311 /update {wt=javabin&version=2} {add=[119 (1413879602231640064)]} 0 1
[junit4:junit4]   2> 14722 T2938 C235 P10337 REQ /update {distrib.from=http://127.0.0.1:10326/solr/collection1/&update.distrib=FROMLEADER&wt=javabin&version=2} status=0 QTime=0 
[junit4:junit4]   2> 14723 T2913 C236 P10326 /update {wt=javabin&version=2} {add=[119 (1413879602234785792)]} 0 4
[junit4:junit4]   2> 14727 T2886 C237 P10311 /update {wt=javabin&version=2} {add=[120 (1413879602242125824)]} 0 1
[junit4:junit4]   2> 14733 T2938 C235 P10337 REQ /update {update.distrib=FROMLEADER&distrib.from=http://127.0.0.1:10326/solr/collection1/&wt=javabin&version=2} status=0 QTime=0 
[junit4:junit4]   2> 14734 T2916 C236 P10326 REQ /update {distrib.from=http://127.0.0.1:10323/solr/collection1/&update.distrib=TOLEADER&wt=javabin&version=2} status=0 QTime=3 
[junit4:junit4]   2> 14734 T2902 C234 P10323 /update {wt=javabin&version=2} {add=[120]} 0 5
[junit4:junit4]   2> 14737 T2886 C237 P10311 /update {wt=javabin&version=2} {add=[121 (1413879602253660160)]} 0 0
[junit4:junit4]   2> 14743 T2938 C235 P10337 REQ /update {distrib.from=http://127.0.0.1:10326/solr/collection1/&update.distrib=FROMLEADER&wt=javabin&version=2} status=0 QTime=0 
[junit4:junit4]   2> 14744 T2913 C236 P10326 /update {wt=javabin&version=2} {add=[121 (1413879602256805888)]} 0 4
[junit4:junit4]   2> 14746 T2886 C237 P10311 /update {wt=javabin&version=2} {add=[122 (1413879602263097344)]} 0 0
[junit4:junit4]   2> 14754 T2924 C233 P10331 REQ /update {distrib.from=http://127.0.0.1:10323/solr/collection1/&update.distrib=FROMLEADER&wt=javabin&version=2} status=0 QTime=2 
[junit4:junit4]   2> 14754 T2902 C234 P10323 /update {wt=javabin&version=2} {add=[122 (1413879602266243072)]} 0 5
[junit4:junit4]   2> 14773 T2886 C237 P10311 /update {wt=javabin&version=2} {add=[123 (1413879602274631680)]} 0 16
[junit4:junit4]   2> 14779 T2924 C233 P10331 REQ /update {distrib.from=http://127.0.0.1:10323/solr/collection1/&update.distrib=FROMLEADER&wt=javabin&version=2} status=0 QTime=0 
[junit4:junit4]   2> 14780 T2902 C234 P10323 /update {wt=javabin&version=2} {add=[123 (1413879602294554624)]} 0 4
[junit4:junit4]   2> 14783 T2886 C237 P10311 /update {wt=javabin&version=2} {add=[124 (1413879602300846080)]} 0 1
[junit4:junit4]   2> 14791 T2924 C233 P10331 REQ /update {update.distrib=FROMLEADER&distrib.from=http://127.0.0.1:10323/solr/collection1/&wt=javabin&version=2} status=0 QTime=1 
[junit4:junit4]   2> 14791 T2901 C234 P10323 REQ /update {distrib.from=http://127.0.0.1:10326/solr/collection1/&update.distrib=TOLEADER&wt=javabin&version=2} status=0 QTime=3 
[junit4:junit4]   2> 14792 T2913 C236 P10326 /update {wt=javabin&version=2} {add=[124]} 0 6
[junit4:junit4]   2> 14794 T2886 C237 P10311 /update {wt=javabin&version=2} {add=[125 (1413879602313428992)]} 0 0
[junit4:junit4]   2> 14799 T2924 C233 P10331 REQ /update {distrib.from=http://127.0.0.1:10323/solr/collection1/&update.distrib=FROMLEADER&wt=javabin&version=2} status=0 QTime=0 
[junit4:junit4]   2> 14800 T2902 C234 P10323 /update {wt=javabin&version=2} {add=[125 (1413879602316574720)]} 0 3
[junit4:junit4]   2> 14802 T2886 C237 P10311 /update {wt=javabin&version=2} {add=[126 (1413879602321817600)]} 0 0
[junit4:junit4]   2> 14807 T2938 C235 P10337 REQ /update {distrib.from=http://127.0.0.1:10326/solr/collection1/&update.distrib=FROMLEADER&wt=javabin&version=2} status=0 QTime=0 
[junit4:junit4]   2> 14808 T2913 C236 P10326 /update {wt=javabin&version=2} {add=[126 (1413879602324963328)]} 0 3
[junit4:junit4]   2> 14810 T2886 C237 P10311 /update {wt=javabin&version=2} {add=[127 (1413879602330206208)]} 0 0
[junit4:junit4]   2> 14849 T2938 C235 P10337 REQ /update {distrib.from=http://127.0.0.1:10326/solr/collection1/&update.distrib=FROMLEADER&wt=javabin&version=2} status=0 QTime=20 
[junit4:junit4]   2> 14849 T2913 C236 P10326 /update {wt=javabin&version=2} {add=[127 (1413879602333351936)]} 0 36
[junit4:junit4]   2> 14853 T2886 C237 P10311 /update {wt=javabin&version=2} {add=[128 (1413879602374246400)]} 0 1
[junit4:junit4]   2> 14863 T2938 C235 P10337 REQ /update {update.distrib=FROMLEADER&distrib.from=http://127.0.0.1:10326/solr/collection1/&wt=javabin&version=2} status=0 QTime=2 
[junit4:junit4]   2> 14863 T2916 C236 P10326 REQ /update {distrib.from=http://127.0.0.1:10323/solr/collection1/&update.distrib=TOLEADER&wt=javabin&version=2} status=0 QTime=6 
[junit4:junit4]   2> 14864 T2902 C234 P10323 /update {wt=javabin&version=2} {add=[128]} 0 9
[junit4:junit4]   2> 14867 T2886 C237 P10311 /update {wt=javabin&version=2} {add=[129 (1413879602388926464)]} 0 1
[junit4:junit4]   2> 14871 T2924 C233 P10331 REQ /update {distrib.from=http://127.0.0.1:10323/solr/collection1/&update.distrib=FROMLEADER&wt=javabin&version=2} status=0 QTime=0 
[junit4:junit4]   2> 14872 T2902 C234 P10323 /update {wt=javabin&version=2} {add=[129 (1413879602392072192)]} 0 3
[junit4:junit4]   2> 14875 T2886 C237 P10311 /update {wt=javabin&version=2} {add=[130 (1413879602397315072)]} 0 1
[junit4:junit4]   2> 14881 T2938 C235 P10337 REQ /update {update.distrib=FROMLEADER&distrib.from=http://127.0.0.1:10326/solr/collection1/&wt=javabin&version=2} status=0 QTime=0 
[junit4:junit4]   2> 14882 T2916 C236 P10326 REQ /update {distrib.from=http://127.0.0.1:10323/solr/collection1/&update.distrib=TOLEADER&wt=javabin&version=2} status=0 QTime=3 
[junit4:junit4]   2> 14882 T2902 C234 P10323 /update {wt=javabin&version=2} {add=[130]} 0 5
[junit4:junit4]   2> 14886 T2886 C237 P10311 /update {wt=javabin&version=2} {add=[131 (1413879602408849408)]} 0 1
[junit4:junit4]   2> 14895 T2938 C235 P10337 REQ /update {update.distrib=FROMLEADER&distrib.from=http://127.0.0.1:10326/solr/collection1/&wt=javabin&version=2} status=0 QTime=1 
[junit4:junit4]   2> 14895 T2916 C236 P10326 REQ /update {distrib.from=http://127.0.0.1:10323/solr/collection1/&update.distrib=TOLEADER&wt=javabin&version=2} status=0 QTime=4 
[junit4:junit4]   2> 14896 T2902 C234 P10323 /update {wt=javabin&version=2} {add=[131]} 0 7
[junit4:junit4]   2> 14899 T2886 C237 P10311 /update {wt=javabin&version=2} {add=[132 (1413879602422480896)]} 0 1
[junit4:junit4]   2> 14906 T2924 C233 P10331 REQ /update {update.distrib=FROMLEADER&distrib.from=http://127.0.0.1:10323/solr/collection1/&wt=javabin&version=2} status=0 QTime=1 
[junit4:junit4]   2> 14906 T2901 C234 P10323 REQ /update {distrib.from=http://127.0.0.1:10326/solr/collection1/&update.distrib=TOLEADER&wt=javabin&version=2} status=0 QTime=3 
[junit4:junit4]   2> 14907 T2913 C236 P10326 /update {wt=javabin&version=2} {add=[132]} 0 6
[junit4:junit4]   2> 14937 T2886 C237 P10311 /update {wt=javabin&version=2} {add=[133 (1413879602434015232)]} 0 28
[junit4:junit4]   2> 14944 T2924 C233 P10331 REQ /update {distrib.from=http://127.0.0.1:10323/solr/collection1/&update.distrib=FROMLEADER&wt=javabin&version=2} status=0 QTime=1 
[junit4:junit4]   2> 14944 T2902 C234 P10323 /update {wt=javabin&version=2} {add=[133 (1413879602466521088)]} 0 4
[junit4:junit4]   2> 14950 T2886 C237 P10311 /update {wt=javabin&version=2} {add=[134 (1413879602473861120)]} 0 3
[junit4:junit4]   2> 14958 T2938 C235 P10337 REQ /update {update.distrib=FROMLEADER&distrib.from=http://127.0.0.1:10326/solr/collection1/&wt=javabin&version=2} status=0 QTime=1 
[junit4:junit4]   2> 14958 T2916 C236 P10326 REQ /update {distrib.from=http://127.0.0.1:10323/solr/collection1/&update.distrib=TOLEADER&wt=javabin&version=2} status=0 QTime=4 
[junit4:junit4]   2> 14959 T2902 C234 P10323 /update {wt=javabin&version=2} {add=[134]} 0 7
[junit4:junit4]   2> 14962 T2886 C237 P10311 /update {wt=javabin&version=2} {add=[135 (1413879602488541184)]} 0 1
[junit4:junit4]   2> 14970 T2924 C233 P10331 REQ /update {update.distrib=FROMLEADER&distrib.from=http://127.0.0.1:10323/solr/collection1/&wt=javabin&version=2} status=0 QTime=1 
[junit4:junit4]   2> 14970 T2901 C234 P10323 REQ /update {distrib.from=http://127.0.0.1:10326/solr/collection1/&update.distrib=TOLEADER&wt=javabin&version=2} status=0 QTime=4 
[junit4:junit4]   2> 14971 T2913 C236 P10326 /update {wt=javabin&version=2} {add=[135]} 0 7
[junit4:junit4]   2> 14974 T2886 C237 P10311 /update {wt=javabin&version=2} {add=[136 (1413879602501124096)]} 0 1
[junit4:junit4]   2> 14980 T2938 C235 P10337 REQ /update {distrib.from=http://127.0.0.1:10326/solr/collection1/&update.distrib=FROMLEADER&wt=javabin&version=2} status=0 QTime=0 
[junit4:junit4]   2> 14981 T2913 C236 P10326 /update {wt=javabin&version=2} {add=[136 (1413879602505318400)]} 0 4
[junit4:junit4]   2> 14985 T2886 C237 P10311 /update {wt=javabin&version=2} {add=[137 (1413879602512658432)]} 0 1
[junit4:junit4]   2> 14993 T2938 C235 P10337 REQ /update {update.distrib=FROMLEADER&distrib.from=http://127.0.0.1:10326/solr/collection1/&wt=javabin&version=2} status=0 QTime=1 
[junit4:junit4]   2> 14993 T2916 C236 P10326 REQ /update {distrib.from=http://127.0.0.1:10323/solr/collection1/&update.distrib=TOLEADER&wt=javabin&version=2} status=0 QTime=4 
[junit4:junit4]   2> 14994 T2902 C234 P10323 /update {wt=javabin&version=2} {add=[137]} 0 7
[junit4:junit4]   2> 14997 T2886 C237 P10311 /update {wt=javabin&version=2} {add=[138 (1413879602525241344)]} 0 1
[junit4:junit4]   2> 15006 T2924 C233 P10331 REQ /update {update.distrib=FROMLEADER&distrib.from=http://127.0.0.1:10323/solr/collection1/&wt=javabin&version=2} status=0 QTime=1 
[junit4:junit4]   2> 15006 T2901 C234 P10323 REQ /update {distrib.from=http://127.0.0.1:10326/solr/collection1/&update.distrib=TOLEADER&wt=javabin&version=2} status=0 QTime=4 
[junit4:junit4]   2> 15007 T2913 C236 P10326 /update {wt=javabin&version=2} {add=[138]} 0 7
[junit4:junit4]   2> 15010 T2886 C237 P10311 /update {wt=javabin&version=2} {add=[139 (1413879602538872832)]} 0 1
[junit4:junit4]   2> 15015 T2938 C235 P10337 REQ /update {distrib.from=http://127.0.0.1:10326/solr/collection1/&update.distrib=FROMLEADER&wt=javabin&version=2} status=0 QTime=0 
[junit4:junit4]   2> 15016 T2913 C236 P10326 /update {wt=javabin&version=2} {add=[139 (1413879602542018560)]} 0 4
[junit4:junit4]   2> 15020 T2886 C237 P10311 /update {wt=javabin&version=2} {add=[140 (1413879602549358592)]} 0 1
[junit4:junit4]   2> 15028 T2938 C235 P10337 REQ /update {update.distrib=FROMLEADER&distrib.from=http://127.0.0.1:10326/solr/collection1/&wt=javabin&version=2} status=0 QTime=1 
[junit4:junit4]   2> 15028 T2916 C236 P10326 REQ /update {distrib.from=http://127.0.0.1:10323/solr/collection1/&update.distrib=TOLEADER&wt=javabin&version=2} status=0 QTime=4 
[junit4:junit4]   2> 15028 T2902 C234 P10323 /update {wt=javabin&version=2} {add=[140]} 0 6
[junit4:junit4]   2> 15032 T2886 C237 P10311 /update {wt=javabin&version=2} {add=[141 (1413879602561941504)]} 0 1
[junit4:junit4]   2> 15040 T2938 C235 P10337 REQ /update {update.distrib=FROMLEADER&distrib.from=http://127.0.0.1:10326/solr/collection1/&wt=javabin&version=2} status=0 QTime=0 
[junit4:junit4]   2> 15040 T2916 C236 P10326 REQ /update {distrib.from=http://127.0.0.1:10323/solr/collection1/&update.distrib=TOLEADER&wt=javabin&version=2} status=0 QTime=3 
[junit4:junit4]   2> 15040 T2902 C234 P10323 /update {wt=javabin&version=2} {add=[141]} 0 5
[junit4:junit4]   2> 15044 T2886 C237 P10311 /update {wt=javabin&version=2} {add=[142 (1413879602574524416)]} 0 1
[junit4:junit4]   2> 15100 T2938 C235 P10337 REQ /update {distrib.from=http://127.0.0.1:10326/solr/collection1/&update.distrib=FROMLEADER&wt=javabin&version=2} status=0 QTime=20 
[junit4:junit4]   2> 15101 T2913 C236 P10326 /update {wt=javabin&version=2} {add=[142 (1413879602577670144)]} 0 55
[junit4:junit4]   2> 15137 T2886 C237 P10311 /update {wt=javabin&version=2} {add=[143 (1413879602638487552)]} 0 33
[junit4:junit4]   2> 15149 T2938 C235 P10337 REQ /update {update.distrib=FROMLEADER&distrib.from=http://127.0.0.1:10326/solr/collection1/&wt=javabin&version=2} status=0 QTime=2 
[junit4:junit4]   2> 15149 T2916 C236 P10326 REQ /update {distrib.from=http://127.0.0.1:10323/solr/collection1/&update.distrib=TOLEADER&wt=javabin&version=2} status=0 QTime=7 
[junit4:junit4]   2> 15150 T2902 C234 P10323 /update {wt=javabin&version=2} {add=[143]} 0 10
[junit4:junit4]   2> 15156 T2886 C237 P10311 /update {wt=javabin&version=2} {add=[144 (1413879602689867776)]} 0 3
[junit4:junit4]   2> 15161 T2938 C235 P10337 REQ /update {distrib.from=http://127.0.0.1:10326/solr/collection1/&update.distrib=FROMLEADER&wt=javabin&version=2} status=0 QTime=0 
[junit4:junit4]   2> 15162 T2913 C236 P10326 /update {wt=javabin&version=2} {add=[144 (1413879602695110656)]} 0 4
[junit4:junit4]   2> 15166 T2886 C237 P10311 /update {wt=javabin&version=2} {add=[145 (1413879602702450688)]} 0 1
[junit4:junit4]   2> 15175 T2938 C235 P10337 REQ /update {update.distrib=FROMLEADER&distrib.from=http://127.0.0.1:10326/solr/collection1/&wt=javabin&version=2} status=0 QTime=1 
[junit4:junit4]   2> 15175 T2916 C236 P10326 REQ /update {distrib.from=http://127.0.0.1:10323/solr/collection1/&update.distrib=TOLEADER&wt=javabin&version=2} status=0 QTime=4 
[junit4:junit4]   2> 15176 T2902 C234 P10323 /update {wt=javabin&version=2} {add=[145]} 0 7
[junit4:junit4]   2> 15179 T2886 C237 P10311 /update {wt=javabin&version=2} {add=[146 (1413879602716082176)]} 0 1
[junit4:junit4]   2> 15223 T2924 C233 P10331 REQ /update {distrib.from=http://127.0.0.1:10323/solr/collection1/&update.distrib=FROMLEADER&wt=javabin&version=2} status=0 QTime=20 
[junit4:junit4]   2> 15223 T2902 C234 P10323 /update {wt=javabin&version=2} {add=[146 (1413879602720276480)]} 0 41
[junit4:junit4]   2> 15227 T2886 C237 P10311 /update {wt=javabin&version=2} {add=[147 (1413879602766413824)]} 0 1
[junit4:junit4]   2> 15236 T2938 C235 P10337 REQ /update {update.distrib=FROMLEADER&distrib.from=http://127.0.0.1:10326/solr/collection1/&wt=javabin&version=2} status=0 QTime=1 
[junit4:junit4]   2> 15236 T2916 C236 P10326 REQ /update {distrib.from=http://127.0.0.1:10323/solr/collection1/&update.distrib=TOLEADER&wt=javabin&version=2} status=0 QTime=4 
[junit4:junit4]   2> 15237 T2902 C234 P10323 /update {wt=javabin&version=2} {add=[147]} 0 7
[junit4:junit4]   2> 15240 T2886 C237 P10311 /update {wt=javabin&version=2} {add=[148 (1413879602780045312)]} 0 1
[junit4:junit4]   2> 15249 T2924 C233 P10331 REQ /update {distrib.from=http://127.0.0.1:10323/solr/collection1/&update.distrib=FROMLEADER&wt=javabin&version=2} status=0 QTime=2 
[junit4:junit4]   2> 15249 T2902 C234 P10323 /update {wt=javabin&version=2} {add=[148 (1413879602784239616)]} 0 6
[junit4:junit4]   2> 15253 T2886 C237 P10311 /update {wt=javabin&version=2} {add=[149 (1413879602793676800)]} 0 1
[junit4:junit4]   2> 15262 T2938 C235 P10337 REQ /update {update.distrib=FROMLEADER&distrib.from=http://127.0.0.1:10326/solr/collection1/&wt=javabin&version=2} status=0 QTime=1 
[junit4:junit4]   2> 15262 T2916 C236 P10326 REQ /update {distrib.from=http://127.0.0.1:10323/solr/collection1/&update.distrib=TOLEADER&wt=javabin&version=2} status=0 QTime=4 
[junit4:junit4]   2> 15263 T2902 C234 P10323 /update {wt=javabin&version=2} {add=[149]} 0 7
[junit4:junit4]   2> 15263 T2874 oasc.AbstractDistribZkTestBase.waitForRecoveriesToFinish Wait for recoveries to finish - collection: collection1 failOnTimeout:true timeout (sec):3600
[junit4:junit4]   2> 15264 T2874 oascc.ZkStateReader.updateClusterState Updating cloud state from ZooKeeper... 
[junit4:junit4]   2> 15267 T2886 C237 P10311 oasu.DirectUpdateHandler2.commit start commit{flags=0,_version_=0,optimize=false,openSearcher=true,waitSearcher=true,expungeDeletes=false,softCommit=false}
[junit4:junit4]   2> 15708 T2886 C237 P10311 oasc.SolrDeletionPolicy.onCommit SolrDeletionPolicy.onCommit: commits:num=2
[junit4:junit4]   2> 		commit{dir=/usr/home/hudson/hudson-slave/workspace/Lucene-Solr-NightlyTests-trunk/solr/build/solr-core/test/J0/org.apache.solr.cloud.BasicDistributedZk2Test-1348380648427/control/data/index,segFN=segments_2,generation=2,filenames=[_0_MockSep_0.pos, _0_Pulsing40_0.prx, _0_Pulsing40_0.frq, _0_Lucene40WithOrds_0.tii, _0_Lucene40WithOrds_0.frq, _0_MockSep_0.skp, _0_Pulsing40_0.tip, _0.si, _0_MockSep_0.doc, _0_Lucene40WithOrds_0.tib, _0_Pulsing40_0.tim, _0.fnm, _0_nrm.cfs, _0_MockRandom_0.skp, _0_MockSep_0.tib, _0_MockRandom_0.tip, _0_MockRandom_0.frq, _0_MockRandom_0.sd, _0_MockRandom_0.doc, _0_nrm.cfe, _0_MockRandom_0.pos, segments_2, _0_MockSep_0.frq, _0.fdx, _0_Lucene40WithOrds_0.prx, _0_MockSep_0.tii, _0_MockSep_0.pyl, _0_MockRandom_0.pyl, _0_MockRandom_0.tim, _0.fdt]
[junit4:junit4]   2> 		commit{dir=/usr/home/hudson/hudson-slave/workspace/Lucene-Solr-NightlyTests-trunk/solr/build/solr-core/test/J0/org.apache.solr.cloud.BasicDistributedZk2Test-1348380648427/control/data/index,segFN=segments_3,generation=3,filenames=[_5_nrm.cfe, _3_MockRandom_0.prx, _4_MockSep_0.skp, _3.fdt, _5_Lucene40WithOrds_0.tib, _2_MockSep_0.doc, _1_MockRandom_0.pos, _7.fnm, _0_Lucene40WithOrds_0.frq, _5_Lucene40WithOrds_0.tii, _1_Lucene40WithOrds_0.tib, _6_MockSep_0.doc, _5_MockSep_0.skp, _4_MockRandom_0.pyl, _1_Lucene40WithOrds_0.tii, _5_Pulsing40_0.tip, _6_MockSep_0.frq, _7_MockSep_0.tib, _5_Pulsing40_0.tim, _1_MockSep_0.pyl, _1_Lucene40WithOrds_0.frq, _0_Pulsing40

[...truncated too long message...]

apache.solr.cloud.LeaderElector.runIamLeaderProcess(LeaderElector.java:158)
[junit4:junit4]   2> 	at org.apache.solr.cloud.LeaderElector.checkIfIamLeader(LeaderElector.java:102)
[junit4:junit4]   2> 	at org.apache.solr.cloud.LeaderElector.access$000(LeaderElector.java:56)
[junit4:junit4]   2> 	at org.apache.solr.cloud.LeaderElector$1.process(LeaderElector.java:131)
[junit4:junit4]   2> 	at org.apache.zookeeper.ClientCnxn$EventThread.processEvent(ClientCnxn.java:526)
[junit4:junit4]   2> 	at org.apache.zookeeper.ClientCnxn$EventThread.run(ClientCnxn.java:502)
[junit4:junit4]   2> 
[junit4:junit4]   2> 305420 T2946 oasc.JmxMonitoredMap$SolrDynamicMBean.getMBeanInfo WARNING Could not getStatistics on info bean Lazy[solr.ReplicationHandler] java.lang.IllegalArgumentException: /usr/home/hudson/hudson-slave/workspace/Lucene-Solr-NightlyTests-trunk/solr/build/solr-core/test/J0/org.apache.solr.cloud.BasicDistributedZk2Test-1348380648427/jetty4/index does not exist
[junit4:junit4]   2> 	at org.apache.commons.io.FileUtils.sizeOfDirectory(FileUtils.java:2074)
[junit4:junit4]   2> 	at org.apache.solr.handler.ReplicationHandler.getIndexSize(ReplicationHandler.java:477)
[junit4:junit4]   2> 	at org.apache.solr.handler.ReplicationHandler.getStatistics(ReplicationHandler.java:525)
[junit4:junit4]   2> 	at org.apache.solr.core.RequestHandlers$LazyRequestHandlerWrapper.getStatistics(RequestHandlers.java:310)
[junit4:junit4]   2> 	at org.apache.solr.core.JmxMonitoredMap$SolrDynamicMBean.getMBeanInfo(JmxMonitoredMap.java:231)
[junit4:junit4]   2> 	at com.sun.jmx.interceptor.DefaultMBeanServerInterceptor.getClassName(DefaultMBeanServerInterceptor.java:1824)
[junit4:junit4]   2> 	at com.sun.jmx.interceptor.DefaultMBeanServerInterceptor.safeGetClassName(DefaultMBeanServerInterceptor.java:1661)
[junit4:junit4]   2> 	at com.sun.jmx.interceptor.DefaultMBeanServerInterceptor.checkMBeanPermission(DefaultMBeanServerInterceptor.java:1833)
[junit4:junit4]   2> 	at com.sun.jmx.interceptor.DefaultMBeanServerInterceptor.exclusiveUnregisterMBean(DefaultMBeanServerInterceptor.java:436)
[junit4:junit4]   2> 	at com.sun.jmx.interceptor.DefaultMBeanServerInterceptor.unregisterMBean(DefaultMBeanServerInterceptor.java:421)
[junit4:junit4]   2> 	at com.sun.jmx.mbeanserver.JmxMBeanServer.unregisterMBean(JmxMBeanServer.java:540)
[junit4:junit4]   2> 	at org.apache.solr.core.JmxMonitoredMap.unregister(JmxMonitoredMap.java:175)
[junit4:junit4]   2> 	at org.apache.solr.core.JmxMonitoredMap.clear(JmxMonitoredMap.java:116)
[junit4:junit4]   2> 	at org.apache.solr.core.SolrCore.close(SolrCore.java:864)
[junit4:junit4]   2> 	at org.apache.solr.cloud.ShardLeaderElectionContext.runLeaderProcess(ElectionContext.java:213)
[junit4:junit4]   2> 	at org.apache.solr.cloud.LeaderElector.runIamLeaderProcess(LeaderElector.java:158)
[junit4:junit4]   2> 	at org.apache.solr.cloud.LeaderElector.checkIfIamLeader(LeaderElector.java:102)
[junit4:junit4]   2> 	at org.apache.solr.cloud.LeaderElector.access$000(LeaderElector.java:56)
[junit4:junit4]   2> 	at org.apache.solr.cloud.LeaderElector$1.process(LeaderElector.java:131)
[junit4:junit4]   2> 	at org.apache.zookeeper.ClientCnxn$EventThread.processEvent(ClientCnxn.java:526)
[junit4:junit4]   2> 	at org.apache.zookeeper.ClientCnxn$EventThread.run(ClientCnxn.java:502)
[junit4:junit4]   2> 
[junit4:junit4]   2> 305427 T2946 oasc.SolrCore.closeSearcher [collection1] Closing main searcher on request.
[junit4:junit4]   2> 305432 T2946 oasu.DirectUpdateHandler2.close closing DirectUpdateHandler2{commits=5,autocommits=0,soft autocommits=0,optimizes=0,rollbacks=0,expungeDeletes=0,docsPending=0,adds=0,deletesById=0,deletesByQuery=0,errors=0,cumulative_adds=35,cumulative_deletesById=0,cumulative_deletesByQuery=0,cumulative_errors=0}
[junit4:junit4]   2> 305433 T2946 oasu.DefaultSolrCoreState.decref SolrCoreState ref count has reached 0 - closing IndexWriter
[junit4:junit4]   2> 305435 T2946 oasu.DefaultSolrCoreState.decref Closing SolrCoreState - canceling any ongoing recovery
[junit4:junit4]   2> 305436 T2946 oascc.ZkStateReader$3.process Updating live nodes
[junit4:junit4]   2> 305436 T2946 oascc.ZkStateReader$3.process WARNING ZooKeeper watch triggered, but Solr cannot talk to ZK
[junit4:junit4]   2> 305436 T2946 oascc.ZkStateReader$2.process A cluster state change has occurred - updating...
[junit4:junit4]   2> 305437 T2946 oascc.ZkStateReader$2.process WARNING ZooKeeper watch triggered, but Solr cannot talk to ZK
[junit4:junit4]   2> 305437 T2946 oascc.ConnectionManager.process Watcher org.apache.solr.common.cloud.ConnectionManager@e54c7a6 name:ZooKeeperConnection Watcher:127.0.0.1:10308/solr got event WatchedEvent state:Disconnected type:None path:null path:null type:None
[junit4:junit4]   2> 305437 T2946 oascc.ConnectionManager.process Client->ZooKeeper status change trigger but we are already closed
[junit4:junit4]   2> 305438 T2946 oaz.ClientCnxn$EventThread.run EventThread shut down
[junit4:junit4]   2> NOTE: test params are: codec=Lucene40: {n_f1=PostingsFormat(name=MockSep), foo_b=PostingsFormat(name=Lucene40WithOrds), foo_d=Pulsing40(freqCutoff=19 minBlockSize=87 maxBlockSize=179), foo_f=PostingsFormat(name=Lucene40WithOrds), n_tl1=PostingsFormat(name=MockSep), n_d1=PostingsFormat(name=MockRandom), rnd_b=Pulsing40(freqCutoff=19 minBlockSize=87 maxBlockSize=179), intDefault=PostingsFormat(name=MockRandom), n_td1=PostingsFormat(name=MockSep), id=Pulsing40(freqCutoff=19 minBlockSize=87 maxBlockSize=179), timestamp=PostingsFormat(name=MockRandom), range_facet_sl=PostingsFormat(name=Lucene40WithOrds), range_facet_si=PostingsFormat(name=MockSep), oddField_s=PostingsFormat(name=Lucene40WithOrds), multiDefault=PostingsFormat(name=MockSep), n_tf1=PostingsFormat(name=MockRandom), n_dt1=PostingsFormat(name=MockSep), n_ti1=Pulsing40(freqCutoff=19 minBlockSize=87 maxBlockSize=179), range_facet_l=PostingsFormat(name=MockRandom), text=PostingsFormat(name=Lucene40WithOrds), _version_=PostingsFormat(name=MockRandom), SubjectTerms_mfacet=PostingsFormat(name=MockRandom), a_t=PostingsFormat(name=MockRandom), n_tdt1=PostingsFormat(name=MockRandom), other_tl1=PostingsFormat(name=MockRandom), n_l1=PostingsFormat(name=MockRandom), a_si=PostingsFormat(name=MockSep)}, sim=RandomSimilarityProvider(queryNorm=false,coord=crazy): {}, locale=ja, timezone=Pacific/Auckland
[junit4:junit4]   2> NOTE: FreeBSD 9.0-RELEASE amd64/Sun Microsystems Inc. 1.6.0_32 (64-bit)/cpus=16,threads=2,free=77403552,total=283705344
[junit4:junit4]   2> NOTE: All tests run in this JVM: [SolrCmdDistributorTest, CircularListTest, DefaultValueUpdateProcessorTest, SpellPossibilityIteratorTest, ClusterStateTest, CoreContainerCoreInitFailuresTest, FieldAnalysisRequestHandlerTest, SpellCheckComponentTest, TestSystemIdResolver, BadComponentTest, SpatialFilterTest, CSVRequestHandlerTest, ResourceLoaderTest, UniqFieldsUpdateProcessorFactoryTest, UpdateRequestProcessorFactoryTest, TestWordDelimiterFilterFactory, AnalysisAfterCoreReloadTest, SampleTest, AutoCommitTest, NotRequiredUniqueKeyTest, MoreLikeThisHandlerTest, BasicDistributedZkTest, TestStressVersions, TestExtendedDismaxParser, CacheHeaderTest, DistributedSpellCheckComponentTest, DateMathParserTest, SOLR749Test, TestGroupingSearch, ZkCLITest, TestFiltering, ZkControllerTest, TestPerFieldSimilarity, SortByFunctionTest, FastVectorHighlighterTest, DateFieldTest, TestQueryTypes, TestFastWriter, LoggingHandlerTest, SuggesterFSTTest, CurrencyFieldTest, TestSolrQueryParser, TestSolr4Spatial, JSONWriterTest, TestIBSimilarityFactory, SolrCoreCheckLockOnStartupTest, TestBadConfig, AlternateDirectoryTest, SolrRequestParserTest, TestBinaryResponseWriter, TestIndexingPerformance, PluginInfoTest, PreAnalyzedFieldTest, TestLMDirichletSimilarityFactory, TestReplicationHandler, LeaderElectionIntegrationTest, TestDistributedSearch, IndexBasedSpellCheckerTest, TestRangeQuery, DirectUpdateHandlerTest, TestMultiCoreConfBootstrap, SimpleFacetsTest, TestCoreContainer, LukeRequestHandlerTest, TestSort, DirectSolrSpellCheckerTest, FileBasedSpellCheckerTest, QueryElevationComponentTest, CoreAdminHandlerTest, DirectSolrConnectionTest, DocumentBuilderTest, DistributedQueryElevationComponentTest, IndexSchemaTest, QueryParsingTest, DistanceFunctionTest, MinimalSchemaTest, XmlUpdateRequestHandlerTest, SuggesterWFSTTest, DirectUpdateHandlerOptimizeTest, SolrPluginUtilsTest, TestReversedWildcardFilterFactory, ReturnFieldsTest, RequestHandlersTest, CopyFieldTest, SuggesterTSTTest, TestPropInject, NoCacheHeaderTest, HighlighterConfigTest, TestXIncludeConfig, TestLFUCache, TestQuerySenderNoQuery, NumericFieldsTest, TestNumberUtils, TestJmxMonitoredMap, TestConfig, TestPhraseSuggestions, TestDFRSimilarityFactory, TestDefaultSimilarityFactory, TestFastLRUCache, OpenExchangeRatesOrgProviderTest, SpellingQueryConverterTest, SystemInfoHandlerTest, TestDocumentBuilder, TestCharFilters, BasicDistributedZk2Test]
[junit4:junit4] Completed on J0 in 305.92s, 1 test, 1 failure <<< FAILURES!

[...truncated 10 lines...]
BUILD FAILED
/usr/home/hudson/hudson-slave/workspace/Lucene-Solr-NightlyTests-trunk/build.xml:32: The following error occurred while executing this line:
/usr/home/hudson/hudson-slave/workspace/Lucene-Solr-NightlyTests-trunk/solr/build.xml:179: The following error occurred while executing this line:
/usr/home/hudson/hudson-slave/workspace/Lucene-Solr-NightlyTests-trunk/lucene/module-build.xml:63: The following error occurred while executing this line:
/usr/home/hudson/hudson-slave/workspace/Lucene-Solr-NightlyTests-trunk/lucene/common-build.xml:1141: The following error occurred while executing this line:
/usr/home/hudson/hudson-slave/workspace/Lucene-Solr-NightlyTests-trunk/lucene/common-build.xml:814: There were test failures: 230 suites, 950 tests, 1 failure, 21 ignored (3 assumptions)

Total time: 128 minutes 12 seconds
Build step 'Invoke Ant' marked build as failure
Recording test results
Email was triggered for: Failure
Sending email for trigger: Failure



Mime
View raw message