lucene-dev mailing list archives

Site index · List index
Message view « Date » · « Thread »
Top « Date » · « Thread »
From Apache Jenkins Server <jenk...@builds.apache.org>
Subject [JENKINS-MAVEN] Lucene-Solr-Maven-4.x #80: POMs out of sync
Date Sat, 01 Sep 2012 13:35:34 GMT
Build: https://builds.apache.org/job/Lucene-Solr-Maven-4.x/80/

3 tests failed.
FAILED:  org.apache.solr.handler.extraction.ExtractingRequestHandlerTest.testArabicPDF

Error Message:
ERROR: [doc=one] unknown field 'meta:creation-date'

Stack Trace:
org.apache.solr.common.SolrException: ERROR: [doc=one] unknown field 'meta:creation-date'
	at __randomizedtesting.SeedInfo.seed([564B8C2811E551FC:388DF7271220FAA9]:0)
	at org.apache.solr.update.DocumentBuilder.toDocument(DocumentBuilder.java:306)
	at org.apache.solr.update.AddUpdateCommand.getLuceneDocument(AddUpdateCommand.java:73)
	at org.apache.solr.update.DirectUpdateHandler2.addDoc(DirectUpdateHandler2.java:208)
	at org.apache.solr.update.processor.RunUpdateProcessor.processAdd(RunUpdateProcessorFactory.java:61)
	at org.apache.solr.update.processor.UpdateRequestProcessor.processAdd(UpdateRequestProcessor.java:51)
	at org.apache.solr.update.processor.DistributedUpdateProcessor.versionAdd(DistributedUpdateProcessor.java:463)
	at org.apache.solr.update.processor.DistributedUpdateProcessor.processAdd(DistributedUpdateProcessor.java:342)
	at org.apache.solr.handler.extraction.ExtractingDocumentLoader.doAdd(ExtractingDocumentLoader.java:121)
	at org.apache.solr.handler.extraction.ExtractingDocumentLoader.addDoc(ExtractingDocumentLoader.java:126)
	at org.apache.solr.handler.extraction.ExtractingDocumentLoader.load(ExtractingDocumentLoader.java:233)
	at org.apache.solr.handler.ContentStreamHandlerBase.handleRequestBody(ContentStreamHandlerBase.java:74)
	at org.apache.solr.handler.RequestHandlerBase.handleRequest(RequestHandlerBase.java:129)
	at org.apache.solr.core.SolrCore.execute(SolrCore.java:1692)
	at org.apache.solr.util.TestHarness.queryAndResponse(TestHarness.java:375)
	at org.apache.solr.handler.extraction.ExtractingRequestHandlerTest.loadLocal(ExtractingRequestHandlerTest.java:602)
	at org.apache.solr.handler.extraction.ExtractingRequestHandlerTest.testArabicPDF(ExtractingRequestHandlerTest.java:388)
	at sun.reflect.NativeMethodAccessorImpl.invoke0(Native Method)
	at sun.reflect.NativeMethodAccessorImpl.invoke(NativeMethodAccessorImpl.java:57)
	at sun.reflect.DelegatingMethodAccessorImpl.invoke(DelegatingMethodAccessorImpl.java:43)
	at java.lang.reflect.Method.invoke(Method.java:616)
	at com.carrotsearch.randomizedtesting.RandomizedRunner.invoke(RandomizedRunner.java:1559)
	at com.carrotsearch.randomizedtesting.RandomizedRunner.access$600(RandomizedRunner.java:79)
	at com.carrotsearch.randomizedtesting.RandomizedRunner$6.evaluate(RandomizedRunner.java:737)
	at com.carrotsearch.randomizedtesting.RandomizedRunner$7.evaluate(RandomizedRunner.java:773)
	at com.carrotsearch.randomizedtesting.RandomizedRunner$8.evaluate(RandomizedRunner.java:787)
	at com.carrotsearch.randomizedtesting.rules.SystemPropertiesRestoreRule$1.evaluate(SystemPropertiesRestoreRule.java:53)
	at org.apache.lucene.util.TestRuleSetupTeardownChained$1.evaluate(TestRuleSetupTeardownChained.java:50)
	at org.apache.lucene.util.TestRuleFieldCacheSanity$1.evaluate(TestRuleFieldCacheSanity.java:51)
	at org.apache.lucene.util.AbstractBeforeAfterRule$1.evaluate(AbstractBeforeAfterRule.java:45)
	at com.carrotsearch.randomizedtesting.rules.SystemPropertiesInvariantRule$1.evaluate(SystemPropertiesInvariantRule.java:55)
	at org.apache.lucene.util.TestRuleThreadAndTestName$1.evaluate(TestRuleThreadAndTestName.java:48)
	at org.apache.lucene.util.TestRuleIgnoreAfterMaxFailures$1.evaluate(TestRuleIgnoreAfterMaxFailures.java:70)
	at org.apache.lucene.util.TestRuleMarkFailure$1.evaluate(TestRuleMarkFailure.java:48)
	at com.carrotsearch.randomizedtesting.rules.StatementAdapter.evaluate(StatementAdapter.java:36)
	at com.carrotsearch.randomizedtesting.ThreadLeakControl$StatementRunner.run(ThreadLeakControl.java:345)
	at com.carrotsearch.randomizedtesting.ThreadLeakControl.forkTimeoutingTask(ThreadLeakControl.java:769)
	at com.carrotsearch.randomizedtesting.ThreadLeakControl$3.evaluate(ThreadLeakControl.java:429)
	at com.carrotsearch.randomizedtesting.RandomizedRunner.runSingleTest(RandomizedRunner.java:746)
	at com.carrotsearch.randomizedtesting.RandomizedRunner$3.evaluate(RandomizedRunner.java:648)
	at com.carrotsearch.randomizedtesting.RandomizedRunner$4.evaluate(RandomizedRunner.java:682)
	at com.carrotsearch.randomizedtesting.RandomizedRunner$5.evaluate(RandomizedRunner.java:693)
	at com.carrotsearch.randomizedtesting.rules.StatementAdapter.evaluate(StatementAdapter.java:36)
	at com.carrotsearch.randomizedtesting.rules.SystemPropertiesRestoreRule$1.evaluate(SystemPropertiesRestoreRule.java:53)
	at org.apache.lucene.util.AbstractBeforeAfterRule$1.evaluate(AbstractBeforeAfterRule.java:45)
	at org.apache.lucene.util.TestRuleStoreClassName$1.evaluate(TestRuleStoreClassName.java:42)
	at com.carrotsearch.randomizedtesting.rules.SystemPropertiesInvariantRule$1.evaluate(SystemPropertiesInvariantRule.java:55)
	at com.carrotsearch.randomizedtesting.rules.NoShadowingOrOverridesOnMethodsRule$1.evaluate(NoShadowingOrOverridesOnMethodsRule.java:39)
	at com.carrotsearch.randomizedtesting.rules.NoShadowingOrOverridesOnMethodsRule$1.evaluate(NoShadowingOrOverridesOnMethodsRule.java:39)
	at org.apache.lucene.util.TestRuleAssertionsRequired$1.evaluate(TestRuleAssertionsRequired.java:40)
	at org.apache.lucene.util.TestRuleMarkFailure$1.evaluate(TestRuleMarkFailure.java:48)
	at org.apache.lucene.util.TestRuleIgnoreAfterMaxFailures$1.evaluate(TestRuleIgnoreAfterMaxFailures.java:70)
	at org.apache.lucene.util.TestRuleIgnoreTestSuites$1.evaluate(TestRuleIgnoreTestSuites.java:55)
	at com.carrotsearch.randomizedtesting.rules.StatementAdapter.evaluate(StatementAdapter.java:36)
	at com.carrotsearch.randomizedtesting.ThreadLeakControl$StatementRunner.run(ThreadLeakControl.java:345)
	at java.lang.Thread.run(Thread.java:679)


FAILED:  org.apache.solr.handler.extraction.ExtractingRequestHandlerTest.testExtraction

Error Message:
ERROR: [doc=one] unknown field 'meta:save-date'

Stack Trace:
org.apache.solr.common.SolrException: ERROR: [doc=one] unknown field 'meta:save-date'
	at __randomizedtesting.SeedInfo.seed([564B8C2811E551FC:EF38F8566DCD8109]:0)
	at org.apache.solr.update.DocumentBuilder.toDocument(DocumentBuilder.java:306)
	at org.apache.solr.update.AddUpdateCommand.getLuceneDocument(AddUpdateCommand.java:73)
	at org.apache.solr.update.DirectUpdateHandler2.addDoc(DirectUpdateHandler2.java:208)
	at org.apache.solr.update.processor.RunUpdateProcessor.processAdd(RunUpdateProcessorFactory.java:61)
	at org.apache.solr.update.processor.UpdateRequestProcessor.processAdd(UpdateRequestProcessor.java:51)
	at org.apache.solr.update.processor.DistributedUpdateProcessor.versionAdd(DistributedUpdateProcessor.java:463)
	at org.apache.solr.update.processor.DistributedUpdateProcessor.processAdd(DistributedUpdateProcessor.java:342)
	at org.apache.solr.handler.extraction.ExtractingDocumentLoader.doAdd(ExtractingDocumentLoader.java:121)
	at org.apache.solr.handler.extraction.ExtractingDocumentLoader.addDoc(ExtractingDocumentLoader.java:126)
	at org.apache.solr.handler.extraction.ExtractingDocumentLoader.load(ExtractingDocumentLoader.java:233)
	at org.apache.solr.handler.ContentStreamHandlerBase.handleRequestBody(ContentStreamHandlerBase.java:74)
	at org.apache.solr.handler.RequestHandlerBase.handleRequest(RequestHandlerBase.java:129)
	at org.apache.solr.core.SolrCore.execute(SolrCore.java:1692)
	at org.apache.solr.util.TestHarness.queryAndResponse(TestHarness.java:375)
	at org.apache.solr.handler.extraction.ExtractingRequestHandlerTest.loadLocal(ExtractingRequestHandlerTest.java:602)
	at org.apache.solr.handler.extraction.ExtractingRequestHandlerTest.testExtraction(ExtractingRequestHandlerTest.java:62)
	at sun.reflect.NativeMethodAccessorImpl.invoke0(Native Method)
	at sun.reflect.NativeMethodAccessorImpl.invoke(NativeMethodAccessorImpl.java:57)
	at sun.reflect.DelegatingMethodAccessorImpl.invoke(DelegatingMethodAccessorImpl.java:43)
	at java.lang.reflect.Method.invoke(Method.java:616)
	at com.carrotsearch.randomizedtesting.RandomizedRunner.invoke(RandomizedRunner.java:1559)
	at com.carrotsearch.randomizedtesting.RandomizedRunner.access$600(RandomizedRunner.java:79)
	at com.carrotsearch.randomizedtesting.RandomizedRunner$6.evaluate(RandomizedRunner.java:737)
	at com.carrotsearch.randomizedtesting.RandomizedRunner$7.evaluate(RandomizedRunner.java:773)
	at com.carrotsearch.randomizedtesting.RandomizedRunner$8.evaluate(RandomizedRunner.java:787)
	at com.carrotsearch.randomizedtesting.rules.SystemPropertiesRestoreRule$1.evaluate(SystemPropertiesRestoreRule.java:53)
	at org.apache.lucene.util.TestRuleSetupTeardownChained$1.evaluate(TestRuleSetupTeardownChained.java:50)
	at org.apache.lucene.util.TestRuleFieldCacheSanity$1.evaluate(TestRuleFieldCacheSanity.java:51)
	at org.apache.lucene.util.AbstractBeforeAfterRule$1.evaluate(AbstractBeforeAfterRule.java:45)
	at com.carrotsearch.randomizedtesting.rules.SystemPropertiesInvariantRule$1.evaluate(SystemPropertiesInvariantRule.java:55)
	at org.apache.lucene.util.TestRuleThreadAndTestName$1.evaluate(TestRuleThreadAndTestName.java:48)
	at org.apache.lucene.util.TestRuleIgnoreAfterMaxFailures$1.evaluate(TestRuleIgnoreAfterMaxFailures.java:70)
	at org.apache.lucene.util.TestRuleMarkFailure$1.evaluate(TestRuleMarkFailure.java:48)
	at com.carrotsearch.randomizedtesting.rules.StatementAdapter.evaluate(StatementAdapter.java:36)
	at com.carrotsearch.randomizedtesting.ThreadLeakControl$StatementRunner.run(ThreadLeakControl.java:345)
	at com.carrotsearch.randomizedtesting.ThreadLeakControl.forkTimeoutingTask(ThreadLeakControl.java:769)
	at com.carrotsearch.randomizedtesting.ThreadLeakControl$3.evaluate(ThreadLeakControl.java:429)
	at com.carrotsearch.randomizedtesting.RandomizedRunner.runSingleTest(RandomizedRunner.java:746)
	at com.carrotsearch.randomizedtesting.RandomizedRunner$3.evaluate(RandomizedRunner.java:648)
	at com.carrotsearch.randomizedtesting.RandomizedRunner$4.evaluate(RandomizedRunner.java:682)
	at com.carrotsearch.randomizedtesting.RandomizedRunner$5.evaluate(RandomizedRunner.java:693)
	at com.carrotsearch.randomizedtesting.rules.StatementAdapter.evaluate(StatementAdapter.java:36)
	at com.carrotsearch.randomizedtesting.rules.SystemPropertiesRestoreRule$1.evaluate(SystemPropertiesRestoreRule.java:53)
	at org.apache.lucene.util.AbstractBeforeAfterRule$1.evaluate(AbstractBeforeAfterRule.java:45)
	at org.apache.lucene.util.TestRuleStoreClassName$1.evaluate(TestRuleStoreClassName.java:42)
	at com.carrotsearch.randomizedtesting.rules.SystemPropertiesInvariantRule$1.evaluate(SystemPropertiesInvariantRule.java:55)
	at com.carrotsearch.randomizedtesting.rules.NoShadowingOrOverridesOnMethodsRule$1.evaluate(NoShadowingOrOverridesOnMethodsRule.java:39)
	at com.carrotsearch.randomizedtesting.rules.NoShadowingOrOverridesOnMethodsRule$1.evaluate(NoShadowingOrOverridesOnMethodsRule.java:39)
	at org.apache.lucene.util.TestRuleAssertionsRequired$1.evaluate(TestRuleAssertionsRequired.java:40)
	at org.apache.lucene.util.TestRuleMarkFailure$1.evaluate(TestRuleMarkFailure.java:48)
	at org.apache.lucene.util.TestRuleIgnoreAfterMaxFailures$1.evaluate(TestRuleIgnoreAfterMaxFailures.java:70)
	at org.apache.lucene.util.TestRuleIgnoreTestSuites$1.evaluate(TestRuleIgnoreTestSuites.java:55)
	at com.carrotsearch.randomizedtesting.rules.StatementAdapter.evaluate(StatementAdapter.java:36)
	at com.carrotsearch.randomizedtesting.ThreadLeakControl$StatementRunner.run(ThreadLeakControl.java:345)
	at java.lang.Thread.run(Thread.java:679)


FAILED:  org.apache.solr.handler.extraction.ExtractingRequestHandlerTest.testLiteralsOverride

Error Message:
ERROR: [doc=three] unknown field 'meta:save-date'

Stack Trace:
org.apache.solr.common.SolrException: ERROR: [doc=three] unknown field 'meta:save-date'
	at __randomizedtesting.SeedInfo.seed([564B8C2811E551FC:6E20CDC6C3AA3D3D]:0)
	at org.apache.solr.update.DocumentBuilder.toDocument(DocumentBuilder.java:306)
	at org.apache.solr.update.AddUpdateCommand.getLuceneDocument(AddUpdateCommand.java:73)
	at org.apache.solr.update.DirectUpdateHandler2.addDoc(DirectUpdateHandler2.java:208)
	at org.apache.solr.update.processor.RunUpdateProcessor.processAdd(RunUpdateProcessorFactory.java:61)
	at org.apache.solr.update.processor.UpdateRequestProcessor.processAdd(UpdateRequestProcessor.java:51)
	at org.apache.solr.update.processor.DistributedUpdateProcessor.versionAdd(DistributedUpdateProcessor.java:463)
	at org.apache.solr.update.processor.DistributedUpdateProcessor.processAdd(DistributedUpdateProcessor.java:342)
	at org.apache.solr.handler.extraction.ExtractingDocumentLoader.doAdd(ExtractingDocumentLoader.java:121)
	at org.apache.solr.handler.extraction.ExtractingDocumentLoader.addDoc(ExtractingDocumentLoader.java:126)
	at org.apache.solr.handler.extraction.ExtractingDocumentLoader.load(ExtractingDocumentLoader.java:233)
	at org.apache.solr.handler.ContentStreamHandlerBase.handleRequestBody(ContentStreamHandlerBase.java:74)
	at org.apache.solr.handler.RequestHandlerBase.handleRequest(RequestHandlerBase.java:129)
	at org.apache.solr.core.SolrCore.execute(SolrCore.java:1692)
	at org.apache.solr.util.TestHarness.queryAndResponse(TestHarness.java:375)
	at org.apache.solr.handler.extraction.ExtractingRequestHandlerTest.loadLocal(ExtractingRequestHandlerTest.java:602)
	at org.apache.solr.handler.extraction.ExtractingRequestHandlerTest.testLiteralsOverride(ExtractingRequestHandlerTest.java:469)
	at sun.reflect.NativeMethodAccessorImpl.invoke0(Native Method)
	at sun.reflect.NativeMethodAccessorImpl.invoke(NativeMethodAccessorImpl.java:57)
	at sun.reflect.DelegatingMethodAccessorImpl.invoke(DelegatingMethodAccessorImpl.java:43)
	at java.lang.reflect.Method.invoke(Method.java:616)
	at com.carrotsearch.randomizedtesting.RandomizedRunner.invoke(RandomizedRunner.java:1559)
	at com.carrotsearch.randomizedtesting.RandomizedRunner.access$600(RandomizedRunner.java:79)
	at com.carrotsearch.randomizedtesting.RandomizedRunner$6.evaluate(RandomizedRunner.java:737)
	at com.carrotsearch.randomizedtesting.RandomizedRunner$7.evaluate(RandomizedRunner.java:773)
	at com.carrotsearch.randomizedtesting.RandomizedRunner$8.evaluate(RandomizedRunner.java:787)
	at com.carrotsearch.randomizedtesting.rules.SystemPropertiesRestoreRule$1.evaluate(SystemPropertiesRestoreRule.java:53)
	at org.apache.lucene.util.TestRuleSetupTeardownChained$1.evaluate(TestRuleSetupTeardownChained.java:50)
	at org.apache.lucene.util.TestRuleFieldCacheSanity$1.evaluate(TestRuleFieldCacheSanity.java:51)
	at org.apache.lucene.util.AbstractBeforeAfterRule$1.evaluate(AbstractBeforeAfterRule.java:45)
	at com.carrotsearch.randomizedtesting.rules.SystemPropertiesInvariantRule$1.evaluate(SystemPropertiesInvariantRule.java:55)
	at org.apache.lucene.util.TestRuleThreadAndTestName$1.evaluate(TestRuleThreadAndTestName.java:48)
	at org.apache.lucene.util.TestRuleIgnoreAfterMaxFailures$1.evaluate(TestRuleIgnoreAfterMaxFailures.java:70)
	at org.apache.lucene.util.TestRuleMarkFailure$1.evaluate(TestRuleMarkFailure.java:48)
	at com.carrotsearch.randomizedtesting.rules.StatementAdapter.evaluate(StatementAdapter.java:36)
	at com.carrotsearch.randomizedtesting.ThreadLeakControl$StatementRunner.run(ThreadLeakControl.java:345)
	at com.carrotsearch.randomizedtesting.ThreadLeakControl.forkTimeoutingTask(ThreadLeakControl.java:769)
	at com.carrotsearch.randomizedtesting.ThreadLeakControl$3.evaluate(ThreadLeakControl.java:429)
	at com.carrotsearch.randomizedtesting.RandomizedRunner.runSingleTest(RandomizedRunner.java:746)
	at com.carrotsearch.randomizedtesting.RandomizedRunner$3.evaluate(RandomizedRunner.java:648)
	at com.carrotsearch.randomizedtesting.RandomizedRunner$4.evaluate(RandomizedRunner.java:682)
	at com.carrotsearch.randomizedtesting.RandomizedRunner$5.evaluate(RandomizedRunner.java:693)
	at com.carrotsearch.randomizedtesting.rules.StatementAdapter.evaluate(StatementAdapter.java:36)
	at com.carrotsearch.randomizedtesting.rules.SystemPropertiesRestoreRule$1.evaluate(SystemPropertiesRestoreRule.java:53)
	at org.apache.lucene.util.AbstractBeforeAfterRule$1.evaluate(AbstractBeforeAfterRule.java:45)
	at org.apache.lucene.util.TestRuleStoreClassName$1.evaluate(TestRuleStoreClassName.java:42)
	at com.carrotsearch.randomizedtesting.rules.SystemPropertiesInvariantRule$1.evaluate(SystemPropertiesInvariantRule.java:55)
	at com.carrotsearch.randomizedtesting.rules.NoShadowingOrOverridesOnMethodsRule$1.evaluate(NoShadowingOrOverridesOnMethodsRule.java:39)
	at com.carrotsearch.randomizedtesting.rules.NoShadowingOrOverridesOnMethodsRule$1.evaluate(NoShadowingOrOverridesOnMethodsRule.java:39)
	at org.apache.lucene.util.TestRuleAssertionsRequired$1.evaluate(TestRuleAssertionsRequired.java:40)
	at org.apache.lucene.util.TestRuleMarkFailure$1.evaluate(TestRuleMarkFailure.java:48)
	at org.apache.lucene.util.TestRuleIgnoreAfterMaxFailures$1.evaluate(TestRuleIgnoreAfterMaxFailures.java:70)
	at org.apache.lucene.util.TestRuleIgnoreTestSuites$1.evaluate(TestRuleIgnoreTestSuites.java:55)
	at com.carrotsearch.randomizedtesting.rules.StatementAdapter.evaluate(StatementAdapter.java:36)
	at com.carrotsearch.randomizedtesting.ThreadLeakControl$StatementRunner.run(ThreadLeakControl.java:345)
	at java.lang.Thread.run(Thread.java:679)




Build Log:
[...truncated 3881 lines...]
278 T3 oasc.SolrCore.finalize SEVERE REFCOUNT ERROR: unreferenced org.apache.solr.core.SolrCore@26bf4e60 (col_bad) has a reference count of 1
Tests run: 1, Failures: 0, Errors: 0, Skipped: 0, Time elapsed: 0.294 sec
Running org.apache.solr.spelling.SpellingQueryConverterTest
Tests run: 5, Failures: 0, Errors: 0, Skipped: 0, Time elapsed: 0.028 sec
Running org.apache.solr.client.solrj.embedded.LargeVolumeBinaryJettyTest
Creating dataDir: /usr/home/hudson/hudson-slave/workspace/Lucene-Solr-Maven-4.x/maven-build/solr/core/target/test/./solrtest-LargeVolumeBinaryJettyTest-1346505151869
Tests run: 1, Failures: 0, Errors: 0, Skipped: 0, Time elapsed: 0.656 sec
Running org.apache.solr.util.DateMathParserTest
Tests run: 8, Failures: 0, Errors: 0, Skipped: 0, Time elapsed: 0.07 sec
Running org.apache.solr.search.TestFiltering
Creating dataDir: /usr/home/hudson/hudson-slave/workspace/Lucene-Solr-Maven-4.x/maven-build/solr/core/target/test/./solrtest-TestFiltering-1346505152597
Tests run: 2, Failures: 0, Errors: 0, Skipped: 0, Time elapsed: 1.769 sec
Running org.apache.solr.update.PeerSyncTest
Tests run: 1, Failures: 0, Errors: 0, Skipped: 0, Time elapsed: 2.742 sec
Running org.apache.solr.common.util.TestXMLEscaping
Tests run: 7, Failures: 0, Errors: 0, Skipped: 0, Time elapsed: 0.026 sec
Running org.apache.solr.search.TestIndexSearcher
Creating dataDir: /usr/home/hudson/hudson-slave/workspace/Lucene-Solr-Maven-4.x/maven-build/solr/core/target/test/./solrtest-TestIndexSearcher-1346505157135
Tests run: 2, Failures: 0, Errors: 0, Skipped: 0, Time elapsed: 0.826 sec
Running org.apache.solr.update.processor.FieldMutatingUpdateProcessorTest
Creating dataDir: /usr/home/hudson/hudson-slave/workspace/Lucene-Solr-Maven-4.x/maven-build/solr/core/target/test/./solrtest-FieldMutatingUpdateProcessorTest-1346505157963
Tests run: 26, Failures: 0, Errors: 0, Skipped: 0, Time elapsed: 0.367 sec
Running org.apache.solr.client.solrj.response.AnlysisResponseBaseTest
Tests run: 2, Failures: 0, Errors: 0, Skipped: 0, Time elapsed: 0.02 sec
Running org.apache.solr.client.solrj.SolrExceptionTest
Tests run: 1, Failures: 0, Errors: 0, Skipped: 0, Time elapsed: 0.02 sec
Running org.apache.solr.client.solrj.embedded.MultiCoreExampleJettyTest
Tests run: 2, Failures: 0, Errors: 0, Skipped: 0, Time elapsed: 1.121 sec
Running org.apache.solr.handler.XsltUpdateRequestHandlerTest
Creating dataDir: /usr/home/hudson/hudson-slave/workspace/Lucene-Solr-Maven-4.x/maven-build/solr/core/target/test/./solrtest-XsltUpdateRequestHandlerTest-1346505159503
Tests run: 1, Failures: 0, Errors: 0, Skipped: 0, Time elapsed: 0.612 sec
Running org.apache.solr.core.IndexReaderFactoryTest
Tests run: 1, Failures: 0, Errors: 0, Skipped: 0, Time elapsed: 0.482 sec
Running org.apache.solr.ConvertedLegacyTest
Creating dataDir: /usr/home/hudson/hudson-slave/workspace/Lucene-Solr-Maven-4.x/maven-build/solr/core/target/test/./solrtest-ConvertedLegacyTest-1346505160595
Tests run: 1, Failures: 0, Errors: 0, Skipped: 0, Time elapsed: 2.243 sec
Running org.apache.solr.analysis.TestWordDelimiterFilterFactory
Creating dataDir: /usr/home/hudson/hudson-slave/workspace/Lucene-Solr-Maven-4.x/maven-build/solr/core/target/test/./solrtest-TestWordDelimiterFilterFactory-1346505162834
Tests run: 7, Failures: 0, Errors: 0, Skipped: 0, Time elapsed: 0.557 sec
Running org.apache.solr.schema.PrimitiveFieldTypeTest
Tests run: 1, Failures: 0, Errors: 0, Skipped: 0, Time elapsed: 0.438 sec
Running org.apache.solr.search.similarities.TestLMDirichletSimilarityFactory
Creating dataDir: /usr/home/hudson/hudson-slave/workspace/Lucene-Solr-Maven-4.x/maven-build/solr/core/target/test/./solrtest-TestLMDirichletSimilarityFactory-1346505163828
Tests run: 2, Failures: 0, Errors: 0, Skipped: 0, Time elapsed: 0.081 sec
Running org.apache.solr.response.TestCSVResponseWriter
Creating dataDir: /usr/home/hudson/hudson-slave/workspace/Lucene-Solr-Maven-4.x/maven-build/solr/core/target/test/./solrtest-TestCSVResponseWriter-1346505163909
Tests run: 1, Failures: 0, Errors: 0, Skipped: 0, Time elapsed: 0.344 sec
Running org.apache.solr.client.solrj.response.QueryResponseTest
Tests run: 3, Failures: 0, Errors: 0, Skipped: 0, Time elapsed: 0.046 sec
Running org.apache.solr.schema.TestCollationField
Creating dataDir: /usr/home/hudson/hudson-slave/workspace/Lucene-Solr-Maven-4.x/maven-build/solr/core/target/test/./solrtest-TestCollationField-1346505164332
Tests run: 8, Failures: 0, Errors: 0, Skipped: 0, Time elapsed: 0.308 sec
Running org.apache.solr.handler.TestReplicationHandler
replicate slave to master
25332 T854 oasc.SolrException.log SEVERE SnapPull failed :org.apache.solr.common.SolrException: Unable to download _8.tis completely. Downloaded 0!=73
		at org.apache.solr.handler.SnapPuller$FileFetcher.cleanup(SnapPuller.java:1117)
		at org.apache.solr.handler.SnapPuller$FileFetcher.fetchFile(SnapPuller.java:1001)
		at org.apache.solr.handler.SnapPuller.downloadIndexFiles(SnapPuller.java:629)
		at org.apache.solr.handler.SnapPuller.fetchLatestIndex(SnapPuller.java:333)
		at org.apache.solr.handler.ReplicationHandler.doFetch(ReplicationHandler.java:297)
		at org.apache.solr.handler.ReplicationHandler$1.run(ReplicationHandler.java:178)
	
32392 T932 oash.SnapPuller.fetchLatestIndex SEVERE Master at: http://localhost:18117/solr is not available. Index fetch failed. Exception: org.apache.solr.client.solrj.SolrServerException: IOException occured when talking to server at: http://localhost:18117/solr
Tests run: 1, Failures: 0, Errors: 0, Skipped: 0, Time elapsed: 32.538 sec
Running org.apache.solr.client.solrj.embedded.SolrExampleEmbeddedTest
Creating dataDir: /usr/home/hudson/hudson-slave/workspace/Lucene-Solr-Maven-4.x/maven-build/solr/core/target/test/./solrtest-SolrExampleEmbeddedTest-1346505197155
Tests run: 22, Failures: 0, Errors: 0, Skipped: 0, Time elapsed: 3.907 sec
Running org.apache.solr.internal.csv.writer.CSVConfigTest
Tests run: 7, Failures: 0, Errors: 0, Skipped: 0, Time elapsed: 0.002 sec
Running org.apache.solr.schema.TestOmitPositions
Creating dataDir: /usr/home/hudson/hudson-slave/workspace/Lucene-Solr-Maven-4.x/maven-build/solr/core/target/test/./solrtest-TestOmitPositions-1346505201064
Tests run: 2, Failures: 0, Errors: 0, Skipped: 0, Time elapsed: 0.515 sec
Running org.apache.solr.core.ResourceLoaderTest
Tests run: 4, Failures: 0, Errors: 0, Skipped: 0, Time elapsed: 0.055 sec
Running org.apache.solr.update.SolrCmdDistributorTest
{responseHeader={status=0,QTime=29},index={numDocs=160,maxDoc=160,version=69,segmentCount=12,current=false,hasDeletions=false,directory=org.apache.lucene.store.MockDirectoryWrapper:MockDirWrapper(org.apache.lucene.store.RAMDirectory@35dd051f lockFactory=org.apache.lucene.store.NativeFSLockFactory@73a9f25),userData={commitTimeMSec=1346505204061},lastModified=Sat Sep 01 08:13:24 CDT 2012},fields={_version_={type=long,schema=ITS----O------,index=-TS-----------,docs=-1},id={type=int,schema=ITS----O------,index=-TS-----------,docs=-1},intDefault={type=int,schema=ITS----O------,index=-TS-----------,docs=-1},multiDefault={type=string,schema=I-SM---------l,index=ITS-----------,docs=-1},range_facet_l={type=long,schema=ITSM---O------,dynamicBase=*_l,index=-TS-----------,docs=-1},range_facet_si={type=sint,schema=I-S----------l,dynamicBase=*_si,index=ITS-----------,docs=-1},range_facet_sl={type=slong,schema=I-SM---------l,dynamicBase=*_sl,index=ITS-----------,docs=-1},timestamp={type=date,schema=ITS-----------,index=-TS-----------,docs=-1}},info={key={I=Indexed,T=Tokenized,S=Stored,M=Multivalued,V=TermVector Stored,o=Store Offset With TermVector,p=Store Position With TermVector,O=Omit Norms,F=Omit Term Frequencies & Positions,P=Omit Positions,L=Lazy,B=Binary,f=Sort Missing First,l=Sort Missing Last},NOTE=Document Frequency (df) is not updated when a document is marked for deletion.  df values include deleted documents.}}
{responseHeader={status=0,QTime=25},index={numDocs=150,maxDoc=150,version=55,segmentCount=7,current=true,hasDeletions=false,directory=org.apache.lucene.store.MockDirectoryWrapper:MockDirWrapper(org.apache.lucene.store.RAMDirectory@4e1bd77f lockFactory=org.apache.lucene.store.NativeFSLockFactory@7578da02),userData={commitTimeMSec=1346505204054},lastModified=Sat Sep 01 08:13:24 CDT 2012},fields={_version_={type=long,schema=ITS----O------,index=-TS-----------,docs=-1},id={type=int,schema=ITS----O------,index=-TS-----------,docs=-1},intDefault={type=int,schema=ITS----O------,index=-TS-----------,docs=-1},multiDefault={type=string,schema=I-SM---------l,index=ITS-----------,docs=-1},range_facet_l={type=long,schema=ITSM---O------,dynamicBase=*_l,index=-TS-----------,docs=-1},range_facet_si={type=sint,schema=I-S----------l,dynamicBase=*_si,index=ITS-----------,docs=-1},range_facet_sl={type=slong,schema=I-SM---------l,dynamicBase=*_sl,index=ITS-----------,docs=-1},timestamp={type=date,schema=ITS-----------,index=-TS-----------,docs=-1}},info={key={I=Indexed,T=Tokenized,S=Stored,M=Multivalued,V=TermVector Stored,o=Store Offset With TermVector,p=Store Position With TermVector,O=Omit Norms,F=Omit Term Frequencies & Positions,P=Omit Positions,L=Lazy,B=Binary,f=Sort Missing First,l=Sort Missing Last},NOTE=Document Frequency (df) is not updated when a document is marked for deletion.  df values include deleted documents.}}
{responseHeader={status=0,QTime=38},index={numDocs=139,maxDoc=139,version=54,segmentCount=16,current=false,hasDeletions=false,directory=org.apache.lucene.store.MockDirectoryWrapper:MockDirWrapper(org.apache.lucene.store.RAMDirectory@434cf27b lockFactory=org.apache.lucene.store.NativeFSLockFactory@360c65bd),userData={commitTimeMSec=1346505204068},lastModified=Sat Sep 01 08:13:24 CDT 2012},fields={_version_={type=long,schema=ITS----O------,index=-TS-----------,docs=-1},id={type=int,schema=ITS----O------,index=-TS-----------,docs=-1},intDefault={type=int,schema=ITS----O------,index=-TS-----------,docs=-1},multiDefault={type=string,schema=I-SM---------l,index=ITS-----------,docs=-1},range_facet_l={type=long,schema=ITSM---O------,dynamicBase=*_l,index=-TS-----------,docs=-1},range_facet_si={type=sint,schema=I-S----------l,dynamicBase=*_si,index=ITS-----------,docs=-1},range_facet_sl={type=slong,schema=I-SM---------l,dynamicBase=*_sl,index=ITS-----------,docs=-1},timestamp={type=date,schema=ITS-----------,index=-TS-----------,docs=-1}},info={key={I=Indexed,T=Tokenized,S=Stored,M=Multivalued,V=TermVector Stored,o=Store Offset With TermVector,p=Store Position With TermVector,O=Omit Norms,F=Omit Term Frequencies & Positions,P=Omit Positions,L=Lazy,B=Binary,f=Sort Missing First,l=Sort Missing Last},NOTE=Document Frequency (df) is not updated when a document is marked for deletion.  df values include deleted documents.}}
{responseHeader={status=0,QTime=42},index={numDocs=136,maxDoc=136,version=46,segmentCount=12,current=false,hasDeletions=false,directory=org.apache.lucene.store.MockDirectoryWrapper:MockDirWrapper(org.apache.lucene.store.RAMDirectory@15c41a24 lockFactory=org.apache.lucene.store.NativeFSLockFactory@87db50a),userData={commitTimeMSec=1346505204055},lastModified=Sat Sep 01 08:13:24 CDT 2012},fields={_version_={type=long,schema=ITS----O------,index=-TS-----------,docs=-1},id={type=int,schema=ITS----O------,index=-TS-----------,docs=-1},intDefault={type=int,schema=ITS----O------,index=-TS-----------,docs=-1},multiDefault={type=string,schema=I-SM---------l,index=ITS-----------,docs=-1},range_facet_l={type=long,schema=ITSM---O------,dynamicBase=*_l,index=-TS-----------,docs=-1},range_facet_si={type=sint,schema=I-S----------l,dynamicBase=*_si,index=ITS-----------,docs=-1},range_facet_sl={type=slong,schema=I-SM---------l,dynamicBase=*_sl,index=ITS-----------,docs=-1},timestamp={type=date,schema=ITS-----------,index=-TS-----------,docs=-1}},info={key={I=Indexed,T=Tokenized,S=Stored,M=Multivalued,V=TermVector Stored,o=Store Offset With TermVector,p=Store Position With TermVector,O=Omit Norms,F=Omit Term Frequencies & Positions,P=Omit Positions,L=Lazy,B=Binary,f=Sort Missing First,l=Sort Missing Last},NOTE=Document Frequency (df) is not updated when a document is marked for deletion.  df values include deleted documents.}}
Tests run: 1, Failures: 0, Errors: 0, Skipped: 0, Time elapsed: 3.077 sec
Running org.apache.solr.client.solrj.TestBatchUpdate
Creating dataDir: /usr/home/hudson/hudson-slave/workspace/Lucene-Solr-Maven-4.x/maven-build/solr/core/target/test/./solrtest-TestBatchUpdate-1346505204713
Tests run: 3, Failures: 0, Errors: 0, Skipped: 0, Time elapsed: 1.541 sec
Running org.apache.solr.update.TestIndexingPerformance
Tests run: 1, Failures: 0, Errors: 0, Skipped: 0, Time elapsed: 0.503 sec
Running org.apache.solr.search.TestSearchPerf
Tests run: 1, Failures: 0, Errors: 0, Skipped: 0, Time elapsed: 0.254 sec
Running org.apache.solr.search.TestRTGBase
Tests run: 0, Failures: 0, Errors: 0, Skipped: 0, Time elapsed: 0.004 sec
Running org.apache.solr.search.similarities.TestLMJelinekMercerSimilarityFactory
Creating dataDir: /usr/home/hudson/hudson-slave/workspace/Lucene-Solr-Maven-4.x/maven-build/solr/core/target/test/./solrtest-TestLMJelinekMercerSimilarityFactory-1346505207016
Tests run: 2, Failures: 0, Errors: 0, Skipped: 0, Time elapsed: 0.085 sec
Running org.apache.solr.BasicFunctionalityTest
Creating dataDir: /usr/home/hudson/hudson-slave/workspace/Lucene-Solr-Maven-4.x/maven-build/solr/core/target/test/./solrtest-BasicFunctionalityTest-1346505207111
Tests run: 23, Failures: 0, Errors: 0, Skipped: 1, Time elapsed: 1.424 sec
Running org.apache.solr.analysis.PathHierarchyTokenizerFactoryTest
Creating dataDir: /usr/home/hudson/hudson-slave/workspace/Lucene-Solr-Maven-4.x/maven-build/solr/core/target/test/./solrtest-PathHierarchyTokenizerFactoryTest-1346505208541
Tests run: 2, Failures: 0, Errors: 0, Skipped: 0, Time elapsed: 0.579 sec
Running org.apache.solr.core.TestSolrDeletionPolicy1
Creating dataDir: /usr/home/hudson/hudson-slave/workspace/Lucene-Solr-Maven-4.x/maven-build/solr/core/target/test/./solrtest-TestSolrDeletionPolicy1-1346505209109
Tests run: 3, Failures: 0, Errors: 0, Skipped: 0, Time elapsed: 0.766 sec
Running org.apache.solr.search.function.TestFunctionQuery
Creating dataDir: /usr/home/hudson/hudson-slave/workspace/Lucene-Solr-Maven-4.x/maven-build/solr/core/target/test/./solrtest-TestFunctionQuery-1346505209878
ASYNC  NEW_CORE C2 name=collection1 org.apache.solr.core.SolrCore@4445b7e3
1615 T1085 C2 oassf.FileFloatSource.getFloats SEVERE Error loading external value source + fileName + java.lang.NumberFormatException: For input string: ""
Tests run: 14, Failures: 0, Errors: 0, Skipped: 1, Time elapsed: 1.678 sec
Running org.apache.solr.core.SolrCoreTest
Creating dataDir: /usr/home/hudson/hudson-slave/workspace/Lucene-Solr-Maven-4.x/maven-build/solr/core/target/test/./solrtest-SolrCoreTest-1346505211553
Creating dataDir: /usr/home/hudson/hudson-slave/workspace/Lucene-Solr-Maven-4.x/maven-build/solr/core/target/test/./solrtest-SolrCoreTest-1346505211884
Creating dataDir: /usr/home/hudson/hudson-slave/workspace/Lucene-Solr-Maven-4.x/maven-build/solr/core/target/test/./solrtest-SolrCoreTest-1346505212211
Creating dataDir: /usr/home/hudson/hudson-slave/workspace/Lucene-Solr-Maven-4.x/maven-build/solr/core/target/test/./solrtest-SolrCoreTest-1346505212518
Creating dataDir: /usr/home/hudson/hudson-slave/workspace/Lucene-Solr-Maven-4.x/maven-build/solr/core/target/test/./solrtest-SolrCoreTest-1346505212821
Creating dataDir: /usr/home/hudson/hudson-slave/workspace/Lucene-Solr-Maven-4.x/maven-build/solr/core/target/test/./solrtest-SolrCoreTest-1346505213208
Tests run: 6, Failures: 0, Errors: 0, Skipped: 0, Time elapsed: 3.143 sec
Running org.apache.solr.cloud.SyncSliceTest
Creating dataDir: /usr/home/hudson/hudson-slave/workspace/Lucene-Solr-Maven-4.x/maven-build/solr/core/target/test/./solrtest-SyncSliceTest-1346505214713
check const of shard1
client0
PROPS:shard=shard1
leader=true
roles=null
state=active
core=collection1
collection=collection1
node_name=127.0.0.1:18396_solr
base_url=http://127.0.0.1:18396/solr

 live:true
 num:4

client1
PROPS:shard=shard1
roles=null
state=active
core=collection1
collection=collection1
node_name=127.0.0.1:18415_solr
base_url=http://127.0.0.1:18415/solr

 live:true
 num:2

######shard1 is not consistent.  Got 4 from http://127.0.0.1:18396/solr/collection1lastClient and got 2 from http://127.0.0.1:18415/solr/collection1
######http://127.0.0.1:18396/solr/collection1: {numFound=4,start=0,docs=[SolrDocument{id=0, _version_=1411913071649095680}, SolrDocument{id=1, _version_=1411913071660630016}, SolrDocument{id=2, _version_=1411913071671115776}, SolrDocument{id=3, _version_=1411913071681601536}]}
######http://127.0.0.1:18415/solr/collection1: {numFound=2,start=0,docs=[SolrDocument{id=0, _version_=1411913071649095680}, SolrDocument{id=1, _version_=1411913071660630016}]}
###### sizes=4,2
###### Only in http://127.0.0.1:18396/solr/collection1: [{id=3, _version_=1411913071681601536}, {id=2, _version_=1411913071671115776}]
client2
PROPS:shard=shard1
roles=null
state=active
core=collection1
collection=collection1
node_name=127.0.0.1:18426_solr
base_url=http://127.0.0.1:18426/solr

 live:true
 num:3

client3
PROPS:shard=shard1
roles=null
state=active
core=collection1
collection=collection1
node_name=127.0.0.1:18437_solr
base_url=http://127.0.0.1:18437/solr

 live:true
 num:4

Control Docs:4
check const of shard1
client0
PROPS:shard=shard1
leader=true
roles=null
state=active
core=collection1
collection=collection1
node_name=127.0.0.1:18396_solr
base_url=http://127.0.0.1:18396/solr

 live:true
 num:4

client1
PROPS:shard=shard1
roles=null
state=active
core=collection1
collection=collection1
node_name=127.0.0.1:18415_solr
base_url=http://127.0.0.1:18415/solr

 live:true
 num:4

client2
PROPS:shard=shard1
roles=null
state=active
core=collection1
collection=collection1
node_name=127.0.0.1:18426_solr
base_url=http://127.0.0.1:18426/solr

 live:true
 num:4

client3
PROPS:shard=shard1
roles=null
state=active
core=collection1
collection=collection1
node_name=127.0.0.1:18437_solr
base_url=http://127.0.0.1:18437/solr

 live:true
 num:4

Control Docs:5
check const of shard1
client0
PROPS:shard=shard1
roles=null
state=active
core=collection1
collection=collection1
node_name=127.0.0.1:18396_solr
base_url=http://127.0.0.1:18396/solr

error contacting client: IOException occured when talking to server at: http://localhost:18396/solr/collection1

client1
PROPS:shard=shard1
roles=null
leader=true
state=active
core=collection1
collection=collection1
node_name=127.0.0.1:18415_solr
base_url=http://127.0.0.1:18415/solr

 live:true
 num:5

client2
PROPS:shard=shard1
roles=null
state=active
core=collection1
collection=collection1
node_name=127.0.0.1:18426_solr
base_url=http://127.0.0.1:18426/solr

 live:true
 num:5

client3
PROPS:shard=shard1
roles=null
state=active
core=collection1
collection=collection1
node_name=127.0.0.1:18437_solr
base_url=http://127.0.0.1:18437/solr

 live:true
 num:5

check const of shard1
client0
PROPS:shard=shard1
roles=null
state=active
core=collection1
collection=collection1
node_name=127.0.0.1:18396_solr
base_url=http://127.0.0.1:18396/solr

 live:true
 num:305

client1
PROPS:shard=shard1
leader=true
roles=null
state=active
core=collection1
collection=collection1
node_name=127.0.0.1:18415_solr
base_url=http://127.0.0.1:18415/solr

 live:true
 num:305

client2
PROPS:shard=shard1
roles=null
state=active
core=collection1
collection=collection1
node_name=127.0.0.1:18426_solr
base_url=http://127.0.0.1:18426/solr

 live:true
 num:5

######shard1 is not consistent.  Got 305 from http://127.0.0.1:18415/solr/collection1lastClient and got 5 from http://127.0.0.1:18426/solr/collection1
######http://127.0.0.1:18415/solr/collection1: {numFound=305,start=0,docs=[SolrDocument{id=0, _version_=1411913071649095680}, SolrDocument{id=1, _version_=1411913071660630016}, SolrDocument{id=2, _version_=1411913071671115776}, SolrDocument{id=3, _version_=1411913071681601536}, SolrDocument{id=4, _version_=1411913074606080000}, SolrDocument{id=5, _version_=1411913090357788672}, SolrDocument{id=6, _version_=1411913090370371584}, SolrDocument{id=7, _version_=1411913090379808768}, SolrDocument{id=8, _version_=1411913090389245952}, SolrDocument{id=9, _version_=1411913090398683136}, SolrDocument{id=10, _version_=1411913090408120320}, SolrDocument{id=11, _version_=1411913090417557504}, SolrDocument{id=12, _version_=1411913090426994688}, SolrDocument{id=13, _version_=1411913090436431872}, SolrDocument{id=14, _version_=1411913090449014784}, SolrDocument{id=15, _version_=1411913090465792000}, SolrDocument{id=16, _version_=1411913090476277760}, SolrDocument{id=17, _version_=1411913090485714944}, SolrDocument{id=18, _version_=1411913090496200704}, SolrDocument{id=19, _version_=1411913090505637888}, SolrDocument{id=20, _version_=1411913090515075072}, SolrDocument{id=21, _version_=1411913090524512256}, SolrDocument{id=22, _version_=1411913090533949440}, SolrDocument{id=23, _version_=1411913090543386624}, SolrDocument{id=24, _version_=1411913090554920960}, SolrDocument{id=25, _version_=1411913090569601024}, SolrDocument{id=26, _version_=1411913090580086784}, SolrDocument{id=27, _version_=1411913090589523968}, SolrDocument{id=28, _version_=1411913090598961152}, SolrDocument{id=29, _version_=1411913090608398336}, SolrDocument{id=30, _version_=1411913090617835520}, SolrDocument{id=31, _version_=1411913090627272704}, SolrDocument{id=32, _version_=1411913090636709888}, SolrDocument{id=33, _version_=1411913090646147072}, SolrDocument{id=34, _version_=1411913090662924288}, SolrDocument{id=35, _version_=1411913090678652928}, SolrDocument{id=36, _version_=1411913090689138688}, SolrDocument{id=37, _version_=1411913090699624448}, SolrDocument{id=38, _version_=1411913090709061632}, SolrDocument{id=39, _version_=1411913090719547392}, SolrDocument{id=40, _version_=1411913090728984576}, SolrDocument{id=41, _version_=1411913090738421760}, SolrDocument{id=42, _version_=1411913090748907520}, SolrDocument{id=43, _version_=1411913090758344704}, SolrDocument{id=44, _version_=1411913090769879040}, SolrDocument{id=45, _version_=1411913090783510528}, SolrDocument{id=46, _version_=1411913090793996288}, SolrDocument{id=47, _version_=1411913090804482048}, SolrDocument{id=48, _version_=1411913090814967808}, SolrDocument{id=49, _version_=1411913090824404992}, SolrDocument{id=50, _version_=1411913090834890752}, SolrDocument{id=51, _version_=1411913090845376512}, SolrDocument{id=52, _version_=1411913090854813696}, SolrDocument{id=53, _version_=1411913090864250880}, SolrDocument{id=54, _version_=1411913090875785216}, SolrDocument{id=55, _version_=1411913090916679680}, SolrDocument{id=56, _version_=1411913090927165440}, SolrDocument{id=57, _version_=1411913090938699776}, SolrDocument{id=58, _version_=1411913090949185536}, SolrDocument{id=59, _version_=1411913090959671296}, SolrDocument{id=60, _version_=1411913090970157056}, SolrDocument{id=61, _version_=1411913090979594240}, SolrDocument{id=62, _version_=1411913090989031424}, SolrDocument{id=63, _version_=1411913090998468608}, SolrDocument{id=64, _version_=1411913091018391552}, SolrDocument{id=65, _version_=1411913091047751680}, SolrDocument{id=66, _version_=1411913091059286016}, SolrDocument{id=67, _version_=1411913091079208960}, SolrDocument{id=68, _version_=1411913091089694720}, SolrDocument{id=69, _version_=1411913091099131904}, SolrDocument{id=70, _version_=1411913091109617664}, SolrDocument{id=71, _version_=1411913091120103424}, SolrDocument{id=72, _version_=1411913091129540608}, SolrDocument{id=73, _version_=1411913091140026368}, SolrDocument{id=74, _version_=1411913091152609280}, SolrDocument{id=75, _version_=1411913091167289344}, SolrDocument{id=76, _version_=1411913091177775104}, SolrDocument{id=77, _version_=1411913091188260864}, SolrDocument{id=78, _version_=1411913091199795200}, SolrDocument{id=79, _version_=1411913091210280960}, SolrDocument{id=80, _version_=1411913091219718144}, SolrDocument{id=81, _version_=1411913091230203904}, SolrDocument{id=82, _version_=1411913091242786816}, SolrDocument{id=83, _version_=1411913091254321152}, SolrDocument{id=84, _version_=1411913091265855488}, SolrDocument{id=85, _version_=1411913091280535552}, SolrDocument{id=86, _version_=1411913091291021312}, SolrDocument{id=87, _version_=1411913091300458496}, SolrDocument{id=88, _version_=1411913091309895680}, SolrDocument{id=89, _version_=1411913091319332864}, SolrDocument{id=90, _version_=1411913091328770048}, SolrDocument{id=91, _version_=1411913091339255808}, SolrDocument{id=92, _version_=1411913091349741568}, SolrDocument{id=93, _version_=1411913091360227328}, SolrDocument{id=94, _version_=1411913091372810240}, SolrDocument{id=95, _version_=1411913091386441728}, SolrDocument{id=96, _version_=1411913091396927488}, SolrDocument{id=97, _version_=1411913091406364672}, SolrDocument{id=98, _version_=1411913091415801856}, SolrDocument{id=99, _version_=1411913091425239040}, SolrDocument{id=100, _version_=1411913091434676224}, SolrDocument{id=101, _version_=1411913091444113408}, SolrDocument{id=102, _version_=1411913091453550592}, SolrDocument{id=103, _version_=1411913091462987776}, SolrDocument{id=104, _version_=1411913091474522112}, SolrDocument{id=105, _version_=1411913091488153600}, SolrDocument{id=106, _version_=1411913091498639360}, SolrDocument{id=107, _version_=1411913091508076544}, SolrDocument{id=108, _version_=1411913091517513728}, SolrDocument{id=109, _version_=1411913091526950912}, SolrDocument{id=110, _version_=1411913091536388096}, SolrDocument{id=111, _version_=1411913091546873856}, SolrDocument{id=112, _version_=1411913091556311040}, SolrDocument{id=113, _version_=1411913091565748224}, SolrDocument{id=114, _version_=1411913091577282560}, SolrDocument{id=115, _version_=1411913091589865472}, SolrDocument{id=116, _version_=1411913091599302656}, SolrDocument{id=117, _version_=1411913091608739840}, SolrDocument{id=118, _version_=1411913091618177024}, SolrDocument{id=119, _version_=1411913091627614208}, SolrDocument{id=120, _version_=1411913091637051392}, SolrDocument{id=121, _version_=1411913091646488576}, SolrDocument{id=122, _version_=1411913091655925760}, SolrDocument{id=123, _version_=1411913091665362944}, SolrDocument{id=124, _version_=1411913091676897280}, SolrDocument{id=125, _version_=1411913091698917376}, SolrDocument{id=126, _version_=1411913091709403136}, SolrDocument{id=127, _version_=1411913091718840320}, SolrDocument{id=128, _version_=1411913091728277504}, SolrDocument{id=129, _version_=1411913091747151872}, SolrDocument{id=130, _version_=1411913091756589056}, SolrDocument{id=131, _version_=1411913091766026240}, SolrDocument{id=132, _version_=1411913091775463424}, SolrDocument{id=133, _version_=1411913091784900608}, SolrDocument{id=134, _version_=1411913091805872128}, SolrDocument{id=135, _version_=1411913091832086528}, SolrDocument{id=136, _version_=1411913091842572288}, SolrDocument{id=137, _version_=1411913091852009472}, SolrDocument{id=138, _version_=1411913091861446656}, SolrDocument{id=139, _version_=1411913091870883840}, SolrDocument{id=140, _version_=1411913091880321024}, SolrDocument{id=141, _version_=1411913091889758208}, SolrDocument{id=142, _version_=1411913091899195392}, SolrDocument{id=143, _version_=1411913091908632576}, SolrDocument{id=144, _version_=1411913091920166912}, SolrDocument{id=145, _version_=1411913091932749824}, SolrDocument{id=146, _version_=1411913091943235584}, SolrDocument{id=147, _version_=1411913091952672768}, SolrDocument{id=148, _version_=1411913091962109952}, SolrDocument{id=149, _version_=1411913091971547136}, SolrDocument{id=150, _version_=1411913091980984320}, SolrDocument{id=151, _version_=1411913091990421504}, SolrDocument{id=152, _version_=1411913091999858688}, SolrDocument{id=153, _version_=1411913092009295872}, SolrDocument{id=154, _version_=1411913092020830208}, SolrDocument{id=155, _version_=1411913092033413120}, SolrDocument{id=156, _version_=1411913092042850304}, SolrDocument{id=157, _version_=1411913092053336064}, SolrDocument{id=158, _version_=1411913092063821824}, SolrDocument{id=159, _version_=1411913092073259008}, SolrDocument{id=160, _version_=1411913092082696192}, SolrDocument{id=161, _version_=1411913092092133376}, SolrDocument{id=162, _version_=1411913092101570560}, SolrDocument{id=163, _version_=1411913092109959168}, SolrDocument{id=164, _version_=1411913092120444928}, SolrDocument{id=165, _version_=1411913092133027840}, SolrDocument{id=166, _version_=1411913092142465024}, SolrDocument{id=167, _version_=1411913092151902208}, SolrDocument{id=168, _version_=1411913092161339392}, SolrDocument{id=169, _version_=1411913092170776576}, SolrDocument{id=170, _version_=1411913092181262336}, SolrDocument{id=171, _version_=1411913092190699520}, SolrDocument{id=172, _version_=1411913092200136704}, SolrDocument{id=173, _version_=1411913092210622464}, SolrDocument{id=174, _version_=1411913092222156800}, SolrDocument{id=175, _version_=1411913092234739712}, SolrDocument{id=176, _version_=1411913092245225472}, SolrDocument{id=177, _version_=1411913092254662656}, SolrDocument{id=178, _version_=1411913092264099840}, SolrDocument{id=179, _version_=1411913092273537024}, SolrDocument{id=180, _version_=1411913092282974208}, SolrDocument{id=181, _version_=1411913092292411392}, SolrDocument{id=182, _version_=1411913092301848576}, SolrDocument{id=183, _version_=1411913092311285760}, SolrDocument{id=184, _version_=1411913092322820096}, SolrDocument{id=185, _version_=1411913092335403008}, SolrDocument{id=186, _version_=1411913092345888768}, SolrDocument{id=187, _version_=1411913092355325952}, SolrDocument{id=188, _version_=1411913092364763136}, SolrDocument{id=189, _version_=1411913092374200320}, SolrDocument{id=190, _version_=1411913092383637504}, SolrDocument{id=191, _version_=1411913092393074688}, SolrDocument{id=192, _version_=1411913092402511872}, SolrDocument{id=193, _version_=1411913092412997632}, SolrDocument{id=194, _version_=1411913092424531968}, SolrDocument{id=195, _version_=1411913092454940672}, SolrDocument{id=196, _version_=1411913092465426432}, SolrDocument{id=197, _version_=1411913092474863616}, SolrDocument{id=198, _version_=1411913092484300800}, SolrDocument{id=199, _version_=1411913092493737984}, SolrDocument{id=200, _version_=1411913092503175168}, SolrDocument{id=201, _version_=1411913092512612352}, SolrDocument{id=202, _version_=1411913092522049536}, SolrDocument{id=203, _version_=1411913092531486720}, SolrDocument{id=204, _version_=1411913092555603968}, SolrDocument{id=205, _version_=1411913092586012672}, SolrDocument{id=206, _version_=1411913092596498432}, SolrDocument{id=207, _version_=1411913092605935616}, SolrDocument{id=208, _version_=1411913092615372800}, SolrDocument{id=209, _version_=1411913092624809984}, SolrDocument{id=210, _version_=1411913092634247168}, SolrDocument{id=211, _version_=1411913092643684352}, SolrDocument{id=212, _version_=1411913092653121536}, SolrDocument{id=213, _version_=1411913092662558720}, SolrDocument{id=214, _version_=1411913092673044480}, SolrDocument{id=215, _version_=1411913092685627392}, SolrDocument{id=216, _version_=1411913092695064576}, SolrDocument{id=217, _version_=1411913092704501760}, SolrDocument{id=218, _version_=1411913092713938944}, SolrDocument{id=219, _version_=1411913092723376128}, SolrDocument{id=220, _version_=1411913092732813312}, SolrDocument{id=221, _version_=1411913092742250496}, SolrDocument{id=222, _version_=1411913092751687680}, SolrDocument{id=223, _version_=1411913092761124864}, SolrDocument{id=224, _version_=1411913092772659200}, SolrDocument{id=225, _version_=1411913092785242112}, SolrDocument{id=226, _version_=1411913092795727872}, SolrDocument{id=227, _version_=1411913092805165056}, SolrDocument{id=228, _version_=1411913092814602240}, SolrDocument{id=229, _version_=1411913092824039424}, SolrDocument{id=230, _version_=1411913092833476608}, SolrDocument{id=231, _version_=1411913092842913792}, SolrDocument{id=232, _version_=1411913092852350976}, SolrDocument{id=233, _version_=1411913092861788160}, SolrDocument{id=234, _version_=1411913092872273920}, SolrDocument{id=235, _version_=1411913092884856832}, SolrDocument{id=236, _version_=1411913092894294016}, SolrDocument{id=237, _version_=1411913092903731200}, SolrDocument{id=238, _version_=1411913092913168384}, SolrDocument{id=239, _version_=1411913092922605568}, SolrDocument{id=240, _version_=1411913092932042752}, SolrDocument{id=241, _version_=1411913092941479936}, SolrDocument{id=242, _version_=1411913092950917120}, SolrDocument{id=243, _version_=1411913092960354304}, SolrDocument{id=244, _version_=1411913092971888640}, SolrDocument{id=245, _version_=1411913092984471552}, SolrDocument{id=246, _version_=1411913092993908736}, SolrDocument{id=247, _version_=1411913093003345920}, SolrDocument{id=248, _version_=1411913093012783104}, SolrDocument{id=249, _version_=1411913093022220288}, SolrDocument{id=250, _version_=1411913093031657472}, SolrDocument{id=251, _version_=1411913093041094656}, SolrDocument{id=252, _version_=1411913093050531840}, SolrDocument{id=253, _version_=1411913093059969024}, SolrDocument{id=254, _version_=1411913093070454784}, SolrDocument{id=255, _version_=1411913093083037696}, SolrDocument{id=256, _version_=1411913093092474880}, SolrDocument{id=257, _version_=1411913093101912064}, SolrDocument{id=258, _version_=1411913093111349248}, SolrDocument{id=259, _version_=1411913093120786432}, SolrDocument{id=260, _version_=1411913093130223616}, SolrDocument{id=261, _version_=1411913093139660800}, SolrDocument{id=262, _version_=1411913093149097984}, SolrDocument{id=263, _version_=1411913093158535168}, SolrDocument{id=264, _version_=1411913093169020928}, SolrDocument{id=265, _version_=1411913093196283904}, SolrDocument{id=266, _version_=1411913093205721088}, SolrDocument{id=267, _version_=1411913093215158272}, SolrDocument{id=268, _version_=1411913093224595456}, SolrDocument{id=269, _version_=1411913093234032640}, SolrDocument{id=270, _version_=1411913093243469824}, SolrDocument{id=271, _version_=1411913093252907008}, SolrDocument{id=272, _version_=1411913093262344192}, SolrDocument{id=273, _version_=1411913093271781376}, SolrDocument{id=274, _version_=1411913093296947200}, SolrDocument{id=275, _version_=1411913093325258752}, SolrDocument{id=276, _version_=1411913093335744512}, SolrDocument{id=277, _version_=1411913093345181696}, SolrDocument{id=278, _version_=1411913093354618880}, SolrDocument{id=279, _version_=1411913093364056064}, SolrDocument{id=280, _version_=1411913093373493248}, SolrDocument{id=281, _version_=1411913093382930432}, SolrDocument{id=282, _version_=1411913093392367616}, SolrDocument{id=283, _version_=1411913093401804800}, SolrDocument{id=284, _version_=1411913093412290560}, SolrDocument{id=285, _version_=1411913093424873472}, SolrDocument{id=286, _version_=1411913093434310656}, SolrDocument{id=287, _version_=1411913093443747840}, SolrDocument{id=288, _version_=1411913093453185024}, SolrDocument{id=289, _version_=1411913093462622208}, SolrDocument{id=290, _version_=1411913093472059392}, SolrDocument{id=291, _version_=1411913093481496576}, SolrDocument{id=292, _version_=1411913093490933760}, SolrDocument{id=293, _version_=1411913093500370944}, SolrDocument{id=294, _version_=1411913093510856704}, SolrDocument{id=295, _version_=1411913093523439616}, SolrDocument{id=296, _version_=1411913093532876800}, SolrDocument{id=297, _version_=1411913093542313984}, SolrDocument{id=298, _version_=1411913093551751168}, SolrDocument{id=299, _version_=1411913093561188352}, SolrDocument{id=300, _version_=1411913093570625536}, SolrDocument{id=301, _version_=1411913093580062720}, SolrDocument{id=302, _version_=1411913093589499904}, SolrDocument{id=303, _version_=1411913093598937088}, SolrDocument{id=304, _version_=1411913093609422848}]}
######http://127.0.0.1:18426/solr/collection1: {numFound=5,start=0,docs=[SolrDocument{id=0, _version_=1411913071649095680}, SolrDocument{id=1, _version_=1411913071660630016}, SolrDocument{id=2, _version_=1411913071671115776}, SolrDocument{id=3, _version_=1411913071681601536}, SolrDocument{id=4, _version_=1411913074606080000}]}
###### sizes=305,5
###### Only in http://127.0.0.1:18415/solr/collection1: [{id=228, _version_=1411913092814602240}, {id=186, _version_=1411913092345888768}, {id=151, _version_=1411913091990421504}, {id=292, _version_=1411913093490933760}, {id=303, _version_=1411913093598937088}, {id=199, _version_=1411913092493737984}, {id=248, _version_=1411913093012783104}, {id=46, _version_=1411913090793996288}, {id=155, _version_=1411913092033413120}, {id=134, _version_=1411913091805872128}, {id=117, _version_=1411913091608739840}, {id=106, _version_=1411913091498639360}, {id=214, _version_=1411913092673044480}, {id=286, _version_=1411913093434310656}, {id=287, _version_=1411913093443747840}, {id=277, _version_=1411913093345181696}, {id=102, _version_=1411913091453550592}, {id=258, _version_=1411913093111349248}, {id=30, _version_=1411913090617835520}, {id=72, _version_=1411913091129540608}, {id=57, _version_=1411913090938699776}, {id=160, _version_=1411913092082696192}, {id=110, _version_=1411913091536388096}, {id=200, _version_=1411913092503175168}, {id=173, _version_=1411913092210622464}, {id=219, _version_=1411913092723376128}, {id=65, _version_=1411913091047751680}, {id=79, _version_=1411913091210280960}, {id=288, _version_=1411913093453185024}, {id=211, _version_=1411913092643684352}, {id=233, _version_=1411913092861788160}, {id=253, _version_=1411913093059969024}, {id=119, _version_=1411913091627614208}, {id=169, _version_=1411913092170776576}, {id=262, _version_=1411913093149097984}, {id=223, _version_=1411913092761124864}, {id=71, _version_=1411913091120103424}, {id=145, _version_=1411913091932749824}, {id=112, _version_=1411913091556311040}, {id=142, _version_=1411913091899195392}, {id=77, _version_=1411913091188260864}, {id=176, _version_=1411913092245225472}, {id=205, _version_=1411913092586012672}, {id=284, _version_=1411913093412290560}, {id=189, _version_=1411913092374200320}, {id=127, _version_=1411913091718840320}, {id=50, _version_=1411913090834890752}, {id=6, _version_=1411913090370371584}, {id=174, _version_=1411913092222156800}, {id=229, _version_=1411913092824039424}, {id=239, _version_=1411913092922605568}, {id=28, _version_=1411913090598961152}, {id=114, _version_=1411913091577282560}, {id=11, _version_=1411913090417557504}, {id=136, _version_=1411913091842572288}, {id=130, _version_=1411913091756589056}, {id=41, _version_=1411913090738421760}, {id=216, _version_=1411913092695064576}, {id=281, _version_=1411913093382930432}, {id=164, _version_=1411913092120444928}, {id=20, _version_=1411913090515075072}, {id=89, _version_=1411913091319332864}, {id=266, _version_=1411913093205721088}, {id=295, _version_=1411913093523439616}, {id=171, _version_=1411913092190699520}, {id=67, _version_=1411913091079208960}, {id=245, _version_=1411913092984471552}, {id=273, _version_=1411913093271781376}, {id=299, _version_=1411913093561188352}, {id=180, _version_=1411913092282974208}, {id=53, _version_=1411913090864250880}, {id=60, _version_=1411913090970157056}, {id=218, _version_=1411913092713938944}, {id=166, _version_=1411913092142465024}, {id=38, _version_=1411913090709061632}, {id=56, _version_=1411913090927165440}, {id=36, _version_=1411913090689138688}, {id=140, _version_=1411913091880321024}, {id=124, _version_=1411913091676897280}, {id=208, _version_=1411913092615372800}, {id=21, _version_=1411913090524512256}, {id=70, _version_=1411913091109617664}, {id=43, _version_=1411913090758344704}, {id=86, _version_=1411913091291021312}, {id=278, _version_=1411913093354618880}, {id=193, _version_=1411913092412997632}, {id=263, _version_=1411913093158535168}, {id=190, _version_=1411913092383637504}, {id=24, _version_=1411913090554920960}, {id=115, _version_=1411913091589865472}, {id=63, _version_=1411913090998468608}, {id=300, _version_=1411913093570625536}, {id=172, _version_=1411913092200136704}, {id=132, _version_=1411913091775463424}, {id=212, _version_=1411913092653121536}, {id=54, _version_=1411913090875785216}, {id=66, _version_=1411913091059286016}, {id=42, _version_=1411913090748907520}, {id=128, _version_=1411913091728277504}, {id=90, _version_=1411913091328770048}, {id=107, _version_=1411913091508076544}, {id=259, _version_=1411913093120786432}, {id=104, _version_=1411913091474522112}, {id=275, _version_=1411913093325258752}, {id=249, _version_=1411913093022220288}, {id=139, _version_=1411913091870883840}, {id=116, _version_=1411913091599302656}, {id=125, _version_=1411913091698917376}, {id=179, _version_=1411913092273537024}, {id=9, _version_=1411913090398683136}, {id=84, _version_=1411913091265855488}, {id=235, _version_=1411913092884856832}, {id=272, _version_=1411913093262344192}, {id=83, _version_=1411913091254321152}, {id=64, _version_=1411913091018391552}, {id=15, _version_=1411913090465792000}, {id=220, _version_=1411913092732813312}, {id=183, _version_=1411913092311285760}, {id=22, _version_=1411913090533949440}, {id=167, _version_=1411913092151902208}, {id=37, _version_=1411913090699624448}, {id=282, _version_=1411913093392367616}, {id=68, _version_=1411913091089694720}, {id=122, _version_=1411913091655925760}, {id=99, _version_=1411913091425239040}, {id=230, _version_=1411913092833476608}, {id=148, _version_=1411913091962109952}, {id=113, _version_=1411913091565748224}, {id=207, _version_=1411913092605935616}, {id=94, _version_=1411913091372810240}, {id=44, _version_=1411913090769879040}, {id=238, _version_=1411913092913168384}, {id=291, _version_=1411913093481496576}, {id=269, _version_=1411913093234032640}, {id=131, _version_=1411913091766026240}, {id=196, _version_=1411913092465426432}, {id=184, _version_=1411913092322820096}, {id=298, _version_=1411913093551751168}, {id=157, _version_=1411913092053336064}, {id=147, _version_=1411913091952672768}, {id=40, _version_=1411913090728984576}, {id=243, _version_=1411913092960354304}, {id=265, _version_=1411913093196283904}, {id=58, _version_=1411913090949185536}, {id=75, _version_=1411913091167289344}, {id=159, _version_=1411913092073259008}, {id=103, _version_=1411913091462987776}, {id=152, _version_=1411913091999858688}, {id=10, _version_=1411913090408120320}, {id=29, _version_=1411913090608398336}, {id=224, _version_=1411913092772659200}, {id=98, _version_=1411913091415801856}, {id=49, _version_=1411913090824404992}, {id=81, _version_=1411913091230203904}, {id=206, _version_=1411913092596498432}, {id=33, _version_=1411913090646147072}, {id=135, _version_=1411913091832086528}, {id=251, _version_=1411913093041094656}, {id=279, _version_=1411913093364056064}, {id=271, _version_=1411913093252907008}, {id=175, _version_=1411913092234739712}, {id=87, _version_=1411913091300458496}, {id=255, _version_=1411913093083037696}, {id=163, _version_=1411913092109959168}, {id=158, _version_=1411913092063821824}, {id=133, _version_=1411913091784900608}, {id=51, _version_=1411913090845376512}, {id=247, _version_=1411913093003345920}, {id=95, _version_=1411913091386441728}, {id=154, _version_=1411913092020830208}, {id=244, _version_=1411913092971888640}, {id=62, _version_=1411913090989031424}, {id=82, _version_=1411913091242786816}, {id=301, _version_=1411913093580062720}, {id=191, _version_=1411913092393074688}, {id=108, _version_=1411913091517513728}, {id=250, _version_=1411913093031657472}, {id=194, _version_=1411913092424531968}, {id=294, _version_=1411913093510856704}, {id=138, _version_=1411913091861446656}, {id=236, _version_=1411913092894294016}, {id=178, _version_=1411913092264099840}, {id=8, _version_=1411913090389245952}, {id=45, _version_=1411913090783510528}, {id=213, _version_=1411913092662558720}, {id=96, _version_=1411913091396927488}, {id=195, _version_=1411913092454940672}, {id=203, _version_=1411913092531486720}, {id=26, _version_=1411913090580086784}, {id=283, _version_=1411913093401804800}, {id=74, _version_=1411913091152609280}, {id=260, _version_=1411913093130223616}, {id=13, _version_=1411913090436431872}, {id=69, _version_=1411913091099131904}, {id=23, _version_=1411913090543386624}, {id=242, _version_=1411913092950917120}, {id=92, _version_=1411913091349741568}, {id=18, _version_=1411913090496200704}, {id=59, _version_=1411913090959671296}, {id=105, _version_=1411913091488153600}, {id=39, _version_=1411913090719547392}, {id=182, _version_=1411913092301848576}, {id=100, _version_=1411913091434676224}, {id=268, _version_=1411913093224595456}, {id=197, _version_=1411913092474863616}, {id=256, _version_=1411913093092474880}, {id=149, _version_=1411913091971547136}, {id=185, _version_=1411913092335403008}, {id=290, _version_=1411913093472059392}, {id=237, _version_=1411913092903731200}, {id=121, _version_=1411913091646488576}, {id=231, _version_=1411913092842913792}, {id=146, _version_=1411913091943235584}, {id=264, _version_=1411913093169020928}, {id=48, _version_=1411913090814967808}, {id=221, _version_=1411913092742250496}, {id=97, _version_=1411913091406364672}, {id=297, _version_=1411913093542313984}, {id=32, _version_=1411913090636709888}, {id=226, _version_=1411913092795727872}, {id=153, _version_=1411913092009295872}, {id=76, _version_=1411913091177775104}, {id=198, _version_=1411913092484300800}, {id=16, _version_=1411913090476277760}, {id=293, _version_=1411913093500370944}, {id=35, _version_=1411913090678652928}, {id=302, _version_=1411913093589499904}, {id=47, _version_=1411913090804482048}, {id=227, _version_=1411913092805165056}, {id=161, _version_=1411913092092133376}, {id=225, _version_=1411913092785242112}, {id=150, _version_=1411913091980984320}, {id=187, _version_=1411913092355325952}, {id=31, _version_=1411913090627272704}, {id=14, _version_=1411913090449014784}, {id=162, _version_=1411913092101570560}, {id=55, _version_=1411913090916679680}, {id=73, _version_=1411913091140026368}, {id=276, _version_=1411913093335744512}, {id=204, _version_=1411913092555603968}, {id=261, _version_=1411913093139660800}, {id=101, _version_=1411913091444113408}, {id=80, _version_=1411913091219718144}, {id=289, _version_=1411913093462622208}, {id=285, _version_=1411913093424873472}, {id=118, _version_=1411913091618177024}, {id=93, _version_=1411913091360227328}, {id=296, _version_=1411913093532876800}, {id=5, _version_=1411913090357788672}, {id=201, _version_=1411913092512612352}, {id=111, _version_=1411913091546873856}, {id=34, _version_=1411913090662924288}, {id=85, _version_=1411913091280535552}, {id=168, _version_=1411913092161339392}, {id=17, _version_=1411913090485714944}, {id=257, _version_=1411913093101912064}, {id=156, _version_=1411913092042850304}, {id=144, _version_=1411913091920166912}, {id=252, _version_=1411913093050531840}, {id=270, _version_=1411913093243469824}, {id=170, _version_=1411913092181262336}, {id=304, _version_=1411913093609422848}, {id=234, _version_=1411913092872273920}, {id=91, _version_=1411913091339255808}, {id=7, _version_=1411913090379808768}, {id=109, _version_=1411913091526950912}, {id=246, _version_=1411913092993908736}, {id=143, _version_=1411913091908632576}, {id=25, _version_=1411913090569601024}, {id=210, _version_=1411913092634247168}, {id=188, _version_=1411913092364763136}, {id=232, _version_=1411913092852350976}, {id=177, _version_=1411913092254662656}, {id=274, _version_=1411913093296947200}, {id=267, _version_=1411913093215158272}, {id=88, _version_=1411913091309895680}, {id=123, _version_=1411913091665362944}, {id=209, _version_=1411913092624809984}, {id=192, _version_=1411913092402511872}, {id=222, _version_=1411913092751687680}, {id=240, _version_=1411913092932042752}, {id=137, _version_=1411913091852009472}, {id=120, _version_=1411913091637051392}, {id=27, _version_=1411913090589523968}, {id=165, _version_=1411913092133027840}, {id=254, _version_=1411913093070454784}, {id=280, _version_=1411913093373493248}, {id=52, _version_=1411913090854813696}, {id=61, _version_=1411913090979594240}, {id=217, _version_=1411913092704501760}, {id=202, _version_=1411913092522049536}, {id=215, _version_=1411913092685627392}, {id=78, _version_=1411913091199795200}, {id=181, _version_=1411913092292411392}, {id=126, _version_=1411913091709403136}, {id=141, _version_=1411913091889758208}, {id=12, _version_=1411913090426994688}, {id=129, _version_=1411913091747151872}, {id=241, _version_=1411913092941479936}, {id=19, _version_=1411913090505637888}]
client3
PROPS:shard=shard1
roles=null
state=active
core=collection1
collection=collection1
node_name=127.0.0.1:18437_solr
base_url=http://127.0.0.1:18437/solr

 live:true
 num:5

40369 T1173 oasc.SolrException.log SEVERE Sync Failed
40397 T1186 oasc.SolrException.log SEVERE Sync Failed
ASYNC  NEW_CORE C3 name=collection1 org.apache.solr.core.SolrCore@4bf8ced7 url=http://127.0.0.1:18426/solr/collection1 node=127.0.0.1:18426_solr
85394 T1250 C3 P18426 oasc.SolrException.log SEVERE Error while trying to recover. core=collection1:org.apache.solr.client.solrj.SolrServerException: IOException occured when talking to server at: http://127.0.0.1:18415/solr
		at org.apache.solr.client.solrj.impl.HttpSolrServer.request(HttpSolrServer.java:414)
		at org.apache.solr.client.solrj.impl.HttpSolrServer.request(HttpSolrServer.java:182)
		at org.apache.solr.cloud.RecoveryStrategy.sendPrepRecoveryCmd(RecoveryStrategy.java:191)
		at org.apache.solr.cloud.RecoveryStrategy.doRecovery(RecoveryStrategy.java:320)
		at org.apache.solr.cloud.RecoveryStrategy.run(RecoveryStrategy.java:212)
	Caused by: org.apache.http.conn.ConnectTimeoutException: Connect to 127.0.0.1:18415 timed out
		at org.apache.http.conn.scheme.PlainSocketFactory.connectSocket(PlainSocketFactory.java:125)
		at org.apache.http.impl.conn.DefaultClientConnectionOperator.openConnection(DefaultClientConnectionOperator.java:148)
		at org.apache.http.impl.conn.AbstractPoolEntry.open(AbstractPoolEntry.java:150)
		at org.apache.http.impl.conn.AbstractPooledConnAdapter.open(AbstractPooledConnAdapter.java:121)
		at org.apache.http.impl.client.DefaultRequestDirector.tryConnect(DefaultRequestDirector.java:575)
		at org.apache.http.impl.client.DefaultRequestDirector.execute(DefaultRequestDirector.java:425)
		at org.apache.http.impl.client.AbstractHttpClient.execute(AbstractHttpClient.java:820)
		at org.apache.http.impl.client.AbstractHttpClient.execute(AbstractHttpClient.java:754)
		at org.apache.http.impl.client.AbstractHttpClient.execute(AbstractHttpClient.java:732)
		at org.apache.solr.client.solrj.impl.HttpSolrServer.request(HttpSolrServer.java:353)
		... 4 more
	
85395 T1250 C3 P18426 oasc.RecoveryStrategy.doRecovery SEVERE Recovery failed - trying again... core=collection1
ASYNC  NEW_CORE C4 name=collection1 org.apache.solr.core.SolrCore@686b7ca7 url=http://127.0.0.1:18437/solr/collection1 node=127.0.0.1:18437_solr
85424 T1253 C4 P18437 oasc.SolrException.log SEVERE Error while trying to recover. core=collection1:org.apache.solr.client.solrj.SolrServerException: IOException occured when talking to server at: http://127.0.0.1:18415/solr
		at org.apache.solr.client.solrj.impl.HttpSolrServer.request(HttpSolrServer.java:414)
		at org.apache.solr.client.solrj.impl.HttpSolrServer.request(HttpSolrServer.java:182)
		at org.apache.solr.cloud.RecoveryStrategy.sendPrepRecoveryCmd(RecoveryStrategy.java:191)
		at org.apache.solr.cloud.RecoveryStrategy.doRecovery(RecoveryStrategy.java:320)
		at org.apache.solr.cloud.RecoveryStrategy.run(RecoveryStrategy.java:212)
	Caused by: org.apache.http.conn.ConnectTimeoutException: Connect to 127.0.0.1:18415 timed out
		at org.apache.http.conn.scheme.PlainSocketFactory.connectSocket(PlainSocketFactory.java:125)
		at org.apache.http.impl.conn.DefaultClientConnectionOperator.openConnection(DefaultClientConnectionOperator.java:148)
		at org.apache.http.impl.conn.AbstractPoolEntry.open(AbstractPoolEntry.java:150)
		at org.apache.http.impl.conn.AbstractPooledConnAdapter.open(AbstractPooledConnAdapter.java:121)
		at org.apache.http.impl.client.DefaultRequestDirector.tryConnect(DefaultRequestDirector.java:575)
		at org.apache.http.impl.client.DefaultRequestDirector.execute(DefaultRequestDirector.java:425)
		at org.apache.http.impl.client.AbstractHttpClient.execute(AbstractHttpClient.java:820)
		at org.apache.http.impl.client.AbstractHttpClient.execute(AbstractHttpClient.java:754)
		at org.apache.http.impl.client.AbstractHttpClient.execute(AbstractHttpClient.java:732)
		at org.apache.solr.client.solrj.impl.HttpSolrServer.request(HttpSolrServer.java:353)
		... 4 more
	
85425 T1253 C4 P18437 oasc.RecoveryStrategy.doRecovery SEVERE Recovery failed - trying again... core=collection1
86416 T1260 C3 P18426 oasc.SolrException.log SEVERE Error while trying to recover. core=collection1:java.lang.RuntimeException: No registered leader was found, collection:collection1 slice:shard1
		at org.apache.solr.common.cloud.ZkStateReader.getLeaderProps(ZkStateReader.java:413)
		at org.apache.solr.common.cloud.ZkStateReader.getLeaderProps(ZkStateReader.java:399)
		at org.apache.solr.cloud.RecoveryStrategy.doRecovery(RecoveryStrategy.java:296)
		at org.apache.solr.cloud.RecoveryStrategy.run(RecoveryStrategy.java:212)
	
86416 T1260 C3 P18426 oasc.RecoveryStrategy.doRecovery SEVERE Recovery failed - trying again... core=collection1
86445 T1261 C4 P18437 oasc.SolrException.log SEVERE Error while trying to recover. core=collection1:java.lang.RuntimeException: No registered leader was found, collection:collection1 slice:shard1
		at org.apache.solr.common.cloud.ZkStateReader.getLeaderProps(ZkStateReader.java:413)
		at org.apache.solr.common.cloud.ZkStateReader.getLeaderProps(ZkStateReader.java:399)
		at org.apache.solr.cloud.RecoveryStrategy.doRecovery(RecoveryStrategy.java:296)
		at org.apache.solr.cloud.RecoveryStrategy.run(RecoveryStrategy.java:212)
	
86445 T1261 C4 P18437 oasc.RecoveryStrategy.doRecovery SEVERE Recovery failed - trying again... core=collection1
Control Docs:305
check const of shard1
client0
PROPS:shard=shard1
roles=null
leader=true
state=active
core=collection1
collection=collection1
node_name=127.0.0.1:18396_solr
base_url=http://127.0.0.1:18396/solr

 live:true
 num:305

client1
PROPS:shard=shard1
roles=null
state=active
core=collection1
collection=collection1
node_name=127.0.0.1:18415_solr
base_url=http://127.0.0.1:18415/solr

error contacting client: IOException occured when talking to server at: http://localhost:18415/solr/collection1

client2
PROPS:shard=shard1
roles=null
state=active
core=collection1
collection=collection1
node_name=127.0.0.1:18426_solr
base_url=http://127.0.0.1:18426/solr

 live:true
 num:305

client3
PROPS:shard=shard1
roles=null
state=active
core=collection1
collection=collection1
node_name=127.0.0.1:18437_solr
base_url=http://127.0.0.1:18437/solr

 live:true
 num:305

http://127.0.0.1:18396/solr/collection1/ : 305
shard:shard1
127676 T1186 oasc.SolrException.log SEVERE Sync Failed
Tests run: 1, Failures: 0, Errors: 0, Skipped: 0, Time elapsed: 128.201 sec
Running org.apache.solr.search.QueryParsingTest
Creating dataDir: /usr/home/hudson/hudson-slave/workspace/Lucene-Solr-Maven-4.x/maven-build/solr/core/target/test/./solrtest-QueryParsingTest-1346505342897
Tests run: 4, Failures: 0, Errors: 0, Skipped: 0, Time elapsed: 0.354 sec
Running org.apache.solr.schema.NumericFieldsTest
Creating dataDir: /usr/home/hudson/hudson-slave/workspace/Lucene-Solr-Maven-4.x/maven-build/solr/core/target/test/./solrtest-NumericFieldsTest-1346505343252
Tests run: 1, Failures: 0, Errors: 0, Skipped: 0, Time elapsed: 0.189 sec
Running org.apache.solr.internal.csv.writer.CSVWriterTest
Tests run: 2, Failures: 0, Errors: 0, Skipped: 0, Time elapsed: 0.001 sec
Running org.apache.solr.search.TestDocSet
Tests run: 2, Failures: 0, Errors: 0, Skipped: 0, Time elapsed: 0.641 sec
Running org.apache.solr.client.solrj.embedded.SolrExampleStreamingBinaryTest
Creating dataDir: /usr/home/hudson/hudson-slave/workspace/Lucene-Solr-Maven-4.x/maven-build/solr/core/target/test/./solrtest-SolrExampleStreamingBinaryTest-1346505344088
ASYNC  NEW_CORE C5 name=collection1 org.apache.solr.core.SolrCore@79ed3e07
4774 T1289 C5 oasc.SolrException.log SEVERE org.apache.solr.common.SolrException: Document contains multiple values for uniqueKey field: id=[DOCID, DOCID2]
		at org.apache.solr.update.AddUpdateCommand.getIndexedId(AddUpdateCommand.java:91)
		at org.apache.solr.update.processor.DistributedUpdateProcessor.versionAdd(DistributedUpdateProcessor.java:460)
		at org.apache.solr.update.processor.DistributedUpdateProcessor.processAdd(DistributedUpdateProcessor.java:342)
		at org.apache.solr.handler.loader.JavabinLoader$1.update(JavabinLoader.java:86)
		at org.apache.solr.client.solrj.request.JavaBinUpdateRequestCodec$1.readOuterMostDocIterator(JavaBinUpdateRequestCodec.java:140)
		at org.apache.solr.client.solrj.request.JavaBinUpdateRequestCodec$1.readIterator(JavaBinUpdateRequestCodec.java:120)
		at org.apache.solr.common.util.JavaBinCodec.readVal(JavaBinCodec.java:221)
		at org.apache.solr.client.solrj.request.JavaBinUpdateRequestCodec$1.readNamedList(JavaBinUpdateRequestCodec.java:105)
		at org.apache.solr.common.util.JavaBinCodec.readVal(JavaBinCodec.java:186)
		at org.apache.solr.common.util.JavaBinCodec.unmarshal(JavaBinCodec.java:112)
		at org.apache.solr.client.solrj.request.JavaBinUpdateRequestCodec.unmarshal(JavaBinUpdateRequestCodec.java:147)
		at org.apache.solr.handler.loader.JavabinLoader.parseAndLoadDocs(JavabinLoader.java:96)
		at org.apache.solr.handler.loader.JavabinLoader.load(JavabinLoader.java:55)
		at org.apache.solr.handler.UpdateRequestHandler$1.load(UpdateRequestHandler.java:92)
		at org.apache.solr.handler.ContentStreamHandlerBase.handleRequestBody(ContentStreamHandlerBase.java:74)
		at org.apache.solr.handler.RequestHandlerBase.handleRequest(RequestHandlerBase.java:129)
		at org.apache.solr.core.SolrCore.execute(SolrCore.java:1692)
		at org.apache.solr.servlet.SolrDispatchFilter.execute(SolrDispatchFilter.java:454)
		at org.apache.solr.servlet.SolrDispatchFilter.doFilter(SolrDispatchFilter.java:275)
		at org.eclipse.jetty.servlet.ServletHandler$CachedChain.doFilter(ServletHandler.java:1337)
		at org.eclipse.jetty.servlet.ServletHandler.doHandle(ServletHandler.java:484)
		at org.eclipse.jetty.server.session.SessionHandler.doHandle(SessionHandler.java:231)
		at org.eclipse.jetty.server.handler.ScopedHandler.handle(ScopedHandler.java:119)
		at org.eclipse.jetty.server.handler.GzipHandler.handle(GzipHandler.java:267)
		at org.eclipse.jetty.server.handler.ContextHandler.doHandle(ContextHandler.java:1067)
		at org.eclipse.jetty.servlet.ServletHandler.doScope(ServletHandler.java:413)
		at org.eclipse.jetty.server.session.SessionHandler.doScope(SessionHandler.java:192)
		at org.eclipse.jetty.server.handler.ContextHandler.doScope(ContextHandler.java:999)
		at org.eclipse.jetty.server.handler.ScopedHandler.handle(ScopedHandler.java:117)
		at org.eclipse.jetty.server.handler.HandlerWrapper.handle(HandlerWrapper.java:111)
		at org.eclipse.jetty.server.Server.handle(Server.java:351)
		at org.eclipse.jetty.server.AbstractHttpConnection.handleRequest(AbstractHttpConnection.java:454)
		at org.eclipse.jetty.server.BlockingHttpConnection.handleRequest(BlockingHttpConnection.java:47)
		at org.eclipse.jetty.server.AbstractHttpConnection.content(AbstractHttpConnection.java:900)
		at org.eclipse.jetty.server.AbstractHttpConnection$RequestHandler.content(AbstractHttpConnection.java:954)
		at org.eclipse.jetty.http.HttpParser.parseNext(HttpParser.java:952)
		at org.eclipse.jetty.http.HttpParser.parseAvailable(HttpParser.java:235)
		at org.eclipse.jetty.server.BlockingHttpConnection.handle(BlockingHttpConnection.java:66)
		at org.eclipse.jetty.server.bio.SocketConnector$ConnectorEndPoint.run(SocketConnector.java:254)
		at org.eclipse.jetty.util.thread.QueuedThreadPool.runJob(QueuedThreadPool.java:599)
		at org.eclipse.jetty.util.thread.QueuedThreadPool$3.run(QueuedThreadPool.java:534)
		at java.lang.Thread.run(Thread.java:679)
	
Tests run: 22, Failures: 0, Errors: 0, Skipped: 0, Time elapsed: 11.29 sec
Running org.apache.solr.EchoParamsTest
Creating dataDir: /usr/home/hudson/hudson-slave/workspace/Lucene-Solr-Maven-4.x/maven-build/solr/core/target/test/./solrtest-EchoParamsTest-1346505355377
Tests run: 1, Failures: 0, Errors: 0, Skipped: 0, Time elapsed: 0.074 sec
Running org.apache.solr.core.TestJmxMonitoredMap
Tests run: 2, Failures: 0, Errors: 0, Skipped: 0, Time elapsed: 0.104 sec
Running org.apache.solr.schema.IndexSchemaRuntimeFieldTest
Creating dataDir: /usr/home/hudson/hudson-slave/workspace/Lucene-Solr-Maven-4.x/maven-build/solr/core/target/test/./solrtest-IndexSchemaRuntimeFieldTest-1346505355556
Tests run: 1, Failures: 0, Errors: 0, Skipped: 0, Time elapsed: 0.368 sec
Running org.apache.solr.common.util.TestHash
Tests run: 2, Failures: 0, Errors: 0, Skipped: 0, Time elapsed: 0.106 sec
Running org.apache.solr.search.TestSurroundQueryParser
Tests run: 1, Failures: 0, Errors: 0, Skipped: 0, Time elapsed: 0.382 sec
Running org.apache.solr.util.TestSystemIdResolver
Tests run: 1, Failures: 0, Errors: 0, Skipped: 0, Time elapsed: 0.021 sec
Running org.apache.solr.search.TestFastLRUCache
Tests run: 7, Failures: 0, Errors: 0, Skipped: 0, Time elapsed: 0.082 sec
Running org.apache.solr.cloud.ZkSolrClientTest
4505 T3 oasu.ConcurrentLRUCache.finalize SEVERE ConcurrentLRUCache was not destroyed prior to finalize(), indicates a bug -- POSSIBLE RESOURCE LEAK!!!
Tests run: 4, Failures: 0, Errors: 0, Skipped: 0, Time elapsed: 7.3 sec
Running org.apache.solr.highlight.FastVectorHighlighterTest
Creating dataDir: /usr/home/hudson/hudson-slave/workspace/Lucene-Solr-Maven-4.x/maven-build/solr/core/target/test/./solrtest-FastVectorHighlighterTest-1346505363839
Tests run: 2, Failures: 0, Errors: 0, Skipped: 0, Time elapsed: 0.579 sec
Running org.apache.solr.cloud.ZkCLITest
Creating dataDir: /usr/home/hudson/hudson-slave/workspace/Lucene-Solr-Maven-4.x/maven-build/solr/core/target/test/./solrtest-ZkCLITest-1346505364436
Creating dataDir: /usr/home/hudson/hudson-slave/workspace/Lucene-Solr-Maven-4.x/maven-build/solr/core/target/test/./solrtest-ZkCLITest-1346505366870
Creating dataDir: /usr/home/hudson/hudson-slave/workspace/Lucene-Solr-Maven-4.x/maven-build/solr/core/target/test/./solrtest-ZkCLITest-1346505367096
Tests run: 3, Failures: 0, Errors: 0, Skipped: 0, Time elapsed: 4.733 sec
Running org.apache.solr.search.TestQueryTypes
Tests run: 1, Failures: 0, Errors: 0, Skipped: 0, Time elapsed: 0.648 sec
Running org.apache.solr.internal.csv.CSVStrategyTest
Tests run: 5, Failures: 0, Errors: 0, Skipped: 0, Time elapsed: 0.001 sec
Running org.apache.solr.handler.BinaryUpdateRequestHandlerTest
Creating dataDir: /usr/home/hudson/hudson-slave/workspace/Lucene-Solr-Maven-4.x/maven-build/solr/core/target/test/./solrtest-BinaryUpdateRequestHandlerTest-1346505369812
null
Tests run: 1, Failures: 0, Errors: 0, Skipped: 0, Time elapsed: 0.499 sec
Running org.apache.solr.handler.StandardRequestHandlerTest
Tests run: 1, Failures: 0, Errors: 0, Skipped: 0, Time elapsed: 0.364 sec
Running org.apache.solr.spelling.suggest.SuggesterFSTTest
Creating dataDir: /usr/home/hudson/hudson-slave/workspace/Lucene-Solr-Maven-4.x/maven-build/solr/core/target/test/./solrtest-SuggesterFSTTest-1346505370669
NOTE: per solr.test.leavedatadir, dataDir will not be removed: /usr/home/hudson/hudson-slave/workspace/Lucene-Solr-Maven-4.x/maven-build/solr/core/target/test/./solrtest-SuggesterFSTTest-1346505370669
Tests run: 4, Failures: 0, Errors: 0, Skipped: 0, Time elapsed: 0.547 sec
Running org.apache.solr.core.TestCodecSupport
Creating dataDir: /usr/home/hudson/hudson-slave/workspace/Lucene-Solr-Maven-4.x/maven-build/solr/core/target/test/./solrtest-TestCodecSupport-1346505371219
Tests run: 3, Failures: 0, Errors: 0, Skipped: 0, Time elapsed: 0.092 sec
Running org.apache.solr.schema.BadIndexSchemaTest
Creating dataDir: /usr/home/hudson/hudson-slave/workspace/Lucene-Solr-Maven-4.x/maven-build/solr/core/target/test/./solrtest-BadIndexSchemaTest-1346505371313
Creating dataDir: /usr/home/hudson/hudson-slave/workspace/Lucene-Solr-Maven-4.x/maven-build/solr/core/target/test/./solrtest-BadIndexSchemaTest-1346505371397
154 T1442 oass.IndexSchema.readSchema SEVERE FieldType 'sim1' is configured with a similarity, but the global similarity does not support it: class org.apache.solr.search.similarities.DefaultSimilarityFactory
Creating dataDir: /usr/home/hudson/hudson-slave/workspace/Lucene-Solr-Maven-4.x/maven-build/solr/core/target/test/./solrtest-BadIndexSchemaTest-1346505371468
223 T1442 oass.IndexSchema.readSchema SEVERE uniqueKey field (id) can not be the dest of a copyField (src=XXX)
Creating dataDir: /usr/home/hudson/hudson-slave/workspace/Lucene-Solr-Maven-4.x/maven-build/solr/core/target/test/./solrtest-BadIndexSchemaTest-1346505371535
296 T1442 oass.IndexSchema.readSchema SEVERE uniqueKey field (null) can not be configured with a default value (XXX)
Creating dataDir: /usr/home/hudson/hudson-slave/workspace/Lucene-Solr-Maven-4.x/maven-build/solr/core/target/test/./solrtest-BadIndexSchemaTest-1346505371608
347 T1442 oass.IndexSchema.readSchema SEVERE uniqueKey field (null) can not be configured to be multivalued
Creating dataDir: /usr/home/hudson/hudson-slave/workspace/Lucene-Solr-Maven-4.x/maven-build/solr/core/target/test/./solrtest-BadIndexSchemaTest-1346505371675
418 T1442 oasc.SolrCore.initCodec SEVERE FieldType 'pulsing1' is configured with a postings format, but the codec does not support it: class org.apache.solr.core.SolrCore$3
Creating dataDir: /usr/home/hudson/hudson-slave/workspace/Lucene-Solr-Maven-4.x/maven-build/solr/core/target/test/./solrtest-BadIndexSchemaTest-1346505371732
Creating dataDir: /usr/home/hudson/hudson-slave/workspace/Lucene-Solr-Maven-4.x/maven-build/solr/core/target/test/./solrtest-BadIndexSchemaTest-1346505371779
Creating dataDir: /usr/home/hudson/hudson-slave/workspace/Lucene-Solr-Maven-4.x/maven-build/solr/core/target/test/./solrtest-BadIndexSchemaTest-1346505371827
612 T3 oasc.CoreContainer.finalize SEVERE CoreContainer was not shutdown prior to finalize(), indicates a bug -- POSSIBLE RESOURCE LEAK!!!  instance=1317276040
613 T3 oasc.SolrCore.finalize SEVERE REFCOUNT ERROR: unreferenced org.apache.solr.core.SolrCore@3e8de7fd (collection1) has a reference count of 1
Creating dataDir: /usr/home/hudson/hudson-slave/workspace/Lucene-Solr-Maven-4.x/maven-build/solr/core/target/test/./solrtest-BadIndexSchemaTest-1346505371934
Creating dataDir: /usr/home/hudson/hudson-slave/workspace/Lucene-Solr-Maven-4.x/maven-build/solr/core/target/test/./solrtest-BadIndexSchemaTest-1346505371994
Creating dataDir: /usr/home/hudson/hudson-slave/workspace/Lucene-Solr-Maven-4.x/maven-build/solr/core/target/test/./solrtest-BadIndexSchemaTest-1346505372062
Creating dataDir: /usr/home/hudson/hudson-slave/workspace/Lucene-Solr-Maven-4.x/maven-build/solr/core/target/test/./solrtest-BadIndexSchemaTest-1346505372128
Creating dataDir: /usr/home/hudson/hudson-slave/workspace/Lucene-Solr-Maven-4.x/maven-build/solr/core/target/test/./solrtest-BadIndexSchemaTest-1346505372181
Creating dataDir: /usr/home/hudson/hudson-slave/workspace/Lucene-Solr-Maven-4.x/maven-build/solr/core/target/test/./solrtest-BadIndexSchemaTest-1346505372229
Tests run: 9, Failures: 0, Errors: 0, Skipped: 0, Time elapsed: 0.983 sec
Running org.apache.solr.core.TestBadConfig
Creating dataDir: /usr/home/hudson/hudson-slave/workspace/Lucene-Solr-Maven-4.x/maven-build/solr/core/target/test/./solrtest-TestBadConfig-1346505372389
377 T1444 oasup.StatelessScriptUpdateProcessorFactory.inform SEVERE Unable to initialize scripts: Unable to evaluate script: a-file-name-that-does-not-exist.js Ignoring exception matching \Qa-file-name-that-does-not-exist.js\E
Creating dataDir: /usr/home/hudson/hudson-slave/workspace/Lucene-Solr-Maven-4.x/maven-build/solr/core/target/test/./solrtest-TestBadConfig-1346505372676
594 T3 oasc.CoreContainer.finalize SEVERE CoreContainer was not shutdown prior to finalize(), indicates a bug -- POSSIBLE RESOURCE LEAK!!!  instance=999780773
747 T1444 oasup.StatelessScriptUpdateProcessorFactory.inform SEVERE Unable to initialize scripts: No ScriptEngine found by name: giberish -- supported names: js, rhino, JavaScript, javascript, ECMAScript, ecmascript Ignoring exception matching \Qgiberish\E
Creating dataDir: /usr/home/hudson/hudson-slave/workspace/Lucene-Solr-Maven-4.x/maven-build/solr/core/target/test/./solrtest-TestBadConfig-1346505373056
955 T3 oasc.CoreContainer.finalize SEVERE CoreContainer was not shutdown prior to finalize(), indicates a bug -- POSSIBLE RESOURCE LEAK!!!  instance=918300162
1238 T1444 oasup.StatelessScriptUpdateProcessorFactory.inform SEVERE Unable to initialize scripts: Unable to evaluate script: currency.xml Ignoring exception matching \Qcurrency.xml\E
Creating dataDir: /usr/home/hudson/hudson-slave/workspace/Lucene-Solr-Maven-4.x/maven-build/solr/core/target/test/./solrtest-TestBadConfig-1346505373535
Creating dataDir: /usr/home/hudson/hudson-slave/workspace/Lucene-Solr-Maven-4.x/maven-build/solr/core/target/test/./solrtest-TestBadConfig-1346505373553
1445 T3 oasc.CoreContainer.finalize SEVERE CoreContainer was not shutdown prior to finalize(), indicates a bug -- POSSIBLE RESOURCE LEAK!!!  instance=7679575
Tests run: 5, Failures: 0, Errors: 0, Skipped: 0, Time elapsed: 1.639 sec
Running org.apache.solr.search.similarities.TestDefaultSimilarityFactory
Creating dataDir: /usr/home/hudson/hudson-slave/workspace/Lucene-Solr-Maven-4.x/maven-build/solr/core/target/test/./solrtest-TestDefaultSimilarityFactory-1346505373934
Tests run: 2, Failures: 0, Errors: 0, Skipped: 0, Time elapsed: 0.086 sec
Running org.apache.solr.spelling.TestSuggestSpellingConverter
Tests run: 2, Failures: 0, Errors: 0, Skipped: 0, Time elapsed: 0.044 sec
Running org.apache.solr.schema.TestBinaryField
Tests run: 1, Failures: 0, Errors: 0, Skipped: 0, Time elapsed: 0.249 sec
Running org.apache.solr.util.TestFastWriter
Tests run: 1, Failures: 0, Errors: 0, Skipped: 0, Time elapsed: 0.298 sec
Running org.apache.solr.cloud.BasicDistributedZkTest
Creating dataDir: /usr/home/hudson/hudson-slave/workspace/Lucene-Solr-Maven-4.x/maven-build/solr/core/target/test/./solrtest-BasicDistributedZkTest-1346505374626
57477 T3 oasc.CoreContainer.finalize SEVERE CoreContainer was not shutdown prior to finalize(), indicates a bug -- POSSIBLE RESOURCE LEAK!!!  instance=759040806
67616 T1482 oasc.SolrException.log SEVERE org.apache.solr.common.SolrException: Failed to unregister info bean: org.apache.solr.highlight.GapFragmenter
		at org.apache.solr.core.JmxMonitoredMap.unregister(JmxMonitoredMap.java:178)
		at org.apache.solr.core.JmxMonitoredMap.clear(JmxMonitoredMap.java:116)
		at org.apache.solr.core.SolrCore.close(SolrCore.java:863)
		at org.apache.solr.handler.admin.CoreAdminHandler.handleUnloadAction(CoreAdminHandler.java:615)
		at org.apache.solr.handler.admin.CoreAdminHandler.handleRequestBody(CoreAdminHandler.java:149)
		at org.apache.solr.handler.RequestHandlerBase.handleRequest(RequestHandlerBase.java:129)
		at org.apache.solr.servlet.SolrDispatchFilter.handleAdminRequest(SolrDispatchFilter.java:371)
		at org.apache.solr.servlet.SolrDispatchFilter.doFilter(SolrDispatchFilter.java:180)
		at org.eclipse.jetty.servlet.ServletHandler$CachedChain.doFilter(ServletHandler.java:1337)
		at org.eclipse.jetty.servlet.ServletHandler.doHandle(ServletHandler.java:484)
		at org.eclipse.jetty.server.session.SessionHandler.doHandle(SessionHandler.java:231)
		at org.eclipse.jetty.server.handler.ScopedHandler.handle(ScopedHandler.java:119)
		at org.eclipse.jetty.server.handler.GzipHandler.handle(GzipHandler.java:267)
		at org.eclipse.jetty.server.handler.ContextHandler.doHandle(ContextHandler.java:1067)
		at org.eclipse.jetty.servlet.ServletHandler.doScope(ServletHandler.java:413)
		at org.eclipse.jetty.server.session.SessionHandler.doScope(SessionHandler.java:192)
		at org.eclipse.jetty.server.handler.ContextHandler.doScope(ContextHandler.java:999)
		at org.eclipse.jetty.server.handler.ScopedHandler.handle(ScopedHandler.java:117)
		at org.eclipse.jetty.server.handler.HandlerWrapper.handle(HandlerWrapper.java:111)
		at org.eclipse.jetty.server.Server.handle(Server.java:351)
		at org.eclipse.jetty.server.AbstractHttpConnection.handleRequest(AbstractHttpConnection.java:454)
		at org.eclipse.jetty.server.BlockingHttpConnection.handleRequest(BlockingHttpConnection.java:47)
		at org.eclipse.jetty.server.AbstractHttpConnection.content(AbstractHttpConnection.java:900)
		at org.eclipse.jetty.server.AbstractHttpConnection$RequestHandler.content(AbstractHttpConnection.java:954)
		at org.eclipse.jetty.http.HttpParser.parseNext(HttpParser.java:857)
		at org.eclipse.jetty.http.HttpParser.parseAvailable(HttpParser.java:235)
		at org.eclipse.jetty.server.BlockingHttpConnection.handle(BlockingHttpConnection.java:66)
		at org.eclipse.jetty.server.bio.SocketConnector$ConnectorEndPoint.run(SocketConnector.java:254)
		at org.eclipse.jetty.util.thread.QueuedThreadPool.runJob(QueuedThreadPool.java:599)
		at org.eclipse.jetty.util.thread.QueuedThreadPool$3.run(QueuedThreadPool.java:534)
		at java.lang.Thread.run(Thread.java:679)
	Caused by: javax.management.InstanceNotFoundException: solr/awholynewcollection_2:type=org.apache.solr.highlight.GapFragmenter,id=org.apache.solr.highlight.GapFragmenter
		at com.sun.jmx.interceptor.DefaultMBeanServerInterceptor.getMBean(DefaultMBeanServerInterceptor.java:1118)
		at com.sun.jmx.interceptor.DefaultMBeanServerInterceptor.getAttribute(DefaultMBeanServerInterceptor.java:679)
		at com.sun.jmx.mbeanserver.JmxMBeanServer.getAttribute(JmxMBeanServer.java:672)
		at org.apache.solr.core.JmxMonitoredMap.unregister(JmxMonitoredMap.java:174)
		... 30 more
	
68195 T1515 oasc.SolrException.log SEVERE Sync Failed
68760 T1515 oasc.SolrException.log SEVERE Sync Failed
99299 T1515 oasc.SolrException.log SEVERE Sync request error: org.apache.solr.client.solrj.SolrServerException: Timeout occured while waiting response from server at: http://127.0.0.1:24381/solr/collection2
ASYNC  NEW_CORE C6 name=collection2 org.apache.solr.core.SolrCore@6b5f3521 url=http://127.0.0.1:24381/solr/collection2 node=127.0.0.1:24381_solr
100352 T1735 C6 P24381 oasc.SolrException.log SEVERE Error while trying to recover. core=collection2:java.lang.RuntimeException: No registered leader was found, collection:collection2 slice:shard1
		at org.apache.solr.common.cloud.ZkStateReader.getLeaderProps(ZkStateReader.java:413)
		at org.apache.solr.common.cloud.ZkStateReader.getLeaderProps(ZkStateReader.java:399)
		at org.apache.solr.cloud.RecoveryStrategy.doRecovery(RecoveryStrategy.java:296)
		at org.apache.solr.cloud.RecoveryStrategy.run(RecoveryStrategy.java:212)
	
100352 T1735 C6 P24381 oasc.RecoveryStrategy.doRecovery SEVERE Recovery failed - trying again... core=collection2
ASYNC  NEW_CORE C7 name=awholynewcollection_3 org.apache.solr.core.SolrCore@ad5a2ce url=http://127.0.0.1:24379/solr/awholynewcollection_3 node=127.0.0.1:24379_solr
113222 T1729 C7 P24379 oasc.SolrException.log SEVERE Error while trying to recover. core=awholynewcollection_3:org.apache.solr.client.solrj.SolrServerException: IOException occured when talking to server at: http://127.0.0.1:24377/solr
		at org.apache.solr.client.solrj.impl.HttpSolrServer.request(HttpSolrServer.java:414)
		at org.apache.solr.client.solrj.impl.HttpSolrServer.request(HttpSolrServer.java:182)
		at org.apache.solr.cloud.RecoveryStrategy.sendPrepRecoveryCmd(RecoveryStrategy.java:191)
		at org.apache.solr.cloud.RecoveryStrategy.doRecovery(RecoveryStrategy.java:320)
		at org.apache.solr.cloud.RecoveryStrategy.run(RecoveryStrategy.java:212)
	Caused by: org.apache.http.conn.ConnectTimeoutException: Connect to 127.0.0.1:24377 timed out
		at org.apache.http.conn.scheme.PlainSocketFactory.connectSocket(PlainSocketFactory.java:125)
		at org.apache.http.impl.conn.DefaultClientConnectionOperator.openConnection(DefaultClientConnectionOperator.java:148)
		at org.apache.http.impl.conn.AbstractPoolEntry.open(AbstractPoolEntry.java:150)
		at org.apache.http.impl.conn.AbstractPooledConnAdapter.open(AbstractPooledConnAdapter.java:121)
		at org.apache.http.impl.client.DefaultRequestDirector.tryConnect(DefaultRequestDirector.java:575)
		at org.apache.http.impl.client.DefaultRequestDirector.execute(DefaultRequestDirector.java:425)
		at org.apache.http.impl.client.AbstractHttpClient.execute(AbstractHttpClient.java:820)
		at org.apache.http.impl.client.AbstractHttpClient.execute(AbstractHttpClient.java:754)
		at org.apache.http.impl.client.AbstractHttpClient.execute(AbstractHttpClient.java:732)
		at org.apache.solr.client.solrj.impl.HttpSolrServer.request(HttpSolrServer.java:353)
		... 4 more
	
113223 T1729 C7 P24379 oasc.RecoveryStrategy.doRecovery SEVERE Recovery failed - trying again... core=awholynewcollection_3
113302 T1515 oasc.SolrException.log SEVERE Sync request error: org.apache.solr.client.solrj.SolrServerException: IOException occured when talking to server at: http://127.0.0.1:24381/solr/collection3
ASYNC  NEW_CORE C8 name=collection3 org.apache.solr.core.SolrCore@1494a702 url=http://127.0.0.1:24381/solr/collection3 node=127.0.0.1:24381_solr
129861 T1524 C8 P24381 oasc.SolrException.log SEVERE null:org.eclipse.jetty.io.EofException
		at org.eclipse.jetty.server.HttpOutput.write(HttpOutput.java:154)
		at org.eclipse.jetty.server.HttpOutput.write(HttpOutput.java:101)
		at org.apache.solr.common.util.FastOutputStream.flush(FastOutputStream.java:204)
		at org.apache.solr.common.util.FastOutputStream.flushBuffer(FastOutputStream.java:197)
		at org.apache.solr.common.util.JavaBinCodec.marshal(JavaBinCodec.java:94)
		at org.apache.solr.response.BinaryResponseWriter.write(BinaryResponseWriter.java:49)
		at org.apache.solr.servlet.SolrDispatchFilter.writeResponse(SolrDispatchFilter.java:403)
		at org.apache.solr.servlet.SolrDispatchFilter.doFilter(SolrDispatchFilter.java:288)
		at org.eclipse.jetty.servlet.ServletHandler$CachedChain.doFilter(ServletHandler.java:1337)
		at org.eclipse.jetty.servlet.ServletHandler.doHandle(ServletHandler.java:484)
		at org.eclipse.jetty.server.session.SessionHandler.doHandle(SessionHandler.java:231)
		at org.eclipse.jetty.server.handler.ScopedHandler.handle(ScopedHandler.java:119)
		at org.eclipse.jetty.server.handler.GzipHandler.handle(GzipHandler.java:267)
		at org.eclipse.jetty.server.handler.ContextHandler.doHandle(ContextHandler.java:1067)
		at org.eclipse.jetty.servlet.ServletHandler.doScope(ServletHandler.java:413)
		at org.eclipse.jetty.server.session.SessionHandler.doScope(SessionHandler.java:192)
		at org.eclipse.jetty.server.handler.ContextHandler.doScope(ContextHandler.java:999)
		at org.eclipse.jetty.server.handler.ScopedHandler.handle(ScopedHandler.java:117)
		at org.eclipse.jetty.server.handler.HandlerWrapper.handle(HandlerWrapper.java:111)
		at org.eclipse.jetty.server.Server.handle(Server.java:351)
		at org.eclipse.jetty.server.AbstractHttpConnection.handleRequest(AbstractHttpConnection.java:454)
		at org.eclipse.jetty.server.BlockingHttpConnection.handleRequest(BlockingHttpConnection.java:47)
		at org.eclipse.jetty.server.AbstractHttpConnection.content(AbstractHttpConnection.java:900)
		at org.eclipse.jetty.server.AbstractHttpConnection$RequestHandler.content(AbstractHttpConnection.java:954)
		at org.eclipse.jetty.http.HttpParser.parseNext(HttpParser.java:857)
		at org.eclipse.jetty.http.HttpParser.parseAvailable(HttpParser.java:235)
		at org.eclipse.jetty.server.BlockingHttpConnection.handle(BlockingHttpConnection.java:66)
		at org.eclipse.jetty.server.bio.SocketConnector$ConnectorEndPoint.run(SocketConnector.java:254)
		at org.eclipse.jetty.util.thread.QueuedThreadPool.runJob(QueuedThreadPool.java:599)
		at org.eclipse.jetty.util.thread.QueuedThreadPool$3.run(QueuedThreadPool.java:534)
		at java.lang.Thread.run(Thread.java:679)
	
129861 T1524 C8 P24381 oasc.SolrException.log SEVERE null:org.eclipse.jetty.io.EofException
		at org.eclipse.jetty.server.HttpOutput.write(HttpOutput.java:154)
		at org.eclipse.jetty.server.HttpOutput.write(HttpOutput.java:101)
		at org.apache.solr.common.util.FastOutputStream.flush(FastOutputStream.java:204)
		at org.apache.solr.common.util.FastOutputStream.flushBuffer(FastOutputStream.java:197)
		at org.apache.solr.common.util.JavaBinCodec.marshal(JavaBinCodec.java:94)
		at org.apache.solr.response.BinaryResponseWriter.write(BinaryResponseWriter.java:49)
		at org.apache.solr.servlet.SolrDispatchFilter.writeResponse(SolrDispatchFilter.java:403)
		at org.apache.solr.servlet.SolrDispatchFilter.doFilter(SolrDispatchFilter.java:288)
		at org.eclipse.jetty.servlet.ServletHandler$CachedChain.doFilter(ServletHandler.java:1337)
		at org.eclipse.jetty.servlet.ServletHandler.doHandle(ServletHandler.java:484)
		at org.eclipse.jetty.server.session.SessionHandler.doHandle(SessionHandler.java:231)
		at org.eclipse.jetty.server.handler.ScopedHandler.handle(ScopedHandler.java:119)
		at org.eclipse.jetty.server.handler.GzipHandler.handle(GzipHandler.java:267)
		at org.eclipse.jetty.server.handler.ContextHandler.doHandle(ContextHandler.java:1067)
		at org.eclipse.jetty.servlet.ServletHandler.doScope(ServletHandler.java:413)
		at org.eclipse.jetty.server.session.SessionHandler.doScope(SessionHandler.java:192)
		at org.eclipse.jetty.server.handler.ContextHandler.doScope(ContextHandler.java:999)
		at org.eclipse.jetty.server.handler.ScopedHandler.handle(ScopedHandler.java:117)
		at org.eclipse.jetty.server.handler.HandlerWrapper.handle(HandlerWrapper.java:111)
		at org.eclipse.jetty.server.Server.handle(Server.java:351)
		at org.eclipse.jetty.server.AbstractHttpConnection.handleRequest(AbstractHttpConnection.java:454)
		at org.eclipse.jetty.server.BlockingHttpConnection.handleRequest(BlockingHttpConnection.java:47)
		at org.eclipse.jetty.server.AbstractHttpConnection.content(AbstractHttpConnection.java:900)
		at org.eclipse.jetty.server.AbstractHttpConnection$RequestHandler.content(AbstractHttpConnection.java:954)
		at org.eclipse.jetty.http.HttpParser.parseNext(HttpParser.java:857)
		at org.eclipse.jetty.http.HttpParser.parseAvailable(HttpParser.java:235)
		at org.eclipse.jetty.server.BlockingHttpConnection.handle(BlockingHttpConnection.java:66)
		at org.eclipse.jetty.server.bio.SocketConnector$ConnectorEndPoint.run(SocketConnector.java:254)
		at org.eclipse.jetty.util.thread.QueuedThreadPool.runJob(QueuedThreadPool.java:599)
		at org.eclipse.jetty.util.thread.QueuedThreadPool$3.run(QueuedThreadPool.java:534)
		at java.lang.Thread.run(Thread.java:679)
	
 C6_STATE=coll:collection2 core:collection2 props:{shard=shard1, roles=null, state=active, core=collection2, collection=collection2, node_name=127.0.0.1:24381_solr, base_url=http://127.0.0.1:24381/solr}
147367 T1735 C6 P24381 oasc.SolrException.log SEVERE Error while trying to recover. core=collection2:org.apache.solr.client.solrj.SolrServerException: IOException occured when talking to server at: http://127.0.0.1:24379/solr
		at org.apache.solr.client.solrj.impl.HttpSolrServer.request(HttpSolrServer.java:414)
		at org.apache.solr.client.solrj.impl.HttpSolrServer.request(HttpSolrServer.java:182)
		at org.apache.solr.cloud.RecoveryStrategy.sendPrepRecoveryCmd(RecoveryStrategy.java:191)
		at org.apache.solr.cloud.RecoveryStrategy.doRecovery(RecoveryStrategy.java:320)
		at org.apache.solr.cloud.RecoveryStrategy.run(RecoveryStrategy.java:212)
	Caused by: org.apache.http.conn.ConnectTimeoutException: Connect to 127.0.0.1:24379 timed out
		at org.apache.http.conn.scheme.PlainSocketFactory.connectSocket(PlainSocketFactory.java:125)
		at org.apache.http.impl.conn.DefaultClientConnectionOperator.openConnection(DefaultClientConnectionOperator.java:148)
		at org.apache.http.impl.conn.AbstractPoolEntry.open(AbstractPoolEntry.java:150)
		at org.apache.http.impl.conn.AbstractPooledConnAdapter.open(AbstractPooledConnAdapter.java:121)
		at org.apache.http.impl.client.DefaultRequestDirector.tryConnect(DefaultRequestDirector.java:575)
		at org.apache.http.impl.client.DefaultRequestDirector.execute(DefaultRequestDirector.java:425)
		at org.apache.http.impl.client.AbstractHttpClient.execute(AbstractHttpClient.java:820)
		at org.apache.http.impl.client.AbstractHttpClient.execute(AbstractHttpClient.java:754)
		at org.apache.http.impl.client.AbstractHttpClient.execute(AbstractHttpClient.java:732)
		at org.apache.solr.client.solrj.impl.HttpSolrServer.request(HttpSolrServer.java:353)
		... 4 more
	
147368 T1735 C6 P24381 oasc.RecoveryStrategy.doRecovery SEVERE Recovery failed - trying again... core=collection2
158311 T1515 oasc.SolrException.log SEVERE http://127.0.0.1:24379/solr/collection3/: Could not tell a replica to recover:org.apache.solr.client.solrj.SolrServerException: IOException occured when talking to server at: http://127.0.0.1:24381/solr
		at org.apache.solr.client.solrj.impl.HttpSolrServer.request(HttpSolrServer.java:414)
		at org.apache.solr.client.solrj.impl.HttpSolrServer.request(HttpSolrServer.java:182)
		at org.apache.solr.cloud.SyncStrategy.requestRecovery(SyncStrategy.java:282)
		at org.apache.solr.cloud.SyncStrategy.syncToMe(SyncStrategy.java:226)
		at org.apache.solr.cloud.SyncStrategy.syncReplicas(SyncStrategy.java:119)
		at org.apache.solr.cloud.SyncStrategy.sync(SyncStrategy.java:85)
		at org.apache.solr.cloud.ShardLeaderElectionContext.runLeaderProcess(ElectionContext.java:180)
		at org.apache.solr.cloud.LeaderElector.runIamLeaderProcess(LeaderElector.java:159)
		at org.apache.solr.cloud.LeaderElector.checkIfIamLeader(LeaderElector.java:103)
		at org.apache.solr.cloud.LeaderElector.access$000(LeaderElector.java:57)
		at org.apache.solr.cloud.LeaderElector$1.process(LeaderElector.java:132)
		at org.apache.zookeeper.ClientCnxn$EventThread.processEvent(ClientCnxn.java:526)
		at org.apache.zookeeper.ClientCnxn$EventThread.run(ClientCnxn.java:502)
	Caused by: org.apache.http.conn.ConnectTimeoutException: Connect to 127.0.0.1:24381 timed out
		at org.apache.http.conn.scheme.PlainSocketFactory.connectSocket(PlainSocketFactory.java:125)
		at org.apache.http.impl.conn.DefaultClientConnectionOperator.openConnection(DefaultClientConnectionOperator.java:148)
		at org.apache.http.impl.conn.AbstractPoolEntry.open(AbstractPoolEntry.java:150)
		at org.apache.http.impl.conn.AbstractPooledConnAdapter.open(AbstractPooledConnAdapter.java:121)
		at org.apache.http.impl.client.DefaultRequestDirector.tryConnect(DefaultRequestDirector.java:575)
		at org.apache.http.impl.client.DefaultRequestDirector.execute(DefaultRequestDirector.java:425)
		at org.apache.http.impl.client.AbstractHttpClient.execute(AbstractHttpClient.java:820)
		at org.apache.http.impl.client.AbstractHttpClient.execute(AbstractHttpClient.java:754)
		at org.apache.http.impl.client.AbstractHttpClient.execute(AbstractHttpClient.java:732)
		at org.apache.solr.client.solrj.impl.HttpSolrServer.request(HttpSolrServer.java:353)
		... 12 more
	
Tests run: 1, Failures: 0, Errors: 0, Skipped: 0, Time elapsed: 158.846 sec
Running org.apache.solr.TestDistributedSearch
Tests run: 1, Failures: 0, Errors: 0, Skipped: 0, Time elapsed: 86.319 sec
Running org.apache.solr.core.TestQuerySenderNoQuery
Creating dataDir: /usr/home/hudson/hudson-slave/workspace/Lucene-Solr-Maven-4.x/maven-build/solr/core/target/test/./solrtest-TestQuerySenderNoQuery-1346505619785
Tests run: 3, Failures: 0, Errors: 0, Skipped: 0, Time elapsed: 0.387 sec
Running org.apache.solr.search.TestSolrQueryParser
Creating dataDir: /usr/home/hudson/hudson-slave/workspace/Lucene-Solr-Maven-4.x/maven-build/solr/core/target/test/./solrtest-TestSolrQueryParser-1346505620171
Tests run: 1, Failures: 0, Errors: 0, Skipped: 0, Time elapsed: 0.468 sec
Running org.apache.solr.spelling.SpellCheckCollatorTest
Creating dataDir: /usr/home/hudson/hudson-slave/workspace/Lucene-Solr-Maven-4.x/maven-build/solr/core/target/test/./solrtest-SpellCheckCollatorTest-1346505620641
Tests run: 7, Failures: 0, Errors: 0, Skipped: 0, Time elapsed: 1.591 sec
Running org.apache.solr.TestJoin
Creating dataDir: /usr/home/hudson/hudson-slave/workspace/Lucene-Solr-Maven-4.x/maven-build/solr/core/target/test/./solrtest-TestJoin-1346505622233
Tests run: 2, Failures: 0, Errors: 0, Skipped: 0, Time elapsed: 4.381 sec
Running org.apache.solr.spelling.IndexBasedSpellCheckerTest
Creating dataDir: /usr/home/hudson/hudson-slave/workspace/Lucene-Solr-Maven-4.x/maven-build/solr/core/target/test/./solrtest-IndexBasedSpellCheckerTest-1346505626614
Tests run: 5, Failures: 0, Errors: 0, Skipped: 0, Time elapsed: 0.743 sec
Running org.apache.solr.update.DocumentBuilderTest
Creating dataDir: /usr/home/hudson/hudson-slave/workspace/Lucene-Solr-Maven-4.x/maven-build/solr/core/target/test/./solrtest-DocumentBuilderTest-1346505627359
Tests run: 11, Failures: 0, Errors: 0, Skipped: 0, Time elapsed: 0.533 sec
Running org.apache.solr.search.TestExtendedDismaxParser
Tests run: 10, Failures: 0, Errors: 0, Skipped: 0, Time elapsed: 4.807 sec
Running org.apache.solr.schema.MultiTermTest
Creating dataDir: /usr/home/hudson/hudson-slave/workspace/Lucene-Solr-Maven-4.x/maven-build/solr/core/target/test/./solrtest-MultiTermTest-1346505632697
Tests run: 3, Failures: 0, Errors: 0, Skipped: 0, Time elapsed: 0.187 sec
Running org.apache.solr.common.params.SolrParamTest
Tests run: 1, Failures: 0, Errors: 0, Skipped: 0, Time elapsed: 0.068 sec
Running org.apache.solr.core.TestQuerySenderListener
Creating dataDir: /usr/home/hudson/hudson-slave/workspace/Lucene-Solr-Maven-4.x/maven-build/solr/core/target/test/./solrtest-TestQuerySenderListener-1346505632961
Tests run: 3, Failures: 0, Errors: 0, Skipped: 0, Time elapsed: 0.385 sec
Running org.apache.solr.util.TestNumberUtils
Tests run: 1, Failures: 0, Errors: 0, Skipped: 0, Time elapsed: 0.278 sec
Running org.apache.solr.analysis.TestReversedWildcardFilterFactory
Creating dataDir: /usr/home/hudson/hudson-slave/workspace/Lucene-Solr-Maven-4.x/maven-build/solr/core/target/test/./solrtest-TestReversedWildcardFilterFactory-1346505633622
Tests run: 4, Failures: 0, Errors: 0, Skipped: 0, Time elapsed: 0.427 sec
Running org.apache.solr.search.similarities.TestDFRSimilarityFactory
Creating dataDir: /usr/home/hudson/hudson-slave/workspace/Lucene-Solr-Maven-4.x/maven-build/solr/core/target/test/./solrtest-TestDFRSimilarityFactory-1346505634050
Tests run: 3, Failures: 0, Errors: 0, Skipped: 0, Time elapsed: 0.113 sec
Running org.apache.solr.analysis.LegacyHTMLStripCharFilterTest
Tests run: 13, Failures: 0, Errors: 0, Skipped: 1, Time elapsed: 0.255 sec
Running org.apache.solr.cloud.ClusterStateTest
Tests run: 1, Failures: 0, Errors: 0, Skipped: 0, Time elapsed: 0.017 sec
Running org.apache.solr.spelling.WordBreakSolrSpellCheckerTest
Creating dataDir: /usr/home/hudson/hudson-slave/workspace/Lucene-Solr-Maven-4.x/maven-build/solr/core/target/test/./solrtest-WordBreakSolrSpellCheckerTest-1346505634439
Tests run: 3, Failures: 0, Errors: 0, Skipped: 0, Time elapsed: 1.26 sec
Running org.apache.solr.schema.PreAnalyzedFieldTest
Tests run: 3, Failures: 0, Errors: 0, Skipped: 0, Time elapsed: 0.025 sec
Running org.apache.solr.TestTrie
Creating dataDir: /usr/home/hudson/hudson-slave/workspace/Lucene-Solr-Maven-4.x/maven-build/solr/core/target/test/./solrtest-TestTrie-1346505635726
Tests run: 8, Failures: 0, Errors: 0, Skipped: 0, Time elapsed: 0.834 sec
Running org.apache.solr.TestGroupingSearch
Creating dataDir: /usr/home/hudson/hudson-slave/workspace/Lucene-Solr-Maven-4.x/maven-build/solr/core/target/test/./solrtest-TestGroupingSearch-1346505636600
Tests run: 12, Failures: 0, Errors: 0, Skipped: 0, Time elapsed: 3.236 sec
Running org.apache.solr.cloud.OverseerTest
Creating dataDir: /usr/home/hudson/hudson-slave/workspace/Lucene-Solr-Maven-4.x/maven-build/solr/core/target/test/./solrtest-OverseerTest-1346505639797
Tests run: 8, Failures: 0, Errors: 0, Skipped: 0, Time elapsed: 36.108 sec
Running org.apache.solr.cloud.ZkControllerTest
Creating dataDir: /usr/home/hudson/hudson-slave/workspace/Lucene-Solr-Maven-4.x/maven-build/solr/core/target/test/./solrtest-ZkControllerTest-1346505675907
Tests run: 2, Failures: 0, Errors: 0, Skipped: 0, Time elapsed: 4.764 sec
Running org.apache.solr.schema.UUIDFieldTest
Tests run: 1, Failures: 0, Errors: 0, Skipped: 0, Time elapsed: 0.021 sec
Running org.apache.solr.DisMaxRequestHandlerTest
Creating dataDir: /usr/home/hudson/hudson-slave/workspace/Lucene-Solr-Maven-4.x/maven-build/solr/core/target/test/./solrtest-DisMaxRequestHandlerTest-1346505680693
Tests run: 2, Failures: 0, Errors: 0, Skipped: 0, Time elapsed: 0.589 sec
Running org.apache.solr.core.RequestHandlersTest
Creating dataDir: /usr/home/hudson/hudson-slave/workspace/Lucene-Solr-Maven-4.x/maven-build/solr/core/target/test/./solrtest-RequestHandlersTest-1346505681283
Tests run: 3, Failures: 0, Errors: 0, Skipped: 0, Time elapsed: 0.538 sec
Running org.apache.solr.search.TestValueSourceCache
Creating dataDir: /usr/home/hudson/hudson-slave/workspace/Lucene-Solr-Maven-4.x/maven-build/solr/core/target/test/./solrtest-TestValueSourceCache-1346505681823
Tests run: 2, Failures: 0, Errors: 0, Skipped: 0, Time elapsed: 0.535 sec
Running org.apache.solr.handler.admin.LukeRequestHandlerTest
Tests run: 3, Failures: 0, Errors: 0, Skipped: 0, Time elapsed: 1.381 sec
Running org.apache.solr.handler.component.SpellCheckComponentTest
Creating dataDir: /usr/home/hudson/hudson-slave/workspace/Lucene-Solr-Maven-4.x/maven-build/solr/core/target/test/./solrtest-SpellCheckComponentTest-1346505683741
Tests run: 9, Failures: 0, Errors: 0, Skipped: 0, Time elapsed: 6.01 sec
Running org.apache.solr.cloud.FullSolrCloudDistribCmdsTest
Creating dataDir: /usr/home/hudson/hudson-slave/workspace/Lucene-Solr-Maven-4.x/maven-build/solr/core/target/test/./solrtest-FullSolrCloudDistribCmdsTest-1346505689760
ASYNC  NEW_CORE C9 name=collection1 org.apache.solr.core.SolrCore@4ebe713f url=http://127.0.0.1:27510/solr/collection1 node=127.0.0.1:27510_solr
35691 T2515 C9 P27510 oasc.SolrException.log SEVERE java.lang.RuntimeException: No registered leader was found, collection:collection1 slice:shard1
		at org.apache.solr.common.cloud.ZkStateReader.getLeaderProps(ZkStateReader.java:413)
		at org.apache.solr.common.cloud.ZkStateReader.getLeaderProps(ZkStateReader.java:399)
		at org.apache.solr.update.processor.DistributedUpdateProcessor.setupRequest(DistributedUpdateProcessor.java:189)
		at org.apache.solr.update.processor.DistributedUpdateProcessor.processAdd(DistributedUpdateProcessor.java:333)
		at org.apache.solr.handler.loader.XMLLoader.processUpdate(XMLLoader.java:230)
		at org.apache.solr.handler.loader.XMLLoader.load(XMLLoader.java:157)
		at org.apache.solr.handler.UpdateRequestHandler$1.load(UpdateRequestHandler.java:92)
		at org.apache.solr.handler.ContentStreamHandlerBase.handleRequestBody(ContentStreamHandlerBase.java:74)
		at org.apache.solr.handler.RequestHandlerBase.handleRequest(RequestHandlerBase.java:129)
		at org.apache.solr.core.SolrCore.execute(SolrCore.java:1692)
		at org.apache.solr.servlet.SolrDispatchFilter.execute(SolrDispatchFilter.java:454)
		at org.apache.solr.servlet.SolrDispatchFilter.doFilter(SolrDispatchFilter.java:275)
		at org.eclipse.jetty.servlet.ServletHandler$CachedChain.doFilter(ServletHandler.java:1337)
		at org.eclipse.jetty.servlet.ServletHandler.doHandle(ServletHandler.java:484)
		at org.eclipse.jetty.server.session.SessionHandler.doHandle(SessionHandler.java:231)
		at org.eclipse.jetty.server.handler.ScopedHandler.handle(ScopedHandler.java:119)
		at org.eclipse.jetty.server.handler.GzipHandler.handle(GzipHandler.java:267)
		at org.eclipse.jetty.server.handler.ContextHandler.doHandle(ContextHandler.java:1067)
		at org.eclipse.jetty.servlet.ServletHandler.doScope(ServletHandler.java:413)
		at org.eclipse.jetty.server.session.SessionHandler.doScope(SessionHandler.java:192)
		at org.eclipse.jetty.server.handler.ContextHandler.doScope(ContextHandler.java:999)
		at org.eclipse.jetty.server.handler.ScopedHandler.handle(ScopedHandler.java:117)
		at org.eclipse.jetty.server.handler.HandlerWrapper.handle(HandlerWrapper.java:111)
		at org.eclipse.jetty.server.Server.handle(Server.java:351)
		at org.eclipse.jetty.server.AbstractHttpConnection.handleRequest(AbstractHttpConnection.java:454)
		at org.eclipse.jetty.server.BlockingHttpConnection.handleRequest(BlockingHttpConnection.java:47)
		at org.eclipse.jetty.server.AbstractHttpConnection.content(AbstractHttpConnection.java:900)
		at org.eclipse.jetty.server.AbstractHttpConnection$RequestHandler.content(AbstractHttpConnection.java:954)
		at org.eclipse.jetty.http.HttpParser.parseNext(HttpParser.java:952)
		at org.eclipse.jetty.http.HttpParser.parseAvailable(HttpParser.java:235)
		at org.eclipse.jetty.server.BlockingHttpConnection.handle(BlockingHttpConnection.java:66)
		at org.eclipse.jetty.server.bio.SocketConnector$ConnectorEndPoint.run(SocketConnector.java:254)
		at org.eclipse.jetty.util.thread.QueuedThreadPool.runJob(QueuedThreadPool.java:599)
		at org.eclipse.jetty.util.thread.QueuedThreadPool$3.run(QueuedThreadPool.java:534)
		at java.lang.Thread.run(Thread.java:679)
	
35692 T2515 C9 P27510 oasc.SolrException.log SEVERE null:java.lang.RuntimeException: No registered leader was found, collection:collection1 slice:shard1
		at org.apache.solr.common.cloud.ZkStateReader.getLeaderProps(ZkStateReader.java:413)
		at org.apache.solr.common.cloud.ZkStateReader.getLeaderProps(ZkStateReader.java:399)
		at org.apache.solr.update.processor.DistributedUpdateProcessor.setupRequest(DistributedUpdateProcessor.java:189)
		at org.apache.solr.update.processor.DistributedUpdateProcessor.processAdd(DistributedUpdateProcessor.java:333)
		at org.apache.solr.handler.loader.XMLLoader.processUpdate(XMLLoader.java:230)
		at org.apache.solr.handler.loader.XMLLoader.load(XMLLoader.java:157)
		at org.apache.solr.handler.UpdateRequestHandler$1.load(UpdateRequestHandler.java:92)
		at org.apache.solr.handler.ContentStreamHandlerBase.handleRequestBody(ContentStreamHandlerBase.java:74)
		at org.apache.solr.handler.RequestHandlerBase.handleRequest(RequestHandlerBase.java:129)
		at org.apache.solr.core.SolrCore.execute(SolrCore.java:1692)
		at org.apache.solr.servlet.SolrDispatchFilter.execute(SolrDispatchFilter.java:454)
		at org.apache.solr.servlet.SolrDispatchFilter.doFilter(SolrDispatchFilter.java:275)
		at org.eclipse.jetty.servlet.ServletHandler$CachedChain.doFilter(ServletHandler.java:1337)
		at org.eclipse.jetty.servlet.ServletHandler.doHandle(ServletHandler.java:484)
		at org.eclipse.jetty.server.session.SessionHandler.doHandle(SessionHandler.java:231)
		at org.eclipse.jetty.server.handler.ScopedHandler.handle(ScopedHandler.java:119)
		at org.eclipse.jetty.server.handler.GzipHandler.handle(GzipHandler.java:267)
		at org.eclipse.jetty.server.handler.ContextHandler.doHandle(ContextHandler.java:1067)
		at org.eclipse.jetty.servlet.ServletHandler.doScope(ServletHandler.java:413)
		at org.eclipse.jetty.server.session.SessionHandler.doScope(SessionHandler.java:192)
		at org.eclipse.jetty.server.handler.ContextHandler.doScope(ContextHandler.java:999)
		at org.eclipse.jetty.server.handler.ScopedHandler.handle(ScopedHandler.java:117)
		at org.eclipse.jetty.server.handler.HandlerWrapper.handle(HandlerWrapper.java:111)
		at org.eclipse.jetty.server.Server.handle(Server.java:351)
		at org.eclipse.jetty.server.AbstractHttpConnection.handleRequest(AbstractHttpConnection.java:454)
		at org.eclipse.jetty.server.BlockingHttpConnection.handleRequest(BlockingHttpConnection.java:47)
		at org.eclipse.jetty.server.AbstractHttpConnection.content(AbstractHttpConnection.java:900)
		at org.eclipse.jetty.server.AbstractHttpConnection$RequestHandler.content(AbstractHttpConnection.java:954)
		at org.eclipse.jetty.http.HttpParser.parseNext(HttpParser.java:952)
		at org.eclipse.jetty.http.HttpParser.parseAvailable(HttpParser.java:235)
		at org.eclipse.jetty.server.BlockingHttpConnection.handle(BlockingHttpConnection.java:66)
		at org.eclipse.jetty.server.bio.SocketConnector$ConnectorEndPoint.run(SocketConnector.java:254)
		at org.eclipse.jetty.util.thread.QueuedThreadPool.runJob(QueuedThreadPool.java:599)
		at org.eclipse.jetty.util.thread.QueuedThreadPool$3.run(QueuedThreadPool.java:534)
		at java.lang.Thread.run(Thread.java:679)
	
ASYNC  NEW_CORE C10 name=collection1 org.apache.solr.core.SolrCore@df1b3b7 url=http://127.0.0.1:27505/solr/collection1 node=127.0.0.1:27505_solr
35839 T2486 C10 P27505 oasc.SolrException.log SEVERE null:org.eclipse.jetty.io.EofException
		at org.eclipse.jetty.server.HttpOutput.write(HttpOutput.java:154)
		at org.eclipse.jetty.server.HttpOutput.write(HttpOutput.java:101)
		at org.apache.solr.common.util.FastOutputStream.flush(FastOutputStream.java:204)
		at org.apache.solr.common.util.FastOutputStream.flushBuffer(FastOutputStream.java:197)
		at org.apache.solr.common.util.JavaBinCodec.marshal(JavaBinCodec.java:94)
		at org.apache.solr.response.BinaryResponseWriter.write(BinaryResponseWriter.java:49)
		at org.apache.solr.servlet.SolrDispatchFilter.writeResponse(SolrDispatchFilter.java:403)
		at org.apache.solr.servlet.SolrDispatchFilter.doFilter(SolrDispatchFilter.java:288)
		at org.eclipse.jetty.servlet.ServletHandler$CachedChain.doFilter(ServletHandler.java:1337)
		at org.eclipse.jetty.servlet.ServletHandler.doHandle(ServletHandler.java:484)
		at org.eclipse.jetty.server.session.SessionHandler.doHandle(SessionHandler.java:231)
		at org.eclipse.jetty.server.handler.ScopedHandler.handle(ScopedHandler.java:119)
		at org.eclipse.jetty.server.handler.GzipHandler.handle(GzipHandler.java:267)
		at org.eclipse.jetty.server.handler.ContextHandler.doHandle(ContextHandler.java:1067)
		at org.eclipse.jetty.servlet.ServletHandler.doScope(ServletHandler.java:413)
		at org.eclipse.jetty.server.session.SessionHandler.doScope(SessionHandler.java:192)
		at org.eclipse.jetty.server.handler.ContextHandler.doScope(ContextHandler.java:999)
		at org.eclipse.jetty.server.handler.ScopedHandler.handle(ScopedHandler.java:117)
		at org.eclipse.jetty.server.handler.HandlerWrapper.handle(HandlerWrapper.java:111)
		at org.eclipse.jetty.server.Server.handle(Server.java:351)
		at org.eclipse.jetty.server.AbstractHttpConnection.handleRequest(AbstractHttpConnection.java:454)
		at org.eclipse.jetty.server.BlockingHttpConnection.handleRequest(BlockingHttpConnection.java:47)
		at org.eclipse.jetty.server.AbstractHttpConnection.content(AbstractHttpConnection.java:900)
		at org.eclipse.jetty.server.AbstractHttpConnection$RequestHandler.content(AbstractHttpConnection.java:954)
		at org.eclipse.jetty.http.HttpParser.parseNext(HttpParser.java:952)
		at org.eclipse.jetty.http.HttpParser.parseAvailable(HttpParser.java:235)
		at org.eclipse.jetty.server.BlockingHttpConnection.handle(BlockingHttpConnection.java:66)
		at org.eclipse.jetty.server.bio.SocketConnector$ConnectorEndPoint.run(SocketConnector.java:254)
		at org.eclipse.jetty.util.thread.QueuedThreadPool.runJob(QueuedThreadPool.java:599)
		at org.eclipse.jetty.util.thread.QueuedThreadPool$3.run(QueuedThreadPool.java:534)
		at java.lang.Thread.run(Thread.java:679)
	
35841 T2486 C10 P27505 oasc.SolrException.log SEVERE null:org.eclipse.jetty.io.EofException
		at org.eclipse.jetty.server.HttpOutput.write(HttpOutput.java:154)
		at org.eclipse.jetty.server.HttpOutput.write(HttpOutput.java:101)
		at org.apache.solr.common.util.FastOutputStream.flush(FastOutputStream.java:204)
		at org.apache.solr.common.util.FastOutputStream.flushBuffer(FastOutputStream.java:197)
		at org.apache.solr.common.util.JavaBinCodec.marshal(JavaBinCodec.java:94)
		at org.apache.solr.response.BinaryResponseWriter.write(BinaryResponseWriter.java:49)
		at org.apache.solr.servlet.SolrDispatchFilter.writeResponse(SolrDispatchFilter.java:403)
		at org.apache.solr.servlet.SolrDispatchFilter.doFilter(SolrDispatchFilter.java:288)
		at org.eclipse.jetty.servlet.ServletHandler$CachedChain.doFilter(ServletHandler.java:1337)
		at org.eclipse.jetty.servlet.ServletHandler.doHandle(ServletHandler.java:484)
		at org.eclipse.jetty.server.session.SessionHandler.doHandle(SessionHandler.java:231)
		at org.eclipse.jetty.server.handler.ScopedHandler.handle(ScopedHandler.java:119)
		at org.eclipse.jetty.server.handler.GzipHandler.handle(GzipHandler.java:267)
		at org.eclipse.jetty.server.handler.ContextHandler.doHandle(ContextHandler.java:1067)
		at org.eclipse.jetty.servlet.ServletHandler.doScope(ServletHandler.java:413)
		at org.eclipse.jetty.server.session.SessionHandler.doScope(SessionHandler.java:192)
		at org.eclipse.jetty.server.handler.ContextHandler.doScope(ContextHandler.java:999)
		at org.eclipse.jetty.server.handler.ScopedHandler.handle(ScopedHandler.java:117)
		at org.eclipse.jetty.server.handler.HandlerWrapper.handle(HandlerWrapper.java:111)
		at org.eclipse.jetty.server.Server.handle(Server.java:351)
		at org.eclipse.jetty.server.AbstractHttpConnection.handleRequest(AbstractHttpConnection.java:454)
		at org.eclipse.jetty.server.BlockingHttpConnection.handleRequest(BlockingHttpConnection.java:47)
		at org.eclipse.jetty.server.AbstractHttpConnection.content(AbstractHttpConnection.java:900)
		at org.eclipse.jetty.server.AbstractHttpConnection$RequestHandler.content(AbstractHttpConnection.java:954)
		at org.eclipse.jetty.http.HttpParser.parseNext(HttpParser.java:952)
		at org.eclipse.jetty.http.HttpParser.parseAvailable(HttpParser.java:235)
		at org.eclipse.jetty.server.BlockingHttpConnection.handle(BlockingHttpConnection.java:66)
		at org.eclipse.jetty.server.bio.SocketConnector$ConnectorEndPoint.run(SocketConnector.java:254)
		at org.eclipse.jetty.util.thread.QueuedThreadPool.runJob(QueuedThreadPool.java:599)
		at org.eclipse.jetty.util.thread.QueuedThreadPool$3.run(QueuedThreadPool.java:534)
		at java.lang.Thread.run(Thread.java:679)
	
49556 T2506 oasc.SolrException.log SEVERE Sync request error: org.apache.solr.client.solrj.SolrServerException: IOException occured when talking to server at: http://127.0.0.1:27503/solr/collection1
65802 T2519 oasc.SolrException.log SEVERE Sync request error: org.apache.solr.client.solrj.SolrServerException: IOException occured when talking to server at: http://127.0.0.1:27505/solr/collection1
94566 T2506 oasc.SolrException.log SEVERE http://127.0.0.1:27507/solr/collection1/: Could not tell a replica to recover:org.apache.solr.client.solrj.SolrServerException: IOException occured when talking to server at: http://127.0.0.1:27503/solr
		at org.apache.solr.client.solrj.impl.HttpSolrServer.request(HttpSolrServer.java:414)
		at org.apache.solr.client.solrj.impl.HttpSolrServer.request(HttpSolrServer.java:182)
		at org.apache.solr.cloud.SyncStrategy.requestRecovery(SyncStrategy.java:282)
		at org.apache.solr.cloud.SyncStrategy.syncToMe(SyncStrategy.java:226)
		at org.apache.solr.cloud.SyncStrategy.syncReplicas(SyncStrategy.java:119)
		at org.apache.solr.cloud.SyncStrategy.sync(SyncStrategy.java:85)
		at org.apache.solr.cloud.ShardLeaderElectionContext.runLeaderProcess(ElectionContext.java:180)
		at org.apache.solr.cloud.LeaderElector.runIamLeaderProcess(LeaderElector.java:159)
		at org.apache.solr.cloud.LeaderElector.checkIfIamLeader(LeaderElector.java:103)
		at org.apache.solr.cloud.LeaderElector.access$000(LeaderElector.java:57)
		at org.apache.solr.cloud.LeaderElector$1.process(LeaderElector.java:132)
		at org.apache.zookeeper.ClientCnxn$EventThread.processEvent(ClientCnxn.java:526)
		at org.apache.zookeeper.ClientCnxn$EventThread.run(ClientCnxn.java:502)
	Caused by: org.apache.http.conn.ConnectTimeoutException: Connect to 127.0.0.1:27503 timed out
		at org.apache.http.conn.scheme.PlainSocketFactory.connectSocket(PlainSocketFactory.java:125)
		at org.apache.http.impl.conn.DefaultClientConnectionOperator.openConnection(DefaultClientConnectionOperator.java:148)
		at org.apache.http.impl.conn.AbstractPoolEntry.open(AbstractPoolEntry.java:150)
		at org.apache.http.impl.conn.AbstractPooledConnAdapter.open(AbstractPooledConnAdapter.java:121)
		at org.apache.http.impl.client.DefaultRequestDirector.tryConnect(DefaultRequestDirector.java:575)
		at org.apache.http.impl.client.DefaultRequestDirector.execute(DefaultRequestDirector.java:425)
		at org.apache.http.impl.client.AbstractHttpClient.execute(AbstractHttpClient.java:820)
		at org.apache.http.impl.client.AbstractHttpClient.execute(AbstractHttpClient.java:754)
		at org.apache.http.impl.client.AbstractHttpClient.execute(AbstractHttpClient.java:732)
		at org.apache.solr.client.solrj.impl.HttpSolrServer.request(HttpSolrServer.java:353)
		... 12 more
	
110812 T2519 oasc.SolrException.log SEVERE http://127.0.0.1:27510/solr/collection1/: Could not tell a replica to recover:org.apache.solr.client.solrj.SolrServerException: IOException occured when talking to server at: http://127.0.0.1:27505/solr
		at org.apache.solr.client.solrj.impl.HttpSolrServer.request(HttpSolrServer.java:414)
		at org.apache.solr.client.solrj.impl.HttpSolrServer.request(HttpSolrServer.java:182)
		at org.apache.solr.cloud.SyncStrategy.requestRecovery(SyncStrategy.java:282)
		at org.apache.solr.cloud.SyncStrategy.syncToMe(SyncStrategy.java:226)
		at org.apache.solr.cloud.SyncStrategy.syncReplicas(SyncStrategy.java:119)
		at org.apache.solr.cloud.SyncStrategy.sync(SyncStrategy.java:85)
		at org.apache.solr.cloud.ShardLeaderElectionContext.runLeaderProcess(ElectionContext.java:180)
		at org.apache.solr.cloud.LeaderElector.runIamLeaderProcess(LeaderElector.java:159)
		at org.apache.solr.cloud.LeaderElector.checkIfIamLeader(LeaderElector.java:103)
		at org.apache.solr.cloud.LeaderElector.access$000(LeaderElector.java:57)
		at org.apache.solr.cloud.LeaderElector$1.process(LeaderElector.java:132)
		at org.apache.zookeeper.ClientCnxn$EventThread.processEvent(ClientCnxn.java:526)
		at org.apache.zookeeper.ClientCnxn$EventThread.run(ClientCnxn.java:502)
	Caused by: org.apache.http.conn.ConnectTimeoutException: Connect to 127.0.0.1:27505 timed out
		at org.apache.http.conn.scheme.PlainSocketFactory.connectSocket(PlainSocketFactory.java:125)
		at org.apache.http.impl.conn.DefaultClientConnectionOperator.openConnection(DefaultClientConnectionOperator.java:148)
		at org.apache.http.impl.conn.AbstractPoolEntry.open(AbstractPoolEntry.java:150)
		at org.apache.http.impl.conn.AbstractPooledConnAdapter.open(AbstractPooledConnAdapter.java:121)
		at org.apache.http.impl.client.DefaultRequestDirector.tryConnect(DefaultRequestDirector.java:575)
		at org.apache.http.impl.client.DefaultRequestDirector.execute(DefaultRequestDirector.java:425)
		at org.apache.http.impl.client.AbstractHttpClient.execute(AbstractHttpClient.java:820)
		at org.apache.http.impl.client.AbstractHttpClient.execute(AbstractHttpClient.java:754)
		at org.apache.http.impl.client.AbstractHttpClient.execute(AbstractHttpClient.java:732)
		at org.apache.solr.client.solrj.impl.HttpSolrServer.request(HttpSolrServer.java:353)
		... 12 more
	
Tests run: 1, Failures: 0, Errors: 0, Skipped: 0, Time elapsed: 111.393 sec
Running org.apache.solr.client.solrj.embedded.SolrExampleJettyTest
Creating dataDir: /usr/home/hudson/hudson-slave/workspace/Lucene-Solr-Maven-4.x/maven-build/solr/core/target/test/./solrtest-SolrExampleJettyTest-1346505801148
ASYNC  NEW_CORE C11 name=collection1 org.apache.solr.core.SolrCore@9ed21b6
4295 T2561 C11 oasc.SolrException.log SEVERE org.apache.solr.common.SolrException: Document contains multiple values for uniqueKey field: id=[DOCID, DOCID2]
		at org.apache.solr.update.AddUpdateCommand.getIndexedId(AddUpdateCommand.java:91)
		at org.apache.solr.update.processor.DistributedUpdateProcessor.versionAdd(DistributedUpdateProcessor.java:460)
		at org.apache.solr.update.processor.DistributedUpdateProcessor.processAdd(DistributedUpdateProcessor.java:342)
		at org.apache.solr.handler.loader.XMLLoader.processUpdate(XMLLoader.java:230)
		at org.apache.solr.handler.loader.XMLLoader.load(XMLLoader.java:157)
		at org.apache.solr.handler.UpdateRequestHandler$1.load(UpdateRequestHandler.java:92)
		at org.apache.solr.handler.ContentStreamHandlerBase.handleRequestBody(ContentStreamHandlerBase.java:74)
		at org.apache.solr.handler.RequestHandlerBase.handleRequest(RequestHandlerBase.java:129)
		at org.apache.solr.core.SolrCore.execute(SolrCore.java:1692)
		at org.apache.solr.servlet.SolrDispatchFilter.execute(SolrDispatchFilter.java:454)
		at org.apache.solr.servlet.SolrDispatchFilter.doFilter(SolrDispatchFilter.java:275)
		at org.eclipse.jetty.servlet.ServletHandler$CachedChain.doFilter(ServletHandler.java:1337)
		at org.eclipse.jetty.servlet.ServletHandler.doHandle(ServletHandler.java:484)
		at org.eclipse.jetty.server.session.SessionHandler.doHandle(SessionHandler.java:231)
		at org.eclipse.jetty.server.handler.ScopedHandler.handle(ScopedHandler.java:119)
		at org.eclipse.jetty.server.handler.GzipHandler.handle(GzipHandler.java:267)
		at org.eclipse.jetty.server.handler.ContextHandler.doHandle(ContextHandler.java:1067)
		at org.eclipse.jetty.servlet.ServletHandler.doScope(ServletHandler.java:413)
		at org.eclipse.jetty.server.session.SessionHandler.doScope(SessionHandler.java:192)
		at org.eclipse.jetty.server.handler.ContextHandler.doScope(ContextHandler.java:999)
		at org.eclipse.jetty.server.handler.ScopedHandler.handle(ScopedHandler.java:117)
		at org.eclipse.jetty.server.handler.HandlerWrapper.handle(HandlerWrapper.java:111)
		at org.eclipse.jetty.server.Server.handle(Server.java:351)
		at org.eclipse.jetty.server.AbstractHttpConnection.handleRequest(AbstractHttpConnection.java:454)
		at org.eclipse.jetty.server.BlockingHttpConnection.handleRequest(BlockingHttpConnection.java:47)
		at org.eclipse.jetty.server.AbstractHttpConnection.content(AbstractHttpConnection.java:900)
		at org.eclipse.jetty.server.AbstractHttpConnection$RequestHandler.content(AbstractHttpConnection.java:954)
		at org.eclipse.jetty.http.HttpParser.parseNext(HttpParser.java:952)
		at org.eclipse.jetty.http.HttpParser.parseAvailable(HttpParser.java:235)
		at org.eclipse.jetty.server.BlockingHttpConnection.handle(BlockingHttpConnection.java:66)
		at org.eclipse.jetty.server.bio.SocketConnector$ConnectorEndPoint.run(SocketConnector.java:254)
		at org.eclipse.jetty.util.thread.QueuedThreadPool.runJob(QueuedThreadPool.java:599)
		at org.eclipse.jetty.util.thread.QueuedThreadPool$3.run(QueuedThreadPool.java:534)
		at java.lang.Thread.run(Thread.java:679)
	
Tests run: 23, Failures: 0, Errors: 0, Skipped: 0, Time elapsed: 4.518 sec
Running org.apache.solr.update.DirectUpdateHandlerTest
Creating dataDir: /usr/home/hudson/hudson-slave/workspace/Lucene-Solr-Maven-4.x/maven-build/solr/core/target/test/./solrtest-DirectUpdateHandlerTest-1346505805665
Creating dataDir: /usr/home/hudson/hudson-slave/workspace/Lucene-Solr-Maven-4.x/maven-build/solr/core/target/test/./solrtest-DirectUpdateHandlerTest-1346505806114
Creating dataDir: /usr/home/hudson/hudson-slave/workspace/Lucene-Solr-Maven-4.x/maven-build/solr/core/target/test/./solrtest-DirectUpdateHandlerTest-1346505806742
Tests run: 6, Failures: 0, Errors: 0, Skipped: 0, Time elapsed: 1.753 sec
Running org.apache.solr.internal.csv.CSVUtilsTest
Tests run: 14, Failures: 0, Errors: 0, Skipped: 0, Time elapsed: 0.004 sec
Running org.apache.solr.update.SoftAutoCommitTest
Tests run: 3, Failures: 0, Errors: 0, Skipped: 0, Time elapsed: 9.048 sec
Running org.apache.solr.core.TestSolrDeletionPolicy2
Creating dataDir: /usr/home/hudson/hudson-slave/workspace/Lucene-Solr-Maven-4.x/maven-build/solr/core/target/test/./solrtest-TestSolrDeletionPolicy2-1346505816471
Tests run: 1, Failures: 0, Errors: 0, Skipped: 0, Time elapsed: 0.436 sec
Running org.apache.solr.search.TestRealTimeGet
Creating dataDir: /usr/home/hudson/hudson-slave/workspace/Lucene-Solr-Maven-4.x/maven-build/solr/core/target/test/./solrtest-TestRealTimeGet-1346505816909
Tests run: 4, Failures: 0, Errors: 0, Skipped: 0, Time elapsed: 2.339 sec
Running org.apache.solr.analysis.TestCharFilters
Creating dataDir: /usr/home/hudson/hudson-slave/workspace/Lucene-Solr-Maven-4.x/maven-build/solr/core/target/test/./solrtest-TestCharFilters-1346505819249
Tests run: 2, Failures: 0, Errors: 0, Skipped: 0, Time elapsed: 0.139 sec
Running org.apache.solr.schema.PolyFieldTest
Creating dataDir: /usr/home/hudson/hudson-slave/workspace/Lucene-Solr-Maven-4.x/maven-build/solr/core/target/test/./solrtest-PolyFieldTest-1346505819388
Tests run: 4, Failures: 0, Errors: 0, Skipped: 0, Time elapsed: 0.683 sec
Running org.apache.solr.handler.admin.CoreAdminHandlerTest
Creating dataDir: /usr/home/hudson/hudson-slave/workspace/Lucene-Solr-Maven-4.x/maven-build/solr/core/target/test/./solrtest-CoreAdminHandlerTest-1346505820070
Tests run: 1, Failures: 0, Errors: 0, Skipped: 0, Time elapsed: 0.942 sec
Running org.apache.solr.update.TestUpdate
Creating dataDir: /usr/home/hudson/hudson-slave/workspace/Lucene-Solr-Maven-4.x/maven-build/solr/core/target/test/./solrtest-TestUpdate-1346505821013
Tests run: 1, Failures: 0, Errors: 0, Skipped: 0, Time elapsed: 0.511 sec
Running org.apache.solr.update.processor.UpdateRequestProcessorFactoryTest
Tests run: 2, Failures: 0, Errors: 0, Skipped: 0, Time elapsed: 0.524 sec
Running org.apache.solr.core.TestArbitraryIndexDir
Tests run: 1, Failures: 0, Errors: 0, Skipped: 0, Time elapsed: 0.424 sec
Running org.apache.solr.update.SolrIndexConfigTest
Tests run: 2, Failures: 0, Errors: 0, Skipped: 0, Time elapsed: 0.389 sec
Running org.apache.solr.update.processor.UniqFieldsUpdateProcessorFactoryTest
Creating dataDir: /usr/home/hudson/hudson-slave/workspace/Lucene-Solr-Maven-4.x/maven-build/solr/core/target/test/./solrtest-UniqFieldsUpdateProcessorFactoryTest-1346505822864
Tests run: 1, Failures: 0, Errors: 0, Skipped: 0, Time elapsed: 0.469 sec
Running org.apache.solr.spelling.FileBasedSpellCheckerTest
Creating dataDir: /usr/home/hudson/hudson-slave/workspace/Lucene-Solr-Maven-4.x/maven-build/solr/core/target/test/./solrtest-FileBasedSpellCheckerTest-1346505823339
Tests run: 3, Failures: 0, Errors: 0, Skipped: 0, Time elapsed: 0.644 sec
Running org.apache.solr.search.similarities.TestIBSimilarityFactory
Creating dataDir: /usr/home/hudson/hudson-slave/workspace/Lucene-Solr-Maven-4.x/maven-build/solr/core/target/test/./solrtest-TestIBSimilarityFactory-1346505823978
Tests run: 2, Failures: 0, Errors: 0, Skipped: 0, Time elapsed: 0.097 sec
Running org.apache.solr.handler.component.BadComponentTest
Creating dataDir: /usr/home/hudson/hudson-slave/workspace/Lucene-Solr-Maven-4.x/maven-build/solr/core/target/test/./solrtest-BadComponentTest-1346505824077
Tests run: 1, Failures: 0, Errors: 0, Skipped: 0, Time elapsed: 0.339 sec
Running org.apache.solr.common.SolrDocumentTest
Tests run: 5, Failures: 0, Errors: 0, Skipped: 0, Time elapsed: 0.094 sec
Running org.apache.solr.core.SOLR749Test
Creating dataDir: /usr/home/hudson/hudson-slave/workspace/Lucene-Solr-Maven-4.x/maven-build/solr/core/target/test/./solrtest-SOLR749Test-1346505824510
Tests run: 1, Failures: 0, Errors: 0, Skipped: 0, Time elapsed: 0.415 sec
Running org.apache.solr.handler.admin.MBeansHandlerTest
Creating dataDir: /usr/home/hudson/hudson-slave/workspace/Lucene-Solr-Maven-4.x/maven-build/solr/core/target/test/./solrtest-MBeansHandlerTest-1346505824927
Tests run: 1, Failures: 0, Errors: 0, Skipped: 0, Time elapsed: 0.487 sec
Running org.apache.solr.search.TestStressLucene
Tests run: 1, Failures: 0, Errors: 0, Skipped: 0, Time elapsed: 1.258 sec
Running org.apache.solr.handler.component.SearchHandlerTest
Creating dataDir: /usr/home/hudson/hudson-slave/workspace/Lucene-Solr-Maven-4.x/maven-build/solr/core/target/test/./solrtest-SearchHandlerTest-1346505826674
Tests run: 1, Failures: 0, Errors: 0, Skipped: 0, Time elapsed: 0.466 sec
Running org.apache.solr.client.solrj.impl.HttpClientUtilTest
Tests run: 3, Failures: 0, Errors: 0, Skipped: 0, Time elapsed: 0.044 sec
Running org.apache.solr.search.TestSort
Creating dataDir: /usr/home/hudson/hudson-slave/workspace/Lucene-Solr-Maven-4.x/maven-build/solr/core/target/test/./solrtest-TestSort-1346505827185
Tests run: 2, Failures: 0, Errors: 0, Skipped: 0, Time elapsed: 3.044 sec
Running org.apache.solr.common.params.ModifiableSolrParamsTest
Tests run: 5, Failures: 0, Errors: 0, Skipped: 0, Time elapsed: 0.032 sec
Running org.apache.solr.client.solrj.SolrQueryTest
Tests run: 9, Failures: 0, Errors: 0, Skipped: 0, Time elapsed: 0.052 sec
Running org.apache.solr.search.TestStressVersions
Creating dataDir: /usr/home/hudson/hudson-slave/workspace/Lucene-Solr-Maven-4.x/maven-build/solr/core/target/test/./solrtest-TestStressVersions-1346505830311
Tests run: 1, Failures: 0, Errors: 0, Skipped: 0, Time elapsed: 2.183 sec
Running org.apache.solr.client.solrj.util.ClientUtilsTest
Tests run: 1, Failures: 0, Errors: 0, Skipped: 0, Time elapsed: 0.067 sec
Running org.apache.solr.update.processor.SignatureUpdateProcessorFactoryTest
Creating dataDir: /usr/home/hudson/hudson-slave/workspace/Lucene-Solr-Maven-4.x/maven-build/solr/core/target/test/./solrtest-SignatureUpdateProcessorFactoryTest-1346505832567
Tests run: 6, Failures: 0, Errors: 0, Skipped: 0, Time elapsed: 0.819 sec
Running org.apache.solr.client.solrj.SolrExampleBinaryTest
Creating dataDir: /usr/home/hudson/hudson-slave/workspace/Lucene-Solr-Maven-4.x/maven-build/solr/core/target/test/./solrtest-SolrExampleBinaryTest-1346505833389
ASYNC  NEW_CORE C12 name=collection1 org.apache.solr.core.SolrCore@bd404e8
685 T2788 C12 oasc.SolrException.log SEVERE org.apache.solr.common.SolrException: Document contains multiple values for uniqueKey field: id=[DOCID, DOCID2]
		at org.apache.solr.update.AddUpdateCommand.getIndexedId(AddUpdateCommand.java:91)
		at org.apache.solr.update.processor.DistributedUpdateProcessor.versionAdd(DistributedUpdateProcessor.java:460)
		at org.apache.solr.update.processor.DistributedUpdateProcessor.processAdd(DistributedUpdateProcessor.java:342)
		at org.apache.solr.handler.loader.JavabinLoader$1.update(JavabinLoader.java:86)
		at org.apache.solr.client.solrj.request.JavaBinUpdateRequestCodec$1.readOuterMostDocIterator(JavaBinUpdateRequestCodec.java:140)
		at org.apache.solr.client.solrj.request.JavaBinUpdateRequestCodec$1.readIterator(JavaBinUpdateRequestCodec.java:120)
		at org.apache.solr.common.util.JavaBinCodec.readVal(JavaBinCodec.java:221)
		at org.apache.solr.client.solrj.request.JavaBinUpdateRequestCodec$1.readNamedList(JavaBinUpdateRequestCodec.java:105)
		at org.apache.solr.common.util.JavaBinCodec.readVal(JavaBinCodec.java:186)
		at org.apache.solr.common.util.JavaBinCodec.unmarshal(JavaBinCodec.java:112)
		at org.apache.solr.client.solrj.request.JavaBinUpdateRequestCodec.unmarshal(JavaBinUpdateRequestCodec.java:147)
		at org.apache.solr.handler.loader.JavabinLoader.parseAndLoadDocs(JavabinLoader.java:96)
		at org.apache.solr.handler.loader.JavabinLoader.load(JavabinLoader.java:55)
		at org.apache.solr.handler.UpdateRequestHandler$1.load(UpdateRequestHandler.java:92)
		at org.apache.solr.handler.ContentStreamHandlerBase.handleRequestBody(ContentStreamHandlerBase.java:74)
		at org.apache.solr.handler.RequestHandlerBase.handleRequest(RequestHandlerBase.java:129)
		at org.apache.solr.core.SolrCore.execute(SolrCore.java:1692)
		at org.apache.solr.servlet.SolrDispatchFilter.execute(SolrDispatchFilter.java:454)
		at org.apache.solr.servlet.SolrDispatchFilter.doFilter(SolrDispatchFilter.java:275)
		at org.eclipse.jetty.servlet.ServletHandler$CachedChain.doFilter(ServletHandler.java:1337)
		at org.eclipse.jetty.servlet.ServletHandler.doHandle(ServletHandler.java:484)
		at org.eclipse.jetty.server.session.SessionHandler.doHandle(SessionHandler.java:231)
		at org.eclipse.jetty.server.handler.ScopedHandler.handle(ScopedHandler.java:119)
		at org.eclipse.jetty.server.handler.GzipHandler.handle(GzipHandler.java:267)
		at org.eclipse.jetty.server.handler.ContextHandler.doHandle(ContextHandler.java:1067)
		at org.eclipse.jetty.servlet.ServletHandler.doScope(ServletHandler.java:413)
		at org.eclipse.jetty.server.session.SessionHandler.doScope(SessionHandler.java:192)
		at org.eclipse.jetty.server.handler.ContextHandler.doScope(ContextHandler.java:999)
		at org.eclipse.jetty.server.handler.ScopedHandler.handle(ScopedHandler.java:117)
		at org.eclipse.jetty.server.handler.HandlerWrapper.handle(HandlerWrapper.java:111)
		at org.eclipse.jetty.server.Server.handle(Server.java:351)
		at org.eclipse.jetty.server.AbstractHttpConnection.handleRequest(AbstractHttpConnection.java:454)
		at org.eclipse.jetty.server.BlockingHttpConnection.handleRequest(BlockingHttpConnection.java:47)
		at org.eclipse.jetty.server.AbstractHttpConnection.content(AbstractHttpConnection.java:900)
		at org.eclipse.jetty.server.AbstractHttpConnection$RequestHandler.content(AbstractHttpConnection.java:954)
		at org.eclipse.jetty.http.HttpParser.parseNext(HttpParser.java:952)
		at org.eclipse.jetty.http.HttpParser.parseAvailable(HttpParser.java:235)
		at org.eclipse.jetty.server.BlockingHttpConnection.handle(BlockingHttpConnection.java:66)
		at org.eclipse.jetty.server.bio.SocketConnector$ConnectorEndPoint.run(SocketConnector.java:254)
		at org.eclipse.jetty.util.thread.QueuedThreadPool.runJob(QueuedThreadPool.java:599)
		at org.eclipse.jetty.util.thread.QueuedThreadPool$3.run(QueuedThreadPool.java:534)
		at java.lang.Thread.run(Thread.java:679)
	
Tests run: 22, Failures: 0, Errors: 0, Skipped: 0, Time elapsed: 4.488 sec
Running org.apache.solr.servlet.NoCacheHeaderTest
Creating dataDir: /usr/home/hudson/hudson-slave/workspace/Lucene-Solr-Maven-4.x/maven-build/solr/core/target/test/./solrtest-NoCacheHeaderTest-1346505837876
Tests run: 3, Failures: 0, Errors: 0, Skipped: 0, Time elapsed: 0.53 sec
Running org.apache.solr.client.solrj.embedded.TestEmbeddedSolrServer
Tests run: 2, Failures: 0, Errors: 0, Skipped: 0, Time elapsed: 0.563 sec
Running org.apache.solr.util.DOMUtilTest
Tests run: 1, Failures: 0, Errors: 0, Skipped: 0, Time elapsed: 0.027 sec
Running org.apache.solr.search.similarities.TestPerFieldSimilarity
Creating dataDir: /usr/home/hudson/hudson-slave/workspace/Lucene-Solr-Maven-4.x/maven-build/solr/core/target/test/./solrtest-TestPerFieldSimilarity-1346505838997
Tests run: 7, Failures: 0, Errors: 0, Skipped: 0, Time elapsed: 0.107 sec
Running org.apache.solr.search.TestFoldingMultitermQuery
Creating dataDir: /usr/home/hudson/hudson-slave/workspace/Lucene-Solr-Maven-4.x/maven-build/solr/core/target/test/./solrtest-TestFoldingMultitermQuery-1346505839106
Tests run: 18, Failures: 0, Errors: 0, Skipped: 0, Time elapsed: 0.57 sec
Running org.apache.solr.client.solrj.impl.CloudSolrServerTest
Creating dataDir: /usr/home/hudson/hudson-slave/workspace/Lucene-Solr-Maven-4.x/maven-build/solr/core/target/test/./solrtest-CloudSolrServerTest-1346505839685
50221 T2886 oasc.SolrException.log SEVERE Sync request error: org.apache.solr.client.solrj.SolrServerException: IOException occured when talking to server at: http://127.0.0.1:47751/solr/collection1
50269 T2899 oasc.SolrException.log SEVERE Sync request error: org.apache.solr.client.solrj.SolrServerException: IOException occured when talking to server at: http://127.0.0.1:33743/solr/collection1
50329 T2912 oasc.SolrException.log SEVERE Sync Failed
50382 T2925 oasc.SolrException.log SEVERE Sync Failed
95231 T2886 oasc.SolrException.log SEVERE http://127.0.0.1:40659/solr/collection1/: Could not tell a replica to recover:org.apache.solr.client.solrj.SolrServerException: IOException occured when talking to server at: http://127.0.0.1:47751/solr
		at org.apache.solr.client.solrj.impl.HttpSolrServer.request(HttpSolrServer.java:414)
		at org.apache.solr.client.solrj.impl.HttpSolrServer.request(HttpSolrServer.java:182)
		at org.apache.solr.cloud.SyncStrategy.requestRecovery(SyncStrategy.java:282)
		at org.apache.solr.cloud.SyncStrategy.syncToMe(SyncStrategy.java:226)
		at org.apache.solr.cloud.SyncStrategy.syncReplicas(SyncStrategy.java:119)
		at org.apache.solr.cloud.SyncStrategy.sync(SyncStrategy.java:85)
		at org.apache.solr.cloud.ShardLeaderElectionContext.runLeaderProcess(ElectionContext.java:180)
		at org.apache.solr.cloud.LeaderElector.runIamLeaderProcess(LeaderElector.java:159)
		at org.apache.solr.cloud.LeaderElector.checkIfIamLeader(LeaderElector.java:103)
		at org.apache.solr.cloud.LeaderElector.access$000(LeaderElector.java:57)
		at org.apache.solr.cloud.LeaderElector$1.process(LeaderElector.java:132)
		at org.apache.zookeeper.ClientCnxn$EventThread.processEvent(ClientCnxn.java:526)
		at org.apache.zookeeper.ClientCnxn$EventThread.run(ClientCnxn.java:502)
	Caused by: org.apache.http.conn.ConnectTimeoutException: Connect to 127.0.0.1:47751 timed out
		at org.apache.http.conn.scheme.PlainSocketFactory.connectSocket(PlainSocketFactory.java:125)
		at org.apache.http.impl.conn.DefaultClientConnectionOperator.openConnection(DefaultClientConnectionOperator.java:148)
		at org.apache.http.impl.conn.AbstractPoolEntry.open(AbstractPoolEntry.java:150)
		at org.apache.http.impl.conn.AbstractPooledConnAdapter.open(AbstractPooledConnAdapter.java:121)
		at org.apache.http.impl.client.DefaultRequestDirector.tryConnect(DefaultRequestDirector.java:575)
		at org.apache.http.impl.client.DefaultRequestDirector.execute(DefaultRequestDirector.java:425)
		at org.apache.http.impl.client.AbstractHttpClient.execute(AbstractHttpClient.java:820)
		at org.apache.http.impl.client.AbstractHttpClient.execute(AbstractHttpClient.java:754)
		at org.apache.http.impl.client.AbstractHttpClient.execute(AbstractHttpClient.java:732)
		at org.apache.solr.client.solrj.impl.HttpSolrServer.request(HttpSolrServer.java:353)
		... 12 more
	
95278 T2899 oasc.SolrException.log SEVERE http://127.0.0.1:37258/solr/collection1/: Could not tell a replica to recover:org.apache.solr.client.solrj.SolrServerException: IOException occured when talking to server at: http://127.0.0.1:33743/solr
		at org.apache.solr.client.solrj.impl.HttpSolrServer.request(HttpSolrServer.java:414)
		at org.apache.solr.client.solrj.impl.HttpSolrServer.request(HttpSolrServer.java:182)
		at org.apache.solr.cloud.SyncStrategy.requestRecovery(SyncStrategy.java:282)
		at org.apache.solr.cloud.SyncStrategy.syncToMe(SyncStrategy.java:226)
		at org.apache.solr.cloud.SyncStrategy.syncReplicas(SyncStrategy.java:119)
		at org.apache.solr.cloud.SyncStrategy.sync(SyncStrategy.java:85)
		at org.apache.solr.cloud.ShardLeaderElectionContext.runLeaderProcess(ElectionContext.java:180)
		at org.apache.solr.cloud.LeaderElector.runIamLeaderProcess(LeaderElector.java:159)
		at org.apache.solr.cloud.LeaderElector.checkIfIamLeader(LeaderElector.java:103)
		at org.apache.solr.cloud.LeaderElector.access$000(LeaderElector.java:57)
		at org.apache.solr.cloud.LeaderElector$1.process(LeaderElector.java:132)
		at org.apache.zookeeper.ClientCnxn$EventThread.processEvent(ClientCnxn.java:526)
		at org.apache.zookeeper.ClientCnxn$EventThread.run(ClientCnxn.java:502)
	Caused by: org.apache.http.conn.ConnectTimeoutException: Connect to 127.0.0.1:33743 timed out
		at org.apache.http.conn.scheme.PlainSocketFactory.connectSocket(PlainSocketFactory.java:125)
		at org.apache.http.impl.conn.DefaultClientConnectionOperator.openConnection(DefaultClientConnectionOperator.java:148)
		at org.apache.http.impl.conn.AbstractPoolEntry.open(AbstractPoolEntry.java:150)
		at org.apache.http.impl.conn.AbstractPooledConnAdapter.open(AbstractPooledConnAdapter.java:121)
		at org.apache.http.impl.client.DefaultRequestDirector.tryConnect(DefaultRequestDirector.java:575)
		at org.apache.http.impl.client.DefaultRequestDirector.execute(DefaultRequestDirector.java:425)
		at org.apache.http.impl.client.AbstractHttpClient.execute(AbstractHttpClient.java:820)
		at org.apache.http.impl.client.AbstractHttpClient.execute(AbstractHttpClient.java:754)
		at org.apache.http.impl.client.AbstractHttpClient.execute(AbstractHttpClient.java:732)
		at org.apache.solr.client.solrj.impl.HttpSolrServer.request(HttpSolrServer.java:353)
		... 12 more
	
Tests run: 1, Failures: 0, Errors: 0, Skipped: 0, Time elapsed: 95.843 sec
Running org.apache.solr.servlet.DirectSolrConnectionTest
Tests run: 2, Failures: 0, Errors: 0, Skipped: 0, Time elapsed: 0.241 sec
Running org.apache.solr.core.SolrCoreCheckLockOnStartupTest
Creating dataDir: /usr/home/hudson/hudson-slave/workspace/Lucene-Solr-Maven-4.x/maven-build/solr/core/target/test/./solrtest-SolrCoreCheckLockOnStartupTest-1346505935765
377 T2960 oasc.SolrCore.initIndex SEVERE [collection1] Solr index directory '/usr/home/hudson/hudson-slave/workspace/Lucene-Solr-Maven-4.x/maven-build/solr/core/target/test/./solrtest-SolrCoreCheckLockOnStartupTest-1346505935765/index/' is locked.  Throwing exception
Creating dataDir: /usr/home/hudson/hudson-slave/workspace/Lucene-Solr-Maven-4.x/maven-build/solr/core/target/test/./solrtest-SolrCoreCheckLockOnStartupTest-1346505936149
460 T3 oasc.SolrCore.finalize SEVERE REFCOUNT ERROR: unreferenced org.apache.solr.core.SolrCore@7a5777e3 (collection1) has a reference count of 1
460 T3 oasc.CoreContainer.finalize SEVERE CoreContainer was not shutdown prior to finalize(), indicates a bug -- POSSIBLE RESOURCE LEAK!!!  instance=1929624746
752 T2960 oasc.SolrCore.initIndex SEVERE [collection1] Solr index directory '/usr/home/hudson/hudson-slave/workspace/Lucene-Solr-Maven-4.x/maven-build/solr/core/target/test/./solrtest-SolrCoreCheckLockOnStartupTest-1346505936149/index/' is locked.  Throwing exception
Tests run: 2, Failures: 0, Errors: 0, Skipped: 0, Time elapsed: 0.774 sec
Running org.apache.solr.cloud.TestMultiCoreConfBootstrap
4 T3 oasc.CoreContainer.finalize SEVERE CoreContainer was not shutdown prior to finalize(), indicates a bug -- POSSIBLE RESOURCE LEAK!!!  instance=805610095
5 T3 oasc.SolrCore.finalize SEVERE REFCOUNT ERROR: unreferenced org.apache.solr.core.SolrCore@443e0a (collection1) has a reference count of 1
Creating dataDir: /usr/home/hudson/hudson-slave/workspace/Lucene-Solr-Maven-4.x/maven-build/solr/core/target/test/./solrtest-TestMultiCoreConfBootstrap-1346505936544
!!!! WARNING: best effort to remove /usr/home/hudson/hudson-slave/workspace/Lucene-Solr-Maven-4.x/maven-build/solr/core/target/test/./solrtest-TestMultiCoreConfBootstrap-1346505936544 FAILED !!!!!
Tests run: 1, Failures: 0, Errors: 0, Skipped: 0, Time elapsed: 5.676 sec
Running org.apache.solr.client.solrj.TestLBHttpSolrServer
Tests run: 3, Failures: 0, Errors: 0, Skipped: 0, Time elapsed: 36.826 sec
Running org.apache.solr.update.processor.StatelessScriptUpdateProcessorFactoryTest
Creating dataDir: /usr/home/hudson/hudson-slave/workspace/Lucene-Solr-Maven-4.x/maven-build/solr/core/target/test/./solrtest-StatelessScriptUpdateProcessorFactoryTest-1346505979049
Tests run: 7, Failures: 0, Errors: 0, Skipped: 0, Time elapsed: 1.13 sec
Running org.apache.solr.cloud.RecoveryZkTest
Creating dataDir: /usr/home/hudson/hudson-slave/workspace/Lucene-Solr-Maven-4.x/maven-build/solr/core/target/test/./solrtest-RecoveryZkTest-1346505980197
ASYNC  NEW_CORE C13 name=collection1 org.apache.solr.core.SolrCore@17d6c198 url=http://127.0.0.1:49646/solr/collection1 node=127.0.0.1:49646_solr
13225 T3133 C13 P49646 oasc.SolrException.log SEVERE shard update error StdNode: http://127.0.0.1:34096/solr/collection1/:org.apache.solr.client.solrj.SolrServerException: IOException occured when talking to server at: http://127.0.0.1:34096/solr/collection1
		at org.apache.solr.client.solrj.impl.HttpSolrServer.request(HttpSolrServer.java:414)
		at org.apache.solr.client.solrj.impl.HttpSolrServer.request(HttpSolrServer.java:182)
		at org.apache.solr.update.SolrCmdDistributor$1.call(SolrCmdDistributor.java:331)
		at org.apache.solr.update.SolrCmdDistributor$1.call(SolrCmdDistributor.java:312)
		at java.util.concurrent.FutureTask$Sync.innerRun(FutureTask.java:334)
		at java.util.concurrent.FutureTask.run(FutureTask.java:166)
		at java.util.concurrent.Executors$RunnableAdapter.call(Executors.java:471)
		at java.util.concurrent.FutureTask$Sync.innerRun(FutureTask.java:334)
		at java.util.concurrent.FutureTask.run(FutureTask.java:166)
		at java.util.concurrent.ThreadPoolExecutor.runWorker(ThreadPoolExecutor.java:1110)
		at java.util.concurrent.ThreadPoolExecutor$Worker.run(ThreadPoolExecutor.java:603)
		at java.lang.Thread.run(Thread.java:679)
	Caused by: org.apache.http.NoHttpResponseException: The target server failed to respond
		at org.apache.http.impl.conn.DefaultResponseParser.parseHead(DefaultResponseParser.java:101)
		at org.apache.http.impl.io.AbstractMessageParser.parse(AbstractMessageParser.java:252)
		at org.apache.http.impl.AbstractHttpClientConnection.receiveResponseHeader(AbstractHttpClientConnection.java:282)
		at org.apache.http.impl.conn.DefaultClientConnection.receiveResponseHeader(DefaultClientConnection.java:247)
		at org.apache.http.impl.conn.AbstractClientConnAdapter.receiveResponseHeader(AbstractClientConnAdapter.java:216)
		at org.apache.http.protocol.HttpRequestExecutor.doReceiveResponse(HttpRequestExecutor.java:298)
		at org.apache.http.protocol.HttpRequestExecutor.execute(HttpRequestExecutor.java:125)
		at org.apache.http.impl.client.DefaultRequestDirector.tryExecute(DefaultRequestDirector.java:647)
		at org.apache.http.impl.client.DefaultRequestDirector.execute(DefaultRequestDirector.java:464)
		at org.apache.http.impl.client.AbstractHttpClient.execute(AbstractHttpClient.java:820)
		at org.apache.http.impl.client.AbstractHttpClient.execute(AbstractHttpClient.java:754)
		at org.apache.http.impl.client.AbstractHttpClient.execute(AbstractHttpClient.java:732)
		at org.apache.solr.client.solrj.impl.HttpSolrServer.request(HttpSolrServer.java:353)
		... 11 more
	
13225 T3134 C13 P49646 oasc.SolrException.log SEVERE shard update error StdNode: http://127.0.0.1:34096/solr/collection1/:org.apache.solr.client.solrj.SolrServerException: IOException occured when talking to server at: http://127.0.0.1:34096/solr/collection1
		at org.apache.solr.client.solrj.impl.HttpSolrServer.request(HttpSolrServer.java:414)
		at org.apache.solr.client.solrj.impl.HttpSolrServer.request(HttpSolrServer.java:182)
		at org.apache.solr.update.SolrCmdDistributor$1.call(SolrCmdDistributor.java:331)
		at org.apache.solr.update.SolrCmdDistributor$1.call(SolrCmdDistributor.java:312)
		at java.util.concurrent.FutureTask$Sync.innerRun(FutureTask.java:334)
		at java.util.concurrent.FutureTask.run(FutureTask.java:166)
		at java.util.concurrent.Executors$RunnableAdapter.call(Executors.java:471)
		at java.util.concurrent.FutureTask$Sync.innerRun(FutureTask.java:334)
		at java.util.concurrent.FutureTask.run(FutureTask.java:166)
		at java.util.concurrent.ThreadPoolExecutor.runWorker(ThreadPoolExecutor.java:1110)
		at java.util.concurrent.ThreadPoolExecutor$Worker.run(ThreadPoolExecutor.java:603)
		at java.lang.Thread.run(Thread.java:679)
	Caused by: org.apache.http.NoHttpResponseException: The target server failed to respond
		at org.apache.http.impl.conn.DefaultResponseParser.parseHead(DefaultResponseParser.java:101)
		at org.apache.http.impl.io.AbstractMessageParser.parse(AbstractMessageParser.java:252)
		at org.apache.http.impl.AbstractHttpClientConnection.receiveResponseHeader(AbstractHttpClientConnection.java:282)
		at org.apache.http.impl.conn.DefaultClientConnection.receiveResponseHeader(DefaultClientConnection.java:247)
		at org.apache.http.impl.conn.AbstractClientConnAdapter.receiveResponseHeader(AbstractClientConnAdapter.java:216)
		at org.apache.http.protocol.HttpRequestExecutor.doReceiveResponse(HttpRequestExecutor.java:298)
		at org.apache.http.protocol.HttpRequestExecutor.execute(HttpRequestExecutor.java:125)
		at org.apache.http.impl.client.DefaultRequestDirector.tryExecute(DefaultRequestDirector.java:647)
		at org.apache.http.impl.client.DefaultRequestDirector.execute(DefaultRequestDirector.java:464)
		at org.apache.http.impl.client.AbstractHttpClient.execute(AbstractHttpClient.java:820)
		at org.apache.http.impl.client.AbstractHttpClient.execute(AbstractHttpClient.java:754)
		at org.apache.http.impl.client.AbstractHttpClient.execute(AbstractHttpClient.java:732)
		at org.apache.solr.client.solrj.impl.HttpSolrServer.request(HttpSolrServer.java:353)
		... 11 more
	
added docs:1998 with 0 fails deletes:922
added docs:1996 with 0 fails deletes:921
34542 T3176 oasc.Overseer.createOverseerNode SEVERE Could not create Overseer node: class org.apache.zookeeper.KeeperException$SessionExpiredException:KeeperErrorCode = Session expired for /overseer
Tests run: 1, Failures: 0, Errors: 0, Skipped: 0, Time elapsed: 34.726 sec
Running org.apache.solr.analysis.TestCollationKeyRangeQueries
Creating dataDir: /usr/home/hudson/hudson-slave/workspace/Lucene-Solr-Maven-4.x/maven-build/solr/core/target/test/./solrtest-TestCollationKeyRangeQueries-1346506014900
Tests run: 3, Failures: 0, Errors: 0, Skipped: 0, Time elapsed: 0.149 sec
Running org.apache.solr.util.TestFastOutputStream
Tests run: 1, Failures: 0, Errors: 0, Skipped: 0, Time elapsed: 0.188 sec
Running org.apache.solr.request.TestWriterPerf
Tests run: 1, Failures: 0, Errors: 0, Skipped: 0, Time elapsed: 0.945 sec
Running org.apache.solr.common.util.TestNamedListCodec
Tests run: 4, Failures: 0, Errors: 0, Skipped: 0, Time elapsed: 0.336 sec
Running org.apache.solr.search.TestQueryUtils
Tests run: 1, Failures: 0, Errors: 0, Skipped: 0, Time elapsed: 0.538 sec
Running org.apache.solr.servlet.SolrRequestParserTest
Creating dataDir: /usr/home/hudson/hudson-slave/workspace/Lucene-Solr-Maven-4.x/maven-build/solr/core/target/test/./solrtest-SolrRequestParserTest-1346506017060
Tests run: 4, Failures: 0, Errors: 0, Skipped: 0, Time elapsed: 1.024 sec
Running org.apache.solr.update.processor.DefaultValueUpdateProcessorTest
Creating dataDir: /usr/home/hudson/hudson-slave/workspace/Lucene-Solr-Maven-4.x/maven-build/solr/core/target/test/./solrtest-DefaultValueUpdateProcessorTest-1346506018086
Tests run: 1, Failures: 0, Errors: 0, Skipped: 0, Time elapsed: 0.378 sec
Running org.apache.solr.handler.admin.SystemInfoHandlerTest
Tests run: 1, Failures: 0, Errors: 0, Skipped: 0, Time elapsed: 0.022 sec
Running org.apache.solr.handler.TestCSVLoader
Creating dataDir: /usr/home/hudson/hudson-slave/workspace/Lucene-Solr-Maven-4.x/maven-build/solr/core/target/test/./solrtest-TestCSVLoader-1346506018490
Tests run: 5, Failures: 0, Errors: 0, Skipped: 0, Time elapsed: 0.688 sec
Running org.apache.solr.client.solrj.embedded.TestSolrProperties
Tests run: 1, Failures: 0, Errors: 0, Skipped: 0, Time elapsed: 0.684 sec
Running org.apache.solr.TestDistributedGrouping
Tests run: 1, Failures: 0, Errors: 0, Skipped: 0, Time elapsed: 10.266 sec
Running org.apache.solr.cloud.LeaderElectionIntegrationTest
Creating dataDir: /usr/home/hudson/hudson-slave/workspace/Lucene-Solr-Maven-4.x/maven-build/solr/core/target/test/./solrtest-LeaderElectionIntegrationTest-1346506030135
Creating dataDir: /usr/home/hudson/hudson-slave/workspace/Lucene-Solr-Maven-4.x/maven-build/solr/core/target/test/./solrtest-LeaderElectionIntegrationTest-1346506043816
20320 T3405 oasc.SolrException.log SEVERE Sync Failed
20325 T3408 oasc.SolrException.log SEVERE Sync Failed
20331 T3411 oasc.SolrException.log SEVERE Sync Failed
20335 T3414 oasc.SolrException.log SEVERE Sync Failed
Tests run: 2, Failures: 0, Errors: 0, Skipped: 0, Time elapsed: 26.067 sec
Running org.apache.solr.core.AlternateDirectoryTest
Creating dataDir: /usr/home/hudson/hudson-slave/workspace/Lucene-Solr-Maven-4.x/maven-build/solr/core/target/test/./solrtest-AlternateDirectoryTest-1346506056200
Tests run: 1, Failures: 0, Errors: 0, Skipped: 0, Time elapsed: 0.395 sec
Running org.apache.solr.search.function.SortByFunctionTest
Tests run: 2, Failures: 0, Errors: 0, Skipped: 0, Time elapsed: 1.133 sec
Running org.apache.solr.schema.RequiredFieldsTest
Creating dataDir: /usr/home/hudson/hudson-slave/workspace/Lucene-Solr-Maven-4.x/maven-build/solr/core/target/test/./solrtest-RequiredFieldsTest-1346506057730
Tests run: 3, Failures: 0, Errors: 0, Skipped: 0, Time elapsed: 0.424 sec
Running org.apache.solr.handler.component.TermVectorComponentTest
Creating dataDir: /usr/home/hudson/hudson-slave/workspace/Lucene-Solr-Maven-4.x/maven-build/solr/core/target/test/./solrtest-TermVectorComponentTest-1346506058155
Tests run: 3, Failures: 0, Errors: 0, Skipped: 0, Time elapsed: 0.733 sec
Running org.apache.solr.internal.csv.CSVParserTest
Tests run: 23, Failures: 0, Errors: 0, Skipped: 0, Time elapsed: 0.02 sec
Running org.apache.solr.highlight.HighlighterTest
Creating dataDir: /usr/home/hudson/hudson-slave/workspace/Lucene-Solr-Maven-4.x/maven-build/solr/core/target/test/./solrtest-HighlighterTest-1346506058916
Tests run: 27, Failures: 0, Errors: 0, Skipped: 0, Time elapsed: 1.195 sec
Running org.apache.solr.handler.component.DistributedTermsComponentTest
Tests run: 1, Failures: 0, Errors: 0, Skipped: 0, Time elapsed: 4.333 sec
Running org.apache.solr.spelling.DirectSolrSpellCheckerTest
Creating dataDir: /usr/home/hudson/hudson-slave/workspace/Lucene-Solr-Maven-4.x/maven-build/solr/core/target/test/./solrtest-DirectSolrSpellCheckerTest-1346506064444
Tests run: 2, Failures: 0, Errors: 0, Skipped: 0, Time elapsed: 0.566 sec
Running org.apache.solr.handler.component.TermVectorComponentDistributedTest
Tests run: 1, Failures: 0, Errors: 0, Skipped: 0, Time elapsed: 5.544 sec
Running org.apache.solr.core.RAMDirectoryFactoryTest
Tests run: 1, Failures: 0, Errors: 0, Skipped: 0, Time elapsed: 0.029 sec
Running org.apache.solr.core.PluginInfoTest
Tests run: 9, Failures: 0, Errors: 0, Skipped: 0, Time elapsed: 0.102 sec
Running org.apache.solr.internal.csv.writer.CSVFieldTest
Tests run: 2, Failures: 0, Errors: 0, Skipped: 0, Time elapsed: 0 sec
Running org.apache.solr.handler.PingRequestHandlerTest
Creating dataDir: /usr/home/hudson/hudson-slave/workspace/Lucene-Solr-Maven-4.x/maven-build/solr/core/target/test/./solrtest-PingRequestHandlerTest-1346506070686
Tests run: 5, Failures: 0, Errors: 0, Skipped: 0, Time elapsed: 0.457 sec
Running org.apache.solr.update.processor.ScriptEngineTest
Tests run: 6, Failures: 0, Errors: 0, Skipped: 1, Time elapsed: 0.079 sec
Running org.apache.solr.request.TestBinaryResponseWriter
Tests run: 2, Failures: 0, Errors: 0, Skipped: 0, Time elapsed: 0.736 sec
Running org.apache.solr.cloud.BasicDistributedZk2Test
Creating dataDir: /usr/home/hudson/hudson-slave/workspace/Lucene-Solr-Maven-4.x/maven-build/solr/core/target/test/./solrtest-BasicDistributedZk2Test-1346506071977
ASYNC  NEW_CORE C14 name=collection1 org.apache.solr.core.SolrCore@eecff2 url=http://127.0.0.1:20664/solr/collection1 node=127.0.0.1:20664_solr
57540 T3708 C14 P20664 oasc.SolrException.log SEVERE org.apache.solr.common.SolrException: Document is missing mandatory uniqueKey field: id
		at org.apache.solr.update.AddUpdateCommand.getHashableId(AddUpdateCommand.java:132)
		at org.apache.solr.update.processor.DistributedUpdateProcessor.hash(DistributedUpdateProcessor.java:1067)
		at org.apache.solr.update.processor.DistributedUpdateProcessor.processAdd(DistributedUpdateProcessor.java:332)
		at org.apache.solr.handler.loader.XMLLoader.processUpdate(XMLLoader.java:230)
		at org.apache.solr.handler.loader.XMLLoader.load(XMLLoader.java:157)
		at org.apache.solr.handler.UpdateRequestHandler$1.load(UpdateRequestHandler.java:92)
		at org.apache.solr.handler.ContentStreamHandlerBase.handleRequestBody(ContentStreamHandlerBase.java:74)
		at org.apache.solr.handler.RequestHandlerBase.handleRequest(RequestHandlerBase.java:129)
		at org.apache.solr.core.SolrCore.execute(SolrCore.java:1692)
		at org.apache.solr.servlet.SolrDispatchFilter.execute(SolrDispatchFilter.java:454)
		at org.apache.solr.servlet.SolrDispatchFilter.doFilter(SolrDispatchFilter.java:275)
		at org.eclipse.jetty.servlet.ServletHandler$CachedChain.doFilter(ServletHandler.java:1337)
		at org.eclipse.jetty.servlet.ServletHandler.doHandle(ServletHandler.java:484)
		at org.eclipse.jetty.server.session.SessionHandler.doHandle(SessionHandler.java:231)
		at org.eclipse.jetty.server.handler.ScopedHandler.handle(ScopedHandler.java:119)
		at org.eclipse.jetty.server.handler.GzipHandler.handle(GzipHandler.java:267)
		at org.eclipse.jetty.server.handler.ContextHandler.doHandle(ContextHandler.java:1067)
		at org.eclipse.jetty.servlet.ServletHandler.doScope(ServletHandler.java:413)
		at org.eclipse.jetty.server.session.SessionHandler.doScope(SessionHandler.java:192)
		at org.eclipse.jetty.server.handler.ContextHandler.doScope(ContextHandler.java:999)
		at org.eclipse.jetty.server.handler.ScopedHandler.handle(ScopedHandler.java:117)
		at org.eclipse.jetty.server.handler.HandlerWrapper.handle(HandlerWrapper.java:111)
		at org.eclipse.jetty.server.Server.handle(Server.java:351)
		at org.eclipse.jetty.server.AbstractHttpConnection.handleRequest(AbstractHttpConnection.java:454)
		at org.eclipse.jetty.server.BlockingHttpConnection.handleRequest(BlockingHttpConnection.java:47)
		at org.eclipse.jetty.server.AbstractHttpConnection.content(AbstractHttpConnection.java:900)
		at org.eclipse.jetty.server.AbstractHttpConnection$RequestHandler.content(AbstractHttpConnection.java:954)
		at org.eclipse.jetty.http.HttpParser.parseNext(HttpParser.java:952)
		at org.eclipse.jetty.http.HttpParser.parseAvailable(HttpParser.java:235)
		at org.eclipse.jetty.server.BlockingHttpConnection.handle(BlockingHttpConnection.java:66)
		at org.eclipse.jetty.server.bio.SocketConnector$ConnectorEndPoint.run(SocketConnector.java:254)
		at org.eclipse.jetty.util.thread.QueuedThreadPool.runJob(QueuedThreadPool.java:599)
		at org.eclipse.jetty.util.thread.QueuedThreadPool$3.run(QueuedThreadPool.java:534)
		at java.lang.Thread.run(Thread.java:679)
	
57622 T3754 oasc.SolrException.log SEVERE Sync Failed
58968 T3865 oasc.SolrException.log SEVERE java.lang.InterruptedException: sleep interrupted
		at java.lang.Thread.sleep(Native Method)
		at org.apache.solr.handler.admin.CoreAdminHandler.handleWaitForStateAction(CoreAdminHandler.java:896)
		at org.apache.solr.handler.admin.CoreAdminHandler.handleRequestBody(CoreAdminHandler.java:185)
		at org.apache.solr.handler.RequestHandlerBase.handleRequest(RequestHandlerBase.java:129)
		at org.apache.solr.servlet.SolrDispatchFilter.handleAdminRequest(SolrDispatchFilter.java:371)
		at org.apache.solr.servlet.SolrDispatchFilter.doFilter(SolrDispatchFilter.java:180)
		at org.eclipse.jetty.servlet.ServletHandler$CachedChain.doFilter(ServletHandler.java:1337)
		at org.eclipse.jetty.servlet.ServletHandler.doHandle(ServletHandler.java:484)
		at org.eclipse.jetty.server.session.SessionHandler.doHandle(SessionHandler.java:231)
		at org.eclipse.jetty.server.handler.ScopedHandler.handle(ScopedHandler.java:119)
		at org.eclipse.jetty.server.handler.GzipHandler.handle(GzipHandler.java:267)
		at org.eclipse.jetty.server.handler.ContextHandler.doHandle(ContextHandler.java:1067)
		at org.eclipse.jetty.servlet.ServletHandler.doScope(ServletHandler.java:413)
		at org.eclipse.jetty.server.session.SessionHandler.doScope(SessionHandler.java:192)
		at org.eclipse.jetty.server.handler.ContextHandler.doScope(ContextHandler.java:999)
		at org.eclipse.jetty.server.handler.ScopedHandler.handle(ScopedHandler.java:117)
		at org.eclipse.jetty.server.handler.HandlerWrapper.handle(HandlerWrapper.java:111)
		at org.eclipse.jetty.server.Server.handle(Server.java:351)
		at org.eclipse.jetty.server.AbstractHttpConnection.handleRequest(AbstractHttpConnection.java:454)
		at org.eclipse.jetty.server.BlockingHttpConnection.handleRequest(BlockingHttpConnection.java:47)
		at org.eclipse.jetty.server.AbstractHttpConnection.headerComplete(AbstractHttpConnection.java:890)
		at org.eclipse.jetty.server.AbstractHttpConnection$RequestHandler.headerComplete(AbstractHttpConnection.java:944)
		at org.eclipse.jetty.http.HttpParser.parseNext(HttpParser.java:634)
		at org.eclipse.jetty.http.HttpParser.parseAvailable(HttpParser.java:230)
		at org.eclipse.jetty.server.BlockingHttpConnection.handle(BlockingHttpConnection.java:66)
		at org.eclipse.jetty.server.bio.SocketConnector$ConnectorEndPoint.run(SocketConnector.java:254)
		at org.eclipse.jetty.util.thread.QueuedThreadPool.runJob(QueuedThreadPool.java:599)
		at org.eclipse.jetty.util.thread.QueuedThreadPool$3.run(QueuedThreadPool.java:534)
		at java.lang.Thread.run(Thread.java:679)
	
58969 T3865 oasc.SolrException.log SEVERE null:java.lang.InterruptedException: sleep interrupted
		at java.lang.Thread.sleep(Native Method)
		at org.apache.solr.handler.admin.CoreAdminHandler.handleWaitForStateAction(CoreAdminHandler.java:896)
		at org.apache.solr.handler.admin.CoreAdminHandler.handleRequestBody(CoreAdminHandler.java:185)
		at org.apache.solr.handler.RequestHandlerBase.handleRequest(RequestHandlerBase.java:129)
		at org.apache.solr.servlet.SolrDispatchFilter.handleAdminRequest(SolrDispatchFilter.java:371)
		at org.apache.solr.servlet.SolrDispatchFilter.doFilter(SolrDispatchFilter.java:180)
		at org.eclipse.jetty.servlet.ServletHandler$CachedChain.doFilter(ServletHandler.java:1337)
		at org.eclipse.jetty.servlet.ServletHandler.doHandle(ServletHandler.java:484)
		at org.eclipse.jetty.server.session.SessionHandler.doHandle(SessionHandler.java:231)
		at org.eclipse.jetty.server.handler.ScopedHandler.handle(ScopedHandler.java:119)
		at org.eclipse.jetty.server.handler.GzipHandler.handle(GzipHandler.java:267)
		at org.eclipse.jetty.server.handler.ContextHandler.doHandle(ContextHandler.java:1067)
		at org.eclipse.jetty.servlet.ServletHandler.doScope(ServletHandler.java:413)
		at org.eclipse.jetty.server.session.SessionHandler.doScope(SessionHandler.java:192)
		at org.eclipse.jetty.server.handler.ContextHandler.doScope(ContextHandler.java:999)
		at org.eclipse.jetty.server.handler.ScopedHandler.handle(ScopedHandler.java:117)
		at org.eclipse.jetty.server.handler.HandlerWrapper.handle(HandlerWrapper.java:111)
		at org.eclipse.jetty.server.Server.handle(Server.java:351)
		at org.eclipse.jetty.server.AbstractHttpConnection.handleRequest(AbstractHttpConnection.java:454)
		at org.eclipse.jetty.server.BlockingHttpConnection.handleRequest(BlockingHttpConnection.java:47)
		at org.eclipse.jetty.server.AbstractHttpConnection.headerComplete(AbstractHttpConnection.java:890)
		at org.eclipse.jetty.server.AbstractHttpConnection$RequestHandler.headerComplete(AbstractHttpConnection.java:944)
		at org.eclipse.jetty.http.HttpParser.parseNext(HttpParser.java:634)
		at org.eclipse.jetty.http.HttpParser.parseAvailable(HttpParser.java:230)
		at org.eclipse.jetty.server.BlockingHttpConnection.handle(BlockingHttpConnection.java:66)
		at org.eclipse.jetty.server.bio.SocketConnector$ConnectorEndPoint.run(SocketConnector.java:254)
		at org.eclipse.jetty.util.thread.QueuedThreadPool.runJob(QueuedThreadPool.java:599)
		at org.eclipse.jetty.util.thread.QueuedThreadPool$3.run(QueuedThreadPool.java:534)
		at java.lang.Thread.run(Thread.java:679)
	
58970 T3865 oasc.SolrException.log SEVERE null:org.eclipse.jetty.io.EofException
		at org.eclipse.jetty.server.HttpOutput.write(HttpOutput.java:154)
		at org.eclipse.jetty.server.HttpOutput.write(HttpOutput.java:101)
		at org.apache.solr.common.util.FastOutputStream.flush(FastOutputStream.java:204)
		at org.apache.solr.common.util.FastOutputStream.flushBuffer(FastOutputStream.java:197)
		at org.apache.solr.common.util.JavaBinCodec.marshal(JavaBinCodec.java:94)
		at org.apache.solr.response.BinaryResponseWriter.write(BinaryResponseWriter.java:49)
		at org.apache.solr.servlet.SolrDispatchFilter.writeResponse(SolrDispatchFilter.java:403)
		at org.apache.solr.servlet.SolrDispatchFilter.handleAdminRequest(SolrDispatchFilter.java:381)
		at org.apache.solr.servlet.SolrDispatchFilter.doFilter(SolrDispatchFilter.java:180)
		at org.eclipse.jetty.servlet.ServletHandler$CachedChain.doFilter(ServletHandler.java:1337)
		at org.eclipse.jetty.servlet.ServletHandler.doHandle(ServletHandler.java:484)
		at org.eclipse.jetty.server.session.SessionHandler.doHandle(SessionHandler.java:231)
		at org.eclipse.jetty.server.handler.ScopedHandler.handle(ScopedHandler.java:119)
		at org.eclipse.jetty.server.handler.GzipHandler.handle(GzipHandler.java:267)
		at org.eclipse.jetty.server.handler.ContextHandler.doHandle(ContextHandler.java:1067)
		at org.eclipse.jetty.servlet.ServletHandler.doScope(ServletHandler.java:413)
		at org.eclipse.jetty.server.session.SessionHandler.doScope(SessionHandler.java:192)
		at org.eclipse.jetty.server.handler.ContextHandler.doScope(ContextHandler.java:999)
		at org.eclipse.jetty.server.handler.ScopedHandler.handle(ScopedHandler.java:117)
		at org.eclipse.jetty.server.handler.HandlerWrapper.handle(HandlerWrapper.java:111)
		at org.eclipse.jetty.server.Server.handle(Server.java:351)
		at org.eclipse.jetty.server.AbstractHttpConnection.handleRequest(AbstractHttpConnection.java:454)
		at org.eclipse.jetty.server.BlockingHttpConnection.handleRequest(BlockingHttpConnection.java:47)
		at org.eclipse.jetty.server.AbstractHttpConnection.headerComplete(AbstractHttpConnection.java:890)
		at org.eclipse.jetty.server.AbstractHttpConnection$RequestHandler.headerComplete(AbstractHttpConnection.java:944)
		at org.eclipse.jetty.http.HttpParser.parseNext(HttpParser.java:634)
		at org.eclipse.jetty.http.HttpParser.parseAvailable(HttpParser.java:230)
		at org.eclipse.jetty.server.BlockingHttpConnection.handle(BlockingHttpConnection.java:66)
		at org.eclipse.jetty.server.bio.SocketConnector$ConnectorEndPoint.run(SocketConnector.java:254)
		at org.eclipse.jetty.util.thread.QueuedThreadPool.runJob(QueuedThreadPool.java:599)
		at org.eclipse.jetty.util.thread.QueuedThreadPool$3.run(QueuedThreadPool.java:534)
		at java.lang.Thread.run(Thread.java:679)
	
102661 T3862 oasc.SolrException.log SEVERE http://127.0.0.1:20733/solr/collection1/: Could not tell a replica to recover:org.apache.solr.client.solrj.SolrServerException: Timeout occured while waiting response from server at: http://127.0.0.1:20670/solr
		at org.apache.solr.client.solrj.impl.HttpSolrServer.request(HttpSolrServer.java:410)
		at org.apache.solr.client.solrj.impl.HttpSolrServer.request(HttpSolrServer.java:182)
		at org.apache.solr.cloud.SyncStrategy.requestRecovery(SyncStrategy.java:282)
		at org.apache.solr.cloud.SyncStrategy.syncToMe(SyncStrategy.java:226)
		at org.apache.solr.cloud.SyncStrategy.syncReplicas(SyncStrategy.java:119)
		at org.apache.solr.cloud.SyncStrategy.sync(SyncStrategy.java:85)
		at org.apache.solr.cloud.ShardLeaderElectionContext.runLeaderProcess(ElectionContext.java:180)
		at org.apache.solr.cloud.LeaderElector.runIamLeaderProcess(LeaderElector.java:159)
		at org.apache.solr.cloud.LeaderElector.checkIfIamLeader(LeaderElector.java:103)
		at org.apache.solr.cloud.LeaderElector.access$000(LeaderElector.java:57)
		at org.apache.solr.cloud.LeaderElector$1.process(LeaderElector.java:132)
		at org.apache.zookeeper.ClientCnxn$EventThread.processEvent(ClientCnxn.java:526)
		at org.apache.zookeeper.ClientCnxn$EventThread.run(ClientCnxn.java:502)
	Caused by: java.net.SocketTimeoutException: Read timed out
		at java.net.SocketInputStream.socketRead0(Native Method)
		at java.net.SocketInputStream.read(SocketInputStream.java:146)
		at org.apache.http.impl.io.AbstractSessionInputBuffer.fillBuffer(AbstractSessionInputBuffer.java:149)
		at org.apache.http.impl.io.SocketInputBuffer.fillBuffer(SocketInputBuffer.java:111)
		at org.apache.http.impl.io.AbstractSessionInputBuffer.readLine(AbstractSessionInputBuffer.java:264)
		at org.apache.http.impl.conn.DefaultResponseParser.parseHead(DefaultResponseParser.java:98)
		at org.apache.http.impl.io.AbstractMessageParser.parse(AbstractMessageParser.java:252)
		at org.apache.http.impl.AbstractHttpClientConnection.receiveResponseHeader(AbstractHttpClientConnection.java:282)
		at org.apache.http.impl.conn.DefaultClientConnection.receiveResponseHeader(DefaultClientConnection.java:247)
		at org.apache.http.impl.conn.AbstractClientConnAdapter.receiveResponseHeader(AbstractClientConnAdapter.java:216)
		at org.apache.http.protocol.HttpRequestExecutor.doReceiveResponse(HttpRequestExecutor.java:298)
		at org.apache.http.protocol.HttpRequestExecutor.execute(HttpRequestExecutor.java:125)
		at org.apache.http.impl.client.DefaultRequestDirector.tryExecute(DefaultRequestDirector.java:647)
		at org.apache.http.impl.client.DefaultRequestDirector.execute(DefaultRequestDirector.java:464)
		at org.apache.http.impl.client.AbstractHttpClient.execute(AbstractHttpClient.java:820)
		at org.apache.http.impl.client.AbstractHttpClient.execute(AbstractHttpClient.java:754)
		at org.apache.http.impl.client.AbstractHttpClient.execute(AbstractHttpClient.java:732)
		at org.apache.solr.client.solrj.impl.HttpSolrServer.request(HttpSolrServer.java:353)
		... 12 more
	
ASYNC  NEW_CORE C15 name=collection1 org.apache.solr.core.SolrCore@13bdb2b6 url=http://127.0.0.1:20670/solr/collection1 node=127.0.0.1:20670_solr
103919 T3880 C15 P20670 oasc.SolrException.log SEVERE Error while trying to recover. core=collection1:org.apache.solr.client.solrj.SolrServerException: IOException occured when talking to server at: http://127.0.0.1:20666/solr
		at org.apache.solr.client.solrj.impl.HttpSolrServer.request(HttpSolrServer.java:414)
		at org.apache.solr.client.solrj.impl.HttpSolrServer.request(HttpSolrServer.java:182)
		at org.apache.solr.cloud.RecoveryStrategy.sendPrepRecoveryCmd(RecoveryStrategy.java:191)
		at org.apache.solr.cloud.RecoveryStrategy.doRecovery(RecoveryStrategy.java:320)
		at org.apache.solr.cloud.RecoveryStrategy.run(RecoveryStrategy.java:212)
	Caused by: org.apache.http.conn.ConnectTimeoutException: Connect to 127.0.0.1:20666 timed out
		at org.apache.http.conn.scheme.PlainSocketFactory.connectSocket(PlainSocketFactory.java:125)
		at org.apache.http.impl.conn.DefaultClientConnectionOperator.openConnection(DefaultClientConnectionOperator.java:148)
		at org.apache.http.impl.conn.AbstractPoolEntry.open(AbstractPoolEntry.java:150)
		at org.apache.http.impl.conn.AbstractPooledConnAdapter.open(AbstractPooledConnAdapter.java:121)
		at org.apache.http.impl.client.DefaultRequestDirector.tryExecute(DefaultRequestDirector.java:636)
		at org.apache.http.impl.client.DefaultRequestDirector.execute(DefaultRequestDirector.java:464)
		at org.apache.http.impl.client.AbstractHttpClient.execute(AbstractHttpClient.java:820)
		at org.apache.http.impl.client.AbstractHttpClient.execute(AbstractHttpClient.java:754)
		at org.apache.http.impl.client.AbstractHttpClient.execute(AbstractHttpClient.java:732)
		at org.apache.solr.client.solrj.impl.HttpSolrServer.request(HttpSolrServer.java:353)
		... 4 more
	
103919 T3880 C15 P20670 oasc.RecoveryStrategy.doRecovery SEVERE Recovery failed - trying again... core=collection1
Tests run: 1, Failures: 0, Errors: 0, Skipped: 0, Time elapsed: 107.217 sec
Running org.apache.solr.handler.admin.LoggingHandlerTest
Creating dataDir: /usr/home/hudson/hudson-slave/workspace/Lucene-Solr-Maven-4.x/maven-build/solr/core/target/test/./solrtest-LoggingHandlerTest-1346506179187
Tests run: 1, Failures: 0, Errors: 0, Skipped: 0, Time elapsed: 0.512 sec
Running org.apache.solr.schema.NotRequiredUniqueKeyTest
Creating dataDir: /usr/home/hudson/hudson-slave/workspace/Lucene-Solr-Maven-4.x/maven-build/solr/core/target/test/./solrtest-NotRequiredUniqueKeyTest-1346506179693
Tests run: 1, Failures: 0, Errors: 0, Skipped: 0, Time elapsed: 0.159 sec
Running org.apache.solr.common.util.IteratorChainTest
Tests run: 7, Failures: 0, Errors: 0, Skipped: 0, Time elapsed: 0.047 sec
Running org.apache.solr.response.TestPHPSerializedResponseWriter
Creating dataDir: /usr/home/hudson/hudson-slave/workspace/Lucene-Solr-Maven-4.x/maven-build/solr/core/target/test/./solrtest-TestPHPSerializedResponseWriter-1346506179900
Tests run: 2, Failures: 0, Errors: 0, Skipped: 0, Time elapsed: 0.487 sec
Running org.apache.solr.cloud.LeaderElectionTest
Creating dataDir: /usr/home/hudson/hudson-slave/workspace/Lucene-Solr-Maven-4.x/maven-build/solr/core/target/test/./solrtest-LeaderElectionTest-1346506180389
2455 T3944 oasc.LeaderElectionTest$ClientThread.run SEVERE setup failed org.apache.zookeeper.KeeperException$SessionExpiredException: KeeperErrorCode = Session expired for /collections/collection1/leader_elect/shard1/election
	at org.apache.zookeeper.KeeperException.create(KeeperException.java:118)
	at org.apache.zookeeper.KeeperException.create(KeeperException.java:42)
	at org.apache.zookeeper.ZooKeeper.exists(ZooKeeper.java:815)
	at org.apache.solr.common.cloud.SolrZkClient$4.execute(SolrZkClient.java:232)
	at org.apache.solr.common.cloud.SolrZkClient$4.execute(SolrZkClient.java:229)
	at org.apache.solr.common.cloud.ZkCmdExecutor.retryOperation(ZkCmdExecutor.java:67)
	at org.apache.solr.common.cloud.SolrZkClient.exists(SolrZkClient.java:229)
	at org.apache.solr.common.cloud.ZkCmdExecutor.ensureExists(ZkCmdExecutor.java:94)
	at org.apache.solr.common.cloud.ZkCmdExecutor.ensureExists(ZkCmdExecutor.java:88)
	at org.apache.solr.cloud.LeaderElector.setup(LeaderElector.java:279)
	at org.apache.solr.cloud.LeaderElectionTest$ClientThread.setupOnConnect(LeaderElectionTest.java:116)
	at org.apache.solr.cloud.LeaderElectionTest$ClientThread.run(LeaderElectionTest.java:125)
	at java.util.concurrent.Executors$RunnableAdapter.call(Executors.java:471)
	at java.util.concurrent.FutureTask$Sync.innerRun(FutureTask.java:334)
	at java.util.concurrent.FutureTask.run(FutureTask.java:166)
	at java.util.concurrent.ScheduledThreadPoolExecutor$ScheduledFutureTask.access$101(ScheduledThreadPoolExecutor.java:165)
	at java.util.concurrent.ScheduledThreadPoolExecutor$ScheduledFutureTask.run(ScheduledThreadPoolExecutor.java:266)
	at java.util.concurrent.ThreadPoolExecutor.runWorker(ThreadPoolExecutor.java:1110)
	at java.util.concurrent.ThreadPoolExecutor$Worker.run(ThreadPoolExecutor.java:603)
	at java.lang.Thread.run(Thread.java:679)

2455 T3932 oasc.LeaderElectionTest$ClientThread.run SEVERE setup failed org.apache.zookeeper.KeeperException$SessionExpiredException: KeeperErrorCode = Session expired for /collections/collection1/leader_elect/shard1/election
	at org.apache.zookeeper.KeeperException.create(KeeperException.java:118)
	at org.apache.zookeeper.KeeperException.create(KeeperException.java:42)
	at org.apache.zookeeper.ZooKeeper.exists(ZooKeeper.java:815)
	at org.apache.solr.common.cloud.SolrZkClient$4.execute(SolrZkClient.java:232)
	at org.apache.solr.common.cloud.SolrZkClient$4.execute(SolrZkClient.java:229)
	at org.apache.solr.common.cloud.ZkCmdExecutor.retryOperation(ZkCmdExecutor.java:67)
	at org.apache.solr.common.cloud.SolrZkClient.exists(SolrZkClient.java:229)
	at org.apache.solr.common.cloud.ZkCmdExecutor.ensureExists(ZkCmdExecutor.java:94)
	at org.apache.solr.common.cloud.ZkCmdExecutor.ensureExists(ZkCmdExecutor.java:88)
	at org.apache.solr.cloud.LeaderElector.setup(LeaderElector.java:279)
	at org.apache.solr.cloud.LeaderElectionTest$ClientThread.setupOnConnect(LeaderElectionTest.java:116)
	at org.apache.solr.cloud.LeaderElectionTest$ClientThread.run(LeaderElectionTest.java:125)
	at java.util.concurrent.Executors$RunnableAdapter.call(Executors.java:471)
	at java.util.concurrent.FutureTask$Sync.innerRun(FutureTask.java:334)
	at java.util.concurrent.FutureTask.run(FutureTask.java:166)
	at java.util.concurrent.ScheduledThreadPoolExecutor$ScheduledFutureTask.access$101(ScheduledThreadPoolExecutor.java:165)
	at java.util.concurrent.ScheduledThreadPoolExecutor$ScheduledFutureTask.run(ScheduledThreadPoolExecutor.java:266)
	at java.util.concurrent.ThreadPoolExecutor.runWorker(ThreadPoolExecutor.java:1110)
	at java.util.concurrent.ThreadPoolExecutor$Worker.run(ThreadPoolExecutor.java:603)
	at java.lang.Thread.run(Thread.java:679)

2779 T3936 oasc.LeaderElectionTest$ClientThread.run SEVERE setup failed org.apache.zookeeper.KeeperException$SessionExpiredException: KeeperErrorCode = Session expired for /collections
	at org.apache.zookeeper.KeeperException.create(KeeperException.java:118)
	at org.apache.zookeeper.KeeperException.create(KeeperException.java:42)
	at org.apache.zookeeper.ZooKeeper.exists(ZooKeeper.java:815)
	at org.apache.solr.common.cloud.SolrZkClient$3.execute(SolrZkClient.java:211)
	at org.apache.solr.common.cloud.SolrZkClient$3.execute(SolrZkClient.java:208)
	at org.apache.solr.common.cloud.ZkCmdExecutor.retryOperation(ZkCmdExecutor.java:67)
	at org.apache.solr.common.cloud.SolrZkClient.exists(SolrZkClient.java:208)
	at org.apache.solr.common.cloud.SolrZkClient.makePath(SolrZkClient.java:483)
	at org.apache.solr.common.cloud.SolrZkClient.makePath(SolrZkClient.java:443)
	at org.apache.solr.common.cloud.SolrZkClient.makePath(SolrZkClient.java:424)
	at org.apache.solr.cloud.ShardLeaderElectionContextBase.runLeaderProcess(ElectionContext.java:94)
	at org.apache.solr.cloud.LeaderElector.runIamLeaderProcess(LeaderElector.java:159)
	at org.apache.solr.cloud.LeaderElector.checkIfIamLeader(LeaderElector.java:103)
	at org.apache.solr.cloud.LeaderElector.joinElection(LeaderElector.java:263)
	at org.apache.solr.cloud.LeaderElectionTest$ClientThread.setupOnConnect(LeaderElectionTest.java:117)
	at org.apache.solr.cloud.LeaderElectionTest$ClientThread.run(LeaderElectionTest.java:125)
	at java.util.concurrent.Executors$RunnableAdapter.call(Executors.java:471)
	at java.util.concurrent.FutureTask$Sync.innerRun(FutureTask.java:334)
	at java.util.concurrent.FutureTask.run(FutureTask.java:166)
	at java.util.concurrent.ScheduledThreadPoolExecutor$ScheduledFutureTask.access$101(ScheduledThreadPoolExecutor.java:165)
	at java.util.concurrent.ScheduledThreadPoolExecutor$ScheduledFutureTask.run(ScheduledThreadPoolExecutor.java:266)
	at java.util.concurrent.ThreadPoolExecutor.runWorker(ThreadPoolExecutor.java:1110)
	at java.util.concurrent.ThreadPoolExecutor$Worker.run(ThreadPoolExecutor.java:603)
	at java.lang.Thread.run(Thread.java:679)

9075 T3992 oasc.SolrException.log SEVERE Failed setting watch:org.apache.zookeeper.KeeperException$NoNodeException: KeeperErrorCode = NoNode for /collections/collection1/leader_elect/shard1/election/88244629511143428-1-n_0000000003
		at org.apache.zookeeper.KeeperException.create(KeeperException.java:102)
		at org.apache.zookeeper.KeeperException.create(KeeperException.java:42)
		at org.apache.zookeeper.ZooKeeper.getData(ZooKeeper.java:927)
		at org.apache.solr.common.cloud.SolrZkClient$7.execute(SolrZkClient.java:301)
		at org.apache.solr.common.cloud.SolrZkClient$7.execute(SolrZkClient.java:298)
		at org.apache.solr.common.cloud.ZkCmdExecutor.retryOperation(ZkCmdExecutor.java:67)
		at org.apache.solr.common.cloud.SolrZkClient.getData(SolrZkClient.java:298)
		at org.apache.solr.cloud.LeaderElector.checkIfIamLeader(LeaderElector.java:120)
		at org.apache.solr.cloud.LeaderElector.access$000(LeaderElector.java:57)
		at org.apache.solr.cloud.LeaderElector$1.process(LeaderElector.java:132)
		at org.apache.zookeeper.ClientCnxn$EventThread.processEvent(ClientCnxn.java:526)
		at org.apache.zookeeper.ClientCnxn$EventThread.run(ClientCnxn.java:502)
	
10079 T4007 oasc.SolrException.log SEVERE Failed setting watch:org.apache.zookeeper.KeeperException$NoNodeException: KeeperErrorCode = NoNode for /collections/collection1/leader_elect/shard1/election/88244629511143429-2-n_0000000002
		at org.apache.zookeeper.KeeperException.create(KeeperException.java:102)
		at org.apache.zookeeper.KeeperException.create(KeeperException.java:42)
		at org.apache.zookeeper.ZooKeeper.getData(ZooKeeper.java:927)
		at org.apache.solr.common.cloud.SolrZkClient$7.execute(SolrZkClient.java:301)
		at org.apache.solr.common.cloud.SolrZkClient$7.execute(SolrZkClient.java:298)
		at org.apache.solr.common.cloud.ZkCmdExecutor.retryOperation(ZkCmdExecutor.java:67)
		at org.apache.solr.common.cloud.SolrZkClient.getData(SolrZkClient.java:298)
		at org.apache.solr.cloud.LeaderElector.checkIfIamLeader(LeaderElector.java:120)
		at org.apache.solr.cloud.LeaderElector.access$000(LeaderElector.java:57)
		at org.apache.solr.cloud.LeaderElector$1.process(LeaderElector.java:132)
		at org.apache.zookeeper.ClientCnxn$EventThread.processEvent(ClientCnxn.java:526)
		at org.apache.zookeeper.ClientCnxn$EventThread.run(ClientCnxn.java:502)
	
Tests run: 4, Failures: 0, Errors: 0, Skipped: 0, Time elapsed: 15.752 sec
Running org.apache.solr.search.TestPseudoReturnFields
Creating dataDir: /usr/home/hudson/hudson-slave/workspace/Lucene-Solr-Maven-4.x/maven-build/solr/core/target/test/./solrtest-TestPseudoReturnFields-1346506196142
Tests run: 13, Failures: 0, Errors: 0, Skipped: 0, Time elapsed: 0.667 sec
Running org.apache.solr.AnalysisAfterCoreReloadTest
Tests run: 1, Failures: 0, Errors: 0, Skipped: 0, Time elapsed: 1.605 sec
Running org.apache.solr.core.TestCoreContainer
Creating dataDir: /usr/home/hudson/hudson-slave/workspace/Lucene-Solr-Maven-4.x/maven-build/solr/core/target/test/./solrtest-TestCoreContainer-134

[...truncated too long message...]

sting.rules.NoShadowingOrOverridesOnMethodsRule$1.evaluate(NoShadowingOrOverridesOnMethodsRule.java:39)
	at org.apache.lucene.util.TestRuleAssertionsRequired$1.evaluate(TestRuleAssertionsRequired.java:40)
	at org.apache.lucene.util.TestRuleMarkFailure$1.evaluate(TestRuleMarkFailure.java:48)
	at org.apache.lucene.util.TestRuleIgnoreAfterMaxFailures$1.evaluate(TestRuleIgnoreAfterMaxFailures.java:70)
	at org.apache.lucene.util.TestRuleIgnoreTestSuites$1.evaluate(TestRuleIgnoreTestSuites.java:55)
	at com.carrotsearch.randomizedtesting.rules.StatementAdapter.evaluate(StatementAdapter.java:36)
	at com.carrotsearch.randomizedtesting.ThreadLeakControl$StatementRunner.run(ThreadLeakControl.java:345)
	at java.lang.Thread.run(Thread.java:679)

Tests run: 5, Failures: 0, Errors: 0, Skipped: 0, Time elapsed: 11.742 sec
Running org.apache.solr.uima.analysis.UIMATypeAwareAnnotationsTokenizerFactoryTest
Creating dataDir: /usr/home/hudson/hudson-slave/workspace/Lucene-Solr-Maven-4.x/maven-build/solr/contrib/uima/target/test/./solrtest-UIMATypeAwareAnnotationsTokenizerFactoryTest-1346506512327
Tests run: 2, Failures: 0, Errors: 0, Skipped: 0, Time elapsed: 7.193 sec

Results :

Tests run: 9, Failures: 0, Errors: 0, Skipped: 0

[INFO] [jar:jar {execution: default-jar}]
[INFO] Building jar: /usr/home/hudson/hudson-slave/workspace/Lucene-Solr-Maven-4.x/maven-build/solr/contrib/uima/target/solr-uima-4.0-SNAPSHOT.jar
[INFO] [install:install {execution: default-install}]
[INFO] Installing /usr/home/hudson/hudson-slave/workspace/Lucene-Solr-Maven-4.x/maven-build/solr/contrib/uima/target/solr-uima-4.0-SNAPSHOT.jar to /home/hudson/.m2/repository/org/apache/solr/solr-uima/4.0-SNAPSHOT/solr-uima-4.0-SNAPSHOT.jar
[INFO] ------------------------------------------------------------------------
[INFO] Building Apache Solr Velocity
[INFO]    task-segment: [install]
[INFO] ------------------------------------------------------------------------
[INFO] [groovy:execute {execution: generate-timestamps}]
[INFO] [buildnumber:create {execution: default}]
[INFO] [enforcer:enforce {execution: enforce-java-compat-version-and-maven-2.2.1}]
[INFO] [remote-resources:process {execution: default}]
[debug] execute contextualize
[INFO] [resources:resources {execution: default-resources}]
[INFO] Using 'UTF-8' encoding to copy filtered resources.
[INFO] skip non existing resourceDirectory /usr/home/hudson/hudson-slave/workspace/Lucene-Solr-Maven-4.x/maven-build/solr/contrib/velocity/src/main/resources
[INFO] Copying 3 resources
[INFO] [compiler:compile {execution: default-compile}]
[INFO] Compiling 4 source files to /usr/home/hudson/hudson-slave/workspace/Lucene-Solr-Maven-4.x/maven-build/solr/contrib/velocity/target/classes
[INFO] [bundle:manifest {execution: bundle-manifest}]
[debug] execute contextualize
[INFO] [resources:testResources {execution: default-testResources}]
[INFO] Using 'UTF-8' encoding to copy filtered resources.
[INFO] Copying 3 resources
[INFO] Copying 148 resources
[INFO] Copying 1 resource
[INFO] Copying 3 resources
[INFO] [compiler:testCompile {execution: default-testCompile}]
[INFO] Compiling 1 source file to /usr/home/hudson/hudson-slave/workspace/Lucene-Solr-Maven-4.x/maven-build/solr/contrib/velocity/target/test-classes
[INFO] [surefire:test {execution: default-test}]
[INFO] Surefire report directory: /usr/home/hudson/hudson-slave/workspace/Lucene-Solr-Maven-4.x/maven-build/solr/contrib/velocity/target/surefire-reports

-------------------------------------------------------
 T E S T S
-------------------------------------------------------
Running org.apache.solr.velocity.VelocityResponseWriterTest
Creating dataDir: /usr/home/hudson/hudson-slave/workspace/Lucene-Solr-Maven-4.x/maven-build/solr/contrib/velocity/target/test/./solrtest-VelocityResponseWriterTest-1346506523061
Tests run: 1, Failures: 0, Errors: 0, Skipped: 0, Time elapsed: 1.709 sec

Results :

Tests run: 1, Failures: 0, Errors: 0, Skipped: 0

[INFO] [jar:jar {execution: default-jar}]
[INFO] Building jar: /usr/home/hudson/hudson-slave/workspace/Lucene-Solr-Maven-4.x/maven-build/solr/contrib/velocity/target/solr-velocity-4.0-SNAPSHOT.jar
[INFO] [install:install {execution: default-install}]
[INFO] Installing /usr/home/hudson/hudson-slave/workspace/Lucene-Solr-Maven-4.x/maven-build/solr/contrib/velocity/target/solr-velocity-4.0-SNAPSHOT.jar to /home/hudson/.m2/repository/org/apache/solr/solr-velocity/4.0-SNAPSHOT/solr-velocity-4.0-SNAPSHOT.jar
[INFO] ------------------------------------------------------------------------
[INFO] Building Apache Solr Contrib aggregator POM
[INFO]    task-segment: [install]
[INFO] ------------------------------------------------------------------------
[INFO] [groovy:execute {execution: generate-timestamps}]
[INFO] [buildnumber:create {execution: default}]
[INFO] [enforcer:enforce {execution: enforce-java-compat-version-and-maven-2.2.1}]
[INFO] [remote-resources:process {execution: default}]
[INFO] [bundle:manifest {execution: bundle-manifest}]
[WARNING] Ignoring project type pom - supportedProjectTypes = [jar, bundle]
[INFO] [site:attach-descriptor {execution: default-attach-descriptor}]
[INFO] [install:install {execution: default-install}]
[INFO] Installing /usr/home/hudson/hudson-slave/workspace/Lucene-Solr-Maven-4.x/maven-build/solr/contrib/pom.xml to /home/hudson/.m2/repository/org/apache/solr/solr-contrib-aggregator/4.0-SNAPSHOT/solr-contrib-aggregator-4.0-SNAPSHOT.pom
[INFO] 
[INFO] 
[INFO] ------------------------------------------------------------------------
[INFO] Reactor Summary:
[INFO] ------------------------------------------------------------------------
[INFO] Grandparent POM for Apache Lucene Core and Apache Solr  SUCCESS [7.802s]
[INFO] Lucene parent POM ..................................... SUCCESS [0.109s]
[INFO] Lucene Core ........................................... SUCCESS [4:41.550s]
[INFO] Lucene Test Framework ................................. SUCCESS [4.749s]
[INFO] Lucene Common Analyzers ............................... SUCCESS [2:06.136s]
[INFO] Lucene ICU Analysis Components ........................ SUCCESS [10.150s]
[INFO] Lucene Kuromoji Japanese Morphological Analyzer ....... SUCCESS [23.960s]
[INFO] Lucene Morfologik Polish Lemmatizer ................... SUCCESS [4.256s]
[INFO] Lucene Phonetic Filters ............................... SUCCESS [19.390s]
[INFO] Lucene Smart Chinese Analyzer ......................... SUCCESS [9.099s]
[INFO] Lucene Stempel Analyzer ............................... SUCCESS [5.315s]
[INFO] Lucene UIMA Analysis Components ....................... SUCCESS [22.637s]
[INFO] Lucene Analysis Modules aggregator POM ................ SUCCESS [0.234s]
[INFO] Lucene Queries ........................................ SUCCESS [9.584s]
[INFO] Lucene Sandbox ........................................ SUCCESS [7.929s]
[INFO] Lucene QueryParsers ................................... SUCCESS [14.819s]
[INFO] Lucene Memory ......................................... SUCCESS [8.360s]
[INFO] Lucene Highlighter .................................... SUCCESS [10.392s]
[INFO] Lucene Facets ......................................... SUCCESS [1:06.498s]
[INFO] Lucene Benchmark ...................................... SUCCESS [25.965s]
[INFO] Lucene Demo ........................................... SUCCESS [4.412s]
[INFO] Lucene Grouping ....................................... SUCCESS [21.740s]
[INFO] Lucene Join ........................................... SUCCESS [17.637s]
[INFO] Lucene Miscellaneous .................................. SUCCESS [6.462s]
[INFO] Lucene Spatial ........................................ SUCCESS [15.270s]
[INFO] Lucene Suggest ........................................ SUCCESS [15.718s]
[INFO] Apache Solr parent POM ................................ SUCCESS [0.079s]
[INFO] Apache Solr Solrj ..................................... SUCCESS [4.514s]
[INFO] Apache Solr Core ...................................... SUCCESS [21:21.043s]
[INFO] Apache Solr Search Server ............................. SUCCESS [5.171s]
[INFO] Apache Solr Test Framework ............................ SUCCESS [3.076s]
[INFO] Apache Solr Analysis Extras ........................... SUCCESS [7.350s]
[INFO] Apache Solr Clustering ................................ SUCCESS [15.190s]
[INFO] Apache Solr DataImportHandler ......................... SUCCESS [1:33.618s]
[INFO] Apache Solr DataImportHandler Extras .................. SUCCESS [9.670s]
[INFO] Apache Solr Content Extraction Library ................ FAILED [9.195s]
[INFO] Apache Solr Language Identifier ....................... SUCCESS [7.282s]
[INFO] Apache Solr UIMA integration .......................... SUCCESS [31.116s]
[INFO] Apache Solr Velocity .................................. SUCCESS [4.792s]
[INFO] Apache Solr Contrib aggregator POM .................... SUCCESS [0.092s]
[INFO] ------------------------------------------------------------------------
[INFO] Error for project: Apache Solr Content Extraction Library (during install)
[INFO] ------------------------------------------------------------------------
[INFO] There are test failures.

Please refer to /usr/home/hudson/hudson-slave/workspace/Lucene-Solr-Maven-4.x/maven-build/solr/contrib/extraction/target/surefire-reports for the individual test results.
[INFO] ------------------------------------------------------------------------
[INFO] For more information, run Maven with the -e switch
[INFO] ------------------------------------------------------------------------
[INFO] BUILD ERRORS
[INFO] ------------------------------------------------------------------------
[INFO] Total time: 36 minutes 53 seconds
[INFO] Finished at: Sat Sep 01 13:35:25 UTC 2012
[INFO] Final Memory: 237M/1384M
[INFO] ------------------------------------------------------------------------
Build step 'Invoke top-level Maven targets' marked build as failure
Recording test results
Email was triggered for: Failure
Sending email for trigger: Failure




Mime
View raw message