lucene-dev mailing list archives

Site index · List index
Message view « Date » · « Thread »
Top « Date » · « Thread »
From Apache Jenkins Server <jenk...@builds.apache.org>
Subject [JENKINS] Lucene-Solr-Tests-trunk-Java6 - Build # 15234 - Still Failing
Date Sat, 15 Sep 2012 05:02:46 GMT
Build: https://builds.apache.org/job/Lucene-Solr-Tests-trunk-Java6/15234/

1 tests failed.
FAILED:  org.apache.solr.cloud.BasicDistributedZk2Test.testDistribSearch

Error Message:
Shard still reported as live in zk

Stack Trace:
java.lang.AssertionError: Shard still reported as live in zk
	at __randomizedtesting.SeedInfo.seed([48E372D691F3E813:C905FCCEE6AC882F]:0)
	at org.junit.Assert.fail(Assert.java:93)
	at org.apache.solr.cloud.AbstractFullDistribZkTestBase.waitToSeeNotLive(AbstractFullDistribZkTestBase.java:1215)
	at org.apache.solr.cloud.BasicDistributedZk2Test.brindDownShardIndexSomeDocsAndRecover(BasicDistributedZk2Test.java:190)
	at org.apache.solr.cloud.BasicDistributedZk2Test.doTest(BasicDistributedZk2Test.java:83)
	at org.apache.solr.BaseDistributedSearchTestCase.testDistribSearch(BaseDistributedSearchTestCase.java:691)
	at sun.reflect.NativeMethodAccessorImpl.invoke0(Native Method)
	at sun.reflect.NativeMethodAccessorImpl.invoke(NativeMethodAccessorImpl.java:57)
	at sun.reflect.DelegatingMethodAccessorImpl.invoke(DelegatingMethodAccessorImpl.java:43)
	at java.lang.reflect.Method.invoke(Method.java:616)
	at com.carrotsearch.randomizedtesting.RandomizedRunner.invoke(RandomizedRunner.java:1559)
	at com.carrotsearch.randomizedtesting.RandomizedRunner.access$600(RandomizedRunner.java:79)
	at com.carrotsearch.randomizedtesting.RandomizedRunner$6.evaluate(RandomizedRunner.java:737)
	at com.carrotsearch.randomizedtesting.RandomizedRunner$7.evaluate(RandomizedRunner.java:773)
	at com.carrotsearch.randomizedtesting.RandomizedRunner$8.evaluate(RandomizedRunner.java:787)
	at com.carrotsearch.randomizedtesting.rules.SystemPropertiesRestoreRule$1.evaluate(SystemPropertiesRestoreRule.java:53)
	at org.apache.lucene.util.TestRuleSetupTeardownChained$1.evaluate(TestRuleSetupTeardownChained.java:50)
	at org.apache.lucene.util.TestRuleFieldCacheSanity$1.evaluate(TestRuleFieldCacheSanity.java:51)
	at org.apache.lucene.util.AbstractBeforeAfterRule$1.evaluate(AbstractBeforeAfterRule.java:45)
	at com.carrotsearch.randomizedtesting.rules.SystemPropertiesInvariantRule$1.evaluate(SystemPropertiesInvariantRule.java:55)
	at org.apache.lucene.util.TestRuleThreadAndTestName$1.evaluate(TestRuleThreadAndTestName.java:48)
	at org.apache.lucene.util.TestRuleIgnoreAfterMaxFailures$1.evaluate(TestRuleIgnoreAfterMaxFailures.java:70)
	at org.apache.lucene.util.TestRuleMarkFailure$1.evaluate(TestRuleMarkFailure.java:48)
	at com.carrotsearch.randomizedtesting.rules.StatementAdapter.evaluate(StatementAdapter.java:36)
	at com.carrotsearch.randomizedtesting.ThreadLeakControl$StatementRunner.run(ThreadLeakControl.java:358)
	at com.carrotsearch.randomizedtesting.ThreadLeakControl.forkTimeoutingTask(ThreadLeakControl.java:782)
	at com.carrotsearch.randomizedtesting.ThreadLeakControl$3.evaluate(ThreadLeakControl.java:442)
	at com.carrotsearch.randomizedtesting.RandomizedRunner.runSingleTest(RandomizedRunner.java:746)
	at com.carrotsearch.randomizedtesting.RandomizedRunner$3.evaluate(RandomizedRunner.java:648)
	at com.carrotsearch.randomizedtesting.RandomizedRunner$4.evaluate(RandomizedRunner.java:682)
	at com.carrotsearch.randomizedtesting.RandomizedRunner$5.evaluate(RandomizedRunner.java:693)
	at com.carrotsearch.randomizedtesting.rules.StatementAdapter.evaluate(StatementAdapter.java:36)
	at com.carrotsearch.randomizedtesting.rules.SystemPropertiesRestoreRule$1.evaluate(SystemPropertiesRestoreRule.java:53)
	at org.apache.lucene.util.AbstractBeforeAfterRule$1.evaluate(AbstractBeforeAfterRule.java:45)
	at org.apache.lucene.util.TestRuleStoreClassName$1.evaluate(TestRuleStoreClassName.java:42)
	at com.carrotsearch.randomizedtesting.rules.SystemPropertiesInvariantRule$1.evaluate(SystemPropertiesInvariantRule.java:55)
	at com.carrotsearch.randomizedtesting.rules.NoShadowingOrOverridesOnMethodsRule$1.evaluate(NoShadowingOrOverridesOnMethodsRule.java:39)
	at com.carrotsearch.randomizedtesting.rules.NoShadowingOrOverridesOnMethodsRule$1.evaluate(NoShadowingOrOverridesOnMethodsRule.java:39)
	at com.carrotsearch.randomizedtesting.rules.StatementAdapter.evaluate(StatementAdapter.java:36)
	at org.apache.lucene.util.TestRuleAssertionsRequired$1.evaluate(TestRuleAssertionsRequired.java:43)
	at org.apache.lucene.util.TestRuleMarkFailure$1.evaluate(TestRuleMarkFailure.java:48)
	at org.apache.lucene.util.TestRuleIgnoreAfterMaxFailures$1.evaluate(TestRuleIgnoreAfterMaxFailures.java:70)
	at org.apache.lucene.util.TestRuleIgnoreTestSuites$1.evaluate(TestRuleIgnoreTestSuites.java:55)
	at com.carrotsearch.randomizedtesting.rules.StatementAdapter.evaluate(StatementAdapter.java:36)
	at com.carrotsearch.randomizedtesting.ThreadLeakControl$StatementRunner.run(ThreadLeakControl.java:358)
	at java.lang.Thread.run(Thread.java:679)




Build Log:
[...truncated 7594 lines...]
[junit4:junit4] Suite: org.apache.solr.cloud.BasicDistributedZk2Test
[junit4:junit4]   2> 15 T2016 oas.SolrTestCaseJ4.setUp ###Starting testDistribSearch
[junit4:junit4]   2> Creating dataDir: /usr/home/hudson/hudson-slave/workspace/Lucene-Solr-Tests-trunk-Java6/solr/build/solr-core/test/J0/./solrtest-BasicDistributedZk2Test-1347685174605
[junit4:junit4]   2> 16 T2016 oasc.ZkTestServer.run STARTING ZK TEST SERVER
[junit4:junit4]   2> 21 T2017 oazs.ZooKeeperServer.setTickTime tickTime set to 1000
[junit4:junit4]   2> 21 T2017 oazs.NIOServerCnxn$Factory.<init> binding to port 0.0.0.0/0.0.0.0:0
[junit4:junit4]   2> 22 T2017 oazsp.FileTxnSnapLog.save Snapshotting: 0
[junit4:junit4]   2> 118 T2016 oasc.ZkTestServer.run start zk server on port:30056
[junit4:junit4]   2> 118 T2016 oaz.ZooKeeper.<init> Initiating client connection, connectString=127.0.0.1:30056 sessionTimeout=10000 watcher=org.apache.solr.common.cloud.ConnectionManager@648f8a1
[junit4:junit4]   2> 119 T2022 oaz.ClientCnxn$SendThread.startConnect Opening socket connection to server /127.0.0.1:30056
[junit4:junit4]   2> 119 T2016 oascc.ConnectionManager.waitForConnected Waiting for client to connect to ZooKeeper
[junit4:junit4]   2> 120 T2022 oaz.ClientCnxn$SendThread.primeConnection Socket connection established to localhost/127.0.0.1:30056, initiating session
[junit4:junit4]   2> 120 T2018 oazs.NIOServerCnxn$Factory.run Accepted socket connection from /140.211.11.196:10420
[junit4:junit4]   2> 121 T2018 oazs.NIOServerCnxn.readConnectRequest Client attempting to establish new session at /140.211.11.196:10420
[junit4:junit4]   2> 121 T2020 oazsp.FileTxnLog.append Creating new log file: log.1
[junit4:junit4]   2> 134 T2020 oazs.NIOServerCnxn.finishSessionInit Established session 0x139c84bcd540000 with negotiated timeout 10000 for client /140.211.11.196:10420
[junit4:junit4]   2> 134 T2022 oaz.ClientCnxn$SendThread.readConnectResult Session establishment complete on server localhost/127.0.0.1:30056, sessionid = 0x139c84bcd540000, negotiated timeout = 10000
[junit4:junit4]   2> 135 T2023 oascc.ConnectionManager.process Watcher org.apache.solr.common.cloud.ConnectionManager@648f8a1 name:ZooKeeperConnection Watcher:127.0.0.1:30056 got event WatchedEvent state:SyncConnected type:None path:null path:null type:None
[junit4:junit4]   2> 135 T2016 oascc.ConnectionManager.waitForConnected Client is connected to ZooKeeper
[junit4:junit4]   2> 135 T2016 oascc.SolrZkClient.makePath makePath: /solr
[junit4:junit4]   2> 138 T2021 oazs.PrepRequestProcessor.pRequest Processed session termination for sessionid: 0x139c84bcd540000
[junit4:junit4]   2> 145 T2023 oaz.ClientCnxn$EventThread.run EventThread shut down
[junit4:junit4]   2> 145 T2016 oaz.ZooKeeper.close Session: 0x139c84bcd540000 closed
[junit4:junit4]   2> 146 T2018 oazs.NIOServerCnxn.closeSock Closed socket connection for client /140.211.11.196:10420 which had sessionid 0x139c84bcd540000
[junit4:junit4]   2> 146 T2016 oaz.ZooKeeper.<init> Initiating client connection, connectString=127.0.0.1:30056/solr sessionTimeout=10000 watcher=org.apache.solr.common.cloud.ConnectionManager@6140d944
[junit4:junit4]   2> 147 T2024 oaz.ClientCnxn$SendThread.startConnect Opening socket connection to server /127.0.0.1:30056
[junit4:junit4]   2> 147 T2016 oascc.ConnectionManager.waitForConnected Waiting for client to connect to ZooKeeper
[junit4:junit4]   2> 148 T2024 oaz.ClientCnxn$SendThread.primeConnection Socket connection established to localhost/127.0.0.1:30056, initiating session
[junit4:junit4]   2> 148 T2018 oazs.NIOServerCnxn$Factory.run Accepted socket connection from /140.211.11.196:19507
[junit4:junit4]   2> 148 T2018 oazs.NIOServerCnxn.readConnectRequest Client attempting to establish new session at /140.211.11.196:19507
[junit4:junit4]   2> 150 T2020 oazs.NIOServerCnxn.finishSessionInit Established session 0x139c84bcd540001 with negotiated timeout 10000 for client /140.211.11.196:19507
[junit4:junit4]   2> 150 T2024 oaz.ClientCnxn$SendThread.readConnectResult Session establishment complete on server localhost/127.0.0.1:30056, sessionid = 0x139c84bcd540001, negotiated timeout = 10000
[junit4:junit4]   2> 150 T2025 oascc.ConnectionManager.process Watcher org.apache.solr.common.cloud.ConnectionManager@6140d944 name:ZooKeeperConnection Watcher:127.0.0.1:30056/solr got event WatchedEvent state:SyncConnected type:None path:null path:null type:None
[junit4:junit4]   2> 150 T2016 oascc.ConnectionManager.waitForConnected Client is connected to ZooKeeper
[junit4:junit4]   2> 151 T2016 oascc.SolrZkClient.makePath makePath: /collections/collection1
[junit4:junit4]   2> 161 T2016 oascc.SolrZkClient.makePath makePath: /collections/collection1/shards
[junit4:junit4]   2> 163 T2016 oascc.SolrZkClient.makePath makePath: /collections/control_collection
[junit4:junit4]   2> 165 T2016 oascc.SolrZkClient.makePath makePath: /collections/control_collection/shards
[junit4:junit4]   2> 173 T2016 oasc.AbstractZkTestCase.putConfig put /usr/home/hudson/hudson-slave/workspace/Lucene-Solr-Tests-trunk-Java6/solr/build/solr-core/test-files/solr/collection1/conf/solrconfig.xml to /configs/conf1/solrconfig.xml
[junit4:junit4]   2> 174 T2016 oascc.SolrZkClient.makePath makePath: /configs/conf1/solrconfig.xml
[junit4:junit4]   2> 185 T2016 oasc.AbstractZkTestCase.putConfig put /usr/home/hudson/hudson-slave/workspace/Lucene-Solr-Tests-trunk-Java6/solr/build/solr-core/test-files/solr/collection1/conf/schema.xml to /configs/conf1/schema.xml
[junit4:junit4]   2> 186 T2016 oascc.SolrZkClient.makePath makePath: /configs/conf1/schema.xml
[junit4:junit4]   2> 289 T2016 oasc.AbstractZkTestCase.putConfig put /usr/home/hudson/hudson-slave/workspace/Lucene-Solr-Tests-trunk-Java6/solr/build/solr-core/test-files/solr/collection1/conf/solrconfig.xml to /configs/conf1/solrconfig.xml
[junit4:junit4]   2> 290 T2016 oascc.SolrZkClient.makePath makePath: /configs/conf1/solrconfig.xml
[junit4:junit4]   2> 292 T2016 oasc.AbstractZkTestCase.putConfig put /usr/home/hudson/hudson-slave/workspace/Lucene-Solr-Tests-trunk-Java6/solr/build/solr-core/test-files/solr/collection1/conf/stopwords.txt to /configs/conf1/stopwords.txt
[junit4:junit4]   2> 293 T2016 oascc.SolrZkClient.makePath makePath: /configs/conf1/stopwords.txt
[junit4:junit4]   2> 301 T2016 oasc.AbstractZkTestCase.putConfig put /usr/home/hudson/hudson-slave/workspace/Lucene-Solr-Tests-trunk-Java6/solr/build/solr-core/test-files/solr/collection1/conf/protwords.txt to /configs/conf1/protwords.txt
[junit4:junit4]   2> 302 T2016 oascc.SolrZkClient.makePath makePath: /configs/conf1/protwords.txt
[junit4:junit4]   2> 304 T2016 oasc.AbstractZkTestCase.putConfig put /usr/home/hudson/hudson-slave/workspace/Lucene-Solr-Tests-trunk-Java6/solr/build/solr-core/test-files/solr/collection1/conf/currency.xml to /configs/conf1/currency.xml
[junit4:junit4]   2> 305 T2016 oascc.SolrZkClient.makePath makePath: /configs/conf1/currency.xml
[junit4:junit4]   2> 308 T2016 oasc.AbstractZkTestCase.putConfig put /usr/home/hudson/hudson-slave/workspace/Lucene-Solr-Tests-trunk-Java6/solr/build/solr-core/test-files/solr/collection1/conf/open-exchange-rates.json to /configs/conf1/open-exchange-rates.json
[junit4:junit4]   2> 308 T2016 oascc.SolrZkClient.makePath makePath: /configs/conf1/open-exchange-rates.json
[junit4:junit4]   2> 315 T2016 oasc.AbstractZkTestCase.putConfig put /usr/home/hudson/hudson-slave/workspace/Lucene-Solr-Tests-trunk-Java6/solr/build/solr-core/test-files/solr/collection1/conf/mapping-ISOLatin1Accent.txt to /configs/conf1/mapping-ISOLatin1Accent.txt
[junit4:junit4]   2> 316 T2016 oascc.SolrZkClient.makePath makePath: /configs/conf1/mapping-ISOLatin1Accent.txt
[junit4:junit4]   2> 318 T2016 oasc.AbstractZkTestCase.putConfig put /usr/home/hudson/hudson-slave/workspace/Lucene-Solr-Tests-trunk-Java6/solr/build/solr-core/test-files/solr/collection1/conf/old_synonyms.txt to /configs/conf1/old_synonyms.txt
[junit4:junit4]   2> 319 T2016 oascc.SolrZkClient.makePath makePath: /configs/conf1/old_synonyms.txt
[junit4:junit4]   2> 322 T2016 oasc.AbstractZkTestCase.putConfig put /usr/home/hudson/hudson-slave/workspace/Lucene-Solr-Tests-trunk-Java6/solr/build/solr-core/test-files/solr/collection1/conf/synonyms.txt to /configs/conf1/synonyms.txt
[junit4:junit4]   2> 322 T2016 oascc.SolrZkClient.makePath makePath: /configs/conf1/synonyms.txt
[junit4:junit4]   2> 329 T2021 oazs.PrepRequestProcessor.pRequest Processed session termination for sessionid: 0x139c84bcd540001
[junit4:junit4]   2> 330 T2025 oaz.ClientCnxn$EventThread.run EventThread shut down
[junit4:junit4]   2> 330 T2018 oazs.NIOServerCnxn.closeSock Closed socket connection for client /140.211.11.196:19507 which had sessionid 0x139c84bcd540001
[junit4:junit4]   2> 330 T2016 oaz.ZooKeeper.close Session: 0x139c84bcd540001 closed
[junit4:junit4]   2> 331 T2016 oejs.Server.doStart jetty-8.1.2.v20120308
[junit4:junit4]   2> 339 T2016 oejs.AbstractConnector.doStart Started SocketConnector@0.0.0.0:30102
[junit4:junit4]   2> 340 T2016 oasc.SolrResourceLoader.locateSolrHome JNDI not configured for solr (NoInitialContextEx)
[junit4:junit4]   2> 340 T2016 oasc.SolrResourceLoader.locateSolrHome using system property solr.solr.home: /usr/home/hudson/hudson-slave/workspace/Lucene-Solr-Tests-trunk-Java6/solr/build/solr-core/test-files/solr
[junit4:junit4]   2> 341 T2016 oasc.SolrResourceLoader.<init> new SolrResourceLoader for deduced Solr Home: '/usr/home/hudson/hudson-slave/workspace/Lucene-Solr-Tests-trunk-Java6/solr/build/solr-core/test-files/solr/'
[junit4:junit4]   2> 363 T2016 oass.SolrDispatchFilter.init SolrDispatchFilter.init()
[junit4:junit4]   2> 364 T2016 oasc.SolrResourceLoader.locateSolrHome JNDI not configured for solr (NoInitialContextEx)
[junit4:junit4]   2> 364 T2016 oasc.SolrResourceLoader.locateSolrHome using system property solr.solr.home: /usr/home/hudson/hudson-slave/workspace/Lucene-Solr-Tests-trunk-Java6/solr/build/solr-core/test-files/solr
[junit4:junit4]   2> 365 T2016 oasc.CoreContainer$Initializer.initialize looking for solr.xml: /usr/home/hudson/hudson-slave/workspace/Lucene-Solr-Tests-trunk-Java6/solr/build/solr-core/test-files/solr/solr.xml
[junit4:junit4]   2> 365 T2016 oasc.CoreContainer.<init> New CoreContainer 2061241618
[junit4:junit4]   2> 366 T2016 oasc.CoreContainer.load Loading CoreContainer using Solr Home: '/usr/home/hudson/hudson-slave/workspace/Lucene-Solr-Tests-trunk-Java6/solr/build/solr-core/test-files/solr/'
[junit4:junit4]   2> 366 T2016 oasc.SolrResourceLoader.<init> new SolrResourceLoader for directory: '/usr/home/hudson/hudson-slave/workspace/Lucene-Solr-Tests-trunk-Java6/solr/build/solr-core/test-files/solr/'
[junit4:junit4]   2> 393 T2016 oasc.CoreContainer.load Registering Log Listener
[junit4:junit4]   2> 409 T2016 oasc.CoreContainer.initZooKeeper Zookeeper client=127.0.0.1:30056/solr
[junit4:junit4]   2> 410 T2016 oaz.ZooKeeper.<init> Initiating client connection, connectString=127.0.0.1:30056/solr sessionTimeout=5000 watcher=org.apache.solr.common.cloud.ConnectionManager@2153840d
[junit4:junit4]   2> 411 T2035 oaz.ClientCnxn$SendThread.startConnect Opening socket connection to server /127.0.0.1:30056
[junit4:junit4]   2> 411 T2016 oascc.ConnectionManager.waitForConnected Waiting for client to connect to ZooKeeper
[junit4:junit4]   2> 412 T2035 oaz.ClientCnxn$SendThread.primeConnection Socket connection established to localhost/127.0.0.1:30056, initiating session
[junit4:junit4]   2> 413 T2018 oazs.NIOServerCnxn$Factory.run Accepted socket connection from /140.211.11.196:30783
[junit4:junit4]   2> 413 T2018 oazs.NIOServerCnxn.readConnectRequest Client attempting to establish new session at /140.211.11.196:30783
[junit4:junit4]   2> 414 T2020 oazs.NIOServerCnxn.finishSessionInit Established session 0x139c84bcd540002 with negotiated timeout 5000 for client /140.211.11.196:30783
[junit4:junit4]   2> 414 T2035 oaz.ClientCnxn$SendThread.readConnectResult Session establishment complete on server localhost/127.0.0.1:30056, sessionid = 0x139c84bcd540002, negotiated timeout = 5000
[junit4:junit4]   2> 415 T2036 oascc.ConnectionManager.process Watcher org.apache.solr.common.cloud.ConnectionManager@2153840d name:ZooKeeperConnection Watcher:127.0.0.1:30056/solr got event WatchedEvent state:SyncConnected type:None path:null path:null type:None
[junit4:junit4]   2> 415 T2016 oascc.ConnectionManager.waitForConnected Client is connected to ZooKeeper
[junit4:junit4]   2> 416 T2021 oazs.PrepRequestProcessor.pRequest Got user-level KeeperException when processing sessionid:0x139c84bcd540002 type:create cxid:0x2 zxid:0xfffffffffffffffe txntype:unknown reqpath:n/a Error Path:/solr/overseer Error:KeeperErrorCode = NodeExists for /solr/overseer
[junit4:junit4]   2> 417 T2016 oascc.SolrZkClient.makePath makePath: /live_nodes
[junit4:junit4]   2> 426 T2016 oasc.ZkController.createEphemeralLiveNode Register node as live in ZooKeeper:/live_nodes/127.0.0.1:30102_solr
[junit4:junit4]   2> 426 T2021 oazs.PrepRequestProcessor.pRequest Got user-level KeeperException when processing sessionid:0x139c84bcd540002 type:delete cxid:0x7 zxid:0xfffffffffffffffe txntype:unknown reqpath:n/a Error Path:/solr/live_nodes/127.0.0.1:30102_solr Error:KeeperErrorCode = NoNode for /solr/live_nodes/127.0.0.1:30102_solr
[junit4:junit4]   2> 427 T2016 oascc.SolrZkClient.makePath makePath: /live_nodes/127.0.0.1:30102_solr
[junit4:junit4]   2> 434 T2016 oashc.HttpShardHandlerFactory.getParameter Setting socketTimeout to: 0
[junit4:junit4]   2> 434 T2016 oashc.HttpShardHandlerFactory.getParameter Setting urlScheme to: http://
[junit4:junit4]   2> 435 T2016 oashc.HttpShardHandlerFactory.getParameter Setting connTimeout to: 0
[junit4:junit4]   2> 436 T2016 oashc.HttpShardHandlerFactory.getParameter Setting maxConnectionsPerHost to: 20
[junit4:junit4]   2> 437 T2016 oashc.HttpShardHandlerFactory.getParameter Setting corePoolSize to: 0
[junit4:junit4]   2> 437 T2016 oashc.HttpShardHandlerFactory.getParameter Setting maximumPoolSize to: 2147483647
[junit4:junit4]   2> 438 T2016 oashc.HttpShardHandlerFactory.getParameter Setting maxThreadIdleTime to: 5
[junit4:junit4]   2> 438 T2016 oashc.HttpShardHandlerFactory.getParameter Setting sizeOfQueue to: -1
[junit4:junit4]   2> 439 T2016 oashc.HttpShardHandlerFactory.getParameter Setting fairnessPolicy to: false
[junit4:junit4]   2> 439 T2016 oascsi.HttpClientUtil.createClient Creating new http client, config:maxConnectionsPerHost=20&maxConnections=10000&socketTimeout=0&connTimeout=0&retry=false
[junit4:junit4]   2> 456 T2016 oascc.SolrZkClient.makePath makePath: /overseer_elect/election
[junit4:junit4]   2> 460 T2021 oazs.PrepRequestProcessor.pRequest Got user-level KeeperException when processing sessionid:0x139c84bcd540002 type:delete cxid:0x15 zxid:0xfffffffffffffffe txntype:unknown reqpath:n/a Error Path:/solr/overseer_elect/leader Error:KeeperErrorCode = NoNode for /solr/overseer_elect/leader
[junit4:junit4]   2> 472 T2016 oascc.SolrZkClient.makePath makePath: /overseer_elect/leader
[junit4:junit4]   2> 474 T2016 oasc.Overseer.start Overseer (id=88321895603372034-127.0.0.1:30102_solr-n_0000000000) starting
[junit4:junit4]   2> 475 T2021 oazs.PrepRequestProcessor.pRequest Got user-level KeeperException when processing sessionid:0x139c84bcd540002 type:create cxid:0x1a zxid:0xfffffffffffffffe txntype:unknown reqpath:n/a Error Path:/solr/overseer Error:KeeperErrorCode = NodeExists for /solr/overseer
[junit4:junit4]   2> 476 T2021 oazs.PrepRequestProcessor.pRequest Got user-level KeeperException when processing sessionid:0x139c84bcd540002 type:create cxid:0x1b zxid:0xfffffffffffffffe txntype:unknown reqpath:n/a Error Path:/solr/overseer Error:KeeperErrorCode = NodeExists for /solr/overseer
[junit4:junit4]   2> 477 T2021 oazs.PrepRequestProcessor.pRequest Got user-level KeeperException when processing sessionid:0x139c84bcd540002 type:create cxid:0x1c zxid:0xfffffffffffffffe txntype:unknown reqpath:n/a Error Path:/solr/overseer Error:KeeperErrorCode = NodeExists for /solr/overseer
[junit4:junit4]   2> 490 T2021 oazs.PrepRequestProcessor.pRequest Got user-level KeeperException when processing sessionid:0x139c84bcd540002 type:create cxid:0x1d zxid:0xfffffffffffffffe txntype:unknown reqpath:n/a Error Path:/solr/overseer Error:KeeperErrorCode = NodeExists for /solr/overseer
[junit4:junit4]   2> 491 T2038 oasc.OverseerCollectionProcessor.run Process current queue of collection creations
[junit4:junit4]   2> 491 T2016 oascc.SolrZkClient.makePath makePath: /clusterstate.json
[junit4:junit4]   2> 501 T2016 oascc.ZkStateReader.createClusterStateWatchersAndUpdate Updating cluster state from ZooKeeper... 
[junit4:junit4]   2> 502 T2037 oasc.Overseer$ClusterStateUpdater.run Starting to work on the main queue
[junit4:junit4]   2> 507 T2016 oasc.CoreContainer.create Creating SolrCore 'collection1' using instanceDir: /usr/home/hudson/hudson-slave/workspace/Lucene-Solr-Tests-trunk-Java6/solr/build/solr-core/test-files/solr/collection1
[junit4:junit4]   2> 508 T2016 oasc.ZkController.createCollectionZkNode Check for collection zkNode:control_collection
[junit4:junit4]   2> 508 T2016 oasc.ZkController.createCollectionZkNode Collection zkNode exists
[junit4:junit4]   2> 509 T2016 oasc.ZkController.readConfigName Load collection config from:/collections/control_collection
[junit4:junit4]   2> 510 T2016 oasc.SolrResourceLoader.<init> new SolrResourceLoader for directory: '/usr/home/hudson/hudson-slave/workspace/Lucene-Solr-Tests-trunk-Java6/solr/build/solr-core/test-files/solr/collection1/'
[junit4:junit4]   2> 511 T2016 oasc.SolrResourceLoader.replaceClassLoader Adding 'file:/usr/home/hudson/hudson-slave/workspace/Lucene-Solr-Tests-trunk-Java6/solr/build/solr-core/test-files/solr/collection1/lib/README' to classloader
[junit4:junit4]   2> 511 T2016 oasc.SolrResourceLoader.replaceClassLoader Adding 'file:/usr/home/hudson/hudson-slave/workspace/Lucene-Solr-Tests-trunk-Java6/solr/build/solr-core/test-files/solr/collection1/lib/classes/' to classloader
[junit4:junit4]   2> 563 T2016 oasc.SolrConfig.<init> Using Lucene MatchVersion: LUCENE_50
[junit4:junit4]   2> 637 T2016 oasc.SolrConfig.<init> Loaded SolrConfig: solrconfig.xml
[junit4:junit4]   2> 738 T2016 oass.IndexSchema.readSchema Reading Solr Schema
[junit4:junit4]   2> 754 T2016 oass.IndexSchema.readSchema Schema name=test
[junit4:junit4]   2> 1413 T2016 oass.OpenExchangeRatesOrgProvider.init Initialized with rates=open-exchange-rates.json, refreshInterval=1440.
[junit4:junit4]   2> 1422 T2016 oass.IndexSchema.readSchema default search field in schema is text
[junit4:junit4]   2> 1425 T2016 oass.IndexSchema.readSchema unique key field: id
[junit4:junit4]   2> 1432 T2016 oass.FileExchangeRateProvider.reload Reloading exchange rates from file currency.xml
[junit4:junit4]   2> 1436 T2016 oass.FileExchangeRateProvider.reload Reloading exchange rates from file currency.xml
[junit4:junit4]   2> 1439 T2016 oass.OpenExchangeRatesOrgProvider.reload Reloading exchange rates from open-exchange-rates.json
[junit4:junit4]   2> 1441 T2016 oass.OpenExchangeRatesOrgProvider.reload Reloading exchange rates from open-exchange-rates.json
[junit4:junit4]   2> 1442 T2016 oasc.SolrCore.<init> [collection1] Opening new SolrCore at /usr/home/hudson/hudson-slave/workspace/Lucene-Solr-Tests-trunk-Java6/solr/build/solr-core/test-files/solr/collection1/, dataDir=./org.apache.solr.cloud.BasicDistributedZk2Test-1347685174604/control/data/
[junit4:junit4]   2> 1442 T2016 oasc.JmxMonitoredMap.<init> JMX monitoring is enabled. Adding Solr mbeans to JMX Server: com.sun.jmx.mbeanserver.JmxMBeanServer@f5bfdbd
[junit4:junit4]   2> 1443 T2016 oasc.SolrCore.getNewIndexDir WARNING New index directory detected: old=null new=./org.apache.solr.cloud.BasicDistributedZk2Test-1347685174604/control/data/index/
[junit4:junit4]   2> 1444 T2016 oasc.SolrCore.initIndex WARNING [collection1] Solr index directory './org.apache.solr.cloud.BasicDistributedZk2Test-1347685174604/control/data/index' doesn't exist. Creating new index...
[junit4:junit4]   2> 1445 T2016 oasc.CachingDirectoryFactory.get return new directory for /usr/home/hudson/hudson-slave/workspace/Lucene-Solr-Tests-trunk-Java6/solr/build/solr-core/test/J0/./org.apache.solr.cloud.BasicDistributedZk2Test-1347685174604/control/data/index forceNew:false
[junit4:junit4]   2> 1459 T2016 oasc.SolrDeletionPolicy.onCommit SolrDeletionPolicy.onCommit: commits:num=1
[junit4:junit4]   2> 		commit{dir=NRTCachingDirectory(org.apache.lucene.store.NIOFSDirectory@/usr/home/hudson/hudson-slave/workspace/Lucene-Solr-Tests-trunk-Java6/solr/build/solr-core/test/J0/org.apache.solr.cloud.BasicDistributedZk2Test-1347685174604/control/data/index lockFactory=org.apache.lucene.store.NativeFSLockFactory@5c766625; maxCacheMB=48.0 maxMergeSizeMB=4.0),segFN=segments_1,generation=1,filenames=[segments_1]
[junit4:junit4]   2> 1460 T2016 oasc.SolrDeletionPolicy.updateCommits newest commit = 1
[junit4:junit4]   2> 1460 T2016 oasc.SolrCore.initWriters created xml: solr.XMLResponseWriter
[junit4:junit4]   2> 1462 T2016 oasup.UpdateRequestProcessorChain.init inserting DistributedUpdateProcessorFactory into updateRequestProcessorChain "dedupe"
[junit4:junit4]   2> 1462 T2016 oasup.UpdateRequestProcessorChain.init inserting DistributedUpdateProcessorFactory into updateRequestProcessorChain "dedupe-allfields"
[junit4:junit4]   2> 1463 T2016 oasup.UpdateRequestProcessorChain.init inserting DistributedUpdateProcessorFactory into updateRequestProcessorChain "stored_sig"
[junit4:junit4]   2> 1463 T2016 oasup.UpdateRequestProcessorChain.init inserting DistributedUpdateProcessorFactory into updateRequestProcessorChain "uniq-fields"
[junit4:junit4]   2> 1464 T2016 oasup.UpdateRequestProcessorChain.init inserting DistributedUpdateProcessorFactory into updateRequestProcessorChain "distrib-dup-test-chain-implicit"
[junit4:junit4]   2> 1464 T2016 oasc.RequestHandlers.initHandlersFromConfig adding lazy requestHandler: solr.ReplicationHandler
[junit4:junit4]   2> 1464 T2016 oasc.RequestHandlers.initHandlersFromConfig created /replication: solr.ReplicationHandler
[junit4:junit4]   2> 1465 T2016 oasc.RequestHandlers.initHandlersFromConfig created standard: solr.StandardRequestHandler
[junit4:junit4]   2> 1465 T2016 oasc.RequestHandlers.initHandlersFromConfig created /get: solr.RealTimeGetHandler
[junit4:junit4]   2> 1465 T2016 oasc.RequestHandlers.initHandlersFromConfig created dismax: solr.SearchHandler
[junit4:junit4]   2> 1466 T2016 oasc.RequestHandlers.initHandlersFromConfig created mock: org.apache.solr.core.MockQuerySenderListenerReqHandler
[junit4:junit4]   2> 1466 T2016 oasc.RequestHandlers.initHandlersFromConfig created /admin/: org.apache.solr.handler.admin.AdminHandlers
[junit4:junit4]   2> 1467 T2016 oasc.RequestHandlers.initHandlersFromConfig created defaults: solr.StandardRequestHandler
[junit4:junit4]   2> 1467 T2016 oasc.RequestHandlers.initHandlersFromConfig adding lazy requestHandler: solr.StandardRequestHandler
[junit4:junit4]   2> 1467 T2016 oasc.RequestHandlers.initHandlersFromConfig created lazy: solr.StandardRequestHandler
[junit4:junit4]   2> 1468 T2016 oasc.RequestHandlers.initHandlersFromConfig created /update: solr.UpdateRequestHandler
[junit4:junit4]   2> 1468 T2016 oasc.RequestHandlers.initHandlersFromConfig created /terms: org.apache.solr.handler.component.SearchHandler
[junit4:junit4]   2> 1469 T2016 oasc.RequestHandlers.initHandlersFromConfig created spellCheckCompRH: org.apache.solr.handler.component.SearchHandler
[junit4:junit4]   2> 1469 T2016 oasc.RequestHandlers.initHandlersFromConfig created spellCheckCompRH_Direct: org.apache.solr.handler.component.SearchHandler
[junit4:junit4]   2> 1470 T2016 oasc.RequestHandlers.initHandlersFromConfig created spellCheckWithWordbreak: org.apache.solr.handler.component.SearchHandler
[junit4:junit4]   2> 1470 T2016 oasc.RequestHandlers.initHandlersFromConfig created spellCheckWithWordbreak_Direct: org.apache.solr.handler.component.SearchHandler
[junit4:junit4]   2> 1471 T2016 oasc.RequestHandlers.initHandlersFromConfig created spellCheckCompRH1: org.apache.solr.handler.component.SearchHandler
[junit4:junit4]   2> 1471 T2016 oasc.RequestHandlers.initHandlersFromConfig created tvrh: org.apache.solr.handler.component.SearchHandler
[junit4:junit4]   2> 1471 T2016 oasc.RequestHandlers.initHandlersFromConfig created /mlt: solr.MoreLikeThisHandler
[junit4:junit4]   2> 1472 T2016 oasc.RequestHandlers.initHandlersFromConfig created /debug/dump: solr.DumpRequestHandler
[junit4:junit4]   2> 1475 T2016 oashl.XMLLoader.init xsltCacheLifetimeSeconds=60
[junit4:junit4]   2> 1479 T2016 oasc.SolrCore.initDeprecatedSupport WARNING solrconfig.xml uses deprecated <admin/gettableFiles>, Please update your config to use the ShowFileRequestHandler.
[junit4:junit4]   2> 1480 T2016 oasc.SolrCore.initDeprecatedSupport WARNING adding ShowFileRequestHandler with hidden files: [SCHEMA.XML, OLD_SYNONYMS.TXT, STOPWORDS.TXT, PROTWORDS.TXT, OPEN-EXCHANGE-RATES.JSON, SYNONYMS.TXT, CURRENCY.XML, MAPPING-ISOLATIN1ACCENT.TXT]
[junit4:junit4]   2> 1483 T2016 oass.SolrIndexSearcher.<init> Opening Searcher@3445e34f main
[junit4:junit4]   2> 1484 T2016 oasu.CommitTracker.<init> Hard AutoCommit: disabled
[junit4:junit4]   2> 1484 T2016 oasu.CommitTracker.<init> Soft AutoCommit: disabled
[junit4:junit4]   2> 1485 T2016 oashc.SpellCheckComponent.inform Initializing spell checkers
[junit4:junit4]   2> 1490 T2016 oass.DirectSolrSpellChecker.init init: {name=direct,classname=DirectSolrSpellChecker,field=lowerfilt,minQueryLength=3}
[junit4:junit4]   2> 1538 T2039 oasc.SolrCore.registerSearcher [collection1] Registered new searcher Searcher@3445e34f main{StandardDirectoryReader(segments_1:1)}
[junit4:junit4]   2> 1540 T2021 oazs.PrepRequestProcessor.pRequest Got user-level KeeperException when processing sessionid:0x139c84bcd540002 type:create cxid:0x56 zxid:0xfffffffffffffffe txntype:unknown reqpath:n/a Error Path:/solr/overseer/queue Error:KeeperErrorCode = NoNode for /solr/overseer/queue
[junit4:junit4]   2> 1549 T2016 oasc.CoreContainer.register registering core: collection1
[junit4:junit4]   2> 1550 T2016 oasc.ZkController.register Register shard - core:collection1 address:http://127.0.0.1:30102/solr shardId:control_shard
[junit4:junit4]   2> 1551 T2016 oascc.SolrZkClient.makePath makePath: /collections/control_collection/leader_elect/control_shard/election
[junit4:junit4]   2> 1566 T2021 oazs.PrepRequestProcessor.pRequest Got user-level KeeperException when processing sessionid:0x139c84bcd540002 type:delete cxid:0x65 zxid:0xfffffffffffffffe txntype:unknown reqpath:n/a Error Path:/solr/collections/control_collection/leaders Error:KeeperErrorCode = NoNode for /solr/collections/control_collection/leaders
[junit4:junit4]   2> 1567 T2016 oasc.ShardLeaderElectionContext.runLeaderProcess Running the leader process.
[junit4:junit4]   2> 1567 T2021 oazs.PrepRequestProcessor.pRequest Got user-level KeeperException when processing sessionid:0x139c84bcd540002 type:create cxid:0x66 zxid:0xfffffffffffffffe txntype:unknown reqpath:n/a Error Path:/solr/overseer Error:KeeperErrorCode = NodeExists for /solr/overseer
[junit4:junit4]   2> 2007 T2037 oascc.ZkStateReader.updateClusterState Updating cloud state from ZooKeeper... 
[junit4:junit4]   2> 2010 T2021 oazs.PrepRequestProcessor.pRequest Got user-level KeeperException when processing sessionid:0x139c84bcd540002 type:create cxid:0x6d zxid:0xfffffffffffffffe txntype:unknown reqpath:n/a Error Path:/solr/overseer/queue-work Error:KeeperErrorCode = NoNode for /solr/overseer/queue-work
[junit4:junit4]   2> 2040 T2036 oascc.ZkStateReader$2.process A cluster state change has occurred - updating...
[junit4:junit4]   2> 2075 T2016 oasc.ShardLeaderElectionContext.waitForReplicasToComeUp Enough replicas found to continue.
[junit4:junit4]   2> 2076 T2016 oasc.ShardLeaderElectionContext.runLeaderProcess I may be the new leader - try and sync
[junit4:junit4]   2> 2076 T2016 oasc.SyncStrategy.sync Sync replicas to http://127.0.0.1:30102/solr/collection1/
[junit4:junit4]   2> 2076 T2016 oasc.SyncStrategy.syncReplicas Sync Success - now sync replicas to me
[junit4:junit4]   2> 2077 T2016 oasc.SyncStrategy.syncToMe http://127.0.0.1:30102/solr/collection1/ has no replicas
[junit4:junit4]   2> 2077 T2016 oasc.ShardLeaderElectionContext.runLeaderProcess I am the new leader: http://127.0.0.1:30102/solr/collection1/
[junit4:junit4]   2> 2077 T2016 oascc.SolrZkClient.makePath makePath: /collections/control_collection/leaders/control_shard
[junit4:junit4]   2> 2080 T2021 oazs.PrepRequestProcessor.pRequest Got user-level KeeperException when processing sessionid:0x139c84bcd540002 type:create cxid:0x8b zxid:0xfffffffffffffffe txntype:unknown reqpath:n/a Error Path:/solr/overseer Error:KeeperErrorCode = NodeExists for /solr/overseer
[junit4:junit4]   2> 2544 T2037 oascc.ZkStateReader.updateClusterState Updating cloud state from ZooKeeper... 
[junit4:junit4]   2> 2559 T2036 oascc.ZkStateReader$2.process A cluster state change has occurred - updating...
[junit4:junit4]   2> 2599 T2016 oasc.ZkController.register We are http://127.0.0.1:30102/solr/collection1/ and leader is http://127.0.0.1:30102/solr/collection1/
[junit4:junit4]   2> 2599 T2016 oasc.ZkController.register No LogReplay needed for core=collection1 baseURL=http://127.0.0.1:30102/solr
[junit4:junit4]   2> 2600 T2016 oasc.ZkController.checkRecovery I am the leader, no recovery necessary
[junit4:junit4]   2> 2608 T2016 oascc.ZkStateReader.updateClusterState Updating cloud state from ZooKeeper... 
[junit4:junit4]   2> 2609 T2016 oass.SolrDispatchFilter.init user.dir=/usr/home/hudson/hudson-slave/workspace/Lucene-Solr-Tests-trunk-Java6/solr/build/solr-core/test/J0
[junit4:junit4]   2> 2609 T2016 oass.SolrDispatchFilter.init SolrDispatchFilter.init() done
[junit4:junit4]   2> 2610 T2016 oascsi.HttpClientUtil.createClient Creating new http client, config:maxConnections=128&maxConnectionsPerHost=32&followRedirects=false
[junit4:junit4]   2> 2626 T2016 oejs.Server.doStart jetty-8.1.2.v20120308
[junit4:junit4]   2> 2628 T2016 oejs.AbstractConnector.doStart Started SocketConnector@0.0.0.0:14075
[junit4:junit4]   2> 2629 T2016 oasc.SolrResourceLoader.locateSolrHome JNDI not configured for solr (NoInitialContextEx)
[junit4:junit4]   2> 2630 T2016 oasc.SolrResourceLoader.locateSolrHome using system property solr.solr.home: /usr/home/hudson/hudson-slave/workspace/Lucene-Solr-Tests-trunk-Java6/solr/build/solr-core/test-files/solr
[junit4:junit4]   2> 2630 T2016 oasc.SolrResourceLoader.<init> new SolrResourceLoader for deduced Solr Home: '/usr/home/hudson/hudson-slave/workspace/Lucene-Solr-Tests-trunk-Java6/solr/build/solr-core/test-files/solr/'
[junit4:junit4]   2> 2664 T2016 oass.SolrDispatchFilter.init SolrDispatchFilter.init()
[junit4:junit4]   2> 2664 T2016 oasc.SolrResourceLoader.locateSolrHome JNDI not configured for solr (NoInitialContextEx)
[junit4:junit4]   2> 2665 T2016 oasc.SolrResourceLoader.locateSolrHome using system property solr.solr.home: /usr/home/hudson/hudson-slave/workspace/Lucene-Solr-Tests-trunk-Java6/solr/build/solr-core/test-files/solr
[junit4:junit4]   2> 2665 T2016 oasc.CoreContainer$Initializer.initialize looking for solr.xml: /usr/home/hudson/hudson-slave/workspace/Lucene-Solr-Tests-trunk-Java6/solr/build/solr-core/test-files/solr/solr.xml
[junit4:junit4]   2> 2666 T2016 oasc.CoreContainer.<init> New CoreContainer 1110471149
[junit4:junit4]   2> 2666 T2016 oasc.CoreContainer.load Loading CoreContainer using Solr Home: '/usr/home/hudson/hudson-slave/workspace/Lucene-Solr-Tests-trunk-Java6/solr/build/solr-core/test-files/solr/'
[junit4:junit4]   2> 2667 T2016 oasc.SolrResourceLoader.<init> new SolrResourceLoader for directory: '/usr/home/hudson/hudson-slave/workspace/Lucene-Solr-Tests-trunk-Java6/solr/build/solr-core/test-files/solr/'
[junit4:junit4]   2> 2691 T2016 oasc.CoreContainer.load Registering Log Listener
[junit4:junit4]   2> 2705 T2016 oasc.CoreContainer.initZooKeeper Zookeeper client=127.0.0.1:30056/solr
[junit4:junit4]   2> 2706 T2016 oaz.ZooKeeper.<init> Initiating client connection, connectString=127.0.0.1:30056/solr sessionTimeout=5000 watcher=org.apache.solr.common.cloud.ConnectionManager@5e3dc7d3
[junit4:junit4]   2> 2707 T2049 oaz.ClientCnxn$SendThread.startConnect Opening socket connection to server /127.0.0.1:30056
[junit4:junit4]   2> 2707 T2016 oascc.ConnectionManager.waitForConnected Waiting for client to connect to ZooKeeper
[junit4:junit4]   2> 2708 T2049 oaz.ClientCnxn$SendThread.primeConnection Socket connection established to localhost/127.0.0.1:30056, initiating session
[junit4:junit4]   2> 2708 T2018 oazs.NIOServerCnxn$Factory.run Accepted socket connection from /140.211.11.196:25241
[junit4:junit4]   2> 2709 T2018 oazs.NIOServerCnxn.readConnectRequest Client attempting to establish new session at /140.211.11.196:25241
[junit4:junit4]   2> 2710 T2020 oazs.NIOServerCnxn.finishSessionInit Established session 0x139c84bcd540003 with negotiated timeout 5000 for client /140.211.11.196:25241
[junit4:junit4]   2> 2710 T2049 oaz.ClientCnxn$SendThread.readConnectResult Session establishment complete on server localhost/127.0.0.1:30056, sessionid = 0x139c84bcd540003, negotiated timeout = 5000
[junit4:junit4]   2> 2711 T2050 oascc.ConnectionManager.process Watcher org.apache.solr.common.cloud.ConnectionManager@5e3dc7d3 name:ZooKeeperConnection Watcher:127.0.0.1:30056/solr got event WatchedEvent state:SyncConnected type:None path:null path:null type:None
[junit4:junit4]   2> 2711 T2016 oascc.ConnectionManager.waitForConnected Client is connected to ZooKeeper
[junit4:junit4]   2> 2712 T2021 oazs.PrepRequestProcessor.pRequest Got user-level KeeperException when processing sessionid:0x139c84bcd540003 type:create cxid:0x1 zxid:0xfffffffffffffffe txntype:unknown reqpath:n/a Error Path:/solr/overseer Error:KeeperErrorCode = NodeExists for /solr/overseer
[junit4:junit4]   2> 2713 T2021 oazs.PrepRequestProcessor.pRequest Got user-level KeeperException when processing sessionid:0x139c84bcd540003 type:create cxid:0x2 zxid:0xfffffffffffffffe txntype:unknown reqpath:n/a Error Path:/solr/overseer Error:KeeperErrorCode = NodeExists for /solr/overseer
[junit4:junit4]   2> 2725 T2016 oasc.ZkController.createEphemeralLiveNode Register node as live in ZooKeeper:/live_nodes/127.0.0.1:14075_solr
[junit4:junit4]   2> 2726 T2021 oazs.PrepRequestProcessor.pRequest Got user-level KeeperException when processing sessionid:0x139c84bcd540003 type:delete cxid:0x4 zxid:0xfffffffffffffffe txntype:unknown reqpath:n/a Error Path:/solr/live_nodes/127.0.0.1:14075_solr Error:KeeperErrorCode = NoNode for /solr/live_nodes/127.0.0.1:14075_solr
[junit4:junit4]   2> 2732 T2016 oascc.SolrZkClient.makePath makePath: /live_nodes/127.0.0.1:14075_solr
[junit4:junit4]   2> 2734 T2036 oascc.ZkStateReader$3.process Updating live nodes
[junit4:junit4]   2> 2735 T2016 oashc.HttpShardHandlerFactory.getParameter Setting socketTimeout to: 0
[junit4:junit4]   2> 2736 T2016 oashc.HttpShardHandlerFactory.getParameter Setting urlScheme to: http://
[junit4:junit4]   2> 2736 T2016 oashc.HttpShardHandlerFactory.getParameter Setting connTimeout to: 0
[junit4:junit4]   2> 2736 T2016 oashc.HttpShardHandlerFactory.getParameter Setting maxConnectionsPerHost to: 20
[junit4:junit4]   2> 2737 T2016 oashc.HttpShardHandlerFactory.getParameter Setting corePoolSize to: 0
[junit4:junit4]   2> 2737 T2016 oashc.HttpShardHandlerFactory.getParameter Setting maximumPoolSize to: 2147483647
[junit4:junit4]   2> 2738 T2016 oashc.HttpShardHandlerFactory.getParameter Setting maxThreadIdleTime to: 5
[junit4:junit4]   2> 2738 T2016 oashc.HttpShardHandlerFactory.getParameter Setting sizeOfQueue to: -1
[junit4:junit4]   2> 2739 T2016 oashc.HttpShardHandlerFactory.getParameter Setting fairnessPolicy to: false
[junit4:junit4]   2> 2739 T2016 oascsi.HttpClientUtil.createClient Creating new http client, config:maxConnectionsPerHost=20&maxConnections=10000&socketTimeout=0&connTimeout=0&retry=false
[junit4:junit4]   2> 2753 T2016 oascc.ZkStateReader.createClusterStateWatchersAndUpdate Updating cluster state from ZooKeeper... 
[junit4:junit4]   2> 2760 T2016 oasc.CoreContainer.create Creating SolrCore 'collection1' using instanceDir: /usr/home/hudson/hudson-slave/workspace/Lucene-Solr-Tests-trunk-Java6/solr/build/solr-core/test-files/solr/collection1
[junit4:junit4]   2> 2760 T2016 oasc.ZkController.createCollectionZkNode Check for collection zkNode:collection1
[junit4:junit4]   2> 2761 T2016 oasc.ZkController.createCollectionZkNode Collection zkNode exists
[junit4:junit4]   2> 2761 T2016 oasc.ZkController.readConfigName Load collection config from:/collections/collection1
[junit4:junit4]   2> 2763 T2016 oasc.SolrResourceLoader.<init> new SolrResourceLoader for directory: '/usr/home/hudson/hudson-slave/workspace/Lucene-Solr-Tests-trunk-Java6/solr/build/solr-core/test-files/solr/collection1/'
[junit4:junit4]   2> 2764 T2016 oasc.SolrResourceLoader.replaceClassLoader Adding 'file:/usr/home/hudson/hudson-slave/workspace/Lucene-Solr-Tests-trunk-Java6/solr/build/solr-core/test-files/solr/collection1/lib/README' to classloader
[junit4:junit4]   2> 2765 T2016 oasc.SolrResourceLoader.replaceClassLoader Adding 'file:/usr/home/hudson/hudson-slave/workspace/Lucene-Solr-Tests-trunk-Java6/solr/build/solr-core/test-files/solr/collection1/lib/classes/' to classloader
[junit4:junit4]   2> 2819 T2016 oasc.SolrConfig.<init> Using Lucene MatchVersion: LUCENE_50
[junit4:junit4]   2> 2890 T2016 oasc.SolrConfig.<init> Loaded SolrConfig: solrconfig.xml
[junit4:junit4]   2> 2991 T2016 oass.IndexSchema.readSchema Reading Solr Schema
[junit4:junit4]   2> 3007 T2016 oass.IndexSchema.readSchema Schema name=test
[junit4:junit4]   2> 3072 T2037 oascc.ZkStateReader.updateClusterState Updating cloud state from ZooKeeper... 
[junit4:junit4]   2> 3085 T2036 oascc.ZkStateReader$2.process A cluster state change has occurred - updating...
[junit4:junit4]   2> 3085 T2050 oascc.ZkStateReader$2.process A cluster state change has occurred - updating...
[junit4:junit4]   2> 3660 T2016 oass.OpenExchangeRatesOrgProvider.init Initialized with rates=open-exchange-rates.json, refreshInterval=1440.
[junit4:junit4]   2> 3672 T2016 oass.IndexSchema.readSchema default search field in schema is text
[junit4:junit4]   2> 3676 T2016 oass.IndexSchema.readSchema unique key field: id
[junit4:junit4]   2> 3686 T2016 oass.FileExchangeRateProvider.reload Reloading exchange rates from file currency.xml
[junit4:junit4]   2> 3691 T2016 oass.FileExchangeRateProvider.reload Reloading exchange rates from file currency.xml
[junit4:junit4]   2> 3696 T2016 oass.OpenExchangeRatesOrgProvider.reload Reloading exchange rates from open-exchange-rates.json
[junit4:junit4]   2> 3697 T2016 oass.OpenExchangeRatesOrgProvider.reload Reloading exchange rates from open-exchange-rates.json
[junit4:junit4]   2> 3698 T2016 oasc.SolrCore.<init> [collection1] Opening new SolrCore at /usr/home/hudson/hudson-slave/workspace/Lucene-Solr-Tests-trunk-Java6/solr/build/solr-core/test-files/solr/collection1/, dataDir=./org.apache.solr.cloud.BasicDistributedZk2Test-1347685174604/jetty1/
[junit4:junit4]   2> 3698 T2016 oasc.JmxMonitoredMap.<init> JMX monitoring is enabled. Adding Solr mbeans to JMX Server: com.sun.jmx.mbeanserver.JmxMBeanServer@f5bfdbd
[junit4:junit4]   2> 3700 T2016 oasc.SolrCore.getNewIndexDir WARNING New index directory detected: old=null new=./org.apache.solr.cloud.BasicDistributedZk2Test-1347685174604/jetty1/index/
[junit4:junit4]   2> 3701 T2016 oasc.SolrCore.initIndex WARNING [collection1] Solr index directory './org.apache.solr.cloud.BasicDistributedZk2Test-1347685174604/jetty1/index' doesn't exist. Creating new index...
[junit4:junit4]   2> 3702 T2016 oasc.CachingDirectoryFactory.get return new directory for /usr/home/hudson/hudson-slave/workspace/Lucene-Solr-Tests-trunk-Java6/solr/build/solr-core/test/J0/./org.apache.solr.cloud.BasicDistributedZk2Test-1347685174604/jetty1/index forceNew:false
[junit4:junit4]   2> 3714 T2016 oasc.SolrDeletionPolicy.onCommit SolrDeletionPolicy.onCommit: commits:num=1
[junit4:junit4]   2> 		commit{dir=NRTCachingDirectory(org.apache.lucene.store.NIOFSDirectory@/usr/home/hudson/hudson-slave/workspace/Lucene-Solr-Tests-trunk-Java6/solr/build/solr-core/test/J0/org.apache.solr.cloud.BasicDistributedZk2Test-1347685174604/jetty1/index lockFactory=org.apache.lucene.store.NativeFSLockFactory@2ecef336; maxCacheMB=48.0 maxMergeSizeMB=4.0),segFN=segments_1,generation=1,filenames=[segments_1]
[junit4:junit4]   2> 3715 T2016 oasc.SolrDeletionPolicy.updateCommits newest commit = 1
[junit4:junit4]   2> 3716 T2016 oasc.SolrCore.initWriters created xml: solr.XMLResponseWriter
[junit4:junit4]   2> 3718 T2016 oasup.UpdateRequestProcessorChain.init inserting DistributedUpdateProcessorFactory into updateRequestProcessorChain "dedupe"
[junit4:junit4]   2> 3718 T2016 oasup.UpdateRequestProcessorChain.init inserting DistributedUpdateProcessorFactory into updateRequestProcessorChain "dedupe-allfields"
[junit4:junit4]   2> 3719 T2016 oasup.UpdateRequestProcessorChain.init inserting DistributedUpdateProcessorFactory into updateRequestProcessorChain "stored_sig"
[junit4:junit4]   2> 3719 T2016 oasup.UpdateRequestProcessorChain.init inserting DistributedUpdateProcessorFactory into updateRequestProcessorChain "uniq-fields"
[junit4:junit4]   2> 3720 T2016 oasup.UpdateRequestProcessorChain.init inserting DistributedUpdateProcessorFactory into updateRequestProcessorChain "distrib-dup-test-chain-implicit"
[junit4:junit4]   2> 3721 T2016 oasc.RequestHandlers.initHandlersFromConfig adding lazy requestHandler: solr.ReplicationHandler
[junit4:junit4]   2> 3722 T2016 oasc.RequestHandlers.initHandlersFromConfig created /replication: solr.ReplicationHandler
[junit4:junit4]   2> 3722 T2016 oasc.RequestHandlers.initHandlersFromConfig created standard: solr.StandardRequestHandler
[junit4:junit4]   2> 3723 T2016 oasc.RequestHandlers.initHandlersFromConfig created /get: solr.RealTimeGetHandler
[junit4:junit4]   2> 3724 T2016 oasc.RequestHandlers.initHandlersFromConfig created dismax: solr.SearchHandler
[junit4:junit4]   2> 3724 T2016 oasc.RequestHandlers.initHandlersFromConfig created mock: org.apache.solr.core.MockQuerySenderListenerReqHandler
[junit4:junit4]   2> 3725 T2016 oasc.RequestHandlers.initHandlersFromConfig created /admin/: org.apache.solr.handler.admin.AdminHandlers
[junit4:junit4]   2> 3726 T2016 oasc.RequestHandlers.initHandlersFromConfig created defaults: solr.StandardRequestHandler
[junit4:junit4]   2> 3726 T2016 oasc.RequestHandlers.initHandlersFromConfig adding lazy requestHandler: solr.StandardRequestHandler
[junit4:junit4]   2> 3727 T2016 oasc.RequestHandlers.initHandlersFromConfig created lazy: solr.StandardRequestHandler
[junit4:junit4]   2> 3727 T2016 oasc.RequestHandlers.initHandlersFromConfig created /update: solr.UpdateRequestHandler
[junit4:junit4]   2> 3728 T2016 oasc.RequestHandlers.initHandlersFromConfig created /terms: org.apache.solr.handler.component.SearchHandler
[junit4:junit4]   2> 3728 T2016 oasc.RequestHandlers.initHandlersFromConfig created spellCheckCompRH: org.apache.solr.handler.component.SearchHandler
[junit4:junit4]   2> 3729 T2016 oasc.RequestHandlers.initHandlersFromConfig created spellCheckCompRH_Direct: org.apache.solr.handler.component.SearchHandler
[junit4:junit4]   2> 3730 T2016 oasc.RequestHandlers.initHandlersFromConfig created spellCheckWithWordbreak: org.apache.solr.handler.component.SearchHandler
[junit4:junit4]   2> 3731 T2016 oasc.RequestHandlers.initHandlersFromConfig created spellCheckWithWordbreak_Direct: org.apache.solr.handler.component.SearchHandler
[junit4:junit4]   2> 3731 T2016 oasc.RequestHandlers.initHandlersFromConfig created spellCheckCompRH1: org.apache.solr.handler.component.SearchHandler
[junit4:junit4]   2> 3732 T2016 oasc.RequestHandlers.initHandlersFromConfig created tvrh: org.apache.solr.handler.component.SearchHandler
[junit4:junit4]   2> 3733 T2016 oasc.RequestHandlers.initHandlersFromConfig created /mlt: solr.MoreLikeThisHandler
[junit4:junit4]   2> 3733 T2016 oasc.RequestHandlers.initHandlersFromConfig created /debug/dump: solr.DumpRequestHandler
[junit4:junit4]   2> 3738 T2016 oashl.XMLLoader.init xsltCacheLifetimeSeconds=60
[junit4:junit4]   2> 3743 T2016 oasc.SolrCore.initDeprecatedSupport WARNING solrconfig.xml uses deprecated <admin/gettableFiles>, Please update your config to use the ShowFileRequestHandler.
[junit4:junit4]   2> 3745 T2016 oasc.SolrCore.initDeprecatedSupport WARNING adding ShowFileRequestHandler with hidden files: [SCHEMA.XML, OLD_SYNONYMS.TXT, STOPWORDS.TXT, PROTWORDS.TXT, OPEN-EXCHANGE-RATES.JSON, SYNONYMS.TXT, CURRENCY.XML, MAPPING-ISOLATIN1ACCENT.TXT]
[junit4:junit4]   2> 3749 T2016 oass.SolrIndexSearcher.<init> Opening Searcher@5ab671ce main
[junit4:junit4]   2> 3750 T2016 oasu.CommitTracker.<init> Hard AutoCommit: disabled
[junit4:junit4]   2> 3751 T2016 oasu.CommitTracker.<init> Soft AutoCommit: disabled
[junit4:junit4]   2> 3752 T2016 oashc.SpellCheckComponent.inform Initializing spell checkers
[junit4:junit4]   2> 3771 T2016 oass.DirectSolrSpellChecker.init init: {name=direct,classname=DirectSolrSpellChecker,field=lowerfilt,minQueryLength=3}
[junit4:junit4]   2> 3824 T2051 oasc.SolrCore.registerSearcher [collection1] Registered new searcher Searcher@5ab671ce main{StandardDirectoryReader(segments_1:1)}
[junit4:junit4]   2> 4091 T2037 oascc.ZkStateReader.updateClusterState Updating cloud state from ZooKeeper... 
[junit4:junit4]   2> 4104 T2036 oascc.ZkStateReader$2.process A cluster state change has occurred - updating...
[junit4:junit4]   2> 4104 T2050 oascc.ZkStateReader$2.process A cluster state change has occurred - updating...
[junit4:junit4]   2> 4329 T2016 oasc.CoreContainer.register registering core: collection1
[junit4:junit4]   2> 4329 T2016 oasc.ZkController.register Register shard - core:collection1 address:http://127.0.0.1:14075/solr shardId:shard1
[junit4:junit4]   2> 4330 T2016 oascc.SolrZkClient.makePath makePath: /collections/collection1/leader_elect/shard1/election
[junit4:junit4]   2> 4349 T2021 oazs.PrepRequestProcessor.pRequest Got user-level KeeperException when processing sessionid:0x139c84bcd540003 type:delete cxid:0x43 zxid:0xfffffffffffffffe txntype:unknown reqpath:n/a Error Path:/solr/collections/collection1/leaders Error:KeeperErrorCode = NoNode for /solr/collections/collection1/leaders
[junit4:junit4]   2> 4350 T2016 oasc.ShardLeaderElectionContext.runLeaderProcess Running the leader process.
[junit4:junit4]   2> 4350 T2021 oazs.PrepRequestProcessor.pRequest Got user-level KeeperException when processing sessionid:0x139c84bcd540003 type:create cxid:0x44 zxid:0xfffffffffffffffe txntype:unknown reqpath:n/a Error Path:/solr/overseer Error:KeeperErrorCode = NodeExists for /solr/overseer
[junit4:junit4]   2> 4360 T2016 oasc.ShardLeaderElectionContext.waitForReplicasToComeUp Enough replicas found to continue.
[junit4:junit4]   2> 4361 T2016 oasc.ShardLeaderElectionContext.runLeaderProcess I may be the new leader - try and sync
[junit4:junit4]   2> 4361 T2016 oasc.SyncStrategy.sync Sync replicas to http://127.0.0.1:14075/solr/collection1/
[junit4:junit4]   2> 4362 T2016 oasc.SyncStrategy.syncReplicas Sync Success - now sync replicas to me
[junit4:junit4]   2> 4362 T2016 oasc.SyncStrategy.syncToMe http://127.0.0.1:14075/solr/collection1/ has no replicas
[junit4:junit4]   2> 4363 T2016 oasc.ShardLeaderElectionContext.runLeaderProcess I am the new leader: http://127.0.0.1:14075/solr/collection1/
[junit4:junit4]   2> 4363 T2016 oascc.SolrZkClient.makePath makePath: /collections/collection1/leaders/shard1
[junit4:junit4]   2> 4366 T2021 oazs.PrepRequestProcessor.pRequest Got user-level KeeperException when processing sessionid:0x139c84bcd540003 type:create cxid:0x4e zxid:0xfffffffffffffffe txntype:unknown reqpath:n/a Error Path:/solr/overseer Error:KeeperErrorCode = NodeExists for /solr/overseer
[junit4:junit4]   2> 4606 T2037 oascc.ZkStateReader.updateClusterState Updating cloud state from ZooKeeper... 
[junit4:junit4]   2> 4611 T2050 oascc.ZkStateReader$2.process A cluster state change has occurred - updating...
[junit4:junit4]   2> 4611 T2036 oascc.ZkStateReader$2.process A cluster state change has occurred - updating...
[junit4:junit4]   2> 4632 T2016 oasc.ZkController.register We are http://127.0.0.1:14075/solr/collection1/ and leader is http://127.0.0.1:14075/solr/collection1/
[junit4:junit4]   2> 4632 T2016 oasc.ZkController.register No LogReplay needed for core=collection1 baseURL=http://127.0.0.1:14075/solr
[junit4:junit4]   2> 4633 T2016 oasc.ZkController.checkRecovery I am the leader, no recovery necessary
[junit4:junit4]   2> 4634 T2016 oascc.ZkStateReader.updateClusterState Updating cloud state from ZooKeeper... 
[junit4:junit4]   2> 4635 T2016 oass.SolrDispatchFilter.init user.dir=/usr/home/hudson/hudson-slave/workspace/Lucene-Solr-Tests-trunk-Java6/solr/build/solr-core/test/J0
[junit4:junit4]   2> 4636 T2016 oass.SolrDispatchFilter.init SolrDispatchFilter.init() done
[junit4:junit4]   2> 4636 T2016 oascsi.HttpClientUtil.createClient Creating new http client, config:maxConnections=128&maxConnectionsPerHost=32&followRedirects=false
[junit4:junit4]   2> 4652 T2016 oejs.Server.doStart jetty-8.1.2.v20120308
[junit4:junit4]   2> 4654 T2016 oejs.AbstractConnector.doStart Started SocketConnector@0.0.0.0:32758
[junit4:junit4]   2> 4655 T2016 oasc.SolrResourceLoader.locateSolrHome JNDI not configured for solr (NoInitialContextEx)
[junit4:junit4]   2> 4655 T2016 oasc.SolrResourceLoader.locateSolrHome using system property solr.solr.home: /usr/home/hudson/hudson-slave/workspace/Lucene-Solr-Tests-trunk-Java6/solr/build/solr-core/test-files/solr
[junit4:junit4]   2> 4656 T2016 oasc.SolrResourceLoader.<init> new SolrResourceLoader for deduced Solr Home: '/usr/home/hudson/hudson-slave/workspace/Lucene-Solr-Tests-trunk-Java6/solr/build/solr-core/test-files/solr/'
[junit4:junit4]   2> 4688 T2016 oass.SolrDispatchFilter.init SolrDispatchFilter.init()
[junit4:junit4]   2> 4688 T2016 oasc.SolrResourceLoader.locateSolrHome JNDI not configured for solr (NoInitialContextEx)
[junit4:junit4]   2> 4689 T2016 oasc.SolrResourceLoader.locateSolrHome using system property solr.solr.home: /usr/home/hudson/hudson-slave/workspace/Lucene-Solr-Tests-trunk-Java6/solr/build/solr-core/test-files/solr
[junit4:junit4]   2> 4689 T2016 oasc.CoreContainer$Initializer.initialize looking for solr.xml: /usr/home/hudson/hudson-slave/workspace/Lucene-Solr-Tests-trunk-Java6/solr/build/solr-core/test-files/solr/solr.xml
[junit4:junit4]   2> 4689 T2016 oasc.CoreContainer.<init> New CoreContainer 1813635266
[junit4:junit4]   2> 4690 T2016 oasc.CoreContainer.load Loading CoreContainer using Solr Home: '/usr/home/hudson/hudson-slave/workspace/Lucene-Solr-Tests-trunk-Java6/solr/build/solr-core/test-files/solr/'
[junit4:junit4]   2> 4691 T2016 oasc.SolrResourceLoader.<init> new SolrResourceLoader for directory: '/usr/home/hudson/hudson-slave/workspace/Lucene-Solr-Tests-trunk-Java6/solr/build/solr-core/test-files/solr/'
[junit4:junit4]   2> 4713 T2016 oasc.CoreContainer.load Registering Log Listener
[junit4:junit4]   2> 4727 T2016 oasc.CoreContainer.initZooKeeper Zookeeper client=127.0.0.1:30056/solr
[junit4:junit4]   2> 4727 T2016 oaz.ZooKeeper.<init> Initiating client connection, connectString=127.0.0.1:30056/solr sessionTimeout=5000 watcher=org.apache.solr.common.cloud.ConnectionManager@31acb3c5
[junit4:junit4]   2> 4728 T2061 oaz.ClientCnxn$SendThread.startConnect Opening socket connection to server /127.0.0.1:30056
[junit4:junit4]   2> 4728 T2016 oascc.ConnectionManager.waitForConnected Waiting for client to connect to ZooKeeper
[junit4:junit4]   2> 4730 T2061 oaz.ClientCnxn$SendThread.primeConnection Socket connection established to localhost/127.0.0.1:30056, initiating session
[junit4:junit4]   2> 4730 T2018 oazs.NIOServerCnxn$Factory.run Accepted socket connection from /140.211.11.196:32759
[junit4:junit4]   2> 4730 T2018 oazs.NIOServerCnxn.readConnectRequest Client attempting to establish new session at /140.211.11.196:32759
[junit4:junit4]   2> 4732 T2020 oazs.NIOServerCnxn.finishSessionInit Established session 0x139c84bcd540004 with negotiated timeout 5000 for client /140.211.11.196:32759
[junit4:junit4]   2> 4732 T2061 oaz.ClientCnxn$SendThread.readConnectResult Session establishment complete on server localhost/127.0.0.1:30056, sessionid = 0x139c84bcd540004, negotiated timeout = 5000
[junit4:junit4]   2> 4732 T2062 oascc.ConnectionManager.process Watcher org.apache.solr.common.cloud.ConnectionManager@31acb3c5 name:ZooKeeperConnection Watcher:127.0.0.1:30056/solr got event WatchedEvent state:SyncConnected type:None path:null path:null type:None
[junit4:junit4]   2> 4732 T2016 oascc.ConnectionManager.waitForConnected Client is connected to ZooKeeper
[junit4:junit4]   2> 4733 T2021 oazs.PrepRequestProcessor.pRequest Got user-level KeeperException when processing sessionid:0x139c84bcd540004 type:create cxid:0x1 zxid:0xfffffffffffffffe txntype:unknown reqpath:n/a Error Path:/solr/overseer Error:KeeperErrorCode = NodeExists for /solr/overseer
[junit4:junit4]   2> 4734 T2021 oazs.PrepRequestProcessor.pRequest Got user-level KeeperException when processing sessionid:0x139c84bcd540004 type:create cxid:0x2 zxid:0xfffffffffffffffe txntype:unknown reqpath:n/a Error Path:/solr/overseer Error:KeeperErrorCode = NodeExists for /solr/overseer
[junit4:junit4]   2> 4743 T2016 oasc.ZkController.createEphemeralLiveNode Register node as live in ZooKeeper:/live_nodes/127.0.0.1:32758_solr
[junit4:junit4]   2> 4743 T2021 oazs.PrepRequestProcessor.pRequest Got user-level KeeperException when processing sessionid:0x139c84bcd540004 type:delete cxid:0x4 zxid:0xfffffffffffffffe txntype:unknown reqpath:n/a Error Path:/solr/live_nodes/127.0.0.1:32758_solr Error:KeeperErrorCode = NoNode for /solr/live_nodes/127.0.0.1:32758_solr
[junit4:junit4]   2> 4744 T2016 oascc.SolrZkClient.makePath makePath: /live_nodes/127.0.0.1:32758_solr
[junit4:junit4]   2> 4746 T2050 oascc.ZkStateReader$3.process Updating live nodes
[junit4:junit4]   2> 4746 T2036 oascc.ZkStateReader$3.process Updating live nodes
[junit4:junit4]   2> 4746 T2016 oashc.HttpShardHandlerFactory.getParameter Setting socketTimeout to: 0
[junit4:junit4]   2> 4747 T2016 oashc.HttpShardHandlerFactory.getParameter Setting urlScheme to: http://
[junit4:junit4]   2> 4747 T2016 oashc.HttpShardHandlerFactory.getParameter Setting connTimeout to: 0
[junit4:junit4]   2> 4747 T2016 oashc.HttpShardHandlerFactory.getParameter Setting maxConnectionsPerHost to: 20
[junit4:junit4]   2> 4748 T2016 oashc.HttpShardHandlerFactory.getParameter Setting corePoolSize to: 0
[junit4:junit4]   2> 4748 T2016 oashc.HttpShardHandlerFactory.getParameter Setting maximumPoolSize to: 2147483647
[junit4:junit4]   2> 4749 T2016 oashc.HttpShardHandlerFactory.getParameter Setting maxThreadIdleTime to: 5
[junit4:junit4]   2> 4749 T2016 oashc.HttpShardHandlerFactory.getParameter Setting sizeOfQueue to: -1
[junit4:junit4]   2> 4750 T2016 oashc.HttpShardHandlerFactory.getParameter Setting fairnessPolicy to: false
[junit4:junit4]   2> 4750 T2016 oascsi.HttpClientUtil.createClient Creating new http client, config:maxConnectionsPerHost=20&maxConnections=10000&socketTimeout=0&connTimeout=0&retry=false
[junit4:junit4]   2> 4763 T2016 oascc.ZkStateReader.createClusterStateWatchersAndUpdate Updating cluster state from ZooKeeper... 
[junit4:junit4]   2> 4768 T2016 oasc.CoreContainer.create Creating SolrCore 'collection1' using instanceDir: /usr/home/hudson/hudson-slave/workspace/Lucene-Solr-Tests-trunk-Java6/solr/build/solr-core/test-files/solr/collection1
[junit4:junit4]   2> 4768 T2016 oasc.ZkController.createCollectionZkNode Check for collection zkNode:collection1
[junit4:junit4]   2> 4769 T2016 oasc.ZkController.createCollectionZkNode Collection zkNode exists
[junit4:junit4]   2> 4769 T2016 oasc.ZkController.readConfigName Load collection config from:/collections/collection1
[junit4:junit4]   2> 4770 T2016 oasc.SolrResourceLoader.<init> new SolrResourceLoader for directory: '/usr/home/hudson/hudson-slave/workspace/Lucene-Solr-Tests-trunk-Java6/solr/build/solr-core/test-files/solr/collection1/'
[junit4:junit4]   2> 4772 T2016 oasc.SolrResourceLoader.replaceClassLoader Adding 'file:/usr/home/hudson/hudson-slave/workspace/Lucene-Solr-Tests-trunk-Java6/solr/build/solr-core/test-files/solr/collection1/lib/README' to classloader
[junit4:junit4]   2> 4772 T2016 oasc.SolrResourceLoader.replaceClassLoader Adding 'file:/usr/home/hudson/hudson-slave/workspace/Lucene-Solr-Tests-trunk-Java6/solr/build/solr-core/test-files/solr/collection1/lib/classes/' to classloader
[junit4:junit4]   2> 4817 T2016 oasc.SolrConfig.<init> Using Lucene MatchVersion: LUCENE_50
[junit4:junit4]   2> 4884 T2016 oasc.SolrConfig.<init> Loaded SolrConfig: solrconfig.xml
[junit4:junit4]   2> 4985 T2016 oass.IndexSchema.readSchema Reading Solr Schema
[junit4:junit4]   2> 4993 T2016 oass.IndexSchema.readSchema Schema name=test
[junit4:junit4]   2> 5116 T2037 oascc.ZkStateReader.updateClusterState Updating cloud state from ZooKeeper... 
[junit4:junit4]   2> 5127 T2050 oascc.ZkStateReader$2.process A cluster state change has occurred - updating...
[junit4:junit4]   2> 5127 T2062 oascc.ZkStateReader$2.process A cluster state change has occurred - updating...
[junit4:junit4]   2> 5127 T2036 oascc.ZkStateReader$2.process A cluster state change has occurred - updating...
[junit4:junit4]   2> 5602 T2016 oass.OpenExchangeRatesOrgProvider.init Initialized with rates=open-exchange-rates.json, refreshInterval=1440.
[junit4:junit4]   2> 5613 T2016 oass.IndexSchema.readSchema default search field in schema is text
[junit4:junit4]   2> 5618 T2016 oass.IndexSchema.readSchema unique key field: id
[junit4:junit4]   2> 5627 T2016 oass.FileExchangeRateProvider.reload Reloading exchange rates from file currency.xml
[junit4:junit4]   2> 5632 T2016 oass.FileExchangeRateProvider.reload Reloading exchange rates from file currency.xml
[junit4:junit4]   2> 5637 T2016 oass.OpenExchangeRatesOrgProvider.reload Reloading exchange rates from open-exchange-rates.json
[junit4:junit4]   2> 5638 T2016 oass.OpenExchangeRatesOrgProvider.reload Reloading exchange rates from open-exchange-rates.json
[junit4:junit4]   2> 5639 T2016 oasc.SolrCore.<init> [collection1] Opening new SolrCore at /usr/home/hudson/hudson-slave/workspace/Lucene-Solr-Tests-trunk-Java6/solr/build/solr-core/test-files/solr/collection1/, dataDir=./org.apache.solr.cloud.BasicDistributedZk2Test-1347685174604/jetty2/
[junit4:junit4]   2> 5639 T2016 oasc.JmxMonitoredMap.<init> JMX monitoring is enabled. Adding Solr mbeans to JMX Server: com.sun.jmx.mbeanserver.JmxMBeanServer@f5bfdbd
[junit4:junit4]   2> 5640 T2016 oasc.SolrCore.getNewIndexDir WARNING New index directory detected: old=null new=./org.apache.solr.cloud.BasicDistributedZk2Test-1347685174604/jetty2/index/
[junit4:junit4]   2> 5641 T2016 oasc.SolrCore.initIndex WARNING [collection1] Solr index directory './org.apache.solr.cloud.BasicDistributedZk2Test-1347685174604/jetty2/index' doesn't exist. Creating new index...
[junit4:junit4]   2> 5642 T2016 oasc.CachingDirectoryFactory.get return new directory for /usr/home/hudson/hudson-slave/workspace/Lucene-Solr-Tests-trunk-Java6/solr/build/solr-core/test/J0/./org.apache.solr.cloud.BasicDistributedZk2Test-1347685174604/jetty2/index forceNew:false
[junit4:junit4]   2> 5649 T2016 oasc.SolrDeletionPolicy.onCommit SolrDeletionPolicy.onCommit: commits:num=1
[junit4:junit4]   2> 		commit{dir=NRTCachingDirectory(org.apache.lucene.store.NIOFSDirectory@/usr/home/hudson/hudson-slave/workspace/Lucene-Solr-Tests-trunk-Java6/solr/build/solr-core/test/J0/org.apache.solr.cloud.BasicDistributedZk2Test-1347685174604/jetty2/index lockFactory=org.apache.lucene.store.NativeFSLockFactory@4a659073; maxCacheMB=48.0 maxMergeSizeMB=4.0),segFN=segments_1,generation=1,filenames=[segments_1]
[junit4:junit4]   2> 5650 T2016 oasc.SolrDeletionPolicy.updateCommits newest commit = 1
[junit4:junit4]   2> 5651 T2016 oasc.SolrCore.initWriters created xml: solr.XMLResponseWriter
[junit4:junit4]   2> 5653 T2016 oasup.UpdateRequestProcessorChain.init inserting DistributedUpdateProcessorFactory into updateRequestProcessorChain "dedupe"
[junit4:junit4]   2> 5653 T2016 oasup.UpdateRequestProcessorChain.init inserting DistributedUpdateProcessorFactory into updateRequestProcessorChain "dedupe-allfields"
[junit4:junit4]   2> 5654 T2016 oasup.UpdateRequestProcessorChain.init inserting DistributedUpdateProcessorFactory into updateRequestProcessorChain "stored_sig"
[junit4:junit4]   2> 5654 T2016 oasup.UpdateRequestProcessorChain.init inserting DistributedUpdateProcessorFactory into updateRequestProcessorChain "uniq-fields"
[junit4:junit4]   2> 5655 T2016 oasup.UpdateRequestProcessorChain.init inserting DistributedUpdateProcessorFactory into updateRequestProcessorChain "distrib-dup-test-chain-implicit"
[junit4:junit4]   2> 5656 T2016 oasc.RequestHandlers.initHandlersFromConfig adding lazy requestHandler: solr.ReplicationHandler
[junit4:junit4]   2> 5656 T2016 oasc.RequestHandlers.initHandlersFromConfig created /replication: solr.ReplicationHandler
[junit4:junit4]   2> 5657 T2016 oasc.RequestHandlers.initHandlersFromConfig created standard: solr.StandardRequestHandler
[junit4:junit4]   2> 5657 T2016 oasc.RequestHandlers.initHandlersFromConfig created /get: solr.RealTimeGetHandler
[junit4:junit4]   2> 5658 T2016 oasc.RequestHandlers.initHandlersFromConfig created dismax: solr.SearchHandler
[junit4:junit4]   2> 5659 T2016 oasc.RequestHandlers.initHandlersFromConfig created mock: org.apache.solr.core.MockQuerySenderListenerReqHandler
[junit4:junit4]   2> 5659 T2016 oasc.RequestHandlers.initHandlersFromConfig created /admin/: org.apache.solr.handler.admin.AdminHandlers
[junit4:junit4]   2> 5660 T2016 oasc.RequestHandlers.initHandlersFromConfig created defaults: solr.StandardRequestHandler
[junit4:junit4]   2> 5661 T2016 oasc.RequestHandlers.initHandlersFromConfig adding lazy requestHandler: solr.StandardRequestHandler
[junit4:junit4]   2> 5661 T2016 oasc.RequestHandlers.initHandlersFromConfig created lazy: solr.StandardRequestHandler
[junit4:junit4]   2> 5662 T2016 oasc.RequestHandlers.initHandlersFromConfig created /update: solr.UpdateRequestHandler
[junit4:junit4]   2> 5662 T2016 oasc.RequestHandlers.initHandlersFromConfig created /terms: org.apache.solr.handler.component.SearchHandler
[junit4:junit4]   2> 5663 T2016 oasc.RequestHandlers.initHandlersFromConfig created spellCheckCompRH: org.apache.solr.handler.component.SearchHandler
[junit4:junit4]   2> 5664 T2016 oasc.RequestHandlers.initHandlersFromConfig created spellCheckCompRH_Direct: org.apache.solr.handler.component.SearchHandler
[junit4:junit4]   2> 5664 T2016 oasc.RequestHandlers.initHandlersFromConfig created spellCheckWithWordbreak: org.apache.solr.handler.component.SearchHandler
[junit4:junit4]   2> 5665 T2016 oasc.RequestHandlers.initHandlersFromConfig created spellCheckWithWordbreak_Direct: org.apache.solr.handler.component.SearchHandler
[junit4:junit4]   2> 5666 T2016 oasc.RequestHandlers.initHandlersFromConfig created spellCheckCompRH1: org.apache.solr.handler.component.SearchHandler
[junit4:junit4]   2> 5666 T2016 oasc.RequestHandlers.initHandlersFromConfig created tvrh: org.apache.solr.handler.component.SearchHandler
[junit4:junit4]   2> 5667 T2016 oasc.RequestHandlers.initHandlersFromConfig created /mlt: solr.MoreLikeThisHandler
[junit4:junit4]   2> 5668 T2016 oasc.RequestHandlers.initHandlersFromConfig created /debug/dump: solr.DumpRequestHandler
[junit4:junit4]   2> 5672 T2016 oashl.XMLLoader.init xsltCacheLifetimeSeconds=60
[junit4:junit4]   2> 5677 T2016 oasc.SolrCore.initDeprecatedSupport WARNING solrconfig.xml uses deprecated <admin/gettableFiles>, Please update your config to use the ShowFileRequestHandler.
[junit4:junit4]   2> 5678 T2016 oasc.SolrCore.initDeprecatedSupport WARNING adding ShowFileRequestHandler with hidden files: [SCHEMA.XML, OLD_SYNONYMS.TXT, STOPWORDS.TXT, PROTWORDS.TXT, OPEN-EXCHANGE-RATES.JSON, SYNONYMS.TXT, CURRENCY.XML, MAPPING-ISOLATIN1ACCENT.TXT]
[junit4:junit4]   2> 5682 T2016 oass.SolrIndexSearcher.<init> Opening Searcher@5e6af362 main
[junit4:junit4]   2> 5683 T2016 oasu.CommitTracker.<init> Hard AutoCommit: disabled
[junit4:junit4]   2> 5684 T2016 oasu.CommitTracker.<init> Soft AutoCommit: disabled
[junit4:junit4]   2> 5684 T2016 oashc.SpellCheckComponent.inform Initializing spell checkers
[junit4:junit4]   2> 5692 T2016 oass.DirectSolrSpellChecker.init init: {name=direct,classname=DirectSolrSpellChecker,field=lowerfilt,minQueryLength=3}
[junit4:junit4]   2> 5747 T2063 oasc.SolrCore.registerSearcher [collection1] Registered new searcher Searcher@5e6af362 main{StandardDirectoryReader(segments_1:1)}
[junit4:junit4]   2> 6131 T2037 oascc.ZkStateReader.updateClusterState Updating cloud state from ZooKeeper... 
[junit4:junit4]   2> 6143 T2036 oascc.ZkStateReader$2.process A cluster state change has occurred - updating...
[junit4:junit4]   2> 6143 T2062 oascc.ZkStateReader$2.process A cluster state change has occurred - updating...
[junit4:junit4]   2> 6143 T2050 oascc.ZkStateReader$2.process A cluster state change has occurred - updating...
[junit4:junit4]   2> 6253 T2016 oasc.CoreContainer.register registering core: collection1
[junit4:junit4]   2> 6253 T2016 oasc.ZkController.register Register shard - core:collection1 address:http://127.0.0.1:32758/solr shardId:shard2
[junit4:junit4]   2> 6254 T2016 oascc.SolrZkClient.makePath makePath: /collections/collection1/leader_elect/shard2/election
[junit4:junit4]   2> 6268 T2021 oazs.PrepRequestProcessor.pRequest Got user-level KeeperException when processing sessionid:0x139c84bcd540004 type:delete cxid:0x42 zxid:0xfffffffffffffffe txntype:unknown reqpath:n/a Error Path:/solr/collections/collection1/leaders/shard2 Error:KeeperErrorCode = NoNode for /solr/collections/collection1/leaders/shard2
[junit4:junit4]   2> 6269 T2016 oasc.ShardLeaderElectionContext.runLeaderProcess Running the leader process.
[junit4:junit4]   2> 6270 T2021 oazs.PrepRequestProcessor.pRequest Got user-level KeeperException when processing sessionid:0x139c84bcd540004 type:create cxid:0x43 zxid:0xfffffffffffffffe txntype:unknown reqpath:n/a Error Path:/solr/overseer Error:KeeperErrorCode = NodeExists for /solr/overseer
[junit4:junit4]   2> 6272 T2016 oasc.ShardLeaderElectionContext.waitForReplicasToComeUp Enough replicas found to continue.
[junit4:junit4]   2> 6272 T2016 oasc.ShardLeaderElectionContext.runLeaderProcess I may be the new leader - try and sync
[junit4:junit4]   2> 6273 T2016 oasc.SyncStrategy.sync Sync replicas to http://127.0.0.1:32758/solr/collection1/
[junit4:junit4]   2> 6274 T2016 oasc.SyncStrategy.syncReplicas Sync Success - now sync replicas to me
[junit4:junit4]   2> 6275 T2016 oasc.SyncStrategy.syncToMe http://127.0.0.1:32758/solr/collection1/ has no replicas
[junit4:junit4]   2> 6275 T2016 oasc.ShardLeaderElectionContext.runLeaderProcess I am the new leader: http://127.0.0.1:32758/solr/collection1/
[junit4:junit4]   2> 6276 T2016 oascc.SolrZkClient.makePath makePath: /collections/collection1/leaders/shard2
[junit4:junit4]   2> 6278 T2021 oazs.PrepRequestProcessor.pRequest Got user-level KeeperException when processing sessionid:0x139c84bcd540004 type:create cxid:0x4c zxid:0xfffffffffffffffe txntype:unknown reqpath:n/a Error Path:/solr/overseer Error:KeeperErrorCode = NodeExists for /solr/overseer
[junit4:junit4]   2> 6645 T2037 oascc.ZkStateReader.updateClusterState Updating cloud state from ZooKeeper... 
[junit4:junit4]   2> 6659 T2050 oascc.ZkStateReader$2.process A cluster state change has occurred - updating...
[junit4:junit4]   2> 6659 T2036 oascc.ZkStateReader$2.process A cluster state change has occurred - updating...
[junit4:junit4]   2> 6659 T2062 oascc.ZkStateReader$2.process A cluster state change has occurred - updating...
[junit4:junit4]   2> 6687 T2016 oasc.ZkController.register We are http://127.0.0.1:32758/solr/collection1/ and leader is http://127.0.0.1:32758/solr/collection1/
[junit4:junit4]   2> 6687 T2016 oasc.ZkController.register No LogReplay needed for core=collection1 baseURL=http://127.0.0.1:32758/solr
[junit4:junit4]   2> 6687 T2016 oasc.ZkController.checkRecovery I am the leader, no recovery necessary
[junit4:junit4]   2> 6689 T2016 oascc.ZkStateReader.updateClusterState Updating cloud state from ZooKeeper... 
[junit4:junit4]   2> 6690 T2016 oass.SolrDispatchFilter.init user.dir=/usr/home/hudson/hudson-slave/workspace/Lucene-Solr-Tests-trunk-Java6/solr/build/solr-core/test/J0
[junit4:junit4]   2> 6690 T2016 oass.SolrDispatchFilter.init SolrDispatchFilter.init() done
[junit4:junit4]   2> 6691 T2016 oascsi.HttpClientUtil.createClient Creating new http client, config:maxConnections=128&maxConnectionsPerHost=32&followRedirects=false
[junit4:junit4]   2> 6702 T2016 oejs.Server.doStart jetty-8.1.2.v20120308
[junit4:junit4]   2> 6704 T2016 oejs.AbstractConnector.doStart Started SocketConnector@0.0.0.0:32763
[junit4:junit4]   2> 6705 T2016 oasc.SolrResourceLoader.locateSolrHome JNDI not configured for solr (NoInitialContextEx)
[junit4:junit4]   2> 6705 T2016 oasc.SolrResourceLoader.locateSolrHome using system property solr.solr.home: /usr/home/hudson/hudson-slave/workspace/Lucene-Solr-Tests-trunk-Java6/solr/build/solr-core/test-files/solr
[junit4:junit4]   2> 6705 T2016 oasc.SolrResourceLoader.<init> new SolrResourceLoader for deduced Solr Home: '/usr/home/hudson/hudson-slave/workspace/Lucene-Solr-Tests-trunk-Java6/solr/build/solr-core/test-files/solr/'
[junit4:junit4]   2> 6729 T2016 oass.SolrDispatchFilter.init SolrDispatchFilter.init()
[junit4:junit4]   2> 6729 T2016 oasc.SolrResourceLoader.locateSolrHome JNDI not configured for solr (NoInitialContextEx)
[junit4:junit4]   2> 6729 T2016 oasc.SolrResourceLoader.locateSolrHome using system property solr.solr.home: /usr/home/hudson/hudson-slave/workspace/Lucene-Solr-Tests-trunk-Java6/solr/build/solr-core/test-files/solr
[junit4:junit4]   2> 6730 T2016 oasc.CoreContainer$Initializer.initialize looking for solr.xml: /usr/home/hudson/hudson-slave/workspace/Lucene-Solr-Tests-trunk-Java6/solr/build/solr-core/test-files/solr/solr.xml
[junit4:junit4]   2> 6730 T2016 oasc.CoreContainer.<init> New CoreContainer 256831126
[junit4:junit4]   2> 6731 T2016 oasc.CoreContainer.load Loading CoreContainer using Solr Home: '/usr/home/hudson/hudson-slave/workspace/Lucene-Solr-Tests-trunk-Java6/solr/build/solr-core/test-files/solr/'
[junit4:junit4]   2> 6731 T2016 oasc.SolrResourceLoader.<init> new SolrResourceLoader for directory: '/usr/home/hudson/hudson-slave/workspace/Lucene-Solr-Tests-trunk-Java6/solr/build/solr-core/test-files/solr/'
[junit4:junit4]   2> 6747 T2016 oasc.CoreContainer.load Registering Log Listener
[junit4:junit4]   2> 6757 T2016 oasc.CoreContainer.initZooKeeper Zookeeper client=127.0.0.1:30056/solr
[junit4:junit4]   2> 6758 T2016 oaz.ZooKeeper.<init> Initiating client connection, connectString=127.0.0.1:30056/solr sessionTimeout=5000 watcher=org.apache.solr.common.cloud.ConnectionManager@1ec4140c
[junit4:junit4]   2> 6758 T2073 oaz.ClientCnxn$SendThread.startConnect Opening socket connection to server /127.0.0.1:30056
[junit4:junit4]   2> 6758 T2016 oascc.ConnectionManager.waitForConnected Waiting for client to connect to ZooKeeper
[junit4:junit4]   2> 6760 T2073 oaz.ClientCnxn$SendThread.primeConnection Socket connection established to localhost/127.0.0.1:30056, initiating session
[junit4:junit4]   2> 6760 T2018 oazs.NIOServerCnxn$Factory.run Accepted socket connection from /140.211.11.196:32764
[junit4:junit4]   2> 6760 T2018 oazs.NIOServerCnxn.readConnectRequest Client attempting to establish new session at /140.211.11.196:32764
[junit4:junit4]   2> 6761 T2020 oazs.NIOServerCnxn.finishSessionInit Established session 0x139c84bcd540005 with negotiated timeout 5000 for client /140.211.11.196:32764
[junit4:junit4]   2> 6761 T2073 oaz.ClientCnxn$SendThread.readConnectResult Session establishment complete on server localhost/127.0.0.1:30056, sessionid = 0x139c84bcd540005, negotiated timeout = 5000
[junit4:junit4]   2> 6762 T2074 oascc.ConnectionManager.process Watcher org.apache.solr.common.cloud.ConnectionManager@1ec4140c name:ZooKeeperConnection Watcher:127.0.0.1:30056/solr got event WatchedEvent state:SyncConnected type:None path:null path:null type:None
[junit4:junit4]   2> 6762 T2016 oascc.ConnectionManager.waitForConnected Client is connected to ZooKeeper
[junit4:junit4]   2> 6762 T2021 oazs.PrepRequestProcessor.pRequest Got user-level KeeperException when processing sessionid:0x139c84bcd540005 type:create cxid:0x1 zxid:0xfffffffffffffffe txntype:unknown reqpath:n/a Error Path:/solr/overseer Error:KeeperErrorCode = NodeExists for /solr/overseer
[junit4:junit4]   2> 6763 T2021 oazs.PrepRequestProcessor.pRequest Got user-level KeeperException when processing sessionid:0x139c84bcd540005 type:create cxid:0x2 zxid:0xfffffffffffffffe txntype:unknown reqpath:n/a Error Path:/solr/overseer Error:KeeperErrorCode = NodeExists for /solr/overseer
[junit4:junit4]   2> 6772 T2016 oasc.ZkController.createEphemeralLiveNode Register node as live in ZooKeeper:/live_nodes/127.0.0.1:32763_solr
[junit4:junit4]   2> 6772 T2021 oazs.PrepRequestProcessor.pRequest Got user-level KeeperException when processing sessionid:0x139c84bcd540005 type:delete cxid:0x4 zxid:0xfffffffffffffffe txntype:unknown reqpath:n/a Error Path:/solr/live_nodes/127.0.0.1:32763_solr Error:KeeperErrorCode = NoNode for /solr/live_nodes/127.0.0.1:32763_solr
[junit4:junit4]   2> 6773 T2016 oascc.SolrZkClient.makePath makePath: /live_nodes/127.0.0.1:32763_solr
[junit4:junit4]   2> 6780 T2050 oascc.ZkStateReader$3.process Updating live nodes
[junit4:junit4]   2> 6780 T2036 oascc.ZkStateReader$3.process Updating live nodes
[junit4:junit4]   2> 6780 T2062 oascc.ZkStateReader$3.process Updating live nodes
[junit4:junit4]   2> 6780 T2016 oashc.HttpShardHandlerFactory.getParameter Setting socketTimeout to: 0
[junit4:junit4]   2> 6780 T2016 oashc.HttpShardHandlerFactory.getParameter Setting urlScheme to: http://
[junit4:junit4]   2> 6781 T2016 oashc.HttpShardHandlerFactory.getParameter Setting connTimeout to: 0
[junit4:junit4]   2> 6781 T2016 oashc.HttpShardHandlerFactory.getParameter Setting maxConnectionsPerHost to: 20
[junit4:junit4]   2> 6781 T2016 oashc.HttpShardHandlerFactory.getParameter Setting corePoolSize to: 0
[junit4:junit4]   2> 6782 T2016 oashc.HttpShardHandlerFactory.getParameter Setting maximumPoolSize to: 2147483647
[junit4:junit4]   2> 6782 T2016 oashc.HttpShardHandlerFactory.getParameter Setting maxThreadIdleTime to: 5
[junit4:junit4]   2> 6782 T2016 oashc.HttpShardHandlerFactory.getParameter Setting sizeOfQueue to: -1
[junit4:junit4]   2> 6783 T2016 oashc.HttpShardHandlerFactory.getParameter Setting fairnessPolicy to: false
[junit4:junit4]   2> 6783 T2016 oascsi.HttpClientUtil.createClient Creating new http client, config:maxConnectionsPerHost=20&maxConnections=10000&socketTimeout=0&connTimeout=0&retry=false
[junit4:junit4]   2> 6791 T2016 oascc.ZkStateReader.createClusterStateWatchersAndUpdate Updating cluster state from ZooKeeper... 
[junit4:junit4]   2> 6795 T2016 oasc.CoreContainer.create Creating SolrCore 'collection1' using instanceDir: /usr/home/hudson/hudson-slave/workspace/Lucene-Solr-Tests-trunk-Java6/solr/build/solr-core/test-files/solr/collection1
[junit4:junit4]   2> 6796 T2016 oasc.ZkController.createCollectionZkNode Check for collection zkNode:collection1
[junit4:junit4]   2> 6796 T2016 oasc.ZkController.createCollectionZkNode Collection zkNode exists
[junit4:junit4]   2> 6796 T2016 oasc.ZkController.readConfigName Load collection config from:/collections/collection1
[junit4:junit4]   2> 6797 T2016 oasc.SolrResourceLoader.<init> new SolrResourceLoader for directory: '/usr/home/hudson/hudson-slave/workspace/Lucene-Solr-Tests-trunk-Java6/solr/build/solr-core/test-files/solr/collection1/'
[junit4:junit4]   2> 6798 T2016 oasc.SolrResourceLoader.replaceClassLoader Adding 'file:/usr/home/hudson/hudson-slave/workspace/Lucene-Solr-Tests-trunk-Java6/solr/build/solr-core/test-files/solr/collection1/lib/README' to classloader
[junit4:junit4]   2> 6798 T2016 oasc.SolrResourceLoader.replaceClassLoader Adding 'file:/usr/home/hudson/hudson-slave/workspace/Lucene-Solr-Tests-trunk-Java6/solr/build/solr-core/test-files/solr/collection1/lib/classes/' to classloader
[junit4:junit4]   2> 6831 T2016 oasc.SolrConfig.<init> Using Lucene MatchVersion: LUCENE_50
[junit4:junit4]   2> 6882 T2016 oasc.SolrConfig.<init> Loaded SolrConfig: solrconfig.xml
[junit4:junit4]   2> 6983 T2016 oass.IndexSchema.readSchema Reading Solr Schema
[junit4:junit4]   2> 6992 T2016 oass.IndexSchema.readSchema Schema name=test
[junit4:junit4]   2> 7500 T2037 oascc.ZkStateReader.updateClusterState Updating cloud state from ZooKeeper... 
[junit4:junit4]   2> 7528 T2074 oascc.ZkStateReader$2.process A cluster state change has occurred - updating...
[junit4:junit4]   2> 7528 T2050 oascc.ZkStateReader$2.process A cluster state change has occurred - updating...
[junit4:junit4]   2> 7528 T2062 oascc.ZkStateReader$2.process A cluster state change has occurred - updating...
[junit4:junit4]   2> 7528 T2036 oascc.ZkStateReader$2.process A cluster state change has occurred - updating...
[junit4:junit4]   2> 7963 T2016 oass.OpenExchangeRatesOrgProvider.init Initialized with rates=open-exchange-rates.json, refreshInterval=1440.
[junit4:junit4]   2> 7977 T2016 oass.IndexSchema.readSchema default search field in schema is text
[junit4:junit4]   2> 7982 T2016 oass.IndexSchema.readSchema unique key field: id
[junit4:junit4]   2> 7991 T2016 oass.FileExchangeRateProvider.reload Reloading exchange rates from file currency.xml
[junit4:junit4]   2> 7996 T2016 oass.FileExchangeRateProvider.reload Reloading exchange rates from file currency.xml
[junit4:junit4]   2> 8000 T2016 oass.OpenExchangeRatesOrgProvider.reload Reloading exchange rates from open-exchange-rates.json
[junit4:junit4]   2> 8001 T2016 oass.OpenExchangeRatesOrgProvider.reload Reloading exchange rates from open-exchange-rates.json
[junit4:junit4]   2> 8002 T2016 oasc.SolrCore.<init> [collection1] Opening new SolrCore at /usr/home/hudson/hudson-slave/workspace/Lucene-Solr-Tests-trunk-Java6/solr/build/solr-core/test-files/solr/collection1/, dataDir=./org.apache.solr.cloud.BasicDistributedZk2Test-1347685174604/jetty3/
[junit4:junit4]   2> 8003 T2016 oasc.JmxMonitoredMap.<init> JMX monitoring is enabled. Adding Solr mbeans to JMX Server: com.sun.jmx.mbeanserver.JmxMBeanServer@f5bfdbd
[junit4:junit4]   2> 8004 T2016 oasc.SolrCore.getNewIndexDir WARNING New index directory detected: old=null new=./org.apache.solr.cloud.BasicDistributedZk2Test-1347685174604/jetty3/index/
[junit4:junit4]   2> 8005 T2016 oasc.SolrCore.initIndex WARNING [collection1] Solr index directory './org.apache.solr.cloud.BasicDistributedZk2Test-1347685174604/jetty3/index' doesn't exist. Creating new index...
[junit4:junit4]   2> 8006 T2016 oasc.CachingDirectoryFactory.get return new directory for /usr/home/hudson/hudson-slave/workspace/Lucene-Solr-Tests-trunk-Java6/solr/build/solr-core/test/J0/./org.apache.solr.cloud.BasicDistributedZk2Test-1347685174604/jetty3/index forceNew:false
[junit4:junit4]   2> 8013 T2016 oasc.SolrDeletionPolicy.onCommit SolrDeletionPolicy.onCommit: commits:num=1
[junit4:junit4]   2> 		commit{dir=NRTCachingDirectory(org.apache.lucene.store.NIOFSDirectory@/usr/home/hudson/hudson-slave/workspace/Lucene-Solr-Tests-trunk-Java6/solr/build/solr-core/test/J0/org.apache.solr.cloud.BasicDistributedZk2Test-1347685174604/jetty3/index lockFactory=org.apache.lucene.store.NativeFSLockFactory@5b8555cc; maxCacheMB=48.0 maxMergeSizeMB=4.0),segFN=segments_1,generation=1,filenames=[segments_1]
[junit4:junit4]   2> 8014 T2016 oasc.SolrDeletionPolicy.updateCommits newest commit = 1
[junit4:junit4]   2> 8015 T2016 oasc.SolrCore.initWriters created xml: solr.XMLResponseWriter
[junit4:junit4]   2> 8016 T2016 oasup.UpdateRequestProcessorChain.init inserting DistributedUpdateProcessorFactory into updateRequestProcessorChain "dedupe"
[junit4:junit4]   2> 8017 T2016 oasup.UpdateRequestProcessorChain.init inserting DistributedUpdateProcessorFactory into updateRequestProcessorChain "dedupe-allfields"
[junit4:junit4]   2> 8018 T2016 oasup.UpdateRequestProcessorChain.init inserting DistributedUpdateProcessorFactory into updateRequestProcessorChain "stored_sig"
[junit4:junit4]   2> 8018 T2016 oasup.UpdateRequestProcessorChain.init inserting DistributedUpdateProcessorFactory into updateRequestProcessorChain "uniq-fields"
[junit4:junit4]   2> 8019 T2016 oasup.UpdateRequestProcessorChain.init inserting DistributedUpdateProcessorFactory into updateRequestProcessorChain "distrib-dup-test-chain-implicit"
[junit4:junit4]   2> 8019 T2016 oasc.RequestHandlers.initHandlersFromConfig adding lazy requestHandler: solr.ReplicationHandler
[junit4:junit4]   2> 8020 T2016 oasc.RequestHandlers.initHandlersFromConfig created /replication: solr.ReplicationHandler
[junit4:junit4]   2> 8021 T2016 oasc.RequestHandlers.initHandlersFromConfig created standard: solr.StandardRequestHandler
[junit4:junit4]   2> 8021 T2016 oasc.RequestHandlers.initHandlersFromConfig created /get: solr.RealTimeGetHandler
[junit4:junit4]   2> 8022 T2016 oasc.RequestHandlers.initHandlersFromConfig created dismax: solr.SearchHandler
[junit4:junit4]   2> 8023 T2016 oasc.RequestHandlers.initHandlersFromConfig created mock: org.apache.solr.core.MockQuerySenderListenerReqHandler
[junit4:junit4]   2> 8023 T2016 oasc.RequestHandlers.initHandlersFromConfig created /admin/: org.apache.solr.handler.admin.AdminHandlers
[junit4:junit4]   2> 8024 T2016 oasc.RequestHandlers.initHandlersFromConfig created defaults: solr.StandardRequestHandler
[junit4:junit4]   2> 8024 T2016 oasc.RequestHandlers.initHandlersFromConfig adding lazy requestHandler: solr.StandardRequestHandler
[junit4:junit4]   2> 8025 T2016 oasc.RequestHandlers.initHandlersFromConfig created lazy: solr.StandardRequestHandler
[junit4:junit4]   2> 8025 T2016 oasc.RequestHandlers.initHandlersFromConfig created /update: solr.UpdateRequestHandler
[junit4:junit4]   2> 8026 T2016 oasc.RequestHandlers.initHandlersFromConfig created /terms: org.apache.solr.handler.component.SearchHandler
[junit4:junit4]   2> 8027 T2016 oasc.RequestHandlers.initHandlersFromConfig created spellCheckCompRH: org.apache.solr.handler.component.SearchHandler
[junit4:junit4]   2> 8027 T2016 oasc.RequestHandlers.initHandlersFromConfig created spellCheckCompRH_Direct: org.apache.solr.handler.component.SearchHandler
[junit4:junit4]   2> 8028 T2016 oasc.RequestHandlers.initHandlersFromConfig created spellCheckWithWordbreak: org.apache.solr.handler.component.SearchHandler
[junit4:junit4]   2> 8029 T2016 oasc.RequestHandlers.initHandlersFromConfig created spellCheckWithWordbreak_Direct: org.apache.solr.handler.component.SearchHandler
[junit4:junit4]   2> 8029 T2016 oasc.RequestHandlers.initHandlersFromConfig created spellCheckCompRH1: org.apache.solr.handler.component.SearchHandler
[junit4:junit4]   2> 8030 T2016 oasc.RequestHandlers.initHandlersFromConfig created tvrh: org.apache.solr.handler.component.SearchHandler
[junit4:junit4]   2> 8030 T2016 oasc.RequestHandlers.initHandlersFromConfig created /mlt: solr.MoreLikeThisHandler
[junit4:junit4]   2> 8031 T2016 oasc.RequestHandlers.initHandlersFromConfig created /debug/dump: solr.DumpRequestHandler
[junit4:junit4]   2> 8035 T2016 oashl.XMLLoader.init xsltCacheLifetimeSeconds=60
[junit4:junit4]   2> 8040 T2016 oasc.SolrCore.initDeprecatedSupport WARNING solrconfig.xml uses deprecated <admin/gettableFiles>, Please update your config to use the ShowFileRequestHandler.
[junit4:junit4]   2> 8041 T2016 oasc.SolrCore.initDeprecatedSupport WARNING adding ShowFileRequestHandler with hidden files: [SCHEMA.XML, OLD_SYNONYMS.TXT, STOPWORDS.TXT, PROTWORDS.TXT, OPEN-EXCHANGE-RATES.JSON, SYNONYMS.TXT, CURRENCY.XML, MAPPING-ISOLATIN1ACCENT.TXT]
[junit4:junit4]   2> 8044 T2016 oass.SolrIndexSearcher.<init> Opening Searcher@6377f326 main
[junit4:junit4]   2> 8046 T2016 oasu.CommitTracker.<init> Hard AutoCommit: disabled
[junit4:junit4]   2> 8046 T2016 oasu.CommitTracker.<init> Soft AutoCommit: disabled
[junit4:junit4]   2> 8047 T2016 oashc.SpellCheckComponent.inform Initializing spell checkers
[junit4:junit4]   2> 8075 T2016 oass.DirectSolrSpellChecker.init init: {name=direct,classname=DirectSolrSpellChecker,field=lowerfilt,minQueryLength=3}
[junit4:junit4]   2> 8257 T2075 oasc.SolrCore.registerSearcher [collection1] Registered new searcher Searcher@6377f326 main{StandardDirectoryReader(segments_1:1)}
[junit4:junit4]   2> 8533 T2037 oascc.ZkStateReader.updateClusterState Updating cloud state from ZooKeeper... 
[junit4:junit4]   2> 8552 T2036 oascc.ZkStateReader$2.process A cluster state change has occurred - updating...
[junit4:junit4]   2> 8552 T2050 oascc.ZkStateReader$2.process A cluster state change has occurred - updating...
[junit4:junit4]   2> 8552 T2074 oascc.ZkStateReader$2.process A cluster state change has occurred - updating...
[junit4:junit4]   2> 8552 T2062 oascc.ZkStateReader$2.process A cluster state change has occurred - updating...
[junit4:junit4]   2> 8762 T2016 oasc.CoreContainer.register registering core: collection1
[junit4:junit4]   2> 8762 T2016 oasc.ZkController.register Register shard - core:collection1 address:http://127.0.0.1:32763/solr shardId:shard1
[junit4:junit4]   2> 8765 T2016 oasc.ZkController.register We are http://127.0.0.1:32763/solr/collection1/ and leader is http://127.0.0.1:14075/solr/collection1/
[junit4:junit4]   2> 8766 T2016 oasc.ZkController.register No LogReplay needed for core=collection1 baseURL=http://127.0.0.1:32763/solr
[junit4:junit4]   2> 8766 T2016 oasc.ZkController.checkRecovery Core needs to recover:collection1
[junit4:junit4]   2> 8767 T2016 oasu.DefaultSolrCoreState.doRecovery Running recovery - first canceling any ongoing recovery
[junit4:junit4]   2> ASYNC  NEW_CORE C158 name=collection1 org.apache.solr.core.SolrCore@1a71d5f0 url=http://127.0.0.1:32763/solr/collection1 node=127.0.0.1:32763_solr
[junit4:junit4]   2> 8768 T2076 C158 P32763 oasc.RecoveryStrategy.run Starting recovery process.  core=collection1 recoveringAfterStartup=true
[junit4:junit4]   2> 8768 T2016 oascc.ZkStateReader.updateClusterState Updating cloud state from ZooKeeper... 
[junit4:junit4]   2> 8795 T2076 C158 P32763 oasc.RecoveryStrategy.doRecovery ###### startupVersions=[]
[junit4:junit4]   2> 8796 T2016 oass.SolrDispatchFilter.init user.dir=/usr/home/hudson/hudson-slave/workspace/Lucene-Solr-Tests-trunk-Java6/solr/build/solr-core/test/J0
[junit4:junit4]   2> 8796 T2016 oass.SolrDispatchFilter.init SolrDispatchFilter.init() done
[junit4:junit4]   2> 8796 T2076 C158 P32763 oasc.RecoveryStrategy.doRecovery Attempting to PeerSync from http://127.0.0.1:14075/solr/collection1/ core=collection1 - recoveringAfterStartup=true
[junit4:junit4]   2> 8797 T2016 oascsi.HttpClientUtil.createClient Creating new http client, config:maxConnections=128&maxConnectionsPerHost=32&followRedirects=false
[junit4:junit4]   2> 8797 T2076 C158 P32763 oasu.PeerSync.sync PeerSync: core=collection1 url=http://127.0.0.1:32763/solr START replicas=[http://127.0.0.1:14075/solr/collection1/] nUpdates=100
[junit4:junit4]   2> 8797 T2076 C158 P32763 oasu.PeerSync.sync WARNING no frame of reference to tell of we've missed updates
[junit4:junit4]   2> 8798 T2076 C158 P32763 oasc.RecoveryStrategy.doRecovery PeerSync Recovery was not successful - trying replication. core=collection1
[junit4:junit4]   2> 8798 T2076 C158 P32763 oasc.RecoveryStrategy.doRecovery Starting Replication Recovery. core=collection1
[junit4:junit4]   2> 8798 T2076 C158 P32763 oascsi.HttpClientUtil.createClient Creating new http client, config:maxConnections=128&maxConnectionsPerHost=32&followRedirects=false
[junit4:junit4]   2> ASYNC  NEW_CORE C159 name=collection1 org.apache.solr.core.SolrCore@5867b1e5 url=http://127.0.0.1:14075/solr/collection1 node=127.0.0.1:14075_solr
[junit4:junit4]   2> 8807 T2042 C159 P14075 REQ /get {distrib=false&qt=/get&wt=javabin&version=2&getVersions=100} status=0 QTime=0 
[junit4:junit4]   2> 8819 T2016 oejs.Server.doStart jetty-8.1.2.v20120308
[junit4:junit4]   2> 8821 T2016 oejs.AbstractConnector.doStart Started SocketConnector@0.0.0.0:32769
[junit4:junit4]   2> 8822 T2016 oasc.SolrResourceLoader.locateSolrHome JNDI not configured for solr (NoInitialContextEx)
[junit4:junit4]   2> 8823 T2016 oasc.SolrResourceLoader.locateSolrHome using system property solr.solr.home: /usr/home/hudson/hudson-slave/workspace/Lucene-Solr-Tests-trunk-Java6/solr/build/solr-core/test-files/solr
[junit4:junit4]   2> 8823 T2016 oasc.SolrResourceLoader.<init> new SolrResourceLoader for deduced Solr Home: '/usr/home/hudson/hudson-slave/workspace/Lucene-Solr-Tests-trunk-Java6/solr/build/solr-core/test-files/solr/'
[junit4:junit4]   2> 8857 T2016 oass.SolrDispatchFilter.init SolrDispatchFilter.init()
[junit4:junit4]   2> 8858 T2016 oasc.SolrResourceLoader.locateSolrHome JNDI not configured for solr (NoInitialContextEx)
[junit4:junit4]   2> 8858 T2016 oasc.SolrResourceLoader.locateSolrHome using system property solr.solr.home: /usr/home/hudson/hudson-slave/workspace/Lucene-Solr-Tests-trunk-Java6/solr/build/solr-core/test-files/solr
[junit4:junit4]   2> 8859 T2016 oasc.CoreContainer$Initializer.initialize looking for solr.xml: /usr/home/hudson/hudson-slave/workspace/Lucene-Solr-Tests-trunk-Java6/solr/build/solr-core/test-files/solr/solr.xml
[junit4:junit4]   2> 8859 T2016 oasc.CoreContainer.<init> New CoreContainer 2117615112
[junit4:junit4]   2> 8860 T2016 oasc.CoreContainer.load Loading CoreContainer using Solr Home: '/usr/home/hudson/hudson-slave/workspace/Lucene-Solr-Tests-trunk-Java6/solr/build/solr-core/test-files/solr/'
[junit4:junit4]   2> 8860 T2016 oasc.SolrResourceLoader.<init> new SolrResourceLoader for directory: '/usr/home/hudson/hudson-slave/workspace/Lucene-Solr-Tests-trunk-Java6/solr/build/solr-core/test-files/solr/'
[junit4:junit4]   2> 8886 T2016 oasc.CoreContainer.load Registering Log Listener
[junit4:junit4]   2> 8901 T2016 oasc.CoreContainer.initZooKeeper Zookeeper client=127.0.0.1:30056/solr
[junit4:junit4]   2> 8902 T2016 oaz.ZooKeeper.<init> Initiating client connection, connectString=127.0.0.1:30056/solr sessionTimeout=5000 watcher=org.apache.solr.common.cloud.ConnectionManager@7c4a7d6f
[junit4:junit4]   2> 8903 T2087 oaz.ClientCnxn$SendThread.startConnect Opening socket connection to server /127.0.0.1:30056
[junit4:junit4]   2> 8903 T2016 oascc.ConnectionManager.waitForConnected Waiting for client to connect to ZooKeeper
[junit4:junit4]   2> 8904 T2087 oaz.ClientCnxn$SendThread.primeConnection Socket connection established to localhost/127.0.0.1:30056, initiating session
[junit4:junit4]   2> 8904 T2018 oazs.NIOServerCnxn$Factory.run Accepted socket connection from /140.211.11.196:32770
[junit4:junit4]   2> 8905 T2018 oazs.NIOServerCnxn.readConnectRequest Client attempting to establish new session at /140.211.11.196:32770
[junit4:junit4]   2> 8906 T2020 oazs.NIOServerCnxn.finishSessionInit Established session 0x139c84bcd540006 with negotiated timeout 5000 for client /140.211.11.196:32770
[junit4:junit4]   2> 8906 T2087 oaz.ClientCnxn$SendThread.readConnectResult Session establishment complete on server localhost/127.0.0.1:30056, sessionid = 0x139c84bcd540006, negotiated timeout = 5000
[junit4:junit4]   2> 8907 T2088 oascc.ConnectionManager.process Watcher org.apache.solr.common.cloud.ConnectionManager@7c4a7d6f name:ZooKeeperConnection Watcher:127.0.0.1:30056/solr got event WatchedEvent state:SyncConnected type:None path:null path:null type:None
[junit4:junit4]   2> 8907 T2016 oascc.ConnectionManager.waitForConnected Client is connected to ZooKeeper
[junit4:junit4]   2> 8908 T2021 oazs.PrepRequestProcessor.pRequest Got user-level KeeperException when processing sessionid:0x139c84bcd540006 type:create cxid:0x1 zxid:0xfffffffffffffffe txntype:unknown reqpath:n/a Error Path:/solr/overseer Error:KeeperErrorCode = NodeExists for /solr/overseer
[junit4:junit4]   2> 8916 T2021 oazs.PrepRequestProcessor.pRequest Got user-level KeeperException when processing sessionid:0x139c84bcd540006 type:create cxid:0x2 zxid:0xfffffffffffffffe txntype:unknown reqpath:n/a Error Path:/solr/overseer Error:KeeperErrorCode = NodeExists for /solr/overseer
[junit4:junit4]   2> 8917 T2016 oasc.ZkController.createEphemeralLiveNode Register node as live in ZooKeeper:/live_nodes/127.0.0.1:32769_solr
[junit4:junit4]   2> 8918 T2021 oazs.PrepRequestProcessor.pRequest Got user-level KeeperException when processing sessionid:0x139c84bcd540006 type:delete cxid:0x4 zxid:0xfffffffffffffffe txntype:unknown reqpath:n/a Error Path:/solr/live_nodes/127.0.0.1:32769_solr Error:KeeperErrorCode = NoNode for /solr/live_nodes/127.0.0.1:32769_solr
[junit4:junit4]   2> 8919 T2016 oascc.SolrZkClient.makePath makePath: /live_nodes/127.0.0.1:32769_solr
[junit4:junit4]   2> 8928 T2074 oascc.ZkStateReader$3.process Updating live nodes
[junit4:junit4]   2> 8928 T2062 oascc.ZkStateReader$3.process Updating live nodes
[junit4:junit4]   2> 8928 T2050 oascc.ZkStateReader$3.process Updating live nodes
[junit4:junit4]   2> 8928 T2036 oascc.ZkStateReader$3.process Updating live nodes
[junit4:junit4]   2> 8928 T2016 oashc.HttpShardHandlerFactory.getParameter Setting socketTimeout to: 0
[junit4:junit4]   2> 8929 T2016 oashc.HttpShardHandlerFactory.getParameter Setting urlScheme to: http://
[junit4:junit4]   2> 8929 T2016 oashc.HttpShardHandlerFactory.getParameter Setting connTimeout to: 0
[junit4:junit4]   2> 8930 T2016 oashc.HttpShardHandlerFactory.getParameter Setting maxConnectionsPerHost to: 20
[junit4:junit4]   2> 8930 T2016 oashc.HttpShardHandlerFactory.getParameter Setting corePoolSize to: 0
[junit4:junit4]   2> 8930 T2016 oashc.HttpShardHandlerFactory.getParameter Setting maximumPoolSize to: 2147483647
[junit4:junit4]   2> 8931 T2016 oashc.HttpShardHandlerFactory.getParameter Setting maxThreadIdleTime to: 5
[junit4:junit4]   2> 8931 T2016 oashc.HttpShardHandlerFactory.getParameter Setting sizeOfQueue to: -1
[junit4:junit4]   2> 8932 T2016 oashc.HttpShardHandlerFactory.getParameter Setting fairnessPolicy to: false
[junit4:junit4]   2> 8932 T2016 oascsi.HttpClientUtil.createClient Creating new http client, config:maxConnectionsPerHost=20&maxConnections=10000&socketTimeout=0&connTimeout=0&retry=false
[junit4:junit4]   2> 8944 T2016 oascc.ZkStateReader.createClusterStateWatchersAndUpdate Updating cluster state from ZooKeeper... 
[junit4:junit4]   2> 8949 T2016 oasc.CoreContainer.create Creating SolrCore 'collection1' using instanceDir: /usr/home/hudson/hudson-slave/workspace/Lucene-Solr-Tests-trunk-Java6/solr/build/solr-core/test-files/solr/collection1
[junit4:junit4]   2> 8950 T2016 oasc.ZkController.createCollectionZkNode Check for collection zkNode:collection1
[junit4:junit4]   2> 8950 T2016 oasc.ZkController.createCollectionZkNode Collection zkNode exists
[junit4:junit4]   2> 8951 T2016 oasc.ZkController.readConfigName Load collection config from:/collections/collection1
[junit4:junit4]   2> 8952 T2016 oasc.SolrResourceLoader.<init> new SolrResourceLoader for directory: '/usr/home/hudson/hudson-slave/workspace/Lucene-Solr-Tests-trunk-Java6/solr/build/solr-core/test-files/solr/collection1/'
[junit4:junit4]   2> 8953 T2016 oasc.SolrResourceLoader.replaceClassLoader Adding 'file:/usr/home/hudson/hudson-slave/workspace/Lucene-Solr-Tests-trunk-Java6/solr/build/solr-core/test-files/solr/collection1/lib/README' to classloader
[junit4:junit4]   2> 8954 T2016 oasc.SolrResourceLoader.replaceClassLoader Adding 'file:/usr/home/hudson/hudson-slave/workspace/Lucene-Solr-Tests-trunk-Java6/solr/build/solr-core/test-files/solr/collection1/lib/classes/' to classloader
[junit4:junit4]   2> 8999 T2016 oasc.SolrConfig.<init> Using Lucene MatchVersion: LUCENE_50
[junit4:junit4]   2> 9055 T2037 oascc.ZkStateReader.updateClusterState Updating cloud state from ZooKeeper... 
[junit4:junit4]   2> 9063 T2016 oasc.SolrConfig.<init> Loaded SolrConfig: solrconfig.xml
[junit4:junit4]   2> 9065 T2074 oascc.ZkStateReader$2.process A cluster state change has occurred - updating...
[junit4:junit4]   2> 9065 T2062 oascc.ZkStateReader$2.process A cluster state change has occurred - updating...
[junit4:junit4]   2> 9065 T2036 oascc.ZkStateReader$2.process A cluster state change has occurred - updating...
[junit4:junit4]   2> 9065 T2050 oascc.ZkStateReader$2.process A cluster state change has occurred - updating...
[junit4:junit4]   2> 9065 T2088 oascc.ZkStateReader$2.process A cluster state change has occurred - updating...
[junit4:junit4]   2> 9065 T2016 oass.IndexSchema.readSchema Reading Solr Schema
[junit4:junit4]   2> 9074 T2016 oass.IndexSchema.readSchema Schema name=test
[junit4:junit4]   2> 9669 T2016 oass.OpenExchangeRatesOrgProvider.init Initialized with rates=open-exchange-rates.json, refreshInterval=1440.
[junit4:junit4]   2> 9680 T2016 oass.IndexSchema.readSchema default search field in schema is text
[junit4:junit4]   2> 9684 T2016 oass.IndexSchema.readSchema unique key field: id
[junit4:junit4]   2> 9694 T2016 oass.FileExchangeRateProvider.reload Reloading exchange rates from file currency.xml
[junit4:junit4]   2> 9698 T2016 oass.FileExchangeRateProvider.reload Reloading exchange rates from file currency.xml
[junit4:junit4]   2> 9703 T2016 oass.OpenExchangeRatesOrgProvider.reload Reloading exchange rates from open-exchange-rates.json
[junit4:junit4]   2> 9704 T2016 oass.OpenExchangeRatesOrgProvider.reload Reloading exchange rates from open-exchange-rates.json
[junit4:junit4]   2> 9705 T2016 oasc.SolrCore.<init> [collection1] Opening new SolrCore at /usr/home/hudson/hudson-slave/workspace/Lucene-Solr-Tests-trunk-Java6/solr/build/solr-core/test-files/solr/collection1/, dataDir=./org.apache.solr.cloud.BasicDistributedZk2Test-1347685174604/jetty4/
[junit4:junit4]   2> 9705 T2016 oasc.JmxMonitoredMap.<init> JMX monitoring is enabled. Adding Solr mbeans to JMX Server: com.sun.jmx.mbeanserver.JmxMBeanServer@f5bfdbd
[junit4:junit4]   2> 9706 T2016 oasc.SolrCore.getNewIndexDir WARNING New index directory detected: old=null new=./org.apache.solr.cloud.BasicDistributedZk2Test-1347685174604/jetty4/index/
[junit4:junit4]   2> 9707 T2016 oasc.SolrCore.initIndex WARNING [collection1] Solr index directory './org.apache.solr.cloud.BasicDistributedZk2Test-1347685174604/jetty4/index' doesn't exist. Creating new index...
[junit4:junit4]   2> 9708 T2016 oasc.CachingDirectoryFactory.get return new directory for /usr/home/hudson/hudson-slave/workspace/Lucene-Solr-Tests-trunk-Java6/solr/build/solr-core/test/J0/./org.apache.solr.cloud.BasicDistributedZk2Test-1347685174604/jetty4/index forceNew:false
[junit4:junit4]   2> 9714 T2016 oasc.SolrDeletionPolicy.onCommit SolrDeletionPolicy.onCommit: commits:num=1
[junit4:junit4]   2> 		commit{dir=NRTCachingDirectory(org.apache.lucene.store.NIOFSDirectory@/usr/home/hudson/hudson-slave/workspace/Lucene-Solr-Tests-trunk-Java6/solr/build/solr-core/test/J0/org.apache.solr.cloud.BasicDistributedZk2Test-1347685174604/jetty4/index lockFactory=org.apache.lucene.store.NativeFSLockFactory@1538f624; maxCacheMB=48.0 maxMergeSizeMB=4.0),segFN=segments_1,generation=1,filenames=[segments_1]
[junit4:junit4]   2> 9715 T2016 oasc.SolrDeletionPolicy.updateCommits newest commit = 1
[junit4:junit4]   2> 9716 T2016 oasc.SolrCore.initWriters created xml: solr.XMLResponseWriter
[junit4:junit4]   2> 9718 T2016 oasup.UpdateRequestProcessorChain.init inserting DistributedUpdateProcessorFactory into updateRequestProcessorChain "dedupe"
[junit4:junit4]   2> 9718 T2016 oasup.UpdateRequestProcessorChain.init inserting DistributedUpdateProcessorFactory into updateRequestProcessorChain "dedupe-allfields"
[junit4:junit4]   2> 9719 T2016 oasup.UpdateRequestProcessorChain.init inserting DistributedUpdateProcessorFactory into updateRequestProcessorChain "stored_sig"
[junit4:junit4]   2> 9719 T2016 oasup.UpdateRequestProcessorChain.init inserting DistributedUpdateProcessorFactory into updateRequestProcessorChain "uniq-fields"
[junit4:junit4]   2> 9720 T2016 oasup.UpdateRequestProcessorChain.init inserting DistributedUpdateProcessorFactory into updateRequestProcessorChain "distrib-dup-test-chain-implicit"
[junit4:junit4]   2> 9721 T2016 oasc.RequestHandlers.initHandlersFromConfig adding lazy requestHandler: solr.ReplicationHandler
[junit4:junit4]   2> 9721 T2016 oasc.RequestHandlers.initHandlersFromConfig created /replication: solr.ReplicationHandler
[junit4:junit4]   2> 9722 T2016 oasc.RequestHandlers.initHandlersFromConfig created standard: solr.StandardRequestHandler
[junit4:junit4]   2> 9723 T2016 oasc.RequestHandlers.initHandlersFromConfig created /get: solr.RealTimeGetHandler
[junit4:junit4]   2> 9723 T2016 oasc.RequestHandlers.initHandlersFromConfig created dismax: solr.SearchHandler
[junit4:junit4]   2> 9724 T2016 oasc.RequestHandlers.initHandlersFromConfig created mock: org.apache.solr.core.MockQuerySenderListenerReqHandler
[junit4:junit4]   2> 9725 T2016 oasc.RequestHandlers.initHandlersFromConfig created /admin/: org.apache.solr.handler.admin.AdminHandlers
[junit4:junit4]   2> 9725 T2016 oasc.RequestHandlers.initHandlersFromConfig created defaults: solr.StandardRequestHandler
[junit4:junit4]   2> 9726 T2016 oasc.RequestHandlers.initHandlersFromConfig adding lazy requestHandler: solr.StandardRequestHandler
[junit4:junit4]   2> 9726 T2016 oasc.RequestHandlers.initHandlersFromConfig created lazy: solr.StandardRequestHandler
[junit4:junit4]   2> 9727 T2016 oasc.RequestHandlers.initHandlersFromConfig created /update: solr.UpdateRequestHandler
[junit4:junit4]   2> 9727 T2016 oasc.RequestHandlers.initHandlersFromConfig created /terms: org.apache.solr.handler.component.SearchHandler
[junit4:junit4]   2> 9728 T2016 oasc.RequestHandlers.initHandlersFromConfig created spellCheckCompRH: org.apache.solr.handler.component.SearchHandler
[junit4:junit4]   2> 9729 T2016 oasc.RequestHandlers.initHandlersFromConfig created spellCheckCompRH_Direct: org.apache.solr.handler.component.SearchHandler
[junit4:junit4]   2> 9729 T2016 oasc.RequestHandlers.initHandlersFromConfig created spellCheckWithWordbreak: org.apache.solr.handler.component.SearchHandler
[junit4:junit4]   2> 9730 T2016 oasc.RequestHandlers.initHandlersFromConfig created spellCheckWithWordbreak_Direct: org.apache.solr.handler.component.SearchHandler
[junit4:junit4]   2> 9731 T2016 oasc.RequestHandlers.initHandlersFromConfig created spellCheckCompRH1: org.apache.solr.handler.component.SearchHandler
[junit4:junit4]   2> 9731 T2016 oasc.RequestHandlers.initHandlersFromConfig created tvrh: org.apache.solr.handler.component.SearchHandler
[junit4:junit4]   2> 9732 T2016 oasc.RequestHandlers.initHandlersFromConfig created /mlt: solr.MoreLikeThisHandler
[junit4:junit4]   2> 9733 T2016 oasc.RequestHandlers.initHandlersFromConfig created /debug/dump: solr.DumpRequestHandler
[junit4:junit4]   2> 9736 T2016 oashl.XMLLoader.init xsltCacheLifetimeSeconds=60
[junit4:junit4]   2> 9741 T2016 oasc.SolrCore.initDeprecatedSupport WARNING solrconfig.xml uses deprecated <admin/gettableFiles>, Please update your config to use the ShowFileRequestHandler.
[junit4:junit4]   2> 9742 T2016 oasc.SolrCore.initDeprecatedSupport WARNING adding ShowFileRequestHandler with hidden files: [SCHEMA.XML, OLD_SYNONYMS.TXT, STOPWORDS.TXT, PROTWORDS.TXT, OPEN-EXCHANGE-RATES.JSON, SYNONYMS.TXT, CURRENCY.XML, MAPPING-ISOLATIN1ACCENT.TXT]
[junit4:junit4]   2> 9746 T2016 oass.SolrIndexSearcher.<init> Opening Searcher@3ae16144 main
[junit4:junit4]   2> 9747 T2016 oasu.CommitTracker.<init> Hard AutoCommit: disabled
[junit4:junit4]   2> 9748 T2016 oasu.CommitTracker.<init> Soft AutoCommit: disabled
[junit4:junit4]   2> 9748 T2016 oashc.SpellCheckComponent.inform Initializing spell checkers
[junit4:junit4]   2> 9755 T2016 oass.DirectSolrSpellChecker.init init: {name=direct,classname=DirectSolrSpellChecker,field=lowerfilt,minQueryLength=3}
[junit4:junit4]   2> 9803 T2089 oasc.SolrCore.registerSearcher [collection1] Registered new searcher Searcher@3ae16144 main{StandardDirectoryReader(segments_1:1)}
[junit4:junit4]   2> 10070 T2037 oascc.ZkStateReader.updateClusterState Updating cloud state from ZooKeeper... 
[junit4:junit4]   2> 10082 T2074 oascc.ZkStateReader$2.process A cluster state change has occurred - updating...
[junit4:junit4]   2> 10082 T2050 oascc.ZkStateReader$2.process A cluster state change has occurred - updating...
[junit4:junit4]   2> 10082 T2088 oascc.ZkStateReader$2.process A cluster state change has occurred - updating...
[junit4:junit4]   2> 10082 T2036 oascc.ZkStateReader$2.process A cluster state change has occurred - updating...
[junit4:junit4]   2> 10082 T2062 oascc.ZkStateReader$2.process A cluster state change has occurred - updating...
[junit4:junit4]   2> 10309 T2016 oasc.CoreContainer.register registering core: collection1
[junit4:junit4]   2> 10309 T2016 oasc.ZkController.register Register shard - core:collection1 address:http://127.0.0.1:32769/solr shardId:shard2
[junit4:junit4]   2> 10312 T2016 oasc.ZkController.register We are http://127.0.0.1:32769/solr/collection1/ and leader is http://127.0.0.1:32758/solr/collection1/
[junit4:junit4]   2> 10313 T2016 oasc.ZkController.register No LogReplay needed for core=collection1 baseURL=http://127.0.0.1:32769/solr
[junit4:junit4]   2> 10313 T2016 oasc.ZkController.checkRecovery Core needs to recover:collection1
[junit4:junit4]   2> 10314 T2016 oasu.DefaultSolrCoreState.doRecovery Running recovery - first canceling any ongoing recovery
[junit4:junit4]   2> ASYNC  NEW_CORE C160 name=collection1 org.apache.solr.core.SolrCore@c363ab5 url=http://127.0.0.1:32769/solr/collection1 node=127.0.0.1:32769_solr
[junit4:junit4]   2> 10315 T2090 C160 P32769 oasc.RecoveryStrategy.run Starting recovery process.  core=collection1 recoveringAfterStartup=true
[junit4:junit4]   2> 10315 T2090 C160 P32769 oasc.RecoveryStrategy.doRecovery ###### startupVersions=[]
[junit4:junit4]   2> 10315 T2016 oascc.ZkStateReader.updateClusterState Updating cloud state from ZooKeeper... 
[junit4:junit4]   2> 10316 T2090 C160 P32769 oasc.RecoveryStrategy.doRecovery Attempting to PeerSync from http://127.0.0.1:32758/solr/collection1/ core=collection1 - recoveringAfterStartup=true
[junit4:junit4]   2> 10317 T2090 C160 P32769 oasu.PeerSync.sync PeerSync: core=collection1 url=http://127.0.0.1:32769/solr START replicas=[http://127.0.0.1:32758/solr/collection1/] nUpdates=100
[junit4:junit4]   2> 10316 T2016 oass.SolrDispatchFilter.init user.dir=/usr/home/hudson/hudson-slave/workspace/Lucene-Solr-Tests-trunk-Java6/solr/build/solr-core/test/J0
[junit4:junit4]   2> 10317 T2090 C160 P32769 oasu.PeerSync.sync WARNING no frame of reference to tell of we've missed updates
[junit4:junit4]   2> 10317 T2016 oass.SolrDispatchFilter.init SolrDispatchFilter.init() done
[junit4:junit4]   2> 10317 T2090 C160 P32769 oasc.RecoveryStrategy.doRecovery PeerSync Recovery was not successful - trying replication. core=collection1
[junit4:junit4]   2> 10318 T2090 C160 P32769 oasc.RecoveryStrategy.doRecovery Starting Replication Recovery. core=collection1
[junit4:junit4]   2> 10318 T2090 C160 P32769 oascsi.HttpClientUtil.createClient Creating new http client, config:maxConnections=128&maxConnectionsPerHost=32&followRedirects=false
[junit4:junit4]   2> 10318 T2016 oascsi.HttpClientUtil.createClient Creating new http client, config:maxConnections=128&maxConnectionsPerHost=32&followRedirects=false
[junit4:junit4]   2> ASYNC  NEW_CORE C161 name=collection1 org.apache.solr.core.SolrCore@23611933 url=http://127.0.0.1:32758/solr/collection1 node=127.0.0.1:32758_solr
[junit4:junit4]   2> 10327 T2054 C161 P32758 REQ /get {distrib=false&qt=/get&wt=javabin&version=2&getVersions=100} status=0 QTime=0 
[junit4:junit4]   2> 10341 T2016 oaz.ZooKeeper.<init> Initiating client connection, connectString=127.0.0.1:30056/solr sessionTimeout=10000 watcher=org.apache.solr.common.cloud.ConnectionManager@57ea64de
[junit4:junit4]   2> 10342 T2092 oaz.ClientCnxn$SendThread.startConnect Opening socket connection to server /127.0.0.1:30056
[junit4:junit4]   2> 10342 T2016 oascc.ConnectionManager.waitForConnected Waiting for client to connect to ZooKeeper
[junit4:junit4]   2> 10346 T2092 oaz.ClientCnxn$SendThread.primeConnection Socket connection established to localhost/127.0.0.1:30056, initiating session
[junit4:junit4]   2> 10347 T2018 oazs.NIOServerCnxn$Factory.run Accepted socket connection from /140.211.11.196:32775
[junit4:junit4]   2> 10347 T2018 oazs.NIOServerCnxn.readConnectRequest Client attempting to establish new session at /140.211.11.196:32775
[junit4:junit4]   2> 10348 T2020 oazs.NIOServerCnxn.finishSessionInit Established session 0x139c84bcd540007 with negotiated timeout 10000 for client /140.211.11.196:32775
[junit4:junit4]   2> 10348 T2092 oaz.ClientCnxn$SendThread.readConnectResult Session establishment complete on server localhost/127.0.0.1:30056, sessionid = 0x139c84bcd540007, negotiated timeout = 10000
[junit4:junit4]   2> 10349 T2093 oascc.ConnectionManager.process Watcher org.apache.solr.common.cloud.ConnectionManager@57ea64de name:ZooKeeperConnection Watcher:127.0.0.1:30056/solr got event WatchedEvent state:SyncConnected type:None path:null path:null type:None
[junit4:junit4]   2> 10349 T2016 oascc.ConnectionManager.waitForConnected Client is connected to ZooKeeper
[junit4:junit4]   2> 10350 T2016 oascc.ZkStateReader.createClusterStateWatchersAndUpdate Updating cluster state from ZooKeeper... 
[junit4:junit4]   2> 10351 T2016 oasc.ChaosMonkey.monkeyLog monkey: init - expire sessions:true cause connection loss:true
[junit4:junit4]   2> 10351 T2016 oascsi.HttpClientUtil.createClient Creating new http client, config:
[junit4:junit4]   2> 10360 T2016 oascc.ZkStateReader.updateClusterState Updating cloud state from ZooKeeper... 
[junit4:junit4]   2> ASYNC  NEW_CORE C162 name=collection1 org.apache.solr.core.SolrCore@77a3612f url=http://127.0.0.1:30102/solr/collection1 node=127.0.0.1:30102_solr
[junit4:junit4]   2> 10372 T2028 C162 P30102 oasc.SolrDeletionPolicy.onInit SolrDeletionPolicy.onInit: commits:num=1
[junit4:junit4]   2> 		commit{dir=NRTCachingDirectory(org.apache.lucene.store.NIOFSDirectory@/usr/home/hudson/hudson-slave/workspace/Lucene-Solr-Tests-trunk-Java6/solr/build/solr-core/test/J0/org.apache.solr.cloud.BasicDistributedZk2Test-1347685174604/control/data/index lockFactory=org.apache.lucene.store.NativeFSLockFactory@5c766625; maxCacheMB=48.0 maxMergeSizeMB=4.0),segFN=segments_1,generation=1,filenames=[segments_1]
[junit4:junit4]   2> 10373 T2028 C162 P30102 oasc.SolrDeletionPolicy.updateCommits newest commit = 1
[junit4:junit4]   2> 10377 T2028 C162 P30102 /update {wt=javabin&version=2} {add=[1 (1413150340501471232)]} 0 9
[junit4:junit4]   2> 10377 T2016 oaz.ZooKeeper.<init> Initiating client connection, connectString=127.0.0.1:30056/solr sessionTimeout=10000 watcher=org.apache.solr.common.cloud.ConnectionManager@d4a7e00
[junit4:junit4]   2> 10378 T2094 oaz.ClientCnxn$SendThread.startConnect Opening socket connection to server /127.0.0.1:30056
[junit4:junit4]   2> 10379 T2094 oaz.ClientCnxn$SendThread.primeConnection Socket connection established to localhost/127.0.0.1:30056, initiating session
[junit4:junit4]   2> 10379 T2018 oazs.NIOServerCnxn$Factory.run Accepted socket connection from /140.211.11.196:32777
[junit4:junit4]   2> 10379 T2018 oazs.NIOServerCnxn.readConnectRequest Client attempting to establish new session at /140.211.11.196:32777
[junit4:junit4]   2> 10379 T2016 oascc.ConnectionManager.waitForConnected Waiting for client to connect to ZooKeeper
[junit4:junit4]   2> 10380 T2020 oazs.NIOServerCnxn.finishSessionInit Established session 0x139c84bcd540008 with negotiated timeout 10000 for client /140.211.11.196:32777
[junit4:junit4]   2> 10381 T2094 oaz.ClientCnxn$SendThread.readConnectResult Session establishment complete on server localhost/127.0.0.1:30056, sessionid = 0x139c84bcd540008, negotiated timeout = 10000
[junit4:junit4]   2> 10381 T2095 oascc.ConnectionManager.process Watcher org.apache.solr.common.cloud.ConnectionManager@d4a7e00 name:ZooKeeperConnection Watcher:127.0.0.1:30056/solr got event WatchedEvent state:SyncConnected type:None path:null path:null type:None
[junit4:junit4]   2> 10381 T2016 oascc.ConnectionManager.waitForConnected Client is connected to ZooKeeper
[junit4:junit4]   2> 10382 T2016 oascc.ZkStateReader.createClusterStateWatchersAndUpdate Updating cluster state from ZooKeeper... 
[junit4:junit4]   2> 10389 T2044 C159 P14075 oasc.SolrDeletionPolicy.onInit SolrDeletionPolicy.onInit: commits:num=1
[junit4:junit4]   2> 		commit{dir=NRTCachingDirectory(org.apache.lucene.store.NIOFSDirectory@/usr/home/hudson/hudson-slave/workspace/Lucene-Solr-Tests-trunk-Java6/solr/build/solr-core/test/J0/org.apache.solr.cloud.BasicDistributedZk2Test-1347685174604/jetty1/index lockFactory=org.apache.lucene.store.NativeFSLockFactory@2ecef336; maxCacheMB=48.0 maxMergeSizeMB=4.0),segFN=segments_1,generation=1,filenames=[segments_1]
[junit4:junit4]   2> 10389 T2044 C159 P14075 oasc.SolrDeletionPolicy.updateCommits newest commit = 1
[junit4:junit4]   2>  C158_STATE=coll:collection1 core:collection1 props:{shard=shard1, roles=null, state=recovering, core=collection1, collection=collection1, node_name=127.0.0.1:32763_solr, base_url=http://127.0.0.1:32763/solr}
[junit4:junit4]   2> 10408 T2066 C158 P32763 oasc.SolrDeletionPolicy.onInit SolrDeletionPolicy.onInit: commits:num=1
[junit4:junit4]   2> 		commit{dir=NRTCachingDirectory(org.apache.lucene.store.NIOFSDirectory@/usr/home/hudson/hudson-slave/workspace/Lucene-Solr-Tests-trunk-Java6/solr/build/solr-core/test/J0/org.apache.solr.cloud.BasicDistributedZk2Test-1347685174604/jetty3/index lockFactory=org.apache.lucene.store.NativeFSLockFactory@5b8555cc; maxCacheMB=48.0 maxMergeSizeMB=4.0),segFN=segments_1,generation=1,filenames=[segments_1]
[junit4:junit4]   2> 10409 T2066 C158 P32763 oasc.SolrDeletionPolicy.updateCommits newest commit = 1
[junit4:junit4]   2> 10412 T2066 C158 P32763 REQ /update {distrib.from=http://127.0.0.1:14075/solr/collection1/&update.distrib=FROMLEADER&wt=javabin&version=2} status=0 QTime=9 
[junit4:junit4]   2> 10413 T2044 C159 P14075 /update {wt=javabin&version=2} {add=[1 (1413150340519297024)]} 0 29
[junit4:junit4]   2> 10414 T2016 oasc.AbstractDistribZkTestBase.waitForRecoveriesToFinish Wait for recoveries to finish - collection: collection1 failOnTimeout:true timeout (sec):1440
[junit4:junit4]   2> 10415 T2016 oascc.ZkStateReader.updateClusterState Updating cloud state from ZooKeeper... 
[junit4:junit4]   2> 10586 T2037 oascc.ZkStateReader.updateClusterState Updating cloud state from ZooKeeper... 
[junit4:junit4]   2> 10598 T2088 oascc.ZkStateReader$2.process A cluster state change has occurred - updating...
[junit4:junit4]   2> 10598 T2050 oascc.ZkStateReader$2.process A cluster state change has occurred - updating...
[junit4:junit4]   2> 10598 T2093 oascc.ZkStateReader$2.process A cluster state change has occurred - updating...
[junit4:junit4]   2> 10598 T2036 oascc.ZkStateReader$2.process A cluster state change has occurred - updating...
[junit4:junit4]   2> 10598 T2095 oascc.ZkStateReader$2.process A cluster state change has occurred - updating...
[junit4:junit4]   2> 10598 T2062 oascc.ZkStateReader$2.process A cluster state change has occurred - updating...
[junit4:junit4]   2> 10598 T2074 oascc.ZkStateReader$2.process A cluster state change has occurred - updating...
[junit4:junit4]   2> 11416 T2016 oascc.ZkStateReader.updateClusterState Updating cloud state from ZooKeeper... 
[junit4:junit4]   2> 11821 T2076 C158 P32763 oasc.RecoveryStrategy.doRecovery Begin buffering updates. core=collection1
[junit4:junit4]   2> 11821 T2076 C158 P32763 oasu.UpdateLog.bufferUpdates Starting to buffer updates. FSUpdateLog{state=ACTIVE, tlog=tlog{file=./org.apache.solr.cloud.BasicDistributedZk2Test-1347685174604/jetty3/tlog/tlog.0000000000000000000 refcount=1}}
[junit4:junit4]   2> 11821 T2076 C158 P32763 oasc.RecoveryStrategy.replicate Attempting to replicate from http://127.0.0.1:14075/solr/collection1/. core=collection1
[junit4:junit4]   2> 11822 T2076 C158 P32763 oascsi.HttpClientUtil.createClient Creating new http client, config:maxConnections=128&maxConnectionsPerHost=32&followRedirects=false
[junit4:junit4]   2> 11836 T2045 C159 P14075 oasu.DirectUpdateHandler2.commit start commit{flags=0,_version_=0,optimize=false,openSearcher=true,waitSearcher=true,expungeDeletes=false,softCommit=false}
[junit4:junit4]   2> 11963 T2045 C159 P14075 oasc.SolrDeletionPolicy.onCommit SolrDeletionPolicy.onCommit: commits:num=2
[junit4:junit4]   2> 		commit{dir=NRTCachingDirectory(org.apache.lucene.store.NIOFSDirectory@/usr/home/hudson/hudson-slave/workspace/Lucene-Solr-Tests-trunk-Java6/solr/build/solr-core/test/J0/org.apache.solr.cloud.BasicDistributedZk2Test-1347685174604/jetty1/index lockFactory=org.apache.lucene.store.NativeFSLockFactory@2ecef336; maxCacheMB=48.0 maxMergeSizeMB=4.0),segFN=segments_1,generation=1,filenames=[segments_1]
[junit4:junit4]   2> 		commit{dir=NRTCachingDirectory(org.apache.lucene.store.NIOFSDirectory@/usr/home/hudson/hudson-slave/workspace/Lucene-Solr-Tests-trunk-Java6/solr/build/solr-core/test/J0/org.apache.solr.cloud.BasicDistributedZk2Test-1347685174604/jetty1/index lockFactory=org.apache.lucene.store.NativeFSLockFactory@2ecef336; maxCacheMB=48.0 maxMergeSizeMB=4.0),segFN=segments_2,generation=2,filenames=[_0_MockSep_0.pos, _0_MockVariableIntBlock_0.doc, _0_TestBloomFilteredLucene40Postings_0.prx, _0_MockVariableIntBlock_0.skp, _0_Pulsing40_0.prx, _0_Pulsing40_0.frq, _0_MockVariableIntBlock_0.pyl, _0_MockVariableIntBlock_0.tib, _0_MockSep_0.skp, _0_MockVariableIntBlock_0.pos, _0_Pulsing40_0.tip, _0_TestBloomFilteredLucene40Postings_0.frq, _0_MockSep_0.doc, _0.si, _0_MockVariableIntBlock_0.tii, _0_TestBloomFilteredLucene40Postings_0.tim, _0_TestBloomFilteredLucene40Postings_0.tip, _0_TestBloomFilteredLucene40Postings_0.blm, _0.fnm, _0_Pulsing40_0.tim, _0_nrm.cfs, _0_MockSep_0.tib, _0_nrm.cfe, _0_MockVariableIntBlock_0.frq, _0_MockSep_0.frq, segments_2, _0.fdx, _0_MockSep_0.tii, _0_MockSep_0.pyl, _0.fdt]
[junit4:junit4]   2> 11965 T2045 C159 P14075 oasc.SolrDeletionPolicy.updateCommits newest commit = 2
[junit4:junit4]   2> 11982 T2045 C159 P14075 oass.SolrIndexSearcher.<init> Opening Searcher@116049dc main
[junit4:junit4]   2> 11983 T2045 C159 P14075 oasu.DirectUpdateHandler2.commit end_commit_flush
[junit4:junit4]   2> 11984 T2051 oasc.SolrCore.registerSearcher [collection1] Registered new searcher Searcher@116049dc main{StandardDirectoryReader(segments_2:3 _0(5.0):C1)}
[junit4:junit4]   2> 11984 T2045 C159 P14075 /update {waitSearcher=true&commit=true&commit_end_point=true&wt=javabin&softCommit=false&version=2} {commit=} 0 148
[junit4:junit4]   2> 11985 T2076 C158 P32763 oash.ReplicationHandler.inform Commits will be reserved for  10000
[junit4:junit4]   2> 11986 T2076 C158 P32763 oash.SnapPuller.<init>  No value set for 'pollInterval'. Timer Task not started.
[junit4:junit4]   2> 11988 T2046 C159 P14075 oash.ReplicationHandler.inform Commits will be reserved for  10000
[junit4:junit4]   2> 11989 T2046 C159 P14075 REQ /replication {command=indexversion&wt=javabin&qt=/replication&version=2} status=0 QTime=2 
[junit4:junit4]   2> 11990 T2076 C158 P32763 oash.SnapPuller.fetchLatestIndex Master's generation: 2
[junit4:junit4]   2> 11990 T2076 C158 P32763 oash.SnapPuller.fetchLatestIndex Slave's generation: 1
[junit4:junit4]   2> 11990 T2076 C158 P32763 oash.SnapPuller.fetchLatestIndex Starting replication process
[junit4:junit4]   2> 11997 T2046 C159 P14075 REQ /replication {command=filelist&generation=2&wt=javabin&qt=/replication&version=2} status=0 QTime=5 
[junit4:junit4]   2> 11998 T2076 C158 P32763 oash.SnapPuller.fetchLatestIndex Number of files in latest index in master: 30
[junit4:junit4]   2> 12010 T2076 C158 P32763 oash.SnapPuller.fetchLatestIndex Starting download to ./org.apache.solr.cloud.BasicDistributedZk2Test-1347685174604/jetty3/index.20120915075946588 fullCopy=true
[junit4:junit4]   2> 12014 T2046 C159 P14075 REQ /replication {file=_0_MockSep_0.pos&command=filecontent&checksum=true&generation=2&qt=/replication&wt=filestream} status=0 QTime=0 
[junit4:junit4]   2> 12020 T2046 C159 P14075 REQ /replication {file=_0_MockVariableIntBlock_0.doc&command=filecontent&checksum=true&generation=2&qt=/replication&wt=filestream} status=0 QTime=0 
[junit4:junit4]   2> 12025 T2046 C159 P14075 REQ /replication {file=_0_TestBloomFilteredLucene40Postings_0.prx&command=filecontent&checksum=true&generation=2&qt=/replication&wt=filestream} status=0 QTime=0 
[junit4:junit4]   2> 12030 T2046 C159 P14075 REQ /replication {file=_0_MockVariableIntBlock_0.skp&command=filecontent&checksum=true&generation=2&qt=/replication&wt=filestream} status=0 QTime=0 
[junit4:junit4]   2> 12032 T2076 C158 P32763 oash.SnapPuller$FileFetcher.fetchPackets WARNING No content recieved for file: {name=_0_MockVariableIntBlock_0.skp, lastmodified=1347685186000, size=0}
[junit4:junit4]   2> 12035 T2046 C159 P14075 REQ /replication {file=_0_Pulsing40_0.prx&command=filecontent&checksum=true&generation=2&qt=/replication&wt=filestream} status=0 QTime=0 
[junit4:junit4]   2> 12040 T2046 C159 P14075 REQ /replication {file=_0_Pulsing40_0.frq&command=filecontent&checksum=true&generation=2&qt=/replication&wt=filestream} status=0 QTime=0 
[junit4:junit4]   2> 12045 T2046 C159 P14075 REQ /replication {file=_0_MockVariableIntBlock_0.pyl&command=filecontent&checksum=true&generation=2&qt=/replication&wt=filestream} status=0 QTime=0 
[junit4:junit4]   2> 12047 T2076 C158 P32763 oash.SnapPuller$FileFetcher.fetchPackets WARNING No content recieved for file: {name=_0_MockVariableIntBlock_0.pyl, lastmodified=1347685186000, size=0}
[junit4:junit4]   2> 12050 T2046 C159 P14075 REQ /replication {file=_0_MockSep_0.skp&command=filecontent&checksum=true&generation=2&qt=/replication&wt=filestream} status=0 QTime=0 
[junit4:junit4]   2> 12052 T2076 C158 P32763 oash.SnapPuller$FileFetcher.fetchPackets WARNING No content recieved for file: {name=_0_MockSep_0.skp, lastmodified=1347685186000, size=0}
[junit4:junit4]   2> 12055 T2046 C159 P14075 REQ /replication {file=_0_MockVariableIntBlock_0.tib&command=filecontent&checksum=true&generation=2&qt=/replication&wt=filestream} status=0 QTime=0 
[junit4:junit4]   2> 12060 T2046 C159 P14075 REQ /replication {file=_0_Pulsing40_0.tip&command=filecontent&checksum=true&generation=2&qt=/replication&wt=filestream} status=0 QTime=0 
[junit4:junit4]   2> 12065 T2046 C159 P14075 REQ /replication {file=_0_MockVariableIntBlock_0.pos&command=filecontent&checksum=true&generation=2&qt=/replication&wt=filestream} status=0 QTime=0 
[junit4:junit4]   2> 12070 T2046 C159 P14075 REQ /replication {file=_0_TestBloomFilteredLucene40Postings_0.frq&command=filecontent&checksum=true&generation=2&qt=/replication&wt=filestream} status=0 QTime=0 
[junit4:junit4]   2> 12075 T2046 C159 P14075 REQ /replication {file=_0.si&command=filecontent&checksum=true&generation=2&qt=/replication&wt=filestream} status=0 QTime=0 
[junit4:junit4]   2> 12080 T2046 C159 P14075 REQ /replication {file=_0_MockSep_0.doc&command=filecontent&checksum=true&generation=2&qt=/replication&wt=filestream} status=0 QTime=0 
[junit4:junit4]   2> 12085 T2046 C159 P14075 REQ /replication {file=_0_MockVariableIntBlock_0.tii&command=filecontent&checksum=true&generation=2&qt=/replication&wt=filestream} status=0 QTime=0 
[junit4:junit4]   2> 12090 T2046 C159 P14075 REQ /replication {file=_0_TestBloomFilteredLucene40Postings_0.tim&command=filecontent&checksum=true&generation=2&qt=/replication&wt=filestream} status=0 QTime=0 
[junit4:junit4]   2> 12095 T2046 C159 P14075 REQ /replication {file=_0_TestBloomFilteredLucene40Postings_0.blm&command=filecontent&checksum=true&generation=2&qt=/replication&wt=filestream} status=0 QTime=0 
[junit4:junit4]   2> 12100 T2046 C159 P14075 REQ /replication {file=_0_TestBloomFilteredLucene40Postings_0.tip&command=filecontent&checksum=true&generation=2&qt=/replication&wt=filestream} status=0 QTime=0 
[junit4:junit4]   2> 12105 T2046 C159 P14075 REQ /replication {file=_0_Pulsing40_0.tim&command=filecontent&checksum=true&generation=2&qt=/replication&wt=filestream} status=0 QTime=0 
[junit4:junit4]   2> 12110 T2046 C159 P14075 REQ /replication {file=_0.fnm&command=filecontent&checksum=true&generation=2&qt=/replication&wt=filestream} status=0 QTime=0 
[junit4:junit4]   2> 12115 T2046 C159 P14075 REQ /replication {file=_0_nrm.cfs&command=filecontent&checksum=true&generation=2&qt=/replication&wt=filestream} status=0 QTime=0 
[junit4:junit4]   2> 12120 T2046 C159 P14075 REQ /replication {file=_0_MockSep_0.tib&command=filecontent&checksum=true&generation=2&qt=/replication&wt=filestream} status=0 QTime=0 
[junit4:junit4]   2> 12125 T2046 C159 P14075 REQ /replication {file=_0_MockVariableIntBlock_0.frq&command=filecontent&checksum=true&generation=2&qt=/replication&wt=filestream} status=0 QTime=0 
[junit4:junit4]   2> 12130 T2046 C159 P14075 REQ /replication {file=_0_nrm.cfe&command=filecontent&checksum=true&generation=2&qt=/replication&wt=filestream} status=0 QTime=0 
[junit4:junit4]   2> 12135 T2046 C159 P14075 REQ /replication {file=segments_2&command=filecontent&checksum=true&generation=2&qt=/replication&wt=filestream} status=0 QTime=0 
[junit4:junit4]   2> 12140 T2046 C159 P14075 REQ /replication {file=_0_MockSep_0.frq&command=filecontent&checksum=true&generation=2&qt=/replication&wt=filestream} status=0 QTime=0 
[junit4:junit4]   2> 12145 T2046 C159 P14075 REQ /replication {file=_0.fdx&command=filecontent&checksum=true&generation=2&qt=/replication&wt=filestream} status=0 QTime=0 
[junit4:junit4]   2> 12150 T2046 C159 P14075 REQ /replication {file=_0_MockSep_0.tii&command=filecontent&checksum=true&generation=2&qt=/replication&wt=filestream} status=0 QTime=0 
[junit4:junit4]   2> 12155 T2046 C159 P14075 REQ /replication {file=_0_MockSep_0.pyl&command=filecontent&checksum=true&generation=2&qt=/replication&wt=filestream} status=0 QTime=0 
[junit4:junit4]   2> 12157 T2076 C158 P32763 oash.SnapPuller$FileFetcher.fetchPackets WARNING No content recieved for file: {name=_0_MockSep_0.pyl, lastmodified=1347685186000, size=0}
[junit4:junit4]   2> 12160 T2046 C159 P14075 REQ /replication {file=_0.fdt&command=filecontent&checksum=true&generation=2&qt=/replication&wt=filestream} status=0 QTime=0 
[junit4:junit4]   2> 12162 T2076 C158 P32763 oash.SnapPuller.fetchLatestIndex Total time taken for download : 0 secs
[junit4:junit4]   2> 12163 T2076 C158 P32763 oash.SnapPuller.modifyIndexProps New index installed. Updating index properties... index=index.20120915075946588
[junit4:junit4]   2> 12165 T2076 C158 P32763 oasu.DefaultSolrCoreState.newIndexWriter Creating new IndexWriter...
[junit4:junit4]   2> 12165 T2076 C158 P32763 oasu.DefaultSolrCoreState.newIndexWriter Waiting until IndexWriter is unused... core=collection1
[junit4:junit4]   2> 12166 T2076 C158 P32763 oasu.DefaultSolrCoreState.newIndexWriter Rollback old IndexWriter... core=collection1
[junit4:junit4]   2> 12170 T2076 C158 P32763 oasc.SolrCore.getNewIndexDir WARNING New index directory detected: old=./org.apache.solr.cloud.BasicDistributedZk2Test-1347685174604/jetty3/index/ new=./org.apache.solr.cloud.BasicDistributedZk2Test-1347685174604/jetty3/index.20120915075946588
[junit4:junit4]   2> 12171 T2076 C158 P32763 oasc.CachingDirectoryFactory.get return new directory for /usr/home/hudson/hudson-slave/workspace/Lucene-Solr-Tests-trunk-Java6/solr/build/solr-core/test/J0/./org.apache.solr.cloud.BasicDistributedZk2Test-1347685174604/jetty3/index.20120915075946588 forceNew:true
[junit4:junit4]   2> 12184 T2076 C158 P32763 oasc.SolrDeletionPolicy.onInit SolrDeletionPolicy.onInit: commits:num=1
[junit4:junit4]   2> 		commit{dir=NRTCachingDirectory(org.apache.lucene.store.NIOFSDirectory@/usr/home/hudson/hudson-slave/workspace/Lucene-Solr-Tests-trunk-Java6/solr/build/solr-core/test/J0/org.apache.solr.cloud.BasicDistributedZk2Test-1347685174604/jetty3/index.20120915075946588 lockFactory=org.apache.lucene.store.NativeFSLockFactory@142fa4e6; maxCacheMB=48.0 maxMergeSizeMB=4.0),segFN=segments_2,generation=2,filenames=[_0_MockSep_0.pos, _0_MockVariableIntBlock_0.doc, _0_TestBloomFilteredLucene40Postings_0.prx, _0_MockVariableIntBlock_0.skp, _0_Pulsing40_0.prx, _0_Pulsing40_0.frq, _0_MockVariableIntBlock_0.pyl, _0_MockSep_0.skp, _0_MockVariableIntBlock_0.tib, _0_Pulsing40_0.tip, _0_MockVariableIntBlock_0.pos, _0_TestBloomFilteredLucene40Postings_0.frq, _0_MockSep_0.doc, _0.si, _0_MockVariableIntBlock_0.tii, _0_TestBloomFilteredLucene40Postings_0.tim, _0_TestBloomFilteredLucene40Postings_0.tip, _0_TestBloomFilteredLucene40Postings_0.blm, _0.fnm, _0_Pulsing40_0.tim, _0_nrm.cfs, _0_MockSep_0.tib, _0_nrm.cfe, _0_MockVariableIntBlock_0.frq, _0_MockSep_0.frq, segments_2, _0.fdx, _0_MockSep_0.tii, _0_MockSep_0.pyl, _0.fdt]
[junit4:junit4]   2> 12184 T2076 C158 P32763 oasc.SolrDeletionPolicy.updateCommits newest commit = 2
[junit4:junit4]   2> 12185 T2076 C158 P32763 oasu.DefaultSolrCoreState.newIndexWriter New IndexWriter is ready to be used.
[junit4:junit4]   2> 12189 T2076 C158 P32763 oass.SolrIndexSearcher.<init> Opening Searcher@145bd110 main
[junit4:junit4]   2> 12190 T2075 oasc.SolrCore.registerSearcher [collection1] Registered new searcher Searcher@145bd110 main{StandardDirectoryReader(segments_2:3:nrt _0(5.0):C1)}
[junit4:junit4]   2> 12191 T2075 oasc.CachingDirectoryFactory.close Closing directory:/usr/home/hudson/hudson-slave/workspace/Lucene-Solr-Tests-trunk-Java6/solr/build/solr-core/test/J0/./org.apache.solr.cloud.BasicDistributedZk2Test-1347685174604/jetty3/index
[junit4:junit4]   2> 12191 T2075 oash.SnapPuller$2.onClose removing old index directory ./org.apache.solr.cloud.BasicDistributedZk2Test-1347685174604/jetty3/index
[junit4:junit4]   2> 12193 T2076 C158 P32763 oasu.DirectUpdateHandler2.commit start commit{flags=0,_version_=0,optimize=false,openSearcher=true,waitSearcher=true,expungeDeletes=false,softCommit=false}
[junit4:junit4]   2> 12195 T2076 C158 P32763 oass.SolrIndexSearcher.<init> Opening Searcher@3ddafd13 main
[junit4:junit4]   2> 12195 T2076 C158 P32763 oasu.DirectUpdateHandler2.commit end_commit_flush
[junit4:junit4]   2> 12196 T2075 oasc.SolrCore.registerSearcher [collection1] Registered new searcher Searcher@3ddafd13 main{StandardDirectoryReader(segments_2:3:nrt _0(5.0):C1)}
[junit4:junit4]   2> 12202 T2076 C158 P32763 oasc.RecoveryStrategy.replay Replaying buffered documents. core=collection1
[junit4:junit4]   2> 12202 T2098 C158 P32763 oasu.UpdateLog$LogReplayer.doReplay WARNING Starting log replay tlog{file=./org.apache.solr.cloud.BasicDistributedZk2Test-1347685174604/jetty3/tlog/tlog.0000000000000000000 refcount=2} active=true starting pos=433
[junit4:junit4]   2> 12207 T2098 C158 P32763 oasu.DirectUpdateHandler2.commit start commit{flags=2,_version_=0,optimize=false,openSearcher=true,waitSearcher=true,expungeDeletes=false,softCommit=false}
[junit4:junit4]   2> 12209 T2098 C158 P32763 oass.SolrIndexSearcher.<init> Opening Searcher@785b6f19 main
[junit4:junit4]   2> 12210 T2098 C158 P32763 oasu.DirectUpdateHandler2.commit end_commit_flush
[junit4:junit4]   2> 12210 T2075 oasc.SolrCore.registerSearcher [collection1] Registered new searcher Searcher@785b6f19 main{StandardDirectoryReader(segments_2:3:nrt _0(5.0):C1)}
[junit4:junit4]   2> 12211 T2098 C158 P32763 oasu.UpdateLog$LogReplayer.run WARNING Log replay finished. recoveryInfo=RecoveryInfo{adds=0 deletes=0 deleteByQuery=0 errors=0 positionOfStart=433}
[junit4:junit4]   2> 12211 T2076 C158 P32763 oasc.RecoveryStrategy.doRecovery Replication Recovery was successful - registering as Active. core=collection1
[junit4:junit4]   2> 12213 T2076 C158 P32763 oasc.RecoveryStrategy.doRecovery Finished recovery process. core=collection1
[junit4:junit4]   2> 12418 T2016 oascc.ZkStateReader.updateClusterState Updating cloud state from ZooKeeper... 
[junit4:junit4]   2> 12605 T2037 oascc.ZkStateReader.updateClusterState Updating cloud state from ZooKeeper... 
[junit4:junit4]   2> 12619 T2050 oascc.ZkStateReader$2.process A cluster state change has occurred - updating...
[junit4:junit4]   2> 12619 T2095 oascc.ZkStateReader$2.process A cluster state change has occurred - updating...
[junit4:junit4]   2> 12619 T2074 oascc.ZkStateReader$2.process A cluster state change has occurred - updating...
[junit4:junit4]   2> 12620 T2062 oascc.ZkStateReader$2.process A cluster state change has occurred - updating...
[junit4:junit4]   2> 12620 T2093 oascc.ZkStateReader$2.process A cluster state change has occurred - updating...
[junit4:junit4]   2> 12619 T2036 oascc.ZkStateReader$2.process A cluster state change has occurred - updating...
[junit4:junit4]   2> 12619 T2088 oascc.ZkStateReader$2.process A cluster state change has occurred - updating...
[junit4:junit4]   2>  C160_STATE=coll:collection1 core:collection1 props:{shard=shard2, roles=null, state=recovering, core=collection1, collection=collection1, node_name=127.0.0.1:32769_solr, base_url=http://127.0.0.1:32769/solr}
[junit4:junit4]   2> 13348 T2090 C160 P32769 oasc.RecoveryStrategy.doRecovery Begin buffering updates. core=collection1
[junit4:junit4]   2> 13348 T2090 C160 P32769 oasu.UpdateLog.bufferUpdates Starting to buffer updates. FSUpdateLog{state=ACTIVE, tlog=null}
[junit4:junit4]   2> 13348 T2090 C160 P32769 oasc.RecoveryStrategy.replicate Attempting to replicate from http://127.0.0.1:32758/solr/collection1/. core=collection1
[junit4:junit4]   2> 13348 T2090 C160 P32769 oascsi.HttpClientUtil.createClient Creating new http client, config:maxConnections=128&maxConnectionsPerHost=32&followRedirects=false
[junit4:junit4]   2> 13359 T2056 C161 P32758 oasu.DirectUpdateHandler2.commit start commit{flags=0,_version_=0,optimize=false,openSearcher=true,waitSearcher=true,expungeDeletes=false,softCommit=false}
[junit4:junit4]   2> 13365 T2056 C161 P32758 oasc.SolrDeletionPolicy.onInit SolrDeletionPolicy.onInit: commits:num=1
[junit4:junit4]   2> 		commit{dir=NRTCachingDirectory(org.apache.lucene.store.NIOFSDirectory@/usr/home/hudson/hudson-slave/workspace/Lucene-Solr-Tests-trunk-Java6/solr/build/solr-core/test/J0/org.apache.solr.cloud.BasicDistributedZk2Test-1347685174604/jetty2/index lockFactory=org.apache.lucene.store.NativeFSLockFactory@4a659073; maxCacheMB=48.0 maxMergeSizeMB=4.0),segFN=segments_1,generation=1,filenames=[segments_1]
[junit4:junit4]   2> 13366 T2056 C161 P32758 oasc.SolrDeletionPolicy.updateCommits newest commit = 1
[junit4:junit4]   2> 13368 T2056 C161 P32758 oass.SolrIndexSearcher.<init> Opening Searcher@22c19c45 main
[junit4:junit4]   2> 13369 T2056 C161 P32758 oasu.DirectUpdateHandler2.commit end_commit_flush
[junit4:junit4]   2> 13370 T2063 oasc.SolrCore.registerSearcher [collection1] Registered new searcher Searcher@22c19c45 main{StandardDirectoryReader(segments_1:1)}
[junit4:junit4]   2> 13370 T2056 C161 P32758 /update {waitSearcher=true&commit=true&commit_end_point=true&wt=javabin&softCommit=false&version=2} {commit=} 0 11
[junit4:junit4]   2> 13371 T2090 C160 P32769 oash.ReplicationHandler.inform Commits will be reserved for  10000
[junit4:junit4]   2> 13371 T2090 C160 P32769 oash.SnapPuller.<init>  No value set for 'pollInterval'. Timer Task not started.
[junit4:junit4]   2> 13373 T2057 C161 P32758 oash.ReplicationHandler.inform Commits will be reserved for  10000
[junit4:junit4]   2> 13373 T2057 C161 P32758 REQ /replication {command=indexversion&wt=javabin&qt=/replication&version=2} status=0 QTime=1 
[junit4:junit4]   2> 13376 T2090 C160 P32769 oasc.SolrDeletionPolicy.onInit SolrDeletionPolicy.onInit: commits:num=1
[junit4:junit4]   2> 		commit{dir=NRTCachingDirectory(org.apache.lucene.store.NIOFSDirectory@/usr/home/hudson/hudson-slave/workspace/Lucene-Solr-Tests-trunk-Java6/solr/build/solr-core/test/J0/org.apache.solr.cloud.BasicDistributedZk2Test-1347685174604/jetty4/index lockFactory=org.apache.lucene.store.NativeFSLockFactory@1538f624; maxCacheMB=48.0 maxMergeSizeMB=4.0),segFN=segments_1,generation=1,filenames=[segments_1]
[junit4:junit4]   2> 13377 T2090 C160 P32769 oasc.SolrDeletionPolicy.updateCommits newest commit = 1
[junit4:junit4]   2> 13377 T2090 C160 P32769 oasu.DirectUpdateHandler2.commit start commit{flags=0,_version_=0,optimize=false,openSearcher=true,waitSearcher=true,expungeDeletes=false,softCommit=false}
[junit4:junit4]   2> 13382 T2090 C160 P32769 oasc.SolrDeletionPolicy.onCommit SolrDeletionPolicy.onCommit: commits:num=2
[junit4:junit4]   2> 		commit{dir=NRTCachingDirectory(org.apache.lucene.store.NIOFSDirectory@/usr/home/hudson/hudson-slave/workspace/Lucene-Solr-Tests-trunk-Java6/solr/build/solr-core/test/J0/org.apache.solr.cloud.BasicDistributedZk2Test-1347685174604/jetty4/index lockFactory=org.apache.lucene.store.NativeFSLockFactory@1538f624; maxCacheMB=48.0 maxMergeSizeMB=4.0),segFN=segments_1,generation=1,filenames=[segments_1]
[junit4:junit4]   2> 		commit{dir=NRTCachingDirectory(org.apache.lucene.store.NIOFSDirectory@/usr/home/hudson/hudson-slave/workspace/Lucene-Solr-Tests-trunk-Java6/solr/build/solr-core/test/J0/org.apache.solr.cloud.BasicDistributedZk2Test-1347685174604/jetty4/index lockFactory=org.apache.lucene.store.NativeFSLockFactory@1538f624; maxCacheMB=48.0 maxMergeSizeMB=4.0),segFN=segments_2,generation=2,filenames=[segments_2]
[junit4:junit4]   2> 13382 T2090 C160 P32769 oasc.SolrDeletionPolicy.updateCommits newest commit = 2
[junit4:junit4]   2> 13384 T2090 C160 P32769 oass.SolrIndexSearcher.<init> Opening Searcher@6505b5e4 main
[junit4:junit4]   2> 13385 T2090 C160 P32769 oasu.DirectUpdateHandler2.commit end_commit_flush
[junit4:junit4]   2> 13385 T2089 oasc.SolrCore.registerSearcher [collection1] Registered new searcher Searcher@6505b5e4 main{StandardDirectoryReader(segments_2:2)}
[junit4:junit4]   2> 13386 T2090 C160 P32769 oasc.RecoveryStrategy.replay No replay needed. core=collection1
[junit4:junit4]   2> 13386 T2090 C160 P32769 oasc.RecoveryStrategy.doRecovery Replication Recovery was successful - registering as Active. core=collection1
[junit4:junit4]   2> 13432 T2090 C160 P32769 oasc.RecoveryStrategy.doRecovery Finished recovery process. core=collection1
[junit4:junit4]   2> 13432 T2016 oascc.ZkStateReader.updateClusterState Updating cloud state from ZooKeeper... 
[junit4:junit4]   2> 13627 T2037 oascc.ZkStateReader.updateClusterState Updating cloud state from ZooKeeper... 
[junit4:junit4]   2> 13646 T2036 oascc.ZkStateReader$2.process A cluster state change has occurred - updating...
[junit4:junit4]   2> 13646 T2062 oascc.ZkStateReader$2.process A cluster state change has occurred - updating...
[junit4:junit4]   2> 13646 T2074 oascc.ZkStateReader$2.process A cluster state change has occurred - updating...
[junit4:junit4]   2> 13646 T2050 oascc.ZkStateReader$2.process A cluster state change has occurred - updating...
[junit4:junit4]   2> 13646 T2093 oascc.ZkStateReader$2.process A cluster state change has occurred - updating...
[junit4:junit4]   2> 13646 T2095 oascc.ZkStateReader$2.process A cluster state change has occurred - updating...
[junit4:junit4]   2> 13646 T2088 oascc.ZkStateReader$2.process A cluster state change has occurred - updating...
[junit4:junit4]   2> 14435 T2016 oascc.ZkStateReader.updateClusterState Updating cloud state from ZooKeeper... 
[junit4:junit4]   2> 14438 T2028 C162 P30102 oasu.DirectUpdateHandler2.commit start commit{flags=0,_version_=0,optimize=false,openSearcher=true,waitSearcher=true,expungeDeletes=false,softCommit=false}
[junit4:junit4]   2> 14557 T2028 C162 P30102 oasc.SolrDeletionPolicy.onCommit SolrDeletionPolicy.onCommit: commits:num=2
[junit4:junit4]   2> 		commit{dir=NRTCachingDirectory(org.apache.lucene.store.NIOFSDirectory@/usr/home/hudson/hudson-slave/workspace/Lucene-Solr-Tests-trunk-Java6/solr/build/solr-core/test/J0/org.apache.solr.cloud.BasicDistributedZk2Test-1347685174604/control/data/index lockFactory=org.apache.lucene.store.NativeFSLockFactory@5c766625; maxCacheMB=48.0 maxMergeSizeMB=4.0),segFN=segments_1,generation=1,filenames=[segments_1]
[junit4:junit4]   2> 		commit{dir=NRTCachingDirectory(org.apache.lucene.store.NIOFSDirectory@/usr/home/hudson/hudson-slave/workspace/Lucene-Solr-Tests-trunk-Java6/solr/build/solr-core/test/J0/org.apache.solr.cloud.BasicDistributedZk2Test-1347685174604/control/data/index lockFactory=org.apache.lucene.store.NativeFSLockFactory@5c766625; maxCacheMB=48.0 maxMergeSizeMB=4.0),segFN=segments_2,generation=2,filenames=[_0_MockSep_0.pos, _0_MockVariableIntBlock_0.doc, _0_TestBloomFilteredLucene40Postings_0.prx, _0_MockVariableIntBlock_0.skp, _0_Pulsing40_0.prx, _0_Pulsing40_0.frq, _0_MockVariableIntBlock_0.pyl, _0_MockVariableIntBlock_0.tib, _0_MockSep_0.skp, _0_MockVariableIntBlock_0.pos, _0_Pulsing40_0.tip, _0_TestBloomFilteredLucene40Postings_0.frq, _0_MockSep_0.doc, _0.si, _0_MockVariableIntBlock_0.tii, _0_TestBloomFilteredLucene40Postings_0.tim, _0_TestBloomFilteredLucene40Postings_0.tip, _0_TestBloomFilteredLucene40Postings_0.blm, _0.fnm, _0_Pulsing40_0.tim, _0_nrm.cfs, _0_MockSep_0.tib, _0_nrm.cfe, _0_MockVariableIntBlock_0.frq, _0_MockSep_0.frq, segments_2, _0.fdx, _0_MockSep_0.tii, _0_MockSep_0.pyl, _0.fdt]
[junit4:junit4]   2> 14558 T2028 C162 P30102 oasc.SolrDeletionPolicy.updateCommits newest commit = 2
[junit4:junit4]   2> 14576 T2028 C162 P30102 oass.SolrIndexSearcher.<init> Opening Searcher@41e3d0a2 main
[junit4:junit4]   2> 14577 T2028 C162 P30102 oasu.DirectUpdateHandler2.commit end_commit_flush
[junit4:junit4]   2> 14577 T2039 oasc.SolrCore.registerSearcher [collection1] Registered new searcher Searcher@41e3d0a2 main{StandardDirectoryReader(segments_2:3 _0(5.0):C1)}
[junit4:junit4]   2> 14578 T2028 C162 P30102 /update {waitSearcher=true&wt=javabin&commit=true&softCommit=false&version=2} {commit=} 0 140
[junit4:junit4]   2> 14580 T2058 C161 P32758 oasu.DirectUpdateHandler2.commit start commit{flags=0,_version_=0,optimize=false,openSearcher=true,waitSearcher=true,expungeDeletes=false,softCommit=false}
[junit4:junit4]   2> 14583 T2058 C161 P32758 oass.SolrIndexSearcher.<init> Opening Searcher@6c54e7c2 main
[junit4:junit4]   2> 14584 T2058 C161 P32758 oasu.DirectUpdateHandler2.commit end_commit_flush
[junit4:junit4]   2> 14585 T2063 oasc.SolrCore.registerSearcher [collection1] Registered new searcher Searcher@6c54e7c2 main{StandardDirectoryReader(segments_1:1)}
[junit4:junit4]   2> 14585 T2058 C161 P32758 oasu.SolrCmdDistributor.distribCommit Distrib commit to:[StdNode: http://127.0.0.1:14075/solr/collection1/, StdNode: http://127.0.0.1:32763/solr/collection1/, StdNode: http://127.0.0.1:32769/solr/collection1/]
[junit4:junit4]   2> 14587 T2047 C159 P14075 oasu.DirectUpdateHandler2.commit start commit{flags=0,_version_=0,optimize=false,openSearcher=true,waitSearcher=true,expungeDeletes=false,softCommit=false}
[junit4:junit4]   2>  C158_STATE=coll:collection1 core:collection1 props:{shard=shard1, roles=null, state=active, core=collection1, collection=collection1, node_name=127.0.0.1:32763_solr, base_url=http://127.0.0.1:32763/solr}
[junit4:junit4]   2> 14589 T2066 C158 P32763 oasu.DirectUpdateHandler2.commit start commit{flags=0,_version_=0,optimize=false,openSearcher=true,waitSearcher=true,expungeDeletes=false,softCommit=false}
[junit4:junit4]   2> 14591 T2066 C158 P32763 oass.SolrIndexSearcher.<init> Opening Searcher@17ea5db5 main
[junit4:junit4]   2> 14592 T2066 C158 P32763 oasu.DirectUpdateHandler2.commit end_commit_flush
[junit4:junit4]   2> 14593 T2075 oasc.SolrCore.registerSearcher [collection1] Registered new searcher Searcher@17ea5db5 main{StandardDirectoryReader(segments_2:3:nrt _0(5.0):C1)}
[junit4:junit4]   2> 14593 T2066 C158 P32763 /update {waitSearcher=true&commit=true&wt=javabin&commit_end_point=true&expungeDeletes=false&softCommit=false&version=2} {commit=} 0 4
[junit4:junit4]   2>  C160_STATE=coll:collection1 core:collection1 props:{shard=shard2, roles=null, state=active, core=collection1, collection=collection1, node_name=127.0.0.1:32769_solr, base_url=http://127.0.0.1:32769/solr}
[junit4:junit4]   2> 14594 T2080 C160 P32769 oasu.DirectUpdateHandler2.commit start commit{flags=0,_version_=0,optimize=false,openSearcher=true,waitSearcher=true,expungeDeletes=false,softCommit=false}
[junit4:junit4]   2> 14600 T2080 C160 P32769 oass.SolrIndexSearcher.<init> Opening Searcher@71bde4ed main
[junit4:junit4]   2> 14600 T2080 C160 P32769 oasu.DirectUpdateHandler2.commit end_commit_flush
[junit4:junit4]   2> 14601 T2089 oasc.SolrCore.registerSearcher [collection1] Registered new searcher Searcher@71bde4ed main{StandardDirectoryReader(segments_2:2)}
[junit4:junit4]   2> 14602 T2080 C160 P32769 /update {waitSearcher=true&commit=true&wt=javabin&commit_end_point=true&expungeDeletes=false&softCommit=false&version=2} {commit=} 0 8
[junit4:junit4]   2> 14604 T2047 C159 P14075 oass.SolrIndexSearcher.<init> Opening Searcher@56b64f95 main
[junit4:junit4]   2> 14605 T2047 C159 P14075 oasu.DirectUpdateHandler2.commit end_commit_flush
[junit4:junit4]   2> 14605 T2051 oasc.SolrCore.registerSearcher [collection1] Registered new searcher Searcher@56b64f95 main{StandardDirectoryReader(segments_2:3 _0(5.0):C1)}
[junit4:junit4]   2> 14606 T2047 C159 P14075 /update {waitSearcher=true&commit=true&wt=javabin&commit_end_point=true&expungeDeletes=false&softCommit=false&version=2} {commit=} 0 19
[junit4:junit4]   2> 14607 T2058 C161 P32758 /update {waitSearcher=true&wt=javabin&commit=true&softCommit=false&version=2} {commit=} 0 27
[junit4:junit4]   2> 14612 T2029 C162 P30102 REQ /select {fl=id,score&shard.url=127.0.0.1:30102/solr/collection1/&NOW=1347685189198&start=0&q=*:*&distrib=false&isShard=true&wt=javabin&fsv=true&rows=10&version=2} hits=1 status=0 QTime=1 
[junit4:junit4]   2> 14615 T2029 C162 P30102 REQ /select {shard.url=127.0.0.1:30102/solr/collection1/&NOW=1347685189198&q=*:*&ids=1&distrib=false&isShard=true&wt=javabin&version=2} status=0 QTime=0 
[junit4:junit4]   2> 14616 T2028 C162 P30102 REQ /select {wt=javabin&q=*:*&version=2} hits=1 status=0 QTime=7 
[junit4:junit4]   2> 14617 T2016 oaz.ZooKeeper.<init> Initiating client connection, connectString=127.0.0.1:30056/solr sessionTimeout=10000 watcher=org.apache.solr.common.cloud.ConnectionManager@7da96a96
[junit4:junit4]   2> 14618 T2103 oaz.ClientCnxn$SendThread.startConnect Opening socket connection to server /127.0.0.1:30056
[junit4:junit4]   2> 14618 T2016 oascc.ConnectionManager.waitForConnected Waiting for client to connect to ZooKeeper
[junit4:junit4]   2> 14618 T2103 oaz.ClientCnxn$SendThread.primeConnection Socket connection established to localhost/127.0.0.1:30056, initiating session
[junit4:junit4]   2> 14619 T2018 oazs.NIOServerCnxn$Factory.run Accepted socket connection from /140.211.11.196:32796
[junit4:junit4]   2> 14619 T2018 oazs.NIOServerCnxn.readConnectRequest Client attempting to establish new session at /140.211.11.196:32796
[junit4:junit4]   2> 14620 T2020 oazs.NIOServerCnxn.finishSessionInit Established session 0x139c84bcd540009 with negotiated timeout 10000 for client /140.211.11.196:32796
[junit4:junit4]   2> 14620 T2103 oaz.ClientCnxn$SendThread.readConnectResult Session establishment complete on server localhost/127.0.0.1:30056, sessionid = 0x139c84bcd540009, negotiated timeout = 10000
[junit4:junit4]   2> 14620 T2104 oascc.ConnectionManager.process Watcher org.apache.solr.common.cloud.ConnectionManager@7da96a96 name:ZooKeeperConnection Watcher:127.0.0.1:30056/solr got event WatchedEvent state:SyncConnected type:None path:null path:null type:None
[junit4:junit4]   2> 14621 T2016 oascc.ConnectionManager.waitForConnected Client is connected to ZooKeeper
[junit4:junit4]   2> 14621 T2016 oascc.ZkStateReader.createClusterStateWatchersAndUpdate Updating cluster state from ZooKeeper... 
[junit4:junit4]   2> 14622 T2021 oazs.PrepRequestProcessor.pRequest Processed session termination for sessionid: 0x139c84bcd540009
[junit4:junit4]   2> 14624 T2104 oaz.ClientCnxn$EventThread.run EventThread shut down
[junit4:junit4]   2> 14624 T2016 oaz.ZooKeeper.close Session: 0x139c84bcd540009 closed
[junit4:junit4]   2> 14624 T2018 oazs.NIOServerCnxn.closeSock Closed socket connection for client /140.211.11.196:32796 which had sessionid 0x139c84bcd540009
[junit4:junit4]   2> 14625 T2048 C159 P14075 REQ /select {distrib=false&wt=javabin&q=*:*&version=2} hits=1 status=0 QTime=0 
[junit4:junit4]   2> 14627 T2059 C161 P32758 REQ /select {distrib=false&wt=javabin&q=*:*&version=2} hits=0 status=0 QTime=0 
[junit4:junit4]   2> 14631 T2082 C160 P32769 REQ /select {fl=id,score&shard.url=127.0.0.1:32758/solr/collection1/|127.0.0.1:32769/solr/collection1/&NOW=1347685189218&start=0&q=*:*&distrib=false&isShard=true&wt=javabin&fsv=true&rows=10&version=2} hits=0 status=0 QTime=0 
[junit4:junit4]   2> 14631 T2067 C158 P32763 REQ /select {fl=id,score&shard.url=127.0.0.1:14075/solr/collection1/|127.0.0.1:32763/solr/collection1/&NOW=1347685189218&start=0&q=*:*&distrib=false&isShard=true&wt=javabin&fsv=true&rows=10&version=2} hits=1 status=0 QTime=0 
[junit4:junit4]   2> 14634 T2067 C158 P32763 REQ /select {shard.url=127.0.0.1:14075/solr/collection1/|127.0.0.1:32763/solr/collection1/&NOW=1347685189218&q=*:*&ids=1&distrib=false&isShard=true&wt=javabin&version=2} status=0 QTime=0 
[junit4:junit4]   2> 14635 T2081 C160 P32769 REQ /select {wt=javabin&q=*:*&version=2} hits=1 status=0 QTime=6 
[junit4:junit4]   2> 14642 T2028 C162 P30102 /update {wt=javabin&version=2} {add=[2 (1413150344978890752)]} 0 4
[junit4:junit4]   2> 14651 T2080 C160 P32769 REQ /update {distrib.from=http://127.0.0.1:32758/solr/collection1/&update.distrib=FROMLEADER&wt=javabin&version=2} status=0 QTime=2 
[junit4:junit4]   2> 14652 T2058 C161 P32758 /update {wt=javabin&version=2} {add=[2 (1413150344985182208)]} 0 8
[junit4:junit4]   2> 14656 T2028 C162 P30102 /update {wt=javabin&version=2} {add=[3 (1413150344995667968)]} 0 2
[junit4:junit4]   2> 14663 T2080 C160 P32769 REQ /update {distrib.from=http://127.0.0.1:32758/solr/collection1/&update.distrib=FROMLEADER&wt=javabin&version=2} status=0 QTime=1 
[junit4:junit4]   2> 14663 T2058 C161 P32758 /update {wt=javabin&version=2} {add=[3 (1413150345000910848)]} 0 4
[junit4:junit4]   2> 14667 T2028 C162 P30102 /update {wt=javabin&version=2} {add=[4 (1413150345008250880)]} 0 1
[junit4:junit4]   2> 14681 T2066 C158 P32763 REQ /update {update.distrib=FROMLEADER&distrib.from=http://127.0.0.1:14075/solr/collection1/&wt=javabin&version=2} status=0 QTime=3 
[junit4:junit4]   2> 14682 T2047 C159 P14075 REQ /update {distrib.from=http://127.0.0.1:32758/solr/collection1/&update.distrib=TOLEADER&wt=javabin&version=2} status=0 QTime=11 
[junit4:junit4]   2> 14683 T2058 C161 P32758 /update {wt=javabin&version=2} {add=[4]} 0 14
[junit4:junit4]   2> 14686 T2028 C162 P30102 /update {wt=javabin&version=2} {add=[5 (1413150345028173824)]} 0 1
[junit4:junit4]   2> 14693 T2080 C160 P32769 REQ /update {distrib.from=http://127.0.0.1:32758/solr/collection1/&update.distrib=FROMLEADER&wt=javabin&version=2} status=0 QTime=1 
[junit4:junit4]   2> 14693 T2058 C161 P32758 /update {wt=javabin&version=2} {add=[5 (1413150345032368128)]} 0 4
[junit4:junit4]   2> 14697 T2028 C162 P30102 /update {wt=javabin&version=2} {add=[6 (1413150345039708160)]} 0 1
[junit4:junit4]   2> 14706 T2080 C160 P32769 REQ /update {update.distrib=FROMLEADER&distrib.from=http://127.0.0.1:32758/solr/collection1/&wt=javabin&version=2} status=0 QTime=1 
[junit4:junit4]   2> 14706 T2060 C161 P32758 REQ /update {distrib.from=http://127.0.0.1:14075/solr/collection1/&update.distrib=TOLEADER&wt=javabin&version=2} status=0 QTime=5 
[junit4:junit4]   2> 14707 T2044 C159 P14075 /update {wt=javabin&version=2} {add=[6]} 0 7
[junit4:junit4]   2> 14710 T2028 C162 P30102 /update {wt=javabin&version=2} {add=[7 (1413150345053339648)]} 0 1
[junit4:junit4]   2> 14719 T2080 C160 P32769 REQ /update {update.distrib=FROMLEADER&distrib.from=http://127.0.0.1:32758/solr/collection1/&wt=javabin&version=2} status=0 QTime=1 
[junit4:junit4]   2> 14719 T2060 C161 P32758 REQ /update {distrib.from=http://127.0.0.1:14075/solr/collection1/&update.distrib=TOLEADER&wt=javabin&version=2} status=0 QTime=4 
[junit4:junit4]   2> 14720 T2044 C159 P14075 /update {wt=javabin&version=2} {add=[7]} 0 7
[junit4:junit4]   2> 14723 T2028 C162 P30102 /update {wt=javabin&version=2} {add=[8 (1413150345066971136)]} 0 1
[junit4:junit4]   2> 14730 T2066 C158 P32763 REQ /update {distrib.from=http://127.0.0.1:14075/solr/collection1/&update.distrib=FROMLEADER&wt=javabin&version=2} status=0 QTime=1 
[junit4:junit4]   2> 14731 T2044 C159 P14075 /update {wt=javabin&version=2} {add=[8 (1413150345071165440)]} 0 5
[junit4:junit4]   2> 14735 T2028 C162 P30102 /update {wt=javabin&version=2} {add=[9 (1413150345079554048)]} 0 1
[junit4:junit4]   2> 14742 T2080 C160 P32769 REQ /update {distrib.from=http://127.0.0.1:32758/solr/collection1/&update.distrib=FROMLEADER&wt=javabin&version=2} status=0 QTime=1 
[junit4:junit4]   2> 14743 T2058 C161 P32758 /update {wt=javabin&version=2} {add=[9 (1413150345083748352)]} 0 5
[junit4:junit4]   2> 14747 T2028 C162 P30102 /update {wt=javabin&version=2} {add=[10 (1413150345092136960)]} 0 1
[junit4:junit4]   2> 14755 T2066 C158 P32763 REQ /update {distrib.from=http://127.0.0.1:14075/solr/collection1/&update.distrib=FROMLEADER&wt=javabin&version=2} status=0 QTime=2 
[junit4:junit4]   2> 14755 T2044 C159 P14075 /update {wt=javabin&version=2} {add=[10 (1413150345096331264)]} 0 5
[junit4:junit4]   2> 14768 T2028 C162 P30102 /update {wt=javabin&version=2} {add=[11 (1413150345104719872)]} 0 10
[junit4:junit4]   2> 14775 T2066 C158 P32763 REQ /update {distrib.from=http://127.0.0.1:14075/solr/collection1/&update.distrib=FROMLEADER&wt=javabin&version=2} status=0 QTime=1 
[junit4:junit4]   2> 14776 T2044 C159 P14075 /update {wt=javabin&version=2} {add=[11 (1413150345118351360)]} 0 5
[junit4:junit4]   2> 14780 T2028 C162 P30102 /update {wt=javabin&version=2} {add=[12 (1413150345125691392)]} 0 2
[junit4:junit4]   2> 14790 T2066 C158 P32763 REQ /update {update.distrib=FROMLEADER&distrib.from=http://127.0.0.1:14075/solr/collection1/&wt=javabin&version=2} status=0 QTime=1 
[junit4:junit4]   2> 14790 T2047 C159 P14075 REQ /update {distrib.from=http://127.0.0.1:32758/solr/collection1/&update.distrib=TOLEADER&wt=javabin&version=2} status=0 QTime=5 
[junit4:junit4]   2> 14791 T2058 C161 P32758 /update {wt=javabin&version=2} {add=[12]} 0 9
[junit4:junit4]   2> 14795 T2028 C162 P30102 /update {wt=javabin&version=2} {add=[13 (1413150345142468608)]} 0 1
[junit4:junit4]   2> 14805 T2066 C158 P32763 REQ /update {update.distrib=FROMLEADER&distrib.from=http://127.0.0.1:14075/solr/collection1/&wt=javabin&version=2} status=0 QTime=1 
[junit4:junit4]   2> 14805 T2047 C159 P14075 REQ /update {distrib.from=http://127.0.0.1:32758/solr/collection1/&update.distrib=TOLEADER&wt=javabin&version=2} status=0 QTime=5 
[junit4:junit4]   2> 14806 T2058 C161 P32758 /update {wt=javabin&version=2} {add=[13]} 0 9
[junit4:junit4]   2> 14810 T2028 C162 P30102 /update {wt=javabin&version=2} {add=[14 (1413150345158197248)]} 0 1
[junit4:junit4]   2> 14817 T2066 C158 P32763 REQ /update {distrib.from=http://127.0.0.1:14075/solr/collection1/&update.distrib=FROMLEADER&wt=javabin&version=2} status=0 QTime=1 
[junit4:junit4]   2> 14817 T2044 C159 P14075 /update {wt=javabin&version=2} {add=[14 (1413150345162391552)]} 0 4
[junit4:junit4]   2> 14821 T2028 C162 P30102 /update {wt=javabin&version=2} {add=[15 (1413150345169731584)]} 0 1
[junit4:junit4]   2> 14832 T2066 C158 P32763 REQ /update {update.distrib=FROMLEADER&distrib.from=http://127.0.0.1:14075/solr/collection1/&wt=javabin&version=2} status=0 QTime=1 
[junit4:junit4]   2> 14833 T2047 C159 P14075 REQ /update {distrib.from=http://127.0.0.1:32758/solr/collection1/&update.distrib=TOLEADER&wt=javabin&version=2} status=0 QTime=6 
[junit4:junit4]   2> 14834 T2058 C161 P32758 /update {wt=javabin&version=2} {add=[15]} 0 10
[junit4:junit4]   2> 14837 T2028 C162 P30102 /update {wt=javabin&version=2} {add=[16 (1413150345186508800)]} 0 1
[junit4:junit4]   2> 14847 T2066 C158 P32763 REQ /update {update.distrib=FROMLEADER&distrib.from=http://127.0.0.1:14075/solr/collection1/&wt=javabin&version=2} status=0 QTime=1 
[junit4:junit4]   2> 14847 T2047 C159 P14075 REQ /update {distrib.from=http://127.0.0.1:32758/solr/collection1/&update.distrib=TOLEADER&wt=javabin&version=2} status=0 QTime=4 
[junit4:junit4]   2> 14848 T2058 C161 P32758 /update {wt=javabin&version=2} {add=[16]} 0 8
[junit4:junit4]   2> 14852 T2028 C162 P30102 /update {wt=javabin&version=2} {add=[17 (1413150345202237440)]} 0 1
[junit4:junit4]   2> 14865 T2080 C160 P32769 REQ /update {update.distrib=FROMLEADER&distrib.from=http://127.0.0.1:32758/solr/collection1/&wt=javabin&version=2} status=0 QTime=2 
[junit4:junit4]   2> 14865 T2060 C161 P32758 REQ /update {distrib.from=http://127.0.0.1:14075/solr/collection1/&update.distrib=TOLEADER&wt=javabin&version=2} status=0 QTime=7 
[junit4:junit4]   2> 14866 T2044 C159 P14075 /update {wt=javabin&version=2} {add=[17]} 0 11
[junit4:junit4]   2> 14869 T2028 C162 P30102 /update {wt=javabin&version=2} {add=[100 (1413150345220063232)]} 0 1
[junit4:junit4]   2> 14893 T2066 C158 P32763 REQ /update {distrib.from=http://127.0.0.1:14075/solr/collection1/&update.distrib=FROMLEADER&wt=javabin&version=2} status=0 QTime=10 
[junit4:junit4]   2> 14893 T2044 C159 P14075 /update {wt=javabin&version=2} {add=[100 (1413150345223208960)]} 0 22
[junit4:junit4]   2> 14897 T2028 C162 P30102 /update {wt=javabin&version=2} {add=[101 (1413150345249423360)]} 0 1
[junit4:junit4]   2> 14910 T2066 C158 P32763 REQ /update {update.distrib=FROMLEADER&distrib.from=http://127.0.0.1:14075/solr/collection1/&wt=javabin&version=2} status=0 QTime=2 
[junit4:junit4]   2> 14910 T2047 C159 P14075 REQ /update {distrib.from=http://127.0.0.1:32758/solr/collection1/&update.distrib=TOLEADER&wt=javabin&version=2} status=0 QTime=7 
[junit4:junit4]   2> 14911 T2058 C161 P32758 /update {wt=javabin&version=2} {add=[101]} 0 12
[junit4:junit4]   2> 14915 T2028 C162 P30102 /update {wt=javabin&version=2} {add=[102 (1413150345268297728)]} 0 1
[junit4:junit4]   2> 14921 T2066 C158 P32763 REQ /update {distrib.from=http://127.0.0.1:14075/solr/collection1/&update.distrib=FROMLEADER&wt=javabin&version=2} status=0 QTime=1 
[junit4:junit4]   2> 14921 T2044 C159 P14075 /update {wt=javabin&version=2} {add=[102 (1413150345271443456)]} 0 4
[junit4:junit4]   2> 14935 T2028 C162 P30102 /update {wt=javabin&version=2} {add=[103 (1413150345278783488)]} 0 11
[junit4:junit4]   2> 14945 T2080 C160 P32769 REQ /update {update.distrib=FROMLEADER&distrib.from=http://127.0.0.1:32758/solr/collection1/&wt=javabin&version=2} status=0 QTime=1 
[junit4:junit4]   2> 14946 T2060 C161 P32758 REQ /update {distrib.from=http://127.0.0.1:14075/solr/collection1/&update.distrib=TOLEADER&wt=javabin&version=2} status=0 QTime=5 
[junit4:junit4]   2> 14947 T2044 C159 P14075 /update {wt=javabin&version=2} {add=[103]} 0 9
[junit4:junit4]   2> 14951 T2028 C162 P30102 /update {wt=javabin&version=2} {add=[104 (1413150345304997888)]} 0 2
[junit4:junit4]   2> 14959 T2080 C160 P32769 REQ /update {update.distrib=FROMLEADER&distrib.from=http://127.0.0.1:32758/solr/collection1/&wt=javabin&version=2} status=0 QTime=1 
[junit4:junit4]   2> 14959 T2060 C161 P32758 REQ /update {distrib.from=http://127.0.0.1:14075/solr/collection1/&update.distrib=TOLEADER&wt=javabin&version=2} status=0 QTime=4 
[junit4:junit4]   2> 14960 T2044 C159 P14075 /update {wt=javabin&version=2} {add=[104]} 0 7
[junit4:junit4]   2> 14964 T2028 C162 P30102 /update {wt=javabin&version=2} {add=[105 (1413150345319677952)]} 0 1
[junit4:junit4]   2> 15001 T2080 C160 P32769 REQ /update {distrib.from=http://127.0.0.1:32758/solr/collection1/&update.distrib=FROMLEADER&wt=javabin&version=2} status=0 QTime=16 
[junit4:junit4]   2> 15002 T2058 C161 P32758 /update {wt=javabin&version=2} {add=[105 (1413150345323872256)]} 0 35
[junit4:junit4]   2> 15006 T2028 C162 P30102 /update {wt=javabin&version=2} {add=[106 (1413150345363718144)]} 0 1
[junit4:junit4]   2> 15015 T2080 C160 P32769 REQ /update {distrib.from=http://127.0.0.1:32758/solr/collection1/&update.distrib=FROMLEADER&wt=javabin&version=2} status=0 QTime=2 
[junit4:junit4]   2> 15015 T2058 C161 P32758 /update {wt=javabin&version=2} {add=[106 (1413150345367912448)]} 0 6
[junit4:junit4]   2> 15019 T2028 C162 P30102 /update {wt=javabin&version=2} {add=[107 (1413150345377349632)]} 0 1
[junit4:junit4]   2> 15029 T2066 C158 P32763 REQ /update {update.distrib=FROMLEADER&distrib.from=http://127.0.0.1:14075/solr/collection1/&wt=javabin&version=2} status=0 QTime=1 
[junit4:junit4]   2> 15029 T2047 C159 P14075 REQ /update {distrib.from=http://127.0.0.1:32758/solr/collection1/&update.distrib=TOLEADER&wt=javabin&version=2} status=0 QTime=4 
[junit4:junit4]   2> 15030 T2058 C161 P32758 /update {wt=javabin&version=2} {add=[107]} 0 8
[junit4:junit4]   2> 15034 T2028 C162 P30102 /update {wt=javabin&version=2} {add=[108 (1413150345393078272)]} 0 1
[junit4:junit4]   2> 15043 T2066 C158 P32763 REQ /update {update.distrib=FROMLEADER&distrib.from=http://127.0.0.1:14075/solr/collection1/&wt=javabin&version=2} status=0 QTime=1 
[junit4:junit4]   2> 15043 T2047 C159 P14075 REQ /update {distrib.from=http://127.0.0.1:32758/solr/collection1/&update.distrib=TOLEADER&wt=javabin&version=2} status=0 QTime=4 
[junit4:junit4]   2> 15044 T2058 C161 P32758 /update {wt=javabin&version=2} {add=[108]} 0 8
[junit4:junit4]   2> 15048 T2028 C162 P30102 /update {wt=javabin&version=2} {add=[109 (1413150345407758336)]} 0 1
[junit4:junit4]   2> 15056 T2066 C158 P32763 REQ /update {distrib.from=http://127.0.0.1:14075/solr/collection1/&update.distrib=FROMLEADER&wt=javabin&version=2} status=0 QTime=1 
[junit4:junit4]   2> 15057 T2044 C159 P14075 /update {wt=javabin&version=2} {add=[109 (1413150345413001216)]} 0 6
[junit4:junit4]   2> 15061 T2028 C162 P30102 /update {wt=javabin&version=2} {add=[110 (1413150345421389824)]} 0 1
[junit4:junit4]   2> 15069 T2066 C158 P32763 REQ /update {distrib.from=http://127.0.0.1:14075/solr/collection1/&update.distrib=FROMLEADER&wt=javabin&version=2} status=0 QTime=1 
[junit4:junit4]   2> 15070 T2044 C159 P14075 /update {wt=javabin&version=2} {add=[110 (1413150345425584128)]} 0 6
[junit4:junit4]   2> 15073 T2028 C162 P30102 /update {wt=javabin&version=2} {add=[111 (1413150345433972736)]} 0 1
[junit4:junit4]   2> 15080 T2066 C158 P32763 REQ /update {distrib.from=http://127.0.0.1:14075/solr/collection1/&update.distrib=FROMLEADER&wt=javabin&version=2} status=0 QTime=1 
[junit4:junit4]   2> 15081 T2044 C159 P14075 /update {wt=javabin&version=2} {add=[111 (1413150345438167040)]} 0 5
[junit4:junit4]   2> 15084 T2028 C162 P30102 /update {wt=javabin&version=2} {add=[112 (1413150345445507072)]} 0 1
[junit4:junit4]   2> 15095 T2080 C160 P32769 REQ /update {update.distrib=FROMLEADER&distrib.from=http://127.0.0.1:32758/solr/collection1/&wt=javabin&version=2} status=0 QTime=1 
[junit4:junit4]   2> 15095 T2060 C161 P32758 REQ /update {distrib.from=http://127.0.0.1:14075/solr/collection1/&update.distrib=TOLEADER&wt=javabin&version=2} status=0 QTime=4 
[junit4:junit4]   2> 15096 T2044 C159 P14075 /update {wt=javabin&version=2} {add=[112]} 0 8
[junit4:junit4]   2> 15109 T2028 C162 P30102 /update {wt=javabin&version=2} {add=[113 (1413150345462284288)]} 0 10
[junit4:junit4]   2> 15119 T2066 C158 P32763 REQ /update {update.distrib=FROMLEADER&distrib.from=http://127.0.0.1:14075/solr/collection1/&wt=javabin&version=2} status=0 QTime=1 
[junit4:junit4]   2> 15119 T2047 C159 P14075 REQ /update {distrib.from=http://127.0.0.1:32758/solr/collection1/&update.distrib=TOLEADER&wt=javabin&version=2} status=0 QTime=4 
[junit4:junit4]   2> 15120 T2058 C161 P32758 /update {wt=javabin&version=2} {add=[113]} 0 8
[junit4:junit4]   2> 15125 T2028 C162 P30102 /update {wt=javabin&version=2} {add=[114 (1413150345487450112)]} 0 2
[junit4:junit4]   2> 15131 T2066 C158 P32763 REQ /update {distrib.from=http://127.0.0.1:14075/solr/collection1/&update.distrib=FROMLEADER&wt=javabin&version=2} status=0 QTime=1 
[junit4:junit4]   2> 15131 T2044 C159 P14075 /update {wt=javabin&version=2} {add=[114 (1413150345491644416)]} 0 4
[junit4:junit4]   2> 15135 T2028 C162 P30102 /update {wt=javabin&version=2} {add=[115 (1413150345498984448)]} 0 1
[junit4:junit4]   2> 15143 T2080 C160 P32769 REQ /update {update.distrib=FROMLEADER&distrib.from=http://127.0.0.1:32758/solr/collection1/&wt=javabin&version=2} status=0 QTime=1 
[junit4:junit4]   2> 15143 T2060 C161 P32758 REQ /update {distrib.from=http://127.0.0.1:14075/solr/collection1/&update.distrib=TOLEADER&wt=javabin&version=2} status=0 QTime=4 
[junit4:junit4]   2> 15144 T2044 C159 P14075 /update {wt=javabin&version=2} {add=[115]} 0 7
[junit4:junit4]   2> 15147 T2028 C162 P30102 /update {wt=javabin&version=2} {add=[116 (1413150345511567360)]} 0 1
[junit4:junit4]   2> 15156 T2080 C160 P32769 REQ /update {update.distrib=FROMLEADER&distrib.from=http://127.0.0.1:32758/solr/collection1/&wt=javabin&version=2} status=0 QTime=1 
[junit4:junit4]   2> 15156 T2060 C161 P32758 REQ /update {distrib.from=http://127.0.0.1:14075/solr/collection1/&update.distrib=TOLEADER&wt=javabin&version=2} status=0 QTime=4 
[junit4:junit4]   2> 15156 T2044 C159 P14075 /update {wt=javabin&version=2} {add=[116]} 0 6
[junit4:junit4]   2> 15160 T2028 C162 P30102 /update {wt=javabin&version=2} {add=[117 (1413150345525198848)]} 0 1
[junit4:junit4]   2> 15169 T2080 C160 P32769 REQ /update {update.distrib=FROMLEADER&distrib.from=http://127.0.0.1:32758/solr/collection1/&wt=javabin&version=2} status=0 QTime=1 
[junit4:junit4]   2> 15169 T2060 C161 P32758 REQ /update {distrib.from=http://127.0.0.1:14075/solr/collection1/&update.distrib=TOLEADER&wt=javabin&version=2} status=0 QTime=4 
[junit4:junit4]   2> 15170 T2044 C159 P14075 /update {wt=javabin&version=2} {add=[117]} 0 7
[junit4:junit4]   2> 15173 T2028 C162 P30102 /update {wt=javabin&version=2} {add=[118 (1413150345538830336)]} 0 1
[junit4:junit4]   2> 15200 T2066 C158 P32763 REQ /update {update.distrib=FROMLEADER&distrib.from=http://127.0.0.1:14075/solr/collection1/&wt=javabin&version=2} status=0 QTime=10 
[junit4:junit4]   2> 15200 T2047 C159 P14075 REQ /update {distrib.from=http://127.0.0.1:32758/solr/collection1/&update.distrib=TOLEADER&wt=javabin&version=2} status=0 QTime=22 
[junit4:junit4]   2> 15201 T2058 C161 P32758 /update {wt=javabin&version=2} {add=[118]} 0 25
[junit4:junit4]   2> 15205 T2028 C162 P30102 /update {wt=javabin&version=2} {add=[119 (1413150345572384768)]} 0 1
[junit4:junit4]   2> 15212 T2080 C160 P32769 REQ /update {distrib.from=http://127.0.0.1:32758/solr/collection1/&update.distrib=FROMLEADER&wt=javabin&version=2} status=0 QTime=1 
[junit4:junit4]   2> 15213 T2058 C161 P32758 /update {wt=javabin&version=2} {add=[119 (1413150345576579072)]} 0 5
[junit4:junit4]   2> 15216 T2028 C162 P30102 /update {wt=javabin&version=2} {add=[120 (1413150345583919104)]} 0 1
[junit4:junit4]   2> 15224 T2080 C160 P32769 REQ /update {update.distrib=FROMLEADER&distrib.from=http://127.0.0.1:32758/solr/collection1/&wt=javabin&version=2} status=0 QTime=1 
[junit4:junit4]   2> 15225 T2060 C161 P32758 REQ /update {distrib.from=http://127.0.0.1:14075/solr/collection1/&update.distrib=TOLEADER&wt=javabin&version=2} status=0 QTime=5 
[junit4:junit4]   2> 15225 T2044 C159 P14075 /update {wt=javabin&version=2} {add=[120]} 0 7
[junit4:junit4]   2> 15229 T2028 C162 P30102 /update {wt=javabin&version=2} {add=[121 (1413150345597550592)]} 0 1
[junit4:junit4]   2> 15237 T2080 C160 P32769 REQ /update {update.distrib=FROMLEADER&distrib.from=http://127.0.0.1:32758/solr/collection1/&wt=javabin&version=2} status=0 QTime=1 
[junit4:junit4]   2> 15238 T2060 C161 P32758 REQ /update {distrib.from=http://127.0.0.1:14075/solr/collection1/&update.distrib=TOLEADER&wt=javabin&version=2} status=0 QTime=5 
[junit4:junit4]   2> 15238 T2044 C159 P14075 /update {wt=javabin&version=2} {add=[121]} 0 7
[junit4:junit4]   2> 15242 T2028 C162 P30102 /update {wt=javabin&version=2} {add=[122 (1413150345611182080)]} 0 1
[junit4:junit4]   2> 15250 T2066 C158 P32763 REQ /update {distrib.from=http://127.0.0.1:14075/solr/collection1/&update.distrib=FROMLEADER&wt=javabin&version=2} status=0 QTime=2 
[junit4:junit4]   2> 15250 T2044 C159 P14075 /update {wt=javabin&version=2} {add=[122 (1413150345614327808)]} 0 6
[junit4:junit4]   2> 15264 T2028 C162 P30102 /update {wt=javabin&version=2} {add=[123 (1413150345623764992)]} 0 11
[junit4:junit4]   2> 15275 T2066 C158 P32763 REQ /update {update.distrib=FROMLEADER&distrib.from=http://127.0.0.1:14075/solr/collection1/&wt=javabin&version=2} status=0 QTime=1 
[junit4:junit4]   2> 15276 T2047 C159 P14075 REQ /update {distrib.from=http://127.0.0.1:32758/solr/collection1/&update.distrib=TOLEADER&wt=javabin&version=2} status=0 QTime=6 
[junit4:junit4]   2> 15276 T2058 C161 P32758 /update {wt=javabin&version=2} {add=[123]} 0 9
[junit4:junit4]   2> 15282 T2028 C162 P30102 /update {wt=javabin&version=2} {add=[124 (1413150345651027968)]} 0 3
[junit4:junit4]   2> 15293 T2066 C158 P32763 REQ /update {update.distrib=FROMLEADER&distrib.from=http://127.0.0.1:14075/solr/collection1/&wt=javabin&version=2} status=0 QTime=1 
[junit4:junit4]   2> 15294 T2047 C159 P14075 REQ /update {distrib.from=http://127.0.0.1:32758/solr/collection1/&update.distrib=TOLEADER&wt=javabin&version=2} status=0 QTime=7 
[junit4:junit4]   2> 15294 T2058 C161 P32758 /update {wt=javabin&version=2} {add=[124]} 0 10
[junit4:junit4]   2> 15298 T2028 C162 P30102 /update {wt=javabin&version=2} {add=[125 (1413150345669902336)]} 0 1
[junit4:junit4]   2> 15305 T2066 C158 P32763 REQ /update {distrib.from=http://127.0.0.1:14075/solr/collection1/&update.distrib=FROMLEADER&wt=javabin&version=2} status=0 QTime=1 
[junit4:junit4]   2> 15306 T2044 C159 P14075 /update {wt=javabin&version=2} {add=[125 (1413150345674096640)]} 0 5
[junit4:junit4]   2> 15310 T2028 C162 P30102 /update {wt=javabin&version=2} {add=[126 (1413150345682485248)]} 0 1
[junit4:junit4]   2> 15318 T2080 C160 P32769 REQ /update {distrib.from=http://127.0.0.1:32758/solr/collection1/&update.distrib=FROMLEADER&wt=javabin&version=2} status=0 QTime=2 
[junit4:junit4]   2> 15318 T2058 C161 P32758 /update {wt=javabin&version=2} {add=[126 (1413150345686679552)]} 0 5
[junit4:junit4]   2> 15322 T2028 C162 P30102 /update {wt=javabin&version=2} {add=[127 (1413150345695068160)]} 0 1
[junit4:junit4]   2> 15359 T2080 C160 P32769 REQ /update {distrib.from=http://127.0.0.1:32758/solr/collection1/&update.distrib=FROMLEADER&wt=javabin&version=2} status=0 QTime=16 
[junit4:junit4]   2> 15360 T2058 C161 P32758 /update {wt=javabin&version=2} {add=[127 (1413150345699262464)]} 0 35
[junit4:junit4]   2> 15364 T2028 C162 P30102 /update {wt=javabin&version=2} {add=[128 (1413150345739108352)]} 0 1
[junit4:junit4]   2> 15374 T2080 C160 P32769 REQ /update {distrib.from=http://127.0.0.1:32758/solr/collection1/&update.distrib=FROMLEADER&wt=javabin&version=2} status=0 QTime=3 
[junit4:junit4]   2> 15375 T2058 C161 P32758 /update {wt=javabin&version=2} {add=[128 (1413150345743302656)]} 0 8
[junit4:junit4]   2> 15379 T2028 C162 P30102 /update {wt=javabin&version=2} {add=[129 (1413150345754836992)]} 0 2
[junit4:junit4]   2> 15385 T2066 C158 P32763 REQ /update {distrib.from=http://127.0.0.1:14075/solr/collection1/&update.distrib=FROMLEADER&wt=javabin&version=2} status=0 QTime=1 
[junit4:junit4]   2> 15386 T2044 C159 P14075 /update {wt=javabin&version=2} {add=[129 (1413150345757982720)]} 0 5
[junit4:junit4]   2> 15389 T2028 C162 P30102 /update {wt=javabin&version=2} {add=[130 (1413150345765322752)]} 0 1
[junit4:junit4]   2> 15399 T2080 C160 P32769 REQ /update {update.distrib=FROMLEADER&distrib.from=http://127.0.0.1:32758/solr/collection1/&wt=javabin&version=2} status=0 QTime=1 
[junit4:junit4]   2> 15400 T2060 C161 P32758 REQ /update {distrib.from=http://127.0.0.1:14075/solr/collection1/&update.distrib=TOLEADER&wt=javabin&version=2} status=0 QTime=5 
[junit4:junit4]   2> 15401 T2044 C159 P14075 /update {wt=javabin&version=2} {add=[130]} 0 9
[junit4:junit4]   2> 15404 T2028 C162 P30102 /update {wt=javabin&version=2} {add=[131 (1413150345781051392)]} 0 1
[junit4:junit4]   2> 15414 T2080 C160 P32769 REQ /update {update.distrib=FROMLEADER&distrib.from=http://127.0.0.1:32758/solr/collection1/&wt=javabin&version=2} status=0 QTime=1 
[junit4:junit4]   2> 15418 T2060 C161 P32758 REQ /update {distrib.from=http://127.0.0.1:14075/solr/collection1/&update.distrib=TOLEADER&wt=javabin&version=2} status=0 QTime=8 
[junit4:junit4]   2> 15419 T2044 C159 P14075 /update {wt=javabin&version=2} {add=[131]} 0 12
[junit4:junit4]   2> 15423 T2028 C162 P30102 /update {wt=javabin&version=2} {add=[132 (1413150345800974336)]} 0 1
[junit4:junit4]   2> 15430 T2066 C158 P32763 REQ /update {distrib.from=http://127.0.0.1:14075/solr/collection1/&update.distrib=FROMLEADER&wt=javabin&version=2} status=0 QTime=1 
[junit4:junit4]   2> 15430 T2044 C159 P14075 /update {wt=javabin&version=2} {add=[132 (1413150345805168640)]} 0 4
[junit4:junit4]   2> 15446 T2028 C162 P30102 /update {wt=javabin&version=2} {add=[133 (1413150345812508672)]} 0 13
[junit4:junit4]   2> 15453 T2066 C158 P32763 REQ /update {distrib.from=http://127.0.0.1:14075/solr/collection1/&update.distrib=FROMLEADER&wt=javabin&version=2} status=0 QTime=1 
[junit4:junit4]   2> 15453 T2044 C159 P14075 /update {wt=javabin&version=2} {add=[133 (1413150345829285888)]} 0 4
[junit4:junit4]   2> 15458 T2028 C162 P30102 /update {wt=javabin&version=2} {add=[134 (1413150345836625920)]} 0 2
[junit4:junit4]   2> 15466 T2080 C160 P32769 REQ /update {update.distrib=FROMLEADER&distrib.from=http://127.0.0.1:32758/solr/collection1/&wt=javabin&version=2} status=0 QTime=1 
[junit4:junit4]   2> 15466 T2060 C161 P32758 REQ /update {distrib.from=http://127.0.0.1:14075/solr/collection1/&update.distrib=TOLEADER&wt=javabin&version=2} status=0 QTime=4 
[junit4:junit4]   2> 15467 T2044 C159 P14075 /update {wt=javabin&version=2} {add=[134]} 0 7
[junit4:junit4]   2> 15471 T2028 C162 P30102 /update {wt=javabin&version=2} {add=[135 (1413150345851305984)]} 0 1
[junit4:junit4]   2> 15484 T2066 C158 P32763 REQ /update {update.distrib=FROMLEADER&distrib.from=http://127.0.0.1:14075/solr/collection1/&wt=javabin&version=2} status=0 QTime=1 
[junit4:junit4]   2> 15485 T2047 C159 P14075 REQ /update {distrib.from=http://127.0.0.1:32758/solr/collection1/&update.distrib=TOLEADER&wt=javabin&version=2} status=0 QTime=5 
[junit4:junit4]   2> 15486 T2058 C161 P32758 /update {wt=javabin&version=2} {add=[135]} 0 8
[junit4:junit4]   2> 15489 T2028 C162 P30102 /update {wt=javabin&version=2} {add=[136 (1413150345870180352)]} 0 1
[junit4:junit4]   2> 15496 T2080 C160 P32769 REQ /update {distrib.from=http://127.0.0.1:32758/solr/collection1/&update.distrib=FROMLEADER&wt=javabin&version=2} status=0 QTime=1 
[junit4:junit4]   2> 15496 T2058 C161 P32758 /update {wt=javabin&version=2} {add=[136 (1413150345874374656)]} 0 4
[junit4:junit4]   2> 15500 T2028 C162 P30102 /update {wt=javabin&version=2} {add=[137 (1413150345881714688)]} 0 1
[junit4:junit4]   2> 15507 T2080 C160 P32769 REQ /update {distrib.from=http://127.0.0.1:32758/solr/collection1/&update.distrib=FROMLEADER&wt=javabin&version=2} status=0 QTime=1 
[junit4:junit4]   2> 15507 T2058 C161 P32758 /update {wt=javabin&version=2} {add=[137 (1413150345885908992)]} 0 4
[junit4:junit4]   2> 15511 T2028 C162 P30102 /update {wt=javabin&version=2} {add=[138 (1413150345893249024)]} 0 1
[junit4:junit4]   2> 15518 T2066 C158 P32763 REQ /update {distrib.from=http://127.0.0.1:14075/solr/collection1/&update.distrib=FROMLEADER&wt=javabin&version=2} status=0 QTime=1 
[junit4:junit4]   2> 15519 T2044 C159 P14075 /update {wt=javabin&version=2} {add=[138 (1413150345897443328)]} 0 5
[junit4:junit4]   2> 15523 T2028 C162 P30102 /update {wt=javabin&version=2} {add=[139 (1413150345905831936)]} 0 1
[junit4:junit4]   2> 15530 T2080 C160 P32769 REQ /update {distrib.from=http://127.0.0.1:32758/solr/collection1/&update.distrib=FROMLEADER&wt=javabin&version=2} status=0 QTime=1 
[junit4:junit4]   2> 15530 T2058 C161 P32758 /update {wt=javabin&version=2} {add=[139 (1413150345910026240)]} 0 4
[junit4:junit4]   2> 15534 T2028 C162 P30102 /update {wt=javabin&version=2} {add=[140 (1413150345917366272)]} 0 1
[junit4:junit4]   2> 15541 T2080 C160 P32769 REQ /update {distrib.from=http://127.0.0.1:32758/solr/collection1/&update.distrib=FROMLEADER&wt=javabin&version=2} status=0 QTime=1 
[junit4:junit4]   2> 15541 T2058 C161 P32758 /update {wt=javabin&version=2} {add=[140 (1413150345921560576)]} 0 4
[junit4:junit4]   2> 15545 T2028 C162 P30102 /update {wt=javabin&version=2} {add=[141 (1413150345928900608)]} 0 1
[junit4:junit4]   2> 15554 T2080 C160 P32769 REQ /update {update.distrib=FROMLEADER&distrib.from=http://127.0.0.1:32758/solr/collection1/&wt=javabin&version=2} status=0 QTime=1 
[junit4:junit4]   2> 15554 T2060 C161 P32758 REQ /update {distrib.from=http://127.0.0.1:14075/solr/collection1/&update.distrib=TOLEADER&wt=javabin&version=2} status=0 QTime=4 
[junit4:junit4]   2> 15555 T2044 C159 P14075 /update {wt=javabin&version=2} {add=[141]} 0 7
[junit4:junit4]   2> 15559 T2028 C162 P30102 /update {wt=javabin&version=2} {add=[142 (1413150345943580672)]} 0 1
[junit4:junit4]   2> 15588 T2080 C160 P32769 REQ /update {distrib.from=http://127.0.0.1:32758/solr/collection1/&update.distrib=FROMLEADER&wt=javabin&version=2} status=0 QTime=12 
[junit4:junit4]   2> 15588 T2058 C161 P32758 /update {wt=javabin&version=2} {add=[142 (1413150345947774976)]} 0 26
[junit4:junit4]   2> 15607 T2028 C162 P30102 /update {wt=javabin&version=2} {add=[143 (1413150345979232256)]} 0 16
[junit4:junit4]   2> 15620 T2080 C160 P32769 REQ /update {update.distrib=FROMLEADER&distrib.from=http://127.0.0.1:32758/solr/collection1/&wt=javabin&version=2} status=0 QTime=2 
[junit4:junit4]   2> 15620 T2060 C161 P32758 REQ /update {distrib.from=http://127.0.0.1:14075/solr/collection1/&update.distrib=TOLEADER&wt=javabin&version=2} status=0 QTime=8 
[junit4:junit4]   2> 15621 T2044 C159 P14075 /update {wt=javabin&version=2} {add=[143]} 0 11
[junit4:junit4]   2> 15626 T2028 C162 P30102 /update {wt=javabin&version=2} {add=[144 (1413150346012786688)]} 0 2
[junit4:junit4]   2> 15633 T2080 C160 P32769 REQ /update {distrib.from=http://127.0.0.1:32758/solr/collection1/&update.distrib=FROMLEADER&wt=javabin&version=2} status=0 QTime=1 
[junit4:junit4]   2> 15633 T2058 C161 P32758 /update {wt=javabin&version=2} {add=[144 (1413150346018029568)]} 0 4
[junit4:junit4]   2> 15637 T2028 C162 P30102 /update {wt=javabin&version=2} {add=[145 (1413150346025369600)]} 0 1
[junit4:junit4]   2> 15644 T2080 C160 P32769 REQ /update {distrib.from=http://127.0.0.1:32758/solr/collection1/&update.distrib=FROMLEADER&wt=javabin&version=2} status=0 QTime=1 
[junit4:junit4]   2> 15644 T2058 C161 P32758 /update {wt=javabin&version=2} {add=[145 (1413150346029563904)]} 0 4
[junit4:junit4]   2> 15648 T2028 C162 P30102 /update {wt=javabin&version=2} {add=[146 (1413150346036903936)]} 0 1
[junit4:junit4]   2> 15679 T2066 C158 P32763 REQ /update {distrib.from=http://127.0.0.1:14075/solr/collection1/&update.distrib=FROMLEADER&wt=javabin&version=2} status=0 QTime=14 
[junit4:junit4]   2> 15680 T2044 C159 P14075 /update {wt=javabin&version=2} {add=[146 (1413150346041098240)]} 0 29
[junit4:junit4]   2> 15684 T2028 C162 P30102 /update {wt=javabin&version=2} {add=[147 (1413150346074652672)]} 0 1
[junit4:junit4]   2> 15691 T2080 C160 P32769 REQ /update {distrib.from=http://127.0.0.1:32758/solr/collection1/&update.distrib=FROMLEADER&wt=javabin&version=2} status=0 QTime=1 
[junit4:junit4]   2> 15691 T2058 C161 P32758 /update {wt=javabin&version=2} {add=[147 (1413150346078846976)]} 0 4
[junit4:junit4]   2> 15695 T2028 C162 P30102 /update {wt=javabin&version=2} {add=[148 (1413150346086187008)]} 0 1
[junit4:junit4]   2> 15706 T2066 C158 P32763 REQ /update {update.distrib=FROMLEADER&distrib.from=http://127.0.0.1:14075/solr/collection1/&wt=javabin&version=2} status=0 QTime=2 
[junit4:junit4]   2> 15707 T2047 C159 P14075 REQ /update {distrib.from=http://127.0.0.1:32758/solr/collection1/&update.distrib=TOLEADER&wt=javabin&version=2} status=0 QTime=7 
[junit4:junit4]   2> 15707 T2058 C161 P32758 /update {wt=javabin&version=2} {add=[148]} 0 9
[junit4:junit4]   2> 15711 T2028 C162 P30102 /update {wt=javabin&version=2} {add=[149 (1413150346102964224)]} 0 1
[junit4:junit4]   2> 15720 T2080 C160 P32769 REQ /update {update.distrib=FROMLEADER&distrib.from=http://127.0.0.1:32758/solr/collection1/&wt=javabin&version=2} status=0 QTime=1 
[junit4:junit4]   2> 15720 T2060 C161 P32758 REQ /update {distrib.from=http://127.0.0.1:14075/solr/collection1/&update.distrib=TOLEADER&wt=javabin&version=2} status=0 QTime=4 
[junit4:junit4]   2> 15721 T2044 C159 P14075 /update {wt=javabin&version=2} {add=[149]} 0 7
[junit4:junit4]   2> 15721 T2016 oasc.AbstractDistribZkTestBase.waitForRecoveriesToFinish Wait for recoveries to finish - collection: collection1 failOnTimeout:true timeout (sec):1440
[junit4:junit4]   2> 15722 T2016 oascc.ZkStateReader.updateClusterState Updating cloud state from ZooKeeper... 
[junit4:junit4]   2> 15725 T2028 C162 P30102 oasu.DirectUpdateHandler2.commit start commit{flags=0,_version_=0,optimize=false,openSearcher=true,waitSearcher=true,expungeDeletes=false,softCommit=false}
[junit4:junit4]   2> 16315 T2028 C162 P30102 oasc.SolrDeletionPolicy.onCommit SolrDeletionPolicy.onCommit: commits:num=2
[junit4:junit4]   2> 		commit{dir=NRTCachingDirectory(org.apache.lucene.store.NIOFSDirectory@/usr/home/hudson/hudson-slave/workspace/Lucene-Solr-Tests-trunk-Java6/solr/build/solr-core/test/J0/org.apache.solr.cloud.BasicDistributedZk2Test-1347685174604/control/data/index lockFactory=org.apache.lucene.store.NativeFSLockFactory@5c766625; maxCacheMB=48.0 maxMergeSizeMB=4.0),segFN=segments_2,generation=2,filenames=[_0_MockSep_0.pos, _0_MockVariableIntBlock_0.doc, _0_TestBloomFilteredLucene40Postings_0.prx, _0_MockVariableIntBlock_0.skp, _0_Pulsing40_0.prx, _0_Pulsing40_0.frq, _0_MockVariableIntBlock_0.pyl, _0_MockVariableIntBlock_0.tib, _0_MockSep_0.skp, _0_MockVariableIntBlock_0.pos, _0_Pulsing40_0.tip, _0_TestBloomFilteredLucene40Postings_0.frq, _0_MockSep_0.doc, _0.si, _0_MockVariableIntBlock_0.tii, _0_TestBloomFilteredLucene40Postings_0.tim, _0_TestBloomFilteredLucene40Postings_0.tip, _0_TestBloomFilteredLucene40Postings_0.blm, _0.fnm, _0_Pulsing40_0.tim, _0_nrm.cfs, _0_MockSep_0.tib, _0_nrm.cfe, _0_MockVariableIntBlock_0.frq, _0_MockSep_0.frq, segments_2, _0.fdx, _0_MockSep_0.tii, _0_MockSep_0.pyl, _0.fdt]
[junit4:junit4]   2> 		commit{dir=NRTCachingDirectory(org.apache.lucene.store.NIOFSDirectory@/usr/home/hudson/hudson-slave/workspace/Lucene-Solr-Tests-trunk-Java6/solr/build/solr-core/test/J0/org.apache.solr.cloud.BasicDistributedZk2Test-1347685174604/control/data/index lockFactory=org.apache.lucene.store.NativeFSLockFactory@5c766625; maxCacheMB=48.0 maxMergeSizeMB=4.0),segFN=segments_3,generation=3,filenames=[_5_nrm.cfe, _3_MockVariableIntBlock_0.frq, _4_MockSep_0.skp, _3.fdt, _4_MockVariableIntBlock_0.tii, _2_MockSep_0.doc, _7.fnm, _6_MockSep_0.doc, _5_MockSep_0.skp, _5_Pulsing40_0.tip, _3_TestBloomFilteredLucene40Postings_0.frq, _6_MockSep_0.frq, _7_MockSep_0.tib, _5_Pulsing40_0.tim, _6_MockVariableIntBlock_0.tii, _1_MockSep_0.pyl, _3_TestBloomFilteredLucene40Postings_0.tim, _0_TestBloomFilteredLucene40Postings_0.blm, _6_MockVariableIntBlock_0.tib, _0_Pulsing40_0.tim, _7_MockSep_0.tii, _1_MockSep_0.tib, _1_MockVariableIntBlock_0.tii, _3_TestBloomFilteredLucene40Postings_0.tip, _5_MockSep_0.doc, _1_MockSep_0.tii, _1_MockVariableIntBlock_0.tib, _5_TestBloomFilteredLucene40Postings_0.frq, _1.fdx, _4_MockVariableIntBlock_0.tib, _1.fdt, _3_MockSep_0.pos, _5_nrm.cfs, _0_MockVariableIntBlock_0.frq, _6.fdt, _3_Pulsing40_0.frq, _2.si, _1_MockVariableIntBlock_0.skp, _2_Pulsing40_0.tim, _7_MockVariableIntBlock_0.pos, _0_MockVariableIntBlock_0.doc, _6_MockSep_0.pyl, _2_MockSep_0.skp, _2_Pulsing40_0.tip, _6.fdx, _1_MockVariableIntBlock_0.pyl, _5_MockSep_0.tii, _3_MockVariableIntBlock_0.tii, _2_nrm.cfe, _5_Pulsing40_0.frq, _0_Pulsing40_0.tip, _0_MockVariableIntBlock_0.pos, _7_MockVariableIntBlock_0.skp, _2_nrm.cfs, _2_TestBloomFilteredLucene40Postings_0.frq, _4_TestBloomFilteredLucene40Postings_0.blm, _4_MockVariableIntBlock_0.frq, _2.fnm, _5_MockVariableIntBlock_0.frq, _7_Pulsing40_0.tim, _3.fdx, _4_Pulsing40_0.tip, _2_MockSep_0.pyl, _4_Pulsing40_0.tim, _1.si, _5_MockSep_0.tib, _4_TestBloomFilteredLucene40Postings_0.tim, _3_MockSep_0.skp, _4_TestBloomFilteredLucene40Postings_0.tip, _7_Pulsing40_0.tip, _3_MockVariableIntBlock_0.pos, _3_MockSep_0.doc, _3_nrm.cfe, _5_MockVariableInt

[...truncated too long message...]

.apache.solr.core.JmxMonitoredMap.clear(JmxMonitoredMap.java:116)
[junit4:junit4]   2> 	at org.apache.solr.core.SolrCore.close(SolrCore.java:864)
[junit4:junit4]   2> 	at org.apache.solr.cloud.ShardLeaderElectionContext.runLeaderProcess(ElectionContext.java:213)
[junit4:junit4]   2> 	at org.apache.solr.cloud.LeaderElector.runIamLeaderProcess(LeaderElector.java:158)
[junit4:junit4]   2> 	at org.apache.solr.cloud.LeaderElector.checkIfIamLeader(LeaderElector.java:102)
[junit4:junit4]   2> 	at org.apache.solr.cloud.LeaderElector.access$000(LeaderElector.java:56)
[junit4:junit4]   2> 	at org.apache.solr.cloud.LeaderElector$1.process(LeaderElector.java:131)
[junit4:junit4]   2> 	at org.apache.zookeeper.ClientCnxn$EventThread.processEvent(ClientCnxn.java:526)
[junit4:junit4]   2> 	at org.apache.zookeeper.ClientCnxn$EventThread.run(ClientCnxn.java:502)
[junit4:junit4]   2> 
[junit4:junit4]   2> 184578 T2088 oasc.SolrCore.closeSearcher [collection1] Closing main searcher on request.
[junit4:junit4]   2> 184582 T2088 oasu.DirectUpdateHandler2.close closing DirectUpdateHandler2{commits=5,autocommits=0,soft autocommits=0,optimizes=0,rollbacks=0,expungeDeletes=0,docsPending=0,adds=0,deletesById=0,deletesByQuery=0,errors=0,cumulative_adds=35,cumulative_deletesById=0,cumulative_deletesByQuery=0,cumulative_errors=0}
[junit4:junit4]   2> 184583 T2088 oasu.DefaultSolrCoreState.decref SolrCoreState ref count has reached 0 - closing IndexWriter
[junit4:junit4]   2> 184585 T2088 oasu.DefaultSolrCoreState.decref Closing SolrCoreState - canceling any ongoing recovery
[junit4:junit4]   2> 184586 T2088 oasc.LeaderElector$1.process WARNING  org.apache.zookeeper.KeeperException$SessionExpiredException: KeeperErrorCode = Session expired for /collections/collection1/leader_elect/shard2/election/88321895603372038-127.0.0.1:32769_solr_collection1-n_0000000004
[junit4:junit4]   2> 	at org.apache.zookeeper.KeeperException.create(KeeperException.java:118)
[junit4:junit4]   2> 	at org.apache.zookeeper.KeeperException.create(KeeperException.java:42)
[junit4:junit4]   2> 	at org.apache.zookeeper.ZooKeeper.delete(ZooKeeper.java:734)
[junit4:junit4]   2> 	at org.apache.solr.common.cloud.SolrZkClient$2.execute(SolrZkClient.java:178)
[junit4:junit4]   2> 	at org.apache.solr.common.cloud.SolrZkClient$2.execute(SolrZkClient.java:175)
[junit4:junit4]   2> 	at org.apache.solr.common.cloud.ZkCmdExecutor.retryOperation(ZkCmdExecutor.java:67)
[junit4:junit4]   2> 	at org.apache.solr.common.cloud.SolrZkClient.delete(SolrZkClient.java:175)
[junit4:junit4]   2> 	at org.apache.solr.cloud.ElectionContext.cancelElection(ElectionContext.java:60)
[junit4:junit4]   2> 	at org.apache.solr.cloud.ShardLeaderElectionContext.runLeaderProcess(ElectionContext.java:151)
[junit4:junit4]   2> 	at org.apache.solr.cloud.LeaderElector.runIamLeaderProcess(LeaderElector.java:158)
[junit4:junit4]   2> 	at org.apache.solr.cloud.LeaderElector.checkIfIamLeader(LeaderElector.java:102)
[junit4:junit4]   2> 	at org.apache.solr.cloud.LeaderElector.joinElection(LeaderElector.java:275)
[junit4:junit4]   2> 	at org.apache.solr.cloud.ShardLeaderElectionContext.rejoinLeaderElection(ElectionContext.java:326)
[junit4:junit4]   2> 	at org.apache.solr.cloud.ShardLeaderElectionContext.runLeaderProcess(ElectionContext.java:204)
[junit4:junit4]   2> 	at org.apache.solr.cloud.LeaderElector.runIamLeaderProcess(LeaderElector.java:158)
[junit4:junit4]   2> 	at org.apache.solr.cloud.LeaderElector.checkIfIamLeader(LeaderElector.java:102)
[junit4:junit4]   2> 	at org.apache.solr.cloud.LeaderElector.access$000(LeaderElector.java:56)
[junit4:junit4]   2> 	at org.apache.solr.cloud.LeaderElector$1.process(LeaderElector.java:131)
[junit4:junit4]   2> 	at org.apache.zookeeper.ClientCnxn$EventThread.processEvent(ClientCnxn.java:526)
[junit4:junit4]   2> 	at org.apache.zookeeper.ClientCnxn$EventThread.run(ClientCnxn.java:502)
[junit4:junit4]   2> 
[junit4:junit4]   2> 184586 T2088 oascc.ZkStateReader$3.process Updating live nodes
[junit4:junit4]   2> 184586 T2088 oascc.ZkStateReader$3.process WARNING ZooKeeper watch triggered, but Solr cannot talk to ZK
[junit4:junit4]   2> 184587 T2088 oascc.ZkStateReader$2.process A cluster state change has occurred - updating...
[junit4:junit4]   2> 184587 T2088 oascc.ZkStateReader$2.process WARNING ZooKeeper watch triggered, but Solr cannot talk to ZK
[junit4:junit4]   2> 184587 T2088 oascc.ConnectionManager.process Watcher org.apache.solr.common.cloud.ConnectionManager@7c4a7d6f name:ZooKeeperConnection Watcher:127.0.0.1:30056/solr got event WatchedEvent state:Disconnected type:None path:null path:null type:None
[junit4:junit4]   2> 184587 T2088 oascc.ConnectionManager.process Client->ZooKeeper status change trigger but we are already closed
[junit4:junit4]   2> 184587 T2088 oaz.ClientCnxn$EventThread.run EventThread shut down
[junit4:junit4]   2> NOTE: test params are: codec=Lucene40: {n_f1=Pulsing40(freqCutoff=6 minBlockSize=7 maxBlockSize=24), foo_b=PostingsFormat(name=MockSep), foo_d=MockVariableIntBlock(baseBlockSize=76), foo_f=PostingsFormat(name=MockSep), n_tl1=Pulsing40(freqCutoff=6 minBlockSize=7 maxBlockSize=24), n_d1=PostingsFormat(name=TestBloomFilteredLucene40Postings), rnd_b=MockVariableIntBlock(baseBlockSize=76), intDefault=PostingsFormat(name=TestBloomFilteredLucene40Postings), n_td1=Pulsing40(freqCutoff=6 minBlockSize=7 maxBlockSize=24), id=MockVariableIntBlock(baseBlockSize=76), timestamp=PostingsFormat(name=TestBloomFilteredLucene40Postings), range_facet_sl=PostingsFormat(name=MockSep), range_facet_si=Pulsing40(freqCutoff=6 minBlockSize=7 maxBlockSize=24), oddField_s=PostingsFormat(name=MockSep), multiDefault=Pulsing40(freqCutoff=6 minBlockSize=7 maxBlockSize=24), n_tf1=PostingsFormat(name=TestBloomFilteredLucene40Postings), n_dt1=Pulsing40(freqCutoff=6 minBlockSize=7 maxBlockSize=24), n_ti1=MockVariableIntBlock(baseBlockSize=76), range_facet_l=PostingsFormat(name=TestBloomFilteredLucene40Postings), text=PostingsFormat(name=MockSep), _version_=PostingsFormat(name=TestBloomFilteredLucene40Postings), SubjectTerms_mfacet=PostingsFormat(name=TestBloomFilteredLucene40Postings), a_t=PostingsFormat(name=TestBloomFilteredLucene40Postings), n_tdt1=PostingsFormat(name=TestBloomFilteredLucene40Postings), other_tl1=PostingsFormat(name=TestBloomFilteredLucene40Postings), n_l1=PostingsFormat(name=TestBloomFilteredLucene40Postings), a_si=Pulsing40(freqCutoff=6 minBlockSize=7 maxBlockSize=24)}, sim=RandomSimilarityProvider(queryNorm=true,coord=yes): {}, locale=ko_KR, timezone=Europe/Sofia
[junit4:junit4]   2> NOTE: FreeBSD 9.0-RELEASE amd64/Sun Microsystems Inc. 1.6.0_32 (64-bit)/cpus=16,threads=1,free=107839464,total=227803136
[junit4:junit4]   2> NOTE: All tests run in this JVM: [TestCharFilters, TestLMJelinekMercerSimilarityFactory, FileBasedSpellCheckerTest, TestJoin, LeaderElectionIntegrationTest, TestSolrQueryParser, MinimalSchemaTest, DateMathParserTest, SolrCmdDistributorTest, CoreAdminHandlerTest, TestExtendedDismaxParser, TestSolrJ, ClusterStateTest, TestJmxMonitoredMap, IndexBasedSpellCheckerTest, PreAnalyzedFieldTest, ZkCLITest, FastVectorHighlighterTest, NumericFieldsTest, SortByFunctionTest, SOLR749Test, DistributedSpellCheckComponentTest, TestFastOutputStream, TestPseudoReturnFields, SolrPluginUtilsTest, QueryElevationComponentTest, TestRangeQuery, DirectUpdateHandlerOptimizeTest, DateFieldTest, DefaultValueUpdateProcessorTest, TestBadConfig, SystemInfoHandlerTest, TestQueryTypes, TestCollationField, JsonLoaderTest, AutoCommitTest, SimpleFacetsTest, TestFaceting, TestBinaryResponseWriter, TestLFUCache, CircularListTest, DistanceFunctionTest, TestDefaultSimilarityFactory, TestIndexingPerformance, TestCoreContainer, NotRequiredUniqueKeyTest, CacheHeaderTest, SampleTest, SuggesterWFSTTest, SimplePostToolTest, TestElisionMultitermQuery, BasicDistributedZkTest, OverseerTest, FullSolrCloudDistribCmdsTest, SpellCheckCollatorTest, SoftAutoCommitTest, ZkSolrClientTest, WordBreakSolrSpellCheckerTest, TestHashPartitioner, DistributedTermsComponentTest, SolrCoreTest, DirectUpdateHandlerTest, TestGroupingSearch, TestFiltering, QueryEqualityTest, TestCSVLoader, SpatialFilterTest, CurrencyFieldTest, QueryParsingTest, StandardRequestHandlerTest, FieldAnalysisRequestHandlerTest, TestReversedWildcardFilterFactory, JSONWriterTest, RequestHandlersTest, RequiredFieldsTest, SuggesterFSTTest, TestQueryUtils, CSVRequestHandlerTest, TestSearchPerf, TestFoldingMultitermQuery, TestLuceneMatchVersion, UpdateRequestProcessorFactoryTest, AlternateDirectoryTest, BadComponentTest, TestUpdate, TestSolrDeletionPolicy2, TestXIncludeConfig, TestQuerySenderListener, TestQuerySenderNoQuery, TestNumberUtils, TestConfig, SpellPossibilityIteratorTest, TestLMDirichletSimilarityFactory, TestPluginEnable, TestDFRSimilarityFactory, TimeZoneUtilsTest, URLClassifyProcessorTest, ResourceLoaderTest, TestSystemIdResolver, TestUtils, BasicDistributedZk2Test]
[junit4:junit4] Completed on J0 in 184.80s, 1 test, 1 failure <<< FAILURES!

[...truncated 5 lines...]
BUILD FAILED
/usr/home/hudson/hudson-slave/workspace/Lucene-Solr-Tests-trunk-Java6/build.xml:29: The following error occurred while executing this line:
/usr/home/hudson/hudson-slave/workspace/Lucene-Solr-Tests-trunk-Java6/solr/build.xml:146: The following error occurred while executing this line:
/usr/home/hudson/hudson-slave/workspace/Lucene-Solr-Tests-trunk-Java6/lucene/module-build.xml:63: The following error occurred while executing this line:
/usr/home/hudson/hudson-slave/workspace/Lucene-Solr-Tests-trunk-Java6/lucene/common-build.xml:1133: The following error occurred while executing this line:
/usr/home/hudson/hudson-slave/workspace/Lucene-Solr-Tests-trunk-Java6/lucene/common-build.xml:810: There were test failures: 228 suites, 923 tests, 1 failure, 6 ignored (1 assumption)

Total time: 30 minutes 42 seconds
Build step 'Invoke Ant' marked build as failure
Recording test results
Email was triggered for: Failure
Sending email for trigger: Failure



Mime
View raw message