lucene-dev mailing list archives

Site index · List index
Message view « Date » · « Thread »
Top « Date » · « Thread »
From Apache Jenkins Server <jenk...@builds.apache.org>
Subject [JENKINS] Lucene-Solr-Tests-4.x-Java6 - Build # 611 - Still Failing
Date Mon, 10 Sep 2012 08:01:02 GMT
Build: https://builds.apache.org/job/Lucene-Solr-Tests-4.x-Java6/611/

All tests passed

Build Log:
[...truncated 20554 lines...]
-jenkins-javadocs-lint:

javadocs-lint:

[...truncated 1608 lines...]
javadocs-lint:
     [exec] 
     [exec] Crawl/parse...
     [exec] 
     [exec]   build/docs/core/org/apache/lucene/store/package-use.html
     [exec]     WARNING: anchor "../../../../org/apache/lucene/store/subclasses" appears more
than once
     [exec] 
     [exec] Verify...

[...truncated 594 lines...]
javadocs-lint:
     [exec] 
     [exec] Crawl/parse...
     [exec] 
     [exec]   build/docs/api/org/apache/solr/common/cloud/Slice.html
     [exec]   WARNING: failed to parse build/docs/api/org/apache/solr/common/cloud/Slice.html:
     [exec] Traceback (most recent call last):
     [exec]   File "/usr/home/hudson/hudson-slave/workspace/Lucene-Solr-Tests-4.x-Java6/lucene/../dev-tools/scripts/checkJavadocLinks.py",
line 93, in parse
     [exec]     parser.feed(html)
     [exec]   File "/usr/local/lib/python3.2/html/parser.py", line 142, in feed
     [exec]     self.goahead(0)
     [exec]   File "/usr/local/lib/python3.2/html/parser.py", line 186, in goahead
     [exec]     k = self.parse_starttag(i)
     [exec]   File "/usr/local/lib/python3.2/html/parser.py", line 319, in parse_starttag
     [exec]     endpos = self.check_for_whole_start_tag(i)
     [exec]   File "/usr/local/lib/python3.2/html/parser.py", line 409, in check_for_whole_start_tag
     [exec]     self.error("malformed start tag")
     [exec]   File "/usr/local/lib/python3.2/html/parser.py", line 149, in error
     [exec]     raise HTMLParseError(message, self.getpos())
     [exec] html.parser.HTMLParseError: malformed start tag, at line 239, column 15
     [exec] 
     [exec]   build/docs/api/solrj/org/apache/solr/common/cloud/Slice.html
     [exec]   WARNING: failed to parse build/docs/api/solrj/org/apache/solr/common/cloud/Slice.html:
     [exec] Traceback (most recent call last):
     [exec]   File "/usr/home/hudson/hudson-slave/workspace/Lucene-Solr-Tests-4.x-Java6/lucene/../dev-tools/scripts/checkJavadocLinks.py",
line 93, in parse
     [exec]     parser.feed(html)
     [exec]   File "/usr/local/lib/python3.2/html/parser.py", line 142, in feed
     [exec]     self.goahead(0)
     [exec]   File "/usr/local/lib/python3.2/html/parser.py", line 186, in goahead
     [exec]     k = self.parse_starttag(i)
     [exec]   File "/usr/local/lib/python3.2/html/parser.py", line 319, in parse_starttag
     [exec]     endpos = self.check_for_whole_start_tag(i)
     [exec]   File "/usr/local/lib/python3.2/html/parser.py", line 409, in check_for_whole_start_tag
     [exec]     self.error("malformed start tag")
     [exec]   File "/usr/local/lib/python3.2/html/parser.py", line 149, in error
     [exec]     raise HTMLParseError(message, self.getpos())
     [exec] html.parser.HTMLParseError: malformed start tag, at line 239, column 15
     [exec] 
     [exec] Verify...
     [exec] 
     [exec] build/docs/api/solrj/org/apache/solr/common/cloud/class-use/Replica.html
     [exec]   BROKEN ANCHOR: build/docs/api/solrj/org/apache/solr/common/cloud/Slice.html#getLeader()
     [exec]   BROKEN ANCHOR: build/docs/api/solrj/org/apache/solr/common/cloud/Slice.html#getReplicas()
     [exec]   BROKEN ANCHOR: build/docs/api/solrj/org/apache/solr/common/cloud/Slice.html#getReplicasCopy()
     [exec]   BROKEN ANCHOR: build/docs/api/solrj/org/apache/solr/common/cloud/Slice.html#getReplicasMap()
     [exec]   BROKEN ANCHOR: build/docs/api/solrj/org/apache/solr/common/cloud/Slice.html#Slice(java.lang.String,
java.util.Map)
     [exec]   BROKEN ANCHOR: build/docs/api/solrj/org/apache/solr/common/cloud/Slice.html#Slice(java.lang.String,
java.util.Map, java.util.Map)
     [exec] 
     [exec] build/docs/api/org/apache/noggit/class-use/JSONWriter.html
     [exec]   BROKEN ANCHOR: build/docs/api/org/apache/solr/common/cloud/Slice.html#write(org.apache.noggit.JSONWriter)
     [exec] 
     [exec] build/docs/api/org/apache/solr/common/cloud/class-use/Replica.html
     [exec]   BROKEN ANCHOR: build/docs/api/org/apache/solr/common/cloud/Slice.html#getLeader()
     [exec]   BROKEN ANCHOR: build/docs/api/org/apache/solr/common/cloud/Slice.html#getReplicas()
     [exec]   BROKEN ANCHOR: build/docs/api/org/apache/solr/common/cloud/Slice.html#getReplicasCopy()
     [exec]   BROKEN ANCHOR: build/docs/api/org/apache/solr/common/cloud/Slice.html#getReplicasMap()
     [exec]   BROKEN ANCHOR: build/docs/api/org/apache/solr/common/cloud/Slice.html#Slice(java.lang.String,
java.util.Map)
     [exec]   BROKEN ANCHOR: build/docs/api/org/apache/solr/common/cloud/Slice.html#Slice(java.lang.String,
java.util.Map, java.util.Map)
     [exec] 
     [exec] build/docs/api/solrj/org/apache/noggit/class-use/JSONWriter.html
     [exec]   BROKEN ANCHOR: build/docs/api/solrj/org/apache/solr/common/cloud/Slice.html#write(org.apache.noggit.JSONWriter)
     [exec] 
     [exec] Broken javadocs links were found!

BUILD FAILED
/usr/home/hudson/hudson-slave/workspace/Lucene-Solr-Tests-4.x-Java6/build.xml:328: The following
error occurred while executing this line:
/usr/home/hudson/hudson-slave/workspace/Lucene-Solr-Tests-4.x-Java6/build.xml:56: The following
error occurred while executing this line:
/usr/home/hudson/hudson-slave/workspace/Lucene-Solr-Tests-4.x-Java6/solr/build.xml:553: The
following error occurred while executing this line:
/usr/home/hudson/hudson-slave/workspace/Lucene-Solr-Tests-4.x-Java6/lucene/common-build.xml:1802:
exec returned: 1

Total time: 55 minutes 10 seconds
Build step 'Invoke Ant' marked build as failure
Recording test results
Email was triggered for: Failure
Sending email for trigger: Failure



Mime
View raw message