lucene-dev mailing list archives

Site index · List index
Message view « Date » · « Thread »
Top « Date » · « Thread »
From Apache Jenkins Server <jenk...@builds.apache.org>
Subject [JENKINS] Lucene-Solr-Tests-trunk-Java6 - Build # 15273 - Still Failing
Date Thu, 20 Sep 2012 20:17:11 GMT
Build: https://builds.apache.org/job/Lucene-Solr-Tests-trunk-Java6/15273/

2 tests failed.
REGRESSION:  org.apache.solr.cloud.SyncSliceTest.testDistribSearch

Error Message:
There are still nodes recoverying

Stack Trace:
java.lang.AssertionError: There are still nodes recoverying
	at __randomizedtesting.SeedInfo.seed([CFEE5751AE7FE656:4E08D949D920866A]:0)
	at org.junit.Assert.fail(Assert.java:93)
	at org.apache.solr.cloud.AbstractDistribZkTestBase.waitForRecoveriesToFinish(AbstractDistribZkTestBase.java:154)
	at org.apache.solr.cloud.AbstractFullDistribZkTestBase.waitForRecoveriesToFinish(AbstractFullDistribZkTestBase.java:560)
	at org.apache.solr.cloud.AbstractFullDistribZkTestBase.waitForThingsToLevelOut(AbstractFullDistribZkTestBase.java:1135)
	at org.apache.solr.cloud.SyncSliceTest.doTest(SyncSliceTest.java:162)
	at org.apache.solr.BaseDistributedSearchTestCase.testDistribSearch(BaseDistributedSearchTestCase.java:695)
	at sun.reflect.NativeMethodAccessorImpl.invoke0(Native Method)
	at sun.reflect.NativeMethodAccessorImpl.invoke(NativeMethodAccessorImpl.java:57)
	at sun.reflect.DelegatingMethodAccessorImpl.invoke(DelegatingMethodAccessorImpl.java:43)
	at java.lang.reflect.Method.invoke(Method.java:616)
	at com.carrotsearch.randomizedtesting.RandomizedRunner.invoke(RandomizedRunner.java:1559)
	at com.carrotsearch.randomizedtesting.RandomizedRunner.access$600(RandomizedRunner.java:79)
	at com.carrotsearch.randomizedtesting.RandomizedRunner$6.evaluate(RandomizedRunner.java:737)
	at com.carrotsearch.randomizedtesting.RandomizedRunner$7.evaluate(RandomizedRunner.java:773)
	at com.carrotsearch.randomizedtesting.RandomizedRunner$8.evaluate(RandomizedRunner.java:787)
	at com.carrotsearch.randomizedtesting.rules.SystemPropertiesRestoreRule$1.evaluate(SystemPropertiesRestoreRule.java:53)
	at org.apache.lucene.util.TestRuleSetupTeardownChained$1.evaluate(TestRuleSetupTeardownChained.java:50)
	at org.apache.lucene.util.TestRuleFieldCacheSanity$1.evaluate(TestRuleFieldCacheSanity.java:51)
	at org.apache.lucene.util.AbstractBeforeAfterRule$1.evaluate(AbstractBeforeAfterRule.java:45)
	at com.carrotsearch.randomizedtesting.rules.SystemPropertiesInvariantRule$1.evaluate(SystemPropertiesInvariantRule.java:55)
	at org.apache.lucene.util.TestRuleThreadAndTestName$1.evaluate(TestRuleThreadAndTestName.java:48)
	at org.apache.lucene.util.TestRuleIgnoreAfterMaxFailures$1.evaluate(TestRuleIgnoreAfterMaxFailures.java:70)
	at org.apache.lucene.util.TestRuleMarkFailure$1.evaluate(TestRuleMarkFailure.java:48)
	at com.carrotsearch.randomizedtesting.rules.StatementAdapter.evaluate(StatementAdapter.java:36)
	at com.carrotsearch.randomizedtesting.ThreadLeakControl$StatementRunner.run(ThreadLeakControl.java:358)
	at com.carrotsearch.randomizedtesting.ThreadLeakControl.forkTimeoutingTask(ThreadLeakControl.java:782)
	at com.carrotsearch.randomizedtesting.ThreadLeakControl$3.evaluate(ThreadLeakControl.java:442)
	at com.carrotsearch.randomizedtesting.RandomizedRunner.runSingleTest(RandomizedRunner.java:746)
	at com.carrotsearch.randomizedtesting.RandomizedRunner$3.evaluate(RandomizedRunner.java:648)
	at com.carrotsearch.randomizedtesting.RandomizedRunner$4.evaluate(RandomizedRunner.java:682)
	at com.carrotsearch.randomizedtesting.RandomizedRunner$5.evaluate(RandomizedRunner.java:693)
	at com.carrotsearch.randomizedtesting.rules.StatementAdapter.evaluate(StatementAdapter.java:36)
	at com.carrotsearch.randomizedtesting.rules.SystemPropertiesRestoreRule$1.evaluate(SystemPropertiesRestoreRule.java:53)
	at org.apache.lucene.util.AbstractBeforeAfterRule$1.evaluate(AbstractBeforeAfterRule.java:45)
	at org.apache.lucene.util.TestRuleStoreClassName$1.evaluate(TestRuleStoreClassName.java:42)
	at com.carrotsearch.randomizedtesting.rules.SystemPropertiesInvariantRule$1.evaluate(SystemPropertiesInvariantRule.java:55)
	at com.carrotsearch.randomizedtesting.rules.NoShadowingOrOverridesOnMethodsRule$1.evaluate(NoShadowingOrOverridesOnMethodsRule.java:39)
	at com.carrotsearch.randomizedtesting.rules.NoShadowingOrOverridesOnMethodsRule$1.evaluate(NoShadowingOrOverridesOnMethodsRule.java:39)
	at com.carrotsearch.randomizedtesting.rules.StatementAdapter.evaluate(StatementAdapter.java:36)
	at org.apache.lucene.util.TestRuleAssertionsRequired$1.evaluate(TestRuleAssertionsRequired.java:43)
	at org.apache.lucene.util.TestRuleMarkFailure$1.evaluate(TestRuleMarkFailure.java:48)
	at org.apache.lucene.util.TestRuleIgnoreAfterMaxFailures$1.evaluate(TestRuleIgnoreAfterMaxFailures.java:70)
	at org.apache.lucene.util.TestRuleIgnoreTestSuites$1.evaluate(TestRuleIgnoreTestSuites.java:55)
	at com.carrotsearch.randomizedtesting.rules.StatementAdapter.evaluate(StatementAdapter.java:36)
	at com.carrotsearch.randomizedtesting.ThreadLeakControl$StatementRunner.run(ThreadLeakControl.java:358)
	at java.lang.Thread.run(Thread.java:679)


FAILED:  org.apache.solr.cloud.BasicDistributedZk2Test.testDistribSearch

Error Message:
Shard still reported as live in zk

Stack Trace:
java.lang.AssertionError: Shard still reported as live in zk
	at __randomizedtesting.SeedInfo.seed([CFEE5751AE7FE656:4E08D949D920866A]:0)
	at org.junit.Assert.fail(Assert.java:93)
	at org.apache.solr.cloud.AbstractFullDistribZkTestBase.waitToSeeNotLive(AbstractFullDistribZkTestBase.java:1220)
	at org.apache.solr.cloud.BasicDistributedZk2Test.brindDownShardIndexSomeDocsAndRecover(BasicDistributedZk2Test.java:190)
	at org.apache.solr.cloud.BasicDistributedZk2Test.doTest(BasicDistributedZk2Test.java:83)
	at org.apache.solr.BaseDistributedSearchTestCase.testDistribSearch(BaseDistributedSearchTestCase.java:695)
	at sun.reflect.NativeMethodAccessorImpl.invoke0(Native Method)
	at sun.reflect.NativeMethodAccessorImpl.invoke(NativeMethodAccessorImpl.java:57)
	at sun.reflect.DelegatingMethodAccessorImpl.invoke(DelegatingMethodAccessorImpl.java:43)
	at java.lang.reflect.Method.invoke(Method.java:616)
	at com.carrotsearch.randomizedtesting.RandomizedRunner.invoke(RandomizedRunner.java:1559)
	at com.carrotsearch.randomizedtesting.RandomizedRunner.access$600(RandomizedRunner.java:79)
	at com.carrotsearch.randomizedtesting.RandomizedRunner$6.evaluate(RandomizedRunner.java:737)
	at com.carrotsearch.randomizedtesting.RandomizedRunner$7.evaluate(RandomizedRunner.java:773)
	at com.carrotsearch.randomizedtesting.RandomizedRunner$8.evaluate(RandomizedRunner.java:787)
	at com.carrotsearch.randomizedtesting.rules.SystemPropertiesRestoreRule$1.evaluate(SystemPropertiesRestoreRule.java:53)
	at org.apache.lucene.util.TestRuleSetupTeardownChained$1.evaluate(TestRuleSetupTeardownChained.java:50)
	at org.apache.lucene.util.TestRuleFieldCacheSanity$1.evaluate(TestRuleFieldCacheSanity.java:51)
	at org.apache.lucene.util.AbstractBeforeAfterRule$1.evaluate(AbstractBeforeAfterRule.java:45)
	at com.carrotsearch.randomizedtesting.rules.SystemPropertiesInvariantRule$1.evaluate(SystemPropertiesInvariantRule.java:55)
	at org.apache.lucene.util.TestRuleThreadAndTestName$1.evaluate(TestRuleThreadAndTestName.java:48)
	at org.apache.lucene.util.TestRuleIgnoreAfterMaxFailures$1.evaluate(TestRuleIgnoreAfterMaxFailures.java:70)
	at org.apache.lucene.util.TestRuleMarkFailure$1.evaluate(TestRuleMarkFailure.java:48)
	at com.carrotsearch.randomizedtesting.rules.StatementAdapter.evaluate(StatementAdapter.java:36)
	at com.carrotsearch.randomizedtesting.ThreadLeakControl$StatementRunner.run(ThreadLeakControl.java:358)
	at com.carrotsearch.randomizedtesting.ThreadLeakControl.forkTimeoutingTask(ThreadLeakControl.java:782)
	at com.carrotsearch.randomizedtesting.ThreadLeakControl$3.evaluate(ThreadLeakControl.java:442)
	at com.carrotsearch.randomizedtesting.RandomizedRunner.runSingleTest(RandomizedRunner.java:746)
	at com.carrotsearch.randomizedtesting.RandomizedRunner$3.evaluate(RandomizedRunner.java:648)
	at com.carrotsearch.randomizedtesting.RandomizedRunner$4.evaluate(RandomizedRunner.java:682)
	at com.carrotsearch.randomizedtesting.RandomizedRunner$5.evaluate(RandomizedRunner.java:693)
	at com.carrotsearch.randomizedtesting.rules.StatementAdapter.evaluate(StatementAdapter.java:36)
	at com.carrotsearch.randomizedtesting.rules.SystemPropertiesRestoreRule$1.evaluate(SystemPropertiesRestoreRule.java:53)
	at org.apache.lucene.util.AbstractBeforeAfterRule$1.evaluate(AbstractBeforeAfterRule.java:45)
	at org.apache.lucene.util.TestRuleStoreClassName$1.evaluate(TestRuleStoreClassName.java:42)
	at com.carrotsearch.randomizedtesting.rules.SystemPropertiesInvariantRule$1.evaluate(SystemPropertiesInvariantRule.java:55)
	at com.carrotsearch.randomizedtesting.rules.NoShadowingOrOverridesOnMethodsRule$1.evaluate(NoShadowingOrOverridesOnMethodsRule.java:39)
	at com.carrotsearch.randomizedtesting.rules.NoShadowingOrOverridesOnMethodsRule$1.evaluate(NoShadowingOrOverridesOnMethodsRule.java:39)
	at com.carrotsearch.randomizedtesting.rules.StatementAdapter.evaluate(StatementAdapter.java:36)
	at org.apache.lucene.util.TestRuleAssertionsRequired$1.evaluate(TestRuleAssertionsRequired.java:43)
	at org.apache.lucene.util.TestRuleMarkFailure$1.evaluate(TestRuleMarkFailure.java:48)
	at org.apache.lucene.util.TestRuleIgnoreAfterMaxFailures$1.evaluate(TestRuleIgnoreAfterMaxFailures.java:70)
	at org.apache.lucene.util.TestRuleIgnoreTestSuites$1.evaluate(TestRuleIgnoreTestSuites.java:55)
	at com.carrotsearch.randomizedtesting.rules.StatementAdapter.evaluate(StatementAdapter.java:36)
	at com.carrotsearch.randomizedtesting.ThreadLeakControl$StatementRunner.run(ThreadLeakControl.java:358)
	at java.lang.Thread.run(Thread.java:679)




Build Log:
[...truncated 7566 lines...]
[junit4:junit4] Suite: org.apache.solr.cloud.SyncSliceTest
[junit4:junit4]   2> 2 T2457 oas.SolrTestCaseJ4.setUp ###Starting testDistribSearch
[junit4:junit4]   2> Creating dataDir: /usr/home/hudson/hudson-slave/workspace/Lucene-Solr-Tests-trunk-Java6/solr/build/solr-core/test/J1/./solrtest-SyncSliceTest-1348171916040
[junit4:junit4]   2> 3 T2457 oasc.ZkTestServer.run STARTING ZK TEST SERVER
[junit4:junit4]   2> 6 T2458 oazs.ZooKeeperServer.setTickTime tickTime set to 1000
[junit4:junit4]   2> 7 T2458 oazs.NIOServerCnxn$Factory.<init> binding to port 0.0.0.0/0.0.0.0:0
[junit4:junit4]   2> 7 T2458 oazsp.FileTxnSnapLog.save Snapshotting: 0
[junit4:junit4]   2> 104 T2457 oasc.ZkTestServer.run start zk server on port:51376
[junit4:junit4]   2> 104 T2457 oaz.ZooKeeper.<init> Initiating client connection, connectString=127.0.0.1:51376 sessionTimeout=10000 watcher=org.apache.solr.common.cloud.ConnectionManager@6c007bce
[junit4:junit4]   2> 105 T2463 oaz.ClientCnxn$SendThread.startConnect Opening socket connection to server /127.0.0.1:51376
[junit4:junit4]   2> 105 T2457 oascc.ConnectionManager.waitForConnected Waiting for client to connect to ZooKeeper
[junit4:junit4]   2> 105 T2463 oaz.ClientCnxn$SendThread.primeConnection Socket connection established to localhost/127.0.0.1:51376, initiating session
[junit4:junit4]   2> 106 T2459 oazs.NIOServerCnxn$Factory.run Accepted socket connection from /140.211.11.196:51379
[junit4:junit4]   2> 106 T2459 oazs.NIOServerCnxn.readConnectRequest Client attempting to establish new session at /140.211.11.196:51379
[junit4:junit4]   2> 106 T2461 oazsp.FileTxnLog.append Creating new log file: log.1
[junit4:junit4]   2> 109 T2461 oazs.NIOServerCnxn.finishSessionInit Established session 0x139e54ee30e0000 with negotiated timeout 10000 for client /140.211.11.196:51379
[junit4:junit4]   2> 109 T2463 oaz.ClientCnxn$SendThread.readConnectResult Session establishment complete on server localhost/127.0.0.1:51376, sessionid = 0x139e54ee30e0000, negotiated timeout = 10000
[junit4:junit4]   2> 110 T2464 oascc.ConnectionManager.process Watcher org.apache.solr.common.cloud.ConnectionManager@6c007bce name:ZooKeeperConnection Watcher:127.0.0.1:51376 got event WatchedEvent state:SyncConnected type:None path:null path:null type:None
[junit4:junit4]   2> 110 T2457 oascc.ConnectionManager.waitForConnected Client is connected to ZooKeeper
[junit4:junit4]   2> 110 T2457 oascc.SolrZkClient.makePath makePath: /solr
[junit4:junit4]   2> 119 T2462 oazs.PrepRequestProcessor.pRequest Processed session termination for sessionid: 0x139e54ee30e0000
[junit4:junit4]   2> 121 T2464 oaz.ClientCnxn$EventThread.run EventThread shut down
[junit4:junit4]   2> 122 T2459 oazs.NIOServerCnxn.closeSock Closed socket connection for client /140.211.11.196:51379 which had sessionid 0x139e54ee30e0000
[junit4:junit4]   2> 121 T2457 oaz.ZooKeeper.close Session: 0x139e54ee30e0000 closed
[junit4:junit4]   2> 122 T2457 oaz.ZooKeeper.<init> Initiating client connection, connectString=127.0.0.1:51376/solr sessionTimeout=10000 watcher=org.apache.solr.common.cloud.ConnectionManager@55e7005a
[junit4:junit4]   2> 122 T2465 oaz.ClientCnxn$SendThread.startConnect Opening socket connection to server /127.0.0.1:51376
[junit4:junit4]   2> 122 T2457 oascc.ConnectionManager.waitForConnected Waiting for client to connect to ZooKeeper
[junit4:junit4]   2> 123 T2465 oaz.ClientCnxn$SendThread.primeConnection Socket connection established to localhost/127.0.0.1:51376, initiating session
[junit4:junit4]   2> 123 T2459 oazs.NIOServerCnxn$Factory.run Accepted socket connection from /140.211.11.196:51381
[junit4:junit4]   2> 124 T2459 oazs.NIOServerCnxn.readConnectRequest Client attempting to establish new session at /140.211.11.196:51381
[junit4:junit4]   2> 133 T2465 oaz.ClientCnxn$SendThread.readConnectResult Session establishment complete on server localhost/127.0.0.1:51376, sessionid = 0x139e54ee30e0001, negotiated timeout = 10000
[junit4:junit4]   2> 133 T2461 oazs.NIOServerCnxn.finishSessionInit Established session 0x139e54ee30e0001 with negotiated timeout 10000 for client /140.211.11.196:51381
[junit4:junit4]   2> 133 T2466 oascc.ConnectionManager.process Watcher org.apache.solr.common.cloud.ConnectionManager@55e7005a name:ZooKeeperConnection Watcher:127.0.0.1:51376/solr got event WatchedEvent state:SyncConnected type:None path:null path:null type:None
[junit4:junit4]   2> 133 T2457 oascc.ConnectionManager.waitForConnected Client is connected to ZooKeeper
[junit4:junit4]   2> 134 T2457 oascc.SolrZkClient.makePath makePath: /collections/collection1
[junit4:junit4]   2> 142 T2457 oascc.SolrZkClient.makePath makePath: /collections/collection1/shards
[junit4:junit4]   2> 152 T2457 oascc.SolrZkClient.makePath makePath: /collections/control_collection
[junit4:junit4]   2> 164 T2457 oascc.SolrZkClient.makePath makePath: /collections/control_collection/shards
[junit4:junit4]   2> 166 T2457 oasc.AbstractZkTestCase.putConfig put /usr/home/hudson/hudson-slave/workspace/Lucene-Solr-Tests-trunk-Java6/solr/build/solr-core/test-files/solr/collection1/conf/solrconfig.xml to /configs/conf1/solrconfig.xml
[junit4:junit4]   2> 167 T2457 oascc.SolrZkClient.makePath makePath: /configs/conf1/solrconfig.xml
[junit4:junit4]   2> 196 T2457 oasc.AbstractZkTestCase.putConfig put /usr/home/hudson/hudson-slave/workspace/Lucene-Solr-Tests-trunk-Java6/solr/build/solr-core/test-files/solr/collection1/conf/schema.xml to /configs/conf1/schema.xml
[junit4:junit4]   2> 197 T2457 oascc.SolrZkClient.makePath makePath: /configs/conf1/schema.xml
[junit4:junit4]   2> 313 T2457 oasc.AbstractZkTestCase.putConfig put /usr/home/hudson/hudson-slave/workspace/Lucene-Solr-Tests-trunk-Java6/solr/build/solr-core/test-files/solr/collection1/conf/solrconfig.xml to /configs/conf1/solrconfig.xml
[junit4:junit4]   2> 313 T2457 oascc.SolrZkClient.makePath makePath: /configs/conf1/solrconfig.xml
[junit4:junit4]   2> 321 T2457 oasc.AbstractZkTestCase.putConfig put /usr/home/hudson/hudson-slave/workspace/Lucene-Solr-Tests-trunk-Java6/solr/build/solr-core/test-files/solr/collection1/conf/stopwords.txt to /configs/conf1/stopwords.txt
[junit4:junit4]   2> 321 T2457 oascc.SolrZkClient.makePath makePath: /configs/conf1/stopwords.txt
[junit4:junit4]   2> 328 T2457 oasc.AbstractZkTestCase.putConfig put /usr/home/hudson/hudson-slave/workspace/Lucene-Solr-Tests-trunk-Java6/solr/build/solr-core/test-files/solr/collection1/conf/protwords.txt to /configs/conf1/protwords.txt
[junit4:junit4]   2> 329 T2457 oascc.SolrZkClient.makePath makePath: /configs/conf1/protwords.txt
[junit4:junit4]   2> 332 T2457 oasc.AbstractZkTestCase.putConfig put /usr/home/hudson/hudson-slave/workspace/Lucene-Solr-Tests-trunk-Java6/solr/build/solr-core/test-files/solr/collection1/conf/currency.xml to /configs/conf1/currency.xml
[junit4:junit4]   2> 332 T2457 oascc.SolrZkClient.makePath makePath: /configs/conf1/currency.xml
[junit4:junit4]   2> 334 T2457 oasc.AbstractZkTestCase.putConfig put /usr/home/hudson/hudson-slave/workspace/Lucene-Solr-Tests-trunk-Java6/solr/build/solr-core/test-files/solr/collection1/conf/open-exchange-rates.json to /configs/conf1/open-exchange-rates.json
[junit4:junit4]   2> 334 T2457 oascc.SolrZkClient.makePath makePath: /configs/conf1/open-exchange-rates.json
[junit4:junit4]   2> 343 T2457 oasc.AbstractZkTestCase.putConfig put /usr/home/hudson/hudson-slave/workspace/Lucene-Solr-Tests-trunk-Java6/solr/build/solr-core/test-files/solr/collection1/conf/mapping-ISOLatin1Accent.txt to /configs/conf1/mapping-ISOLatin1Accent.txt
[junit4:junit4]   2> 343 T2457 oascc.SolrZkClient.makePath makePath: /configs/conf1/mapping-ISOLatin1Accent.txt
[junit4:junit4]   2> 351 T2457 oasc.AbstractZkTestCase.putConfig put /usr/home/hudson/hudson-slave/workspace/Lucene-Solr-Tests-trunk-Java6/solr/build/solr-core/test-files/solr/collection1/conf/old_synonyms.txt to /configs/conf1/old_synonyms.txt
[junit4:junit4]   2> 351 T2457 oascc.SolrZkClient.makePath makePath: /configs/conf1/old_synonyms.txt
[junit4:junit4]   2> 358 T2457 oasc.AbstractZkTestCase.putConfig put /usr/home/hudson/hudson-slave/workspace/Lucene-Solr-Tests-trunk-Java6/solr/build/solr-core/test-files/solr/collection1/conf/synonyms.txt to /configs/conf1/synonyms.txt
[junit4:junit4]   2> 359 T2457 oascc.SolrZkClient.makePath makePath: /configs/conf1/synonyms.txt
[junit4:junit4]   2> 366 T2462 oazs.PrepRequestProcessor.pRequest Processed session termination for sessionid: 0x139e54ee30e0001
[junit4:junit4]   2> 373 T2466 oaz.ClientCnxn$EventThread.run EventThread shut down
[junit4:junit4]   2> 373 T2457 oaz.ZooKeeper.close Session: 0x139e54ee30e0001 closed
[junit4:junit4]   2> 373 T2459 oazs.NIOServerCnxn.closeSock Closed socket connection for client /140.211.11.196:51381 which had sessionid 0x139e54ee30e0001
[junit4:junit4]   2> 374 T2457 oejs.Server.doStart jetty-8.1.2.v20120308
[junit4:junit4]   2> 377 T2457 oejs.AbstractConnector.doStart Started SocketConnector@0.0.0.0:51383
[junit4:junit4]   2> 377 T2457 oasc.SolrResourceLoader.locateSolrHome JNDI not configured for solr (NoInitialContextEx)
[junit4:junit4]   2> 378 T2457 oasc.SolrResourceLoader.locateSolrHome using system property solr.solr.home: /usr/home/hudson/hudson-slave/workspace/Lucene-Solr-Tests-trunk-Java6/solr/build/solr-core/test-files/solr
[junit4:junit4]   2> 378 T2457 oasc.SolrResourceLoader.<init> new SolrResourceLoader for deduced Solr Home: '/usr/home/hudson/hudson-slave/workspace/Lucene-Solr-Tests-trunk-Java6/solr/build/solr-core/test-files/solr/'
[junit4:junit4]   2> 409 T2457 oass.SolrDispatchFilter.init SolrDispatchFilter.init()
[junit4:junit4]   2> 409 T2457 oasc.SolrResourceLoader.locateSolrHome JNDI not configured for solr (NoInitialContextEx)
[junit4:junit4]   2> 409 T2457 oasc.SolrResourceLoader.locateSolrHome using system property solr.solr.home: /usr/home/hudson/hudson-slave/workspace/Lucene-Solr-Tests-trunk-Java6/solr/build/solr-core/test-files/solr
[junit4:junit4]   2> 410 T2457 oasc.CoreContainer$Initializer.initialize looking for solr.xml: /usr/home/hudson/hudson-slave/workspace/Lucene-Solr-Tests-trunk-Java6/solr/build/solr-core/test-files/solr/solr.xml
[junit4:junit4]   2> 410 T2457 oasc.CoreContainer.<init> New CoreContainer 32489880
[junit4:junit4]   2> 410 T2457 oasc.CoreContainer.load Loading CoreContainer using Solr Home: '/usr/home/hudson/hudson-slave/workspace/Lucene-Solr-Tests-trunk-Java6/solr/build/solr-core/test-files/solr/'
[junit4:junit4]   2> 411 T2457 oasc.SolrResourceLoader.<init> new SolrResourceLoader for directory: '/usr/home/hudson/hudson-slave/workspace/Lucene-Solr-Tests-trunk-Java6/solr/build/solr-core/test-files/solr/'
[junit4:junit4]   2> 429 T2457 oasc.CoreContainer.load Registering Log Listener
[junit4:junit4]   2> 440 T2457 oasc.CoreContainer.initZooKeeper Zookeeper client=127.0.0.1:51376/solr
[junit4:junit4]   2> 441 T2457 oaz.ZooKeeper.<init> Initiating client connection, connectString=127.0.0.1:51376/solr sessionTimeout=5000 watcher=org.apache.solr.common.cloud.ConnectionManager@79e2e606
[junit4:junit4]   2> 442 T2476 oaz.ClientCnxn$SendThread.startConnect Opening socket connection to server /127.0.0.1:51376
[junit4:junit4]   2> 442 T2457 oascc.ConnectionManager.waitForConnected Waiting for client to connect to ZooKeeper
[junit4:junit4]   2> 442 T2476 oaz.ClientCnxn$SendThread.primeConnection Socket connection established to localhost/127.0.0.1:51376, initiating session
[junit4:junit4]   2> 442 T2459 oazs.NIOServerCnxn$Factory.run Accepted socket connection from /140.211.11.196:51384
[junit4:junit4]   2> 443 T2459 oazs.NIOServerCnxn.readConnectRequest Client attempting to establish new session at /140.211.11.196:51384
[junit4:junit4]   2> 444 T2461 oazs.NIOServerCnxn.finishSessionInit Established session 0x139e54ee30e0002 with negotiated timeout 5000 for client /140.211.11.196:51384
[junit4:junit4]   2> 445 T2476 oaz.ClientCnxn$SendThread.readConnectResult Session establishment complete on server localhost/127.0.0.1:51376, sessionid = 0x139e54ee30e0002, negotiated timeout = 5000
[junit4:junit4]   2> 445 T2477 oascc.ConnectionManager.process Watcher org.apache.solr.common.cloud.ConnectionManager@79e2e606 name:ZooKeeperConnection Watcher:127.0.0.1:51376/solr got event WatchedEvent state:SyncConnected type:None path:null path:null type:None
[junit4:junit4]   2> 445 T2457 oascc.ConnectionManager.waitForConnected Client is connected to ZooKeeper
[junit4:junit4]   2> 447 T2462 oazs.PrepRequestProcessor.pRequest Got user-level KeeperException when processing sessionid:0x139e54ee30e0002 type:create cxid:0x2 zxid:0xfffffffffffffffe txntype:unknown reqpath:n/a Error Path:/solr/overseer Error:KeeperErrorCode = NodeExists for /solr/overseer
[junit4:junit4]   2> 456 T2457 oascc.SolrZkClient.makePath makePath: /live_nodes
[junit4:junit4]   2> 457 T2457 oasc.ZkController.createEphemeralLiveNode Register node as live in ZooKeeper:/live_nodes/127.0.0.1:51383_solr
[junit4:junit4]   2> 457 T2462 oazs.PrepRequestProcessor.pRequest Got user-level KeeperException when processing sessionid:0x139e54ee30e0002 type:delete cxid:0x7 zxid:0xfffffffffffffffe txntype:unknown reqpath:n/a Error Path:/solr/live_nodes/127.0.0.1:51383_solr Error:KeeperErrorCode = NoNode for /solr/live_nodes/127.0.0.1:51383_solr
[junit4:junit4]   2> 458 T2457 oascc.SolrZkClient.makePath makePath: /live_nodes/127.0.0.1:51383_solr
[junit4:junit4]   2> 467 T2457 oashc.HttpShardHandlerFactory.getParameter Setting socketTimeout to: 0
[junit4:junit4]   2> 468 T2457 oashc.HttpShardHandlerFactory.getParameter Setting urlScheme to: http://
[junit4:junit4]   2> 468 T2457 oashc.HttpShardHandlerFactory.getParameter Setting connTimeout to: 0
[junit4:junit4]   2> 468 T2457 oashc.HttpShardHandlerFactory.getParameter Setting maxConnectionsPerHost to: 20
[junit4:junit4]   2> 469 T2457 oashc.HttpShardHandlerFactory.getParameter Setting corePoolSize to: 0
[junit4:junit4]   2> 469 T2457 oashc.HttpShardHandlerFactory.getParameter Setting maximumPoolSize to: 2147483647
[junit4:junit4]   2> 469 T2457 oashc.HttpShardHandlerFactory.getParameter Setting maxThreadIdleTime to: 5
[junit4:junit4]   2> 470 T2457 oashc.HttpShardHandlerFactory.getParameter Setting sizeOfQueue to: -1
[junit4:junit4]   2> 470 T2457 oashc.HttpShardHandlerFactory.getParameter Setting fairnessPolicy to: false
[junit4:junit4]   2> 470 T2457 oascsi.HttpClientUtil.createClient Creating new http client, config:maxConnectionsPerHost=20&maxConnections=10000&socketTimeout=0&connTimeout=0&retry=false
[junit4:junit4]   2> 479 T2457 oascc.SolrZkClient.makePath makePath: /overseer_elect/election
[junit4:junit4]   2> 493 T2462 oazs.PrepRequestProcessor.pRequest Got user-level KeeperException when processing sessionid:0x139e54ee30e0002 type:delete cxid:0x15 zxid:0xfffffffffffffffe txntype:unknown reqpath:n/a Error Path:/solr/overseer_elect/leader Error:KeeperErrorCode = NoNode for /solr/overseer_elect/leader
[junit4:junit4]   2> 494 T2457 oascc.SolrZkClient.makePath makePath: /overseer_elect/leader
[junit4:junit4]   2> 495 T2457 oasc.Overseer.start Overseer (id=88353794689990658-127.0.0.1:51383_solr-n_0000000000) starting
[junit4:junit4]   2> 496 T2462 oazs.PrepRequestProcessor.pRequest Got user-level KeeperException when processing sessionid:0x139e54ee30e0002 type:create cxid:0x1a zxid:0xfffffffffffffffe txntype:unknown reqpath:n/a Error Path:/solr/overseer Error:KeeperErrorCode = NodeExists for /solr/overseer
[junit4:junit4]   2> 496 T2462 oazs.PrepRequestProcessor.pRequest Got user-level KeeperException when processing sessionid:0x139e54ee30e0002 type:create cxid:0x1b zxid:0xfffffffffffffffe txntype:unknown reqpath:n/a Error Path:/solr/overseer Error:KeeperErrorCode = NodeExists for /solr/overseer
[junit4:junit4]   2> 497 T2462 oazs.PrepRequestProcessor.pRequest Got user-level KeeperException when processing sessionid:0x139e54ee30e0002 type:create cxid:0x1c zxid:0xfffffffffffffffe txntype:unknown reqpath:n/a Error Path:/solr/overseer Error:KeeperErrorCode = NodeExists for /solr/overseer
[junit4:junit4]   2> 498 T2462 oazs.PrepRequestProcessor.pRequest Got user-level KeeperException when processing sessionid:0x139e54ee30e0002 type:create cxid:0x1d zxid:0xfffffffffffffffe txntype:unknown reqpath:n/a Error Path:/solr/overseer Error:KeeperErrorCode = NodeExists for /solr/overseer
[junit4:junit4]   2> 499 T2479 oasc.OverseerCollectionProcessor.run Process current queue of collection creations
[junit4:junit4]   2> 499 T2457 oascc.SolrZkClient.makePath makePath: /clusterstate.json
[junit4:junit4]   2> 500 T2457 oascc.ZkStateReader.createClusterStateWatchersAndUpdate Updating cluster state from ZooKeeper... 
[junit4:junit4]   2> 501 T2478 oasc.Overseer$ClusterStateUpdater.run Starting to work on the main queue
[junit4:junit4]   2> 505 T2457 oasc.CoreContainer.create Creating SolrCore 'collection1' using instanceDir: /usr/home/hudson/hudson-slave/workspace/Lucene-Solr-Tests-trunk-Java6/solr/build/solr-core/test-files/solr/collection1
[junit4:junit4]   2> 505 T2457 oasc.ZkController.createCollectionZkNode Check for collection zkNode:control_collection
[junit4:junit4]   2> 505 T2457 oasc.ZkController.createCollectionZkNode Collection zkNode exists
[junit4:junit4]   2> 506 T2457 oasc.ZkController.readConfigName Load collection config from:/collections/control_collection
[junit4:junit4]   2> 507 T2457 oasc.SolrResourceLoader.<init> new SolrResourceLoader for directory: '/usr/home/hudson/hudson-slave/workspace/Lucene-Solr-Tests-trunk-Java6/solr/build/solr-core/test-files/solr/collection1/'
[junit4:junit4]   2> 508 T2457 oasc.SolrResourceLoader.replaceClassLoader Adding 'file:/usr/home/hudson/hudson-slave/workspace/Lucene-Solr-Tests-trunk-Java6/solr/build/solr-core/test-files/solr/collection1/lib/classes/' to classloader
[junit4:junit4]   2> 509 T2457 oasc.SolrResourceLoader.replaceClassLoader Adding 'file:/usr/home/hudson/hudson-slave/workspace/Lucene-Solr-Tests-trunk-Java6/solr/build/solr-core/test-files/solr/collection1/lib/README' to classloader
[junit4:junit4]   2> 546 T2457 oasc.SolrConfig.<init> Using Lucene MatchVersion: LUCENE_50
[junit4:junit4]   2> 600 T2457 oasc.SolrConfig.<init> Loaded SolrConfig: solrconfig.xml
[junit4:junit4]   2> 701 T2457 oass.IndexSchema.readSchema Reading Solr Schema
[junit4:junit4]   2> 709 T3 oasc.CoreContainer.finalize SEVERE CoreContainer was not shutdown prior to finalize(), indicates a bug -- POSSIBLE RESOURCE LEAK!!!  instance=218229116
[junit4:junit4]   2> 711 T2457 oass.IndexSchema.readSchema Schema name=test
[junit4:junit4]   2> 1305 T2457 oass.OpenExchangeRatesOrgProvider.init Initialized with rates=open-exchange-rates.json, refreshInterval=1440.
[junit4:junit4]   2> 1318 T2457 oass.IndexSchema.readSchema default search field in schema is text
[junit4:junit4]   2> 1322 T2457 oass.IndexSchema.readSchema unique key field: id
[junit4:junit4]   2> 1333 T2457 oass.FileExchangeRateProvider.reload Reloading exchange rates from file currency.xml
[junit4:junit4]   2> 1338 T2457 oass.FileExchangeRateProvider.reload Reloading exchange rates from file currency.xml
[junit4:junit4]   2> 1343 T2457 oass.OpenExchangeRatesOrgProvider.reload Reloading exchange rates from open-exchange-rates.json
[junit4:junit4]   2> 1344 T2457 oass.OpenExchangeRatesOrgProvider.reload Reloading exchange rates from open-exchange-rates.json
[junit4:junit4]   2> 1345 T2457 oasc.SolrCore.<init> [collection1] Opening new SolrCore at /usr/home/hudson/hudson-slave/workspace/Lucene-Solr-Tests-trunk-Java6/solr/build/solr-core/test-files/solr/collection1/, dataDir=./org.apache.solr.cloud.SyncSliceTest-1348171916040/control/data/
[junit4:junit4]   2> 1346 T2457 oasc.JmxMonitoredMap.<init> JMX monitoring is enabled. Adding Solr mbeans to JMX Server: com.sun.jmx.mbeanserver.JmxMBeanServer@729b1670
[junit4:junit4]   2> 1347 T2457 oasc.SolrCore.getNewIndexDir WARNING New index directory detected: old=null new=./org.apache.solr.cloud.SyncSliceTest-1348171916040/control/data/index/
[junit4:junit4]   2> 1348 T2457 oasc.SolrCore.initIndex WARNING [collection1] Solr index directory './org.apache.solr.cloud.SyncSliceTest-1348171916040/control/data/index' doesn't exist. Creating new index...
[junit4:junit4]   2> 1349 T2457 oasc.CachingDirectoryFactory.get return new directory for /usr/home/hudson/hudson-slave/workspace/Lucene-Solr-Tests-trunk-Java6/solr/build/solr-core/test/J1/./org.apache.solr.cloud.SyncSliceTest-1348171916040/control/data/index forceNew:false
[junit4:junit4]   2> 1361 T2457 oasc.SolrDeletionPolicy.onCommit SolrDeletionPolicy.onCommit: commits:num=1
[junit4:junit4]   2> 		commit{dir=NRTCachingDirectory(org.apache.lucene.store.NIOFSDirectory@/usr/home/hudson/hudson-slave/workspace/Lucene-Solr-Tests-trunk-Java6/solr/build/solr-core/test/J1/org.apache.solr.cloud.SyncSliceTest-1348171916040/control/data/index lockFactory=org.apache.lucene.store.NativeFSLockFactory@63d92c04; maxCacheMB=48.0 maxMergeSizeMB=4.0),segFN=segments_1,generation=1,filenames=[segments_1]
[junit4:junit4]   2> 1361 T2457 oasc.SolrDeletionPolicy.updateCommits newest commit = 1
[junit4:junit4]   2> 1362 T2457 oasc.SolrCore.initWriters created xml: solr.XMLResponseWriter
[junit4:junit4]   2> 1364 T2457 oasup.UpdateRequestProcessorChain.init inserting DistributedUpdateProcessorFactory into updateRequestProcessorChain "dedupe"
[junit4:junit4]   2> 1365 T2457 oasup.UpdateRequestProcessorChain.init inserting DistributedUpdateProcessorFactory into updateRequestProcessorChain "dedupe-allfields"
[junit4:junit4]   2> 1365 T2457 oasup.UpdateRequestProcessorChain.init inserting DistributedUpdateProcessorFactory into updateRequestProcessorChain "stored_sig"
[junit4:junit4]   2> 1366 T2457 oasup.UpdateRequestProcessorChain.init inserting DistributedUpdateProcessorFactory into updateRequestProcessorChain "uniq-fields"
[junit4:junit4]   2> 1367 T2457 oasup.UpdateRequestProcessorChain.init inserting DistributedUpdateProcessorFactory into updateRequestProcessorChain "distrib-dup-test-chain-implicit"
[junit4:junit4]   2> 1367 T2457 oasc.RequestHandlers.initHandlersFromConfig adding lazy requestHandler: solr.ReplicationHandler
[junit4:junit4]   2> 1368 T2457 oasc.RequestHandlers.initHandlersFromConfig created /replication: solr.ReplicationHandler
[junit4:junit4]   2> 1368 T2457 oasc.RequestHandlers.initHandlersFromConfig created standard: solr.StandardRequestHandler
[junit4:junit4]   2> 1369 T2457 oasc.RequestHandlers.initHandlersFromConfig created /get: solr.RealTimeGetHandler
[junit4:junit4]   2> 1370 T2457 oasc.RequestHandlers.initHandlersFromConfig created dismax: solr.SearchHandler
[junit4:junit4]   2> 1370 T2457 oasc.RequestHandlers.initHandlersFromConfig created mock: org.apache.solr.core.MockQuerySenderListenerReqHandler
[junit4:junit4]   2> 1371 T2457 oasc.RequestHandlers.initHandlersFromConfig created /admin/: org.apache.solr.handler.admin.AdminHandlers
[junit4:junit4]   2> 1372 T2457 oasc.RequestHandlers.initHandlersFromConfig created defaults: solr.StandardRequestHandler
[junit4:junit4]   2> 1372 T2457 oasc.RequestHandlers.initHandlersFromConfig adding lazy requestHandler: solr.StandardRequestHandler
[junit4:junit4]   2> 1373 T2457 oasc.RequestHandlers.initHandlersFromConfig created lazy: solr.StandardRequestHandler
[junit4:junit4]   2> 1373 T2457 oasc.RequestHandlers.initHandlersFromConfig created /update: solr.UpdateRequestHandler
[junit4:junit4]   2> 1374 T2457 oasc.RequestHandlers.initHandlersFromConfig created /terms: org.apache.solr.handler.component.SearchHandler
[junit4:junit4]   2> 1374 T2457 oasc.RequestHandlers.initHandlersFromConfig created spellCheckCompRH: org.apache.solr.handler.component.SearchHandler
[junit4:junit4]   2> 1375 T2457 oasc.RequestHandlers.initHandlersFromConfig created spellCheckCompRH_Direct: org.apache.solr.handler.component.SearchHandler
[junit4:junit4]   2> 1376 T2457 oasc.RequestHandlers.initHandlersFromConfig created spellCheckWithWordbreak: org.apache.solr.handler.component.SearchHandler
[junit4:junit4]   2> 1376 T2457 oasc.RequestHandlers.initHandlersFromConfig created spellCheckWithWordbreak_Direct: org.apache.solr.handler.component.SearchHandler
[junit4:junit4]   2> 1377 T2457 oasc.RequestHandlers.initHandlersFromConfig created spellCheckCompRH1: org.apache.solr.handler.component.SearchHandler
[junit4:junit4]   2> 1377 T2457 oasc.RequestHandlers.initHandlersFromConfig created tvrh: org.apache.solr.handler.component.SearchHandler
[junit4:junit4]   2> 1378 T2457 oasc.RequestHandlers.initHandlersFromConfig created /mlt: solr.MoreLikeThisHandler
[junit4:junit4]   2> 1379 T2457 oasc.RequestHandlers.initHandlersFromConfig created /debug/dump: solr.DumpRequestHandler
[junit4:junit4]   2> 1383 T2457 oashl.XMLLoader.init xsltCacheLifetimeSeconds=60
[junit4:junit4]   2> 1388 T2457 oasc.SolrCore.initDeprecatedSupport WARNING solrconfig.xml uses deprecated <admin/gettableFiles>, Please update your config to use the ShowFileRequestHandler.
[junit4:junit4]   2> 1389 T2457 oasc.SolrCore.initDeprecatedSupport WARNING adding ShowFileRequestHandler with hidden files: [SCHEMA.XML, OLD_SYNONYMS.TXT, STOPWORDS.TXT, PROTWORDS.TXT, OPEN-EXCHANGE-RATES.JSON, SYNONYMS.TXT, CURRENCY.XML, MAPPING-ISOLATIN1ACCENT.TXT]
[junit4:junit4]   2> 1394 T2457 oass.SolrIndexSearcher.<init> Opening Searcher@376b142a main
[junit4:junit4]   2> 1395 T2457 oasu.CommitTracker.<init> Hard AutoCommit: disabled
[junit4:junit4]   2> 1396 T2457 oasu.CommitTracker.<init> Soft AutoCommit: disabled
[junit4:junit4]   2> 1397 T2457 oashc.SpellCheckComponent.inform Initializing spell checkers
[junit4:junit4]   2> 1450 T2457 oass.DirectSolrSpellChecker.init init: {name=direct,classname=DirectSolrSpellChecker,field=lowerfilt,minQueryLength=3}
[junit4:junit4]   2> 1508 T2480 oasc.SolrCore.registerSearcher [collection1] Registered new searcher Searcher@376b142a main{StandardDirectoryReader(segments_1:1)}
[junit4:junit4]   2> 1513 T2462 oazs.PrepRequestProcessor.pRequest Got user-level KeeperException when processing sessionid:0x139e54ee30e0002 type:create cxid:0x56 zxid:0xfffffffffffffffe txntype:unknown reqpath:n/a Error Path:/solr/overseer/queue Error:KeeperErrorCode = NoNode for /solr/overseer/queue
[junit4:junit4]   2> 1524 T2457 oasc.CoreContainer.register registering core: collection1
[junit4:junit4]   2> 1525 T2457 oasc.ZkController.register Register shard - core:collection1 address:http://127.0.0.1:51383/solr shardId:control_shard
[junit4:junit4]   2> 1526 T2457 oascc.SolrZkClient.makePath makePath: /collections/control_collection/leader_elect/control_shard/election
[junit4:junit4]   2> 1547 T2462 oazs.PrepRequestProcessor.pRequest Got user-level KeeperException when processing sessionid:0x139e54ee30e0002 type:delete cxid:0x65 zxid:0xfffffffffffffffe txntype:unknown reqpath:n/a Error Path:/solr/collections/control_collection/leaders Error:KeeperErrorCode = NoNode for /solr/collections/control_collection/leaders
[junit4:junit4]   2> 1548 T2457 oasc.ShardLeaderElectionContext.runLeaderProcess Running the leader process.
[junit4:junit4]   2> 1549 T2462 oazs.PrepRequestProcessor.pRequest Got user-level KeeperException when processing sessionid:0x139e54ee30e0002 type:create cxid:0x66 zxid:0xfffffffffffffffe txntype:unknown reqpath:n/a Error Path:/solr/overseer Error:KeeperErrorCode = NodeExists for /solr/overseer
[junit4:junit4]   2> 2007 T2478 oascc.ZkStateReader.updateClusterState Updating cloud state from ZooKeeper... 
[junit4:junit4]   2> 2007 T2462 oazs.PrepRequestProcessor.pRequest Got user-level KeeperException when processing sessionid:0x139e54ee30e0002 type:create cxid:0x6d zxid:0xfffffffffffffffe txntype:unknown reqpath:n/a Error Path:/solr/overseer/queue-work Error:KeeperErrorCode = NoNode for /solr/overseer/queue-work
[junit4:junit4]   2> 2032 T2477 oascc.ZkStateReader$2.process A cluster state change has occurred - updating...
[junit4:junit4]   2> 2060 T2457 oasc.ShardLeaderElectionContext.waitForReplicasToComeUp Enough replicas found to continue.
[junit4:junit4]   2> 2060 T2457 oasc.ShardLeaderElectionContext.runLeaderProcess I may be the new leader - try and sync
[junit4:junit4]   2> 2061 T2457 oasc.SyncStrategy.sync Sync replicas to http://127.0.0.1:51383/solr/collection1/
[junit4:junit4]   2> 2061 T2457 oasc.SyncStrategy.syncReplicas Sync Success - now sync replicas to me
[junit4:junit4]   2> 2062 T2457 oasc.SyncStrategy.syncToMe http://127.0.0.1:51383/solr/collection1/ has no replicas
[junit4:junit4]   2> 2062 T2457 oasc.ShardLeaderElectionContext.runLeaderProcess I am the new leader: http://127.0.0.1:51383/solr/collection1/
[junit4:junit4]   2> 2063 T2457 oascc.SolrZkClient.makePath makePath: /collections/control_collection/leaders/control_shard
[junit4:junit4]   2> 2066 T2462 oazs.PrepRequestProcessor.pRequest Got user-level KeeperException when processing sessionid:0x139e54ee30e0002 type:create cxid:0x8b zxid:0xfffffffffffffffe txntype:unknown reqpath:n/a Error Path:/solr/overseer Error:KeeperErrorCode = NodeExists for /solr/overseer
[junit4:junit4]   2> 2537 T2478 oascc.ZkStateReader.updateClusterState Updating cloud state from ZooKeeper... 
[junit4:junit4]   2> 2715 T2477 oascc.ZkStateReader$2.process A cluster state change has occurred - updating...
[junit4:junit4]   2> 2731 T2457 oasc.ZkController.register We are http://127.0.0.1:51383/solr/collection1/ and leader is http://127.0.0.1:51383/solr/collection1/
[junit4:junit4]   2> 2731 T2457 oasc.ZkController.register No LogReplay needed for core=collection1 baseURL=http://127.0.0.1:51383/solr
[junit4:junit4]   2> 2732 T2457 oasc.ZkController.checkRecovery I am the leader, no recovery necessary
[junit4:junit4]   2> 2733 T2457 oascc.ZkStateReader.updateClusterState Updating cloud state from ZooKeeper... 
[junit4:junit4]   2> 2734 T2457 oass.SolrDispatchFilter.init user.dir=/usr/home/hudson/hudson-slave/workspace/Lucene-Solr-Tests-trunk-Java6/solr/build/solr-core/test/J1
[junit4:junit4]   2> 2734 T2457 oass.SolrDispatchFilter.init SolrDispatchFilter.init() done
[junit4:junit4]   2> 2735 T2457 oascsi.HttpClientUtil.createClient Creating new http client, config:maxConnections=128&maxConnectionsPerHost=32&followRedirects=false
[junit4:junit4]   2> 3228 T2478 oascc.ZkStateReader.updateClusterState Updating cloud state from ZooKeeper... 
[junit4:junit4]   2> 3235 T2477 oascc.ZkStateReader$2.process A cluster state change has occurred - updating...
[junit4:junit4]   2> 3309 T2457 oejs.Server.doStart jetty-8.1.2.v20120308
[junit4:junit4]   2> 3312 T2457 oejs.AbstractConnector.doStart Started SocketConnector@0.0.0.0:51387
[junit4:junit4]   2> 3313 T2457 oasc.SolrResourceLoader.locateSolrHome JNDI not configured for solr (NoInitialContextEx)
[junit4:junit4]   2> 3313 T2457 oasc.SolrResourceLoader.locateSolrHome using system property solr.solr.home: /usr/home/hudson/hudson-slave/workspace/Lucene-Solr-Tests-trunk-Java6/solr/build/solr-core/test/J1/./solrtest-jetty1-1348171918788
[junit4:junit4]   2> 3314 T2457 oasc.SolrResourceLoader.<init> new SolrResourceLoader for deduced Solr Home: '/usr/home/hudson/hudson-slave/workspace/Lucene-Solr-Tests-trunk-Java6/solr/build/solr-core/test/J1/./solrtest-jetty1-1348171918788/'
[junit4:junit4]   2> 3350 T2457 oass.SolrDispatchFilter.init SolrDispatchFilter.init()
[junit4:junit4]   2> 3351 T2457 oasc.SolrResourceLoader.locateSolrHome JNDI not configured for solr (NoInitialContextEx)
[junit4:junit4]   2> 3351 T2457 oasc.SolrResourceLoader.locateSolrHome using system property solr.solr.home: /usr/home/hudson/hudson-slave/workspace/Lucene-Solr-Tests-trunk-Java6/solr/build/solr-core/test/J1/./solrtest-jetty1-1348171918788
[junit4:junit4]   2> 3352 T2457 oasc.CoreContainer$Initializer.initialize looking for solr.xml: /usr/home/hudson/hudson-slave/workspace/Lucene-Solr-Tests-trunk-Java6/solr/build/solr-core/test/J1/./solrtest-jetty1-1348171918788/solr.xml
[junit4:junit4]   2> 3352 T2457 oasc.CoreContainer.<init> New CoreContainer 1689709123
[junit4:junit4]   2> 3353 T2457 oasc.CoreContainer.load Loading CoreContainer using Solr Home: '/usr/home/hudson/hudson-slave/workspace/Lucene-Solr-Tests-trunk-Java6/solr/build/solr-core/test/J1/./solrtest-jetty1-1348171918788/'
[junit4:junit4]   2> 3353 T2457 oasc.SolrResourceLoader.<init> new SolrResourceLoader for directory: '/usr/home/hudson/hudson-slave/workspace/Lucene-Solr-Tests-trunk-Java6/solr/build/solr-core/test/J1/./solrtest-jetty1-1348171918788/'
[junit4:junit4]   2> 3378 T2457 oasc.CoreContainer.load Registering Log Listener
[junit4:junit4]   2> 3394 T2457 oasc.CoreContainer.initZooKeeper Zookeeper client=127.0.0.1:51376/solr
[junit4:junit4]   2> 3395 T2457 oaz.ZooKeeper.<init> Initiating client connection, connectString=127.0.0.1:51376/solr sessionTimeout=5000 watcher=org.apache.solr.common.cloud.ConnectionManager@5287248b
[junit4:junit4]   2> 3396 T2490 oaz.ClientCnxn$SendThread.startConnect Opening socket connection to server /127.0.0.1:51376
[junit4:junit4]   2> 3396 T2457 oascc.ConnectionManager.waitForConnected Waiting for client to connect to ZooKeeper
[junit4:junit4]   2> 3397 T2490 oaz.ClientCnxn$SendThread.primeConnection Socket connection established to localhost/127.0.0.1:51376, initiating session
[junit4:junit4]   2> 3397 T2459 oazs.NIOServerCnxn$Factory.run Accepted socket connection from /140.211.11.196:51389
[junit4:junit4]   2> 3397 T2459 oazs.NIOServerCnxn.readConnectRequest Client attempting to establish new session at /140.211.11.196:51389
[junit4:junit4]   2> 3399 T2461 oazs.NIOServerCnxn.finishSessionInit Established session 0x139e54ee30e0003 with negotiated timeout 5000 for client /140.211.11.196:51389
[junit4:junit4]   2> 3399 T2490 oaz.ClientCnxn$SendThread.readConnectResult Session establishment complete on server localhost/127.0.0.1:51376, sessionid = 0x139e54ee30e0003, negotiated timeout = 5000
[junit4:junit4]   2> 3399 T2491 oascc.ConnectionManager.process Watcher org.apache.solr.common.cloud.ConnectionManager@5287248b name:ZooKeeperConnection Watcher:127.0.0.1:51376/solr got event WatchedEvent state:SyncConnected type:None path:null path:null type:None
[junit4:junit4]   2> 3400 T2457 oascc.ConnectionManager.waitForConnected Client is connected to ZooKeeper
[junit4:junit4]   2> 3400 T2462 oazs.PrepRequestProcessor.pRequest Got user-level KeeperException when processing sessionid:0x139e54ee30e0003 type:create cxid:0x1 zxid:0xfffffffffffffffe txntype:unknown reqpath:n/a Error Path:/solr/overseer Error:KeeperErrorCode = NodeExists for /solr/overseer
[junit4:junit4]   2> 3402 T2462 oazs.PrepRequestProcessor.pRequest Got user-level KeeperException when processing sessionid:0x139e54ee30e0003 type:create cxid:0x2 zxid:0xfffffffffffffffe txntype:unknown reqpath:n/a Error Path:/solr/overseer Error:KeeperErrorCode = NodeExists for /solr/overseer
[junit4:junit4]   2> 3410 T2457 oasc.ZkController.createEphemeralLiveNode Register node as live in ZooKeeper:/live_nodes/127.0.0.1:51387_solr
[junit4:junit4]   2> 3410 T2462 oazs.PrepRequestProcessor.pRequest Got user-level KeeperException when processing sessionid:0x139e54ee30e0003 type:delete cxid:0x4 zxid:0xfffffffffffffffe txntype:unknown reqpath:n/a Error Path:/solr/live_nodes/127.0.0.1:51387_solr Error:KeeperErrorCode = NoNode for /solr/live_nodes/127.0.0.1:51387_solr
[junit4:junit4]   2> 3412 T2457 oascc.SolrZkClient.makePath makePath: /live_nodes/127.0.0.1:51387_solr
[junit4:junit4]   2> 3415 T2477 oascc.ZkStateReader$3.process Updating live nodes
[junit4:junit4]   2> 3415 T2457 oashc.HttpShardHandlerFactory.getParameter Setting socketTimeout to: 0
[junit4:junit4]   2> 3416 T2457 oashc.HttpShardHandlerFactory.getParameter Setting urlScheme to: http://
[junit4:junit4]   2> 3416 T2457 oashc.HttpShardHandlerFactory.getParameter Setting connTimeout to: 0
[junit4:junit4]   2> 3416 T2457 oashc.HttpShardHandlerFactory.getParameter Setting maxConnectionsPerHost to: 20
[junit4:junit4]   2> 3417 T2457 oashc.HttpShardHandlerFactory.getParameter Setting corePoolSize to: 0
[junit4:junit4]   2> 3417 T2457 oashc.HttpShardHandlerFactory.getParameter Setting maximumPoolSize to: 2147483647
[junit4:junit4]   2> 3418 T2457 oashc.HttpShardHandlerFactory.getParameter Setting maxThreadIdleTime to: 5
[junit4:junit4]   2> 3418 T2457 oashc.HttpShardHandlerFactory.getParameter Setting sizeOfQueue to: -1
[junit4:junit4]   2> 3419 T2457 oashc.HttpShardHandlerFactory.getParameter Setting fairnessPolicy to: false
[junit4:junit4]   2> 3419 T2457 oascsi.HttpClientUtil.createClient Creating new http client, config:maxConnectionsPerHost=20&maxConnections=10000&socketTimeout=0&connTimeout=0&retry=false
[junit4:junit4]   2> 3435 T2457 oascc.ZkStateReader.createClusterStateWatchersAndUpdate Updating cluster state from ZooKeeper... 
[junit4:junit4]   2> 3440 T2457 oasc.CoreContainer.create Creating SolrCore 'collection1' using instanceDir: /usr/home/hudson/hudson-slave/workspace/Lucene-Solr-Tests-trunk-Java6/solr/build/solr-core/test/J1/./solrtest-jetty1-1348171918788/collection1
[junit4:junit4]   2> 3441 T2457 oasc.ZkController.createCollectionZkNode Check for collection zkNode:collection1
[junit4:junit4]   2> 3442 T2457 oasc.ZkController.createCollectionZkNode Collection zkNode exists
[junit4:junit4]   2> 3442 T2457 oasc.ZkController.readConfigName Load collection config from:/collections/collection1
[junit4:junit4]   2> 3443 T2457 oasc.SolrResourceLoader.<init> new SolrResourceLoader for directory: '/usr/home/hudson/hudson-slave/workspace/Lucene-Solr-Tests-trunk-Java6/solr/build/solr-core/test/J1/./solrtest-jetty1-1348171918788/collection1/'
[junit4:junit4]   2> 3444 T2457 oasc.SolrResourceLoader.replaceClassLoader Adding 'file:/usr/home/hudson/hudson-slave/workspace/Lucene-Solr-Tests-trunk-Java6/solr/build/solr-core/test/J1/solrtest-jetty1-1348171918788/collection1/lib/README' to classloader
[junit4:junit4]   2> 3445 T2457 oasc.SolrResourceLoader.replaceClassLoader Adding 'file:/usr/home/hudson/hudson-slave/workspace/Lucene-Solr-Tests-trunk-Java6/solr/build/solr-core/test/J1/solrtest-jetty1-1348171918788/collection1/lib/classes/' to classloader
[junit4:junit4]   2> 3497 T2457 oasc.SolrConfig.<init> Using Lucene MatchVersion: LUCENE_50
[junit4:junit4]   2> 3573 T2457 oasc.SolrConfig.<init> Loaded SolrConfig: solrconfig.xml
[junit4:junit4]   2> 3674 T2457 oass.IndexSchema.readSchema Reading Solr Schema
[junit4:junit4]   2> 3682 T2457 oass.IndexSchema.readSchema Schema name=test
[junit4:junit4]   2> 4320 T2457 oass.OpenExchangeRatesOrgProvider.init Initialized with rates=open-exchange-rates.json, refreshInterval=1440.
[junit4:junit4]   2> 4333 T2457 oass.IndexSchema.readSchema default search field in schema is text
[junit4:junit4]   2> 4338 T2457 oass.IndexSchema.readSchema unique key field: id
[junit4:junit4]   2> 4349 T2457 oass.FileExchangeRateProvider.reload Reloading exchange rates from file currency.xml
[junit4:junit4]   2> 4354 T2457 oass.FileExchangeRateProvider.reload Reloading exchange rates from file currency.xml
[junit4:junit4]   2> 4358 T2457 oass.OpenExchangeRatesOrgProvider.reload Reloading exchange rates from open-exchange-rates.json
[junit4:junit4]   2> 4359 T2457 oass.OpenExchangeRatesOrgProvider.reload Reloading exchange rates from open-exchange-rates.json
[junit4:junit4]   2> 4361 T2457 oasc.SolrCore.<init> [collection1] Opening new SolrCore at /usr/home/hudson/hudson-slave/workspace/Lucene-Solr-Tests-trunk-Java6/solr/build/solr-core/test/J1/./solrtest-jetty1-1348171918788/collection1/, dataDir=./org.apache.solr.cloud.SyncSliceTest-1348171916040/jetty1/
[junit4:junit4]   2> 4361 T2457 oasc.JmxMonitoredMap.<init> JMX monitoring is enabled. Adding Solr mbeans to JMX Server: com.sun.jmx.mbeanserver.JmxMBeanServer@729b1670
[junit4:junit4]   2> 4363 T2457 oasc.SolrCore.getNewIndexDir WARNING New index directory detected: old=null new=./org.apache.solr.cloud.SyncSliceTest-1348171916040/jetty1/index/
[junit4:junit4]   2> 4364 T2457 oasc.SolrCore.initIndex WARNING [collection1] Solr index directory './org.apache.solr.cloud.SyncSliceTest-1348171916040/jetty1/index' doesn't exist. Creating new index...
[junit4:junit4]   2> 4366 T2457 oasc.CachingDirectoryFactory.get return new directory for /usr/home/hudson/hudson-slave/workspace/Lucene-Solr-Tests-trunk-Java6/solr/build/solr-core/test/J1/./org.apache.solr.cloud.SyncSliceTest-1348171916040/jetty1/index forceNew:false
[junit4:junit4]   2> 4402 T2457 oasc.SolrDeletionPolicy.onCommit SolrDeletionPolicy.onCommit: commits:num=1
[junit4:junit4]   2> 		commit{dir=NRTCachingDirectory(org.apache.lucene.store.NIOFSDirectory@/usr/home/hudson/hudson-slave/workspace/Lucene-Solr-Tests-trunk-Java6/solr/build/solr-core/test/J1/org.apache.solr.cloud.SyncSliceTest-1348171916040/jetty1/index lockFactory=org.apache.lucene.store.NativeFSLockFactory@4144712c; maxCacheMB=48.0 maxMergeSizeMB=4.0),segFN=segments_1,generation=1,filenames=[segments_1]
[junit4:junit4]   2> 4403 T2457 oasc.SolrDeletionPolicy.updateCommits newest commit = 1
[junit4:junit4]   2> 4405 T2457 oasc.SolrCore.initWriters created xml: solr.XMLResponseWriter
[junit4:junit4]   2> 4408 T2457 oasup.UpdateRequestProcessorChain.init inserting DistributedUpdateProcessorFactory into updateRequestProcessorChain "dedupe"
[junit4:junit4]   2> 4409 T2457 oasup.UpdateRequestProcessorChain.init inserting DistributedUpdateProcessorFactory into updateRequestProcessorChain "dedupe-allfields"
[junit4:junit4]   2> 4410 T2457 oasup.UpdateRequestProcessorChain.init inserting DistributedUpdateProcessorFactory into updateRequestProcessorChain "stored_sig"
[junit4:junit4]   2> 4411 T2457 oasup.UpdateRequestProcessorChain.init inserting DistributedUpdateProcessorFactory into updateRequestProcessorChain "uniq-fields"
[junit4:junit4]   2> 4412 T2457 oasup.UpdateRequestProcessorChain.init inserting DistributedUpdateProcessorFactory into updateRequestProcessorChain "distrib-dup-test-chain-implicit"
[junit4:junit4]   2> 4413 T2457 oasc.RequestHandlers.initHandlersFromConfig adding lazy requestHandler: solr.ReplicationHandler
[junit4:junit4]   2> 4414 T2457 oasc.RequestHandlers.initHandlersFromConfig created /replication: solr.ReplicationHandler
[junit4:junit4]   2> 4415 T2457 oasc.RequestHandlers.initHandlersFromConfig created standard: solr.StandardRequestHandler
[junit4:junit4]   2> 4417 T2457 oasc.RequestHandlers.initHandlersFromConfig created /get: solr.RealTimeGetHandler
[junit4:junit4]   2> 4418 T2457 oasc.RequestHandlers.initHandlersFromConfig created dismax: solr.SearchHandler
[junit4:junit4]   2> 4419 T2457 oasc.RequestHandlers.initHandlersFromConfig created mock: org.apache.solr.core.MockQuerySenderListenerReqHandler
[junit4:junit4]   2> 4420 T2457 oasc.RequestHandlers.initHandlersFromConfig created /admin/: org.apache.solr.handler.admin.AdminHandlers
[junit4:junit4]   2> 4421 T2457 oasc.RequestHandlers.initHandlersFromConfig created defaults: solr.StandardRequestHandler
[junit4:junit4]   2> 4422 T2457 oasc.RequestHandlers.initHandlersFromConfig adding lazy requestHandler: solr.StandardRequestHandler
[junit4:junit4]   2> 4423 T2457 oasc.RequestHandlers.initHandlersFromConfig created lazy: solr.StandardRequestHandler
[junit4:junit4]   2> 4424 T2457 oasc.RequestHandlers.initHandlersFromConfig created /update: solr.UpdateRequestHandler
[junit4:junit4]   2> 4425 T2457 oasc.RequestHandlers.initHandlersFromConfig created /terms: org.apache.solr.handler.component.SearchHandler
[junit4:junit4]   2> 4426 T2457 oasc.RequestHandlers.initHandlersFromConfig created spellCheckCompRH: org.apache.solr.handler.component.SearchHandler
[junit4:junit4]   2> 4427 T2457 oasc.RequestHandlers.initHandlersFromConfig created spellCheckCompRH_Direct: org.apache.solr.handler.component.SearchHandler
[junit4:junit4]   2> 4428 T2457 oasc.RequestHandlers.initHandlersFromConfig created spellCheckWithWordbreak: org.apache.solr.handler.component.SearchHandler
[junit4:junit4]   2> 4429 T2457 oasc.RequestHandlers.initHandlersFromConfig created spellCheckWithWordbreak_Direct: org.apache.solr.handler.component.SearchHandler
[junit4:junit4]   2> 4430 T2457 oasc.RequestHandlers.initHandlersFromConfig created spellCheckCompRH1: org.apache.solr.handler.component.SearchHandler
[junit4:junit4]   2> 4431 T2457 oasc.RequestHandlers.initHandlersFromConfig created tvrh: org.apache.solr.handler.component.SearchHandler
[junit4:junit4]   2> 4432 T2457 oasc.RequestHandlers.initHandlersFromConfig created /mlt: solr.MoreLikeThisHandler
[junit4:junit4]   2> 4433 T2457 oasc.RequestHandlers.initHandlersFromConfig created /debug/dump: solr.DumpRequestHandler
[junit4:junit4]   2> 4438 T2457 oashl.XMLLoader.init xsltCacheLifetimeSeconds=60
[junit4:junit4]   2> 4446 T2457 oasc.SolrCore.initDeprecatedSupport WARNING solrconfig.xml uses deprecated <admin/gettableFiles>, Please update your config to use the ShowFileRequestHandler.
[junit4:junit4]   2> 4447 T2457 oasc.SolrCore.initDeprecatedSupport WARNING adding ShowFileRequestHandler with hidden files: [SCHEMA.XML, OLD_SYNONYMS.TXT, STOPWORDS.TXT, PROTWORDS.TXT, OPEN-EXCHANGE-RATES.JSON, SYNONYMS.TXT, CURRENCY.XML, MAPPING-ISOLATIN1ACCENT.TXT]
[junit4:junit4]   2> 4454 T2457 oass.SolrIndexSearcher.<init> Opening Searcher@3ca33ecb main
[junit4:junit4]   2> 4456 T2457 oasu.CommitTracker.<init> Hard AutoCommit: disabled
[junit4:junit4]   2> 4456 T2457 oasu.CommitTracker.<init> Soft AutoCommit: disabled
[junit4:junit4]   2> 4458 T2457 oashc.SpellCheckComponent.inform Initializing spell checkers
[junit4:junit4]   2> 4468 T2457 oass.DirectSolrSpellChecker.init init: {name=direct,classname=DirectSolrSpellChecker,field=lowerfilt,minQueryLength=3}
[junit4:junit4]   2> 4524 T2492 oasc.SolrCore.registerSearcher [collection1] Registered new searcher Searcher@3ca33ecb main{StandardDirectoryReader(segments_1:1)}
[junit4:junit4]   2> 4755 T2478 oascc.ZkStateReader.updateClusterState Updating cloud state from ZooKeeper... 
[junit4:junit4]   2> 4774 T2477 oascc.ZkStateReader$2.process A cluster state change has occurred - updating...
[junit4:junit4]   2> 4774 T2491 oascc.ZkStateReader$2.process A cluster state change has occurred - updating...
[junit4:junit4]   2> 5031 T2457 oasc.CoreContainer.register registering core: collection1
[junit4:junit4]   2> 5031 T2457 oasc.ZkController.register Register shard - core:collection1 address:http://127.0.0.1:51387/solr shardId:shard1
[junit4:junit4]   2> 5032 T2457 oascc.SolrZkClient.makePath makePath: /collections/collection1/leader_elect/shard1/election
[junit4:junit4]   2> 5047 T2462 oazs.PrepRequestProcessor.pRequest Got user-level KeeperException when processing sessionid:0x139e54ee30e0003 type:delete cxid:0x42 zxid:0xfffffffffffffffe txntype:unknown reqpath:n/a Error Path:/solr/collections/collection1/leaders Error:KeeperErrorCode = NoNode for /solr/collections/collection1/leaders
[junit4:junit4]   2> 5048 T2457 oasc.ShardLeaderElectionContext.runLeaderProcess Running the leader process.
[junit4:junit4]   2> 5049 T2462 oazs.PrepRequestProcessor.pRequest Got user-level KeeperException when processing sessionid:0x139e54ee30e0003 type:create cxid:0x43 zxid:0xfffffffffffffffe txntype:unknown reqpath:n/a Error Path:/solr/overseer Error:KeeperErrorCode = NodeExists for /solr/overseer
[junit4:junit4]   2> 5059 T2457 oasc.ShardLeaderElectionContext.waitForReplicasToComeUp Enough replicas found to continue.
[junit4:junit4]   2> 5060 T2457 oasc.ShardLeaderElectionContext.runLeaderProcess I may be the new leader - try and sync
[junit4:junit4]   2> 5060 T2457 oasc.SyncStrategy.sync Sync replicas to http://127.0.0.1:51387/solr/collection1/
[junit4:junit4]   2> 5061 T2457 oasc.SyncStrategy.syncReplicas Sync Success - now sync replicas to me
[junit4:junit4]   2> 5061 T2457 oasc.SyncStrategy.syncToMe http://127.0.0.1:51387/solr/collection1/ has no replicas
[junit4:junit4]   2> 5062 T2457 oasc.ShardLeaderElectionContext.runLeaderProcess I am the new leader: http://127.0.0.1:51387/solr/collection1/
[junit4:junit4]   2> 5062 T2457 oascc.SolrZkClient.makePath makePath: /collections/collection1/leaders/shard1
[junit4:junit4]   2> 5065 T2462 oazs.PrepRequestProcessor.pRequest Got user-level KeeperException when processing sessionid:0x139e54ee30e0003 type:create cxid:0x4d zxid:0xfffffffffffffffe txntype:unknown reqpath:n/a Error Path:/solr/overseer Error:KeeperErrorCode = NodeExists for /solr/overseer
[junit4:junit4]   2> 5278 T2478 oascc.ZkStateReader.updateClusterState Updating cloud state from ZooKeeper... 
[junit4:junit4]   2> 5292 T2477 oascc.ZkStateReader$2.process A cluster state change has occurred - updating...
[junit4:junit4]   2> 5292 T2491 oascc.ZkStateReader$2.process A cluster state change has occurred - updating...
[junit4:junit4]   2> 5330 T2457 oasc.ZkController.register We are http://127.0.0.1:51387/solr/collection1/ and leader is http://127.0.0.1:51387/solr/collection1/
[junit4:junit4]   2> 5330 T2457 oasc.ZkController.register No LogReplay needed for core=collection1 baseURL=http://127.0.0.1:51387/solr
[junit4:junit4]   2> 5330 T2457 oasc.ZkController.checkRecovery I am the leader, no recovery necessary
[junit4:junit4]   2> 5332 T2457 oascc.ZkStateReader.updateClusterState Updating cloud state from ZooKeeper... 
[junit4:junit4]   2> 5333 T2457 oass.SolrDispatchFilter.init user.dir=/usr/home/hudson/hudson-slave/workspace/Lucene-Solr-Tests-trunk-Java6/solr/build/solr-core/test/J1
[junit4:junit4]   2> 5333 T2457 oass.SolrDispatchFilter.init SolrDispatchFilter.init() done
[junit4:junit4]   2> 5334 T2457 oascsi.HttpClientUtil.createClient Creating new http client, config:maxConnections=128&maxConnectionsPerHost=32&followRedirects=false
[junit4:junit4]   2> 5770 T2457 oejs.Server.doStart jetty-8.1.2.v20120308
[junit4:junit4]   2> 5773 T2457 oejs.AbstractConnector.doStart Started SocketConnector@0.0.0.0:51394
[junit4:junit4]   2> 5774 T2457 oasc.SolrResourceLoader.locateSolrHome JNDI not configured for solr (NoInitialContextEx)
[junit4:junit4]   2> 5774 T2457 oasc.SolrResourceLoader.locateSolrHome using system property solr.solr.home: /usr/home/hudson/hudson-slave/workspace/Lucene-Solr-Tests-trunk-Java6/solr/build/solr-core/test/J1/./solrtest-jetty2-1348171921384
[junit4:junit4]   2> 5775 T2457 oasc.SolrResourceLoader.<init> new SolrResourceLoader for deduced Solr Home: '/usr/home/hudson/hudson-slave/workspace/Lucene-Solr-Tests-trunk-Java6/solr/build/solr-core/test/J1/./solrtest-jetty2-1348171921384/'
[junit4:junit4]   2> 5797 T2478 oascc.ZkStateReader.updateClusterState Updating cloud state from ZooKeeper... 
[junit4:junit4]   2> 5812 T2457 oass.SolrDispatchFilter.init SolrDispatchFilter.init()
[junit4:junit4]   2> 5813 T2457 oasc.SolrResourceLoader.locateSolrHome JNDI not configured for solr (NoInitialContextEx)
[junit4:junit4]   2> 5813 T2457 oasc.SolrResourceLoader.locateSolrHome using system property solr.solr.home: /usr/home/hudson/hudson-slave/workspace/Lucene-Solr-Tests-trunk-Java6/solr/build/solr-core/test/J1/./solrtest-jetty2-1348171921384
[junit4:junit4]   2> 5814 T2457 oasc.CoreContainer$Initializer.initialize looking for solr.xml: /usr/home/hudson/hudson-slave/workspace/Lucene-Solr-Tests-trunk-Java6/solr/build/solr-core/test/J1/./solrtest-jetty2-1348171921384/solr.xml
[junit4:junit4]   2> 5814 T2457 oasc.CoreContainer.<init> New CoreContainer 678048085
[junit4:junit4]   2> 5814 T2491 oascc.ZkStateReader$2.process A cluster state change has occurred - updating...
[junit4:junit4]   2> 5814 T2477 oascc.ZkStateReader$2.process A cluster state change has occurred - updating...
[junit4:junit4]   2> 5815 T2457 oasc.CoreContainer.load Loading CoreContainer using Solr Home: '/usr/home/hudson/hudson-slave/workspace/Lucene-Solr-Tests-trunk-Java6/solr/build/solr-core/test/J1/./solrtest-jetty2-1348171921384/'
[junit4:junit4]   2> 5815 T2457 oasc.SolrResourceLoader.<init> new SolrResourceLoader for directory: '/usr/home/hudson/hudson-slave/workspace/Lucene-Solr-Tests-trunk-Java6/solr/build/solr-core/test/J1/./solrtest-jetty2-1348171921384/'
[junit4:junit4]   2> 5840 T2457 oasc.CoreContainer.load Registering Log Listener
[junit4:junit4]   2> 5855 T2457 oasc.CoreContainer.initZooKeeper Zookeeper client=127.0.0.1:51376/solr
[junit4:junit4]   2> 5856 T2457 oaz.ZooKeeper.<init> Initiating client connection, connectString=127.0.0.1:51376/solr sessionTimeout=5000 watcher=org.apache.solr.common.cloud.ConnectionManager@2d849d56
[junit4:junit4]   2> 5856 T2502 oaz.ClientCnxn$SendThread.startConnect Opening socket connection to server /127.0.0.1:51376
[junit4:junit4]   2> 5856 T2457 oascc.ConnectionManager.waitForConnected Waiting for client to connect to ZooKeeper
[junit4:junit4]   2> 5857 T2502 oaz.ClientCnxn$SendThread.primeConnection Socket connection established to localhost/127.0.0.1:51376, initiating session
[junit4:junit4]   2> 5857 T2459 oazs.NIOServerCnxn$Factory.run Accepted socket connection from /140.211.11.196:51395
[junit4:junit4]   2> 5858 T2459 oazs.NIOServerCnxn.readConnectRequest Client attempting to establish new session at /140.211.11.196:51395
[junit4:junit4]   2> 5859 T2461 oazs.NIOServerCnxn.finishSessionInit Established session 0x139e54ee30e0004 with negotiated timeout 5000 for client /140.211.11.196:51395
[junit4:junit4]   2> 5859 T2502 oaz.ClientCnxn$SendThread.readConnectResult Session establishment complete on server localhost/127.0.0.1:51376, sessionid = 0x139e54ee30e0004, negotiated timeout = 5000
[junit4:junit4]   2> 5860 T2503 oascc.ConnectionManager.process Watcher org.apache.solr.common.cloud.ConnectionManager@2d849d56 name:ZooKeeperConnection Watcher:127.0.0.1:51376/solr got event WatchedEvent state:SyncConnected type:None path:null path:null type:None
[junit4:junit4]   2> 5860 T2457 oascc.ConnectionManager.waitForConnected Client is connected to ZooKeeper
[junit4:junit4]   2> 5860 T2462 oazs.PrepRequestProcessor.pRequest Got user-level KeeperException when processing sessionid:0x139e54ee30e0004 type:create cxid:0x1 zxid:0xfffffffffffffffe txntype:unknown reqpath:n/a Error Path:/solr/overseer Error:KeeperErrorCode = NodeExists for /solr/overseer
[junit4:junit4]   2> 5863 T2462 oazs.PrepRequestProcessor.pRequest Got user-level KeeperException when processing sessionid:0x139e54ee30e0004 type:create cxid:0x2 zxid:0xfffffffffffffffe txntype:unknown reqpath:n/a Error Path:/solr/overseer Error:KeeperErrorCode = NodeExists for /solr/overseer
[junit4:junit4]   2> 5864 T2457 oasc.ZkController.createEphemeralLiveNode Register node as live in ZooKeeper:/live_nodes/127.0.0.1:51394_solr
[junit4:junit4]   2> 5865 T2462 oazs.PrepRequestProcessor.pRequest Got user-level KeeperException when processing sessionid:0x139e54ee30e0004 type:delete cxid:0x4 zxid:0xfffffffffffffffe txntype:unknown reqpath:n/a Error Path:/solr/live_nodes/127.0.0.1:51394_solr Error:KeeperErrorCode = NoNode for /solr/live_nodes/127.0.0.1:51394_solr
[junit4:junit4]   2> 5874 T2457 oascc.SolrZkClient.makePath makePath: /live_nodes/127.0.0.1:51394_solr
[junit4:junit4]   2> 5876 T2491 oascc.ZkStateReader$3.process Updating live nodes
[junit4:junit4]   2> 5876 T2477 oascc.ZkStateReader$3.process Updating live nodes
[junit4:junit4]   2> 5876 T2457 oashc.HttpShardHandlerFactory.getParameter Setting socketTimeout to: 0
[junit4:junit4]   2> 5877 T2457 oashc.HttpShardHandlerFactory.getParameter Setting urlScheme to: http://
[junit4:junit4]   2> 5877 T2457 oashc.HttpShardHandlerFactory.getParameter Setting connTimeout to: 0
[junit4:junit4]   2> 5877 T2457 oashc.HttpShardHandlerFactory.getParameter Setting maxConnectionsPerHost to: 20
[junit4:junit4]   2> 5878 T2457 oashc.HttpShardHandlerFactory.getParameter Setting corePoolSize to: 0
[junit4:junit4]   2> 5878 T2457 oashc.HttpShardHandlerFactory.getParameter Setting maximumPoolSize to: 2147483647
[junit4:junit4]   2> 5879 T2457 oashc.HttpShardHandlerFactory.getParameter Setting maxThreadIdleTime to: 5
[junit4:junit4]   2> 5879 T2457 oashc.HttpShardHandlerFactory.getParameter Setting sizeOfQueue to: -1
[junit4:junit4]   2> 5879 T2457 oashc.HttpShardHandlerFactory.getParameter Setting fairnessPolicy to: false
[junit4:junit4]   2> 5880 T2457 oascsi.HttpClientUtil.createClient Creating new http client, config:maxConnectionsPerHost=20&maxConnections=10000&socketTimeout=0&connTimeout=0&retry=false
[junit4:junit4]   2> 5900 T2457 oascc.ZkStateReader.createClusterStateWatchersAndUpdate Updating cluster state from ZooKeeper... 
[junit4:junit4]   2> 5907 T2457 oasc.CoreContainer.create Creating SolrCore 'collection1' using instanceDir: /usr/home/hudson/hudson-slave/workspace/Lucene-Solr-Tests-trunk-Java6/solr/build/solr-core/test/J1/./solrtest-jetty2-1348171921384/collection1
[junit4:junit4]   2> 5907 T2457 oasc.ZkController.createCollectionZkNode Check for collection zkNode:collection1
[junit4:junit4]   2> 5907 T2457 oasc.ZkController.createCollectionZkNode Collection zkNode exists
[junit4:junit4]   2> 5908 T2457 oasc.ZkController.readConfigName Load collection config from:/collections/collection1
[junit4:junit4]   2> 5909 T2457 oasc.SolrResourceLoader.<init> new SolrResourceLoader for directory: '/usr/home/hudson/hudson-slave/workspace/Lucene-Solr-Tests-trunk-Java6/solr/build/solr-core/test/J1/./solrtest-jetty2-1348171921384/collection1/'
[junit4:junit4]   2> 5910 T2457 oasc.SolrResourceLoader.replaceClassLoader Adding 'file:/usr/home/hudson/hudson-slave/workspace/Lucene-Solr-Tests-trunk-Java6/solr/build/solr-core/test/J1/solrtest-jetty2-1348171921384/collection1/lib/README' to classloader
[junit4:junit4]   2> 5911 T2457 oasc.SolrResourceLoader.replaceClassLoader Adding 'file:/usr/home/hudson/hudson-slave/workspace/Lucene-Solr-Tests-trunk-Java6/solr/build/solr-core/test/J1/solrtest-jetty2-1348171921384/collection1/lib/classes/' to classloader
[junit4:junit4]   2> 5965 T2457 oasc.SolrConfig.<init> Using Lucene MatchVersion: LUCENE_50
[junit4:junit4]   2> 6044 T2457 oasc.SolrConfig.<init> Loaded SolrConfig: solrconfig.xml
[junit4:junit4]   2> 6145 T2457 oass.IndexSchema.readSchema Reading Solr Schema
[junit4:junit4]   2> 6154 T2457 oass.IndexSchema.readSchema Schema name=test
[junit4:junit4]   2> 6822 T2457 oass.OpenExchangeRatesOrgProvider.init Initialized with rates=open-exchange-rates.json, refreshInterval=1440.
[junit4:junit4]   2> 6834 T2457 oass.IndexSchema.readSchema default search field in schema is text
[junit4:junit4]   2> 6839 T2457 oass.IndexSchema.readSchema unique key field: id
[junit4:junit4]   2> 6850 T2457 oass.FileExchangeRateProvider.reload Reloading exchange rates from file currency.xml
[junit4:junit4]   2> 6855 T2457 oass.FileExchangeRateProvider.reload Reloading exchange rates from file currency.xml
[junit4:junit4]   2> 6860 T2457 oass.OpenExchangeRatesOrgProvider.reload Reloading exchange rates from open-exchange-rates.json
[junit4:junit4]   2> 6861 T2457 oass.OpenExchangeRatesOrgProvider.reload Reloading exchange rates from open-exchange-rates.json
[junit4:junit4]   2> 6862 T2457 oasc.SolrCore.<init> [collection1] Opening new SolrCore at /usr/home/hudson/hudson-slave/workspace/Lucene-Solr-Tests-trunk-Java6/solr/build/solr-core/test/J1/./solrtest-jetty2-1348171921384/collection1/, dataDir=./org.apache.solr.cloud.SyncSliceTest-1348171916040/jetty2/
[junit4:junit4]   2> 6862 T2457 oasc.JmxMonitoredMap.<init> JMX monitoring is enabled. Adding Solr mbeans to JMX Server: com.sun.jmx.mbeanserver.JmxMBeanServer@729b1670
[junit4:junit4]   2> 6864 T2457 oasc.SolrCore.getNewIndexDir WARNING New index directory detected: old=null new=./org.apache.solr.cloud.SyncSliceTest-1348171916040/jetty2/index/
[junit4:junit4]   2> 6865 T2457 oasc.SolrCore.initIndex WARNING [collection1] Solr index directory './org.apache.solr.cloud.SyncSliceTest-1348171916040/jetty2/index' doesn't exist. Creating new index...
[junit4:junit4]   2> 6866 T2457 oasc.CachingDirectoryFactory.get return new directory for /usr/home/hudson/hudson-slave/workspace/Lucene-Solr-Tests-trunk-Java6/solr/build/solr-core/test/J1/./org.apache.solr.cloud.SyncSliceTest-1348171916040/jetty2/index forceNew:false
[junit4:junit4]   2> 6872 T2457 oasc.SolrDeletionPolicy.onCommit SolrDeletionPolicy.onCommit: commits:num=1
[junit4:junit4]   2> 		commit{dir=NRTCachingDirectory(org.apache.lucene.store.NIOFSDirectory@/usr/home/hudson/hudson-slave/workspace/Lucene-Solr-Tests-trunk-Java6/solr/build/solr-core/test/J1/org.apache.solr.cloud.SyncSliceTest-1348171916040/jetty2/index lockFactory=org.apache.lucene.store.NativeFSLockFactory@5356bd08; maxCacheMB=48.0 maxMergeSizeMB=4.0),segFN=segments_1,generation=1,filenames=[segments_1]
[junit4:junit4]   2> 6873 T2457 oasc.SolrDeletionPolicy.updateCommits newest commit = 1
[junit4:junit4]   2> 6874 T2457 oasc.SolrCore.initWriters created xml: solr.XMLResponseWriter
[junit4:junit4]   2> 6876 T2457 oasup.UpdateRequestProcessorChain.init inserting DistributedUpdateProcessorFactory into updateRequestProcessorChain "dedupe"
[junit4:junit4]   2> 6877 T2457 oasup.UpdateRequestProcessorChain.init inserting DistributedUpdateProcessorFactory into updateRequestProcessorChain "dedupe-allfields"
[junit4:junit4]   2> 6877 T2457 oasup.UpdateRequestProcessorChain.init inserting DistributedUpdateProcessorFactory into updateRequestProcessorChain "stored_sig"
[junit4:junit4]   2> 6878 T2457 oasup.UpdateRequestProcessorChain.init inserting DistributedUpdateProcessorFactory into updateRequestProcessorChain "uniq-fields"
[junit4:junit4]   2> 6879 T2457 oasup.UpdateRequestProcessorChain.init inserting DistributedUpdateProcessorFactory into updateRequestProcessorChain "distrib-dup-test-chain-implicit"
[junit4:junit4]   2> 6879 T2457 oasc.RequestHandlers.initHandlersFromConfig adding lazy requestHandler: solr.ReplicationHandler
[junit4:junit4]   2> 6880 T2457 oasc.RequestHandlers.initHandlersFromConfig created /replication: solr.ReplicationHandler
[junit4:junit4]   2> 6881 T2457 oasc.RequestHandlers.initHandlersFromConfig created standard: solr.StandardRequestHandler
[junit4:junit4]   2> 6881 T2457 oasc.RequestHandlers.initHandlersFromConfig created /get: solr.RealTimeGetHandler
[junit4:junit4]   2> 6882 T2457 oasc.RequestHandlers.initHandlersFromConfig created dismax: solr.SearchHandler
[junit4:junit4]   2> 6883 T2457 oasc.RequestHandlers.initHandlersFromConfig created mock: org.apache.solr.core.MockQuerySenderListenerReqHandler
[junit4:junit4]   2> 6883 T2457 oasc.RequestHandlers.initHandlersFromConfig created /admin/: org.apache.solr.handler.admin.AdminHandlers
[junit4:junit4]   2> 6884 T2457 oasc.RequestHandlers.initHandlersFromConfig created defaults: solr.StandardRequestHandler
[junit4:junit4]   2> 6885 T2457 oasc.RequestHandlers.initHandlersFromConfig adding lazy requestHandler: solr.StandardRequestHandler
[junit4:junit4]   2> 6885 T2457 oasc.RequestHandlers.initHandlersFromConfig created lazy: solr.StandardRequestHandler
[junit4:junit4]   2> 6886 T2457 oasc.RequestHandlers.initHandlersFromConfig created /update: solr.UpdateRequestHandler
[junit4:junit4]   2> 6887 T2457 oasc.RequestHandlers.initHandlersFromConfig created /terms: org.apache.solr.handler.component.SearchHandler
[junit4:junit4]   2> 6887 T2457 oasc.RequestHandlers.initHandlersFromConfig created spellCheckCompRH: org.apache.solr.handler.component.SearchHandler
[junit4:junit4]   2> 6888 T2457 oasc.RequestHandlers.initHandlersFromConfig created spellCheckCompRH_Direct: org.apache.solr.handler.component.SearchHandler
[junit4:junit4]   2> 6889 T2457 oasc.RequestHandlers.initHandlersFromConfig created spellCheckWithWordbreak: org.apache.solr.handler.component.SearchHandler
[junit4:junit4]   2> 6889 T2457 oasc.RequestHandlers.initHandlersFromConfig created spellCheckWithWordbreak_Direct: org.apache.solr.handler.component.SearchHandler
[junit4:junit4]   2> 6890 T2457 oasc.RequestHandlers.initHandlersFromConfig created spellCheckCompRH1: org.apache.solr.handler.component.SearchHandler
[junit4:junit4]   2> 6891 T2457 oasc.RequestHandlers.initHandlersFromConfig created tvrh: org.apache.solr.handler.component.SearchHandler
[junit4:junit4]   2> 6891 T2457 oasc.RequestHandlers.initHandlersFromConfig created /mlt: solr.MoreLikeThisHandler
[junit4:junit4]   2> 6892 T2457 oasc.RequestHandlers.initHandlersFromConfig created /debug/dump: solr.DumpRequestHandler
[junit4:junit4]   2> 6896 T2457 oashl.XMLLoader.init xsltCacheLifetimeSeconds=60
[junit4:junit4]   2> 6901 T2457 oasc.SolrCore.initDeprecatedSupport WARNING solrconfig.xml uses deprecated <admin/gettableFiles>, Please update your config to use the ShowFileRequestHandler.
[junit4:junit4]   2> 6902 T2457 oasc.SolrCore.initDeprecatedSupport WARNING adding ShowFileRequestHandler with hidden files: [SCHEMA.XML, OLD_SYNONYMS.TXT, STOPWORDS.TXT, PROTWORDS.TXT, OPEN-EXCHANGE-RATES.JSON, SYNONYMS.TXT, CURRENCY.XML, MAPPING-ISOLATIN1ACCENT.TXT]
[junit4:junit4]   2> 6907 T2457 oass.SolrIndexSearcher.<init> Opening Searcher@779fa7ac main
[junit4:junit4]   2> 6908 T2457 oasu.CommitTracker.<init> Hard AutoCommit: disabled
[junit4:junit4]   2> 6909 T2457 oasu.CommitTracker.<init> Soft AutoCommit: disabled
[junit4:junit4]   2> 6909 T2457 oashc.SpellCheckComponent.inform Initializing spell checkers
[junit4:junit4]   2> 6917 T2457 oass.DirectSolrSpellChecker.init init: {name=direct,classname=DirectSolrSpellChecker,field=lowerfilt,minQueryLength=3}
[junit4:junit4]   2> 6975 T2504 oasc.SolrCore.registerSearcher [collection1] Registered new searcher Searcher@779fa7ac main{StandardDirectoryReader(segments_1:1)}
[junit4:junit4]   2> 7320 T2478 oascc.ZkStateReader.updateClusterState Updating cloud state from ZooKeeper... 
[junit4:junit4]   2> 7335 T2477 oascc.ZkStateReader$2.process A cluster state change has occurred - updating...
[junit4:junit4]   2> 7335 T2503 oascc.ZkStateReader$2.process A cluster state change has occurred - updating...
[junit4:junit4]   2> 7335 T2491 oascc.ZkStateReader$2.process A cluster state change has occurred - updating...
[junit4:junit4]   2> 7482 T2457 oasc.CoreContainer.register registering core: collection1
[junit4:junit4]   2> 7482 T2457 oasc.ZkController.register Register shard - core:collection1 address:http://127.0.0.1:51394/solr shardId:shard1
[junit4:junit4]   2> 7485 T2457 oasc.ZkController.register We are http://127.0.0.1:51394/solr/collection1/ and leader is http://127.0.0.1:51387/solr/collection1/
[junit4:junit4]   2> 7485 T2457 oasc.ZkController.register No LogReplay needed for core=collection1 baseURL=http://127.0.0.1:51394/solr
[junit4:junit4]   2> 7486 T2457 oasc.ZkController.checkRecovery Core needs to recover:collection1
[junit4:junit4]   2> 7486 T2457 oasu.DefaultSolrCoreState.doRecovery Running recovery - first canceling any ongoing recovery
[junit4:junit4]   2> ASYNC  NEW_CORE C124 name=collection1 org.apache.solr.core.SolrCore@607661b8 url=http://127.0.0.1:51394/solr/collection1 node=127.0.0.1:51394_solr
[junit4:junit4]   2> 7487 T2505 C124 P51394 oasc.RecoveryStrategy.run Starting recovery process.  core=collection1 recoveringAfterStartup=true
[junit4:junit4]   2> 7488 T2457 oascc.ZkStateReader.updateClusterState Updating cloud state from ZooKeeper... 
[junit4:junit4]   2> 7488 T2505 C124 P51394 oasc.RecoveryStrategy.doRecovery ###### startupVersions=[]
[junit4:junit4]   2> 7489 T2457 oass.SolrDispatchFilter.init user.dir=/usr/home/hudson/hudson-slave/workspace/Lucene-Solr-Tests-trunk-Java6/solr/build/solr-core/test/J1
[junit4:junit4]   2> 7489 T2457 oass.SolrDispatchFilter.init SolrDispatchFilter.init() done
[junit4:junit4]   2> 7490 T2505 C124 P51394 oasc.RecoveryStrategy.doRecovery Attempting to PeerSync from http://127.0.0.1:51387/solr/collection1/ core=collection1 - recoveringAfterStartup=true
[junit4:junit4]   2> 7490 T2457 oascsi.HttpClientUtil.createClient Creating new http client, config:maxConnections=128&maxConnectionsPerHost=32&followRedirects=false
[junit4:junit4]   2> 7490 T2505 C124 P51394 oasu.PeerSync.sync PeerSync: core=collection1 url=http://127.0.0.1:51394/solr START replicas=[http://127.0.0.1:51387/solr/collection1/] nUpdates=100
[junit4:junit4]   2> 7491 T2505 C124 P51394 oasu.PeerSync.sync WARNING no frame of reference to tell of we've missed updates
[junit4:junit4]   2> 7491 T2505 C124 P51394 oasc.RecoveryStrategy.doRecovery PeerSync Recovery was not successful - trying replication. core=collection1
[junit4:junit4]   2> 7491 T2505 C124 P51394 oasc.RecoveryStrategy.doRecovery Starting Replication Recovery. core=collection1
[junit4:junit4]   2> 7491 T2505 C124 P51394 oascsi.HttpClientUtil.createClient Creating new http client, config:maxConnections=128&maxConnectionsPerHost=32&followRedirects=false
[junit4:junit4]   2> ASYNC  NEW_CORE C125 name=collection1 org.apache.solr.core.SolrCore@440d6032 url=http://127.0.0.1:51387/solr/collection1 node=127.0.0.1:51387_solr
[junit4:junit4]   2> 7506 T2483 C125 P51387 REQ /get {distrib=false&qt=/get&wt=javabin&version=2&getVersions=100} status=0 QTime=1 
[junit4:junit4]   2> 7839 T2478 oascc.ZkStateReader.updateClusterState Updating cloud state from ZooKeeper... 
[junit4:junit4]   2> 7843 T2503 oascc.ZkStateReader$2.process A cluster state change has occurred - updating...
[junit4:junit4]   2> 7843 T2477 oascc.ZkStateReader$2.process A cluster state change has occurred - updating...
[junit4:junit4]   2> 7843 T2491 oascc.ZkStateReader$2.process A cluster state change has occurred - updating...
[junit4:junit4]   2> 7965 T2457 oejs.Server.doStart jetty-8.1.2.v20120308
[junit4:junit4]   2> 7968 T2457 oejs.AbstractConnector.doStart Started SocketConnector@0.0.0.0:51400
[junit4:junit4]   2> 7968 T2457 oasc.SolrResourceLoader.locateSolrHome JNDI not configured for solr (NoInitialContextEx)
[junit4:junit4]   2> 7969 T2457 oasc.SolrResourceLoader.locateSolrHome using system property solr.solr.home: /usr/home/hudson/hudson-slave/workspace/Lucene-Solr-Tests-trunk-Java6/solr/build/solr-core/test/J1/./solrtest-jetty3-1348171923546
[junit4:junit4]   2> 7969 T2457 oasc.SolrResourceLoader.<init> new SolrResourceLoader for deduced Solr Home: '/usr/home/hudson/hudson-slave/workspace/Lucene-Solr-Tests-trunk-Java6/solr/build/solr-core/test/J1/./solrtest-jetty3-1348171923546/'
[junit4:junit4]   2> 8003 T2457 oass.SolrDispatchFilter.init SolrDispatchFilter.init()
[junit4:junit4]   2> 8004 T2457 oasc.SolrResourceLoader.locateSolrHome JNDI not configured for solr (NoInitialContextEx)
[junit4:junit4]   2> 8004 T2457 oasc.SolrResourceLoader.locateSolrHome using system property solr.solr.home: /usr/home/hudson/hudson-slave/workspace/Lucene-Solr-Tests-trunk-Java6/solr/build/solr-core/test/J1/./solrtest-jetty3-1348171923546
[junit4:junit4]   2> 8005 T2457 oasc.CoreContainer$Initializer.initialize looking for solr.xml: /usr/home/hudson/hudson-slave/workspace/Lucene-Solr-Tests-trunk-Java6/solr/build/solr-core/test/J1/./solrtest-jetty3-1348171923546/solr.xml
[junit4:junit4]   2> 8005 T2457 oasc.CoreContainer.<init> New CoreContainer 523304716
[junit4:junit4]   2> 8006 T2457 oasc.CoreContainer.load Loading CoreContainer using Solr Home: '/usr/home/hudson/hudson-slave/workspace/Lucene-Solr-Tests-trunk-Java6/solr/build/solr-core/test/J1/./solrtest-jetty3-1348171923546/'
[junit4:junit4]   2> 8006 T2457 oasc.SolrResourceLoader.<init> new SolrResourceLoader for directory: '/usr/home/hudson/hudson-slave/workspace/Lucene-Solr-Tests-trunk-Java6/solr/build/solr-core/test/J1/./solrtest-jetty3-1348171923546/'
[junit4:junit4]   2> 8030 T2457 oasc.CoreContainer.load Registering Log Listener
[junit4:junit4]   2> 8045 T2457 oasc.CoreContainer.initZooKeeper Zookeeper client=127.0.0.1:51376/solr
[junit4:junit4]   2> 8046 T2457 oaz.ZooKeeper.<init> Initiating client connection, connectString=127.0.0.1:51376/solr sessionTimeout=5000 watcher=org.apache.solr.common.cloud.ConnectionManager@6f0b2674
[junit4:junit4]   2> 8047 T2516 oaz.ClientCnxn$SendThread.startConnect Opening socket connection to server /127.0.0.1:51376
[junit4:junit4]   2> 8047 T2457 oascc.ConnectionManager.waitForConnected Waiting for client to connect to ZooKeeper
[junit4:junit4]   2> 8047 T2516 oaz.ClientCnxn$SendThread.primeConnection Socket connection established to localhost/127.0.0.1:51376, initiating session
[junit4:junit4]   2> 8048 T2459 oazs.NIOServerCnxn$Factory.run Accepted socket connection from /140.211.11.196:51401
[junit4:junit4]   2> 8048 T2459 oazs.NIOServerCnxn.readConnectRequest Client attempting to establish new session at /140.211.11.196:51401
[junit4:junit4]   2> 8049 T2461 oazs.NIOServerCnxn.finishSessionInit Established session 0x139e54ee30e0005 with negotiated timeout 5000 for client /140.211.11.196:51401
[junit4:junit4]   2> 8050 T2516 oaz.ClientCnxn$SendThread.readConnectResult Session establishment complete on server localhost/127.0.0.1:51376, sessionid = 0x139e54ee30e0005, negotiated timeout = 5000
[junit4:junit4]   2> 8050 T2517 oascc.ConnectionManager.process Watcher org.apache.solr.common.cloud.ConnectionManager@6f0b2674 name:ZooKeeperConnection Watcher:127.0.0.1:51376/solr got event WatchedEvent state:SyncConnected type:None path:null path:null type:None
[junit4:junit4]   2> 8050 T2457 oascc.ConnectionManager.waitForConnected Client is connected to ZooKeeper
[junit4:junit4]   2> 8051 T2462 oazs.PrepRequestProcessor.pRequest Got user-level KeeperException when processing sessionid:0x139e54ee30e0005 type:create cxid:0x1 zxid:0xfffffffffffffffe txntype:unknown reqpath:n/a Error Path:/solr/overseer Error:KeeperErrorCode = NodeExists for /solr/overseer
[junit4:junit4]   2> 8052 T2462 oazs.PrepRequestProcessor.pRequest Got user-level KeeperException when processing sessionid:0x139e54ee30e0005 type:create cxid:0x2 zxid:0xfffffffffffffffe txntype:unknown reqpath:n/a Error Path:/solr/overseer Error:KeeperErrorCode = NodeExists for /solr/overseer
[junit4:junit4]   2> 8061 T2457 oasc.ZkController.createEphemeralLiveNode Register node as live in ZooKeeper:/live_nodes/127.0.0.1:51400_solr
[junit4:junit4]   2> 8061 T2462 oazs.PrepRequestProcessor.pRequest Got user-level KeeperException when processing sessionid:0x139e54ee30e0005 type:delete cxid:0x4 zxid:0xfffffffffffffffe txntype:unknown reqpath:n/a Error Path:/solr/live_nodes/127.0.0.1:51400_solr Error:KeeperErrorCode = NoNode for /solr/live_nodes/127.0.0.1:51400_solr
[junit4:junit4]   2> 8062 T2457 oascc.SolrZkClient.makePath makePath: /live_nodes/127.0.0.1:51400_solr
[junit4:junit4]   2> 8064 T2503 oascc.ZkStateReader$3.process Updating live nodes
[junit4:junit4]   2> 8064 T2477 oascc.ZkStateReader$3.process Updating live nodes
[junit4:junit4]   2> 8064 T2491 oascc.ZkStateReader$3.process Updating live nodes
[junit4:junit4]   2> 8065 T2457 oashc.HttpShardHandlerFactory.getParameter Setting socketTimeout to: 0
[junit4:junit4]   2> 8065 T2457 oashc.HttpShardHandlerFactory.getParameter Setting urlScheme to: http://
[junit4:junit4]   2> 8066 T2457 oashc.HttpShardHandlerFactory.getParameter Setting connTimeout to: 0
[junit4:junit4]   2> 8066 T2457 oashc.HttpShardHandlerFactory.getParameter Setting maxConnectionsPerHost to: 20
[junit4:junit4]   2> 8067 T2457 oashc.HttpShardHandlerFactory.getParameter Setting corePoolSize to: 0
[junit4:junit4]   2> 8067 T2457 oashc.HttpShardHandlerFactory.getParameter Setting maximumPoolSize to: 2147483647
[junit4:junit4]   2> 8068 T2457 oashc.HttpShardHandlerFactory.getParameter Setting maxThreadIdleTime to: 5
[junit4:junit4]   2> 8068 T2457 oashc.HttpShardHandlerFactory.getParameter Setting sizeOfQueue to: -1
[junit4:junit4]   2> 8068 T2457 oashc.HttpShardHandlerFactory.getParameter Setting fairnessPolicy to: false
[junit4:junit4]   2> 8069 T2457 oascsi.HttpClientUtil.createClient Creating new http client, config:maxConnectionsPerHost=20&maxConnections=10000&socketTimeout=0&connTimeout=0&retry=false
[junit4:junit4]   2> 8085 T2457 oascc.ZkStateReader.createClusterStateWatchersAndUpdate Updating cluster state from ZooKeeper... 
[junit4:junit4]   2> 8091 T2457 oasc.CoreContainer.create Creating SolrCore 'collection1' using instanceDir: /usr/home/hudson/hudson-slave/workspace/Lucene-Solr-Tests-trunk-Java6/solr/build/solr-core/test/J1/./solrtest-jetty3-1348171923546/collection1
[junit4:junit4]   2> 8091 T2457 oasc.ZkController.createCollectionZkNode Check for collection zkNode:collection1
[junit4:junit4]   2> 8092 T2457 oasc.ZkController.createCollectionZkNode Collection zkNode exists
[junit4:junit4]   2> 8093 T2457 oasc.ZkController.readConfigName Load collection config from:/collections/collection1
[junit4:junit4]   2> 8094 T2457 oasc.SolrResourceLoader.<init> new SolrResourceLoader for directory: '/usr/home/hudson/hudson-slave/workspace/Lucene-Solr-Tests-trunk-Java6/solr/build/solr-core/test/J1/./solrtest-jetty3-1348171923546/collection1/'
[junit4:junit4]   2> 8095 T2457 oasc.SolrResourceLoader.replaceClassLoader Adding 'file:/usr/home/hudson/hudson-slave/workspace/Lucene-Solr-Tests-trunk-Java6/solr/build/solr-core/test/J1/solrtest-jetty3-1348171923546/collection1/lib/README' to classloader
[junit4:junit4]   2> 8096 T2457 oasc.SolrResourceLoader.replaceClassLoader Adding 'file:/usr/home/hudson/hudson-slave/workspace/Lucene-Solr-Tests-trunk-Java6/solr/build/solr-core/test/J1/solrtest-jetty3-1348171923546/collection1/lib/classes/' to classloader
[junit4:junit4]   2> 8146 T2457 oasc.SolrConfig.<init> Using Lucene MatchVersion: LUCENE_50
[junit4:junit4]   2> 8220 T2457 oasc.SolrConfig.<init> Loaded SolrConfig: solrconfig.xml
[junit4:junit4]   2> 8321 T2457 oass.IndexSchema.readSchema Reading Solr Schema
[junit4:junit4]   2> 8329 T2457 oass.IndexSchema.readSchema Schema name=test
[junit4:junit4]   2> 8986 T2457 oass.OpenExchangeRatesOrgProvider.init Initialized with rates=open-exchange-rates.json, refreshInterval=1440.
[junit4:junit4]   2> 8993 T2457 oass.IndexSchema.readSchema default search field in schema is text
[junit4:junit4]   2> 8996 T2457 oass.IndexSchema.readSchema unique key field: id
[junit4:junit4]   2> 9005 T2457 oass.FileExchangeRateProvider.reload Reloading exchange rates from file currency.xml
[junit4:junit4]   2> 9008 T2457 oass.FileExchangeRateProvider.reload Reloading exchange rates from file currency.xml
[junit4:junit4]   2> 9011 T2457 oass.OpenExchangeRatesOrgProvider.reload Reloading exchange rates from open-exchange-rates.json
[junit4:junit4]   2> 9012 T2457 oass.OpenExchangeRatesOrgProvider.reload Reloading exchange rates from open-exchange-rates.json
[junit4:junit4]   2> 9013 T2457 oasc.SolrCore.<init> [collection1] Opening new SolrCore at /usr/home/hudson/hudson-slave/workspace/Lucene-Solr-Tests-trunk-Java6/solr/build/solr-core/test/J1/./solrtest-jetty3-1348171923546/collection1/, dataDir=./org.apache.solr.cloud.SyncSliceTest-1348171916040/jetty3/
[junit4:junit4]   2> 9013 T2457 oasc.JmxMonitoredMap.<init> JMX monitoring is enabled. Adding Solr mbeans to JMX Server: com.sun.jmx.mbeanserver.JmxMBeanServer@729b1670
[junit4:junit4]   2> 9014 T2457 oasc.SolrCore.getNewIndexDir WARNING New index directory detected: old=null new=./org.apache.solr.cloud.SyncSliceTest-1348171916040/jetty3/index/
[junit4:junit4]   2> 9015 T2457 oasc.SolrCore.initIndex WARNING [collection1] Solr index directory './org.apache.solr.cloud.SyncSliceTest-1348171916040/jetty3/index' doesn't exist. Creating new index...
[junit4:junit4]   2> 9015 T2457 oasc.CachingDirectoryFactory.get return new directory for /usr/home/hudson/hudson-slave/workspace/Lucene-Solr-Tests-trunk-Java6/solr/build/solr-core/test/J1/./org.apache.solr.cloud.SyncSliceTest-1348171916040/jetty3/index forceNew:false
[junit4:junit4]   2> 9020 T2457 oasc.SolrDeletionPolicy.onCommit SolrDeletionPolicy.onCommit: commits:num=1
[junit4:junit4]   2> 		commit{dir=NRTCachingDirectory(org.apache.lucene.store.NIOFSDirectory@/usr/home/hudson/hudson-slave/workspace/Lucene-Solr-Tests-trunk-Java6/solr/build/solr-core/test/J1/org.apache.solr.cloud.SyncSliceTest-1348171916040/jetty3/index lockFactory=org.apache.lucene.store.NativeFSLockFactory@58c00adc; maxCacheMB=48.0 maxMergeSizeMB=4.0),segFN=segments_1,generation=1,filenames=[segments_1]
[junit4:junit4]   2> 9021 T2457 oasc.SolrDeletionPolicy.updateCommits newest commit = 1
[junit4:junit4]   2> 9021 T2457 oasc.SolrCore.initWriters created xml: solr.XMLResponseWriter
[junit4:junit4]   2> 9023 T2457 oasup.UpdateRequestProcessorChain.init inserting DistributedUpdateProcessorFactory into updateRequestProcessorChain "dedupe"
[junit4:junit4]   2> 9023 T2457 oasup.UpdateRequestProcessorChain.init inserting DistributedUpdateProcessorFactory into updateRequestProcessorChain "dedupe-allfields"
[junit4:junit4]   2> 9024 T2457 oasup.UpdateRequestProcessorChain.init inserting DistributedUpdateProcessorFactory into updateRequestProcessorChain "stored_sig"
[junit4:junit4]   2> 9024 T2457 oasup.UpdateRequestProcessorChain.init inserting DistributedUpdateProcessorFactory into updateRequestProcessorChain "uniq-fields"
[junit4:junit4]   2> 9025 T2457 oasup.UpdateRequestProcessorChain.init inserting DistributedUpdateProcessorFactory into updateRequestProcessorChain "distrib-dup-test-chain-implicit"
[junit4:junit4]   2> 9025 T2457 oasc.RequestHandlers.initHandlersFromConfig adding lazy requestHandler: solr.ReplicationHandler
[junit4:junit4]   2> 9025 T2457 oasc.RequestHandlers.initHandlersFromConfig created /replication: solr.ReplicationHandler
[junit4:junit4]   2> 9026 T2457 oasc.RequestHandlers.initHandlersFromConfig created standard: solr.StandardRequestHandler
[junit4:junit4]   2> 9026 T2457 oasc.RequestHandlers.initHandlersFromConfig created /get: solr.RealTimeGetHandler
[junit4:junit4]   2> 9027 T2457 oasc.RequestHandlers.initHandlersFromConfig created dismax: solr.SearchHandler
[junit4:junit4]   2> 9027 T2457 oasc.RequestHandlers.initHandlersFromConfig created mock: org.apache.solr.core.MockQuerySenderListenerReqHandler
[junit4:junit4]   2> 9028 T2457 oasc.RequestHandlers.initHandlersFromConfig created /admin/: org.apache.solr.handler.admin.AdminHandlers
[junit4:junit4]   2> 9028 T2457 oasc.RequestHandlers.initHandlersFromConfig created defaults: solr.StandardRequestHandler
[junit4:junit4]   2> 9028 T2457 oasc.RequestHandlers.initHandlersFromConfig adding lazy requestHandler: solr.StandardRequestHandler
[junit4:junit4]   2> 9029 T2457 oasc.RequestHandlers.initHandlersFromConfig created lazy: solr.StandardRequestHandler
[junit4:junit4]   2> 9029 T2457 oasc.RequestHandlers.initHandlersFromConfig created /update: solr.UpdateRequestHandler
[junit4:junit4]   2> 9030 T2457 oasc.RequestHandlers.initHandlersFromConfig created /terms: org.apache.solr.handler.component.SearchHandler
[junit4:junit4]   2> 9030 T2457 oasc.RequestHandlers.initHandlersFromConfig created spellCheckCompRH: org.apache.solr.handler.component.SearchHandler
[junit4:junit4]   2> 9031 T2457 oasc.RequestHandlers.initHandlersFromConfig created spellCheckCompRH_Direct: org.apache.solr.handler.component.SearchHandler
[junit4:junit4]   2> 9031 T2457 oasc.RequestHandlers.initHandlersFromConfig created spellCheckWithWordbreak: org.apache.solr.handler.component.SearchHandler
[junit4:junit4]   2> 9031 T2457 oasc.RequestHandlers.initHandlersFromConfig created spellCheckWithWordbreak_Direct: org.apache.solr.handler.component.SearchHandler
[junit4:junit4]   2> 9032 T2457 oasc.RequestHandlers.initHandlersFromConfig created spellCheckCompRH1: org.apache.solr.handler.component.SearchHandler
[junit4:junit4]   2> 9032 T2457 oasc.RequestHandlers.initHandlersFromConfig created tvrh: org.apache.solr.handler.component.SearchHandler
[junit4:junit4]   2> 9033 T2457 oasc.RequestHandlers.initHandlersFromConfig created /mlt: solr.MoreLikeThisHandler
[junit4:junit4]   2> 9033 T2457 oasc.RequestHandlers.initHandlersFromConfig created /debug/dump: solr.DumpRequestHandler
[junit4:junit4]   2> 9036 T2457 oashl.XMLLoader.init xsltCacheLifetimeSeconds=60
[junit4:junit4]   2> 9039 T2457 oasc.SolrCore.initDeprecatedSupport WARNING solrconfig.xml uses deprecated <admin/gettableFiles>, Please update your config to use the ShowFileRequestHandler.
[junit4:junit4]   2> 9040 T2457 oasc.SolrCore.initDeprecatedSupport WARNING adding ShowFileRequestHandler with hidden files: [SCHEMA.XML, OLD_SYNONYMS.TXT, STOPWORDS.TXT, PROTWORDS.TXT, OPEN-EXCHANGE-RATES.JSON, SYNONYMS.TXT, CURRENCY.XML, MAPPING-ISOLATIN1ACCENT.TXT]
[junit4:junit4]   2> 9043 T2457 oass.SolrIndexSearcher.<init> Opening Searcher@1cd938cb main
[junit4:junit4]   2> 9043 T2457 oasu.CommitTracker.<init> Hard AutoCommit: disabled
[junit4:junit4]   2> 9044 T2457 oasu.CommitTracker.<init> Soft AutoCommit: disabled
[junit4:junit4]   2> 9044 T2457 oashc.SpellCheckComponent.inform Initializing spell checkers
[junit4:junit4]   2> 9050 T2457 oass.DirectSolrSpellChecker.init init: {name=direct,classname=DirectSolrSpellChecker,field=lowerfilt,minQueryLength=3}
[junit4:junit4]   2> 9098 T2518 oasc.SolrCore.registerSearcher [collection1] Registered new searcher Searcher@1cd938cb main{StandardDirectoryReader(segments_1:1)}
[junit4:junit4]   2> 9357 T2478 oascc.ZkStateReader.updateClusterState Updating cloud state from ZooKeeper... 
[junit4:junit4]   2> 9370 T2503 oascc.ZkStateReader$2.process A cluster state change has occurred - updating...
[junit4:junit4]   2> 9370 T2517 oascc.ZkStateReader$2.process A cluster state change has occurred - updating...
[junit4:junit4]   2> 9370 T2477 oascc.ZkStateReader$2.process A cluster state change has occurred - updating...
[junit4:junit4]   2> 9370 T2491 oascc.ZkStateReader$2.process A cluster state change has occurred - updating...
[junit4:junit4]   2> 9603 T2457 oasc.CoreContainer.register registering core: collection1
[junit4:junit4]   2> 9603 T2457 oasc.ZkController.register Register shard - core:collection1 address:http://127.0.0.1:51400/solr shardId:shard1
[junit4:junit4]   2> 9608 T2457 oasc.ZkController.register We are http://127.0.0.1:51400/solr/collection1/ and leader is http://127.0.0.1:51387/solr/collection1/
[junit4:junit4]   2> 9609 T2457 oasc.ZkController.register No LogReplay needed for core=collection1 baseURL=http://127.0.0.1:51400/solr
[junit4:junit4]   2> 9609 T2457 oasc.ZkController.checkRecovery Core needs to recover:collection1
[junit4:junit4]   2> 9609 T2457 oasu.DefaultSolrCoreState.doRecovery Running recovery - first canceling any ongoing recovery
[junit4:junit4]   2> ASYNC  NEW_CORE C126 name=collection1 org.apache.solr.core.SolrCore@6d291a64 url=http://127.0.0.1:51400/solr/collection1 node=127.0.0.1:51400_solr
[junit4:junit4]   2> 9611 T2519 C126 P51400 oasc.RecoveryStrategy.run Starting recovery process.  core=collection1 recoveringAfterStartup=true
[junit4:junit4]   2> 9611 T2519 C126 P51400 oasc.RecoveryStrategy.doRecovery ###### startupVersions=[]
[junit4:junit4]   2> 9611 T2457 oascc.ZkStateReader.updateClusterState Updating cloud state from ZooKeeper... 
[junit4:junit4]   2> 9612 T2457 oass.SolrDispatchFilter.init user.dir=/usr/home/hudson/hudson-slave/workspace/Lucene-Solr-Tests-trunk-Java6/solr/build/solr-core/test/J1
[junit4:junit4]   2> 9612 T2457 oass.SolrDispatchFilter.init SolrDispatchFilter.init() done
[junit4:junit4]   2> 9613 T2457 oascsi.HttpClientUtil.createClient Creating new http client, config:maxConnections=128&maxConnectionsPerHost=32&followRedirects=false
[junit4:junit4]   2> 9615 T2519 C126 P51400 oasc.RecoveryStrategy.doRecovery Attempting to PeerSync from http://127.0.0.1:51387/solr/collection1/ core=collection1 - recoveringAfterStartup=true
[junit4:junit4]   2> 9615 T2519 C126 P51400 oasu.PeerSync.sync PeerSync: core=collection1 url=http://127.0.0.1:51400/solr START replicas=[http://127.0.0.1:51387/solr/collection1/] nUpdates=100
[junit4:junit4]   2> 9616 T2519 C126 P51400 oasu.PeerSync.sync WARNING no frame of reference to tell of we've missed updates
[junit4:junit4]   2> 9616 T2519 C126 P51400 oasc.RecoveryStrategy.doRecovery PeerSync Recovery was not successful - trying replication. core=collection1
[junit4:junit4]   2> 9616 T2519 C126 P51400 oasc.RecoveryStrategy.doRecovery Starting Replication Recovery. core=collection1
[junit4:junit4]   2> 9617 T2519 C126 P51400 oascsi.HttpClientUtil.createClient Creating new http client, config:maxConnections=128&maxConnectionsPerHost=32&followRedirects=false
[junit4:junit4]   2> 9618 T2483 C125 P51387 REQ /get {distrib=false&qt=/get&wt=javabin&version=2&getVersions=100} status=0 QTime=0 
[junit4:junit4]   2> 9874 T2478 oascc.ZkStateReader.updateClusterState Updating cloud state from ZooKeeper... 
[junit4:junit4]   2> 9887 T2503 oascc.ZkStateReader$2.process A cluster state change has occurred - updating...
[junit4:junit4]   2> 9887 T2477 oascc.ZkStateReader$2.process A cluster state change has occurred - updating...
[junit4:junit4]   2> 9887 T2491 oascc.ZkStateReader$2.process A cluster state change has occurred - updating...
[junit4:junit4]   2> 9887 T2517 oascc.ZkStateReader$2.process A cluster state change has occurred - updating...
[junit4:junit4]   2> 10097 T2457 oejs.Server.doStart jetty-8.1.2.v20120308
[junit4:junit4]   2> 10100 T2457 oejs.AbstractConnector.doStart Started SocketConnector@0.0.0.0:51406
[junit4:junit4]   2> 10101 T2457 oasc.SolrResourceLoader.locateSolrHome JNDI not configured for solr (NoInitialContextEx)
[junit4:junit4]   2> 10101 T2457 oasc.SolrResourceLoader.locateSolrHome using system property solr.solr.home: /usr/home/hudson/hudson-slave/workspace/Lucene-Solr-Tests-trunk-Java6/solr/build/solr-core/test/J1/./solrtest-jetty4-1348171925669
[junit4:junit4]   2> 10102 T2457 oasc.SolrResourceLoader.<init> new SolrResourceLoader for deduced Solr Home: '/usr/home/hudson/hudson-slave/workspace/Lucene-Solr-Tests-trunk-Java6/solr/build/solr-core/test/J1/./solrtest-jetty4-1348171925669/'
[junit4:junit4]   2> 10136 T2457 oass.SolrDispatchFilter.init SolrDispatchFilter.init()
[junit4:junit4]   2> 10136 T2457 oasc.SolrResourceLoader.locateSolrHome JNDI not configured for solr (NoInitialContextEx)
[junit4:junit4]   2> 10137 T2457 oasc.SolrResourceLoader.locateSolrHome using system property solr.solr.home: /usr/home/hudson/hudson-slave/workspace/Lucene-Solr-Tests-trunk-Java6/solr/build/solr-core/test/J1/./solrtest-jetty4-1348171925669
[junit4:junit4]   2> 10137 T2457 oasc.CoreContainer$Initializer.initialize looking for solr.xml: /usr/home/hudson/hudson-slave/workspace/Lucene-Solr-Tests-trunk-Java6/solr/build/solr-core/test/J1/./solrtest-jetty4-1348171925669/solr.xml
[junit4:junit4]   2> 10138 T2457 oasc.CoreContainer.<init> New CoreContainer 30625444
[junit4:junit4]   2> 10138 T2457 oasc.CoreContainer.load Loading CoreContainer using Solr Home: '/usr/home/hudson/hudson-slave/workspace/Lucene-Solr-Tests-trunk-Java6/solr/build/solr-core/test/J1/./solrtest-jetty4-1348171925669/'
[junit4:junit4]   2> 10139 T2457 oasc.SolrResourceLoader.<init> new SolrResourceLoader for directory: '/usr/home/hudson/hudson-slave/workspace/Lucene-Solr-Tests-trunk-Java6/solr/build/solr-core/test/J1/./solrtest-jetty4-1348171925669/'
[junit4:junit4]   2> 10163 T2457 oasc.CoreContainer.load Registering Log Listener
[junit4:junit4]   2> 10179 T2457 oasc.CoreContainer.initZooKeeper Zookeeper client=127.0.0.1:51376/solr
[junit4:junit4]   2> 10180 T2457 oaz.ZooKeeper.<init> Initiating client connection, connectString=127.0.0.1:51376/solr sessionTimeout=5000 watcher=org.apache.solr.common.cloud.ConnectionManager@1513a857
[junit4:junit4]   2> 10181 T2530 oaz.ClientCnxn$SendThread.startConnect Opening socket connection to server /127.0.0.1:51376
[junit4:junit4]   2> 10181 T2457 oascc.ConnectionManager.waitForConnected Waiting for client to connect to ZooKeeper
[junit4:junit4]   2> 10181 T2530 oaz.ClientCnxn$SendThread.primeConnection Socket connection established to localhost/127.0.0.1:51376, initiating session
[junit4:junit4]   2> 10182 T2459 oazs.NIOServerCnxn$Factory.run Accepted socket connection from /140.211.11.196:51408
[junit4:junit4]   2> 10182 T2459 oazs.NIOServerCnxn.readConnectRequest Client attempting to establish new session at /140.211.11.196:51408
[junit4:junit4]   2> 10183 T2461 oazs.NIOServerCnxn.finishSessionInit Established session 0x139e54ee30e0006 with negotiated timeout 5000 for client /140.211.11.196:51408
[junit4:junit4]   2> 10183 T2530 oaz.ClientCnxn$SendThread.readConnectResult Session establishment complete on server localhost/127.0.0.1:51376, sessionid = 0x139e54ee30e0006, negotiated timeout = 5000
[junit4:junit4]   2> 10184 T2531 oascc.ConnectionManager.process Watcher org.apache.solr.common.cloud.ConnectionManager@1513a857 name:ZooKeeperConnection Watcher:127.0.0.1:51376/solr got event WatchedEvent state:SyncConnected type:None path:null path:null type:None
[junit4:junit4]   2> 10184 T2457 oascc.ConnectionManager.waitForConnected Client is connected to ZooKeeper
[junit4:junit4]   2> 10185 T2462 oazs.PrepRequestProcessor.pRequest Got user-level KeeperException when processing sessionid:0x139e54ee30e0006 type:create cxid:0x1 zxid:0xfffffffffffffffe txntype:unknown reqpath:n/a Error Path:/solr/overseer Error:KeeperErrorCode = NodeExists for /solr/overseer
[junit4:junit4]   2> 10186 T2462 oazs.PrepRequestProcessor.pRequest Got user-level KeeperException when processing sessionid:0x139e54ee30e0006 type:create cxid:0x2 zxid:0xfffffffffffffffe txntype:unknown reqpath:n/a Error Path:/solr/overseer Error:KeeperErrorCode = NodeExists for /solr/overseer
[junit4:junit4]   2> 10194 T2457 oasc.ZkController.createEphemeralLiveNode Register node as live in ZooKeeper:/live_nodes/127.0.0.1:51406_solr
[junit4:junit4]   2> 10194 T2462 oazs.PrepRequestProcessor.pRequest Got user-level KeeperException when processing sessionid:0x139e54ee30e0006 type:delete cxid:0x4 zxid:0xfffffffffffffffe txntype:unknown reqpath:n/a Error Path:/solr/live_nodes/127.0.0.1:51406_solr Error:KeeperErrorCode = NoNode for /solr/live_nodes/127.0.0.1:51406_solr
[junit4:junit4]   2> 10195 T2457 oascc.SolrZkClient.makePath makePath: /live_nodes/127.0.0.1:51406_solr
[junit4:junit4]   2> 10201 T2503 oascc.ZkStateReader$3.process Updating live nodes
[junit4:junit4]   2> 10201 T2517 oascc.ZkStateReader$3.process Updating live nodes
[junit4:junit4]   2> 10201 T2491 oascc.ZkStateReader$3.process Updating live nodes
[junit4:junit4]   2> 10201 T2477 oascc.ZkStateReader$3.process Updating live nodes
[junit4:junit4]   2> 10202 T2457 oashc.HttpShardHandlerFactory.getParameter Setting socketTimeout to: 0
[junit4:junit4]   2> 10203 T2457 oashc.HttpShardHandlerFactory.getParameter Setting urlScheme to: http://
[junit4:junit4]   2> 10203 T2457 oashc.HttpShardHandlerFactory.getParameter Setting connTimeout to: 0
[junit4:junit4]   2> 10203 T2457 oashc.HttpShardHandlerFactory.getParameter Setting maxConnectionsPerHost to: 20
[junit4:junit4]   2> 10203 T2457 oashc.HttpShardHandlerFactory.getParameter Setting corePoolSize to: 0
[junit4:junit4]   2> 10204 T2457 oashc.HttpShardHandlerFactory.getParameter Setting maximumPoolSize to: 2147483647
[junit4:junit4]   2> 10204 T2457 oashc.HttpShardHandlerFactory.getParameter Setting maxThreadIdleTime to: 5
[junit4:junit4]   2> 10204 T2457 oashc.HttpShardHandlerFactory.getParameter Setting sizeOfQueue to: -1
[junit4:junit4]   2> 10205 T2457 oashc.HttpShardHandlerFactory.getParameter Setting fairnessPolicy to: false
[junit4:junit4]   2> 10205 T2457 oascsi.HttpClientUtil.createClient Creating new http client, config:maxConnectionsPerHost=20&maxConnections=10000&socketTimeout=0&connTimeout=0&retry=false
[junit4:junit4]   2> 10219 T2457 oascc.ZkStateReader.createClusterStateWatchersAndUpdate Updating cluster state from ZooKeeper... 
[junit4:junit4]   2> 10224 T2457 oasc.CoreContainer.create Creating SolrCore 'collection1' using instanceDir: /usr/home/hudson/hudson-slave/workspace/Lucene-Solr-Tests-trunk-Java6/solr/build/solr-core/test/J1/./solrtest-jetty4-1348171925669/collection1
[junit4:junit4]   2> 10225 T2457 oasc.ZkController.createCollectionZkNode Check for collection zkNode:collection1
[junit4:junit4]   2> 10225 T2457 oasc.ZkController.createCollectionZkNode Collection zkNode exists
[junit4:junit4]   2> 10226 T2457 oasc.ZkController.readConfigName Load collection config from:/collections/collection1
[junit4:junit4]   2> 10227 T2457 oasc.SolrResourceLoader.<init> new SolrResourceLoader for directory: '/usr/home/hudson/hudson-slave/workspace/Lucene-Solr-Tests-trunk-Java6/solr/build/solr-core/test/J1/./solrtest-jetty4-1348171925669/collection1/'
[junit4:junit4]   2> 10228 T2457 oasc.SolrResourceLoader.replaceClassLoader Adding 'file:/usr/home/hudson/hudson-slave/workspace/Lucene-Solr-Tests-trunk-Java6/solr/build/solr-core/test/J1/solrtest-jetty4-1348171925669/collection1/lib/classes/' to classloader
[junit4:junit4]   2> 10228 T2457 oasc.SolrResourceLoader.replaceClassLoader Adding 'file:/usr/home/hudson/hudson-slave/workspace/Lucene-Solr-Tests-trunk-Java6/solr/build/solr-core/test/J1/solrtest-jetty4-1348171925669/collection1/lib/README' to classloader
[junit4:junit4]   2> 10269 T2457 oasc.SolrConfig.<init> Using Lucene MatchVersion: LUCENE_50
[junit4:junit4]   2> 10328 T2457 oasc.SolrConfig.<init> Loaded SolrConfig: solrconfig.xml
[junit4:junit4]   2> 10429 T2457 oass.IndexSchema.readSchema Reading Solr Schema
[junit4:junit4]   2> 10436 T2457 oass.IndexSchema.readSchema Schema name=test
[junit4:junit4]   2>  C124_STATE=coll:collection1 core:collection1 props:{shard=shard1, roles=null, state=recovering, core=collection1, collection=collection1, node_name=127.0.0.1:51394_solr, base_url=http://127.0.0.1:51394/solr}
[junit4:junit4]   2> 10512 T2505 C124 P51394 oasc.RecoveryStrategy.doRecovery Begin buffering updates. core=collection1
[junit4:junit4]   2> 10512 T2505 C124 P51394 oasu.UpdateLog.bufferUpdates Starting to buffer updates. FSUpdateLog{state=ACTIVE, tlog=null}
[junit4:junit4]   2> 10512 T2505 C124 P51394 oasc.RecoveryStrategy.replicate Attempting to replicate from http://127.0.0.1:51387/solr/collection1/. core=collection1
[junit4:junit4]   2> 10512 T2505 C124 P51394 oascsi.HttpClientUtil.createClient Creating new http client, config:maxConnections=128&maxConnectionsPerHost=32&followRedirects=false
[junit4:junit4]   2> 10525 T2486 C125 P51387 oasu.DirectUpdateHandler2.commit start commit{flags=0,_version_=0,optimize=false,openSearcher=true,waitSearcher=true,expungeDeletes=false,softCommit=false}
[junit4:junit4]   2> 10533 T2486 C125 P51387 oasc.SolrDeletionPolicy.onInit SolrDeletionPolicy.onInit: commits:num=1
[junit4:junit4]   2> 		commit{dir=NRTCachingDirectory(org.apache.lucene.store.NIOFSDirectory@/usr/home/hudson/hudson-slave/workspace/Lucene-Solr-Tests-trunk-Java6/solr/build/solr-core/test/J1/org.apache.solr.cloud.SyncSliceTest-1348171916040/jetty1/index lockFactory=org.apache.lucene.store.NativeFSLockFactory@4144712c; maxCacheMB=48.0 maxMergeSizeMB=4.0),segFN=segments_1,generation=1,filenames=[segments_1]
[junit4:junit4]   2> 10534 T2486 C125 P51387 oasc.SolrDeletionPolicy.updateCommits newest commit = 1
[junit4:junit4]   2> 10536 T2486 C125 P51387 oass.SolrIndexSearcher.<init> Opening Searcher@19d9ce31 main
[junit4:junit4]   2> 10537 T2486 C125 P51387 oasu.DirectUpdateHandler2.commit end_commit_flush
[junit4:junit4]   2> 10538 T2492 oasc.SolrCore.registerSearcher [collection1] Registered new searcher Searcher@19d9ce31 main{StandardDirectoryReader(segments_1:1)}
[junit4:junit4]   2> 10539 T2486 C125 P51387 /update {waitSearcher=true&commit=true&commit_end_point=true&wt=javabin&softCommit=false&version=2} {commit=} 0 14
[junit4:junit4]   2> 10540 T2505 C124 P51394 oash.ReplicationHandler.inform Commits will be reserved for  10000
[junit4:junit4]   2> 10540 T2505 C124 P51394 oash.SnapPuller.<init>  No value set for 'pollInterval'. Timer Task not started.
[junit4:junit4]   2> 10542 T2487 C125 P51387 oash.ReplicationHandler.inform Commits will be reserved for  10000
[junit4:junit4]   2> 10543 T2487 C125 P51387 REQ /replication {command=indexversion&wt=javabin&qt=/replication&version=2} status=0 QTime=2 
[junit4:junit4]   2> 10549 T2505 C124 P51394 oasc.SolrDeletionPolicy.onInit SolrDeletionPolicy.onInit: commits:num=1
[junit4:junit4]   2> 		commit{dir=NRTCachingDirectory(org.apache.lucene.store.NIOFSDirectory@/usr/home/hudson/hudson-slave/workspace/Lucene-Solr-Tests-trunk-Java6/solr/build/solr-core/test/J1/org.apache.solr.cloud.SyncSliceTest-1348171916040/jetty2/index lockFactory=org.apache.lucene.store.NativeFSLockFactory@5356bd08; maxCacheMB=48.0 maxMergeSizeMB=4.0),segFN=segments_1,generation=1,filenames=[segments_1]
[junit4:junit4]   2> 10549 T2505 C124 P51394 oasc.SolrDeletionPolicy.updateCommits newest commit = 1
[junit4:junit4]   2> 10550 T2505 C124 P51394 oasu.DirectUpdateHandler2.commit start commit{flags=0,_version_=0,optimize=false,openSearcher=true,waitSearcher=true,expungeDeletes=false,softCommit=false}
[junit4:junit4]   2> 10555 T2505 C124 P51394 oasc.SolrDeletionPolicy.onCommit SolrDeletionPolicy.onCommit: commits:num=2
[junit4:junit4]   2> 		commit{dir=NRTCachingDirectory(org.apache.lucene.store.NIOFSDirectory@/usr/home/hudson/hudson-slave/workspace/Lucene-Solr-Tests-trunk-Java6/solr/build/solr-core/test/J1/org.apache.solr.cloud.SyncSliceTest-1348171916040/jetty2/index lockFactory=org.apache.lucene.store.NativeFSLockFactory@5356bd08; maxCacheMB=48.0 maxMergeSizeMB=4.0),segFN=segments_1,generation=1,filenames=[segments_1]
[junit4:junit4]   2> 		commit{dir=NRTCachingDirectory(org.apache.lucene.store.NIOFSDirectory@/usr/home/hudson/hudson-slave/workspace/Lucene-Solr-Tests-trunk-Java6/solr/build/solr-core/test/J1/org.apache.solr.cloud.SyncSliceTest-1348171916040/jetty2/index lockFactory=org.apache.lucene.store.NativeFSLockFactory@5356bd08; maxCacheMB=48.0 maxMergeSizeMB=4.0),segFN=segments_2,generation=2,filenames=[segments_2]
[junit4:junit4]   2> 10555 T2505 C124 P51394 oasc.SolrDeletionPolicy.updateCommits newest commit = 2
[junit4:junit4]   2> 10561 T2505 C124 P51394 oass.SolrIndexSearcher.<init> Opening Searcher@4e517c5d main
[junit4:junit4]   2> 10562 T2505 C124 P51394 oasu.DirectUpdateHandler2.commit end_commit_flush
[junit4:junit4]   2> 10563 T2504 oasc.SolrCore.registerSearcher [collection1] Registered new searcher Searcher@4e517c5d main{StandardDirectoryReader(segments_2:2)}
[junit4:junit4]   2> 10563 T2505 C124 P51394 oasc.RecoveryStrategy.replay No replay needed. core=collection1
[junit4:junit4]   2> 10564 T2505 C124 P51394 oasc.RecoveryStrategy.doRecovery Replication Recovery was successful - registering as Active. core=collection1
[junit4:junit4]   2> 10565 T2505 C124 P51394 oasc.RecoveryStrategy.doRecovery Finished recovery process. core=collection1
[junit4:junit4]   2> 10897 T2478 oascc.ZkStateReader.updateClusterState Updating cloud state from ZooKeeper... 
[junit4:junit4]   2> 10909 T2517 oascc.ZkStateReader$2.process A cluster state change has occurred - updating...
[junit4:junit4]   2> 10909 T2477 oascc.ZkStateReader$2.process A cluster state change has occurred - updating...
[junit4:junit4]   2> 10909 T2531 oascc.ZkStateReader$2.process A cluster state change has occurred - updating...
[junit4:junit4]   2> 10909 T2491 oascc.ZkStateReader$2.process A cluster state change has occurred - updating...
[junit4:junit4]   2> 10909 T2503 oascc.ZkStateReader$2.process A cluster state change has occurred - updating...
[junit4:junit4]   2> 11147 T2457 oass.OpenExchangeRatesOrgProvider.init Initialized with rates=open-exchange-rates.json, refreshInterval=1440.
[junit4:junit4]   2> 11159 T2457 oass.IndexSchema.readSchema default search field in schema is text
[junit4:junit4]   2> 11164 T2457 oass.IndexSchema.readSchema unique key field: id
[junit4:junit4]   2> 11175 T2457 oass.FileExchangeRateProvider.reload Reloading exchange rates from file currency.xml
[junit4:junit4]   2> 11186 T2457 oass.FileExchangeRateProvider.reload Reloading exchange rates from file currency.xml
[junit4:junit4]   2> 11190 T2457 oass.OpenExchangeRatesOrgProvider.reload Reloading exchange rates from open-exchange-rates.json
[junit4:junit4]   2> 11192 T2457 oass.OpenExchangeRatesOrgProvider.reload Reloading exchange rates from open-exchange-rates.json
[junit4:junit4]   2> 11193 T2457 oasc.SolrCore.<init> [collection1] Opening new SolrCore at /usr/home/hudson/hudson-slave/workspace/Lucene-Solr-Tests-trunk-Java6/solr/build/solr-core/test/J1/./solrtest-jetty4-1348171925669/collection1/, dataDir=./org.apache.solr.cloud.SyncSliceTest-1348171916040/jetty4/
[junit4:junit4]   2> 11193 T2457 oasc.JmxMonitoredMap.<init> JMX monitoring is enabled. Adding Solr mbeans to JMX Server: com.sun.jmx.mbeanserver.JmxMBeanServer@729b1670
[junit4:junit4]   2> 11195 T2457 oasc.SolrCore.getNewIndexDir WARNING New index directory detected: old=null new=./org.apache.solr.cloud.SyncSliceTest-1348171916040/jetty4/index/
[junit4:junit4]   2> 11195 T2457 oasc.SolrCore.initIndex WARNING [collection1] Solr index directory './org.apache.solr.cloud.SyncSliceTest-1348171916040/jetty4/index' doesn't exist. Creating new index...
[junit4:junit4]   2> 11196 T2457 oasc.CachingDirectoryFactory.get return new directory for /usr/home/hudson/hudson-slave/workspace/Lucene-Solr-Tests-trunk-Java6/solr/build/solr-core/test/J1/./org.apache.solr.cloud.SyncSliceTest-1348171916040/jetty4/index forceNew:false
[junit4:junit4]   2> 11235 T2457 oasc.SolrDeletionPolicy.onCommit SolrDeletionPolicy.onCommit: commits:num=1
[junit4:junit4]   2> 		commit{dir=NRTCachingDirectory(org.apache.lucene.store.NIOFSDirectory@/usr/home/hudson/hudson-slave/workspace/Lucene-Solr-Tests-trunk-Java6/solr/build/solr-core/test/J1/org.apache.solr.cloud.SyncSliceTest-1348171916040/jetty4/index lockFactory=org.apache.lucene.store.NativeFSLockFactory@547121cd; maxCacheMB=48.0 maxMergeSizeMB=4.0),segFN=segments_1,generation=1,filenames=[segments_1]
[junit4:junit4]   2> 11236 T2457 oasc.SolrDeletionPolicy.updateCommits newest commit = 1
[junit4:junit4]   2> 11237 T2457 oasc.SolrCore.initWriters created xml: solr.XMLResponseWriter
[junit4:junit4]   2> 11240 T2457 oasup.UpdateRequestProcessorChain.init inserting DistributedUpdateProcessorFactory into updateRequestProcessorChain "dedupe"
[junit4:junit4]   2> 11241 T2457 oasup.UpdateRequestProcessorChain.init inserting DistributedUpdateProcessorFactory into updateRequestProcessorChain "dedupe-allfields"
[junit4:junit4]   2> 11241 T2457 oasup.UpdateRequestProcessorChain.init inserting DistributedUpdateProcessorFactory into updateRequestProcessorChain "stored_sig"
[junit4:junit4]   2> 11242 T2457 oasup.UpdateRequestProcessorChain.init inserting DistributedUpdateProcessorFactory into updateRequestProcessorChain "uniq-fields"
[junit4:junit4]   2> 11243 T2457 oasup.UpdateRequestProcessorChain.init inserting DistributedUpdateProcessorFactory into updateRequestProcessorChain "distrib-dup-test-chain-implicit"
[junit4:junit4]   2> 11243 T2457 oasc.RequestHandlers.initHandlersFromConfig adding lazy requestHandler: solr.ReplicationHandler
[junit4:junit4]   2> 11244 T2457 oasc.RequestHandlers.initHandlersFromConfig created /replication: solr.ReplicationHandler
[junit4:junit4]   2> 11244 T2457 oasc.RequestHandlers.initHandlersFromConfig created standard: solr.StandardRequestHandler
[junit4:junit4]   2> 11245 T2457 oasc.RequestHandlers.initHandlersFromConfig created /get: solr.RealTimeGetHandler
[junit4:junit4]   2> 11246 T2457 oasc.RequestHandlers.initHandlersFromConfig created dismax: solr.SearchHandler
[junit4:junit4]   2> 11247 T2457 oasc.RequestHandlers.initHandlersFromConfig created mock: org.apache.solr.core.MockQuerySenderListenerReqHandler
[junit4:junit4]   2> 11247 T2457 oasc.RequestHandlers.initHandlersFromConfig created /admin/: org.apache.solr.handler.admin.AdminHandlers
[junit4:junit4]   2> 11248 T2457 oasc.RequestHandlers.initHandlersFromConfig created defaults: solr.StandardRequestHandler
[junit4:junit4]   2> 11248 T2457 oasc.RequestHandlers.initHandlersFromConfig adding lazy requestHandler: solr.StandardRequestHandler
[junit4:junit4]   2> 11249 T2457 oasc.RequestHandlers.initHandlersFromConfig created lazy: solr.StandardRequestHandler
[junit4:junit4]   2> 11250 T2457 oasc.RequestHandlers.initHandlersFromConfig created /update: solr.UpdateRequestHandler
[junit4:junit4]   2> 11250 T2457 oasc.RequestHandlers.initHandlersFromConfig created /terms: org.apache.solr.handler.component.SearchHandler
[junit4:junit4]   2> 11251 T2457 oasc.RequestHandlers.initHandlersFromConfig created spellCheckCompRH: org.apache.solr.handler.component.SearchHandler
[junit4:junit4]   2> 11252 T2457 oasc.RequestHandlers.initHandlersFromConfig created spellCheckCompRH_Direct: org.apache.solr.handler.component.SearchHandler
[junit4:junit4]   2> 11252 T2457 oasc.RequestHandlers.initHandlersFromConfig created spellCheckWithWordbreak: org.apache.solr.handler.component.SearchHandler
[junit4:junit4]   2> 11253 T2457 oasc.RequestHandlers.initHandlersFromConfig created spellCheckWithWordbreak_Direct: org.apache.solr.handler.component.SearchHandler
[junit4:junit4]   2> 11254 T2457 oasc.RequestHandlers.initHandlersFromConfig created spellCheckCompRH1: org.apache.solr.handler.component.SearchHandler
[junit4:junit4]   2> 11254 T2457 oasc.RequestHandlers.initHandlersFromConfig created tvrh: org.apache.solr.handler.component.SearchHandler
[junit4:junit4]   2> 11255 T2457 oasc.RequestHandlers.initHandlersFromConfig created /mlt: solr.MoreLikeThisHandler
[junit4:junit4]   2> 11256 T2457 oasc.RequestHandlers.initHandlersFromConfig created /debug/dump: solr.DumpRequestHandler
[junit4:junit4]   2> 11260 T2457 oashl.XMLLoader.init xsltCacheLifetimeSeconds=60
[junit4:junit4]   2> 11265 T2457 oasc.SolrCore.initDeprecatedSupport WARNING solrconfig.xml uses deprecated <admin/gettableFiles>, Please update your config to use the ShowFileRequestHandler.
[junit4:junit4]   2> 11266 T2457 oasc.SolrCore.initDeprecatedSupport WARNING adding ShowFileRequestHandler with hidden files: [SCHEMA.XML, OLD_SYNONYMS.TXT, STOPWORDS.TXT, PROTWORDS.TXT, OPEN-EXCHANGE-RATES.JSON, SYNONYMS.TXT, CURRENCY.XML, MAPPING-ISOLATIN1ACCENT.TXT]
[junit4:junit4]   2> 11271 T2457 oass.SolrIndexSearcher.<init> Opening Searcher@5859565a main
[junit4:junit4]   2> 11272 T2457 oasu.CommitTracker.<init> Hard AutoCommit: disabled
[junit4:junit4]   2> 11273 T2457 oasu.CommitTracker.<init> Soft AutoCommit: disabled
[junit4:junit4]   2> 11273 T2457 oashc.SpellCheckComponent.inform Initializing spell checkers
[junit4:junit4]   2> 11281 T2457 oass.DirectSolrSpellChecker.init init: {name=direct,classname=DirectSolrSpellChecker,field=lowerfilt,minQueryLength=3}
[junit4:junit4]   2> 11410 T2532 oasc.SolrCore.registerSearcher [collection1] Registered new searcher Searcher@5859565a main{StandardDirectoryReader(segments_1:1)}
[junit4:junit4]   2> 11914 T2478 oascc.ZkStateReader.updateClusterState Updating cloud state from ZooKeeper... 
[junit4:junit4]   2> 11932 T2531 oascc.ZkStateReader$2.process A cluster state change has occurred - updating...
[junit4:junit4]   2> 11933 T2491 oascc.ZkStateReader$2.process A cluster state change has occurred - updating...
[junit4:junit4]   2> 11933 T2517 oascc.ZkStateReader$2.process A cluster state change has occurred - updating...
[junit4:junit4]   2> 11932 T2503 oascc.ZkStateReader$2.process A cluster state change has occurred - updating...
[junit4:junit4]   2> 11932 T2477 oascc.ZkStateReader$2.process A cluster state change has occurred - updating...
[junit4:junit4]   2> 12418 T2457 oasc.CoreContainer.register registering core: collection1
[junit4:junit4]   2> 12418 T2457 oasc.ZkController.register Register shard - core:collection1 address:http://127.0.0.1:51406/solr shardId:shard1
[junit4:junit4]   2> 12421 T2457 oasc.ZkController.register We are http://127.0.0.1:51406/solr/collection1/ and leader is http://127.0.0.1:51387/solr/collection1/
[junit4:junit4]   2> 12421 T2457 oasc.ZkController.register No LogReplay needed for core=collection1 baseURL=http://127.0.0.1:51406/solr
[junit4:junit4]   2> 12422 T2457 oasc.ZkController.checkRecovery Core needs to recover:collection1
[junit4:junit4]   2> 12422 T2457 oasu.DefaultSolrCoreState.doRecovery Running recovery - first canceling any ongoing recovery
[junit4:junit4]   2> ASYNC  NEW_CORE C127 name=collection1 org.apache.solr.core.SolrCore@2ae41e82 url=http://127.0.0.1:51406/solr/collection1 node=127.0.0.1:51406_solr
[junit4:junit4]   2> 12424 T2533 C127 P51406 oasc.RecoveryStrategy.run Starting recovery process.  core=collection1 recoveringAfterStartup=true
[junit4:junit4]   2> 12424 T2457 oascc.ZkStateReader.updateClusterState Updating cloud state from ZooKeeper... 
[junit4:junit4]   2> 12424 T2533 C127 P51406 oasc.RecoveryStrategy.doRecovery ###### startupVersions=[]
[junit4:junit4]   2> 12425 T2457 oass.SolrDispatchFilter.init user.dir=/usr/home/hudson/hudson-slave/workspace/Lucene-Solr-Tests-trunk-Java6/solr/build/solr-core/test/J1
[junit4:junit4]   2> 12425 T2533 C127 P51406 oasc.RecoveryStrategy.doRecovery Attempting to PeerSync from http://127.0.0.1:51387/solr/collection1/ core=collection1 - recoveringAfterStartup=true
[junit4:junit4]   2> 12425 T2457 oass.SolrDispatchFilter.init SolrDispatchFilter.init() done
[junit4:junit4]   2> 12426 T2533 C127 P51406 oasu.PeerSync.sync PeerSync: core=collection1 url=http://127.0.0.1:51406/solr START replicas=[http://127.0.0.1:51387/solr/collection1/] nUpdates=100
[junit4:junit4]   2> 12426 T2457 oascsi.HttpClientUtil.createClient Creating new http client, config:maxConnections=128&maxConnectionsPerHost=32&followRedirects=false
[junit4:junit4]   2> 12426 T2533 C127 P51406 oasu.PeerSync.sync WARNING no frame of reference to tell of we've missed updates
[junit4:junit4]   2> 12427 T2533 C127 P51406 oasc.RecoveryStrategy.doRecovery PeerSync Recovery was not successful - trying replication. core=collection1
[junit4:junit4]   2> 12427 T2533 C127 P51406 oasc.RecoveryStrategy.doRecovery Starting Replication Recovery. core=collection1
[junit4:junit4]   2> 12427 T2533 C127 P51406 oascsi.HttpClientUtil.createClient Creating new http client, config:maxConnections=128&maxConnectionsPerHost=32&followRedirects=false
[junit4:junit4]   2> 12428 T2483 C125 P51387 REQ /get {distrib=false&qt=/get&wt=javabin&version=2&getVersions=100} status=0 QTime=0 
[junit4:junit4]   2> 12443 T2478 oascc.ZkStateReader.updateClusterState Updating cloud state from ZooKeeper... 
[junit4:junit4]   2> 12448 T2457 oaz.ZooKeeper.<init> Initiating client connection, connectString=127.0.0.1:51376/solr sessionTimeout=10000 watcher=org.apache.solr.common.cloud.ConnectionManager@4cbadf68
[junit4:junit4]   2> 12448 T2535 oaz.ClientCnxn$SendThread.startConnect Opening socket connection to server /127.0.0.1:51376
[junit4:junit4]   2> 12448 T2457 oascc.ConnectionManager.waitForConnected Waiting for client to connect to ZooKeeper
[junit4:junit4]   2> 12449 T2535 oaz.ClientCnxn$SendThread.primeConnection Socket connection established to localhost/127.0.0.1:51376, initiating session
[junit4:junit4]   2> 12449 T2459 oazs.NIOServerCnxn$Factory.run Accepted socket connection from /140.211.11.196:51416
[junit4:junit4]   2> 12450 T2459 oazs.NIOServerCnxn.readConnectRequest Client attempting to establish new session at /140.211.11.196:51416
[junit4:junit4]   2> 12453 T2461 oazs.NIOServerCnxn.finishSessionInit Established session 0x139e54ee30e0007 with negotiated timeout 10000 for client /140.211.11.196:51416
[junit4:junit4]   2> 12453 T2535 oaz.ClientCnxn$SendThread.readConnectResult Session establishment complete on server localhost/127.0.0.1:51376, sessionid = 0x139e54ee30e0007, negotiated timeout = 10000
[junit4:junit4]   2> 12453 T2536 oascc.ConnectionManager.process Watcher org.apache.solr.common.cloud.ConnectionManager@4cbadf68 name:ZooKeeperConnection Watcher:127.0.0.1:51376/solr got event WatchedEvent state:SyncConnected type:None path:null path:null type:None
[junit4:junit4]   2> 12453 T2457 oascc.ConnectionManager.waitForConnected Client is connected to ZooKeeper
[junit4:junit4]   2> 12454 T2503 oascc.ZkStateReader$2.process A cluster state change has occurred - updating...
[junit4:junit4]   2> 12454 T2531 oascc.ZkStateReader$2.process A cluster state change has occurred - updating...
[junit4:junit4]   2> 12454 T2491 oascc.ZkStateReader$2.process A cluster state change has occurred - updating...
[junit4:junit4]   2> 12454 T2477 oascc.ZkStateReader$2.process A cluster state change has occurred - updating...
[junit4:junit4]   2> 12454 T2517 oascc.ZkStateReader$2.process A cluster state change has occurred - updating...
[junit4:junit4]   2> 12454 T2457 oascc.ZkStateReader.createClusterStateWatchersAndUpdate Updating cluster state from ZooKeeper... 
[junit4:junit4]   2> 12464 T2457 oasc.ChaosMonkey.monkeyLog monkey: init - expire sessions:true cause connection loss:true
[junit4:junit4]   2> 12464 T2457 oascsi.HttpClientUtil.createClient Creating new http client, config:
[junit4:junit4]   2> 12475 T2457 oascc.ZkStateReader.updateClusterState Updating cloud state from ZooKeeper... 
[junit4:junit4]   2> 12476 T2457 oasc.AbstractFullDistribZkTestBase.waitForThingsToLevelOut Wait for recoveries to finish - wait 15 for each attempt
[junit4:junit4]   2> 12476 T2457 oasc.AbstractDistribZkTestBase.waitForRecoveriesToFinish Wait for recoveries to finish - collection: collection1 failOnTimeout:true timeout (sec):15
[junit4:junit4]   2> 12477 T2457 oascc.ZkStateReader.updateClusterState Updating cloud state from ZooKeeper... 
[junit4:junit4]   2>  C126_STATE=coll:collection1 core:collection1 props:{shard=shard1, roles=null, state=recovering, core=collection1, collection=collection1, node_name=127.0.0.1:51400_solr, base_url=http://127.0.0.1:51400/solr}
[junit4:junit4]   2> 12634 T2519 C126 P51400 oasc.RecoveryStrategy.doRecovery Begin buffering updates. core=collection1
[junit4:junit4]   2> 12634 T2519 C126 P51400 oasu.UpdateLog.bufferUpdates Starting to buffer updates. FSUpdateLog{state=ACTIVE, tlog=null}
[junit4:junit4]   2> 12634 T2519 C126 P51400 oasc.RecoveryStrategy.replicate Attempting to replicate from http://127.0.0.1:51387/solr/collection1/. core=collection1
[junit4:junit4]   2> 12635 T2519 C126 P51400 oascsi.HttpClientUtil.createClient Creating new http client, config:maxConnections=128&maxConnectionsPerHost=32&followRedirects=false
[junit4:junit4]   2> 12644 T2489 C125 P51387 oasu.DirectUpdateHandler2.commit start commit{flags=0,_version_=0,optimize=false,openSearcher=true,waitSearcher=true,expungeDeletes=false,softCommit=false}
[junit4:junit4]   2> 12650 T2489 C125 P51387 oass.SolrIndexSearcher.<init> Opening Searcher@ffc53cc main
[junit4:junit4]   2> 12650 T2489 C125 P51387 oasu.DirectUpdateHandler2.commit end_commit_flush
[junit4:junit4]   2> 12652 T2492 oasc.SolrCore.registerSearcher [collection1] Registered new searcher Searcher@ffc53cc main{StandardDirectoryReader(segments_1:1)}
[junit4:junit4]   2> 12652 T2489 C125 P51387 /update {waitSearcher=true&commit=true&commit_end_point=true&wt=javabin&softCommit=false&version=2} {commit=} 0 8
[junit4:junit4]   2> 12653 T2519 C126 P51400 oash.ReplicationHandler.inform Commits will be reserved for  10000
[junit4:junit4]   2> 12653 T2519 C126 P51400 oash.SnapPuller.<init>  No value set for 'pollInterval'. Timer Task not started.
[junit4:junit4]   2> 12655 T2487 C125 P51387 REQ /replication {command=indexversion&wt=javabin&qt=/replication&version=2} status=0 QTime=0 
[junit4:junit4]   2> 12659 T2519 C126 P51400 oasc.SolrDeletionPolicy.onInit SolrDeletionPolicy.onInit: commits:num=1
[junit4:junit4]   2> 		commit{dir=NRTCachingDirectory(org.apache.lucene.store.NIOFSDirectory@/usr/home/hudson/hudson-slave/workspace/Lucene-Solr-Tests-trunk-Java6/solr/build/solr-core/test/J1/org.apache.solr.cloud.SyncSliceTest-1348171916040/jetty3/index lockFactory=org.apache.lucene.store.NativeFSLockFactory@58c00adc; maxCacheMB=48.0 maxMergeSizeMB=4.0),segFN=segments_1,generation=1,filenames=[segments_1]
[junit4:junit4]   2> 12660 T2519 C126 P51400 oasc.SolrDeletionPolicy.updateCommits newest commit = 1
[junit4:junit4]   2> 12660 T2519 C126 P51400 oasu.DirectUpdateHandler2.commit start commit{flags=0,_version_=0,optimize=false,openSearcher=true,waitSearcher=true,expungeDeletes=false,softCommit=false}
[junit4:junit4]   2> 12664 T2519 C126 P51400 oasc.SolrDeletionPolicy.onCommit SolrDeletionPolicy.onCommit: commits:num=2
[junit4:junit4]   2> 		commit{dir=NRTCachingDirectory(org.apache.lucene.store.NIOFSDirectory@/usr/home/hudson/hudson-slave/workspace/Lucene-Solr-Tests-trunk-Java6/solr/build/solr-core/test/J1/org.apache.solr.cloud.SyncSliceTest-1348171916040/jetty3/index lockFactory=org.apache.lucene.store.NativeFSLockFactory@58c00adc; maxCacheMB=48.0 maxMergeSizeMB=4.0),segFN=segments_1,generation=1,filenames=[segments_1]
[junit4:junit4]   2> 		commit{dir=NRTCachingDirectory(org.apache.lucene.store.NIOFSDirectory@/usr/home/hudson/hudson-slave/workspace/Lucene-Solr-Tests-trunk-Java6/solr/build/solr-core/test/J1/org.apache.solr.cloud.SyncSliceTest-1348171916040/jetty3/index lockFactory=org.apache.lucene.store.NativeFSLockFactory@58c00adc; maxCacheMB=48.0 maxMergeSizeMB=4.0),segFN=segments_2,generation=2,filenames=[segments_2]
[junit4:junit4]   2> 12664 T2519 C126 P51400 oasc.SolrDeletionPolicy.updateCommits newest commit = 2
[junit4:junit4]   2> 12668 T2519 C126 P51400 oass.SolrIndexSearcher.<init> Opening Searcher@71e441c3 main
[junit4:junit4]   2> 12668 T2519 C126 P51400 oasu.DirectUpdateHandler2.commit end_commit_flush
[junit4:junit4]   2> 12669 T2518 oasc.SolrCore.registerSearcher [collection1] Registered new searcher Searcher@71e441c3 main{StandardDirectoryReader(segments_2:2)}
[junit4:junit4]   2> 12670 T2519 C126 P51400 oasc.RecoveryStrategy.replay No replay needed. core=collection1
[junit4:junit4]   2> 12670 T2519 C126 P51400 oasc.RecoveryStrategy.doRecovery Replication Recovery was successful - registering as Active. core=collection1
[junit4:junit4]   2> 12671 T2519 C126 P51400 oasc.RecoveryStrategy.doRecovery Finished recovery process. core=collection1
[junit4:junit4]   2> 12965 T2478 oascc.ZkStateReader.updateClusterState Updating cloud state from ZooKeeper... 
[junit4:junit4]   2> 12978 T2517 oascc.ZkStateReader$2.process A cluster state change has occurred - updating...
[junit4:junit4]   2> 12978 T2477 oascc.ZkStateReader$2.process A cluster state change has occurred - updating...
[junit4:junit4]   2> 12978 T2503 oascc.ZkStateReader$2.process A cluster state change has occurred - updating...
[junit4:junit4]   2> 12978 T2531 oascc.ZkStateReader$2.process A cluster state change has occurred - updating...
[junit4:junit4]   2> 12978 T2491 oascc.ZkStateReader$2.process A cluster state change has occurred - updating...
[junit4:junit4]   2> 12978 T2536 oascc.ZkStateReader$2.process A cluster state change has occurred - updating...
[junit4:junit4]   2> 13479 T2457 oascc.ZkStateReader.updateClusterState Updating cloud state from ZooKeeper... 
[junit4:junit4]   2> 14481 T2457 oascc.ZkStateReader.updateClusterState Updating cloud state from ZooKeeper... 
[junit4:junit4]   2>  C127_STATE=coll:collection1 core:collection1 props:{shard=shard1, roles=null, state=recovering, core=collection1, collection=collection1, node_name=127.0.0.1:51406_solr, base_url=http://127.0.0.1:51406/solr}
[junit4:junit4]   2> 15451 T2533 C127 P51406 oasc.RecoveryStrategy.doRecovery Begin buffering updates. core=collection1
[junit4:junit4]   2> 15451 T2533 C127 P51406 oasu.UpdateLog.bufferUpdates Starting to buffer updates. FSUpdateLog{state=ACTIVE, tlog=null}
[junit4:junit4]   2> 15451 T2533 C127 P51406 oasc.RecoveryStrategy.replicate Attempting to replicate from http://127.0.0.1:51387/solr/collection1/. core=collection1
[junit4:junit4]   2> 15451 T2533 C127 P51406 oascsi.HttpClientUtil.createClient Creating new http client, config:maxConnections=128&maxConnectionsPerHost=32&followRedirects=false
[junit4:junit4]   2> 15465 T2484 C125 P51387 oasu.DirectUpdateHandler2.commit start commit{flags=0,_version_=0,optimize=false,openSearcher=true,waitSearcher=true,expungeDeletes=false,softCommit=false}
[junit4:junit4]   2> 15469 T2484 C125 P51387 oass.SolrIndexSearcher.<init> Opening Searcher@298941eb main
[junit4:junit4]   2> 15469 T2484 C125 P51387 oasu.DirectUpdateHandler2.commit end_commit_flush
[junit4:junit4]   2> 15471 T2492 oasc.SolrCore.registerSearcher [collection1] Registered new searcher Searcher@298941eb main{StandardDirectoryReader(segments_1:1)}
[junit4:junit4]   2> 15471 T2484 C125 P51387 /update {waitSearcher=true&commit=true&commit_end_point=true&wt=javabin&softCommit=false&version=2} {commit=} 0 6
[junit4:junit4]   2> 15472 T2533 C127 P51406 oash.ReplicationHandler.inform Commits will be reserved for  10000
[junit4:junit4]   2> 15472 T2533 C127 P51406 oash.SnapPuller.<init>  No value set for 'pollInterval'. Timer Task not started.
[junit4:junit4]   2> 15475 T2487 C125 P51387 REQ /replication {command=indexversion&wt=javabin&qt=/replication&version=2} status=0 QTime=0 
[junit4:junit4]   2> 15480 T2533 C127 P51406 oasc.SolrDeletionPolicy.onInit SolrDeletionPolicy.onInit: commits:num=1
[junit4:junit4]   2> 		commit{dir=NRTCachingDirectory(org.apache.lucene.store.NIOFSDirectory@/usr/home/hudson/hudson-slave/workspace/Lucene-Solr-Tests-trunk-Java6/solr/build/solr-core/test/J1/org.apache.solr.cloud.SyncSliceTest-1348171916040/jetty4/index lockFactory=org.apache.lucene.store.NativeFSLockFactory@547121cd; maxCacheMB=48.0 maxMergeSizeMB=4.0),segFN=segments_1,generation=1,filenames=[segments_1]
[junit4:junit4]   2> 15480 T2533 C127 P51406 oasc.SolrDeletionPolicy.updateCommits newest commit = 1
[junit4:junit4]   2> 15481 T2533 C127 P51406 oasu.DirectUpdateHandler2.commit start commit{flags=0,_version_=0,optimize=false,openSearcher=true,waitSearcher=true,expungeDeletes=false,softCommit=false}
[junit4:junit4]   2> 15483 T2457 oascc.ZkStateReader.updateClusterState Updating cloud state from ZooKeeper... 
[junit4:junit4]   2> 15485 T2533 C127 P51406 oasc.SolrDeletionPolicy.onCommit SolrDeletionPolicy.onCommit: commits:num=2
[junit4:junit4]   2> 		commit{dir=NRTCachingDirectory(org.apache.lucene.store.NIOFSDirectory@/usr/home/hudson/hudson-slave/workspace/Lucene-Solr-Tests-trunk-Java6/solr/build/solr-core/test/J1/org.apache.solr.cloud.SyncSliceTest-1348171916040/jetty4/index lockFactory=org.apache.lucene.store.NativeFSLockFactory@547121cd; maxCacheMB=48.0 maxMergeSizeMB=4.0),segFN=segments_1,generation=1,filenames=[segments_1]
[junit4:junit4]   2> 		commit{dir=NRTCachingDirectory(org.apache.lucene.store.NIOFSDirectory@/usr/home/hudson/hudson-slave/workspace/Lucene-Solr-Tests-trunk-Java6/solr/build/solr-core/test/J1/org.apache.solr.cloud.SyncSliceTest-1348171916040/jetty4/index lockFactory=org.apache.lucene.store.NativeFSLockFactory@547121cd; maxCacheMB=48.0 maxMergeSizeMB=4.0),segFN=segments_2,generation=2,filenames=[segments_2]
[junit4:junit4]   2> 15485 T2533 C127 P51406 oasc.SolrDeletionPolicy.updateCommits newest commit = 2
[junit4:junit4]   2> 15488 T2533 C127 P51406 oass.SolrIndexSearcher.<init> Opening Searcher@2bcfc676 main
[junit4:junit4]   2> 15489 T2533 C127 P51406 oasu.DirectUpdateHandler2.commit end_commit_flush
[junit4:junit4]   2> 15490 T2532 oasc.SolrCore.registerSearcher [collection1] Registered new searcher Searcher@2bcfc676 main{StandardDirectoryReader(segments_2:2)}
[junit4:junit4]   2> 15491 T2533 C127 P51406 oasc.RecoveryStrategy.replay No replay needed. core=collection1
[junit4:junit4]   2> 15491 T2533 C127 P51406 oasc.RecoveryStrategy.doRecovery Replication Recovery was successful - registering as Active. core=collection1
[junit4:junit4]   2> 15501 T2533 C127 P51406 oasc.RecoveryStrategy.doRecovery Finished recovery process. core=collection1
[junit4:junit4]   2> 15986 T2478 oascc.ZkStateReader.updateClusterState Updating cloud state from ZooKeeper... 
[junit4:junit4]   2> 15999 T2517 oascc.ZkStateReader$2.process A cluster state change has occurred - updating...
[junit4:junit4]   2> 15999 T2531 oascc.ZkStateReader$2.process A cluster state change has occurred - updating...
[junit4:junit4]   2> 15999 T2503 oascc.ZkStateReader$2.process A cluster state change has occurred - updating...
[junit4:junit4]   2> 15999 T2536 oascc.ZkStateReader$2.process A cluster state change has occurred - updating...
[junit4:junit4]   2> 15999 T2477 oascc.ZkStateReader$2.process A cluster state change has occurred - updating...
[junit4:junit4]   2> 15999 T2491 oascc.ZkStateReader$2.process A cluster state change has occurred - updating...
[junit4:junit4]   2> 16485 T2457 oascc.ZkStateReader.updateClusterState Updating cloud state from ZooKeeper... 
[junit4:junit4]   2> ASYNC  NEW_CORE C128 name=collection1 org.apache.solr.core.SolrCore@f7fcd4e url=http://127.0.0.1:51383/solr/collection1 node=127.0.0.1:51383_solr
[junit4:junit4]   2> 16496 T2469 C128 P51383 oasu.DirectUpdateHandler2.commit start commit{flags=0,_version_=0,optimize=false,openSearcher=true,waitSearcher=true,expungeDeletes=false,softCommit=false}
[junit4:junit4]   2> 16500 T2469 C128 P51383 oasc.SolrDeletionPolicy.onInit SolrDeletionPolicy.onInit: commits:num=1
[junit4:junit4]   2> 		commit{dir=NRTCachingDirectory(org.apache.lucene.store.NIOFSDirectory@/usr/home/hudson/hudson-slave/workspace/Lucene-Solr-Tests-trunk-Java6/solr/build/solr-core/test/J1/org.apache.solr.cloud.SyncSliceTest-1348171916040/control/data/index lockFactory=org.apache.lucene.store.NativeFSLockFactory@63d92c04; maxCacheMB=48.0 maxMergeSizeMB=4.0),segFN=segments_1,generation=1,filenames=[segments_1]
[junit4:junit4]   2> 16501 T2469 C128 P51383 oasc.SolrDeletionPolicy.updateCommits newest commit = 1
[junit4:junit4]   2> 16503 T2469 C128 P51383 oass.SolrIndexSearcher.<init> Opening Searcher@1323d7af main
[junit4:junit4]   2> 16503 T2469 C128 P51383 oasu.DirectUpdateHandler2.commit end_commit_flush
[junit4:junit4]   2> 16504 T2480 oasc.SolrCore.registerSearcher [collection1] Registered new searcher Searcher@1323d7af main{StandardDirectoryReader(segments_1:1)}
[junit4:junit4]   2> 16505 T2469 C128 P51383 /update {waitSearcher=true&wt=javabin&commit=true&softCommit=false&version=2} {commit=} 0 9
[junit4:junit4]   2> 16506 T2457 oaz.ZooKeeper.<init> Initiating client connection, connectString=127.0.0.1:51376/solr sessionTimeout=10000 watcher=org.apache.solr.common.cloud.ConnectionManager@16252bfa
[junit4:junit4]   2> 16507 T2537 oaz.ClientCnxn$SendThread.startConnect Opening socket connection to server /127.0.0.1:51376
[junit4:junit4]   2> 16507 T2457 oascc.ConnectionManager.waitForConnected Waiting for client to connect to ZooKeeper
[junit4:junit4]   2> 16507 T2537 oaz.ClientCnxn$SendThread.primeConnection Socket connection established to localhost/127.0.0.1:51376, initiating session
[junit4:junit4]   2> 16508 T2459 oazs.NIOServerCnxn$Factory.run Accepted socket connection from /140.211.11.196:51434
[junit4:junit4]   2> 16508 T2459 oazs.NIOServerCnxn.readConnectRequest Client attempting to establish new session at /140.211.11.196:51434
[junit4:junit4]   2> 16535 T2461 oazs.NIOServerCnxn.finishSessionInit Established session 0x139e54ee30e0008 with negotiated timeout 10000 for client /140.211.11.196:51434
[junit4:junit4]   2> 16535 T2537 oaz.ClientCnxn$SendThread.readConnectResult Session establishment complete on server localhost/127.0.0.1:51376, sessionid = 0x139e54ee30e0008, negotiated timeout = 10000
[junit4:junit4]   2> 16536 T2538 oascc.ConnectionManager.process Watcher org.apache.solr.common.cloud.ConnectionManager@16252bfa name:ZooKeeperConnection Watcher:127.0.0.1:51376/solr got event WatchedEvent state:SyncConnected type:None path:null path:null type:None
[junit4:junit4]   2> 16536 T2457 oascc.ConnectionManager.waitForConnected Client is connected to ZooKeeper
[junit4:junit4]   2> 16537 T2457 oascc.ZkStateReader.createClusterStateWatchersAndUpdate Updating cluster state from ZooKeeper... 
[junit4:junit4]   2> 16540 T2486 C125 P51387 oasu.DirectUpdateHandler2.commit start commit{flags=0,_version_=0,optimize=false,openSearcher=true,waitSearcher=true,expungeDeletes=false,softCommit=false}
[junit4:junit4]   2> 16543 T2486 C125 P51387 oass.SolrIndexSearcher.<init> Opening Searcher@49a4835a main
[junit4:junit4]   2> 16544 T2486 C125 P51387 oasu.DirectUpdateHandler2.commit end_commit_flush
[junit4:junit4]   2> 16545 T2492 oasc.SolrCore.registerSearcher [collection1] Registered new searcher Searcher@49a4835a main{StandardDirectoryReader(segments_1:1)}
[junit4:junit4]   2> 16546 T2486 C125 P51387 oasu.SolrCmdDistributor.distribCommit Distrib commit to:[StdNode: http://127.0.0.1:51394/solr/collection1/, StdNode: http://127.0.0.1:51400/solr/collection1/, StdNode: http://127.0.0.1:51406/solr/collection1/]
[junit4:junit4]   2>  C124_STATE=coll:collection1 core:collection1 props:{shard=shard1, roles=null, state=active, core=collection1, collection=collection1, node_name=127.0.0.1:51394_solr, base_url=http://127.0.0.1:51394/solr}
[junit4:junit4]   2> 16553 T2495 C124 P51394 oasu.DirectUpdateHandler2.commit start commit{flags=0,_version_=0,optimize=false,openSearcher=true,waitSearcher=true,expungeDeletes=false,softCommit=false}
[junit4:junit4]   2>  C126_STATE=coll:collection1 core:collection1 props:{shard=shard1, roles=null, state=active, core=collection1, collection=collection1, node_name=127.0.0.1:51400_solr, base_url=http://127.0.0.1:51400/solr}
[junit4:junit4]   2> 16554 T2509 C126 P51400 oasu.DirectUpdateHandler2.commit start commit{flags=0,_version_=0,optimize=false,openSearcher=true,waitSearcher=true,expungeDeletes=false,softCommit=false}
[junit4:junit4]   2>  C127_STATE=coll:collection1 core:collection1 props:{shard=shard1, roles=null, state=active, core=collection1, collection=collection1, node_name=127.0.0.1:51406_solr, base_url=http://127.0.0.1:51406/solr}
[junit4:junit4]   2> 16554 T2523 C127 P51406 oasu.DirectUpdateHandler2.commit start commit{flags=0,_version_=0,optimize=false,openSearcher=true,waitSearcher=true,expungeDeletes=false,softCommit=false}
[junit4:junit4]   2> 16558 T2523 C127 P51406 oass.SolrIndexSearcher.<init> Opening Searcher@5cebd143 main
[junit4:junit4]   2> 16558 T2523 C127 P51406 oasu.DirectUpdateHandler2.commit end_commit_flush
[junit4:junit4]   2> 16559 T2495 C124 P51394 oass.SolrIndexSearcher.<init> Opening Searcher@11a42d47 main
[junit4:junit4]   2> 16559 T2495 C124 P51394 oasu.DirectUpdateHandler2.commit end_commit_flush
[junit4:junit4]   2> 16559 T2509 C126 P51400 oass.SolrIndexSearcher.<init> Opening Searcher@197cc21b main
[junit4:junit4]   2> 16560 T2532 oasc.SolrCore.registerSearcher [collection1] Registered new searcher Searcher@5cebd143 main{StandardDirectoryReader(segments_2:2)}
[junit4:junit4]   2> 16560 T2509 C126 P51400 oasu.DirectUpdateHandler2.commit end_commit_flush
[junit4:junit4]   2> 16560 T2523 C127 P51406 /update {waitSearcher=true&commit=true&wt=javabin&commit_end_point=true&expungeDeletes=false&softCommit=false&version=2} {commit=} 0 6
[junit4:junit4]   2> 16560 T2504 oasc.SolrCore.registerSearcher [collection1] Registered new searcher Searcher@11a42d47 main{StandardDirectoryReader(segments_2:2)}
[junit4:junit4]   2> 16561 T2495 C124 P51394 /update {waitSearcher=true&commit=true&wt=javabin&commit_end_point=true&expungeDeletes=false&softCommit=false&version=2} {commit=} 0 8
[junit4:junit4]   2> 16561 T2518 oasc.SolrCore.registerSearcher [collection1] Registered new searcher Searcher@197cc21b main{StandardDirectoryReader(segments_2:2)}
[junit4:junit4]   2> 16562 T2509 C126 P51400 /update {waitSearcher=true&commit=true&wt=javabin&commit_end_point=true&expungeDeletes=false&softCommit=false&version=2} {commit=} 0 8
[junit4:junit4]   2> 16563 T2486 C125 P51387 /update {waitSearcher=true&wt=javabin&commit=true&softCommit=false&version=2} {commit=} 0 24
[junit4:junit4]   2> 16563 T2457 oascc.ZkStateReader.updateClusterState Updating cloud state from ZooKeeper... 
[junit4:junit4]   2> 16566 T2485 C125 P51387 REQ /select {distrib=false&wt=javabin&q=*:*&version=2} hits=0 status=0 QTime=1 
[junit4:junit4]   2> 16568 T2496 C124 P51394 REQ /select {distrib=false&wt=javabin&q=*:*&version=2} hits=0 status=0 QTime=1 
[junit4:junit4]   2> 16569 T2510 C126 P51400 REQ /select {distrib=false&wt=javabin&q=*:*&version=2} hits=0 status=0 QTime=0 
[junit4:junit4]   2> 16571 T2524 C127 P51406 REQ /select {distrib=false&wt=javabin&q=*:*&version=2} hits=0 status=0 QTime=0 
[junit4:junit4]   2> 18576 T2469 C128 P51383 oass.SolrIndexSearcher.<init> Opening Searcher@1bad7348 realtime
[junit4:junit4]   2> 18576 T2469 C128 P51383 /update {wt=javabin&version=2} {deleteByQuery=*:* (-1413660734507712512)} 0 2
[junit4:junit4]   2> 18580 T2486 C125 P51387 oass.SolrIndexSearcher.<init> Opening Searcher@3c3bd7ec realtime
[junit4:junit4]   2> 18584 T2523 C127 P51406 oass.SolrIndexSearcher.<init> Opening Searcher@20089d1 realtime
[junit4:junit4]   2> 18584 T2495 C124 P51394 oass.SolrIndexSearcher.<init> Opening Searcher@46b482cd realtime
[junit4:junit4]   2> 18584 T2509 C126 P51400 oass.SolrIndexSearcher.<init> Opening Searcher@263c7bb0 realtime
[junit4:junit4]   2> 18585 T2523 C127 P51406 REQ /update {update.distrib=FROMLEADER&_version_=-1413660734512955392&update.from=http://127.0.0.1:51387/solr/collection1/&wt=javabin&version=2} status=0 QTime=2 
[junit4:junit4]   2> 18585 T2495 C124 P51394 REQ /update {update.distrib=FROMLEADER&_version_=-1413660734512955392&update.from=http://127.0.0.1:51387/solr/collection1/&wt=javabin&version=2} status=0 QTime=2 
[junit4:junit4]   2> 18585 T2509 C126 P51400 REQ /update {update.distrib=FROMLEADER&_version_=-1413660734512955392&update.from=http://127.0.0.1:51387/solr/collection1/&wt=javabin&version=2} status=0 QTime=2 
[junit4:junit4]   2> 18586 T2486 C125 P51387 /update {wt=javabin&version=2} {deleteByQuery=*:* (-1413660734512955392)} 0 7
[junit4:junit4]   2> 18591 T2469 C128 P51383 /update {wt=javabin&version=2} {add=[0 (1413660734523441152)]} 0 2
[junit4:junit4]   2> 18599 T2495 C124 P51394 REQ /update {distrib.from=http://127.0.0.1:51387/solr/collection1/&update.distrib=FROMLEADER&wt=javabin&version=2} status=0 QTime=2 
[junit4:junit4]   2> 18599 T2509 C126 P51400 REQ /update {distrib.from=http://127.0.0.1:51387/solr/collection1/&update.distrib=FROMLEADER&wt=javabin&version=2} status=0 QTime=2 
[junit4:junit4]   2> 18599 T2523 C127 P51406 REQ /update {distrib.from=http://127.0.0.1:51387/solr/collection1/&update.distrib=FROMLEADER&wt=javabin&version=2} status=0 QTime=2 
[junit4:junit4]   2> 18600 T2486 C125 P51387 /update {wt=javabin&version=2} {add=[0 (1413660734527635456)]} 0 7
[junit4:junit4]   2> 18603 T2469 C128 P51383 /update {wt=javabin&version=2} {add=[1 (1413660734537072640)]} 0 1
[junit4:junit4]   2> 18609 T2495 C124 P51394 REQ /update {distrib.from=http://127.0.0.1:51387/solr/collection1/&update.distrib=FROMLEADER&wt=javabin&version=2} status=0 QTime=0 
[junit4:junit4]   2> 18609 T2509 C126 P51400 REQ /update {distrib.from=http://127.0.0.1:51387/solr/collection1/&update.distrib=FROMLEADER&wt=javabin&version=2} status=0 QTime=1 
[junit4:junit4]   2> 18609 T2523 C127 P51406 REQ /update {distrib.from=http://127.0.0.1:51387/solr/collection1/&update.distrib=FROMLEADER&wt=javabin&version=2} status=0 QTime=1 
[junit4:junit4]   2> 18610 T2486 C125 P51387 /update {wt=javabin&version=2} {add=[1 (1413660734540218368)]} 0 5
[junit4:junit4]   2> 18612 T2469 C128 P51383 /update {wt=javabin&version=2} {add=[2 (1413660734547558400)]} 0 0
[junit4:junit4]   2> 18618 T2523 C127 P51406 REQ /update {distrib.from=http://127.0.0.1:51387/solr/collection1/&update.distrib=FROMLEADER&test.distrib.skip.servers=http://127.0.0.1:51394/solr/collection1/&wt=javabin&version=2} status=0 QTime=0 
[junit4:junit4]   2> 18618 T2509 C126 P51400 REQ /update {distrib.from=http://127.0.0.1:51387/solr/collection1/&update.distrib=FROMLEADER&test.distrib.skip.servers=http://127.0.0.1:51394/solr/collection1/&wt=javabin&version=2} status=0 QTime=0 
[junit4:junit4]   2> 18619 T2486 C125 P51387 /update {test.distrib.skip.servers=http://127.0.0.1:51394/solr/collection1/&wt=javabin&version=2} {add=[2 (1413660734550704128)]} 0 4
[junit4:junit4]   2> 18623 T2469 C128 P51383 /update {wt=javabin&version=2} {add=[3 (1413660734558044160)]} 0 1
[junit4:junit4]   2> 18629 T2523 C127 P51406 REQ /update {distrib.from=http://127.0.0.1:51387/solr/collection1/&update.distrib=FROMLEADER&test.distrib.skip.servers=http://127.0.0.1:51394/solr/collection1/&test.distrib.skip.servers=http://127.0.0.1:51400/solr/collection1/&wt=javabin&version=2} status=0 QTime=1 
[junit4:junit4]   2> 18629 T2486 C125 P51387 /update {test.distrib.skip.servers=http://127.0.0.1:51394/solr/collection1/&test.distrib.skip.servers=http://127.0.0.1:51400/solr/collection1/&wt=javabin&version=2} {add=[3 (1413660734561189888)]} 0 4
[junit4:junit4]   2> 18632 T2469 C128 P51383 oasu.DirectUpdateHandler2.commit start commit{flags=0,_version_=0,optimize=false,openSearcher=true,waitSearcher=true,expungeDeletes=false,softCommit=false}
[junit4:junit4]   2> 18721 T2469 C128 P51383 oasc.SolrDeletionPolicy.onCommit SolrDeletionPolicy.onCommit: commits:num=2
[junit4:junit4]   2> 		commit{dir=NRTCachingDirectory(org.apache.lucene.store.NIOFSDirectory@/usr/home/hudson/hudson-slave/workspace/Lucene-Solr-Tests-trunk-Java6/solr/build/solr-core/test/J1/org.apache.solr.cloud.SyncSliceTest-1348171916040/control/data/index lockFactory=org.apache.lucene.store.NativeFSLockFactory@63d92c04; maxCacheMB=48.0 maxMergeSizeMB=4.0),segFN=segments_1,generation=1,filenames=[segments_1]
[junit4:junit4]   2> 		commit{dir=NRTCachingDirectory(org.apache.lucene.store.NIOFSDirectory@/usr/home/hudson/hudson-slave/workspace/Lucene-Solr-Tests-trunk-Java6/solr/build/solr-core/test/J1/org.apache.solr.cloud.SyncSliceTest-1348171916040/control/data/index lockFactory=org.apache.lucene.store.NativeFSLockFactory@63d92c04; maxCacheMB=48.0 maxMergeSizeMB=4.0),segFN=segments_2,generation=2,filenames=[_0_Lucene40_0.tim, _0.fnm, _0_MockSep_0.pos, _0_Memory_0.ram, _0_nrm.cfs, _0_Lucene40_0.prx, _0_Lucene40_0.tip, _0_MockSep_0.tib, _0_Lucene40_0.frq, _0_MockSep_0.skp, _0_nrm.cfe, _0_SimpleText_0.pst, _0_MockSep_0.frq, segments_2, _0.fdx, _0_MockSep_0.tii, _0.si, _0_MockSep_0.pyl, _0_MockSep_0.doc, _0.fdt]
[junit4:junit4]   2> 18722 T2469 C128 P51383 oasc.SolrDeletionPolicy.updateCommits newest commit = 2
[junit4:junit4]   2> 18731 T2469 C128 P51383 oass.SolrIndexSearcher.<init> Opening Searcher@3ab0a9c4 main
[junit4:junit4]   2> 18732 T2469 C128 P51383 oasu.DirectUpdateHandler2.commit end_commit_flush
[junit4:junit4]   2> 18733 T2480 oasc.SolrCore.registerSearcher [collection1] Registered new searcher Searcher@3ab0a9c4 main{StandardDirectoryReader(segments_2:3:nrt _0(5.0):C4)}
[junit4:junit4]   2> 18734 T2469 C128 P51383 /update {waitSearcher=true&wt=javabin&commit=true&softCommit=false&version=2} {commit=} 0 102
[junit4:junit4]   2> 18736 T2486 C125 P51387 oasu.DirectUpdateHandler2.commit start commit{flags=0,_version_=0,optimize=false,openSearcher=true,waitSearcher=true,expungeDeletes=false,softCommit=false}
[junit4:junit4]   2> 18810 T2486 C125 P51387 oasc.SolrDeletionPolicy.onCommit SolrDeletionPolicy.onCommit: commits:num=2
[junit4:junit4]   2> 		commit{dir=NRTCachingDirectory(org.apache.lucene.store.NIOFSDirectory@/usr/home/hudson/hudson-slave/workspace/Lucene-Solr-Tests-trunk-Java6/solr/build/solr-core/test/J1/org.apache.solr.cloud.SyncSliceTest-1348171916040/jetty1/index lockFactory=org.apache.lucene.store.NativeFSLockFactory@4144712c; maxCacheMB=48.0 maxMergeSizeMB=4.0),segFN=segments_1,generation=1,filenames=[segments_1]
[junit4:junit4]   2> 		commit{dir=NRTCachingDirectory(org.apache.lucene.store.NIOFSDirectory@/usr/home/hudson/hudson-slave/workspace/Lucene-Solr-Tests-trunk-Java6/solr/build/solr-core/test/J1/org.apache.solr.cloud.SyncSliceTest-1348171916040/jetty1/index lockFactory=org.apache.lucene.store.NativeFSLockFactory@4144712c; maxCacheMB=48.0 maxMergeSizeMB=4.0),segFN=segments_2,generation=2,filenames=[_0_Lucene40_0.tim, _0.fnm, _0_MockSep_0.pos, _0_Memory_0.ram, _0_nrm.cfs, _0_Lucene40_0.prx, _0_Lucene40_0.tip, _0_MockSep_0.tib, _0_Lucene40_0.frq, _0_MockSep_0.skp, _0_nrm.cfe, _0_SimpleText_0.pst, _0_MockSep_0.frq, segments_2, _0.fdx, _0_MockSep_0.tii, _0.si, _0_MockSep_0.pyl, _0_MockSep_0.doc, _0.fdt]
[junit4:junit4]   2> 18811 T2486 C125 P51387 oasc.SolrDeletionPolicy.updateCommits newest commit = 2
[junit4:junit4]   2> 18819 T2486 C125 P51387 oass.SolrIndexSearcher.<init> Opening Searcher@7104e087 main
[junit4:junit4]   2> 18819 T2486 C125 P51387 oasu.DirectUpdateHandler2.commit end_commit_flush
[junit4:junit4]   2> 18821 T2492 oasc.SolrCore.registerSearcher [collection1] Registered new searcher Searcher@7104e087 main{StandardDirectoryReader(segments_2:3:nrt _0(5.0):C4)}
[junit4:junit4]   2> 18821 T2486 C125 P51387 oasu.SolrCmdDistributor.distribCommit Distrib commit to:[StdNode: http://127.0.0.1:51394/solr/collection1/, StdNode: http://127.0.0.1:51400/solr/collection1/, StdNode: http://127.0.0.1:51406/solr/collection1/]
[junit4:junit4]   2> 18824 T2523 C127 P51406 oasu.DirectUpdateHandler2.commit start commit{flags=0,_version_=0,optimize=false,openSearcher=true,waitSearcher=true,expungeDeletes=false,softCommit=false}
[junit4:junit4]   2> 18824 T2509 C126 P51400 oasu.DirectUpdateHandler2.commit start commit{flags=0,_version_=0,optimize=false,openSearcher=true,waitSearcher=true,expungeDeletes=false,softCommit=false}
[junit4:junit4]   2> 18824 T2495 C124 P51394 oasu.DirectUpdateHandler2.commit start commit{flags=0,_version_=0,optimize=false,openSearcher=true,waitSearcher=true,expungeDeletes=false,softCommit=false}
[junit4:junit4]   2> 18938 T2523 C127 P51406 oasc.SolrDeletionPolicy.onCommit SolrDeletionPolicy.onCommit: commits:num=2
[junit4:junit4]   2> 		commit{dir=NRTCachingDirectory(org.apache.lucene.store.NIOFSDirectory@/usr/home/hudson/hudson-slave/workspace/Lucene-Solr-Tests-trunk-Java6/solr/build/solr-core/test/J1/org.apache.solr.cloud.SyncSliceTest-1348171916040/jetty4/index lockFactory=org.apache.lucene.store.NativeFSLockFactory@547121cd; maxCacheMB=48.0 maxMergeSizeMB=4.0),segFN=segments_2,generation=2,filenames=[segments_2]
[junit4:junit4]   2> 		commit{dir=NRTCachingDirectory(org.apache.lucene.store.NIOFSDirectory@/usr/home/hudson/hudson-slave/workspace/Lucene-Solr-Tests-trunk-Java6/solr/build/solr-core/test/J1/org.apache.solr.cloud.SyncSliceTest-1348171916040/jetty4/index lockFactory=org.apache.lucene.store.NativeFSLockFactory@547121cd; maxCacheMB=48.0 maxMergeSizeMB=4.0),segFN=segments_3,generation=3,filenames=[_0_Lucene40_0.tim, _0.fnm, _0_MockSep_0.pos, _0_Memory_0.ram, _0_nrm.cfs, _0_Lucene40_0.prx, _0_Lucene40_0.tip, _0_MockSep_0.tib, _0_Lucene40_0.frq, _0_MockSep_0.skp, _0_nrm.cfe, _0_SimpleText_0.pst, _0_MockSep_0.frq, _0.fdx, _0_MockSep_0.tii, _0.si, _0_MockSep_0.pyl, _0_MockSep_0.doc, _0.fdt, segments_3]
[junit4:junit4]   2> 18938 T2509 C126 P51400 oasc.SolrDeletionPolicy.onCommit SolrDeletionPolicy.onCommit: commits:num=2
[junit4:junit4]   2> 		commit{dir=NRTCachingDirectory(org.apache.lucene.store.NIOFSDirectory@/usr/home/hudson/hudson-slave/workspace/Lucene-Solr-Tests-trunk-Java6/solr/build/solr-core/test/J1/org.apache.solr.cloud.SyncSliceTest-1348171916040/jetty3/index lockFactory=org.apache.lucene.store.NativeFSLockFactory@58c00adc; maxCacheMB=48.0 maxMergeSizeMB=4.0),segFN=segments_2,generation=2,filenames=[segments_2]
[junit4:junit4]   2> 		commit{dir=NRTCachingDirectory(org.apache.lucene.store.NIOFSDirectory@/usr/home/hudson/hudson-slave/workspace/Lucene-Solr-Tests-trunk-Java6/solr/build/solr-core/test/J1/org.apache.solr.cloud.SyncSliceTest-1348171916040/jetty3/index lockFactory=org.apache.lucene.store.NativeFSLockFactory@58c00adc; maxCacheMB=48.0 maxMergeSizeMB=4.0),segFN=segments_3,generation=3,filenames=[_0_Lucene40_0.tim, _0.fnm, _0_MockSep_0.pos, _0_Memory_0.ram, _0_nrm.cfs, _0_Lucene40_0.prx, _0_Lucene40_0.tip, _0_MockSep_0.tib, _0_Lucene40_0.frq, _0_MockSep_0.skp, _0_nrm.cfe, _0_SimpleText_0.pst, _0_MockSep_0.frq, _0.fdx, _0_MockSep_0.tii, _0.si, _0_MockSep_0.pyl, _0_MockSep_0.doc, _0.fdt, segments_3]
[junit4:junit4]   2> 18939 T2495 C124 P51394 oasc.SolrDeletionPolicy.onCommit SolrDeletionPolicy.onCommit: commits:num=2
[junit4:junit4]   2> 		commit{dir=NRTCachingDirectory(org.apache.lucene.store.NIOFSDirectory@/usr/home/hudson/hudson-slave/workspace/Lucene-Solr-Tests-trunk-Java6/solr/build/solr-core/test/J1/org.apache.solr.cloud.SyncSliceTest-1348171916040/jetty2/index lockFactory=org.apache.lucene.store.NativeFSLockFactory@5356bd08; maxCacheMB=48.0 maxMergeSizeMB=4.0),segFN=segments_2,generation=2,filenames=[segments_2]
[junit4:junit4]   2> 		commit{dir=NRTCachingDirectory(org.apache.lucene.store.NIOFSDirectory@/usr/home/hudson/hudson-slave/workspace/Lucene-Solr-Tests-trunk-Java6/solr/build/solr-core/test/J1/org.apache.solr.cloud.SyncSliceTest-1348171916040/jetty2/index lockFactory=org.apache.lucene.store.NativeFSLockFactory@5356bd08; maxCacheMB=48.0 maxMergeSizeMB=4.0),segFN=segments_3,generation=3,filenames=[_0_Lucene40_0.tim, _0.fnm, _0_MockSep_0.pos, _0_Memory_0.ram, _0_nrm.cfs, _0_Lucene40_0.prx, _0_Lucene40_0.tip, _0_MockSep_0.tib, _0_Lucene40_0.frq, _0_MockSep_0.skp, _0_nrm.cfe, _0_SimpleText_0.pst, _0_MockSep_0.frq, _0.fdx, _0_MockSep_0.tii, _0.si, _0_MockSep_0.pyl, _0_MockSep_0.doc, _0.fdt, segments_3]
[junit4:junit4]   2> 18940 T2509 C126 P51400 oasc.SolrDeletionPolicy.updateCommits newest commit = 3
[junit4:junit4]   2> 18939 T2523 C127 P51406 oasc.SolrDeletionPolicy.updateCommits newest commit = 3
[junit4:junit4]   2> 18941 T2495 C124 P51394 oasc.SolrDeletionPolicy.updateCommits newest commit = 3
[junit4:junit4]   2> 18952 T2523 C127 P51406 oass.SolrIndexSearcher.<init> Opening Searcher@259a1042 main
[junit4:junit4]   2> 18952 T2509 C126 P51400 oass.SolrIndexSearcher.<init> Opening Searcher@5e1ba12d main
[junit4:junit4]   2> 18953 T2523 C127 P51406 oasu.DirectUpdateHandler2.commit end_commit_flush
[junit4:junit4]   2> 18953 T2509 C126 P51400 oasu.DirectUpdateHandler2.commit end_commit_flush
[junit4:junit4]   2> 18953 T2495 C124 P51394 oass.SolrIndexSearcher.<init> Opening Searcher@33fc9e9c main
[junit4:junit4]   2> 18953 T2518 oasc.JmxMonitoredMap.put WARNING Failed to register info bean: searcher javax.management.InstanceAlreadyExistsException: solr/collection1:type=searcher,id=org.apache.solr.search.SolrIndexSearcher
[junit4:junit4]   2> 	at com.sun.jmx.mbeanserver.Repository.addMBean(Repository.java:467)
[junit4:junit4]   2> 	at com.sun.jmx.interceptor.DefaultMBeanServerInterceptor.internal_addObject(DefaultMBeanServerInterceptor.java:1520)
[junit4:junit4]   2> 	at com.sun.jmx.interceptor.DefaultMBeanServerInterceptor.registerDynamicMBean(DefaultMBeanServerInterceptor.java:986)
[junit4:junit4]   2> 	at com.sun.jmx.interceptor.DefaultMBeanServerInterceptor.registerObject(DefaultMBeanServerInterceptor.java:938)
[junit4:junit4]   2> 	at com.sun.jmx.interceptor.DefaultMBeanServerInterceptor.registerMBean(DefaultMBeanServerInterceptor.java:330)
[junit4:junit4]   2> 	at com.sun.jmx.mbeanserver.JmxMBeanServer.registerMBean(JmxMBeanServer.java:516)
[junit4:junit4]   2> 	at org.apache.solr.core.JmxMonitoredMap.put(JmxMonitoredMap.java:140)
[junit4:junit4]   2> 	at org.apache.solr.core.JmxMonitoredMap.put(JmxMonitoredMap.java:51)
[junit4:junit4]   2> 	at org.apache.solr.search.SolrIndexSearcher.register(SolrIndexSearcher.java:242)
[junit4:junit4]   2> 	at org.apache.solr.core.SolrCore.registerSearcher(SolrCore.java:1642)
[junit4:junit4]   2> 	at org.apache.solr.core.SolrCore.access$000(SolrCore.java:121)
[junit4:junit4]   2> 	at org.apache.solr.core.SolrCore$7.call(SolrCore.java:1519)
[junit4:junit4]   2> 	at java.util.concurrent.FutureTask$Sync.innerRun(FutureTask.java:334)
[junit4:junit4]   2> 	at java.util.concurrent.FutureTask.run(FutureTask.java:166)
[junit4:junit4]   2> 	at java.util.concurrent.ThreadPoolExecutor.runWorker(ThreadPoolExecutor.java:1110)
[junit4:junit4]   2> 	at java.util.concurrent.ThreadPoolExecutor$Worker.run(ThreadPoolExecutor.java:603)
[junit4:junit4]   2> 	at java.lang.Thread.run(Thread.java:679)
[junit4:junit4]   2> 
[junit4:junit4]   2> 18954 T2532 oasc.SolrCore.registerSearcher [collection1] Registered new searcher Searcher@259a1042 main{StandardDirectoryReader(segments_3:4:nrt _0(5.0):C4)}
[junit4:junit4]   2> 18954 T2495 C124 P51394 oasu.DirectUpdateHandler2.commit end_commit_flush
[junit4:junit4]   2> 18955 T2523 C127 P51406 /update {waitSearcher=true&commit=true&wt=javabin&commit_end_point=true&expungeDeletes=false&softCommit=false&version=2} {commit=} 0 131
[junit4:junit4]   2> 18955 T2504 oasc.SolrCore.registerSearcher [collection1] Registered new searcher Searcher@33fc9e9c main{StandardDirectoryReader(segments_3:4:nrt _0(5.0):C2)}
[junit4:junit4]   2> 18956 T2518 oasc.SolrCore.registerSearcher [collection1] Registered new searcher Searcher@5e1ba12d main{StandardDirectoryReader(segments_3:4:nrt _0(5.0):C3)}
[junit4:junit4]   2> 18956 T2495 C124 P51394 /update {waitSearcher=true&commit=true&wt=javabin&commit_end_point=true&expungeDeletes=false&softCommit=false&version=2} {commit=} 0 132
[junit4:junit4]   2> 18956 T2509 C126 P51400 /update {waitSearcher=true&commit=true&wt=javabin&commit_end_point=true&expungeDeletes=false&softCommit=false&version=2} {commit=} 0 132
[junit4:junit4]   2> 18957 T2486 C125 P51387 /update {waitSearcher=true&wt=javabin&commit=true&softCommit=false&version=2} {commit=} 0 221
[junit4:junit4]   2> 18957 T2457 oasc.AbstractDistribZkTestBase.waitForRecoveriesToFinish Wait for recoveries to finish - collection: collection1 failOnTimeout:true timeout (sec):1800
[junit4:junit4]   2> 18958 T2457 oascc.ZkStateReader.updateClusterState Updating cloud state from ZooKeeper... 
[junit4:junit4]   2> check const of shard1
[junit4:junit4]   2> client0
[junit4:junit4]   2> PROPS:127.0.0.1:51387_solr_collection1:{"shard":"shard1","roles":null,"state":"active","core":"collection1","collection":"collection1","node_name":"127.0.0.1:51387_solr","base_url":"http://127.0.0.1:51387/solr","leader":"true"}
[junit4:junit4]   2> 18962 T2485 C125 P51387 REQ /select {distrib=false&wt=javabin&q=*:*&version=2} hits=4 status=0 QTime=0 
[junit4:junit4]   2>  live:true
[junit4:junit4]   2>  num:4
[junit4:junit4]   2> 
[junit4:junit4]   2> client1
[junit4:junit4]   2> PROPS:127.0.0.1:51394_solr_collection1:{"shard":"shard1","roles":null,"state":"active","core":"collection1","collection":"collection1","node_name":"127.0.0.1:51394_solr","base_url":"http://127.0.0.1:51394/solr"}
[junit4:junit4]   2> 18966 T2496 C124 P51394 REQ /select {distrib=false&wt=javabin&q=*:*&version=2} hits=2 status=0 QTime=0 
[junit4:junit4]   2>  live:true
[junit4:junit4]   2>  num:2
[junit4:junit4]   2> 
[junit4:junit4]   2> ######shard1 is not consistent.  Got 4 from http://127.0.0.1:51387/solr/collection1lastClient and got 2 from http://127.0.0.1:51394/solr/collection1
[junit4:junit4]   2> 18969 T2485 C125 P51387 REQ /select {fl=id,_version_&sort=id+asc&q=*:*&distrib=false&wt=javabin&rows=1000&version=2} hits=4 status=0 QTime=0 
[junit4:junit4]   2> 18972 T2496 C124 P51394 REQ /select {fl=id,_version_&sort=id+asc&q=*:*&distrib=false&wt=javabin&rows=1000&version=2} hits=2 status=0 QTime=0 
[junit4:junit4]   2> ######http://127.0.0.1:51387/solr/collection1: {numFound=4,start=0,docs=[SolrDocument{id=0, _version_=1413660734527635456}, SolrDocument{id=1, _version_=1413660734540218368}, SolrDocument{id=2, _version_=1413660734550704128}, SolrDocument{id=3, _version_=1413660734561189888}]}
[junit4:junit4]   2> ######http://127.0.0.1:51394/solr/collection1: {numFound=2,start=0,docs=[SolrDocument{id=0, _version_=1413660734527635456}, SolrDocument{id=1, _version_=1413660734540218368}]}
[junit4:junit4]   2> ###### sizes=4,2
[junit4:junit4]   2> ###### Only in http://127.0.0.1:51387/solr/collection1: [{id=3, _version_=1413660734561189888}, {id=2, _version_=1413660734550704128}]
[junit4:junit4]   2> client2
[junit4:junit4]   2> PROPS:127.0.0.1:51400_solr_collection1:{"shard":"shard1","roles":null,"state":"active","core":"collection1","collection":"collection1","node_name":"127.0.0.1:51400_solr","base_url":"http://127.0.0.1:51400/solr"}
[junit4:junit4]   2> 18976 T2510 C126 P51400 REQ /select {distrib=false&wt=javabin&q=*:*&version=2} hits=3 status=0 QTime=0 
[junit4:junit4]   2>  live:true
[junit4:junit4]   2>  num:3
[junit4:junit4]   2> 
[junit4:junit4]   2> client3
[junit4:junit4]   2> PROPS:127.0.0.1:51406_solr_collection1:{"shard":"shard1","roles":null,"state":"active","core":"collection1","collection":"collection1","node_name":"127.0.0.1:51406_solr","base_url":"http://127.0.0.1:51406/solr"}
[junit4:junit4]   2> 18980 T2524 C127 P51406 REQ /select {distrib=false&wt=javabin&q=*:*&version=2} hits=4 status=0 QTime=0 
[junit4:junit4]   2>  live:true
[junit4:junit4]   2>  num:4
[junit4:junit4]   2> 
[junit4:junit4]   2> 18982 T2457 oascsi.HttpClientUtil.createClient Creating new http client, config:maxConnections=128&maxConnectionsPerHost=32&followRedirects=false
[junit4:junit4]   2> 18998 T2511 oasha.CollectionsHandler.handleSyncShardAction Syncing shard : action=SYNCSHARD&collection=collection1&shard=shard1&wt=javabin&version=2
[junit4:junit4]   2> 18998 T2511 oascsi.HttpClientUtil.createClient Creating new http client, config:maxConnections=128&maxConnectionsPerHost=32&followRedirects=false
[junit4:junit4]   2> 19010 T2489 oasha.CoreAdminHandler.handleRequestSyncAction I have been requested to sync up my shard
[junit4:junit4]   2> 19011 T2489 oasc.SyncStrategy.sync Sync replicas to http://127.0.0.1:51387/solr/collection1/
[junit4:junit4]   2> 19011 T2489 oasu.PeerSync.sync PeerSync: core=collection1 url=http://127.0.0.1:51387/solr START replicas=[http://127.0.0.1:51394/solr/collection1/, http://127.0.0.1:51400/solr/collection1/, http://127.0.0.1:51406/solr/collection1/] nUpdates=100
[junit4:junit4]   2> 19013 T2497 C124 P51394 REQ /get {distrib=false&qt=/get&wt=javabin&version=2&getVersions=100} status=0 QTime=0 
[junit4:junit4]   2> 19013 T2525 C127 P51406 REQ /get {distrib=false&qt=/get&wt=javabin&version=2&getVersions=100} status=0 QTime=0 
[junit4:junit4]   2> 19013 T2489 oasu.PeerSync.handleVersions PeerSync: core=collection1 url=http://127.0.0.1:51387/solr  Received 3 versions from 127.0.0.1:51394/solr/collection1/
[junit4:junit4]   2> 19013 T2512 C126 P51400 REQ /get {distrib=false&qt=/get&wt=javabin&version=2&getVersions=100} status=0 QTime=0 
[junit4:junit4]   2> 19014 T2489 oasu.PeerSync.handleVersions PeerSync: core=collection1 url=http://127.0.0.1:51387/solr  Our versions are newer. ourLowThreshold=1413660734512955392 otherHigh=1413660734540218368
[junit4:junit4]   2> 19014 T2489 oasu.PeerSync.handleVersions PeerSync: core=collection1 url=http://127.0.0.1:51387/solr  Received 5 versions from 127.0.0.1:51406/solr/collection1/
[junit4:junit4]   2> 19014 T2489 oasu.PeerSync.handleVersions PeerSync: core=collection1 url=http://127.0.0.1:51387/solr  Our versions are newer. ourLowThreshold=1413660734512955392 otherHigh=1413660734550704128
[junit4:junit4]   2> 19015 T2489 oasu.PeerSync.handleVersions PeerSync: core=collection1 url=http://127.0.0.1:51387/solr  Received 4 versions from 127.0.0.1:51400/solr/collection1/
[junit4:junit4]   2> 19015 T2489 oasu.PeerSync.handleVersions PeerSync: core=collection1 url=http://127.0.0.1:51387/solr  Our versions are newer. ourLowThreshold=1413660734512955392 otherHigh=1413660734550704128
[junit4:junit4]   2> 19015 T2489 oasu.PeerSync.sync PeerSync: core=collection1 url=http://127.0.0.1:51387/solr DONE. sync succeeded
[junit4:junit4]   2> 19016 T2489 oasc.SyncStrategy.syncReplicas Sync Success - now sync replicas to me
[junit4:junit4]   2> 19016 T2489 oasc.SyncStrategy.syncToMe http://127.0.0.1:51387/solr/collection1/: try and ask http://127.0.0.1:51394/solr/collection1/ to sync
[junit4:junit4]   2> 19017 T2489 oasc.SyncStrategy.syncToMe http://127.0.0.1:51387/solr/collection1/: try and ask http://127.0.0.1:51400/solr/collection1/ to sync
[junit4:junit4]   2> 19017 T2489 oasc.SyncStrategy.syncToMe http://127.0.0.1:51387/solr/collection1/: try and ask http://127.0.0.1:51406/solr/collection1/ to sync
[junit4:junit4]   2> 19019 T2498 C124 P51394 oasu.PeerSync.sync PeerSync: core=collection1 url=http://127.0.0.1:51394/solr START replicas=[http://127.0.0.1:51387/solr/collection1/] nUpdates=100
[junit4:junit4]   2> 19019 T2513 C126 P51400 oasu.PeerSync.sync PeerSync: core=collection1 url=http://127.0.0.1:51400/solr START replicas=[http://127.0.0.1:51387/solr/collection1/] nUpdates=100
[junit4:junit4]   2> 19020 T2526 C127 P51406 oasu.PeerSync.sync PeerSync: core=collection1 url=http://127.0.0.1:51406/solr START replicas=[http://127.0.0.1:51387/solr/collection1/] nUpdates=100
[junit4:junit4]   2> 19021 T2488 C125 P51387 REQ /get {distrib=false&qt=/get&wt=javabin&version=2&getVersions=100} status=0 QTime=0 
[junit4:junit4]   2> 19021 T2484 C125 P51387 REQ /get {distrib=false&qt=/get&wt=javabin&version=2&getVersions=100} status=0 QTime=0 
[junit4:junit4]   2> 19021 T2513 C126 P51400 oasu.PeerSync.handleVersions PeerSync: core=collection1 url=http://127.0.0.1:51400/solr  Received 5 versions from 127.0.0.1:51387/solr/collection1/
[junit4:junit4]   2> 19022 T2526 C127 P51406 oasu.PeerSync.handleVersions PeerSync: core=collection1 url=http://127.0.0.1:51406/solr  Received 5 versions from 127.0.0.1:51387/solr/collection1/
[junit4:junit4]   2> 19022 T2513 C126 P51400 oasu.PeerSync.requestUpdates PeerSync: core=collection1 url=http://127.0.0.1:51400/solr Requesting updates from 127.0.0.1:51387/solr/collection1/n=1 versions=[1413660734561189888]
[junit4:junit4]   2> 19022 T2526 C127 P51406 oasu.PeerSync.handleVersions PeerSync: core=collection1 url=http://127.0.0.1:51406/solr  Our versions are newer. ourLowThreshold=1413660734512955392 otherHigh=1413660734550704128
[junit4:junit4]   2> 19022 T2483 C125 P51387 REQ /get {distrib=false&qt=/get&wt=javabin&version=2&getVersions=100} status=0 QTime=0 
[junit4:junit4]   2> 19023 T2526 C127 P51406 oasu.PeerSync.sync PeerSync: core=collection1 url=http://127.0.0.1:51406/solr DONE. sync succeeded
[junit4:junit4]   2> 19023 T2526 C127 P51406 REQ /get {sync=http://127.0.0.1:51387/solr/collection1/&getVersions=100&distrib=false&qt=/get&wt=javabin&version=2} status=0 QTime=3 
[junit4:junit4]   2> 19023 T2498 C124 P51394 oasu.PeerSync.handleVersions PeerSync: core=collection1 url=http://127.0.0.1:51394/solr  Received 5 versions from 127.0.0.1:51387/solr/collection1/
[junit4:junit4]   2> 19024 T2498 C124 P51394 oasu.PeerSync.requestUpdates PeerSync: core=collection1 url=http://127.0.0.1:51394/solr Requesting updates from 127.0.0.1:51387/solr/collection1/n=2 versions=[1413660734561189888, 1413660734550704128]
[junit4:junit4]   2> 19024 T2489 oasc.SyncStrategy.syncToMe http://127.0.0.1:51387/solr/collection1/:  sync completed with http://127.0.0.1:51406/solr/collection1/
[junit4:junit4]   2> 19025 T2484 C125 P51387 REQ /get {distrib=false&getUpdates=1413660734561189888&qt=/get&wt=javabin&version=2} status=0 QTime=0 
[junit4:junit4]   2> 19026 T2483 C125 P51387 REQ /get {distrib=false&getUpdates=1413660734561189888,1413660734550704128&qt=/get&wt=javabin&version=2} status=0 QTime=0 
[junit4:junit4]   2> 19029 T2513 C126 P51400 oasu.PeerSync.sync PeerSync: core=collection1 url=http://127.0.0.1:51400/solr DONE. sync succeeded
[junit4:junit4]   2> 19029 T2513 C126 P51400 REQ /get {sync=http://127.0.0.1:51387/solr/collection1/&getVersions=100&distrib=false&qt=/get&wt=javabin&version=2} status=0 QTime=10 
[junit4:junit4]   2> 19030 T2498 C124 P51394 oasu.PeerSync.sync PeerSync: core=collection1 url=http://127.0.0.1:51394/solr DONE. sync succeeded
[junit4:junit4]   2> 19030 T2489 oasc.SyncStrategy.syncToMe http://127.0.0.1:51387/solr/collection1/:  sync completed with http://127.0.0.1:51400/solr/collection1/
[junit4:junit4]   2> 19030 T2498 C124 P51394 REQ /get {sync=http://127.0.0.1:51387/solr/collection1/&getVersions=100&distrib=false&qt=/get&wt=javabin&version=2} status=0 QTime=12 
[junit4:junit4]   2> 19031 T2489 oasc.SyncStrategy.syncToMe http://127.0.0.1:51387/solr/collection1/:  sync completed with http://127.0.0.1:51394/solr/collection1/
[junit4:junit4]   2> 19032 T2457 oasc.AbstractFullDistribZkTestBase.waitForThingsToLevelOut Wait for recoveries to finish - wait 15 for each attempt
[junit4:junit4]   2> 19032 T2457 oasc.AbstractDistribZkTestBase.waitForRecoveriesToFinish Wait for recoveries to finish - collection: collection1 failOnTimeout:true timeout (sec):15
[junit4:junit4]   2> 19033 T2457 oascc.ZkStateReader.updateClusterState Updating cloud state from ZooKeeper... 
[junit4:junit4]   2> 19036 T2469 C128 P51383 oasu.DirectUpdateHandler2.commit start commit{flags=0,_version_=0,optimize=false,openSearcher=true,waitSearcher=true,expungeDeletes=false,softCommit=false}
[junit4:junit4]   2> 19037 T2469 C128 P51383 oass.SolrIndexSearcher.<init> Opening Searcher@44a87afc main
[junit4:junit4]   2> 19038 T2469 C128 P51383 oasu.DirectUpdateHandler2.commit end_commit_flush
[junit4:junit4]   2> 19039 T2480 oasc.SolrCore.registerSearcher [collection1] Registered new searcher Searcher@44a87afc main{StandardDirectoryReader(segments_2:3:nrt _0(5.0):C4)}
[junit4:junit4]   2> 19040 T2469 C128 P51383 /update {waitSearcher=true&wt=javabin&commit=true&softCommit=false&version=2} {commit=} 0 4
[junit4:junit4]   2> 19043 T2486 C125 P51387 oasu.DirectUpdateHandler2.commit start commit{flags=0,_version_=0,optimize=false,openSearcher=true,waitSearcher=true,expungeDeletes=false,softCommit=false}
[junit4:junit4]   2> 19045 T2486 C125 P51387 oass.SolrIndexSearcher.<init> Opening Searcher@6628d7e6 main
[junit4:junit4]   2> 19046 T2486 C125 P51387 oasu.DirectUpdateHandler2.commit end_commit_flush
[junit4:junit4]   2> 19047 T2492 oasc.SolrCore.registerSearcher [collection1] Registered new searcher Searcher@6628d7e6 main{StandardDirectoryReader(segments_2:3:nrt _0(5.0):C4)}
[junit4:junit4]   2> 19048 T2486 C125 P51387 oasu.SolrCmdDistributor.distribCommit Distrib commit to:[StdNode: http://127.0.0.1:51394/solr/collection1/, StdNode: http://127.0.0.1:51400/solr/collection1/, StdNode: http://127.0.0.1:51406/solr/collection1/]
[junit4:junit4]   2> 19051 T2495 C124 P51394 oasu.DirectUpdateHandler2.commit start commit{flags=0,_version_=0,optimize=false,openSearcher=true,waitSearcher=true,expungeDeletes=false,softCommit=false}
[junit4:junit4]   2> 19051 T2523 C127 P51406 oasu.DirectUpdateHandler2.commit start commit{flags=0,_version_=0,optimize=false,openSearcher=true,waitSearcher=true,expungeDeletes=false,softCommit=false}
[junit4:junit4]   2> 19051 T2509 C126 P51400 oasu.DirectUpdateHandler2.commit start commit{flags=0,_version_=0,optimize=false,openSearcher=true,waitSearcher=true,expungeDeletes=false,softCommit=false}
[junit4:junit4]   2> 19053 T2523 C127 P51406 oass.SolrIndexSearcher.<init> Opening Searcher@1183170c main
[junit4:junit4]   2> 19053 T2523 C127 P51406 oasu.DirectUpdateHandler2.commit end_commit_flush
[junit4:junit4]   2> 19055 T2532 oasc.SolrCore.registerSearcher [collection1] Registered new searcher Searcher@1183170c main{StandardDirectoryReader(segments_3:4:nrt _0(5.0):C4)}
[junit4:junit4]   2> 19055 T2523 C127 P51406 /update {waitSearcher=true&commit=true&wt=javabin&commit_end_point=true&expungeDeletes=false&softCommit=false&version=2} {commit=} 0 4
[junit4:junit4]   2> 19194 T2495 C124 P51394 oasc.SolrDeletionPolicy.onCommit SolrDeletionPolicy.onCommit: commits:num=2
[junit4:junit4]   2> 		commit{dir=NRTCachingDirectory(org.apache.lucene.store.NIOFSDirectory@/usr/home/hudson/hudson-slave/workspace/Lucene-Solr-Tests-trunk-Java6/solr/build/solr-core/test/J1/org.apache.solr.cloud.SyncSliceTest-1348171916040/jetty2/index lockFactory=org.apache.lucene.store.NativeFSLockFactory@5356bd08; maxCacheMB=48.0 maxMergeSizeMB=4.0),segFN=segments_3,generation=3,filenames=[_0_Lucene40_0.tim, _0.fnm, _0_MockSep_0.pos, _0_Memory_0.ram, _0_nrm.cfs, _0_Lucene40_0.prx, _0_Lucene40_0.tip, _0_MockSep_0.tib, _0_Lucene40_0.frq, _0_MockSep_0.skp, _0_nrm.cfe, _0_SimpleText_0.pst, _0_MockSep_0.frq, _0.fdx, _0_MockSep_0.tii, _0.si, _0_MockSep_0.pyl, _0_MockSep_0.doc, _0.fdt, segments_3]
[junit4:junit4]   2> 		commit{dir=NRTCachingDirectory(org.apache.lucene.store.NIOFSDirectory@/usr/home/hudson/hudson-slave/workspace/Lucene-Solr-Tests-trunk-Java6/solr/build/solr-core/test/J1/org.apache.solr.cloud.SyncSliceTest-1348171916040/jetty2/index lockFactory=org.apache.lucene.store.NativeFSLockFactory@5356bd08; maxCacheMB=48.0 maxMergeSizeMB=4.0),segFN=segments_4,generation=4,filenames=[_1_Lucene40_0.tim, _1_MockSep_0.frq, _0_MockSep_0.pos, _0_Lucene40_0.prx, _1.fnm, _1_Lucene40_0.tip, _1_Memory_0.ram, _0_Lucene40_0.frq, _0_MockSep_0.skp, _0_SimpleText_0.pst, _0_MockSep_0.doc, _0.si, _1_MockSep_0.doc, _1_MockSep_0.pyl, _1_nrm.cfs, _1_MockSep_0.skp, _0_Lucene40_0.tim, _0.fnm, _1_MockSep_0.pos, _1_MockSep_0.tib, _0_Memory_0.ram, _1_Lucene40_0.frq, _0_nrm.cfs, _1_Lucene40_0.prx, _1_MockSep_0.tii, _1_nrm.cfe, _0_Lucene40_0.tip, _0_MockSep_0.tib, _1.fdx, _1.fdt, _1.si, _0_nrm.cfe, _0_MockSep_0.frq, _0.fdx, _0_MockSep_0.tii, _0_MockSep_0.pyl, _0.fdt, _1_SimpleText_0.pst, segments_4]
[junit4:junit4]   2> 19194 T2509 C126 P51400 oasc.SolrDeletionPolicy.onCommit SolrDeletionPolicy.onCommit: commits:num=2
[junit4:junit4]   2> 		commit{dir=NRTCachingDirectory(org.apache.lucene.store.NIOFSDirectory@/usr/home/hudson/hudson-slave/workspace/Lucene-Solr-Tests-trunk-Java6/solr/build/solr-core/test/J1/org.apache.solr.cloud.SyncSliceTest-1348171916040/jetty3/index lockFactory=org.apache.lucene.store.NativeFSLockFactory@58c00adc; maxCacheMB=48.0 maxMergeSizeMB=4.0),segFN=segments_3,generation=3,filenames=[_0_Lucene40_0.tim, _0.fnm, _0_MockSep_0.pos, _0_Memory_0.ram, _0_nrm.cfs, _0_Lucene40_0.prx, _0_Lucene40_0.tip, _0_MockSep_0.tib, _0_Lucene40_0.frq, _0_MockSep_0.skp, _0_nrm.cfe, _0_SimpleText_0.pst, _0_MockSep_0.frq, _0.fdx, _0_MockSep_0.tii, _0.si, _0_MockSep_0.pyl, _0_MockSep_0.doc, _0.fdt, segments_3]
[junit4:junit4]   2> 		commit{dir=NRTCachingDirectory(org.apache.lucene.store.NIOFSDirectory@/usr/home/hudson/hudson-slave/workspace/Lucene-Solr-Tests-trunk-Java6/solr/build/solr-core/test/J1/org.apache.solr.cloud.SyncSliceTest-1348171916040/jetty3/index lockFactory=org.apache.lucene.store.NativeFSLockFactory@58c00adc; maxCacheMB=48.0 maxMergeSizeMB=4.0),segFN=segments_4,generation=4,filenames=[_1_Lucene40_0.tim, _1_MockSep_0.frq, _0_MockSep_0.pos, _0_Lucene40_0.prx, _1.fnm, _1_Lucene40_0.tip, _1_Memory_0.ram, _0_Lucene40_0.frq, _0_MockSep_0.skp, _0_SimpleText_0.pst, _0_MockSep_0.doc, _0.si, _1_MockSep_0.doc, _1_MockSep_0.pyl, _1_nrm.cfs, _1_MockSep_0.skp, _0_Lucene40_0.tim, _0.fnm, _1_MockSep_0.pos, _1_MockSep_0.tib, _0_Memory_0.ram, _1_Lucene40_0.frq, _0_nrm.cfs, _1_Lucene40_0.prx, _1_MockSep_0.tii, _1_nrm.cfe, _0_Lucene40_0.tip, _0_MockSep_0.tib, _1.fdx, _1.fdt, _1.si, _0_nrm.cfe, _0_MockSep_0.frq, _0.fdx, _0_MockSep_0.tii, _0_MockSep_0.pyl, _0.fdt, _1_SimpleText_0.pst, segments_4]
[junit4:junit4]   2> 19194 T2495 C124 P51394 oasc.SolrDeletionPolicy.updateCommits newest commit = 4
[junit4:junit4]   2> 19195 T2509 C126 P51400 oasc.SolrDeletionPolicy.updateCommits newest commit = 4
[junit4:junit4]   2> 19204 T2495 C124 P51394 oass.SolrIndexSearcher.<init> Opening Searcher@1ad394f5 main
[junit4:junit4]   2> 19204 T2509 C126 P51400 oass.SolrIndexSearcher.<init> Opening Searcher@54d60e1d main
[junit4:junit4]   2> 19205 T2509 C126 P51400 oasu.DirectUpdateHandler2.commit end_commit_flush
[junit4:junit4]   2> 19205 T2495 C124 P51394 oasu.DirectUpdateHandler2.commit end_commit_flush
[junit4:junit4]   2> 19206 T2518 oasc.SolrCore.registerSearcher [collection1] Registered new searcher Searcher@54d60e1d main{StandardDirectoryReader(segments_4:6:nrt _0(5.0):C3 _1(5.0):C1)}
[junit4:junit4]   2> 19207 T2504 oasc.SolrCore.registerSearcher [collection1] Registered new searcher Searcher@1ad394f5 main{StandardDirectoryReader(segments_4:6:nrt _0(5.0):C2 _1(5.0):C2)}
[junit4:junit4]   2> 19207 T2509 C126 P51400 /update {waitSearcher=true&commit=true&wt=javabin&commit_end_point=true&expungeDeletes=false&softCommit=false&version=2} {commit=} 0 156
[junit4:junit4]   2> 19207 T2495 C124 P51394 /update {waitSearcher=true&commit=true&wt=javabin&commit_end_point=true&expungeDeletes=false&softCommit=false&version=2} {commit=} 0 156
[junit4:junit4]   2> 19208 T2486 C125 P51387 /update {waitSearcher=true&wt=javabin&commit=true&softCommit=false&version=2} {commit=} 0 165
[junit4:junit4]   2> 19209 T2457 oascc.ZkStateReader.updateClusterState Updating cloud state from ZooKeeper... 
[junit4:junit4]   2> 19213 T2485 C125 P51387 REQ /select {distrib=false&wt=javabin&q=*:*&version=2} hits=4 status=0 QTime=0 
[junit4:junit4]   2> 19216 T2496 C124 P51394 REQ /select {distrib=false&wt=javabin&q=*:*&version=2} hits=4 status=0 QTime=0 
[junit4:junit4]   2> 19220 T2510 C126 P51400 REQ /select {distrib=false&wt=javabin&q=*:*&version=2} hits=4 status=0 QTime=0 
[junit4:junit4]   2> 19223 T2524 C127 P51406 REQ /select {distrib=false&wt=javabin&q=*:*&version=2} hits=4 status=0 QTime=0 
[junit4:junit4]   2> 21231 T2470 C128 P51383 REQ /select {fl=id,score&shard.url=127.0.0.1:51383/solr/collection1/&NOW=1348171937265&start=0&q=*:*&distrib=false&isShard=true&wt=javabin&fsv=true&rows=10&version=2} hits=4 status=0 QTime=1 
[junit4:junit4]   2> 21234 T2470 C128 P51383 REQ /select {shard.url=127.0.0.1:51383/solr/collection1/&NOW=1348171937265&q=*:*&ids=3,2,1,0&distrib=false&isShard=true&wt=javabin&version=2} status=0 QTime=0 
[junit4:junit4]   2> 21236 T2469 C128 P51383 REQ /select {wt=javabin&q=*:*&version=2} hits=4 status=0 QTime=9 
[junit4:junit4]   2> Control Docs:4
[junit4:junit4]   2> 21237 T2457 oascc.ZkStateReader.updateClusterState Updating cloud state from ZooKeeper... 
[junit4:junit4]   2> check const of shard1
[junit4:junit4]   2> client0
[junit4:junit4]   2> PROPS:127.0.0.1:51387_solr_collection1:{"shard":"shard1","roles":null,"state":"active","core":"collection1","collection":"collection1","node_name":"127.0.0.1:51387_solr","base_url":"http://127.0.0.1:51387/solr","leader":"true"}
[junit4:junit4]   2> 21240 T2485 C125 P51387 REQ /select {distrib=false&wt=javabin&q=*:*&version=2} hits=4 status=0 QTime=0 
[junit4:junit4]   2>  live:true
[junit4:junit4]   2>  num:4
[junit4:junit4]   2> 
[junit4:junit4]   2> client1
[junit4:junit4]   2> PROPS:127.0.0.1:51394_solr_collection1:{"shard":"shard1","roles":null,"state":"active","core":"collection1","collection":"collection1","node_name":"127.0.0.1:51394_solr","base_url":"http://127.0.0.1:51394/solr"}
[junit4:junit4]   2> 21243 T2496 C124 P51394 REQ /select {distrib=false&wt=javabin&q=*:*&version=2} hits=4 status=0 QTime=0 
[junit4:junit4]   2>  live:true
[junit4:junit4]   2>  num:4
[junit4:junit4]   2> 
[junit4:junit4]   2> client2
[junit4:junit4]   2> PROPS:127.0.0.1:51400_solr_collection1:{"shard":"shard1","roles":null,"state":"active","core":"collection1","collection":"collection1","node_name":"127.0.0.1:51400_solr","base_url":"http://127.0.0.1:51400/solr"}
[junit4:junit4]   2> 21246 T2510 C126 P51400 REQ /select {distrib=false&wt=javabin&q=*:*&version=2} hits=4 status=0 QTime=0 
[junit4:junit4]   2>  live:true
[junit4:junit4]   2>  num:4
[junit4:junit4]   2> 
[junit4:junit4]   2> client3
[junit4:junit4]   2> PROPS:127.0.0.1:51406_solr_collection1:{"shard":"shard1","roles":null,"state":"active","core":"collection1","collection":"collection1","node_name":"127.0.0.1:51406_solr","base_url":"http://127.0.0.1:51406/solr"}
[junit4:junit4]   2> 21249 T2524 C127 P51406 REQ /select {distrib=false&wt=javabin&q=*:*&version=2} hits=4 status=0 QTime=0 
[junit4:junit4]   2>  live:true
[junit4:junit4]   2>  num:4
[junit4:junit4]   2> 
[junit4:junit4]   2> 21255 T2553 C125 P51387 REQ /select {fl=id,score&shard.url=127.0.0.1:51387/solr/collection1/|127.0.0.1:51394/solr/collection1/|127.0.0.1:51400/solr/collection1/|127.0.0.1:51406/solr/collection1/&NOW=1348171937290&start=0&q=*:*&distrib=false&isShard=true&wt=javabin&fsv=true&rows=10&version=2} hits=4 status=0 QTime=0 
[junit4:junit4]   2> 21258 T2553 C125 P51387 REQ /select {shard.url=127.0.0.1:51387/solr/collection1/|127.0.0.1:51394/solr/collection1/|127.0.0.1:51400/solr/collection1/|127.0.0.1:51406/solr/collection1/&NOW=1348171937290&q=*:*&ids=3,2,1,0&distrib=false&isShard=true&wt=javabin&version=2} status=0 QTime=0 
[junit4:junit4]   2> 21259 T2486 C125 P51387 REQ /select {wt=javabin&q=*:*&version=2} hits=4 status=0 QTime=7 
[junit4:junit4]   2> 21264 T2469 C128 P51383 /update {wt=javabin&version=2} {add=[4 (1413660737326284800)]} 0 2
[junit4:junit4]   2> 21274 T2509 C126 P51400 REQ /update {distrib.from=http://127.0.0.1:51387/solr/collection1/&update.distrib=FROMLEADER&test.distrib.skip.servers=http://127.0.0.1:51394/solr/collection1/&wt=javabin&version=2} status=0 QTime=3 
[junit4:junit4]   2> 21274 T2523 C127 P51406 REQ /update {distrib.from=http://127.0.0.1:51387/solr/collection1/&update.distrib=FROMLEADER&test.distrib.skip.servers=http://127.0.0.1:51394/solr/collection1/&wt=javabin&version=2} status=0 QTime=3 
[junit4:junit4]   2> 21274 T2486 C125 P51387 /update {test.distrib.skip.servers=http://127.0.0.1:51394/solr/collection1/&wt=javabin&version=2} {add=[4 (1413660737331527680)]} 0 7
[junit4:junit4]   2> 21275 T2457 oasc.ChaosMonkey.monkeyLog monkey: kill shard! 51387
[junit4:junit4]   2> 21276 T2457 oasc.CoreContainer.shutdown Shutting down CoreContainer instance=1689709123
[junit4:junit4]   2> 21277 T2457 oasc.SolrCore.close [collection1]  CLOSING SolrCore org.apache.solr.core.SolrCore@440d6032
[junit4:junit4]   2> 21291 T2457 oasc.SolrCore.closeSearcher [collection1] Closing main searcher on request.
[junit4:junit4]   2> 21292 T2457 oasu.DirectUpdateHandler2.close closing DirectUpdateHandler2{commits=6,autocommits=0,soft autocommits=0,optimizes=0,rollbacks=0,expungeDeletes=0,docsPending=1,adds=1,deletesById=0,deletesByQuery=0,errors=0,cumulative_adds=5,cumulative_deletesById=0,cumulative_deletesByQuery=1,cumulative_errors=0}
[junit4:junit4]   2> 21292 T2457 oasu.DefaultSolrCoreState.decref SolrCoreState ref count has reached 0 - closing IndexWriter
[junit4:junit4]   2> 21573 T2457 C125 P51387 oasc.SolrDeletionPolicy.onCommit SolrDeletionPolicy.onCommit: commits:num=3
[junit4:junit4]   2> 		commit{dir=NRTCachingDirectory(org.apache.lucene.store.NIOFSDirectory@/usr/home/hudson/hudson-slave/workspace/Lucene-Solr-Tests-trunk-Java6/solr/build/solr-core/test/J1/org.apache.solr.cloud.SyncSliceTest-1348171916040/jetty1/index lockFactory=org.apache.lucene.store.NativeFSLockFactory@4144712c; maxCacheMB=48.0 maxMergeSizeMB=4.0),segFN=segments_1,generation=1,filenames=[segments_1]
[junit4:junit4]   2> 		commit{dir=NRTCachingDirectory(org.apache.lucene.store.NIOFSDirectory@/usr/home/hudson/hudson-slave/workspace/Lucene-Solr-Tests-trunk-Java6/solr/build/solr-core/test/J1/org.apache.solr.cloud.SyncSliceTest-1348171916040/jetty1/index lockFactory=org.apache.lucene.store.NativeFSLockFactory@4144712c; maxCacheMB=48.0 maxMergeSizeMB=4.0),segFN=segments_2,generation=2,filenames=[_0_Lucene40_0.tim, _0.fnm, _0_MockSep_0.pos, _0_Memory_0.ram, _0_nrm.cfs, _0_Lucene40_0.prx, _0_Lucene40_0.tip, _0_MockSep_0.tib, _0_Lucene40_0.frq, _0_MockSep_0.skp, _0_nrm.cfe, _0_SimpleText_0.pst, _0_MockSep_0.frq, segments_2, _0.fdx, _0_MockSep_0.tii, _0.si, _0_MockSep_0.pyl, _0_MockSep_0.doc, _0.fdt]
[junit4:junit4]   2> 		commit{dir=NRTCachingDirectory(org.apache.lucene.store.NIOFSDirectory@/usr/home/hudson/hudson-slave/workspace/Lucene-Solr-Tests-trunk-Java6/solr/build/solr-core/test/J1/org.apache.solr.cloud.SyncSliceTest-1348171916040/jetty1/index lockFactory=org.apache.lucene.store.NativeFSLockFactory@4144712c; maxCacheMB=48.0 maxMergeSizeMB=4.0),segFN=segments_3,generation=3,filenames=[_1_Lucene40_0.tim, _1_MockSep_0.frq, _0_MockSep_0.pos, _0_Lucene40_0.prx, _1.fnm, _1_Lucene40_0.tip, _1_Memory_0.ram, _0_Lucene40_0.frq, _0_MockSep_0.skp, _0_SimpleText_0.pst, _0_MockSep_0.doc, _0.si, _1_MockSep_0.doc, _1_MockSep_0.pyl, _1_nrm.cfs, _1_MockSep_0.skp, _0_Lucene40_0.tim, _0.fnm, _1_MockSep_0.pos, _1_MockSep_0.tib, _0_Memory_0.ram, _1_Lucene40_0.frq, _0_nrm.cfs, _1_Lucene40_0.prx, _1_MockSep_0.tii, _1_nrm.cfe, _0_Lucene40_0.tip, _0_MockSep_0.tib, _1.fdx, _1.fdt, _1.si, _0_nrm.cfe, _0_MockSep_0.frq, _0.fdx, _0_MockSep_0.tii, _0_MockSep_0.pyl, segments_3, _0.fdt, _1_SimpleText_0.pst]
[junit4:junit4]   2> 21574 T2457 C125 P51387 oasc.SolrDeletionPolicy.updateCommits newest commit = 3
[junit4:junit4]   2> 21577 T2457 oasu.DefaultSolrCoreState.decref Closing SolrCoreState - canceling any ongoing recovery
[junit4:junit4]   2> 21578 T2462 oazs.PrepRequestProcessor.pRequest Processed session termination for sessionid: 0x139e54ee30e0003
[junit4:junit4]   2> 21579 T2536 oascc.ZkStateReader$3.process Updating live nodes
[junit4:junit4]   2> 21579 T2477 oascc.ZkStateReader$3.process Updating live nodes
[junit4:junit4]   2> 21579 T2491 oascc.ZkStateReader$3.process Updating live nodes
[junit4:junit4]   2> 21579 T2457 oaz.Zoo

[...truncated too long message...]

ndler.ReplicationHandler.getIndexSize(ReplicationHandler.java:477)
[junit4:junit4]   2> 	at org.apache.solr.handler.ReplicationHandler.getStatistics(ReplicationHandler.java:525)
[junit4:junit4]   2> 	at org.apache.solr.core.RequestHandlers$LazyRequestHandlerWrapper.getStatistics(RequestHandlers.java:310)
[junit4:junit4]   2> 	at org.apache.solr.core.JmxMonitoredMap$SolrDynamicMBean.getMBeanInfo(JmxMonitoredMap.java:231)
[junit4:junit4]   2> 	at com.sun.jmx.interceptor.DefaultMBeanServerInterceptor.getClassName(DefaultMBeanServerInterceptor.java:1824)
[junit4:junit4]   2> 	at com.sun.jmx.interceptor.DefaultMBeanServerInterceptor.safeGetClassName(DefaultMBeanServerInterceptor.java:1661)
[junit4:junit4]   2> 	at com.sun.jmx.interceptor.DefaultMBeanServerInterceptor.checkMBeanPermission(DefaultMBeanServerInterceptor.java:1833)
[junit4:junit4]   2> 	at com.sun.jmx.interceptor.DefaultMBeanServerInterceptor.getAttribute(DefaultMBeanServerInterceptor.java:680)
[junit4:junit4]   2> 	at com.sun.jmx.mbeanserver.JmxMBeanServer.getAttribute(JmxMBeanServer.java:672)
[junit4:junit4]   2> 	at org.apache.solr.core.JmxMonitoredMap.unregister(JmxMonitoredMap.java:174)
[junit4:junit4]   2> 	at org.apache.solr.core.JmxMonitoredMap.clear(JmxMonitoredMap.java:116)
[junit4:junit4]   2> 	at org.apache.solr.core.SolrCore.close(SolrCore.java:864)
[junit4:junit4]   2> 	at org.apache.solr.cloud.ShardLeaderElectionContext.runLeaderProcess(ElectionContext.java:213)
[junit4:junit4]   2> 	at org.apache.solr.cloud.LeaderElector.runIamLeaderProcess(LeaderElector.java:158)
[junit4:junit4]   2> 	at org.apache.solr.cloud.LeaderElector.checkIfIamLeader(LeaderElector.java:102)
[junit4:junit4]   2> 	at org.apache.solr.cloud.LeaderElector.access$000(LeaderElector.java:56)
[junit4:junit4]   2> 	at org.apache.solr.cloud.LeaderElector$1.process(LeaderElector.java:131)
[junit4:junit4]   2> 	at org.apache.zookeeper.ClientCnxn$EventThread.processEvent(ClientCnxn.java:526)
[junit4:junit4]   2> 	at org.apache.zookeeper.ClientCnxn$EventThread.run(ClientCnxn.java:502)
[junit4:junit4]   2> 
[junit4:junit4]   2> 308248 T1565 oasc.JmxMonitoredMap$SolrDynamicMBean.getMBeanInfo WARNING Could not getStatistics on info bean Lazy[solr.ReplicationHandler] java.lang.IllegalArgumentException: /usr/home/hudson/hudson-slave/workspace/Lucene-Solr-Tests-trunk-Java6/solr/build/solr-core/test/J0/org.apache.solr.cloud.BasicDistributedZk2Test-1348171916039/jetty4/index does not exist
[junit4:junit4]   2> 	at org.apache.commons.io.FileUtils.sizeOfDirectory(FileUtils.java:2074)
[junit4:junit4]   2> 	at org.apache.solr.handler.ReplicationHandler.getIndexSize(ReplicationHandler.java:477)
[junit4:junit4]   2> 	at org.apache.solr.handler.ReplicationHandler.getStatistics(ReplicationHandler.java:525)
[junit4:junit4]   2> 	at org.apache.solr.core.RequestHandlers$LazyRequestHandlerWrapper.getStatistics(RequestHandlers.java:310)
[junit4:junit4]   2> 	at org.apache.solr.core.JmxMonitoredMap$SolrDynamicMBean.getMBeanInfo(JmxMonitoredMap.java:231)
[junit4:junit4]   2> 	at com.sun.jmx.interceptor.DefaultMBeanServerInterceptor.getClassName(DefaultMBeanServerInterceptor.java:1824)
[junit4:junit4]   2> 	at com.sun.jmx.interceptor.DefaultMBeanServerInterceptor.safeGetClassName(DefaultMBeanServerInterceptor.java:1661)
[junit4:junit4]   2> 	at com.sun.jmx.interceptor.DefaultMBeanServerInterceptor.checkMBeanPermission(DefaultMBeanServerInterceptor.java:1833)
[junit4:junit4]   2> 	at com.sun.jmx.interceptor.DefaultMBeanServerInterceptor.exclusiveUnregisterMBean(DefaultMBeanServerInterceptor.java:436)
[junit4:junit4]   2> 	at com.sun.jmx.interceptor.DefaultMBeanServerInterceptor.unregisterMBean(DefaultMBeanServerInterceptor.java:421)
[junit4:junit4]   2> 	at com.sun.jmx.mbeanserver.JmxMBeanServer.unregisterMBean(JmxMBeanServer.java:540)
[junit4:junit4]   2> 	at org.apache.solr.core.JmxMonitoredMap.unregister(JmxMonitoredMap.java:175)
[junit4:junit4]   2> 	at org.apache.solr.core.JmxMonitoredMap.clear(JmxMonitoredMap.java:116)
[junit4:junit4]   2> 	at org.apache.solr.core.SolrCore.close(SolrCore.java:864)
[junit4:junit4]   2> 	at org.apache.solr.cloud.ShardLeaderElectionContext.runLeaderProcess(ElectionContext.java:213)
[junit4:junit4]   2> 	at org.apache.solr.cloud.LeaderElector.runIamLeaderProcess(LeaderElector.java:158)
[junit4:junit4]   2> 	at org.apache.solr.cloud.LeaderElector.checkIfIamLeader(LeaderElector.java:102)
[junit4:junit4]   2> 	at org.apache.solr.cloud.LeaderElector.access$000(LeaderElector.java:56)
[junit4:junit4]   2> 	at org.apache.solr.cloud.LeaderElector$1.process(LeaderElector.java:131)
[junit4:junit4]   2> 	at org.apache.zookeeper.ClientCnxn$EventThread.processEvent(ClientCnxn.java:526)
[junit4:junit4]   2> 	at org.apache.zookeeper.ClientCnxn$EventThread.run(ClientCnxn.java:502)
[junit4:junit4]   2> 
[junit4:junit4]   2> 308251 T1565 oasc.SolrCore.closeSearcher [collection1] Closing main searcher on request.
[junit4:junit4]   2> 308253 T1565 oasu.DirectUpdateHandler2.close closing DirectUpdateHandler2{commits=5,autocommits=0,soft autocommits=0,optimizes=0,rollbacks=0,expungeDeletes=0,docsPending=0,adds=0,deletesById=0,deletesByQuery=0,errors=0,cumulative_adds=35,cumulative_deletesById=0,cumulative_deletesByQuery=0,cumulative_errors=0}
[junit4:junit4]   2> 308253 T1565 oasu.DefaultSolrCoreState.decref SolrCoreState ref count has reached 0 - closing IndexWriter
[junit4:junit4]   2> 308255 T1565 oasu.DefaultSolrCoreState.decref Closing SolrCoreState - canceling any ongoing recovery
[junit4:junit4]   2> 308255 T1565 oascc.ZkStateReader$3.process Updating live nodes
[junit4:junit4]   2> 308255 T1565 oascc.ZkStateReader$3.process WARNING ZooKeeper watch triggered, but Solr cannot talk to ZK
[junit4:junit4]   2> 308256 T1565 oascc.ZkStateReader$2.process A cluster state change has occurred - updating...
[junit4:junit4]   2> 308256 T1565 oascc.ZkStateReader$2.process WARNING ZooKeeper watch triggered, but Solr cannot talk to ZK
[junit4:junit4]   2> 308256 T1565 oascc.ConnectionManager.process Watcher org.apache.solr.common.cloud.ConnectionManager@3b566e0b name:ZooKeeperConnection Watcher:127.0.0.1:51377/solr got event WatchedEvent state:Disconnected type:None path:null path:null type:None
[junit4:junit4]   2> 308256 T1565 oascc.ConnectionManager.process Client->ZooKeeper status change trigger but we are already closed
[junit4:junit4]   2> 308256 T1565 oaz.ClientCnxn$EventThread.run EventThread shut down
[junit4:junit4]   2> NOTE: test params are: codec=Appending, sim=RandomSimilarityProvider(queryNorm=false,coord=yes): {}, locale=fr_CA, timezone=America/Paramaribo
[junit4:junit4]   2> NOTE: FreeBSD 9.0-RELEASE amd64/Sun Microsystems Inc. 1.6.0_32 (64-bit)/cpus=16,threads=2,free=176948192,total=314114048
[junit4:junit4]   2> NOTE: All tests run in this JVM: [TestPerFieldSimilarity, SOLR749Test, SearchHandlerTest, TestLMJelinekMercerSimilarityFactory, ZkCLITest, TestLFUCache, DistributedSpellCheckComponentTest, IndexBasedSpellCheckerTest, SimplePostToolTest, AlternateDirectoryTest, DateFieldTest, WordBreakSolrSpellCheckerTest, MBeansHandlerTest, QueryElevationComponentTest, TestFastWriter, AnalysisAfterCoreReloadTest, TestSearchPerf, AutoCommitTest, CircularListTest, SpatialFilterTest, TestSystemIdResolver, SpellPossibilityIteratorTest, FieldAnalysisRequestHandlerTest, DirectUpdateHandlerOptimizeTest, TestRandomFaceting, SystemInfoHandlerTest, TestGroupingSearch, NotRequiredUniqueKeyTest, ClusterStateTest, JsonLoaderTest, TestIBSimilarityFactory, TestStressVersions, TestCollationField, UpdateRequestProcessorFactoryTest, TestPseudoReturnFields, ZkControllerTest, DistanceFunctionTest, SuggesterFSTTest, JSONWriterTest, TestSolrJ, TestCoreContainer, TestFiltering, BadComponentTest, CoreAdminHandlerTest, LoggingHandlerTest, TestJmxMonitoredMap, SimpleFacetsTest, DateMathParserTest, TestIndexingPerformance, TestXIncludeConfig, ResponseLogComponentTest, MinimalSchemaTest, TestFaceting, SortByFunctionTest, BasicDistributedZkTest, SpellCheckCollatorTest, TestExtendedDismaxParser, SoftAutoCommitTest, BasicZkTest, TestHashPartitioner, DistributedTermsComponentTest, StatsComponentTest, TestRecovery, TestJoin, XsltUpdateRequestHandlerTest, TermVectorComponentTest, IndexSchemaRuntimeFieldTest, SolrPluginUtilsTest, FastVectorHighlighterTest, RequiredFieldsTest, CopyFieldTest, TestQueryUtils, UniqFieldsUpdateProcessorFactoryTest, CSVRequestHandlerTest, BadIndexSchemaTest, TestFoldingMultitermQuery, SolrCoreCheckLockOnStartupTest, TestLuceneMatchVersion, FieldMutatingUpdateProcessorTest, TestBinaryField, DefaultValueUpdateProcessorTest, TestDocSet, TestQuerySenderNoQuery, TestNumberUtils, TestConfig, LegacyHTMLStripCharFilterTest, TimeZoneUtilsTest, TestFastLRUCache, PluginInfoTest, PrimUtilsTest, ResourceLoaderTest, TestSolrXMLSerializer, TestSuggestSpellingConverter, PreAnalyzedFieldTest, ZkNodePropsTest, TestDocumentBuilder, BasicDistributedZk2Test]
[junit4:junit4] Completed on J0 in 308.73s, 1 test, 1 failure <<< FAILURES!

[...truncated 11 lines...]
BUILD FAILED
/usr/home/hudson/hudson-slave/workspace/Lucene-Solr-Tests-trunk-Java6/build.xml:32: The following error occurred while executing this line:
/usr/home/hudson/hudson-slave/workspace/Lucene-Solr-Tests-trunk-Java6/solr/build.xml:146: The following error occurred while executing this line:
/usr/home/hudson/hudson-slave/workspace/Lucene-Solr-Tests-trunk-Java6/lucene/module-build.xml:63: The following error occurred while executing this line:
/usr/home/hudson/hudson-slave/workspace/Lucene-Solr-Tests-trunk-Java6/lucene/common-build.xml:1140: The following error occurred while executing this line:
/usr/home/hudson/hudson-slave/workspace/Lucene-Solr-Tests-trunk-Java6/lucene/common-build.xml:813: There were test failures: 230 suites, 950 tests, 2 failures, 7 ignored (2 assumptions)

Total time: 29 minutes 42 seconds
Build step 'Invoke Ant' marked build as failure
Recording test results
Email was triggered for: Failure
Sending email for trigger: Failure



Mime
View raw message