lucene-dev mailing list archives

Site index · List index
Message view « Date » · « Thread »
Top « Date » · « Thread »
From Apache Jenkins Server <jenk...@builds.apache.org>
Subject [JENKINS-MAVEN] Lucene-Solr-Maven-4.x #104: POMs out of sync
Date Sat, 22 Sep 2012 10:49:11 GMT
Build: https://builds.apache.org/job/Lucene-Solr-Maven-4.x/104/

1 tests failed.
FAILED:  org.apache.solr.cloud.BasicDistributedZk2Test.testDistribSearch

Error Message:
Shard still reported as live in zk

Stack Trace:
java.lang.AssertionError: Shard still reported as live in zk
	at __randomizedtesting.SeedInfo.seed([BBFBFDADC2D8289F:3A1D73B5B58748A3]:0)
	at org.junit.Assert.fail(Assert.java:93)
	at org.apache.solr.cloud.AbstractFullDistribZkTestBase.waitToSeeNotLive(AbstractFullDistribZkTestBase.java:1220)
	at org.apache.solr.cloud.BasicDistributedZk2Test.brindDownShardIndexSomeDocsAndRecover(BasicDistributedZk2Test.java:190)
	at org.apache.solr.cloud.BasicDistributedZk2Test.doTest(BasicDistributedZk2Test.java:83)
	at org.apache.solr.BaseDistributedSearchTestCase.testDistribSearch(BaseDistributedSearchTestCase.java:695)
	at sun.reflect.NativeMethodAccessorImpl.invoke0(Native Method)
	at sun.reflect.NativeMethodAccessorImpl.invoke(NativeMethodAccessorImpl.java:57)
	at sun.reflect.DelegatingMethodAccessorImpl.invoke(DelegatingMethodAccessorImpl.java:43)
	at java.lang.reflect.Method.invoke(Method.java:616)
	at com.carrotsearch.randomizedtesting.RandomizedRunner.invoke(RandomizedRunner.java:1559)
	at com.carrotsearch.randomizedtesting.RandomizedRunner.access$600(RandomizedRunner.java:79)
	at com.carrotsearch.randomizedtesting.RandomizedRunner$6.evaluate(RandomizedRunner.java:737)
	at com.carrotsearch.randomizedtesting.RandomizedRunner$7.evaluate(RandomizedRunner.java:773)
	at com.carrotsearch.randomizedtesting.RandomizedRunner$8.evaluate(RandomizedRunner.java:787)
	at com.carrotsearch.randomizedtesting.rules.SystemPropertiesRestoreRule$1.evaluate(SystemPropertiesRestoreRule.java:53)
	at org.apache.lucene.util.TestRuleSetupTeardownChained$1.evaluate(TestRuleSetupTeardownChained.java:50)
	at org.apache.lucene.util.TestRuleFieldCacheSanity$1.evaluate(TestRuleFieldCacheSanity.java:51)
	at org.apache.lucene.util.AbstractBeforeAfterRule$1.evaluate(AbstractBeforeAfterRule.java:45)
	at com.carrotsearch.randomizedtesting.rules.SystemPropertiesInvariantRule$1.evaluate(SystemPropertiesInvariantRule.java:55)
	at org.apache.lucene.util.TestRuleThreadAndTestName$1.evaluate(TestRuleThreadAndTestName.java:48)
	at org.apache.lucene.util.TestRuleIgnoreAfterMaxFailures$1.evaluate(TestRuleIgnoreAfterMaxFailures.java:70)
	at org.apache.lucene.util.TestRuleMarkFailure$1.evaluate(TestRuleMarkFailure.java:48)
	at com.carrotsearch.randomizedtesting.rules.StatementAdapter.evaluate(StatementAdapter.java:36)
	at com.carrotsearch.randomizedtesting.ThreadLeakControl$StatementRunner.run(ThreadLeakControl.java:358)
	at com.carrotsearch.randomizedtesting.ThreadLeakControl.forkTimeoutingTask(ThreadLeakControl.java:782)
	at com.carrotsearch.randomizedtesting.ThreadLeakControl$3.evaluate(ThreadLeakControl.java:442)
	at com.carrotsearch.randomizedtesting.RandomizedRunner.runSingleTest(RandomizedRunner.java:746)
	at com.carrotsearch.randomizedtesting.RandomizedRunner$3.evaluate(RandomizedRunner.java:648)
	at com.carrotsearch.randomizedtesting.RandomizedRunner$4.evaluate(RandomizedRunner.java:682)
	at com.carrotsearch.randomizedtesting.RandomizedRunner$5.evaluate(RandomizedRunner.java:693)
	at com.carrotsearch.randomizedtesting.rules.StatementAdapter.evaluate(StatementAdapter.java:36)
	at com.carrotsearch.randomizedtesting.rules.SystemPropertiesRestoreRule$1.evaluate(SystemPropertiesRestoreRule.java:53)
	at org.apache.lucene.util.AbstractBeforeAfterRule$1.evaluate(AbstractBeforeAfterRule.java:45)
	at org.apache.lucene.util.TestRuleStoreClassName$1.evaluate(TestRuleStoreClassName.java:42)
	at com.carrotsearch.randomizedtesting.rules.SystemPropertiesInvariantRule$1.evaluate(SystemPropertiesInvariantRule.java:55)
	at com.carrotsearch.randomizedtesting.rules.NoShadowingOrOverridesOnMethodsRule$1.evaluate(NoShadowingOrOverridesOnMethodsRule.java:39)
	at com.carrotsearch.randomizedtesting.rules.NoShadowingOrOverridesOnMethodsRule$1.evaluate(NoShadowingOrOverridesOnMethodsRule.java:39)
	at com.carrotsearch.randomizedtesting.rules.StatementAdapter.evaluate(StatementAdapter.java:36)
	at org.apache.lucene.util.TestRuleAssertionsRequired$1.evaluate(TestRuleAssertionsRequired.java:43)
	at org.apache.lucene.util.TestRuleMarkFailure$1.evaluate(TestRuleMarkFailure.java:48)
	at org.apache.lucene.util.TestRuleIgnoreAfterMaxFailures$1.evaluate(TestRuleIgnoreAfterMaxFailures.java:70)
	at org.apache.lucene.util.TestRuleIgnoreTestSuites$1.evaluate(TestRuleIgnoreTestSuites.java:55)
	at com.carrotsearch.randomizedtesting.rules.StatementAdapter.evaluate(StatementAdapter.java:36)
	at com.carrotsearch.randomizedtesting.ThreadLeakControl$StatementRunner.run(ThreadLeakControl.java:358)
	at java.lang.Thread.run(Thread.java:679)




Build Log:
[...truncated 6393 lines...]
      [mvn] 1069 T3 oasc.SolrCore.finalize SEVERE REFCOUNT ERROR: unreferenced org.apache.solr.core.SolrCore@4b93c3d0 (collection1) has a reference count of 1
      [mvn] 1312 T2884 oasup.StatelessScriptUpdateProcessorFactory.inform SEVERE Unable to initialize scripts: Unable to evaluate script: a-file-name-that-does-not-exist.js Ignoring exception matching \Qa-file-name-that-does-not-exist.js\E
      [mvn] Tests run: 6, Failures: 0, Errors: 0, Skipped: 0, Time elapsed: 1.328 sec
      [mvn] Running org.apache.solr.handler.JsonLoaderTest
      [mvn] 1320 T3 oasc.CoreContainer.finalize SEVERE CoreContainer was not shutdown prior to finalize(), indicates a bug -- POSSIBLE RESOURCE LEAK!!!  instance=1514761506
      [mvn] Creating dataDir: /usr/home/hudson/hudson-slave/workspace/Lucene-Solr-Maven-4.x/maven-build/solr/core/src/test/target/test/./solrtest-JsonLoaderTest-1348310269977
      [mvn] Tests run: 6, Failures: 0, Errors: 0, Skipped: 0, Time elapsed: 0.394 sec
      [mvn] Running org.apache.solr.handler.component.TermVectorComponentDistributedTest
      [mvn] Tests run: 1, Failures: 0, Errors: 0, Skipped: 0, Time elapsed: 5.721 sec
      [mvn] Running org.apache.solr.cloud.FullSolrCloudDistribCmdsTest
      [mvn] Creating dataDir: /usr/home/hudson/hudson-slave/workspace/Lucene-Solr-Maven-4.x/maven-build/solr/core/src/test/target/test/./solrtest-FullSolrCloudDistribCmdsTest-1348310276108
      [mvn] ASYNC  NEW_CORE C5 name=collection1 org.apache.solr.core.SolrCore@1f09e5b3 url=http://127.0.0.1:27824/solr/collection1 node=127.0.0.1:27824_solr
      [mvn] 89163 T3048 C5 P27824 oasc.SolrException.log SEVERE forwarding update to http://127.0.0.1:27827/solr/collection1/ failed - retrying ... 
      [mvn] 89216 T3048 C5 P27824 oasc.SolrException.log SEVERE null:org.eclipse.jetty.io.EofException
      [mvn] 		at org.eclipse.jetty.server.HttpOutput.write(HttpOutput.java:154)
      [mvn] 		at org.eclipse.jetty.server.HttpOutput.write(HttpOutput.java:101)
      [mvn] 		at org.apache.solr.common.util.FastOutputStream.flush(FastOutputStream.java:204)
      [mvn] 		at org.apache.solr.common.util.FastOutputStream.flushBuffer(FastOutputStream.java:197)
      [mvn] 		at org.apache.solr.common.util.JavaBinCodec.marshal(JavaBinCodec.java:94)
      [mvn] 		at org.apache.solr.response.BinaryResponseWriter.write(BinaryResponseWriter.java:49)
      [mvn] 		at org.apache.solr.servlet.SolrDispatchFilter.writeResponse(SolrDispatchFilter.java:404)
      [mvn] 		at org.apache.solr.servlet.SolrDispatchFilter.doFilter(SolrDispatchFilter.java:289)
      [mvn] 		at org.eclipse.jetty.servlet.ServletHandler$CachedChain.doFilter(ServletHandler.java:1337)
      [mvn] 		at org.eclipse.jetty.servlet.ServletHandler.doHandle(ServletHandler.java:484)
      [mvn] 		at org.eclipse.jetty.server.session.SessionHandler.doHandle(SessionHandler.java:231)
      [mvn] 		at org.eclipse.jetty.server.handler.ScopedHandler.handle(ScopedHandler.java:119)
      [mvn] 		at org.eclipse.jetty.server.handler.GzipHandler.handle(GzipHandler.java:267)
      [mvn] 		at org.eclipse.jetty.server.handler.ContextHandler.doHandle(ContextHandler.java:1067)
      [mvn] 		at org.eclipse.jetty.servlet.ServletHandler.doScope(ServletHandler.java:413)
      [mvn] 		at org.eclipse.jetty.server.session.SessionHandler.doScope(SessionHandler.java:192)
      [mvn] 		at org.eclipse.jetty.server.handler.ContextHandler.doScope(ContextHandler.java:999)
      [mvn] 		at org.eclipse.jetty.server.handler.ScopedHandler.handle(ScopedHandler.java:117)
      [mvn] 		at org.eclipse.jetty.server.handler.HandlerWrapper.handle(HandlerWrapper.java:111)
      [mvn] 		at org.eclipse.jetty.server.Server.handle(Server.java:351)
      [mvn] 		at org.eclipse.jetty.server.AbstractHttpConnection.handleRequest(AbstractHttpConnection.java:454)
      [mvn] 		at org.eclipse.jetty.server.BlockingHttpConnection.handleRequest(BlockingHttpConnection.java:47)
      [mvn] 		at org.eclipse.jetty.server.AbstractHttpConnection.content(AbstractHttpConnection.java:900)
      [mvn] 		at org.eclipse.jetty.server.AbstractHttpConnection$RequestHandler.content(AbstractHttpConnection.java:954)
      [mvn] 		at org.eclipse.jetty.http.HttpParser.parseNext(HttpParser.java:952)
      [mvn] 		at org.eclipse.jetty.http.HttpParser.parseAvailable(HttpParser.java:235)
      [mvn] 		at org.eclipse.jetty.server.BlockingHttpConnection.handle(BlockingHttpConnection.java:66)
      [mvn] 		at org.eclipse.jetty.server.bio.SocketConnector$ConnectorEndPoint.run(SocketConnector.java:254)
      [mvn] 		at org.eclipse.jetty.util.thread.QueuedThreadPool.runJob(QueuedThreadPool.java:599)
      [mvn] 		at org.eclipse.jetty.util.thread.QueuedThreadPool$3.run(QueuedThreadPool.java:534)
      [mvn] 		at java.lang.Thread.run(Thread.java:679)
      [mvn] 	
      [mvn] 89217 T3048 C5 P27824 oasc.SolrException.log SEVERE null:org.eclipse.jetty.io.EofException
      [mvn] 		at org.eclipse.jetty.server.HttpOutput.write(HttpOutput.java:154)
      [mvn] 		at org.eclipse.jetty.server.HttpOutput.write(HttpOutput.java:101)
      [mvn] 		at org.apache.solr.common.util.FastOutputStream.flush(FastOutputStream.java:204)
      [mvn] 		at org.apache.solr.common.util.FastOutputStream.flushBuffer(FastOutputStream.java:197)
      [mvn] 		at org.apache.solr.common.util.JavaBinCodec.marshal(JavaBinCodec.java:94)
      [mvn] 		at org.apache.solr.response.BinaryResponseWriter.write(BinaryResponseWriter.java:49)
      [mvn] 		at org.apache.solr.servlet.SolrDispatchFilter.writeResponse(SolrDispatchFilter.java:404)
      [mvn] 		at org.apache.solr.servlet.SolrDispatchFilter.doFilter(SolrDispatchFilter.java:289)
      [mvn] 		at org.eclipse.jetty.servlet.ServletHandler$CachedChain.doFilter(ServletHandler.java:1337)
      [mvn] 		at org.eclipse.jetty.servlet.ServletHandler.doHandle(ServletHandler.java:484)
      [mvn] 		at org.eclipse.jetty.server.session.SessionHandler.doHandle(SessionHandler.java:231)
      [mvn] 		at org.eclipse.jetty.server.handler.ScopedHandler.handle(ScopedHandler.java:119)
      [mvn] 		at org.eclipse.jetty.server.handler.GzipHandler.handle(GzipHandler.java:267)
      [mvn] 		at org.eclipse.jetty.server.handler.ContextHandler.doHandle(ContextHandler.java:1067)
      [mvn] 		at org.eclipse.jetty.servlet.ServletHandler.doScope(ServletHandler.java:413)
      [mvn] 		at org.eclipse.jetty.server.session.SessionHandler.doScope(SessionHandler.java:192)
      [mvn] 		at org.eclipse.jetty.server.handler.ContextHandler.doScope(ContextHandler.java:999)
      [mvn] 		at org.eclipse.jetty.server.handler.ScopedHandler.handle(ScopedHandler.java:117)
      [mvn] 		at org.eclipse.jetty.server.handler.HandlerWrapper.handle(HandlerWrapper.java:111)
      [mvn] 		at org.eclipse.jetty.server.Server.handle(Server.java:351)
      [mvn] 		at org.eclipse.jetty.server.AbstractHttpConnection.handleRequest(AbstractHttpConnection.java:454)
      [mvn] 		at org.eclipse.jetty.server.BlockingHttpConnection.handleRequest(BlockingHttpConnection.java:47)
      [mvn] 		at org.eclipse.jetty.server.AbstractHttpConnection.content(AbstractHttpConnection.java:900)
      [mvn] 		at org.eclipse.jetty.server.AbstractHttpConnection$RequestHandler.content(AbstractHttpConnection.java:954)
      [mvn] 		at org.eclipse.jetty.http.HttpParser.parseNext(HttpParser.java:952)
      [mvn] 		at org.eclipse.jetty.http.HttpParser.parseAvailable(HttpParser.java:235)
      [mvn] 		at org.eclipse.jetty.server.BlockingHttpConnection.handle(BlockingHttpConnection.java:66)
      [mvn] 		at org.eclipse.jetty.server.bio.SocketConnector$ConnectorEndPoint.run(SocketConnector.java:254)
      [mvn] 		at org.eclipse.jetty.util.thread.QueuedThreadPool.runJob(QueuedThreadPool.java:599)
      [mvn] 		at org.eclipse.jetty.util.thread.QueuedThreadPool$3.run(QueuedThreadPool.java:534)
      [mvn] 		at java.lang.Thread.run(Thread.java:679)
      [mvn] 	
      [mvn] ASYNC  NEW_CORE C6 name=collection1 org.apache.solr.core.SolrCore@21374349 url=http://127.0.0.1:27831/solr/collection1 node=127.0.0.1:27831_solr
      [mvn] 109168 T3073 C6 P27831 oasc.SolrException.log SEVERE forwarding update to http://127.0.0.1:27827/solr/collection1/ failed - retrying ... 
      [mvn] 109220 T3073 C6 P27831 oasc.SolrException.log SEVERE null:org.eclipse.jetty.io.EofException
      [mvn] 		at org.eclipse.jetty.server.HttpOutput.write(HttpOutput.java:154)
      [mvn] 		at org.eclipse.jetty.server.HttpOutput.write(HttpOutput.java:101)
      [mvn] 		at org.apache.solr.common.util.FastOutputStream.flush(FastOutputStream.java:204)
      [mvn] 		at org.apache.solr.common.util.FastOutputStream.flushBuffer(FastOutputStream.java:197)
      [mvn] 		at org.apache.solr.common.util.JavaBinCodec.marshal(JavaBinCodec.java:94)
      [mvn] 		at org.apache.solr.response.BinaryResponseWriter.write(BinaryResponseWriter.java:49)
      [mvn] 		at org.apache.solr.servlet.SolrDispatchFilter.writeResponse(SolrDispatchFilter.java:404)
      [mvn] 		at org.apache.solr.servlet.SolrDispatchFilter.doFilter(SolrDispatchFilter.java:289)
      [mvn] 		at org.eclipse.jetty.servlet.ServletHandler$CachedChain.doFilter(ServletHandler.java:1337)
      [mvn] 		at org.eclipse.jetty.servlet.ServletHandler.doHandle(ServletHandler.java:484)
      [mvn] 		at org.eclipse.jetty.server.session.SessionHandler.doHandle(SessionHandler.java:231)
      [mvn] 		at org.eclipse.jetty.server.handler.ScopedHandler.handle(ScopedHandler.java:119)
      [mvn] 		at org.eclipse.jetty.server.handler.GzipHandler.handle(GzipHandler.java:267)
      [mvn] 		at org.eclipse.jetty.server.handler.ContextHandler.doHandle(ContextHandler.java:1067)
      [mvn] 		at org.eclipse.jetty.servlet.ServletHandler.doScope(ServletHandler.java:413)
      [mvn] 		at org.eclipse.jetty.server.session.SessionHandler.doScope(SessionHandler.java:192)
      [mvn] 		at org.eclipse.jetty.server.handler.ContextHandler.doScope(ContextHandler.java:999)
      [mvn] 		at org.eclipse.jetty.server.handler.ScopedHandler.handle(ScopedHandler.java:117)
      [mvn] 		at org.eclipse.jetty.server.handler.HandlerWrapper.handle(HandlerWrapper.java:111)
      [mvn] 		at org.eclipse.jetty.server.Server.handle(Server.java:351)
      [mvn] 		at org.eclipse.jetty.server.AbstractHttpConnection.handleRequest(AbstractHttpConnection.java:454)
      [mvn] 		at org.eclipse.jetty.server.BlockingHttpConnection.handleRequest(BlockingHttpConnection.java:47)
      [mvn] 		at org.eclipse.jetty.server.AbstractHttpConnection.content(AbstractHttpConnection.java:900)
      [mvn] 		at org.eclipse.jetty.server.AbstractHttpConnection$RequestHandler.content(AbstractHttpConnection.java:954)
      [mvn] 		at org.eclipse.jetty.http.HttpParser.parseNext(HttpParser.java:952)
      [mvn] 		at org.eclipse.jetty.http.HttpParser.parseAvailable(HttpParser.java:235)
      [mvn] 		at org.eclipse.jetty.server.BlockingHttpConnection.handle(BlockingHttpConnection.java:66)
      [mvn] 		at org.eclipse.jetty.server.bio.SocketConnector$ConnectorEndPoint.run(SocketConnector.java:254)
      [mvn] 		at org.eclipse.jetty.util.thread.QueuedThreadPool.runJob(QueuedThreadPool.java:599)
      [mvn] 		at org.eclipse.jetty.util.thread.QueuedThreadPool$3.run(QueuedThreadPool.java:534)
      [mvn] 		at java.lang.Thread.run(Thread.java:679)
      [mvn] 	
      [mvn] 109221 T3073 C6 P27831 oasc.SolrException.log SEVERE null:org.eclipse.jetty.io.EofException
      [mvn] 		at org.eclipse.jetty.server.HttpOutput.write(HttpOutput.java:154)
      [mvn] 		at org.eclipse.jetty.server.HttpOutput.write(HttpOutput.java:101)
      [mvn] 		at org.apache.solr.common.util.FastOutputStream.flush(FastOutputStream.java:204)
      [mvn] 		at org.apache.solr.common.util.FastOutputStream.flushBuffer(FastOutputStream.java:197)
      [mvn] 		at org.apache.solr.common.util.JavaBinCodec.marshal(JavaBinCodec.java:94)
      [mvn] 		at org.apache.solr.response.BinaryResponseWriter.write(BinaryResponseWriter.java:49)
      [mvn] 		at org.apache.solr.servlet.SolrDispatchFilter.writeResponse(SolrDispatchFilter.java:404)
      [mvn] 		at org.apache.solr.servlet.SolrDispatchFilter.doFilter(SolrDispatchFilter.java:289)
      [mvn] 		at org.eclipse.jetty.servlet.ServletHandler$CachedChain.doFilter(ServletHandler.java:1337)
      [mvn] 		at org.eclipse.jetty.servlet.ServletHandler.doHandle(ServletHandler.java:484)
      [mvn] 		at org.eclipse.jetty.server.session.SessionHandler.doHandle(SessionHandler.java:231)
      [mvn] 		at org.eclipse.jetty.server.handler.ScopedHandler.handle(ScopedHandler.java:119)
      [mvn] 		at org.eclipse.jetty.server.handler.GzipHandler.handle(GzipHandler.java:267)
      [mvn] 		at org.eclipse.jetty.server.handler.ContextHandler.doHandle(ContextHandler.java:1067)
      [mvn] 		at org.eclipse.jetty.servlet.ServletHandler.doScope(ServletHandler.java:413)
      [mvn] 		at org.eclipse.jetty.server.session.SessionHandler.doScope(SessionHandler.java:192)
      [mvn] 		at org.eclipse.jetty.server.handler.ContextHandler.doScope(ContextHandler.java:999)
      [mvn] 		at org.eclipse.jetty.server.handler.ScopedHandler.handle(ScopedHandler.java:117)
      [mvn] 		at org.eclipse.jetty.server.handler.HandlerWrapper.handle(HandlerWrapper.java:111)
      [mvn] 		at org.eclipse.jetty.server.Server.handle(Server.java:351)
      [mvn] 		at org.eclipse.jetty.server.AbstractHttpConnection.handleRequest(AbstractHttpConnection.java:454)
      [mvn] 		at org.eclipse.jetty.server.BlockingHttpConnection.handleRequest(BlockingHttpConnection.java:47)
      [mvn] 		at org.eclipse.jetty.server.AbstractHttpConnection.content(AbstractHttpConnection.java:900)
      [mvn] 		at org.eclipse.jetty.server.AbstractHttpConnection$RequestHandler.content(AbstractHttpConnection.java:954)
      [mvn] 		at org.eclipse.jetty.http.HttpParser.parseNext(HttpParser.java:952)
      [mvn] 		at org.eclipse.jetty.http.HttpParser.parseAvailable(HttpParser.java:235)
      [mvn] 		at org.eclipse.jetty.server.BlockingHttpConnection.handle(BlockingHttpConnection.java:66)
      [mvn] 		at org.eclipse.jetty.server.bio.SocketConnector$ConnectorEndPoint.run(SocketConnector.java:254)
      [mvn] 		at org.eclipse.jetty.util.thread.QueuedThreadPool.runJob(QueuedThreadPool.java:599)
      [mvn] 		at org.eclipse.jetty.util.thread.QueuedThreadPool$3.run(QueuedThreadPool.java:534)
      [mvn] 		at java.lang.Thread.run(Thread.java:679)
      [mvn] 	
      [mvn] Tests run: 1, Failures: 0, Errors: 0, Skipped: 0, Time elapsed: 110.417 sec
      [mvn] Running org.apache.solr.util.FileUtilsTest
      [mvn] Tests run: 1, Failures: 0, Errors: 0, Skipped: 0, Time elapsed: 0.022 sec
      [mvn] Running org.apache.solr.spelling.DirectSolrSpellCheckerTest
      [mvn] Creating dataDir: /usr/home/hudson/hudson-slave/workspace/Lucene-Solr-Maven-4.x/maven-build/solr/core/src/test/target/test/./solrtest-DirectSolrSpellCheckerTest-1348310386538
      [mvn] Tests run: 2, Failures: 0, Errors: 0, Skipped: 0, Time elapsed: 1.02 sec
      [mvn] Running org.apache.solr.util.SolrPluginUtilsTest
      [mvn] Creating dataDir: /usr/home/hudson/hudson-slave/workspace/Lucene-Solr-Maven-4.x/maven-build/solr/core/src/test/target/test/./solrtest-SolrPluginUtilsTest-1348310387560
      [mvn] Tests run: 7, Failures: 0, Errors: 0, Skipped: 0, Time elapsed: 0.538 sec
      [mvn] Running org.apache.solr.search.TestFoldingMultitermQuery
      [mvn] Creating dataDir: /usr/home/hudson/hudson-slave/workspace/Lucene-Solr-Maven-4.x/maven-build/solr/core/src/test/target/test/./solrtest-TestFoldingMultitermQuery-1348310388100
      [mvn] Tests run: 18, Failures: 0, Errors: 0, Skipped: 0, Time elapsed: 0.642 sec
      [mvn] Running org.apache.solr.core.TestPropInject
      [mvn] Tests run: 2, Failures: 0, Errors: 0, Skipped: 0, Time elapsed: 0.809 sec
      [mvn] Running org.apache.solr.schema.CurrencyFieldTest
      [mvn] Creating dataDir: /usr/home/hudson/hudson-slave/workspace/Lucene-Solr-Maven-4.x/maven-build/solr/core/src/test/target/test/./solrtest-CurrencyFieldTest-1348310389547
      [mvn] Tests run: 8, Failures: 0, Errors: 0, Skipped: 1, Time elapsed: 0.484 sec
      [mvn] Running org.apache.solr.schema.TestCollationField
      [mvn] Creating dataDir: /usr/home/hudson/hudson-slave/workspace/Lucene-Solr-Maven-4.x/maven-build/solr/core/src/test/target/test/./solrtest-TestCollationField-1348310390057
      [mvn] Tests run: 8, Failures: 0, Errors: 0, Skipped: 0, Time elapsed: 0.251 sec
      [mvn] Running org.apache.solr.search.QueryEqualityTest
      [mvn] Creating dataDir: /usr/home/hudson/hudson-slave/workspace/Lucene-Solr-Maven-4.x/maven-build/solr/core/src/test/target/test/./solrtest-QueryEqualityTest-1348310390288
      [mvn] Tests run: 60, Failures: 0, Errors: 0, Skipped: 0, Time elapsed: 0.527 sec
      [mvn] Running org.apache.solr.handler.PingRequestHandlerTest
      [mvn] Creating dataDir: /usr/home/hudson/hudson-slave/workspace/Lucene-Solr-Maven-4.x/maven-build/solr/core/src/test/target/test/./solrtest-PingRequestHandlerTest-1348310390817
      [mvn] Tests run: 5, Failures: 0, Errors: 0, Skipped: 0, Time elapsed: 0.506 sec
      [mvn] Running org.apache.solr.util.TestFastOutputStream
      [mvn] Tests run: 1, Failures: 0, Errors: 0, Skipped: 0, Time elapsed: 0.194 sec
      [mvn] Running org.apache.solr.search.similarities.TestLMDirichletSimilarityFactory
      [mvn] Creating dataDir: /usr/home/hudson/hudson-slave/workspace/Lucene-Solr-Maven-4.x/maven-build/solr/core/src/test/target/test/./solrtest-TestLMDirichletSimilarityFactory-1348310391522
      [mvn] Tests run: 2, Failures: 0, Errors: 0, Skipped: 0, Time elapsed: 0.103 sec
      [mvn] Running org.apache.solr.core.TestMergePolicyConfig
      [mvn] Creating dataDir: /usr/home/hudson/hudson-slave/workspace/Lucene-Solr-Maven-4.x/maven-build/solr/core/src/test/target/test/./solrtest-TestMergePolicyConfig-1348310391624
      [mvn] Tests run: 1, Failures: 0, Errors: 0, Skipped: 0, Time elapsed: 0.395 sec
      [mvn] Running org.apache.solr.cloud.BasicZkTest
      [mvn] azt beforeclass
      [mvn] Creating dataDir: /usr/home/hudson/hudson-slave/workspace/Lucene-Solr-Maven-4.x/maven-build/solr/core/src/test/target/test/./solrtest-BasicZkTest-1348310392020
      [mvn] 4306 T3153 oasc.CoreContainer.reload SEVERE Unable to reload core: collection1 Ignoring exception matching SAXParseException
      [mvn] Tests run: 1, Failures: 0, Errors: 0, Skipped: 0, Time elapsed: 14.678 sec
      [mvn] Running org.apache.solr.core.AlternateDirectoryTest
      [mvn] Creating dataDir: /usr/home/hudson/hudson-slave/workspace/Lucene-Solr-Maven-4.x/maven-build/solr/core/src/test/target/test/./solrtest-AlternateDirectoryTest-1348310406700
      [mvn] Tests run: 1, Failures: 0, Errors: 0, Skipped: 0, Time elapsed: 0.435 sec
      [mvn] Running org.apache.solr.update.SolrCmdDistributorTest
      [mvn] node props:{
      [mvn]   "base_url":"http://127.0.0.1:15800/solr",
      [mvn]   "core":""}
      [mvn] node props:{
      [mvn]   "base_url":"http://127.0.0.1:27007/solr",
      [mvn]   "core":""}
      [mvn] node props:{
      [mvn]   "base_url":"http://127.0.0.1:20598/solr",
      [mvn]   "core":""}
      [mvn] node props:{
      [mvn]   "base_url":"http://127.0.0.1:15800/solr",
      [mvn]   "core":""}
      [mvn] node props:{
      [mvn]   "base_url":"http://127.0.0.1:39906/solr",
      [mvn]   "core":""}
      [mvn] node props:{
      [mvn]   "base_url":"http://127.0.0.1:15800/solr",
      [mvn]   "core":""}
      [mvn] node props:{
      [mvn]   "base_url":"http://127.0.0.1:39906/solr",
      [mvn]   "core":""}
      [mvn] node props:{
      [mvn]   "base_url":"http://127.0.0.1:20598/solr",
      [mvn]   "core":""}
      [mvn] node props:{
      [mvn]   "base_url":"http://127.0.0.1:39906/solr",
      [mvn]   "core":""}
      [mvn] node props:{
      [mvn]   "base_url":"http://127.0.0.1:20598/solr",
      [mvn]   "core":""}
      [mvn] node props:{
      [mvn]   "base_url":"http://127.0.0.1:27007/solr",
      [mvn]   "core":""}
      [mvn] node props:{
      [mvn]   "base_url":"http://127.0.0.1:15800/solr",
      [mvn]   "core":""}
      [mvn] node props:{
      [mvn]   "base_url":"http://127.0.0.1:27007/solr",
      [mvn]   "core":""}
      [mvn] node props:{
      [mvn]   "base_url":"http://127.0.0.1:39906/solr",
      [mvn]   "core":""}
      [mvn] node props:{
      [mvn]   "base_url":"http://127.0.0.1:39906/solr",
      [mvn]   "core":""}
      [mvn] node props:{
      [mvn]   "base_url":"http://127.0.0.1:15800/solr",
      [mvn]   "core":""}
      [mvn] node props:{
      [mvn]   "base_url":"http://127.0.0.1:20598/solr",
      [mvn]   "core":""}
      [mvn] node props:{
      [mvn]   "base_url":"http://127.0.0.1:27007/solr",
      [mvn]   "core":""}
      [mvn] node props:{
      [mvn]   "base_url":"http://127.0.0.1:39906/solr",
      [mvn]   "core":""}
      [mvn] node props:{
      [mvn]   "base_url":"http://127.0.0.1:15800/solr",
      [mvn]   "core":""}
      [mvn] node props:{
      [mvn]   "base_url":"http://127.0.0.1:20598/solr",
      [mvn]   "core":""}
      [mvn] node props:{
      [mvn]   "base_url":"http://127.0.0.1:15800/solr",
      [mvn]   "core":""}
      [mvn] node props:{
      [mvn]   "base_url":"http://127.0.0.1:27007/solr",
      [mvn]   "core":""}
      [mvn] node props:{
      [mvn]   "base_url":"http://127.0.0.1:39906/solr",
      [mvn]   "core":""}
      [mvn] node props:{
      [mvn]   "base_url":"http://127.0.0.1:20598/solr",
      [mvn]   "core":""}
      [mvn] node props:{
      [mvn]   "base_url":"http://127.0.0.1:27007/solr",
      [mvn]   "core":""}
      [mvn] node props:{
      [mvn]   "base_url":"http://127.0.0.1:39906/solr",
      [mvn]   "core":""}
      [mvn] node props:{
      [mvn]   "base_url":"http://127.0.0.1:15800/solr",
      [mvn]   "core":""}
      [mvn] node props:{
      [mvn]   "base_url":"http://127.0.0.1:20598/solr",
      [mvn]   "core":""}
      [mvn] node props:{
      [mvn]   "base_url":"http://127.0.0.1:20598/solr",
      [mvn]   "core":""}
      [mvn] node props:{
      [mvn]   "base_url":"http://127.0.0.1:27007/solr",
      [mvn]   "core":""}
      [mvn] node props:{
      [mvn]   "base_url":"http://127.0.0.1:39906/solr",
      [mvn]   "core":""}
      [mvn] node props:{
      [mvn]   "base_url":"http://127.0.0.1:15800/solr",
      [mvn]   "core":""}
      [mvn] node props:{
      [mvn]   "base_url":"http://127.0.0.1:20598/solr",
      [mvn]   "core":""}
      [mvn] node props:{
      [mvn]   "base_url":"http://127.0.0.1:27007/solr",
      [mvn]   "core":""}
      [mvn] node props:{
      [mvn]   "base_url":"http://127.0.0.1:15800/solr",
      [mvn]   "core":""}
      [mvn] node props:{
      [mvn]   "base_url":"http://127.0.0.1:27007/solr",
      [mvn]   "core":""}
      [mvn] node props:{
      [mvn]   "base_url":"http://127.0.0.1:39906/solr",
      [mvn]   "core":""}
      [mvn] node props:{
      [mvn]   "base_url":"http://127.0.0.1:39906/solr",
      [mvn]   "core":""}
      [mvn] node props:{
      [mvn]   "base_url":"http://127.0.0.1:20598/solr",
      [mvn]   "core":""}
      [mvn] node props:{
      [mvn]   "base_url":"http://127.0.0.1:27007/solr",
      [mvn]   "core":""}
      [mvn] node props:{
      [mvn]   "base_url":"http://127.0.0.1:20598/solr",
      [mvn]   "core":""}
      [mvn] node props:{
      [mvn]   "base_url":"http://127.0.0.1:39906/solr",
      [mvn]   "core":""}
      [mvn] node props:{
      [mvn]   "base_url":"http://127.0.0.1:20598/solr",
      [mvn]   "core":""}
      [mvn] node props:{
      [mvn]   "base_url":"http://127.0.0.1:39906/solr",
      [mvn]   "core":""}
      [mvn] node props:{
      [mvn]   "base_url":"http://127.0.0.1:20598/solr",
      [mvn]   "core":""}
      [mvn] node props:{
      [mvn]   "base_url":"http://127.0.0.1:20598/solr",
      [mvn]   "core":""}
      [mvn] node props:{
      [mvn]   "base_url":"http://127.0.0.1:27007/solr",
      [mvn]   "core":""}
      [mvn] node props:{
      [mvn]   "base_url":"http://127.0.0.1:39906/solr",
      [mvn]   "core":""}
      [mvn] node props:{
      [mvn]   "base_url":"http://127.0.0.1:15800/solr",
      [mvn]   "core":""}
      [mvn] node props:{
      [mvn]   "base_url":"http://127.0.0.1:20598/solr",
      [mvn]   "core":""}
      [mvn] node props:{
      [mvn]   "base_url":"http://127.0.0.1:39906/solr",
      [mvn]   "core":""}
      [mvn] node props:{
      [mvn]   "base_url":"http://127.0.0.1:27007/solr",
      [mvn]   "core":""}
      [mvn] node props:{
      [mvn]   "base_url":"http://127.0.0.1:20598/solr",
      [mvn]   "core":""}
      [mvn] node props:{
      [mvn]   "base_url":"http://127.0.0.1:27007/solr",
      [mvn]   "core":""}
      [mvn] node props:{
      [mvn]   "base_url":"http://127.0.0.1:20598/solr",
      [mvn]   "core":""}
      [mvn] node props:{
      [mvn]   "base_url":"http://127.0.0.1:15800/solr",
      [mvn]   "core":""}
      [mvn] node props:{
      [mvn]   "base_url":"http://127.0.0.1:39906/solr",
      [mvn]   "core":""}
      [mvn] node props:{
      [mvn]   "base_url":"http://127.0.0.1:15800/solr",
      [mvn]   "core":""}
      [mvn] node props:{
      [mvn]   "base_url":"http://127.0.0.1:20598/solr",
      [mvn]   "core":""}
      [mvn] node props:{
      [mvn]   "base_url":"http://127.0.0.1:27007/solr",
      [mvn]   "core":""}
      [mvn] node props:{
      [mvn]   "base_url":"http://127.0.0.1:39906/solr",
      [mvn]   "core":""}
      [mvn] node props:{
      [mvn]   "base_url":"http://127.0.0.1:15800/solr",
      [mvn]   "core":""}
      [mvn] node props:{
      [mvn]   "base_url":"http://127.0.0.1:27007/solr",
      [mvn]   "core":""}
      [mvn] node props:{
      [mvn]   "base_url":"http://127.0.0.1:15800/solr",
      [mvn]   "core":""}
      [mvn] node props:{
      [mvn]   "base_url":"http://127.0.0.1:39906/solr",
      [mvn]   "core":""}
      [mvn] node props:{
      [mvn]   "base_url":"http://127.0.0.1:15800/solr",
      [mvn]   "core":""}
      [mvn] node props:{
      [mvn]   "base_url":"http://127.0.0.1:39906/solr",
      [mvn]   "core":""}
      [mvn] node props:{
      [mvn]   "base_url":"http://127.0.0.1:27007/solr",
      [mvn]   "core":""}
      [mvn] node props:{
      [mvn]   "base_url":"http://127.0.0.1:39906/solr",
      [mvn]   "core":""}
      [mvn] node props:{
      [mvn]   "base_url":"http://127.0.0.1:15800/solr",
      [mvn]   "core":""}
      [mvn] node props:{
      [mvn]   "base_url":"http://127.0.0.1:20598/solr",
      [mvn]   "core":""}
      [mvn] node props:{
      [mvn]   "base_url":"http://127.0.0.1:20598/solr",
      [mvn]   "core":""}
      [mvn] node props:{
      [mvn]   "base_url":"http://127.0.0.1:27007/solr",
      [mvn]   "core":""}
      [mvn] node props:{
      [mvn]   "base_url":"http://127.0.0.1:39906/solr",
      [mvn]   "core":""}
      [mvn] node props:{
      [mvn]   "base_url":"http://127.0.0.1:15800/solr",
      [mvn]   "core":""}
      [mvn] node props:{
      [mvn]   "base_url":"http://127.0.0.1:20598/solr",
      [mvn]   "core":""}
      [mvn] node props:{
      [mvn]   "base_url":"http://127.0.0.1:15800/solr",
      [mvn]   "core":""}
      [mvn] node props:{
      [mvn]   "base_url":"http://127.0.0.1:27007/solr",
      [mvn]   "core":""}
      [mvn] node props:{
      [mvn]   "base_url":"http://127.0.0.1:39906/solr",
      [mvn]   "core":""}
      [mvn] node props:{
      [mvn]   "base_url":"http://127.0.0.1:15800/solr",
      [mvn]   "core":""}
      [mvn] node props:{
      [mvn]   "base_url":"http://127.0.0.1:39906/solr",
      [mvn]   "core":""}
      [mvn] node props:{
      [mvn]   "base_url":"http://127.0.0.1:15800/solr",
      [mvn]   "core":""}
      [mvn] node props:{
      [mvn]   "base_url":"http://127.0.0.1:20598/solr",
      [mvn]   "core":""}
      [mvn] node props:{
      [mvn]   "base_url":"http://127.0.0.1:20598/solr",
      [mvn]   "core":""}
      [mvn] node props:{
      [mvn]   "base_url":"http://127.0.0.1:27007/solr",
      [mvn]   "core":""}
      [mvn] node props:{
      [mvn]   "base_url":"http://127.0.0.1:20598/solr",
      [mvn]   "core":""}
      [mvn] node props:{
      [mvn]   "base_url":"http://127.0.0.1:39906/solr",
      [mvn]   "core":""}
      [mvn] node props:{
      [mvn]   "base_url":"http://127.0.0.1:39906/solr",
      [mvn]   "core":""}
      [mvn] node props:{
      [mvn]   "base_url":"http://127.0.0.1:15800/solr",
      [mvn]   "core":""}
      [mvn] node props:{
      [mvn]   "base_url":"http://127.0.0.1:20598/solr",
      [mvn]   "core":""}
      [mvn] node props:{
      [mvn]   "base_url":"http://127.0.0.1:27007/solr",
      [mvn]   "core":""}
      [mvn] node props:{
      [mvn]   "base_url":"http://127.0.0.1:20598/solr",
      [mvn]   "core":""}
      [mvn] node props:{
      [mvn]   "base_url":"http://127.0.0.1:27007/solr",
      [mvn]   "core":""}
      [mvn] node props:{
      [mvn]   "base_url":"http://127.0.0.1:20598/solr",
      [mvn]   "core":""}
      [mvn] node props:{
      [mvn]   "base_url":"http://127.0.0.1:27007/solr",
      [mvn]   "core":""}
      [mvn] node props:{
      [mvn]   "base_url":"http://127.0.0.1:20598/solr",
      [mvn]   "core":""}
      [mvn] node props:{
      [mvn]   "base_url":"http://127.0.0.1:27007/solr",
      [mvn]   "core":""}
      [mvn] node props:{
      [mvn]   "base_url":"http://127.0.0.1:39906/solr",
      [mvn]   "core":""}
      [mvn] node props:{
      [mvn]   "base_url":"http://127.0.0.1:15800/solr",
      [mvn]   "core":""}
      [mvn] node props:{
      [mvn]   "base_url":"http://127.0.0.1:20598/solr",
      [mvn]   "core":""}
      [mvn] node props:{
      [mvn]   "base_url":"http://127.0.0.1:27007/solr",
      [mvn]   "core":""}
      [mvn] node props:{
      [mvn]   "base_url":"http://127.0.0.1:15800/solr",
      [mvn]   "core":""}
      [mvn] node props:{
      [mvn]   "base_url":"http://127.0.0.1:20598/solr",
      [mvn]   "core":""}
      [mvn] node props:{
      [mvn]   "base_url":"http://127.0.0.1:27007/solr",
      [mvn]   "core":""}
      [mvn] node props:{
      [mvn]   "base_url":"http://127.0.0.1:27007/solr",
      [mvn]   "core":""}
      [mvn] node props:{
      [mvn]   "base_url":"http://127.0.0.1:39906/solr",
      [mvn]   "core":""}
      [mvn] node props:{
      [mvn]   "base_url":"http://127.0.0.1:15800/solr",
      [mvn]   "core":""}
      [mvn] node props:{
      [mvn]   "base_url":"http://127.0.0.1:20598/solr",
      [mvn]   "core":""}
      [mvn] node props:{
      [mvn]   "base_url":"http://127.0.0.1:39906/solr",
      [mvn]   "core":""}
      [mvn] node props:{
      [mvn]   "base_url":"http://127.0.0.1:15800/solr",
      [mvn]   "core":""}
      [mvn] node props:{
      [mvn]   "base_url":"http://127.0.0.1:27007/solr",
      [mvn]   "core":""}
      [mvn] node props:{
      [mvn]   "base_url":"http://127.0.0.1:15800/solr",
      [mvn]   "core":""}
      [mvn] node props:{
      [mvn]   "base_url":"http://127.0.0.1:15800/solr",
      [mvn]   "core":""}
      [mvn] node props:{
      [mvn]   "base_url":"http://127.0.0.1:27007/solr",
      [mvn]   "core":""}
      [mvn] node props:{
      [mvn]   "base_url":"http://127.0.0.1:39906/solr",
      [mvn]   "core":""}
      [mvn] node props:{
      [mvn]   "base_url":"http://127.0.0.1:39906/solr",
      [mvn]   "core":""}
      [mvn] node props:{
      [mvn]   "base_url":"http://127.0.0.1:15800/solr",
      [mvn]   "core":""}
      [mvn] node props:{
      [mvn]   "base_url":"http://127.0.0.1:20598/solr",
      [mvn]   "core":""}
      [mvn] node props:{
      [mvn]   "base_url":"http://127.0.0.1:27007/solr",
      [mvn]   "core":""}
      [mvn] node props:{
      [mvn]   "base_url":"http://127.0.0.1:15800/solr",
      [mvn]   "core":""}
      [mvn] node props:{
      [mvn]   "base_url":"http://127.0.0.1:20598/solr",
      [mvn]   "core":""}
      [mvn] node props:{
      [mvn]   "base_url":"http://127.0.0.1:27007/solr",
      [mvn]   "core":""}
      [mvn] node props:{
      [mvn]   "base_url":"http://127.0.0.1:15800/solr",
      [mvn]   "core":""}
      [mvn] node props:{
      [mvn]   "base_url":"http://127.0.0.1:27007/solr",
      [mvn]   "core":""}
      [mvn] node props:{
      [mvn]   "base_url":"http://127.0.0.1:15800/solr",
      [mvn]   "core":""}
      [mvn] node props:{
      [mvn]   "base_url":"http://127.0.0.1:20598/solr",
      [mvn]   "core":""}
      [mvn] node props:{
      [mvn]   "base_url":"http://127.0.0.1:27007/solr",
      [mvn]   "core":""}
      [mvn] node props:{
      [mvn]   "base_url":"http://127.0.0.1:15800/solr",
      [mvn]   "core":""}
      [mvn] node props:{
      [mvn]   "base_url":"http://127.0.0.1:20598/solr",
      [mvn]   "core":""}
      [mvn] node props:{
      [mvn]   "base_url":"http://127.0.0.1:27007/solr",
      [mvn]   "core":""}
      [mvn] node props:{
      [mvn]   "base_url":"http://127.0.0.1:39906/solr",
      [mvn]   "core":""}
      [mvn] node props:{
      [mvn]   "base_url":"http://127.0.0.1:15800/solr",
      [mvn]   "core":""}
      [mvn] node props:{
      [mvn]   "base_url":"http://127.0.0.1:27007/solr",
      [mvn]   "core":""}
      [mvn] node props:{
      [mvn]   "base_url":"http://127.0.0.1:15800/solr",
      [mvn]   "core":""}
      [mvn] node props:{
      [mvn]   "base_url":"http://127.0.0.1:39906/solr",
      [mvn]   "core":""}
      [mvn] node props:{
      [mvn]   "base_url":"http://127.0.0.1:20598/solr",
      [mvn]   "core":""}
      [mvn] node props:{
      [mvn]   "base_url":"http://127.0.0.1:27007/solr",
      [mvn]   "core":""}
      [mvn] node props:{
      [mvn]   "base_url":"http://127.0.0.1:15800/solr",
      [mvn]   "core":""}
      [mvn] node props:{
      [mvn]   "base_url":"http://127.0.0.1:20598/solr",
      [mvn]   "core":""}
      [mvn] node props:{
      [mvn]   "base_url":"http://127.0.0.1:15800/solr",
      [mvn]   "core":""}
      [mvn] node props:{
      [mvn]   "base_url":"http://127.0.0.1:27007/solr",
      [mvn]   "core":""}
      [mvn] node props:{
      [mvn]   "base_url":"http://127.0.0.1:39906/solr",
      [mvn]   "core":""}
      [mvn] node props:{
      [mvn]   "base_url":"http://127.0.0.1:20598/solr",
      [mvn]   "core":""}
      [mvn] node props:{
      [mvn]   "base_url":"http://127.0.0.1:39906/solr",
      [mvn]   "core":""}
      [mvn] node props:{
      [mvn]   "base_url":"http://127.0.0.1:27007/solr",
      [mvn]   "core":""}
      [mvn] node props:{
      [mvn]   "base_url":"http://127.0.0.1:39906/solr",
      [mvn]   "core":""}
      [mvn] node props:{
      [mvn]   "base_url":"http://127.0.0.1:15800/solr",
      [mvn]   "core":""}
      [mvn] node props:{
      [mvn]   "base_url":"http://127.0.0.1:39906/solr",
      [mvn]   "core":""}
      [mvn] node props:{
      [mvn]   "base_url":"http://127.0.0.1:15800/solr",
      [mvn]   "core":""}
      [mvn] node props:{
      [mvn]   "base_url":"http://127.0.0.1:20598/solr",
      [mvn]   "core":""}
      [mvn] node props:{
      [mvn]   "base_url":"http://127.0.0.1:27007/solr",
      [mvn]   "core":""}
      [mvn] node props:{
      [mvn]   "base_url":"http://127.0.0.1:39906/solr",
      [mvn]   "core":""}
      [mvn] node props:{
      [mvn]   "base_url":"http://127.0.0.1:15800/solr",
      [mvn]   "core":""}
      [mvn] node props:{
      [mvn]   "base_url":"http://127.0.0.1:27007/solr",
      [mvn]   "core":""}
      [mvn] node props:{
      [mvn]   "base_url":"http://127.0.0.1:39906/solr",
      [mvn]   "core":""}
      [mvn] node props:{
      [mvn]   "base_url":"http://127.0.0.1:20598/solr",
      [mvn]   "core":""}
      [mvn] node props:{
      [mvn]   "base_url":"http://127.0.0.1:27007/solr",
      [mvn]   "core":""}
      [mvn] node props:{
      [mvn]   "base_url":"http://127.0.0.1:39906/solr",
      [mvn]   "core":""}
      [mvn] node props:{
      [mvn]   "base_url":"http://127.0.0.1:15800/solr",
      [mvn]   "core":""}
      [mvn] node props:{
      [mvn]   "base_url":"http://127.0.0.1:20598/solr",
      [mvn]   "core":""}
      [mvn] node props:{
      [mvn]   "base_url":"http://127.0.0.1:39906/solr",
      [mvn]   "core":""}
      [mvn] node props:{
      [mvn]   "base_url":"http://127.0.0.1:15800/solr",
      [mvn]   "core":""}
      [mvn] node props:{
      [mvn]   "base_url":"http://127.0.0.1:27007/solr",
      [mvn]   "core":""}
      [mvn] node props:{
      [mvn]   "base_url":"http://127.0.0.1:15800/solr",
      [mvn]   "core":""}
      [mvn] node props:{
      [mvn]   "base_url":"http://127.0.0.1:27007/solr",
      [mvn]   "core":""}
      [mvn] node props:{
      [mvn]   "base_url":"http://127.0.0.1:39906/solr",
      [mvn]   "core":""}
      [mvn] node props:{
      [mvn]   "base_url":"http://127.0.0.1:27007/solr",
      [mvn]   "core":""}
      [mvn] node props:{
      [mvn]   "base_url":"http://127.0.0.1:15800/solr",
      [mvn]   "core":""}
      [mvn] node props:{
      [mvn]   "base_url":"http://127.0.0.1:20598/solr",
      [mvn]   "core":""}
      [mvn] node props:{
      [mvn]   "base_url":"http://127.0.0.1:27007/solr",
      [mvn]   "core":""}
      [mvn] node props:{
      [mvn]   "base_url":"http://127.0.0.1:39906/solr",
      [mvn]   "core":""}
      [mvn] node props:{
      [mvn]   "base_url":"http://127.0.0.1:15800/solr",
      [mvn]   "core":""}
      [mvn] node props:{
      [mvn]   "base_url":"http://127.0.0.1:27007/solr",
      [mvn]   "core":""}
      [mvn] node props:{
      [mvn]   "base_url":"http://127.0.0.1:39906/solr",
      [mvn]   "core":""}
      [mvn] node props:{
      [mvn]   "base_url":"http://127.0.0.1:20598/solr",
      [mvn]   "core":""}
      [mvn] node props:{
      [mvn]   "base_url":"http://127.0.0.1:39906/solr",
      [mvn]   "core":""}
      [mvn] node props:{
      [mvn]   "base_url":"http://127.0.0.1:15800/solr",
      [mvn]   "core":""}
      [mvn] node props:{
      [mvn]   "base_url":"http://127.0.0.1:27007/solr",
      [mvn]   "core":""}
      [mvn] node props:{
      [mvn]   "base_url":"http://127.0.0.1:39906/solr",
      [mvn]   "core":""}
      [mvn] node props:{
      [mvn]   "base_url":"http://127.0.0.1:15800/solr",
      [mvn]   "core":""}
      [mvn] node props:{
      [mvn]   "base_url":"http://127.0.0.1:27007/solr",
      [mvn]   "core":""}
      [mvn] node props:{
      [mvn]   "base_url":"http://127.0.0.1:15800/solr",
      [mvn]   "core":""}
      [mvn] node props:{
      [mvn]   "base_url":"http://127.0.0.1:20598/solr",
      [mvn]   "core":""}
      [mvn] node props:{
      [mvn]   "base_url":"http://127.0.0.1:39906/solr",
      [mvn]   "core":""}
      [mvn] node props:{
      [mvn]   "base_url":"http://127.0.0.1:15800/solr",
      [mvn]   "core":""}
      [mvn] node props:{
      [mvn]   "base_url":"http://127.0.0.1:27007/solr",
      [mvn]   "core":""}
      [mvn] node props:{
      [mvn]   "base_url":"http://127.0.0.1:20598/solr",
      [mvn]   "core":""}
      [mvn] node props:{
      [mvn]   "base_url":"http://127.0.0.1:39906/solr",
      [mvn]   "core":""}
      [mvn] node props:{
      [mvn]   "base_url":"http://127.0.0.1:15800/solr",
      [mvn]   "core":""}
      [mvn] node props:{
      [mvn]   "base_url":"http://127.0.0.1:15800/solr",
      [mvn]   "core":""}
      [mvn] node props:{
      [mvn]   "base_url":"http://127.0.0.1:39906/solr",
      [mvn]   "core":""}
      [mvn] node props:{
      [mvn]   "base_url":"http://127.0.0.1:15800/solr",
      [mvn]   "core":""}
      [mvn] node props:{
      [mvn]   "base_url":"http://127.0.0.1:20598/solr",
      [mvn]   "core":""}
      [mvn] node props:{
      [mvn]   "base_url":"http://127.0.0.1:39906/solr",
      [mvn]   "core":""}
      [mvn] node props:{
      [mvn]   "base_url":"http://127.0.0.1:15800/solr",
      [mvn]   "core":""}
      [mvn] node props:{
      [mvn]   "base_url":"http://127.0.0.1:20598/solr",
      [mvn]   "core":""}
      [mvn] node props:{
      [mvn]   "base_url":"http://127.0.0.1:27007/solr",
      [mvn]   "core":""}
      [mvn] node props:{
      [mvn]   "base_url":"http://127.0.0.1:39906/solr",
      [mvn]   "core":""}
      [mvn] node props:{
      [mvn]   "base_url":"http://127.0.0.1:20598/solr",
      [mvn]   "core":""}
      [mvn] node props:{
      [mvn]   "base_url":"http://127.0.0.1:27007/solr",
      [mvn]   "core":""}
      [mvn] node props:{
      [mvn]   "base_url":"http://127.0.0.1:39906/solr",
      [mvn]   "core":""}
      [mvn] node props:{
      [mvn]   "base_url":"http://127.0.0.1:27007/solr",
      [mvn]   "core":""}
      [mvn] node props:{
      [mvn]   "base_url":"http://127.0.0.1:39906/solr",
      [mvn]   "core":""}
      [mvn] node props:{
      [mvn]   "base_url":"http://127.0.0.1:20598/solr",
      [mvn]   "core":""}
      [mvn] node props:{
      [mvn]   "base_url":"http://127.0.0.1:27007/solr",
      [mvn]   "core":""}
      [mvn] node props:{
      [mvn]   "base_url":"http://127.0.0.1:15800/solr",
      [mvn]   "core":""}
      [mvn] node props:{
      [mvn]   "base_url":"http://127.0.0.1:15800/solr",
      [mvn]   "core":""}
      [mvn] node props:{
      [mvn]   "base_url":"http://127.0.0.1:20598/solr",
      [mvn]   "core":""}
      [mvn] node props:{
      [mvn]   "base_url":"http://127.0.0.1:27007/solr",
      [mvn]   "core":""}
      [mvn] node props:{
      [mvn]   "base_url":"http://127.0.0.1:15800/solr",
      [mvn]   "core":""}
      [mvn] node props:{
      [mvn]   "base_url":"http://127.0.0.1:20598/solr",
      [mvn]   "core":""}
      [mvn] node props:{
      [mvn]   "base_url":"http://127.0.0.1:27007/solr",
      [mvn]   "core":""}
      [mvn] node props:{
      [mvn]   "base_url":"http://127.0.0.1:27007/solr",
      [mvn]   "core":""}
      [mvn] node props:{
      [mvn]   "base_url":"http://127.0.0.1:15800/solr",
      [mvn]   "core":""}
      [mvn] node props:{
      [mvn]   "base_url":"http://127.0.0.1:20598/solr",
      [mvn]   "core":""}
      [mvn] node props:{
      [mvn]   "base_url":"http://127.0.0.1:39906/solr",
      [mvn]   "core":""}
      [mvn] node props:{
      [mvn]   "base_url":"http://127.0.0.1:15800/solr",
      [mvn]   "core":""}
      [mvn] node props:{
      [mvn]   "base_url":"http://127.0.0.1:39906/solr",
      [mvn]   "core":""}
      [mvn] node props:{
      [mvn]   "base_url":"http://127.0.0.1:20598/solr",
      [mvn]   "core":""}
      [mvn] node props:{
      [mvn]   "base_url":"http://127.0.0.1:20598/solr",
      [mvn]   "core":""}
      [mvn] node props:{
      [mvn]   "base_url":"http://127.0.0.1:27007/solr",
      [mvn]   "core":""}
      [mvn] node props:{
      [mvn]   "base_url":"http://127.0.0.1:39906/solr",
      [mvn]   "core":""}
      [mvn] node props:{
      [mvn]   "base_url":"http://127.0.0.1:15800/solr",
      [mvn]   "core":""}
      [mvn] node props:{
      [mvn]   "base_url":"http://127.0.0.1:39906/solr",
      [mvn]   "core":""}
      [mvn] node props:{
      [mvn]   "base_url":"http://127.0.0.1:15800/solr",
      [mvn]   "core":""}
      [mvn] node props:{
      [mvn]   "base_url":"http://127.0.0.1:20598/solr",
      [mvn]   "core":""}
      [mvn] node props:{
      [mvn]   "base_url":"http://127.0.0.1:27007/solr",
      [mvn]   "core":""}
      [mvn] node props:{
      [mvn]   "base_url":"http://127.0.0.1:39906/solr",
      [mvn]   "core":""}
      [mvn] node props:{
      [mvn]   "base_url":"http://127.0.0.1:20598/solr",
      [mvn]   "core":""}
      [mvn] node props:{
      [mvn]   "base_url":"http://127.0.0.1:39906/solr",
      [mvn]   "core":""}
      [mvn] node props:{
      [mvn]   "base_url":"http://127.0.0.1:15800/solr",
      [mvn]   "core":""}
      [mvn] node props:{
      [mvn]   "base_url":"http://127.0.0.1:27007/solr",
      [mvn]   "core":""}
      [mvn] node props:{
      [mvn]   "base_url":"http://127.0.0.1:15800/solr",
      [mvn]   "core":""}
      [mvn] node props:{
      [mvn]   "base_url":"http://127.0.0.1:27007/solr",
      [mvn]   "core":""}
      [mvn] node props:{
      [mvn]   "base_url":"http://127.0.0.1:39906/solr",
      [mvn]   "core":""}
      [mvn] node props:{
      [mvn]   "base_url":"http://127.0.0.1:15800/solr",
      [mvn]   "core":""}
      [mvn] node props:{
      [mvn]   "base_url":"http://127.0.0.1:20598/solr",
      [mvn]   "core":""}
      [mvn] node props:{
      [mvn]   "base_url":"http://127.0.0.1:20598/solr",
      [mvn]   "core":""}
      [mvn] node props:{
      [mvn]   "base_url":"http://127.0.0.1:27007/solr",
      [mvn]   "core":""}
      [mvn] node props:{
      [mvn]   "base_url":"http://127.0.0.1:27007/solr",
      [mvn]   "core":""}
      [mvn] node props:{
      [mvn]   "base_url":"http://127.0.0.1:39906/solr",
      [mvn]   "core":""}
      [mvn] node props:{
      [mvn]   "base_url":"http://127.0.0.1:15800/solr",
      [mvn]   "core":""}
      [mvn] node props:{
      [mvn]   "base_url":"http://127.0.0.1:20598/solr",
      [mvn]   "core":""}
      [mvn] node props:{
      [mvn]   "base_url":"http://127.0.0.1:15800/solr",
      [mvn]   "core":""}
      [mvn] node props:{
      [mvn]   "base_url":"http://127.0.0.1:27007/solr",
      [mvn]   "core":""}
      [mvn] node props:{
      [mvn]   "base_url":"http://127.0.0.1:27007/solr",
      [mvn]   "core":""}
      [mvn] node props:{
      [mvn]   "base_url":"http://127.0.0.1:39906/solr",
      [mvn]   "core":""}
      [mvn] node props:{
      [mvn]   "base_url":"http://127.0.0.1:20598/solr",
      [mvn]   "core":""}
      [mvn] node props:{
      [mvn]   "base_url":"http://127.0.0.1:15800/solr",
      [mvn]   "core":""}
      [mvn] node props:{
      [mvn]   "base_url":"http://127.0.0.1:20598/solr",
      [mvn]   "core":""}
      [mvn] node props:{
      [mvn]   "base_url":"http://127.0.0.1:27007/solr",
      [mvn]   "core":""}
      [mvn] node props:{
      [mvn]   "base_url":"http://127.0.0.1:20598/solr",
      [mvn]   "core":""}
      [mvn] node props:{
      [mvn]   "base_url":"http://127.0.0.1:15800/solr",
      [mvn]   "core":""}
      [mvn] node props:{
      [mvn]   "base_url":"http://127.0.0.1:20598/solr",
      [mvn]   "core":""}
      [mvn] node props:{
      [mvn]   "base_url":"http://127.0.0.1:39906/solr",
      [mvn]   "core":""}
      [mvn] node props:{
      [mvn]   "base_url":"http://127.0.0.1:15800/solr",
      [mvn]   "core":""}
      [mvn] node props:{
      [mvn]   "base_url":"http://127.0.0.1:20598/solr",
      [mvn]   "core":""}
      [mvn] node props:{
      [mvn]   "base_url":"http://127.0.0.1:39906/solr",
      [mvn]   "core":""}
      [mvn] node props:{
      [mvn]   "base_url":"http://127.0.0.1:20598/solr",
      [mvn]   "core":""}
      [mvn] node props:{
      [mvn]   "base_url":"http://127.0.0.1:27007/solr",
      [mvn]   "core":""}
      [mvn] node props:{
      [mvn]   "base_url":"http://127.0.0.1:20598/solr",
      [mvn]   "core":""}
      [mvn] node props:{
      [mvn]   "base_url":"http://127.0.0.1:27007/solr",
      [mvn]   "core":""}
      [mvn] node props:{
      [mvn]   "base_url":"http://127.0.0.1:39906/solr",
      [mvn]   "core":""}
      [mvn] node props:{
      [mvn]   "base_url":"http://127.0.0.1:15800/solr",
      [mvn]   "core":""}
      [mvn] node props:{
      [mvn]   "base_url":"http://127.0.0.1:20598/solr",
      [mvn]   "core":""}
      [mvn] node props:{
      [mvn]   "base_url":"http://127.0.0.1:27007/solr",
      [mvn]   "core":""}
      [mvn] node props:{
      [mvn]   "base_url":"http://127.0.0.1:39906/solr",
      [mvn]   "core":""}
      [mvn] node props:{
      [mvn]   "base_url":"http://127.0.0.1:27007/solr",
      [mvn]   "core":""}
      [mvn] node props:{
      [mvn]   "base_url":"http://127.0.0.1:39906/solr",
      [mvn]   "core":""}
      [mvn] node props:{
      [mvn]   "base_url":"http://127.0.0.1:20598/solr",
      [mvn]   "core":""}
      [mvn] node props:{
      [mvn]   "base_url":"http://127.0.0.1:39906/solr",
      [mvn]   "core":""}
      [mvn] node props:{
      [mvn]   "base_url":"http://127.0.0.1:15800/solr",
      [mvn]   "core":""}
      [mvn] node props:{
      [mvn]   "base_url":"http://127.0.0.1:39906/solr",
      [mvn]   "core":""}
      [mvn] node props:{
      [mvn]   "base_url":"http://127.0.0.1:15800/solr",
      [mvn]   "core":""}
      [mvn] node props:{
      [mvn]   "base_url":"http://127.0.0.1:20598/solr",
      [mvn]   "core":""}
      [mvn] node props:{
      [mvn]   "base_url":"http://127.0.0.1:39906/solr",
      [mvn]   "core":""}
      [mvn] node props:{
      [mvn]   "base_url":"http://127.0.0.1:15800/solr",
      [mvn]   "core":""}
      [mvn] node props:{
      [mvn]   "base_url":"http://127.0.0.1:15800/solr",
      [mvn]   "core":""}
      [mvn] node props:{
      [mvn]   "base_url":"http://127.0.0.1:27007/solr",
      [mvn]   "core":""}
      [mvn] node props:{
      [mvn]   "base_url":"http://127.0.0.1:39906/solr",
      [mvn]   "core":""}
      [mvn] node props:{
      [mvn]   "base_url":"http://127.0.0.1:15800/solr",
      [mvn]   "core":""}
      [mvn] node props:{
      [mvn]   "base_url":"http://127.0.0.1:20598/solr",
      [mvn]   "core":""}
      [mvn] node props:{
      [mvn]   "base_url":"http://127.0.0.1:15800/solr",
      [mvn]   "core":""}
      [mvn] node props:{
      [mvn]   "base_url":"http://127.0.0.1:15800/solr",
      [mvn]   "core":""}
      [mvn] node props:{
      [mvn]   "base_url":"http://127.0.0.1:20598/solr",
      [mvn]   "core":""}
      [mvn] node props:{
      [mvn]   "base_url":"http://127.0.0.1:27007/solr",
      [mvn]   "core":""}
      [mvn] node props:{
      [mvn]   "base_url":"http://127.0.0.1:39906/solr",
      [mvn]   "core":""}
      [mvn] node props:{
      [mvn]   "base_url":"http://127.0.0.1:27007/solr",
      [mvn]   "core":""}
      [mvn] node props:{
      [mvn]   "base_url":"http://127.0.0.1:39906/solr",
      [mvn]   "core":""}
      [mvn] node props:{
      [mvn]   "base_url":"http://127.0.0.1:39906/solr",
      [mvn]   "core":""}
      [mvn] node props:{
      [mvn]   "base_url":"http://127.0.0.1:15800/solr",
      [mvn]   "core":""}
      [mvn] node props:{
      [mvn]   "base_url":"http://127.0.0.1:20598/solr",
      [mvn]   "core":""}
      [mvn] node props:{
      [mvn]   "base_url":"http://127.0.0.1:27007/solr",
      [mvn]   "core":""}
      [mvn] node props:{
      [mvn]   "base_url":"http://127.0.0.1:39906/solr",
      [mvn]   "core":""}
      [mvn] node props:{
      [mvn]   "base_url":"http://127.0.0.1:20598/solr",
      [mvn]   "core":""}
      [mvn] node props:{
      [mvn]   "base_url":"http://127.0.0.1:15800/solr",
      [mvn]   "core":""}
      [mvn] node props:{
      [mvn]   "base_url":"http://127.0.0.1:27007/solr",
      [mvn]   "core":""}
      [mvn] node props:{
      [mvn]   "base_url":"http://127.0.0.1:39906/solr",
      [mvn]   "core":""}
      [mvn] node props:{
      [mvn]   "base_url":"http://127.0.0.1:20598/solr",
      [mvn]   "core":""}
      [mvn] node props:{
      [mvn]   "base_url":"http://127.0.0.1:27007/solr",
      [mvn]   "core":""}
      [mvn] node props:{
      [mvn]   "base_url":"http://127.0.0.1:39906/solr",
      [mvn]   "core":""}
      [mvn] node props:{
      [mvn]   "base_url":"http://127.0.0.1:15800/solr",
      [mvn]   "core":""}
      [mvn] node props:{
      [mvn]   "base_url":"http://127.0.0.1:39906/solr",
      [mvn]   "core":""}
      [mvn] node props:{
      [mvn]   "base_url":"http://127.0.0.1:15800/solr",
      [mvn]   "core":""}
      [mvn] node props:{
      [mvn]   "base_url":"http://127.0.0.1:15800/solr",
      [mvn]   "core":""}
      [mvn] node props:{
      [mvn]   "base_url":"http://127.0.0.1:20598/solr",
      [mvn]   "core":""}
      [mvn] node props:{
      [mvn]   "base_url":"http://127.0.0.1:39906/solr",
      [mvn]   "core":""}
      [mvn] node props:{
      [mvn]   "base_url":"http://127.0.0.1:27007/solr",
      [mvn]   "core":""}
      [mvn] node props:{
      [mvn]   "base_url":"http://127.0.0.1:39906/solr",
      [mvn]   "core":""}
      [mvn] node props:{
      [mvn]   "base_url":"http://127.0.0.1:27007/solr",
      [mvn]   "core":""}
      [mvn] node props:{
      [mvn]   "base_url":"http://127.0.0.1:39906/solr",
      [mvn]   "core":""}
      [mvn] node props:{
      [mvn]   "base_url":"http://127.0.0.1:27007/solr",
      [mvn]   "core":""}
      [mvn] node props:{
      [mvn]   "base_url":"http://127.0.0.1:39906/solr",
      [mvn]   "core":""}
      [mvn] node props:{
      [mvn]   "base_url":"http://127.0.0.1:15800/solr",
      [mvn]   "core":""}
      [mvn] node props:{
      [mvn]   "base_url":"http://127.0.0.1:20598/solr",
      [mvn]   "core":""}
      [mvn] node props:{
      [mvn]   "base_url":"http://127.0.0.1:27007/solr",
      [mvn]   "core":""}
      [mvn] node props:{
      [mvn]   "base_url":"http://127.0.0.1:15800/solr",
      [mvn]   "core":""}
      [mvn] node props:{
      [mvn]   "base_url":"http://127.0.0.1:20598/solr",
      [mvn]   "core":""}
      [mvn] node props:{
      [mvn]   "base_url":"http://127.0.0.1:27007/solr",
      [mvn]   "core":""}
      [mvn] node props:{
      [mvn]   "base_url":"http://127.0.0.1:15800/solr",
      [mvn]   "core":""}
      [mvn] node props:{
      [mvn]   "base_url":"http://127.0.0.1:20598/solr",
      [mvn]   "core":""}
      [mvn] node props:{
      [mvn]   "base_url":"http://127.0.0.1:27007/solr",
      [mvn]   "core":""}
      [mvn] node props:{
      [mvn]   "base_url":"http://127.0.0.1:39906/solr",
      [mvn]   "core":""}
      [mvn] node props:{
      [mvn]   "base_url":"http://127.0.0.1:20598/solr",
      [mvn]   "core":""}
      [mvn] node props:{
      [mvn]   "base_url":"http://127.0.0.1:39906/solr",
      [mvn]   "core":""}
      [mvn] node props:{
      [mvn]   "base_url":"http://127.0.0.1:15800/solr",
      [mvn]   "core":""}
      [mvn] node props:{
      [mvn]   "base_url":"http://127.0.0.1:20598/solr",
      [mvn]   "core":""}
      [mvn] node props:{
      [mvn]   "base_url":"http://127.0.0.1:27007/solr",
      [mvn]   "core":""}
      [mvn] node props:{
      [mvn]   "base_url":"http://127.0.0.1:39906/solr",
      [mvn]   "core":""}
      [mvn] node props:{
      [mvn]   "base_url":"http://127.0.0.1:27007/solr",
      [mvn]   "core":""}
      [mvn] node props:{
      [mvn]   "base_url":"http://127.0.0.1:39906/solr",
      [mvn]   "core":""}
      [mvn] node props:{
      [mvn]   "base_url":"http://127.0.0.1:15800/solr",
      [mvn]   "core":""}
      [mvn] node props:{
      [mvn]   "base_url":"http://127.0.0.1:20598/solr",
      [mvn]   "core":""}
      [mvn] node props:{
      [mvn]   "base_url":"http://127.0.0.1:39906/solr",
      [mvn]   "core":""}
      [mvn] node props:{
      [mvn]   "base_url":"http://127.0.0.1:15800/solr",
      [mvn]   "core":""}
      [mvn] node props:{
      [mvn]   "base_url":"http://127.0.0.1:15800/solr",
      [mvn]   "core":""}
      [mvn] node props:{
      [mvn]   "base_url":"http://127.0.0.1:20598/solr",
      [mvn]   "core":""}
      [mvn] node props:{
      [mvn]   "base_url":"http://127.0.0.1:27007/solr",
      [mvn]   "core":""}
      [mvn] node props:{
      [mvn]   "base_url":"http://127.0.0.1:15800/solr",
      [mvn]   "core":""}
      [mvn] node props:{
      [mvn]   "base_url":"http://127.0.0.1:20598/solr",
      [mvn]   "core":""}
      [mvn] node props:{
      [mvn]   "base_url":"http://127.0.0.1:27007/solr",
      [mvn]   "core":""}
      [mvn] node props:{
      [mvn]   "base_url":"http://127.0.0.1:15800/solr",
      [mvn]   "core":""}
      [mvn] node props:{
      [mvn]   "base_url":"http://127.0.0.1:20598/solr",
      [mvn]   "core":""}
      [mvn] node props:{
      [mvn]   "base_url":"http://127.0.0.1:15800/solr",
      [mvn]   "core":""}
      [mvn] node props:{
      [mvn]   "base_url":"http://127.0.0.1:20598/solr",
      [mvn]   "core":""}
      [mvn] node props:{
      [mvn]   "base_url":"http://127.0.0.1:27007/solr",
      [mvn]   "core":""}
      [mvn] node props:{
      [mvn]   "base_url":"http://127.0.0.1:39906/solr",
      [mvn]   "core":""}
      [mvn] node props:{
      [mvn]   "base_url":"http://127.0.0.1:15800/solr",
      [mvn]   "core":""}
      [mvn] node props:{
      [mvn]   "base_url":"http://127.0.0.1:27007/solr",
      [mvn]   "core":""}
      [mvn] node props:{
      [mvn]   "base_url":"http://127.0.0.1:39906/solr",
      [mvn]   "core":""}
      [mvn] node props:{
      [mvn]   "base_url":"http://127.0.0.1:20598/solr",
      [mvn]   "core":""}
      [mvn] node props:{
      [mvn]   "base_url":"http://127.0.0.1:27007/solr",
      [mvn]   "core":""}
      [mvn] node props:{
      [mvn]   "base_url":"http://127.0.0.1:27007/solr",
      [mvn]   "core":""}
      [mvn] node props:{
      [mvn]   "base_url":"http://127.0.0.1:39906/solr",
      [mvn]   "core":""}
      [mvn] node props:{
      [mvn]   "base_url":"http://127.0.0.1:15800/solr",
      [mvn]   "core":""}
      [mvn] node props:{
      [mvn]   "base_url":"http://127.0.0.1:39906/solr",
      [mvn]   "core":""}
      [mvn] node props:{
      [mvn]   "base_url":"http://127.0.0.1:15800/solr",
      [mvn]   "core":""}
      [mvn] node props:{
      [mvn]   "base_url":"http://127.0.0.1:20598/solr",
      [mvn]   "core":""}
      [mvn] node props:{
      [mvn]   "base_url":"http://127.0.0.1:39906/solr",
      [mvn]   "core":""}
      [mvn] node props:{
      [mvn]   "base_url":"http://127.0.0.1:15800/solr",
      [mvn]   "core":""}
      [mvn] node props:{
      [mvn]   "base_url":"http://127.0.0.1:20598/solr",
      [mvn]   "core":""}
      [mvn] node props:{
      [mvn]   "base_url":"http://127.0.0.1:20598/solr",
      [mvn]   "core":""}
      [mvn] node props:{
      [mvn]   "base_url":"http://127.0.0.1:27007/solr",
      [mvn]   "core":""}
      [mvn] node props:{
      [mvn]   "base_url":"http://127.0.0.1:39906/solr",
      [mvn]   "core":""}
      [mvn] node props:{
      [mvn]   "base_url":"http://127.0.0.1:15800/solr",
      [mvn]   "core":""}
      [mvn] node props:{
      [mvn]   "base_url":"http://127.0.0.1:20598/solr",
      [mvn]   "core":""}
      [mvn] node props:{
      [mvn]   "base_url":"http://127.0.0.1:27007/solr",
      [mvn]   "core":""}
      [mvn] node props:{
      [mvn]   "base_url":"http://127.0.0.1:20598/solr",
      [mvn]   "core":""}
      [mvn] node props:{
      [mvn]   "base_url":"http://127.0.0.1:39906/solr",
      [mvn]   "core":""}
      [mvn] node props:{
      [mvn]   "base_url":"http://127.0.0.1:20598/solr",
      [mvn]   "core":""}
      [mvn] node props:{
      [mvn]   "base_url":"http://127.0.0.1:27007/solr",
      [mvn]   "core":""}
      [mvn] node props:{
      [mvn]   "base_url":"http://127.0.0.1:20598/solr",
      [mvn]   "core":""}
      [mvn] node props:{
      [mvn]   "base_url":"http://127.0.0.1:27007/solr",
      [mvn]   "core":""}
      [mvn] node props:{
      [mvn]   "base_url":"http://127.0.0.1:39906/solr",
      [mvn]   "core":""}
      [mvn] node props:{
      [mvn]   "base_url":"http://127.0.0.1:15800/solr",
      [mvn]   "core":""}
      [mvn] node props:{
      [mvn]   "base_url":"http://127.0.0.1:27007/solr",
      [mvn]   "core":""}
      [mvn] node props:{
      [mvn]   "base_url":"http://127.0.0.1:20598/solr",
      [mvn]   "core":""}
      [mvn] node props:{
      [mvn]   "base_url":"http://127.0.0.1:27007/solr",
      [mvn]   "core":""}
      [mvn] node props:{
      [mvn]   "base_url":"http://127.0.0.1:39906/solr",
      [mvn]   "core":""}
      [mvn] node props:{
      [mvn]   "base_url":"http://127.0.0.1:15800/solr",
      [mvn]   "core":""}
      [mvn] node props:{
      [mvn]   "base_url":"http://127.0.0.1:20598/solr",
      [mvn]   "core":""}
      [mvn] node props:{
      [mvn]   "base_url":"http://127.0.0.1:39906/solr",
      [mvn]   "core":""}
      [mvn] node props:{
      [mvn]   "base_url":"http://127.0.0.1:27007/solr",
      [mvn]   "core":""}
      [mvn] node props:{
      [mvn]   "base_url":"http://127.0.0.1:15800/solr",
      [mvn]   "core":""}
      [mvn] node props:{
      [mvn]   "base_url":"http://127.0.0.1:15800/solr",
      [mvn]   "core":""}
      [mvn] node props:{
      [mvn]   "base_url":"http://127.0.0.1:27007/solr",
      [mvn]   "core":""}
      [mvn] node props:{
      [mvn]   "base_url":"http://127.0.0.1:39906/solr",
      [mvn]   "core":""}
      [mvn] node props:{
      [mvn]   "base_url":"http://127.0.0.1:15800/solr",
      [mvn]   "core":""}
      [mvn] node props:{
      [mvn]   "base_url":"http://127.0.0.1:20598/solr",
      [mvn]   "core":""}
      [mvn] node props:{
      [mvn]   "base_url":"http://127.0.0.1:39906/solr",
      [mvn]   "core":""}
      [mvn] node props:{
      [mvn]   "base_url":"http://127.0.0.1:20598/solr",
      [mvn]   "core":""}
      [mvn] node props:{
      [mvn]   "base_url":"http://127.0.0.1:20598/solr",
      [mvn]   "core":""}
      [mvn] node props:{
      [mvn]   "base_url":"http://127.0.0.1:27007/solr",
      [mvn]   "core":""}
      [mvn] node props:{
      [mvn]   "base_url":"http://127.0.0.1:39906/solr",
      [mvn]   "core":""}
      [mvn] node props:{
      [mvn]   "base_url":"http://127.0.0.1:15800/solr",
      [mvn]   "core":""}
      [mvn] node props:{
      [mvn]   "base_url":"http://127.0.0.1:39906/solr",
      [mvn]   "core":""}
      [mvn] node props:{
      [mvn]   "base_url":"http://127.0.0.1:15800/solr",
      [mvn]   "core":""}
      [mvn] node props:{
      [mvn]   "base_url":"http://127.0.0.1:20598/solr",
      [mvn]   "core":""}
      [mvn] node props:{
      [mvn]   "base_url":"http://127.0.0.1:20598/solr",
      [mvn]   "core":""}
      [mvn] node props:{
      [mvn]   "base_url":"http://127.0.0.1:27007/solr",
      [mvn]   "core":""}
      [mvn] node props:{
      [mvn]   "base_url":"http://127.0.0.1:15800/solr",
      [mvn]   "core":""}
      [mvn] node props:{
      [mvn]   "base_url":"http://127.0.0.1:20598/solr",
      [mvn]   "core":""}
      [mvn] node props:{
      [mvn]   "base_url":"http://127.0.0.1:39906/solr",
      [mvn]   "core":""}
      [mvn] node props:{
      [mvn]   "base_url":"http://127.0.0.1:20598/solr",
      [mvn]   "core":""}
      [mvn] node props:{
      [mvn]   "base_url":"http://127.0.0.1:27007/solr",
      [mvn]   "core":""}
      [mvn] node props:{
      [mvn]   "base_url":"http://127.0.0.1:20598/solr",
      [mvn]   "core":""}
      [mvn] node props:{
      [mvn]   "base_url":"http://127.0.0.1:39906/solr",
      [mvn]   "core":""}
      [mvn] node props:{
      [mvn]   "base_url":"http://127.0.0.1:15800/solr",
      [mvn]   "core":""}
      [mvn] node props:{
      [mvn]   "base_url":"http://127.0.0.1:20598/solr",
      [mvn]   "core":""}
      [mvn] node props:{
      [mvn]   "base_url":"http://127.0.0.1:39906/solr",
      [mvn]   "core":""}
      [mvn] node props:{
      [mvn]   "base_url":"http://127.0.0.1:15800/solr",
      [mvn]   "core":""}
      [mvn] node props:{
      [mvn]   "base_url":"http://127.0.0.1:15800/solr",
      [mvn]   "core":""}
      [mvn] node props:{
      [mvn]   "base_url":"http://127.0.0.1:27007/solr",
      [mvn]   "core":""}
      [mvn] node props:{
      [mvn]   "base_url":"http://127.0.0.1:39906/solr",
      [mvn]   "core":""}
      [mvn] node props:{
      [mvn]   "base_url":"http://127.0.0.1:15800/solr",
      [mvn]   "core":""}
      [mvn] node props:{
      [mvn]   "base_url":"http://127.0.0.1:27007/solr",
      [mvn]   "core":""}
      [mvn] node props:{
      [mvn]   "base_url":"http://127.0.0.1:39906/solr",
      [mvn]   "core":""}
      [mvn] node props:{
      [mvn]   "base_url":"http://127.0.0.1:20598/solr",
      [mvn]   "core":""}
      [mvn] node props:{
      [mvn]   "base_url":"http://127.0.0.1:27007/solr",
      [mvn]   "core":""}
      [mvn] node props:{
      [mvn]   "base_url":"http://127.0.0.1:39906/solr",
      [mvn]   "core":""}
      [mvn] node props:{
      [mvn]   "base_url":"http://127.0.0.1:20598/solr",
      [mvn]   "core":""}
      [mvn] node props:{
      [mvn]   "base_url":"http://127.0.0.1:15800/solr",
      [mvn]   "core":""}
      [mvn] node props:{
      [mvn]   "base_url":"http://127.0.0.1:27007/solr",
      [mvn]   "core":""}
      [mvn] node props:{
      [mvn]   "base_url":"http://127.0.0.1:39906/solr",
      [mvn]   "core":""}
      [mvn] node props:{
      [mvn]   "base_url":"http://127.0.0.1:27007/solr",
      [mvn]   "core":""}
      [mvn] node props:{
      [mvn]   "base_url":"http://127.0.0.1:15800/solr",
      [mvn]   "core":""}
      [mvn] node props:{
      [mvn]   "base_url":"http://127.0.0.1:20598/solr",
      [mvn]   "core":""}
      [mvn] node props:{
      [mvn]   "base_url":"http://127.0.0.1:15800/solr",
      [mvn]   "core":""}
      [mvn] node props:{
      [mvn]   "base_url":"http://127.0.0.1:20598/solr",
      [mvn]   "core":""}
      [mvn] node props:{
      [mvn]   "base_url":"http://127.0.0.1:39906/solr",
      [mvn]   "core":""}
      [mvn] node props:{
      [mvn]   "base_url":"http://127.0.0.1:20598/solr",
      [mvn]   "core":""}
      [mvn] node props:{
      [mvn]   "base_url":"http://127.0.0.1:39906/solr",
      [mvn]   "core":""}
      [mvn] node props:{
      [mvn]   "base_url":"http://127.0.0.1:27007/solr",
      [mvn]   "core":""}
      [mvn] node props:{
      [mvn]   "base_url":"http://127.0.0.1:15800/solr",
      [mvn]   "core":""}
      [mvn] node props:{
      [mvn]   "base_url":"http://127.0.0.1:20598/solr",
      [mvn]   "core":""}
      [mvn] node props:{
      [mvn]   "base_url":"http://127.0.0.1:15800/solr",
      [mvn]   "core":""}
      [mvn] node props:{
      [mvn]   "base_url":"http://127.0.0.1:20598/solr",
      [mvn]   "core":""}
      [mvn] node props:{
      [mvn]   "base_url":"http://127.0.0.1:39906/solr",
      [mvn]   "core":""}
      [mvn] node props:{
      [mvn]   "base_url":"http://127.0.0.1:15800/solr",
      [mvn]   "core":""}
      [mvn] node props:{
      [mvn]   "base_url":"http://127.0.0.1:20598/solr",
      [mvn]   "core":""}
      [mvn] node props:{
      [mvn]   "base_url":"http://127.0.0.1:15800/solr",
      [mvn]   "core":""}
      [mvn] node props:{
      [mvn]   "base_url":"http://127.0.0.1:20598/solr",
      [mvn]   "core":""}
      [mvn] node props:{
      [mvn]   "base_url":"http://127.0.0.1:27007/solr",
      [mvn]   "core":""}
      [mvn] node props:{
      [mvn]   "base_url":"http://127.0.0.1:39906/solr",
      [mvn]   "core":""}
      [mvn] Tests run: 1, Failures: 0, Errors: 0, Skipped: 0, Time elapsed: 2.228 sec
      [mvn] Running org.apache.solr.core.RAMDirectoryFactoryTest
      [mvn] Tests run: 1, Failures: 0, Errors: 0, Skipped: 0, Time elapsed: 0.02 sec
      [mvn] Running org.apache.solr.core.CoreContainerCoreInitFailuresTest
      [mvn] 22 T3290 oasc.CoreContainer.create SEVERE Unable to create core: bogus Ignoring exception matching \Qbogus_path\E
      [mvn] 118 T3290 oasc.CoreContainer.create SEVERE Unable to create core: col_bad Ignoring exception matching \QDummyMergePolicy\E
      [mvn] 135 T3 oasc.SolrCore.finalize SEVERE REFCOUNT ERROR: unreferenced org.apache.solr.core.SolrCore@7dcab672 (col_bad) has a reference count of 1
      [mvn] 179 T3290 oasc.CoreContainer.create SEVERE Unable to create core: bogus Ignoring exception matching \Qbogus_path\E
      [mvn] 189 T3290 oasc.CoreContainer.reload SEVERE Unable to reload core: col_bad Ignoring exception matching \QSAX\E
      [mvn] Tests run: 2, Failures: 0, Errors: 0, Skipped: 0, Time elapsed: 0.254 sec
      [mvn] Running org.apache.solr.search.function.TestFunctionQuery
      [mvn] Creating dataDir: /usr/home/hudson/hudson-slave/workspace/Lucene-Solr-Maven-4.x/maven-build/solr/core/src/test/target/test/./solrtest-TestFunctionQuery-1348310409645
      [mvn] ASYNC  NEW_CORE C7 name=collection1 org.apache.solr.core.SolrCore@20b13f94
      [mvn] 778 T3295 C7 oassf.FileFloatSource.getFloats SEVERE Error loading external value source + fileName + java.lang.NumberFormatException: For input string: ""
      [mvn] Tests run: 14, Failures: 0, Errors: 0, Skipped: 0, Time elapsed: 1.222 sec
      [mvn] Running org.apache.solr.schema.IndexSchemaTest
      [mvn] Creating dataDir: /usr/home/hudson/hudson-slave/workspace/Lucene-Solr-Maven-4.x/maven-build/solr/core/src/test/target/test/./solrtest-IndexSchemaTest-1348310410866
      [mvn] Tests run: 3, Failures: 0, Errors: 0, Skipped: 0, Time elapsed: 0.515 sec
      [mvn] Running org.apache.solr.cloud.LeaderElectionIntegrationTest
      [mvn] Creating dataDir: /usr/home/hudson/hudson-slave/workspace/Lucene-Solr-Maven-4.x/maven-build/solr/core/src/test/target/test/./solrtest-LeaderElectionIntegrationTest-1348310411385
      [mvn] Creating dataDir: /usr/home/hudson/hudson-slave/workspace/Lucene-Solr-Maven-4.x/maven-build/solr/core/src/test/target/test/./solrtest-LeaderElectionIntegrationTest-1348310419311
      [mvn] 18856 T3365 oasc.SolrException.log SEVERE Failed setting watch:org.apache.zookeeper.KeeperException$NoNodeException: KeeperErrorCode = NoNode for /collections/collection1/leader_elect/shard1/election/88362871640293379-127.0.0.1:7001_solr_collection1-n_0000000001
      [mvn] 		at org.apache.zookeeper.KeeperException.create(KeeperException.java:102)
      [mvn] 		at org.apache.zookeeper.KeeperException.create(KeeperException.java:42)
      [mvn] 		at org.apache.zookeeper.ZooKeeper.getData(ZooKeeper.java:927)
      [mvn] 		at org.apache.solr.common.cloud.SolrZkClient$7.execute(SolrZkClient.java:291)
      [mvn] 		at org.apache.solr.common.cloud.SolrZkClient$7.execute(SolrZkClient.java:288)
      [mvn] 		at org.apache.solr.common.cloud.ZkCmdExecutor.retryOperation(ZkCmdExecutor.java:67)
      [mvn] 		at org.apache.solr.common.cloud.SolrZkClient.getData(SolrZkClient.java:288)
      [mvn] 		at org.apache.solr.cloud.LeaderElector.checkIfIamLeader(LeaderElector.java:119)
      [mvn] 		at org.apache.solr.cloud.LeaderElector.access$000(LeaderElector.java:56)
      [mvn] 		at org.apache.solr.cloud.LeaderElector$1.process(LeaderElector.java:131)
      [mvn] 		at org.apache.zookeeper.ClientCnxn$EventThread.processEvent(ClientCnxn.java:526)
      [mvn] 		at org.apache.zookeeper.ClientCnxn$EventThread.run(ClientCnxn.java:502)
      [mvn] 	
      [mvn] 19858 T3365 oasc.Overseer.createOverseerNode SEVERE Could not create Overseer node org.apache.zookeeper.KeeperException$SessionExpiredException: KeeperErrorCode = Session expired for /overseer
      [mvn] 	at org.apache.zookeeper.KeeperException.create(KeeperException.java:118)
      [mvn] 	at org.apache.zookeeper.KeeperException.create(KeeperException.java:42)
      [mvn] 	at org.apache.zookeeper.ZooKeeper.create(ZooKeeper.java:643)
      [mvn] 	at org.apache.solr.common.cloud.SolrZkClient$9.execute(SolrZkClient.java:339)
      [mvn] 	at org.apache.solr.common.cloud.SolrZkClient$9.execute(SolrZkClient.java:336)
      [mvn] 	at org.apache.solr.common.cloud.ZkCmdExecutor.retryOperation(ZkCmdExecutor.java:67)
      [mvn] 	at org.apache.solr.common.cloud.SolrZkClient.create(SolrZkClient.java:336)
      [mvn] 	at org.apache.solr.cloud.Overseer.createOverseerNode(Overseer.java:541)
      [mvn] 	at org.apache.solr.cloud.Overseer.getInQueue(Overseer.java:523)
      [mvn] 	at org.apache.solr.cloud.ShardLeaderElectionContext.runLeaderProcess(ElectionContext.java:138)
      [mvn] 	at org.apache.solr.cloud.LeaderElector.runIamLeaderProcess(LeaderElector.java:158)
      [mvn] 	at org.apache.solr.cloud.LeaderElector.checkIfIamLeader(LeaderElector.java:102)
      [mvn] 	at org.apache.solr.cloud.LeaderElector.checkIfIamLeader(LeaderElector.java:150)
      [mvn] 	at org.apache.solr.cloud.LeaderElector.access$000(LeaderElector.java:56)
      [mvn] 	at org.apache.solr.cloud.LeaderElector$1.process(LeaderElector.java:131)
      [mvn] 	at org.apache.zookeeper.ClientCnxn$EventThread.processEvent(ClientCnxn.java:526)
      [mvn] 	at org.apache.zookeeper.ClientCnxn$EventThread.run(ClientCnxn.java:502)
      [mvn] 
      [mvn] Tests run: 2, Failures: 0, Errors: 0, Skipped: 0, Time elapsed: 21.322 sec
      [mvn] Running org.apache.solr.search.function.SortByFunctionTest
      [mvn] Tests run: 2, Failures: 0, Errors: 0, Skipped: 0, Time elapsed: 1.09 sec
      [mvn] Running org.apache.solr.core.TestSolrXMLSerializer
      [mvn] Tests run: 1, Failures: 0, Errors: 0, Skipped: 0, Time elapsed: 0.031 sec
      [mvn] Running org.apache.solr.update.DocumentBuilderTest
      [mvn] Creating dataDir: /usr/home/hudson/hudson-slave/workspace/Lucene-Solr-Maven-4.x/maven-build/solr/core/src/test/target/test/./solrtest-DocumentBuilderTest-1348310433830
      [mvn] Tests run: 11, Failures: 0, Errors: 0, Skipped: 0, Time elapsed: 0.532 sec
      [mvn] Running org.apache.solr.TestPluginEnable
      [mvn] Creating dataDir: /usr/home/hudson/hudson-slave/workspace/Lucene-Solr-Maven-4.x/maven-build/solr/core/src/test/target/test/./solrtest-TestPluginEnable-1348310434363
      [mvn] Tests run: 1, Failures: 0, Errors: 0, Skipped: 0, Time elapsed: 0.097 sec
      [mvn] Running org.apache.solr.handler.component.StatsComponentTest
      [mvn] ASYNC  NEW_CORE C8 name=collection1 org.apache.solr.core.SolrCore@2c471cbb
      [mvn] 387 T3392 C8 oasc.SolrException.log SEVERE org.apache.solr.common.SolrException: Stats can only facet on single-valued fields, not: foo_ss
      [mvn] 		at org.apache.solr.handler.component.SimpleStats.getFieldCacheStats(StatsComponent.java:261)
      [mvn] 		at org.apache.solr.handler.component.SimpleStats.getStatsFields(StatsComponent.java:227)
      [mvn] 		at org.apache.solr.handler.component.SimpleStats.getStatsCounts(StatsComponent.java:201)
      [mvn] 		at org.apache.solr.handler.component.StatsComponent.process(StatsComponent.java:70)
      [mvn] 		at org.apache.solr.handler.component.SearchHandler.handleRequestBody(SearchHandler.java:206)
      [mvn] 		at org.apache.solr.handler.RequestHandlerBase.handleRequest(RequestHandlerBase.java:129)
      [mvn] 		at org.apache.solr.core.SolrCore.execute(SolrCore.java:1701)
      [mvn] 		at org.apache.solr.util.TestHarness.query(TestHarness.java:364)
      [mvn] 		at org.apache.solr.util.TestHarness.query(TestHarness.java:346)
      [mvn] 		at org.apache.solr.util.AbstractSolrTestCase.assertQEx(AbstractSolrTestCase.java:290)
      [mvn] 		at org.apache.solr.handler.component.StatsComponentTest.testStatsFacetMultivaluedErrorHandling(StatsComponentTest.java:363)
      [mvn] 		at sun.reflect.NativeMethodAccessorImpl.invoke0(Native Method)
      [mvn] 		at sun.reflect.NativeMethodAccessorImpl.invoke(NativeMethodAccessorImpl.java:57)
      [mvn] 		at sun.reflect.DelegatingMethodAccessorImpl.invoke(DelegatingMethodAccessorImpl.java:43)
      [mvn] 		at java.lang.reflect.Method.invoke(Method.java:616)
      [mvn] 		at com.carrotsearch.randomizedtesting.RandomizedRunner.invoke(RandomizedRunner.java:1559)
      [mvn] 		at com.carrotsearch.randomizedtesting.RandomizedRunner.access$600(RandomizedRunner.java:79)
      [mvn] 		at com.carrotsearch.randomizedtesting.RandomizedRunner$6.evaluate(RandomizedRunner.java:737)
      [mvn] 		at com.carrotsearch.randomizedtesting.RandomizedRunner$7.evaluate(RandomizedRunner.java:773)
      [mvn] 		at com.carrotsearch.randomizedtesting.RandomizedRunner$8.evaluate(RandomizedRunner.java:787)
      [mvn] 		at com.carrotsearch.randomizedtesting.rules.SystemPropertiesRestoreRule$1.evaluate(SystemPropertiesRestoreRule.java:53)
      [mvn] 		at org.apache.lucene.util.TestRuleSetupTeardownChained$1.evaluate(TestRuleSetupTeardownChained.java:50)
      [mvn] 		at org.apache.lucene.util.TestRuleFieldCacheSanity$1.evaluate(TestRuleFieldCacheSanity.java:51)
      [mvn] 		at org.apache.lucene.util.AbstractBeforeAfterRule$1.evaluate(AbstractBeforeAfterRule.java:45)
      [mvn] 		at com.carrotsearch.randomizedtesting.rules.SystemPropertiesInvariantRule$1.evaluate(SystemPropertiesInvariantRule.java:55)
      [mvn] 		at org.apache.lucene.util.TestRuleThreadAndTestName$1.evaluate(TestRuleThreadAndTestName.java:48)
      [mvn] 		at org.apache.lucene.util.TestRuleIgnoreAfterMaxFailures$1.evaluate(TestRuleIgnoreAfterMaxFailures.java:70)
      [mvn] 		at org.apache.lucene.util.TestRuleMarkFailure$1.evaluate(TestRuleMarkFailure.java:48)
      [mvn] 		at com.carrotsearch.randomizedtesting.rules.StatementAdapter.evaluate(StatementAdapter.java:36)
      [mvn] 		at com.carrotsearch.randomizedtesting.ThreadLeakControl$StatementRunner.run(ThreadLeakControl.java:358)
      [mvn] 		at com.carrotsearch.randomizedtesting.ThreadLeakControl.forkTimeoutingTask(ThreadLeakControl.java:782)
      [mvn] 		at com.carrotsearch.randomizedtesting.ThreadLeakControl$3.evaluate(ThreadLeakControl.java:442)
      [mvn] 		at com.carrotsearch.randomizedtesting.RandomizedRunner.runSingleTest(RandomizedRunner.java:746)
      [mvn] 		at com.carrotsearch.randomizedtesting.RandomizedRunner$3.evaluate(RandomizedRunner.java:648)
      [mvn] 		at com.carrotsearch.randomizedtesting.RandomizedRunner$4.evaluate(RandomizedRunner.java:682)
      [mvn] 		at com.carrotsearch.randomizedtesting.RandomizedRunner$5.evaluate(RandomizedRunner.java:693)
      [mvn] 		at com.carrotsearch.randomizedtesting.rules.StatementAdapter.evaluate(StatementAdapter.java:36)
      [mvn] 		at com.carrotsearch.randomizedtesting.rules.SystemPropertiesRestoreRule$1.evaluate(SystemPropertiesRestoreRule.java:53)
      [mvn] 		at org.apache.lucene.util.AbstractBeforeAfterRule$1.evaluate(AbstractBeforeAfterRule.java:45)
      [mvn] 		at org.apache.lucene.util.TestRuleStoreClassName$1.evaluate(TestRuleStoreClassName.java:42)
      [mvn] 		at com.carrotsearch.randomizedtesting.rules.SystemPropertiesInvariantRule$1.evaluate(SystemPropertiesInvariantRule.java:55)
      [mvn] 		at com.carrotsearch.randomizedtesting.rules.NoShadowingOrOverridesOnMethodsRule$1.evaluate(NoShadowingOrOverridesOnMethodsRule.java:39)
      [mvn] 		at com.carrotsearch.randomizedtesting.rules.NoShadowingOrOverridesOnMethodsRule$1.evaluate(NoShadowingOrOverridesOnMethodsRule.java:39)
      [mvn] 		at com.carrotsearch.randomizedtesting.rules.StatementAdapter.evaluate(StatementAdapter.java:36)
      [mvn] 		at org.apache.lucene.util.TestRuleAssertionsRequired$1.evaluate(TestRuleAssertionsRequired.java:43)
      [mvn] 		at org.apache.lucene.util.TestRuleMarkFailure$1.evaluate(TestRuleMarkFailure.java:48)
      [mvn] 		at org.apache.lucene.util.TestRuleIgnoreAfterMaxFailures$1.evaluate(TestRuleIgnoreAfterMaxFailures.java:70)
      [mvn] 		at org.apache.lucene.util.TestRuleIgnoreTestSuites$1.evaluate(TestRuleIgnoreTestSuites.java:55)
      [mvn] 		at com.carrotsearch.randomizedtesting.rules.StatementAdapter.evaluate(StatementAdapter.java:36)
      [mvn] 		at com.carrotsearch.randomizedtesting.ThreadLeakControl$StatementRunner.run(ThreadLeakControl.java:358)
      [mvn] 		at java.lang.Thread.run(Thread.java:679)
      [mvn] 	
      [mvn] Tests run: 7, Failures: 0, Errors: 0, Skipped: 0, Time elapsed: 3.434 sec
      [mvn] Running org.apache.solr.search.TestPseudoReturnFields
      [mvn] Creating dataDir: /usr/home/hudson/hudson-slave/workspace/Lucene-Solr-Maven-4.x/maven-build/solr/core/src/test/target/test/./solrtest-TestPseudoReturnFields-1348310437898
      [mvn] Tests run: 13, Failures: 0, Errors: 0, Skipped: 0, Time elapsed: 0.685 sec
      [mvn] Running org.apache.solr.core.TestQuerySenderListener
      [mvn] Creating dataDir: /usr/home/hudson/hudson-slave/workspace/Lucene-Solr-Maven-4.x/maven-build/solr/core/src/test/target/test/./solrtest-TestQuerySenderListener-1348310438583
      [mvn] Tests run: 3, Failures: 0, Errors: 0, Skipped: 0, Time elapsed: 0.377 sec
      [mvn] Running org.apache.solr.analysis.LegacyHTMLStripCharFilterTest
      [mvn] Tests run: 13, Failures: 0, Errors: 0, Skipped: 1, Time elapsed: 0.295 sec
      [mvn] Running org.apache.solr.search.TestRangeQuery
      [mvn] Creating dataDir: /usr/home/hudson/hudson-slave/workspace/Lucene-Solr-Maven-4.x/maven-build/solr/core/src/test/target/test/./solrtest-TestRangeQuery-1348310439258
      [mvn] Tests run: 2, Failures: 0, Errors: 0, Skipped: 0, Time elapsed: 2.82 sec
      [mvn] Running org.apache.solr.core.TestSolrDeletionPolicy1
      [mvn] Creating dataDir: /usr/home/hudson/hudson-slave/workspace/Lucene-Solr-Maven-4.x/maven-build/solr/core/src/test/target/test/./solrtest-TestSolrDeletionPolicy1-1348310442075
      [mvn] Tests run: 3, Failures: 0, Errors: 0, Skipped: 0, Time elapsed: 0.524 sec
      [mvn] Running org.apache.solr.schema.PolyFieldTest
      [mvn] Creating dataDir: /usr/home/hudson/hudson-slave/workspace/Lucene-Solr-Maven-4.x/maven-build/solr/core/src/test/target/test/./solrtest-PolyFieldTest-1348310442600
      [mvn] Tests run: 4, Failures: 0, Errors: 0, Skipped: 0, Time elapsed: 0.523 sec
      [mvn] Running org.apache.solr.cloud.ChaosMonkeySafeLeaderTest
      [mvn] Tests run: 1, Failures: 0, Errors: 0, Skipped: 1, Time elapsed: 0 sec
      [mvn] Running org.apache.solr.update.processor.DefaultValueUpdateProcessorTest
      [mvn] Creating dataDir: /usr/home/hudson/hudson-slave/workspace/Lucene-Solr-Maven-4.x/maven-build/solr/core/src/test/target/test/./solrtest-DefaultValueUpdateProcessorTest-1348310443127
      [mvn] Tests run: 1, Failures: 0, Errors: 0, Skipped: 0, Time elapsed: 0.404 sec
      [mvn] Running org.apache.solr.update.UpdateParamsTest
      [mvn] Tests run: 1, Failures: 0, Errors: 0, Skipped: 0, Time elapsed: 0.499 sec
      [mvn] Running org.apache.solr.core.SolrCoreCheckLockOnStartupTest
      [mvn] Creating dataDir: /usr/home/hudson/hudson-slave/workspace/Lucene-Solr-Maven-4.x/maven-build/solr/core/src/test/target/test/./solrtest-SolrCoreCheckLockOnStartupTest-1348310444035
      [mvn] 400 T3434 oasc.SolrCore.initIndex SEVERE [collection1] Solr index directory '/usr/home/hudson/hudson-slave/workspace/Lucene-Solr-Maven-4.x/maven-build/solr/core/src/test/target/test/./solrtest-SolrCoreCheckLockOnStartupTest-1348310444035/index/' is locked.  Throwing exception
      [mvn] Creating dataDir: /usr/home/hudson/hudson-slave/workspace/Lucene-Solr-Maven-4.x/maven-build/solr/core/src/test/target/test/./solrtest-SolrCoreCheckLockOnStartupTest-1348310444444
      [mvn] 513 T3 oasc.SolrCore.finalize SEVERE REFCOUNT ERROR: unreferenced org.apache.solr.core.SolrCore@4211e690 (collection1) has a reference count of 1
      [mvn] 513 T3 oasc.CoreContainer.finalize SEVERE CoreContainer was not shutdown prior to finalize(), indicates a bug -- POSSIBLE RESOURCE LEAK!!!  instance=1962150732
      [mvn] 800 T3434 oasc.SolrCore.initIndex SEVERE [collection1] Solr index directory '/usr/home/hudson/hudson-slave/workspace/Lucene-Solr-Maven-4.x/maven-build/solr/core/src/test/target/test/./solrtest-SolrCoreCheckLockOnStartupTest-1348310444444/index/' is locked.  Throwing exception
      [mvn] Tests run: 2, Failures: 0, Errors: 0, Skipped: 0, Time elapsed: 0.824 sec
      [mvn] Running org.apache.solr.search.TestSort
      [mvn] Creating dataDir: /usr/home/hudson/hudson-slave/workspace/Lucene-Solr-Maven-4.x/maven-build/solr/core/src/test/target/test/./solrtest-TestSort-1348310444859
      [mvn] 83 T3 oasc.SolrCore.finalize SEVERE REFCOUNT ERROR: unreferenced org.apache.solr.core.SolrCore@490a8d0a (collection1) has a reference count of 1
      [mvn] 83 T3 oasc.CoreContainer.finalize SEVERE CoreContainer was not shutdown prior to finalize(), indicates a bug -- POSSIBLE RESOURCE LEAK!!!  instance=1873610885
      [mvn] Tests run: 2, Failures: 0, Errors: 0, Skipped: 0, Time elapsed: 3.337 sec
      [mvn] Running org.apache.solr.search.TestFiltering
      [mvn] Creating dataDir: /usr/home/hudson/hudson-slave/workspace/Lucene-Solr-Maven-4.x/maven-build/solr/core/src/test/target/test/./solrtest-TestFiltering-1348310448194
      [mvn] Tests run: 2, Failures: 0, Errors: 0, Skipped: 0, Time elapsed: 22.519 sec
      [mvn] Running org.apache.solr.search.TestStressVersions
      [mvn] Creating dataDir: /usr/home/hudson/hudson-slave/workspace/Lucene-Solr-Maven-4.x/maven-build/solr/core/src/test/target/test/./solrtest-TestStressVersions-1348310470714
      [mvn] Tests run: 1, Failures: 0, Errors: 0, Skipped: 0, Time elapsed: 1.689 sec
      [mvn] Running org.apache.solr.search.TestQueryTypes
      [mvn] Tests run: 1, Failures: 0, Errors: 0, Skipped: 0, Time elapsed: 0.359 sec
      [mvn] Running org.apache.solr.core.TestJmxMonitoredMap
      [mvn] Tests run: 2, Failures: 0, Errors: 0, Skipped: 0, Time elapsed: 0.119 sec
      [mvn] Running org.apache.solr.util.TestNumberUtils
      [mvn] Tests run: 1, Failures: 0, Errors: 0, Skipped: 0, Time elapsed: 0.17 sec
      [mvn] Running org.apache.solr.search.similarities.TestPerFieldSimilarity
      [mvn] Creating dataDir: /usr/home/hudson/hudson-slave/workspace/Lucene-Solr-Maven-4.x/maven-build/solr/core/src/test/target/test/./solrtest-TestPerFieldSimilarity-1348310473057
      [mvn] Tests run: 7, Failures: 0, Errors: 0, Skipped: 0, Time elapsed: 0.123 sec
      [mvn] Running org.apache.solr.request.TestBinaryResponseWriter
      [mvn] Tests run: 2, Failures: 0, Errors: 0, Skipped: 0, Time elapsed: 1.037 sec
      [mvn] Running org.apache.solr.request.TestRemoteStreaming
      [mvn] Creating dataDir: /usr/home/hudson/hudson-slave/workspace/Lucene-Solr-Maven-4.x/maven-build/solr/core/src/test/target/test/./solrtest-TestRemoteStreaming-1348310474225
      [mvn] Tests run: 4, Failures: 0, Errors: 0, Skipped: 0, Time elapsed: 0.724 sec
      [mvn] Running org.apache.solr.response.TestCSVResponseWriter
      [mvn] Creating dataDir: /usr/home/hudson/hudson-slave/workspace/Lucene-Solr-Maven-4.x/maven-build/solr/core/src/test/target/test/./solrtest-TestCSVResponseWriter-1348310474948
      [mvn] Tests run: 1, Failures: 0, Errors: 0, Skipped: 0, Time elapsed: 0.38 sec
      [mvn] Running org.apache.solr.handler.component.SearchHandlerTest
      [mvn] Creating dataDir: /usr/home/hudson/hudson-slave/workspace/Lucene-Solr-Maven-4.x/maven-build/solr/core/src/test/target/test/./solrtest-SearchHandlerTest-1348310475324
      [mvn] Tests run: 1, Failures: 0, Errors: 0, Skipped: 0, Time elapsed: 0.354 sec
      [mvn] Running org.apache.solr.handler.admin.LukeRequestHandlerTest
      [mvn] Tests run: 4, Failures: 0, Errors: 0, Skipped: 0, Time elapsed: 1.53 sec
      [mvn] Running org.apache.solr.schema.BadIndexSchemaTest
      [mvn] Creating dataDir: /usr/home/hudson/hudson-slave/workspace/Lucene-Solr-Maven-4.x/maven-build/solr/core/src/test/target/test/./solrtest-BadIndexSchemaTest-1348310477210
      [mvn] 64 T3541 oasc.SolrCore.initCodec SEVERE FieldType 'pulsing1' is configured with a postings format, but the codec does not support it: class org.apache.solr.core.SolrCore$3
      [mvn] Creating dataDir: /usr/home/hudson/hudson-slave/workspace/Lucene-Solr-Maven-4.x/maven-build/solr/core/src/test/target/test/./solrtest-BadIndexSchemaTest-1348310477275
      [mvn] Creating dataDir: /usr/home/hudson/hudson-slave/workspace/Lucene-Solr-Maven-4.x/maven-build/solr/core/src/test/target/test/./solrtest-BadIndexSchemaTest-1348310477327
      [mvn] 157 T3 oasc.SolrCore.finalize SEVERE REFCOUNT ERROR: unreferenced org.apache.solr.core.SolrCore@70e4afa6 (collection1) has a reference count of 1
      [mvn] 157 T3 oasc.CoreContainer.finalize SEVERE CoreContainer was not shutdown prior to finalize(), indicates a bug -- POSSIBLE RESOURCE LEAK!!!  instance=827571734
      [mvn] Creating dataDir: /usr/home/hudson/hudson-slave/workspace/Lucene-Solr-Maven-4.x/maven-build/solr/core/src/test/target/test/./solrtest-BadIndexSchemaTest-1348310477387
      [mvn] Creating dataDir: /usr/home/hudson/hudson-slave/workspace/Lucene-Solr-Maven-4.x/maven-build/solr/core/src/test/target/test/./solrtest-BadIndexSchemaTest-1348310477439
      [mvn] Creating dataDir: /usr/home/hudson/hudson-slave/workspace/Lucene-Solr-Maven-4.x/maven-build/solr/core/src/test/target/test/./solrtest-BadIndexSchemaTest-1348310477492
      [mvn] 346 T3541 oass.IndexSchema.readSchema SEVERE uniqueKey field (id) can not be the dest of a copyField (src=XXX)
      [mvn] Creating dataDir: /usr/home/hudson/hudson-slave/workspace/Lucene-Solr-Maven-4.x/maven-build/solr/core/src/test/target/test/./solrtest-BadIndexSchemaTest-1348310477555
      [mvn] 418 T3541 oass.IndexSchema.readSchema SEVERE uniqueKey field (null) can not be configured with a default value (XXX)
      [mvn] Creating dataDir: /usr/home/hudson/hudson-slave/workspace/Lucene-Solr-Maven-4.x/maven-build/solr/core/src/test/target/test/./solrtest-BadIndexSchemaTest-1348310477627
      [mvn] 491 T3541 oass.IndexSchema.readSchema SEVERE uniqueKey field (null) can not be configured to be multivalued
      [mvn] Creating dataDir: /usr/home/hudson/hudson-slave/workspace/Lucene-Solr-Maven-4.x/maven-build/solr/core/src/test/target/test/./solrtest-BadIndexSchemaTest-1348310477702
      [mvn] Creating dataDir: /usr/home/hudson/hudson-slave/workspace/Lucene-Solr-Maven-4.x/maven-build/solr/core/src/test/target/test/./solrtest-BadIndexSchemaTest-1348310477780
      [mvn] 643 T3541 oass.IndexSchema.readSchema SEVERE FieldType 'sim1' is configured with a similarity, but the global similarity does not support it: class org.apache.solr.search.similarities.DefaultSimilarityFactory
      [mvn] Creating dataDir: /usr/home/hudson/hudson-slave/workspace/Lucene-Solr-Maven-4.x/maven-build/solr/core/src/test/target/test/./solrtest-BadIndexSchemaTest-1348310477854
      [mvn] Creating dataDir: /usr/home/hudson/hudson-slave/workspace/Lucene-Solr-Maven-4.x/maven-build/solr/core/src/test/target/test/./solrtest-BadIndexSchemaTest-1348310477925
      [mvn] Creating dataDir: /usr/home/hudson/hudson-slave/workspace/Lucene-Solr-Maven-4.x/maven-build/solr/core/src/test/target/test/./solrtest-BadIndexSchemaTest-1348310477997
      [mvn] Creating dataDir: /usr/home/hudson/hudson-slave/workspace/Lucene-Solr-Maven-4.x/maven-build/solr/core/src/test/target/test/./solrtest-BadIndexSchemaTest-1348310478057
      [mvn] Creating dataDir: /usr/home/hudson/hudson-slave/workspace/Lucene-Solr-Maven-4.x/maven-build/solr/core/src/test/target/test/./solrtest-BadIndexSchemaTest-1348310478113
      [mvn] Creating dataDir: /usr/home/hudson/hudson-slave/workspace/Lucene-Solr-Maven-4.x/maven-build/solr/core/src/test/target/test/./solrtest-BadIndexSchemaTest-1348310478171
      [mvn] Creating dataDir: /usr/home/hudson/hudson-slave/workspace/Lucene-Solr-Maven-4.x/maven-build/solr/core/src/test/target/test/./solrtest-BadIndexSchemaTest-1348310478222
      [mvn] Creating dataDir: /usr/home/hudson/hudson-slave/workspace/Lucene-Solr-Maven-4.x/maven-build/solr/core/src/test/target/test/./solrtest-BadIndexSchemaTest-1348310478275
      [mvn] Tests run: 10, Failures: 0, Errors: 0, Skipped: 0, Time elapsed: 1.174 sec
      [mvn] Running org.apache.solr.request.JSONWriterTest
      [mvn] Creating dataDir: /usr/home/hudson/hudson-slave/workspace/Lucene-Solr-Maven-4.x/maven-build/solr/core/src/test/target/test/./solrtest-JSONWriterTest-1348310478381
      [mvn] Tests run: 3, Failures: 0, Errors: 0, Skipped: 0, Time elapsed: 0.377 sec
      [mvn] Running org.apache.solr.handler.admin.ShowFileRequestHandlerTest
      [mvn] Creating dataDir: /usr/home/hudson/hudson-slave/workspace/Lucene-Solr-Maven-4.x/maven-build/solr/core/src/test/target/test/./solrtest-ShowFileRequestHandlerTest-1348310478759
      [mvn] Tests run: 2, Failures: 0, Errors: 0, Skipped: 0, Time elapsed: 0.777 sec
      [mvn] Running org.apache.solr.update.processor.UniqFieldsUpdateProcessorFactoryTest
      [mvn] Creating dataDir: /usr/home/hudson/hudson-slave/workspace/Lucene-Solr-Maven-4.x/maven-build/solr/core/src/test/target/test/./solrtest-UniqFieldsUpdateProcessorFactoryTest-1348310479541
      [mvn] Tests run: 1, Failures: 0, Errors: 0, Skipped: 0, Time elapsed: 0.502 sec
      [mvn] Running org.apache.solr.search.similarities.TestDFRSimilarityFactory
      [mvn] Creating dataDir: /usr/home/hudson/hudson-slave/workspace/Lucene-Solr-Maven-4.x/maven-build/solr/core/src/test/target/test/./solrtest-TestDFRSimilarityFactory-1348310480045
      [mvn] Tests run: 3, Failures: 0, Errors: 0, Skipped: 0, Time elapsed: 0.107 sec
      [mvn] Running org.apache.solr.core.TestArbitraryIndexDir
      [mvn] Tests run: 1, Failures: 0, Errors: 0, Skipped: 0, Time elapsed: 0.535 sec
      [mvn] Running org.apache.solr.util.TestUtils
      [mvn] Tests run: 3, Failures: 0, Errors: 0, Skipped: 0, Time elapsed: 0.034 sec
      [mvn] Running org.apache.solr.schema.OpenExchangeRatesOrgProviderTest
      [mvn] Tests run: 5, Failures: 0, Errors: 0, Skipped: 0, Time elapsed: 0.07 sec
      [mvn] Running org.apache.solr.SolrInfoMBeanTest
      [mvn] Creating dataDir: /usr/home/hudson/hudson-slave/workspace/Lucene-Solr-Maven-4.x/maven-build/solr/core/src/test/target/test/./solrtest-SolrInfoMBeanTest-1348310480795
      [mvn] Tests run: 1, Failures: 0, Errors: 0, Skipped: 0, Time elapsed: 0.535 sec
      [mvn] Running org.apache.solr.TestTrie
      [mvn] Creating dataDir: /usr/home/hudson/hudson-slave/workspace/Lucene-Solr-Maven-4.x/maven-build/solr/core/src/test/target/test/./solrtest-TestTrie-1348310481333
      [mvn] Tests run: 8, Failures: 0, Errors: 0, Skipped: 0, Time elapsed: 0.89 sec
      [mvn] Running org.apache.solr.schema.IndexSchemaRuntimeFieldTest
      [mvn] Creating dataDir: /usr/home/hudson/hudson-slave/workspace/Lucene-Solr-Maven-4.x/maven-build/solr/core/src/test/target/test/./solrtest-IndexSchemaRuntimeFieldTest-1348310482223
      [mvn] Tests run: 1, Failures: 0, Errors: 0, Skipped: 0, Time elapsed: 0.532 sec
      [mvn] Running org.apache.solr.spelling.SpellCheckCollatorTest
      [mvn] Creating dataDir: /usr/home/hudson/hudson-slave/workspace/Lucene-Solr-Maven-4.x/maven-build/solr/core/src/test/target/test/./solrtest-SpellCheckCollatorTest-1348310482755
      [mvn] Tests run: 7, Failures: 0, Errors: 0, Skipped: 0, Time elapsed: 1.253 sec
      [mvn] Running org.apache.solr.highlight.FastVectorHighlighterTest
      [mvn] Creating dataDir: /usr/home/hudson/hudson-slave/workspace/Lucene-Solr-Maven-4.x/maven-build/solr/core/src/test/target/test/./solrtest-FastVectorHighlighterTest-1348310484010
      [mvn] Tests run: 2, Failures: 0, Errors: 0, Skipped: 0, Time elapsed: 0.601 sec
      [mvn] Running org.apache.solr.core.TestJmxIntegration
      [mvn] Tests run: 3, Failures: 0, Errors: 0, Skipped: 1, Time elapsed: 0.744 sec
      [mvn] Running org.apache.solr.cloud.ZkSolrClientTest
      [mvn] Tests run: 4, Failures: 0, Errors: 0, Skipped: 0, Time elapsed: 7.469 sec
      [mvn] Running org.apache.solr.search.similarities.TestLMJelinekMercerSimilarityFactory
      [mvn] Creating dataDir: /usr/home/hudson/hudson-slave/workspace/Lucene-Solr-Maven-4.x/maven-build/solr/core/src/test/target/test/./solrtest-TestLMJelinekMercerSimilarityFactory-1348310492827
      [mvn] Tests run: 2, Failures: 0, Errors: 0, Skipped: 0, Time elapsed: 0.108 sec
      [mvn] Running org.apache.solr.analysis.TestCollationKeyRangeQueries
      [mvn] Creating dataDir: /usr/home/hudson/hudson-slave/workspace/Lucene-Solr-Maven-4.x/maven-build/solr/core/src/test/target/test/./solrtest-TestCollationKeyRangeQueries-1348310492937
      [mvn] Tests run: 3, Failures: 0, Errors: 0, Skipped: 0, Time elapsed: 0.156 sec
      [mvn] Running org.apache.solr.handler.MoreLikeThisHandlerTest
      [mvn] Creating dataDir: /usr/home/hudson/hudson-slave/workspace/Lucene-Solr-Maven-4.x/maven-build/solr/core/src/test/target/test/./solrtest-MoreLikeThisHandlerTest-1348310493094
      [mvn] Tests run: 1, Failures: 0, Errors: 0, Skipped: 0, Time elapsed: 0.664 sec
      [mvn] Running org.apache.solr.core.TestSolrDeletionPolicy2
      [mvn] Creating dataDir: /usr/home/hudson/hudson-slave/workspace/Lucene-Solr-Maven-4.x/maven-build/solr/core/src/test/target/test/./solrtest-TestSolrDeletionPolicy2-1348310493759
      [mvn] Tests run: 1, Failures: 0, Errors: 0, Skipped: 0, Time elapsed: 0.388 sec
      [mvn] Running org.apache.solr.search.ReturnFieldsTest
      [mvn] Creating dataDir: /usr/home/hudson/hudson-slave/workspace/Lucene-Solr-Maven-4.x/maven-build/solr/core/src/test/target/test/./solrtest-ReturnFieldsTest-1348310494145
      [mvn] Tests run: 10, Failures: 0, Errors: 0, Skipped: 0, Time elapsed: 0.488 sec
      [mvn] Running org.apache.solr.schema.MultiTermTest
      [mvn] Creating dataDir: /usr/home/hudson/hudson-slave/workspace/Lucene-Solr-Maven-4.x/maven-build/solr/core/src/test/target/test/./solrtest-MultiTermTest-1348310494639
      [mvn] Tests run: 3, Failures: 0, Errors: 0, Skipped: 0, Time elapsed: 0.165 sec
      [mvn] Running org.apache.solr.handler.BinaryUpdateRequestHandlerTest
      [mvn] Creating dataDir: /usr/home/hudson/hudson-slave/workspace/Lucene-Solr-Maven-4.x/maven-build/solr/core/src/test/target/test/./solrtest-BinaryUpdateRequestHandlerTest-1348310494798
      [mvn] null
      [mvn] Tests run: 1, Failures: 0, Errors: 0, Skipped: 0, Time elapsed: 0.373 sec
      [mvn] Running org.apache.solr.cloud.TestHashPartitioner
      [mvn] Tests run: 1, Failures: 0, Errors: 0, Skipped: 0, Time elapsed: 17.073 sec
      [mvn] Running org.apache.solr.schema.PrimitiveFieldTypeTest
      [mvn] Tests run: 1, Failures: 0, Errors: 0, Skipped: 0, Time elapsed: 0.459 sec
      [mvn] Running org.apache.solr.cloud.LeaderElectionTest
      [mvn] Creating dataDir: /usr/home/hudson/hudson-slave/workspace/Lucene-Solr-Maven-4.x/maven-build/solr/core/src/test/target/test/./solrtest-LeaderElectionTest-1348310512705
      [mvn] 8121 T3758 oasc.LeaderElectionTest$ClientThread.run SEVERE setup failed org.apache.zookeeper.KeeperException$SessionExpiredException: KeeperErrorCode = Session expired for /collections/collection1/leader_elect/shard1/election
      [mvn] 	at org.apache.zookeeper.KeeperException.create(KeeperException.java:118)
      [mvn] 	at org.apache.zookeeper.KeeperException.create(KeeperException.java:42)
      [mvn] 	at org.apache.zookeeper.ZooKeeper.exists(ZooKeeper.java:815)
      [mvn] 	at org.apache.solr.common.cloud.SolrZkClient$4.execute(SolrZkClient.java:222)
      [mvn] 	at org.apache.solr.common.cloud.SolrZkClient$4.execute(SolrZkClient.java:219)
      [mvn] 	at org.apache.solr.common.cloud.ZkCmdExecutor.retryOperation(ZkCmdExecutor.java:67)
      [mvn] 	at org.apache.solr.common.cloud.SolrZkClient.exists(SolrZkClient.java:219)
      [mvn] 	at org.apache.solr.common.cloud.ZkCmdExecutor.ensureExists(ZkCmdExecutor.java:94)
      [mvn] 	at org.apache.solr.common.cloud.ZkCmdExecutor.ensureExists(ZkCmdExecutor.java:88)
      [mvn] 	at org.apache.solr.cloud.LeaderElector.setup(LeaderElector.java:290)
      [mvn] 	at org.apache.solr.cloud.LeaderElectionTest$ClientThread.setupOnConnect(LeaderElectionTest.java:116)
      [mvn] 	at org.apache.solr.cloud.LeaderElectionTest$ClientThread.run(LeaderElectionTest.java:125)
      [mvn] 	at java.util.concurrent.Executors$RunnableAdapter.call(Executors.java:471)
      [mvn] 	at java.util.concurrent.FutureTask$Sync.innerRun(FutureTask.java:334)
      [mvn] 	at java.util.concurrent.FutureTask.run(FutureTask.java:166)
      [mvn] 	at java.util.concurrent.ScheduledThreadPoolExecutor$ScheduledFutureTask.access$101(ScheduledThreadPoolExecutor.java:165)
      [mvn] 	at java.util.concurrent.ScheduledThreadPoolExecutor$ScheduledFutureTask.run(ScheduledThreadPoolExecutor.java:266)
      [mvn] 	at java.util.concurrent.ThreadPoolExecutor.runWorker(ThreadPoolExecutor.java:1110)
      [mvn] 	at java.util.concurrent.ThreadPoolExecutor$Worker.run(ThreadPoolExecutor.java:603)
      [mvn] 	at java.lang.Thread.run(Thread.java:679)
      [mvn] 
      [mvn] 8356 T3758 oasc.LeaderElectionTest$ClientThread.run SEVERE setup failed org.apache.zookeeper.KeeperException$SessionExpiredException: KeeperErrorCode = Session expired for /collections/collection1/leader_elect/shard1/election
      [mvn] 	at org.apache.zookeeper.KeeperException.create(KeeperException.java:118)
      [mvn] 	at org.apache.zookeeper.KeeperException.create(KeeperException.java:42)
      [mvn] 	at org.apache.zookeeper.ZooKeeper.exists(ZooKeeper.java:815)
      [mvn] 	at org.apache.solr.common.cloud.SolrZkClient$4.execute(SolrZkClient.java:222)
      [mvn] 	at org.apache.solr.common.cloud.SolrZkClient$4.execute(SolrZkClient.java:219)
      [mvn] 	at org.apache.solr.common.cloud.ZkCmdExecutor.retryOperation(ZkCmdExecutor.java:67)
      [mvn] 	at org.apache.solr.common.cloud.SolrZkClient.exists(SolrZkClient.java:219)
      [mvn] 	at org.apache.solr.common.cloud.ZkCmdExecutor.ensureExists(ZkCmdExecutor.java:94)
      [mvn] 	at org.apache.solr.common.cloud.ZkCmdExecutor.ensureExists(ZkCmdExecutor.java:88)
      [mvn] 	at org.apache.solr.cloud.LeaderElector.setup(LeaderElector.java:290)
      [mvn] 	at org.apache.solr.cloud.LeaderElectionTest$ClientThread.setupOnConnect(LeaderElectionTest.java:116)
      [mvn] 	at org.apache.solr.cloud.LeaderElectionTest$ClientThread.run(LeaderElectionTest.java:125)
      [mvn] 	at java.util.concurrent.Executors$RunnableAdapter.call(Executors.java:471)
      [mvn] 	at java.util.concurrent.FutureTask$Sync.innerRun(FutureTask.java:334)
      [mvn] 	at java.util.concurrent.FutureTask.run(FutureTask.java:166)
      [mvn] 	at java.util.concurrent.ScheduledThreadPoolExecutor$ScheduledFutureTask.access$101(ScheduledThreadPoolExecutor.java:165)
      [mvn] 	at java.util.concurrent.ScheduledThreadPoolExecutor$ScheduledFutureTask.run(ScheduledThreadPoolExecutor.java:266)
      [mvn] 	at java.util.concurrent.ThreadPoolExecutor.runWorker(ThreadPoolExecutor.java:1110)
      [mvn] 	at java.util.concurrent.ThreadPoolExecutor$Worker.run(ThreadPoolExecutor.java:603)
      [mvn] 	at java.lang.Thread.run(Thread.java:679)
      [mvn] 
      [mvn] Tests run: 4, Failures: 0, Errors: 0, Skipped: 0, Time elapsed: 13.21 sec
      [mvn] Running org.apache.solr.highlight.HighlighterConfigTest
      [mvn] Tests run: 1, Failures: 0, Errors: 0, Skipped: 0, Time elapsed: 0.434 sec
      [mvn] Running org.apache.solr.internal.csv.writer.CSVWriterTest
      [mvn] Tests run: 2, Failures: 0, Errors: 0, Skipped: 0, Time elapsed: 0.001 sec
      [mvn] Running org.apache.solr.schema.PreAnalyzedFieldTest
      [mvn] Tests run: 3, Failures: 0, Errors: 0, Skipped: 0, Time elapsed: 0.053 sec
      [mvn] 
      [mvn] Results :
      [mvn] 
      [mvn] Failed tests:   testDistribSearch(org.apache.solr.cloud.BasicDistributedZk2Test): Shard still reported as live in zk
      [mvn] 
      [mvn] Tests run: 956, Failures: 1, Errors: 0, Skipped: 9
      [mvn] 
      [mvn] [INFO] ------------------------------------------------------------------------
      [mvn] [INFO] Building Apache Solr Core aggregator POM
      [mvn] [INFO]    task-segment: [install]
      [mvn] [INFO] ------------------------------------------------------------------------
      [mvn] [INFO] [groovy:execute {execution: generate-timestamps}]
      [mvn] [INFO] [buildnumber:create {execution: default}]
      [mvn] [INFO] [enforcer:enforce {execution: enforce-java-compat-version-and-maven-2.2.1}]
      [mvn] [INFO] [remote-resources:process {execution: default}]
      [mvn] [INFO] [bundle:manifest {execution: bundle-manifest}]
      [mvn] [WARNING] Ignoring project type pom - supportedProjectTypes = [jar, bundle]
      [mvn] [INFO] [site:attach-descriptor {execution: default-attach-descriptor}]
      [mvn] [INFO] [install:install {execution: default-install}]
      [mvn] [INFO] Installing /usr/home/hudson/hudson-slave/workspace/Lucene-Solr-Maven-4.x/maven-build/solr/core/pom.xml to /home/hudson/.m2/repository/org/apache/solr/solr-core-aggregator/4.0-SNAPSHOT/solr-core-aggregator-4.0-SNAPSHOT.pom
      [mvn] [INFO] ------------------------------------------------------------------------
      [mvn] [INFO] Building Apache Solr Solrj tests
      [mvn] [INFO]    task-segment: [install]
      [mvn] [INFO] ------------------------------------------------------------------------
      [mvn] [INFO] [groovy:execute {execution: generate-timestamps}]
      [mvn] [INFO] [buildnumber:create {execution: default}]
      [mvn] [INFO] [enforcer:enforce {execution: enforce-java-compat-version-and-maven-2.2.1}]
      [mvn] [INFO] [remote-resources:process {execution: default}]
      [mvn] [debug] execute contextualize
      [mvn] [INFO] [resources:resources {execution: default-resources}]
      [mvn] [INFO] Using 'UTF-8' encoding to copy filtered resources.
      [mvn] [INFO] skip non existing resourceDirectory /usr/home/hudson/hudson-slave/workspace/Lucene-Solr-Maven-4.x/maven-build/solr/solrj/src/test/src/main/resources
      [mvn] [INFO] Copying 3 resources
      [mvn] [INFO] [compiler:compile {execution: default-compile}]
      [mvn] [INFO] No sources to compile
      [mvn] [INFO] [bundle:manifest {execution: bundle-manifest}]
      [mvn] [debug] execute contextualize
      [mvn] [INFO] [resources:testResources {execution: default-testResources}]
      [mvn] [INFO] Using 'UTF-8' encoding to copy filtered resources.
      [mvn] [INFO] Copying 17 resources
      [mvn] [INFO] Copying 1 resource
      [mvn] [INFO] Copying 3 resources
      [mvn] [INFO] [compiler:testCompile {execution: default-testCompile}]
      [mvn] [INFO] Compiling 50 source files to /usr/home/hudson/hudson-slave/workspace/Lucene-Solr-Maven-4.x/maven-build/solr/solrj/src/test/target/test-classes
      [mvn] [INFO] [surefire:test {execution: default-test}]
      [mvn] [INFO] Surefire report directory: /usr/home/hudson/hudson-slave/workspace/Lucene-Solr-Maven-4.x/maven-build/solr/solrj/src/test/target/surefire-reports
      [mvn] 
      [mvn] -------------------------------------------------------
      [mvn]  T E S T S
      [mvn] -------------------------------------------------------
      [mvn] Running org.apache.solr.client.solrj.embedded.LargeVolumeJettyTest
      [mvn] Creating dataDir: /usr/home/hudson/hudson-slave/workspace/Lucene-Solr-Maven-4.x/maven-build/solr/solrj/src/test/target/test/./solrtest-LargeVolumeJettyTest-1348310531309
      [mvn] Tests run: 1, Failures: 0, Errors: 0, Skipped: 0, Time elapsed: 3.564 sec
      [mvn] Running org.apache.solr.common.SolrDocumentTest
      [mvn] Tests run: 5, Failures: 0, Errors: 0, Skipped: 0, Time elapsed: 0.058 sec
      [mvn] Running org.apache.solr.client.solrj.embedded.MergeIndexesEmbeddedTest
      [mvn] !!!! WARNING: best effort to remove /usr/home/hudson/hudson-slave/workspace/Lucene-Solr-Maven-4.x/maven-build/solr/solrj/src/test/target/test/./org.apache.solr.client.solrj.embedded.MergeIndexesEmbeddedTest-1348310534533 FAILED !!!!!
      [mvn] !!!! WARNING: best effort to remove /usr/home/hudson/hudson-slave/workspace/Lucene-Solr-Maven-4.x/maven-build/solr/solrj/src/test/target/test/./org.apache.solr.client.solrj.embedded.MergeIndexesEmbeddedTest-1348310535141 FAILED !!!!!
      [mvn] Tests run: 2, Failures: 0, Errors: 0, Skipped: 0, Time elapsed: 1.286 sec
      [mvn] Running org.apache.solr.common.util.ContentStreamTest
      [mvn] Tests run: 3, Failures: 0, Errors: 0, Skipped: 0, Time elapsed: 0.071 sec
      [mvn] Running org.apache.solr.client.solrj.response.FacetFieldTest
      [mvn] Tests run: 1, Failures: 0, Errors: 0, Skipped: 0, Time elapsed: 0.026 sec
      [mvn] Running org.apache.solr.common.params.SolrParamTest
      [mvn] Tests run: 1, Failures: 0, Errors: 0, Skipped: 0, Time elapsed: 0.032 sec
      [mvn] Running org.apache.solr.client.solrj.response.FieldAnalysisResponseTest
      [mvn] Tests run: 1, Failures: 0, Errors: 0, Skipped: 0, Time elapsed: 0.029 sec
      [mvn] Running org.apache.solr.client.solrj.embedded.MultiCoreExampleJettyTest
      [mvn] Tests run: 2, Failures: 0, Errors: 0, Skipped: 0, Time elapsed: 2.064 sec
      [mvn] Running org.apache.solr.common.util.NamedListTest
      [mvn] Tests run: 1, Failures: 0, Errors: 0, Skipped: 0, Time elapsed: 0.029 sec
      [mvn] Running org.apache.solr.client.solrj.response.DocumentAnalysisResponseTest
      [mvn] Tests run: 1, Failures: 0, Errors: 0, Skipped: 0, Time elapsed: 0.03 sec
      [mvn] Running org.apache.solr.common.util.TestJavaBinCodec
      [mvn] Tests run: 1, Failures: 0, Errors: 0, Skipped: 0, Time elapsed: 0.325 sec
      [mvn] Running org.apache.solr.client.solrj.embedded.SolrExampleEmbeddedTest
      [mvn] Creating dataDir: /usr/home/hudson/hudson-slave/workspace/Lucene-Solr-Maven-4.x/maven-build/solr/solrj/src/test/target/test/./solrtest-SolrExampleEmbeddedTest-1348310538429
      [mvn] Tests run: 23, Failures: 0, Errors: 0, Skipped: 0, Time elapsed: 4.757 sec
      [mvn] Running org.apache.solr.client.solrj.request.TestUpdateRequestCodec
      [mvn] Tests run: 2, Failures: 0, Errors: 0, Skipped: 0, Time elapsed: 0.024 sec
      [mvn] Running org.apache.solr.common.params.ModifiableSolrParamsTest
      [mvn] Tests run: 5, Failures: 0, Errors: 0, Skipped: 0, Time elapsed: 0.035 sec
      [mvn] Running org.apache.solr.client.solrj.embedded.TestEmbeddedSolrServer
      [mvn] Tests run: 2, Failures: 0, Errors: 0, Skipped: 0, Time elapsed: 0.674 sec
      [mvn] Running org.apache.solr.common.util.TestXMLEscaping
      [mvn] Tests run: 7, Failures: 0, Errors: 0, Skipped: 0, Time elapsed: 0.032 sec
      [mvn] Running org.apache.solr.client.solrj.SolrQueryTest
      [mvn] Tests run: 9, Failures: 0, Errors: 0, Skipped: 0, Time elapsed: 0.038 sec
      [mvn] Running org.apache.solr.client.solrj.impl.HttpClientUtilTest
      [mvn] Tests run: 3, Failures: 0, Errors: 0, Skipped: 0, Time elapsed: 0.049 sec
      [mvn] Running org.apache.solr.client.solrj.response.AnlysisResponseBaseTest
      [mvn] Tests run: 2, Failures: 0, Errors: 0, Skipped: 0, Time elapsed: 0.019 sec
      [mvn] Running org.apache.solr.client.solrj.embedded.TestSolrProperties
      [mvn] Tests run: 1, Failures: 0, Errors: 0, Skipped: 0, Time elapsed: 0.997 sec
      [mvn] Running org.apache.solr.client.solrj.embedded.MultiCoreEmbeddedTest
      [mvn] Tests run: 1, Failures: 0, Errors: 0, Skipped: 0, Time elapsed: 0.391 sec
      [mvn] Running org.apache.solr.client.solrj.embedded.SolrExampleStreamingBinaryTest
      [mvn] Creating dataDir: /usr/home/hudson/hudson-slave/workspace/Lucene-Solr-Maven-4.x/maven-build/solr/solrj/src/test/target/test/./solrtest-SolrExampleStreamingBinaryTest-1348310545441
      [mvn] ASYNC  NEW_CORE C0 name=collection1 org.apache.solr.core.SolrCore@6c4fb026
      [mvn] 8523 T144 C0 oasc.SolrException.log SEVERE org.apache.solr.common.SolrException: Document contains multiple values for uniqueKey field: id=[DOCID, DOCID2]
      [mvn] 		at org.apache.solr.update.AddUpdateCommand.getIndexedId(AddUpdateCommand.java:91)
      [mvn] 		at org.apache.solr.update.processor.DistributedUpdateProcessor.versionAdd(DistributedUpdateProcessor.java:445)
      [mvn] 		at org.apache.solr.update.processor.DistributedUpdateProcessor.processAdd(DistributedUpdateProcessor.java:324)
      [mvn] 		at org.apache.solr.handler.loader.JavabinLoader$1.update(JavabinLoader.java:86)
      [mvn] 		at org.apache.solr.client.solrj.request.JavaBinUpdateRequestCodec$1.readOuterMostDocIterator(JavaBinUpdateRequestCodec.java:140)
      [mvn] 		at org.apache.solr.client.solrj.request.JavaBinUpdateRequestCodec$1.readIterator(JavaBinUpdateRequestCodec.java:120)
      [mvn] 		at org.apache.solr.common.util.JavaBinCodec.readVal(JavaBinCodec.java:221)
      [mvn] 		at org.apache.solr.client.solrj.request.JavaBinUpdateRequestCodec$1.readNamedList(JavaBinUpdateRequestCodec.java:105)
      [mvn] 		at org.apache.solr.common.util.JavaBinCodec.readVal(JavaBinCodec.java:186)
      [mvn] 		at org.apache.solr.common.util.JavaBinCodec.unmarshal(JavaBinCodec.java:112)
      [mvn] 		at org.apache.solr.client.solrj.request.JavaBinUpdateRequestCodec.unmarshal(JavaBinUpdateRequestCodec.java:147)
      [mvn] 		at org.apache.solr.handler.loader.JavabinLoader.parseAndLoadDocs(JavabinLoader.java:96)
      [mvn] 		at org.apache.solr.handler.loader.JavabinLoader.load(JavabinLoader.java:55)
      [mvn] 		at org.apache.solr.handler.UpdateRequestHandler$1.load(UpdateRequestHandler.java:92)
      [mvn] 		at org.apache.solr.handler.ContentStreamHandlerBase.handleRequestBody(ContentStreamHandlerBase.java:74)
      [mvn] 		at org.apache.solr.handler.RequestHandlerBase.handleRequest(RequestHandlerBase.java:129)
      [mvn] 		at org.apache.solr.core.SolrCore.execute(SolrCore.java:1701)
      [mvn] 		at org.apache.solr.servlet.SolrDispatchFilter.execute(SolrDispatchFilter.java:455)
      [mvn] 		at org.apache.solr.servlet.SolrDispatchFilter.doFilter(SolrDispatchFilter.java:276)
      [mvn] 		at org.eclipse.jetty.servlet.ServletHandler$CachedChain.doFilter(ServletHandler.java:1337)
      [mvn] 		at org.eclipse.jetty.servlet.ServletHandler.doHandle(ServletHandler.java:484)
      [mvn] 		at org.eclipse.jetty.server.session.SessionHandler.doHandle(SessionHandler.java:231)
      [mvn] 		at org.eclipse.jetty.server.handler.ScopedHandler.handle(ScopedHandler.java:119)
      [mvn] 		at org.eclipse.jetty.server.handler.GzipHandler.handle(GzipHandler.java:267)
      [mvn] 		at org.eclipse.jetty.server.handler.ContextHandler.doHandle(ContextHandler.java:1067)
      [mvn] 		at org.eclipse.jetty.servlet.ServletHandler.doScope(ServletHandler.java:413)
      [mvn] 		at org.eclipse.jetty.server.session.SessionHandler.doScope(SessionHandler.java:192)
      [mvn] 		at org.eclipse.jetty.server.handler.ContextHandler.doScope(ContextHandler.java:999)
      [mvn] 		at org.eclipse.jetty.server.handler.ScopedHandler.handle(ScopedHandler.java:117)
      [mvn] 		at org.eclipse.jetty.server.handler.HandlerWrapper.handle(HandlerWrapper.java:111)
      [mvn] 		at org.eclipse.jetty.server.Server.handle(Server.java:351)
      [mvn] 		at org.eclipse.jetty.server.AbstractHttpConnection.handleRequest(AbstractHttpConnection.java:454)
      [mvn] 		at org.eclipse.jetty.server.BlockingHttpConnection.handleRequest(BlockingHttpConnection.java:47)
      [mvn] 		at org.eclipse.jetty.server.AbstractHttpConnection.content(AbstractHttpConnection.java:900)
      [mvn] 		at org.eclipse.jetty.server.AbstractHttpConnection$RequestHandler.content(AbstractHttpConnection.java:954)
      [mvn] 		at org.eclipse.jetty.http.HttpParser.parseNext(HttpParser.java:952)
      [mvn] 		at org.eclipse.jetty.http.HttpParser.parseAvailable(HttpParser.java:235)
      [mvn] 		at org.eclipse.jetty.server.BlockingHttpConnection.handle(BlockingHttpConnection.java:66)
      [mvn] 		at org.eclipse.jetty.server.bio.SocketConnector$ConnectorEndPoint.run(SocketConnector.java:254)
      [mvn] 		at org.eclipse.jetty.util.thread.QueuedThreadPool.runJob(QueuedThreadPool.java:599)
      [mvn] 		at org.eclipse.jetty.util.thread.QueuedThreadPool$3.run(QueuedThreadPool.java:534)
      [mvn] 		at java.lang.Thread.run(Thread.java:679)
      [mvn] 	
      [mvn] Tests run: 23, Failures: 0, Errors: 0, Skipped: 0, Time elapsed: 12.068 sec
      [mvn] Running org.apache.solr.client.solrj.impl.BasicHttpSolrServerTest
      [mvn] Creating dataDir: /usr/home/hudson/hudson-slave/workspace/Lucene-Solr-Maven-4.x/maven-build/solr/solrj/src/test/target/test/./solrtest-BasicHttpSolrServerTest-1348310557505
      [mvn] Tests run: 9, Failures: 0, Errors: 0, Skipped: 0, Time elapsed: 77.967 sec
      [mvn] Running org.apache.solr.client.solrj.SolrExampleBinaryTest
      [mvn] Creating dataDir: /usr/home/hudson/hudson-slave/workspace/Lucene-Solr-Maven-4.x/maven-build/solr/solrj/src/test/target/test/./solrtest-SolrExampleBinaryTest-1348310635478
      [mvn] ASYNC  NEW_CORE C1 name=collection1 org.apache.solr.core.SolrCore@41a13003
      [mvn] 1169 T177 C1 oasc.SolrException.log SEVERE org.apache.solr.common.SolrException: Document contains multiple values for uniqueKey field: id=[DOCID, DOCID2]
      [mvn] 		at org.apache.solr.update.AddUpdateCommand.getIndexedId(AddUpdateCommand.java:91)
      [mvn] 		at org.apache.solr.update.processor.DistributedUpdateProcessor.versionAdd(DistributedUpdateProcessor.java:445)
      [mvn] 		at org.apache.solr.update.processor.DistributedUpdateProcessor.processAdd(DistributedUpdateProcessor.java:324)
      [mvn] 		at org.apache.solr.handler.loader.JavabinLoader$1.update(JavabinLoader.java:86)
      [mvn] 		at org.apache.solr.client.solrj.request.JavaBinUpdateRequestCodec$1.readOuterMostDocIterator(JavaBinUpdateRequestCodec.java:140)
      [mvn] 		at org.apache.solr.client.solrj.request.JavaBinUpdateRequestCodec$1.readIterator(JavaBinUpdateRequestCodec.java:120)
      [mvn] 		at org.apache.solr.common.util.JavaBinCodec.readVal(JavaBinCodec.java:221)
      [mvn] 		at org.apache.solr.client.solrj.request.JavaBinUpdateRequestCodec$1.readNamedList(JavaBinUpdateRequestCodec.java:105)
      [mvn] 		at org.apache.solr.common.util.JavaBinCodec.readVal(JavaBinCodec.java:186)
      [mvn] 		at org.apache.solr.common.util.JavaBinCodec.unmarshal(JavaBinCodec.java:112)
      [mvn] 		at org.apache.solr.client.solrj.request.JavaBinUpdateRequestCodec.unmarshal(JavaBinUpdateRequestCodec.java:147)
      [mvn] 		at org.apache.solr.handler.loader.JavabinLoader.parseAndLoadDocs(JavabinLoader.java:96)
      [mvn] 		at org.apache.solr.handler.loader.JavabinLoader.load(JavabinLoader.java:55)
      [mvn] 		at org.apache.solr.handler.UpdateRequestHandler$1.load(UpdateRequestHandler.java:92)
      [mvn] 		at org.apache.solr.handler.ContentStreamHandlerBase.handleRequestBody(ContentStreamHandlerBase.java:74)
      [mvn] 		at org.apache.solr.handler.RequestHandlerBase.handleRequest(RequestHandlerBase.java:129)
      [mvn] 		at org.apache.solr.core.SolrCore.execute(SolrCore.java:1701)
      [mvn] 		at org.apache.solr.servlet.SolrDispatchFilter.execute(SolrDispatchFilter.java:455)
      [mvn] 		at org.apache.solr.servlet.SolrDispatchFilter.doFilter(SolrDispatchFilter.java:276)
      [mvn] 		at org.eclipse.jetty.servlet.ServletHandler$CachedChain.doFilter(ServletHandler.java:1337)
      [mvn] 		at org.eclipse.jetty.servlet.ServletHandler.doHandle(ServletHandler.java:484)
      [mvn] 		at org.eclipse.jetty.server.session.SessionHandler.doHandle(SessionHandler.java:231)
      [mvn] 		at org.eclipse.jetty.server.handler.ScopedHandler.handle(ScopedHandler.java:119)
      [mvn] 		at org.eclipse.jetty.server.handler.GzipHandler.handle(GzipHandler.java:267)
      [mvn] 		at org.eclipse.jetty.server.handler.ContextHandler.doHandle(ContextHandler.java:1067)
      [mvn] 		at org.eclipse.jetty.servlet.ServletHandler.doScope(ServletHandler.java:413)
      [mvn] 		at org.eclipse.jetty.server.session.SessionHandler.doScope(SessionHandler.java:192)
      [mvn] 		at org.eclipse.jetty.server.handler.ContextHandler.doScope(ContextHandler.java:999)
      [mvn] 		at org.eclipse.jetty.server.handler.ScopedHandler.handle(ScopedHandler.java:117)
      [mvn] 		at org.eclipse.jetty.server.handler.HandlerWrapper.handle(HandlerWrapper.java:111)
      [mvn] 		at org.eclipse.jetty.server.Server.handle(Server.java:351)
      [mvn] 		at org.eclipse.jetty.server.AbstractHttpConnection.handleRequest(AbstractHttpConnection.java:454)
      [mvn] 		at org.eclipse.jetty.server.BlockingHttpConnection.handleRequest(BlockingHttpConnection.java:47)
      [mvn] 		at org.eclipse.jetty.server.AbstractHttpConnection.content(AbstractHttpConnection.java:900)
      [mvn] 		at org.eclipse.jetty.server.AbstractHttpConnection$RequestHandler.content(AbstractHttpConnection.java:954)
      [mvn] 		at org.eclipse.jetty.http.HttpParser.parseNext(HttpParser.java:952)
      [mvn] 		at org.eclipse.jetty.http.HttpParser.parseAvailable(HttpParser.java:235)
      [mvn] 		at org.eclipse.jetty.server.BlockingHttpConnection.handle(BlockingHttpConnection.java:66)
      [mvn] 		at org.eclipse.jetty.server.bio.SocketConnector$ConnectorEndPoint.run(SocketConnector.java:254)
      [mvn] 		at org.eclipse.jetty.util.thread.QueuedThreadPool.runJob(QueuedThreadPool.java:599)
      [mvn] 		at org.eclipse.jetty.util.thread.QueuedThreadPool$3.run(QueuedThreadPool.java:534)
      [mvn] 		at java.lang.Thread.run(Thread.java:679)
      [mvn] 	
      [mvn] Tests run: 23, Failures: 0, Errors: 0, Skipped: 0, Time elapsed: 4.874 sec
      [mvn] Running org.apache.solr.client.solrj.embedded.LargeVolumeBinaryJettyTest
      [mvn] Creating dataDir: /usr/home/hudson/hudson-slave/workspace/Lucene-Solr-Maven-4.x/maven-build/solr/solrj/src/test/target/test/./solrtest-LargeVolumeBinaryJettyTest-1348310640347
      [mvn] Tests run: 1, Failures: 0, Errors: 0, Skipped: 0, Time elapsed: 1.062 sec
      [mvn] Running org.apache.solr.client.solrj.response.TestSpellCheckResponse
      [mvn] Creating dataDir: /usr/home/hudson/hudson-slave/workspace/Lucene-Solr-Maven-4.x/maven-build/solr/solrj/src/test/target/test/./solrtest-TestSpellCheckResponse-1348310641405
      [mvn] Tests run: 3, Failures: 0, Errors: 0, Skipped: 0, Time elapsed: 0.695 sec
      [mvn] Running org.apache.solr.client.solrj.response.TermsResponseTest
      [mvn] Creating dataDir: /usr/home/hudson/hudson-slave/workspace/Lucene-Solr-Maven-4.x/maven-build/solr/solrj/src/test/target/test/./solrtest-TermsResponseTest-1348310642101
      [mvn] Tests run: 1, Failures: 0, Errors: 0, Skipped: 0, Time elapsed: 0.53 sec
      [mvn] Running org.apache.solr.client.solrj.embedded.JettyWebappTest
      [mvn] Tests run: 1, Failures: 0, Errors: 0, Skipped: 0, Time elapsed: 0.777 sec
      [mvn] Running org.apache.solr.client.solrj.TestLBHttpSolrServer
      [mvn] Tests run: 3, Failures: 0, Errors: 0, Skipped: 0, Time elapsed: 37.171 sec
      [mvn] Running org.apache.solr.common.util.TestFastInputStream
      [mvn] Tests run: 1, Failures: 0, Errors: 0, Skipped: 0, Time elapsed: 0.014 sec
      [mvn] Running org.apache.solr.client.solrj.SolrExampleXMLTest
      [mvn] Creating dataDir: /usr/home/hudson/hudson-slave/workspace/Lucene-Solr-Maven-4.x/maven-build/solr/solrj/src/test/target/test/./solrtest-SolrExampleXMLTest-1348310680607
      [mvn] ASYNC  NEW_CORE C2 name=collection1 org.apache.solr.core.SolrCore@6e2577eb
      [mvn] 4896 T359 C2 oasc.SolrException.log SEVERE org.apache.solr.common.SolrException: Document contains multiple values for uniqueKey field: id=[DOCID, DOCID2]
      [mvn] 		at org.apache.solr.update.AddUpdateCommand.getIndexedId(AddUpdateCommand.java:91)
      [mvn] 		at org.apache.solr.update.processor.DistributedUpdateProcessor.versionAdd(DistributedUpdateProcessor.java:445)
      [mvn] 		at org.apache.solr.update.processor.DistributedUpdateProcessor.processAdd(DistributedUpdateProcessor.java:324)
      [mvn] 		at org.apache.solr.handler.loader.XMLLoader.processUpdate(XMLLoader.java:230)
      [mvn] 		at org.apache.solr.handler.loader.XMLLoader.load(XMLLoader.java:157)
      [mvn] 		at org.apache.solr.handler.UpdateRequestHandler$1.load(UpdateRequestHandler.java:92)
      [mvn] 		at org.apache.solr.handler.ContentStreamHandlerBase.handleRequestBody(ContentStreamHandlerBase.java:74)
      [mvn] 		at org.apache.solr.handler.RequestHandlerBase.handleRequest(RequestHandlerBase.java:129)
      [mvn] 		at org.apache.solr.core.SolrCore.execute(SolrCore.java:1701)
      [mvn] 		at org.apache.solr.servlet.SolrDispatchFilter.execute(SolrDispatchFilter.java:455)
      [mvn] 		at org.apache.solr.servlet.SolrDispatchFilter.doFilter(SolrDispatchFilter.java:276)
      [mvn] 		at org.eclipse.jetty.servlet.ServletHandler$CachedChain.doFilter(ServletHandler.java:1337)
      [mvn] 		at org.eclipse.jetty.servlet.ServletHandler.doHandle(ServletHandler.java:484)
      [mvn] 		at org.eclipse.jetty.server.session.SessionHandler.doHandle(SessionHandler.java:231)
      [mvn] 		at org.eclipse.jetty.server.handler.ScopedHandler.handle(ScopedHandler.java:119)
      [mvn] 		at org.eclipse.jetty.server.handler.GzipHandler.handle(GzipHandler.java:267)
      [mvn] 		at org.eclipse.jetty.server.handler.ContextHandler.doHandle(ContextHandler.java:1067)
      [mvn] 		at org.eclipse.jetty.servlet.ServletHandler.doScope(ServletHandler.java:413)
      [mvn] 		at org.eclipse.jetty.server.session.SessionHandler.doScope(SessionHandler.java:192)
      [mvn] 		at org.eclipse.jetty.server.handler.ContextHandler.doScope(ContextHandler.java:999)
      [mvn] 		at org.eclipse.jetty.server.handler.ScopedHandler.handle(ScopedHandler.java:117)
      [mvn] 		at org.eclipse.jetty.server.handler.HandlerWrapper.handle(HandlerWrapper.java:111)
      [mvn] 		at org.eclipse.jetty.server.Server.handle(Server.java:351)
      [mvn] 		at org.eclipse.jetty.server.AbstractHttpConnection.handleRequest(AbstractHttpConnection.java:454)
      [mvn] 		at org.eclipse.jetty.server.BlockingHttpConnection.handleRequest(BlockingHttpConnection.java:47)
      [mvn] 		at org.eclipse.jetty.server.AbstractHttpConnection.content(AbstractHttpConnection.java:900)
      [mvn] 		at org.eclipse.jetty.server.AbstractHttpConnection$RequestHandler.content(AbstractHttpConnection.java:954)
      [mvn] 		at org.eclipse.jetty.http.HttpParser.parseNext(HttpParser.java:952)
      [mvn] 		at org.eclipse.jetty.http.HttpParser.parseAvailable(HttpParser.java:235)
      [mvn] 		at org.eclipse.jetty.server.BlockingHttpConnection.handle(BlockingHttpConnection.java:66)
      [mvn] 		at org.eclipse.jetty.server.bio.SocketConnector$ConnectorEndPoint.run(SocketConnector.java:254)
      [mvn] 		at org.eclipse.jetty.util.thread.QueuedThreadPool.runJob(QueuedThreadPool.java:599)
      [mvn] 		at org.eclipse.jetty.util.thread.QueuedThreadPool$3.run(QueuedThreadPool.java:534)
      [mvn] 		at java.lang.Thread.run(Thread.java:679)
      [mvn] 	
      [mvn] Tests run: 23, Failures: 0, Errors: 0, Skipped: 0, Time elapsed: 4.979 sec
      [mvn] Running org.apache.solr.client.solrj.TestBatchUpdate
      [mvn] Creating dataDir: /usr/home/hudson/hudson-slave/workspace/Lucene-Solr-Maven-4.x/maven-build/solr/solrj/src/test/target/test/./solrtest-TestBatchUpdate-1348310685582
      [mvn] Tests run: 3, Failures: 0, Errors: 0, Skipped: 0, Time elapsed: 1.873 sec
      [mvn] Running org.apache.solr.client.solrj.embedded.SolrExampleStreamingTest
      [mvn] Creating dataDir: /usr/home/hudson/hudson-slave/workspace/Lucene-Solr-Maven-4.x/maven-build/solr/solrj/src/test/target/test/./solrtest-SolrExampleStreamingTest-1348310687462
      [mvn] ASYNC  NEW_CORE C3 name=collection1 org.apache.solr.core.SolrCore@293b863e
      [mvn] 1911 T389 C3 oasc.SolrException.log SEVERE org.apache.solr.common.SolrException: Document contains multiple values for uniqueKey field: id=[DOCID, DOCID2]
      [mvn] 		at org.apache.solr.update.AddUpdateCommand.getIndexedId(AddUpdateCommand.java:91)
      [mvn] 		at org.apache.solr.update.processor.DistributedUpdateProcessor.versionAdd(DistributedUpdateProcessor.java:445)
      [mvn] 		at org.apache.solr.update.processor.DistributedUpdateProcessor.processAdd(DistributedUpdateProcessor.java:324)
      [mvn] 		at org.apache.solr.handler.loader.XMLLoader.processUpdate(XMLLoader.java:230)
      [mvn] 		at org.apache.solr.handler.loader.XMLLoader.load(XMLLoader.java:157)
      [mvn] 		at org.apache.solr.handler.UpdateRequestHandler$1.load(UpdateRequestHandler.java:92)
      [mvn] 		at org.apache.solr.handler.ContentStreamHandlerBase.handleRequestBody(ContentStreamHandlerBase.java:74)
      [mvn] 		at org.apache.solr.handler.RequestHandlerBase.handleRequest(RequestHandlerBase.java:129)
      [mvn] 		at org.apache.solr.core.SolrCore.execute(SolrCore.java:1701)
      [mvn] 		at org.apache.solr.servlet.SolrDispatchFilter.execute(SolrDispatchFilter.java:455)
      [mvn] 		at org.apache.solr.servlet.SolrDispatchFilter.doFilter(SolrDispatchFilter.java:276)
      [mvn] 		at org.eclipse.jetty.servlet.ServletHandler$CachedChain.doFilter(ServletHandler.java:1337)
      [mvn] 		at org.eclipse.jetty.servlet.ServletHandler.doHandle(ServletHandler.java:484)
      [mvn] 		at org.eclipse.jetty.server.session.SessionHandler.doHandle(SessionHandler.java:231)
      [mvn] 		at org.eclipse.jetty.server.handler.ScopedHandler.handle(ScopedHandler.java:119)
      [mvn] 		at org.eclipse.jetty.server.handler.GzipHandler.handle(GzipHandler.java:267)
      [mvn] 		at org.eclipse.jetty.server.handler.ContextHandler.doHandle(ContextHandler.java:1067)
      [mvn] 		at org.eclipse.jetty.servlet.ServletHandler.doScope(ServletHandler.java:413)
      [mvn] 		at org.eclipse.jetty.server.session.SessionHandler.doScope(SessionHandler.java:192)
      [mvn] 		at org.eclipse.jetty.server.handler.ContextHandler.doScope(ContextHandler.java:999)
      [mvn] 		at org.eclipse.jetty.server.handler.ScopedHandler.handle(ScopedHandler.java:117)
      [mvn] 		at org.eclipse.jetty.server.handler.HandlerWrapper.handle(HandlerWrapper.java:111)
      [mvn] 		at org.eclipse.jetty.server.Server.handle(Server.java:351)
      [mvn] 		at org.eclipse.jetty.server.AbstractHttpConnection.handleRequest(AbstractHttpConnection.java:454)
      [mvn] 		at org.eclipse.jetty.server.BlockingHttpConnection.handleRequest(BlockingHttpConnection.java:47)
      [mvn] 		at org.eclipse.jetty.server.AbstractHttpConnection.content(AbstractHttpConnection.java:900)
      [mvn] 		at org.eclipse.jetty.server.AbstractHttpConnection$RequestHandler.content(AbstractHttpConnection.java:954)
      [mvn] 		at org.eclipse.jetty.http.HttpParser.parseNext(HttpParser.java:952)
      [mvn] 		at org.eclipse.jetty.http.HttpParser.parseAvailable(HttpParser.java:235)
      [mvn] 		at org.eclipse.jetty.server.BlockingHttpConnection.handle(BlockingHttpConnection.java:66)
      [mvn] 		at org.eclipse.jetty.server.bio.SocketConnector$ConnectorEndPoint.run(SocketConnector.java:254)
      [mvn] 		at org.eclipse.jetty.util.thread.QueuedThreadPool.runJob(QueuedThreadPool.java:599)
      [mvn] 		at org.eclipse.jetty.util.thread.QueuedThreadPool$3.run(QueuedThreadPool.java:534)
      [mvn] 		at java.lang.Thread.run(Thread.java:679)
      [mvn] 	
      [mvn] Tests run: 23, Failures: 0, Errors: 0, Skipped: 0, Time elapsed: 11.795 sec
      [mvn] Running org.apache.solr.client.solrj.embedded.SolrExampleJettyTest
      [mvn] Creating dataDir: /usr/home/hudson/hudson-slave/workspace/Lucene-Solr-Maven-4.x/maven-build/solr/solrj/src/test/target/test/./solrtest-SolrExampleJettyTest-1348310699257
      [mvn] ASYNC  NEW_CORE C4 name=collection1 org.apache.solr.core.SolrCore@3c4a5039
      [mvn] 4645 T409 C4 oasc.SolrException.log SEVERE org.apache.solr.common.SolrException: Document contains multiple values for uniqueKey field: id=[DOCID, DOCID2]
      [mvn] 		at org.apache.solr.update.AddUpdateCommand.getIndexedId(AddUpdateCommand.java:91)
      [mvn] 		at org.apache.solr.update.processor.DistributedUpdateProcessor.versionAdd(DistributedUpdateProcessor.java:445)
      [mvn] 		at org.apache.solr.update.processor.DistributedUpdateProcessor.processAdd(DistributedUpdateProcessor.java:324)
      [mvn] 		at org.apache.solr.handler.loader.XMLLoader.processUpdate(XMLLoader.java:230)
      [mvn] 		at org.apache.solr.handler.loader.XMLLoader.load(XMLLoader.java:157)
      [mvn] 		at org.apache.solr.handler.UpdateRequestHandler$1.load(UpdateRequestHandler.java:92)
      [mvn] 		at org.apache.solr.handler.ContentStreamHandlerBase.handleRequestBody(ContentStreamHandlerBase.java:74)
      [mvn] 		at org.apache.solr.handler.RequestHandlerBase.handleRequest(RequestHandlerBase.java:129)
      [mvn] 		at org.apache.solr.core.SolrCore.execute(SolrCore.java:1701)
      [mvn] 		at org.apache.solr.servlet.SolrDispatchFilter.execute(SolrDispatchFilter.java:455)
      [mvn] 		at org.apache.solr.servlet.SolrDispatchFilter.doFilter(SolrDispatchFilter.java:276)
      [mvn] 		at org.eclipse.jetty.servlet.ServletHandler$CachedChain.doFilter(ServletHandler.java:1337)
      [mvn] 		at org.eclipse.jetty.servlet.ServletHandler.doHandle(ServletHandler.java:484)
      [mvn] 		at org.eclipse.jetty.server.session.SessionHandler.doHandle(SessionHandler.java:231)
      [mvn] 		at org.eclipse.jetty.server.handler.ScopedHandler.handle(ScopedHandler.java:119)
      [mvn] 		at org.eclipse.jetty.server.handler.GzipHandler.handle(GzipHandler.java:267)
      [mvn] 		at org.eclipse.jetty.server.handler.ContextHandler.doHandle(ContextHandler.java:1067)
      [mvn] 		at org.eclipse.jetty.servlet.ServletHandler.doScope(ServletHandler.java:413)
      [mvn] 		at org.eclipse.jetty.server.session.SessionHandler.doScope(SessionHandler.java:192)
      [mvn] 		at org.eclipse.jetty.server.handler.ContextHandler.doScope(ContextHandler.java:999)
      [mvn] 		at org.eclipse.jetty.server.handler.ScopedHandler.handle(ScopedHandler.java:117)
      [mvn] 		at org.eclipse.jetty.server.handler.HandlerWrapper.handle(HandlerWrapper.java:111)
      [mvn] 		at org.eclipse.jetty.server.Server.handle(Server.java:351)
      [mvn] 		at org.eclipse.jetty.server.AbstractHttpConnection.handleRequest(AbstractHttpConnection.java:454)
      [mvn] 		at org.eclipse.jetty.server.BlockingHttpConnection.handleRequest(BlockingHttpConnection.java:47)
      [mvn] 		at org.eclipse.jetty.server.AbstractHttpConnection.content(AbstractHttpConnection.java:900)
      [mvn] 		at org.eclipse.jetty.server.AbstractHttpConnection$RequestHandler.content(AbstractHttpConnection.java:954)
      [mvn] 		at org.eclipse.jetty.http.HttpParser.parseNext(HttpParser.java:952)
      [mvn] 		at org.eclipse.jetty.http.HttpParser.parseAvailable(HttpParser.java:235)
      [mvn] 		at org.eclipse.jetty.server.BlockingHttpConnection.handle(BlockingHttpConnection.java:66)
      [mvn] 		at org.eclipse.jetty.server.bio.SocketConnector$ConnectorEndPoint.run(SocketConnector.java:254)
      [mvn] 		at org.eclipse.jetty.util.thread.QueuedThreadPool.runJob(QueuedThreadPool.java:599)
      [mvn] 		at org.eclipse.jetty.util.thread.QueuedThreadPool$3.run(QueuedThreadPool.java:534)
      [mvn] 		at java.lang.Thread.run(Thread.java:679)
      [mvn] 	
      [mvn] Tests run: 24, Failures: 0, Errors: 0, Skipped: 0, Time elapsed: 4.828 sec
      [mvn] Running org.apache.solr.common.util.IteratorChainTest
      [mvn] Tests run: 7, Failures: 0, Errors: 0, Skipped: 0, Time elapsed: 0.033 sec
      [mvn] Running org.apache.solr.client.solrj.SolrExceptionTest
      [mvn] Tests run: 1, Failures: 0, Errors: 0, Skipped: 0, Time elapsed: 0.026 sec
      [mvn] Running org.apache.solr.client.solrj.util.ClientUtilsTest
      [mvn] Tests run: 1, Failures: 0, Errors: 0, Skipped: 0, Time elapsed: 0.014 sec
      [mvn] Running org.apache.solr.client.solrj.embedded.LargeVolumeEmbeddedTest
      [mvn] Creating dataDir: /usr/home/hudson/hudson-slave/workspace/Lucene-Solr-Maven-4.x/maven-build/solr/solrj/src/test/target/test/./solrtest-LargeVolumeEmbeddedTest-1348310704158
      [mvn] Tests run: 1, Failures: 0, Errors: 0, Skipped: 0, Time elapsed: 0.905 sec
      [mvn] Running org.apache.solr.common.util.TestHash
      [mvn] Tests run: 2, Failures: 0, Errors: 0, Skipped: 0, Time elapsed: 0.187 sec
      [mvn] Running org.apache.solr.common.util.TestNamedListCodec
      [mvn] Tests run: 4, Failures: 0, Errors: 0, Skipped: 0, Time elapsed: 0.338 sec
      [mvn] Running org.apache.solr.client.solrj.beans.TestDocumentObjectBinder
      [mvn] Tests run: 5, Failures: 0, Errors: 0, Skipped: 0, Time elapsed: 0.039 sec
      [mvn] Running org.apache.solr.client.solrj.response.QueryResponseTest
      [mvn] Tests run: 3, Failures: 0, Errors: 0, Skipped: 0, Time elapsed: 0.058 sec
      [mvn] Running org.apache.solr.client.solrj.impl.CloudSolrServerTest
      [mvn] Creating dataDir: /usr/home/hudson/hudson-slave/workspace/Lucene-Solr-Maven-4.x/maven-build/solr/solrj/src/test/target/test/./solrtest-CloudSolrServerTest-1348310705714
      [mvn] 46844 T503 oasc.SolrException.log SEVERE Sync Failed
      [mvn] ASYNC  NEW_CORE C5 name=collection1 org.apache.solr.core.SolrCore@5ecaeee0 url=http://127.0.0.1:20190/solr/collection1 node=127.0.0.1:20190_solr
      [mvn] 46856 T503 C5 P20190 oasu.DirectUpdateHandler2.closeWriter SEVERE Error in final commit java.io.FileNotFoundException: _0.fdx
      [mvn] 	at org.apache.lucene.store.FSDirectory.fileLength(FSDirectory.java:267)
      [mvn] 	at org.apache.lucene.index.SegmentInfo.sizeInBytes(SegmentInfo.java:114)
      [mvn] 	at org.apache.lucene.index.IndexWriter.prepareFlushedSegment(IndexWriter.java:2141)
      [mvn] 	at org.apache.lucene.index.DocumentsWriter.publishFlushedSegment(DocumentsWriter.java:495)
      [mvn] 	at org.apache.lucene.index.DocumentsWriter.finishFlush(DocumentsWriter.java:474)
      [mvn] 	at org.apache.lucene.index.DocumentsWriterFlushQueue$SegmentFlushTicket.publish(DocumentsWriterFlushQueue.java:201)
      [mvn] 	at org.apache.lucene.index.DocumentsWriterFlushQueue.innerPurge(DocumentsWriterFlushQueue.java:119)
      [mvn] 	at org.apache.lucene.index.DocumentsWriterFlushQueue.tryPurge(DocumentsWriterFlushQueue.java:148)
      [mvn] 	at org.apache.lucene.index.DocumentsWriter.doFlush(DocumentsWriter.java:435)
      [mvn] 	at org.apache.lucene.index.DocumentsWriter.flushAllThreads(DocumentsWriter.java:551)
      [mvn] 	at org.apache.lucene.index.IndexWriter.prepareCommit(IndexWriter.java:2671)
      [mvn] 	at org.apache.lucene.index.IndexWriter.commitInternal(IndexWriter.java:2807)
      [mvn] 	at org.apache.lucene.index.IndexWriter.commit(IndexWriter.java:2787)
      [mvn] 	at org.apache.solr.update.DirectUpdateHandler2.closeWriter(DirectUpdateHandler2.java:715)
      [mvn] 	at org.apache.solr.update.DefaultSolrCoreState.decref(DefaultSolrCoreState.java:153)
      [mvn] 	at org.apache.solr.update.DirectUpdateHandler2.close(DirectUpdateHandler2.java:662)
      [mvn] 	at org.apache.solr.core.SolrCore.close(SolrCore.java:901)
      [mvn] 	at org.apache.solr.cloud.ShardLeaderElectionContext.runLeaderProcess(ElectionContext.java:213)
      [mvn] 	at org.apache.solr.cloud.LeaderElector.runIamLeaderProcess(LeaderElector.java:158)
      [mvn] 	at org.apache.solr.cloud.LeaderElector.checkIfIamLeader(LeaderElector.java:102)
      [mvn] 	at org.apache.solr.cloud.LeaderElector.access$000(LeaderElector.java:56)
      [mvn] 	at org.apache.solr.cloud.LeaderElector$1.process(LeaderElector.java:131)
      [mvn] 	at org.apache.zookeeper.ClientCnxn$EventThread.processEvent(ClientCnxn.java:526)
      [mvn] 	at org.apache.zookeeper.ClientCnxn$EventThread.run(ClientCnxn.java:502)
      [mvn] 
      [mvn] 46911 T517 oasc.SolrException.log SEVERE Sync Failed
      [mvn] 47022 T545 oasc.SolrException.log SEVERE Sync Failed
      [mvn] Tests run: 1, Failures: 0, Errors: 0, Skipped: 0, Time elapsed: 47.488 sec
      [mvn] 
      [mvn] Results :
      [mvn] 
      [mvn] Tests run: 237, Failures: 0, Errors: 0, Skipped: 0
      [mvn] 
      [mvn] [INFO] [jar:jar {execution: default-jar}]
      [mvn] [INFO] Building jar: /usr/home/hudson/hudson-slave/workspace/Lucene-Solr-Maven-4.x/maven-build/solr/solrj/src/test/target/solr-solrj-tests-4.0-SNAPSHOT.jar
      [mvn] [INFO] [install:install {execution: default-install}]
      [mvn] [INFO] Skipping artifact installation
      [mvn] [INFO] ------------------------------------------------------------------------
      [mvn] [INFO] Building Apache Solr Solrj aggregator POM
      [mvn] [INFO]    task-segment: [install]
      [mvn] [INFO] ------------------------------------------------------------------------
      [mvn] [INFO] [groovy:execute {execution: generate-timestamps}]
      [mvn] [INFO] [buildnumber:create {execution: default}]
      [mvn] [INFO] [enforcer:enforce {execution: enforce-java-compat-version-and-maven-2.2.1}]
      [mvn] [INFO] [remote-resources:process {execution: default}]
      [mvn] [INFO] [bundle:manifest {execution: bundle-manifest}]
      [mvn] [WARNING] Ignoring project type pom - supportedProjectTypes = [jar, bundle]
      [mvn] [INFO] [site:attach-descriptor {execution: default-attach-descriptor}]
      [mvn] [INFO] [install:install {execution: default-install}]
      [mvn] [INFO] Installing /usr/home/hudson/hudson-slave/workspace/Lucene-Solr-Maven-4.x/maven-build/solr/solrj/pom.xml to /home/hudson/.m2/repository/org/apache/solr/solr-solrj-aggregator/4.0-SNAPSHOT/solr-solrj-aggregator-4.0-SNAPSHOT.pom
      [mvn] [INFO] ------------------------------------------------------------------------
      [mvn] [INFO] Building Apache Solr Search Server
      [mvn] [INFO]    task-segment: [install]
      [mvn] [INFO] ------------------------------------------------------------------------
      [mvn] [INFO] [groovy:execute {execution: generate-timestamps}]
      [mvn] [INFO] [buildnumber:create {execution: default}]
      [mvn] [INFO] [enforcer:enforce {execution: enforce-java-compat-version-and-maven-2.2.1}]
      [mvn] [INFO] [remote-resources:process {execution: default}]
      [mvn] [debug] execute contextualize
      [mvn] [INFO] [resources:resources {execution: default-resources}]
      [mvn] [INFO] Using 'UTF-8' encoding to copy filtered resources.
      [mvn] [INFO] skip non existing resourceDirectory /usr/home/hudson/hudson-slave/workspace/Lucene-Solr-Maven-4.x/maven-build/solr/webapp/src/main/resources
      [mvn] [INFO] Copying 3 resources
      [mvn] [INFO] [compiler:compile {execution: default-compile}]
      [mvn] [INFO] No sources to compile
      [mvn] [INFO] [bundle:manifest {execution: bundle-manifest}]
      [mvn] [WARNING] Ignoring project type war - supportedProjectTypes = [jar, bundle]
      [mvn] [debug] execute contextualize
      [mvn] [INFO] [resources:testResources {execution: default-testResources}]
      [mvn] [INFO] Using 'UTF-8' encoding to copy filtered resources.
      [mvn] [INFO] skip non existing resourceDirectory /usr/home/hudson/hudson-slave/workspace/Lucene-Solr-Maven-4.x/maven-build/solr/webapp/src/test/resources
      [mvn] [INFO] Copying 3 resources
      [mvn] [INFO] [compiler:testCompile {execution: default-testCompile}]
      [mvn] [INFO] No sources to compile
      [mvn] [INFO] [surefire:test {execution: default-test}]
      [mvn] [INFO] Surefire report directory: /usr/home/hudson/hudson-slave/workspace/Lucene-Solr-Maven-4.x/maven-build/solr/webapp/null/surefire-reports
      [mvn] 
      [mvn] -------------------------------------------------------
      [mvn]  T E S T S
      [mvn] -------------------------------------------------------
      [mvn] 
      [mvn] Results :
      [mvn] 
      [mvn] Tests run: 0, Failures: 0, Errors: 0, Skipped: 0
      [mvn] 
      [mvn] [INFO] [war:war {execution: default-war}]
      [mvn] [INFO] Packaging webapp
      [mvn] [INFO] Assembling webapp [solr] in [/usr/home/hudson/hudson-slave/workspace/Lucene-Solr-Maven-4.x/maven-build/solr/webapp/null/solr-4.0-SNAPSHOT]
      [mvn] [INFO] Processing war project
      [mvn] [INFO] Copying webapp resources [/usr/home/hudson/hudson-slave/workspace/Lucene-Solr-Maven-4.x/solr/webapp/web]
      [mvn] [INFO] Webapp assembled in [720 msecs]
      [mvn] [INFO] Building war: /usr/home/hudson/hudson-slave/workspace/Lucene-Solr-Maven-4.x/maven-build/solr/webapp/null/solr-4.0-SNAPSHOT.war
      [mvn] [INFO] WEB-INF/web.xml already added, skipping
      [mvn] [INFO] [install:install {execution: default-install}]
      [mvn] [INFO] Installing /usr/home/hudson/hudson-slave/workspace/Lucene-Solr-Maven-4.x/maven-build/solr/webapp/null/solr-4.0-SNAPSHOT.war to /home/hudson/.m2/repository/org/apache/solr/solr/4.0-SNAPSHOT/solr-4.0-SNAPSHOT.war
      [mvn] [INFO] ------------------------------------------------------------------------
      [mvn] [INFO] Building Apache Solr Analysis Extras
      [mvn] [INFO]    task-segment: [install]
      [mvn] [INFO] ------------------------------------------------------------------------
      [mvn] [INFO] [groovy:execute {execution: generate-timestamps}]
      [mvn] [INFO] [buildnumber:create {execution: default}]
      [mvn] [INFO] [enforcer:enforce {execution: enforce-java-compat-version-and-maven-2.2.1}]
      [mvn] [INFO] [remote-resources:process {execution: default}]
      [mvn] [debug] execute contextualize
      [mvn] [INFO] [resources:resources {execution: default-resources}]
      [mvn] [INFO] Using 'UTF-8' encoding to copy filtered resources.
      [mvn] [INFO] skip non existing resourceDirectory /usr/home/hudson/hudson-slave/workspace/Lucene-Solr-Maven-4.x/maven-build/solr/contrib/analysis-extras/src/main/resources
      [mvn] [INFO] Copying 3 resources
      [mvn] [INFO] [compiler:compile {execution: default-compile}]
      [mvn] [INFO] Compiling 1 source file to /usr/home/hudson/hudson-slave/workspace/Lucene-Solr-Maven-4.x/maven-build/solr/contrib/analysis-extras/target/classes
      [mvn] [INFO] [bundle:manifest {execution: bundle-manifest}]
      [mvn] [debug] execute contextualize
      [mvn] [INFO] [resources:testResources {execution: default-testResources}]
      [mvn] [INFO] Using 'UTF-8' encoding to copy filtered resources.
      [mvn] [INFO] Copying 5 resources
      [mvn] [INFO] Copying 1 resource
      [mvn] [INFO] Copying 3 resources
      [mvn] [INFO] [compiler:testCompile {execution: default-testCompile}]
      [mvn] [INFO] Compiling 4 source files to /usr/home/hudson/hudson-slave/workspace/Lucene-Solr-Maven-4.x/maven-build/solr/contrib/analysis-extras/target/test-classes
      [mvn] [INFO] [surefire:test {execution: default-test}]
      [mvn] [INFO] Surefire report directory: /usr/home/hudson/hudson-slave/workspace/Lucene-Solr-Maven-4.x/maven-build/solr/contrib/analysis-extras/target/surefire-reports
      [mvn] 
      [mvn] -------------------------------------------------------
      [mvn]  T E S T S
      [mvn] -------------------------------------------------------
      [mvn] Running org.apache.solr.analysis.TestICUCollationKeyRangeQueries
      [mvn] Creating dataDir: /usr/home/hudson/hudson-slave/workspace/Lucene-Solr-Maven-4.x/maven-build/solr/contrib/analysis-extras/target/test/./solrtest-TestICUCollationKeyRangeQueries-1348310764558
      [mvn] Tests run: 3, Failures: 0, Errors: 0, Skipped: 0, Time elapsed: 2.25 sec
      [mvn] Running org.apache.solr.schema.TestICUCollationField
      [mvn] Creating dataDir: /usr/home/hudson/hudson-slave/workspace/Lucene-Solr-Maven-4.x/maven-build/solr/contrib/analysis-extras/target/test/./solrtest-TestICUCollationField-1348310766802
      [mvn] Tests run: 7, Failures: 0, Errors: 0, Skipped: 0, Time elapsed: 1.096 sec
      [mvn] Running org.apache.solr.schema.TestICUCollationFieldOptions
      [mvn] Creating dataDir: /usr/home/hudson/hudson-slave/workspace/Lucene-Solr-Maven-4.x/maven-build/solr/contrib/analysis-extras/target/test/./solrtest-TestICUCollationFieldOptions-1348310767380
      [mvn] Tests run: 5, Failures: 0, Errors: 0, Skipped: 0, Time elapsed: 0.258 sec
      [mvn] Running org.apache.solr.analysis.TestFoldingMultitermExtrasQuery
      [mvn] Creating dataDir: /usr/home/hudson/hudson-slave/workspace/Lucene-Solr-Maven-4.x/maven-build/solr/contrib/analysis-extras/target/test/./solrtest-TestFoldingMultitermExtrasQuery-1348310767654
      [mvn] Tests run: 3, Failures: 0, Errors: 0, Skipped: 0, Time elapsed: 0.509 sec
      [mvn] 
      [mvn] Results :
      [mvn] 
      [mvn] Tests run: 18, Failures: 0, Errors: 0, Skipped: 0
      [mvn] 
      [mvn] [INFO] [jar:jar {execution: default-jar}]
      [mvn] [INFO] Building jar: /usr/home/hudson/hudson-slave/workspace/Lucene-Solr-Maven-4.x/maven-build/solr/contrib/analysis-extras/target/solr-analysis-extras-4.0-SNAPSHOT.jar
      [mvn] [INFO] [install:install {execution: default-install}]
      [mvn] [INFO] Installing /usr/home/hudson/hudson-slave/workspace/Lucene-Solr-Maven-4.x/maven-build/solr/contrib/analysis-extras/target/solr-analysis-extras-4.0-SNAPSHOT.jar to /home/hudson/.m2/repository/org/apache/solr/solr-analysis-extras/4.0-SNAPSHOT/solr-analysis-extras-4.0-SNAPSHOT.jar
      [mvn] [INFO] ------------------------------------------------------------------------
      [mvn] [INFO] Building Apache Solr Clustering
      [mvn] [INFO]    task-segment: [install]
      [mvn] [INFO] ------------------------------------------------------------------------
      [mvn] Downloading: http://repo1.maven.org/maven2/org/apache/lucene/lucene-memory/3.1.0/lucene-memory-3.1.0.pom
      [mvn] 2K downloaded  (lucene-memory-3.1.0.pom)
      [mvn] Downloading: http://repo1.maven.org/maven2/org/apache/lucene/lucene-parent/3.1.0/lucene-parent-3.1.0.pom
      [mvn] 1K downloaded  (lucene-parent-3.1.0.pom)
      [mvn] Downloading: http://repo1.maven.org/maven2/org/apache/lucene/lucene-solr-grandparent/3.1.0/lucene-solr-grandparent-3.1.0.pom
      [mvn] 31K downloaded  (lucene-solr-grandparent-3.1.0.pom)
      [mvn] [INFO] [groovy:execute {execution: generate-timestamps}]
      [mvn] [INFO] [buildnumber:create {execution: default}]
      [mvn] [INFO] [enforcer:enforce {execution: enforce-java-compat-version-and-maven-2.2.1}]
      [mvn] [INFO] [remote-resources:process {execution: default}]
      [mvn] [debug] execute contextualize
      [mvn] [INFO] [resources:resources {execution: default-resources}]
      [mvn] [INFO] Using 'UTF-8' encoding to copy filtered resources.
      [mvn] [INFO] skip non existing resourceDirectory /usr/home/hudson/hudson-slave/workspace/Lucene-Solr-Maven-4.x/maven-build/solr/contrib/clustering/src/main/resources
      [mvn] [INFO] Copying 3 resources
      [mvn] [INFO] [compiler:compile {execution: default-compile}]
      [mvn] [INFO] Compiling 10 source files to /usr/home/hudson/hudson-slave/workspace/Lucene-Solr-Maven-4.x/maven-build/solr/contrib/clustering/target/classes
      [mvn] [INFO] [bundle:manifest {execution: bundle-manifest}]
      [mvn] [debug] execute contextualize
      [mvn] [INFO] [resources:testResources {execution: default-testResources}]
      [mvn] [INFO] Using 'UTF-8' encoding to copy filtered resources.
      [mvn] [INFO] Copying 11 resources
      [mvn] [INFO] Copying 1 resource
      [mvn] [INFO] Copying 3 resources
      [mvn] [INFO] [compiler:testCompile {execution: default-testCompile}]
      [mvn] [INFO] Compiling 12 source files to /usr/home/hudson/hudson-slave/workspace/Lucene-Solr-Maven-4.x/maven-build/solr/contrib/clustering/target/test-classes
      [mvn] [INFO] [surefire:test {execution: default-test}]
      [mvn] [INFO] Surefire report directory: /usr/home/hudson/hudson-slave/workspace/Lucene-Solr-Maven-4.x/maven-build/solr/contrib/clustering/target/surefire-reports
      [mvn] 
      [mvn] -------------------------------------------------------
      [mvn]  T E S T S
      [mvn] -------------------------------------------------------
      [mvn] Running org.apache.solr.handler.clustering.ClusteringComponentTest
      [mvn] Creating dataDir: /usr/home/hudson/hudson-slave/workspace/Lucene-Solr-Maven-4.x/maven-build/solr/contrib/clustering/target/test/./solrtest-ClusteringComponentTest-1348310773781
      [mvn] Tests run: 1, Failures: 0, Errors: 0, Skipped: 0, Time elapsed: 3.198 sec
      [mvn] Running org.apache.solr.handler.clustering.carrot2.CarrotClusteringEngineTest
      [mvn] Creating dataDir: /usr/home/hudson/hudson-slave/workspace/Lucene-Solr-Maven-4.x/maven-build/solr/contrib/clustering/target/test/./solrtest-CarrotClusteringEngineTest-1348310776505
      [mvn] Tests run: 23, Failures: 0, Errors: 0, Skipped: 0, Time elapsed: 1.729 sec
      [mvn] Running org.apache.solr.handler.clustering.DistributedClusteringComponentTest
      [mvn] Tests run: 1, Failures: 0, Errors: 0, Skipped: 0, Time elapsed: 6.381 sec
      [mvn] 
      [mvn] Results :
      [mvn] 
      [mvn] Tests run: 25, Failures: 0, Errors: 0, Skipped: 0
      [mvn] 
      [mvn] [INFO] [jar:jar {execution: default-jar}]
      [mvn] [INFO] Building jar: /usr/home/hudson/hudson-slave/workspace/Lucene-Solr-Maven-4.x/maven-build/solr/contrib/clustering/target/solr-clustering-4.0-SNAPSHOT.jar
      [mvn] [INFO] [install:install {execution: default-install}]
      [mvn] [INFO] Installing /usr/home/hudson/hudson-slave/workspace/Lucene-Solr-Maven-4.x/maven-build/solr/contrib/clustering/target/solr-clustering-4.0-SNAPSHOT.jar to /home/hudson/.m2/repository/org/apache/solr/solr-clustering/4.0-SNAPSHOT/solr-clustering-4.0-SNAPSHOT.jar
      [mvn] [INFO] ------------------------------------------------------------------------
      [mvn] [INFO] Building Apache Solr DataImportHandler
      [mvn] [INFO]    task-segment: [install]
      [mvn] [INFO] ------------------------------------------------------------------------
      [mvn] [INFO] [groovy:execute {execution: generate-timestamps}]
      [mvn] [INFO] [buildnumber:create {execution: default}]
      [mvn] [INFO] [enforcer:enforce {execution: enforce-java-compat-version-and-maven-2.2.1}]
      [mvn] [INFO] [remote-resources:process {execution: default}]
      [mvn] [debug] execute contextualize
      [mvn] [INFO] [resources:resources {execution: default-resources}]
      [mvn] [INFO] Using 'UTF-8' encoding to copy filtered resources.
      [mvn] [INFO] skip non existing resourceDirectory /usr/home/hudson/hudson-slave/workspace/Lucene-Solr-Maven-4.x/maven-build/solr/contrib/dataimporthandler/src/main/resources
      [mvn] [INFO] Copying 3 resources
      [mvn] [INFO] [compiler:compile {execution: default-compile}]
      [mvn] [INFO] Compiling 67 source files to /usr/home/hudson/hudson-slave/workspace/Lucene-Solr-Maven-4.x/maven-build/solr/contrib/dataimporthandler/target/classes
      [mvn] [INFO] [bundle:manifest {execution: bundle-manifest}]
      [mvn] [debug] execute contextualize
      [mvn] [INFO] [resources:testResources {execution: default-testResources}]
      [mvn] [INFO] Using 'UTF-8' encoding to copy filtered resources.
      [mvn] [INFO] Copying 14 resources
      [mvn] [INFO] Copying 1 resource
      [mvn] [INFO] Copying 3 resources
      [mvn] [INFO] [compiler:testCompile {execution: default-testCompile}]
      [mvn] [INFO] Compiling 43 source files to /usr/home/hudson/hudson-slave/workspace/Lucene-Solr-Maven-4.x/maven-build/solr/contrib/dataimporthandler/target/test-classes
      [mvn] [INFO] [surefire:test {execution: default-test}]
      [mvn] [INFO] Surefire report directory: /usr/home/hudson/hudson-slave/workspace/Lucene-Solr-Maven-4.x/maven-build/solr/contrib/dataimporthandler/target/surefire-reports
      [mvn] 
      [mvn] -------------------------------------------------------
      [mvn]  T E S T S
      [mvn] -------------------------------------------------------
      [mvn] Running org.apache.solr.handler.dataimport.TestDIHEndToEnd
      [mvn] Creating dataDir: /usr/home/hudson/hudson-slave/workspace/Lucene-Solr-Maven-4.x/maven-build/solr/contrib/dataimporthandler/target/test/./solrtest-TestDIHEndToEnd-1348310794705
      [mvn] Tests run: 1, Failures: 0, Errors: 0, Skipped: 0, Time elapsed: 1.992 sec
      [mvn] Running org.apache.solr.handler.dataimport.TestEvaluatorBag
      [mvn] Tests run: 5, Failures: 0, Errors: 0, Skipped: 1, Time elapsed: 0.079 sec
      [mvn] Running org.apache.solr.handler.dataimport.TestSolrEntityProcessorUnit
      [mvn] Tests run: 3, Failures: 0, Errors: 0, Skipped: 0, Time elapsed: 0.063 sec
      [mvn] Running org.apache.solr.handler.dataimport.TestXPathEntityProcessor
      [mvn] Tests run: 8, Failures: 0, Errors: 0, Skipped: 0, Time elapsed: 0.544 sec
      [mvn] Running org.apache.solr.handler.dataimport.TestNumberFormatTransformer
      [mvn] Tests run: 9, Failures: 0, Errors: 0, Skipped: 0, Time elapsed: 0.068 sec
      [mvn] Running org.apache.solr.handler.dataimport.TestURLDataSource
      [mvn] Tests run: 1, Failures: 0, Errors: 0, Skipped: 0, Time elapsed: 0.036 sec
      [mvn] Running org.apache.solr.handler.dataimport.TestCachedSqlEntityProcessor
      [mvn] Tests run: 5, Failures: 0, Errors: 0, Skipped: 0, Time elapsed: 0.095 sec
      [mvn] Running org.apache.solr.handler.dataimport.TestDateFormatTransformer
      [mvn] Tests run: 2, Failures: 0, Errors: 0, Skipped: 0, Time elapsed: 0.027 sec
      [mvn] Running org.apache.solr.handler.dataimport.TestSqlEntityProcessorDelta3
      [mvn] Tests run: 1, Failures: 0, Errors: 0, Skipped: 1, Time elapsed: 0 sec
      [mvn] Running org.apache.solr.handler.dataimport.TestScriptTransformer
      [mvn] Tests run: 4, Failures: 0, Errors: 0, Skipped: 0, Time elapsed: 0.234 sec
      [mvn] Running org.apache.solr.handler.dataimport.TestEntityProcessorBase
      [mvn] Tests run: 1, Failures: 0, Errors: 0, Skipped: 0, Time elapsed: 0.045 sec
      [mvn] Running org.apache.solr.handler.dataimport.TestXPathRecordReader
      [mvn] Tests run: 22, Failures: 0, Errors: 0, Skipped: 0, Time elapsed: 0.217 sec
      [mvn] Running org.apache.solr.handler.dataimport.TestRegexTransformer
      [mvn] Tests run: 5, Failures: 0, Errors: 0, Skipped: 0, Time elapsed: 0.062 sec
      [mvn] Running org.apache.solr.handler.dataimport.TestDataConfig
      [mvn] Creating dataDir: /usr/home/hudson/hudson-slave/workspace/Lucene-Solr-Maven-4.x/maven-build/solr/contrib/dataimporthandler/target/test/./solrtest-TestDataConfig-1348310797554
      [mvn] Tests run: 2, Failures: 0, Errors: 0, Skipped: 0, Time elapsed: 0.434 sec
      [mvn] Running org.apache.solr.handler.dataimport.TestLineEntityProcessor
      [mvn] Tests run: 4, Failures: 0, Errors: 0, Skipped: 0, Time elapsed: 0.054 sec
      [mvn] Running org.apache.solr.handler.dataimport.TestFileListEntityProcessor
      [mvn] Tests run: 4, Failures: 0, Errors: 0, Skipped: 1, Time elapsed: 0.044 sec
      [mvn] Running org.apache.solr.handler.dataimport.TestFileListWithLineEntityProcessor
      [mvn] Creating dataDir: /usr/home/hudson/hudson-slave/workspace/Lucene-Solr-Maven-4.x/maven-build/solr/contrib/dataimporthandler/target/test/./solrtest-TestFileListWithLineEntityProcessor-1348310798098
      [mvn] Tests run: 1, Failures: 0, Errors: 0, Skipped: 0, Time elapsed: 0.312 sec
      [mvn] Running org.apache.solr.handler.dataimport.TestSqlEntityProcessor
      [mvn] Tests run: 1, Failures: 0, Errors: 0, Skipped: 1, Time elapsed: 0 sec
      [mvn] Running org.apache.solr.handler.dataimport.TestSqlEntityProcessorDelta2
      [mvn] Tests run: 1, Failures: 0, Errors: 0, Skipped: 1, Time elapsed: 0 sec
      [mvn] Running org.apache.solr.handler.dataimport.TestTemplateString
      [mvn] Tests run: 1, Failures: 0, Errors: 0, Skipped: 0, Time elapsed: 0.022 sec
      [mvn] Running org.apache.solr.handler.dataimport.TestTemplateTransformer
      [mvn] Tests run: 1, Failures: 0, Errors: 0, Skipped: 0, Time elapsed: 0.023 sec
      [mvn] Running org.apache.solr.handler.dataimport.TestDocBuilder2
      [mvn] Creating dataDir: /usr/home/hudson/hudson-slave/workspace/Lucene-Solr-Maven-4.x/maven-build/solr/contrib/dataimporthandler/target/test/./solrtest-TestDocBuilder2-1348310798453
      [mvn] Tests run: 11, Failures: 0, Errors: 0, Skipped: 1, Time elapsed: 0.678 sec
      [mvn] Running org.apache.solr.handler.dataimport.TestJdbcDataSource
      [mvn] Tests run: 4, Failures: 0, Errors: 0, Skipped: 1, Time elapsed: 0.099 sec
      [mvn] Running org.apache.solr.handler.dataimport.TestPlainTextEntityProcessor
      [mvn] Tests run: 1, Failures: 0, Errors: 0, Skipped: 0, Time elapsed: 0.036 sec
      [mvn] Running org.apache.solr.handler.dataimport.TestEphemeralCache
      [mvn] Creating dataDir: /usr/home/hudson/hudson-slave/workspace/Lucene-Solr-Maven-4.x/maven-build/solr/contrib/dataimporthandler/target/test/./solrtest-TestEphemeralCache-1348310799263
      [mvn] Tests run: 1, Failures: 0, Errors: 0, Skipped: 0, Time elapsed: 0.266 sec
      [mvn] Running org.apache.solr.handler.dataimport.TestErrorHandling
      [mvn] Creating dataDir: /usr/home/hudson/hudson-slave/workspace/Lucene-Solr-Maven-4.x/maven-build/solr/contrib/dataimporthandler/target/test/./solrtest-TestErrorHandling-1348310799532
      [mvn] 104 T3 oashd.JdbcDataSource.finalize SEVERE JdbcDataSource was not closed prior to finalize(), indicates a bug -- POSSIBLE RESOURCE LEAK!!!
      [mvn] 105 T3 oashd.JdbcDataSource.finalize SEVERE JdbcDataSource was not closed prior to finalize(), indicates a bug -- POSSIBLE RESOURCE LEAK!!!
      [mvn] 105 T3 oashd.JdbcDataSource.finalize SEVERE JdbcDataSource was not closed prior to finalize(), indicates a bug -- POSSIBLE RESOURCE LEAK!!!
      [mvn] Tests run: 4, Failures: 0, Errors: 0, Skipped: 0, Time elapsed: 0.6 sec
      [mvn] Running org.apache.solr.handler.dataimport.TestSqlEntityProcessor2
      [mvn] Tests run: 1, Failures: 0, Errors: 0, Skipped: 1, Time elapsed: 0 sec
      [mvn] Running org.apache.solr.handler.dataimport.TestSortedMapBackedCache
      [mvn] Tests run: 4, Failures: 0, Errors: 0, Skipped: 0, Time elapsed: 0.015 sec
      [mvn] Running org.apache.solr.handler.dataimport.TestVariableResolver
      [mvn] Tests run: 9, Failures: 0, Errors: 0, Skipped: 0, Time elapsed: 0.057 sec
      [mvn] Running org.apache.solr.handler.dataimport.TestSqlEntityProcessorDeltaPrefixedPk
      [mvn] Tests run: 1, Failures: 0, Errors: 0, Skipped: 1, Time elapsed: 0 sec
      [mvn] Running org.apache.solr.handler.dataimport.TestSqlEntityProcessorDelta
      [mvn] Tests run: 1, Failures: 0, Errors: 0, Skipped: 1, Time elapsed: 0 sec
      [mvn] Running org.apache.solr.handler.dataimport.TestClobTransformer
      [mvn] Tests run: 1, Failures: 0, Errors: 0, Skipped: 0, Time elapsed: 0.026 sec
      [mvn] Running org.apache.solr.handler.dataimport.TestContentStreamDataSource
      [mvn] Tests run: 2, Failures: 0, Errors: 0, Skipped: 0, Time elapsed: 2.24 sec
      [mvn] Running org.apache.solr.handler.dataimport.TestFieldReader
      [mvn] Tests run: 1, Failures: 0, Errors: 0, Skipped: 0, Time elapsed: 0.028 sec
      [mvn] Running org.apache.solr.handler.dataimport.TestContextImpl
      [mvn] Tests run: 4, Failures: 0, Errors: 0, Skipped: 0, Time elapsed: 0.034 sec
      [mvn] Running org.apache.solr.handler.dataimport.TestSolrEntityProcessorEndToEnd
      [mvn] Creating dataDir: /usr/home/hudson/hudson-slave/workspace/Lucene-Solr-Maven-4.x/maven-build/solr/contrib/dataimporthandler/target/test/./solrtest-TestSolrEntityProcessorEndToEnd-1348310802547
      [mvn] ASYNC  NEW_CORE C0 name=collection1 org.apache.solr.core.SolrCore@79fc7299
      [mvn] 556 T99 C0 oashd.DocBuilder.finish SEVERE Could not write property file org.apache.solr.handler.dataimport.DataImportHandlerException: Unable to persist Index Start Time Processing Document # 2
      [mvn] 	at org.apache.solr.handler.dataimport.SimplePropertiesWriter.persist(SimplePropertiesWriter.java:89)
      [mvn] 	at org.apache.solr.handler.dataimport.DocBuilder.finish(DocBuilder.java:310)
      [mvn] 	at org.apache.solr.handler.dataimport.DocBuilder.execute(DocBuilder.java:256)
      [mvn] 	at org.apache.solr.handler.dataimport.DataImporter.doFullImport(DataImporter.java:382)
      [mvn] 	at org.apache.solr.handler.dataimport.DataImporter.runCmd(DataImporter.java:448)
      [mvn] 	at org.apache.solr.handler.dataimport.DataImportHandler.handleRequestBody(DataImportHandler.java:177)
      [mvn] 	at org.apache.solr.handler.RequestHandlerBase.handleRequest(RequestHandlerBase.java:129)
      [mvn] 	at org.apache.solr.core.SolrCore.execute(SolrCore.java:1701)
      [mvn] 	at org.apache.solr.util.TestHarness.query(TestHarness.java:364)
      [mvn] 	at org.apache.solr.handler.dataimport.AbstractDataImportHandlerTestCase.runFullImport(AbstractDataImportHandlerTestCase.java:128)
      [mvn] 	at org.apache.solr.handler.dataimport.TestSolrEntityProcessorEndToEnd.testFullImportFqParam(TestSolrEntityProcessorEndToEnd.java:166)
      [mvn] 	at sun.reflect.NativeMethodAccessorImpl.invoke0(Native Method)
      [mvn] 	at sun.reflect.NativeMethodAccessorImpl.invoke(NativeMethodAccessorImpl.java:57)
      [mvn] 	at sun.reflect.DelegatingMethodAccessorImpl.invoke(DelegatingMethodAccessorImpl.java:43)
      [mvn] 	at java.lang.reflect.Method.invoke(Method.java:616)
      [mvn] 	at com.carrotsearch.randomizedtesting.RandomizedRunner.invoke(RandomizedRunner.java:1559)
      [mvn] 	at com.carrotsearch.randomizedtesting.RandomizedRunner.access$600(RandomizedRunner.java:79)
      [mvn] 	at com.carrotsearch.randomizedtesting.RandomizedRunner$6.evaluate(RandomizedRunner.java:737)
      [mvn] 	at com.carrotsearch.randomizedtesting.RandomizedRunner$7.evaluate(RandomizedRunner.java:773)
      [mvn] 	at com.carrotsearch.randomizedtesting.RandomizedRunner$8.evaluate(RandomizedRunner.java:787)
      [mvn] 	at com.carrotsearch.randomizedtesting.rules.SystemPropertiesRestoreRule$1.evaluate(SystemPropertiesRestoreRule.java:53)
      [mvn] 	at org.apache.lucene.util.TestRuleSetupTeardownChained$1.evaluate(TestRuleSetupTeardownChained.java:50)
      [mvn] 	at org.apache.lucene.util.TestRuleFieldCacheSanity$1.evaluate(TestRuleFieldCacheSanity.java:51)
      [mvn] 	at org.apache.lucene.util.AbstractBeforeAfterRule$1.evaluate(AbstractBeforeAfterRule.java:45)
      [mvn] 	at com.carrotsearch.randomizedtesting.rules.SystemPropertiesInvariantRule$1.evaluate(SystemPropertiesInvariantRule.java:55)
      [mvn] 	at org.apache.lucene.util.TestRuleThreadAndTestName$1.evaluate(TestRuleThreadAndTestName.java:48)
      [mvn] 	at org.apache.lucene.util.TestRuleIgnoreAfterMaxFailures$1.evaluate(TestRuleIgnoreAfterMaxFailures.java:70)
      [mvn] 	at org.apache.lucene.util.TestRuleMarkFailure$1.evaluate(TestRuleMarkFailure.java:48)
      [mvn] 	at com.carrotsearch.randomizedtesting.rules.StatementAdapter.evaluate(StatementAdapter.java:36)
      [mvn] 	at com.carrotsearch.randomizedtesting.ThreadLeakControl$StatementRunner.run(ThreadLeakControl.java:358)
      [mvn] 	at com.carrotsearch.randomizedtesting.ThreadLeakControl.forkTimeoutingTask(ThreadLeakControl.java:782)
      [mvn] 	at com.carrotsearch.randomizedtesting.ThreadLeakControl$3.evaluate(ThreadLeakControl.java:442)
      [mvn] 	at com.carrotsearch.randomizedtesting.RandomizedRunner.runSingleTest(RandomizedRunner.java:746)
      [mvn] 	at com.carrotsearch.randomizedtesting.RandomizedRunner$3.evaluate(RandomizedRunner.java:648)
      [mvn] 	at com.carrotsearch.randomizedtesting.RandomizedRunner$4.evaluate(RandomizedRunner.java:682)
      [mvn] 	at com.carrotsearch.randomizedtesting.RandomizedRunner$5.evaluate(RandomizedRunner.java:693)
      [mvn] 	at com.carrotsearch.randomizedtesting.rules.StatementAdapter.evaluate(StatementAdapter.java:36)
      [mvn] 	at com.carrotsearch.randomizedtesting.rules.SystemPropertiesRestoreRule$1.evaluate(SystemPropertiesRestoreRule.java:53)
      [mvn] 	at org.apache.lucene.util.AbstractBeforeAfterRule$1.evaluate(AbstractBeforeAfterRule.java:45)
      [mvn] 	at org.apache.lucene.util.TestRuleStoreClassName$1.evaluate(TestRuleStoreClassName.java:42)
      [mvn] 	at com.carrotsearch.randomizedtesting.rules.SystemPropertiesInvariantRule$1.evaluate(SystemPropertiesInvariantRule.java:55)
      [mvn] 	at com.carrotsearch.randomizedtesting.rules.NoShadowingOrOverridesOnMethodsRule$1.evaluate(NoShadowingOrOverridesOnMethodsRule.java:39)
      [mvn] 	at com.carrotsearch.randomizedtesting.rules.NoShadowingOrOverridesOnMethodsRule$1.evaluate(NoShadowingOrOverridesOnMethodsRule.java:39)
      [mvn] 	at com.carrotsearch.randomizedtesting.rules.StatementAdapter.evaluate(StatementAdapter.java:36)
      [mvn] 	at org.apache.lucene.util.TestRuleAssertionsRequired$1.evaluate(TestRuleAssertionsRequired.java:43)
      [mvn] 	at org.apache.lucene.util.TestRuleMarkFailure$1.evaluate(TestRuleMarkFailure.java:48)
      [mvn] 	at org.apache.lucene.util.TestRuleIgnoreAfterMaxFailures$1.evaluate(TestRuleIgnoreAfterMaxFailures.java:70)
      [mvn] 	at org.apache.lucene.util.TestRuleIgnoreTestSuites$1.evaluate(TestRuleIgnoreTestSuites.java:55)
      [mvn] 	at com.carrotsearch.randomizedtesting.rules.StatementAdapter.evaluate(StatementAdapter.java:36)
      [mvn] 	at com.carrotsearch.randomizedtesting.ThreadLeakControl$StatementRunner.run(ThreadLeakControl.java:358)
      [mvn] 	at java.lang.Thread.run(Thread.java:679)
      [mvn] Caused by: java.io.FileNotFoundException: dih/solr/collection1/conf/dataimport.properties (No such file or directory)
      [mvn] 	at java.io.FileOutputStream.open(Native Method)
      [mvn] 	at java.io.FileOutputStream.<init>(FileOutputStream.java:209)
      [mvn] 	at java.io.FileOutputStream.<init>(FileOutputStream.java:99)
      [mvn] 	at org.apache.solr.handler.dataimport.SimplePropertiesWriter.persist(SimplePropertiesWriter.java:85)
      [mvn] 	... 50 more
      [mvn] 
      [mvn] Creating dataDir: /usr/home/hudson/hudson-slave/workspace/Lucene-Solr-Maven-4.x/maven-build/solr/contrib/dataimporthandler/target/test/./solrtest-TestSolrEntityProcessorEndToEnd-1348310803172
      [mvn] ASYNC  NEW_CORE C1 name=collection1 org.apache.solr.core.SolrCore@4280bc28
      [mvn] 1120 T99 C1 oashd.DocBuilder.finish SEVERE Could not write property file org.apache.solr.handler.dataimport.DataImportHandlerException: Unable to persist Index Start Time Processing Document # 2
      [mvn] 	at org.apache.solr.handler.dataimport.SimplePropertiesWriter.persist(SimplePropertiesWriter.java:89)
      [mvn] 	at org.apache.solr.handler.dataimport.DocBuilder.finish(DocBuilder.java:310)
      [mvn] 	at org.apache.solr.handler.dataimport.DocBuilder.execute(DocBuilder.java:256)
      [mvn] 	at org.apache.solr.handler.dataimport.DataImporter.doFullImport(DataImporter.java:382)
      [mvn] 	at org.apache.solr.handler.dataimport.DataImporter.runCmd(DataImporter.java:448)
      [mvn] 	at org.apache.solr.handler.dataimport.DataImportHandler.handleRequestBody(DataImportHandler.java:177)
      [mvn] 	at org.apache.solr.handler.RequestHandlerBase.handleRequest(RequestHandlerBase.java:129)
      [mvn] 	at org.apache.solr.core.SolrCore.execute(SolrCore.java:1701)
      [mvn] 	at org.apache.solr.util.TestHarness.query(TestHarness.java:364)
      [mvn] 	at org.apache.solr.handler.dataimport.AbstractDataImportHandlerTestCase.runFullImport(AbstractDataImportHandlerTestCase.java:96)
      [mvn] 	at org.apache.solr.handler.dataimport.TestSolrEntityProcessorEndToEnd.testFullImportInnerEntity(TestSolrEntityProcessorEndToEnd.java:207)
      [mvn] 	at sun.reflect.NativeMethodAccessorImpl.invoke0(Native Method)
      [mvn] 	at sun.reflect.NativeMethodAccessorImpl.invoke(NativeMethodAccessorImpl.java:57)
      [mvn] 	at sun.reflect.DelegatingMethodAccessorImpl.invoke(DelegatingMethodAccessorImpl.java:43)
      [mvn] 	at java.lang.reflect.Method.invoke(Method.java:616)
      [mvn] 	at com.carrotsearch.randomizedtesting.RandomizedRunner.invoke(RandomizedRunner.java:1559)
      [mvn] 	at com.carrotsearch.randomizedtesting.RandomizedRunner.access$600(RandomizedRunner.java:79)
      [mvn] 	at com.carrotsearch.randomizedtesting.RandomizedRunner$6.evaluate(RandomizedRunner.java:737)
      [mvn] 	at com.carrotsearch.randomizedtesting.RandomizedRunner$7.evaluate(RandomizedRunner.java:773)
      [mvn] 	at com.carrotsearch.randomizedtesting.RandomizedRunner$8.evaluate(RandomizedRunner.java:787)
      [mvn] 	at com.carrotsearch.randomizedtesting.rules.SystemPropertiesRestoreRule$1.evaluate(SystemPropertiesRestoreRule.java:53)
      [mvn] 	at org.apache.lucene.util.TestRuleSetupTeardownChained$1.evaluate(TestRuleSetupTeardownChained.java:50)
      [mvn] 	at org.apache.lucene.util.TestRuleFieldCacheSanity$1.evaluate(TestRuleFieldCacheSanity.java:51)
      [mvn] 	at org.apache.lucene.util.AbstractBeforeAfterRule$1.evaluate(AbstractBeforeAfterRule.java:45)
      [mvn] 	at com.carrotsearch.randomizedtesting.rules.SystemPropertiesInvariantRule$1.evaluate(SystemPropertiesInvariantRule.java:55)
      [mvn] 	at org.apache.lucene.util.TestRuleThreadAndTestName$1.evaluate(TestRuleThreadAndTestName.java:48)
      [mvn] 	at org.apache.lucene.util.TestRuleIgnoreAfterMaxFailures$1.evaluate(TestRuleIgnoreAfterMaxFailures.java:70)
      [mvn] 	at org.apache.lucene.util.TestRuleMarkFailure$1.evaluate(TestRuleMarkFailure.java:48)
      [mvn] 	at com.carrotsearch.randomizedtesting.rules.StatementAdapter.evaluate(StatementAdapter.java:36)
      [mvn] 	at com.carrotsearch.randomizedtesting.ThreadLeakControl$StatementRunner.run(ThreadLeakControl.java:358)
      [mvn] 	at com.carrotsearch.randomizedtesting.ThreadLeakControl.forkTimeoutingTask(ThreadLeakControl.java:782)
      [mvn] 	at com.carrotsearch.randomizedtesting.ThreadLeakControl$3.evaluate(ThreadLeakControl.java:442)
      [mvn] 	at com.carrotsearch.randomizedtesting.RandomizedRunner.runSingleTest(RandomizedRunner.java:746)
      [mvn] 	at com.carrotsearch.randomizedtesting.RandomizedRunner$3.evaluate(RandomizedRunner.java:648)
      [mvn] 	at com.carrotsearch.randomizedtesting.RandomizedRunner$4.evaluate(RandomizedRunner.java:682)
      [mvn] 	at com.carrotsearch.randomizedtesting.RandomizedRunner$5.evaluate(RandomizedRunner.java:693)
      [mvn] 	at com.carrotsearch.randomizedtesting.rules.StatementAdapter.evaluate(StatementAdapter.java:36)
      [mvn] 	at com.carrotsearch.randomizedtesting.rules.SystemPropertiesRestoreRule$1.evaluate(SystemPropertiesRestoreRule.java:53)
      [mvn] 	at org.apache.lucene.util.AbstractBeforeAfterRule$1.evaluate(AbstractBeforeAfterRule.java:45)
      [mvn] 	at org.apache.lucene.util.TestRuleStoreClassName$1.evaluate(TestRuleStoreClassName.java:42)
      [mvn] 	at com.carrotsearch.randomizedtesting.rules.SystemPropertiesInvariantRule$1.evaluate(SystemPropertiesInvariantRule.java:55)
      [mvn] 	at com.carrotsearch.randomizedtesting.rules.NoShadowingOrOverridesOnMethodsRule$1.evaluate(NoShadowingOrOverridesOnMethodsRule.java:39)
      [mvn] 	at com.carrotsearch.randomizedtesting.rules.NoShadowingOrOverridesOnMethodsRule$1.evaluate(NoShadowingOrOverridesOnMethodsRule.java:39)
      [mvn] 	at com.carrotsearch.randomizedtesting.rules.StatementAdapter.evaluate(StatementAdapter.java:36)
      [mvn] 	at org.apache.lucene.util.TestRuleAssertionsRequired$1.evaluate(TestRuleAssertionsRequired.java:43)
      [mvn] 	at org.apache.lucene.util.TestRuleMarkFailure$1.evaluate(TestRuleMarkFailure.java:48)
      [mvn] 	at org.apache.lucene.util.TestRuleIgnoreAfterMaxFailures$1.evaluate(TestRuleIgnoreAfterMaxFailures.java:70)
      [mvn] 	at org.apache.lucene.util.TestRuleIgnoreTestSuites$1.evaluate(TestRuleIgnoreTestSuites.java:55)
      [mvn] 	at com.carrotsearch.randomizedtesting.rules.StatementAdapter.evaluate(StatementAdapter.java:36)
      [mvn] 	at com.carrotsearch.randomizedtesting.ThreadLeakControl$StatementRunner.run(ThreadLeakControl.java:358)
      [mvn] 	at java.lang.Thread.run(Thread.java:679)
      [mvn] Caused by: java.io.FileNotFoundException: dih/solr/collection1/conf/dataimport.properties (No such file or directory)
      [mvn] 	at java.io.FileOutputStream.open(Native Method)
      [mvn] 	at java.io.FileOutputStream.<init>(FileOutputStream.java:209)
      [mvn] 	at java.io.FileOutputStream.<init>(FileOutputStream.java:99)
      [mvn] 	at org.apache.solr.handler.dataimport.SimplePropertiesWriter.persist(SimplePropertiesWriter.java:85)
      [mvn] 	... 50 more
      [mvn] 
      [mvn] Creating dataDir: /usr/home/hudson/hudson-slave/workspace/Lucene-Solr-Maven-4.x/maven-build/solr/contrib/dataimporthandler/target/test/./solrtest-TestSolrEntityProcessorEndToEnd-1348310803737
      [mvn] ASYNC  NEW_CORE C2 name=collection1 org.apache.solr.core.SolrCore@38d8fb2b
      [mvn] 1678 T99 C2 oashd.DocBuilder.finish SEVERE Could not write property file org.apache.solr.handler.dataimport.DataImportHandlerException: Unable to persist Index Start Time Processing Document # 8
      [mvn] 	at org.apache.solr.handler.dataimport.SimplePropertiesWriter.persist(SimplePropertiesWriter.java:89)
      [mvn] 	at org.apache.solr.handler.dataimport.DocBuilder.finish(DocBuilder.java:310)
      [mvn] 	at org.apache.solr.handler.dataimport.DocBuilder.execute(DocBuilder.java:256)
      [mvn] 	at org.apache.solr.handler.dataimport.DataImporter.doFullImport(DataImporter.java:382)
      [mvn] 	at org.apache.solr.handler.dataimport.DataImporter.runCmd(DataImporter.java:448)
      [mvn] 	at org.apache.solr.handler.dataimport.DataImportHandler.handleRequestBody(DataImportHandler.java:177)
      [mvn] 	at org.apache.solr.handler.RequestHandlerBase.handleRequest(RequestHandlerBase.java:129)
      [mvn] 	at org.apache.solr.core.SolrCore.execute(SolrCore.java:1701)
      [mvn] 	at org.apache.solr.util.TestHarness.query(TestHarness.java:364)
      [mvn] 	at org.apache.solr.handler.dataimport.AbstractDataImportHandlerTestCase.runFullImport(AbstractDataImportHandlerTestCase.java:96)
      [mvn] 	at org.apache.solr.handler.dataimport.TestSolrEntityProcessorEndToEnd.testFullImportFieldsParam(TestSolrEntityProcessorEndToEnd.java:181)
      [mvn] 	at sun.reflect.NativeMethodAccessorImpl.invoke0(Native Method)
      [mvn] 	at sun.reflect.NativeMethodAccessorImpl.invoke(NativeMethodAccessorImpl.java:57)
      [mvn] 	at sun.reflect.DelegatingMethodAccessorImpl.invoke(DelegatingMethodAccessorImpl.java:43)
      [mvn] 	at java.lang.reflect.Method.invoke(Method.java:616)
      [mvn] 	at com.carrotsearch.randomizedtesting.RandomizedRunner.invoke(RandomizedRunner.java:1559)
      [mvn] 	at com.carrotsearch.randomizedtesting.RandomizedRunner.access$600(RandomizedRunner.java:79)
      [mvn] 	at com.carrotsearch.randomizedtesting.RandomizedRunner$6.evaluate(RandomizedRunner.java:737)
      [mvn] 	at com.carrotsearch.randomizedtesting.RandomizedRunner$7.evaluate(RandomizedRunner.java:773)
      [mvn] 	at com.carrotsearch.randomizedtesting.RandomizedRunner$8.evaluate(RandomizedRunner.java:787)
      [mvn] 	at com.carrotsearch.randomizedtesting.rules.SystemPropertiesRestoreRule$1.evaluate(SystemPropertiesRestoreRule.java:53)
      [mvn] 	at org.apache.lucene.util.TestRuleSetupTeardownChained$1.evaluate(TestRuleSetupTeardownChained.java:50)
      [mvn] 	at org.apache.lucene.util.TestRuleFieldCacheSanity$1.evaluate(TestRuleFieldCacheSanity.java:51)
      [mvn] 	at org.apache.lucene.util.AbstractBeforeAfterRule$1.evaluate(AbstractBeforeAfterRule.java:45)
      [mvn] 	at com.carrotsearch.randomizedtesting.rules.SystemPropertiesInvariantRule$1.evaluate(SystemPropertiesInvariantRule.java:55)
      [mvn] 	at org.apache.lucene.util.TestRuleThreadAndTestName$1.evaluate(TestRuleThreadAndTestName.java:48)
      [mvn] 	at org.apache.lucene.util.TestRuleIgnoreAfterMaxFailures$1.evaluate(TestRuleIgnoreAfterMaxFailures.java:70)
      [mvn] 	at org.apache.lucene.util.TestRuleMarkFailure$1.evaluate(TestRuleMarkFailure.java:48)
      [mvn] 	at com.carrotsearch.randomizedtesting.rules.StatementAdapter.evaluate(StatementAdapter.java:36)
      [mvn] 	at com.carrotsearch.randomizedtesting.ThreadLeakControl$StatementRunner.run(ThreadLeakControl.java:358)
      [mvn] 	at com.carrotsearch.randomizedtesting.ThreadLeakControl.forkTimeoutingTask(ThreadLeakControl.java:782)
      [mvn] 	at com.carrotsearch.randomizedtesting.ThreadLeakControl$3.evaluate(ThreadLeakControl.java:442)
      [mvn] 	at com.carrotsearch.randomizedtesting.RandomizedRunner.runSingleTest(RandomizedRunner.java:746)
      [mvn] 	at com.carrotsearch.randomizedtesting.RandomizedRunner$3.evaluate(RandomizedRunner.java:648)
      [mvn] 	at com.carrotsearch.randomizedtesting.RandomizedRunner$4.evaluate(RandomizedRunner.java:682)
      [mvn] 	at com.carrotsearch.randomizedtesting.RandomizedRunner$5.evaluate(RandomizedRunner.java:693)
      [mvn] 	at com.carrotsearch.randomizedtesting.rules.StatementAdapter.evaluate(StatementAdapter.java:36)
      [mvn] 	at com.carrotsearch.randomizedtesting.rules.SystemPropertiesRestoreRule$1.evaluate(SystemPropertiesRestoreRule.java:53)
      [mvn] 	at org.apache.lucene.util.AbstractBeforeAfterRule$1.evaluate(AbstractBeforeAfterRule.java:45)
      [mvn] 	at org.apache.lucene.util.TestRuleStoreClassName$1.evaluate(TestRuleStoreClassName.java:42)
      [mvn] 	at com.carrotsearch.randomizedtesting.rules.SystemPropertiesInvariantRule$1.evaluate(SystemPropertiesInvariantRule.java:55)
      [mvn] 	at com.carrotsearch.randomizedtesting.rules.NoShadowingOrOverridesOnMethodsRule$1.evaluate(NoShadowingOrOverridesOnMethodsRule.java:39)
      [mvn] 	at com.carrotsearch.randomizedtesting.rules.NoShadowingOrOverridesOnMethodsRule$1.evaluate(NoShadowingOrOverridesOnMethodsRule.java:39)
      [mvn] 	at com.carrotsearch.randomizedtesting.rules.StatementAdapter.evaluate(StatementAdapter.java:36)
      [mvn] 	at org.apache.lucene.util.TestRuleAssertionsRequired$1.evaluate(TestRuleAssertionsRequired.java:43)
      [mvn] 	at org.apache.lucene.util.TestRuleMarkFailure$1.evaluate(TestRuleMarkFailure.java:48)
      [mvn] 	at org.apache.lucene.util.TestRuleIgnoreAfterMaxFailures$1.evaluate(TestRuleIgnoreAfterMaxFailures.java:70)
      [mvn] 	at org.apache.lucene.util.TestRuleIgnoreTestSuites$1.evaluate(TestRuleIgnoreTestSuites.java:55)
      [mvn] 	at com.carrotsearch.randomizedtesting.rules.StatementAdapter.evaluate(StatementAdapter.java:36)
      [mvn] 	at com.carrotsearch.randomizedtesting.ThreadLeakControl$StatementRunner.run(ThreadLeakControl.java:358)
      [mvn] 	at java.lang.Thread.run(Thread.java:679)
      [mvn] Caused by: java.io.FileNotFoundException: dih/solr/collection1/conf/dataimport.properties (No such file or directory)
      [mvn] 	at java.io.FileOutputStream.open(Native Method)
      [mvn] 	at java.io.FileOutputStream.<init>(FileOutputStream.java:209)
      [mvn] 	at java.io.FileOutputStream.<init>(FileOutputStream.java:99)
      [mvn] 	at org.apache.solr.handler.dataimport.SimplePropertiesWriter.persist(SimplePropertiesWriter.java:85)
      [mvn] 	... 50 more
      [mvn] 
      [mvn] 1687 T99 oas.SolrTestCaseJ4.assertQ SEVERE REQUEST FAILED: xpath=//result/doc/arr[@name='desc']
      [mvn] 		xml response was: <?xml version="1.0" encoding="UTF-8"?>
      [mvn] 	<response>
      [mvn] 	<lst name="responseHeader"><int name="status">0</int><int name="QTime">1</int><lst name="params"><str name="start">0</str><str name="q">id:1</str><str name="qt">standard</str><str name="rows">20</str><str name="version">2.2</str></lst></lst><result name="response" numFound="1" start="0"><doc><str name="id">1</str><date name="timestamp">2012-09-22T10:46:44.149Z</date></doc></result>
      [mvn] 	</response>
      [mvn] 	
      [mvn] 		request was:start=0&q=id:1&qt=standard&rows=20&version=2.2
      [mvn] 1688 T99 oasc.SolrException.log SEVERE REQUEST FAILED: start=0&q=id:1&qt=standard&rows=20&version=2.2:java.lang.RuntimeException: REQUEST FAILED: xpath=//result/doc/arr[@name='desc']
      [mvn] 		xml response was: <?xml version="1.0" encoding="UTF-8"?>
      [mvn] 	<response>
      [mvn] 	<lst name="responseHeader"><int name="status">0</int><int name="QTime">1</int><lst name="params"><str name="start">0</str><str name="q">id:1</str><str name="qt">standard</str><str name="rows">20</str><str name="version">2.2</str></lst></lst><result name="response" numFound="1" start="0"><doc><str name="id">1</str><date name="timestamp">2012-09-22T10:46:44.149Z</date></doc></result>
      [mvn] 	</response>
      [mvn] 	
      [mvn] 		request was:start=0&q=id:1&qt=standard&rows=20&version=2.2
      [mvn] 		at org.apache.solr.SolrTestCaseJ4.assertQ(SolrTestCaseJ4.java:503)
      [mvn] 		at org.apache.solr.SolrTestCaseJ4.assertQ(SolrTestCaseJ4.java:477)
      [mvn] 		at org.apache.solr.handler.dataimport.TestSolrEntityProcessorEndToEnd.testFullImportFieldsParam(TestSolrEntityProcessorEndToEnd.java:190)
      [mvn] 		at sun.reflect.NativeMethodAccessorImpl.invoke0(Native Method)
      [mvn] 		at sun.reflect.NativeMethodAccessorImpl.invoke(NativeMethodAccessorImpl.java:57)
      [mvn] 		at sun.reflect.DelegatingMethodAccessorImpl.invoke(DelegatingMethodAccessorImpl.java:43)
      [mvn] 		at java.lang.reflect.Method.invoke(Method.java:616)
      [mvn] 		at com.carrotsearch.randomizedtesting.RandomizedRunner.invoke(RandomizedRunner.java:1559)
      [mvn] 		at com.carrotsearch.randomizedtesting.RandomizedRunner.access$600(RandomizedRunner.java:79)
      [mvn] 		at com.carrotsearch.randomizedtesting.RandomizedRunner$6.evaluate(RandomizedRunner.java:737)
      [mvn] 		at com.carrotsearch.randomizedtesting.RandomizedRunner$7.evaluate(RandomizedRunner.java:773)
      [mvn] 		at com.carrotsearch.randomizedtesting.RandomizedRunner$8.evaluate(RandomizedRunner.java:787)
      [mvn] 		at com.carrotsearch.randomizedtesting.rules.SystemPropertiesRestoreRule$1.evaluate(SystemPropertiesRestoreRule.java:53)
      [mvn] 		at org.apache.lucene.util.TestRuleSetupTeardownChained$1.evaluate(TestRuleSetupTeardownChained.java:50)
      [mvn] 		at org.apache.lucene.util.TestRuleFieldCacheSanity$1.evaluate(TestRuleFieldCacheSanity.java:51)
      [mvn] 		at org.apache.lucene.util.AbstractBeforeAfterRule$1.evaluate(AbstractBeforeAfterRule.java:45)
      [mvn] 		at com.carrotsearch.randomizedtesting.rules.SystemPropertiesInvariantRule$1.evaluate(SystemPropertiesInvariantRule.java:55)
      [mvn] 		at org.apache.lucene.util.TestRuleThreadAndTestName$1.evaluate(TestRuleThreadAndTestName.java:48)
      [mvn] 		at org.apache.lucene.util.TestRuleIgnoreAfterMaxFailures$1.evaluate(TestRuleIgnoreAfterMaxFailures.java:70)
      [mvn] 		at org.apache.lucene.util.TestRuleMarkFailure$1.evaluate(TestRuleMarkFailure.java:48)
      [mvn] 		at com.carrotsearch.randomizedtesting.rules.StatementAdapter.evaluate(StatementAdapter.java:36)
      [mvn] 		at com.carrotsearch.randomizedtesting.ThreadLeakControl$StatementRunner.run(ThreadLeakControl.java:358)
      [mvn] 		at com.carrotsearch.randomizedtesting.ThreadLeakControl.forkTimeoutingTask(ThreadLeakControl.java:782)
      [mvn] 		at com.carrotsearch.randomizedtesting.ThreadLeakControl$3.evaluate(ThreadLeakControl.java:442)
      [mvn] 		at com.carrotsearch.randomizedtesting.RandomizedRunner.runSingleTest(RandomizedRunner.java:746)
      [mvn] 		at com.carrotsearch.randomizedtesting.RandomizedRunner$3.evaluate(RandomizedRunner.java:648)
      [mvn] 		at com.carrotsearch.randomizedtesting.RandomizedRunner$4.evaluate(RandomizedRunner.java:682)
      [mvn] 		at com.carrotsearch.randomizedtesting.RandomizedRunner$5.evaluate(RandomizedRunner.java:693)
      [mvn] 		at com.carrotsearch.randomizedtesting.rules.StatementAdapter.evaluate(StatementAdapter.java:36)
      [mvn] 		at com.carrotsearch.randomizedtesting.rules.SystemPropertiesRestoreRule$1.evaluate(

[...truncated too long message...]

TF-8' encoding to copy filtered resources.
      [mvn] [INFO] skip non existing resourceDirectory /usr/home/hudson/hudson-slave/workspace/Lucene-Solr-Maven-4.x/maven-build/solr/contrib/velocity/src/main/resources
      [mvn] [INFO] Copying 3 resources
      [mvn] [INFO] [compiler:compile {execution: default-compile}]
      [mvn] [INFO] Compiling 4 source files to /usr/home/hudson/hudson-slave/workspace/Lucene-Solr-Maven-4.x/maven-build/solr/contrib/velocity/target/classes
      [mvn] [INFO] [bundle:manifest {execution: bundle-manifest}]
      [mvn] [debug] execute contextualize
      [mvn] [INFO] [resources:testResources {execution: default-testResources}]
      [mvn] [INFO] Using 'UTF-8' encoding to copy filtered resources.
      [mvn] [INFO] Copying 3 resources
      [mvn] [INFO] Copying 1 resource
      [mvn] [INFO] Copying 3 resources
      [mvn] [INFO] [compiler:testCompile {execution: default-testCompile}]
      [mvn] [INFO] Compiling 1 source file to /usr/home/hudson/hudson-slave/workspace/Lucene-Solr-Maven-4.x/maven-build/solr/contrib/velocity/target/test-classes
      [mvn] [INFO] [surefire:test {execution: default-test}]
      [mvn] [INFO] Surefire report directory: /usr/home/hudson/hudson-slave/workspace/Lucene-Solr-Maven-4.x/maven-build/solr/contrib/velocity/target/surefire-reports
      [mvn] 
      [mvn] -------------------------------------------------------
      [mvn]  T E S T S
      [mvn] -------------------------------------------------------
      [mvn] Running org.apache.solr.velocity.VelocityResponseWriterTest
      [mvn] Creating dataDir: /usr/home/hudson/hudson-slave/workspace/Lucene-Solr-Maven-4.x/maven-build/solr/contrib/velocity/target/test/./solrtest-VelocityResponseWriterTest-1348310941039
      [mvn] Tests run: 1, Failures: 0, Errors: 0, Skipped: 0, Time elapsed: 1.987 sec
      [mvn] 
      [mvn] Results :
      [mvn] 
      [mvn] Tests run: 1, Failures: 0, Errors: 0, Skipped: 0
      [mvn] 
      [mvn] [INFO] [jar:jar {execution: default-jar}]
      [mvn] [INFO] Building jar: /usr/home/hudson/hudson-slave/workspace/Lucene-Solr-Maven-4.x/maven-build/solr/contrib/velocity/target/solr-velocity-4.0-SNAPSHOT.jar
      [mvn] [INFO] [install:install {execution: default-install}]
      [mvn] [INFO] Installing /usr/home/hudson/hudson-slave/workspace/Lucene-Solr-Maven-4.x/maven-build/solr/contrib/velocity/target/solr-velocity-4.0-SNAPSHOT.jar to /home/hudson/.m2/repository/org/apache/solr/solr-velocity/4.0-SNAPSHOT/solr-velocity-4.0-SNAPSHOT.jar
      [mvn] [INFO] ------------------------------------------------------------------------
      [mvn] [INFO] Building Apache Solr Contrib aggregator POM
      [mvn] [INFO]    task-segment: [install]
      [mvn] [INFO] ------------------------------------------------------------------------
      [mvn] [INFO] [groovy:execute {execution: generate-timestamps}]
      [mvn] [INFO] [buildnumber:create {execution: default}]
      [mvn] [INFO] [enforcer:enforce {execution: enforce-java-compat-version-and-maven-2.2.1}]
      [mvn] [INFO] [remote-resources:process {execution: default}]
      [mvn] [INFO] [bundle:manifest {execution: bundle-manifest}]
      [mvn] [WARNING] Ignoring project type pom - supportedProjectTypes = [jar, bundle]
      [mvn] [INFO] [site:attach-descriptor {execution: default-attach-descriptor}]
      [mvn] [INFO] [install:install {execution: default-install}]
      [mvn] [INFO] Installing /usr/home/hudson/hudson-slave/workspace/Lucene-Solr-Maven-4.x/maven-build/solr/contrib/pom.xml to /home/hudson/.m2/repository/org/apache/solr/solr-contrib-aggregator/4.0-SNAPSHOT/solr-contrib-aggregator-4.0-SNAPSHOT.pom
      [mvn] [INFO] 
      [mvn] [INFO] 
      [mvn] [INFO] ------------------------------------------------------------------------
      [mvn] [INFO] Reactor Summary:
      [mvn] [INFO] ------------------------------------------------------------------------
      [mvn] [INFO] Grandparent POM for Apache Lucene Core and Apache Solr  SUCCESS [7.967s]
      [mvn] [INFO] Lucene parent POM ..................................... SUCCESS [0.090s]
      [mvn] [INFO] Lucene Core ........................................... SUCCESS [13.688s]
      [mvn] [INFO] Lucene codecs ......................................... SUCCESS [4.095s]
      [mvn] [INFO] Lucene Test Framework ................................. SUCCESS [5.272s]
      [mvn] [INFO] Lucene Core tests ..................................... SUCCESS [3:51.158s]
      [mvn] [INFO] Lucene Core aggregator POM ............................ SUCCESS [0.088s]
      [mvn] [INFO] Lucene codecs tests ................................... SUCCESS [3.339s]
      [mvn] [INFO] Lucene codecs aggregator POM .......................... SUCCESS [0.083s]
      [mvn] [INFO] Lucene Common Analyzers ............................... SUCCESS [2:13.793s]
      [mvn] [INFO] Lucene ICU Analysis Components ........................ SUCCESS [12.076s]
      [mvn] [INFO] Lucene Kuromoji Japanese Morphological Analyzer ....... SUCCESS [34.013s]
      [mvn] [INFO] Lucene Morfologik Polish Lemmatizer ................... SUCCESS [3.464s]
      [mvn] [INFO] Lucene Phonetic Filters ............................... SUCCESS [19.859s]
      [mvn] [INFO] Lucene Smart Chinese Analyzer ......................... SUCCESS [11.523s]
      [mvn] [INFO] Lucene Stempel Analyzer ............................... SUCCESS [6.627s]
      [mvn] [INFO] Lucene UIMA Analysis Components ....................... SUCCESS [19.493s]
      [mvn] [INFO] Lucene Analysis Modules aggregator POM ................ SUCCESS [0.076s]
      [mvn] [INFO] Lucene Queries ........................................ SUCCESS [20.077s]
      [mvn] [INFO] Lucene Sandbox ........................................ SUCCESS [38.036s]
      [mvn] [INFO] Lucene QueryParsers ................................... SUCCESS [13.117s]
      [mvn] [INFO] Lucene Memory ......................................... SUCCESS [9.507s]
      [mvn] [INFO] Lucene Highlighter .................................... SUCCESS [8.677s]
      [mvn] [INFO] Lucene Facets ......................................... SUCCESS [51.632s]
      [mvn] [INFO] Lucene Benchmark ...................................... SUCCESS [25.514s]
      [mvn] [INFO] Lucene Demo ........................................... SUCCESS [3.957s]
      [mvn] [INFO] Lucene Grouping ....................................... SUCCESS [16.468s]
      [mvn] [INFO] Lucene Join ........................................... SUCCESS [17.150s]
      [mvn] [INFO] Lucene Miscellaneous .................................. SUCCESS [7.960s]
      [mvn] [INFO] Lucene Spatial ........................................ SUCCESS [13.166s]
      [mvn] [INFO] Lucene Suggest ........................................ SUCCESS [19.625s]
      [mvn] [INFO] Apache Solr parent POM ................................ SUCCESS [0.085s]
      [mvn] [INFO] Apache Solr Solrj ..................................... SUCCESS [4.435s]
      [mvn] [INFO] Apache Solr Core ...................................... SUCCESS [12.274s]
      [mvn] [INFO] Apache Solr Test Framework ............................ SUCCESS [3.238s]
      [mvn] [INFO] Apache Solr Core tests ................................ FAILED [19:13.044s]
      [mvn] [INFO] Apache Solr Core aggregator POM ....................... SUCCESS [0.086s]
      [mvn] [INFO] Apache Solr Solrj tests ............................... SUCCESS [3:47.378s]
      [mvn] [INFO] Apache Solr Solrj aggregator POM ...................... SUCCESS [0.086s]
      [mvn] [INFO] Apache Solr Search Server ............................. SUCCESS [5.138s]
      [mvn] [INFO] Apache Solr Analysis Extras ........................... SUCCESS [9.325s]
      [mvn] [INFO] Apache Solr Clustering ................................ SUCCESS [16.631s]
      [mvn] [INFO] Apache Solr DataImportHandler ......................... SUCCESS [1:37.235s]
      [mvn] [INFO] Apache Solr DataImportHandler Extras .................. SUCCESS [7.388s]
      [mvn] [INFO] Apache Solr Content Extraction Library ................ SUCCESS [10.395s]
      [mvn] [INFO] Apache Solr Language Identifier ....................... SUCCESS [7.715s]
      [mvn] [INFO] Apache Solr UIMA integration .......................... SUCCESS [30.372s]
      [mvn] [INFO] Apache Solr Velocity .................................. SUCCESS [4.629s]
      [mvn] [INFO] Apache Solr Contrib aggregator POM .................... SUCCESS [0.075s]
      [mvn] [INFO] ------------------------------------------------------------------------
      [mvn] [INFO] Error for project: Apache Solr Core tests (during install)
      [mvn] [INFO] ------------------------------------------------------------------------
      [mvn] [INFO] There are test failures.
      [mvn] 
      [mvn] Please refer to /usr/home/hudson/hudson-slave/workspace/Lucene-Solr-Maven-4.x/maven-build/solr/core/src/test/target/surefire-reports for the individual test results.
      [mvn] [INFO] ------------------------------------------------------------------------
      [mvn] [INFO] For more information, run Maven with the -e switch
      [mvn] [INFO] ------------------------------------------------------------------------
      [mvn] [INFO] BUILD ERRORS
      [mvn] [INFO] ------------------------------------------------------------------------
      [mvn] [INFO] Total time: 39 minutes 2 seconds
      [mvn] [INFO] Finished at: Sat Sep 22 10:49:03 UTC 2012
      [mvn] [INFO] Final Memory: 259M/1740M
      [mvn] [INFO] ------------------------------------------------------------------------

BUILD FAILED
/usr/home/hudson/hudson-slave/workspace/Lucene-Solr-Maven-4.x/build.xml:160: The following error occurred while executing this line:
/usr/home/hudson/hudson-slave/workspace/Lucene-Solr-Maven-4.x/extra-targets.xml:56: Java returned: 1

Total time: 39 minutes 8 seconds
Build step 'Invoke Ant' marked build as failure
Recording test results
Email was triggered for: Failure
Sending email for trigger: Failure




Mime
View raw message