lucene-dev mailing list archives

Site index · List index
Message view « Date » · « Thread »
Top « Date » · « Thread »
From Policeman Jenkins Server <jenk...@sd-datasolutions.de>
Subject [JENKINS] Lucene-Solr-4.x-Linux (32bit/jdk1.8.0-ea-b51) - Build # 779 - Failure!
Date Sat, 01 Sep 2012 01:23:21 GMT
Build: http://jenkins.sd-datasolutions.de/job/Lucene-Solr-4.x-Linux/779/
Java: 32bit/jdk1.8.0-ea-b51 -client -XX:+UseConcMarkSweepGC

4 tests failed.
FAILED:  junit.framework.TestSuite.org.apache.solr.cloud.BasicDistributedZkTest

Error Message:
ERROR: SolrIndexSearcher opens=1124 closes=1123

Stack Trace:
java.lang.AssertionError: ERROR: SolrIndexSearcher opens=1124 closes=1123
	at __randomizedtesting.SeedInfo.seed([9AAF0F91EFAE552C]:0)
	at org.junit.Assert.fail(Assert.java:93)
	at org.apache.solr.SolrTestCaseJ4.endTrackingSearchers(SolrTestCaseJ4.java:223)
	at org.apache.solr.SolrTestCaseJ4.afterClass(SolrTestCaseJ4.java:89)
	at sun.reflect.NativeMethodAccessorImpl.invoke0(Native Method)
	at sun.reflect.NativeMethodAccessorImpl.invoke(NativeMethodAccessorImpl.java:57)
	at sun.reflect.DelegatingMethodAccessorImpl.invoke(DelegatingMethodAccessorImpl.java:43)
	at java.lang.reflect.Method.invoke(Method.java:474)
	at com.carrotsearch.randomizedtesting.RandomizedRunner.invoke(RandomizedRunner.java:1559)
	at com.carrotsearch.randomizedtesting.RandomizedRunner.access$600(RandomizedRunner.java:79)
	at com.carrotsearch.randomizedtesting.RandomizedRunner$5.evaluate(RandomizedRunner.java:700)
	at com.carrotsearch.randomizedtesting.rules.StatementAdapter.evaluate(StatementAdapter.java:36)
	at com.carrotsearch.randomizedtesting.rules.SystemPropertiesRestoreRule$1.evaluate(SystemPropertiesRestoreRule.java:53)
	at org.apache.lucene.util.AbstractBeforeAfterRule$1.evaluate(AbstractBeforeAfterRule.java:45)
	at org.apache.lucene.util.TestRuleStoreClassName$1.evaluate(TestRuleStoreClassName.java:42)
	at com.carrotsearch.randomizedtesting.rules.SystemPropertiesInvariantRule$1.evaluate(SystemPropertiesInvariantRule.java:55)
	at com.carrotsearch.randomizedtesting.rules.NoShadowingOrOverridesOnMethodsRule$1.evaluate(NoShadowingOrOverridesOnMethodsRule.java:39)
	at com.carrotsearch.randomizedtesting.rules.NoShadowingOrOverridesOnMethodsRule$1.evaluate(NoShadowingOrOverridesOnMethodsRule.java:39)
	at org.apache.lucene.util.TestRuleAssertionsRequired$1.evaluate(TestRuleAssertionsRequired.java:40)
	at org.apache.lucene.util.TestRuleMarkFailure$1.evaluate(TestRuleMarkFailure.java:48)
	at org.apache.lucene.util.TestRuleIgnoreAfterMaxFailures$1.evaluate(TestRuleIgnoreAfterMaxFailures.java:70)
	at org.apache.lucene.util.TestRuleIgnoreTestSuites$1.evaluate(TestRuleIgnoreTestSuites.java:55)
	at com.carrotsearch.randomizedtesting.rules.StatementAdapter.evaluate(StatementAdapter.java:36)
	at com.carrotsearch.randomizedtesting.ThreadLeakControl$StatementRunner.run(ThreadLeakControl.java:345)
	at java.lang.Thread.run(Thread.java:722)


FAILED:  junit.framework.TestSuite.org.apache.solr.cloud.BasicDistributedZkTest

Error Message:
1 thread leaked from SUITE scope at org.apache.solr.cloud.BasicDistributedZkTest:     1) Thread[id=1048, name=searcherExecutor-712-thread-1, state=WAITING, group=TGRP-BasicDistributedZkTest]         at sun.misc.Unsafe.park(Native Method)         at java.util.concurrent.locks.LockSupport.park(LockSupport.java:186)         at java.util.concurrent.locks.AbstractQueuedSynchronizer$ConditionObject.await(AbstractQueuedSynchronizer.java:2043)         at java.util.concurrent.LinkedBlockingQueue.take(LinkedBlockingQueue.java:442)         at java.util.concurrent.ThreadPoolExecutor.getTask(ThreadPoolExecutor.java:1045)         at java.util.concurrent.ThreadPoolExecutor.runWorker(ThreadPoolExecutor.java:1103)         at java.util.concurrent.ThreadPoolExecutor$Worker.run(ThreadPoolExecutor.java:603)         at java.lang.Thread.run(Thread.java:722)

Stack Trace:
com.carrotsearch.randomizedtesting.ThreadLeakError: 1 thread leaked from SUITE scope at org.apache.solr.cloud.BasicDistributedZkTest: 
   1) Thread[id=1048, name=searcherExecutor-712-thread-1, state=WAITING, group=TGRP-BasicDistributedZkTest]
        at sun.misc.Unsafe.park(Native Method)
        at java.util.concurrent.locks.LockSupport.park(LockSupport.java:186)
        at java.util.concurrent.locks.AbstractQueuedSynchronizer$ConditionObject.await(AbstractQueuedSynchronizer.java:2043)
        at java.util.concurrent.LinkedBlockingQueue.take(LinkedBlockingQueue.java:442)
        at java.util.concurrent.ThreadPoolExecutor.getTask(ThreadPoolExecutor.java:1045)
        at java.util.concurrent.ThreadPoolExecutor.runWorker(ThreadPoolExecutor.java:1103)
        at java.util.concurrent.ThreadPoolExecutor$Worker.run(ThreadPoolExecutor.java:603)
        at java.lang.Thread.run(Thread.java:722)
	at __randomizedtesting.SeedInfo.seed([9AAF0F91EFAE552C]:0)


FAILED:  junit.framework.TestSuite.org.apache.solr.cloud.FullSolrCloudDistribCmdsTest

Error Message:


Stack Trace:
java.lang.AssertionError
	at __randomizedtesting.SeedInfo.seed([9AAF0F91EFAE552C]:0)
	at org.apache.solr.SolrTestCaseJ4.useFactory(SolrTestCaseJ4.java:98)
	at org.apache.solr.cloud.AbstractDistribZkTestBase.beforeThisClass(AbstractDistribZkTestBase.java:48)
	at sun.reflect.NativeMethodAccessorImpl.invoke0(Native Method)
	at sun.reflect.NativeMethodAccessorImpl.invoke(NativeMethodAccessorImpl.java:57)
	at sun.reflect.DelegatingMethodAccessorImpl.invoke(DelegatingMethodAccessorImpl.java:43)
	at java.lang.reflect.Method.invoke(Method.java:474)
	at com.carrotsearch.randomizedtesting.RandomizedRunner.invoke(RandomizedRunner.java:1559)
	at com.carrotsearch.randomizedtesting.RandomizedRunner.access$600(RandomizedRunner.java:79)
	at com.carrotsearch.randomizedtesting.RandomizedRunner$4.evaluate(RandomizedRunner.java:677)
	at com.carrotsearch.randomizedtesting.RandomizedRunner$5.evaluate(RandomizedRunner.java:693)
	at com.carrotsearch.randomizedtesting.rules.StatementAdapter.evaluate(StatementAdapter.java:36)
	at com.carrotsearch.randomizedtesting.rules.SystemPropertiesRestoreRule$1.evaluate(SystemPropertiesRestoreRule.java:53)
	at org.apache.lucene.util.AbstractBeforeAfterRule$1.evaluate(AbstractBeforeAfterRule.java:45)
	at org.apache.lucene.util.TestRuleStoreClassName$1.evaluate(TestRuleStoreClassName.java:42)
	at com.carrotsearch.randomizedtesting.rules.SystemPropertiesInvariantRule$1.evaluate(SystemPropertiesInvariantRule.java:55)
	at com.carrotsearch.randomizedtesting.rules.NoShadowingOrOverridesOnMethodsRule$1.evaluate(NoShadowingOrOverridesOnMethodsRule.java:39)
	at com.carrotsearch.randomizedtesting.rules.NoShadowingOrOverridesOnMethodsRule$1.evaluate(NoShadowingOrOverridesOnMethodsRule.java:39)
	at org.apache.lucene.util.TestRuleAssertionsRequired$1.evaluate(TestRuleAssertionsRequired.java:40)
	at org.apache.lucene.util.TestRuleMarkFailure$1.evaluate(TestRuleMarkFailure.java:48)
	at org.apache.lucene.util.TestRuleIgnoreAfterMaxFailures$1.evaluate(TestRuleIgnoreAfterMaxFailures.java:70)
	at org.apache.lucene.util.TestRuleIgnoreTestSuites$1.evaluate(TestRuleIgnoreTestSuites.java:55)
	at com.carrotsearch.randomizedtesting.rules.StatementAdapter.evaluate(StatementAdapter.java:36)
	at com.carrotsearch.randomizedtesting.ThreadLeakControl$StatementRunner.run(ThreadLeakControl.java:345)
	at java.lang.Thread.run(Thread.java:722)


REGRESSION:  org.apache.solr.cloud.BasicDistributedZkTest.testDistribSearch

Error Message:
Could not find new 2 slice collection called awholynewcollection_9

Stack Trace:
java.lang.AssertionError: Could not find new 2 slice collection called awholynewcollection_9
	at __randomizedtesting.SeedInfo.seed([9AAF0F91EFAE552C:1B49818998F13510]:0)
	at org.junit.Assert.fail(Assert.java:93)
	at org.apache.solr.cloud.BasicDistributedZkTest.checkForCollection(BasicDistributedZkTest.java:576)
	at org.apache.solr.cloud.BasicDistributedZkTest.testCollectionsAPI(BasicDistributedZkTest.java:356)
	at org.apache.solr.cloud.BasicDistributedZkTest.doTest(BasicDistributedZkTest.java:314)
	at org.apache.solr.BaseDistributedSearchTestCase.testDistribSearch(BaseDistributedSearchTestCase.java:691)
	at sun.reflect.NativeMethodAccessorImpl.invoke0(Native Method)
	at sun.reflect.NativeMethodAccessorImpl.invoke(NativeMethodAccessorImpl.java:57)
	at sun.reflect.DelegatingMethodAccessorImpl.invoke(DelegatingMethodAccessorImpl.java:43)
	at java.lang.reflect.Method.invoke(Method.java:474)
	at com.carrotsearch.randomizedtesting.RandomizedRunner.invoke(RandomizedRunner.java:1559)
	at com.carrotsearch.randomizedtesting.RandomizedRunner.access$600(RandomizedRunner.java:79)
	at com.carrotsearch.randomizedtesting.RandomizedRunner$6.evaluate(RandomizedRunner.java:737)
	at com.carrotsearch.randomizedtesting.RandomizedRunner$7.evaluate(RandomizedRunner.java:773)
	at com.carrotsearch.randomizedtesting.RandomizedRunner$8.evaluate(RandomizedRunner.java:787)
	at com.carrotsearch.randomizedtesting.rules.SystemPropertiesRestoreRule$1.evaluate(SystemPropertiesRestoreRule.java:53)
	at org.apache.lucene.util.TestRuleSetupTeardownChained$1.evaluate(TestRuleSetupTeardownChained.java:50)
	at org.apache.lucene.util.TestRuleFieldCacheSanity$1.evaluate(TestRuleFieldCacheSanity.java:51)
	at org.apache.lucene.util.AbstractBeforeAfterRule$1.evaluate(AbstractBeforeAfterRule.java:45)
	at com.carrotsearch.randomizedtesting.rules.SystemPropertiesInvariantRule$1.evaluate(SystemPropertiesInvariantRule.java:55)
	at org.apache.lucene.util.TestRuleThreadAndTestName$1.evaluate(TestRuleThreadAndTestName.java:48)
	at org.apache.lucene.util.TestRuleIgnoreAfterMaxFailures$1.evaluate(TestRuleIgnoreAfterMaxFailures.java:70)
	at org.apache.lucene.util.TestRuleMarkFailure$1.evaluate(TestRuleMarkFailure.java:48)
	at com.carrotsearch.randomizedtesting.rules.StatementAdapter.evaluate(StatementAdapter.java:36)
	at com.carrotsearch.randomizedtesting.ThreadLeakControl$StatementRunner.run(ThreadLeakControl.java:345)
	at com.carrotsearch.randomizedtesting.ThreadLeakControl.forkTimeoutingTask(ThreadLeakControl.java:769)
	at com.carrotsearch.randomizedtesting.ThreadLeakControl$3.evaluate(ThreadLeakControl.java:429)
	at com.carrotsearch.randomizedtesting.RandomizedRunner.runSingleTest(RandomizedRunner.java:746)
	at com.carrotsearch.randomizedtesting.RandomizedRunner$3.evaluate(RandomizedRunner.java:648)
	at com.carrotsearch.randomizedtesting.RandomizedRunner$4.evaluate(RandomizedRunner.java:682)
	at com.carrotsearch.randomizedtesting.RandomizedRunner$5.evaluate(RandomizedRunner.java:693)
	at com.carrotsearch.randomizedtesting.rules.StatementAdapter.evaluate(StatementAdapter.java:36)
	at com.carrotsearch.randomizedtesting.rules.SystemPropertiesRestoreRule$1.evaluate(SystemPropertiesRestoreRule.java:53)
	at org.apache.lucene.util.AbstractBeforeAfterRule$1.evaluate(AbstractBeforeAfterRule.java:45)
	at org.apache.lucene.util.TestRuleStoreClassName$1.evaluate(TestRuleStoreClassName.java:42)
	at com.carrotsearch.randomizedtesting.rules.SystemPropertiesInvariantRule$1.evaluate(SystemPropertiesInvariantRule.java:55)
	at com.carrotsearch.randomizedtesting.rules.NoShadowingOrOverridesOnMethodsRule$1.evaluate(NoShadowingOrOverridesOnMethodsRule.java:39)
	at com.carrotsearch.randomizedtesting.rules.NoShadowingOrOverridesOnMethodsRule$1.evaluate(NoShadowingOrOverridesOnMethodsRule.java:39)
	at org.apache.lucene.util.TestRuleAssertionsRequired$1.evaluate(TestRuleAssertionsRequired.java:40)
	at org.apache.lucene.util.TestRuleMarkFailure$1.evaluate(TestRuleMarkFailure.java:48)
	at org.apache.lucene.util.TestRuleIgnoreAfterMaxFailures$1.evaluate(TestRuleIgnoreAfterMaxFailures.java:70)
	at org.apache.lucene.util.TestRuleIgnoreTestSuites$1.evaluate(TestRuleIgnoreTestSuites.java:55)
	at com.carrotsearch.randomizedtesting.rules.StatementAdapter.evaluate(StatementAdapter.java:36)
	at com.carrotsearch.randomizedtesting.ThreadLeakControl$StatementRunner.run(ThreadLeakControl.java:345)
	at java.lang.Thread.run(Thread.java:722)




Build Log:
[...truncated 7062 lines...]
[junit4:junit4] Suite: org.apache.solr.cloud.BasicDistributedZkTest
[junit4:junit4]   2> 2 T750 oas.SolrTestCaseJ4.setUp ###Starting testDistribSearch
[junit4:junit4]   2> Creating dataDir: /mnt/ssd/jenkins/workspace/Lucene-Solr-4.x-Linux/solr/build/solr-core/test/J1/./solrtest-BasicDistributedZkTest-1346461413696
[junit4:junit4]   2> 3 T750 oasc.ZkTestServer.run STARTING ZK TEST SERVER
[junit4:junit4]   2> 4 T751 oazs.ZooKeeperServer.setTickTime tickTime set to 3000
[junit4:junit4]   2> 5 T751 oazs.NIOServerCnxn$Factory.<init> binding to port 0.0.0.0/0.0.0.0:0
[junit4:junit4]   2> 5 T751 oazsp.FileTxnSnapLog.save Snapshotting: 0
[junit4:junit4]   2> 104 T750 oasc.ZkTestServer.run start zk server on port:57909
[junit4:junit4]   2> 104 T750 oaz.ZooKeeper.<init> Initiating client connection, connectString=127.0.0.1:57909 sessionTimeout=10000 watcher=org.apache.solr.common.cloud.ConnectionManager@1ffa055
[junit4:junit4]   2> 105 T756 oaz.ClientCnxn$SendThread.startConnect Opening socket connection to server /127.0.0.1:57909
[junit4:junit4]   2> 105 T750 oascc.ConnectionManager.waitForConnected Waiting for client to connect to ZooKeeper
[junit4:junit4]   2> 106 T756 oaz.ClientCnxn$SendThread.primeConnection Socket connection established to localhost.localdomain/127.0.0.1:57909, initiating session
[junit4:junit4]   2> 106 T752 oazs.NIOServerCnxn$Factory.run Accepted socket connection from /127.0.0.1:41486
[junit4:junit4]   2> 106 T752 oazs.NIOServerCnxn.readConnectRequest Client attempting to establish new session at /127.0.0.1:41486
[junit4:junit4]   2> 106 T754 oazsp.FileTxnLog.append Creating new log file: log.1
[junit4:junit4]   2> 240 T754 oazs.NIOServerCnxn.finishSessionInit Established session 0x1397f5ab1420000 with negotiated timeout 10000 for client /127.0.0.1:41486
[junit4:junit4]   2> 240 T756 oaz.ClientCnxn$SendThread.readConnectResult Session establishment complete on server localhost.localdomain/127.0.0.1:57909, sessionid = 0x1397f5ab1420000, negotiated timeout = 10000
[junit4:junit4]   2> 241 T757 oascc.ConnectionManager.process Watcher org.apache.solr.common.cloud.ConnectionManager@1ffa055 name:ZooKeeperConnection Watcher:127.0.0.1:57909 got event WatchedEvent state:SyncConnected type:None path:null path:null type:None
[junit4:junit4]   2> 241 T750 oascc.ConnectionManager.waitForConnected Client is connected to ZooKeeper
[junit4:junit4]   2> 241 T750 oascc.SolrZkClient.makePath makePath: /solr
[junit4:junit4]   2> 245 T755 oazs.PrepRequestProcessor.pRequest Processed session termination for sessionid: 0x1397f5ab1420000
[junit4:junit4]   2> 246 T757 oaz.ClientCnxn$EventThread.run EventThread shut down
[junit4:junit4]   2> 245 T750 oaz.ZooKeeper.close Session: 0x1397f5ab1420000 closed
[junit4:junit4]   2> 246 T752 oazs.NIOServerCnxn.closeSock Closed socket connection for client /127.0.0.1:41486 which had sessionid 0x1397f5ab1420000
[junit4:junit4]   2> 246 T750 oaz.ZooKeeper.<init> Initiating client connection, connectString=127.0.0.1:57909/solr sessionTimeout=10000 watcher=org.apache.solr.common.cloud.ConnectionManager@172e002
[junit4:junit4]   2> 247 T758 oaz.ClientCnxn$SendThread.startConnect Opening socket connection to server /127.0.0.1:57909
[junit4:junit4]   2> 247 T750 oascc.ConnectionManager.waitForConnected Waiting for client to connect to ZooKeeper
[junit4:junit4]   2> 247 T758 oaz.ClientCnxn$SendThread.primeConnection Socket connection established to localhost.localdomain/127.0.0.1:57909, initiating session
[junit4:junit4]   2> 247 T752 oazs.NIOServerCnxn$Factory.run Accepted socket connection from /127.0.0.1:41487
[junit4:junit4]   2> 247 T752 oazs.NIOServerCnxn.readConnectRequest Client attempting to establish new session at /127.0.0.1:41487
[junit4:junit4]   2> 248 T754 oazs.NIOServerCnxn.finishSessionInit Established session 0x1397f5ab1420001 with negotiated timeout 10000 for client /127.0.0.1:41487
[junit4:junit4]   2> 248 T758 oaz.ClientCnxn$SendThread.readConnectResult Session establishment complete on server localhost.localdomain/127.0.0.1:57909, sessionid = 0x1397f5ab1420001, negotiated timeout = 10000
[junit4:junit4]   2> 248 T759 oascc.ConnectionManager.process Watcher org.apache.solr.common.cloud.ConnectionManager@172e002 name:ZooKeeperConnection Watcher:127.0.0.1:57909/solr got event WatchedEvent state:SyncConnected type:None path:null path:null type:None
[junit4:junit4]   2> 249 T750 oascc.ConnectionManager.waitForConnected Client is connected to ZooKeeper
[junit4:junit4]   2> 249 T750 oascc.SolrZkClient.makePath makePath: /collections/collection1
[junit4:junit4]   2> 251 T750 oascc.SolrZkClient.makePath makePath: /collections/collection1/shards
[junit4:junit4]   2> 252 T750 oascc.SolrZkClient.makePath makePath: /collections/control_collection
[junit4:junit4]   2> 253 T750 oascc.SolrZkClient.makePath makePath: /collections/control_collection/shards
[junit4:junit4]   2> 255 T750 oasc.AbstractZkTestCase.putConfig put /mnt/ssd/jenkins/workspace/Lucene-Solr-4.x-Linux/solr/build/solr-core/test-files/solr/collection1/conf/solrconfig.xml to /configs/conf1/solrconfig.xml
[junit4:junit4]   2> 255 T750 oascc.SolrZkClient.makePath makePath: /configs/conf1/solrconfig.xml
[junit4:junit4]   2> 259 T750 oasc.AbstractZkTestCase.putConfig put /mnt/ssd/jenkins/workspace/Lucene-Solr-4.x-Linux/solr/build/solr-core/test-files/solr/collection1/conf/schema.xml to /configs/conf1/schema.xml
[junit4:junit4]   2> 266 T750 oascc.SolrZkClient.makePath makePath: /configs/conf1/schema.xml
[junit4:junit4]   2> 269 T750 oasc.AbstractZkTestCase.putConfig put /mnt/ssd/jenkins/workspace/Lucene-Solr-4.x-Linux/solr/build/solr-core/test-files/solr/collection1/conf/solrconfig.xml to /configs/conf1/solrconfig.xml
[junit4:junit4]   2> 270 T750 oascc.SolrZkClient.makePath makePath: /configs/conf1/solrconfig.xml
[junit4:junit4]   2> 272 T750 oasc.AbstractZkTestCase.putConfig put /mnt/ssd/jenkins/workspace/Lucene-Solr-4.x-Linux/solr/build/solr-core/test-files/solr/collection1/conf/stopwords.txt to /configs/conf1/stopwords.txt
[junit4:junit4]   2> 273 T750 oascc.SolrZkClient.makePath makePath: /configs/conf1/stopwords.txt
[junit4:junit4]   2> 274 T750 oasc.AbstractZkTestCase.putConfig put /mnt/ssd/jenkins/workspace/Lucene-Solr-4.x-Linux/solr/build/solr-core/test-files/solr/collection1/conf/protwords.txt to /configs/conf1/protwords.txt
[junit4:junit4]   2> 274 T750 oascc.SolrZkClient.makePath makePath: /configs/conf1/protwords.txt
[junit4:junit4]   2> 276 T750 oasc.AbstractZkTestCase.putConfig put /mnt/ssd/jenkins/workspace/Lucene-Solr-4.x-Linux/solr/build/solr-core/test-files/solr/collection1/conf/currency.xml to /configs/conf1/currency.xml
[junit4:junit4]   2> 277 T750 oascc.SolrZkClient.makePath makePath: /configs/conf1/currency.xml
[junit4:junit4]   2> 278 T750 oasc.AbstractZkTestCase.putConfig put /mnt/ssd/jenkins/workspace/Lucene-Solr-4.x-Linux/solr/build/solr-core/test-files/solr/collection1/conf/open-exchange-rates.json to /configs/conf1/open-exchange-rates.json
[junit4:junit4]   2> 279 T750 oascc.SolrZkClient.makePath makePath: /configs/conf1/open-exchange-rates.json
[junit4:junit4]   2> 280 T750 oasc.AbstractZkTestCase.putConfig put /mnt/ssd/jenkins/workspace/Lucene-Solr-4.x-Linux/solr/build/solr-core/test-files/solr/collection1/conf/mapping-ISOLatin1Accent.txt to /configs/conf1/mapping-ISOLatin1Accent.txt
[junit4:junit4]   2> 281 T750 oascc.SolrZkClient.makePath makePath: /configs/conf1/mapping-ISOLatin1Accent.txt
[junit4:junit4]   2> 282 T750 oasc.AbstractZkTestCase.putConfig put /mnt/ssd/jenkins/workspace/Lucene-Solr-4.x-Linux/solr/build/solr-core/test-files/solr/collection1/conf/old_synonyms.txt to /configs/conf1/old_synonyms.txt
[junit4:junit4]   2> 283 T750 oascc.SolrZkClient.makePath makePath: /configs/conf1/old_synonyms.txt
[junit4:junit4]   2> 284 T750 oasc.AbstractZkTestCase.putConfig put /mnt/ssd/jenkins/workspace/Lucene-Solr-4.x-Linux/solr/build/solr-core/test-files/solr/collection1/conf/synonyms.txt to /configs/conf1/synonyms.txt
[junit4:junit4]   2> 285 T750 oascc.SolrZkClient.makePath makePath: /configs/conf1/synonyms.txt
[junit4:junit4]   2> 287 T755 oazs.PrepRequestProcessor.pRequest Processed session termination for sessionid: 0x1397f5ab1420001
[junit4:junit4]   2> 287 T759 oaz.ClientCnxn$EventThread.run EventThread shut down
[junit4:junit4]   2> 287 T752 oazs.NIOServerCnxn.closeSock Closed socket connection for client /127.0.0.1:41487 which had sessionid 0x1397f5ab1420001
[junit4:junit4]   2> 287 T750 oaz.ZooKeeper.close Session: 0x1397f5ab1420001 closed
[junit4:junit4]   2> 330 T750 oejs.Server.doStart jetty-8.1.2.v20120308
[junit4:junit4]   2> 332 T750 oejs.AbstractConnector.doStart Started SocketConnector@0.0.0.0:44054
[junit4:junit4]   2> 333 T750 oasc.SolrResourceLoader.locateSolrHome JNDI not configured for solr (NoInitialContextEx)
[junit4:junit4]   2> 333 T750 oasc.SolrResourceLoader.locateSolrHome using system property solr.solr.home: /mnt/ssd/jenkins/workspace/Lucene-Solr-4.x-Linux/solr/build/solr-core/test-files/control1
[junit4:junit4]   2> 345 T750 oasc.SolrResourceLoader.<init> new SolrResourceLoader for deduced Solr Home: '/mnt/ssd/jenkins/workspace/Lucene-Solr-4.x-Linux/solr/build/solr-core/test-files/control1/'
[junit4:junit4]   2> 358 T750 oass.SolrDispatchFilter.init SolrDispatchFilter.init()
[junit4:junit4]   2> 359 T750 oasc.SolrResourceLoader.locateSolrHome JNDI not configured for solr (NoInitialContextEx)
[junit4:junit4]   2> 359 T750 oasc.SolrResourceLoader.locateSolrHome using system property solr.solr.home: /mnt/ssd/jenkins/workspace/Lucene-Solr-4.x-Linux/solr/build/solr-core/test-files/control1
[junit4:junit4]   2> 360 T750 oasc.CoreContainer$Initializer.initialize looking for solr.xml: /mnt/ssd/jenkins/workspace/Lucene-Solr-4.x-Linux/solr/build/solr-core/test-files/control1/solr.xml
[junit4:junit4]   2> 360 T750 oasc.CoreContainer.<init> New CoreContainer 8820448
[junit4:junit4]   2> 360 T750 oasc.CoreContainer.load Loading CoreContainer using Solr Home: '/mnt/ssd/jenkins/workspace/Lucene-Solr-4.x-Linux/solr/build/solr-core/test-files/control1/'
[junit4:junit4]   2> 361 T750 oasc.SolrResourceLoader.<init> new SolrResourceLoader for directory: '/mnt/ssd/jenkins/workspace/Lucene-Solr-4.x-Linux/solr/build/solr-core/test-files/control1/'
[junit4:junit4]   2> 381 T750 oasc.CoreContainer.load Registering Log Listener
[junit4:junit4]   2> 396 T750 oasc.CoreContainer.initZooKeeper Zookeeper client=127.0.0.1:57909/solr
[junit4:junit4]   2> 397 T750 oaz.ZooKeeper.<init> Initiating client connection, connectString=127.0.0.1:57909/solr sessionTimeout=8000 watcher=org.apache.solr.common.cloud.ConnectionManager@93d997
[junit4:junit4]   2> 397 T769 oaz.ClientCnxn$SendThread.startConnect Opening socket connection to server /127.0.0.1:57909
[junit4:junit4]   2> 397 T750 oascc.ConnectionManager.waitForConnected Waiting for client to connect to ZooKeeper
[junit4:junit4]   2> 398 T769 oaz.ClientCnxn$SendThread.primeConnection Socket connection established to localhost.localdomain/127.0.0.1:57909, initiating session
[junit4:junit4]   2> 398 T752 oazs.NIOServerCnxn$Factory.run Accepted socket connection from /127.0.0.1:41488
[junit4:junit4]   2> 398 T752 oazs.NIOServerCnxn.readConnectRequest Client attempting to establish new session at /127.0.0.1:41488
[junit4:junit4]   2> 399 T754 oazs.NIOServerCnxn.finishSessionInit Established session 0x1397f5ab1420002 with negotiated timeout 8000 for client /127.0.0.1:41488
[junit4:junit4]   2> 399 T769 oaz.ClientCnxn$SendThread.readConnectResult Session establishment complete on server localhost.localdomain/127.0.0.1:57909, sessionid = 0x1397f5ab1420002, negotiated timeout = 8000
[junit4:junit4]   2> 399 T770 oascc.ConnectionManager.process Watcher org.apache.solr.common.cloud.ConnectionManager@93d997 name:ZooKeeperConnection Watcher:127.0.0.1:57909/solr got event WatchedEvent state:SyncConnected type:None path:null path:null type:None
[junit4:junit4]   2> 400 T750 oascc.ConnectionManager.waitForConnected Client is connected to ZooKeeper
[junit4:junit4]   2> 401 T755 oazs.PrepRequestProcessor.pRequest Got user-level KeeperException when processing sessionid:0x1397f5ab1420002 type:create cxid:0x2 zxid:0xfffffffffffffffe txntype:unknown reqpath:n/a Error Path:/solr/overseer Error:KeeperErrorCode = NodeExists for /solr/overseer
[junit4:junit4]   2> 402 T750 oascc.SolrZkClient.makePath makePath: /live_nodes
[junit4:junit4]   2> 403 T750 oasc.ZkController.createEphemeralLiveNode Register node as live in ZooKeeper:/live_nodes/127.0.0.1:44054_solr
[junit4:junit4]   2> 404 T755 oazs.PrepRequestProcessor.pRequest Got user-level KeeperException when processing sessionid:0x1397f5ab1420002 type:delete cxid:0x7 zxid:0xfffffffffffffffe txntype:unknown reqpath:n/a Error Path:/solr/live_nodes/127.0.0.1:44054_solr Error:KeeperErrorCode = NoNode for /solr/live_nodes/127.0.0.1:44054_solr
[junit4:junit4]   2> 404 T750 oascc.SolrZkClient.makePath makePath: /live_nodes/127.0.0.1:44054_solr
[junit4:junit4]   2> 406 T750 oashc.HttpShardHandlerFactory.getParameter Setting socketTimeout to: 0
[junit4:junit4]   2> 407 T750 oashc.HttpShardHandlerFactory.getParameter Setting urlScheme to: http://
[junit4:junit4]   2> 407 T750 oashc.HttpShardHandlerFactory.getParameter Setting connTimeout to: 0
[junit4:junit4]   2> 407 T750 oashc.HttpShardHandlerFactory.getParameter Setting maxConnectionsPerHost to: 20
[junit4:junit4]   2> 408 T750 oashc.HttpShardHandlerFactory.getParameter Setting corePoolSize to: 0
[junit4:junit4]   2> 408 T750 oashc.HttpShardHandlerFactory.getParameter Setting maximumPoolSize to: 2147483647
[junit4:junit4]   2> 408 T750 oashc.HttpShardHandlerFactory.getParameter Setting maxThreadIdleTime to: 5
[junit4:junit4]   2> 409 T750 oashc.HttpShardHandlerFactory.getParameter Setting sizeOfQueue to: -1
[junit4:junit4]   2> 409 T750 oashc.HttpShardHandlerFactory.getParameter Setting fairnessPolicy to: false
[junit4:junit4]   2> 409 T750 oascsi.HttpClientUtil.createClient Creating new http client, config:maxConnectionsPerHost=20&maxConnections=10000&socketTimeout=0&connTimeout=0&retry=false
[junit4:junit4]   2> 420 T750 oascc.SolrZkClient.makePath makePath: /overseer_elect/election
[junit4:junit4]   2> 423 T755 oazs.PrepRequestProcessor.pRequest Got user-level KeeperException when processing sessionid:0x1397f5ab1420002 type:delete cxid:0x15 zxid:0xfffffffffffffffe txntype:unknown reqpath:n/a Error Path:/solr/overseer_elect/leader Error:KeeperErrorCode = NoNode for /solr/overseer_elect/leader
[junit4:junit4]   2> 423 T750 oascc.SolrZkClient.makePath makePath: /overseer_elect/leader
[junit4:junit4]   2> 425 T750 oasc.Overseer.start Overseer (id=88241695208112130-127.0.0.1:44054_solr-n_0000000000) starting
[junit4:junit4]   2> 425 T755 oazs.PrepRequestProcessor.pRequest Got user-level KeeperException when processing sessionid:0x1397f5ab1420002 type:create cxid:0x1a zxid:0xfffffffffffffffe txntype:unknown reqpath:n/a Error Path:/solr/overseer Error:KeeperErrorCode = NodeExists for /solr/overseer
[junit4:junit4]   2> 426 T755 oazs.PrepRequestProcessor.pRequest Got user-level KeeperException when processing sessionid:0x1397f5ab1420002 type:create cxid:0x1b zxid:0xfffffffffffffffe txntype:unknown reqpath:n/a Error Path:/solr/overseer Error:KeeperErrorCode = NodeExists for /solr/overseer
[junit4:junit4]   2> 426 T755 oazs.PrepRequestProcessor.pRequest Got user-level KeeperException when processing sessionid:0x1397f5ab1420002 type:create cxid:0x1c zxid:0xfffffffffffffffe txntype:unknown reqpath:n/a Error Path:/solr/overseer Error:KeeperErrorCode = NodeExists for /solr/overseer
[junit4:junit4]   2> 427 T755 oazs.PrepRequestProcessor.pRequest Got user-level KeeperException when processing sessionid:0x1397f5ab1420002 type:create cxid:0x1d zxid:0xfffffffffffffffe txntype:unknown reqpath:n/a Error Path:/solr/overseer Error:KeeperErrorCode = NodeExists for /solr/overseer
[junit4:junit4]   2> 428 T772 oasc.OverseerCollectionProcessor.run Process current queue of collection creations
[junit4:junit4]   2> 428 T750 oascc.SolrZkClient.makePath makePath: /clusterstate.json
[junit4:junit4]   2> 430 T750 oascc.ZkStateReader.createClusterStateWatchersAndUpdate Updating cluster state from ZooKeeper... 
[junit4:junit4]   2> 431 T771 oasc.Overseer$ClusterStateUpdater.run Starting to work on the main queue
[junit4:junit4]   2> 434 T750 oasc.CoreContainer.create Creating SolrCore 'collection1' using instanceDir: /mnt/ssd/jenkins/workspace/Lucene-Solr-4.x-Linux/solr/build/solr-core/test-files/control1/collection1
[junit4:junit4]   2> 434 T750 oasc.ZkController.createCollectionZkNode Check for collection zkNode:control_collection
[junit4:junit4]   2> 435 T750 oasc.ZkController.createCollectionZkNode Collection zkNode exists
[junit4:junit4]   2> 435 T750 oasc.ZkController.readConfigName Load collection config from:/collections/control_collection
[junit4:junit4]   2> 436 T750 oasc.SolrResourceLoader.<init> new SolrResourceLoader for directory: '/mnt/ssd/jenkins/workspace/Lucene-Solr-4.x-Linux/solr/build/solr-core/test-files/control1/collection1/'
[junit4:junit4]   2> 437 T750 oasc.SolrResourceLoader.replaceClassLoader Adding 'file:/mnt/ssd/jenkins/workspace/Lucene-Solr-4.x-Linux/solr/build/solr-core/test-files/control1/collection1/lib/README' to classloader
[junit4:junit4]   2> 437 T750 oasc.SolrResourceLoader.replaceClassLoader Adding 'file:/mnt/ssd/jenkins/workspace/Lucene-Solr-4.x-Linux/solr/build/solr-core/test-files/control1/collection1/lib/classes/' to classloader
[junit4:junit4]   2> 487 T750 oasc.SolrConfig.<init> Using Lucene MatchVersion: LUCENE_40
[junit4:junit4]   2> 579 T750 oasc.SolrConfig.<init> Loaded SolrConfig: solrconfig.xml
[junit4:junit4]   2> 581 T750 oass.IndexSchema.readSchema Reading Solr Schema
[junit4:junit4]   2> 585 T750 oass.IndexSchema.readSchema Schema name=test
[junit4:junit4]   2> 1503 T750 oass.OpenExchangeRatesOrgProvider.init Initialized with rates=open-exchange-rates.json, refreshInterval=1440.
[junit4:junit4]   2> 1523 T750 oass.IndexSchema.readSchema default search field in schema is text
[junit4:junit4]   2> 1526 T750 oass.IndexSchema.readSchema unique key field: id
[junit4:junit4]   2> 1538 T750 oass.FileExchangeRateProvider.reload Reloading exchange rates from file currency.xml
[junit4:junit4]   2> 1542 T750 oass.FileExchangeRateProvider.reload Reloading exchange rates from file currency.xml
[junit4:junit4]   2> 1554 T750 oass.OpenExchangeRatesOrgProvider.reload Reloading exchange rates from open-exchange-rates.json
[junit4:junit4]   2> 1555 T750 oass.OpenExchangeRatesOrgProvider.reload Reloading exchange rates from open-exchange-rates.json
[junit4:junit4]   2> 1556 T750 oasc.SolrCore.<init> [collection1] Opening new SolrCore at /mnt/ssd/jenkins/workspace/Lucene-Solr-4.x-Linux/solr/build/solr-core/test-files/control1/collection1/, dataDir=/mnt/ssd/jenkins/workspace/Lucene-Solr-4.x-Linux/solr/build/solr-core/test-files/control1/collection1/data/
[junit4:junit4]   2> 1557 T750 oasc.JmxMonitoredMap.<init> JMX monitoring is enabled. Adding Solr mbeans to JMX Server: com.sun.jmx.mbeanserver.JmxMBeanServer@1ddd557
[junit4:junit4]   2> 1565 T750 oasc.SolrCore.getNewIndexDir WARNING New index directory detected: old=null new=/mnt/ssd/jenkins/workspace/Lucene-Solr-4.x-Linux/solr/build/solr-core/test-files/control1/collection1/data/index/
[junit4:junit4]   2> 1566 T750 oasc.SolrCore.initIndex WARNING [collection1] Solr index directory '/mnt/ssd/jenkins/workspace/Lucene-Solr-4.x-Linux/solr/build/solr-core/test-files/control1/collection1/data/index' doesn't exist. Creating new index...
[junit4:junit4]   2> 1566 T750 oasc.CachingDirectoryFactory.get return new directory for /mnt/ssd/jenkins/workspace/Lucene-Solr-4.x-Linux/solr/build/solr-core/test-files/control1/collection1/data/index forceNew:false
[junit4:junit4]   2> 1633 T750 oasc.SolrDeletionPolicy.onCommit SolrDeletionPolicy.onCommit: commits:num=1
[junit4:junit4]   2> 		commit{dir=NRTCachingDirectory(org.apache.lucene.store.NIOFSDirectory@/mnt/ssd/jenkins/workspace/Lucene-Solr-4.x-Linux/solr/build/solr-core/test-files/control1/collection1/data/index lockFactory=org.apache.lucene.store.NativeFSLockFactory@eba774; maxCacheMB=48.0 maxMergeSizeMB=4.0),segFN=segments_1,generation=1,filenames=[segments_1]
[junit4:junit4]   2> 1633 T750 oasc.SolrDeletionPolicy.updateCommits newest commit = 1
[junit4:junit4]   2> 1634 T750 oasc.SolrCore.initWriters created xml: solr.XMLResponseWriter
[junit4:junit4]   2> 1635 T750 oasup.UpdateRequestProcessorChain.init inserting DistributedUpdateProcessorFactory into updateRequestProcessorChain "dedupe"
[junit4:junit4]   2> 1636 T750 oasup.UpdateRequestProcessorChain.init inserting DistributedUpdateProcessorFactory into updateRequestProcessorChain "dedupe-allfields"
[junit4:junit4]   2> 1636 T750 oasup.UpdateRequestProcessorChain.init inserting DistributedUpdateProcessorFactory into updateRequestProcessorChain "stored_sig"
[junit4:junit4]   2> 1637 T750 oasup.UpdateRequestProcessorChain.init inserting DistributedUpdateProcessorFactory into updateRequestProcessorChain "uniq-fields"
[junit4:junit4]   2> 1637 T750 oasup.UpdateRequestProcessorChain.init inserting DistributedUpdateProcessorFactory into updateRequestProcessorChain "distrib-dup-test-chain-implicit"
[junit4:junit4]   2> 1638 T750 oasc.RequestHandlers.initHandlersFromConfig adding lazy requestHandler: solr.ReplicationHandler
[junit4:junit4]   2> 1638 T750 oasc.RequestHandlers.initHandlersFromConfig created /replication: solr.ReplicationHandler
[junit4:junit4]   2> 1638 T750 oasc.RequestHandlers.initHandlersFromConfig created standard: solr.StandardRequestHandler
[junit4:junit4]   2> 1639 T750 oasc.RequestHandlers.initHandlersFromConfig created /get: solr.RealTimeGetHandler
[junit4:junit4]   2> 1639 T750 oasc.RequestHandlers.initHandlersFromConfig created dismax: solr.SearchHandler
[junit4:junit4]   2> 1640 T750 oasc.RequestHandlers.initHandlersFromConfig created mock: org.apache.solr.core.MockQuerySenderListenerReqHandler
[junit4:junit4]   2> 1640 T750 oasc.RequestHandlers.initHandlersFromConfig created /admin/: org.apache.solr.handler.admin.AdminHandlers
[junit4:junit4]   2> 1641 T750 oasc.RequestHandlers.initHandlersFromConfig created defaults: solr.StandardRequestHandler
[junit4:junit4]   2> 1641 T750 oasc.RequestHandlers.initHandlersFromConfig adding lazy requestHandler: solr.StandardRequestHandler
[junit4:junit4]   2> 1642 T750 oasc.RequestHandlers.initHandlersFromConfig created lazy: solr.StandardRequestHandler
[junit4:junit4]   2> 1642 T750 oasc.RequestHandlers.initHandlersFromConfig created /update: solr.UpdateRequestHandler
[junit4:junit4]   2> 1643 T750 oasc.RequestHandlers.initHandlersFromConfig created /terms: org.apache.solr.handler.component.SearchHandler
[junit4:junit4]   2> 1644 T750 oasc.RequestHandlers.initHandlersFromConfig created spellCheckCompRH: org.apache.solr.handler.component.SearchHandler
[junit4:junit4]   2> 1644 T750 oasc.RequestHandlers.initHandlersFromConfig created spellCheckCompRH_Direct: org.apache.solr.handler.component.SearchHandler
[junit4:junit4]   2> 1645 T750 oasc.RequestHandlers.initHandlersFromConfig created spellCheckWithWordbreak: org.apache.solr.handler.component.SearchHandler
[junit4:junit4]   2> 1645 T750 oasc.RequestHandlers.initHandlersFromConfig created spellCheckWithWordbreak_Direct: org.apache.solr.handler.component.SearchHandler
[junit4:junit4]   2> 1646 T750 oasc.RequestHandlers.initHandlersFromConfig created spellCheckCompRH1: org.apache.solr.handler.component.SearchHandler
[junit4:junit4]   2> 1646 T750 oasc.RequestHandlers.initHandlersFromConfig created tvrh: org.apache.solr.handler.component.SearchHandler
[junit4:junit4]   2> 1647 T750 oasc.RequestHandlers.initHandlersFromConfig created /mlt: solr.MoreLikeThisHandler
[junit4:junit4]   2> 1647 T750 oasc.RequestHandlers.initHandlersFromConfig created /debug/dump: solr.DumpRequestHandler
[junit4:junit4]   2> 1648 T750 oashl.XMLLoader.init xsltCacheLifetimeSeconds=60
[junit4:junit4]   2> 1650 T750 oasc.SolrCore.initDeprecatedSupport WARNING solrconfig.xml uses deprecated <admin/gettableFiles>, Please update your config to use the ShowFileRequestHandler.
[junit4:junit4]   2> 1651 T750 oasc.SolrCore.initDeprecatedSupport WARNING adding ShowFileRequestHandler with hidden files: [STOPWORDS.TXT, SCHEMA.XML, OPEN-EXCHANGE-RATES.JSON, SYNONYMS.TXT, MAPPING-ISOLATIN1ACCENT.TXT, OLD_SYNONYMS.TXT, CURRENCY.XML, PROTWORDS.TXT]
[junit4:junit4]   2> 1653 T750 oass.SolrIndexSearcher.<init> Opening Searcher@d1f328 main
[junit4:junit4]   2> 1654 T750 oasu.CommitTracker.<init> Hard AutoCommit: disabled
[junit4:junit4]   2> 1654 T750 oasu.CommitTracker.<init> Soft AutoCommit: disabled
[junit4:junit4]   2> 1655 T750 oashc.SpellCheckComponent.inform Initializing spell checkers
[junit4:junit4]   2> 1669 T750 oass.DirectSolrSpellChecker.init init: {name=direct,classname=DirectSolrSpellChecker,field=lowerfilt,minQueryLength=3}
[junit4:junit4]   2> 4693 T773 oasc.SolrCore.registerSearcher [collection1] Registered new searcher Searcher@d1f328 main{StandardDirectoryReader(segments_1:1)}
[junit4:junit4]   2> 4696 T755 oazs.PrepRequestProcessor.pRequest Got user-level KeeperException when processing sessionid:0x1397f5ab1420002 type:create cxid:0x68 zxid:0xfffffffffffffffe txntype:unknown reqpath:n/a Error Path:/solr/overseer/queue Error:KeeperErrorCode = NoNode for /solr/overseer/queue
[junit4:junit4]   2> 4698 T750 oasc.CoreContainer.register registering core: collection1
[junit4:junit4]   2> 4699 T750 oasc.ZkController.register Register shard - core:collection1 address:http://127.0.0.1:44054/solr shardId:control_shard
[junit4:junit4]   2> 4700 T750 oascc.SolrZkClient.makePath makePath: /collections/control_collection/leader_elect/control_shard/election
[junit4:junit4]   2> 4703 T755 oazs.PrepRequestProcessor.pRequest Got user-level KeeperException when processing sessionid:0x1397f5ab1420002 type:delete cxid:0x77 zxid:0xfffffffffffffffe txntype:unknown reqpath:n/a Error Path:/solr/collections/control_collection/leaders Error:KeeperErrorCode = NoNode for /solr/collections/control_collection/leaders
[junit4:junit4]   2> 4704 T755 oazs.PrepRequestProcessor.pRequest Got user-level KeeperException when processing sessionid:0x1397f5ab1420002 type:create cxid:0x78 zxid:0xfffffffffffffffe txntype:unknown reqpath:n/a Error Path:/solr/overseer Error:KeeperErrorCode = NodeExists for /solr/overseer
[junit4:junit4]   2> 4705 T750 oasc.ShardLeaderElectionContext.waitForReplicasToComeUp Running the leader process. afterExperiation=false
[junit4:junit4]   2> 4968 T771 oascc.ZkStateReader.updateClusterState Updating cloud state from ZooKeeper... 
[junit4:junit4]   2> 4969 T755 oazs.PrepRequestProcessor.pRequest Got user-level KeeperException when processing sessionid:0x1397f5ab1420002 type:create cxid:0x7f zxid:0xfffffffffffffffe txntype:unknown reqpath:n/a Error Path:/solr/overseer/queue-work Error:KeeperErrorCode = NoNode for /solr/overseer/queue-work
[junit4:junit4]   2> 4973 T770 oascc.ZkStateReader$2.process A cluster state change has occurred - updating...
[junit4:junit4]   2> 5705 T750 oasc.ShardLeaderElectionContext.waitForReplicasToComeUp Enough replicas found to continue.
[junit4:junit4]   2> 5706 T750 oasc.ShardLeaderElectionContext.runLeaderProcess I am the new leader: http://127.0.0.1:44054/solr/collection1/
[junit4:junit4]   2> 6206 T750 oascc.SolrZkClient.makePath makePath: /collections/control_collection/leaders/control_shard
[junit4:junit4]   2> 6210 T755 oazs.PrepRequestProcessor.pRequest Got user-level KeeperException when processing sessionid:0x1397f5ab1420002 type:create cxid:0xa2 zxid:0xfffffffffffffffe txntype:unknown reqpath:n/a Error Path:/solr/overseer Error:KeeperErrorCode = NodeExists for /solr/overseer
[junit4:junit4]   2> 6480 T771 oascc.ZkStateReader.updateClusterState Updating cloud state from ZooKeeper... 
[junit4:junit4]   2> 6483 T770 oascc.ZkStateReader$2.process A cluster state change has occurred - updating...
[junit4:junit4]   2> 6512 T750 oasc.ZkController.register We are http://127.0.0.1:44054/solr/collection1/ and leader is http://127.0.0.1:44054/solr/collection1/
[junit4:junit4]   2> 6512 T750 oasc.ZkController.register No LogReplay needed for core=collection1 baseURL=http://127.0.0.1:44054/solr
[junit4:junit4]   2> 6513 T750 oasc.ZkController.checkRecovery I am the leader, no recovery necessary
[junit4:junit4]   2> 6515 T750 oascc.ZkStateReader.updateClusterState Updating cloud state from ZooKeeper... 
[junit4:junit4]   2> 6515 T750 oass.SolrDispatchFilter.init user.dir=/mnt/ssd/jenkins/workspace/Lucene-Solr-4.x-Linux/solr/build/solr-core/test/J1
[junit4:junit4]   2> 6516 T750 oass.SolrDispatchFilter.init SolrDispatchFilter.init() done
[junit4:junit4]   2> 6516 T750 oascsi.HttpClientUtil.createClient Creating new http client, config:maxConnections=128&maxConnectionsPerHost=32&followRedirects=false
[junit4:junit4]   2> 6569 T750 oejs.Server.doStart jetty-8.1.2.v20120308
[junit4:junit4]   2> 6571 T750 oejs.AbstractConnector.doStart Started SocketConnector@0.0.0.0:50065
[junit4:junit4]   2> 6571 T750 oasc.SolrResourceLoader.locateSolrHome JNDI not configured for solr (NoInitialContextEx)
[junit4:junit4]   2> 6572 T750 oasc.SolrResourceLoader.locateSolrHome using system property solr.solr.home: /mnt/ssd/jenkins/workspace/Lucene-Solr-4.x-Linux/solr/build/solr-core/test-files/jetty2
[junit4:junit4]   2> 6572 T750 oasc.SolrResourceLoader.<init> new SolrResourceLoader for deduced Solr Home: '/mnt/ssd/jenkins/workspace/Lucene-Solr-4.x-Linux/solr/build/solr-core/test-files/jetty2/'
[junit4:junit4]   2> 6592 T750 oass.SolrDispatchFilter.init SolrDispatchFilter.init()
[junit4:junit4]   2> 6593 T750 oasc.SolrResourceLoader.locateSolrHome JNDI not configured for solr (NoInitialContextEx)
[junit4:junit4]   2> 6593 T750 oasc.SolrResourceLoader.locateSolrHome using system property solr.solr.home: /mnt/ssd/jenkins/workspace/Lucene-Solr-4.x-Linux/solr/build/solr-core/test-files/jetty2
[junit4:junit4]   2> 6593 T750 oasc.CoreContainer$Initializer.initialize looking for solr.xml: /mnt/ssd/jenkins/workspace/Lucene-Solr-4.x-Linux/solr/build/solr-core/test-files/jetty2/solr.xml
[junit4:junit4]   2> 6594 T750 oasc.CoreContainer.<init> New CoreContainer 15869842
[junit4:junit4]   2> 6594 T750 oasc.CoreContainer.load Loading CoreContainer using Solr Home: '/mnt/ssd/jenkins/workspace/Lucene-Solr-4.x-Linux/solr/build/solr-core/test-files/jetty2/'
[junit4:junit4]   2> 6594 T750 oasc.SolrResourceLoader.<init> new SolrResourceLoader for directory: '/mnt/ssd/jenkins/workspace/Lucene-Solr-4.x-Linux/solr/build/solr-core/test-files/jetty2/'
[junit4:junit4]   2> 6614 T750 oasc.CoreContainer.load Registering Log Listener
[junit4:junit4]   2> 6629 T750 oasc.CoreContainer.initZooKeeper Zookeeper client=127.0.0.1:57909/solr
[junit4:junit4]   2> 6630 T750 oaz.ZooKeeper.<init> Initiating client connection, connectString=127.0.0.1:57909/solr sessionTimeout=8000 watcher=org.apache.solr.common.cloud.ConnectionManager@166c64f
[junit4:junit4]   2> 6631 T783 oaz.ClientCnxn$SendThread.startConnect Opening socket connection to server /127.0.0.1:57909
[junit4:junit4]   2> 6631 T750 oascc.ConnectionManager.waitForConnected Waiting for client to connect to ZooKeeper
[junit4:junit4]   2> 6631 T783 oaz.ClientCnxn$SendThread.primeConnection Socket connection established to localhost.localdomain/127.0.0.1:57909, initiating session
[junit4:junit4]   2> 6632 T752 oazs.NIOServerCnxn$Factory.run Accepted socket connection from /127.0.0.1:41490
[junit4:junit4]   2> 6632 T752 oazs.NIOServerCnxn.readConnectRequest Client attempting to establish new session at /127.0.0.1:41490
[junit4:junit4]   2> 6633 T754 oazs.NIOServerCnxn.finishSessionInit Established session 0x1397f5ab1420003 with negotiated timeout 8000 for client /127.0.0.1:41490
[junit4:junit4]   2> 6633 T783 oaz.ClientCnxn$SendThread.readConnectResult Session establishment complete on server localhost.localdomain/127.0.0.1:57909, sessionid = 0x1397f5ab1420003, negotiated timeout = 8000
[junit4:junit4]   2> 6633 T784 oascc.ConnectionManager.process Watcher org.apache.solr.common.cloud.ConnectionManager@166c64f name:ZooKeeperConnection Watcher:127.0.0.1:57909/solr got event WatchedEvent state:SyncConnected type:None path:null path:null type:None
[junit4:junit4]   2> 6633 T750 oascc.ConnectionManager.waitForConnected Client is connected to ZooKeeper
[junit4:junit4]   2> 6634 T755 oazs.PrepRequestProcessor.pRequest Got user-level KeeperException when processing sessionid:0x1397f5ab1420003 type:create cxid:0x1 zxid:0xfffffffffffffffe txntype:unknown reqpath:n/a Error Path:/solr/overseer Error:KeeperErrorCode = NodeExists for /solr/overseer
[junit4:junit4]   2> 6635 T755 oazs.PrepRequestProcessor.pRequest Got user-level KeeperException when processing sessionid:0x1397f5ab1420003 type:create cxid:0x2 zxid:0xfffffffffffffffe txntype:unknown reqpath:n/a Error Path:/solr/overseer Error:KeeperErrorCode = NodeExists for /solr/overseer
[junit4:junit4]   2> 6636 T750 oasc.ZkController.createEphemeralLiveNode Register node as live in ZooKeeper:/live_nodes/127.0.0.1:50065_solr
[junit4:junit4]   2> 6636 T755 oazs.PrepRequestProcessor.pRequest Got user-level KeeperException when processing sessionid:0x1397f5ab1420003 type:delete cxid:0x4 zxid:0xfffffffffffffffe txntype:unknown reqpath:n/a Error Path:/solr/live_nodes/127.0.0.1:50065_solr Error:KeeperErrorCode = NoNode for /solr/live_nodes/127.0.0.1:50065_solr
[junit4:junit4]   2> 6637 T750 oascc.SolrZkClient.makePath makePath: /live_nodes/127.0.0.1:50065_solr
[junit4:junit4]   2> 6638 T770 oascc.ZkStateReader$3.process Updating live nodes
[junit4:junit4]   2> 6638 T750 oashc.HttpShardHandlerFactory.getParameter Setting socketTimeout to: 0
[junit4:junit4]   2> 6639 T750 oashc.HttpShardHandlerFactory.getParameter Setting urlScheme to: http://
[junit4:junit4]   2> 6639 T750 oashc.HttpShardHandlerFactory.getParameter Setting connTimeout to: 0
[junit4:junit4]   2> 6639 T750 oashc.HttpShardHandlerFactory.getParameter Setting maxConnectionsPerHost to: 20
[junit4:junit4]   2> 6640 T750 oashc.HttpShardHandlerFactory.getParameter Setting corePoolSize to: 0
[junit4:junit4]   2> 6640 T750 oashc.HttpShardHandlerFactory.getParameter Setting maximumPoolSize to: 2147483647
[junit4:junit4]   2> 6640 T750 oashc.HttpShardHandlerFactory.getParameter Setting maxThreadIdleTime to: 5
[junit4:junit4]   2> 6641 T750 oashc.HttpShardHandlerFactory.getParameter Setting sizeOfQueue to: -1
[junit4:junit4]   2> 6641 T750 oashc.HttpShardHandlerFactory.getParameter Setting fairnessPolicy to: false
[junit4:junit4]   2> 6641 T750 oascsi.HttpClientUtil.createClient Creating new http client, config:maxConnectionsPerHost=20&maxConnections=10000&socketTimeout=0&connTimeout=0&retry=false
[junit4:junit4]   2> 6646 T750 oascc.ZkStateReader.createClusterStateWatchersAndUpdate Updating cluster state from ZooKeeper... 
[junit4:junit4]   2> 6650 T750 oasc.CoreContainer.create Creating SolrCore 'collection1' using instanceDir: /mnt/ssd/jenkins/workspace/Lucene-Solr-4.x-Linux/solr/build/solr-core/test-files/jetty2/collection1
[junit4:junit4]   2> 6650 T750 oasc.ZkController.createCollectionZkNode Check for collection zkNode:collection1
[junit4:junit4]   2> 6651 T750 oasc.ZkController.createCollectionZkNode Collection zkNode exists
[junit4:junit4]   2> 6651 T750 oasc.ZkController.readConfigName Load collection config from:/collections/collection1
[junit4:junit4]   2> 6652 T750 oasc.SolrResourceLoader.<init> new SolrResourceLoader for directory: '/mnt/ssd/jenkins/workspace/Lucene-Solr-4.x-Linux/solr/build/solr-core/test-files/jetty2/collection1/'
[junit4:junit4]   2> 6653 T750 oasc.SolrResourceLoader.replaceClassLoader Adding 'file:/mnt/ssd/jenkins/workspace/Lucene-Solr-4.x-Linux/solr/build/solr-core/test-files/jetty2/collection1/lib/README' to classloader
[junit4:junit4]   2> 6654 T750 oasc.SolrResourceLoader.replaceClassLoader Adding 'file:/mnt/ssd/jenkins/workspace/Lucene-Solr-4.x-Linux/solr/build/solr-core/test-files/jetty2/collection1/lib/classes/' to classloader
[junit4:junit4]   2> 6707 T750 oasc.SolrConfig.<init> Using Lucene MatchVersion: LUCENE_40
[junit4:junit4]   2> 6786 T750 oasc.SolrConfig.<init> Loaded SolrConfig: solrconfig.xml
[junit4:junit4]   2> 6787 T750 oass.IndexSchema.readSchema Reading Solr Schema
[junit4:junit4]   2> 6791 T750 oass.IndexSchema.readSchema Schema name=test
[junit4:junit4]   2> 6992 T771 oascc.ZkStateReader.updateClusterState Updating cloud state from ZooKeeper... 
[junit4:junit4]   2> 6995 T770 oascc.ZkStateReader$2.process A cluster state change has occurred - updating...
[junit4:junit4]   2> 6995 T784 oascc.ZkStateReader$2.process A cluster state change has occurred - updating...
[junit4:junit4]   2> 7552 T750 oass.OpenExchangeRatesOrgProvider.init Initialized with rates=open-exchange-rates.json, refreshInterval=1440.
[junit4:junit4]   2> 7558 T750 oass.IndexSchema.readSchema default search field in schema is text
[junit4:junit4]   2> 7561 T750 oass.IndexSchema.readSchema unique key field: id
[junit4:junit4]   2> 7582 T750 oass.FileExchangeRateProvider.reload Reloading exchange rates from file currency.xml
[junit4:junit4]   2> 7585 T750 oass.FileExchangeRateProvider.reload Reloading exchange rates from file currency.xml
[junit4:junit4]   2> 7588 T750 oass.OpenExchangeRatesOrgProvider.reload Reloading exchange rates from open-exchange-rates.json
[junit4:junit4]   2> 7589 T750 oass.OpenExchangeRatesOrgProvider.reload Reloading exchange rates from open-exchange-rates.json
[junit4:junit4]   2> 7590 T750 oasc.SolrCore.<init> [collection1] Opening new SolrCore at /mnt/ssd/jenkins/workspace/Lucene-Solr-4.x-Linux/solr/build/solr-core/test-files/jetty2/collection1/, dataDir=/mnt/ssd/jenkins/workspace/Lucene-Solr-4.x-Linux/solr/build/solr-core/test-files/jetty2/collection1/data/
[junit4:junit4]   2> 7590 T750 oasc.JmxMonitoredMap.<init> JMX monitoring is enabled. Adding Solr mbeans to JMX Server: com.sun.jmx.mbeanserver.JmxMBeanServer@1ddd557
[junit4:junit4]   2> 7591 T750 oasc.SolrCore.getNewIndexDir WARNING New index directory detected: old=null new=/mnt/ssd/jenkins/workspace/Lucene-Solr-4.x-Linux/solr/build/solr-core/test-files/jetty2/collection1/data/index/
[junit4:junit4]   2> 7591 T750 oasc.SolrCore.initIndex WARNING [collection1] Solr index directory '/mnt/ssd/jenkins/workspace/Lucene-Solr-4.x-Linux/solr/build/solr-core/test-files/jetty2/collection1/data/index' doesn't exist. Creating new index...
[junit4:junit4]   2> 7592 T750 oasc.CachingDirectoryFactory.get return new directory for /mnt/ssd/jenkins/workspace/Lucene-Solr-4.x-Linux/solr/build/solr-core/test-files/jetty2/collection1/data/index forceNew:false
[junit4:junit4]   2> 7595 T750 oasc.SolrDeletionPolicy.onCommit SolrDeletionPolicy.onCommit: commits:num=1
[junit4:junit4]   2> 		commit{dir=NRTCachingDirectory(org.apache.lucene.store.NIOFSDirectory@/mnt/ssd/jenkins/workspace/Lucene-Solr-4.x-Linux/solr/build/solr-core/test-files/jetty2/collection1/data/index lockFactory=org.apache.lucene.store.NativeFSLockFactory@1696cdc; maxCacheMB=48.0 maxMergeSizeMB=4.0),segFN=segments_1,generation=1,filenames=[segments_1]
[junit4:junit4]   2> 7596 T750 oasc.SolrDeletionPolicy.updateCommits newest commit = 1
[junit4:junit4]   2> 7596 T750 oasc.SolrCore.initWriters created xml: solr.XMLResponseWriter
[junit4:junit4]   2> 7598 T750 oasup.UpdateRequestProcessorChain.init inserting DistributedUpdateProcessorFactory into updateRequestProcessorChain "dedupe"
[junit4:junit4]   2> 7598 T750 oasup.UpdateRequestProcessorChain.init inserting DistributedUpdateProcessorFactory into updateRequestProcessorChain "dedupe-allfields"
[junit4:junit4]   2> 7599 T750 oasup.UpdateRequestProcessorChain.init inserting DistributedUpdateProcessorFactory into updateRequestProcessorChain "stored_sig"
[junit4:junit4]   2> 7599 T750 oasup.UpdateRequestProcessorChain.init inserting DistributedUpdateProcessorFactory into updateRequestProcessorChain "uniq-fields"
[junit4:junit4]   2> 7600 T750 oasup.UpdateRequestProcessorChain.init inserting DistributedUpdateProcessorFactory into updateRequestProcessorChain "distrib-dup-test-chain-implicit"
[junit4:junit4]   2> 7600 T750 oasc.RequestHandlers.initHandlersFromConfig adding lazy requestHandler: solr.ReplicationHandler
[junit4:junit4]   2> 7600 T750 oasc.RequestHandlers.initHandlersFromConfig created /replication: solr.ReplicationHandler
[junit4:junit4]   2> 7601 T750 oasc.RequestHandlers.initHandlersFromConfig created standard: solr.StandardRequestHandler
[junit4:junit4]   2> 7601 T750 oasc.RequestHandlers.initHandlersFromConfig created /get: solr.RealTimeGetHandler
[junit4:junit4]   2> 7602 T750 oasc.RequestHandlers.initHandlersFromConfig created dismax: solr.SearchHandler
[junit4:junit4]   2> 7602 T750 oasc.RequestHandlers.initHandlersFromConfig created mock: org.apache.solr.core.MockQuerySenderListenerReqHandler
[junit4:junit4]   2> 7603 T750 oasc.RequestHandlers.initHandlersFromConfig created /admin/: org.apache.solr.handler.admin.AdminHandlers
[junit4:junit4]   2> 7603 T750 oasc.RequestHandlers.initHandlersFromConfig created defaults: solr.StandardRequestHandler
[junit4:junit4]   2> 7604 T750 oasc.RequestHandlers.initHandlersFromConfig adding lazy requestHandler: solr.StandardRequestHandler
[junit4:junit4]   2> 7604 T750 oasc.RequestHandlers.initHandlersFromConfig created lazy: solr.StandardRequestHandler
[junit4:junit4]   2> 7605 T750 oasc.RequestHandlers.initHandlersFromConfig created /update: solr.UpdateRequestHandler
[junit4:junit4]   2> 7605 T750 oasc.RequestHandlers.initHandlersFromConfig created /terms: org.apache.solr.handler.component.SearchHandler
[junit4:junit4]   2> 7606 T750 oasc.RequestHandlers.initHandlersFromConfig created spellCheckCompRH: org.apache.solr.handler.component.SearchHandler
[junit4:junit4]   2> 7606 T750 oasc.RequestHandlers.initHandlersFromConfig created spellCheckCompRH_Direct: org.apache.solr.handler.component.SearchHandler
[junit4:junit4]   2> 7607 T750 oasc.RequestHandlers.initHandlersFromConfig created spellCheckWithWordbreak: org.apache.solr.handler.component.SearchHandler
[junit4:junit4]   2> 7607 T750 oasc.RequestHandlers.initHandlersFromConfig created spellCheckWithWordbreak_Direct: org.apache.solr.handler.component.SearchHandler
[junit4:junit4]   2> 7608 T750 oasc.RequestHandlers.initHandlersFromConfig created spellCheckCompRH1: org.apache.solr.handler.component.SearchHandler
[junit4:junit4]   2> 7615 T750 oasc.RequestHandlers.initHandlersFromConfig created tvrh: org.apache.solr.handler.component.SearchHandler
[junit4:junit4]   2> 7616 T750 oasc.RequestHandlers.initHandlersFromConfig created /mlt: solr.MoreLikeThisHandler
[junit4:junit4]   2> 7617 T750 oasc.RequestHandlers.initHandlersFromConfig created /debug/dump: solr.DumpRequestHandler
[junit4:junit4]   2> 7618 T750 oashl.XMLLoader.init xsltCacheLifetimeSeconds=60
[junit4:junit4]   2> 7619 T750 oasc.SolrCore.initDeprecatedSupport WARNING solrconfig.xml uses deprecated <admin/gettableFiles>, Please update your config to use the ShowFileRequestHandler.
[junit4:junit4]   2> 7620 T750 oasc.SolrCore.initDeprecatedSupport WARNING adding ShowFileRequestHandler with hidden files: [STOPWORDS.TXT, SCHEMA.XML, OPEN-EXCHANGE-RATES.JSON, SYNONYMS.TXT, MAPPING-ISOLATIN1ACCENT.TXT, OLD_SYNONYMS.TXT, CURRENCY.XML, PROTWORDS.TXT]
[junit4:junit4]   2> 7622 T750 oass.SolrIndexSearcher.<init> Opening Searcher@79edb main
[junit4:junit4]   2> 7623 T750 oasu.CommitTracker.<init> Hard AutoCommit: disabled
[junit4:junit4]   2> 7624 T750 oasu.CommitTracker.<init> Soft AutoCommit: disabled
[junit4:junit4]   2> 7624 T750 oashc.SpellCheckComponent.inform Initializing spell checkers
[junit4:junit4]   2> 7628 T750 oass.DirectSolrSpellChecker.init init: {name=direct,classname=DirectSolrSpellChecker,field=lowerfilt,minQueryLength=3}
[junit4:junit4]   2> 7650 T785 oasc.SolrCore.registerSearcher [collection1] Registered new searcher Searcher@79edb main{StandardDirectoryReader(segments_1:1)}
[junit4:junit4]   2> 7676 T750 oasc.CoreContainer.register registering core: collection1
[junit4:junit4]   2> 7677 T750 oasc.ZkController.register Register shard - core:collection1 address:http://127.0.0.1:50065/solr shardId:shard3
[junit4:junit4]   2> 7678 T750 oascc.SolrZkClient.makePath makePath: /collections/collection1/leader_elect/shard3/election
[junit4:junit4]   2> 7681 T755 oazs.PrepRequestProcessor.pRequest Got user-level KeeperException when processing sessionid:0x1397f5ab1420003 type:delete cxid:0x42 zxid:0xfffffffffffffffe txntype:unknown reqpath:n/a Error Path:/solr/collections/collection1/leaders Error:KeeperErrorCode = NoNode for /solr/collections/collection1/leaders
[junit4:junit4]   2> 7682 T755 oazs.PrepRequestProcessor.pRequest Got user-level KeeperException when processing sessionid:0x1397f5ab1420003 type:create cxid:0x43 zxid:0xfffffffffffffffe txntype:unknown reqpath:n/a Error Path:/solr/overseer Error:KeeperErrorCode = NodeExists for /solr/overseer
[junit4:junit4]   2> 7683 T750 oasc.ShardLeaderElectionContext.waitForReplicasToComeUp Running the leader process. afterExperiation=false
[junit4:junit4]   2> 8001 T771 oascc.ZkStateReader.updateClusterState Updating cloud state from ZooKeeper... 
[junit4:junit4]   2> 8006 T770 oascc.ZkStateReader$2.process A cluster state change has occurred - updating...
[junit4:junit4]   2> 8006 T784 oascc.ZkStateReader$2.process A cluster state change has occurred - updating...
[junit4:junit4]   2> 8683 T750 oasc.ShardLeaderElectionContext.waitForReplicasToComeUp Enough replicas found to continue.
[junit4:junit4]   2> 8684 T750 oasc.ShardLeaderElectionContext.runLeaderProcess I am the new leader: http://127.0.0.1:50065/solr/collection1/
[junit4:junit4]   2> 9184 T750 oascc.SolrZkClient.makePath makePath: /collections/collection1/leaders/shard3
[junit4:junit4]   2> 9188 T755 oazs.PrepRequestProcessor.pRequest Got user-level KeeperException when processing sessionid:0x1397f5ab1420003 type:create cxid:0x4d zxid:0xfffffffffffffffe txntype:unknown reqpath:n/a Error Path:/solr/overseer Error:KeeperErrorCode = NodeExists for /solr/overseer
[junit4:junit4]   2> 9512 T771 oascc.ZkStateReader.updateClusterState Updating cloud state from ZooKeeper... 
[junit4:junit4]   2> 9515 T784 oascc.ZkStateReader$2.process A cluster state change has occurred - updating...
[junit4:junit4]   2> 9515 T770 oascc.ZkStateReader$2.process A cluster state change has occurred - updating...
[junit4:junit4]   2> 9540 T750 oasc.ZkController.register We are http://127.0.0.1:50065/solr/collection1/ and leader is http://127.0.0.1:50065/solr/collection1/
[junit4:junit4]   2> 9541 T750 oasc.ZkController.register No LogReplay needed for core=collection1 baseURL=http://127.0.0.1:50065/solr
[junit4:junit4]   2> 9541 T750 oasc.ZkController.checkRecovery I am the leader, no recovery necessary
[junit4:junit4]   2> 9543 T750 oascc.ZkStateReader.updateClusterState Updating cloud state from ZooKeeper... 
[junit4:junit4]   2> 9544 T750 oass.SolrDispatchFilter.init user.dir=/mnt/ssd/jenkins/workspace/Lucene-Solr-4.x-Linux/solr/build/solr-core/test/J1
[junit4:junit4]   2> 9544 T750 oass.SolrDispatchFilter.init SolrDispatchFilter.init() done
[junit4:junit4]   2> 9544 T750 oascsi.HttpClientUtil.createClient Creating new http client, config:maxConnections=128&maxConnectionsPerHost=32&followRedirects=false
[junit4:junit4]   2> 9590 T750 oejs.Server.doStart jetty-8.1.2.v20120308
[junit4:junit4]   2> 9591 T750 oejs.AbstractConnector.doStart Started SocketConnector@0.0.0.0:59248
[junit4:junit4]   2> 9592 T750 oasc.SolrResourceLoader.locateSolrHome JNDI not configured for solr (NoInitialContextEx)
[junit4:junit4]   2> 9592 T750 oasc.SolrResourceLoader.locateSolrHome using system property solr.solr.home: /mnt/ssd/jenkins/workspace/Lucene-Solr-4.x-Linux/solr/build/solr-core/test-files/jetty3
[junit4:junit4]   2> 9592 T750 oasc.SolrResourceLoader.<init> new SolrResourceLoader for deduced Solr Home: '/mnt/ssd/jenkins/workspace/Lucene-Solr-4.x-Linux/solr/build/solr-core/test-files/jetty3/'
[junit4:junit4]   2> 9613 T750 oass.SolrDispatchFilter.init SolrDispatchFilter.init()
[junit4:junit4]   2> 9614 T750 oasc.SolrResourceLoader.locateSolrHome JNDI not configured for solr (NoInitialContextEx)
[junit4:junit4]   2> 9614 T750 oasc.SolrResourceLoader.locateSolrHome using system property solr.solr.home: /mnt/ssd/jenkins/workspace/Lucene-Solr-4.x-Linux/solr/build/solr-core/test-files/jetty3
[junit4:junit4]   2> 9614 T750 oasc.CoreContainer$Initializer.initialize looking for solr.xml: /mnt/ssd/jenkins/workspace/Lucene-Solr-4.x-Linux/solr/build/solr-core/test-files/jetty3/solr.xml
[junit4:junit4]   2> 9615 T750 oasc.CoreContainer.<init> New CoreContainer 3400907
[junit4:junit4]   2> 9615 T750 oasc.CoreContainer.load Loading CoreContainer using Solr Home: '/mnt/ssd/jenkins/workspace/Lucene-Solr-4.x-Linux/solr/build/solr-core/test-files/jetty3/'
[junit4:junit4]   2> 9616 T750 oasc.SolrResourceLoader.<init> new SolrResourceLoader for directory: '/mnt/ssd/jenkins/workspace/Lucene-Solr-4.x-Linux/solr/build/solr-core/test-files/jetty3/'
[junit4:junit4]   2> 9636 T750 oasc.CoreContainer.load Registering Log Listener
[junit4:junit4]   2> 9655 T750 oasc.CoreContainer.initZooKeeper Zookeeper client=127.0.0.1:57909/solr
[junit4:junit4]   2> 9655 T750 oaz.ZooKeeper.<init> Initiating client connection, connectString=127.0.0.1:57909/solr sessionTimeout=8000 watcher=org.apache.solr.common.cloud.ConnectionManager@136a4f
[junit4:junit4]   2> 9656 T795 oaz.ClientCnxn$SendThread.startConnect Opening socket connection to server /127.0.0.1:57909
[junit4:junit4]   2> 9656 T750 oascc.ConnectionManager.waitForConnected Waiting for client to connect to ZooKeeper
[junit4:junit4]   2> 9657 T795 oaz.ClientCnxn$SendThread.primeConnection Socket connection established to localhost.localdomain/127.0.0.1:57909, initiating session
[junit4:junit4]   2> 9657 T752 oazs.NIOServerCnxn$Factory.run Accepted socket connection from /127.0.0.1:41492
[junit4:junit4]   2> 9657 T752 oazs.NIOServerCnxn.readConnectRequest Client attempting to establish new session at /127.0.0.1:41492
[junit4:junit4]   2> 9658 T754 oazs.NIOServerCnxn.finishSessionInit Established session 0x1397f5ab1420004 with negotiated timeout 8000 for client /127.0.0.1:41492
[junit4:junit4]   2> 9658 T795 oaz.ClientCnxn$SendThread.readConnectResult Session establishment complete on server localhost.localdomain/127.0.0.1:57909, sessionid = 0x1397f5ab1420004, negotiated timeout = 8000
[junit4:junit4]   2> 9658 T796 oascc.ConnectionManager.process Watcher org.apache.solr.common.cloud.ConnectionManager@136a4f name:ZooKeeperConnection Watcher:127.0.0.1:57909/solr got event WatchedEvent state:SyncConnected type:None path:null path:null type:None
[junit4:junit4]   2> 9658 T750 oascc.ConnectionManager.waitForConnected Client is connected to ZooKeeper
[junit4:junit4]   2> 9659 T755 oazs.PrepRequestProcessor.pRequest Got user-level KeeperException when processing sessionid:0x1397f5ab1420004 type:create cxid:0x1 zxid:0xfffffffffffffffe txntype:unknown reqpath:n/a Error Path:/solr/overseer Error:KeeperErrorCode = NodeExists for /solr/overseer
[junit4:junit4]   2> 9660 T755 oazs.PrepRequestProcessor.pRequest Got user-level KeeperException when processing sessionid:0x1397f5ab1420004 type:create cxid:0x2 zxid:0xfffffffffffffffe txntype:unknown reqpath:n/a Error Path:/solr/overseer Error:KeeperErrorCode = NodeExists for /solr/overseer
[junit4:junit4]   2> 9661 T750 oasc.ZkController.createEphemeralLiveNode Register node as live in ZooKeeper:/live_nodes/127.0.0.1:59248_solr
[junit4:junit4]   2> 9661 T755 oazs.PrepRequestProcessor.pRequest Got user-level KeeperException when processing sessionid:0x1397f5ab1420004 type:delete cxid:0x4 zxid:0xfffffffffffffffe txntype:unknown reqpath:n/a Error Path:/solr/live_nodes/127.0.0.1:59248_solr Error:KeeperErrorCode = NoNode for /solr/live_nodes/127.0.0.1:59248_solr
[junit4:junit4]   2> 9662 T750 oascc.SolrZkClient.makePath makePath: /live_nodes/127.0.0.1:59248_solr
[junit4:junit4]   2> 9663 T784 oascc.ZkStateReader$3.process Updating live nodes
[junit4:junit4]   2> 9663 T770 oascc.ZkStateReader$3.process Updating live nodes
[junit4:junit4]   2> 9664 T750 oashc.HttpShardHandlerFactory.getParameter Setting socketTimeout to: 0
[junit4:junit4]   2> 9664 T750 oashc.HttpShardHandlerFactory.getParameter Setting urlScheme to: http://
[junit4:junit4]   2> 9664 T750 oashc.HttpShardHandlerFactory.getParameter Setting connTimeout to: 0
[junit4:junit4]   2> 9665 T750 oashc.HttpShardHandlerFactory.getParameter Setting maxConnectionsPerHost to: 20
[junit4:junit4]   2> 9665 T750 oashc.HttpShardHandlerFactory.getParameter Setting corePoolSize to: 0
[junit4:junit4]   2> 9665 T750 oashc.HttpShardHandlerFactory.getParameter Setting maximumPoolSize to: 2147483647
[junit4:junit4]   2> 9666 T750 oashc.HttpShardHandlerFactory.getParameter Setting maxThreadIdleTime to: 5
[junit4:junit4]   2> 9666 T750 oashc.HttpShardHandlerFactory.getParameter Setting sizeOfQueue to: -1
[junit4:junit4]   2> 9666 T750 oashc.HttpShardHandlerFactory.getParameter Setting fairnessPolicy to: false
[junit4:junit4]   2> 9667 T750 oascsi.HttpClientUtil.createClient Creating new http client, config:maxConnectionsPerHost=20&maxConnections=10000&socketTimeout=0&connTimeout=0&retry=false
[junit4:junit4]   2> 9678 T750 oascc.ZkStateReader.createClusterStateWatchersAndUpdate Updating cluster state from ZooKeeper... 
[junit4:junit4]   2> 9682 T750 oasc.CoreContainer.create Creating SolrCore 'collection1' using instanceDir: /mnt/ssd/jenkins/workspace/Lucene-Solr-4.x-Linux/solr/build/solr-core/test-files/jetty3/collection1
[junit4:junit4]   2> 9683 T750 oasc.ZkController.createCollectionZkNode Check for collection zkNode:collection1
[junit4:junit4]   2> 9683 T750 oasc.ZkController.createCollectionZkNode Collection zkNode exists
[junit4:junit4]   2> 9683 T750 oasc.ZkController.readConfigName Load collection config from:/collections/collection1
[junit4:junit4]   2> 9684 T750 oasc.SolrResourceLoader.<init> new SolrResourceLoader for directory: '/mnt/ssd/jenkins/workspace/Lucene-Solr-4.x-Linux/solr/build/solr-core/test-files/jetty3/collection1/'
[junit4:junit4]   2> 9685 T750 oasc.SolrResourceLoader.replaceClassLoader Adding 'file:/mnt/ssd/jenkins/workspace/Lucene-Solr-4.x-Linux/solr/build/solr-core/test-files/jetty3/collection1/lib/README' to classloader
[junit4:junit4]   2> 9685 T750 oasc.SolrResourceLoader.replaceClassLoader Adding 'file:/mnt/ssd/jenkins/workspace/Lucene-Solr-4.x-Linux/solr/build/solr-core/test-files/jetty3/collection1/lib/classes/' to classloader
[junit4:junit4]   2> 9735 T750 oasc.SolrConfig.<init> Using Lucene MatchVersion: LUCENE_40
[junit4:junit4]   2> 9813 T750 oasc.SolrConfig.<init> Loaded SolrConfig: solrconfig.xml
[junit4:junit4]   2> 9814 T750 oass.IndexSchema.readSchema Reading Solr Schema
[junit4:junit4]   2> 9818 T750 oass.IndexSchema.readSchema Schema name=test
[junit4:junit4]   2> 10022 T771 oascc.ZkStateReader.updateClusterState Updating cloud state from ZooKeeper... 
[junit4:junit4]   2> 10093 T770 oascc.ZkStateReader$2.process A cluster state change has occurred - updating...
[junit4:junit4]   2> 10093 T784 oascc.ZkStateReader$2.process A cluster state change has occurred - updating...
[junit4:junit4]   2> 10093 T796 oascc.ZkStateReader$2.process A cluster state change has occurred - updating...
[junit4:junit4]   2> 10562 T750 oass.OpenExchangeRatesOrgProvider.init Initialized with rates=open-exchange-rates.json, refreshInterval=1440.
[junit4:junit4]   2> 10575 T750 oass.IndexSchema.readSchema default search field in schema is text
[junit4:junit4]   2> 10578 T750 oass.IndexSchema.readSchema unique key field: id
[junit4:junit4]   2> 10586 T750 oass.FileExchangeRateProvider.reload Reloading exchange rates from file currency.xml
[junit4:junit4]   2> 10589 T750 oass.FileExchangeRateProvider.reload Reloading exchange rates from file currency.xml
[junit4:junit4]   2> 10599 T750 oass.OpenExchangeRatesOrgProvider.reload Reloading exchange rates from open-exchange-rates.json
[junit4:junit4]   2> 10600 T750 oass.OpenExchangeRatesOrgProvider.reload Reloading exchange rates from open-exchange-rates.json
[junit4:junit4]   2> 10601 T750 oasc.SolrCore.<init> [collection1] Opening new SolrCore at /mnt/ssd/jenkins/workspace/Lucene-Solr-4.x-Linux/solr/build/solr-core/test-files/jetty3/collection1/, dataDir=/mnt/ssd/jenkins/workspace/Lucene-Solr-4.x-Linux/solr/build/solr-core/test-files/jetty3/collection1/data/
[junit4:junit4]   2> 10602 T750 oasc.JmxMonitoredMap.<init> JMX monitoring is enabled. Adding Solr mbeans to JMX Server: com.sun.jmx.mbeanserver.JmxMBeanServer@1ddd557
[junit4:junit4]   2> 10602 T750 oasc.SolrCore.getNewIndexDir WARNING New index directory detected: old=null new=/mnt/ssd/jenkins/workspace/Lucene-Solr-4.x-Linux/solr/build/solr-core/test-files/jetty3/collection1/data/index/
[junit4:junit4]   2> 10603 T750 oasc.SolrCore.initIndex WARNING [collection1] Solr index directory '/mnt/ssd/jenkins/workspace/Lucene-Solr-4.x-Linux/solr/build/solr-core/test-files/jetty3/collection1/data/index' doesn't exist. Creating new index...
[junit4:junit4]   2> 10603 T750 oasc.CachingDirectoryFactory.get return new directory for /mnt/ssd/jenkins/workspace/Lucene-Solr-4.x-Linux/solr/build/solr-core/test-files/jetty3/collection1/data/index forceNew:false
[junit4:junit4]   2> 10606 T750 oasc.SolrDeletionPolicy.onCommit SolrDeletionPolicy.onCommit: commits:num=1
[junit4:junit4]   2> 		commit{dir=NRTCachingDirectory(org.apache.lucene.store.NIOFSDirectory@/mnt/ssd/jenkins/workspace/Lucene-Solr-4.x-Linux/solr/build/solr-core/test-files/jetty3/collection1/data/index lockFactory=org.apache.lucene.store.NativeFSLockFactory@10a6595; maxCacheMB=48.0 maxMergeSizeMB=4.0),segFN=segments_1,generation=1,filenames=[segments_1]
[junit4:junit4]   2> 10607 T750 oasc.SolrDeletionPolicy.updateCommits newest commit = 1
[junit4:junit4]   2> 10607 T750 oasc.SolrCore.initWriters created xml: solr.XMLResponseWriter
[junit4:junit4]   2> 10609 T750 oasup.UpdateRequestProcessorChain.init inserting DistributedUpdateProcessorFactory into updateRequestProcessorChain "dedupe"
[junit4:junit4]   2> 10609 T750 oasup.UpdateRequestProcessorChain.init inserting DistributedUpdateProcessorFactory into updateRequestProcessorChain "dedupe-allfields"
[junit4:junit4]   2> 10610 T750 oasup.UpdateRequestProcessorChain.init inserting DistributedUpdateProcessorFactory into updateRequestProcessorChain "stored_sig"
[junit4:junit4]   2> 10610 T750 oasup.UpdateRequestProcessorChain.init inserting DistributedUpdateProcessorFactory into updateRequestProcessorChain "uniq-fields"
[junit4:junit4]   2> 10611 T750 oasup.UpdateRequestProcessorChain.init inserting DistributedUpdateProcessorFactory into updateRequestProcessorChain "distrib-dup-test-chain-implicit"
[junit4:junit4]   2> 10611 T750 oasc.RequestHandlers.initHandlersFromConfig adding lazy requestHandler: solr.ReplicationHandler
[junit4:junit4]   2> 10611 T750 oasc.RequestHandlers.initHandlersFromConfig created /replication: solr.ReplicationHandler
[junit4:junit4]   2> 10612 T750 oasc.RequestHandlers.initHandlersFromConfig created standard: solr.StandardRequestHandler
[junit4:junit4]   2> 10612 T750 oasc.RequestHandlers.initHandlersFromConfig created /get: solr.RealTimeGetHandler
[junit4:junit4]   2> 10613 T750 oasc.RequestHandlers.initHandlersFromConfig created dismax: solr.SearchHandler
[junit4:junit4]   2> 10613 T750 oasc.RequestHandlers.initHandlersFromConfig created mock: org.apache.solr.core.MockQuerySenderListenerReqHandler
[junit4:junit4]   2> 10614 T750 oasc.RequestHandlers.initHandlersFromConfig created /admin/: org.apache.solr.handler.admin.AdminHandlers
[junit4:junit4]   2> 10614 T750 oasc.RequestHandlers.initHandlersFromConfig created defaults: solr.StandardRequestHandler
[junit4:junit4]   2> 10615 T750 oasc.RequestHandlers.initHandlersFromConfig adding lazy requestHandler: solr.StandardRequestHandler
[junit4:junit4]   2> 10615 T750 oasc.RequestHandlers.initHandlersFromConfig created lazy: solr.StandardRequestHandler
[junit4:junit4]   2> 10616 T750 oasc.RequestHandlers.initHandlersFromConfig created /update: solr.UpdateRequestHandler
[junit4:junit4]   2> 10616 T750 oasc.RequestHandlers.initHandlersFromConfig created /terms: org.apache.solr.handler.component.SearchHandler
[junit4:junit4]   2> 10617 T750 oasc.RequestHandlers.initHandlersFromConfig created spellCheckCompRH: org.apache.solr.handler.component.SearchHandler
[junit4:junit4]   2> 10617 T750 oasc.RequestHandlers.initHandlersFromConfig created spellCheckCompRH_Direct: org.apache.solr.handler.component.SearchHandler
[junit4:junit4]   2> 10618 T750 oasc.RequestHandlers.initHandlersFromConfig created spellCheckWithWordbreak: org.apache.solr.handler.component.SearchHandler
[junit4:junit4]   2> 10618 T750 oasc.RequestHandlers.initHandlersFromConfig created spellCheckWithWordbreak_Direct: org.apache.solr.handler.component.SearchHandler
[junit4:junit4]   2> 10619 T750 oasc.RequestHandlers.initHandlersFromConfig created spellCheckCompRH1: org.apache.solr.handler.component.SearchHandler
[junit4:junit4]   2> 10619 T750 oasc.RequestHandlers.initHandlersFromConfig created tvrh: org.apache.solr.handler.component.SearchHandler
[junit4:junit4]   2> 10620 T750 oasc.RequestHandlers.initHandlersFromConfig created /mlt: solr.MoreLikeThisHandler
[junit4:junit4]   2> 10620 T750 oasc.RequestHandlers.initHandlersFromConfig created /debug/dump: solr.DumpRequestHandler
[junit4:junit4]   2> 10621 T750 oashl.XMLLoader.init xsltCacheLifetimeSeconds=60
[junit4:junit4]   2> 10623 T750 oasc.SolrCore.initDeprecatedSupport WARNING solrconfig.xml uses deprecated <admin/gettableFiles>, Please update your config to use the ShowFileRequestHandler.
[junit4:junit4]   2> 10624 T750 oasc.SolrCore.initDeprecatedSupport WARNING adding ShowFileRequestHandler with hidden files: [STOPWORDS.TXT, SCHEMA.XML, OPEN-EXCHANGE-RATES.JSON, SYNONYMS.TXT, MAPPING-ISOLATIN1ACCENT.TXT, OLD_SYNONYMS.TXT, CURRENCY.XML, PROTWORDS.TXT]
[junit4:junit4]   2> 10626 T750 oass.SolrIndexSearcher.<init> Opening Searcher@4554d main
[junit4:junit4]   2> 10627 T750 oasu.CommitTracker.<init> Hard AutoCommit: disabled
[junit4:junit4]   2> 10627 T750 oasu.CommitTracker.<init> Soft AutoCommit: disabled
[junit4:junit4]   2> 10628 T750 oashc.SpellCheckComponent.inform Initializing spell checkers
[junit4:junit4]   2> 10632 T750 oass.DirectSolrSpellChecker.init init: {name=direct,classname=DirectSolrSpellChecker,field=lowerfilt,minQueryLength=3}
[junit4:junit4]   2> 13662 T797 oasc.SolrCore.registerSearcher [collection1] Registered new searcher Searcher@4554d main{StandardDirectoryReader(segments_1:1)}
[junit4:junit4]   2> 13669 T750 oasc.CoreContainer.register registering core: collection1
[junit4:junit4]   2> 13669 T750 oasc.ZkController.register Register shard - core:collection1 address:http://127.0.0.1:59248/solr shardId:shard4
[junit4:junit4]   2> 13670 T750 oascc.SolrZkClient.makePath makePath: /collections/collection1/leader_elect/shard4/election
[junit4:junit4]   2> 13674 T755 oazs.PrepRequestProcessor.pRequest Got user-level KeeperException when processing sessionid:0x1397f5ab1420004 type:delete cxid:0x41 zxid:0xfffffffffffffffe txntype:unknown reqpath:n/a Error Path:/solr/collections/collection1/leaders/shard4 Error:KeeperErrorCode = NoNode for /solr/collections/collection1/leaders/shard4
[junit4:junit4]   2> 13675 T755 oazs.PrepRequestProcessor.pRequest Got user-level KeeperException when processing sessionid:0x1397f5ab1420004 type:create cxid:0x42 zxid:0xfffffffffffffffe txntype:unknown reqpath:n/a Error Path:/solr/overseer Error:KeeperErrorCode = NodeExists for /solr/overseer
[junit4:junit4]   2> 13676 T750 oasc.ShardLeaderElectionContext.waitForReplicasToComeUp Running the leader process. afterExperiation=false
[junit4:junit4]   2> 14109 T771 oascc.ZkStateReader.updateClusterState Updating cloud state from ZooKeeper... 
[junit4:junit4]   2> 14116 T770 oascc.ZkStateReader$2.process A cluster state change has occurred - updating...
[junit4:junit4]   2> 14116 T784 oascc.ZkStateReader$2.process A cluster state change has occurred - updating...
[junit4:junit4]   2> 14116 T796 oascc.ZkStateReader$2.process A cluster state change has occurred - updating...
[junit4:junit4]   2> 14676 T750 oasc.ShardLeaderElectionContext.waitForReplicasToComeUp Enough replicas found to continue.
[junit4:junit4]   2> 14677 T750 oasc.ShardLeaderElectionContext.runLeaderProcess I am the new leader: http://127.0.0.1:59248/solr/collection1/
[junit4:junit4]   2> 15178 T750 oascc.SolrZkClient.makePath makePath: /collections/collection1/leaders/shard4
[junit4:junit4]   2> 15182 T755 oazs.PrepRequestProcessor.pRequest Got user-level KeeperException when processing sessionid:0x1397f5ab1420004 type:create cxid:0x4b zxid:0xfffffffffffffffe txntype:unknown reqpath:n/a Error Path:/solr/overseer Error:KeeperErrorCode = NodeExists for /solr/overseer
[junit4:junit4]   2> 15624 T771 oascc.ZkStateReader.updateClusterState Updating cloud state from ZooKeeper... 
[junit4:junit4]   2> 15627 T770 oascc.ZkStateReader$2.process A cluster state change has occurred - updating...
[junit4:junit4]   2> 15627 T784 oascc.ZkStateReader$2.process A cluster state change has occurred - updating...
[junit4:junit4]   2> 15627 T796 oascc.ZkStateReader$2.process A cluster state change has occurred - updating...
[junit4:junit4]   2> 15634 T750 oasc.ZkController.register We are http://127.0.0.1:59248/solr/collection1/ and leader is http://127.0.0.1:59248/solr/collection1/
[junit4:junit4]   2> 15635 T750 oasc.ZkController.register No LogReplay needed for core=collection1 baseURL=http://127.0.0.1:59248/solr
[junit4:junit4]   2> 15636 T750 oasc.ZkController.checkRecovery I am the leader, no recovery necessary
[junit4:junit4]   2> 15638 T750 oascc.ZkStateReader.updateClusterState Updating cloud state from ZooKeeper... 
[junit4:junit4]   2> 15639 T750 oass.SolrDispatchFilter.init user.dir=/mnt/ssd/jenkins/workspace/Lucene-Solr-4.x-Linux/solr/build/solr-core/test/J1
[junit4:junit4]   2> 15639 T750 oass.SolrDispatchFilter.init SolrDispatchFilter.init() done
[junit4:junit4]   2> 15640 T750 oascsi.HttpClientUtil.createClient Creating new http client, config:maxConnections=128&maxConnectionsPerHost=32&followRedirects=false
[junit4:junit4]   2> 15693 T750 oejs.Server.doStart jetty-8.1.2.v20120308
[junit4:junit4]   2> 15695 T750 oejs.AbstractConnector.doStart Started SocketConnector@0.0.0.0:49944
[junit4:junit4]   2> 15695 T750 oasc.SolrResourceLoader.locateSolrHome JNDI not configured for solr (NoInitialContextEx)
[junit4:junit4]   2> 15696 T750 oasc.SolrResourceLoader.locateSolrHome using system property solr.solr.home: /mnt/ssd/jenkins/workspace/Lucene-Solr-4.x-Linux/solr/build/solr-core/test-files/jetty4
[junit4:junit4]   2> 15696 T750 oasc.SolrResourceLoader.<init> new SolrResourceLoader for deduced Solr Home: '/mnt/ssd/jenkins/workspace/Lucene-Solr-4.x-Linux/solr/build/solr-core/test-files/jetty4/'
[junit4:junit4]   2> 15716 T750 oass.SolrDispatchFilter.init SolrDispatchFilter.init()
[junit4:junit4]   2> 15717 T750 oasc.SolrResourceLoader.locateSolrHome JNDI not configured for solr (NoInitialContextEx)
[junit4:junit4]   2> 15717 T750 oasc.SolrResourceLoader.locateSolrHome using system property solr.solr.home: /mnt/ssd/jenkins/workspace/Lucene-Solr-4.x-Linux/solr/build/solr-core/test-files/jetty4
[junit4:junit4]   2> 15717 T750 oasc.CoreContainer$Initializer.initialize looking for solr.xml: /mnt/ssd/jenkins/workspace/Lucene-Solr-4.x-Linux/solr/build/solr-core/test-files/jetty4/solr.xml
[junit4:junit4]   2> 15718 T750 oasc.CoreContainer.<init> New CoreContainer 25219460
[junit4:junit4]   2> 15718 T750 oasc.CoreContainer.load Loading CoreContainer using Solr Home: '/mnt/ssd/jenkins/workspace/Lucene-Solr-4.x-Linux/solr/build/solr-core/test-files/jetty4/'
[junit4:junit4]   2> 15718 T750 oasc.SolrResourceLoader.<init> new SolrResourceLoader for directory: '/mnt/ssd/jenkins/workspace/Lucene-Solr-4.x-Linux/solr/build/solr-core/test-files/jetty4/'
[junit4:junit4]   2> 15742 T750 oasc.CoreContainer.load Registering Log Listener
[junit4:junit4]   2> 15757 T750 oasc.CoreContainer.initZooKeeper Zookeeper client=127.0.0.1:57909/solr
[junit4:junit4]   2> 15758 T750 oaz.ZooKeeper.<init> Initiating client connection, connectString=127.0.0.1:57909/solr sessionTimeout=8000 watcher=org.apache.solr.common.cloud.ConnectionManager@de811
[junit4:junit4]   2> 15759 T807 oaz.ClientCnxn$SendThread.startConnect Opening socket connection to server /127.0.0.1:57909
[junit4:junit4]   2> 15759 T750 oascc.ConnectionManager.waitForConnected Waiting for client to connect to ZooKeeper
[junit4:junit4]   2> 15759 T807 oaz.ClientCnxn$SendThread.primeConnection Socket connection established to localhost.localdomain/127.0.0.1:57909, initiating session
[junit4:junit4]   2> 15759 T752 oazs.NIOServerCnxn$Factory.run Accepted socket connection from /127.0.0.1:41495
[junit4:junit4]   2> 15760 T752 oazs.NIOServerCnxn.readConnectRequest Client attempting to establish new session at /127.0.0.1:41495
[junit4:junit4]   2> 15761 T754 oazs.NIOServerCnxn.finishSessionInit Established session 0x1397f5ab1420005 with negotiated timeout 8000 for client /127.0.0.1:41495
[junit4:junit4]   2> 15761 T807 oaz.ClientCnxn$SendThread.readConnectResult Session establishment complete on server localhost.localdomain/127.0.0.1:57909, sessionid = 0x1397f5ab1420005, negotiated timeout = 8000
[junit4:junit4]   2> 15761 T808 oascc.ConnectionManager.process Watcher org.apache.solr.common.cloud.ConnectionManager@de811 name:ZooKeeperConnection Watcher:127.0.0.1:57909/solr got event WatchedEvent state:SyncConnected type:None path:null path:null type:None
[junit4:junit4]   2> 15761 T750 oascc.ConnectionManager.waitForConnected Client is connected to ZooKeeper
[junit4:junit4]   2> 15762 T755 oazs.PrepRequestProcessor.pRequest Got user-level KeeperException when processing sessionid:0x1397f5ab1420005 type:create cxid:0x1 zxid:0xfffffffffffffffe txntype:unknown reqpath:n/a Error Path:/solr/overseer Error:KeeperErrorCode = NodeExists for /solr/overseer
[junit4:junit4]   2> 15763 T755 oazs.PrepRequestProcessor.pRequest Got user-level KeeperException when processing sessionid:0x1397f5ab1420005 type:create cxid:0x2 zxid:0xfffffffffffffffe txntype:unknown reqpath:n/a Error Path:/solr/overseer Error:KeeperErrorCode = NodeExists for /solr/overseer
[junit4:junit4]   2> 15763 T750 oasc.ZkController.createEphemeralLiveNode Register node as live in ZooKeeper:/live_nodes/127.0.0.1:49944_solr
[junit4:junit4]   2> 15764 T755 oazs.PrepRequestProcessor.pRequest Got user-level KeeperException when processing sessionid:0x1397f5ab1420005 type:delete cxid:0x4 zxid:0xfffffffffffffffe txntype:unknown reqpath:n/a Error Path:/solr/live_nodes/127.0.0.1:49944_solr Error:KeeperErrorCode = NoNode for /solr/live_nodes/127.0.0.1:49944_solr
[junit4:junit4]   2> 15764 T750 oascc.SolrZkClient.makePath makePath: /live_nodes/127.0.0.1:49944_solr
[junit4:junit4]   2> 15766 T784 oascc.ZkStateReader$3.process Updating live nodes
[junit4:junit4]   2> 15766 T770 oascc.ZkStateReader$3.process Updating live nodes
[junit4:junit4]   2> 15766 T796 oascc.ZkStateReader$3.process Updating live nodes
[junit4:junit4]   2> 15767 T750 oashc.HttpShardHandlerFactory.getParameter Setting socketTimeout to: 0
[junit4:junit4]   2> 15767 T750 oashc.HttpShardHandlerFactory.getParameter Setting urlScheme to: http://
[junit4:junit4]   2> 15767 T750 oashc.HttpShardHandlerFactory.getParameter Setting connTimeout to: 0
[junit4:junit4]   2> 15768 T750 oashc.HttpShardHandlerFactory.getParameter Setting maxConnectionsPerHost to: 20
[junit4:junit4]   2> 15768 T750 oashc.HttpShardHandlerFactory.getParameter Setting corePoolSize to: 0
[junit4:junit4]   2> 15768 T750 oashc.HttpShardHandlerFactory.getParameter Setting maximumPoolSize to: 2147483647
[junit4:junit4]   2> 15769 T750 oashc.HttpShardHandlerFactory.getParameter Setting maxThreadIdleTime to: 5
[junit4:junit4]   2> 15769 T750 oashc.HttpShardHandlerFactory.getParameter Setting sizeOfQueue to: -1
[junit4:junit4]   2> 15769 T750 oashc.HttpShardHandlerFactory.getParameter Setting fairnessPolicy to: false
[junit4:junit4]   2> 15770 T750 oascsi.HttpClientUtil.createClient Creating new http client, config:maxConnectionsPerHost=20&maxConnections=10000&socketTimeout=0&connTimeout=0&retry=false
[junit4:junit4]   2> 15775 T750 oascc.ZkStateReader.createClusterStateWatchersAndUpdate Updating cluster state from ZooKeeper... 
[junit4:junit4]   2> 15786 T750 oasc.CoreContainer.create Creating SolrCore 'collection1' using instanceDir: /mnt/ssd/jenkins/workspace/Lucene-Solr-4.x-Linux/solr/build/solr-core/test-files/jetty4/collection1
[junit4:junit4]   2> 15787 T750 oasc.ZkController.createCollectionZkNode Check for collection zkNode:collection1
[junit4:junit4]   2> 15787 T750 oasc.ZkController.createCollectionZkNode Collection zkNode exists
[junit4:junit4]   2> 15788 T750 oasc.ZkController.readConfigName Load collection config from:/collections/collection1
[junit4:junit4]   2> 15789 T750 oasc.SolrResourceLoader.<init> new SolrResourceLoader for directory: '/mnt/ssd/jenkins/workspace/Lucene-Solr-4.x-Linux/solr/build/solr-core/test-files/jetty4/collection1/'
[junit4:junit4]   2> 15790 T750 oasc.SolrResourceLoader.replaceClassLoader Adding 'file:/mnt/ssd/jenkins/workspace/Lucene-Solr-4.x-Linux/solr/build/solr-core/test-files/jetty4/collection1/lib/README' to classloader
[junit4:junit4]   2> 15790 T750 oasc.SolrResourceLoader.replaceClassLoader Adding 'file:/mnt/ssd/jenkins/workspace/Lucene-Solr-4.x-Linux/solr/build/solr-core/test-files/jetty4/collection1/lib/classes/' to classloader
[junit4:junit4]   2> 15837 T750 oasc.SolrConfig.<init> Using Lucene MatchVersion: LUCENE_40
[junit4:junit4]   2> 15920 T750 oasc.SolrConfig.<init> Loaded SolrConfig: solrconfig.xml
[junit4:junit4]   2> 15921 T750 oass.IndexSchema.readSchema Reading Solr Schema
[junit4:junit4]   2> 15925 T750 oass.IndexSchema.readSchema Schema name=test
[junit4:junit4]   2> 16131 T771 oascc.ZkStateReader.updateClusterState Updating cloud state from ZooKeeper... 
[junit4:junit4]   2> 16135 T770 oascc.ZkStateReader$2.process A cluster state change has occurred - updating...
[junit4:junit4]   2> 16135 T808 oascc.ZkStateReader$2.process A cluster state change has occurred - updating...
[junit4:junit4]   2> 16135 T796 oascc.ZkStateReader$2.process A cluster state change has occurred - updating...
[junit4:junit4]   2> 16135 T784 oascc.ZkStateReader$2.process A cluster state change has occurred - updating...
[junit4:junit4]   2> 16834 T750 oass.OpenExchangeRatesOrgProvider.init Initialized with rates=open-exchange-rates.json, refreshInterval=1440.
[junit4:junit4]   2> 16842 T750 oass.IndexSchema.readSchema default search field in schema is text
[junit4:junit4]   2> 16857 T750 oass.IndexSchema.readSchema unique key field: id
[junit4:junit4]   2> 16865 T750 oass.FileExchangeRateProvider.reload Reloading exchange rates from file currency.xml
[junit4:junit4]   2> 16869 T750 oass.FileExchangeRateProvider.reload Reloading exchange rates from file currency.xml
[junit4:junit4]   2> 16872 T750 oass.OpenExchangeRatesOrgProvider.reload Reloading exchange rates from open-exchange-rates.json
[junit4:junit4]   2> 16873 T750 oass.OpenExchangeRatesOrgProvider.reload Reloading exchange rates from open-exchange-rates.json
[junit4:junit4]   2> 16874 T750 oasc.SolrCore.<init> [collection1] Opening new SolrCore at /mnt/ssd/jenkins/workspace/Lucene-Solr-4.x-Linux/solr/build/solr-core/test-files/jetty4/collection1/, dataDir=/mnt/ssd/jenkins/workspace/Lucene-Solr-4.x-Linux/solr/build/solr-core/test-files/jetty4/collection1/data/
[junit4:junit4]   2> 16875 T750 oasc.JmxMonitoredMap.<init> JMX monitoring is enabled. Adding Solr mbeans to JMX Server: com.sun.jmx.mbeanserver.JmxMBeanServer@1ddd557
[junit4:junit4]   2> 16875 T750 oasc.SolrCore.getNewIndexDir WARNING New index directory detected: old=null new=/mnt/ssd/jenkins/workspace/Lucene-Solr-4.x-Linux/solr/build/solr-core/test-files/jetty4/collection1/data/index/
[junit4:junit4]   2> 16876 T750 oasc.SolrCore.initIndex WARNING [collection1] Solr index directory '/mnt/ssd/jenkins/workspace/Lucene-Solr-4.x-Linux/solr/build/solr-core/test-files/jetty4/collection1/data/index' doesn't exist. Creating new index...
[junit4:junit4]   2> 16876 T750 oasc.CachingDirectoryFactory.get return new directory for /mnt/ssd/jenkins/workspace/Lucene-Solr-4.x-Linux/solr/build/solr-core/test-files/jetty4/collection1/data/index forceNew:false
[junit4:junit4]   2> 16879 T750 oasc.SolrDeletionPolicy.onCommit SolrDeletionPolicy.onCommit: commits:num=1
[junit4:junit4]   2> 		commit{dir=NRTCachingDirectory(org.apache.lucene.store.NIOFSDirectory@/mnt/ssd/jenkins/workspace/Lucene-Solr-4.x-Linux/solr/build/solr-core/test-files/jetty4/collection1/data/index lockFactory=org.apache.lucene.store.NativeFSLockFactory@12a442a; maxCacheMB=48.0 maxMergeSizeMB=4.0),segFN=segments_1,generation=1,filenames=[segments_1]
[junit4:junit4]   2> 16880 T750 oasc.SolrDeletionPolicy.updateCommits newest commit = 1
[junit4:junit4]   2> 16881 T750 oasc.SolrCore.initWriters created xml: solr.XMLResponseWriter
[junit4:junit4]   2> 16882 T750 oasup.UpdateRequestProcessorChain.init inserting DistributedUpdateProcessorFactory into updateRequestProcessorChain "dedupe"
[junit4:junit4]   2> 16883 T750 oasup.UpdateRequestProcessorChain.init inserting DistributedUpdateProcessorFactory into updateRequestProcessorChain "dedupe-allfields"
[junit4:junit4]   2> 16883 T750 oasup.UpdateRequestProcessorChain.init inserting DistributedUpdateProcessorFactory into updateRequestProcessorChain "stored_sig"
[junit4:junit4]   2> 16883 T750 oasup.UpdateRequestProcessorChain.init inserting DistributedUpdateProcessorFactory into updateRequestProcessorChain "uniq-fields"
[junit4:junit4]   2> 16884 T750 oasup.UpdateRequestProcessorChain.init inserting DistributedUpdateProcessorFactory into updateRequestProcessorChain "distrib-dup-test-chain-implicit"
[junit4:junit4]   2> 16884 T750 oasc.RequestHandlers.initHandlersFromConfig adding lazy requestHandler: solr.ReplicationHandler
[junit4:junit4]   2> 16885 T750 oasc.RequestHandlers.initHandlersFromConfig created /replication: solr.ReplicationHandler
[junit4:junit4]   2> 16885 T750 oasc.RequestHandlers.initHandlersFromConfig created standard: solr.StandardRequestHandler
[junit4:junit4]   2> 16886 T750 oasc.RequestHandlers.initHandlersFromConfig created /get: solr.RealTimeGetHandler
[junit4:junit4]   2> 16886 T750 oasc.RequestHandlers.initHandlersFromConfig created dismax: solr.SearchHandler
[junit4:junit4]   2> 16887 T750 oasc.RequestHandlers.initHandlersFromConfig created mock: org.apache.solr.core.MockQuerySenderListenerReqHandler
[junit4:junit4]   2> 16891 T750 oasc.RequestHandlers.initHandlersFromConfig created /admin/: org.apache.solr.handler.admin.AdminHandlers
[junit4:junit4]   2> 16892 T750 oasc.RequestHandlers.initHandlersFromConfig created defaults: solr.StandardRequestHandler
[junit4:junit4]   2> 16901 T750 oasc.RequestHandlers.initHandlersFromConfig adding lazy requestHandler: solr.StandardRequestHandler
[junit4:junit4]   2> 16902 T750 oasc.RequestHandlers.initHandlersFromConfig created lazy: solr.StandardRequestHandler
[junit4:junit4]   2> 16902 T750 oasc.RequestHandlers.initHandlersFromConfig created /update: solr.UpdateRequestHandler
[junit4:junit4]   2> 16903 T750 oasc.RequestHandlers.initHandlersFromConfig created /terms: org.apache.solr.handler.component.SearchHandler
[junit4:junit4]   2> 16903 T750 oasc.RequestHandlers.initHandlersFromConfig created spellCheckCompRH: org.apache.solr.handler.component.SearchHandler
[junit4:junit4]   2> 16904 T750 oasc.RequestHandlers.initHandlersFromConfig created spellCheckCompRH_Direct: org.apache.solr.handler.component.SearchHandler
[junit4:junit4]   2> 16904 T750 oasc.RequestHandlers.initHandlersFromConfig created spellCheckWithWordbreak: org.apache.solr.handler.component.SearchHandler
[junit4:junit4]   2> 16905 T750 oasc.RequestHandlers.initHandlersFromConfig created spellCheckWithWordbreak_Direct: org.apache.solr.handler.component.SearchHandler
[junit4:junit4]   2> 16906 T750 oasc.RequestHandlers.initHandlersFromConfig created spellCheckCompRH1: org.apache.solr.handler.component.SearchHandler
[junit4:junit4]   2> 16907 T750 oasc.RequestHandlers.initHandlersFromConfig created tvrh: org.apache.solr.handler.component.SearchHandler
[junit4:junit4]   2> 16907 T750 oasc.RequestHandlers.initHandlersFromConfig created /mlt: solr.MoreLikeThisHandler
[junit4:junit4]   2> 16910 T750 oasc.RequestHandlers.initHandlersFromConfig created /debug/dump: solr.DumpRequestHandler
[junit4:junit4]   2> 16912 T750 oashl.XMLLoader.init xsltCacheLifetimeSeconds=60
[junit4:junit4]   2> 16914 T750 oasc.SolrCore.initDeprecatedSupport WARNING solrconfig.xml uses deprecated <admin/gettableFiles>, Please update your config to use the ShowFileRequestHandler.
[junit4:junit4]   2> 16915 T750 oasc.SolrCore.initDeprecatedSupport WARNING adding ShowFileRequestHandler with hidden files: [STOPWORDS.TXT, SCHEMA.XML, OPEN-EXCHANGE-RATES.JSON, SYNONYMS.TXT, MAPPING-ISOLATIN1ACCENT.TXT, OLD_SYNONYMS.TXT, CURRENCY.XML, PROTWORDS.TXT]
[junit4:junit4]   2> 16917 T750 oass.SolrIndexSearcher.<init> Opening Searcher@6e5a7b main
[junit4:junit4]   2> 16918 T750 oasu.CommitTracker.<init> Hard AutoCommit: disabled
[junit4:junit4]   2> 16919 T750 oasu.CommitTracker.<init> Soft AutoCommit: disabled
[junit4:junit4]   2> 16919 T750 oashc.SpellCheckComponent.inform Initializing spell checkers
[junit4:junit4]   2> 16923 T750 oass.DirectSolrSpellChecker.init init: {name=direct,classname=DirectSolrSpellChecker,field=lowerfilt,minQueryLength=3}
[junit4:junit4]   2> 16954 T809 oasc.SolrCore.registerSearcher [collection1] Registered new searcher Searcher@6e5a7b main{StandardDirectoryReader(segments_1:1)}
[junit4:junit4]   2> 16957 T750 oasc.CoreContainer.register registering core: collection1
[junit4:junit4]   2> 16957 T750 oasc.ZkController.register Register shard - core:collection1 address:http://127.0.0.1:49944/solr shardId:shard5
[junit4:junit4]   2> 16958 T750 oascc.SolrZkClient.makePath makePath: /collections/collection1/leader_elect/shard5/election
[junit4:junit4]   2> 16963 T755 oazs.PrepRequestProcessor.pRequest Got user-level KeeperException when processing sessionid:0x1397f5ab1420005 type:delete cxid:0x41 zxid:0xfffffffffffffffe txntype:unknown reqpath:n/a Error Path:/solr/collections/collection1/leaders/shard5 Error:KeeperErrorCode = NoNode for /solr/collections/collection1/leaders/shard5
[junit4:junit4]   2> 16964 T755 oazs.PrepRequestProcessor.pRequest Got user-level KeeperException when processing sessionid:0x1397f5ab1420005 type:create cxid:0x42 zxid:0xfffffffffffffffe txntype:unknown reqpath:n/a Error Path:/solr/overseer Error:KeeperErrorCode = NodeExists for /solr/overseer
[junit4:junit4]   2> 16965 T750 oasc.ShardLeaderElectionContext.waitForReplicasToComeUp Running the leader process. afterExperiation=false
[junit4:junit4]   2> 17156 T771 oascc.ZkStateReader.updateClusterState Updating cloud state from ZooKeeper... 
[junit4:junit4]   2> 17161 T770 oascc.ZkStateReader$2.process A cluster state change has occurred - updating...
[junit4:junit4]   2> 17161 T808 oascc.ZkStateReader$2.process A cluster state change has occurred - updating...
[junit4:junit4]   2> 17161 T784 oascc.ZkStateReader$2.process A cluster state change has occurred - updating...
[junit4:junit4]   2> 17161 T796 oascc.ZkStateReader$2.process A cluster state change has occurred - updating...
[junit4:junit4]   2> 17966 T750 oasc.ShardLeaderElectionContext.waitForReplicasToComeUp Enough replicas found to continue.
[junit4:junit4]   2> 17966 T750 oasc.ShardLeaderElectionContext.runLeaderProcess I am the new leader: http://127.0.0.1:49944/solr/collection1/
[junit4:junit4]   2> 18467 T750 oascc.SolrZkClient.makePath makePath: /collections/collection1/leaders/shard5
[junit4:junit4]   2> 18471 T755 oazs.PrepRequestProcessor.pRequest Got user-level KeeperException when processing sessionid:0x1397f5ab1420005 type:create cxid:0x4b zxid:0xfffffffffffffffe txntype:unknown reqpath:n/a Error Path:/solr/overseer Error:KeeperErrorCode = NodeExists for /solr/overseer
[junit4:junit4]   2> 18668 T771 oascc.ZkStateReader.updateClusterState Updating cloud state from ZooKeeper... 
[junit4:junit4]   2> 18672 T808 oascc.ZkStateReader$2.process A cluster state change has occurred - updating...
[junit4:junit4]   2> 18672 T796 oascc.ZkStateReader$2.process A cluster state change has occurred - updating...
[junit4:junit4]   2> 18672 T784 oascc.ZkStateReader$2.process A cluster state change has occurred - updating...
[junit4:junit4]   2> 18672 T770 oascc.ZkStateReader$2.process A cluster state change has occurred - updating...
[junit4:junit4]   2> 18681 T750 oasc.ZkController.register We are http://127.0.0.1:49944/solr/collection1/ and leader is http://127.0.0.1:49944/solr/collection1/
[junit4:junit4]   2> 18681 T750 oasc.ZkController.register No LogReplay needed for core=collection1 baseURL=http://127.0.0.1:49944/solr
[junit4:junit4]   2> 18682 T750 oasc.ZkController.checkRecovery I am the leader, no recovery necessary
[junit4:junit4]   2> 18683 T750 oascc.ZkStateReader.updateClusterState Updating cloud state from ZooKeeper... 
[junit4:junit4]   2> 18684 T750 oass.SolrDispatchFilter.init user.dir=/mnt/ssd/jenkins/workspace/Lucene-Solr-4.x-Linux/solr/build/solr-core/test/J1
[junit4:junit4]   2> 18684 T750 oass.SolrDispatchFilter.init SolrDispatchFilter.init() done
[junit4:junit4]   2> 18685 T750 oascsi.HttpClientUtil.createClient Creating new http client, config:maxConnections=128&maxConnectionsPerHost=32&followRedirects=false
[junit4:junit4]   2> ASYNC  NEW_CORE C61 name=collection1 org.apache.solr.core.SolrCore@121b5c9 url=http://127.0.0.1:44054/solr/collection1 node=127.0.0.1:44054_solr
[junit4:junit4]   2> 18700 T762 C61 P44054 oasc.SolrDeletionPolicy.onInit SolrDeletionPolicy.onInit: commits:num=1
[junit4:junit4]   2> 		commit{dir=NRTCachingDirectory(org.apache.lucene.store.NIOFSDirectory@/mnt/ssd/jenkins/workspace/Lucene-Solr-4.x-Linux/solr/build/solr-core/test-files/control1/collection1/data/index lockFactory=org.apache.lucene.store.NativeFSLockFactory@eba774; maxCacheMB=48.0 maxMergeSizeMB=4.0),segFN=segments_1,generation=1,filenames=[segments_1]
[junit4:junit4]   2> 18701 T762 C61 P44054 oasc.SolrDeletionPolicy.updateCommits newest commit = 1
[junit4:junit4]   2> 18702 T762 C61 P44054 oass.SolrIndexSearcher.<init> Opening Searcher@12e6851 realtime
[junit4:junit4]   2> 18703 T762 C61 P44054 UPDATE [collection1] webapp=/solr path=/update params={version=2&wt=javabin} {deleteByQuery=*:* (-1411867142931873792)} 0 4
[junit4:junit4]   2> ASYNC  NEW_CORE C62 name=collection1 org.apache.solr.core.SolrCore@110f43c url=http://127.0.0.1:50065/solr/collection1 node=127.0.0.1:50065_solr
[junit4:junit4]   2> 18710 T776 C62 P50065 oasc.SolrDeletionPolicy.onInit SolrDeletionPolicy.onInit: commits:num=1
[junit4:junit4]   2> 		commit{dir=NRTCachingDirectory(org.apache.lucene.store.NIOFSDirectory@/mnt/ssd/jenkins/workspace/Lucene-Solr-4.x-Linux/solr/build/solr-core/test-files/jetty2/collection1/data/index lockFactory=org.apache.lucene.store.NativeFSLockFactory@1696cdc; maxCacheMB=48.0 maxMergeSizeMB=4.0),segFN=segments_1,generation=1,filenames=[segments_1]
[junit4:junit4]   2> 18711 T776 C62 P50065 oasc.SolrDeletionPolicy.updateCommits newest commit = 1
[junit4:junit4]   2> 18712 T776 C62 P50065 oass.SolrIndexSearcher.<init> Opening Searcher@1836162 realtime
[junit4:junit4]   2> ASYNC  NEW_CORE C63 name=collection1 org.apache.solr.core.SolrCore@1aa1504 url=http://127.0.0.1:49944/solr/collection1 node=127.0.0.1:49944_solr
[junit4:junit4]   2> 18730 T800 C63 P49944 oasc.SolrDeletionPolicy.onInit SolrDeletionPolicy.onInit: commits:num=1
[junit4:junit4]   2> 		commit{dir=NRTCachingDirectory(org.apache.lucene.store.NIOFSDirectory@/mnt/ssd/jenkins/workspace/Lucene-Solr-4.x-Linux/solr/build/solr-core/test-files/jetty4/collection1/data/index lockFactory=org.apache.lucene.store.NativeFSLockFactory@12a442a; maxCacheMB=48.0 maxMergeSizeMB=4.0),segFN=segments_1,generation=1,filenames=[segments_1]
[junit4:junit4]   2> ASYNC  NEW_CORE C64 name=collection1 org.apache.solr.core.SolrCore@bfb5cb url=http://127.0.0.1:59248/solr/collection1 node=127.0.0.1:59248_solr
[junit4:junit4]   2> 18730 T788 C64 P59248 oasc.SolrDeletionPolicy.onInit SolrDeletionPolicy.onInit: commits:num=1
[junit4:junit4]   2> 		commit{dir=NRTCachingDirectory(org.apache.lucene.store.NIOFSDirectory@/mnt/ssd/jenkins/workspace/Lucene-Solr-4.x-Linux/solr/build/solr-core/test-files/jetty3/collection1/data/index lockFactory=org.apache.lucene.store.NativeFSLockFactory@10a6595; maxCacheMB=48.0 maxMergeSizeMB=4.0),segFN=segments_1,generation=1,filenames=[segments_1]
[junit4:junit4]   2> 18731 T788 C64 P59248 oasc.SolrDeletionPolicy.updateCommits newest commit = 1
[junit4:junit4]   2> 18731 T800 C63 P49944 oasc.SolrDeletionPolicy.updateCommits newest commit = 1
[junit4:junit4]   2> 18732 T788 C64 P59248 oass.SolrIndexSearcher.<init> Opening Searcher@1acde04 realtime
[junit4:junit4]   2> 18732 T800 C63 P49944 oass.SolrIndexSearcher.<init> Opening Searcher@a1fffb realtime
[junit4:junit4]   2> 18732 T788 C64 P59248 REQ [collection1] webapp=/solr path=/update params={update.distrib=TOLEADER&version=2&wt=javabin} status=0 QTime=4 
[junit4:junit4]   2> 18732 T800 C63 P49944 REQ [collection1] webapp=/solr path=/update params={update.distrib=TOLEADER&version=2&wt=javabin} status=0 QTime=4 
[junit4:junit4]   2> 18733 T776 C62 P50065 UPDATE [collection1] webapp=/solr path=/update params={version=2&wt=javabin} {deleteByQuery=*:* (-1411867142942359552)} 0 26
[junit4:junit4]   2> 18736 T777 C62 P50065 REQ [collection1] webapp=/solr path=/update params={update.distrib=TOLEADER&version=2&wt=javabin} status=0 QTime=1 
[junit4:junit4]   2> 18736 T800 C63 P49944 REQ [collection1] webapp=/solr path=/update params={update.distrib=TOLEADER&version=2&wt=javabin} status=0 QTime=0 
[junit4:junit4]   2> 18737 T789 C64 P59248 UPDATE [collection1] webapp=/solr path=/update params={version=2&wt=javabin} {deleteByQuery=*:* (-1411867142968573952)} 0 3
[junit4:junit4]   2> 18740 T777 C62 P50065 REQ [collection1] webapp=/solr path=/update params={update.distrib=TOLEADER&version=2&wt=javabin} status=0 QTime=0 
[junit4:junit4]   2> 18740 T788 C64 P59248 REQ [collection1] webapp=/solr path=/update params={update.distrib=TOLEADER&version=2&wt=javabin} status=0 QTime=0 
[junit4:junit4]   2> 18740 T801 C63 P49944 UPDATE [collection1] webapp=/solr path=/update params={version=2&wt=javabin} {deleteByQuery=*:* (-1411867142972768256)} 0 2
[junit4:junit4]   2> 18744 T762 C61 P44054 UPDATE [collection1] webapp=/solr path=/update params={version=2&wt=javabin} {add=[1 (1411867142978011136)]} 0 2
[junit4:junit4]   2> 18747 T776 C62 P50065 UPDATE [collection1] webapp=/solr path=/update params={version=2&wt=javabin} {add=[1 (1411867142981156864)]} 0 1
[junit4:junit4]   2> 18749 T762 C61 P44054 UPDATE [collection1] webapp=/solr path=/update params={version=2&wt=javabin} {add=[2 (1411867142984302592)]} 0 0
[junit4:junit4]   2> 18760 T789 C64 P59248 UPDATE [collection1] webapp=/solr path=/update params={version=2&wt=javabin} {add=[2 (1411867142986399744)]} 0 9
[junit4:junit4]   2> 18763 T762 C61 P44054 UPDATE [collection1] webapp=/solr path=/update params={version=2&wt=javabin} {add=[3 (1411867142998982656)]} 0 1
[junit4:junit4]   2> 18770 T788 C64 P59248 REQ [collection1] webapp=/solr path=/update params={update.distrib=TOLEADER&version=2&distrib.from=http://127.0.0.1:49944/solr/collection1/&wt=javabin} status=0 QTime=1 
[junit4:junit4]   2> 18771 T801 C63 P49944 UPDATE [collection1] webapp=/solr path=/update params={version=2&wt=javabin} {add=[3]} 0 6
[junit4:junit4]   2> 18773 T762 C61 P44054 UPDATE [collection1] webapp=/solr path=/update params={version=2&wt=javabin} {add=[4 (1411867143009468416)]} 0 0
[junit4:junit4]   2> 18777 T788 C64 P59248 REQ [collection1] webapp=/solr path=/update params={update.distrib=TOLEADER&version=2&distrib.from=http://127.0.0.1:50065/solr/collection1/&wt=javabin} status=0 QTime=1 
[junit4:junit4]   2> 18778 T776 C62 P50065 UPDATE [collection1] webapp=/solr path=/update params={version=2&wt=javabin} {add=[4]} 0 3
[junit4:junit4]   2> 18780 T762 C61 P44054 UPDATE [collection1] webapp=/solr path=/update params={version=2&wt=javabin} {add=[5 (1411867143015759872)]} 0 1
[junit4:junit4]   2> 18784 T800 C63 P49944 REQ [collection1] webapp=/solr path=/update params={update.distrib=TOLEADER&version=2&distrib.from=http://127.0.0.1:59248/solr/collection1/&wt=javabin} status=0 QTime=1 
[junit4:junit4]   2> 18785 T789 C64 P59248 UPDATE [collection1] webapp=/solr path=/update params={version=2&wt=javabin} {add=[5]} 0 3
[junit4:junit4]   2> 18787 T762 C61 P44054 UPDATE [collection1] webapp=/solr path=/update params={version=2&wt=javabin} {add=[6 (1411867143024148480)]} 0 0
[junit4:junit4]   2> 18791 T788 C64 P59248 REQ [collection1] webapp=/solr path=/update params={update.distrib=TOLEADER&version=2&distrib.from=http://127.0.0.1:49944/solr/collection1/&wt=javabin} status=0 QTime=1 
[junit4:junit4]   2> 18791 T801 C63 P49944 UPDATE [collection1] webapp=/solr path=/update params={version=2&wt=javabin} {add=[6]} 0 2
[junit4:junit4]   2> 18794 T762 C61 P44054 UPDATE [collection1] webapp=/solr path=/update params={version=2&wt=javabin} {add=[7 (1411867143030439936)]} 0 1
[junit4:junit4]   2> 18797 T788 C64 P59248 REQ [collection1] webapp=/solr path=/update params={update.distrib=TOLEADER&version=2&distrib.from=http://127.0.0.1:50065/solr/collection1/&wt=javabin} status=0 QTime=0 
[junit4:junit4]   2> 18798 T776 C62 P50065 UPDATE [collection1] webapp=/solr path=/update params={version=2&wt=javabin} {add=[7]} 0 3
[junit4:junit4]   2> 18800 T762 C61 P44054 UPDATE [collection1] webapp=/solr path=/update params={version=2&wt=javabin} {add=[8 (1411867143037779968)]} 0 1
[junit4:junit4]   2> 18804 T777 C62 P50065 REQ [collection1] webapp=/solr path=/update params={update.distrib=TOLEADER&version=2&distrib.from=http://127.0.0.1:59248/solr/collection1/&wt=javabin} status=0 QTime=0 
[junit4:junit4]   2> 18805 T789 C64 P59248 UPDATE [collection1] webapp=/solr path=/update params={version=2&wt=javabin} {add=[8]} 0 3
[junit4:junit4]   2> 18807 T762 C61 P44054 UPDATE [collection1] webapp=/solr path=/update params={version=2&wt=javabin} {add=[9 (1411867143045120000)]} 0 0
[junit4:junit4]   2> 18811 T788 C64 P59248 REQ [collection1] webapp=/solr path=/update params={update.distrib=TOLEADER&version=2&distrib.from=http://127.0.0.1:49944/solr/collection1/&wt=javabin} status=0 QTime=1 
[junit4:junit4]   2> 18811 T801 C63 P49944 UPDATE [collection1] webapp=/solr path=/update params={version=2&wt=javabin} {add=[9]} 0 2
[junit4:junit4]   2> 18816 T762 C61 P44054 UPDATE [collection1] webapp=/solr path=/update params={version=2&wt=javabin} {add=[10 (1411867143051411456)]} 0 3
[junit4:junit4]   2> 18818 T776 C62 P50065 UPDATE [collection1] webapp=/solr path=/update params={version=2&wt=javabin} {add=[10 (1411867143056654336)]} 0 1
[junit4:junit4]   2> 18828 T762 C61 P44054 UPDATE [collection1] webapp=/solr path=/update params={version=2&wt=javabin} {add=[11 (1411867143058751488)]} 0 8
[junit4:junit4]   2> 18832 T777 C62 P50065 REQ [collection1] webapp=/solr path=/update params={update.distrib=TOLEADER&version=2&distrib.from=http://127.0.0.1:59248/solr/collection1/&wt=javabin} status=0 QTime=0 
[junit4:junit4]   2> 18833 T789 C64 P59248 UPDATE [collection1] webapp=/solr path=/update params={version=2&wt=javabin} {add=[11]} 0 3
[junit4:junit4]   2> 18835 T762 C61 P44054 UPDATE [collection1] webapp=/solr path=/update params={version=2&wt=javabin} {add=[12 (1411867143073431552)]} 0 1
[junit4:junit4]   2> 18839 T788 C64 P59248 REQ [collection1] webapp=/solr path=/update params={update.distrib=TOLEADER&version=2&distrib.from=http://127.0.0.1:49944/solr/collection1/&wt=javabin} status=0 QTime=1 
[junit4:junit4]   2> 18839 T801 C63 P49944 UPDATE [collection1] webapp=/solr path=/update params={version=2&wt=javabin} {add=[12]} 0 2
[junit4:junit4]   2> 18842 T762 C61 P44054 UPDATE [collection1] webapp=/solr path=/update params={version=2&wt=javabin} {add=[13 (1411867143080771584)]} 0 1
[junit4:junit4]   2> 18844 T776 C62 P50065 UPDATE [collection1] webapp=/solr path=/update params={version=2&wt=javabin} {add=[13 (1411867143082868736)]} 0 1
[junit4:junit4]   2> 18846 T762 C61 P44054 UPDATE [collection1] webapp=/solr path=/update params={version=2&wt=javabin} {add=[14 (1411867143086014464)]} 0 0
[junit4:junit4]   2> 18850 T777 C62 P50065 REQ [collection1] webapp=/solr path=/update params={update.distrib=TOLEADER&version=2&distrib.from=http://127.0.0.1:59248/solr/collection1/&wt=javabin} status=0 QTime=1 
[junit4:junit4]   2> 18851 T789 C64 P59248 UPDATE [collection1] webapp=/solr path=/update params={version=2&wt=javabin} {add=[14]} 0 3
[junit4:junit4]   2> 18853 T762 C61 P44054 UPDATE [collection1] webapp=/solr path=/update params={version=2&wt=javabin} {add=[15 (1411867143093354496)]} 0 1
[junit4:junit4]   2> 18857 T788 C64 P59248 REQ [collection1] webapp=/solr path=/update params={update.distrib=TOLEADER&version=2&distrib.from=http://127.0.0.1:49944/solr/collection1/&wt=javabin} status=0 QTime=1 
[junit4:junit4]   2> 18857 T801 C63 P49944 UPDATE [collection1] webapp=/solr path=/update params={version=2&wt=javabin} {add=[15]} 0 2
[junit4:junit4]   2> 18860 T762 C61 P44054 UPDATE [collection1] webapp=/solr path=/update params={version=2&wt=javabin} {add=[16 (1411867143099645952)]} 0 1
[junit4:junit4]   2> 18862 T776 C62 P50065 UPDATE [collection1] webapp=/solr path=/update params={version=2&wt=javabin} {add=[16 (1411867143101743104)]} 0 1
[junit4:junit4]   2> 18866 T762 C61 P44054 UPDATE [collection1] webapp=/solr path=/update params={version=2&wt=javabin} {add=[17 (1411867143104888832)]} 0 2
[junit4:junit4]   2> 18871 T800 C63 P49944 REQ [collection1] webapp=/solr path=/update params={update.distrib=TOLEADER&version=2&distrib.from=http://127.0.0.1:59248/solr/collection1/&wt=javabin} status=0 QTime=2 
[junit4:junit4]   2> 18871 T789 C64 P59248 UPDATE [collection1] webapp=/solr path=/update params={version=2&wt=javabin} {add=[17]} 0 4
[junit4:junit4]   2> 18873 T762 C61 P44054 UPDATE [collection1] webapp=/solr path=/update params={version=2&wt=javabin} {add=[100 (1411867143114326016)]} 0 0
[junit4:junit4]   2> 18877 T777 C62 P50065 REQ [collection1] webapp=/solr path=/update params={update.distrib=TOLEADER&version=2&distrib.from=http://127.0.0.1:59248/solr/collection1/&wt=javabin} status=0 QTime=1 
[junit4:junit4]   2> 18877 T789 C64 P59248 UPDATE [collection1] webapp=/solr path=/update params={version=2&wt=javabin} {add=[100]} 0 2
[junit4:junit4]   2> 18880 T762 C61 P44054 UPDATE [collection1] webapp=/solr path=/update params={version=2&wt=javabin} {add=[101 (1411867143120617472)]} 0 1
[junit4:junit4]   2> 18884 T788 C64 P59248 REQ [collection1] webapp=/solr path=/update params={update.distrib=TOLEADER&version=2&distrib.from=http://127.0.0.1:49944/solr/collection1/&wt=javabin} status=0 QTime=1 
[junit4:junit4]   2> 18884 T801 C63 P49944 UPDATE [collection1] webapp=/solr path=/update params={version=2&wt=javabin} {add=[101]} 0 2
[junit4:junit4]   2> 18897 T762 C61 P44054 UPDATE [collection1] webapp=/solr path=/update params={version=2&wt=javabin} {add=[102 (1411867143127957504)]} 0 11
[junit4:junit4]   2> 18904 T788 C64 P59248 REQ [collection1] webapp=/solr path=/update params={update.distrib=TOLEADER&version=2&distrib.from=http://127.0.0.1:50065/solr/collection1/&wt=javabin} status=0 QTime=3 
[junit4:junit4]   2> 18904 T776 C62 P50065 UPDATE [collection1] webapp=/solr path=/update params={version=2&wt=javabin} {add=[102]} 0 5
[junit4:junit4]   2> 18907 T762 C61 P44054 UPDATE [collection1] webapp=/solr path=/update params={version=2&wt=javabin} {add=[103 (1411867143148929024)]} 0 1
[junit4:junit4]   2> 18912 T800 C63 P49944 REQ [collection1] webapp=/solr path=/update params={update.distrib=TOLEADER&version=2&distrib.from=http://127.0.0.1:59248/solr/collection1/&wt=javabin} status=0 QTime=1 
[junit4:junit4]   2> 18912 T789 C64 P59248 UPDATE [collection1] webapp=/solr path=/update params={version=2&wt=javabin} {add=[103]} 0 3
[junit4:junit4]   2> 18915 T762 C61 P44054 UPDATE [collection1] webapp=/solr path=/update params={version=2&wt=javabin} {add=[104 (1411867143157317632)]} 0 1
[junit4:junit4]   2> 18917 T801 C63 P49944 UPDATE [collection1] webapp=/solr path=/update params={version=2&wt=javabin} {add=[104 (1411867143160463360)]} 0 0
[junit4:junit4]   2> 18920 T762 C61 P44054 UPDATE [collection1] webapp=/solr path=/update params={version=2&wt=javabin} {add=[105 (1411867143162560512)]} 0 1
[junit4:junit4]   2> 18924 T788 C64 P59248 REQ [collection1] webapp=/solr path=/update params={update.distrib=TOLEADER&version=2&distrib.from=http://127.0.0.1:50065/solr/collection1/&wt=javabin} status=0 QTime=1 
[junit4:junit4]   2> 18925 T776 C62 P50065 UPDATE [collection1] webapp=/solr path=/update params={version=2&wt=javabin} {add=[105]} 0 3
[junit4:junit4]   2> 18927 T762 C61 P44054 UPDATE [collection1] webapp=/solr path=/update params={version=2&wt=javabin} {add=[106 (1411867143170949120)]} 0 1
[junit4:junit4]   2> 18931 T800 C63 P49944 REQ [collection1] webapp=/solr path=/update params={update.distrib=TOLEADER&version=2&distrib.from=http://127.0.0.1:59248/solr/collection1/&wt=javabin} status=0 QTime=1 
[junit4:junit4]   2> 18931 T789 C64 P59248 UPDATE [collection1] webapp=/solr path=/update params={version=2&wt=javabin} {add=[106]} 0 2
[junit4:junit4]   2> 18934 T762 C61 P44054 UPDATE [collection1] webapp=/solr path=/update params={version=2&wt=javabin} {add=[107 (1411867143177240576)]} 0 1
[junit4:junit4]   2> 18938 T788 C64 P59248 REQ [collection1] webapp=/solr path=/update params={update.distrib=TOLEADER&version=2&distrib.from=http://127.0.0.1:49944/solr/collection1/&wt=javabin} status=0 QTime=1 
[junit4:junit4]   2> 18938 T801 C63 P49944 UPDATE [collection1] webapp=/solr path=/update params={version=2&wt=javabin} {add=[107]} 0 3
[junit4:junit4]   2> 18940 T762 C61 P44054 UPDATE [collection1] webapp=/solr path=/update params={version=2&wt=javabin} {add=[108 (1411867143184580608)]} 0 0
[junit4:junit4]   2> 18943 T776 C62 P50065 UPDATE [collection1] webapp=/solr path=/update params={version=2&wt=javabin} {add=[108 (1411867143187726336)]} 0 1
[junit4:junit4]   2> 18945 T762 C61 P44054 UPDATE [collection1] webapp=/solr path=/update params={version=2&wt=javabin} {add=[109 (1411867143189823488)]} 0 0
[junit4:junit4]   2> 18951 T777 C62 P50065 REQ [collection1] webapp=/solr path=/update params={update.distrib=TOLEADER&version=2&distrib.from=http://127.0.0.1:59248/solr/collection1/&wt=javabin} status=0 QTime=2 
[junit4:junit4]   2> 18959 T789 C64 P59248 UPDATE [collection1] webapp=/solr path=/update params={version=2&wt=javabin} {add=[109]} 0 12
[junit4:junit4]   2> 18962 T762 C61 P44054 UPDATE [collection1] webapp=/solr path=/update params={version=2&wt=javabin} {add=[110 (1411867143206600704)]} 0 1
[junit4:junit4]   2> 18966 T777 C62 P50065 REQ [collection1] webapp=/solr path=/update params={update.distrib=TOLEADER&version=2&distrib.from=http://127.0.0.1:49944/solr/collection1/&wt=javabin} status=0 QTime=1 
[junit4:junit4]   2> 18966 T801 C63 P49944 UPDATE [collection1] webapp=/solr path=/update params={version=2&wt=javabin} {add=[110]} 0 2
[junit4:junit4]   2> 18969 T762 C61 P44054 UPDATE [collection1] webapp=/solr path=/update params={version=2&wt=javabin} {add=[111 (1411867143213940736)]} 0 1
[junit4:junit4]   2> 18973 T788 C64 P59248 REQ [collection1] webapp=/solr path=/update params={update.distrib=TOLEADER&version=2&distrib.from=http://127.0.0.1:50065/solr/collection1/&wt=javabin} status=0 QTime=0 
[junit4:junit4]   2> 18974 T776 C62 P50065 UPDATE [collection1] webapp=/solr path=/update params={version=2&wt=javabin} {add=[111]} 0 3
[junit4:junit4]   2> 18978 T762 C61 P44054 UPDATE [collection1] webapp=/solr path=/update params={version=2&wt=javabin} {add=[112 (1411867143222329344)]} 0 3
[junit4:junit4]   2> 18982 T800 C63 P49944 REQ [collection1] webapp=/solr path=/update params={update.distrib=TOLEADER&version=2&distrib.from=http://127.0.0.1:59248/solr/collection1/&wt=javabin} status=0 QTime=1 
[junit4:junit4]   2> 18982 T789 C64 P59248 UPDATE [collection1] webapp=/solr path=/update params={version=2&wt=javabin} {add=[112]} 0 2
[junit4:junit4]   2> 18985 T762 C61 P44054 UPDATE [collection1] webapp=/solr path=/update params={version=2&wt=javabin} {add=[113 (1411867143230717952)]} 0 1
[junit4:junit4]   2> 18989 T788 C64 P59248 REQ [collection1] webapp=/solr path=/update params={update.distrib=TOLEADER&version=2&distrib.from=http://127.0.0.1:49944/solr/collection1/&wt=javabin} status=0 QTime=1 
[junit4:junit4]   2> 18990 T801 C63 P49944 UPDATE [collection1] webapp=/solr path=/update params={version=2&wt=javabin} {add=[113]} 0 3
[junit4:junit4]   2> 18992 T762 C61 P44054 UPDATE [collection1] webapp=/solr path=/update params={version=2&wt=javabin} {add=[114 (1411867143238057984)]} 0 1
[junit4:junit4]   2> 18996 T788 C64 P59248 REQ [collection1] webapp=/solr path=/update params={update.distrib=TOLEADER&version=2&distrib.from=http://127.0.0.1:50065/solr/collection1/&wt=javabin} status=0 QTime=1 
[junit4:junit4]   2> 18997 T776 C62 P50065 UPDATE [collection1] webapp=/solr path=/update params={version=2&wt=javabin} {add=[114]} 0 3
[junit4:junit4]   2> 18999 T762 C61 P44054 UPDATE [collection1] webapp=/solr path=/update params={version=2&wt=javabin} {add=[115 (1411867143245398016)]} 0 1
[junit4:junit4]   2> 19001 T789 C64 P59248 UPDATE [collection1] webapp=/solr path=/update params={version=2&wt=javabin} {add=[115 (1411867143248543744)]} 0 0
[junit4:junit4]   2> 19004 T762 C61 P44054 UPDATE [collection1] webapp=/solr path=/update params={version=2&wt=javabin} {add=[116 (1411867143250640896)]} 0 1
[junit4:junit4]   2> 19006 T801 C63 P49944 UPDATE [collection1] webapp=/solr path=/update params={version=2&wt=javabin} {add=[116 (1411867143253786624)]} 0 1
[junit4:junit4]   2> 19009 T762 C61 P44054 UPDATE [collection1] webapp=/solr path=/update params={version=2&wt=javabin} {add=[117 (1411867143255883776)]} 0 1
[junit4:junit4]   2> 19012 T788 C64 P59248 REQ [collection1] webapp=/solr path=/update params={update.distrib=TOLEADER&version=2&distrib.from=http://127.0.0.1:50065/solr/collection1/&wt=javabin} status=0 QTime=0 
[junit4:junit4]   2> 19013 T776 C62 P50065 UPDATE [collection1] webapp=/solr path=/update params={version=2&wt=javabin} {add=[117]} 0 3
[junit4:junit4]   2> 19015 T762 C61 P44054 UPDATE [collection1] webapp=/solr path=/update params={version=2&wt=javabin} {add=[118 (1411867143263223808)]} 0 0
[junit4:junit4]   2> 19019 T777 C62 P50065 REQ [collection1] webapp=/solr path=/update params={update.distrib=TOLEADER&version=2&distrib.from=http://127.0.0.1:59248/solr/collection1/&wt=javabin} status=0 QTime=0 
[junit4:junit4]   2> 19020 T789 C64 P59248 UPDATE [collection1] webapp=/solr path=/update params={version=2&wt=javabin} {add=[118]} 0 3
[junit4:junit4]   2> 19022 T762 C61 P44054 UPDATE [collection1] webapp=/solr path=/update params={version=2&wt=javabin} {add=[119 (1411867143270563840)]} 0 1
[junit4:junit4]   2> 19026 T788 C64 P59248 REQ [collection1] webapp=/solr path=/update params={update.distrib=TOLEADER&version=2&distrib.from=http://127.0.0.1:49944/solr/collection1/&wt=javabin} status=0 QTime=1 
[junit4:junit4]   2> 19026 T801 C63 P49944 UPDATE [collection1] webapp=/solr path=/update params={version=2&wt=javabin} {add=[119]} 0 2
[junit4:junit4]   2> 19028 T762 C61 P44054 UPDATE [collection1] webapp=/solr path=/update params={version=2&wt=javabin} {add=[120 (1411867143276855296)]} 0 0
[junit4:junit4]   2> 19039 T788 C64 P59248 REQ [collection1] webapp=/solr path=/update params={update.distrib=TOLEADER&version=2&distrib.from=http://127.0.0.1:50065/solr/collection1/&wt=javabin} status=0 QTime=1 
[junit4:junit4]   2> 19040 T776 C62 P50065 UPDATE [collection1] webapp=/solr path=/update params={version=2&wt=javabin} {add=[120]} 0 10
[junit4:junit4]   2> 19042 T762 C61 P44054 UPDATE [collection1] webapp=/solr path=/update params={version=2&wt=javabin} {add=[121 (1411867143290486784)]} 0 1
[junit4:junit4]   2> 19046 T800 C63 P49944 REQ [collection1] webapp=/solr path=/update params={update.distrib=TOLEADER&version=2&distrib.from=http://127.0.0.1:59248/solr/collection1/&wt=javabin} status=0 QTime=1 
[junit4:junit4]   2> 19046 T789 C64 P59248 UPDATE [collection1] webapp=/solr path=/update params={version=2&wt=javabin} {add=[121]} 0 2
[junit4:junit4]   2> 19051 T762 C61 P44054 UPDATE [collection1] webapp=/solr path=/update params={version=2&wt=javabin} {add=[122 (1411867143297826816)]} 0 3
[junit4:junit4]   2> 19056 T788 C64 P59248 REQ [collection1] webapp=/solr path=/update params={update.distrib=TOLEADER&version=2&distrib.from=http://127.0.0.1:49944/solr/collection1/&wt=javabin} status=0 QTime=2 
[junit4:junit4]   2> 19057 T801 C63 P49944 UPDATE [collection1] webapp=/solr path=/update params={version=2&wt=javabin} {add=[122]} 0 5
[junit4:junit4]   2> 19059 T762 C61 P44054 UPDATE [collection1] webapp=/solr path=/update params={version=2&wt=javabin} {add=[123 (1411867143309361152)]} 0 1
[junit4:junit4]   2> 19062 T776 C62 P50065 UPDATE [collection1] webapp=/solr path=/update params={version=2&wt=javabin} {add=[123 (1411867143311458304)]} 0 1
[junit4:junit4]   2> 19064 T762 C61 P44054 UPDATE [collection1] webapp=/solr path=/update params={version=2&wt=javabin} {add=[124 (1411867143313555456)]} 0 1
[junit4:junit4]   2> 19068 T777 C62 P50065 REQ [collection1] webapp=/solr path=/update params={update.distrib=TOLEADER&version=2&distrib.from=http://127.0.0.1:59248/solr/collection1/&wt=javabin} status=0 QTime=1 
[junit4:junit4]   2> 19068 T789 C64 P59248 UPDATE [collection1] webapp=/solr path=/update params={version=2&wt=javabin} {add=[124]} 0 2
[junit4:junit4]   2> 19070 T762 C61 P44054 UPDATE [collection1] webapp=/solr path=/update params={version=2&wt=javabin} {add=[125 (1411867143320895488)]} 0 0
[junit4:junit4]   2> 19074 T788 C64 P59248 REQ [collection1] webapp=/solr path=/update params={update.distrib=TOLEADER&version=2&distrib.from=http://127.0.0.1:49944/solr/collection1/&wt=javabin} status=0 QTime=0 
[junit4:junit4]   2> 19075 T801 C63 P49944 UPDATE [collection1] webapp=/solr path=/update params={version=2&wt=javabin} {add=[125]} 0 3
[junit4:junit4]   2> 19077 T762 C61 P44054 UPDATE [collection1] webapp=/solr path=/update params={version=2&wt=javabin} {add=[126 (1411867143328235520)]} 0 0
[junit4:junit4]   2> 19081 T800 C63 P49944 REQ [collection1] webapp=/solr path=/update params={update.distrib=TOLEADER&version=2&distrib.from=http://127.0.0.1:50065/solr/collection1/&wt=javabin} status=0 QTime=1 
[junit4:junit4]   2> 19081 T776 C62 P50065 UPDATE [collection1] webapp=/solr path=/update params={version=2&wt=javabin} {add=[126]} 0 2
[junit4:junit4]   2> 19084 T762 C61 P44054 UPDATE [collection1] webapp=/solr path=/update params={version=2&wt=javabin} {add=[127 (1411867143334526976)]} 0 1
[junit4:junit4]   2> 19102 T800 C63 P49944 REQ [collection1] webapp=/solr path=/update params={update.distrib=TOLEADER&version=2&distrib.from=http://127.0.0.1:59248/solr/collection1/&wt=javabin} status=0 QTime=15 
[junit4:junit4]   2> 19102 T789 C64 P59248 UPDATE [collection1] webapp=/solr path=/update params={version=2&wt=javabin} {add=[127]} 0 17
[junit4:junit4]   2> 19105 T762 C61 P44054 UPDATE [collection1] webapp=/solr path=/update params={version=2&wt=javabin} {add=[128 (1411867143356547072)]} 0 1
[junit4:junit4]   2> 19108 T801 C63 P49944 UPDATE [collection1] webapp=/solr path=/update params={version=2&wt=javabin} {add=[128 (1411867143359692800)]} 0 1
[junit4:junit4]   2> 19111 T762 C61 P44054 UPDATE [collection1] webapp=/solr path=/update params={version=2&wt=javabin} {add=[129 (1411867143362838528)]} 0 1
[junit4:junit4]   2> 19114 T788 C64 P59248 REQ [collection1] webapp=/solr path=/update params={update.distrib=TOLEADER&version=2&distrib.from=http://127.0.0.1:50065/solr/collection1/&wt=javabin} status=0 QTime=0 
[junit4:junit4]   2> 19115 T776 C62 P50065 UPDATE [collection1] webapp=/solr path=/update params={version=2&wt=javabin} {add=[129]} 0 3
[junit4:junit4]   2> 19117 T762 C61 P44054 UPDATE [collection1] webapp=/solr path=/update params={version=2&wt=javabin} {add=[130 (1411867143369129984)]} 0 1
[junit4:junit4]   2> 19119 T789 C64 P59248 UPDATE [collection1] webapp=/solr path=/update params={version=2&wt=javabin} {add=[130 (1411867143372275712)]} 0 1
[junit4:junit4]   2> 19121 T762 C61 P44054 UPDATE [collection1] webapp=/solr path=/update params={version=2&wt=javabin} {add=[131 (1411867143374372864)]} 0 0
[junit4:junit4]   2> 19123 T801 C63 P49944 UPDATE [collection1] webapp=/solr path=/update params={version=2&wt=javabin} {add=[131 (1411867143376470016)]} 0 0
[junit4:junit4]   2> 19128 T762 C61 P44054 UPDATE [collection1] webapp=/solr path=/update params={version=2&wt=javabin} {add=[132 (1411867143378567168)]} 0 3
[junit4:junit4]   2> 19130 T776 C62 P50065 UPDATE [collection1] webapp=/solr path=/update params={version=2&wt=javabin} {add=[132 (1411867143382761472)]} 0 1
[junit4:junit4]   2> 19132 T762 C61 P44054 UPDATE [collection1] webapp=/solr path=/update params={version=2&wt=javabin} {add=[133 (1411867143385907200)]} 0 0
[junit4:junit4]   2> 19135 T789 C64 P59248 UPDATE [collection1] webapp=/solr path=/update params={version=2&wt=javabin} {add=[133 (1411867143388004352)]} 0 1
[junit4:junit4]   2> 19137 T762 C61 P44054 UPDATE [collection1] webapp=/solr path=/update params={version=2&wt=javabin} {add=[134 (1411867143391150080)]} 0 1
[junit4:junit4]   2> 19141 T788 C64 P59248 REQ [collection1] webapp=/solr path=/update params={update.distrib=TOLEADER&version=2&distrib.from=http://127.0.0.1:49944/solr/collection1/&wt=javabin} status=0 QTime=1 
[junit4:junit4]   2> 19141 T801 C63 P49944 UPDATE [collection1] webapp=/solr path=/update params={version=2&wt=javabin} {add=[134]} 0 2
[junit4:junit4]   2> 19143 T762 C61 P44054 UPDATE [collection1] webapp=/solr path=/update params={version=2&wt=javabin} {add=[135 (1411867143397441536)]} 0 0
[junit4:junit4]   2> 19145 T776 C62 P50065 UPDATE [collection1] webapp=/solr path=/update params={version=2&wt=javabin} {add=[135 (1411867143399538688)]} 0 0
[junit4:junit4]   2> 19148 T762 C61 P44054 UPDATE [collection1] webapp=/solr path=/update params={version=2&wt=javabin} {add=[136 (1411867143401635840)]} 0 1
[junit4:junit4]   2> 19151 T800 C63 P49944 REQ [collection1] webapp=/solr path=/update params={update.distrib=TOLEADER&version=2&distrib.from=http://127.0.0.1:59248/solr/collection1/&wt=javabin} status=0 QTime=0 
[junit4:junit4]   2> 19152 T789 C64 P59248 UPDATE [collection1] webapp=/solr path=/update params={version=2&wt=javabin} {add=[136]} 0 3
[junit4:junit4]   2> 19154 T762 C61 P44054 UPDATE [collection1] webapp=/solr path=/update params={version=2&wt=javabin} {add=[137 (1411867143407927296)]} 0 1
[junit4:junit4]   2> 19156 T801 C63 P49944 UPDATE [collection1] webapp=/solr path=/update params={version=2&wt=javabin} {add=[137 (1411867143411073024)]} 0 0
[junit4:junit4]   2> 19158 T762 C61 P44054 UPDATE [collection1] webapp=/solr path=/update params={version=2&wt=javabin} {add=[138 (1411867143413170176)]} 0 0
[junit4:junit4]   2> 19160 T776 C62 P50065 UPDATE [collection1] webapp=/solr path=/update params={version=2&wt=javabin} {add=[138 (1411867143415267328)]} 0 0
[junit4:junit4]   2> 19163 T762 C61 P44054 UPDATE [collection1] webapp=/solr path=/update params={version=2&wt=javabin} {add=[139 (1411867143417364480)]} 0 1
[junit4:junit4]   2> 19166 T800 C63 P49944 REQ [collection1] webapp=/solr path=/update params={update.distrib=TOLEADER&version=2&distrib.from=http://127.0.0.1:59248/solr/collection1/&wt=javabin} status=0 QTime=0 
[junit4:junit4]   2> 19173 T789 C64 P59248 UPDATE [collection1] webapp=/solr path=/update params={version=2&wt=javabin} {add=[139]} 0 9
[junit4:junit4]   2> 19174 T771 oascc.ZkStateReader.updateClusterState Updating cloud state from ZooKeeper... 
[junit4:junit4]   2> 19176 T762 C61 P44054 UPDATE [collection1] webapp=/solr path=/update params={version=2&wt=javabin} {add=[140 (1411867143432044544)]} 0 1
[junit4:junit4]   2> 19178 T808 oascc.ZkStateReader$2.process A cluster state change has occurred - updating...
[junit4:junit4]   2> 19178 T770 oascc.ZkStateReader$2.process A cluster state change has occurred - updating...
[junit4:junit4]   2> 19178 T796 oascc.ZkStateReader$2.process A cluster state change has occurred - updating...
[junit4:junit4]   2> 19178 T784 oascc.ZkStateReader$2.process A cluster state change has occurred - updating...
[junit4:junit4]   2> 19180 T788 C64 P59248 REQ [collection1] webapp=/solr path=/update params={update.distrib=TOLEADER&version=2&distrib.from=http://127.0.0.1:49944/solr/collection1/&wt=javabin} status=0 QTime=1 
[junit4:junit4]   2>  C63_STATE=coll:collection1 core:collection1 props:{shard=shard5, base_url=http://127.0.0.1:49944/solr, core=collection1, collection=collection1, node_name=127.0.0.1:49944_solr, leader=true, state=active, roles=null}
[junit4:junit4]   2> 19180 T801 C63 P49944 UPDATE [collection1] webapp=/solr path=/update params={version=2&wt=javabin} {add=[140]} 0 2
[junit4:junit4]   2> 19183 T762 C61 P44054 UPDATE [collection1] webapp=/solr path=/update params={version=2&wt=javabin} {add=[141 (1411867143438336000)]} 0 1
[junit4:junit4]   2> 19186 T788 C64 P59248 REQ [collection1] webapp=/solr path=/update params={update.distrib=TOLEADER&version=2&distrib.from=http://127.0.0.1:50065/solr/collection1/&wt=javabin} status=0 QTime=0 
[junit4:junit4]   2> 19187 T776 C62 P50065 UPDATE [collection1] webapp=/solr path=/update params={version=2&wt=javabin} {add=[141]} 0 3
[junit4:junit4]   2> 19191 T762 C61 P44054 UPDATE [collection1] webapp=/solr path=/update params={version=2&wt=javabin} {add=[142 (1411867143444627456)]} 0 3
[junit4:junit4]   2> 19195 T800 C63 P49944 REQ [collection1] webapp=/solr path=/update params={update.distrib=TOLEADER&version=2&distrib.from=http://127.0.0.1:59248/solr/collection1/&wt=javabin} status=0 QTime=1 
[junit4:junit4]   2> 19195 T789 C64 P59248 UPDATE [collection1] webapp=/solr path=/update params={version=2&wt=javabin} {add=[142]} 0 3
[junit4:junit4]   2> 19197 T762 C61 P44054 UPDATE [collection1] webapp=/solr path=/update params={version=2&wt=javabin} {add=[143 (1411867143454064640)]} 0 0
[junit4:junit4]   2> 19201 T788 C64 P59248 REQ [collection1] webapp=/solr path=/update params={update.distrib=TOLEADER&version=2&distrib.from=http://127.0.0.1:49944/solr/collection1/&wt=javabin} status=0 QTime=0 
[junit4:junit4]   2> 19202 T801 C63 P49944 UPDATE [collection1] webapp=/solr path=/update params={version=2&wt=javabin} {add=[143]} 0 3
[junit4:junit4]   2> 19204 T762 C61 P44054 UPDATE [collection1] webapp=/solr path=/update params={version=2&wt=javabin} {add=[144 (1411867143460356096)]} 0 1
[junit4:junit4]   2> 19207 T788 C64 P59248 REQ [collection1] webapp=/solr path=/update params={update.distrib=TOLEADER&version=2&distrib.from=http://127.0.0.1:50065/solr/collection1/&wt=javabin} status=0 QTime=0 
[junit4:junit4]   2> 19208 T776 C62 P50065 UPDATE [collection1] webapp=/solr path=/update params={version=2&wt=javabin} {add=[144]} 0 3
[junit4:junit4]   2> 19210 T762 C61 P44054 UPDATE [collection1] webapp=/solr path=/update params={version=2&wt=javabin} {add=[145 (1411867143466647552)]} 0 1
[junit4:junit4]   2> 19213 T800 C63 P49944 REQ [collection1] webapp=/solr path=/update params={update.distrib=TOLEADER&version=2&distrib.from=http://127.0.0.1:59248/solr/collection1/&wt=javabin} status=0 QTime=0 
[junit4:junit4]   2> 19214 T789 C64 P59248 UPDATE [collection1] webapp=/solr path=/update params={version=2&wt=javabin} {add=[145]} 0 3
[junit4:junit4]   2> 19216 T762 C61 P44054 UPDATE [collection1] webapp=/solr path=/update params={version=2&wt=javabin} {add=[146 (1411867143472939008)]} 0 1
[junit4:junit4]   2> 19222 T788 C64 P59248 REQ [collection1] webapp=/solr path=/update params={update.distrib=TOLEADER&version=2&distrib.from=http://127.0.0.1:49944/solr/collection1/&wt=javabin} status=0 QTime=3 
[junit4:junit4]   2> 19222 T801 C63 P49944 UPDATE [collection1] webapp=/solr path=/update params={version=2&wt=javabin} {add=[146]} 0 4
[junit4:junit4]   2> 19224 T762 C61 P44054 UPDATE [collection1] webapp=/solr path=/update params={version=2&wt=javabin} {add=[147 (1411867143482376192)]} 0 0
[junit4:junit4]   2> 19228 T800 C63 P49944 REQ [collection1] webapp=/solr path=/update params={update.distrib=TOLEADER&version=2&distrib.from=http://127.0.0.1:50065/solr/collection1/&wt=javabin} status=0 QTime=0 
[junit4:junit4]   2> 19229 T776 C62 P50065 UPDATE [collection1] webapp=/solr path=/update params={version=2&wt=javabin} {add=[147]} 0 3
[junit4:junit4]   2> 19240 T762 C61 P44054 UPDATE [collection1] webapp=/solr path=/update params={version=2&wt=javabin} {add=[148 (1411867143488667648)]} 0 10
[junit4:junit4]   2> 19244 T777 C62 P50065 REQ [collection1] webapp=/solr path=/update params={update.distrib=TOLEADER&version=2&distrib.from=http://127.0.0.1:59248/solr/collection1/&wt=javabin} status=0 QTime=1 
[junit4:junit4]   2> 19244 T789 C64 P59248 UPDATE [collection1] webapp=/solr path=/update params={version=2&wt=javabin} {add=[148]} 0 2
[junit4:junit4]   2> 19246 T762 C61 P44054 UPDATE [collection1] webapp=/solr path=/update params={version=2&wt=javabin} {add=[149 (1411867143505444864)]} 0 0
[junit4:junit4]   2> 19249 T801 C63 P49944 UPDATE [collection1] webapp=/solr path=/update params={version=2&wt=javabin} {add=[149 (1411867143507542016)]} 0 1
[junit4:junit4]   2> 19250 T762 C61 P44054 oasu.DirectUpdateHandler2.commit start commit{flags=0,_version_=0,optimize=false,openSearcher=true,waitSearcher=true,expungeDeletes=false,softCommit=false}
[junit4:junit4]   2> 19300 T762 C61 P44054 oasc.SolrDeletionPolicy.onCommit SolrDeletionPolicy.onCommit: commits:num=2
[junit4:junit4]   2> 		commit{dir=NRTCachingDirectory(org.apache.lucene.store.NIOFSDirectory@/mnt/ssd/jenkins/workspace/Lucene-Solr-4.x-Linux/solr/build/solr-core/test-files/control1/collection1/data/index lockFactory=org.apache.lucene.store.NativeFSLockFactory@eba774; maxCacheMB=48.0 maxMergeSizeMB=4.0),segFN=segments_1,generation=1,filenames=[segments_1]
[junit4:junit4]   2> 		commit{dir=NRTCachingDirectory(org.apache.lucene.store.NIOFSDirectory@/mnt/ssd/jenkins/workspace/Lucene-Solr-4.x-Linux/solr/build/solr-core/test-files/control1/collection1/data/index lockFactory=org.apache.lucene.store.NativeFSLockFactory@eba774; maxCacheMB=48.0 maxMergeSizeMB=4.0),segFN=segments_2,generation=2,filenames=[_6.fnm, _3_nrm.cfe, _1.tip, _0.fdx, _1.tim, _5.prx, _6.tim, _2.tip, _4.fdt, _6_nrm.cfe, _5.frq, _1.fdt, _2.prx, _3.frq, _6.prx, _1.frq, _3.tip, _0.fnm, _1.prx, _0_nrm.cfe, _0.tim, _6.tip, _5.fnm, _2.frq, _5_nrm.cfe, _2.fdt, _2.si, _4.tip, _4.frq, _4.fdx, _5.tip, _3_nrm.cfs, _5.si, _0.tip, _4.si, _4.fnm, _3.si, _5_nrm.cfs, _1_nrm.cfe, _3.tim, _6_nrm.cfs, _4.tim, _2.fnm, _5.tim, _0.si, _4_nrm.cfs, _0.prx, _3.prx, _3.fnm, _3.fdx, _3.fdt, _0.fdt, _6.si, _2_nrm.cfs, _6.fdt, _6.frq, _2_nrm.cfe, _4.prx, _1.fdx, segments_2, _2.tim, _5.fdt, _1.si, _0.frq, _6.fdx, _1_nrm.cfs, _2.fdx, _4_nrm.cfe, _1.fnm, _0_nrm.cfs, _5.fdx]
[junit4:junit4]   2> 19300 T762 C61 P44054 oasc.SolrDeletionPolicy.updateCommits newest commit = 2
[junit4:junit4]   2> 19302 T762 C61 P44054 oass.SolrIndexSearcher.<init> Opening Searcher@111d141 main
[junit4:junit4]   2> 19303 T762 C61 P44054 oasu.DirectUpdateHandler2.commit end_commit_flush
[junit4:junit4]   2> 19304 T773 oasc.SolrCore.registerSearcher [collection1] Registered new searcher Searcher@111d141 main{StandardDirectoryReader(segments_2:15:nrt _0(4.0.0.2):C10 _1(4.0.0.2):C10 _2(4.0.0.2):C10 _3(4.0.0.2):C10 _4(4.0.0.2):C10 _5(4.0.0.2):C10 _6(4.0.0.2):C7)}
[junit4:junit4]   2> 19304 T762 C61 P44054 UPDATE [collection1] webapp=/solr path=/update params={version=2&softCommit=false&commit=true&waitSearcher=true&wt=javabin} {commit=} 0 54
[junit4:junit4]   2> 19306 T776 C62 P50065 oasu.DirectUpdateHandler2.commit start commit{flags=0,_version_=0,optimize=false,openSearcher=true,waitSearcher=true,expungeDeletes=false,softCommit=false}
[junit4:junit4]   2> 19340 T776 C62 P50065 oasc.SolrDeletionPolicy.onCommit SolrDeletionPolicy.onCommit: commits:num=2
[junit4:junit4]   2> 		commit{dir=NRTCachingDirectory(org.apache.lucene.store.NIOFSDirectory@/mnt/ssd/jenkins/workspace/Lucene-Solr-4.x-Linux/solr/build/solr-core/test-files/jetty2/collection1/data/index lockFactory=org.apache.lucene.store.NativeFSLockFactory@1696cdc; maxCacheMB=48.0 maxMergeSizeMB=4.0),segFN=segments_1,generation=1,filenames=[segments_1]
[junit4:junit4]   2> 		commit{dir=NRTCachingDirectory(org.apache.lucene.store.NIOFSDirectory@/mnt/ssd/jenkins/workspace/Lucene-Solr-4.x-Linux/solr/build/solr-core/test-files/jetty2/collection1/data/index lockFactory=org.apache.lucene.store.NativeFSLockFactory@1696cdc; maxCacheMB=48.0 maxMergeSizeMB=4.0),segFN=segments_2,generation=2,filenames=[_1.frq, _0.fnm, _1.tip, _0.fdt, _1.prx, _0.tip, _0_nrm.cfe, _0.fdx, _1.tim, _0.tim, _1_nrm.cfe, _1.fdx, segments_2, _1.si, _0.frq, _1_nrm.cfs, _0.si, _0.prx, _1.fdt, _1.fnm, _0_nrm.cfs]
[junit4:junit4]   2> 19340 T776 C62 P50065 oasc.SolrDeletionPolicy.updateCommits newest commit = 2
[junit4:junit4]   2> 19342 T776 C62 P50065 oass.SolrIndexSearcher.<init> Opening Searcher@98d10c main
[junit4:junit4]   2> 19342 T776 C62 P50065 oasu.DirectUpdateHandler2.commit end_commit_flush
[junit4:junit4]   2> 19343 T785 oasc.SolrCore.registerSearcher [collection1] Registered new searcher Searcher@98d10c main{StandardDirectoryReader(segments_2:5:nrt _0(4.0.0.2):C10 _1(4.0.0.2):C8)}
[junit4:junit4]   2> 19344 T776 C62 P50065 oasu.SolrCmdDistributor.distribCommit Distrib commit to:[StdNode: http://127.0.0.1:59248/solr/collection1/, StdNode: http://127.0.0.1:49944/solr/collection1/]
[junit4:junit4]   2> 19346 T788 C64 P59248 oasu.DirectUpdateHandler2.commit start commit{flags=0,_version_=0,optimize=false,openSearcher=true,waitSearcher=true,expungeDeletes=false,softCommit=false}
[junit4:junit4]   2> 19346 T800 C63 P49944 oasu.DirectUpdateHandler2.commit start commit{flags=0,_version_=0,optimize=false,openSearcher=true,waitSearcher=true,expungeDeletes=false,softCommit=false}
[junit4:junit4]   2> 19380 T800 C63 P49944 oasc.SolrDeletionPolicy.onCommit SolrDeletionPolicy.onCommit: commits:num=2
[junit4:junit4]   2> 		commit{dir=NRTCachingDirectory(org.apache.lucene.store.NIOFSDirectory@/mnt/ssd/jenkins/workspace/Lucene-Solr-4.x-Linux/solr/build/solr-core/test-files/jetty4/collection1/data/index lockFactory=org.apache.lucene.store.NativeFSLockFactory@12a442a; maxCacheMB=48.0 maxMergeSizeMB=4.0),segFN=segments_1,generation=1,filenames=[segments_1]
[junit4:junit4]   2> 		commit{dir=NRTCachingDirectory(org.apache.lucene.store.NIOFSDirectory@/mnt/ssd/jenkins/workspace/Lucene-Solr-4.x-Linux/solr/build/solr-core/test-files/jetty4/collection1/data/index lockFactory=org.apache.lucene.store.NativeFSLockFactory@12a442a; maxCacheMB=48.0 maxMergeSizeMB=4.0),segFN=segments_2,generation=2,filenames=[_1.frq, _0.fnm, _1.tip, _0.fdt, _1.prx, _0.tip, _0_nrm.cfe, _0.fdx, _1.tim, _0.tim, _1_nrm.cfe, _1.fdx, segments_2, _1.si, _0.frq, _1_nrm.cfs, _0.si, _0.prx, _1.fdt, _1.fnm, _0_nrm.cfs]
[junit4:junit4]   2> 19380 T800 C63 P49944 oasc.SolrDeletionPolicy.updateCommits newest commit = 2
[junit4:junit4]   2> 19382 T800 C63 P49944 oass.SolrIndexSearcher.<init> Opening Searcher@530bcb main
[junit4:junit4]   2> 19390 T800 C63 P49944 oasu.DirectUpdateHandler2.commit end_commit_flush
[junit4:junit4]   2> 19391 T809 oasc.SolrCore.registerSearcher [collection1] Registered new searcher Searcher@530bcb main{StandardDirectoryReader(segments_2:5:nrt _0(4.0.0.2):C10 _1(4.0.0.2):C9)}
[junit4:junit4]   2> 19391 T800 C63 P49944 UPDATE [collection1] webapp=/solr path=/update params={softCommit=false&waitSearcher=true&version=2&commit=true&commit_end_point=true&wt=javabin} {commit=} 0 45
[junit4:junit4]   2> 19400 T788 C64 P59248 oasc.SolrDeletionPolicy.onCommit SolrDeletionPolicy.onCommit: commits:num=2
[junit4:junit4]   2> 		commit{dir=NRTCachingDirectory(org.apache.lucene.store.NIOFSDirectory@/mnt/ssd/jenkins/workspace/Lucene-Solr-4.x-Linux/solr/build/solr-core/test-files/jetty3/collection1/data/index lockFactory=org.apache.lucene.store.NativeFSLockFactory@10a6595; maxCacheMB=48.0 maxMergeSizeMB=4.0),segFN=segments_1,generation=1,filenames=[segments_1]
[junit4:junit4]   2> 		commit{dir=NRTCachingDirectory(org.apache.lucene.store.NIOFSDirectory@/mnt/ssd/jenkins/workspace/Lucene-Solr-4.x-Linux/solr/build/solr-core/test-files/jetty3/collection1/data/index lockFactory=org.apache.lucene.store.NativeFSLockFactory@10a6595; maxCacheMB=48.0 maxMergeSizeMB=4.0),segFN=segments_2,generation=2,filenames=[_1.tip, _0.tip, _0.fdx, _1.tim, _1_nrm.cfe, _2.tip, _2.fnm, _0.si, _0.prx, _1.fdt, _2.prx, _1.frq, _0.fnm, _0.fdt, _1.prx, _2_nrm.cfs, _0_nrm.cfe, _0.tim, _2_nrm.cfe, segments_2, _1.fdx, _2.tim, _1.si, _0.frq, _2.frq, _1_nrm.cfs, _2.fdx, _2.fdt, _2.si, _0_nrm.cfs, _1.fnm]
[junit4:junit4]   2> 19400 T788 C64 P59248 oasc.SolrDeletionPolicy.updateCommits newest commit = 2
[junit4:junit4]   2> 19402 T788 C64 P59248 oass.SolrIndexSearcher.<init> Opening Searcher@99819c main
[junit4:junit4]   2> 19402 T788 C64 P59248 oasu.DirectUpdateHandler2.commit end_commit_flush
[junit4:junit4]   2> 19404 T797 oasc.SolrCore.registerSearcher [collection1] Registered new searcher Searcher@99819c main{StandardDirectoryReader(segments_2:7:nrt _0(4.0.0.2):C10 _1(4.0.0.2):C10 _2(4.0.0.2):C10)}
[junit4:junit4]   2> 19404 T788 C64 P59248 UPDATE [collection1] webapp=/solr path=/update params={softCommit=false&waitSearcher=true&version=2&commit=true&commit_end_point=true&wt=javabin} {commit=} 0 58
[junit4:junit4]   2> 19404 T776 C62 P50065 UPDATE [collection1] webapp=/solr path=/update params={version=2&softCommit=false&commit=true&waitSearcher=true&wt=javabin} {commit=} 0 98
[junit4:junit4]   2> 19406 T789 C64 P59248 oasu.DirectUpdateHandler2.commit start commit{flags=0,_version_=0,optimize=false,openSearcher=true,waitSearcher=true,expungeDeletes=false,softCommit=false}
[junit4:junit4]   2> 19407 T789 C64 P59248 oass.SolrIndexSearcher.<init> Opening Searcher@c8d195 main
[junit4:junit4]   2> 19408 T789 C64 P59248 oasu.DirectUpdateHandler2.commit end_commit_flush
[junit4:junit4]   2> 19409 T797 oasc.SolrCore.registerSearcher [collection1] Registered new searcher Searcher@c8d195 main{StandardDirectoryReader(segments_2:7:nrt _0(4.0.0.2):C10 _1(4.0.0.2):C10 _2(4.0.0.2):C10)}
[junit4:junit4]   2> 19409 T789 C64 P59248 oasu.SolrCmdDistributor.distribCommit Distrib commit to:[StdNode: http://127.0.0.1:50065/solr/collection1/, StdNode: http://127.0.0.1:49944/solr/collection1/]
[junit4:junit4]   2> 19411 T777 C62 P50065 oasu.DirectUpdateHandler2.commit start commit{flags=0,_version_=0,optimize=false,openSearcher=true,waitSearcher=true,expungeDeletes=false,softCommit=false}
[junit4:junit4]   2> 19411 T800 C63 P49944 oasu.DirectUpdateHandler2.commit start commit{flags=0,_version_=0,optimize=false,openSearcher=true,waitSearcher=true,expungeDeletes=false,softCommit=false}
[junit4:junit4]   2> 19412 T800 C63 P49944 oass.SolrIndexSearcher.<init> Opening Searcher@16d94ab main
[junit4:junit4]   2> 19412 T777 C62 P50065 oass.SolrIndexSearcher.<init> Opening Searcher@1d0d15f main
[junit4:junit4]   2> 19412 T800 C63 P49944 oasu.DirectUpdateHandler2.commit end_commit_flush
[junit4:junit4]   2> 19412 T777 C62 P50065 oasu.DirectUpdateHandler2.commit end_commit_flush
[junit4:junit4]   2> 19413 T809 oasc.SolrCore.registerSearcher [collection1] Registered new searcher Searcher@16d94ab main{StandardDirectoryReader(segments_2:5:nrt _0(4.0.0.2):C10 _1(4.0.0.2):C9)}
[junit4:junit4]   2> 19413 T785 oasc.SolrCore.registerSearcher [collection1] Registered new searcher Searcher@1d0d15f main{StandardDirectoryReader(segments_2:5:nrt _0(4.0.0.2):C10 _1(4.0.0.2):C8)}
[junit4:junit4]   2> 19414 T800 C63 P49944 UPDATE [collection1] webapp=/solr path=/update params={softCommit=false&waitSearcher=true&version=2&commit=true&commit_end_point=true&wt=javabin} {commit=} 0 3
[junit4:junit4]   2> 19414 T777 C62 P50065 UPDATE [collection1] webapp=/solr path=/update params={softCommit=false&waitSearcher=true&version=2&commit=true&commit_end_point=true&wt=javabin} {commit=} 0 3
[junit4:junit4]   2> 19414 T789 C64 P59248 UPDATE [collection1] webapp=/solr path=/update params={version=2&softCommit=false&commit=true&waitSearcher=true&wt=javabin} {commit=} 0 8
[junit4:junit4]   2> 19416 T801 C63 P49944 oasu.DirectUpdateHandler2.commit start commit{flags=0,_version_=0,optimize=false,openSearcher=true,waitSearcher=true,expungeDeletes=false,softCommit=false}
[junit4:junit4]   2> 19417 T801 C63 P49944 oass.SolrIndexSearcher.<init> Opening Searcher@2fbec4 main
[junit4:junit4]   2> 19417 T801 C63 P49944 oasu.DirectUpdateHandler2.commit end_commit_flush
[junit4:junit4]   2> 19419 T809 oasc.SolrCore.registerSearcher [collection1] Registered new searcher Searcher@2fbec4 main{StandardDirectoryReader(segments_2:5:nrt _0(4.0.0.2):C10 _1(4.0.0.2):C9)}
[junit4:junit4]   2> 19419 T801 C63 P49944 oasu.SolrCmdDistributor.distribCommit Distrib commit to:[StdNode: http://127.0.0.1:50065/solr/collection1/, StdNode: http://127.0.0.1:59248/solr/collection1/]
[junit4:junit4]   2> 19421 T777 C62 P50065 oasu.DirectUpdateHandler2.commit start commit{flags=0,_version_=0,optimize=false,openSearcher=true,waitSearcher=true,expungeDeletes=false,softCommit=false}
[junit4:junit4]   2> 19421 T788 C64 P59248 oasu.DirectUpdateHandler2.commit start commit{flags=0,_version_=0,optimize=false,openSearcher=true,waitSearcher=true,expungeDeletes=false,softCommit=false}
[junit4:junit4]   2> 19421 T777 C62 P50065 oass.SolrIndexSearcher.<init> Opening Searcher@ceccc6 main
[junit4:junit4]   2> 19421 T788 C64 P59248 oass.SolrIndexSearcher.<init> Opening Searcher@e864d8 main
[junit4:junit4]   2> 19421 T777 C62 P50065 oasu.DirectUpdateHandler2.commit end_commit_flush
[junit4:junit4]   2> 19429 T788 C64 P59248 oasu.DirectUpdateHandler2.commit end_commit_flush
[junit4:junit4]   2> 19429 T797 oasc.JmxMonitoredMap.put WARNING Failed to register info bean: searcher javax.management.InstanceAlreadyExistsException: solr/collection1:type=searcher,id=org.apache.solr.search.SolrIndexSearcher
[junit4:junit4]   2> 	at com.sun.jmx.mbeanserver.Repository.addMBean(Repository.java:437)
[junit4:junit4]   2> 	at com.sun.jmx.interceptor.DefaultMBeanServerInterceptor.registerWithRepository(DefaultMBeanServerInterceptor.java:1898)
[junit4:junit4]   2> 	at com.sun.jmx.interceptor.DefaultMBeanServerInterceptor.registerDynamicMBean(DefaultMBeanServerInterceptor.java:966)
[junit4:junit4]   2> 	at com.sun.jmx.interceptor.DefaultMBeanServerInterceptor.registerObject(DefaultMBeanServerInterceptor.java:900)
[junit4:junit4]   2> 	at com.sun.jmx.interceptor.DefaultMBeanServerInterceptor.registerMBean(DefaultMBeanServerInterceptor.java:324)
[junit4:junit4]   2> 	at com.sun.jmx.mbeanserver.JmxMBeanServer.registerMBean(JmxMBeanServer.java:512)
[junit4:junit4]   2> 	at org.apache.solr.core.JmxMonitoredMap.put(JmxMonitoredMap.java:140)
[junit4:junit4]   2> 	at org.apache.solr.core.JmxMonitoredMap.put(JmxMonitoredMap.java:51)
[junit4:junit4]   2> 	at org.apache.solr.search.SolrIndexSearcher.register(SolrIndexSearcher.java:242)
[junit4:junit4]   2> 	at org.apache.solr.core.SolrCore.registerSearcher(SolrCore.java:1633)
[junit4:junit4]   2> 	at org.apache.solr.core.SolrCore.access$000(SolrCore.java:121)
[junit4:junit4]   2> 	at org.apache.solr.core.SolrCore$7.call(SolrCore.java:1510)
[junit4:junit4]   2> 	at java.util.concurrent.FutureTask.run(FutureTask.java:262)
[junit4:junit4]   2> 	at java.util.concurrent.ThreadPoolExecutor.runWorker(ThreadPoolExecutor.java:1110)
[junit4:junit4]   2> 	at java.util.concurrent.ThreadPoolExecutor$Worker.run(ThreadPoolExecutor.java:603)
[junit4:junit4]   2> 	at java.lang.Thread.run(Thread.java:722)
[junit4:junit4]   2> 
[junit4:junit4]   2> 19431 T785 oasc.SolrCore.registerSearcher [collection1] Registered new searcher Searcher@ceccc6 main{StandardDirectoryReader(segments_2:5:nrt _0(4.0.0.2):C10 _1(4.0.0.2):C8)}
[junit4:junit4]   2> 19431 T777 C62 P50065 UPDATE [collection1] webapp=/solr path=/update params={softCommit=false&waitSearcher=true&version=2&commit=true&commit_end_point=true&wt=javabin} {commit=} 0 10
[junit4:junit4]   2> 19432 T797 oasc.SolrCore.registerSearcher [collection1] Registered new searcher Searcher@e864d8 main{StandardDirectoryReader(segments_2:7:nrt _0(4.0.0.2):C10 _1(4.0.0.2):C10 _2(4.0.0.2):C10)}
[junit4:junit4]   2> 19432 T788 C64 P59248 UPDATE [collection1] webapp=/solr path=/update params={softCommit=false&waitSearcher=true&version=2&commit=true&commit_end_point=true&wt=javabin} {commit=} 0 11
[junit4:junit4]   2> 19432 T801 C63 P49944 UPDATE [collection1] webapp=/solr path=/update params={version=2&softCommit=false&commit=true&waitSearcher=true&wt=javabin} {commit=} 0 16
[junit4:junit4]   2> 19435 T762 C61 P44054 REQ [collection1] webapp=/solr path=/select params={version=2&distrib=false&q=*:*&sort=n_ti1+desc&wt=javabin} hits=67 status=0 QTime=1 
[junit4:junit4]   2> 19440 T778 C62 P50065 REQ [collection1] webapp=/solr path=/select params={shard.url=127.0.0.1:50065/solr/collection1/&fl=id&rows=10&distrib=false&isShard=true&NOW=1346461433130&wt=javabin&q=*:*&start=0&fsv=true&version=2&sort=n_ti1+desc} hits=18 status=0 QTime=1 
[junit4:junit4]   2> 19440 T790 C64 P59248 REQ [collection1] webapp=/solr path=/select params={shard.url=127.0.0.1:59248/solr/collection1/&fl=id&rows=10&distrib=false&isShard=true&NOW=1346461433130&wt=javabin&q=*:*&start=0&fsv=true&version=2&sort=n_ti1+desc} hits=30 status=0 QTime=1 
[junit4:junit4]   2> 19440 T802 C63 P49944 REQ [collection1] webapp=/solr path=/select params={shard.url=127.0.0.1:49944/solr/collection1/&fl=id&rows=10&distrib=false&isShard=true&NOW=1346461433130&wt=javabin&q=*:*&start=0&fsv=true&version=2&sort=n_ti1+desc} hits=19 status=0 QTime=0 
[junit4:junit4]   2> 19442 T778 C62 P50065 REQ [collection1] webapp=/solr path=/select params={shard.url=127.0.0.1:50065/solr/collection1/&ids=110&q=*:*&version=2&distrib=false&isShard=true&NOW=1346461433130&wt=javabin} status=0 QTime=0 
[junit4:junit4]   2> 19443 T802 C63 P49944 REQ [collection1] webapp=/solr path=/select params={shard.url=127.0.0.1:49944/solr/collection1/&ids=149&q=*:*&version=2&distrib=false&isShard=true&NOW=1346461433130&wt=javabin} status=0 QTime=1 
[junit4:junit4]   2> 19443 T790 C64 P59248 REQ [collection1] webapp=/solr path=/select params={shard.url=127.0.0.1:59248/solr/collection1/&ids=130,7,146,4,6,143,144,125&q=*:*&version=2&distrib=false&isShard=true&NOW=1346461433130&wt=javabin} status=0 QTime=1 
[junit4:junit4]   2> 19444 T789 C64 P59248 REQ [collection1] webapp=/solr path=/select params={shards=shard3,shard4,shard5&version=2&q=*:*&sort=n_ti1+desc&wt=javabin} status=0 QTime=7 
[junit4:junit4]   2> 19446 T762 C61 P44054 REQ [collection1] webapp=/solr path=/select params={version=2&distrib=false&q=*:*&sort=n_ti1+asc&wt=javabin} hits=67 status=0 QTime=0 
[junit4:junit4]   2> 19447 T750 oascsi.HttpClientUtil.createClient Creating new http client, config:
[junit4:junit4]   2> 19450 T750 oaz.ZooKeeper.<init> Initiating client connection, connectString=127.0.0.1:57909/solr sessionTimeout=10000 watcher=org.apache.solr.common.cloud.ConnectionManager@5f718b
[junit4:junit4]   2> 19451 T815 oaz.ClientCnxn$SendThread.startConnect Opening socket connection to server /127.0.0.1:57909
[junit4:junit4]   2> 19451 T750 oascc.ConnectionManager.waitForConnected Waiting for client to connect to ZooKeeper
[junit4:junit4]   2> 19451 T815 oaz.ClientCnxn$SendThread.primeConnection Socket connection established to localhost.localdomain/127.0.0.1:57909, initiating session
[junit4:junit4]   2> 19451 T752 oazs.NIOServerCnxn$Factory.run Accepted socket connection from /127.0.0.1:41508
[junit4:junit4]   2> 19452 T752 oazs.NIOServerCnxn.readConnectRequest Client attempting to establish new session at /127.0.0.1:41508
[junit4:junit4]   2> 19453 T754 oazs.NIOServerCnxn.finishSessionInit Established session 0x1397f5ab1420006 with negotiated timeout 10000 for client /127.0.0.1:41508
[junit4:junit4]   2> 19453 T815 oaz.ClientCnxn$SendThread.readConnectResult Session establishment complete on server localhost.localdomain/127.0.0.1:57909, sessionid = 0x1397f5ab1420006, negotiated timeout = 10000
[junit4:junit4]   2> 19453 T816 oascc.ConnectionManager.process Watcher org.apache.solr.common.cloud.ConnectionManager@5f718b name:ZooKeeperConnection Watcher:127.0.0.1:57909/solr got event WatchedEvent state:SyncConnected type:None path:null path:null type:None
[junit4:junit4]   2> 19454 T750 oascc.ConnectionManager.waitForConnected Client is connected to ZooKeeper
[junit4:junit4]   2> 19454 T750 oascc.ZkStateReader.createClusterStateWatchersAndUpdate Updating cluster state from ZooKeeper... 
[junit4:junit4]   2> 19460 T791 C64 P59248 REQ [collection1] webapp=/solr path=/select params={shard.url=127.0.0.1:59248/solr/collection1/&fl=id&rows=10&distrib=false&isShard=true&NOW=1346461433150&wt=javabin&q=*:*&start=0&fsv=true&version=2&sort=n_ti1+asc} hits=30 status=0 QTime=0 
[junit4:junit4]   2> 19460 T779 C62 P50065 REQ [collection1] webapp=/solr path=/select params={shard.url=127.0.0.1:50065/solr/collection1/&fl=id&rows=10&distrib=false&isShard=true&NOW=1346461433150&wt=javabin&q=*:*&start=0&fsv=true&version=2&sort=n_ti1+asc} hits=18 status=0 QTime=0 
[junit4:junit4]   2> 19460 T804 C63 P49944 REQ [collection1] webapp=/solr path=/select params={shard.url=127.0.0.1:49944/solr/collection1/&fl=id&rows=10&distrib=false&isShard=true&NOW=1346461433150&wt=javabin&q=*:*&start=0&fsv=true&version=2&sort=n_ti1+asc} hits=19 status=0 QTime=0 
[junit4:junit4]   2> 19469 T804 C63 P49944 REQ [collection1] webapp=/solr path=/select params={shard.url=127.0.0.1:49944/solr/collection1/&ids=131,17,137&q=*:*&version=2&distrib=false&isShard=true&NOW=1346461433150&wt=javabin} status=0 QTime=1 
[junit4:junit4]   2> 19469 T791 C64 P59248 REQ [collection1] webapp=/solr path=/select params={shard.url=127.0.0.1:59248/solr/collection1/&ids=115,129,117&q=*:*&version=2&distrib=false&isShard=true&NOW=1346461433150&wt=javabin} status=0 QTime=1 
[junit4:junit4]   2> 19469 T779 C62 P50065 REQ [collection1] webapp=/solr path=/select params={shard.url=127.0.0.1:50065/solr/collection1/&ids=108,10,132,16&q=*:*&version=2&distrib=false&isShard=true&NOW=1346461433150&wt=javabin} status=0 QTime=1 
[junit4:junit4]   2> 19469 T803 C63 P49944 REQ [collection1] webapp=/solr path=/select params={version=2&q=*:*&sort=n_ti1+asc&wt=javabin} status=0 QTime=12 
[junit4:junit4]   2> 19472 T762 C61 P44054 REQ [collection1] webapp=/solr path=/select params={version=2&distrib=false&q=*:*&sort=n_f1+desc&wt=javabin} hits=67 status=0 QTime=1 
[junit4:junit4]   2> 19476 T791 C64 P59248 REQ [collection1] webapp=/solr path=/select params={shard.url=127.0.0.1:59248/solr/collection1/&fl=id&rows=10&distrib=false&isShard=true&NOW=1346461433167&wt=javabin&q=*:*&start=0&fsv=true&version=2&sort=n_f1+desc} hits=30 status=0 QTime=0 
[junit4:junit4]   2> 19476 T779 C62 P50065 REQ [collection1] webapp=/solr path=/select params={shard.url=127.0.0.1:50065/solr/collection1/&fl=id&rows=10&distrib=false&isShard=true&NOW=1346461433167&wt=javabin&q=*:*&start=0&fsv=true&version=2&sort=n_f1+desc} hits=18 status=0 QTime=0 
[junit4:junit4]   2> 19476 T804 C63 P49944 REQ [collection1] webapp=/solr path=/select params={shard.url=127.0.0.1:49944/solr/collection1/&fl=id&rows=10&distrib=false&isShard=true&NOW=1346461433167&wt=javabin&q=*:*&start=0&fsv=true&version=2&sort=n_f1+desc} hits=19 status=0 QTime=0 
[junit4:junit4]   2> 19478 T791 C64 P59248 REQ [collection1] webapp=/solr path=/select params={shard.url=127.0.0.1:59248/solr/collection1/&ids=107,102&q=*:*&version=2&distrib=false&isShard=true&NOW=1346461433167&wt=javabin} status=0 QTime=0 
[junit4:junit4]   2> 19478 T804 C63 P49944 REQ [collection1] webapp=/solr path=/select params={shard.url=127.0.0.1:49944/solr/collection1/&ids=127,149,145,103&q=*:*&version=2&distrib=false&isShard=true&NOW=1346461433167&wt=javabin} status=0 QTime=0 
[junit4:junit4]   2> 19478 T779 C62 P50065 REQ [collection1] webapp=/solr path=/select params={shard.url=127.0.0.1:50065/solr/collection1/&ids=13,124,109,132&q=*:*&version=2&distrib=false&isShard=true&NOW=1346461433167&wt=javabin} status=0 QTime=0 
[junit4:junit4]   2> 19479 T803 C63 P49944 REQ [collection1] webapp=/solr path=/select params={shards=shard3,shard4,shard5&version=2&q=*:*&sort=n_f1+desc&wt=javabin} status=0 QTime=5 
[junit4:junit4]   2> 19482 T762 C61 P44054 REQ [collection1] webapp=/solr path=/select params={version=2&distrib=false&q=*:*&sort=n_f1+asc&wt=javabin} hits=67 status=0 QTime=1 
[junit4:junit4]   2> 19485 T779 C62 P50065 REQ [collection1] webapp=/solr path=/select params={shard.url=127.0.0.1:50065/solr/collection1/&fl=id&rows=10&distrib=false&isShard=true&NOW=1346461433177&wt=javabin&q=*:*&start=0&fsv=true&version=2&sort=n_f1+asc} hits=18 status=0 QTime=0 
[junit4:junit4]   2> 19485 T791 C64 P59248 REQ [collection1] webapp=/solr path=/select params={shard.url=127.0.0.1:59248/solr/collection1/&fl=id&rows=10&distrib=false&isShard=true&NOW=1346461433177&wt=javabin&q=*:*&start=0&fsv=true&version=2&sort=n_f1+asc} hits=30 status=0 QTime=0 
[junit4:junit4]   2> 19485 T804 C63 P49944 REQ [collection1] webapp=/solr path=/select params={shard.url=127.0.0.1:49944/solr/collection1/&fl=id&rows=10&distrib=false&isShard=true&NOW=1346461433177&wt=javabin&q=*:*&start=0&fsv=true&version=2&sort=n_f1+asc} hits=19 status=0 QTime=0 
[junit4:junit4]   2> 19488 T779 C62 P50065 REQ [collection1] webapp=/solr path=/select params={shard.url=127.0.0.1:50065/solr/collection1/&ids=148&q=*:*&version=2&distrib=false&isShard=true&NOW=1346461433177&wt=javabin} status=0 QTime=0 
[junit4:junit4]   2> 19488 T791 C64 P59248 REQ [collection1] webapp=/solr path=/select params={shard.url=127.0.0.1:59248/solr/collection1/&ids=146,4,122,3,15,105&q=*:*&version=2&distrib=false&isShard=true&NOW=1346461433177&wt=javabin} status=0 QTime=0 
[junit4:junit4]   2> 19488 T804 C63 P49944 REQ [collection1] webapp=/solr path=/select params={shard.url=127.0.0.1:49944/solr/collection1/&ids=116,147,136&q=*:*&version=2&distrib=false&isShard=true&NOW=1346461433177&wt=javabin} status=0 QTime=0 
[junit4:junit4]   2> 19489 T801 C63 P49944 REQ [collection1] webapp=/solr path=/select params={shards=shard3,shard4,shard5&version=2&q=*:*&sort=n_f1+asc&wt=javabin} status=0 QTime=5 
[junit4:junit4]   2> 19492 T762 C61 P44054 REQ [collection1] webapp=/solr path=/select params={version=2&distrib=false&q=*:*&sort=n_tf1+desc&wt=javabin} hits=67 status=0 QTime=1 
[junit4:junit4]   2> 19496 T792 C64 P59248 REQ [collection1] webapp=/solr path=/select params={shard.url=127.0.0.1:59248/solr/collection1/&fl=id&rows=10&distrib=false&isShard=true&NOW=1346461433187&wt=javabin&q=*:*&start=0&fsv=true&version=2&sort=n_tf1+desc} hits=30 status=0 QTime=0 
[junit4:junit4]   2> 19496 T805 C63 P49944 REQ [collection1] webapp=/solr path=/select params={shard.url=127.0.0.1:49944/solr/collection1/&fl=id&rows=10&distrib=false&isShard=true&NOW=1346461433187&wt=javabin&q=*:*&start=0&fsv=true&version=2&sort=n_tf1+desc} hits=19 status=0 QTime=0 
[junit4:junit4]   2> 19496 T780 C62 P50065 REQ [collection1] webapp=/solr path=/select params={shard.url=127.0.0.1:50065/solr/collection1/&fl=id&rows=10&distrib=false&isShard=true&NOW=1346461433187&wt=javabin&q=*:*&start=0&fsv=true&version=2&sort=n_tf1+desc} hits=18 status=0 QTime=0 
[junit4:junit4]   2> 19499 T780 C62 P50065 REQ [collection1] webapp=/solr path=/select params={shard.url=127.0.0.1:50065/solr/collection1/&ids=148,110&q=*:*&version=2&distrib=false&isShard=true&NOW=1346461433187&wt=javabin} status=0 QTime=1 
[junit4:junit4]   2> 19499 T805 C63 P49944 REQ [collection1] webapp=/solr path=/select params={shard.url=127.0.0.1:49944/solr/collection1/&ids=126,104&q=*:*&version=2&distrib=false&isShard=true&NOW=1346461433187&wt=javabin} status=0 QTime=0 
[junit4:junit4]   2> 19499 T792 C64 P59248 REQ [collection1] webapp=/solr path=/select params={shard.url=127.0.0.1:59248/solr/collection1/&ids=119,107,7,6,143,125&q=*:*&version=2&distrib=false&isShard=true&NOW=1346461433187&wt=javabin} status=0 QTime=0 
[junit4:junit4]   2> 19501 T776 C62 P50065 REQ [collection1] webapp=/solr path=/select params={version=2&q=*:*&sort=n_tf1+desc&wt=javabin} status=0 QTime=7 
[junit4:junit4]   2> 19503 T762 C61 P44054 REQ [collection1] webapp=/solr path=/select params={version=2&distrib=false&q=*:*&sort=n_tf1+asc&wt=javabin} hits=67 status=0 QTime=0 
[junit4:junit4]   2> 19506 T802 C63 P49944 REQ [collection1] webapp=/solr path=/select params={shard.url=127.0.0.1:49944/solr/collection1/&collection=collection1&fl=id&rows=10&distrib=false&isShard=true&wt=javabin&NOW=1346461433197&q=*:*&start=0&fsv=true&version=2&sort=n_tf1+asc} hits=19 status=0 QTime=0 
[junit4:junit4]   2> 19506 T790 C64 P59248 REQ [collection1] webapp=/solr path=/select params={shard.url=127.0.0.1:59248/solr/collection1/&collection=collection1&fl=id&rows=10&distrib=false&isShard=true&wt=javabin&NOW=1346461433197&q=*:*&start=0&fsv=true&version=2&sort=n_tf1+asc} hits=30 status=0 QTime=0 
[junit4:junit4]   2> 19506 T778 C62 P50065 REQ [collection1] webapp=/solr path=/select params={shard.url=127.0.0.1:50065/solr/collection1/&collection=collection1&fl=id&rows=10&distrib=false&isShard=true&wt=javabin&NOW=1346461433197&q=*:*&start=0&fsv=true&version=2&sort=n_tf1+asc} hits=18 status=0 QTime=0 
[junit4:junit4]   2> 19509 T802 C63 P49944 REQ [collection1] webapp=/solr path=/select params={shard.url=127.0.0.1:49944/solr/collection1/&ids=116,128&q=*:*&collection=collection1&version=2&distrib=false&isShard=true&NOW=1346461433197&wt=javabin} status=0 QTime=1 
[junit4:junit4]   2> 19509 T778 C62 P50065 REQ [collection1] webapp=/solr path=/select params={shard.url=127.0.0.1:50065/solr/collection1/&ids=1,124&q=*:*&collection=collection1&version=2&distrib=false&isShard=true&NOW=1346461433197&wt=javabin} status=0 QTime=1 
[junit4:junit4]   2> 19515 T790 C64 P59248 REQ [collection1] webapp=/solr path=/select params={shard.url=127.0.0.1:59248/solr/collection1/&ids=140,114,113,2,141,105&q=*:*&collection=collection1&version=2&distrib=false&isShard=true&NOW=1346461433197&wt=javabin} status=0 QTime=6 
[junit4:junit4]   2> 19516 T793 C64 P59248 REQ [collection1] webapp=/solr path=/select params={version=2&q=*:*&sort=n_tf1+asc&collection=collection1&wt=javabin} status=0 QTime=12 
[junit4:junit4]   2> 19519 T762 C61 P44054 REQ [collection1] webapp=/solr path=/select params={version=2&distrib=false&q=*:*&sort=n_d1+desc&wt=javabin} hits=67 status=0 QTime=0 
[junit4:junit4]   2> 19523 T804 C63 P49944 REQ [collection1] webapp=/solr path=/select params={shard.url=127.0.0.1:49944/solr/collection1/&collection=collection1&fl=id&rows=10&distrib=false&isShard=true&wt=javabin&NOW=1346461433214&q=*:*&start=0&fsv=true&version=2&sort=n_d1+desc} hits=19 status=0 QTime=0 
[junit4:junit4]   2> 19523 T791 C64 P59248 REQ [collection1] webapp=/solr path=/select params={shard.url=127.0.0.1:59248/solr/collection1/&collection=collection1&fl=id&rows=10&distrib=false&isShard=true&wt=javabin&NOW=1346461433214&q=*:*&start=0&fsv=true&version=2&sort=n_d1+desc} hits=30 status=0 QTime=0 
[junit4:junit4]   2> 19523 T779 C62 P50065 REQ [collection1] webapp=/solr path=/select params={shard.url=127.0.0.1:50065/solr/collection1/&collection=collection1&fl=id&rows=10&distrib=false&isShard=true&wt=javabin&NOW=1346461433214&q=*:*&start=0&fsv=true&version=2&sort=n_d1+desc} hits=18 status=0 QTime=0 
[junit4:junit4]   2> 19526 T791 C64 P59248 REQ [collection1] webapp=/solr path=/select params={shard.url=127.0.0.1:59248/solr/collection1/&ids=7,3,117,111&q=*:*&collection=collection1&version=2&distrib=false&isShard=true&NOW=1346461433214&wt=javabin} status=0 QTime=1 
[junit4:junit4]   2> 19525 T804 C63 P49944 REQ [collection1] webapp=/solr path=/select params={shard.url=127.0.0.1:49944/solr/collection1/&ids=147&q=*:*&collection=collection1&version=2&distrib=false&isShard=true&NOW=1346461433214&wt=javabin} status=0 QTime=0 
[junit4:junit4]   2> 19526 T779 C62 P50065 REQ [collection1] webapp=/solr path=/select params={shard.url=127.0.0.1:50065/solr/collection1/&ids=135,148,1,123,14&q=*:*&collection=collection1&version=2&distrib=false&isShard=true&NOW=1346461433214&wt=javabin} status=0 QTime=1 
[junit4:junit4]   2> 19527 T803 C63 P49944 REQ [collection1] webapp=/solr path=/select params={version=2&q=*:*&sort=n_d1+desc&collection=collection1&wt=javabin} status=0 QTime=6 
[junit4:junit4]   2> 19529 T762 C61 P44054 REQ [collection1] webapp=/solr path=/select params={version=2&distrib=false&q=*:*&sort=n_d1+asc&wt=javabin} hits=67 status=0 QTime=0 
[junit4:junit4]   2> 19532 T779 C62 P50065 REQ [collection1] webapp=/solr path=/select params={shard.url=127.0.0.1:50065/solr/collection1/&fl=id&rows=10&distrib=false&isShard=true&NOW=1346461433224&wt=javabin&q=*:*&start=0&fsv=true&version=2&sort=n_d1+asc} hits=18 status=0 QTime=0 
[junit4:junit4]   2> 19532 T791 C64 P59248 REQ [collection1] webapp=/solr path=/select params={shard.url=127.0.0.1:59248/solr/collection1/&fl=id&rows=10&distrib=false&isShard=true&NOW=1346461433224&wt=javabin&q=*:*&start=0&fsv=true&version=2&sort=n_d1+asc} hits=30 status=0 QTime=0 
[junit4:junit4]   2> 19532 T804 C63 P49944 REQ [collection1] webapp=/solr path=/select params={shard.url=127.0.0.1:49944/solr/collection1/&fl=id&rows=10&distrib=false&isShard=true&NOW=1346461433224&wt=javabin&q=*:*&start=0&fsv=true&version=2&sort=n_d1+asc} hits=19 status=0 QTime=0 
[junit4:junit4]   2> 19535 T779 C62 P50065 REQ [collection1] webapp=/solr path=/select params={shard.url=127.0.0.1:50065/solr/collection1/&ids=10&q=*:*&version=2&distrib=false&isShard=true&NOW=1346461433224&wt=javabin} status=0 QTime=0 
[junit4:junit4]   2> 19535 T791 C64 P59248 REQ [collection1] webapp=/solr path=/select params={shard.url=127.0.0.1:59248/solr/collection1/&ids=107,101,120,122,144,105,125&q=*:*&version=2&distrib=false&isShard=true&NOW=1346461433224&wt=javabin} status=0 QTime=0 
[junit4:junit4]   2> 19535 T804 C63 P49944 REQ [collection1] webapp=/solr path=/select params={shard.url=127.0.0.1:49944/solr/collection1/&ids=149,128&q=*:*&version=2&distrib=false&isShard=true&NOW=1346461433224&wt=javabin} status=0 QTime=0 
[junit4:junit4]   2> 19536 T801 C63 P49944 REQ [collection1] webapp=/solr path=/select params={version=2&q=*:*&sort=n_d1+asc&wt=javabin} status=0 QTime=5 
[junit4:junit4]   2> 19539 T762 C61 P44054 REQ [collection1] webapp=/solr path=/select params={version=2&distrib=false&q=*:*&sort=n_td1+desc&wt=javabin} hits=67 status=0 QTime=1 
[junit4:junit4]   2> 19542 T804 C63 P49944 REQ [collection1] webapp=/solr path=/select params={shard.url=127.0.0.1:49944/solr/collection1/&fl=id&rows=10&distrib=false&isShard=true&NOW=1346461433234&wt=javabin&q=*:*&start=0&fsv=true&version=2&sort=n_td1+desc} hits=19 status=0 QTime=0 
[junit4:junit4]   2> 19542 T779 C62 P50065 REQ [collection1] webapp=/solr path=/select params={shard.url=127.0.0.1:50065/solr/collection1/&fl=id&rows=10&distrib=false&isShard=true&NOW=1346461433234&wt=javabin&q=*:*&start=0&fsv=true&version=2&sort=n_td1+desc} hits=18 status=0 QTime=0 
[junit4:junit4]   2> 19543 T791 C64 P59248 REQ [collection1] webapp=/solr path=/select params={shard.url=127.0.0.1:59248/solr/collection1/&fl=id&rows=10&distrib=false&isShard=true&NOW=1346461433234&wt=javabin&q=*:*&start=0&fsv=true&version=2&sort=n_td1+desc} hits=30 status=0 QTime=1 
[junit4:junit4]   2> 19545 T791 C64 P59248 REQ [collection1] webapp=/solr path=/select params={shard.url=127.0.0.1:59248/solr/collection1/&ids=143,113,15&q=*:*&version=2&distrib=false&isShard=true&NOW=1346461433234&wt=javabin} status=0 QTime=0 
[junit4:junit4]   2> 19545 T779 C62 P50065 REQ [collection1] webapp=/solr path=/select params={shard.url=127.0.0.1:50065/solr/collection1/&ids=108,138,118,148,14&q=*:*&version=2&distrib=false&isShard=true&NOW=1346461433234&wt=javabin} status=0 QTime=0 
[junit4:junit4]   2> 19545 T804 C63 P49944 REQ [collection1] webapp=/solr path=/select params={shard.url=127.0.0.1:49944/solr/collection1/&ids=147,121&q=*:*&version=2&distrib=false&isShard=true&NOW=1346461433234&wt=javabin} status=0 QTime=0 
[junit4:junit4]   2> 19546 T801 C63 P49944 REQ [collection1] webapp=/solr path=/select params={version=2&q=*:*&sort=n_td1+desc&wt=javabin} status=0 QTime=5 
[junit4:junit4]   2> 19548 T762 C61 P44054 REQ [collection1] webapp=/solr path=/select params={version=2&distrib=false&q=*:*&sort=n_td1+asc&wt=javabin} hits=67 status=0 QTime=0 
[junit4:junit4]   2> 19551 T779 C62 P50065 REQ [collection1] webapp=/solr path=/select params={shard.url=127.0.0.1:50065/solr/collection1/&collection=collection1&fl=id&rows=10&distrib=false&isShard=true&NOW=1346461433243&wt=javabin&q=*:*&start=0&fsv=true&version=2&sort=n_td1+asc} hits=18 status=0 QTime=0 
[junit4:junit4]   2> 19551 T804 C63 P49944 REQ [collection1] webapp=/solr path=/select params={shard.url=127.0.0.1:49944/solr/collection1/&collection=collection1&fl=id&rows=10&distrib=false&isShard=true&NOW=1346461433243&wt=javabin&q=*:*&start=0&fsv=true&version=2&sort=n_td1+asc} hits=19 status=0 QTime=0 
[junit4:junit4]   2> 19551 T791 C64 P59248 REQ [collection1] webapp=/solr path=/select params={shard.url=127.0.0.1:59248/solr/collection1/&collection=collection1&fl=id&rows=10&distrib=false&isShard=true&NOW=1346461433243&wt=javabin&q=*:*&start=0&fsv=true&version=2&sort=n_td1+asc} hits=30 status=0 QTime=0 
[junit4:junit4]   2> 19554 T779 C62 P50065 REQ [collection1] webapp=/solr path=/select params={shard.url=127.0.0.1:50065/solr/collection1/&ids=13&q=*:*&collection=collection1&version=2&distrib=false&isShard=true&NOW=1346461433243&wt=javabin} status=0 QTime=0 
[junit4:junit4]   2> 19554 T791 C64 P59248 REQ [collection1] webapp=/solr path=/select params={shard.url=127.0.0.1:59248/solr/collection1/&ids=3,6,111&q=*:*&collection=collection1&version=2&distrib=false&isShard=true&NOW=1346461433243&wt=javabin} status=0 QTime=0 
[junit4:junit4]   2> 19554 T804 C63 P49944 REQ [collection1] webapp=/solr path=/select params={shard.url=127.0.0.1:49944/solr/collection1/&ids=139,142,131,106,103,104&q=*:*&collection=collection1&version=2&distrib=false&isShard=true&NOW=1346461433243&wt=javabin} status=0 QTime=0 
[junit4:junit4]   2> 19555 T803 C63 P49944 REQ [collection1] webapp=/solr path=/select params={q=*:*&collection=collection1&shards=shard3,shard4,shard5&version=2&sort=n_td1+asc&wt=javabin} status=0 QTime=5 
[junit4:junit4]   2> 19557 T762 C61 P44054 REQ [collection1] webapp=/solr path=/select params={version=2&distrib=false&q=*:*&sort=n_l1+desc&wt=javabin} hits=67 status=0 QTime=0 
[junit4:junit4]   2> 19568 T805 C63 P49944 REQ [collection1] webapp=/solr path=/select params={shard.url=127.0.0.1:49944/solr/collection1/&fl=id&rows=10&distrib=false&isShard=true&NOW=1346461433259&wt=javabin&q=*:*&start=0&fsv=true&version=2&sort=n_l1+desc} hits=19 status=0 QTime=0 
[junit4:junit4]   2> 19568 T780 C62 P50065 REQ [collection1] webapp=/solr path=/select params={shard.url=127.0.0.1:50065/solr/collection1/&fl=id&rows=10&distrib=false&isShard=true&NOW=1346461433259&wt=javabin&q=*:*&start=0&fsv=true&version=2&sort=n_l1+desc} hits=18 status=0 QTime=0 
[junit4:junit4]   2> 19568 T792 C64 P59248 REQ [collection1] webapp=/solr path=/select params={shard.url=127.0.0.1:59248/solr/collection1/&fl=id&rows=10&distrib=false&isShard=true&NOW=1346461433259&wt=javabin&q=*:*&start=0&fsv=true&version=2&sort=n_l1+desc} hits=30 status=0 QTime=0 
[junit4:junit4]   2> 19571 T805 C63 P49944 REQ [collection1] webapp=/solr path=/select params={shard.url=127.0.0.1:49944/solr/collection1/&ids=145,103&q=*:*&version=2&distrib=false&isShard=true&NOW=1346461433259&wt=javabin} status=0 QTime=0 
[junit4:junit4]   2> 19571 T792 C64 P59248 REQ [collection1] webapp=/solr path=/select params={shard.url=127.0.0.1:59248/solr/collection1/&ids=146,101,114,133,15&q=*:*&version=2&distrib=false&isShard=true&NOW=1346461433259&wt=javabin} status=0 QTime=0 
[junit4:junit4]   2> 19571 T780 C62 P50065 REQ [collection1] webapp=/solr path=/select params={shard.url=127.0.0.1:50065/solr/collection1/&ids=11,135,14&q=*:*&version=2&distrib=false&isShard=true&NOW=1346461433259&wt=javabin} status=0 QTime=0 
[junit4:junit4]   2> 19572 T776 C62 P50065 REQ [collection1] webapp=/solr path=/select params={shards=shard3,shard4,shard5&version=2&q=*:*&sort=n_l1+desc&wt=javabin} status=0 QTime=6 
[junit4:junit4]   2> 19574 T762 C61 P44054 REQ [collection1] webapp=/solr path=/select params={version=2&distrib=false&q=*:*&sort=n_l1+asc&wt=javabin} hits=67 status=0 QTime=0 
[junit4:junit4]   2> 19578 T792 C64 P59248 REQ [collection1] webapp=/solr path=/select params={shard.url=127.0.0.1:59248/solr/collection1/&fl=id&rows=10&distrib=false&isShard=true&NOW=1346461433269&wt=javabin&q=*:*&start=0&fsv=true&version=2&sort=n_l1+asc} hits=30 status=0 QTime=0 
[junit4:junit4]   2> 19578 T805 C63 P49944 REQ [collection1] webapp=/solr path=/select params={shard.url=127.0.0.1:49944/solr/collection1/&fl=id&rows=10&distrib=false&isShard=true&NOW=1346461433269&wt=javabin&q=*:*&start=0&fsv=true&version=2&sort=n_l1+asc} hits=19 status=0 QTime=0 
[junit4:junit4]   2> 19578 T780 C62 P50065 REQ [collection1] webapp=/solr path=/select params={shard.url=127.0.0.1:50065/solr/collection1/&fl=id&rows=10&distrib=false&isShard=true&NOW=1346461433269&wt=javabin&q=*:*&start=0&fsv=true&version=2&sort=n_l1+asc} hits=18 status=0 QTime=0 
[junit4:junit4]   2> 19580 T780 C62 P50065 REQ [collection1] webapp=/solr path=/select params={shard.url=127.0.0.1:50065/solr/collection1/&ids=8,110&q=*:*&version=2&distrib=false&isShard=true&NOW=1346461433269&wt=javabin} status=0 QTime=0 
[junit4:junit4]   2> 19580 T792 C64 P59248 REQ [collection1] webapp=/solr path=/select params={shard.url=127.0.0.1:59248/solr/collection1/&ids=6,113,12,125&q=*:*&version=2&distrib=false&isShard=true&NOW=1346461433269&wt=javabin} status=0 QTime=0 
[junit4:junit4]   2> 19580 T805 C63 P49944 REQ [collection1] webapp=/solr path=/select params={shard.url=127.0.0.1:49944/solr/collection1/&ids=116,139,128,17&q=*:*&version=2&distrib=false&isShard=true&NOW=1346461433269&wt=javabin} status=0 QTime=0 
[junit4:junit4]   2> 19582 T776 C62 P50065 REQ [collection1] webapp=/solr path=/select params={shards=shard3,shard4,shard5&version=2&q=*:*&sort=n_l1+asc&wt=javabin} status=0 QTime=6 
[junit4:junit4]   2> 19584 T762 C61 P44054 REQ [collection1] webapp=/solr path=/select params={version=2&distrib=false&q=*:*&sort=n_tl1+desc&wt=javabin} hits=67 status=0 QTime=0 
[junit4:junit4]   2> 19588 T802 C63 P49944 REQ [collection1] webapp=/solr path=/select params={shard.url=127.0.0.1:49944/solr/collection1/&collection=collection1&fl=id&rows=10&distrib=false&isShard=true&NOW=1346461433279&wt=javabin&q=*:*&start=0&fsv=true&version=2&sort=n_tl1+desc} hits=19 status=0 QTime=1 
[junit4:junit4]   2> 19588 T790 C64 P59248 REQ [collection1] webapp=/solr path=/select params={shard.url=127.0.0.1:59248/solr/collection1/&collection=collection1&fl=id&rows=10&distrib=false&isShard=true&NOW=1346461433279&wt=javabin&q=*:*&start=0&fsv=true&version=2&sort=n_tl1+desc} hits=30 status=0 QTime=0 
[junit4:junit4]   2> 19588 T778 C62 P50065 REQ [collection1] webapp=/solr path=/select params={shard.url=127.0.0.1:50065/solr/collection1/&collection=collection1&fl=id&rows=10&distrib=false&isShard=true&NOW=1346461433279&wt=javabin&q=*:*&start=0&fsv=true&version=2&sort=n_tl1+desc} hits=18 status=0 QTime=0 
[junit4:junit4]   2> 19590 T778 C62 P50065 REQ [collection1] webapp=/solr path=/select params={shard.url=127.0.0.1:50065/solr/collection1/&ids=11,16,14&q=*:*&collection=collection1&version=2&distrib=false&isShard=true&NOW=1346461433279&wt=javabin} status=0 QTime=0 
[junit4:junit4]   2> 19590 T790 C64 P59248 REQ [collection1] webapp=/solr path=/select params={shard.url=127.0.0.1:59248/solr/collection1/&ids=119,143,117,141&q=*:*&collection=collection1&version=2&distrib=false&isShard=true&NOW=1346461433279&wt=javabin} status=0 QTime=0 
[junit4:junit4]   2> 19590 T802 C63 P49944 REQ [collection1] webapp=/solr path=/select params={shard.url=127.0.0.1:49944/solr/collection1/&ids=147,149,121&q=*:*&collection=collection1&version=2&distrib=false&isShard=true&NOW=1346461433279&wt=javabin} status=0 QTime=0 
[junit4:junit4]   2> 19591 T793 C64 P59248 REQ [collection1] webapp=/solr path=/select params={version=2&q=*:*&sort=n_tl1+desc&collection=collection1&wt=javabin} status=0 QTime=5 
[junit4:junit4]   2> 19593 T762 C61 P44054 REQ [collection1] webapp=/solr path=/select params={version=2&distrib=false&q=*:*&sort=n_tl1+asc&wt=javabin} hits=67 status=0 QTime=0 
[junit4:junit4]   2> 19597 T780 C62 P50065 REQ [collection1] webapp=/solr path=/select params={shard.url=127.0.0.1:50065/solr/collection1/&fl=id&rows=10&distrib=false&isShard=true&NOW=1346461433288&wt=javabin&q=*:*&start=0&fsv=true&version=2&sort=n_tl1+asc} hits=18 status=0 QTime=0 
[junit4:junit4]   2> 19597 T805 C63 P49944 REQ [collection1] webapp=/solr path=/select params={shard.url=127.0.0.1:49944/solr/collection1/&fl=id&rows=10&distrib=false&isShard=true&NOW=1346461433288&wt=javabin&q=*:*&start=0&fsv=true&version=2&sort=n_tl1+asc} hits=19 status=0 QTime=0 
[junit4:junit4]   2> 19597 T792 C64 P59248 REQ [collection1] webapp=/solr path=/select params={shard.url=127.0.0.1:59248/solr/collection1/&fl=id&rows=10&distrib=false&isShard=true&NOW=1346461433288&wt=javabin&q=*:*&start=0&fsv=true&version=2&sort=n_tl1+asc} hits=30 status=0 QTime=0 
[junit4:junit4]   2> 19599 T780 C62 P50065 REQ [collection1] webapp=/solr path=/select params={shard.url=127.0.0.1:50065/solr/collection1/&ids=138,13,118,1&q=*:*&version=2&distrib=false&isShard=true&NOW=1346461433288&wt=javabin} status=0 QTime=0 
[junit4:junit4]   2> 19600 T805 C63 P49944 REQ [collection1] webapp=/solr path=/select params={shard.url=127.0.0.1:49944/solr/collection1/&ids=127,103&q=*:*&version=2&distrib=false&isShard=true&NOW=1346461433288&wt=javabin} status=0 QTime=1 
[junit4:junit4]   2> 19600 T792 C64 P59248 REQ [collection1] webapp=/solr path=/select params={shard.url=127.0.0.1:59248/solr/collection1/&ids=107,122,144,111&q=*:*&version=2&distrib=false&isShard=true&NOW=1346461433288&wt=javabin} status=0 QTime=1 
[junit4:junit4]   2> 19601 T776 C62 P50065 REQ [collection1] webapp=/solr path=/select params={version=2&q=*:*&sort=n_tl1+asc&wt=javabin} status=0 QTime=6 
[junit4:junit4]   2> 19603 T762 C61 P44054 REQ [collection1] webapp=/solr path=/select params={version=2&distrib=false&q=*:*&sort=n_dt1+desc&wt=javabin} hits=67 status=0 QTime=0 
[junit4:junit4]   2> 19607 T802 C63 P49944 REQ [collection1] webapp=/solr path=/select params={shard.url=127.0.0.1:49944/solr/collection1/&fl=id&rows=10&distrib=false&isShard=true&NOW=1346461433298&wt=javabin&q=*:*&start=0&fsv=true&version=2&sort=n_dt1+desc} hits=19 status=0 QTime=1 
[junit4:junit4]   2> 19607 T790 C64 P59248 REQ [collection1] webapp=/solr path=/select params={shard.url=127.0.0.1:59248/solr/collection1/&fl=id&rows=10&distrib=false&isShard=true&NOW=1346461433298&wt=javabin&q=*:*&start=0&fsv=true&version=2&sort=n_dt1+desc} hits=30 status=0 QTime=1 
[junit4:junit4]   2> 19607 T778 C62 P50065 REQ [collection1] webapp=/solr path=/select params={shard.url=127.0.0.1:50065/solr/collection1/&fl=id&rows=10&distrib=false&isShard=true&NOW=1346461433298&wt=javabin&q=*:*&start=0&fsv=true&version=2&sort=n_dt1+desc} hits=18 status=0 QTime=1 
[junit4:junit4]   2> 19615 T778 C62 P50065 REQ [collection1] webapp=/solr path=/select params={shard.url=127.0.0.1:50065/solr/collection1/&ids=11&q=*:*&version=2&distrib=false&isShard=true&NOW=1346461433298&wt=javabin} status=0 QTime=7 
[junit4:junit4]   2> 19615 T802 C63 P49944 REQ [collection1] webapp=/solr path=/select params={shard.url=127.0.0.1:49944/solr/collection1/&ids=112,142,106,17&q=*:*&version=2&distrib=false&isShard=true&NOW=1346461433298&wt=javabin} status=0 QTime=6 
[junit4:junit4]   2> 19615 T790 C64 P59248 REQ [collection1] webapp=/solr path=/select params={shard.url=127.0.0.1:59248/solr/collection1/&ids=7,6,143,15,113&q=*:*&version=2&distrib=false&isShard=true&NOW=1346461433298&wt=javabin} status=0 QTime=6 
[junit4:junit4]   2> 19617 T789 C64 P59248 REQ [collection1] webapp=/solr path=/select params={shards=shard3,shard4,shard5&version=2&q=*:*&sort=n_dt1+desc&wt=javabin} status=0 QTime=12 
[junit4:junit4]   2> 19619 T762 C61 P44054 REQ [collection1] webapp=/solr path=/select params={version=2&distrib=false&q=*:*&sort=n_dt1+asc&wt=javabin} hits=67 status=0 QTime=0 
[junit4:junit4]   2> 19623 T804 C63 P49944 REQ [collection1] webapp=/solr path=/select params={shard.url=127.0.0.1:49944/solr/collection1/&fl=id&rows=10&distrib=false&isShard=true&NOW=1346461433314&wt=javabin&q=*:*&start=0&fsv=true&version=2&sort=n_dt1+asc} hits=19 status=0 QTime=0 
[junit4:junit4]   2> 19623 T791 C64 P59248 REQ [collection1] webapp=/solr path=/select params={shard.url=127.0.0.1:59248/solr/collection1/&fl=id&rows=10&distrib=false&isShard=true&NOW=1346461433314&wt=javabin&q=*:*&start=0&fsv=true&version=2&sort=n_dt1+asc} hits=30 status=0 QTime=0 
[junit4:junit4]   2> 19623 T779 C62 P50065 REQ [collection1] webapp=/solr path=/select params={shard.url=127.0.0.1:50065/solr/collection1/&fl=id&rows=10&distrib=false&isShard=true&NOW=1346461433314&wt=javabin&q=*:*&start=0&fsv=true&version=2&sort=n_dt1+asc} hits=18 status=0 QTime=0 
[junit4:junit4]   2> 19625 T779 C62 P50065 REQ [collection1] webapp=/solr path=/select params={shard.url=127.0.0.1:50065/solr/collection1/&ids=108,135,132,14,110&q=*:*&version=2&distrib=false&isShard=true&NOW=1346461433314&wt=javabin} status=0 QTime=0 
[junit4:junit4]   2> 19625 T804 C63 P49944 REQ [collection1] webapp=/solr path=/select params={shard.url=127.0.0.1:49944/solr/collection1/&ids=131&q=*:*&version=2&distrib=false&isShard=true&NOW=1346461433314&wt=javabin} status=0 QTime=0 
[junit4:junit4]   2> 19625 T791 C64 P59248 REQ [collection1] webapp=/solr path=/select params={shard.url=127.0.0.1:59248/solr/collection1/&ids=129,3,117,102&q=*:*&version=2&distrib=false&isShard=true&NOW=1346461433314&wt=javabin} status=0 QTime=0 
[junit4:junit4]   2> 19626 T803 C63 P49944 REQ [collection1] webapp=/solr path=/select params={shards=shard3,shard4,shard5&version=2&q=*:*&sort=n_dt1+asc&wt=javabin} status=0 QTime=5 
[junit4:junit4]   2> 19629 T762 C61 P44054 REQ [collection1] webapp=/solr path=/select params={version=2&distrib=false&q=*:*&sort=n_tdt1+desc&wt=javabin} hits=67 status=0 QTime=1 
[junit4:junit4]   2> 19632 T780 C62 P50065 REQ [collection1] webapp=/solr path=/select params={shard.url=127.0.0.1:50065/solr/collection1/&fl=id&rows=10&distrib=false&isShard=true&NOW=1346461433324&wt=javabin&q=*:*&start=0&fsv=true&version=2&sort=n_tdt1+desc} hits=18 status=0 QTime=0 
[junit4:junit4]   2> 19633 T805 C63 P49944 REQ [collection1] webapp=/solr path=/select params={shard.url=127.0.0.1:49944/solr/collection1/&fl=id&rows=10&distrib=false&isShard=true&NOW=1346461433324&wt=javabin&q=*:*&start=0&fsv=true&version=2&sort=n_tdt1+desc} hits=19 status=0 QTime=1 
[junit4:junit4]   2> 19633 T792 C64 P59248 REQ [collection1] webapp=/solr path=/select params={shard.url=127.0.0.1:59248/solr/collection1/&fl=id&rows=10&distrib=false&isShard=true&NOW=1346461433324&wt=javabin&q=*:*&start=0&fsv=true&version=2&sort=n_tdt1+desc} hits=30 status=0 QTime=1 
[junit4:junit4]   2> 19635 T780 C62 P50065 REQ [collection1] webapp=/solr path=/select params={shard.url=127.0.0.1:50065/solr/collection1/&ids=11&q=*:*&version=2&distrib=false&isShard=true&NOW=1346461433324&wt=javabin} status=0 QTime=0 
[junit4:junit4]   2> 19635 T805 C63 P49944 REQ [collection1] webapp=/solr path=/select params={shard.url=127.0.0.1:49944/solr/collection1/&ids=149,17,104&q=*:*&version=2&distrib=false&isShard=true&NOW=1346461433324&wt=javabin} status=0 QTime=0 
[junit4:junit4]   2> 19635 T792 C64 P59248 REQ [collection1] webapp=/solr path=/select params={shard.url=127.0.0.1:59248/solr/collection1/&ids=140,6,143,133,144,15&q=*:*&version=2&distrib=false&isShard=true&NOW=1346461433324&wt=javabin} status=0 QTime=0 
[junit4:junit4]   2> 19637 T776 C62 P50065 REQ [collection1] webapp=/solr path=/select params={version=2&q=*:*&sort=n_tdt1+desc&wt=javabin} status=0 QTime=6 
[junit4:junit4]   2> 19639 T762 C61 P44054 REQ [collection1] webapp=/solr path=/select params={version=2&distrib=false&q=*:*&sort=n_tdt1+asc&wt=javabin} hits=67 status=0 QTime=0 
[junit4:junit4]   2> 19642 T792 C64 P59248 REQ [collection1] webapp=/solr path=/select params={shard.url=127.0.0.1:59248/solr/collection1/&collection=collection1&fl=id&rows=10&distrib=false&isShard=true&wt=javabin&NOW=1346461433333&q=*:*&start=0&fsv=true&version=2&sort=n_tdt1+asc} hits=30 status=0 QTime=0 
[junit4:junit4]   2> 19642 T780 C62 P50065 REQ [collection1] webapp=/solr path=/select params={shard.url=127.0.0.1:50065/solr/collection1/&collection=collection1&fl=id&rows=10&distrib=false&isShard=true&wt=javabin&NOW=1346461433333&q=*:*&start=0&fsv=true&version=2&sort=n_tdt1+asc} hits=18 status=0 QTime=0 
[junit4:junit4]   2> 19642 T805 C63 P49944 REQ [collection1] webapp=/solr path=/select params={shard.url=127.0.0.1:49944/solr/collection1/&collection=collection1&fl=id&rows=10&distrib=false&isShard=true&wt=javabin&NOW=1346461433333&q=*:*&start=0&fsv=true&version=2&sort=n_tdt1+asc} hits=19 status=0 QTime=0 
[junit4:junit4]   2> 19644 T780 C62 P50065 REQ [collection1] webapp=/solr path=/select params={shard.url=127.0.0.1:50065/solr/collection1/&ids=10,110&q=*:*&collection=collection1&version=2&distrib=false&isShard=true&NOW=1346461433333&wt=javabin} status=0 QTime=0 
[junit4:junit4]   2> 19644 T792 C64 P59248 REQ [collection1] webapp=/solr path=/select params={shard.url=127.0.0.1:59248/solr/collection1/&ids=119,141,12,102&q=*:*&collection=collection1&version=2&distrib=false&isShard=true&NOW=1346461433333&wt=javabin} status=0 QTime=0 
[junit4:junit4]   2> 19644 T805 C63 P49944 REQ [collection1] webapp=/solr path=/select params={shard.url=127.0.0.1:49944/solr/collection1/&ids=112,127,139,142&q=*:*&collection=collection1&version=2&distrib=false&isShard=true&NOW=1346461433333&wt=javabin} status=0 QTime=0 
[junit4:junit4]   2> 19645 T781 C62 P50065 REQ [collection1] webapp=/solr path=/select params={version=2&q=*:*&sort=n_tdt1+asc&collection=collection1&wt=javabin} status=0 QTime=5 
[junit4:junit4]   2> 19647 T762 C61 P44054 REQ [collection1] webapp=/solr path=/select params={version=2&distrib=false&q=*:*&sort=a_si+desc&wt=javabin} hits=67 status=0 QTime=0 
[junit4:junit4]   2> 19652 T778 C62 P50065 REQ [collection1] webapp=/solr path=/select params={shard.url=127.0.0.1:50065/solr/collection1/&fl=id&rows=10&distrib=false&isShard=true&NOW=1346461433343&wt=javabin&q=*:*&start=0&fsv=true&version=2&sort=a_si+desc} hits=18 status=0 QTime=1 
[junit4:junit4]   2> 19652 T802 C63 P49944 REQ [collection1] webapp=/solr path=/select params={shard.url=127.0.0.1:49944/solr/collection1/&fl=id&rows=10&distrib=false&isShard=true&NOW=1346461433343&wt=javabin&q=*:*&start=0&fsv=true&version=2&sort=a_si+desc} hits=19 status=0 QTime=1 
[junit4:junit4]   2> 19652 T790 C64 P59248 REQ [collection1] webapp=/solr path=/select params={shard.url=127.0.0.1:59248/solr/collection1/&fl=id&rows=10&distrib=false&isShard=true&NOW=1346461433343&wt=javabin&q=*:*&start=0&fsv=true&version=2&sort=a_si+desc} hits=30 status=0 QTime=1 
[junit4:junit4]   2> 19654 T802 C63 P49944 REQ [collection1] webapp=/solr path=/select params={shard.url=127.0.0.1:49944/solr/collection1/&ids=5&q=*:*&version=2&distrib=false&isShard=true&NOW=1346461433343&wt=javabin} status=0 QTime=0 
[junit4:junit4]   2> 19661 T790 C64 P59248 REQ [collection1] webapp=/solr path=/select params={shard.url=127.0.0.1:59248/solr/collection1/&ids=7,9,3,2,12&q=*:*&version=2&distrib=false&isShard=true&NOW=1346461433343&wt=javabin} status=0 QTime=7 
[junit4:junit4]   2> 19661 T778 C62 P50065 REQ [collection1] webapp=/solr path=/select params={shard.url=127.0.0.1:50065/solr/collection1/&ids=13,1,8,10&q=*:*&version=2&distrib=false&isShard=true&NOW=1346461433343&wt=javabin} status=0 QTime=7 
[junit4:junit4]   2> 19662 T793 C64 P59248 REQ [collection1] webapp=/solr path=/select params={shards=shard3,shard4,shard5&version=2&q=*:*&sort=a_si+desc&wt=javabin} status=0 QTime=12 
[junit4:junit4]   2> 19664 T762 C61 P44054 REQ [collection1] webapp=/solr path=/select params={version=2&distrib=false&q=*:*&sort=a_si+asc&wt=javabin} hits=67 status=0 QTime=0 
[junit4:junit4]   2> 19668 T804 C63 P49944 REQ [collection1] webapp=/solr path=/select params={shard.url=127.0.0.1:49944/solr/collection1/&fl=id&rows=10&distrib=false&isShard=true&NOW=1346461433359&wt=javabin&q=*:*&start=0&fsv=true&version=2&sort=a_si+asc} hits=19 status=0 QTime=0 
[junit4:junit4]   2> 19668 T791 C64 P59248 REQ [collection1] webapp=/solr path=/select params={shard.url=127.0.0.1:59248/solr/collection1/&fl=id&rows=10&distrib=false&isShard=true&NOW=1346461433359&wt=javabin&q=*:*&start=0&fsv=true&version=2&sort=a_si+asc} hits=30 status=0 QTime=0 
[junit4:junit4]   2> 19668 T779 C62 P50065 REQ [collection1] webapp=/solr path=/select params={shard.url=127.0.0.1:50065/solr/collection1/&fl=id&rows=10&distrib=false&isShard=true&NOW=1346461433359&wt=javabin&q=*:*&start=0&fsv=true&version=2&sort=a_si+asc} hits=18 status=0 QTime=0 
[junit4:junit4]   2> 19671 T779 C62 P50065 REQ [collection1] webapp=/solr path=/select params={shard.url=127.0.0.1:50065/solr/collection1/&ids=11,13,1&q=*:*&version=2&distrib=false&isShard=true&NOW=1346461433359&wt=javabin} status=0 QTime=1 
[junit4:junit4]   2> 19671 T791 C64 P59248 REQ [collection1] webapp=/solr path=/select params={shard.url=127.0.0.1:59248/solr/collection1/&ids=7,

[...truncated too long message...]

rt.fail(Assert.java:93)
[junit4:junit4]    > 	at org.apache.solr.SolrTestCaseJ4.endTrackingSearchers(SolrTestCaseJ4.java:223)
[junit4:junit4]    > 	at org.apache.solr.SolrTestCaseJ4.afterClass(SolrTestCaseJ4.java:89)
[junit4:junit4]    > 	at sun.reflect.NativeMethodAccessorImpl.invoke0(Native Method)
[junit4:junit4]    > 	at sun.reflect.NativeMethodAccessorImpl.invoke(NativeMethodAccessorImpl.java:57)
[junit4:junit4]    > 	at sun.reflect.DelegatingMethodAccessorImpl.invoke(DelegatingMethodAccessorImpl.java:43)
[junit4:junit4]    > 	at java.lang.reflect.Method.invoke(Method.java:474)
[junit4:junit4]    > 	at com.carrotsearch.randomizedtesting.RandomizedRunner.invoke(RandomizedRunner.java:1559)
[junit4:junit4]    > 	at com.carrotsearch.randomizedtesting.RandomizedRunner.access$600(RandomizedRunner.java:79)
[junit4:junit4]    > 	at com.carrotsearch.randomizedtesting.RandomizedRunner$5.evaluate(RandomizedRunner.java:700)
[junit4:junit4]    > 	at com.carrotsearch.randomizedtesting.rules.StatementAdapter.evaluate(StatementAdapter.java:36)
[junit4:junit4]    > 	at com.carrotsearch.randomizedtesting.rules.SystemPropertiesRestoreRule$1.evaluate(SystemPropertiesRestoreRule.java:53)
[junit4:junit4]    > 	at org.apache.lucene.util.AbstractBeforeAfterRule$1.evaluate(AbstractBeforeAfterRule.java:45)
[junit4:junit4]    > 	at org.apache.lucene.util.TestRuleStoreClassName$1.evaluate(TestRuleStoreClassName.java:42)
[junit4:junit4]    > 	at com.carrotsearch.randomizedtesting.rules.SystemPropertiesInvariantRule$1.evaluate(SystemPropertiesInvariantRule.java:55)
[junit4:junit4]    > 	at com.carrotsearch.randomizedtesting.rules.NoShadowingOrOverridesOnMethodsRule$1.evaluate(NoShadowingOrOverridesOnMethodsRule.java:39)
[junit4:junit4]    > 	at com.carrotsearch.randomizedtesting.rules.NoShadowingOrOverridesOnMethodsRule$1.evaluate(NoShadowingOrOverridesOnMethodsRule.java:39)
[junit4:junit4]    > 	at org.apache.lucene.util.TestRuleAssertionsRequired$1.evaluate(TestRuleAssertionsRequired.java:40)
[junit4:junit4]    > 	at org.apache.lucene.util.TestRuleMarkFailure$1.evaluate(TestRuleMarkFailure.java:48)
[junit4:junit4]    > 	at org.apache.lucene.util.TestRuleIgnoreAfterMaxFailures$1.evaluate(TestRuleIgnoreAfterMaxFailures.java:70)
[junit4:junit4]    > 	at org.apache.lucene.util.TestRuleIgnoreTestSuites$1.evaluate(TestRuleIgnoreTestSuites.java:55)
[junit4:junit4]    > 	at com.carrotsearch.randomizedtesting.rules.StatementAdapter.evaluate(StatementAdapter.java:36)
[junit4:junit4]    > 	at com.carrotsearch.randomizedtesting.ThreadLeakControl$StatementRunner.run(ThreadLeakControl.java:345)
[junit4:junit4]    > 	at java.lang.Thread.run(Thread.java:722)
[junit4:junit4]    > Throwable #2: com.carrotsearch.randomizedtesting.ThreadLeakError: 1 thread leaked from SUITE scope at org.apache.solr.cloud.BasicDistributedZkTest: 
[junit4:junit4]    >    1) Thread[id=1048, name=searcherExecutor-712-thread-1, state=WAITING, group=TGRP-BasicDistributedZkTest]
[junit4:junit4]    >         at sun.misc.Unsafe.park(Native Method)
[junit4:junit4]    >         at java.util.concurrent.locks.LockSupport.park(LockSupport.java:186)
[junit4:junit4]    >         at java.util.concurrent.locks.AbstractQueuedSynchronizer$ConditionObject.await(AbstractQueuedSynchronizer.java:2043)
[junit4:junit4]    >         at java.util.concurrent.LinkedBlockingQueue.take(LinkedBlockingQueue.java:442)
[junit4:junit4]    >         at java.util.concurrent.ThreadPoolExecutor.getTask(ThreadPoolExecutor.java:1045)
[junit4:junit4]    >         at java.util.concurrent.ThreadPoolExecutor.runWorker(ThreadPoolExecutor.java:1103)
[junit4:junit4]    >         at java.util.concurrent.ThreadPoolExecutor$Worker.run(ThreadPoolExecutor.java:603)
[junit4:junit4]    >         at java.lang.Thread.run(Thread.java:722)
[junit4:junit4]    > 	at __randomizedtesting.SeedInfo.seed([9AAF0F91EFAE552C]:0)
[junit4:junit4] Completed on J1 in 322.26s, 1 test, 2 failures, 1 error <<< FAILURES!

[...truncated 1 lines...]
[junit4:junit4] Suite: org.apache.solr.cloud.FullSolrCloudDistribCmdsTest
[junit4:junit4]   2> 1 T1050 oas.SolrTestCaseJ4.deleteCore ###deleteCore
[junit4:junit4]   2> NOTE: test params are: codec=Asserting, sim=DefaultSimilarity, locale=es_DO, timezone=America/Panama
[junit4:junit4]   2> NOTE: Linux 3.2.0-29-generic i386/Oracle Corporation 1.8.0-ea (32-bit)/cpus=8,threads=1,free=50410064,total=126574592
[junit4:junit4]   2> NOTE: All tests run in this JVM: [ClusterStateTest, SolrCoreTest, TestElisionMultitermQuery, LegacyHTMLStripCharFilterTest, PathHierarchyTokenizerFactoryTest, TestUpdate, TestSurroundQueryParser, TestPluginEnable, TestFoldingMultitermQuery, TestPropInject, DocumentBuilderTest, IndexSchemaTest, QueryEqualityTest, TestDocSet, TestSolrDeletionPolicy2, UpdateParamsTest, DirectSolrSpellCheckerTest, TestQuerySenderListener, TestPropInjectDefaults, TestCollationKeyRangeQueries, ReturnFieldsTest, EchoParamsTest, TestSolrJ, UUIDFieldTest, TestPhraseSuggestions, IndexSchemaRuntimeFieldTest, XmlUpdateRequestHandlerTest, DOMUtilTest, AnalysisAfterCoreReloadTest, TestSolrXMLSerializer, TestRecovery, PolyFieldTest, TestCodecSupport, TestHashPartitioner, OutputWriterTest, TestReversedWildcardFilterFactory, TestBinaryField, TestDistributedGrouping, BadIndexSchemaTest, TestRealTimeGet, TestSort, ConvertedLegacyTest, HighlighterTest, LeaderElectionTest, RequiredFieldsTest, QueryParsingTest, DistributedQueryElevationComponentTest, SuggesterTSTTest, PeerSyncTest, ShowFileRequestHandlerTest, ZkSolrClientTest, StandardRequestHandlerTest, CoreContainerCoreInitFailuresTest, BasicZkTest, StatelessScriptUpdateProcessorFactoryTest, BasicDistributedZkTest, FullSolrCloudDistribCmdsTest]
[junit4:junit4]   2> NOTE: reproduce with: ant test  -Dtestcase=FullSolrCloudDistribCmdsTest -Dtests.seed=9AAF0F91EFAE552C -Dtests.multiplier=3 -Dtests.slow=true -Dtests.locale=es_DO -Dtests.timezone=America/Panama -Dtests.file.encoding=UTF-8
[junit4:junit4] ERROR   0.00s J1 | FullSolrCloudDistribCmdsTest (suite) <<<
[junit4:junit4]    > Throwable #1: java.lang.AssertionError
[junit4:junit4]    > 	at __randomizedtesting.SeedInfo.seed([9AAF0F91EFAE552C]:0)
[junit4:junit4]    > 	at org.apache.solr.SolrTestCaseJ4.useFactory(SolrTestCaseJ4.java:98)
[junit4:junit4]    > 	at org.apache.solr.cloud.AbstractDistribZkTestBase.beforeThisClass(AbstractDistribZkTestBase.java:48)
[junit4:junit4]    > 	at sun.reflect.NativeMethodAccessorImpl.invoke0(Native Method)
[junit4:junit4]    > 	at sun.reflect.NativeMethodAccessorImpl.invoke(NativeMethodAccessorImpl.java:57)
[junit4:junit4]    > 	at sun.reflect.DelegatingMethodAccessorImpl.invoke(DelegatingMethodAccessorImpl.java:43)
[junit4:junit4]    > 	at java.lang.reflect.Method.invoke(Method.java:474)
[junit4:junit4]    > 	at com.carrotsearch.randomizedtesting.RandomizedRunner.invoke(RandomizedRunner.java:1559)
[junit4:junit4]    > 	at com.carrotsearch.randomizedtesting.RandomizedRunner.access$600(RandomizedRunner.java:79)
[junit4:junit4]    > 	at com.carrotsearch.randomizedtesting.RandomizedRunner$4.evaluate(RandomizedRunner.java:677)
[junit4:junit4]    > 	at com.carrotsearch.randomizedtesting.RandomizedRunner$5.evaluate(RandomizedRunner.java:693)
[junit4:junit4]    > 	at com.carrotsearch.randomizedtesting.rules.StatementAdapter.evaluate(StatementAdapter.java:36)
[junit4:junit4]    > 	at com.carrotsearch.randomizedtesting.rules.SystemPropertiesRestoreRule$1.evaluate(SystemPropertiesRestoreRule.java:53)
[junit4:junit4]    > 	at org.apache.lucene.util.AbstractBeforeAfterRule$1.evaluate(AbstractBeforeAfterRule.java:45)
[junit4:junit4]    > 	at org.apache.lucene.util.TestRuleStoreClassName$1.evaluate(TestRuleStoreClassName.java:42)
[junit4:junit4]    > 	at com.carrotsearch.randomizedtesting.rules.SystemPropertiesInvariantRule$1.evaluate(SystemPropertiesInvariantRule.java:55)
[junit4:junit4]    > 	at com.carrotsearch.randomizedtesting.rules.NoShadowingOrOverridesOnMethodsRule$1.evaluate(NoShadowingOrOverridesOnMethodsRule.java:39)
[junit4:junit4]    > 	at com.carrotsearch.randomizedtesting.rules.NoShadowingOrOverridesOnMethodsRule$1.evaluate(NoShadowingOrOverridesOnMethodsRule.java:39)
[junit4:junit4]    > 	at org.apache.lucene.util.TestRuleAssertionsRequired$1.evaluate(TestRuleAssertionsRequired.java:40)
[junit4:junit4]    > 	at org.apache.lucene.util.TestRuleMarkFailure$1.evaluate(TestRuleMarkFailure.java:48)
[junit4:junit4]    > 	at org.apache.lucene.util.TestRuleIgnoreAfterMaxFailures$1.evaluate(TestRuleIgnoreAfterMaxFailures.java:70)
[junit4:junit4]    > 	at org.apache.lucene.util.TestRuleIgnoreTestSuites$1.evaluate(TestRuleIgnoreTestSuites.java:55)
[junit4:junit4]    > 	at com.carrotsearch.randomizedtesting.rules.StatementAdapter.evaluate(StatementAdapter.java:36)
[junit4:junit4]    > 	at com.carrotsearch.randomizedtesting.ThreadLeakControl$StatementRunner.run(ThreadLeakControl.java:345)
[junit4:junit4]    > 	at java.lang.Thread.run(Thread.java:722)
[junit4:junit4] Completed on J1 in 0.07s, 0 tests, 1 failure <<< FAILURES!

[...truncated 351 lines...]
BUILD FAILED
/mnt/ssd/jenkins/workspace/Lucene-Solr-4.x-Linux/build.xml:29: The following error occurred while executing this line:
/mnt/ssd/jenkins/workspace/Lucene-Solr-4.x-Linux/solr/build.xml:144: The following error occurred while executing this line:
/mnt/ssd/jenkins/workspace/Lucene-Solr-4.x-Linux/lucene/module-build.xml:62: The following error occurred while executing this line:
/mnt/ssd/jenkins/workspace/Lucene-Solr-4.x-Linux/lucene/common-build.xml:1056: The following error occurred while executing this line:
/mnt/ssd/jenkins/workspace/Lucene-Solr-4.x-Linux/lucene/common-build.xml:741: There were test failures: 228 suites, 909 tests, 3 suite-level errors, 1 failure, 6 ignored (1 assumption)

Total time: 40 minutes 32 seconds
Build step 'Invoke Ant' marked build as failure
Recording test results
Description set: Java: 32bit/jdk1.8.0-ea-b51 -client -XX:+UseConcMarkSweepGC
Email was triggered for: Failure
Sending email for trigger: Failure



Mime
View raw message