lucene-dev mailing list archives

Site index · List index
Message view « Date » · « Thread »
Top « Date » · « Thread »
From Apache Jenkins Server <jenk...@builds.apache.org>
Subject [JENKINS] Lucene-Solr-Tests-4.x-java7 - Build # 405 - Failure
Date Thu, 06 Sep 2012 02:26:35 GMT
Build: https://builds.apache.org/job/Lucene-Solr-Tests-4.x-java7/405/

1 tests failed.
REGRESSION:  org.apache.solr.cloud.BasicDistributedZkTest.testDistribSearch

Error Message:
some core start times did not change on reload

Stack Trace:
java.lang.AssertionError: some core start times did not change on reload
	at __randomizedtesting.SeedInfo.seed([6CF48C9B95951FB1:ED120283E2CA7F8D]:0)
	at org.junit.Assert.fail(Assert.java:93)
	at org.junit.Assert.assertTrue(Assert.java:43)
	at org.apache.solr.cloud.BasicDistributedZkTest.testCollectionsAPI(BasicDistributedZkTest.java:409)
	at org.apache.solr.cloud.BasicDistributedZkTest.doTest(BasicDistributedZkTest.java:313)
	at org.apache.solr.BaseDistributedSearchTestCase.testDistribSearch(BaseDistributedSearchTestCase.java:691)
	at sun.reflect.NativeMethodAccessorImpl.invoke0(Native Method)
	at sun.reflect.NativeMethodAccessorImpl.invoke(NativeMethodAccessorImpl.java:57)
	at sun.reflect.DelegatingMethodAccessorImpl.invoke(DelegatingMethodAccessorImpl.java:43)
	at java.lang.reflect.Method.invoke(Method.java:601)
	at com.carrotsearch.randomizedtesting.RandomizedRunner.invoke(RandomizedRunner.java:1559)
	at com.carrotsearch.randomizedtesting.RandomizedRunner.access$600(RandomizedRunner.java:79)
	at com.carrotsearch.randomizedtesting.RandomizedRunner$6.evaluate(RandomizedRunner.java:737)
	at com.carrotsearch.randomizedtesting.RandomizedRunner$7.evaluate(RandomizedRunner.java:773)
	at com.carrotsearch.randomizedtesting.RandomizedRunner$8.evaluate(RandomizedRunner.java:787)
	at com.carrotsearch.randomizedtesting.rules.SystemPropertiesRestoreRule$1.evaluate(SystemPropertiesRestoreRule.java:53)
	at org.apache.lucene.util.TestRuleSetupTeardownChained$1.evaluate(TestRuleSetupTeardownChained.java:50)
	at org.apache.lucene.util.TestRuleFieldCacheSanity$1.evaluate(TestRuleFieldCacheSanity.java:51)
	at org.apache.lucene.util.AbstractBeforeAfterRule$1.evaluate(AbstractBeforeAfterRule.java:45)
	at com.carrotsearch.randomizedtesting.rules.SystemPropertiesInvariantRule$1.evaluate(SystemPropertiesInvariantRule.java:55)
	at org.apache.lucene.util.TestRuleThreadAndTestName$1.evaluate(TestRuleThreadAndTestName.java:48)
	at org.apache.lucene.util.TestRuleIgnoreAfterMaxFailures$1.evaluate(TestRuleIgnoreAfterMaxFailures.java:70)
	at org.apache.lucene.util.TestRuleMarkFailure$1.evaluate(TestRuleMarkFailure.java:48)
	at com.carrotsearch.randomizedtesting.rules.StatementAdapter.evaluate(StatementAdapter.java:36)
	at com.carrotsearch.randomizedtesting.ThreadLeakControl$StatementRunner.run(ThreadLeakControl.java:358)
	at com.carrotsearch.randomizedtesting.ThreadLeakControl.forkTimeoutingTask(ThreadLeakControl.java:782)
	at com.carrotsearch.randomizedtesting.ThreadLeakControl$3.evaluate(ThreadLeakControl.java:442)
	at com.carrotsearch.randomizedtesting.RandomizedRunner.runSingleTest(RandomizedRunner.java:746)
	at com.carrotsearch.randomizedtesting.RandomizedRunner$3.evaluate(RandomizedRunner.java:648)
	at com.carrotsearch.randomizedtesting.RandomizedRunner$4.evaluate(RandomizedRunner.java:682)
	at com.carrotsearch.randomizedtesting.RandomizedRunner$5.evaluate(RandomizedRunner.java:693)
	at com.carrotsearch.randomizedtesting.rules.StatementAdapter.evaluate(StatementAdapter.java:36)
	at com.carrotsearch.randomizedtesting.rules.SystemPropertiesRestoreRule$1.evaluate(SystemPropertiesRestoreRule.java:53)
	at org.apache.lucene.util.AbstractBeforeAfterRule$1.evaluate(AbstractBeforeAfterRule.java:45)
	at org.apache.lucene.util.TestRuleStoreClassName$1.evaluate(TestRuleStoreClassName.java:42)
	at com.carrotsearch.randomizedtesting.rules.SystemPropertiesInvariantRule$1.evaluate(SystemPropertiesInvariantRule.java:55)
	at com.carrotsearch.randomizedtesting.rules.NoShadowingOrOverridesOnMethodsRule$1.evaluate(NoShadowingOrOverridesOnMethodsRule.java:39)
	at com.carrotsearch.randomizedtesting.rules.NoShadowingOrOverridesOnMethodsRule$1.evaluate(NoShadowingOrOverridesOnMethodsRule.java:39)
	at org.apache.lucene.util.TestRuleAssertionsRequired$1.evaluate(TestRuleAssertionsRequired.java:40)
	at org.apache.lucene.util.TestRuleMarkFailure$1.evaluate(TestRuleMarkFailure.java:48)
	at org.apache.lucene.util.TestRuleIgnoreAfterMaxFailures$1.evaluate(TestRuleIgnoreAfterMaxFailures.java:70)
	at org.apache.lucene.util.TestRuleIgnoreTestSuites$1.evaluate(TestRuleIgnoreTestSuites.java:55)
	at com.carrotsearch.randomizedtesting.rules.StatementAdapter.evaluate(StatementAdapter.java:36)
	at com.carrotsearch.randomizedtesting.ThreadLeakControl$StatementRunner.run(ThreadLeakControl.java:358)
	at java.lang.Thread.run(Thread.java:722)




Build Log:
[...truncated 7960 lines...]
[junit4:junit4] Suite: org.apache.solr.cloud.BasicDistributedZkTest
[junit4:junit4]   2> 4 T1400 oas.SolrTestCaseJ4.setUp ###Starting testDistribSearch
[junit4:junit4]   2> Creating dataDir: /usr/home/hudson/hudson-slave/workspace/Lucene-Solr-Tests-4.x-java7/solr/build/solr-core/test/J1/./solrtest-BasicDistributedZkTest-1346897727898
[junit4:junit4]   2> 6 T1400 oasc.ZkTestServer.run STARTING ZK TEST SERVER
[junit4:junit4]   2> 9 T1401 oazs.ZooKeeperServer.setTickTime tickTime set to 3000
[junit4:junit4]   2> 9 T1401 oazs.NIOServerCnxn$Factory.<init> binding to port 0.0.0.0/0.0.0.0:0
[junit4:junit4]   2> 10 T1401 oazsp.FileTxnSnapLog.save Snapshotting: 0
[junit4:junit4]   2> 107 T1400 oasc.ZkTestServer.run start zk server on port:37623
[junit4:junit4]   2> 107 T1400 oaz.ZooKeeper.<init> Initiating client connection, connectString=127.0.0.1:37623 sessionTimeout=10000 watcher=org.apache.solr.common.cloud.ConnectionManager@1dab40ec
[junit4:junit4]   2> 108 T1406 oaz.ClientCnxn$SendThread.startConnect Opening socket connection to server /127.0.0.1:37623
[junit4:junit4]   2> 108 T1400 oascc.ConnectionManager.waitForConnected Waiting for client to connect to ZooKeeper
[junit4:junit4]   2> 109 T1406 oaz.ClientCnxn$SendThread.primeConnection Socket connection established to localhost/127.0.0.1:37623, initiating session
[junit4:junit4]   2> 110 T1402 oazs.NIOServerCnxn$Factory.run Accepted socket connection from /140.211.11.196:37624
[junit4:junit4]   2> 110 T1402 oazs.NIOServerCnxn.readConnectRequest Client attempting to establish new session at /140.211.11.196:37624
[junit4:junit4]   2> 110 T1404 oazsp.FileTxnLog.append Creating new log file: log.1
[junit4:junit4]   2> 260 T1404 oazs.NIOServerCnxn.finishSessionInit Established session 0x139995c51a00000 with negotiated timeout 10000 for client /140.211.11.196:37624
[junit4:junit4]   2> 261 T1406 oaz.ClientCnxn$SendThread.readConnectResult Session establishment complete on server localhost/127.0.0.1:37623, sessionid = 0x139995c51a00000, negotiated timeout = 10000
[junit4:junit4]   2> 261 T1407 oascc.ConnectionManager.process Watcher org.apache.solr.common.cloud.ConnectionManager@1dab40ec name:ZooKeeperConnection Watcher:127.0.0.1:37623 got event WatchedEvent state:SyncConnected type:None path:null path:null type:None
[junit4:junit4]   2> 261 T1400 oascc.ConnectionManager.waitForConnected Client is connected to ZooKeeper
[junit4:junit4]   2> 262 T1400 oascc.SolrZkClient.makePath makePath: /solr
[junit4:junit4]   2> 291 T1405 oazs.PrepRequestProcessor.pRequest Processed session termination for sessionid: 0x139995c51a00000
[junit4:junit4]   2> 299 T1400 oaz.ZooKeeper.close Session: 0x139995c51a00000 closed
[junit4:junit4]   2> 300 T1400 oaz.ZooKeeper.<init> Initiating client connection, connectString=127.0.0.1:37623/solr sessionTimeout=10000 watcher=org.apache.solr.common.cloud.ConnectionManager@17e377c8
[junit4:junit4]   2> 311 T1407 oaz.ClientCnxn$EventThread.run EventThread shut down
[junit4:junit4]   2> 318 T1402 oazs.NIOServerCnxn.closeSock Closed socket connection for client /140.211.11.196:37624 which had sessionid 0x139995c51a00000
[junit4:junit4]   2> 318 T1408 oaz.ClientCnxn$SendThread.startConnect Opening socket connection to server /127.0.0.1:37623
[junit4:junit4]   2> 317 T1400 oascc.ConnectionManager.waitForConnected Waiting for client to connect to ZooKeeper
[junit4:junit4]   2> 319 T1408 oaz.ClientCnxn$SendThread.primeConnection Socket connection established to localhost/127.0.0.1:37623, initiating session
[junit4:junit4]   2> 319 T1402 oazs.NIOServerCnxn$Factory.run Accepted socket connection from /140.211.11.196:37629
[junit4:junit4]   2> 320 T1402 oazs.NIOServerCnxn.readConnectRequest Client attempting to establish new session at /140.211.11.196:37629
[junit4:junit4]   2> 322 T1404 oazs.NIOServerCnxn.finishSessionInit Established session 0x139995c51a00001 with negotiated timeout 10000 for client /140.211.11.196:37629
[junit4:junit4]   2> 322 T1408 oaz.ClientCnxn$SendThread.readConnectResult Session establishment complete on server localhost/127.0.0.1:37623, sessionid = 0x139995c51a00001, negotiated timeout = 10000
[junit4:junit4]   2> 323 T1409 oascc.ConnectionManager.process Watcher org.apache.solr.common.cloud.ConnectionManager@17e377c8 name:ZooKeeperConnection Watcher:127.0.0.1:37623/solr got event WatchedEvent state:SyncConnected type:None path:null path:null type:None
[junit4:junit4]   2> 323 T1400 oascc.ConnectionManager.waitForConnected Client is connected to ZooKeeper
[junit4:junit4]   2> 323 T1400 oascc.SolrZkClient.makePath makePath: /collections/collection1
[junit4:junit4]   2> 327 T1400 oascc.SolrZkClient.makePath makePath: /collections/collection1/shards
[junit4:junit4]   2> 339 T1400 oascc.SolrZkClient.makePath makePath: /collections/control_collection
[junit4:junit4]   2> 342 T1400 oascc.SolrZkClient.makePath makePath: /collections/control_collection/shards
[junit4:junit4]   2> 344 T1400 oasc.AbstractZkTestCase.putConfig put /usr/home/hudson/hudson-slave/workspace/Lucene-Solr-Tests-4.x-java7/solr/build/solr-core/test-files/solr/collection1/conf/solrconfig.xml to /configs/conf1/solrconfig.xml
[junit4:junit4]   2> 345 T1400 oascc.SolrZkClient.makePath makePath: /configs/conf1/solrconfig.xml
[junit4:junit4]   2> 357 T1400 oasc.AbstractZkTestCase.putConfig put /usr/home/hudson/hudson-slave/workspace/Lucene-Solr-Tests-4.x-java7/solr/build/solr-core/test-files/solr/collection1/conf/schema.xml to /configs/conf1/schema.xml
[junit4:junit4]   2> 358 T1400 oascc.SolrZkClient.makePath makePath: /configs/conf1/schema.xml
[junit4:junit4]   2> 463 T1400 oasc.AbstractZkTestCase.putConfig put /usr/home/hudson/hudson-slave/workspace/Lucene-Solr-Tests-4.x-java7/solr/build/solr-core/test-files/solr/collection1/conf/solrconfig.xml to /configs/conf1/solrconfig.xml
[junit4:junit4]   2> 465 T1400 oascc.SolrZkClient.makePath makePath: /configs/conf1/solrconfig.xml
[junit4:junit4]   2> 468 T1400 oasc.AbstractZkTestCase.putConfig put /usr/home/hudson/hudson-slave/workspace/Lucene-Solr-Tests-4.x-java7/solr/build/solr-core/test-files/solr/collection1/conf/stopwords.txt to /configs/conf1/stopwords.txt
[junit4:junit4]   2> 469 T1400 oascc.SolrZkClient.makePath makePath: /configs/conf1/stopwords.txt
[junit4:junit4]   2> 471 T1400 oasc.AbstractZkTestCase.putConfig put /usr/home/hudson/hudson-slave/workspace/Lucene-Solr-Tests-4.x-java7/solr/build/solr-core/test-files/solr/collection1/conf/protwords.txt to /configs/conf1/protwords.txt
[junit4:junit4]   2> 472 T1400 oascc.SolrZkClient.makePath makePath: /configs/conf1/protwords.txt
[junit4:junit4]   2> 480 T1400 oasc.AbstractZkTestCase.putConfig put /usr/home/hudson/hudson-slave/workspace/Lucene-Solr-Tests-4.x-java7/solr/build/solr-core/test-files/solr/collection1/conf/currency.xml to /configs/conf1/currency.xml
[junit4:junit4]   2> 481 T1400 oascc.SolrZkClient.makePath makePath: /configs/conf1/currency.xml
[junit4:junit4]   2> 485 T1400 oasc.AbstractZkTestCase.putConfig put /usr/home/hudson/hudson-slave/workspace/Lucene-Solr-Tests-4.x-java7/solr/build/solr-core/test-files/solr/collection1/conf/open-exchange-rates.json to /configs/conf1/open-exchange-rates.json
[junit4:junit4]   2> 486 T1400 oascc.SolrZkClient.makePath makePath: /configs/conf1/open-exchange-rates.json
[junit4:junit4]   2> 489 T1400 oasc.AbstractZkTestCase.putConfig put /usr/home/hudson/hudson-slave/workspace/Lucene-Solr-Tests-4.x-java7/solr/build/solr-core/test-files/solr/collection1/conf/mapping-ISOLatin1Accent.txt to /configs/conf1/mapping-ISOLatin1Accent.txt
[junit4:junit4]   2> 490 T1400 oascc.SolrZkClient.makePath makePath: /configs/conf1/mapping-ISOLatin1Accent.txt
[junit4:junit4]   2> 493 T1400 oasc.AbstractZkTestCase.putConfig put /usr/home/hudson/hudson-slave/workspace/Lucene-Solr-Tests-4.x-java7/solr/build/solr-core/test-files/solr/collection1/conf/old_synonyms.txt to /configs/conf1/old_synonyms.txt
[junit4:junit4]   2> 494 T1400 oascc.SolrZkClient.makePath makePath: /configs/conf1/old_synonyms.txt
[junit4:junit4]   2> 498 T1400 oasc.AbstractZkTestCase.putConfig put /usr/home/hudson/hudson-slave/workspace/Lucene-Solr-Tests-4.x-java7/solr/build/solr-core/test-files/solr/collection1/conf/synonyms.txt to /configs/conf1/synonyms.txt
[junit4:junit4]   2> 499 T1400 oascc.SolrZkClient.makePath makePath: /configs/conf1/synonyms.txt
[junit4:junit4]   2> 501 T1405 oazs.PrepRequestProcessor.pRequest Processed session termination for sessionid: 0x139995c51a00001
[junit4:junit4]   2> 503 T1409 oaz.ClientCnxn$EventThread.run EventThread shut down
[junit4:junit4]   2> 503 T1402 oazs.NIOServerCnxn.closeSock Closed socket connection for client /140.211.11.196:37629 which had sessionid 0x139995c51a00001
[junit4:junit4]   2> 503 T1400 oaz.ZooKeeper.close Session: 0x139995c51a00001 closed
[junit4:junit4]   2> 702 T1400 oejs.Server.doStart jetty-8.1.2.v20120308
[junit4:junit4]   2> 708 T1400 oejs.AbstractConnector.doStart Started SocketConnector@0.0.0.0:37630
[junit4:junit4]   2> 709 T1400 oasc.SolrResourceLoader.locateSolrHome JNDI not configured for solr (NoInitialContextEx)
[junit4:junit4]   2> 710 T1400 oasc.SolrResourceLoader.locateSolrHome using system property solr.solr.home: /usr/home/hudson/hudson-slave/workspace/Lucene-Solr-Tests-4.x-java7/solr/build/solr-core/test-files/control1
[junit4:junit4]   2> 710 T1400 oasc.SolrResourceLoader.<init> new SolrResourceLoader for deduced Solr Home: '/usr/home/hudson/hudson-slave/workspace/Lucene-Solr-Tests-4.x-java7/solr/build/solr-core/test-files/control1/'
[junit4:junit4]   2> 766 T1400 oass.SolrDispatchFilter.init SolrDispatchFilter.init()
[junit4:junit4]   2> 767 T1400 oasc.SolrResourceLoader.locateSolrHome JNDI not configured for solr (NoInitialContextEx)
[junit4:junit4]   2> 768 T1400 oasc.SolrResourceLoader.locateSolrHome using system property solr.solr.home: /usr/home/hudson/hudson-slave/workspace/Lucene-Solr-Tests-4.x-java7/solr/build/solr-core/test-files/control1
[junit4:junit4]   2> 769 T1400 oasc.CoreContainer$Initializer.initialize looking for solr.xml: /usr/home/hudson/hudson-slave/workspace/Lucene-Solr-Tests-4.x-java7/solr/build/solr-core/test-files/control1/solr.xml
[junit4:junit4]   2> 769 T1400 oasc.CoreContainer.<init> New CoreContainer 1354504763
[junit4:junit4]   2> 770 T1400 oasc.CoreContainer.load Loading CoreContainer using Solr Home: '/usr/home/hudson/hudson-slave/workspace/Lucene-Solr-Tests-4.x-java7/solr/build/solr-core/test-files/control1/'
[junit4:junit4]   2> 770 T1400 oasc.SolrResourceLoader.<init> new SolrResourceLoader for directory: '/usr/home/hudson/hudson-slave/workspace/Lucene-Solr-Tests-4.x-java7/solr/build/solr-core/test-files/control1/'
[junit4:junit4]   2> 812 T1400 oasc.CoreContainer.load Registering Log Listener
[junit4:junit4]   2> 831 T1400 oasc.CoreContainer.initZooKeeper Zookeeper client=127.0.0.1:37623/solr
[junit4:junit4]   2> 832 T1400 oaz.ZooKeeper.<init> Initiating client connection, connectString=127.0.0.1:37623/solr sessionTimeout=8000 watcher=org.apache.solr.common.cloud.ConnectionManager@6ad0d937
[junit4:junit4]   2> 834 T1419 oaz.ClientCnxn$SendThread.startConnect Opening socket connection to server /127.0.0.1:37623
[junit4:junit4]   2> 834 T1400 oascc.ConnectionManager.waitForConnected Waiting for client to connect to ZooKeeper
[junit4:junit4]   2> 835 T1419 oaz.ClientCnxn$SendThread.primeConnection Socket connection established to localhost/127.0.0.1:37623, initiating session
[junit4:junit4]   2> 836 T1402 oazs.NIOServerCnxn$Factory.run Accepted socket connection from /140.211.11.196:37637
[junit4:junit4]   2> 836 T1402 oazs.NIOServerCnxn.readConnectRequest Client attempting to establish new session at /140.211.11.196:37637
[junit4:junit4]   2> 871 T1404 oazs.NIOServerCnxn.finishSessionInit Established session 0x139995c51a00002 with negotiated timeout 8000 for client /140.211.11.196:37637
[junit4:junit4]   2> 871 T1419 oaz.ClientCnxn$SendThread.readConnectResult Session establishment complete on server localhost/127.0.0.1:37623, sessionid = 0x139995c51a00002, negotiated timeout = 8000
[junit4:junit4]   2> 872 T1420 oascc.ConnectionManager.process Watcher org.apache.solr.common.cloud.ConnectionManager@6ad0d937 name:ZooKeeperConnection Watcher:127.0.0.1:37623/solr got event WatchedEvent state:SyncConnected type:None path:null path:null type:None
[junit4:junit4]   2> 872 T1400 oascc.ConnectionManager.waitForConnected Client is connected to ZooKeeper
[junit4:junit4]   2> 875 T1405 oazs.PrepRequestProcessor.pRequest Got user-level KeeperException when processing sessionid:0x139995c51a00002 type:create cxid:0x2 zxid:0xfffffffffffffffe txntype:unknown reqpath:n/a Error Path:/solr/overseer Error:KeeperErrorCode = NodeExists for /solr/overseer
[junit4:junit4]   2> 876 T1400 oascc.SolrZkClient.makePath makePath: /live_nodes
[junit4:junit4]   2> 885 T1400 oasc.ZkController.createEphemeralLiveNode Register node as live in ZooKeeper:/live_nodes/127.0.0.1:37630_solr
[junit4:junit4]   2> 886 T1405 oazs.PrepRequestProcessor.pRequest Got user-level KeeperException when processing sessionid:0x139995c51a00002 type:delete cxid:0x7 zxid:0xfffffffffffffffe txntype:unknown reqpath:n/a Error Path:/solr/live_nodes/127.0.0.1:37630_solr Error:KeeperErrorCode = NoNode for /solr/live_nodes/127.0.0.1:37630_solr
[junit4:junit4]   2> 887 T1400 oascc.SolrZkClient.makePath makePath: /live_nodes/127.0.0.1:37630_solr
[junit4:junit4]   2> 890 T1400 oashc.HttpShardHandlerFactory.getParameter Setting socketTimeout to: 0
[junit4:junit4]   2> 890 T1400 oashc.HttpShardHandlerFactory.getParameter Setting urlScheme to: http://
[junit4:junit4]   2> 891 T1400 oashc.HttpShardHandlerFactory.getParameter Setting connTimeout to: 0
[junit4:junit4]   2> 891 T1400 oashc.HttpShardHandlerFactory.getParameter Setting maxConnectionsPerHost to: 20
[junit4:junit4]   2> 892 T1400 oashc.HttpShardHandlerFactory.getParameter Setting corePoolSize to: 0
[junit4:junit4]   2> 892 T1400 oashc.HttpShardHandlerFactory.getParameter Setting maximumPoolSize to: 2147483647
[junit4:junit4]   2> 893 T1400 oashc.HttpShardHandlerFactory.getParameter Setting maxThreadIdleTime to: 5
[junit4:junit4]   2> 893 T1400 oashc.HttpShardHandlerFactory.getParameter Setting sizeOfQueue to: -1
[junit4:junit4]   2> 894 T1400 oashc.HttpShardHandlerFactory.getParameter Setting fairnessPolicy to: false
[junit4:junit4]   2> 895 T1400 oascsi.HttpClientUtil.createClient Creating new http client, config:maxConnectionsPerHost=20&maxConnections=10000&socketTimeout=0&connTimeout=0&retry=false
[junit4:junit4]   2> 914 T1400 oascc.SolrZkClient.makePath makePath: /overseer_elect/election
[junit4:junit4]   2> 928 T1405 oazs.PrepRequestProcessor.pRequest Got user-level KeeperException when processing sessionid:0x139995c51a00002 type:delete cxid:0x15 zxid:0xfffffffffffffffe txntype:unknown reqpath:n/a Error Path:/solr/overseer_elect/leader Error:KeeperErrorCode = NoNode for /solr/overseer_elect/leader
[junit4:junit4]   2> 929 T1400 oascc.SolrZkClient.makePath makePath: /overseer_elect/leader
[junit4:junit4]   2> 933 T1400 oasc.Overseer.start Overseer (id=88270289495916546-127.0.0.1:37630_solr-n_0000000000) starting
[junit4:junit4]   2> 934 T1405 oazs.PrepRequestProcessor.pRequest Got user-level KeeperException when processing sessionid:0x139995c51a00002 type:create cxid:0x1a zxid:0xfffffffffffffffe txntype:unknown reqpath:n/a Error Path:/solr/overseer Error:KeeperErrorCode = NodeExists for /solr/overseer
[junit4:junit4]   2> 935 T1405 oazs.PrepRequestProcessor.pRequest Got user-level KeeperException when processing sessionid:0x139995c51a00002 type:create cxid:0x1b zxid:0xfffffffffffffffe txntype:unknown reqpath:n/a Error Path:/solr/overseer Error:KeeperErrorCode = NodeExists for /solr/overseer
[junit4:junit4]   2> 946 T1405 oazs.PrepRequestProcessor.pRequest Got user-level KeeperException when processing sessionid:0x139995c51a00002 type:create cxid:0x1c zxid:0xfffffffffffffffe txntype:unknown reqpath:n/a Error Path:/solr/overseer Error:KeeperErrorCode = NodeExists for /solr/overseer
[junit4:junit4]   2> 950 T1405 oazs.PrepRequestProcessor.pRequest Got user-level KeeperException when processing sessionid:0x139995c51a00002 type:create cxid:0x1d zxid:0xfffffffffffffffe txntype:unknown reqpath:n/a Error Path:/solr/overseer Error:KeeperErrorCode = NodeExists for /solr/overseer
[junit4:junit4]   2> 953 T1422 oasc.OverseerCollectionProcessor.run Process current queue of collection creations
[junit4:junit4]   2> 954 T1400 oascc.SolrZkClient.makePath makePath: /clusterstate.json
[junit4:junit4]   2> 964 T1400 oascc.ZkStateReader.createClusterStateWatchersAndUpdate Updating cluster state from ZooKeeper... 
[junit4:junit4]   2> 971 T1400 oasc.CoreContainer.create Creating SolrCore 'collection1' using instanceDir: /usr/home/hudson/hudson-slave/workspace/Lucene-Solr-Tests-4.x-java7/solr/build/solr-core/test-files/control1/collection1
[junit4:junit4]   2> 972 T1400 oasc.ZkController.createCollectionZkNode Check for collection zkNode:control_collection
[junit4:junit4]   2> 973 T1421 oasc.Overseer$ClusterStateUpdater.run Starting to work on the main queue
[junit4:junit4]   2> 973 T1400 oasc.ZkController.createCollectionZkNode Collection zkNode exists
[junit4:junit4]   2> 973 T1400 oasc.ZkController.readConfigName Load collection config from:/collections/control_collection
[junit4:junit4]   2> 975 T1400 oasc.SolrResourceLoader.<init> new SolrResourceLoader for directory: '/usr/home/hudson/hudson-slave/workspace/Lucene-Solr-Tests-4.x-java7/solr/build/solr-core/test-files/control1/collection1/'
[junit4:junit4]   2> 977 T1400 oasc.SolrResourceLoader.replaceClassLoader Adding 'file:/usr/home/hudson/hudson-slave/workspace/Lucene-Solr-Tests-4.x-java7/solr/build/solr-core/test-files/control1/collection1/lib/classes/' to classloader
[junit4:junit4]   2> 977 T1400 oasc.SolrResourceLoader.replaceClassLoader Adding 'file:/usr/home/hudson/hudson-slave/workspace/Lucene-Solr-Tests-4.x-java7/solr/build/solr-core/test-files/control1/collection1/lib/README' to classloader
[junit4:junit4]   2> 1037 T1400 oasc.SolrConfig.<init> Using Lucene MatchVersion: LUCENE_40
[junit4:junit4]   2> 1124 T1400 oasc.SolrConfig.<init> Loaded SolrConfig: solrconfig.xml
[junit4:junit4]   2> 1226 T1400 oass.IndexSchema.readSchema Reading Solr Schema
[junit4:junit4]   2> 1236 T1400 oass.IndexSchema.readSchema Schema name=test
[junit4:junit4]   2> 1997 T1400 oass.OpenExchangeRatesOrgProvider.init Initialized with rates=open-exchange-rates.json, refreshInterval=1440.
[junit4:junit4]   2> 2012 T1400 oass.IndexSchema.readSchema default search field in schema is text
[junit4:junit4]   2> 2018 T1400 oass.IndexSchema.readSchema unique key field: id
[junit4:junit4]   2> 2032 T1400 oass.FileExchangeRateProvider.reload Reloading exchange rates from file currency.xml
[junit4:junit4]   2> 2039 T1400 oass.FileExchangeRateProvider.reload Reloading exchange rates from file currency.xml
[junit4:junit4]   2> 2047 T1400 oass.OpenExchangeRatesOrgProvider.reload Reloading exchange rates from open-exchange-rates.json
[junit4:junit4]   2> 2052 T1400 oass.OpenExchangeRatesOrgProvider.reload Reloading exchange rates from open-exchange-rates.json
[junit4:junit4]   2> 2062 T1400 oasc.SolrCore.<init> [collection1] Opening new SolrCore at /usr/home/hudson/hudson-slave/workspace/Lucene-Solr-Tests-4.x-java7/solr/build/solr-core/test-files/control1/collection1/, dataDir=/usr/home/hudson/hudson-slave/workspace/Lucene-Solr-Tests-4.x-java7/solr/build/solr-core/test-files/control1/collection1/data/
[junit4:junit4]   2> 2063 T1400 oasc.JmxMonitoredMap.<init> JMX monitoring is enabled. Adding Solr mbeans to JMX Server: com.sun.jmx.mbeanserver.JmxMBeanServer@41a33efb
[junit4:junit4]   2> 2065 T1400 oasc.SolrCore.getNewIndexDir WARNING New index directory detected: old=null new=/usr/home/hudson/hudson-slave/workspace/Lucene-Solr-Tests-4.x-java7/solr/build/solr-core/test-files/control1/collection1/data/index/
[junit4:junit4]   2> 2067 T1400 oasc.SolrCore.initIndex WARNING [collection1] Solr index directory '/usr/home/hudson/hudson-slave/workspace/Lucene-Solr-Tests-4.x-java7/solr/build/solr-core/test-files/control1/collection1/data/index' doesn't exist. Creating new index...
[junit4:junit4]   2> 2068 T1400 oasc.CachingDirectoryFactory.get return new directory for /usr/home/hudson/hudson-slave/workspace/Lucene-Solr-Tests-4.x-java7/solr/build/solr-core/test-files/control1/collection1/data/index forceNew:false
[junit4:junit4]   2> 2079 T1400 oasc.SolrDeletionPolicy.onCommit SolrDeletionPolicy.onCommit: commits:num=1
[junit4:junit4]   2> 		commit{dir=NRTCachingDirectory(org.apache.lucene.store.NIOFSDirectory@/usr/home/hudson/hudson-slave/workspace/Lucene-Solr-Tests-4.x-java7/solr/build/solr-core/test-files/control1/collection1/data/index lockFactory=org.apache.lucene.store.NativeFSLockFactory@4ae35a2; maxCacheMB=48.0 maxMergeSizeMB=4.0),segFN=segments_1,generation=1,filenames=[segments_1]
[junit4:junit4]   2> 2080 T1400 oasc.SolrDeletionPolicy.updateCommits newest commit = 1
[junit4:junit4]   2> 2081 T1400 oasc.SolrCore.initWriters created xml: solr.XMLResponseWriter
[junit4:junit4]   2> 2084 T1400 oasup.UpdateRequestProcessorChain.init inserting DistributedUpdateProcessorFactory into updateRequestProcessorChain "dedupe"
[junit4:junit4]   2> 2085 T1400 oasup.UpdateRequestProcessorChain.init inserting DistributedUpdateProcessorFactory into updateRequestProcessorChain "dedupe-allfields"
[junit4:junit4]   2> 2086 T1400 oasup.UpdateRequestProcessorChain.init inserting DistributedUpdateProcessorFactory into updateRequestProcessorChain "stored_sig"
[junit4:junit4]   2> 2087 T1400 oasup.UpdateRequestProcessorChain.init inserting DistributedUpdateProcessorFactory into updateRequestProcessorChain "uniq-fields"
[junit4:junit4]   2> 2088 T1400 oasup.UpdateRequestProcessorChain.init inserting DistributedUpdateProcessorFactory into updateRequestProcessorChain "distrib-dup-test-chain-implicit"
[junit4:junit4]   2> 2089 T1400 oasc.RequestHandlers.initHandlersFromConfig adding lazy requestHandler: solr.ReplicationHandler
[junit4:junit4]   2> 2089 T1400 oasc.RequestHandlers.initHandlersFromConfig created /replication: solr.ReplicationHandler
[junit4:junit4]   2> 2090 T1400 oasc.RequestHandlers.initHandlersFromConfig created standard: solr.StandardRequestHandler
[junit4:junit4]   2> 2091 T1400 oasc.RequestHandlers.initHandlersFromConfig created /get: solr.RealTimeGetHandler
[junit4:junit4]   2> 2092 T1400 oasc.RequestHandlers.initHandlersFromConfig created dismax: solr.SearchHandler
[junit4:junit4]   2> 2093 T1400 oasc.RequestHandlers.initHandlersFromConfig created mock: org.apache.solr.core.MockQuerySenderListenerReqHandler
[junit4:junit4]   2> 2093 T1400 oasc.RequestHandlers.initHandlersFromConfig created /admin/: org.apache.solr.handler.admin.AdminHandlers
[junit4:junit4]   2> 2094 T1400 oasc.RequestHandlers.initHandlersFromConfig created defaults: solr.StandardRequestHandler
[junit4:junit4]   2> 2095 T1400 oasc.RequestHandlers.initHandlersFromConfig adding lazy requestHandler: solr.StandardRequestHandler
[junit4:junit4]   2> 2095 T1400 oasc.RequestHandlers.initHandlersFromConfig created lazy: solr.StandardRequestHandler
[junit4:junit4]   2> 2096 T1400 oasc.RequestHandlers.initHandlersFromConfig created /update: solr.UpdateRequestHandler
[junit4:junit4]   2> 2097 T1400 oasc.RequestHandlers.initHandlersFromConfig created /terms: org.apache.solr.handler.component.SearchHandler
[junit4:junit4]   2> 2098 T1400 oasc.RequestHandlers.initHandlersFromConfig created spellCheckCompRH: org.apache.solr.handler.component.SearchHandler
[junit4:junit4]   2> 2098 T1400 oasc.RequestHandlers.initHandlersFromConfig created spellCheckCompRH_Direct: org.apache.solr.handler.component.SearchHandler
[junit4:junit4]   2> 2099 T1400 oasc.RequestHandlers.initHandlersFromConfig created spellCheckWithWordbreak: org.apache.solr.handler.component.SearchHandler
[junit4:junit4]   2> 2100 T1400 oasc.RequestHandlers.initHandlersFromConfig created spellCheckWithWordbreak_Direct: org.apache.solr.handler.component.SearchHandler
[junit4:junit4]   2> 2100 T1400 oasc.RequestHandlers.initHandlersFromConfig created spellCheckCompRH1: org.apache.solr.handler.component.SearchHandler
[junit4:junit4]   2> 2101 T1400 oasc.RequestHandlers.initHandlersFromConfig created tvrh: org.apache.solr.handler.component.SearchHandler
[junit4:junit4]   2> 2102 T1400 oasc.RequestHandlers.initHandlersFromConfig created /mlt: solr.MoreLikeThisHandler
[junit4:junit4]   2> 2103 T1400 oasc.RequestHandlers.initHandlersFromConfig created /debug/dump: solr.DumpRequestHandler
[junit4:junit4]   2> 2108 T1400 oashl.XMLLoader.init xsltCacheLifetimeSeconds=60
[junit4:junit4]   2> 2114 T1400 oasc.SolrCore.initDeprecatedSupport WARNING solrconfig.xml uses deprecated <admin/gettableFiles>, Please update your config to use the ShowFileRequestHandler.
[junit4:junit4]   2> 2117 T1400 oasc.SolrCore.initDeprecatedSupport WARNING adding ShowFileRequestHandler with hidden files: [SCHEMA.XML, OLD_SYNONYMS.TXT, STOPWORDS.TXT, PROTWORDS.TXT, OPEN-EXCHANGE-RATES.JSON, SYNONYMS.TXT, CURRENCY.XML, MAPPING-ISOLATIN1ACCENT.TXT]
[junit4:junit4]   2> 2123 T1400 oass.SolrIndexSearcher.<init> Opening Searcher@2eb33f08 main
[junit4:junit4]   2> 2126 T1400 oasu.CommitTracker.<init> Hard AutoCommit: disabled
[junit4:junit4]   2> 2127 T1400 oasu.CommitTracker.<init> Soft AutoCommit: disabled
[junit4:junit4]   2> 2128 T1400 oashc.SpellCheckComponent.inform Initializing spell checkers
[junit4:junit4]   2> 2132 T1400 oass.DirectSolrSpellChecker.init init: {name=direct,classname=DirectSolrSpellChecker,field=lowerfilt,minQueryLength=3}
[junit4:junit4]   2> 2153 T1423 oasc.SolrCore.registerSearcher [collection1] Registered new searcher Searcher@2eb33f08 main{StandardDirectoryReader(segments_1:1)}
[junit4:junit4]   2> 2168 T1405 oazs.PrepRequestProcessor.pRequest Got user-level KeeperException when processing sessionid:0x139995c51a00002 type:create cxid:0x56 zxid:0xfffffffffffffffe txntype:unknown reqpath:n/a Error Path:/solr/overseer/queue Error:KeeperErrorCode = NoNode for /solr/overseer/queue
[junit4:junit4]   2> 2185 T1400 oasc.CoreContainer.register registering core: collection1
[junit4:junit4]   2> 2186 T1400 oasc.ZkController.register Register shard - core:collection1 address:http://127.0.0.1:37630/solr shardId:control_shard
[junit4:junit4]   2> 2197 T1400 oascc.SolrZkClient.makePath makePath: /collections/control_collection/leader_elect/control_shard/election
[junit4:junit4]   2> 2215 T1405 oazs.PrepRequestProcessor.pRequest Got user-level KeeperException when processing sessionid:0x139995c51a00002 type:delete cxid:0x65 zxid:0xfffffffffffffffe txntype:unknown reqpath:n/a Error Path:/solr/collections/control_collection/leaders Error:KeeperErrorCode = NoNode for /solr/collections/control_collection/leaders
[junit4:junit4]   2> 2216 T1400 oasc.ShardLeaderElectionContext.runLeaderProcess Running the leader process. afterExpiration=false
[junit4:junit4]   2> 2218 T1405 oazs.PrepRequestProcessor.pRequest Got user-level KeeperException when processing sessionid:0x139995c51a00002 type:create cxid:0x66 zxid:0xfffffffffffffffe txntype:unknown reqpath:n/a Error Path:/solr/overseer Error:KeeperErrorCode = NodeExists for /solr/overseer
[junit4:junit4]   2> 2230 T1400 oasc.ShardLeaderElectionContext.runLeaderProcess I am the new leader: http://127.0.0.1:37630/solr/collection1/
[junit4:junit4]   2> 2232 T1400 oascc.SolrZkClient.makePath makePath: /collections/control_collection/leaders/control_shard
[junit4:junit4]   2> 2236 T1405 oazs.PrepRequestProcessor.pRequest Got user-level KeeperException when processing sessionid:0x139995c51a00002 type:create cxid:0x6f zxid:0xfffffffffffffffe txntype:unknown reqpath:n/a Error Path:/solr/overseer Error:KeeperErrorCode = NodeExists for /solr/overseer
[junit4:junit4]   2> 2484 T1421 oascc.ZkStateReader.updateClusterState Updating cloud state from ZooKeeper... 
[junit4:junit4]   2> 2485 T1405 oazs.PrepRequestProcessor.pRequest Got user-level KeeperException when processing sessionid:0x139995c51a00002 type:create cxid:0x77 zxid:0xfffffffffffffffe txntype:unknown reqpath:n/a Error Path:/solr/overseer/queue-work Error:KeeperErrorCode = NoNode for /solr/overseer/queue-work
[junit4:junit4]   2> 2535 T1420 oascc.ZkStateReader$2.process A cluster state change has occurred - updating...
[junit4:junit4]   2> 2553 T1400 oasc.ZkController.register We are http://127.0.0.1:37630/solr/collection1/ and leader is http://127.0.0.1:37630/solr/collection1/
[junit4:junit4]   2> 2554 T1400 oasc.ZkController.register No LogReplay needed for core=collection1 baseURL=http://127.0.0.1:37630/solr
[junit4:junit4]   2> 2554 T1400 oasc.ZkController.checkRecovery I am the leader, no recovery necessary
[junit4:junit4]   2> 2558 T1400 oascc.ZkStateReader.updateClusterState Updating cloud state from ZooKeeper... 
[junit4:junit4]   2> 2560 T1400 oass.SolrDispatchFilter.init user.dir=/usr/home/hudson/hudson-slave/workspace/Lucene-Solr-Tests-4.x-java7/solr/build/solr-core/test/J1
[junit4:junit4]   2> 2560 T1400 oass.SolrDispatchFilter.init SolrDispatchFilter.init() done
[junit4:junit4]   2> 2561 T1400 oascsi.HttpClientUtil.createClient Creating new http client, config:maxConnections=128&maxConnectionsPerHost=32&followRedirects=false
[junit4:junit4]   2> 2795 T1400 oejs.Server.doStart jetty-8.1.2.v20120308
[junit4:junit4]   2> 2799 T1400 oejs.AbstractConnector.doStart Started SocketConnector@0.0.0.0:37651
[junit4:junit4]   2> 2800 T1400 oasc.SolrResourceLoader.locateSolrHome JNDI not configured for solr (NoInitialContextEx)
[junit4:junit4]   2> 2801 T1400 oasc.SolrResourceLoader.locateSolrHome using system property solr.solr.home: /usr/home/hudson/hudson-slave/workspace/Lucene-Solr-Tests-4.x-java7/solr/build/solr-core/test-files/jetty2
[junit4:junit4]   2> 2802 T1400 oasc.SolrResourceLoader.<init> new SolrResourceLoader for deduced Solr Home: '/usr/home/hudson/hudson-slave/workspace/Lucene-Solr-Tests-4.x-java7/solr/build/solr-core/test-files/jetty2/'
[junit4:junit4]   2> 2865 T1400 oass.SolrDispatchFilter.init SolrDispatchFilter.init()
[junit4:junit4]   2> 2866 T1400 oasc.SolrResourceLoader.locateSolrHome JNDI not configured for solr (NoInitialContextEx)
[junit4:junit4]   2> 2867 T1400 oasc.SolrResourceLoader.locateSolrHome using system property solr.solr.home: /usr/home/hudson/hudson-slave/workspace/Lucene-Solr-Tests-4.x-java7/solr/build/solr-core/test-files/jetty2
[junit4:junit4]   2> 2867 T1400 oasc.CoreContainer$Initializer.initialize looking for solr.xml: /usr/home/hudson/hudson-slave/workspace/Lucene-Solr-Tests-4.x-java7/solr/build/solr-core/test-files/jetty2/solr.xml
[junit4:junit4]   2> 2868 T1400 oasc.CoreContainer.<init> New CoreContainer 1475347348
[junit4:junit4]   2> 2869 T1400 oasc.CoreContainer.load Loading CoreContainer using Solr Home: '/usr/home/hudson/hudson-slave/workspace/Lucene-Solr-Tests-4.x-java7/solr/build/solr-core/test-files/jetty2/'
[junit4:junit4]   2> 2869 T1400 oasc.SolrResourceLoader.<init> new SolrResourceLoader for directory: '/usr/home/hudson/hudson-slave/workspace/Lucene-Solr-Tests-4.x-java7/solr/build/solr-core/test-files/jetty2/'
[junit4:junit4]   2> 3009 T1400 oasc.CoreContainer.load Registering Log Listener
[junit4:junit4]   2> 3145 T1421 oascc.ZkStateReader.updateClusterState Updating cloud state from ZooKeeper... 
[junit4:junit4]   2> 3145 T1400 oasc.CoreContainer.initZooKeeper Zookeeper client=127.0.0.1:37623/solr
[junit4:junit4]   2> 3146 T1400 oaz.ZooKeeper.<init> Initiating client connection, connectString=127.0.0.1:37623/solr sessionTimeout=8000 watcher=org.apache.solr.common.cloud.ConnectionManager@64f3ab45
[junit4:junit4]   2> 3151 T1420 oascc.ZkStateReader$2.process A cluster state change has occurred - updating...
[junit4:junit4]   2> 3156 T1433 oaz.ClientCnxn$SendThread.startConnect Opening socket connection to server /127.0.0.1:37623
[junit4:junit4]   2> 3156 T1400 oascc.ConnectionManager.waitForConnected Waiting for client to connect to ZooKeeper
[junit4:junit4]   2> 3157 T1433 oaz.ClientCnxn$SendThread.primeConnection Socket connection established to localhost/127.0.0.1:37623, initiating session
[junit4:junit4]   2> 3157 T1402 oazs.NIOServerCnxn$Factory.run Accepted socket connection from /140.211.11.196:37652
[junit4:junit4]   2> 3158 T1402 oazs.NIOServerCnxn.readConnectRequest Client attempting to establish new session at /140.211.11.196:37652
[junit4:junit4]   2> 3165 T1404 oazs.NIOServerCnxn.finishSessionInit Established session 0x139995c51a00003 with negotiated timeout 8000 for client /140.211.11.196:37652
[junit4:junit4]   2> 3166 T1433 oaz.ClientCnxn$SendThread.readConnectResult Session establishment complete on server localhost/127.0.0.1:37623, sessionid = 0x139995c51a00003, negotiated timeout = 8000
[junit4:junit4]   2> 3166 T1434 oascc.ConnectionManager.process Watcher org.apache.solr.common.cloud.ConnectionManager@64f3ab45 name:ZooKeeperConnection Watcher:127.0.0.1:37623/solr got event WatchedEvent state:SyncConnected type:None path:null path:null type:None
[junit4:junit4]   2> 3166 T1400 oascc.ConnectionManager.waitForConnected Client is connected to ZooKeeper
[junit4:junit4]   2> 3167 T1405 oazs.PrepRequestProcessor.pRequest Got user-level KeeperException when processing sessionid:0x139995c51a00003 type:create cxid:0x1 zxid:0xfffffffffffffffe txntype:unknown reqpath:n/a Error Path:/solr/overseer Error:KeeperErrorCode = NodeExists for /solr/overseer
[junit4:junit4]   2> 3169 T1405 oazs.PrepRequestProcessor.pRequest Got user-level KeeperException when processing sessionid:0x139995c51a00003 type:create cxid:0x2 zxid:0xfffffffffffffffe txntype:unknown reqpath:n/a Error Path:/solr/overseer Error:KeeperErrorCode = NodeExists for /solr/overseer
[junit4:junit4]   2> 3176 T1400 oasc.ZkController.createEphemeralLiveNode Register node as live in ZooKeeper:/live_nodes/127.0.0.1:37651_solr
[junit4:junit4]   2> 3177 T1405 oazs.PrepRequestProcessor.pRequest Got user-level KeeperException when processing sessionid:0x139995c51a00003 type:delete cxid:0x4 zxid:0xfffffffffffffffe txntype:unknown reqpath:n/a Error Path:/solr/live_nodes/127.0.0.1:37651_solr Error:KeeperErrorCode = NoNode for /solr/live_nodes/127.0.0.1:37651_solr
[junit4:junit4]   2> 3178 T1400 oascc.SolrZkClient.makePath makePath: /live_nodes/127.0.0.1:37651_solr
[junit4:junit4]   2> 3180 T1420 oascc.ZkStateReader$3.process Updating live nodes
[junit4:junit4]   2> 3181 T1400 oashc.HttpShardHandlerFactory.getParameter Setting socketTimeout to: 0
[junit4:junit4]   2> 3182 T1400 oashc.HttpShardHandlerFactory.getParameter Setting urlScheme to: http://
[junit4:junit4]   2> 3182 T1400 oashc.HttpShardHandlerFactory.getParameter Setting connTimeout to: 0
[junit4:junit4]   2> 3182 T1400 oashc.HttpShardHandlerFactory.getParameter Setting maxConnectionsPerHost to: 20
[junit4:junit4]   2> 3183 T1400 oashc.HttpShardHandlerFactory.getParameter Setting corePoolSize to: 0
[junit4:junit4]   2> 3183 T1400 oashc.HttpShardHandlerFactory.getParameter Setting maximumPoolSize to: 2147483647
[junit4:junit4]   2> 3183 T1400 oashc.HttpShardHandlerFactory.getParameter Setting maxThreadIdleTime to: 5
[junit4:junit4]   2> 3184 T1400 oashc.HttpShardHandlerFactory.getParameter Setting sizeOfQueue to: -1
[junit4:junit4]   2> 3184 T1400 oashc.HttpShardHandlerFactory.getParameter Setting fairnessPolicy to: false
[junit4:junit4]   2> 3185 T1400 oascsi.HttpClientUtil.createClient Creating new http client, config:maxConnectionsPerHost=20&maxConnections=10000&socketTimeout=0&connTimeout=0&retry=false
[junit4:junit4]   2> 3206 T1400 oascc.ZkStateReader.createClusterStateWatchersAndUpdate Updating cluster state from ZooKeeper... 
[junit4:junit4]   2> 3216 T1400 oasc.CoreContainer.create Creating SolrCore 'collection1' using instanceDir: /usr/home/hudson/hudson-slave/workspace/Lucene-Solr-Tests-4.x-java7/solr/build/solr-core/test-files/jetty2/collection1
[junit4:junit4]   2> 3216 T1400 oasc.ZkController.createCollectionZkNode Check for collection zkNode:collection1
[junit4:junit4]   2> 3225 T1400 oasc.ZkController.createCollectionZkNode Collection zkNode exists
[junit4:junit4]   2> 3226 T1400 oasc.ZkController.readConfigName Load collection config from:/collections/collection1
[junit4:junit4]   2> 3235 T1400 oasc.SolrResourceLoader.<init> new SolrResourceLoader for directory: '/usr/home/hudson/hudson-slave/workspace/Lucene-Solr-Tests-4.x-java7/solr/build/solr-core/test-files/jetty2/collection1/'
[junit4:junit4]   2> 3236 T1400 oasc.SolrResourceLoader.replaceClassLoader Adding 'file:/usr/home/hudson/hudson-slave/workspace/Lucene-Solr-Tests-4.x-java7/solr/build/solr-core/test-files/jetty2/collection1/lib/README' to classloader
[junit4:junit4]   2> 3237 T1400 oasc.SolrResourceLoader.replaceClassLoader Adding 'file:/usr/home/hudson/hudson-slave/workspace/Lucene-Solr-Tests-4.x-java7/solr/build/solr-core/test-files/jetty2/collection1/lib/classes/' to classloader
[junit4:junit4]   2> 3323 T1400 oasc.SolrConfig.<init> Using Lucene MatchVersion: LUCENE_40
[junit4:junit4]   2> 3419 T1400 oasc.SolrConfig.<init> Loaded SolrConfig: solrconfig.xml
[junit4:junit4]   2> 3521 T1400 oass.IndexSchema.readSchema Reading Solr Schema
[junit4:junit4]   2> 3531 T1400 oass.IndexSchema.readSchema Schema name=test
[junit4:junit4]   2> 4629 T1400 oass.OpenExchangeRatesOrgProvider.init Initialized with rates=open-exchange-rates.json, refreshInterval=1440.
[junit4:junit4]   2> 4649 T1400 oass.IndexSchema.readSchema default search field in schema is text
[junit4:junit4]   2> 4657 T1400 oass.IndexSchema.readSchema unique key field: id
[junit4:junit4]   2> 4677 T1400 oass.FileExchangeRateProvider.reload Reloading exchange rates from file currency.xml
[junit4:junit4]   2> 4685 T1400 oass.FileExchangeRateProvider.reload Reloading exchange rates from file currency.xml
[junit4:junit4]   2> 4694 T1400 oass.OpenExchangeRatesOrgProvider.reload Reloading exchange rates from open-exchange-rates.json
[junit4:junit4]   2> 4696 T1400 oass.OpenExchangeRatesOrgProvider.reload Reloading exchange rates from open-exchange-rates.json
[junit4:junit4]   2> 4698 T1400 oasc.SolrCore.<init> [collection1] Opening new SolrCore at /usr/home/hudson/hudson-slave/workspace/Lucene-Solr-Tests-4.x-java7/solr/build/solr-core/test-files/jetty2/collection1/, dataDir=/usr/home/hudson/hudson-slave/workspace/Lucene-Solr-Tests-4.x-java7/solr/build/solr-core/test-files/jetty2/collection1/data/
[junit4:junit4]   2> 4699 T1400 oasc.JmxMonitoredMap.<init> JMX monitoring is enabled. Adding Solr mbeans to JMX Server: com.sun.jmx.mbeanserver.JmxMBeanServer@41a33efb
[junit4:junit4]   2> 4701 T1400 oasc.SolrCore.getNewIndexDir WARNING New index directory detected: old=null new=/usr/home/hudson/hudson-slave/workspace/Lucene-Solr-Tests-4.x-java7/solr/build/solr-core/test-files/jetty2/collection1/data/index/
[junit4:junit4]   2> 4703 T1400 oasc.SolrCore.initIndex WARNING [collection1] Solr index directory '/usr/home/hudson/hudson-slave/workspace/Lucene-Solr-Tests-4.x-java7/solr/build/solr-core/test-files/jetty2/collection1/data/index' doesn't exist. Creating new index...
[junit4:junit4]   2> 4704 T1400 oasc.CachingDirectoryFactory.get return new directory for /usr/home/hudson/hudson-slave/workspace/Lucene-Solr-Tests-4.x-java7/solr/build/solr-core/test-files/jetty2/collection1/data/index forceNew:false
[junit4:junit4]   2> 4738 T1400 oasc.SolrDeletionPolicy.onCommit SolrDeletionPolicy.onCommit: commits:num=1
[junit4:junit4]   2> 		commit{dir=NRTCachingDirectory(org.apache.lucene.store.NIOFSDirectory@/usr/home/hudson/hudson-slave/workspace/Lucene-Solr-Tests-4.x-java7/solr/build/solr-core/test-files/jetty2/collection1/data/index lockFactory=org.apache.lucene.store.NativeFSLockFactory@4e12fc8; maxCacheMB=48.0 maxMergeSizeMB=4.0),segFN=segments_1,generation=1,filenames=[segments_1]
[junit4:junit4]   2> 4740 T1400 oasc.SolrDeletionPolicy.updateCommits newest commit = 1
[junit4:junit4]   2> 4742 T1400 oasc.SolrCore.initWriters created xml: solr.XMLResponseWriter
[junit4:junit4]   2> 4746 T1400 oasup.UpdateRequestProcessorChain.init inserting DistributedUpdateProcessorFactory into updateRequestProcessorChain "dedupe"
[junit4:junit4]   2> 4747 T1400 oasup.UpdateRequestProcessorChain.init inserting DistributedUpdateProcessorFactory into updateRequestProcessorChain "dedupe-allfields"
[junit4:junit4]   2> 4748 T1400 oasup.UpdateRequestProcessorChain.init inserting DistributedUpdateProcessorFactory into updateRequestProcessorChain "stored_sig"
[junit4:junit4]   2> 4749 T1400 oasup.UpdateRequestProcessorChain.init inserting DistributedUpdateProcessorFactory into updateRequestProcessorChain "uniq-fields"
[junit4:junit4]   2> 4751 T1400 oasup.UpdateRequestProcessorChain.init inserting DistributedUpdateProcessorFactory into updateRequestProcessorChain "distrib-dup-test-chain-implicit"
[junit4:junit4]   2> 4752 T1400 oasc.RequestHandlers.initHandlersFromConfig adding lazy requestHandler: solr.ReplicationHandler
[junit4:junit4]   2> 4753 T1400 oasc.RequestHandlers.initHandlersFromConfig created /replication: solr.ReplicationHandler
[junit4:junit4]   2> 4754 T1400 oasc.RequestHandlers.initHandlersFromConfig created standard: solr.StandardRequestHandler
[junit4:junit4]   2> 4755 T1400 oasc.RequestHandlers.initHandlersFromConfig created /get: solr.RealTimeGetHandler
[junit4:junit4]   2> 4757 T1400 oasc.RequestHandlers.initHandlersFromConfig created dismax: solr.SearchHandler
[junit4:junit4]   2> 4758 T1400 oasc.RequestHandlers.initHandlersFromConfig created mock: org.apache.solr.core.MockQuerySenderListenerReqHandler
[junit4:junit4]   2> 4759 T1400 oasc.RequestHandlers.initHandlersFromConfig created /admin/: org.apache.solr.handler.admin.AdminHandlers
[junit4:junit4]   2> 4760 T1400 oasc.RequestHandlers.initHandlersFromConfig created defaults: solr.StandardRequestHandler
[junit4:junit4]   2> 4761 T1400 oasc.RequestHandlers.initHandlersFromConfig adding lazy requestHandler: solr.StandardRequestHandler
[junit4:junit4]   2> 4762 T1400 oasc.RequestHandlers.initHandlersFromConfig created lazy: solr.StandardRequestHandler
[junit4:junit4]   2> 4764 T1400 oasc.RequestHandlers.initHandlersFromConfig created /update: solr.UpdateRequestHandler
[junit4:junit4]   2> 4765 T1400 oasc.RequestHandlers.initHandlersFromConfig created /terms: org.apache.solr.handler.component.SearchHandler
[junit4:junit4]   2> 4766 T1400 oasc.RequestHandlers.initHandlersFromConfig created spellCheckCompRH: org.apache.solr.handler.component.SearchHandler
[junit4:junit4]   2> 4767 T1400 oasc.RequestHandlers.initHandlersFromConfig created spellCheckCompRH_Direct: org.apache.solr.handler.component.SearchHandler
[junit4:junit4]   2> 4768 T1400 oasc.RequestHandlers.initHandlersFromConfig created spellCheckWithWordbreak: org.apache.solr.handler.component.SearchHandler
[junit4:junit4]   2> 4770 T1400 oasc.RequestHandlers.initHandlersFromConfig created spellCheckWithWordbreak_Direct: org.apache.solr.handler.component.SearchHandler
[junit4:junit4]   2> 4771 T1400 oasc.RequestHandlers.initHandlersFromConfig created spellCheckCompRH1: org.apache.solr.handler.component.SearchHandler
[junit4:junit4]   2> 4772 T1400 oasc.RequestHandlers.initHandlersFromConfig created tvrh: org.apache.solr.handler.component.SearchHandler
[junit4:junit4]   2> 4773 T1400 oasc.RequestHandlers.initHandlersFromConfig created /mlt: solr.MoreLikeThisHandler
[junit4:junit4]   2> 4775 T1400 oasc.RequestHandlers.initHandlersFromConfig created /debug/dump: solr.DumpRequestHandler
[junit4:junit4]   2> 4781 T1400 oashl.XMLLoader.init xsltCacheLifetimeSeconds=60
[junit4:junit4]   2> 4790 T1400 oasc.SolrCore.initDeprecatedSupport WARNING solrconfig.xml uses deprecated <admin/gettableFiles>, Please update your config to use the ShowFileRequestHandler.
[junit4:junit4]   2> 4792 T1400 oasc.SolrCore.initDeprecatedSupport WARNING adding ShowFileRequestHandler with hidden files: [SCHEMA.XML, OLD_SYNONYMS.TXT, STOPWORDS.TXT, PROTWORDS.TXT, OPEN-EXCHANGE-RATES.JSON, SYNONYMS.TXT, CURRENCY.XML, MAPPING-ISOLATIN1ACCENT.TXT]
[junit4:junit4]   2> 4799 T1400 oass.SolrIndexSearcher.<init> Opening Searcher@62ea5e6 main
[junit4:junit4]   2> 4802 T1400 oasu.CommitTracker.<init> Hard AutoCommit: disabled
[junit4:junit4]   2> 4803 T1400 oasu.CommitTracker.<init> Soft AutoCommit: disabled
[junit4:junit4]   2> 4804 T1400 oashc.SpellCheckComponent.inform Initializing spell checkers
[junit4:junit4]   2> 4809 T1400 oass.DirectSolrSpellChecker.init init: {name=direct,classname=DirectSolrSpellChecker,field=lowerfilt,minQueryLength=3}
[junit4:junit4]   2> 4835 T1435 oasc.SolrCore.registerSearcher [collection1] Registered new searcher Searcher@62ea5e6 main{StandardDirectoryReader(segments_1:1)}
[junit4:junit4]   2> 4848 T1400 oasc.CoreContainer.register registering core: collection1
[junit4:junit4]   2> 4849 T1400 oasc.ZkController.register Register shard - core:collection1 address:http://127.0.0.1:37651/solr shardId:shard3
[junit4:junit4]   2> 4850 T1400 oascc.SolrZkClient.makePath makePath: /collections/collection1/leader_elect/shard3/election
[junit4:junit4]   2> 5156 T1405 oazs.PrepRequestProcessor.pRequest Got user-level KeeperException when processing sessionid:0x139995c51a00003 type:delete cxid:0x41 zxid:0xfffffffffffffffe txntype:unknown reqpath:n/a Error Path:/solr/collections/collection1/leaders Error:KeeperErrorCode = NoNode for /solr/collections/collection1/leaders
[junit4:junit4]   2> 5158 T1400 oasc.ShardLeaderElectionContext.runLeaderProcess Running the leader process. afterExpiration=false
[junit4:junit4]   2> 5160 T1405 oazs.PrepRequestProcessor.pRequest Got user-level KeeperException when processing sessionid:0x139995c51a00003 type:create cxid:0x42 zxid:0xfffffffffffffffe txntype:unknown reqpath:n/a Error Path:/solr/overseer Error:KeeperErrorCode = NodeExists for /solr/overseer
[junit4:junit4]   2> 5178 T1421 oascc.ZkStateReader.updateClusterState Updating cloud state from ZooKeeper... 
[junit4:junit4]   2> 5177 T1400 oasc.ShardLeaderElectionContext.runLeaderProcess I am the new leader: http://127.0.0.1:37651/solr/collection1/
[junit4:junit4]   2> 5179 T1400 oascc.SolrZkClient.makePath makePath: /collections/collection1/leaders/shard3
[junit4:junit4]   2> 5199 T1405 oazs.PrepRequestProcessor.pRequest Got user-level KeeperException when processing sessionid:0x139995c51a00003 type:create cxid:0x4b zxid:0xfffffffffffffffe txntype:unknown reqpath:n/a Error Path:/solr/overseer Error:KeeperErrorCode = NodeExists for /solr/overseer
[junit4:junit4]   2> 5205 T1434 oascc.ZkStateReader$2.process A cluster state change has occurred - updating...
[junit4:junit4]   2> 5205 T1420 oascc.ZkStateReader$2.process A cluster state change has occurred - updating...
[junit4:junit4]   2> 5252 T1400 oasc.ZkController.register We are http://127.0.0.1:37651/solr/collection1/ and leader is http://127.0.0.1:37651/solr/collection1/
[junit4:junit4]   2> 5253 T1400 oasc.ZkController.register No LogReplay needed for core=collection1 baseURL=http://127.0.0.1:37651/solr
[junit4:junit4]   2> 5253 T1400 oasc.ZkController.checkRecovery I am the leader, no recovery necessary
[junit4:junit4]   2> 5255 T1400 oascc.ZkStateReader.updateClusterState Updating cloud state from ZooKeeper... 
[junit4:junit4]   2> 5257 T1400 oass.SolrDispatchFilter.init user.dir=/usr/home/hudson/hudson-slave/workspace/Lucene-Solr-Tests-4.x-java7/solr/build/solr-core/test/J1
[junit4:junit4]   2> 5257 T1400 oass.SolrDispatchFilter.init SolrDispatchFilter.init() done
[junit4:junit4]   2> 5258 T1400 oascsi.HttpClientUtil.createClient Creating new http client, config:maxConnections=128&maxConnectionsPerHost=32&followRedirects=false
[junit4:junit4]   2> 5498 T1400 oejs.Server.doStart jetty-8.1.2.v20120308
[junit4:junit4]   2> 5502 T1400 oejs.AbstractConnector.doStart Started SocketConnector@0.0.0.0:37653
[junit4:junit4]   2> 5503 T1400 oasc.SolrResourceLoader.locateSolrHome JNDI not configured for solr (NoInitialContextEx)
[junit4:junit4]   2> 5503 T1400 oasc.SolrResourceLoader.locateSolrHome using system property solr.solr.home: /usr/home/hudson/hudson-slave/workspace/Lucene-Solr-Tests-4.x-java7/solr/build/solr-core/test-files/jetty3
[junit4:junit4]   2> 5504 T1400 oasc.SolrResourceLoader.<init> new SolrResourceLoader for deduced Solr Home: '/usr/home/hudson/hudson-slave/workspace/Lucene-Solr-Tests-4.x-java7/solr/build/solr-core/test-files/jetty3/'
[junit4:junit4]   2> 5538 T1400 oass.SolrDispatchFilter.init SolrDispatchFilter.init()
[junit4:junit4]   2> 5539 T1400 oasc.SolrResourceLoader.locateSolrHome JNDI not configured for solr (NoInitialContextEx)
[junit4:junit4]   2> 5539 T1400 oasc.SolrResourceLoader.locateSolrHome using system property solr.solr.home: /usr/home/hudson/hudson-slave/workspace/Lucene-Solr-Tests-4.x-java7/solr/build/solr-core/test-files/jetty3
[junit4:junit4]   2> 5539 T1400 oasc.CoreContainer$Initializer.initialize looking for solr.xml: /usr/home/hudson/hudson-slave/workspace/Lucene-Solr-Tests-4.x-java7/solr/build/solr-core/test-files/jetty3/solr.xml
[junit4:junit4]   2> 5540 T1400 oasc.CoreContainer.<init> New CoreContainer 1104401363
[junit4:junit4]   2> 5540 T1400 oasc.CoreContainer.load Loading CoreContainer using Solr Home: '/usr/home/hudson/hudson-slave/workspace/Lucene-Solr-Tests-4.x-java7/solr/build/solr-core/test-files/jetty3/'
[junit4:junit4]   2> 5541 T1400 oasc.SolrResourceLoader.<init> new SolrResourceLoader for directory: '/usr/home/hudson/hudson-slave/workspace/Lucene-Solr-Tests-4.x-java7/solr/build/solr-core/test-files/jetty3/'
[junit4:junit4]   2> 5566 T1400 oasc.CoreContainer.load Registering Log Listener
[junit4:junit4]   2> 5577 T1400 oasc.CoreContainer.initZooKeeper Zookeeper client=127.0.0.1:37623/solr
[junit4:junit4]   2> 5578 T1400 oaz.ZooKeeper.<init> Initiating client connection, connectString=127.0.0.1:37623/solr sessionTimeout=8000 watcher=org.apache.solr.common.cloud.ConnectionManager@40177f14
[junit4:junit4]   2> 5579 T1445 oaz.ClientCnxn$SendThread.startConnect Opening socket connection to server /127.0.0.1:37623
[junit4:junit4]   2> 5579 T1400 oascc.ConnectionManager.waitForConnected Waiting for client to connect to ZooKeeper
[junit4:junit4]   2> 5580 T1445 oaz.ClientCnxn$SendThread.primeConnection Socket connection established to localhost/127.0.0.1:37623, initiating session
[junit4:junit4]   2> 5580 T1402 oazs.NIOServerCnxn$Factory.run Accepted socket connection from /140.211.11.196:37654
[junit4:junit4]   2> 5581 T1402 oazs.NIOServerCnxn.readConnectRequest Client attempting to establish new session at /140.211.11.196:37654
[junit4:junit4]   2> 5583 T1404 oazs.NIOServerCnxn.finishSessionInit Established session 0x139995c51a00004 with negotiated timeout 8000 for client /140.211.11.196:37654
[junit4:junit4]   2> 5583 T1445 oaz.ClientCnxn$SendThread.readConnectResult Session establishment complete on server localhost/127.0.0.1:37623, sessionid = 0x139995c51a00004, negotiated timeout = 8000
[junit4:junit4]   2> 5583 T1446 oascc.ConnectionManager.process Watcher org.apache.solr.common.cloud.ConnectionManager@40177f14 name:ZooKeeperConnection Watcher:127.0.0.1:37623/solr got event WatchedEvent state:SyncConnected type:None path:null path:null type:None
[junit4:junit4]   2> 5583 T1400 oascc.ConnectionManager.waitForConnected Client is connected to ZooKeeper
[junit4:junit4]   2> 5584 T1405 oazs.PrepRequestProcessor.pRequest Got user-level KeeperException when processing sessionid:0x139995c51a00004 type:create cxid:0x1 zxid:0xfffffffffffffffe txntype:unknown reqpath:n/a Error Path:/solr/overseer Error:KeeperErrorCode = NodeExists for /solr/overseer
[junit4:junit4]   2> 5595 T1405 oazs.PrepRequestProcessor.pRequest Got user-level KeeperException when processing sessionid:0x139995c51a00004 type:create cxid:0x2 zxid:0xfffffffffffffffe txntype:unknown reqpath:n/a Error Path:/solr/overseer Error:KeeperErrorCode = NodeExists for /solr/overseer
[junit4:junit4]   2> 5597 T1400 oasc.ZkController.createEphemeralLiveNode Register node as live in ZooKeeper:/live_nodes/127.0.0.1:37653_solr
[junit4:junit4]   2> 5597 T1405 oazs.PrepRequestProcessor.pRequest Got user-level KeeperException when processing sessionid:0x139995c51a00004 type:delete cxid:0x4 zxid:0xfffffffffffffffe txntype:unknown reqpath:n/a Error Path:/solr/live_nodes/127.0.0.1:37653_solr Error:KeeperErrorCode = NoNode for /solr/live_nodes/127.0.0.1:37653_solr
[junit4:junit4]   2> 5598 T1400 oascc.SolrZkClient.makePath makePath: /live_nodes/127.0.0.1:37653_solr
[junit4:junit4]   2> 5605 T1434 oascc.ZkStateReader$3.process Updating live nodes
[junit4:junit4]   2> 5605 T1420 oascc.ZkStateReader$3.process Updating live nodes
[junit4:junit4]   2> 5607 T1400 oashc.HttpShardHandlerFactory.getParameter Setting socketTimeout to: 0
[junit4:junit4]   2> 5607 T1400 oashc.HttpShardHandlerFactory.getParameter Setting urlScheme to: http://
[junit4:junit4]   2> 5608 T1400 oashc.HttpShardHandlerFactory.getParameter Setting connTimeout to: 0
[junit4:junit4]   2> 5609 T1400 oashc.HttpShardHandlerFactory.getParameter Setting maxConnectionsPerHost to: 20
[junit4:junit4]   2> 5609 T1400 oashc.HttpShardHandlerFactory.getParameter Setting corePoolSize to: 0
[junit4:junit4]   2> 5609 T1400 oashc.HttpShardHandlerFactory.getParameter Setting maximumPoolSize to: 2147483647
[junit4:junit4]   2> 5610 T1400 oashc.HttpShardHandlerFactory.getParameter Setting maxThreadIdleTime to: 5
[junit4:junit4]   2> 5610 T1400 oashc.HttpShardHandlerFactory.getParameter Setting sizeOfQueue to: -1
[junit4:junit4]   2> 5610 T1400 oashc.HttpShardHandlerFactory.getParameter Setting fairnessPolicy to: false
[junit4:junit4]   2> 5611 T1400 oascsi.HttpClientUtil.createClient Creating new http client, config:maxConnectionsPerHost=20&maxConnections=10000&socketTimeout=0&connTimeout=0&retry=false
[junit4:junit4]   2> 5624 T1400 oascc.ZkStateReader.createClusterStateWatchersAndUpdate Updating cluster state from ZooKeeper... 
[junit4:junit4]   2> 5630 T1400 oasc.CoreContainer.create Creating SolrCore 'collection1' using instanceDir: /usr/home/hudson/hudson-slave/workspace/Lucene-Solr-Tests-4.x-java7/solr/build/solr-core/test-files/jetty3/collection1
[junit4:junit4]   2> 5631 T1400 oasc.ZkController.createCollectionZkNode Check for collection zkNode:collection1
[junit4:junit4]   2> 5631 T1400 oasc.ZkController.createCollectionZkNode Collection zkNode exists
[junit4:junit4]   2> 5632 T1400 oasc.ZkController.readConfigName Load collection config from:/collections/collection1
[junit4:junit4]   2> 5633 T1400 oasc.SolrResourceLoader.<init> new SolrResourceLoader for directory: '/usr/home/hudson/hudson-slave/workspace/Lucene-Solr-Tests-4.x-java7/solr/build/solr-core/test-files/jetty3/collection1/'
[junit4:junit4]   2> 5634 T1400 oasc.SolrResourceLoader.replaceClassLoader Adding 'file:/usr/home/hudson/hudson-slave/workspace/Lucene-Solr-Tests-4.x-java7/solr/build/solr-core/test-files/jetty3/collection1/lib/classes/' to classloader
[junit4:junit4]   2> 5634 T1400 oasc.SolrResourceLoader.replaceClassLoader Adding 'file:/usr/home/hudson/hudson-slave/workspace/Lucene-Solr-Tests-4.x-java7/solr/build/solr-core/test-files/jetty3/collection1/lib/README' to classloader
[junit4:junit4]   2> 5678 T1400 oasc.SolrConfig.<init> Using Lucene MatchVersion: LUCENE_40
[junit4:junit4]   2> 5711 T1421 oascc.ZkStateReader.updateClusterState Updating cloud state from ZooKeeper... 
[junit4:junit4]   2> 5726 T1420 oascc.ZkStateReader$2.process A cluster state change has occurred - updating...
[junit4:junit4]   2> 5726 T1434 oascc.ZkStateReader$2.process A cluster state change has occurred - updating...
[junit4:junit4]   2> 5726 T1446 oascc.ZkStateReader$2.process A cluster state change has occurred - updating...
[junit4:junit4]   2> 5754 T1400 oasc.SolrConfig.<init> Loaded SolrConfig: solrconfig.xml
[junit4:junit4]   2> 5856 T1400 oass.IndexSchema.readSchema Reading Solr Schema
[junit4:junit4]   2> 5864 T1400 oass.IndexSchema.readSchema Schema name=test
[junit4:junit4]   2> 6836 T1400 oass.OpenExchangeRatesOrgProvider.init Initialized with rates=open-exchange-rates.json, refreshInterval=1440.
[junit4:junit4]   2> 6851 T1400 oass.IndexSchema.readSchema default search field in schema is text
[junit4:junit4]   2> 6857 T1400 oass.IndexSchema.readSchema unique key field: id
[junit4:junit4]   2> 6872 T1400 oass.FileExchangeRateProvider.reload Reloading exchange rates from file currency.xml
[junit4:junit4]   2> 6879 T1400 oass.FileExchangeRateProvider.reload Reloading exchange rates from file currency.xml
[junit4:junit4]   2> 6887 T1400 oass.OpenExchangeRatesOrgProvider.reload Reloading exchange rates from open-exchange-rates.json
[junit4:junit4]   2> 6889 T1400 oass.OpenExchangeRatesOrgProvider.reload Reloading exchange rates from open-exchange-rates.json
[junit4:junit4]   2> 6925 T1400 oasc.SolrCore.<init> [collection1] Opening new SolrCore at /usr/home/hudson/hudson-slave/workspace/Lucene-Solr-Tests-4.x-java7/solr/build/solr-core/test-files/jetty3/collection1/, dataDir=/usr/home/hudson/hudson-slave/workspace/Lucene-Solr-Tests-4.x-java7/solr/build/solr-core/test-files/jetty3/collection1/data/
[junit4:junit4]   2> 6927 T1400 oasc.JmxMonitoredMap.<init> JMX monitoring is enabled. Adding Solr mbeans to JMX Server: com.sun.jmx.mbeanserver.JmxMBeanServer@41a33efb
[junit4:junit4]   2> 6928 T1400 oasc.SolrCore.getNewIndexDir WARNING New index directory detected: old=null new=/usr/home/hudson/hudson-slave/workspace/Lucene-Solr-Tests-4.x-java7/solr/build/solr-core/test-files/jetty3/collection1/data/index/
[junit4:junit4]   2> 6929 T1400 oasc.SolrCore.initIndex WARNING [collection1] Solr index directory '/usr/home/hudson/hudson-slave/workspace/Lucene-Solr-Tests-4.x-java7/solr/build/solr-core/test-files/jetty3/collection1/data/index' doesn't exist. Creating new index...
[junit4:junit4]   2> 6930 T1400 oasc.CachingDirectoryFactory.get return new directory for /usr/home/hudson/hudson-slave/workspace/Lucene-Solr-Tests-4.x-java7/solr/build/solr-core/test-files/jetty3/collection1/data/index forceNew:false
[junit4:junit4]   2> 6951 T1400 oasc.SolrDeletionPolicy.onCommit SolrDeletionPolicy.onCommit: commits:num=1
[junit4:junit4]   2> 		commit{dir=NRTCachingDirectory(org.apache.lucene.store.NIOFSDirectory@/usr/home/hudson/hudson-slave/workspace/Lucene-Solr-Tests-4.x-java7/solr/build/solr-core/test-files/jetty3/collection1/data/index lockFactory=org.apache.lucene.store.NativeFSLockFactory@5dac7392; maxCacheMB=48.0 maxMergeSizeMB=4.0),segFN=segments_1,generation=1,filenames=[segments_1]
[junit4:junit4]   2> 6952 T1400 oasc.SolrDeletionPolicy.updateCommits newest commit = 1
[junit4:junit4]   2> 6953 T1400 oasc.SolrCore.initWriters created xml: solr.XMLResponseWriter
[junit4:junit4]   2> 6956 T1400 oasup.UpdateRequestProcessorChain.init inserting DistributedUpdateProcessorFactory into updateRequestProcessorChain "dedupe"
[junit4:junit4]   2> 6957 T1400 oasup.UpdateRequestProcessorChain.init inserting DistributedUpdateProcessorFactory into updateRequestProcessorChain "dedupe-allfields"
[junit4:junit4]   2> 6958 T1400 oasup.UpdateRequestProcessorChain.init inserting DistributedUpdateProcessorFactory into updateRequestProcessorChain "stored_sig"
[junit4:junit4]   2> 6959 T1400 oasup.UpdateRequestProcessorChain.init inserting DistributedUpdateProcessorFactory into updateRequestProcessorChain "uniq-fields"
[junit4:junit4]   2> 6960 T1400 oasup.UpdateRequestProcessorChain.init inserting DistributedUpdateProcessorFactory into updateRequestProcessorChain "distrib-dup-test-chain-implicit"
[junit4:junit4]   2> 6960 T1400 oasc.RequestHandlers.initHandlersFromConfig adding lazy requestHandler: solr.ReplicationHandler
[junit4:junit4]   2> 6961 T1400 oasc.RequestHandlers.initHandlersFromConfig created /replication: solr.ReplicationHandler
[junit4:junit4]   2> 6962 T1400 oasc.RequestHandlers.initHandlersFromConfig created standard: solr.StandardRequestHandler
[junit4:junit4]   2> 6963 T1400 oasc.RequestHandlers.initHandlersFromConfig created /get: solr.RealTimeGetHandler
[junit4:junit4]   2> 6963 T1400 oasc.RequestHandlers.initHandlersFromConfig created dismax: solr.SearchHandler
[junit4:junit4]   2> 6964 T1400 oasc.RequestHandlers.initHandlersFromConfig created mock: org.apache.solr.core.MockQuerySenderListenerReqHandler
[junit4:junit4]   2> 6965 T1400 oasc.RequestHandlers.initHandlersFromConfig created /admin/: org.apache.solr.handler.admin.AdminHandlers
[junit4:junit4]   2> 6966 T1400 oasc.RequestHandlers.initHandlersFromConfig created defaults: solr.StandardRequestHandler
[junit4:junit4]   2> 6966 T1400 oasc.RequestHandlers.initHandlersFromConfig adding lazy requestHandler: solr.StandardRequestHandler
[junit4:junit4]   2> 6967 T1400 oasc.RequestHandlers.initHandlersFromConfig created lazy: solr.StandardRequestHandler
[junit4:junit4]   2> 6968 T1400 oasc.RequestHandlers.initHandlersFromConfig created /update: solr.UpdateRequestHandler
[junit4:junit4]   2> 6969 T1400 oasc.RequestHandlers.initHandlersFromConfig created /terms: org.apache.solr.handler.component.SearchHandler
[junit4:junit4]   2> 6969 T1400 oasc.RequestHandlers.initHandlersFromConfig created spellCheckCompRH: org.apache.solr.handler.component.SearchHandler
[junit4:junit4]   2> 6970 T1400 oasc.RequestHandlers.initHandlersFromConfig created spellCheckCompRH_Direct: org.apache.solr.handler.component.SearchHandler
[junit4:junit4]   2> 6971 T1400 oasc.RequestHandlers.initHandlersFromConfig created spellCheckWithWordbreak: org.apache.solr.handler.component.SearchHandler
[junit4:junit4]   2> 6972 T1400 oasc.RequestHandlers.initHandlersFromConfig created spellCheckWithWordbreak_Direct: org.apache.solr.handler.component.SearchHandler
[junit4:junit4]   2> 6972 T1400 oasc.RequestHandlers.initHandlersFromConfig created spellCheckCompRH1: org.apache.solr.handler.component.SearchHandler
[junit4:junit4]   2> 6973 T1400 oasc.RequestHandlers.initHandlersFromConfig created tvrh: org.apache.solr.handler.component.SearchHandler
[junit4:junit4]   2> 6974 T1400 oasc.RequestHandlers.initHandlersFromConfig created /mlt: solr.MoreLikeThisHandler
[junit4:junit4]   2> 6975 T1400 oasc.RequestHandlers.initHandlersFromConfig created /debug/dump: solr.DumpRequestHandler
[junit4:junit4]   2> 6979 T1400 oashl.XMLLoader.init xsltCacheLifetimeSeconds=60
[junit4:junit4]   2> 6985 T1400 oasc.SolrCore.initDeprecatedSupport WARNING solrconfig.xml uses deprecated <admin/gettableFiles>, Please update your config to use the ShowFileRequestHandler.
[junit4:junit4]   2> 6987 T1400 oasc.SolrCore.initDeprecatedSupport WARNING adding ShowFileRequestHandler with hidden files: [SCHEMA.XML, OLD_SYNONYMS.TXT, STOPWORDS.TXT, PROTWORDS.TXT, OPEN-EXCHANGE-RATES.JSON, SYNONYMS.TXT, CURRENCY.XML, MAPPING-ISOLATIN1ACCENT.TXT]
[junit4:junit4]   2> 6992 T1400 oass.SolrIndexSearcher.<init> Opening Searcher@4b483c14 main
[junit4:junit4]   2> 6994 T1400 oasu.CommitTracker.<init> Hard AutoCommit: disabled
[junit4:junit4]   2> 6995 T1400 oasu.CommitTracker.<init> Soft AutoCommit: disabled
[junit4:junit4]   2> 6996 T1400 oashc.SpellCheckComponent.inform Initializing spell checkers
[junit4:junit4]   2> 6999 T1400 oass.DirectSolrSpellChecker.init init: {name=direct,classname=DirectSolrSpellChecker,field=lowerfilt,minQueryLength=3}
[junit4:junit4]   2> 7018 T1447 oasc.SolrCore.registerSearcher [collection1] Registered new searcher Searcher@4b483c14 main{StandardDirectoryReader(segments_1:1)}
[junit4:junit4]   2> 7027 T1400 oasc.CoreContainer.register registering core: collection1
[junit4:junit4]   2> 7028 T1400 oasc.ZkController.register Register shard - core:collection1 address:http://127.0.0.1:37653/solr shardId:shard4
[junit4:junit4]   2> 7030 T1400 oascc.SolrZkClient.makePath makePath: /collections/collection1/leader_elect/shard4/election
[junit4:junit4]   2> 7043 T1405 oazs.PrepRequestProcessor.pRequest Got user-level KeeperException when processing sessionid:0x139995c51a00004 type:delete cxid:0x41 zxid:0xfffffffffffffffe txntype:unknown reqpath:n/a Error Path:/solr/collections/collection1/leaders/shard4 Error:KeeperErrorCode = NoNode for /solr/collections/collection1/leaders/shard4
[junit4:junit4]   2> 7044 T1400 oasc.ShardLeaderElectionContext.runLeaderProcess Running the leader process. afterExpiration=false
[junit4:junit4]   2> 7046 T1405 oazs.PrepRequestProcessor.pRequest Got user-level KeeperException when processing sessionid:0x139995c51a00004 type:create cxid:0x42 zxid:0xfffffffffffffffe txntype:unknown reqpath:n/a Error Path:/solr/overseer Error:KeeperErrorCode = NodeExists for /solr/overseer
[junit4:junit4]   2> 7054 T1400 oasc.ShardLeaderElectionContext.runLeaderProcess I am the new leader: http://127.0.0.1:37653/solr/collection1/
[junit4:junit4]   2> 7055 T1400 oascc.SolrZkClient.makePath makePath: /collections/collection1/leaders/shard4
[junit4:junit4]   2> 7058 T1405 oazs.PrepRequestProcessor.pRequest Got user-level KeeperException when processing sessionid:0x139995c51a00004 type:create cxid:0x4a zxid:0xfffffffffffffffe txntype:unknown reqpath:n/a Error Path:/solr/overseer Error:KeeperErrorCode = NodeExists for /solr/overseer
[junit4:junit4]   2> 7234 T1421 oascc.ZkStateReader.updateClusterState Updating cloud state from ZooKeeper... 
[junit4:junit4]   2> 7327 T1434 oascc.ZkStateReader$2.process A cluster state change has occurred - updating...
[junit4:junit4]   2> 7327 T1446 oascc.ZkStateReader$2.process A cluster state change has occurred - updating...
[junit4:junit4]   2> 7327 T1420 oascc.ZkStateReader$2.process A cluster state change has occurred - updating...
[junit4:junit4]   2> 7379 T1400 oasc.ZkController.register We are http://127.0.0.1:37653/solr/collection1/ and leader is http://127.0.0.1:37653/solr/collection1/
[junit4:junit4]   2> 7380 T1400 oasc.ZkController.register No LogReplay needed for core=collection1 baseURL=http://127.0.0.1:37653/solr
[junit4:junit4]   2> 7380 T1400 oasc.ZkController.checkRecovery I am the leader, no recovery necessary
[junit4:junit4]   2> 7384 T1400 oascc.ZkStateReader.updateClusterState Updating cloud state from ZooKeeper... 
[junit4:junit4]   2> 7385 T1400 oass.SolrDispatchFilter.init user.dir=/usr/home/hudson/hudson-slave/workspace/Lucene-Solr-Tests-4.x-java7/solr/build/solr-core/test/J1
[junit4:junit4]   2> 7386 T1400 oass.SolrDispatchFilter.init SolrDispatchFilter.init() done
[junit4:junit4]   2> 7386 T1400 oascsi.HttpClientUtil.createClient Creating new http client, config:maxConnections=128&maxConnectionsPerHost=32&followRedirects=false
[junit4:junit4]   2> 7572 T1400 oejs.Server.doStart jetty-8.1.2.v20120308
[junit4:junit4]   2> 7584 T1400 oejs.AbstractConnector.doStart Started SocketConnector@0.0.0.0:37655
[junit4:junit4]   2> 7585 T1400 oasc.SolrResourceLoader.locateSolrHome JNDI not configured for solr (NoInitialContextEx)
[junit4:junit4]   2> 7585 T1400 oasc.SolrResourceLoader.locateSolrHome using system property solr.solr.home: /usr/home/hudson/hudson-slave/workspace/Lucene-Solr-Tests-4.x-java7/solr/build/solr-core/test-files/jetty4
[junit4:junit4]   2> 7585 T1400 oasc.SolrResourceLoader.<init> new SolrResourceLoader for deduced Solr Home: '/usr/home/hudson/hudson-slave/workspace/Lucene-Solr-Tests-4.x-java7/solr/build/solr-core/test-files/jetty4/'
[junit4:junit4]   2> 7622 T1400 oass.SolrDispatchFilter.init SolrDispatchFilter.init()
[junit4:junit4]   2> 7623 T1400 oasc.SolrResourceLoader.locateSolrHome JNDI not configured for solr (NoInitialContextEx)
[junit4:junit4]   2> 7623 T1400 oasc.SolrResourceLoader.locateSolrHome using system property solr.solr.home: /usr/home/hudson/hudson-slave/workspace/Lucene-Solr-Tests-4.x-java7/solr/build/solr-core/test-files/jetty4
[junit4:junit4]   2> 7624 T1400 oasc.CoreContainer$Initializer.initialize looking for solr.xml: /usr/home/hudson/hudson-slave/workspace/Lucene-Solr-Tests-4.x-java7/solr/build/solr-core/test-files/jetty4/solr.xml
[junit4:junit4]   2> 7624 T1400 oasc.CoreContainer.<init> New CoreContainer 2119892024
[junit4:junit4]   2> 7625 T1400 oasc.CoreContainer.load Loading CoreContainer using Solr Home: '/usr/home/hudson/hudson-slave/workspace/Lucene-Solr-Tests-4.x-java7/solr/build/solr-core/test-files/jetty4/'
[junit4:junit4]   2> 7625 T1400 oasc.SolrResourceLoader.<init> new SolrResourceLoader for directory: '/usr/home/hudson/hudson-slave/workspace/Lucene-Solr-Tests-4.x-java7/solr/build/solr-core/test-files/jetty4/'
[junit4:junit4]   2> 7658 T1400 oasc.CoreContainer.load Registering Log Listener
[junit4:junit4]   2> 7676 T1400 oasc.CoreContainer.initZooKeeper Zookeeper client=127.0.0.1:37623/solr
[junit4:junit4]   2> 7677 T1400 oaz.ZooKeeper.<init> Initiating client connection, connectString=127.0.0.1:37623/solr sessionTimeout=8000 watcher=org.apache.solr.common.cloud.ConnectionManager@7b322fd6
[junit4:junit4]   2> 7777 T1400 oascc.ConnectionManager.waitForConnected Waiting for client to connect to ZooKeeper
[junit4:junit4]   2> 7809 T1457 oaz.ClientCnxn$SendThread.startConnect Opening socket connection to server /127.0.0.1:37623
[junit4:junit4]   2> 7842 T1421 oascc.ZkStateReader.updateClusterState Updating cloud state from ZooKeeper... 
[junit4:junit4]   2> 7848 T1420 oascc.ZkStateReader$2.process A cluster state change has occurred - updating...
[junit4:junit4]   2> 7848 T1446 oascc.ZkStateReader$2.process A cluster state change has occurred - updating...
[junit4:junit4]   2> 7848 T1434 oascc.ZkStateReader$2.process A cluster state change has occurred - updating...
[junit4:junit4]   2> 7905 T1402 oazs.NIOServerCnxn$Factory.run Accepted socket connection from /140.211.11.196:37656
[junit4:junit4]   2> 7937 T1457 oaz.ClientCnxn$SendThread.primeConnection Socket connection established to localhost/127.0.0.1:37623, initiating session
[junit4:junit4]   2> 7963 T1402 oazs.NIOServerCnxn.readConnectRequest Client attempting to establish new session at /140.211.11.196:37656
[junit4:junit4]   2> 7965 T1404 oazs.NIOServerCnxn.finishSessionInit Established session 0x139995c51a00005 with negotiated timeout 8000 for client /140.211.11.196:37656
[junit4:junit4]   2> 7966 T1457 oaz.ClientCnxn$SendThread.readConnectResult Session establishment complete on server localhost/127.0.0.1:37623, sessionid = 0x139995c51a00005, negotiated timeout = 8000
[junit4:junit4]   2> 7966 T1458 oascc.ConnectionManager.process Watcher org.apache.solr.common.cloud.ConnectionManager@7b322fd6 name:ZooKeeperConnection Watcher:127.0.0.1:37623/solr got event WatchedEvent state:SyncConnected type:None path:null path:null type:None
[junit4:junit4]   2> 7966 T1400 oascc.ConnectionManager.waitForConnected Client is connected to ZooKeeper
[junit4:junit4]   2> 7967 T1405 oazs.PrepRequestProcessor.pRequest Got user-level KeeperException when processing sessionid:0x139995c51a00005 type:create cxid:0x1 zxid:0xfffffffffffffffe txntype:unknown reqpath:n/a Error Path:/solr/overseer Error:KeeperErrorCode = NodeExists for /solr/overseer
[junit4:junit4]   2> 7968 T1405 oazs.PrepRequestProcessor.pRequest Got user-level KeeperException when processing sessionid:0x139995c51a00005 type:create cxid:0x2 zxid:0xfffffffffffffffe txntype:unknown reqpath:n/a Error Path:/solr/overseer Error:KeeperErrorCode = NodeExists for /solr/overseer
[junit4:junit4]   2> 7987 T1400 oasc.ZkController.createEphemeralLiveNode Register node as live in ZooKeeper:/live_nodes/127.0.0.1:37655_solr
[junit4:junit4]   2> 7988 T1405 oazs.PrepRequestProcessor.pRequest Got user-level KeeperException when processing sessionid:0x139995c51a00005 type:delete cxid:0x4 zxid:0xfffffffffffffffe txntype:unknown reqpath:n/a Error Path:/solr/live_nodes/127.0.0.1:37655_solr Error:KeeperErrorCode = NoNode for /solr/live_nodes/127.0.0.1:37655_solr
[junit4:junit4]   2> 7989 T1400 oascc.SolrZkClient.makePath makePath: /live_nodes/127.0.0.1:37655_solr
[junit4:junit4]   2> 8102 T1420 oascc.ZkStateReader$3.process Updating live nodes
[junit4:junit4]   2> 8105 T1446 oascc.ZkStateReader$3.process Updating live nodes
[junit4:junit4]   2> 8124 T1434 oascc.ZkStateReader$3.process Updating live nodes
[junit4:junit4]   2> 8164 T1400 oashc.HttpShardHandlerFactory.getParameter Setting socketTimeout to: 0
[junit4:junit4]   2> 8165 T1400 oashc.HttpShardHandlerFactory.getParameter Setting urlScheme to: http://
[junit4:junit4]   2> 8166 T1400 oashc.HttpShardHandlerFactory.getParameter Setting connTimeout to: 0
[junit4:junit4]   2> 8166 T1400 oashc.HttpShardHandlerFactory.getParameter Setting maxConnectionsPerHost to: 20
[junit4:junit4]   2> 8167 T1400 oashc.HttpShardHandlerFactory.getParameter Setting corePoolSize to: 0
[junit4:junit4]   2> 8167 T1400 oashc.HttpShardHandlerFactory.getParameter Setting maximumPoolSize to: 2147483647
[junit4:junit4]   2> 8167 T1400 oashc.HttpShardHandlerFactory.getParameter Setting maxThreadIdleTime to: 5
[junit4:junit4]   2> 8168 T1400 oashc.HttpShardHandlerFactory.getParameter Setting sizeOfQueue to: -1
[junit4:junit4]   2> 8168 T1400 oashc.HttpShardHandlerFactory.getParameter Setting fairnessPolicy to: false
[junit4:junit4]   2> 8169 T1400 oascsi.HttpClientUtil.createClient Creating new http client, config:maxConnectionsPerHost=20&maxConnections=10000&socketTimeout=0&connTimeout=0&retry=false
[junit4:junit4]   2> 8329 T1400 oascc.ZkStateReader.createClusterStateWatchersAndUpdate Updating cluster state from ZooKeeper... 
[junit4:junit4]   2> 8564 T1400 oasc.CoreContainer.create Creating SolrCore 'collection1' using instanceDir: /usr/home/hudson/hudson-slave/workspace/Lucene-Solr-Tests-4.x-java7/solr/build/solr-core/test-files/jetty4/collection1
[junit4:junit4]   2> 8565 T1400 oasc.ZkController.createCollectionZkNode Check for collection zkNode:collection1
[junit4:junit4]   2> 8566 T1400 oasc.ZkController.createCollectionZkNode Collection zkNode exists
[junit4:junit4]   2> 8566 T1400 oasc.ZkController.readConfigName Load collection config from:/collections/collection1
[junit4:junit4]   2> 8568 T1400 oasc.SolrResourceLoader.<init> new SolrResourceLoader for directory: '/usr/home/hudson/hudson-slave/workspace/Lucene-Solr-Tests-4.x-java7/solr/build/solr-core/test-files/jetty4/collection1/'
[junit4:junit4]   2> 8569 T1400 oasc.SolrResourceLoader.replaceClassLoader Adding 'file:/usr/home/hudson/hudson-slave/workspace/Lucene-Solr-Tests-4.x-java7/solr/build/solr-core/test-files/jetty4/collection1/lib/README' to classloader
[junit4:junit4]   2> 8570 T1400 oasc.SolrResourceLoader.replaceClassLoader Adding 'file:/usr/home/hudson/hudson-slave/workspace/Lucene-Solr-Tests-4.x-java7/solr/build/solr-core/test-files/jetty4/collection1/lib/classes/' to classloader
[junit4:junit4]   2> 8629 T1400 oasc.SolrConfig.<init> Using Lucene MatchVersion: LUCENE_40
[junit4:junit4]   2> 8688 T1400 oasc.SolrConfig.<init> Loaded SolrConfig: solrconfig.xml
[junit4:junit4]   2> 8789 T1400 oass.IndexSchema.readSchema Reading Solr Schema
[junit4:junit4]   2> 8794 T1400 oass.IndexSchema.readSchema Schema name=test
[junit4:junit4]   2> 9323 T1400 oass.OpenExchangeRatesOrgProvider.init Initialized with rates=open-exchange-rates.json, refreshInterval=1440.
[junit4:junit4]   2> 9334 T1400 oass.IndexSchema.readSchema default search field in schema is text
[junit4:junit4]   2> 9338 T1400 oass.IndexSchema.readSchema unique key field: id
[junit4:junit4]   2> 9349 T1400 oass.FileExchangeRateProvider.reload Reloading exchange rates from file currency.xml
[junit4:junit4]   2> 9354 T1400 oass.FileExchangeRateProvider.reload Reloading exchange rates from file currency.xml
[junit4:junit4]   2> 9358 T1400 oass.OpenExchangeRatesOrgProvider.reload Reloading exchange rates from open-exchange-rates.json
[junit4:junit4]   2> 9359 T1400 oass.OpenExchangeRatesOrgProvider.reload Reloading exchange rates from open-exchange-rates.json
[junit4:junit4]   2> 9360 T1400 oasc.SolrCore.<init> [collection1] Opening new SolrCore at /usr/home/hudson/hudson-slave/workspace/Lucene-Solr-Tests-4.x-java7/solr/build/solr-core/test-files/jetty4/collection1/, dataDir=/usr/home/hudson/hudson-slave/workspace/Lucene-Solr-Tests-4.x-java7/solr/build/solr-core/test-files/jetty4/collection1/data/
[junit4:junit4]   2> 9361 T1400 oasc.JmxMonitoredMap.<init> JMX monitoring is enabled. Adding Solr mbeans to JMX Server: com.sun.jmx.mbeanserver.JmxMBeanServer@41a33efb
[junit4:junit4]   2> 9362 T1400 oasc.SolrCore.getNewIndexDir WARNING New index directory detected: old=null new=/usr/home/hudson/hudson-slave/workspace/Lucene-Solr-Tests-4.x-java7/solr/build/solr-core/test-files/jetty4/collection1/data/index/
[junit4:junit4]   2> 9363 T1400 oasc.SolrCore.initIndex WARNING [collection1] Solr index directory '/usr/home/hudson/hudson-slave/workspace/Lucene-Solr-Tests-4.x-java7/solr/build/solr-core/test-files/jetty4/collection1/data/index' doesn't exist. Creating new index...
[junit4:junit4]   2> 9364 T1400 oasc.CachingDirectoryFactory.get return new directory for /usr/home/hudson/hudson-slave/workspace/Lucene-Solr-Tests-4.x-java7/solr/build/solr-core/test-files/jetty4/collection1/data/index forceNew:false
[junit4:junit4]   2> 9369 T1400 oasc.SolrDeletionPolicy.onCommit SolrDeletionPolicy.onCommit: commits:num=1
[junit4:junit4]   2> 		commit{dir=NRTCachingDirectory(org.apache.lucene.store.NIOFSDirectory@/usr/home/hudson/hudson-slave/workspace/Lucene-Solr-Tests-4.x-java7/solr/build/solr-core/test-files/jetty4/collection1/data/index lockFactory=org.apache.lucene.store.NativeFSLockFactory@68dbb0b3; maxCacheMB=48.0 maxMergeSizeMB=4.0),segFN=segments_1,generation=1,filenames=[segments_1]
[junit4:junit4]   2> 9370 T1400 oasc.SolrDeletionPolicy.updateCommits newest commit = 1
[junit4:junit4]   2> 9371 T1400 oasc.SolrCore.initWriters created xml: solr.XMLResponseWriter
[junit4:junit4]   2> 9373 T1400 oasup.UpdateRequestProcessorChain.init inserting DistributedUpdateProcessorFactory into updateRequestProcessorChain "dedupe"
[junit4:junit4]   2> 9374 T1400 oasup.UpdateRequestProcessorChain.init inserting DistributedUpdateProcessorFactory into updateRequestProcessorChain "dedupe-allfields"
[junit4:junit4]   2> 9374 T1400 oasup.UpdateRequestProcessorChain.init inserting DistributedUpdateProcessorFactory into updateRequestProcessorChain "stored_sig"
[junit4:junit4]   2> 9375 T1400 oasup.UpdateRequestProcessorChain.init inserting DistributedUpdateProcessorFactory into updateRequestProcessorChain "uniq-fields"
[junit4:junit4]   2> 9375 T1400 oasup.UpdateRequestProcessorChain.init inserting DistributedUpdateProcessorFactory into updateRequestProcessorChain "distrib-dup-test-chain-implicit"
[junit4:junit4]   2> 9376 T1400 oasc.RequestHandlers.initHandlersFromConfig adding lazy requestHandler: solr.ReplicationHandler
[junit4:junit4]   2> 9376 T1400 oasc.RequestHandlers.initHandlersFromConfig created /replication: solr.ReplicationHandler
[junit4:junit4]   2> 9377 T1400 oasc.RequestHandlers.initHandlersFromConfig created standard: solr.StandardRequestHandler
[junit4:junit4]   2> 9378 T1400 oasc.RequestHandlers.initHandlersFromConfig created /get: solr.RealTimeGetHandler
[junit4:junit4]   2> 9378 T1400 oasc.RequestHandlers.initHandlersFromConfig created dismax: solr.SearchHandler
[junit4:junit4]   2> 9379 T1400 oasc.RequestHandlers.initHandlersFromConfig created mock: org.apache.solr.core.MockQuerySenderListenerReqHandler
[junit4:junit4]   2> 9379 T1400 oasc.RequestHandlers.initHandlersFromConfig created /admin/: org.apache.solr.handler.admin.AdminHandlers
[junit4:junit4]   2> 9380 T1400 oasc.RequestHandlers.initHandlersFromConfig created defaults: solr.StandardRequestHandler
[junit4:junit4]   2> 9380 T1400 oasc.RequestHandlers.initHandlersFromConfig adding lazy requestHandler: solr.StandardRequestHandler
[junit4:junit4]   2> 9381 T1400 oasc.RequestHandlers.initHandlersFromConfig created lazy: solr.StandardRequestHandler
[junit4:junit4]   2> 9381 T1400 oasc.RequestHandlers.initHandlersFromConfig created /update: solr.UpdateRequestHandler
[junit4:junit4]   2> 9382 T1400 oasc.RequestHandlers.initHandlersFromConfig created /terms: org.apache.solr.handler.component.SearchHandler
[junit4:junit4]   2> 9383 T1400 oasc.RequestHandlers.initHandlersFromConfig created spellCheckCompRH: org.apache.solr.handler.component.SearchHandler
[junit4:junit4]   2> 9383 T1400 oasc.RequestHandlers.initHandlersFromConfig created spellCheckCompRH_Direct: org.apache.solr.handler.component.SearchHandler
[junit4:junit4]   2> 9384 T1400 oasc.RequestHandlers.initHandlersFromConfig created spellCheckWithWordbreak: org.apache.solr.handler.component.SearchHandler
[junit4:junit4]   2> 9385 T1400 oasc.RequestHandlers.initHandlersFromConfig created spellCheckWithWordbreak_Direct: org.apache.solr.handler.component.SearchHandler
[junit4:junit4]   2> 9385 T1400 oasc.RequestHandlers.initHandlersFromConfig created spellCheckCompRH1: org.apache.solr.handler.component.SearchHandler
[junit4:junit4]   2> 9386 T1400 oasc.RequestHandlers.initHandlersFromConfig created tvrh: org.apache.solr.handler.component.SearchHandler
[junit4:junit4]   2> 9386 T1400 oasc.RequestHandlers.initHandlersFromConfig created /mlt: solr.MoreLikeThisHandler
[junit4:junit4]   2> 9387 T1400 oasc.RequestHandlers.initHandlersFromConfig created /debug/dump: solr.DumpRequestHandler
[junit4:junit4]   2> 9391 T1400 oashl.XMLLoader.init xsltCacheLifetimeSeconds=60
[junit4:junit4]   2> 9395 T1400 oasc.SolrCore.initDeprecatedSupport WARNING solrconfig.xml uses deprecated <admin/gettableFiles>, Please update your config to use the ShowFileRequestHandler.
[junit4:junit4]   2> 9396 T1400 oasc.SolrCore.initDeprecatedSupport WARNING adding ShowFileRequestHandler with hidden files: [SCHEMA.XML, OLD_SYNONYMS.TXT, STOPWORDS.TXT, PROTWORDS.TXT, OPEN-EXCHANGE-RATES.JSON, SYNONYMS.TXT, CURRENCY.XML, MAPPING-ISOLATIN1ACCENT.TXT]
[junit4:junit4]   2> 9400 T1400 oass.SolrIndexSearcher.<init> Opening Searcher@229e23ce main
[junit4:junit4]   2> 9402 T1400 oasu.CommitTracker.<init> Hard AutoCommit: disabled
[junit4:junit4]   2> 9402 T1400 oasu.CommitTracker.<init> Soft AutoCommit: disabled
[junit4:junit4]   2> 9403 T1400 oashc.SpellCheckComponent.inform Initializing spell checkers
[junit4:junit4]   2> 9405 T1400 oass.DirectSolrSpellChecker.init init: {name=direct,classname=DirectSolrSpellChecker,field=lowerfilt,minQueryLength=3}
[junit4:junit4]   2> 9419 T1459 oasc.SolrCore.registerSearcher [collection1] Registered new searcher Searcher@229e23ce main{StandardDirectoryReader(segments_1:1)}
[junit4:junit4]   2> 9428 T1400 oasc.CoreContainer.register registering core: collection1
[junit4:junit4]   2> 9429 T1400 oasc.ZkController.register Register shard - core:collection1 address:http://127.0.0.1:37655/solr shardId:shard5
[junit4:junit4]   2> 9430 T1400 oascc.SolrZkClient.makePath makePath: /collections/collection1/leader_elect/shard5/election
[junit4:junit4]   2> 9435 T1405 oazs.PrepRequestProcessor.pRequest Got user-level KeeperException when processing sessionid:0x139995c51a00005 type:delete cxid:0x40 zxid:0xfffffffffffffffe txntype:unknown reqpath:n/a Error Path:/solr/collections/collection1/leaders/shard5 Error:KeeperErrorCode = NoNode for /solr/collections/collection1/leaders/shard5
[junit4:junit4]   2> 9445 T1400 oasc.ShardLeaderElectionContext.runLeaderProcess Running the leader process. afterExpiration=false
[junit4:junit4]   2> 9446 T1405 oazs.PrepRequestProcessor.pRequest Got user-level KeeperException when processing sessionid:0x139995c51a00005 type:create cxid:0x41 zxid:0xfffffffffffffffe txntype:unknown reqpath:n/a Error Path:/solr/overseer Error:KeeperErrorCode = NodeExists for /solr/overseer
[junit4:junit4]   2> 9455 T1400 oasc.ShardLeaderElectionContext.runLeaderProcess I am the new leader: http://127.0.0.1:37655/solr/collection1/
[junit4:junit4]   2> 9456 T1400 oascc.SolrZkClient.makePath makePath: /collections/collection1/leaders/shard5
[junit4:junit4]   2> 9459 T1405 oazs.PrepRequestProcessor.pRequest Got user-level KeeperException when processing sessionid:0x139995c51a00005 type:create cxid:0x49 zxid:0xfffffffffffffffe txntype:unknown reqpath:n/a Error Path:/solr/overseer Error:KeeperErrorCode = NodeExists for /solr/overseer
[junit4:junit4]   2> 9859 T1421 oascc.ZkStateReader.updateClusterState Updating cloud state from ZooKeeper... 
[junit4:junit4]   2> 9895 T1434 oascc.ZkStateReader$2.process A cluster state change has occurred - updating...
[junit4:junit4]   2> 9895 T1420 oascc.ZkStateReader$2.process A cluster state change has occurred - updating...
[junit4:junit4]   2> 9895 T1446 oascc.ZkStateReader$2.process A cluster state change has occurred - updating...
[junit4:junit4]   2> 9895 T1458 oascc.ZkStateReader$2.process A cluster state change has occurred - updating...
[junit4:junit4]   2> 9927 T1400 oasc.ZkController.register We are http://127.0.0.1:37655/solr/collection1/ and leader is http://127.0.0.1:37655/solr/collection1/
[junit4:junit4]   2> 9927 T1400 oasc.ZkController.register No LogReplay needed for core=collection1 baseURL=http://127.0.0.1:37655/solr
[junit4:junit4]   2> 9928 T1400 oasc.ZkController.checkRecovery I am the leader, no recovery necessary
[junit4:junit4]   2> 9930 T1400 oascc.ZkStateReader.updateClusterState Updating cloud state from ZooKeeper... 
[junit4:junit4]   2> 9931 T1400 oass.SolrDispatchFilter.init user.dir=/usr/home/hudson/hudson-slave/workspace/Lucene-Solr-Tests-4.x-java7/solr/build/solr-core/test/J1
[junit4:junit4]   2> 9932 T1400 oass.SolrDispatchFilter.init SolrDispatchFilter.init() done
[junit4:junit4]   2> 9932 T1400 oascsi.HttpClientUtil.createClient Creating new http client, config:maxConnections=128&maxConnectionsPerHost=32&followRedirects=false
[junit4:junit4]   2> ASYNC  NEW_CORE C118 name=collection1 org.apache.solr.core.SolrCore@3955553e url=http://127.0.0.1:37630/solr/collection1 node=127.0.0.1:37630_solr
[junit4:junit4]   2> 9957 T1412 C118 P37630 oasc.SolrDeletionPolicy.onInit SolrDeletionPolicy.onInit: commits:num=1
[junit4:junit4]   2> 		commit{dir=NRTCachingDirectory(org.apache.lucene.store.NIOFSDirectory@/usr/home/hudson/hudson-slave/workspace/Lucene-Solr-Tests-4.x-java7/solr/build/solr-core/test-files/control1/collection1/data/index lockFactory=org.apache.lucene.store.NativeFSLockFactory@4ae35a2; maxCacheMB=48.0 maxMergeSizeMB=4.0),segFN=segments_1,generation=1,filenames=[segments_1]
[junit4:junit4]   2> 9958 T1412 C118 P37630 oasc.SolrDeletionPolicy.updateCommits newest commit = 1
[junit4:junit4]   2> 9961 T1412 C118 P37630 oass.SolrIndexSearcher.<init> Opening Searcher@5b37643d realtime
[junit4:junit4]   2> 9962 T1412 C118 P37630 UPDATE [collection1] webapp=/solr path=/update params={wt=javabin&version=2} {deleteByQuery=*:* (-1412324642357510144)} 0 11
[junit4:junit4]   2> ASYNC  NEW_CORE C119 name=collection1 org.apache.solr.core.SolrCore@35fd26fa url=http://127.0.0.1:37651/solr/collection1 node=127.0.0.1:37651_solr
[junit4:junit4]   2> 9973 T1426 C119 P37651 oasc.SolrDeletionPolicy.onInit SolrDeletionPolicy.onInit: commits:num=1
[junit4:junit4]   2> 		commit{dir=NRTCachingDirectory(org.apache.lucene.store.NIOFSDirectory@/usr/home/hudson/hudson-slave/workspace/Lucene-Solr-Tests-4.x-java7/solr/build/solr-core/test-files/jetty2/collection1/data/index lockFactory=org.apache.lucene.store.NativeFSLockFactory@4e12fc8; maxCacheMB=48.0 maxMergeSizeMB=4.0),segFN=segments_1,generation=1,filenames=[segments_1]
[junit4:junit4]   2> 9974 T1426 C119 P37651 oasc.SolrDeletionPolicy.updateCommits newest commit = 1
[junit4:junit4]   2> 9976 T1426 C119 P37651 oass.SolrIndexSearcher.<init> Opening Searcher@34907b93 realtime
[junit4:junit4]   2> ASYNC  NEW_CORE C120 name=collection1 org.apache.solr.core.SolrCore@4d30f39d url=http://127.0.0.1:37655/solr/collection1 node=127.0.0.1:37655_solr
[junit4:junit4]   2> 9987 T1450 C120 P37655 oasc.SolrDeletionPolicy.onInit SolrDeletionPolicy.onInit: commits:num=1
[junit4:junit4]   2> 		commit{dir=NRTCachingDirectory(org.apache.lucene.store.NIOFSDirectory@/usr/home/hudson/hudson-slave/workspace/Lucene-Solr-Tests-4.x-java7/solr/build/solr-core/test-files/jetty4/collection1/data/index lockFactory=org.apache.lucene.store.NativeFSLockFactory@68dbb0b3; maxCacheMB=48.0 maxMergeSizeMB=4.0),segFN=segments_1,generation=1,filenames=[segments_1]
[junit4:junit4]   2> ASYNC  NEW_CORE C121 name=collection1 org.apache.solr.core.SolrCore@5ba3b0e3 url=http://127.0.0.1:37653/solr/collection1 node=127.0.0.1:37653_solr
[junit4:junit4]   2> 9987 T1438 C121 P37653 oasc.SolrDeletionPolicy.onInit SolrDeletionPolicy.onInit: commits:num=1
[junit4:junit4]   2> 		commit{dir=NRTCachingDirectory(org.apache.lucene.store.NIOFSDirectory@/usr/home/hudson/hudson-slave/workspace/Lucene-Solr-Tests-4.x-java7/solr/build/solr-core/test-files/jetty3/collection1/data/index lockFactory=org.apache.lucene.store.NativeFSLockFactory@5dac7392; maxCacheMB=48.0 maxMergeSizeMB=4.0),segFN=segments_1,generation=1,filenames=[segments_1]
[junit4:junit4]   2> 9988 T1450 C120 P37655 oasc.SolrDeletionPolicy.updateCommits newest commit = 1
[junit4:junit4]   2> 9988 T1438 C121 P37653 oasc.SolrDeletionPolicy.updateCommits newest commit = 1
[junit4:junit4]   2> 9990 T1450 C120 P37655 oass.SolrIndexSearcher.<init> Opening Searcher@5049d5de realtime
[junit4:junit4]   2> 9990 T1438 C121 P37653 oass.SolrIndexSearcher.<init> Opening Searcher@21a3d24 realtime
[junit4:junit4]   2> 9991 T1450 C120 P37655 REQ [collection1] webapp=/solr path=/update params={update.distrib=TOLEADER&wt=javabin&version=2} status=0 QTime=7 
[junit4:junit4]   2> 9991 T1438 C121 P37653 REQ [collection1] webapp=/solr path=/update params={update.distrib=TOLEADER&wt=javabin&version=2} status=0 QTime=7 
[junit4:junit4]   2> 9992 T1426 C119 P37651 UPDATE [collection1] webapp=/solr path=/update params={wt=javabin&version=2} {deleteByQuery=*:* (-1412324642377433088)} 0 23
[junit4:junit4]   2> 10000 T1450 C120 P37655 REQ [collection1] webapp=/solr path=/update params={update.distrib=TOLEADER&wt=javabin&version=2} status=0 QTime=0 
[junit4:junit4]   2> 10002 T1427 C119 P37651 REQ [collection1] webapp=/solr path=/update params={update.distrib=TOLEADER&wt=javabin&version=2} status=0 QTime=4 
[junit4:junit4]   2> 10002 T1439 C121 P37653 UPDATE [collection1] webapp=/solr path=/update params={wt=javabin&version=2} {deleteByQuery=*:* (-1412324642403647488)} 0 7
[junit4:junit4]   2> 10010 T1438 C121 P37653 REQ [collection1] webapp=/solr path=/update params={update.distrib=TOLEADER&wt=javabin&version=2} status=0 QTime=1 
[junit4:junit4]   2> 10010 T1427 C119 P37651 REQ [collection1] webapp=/solr path=/update params={update.distrib=TOLEADER&wt=javabin&version=2} status=0 QTime=1 
[junit4:junit4]   2> 10011 T1451 C120 P37655 UPDATE [collection1] webapp=/solr path=/update params={wt=javabin&version=2} {deleteByQuery=*:* (-1412324642414133248)} 0 6
[junit4:junit4]   2> 10021 T1412 C118 P37630 UPDATE [collection1] webapp=/solr path=/update params={wt=javabin&version=2} {add=[1 (1412324642425667584)]} 0 5
[junit4:junit4]   2> 10028 T1426 C119 P37651 UPDATE [collection1] webapp=/solr path=/update params={wt=javabin&version=2} {add=[1 (1412324642435104768)]} 0 4
[junit4:junit4]   2> 10034 T1412 C118 P37630 UPDATE [collection1] webapp=/solr path=/update params={wt=javabin&version=2} {add=[2 (1412324642442444800)]} 0 3
[junit4:junit4]   2> 10043 T1439 C121 P37653 UPDATE [collection1] webapp=/solr path=/update params={wt=javabin&version=2} {add=[2 (1412324642449784832)]} 0 5
[junit4:junit4]   2> 10049 T1412 C118 P37630 UPDATE [collection1] webapp=/solr path=/update params={wt=javabin&version=2} {add=[3 (1412324642458173440)]} 0 3
[junit4:junit4]   2> 10058 T1438 C121 P37653 REQ [collection1] webapp=/solr path=/update params={distrib.from=http://127.0.0.1:37655/solr/collection1/&update.distrib=TOLEADER&wt=javabin&version=2} status=0 QTime=3 
[junit4:junit4]   2> 10058 T1451 C120 P37655 UPDATE [collection1] webapp=/solr path=/update params={wt=javabin&version=2} {add=[3]} 0 6
[junit4:junit4]   2> 10065 T1412 C118 P37630 UPDATE [collection1] webapp=/solr path=/update params={wt=javabin&version=2} {add=[4 (1412324642474950656)]} 0 3
[junit4:junit4]   2> 10076 T1438 C121 P37653 REQ [collection1] webapp=/solr path=/update params={distrib.from=http://127.0.0.1:37651/solr/collection1/&update.distrib=TOLEADER&wt=javabin&version=2} status=0 QTime=3 
[junit4:junit4]   2> 10077 T1426 C119 P37651 UPDATE [collection1] webapp=/solr path=/update params={wt=javabin&version=2} {add=[4]} 0 7
[junit4:junit4]   2> 10084 T1412 C118 P37630 UPDATE [collection1] webapp=/solr path=/update params={wt=javabin&version=2} {add=[5 (1412324642494873600)]} 0 2
[junit4:junit4]   2> 10096 T1450 C120 P37655 REQ [collection1] webapp=/solr path=/update params={distrib.from=http://127.0.0.1:37653/solr/collection1/&update.distrib=TOLEADER&wt=javabin&version=2} status=0 QTime=5 
[junit4:junit4]   2> 10098 T1439 C121 P37653 UPDATE [collection1] webapp=/solr path=/update params={wt=javabin&version=2} {add=[5]} 0 10
[junit4:junit4]   2> 10104 T1412 C118 P37630 UPDATE [collection1] webapp=/solr path=/update params={wt=javabin&version=2} {add=[6 (1412324642515845120)]} 0 3
[junit4:junit4]   2> 10114 T1438 C121 P37653 REQ [collection1] webapp=/solr path=/update params={distrib.from=http://127.0.0.1:37655/solr/collection1/&update.distrib=TOLEADER&wt=javabin&version=2} status=0 QTime=3 
[junit4:junit4]   2> 10115 T1451 C120 P37655 UPDATE [collection1] webapp=/solr path=/update params={wt=javabin&version=2} {add=[6]} 0 7
[junit4:junit4]   2> 10122 T1412 C118 P37630 UPDATE [collection1] webapp=/solr path=/update params={wt=javabin&version=2} {add=[7 (1412324642534719488)]} 0 3
[junit4:junit4]   2> 10131 T1438 C121 P37653 REQ [collection1] webapp=/solr path=/update params={distrib.from=http://127.0.0.1:37651/solr/collection1/&update.distrib=TOLEADER&wt=javabin&version=2} status=0 QTime=2 
[junit4:junit4]   2> 10132 T1426 C119 P37651 UPDATE [collection1] webapp=/solr path=/update params={wt=javabin&version=2} {add=[7]} 0 6
[junit4:junit4]   2> 10139 T1412 C118 P37630 UPDATE [collection1] webapp=/solr path=/update params={wt=javabin&version=2} {add=[8 (1412324642551496704)]} 0 4
[junit4:junit4]   2> 10162 T1427 C119 P37651 REQ [collection1] webapp=/solr path=/update params={distrib.from=http://127.0.0.1:37653/solr/collection1/&update.distrib=TOLEADER&wt=javabin&version=2} status=0 QTime=3 
[junit4:junit4]   2> 10163 T1439 C121 P37653 UPDATE [collection1] webapp=/solr path=/update params={wt=javabin&version=2} {add=[8]} 0 20
[junit4:junit4]   2> 10170 T1412 C118 P37630 UPDATE [collection1] webapp=/solr path=/update params={wt=javabin&version=2} {add=[9 (1412324642585051136)]} 0 3
[junit4:junit4]   2> 10181 T1438 C121 P37653 REQ [collection1] webapp=/solr path=/update params={distrib.from=http://127.0.0.1:37655/solr/collection1/&update.distrib=TOLEADER&wt=javabin&version=2} status=0 QTime=3 
[junit4:junit4]   2> 10182 T1451 C120 P37655 UPDATE [collection1] webapp=/solr path=/update params={wt=javabin&version=2} {add=[9]} 0 7
[junit4:junit4]   2> 10221 T1412 C118 P37630 UPDATE [collection1] webapp=/solr path=/update params={wt=javabin&version=2} {add=[10 (1412324642603925504)]} 0 36
[junit4:junit4]   2> 10227 T1426 C119 P37651 UPDATE [collection1] webapp=/solr path=/update params={wt=javabin&version=2} {add=[10 (1412324642644819968)]} 0 3
[junit4:junit4]   2> 10235 T1412 C118 P37630 UPDATE [collection1] webapp=/solr path=/update params={wt=javabin&version=2} {add=[11 (1412324642652160000)]} 0 4
[junit4:junit4]   2> 10245 T1427 C119 P37651 REQ [collection1] webapp=/solr path=/update params={distrib.from=http://127.0.0.1:37653/solr/collection1/&update.distrib=TOLEADER&wt=javabin&version=2} status=0 QTime=3 
[junit4:junit4]   2> 10246 T1439 C121 P37653 UPDATE [collection1] webapp=/solr path=/update params={wt=javabin&version=2} {add=[11]} 0 7
[junit4:junit4]   2> 10252 T1412 C118 P37630 UPDATE [collection1] webapp=/solr path=/update params={wt=javabin&version=2} {add=[12 (1412324642671034368)]} 0 3
[junit4:junit4]   2> 10261 T1438 C121 P37653 REQ [collection1] webapp=/solr path=/update params={distrib.from=http://127.0.0.1:37655/solr/collection1/&update.distrib=TOLEADER&wt=javabin&version=2} status=0 QTime=3 
[junit4:junit4]   2> 10262 T1451 C120 P37655 UPDATE [collection1] webapp=/solr path=/update params={wt=javabin&version=2} {add=[12]} 0 7
[junit4:junit4]   2> 10268 T1412 C118 P37630 UPDATE [collection1] webapp=/solr path=/update params={wt=javabin&version=2} {add=[13 (1412324642687811584)]} 0 3
[junit4:junit4]   2> 10274 T1426 C119 P37651 UPDATE [collection1] webapp=/solr path=/update params={wt=javabin&version=2} {add=[13 (1412324642693054464)]} 0 3
[junit4:junit4]   2> 10279 T1412 C118 P37630 UPDATE [collection1] webapp=/solr path=/update params={wt=javabin&version=2} {add=[14 (1412324642700394496)]} 0 2
[junit4:junit4]   2> 10288 T1427 C119 P37651 REQ [collection1] webapp=/solr path=/update params={distrib.from=http://127.0.0.1:37653/solr/collection1/&update.distrib=TOLEADER&wt=javabin&version=2} status=0 QTime=2 
[junit4:junit4]   2> 10289 T1439 C121 P37653 UPDATE [collection1] webapp=/solr path=/update params={wt=javabin&version=2} {add=[14]} 0 6
[junit4:junit4]   2> 10294 T1412 C118 P37630 UPDATE [collection1] webapp=/solr path=/update params={wt=javabin&version=2} {add=[15 (1412324642716123136)]} 0 2
[junit4:junit4]   2> 10302 T1438 C121 P37653 REQ [collection1] webapp=/solr path=/update params={distrib.from=http://127.0.0.1:37655/solr/collection1/&update.distrib=TOLEADER&wt=javabin&version=2} status=0 QTime=2 
[junit4:junit4]   2> 10303 T1451 C120 P37655 UPDATE [collection1] webapp=/solr path=/update params={wt=javabin&version=2} {add=[15]} 0 6
[junit4:junit4]   2> 10310 T1412 C118 P37630 UPDATE [collection1] webapp=/solr path=/update params={wt=javabin&version=2} {add=[16 (1412324642731851776)]} 0 3
[junit4:junit4]   2> 10315 T1426 C119 P37651 UPDATE [collection1] webapp=/solr path=/update params={wt=javabin&version=2} {add=[16 (1412324642737094656)]} 0 2
[junit4:junit4]   2> 10324 T1412 C118 P37630 UPDATE [collection1] webapp=/solr path=/update params={wt=javabin&version=2} {add=[17 (1412324642743386112)]} 0 6
[junit4:junit4]   2> 10339 T1450 C120 P37655 REQ [collection1] webapp=/solr path=/update params={distrib.from=http://127.0.0.1:37653/solr/collection1/&update.distrib=TOLEADER&wt=javabin&version=2} status=0 QTime=7 
[junit4:junit4]   2> 10340 T1439 C121 P37653 UPDATE [collection1] webapp=/solr path=/update params={wt=javabin&version=2} {add=[17]} 0 12
[junit4:junit4]   2> 10347 T1412 C118 P37630 UPDATE [collection1] webapp=/solr path=/update params={wt=javabin&version=2} {add=[100 (1412324642770649088)]} 0 3
[junit4:junit4]   2> 10355 T1427 C119 P37651 REQ [collection1] webapp=/solr path=/update params={distrib.from=http://127.0.0.1:37653/solr/collection1/&update.distrib=TOLEADER&wt=javabin&version=2} status=0 QTime=2 
[junit4:junit4]   2> 10355 T1439 C121 P37653 UPDATE [collection1] webapp=/solr path=/update params={wt=javabin&version=2} {add=[100]} 0 5
[junit4:junit4]   2> 10359 T1412 C118 P37630 UPDATE [collection1] webapp=/solr path=/update params={wt=javabin&version=2} {add=[101 (1412324642784280576)]} 0 1
[junit4:junit4]   2> 10367 T1438 C121 P37653 REQ [collection1] webapp=/solr path=/update params={distrib.from=http://127.0.0.1:37655/solr/collection1/&update.distrib=TOLEADER&wt=javabin&version=2} status=0 QTime=2 
[junit4:junit4]   2> 10369 T1451 C120 P37655 UPDATE [collection1] webapp=/solr path=/update params={wt=javabin&version=2} {add=[101]} 0 7
[junit4:junit4]   2> 10394 T1412 C118 P37630 UPDATE [collection1] webapp=/solr path=/update params={wt=javabin&version=2} {add=[102 (1412324642805252096)]} 0 16
[junit4:junit4]   2> 10406 T1421 oascc.ZkStateReader.updateClusterState Updating cloud state from ZooKeeper... 
[junit4:junit4]   2> 10411 T1420 oascc.ZkStateReader$2.process A cluster state change has occurred - updating...
[junit4:junit4]   2> 10411 T1458 oascc.ZkStateReader$2.process A cluster state change has occurred - updating...
[junit4:junit4]   2> 10411 T1434 oascc.ZkStateReader$2.process A cluster state change has occurred - updating...
[junit4:junit4]   2> 10412 T1446 oascc.ZkStateReader$2.process A cluster state change has occurred - updating...
[junit4:junit4]   2> 10417 T1438 C121 P37653 REQ [collection1] webapp=/solr path=/update params={distrib.from=http://127.0.0.1:37651/solr/collection1/&update.distrib=TOLEADER&wt=javabin&version=2} status=0 QTime=17 
[junit4:junit4]   2> 10418 T1426 C119 P37651 UPDATE [collection1] webapp=/solr path=/update params={wt=javabin&version=2} {add=[102]} 0 21
[junit4:junit4]   2> 10425 T1412 C118 P37630 UPDATE [collection1] webapp=/solr path=/update params={wt=javabin&version=2} {add=[103 (1412324642851389440)]} 0 4
[junit4:junit4]   2>  C120_STATE=coll:collection1 core:collection1 props:{shard=shard5, leader=true, roles=null, state=active, core=collection1, collection=collection1, node_name=127.0.0.1:37655_solr, base_url=http://127.0.0.1:37655/solr}
[junit4:junit4]   2> 10437 T1450 C120 P37655 REQ [collection1] webapp=/solr path=/update params={distrib.from=http://127.0.0.1:37653/solr/collection1/&update.distrib=TOLEADER&wt=javabin&version=2} status=0 QTime=2 
[junit4:junit4]   2> 10440 T1439 C121 P37653 UPDATE [collection1] webapp=/solr path=/update params={wt=javabin&version=2} {add=[103]} 0 9
[junit4:junit4]   2> 10460 T1412 C118 P37630 UPDATE [collection1] webapp=/solr path=/update params={wt=javabin&version=2} {add=[104 (1412324642888089600)]} 0 3
[junit4:junit4]   2> 10466 T1451 C120 P37655 UPDATE [collection1] webapp=/solr path=/update params={wt=javabin&version=2} {add=[104 (1412324642896478208)]} 0 1
[junit4:junit4]   2> 10472 T1412 C118 P37630 UPDATE [collection1] webapp=/solr path=/update params={wt=javabin&version=2} {add=[105 (1412324642902769664)]} 0 2
[junit4:junit4]   2> 10482 T1438 C121 P37653 REQ [collection1] webapp=/solr path=/update params={distrib.from=http://127.0.0.1:37651/solr/collection1/&update.distrib=TOLEADER&wt=javabin&version=2} status=0 QTime=4 
[junit4:junit4]   2> 10483 T1426 C119 P37651 UPDATE [collection1] webapp=/solr path=/update params={wt=javabin&version=2} {add=[105]} 0 8
[junit4:junit4]   2> 10489 T1412 C118 P37630 UPDATE [collection1] webapp=/solr path=/update params={wt=javabin&version=2} {add=[106 (1412324642919546880)]} 0 3
[junit4:junit4]   2> 10499 T1450 C120 P37655 REQ [collection1] webapp=/solr path=/update params={distrib.from=http://127.0.0.1:37653/solr/collection1/&update.distrib=TOLEADER&wt=javabin&version=2} status=0 QTime=2 
[junit4:junit4]   2> 10501 T1439 C121 P37653 UPDATE [collection1] webapp=/solr path=/update params={wt=javabin&version=2} {add=[106]} 0 8
[junit4:junit4]   2> 10508 T1412 C118 P37630 UPDATE [collection1] webapp=/solr path=/update params={wt=javabin&version=2} {add=[107 (1412324642939469824)]} 0 2
[junit4:junit4]   2> 10520 T1438 C121 P37653 REQ [collection1] webapp=/solr path=/update params={distrib.from=http://127.0.0.1:37655/solr/collection1/&update.distrib=TOLEADER&wt=javabin&version=2} status=0 QTime=3 
[junit4:junit4]   2> 10521 T1451 C120 P37655 UPDATE [collection1] webapp=/solr path=/update params={wt=javabin&version=2} {add=[107]} 0 8
[junit4:junit4]   2> 10538 T1412 C118 P37630 UPDATE [collection1] webapp=/solr path=/update params={wt=javabin&version=2} {add=[108 (1412324642970927104)]} 0 3
[junit4:junit4]   2> 10547 T1426 C119 P37651 UPDATE [collection1] webapp=/solr path=/update params={wt=javabin&version=2} {add=[108 (1412324642980364288)]} 0 2
[junit4:junit4]   2> 10567 T1412 C118 P37630 UPDATE [collection1] webapp=/solr path=/update params={wt=javabin&version=2} {add=[109 (1412324643001335808)]} 0 2
[junit4:junit4]   2> 10594 T1427 C119 P37651 REQ [collection1] webapp=/solr path=/update params={distrib.from=http://127.0.0.1:37653/solr/collection1/&update.distrib=TOLEADER&wt=javabin&version=2} status=0 QTime=22 
[junit4:junit4]   2> 10596 T1439 C121 P37653 UPDATE [collection1] webapp=/solr path=/update params={wt=javabin&version=2} {add=[109]} 0 25
[junit4:junit4]   2> 10603 T1412 C118 P37630 UPDATE [collection1] webapp=/solr path=/update params={wt=javabin&version=2} {add=[110 (1412324643039084544)]} 0 3
[junit4:junit4]   2> 10614 T1427 C119 P37651 REQ [collection1] webapp=/solr path=/update params={distrib.from=http://127.0.0.1:37655/solr/collection1/&update.distrib=TOLEADER&wt=javabin&version=2} status=0 QTime=4 
[junit4:junit4]   2> 10615 T1451 C120 P37655 UPDATE [collection1] webapp=/solr path=/update params={wt=javabin&version=2} {add=[110]} 0 8
[junit4:junit4]   2> 10622 T1412 C118 P37630 UPDATE [collection1] webapp=/solr path=/update params={wt=javabin&version=2} {add=[111 (1412324643059007488)]} 0 3
[junit4:junit4]   2> 10631 T1438 C121 P37653 REQ [collection1] webapp=/solr path=/update params={distrib.from=http://127.0.0.1:37651/solr/collection1/&update.distrib=TOLEADER&wt=javabin&version=2} status=0 QTime=2 
[junit4:junit4]   2> 10632 T1426 C119 P37651 UPDATE [collection1] webapp=/solr path=/update params={wt=javabin&version=2} {add=[111]} 0 6
[junit4:junit4]   2> 10652 T1412 C118 P37630 UPDATE [collection1] webapp=/solr path=/update params={wt=javabin&version=2} {add=[112 (1412324643075784704)]} 0 16
[junit4:junit4]   2> 10662 T1450 C120 P37655 REQ [collection1] webapp=/solr path=/update params={distrib.from=http://127.0.0.1:37653/solr/collection1/&update.distrib=TOLEADER&wt=javabin&version=2} status=0 QTime=3 
[junit4:junit4]   2> 10663 T1439 C121 P37653 UPDATE [collection1] webapp=/solr path=/update params={wt=javabin&version=2} {add=[112]} 0 7
[junit4:junit4]   2> 10670 T1412 C118 P37630 UPDATE [collection1] webapp=/solr path=/update params={wt=javabin&version=2} {add=[113 (1412324643108290560)]} 0 3
[junit4:junit4]   2> 10679 T1438 C121 P37653 REQ [collection1] webapp=/solr path=/update params={distrib.from=http://127.0.0.1:37655/solr/collection1/&update.distrib=TOLEADER&wt=javabin&version=2} status=0 QTime=2 
[junit4:junit4]   2> 10680 T1451 C120 P37655 UPDATE [collection1] webapp=/solr path=/update params={wt=javabin&version=2} {add=[113]} 0 6
[junit4:junit4]   2> 10686 T1412 C118 P37630 UPDATE [collection1] webapp=/solr path=/update params={wt=javabin&version=2} {add=[114 (1412324643126116352)]} 0 3
[junit4:junit4]   2> 10696 T1438 C121 P37653 REQ [collection1] webapp=/solr path=/update params={distrib.from=http://127.0.0.1:37651/solr/collection1/&update.distrib=TOLEADER&wt=javabin&version=2} status=0 QTime=3 
[junit4:junit4]   2> 10697 T1426 C119 P37651 UPDATE [collection1] webapp=/solr path=/update params={wt=javabin&version=2} {add=[114]} 0 7
[junit4:junit4]   2> 10704 T1412 C118 P37630 UPDATE [collection1] webapp=/solr path=/update params={wt=javabin&version=2} {add=[115 (1412324643144990720)]} 0 2
[junit4:junit4]   2> 10711 T1439 C121 P37653 UPDATE [collection1] webapp=/solr path=/update params={wt=javabin&version=2} {add=[115 (1412324643152330752)]} 0 3
[junit4:junit4]   2> 10716 T1412 C118 P37630 UPDATE [collection1] webapp=/solr path=/update params={wt=javabin&version=2} {add=[116 (1412324643158622208)]} 0 2
[junit4:junit4]   2> 10722 T1451 C120 P37655 UPDATE [collection1] webapp=/solr path=/update params={wt=javabin&version=2} {add=[116 (1412324643163865088)]} 0 2
[junit4:junit4]   2> 10728 T1412 C118 P37630 UPDATE [collection1] webapp=/solr path=/update params={wt=javabin&version=2} {add=[117 (1412324643171205120)]} 0 2
[junit4:junit4]   2> 10737 T1438 C121 P37653 REQ [collection1] webapp=/solr path=/update params={distrib.from=http://127.0.0.1:37651/solr/collection1/&update.distrib=TOLEADER&wt=javabin&version=2} status=0 QTime=3 
[junit4:junit4]   2> 10738 T1426 C119 P37651 UPDATE [collection1] webapp=/solr path=/update params={wt=javabin&version=2} {add=[117]} 0 7
[junit4:junit4]   2> 10744 T1412 C118 P37630 UPDATE [collection1] webapp=/solr path=/update params={wt=javabin&version=2} {add=[118 (1412324643186933760)]} 0 3
[junit4:junit4]   2> 10754 T1427 C119 P37651 REQ [collection1] webapp=/solr path=/update params={distrib.from=http://127.0.0.1:37653/solr/collection1/&update.distrib=TOLEADER&wt=javabin&version=2} status=0 QTime=3 
[junit4:junit4]   2> 10755 T1439 C121 P37653 UPDATE [collection1] webapp=/solr path=/update params={wt=javabin&version=2} {add=[118]} 0 7
[junit4:junit4]   2> 10762 T1412 C118 P37630 UPDATE [collection1] webapp=/solr path=/update params={wt=javabin&version=2} {add=[119 (1412324643205808128)]} 0 3
[junit4:junit4]   2> 10771 T1438 C121 P37653 REQ [collection1] webapp=/solr path=/update params={distrib.from=http://127.0.0.1:37655/solr/collection1/&update.distrib=TOLEADER&wt=javabin&version=2} status=0 QTime=3 
[junit4:junit4]   2> 10772 T1451 C120 P37655 UPDATE [collection1] webapp=/solr path=/update params={wt=javabin&version=2} {add=[119]} 0 7
[junit4:junit4]   2> 10778 T1412 C118 P37630 UPDATE [collection1] webapp=/solr path=/update params={wt=javabin&version=2} {add=[120 (1412324643222585344)]} 0 3
[junit4:junit4]   2> 10789 T1438 C121 P37653 REQ [collection1] webapp=/solr path=/update params={distrib.from=http://127.0.0.1:37651/solr/collection1/&update.distrib=TOLEADER&wt=javabin&version=2} status=0 QTime=3 
[junit4:junit4]   2> 10790 T1426 C119 P37651 UPDATE [collection1] webapp=/solr path=/update params={wt=javabin&version=2} {add=[120]} 0 8
[junit4:junit4]   2> 10797 T1412 C118 P37630 UPDATE [collection1] webapp=/solr path=/update params={wt=javabin&version=2} {add=[121 (1412324643242508288)]} 0 2
[junit4:junit4]   2> 10806 T1450 C120 P37655 REQ [collection1] webapp=/solr path=/update params={distrib.from=http://127.0.0.1:37653/solr/collection1/&update.distrib=TOLEADER&wt=javabin&version=2} status=0 QTime=2 
[junit4:junit4]   2> 10807 T1439 C121 P37653 UPDATE [collection1] webapp=/solr path=/update params={wt=javabin&version=2} {add=[121]} 0 6
[junit4:junit4]   2> 10828 T1412 C118 P37630 UPDATE [collection1] webapp=/solr path=/update params={wt=javabin&version=2} {add=[122 (1412324643259285504)]} 0 17
[junit4:junit4]   2> 10854 T1438 C121 P37653 REQ [collection1] webapp=/solr path=/update params={distrib.from=http://127.0.0.1:37655/solr/collection1/&update.distrib=TOLEADER&wt=javabin&version=2} status=0 QTime=16 
[junit4:junit4]   2> 10857 T1451 C120 P37655 UPDATE [collection1] webapp=/solr path=/update params={wt=javabin&version=2} {add=[122]} 0 22
[junit4:junit4]   2> 10864 T1412 C118 P37630 UPDATE [collection1] webapp=/solr path=/update params={wt=javabin&version=2} {add=[123 (1412324643311714304)]} 0 4
[junit4:junit4]   2> 10870 T1426 C119 P37651 UPDATE [collection1] webapp=/solr path=/update params={wt=javabin&version=2} {add=[123 (1412324643319054336)]} 0 2
[junit4:junit4]   2> 10877 T1412 C118 P37630 UPDATE [collection1] webapp=/solr path=/update params={wt=javabin&version=2} {add=[124 (1412324643327442944)]} 0 2
[junit4:junit4]   2> 10885 T1427 C119 P37651 REQ [collection1] webapp=/solr path=/update params={distrib.from=http://127.0.0.1:37653/solr/collection1/&update.distrib=TOLEADER&wt=javabin&version=2} status=0 QTime=2 
[junit4:junit4]   2> 10886 T1439 C121 P37653 UPDATE [collection1] webapp=/solr path=/update params={wt=javabin&version=2} {add=[124]} 0 6
[junit4:junit4]   2> 10891 T1412 C118 P37630 UPDATE [collection1] webapp=/solr path=/update params={wt=javabin&version=2} {add=[125 (1412324643341074432)]} 0 2
[junit4:junit4]   2> 10900 T1438 C121 P37653 REQ [collection1] webapp=/solr path=/update params={distrib.from=http://127.0.0.1:37655/solr/collection1/&update.distrib=TOLEADER&wt=javabin&version=2} status=0 QTime=3 
[junit4:junit4]   2> 10901 T1451 C120 P37655 UPDATE [collection1] webapp=/solr path=/update params={wt=javabin&version=2} {add=[125]} 0 7
[junit4:junit4]   2> 10906 T1412 C118 P37630 UPDATE [collection1] webapp=/solr path=/update params={wt=javabin&version=2} {add=[126 (1412324643357851648)]} 0 2
[junit4:junit4]   2> 10914 T1450 C120 P37655 REQ [collection1] webapp=/solr path=/update params={distrib.from=http://127.0.0.1:37651/solr/collection1/&update.distrib=TOLEADER&wt=javabin&version=2} status=0 QTime=2 
[junit4:junit4]   2> 10915 T1426 C119 P37651 UPDATE [collection1] webapp=/solr path=/update params={wt=javabin&version=2} {add=[126]} 0 6
[junit4:junit4]   2> 10922 T1412 C118 P37630 UPDATE [collection1] webapp=/solr path=/update params={wt=javabin&version=2} {add=[127 (1412324643373580288)]} 0 3
[junit4:junit4]   2> 10942 T1450 C120 P37655 REQ [collection1] webapp=/solr path=/update params={distrib.from=http://127.0.0.1:37653/solr/collection1/&update.distrib=TOLEADER&wt=javabin&version=2} status=0 QTime=14 
[junit4:junit4]   2> 10943 T1439 C121 P37653 UPDATE [collection1] webapp=/solr path=/update params={wt=javabin&version=2} {add=[127]} 0 18
[junit4:junit4]   2> 10950 T1412 C118 P37630 UPDATE [collection1] webapp=/solr path=/update params={wt=javabin&version=2} {add=[128 (1412324643402940416)]} 0 3
[junit4:junit4]   2> 10958 T1451 C120 P37655 UPDATE [collection1] webapp=/solr path=/update params={wt=javabin&version=2} {add=[128 (1412324643409231872)]} 0 5
[junit4:junit4]   2> 10965 T1412 C118 P37630 UPDATE [collection1] webapp=/solr path=/update params={wt=javabin&version=2} {add=[129 (1412324643418669056)]} 0 3
[junit4:junit4]   2> 10976 T1438 C121 P37653 REQ [collection1] webapp=/solr path=/update params={distrib.from=http://127.0.0.1:37651/solr/collection1/&update.distrib=TOLEADER&wt=javabin&version=2} status=0 QTime=3 
[junit4:junit4]   2> 10977 T1426 C119 P37651 UPDATE [collection1] webapp=/solr path=/update params={wt=javabin&version=2} {add=[129]} 0 7
[junit4:junit4]   2> 10984 T1412 C118 P37630 UPDATE [collection1] webapp=/solr path=/update params={wt=javabin&version=2} {add=[130 (1412324643438592000)]} 0 3
[junit4:junit4]   2> 10991 T1439 C121 P37653 UPDATE [collection1] webapp=/solr path=/update params={wt=javabin&version=2} {add=[130 (1412324643445932032)]} 0 2
[junit4:junit4]   2> 10998 T1412 C118 P37630 UPDATE [collection1] webapp=/solr path=/update params={wt=javabin&version=2} {add=[131 (1412324643453272064)]} 0 3
[junit4:junit4]   2> 11003 T1451 C120 P37655 UPDATE [collection1] webapp=/solr path=/update params={wt=javabin&version=2} {add=[131 (1412324643459563520)]} 0 2
[junit4:junit4]   2> 11027 T1412 C118 P37630 UPDATE [collection1] webapp=/solr path=/update params={wt=javabin&version=2} {add=[132 (1412324643469000704)]} 0 16
[junit4:junit4]   2> 11046 T1426 C119 P37651 UPDATE [collection1] webapp=/solr path=/update params={wt=javabin&version=2} {add=[132 (1412324643503603712)]} 0 3
[junit4:junit4]   2> 11054 T1412 C118 P37630 UPDATE [collection1] webapp=/solr path=/update params={wt=javabin&version=2} {add=[133 (1412324643510943744)]} 0 4
[junit4:junit4]   2> 11063 T1439 C121 P37653 UPDATE [collection1] webapp=/solr path=/update params={wt=javabin&version=2} {add=[133 (1412324643521429504)]} 0 2
[junit4:junit4]   2> 11084 T1412 C118 P37630 UPDATE [collection1] webapp=/solr path=/update params={wt=javabin&version=2} {add=[134 (1412324643543449600)]} 0 3
[junit4:junit4]   2> 11092 T1438 C121 P37653 REQ [collection1] webapp=/solr path=/update params={distrib.from=http://127.0.0.1:37655/solr/collection1/&update.distrib=TOLEADER&wt=javabin&version=2} status=0 QTime=2 
[junit4:junit4]   2> 11093 T1451 C120 P37655 UPDATE [collection1] webapp=/solr path=/update params={wt=javabin&version=2} {add=[134]} 0 6
[junit4:junit4]   2> 11098 T1412 C118 P37630 UPDATE [collection1] webapp=/solr path=/update params={wt=javabin&version=2} {add=[135 (1412324643559178240)]} 0 2
[junit4:junit4]   2> 11104 T1426 C119 P37651 UPDATE [collection1] webapp=/solr path=/update params={wt=javabin&version=2} {add=[135 (1412324643564421120)]} 0 3
[junit4:junit4]   2> 11109 T1412 C118 P37630 UPDATE [collection1] webapp=/solr path=/update params={wt=javabin&version=2} {add=[136 (1412324643570712576)]} 0 2
[junit4:junit4]   2> 11118 T1450 C120 P37655 REQ [collection1] webapp=/solr path=/update params={distrib.from=http://127.0.0.1:37653/solr/collection1/&update.distrib=TOLEADER&wt=javabin&version=2} status=0 QTime=2 
[junit4:junit4]   2> 11119 T1439 C121 P37653 UPDATE [collection1] webapp=/solr path=/update params={wt=javabin&version=2} {add=[136]} 0 6
[junit4:junit4]   2> 11124 T1412 C118 P37630 UPDATE [collection1] webapp=/solr path=/update params={wt=javabin&version=2} {add=[137 (1412324643586441216)]} 0 2
[junit4:junit4]   2> 11130 T1451 C120 P37655 UPDATE [collection1] webapp=/solr path=/update params={wt=javabin&version=2} {add=[137 (1412324643592732672)]} 0 2
[junit4:junit4]   2> 11138 T1412 C118 P37630 UPDATE [collection1] webapp=/solr path=/update params={wt=javabin&version=2} {add=[138 (1412324643599024128)]} 0 4
[junit4:junit4]   2> 11143 T1426 C119 P37651 UPDATE [collection1] webapp=/solr path=/update params={wt=javabin&version=2} {add=[138 (1412324643605315584)]} 0 2
[junit4:junit4]   2> 11148 T1412 C118 P37630 UPDATE [collection1] webapp=/solr path=/update params={wt=javabin&version=2} {add=[139 (1412324643610558464)]} 0 2
[junit4:junit4]   2> 11155 T1450 C120 P37655 REQ [collection1] webapp=/solr path=/update params={distrib.from=http://127.0.0.1:37653/solr/collection1/&update.distrib=TOLEADER&wt=javabin&version=2} status=0 QTime=2 
[junit4:junit4]   2> 11156 T1439 C121 P37653 UPDATE [collection1] webapp=/solr path=/update params={wt=javabin&version=2} {add=[139]} 0 6
[junit4:junit4]   2> 11162 T1412 C118 P37630 UPDATE [collection1] webapp=/solr path=/update params={wt=javabin&version=2} {add=[140 (1412324643625238528)]} 0 3
[junit4:junit4]   2> 11171 T1438 C121 P37653 REQ [collection1] webapp=/solr path=/update params={distrib.from=http://127.0.0.1:37655/solr/collection1/&update.distrib=TOLEADER&wt=javabin&version=2} status=0 QTime=3 
[junit4:junit4]   2> 11172 T1451 C120 P37655 UPDATE [collection1] webapp=/solr path=/update params={wt=javabin&version=2} {add=[140]} 0 7
[junit4:junit4]   2> 11178 T1412 C118 P37630 UPDATE [collection1] webapp=/solr path=/update params={wt=javabin&version=2} {add=[141 (1412324643642015744)]} 0 3
[junit4:junit4]   2> 11187 T1438 C121 P37653 REQ [collection1] webapp=/solr path=/update params={distrib.from=http://127.0.0.1:37651/solr/collection1/&update.distrib=TOLEADER&wt=javabin&version=2} status=0 QTime=3 
[junit4:junit4]   2> 11188 T1426 C119 P37651 UPDATE [collection1] webapp=/solr path=/update params={wt=javabin&version=2} {add=[141]} 0 7
[junit4:junit4]   2> 11204 T1412 C118 P37630 UPDATE [collection1] webapp=/solr path=/update params={wt=javabin&version=2} {add=[142 (1412324643658792960)]} 0 13
[junit4:junit4]   2> 11215 T1450 C120 P37655 REQ [collection1] webapp=/solr path=/update params={distrib.from=http://127.0.0.1:37653/solr/collection1/&update.distrib=TOLEADER&wt=javabin&version=2} status=0 QTime=2 
[junit4:junit4]   2> 11216 T1439 C121 P37653 UPDATE [collection1] webapp=/solr path=/update params={wt=javabin&version=2} {add=[142]} 0 7
[junit4:junit4]   2> 11224 T1412 C118 P37630 UPDATE [collection1] webapp=/solr path=/update params={wt=javabin&version=2} {add=[143 (1412324643689201664)]} 0 4
[junit4:junit4]   2> 11233 T1438 C121 P37653 REQ [collection1] webapp=/solr path=/update params={distrib.from=http://127.0.0.1:37655/solr/collection1/&update.distrib=TOLEADER&wt=javabin&version=2} status=0 QTime=2 
[junit4:junit4]   2> 11234 T1451 C120 P37655 UPDATE [collection1] webapp=/solr path=/update params={wt=javabin&version=2} {add=[143]} 0 6
[junit4:junit4]   2> 11239 T1412 C118 P37630 UPDATE [collection1] webapp=/solr path=/update params={wt=javabin&version=2} {add=[144 (1412324643707027456)]} 0 2
[junit4:junit4]   2> 11260 T1438 C121 P37653 REQ [collection1] webapp=/solr path=/update params={distrib.from=http://127.0.0.1:37651/solr/collection1/&update.distrib=TOLEADER&wt=javabin&version=2} status=0 QTime=3 
[junit4:junit4]   2> 11261 T1426 C119 P37651 UPDATE [collection1] webapp=/solr path=/update params={wt=javabin&version=2} {add=[144]} 0 6
[junit4:junit4]   2> 11268 T1412 C118 P37630 UPDATE [collection1] webapp=/solr path=/update params={wt=javabin&version=2} {add=[145 (1412324643736387584)]} 0 2
[junit4:junit4]   2> 11278 T1450 C120 P37655 REQ [collection1] webapp=/solr path=/update params={distrib.from=http://127.0.0.1:37653/solr/collection1/&update.distrib=TOLEADER&wt=javabin&version=2} status=0 QTime=2 
[junit4:junit4]   2> 11279 T1439 C121 P37653 UPDATE [collection1] webapp=/solr path=/update params={wt=javabin&version=2} {add=[145]} 0 7
[junit4:junit4]   2> 11286 T1412 C118 P37630 UPDATE [collection1] webapp=/solr path=/update params={wt=javabin&version=2} {add=[146 (1412324643755261952)]} 0 3
[junit4:junit4]   2> 11309 T1438 C121 P37653 REQ [collection1] webapp=/solr path=/update params={distrib.from=http://127.0.0.1:37655/solr/collection1/&update.distrib=TOLEADER&wt=javabin&version=2} status=0 QTime=16 
[junit4:junit4]   2> 11310 T1451 C120 P37655 UPDATE [collection1] webapp=/solr path=/update params={wt=javabin&version=2} {add=[146]} 0 20
[junit4:junit4]   2> 11317 T1412 C118 P37630 UPDATE [collection1] webapp=/solr path=/update params={wt=javabin&version=2} {add=[147 (1412324643787767808)]} 0 3
[junit4:junit4]   2> 11326 T1450 C120 P37655 REQ [collection1] webapp=/solr path=/update params={distrib.from=http://127.0.0.1:37651/solr/collection1/&update.distrib=TOLEADER&wt=javabin&version=2} status=0 QTime=2 
[junit4:junit4]   2> 11327 T1426 C119 P37651 UPDATE [collection1] webapp=/solr path=/update params={wt=javabin&version=2} {add=[147]} 0 7
[junit4:junit4]   2> 11333 T1412 C118 P37630 UPDATE [collection1] webapp=/solr path=/update params={wt=javabin&version=2} {add=[148 (1412324643804545024)]} 0 2
[junit4:junit4]   2> 11430 T1427 C119 P37651 REQ [collection1] webapp=/solr path=/update params={distrib.from=http://127.0.0.1:37653/solr/collection1/&update.distrib=TOLEADER&wt=javabin&version=2} status=0 QTime=3 
[junit4:junit4]   2> 11431 T1439 C121 P37653 UPDATE [collection1] webapp=/solr path=/update params={wt=javabin&version=2} {add=[148]} 0 7
[junit4:junit4]   2> 11436 T1412 C118 P37630 UPDATE [collection1] webapp=/solr path=/update params={wt=javabin&version=2} {add=[149 (1412324643913596928)]} 0 2
[junit4:junit4]   2> 11445 T1451 C120 P37655 UPDATE [collection1] webapp=/solr path=/update params={wt=javabin&version=2} {add=[149 (1412324643923034112)]} 0 2
[junit4:junit4]   2> 11448 T1412 C118 P37630 oasu.DirectUpdateHandler2.commit start commit{flags=0,_version_=0,optimize=false,openSearcher=true,waitSearcher=true,expungeDeletes=false,softCommit=false}
[junit4:junit4]   2> 12068 T1412 C118 P37630 oasc.SolrDeletionPolicy.onCommit SolrDeletionPolicy.onCommit: commits:num=2
[junit4:junit4]   2> 		commit{dir=NRTCachingDirectory(org.apache.lucene.store.NIOFSDirectory@/usr/home/hudson/hudson-slave/workspace/Lucene-Solr-Tests-4.x-java7/solr/build/solr-core/test-files/control1/collection1/data/index lockFactory=org.apache.lucene.store.NativeFSLockFactory@4ae35a2; maxCacheMB=48.0 maxMergeSizeMB=4.0),segFN=segments_1,generation=1,filenames=[segments_1]
[junit4:junit4]   2> 		commit{dir=NRTCachingDirectory(org.apache.lucene.store.NIOFSDirectory@/usr/home/hudson/hudson-slave/workspace/Lucene-Solr-Tests-4.x-java7/solr/build/solr-core/test-files/control1/collection1/data/index lockFactory=org.apache.lucene.store.NativeFSLockFactory@4ae35a2; maxCacheMB=48.0 maxMergeSizeMB=4.0),segFN=segments_2,generation=2,filenames=[_5_nrm.cfe, _5_Memory_0.ram, _2_SimpleText_0.pst, _3_MockVariableIntBlock_0.frq, _3.fdt, _4_MockVariableIntBlock_0.tii, _0_Pulsing40_0.frq, _0_SimpleText_0.pst, _5_MockVariableIntBlock_0.tii, _5_Pulsing40_0.tip, _6_MockVariableIntBlock_0.tii, _5_Pulsing40_0.tim, _6_MockVariableIntBlock_0.tib, _0_Pulsing40_0.tim, _0_Memory_0.ram, _1_MockVariableIntBlock_0.tii, _4_MockVariableIntBlock_0.doc, _2.fdt, _3_Pulsing40_0.tip, _2.fdx, _3_Pulsing40_0.tim, _1_MockVariableIntBlock_0.tib, _1.fdx, _4_MockVariableIntBlock_0.tib, _5_nrm.cfs, _1.fdt, _0_MockVariableIntBlock_0.frq, _3.si, _6.fdt, _2_MockVariableIntBlock_0.skp, _1_SimpleText_0.pst, _6_Memory_0.ram, _2.si, _1_MockVariableIntBlock_0.skp, _3_Pulsing40_0.frq, _2_Pulsing40_0.tim, _2_MockVariableIntBlock_0.pyl, _0_MockVariableIntBlock_0.doc, _6.fdx, _2_Pulsing40_0.tip, _1_MockVariableIntBlock_0.pyl, _3.fnm, _2_MockVariableIntBlock_0.doc, _3_MockVariableIntBlock_0.tii, _0_MockVariableIntBlock_0.pyl, _4_Pulsing40_0.prx, _1_Memory_0.ram, _2_nrm.cfe, _5_Pulsing40_0.frq, _1_MockVariableIntBlock_0.doc, _0_Pulsing40_0.tip, _0_MockVariableIntBlock_0.pos, _2_nrm.cfs, _2_MockVariableIntBlock_0.tii, _5_MockVariableIntBlock_0.tib, _2_MockVariableIntBlock_0.tib, _1_MockVariableIntBlock_0.pos, _4_MockVariableIntBlock_0.frq, _5_MockVariableIntBlock_0.frq, _2.fnm, _3.fdx, _4_Pulsing40_0.tip, _4_Pulsing40_0.tim, _5_Pulsing40_0.prx, _1.si, _3_MockVariableIntBlock_0.pyl, _6.si, _6.fnm, _3_MockVariableIntBlock_0.pos, _3_nrm.cfe, _5.fdt, _1_Pulsing40_0.tip, _6_Pulsing40_0.frq, _5_MockVariableIntBlock_0.pyl, _1_Pulsing40_0.tim, _4.fnm, _4_nrm.cfe, _0_MockVariableIntBlock_0.skp, _0_Pulsing40_0.prx, _1.fnm, _1_Pulsing40_0.frq, _4.fdx, _3_SimpleText_0.pst, _6_Pulsing40_0.tim, _1_Pulsing40_0.prx, _6_Pulsing40_0.tip, _6_MockVariableIntBlock_0.frq, _6_MockVariableIntBlock_0.doc, _2_Pulsing40_0.prx, _2_MockVariableIntBlock_0.pos, _5_MockVariableIntBlock_0.pos, _0.fnm, _3_MockVariableIntBlock_0.doc, _2_Pulsing40_0.frq, _5.si, _3_nrm.cfs, _4_MockVariableIntBlock_0.pyl, _6_Pulsing40_0.prx, _4_Memory_0.ram, _4_nrm.cfs, _3_MockVariableIntBlock_0.tib, _5_MockVariableIntBlock_0.doc, _6_MockVariableIntBlock_0.pyl, _2_MockVariableIntBlock_0.frq, _6_nrm.cfs, _4_MockVariableIntBlock_0.skp, _0_MockVariableIntBlock_0.tib, _5_MockVariableIntBlock_0.skp, _6_MockVariableIntBlock_0.pos, _4_MockVariableIntBlock_0.pos, _2_Memory_0.ram, _0.si, _3_Memory_0.ram, _0_MockVariableIntBlock_0.tii, _5_SimpleText_0.pst, _1_nrm.cfs, _5.fnm, _6_nrm.cfe, _0_nrm.cfs, _4.fdt, _4.si, _6_MockVariableIntBlock_0.skp, _6_SimpleText_0.pst, _1_nrm.cfe, _1_MockVariableIntBlock_0.frq, _4_SimpleText_0.pst, _3_Pulsing40_0.prx, _4_Pulsing40_0.frq, _0_nrm.cfe, _5.fdx, segments_2, _0.fdx, _3_MockVariableIntBlock_0.skp, _0.fdt]
[junit4:junit4]   2> 12069 T1412 C118 P37630 oasc.SolrDeletionPolicy.updateCommits newest commit = 2
[junit4:junit4]   2> 12084 T1412 C118 P37630 oass.SolrIndexSearcher.<init> Opening Searcher@1ff8c28a main
[junit4:junit4]   2> 12085 T1412 C118 P37630 oasu.DirectUpdateHandler2.commit end_commit_flush
[junit4:junit4]   2> 12086 T1423 oasc.SolrCore.registerSearcher [collection1] Registered new searcher Searcher@1ff8c28a main{StandardDirectoryReader(segments_2:15:nrt _0(4.0.0.2):C10 _1(4.0.0.2):C10 _2(4.0.0.2):C10 _3(4.0.0.2):C10 _4(4.0.0.2):C10 _5(4.0.0.2):C10 _6(4.0.0.2):C7)}
[junit4:junit4]   2> 12088 T1412 C118 P37630 UPDATE [collection1] webapp=/solr path=/update params={waitSearcher=true&wt=javabin&commit=true&softCommit=false&version=2} {commit=} 0 640
[junit4:junit4]   2> 12091 T1426 C119 P37651 oasu.DirectUpdateHandler2.commit start commit{flags=0,_version_=0,optimize=false,openSearcher=true,waitSearcher=true,expungeDeletes=false,softCommit=false}
[junit4:junit4]   2> 12279 T1426 C119 P37651 oasc.SolrDeletionPolicy.onCommit SolrDeletionPolicy.onCommit: commits:num=2
[junit4:junit4]   2> 		commit{dir=NRTCachingDirectory(org.apache.lucene.store.NIOFSDirectory@/usr/home/hudson/hudson-slave/workspace/Lucene-Solr-Tests-4.x-java7/solr/build/solr-core/test-files/jetty2/collection1/data/index lockFactory=org.apache.lucene.store.NativeFSLockFactory@4e12fc8; maxCacheMB=48.0 maxMergeSizeMB=4.0),segFN=segments_1,generation=1,filenames=[segments_1]
[junit4:junit4]   2> 		commit{dir=NRTCachingDirectory(org.apache.lucene.store.NIOFSDirectory@/usr/home/hudson/hudson-slave/workspace/Lucene-Solr-Tests-4.x-java7/solr/build/solr-core/test-files/jetty2/collection1/data/index lockFactory=org.apache.lucene.store.NativeFSLockFactory@4e12fc8; maxCacheMB=48.0 maxMergeSizeMB=4.0),segFN=segments_2,generation=2,filenames=[_1_MockVariableIntBlock_0.skp, _1_Pulsing40_0.tip, _0_MockVariableIntBlock_0.doc, _1_Pulsing40_0.tim, _1_MockVariableIntBlock_0.pyl, _0_MockVariableIntBlock_0.skp, _0_Pulsing40_0.prx, _1.fnm, _0_Pulsing40_0.frq, _1_Pulsing40_0.frq, _0_MockVariableIntBlock_0.pyl, _1_Memory_0.ram, _0_MockVariableIntBlock_0.tib, _1_MockVariableIntBlock_0.doc, _1_Pulsing40_0.prx, _0_SimpleText_0.pst, _0_Pulsing40_0.tip, _0_MockVariableIntBlock_0.pos, _0.si, _0_MockVariableIntBlock_0.tii, _1_nrm.cfs, _0_Pulsing40_0.tim, _0.fnm, _0_Memory_0.ram, _1_MockVariableIntBlock_0.tii, _1_MockVariableIntBlock_0.pos, _0_nrm.cfs, _1_MockVariableIntBlock_0.tib, _1_nrm.cfe, _1_MockVariableIntBlock_0.frq, _1.fdx, _1.fdt, _1.si, _0_nrm.cfe, _0_MockVariableIntBlock_0.frq, segments_2, _0.fdx, _0.fdt, _1_SimpleText_0.pst]
[junit4:junit4]   2> 12280 T1426 C119 P37651 oasc.SolrDeletionPolicy.updateCommits newest commit = 2
[junit4:junit4]   2> 12292 T1426 C119 P37651 oass.SolrIndexSearcher.<init> Opening Searcher@5101200d main
[junit4:junit4]   2> 12293 T1426 C119 P37651 oasu.DirectUpdateHandler2.commit end_commit_flush
[junit4:junit4]   2> 12296 T1435 oasc.SolrCore.registerSearcher [collection1] Registered new searcher Searcher@5101200d main{StandardDirectoryReader(segments_2:5:nrt _0(4.0.0.2):C10 _1(4.0.0.2):C8)}
[junit4:junit4]   2> 12297 T1426 C119 P37651 oasu.SolrCmdDistributor.distribCommit Distrib commit to:[StdNode: http://127.0.0.1:37653/solr/collection1/, StdNode: http://127.0.0.1:37655/solr/collection1/]
[junit4:junit4]   2> 12301 T1438 C121 P37653 oasu.DirectUpdateHandler2.commit start commit{flags=0,_version_=0,optimize=false,openSearcher=true,waitSearcher=true,expungeDeletes=false,softCommit=false}
[junit4:junit4]   2> 12301 T1450 C120 P37655 oasu.DirectUpdateHandler2.commit start commit{flags=0,_version_=0,optimize=false,openSearcher=true,waitSearcher=true,expungeDeletes=false,softCommit=false}
[junit4:junit4]   2> 12902 T1450 C120 P37655 oasc.SolrDeletionPolicy.onCommit SolrDeletionPolicy.onCommit: commits:num=2
[junit4:junit4]   2> 		commit{dir=NRTCachingDirectory(org.apache.lucene.store.NIOFSDirectory@/usr/home/hudson/hudson-slave/workspace/Lucene-Solr-Tests-4.x-java7/solr/build/solr-core/test-files/jetty4/collection1/data/index lockFactory=org.apache.lucene.store.NativeFSLockFactory@68dbb0b3; maxCacheMB=48.0 maxMergeSizeMB=4.0),segFN=segments_1,generation=1,filenames=[segments_1]
[junit4:junit4]   2> 		commit{dir=NRTCachingDirectory(org.apache.lucene.store.NIOFSDirectory@/usr/home/hudson/hudson-slave/workspace/Lucene-Solr-Tests-4.x-java7/solr/build/solr-core/test-files/jetty4/collection1/data/index lockFactory=org.apache.lucene.store.NativeFSLockFactory@68dbb0b3; maxCacheMB=48.0 maxMergeSizeMB=4.0),segFN=segments_2,generation=2,filenames=[_1_MockVariableIntBlock_0.skp, _1_Pulsing40_0.tip, _0_MockVariableIntBlock_0.doc, _1_Pulsing40_0.tim, _1_MockVariableIntBlock_0.pyl, _0_MockVariableIntBlock_0.skp, _0_Pulsing40_0.prx, _1.fnm, _0_Pulsing40_0.frq, _1_Pulsing40_0.frq, _0_MockVariableIntBlock_0.pyl, _1_Memory_0.ram, _0_MockVariableIntBlock_0.tib, _1_MockVariableIntBlock_0.doc, _1_Pulsing40_0.prx, _0_SimpleText_0.pst, _0_Pulsing40_0.tip, _0_MockVariableIntBlock_0.pos, _0.si, _0_MockVariableIntBlock_0.tii, _1_nrm.cfs, _0_Pulsing40_0.tim, _0.fnm, _0_Memory_0.ram, _1_MockVariableIntBlock_0.tii, _1_MockVariableIntBlock_0.pos, _0_nrm.cfs, _1_MockVariableIntBlock_0.tib, _1_nrm.cfe, _1_MockVariableIntBlock_0.frq, _1.fdx, _1.fdt, _1.si, _0_nrm.cfe, _0_MockVariableIntBlock_0.frq, segments_2, _0.fdx, _0.fdt, _1_SimpleText_0.pst]
[junit4:junit4]   2> 12902 T1450 C120 P37655 oasc.SolrDeletionPolicy.updateCommits newest commit = 2
[junit4:junit4]   2> 12912 T1450 C120 P37655 oass.SolrIndexSearcher.<init> Opening Searcher@2d35ff1b main
[junit4:junit4]   2> 12913 T1450 C120 P37655 oasu.DirectUpdateHandler2.commit end_commit_flush
[junit4:junit4]   2> 12915 T1459 oasc.SolrCore.registerSearcher [collection1] Registered new searcher Searcher@2d35ff1b main{StandardDirectoryReader(segments_2:5:nrt _0(4.0.0.2):C10 _1(4.0.0.2):C9)}
[junit4:junit4]   2> 12916 T1450 C120 P37655 UPDATE [collection1] webapp=/solr path=/update params={waitSearcher=true&commit=true&wt=javabin&commit_end_point=true&softCommit=false&version=2} {commit=} 0 616
[junit4:junit4]   2> 12972 T1438 C121 P37653 oasc.SolrDeletionPolicy.onCommit SolrDeletionPolicy.onCommit: commits:num=2
[junit4:junit4]   2> 		commit{dir=NRTCachingDirectory(org.apache.lucene.store.NIOFSDirectory@/usr/home/hudson/hudson-slave/workspace/Lucene-Solr-Tests-4.x-java7/solr/build/solr-core/test-files/jetty3/collection1/data/index lockFactory=org.apache.lucene.store.NativeFSLockFactory@5dac7392; maxCacheMB=48.0 maxMergeSizeMB=4.0),segFN=segments_1,generation=1,filenames=[segments_1]
[junit4:junit4]   2> 		commit{dir=NRTCachingDirectory(org.apache.lucene.store.NIOFSDirectory@/usr/home/hudson/hudson-slave/workspace/Lucene-Solr-Tests-4.x-java7/solr/build/solr-core/test-files/jetty3/collection1/data/index lockFactory=org.apache.lucene.store.NativeFSLockFactory@5dac7392; maxCacheMB=48.0 maxMergeSizeMB=4.0),segFN=segments_2,generation=2,filenames=[_1_Pulsing40_0.tip, _2_SimpleText_0.pst, _1_Pulsing40_0.tim, _0_MockVariableIntBlock_0.skp, _0_Pulsing40_0.prx, _0_Pulsing40_0.frq, _1.fnm, _1_Pulsing40_0.frq, _1_Pulsing40_0.prx, _0_SimpleText_0.pst, _2_Pulsing40_0.prx, _2_MockVariableIntBlock_0.pos, _0.fnm, _0_Pulsing40_0.tim, _1_MockVariableIntBlock_0.tii, _0_Memory_0.ram, _2.fdt, _2.fdx, _2_Pulsing40_0.frq, _1_MockVariableIntBlock_0.tib, _1.fdx, _1.fdt, _0_MockVariableIntBlock_0.frq, _2_MockVariableIntBlock_0.skp, _1_SimpleText_0.pst, _1_MockVariableIntBlock_0.skp, _2.si, _2_Pulsing40_0.tim, _2_MockVariableIntBlock_0.pyl, _0_MockVariableIntBlock_0.doc, _2_Pulsing40_0.tip, _1_MockVariableIntBlock_0.pyl, _2_MockVariableIntBlock_0.frq, _2_MockVariableIntBlock_0.doc, _0_MockVariableIntBlock_0.pyl, _2_nrm.cfe, _1_Memory_0.ram, _0_MockVariableIntBlock_0.tib, _1_MockVariableIntBlock_0.doc, _0_MockVariableIntBlock_0.pos, _0_Pulsing40_0.tip, _2_Memory_0.ram, _2_nrm.cfs, _0.si, _0_MockVariableIntBlock_0.tii, _1_nrm.cfs, _2_MockVariableIntBlock_0.tii, _2_MockVariableIntBlock_0.tib, _1_MockVariableIntBlock_0.pos, _0_nrm.cfs, _2.fnm, _1_nrm.cfe, _1_MockVariableIntBlock_0.frq, _1.si, _0_nrm.cfe, segments_2, _0.fdx, _0.fdt]
[junit4:junit4]   2> 12974 T1438 C121 P37653 oasc.SolrDeletionPolicy.updateCommits newest commit = 2
[junit4:junit4]   2> 12984 T1438 C121 P37653 oass.SolrIndexSearcher.<init> Opening Searcher@15c848fe main
[junit4:junit4]   2> 12985 T1438 C121 P37653 oasu.DirectUpdateHandler2.commit end_commit_flush
[junit4:junit4]   2> 12986 T1447 oasc.SolrCore.registerSearcher [collection1] Registered new searcher Searcher@15c848fe main{StandardDirectoryReader(segments_2:7:nrt _0(4.0.0.2):C10 _1(4.0.0.2):C10 _2(4.0.0.2):C10)}
[junit4:junit4]   2> 12987 T1438 C121 P37653 UPDATE [collection1] webapp=/solr path=/update params={waitSearcher=true&commit=true&wt=javabin&commit_end_point=true&softCommit=false&version=2} {commit=} 0 687
[junit4:junit4]   2> 12988 T1426 C119 P37651 UPDATE [collection1] webapp=/solr path=/update params={waitSearcher=true&wt=javabin&commit=true&softCommit=false&version=2} {commit=} 0 897
[junit4:junit4]   2> 12991 T1439 C121 P37653 oasu.DirectUpdateHandler2.commit start commit{flags=0,_version_=0,optimize=false,openSearcher=true,waitSearcher=true,expungeDeletes=false,softCommit=false}
[junit4:junit4]   2> 12993 T1439 C121 P37653 oass.SolrIndexSearcher.<init> Opening Searcher@5b76cfdd main
[junit4:junit4]   2> 12993 T1439 C121 P37653 oasu.DirectUpdateHandler2.commit end_commit_flush
[junit4:junit4]   2> 12995 T1447 oasc.SolrCore.registerSearcher [collection1] Registered new searcher Searcher@5b76cfdd main{StandardDirectoryReader(segments_2:7:nrt _0(4.0.0.2):C10 _1(4.0.0.2):C10 _2(4.0.0.2):C10)}
[junit4:junit4]   2> 12996 T1439 C121 P37653 oasu.SolrCmdDistributor.distribCommit Distrib commit to:[StdNode: http://127.0.0.1:37651/solr/collection1/, StdNode: http://127.0.0.1:37655/solr/collection1/]
[junit4:junit4]   2> 12999 T1427 C119 P37651 oasu.DirectUpdateHandler2.commit start commit{flags=0,_version_=0,optimize=false,openSearcher=true,waitSearcher=true,expungeDeletes=false,softCommit=false}
[junit4:junit4]   2> 12999 T1450 C120 P37655 oasu.DirectUpdateHandler2.commit start commit{flags=0,_version_=0,optimize=false,openSearcher=true,waitSearcher=true,expungeDeletes=false,softCommit=false}
[junit4:junit4]   2> 13002 T1427 C119 P37651 oass.SolrIndexSearcher.<init> Opening Searcher@552a82ec main
[junit4:junit4]   2> 13002 T1450 C120 P37655 oass.SolrIndexSearcher.<init> Opening Searcher@b2a92d4 main
[junit4:junit4]   2> 13002 T1427 C119 P37651 oasu.DirectUpdateHandler2.commit end_commit_flush
[junit4:junit4]   2> 13002 T1450 C120 P37655 oasu.DirectUpdateHandler2.commit end_commit_flush
[junit4:junit4]   2> 13003 T1459 oasc.JmxMonitoredMap.put WARNING Failed to register info bean: searcher javax.management.InstanceNotFoundException: solr/collection1:type=searcher,id=org.apache.solr.search.SolrIndexSearcher
[junit4:junit4]   2> 	at com.sun.jmx.interceptor.DefaultMBeanServerInterceptor.getMBean(DefaultMBeanServerInterceptor.java:1095)
[junit4:junit4]   2> 	at com.sun.jmx.interceptor.DefaultMBeanServerInterceptor.exclusiveUnregisterMBean(DefaultMBeanServerInterceptor.java:427)
[junit4:junit4]   2> 	at com.sun.jmx.interceptor.DefaultMBeanServerInterceptor.unregisterMBean(DefaultMBeanServerInterceptor.java:415)
[junit4:junit4]   2> 	at com.sun.jmx.mbeanserver.JmxMBeanServer.unregisterMBean(JmxMBeanServer.java:536)
[junit4:junit4]   2> 	at org.apache.solr.core.JmxMonitoredMap.put(JmxMonitoredMap.java:138)
[junit4:junit4]   2> 	at org.apache.solr.core.JmxMonitoredMap.put(JmxMonitoredMap.java:51)
[junit4:junit4]   2> 	at org.apache.solr.search.SolrIndexSearcher.register(SolrIndexSearcher.java:242)
[junit4:junit4]   2> 	at org.apache.solr.core.SolrCore.registerSearcher(SolrCore.java:1634)
[junit4:junit4]   2> 	at org.apache.solr.core.SolrCore.access$000(SolrCore.java:121)
[junit4:junit4]   2> 	at org.apache.solr.core.SolrCore$7.call(SolrCore.java:1511)
[junit4:junit4]   2> 	at java.util.concurrent.FutureTask$Sync.innerRun(FutureTask.java:334)
[junit4:junit4]   2> 	at java.util.concurrent.FutureTask.run(FutureTask.java:166)
[junit4:junit4]   2> 	at java.util.concurrent.ThreadPoolExecutor.runWorker(ThreadPoolExecutor.java:1110)
[junit4:junit4]   2> 	at java.util.concurrent.ThreadPoolExecutor$Worker.run(ThreadPoolExecutor.java:603)
[junit4:junit4]   2> 	at java.lang.Thread.run(Thread.java:722)
[junit4:junit4]   2> 
[junit4:junit4]   2> 13004 T1435 oasc.SolrCore.registerSearcher [collection1] Registered new searcher Searcher@552a82ec main{StandardDirectoryReader(segments_2:5:nrt _0(4.0.0.2):C10 _1(4.0.0.2):C8)}
[junit4:junit4]   2> 13006 T1427 C119 P37651 UPDATE [collection1] webapp=/solr path=/update params={waitSearcher=true&commit=true&wt=javabin&commit_end_point=true&softCommit=false&version=2} {commit=} 0 7
[junit4:junit4]   2> 13007 T1459 oasc.SolrCore.registerSearcher [collection1] Registered new searcher Searcher@b2a92d4 main{StandardDirectoryReader(segments_2:5:nrt _0(4.0.0.2):C10 _1(4.0.0.2):C9)}
[junit4:junit4]   2> 13007 T1450 C120 P37655 UPDATE [collection1] webapp=/solr path=/update params={waitSearcher=true&commit=true&wt=javabin&commit_end_point=true&softCommit=false&version=2} {commit=} 0 8
[junit4:junit4]   2> 13008 T1439 C121 P37653 UPDATE [collection1] webapp=/solr path=/update params={waitSearcher=true&wt=javabin&commit=true&softCommit=false&version=2} {commit=} 0 17
[junit4:junit4]   2> 13010 T1451 C120 P37655 oasu.DirectUpdateHandler2.commit start commit{flags=0,_version_=0,optimize=false,openSearcher=true,waitSearcher=true,expungeDeletes=false,softCommit=false}
[junit4:junit4]   2> 13013 T1451 C120 P37655 oass.SolrIndexSearcher.<init> Opening Searcher@602db45d main
[junit4:junit4]   2> 13013 T1451 C120 P37655 oasu.DirectUpdateHandler2.commit end_commit_flush
[junit4:junit4]   2> 13015 T1459 oasc.SolrCore.registerSearcher [collection1] Registered new searcher Searcher@602db45d main{StandardDirectoryReader(segments_2:5:nrt _0(4.0.0.2):C10 _1(4.0.0.2):C9)}
[junit4:junit4]   2> 13015 T1451 C120 P37655 oasu.SolrCmdDistributor.distribCommit Distrib commit to:[StdNode: http://127.0.0.1:37651/solr/collection1/, StdNode: http://127.0.0.1:37653/solr/collection1/]
[junit4:junit4]   2> 13019 T1438 C121 P37653 oasu.DirectUpdateHandler2.commit start commit{flags=0,_version_=0,optimize=false,openSearcher=true,waitSearcher=true,expungeDeletes=false,softCommit=false}
[junit4:junit4]   2> 13018 T1427 C119 P37651 oasu.DirectUpdateHandler2.commit start commit{flags=0,_version_=0,optimize=false,openSearcher=true,waitSearcher=true,expungeDeletes=false,softCommit=false}
[junit4:junit4]   2> 13020 T1427 C119 P37651 oass.SolrIndexSearcher.<init> Opening Searcher@2fd1b2c1 main
[junit4:junit4]   2> 13020 T1438 C121 P37653 oass.SolrIndexSearcher.<init> Opening Searcher@a8940a5 main
[junit4:junit4]   2> 13020 T1427 C119 P37651 oasu.DirectUpdateHandler2.commit end_commit_flush
[junit4:junit4]   2> 13021 T1438 C121 P37653 oasu.DirectUpdateHandler2.commit end_commit_flush
[junit4:junit4]   2> 13021 T1447 oasc.JmxMonitoredMap.put WARNING Failed to register info bean: searcher javax.management.InstanceAlreadyExistsException: solr/collection1:type=searcher,id=org.apache.solr.search.SolrIndexSearcher
[junit4:junit4]   2> 	at com.sun.jmx.mbeanserver.Repository.addMBean(Repository.java:437)
[junit4:junit4]   2> 	at com.sun.jmx.interceptor.DefaultMBeanServerInterceptor.registerWithRepository(DefaultMBeanServerInterceptor.java:1898)
[junit4:junit4]   2> 	at com.sun.jmx.interceptor.DefaultMBeanServerInterceptor.registerDynamicMBean(DefaultMBeanServerInterceptor.java:966)
[junit4:junit4]   2> 	at com.sun.jmx.interceptor.DefaultMBeanServerInterceptor.registerObject(DefaultMBeanServerInterceptor.java:900)
[junit4:junit4]   2> 	at com.sun.jmx.interceptor.DefaultMBeanServerInterceptor.registerMBean(DefaultMBeanServerInterceptor.java:324)
[junit4:junit4]   2> 	at com.sun.jmx.mbeanserver.JmxMBeanServer.registerMBean(JmxMBeanServer.java:512)
[junit4:junit4]   2> 	at org.apache.solr.core.JmxMonitoredMap.put(JmxMonitoredMap.java:140)
[junit4:junit4]   2> 	at org.apache.solr.core.JmxMonitoredMap.put(JmxMonitoredMap.java:51)
[junit4:junit4]   2> 	at org.apache.solr.search.SolrIndexSearcher.register(SolrIndexSearcher.java:242)
[junit4:junit4]   2> 	at org.apache.solr.core.SolrCore.registerSearcher(SolrCore.java:1634)
[junit4:junit4]   2> 	at org.apache.solr.core.SolrCore.access$000(SolrCore.java:121)
[junit4:junit4]   2> 	at org.apache.solr.core.SolrCore$7.call(SolrCore.java:1511)
[junit4:junit4]   2> 	at java.util.concurrent.FutureTask$Sync.innerRun(FutureTask.java:334)
[junit4:junit4]   2> 	at java.util.concurrent.FutureTask.run(FutureTask.java:166)
[junit4:junit4]   2> 	at java.util.concurrent.ThreadPoolExecutor.runWorker(ThreadPoolExecutor.java:1110)
[junit4:junit4]   2> 	at java.util.concurrent.ThreadPoolExecutor$Worker.run(ThreadPoolExecutor.java:603)
[junit4:junit4]   2> 	at java.lang.Thread.run(Thread.java:722)
[junit4:junit4]   2> 
[junit4:junit4]   2> 13022 T1435 oasc.SolrCore.registerSearcher [collection1] Registered new searcher Searcher@2fd1b2c1 main{StandardDirectoryReader(segments_2:5:nrt _0(4.0.0.2):C10 _1(4.0.0.2):C8)}
[junit4:junit4]   2> 13022 T1427 C119 P37651 UPDATE [collection1] webapp=/solr path=/update params={waitSearcher=true&commit=true&wt=javabin&commit_end_point=true&softCommit=false&version=2} {commit=} 0 4
[junit4:junit4]   2> 13022 T1447 oasc.SolrCore.registerSearcher [collection1] Registered new searcher Searcher@a8940a5 main{StandardDirectoryReader(segments_2:7:nrt _0(4.0.0.2):C10 _1(4.0.0.2):C10 _2(4.0.0.2):C10)}
[junit4:junit4]   2> 13023 T1438 C121 P37653 UPDATE [collection1] webapp=/solr path=/update params={waitSearcher=true&commit=true&wt=javabin&commit_end_point=true&softCommit=false&version=2} {commit=} 0 5
[junit4:junit4]   2> 13023 T1451 C120 P37655 UPDATE [collection1] webapp=/solr path=/update params={waitSearcher=true&wt=javabin&commit=true&softCommit=false&version=2} {commit=} 0 13
[junit4:junit4]   2> 13028 T1412 C118 P37630 REQ [collection1] webapp=/solr path=/select params={distrib=false&sort=n_ti1+desc&wt=javabin&q=*:*&version=2} hits=67 status=0 QTime=2 
[junit4:junit4]   2> 13030 T1400 oascsi.HttpClientUtil.createClient Creating new http client, config:
[junit4:junit4]   2> 13040 T1400 oaz.ZooKeeper.<init> Initiating client connection, connectString=127.0.0.1:37623/solr sessionTimeout=10000 watcher=org.apache.solr.common.cloud.ConnectionManager@2f07f387
[junit4:junit4]   2> 13041 T1466 oaz.ClientCnxn$SendThread.startConnect Opening socket connection to server /127.0.0.1:37623
[junit4:junit4]   2> 13041 T1400 oascc.ConnectionManager.waitForConnected Waiting for client to connect to ZooKeeper
[junit4:junit4]   2> 13042 T1466 oaz.ClientCnxn$SendThread.primeConnection Socket connection established to localhost/127.0.0.1:37623, initiating session
[junit4:junit4]   2> 13042 T1402 oazs.NIOServerCnxn$Factory.run Accepted socket connection from /140.211.11.196:37664
[junit4:junit4]   2> 13043 T1402 oazs.NIOServerCnxn.readConnectRequest Client attempting to establish new session at /140.211.11.196:37664
[junit4:junit4]   2> 13045 T1404 oazs.NIOServerCnxn.finishSessionInit Established session 0x139995c51a00006 with negotiated timeout 10000 for client /140.211.11.196:37664
[junit4:junit4]   2> 13045 T1466 oaz.ClientCnxn$SendThread.readConnectResult Session establishment complete on server localhost/127.0.0.1:37623, sessionid = 0x139995c51a00006, negotiated timeout = 10000
[junit4:junit4]   2> 13045 T1467 oascc.ConnectionManager.process Watcher org.apache.solr.common.cloud.ConnectionManager@2f07f387 name:ZooKeeperConnection Watcher:127.0.0.1:37623/solr got event WatchedEvent state:SyncConnected type:None path:null path:null type:None
[junit4:junit4]   2> 13046 T1400 oascc.ConnectionManager.waitForConnected Client is connected to ZooKeeper
[junit4:junit4]   2> 13046 T1400 oascc.ZkStateReader.createClusterStateWatchersAndUpdate Updating cluster state from ZooKeeper... 
[junit4:junit4]   2> 13059 T1428 C119 P37651 REQ [collection1] webapp=/solr path=/select params={sort=n_ti1+desc&distrib=false&wt=javabin&rows=10&version=2&fl=id&shard.url=127.0.0.1:37651/solr/collection1/&NOW=1346897740947&start=0&q=*:*&isShard=true&fsv=true} hits=18 status=0 QTime=1 
[junit4:junit4]   2> 13059 T1452 C120 P37655 REQ [collection1] webapp=/solr path=/select params={sort=n_ti1+desc&distrib=false&wt=javabin&rows=10&version=2&fl=id&shard.url=127.0.0.1:37655/solr/collection1/&NOW=1346897740947&start=0&q=*:*&isShard=true&fsv=true} hits=19 status=0 QTime=1 
[junit4:junit4]   2> 13059 T1441 C121 P37653 REQ [collection1] webapp=/solr path=/select params={sort=n_ti1+desc&distrib=false&wt=javabin&rows=10&version=2&fl=id&shard.url=127.0.0.1:37653/solr/collection1/&NOW=1346897740947&start=0&q=*:*&isShard=true&fsv=true} hits=30 status=0 QTime=1 
[junit4:junit4]   2> 13065 T1428 C119 P37651 REQ [collection1] webapp=/solr path=/select params={shard.url=127.0.0.1:37651/solr/collection1/&NOW=1346897740947&q=*:*&ids=14,100&distrib=false&isShard=true&wt=javabin&version=2} status=0 QTime=1 
[junit4:junit4]   2> 13066 T1441 C121 P37653 REQ [collection1] webapp=/solr path=/select params={shard.url=127.0.0.1:37653/solr/collection1/&NOW=1346897740947&q=*:*&ids=125,3,107,12&distrib=false&isShard=true&wt=javabin&version=2} status=0 QTime=2 
[junit4:junit4]   2> 13066 T1452 C120 P37655 REQ [collection1] webapp=/solr path=/select params={shard.url=127.0.0.1:37655/solr/collection1/&NOW=1346897740947&q=*:*&ids=116,106,17,131&distrib=false&isShard=true&wt=javabin&version=2} status=0 QTime=2 
[junit4:junit4]   2> 13068 T1440 C121 P37653 REQ [collection1] webapp=/solr path=/select params={sort=n_ti1+desc&wt=javabin&q=*:*&version=2} status=0 QTime=13 
[junit4:junit4]   2> 13073 T1412 C118 P37630 REQ [collection1] webapp=/solr path=/select params={distrib=false&sort=n_ti1+asc&wt=javabin&q=*:*&version=2} hits=67 status=0 QTime=1 
[junit4:junit4]   2> 13082 T1452 C120 P37655 REQ [collection1] webapp=/solr path=/select params={sort=n_ti1+asc&distrib=false&collection=collection1&wt=javabin&rows=10&version=2&NOW=1346897740971&shard.url=127.0.0.1:37655/solr/collection1/&fl=id&start=0&q=*:*&isShard=true&fsv=true} hits=19 status=0 QTime=1 
[junit4:junit4]   2> 13082 T1428 C119 P37651 REQ [collection1] webapp=/solr path=/select params={sort=n_ti1+asc&distrib=false&collection=collection1&wt=javabin&rows=10&version=2&NOW=1346897740971&shard.url=127.0.0.1:37651/solr/collection1/&fl=id&start=0&q=*:*&isShard=true&fsv=true} hits=18 status=0 QTime=0 
[junit4:junit4]   2> 13083 T1441 C121 P37653 REQ [collection1] webapp=/solr path=/select params={sort=n_ti1+asc&distrib=false&collection=collection1&wt=javabin&rows=10&version=2&NOW=1346897740971&shard.url=127.0.0.1:37653/solr/collection1/&fl=id&start=0&q=*:*&isShard=true&fsv=true} hits=30 status=0 QTime=1 
[junit4:junit4]   2> 13088 T1452 C120 P37655 REQ [collection1] webapp=/solr path=/select params={shard.url=127.0.0.1:37655/solr/collection1/&NOW=1346897740971&q=*:*&ids=145,136&distrib=false&collection=collection1&isShard=true&wt=javabin&version=2} status=0 QTime=1 
[junit4:junit4]   2> 13088 T1428 C119 P37651 REQ [collection1] webapp=/solr path=/select params={shard.url=127.0.0.1:37651/solr/collection1/&NOW=1346897740971&q=*:*&ids=108&distrib=false&collection=collection1&isShard=true&wt=javabin&version=2} status=0 QTime=1 
[junit4:junit4]   2> 13089 T1441 C121 P37653 REQ [collection1] webapp=/solr path=/select params={shard.url=127.0.0.1:37653/solr/collection1/&NOW=1346897740971&q=*:*&ids=134,114,115,111,105,140,130&distrib=false&collection=collection1&isShard=true&wt=javabin&version=2} status=0 QTime=2 
[junit4:junit4]   2> 13090 T1440 C121 P37653 REQ [collection1] webapp=/solr path=/select params={collection=collection1&sort=n_ti1+asc&wt=javabin&q=*:*&version=2} status=0 QTime=12 
[junit4:junit4]   2> 13097 T1412 C118 P37630 REQ [collection1] webapp=/solr path=/select params={distrib=false&sort=n_f1+desc&wt=javabin&q=*:*&version=2} hits=67 status=0 QTime=2 
[junit4:junit4]   2> 13106 T1452 C120 P37655 REQ [collection1] webapp=/solr path=/select params={sort=n_f1+desc&distrib=false&wt=javabin&rows=10&version=2&fl=id&shard.url=127.0.0.1:37655/solr/collection1/&NOW=1346897740994&start=0&q=*:*&isShard=true&fsv=true} hits=19 status=0 QTime=2 
[junit4:junit4]   2> 13106 T1428 C119 P37651 REQ [collection1] webapp=/solr path=/select params={sort=n_f1+desc&distrib=false&wt=javabin&rows=10&version=2&fl=id&shard.url=127.0.0.1:37651/solr/collection1/&NOW=1346897740994&start=0&q=*:*&isShard=true&fsv=true} hits=18 status=0 QTime=2 
[junit4:junit4]   2> 13106 T1441 C121 P37653 REQ [collection1] webapp=/solr path=/select params={sort=n_f1+desc&distrib=false&wt=javabin&rows=10&version=2&fl=id&shard.url=127.0.0.1:37653/solr/collection1/&NOW=1346897740994&start=0&q=*:*&isShard=true&fsv=true} hits=30 status=0 QTime=2 
[junit4:junit4]   2> 13111 T1441 C121 P37653 REQ [collection1] webapp=/solr path=/select params={shard.url=127.0.0.1:37653/solr/collection1/&NOW=1346897740994&q=*:*&ids=113,6,107,9,120,102&distrib=false&isShard=true&wt=javabin&version=2} status=0 QTime=1 
[junit4:junit4]   2> 13111 T1452 C120 P37655 REQ [collection1] webapp=/solr path=/select params={shard.url=127.0.0.1:37655/solr/collection1/&NOW=1346897740994&q=*:*&ids=116,121,149,104&distrib=false&isShard=true&wt=javabin&version=2} status=0 QTime=1 
[junit4:junit4]   2> 13113 T1439 C121 P37653 REQ [collection1] webapp=/solr path=/select params={sort=n_f1+desc&wt=javabin&q=*:*&version=2} status=0 QTime=12 
[junit4:junit4]   2> 13118 T1412 C118 P37630 REQ [collection1] webapp=/solr path=/select params={distrib=false&sort=n_f1+asc&wt=javabin&q=*:*&version=2} hits=67 status=0 QTime=1 
[junit4:junit4]   2> 13126 T1453 C120 P37655 REQ [collection1] webapp=/solr path=/select params={sort=n_f1+asc&distrib=false&wt=javabin&rows=10&version=2&fl=id&shard.url=127.0.0.1:37655/solr/collection1/&NOW=1346897741014&start=0&q=*:*&isShard=true&fsv=true} hits=19 status=0 QTime=1 
[junit4:junit4]   2> 13126 T1429 C119 P37651 REQ [collection1] webapp=/solr path=/select params={sort=n_f1+asc&distrib=false&wt=javabin&rows=10&version=2&fl=id&shard.url=127.0.0.1:37651/solr/collection1/&NOW=1346897741014&start=0&q=*:*&isShard=true&fsv=true} hits=18 status=0 QTime=1 
[junit4:junit4]   2> 13126 T1442 C121 P37653 REQ [collection1] webapp=/solr path=/select params={sort=n_f1+asc&distrib=false&wt=javabin&rows=10&version=2&fl=id&shard.url=127.0.0.1:37653/solr/collection1/&NOW=1346897741014&start=0&q=*:*&isShard=true&fsv=true} hits=30 status=0 QTime=1 
[junit4:junit4]   2> 13131 T1453 C120 P37655 REQ [collection1] webapp=/solr path=/select params={shard.url=127.0.0.1:37655/solr/collection1/&NOW=1346897741014&q=*:*&ids=126,147&distrib=false&isShard=true&wt=javabin&version=2} status=0 QTime=1 
[junit4:junit4]   2> 13131 T1429 C119 P37651 REQ [collection1] webapp=/solr path=/select params={shard.url=127.0.0.1:37651/solr/collection1/&NOW=1346897741014&q=*:*&ids=10,123,14&distrib=false&isShard=true&wt=javabin&version=2} status=0 QTime=1 
[junit4:junit4]   2> 13132 T1442 C121 P37653 REQ [collection1] webapp=/solr path=/select params={shard.url=127.0.0.1:37653/solr/collection1/&NOW=1346897741014&q=*:*&ids=125,117,15,140,12&distrib=false&isShard=true&wt=javabin&version=2} status=0 QTime=2 
[junit4:junit4]   2> 13134 T1426 C119 P37651 REQ [collection1] webapp=/solr path=/select params={sort=n_f1+asc&wt=javabin&q=*:*&version=2} status=0 QTime=13 
[junit4:junit4]   2> 13160 T1412 C118 P37630 REQ [collection1] webapp=/solr path=/select params={distrib=false&sort=n_tf1+desc&wt=javabin&q=*:*&version=2} hits=67 status=0 QTime=22 
[junit4:junit4]   2> 13176 T1430 C119 P37651 REQ [collection1] webapp=/solr path=/select params={sort=n_tf1+desc&distrib=false&wt=javabin&rows=10&version=2&fl=id&shard.url=127.0.0.1:37651/solr/collection1/&NOW=1346897741057&start=0&q=*:*&isShard=true&fsv=true} hits=18 status=0 QTime=7 
[junit4:junit4]   2> 13178 T1454 C120 P37655 REQ [collection1] webapp=/solr path=/select params={sort=n_tf1+desc&distrib=false&wt=javabin&rows=10&version=2&fl=id&shard.url=127.0.0.1:37655/solr/collection1/&NOW=1346897741057&start=0&q=*:*&isShard=true&fsv=true} hits=19 status=0 QTime=8 
[junit4:junit4]   2> 13179 T1443 C121 P37653 REQ [collection1] webapp=/solr path=/select params={sort=n_tf1+desc&distrib=false&wt=javabin&rows=10&version=2&fl=id&shard.url=127.0.0.1:37653/solr/collection1/&NOW=1346897741057&start=0&q=*:*&isShard=true&fsv=true} hits=30 status=0 QTime=9 
[junit4:junit4]   2> 13184 T1443 C121 P37653 REQ [collection1] webapp=/solr path=/select params={shard.url=127.0.0.1:37653/solr/collection1/&NOW=1346897741057&q=*:*&ids=7&distrib=false&isShard=true&wt=javabin&version=2} status=0 QTime=1 
[junit4:junit4]   2> 13184 T1430 C119 P37651 REQ [collection1] webapp=/solr path=/select params={shard.url=127.0.0.1:37651/solr/collection1/&NOW=1346897741057&q=*:*&ids=135,1,132&distrib=false&isShard=true&wt=javabin&version=2} status=0 QTime=1 
[junit4:junit4]   2> 13185 T1454 C120 P37655 REQ [collection1] webapp=/solr path=/select params={shard.url=127.0.0.1:37655/solr/collection1/&NOW=1346897741057&q=*:*&ids=112,147,149,5,17,131&distrib=false&isShard=true&wt=javabin&version=2} status=0 QTime=1 
[junit4:junit4]   2> 13187 T1451 C120 P37655 REQ [collection1] webapp=/solr path=/select params={sort=n_tf1+desc&shards=shard3,shard4,shard5&wt=javabin&q=*:*&version=2} status=0 QTime=23 
[junit4:junit4]   2> 13191 T1412 C118 P37630 REQ [collection1] webapp=/solr path=/select params={distrib=false&sort=n_tf1+asc&wt=javabin&q=*:*&version=2} hits=67 status=0 QTime=1 
[junit4:junit4]   2> 13196 T1429 C119 P37651 REQ [collection1] webapp=/solr path=/select params={sort=n_tf1+asc&distrib=false&wt=javabin&rows=10&version=2&fl=id&shard.url=127.0.0.1:37651/solr/collection1/&NOW=1346897741087&start=0&q=*:*&isShard=true&fsv=true} hits=18 status=0 QTime=0 
[junit4:junit4]   2> 13197 T1453 C120 P37655 REQ [collection1] webapp=/solr path=/select params={sort=n_tf1+asc&distrib=false&wt=javabin&rows=10&version=2&fl=id&shard.url=127.0.0.1:37655/solr/collection1/&NOW=1346897741087&start=0&q=*:*&isShard=true&fsv=true} hits=19 status=0 QTime=1 
[junit4:junit4]   2> 13197 T1442 C121 P37653 REQ [collection1] webapp=/solr path=/select params={sort=n_tf1+asc&distrib=false&wt=javabin&rows=10&version=2&fl=id&shard.url=127.0.0.1:37653/solr/collection1/&NOW=1346897741087&start=0&q=*:*&isShard=true&fsv=true} hits=30 status=0 QTime=1 
[junit4:junit4]   2> 13202 T1453 C120 P37655 REQ [collection1] webapp=/solr path=/select params={shard.url=127.0.0.1:37655/solr/collection1/&NOW=1346897741087&q=*:*&ids=116,126,128,121&distrib=false&isShard=true&wt=javabin&version=2} status=0 QTime=1 
[junit4:junit4]   2> 13202 T1442 C121 P37653 REQ [collection1] webapp=/solr path=/select params={shard.url=127.0.0.1:37653/solr/collection1/&NOW=1346897741087&q=*:*&ids=125,122,105&distrib=false&isShard=true&wt=javabin&version=2} status=0 QTime=1 
[junit4:junit4]   2> 13202 T1429 C119 P37651 REQ [collection1] webapp=/solr path=/select params={shard.url=127.0.0.1:37651/solr/collection1/&NOW=1346897741087&q=*:*&ids=110,8,14&distrib=false&isShard=true&wt=javabin&version=2} status=0 QTime=1 
[junit4:junit4]   2> 13204 T1431 C119 P37651 REQ [collection1] webapp=/solr path=/select params={sort=n_tf1+asc&shards=shard3,shard4,shard5&wt=javabin&q=*:*&version=2} status=0 QTime=10 
[junit4:junit4]   2> 13222 T1412 C118 P37630 REQ [collection1] webapp=/solr path=/select params={distrib=false&sort=n_d1+desc&wt=javabin&q=*:*&version=2} hits=67 status=0 QTime=15 
[junit4:junit4]   2> 13233 T1453 C120 P37655 REQ [collection1] webapp=/solr path=/select params={sort=n_d1+desc&distrib=false&wt=javabin&rows=10&version=2&fl=id&shard.url=127.0.0.1:37655/solr/collection1/&NOW=1346897741119&start=0&q=*:*&isShard=true&fsv=true} hits=19 status=0 QTime=4 
[junit4:junit4]   2> 13233 T1429 C119 P37651 REQ [collection1] webapp=/solr path=/select params={sort=n_d1+desc&distrib=false&wt=javabin&rows=10&version=2&fl=id&shard.url=127.0.0.1:37651/solr/collection1/&NOW=1346897741119&start=0&q=*:*&isShard=true&fsv=true} hits=18 status=0 QTime=4 
[junit4:junit4]   2> 13235 T1442 C121 P37653 REQ [collection1] webapp=/solr path=/select params={sort=n_d1+desc&distrib=false&wt=javabin&rows=10&version=2&fl=id&shard.url=127.0.0.1:37653/solr/collection1/&NOW=1346897741119&start=0&q=*:*&isShard=true&fsv=true} hits=30 status=0 QTime=6 
[junit4:junit4]   2> 13240 T1453 C120 P37655 REQ [collection1] webapp=/solr path=/select params={shard.url=127.0.0.1:37655/solr/collection1/&NOW=1346897741119&q=*:*&ids=126,149,142&distrib=false&isShard=true&wt=javabin&version=2} status=0 QTime=1 
[junit4:junit4]   2> 13240 T1442 C121 P37653 REQ [collection1] webapp=/solr path=/select params={shard.url=127.0.0.1:37653/solr/collection1/&NOW=1346897741119&q=*:*&ids=143,12&distrib=false&isShard=true&wt=javabin&version=2} status=0 QTime=1 
[junit4:junit4]   2> 13240 T1429 C119 P37651 REQ [collection1] webapp=/solr path=/select params={shard.url=127.0.0.1:37651/solr/collection1/&NOW=1346897741119&q=*:*&ids=1,123,16,13,118&distrib=false&isShard=true&wt=javabin&version=2} status=0 QTime=1 
[junit4:junit4]   2> 13242 T1426 C119 P37651 REQ [collection1] webapp=/solr path=/select params={sort=n_d1+desc&shards=shard3,shard4,shard5&wt=javabin&q=*:*&version=2} status=0 QTime=16 
[junit4:junit4]   2> 13247 T1412 C118 P37630 REQ [collection1] webapp=/solr path=/select params={distrib=false&sort=n_d1+asc&wt=javabin&q=*:*&version=2} hits=67 status=0 QTime=1 
[junit4:junit4]   2> 13253 T1453 C120 P37655 REQ [collection1] webapp=/solr path=/select params={sort=n_d1+asc&distrib=false&collection=collection1&wt=javabin&rows=10&version=2&NOW=1346897741143&shard.url=127.0.0.1:37655/solr/collection1/&fl=id&start=0&q=*:*&isShard=true&fsv=true} hits=19 status=0 QTime=0 
[junit4:junit4]   2> 13253 T1442 C121 P37653 REQ [collection1] webapp=/solr path=/select params={sort=n_d1+asc&distrib=false&collection=collection1&wt=javabin&rows=10&version=2&NOW=1346897741143&shard.url=127.0.0.1:37653/solr/collection1/&fl=id&start=0&q=*:*&isShard=true&fsv=true} hits=30 status=0 QTime=0 
[junit4:junit4]   2> 13253 T1429 C119 P37651 REQ [collection1] webapp=/solr path=/select params={sort=n_d1+asc&distrib=false&collection=collection1&wt=javabin&rows=10&version=2&NOW=1346897741143&shard.url=127.0.0.1:37651/solr/collection1/&fl=id&start=0&q=*:*&isShard=true&fsv=true} hits=18 status=0 QTime=0 
[junit4:junit4]   2> 13258 T1429 C119 P37651 REQ [collection1] webapp=/solr path=/select params={shard.url=127.0.0.1:37651/solr/collection1/&NOW=1346897741143&q=*:*&ids=132,8&distrib=false&collection=collection1&isShard=true&wt=javabin&version=2} status=0 QTime=0 
[junit4:junit4]   2> 13258 T1453 C120 P37655 REQ [collection1] webapp=/solr path=/select params={shard.url=127.0.0.1:37655/solr/collection1/&NOW=1346897741143&q=*:*&ids=112,137,106,103&distrib=false&collection=collection1&isShard=true&wt=javabin&version=2} status=0 QTime=1 
[junit4:junit4]   2> 13258 T1442 C121 P37653 REQ [collection1] webapp=/solr path=/select params={shard.url=127.0.0.1:37653/solr/collection1/&NOW=1346897741143&q=*:*&ids=2,7,141,119&distrib=false&collection=collection1&isShard=true&wt=javabin&version=2} status=0 QTime=1 
[junit4:junit4]   2> 13272 T1431 C119 P37651 REQ [collection1] webapp=/solr path=/select params={collection=collection1&sort=n_d1+asc&wt=javabin&q=*:*&version=2} status=0 QTime=22 
[junit4:junit4]   2> 13278 T1412 C118 P37630 REQ [collection1] webapp=/solr path=/select params={distrib=false&sort=n_td1+desc&wt=javabin&q=*:*&version=2} hits=67 status=0 QTime=2 
[junit4:junit4]   2> 13285 T1428 C119 P37651 REQ [collection1] webapp=/solr path=/select params={sort=n_td1+desc&distrib=false&wt=javabin&rows=10&version=2&fl=id&shard.url=127.0.0.1:37651/solr/collection1/&NOW=1346897741174&start=0&q=*:*&isShard=true&fsv=true} hits=18 status=0 QTime=1 
[junit4:junit4]   2> 13285 T1441 C121 P37653 REQ [collection1] webapp=/solr path=/select params={sort=n_td1+desc&distrib=false&wt=javabin&rows=10&version=2&fl=id&shard.url=127.0.0.1:37653/solr/collection1/&NOW=1346897741174&start=0&q=*:*&isShard=true&fsv=true} hits=30 status=0 QTime=1 
[junit4:junit4]   2> 13286 T1452 C120 P37655 REQ [collection1] webapp=/solr path=/select params={sort=n_td1+desc&distrib=false&wt=javabin&rows=10&version=2&fl=id&shard.url=127.0.0.1:37655/solr/collection1/&NOW=1346897741174&start=0&q=*:*&isShard=true&fsv=true} hits=19 status=0 QTime=2 
[junit4:junit4]   2> 13294 T1428 C119 P37651 REQ [collection1] webapp=/solr path=/select params={shard.url=127.0.0.1:37651/solr/collection1/&NOW=1346897741174&q=*:*&ids=110&distrib=false&isShard=true&wt=javabin&version=2} status=0 QTime=1 
[junit4:junit4]   2> 13294 T1452 C120 P37655 REQ [collection1] webapp=/solr path=/select params={shard.url=127.0.0.1:37655/solr/collection1/&NOW=1346897741174&q=*:*&ids=128,147&distrib=false&isShard=true&wt=javabin&version=2} status=0 QTime=0 
[junit4:junit4]   2> 13297 T1441 C121 P37653 REQ [collection1] webapp=/solr path=/select params={shard.url=127.0.0.1:37653/solr/collection1/&NOW=1346897741174&q=*:*&ids=3,122,6,111,4,105,141&distrib=false&isShard=true&wt=javabin&version=2} status=0 QTime=1 
[junit4:junit4]   2> 13300 T1439 C121 P37653 REQ [collection1] webapp=/solr path=/select params={sort=n_td1+desc&wt=javabin&q=*:*&version=2} status=0 QTime=19 
[junit4:junit4]   2> 13306 T1412 C118 P37630 REQ [collection1] webapp=/solr path=/select params={distrib=false&sort=n_td1+asc&wt=javabin&q=*:*&version=2} hits=67 status=0 QTime=1 
[junit4:junit4]   2> 13314 T1454 C120 P37655 REQ [collection1] webapp=/solr path=/select params={sort=n_td1+asc&distrib=false&wt=javabin&rows=10&version=2&fl=id&shard.url=127.0.0.1:37655/solr/collection1/&NOW=1346897741203&start=0&q=*:*&isShard=true&fsv=true} hits=19 status=0 QTime=1 
[junit4:junit4]   2> 13314 T1443 C121 P37653 REQ [collection1] webapp=/solr path=/select params={sort=n_td1+asc&distrib=false&wt=javabin&rows=10&version=2&fl=id&shard.url=127.0.0.1:37653/solr/collection1/&NOW=1346897741203&start=0&q=*:*&isShard=true&fsv=true} hits=30 status=0 QTime=1 
[junit4:junit4]   2> 13314 T1430 C119 P37651 REQ [collection1] webapp=/solr path=/select params={sort=n_td1+asc&distrib=false&wt=javabin&rows=10&version=2&fl=id&shard.url=127.0.0.1:37651/solr/collection1/&NOW=1346897741203&start=0&q=*:*&isShard=true&fsv=true} hits=18 status=0 QTime=1 
[junit4:junit4]   2> 13319 T1443 C121 P37653 REQ [collection1] webapp=/solr path=/select params={shard.url=127.0.0.1:37653/solr/collection1/&NOW=1346897741203&q=*:*&ids=143,7,107&distrib=false&isShard=true&wt=javabin&version=2} status=0 QTime=1 
[junit4:junit4]   2> 13319 T1454 C120 P37655 REQ [collection1] webapp=/solr path=/select params={shard.url=127.0.0.1:37655/solr/collection1/&NOW=1346897741203&q=*:*&ids=112,137,17,142&distrib=false&isShard=true&wt=javabin&version=2} status=0 QTime=1 
[junit4:junit4]   2> 13319 T1430 C119 P37651 REQ [collection1] webapp=/solr path=/select params={shard.url=127.0.0.1:37651/solr/collection1/&NOW=1346897741203&q=*:*&ids=132,148,100&distrib=false&isShard=true&wt=javabin&version=2} status=0 QTime=1 
[junit4:junit4]   2> 13321 T1455 C120 P37655 REQ [collection1] webapp=/solr path=/select params={sort=n_td1+asc&wt=javabin&q=*:*&version=2} status=0 QTime=11 
[junit4:junit4]   2> 13333 T1412 C118 P37630 REQ [collection1] webapp=/solr path=/select params={distrib=false&sort=n_l1+desc&wt=javabin&q=*:*&version=2} hits=67 status=0 QTime=8 
[junit4:junit4]   2> 13342 T1453 C120 P37655 REQ [collection1] webapp=/solr path=/select params={sort=n_l1+desc&distrib=false&wt=javabin&rows=10&version=2&fl=id&shard.url=127.0.0.1:37655/solr/collection1/&NOW=1346897741229&start=0&q=*:*&isShard=true&fsv=true} hits=19 status=0 QTime=3 
[junit4:junit4]   2> 13343 T1429 C119 P37651 REQ [collection1] webapp=/solr path=/select params={sort=n_l1+desc&distrib=false&wt=javabin&rows=10&version=2&fl=id&shard.url=127.0.0.1:37651/solr/collection1/&NOW=1346897741229&start=0&q=*:*&isShard=true&fsv=true} hits=18 status=0 QTime=4 
[junit4:junit4]   2> 13343 T1442 C121 P37653 REQ [collection1] webapp=/solr path=/select params={sort=n_l1+desc&distrib=false&wt=javabin&rows=10&version=2&fl=id&shard.url=127.0.0.1:37653/solr/collection1/&NOW=1346897741229&start=0&q=*:*&isShard=true&fsv=true} hits=30 status=0 QTime=4 
[junit4:junit4]   2> 13347 T1453 C120 P37655 REQ [collection1] webapp=/solr path=/select params={shard.url=127.0.0.1:37655/solr/collection1/&NOW=1346897741229&q=*:*&ids=17,106,103&distrib=false&isShard=true&wt=javabin&version=2} status=0 QTime=1 
[junit4:junit4]   2> 13347 T1429 C119 P37651 REQ [collection1] webapp=/solr path=/select params={shard.url=127.0.0.1:37651/solr/collection1/&NOW=1346897741229&q=*:*&ids=10,1,100,118&distrib=false&isShard=true&wt=javabin&version=2} status=0 QTime=1 
[junit4:junit4]   2> 13347 T1442 C121 P37653 REQ [collection1] webapp=/solr path=/select params={shard.url=127.0.0.1:37653/solr/collection1/&NOW=1346897741229&q=*:*&ids=2,6,119&distrib=false&isShard=true&wt=javabin&version=2} status=0 QTime=1 
[junit4:junit4]   2> 13349 T1426 C119 P37651 REQ [collection1] webapp=/solr path=/select params={sort=n_l1+desc&shards=shard3,shard4,shard5&wt=javabin&q=*:*&version=2} status=0 QTime=13 
[junit4:junit4]   2> 13353 T1412 C118 P37630 REQ [collection1] webapp=/solr path=/select params={distrib=false&sort=n_l1+asc&wt=javabin&q=*:*&version=2} hits=67 status=0 QTime=1 
[junit4:junit4]   2> 13360 T1452 C120 P37655 REQ [collection1] webapp=/solr path=/select params={sort=n_l1+asc&distrib=false&collection=collection1&wt=javabin&rows=10&version=2&fl=id&shard.url=127.0.0.1:37655/solr/collection1/&NOW=1346897741249&start=0&q=*:*&isShard=true&fsv=true} hits=19 status=0 QTime=1 
[junit4:junit4]   2> 13360 T1428 C119 P37651 REQ [collection1] webapp=/solr path=/select params={sort=n_l1+asc&distrib=false&collection=collection1&wt=javabin&rows=10&version=2&fl=id&shard.url=127.0.0.1:37651/solr/collection1/&NOW=1346897741249&start=0&q=*:*&isShard=true&fsv=true} hits=18 status=0 QTime=1 
[junit4:junit4]   2> 13360 T1441 C121 P37653 REQ [collection1] webapp=/solr path=/select params={sort=n_l1+asc&distrib=false&collection=collection1&wt=javabin&rows=10&version=2&fl=id&shard.url=127.0.0.1:37653/solr/collection1/&NOW=1346897741249&start=0&q=*:*&isShard=true&fsv=true} hits=30 status=0 QTime=1 
[junit4:junit4]   2> 13365 T1452 C120 P37655 REQ [collection1] webapp=/solr path=/select params={shard.url=127.0.0.1:37655/solr/collection1/&NOW=1346897741249&q=*:*&ids=104,142&distrib=false&collection=collection1&isShard=true&wt=javabin&version=2} status=0 QTime=1 
[junit4:junit4]   2> 13365 T1428 C119 P37651 REQ [collection1] webapp=/solr path=/select params={shard.url=127.0.0.1:37651/solr/collection1/&NOW=1346897741249&q=*:*&ids=132,124,16,11&distrib=false&collection=collection1&isShard=true&wt=javabin&version=2} status=0 QTime=1 
[junit4:junit4]   2> 13365 T1441 C121 P37653 REQ [collection1] webapp=/solr path=/select params={shard.url=127.0.0.1:37653/solr/collection1/&NOW=1346897741249&q=*:*&ids=146,122,120,102&distrib=false&collection=collection1&isShard=true&wt=javabin&version=2} status=0 QTime=1 
[junit4:junit4]   2> 13367 T1440 C121 P37653 REQ [collection1] webapp=/solr path=/select params={sort=n_l1+asc&shards=shard3,shard4,shard5&q=*:*&collection=collection1&wt=javabin&version=2} status=0 QTime=11 
[junit4:junit4]   2> 13373 T1412 C118 P37630 REQ [collection1] webapp=/solr path=/select params={distrib=false&sort=n_tl1+desc&wt=javabin&q=*:*&version=2} hits=67 status=0 QTime=2 
[junit4:junit4]   2> 13390 T1452 C120 P37655 REQ [collection1] webapp=/solr path=/select params={sort=n_tl1+desc&distrib=false&wt=javabin&rows=10&version=2&fl=id&shard.url=127.0.0.1:37655/solr/collection1/&NOW=1346897741279&start=0&q=*:*&isShard=true&fsv=true} hits=19 status=0 QTime=1 
[junit4:junit4]   2> 13390 T1428 C119 P37651 REQ [collection1] webapp=/solr path=/select params={sort=n_tl1+desc&distrib=false&wt=javabin&rows=10&version=2&fl=id&shard.url=127.0.0.1:37651/solr/collection1/&NOW=1346897741279&start=0&q=*:*&isShard=true&fsv=true} hits=18 status=0 QTime=1 
[junit4:junit4]   2> 13390 T1441 C121 P37653 REQ [collection1] webapp=/solr path=/select params={sort=n_tl1+desc&distrib=false&wt=javabin&rows=10&version=2&fl=id&shard.url=127.0.0.1:37653/solr/collection1/&NOW=1346897741279&start=0&q=*:*&isShard=true&fsv=true} hits=30 status=0 QTime=1 
[junit4:junit4]   2> 13394 T1452 C120 P37655 REQ [collection1] webapp=/solr path=/select params={shard.url=127.0.0.1:37655/solr/collection1/&NOW=1346897741279&q=*:*&ids=116&distrib=false&isShard=true&wt=javabin&version=2} status=0 QTime=0 
[junit4:junit4]   2> 13395 T1428 C119 P37651 REQ [collection1] webapp=/solr path=/select params={shard.url=127.0.0.1:37651/solr/collection1/&NOW=1346897741279&q=*:*&ids=135,132,13&distrib=false&isShard=true&wt=javabin&version=2} status=0 QTime=1 
[junit4:junit4]   2> 13395 T1441 C121 P37653 REQ [collection1] webapp=/solr path=/select params={shard.url=127.0.0.1:37653/solr/collection1/&NOW=1346897741279&q=*:*&ids=3,2,117,6,101,12&distrib=false&isShard=true&wt=javabin&version=2} status=0 QTime=1 
[junit4:junit4]   2> 13397 T1439 C121 P37653 REQ [collection1] webapp=/solr path=/select params={sort=n_tl1+desc&shards=shard3,shard4,shard5&wt=javabin&q=*:*&version=2} status=0 QTime=11 
[junit4:junit4]   2> 13402 T1412 C118 P37630 REQ [collection1] webapp=/solr path=/select params={distrib=false&sort=n_tl1+asc&wt=javabin&q=*:*&version=2} hits=67 status=0 QTime=1 
[junit4:junit4]   2> 13408 T1453 C120 P37655 REQ [collection1] webapp=/solr path=/select params={sort=n_tl1+asc&distrib=false&wt=javabin&rows=10&version=2&fl=id&shard.url=127.0.0.1:37655/solr/collection1/&NOW=1346897741298&start=0&q=*:*&isShard=true&fsv=true} hits=19 status=0 QTime=0 
[junit4:junit4]   2> 13409 T1429 C119 P37651 REQ [collection1] webapp=/solr path=/select params={sort=n_tl1+asc&distrib=false&wt=javabin&rows=10&version=2&fl=id&shard.url=127.0.0.1:37651/solr/collection1/&NOW=1346897741298&start=0&q=*:*&isShard=true&fsv=true} hits=18 status=0 QTime=0 
[junit4:junit4]   2> 13409 T1442 C121 P37653 REQ [collection1] webapp=/solr path=/select params={sort=n_tl1+asc&distrib=false&wt=javabin&rows=10&version=2&fl=id&shard.url=127.0.0.1:37653/solr/collection1/&NOW=1346897741298&start=0&q=*:*&isShard=true&fsv=true} hits=30 status=0 QTime=1 
[junit4:junit4]   2> 13413 T1429 C119 P37651 REQ [collection1] webapp=/solr path=/select params={shard.url=127.0.0.1:37651/solr/collection1/&NOW=1346897741298&q=*:*&ids=123,16&distrib=false&isShard=true&wt=javabin&version=2} status=0 QTime=1 
[junit4:junit4]   2> 13413 T1453 C120 P37655 REQ [collection1] webapp=/solr path=/select params={shard.url=127.0.0.1:37655/solr/collection1/&NOW=1346897741298&q=*:*&ids=128,139,137&distrib=false&isShard=true&wt=javabin&version=2} status=0 QTime=1 
[junit4:junit4]   2> 13413 T1442 C121 P37653 REQ [collection1] webapp=/solr path=/select params={shard.url=127.0.0.1:37653/solr/collection1/&NOW=1346897741298&q=*:*&ids=125,107,9,15,140&distrib=false&isShard=true&wt=javabin&version=2} status=0 QTime=1 
[junit4:junit4]   2> 13415 T1431 C119 P37651 REQ [collection1] webapp=/solr path=/select params={sort=n_tl1+asc&wt=javabin&q=*:*&version=2} status=0 QTime=10 
[junit4:junit4]   2> 13421 T1412 C118 P37630 REQ [collection1] webapp=/solr path=/select params={distrib=false&sort=n_dt1+desc&wt=javabin&q=*:*&version=2} hits=67 status=0 QTime=2 
[junit4:junit4]   2> 13429 T1453 C120 P37655 REQ [collection1] webapp=/solr path=/select params={sort=n_dt1+desc&distrib=false&wt=javabin&rows=10&version=2&fl=id&shard.url=127.0.0.1:37655/solr/collection1/&NOW=1346897741318&start=0&q=*:*&isShard=true&fsv=true} hits=19 status=0 QTime=1 
[junit4:junit4]   2> 13429 T1442 C121 P37653 REQ [collection1] webapp=/solr path=/select params={sort=n_dt1+desc&distrib=false&wt=javabin&rows=10&version=2&fl=id&shard.url=127.0.0.1:37653/solr/collection1/&NOW=1346897741318&start=0&q=*:*&isShard=true&fsv=true} hits=30 status=0 QTime=1 
[junit4:junit4]   2> 13429 T1429 C119 P37651 REQ [collection1] webapp=/solr path=/select params={sort=n_dt1+desc&distrib=false&wt=javabin&rows=10&version=2&fl=id&shard.url=127.0.0.1:37651/solr/collection1/&NOW=1346897741318&start=0&q=*:*&isShard=true&fsv=true} hits=18 status=0 QTime=1 
[junit4:junit4]   2> 13434 T1429 C119 P37651 REQ [collection1] webapp=/solr path=/select params={shard.url=127.0.0.1:37651/solr/collection1/&NOW=1346897741318&q=*:*&ids=10,100&distrib=false&isShard=true&wt=javabin&version=2} status=0 QTime=1 
[junit4:junit4]   2> 13434 T1442 C121 P37653 REQ [collection1] webapp=/solr path=/select params={shard.url=127.0.0.1:37653/solr/collection1/&NOW=1346897741318&q=*:*&ids=125,6,102&distrib=false&isShard=true&wt=javabin&version=2} status=0 QTime=1 
[junit4:junit4]   2> 13434 T1453 C120 P37655 REQ [collection1] webapp=/solr path=/select params={shard.url=127.0.0.1:37655/solr/collection1/&NOW=1346897741318&q=*:*&ids=121,112,5,106,131&distrib=false&isShard=true&wt=javabin&version=2} status=0 QTime=1 
[junit4:junit4]   2> 13436 T1431 C119 P37651 REQ [collection1] webapp=/solr path=/select params={sort=n_dt1+desc&wt=javabin&q=*:*&version=2} status=0 QTime=11 
[junit4:junit4]   2> 13441 T1412 C118 P37630 REQ [collection1] webapp=/solr path=/select params={distrib=false&sort=n_dt1+asc&wt=javabin&q=*:*&version=2} hits=67 status=0 QTime=1 
[junit4:junit4]   2> 13447 T1452 C120 P37655 REQ [collection1] webapp=/solr path=/select params={sort=n_dt1+asc&distrib=false&wt=javabin&rows=10&version=2&fl=id&shard.url=127.0.0.1:37655/solr/collection1/&NOW=1346897741338&start=0&q=*:*&isShard=true&fsv=true} hits=19 status=0 QTime=0 
[junit4:junit4]   2> 13447 T1428 C119 P37651 REQ [collection1] webapp=/solr path=/select params={sort=n_dt1+asc&distrib=false&wt=javabin&rows=10&version=2&fl=id&shard.url=127.0.0.1:37651/solr/collection1/&NOW=1346897741338&start=0&q=*:*&isShard=true&fsv=true} hits=18 status=0 QTime=0 
[junit4:junit4]   2> 13447 T1441 C121 P37653 REQ [collection1] webapp=/solr path=/select params={sort=n_dt1+asc&distrib=false&wt=javabin&rows=10&version=2&fl=id&shard.url=127.0.0.1:37653/solr/collection1/&NOW=1346897741338&start=0&q=*:*&isShard=true&fsv=true} hits=30 status=0 QTime=0 
[junit4:junit4]   2> 13452 T1428 C119 P37651 REQ [collection1] webapp=/solr path=/select params={shard.url=127.0.0.1:37651/solr/collection1/&NOW=1346897741338&q=*:*&ids=148,118&distrib=false&isShard=true&wt=javabin&version=2} status=0 QTime=1 
[junit4:junit4]   2> 13452 T1452 C120 P37655 REQ [collection1] webapp=/solr path=/select params={shard.url=127.0.0.1:37655/solr/collection1/&NOW=1346897741338&q=*:*&ids=139,149,137,103&distrib=false&isShard=true&wt=javabin&version=2} status=0 QTime=1 
[junit4:junit4]   2> 13452 T1441 C121 P37653 REQ [collection1] webapp=/solr path=/select params={shard.url=127.0.0.1:37653/solr/collection1/&NOW=1346897741338&q=*:*&ids=2,115,7,15&distrib=false&isShard=true&wt=javabin&version=2} status=0 QTime=1 
[junit4:junit4]   2> 13454 T1439 C121 P37653 REQ [collection1] webapp=/solr path=/select params={sort=n_dt1+asc&shards=shard3,shard4,shard5&wt=javabin&q=*:*&version=2} status=0 QTime=9 
[junit4:junit4]   2> 13487 T1412 C118 P37630 REQ [collection1] webapp=/solr path=/select params={distrib=false&sort=n_tdt1+desc&wt=javabin&q=*:*&version=2} hits=67 status=0 QTime=28 
[junit4:junit4]   2> 13500 T1452 C120 P37655 REQ [collection1] webapp=/solr path=/select params={sort=n_tdt1+desc&distrib=false&wt=javabin&rows=10&version=2&fl=id&shard.url=127.0.0.1:37655/solr/collection1/&NOW=1346897741383&start=0&q=*:*&isShard=true&fsv=true} hits=19 status=0 QTime=7 
[junit4:junit4]   2> 13500 T1428 C119 P37651 REQ [collection1] webapp=/solr path=/select params={sort=n_tdt1+desc&distrib=false&wt=javabin&rows=10&version=2&fl=id&shard.url=127.0.0.1:37651/solr/collection1/&NOW=1346897741383&start=0&q=*:*&isShard=true&fsv=true} hits=18 status=0 QTime=7 
[junit4:junit4]   2> 13500 T1441 C121 P37653 REQ [collection1] webapp=/solr path=/select params={sort=n_tdt1+desc&distrib=false&wt=javabin&rows=10&version=2&fl=id&shard.url=127.0.0.1:37653/solr/collection1/&NOW=1346897741383&start=0&q=*:*&isShard=true&fsv=true} hits=30 status=0 QTime=7 
[junit4:junit4]   2> 13505 T1452 C120 P37655 REQ [collection1] webapp=/solr path=/select params={shard.url=127.0.0.1:37655/solr/collection1/&NOW=1346897741383&q=*:*&ids=126,5,136&distrib=false&isShard=true&wt=javabin&version=2} status=0 QTime=1 
[junit4:junit4]   2> 13505 T1441 C121 P37653 REQ [collection1] webapp=/solr path=/select params={shard.url=127.0.0.1:37653/solr/collection1/&NOW=1346897741383&q=*:*&ids=146,122,130,12&distrib=false&isShard=true&wt=javabin&version=2} status=0 QTime=1 
[junit4:junit4]   2> 13505 T1428 C119 P37651 REQ [collection1] webapp=/solr path=/select params={shard.url=127.0.0.1:37651/solr/collection1/&NOW=1346897741383&q=*:*&ids=110,108,13&distrib=false&isShard=true&wt=javabin&version=2} status=0 QTime=1 
[junit4:junit4]   2> 13507 T1439 C121 P37653 REQ [collection1] webapp=/solr path=/select params={sort=n_tdt1+desc&shards=shard3,shard4,shard5&wt=javabin&q=*:*&version=2} status=0 QTime=17 
[junit4:junit4]   2> 13510 T1412 C118 P37630 REQ [collection1] webapp=/solr path=/select params={distrib=false&sort=n_tdt1+asc&wt=javabin&q=*:*&version=2} hits=67 status=0 QTime=0 
[junit4:junit4]   2> 13515 T1429 C119 P37651 REQ [collection1] webapp=/solr path=/select params={sort=n_tdt1+asc&distrib=false&wt=javabin&rows=10&version=2&fl=id&shard.url=127.0.0.1:37651/solr/collection1/&NOW=1346897741406&start=0&q=*:*&isShard=true&fsv=true} hits=18 status=0 QTime=0 
[junit4:junit4]   2> 13515 T1442 C121 P37653 REQ [collection1] webapp=/solr path=/select params={sort=n_tdt1+asc&distrib=false&wt=javabin&rows=10&version=2&fl=id&shard.url=127.0.0.1:37653/solr/collection1/&NOW=1346897741406&start=0&q=*:*&isShard=true&fsv=true} hits=30 status=0 QTime=0 
[junit4:junit4]   2> 13515 T1453 C120 P37655 REQ [collection1] webapp=/solr path=/select params={sort=n_tdt1+asc&distrib=false&wt=javabin&rows=10&version=2&fl=id&shard.url=127.0.0.1:37655/solr/collection1/&NOW=1346897741406&start=0&q=*:*&isShard=true&fsv=true} hits=19 status=0 QTime=0 
[junit4:junit4]   2> 13519 T1453 C120 P37655 REQ [collection1] webapp=/solr path=/select params={shard.url=127.0.0.1:37655/solr/collection1/&NOW=1346897741406&q=*:*&ids=139,149,17&distrib=false&isShard=true&wt=javabin&version=2} status=0 QTime=0 
[junit4:junit4]   2> 13520 T1429 C119 P37651 REQ [collection1] webapp=/solr path=/select params={shard.url=127.0.0.1:37651/solr/collection1/&NOW=1346897741406&q=*:*&ids=138,109,148,100&distrib=false&isShard=true&wt=javabin&version=2} status=0 QTime=1 
[junit4:junit4]   2> 13520 T1442 C121 P37653 REQ [collection1] webapp=/solr path=/select params={shard.url=127.0.0.1:37653/solr/collection1/&NOW=1346897741406&q=*:*&ids=3,113,107&distrib=false&isShard=true&wt=javabin&version=2} status=0 QTime=1 
[junit4:junit4]   2> 13521 T1426 C119 P37651 REQ [collection1] webapp=/solr path=/select params={sort=n_tdt1+asc&wt=javabin&q=*:*&version=2} status=0 QTime=8 
[junit4:junit4]   2> 13525 T1412 C118 P37630 REQ [collection1] webapp=/solr path=/select params={distrib=false&sort=a_si+desc&wt=javabin&q=*:*&version=2} hits=67 status=0 QTime=1 
[junit4:junit4]   2> 13532 T1429 C119 P37651 REQ [collection1] webapp=/solr path=/select params={sort=a_si+desc&distrib=false&wt=javabin&rows=10&version=2&fl=id&shard.url=127.0.0.1:37651/solr/collection1/&NOW=1346897741421&start=0&q=*:*&isShard=true&fsv=true} hits=18 status=0 QTime=1 
[junit4:junit4]   2> 13532 T1442 C121 P37653 REQ [collection1] webapp=/solr path=/select params={sort=a_si+desc&distrib=false&wt=javabin&rows=10&version=2&fl=id&shard.url=127.0.0.1:37653/solr/collection1/&NOW=1346897741421&start=0&q=*:*&isShard=true&fsv=true} hits=30 status=0 QTime=1 
[junit4:junit4]   2> 13532 T1453 C120 P37655 REQ [collection1] webapp=/solr path=/select params={sort=a_si+desc&distrib=false&wt=javabin&rows=10&version=2&fl=id&shard.url=127.0.0.1:37655/solr/collection1/&NOW=1346897741421&start=0&q=*:*&isShard=true&fsv=true} hits=19 status=0 QTime=1 
[junit4:junit4]   2> 13536 T1429 C119 P37651 REQ [collection1] webapp=/solr path=/select params={shard.url=127.0.0.1:37651/solr/collection1/&NOW=1346897741421&q=*:*&ids=10,1,8,13&distrib=false&isShard=true&wt=javabin&version=2} status=0 QTime=1 
[junit4:junit4]   2> 13536 T1453 C120 P37655 REQ [collection1] webapp=/solr path=/select params={shard.url=127.0.0.1:37655/solr/collection1/&NOW=1346897741421&q=*:*&ids=5&distrib=false&isShard=true&wt=javabin&version=2} status=0 QTime=1 
[junit4:junit4]   2> 13536 T1442 C121 P37653 REQ [collection1] webapp=/solr path=/select params={shard.url=127.0.0.1:37653/solr/collection1/&NOW=1346897741421&q=*:*&ids=3,2,7,9,12&distrib=false&isShard=true&wt=javabin&version=2} status=0 QTime=1 
[junit4:junit4]   2> 13538 T1426 C119 P37651 REQ [collection1] webapp=/solr path=/select params={sort=a_si+desc&shards=shard3,shard4,shard5&wt=javabin&q=*:*&version=2} status=0 QTime=10 
[junit4:junit4]   2> 13541 T1412 C118 P37630 REQ [collection1] webapp=/solr path=/select params={distrib=false&sort=a_si+asc&wt=javabin&q=*:*&version=2} hits=67 status=0 QTime=0 
[junit4:junit4]   2> 13547 T1441 C121 P37653 REQ [collection1] webapp=/solr path=/select params={sort=a_si+asc&distrib=false&wt=javabin&rows=10&version=2&fl=id&shard.url=127.0.0.1:37653/solr/collection1/&NOW=1346897741437&start=0&q=*:*&isShard=true&fsv=true} hits=30 status=0 QTime=0 
[junit4:junit4]   2> 13547 T1452 C120 P37655 REQ [collection1] webapp=/solr path=/select params={sort=a_si+asc&distrib=false&wt=javabin&rows=10&version=2&fl=id&shard.url=127.0.0.1:37655/solr/collection1/&NOW=1346897741437&start=0&q=*:*&isShard=true&fsv=true} hits=19 status=0 QTime=0 
[junit4:junit4]   2> 13548 T1428 C119 P37651 REQ [collection1] webapp=/solr path=/select params={sort=a_si+asc&distrib=false&wt=javabin&rows=10&version=2&fl=id&shard.url=127.0.0.1:37651/solr/collection1/&NOW=1346897741437&start=0&q=*:*&isShard=true&fsv=true} hits=18 status=0 QTime=0 
[junit4:junit4]   2> 13552 T1428 C119 P37651 REQ [collection1] webapp=/solr path=/select params={shard.url=127.0.0.1:37651/solr/collection1/&NOW=1346897741437&q=*:*&ids=1,13,11&distrib=false&isShard=true&wt=javabin&version=2} status=0 QTime=1 
[junit4:junit4]   2> 13552 T1441 C121 P37653 REQ [collection1] webapp=/solr path=/select params={shard.url=127.0.0.1:37653/solr/collection1/&NOW=1346897741437&q=*:*&ids=3,2,7,6,4,9,12&distrib=false&isShard=true&wt=javabin&version=2} status=0 QTime=1 
[junit4:junit4]   2> 13553 T1439 C121 P37653 REQ [collection1] webapp=/solr path=/select params={sort=a_si+asc&wt=javabin&q=*:*&version=2} status=0 QTime=9 
[junit4:junit4]   2> 13557 T1412 C118 P37630 REQ [collection1] webapp=/solr path=/select params={sort=a_si+desc&fl=*,score&q=*:*&distrib=false&wt=javabin&version=2} hits=67 status=0 QTime=0 
[junit4:junit4]   2> 13563 T1441 C121 P37653 REQ [collection1] webapp=/solr path=/select params={sort=a_si+desc&distrib=false&wt=javabin&rows=10&version=2&fl=id,score&shard.url=127.0.0.1:37653/solr/collection1/&NOW=1346897741454&start=0&q=*:*&isShard=true&fsv=true} hits=30 status=0 QTime=0 
[junit4:junit4]   2> 13563 T1428 C119 P37651 REQ [collection1] webapp=/so

[...truncated too long message...]

ding=ISO-8859-1
[junit4:junit4] FAILURE  361s J1 | BasicDistributedZkTest.testDistribSearch <<<
[junit4:junit4]    > Throwable #1: java.lang.AssertionError: some core start times did not change on reload
[junit4:junit4]    > 	at __randomizedtesting.SeedInfo.seed([6CF48C9B95951FB1:ED120283E2CA7F8D]:0)
[junit4:junit4]    > 	at org.junit.Assert.fail(Assert.java:93)
[junit4:junit4]    > 	at org.junit.Assert.assertTrue(Assert.java:43)
[junit4:junit4]    > 	at org.apache.solr.cloud.BasicDistributedZkTest.testCollectionsAPI(BasicDistributedZkTest.java:409)
[junit4:junit4]    > 	at org.apache.solr.cloud.BasicDistributedZkTest.doTest(BasicDistributedZkTest.java:313)
[junit4:junit4]    > 	at org.apache.solr.BaseDistributedSearchTestCase.testDistribSearch(BaseDistributedSearchTestCase.java:691)
[junit4:junit4]    > 	at sun.reflect.NativeMethodAccessorImpl.invoke0(Native Method)
[junit4:junit4]    > 	at sun.reflect.NativeMethodAccessorImpl.invoke(NativeMethodAccessorImpl.java:57)
[junit4:junit4]    > 	at sun.reflect.DelegatingMethodAccessorImpl.invoke(DelegatingMethodAccessorImpl.java:43)
[junit4:junit4]    > 	at java.lang.reflect.Method.invoke(Method.java:601)
[junit4:junit4]    > 	at com.carrotsearch.randomizedtesting.RandomizedRunner.invoke(RandomizedRunner.java:1559)
[junit4:junit4]    > 	at com.carrotsearch.randomizedtesting.RandomizedRunner.access$600(RandomizedRunner.java:79)
[junit4:junit4]    > 	at com.carrotsearch.randomizedtesting.RandomizedRunner$6.evaluate(RandomizedRunner.java:737)
[junit4:junit4]    > 	at com.carrotsearch.randomizedtesting.RandomizedRunner$7.evaluate(RandomizedRunner.java:773)
[junit4:junit4]    > 	at com.carrotsearch.randomizedtesting.RandomizedRunner$8.evaluate(RandomizedRunner.java:787)
[junit4:junit4]    > 	at com.carrotsearch.randomizedtesting.rules.SystemPropertiesRestoreRule$1.evaluate(SystemPropertiesRestoreRule.java:53)
[junit4:junit4]    > 	at org.apache.lucene.util.TestRuleSetupTeardownChained$1.evaluate(TestRuleSetupTeardownChained.java:50)
[junit4:junit4]    > 	at org.apache.lucene.util.TestRuleFieldCacheSanity$1.evaluate(TestRuleFieldCacheSanity.java:51)
[junit4:junit4]    > 	at org.apache.lucene.util.AbstractBeforeAfterRule$1.evaluate(AbstractBeforeAfterRule.java:45)
[junit4:junit4]    > 	at com.carrotsearch.randomizedtesting.rules.SystemPropertiesInvariantRule$1.evaluate(SystemPropertiesInvariantRule.java:55)
[junit4:junit4]    > 	at org.apache.lucene.util.TestRuleThreadAndTestName$1.evaluate(TestRuleThreadAndTestName.java:48)
[junit4:junit4]    > 	at org.apache.lucene.util.TestRuleIgnoreAfterMaxFailures$1.evaluate(TestRuleIgnoreAfterMaxFailures.java:70)
[junit4:junit4]    > 	at org.apache.lucene.util.TestRuleMarkFailure$1.evaluate(TestRuleMarkFailure.java:48)
[junit4:junit4]    > 	at com.carrotsearch.randomizedtesting.rules.StatementAdapter.evaluate(StatementAdapter.java:36)
[junit4:junit4]    > 	at com.carrotsearch.randomizedtesting.ThreadLeakControl$StatementRunner.run(ThreadLeakControl.java:358)
[junit4:junit4]    > 	at com.carrotsearch.randomizedtesting.ThreadLeakControl.forkTimeoutingTask(ThreadLeakControl.java:782)
[junit4:junit4]    > 	at com.carrotsearch.randomizedtesting.ThreadLeakControl$3.evaluate(ThreadLeakControl.java:442)
[junit4:junit4]    > 	at com.carrotsearch.randomizedtesting.RandomizedRunner.runSingleTest(RandomizedRunner.java:746)
[junit4:junit4]    > 	at com.carrotsearch.randomizedtesting.RandomizedRunner$3.evaluate(RandomizedRunner.java:648)
[junit4:junit4]    > 	at com.carrotsearch.randomizedtesting.RandomizedRunner$4.evaluate(RandomizedRunner.java:682)
[junit4:junit4]    > 	at com.carrotsearch.randomizedtesting.RandomizedRunner$5.evaluate(RandomizedRunner.java:693)
[junit4:junit4]    > 	at com.carrotsearch.randomizedtesting.rules.StatementAdapter.evaluate(StatementAdapter.java:36)
[junit4:junit4]    > 	at com.carrotsearch.randomizedtesting.rules.SystemPropertiesRestoreRule$1.evaluate(SystemPropertiesRestoreRule.java:53)
[junit4:junit4]    > 	at org.apache.lucene.util.AbstractBeforeAfterRule$1.evaluate(AbstractBeforeAfterRule.java:45)
[junit4:junit4]    > 	at org.apache.lucene.util.TestRuleStoreClassName$1.evaluate(TestRuleStoreClassName.java:42)
[junit4:junit4]    > 	at com.carrotsearch.randomizedtesting.rules.SystemPropertiesInvariantRule$1.evaluate(SystemPropertiesInvariantRule.java:55)
[junit4:junit4]    > 	at com.carrotsearch.randomizedtesting.rules.NoShadowingOrOverridesOnMethodsRule$1.evaluate(NoShadowingOrOverridesOnMethodsRule.java:39)
[junit4:junit4]    > 	at com.carrotsearch.randomizedtesting.rules.NoShadowingOrOverridesOnMethodsRule$1.evaluate(NoShadowingOrOverridesOnMethodsRule.java:39)
[junit4:junit4]    > 	at org.apache.lucene.util.TestRuleAssertionsRequired$1.evaluate(TestRuleAssertionsRequired.java:40)
[junit4:junit4]    > 	at org.apache.lucene.util.TestRuleMarkFailure$1.evaluate(TestRuleMarkFailure.java:48)
[junit4:junit4]    > 	at org.apache.lucene.util.TestRuleIgnoreAfterMaxFailures$1.evaluate(TestRuleIgnoreAfterMaxFailures.java:70)
[junit4:junit4]    > 	at org.apache.lucene.util.TestRuleIgnoreTestSuites$1.evaluate(TestRuleIgnoreTestSuites.java:55)
[junit4:junit4]    > 	at com.carrotsearch.randomizedtesting.rules.StatementAdapter.evaluate(StatementAdapter.java:36)
[junit4:junit4]    > 	at com.carrotsearch.randomizedtesting.ThreadLeakControl$StatementRunner.run(ThreadLeakControl.java:358)
[junit4:junit4]    > 	at java.lang.Thread.run(Thread.java:722)
[junit4:junit4]   2> 360504 T1400 oas.SolrTestCaseJ4.deleteCore ###deleteCore
[junit4:junit4]   2> NOTE: test params are: codec=Lucene40: {n_f1=MockVariableIntBlock(baseBlockSize=17), foo_b=PostingsFormat(name=Memory doPackFST= true), cat=PostingsFormat(name=SimpleText), foo_d=Pulsing40(freqCutoff=2 minBlockSize=80 maxBlockSize=168), foo_f=PostingsFormat(name=Memory doPackFST= true), n_tl1=MockVariableIntBlock(baseBlockSize=17), n_d1=PostingsFormat(name=SimpleText), rnd_b=Pulsing40(freqCutoff=2 minBlockSize=80 maxBlockSize=168), intDefault=PostingsFormat(name=SimpleText), n_td1=MockVariableIntBlock(baseBlockSize=17), timestamp=PostingsFormat(name=SimpleText), id=Pulsing40(freqCutoff=2 minBlockSize=80 maxBlockSize=168), range_facet_sl=PostingsFormat(name=Memory doPackFST= true), range_facet_si=MockVariableIntBlock(baseBlockSize=17), oddField_s=PostingsFormat(name=Memory doPackFST= true), sequence_i=PostingsFormat(name=Memory doPackFST= true), name=Pulsing40(freqCutoff=2 minBlockSize=80 maxBlockSize=168), foo_i=MockVariableIntBlock(baseBlockSize=17), regex_dup_B_s=PostingsFormat(name=SimpleText), multiDefault=MockVariableIntBlock(baseBlockSize=17), n_tf1=PostingsFormat(name=SimpleText), n_dt1=MockVariableIntBlock(baseBlockSize=17), genre_s=PostingsFormat(name=Memory doPackFST= true), author_t=MockVariableIntBlock(baseBlockSize=17), n_ti1=Pulsing40(freqCutoff=2 minBlockSize=80 maxBlockSize=168), range_facet_l=PostingsFormat(name=SimpleText), text=PostingsFormat(name=Memory doPackFST= true), _version_=PostingsFormat(name=SimpleText), val_i=Pulsing40(freqCutoff=2 minBlockSize=80 maxBlockSize=168), SubjectTerms_mfacet=PostingsFormat(name=SimpleText), series_t=MockVariableIntBlock(baseBlockSize=17), a_t=PostingsFormat(name=SimpleText), n_tdt1=PostingsFormat(name=SimpleText), regex_dup_A_s=PostingsFormat(name=Memory doPackFST= true), price=PostingsFormat(name=Memory doPackFST= true), other_tl1=PostingsFormat(name=SimpleText), n_l1=PostingsFormat(name=SimpleText), a_si=MockVariableIntBlock(baseBlockSize=17), inStock=PostingsFormat(name=Memory doPackFST= true)}, sim=DefaultSimilarity, locale=lv_LV, timezone=Europe/Budapest
[junit4:junit4]   2> NOTE: FreeBSD 9.0-RELEASE amd64/Oracle Corporation 1.7.0_06 (64-bit)/cpus=16,threads=1,free=105775296,total=536870912
[junit4:junit4]   2> NOTE: All tests run in this JVM: [OpenExchangeRatesOrgProviderTest, TestCSVResponseWriter, TestReload, TimeZoneUtilsTest, DocumentAnalysisRequestHandlerTest, TestSort, LukeRequestHandlerTest, TestReversedWildcardFilterFactory, TestSurroundQueryParser, FullSolrCloudDistribCmdsTest, TestSolrXMLSerializer, TestArbitraryIndexDir, TestCharFilters, TestCodecSupport, TermVectorComponentDistributedTest, FileUtilsTest, EchoParamsTest, DocumentBuilderTest, OverseerTest, TestReplicationHandler, TestRealTimeGet, SolrCoreTest, TestUtils, DirectUpdateHandlerTest, ZkNodePropsTest, TestStressReorder, BasicFunctionalityTest, UpdateParamsTest, TestPropInject, TestFastOutputStream, StatsComponentTest, QueryParsingTest, TestFoldingMultitermQuery, ShowFileRequestHandlerTest, QueryEqualityTest, TestHashPartitioner, DOMUtilTest, SolrInfoMBeanTest, LeaderElectionTest, HighlighterTest, DebugComponentTest, TestJmxIntegration, BasicZkTest, BadIndexSchemaTest, SpellingQueryConverterTest, RAMDirectoryFactoryTest, IndexSchemaTest, StandardRequestHandlerTest, ReturnFieldsTest, ClusterStateTest, SuggesterTSTTest, IndexSchemaRuntimeFieldTest, ConvertedLegacyTest, SolrIndexConfigTest, BasicDistributedZkTest]
[junit4:junit4] Completed on J1 in 360.72s, 1 test, 1 failure <<< FAILURES!

[...truncated 324 lines...]
BUILD FAILED
/usr/home/hudson/hudson-slave/workspace/Lucene-Solr-Tests-4.x-java7/build.xml:29: The following error occurred while executing this line:
/usr/home/hudson/hudson-slave/workspace/Lucene-Solr-Tests-4.x-java7/solr/build.xml:146: The following error occurred while executing this line:
/usr/home/hudson/hudson-slave/workspace/Lucene-Solr-Tests-4.x-java7/lucene/module-build.xml:63: The following error occurred while executing this line:
/usr/home/hudson/hudson-slave/workspace/Lucene-Solr-Tests-4.x-java7/lucene/common-build.xml:1095: The following error occurred while executing this line:
/usr/home/hudson/hudson-slave/workspace/Lucene-Solr-Tests-4.x-java7/lucene/common-build.xml:772: There were test failures: 228 suites, 910 tests, 1 failure, 7 ignored (2 assumptions)

Total time: 44 minutes 25 seconds
Build step 'Invoke Ant' marked build as failure
Recording test results
Email was triggered for: Failure
Sending email for trigger: Failure



Mime
View raw message