lucene-dev mailing list archives

Site index · List index
Message view « Date » · « Thread »
Top « Date » · « Thread »
From Apache Jenkins Server <jenk...@builds.apache.org>
Subject [JENKINS] Lucene-Solr-Tests-4.x-java7 - Build # 466 - Failure
Date Tue, 18 Sep 2012 07:09:44 GMT
Build: https://builds.apache.org/job/Lucene-Solr-Tests-4.x-java7/466/

1 tests failed.
REGRESSION:  org.apache.solr.cloud.SyncSliceTest.testDistribSearch

Error Message:
There are still nodes recoverying

Stack Trace:
java.lang.AssertionError: There are still nodes recoverying
	at __randomizedtesting.SeedInfo.seed([3FB5447824053B5:821DDA5FF51F3389]:0)
	at org.junit.Assert.fail(Assert.java:93)
	at org.apache.solr.cloud.AbstractDistribZkTestBase.waitForRecoveriesToFinish(AbstractDistribZkTestBase.java:154)
	at org.apache.solr.cloud.AbstractFullDistribZkTestBase.waitForRecoveriesToFinish(AbstractFullDistribZkTestBase.java:560)
	at org.apache.solr.cloud.AbstractFullDistribZkTestBase.waitForThingsToLevelOut(AbstractFullDistribZkTestBase.java:1135)
	at org.apache.solr.cloud.SyncSliceTest.doTest(SyncSliceTest.java:162)
	at org.apache.solr.BaseDistributedSearchTestCase.testDistribSearch(BaseDistributedSearchTestCase.java:695)
	at sun.reflect.NativeMethodAccessorImpl.invoke0(Native Method)
	at sun.reflect.NativeMethodAccessorImpl.invoke(NativeMethodAccessorImpl.java:57)
	at sun.reflect.DelegatingMethodAccessorImpl.invoke(DelegatingMethodAccessorImpl.java:43)
	at java.lang.reflect.Method.invoke(Method.java:601)
	at com.carrotsearch.randomizedtesting.RandomizedRunner.invoke(RandomizedRunner.java:1559)
	at com.carrotsearch.randomizedtesting.RandomizedRunner.access$600(RandomizedRunner.java:79)
	at com.carrotsearch.randomizedtesting.RandomizedRunner$6.evaluate(RandomizedRunner.java:737)
	at com.carrotsearch.randomizedtesting.RandomizedRunner$7.evaluate(RandomizedRunner.java:773)
	at com.carrotsearch.randomizedtesting.RandomizedRunner$8.evaluate(RandomizedRunner.java:787)
	at com.carrotsearch.randomizedtesting.rules.SystemPropertiesRestoreRule$1.evaluate(SystemPropertiesRestoreRule.java:53)
	at org.apache.lucene.util.TestRuleSetupTeardownChained$1.evaluate(TestRuleSetupTeardownChained.java:50)
	at org.apache.lucene.util.TestRuleFieldCacheSanity$1.evaluate(TestRuleFieldCacheSanity.java:51)
	at org.apache.lucene.util.AbstractBeforeAfterRule$1.evaluate(AbstractBeforeAfterRule.java:45)
	at com.carrotsearch.randomizedtesting.rules.SystemPropertiesInvariantRule$1.evaluate(SystemPropertiesInvariantRule.java:55)
	at org.apache.lucene.util.TestRuleThreadAndTestName$1.evaluate(TestRuleThreadAndTestName.java:48)
	at org.apache.lucene.util.TestRuleIgnoreAfterMaxFailures$1.evaluate(TestRuleIgnoreAfterMaxFailures.java:70)
	at org.apache.lucene.util.TestRuleMarkFailure$1.evaluate(TestRuleMarkFailure.java:48)
	at com.carrotsearch.randomizedtesting.rules.StatementAdapter.evaluate(StatementAdapter.java:36)
	at com.carrotsearch.randomizedtesting.ThreadLeakControl$StatementRunner.run(ThreadLeakControl.java:358)
	at com.carrotsearch.randomizedtesting.ThreadLeakControl.forkTimeoutingTask(ThreadLeakControl.java:782)
	at com.carrotsearch.randomizedtesting.ThreadLeakControl$3.evaluate(ThreadLeakControl.java:442)
	at com.carrotsearch.randomizedtesting.RandomizedRunner.runSingleTest(RandomizedRunner.java:746)
	at com.carrotsearch.randomizedtesting.RandomizedRunner$3.evaluate(RandomizedRunner.java:648)
	at com.carrotsearch.randomizedtesting.RandomizedRunner$4.evaluate(RandomizedRunner.java:682)
	at com.carrotsearch.randomizedtesting.RandomizedRunner$5.evaluate(RandomizedRunner.java:693)
	at com.carrotsearch.randomizedtesting.rules.StatementAdapter.evaluate(StatementAdapter.java:36)
	at com.carrotsearch.randomizedtesting.rules.SystemPropertiesRestoreRule$1.evaluate(SystemPropertiesRestoreRule.java:53)
	at org.apache.lucene.util.AbstractBeforeAfterRule$1.evaluate(AbstractBeforeAfterRule.java:45)
	at org.apache.lucene.util.TestRuleStoreClassName$1.evaluate(TestRuleStoreClassName.java:42)
	at com.carrotsearch.randomizedtesting.rules.SystemPropertiesInvariantRule$1.evaluate(SystemPropertiesInvariantRule.java:55)
	at com.carrotsearch.randomizedtesting.rules.NoShadowingOrOverridesOnMethodsRule$1.evaluate(NoShadowingOrOverridesOnMethodsRule.java:39)
	at com.carrotsearch.randomizedtesting.rules.NoShadowingOrOverridesOnMethodsRule$1.evaluate(NoShadowingOrOverridesOnMethodsRule.java:39)
	at com.carrotsearch.randomizedtesting.rules.StatementAdapter.evaluate(StatementAdapter.java:36)
	at org.apache.lucene.util.TestRuleAssertionsRequired$1.evaluate(TestRuleAssertionsRequired.java:43)
	at org.apache.lucene.util.TestRuleMarkFailure$1.evaluate(TestRuleMarkFailure.java:48)
	at org.apache.lucene.util.TestRuleIgnoreAfterMaxFailures$1.evaluate(TestRuleIgnoreAfterMaxFailures.java:70)
	at org.apache.lucene.util.TestRuleIgnoreTestSuites$1.evaluate(TestRuleIgnoreTestSuites.java:55)
	at com.carrotsearch.randomizedtesting.rules.StatementAdapter.evaluate(StatementAdapter.java:36)
	at com.carrotsearch.randomizedtesting.ThreadLeakControl$StatementRunner.run(ThreadLeakControl.java:358)
	at java.lang.Thread.run(Thread.java:722)




Build Log:
[...truncated 7653 lines...]
[junit4:junit4] Suite: org.apache.solr.cloud.SyncSliceTest
[junit4:junit4]   2> 10 T14 oas.SolrTestCaseJ4.setUp ###Starting testDistribSearch
[junit4:junit4]   2> Creating dataDir: /usr/home/hudson/hudson-slave/workspace/Lucene-Solr-Tests-4.x-java7/solr/build/solr-core/test/J1/./solrtest-SyncSliceTest-1347951352589
[junit4:junit4]   2> 20 T14 oasc.ZkTestServer.run STARTING ZK TEST SERVER
[junit4:junit4]   2> 165 T15 oaz.Environment.logEnv Server environment:zookeeper.version=3.3.6-1366786, built on 07/29/2012 06:22 GMT
[junit4:junit4]   2> 166 T15 oaz.Environment.logEnv Server environment:host.name=lucene.zones.apache.org
[junit4:junit4]   2> 166 T15 oaz.Environment.logEnv Server environment:java.version=1.7.0_06
[junit4:junit4]   2> 167 T15 oaz.Environment.logEnv Server environment:java.vendor=Oracle Corporation
[junit4:junit4]   2> 167 T15 oaz.Environment.logEnv Server environment:java.home=/usr/local/openjdk7/jre
[junit4:junit4]   2> 168 T15 oaz.Environment.logEnv Server environment:java.class.path=/usr/home/hudson/hudson-slave/workspace/Lucene-Solr-Tests-4.x-java7/solr/build/solr-core/classes/test:/usr/home/hudson/hudson-slave/workspace/Lucene-Solr-Tests-4.x-java7/solr/build/solr-test-framework/classes/java:/usr/home/hudson/hudson-slave/workspace/Lucene-Solr-Tests-4.x-java7/solr/build/solr-core/test-files:/usr/home/hudson/hudson-slave/workspace/Lucene-Solr-Tests-4.x-java7/lucene/build/codecs/classes/java:/usr/home/hudson/hudson-slave/workspace/Lucene-Solr-Tests-4.x-java7/lucene/build/test-framework/classes/java:/usr/home/hudson/hudson-slave/workspace/Lucene-Solr-Tests-4.x-java7/solr/build/solr-solrj/classes/java:/usr/home/hudson/hudson-slave/workspace/Lucene-Solr-Tests-4.x-java7/solr/build/solr-core/classes/java:/usr/home/hudson/hudson-slave/workspace/Lucene-Solr-Tests-4.x-java7/lucene/build/analysis/common/lucene-analyzers-common-4.0-SNAPSHOT.jar:/usr/home/hudson/hudson-slave/workspace/Lucene-Solr-Tests-4.x-java7/lucene/build/analysis/kuromoji/lucene-analyzers-kuromoji-4.0-SNAPSHOT.jar:/usr/home/hudson/hudson-slave/workspace/Lucene-Solr-Tests-4.x-java7/lucene/build/analysis/phonetic/lucene-analyzers-phonetic-4.0-SNAPSHOT.jar:/usr/home/hudson/hudson-slave/workspace/Lucene-Solr-Tests-4.x-java7/lucene/build/highlighter/lucene-highlighter-4.0-SNAPSHOT.jar:/usr/home/hudson/hudson-slave/workspace/Lucene-Solr-Tests-4.x-java7/lucene/build/memory/lucene-memory-4.0-SNAPSHOT.jar:/usr/home/hudson/hudson-slave/workspace/Lucene-Solr-Tests-4.x-java7/lucene/build/misc/lucene-misc-4.0-SNAPSHOT.jar:/usr/home/hudson/hudson-slave/workspace/Lucene-Solr-Tests-4.x-java7/lucene/build/spatial/lucene-spatial-4.0-SNAPSHOT.jar:/usr/home/hudson/hudson-slave/workspace/Lucene-Solr-Tests-4.x-java7/lucene/build/suggest/lucene-suggest-4.0-SNAPSHOT.jar:/usr/home/hudson/hudson-slave/workspace/Lucene-Solr-Tests-4.x-java7/lucene/build/grouping/lucene-grouping-4.0-SNAPSHOT.jar:/usr/home/hudson/hudson-slave/workspace/Lucene-Solr-Tests-4.x-java7/lucene/build/queries/lucene-queries-4.0-SNAPSHOT.jar:/usr/home/hudson/hudson-slave/workspace/Lucene-Solr-Tests-4.x-java7/lucene/build/queryparser/lucene-queryparser-4.0-SNAPSHOT.jar:/usr/home/hudson/hudson-slave/workspace/Lucene-Solr-Tests-4.x-java7/solr/core/lib/commons-cli-1.2.jar:/usr/home/hudson/hudson-slave/workspace/Lucene-Solr-Tests-4.x-java7/solr/core/lib/commons-codec-1.7.jar:/usr/home/hudson/hudson-slave/workspace/Lucene-Solr-Tests-4.x-java7/solr/core/lib/commons-fileupload-1.2.1.jar:/usr/home/hudson/hudson-slave/workspace/Lucene-Solr-Tests-4.x-java7/solr/core/lib/commons-lang-2.6.jar:/usr/home/hudson/hudson-slave/workspace/Lucene-Solr-Tests-4.x-java7/solr/core/lib/easymock-2.2.jar:/usr/home/hudson/hudson-slave/workspace/Lucene-Solr-Tests-4.x-java7/solr/core/lib/guava-r05.jar:/usr/home/hudson/hudson-slave/workspace/Lucene-Solr-Tests-4.x-java7/solr/core/lib/javax.servlet-api-3.0.1.jar:/usr/home/hudson/hudson-slave/workspace/Lucene-Solr-Tests-4.x-java7/solr/core/lib/spatial4j-0.3.jar:/usr/home/hudson/hudson-slave/workspace/Lucene-Solr-Tests-4.x-java7/solr/solrj/lib/commons-io-2.1.jar:/usr/home/hudson/hudson-slave/workspace/Lucene-Solr-Tests-4.x-java7/solr/solrj/lib/httpclient-4.1.3.jar:/usr/home/hudson/hudson-slave/workspace/Lucene-Solr-Tests-4.x-java7/solr/solrj/lib/httpcore-4.1.4.jar:/usr/home/hudson/hudson-slave/workspace/Lucene-Solr-Tests-4.x-java7/solr/solrj/lib/httpmime-4.1.3.jar:/usr/home/hudson/hudson-slave/workspace/Lucene-Solr-Tests-4.x-java7/solr/solrj/lib/jcl-over-slf4j-1.6.4.jar:/usr/home/hudson/hudson-slave/workspace/Lucene-Solr-Tests-4.x-java7/solr/solrj/lib/log4j-over-slf4j-1.6.4.jar:/usr/home/hudson/hudson-slave/workspace/Lucene-Solr-Tests-4.x-java7/solr/solrj/lib/slf4j-api-1.6.4.jar:/usr/home/hudson/hudson-slave/workspace/Lucene-Solr-Tests-4.x-java7/solr/solrj/lib/slf4j-jdk14-1.6.4.jar:/usr/home/hudson/hudson-slave/workspace/Lucene-Solr-Tests-4.x-java7/solr/solrj/lib/wstx-asl-3.2.7.jar:/usr/home/hudson/hudson-slave/workspace/Lucene-Solr-Tests-4.x-java7/solr/solrj/lib/zookeeper-3.3.6.jar:/usr/home/hudson/hudson-slave/workspace/Lucene-Solr-Tests-4.x-java7/solr/example/lib/jetty-continuation-8.1.2.v20120308.jar:/usr/home/hudson/hudson-slave/workspace/Lucene-Solr-Tests-4.x-java7/solr/example/lib/jetty-deploy-8.1.2.v20120308.jar:/usr/home/hudson/hudson-slave/workspace/Lucene-Solr-Tests-4.x-java7/solr/example/lib/jetty-http-8.1.2.v20120308.jar:/usr/home/hudson/hudson-slave/workspace/Lucene-Solr-Tests-4.x-java7/solr/example/lib/jetty-io-8.1.2.v20120308.jar:/usr/home/hudson/hudson-slave/workspace/Lucene-Solr-Tests-4.x-java7/solr/example/lib/jetty-jmx-8.1.2.v20120308.jar:/usr/home/hudson/hudson-slave/workspace/Lucene-Solr-Tests-4.x-java7/solr/example/lib/jetty-security-8.1.2.v20120308.jar:/usr/home/hudson/hudson-slave/workspace/Lucene-Solr-Tests-4.x-java7/solr/example/lib/jetty-server-8.1.2.v20120308.jar:/usr/home/hudson/hudson-slave/workspace/Lucene-Solr-Tests-4.x-java7/solr/example/lib/jetty-servlet-8.1.2.v20120308.jar:/usr/home/hudson/hudson-slave/workspace/Lucene-Solr-Tests-4.x-java7/solr/example/lib/jetty-util-8.1.2.v20120308.jar:/usr/home/hudson/hudson-slave/workspace/Lucene-Solr-Tests-4.x-java7/solr/example/lib/jetty-webapp-8.1.2.v20120308.jar:/usr/home/hudson/hudson-slave/workspace/Lucene-Solr-Tests-4.x-java7/solr/example/lib/jetty-xml-8.1.2.v20120308.jar:/usr/home/hudson/hudson-slave/workspace/Lucene-Solr-Tests-4.x-java7/solr/example/lib/servlet-api-3.0.jar:/usr/home/hudson/hudson-slave/workspace/Lucene-Solr-Tests-4.x-java7/solr/example/example-DIH/solr/db/lib/hsqldb-1.8.0.10.jar:/usr/home/hudson/hudson-slave/workspace/Lucene-Solr-Tests-4.x-java7/lucene/build/core/classes/java:/usr/home/hudson/hudson-slave/workspace/Lucene-Solr-Tests-4.x-java7/lucene/test-framework/lib/junit-4.10.jar:/usr/home/hudson/hudson-slave/workspace/Lucene-Solr-Tests-4.x-java7/lucene/test-framework/lib/randomizedtesting-runner-2.0.0.jar:/home/hudson/hudson-slave/tools/Ant/ant-1.8.2/lib/ant-launcher.jar:/home/hudson/.ant/lib/ivy-2.2.0.jar:/home/hudson/hudson-slave/tools/Ant/ant-1.8.2/lib/ant-apache-regexp.jar:/home/hudson/hudson-slave/tools/Ant/ant-1.8.2/lib/ant-junit.jar:/home/hudson/hudson-slave/tools/Ant/ant-1.8.2/lib/ant-apache-bsf.jar:/home/hudson/hudson-slave/tools/Ant/ant-1.8.2/lib/ant-commons-net.jar:/home/hudson/hudson-slave/tools/Ant/ant-1.8.2/lib/ant-antlr.jar:/home/hudson/hudson-slave/tools/Ant/ant-1.8.2/lib/ant-apache-log4j.jar:/home/hudson/hudson-slave/tools/Ant/ant-1.8.2/lib/ant-commons-logging.jar:/home/hudson/hudson-slave/tools/Ant/ant-1.8.2/lib/ant-apache-xalan2.jar:/home/hudson/hudson-slave/tools/Ant/ant-1.8.2/lib/ant-apache-oro.jar:/home/hudson/hudson-slave/tools/Ant/ant-1.8.2/lib/ant-junit4.jar:/home/hudson/hudson-slave/tools/Ant/ant-1.8.2/lib/ant-netrexx.jar:/home/hudson/hudson-slave/tools/Ant/ant-1.8.2/lib/ant-swing.jar:/home/hudson/hudson-slave/tools/Ant/ant-1.8.2/lib/ant-javamail.jar:/home/hudson/hudson-slave/tools/Ant/ant-1.8.2/lib/ant-jsch.jar:/home/hudson/hudson-slave/tools/Ant/ant-1.8.2/lib/ant-jmf.jar:/home/hudson/hudson-slave/tools/Ant/ant-1.8.2/lib/ant.jar:/home/hudson/hudson-slave/tools/Ant/ant-1.8.2/lib/ant-apache-bcel.jar:/home/hudson/hudson-slave/tools/Ant/ant-1.8.2/lib/ant-jai.jar:/home/hudson/hudson-slave/tools/Ant/ant-1.8.2/lib/ant-testutil.jar:/home/hudson/hudson-slave/tools/Ant/ant-1.8.2/lib/ant-apache-resolver.jar:/home/hudson/hudson-slave/tools/Ant/ant-1.8.2/lib/ant-jdepend.jar:/usr/local/openjdk7/lib/tools.jar:/home/hudson/.ivy2/cache/com.carrotsearch.randomizedtesting/junit4-ant/jars/junit4-ant-2.0.0.jar
[junit4:junit4]   2> 170 T15 oaz.Environment.logEnv Server environment:java.library.path=/usr/local/openjdk7/jre/lib/amd64/server:/usr/local/openjdk7/jre/lib/amd64:/usr/local/openjdk7/jre/../lib/amd64:/usr/local/openjdk6/jre/lib/amd64/server:/usr/local/openjdk6/jre/lib/amd64:/usr/local/openjdk6/jre/../lib/amd64:/usr/java/packages/lib/amd64:/lib:/usr/lib:/usr/local/lib
[junit4:junit4]   2> 170 T15 oaz.Environment.logEnv Server environment:java.io.tmpdir=.
[junit4:junit4]   2> 171 T15 oaz.Environment.logEnv Server environment:java.compiler=<NA>
[junit4:junit4]   2> 172 T15 oaz.Environment.logEnv Server environment:os.name=FreeBSD
[junit4:junit4]   2> 172 T15 oaz.Environment.logEnv Server environment:os.arch=amd64
[junit4:junit4]   2> 173 T15 oaz.Environment.logEnv Server environment:os.version=9.0-RELEASE
[junit4:junit4]   2> 174 T15 oaz.Environment.logEnv Server environment:user.name=hudson
[junit4:junit4]   2> 174 T15 oaz.Environment.logEnv Server environment:user.home=/home/hudson
[junit4:junit4]   2> 175 T15 oaz.Environment.logEnv Server environment:user.dir=/usr/home/hudson/hudson-slave/workspace/Lucene-Solr-Tests-4.x-java7/solr/build/solr-core/test/J1
[junit4:junit4]   2> 234 T15 oazs.ZooKeeperServer.setTickTime tickTime set to 1000
[junit4:junit4]   2> 269 T15 oazs.NIOServerCnxn$Factory.<init> binding to port 0.0.0.0/0.0.0.0:0
[junit4:junit4]   2> 330 T14 oasc.ZkTestServer.run start zk server on port:10849
[junit4:junit4]   2> 336 T15 oazsp.FileTxnSnapLog.save Snapshotting: 0
[junit4:junit4]   2> 415 T14 oaz.Environment.logEnv Client environment:zookeeper.version=3.3.6-1366786, built on 07/29/2012 06:22 GMT
[junit4:junit4]   2> 416 T14 oaz.Environment.logEnv Client environment:host.name=lucene.zones.apache.org
[junit4:junit4]   2> 417 T14 oaz.Environment.logEnv Client environment:java.version=1.7.0_06
[junit4:junit4]   2> 417 T14 oaz.Environment.logEnv Client environment:java.vendor=Oracle Corporation
[junit4:junit4]   2> 418 T14 oaz.Environment.logEnv Client environment:java.home=/usr/local/openjdk7/jre
[junit4:junit4]   2> 418 T14 oaz.Environment.logEnv Client environment:java.class.path=/usr/home/hudson/hudson-slave/workspace/Lucene-Solr-Tests-4.x-java7/solr/build/solr-core/classes/test:/usr/home/hudson/hudson-slave/workspace/Lucene-Solr-Tests-4.x-java7/solr/build/solr-test-framework/classes/java:/usr/home/hudson/hudson-slave/workspace/Lucene-Solr-Tests-4.x-java7/solr/build/solr-core/test-files:/usr/home/hudson/hudson-slave/workspace/Lucene-Solr-Tests-4.x-java7/lucene/build/codecs/classes/java:/usr/home/hudson/hudson-slave/workspace/Lucene-Solr-Tests-4.x-java7/lucene/build/test-framework/classes/java:/usr/home/hudson/hudson-slave/workspace/Lucene-Solr-Tests-4.x-java7/solr/build/solr-solrj/classes/java:/usr/home/hudson/hudson-slave/workspace/Lucene-Solr-Tests-4.x-java7/solr/build/solr-core/classes/java:/usr/home/hudson/hudson-slave/workspace/Lucene-Solr-Tests-4.x-java7/lucene/build/analysis/common/lucene-analyzers-common-4.0-SNAPSHOT.jar:/usr/home/hudson/hudson-slave/workspace/Lucene-Solr-Tests-4.x-java7/lucene/build/analysis/kuromoji/lucene-analyzers-kuromoji-4.0-SNAPSHOT.jar:/usr/home/hudson/hudson-slave/workspace/Lucene-Solr-Tests-4.x-java7/lucene/build/analysis/phonetic/lucene-analyzers-phonetic-4.0-SNAPSHOT.jar:/usr/home/hudson/hudson-slave/workspace/Lucene-Solr-Tests-4.x-java7/lucene/build/highlighter/lucene-highlighter-4.0-SNAPSHOT.jar:/usr/home/hudson/hudson-slave/workspace/Lucene-Solr-Tests-4.x-java7/lucene/build/memory/lucene-memory-4.0-SNAPSHOT.jar:/usr/home/hudson/hudson-slave/workspace/Lucene-Solr-Tests-4.x-java7/lucene/build/misc/lucene-misc-4.0-SNAPSHOT.jar:/usr/home/hudson/hudson-slave/workspace/Lucene-Solr-Tests-4.x-java7/lucene/build/spatial/lucene-spatial-4.0-SNAPSHOT.jar:/usr/home/hudson/hudson-slave/workspace/Lucene-Solr-Tests-4.x-java7/lucene/build/suggest/lucene-suggest-4.0-SNAPSHOT.jar:/usr/home/hudson/hudson-slave/workspace/Lucene-Solr-Tests-4.x-java7/lucene/build/grouping/lucene-grouping-4.0-SNAPSHOT.jar:/usr/home/hudson/hudson-slave/workspace/Lucene-Solr-Tests-4.x-java7/lucene/build/queries/lucene-queries-4.0-SNAPSHOT.jar:/usr/home/hudson/hudson-slave/workspace/Lucene-Solr-Tests-4.x-java7/lucene/build/queryparser/lucene-queryparser-4.0-SNAPSHOT.jar:/usr/home/hudson/hudson-slave/workspace/Lucene-Solr-Tests-4.x-java7/solr/core/lib/commons-cli-1.2.jar:/usr/home/hudson/hudson-slave/workspace/Lucene-Solr-Tests-4.x-java7/solr/core/lib/commons-codec-1.7.jar:/usr/home/hudson/hudson-slave/workspace/Lucene-Solr-Tests-4.x-java7/solr/core/lib/commons-fileupload-1.2.1.jar:/usr/home/hudson/hudson-slave/workspace/Lucene-Solr-Tests-4.x-java7/solr/core/lib/commons-lang-2.6.jar:/usr/home/hudson/hudson-slave/workspace/Lucene-Solr-Tests-4.x-java7/solr/core/lib/easymock-2.2.jar:/usr/home/hudson/hudson-slave/workspace/Lucene-Solr-Tests-4.x-java7/solr/core/lib/guava-r05.jar:/usr/home/hudson/hudson-slave/workspace/Lucene-Solr-Tests-4.x-java7/solr/core/lib/javax.servlet-api-3.0.1.jar:/usr/home/hudson/hudson-slave/workspace/Lucene-Solr-Tests-4.x-java7/solr/core/lib/spatial4j-0.3.jar:/usr/home/hudson/hudson-slave/workspace/Lucene-Solr-Tests-4.x-java7/solr/solrj/lib/commons-io-2.1.jar:/usr/home/hudson/hudson-slave/workspace/Lucene-Solr-Tests-4.x-java7/solr/solrj/lib/httpclient-4.1.3.jar:/usr/home/hudson/hudson-slave/workspace/Lucene-Solr-Tests-4.x-java7/solr/solrj/lib/httpcore-4.1.4.jar:/usr/home/hudson/hudson-slave/workspace/Lucene-Solr-Tests-4.x-java7/solr/solrj/lib/httpmime-4.1.3.jar:/usr/home/hudson/hudson-slave/workspace/Lucene-Solr-Tests-4.x-java7/solr/solrj/lib/jcl-over-slf4j-1.6.4.jar:/usr/home/hudson/hudson-slave/workspace/Lucene-Solr-Tests-4.x-java7/solr/solrj/lib/log4j-over-slf4j-1.6.4.jar:/usr/home/hudson/hudson-slave/workspace/Lucene-Solr-Tests-4.x-java7/solr/solrj/lib/slf4j-api-1.6.4.jar:/usr/home/hudson/hudson-slave/workspace/Lucene-Solr-Tests-4.x-java7/solr/solrj/lib/slf4j-jdk14-1.6.4.jar:/usr/home/hudson/hudson-slave/workspace/Lucene-Solr-Tests-4.x-java7/solr/solrj/lib/wstx-asl-3.2.7.jar:/usr/home/hudson/hudson-slave/workspace/Lucene-Solr-Tests-4.x-java7/solr/solrj/lib/zookeeper-3.3.6.jar:/usr/home/hudson/hudson-slave/workspace/Lucene-Solr-Tests-4.x-java7/solr/example/lib/jetty-continuation-8.1.2.v20120308.jar:/usr/home/hudson/hudson-slave/workspace/Lucene-Solr-Tests-4.x-java7/solr/example/lib/jetty-deploy-8.1.2.v20120308.jar:/usr/home/hudson/hudson-slave/workspace/Lucene-Solr-Tests-4.x-java7/solr/example/lib/jetty-http-8.1.2.v20120308.jar:/usr/home/hudson/hudson-slave/workspace/Lucene-Solr-Tests-4.x-java7/solr/example/lib/jetty-io-8.1.2.v20120308.jar:/usr/home/hudson/hudson-slave/workspace/Lucene-Solr-Tests-4.x-java7/solr/example/lib/jetty-jmx-8.1.2.v20120308.jar:/usr/home/hudson/hudson-slave/workspace/Lucene-Solr-Tests-4.x-java7/solr/example/lib/jetty-security-8.1.2.v20120308.jar:/usr/home/hudson/hudson-slave/workspace/Lucene-Solr-Tests-4.x-java7/solr/example/lib/jetty-server-8.1.2.v20120308.jar:/usr/home/hudson/hudson-slave/workspace/Lucene-Solr-Tests-4.x-java7/solr/example/lib/jetty-servlet-8.1.2.v20120308.jar:/usr/home/hudson/hudson-slave/workspace/Lucene-Solr-Tests-4.x-java7/solr/example/lib/jetty-util-8.1.2.v20120308.jar:/usr/home/hudson/hudson-slave/workspace/Lucene-Solr-Tests-4.x-java7/solr/example/lib/jetty-webapp-8.1.2.v20120308.jar:/usr/home/hudson/hudson-slave/workspace/Lucene-Solr-Tests-4.x-java7/solr/example/lib/jetty-xml-8.1.2.v20120308.jar:/usr/home/hudson/hudson-slave/workspace/Lucene-Solr-Tests-4.x-java7/solr/example/lib/servlet-api-3.0.jar:/usr/home/hudson/hudson-slave/workspace/Lucene-Solr-Tests-4.x-java7/solr/example/example-DIH/solr/db/lib/hsqldb-1.8.0.10.jar:/usr/home/hudson/hudson-slave/workspace/Lucene-Solr-Tests-4.x-java7/lucene/build/core/classes/java:/usr/home/hudson/hudson-slave/workspace/Lucene-Solr-Tests-4.x-java7/lucene/test-framework/lib/junit-4.10.jar:/usr/home/hudson/hudson-slave/workspace/Lucene-Solr-Tests-4.x-java7/lucene/test-framework/lib/randomizedtesting-runner-2.0.0.jar:/home/hudson/hudson-slave/tools/Ant/ant-1.8.2/lib/ant-launcher.jar:/home/hudson/.ant/lib/ivy-2.2.0.jar:/home/hudson/hudson-slave/tools/Ant/ant-1.8.2/lib/ant-apache-regexp.jar:/home/hudson/hudson-slave/tools/Ant/ant-1.8.2/lib/ant-junit.jar:/home/hudson/hudson-slave/tools/Ant/ant-1.8.2/lib/ant-apache-bsf.jar:/home/hudson/hudson-slave/tools/Ant/ant-1.8.2/lib/ant-commons-net.jar:/home/hudson/hudson-slave/tools/Ant/ant-1.8.2/lib/ant-antlr.jar:/home/hudson/hudson-slave/tools/Ant/ant-1.8.2/lib/ant-apache-log4j.jar:/home/hudson/hudson-slave/tools/Ant/ant-1.8.2/lib/ant-commons-logging.jar:/home/hudson/hudson-slave/tools/Ant/ant-1.8.2/lib/ant-apache-xalan2.jar:/home/hudson/hudson-slave/tools/Ant/ant-1.8.2/lib/ant-apache-oro.jar:/home/hudson/hudson-slave/tools/Ant/ant-1.8.2/lib/ant-junit4.jar:/home/hudson/hudson-slave/tools/Ant/ant-1.8.2/lib/ant-netrexx.jar:/home/hudson/hudson-slave/tools/Ant/ant-1.8.2/lib/ant-swing.jar:/home/hudson/hudson-slave/tools/Ant/ant-1.8.2/lib/ant-javamail.jar:/home/hudson/hudson-slave/tools/Ant/ant-1.8.2/lib/ant-jsch.jar:/home/hudson/hudson-slave/tools/Ant/ant-1.8.2/lib/ant-jmf.jar:/home/hudson/hudson-slave/tools/Ant/ant-1.8.2/lib/ant.jar:/home/hudson/hudson-slave/tools/Ant/ant-1.8.2/lib/ant-apache-bcel.jar:/home/hudson/hudson-slave/tools/Ant/ant-1.8.2/lib/ant-jai.jar:/home/hudson/hudson-slave/tools/Ant/ant-1.8.2/lib/ant-testutil.jar:/home/hudson/hudson-slave/tools/Ant/ant-1.8.2/lib/ant-apache-resolver.jar:/home/hudson/hudson-slave/tools/Ant/ant-1.8.2/lib/ant-jdepend.jar:/usr/local/openjdk7/lib/tools.jar:/home/hudson/.ivy2/cache/com.carrotsearch.randomizedtesting/junit4-ant/jars/junit4-ant-2.0.0.jar
[junit4:junit4]   2> 420 T14 oaz.Environment.logEnv Client environment:java.library.path=/usr/local/openjdk7/jre/lib/amd64/server:/usr/local/openjdk7/jre/lib/amd64:/usr/local/openjdk7/jre/../lib/amd64:/usr/local/openjdk6/jre/lib/amd64/server:/usr/local/openjdk6/jre/lib/amd64:/usr/local/openjdk6/jre/../lib/amd64:/usr/java/packages/lib/amd64:/lib:/usr/lib:/usr/local/lib
[junit4:junit4]   2> 420 T14 oaz.Environment.logEnv Client environment:java.io.tmpdir=.
[junit4:junit4]   2> 421 T14 oaz.Environment.logEnv Client environment:java.compiler=<NA>
[junit4:junit4]   2> 421 T14 oaz.Environment.logEnv Client environment:os.name=FreeBSD
[junit4:junit4]   2> 422 T14 oaz.Environment.logEnv Client environment:os.arch=amd64
[junit4:junit4]   2> 422 T14 oaz.Environment.logEnv Client environment:os.version=9.0-RELEASE
[junit4:junit4]   2> 423 T14 oaz.Environment.logEnv Client environment:user.name=hudson
[junit4:junit4]   2> 423 T14 oaz.Environment.logEnv Client environment:user.home=/home/hudson
[junit4:junit4]   2> 424 T14 oaz.Environment.logEnv Client environment:user.dir=/usr/home/hudson/hudson-slave/workspace/Lucene-Solr-Tests-4.x-java7/solr/build/solr-core/test/J1
[junit4:junit4]   2> 429 T14 oaz.ZooKeeper.<init> Initiating client connection, connectString=127.0.0.1:10849 sessionTimeout=10000 watcher=org.apache.solr.common.cloud.ConnectionManager@26f57041
[junit4:junit4]   2> 490 T20 oaz.ClientCnxn$SendThread.startConnect Opening socket connection to server /127.0.0.1:10849
[junit4:junit4]   2> 490 T14 oascc.ConnectionManager.waitForConnected Waiting for client to connect to ZooKeeper
[junit4:junit4]   2> 494 T20 oaz.ClientCnxn$SendThread.primeConnection Socket connection established to localhost/127.0.0.1:10849, initiating session
[junit4:junit4]   2> 495 T16 oazs.NIOServerCnxn$Factory.run Accepted socket connection from /140.211.11.196:51014
[junit4:junit4]   2> 514 T16 oazs.NIOServerCnxn.readConnectRequest Client attempting to establish new session at /140.211.11.196:51014
[junit4:junit4]   2> 528 T18 oazsp.FileTxnLog.append Creating new log file: log.1
[junit4:junit4]   2> 561 T18 oazs.NIOServerCnxn.finishSessionInit Established session 0x139d8295c820000 with negotiated timeout 10000 for client /140.211.11.196:51014
[junit4:junit4]   2> 561 T20 oaz.ClientCnxn$SendThread.readConnectResult Session establishment complete on server localhost/127.0.0.1:10849, sessionid = 0x139d8295c820000, negotiated timeout = 10000
[junit4:junit4]   2> 567 T21 oascc.ConnectionManager.process Watcher org.apache.solr.common.cloud.ConnectionManager@26f57041 name:ZooKeeperConnection Watcher:127.0.0.1:10849 got event WatchedEvent state:SyncConnected type:None path:null path:null type:None
[junit4:junit4]   2> 568 T14 oascc.ConnectionManager.waitForConnected Client is connected to ZooKeeper
[junit4:junit4]   2> 572 T14 oascc.SolrZkClient.makePath makePath: /solr
[junit4:junit4]   2> 629 T19 oazs.PrepRequestProcessor.pRequest Processed session termination for sessionid: 0x139d8295c820000
[junit4:junit4]   2> 631 T21 oaz.ClientCnxn$EventThread.run EventThread shut down
[junit4:junit4]   2> 631 T14 oaz.ZooKeeper.close Session: 0x139d8295c820000 closed
[junit4:junit4]   2> 632 T16 oazs.NIOServerCnxn.closeSock Closed socket connection for client /140.211.11.196:51014 which had sessionid 0x139d8295c820000
[junit4:junit4]   2> 632 T14 oaz.ZooKeeper.<init> Initiating client connection, connectString=127.0.0.1:10849/solr sessionTimeout=10000 watcher=org.apache.solr.common.cloud.ConnectionManager@6246d41e
[junit4:junit4]   2> 633 T22 oaz.ClientCnxn$SendThread.startConnect Opening socket connection to server /127.0.0.1:10849
[junit4:junit4]   2> 633 T14 oascc.ConnectionManager.waitForConnected Waiting for client to connect to ZooKeeper
[junit4:junit4]   2> 634 T22 oaz.ClientCnxn$SendThread.primeConnection Socket connection established to localhost/127.0.0.1:10849, initiating session
[junit4:junit4]   2> 635 T16 oazs.NIOServerCnxn$Factory.run Accepted socket connection from /140.211.11.196:59707
[junit4:junit4]   2> 636 T16 oazs.NIOServerCnxn.readConnectRequest Client attempting to establish new session at /140.211.11.196:59707
[junit4:junit4]   2> 637 T18 oazs.NIOServerCnxn.finishSessionInit Established session 0x139d8295c820001 with negotiated timeout 10000 for client /140.211.11.196:59707
[junit4:junit4]   2> 638 T22 oaz.ClientCnxn$SendThread.readConnectResult Session establishment complete on server localhost/127.0.0.1:10849, sessionid = 0x139d8295c820001, negotiated timeout = 10000
[junit4:junit4]   2> 638 T23 oascc.ConnectionManager.process Watcher org.apache.solr.common.cloud.ConnectionManager@6246d41e name:ZooKeeperConnection Watcher:127.0.0.1:10849/solr got event WatchedEvent state:SyncConnected type:None path:null path:null type:None
[junit4:junit4]   2> 639 T14 oascc.ConnectionManager.waitForConnected Client is connected to ZooKeeper
[junit4:junit4]   2> 657 T14 oascc.SolrZkClient.makePath makePath: /collections/collection1
[junit4:junit4]   2> 663 T14 oascc.SolrZkClient.makePath makePath: /collections/collection1/shards
[junit4:junit4]   2> 672 T14 oascc.SolrZkClient.makePath makePath: /collections/control_collection
[junit4:junit4]   2> 675 T14 oascc.SolrZkClient.makePath makePath: /collections/control_collection/shards
[junit4:junit4]   2> 679 T14 oasc.AbstractZkTestCase.putConfig put /usr/home/hudson/hudson-slave/workspace/Lucene-Solr-Tests-4.x-java7/solr/build/solr-core/test-files/solr/collection1/conf/solrconfig.xml to /configs/conf1/solrconfig.xml
[junit4:junit4]   2> 702 T14 oascc.SolrZkClient.makePath makePath: /configs/conf1/solrconfig.xml
[junit4:junit4]   2> 716 T14 oasc.AbstractZkTestCase.putConfig put /usr/home/hudson/hudson-slave/workspace/Lucene-Solr-Tests-4.x-java7/solr/build/solr-core/test-files/solr/collection1/conf/schema.xml to /configs/conf1/schema.xml
[junit4:junit4]   2> 718 T14 oascc.SolrZkClient.makePath makePath: /configs/conf1/schema.xml
[junit4:junit4]   2> 823 T14 oasc.AbstractZkTestCase.putConfig put /usr/home/hudson/hudson-slave/workspace/Lucene-Solr-Tests-4.x-java7/solr/build/solr-core/test-files/solr/collection1/conf/solrconfig.xml to /configs/conf1/solrconfig.xml
[junit4:junit4]   2> 824 T14 oascc.SolrZkClient.makePath makePath: /configs/conf1/solrconfig.xml
[junit4:junit4]   2> 837 T14 oasc.AbstractZkTestCase.putConfig put /usr/home/hudson/hudson-slave/workspace/Lucene-Solr-Tests-4.x-java7/solr/build/solr-core/test-files/solr/collection1/conf/stopwords.txt to /configs/conf1/stopwords.txt
[junit4:junit4]   2> 837 T14 oascc.SolrZkClient.makePath makePath: /configs/conf1/stopwords.txt
[junit4:junit4]   2> 842 T14 oasc.AbstractZkTestCase.putConfig put /usr/home/hudson/hudson-slave/workspace/Lucene-Solr-Tests-4.x-java7/solr/build/solr-core/test-files/solr/collection1/conf/protwords.txt to /configs/conf1/protwords.txt
[junit4:junit4]   2> 843 T14 oascc.SolrZkClient.makePath makePath: /configs/conf1/protwords.txt
[junit4:junit4]   2> 847 T14 oasc.AbstractZkTestCase.putConfig put /usr/home/hudson/hudson-slave/workspace/Lucene-Solr-Tests-4.x-java7/solr/build/solr-core/test-files/solr/collection1/conf/currency.xml to /configs/conf1/currency.xml
[junit4:junit4]   2> 849 T14 oascc.SolrZkClient.makePath makePath: /configs/conf1/currency.xml
[junit4:junit4]   2> 853 T14 oasc.AbstractZkTestCase.putConfig put /usr/home/hudson/hudson-slave/workspace/Lucene-Solr-Tests-4.x-java7/solr/build/solr-core/test-files/solr/collection1/conf/open-exchange-rates.json to /configs/conf1/open-exchange-rates.json
[junit4:junit4]   2> 854 T14 oascc.SolrZkClient.makePath makePath: /configs/conf1/open-exchange-rates.json
[junit4:junit4]   2> 859 T14 oasc.AbstractZkTestCase.putConfig put /usr/home/hudson/hudson-slave/workspace/Lucene-Solr-Tests-4.x-java7/solr/build/solr-core/test-files/solr/collection1/conf/mapping-ISOLatin1Accent.txt to /configs/conf1/mapping-ISOLatin1Accent.txt
[junit4:junit4]   2> 861 T14 oascc.SolrZkClient.makePath makePath: /configs/conf1/mapping-ISOLatin1Accent.txt
[junit4:junit4]   2> 865 T14 oasc.AbstractZkTestCase.putConfig put /usr/home/hudson/hudson-slave/workspace/Lucene-Solr-Tests-4.x-java7/solr/build/solr-core/test-files/solr/collection1/conf/old_synonyms.txt to /configs/conf1/old_synonyms.txt
[junit4:junit4]   2> 866 T14 oascc.SolrZkClient.makePath makePath: /configs/conf1/old_synonyms.txt
[junit4:junit4]   2> 870 T14 oasc.AbstractZkTestCase.putConfig put /usr/home/hudson/hudson-slave/workspace/Lucene-Solr-Tests-4.x-java7/solr/build/solr-core/test-files/solr/collection1/conf/synonyms.txt to /configs/conf1/synonyms.txt
[junit4:junit4]   2> 871 T14 oascc.SolrZkClient.makePath makePath: /configs/conf1/synonyms.txt
[junit4:junit4]   2> 875 T19 oazs.PrepRequestProcessor.pRequest Processed session termination for sessionid: 0x139d8295c820001
[junit4:junit4]   2> 877 T23 oaz.ClientCnxn$EventThread.run EventThread shut down
[junit4:junit4]   2> 877 T16 oazs.NIOServerCnxn.closeSock Closed socket connection for client /140.211.11.196:59707 which had sessionid 0x139d8295c820001
[junit4:junit4]   2> 876 T14 oaz.ZooKeeper.close Session: 0x139d8295c820001 closed
[junit4:junit4]   2> 1328 T14 oejs.Server.doStart jetty-8.1.2.v20120308
[junit4:junit4]   2> 1604 T14 oejs.AbstractConnector.doStart Started SocketConnector@0.0.0.0:17764
[junit4:junit4]   2> 1680 T14 oasc.SolrResourceLoader.locateSolrHome JNDI not configured for solr (NoInitialContextEx)
[junit4:junit4]   2> 1681 T14 oasc.SolrResourceLoader.locateSolrHome using system property solr.solr.home: /usr/home/hudson/hudson-slave/workspace/Lucene-Solr-Tests-4.x-java7/solr/build/solr-core/test-files/solr
[junit4:junit4]   2> 1682 T14 oasc.SolrResourceLoader.<init> new SolrResourceLoader for deduced Solr Home: '/usr/home/hudson/hudson-slave/workspace/Lucene-Solr-Tests-4.x-java7/solr/build/solr-core/test-files/solr/'
[junit4:junit4]   2> 1764 T14 oass.SolrDispatchFilter.init SolrDispatchFilter.init()
[junit4:junit4]   2> 1765 T14 oasc.SolrResourceLoader.locateSolrHome JNDI not configured for solr (NoInitialContextEx)
[junit4:junit4]   2> 1765 T14 oasc.SolrResourceLoader.locateSolrHome using system property solr.solr.home: /usr/home/hudson/hudson-slave/workspace/Lucene-Solr-Tests-4.x-java7/solr/build/solr-core/test-files/solr
[junit4:junit4]   2> 1766 T14 oasc.CoreContainer$Initializer.initialize looking for solr.xml: /usr/home/hudson/hudson-slave/workspace/Lucene-Solr-Tests-4.x-java7/solr/build/solr-core/test-files/solr/solr.xml
[junit4:junit4]   2> 1766 T14 oasc.CoreContainer.<init> New CoreContainer 1592659210
[junit4:junit4]   2> 1767 T14 oasc.CoreContainer.load Loading CoreContainer using Solr Home: '/usr/home/hudson/hudson-slave/workspace/Lucene-Solr-Tests-4.x-java7/solr/build/solr-core/test-files/solr/'
[junit4:junit4]   2> 1768 T14 oasc.SolrResourceLoader.<init> new SolrResourceLoader for directory: '/usr/home/hudson/hudson-slave/workspace/Lucene-Solr-Tests-4.x-java7/solr/build/solr-core/test-files/solr/'
[junit4:junit4]   2> 1811 T14 oasc.CoreContainer.load Registering Log Listener
[junit4:junit4]   2> 1830 T14 oasc.CoreContainer.initZooKeeper Zookeeper client=127.0.0.1:10849/solr
[junit4:junit4]   2> 1870 T14 oaz.ZooKeeper.<init> Initiating client connection, connectString=127.0.0.1:10849/solr sessionTimeout=5000 watcher=org.apache.solr.common.cloud.ConnectionManager@39ed8be3
[junit4:junit4]   2> 1872 T34 oaz.ClientCnxn$SendThread.startConnect Opening socket connection to server /127.0.0.1:10849
[junit4:junit4]   2> 1872 T14 oascc.ConnectionManager.waitForConnected Waiting for client to connect to ZooKeeper
[junit4:junit4]   2> 1874 T34 oaz.ClientCnxn$SendThread.primeConnection Socket connection established to localhost/127.0.0.1:10849, initiating session
[junit4:junit4]   2> 1874 T16 oazs.NIOServerCnxn$Factory.run Accepted socket connection from /140.211.11.196:37059
[junit4:junit4]   2> 1875 T16 oazs.NIOServerCnxn.readConnectRequest Client attempting to establish new session at /140.211.11.196:37059
[junit4:junit4]   2> 1878 T18 oazs.NIOServerCnxn.finishSessionInit Established session 0x139d8295c820002 with negotiated timeout 5000 for client /140.211.11.196:37059
[junit4:junit4]   2> 1878 T34 oaz.ClientCnxn$SendThread.readConnectResult Session establishment complete on server localhost/127.0.0.1:10849, sessionid = 0x139d8295c820002, negotiated timeout = 5000
[junit4:junit4]   2> 1878 T35 oascc.ConnectionManager.process Watcher org.apache.solr.common.cloud.ConnectionManager@39ed8be3 name:ZooKeeperConnection Watcher:127.0.0.1:10849/solr got event WatchedEvent state:SyncConnected type:None path:null path:null type:None
[junit4:junit4]   2> 1879 T14 oascc.ConnectionManager.waitForConnected Client is connected to ZooKeeper
[junit4:junit4]   2> 1897 T19 oazs.PrepRequestProcessor.pRequest Got user-level KeeperException when processing sessionid:0x139d8295c820002 type:create cxid:0x2 zxid:0xfffffffffffffffe txntype:unknown reqpath:n/a Error Path:/solr/overseer Error:KeeperErrorCode = NodeExists for /solr/overseer
[junit4:junit4]   2> 1908 T14 oascc.SolrZkClient.makePath makePath: /live_nodes
[junit4:junit4]   2> 1911 T14 oasc.ZkController.createEphemeralLiveNode Register node as live in ZooKeeper:/live_nodes/127.0.0.1:17764_solr
[junit4:junit4]   2> 1918 T19 oazs.PrepRequestProcessor.pRequest Got user-level KeeperException when processing sessionid:0x139d8295c820002 type:delete cxid:0x7 zxid:0xfffffffffffffffe txntype:unknown reqpath:n/a Error Path:/solr/live_nodes/127.0.0.1:17764_solr Error:KeeperErrorCode = NoNode for /solr/live_nodes/127.0.0.1:17764_solr
[junit4:junit4]   2> 1919 T14 oascc.SolrZkClient.makePath makePath: /live_nodes/127.0.0.1:17764_solr
[junit4:junit4]   2> 1934 T14 oashc.HttpShardHandlerFactory.getParameter Setting socketTimeout to: 0
[junit4:junit4]   2> 1935 T14 oashc.HttpShardHandlerFactory.getParameter Setting urlScheme to: http://
[junit4:junit4]   2> 1936 T14 oashc.HttpShardHandlerFactory.getParameter Setting connTimeout to: 0
[junit4:junit4]   2> 1936 T14 oashc.HttpShardHandlerFactory.getParameter Setting maxConnectionsPerHost to: 20
[junit4:junit4]   2> 1937 T14 oashc.HttpShardHandlerFactory.getParameter Setting corePoolSize to: 0
[junit4:junit4]   2> 1937 T14 oashc.HttpShardHandlerFactory.getParameter Setting maximumPoolSize to: 2147483647
[junit4:junit4]   2> 1938 T14 oashc.HttpShardHandlerFactory.getParameter Setting maxThreadIdleTime to: 5
[junit4:junit4]   2> 1938 T14 oashc.HttpShardHandlerFactory.getParameter Setting sizeOfQueue to: -1
[junit4:junit4]   2> 1939 T14 oashc.HttpShardHandlerFactory.getParameter Setting fairnessPolicy to: false
[junit4:junit4]   2> 1986 T14 oascsi.HttpClientUtil.createClient Creating new http client, config:maxConnectionsPerHost=20&maxConnections=10000&socketTimeout=0&connTimeout=0&retry=false
[junit4:junit4]   2> 2689 T14 oascc.SolrZkClient.makePath makePath: /overseer_elect/election
[junit4:junit4]   2> 2759 T19 oazs.PrepRequestProcessor.pRequest Got user-level KeeperException when processing sessionid:0x139d8295c820002 type:delete cxid:0x15 zxid:0xfffffffffffffffe txntype:unknown reqpath:n/a Error Path:/solr/overseer_elect/leader Error:KeeperErrorCode = NoNode for /solr/overseer_elect/leader
[junit4:junit4]   2> 2761 T14 oascc.SolrZkClient.makePath makePath: /overseer_elect/leader
[junit4:junit4]   2> 2766 T14 oasc.Overseer.start Overseer (id=88339339867717634-127.0.0.1:17764_solr-n_0000000000) starting
[junit4:junit4]   2> 2767 T19 oazs.PrepRequestProcessor.pRequest Got user-level KeeperException when processing sessionid:0x139d8295c820002 type:create cxid:0x1a zxid:0xfffffffffffffffe txntype:unknown reqpath:n/a Error Path:/solr/overseer Error:KeeperErrorCode = NodeExists for /solr/overseer
[junit4:junit4]   2> 2778 T19 oazs.PrepRequestProcessor.pRequest Got user-level KeeperException when processing sessionid:0x139d8295c820002 type:create cxid:0x1b zxid:0xfffffffffffffffe txntype:unknown reqpath:n/a Error Path:/solr/overseer Error:KeeperErrorCode = NodeExists for /solr/overseer
[junit4:junit4]   2> 2781 T19 oazs.PrepRequestProcessor.pRequest Got user-level KeeperException when processing sessionid:0x139d8295c820002 type:create cxid:0x1c zxid:0xfffffffffffffffe txntype:unknown reqpath:n/a Error Path:/solr/overseer Error:KeeperErrorCode = NodeExists for /solr/overseer
[junit4:junit4]   2> 2786 T19 oazs.PrepRequestProcessor.pRequest Got user-level KeeperException when processing sessionid:0x139d8295c820002 type:create cxid:0x1d zxid:0xfffffffffffffffe txntype:unknown reqpath:n/a Error Path:/solr/overseer Error:KeeperErrorCode = NodeExists for /solr/overseer
[junit4:junit4]   2> 2788 T37 oasc.OverseerCollectionProcessor.run Process current queue of collection creations
[junit4:junit4]   2> 2789 T14 oascc.SolrZkClient.makePath makePath: /clusterstate.json
[junit4:junit4]   2> 2797 T14 oascc.ZkStateReader.createClusterStateWatchersAndUpdate Updating cluster state from ZooKeeper... 
[junit4:junit4]   2> 2817 T36 oasc.Overseer$ClusterStateUpdater.run Starting to work on the main queue
[junit4:junit4]   2> 2862 T14 oasc.CoreContainer.create Creating SolrCore 'collection1' using instanceDir: /usr/home/hudson/hudson-slave/workspace/Lucene-Solr-Tests-4.x-java7/solr/build/solr-core/test-files/solr/collection1
[junit4:junit4]   2> 2863 T14 oasc.ZkController.createCollectionZkNode Check for collection zkNode:control_collection
[junit4:junit4]   2> 2864 T14 oasc.ZkController.createCollectionZkNode Collection zkNode exists
[junit4:junit4]   2> 2865 T14 oasc.ZkController.readConfigName Load collection config from:/collections/control_collection
[junit4:junit4]   2> 2868 T14 oasc.SolrResourceLoader.<init> new SolrResourceLoader for directory: '/usr/home/hudson/hudson-slave/workspace/Lucene-Solr-Tests-4.x-java7/solr/build/solr-core/test-files/solr/collection1/'
[junit4:junit4]   2> 2870 T14 oasc.SolrResourceLoader.replaceClassLoader Adding 'file:/usr/home/hudson/hudson-slave/workspace/Lucene-Solr-Tests-4.x-java7/solr/build/solr-core/test-files/solr/collection1/lib/README' to classloader
[junit4:junit4]   2> 2872 T14 oasc.SolrResourceLoader.replaceClassLoader Adding 'file:/usr/home/hudson/hudson-slave/workspace/Lucene-Solr-Tests-4.x-java7/solr/build/solr-core/test-files/solr/collection1/lib/classes/' to classloader
[junit4:junit4]   2> 3071 T14 oasc.SolrConfig.<init> Using Lucene MatchVersion: LUCENE_40
[junit4:junit4]   2> 3233 T14 oasc.SolrConfig.<init> Loaded SolrConfig: solrconfig.xml
[junit4:junit4]   2> 3321 T14 oass.IndexSchema.readSchema Reading Solr Schema
[junit4:junit4]   2> 3375 T14 oass.IndexSchema.readSchema Schema name=test
[junit4:junit4]   2> 4043 T14 oass.OpenExchangeRatesOrgProvider.init Initialized with rates=open-exchange-rates.json, refreshInterval=1440.
[junit4:junit4]   2> 4059 T14 oass.IndexSchema.readSchema default search field in schema is text
[junit4:junit4]   2> 4063 T14 oass.IndexSchema.readSchema unique key field: id
[junit4:junit4]   2> 4093 T14 oass.FileExchangeRateProvider.reload Reloading exchange rates from file currency.xml
[junit4:junit4]   2> 4100 T14 oass.FileExchangeRateProvider.reload Reloading exchange rates from file currency.xml
[junit4:junit4]   2> 4106 T14 oass.OpenExchangeRatesOrgProvider.reload Reloading exchange rates from open-exchange-rates.json
[junit4:junit4]   2> 4110 T14 oass.OpenExchangeRatesOrgProvider.reload Reloading exchange rates from open-exchange-rates.json
[junit4:junit4]   2> 4114 T14 oasc.SolrCore.<init> [collection1] Opening new SolrCore at /usr/home/hudson/hudson-slave/workspace/Lucene-Solr-Tests-4.x-java7/solr/build/solr-core/test-files/solr/collection1/, dataDir=./org.apache.solr.cloud.SyncSliceTest-1347951352588/control/data/
[junit4:junit4]   2> 4126 T14 oasc.JmxMonitoredMap.<init> JMX monitoring is enabled. Adding Solr mbeans to JMX Server: com.sun.jmx.mbeanserver.JmxMBeanServer@1706f7ec
[junit4:junit4]   2> 4175 T14 oasc.SolrCore.getNewIndexDir WARNING New index directory detected: old=null new=./org.apache.solr.cloud.SyncSliceTest-1347951352588/control/data/index/
[junit4:junit4]   2> 4177 T14 oasc.SolrCore.initIndex WARNING [collection1] Solr index directory './org.apache.solr.cloud.SyncSliceTest-1347951352588/control/data/index' doesn't exist. Creating new index...
[junit4:junit4]   2> 4233 T14 oasc.CachingDirectoryFactory.get return new directory for /usr/home/hudson/hudson-slave/workspace/Lucene-Solr-Tests-4.x-java7/solr/build/solr-core/test/J1/./org.apache.solr.cloud.SyncSliceTest-1347951352588/control/data/index forceNew:false
[junit4:junit4]   2> 4255 T14 oasc.SolrDeletionPolicy.onCommit SolrDeletionPolicy.onCommit: commits:num=1
[junit4:junit4]   2> 		commit{dir=/usr/home/hudson/hudson-slave/workspace/Lucene-Solr-Tests-4.x-java7/solr/build/solr-core/test/J1/org.apache.solr.cloud.SyncSliceTest-1347951352588/control/data/index,segFN=segments_1,generation=1,filenames=[segments_1]
[junit4:junit4]   2> 4256 T14 oasc.SolrDeletionPolicy.updateCommits newest commit = 1
[junit4:junit4]   2> 4311 T14 oasc.SolrCore.initWriters created xml: solr.XMLResponseWriter
[junit4:junit4]   2> 4528 T14 oasup.UpdateRequestProcessorChain.init inserting DistributedUpdateProcessorFactory into updateRequestProcessorChain "dedupe"
[junit4:junit4]   2> 4529 T14 oasup.UpdateRequestProcessorChain.init inserting DistributedUpdateProcessorFactory into updateRequestProcessorChain "dedupe-allfields"
[junit4:junit4]   2> 4529 T14 oasup.UpdateRequestProcessorChain.init inserting DistributedUpdateProcessorFactory into updateRequestProcessorChain "stored_sig"
[junit4:junit4]   2> 4539 T14 oasup.UpdateRequestProcessorChain.init inserting DistributedUpdateProcessorFactory into updateRequestProcessorChain "uniq-fields"
[junit4:junit4]   2> 4672 T14 oasup.UpdateRequestProcessorChain.init inserting DistributedUpdateProcessorFactory into updateRequestProcessorChain "distrib-dup-test-chain-implicit"
[junit4:junit4]   2> 4673 T14 oasc.RequestHandlers.initHandlersFromConfig adding lazy requestHandler: solr.ReplicationHandler
[junit4:junit4]   2> 4679 T14 oasc.RequestHandlers.initHandlersFromConfig created /replication: solr.ReplicationHandler
[junit4:junit4]   2> 4712 T14 oasc.RequestHandlers.initHandlersFromConfig created standard: solr.StandardRequestHandler
[junit4:junit4]   2> 4737 T14 oasc.RequestHandlers.initHandlersFromConfig created /get: solr.RealTimeGetHandler
[junit4:junit4]   2> 4814 T14 oasc.RequestHandlers.initHandlersFromConfig created dismax: solr.SearchHandler
[junit4:junit4]   2> 4816 T14 oasc.RequestHandlers.initHandlersFromConfig created mock: org.apache.solr.core.MockQuerySenderListenerReqHandler
[junit4:junit4]   2> 4820 T14 oasc.RequestHandlers.initHandlersFromConfig created /admin/: org.apache.solr.handler.admin.AdminHandlers
[junit4:junit4]   2> 4822 T14 oasc.RequestHandlers.initHandlersFromConfig created defaults: solr.StandardRequestHandler
[junit4:junit4]   2> 4822 T14 oasc.RequestHandlers.initHandlersFromConfig adding lazy requestHandler: solr.StandardRequestHandler
[junit4:junit4]   2> 4823 T14 oasc.RequestHandlers.initHandlersFromConfig created lazy: solr.StandardRequestHandler
[junit4:junit4]   2> 4841 T14 oasc.RequestHandlers.initHandlersFromConfig created /update: solr.UpdateRequestHandler
[junit4:junit4]   2> 4842 T14 oasc.RequestHandlers.initHandlersFromConfig created /terms: org.apache.solr.handler.component.SearchHandler
[junit4:junit4]   2> 4843 T14 oasc.RequestHandlers.initHandlersFromConfig created spellCheckCompRH: org.apache.solr.handler.component.SearchHandler
[junit4:junit4]   2> 4844 T14 oasc.RequestHandlers.initHandlersFromConfig created spellCheckCompRH_Direct: org.apache.solr.handler.component.SearchHandler
[junit4:junit4]   2> 4846 T14 oasc.RequestHandlers.initHandlersFromConfig created spellCheckWithWordbreak: org.apache.solr.handler.component.SearchHandler
[junit4:junit4]   2> 4847 T14 oasc.RequestHandlers.initHandlersFromConfig created spellCheckWithWordbreak_Direct: org.apache.solr.handler.component.SearchHandler
[junit4:junit4]   2> 4848 T14 oasc.RequestHandlers.initHandlersFromConfig created spellCheckCompRH1: org.apache.solr.handler.component.SearchHandler
[junit4:junit4]   2> 4849 T14 oasc.RequestHandlers.initHandlersFromConfig created tvrh: org.apache.solr.handler.component.SearchHandler
[junit4:junit4]   2> 4880 T14 oasc.RequestHandlers.initHandlersFromConfig created /mlt: solr.MoreLikeThisHandler
[junit4:junit4]   2> 4918 T14 oasc.RequestHandlers.initHandlersFromConfig created /debug/dump: solr.DumpRequestHandler
[junit4:junit4]   2> 4926 T14 oashl.XMLLoader.init xsltCacheLifetimeSeconds=60
[junit4:junit4]   2> 4934 T14 oasc.SolrCore.initDeprecatedSupport WARNING solrconfig.xml uses deprecated <admin/gettableFiles>, Please update your config to use the ShowFileRequestHandler.
[junit4:junit4]   2> 4946 T14 oasc.SolrCore.initDeprecatedSupport WARNING adding ShowFileRequestHandler with hidden files: [SCHEMA.XML, OLD_SYNONYMS.TXT, STOPWORDS.TXT, PROTWORDS.TXT, OPEN-EXCHANGE-RATES.JSON, SYNONYMS.TXT, CURRENCY.XML, MAPPING-ISOLATIN1ACCENT.TXT]
[junit4:junit4]   2> 4954 T14 oass.SolrIndexSearcher.<init> Opening Searcher@559d4cdb main
[junit4:junit4]   2> 5017 T14 oasu.CommitTracker.<init> Hard AutoCommit: disabled
[junit4:junit4]   2> 5018 T14 oasu.CommitTracker.<init> Soft AutoCommit: disabled
[junit4:junit4]   2> 5021 T14 oashc.SpellCheckComponent.inform Initializing spell checkers
[junit4:junit4]   2> 5216 T14 oass.DirectSolrSpellChecker.init init: {name=direct,classname=DirectSolrSpellChecker,field=lowerfilt,minQueryLength=3}
[junit4:junit4]   2> 5558 T19 oazs.PrepRequestProcessor.pRequest Got user-level KeeperException when processing sessionid:0x139d8295c820002 type:create cxid:0x5f zxid:0xfffffffffffffffe txntype:unknown reqpath:n/a Error Path:/solr/overseer/queue Error:KeeperErrorCode = NoNode for /solr/overseer/queue
[junit4:junit4]   2> 5563 T38 oasc.SolrCore.registerSearcher [collection1] Registered new searcher Searcher@559d4cdb main{StandardDirectoryReader(segments_1:1)}
[junit4:junit4]   2> 5572 T14 oasc.CoreContainer.register registering core: collection1
[junit4:junit4]   2> 5572 T14 oasc.ZkController.register Register shard - core:collection1 address:http://127.0.0.1:17764/solr shardId:control_shard
[junit4:junit4]   2> 5594 T14 oascsi.HttpClientUtil.createClient Creating new http client, config:maxConnections=10000&maxConnectionsPerHost=20&connTimeout=30000&socketTimeout=30000&retry=false
[junit4:junit4]   2> 5612 T14 oascc.SolrZkClient.makePath makePath: /collections/control_collection/leader_elect/control_shard/election
[junit4:junit4]   2> 5630 T19 oazs.PrepRequestProcessor.pRequest Got user-level KeeperException when processing sessionid:0x139d8295c820002 type:delete cxid:0x6e zxid:0xfffffffffffffffe txntype:unknown reqpath:n/a Error Path:/solr/collections/control_collection/leaders Error:KeeperErrorCode = NoNode for /solr/collections/control_collection/leaders
[junit4:junit4]   2> 5632 T14 oasc.ShardLeaderElectionContext.runLeaderProcess Running the leader process.
[junit4:junit4]   2> 5633 T19 oazs.PrepRequestProcessor.pRequest Got user-level KeeperException when processing sessionid:0x139d8295c820002 type:create cxid:0x6f zxid:0xfffffffffffffffe txntype:unknown reqpath:n/a Error Path:/solr/overseer Error:KeeperErrorCode = NodeExists for /solr/overseer
[junit4:junit4]   2> 5837 T36 oascc.ZkStateReader.updateClusterState Updating cloud state from ZooKeeper... 
[junit4:junit4]   2> 5855 T19 oazs.PrepRequestProcessor.pRequest Got user-level KeeperException when processing sessionid:0x139d8295c820002 type:create cxid:0x76 zxid:0xfffffffffffffffe txntype:unknown reqpath:n/a Error Path:/solr/overseer/queue-work Error:KeeperErrorCode = NoNode for /solr/overseer/queue-work
[junit4:junit4]   2> 5892 T35 oascc.ZkStateReader$2.process A cluster state change has occurred - updating...
[junit4:junit4]   2> 6143 T14 oasc.ShardLeaderElectionContext.waitForReplicasToComeUp Enough replicas found to continue.
[junit4:junit4]   2> 6143 T14 oasc.ShardLeaderElectionContext.runLeaderProcess I may be the new leader - try and sync
[junit4:junit4]   2> 6144 T14 oasc.SyncStrategy.sync Sync replicas to http://127.0.0.1:17764/solr/collection1/
[junit4:junit4]   2> 6145 T14 oasc.SyncStrategy.syncReplicas Sync Success - now sync replicas to me
[junit4:junit4]   2> 6145 T14 oasc.SyncStrategy.syncToMe http://127.0.0.1:17764/solr/collection1/ has no replicas
[junit4:junit4]   2> 6146 T14 oasc.ShardLeaderElectionContext.runLeaderProcess I am the new leader: http://127.0.0.1:17764/solr/collection1/
[junit4:junit4]   2> 6146 T14 oascc.SolrZkClient.makePath makePath: /collections/control_collection/leaders/control_shard
[junit4:junit4]   2> 6153 T19 oazs.PrepRequestProcessor.pRequest Got user-level KeeperException when processing sessionid:0x139d8295c820002 type:create cxid:0x94 zxid:0xfffffffffffffffe txntype:unknown reqpath:n/a Error Path:/solr/overseer Error:KeeperErrorCode = NodeExists for /solr/overseer
[junit4:junit4]   2> 6400 T36 oascc.ZkStateReader.updateClusterState Updating cloud state from ZooKeeper... 
[junit4:junit4]   2> 6415 T35 oascc.ZkStateReader$2.process A cluster state change has occurred - updating...
[junit4:junit4]   2> 6470 T14 oasc.ZkController.register We are http://127.0.0.1:17764/solr/collection1/ and leader is http://127.0.0.1:17764/solr/collection1/
[junit4:junit4]   2> 6475 T14 oasc.ZkController.register No LogReplay needed for core=collection1 baseURL=http://127.0.0.1:17764/solr
[junit4:junit4]   2> 6475 T14 oasc.ZkController.checkRecovery I am the leader, no recovery necessary
[junit4:junit4]   2> 6478 T14 oascc.ZkStateReader.updateClusterState Updating cloud state from ZooKeeper... 
[junit4:junit4]   2> 6480 T14 oass.SolrDispatchFilter.init user.dir=/usr/home/hudson/hudson-slave/workspace/Lucene-Solr-Tests-4.x-java7/solr/build/solr-core/test/J1
[junit4:junit4]   2> 6480 T14 oass.SolrDispatchFilter.init SolrDispatchFilter.init() done
[junit4:junit4]   2> 6561 T14 oascsi.HttpClientUtil.createClient Creating new http client, config:maxConnections=128&maxConnectionsPerHost=32&followRedirects=false
[junit4:junit4]   2> 6703 T14 oejs.Server.doStart jetty-8.1.2.v20120308
[junit4:junit4]   2> 6706 T14 oejs.AbstractConnector.doStart Started SocketConnector@0.0.0.0:33309
[junit4:junit4]   2> 6707 T14 oasc.SolrResourceLoader.locateSolrHome JNDI not configured for solr (NoInitialContextEx)
[junit4:junit4]   2> 6708 T14 oasc.SolrResourceLoader.locateSolrHome using system property solr.solr.home: /usr/home/hudson/hudson-slave/workspace/Lucene-Solr-Tests-4.x-java7/solr/build/solr-core/test/J1/./solrtest-jetty1-1347951359158
[junit4:junit4]   2> 6708 T14 oasc.SolrResourceLoader.<init> new SolrResourceLoader for deduced Solr Home: '/usr/home/hudson/hudson-slave/workspace/Lucene-Solr-Tests-4.x-java7/solr/build/solr-core/test/J1/./solrtest-jetty1-1347951359158/'
[junit4:junit4]   2> 6745 T14 oass.SolrDispatchFilter.init SolrDispatchFilter.init()
[junit4:junit4]   2> 6746 T14 oasc.SolrResourceLoader.locateSolrHome JNDI not configured for solr (NoInitialContextEx)
[junit4:junit4]   2> 6746 T14 oasc.SolrResourceLoader.locateSolrHome using system property solr.solr.home: /usr/home/hudson/hudson-slave/workspace/Lucene-Solr-Tests-4.x-java7/solr/build/solr-core/test/J1/./solrtest-jetty1-1347951359158
[junit4:junit4]   2> 6747 T14 oasc.CoreContainer$Initializer.initialize looking for solr.xml: /usr/home/hudson/hudson-slave/workspace/Lucene-Solr-Tests-4.x-java7/solr/build/solr-core/test/J1/./solrtest-jetty1-1347951359158/solr.xml
[junit4:junit4]   2> 6747 T14 oasc.CoreContainer.<init> New CoreContainer 1826146590
[junit4:junit4]   2> 6748 T14 oasc.CoreContainer.load Loading CoreContainer using Solr Home: '/usr/home/hudson/hudson-slave/workspace/Lucene-Solr-Tests-4.x-java7/solr/build/solr-core/test/J1/./solrtest-jetty1-1347951359158/'
[junit4:junit4]   2> 6749 T14 oasc.SolrResourceLoader.<init> new SolrResourceLoader for directory: '/usr/home/hudson/hudson-slave/workspace/Lucene-Solr-Tests-4.x-java7/solr/build/solr-core/test/J1/./solrtest-jetty1-1347951359158/'
[junit4:junit4]   2> 6783 T14 oasc.CoreContainer.load Registering Log Listener
[junit4:junit4]   2> 6799 T14 oasc.CoreContainer.initZooKeeper Zookeeper client=127.0.0.1:10849/solr
[junit4:junit4]   2> 6800 T14 oaz.ZooKeeper.<init> Initiating client connection, connectString=127.0.0.1:10849/solr sessionTimeout=5000 watcher=org.apache.solr.common.cloud.ConnectionManager@640334cb
[junit4:junit4]   2> 6801 T48 oaz.ClientCnxn$SendThread.startConnect Opening socket connection to server /127.0.0.1:10849
[junit4:junit4]   2> 6801 T14 oascc.ConnectionManager.waitForConnected Waiting for client to connect to ZooKeeper
[junit4:junit4]   2> 6803 T48 oaz.ClientCnxn$SendThread.primeConnection Socket connection established to localhost/127.0.0.1:10849, initiating session
[junit4:junit4]   2> 6803 T16 oazs.NIOServerCnxn$Factory.run Accepted socket connection from /140.211.11.196:45112
[junit4:junit4]   2> 6804 T16 oazs.NIOServerCnxn.readConnectRequest Client attempting to establish new session at /140.211.11.196:45112
[junit4:junit4]   2> 6806 T18 oazs.NIOServerCnxn.finishSessionInit Established session 0x139d8295c820003 with negotiated timeout 5000 for client /140.211.11.196:45112
[junit4:junit4]   2> 6806 T48 oaz.ClientCnxn$SendThread.readConnectResult Session establishment complete on server localhost/127.0.0.1:10849, sessionid = 0x139d8295c820003, negotiated timeout = 5000
[junit4:junit4]   2> 6807 T49 oascc.ConnectionManager.process Watcher org.apache.solr.common.cloud.ConnectionManager@640334cb name:ZooKeeperConnection Watcher:127.0.0.1:10849/solr got event WatchedEvent state:SyncConnected type:None path:null path:null type:None
[junit4:junit4]   2> 6807 T14 oascc.ConnectionManager.waitForConnected Client is connected to ZooKeeper
[junit4:junit4]   2> 6809 T19 oazs.PrepRequestProcessor.pRequest Got user-level KeeperException when processing sessionid:0x139d8295c820003 type:create cxid:0x1 zxid:0xfffffffffffffffe txntype:unknown reqpath:n/a Error Path:/solr/overseer Error:KeeperErrorCode = NodeExists for /solr/overseer
[junit4:junit4]   2> 6820 T19 oazs.PrepRequestProcessor.pRequest Got user-level KeeperException when processing sessionid:0x139d8295c820003 type:create cxid:0x2 zxid:0xfffffffffffffffe txntype:unknown reqpath:n/a Error Path:/solr/overseer Error:KeeperErrorCode = NodeExists for /solr/overseer
[junit4:junit4]   2> 6822 T14 oasc.ZkController.createEphemeralLiveNode Register node as live in ZooKeeper:/live_nodes/127.0.0.1:33309_solr
[junit4:junit4]   2> 6823 T19 oazs.PrepRequestProcessor.pRequest Got user-level KeeperException when processing sessionid:0x139d8295c820003 type:delete cxid:0x4 zxid:0xfffffffffffffffe txntype:unknown reqpath:n/a Error Path:/solr/live_nodes/127.0.0.1:33309_solr Error:KeeperErrorCode = NoNode for /solr/live_nodes/127.0.0.1:33309_solr
[junit4:junit4]   2> 6825 T14 oascc.SolrZkClient.makePath makePath: /live_nodes/127.0.0.1:33309_solr
[junit4:junit4]   2> 6833 T35 oascc.ZkStateReader$3.process Updating live nodes
[junit4:junit4]   2> 6835 T14 oashc.HttpShardHandlerFactory.getParameter Setting socketTimeout to: 0
[junit4:junit4]   2> 6835 T14 oashc.HttpShardHandlerFactory.getParameter Setting urlScheme to: http://
[junit4:junit4]   2> 6836 T14 oashc.HttpShardHandlerFactory.getParameter Setting connTimeout to: 0
[junit4:junit4]   2> 6836 T14 oashc.HttpShardHandlerFactory.getParameter Setting maxConnectionsPerHost to: 20
[junit4:junit4]   2> 6837 T14 oashc.HttpShardHandlerFactory.getParameter Setting corePoolSize to: 0
[junit4:junit4]   2> 6837 T14 oashc.HttpShardHandlerFactory.getParameter Setting maximumPoolSize to: 2147483647
[junit4:junit4]   2> 6838 T14 oashc.HttpShardHandlerFactory.getParameter Setting maxThreadIdleTime to: 5
[junit4:junit4]   2> 6838 T14 oashc.HttpShardHandlerFactory.getParameter Setting sizeOfQueue to: -1
[junit4:junit4]   2> 6839 T14 oashc.HttpShardHandlerFactory.getParameter Setting fairnessPolicy to: false
[junit4:junit4]   2> 6839 T14 oascsi.HttpClientUtil.createClient Creating new http client, config:maxConnectionsPerHost=20&maxConnections=10000&socketTimeout=0&connTimeout=0&retry=false
[junit4:junit4]   2> 6865 T14 oascc.ZkStateReader.createClusterStateWatchersAndUpdate Updating cluster state from ZooKeeper... 
[junit4:junit4]   2> 6873 T14 oasc.CoreContainer.create Creating SolrCore 'collection1' using instanceDir: /usr/home/hudson/hudson-slave/workspace/Lucene-Solr-Tests-4.x-java7/solr/build/solr-core/test/J1/./solrtest-jetty1-1347951359158/collection1
[junit4:junit4]   2> 6874 T14 oasc.ZkController.createCollectionZkNode Check for collection zkNode:collection1
[junit4:junit4]   2> 6875 T14 oasc.ZkController.createCollectionZkNode Collection zkNode exists
[junit4:junit4]   2> 6876 T14 oasc.ZkController.readConfigName Load collection config from:/collections/collection1
[junit4:junit4]   2> 6878 T14 oasc.SolrResourceLoader.<init> new SolrResourceLoader for directory: '/usr/home/hudson/hudson-slave/workspace/Lucene-Solr-Tests-4.x-java7/solr/build/solr-core/test/J1/./solrtest-jetty1-1347951359158/collection1/'
[junit4:junit4]   2> 6881 T14 oasc.SolrResourceLoader.replaceClassLoader Adding 'file:/usr/home/hudson/hudson-slave/workspace/Lucene-Solr-Tests-4.x-java7/solr/build/solr-core/test/J1/solrtest-jetty1-1347951359158/collection1/lib/README' to classloader
[junit4:junit4]   2> 6882 T14 oasc.SolrResourceLoader.replaceClassLoader Adding 'file:/usr/home/hudson/hudson-slave/workspace/Lucene-Solr-Tests-4.x-java7/solr/build/solr-core/test/J1/solrtest-jetty1-1347951359158/collection1/lib/classes/' to classloader
[junit4:junit4]   2> 6921 T36 oascc.ZkStateReader.updateClusterState Updating cloud state from ZooKeeper... 
[junit4:junit4]   2> 6928 T35 oascc.ZkStateReader$2.process A cluster state change has occurred - updating...
[junit4:junit4]   2> 6928 T49 oascc.ZkStateReader$2.process A cluster state change has occurred - updating...
[junit4:junit4]   2> 6975 T14 oasc.SolrConfig.<init> Using Lucene MatchVersion: LUCENE_40
[junit4:junit4]   2> 7057 T14 oasc.SolrConfig.<init> Loaded SolrConfig: solrconfig.xml
[junit4:junit4]   2> 7159 T14 oass.IndexSchema.readSchema Reading Solr Schema
[junit4:junit4]   2> 7211 T14 oass.IndexSchema.readSchema Schema name=test
[junit4:junit4]   2> 7808 T14 oass.OpenExchangeRatesOrgProvider.init Initialized with rates=open-exchange-rates.json, refreshInterval=1440.
[junit4:junit4]   2> 7822 T14 oass.IndexSchema.readSchema default search field in schema is text
[junit4:junit4]   2> 7825 T14 oass.IndexSchema.readSchema unique key field: id
[junit4:junit4]   2> 7863 T14 oass.FileExchangeRateProvider.reload Reloading exchange rates from file currency.xml
[junit4:junit4]   2> 7869 T14 oass.FileExchangeRateProvider.reload Reloading exchange rates from file currency.xml
[junit4:junit4]   2> 7875 T14 oass.OpenExchangeRatesOrgProvider.reload Reloading exchange rates from open-exchange-rates.json
[junit4:junit4]   2> 7880 T14 oass.OpenExchangeRatesOrgProvider.reload Reloading exchange rates from open-exchange-rates.json
[junit4:junit4]   2> 7883 T14 oasc.SolrCore.<init> [collection1] Opening new SolrCore at /usr/home/hudson/hudson-slave/workspace/Lucene-Solr-Tests-4.x-java7/solr/build/solr-core/test/J1/./solrtest-jetty1-1347951359158/collection1/, dataDir=./org.apache.solr.cloud.SyncSliceTest-1347951352588/jetty1/
[junit4:junit4]   2> 7884 T14 oasc.JmxMonitoredMap.<init> JMX monitoring is enabled. Adding Solr mbeans to JMX Server: com.sun.jmx.mbeanserver.JmxMBeanServer@1706f7ec
[junit4:junit4]   2> 7885 T14 oasc.SolrCore.getNewIndexDir WARNING New index directory detected: old=null new=./org.apache.solr.cloud.SyncSliceTest-1347951352588/jetty1/index/
[junit4:junit4]   2> 7886 T14 oasc.SolrCore.initIndex WARNING [collection1] Solr index directory './org.apache.solr.cloud.SyncSliceTest-1347951352588/jetty1/index' doesn't exist. Creating new index...
[junit4:junit4]   2> 7887 T14 oasc.CachingDirectoryFactory.get return new directory for /usr/home/hudson/hudson-slave/workspace/Lucene-Solr-Tests-4.x-java7/solr/build/solr-core/test/J1/./org.apache.solr.cloud.SyncSliceTest-1347951352588/jetty1/index forceNew:false
[junit4:junit4]   2> 7895 T14 oasc.SolrDeletionPolicy.onCommit SolrDeletionPolicy.onCommit: commits:num=1
[junit4:junit4]   2> 		commit{dir=/usr/home/hudson/hudson-slave/workspace/Lucene-Solr-Tests-4.x-java7/solr/build/solr-core/test/J1/org.apache.solr.cloud.SyncSliceTest-1347951352588/jetty1/index,segFN=segments_1,generation=1,filenames=[segments_1]
[junit4:junit4]   2> 7896 T14 oasc.SolrDeletionPolicy.updateCommits newest commit = 1
[junit4:junit4]   2> 7897 T14 oasc.SolrCore.initWriters created xml: solr.XMLResponseWriter
[junit4:junit4]   2> 7900 T14 oasup.UpdateRequestProcessorChain.init inserting DistributedUpdateProcessorFactory into updateRequestProcessorChain "dedupe"
[junit4:junit4]   2> 7901 T14 oasup.UpdateRequestProcessorChain.init inserting DistributedUpdateProcessorFactory into updateRequestProcessorChain "dedupe-allfields"
[junit4:junit4]   2> 7902 T14 oasup.UpdateRequestProcessorChain.init inserting DistributedUpdateProcessorFactory into updateRequestProcessorChain "stored_sig"
[junit4:junit4]   2> 7902 T14 oasup.UpdateRequestProcessorChain.init inserting DistributedUpdateProcessorFactory into updateRequestProcessorChain "uniq-fields"
[junit4:junit4]   2> 7903 T14 oasup.UpdateRequestProcessorChain.init inserting DistributedUpdateProcessorFactory into updateRequestProcessorChain "distrib-dup-test-chain-implicit"
[junit4:junit4]   2> 7904 T14 oasc.RequestHandlers.initHandlersFromConfig adding lazy requestHandler: solr.ReplicationHandler
[junit4:junit4]   2> 7905 T14 oasc.RequestHandlers.initHandlersFromConfig created /replication: solr.ReplicationHandler
[junit4:junit4]   2> 7907 T14 oasc.RequestHandlers.initHandlersFromConfig created standard: solr.StandardRequestHandler
[junit4:junit4]   2> 7908 T14 oasc.RequestHandlers.initHandlersFromConfig created /get: solr.RealTimeGetHandler
[junit4:junit4]   2> 7910 T14 oasc.RequestHandlers.initHandlersFromConfig created dismax: solr.SearchHandler
[junit4:junit4]   2> 7911 T14 oasc.RequestHandlers.initHandlersFromConfig created mock: org.apache.solr.core.MockQuerySenderListenerReqHandler
[junit4:junit4]   2> 7912 T14 oasc.RequestHandlers.initHandlersFromConfig created /admin/: org.apache.solr.handler.admin.AdminHandlers
[junit4:junit4]   2> 7913 T14 oasc.RequestHandlers.initHandlersFromConfig created defaults: solr.StandardRequestHandler
[junit4:junit4]   2> 7914 T14 oasc.RequestHandlers.initHandlersFromConfig adding lazy requestHandler: solr.StandardRequestHandler
[junit4:junit4]   2> 7914 T14 oasc.RequestHandlers.initHandlersFromConfig created lazy: solr.StandardRequestHandler
[junit4:junit4]   2> 7916 T14 oasc.RequestHandlers.initHandlersFromConfig created /update: solr.UpdateRequestHandler
[junit4:junit4]   2> 7917 T14 oasc.RequestHandlers.initHandlersFromConfig created /terms: org.apache.solr.handler.component.SearchHandler
[junit4:junit4]   2> 7918 T14 oasc.RequestHandlers.initHandlersFromConfig created spellCheckCompRH: org.apache.solr.handler.component.SearchHandler
[junit4:junit4]   2> 7919 T14 oasc.RequestHandlers.initHandlersFromConfig created spellCheckCompRH_Direct: org.apache.solr.handler.component.SearchHandler
[junit4:junit4]   2> 7921 T14 oasc.RequestHandlers.initHandlersFromConfig created spellCheckWithWordbreak: org.apache.solr.handler.component.SearchHandler
[junit4:junit4]   2> 7922 T14 oasc.RequestHandlers.initHandlersFromConfig created spellCheckWithWordbreak_Direct: org.apache.solr.handler.component.SearchHandler
[junit4:junit4]   2> 7923 T14 oasc.RequestHandlers.initHandlersFromConfig created spellCheckCompRH1: org.apache.solr.handler.component.SearchHandler
[junit4:junit4]   2> 7925 T14 oasc.RequestHandlers.initHandlersFromConfig created tvrh: org.apache.solr.handler.component.SearchHandler
[junit4:junit4]   2> 7927 T14 oasc.RequestHandlers.initHandlersFromConfig created /mlt: solr.MoreLikeThisHandler
[junit4:junit4]   2> 7928 T14 oasc.RequestHandlers.initHandlersFromConfig created /debug/dump: solr.DumpRequestHandler
[junit4:junit4]   2> 7931 T14 oashl.XMLLoader.init xsltCacheLifetimeSeconds=60
[junit4:junit4]   2> 7936 T14 oasc.SolrCore.initDeprecatedSupport WARNING solrconfig.xml uses deprecated <admin/gettableFiles>, Please update your config to use the ShowFileRequestHandler.
[junit4:junit4]   2> 7938 T14 oasc.SolrCore.initDeprecatedSupport WARNING adding ShowFileRequestHandler with hidden files: [SCHEMA.XML, OLD_SYNONYMS.TXT, STOPWORDS.TXT, PROTWORDS.TXT, OPEN-EXCHANGE-RATES.JSON, SYNONYMS.TXT, CURRENCY.XML, MAPPING-ISOLATIN1ACCENT.TXT]
[junit4:junit4]   2> 7975 T14 oass.SolrIndexSearcher.<init> Opening Searcher@4773ccf2 main
[junit4:junit4]   2> 7977 T14 oasu.CommitTracker.<init> Hard AutoCommit: disabled
[junit4:junit4]   2> 7978 T14 oasu.CommitTracker.<init> Soft AutoCommit: disabled
[junit4:junit4]   2> 7979 T14 oashc.SpellCheckComponent.inform Initializing spell checkers
[junit4:junit4]   2> 7988 T14 oass.DirectSolrSpellChecker.init init: {name=direct,classname=DirectSolrSpellChecker,field=lowerfilt,minQueryLength=3}
[junit4:junit4]   2> 8057 T50 oasc.SolrCore.registerSearcher [collection1] Registered new searcher Searcher@4773ccf2 main{StandardDirectoryReader(segments_1:1)}
[junit4:junit4]   2> 8440 T36 oascc.ZkStateReader.updateClusterState Updating cloud state from ZooKeeper... 
[junit4:junit4]   2> 8461 T35 oascc.ZkStateReader$2.process A cluster state change has occurred - updating...
[junit4:junit4]   2> 8461 T49 oascc.ZkStateReader$2.process A cluster state change has occurred - updating...
[junit4:junit4]   2> 8572 T14 oasc.CoreContainer.register registering core: collection1
[junit4:junit4]   2> 8573 T14 oasc.ZkController.register Register shard - core:collection1 address:http://127.0.0.1:33309/solr shardId:shard1
[junit4:junit4]   2> 8574 T14 oascc.SolrZkClient.makePath makePath: /collections/collection1/leader_elect/shard1/election
[junit4:junit4]   2> 8596 T19 oazs.PrepRequestProcessor.pRequest Got user-level KeeperException when processing sessionid:0x139d8295c820003 type:delete cxid:0x43 zxid:0xfffffffffffffffe txntype:unknown reqpath:n/a Error Path:/solr/collections/collection1/leaders Error:KeeperErrorCode = NoNode for /solr/collections/collection1/leaders
[junit4:junit4]   2> 8602 T14 oasc.ShardLeaderElectionContext.runLeaderProcess Running the leader process.
[junit4:junit4]   2> 8604 T19 oazs.PrepRequestProcessor.pRequest Got user-level KeeperException when processing sessionid:0x139d8295c820003 type:create cxid:0x44 zxid:0xfffffffffffffffe txntype:unknown reqpath:n/a Error Path:/solr/overseer Error:KeeperErrorCode = NodeExists for /solr/overseer
[junit4:junit4]   2> 8608 T14 oasc.ShardLeaderElectionContext.waitForReplicasToComeUp Enough replicas found to continue.
[junit4:junit4]   2> 8609 T14 oasc.ShardLeaderElectionContext.runLeaderProcess I may be the new leader - try and sync
[junit4:junit4]   2> 8609 T14 oasc.SyncStrategy.sync Sync replicas to http://127.0.0.1:33309/solr/collection1/
[junit4:junit4]   2> 8610 T14 oasc.SyncStrategy.syncReplicas Sync Success - now sync replicas to me
[junit4:junit4]   2> 8611 T14 oasc.SyncStrategy.syncToMe http://127.0.0.1:33309/solr/collection1/ has no replicas
[junit4:junit4]   2> 8612 T14 oasc.ShardLeaderElectionContext.runLeaderProcess I am the new leader: http://127.0.0.1:33309/solr/collection1/
[junit4:junit4]   2> 8612 T14 oascc.SolrZkClient.makePath makePath: /collections/collection1/leaders/shard1
[junit4:junit4]   2> 8620 T19 oazs.PrepRequestProcessor.pRequest Got user-level KeeperException when processing sessionid:0x139d8295c820003 type:create cxid:0x4e zxid:0xfffffffffffffffe txntype:unknown reqpath:n/a Error Path:/solr/overseer Error:KeeperErrorCode = NodeExists for /solr/overseer
[junit4:junit4]   2> 8968 T36 oascc.ZkStateReader.updateClusterState Updating cloud state from ZooKeeper... 
[junit4:junit4]   2> 8990 T35 oascc.ZkStateReader$2.process A cluster state change has occurred - updating...
[junit4:junit4]   2> 8990 T49 oascc.ZkStateReader$2.process A cluster state change has occurred - updating...
[junit4:junit4]   2> 8996 T14 oasc.ZkController.register We are http://127.0.0.1:33309/solr/collection1/ and leader is http://127.0.0.1:33309/solr/collection1/
[junit4:junit4]   2> 8996 T14 oasc.ZkController.register No LogReplay needed for core=collection1 baseURL=http://127.0.0.1:33309/solr
[junit4:junit4]   2> 8997 T14 oasc.ZkController.checkRecovery I am the leader, no recovery necessary
[junit4:junit4]   2> 9000 T14 oascc.ZkStateReader.updateClusterState Updating cloud state from ZooKeeper... 
[junit4:junit4]   2> 9002 T14 oass.SolrDispatchFilter.init user.dir=/usr/home/hudson/hudson-slave/workspace/Lucene-Solr-Tests-4.x-java7/solr/build/solr-core/test/J1
[junit4:junit4]   2> 9002 T14 oass.SolrDispatchFilter.init SolrDispatchFilter.init() done
[junit4:junit4]   2> 9003 T14 oascsi.HttpClientUtil.createClient Creating new http client, config:maxConnections=128&maxConnectionsPerHost=32&followRedirects=false
[junit4:junit4]   2> 9158 T14 oejs.Server.doStart jetty-8.1.2.v20120308
[junit4:junit4]   2> 9160 T14 oejs.AbstractConnector.doStart Started SocketConnector@0.0.0.0:58754
[junit4:junit4]   2> 9161 T14 oasc.SolrResourceLoader.locateSolrHome JNDI not configured for solr (NoInitialContextEx)
[junit4:junit4]   2> 9162 T14 oasc.SolrResourceLoader.locateSolrHome using system property solr.solr.home: /usr/home/hudson/hudson-slave/workspace/Lucene-Solr-Tests-4.x-java7/solr/build/solr-core/test/J1/./solrtest-jetty2-1347951361614
[junit4:junit4]   2> 9162 T14 oasc.SolrResourceLoader.<init> new SolrResourceLoader for deduced Solr Home: '/usr/home/hudson/hudson-slave/workspace/Lucene-Solr-Tests-4.x-java7/solr/build/solr-core/test/J1/./solrtest-jetty2-1347951361614/'
[junit4:junit4]   2> 9194 T14 oass.SolrDispatchFilter.init SolrDispatchFilter.init()
[junit4:junit4]   2> 9195 T14 oasc.SolrResourceLoader.locateSolrHome JNDI not configured for solr (NoInitialContextEx)
[junit4:junit4]   2> 9195 T14 oasc.SolrResourceLoader.locateSolrHome using system property solr.solr.home: /usr/home/hudson/hudson-slave/workspace/Lucene-Solr-Tests-4.x-java7/solr/build/solr-core/test/J1/./solrtest-jetty2-1347951361614
[junit4:junit4]   2> 9196 T14 oasc.CoreContainer$Initializer.initialize looking for solr.xml: /usr/home/hudson/hudson-slave/workspace/Lucene-Solr-Tests-4.x-java7/solr/build/solr-core/test/J1/./solrtest-jetty2-1347951361614/solr.xml
[junit4:junit4]   2> 9196 T14 oasc.CoreContainer.<init> New CoreContainer 387159005
[junit4:junit4]   2> 9197 T14 oasc.CoreContainer.load Loading CoreContainer using Solr Home: '/usr/home/hudson/hudson-slave/workspace/Lucene-Solr-Tests-4.x-java7/solr/build/solr-core/test/J1/./solrtest-jetty2-1347951361614/'
[junit4:junit4]   2> 9197 T14 oasc.SolrResourceLoader.<init> new SolrResourceLoader for directory: '/usr/home/hudson/hudson-slave/workspace/Lucene-Solr-Tests-4.x-java7/solr/build/solr-core/test/J1/./solrtest-jetty2-1347951361614/'
[junit4:junit4]   2> 9291 T14 oasc.CoreContainer.load Registering Log Listener
[junit4:junit4]   2> 9307 T14 oasc.CoreContainer.initZooKeeper Zookeeper client=127.0.0.1:10849/solr
[junit4:junit4]   2> 9308 T14 oaz.ZooKeeper.<init> Initiating client connection, connectString=127.0.0.1:10849/solr sessionTimeout=5000 watcher=org.apache.solr.common.cloud.ConnectionManager@1628f867
[junit4:junit4]   2> 9309 T60 oaz.ClientCnxn$SendThread.startConnect Opening socket connection to server /127.0.0.1:10849
[junit4:junit4]   2> 9309 T14 oascc.ConnectionManager.waitForConnected Waiting for client to connect to ZooKeeper
[junit4:junit4]   2> 9310 T60 oaz.ClientCnxn$SendThread.primeConnection Socket connection established to localhost/127.0.0.1:10849, initiating session
[junit4:junit4]   2> 9311 T16 oazs.NIOServerCnxn$Factory.run Accepted socket connection from /140.211.11.196:21852
[junit4:junit4]   2> 9312 T16 oazs.NIOServerCnxn.readConnectRequest Client attempting to establish new session at /140.211.11.196:21852
[junit4:junit4]   2> 9315 T18 oazs.NIOServerCnxn.finishSessionInit Established session 0x139d8295c820004 with negotiated timeout 5000 for client /140.211.11.196:21852
[junit4:junit4]   2> 9315 T60 oaz.ClientCnxn$SendThread.readConnectResult Session establishment complete on server localhost/127.0.0.1:10849, sessionid = 0x139d8295c820004, negotiated timeout = 5000
[junit4:junit4]   2> 9315 T61 oascc.ConnectionManager.process Watcher org.apache.solr.common.cloud.ConnectionManager@1628f867 name:ZooKeeperConnection Watcher:127.0.0.1:10849/solr got event WatchedEvent state:SyncConnected type:None path:null path:null type:None
[junit4:junit4]   2> 9316 T14 oascc.ConnectionManager.waitForConnected Client is connected to ZooKeeper
[junit4:junit4]   2> 9317 T19 oazs.PrepRequestProcessor.pRequest Got user-level KeeperException when processing sessionid:0x139d8295c820004 type:create cxid:0x1 zxid:0xfffffffffffffffe txntype:unknown reqpath:n/a Error Path:/solr/overseer Error:KeeperErrorCode = NodeExists for /solr/overseer
[junit4:junit4]   2> 9326 T19 oazs.PrepRequestProcessor.pRequest Got user-level KeeperException when processing sessionid:0x139d8295c820004 type:create cxid:0x2 zxid:0xfffffffffffffffe txntype:unknown reqpath:n/a Error Path:/solr/overseer Error:KeeperErrorCode = NodeExists for /solr/overseer
[junit4:junit4]   2> 9329 T14 oasc.ZkController.createEphemeralLiveNode Register node as live in ZooKeeper:/live_nodes/127.0.0.1:58754_solr
[junit4:junit4]   2> 9330 T19 oazs.PrepRequestProcessor.pRequest Got user-level KeeperException when processing sessionid:0x139d8295c820004 type:delete cxid:0x4 zxid:0xfffffffffffffffe txntype:unknown reqpath:n/a Error Path:/solr/live_nodes/127.0.0.1:58754_solr Error:KeeperErrorCode = NoNode for /solr/live_nodes/127.0.0.1:58754_solr
[junit4:junit4]   2> 9331 T14 oascc.SolrZkClient.makePath makePath: /live_nodes/127.0.0.1:58754_solr
[junit4:junit4]   2> 9339 T49 oascc.ZkStateReader$3.process Updating live nodes
[junit4:junit4]   2> 9339 T35 oascc.ZkStateReader$3.process Updating live nodes
[junit4:junit4]   2> 9341 T14 oashc.HttpShardHandlerFactory.getParameter Setting socketTimeout to: 0
[junit4:junit4]   2> 9342 T14 oashc.HttpShardHandlerFactory.getParameter Setting urlScheme to: http://
[junit4:junit4]   2> 9342 T14 oashc.HttpShardHandlerFactory.getParameter Setting connTimeout to: 0
[junit4:junit4]   2> 9343 T14 oashc.HttpShardHandlerFactory.getParameter Setting maxConnectionsPerHost to: 20
[junit4:junit4]   2> 9343 T14 oashc.HttpShardHandlerFactory.getParameter Setting corePoolSize to: 0
[junit4:junit4]   2> 9344 T14 oashc.HttpShardHandlerFactory.getParameter Setting maximumPoolSize to: 2147483647
[junit4:junit4]   2> 9344 T14 oashc.HttpShardHandlerFactory.getParameter Setting maxThreadIdleTime to: 5
[junit4:junit4]   2> 9345 T14 oashc.HttpShardHandlerFactory.getParameter Setting sizeOfQueue to: -1
[junit4:junit4]   2> 9345 T14 oashc.HttpShardHandlerFactory.getParameter Setting fairnessPolicy to: false
[junit4:junit4]   2> 9346 T14 oascsi.HttpClientUtil.createClient Creating new http client, config:maxConnectionsPerHost=20&maxConnections=10000&socketTimeout=0&connTimeout=0&retry=false
[junit4:junit4]   2> 9364 T14 oascc.ZkStateReader.createClusterStateWatchersAndUpdate Updating cluster state from ZooKeeper... 
[junit4:junit4]   2> 9372 T14 oasc.CoreContainer.create Creating SolrCore 'collection1' using instanceDir: /usr/home/hudson/hudson-slave/workspace/Lucene-Solr-Tests-4.x-java7/solr/build/solr-core/test/J1/./solrtest-jetty2-1347951361614/collection1
[junit4:junit4]   2> 9373 T14 oasc.ZkController.createCollectionZkNode Check for collection zkNode:collection1
[junit4:junit4]   2> 9374 T14 oasc.ZkController.createCollectionZkNode Collection zkNode exists
[junit4:junit4]   2> 9375 T14 oasc.ZkController.readConfigName Load collection config from:/collections/collection1
[junit4:junit4]   2> 9377 T14 oasc.SolrResourceLoader.<init> new SolrResourceLoader for directory: '/usr/home/hudson/hudson-slave/workspace/Lucene-Solr-Tests-4.x-java7/solr/build/solr-core/test/J1/./solrtest-jetty2-1347951361614/collection1/'
[junit4:junit4]   2> 9378 T14 oasc.SolrResourceLoader.replaceClassLoader Adding 'file:/usr/home/hudson/hudson-slave/workspace/Lucene-Solr-Tests-4.x-java7/solr/build/solr-core/test/J1/solrtest-jetty2-1347951361614/collection1/lib/README' to classloader
[junit4:junit4]   2> 9379 T14 oasc.SolrResourceLoader.replaceClassLoader Adding 'file:/usr/home/hudson/hudson-slave/workspace/Lucene-Solr-Tests-4.x-java7/solr/build/solr-core/test/J1/solrtest-jetty2-1347951361614/collection1/lib/classes/' to classloader
[junit4:junit4]   2> 9441 T14 oasc.SolrConfig.<init> Using Lucene MatchVersion: LUCENE_40
[junit4:junit4]   2> 9506 T36 oascc.ZkStateReader.updateClusterState Updating cloud state from ZooKeeper... 
[junit4:junit4]   2> 9513 T14 oasc.SolrConfig.<init> Loaded SolrConfig: solrconfig.xml
[junit4:junit4]   2> 9520 T35 oascc.ZkStateReader$2.process A cluster state change has occurred - updating...
[junit4:junit4]   2> 9520 T49 oascc.ZkStateReader$2.process A cluster state change has occurred - updating...
[junit4:junit4]   2> 9520 T61 oascc.ZkStateReader$2.process A cluster state change has occurred - updating...
[junit4:junit4]   2> 9521 T14 oass.IndexSchema.readSchema Reading Solr Schema
[junit4:junit4]   2> 9565 T14 oass.IndexSchema.readSchema Schema name=test
[junit4:junit4]   2> 10143 T14 oass.OpenExchangeRatesOrgProvider.init Initialized with rates=open-exchange-rates.json, refreshInterval=1440.
[junit4:junit4]   2> 10157 T14 oass.IndexSchema.readSchema default search field in schema is text
[junit4:junit4]   2> 10161 T14 oass.IndexSchema.readSchema unique key field: id
[junit4:junit4]   2> 10188 T14 oass.FileExchangeRateProvider.reload Reloading exchange rates from file currency.xml
[junit4:junit4]   2> 10194 T14 oass.FileExchangeRateProvider.reload Reloading exchange rates from file currency.xml
[junit4:junit4]   2> 10199 T14 oass.OpenExchangeRatesOrgProvider.reload Reloading exchange rates from open-exchange-rates.json
[junit4:junit4]   2> 10202 T14 oass.OpenExchangeRatesOrgProvider.reload Reloading exchange rates from open-exchange-rates.json
[junit4:junit4]   2> 10205 T14 oasc.SolrCore.<init> [collection1] Opening new SolrCore at /usr/home/hudson/hudson-slave/workspace/Lucene-Solr-Tests-4.x-java7/solr/build/solr-core/test/J1/./solrtest-jetty2-1347951361614/collection1/, dataDir=./org.apache.solr.cloud.SyncSliceTest-1347951352588/jetty2/
[junit4:junit4]   2> 10205 T14 oasc.JmxMonitoredMap.<init> JMX monitoring is enabled. Adding Solr mbeans to JMX Server: com.sun.jmx.mbeanserver.JmxMBeanServer@1706f7ec
[junit4:junit4]   2> 10207 T14 oasc.SolrCore.getNewIndexDir WARNING New index directory detected: old=null new=./org.apache.solr.cloud.SyncSliceTest-1347951352588/jetty2/index/
[junit4:junit4]   2> 10208 T14 oasc.SolrCore.initIndex WARNING [collection1] Solr index directory './org.apache.solr.cloud.SyncSliceTest-1347951352588/jetty2/index' doesn't exist. Creating new index...
[junit4:junit4]   2> 10209 T14 oasc.CachingDirectoryFactory.get return new directory for /usr/home/hudson/hudson-slave/workspace/Lucene-Solr-Tests-4.x-java7/solr/build/solr-core/test/J1/./org.apache.solr.cloud.SyncSliceTest-1347951352588/jetty2/index forceNew:false
[junit4:junit4]   2> 10215 T14 oasc.SolrDeletionPolicy.onCommit SolrDeletionPolicy.onCommit: commits:num=1
[junit4:junit4]   2> 		commit{dir=/usr/home/hudson/hudson-slave/workspace/Lucene-Solr-Tests-4.x-java7/solr/build/solr-core/test/J1/org.apache.solr.cloud.SyncSliceTest-1347951352588/jetty2/index,segFN=segments_1,generation=1,filenames=[segments_1]
[junit4:junit4]   2> 10216 T14 oasc.SolrDeletionPolicy.updateCommits newest commit = 1
[junit4:junit4]   2> 10216 T14 oasc.SolrCore.initWriters created xml: solr.XMLResponseWriter
[junit4:junit4]   2> 10220 T14 oasup.UpdateRequestProcessorChain.init inserting DistributedUpdateProcessorFactory into updateRequestProcessorChain "dedupe"
[junit4:junit4]   2> 10220 T14 oasup.UpdateRequestProcessorChain.init inserting DistributedUpdateProcessorFactory into updateRequestProcessorChain "dedupe-allfields"
[junit4:junit4]   2> 10221 T14 oasup.UpdateRequestProcessorChain.init inserting DistributedUpdateProcessorFactory into updateRequestProcessorChain "stored_sig"
[junit4:junit4]   2> 10222 T14 oasup.UpdateRequestProcessorChain.init inserting DistributedUpdateProcessorFactory into updateRequestProcessorChain "uniq-fields"
[junit4:junit4]   2> 10223 T14 oasup.UpdateRequestProcessorChain.init inserting DistributedUpdateProcessorFactory into updateRequestProcessorChain "distrib-dup-test-chain-implicit"
[junit4:junit4]   2> 10223 T14 oasc.RequestHandlers.initHandlersFromConfig adding lazy requestHandler: solr.ReplicationHandler
[junit4:junit4]   2> 10224 T14 oasc.RequestHandlers.initHandlersFromConfig created /replication: solr.ReplicationHandler
[junit4:junit4]   2> 10225 T14 oasc.RequestHandlers.initHandlersFromConfig created standard: solr.StandardRequestHandler
[junit4:junit4]   2> 10227 T14 oasc.RequestHandlers.initHandlersFromConfig created /get: solr.RealTimeGetHandler
[junit4:junit4]   2> 10228 T14 oasc.RequestHandlers.initHandlersFromConfig created dismax: solr.SearchHandler
[junit4:junit4]   2> 10229 T14 oasc.RequestHandlers.initHandlersFromConfig created mock: org.apache.solr.core.MockQuerySenderListenerReqHandler
[junit4:junit4]   2> 10230 T14 oasc.RequestHandlers.initHandlersFromConfig created /admin/: org.apache.solr.handler.admin.AdminHandlers
[junit4:junit4]   2> 10231 T14 oasc.RequestHandlers.initHandlersFromConfig created defaults: solr.StandardRequestHandler
[junit4:junit4]   2> 10232 T14 oasc.RequestHandlers.initHandlersFromConfig adding lazy requestHandler: solr.StandardRequestHandler
[junit4:junit4]   2> 10232 T14 oasc.RequestHandlers.initHandlersFromConfig created lazy: solr.StandardRequestHandler
[junit4:junit4]   2> 10234 T14 oasc.RequestHandlers.initHandlersFromConfig created /update: solr.UpdateRequestHandler
[junit4:junit4]   2> 10235 T14 oasc.RequestHandlers.initHandlersFromConfig created /terms: org.apache.solr.handler.component.SearchHandler
[junit4:junit4]   2> 10236 T14 oasc.RequestHandlers.initHandlersFromConfig created spellCheckCompRH: org.apache.solr.handler.component.SearchHandler
[junit4:junit4]   2> 10237 T14 oasc.RequestHandlers.initHandlersFromConfig created spellCheckCompRH_Direct: org.apache.solr.handler.component.SearchHandler
[junit4:junit4]   2> 10238 T14 oasc.RequestHandlers.initHandlersFromConfig created spellCheckWithWordbreak: org.apache.solr.handler.component.SearchHandler
[junit4:junit4]   2> 10239 T14 oasc.RequestHandlers.initHandlersFromConfig created spellCheckWithWordbreak_Direct: org.apache.solr.handler.component.SearchHandler
[junit4:junit4]   2> 10241 T14 oasc.RequestHandlers.initHandlersFromConfig created spellCheckCompRH1: org.apache.solr.handler.component.SearchHandler
[junit4:junit4]   2> 10242 T14 oasc.RequestHandlers.initHandlersFromConfig created tvrh: org.apache.solr.handler.component.SearchHandler
[junit4:junit4]   2> 10243 T14 oasc.RequestHandlers.initHandlersFromConfig created /mlt: solr.MoreLikeThisHandler
[junit4:junit4]   2> 10244 T14 oasc.RequestHandlers.initHandlersFromConfig created /debug/dump: solr.DumpRequestHandler
[junit4:junit4]   2> 10248 T14 oashl.XMLLoader.init xsltCacheLifetimeSeconds=60
[junit4:junit4]   2> 10254 T14 oasc.SolrCore.initDeprecatedSupport WARNING solrconfig.xml uses deprecated <admin/gettableFiles>, Please update your config to use the ShowFileRequestHandler.
[junit4:junit4]   2> 10255 T14 oasc.SolrCore.initDeprecatedSupport WARNING adding ShowFileRequestHandler with hidden files: [SCHEMA.XML, OLD_SYNONYMS.TXT, STOPWORDS.TXT, PROTWORDS.TXT, OPEN-EXCHANGE-RATES.JSON, SYNONYMS.TXT, CURRENCY.XML, MAPPING-ISOLATIN1ACCENT.TXT]
[junit4:junit4]   2> 10260 T14 oass.SolrIndexSearcher.<init> Opening Searcher@4a030114 main
[junit4:junit4]   2> 10262 T14 oasu.CommitTracker.<init> Hard AutoCommit: disabled
[junit4:junit4]   2> 10262 T14 oasu.CommitTracker.<init> Soft AutoCommit: disabled
[junit4:junit4]   2> 10264 T14 oashc.SpellCheckComponent.inform Initializing spell checkers
[junit4:junit4]   2> 10272 T14 oass.DirectSolrSpellChecker.init init: {name=direct,classname=DirectSolrSpellChecker,field=lowerfilt,minQueryLength=3}
[junit4:junit4]   2> 10331 T62 oasc.SolrCore.registerSearcher [collection1] Registered new searcher Searcher@4a030114 main{StandardDirectoryReader(segments_1:1)}
[junit4:junit4]   2> 10530 T36 oascc.ZkStateReader.updateClusterState Updating cloud state from ZooKeeper... 
[junit4:junit4]   2> 10545 T61 oascc.ZkStateReader$2.process A cluster state change has occurred - updating...
[junit4:junit4]   2> 10545 T35 oascc.ZkStateReader$2.process A cluster state change has occurred - updating...
[junit4:junit4]   2> 10545 T49 oascc.ZkStateReader$2.process A cluster state change has occurred - updating...
[junit4:junit4]   2> 10844 T14 oasc.CoreContainer.register registering core: collection1
[junit4:junit4]   2> 10844 T14 oasc.ZkController.register Register shard - core:collection1 address:http://127.0.0.1:58754/solr shardId:shard1
[junit4:junit4]   2> 10849 T14 oasc.ZkController.register We are http://127.0.0.1:58754/solr/collection1/ and leader is http://127.0.0.1:33309/solr/collection1/
[junit4:junit4]   2> 10850 T14 oasc.ZkController.register No LogReplay needed for core=collection1 baseURL=http://127.0.0.1:58754/solr
[junit4:junit4]   2> 10850 T14 oasc.ZkController.checkRecovery Core needs to recover:collection1
[junit4:junit4]   2> 10851 T14 oasu.DefaultSolrCoreState.doRecovery Running recovery - first canceling any ongoing recovery
[junit4:junit4]   2> ASYNC  NEW_CORE C0 name=collection1 org.apache.solr.core.SolrCore@4d10ed49 url=http://127.0.0.1:58754/solr/collection1 node=127.0.0.1:58754_solr
[junit4:junit4]   2> 10858 T63 C0 P58754 oasc.RecoveryStrategy.run Starting recovery process.  core=collection1 recoveringAfterStartup=true
[junit4:junit4]   2> 10859 T14 oascc.ZkStateReader.updateClusterState Updating cloud state from ZooKeeper... 
[junit4:junit4]   2> 10862 T63 C0 P58754 oasc.RecoveryStrategy.doRecovery ###### startupVersions=[]
[junit4:junit4]   2> 10863 T14 oass.SolrDispatchFilter.init user.dir=/usr/home/hudson/hudson-slave/workspace/Lucene-Solr-Tests-4.x-java7/solr/build/solr-core/test/J1
[junit4:junit4]   2> 10864 T63 C0 P58754 oasc.RecoveryStrategy.doRecovery Attempting to PeerSync from http://127.0.0.1:33309/solr/collection1/ core=collection1 - recoveringAfterStartup=true
[junit4:junit4]   2> 10864 T14 oass.SolrDispatchFilter.init SolrDispatchFilter.init() done
[junit4:junit4]   2> 10865 T14 oascsi.HttpClientUtil.createClient Creating new http client, config:maxConnections=128&maxConnectionsPerHost=32&followRedirects=false
[junit4:junit4]   2> 10876 T63 C0 P58754 oascsi.HttpClientUtil.createClient Creating new http client, config:maxConnectionsPerHost=20&maxConnections=10000&connTimeout=30000&socketTimeout=30000&retry=false
[junit4:junit4]   2> 10900 T63 C0 P58754 oasu.PeerSync.sync PeerSync: core=collection1 url=http://127.0.0.1:58754/solr START replicas=[http://127.0.0.1:33309/solr/collection1/] nUpdates=100
[junit4:junit4]   2> 10913 T63 C0 P58754 oasu.PeerSync.sync WARNING no frame of reference to tell of we've missed updates
[junit4:junit4]   2> 10914 T63 C0 P58754 oasc.RecoveryStrategy.doRecovery PeerSync Recovery was not successful - trying replication. core=collection1
[junit4:junit4]   2> 10915 T63 C0 P58754 oasc.RecoveryStrategy.doRecovery Starting Replication Recovery. core=collection1
[junit4:junit4]   2> 10915 T63 C0 P58754 oascsi.HttpClientUtil.createClient Creating new http client, config:maxConnections=128&maxConnectionsPerHost=32&followRedirects=false
[junit4:junit4]   2> 11050 T36 oascc.ZkStateReader.updateClusterState Updating cloud state from ZooKeeper... 
[junit4:junit4]   2> 11059 T14 oejs.Server.doStart jetty-8.1.2.v20120308
[junit4:junit4]   2> 11062 T14 oejs.AbstractConnector.doStart Started SocketConnector@0.0.0.0:57303
[junit4:junit4]   2> 11063 T14 oasc.SolrResourceLoader.locateSolrHome JNDI not configured for solr (NoInitialContextEx)
[junit4:junit4]   2> 11063 T14 oasc.SolrResourceLoader.locateSolrHome using system property solr.solr.home: /usr/home/hudson/hudson-slave/workspace/Lucene-Solr-Tests-4.x-java7/solr/build/solr-core/test/J1/./solrtest-jetty3-1347951363462
[junit4:junit4]   2> 11064 T14 oasc.SolrResourceLoader.<init> new SolrResourceLoader for deduced Solr Home: '/usr/home/hudson/hudson-slave/workspace/Lucene-Solr-Tests-4.x-java7/solr/build/solr-core/test/J1/./solrtest-jetty3-1347951363462/'
[junit4:junit4]   2> 11073 T61 oascc.ZkStateReader$2.process A cluster state change has occurred - updating...
[junit4:junit4]   2> 11073 T49 oascc.ZkStateReader$2.process A cluster state change has occurred - updating...
[junit4:junit4]   2> 11073 T35 oascc.ZkStateReader$2.process A cluster state change has occurred - updating...
[junit4:junit4]   2> 11105 T14 oass.SolrDispatchFilter.init SolrDispatchFilter.init()
[junit4:junit4]   2> 11106 T14 oasc.SolrResourceLoader.locateSolrHome JNDI not configured for solr (NoInitialContextEx)
[junit4:junit4]   2> 11106 T14 oasc.SolrResourceLoader.locateSolrHome using system property solr.solr.home: /usr/home/hudson/hudson-slave/workspace/Lucene-Solr-Tests-4.x-java7/solr/build/solr-core/test/J1/./solrtest-jetty3-1347951363462
[junit4:junit4]   2> 11107 T14 oasc.CoreContainer$Initializer.initialize looking for solr.xml: /usr/home/hudson/hudson-slave/workspace/Lucene-Solr-Tests-4.x-java7/solr/build/solr-core/test/J1/./solrtest-jetty3-1347951363462/solr.xml
[junit4:junit4]   2> 11107 T14 oasc.CoreContainer.<init> New CoreContainer 1518839498
[junit4:junit4]   2> 11108 T14 oasc.CoreContainer.load Loading CoreContainer using Solr Home: '/usr/home/hudson/hudson-slave/workspace/Lucene-Solr-Tests-4.x-java7/solr/build/solr-core/test/J1/./solrtest-jetty3-1347951363462/'
[junit4:junit4]   2> 11108 T14 oasc.SolrResourceLoader.<init> new SolrResourceLoader for directory: '/usr/home/hudson/hudson-slave/workspace/Lucene-Solr-Tests-4.x-java7/solr/build/solr-core/test/J1/./solrtest-jetty3-1347951363462/'
[junit4:junit4]   2> 11140 T14 oasc.CoreContainer.load Registering Log Listener
[junit4:junit4]   2> 11154 T14 oasc.CoreContainer.initZooKeeper Zookeeper client=127.0.0.1:10849/solr
[junit4:junit4]   2> 11155 T14 oaz.ZooKeeper.<init> Initiating client connection, connectString=127.0.0.1:10849/solr sessionTimeout=5000 watcher=org.apache.solr.common.cloud.ConnectionManager@2369fbfa
[junit4:junit4]   2> 11156 T74 oaz.ClientCnxn$SendThread.startConnect Opening socket connection to server /127.0.0.1:10849
[junit4:junit4]   2> 11156 T14 oascc.ConnectionManager.waitForConnected Waiting for client to connect to ZooKeeper
[junit4:junit4]   2> 11158 T74 oaz.ClientCnxn$SendThread.primeConnection Socket connection established to localhost/127.0.0.1:10849, initiating session
[junit4:junit4]   2> 11158 T16 oazs.NIOServerCnxn$Factory.run Accepted socket connection from /140.211.11.196:53464
[junit4:junit4]   2> 11159 T16 oazs.NIOServerCnxn.readConnectRequest Client attempting to establish new session at /140.211.11.196:53464
[junit4:junit4]   2> 11161 T18 oazs.NIOServerCnxn.finishSessionInit Established session 0x139d8295c820005 with negotiated timeout 5000 for client /140.211.11.196:53464
[junit4:junit4]   2> 11161 T74 oaz.ClientCnxn$SendThread.readConnectResult Session establishment complete on server localhost/127.0.0.1:10849, sessionid = 0x139d8295c820005, negotiated timeout = 5000
[junit4:junit4]   2> 11162 T75 oascc.ConnectionManager.process Watcher org.apache.solr.common.cloud.ConnectionManager@2369fbfa name:ZooKeeperConnection Watcher:127.0.0.1:10849/solr got event WatchedEvent state:SyncConnected type:None path:null path:null type:None
[junit4:junit4]   2> 11162 T14 oascc.ConnectionManager.waitForConnected Client is connected to ZooKeeper
[junit4:junit4]   2> 11163 T19 oazs.PrepRequestProcessor.pRequest Got user-level KeeperException when processing sessionid:0x139d8295c820005 type:create cxid:0x1 zxid:0xfffffffffffffffe txntype:unknown reqpath:n/a Error Path:/solr/overseer Error:KeeperErrorCode = NodeExists for /solr/overseer
[junit4:junit4]   2> 11165 T19 oazs.PrepRequestProcessor.pRequest Got user-level KeeperException when processing sessionid:0x139d8295c820005 type:create cxid:0x2 zxid:0xfffffffffffffffe txntype:unknown reqpath:n/a Error Path:/solr/overseer Error:KeeperErrorCode = NodeExists for /solr/overseer
[junit4:junit4]   2> 11174 T14 oasc.ZkController.createEphemeralLiveNode Register node as live in ZooKeeper:/live_nodes/127.0.0.1:57303_solr
[junit4:junit4]   2> 11175 T19 oazs.PrepRequestProcessor.pRequest Got user-level KeeperException when processing sessionid:0x139d8295c820005 type:delete cxid:0x4 zxid:0xfffffffffffffffe txntype:unknown reqpath:n/a Error Path:/solr/live_nodes/127.0.0.1:57303_solr Error:KeeperErrorCode = NoNode for /solr/live_nodes/127.0.0.1:57303_solr
[junit4:junit4]   2> 11176 T14 oascc.SolrZkClient.makePath makePath: /live_nodes/127.0.0.1:57303_solr
[junit4:junit4]   2> 11179 T49 oascc.ZkStateReader$3.process Updating live nodes
[junit4:junit4]   2> 11179 T35 oascc.ZkStateReader$3.process Updating live nodes
[junit4:junit4]   2> 11180 T61 oascc.ZkStateReader$3.process Updating live nodes
[junit4:junit4]   2> 11181 T14 oashc.HttpShardHandlerFactory.getParameter Setting socketTimeout to: 0
[junit4:junit4]   2> 11182 T14 oashc.HttpShardHandlerFactory.getParameter Setting urlScheme to: http://
[junit4:junit4]   2> 11183 T14 oashc.HttpShardHandlerFactory.getParameter Setting connTimeout to: 0
[junit4:junit4]   2> 11184 T14 oashc.HttpShardHandlerFactory.getParameter Setting maxConnectionsPerHost to: 20
[junit4:junit4]   2> 11185 T14 oashc.HttpShardHandlerFactory.getParameter Setting corePoolSize to: 0
[junit4:junit4]   2> 11185 T14 oashc.HttpShardHandlerFactory.getParameter Setting maximumPoolSize to: 2147483647
[junit4:junit4]   2> 11186 T14 oashc.HttpShardHandlerFactory.getParameter Setting maxThreadIdleTime to: 5
[junit4:junit4]   2> 11187 T14 oashc.HttpShardHandlerFactory.getParameter Setting sizeOfQueue to: -1
[junit4:junit4]   2> 11188 T14 oashc.HttpShardHandlerFactory.getParameter Setting fairnessPolicy to: false
[junit4:junit4]   2> 11188 T14 oascsi.HttpClientUtil.createClient Creating new http client, config:maxConnectionsPerHost=20&maxConnections=10000&socketTimeout=0&connTimeout=0&retry=false
[junit4:junit4]   2> 11215 T14 oascc.ZkStateReader.createClusterStateWatchersAndUpdate Updating cluster state from ZooKeeper... 
[junit4:junit4]   2> 11231 T14 oasc.CoreContainer.create Creating SolrCore 'collection1' using instanceDir: /usr/home/hudson/hudson-slave/workspace/Lucene-Solr-Tests-4.x-java7/solr/build/solr-core/test/J1/./solrtest-jetty3-1347951363462/collection1
[junit4:junit4]   2> 11232 T14 oasc.ZkController.createCollectionZkNode Check for collection zkNode:collection1
[junit4:junit4]   2> 11233 T14 oasc.ZkController.createCollectionZkNode Collection zkNode exists
[junit4:junit4]   2> 11234 T14 oasc.ZkController.readConfigName Load collection config from:/collections/collection1
[junit4:junit4]   2> 11236 T14 oasc.SolrResourceLoader.<init> new SolrResourceLoader for directory: '/usr/home/hudson/hudson-slave/workspace/Lucene-Solr-Tests-4.x-java7/solr/build/solr-core/test/J1/./solrtest-jetty3-1347951363462/collection1/'
[junit4:junit4]   2> 11239 T14 oasc.SolrResourceLoader.replaceClassLoader Adding 'file:/usr/home/hudson/hudson-slave/workspace/Lucene-Solr-Tests-4.x-java7/solr/build/solr-core/test/J1/solrtest-jetty3-1347951363462/collection1/lib/classes/' to classloader
[junit4:junit4]   2> 11240 T14 oasc.SolrResourceLoader.replaceClassLoader Adding 'file:/usr/home/hudson/hudson-slave/workspace/Lucene-Solr-Tests-4.x-java7/solr/build/solr-core/test/J1/solrtest-jetty3-1347951363462/collection1/lib/README' to classloader
[junit4:junit4]   2> 11388 T14 oasc.SolrConfig.<init> Using Lucene MatchVersion: LUCENE_40
[junit4:junit4]   2> 11505 T14 oasc.SolrConfig.<init> Loaded SolrConfig: solrconfig.xml
[junit4:junit4]   2> 11607 T14 oass.IndexSchema.readSchema Reading Solr Schema
[junit4:junit4]   2> 11651 T14 oass.IndexSchema.readSchema Schema name=test
[junit4:junit4]   2> ASYNC  NEW_CORE C1 name=collection1 org.apache.solr.core.SolrCore@2c1ec049 url=http://127.0.0.1:33309/solr/collection1 node=127.0.0.1:33309_solr
[junit4:junit4]   2> 12220 T42 C1 P33309 REQ /get {distrib=false&qt=/get&wt=javabin&version=2&getVersions=100} status=0 QTime=51 
[junit4:junit4]   2> 12354 T14 oass.OpenExchangeRatesOrgProvider.init Initialized with rates=open-exchange-rates.json, refreshInterval=1440.
[junit4:junit4]   2> 12366 T14 oass.IndexSchema.readSchema default search field in schema is text
[junit4:junit4]   2> 12370 T14 oass.IndexSchema.readSchema unique key field: id
[junit4:junit4]   2> 12395 T14 oass.FileExchangeRateProvider.reload Reloading exchange rates from file currency.xml
[junit4:junit4]   2> 12408 T14 oass.FileExchangeRateProvider.reload Reloading exchange rates from file currency.xml
[junit4:junit4]   2> 12413 T14 oass.OpenExchangeRatesOrgProvider.reload Reloading exchange rates from open-exchange-rates.json
[junit4:junit4]   2> 12416 T14 oass.OpenExchangeRatesOrgProvider.reload Reloading exchange rates from open-exchange-rates.json
[junit4:junit4]   2> 12419 T14 oasc.SolrCore.<init> [collection1] Opening new SolrCore at /usr/home/hudson/hudson-slave/workspace/Lucene-Solr-Tests-4.x-java7/solr/build/solr-core/test/J1/./solrtest-jetty3-1347951363462/collection1/, dataDir=./org.apache.solr.cloud.SyncSliceTest-1347951352588/jetty3/
[junit4:junit4]   2> 12419 T14 oasc.JmxMonitoredMap.<init> JMX monitoring is enabled. Adding Solr mbeans to JMX Server: com.sun.jmx.mbeanserver.JmxMBeanServer@1706f7ec
[junit4:junit4]   2> 12421 T14 oasc.SolrCore.getNewIndexDir WARNING New index directory detected: old=null new=./org.apache.solr.cloud.SyncSliceTest-1347951352588/jetty3/index/
[junit4:junit4]   2> 12421 T14 oasc.SolrCore.initIndex WARNING [collection1] Solr index directory './org.apache.solr.cloud.SyncSliceTest-1347951352588/jetty3/index' doesn't exist. Creating new index...
[junit4:junit4]   2> 12422 T14 oasc.CachingDirectoryFactory.get return new directory for /usr/home/hudson/hudson-slave/workspace/Lucene-Solr-Tests-4.x-java7/solr/build/solr-core/test/J1/./org.apache.solr.cloud.SyncSliceTest-1347951352588/jetty3/index forceNew:false
[junit4:junit4]   2> 12440 T14 oasc.SolrDeletionPolicy.onCommit SolrDeletionPolicy.onCommit: commits:num=1
[junit4:junit4]   2> 		commit{dir=/usr/home/hudson/hudson-slave/workspace/Lucene-Solr-Tests-4.x-java7/solr/build/solr-core/test/J1/org.apache.solr.cloud.SyncSliceTest-1347951352588/jetty3/index,segFN=segments_1,generation=1,filenames=[segments_1]
[junit4:junit4]   2> 12440 T14 oasc.SolrDeletionPolicy.updateCommits newest commit = 1
[junit4:junit4]   2> 12441 T14 oasc.SolrCore.initWriters created xml: solr.XMLResponseWriter
[junit4:junit4]   2> 12444 T14 oasup.UpdateRequestProcessorChain.init inserting DistributedUpdateProcessorFactory into updateRequestProcessorChain "dedupe"
[junit4:junit4]   2> 12445 T14 oasup.UpdateRequestProcessorChain.init inserting DistributedUpdateProcessorFactory into updateRequestProcessorChain "dedupe-allfields"
[junit4:junit4]   2> 12445 T14 oasup.UpdateRequestProcessorChain.init inserting DistributedUpdateProcessorFactory into updateRequestProcessorChain "stored_sig"
[junit4:junit4]   2> 12446 T14 oasup.UpdateRequestProcessorChain.init inserting DistributedUpdateProcessorFactory into updateRequestProcessorChain "uniq-fields"
[junit4:junit4]   2> 12447 T14 oasup.UpdateRequestProcessorChain.init inserting DistributedUpdateProcessorFactory into updateRequestProcessorChain "distrib-dup-test-chain-implicit"
[junit4:junit4]   2> 12448 T14 oasc.RequestHandlers.initHandlersFromConfig adding lazy requestHandler: solr.ReplicationHandler
[junit4:junit4]   2> 12449 T14 oasc.RequestHandlers.initHandlersFromConfig created /replication: solr.ReplicationHandler
[junit4:junit4]   2> 12450 T14 oasc.RequestHandlers.initHandlersFromConfig created standard: solr.StandardRequestHandler
[junit4:junit4]   2> 12451 T14 oasc.RequestHandlers.initHandlersFromConfig created /get: solr.RealTimeGetHandler
[junit4:junit4]   2> 12452 T14 oasc.RequestHandlers.initHandlersFromConfig created dismax: solr.SearchHandler
[junit4:junit4]   2> 12453 T14 oasc.RequestHandlers.initHandlersFromConfig created mock: org.apache.solr.core.MockQuerySenderListenerReqHandler
[junit4:junit4]   2> 12453 T14 oasc.RequestHandlers.initHandlersFromConfig created /admin/: org.apache.solr.handler.admin.AdminHandlers
[junit4:junit4]   2> 12454 T14 oasc.RequestHandlers.initHandlersFromConfig created defaults: solr.StandardRequestHandler
[junit4:junit4]   2> 12455 T14 oasc.RequestHandlers.initHandlersFromConfig adding lazy requestHandler: solr.StandardRequestHandler
[junit4:junit4]   2> 12456 T14 oasc.RequestHandlers.initHandlersFromConfig created lazy: solr.StandardRequestHandler
[junit4:junit4]   2> 12457 T14 oasc.RequestHandlers.initHandlersFromConfig created /update: solr.UpdateRequestHandler
[junit4:junit4]   2> 12458 T14 oasc.RequestHandlers.initHandlersFromConfig created /terms: org.apache.solr.handler.component.SearchHandler
[junit4:junit4]   2> 12459 T14 oasc.RequestHandlers.initHandlersFromConfig created spellCheckCompRH: org.apache.solr.handler.component.SearchHandler
[junit4:junit4]   2> 12460 T14 oasc.RequestHandlers.initHandlersFromConfig created spellCheckCompRH_Direct: org.apache.solr.handler.component.SearchHandler
[junit4:junit4]   2> 12461 T14 oasc.RequestHandlers.initHandlersFromConfig created spellCheckWithWordbreak: org.apache.solr.handler.component.SearchHandler
[junit4:junit4]   2> 12462 T14 oasc.RequestHandlers.initHandlersFromConfig created spellCheckWithWordbreak_Direct: org.apache.solr.handler.component.SearchHandler
[junit4:junit4]   2> 12463 T14 oasc.RequestHandlers.initHandlersFromConfig created spellCheckCompRH1: org.apache.solr.handler.component.SearchHandler
[junit4:junit4]   2> 12464 T14 oasc.RequestHandlers.initHandlersFromConfig created tvrh: org.apache.solr.handler.component.SearchHandler
[junit4:junit4]   2> 12465 T14 oasc.RequestHandlers.initHandlersFromConfig created /mlt: solr.MoreLikeThisHandler
[junit4:junit4]   2> 12466 T14 oasc.RequestHandlers.initHandlersFromConfig created /debug/dump: solr.DumpRequestHandler
[junit4:junit4]   2> 12469 T14 oashl.XMLLoader.init xsltCacheLifetimeSeconds=60
[junit4:junit4]   2> 12473 T14 oasc.SolrCore.initDeprecatedSupport WARNING solrconfig.xml uses deprecated <admin/gettableFiles>, Please update your config to use the ShowFileRequestHandler.
[junit4:junit4]   2> 12475 T14 oasc.SolrCore.initDeprecatedSupport WARNING adding ShowFileRequestHandler with hidden files: [SCHEMA.XML, OLD_SYNONYMS.TXT, STOPWORDS.TXT, PROTWORDS.TXT, OPEN-EXCHANGE-RATES.JSON, SYNONYMS.TXT, CURRENCY.XML, MAPPING-ISOLATIN1ACCENT.TXT]
[junit4:junit4]   2> 12479 T14 oass.SolrIndexSearcher.<init> Opening Searcher@32f70f30 main
[junit4:junit4]   2> 12480 T14 oasu.CommitTracker.<init> Hard AutoCommit: disabled
[junit4:junit4]   2> 12480 T14 oasu.CommitTracker.<init> Soft AutoCommit: disabled
[junit4:junit4]   2> 12482 T14 oashc.SpellCheckComponent.inform Initializing spell checkers
[junit4:junit4]   2> 12490 T14 oass.DirectSolrSpellChecker.init init: {name=direct,classname=DirectSolrSpellChecker,field=lowerfilt,minQueryLength=3}
[junit4:junit4]   2> 12555 T76 oasc.SolrCore.registerSearcher [collection1] Registered new searcher Searcher@32f70f30 main{StandardDirectoryReader(segments_1:1)}
[junit4:junit4]   2> 12588 T36 oascc.ZkStateReader.updateClusterState Updating cloud state from ZooKeeper... 
[junit4:junit4]   2> 12603 T75 oascc.ZkStateReader$2.process A cluster state change has occurred - updating...
[junit4:junit4]   2> 12603 T49 oascc.ZkStateReader$2.process A cluster state change has occurred - updating...
[junit4:junit4]   2> 12603 T35 oascc.ZkStateReader$2.process A cluster state change has occurred - updating...
[junit4:junit4]   2> 12603 T61 oascc.ZkStateReader$2.process A cluster state change has occurred - updating...
[junit4:junit4]   2> 13076 T14 oasc.CoreContainer.register registering core: collection1
[junit4:junit4]   2> 13077 T14 oasc.ZkController.register Register shard - core:collection1 address:http://127.0.0.1:57303/solr shardId:shard1
[junit4:junit4]   2> 13086 T14 oasc.ZkController.register We are http://127.0.0.1:57303/solr/collection1/ and leader is http://127.0.0.1:33309/solr/collection1/
[junit4:junit4]   2> 13087 T14 oasc.ZkController.register No LogReplay needed for core=collection1 baseURL=http://127.0.0.1:57303/solr
[junit4:junit4]   2> 13087 T14 oasc.ZkController.checkRecovery Core needs to recover:collection1
[junit4:junit4]   2> 13088 T14 oasu.DefaultSolrCoreState.doRecovery Running recovery - first canceling any ongoing recovery
[junit4:junit4]   2> ASYNC  NEW_CORE C2 name=collection1 org.apache.solr.core.SolrCore@6d27bd4b url=http://127.0.0.1:57303/solr/collection1 node=127.0.0.1:57303_solr
[junit4:junit4]   2> 13089 T77 C2 P57303 oasc.RecoveryStrategy.run Starting recovery process.  core=collection1 recoveringAfterStartup=true
[junit4:junit4]   2> 13090 T14 oascc.ZkStateReader.updateClusterState Updating cloud state from ZooKeeper... 
[junit4:junit4]   2> 13090 T77 C2 P57303 oasc.RecoveryStrategy.doRecovery ###### startupVersions=[]
[junit4:junit4]   2> 13091 T14 oass.SolrDispatchFilter.init user.dir=/usr/home/hudson/hudson-slave/workspace/Lucene-Solr-Tests-4.x-java7/solr/build/solr-core/test/J1
[junit4:junit4]   2> 13092 T14 oass.SolrDispatchFilter.init SolrDispatchFilter.init() done
[junit4:junit4]   2> 13092 T77 C2 P57303 oasc.RecoveryStrategy.doRecovery Attempting to PeerSync from http://127.0.0.1:33309/solr/collection1/ core=collection1 - recoveringAfterStartup=true
[junit4:junit4]   2> 13093 T14 oascsi.HttpClientUtil.createClient Creating new http client, config:maxConnections=128&maxConnectionsPerHost=32&followRedirects=false
[junit4:junit4]   2> 13093 T77 C2 P57303 oasu.PeerSync.sync PeerSync: core=collection1 url=http://127.0.0.1:57303/solr START replicas=[http://127.0.0.1:33309/solr/collection1/] nUpdates=100
[junit4:junit4]   2> 13094 T77 C2 P57303 oasu.PeerSync.sync WARNING no frame of reference to tell of we've missed updates
[junit4:junit4]   2> 13095 T77 C2 P57303 oasc.RecoveryStrategy.doRecovery PeerSync Recovery was not successful - trying replication. core=collection1
[junit4:junit4]   2> 13096 T77 C2 P57303 oasc.RecoveryStrategy.doRecovery Starting Replication Recovery. core=collection1
[junit4:junit4]   2> 13096 T77 C2 P57303 oascsi.HttpClientUtil.createClient Creating new http client, config:maxConnections=128&maxConnectionsPerHost=32&followRedirects=false
[junit4:junit4]   2> 13098 T42 C1 P33309 REQ /get {distrib=false&qt=/get&wt=javabin&version=2&getVersions=100} status=0 QTime=0 
[junit4:junit4]   2> 13111 T36 oascc.ZkStateReader.updateClusterState Updating cloud state from ZooKeeper... 
[junit4:junit4]   2> 13125 T75 oascc.ZkStateReader$2.process A cluster state change has occurred - updating...
[junit4:junit4]   2> 13125 T35 oascc.ZkStateReader$2.process A cluster state change has occurred - updating...
[junit4:junit4]   2> 13125 T61 oascc.ZkStateReader$2.process A cluster state change has occurred - updating...
[junit4:junit4]   2> 13125 T49 oascc.ZkStateReader$2.process A cluster state change has occurred - updating...
[junit4:junit4]   2> 13307 T14 oejs.Server.doStart jetty-8.1.2.v20120308
[junit4:junit4]   2> 13310 T14 oejs.AbstractConnector.doStart Started SocketConnector@0.0.0.0:48810
[junit4:junit4]   2> 13311 T14 oasc.SolrResourceLoader.locateSolrHome JNDI not configured for solr (NoInitialContextEx)
[junit4:junit4]   2> 13312 T14 oasc.SolrResourceLoader.locateSolrHome using system property solr.solr.home: /usr/home/hudson/hudson-slave/workspace/Lucene-Solr-Tests-4.x-java7/solr/build/solr-core/test/J1/./solrtest-jetty4-1347951365693
[junit4:junit4]   2> 13313 T14 oasc.SolrResourceLoader.<init> new SolrResourceLoader for deduced Solr Home: '/usr/home/hudson/hudson-slave/workspace/Lucene-Solr-Tests-4.x-java7/solr/build/solr-core/test/J1/./solrtest-jetty4-1347951365693/'
[junit4:junit4]   2> 13370 T14 oass.SolrDispatchFilter.init SolrDispatchFilter.init()
[junit4:junit4]   2> 13371 T14 oasc.SolrResourceLoader.locateSolrHome JNDI not configured for solr (NoInitialContextEx)
[junit4:junit4]   2> 13372 T14 oasc.SolrResourceLoader.locateSolrHome using system property solr.solr.home: /usr/home/hudson/hudson-slave/workspace/Lucene-Solr-Tests-4.x-java7/solr/build/solr-core/test/J1/./solrtest-jetty4-1347951365693
[junit4:junit4]   2> 13373 T14 oasc.CoreContainer$Initializer.initialize looking for solr.xml: /usr/home/hudson/hudson-slave/workspace/Lucene-Solr-Tests-4.x-java7/solr/build/solr-core/test/J1/./solrtest-jetty4-1347951365693/solr.xml
[junit4:junit4]   2> 13373 T14 oasc.CoreContainer.<init> New CoreContainer 1737932744
[junit4:junit4]   2> 13374 T14 oasc.CoreContainer.load Loading CoreContainer using Solr Home: '/usr/home/hudson/hudson-slave/workspace/Lucene-Solr-Tests-4.x-java7/solr/build/solr-core/test/J1/./solrtest-jetty4-1347951365693/'
[junit4:junit4]   2> 13375 T14 oasc.SolrResourceLoader.<init> new SolrResourceLoader for directory: '/usr/home/hudson/hudson-slave/workspace/Lucene-Solr-Tests-4.x-java7/solr/build/solr-core/test/J1/./solrtest-jetty4-1347951365693/'
[junit4:junit4]   2> 13413 T14 oasc.CoreContainer.load Registering Log Listener
[junit4:junit4]   2> 13432 T14 oasc.CoreContainer.initZooKeeper Zookeeper client=127.0.0.1:10849/solr
[junit4:junit4]   2> 13433 T14 oaz.ZooKeeper.<init> Initiating client connection, connectString=127.0.0.1:10849/solr sessionTimeout=5000 watcher=org.apache.solr.common.cloud.ConnectionManager@400a2506
[junit4:junit4]   2> 13435 T88 oaz.ClientCnxn$SendThread.startConnect Opening socket connection to server /127.0.0.1:10849
[junit4:junit4]   2> 13435 T14 oascc.ConnectionManager.waitForConnected Waiting for client to connect to ZooKeeper
[junit4:junit4]   2> 13437 T88 oaz.ClientCnxn$SendThread.primeConnection Socket connection established to localhost/127.0.0.1:10849, initiating session
[junit4:junit4]   2> 13437 T16 oazs.NIOServerCnxn$Factory.run Accepted socket connection from /140.211.11.196:64951
[junit4:junit4]   2> 13438 T16 oazs.NIOServerCnxn.readConnectRequest Client attempting to establish new session at /140.211.11.196:64951
[junit4:junit4]   2> 13441 T18 oazs.NIOServerCnxn.finishSessionInit Established session 0x139d8295c820006 with negotiated timeout 5000 for client /140.211.11.196:64951
[junit4:junit4]   2> 13441 T88 oaz.ClientCnxn$SendThread.readConnectResult Session establishment complete on server localhost/127.0.0.1:10849, sessionid = 0x139d8295c820006, negotiated timeout = 5000
[junit4:junit4]   2> 13442 T89 oascc.ConnectionManager.process Watcher org.apache.solr.common.cloud.ConnectionManager@400a2506 name:ZooKeeperConnection Watcher:127.0.0.1:10849/solr got event WatchedEvent state:SyncConnected type:None path:null path:null type:None
[junit4:junit4]   2> 13443 T14 oascc.ConnectionManager.waitForConnected Client is connected to ZooKeeper
[junit4:junit4]   2> 13444 T19 oazs.PrepRequestProcessor.pRequest Got user-level KeeperException when processing sessionid:0x139d8295c820006 type:create cxid:0x1 zxid:0xfffffffffffffffe txntype:unknown reqpath:n/a Error Path:/solr/overseer Error:KeeperErrorCode = NodeExists for /solr/overseer
[junit4:junit4]   2> 13453 T19 oazs.PrepRequestProcessor.pRequest Got user-level KeeperException when processing sessionid:0x139d8295c820006 type:create cxid:0x2 zxid:0xfffffffffffffffe txntype:unknown reqpath:n/a Error Path:/solr/overseer Error:KeeperErrorCode = NodeExists for /solr/overseer
[junit4:junit4]   2> 13455 T14 oasc.ZkController.createEphemeralLiveNode Register node as live in ZooKeeper:/live_nodes/127.0.0.1:48810_solr
[junit4:junit4]   2> 13456 T19 oazs.PrepRequestProcessor.pRequest Got user-level KeeperException when processing sessionid:0x139d8295c820006 type:delete cxid:0x4 zxid:0xfffffffffffffffe txntype:unknown reqpath:n/a Error Path:/solr/live_nodes/127.0.0.1:48810_solr Error:KeeperErrorCode = NoNode for /solr/live_nodes/127.0.0.1:48810_solr
[junit4:junit4]   2> 13458 T14 oascc.SolrZkClient.makePath makePath: /live_nodes/127.0.0.1:48810_solr
[junit4:junit4]   2> 13462 T75 oascc.ZkStateReader$3.process Updating live nodes
[junit4:junit4]   2> 13462 T61 oascc.ZkStateReader$3.process Updating live nodes
[junit4:junit4]   2> 13462 T49 oascc.ZkStateReader$3.process Updating live nodes
[junit4:junit4]   2> 13462 T35 oascc.ZkStateReader$3.process Updating live nodes
[junit4:junit4]   2> 13464 T14 oashc.HttpShardHandlerFactory.getParameter Setting socketTimeout to: 0
[junit4:junit4]   2> 13465 T14 oashc.HttpShardHandlerFactory.getParameter Setting urlScheme to: http://
[junit4:junit4]   2> 13465 T14 oashc.HttpShardHandlerFactory.getParameter Setting connTimeout to: 0
[junit4:junit4]   2> 13466 T14 oashc.HttpShardHandlerFactory.getParameter Setting maxConnectionsPerHost to: 20
[junit4:junit4]   2> 13467 T14 oashc.HttpShardHandlerFactory.getParameter Setting corePoolSize to: 0
[junit4:junit4]   2> 13468 T14 oashc.HttpShardHandlerFactory.getParameter Setting maximumPoolSize to: 2147483647
[junit4:junit4]   2> 13468 T14 oashc.HttpShardHandlerFactory.getParameter Setting maxThreadIdleTime to: 5
[junit4:junit4]   2> 13469 T14 oashc.HttpShardHandlerFactory.getParameter Setting sizeOfQueue to: -1
[junit4:junit4]   2> 13470 T14 oashc.HttpShardHandlerFactory.getParameter Setting fairnessPolicy to: false
[junit4:junit4]   2> 13470 T14 oascsi.HttpClientUtil.createClient Creating new http client, config:maxConnectionsPerHost=20&maxConnections=10000&socketTimeout=0&connTimeout=0&retry=false
[junit4:junit4]   2> 13492 T14 oascc.ZkStateReader.createClusterStateWatchersAndUpdate Updating cluster state from ZooKeeper... 
[junit4:junit4]   2> 13502 T14 oasc.CoreContainer.create Creating SolrCore 'collection1' using instanceDir: /usr/home/hudson/hudson-slave/workspace/Lucene-Solr-Tests-4.x-java7/solr/build/solr-core/test/J1/./solrtest-jetty4-1347951365693/collection1
[junit4:junit4]   2> 13503 T14 oasc.ZkController.createCollectionZkNode Check for collection zkNode:collection1
[junit4:junit4]   2> 13504 T14 oasc.ZkController.createCollectionZkNode Collection zkNode exists
[junit4:junit4]   2> 13504 T14 oasc.ZkController.readConfigName Load collection config from:/collections/collection1
[junit4:junit4]   2> 13506 T14 oasc.SolrResourceLoader.<init> new SolrResourceLoader for directory: '/usr/home/hudson/hudson-slave/workspace/Lucene-Solr-Tests-4.x-java7/solr/build/solr-core/test/J1/./solrtest-jetty4-1347951365693/collection1/'
[junit4:junit4]   2> 13507 T14 oasc.SolrResourceLoader.replaceClassLoader Adding 'file:/usr/home/hudson/hudson-slave/workspace/Lucene-Solr-Tests-4.x-java7/solr/build/solr-core/test/J1/solrtest-jetty4-1347951365693/collection1/lib/README' to classloader
[junit4:junit4]   2> 13508 T14 oasc.SolrResourceLoader.replaceClassLoader Adding 'file:/usr/home/hudson/hudson-slave/workspace/Lucene-Solr-Tests-4.x-java7/solr/build/solr-core/test/J1/solrtest-jetty4-1347951365693/collection1/lib/classes/' to classloader
[junit4:junit4]   2> 13568 T14 oasc.SolrConfig.<init> Using Lucene MatchVersion: LUCENE_40
[junit4:junit4]   2> 13633 T14 oasc.SolrConfig.<init> Loaded SolrConfig: solrconfig.xml
[junit4:junit4]   2> 13735 T14 oass.IndexSchema.readSchema Reading Solr Schema
[junit4:junit4]   2> 13752 T14 oass.IndexSchema.readSchema Schema name=test
[junit4:junit4]   2> 14278 T14 oass.OpenExchangeRatesOrgProvider.init Initialized with rates=open-exchange-rates.json, refreshInterval=1440.
[junit4:junit4]   2> 14290 T14 oass.IndexSchema.readSchema default search field in schema is text
[junit4:junit4]   2> 14294 T14 oass.IndexSchema.readSchema unique key field: id
[junit4:junit4]   2>  C0_STATE=coll:collection1 core:collection1 props:{shard=shard1, roles=null, state=recovering, core=collection1, collection=collection1, node_name=127.0.0.1:58754_solr, base_url=http://127.0.0.1:58754/solr}
[junit4:junit4]   2> 14309 T63 C0 P58754 oasc.RecoveryStrategy.doRecovery Begin buffering updates. core=collection1
[junit4:junit4]   2> 14309 T63 C0 P58754 oasu.UpdateLog.bufferUpdates Starting to buffer updates. FSUpdateLog{state=ACTIVE, tlog=null}
[junit4:junit4]   2> 14310 T63 C0 P58754 oasc.RecoveryStrategy.replicate Attempting to replicate from http://127.0.0.1:33309/solr/collection1/. core=collection1
[junit4:junit4]   2> 14310 T63 C0 P58754 oascsi.HttpClientUtil.createClient Creating new http client, config:maxConnections=128&maxConnectionsPerHost=32&followRedirects=false
[junit4:junit4]   2> 14326 T14 oass.FileExchangeRateProvider.reload Reloading exchange rates from file currency.xml
[junit4:junit4]   2> 14332 T14 oass.FileExchangeRateProvider.reload Reloading exchange rates from file currency.xml
[junit4:junit4]   2> 14338 T14 oass.OpenExchangeRatesOrgProvider.reload Reloading exchange rates from open-exchange-rates.json
[junit4:junit4]   2> 14340 T14 oass.OpenExchangeRatesOrgProvider.reload Reloading exchange rates from open-exchange-rates.json
[junit4:junit4]   2> 14343 T14 oasc.SolrCore.<init> [collection1] Opening new SolrCore at /usr/home/hudson/hudson-slave/workspace/Lucene-Solr-Tests-4.x-java7/solr/build/solr-core/test/J1/./solrtest-jetty4-1347951365693/collection1/, dataDir=./org.apache.solr.cloud.SyncSliceTest-1347951352588/jetty4/
[junit4:junit4]   2> 14343 T14 oasc.JmxMonitoredMap.<init> JMX monitoring is enabled. Adding Solr mbeans to JMX Server: com.sun.jmx.mbeanserver.JmxMBeanServer@1706f7ec
[junit4:junit4]   2> 14345 T14 oasc.SolrCore.getNewIndexDir WARNING New index directory detected: old=null new=./org.apache.solr.cloud.SyncSliceTest-1347951352588/jetty4/index/
[junit4:junit4]   2> 14346 T14 oasc.SolrCore.initIndex WARNING [collection1] Solr index directory './org.apache.solr.cloud.SyncSliceTest-1347951352588/jetty4/index' doesn't exist. Creating new index...
[junit4:junit4]   2> 14347 T14 oasc.CachingDirectoryFactory.get return new directory for /usr/home/hudson/hudson-slave/workspace/Lucene-Solr-Tests-4.x-java7/solr/build/solr-core/test/J1/./org.apache.solr.cloud.SyncSliceTest-1347951352588/jetty4/index forceNew:false
[junit4:junit4]   2> 14348 T44 C1 P33309 oascsi.HttpClientUtil.createClient Creating new http client, config:maxConnections=500&maxConnectionsPerHost=16
[junit4:junit4]   2> 14366 T44 C1 P33309 oasu.DirectUpdateHandler2.commit start commit{flags=0,_version_=0,optimize=false,openSearcher=true,waitSearcher=true,expungeDeletes=false,softCommit=false}
[junit4:junit4]   2> 14370 T44 C1 P33309 oasc.SolrDeletionPolicy.onInit SolrDeletionPolicy.onInit: commits:num=1
[junit4:junit4]   2> 		commit{dir=/usr/home/hudson/hudson-slave/workspace/Lucene-Solr-Tests-4.x-java7/solr/build/solr-core/test/J1/org.apache.solr.cloud.SyncSliceTest-1347951352588/jetty1/index,segFN=segments_1,generation=1,filenames=[segments_1]
[junit4:junit4]   2> 14371 T44 C1 P33309 oasc.SolrDeletionPolicy.updateCommits newest commit = 1
[junit4:junit4]   2> 14373 T44 C1 P33309 oass.SolrIndexSearcher.<init> Opening Searcher@56292e59 main
[junit4:junit4]   2> 14377 T44 C1 P33309 oasu.DirectUpdateHandler2.commit end_commit_flush
[junit4:junit4]   2> 14384 T50 oasc.SolrCore.registerSearcher [collection1] Registered new searcher Searcher@56292e59 main{StandardDirectoryReader(segments_1:1)}
[junit4:junit4]   2> 14385 T44 C1 P33309 /update {waitSearcher=true&commit=true&commit_end_point=true&wt=javabin&softCommit=false&version=2} {commit=} 0 52
[junit4:junit4]   2> 14399 T14 oasc.SolrDeletionPolicy.onCommit SolrDeletionPolicy.onCommit: commits:num=1
[junit4:junit4]   2> 		commit{dir=/usr/home/hudson/hudson-slave/workspace/Lucene-Solr-Tests-4.x-java7/solr/build/solr-core/test/J1/org.apache.solr.cloud.SyncSliceTest-1347951352588/jetty4/index,segFN=segments_1,generation=1,filenames=[segments_1]
[junit4:junit4]   2> 14400 T14 oasc.SolrDeletionPolicy.updateCommits newest commit = 1
[junit4:junit4]   2> 14401 T14 oasc.SolrCore.initWriters created xml: solr.XMLResponseWriter
[junit4:junit4]   2> 14404 T14 oasup.UpdateRequestProcessorChain.init inserting DistributedUpdateProcessorFactory into updateRequestProcessorChain "dedupe"
[junit4:junit4]   2> 14404 T14 oasup.UpdateRequestProcessorChain.init inserting DistributedUpdateProcessorFactory into updateRequestProcessorChain "dedupe-allfields"
[junit4:junit4]   2> 14405 T14 oasup.UpdateRequestProcessorChain.init inserting DistributedUpdateProcessorFactory into updateRequestProcessorChain "stored_sig"
[junit4:junit4]   2> 14405 T14 oasup.UpdateRequestProcessorChain.init inserting DistributedUpdateProcessorFactory into updateRequestProcessorChain "uniq-fields"
[junit4:junit4]   2> 14406 T14 oasup.UpdateRequestProcessorChain.init inserting DistributedUpdateProcessorFactory into updateRequestProcessorChain "distrib-dup-test-chain-implicit"
[junit4:junit4]   2> 14407 T14 oasc.RequestHandlers.initHandlersFromConfig adding lazy requestHandler: solr.ReplicationHandler
[junit4:junit4]   2> 14408 T14 oasc.RequestHandlers.initHandlersFromConfig created /replication: solr.ReplicationHandler
[junit4:junit4]   2> 14408 T14 oasc.RequestHandlers.initHandlersFromConfig created standard: solr.StandardRequestHandler
[junit4:junit4]   2> 14409 T14 oasc.RequestHandlers.initHandlersFromConfig created /get: solr.RealTimeGetHandler
[junit4:junit4]   2> 14410 T14 oasc.RequestHandlers.initHandlersFromConfig created dismax: solr.SearchHandler
[junit4:junit4]   2> 14411 T14 oasc.RequestHandlers.initHandlersFromConfig created mock: org.apache.solr.core.MockQuerySenderListenerReqHandler
[junit4:junit4]   2> 14412 T14 oasc.RequestHandlers.initHandlersFromConfig created /admin/: org.apache.solr.handler.admin.AdminHandlers
[junit4:junit4]   2> 14413 T14 oasc.RequestHandlers.initHandlersFromConfig created defaults: solr.StandardRequestHandler
[junit4:junit4]   2> 14413 T14 oasc.RequestHandlers.initHandlersFromConfig adding lazy requestHandler: solr.StandardRequestHandler
[junit4:junit4]   2> 14414 T14 oasc.RequestHandlers.initHandlersFromConfig created lazy: solr.StandardRequestHandler
[junit4:junit4]   2> 14415 T14 oasc.RequestHandlers.initHandlersFromConfig created /update: solr.UpdateRequestHandler
[junit4:junit4]   2> 14416 T14 oasc.RequestHandlers.initHandlersFromConfig created /terms: org.apache.solr.handler.component.SearchHandler
[junit4:junit4]   2> 14417 T14 oasc.RequestHandlers.initHandlersFromConfig created spellCheckCompRH: org.apache.solr.handler.component.SearchHandler
[junit4:junit4]   2> 14418 T14 oasc.RequestHandlers.initHandlersFromConfig created spellCheckCompRH_Direct: org.apache.solr.handler.component.SearchHandler
[junit4:junit4]   2> 14419 T14 oasc.RequestHandlers.initHandlersFromConfig created spellCheckWithWordbreak: org.apache.solr.handler.component.SearchHandler
[junit4:junit4]   2> 14419 T14 oasc.RequestHandlers.initHandlersFromConfig created spellCheckWithWordbreak_Direct: org.apache.solr.handler.component.SearchHandler
[junit4:junit4]   2> 14420 T14 oasc.RequestHandlers.initHandlersFromConfig created spellCheckCompRH1: org.apache.solr.handler.component.SearchHandler
[junit4:junit4]   2> 14421 T14 oasc.RequestHandlers.initHandlersFromConfig created tvrh: org.apache.solr.handler.component.SearchHandler
[junit4:junit4]   2> 14423 T14 oasc.RequestHandlers.initHandlersFromConfig created /mlt: solr.MoreLikeThisHandler
[junit4:junit4]   2> 14424 T14 oasc.RequestHandlers.initHandlersFromConfig created /debug/dump: solr.DumpRequestHandler
[junit4:junit4]   2> 14429 T63 C0 P58754 oash.ReplicationHandler.inform Commits will be reserved for  10000
[junit4:junit4]   2> 14429 T14 oashl.XMLLoader.init xsltCacheLifetimeSeconds=60
[junit4:junit4]   2> 14429 T63 C0 P58754 oascsi.HttpClientUtil.createClient Creating new http client, config:connTimeout=5000&socketTimeout=20000&allowCompression=false&maxConnections=10000&maxConnectionsPerHost=10000
[junit4:junit4]   2> 14434 T14 oasc.SolrCore.initDeprecatedSupport WARNING solrconfig.xml uses deprecated <admin/gettableFiles>, Please update your config to use the ShowFileRequestHandler.
[junit4:junit4]   2> 14436 T14 oasc.SolrCore.initDeprecatedSupport WARNING adding ShowFileRequestHandler with hidden files: [SCHEMA.XML, OLD_SYNONYMS.TXT, STOPWORDS.TXT, PROTWORDS.TXT, OPEN-EXCHANGE-RATES.JSON, SYNONYMS.TXT, CURRENCY.XML, MAPPING-ISOLATIN1ACCENT.TXT]
[junit4:junit4]   2> 14440 T14 oass.SolrIndexSearcher.<init> Opening Searcher@67178f5d main
[junit4:junit4]   2> 14441 T14 oasu.CommitTracker.<init> Hard AutoCommit: disabled
[junit4:junit4]   2> 14442 T14 oasu.CommitTracker.<init> Soft AutoCommit: disabled
[junit4:junit4]   2> 14443 T14 oashc.SpellCheckComponent.inform Initializing spell checkers
[junit4:junit4]   2> 14450 T14 oass.DirectSolrSpellChecker.init init: {name=direct,classname=DirectSolrSpellChecker,field=lowerfilt,minQueryLength=3}
[junit4:junit4]   2> 14454 T63 C0 P58754 oash.SnapPuller.<init>  No value set for 'pollInterval'. Timer Task not started.
[junit4:junit4]   2> 14495 T45 C1 P33309 oash.ReplicationHandler.inform Commits will be reserved for  10000
[junit4:junit4]   2> 14496 T45 C1 P33309 REQ /replication {command=indexversion&wt=javabin&qt=/replication&version=2} status=0 QTime=39 
[junit4:junit4]   2> 14501 T63 C0 P58754 oasc.SolrDeletionPolicy.onInit SolrDeletionPolicy.onInit: commits:num=1
[junit4:junit4]   2> 		commit{dir=/usr/home/hudson/hudson-slave/workspace/Lucene-Solr-Tests-4.x-java7/solr/build/solr-core/test/J1/org.apache.solr.cloud.SyncSliceTest-1347951352588/jetty2/index,segFN=segments_1,generation=1,filenames=[segments_1]
[junit4:junit4]   2> 14504 T63 C0 P58754 oasc.SolrDeletionPolicy.updateCommits newest commit = 1
[junit4:junit4]   2> 14505 T63 C0 P58754 oasu.DirectUpdateHandler2.commit start commit{flags=0,_version_=0,optimize=false,openSearcher=true,waitSearcher=true,expungeDeletes=false,softCommit=false}
[junit4:junit4]   2> 14515 T90 oasc.SolrCore.registerSearcher [collection1] Registered new searcher Searcher@67178f5d main{StandardDirectoryReader(segments_1:1)}
[junit4:junit4]   2> 14518 T63 C0 P58754 oasc.SolrDeletionPolicy.onCommit SolrDeletionPolicy.onCommit: commits:num=2
[junit4:junit4]   2> 		commit{dir=/usr/home/hudson/hudson-slave/workspace/Lucene-Solr-Tests-4.x-java7/solr/build/solr-core/test/J1/org.apache.solr.cloud.SyncSliceTest-1347951352588/jetty2/index,segFN=segments_1,generation=1,filenames=[segments_1]
[junit4:junit4]   2> 		commit{dir=/usr/home/hudson/hudson-slave/workspace/Lucene-Solr-Tests-4.x-java7/solr/build/solr-core/test/J1/org.apache.solr.cloud.SyncSliceTest-1347951352588/jetty2/index,segFN=segments_2,generation=2,filenames=[segments_2]
[junit4:junit4]   2> 14519 T63 C0 P58754 oasc.SolrDeletionPolicy.updateCommits newest commit = 2
[junit4:junit4]   2> 14525 T63 C0 P58754 oass.SolrIndexSearcher.<init> Opening Searcher@23aa7439 main
[junit4:junit4]   2> 14526 T63 C0 P58754 oasu.DirectUpdateHandler2.commit end_commit_flush
[junit4:junit4]   2> 14529 T62 oasc.SolrCore.registerSearcher [collection1] Registered new searcher Searcher@23aa7439 main{StandardDirectoryReader(segments_2:2)}
[junit4:junit4]   2> 14530 T63 C0 P58754 oasc.RecoveryStrategy.replay No replay needed. core=collection1
[junit4:junit4]   2> 14531 T63 C0 P58754 oasc.RecoveryStrategy.doRecovery Replication Recovery was successful - registering as Active. core=collection1
[junit4:junit4]   2> 14533 T63 C0 P58754 oasc.RecoveryStrategy.doRecovery Finished recovery process. core=collection1
[junit4:junit4]   2> 14635 T36 oascc.ZkStateReader.updateClusterState Updating cloud state from ZooKeeper... 
[junit4:junit4]   2> 14690 T35 oascc.ZkStateReader$2.process A cluster state change has occurred - updating...
[junit4:junit4]   2> 14690 T49 oascc.ZkStateReader$2.process A cluster state change has occurred - updating...
[junit4:junit4]   2> 14690 T75 oascc.ZkStateReader$2.process A cluster state change has occurred - updating...
[junit4:junit4]   2> 14690 T61 oascc.ZkStateReader$2.process A cluster state change has occurred - updating...
[junit4:junit4]   2> 14690 T89 oascc.ZkStateReader$2.process A cluster state change has occurred - updating...
[junit4:junit4]   2> 15033 T14 oasc.CoreContainer.register registering core: collection1
[junit4:junit4]   2> 15034 T14 oasc.ZkController.register Register shard - core:collection1 address:http://127.0.0.1:48810/solr shardId:shard1
[junit4:junit4]   2> 15038 T14 oasc.ZkController.register We are http://127.0.0.1:48810/solr/collection1/ and leader is http://127.0.0.1:33309/solr/collection1/
[junit4:junit4]   2> 15039 T14 oasc.ZkController.register No LogReplay needed for core=collection1 baseURL=http://127.0.0.1:48810/solr
[junit4:junit4]   2> 15039 T14 oasc.ZkController.checkRecovery Core needs to recover:collection1
[junit4:junit4]   2> 15040 T14 oasu.DefaultSolrCoreState.doRecovery Running recovery - first canceling any ongoing recovery
[junit4:junit4]   2> ASYNC  NEW_CORE C3 name=collection1 org.apache.solr.core.SolrCore@6475c0ab url=http://127.0.0.1:48810/solr/collection1 node=127.0.0.1:48810_solr
[junit4:junit4]   2> 15041 T91 C3 P48810 oasc.RecoveryStrategy.run Starting recovery process.  core=collection1 recoveringAfterStartup=true
[junit4:junit4]   2> 15041 T91 C3 P48810 oasc.RecoveryStrategy.doRecovery ###### startupVersions=[]
[junit4:junit4]   2> 15041 T14 oascc.ZkStateReader.updateClusterState Updating cloud state from ZooKeeper... 
[junit4:junit4]   2> 15043 T91 C3 P48810 oasc.RecoveryStrategy.doRecovery Attempting to PeerSync from http://127.0.0.1:33309/solr/collection1/ core=collection1 - recoveringAfterStartup=true
[junit4:junit4]   2> 15043 T91 C3 P48810 oasu.PeerSync.sync PeerSync: core=collection1 url=http://127.0.0.1:48810/solr START replicas=[http://127.0.0.1:33309/solr/collection1/] nUpdates=100
[junit4:junit4]   2> 15043 T14 oass.SolrDispatchFilter.init user.dir=/usr/home/hudson/hudson-slave/workspace/Lucene-Solr-Tests-4.x-java7/solr/build/solr-core/test/J1
[junit4:junit4]   2> 15044 T91 C3 P48810 oasu.PeerSync.sync WARNING no frame of reference to tell of we've missed updates
[junit4:junit4]   2> 15044 T14 oass.SolrDispatchFilter.init SolrDispatchFilter.init() done
[junit4:junit4]   2> 15044 T91 C3 P48810 oasc.RecoveryStrategy.doRecovery PeerSync Recovery was not successful - trying replication. core=collection1
[junit4:junit4]   2> 15045 T14 oascsi.HttpClientUtil.createClient Creating new http client, config:maxConnections=128&maxConnectionsPerHost=32&followRedirects=false
[junit4:junit4]   2> 15045 T91 C3 P48810 oasc.RecoveryStrategy.doRecovery Starting Replication Recovery. core=collection1
[junit4:junit4]   2> 15046 T91 C3 P48810 oascsi.HttpClientUtil.createClient Creating new http client, config:maxConnections=128&maxConnectionsPerHost=32&followRedirects=false
[junit4:junit4]   2> 15047 T42 C1 P33309 REQ /get {distrib=false&qt=/get&wt=javabin&version=2&getVersions=100} status=0 QTime=0 
[junit4:junit4]   2> 15063 T14 oaz.ZooKeeper.<init> Initiating client connection, connectString=127.0.0.1:10849/solr sessionTimeout=10000 watcher=org.apache.solr.common.cloud.ConnectionManager@17b252ce
[junit4:junit4]   2> 15064 T93 oaz.ClientCnxn$SendThread.startConnect Opening socket connection to server /127.0.0.1:10849
[junit4:junit4]   2> 15064 T14 oascc.ConnectionManager.waitForConnected Waiting for client to connect to ZooKeeper
[junit4:junit4]   2> 15065 T93 oaz.ClientCnxn$SendThread.primeConnection Socket connection established to localhost/127.0.0.1:10849, initiating session
[junit4:junit4]   2> 15065 T16 oazs.NIOServerCnxn$Factory.run Accepted socket connection from /140.211.11.196:16552
[junit4:junit4]   2> 15066 T16 oazs.NIOServerCnxn.readConnectRequest Client attempting to establish new session at /140.211.11.196:16552
[junit4:junit4]   2> 15068 T18 oazs.NIOServerCnxn.finishSessionInit Established session 0x139d8295c820007 with negotiated timeout 10000 for client /140.211.11.196:16552
[junit4:junit4]   2> 15068 T93 oaz.ClientCnxn$SendThread.readConnectResult Session establishment complete on server localhost/127.0.0.1:10849, sessionid = 0x139d8295c820007, negotiated timeout = 10000
[junit4:junit4]   2> 15068 T94 oascc.ConnectionManager.process Watcher org.apache.solr.common.cloud.ConnectionManager@17b252ce name:ZooKeeperConnection Watcher:127.0.0.1:10849/solr got event WatchedEvent state:SyncConnected type:None path:null path:null type:None
[junit4:junit4]   2> 15069 T14 oascc.ConnectionManager.waitForConnected Client is connected to ZooKeeper
[junit4:junit4]   2> 15070 T14 oascc.ZkStateReader.createClusterStateWatchersAndUpdate Updating cluster state from ZooKeeper... 
[junit4:junit4]   2> 15075 T14 oasc.ChaosMonkey.monkeyLog monkey: init - expire sessions:true cause connection loss:true
[junit4:junit4]   2> 15075 T14 oascsi.HttpClientUtil.createClient Creating new http client, config:
[junit4:junit4]   2> 15085 T14 oascc.ZkStateReader.updateClusterState Updating cloud state from ZooKeeper... 
[junit4:junit4]   2> 15087 T14 oasc.AbstractFullDistribZkTestBase.waitForThingsToLevelOut Wait for recoveries to finish - wait 15 for each attempt
[junit4:junit4]   2> 15087 T14 oasc.AbstractDistribZkTestBase.waitForRecoveriesToFinish Wait for recoveries to finish - collection: collection1 failOnTimeout:true timeout (sec):15
[junit4:junit4]   2> 15088 T14 oascc.ZkStateReader.updateClusterState Updating cloud state from ZooKeeper... 
[junit4:junit4]   2> 15205 T36 oascc.ZkStateReader.updateClusterState Updating cloud state from ZooKeeper... 
[junit4:junit4]   2> 15222 T94 oascc.ZkStateReader$2.process A cluster state change has occurred - updating...
[junit4:junit4]   2> 15222 T35 oascc.ZkStateReader$2.process A cluster state change has occurred - updating...
[junit4:junit4]   2> 15222 T61 oascc.ZkStateReader$2.process A cluster state change has occurred - updating...
[junit4:junit4]   2> 15222 T49 oascc.ZkStateReader$2.process A cluster state change has occurred - updating...
[junit4:junit4]   2> 15222 T89 oascc.ZkStateReader$2.process A cluster state change has occurred - updating...
[junit4:junit4]   2> 15222 T75 oascc.ZkStateReader$2.process A cluster state change has occurred - updating...
[junit4:junit4]   2> 16090 T14 oascc.ZkStateReader.updateClusterState Updating cloud state from ZooKeeper... 
[junit4:junit4]   2>  C2_STATE=coll:collection1 core:collection1 props:{shard=shard1, roles=null, state=recovering, core=collection1, collection=collection1, node_name=127.0.0.1:57303_solr, base_url=http://127.0.0.1:57303/solr}
[junit4:junit4]   2> 16122 T77 C2 P57303 oasc.RecoveryStrategy.doRecovery Begin buffering updates. core=collection1
[junit4:junit4]   2> 16122 T77 C2 P57303 oasu.UpdateLog.bufferUpdates Starting to buffer updates. FSUpdateLog{state=ACTIVE, tlog=null}
[junit4:junit4]   2> 16122 T77 C2 P57303 oasc.RecoveryStrategy.replicate Attempting to replicate from http://127.0.0.1:33309/solr/collection1/. core=collection1
[junit4:junit4]   2> 16123 T77 C2 P57303 oascsi.HttpClientUtil.createClient Creating new http client, config:maxConnections=128&maxConnectionsPerHost=32&followRedirects=false
[junit4:junit4]   2> 16133 T47 C1 P33309 oasu.DirectUpdateHandler2.commit start commit{flags=0,_version_=0,optimize=false,openSearcher=true,waitSearcher=true,expungeDeletes=false,softCommit=false}
[junit4:junit4]   2> 16136 T47 C1 P33309 oass.SolrIndexSearcher.<init> Opening Searcher@4b3e213f main
[junit4:junit4]   2> 16137 T47 C1 P33309 oasu.DirectUpdateHandler2.commit end_commit_flush
[junit4:junit4]   2> 16142 T50 oasc.SolrCore.registerSearcher [collection1] Registered new searcher Searcher@4b3e213f main{StandardDirectoryReader(segments_1:1)}
[junit4:junit4]   2> 16143 T47 C1 P33309 /update {waitSearcher=true&commit=true&commit_end_point=true&wt=javabin&softCommit=false&version=2} {commit=} 0 10
[junit4:junit4]   2> 16144 T77 C2 P57303 oash.ReplicationHandler.inform Commits will be reserved for  10000
[junit4:junit4]   2> 16145 T77 C2 P57303 oash.SnapPuller.<init>  No value set for 'pollInterval'. Timer Task not started.
[junit4:junit4]   2> 16148 T45 C1 P33309 REQ /replication {command=indexversion&wt=javabin&qt=/replication&version=2} status=0 QTime=0 
[junit4:junit4]   2> 16154 T77 C2 P57303 oasc.SolrDeletionPolicy.onInit SolrDeletionPolicy.onInit: commits:num=1
[junit4:junit4]   2> 		commit{dir=/usr/home/hudson/hudson-slave/workspace/Lucene-Solr-Tests-4.x-java7/solr/build/solr-core/test/J1/org.apache.solr.cloud.SyncSliceTest-1347951352588/jetty3/index,segFN=segments_1,generation=1,filenames=[segments_1]
[junit4:junit4]   2> 16154 T77 C2 P57303 oasc.SolrDeletionPolicy.updateCommits newest commit = 1
[junit4:junit4]   2> 16156 T77 C2 P57303 oasu.DirectUpdateHandler2.commit start commit{flags=0,_version_=0,optimize=false,openSearcher=true,waitSearcher=true,expungeDeletes=false,softCommit=false}
[junit4:junit4]   2> 16169 T77 C2 P57303 oasc.SolrDeletionPolicy.onCommit SolrDeletionPolicy.onCommit: commits:num=2
[junit4:junit4]   2> 		commit{dir=/usr/home/hudson/hudson-slave/workspace/Lucene-Solr-Tests-4.x-java7/solr/build/solr-core/test/J1/org.apache.solr.cloud.SyncSliceTest-1347951352588/jetty3/index,segFN=segments_1,generation=1,filenames=[segments_1]
[junit4:junit4]   2> 		commit{dir=/usr/home/hudson/hudson-slave/workspace/Lucene-Solr-Tests-4.x-java7/solr/build/solr-core/test/J1/org.apache.solr.cloud.SyncSliceTest-1347951352588/jetty3/index,segFN=segments_2,generation=2,filenames=[segments_2]
[junit4:junit4]   2> 16169 T77 C2 P57303 oasc.SolrDeletionPolicy.updateCommits newest commit = 2
[junit4:junit4]   2> 16172 T77 C2 P57303 oass.SolrIndexSearcher.<init> Opening Searcher@305b17d8 main
[junit4:junit4]   2> 16172 T77 C2 P57303 oasu.DirectUpdateHandler2.commit end_commit_flush
[junit4:junit4]   2> 16177 T76 oasc.SolrCore.registerSearcher [collection1] Registered new searcher Searcher@305b17d8 main{StandardDirectoryReader(segments_2:2)}
[junit4:junit4]   2> 16178 T77 C2 P57303 oasc.RecoveryStrategy.replay No replay needed. core=collection1
[junit4:junit4]   2> 16178 T77 C2 P57303 oasc.RecoveryStrategy.doRecovery Replication Recovery was successful - registering as Active. core=collection1
[junit4:junit4]   2> 16180 T77 C2 P57303 oasc.RecoveryStrategy.doRecovery Finished recovery process. core=collection1
[junit4:junit4]   2> 16231 T36 oascc.ZkStateReader.updateClusterState Updating cloud state from ZooKeeper... 
[junit4:junit4]   2> 16246 T35 oascc.ZkStateReader$2.process A cluster state change has occurred - updating...
[junit4:junit4]   2> 16246 T75 oascc.ZkStateReader$2.process A cluster state change has occurred - updating...
[junit4:junit4]   2> 16246 T89 oascc.ZkStateReader$2.process A cluster state change has occurred - updating...
[junit4:junit4]   2> 16246 T61 oascc.ZkStateReader$2.process A cluster state change has occurred - updating...
[junit4:junit4]   2> 16246 T49 oascc.ZkStateReader$2.process A cluster state change has occurred - updating...
[junit4:junit4]   2> 16246 T94 oascc.ZkStateReader$2.process A cluster state change has occurred - updating...
[junit4:junit4]   2> 17094 T14 oascc.ZkStateReader.updateClusterState Updating cloud state from ZooKeeper... 
[junit4:junit4]   2>  C3_STATE=coll:collection1 core:collection1 props:{shard=shard1, roles=null, state=recovering, core=collection1, collection=collection1, node_name=127.0.0.1:48810_solr, base_url=http://127.0.0.1:48810/solr}
[junit4:junit4]   2> 18063 T91 C3 P48810 oasc.RecoveryStrategy.doRecovery Begin buffering updates. core=collection1
[junit4:junit4]   2> 18063 T91 C3 P48810 oasu.UpdateLog.bufferUpdates Starting to buffer updates. FSUpdateLog{state=ACTIVE, tlog=null}
[junit4:junit4]   2> 18064 T91 C3 P48810 oasc.RecoveryStrategy.replicate Attempting to replicate from http://127.0.0.1:33309/solr/collection1/. core=collection1
[junit4:junit4]   2> 18064 T91 C3 P48810 oascsi.HttpClientUtil.createClient Creating new http client, config:maxConnections=128&maxConnectionsPerHost=32&followRedirects=false
[junit4:junit4]   2> 18078 T41 C1 P33309 oasu.DirectUpdateHandler2.commit start commit{flags=0,_version_=0,optimize=false,openSearcher=true,waitSearcher=true,expungeDeletes=false,softCommit=false}
[junit4:junit4]   2> 18083 T41 C1 P33309 oass.SolrIndexSearcher.<init> Opening Searcher@1b24d310 main
[junit4:junit4]   2> 18084 T41 C1 P33309 oasu.DirectUpdateHandler2.commit end_commit_flush
[junit4:junit4]   2> 18087 T50 oasc.SolrCore.registerSearcher [collection1] Registered new searcher Searcher@1b24d310 main{StandardDirectoryReader(segments_1:1)}
[junit4:junit4]   2> 18088 T41 C1 P33309 /update {waitSearcher=true&commit=true&commit_end_point=true&wt=javabin&softCommit=false&version=2} {commit=} 0 11
[junit4:junit4]   2> 18090 T91 C3 P48810 oash.ReplicationHandler.inform Commits will be reserved for  10000
[junit4:junit4]   2> 18090 T91 C3 P48810 oash.SnapPuller.<init>  No value set for 'pollInterval'. Timer Task not started.
[junit4:junit4]   2> 18094 T45 C1 P33309 REQ /replication {command=indexversion&wt=javabin&qt=/replication&version=2} status=0 QTime=0 
[junit4:junit4]   2> 18096 T14 oascc.ZkStateReader.updateClusterState Updating cloud state from ZooKeeper... 
[junit4:junit4]   2> 18100 T91 C3 P48810 oasc.SolrDeletionPolicy.onInit SolrDeletionPolicy.onInit: commits:num=1
[junit4:junit4]   2> 		commit{dir=/usr/home/hudson/hudson-slave/workspace/Lucene-Solr-Tests-4.x-java7/solr/build/solr-core/test/J1/org.apache.solr.cloud.SyncSliceTest-1347951352588/jetty4/index,segFN=segments_1,generation=1,filenames=[segments_1]
[junit4:junit4]   2> 18101 T91 C3 P48810 oasc.SolrDeletionPolicy.updateCommits newest commit = 1
[junit4:junit4]   2> 18102 T91 C3 P48810 oasu.DirectUpdateHandler2.commit start commit{flags=0,_version_=0,optimize=false,openSearcher=true,waitSearcher=true,expungeDeletes=false,softCommit=false}
[junit4:junit4]   2> 18104 T91 C3 P48810 oasc.SolrDeletionPolicy.onCommit SolrDeletionPolicy.onCommit: commits:num=2
[junit4:junit4]   2> 		commit{dir=/usr/home/hudson/hudson-slave/workspace/Lucene-Solr-Tests-4.x-java7/solr/build/solr-core/test/J1/org.apache.solr.cloud.SyncSliceTest-1347951352588/jetty4/index,segFN=segments_1,generation=1,filenames=[segments_1]
[junit4:junit4]   2> 		commit{dir=/usr/home/hudson/hudson-slave/workspace/Lucene-Solr-Tests-4.x-java7/solr/build/solr-core/test/J1/org.apache.solr.cloud.SyncSliceTest-1347951352588/jetty4/index,segFN=segments_2,generation=2,filenames=[segments_2]
[junit4:junit4]   2> 18105 T91 C3 P48810 oasc.SolrDeletionPolicy.updateCommits newest commit = 2
[junit4:junit4]   2> 18107 T91 C3 P48810 oass.SolrIndexSearcher.<init> Opening Searcher@5258c839 main
[junit4:junit4]   2> 18108 T91 C3 P48810 oasu.DirectUpdateHandler2.commit end_commit_flush
[junit4:junit4]   2> 18114 T90 oasc.SolrCore.registerSearcher [collection1] Registered new searcher Searcher@5258c839 main{StandardDirectoryReader(segments_2:2)}
[junit4:junit4]   2> 18116 T91 C3 P48810 oasc.RecoveryStrategy.replay No replay needed. core=collection1
[junit4:junit4]   2> 18117 T91 C3 P48810 oasc.RecoveryStrategy.doRecovery Replication Recovery was successful - registering as Active. core=collection1
[junit4:junit4]   2> 18119 T91 C3 P48810 oasc.RecoveryStrategy.doRecovery Finished recovery process. core=collection1
[junit4:junit4]   2> 18260 T36 oascc.ZkStateReader.updateClusterState Updating cloud state from ZooKeeper... 
[junit4:junit4]   2> 18280 T35 oascc.ZkStateReader$2.process A cluster state change has occurred - updating...
[junit4:junit4]   2> 18280 T94 oascc.ZkStateReader$2.process A cluster state change has occurred - updating...
[junit4:junit4]   2> 18280 T75 oascc.ZkStateReader$2.process A cluster state change has occurred - updating...
[junit4:junit4]   2> 18280 T89 oascc.ZkStateReader$2.process A cluster state change has occurred - updating...
[junit4:junit4]   2> 18280 T49 oascc.ZkStateReader$2.process A cluster state change has occurred - updating...
[junit4:junit4]   2> 18280 T61 oascc.ZkStateReader$2.process A cluster state change has occurred - updating...
[junit4:junit4]   2> 19100 T14 oascc.ZkStateReader.updateClusterState Updating cloud state from ZooKeeper... 
[junit4:junit4]   2> ASYNC  NEW_CORE C4 name=collection1 org.apache.solr.core.SolrCore@a52f708 url=http://127.0.0.1:17764/solr/collection1 node=127.0.0.1:17764_solr
[junit4:junit4]   2> 19115 T27 C4 P17764 oasu.DirectUpdateHandler2.commit start commit{flags=0,_version_=0,optimize=false,openSearcher=true,waitSearcher=true,expungeDeletes=false,softCommit=false}
[junit4:junit4]   2> 19121 T27 C4 P17764 oasc.SolrDeletionPolicy.onInit SolrDeletionPolicy.onInit: commits:num=1
[junit4:junit4]   2> 		commit{dir=/usr/home/hudson/hudson-slave/workspace/Lucene-Solr-Tests-4.x-java7/solr/build/solr-core/test/J1/org.apache.solr.cloud.SyncSliceTest-1347951352588/control/data/index,segFN=segments_1,generation=1,filenames=[segments_1]
[junit4:junit4]   2> 19122 T27 C4 P17764 oasc.SolrDeletionPolicy.updateCommits newest commit = 1
[junit4:junit4]   2> 19130 T27 C4 P17764 oass.SolrIndexSearcher.<init> Opening Searcher@55e7455d main
[junit4:junit4]   2> 19131 T27 C4 P17764 oasu.DirectUpdateHandler2.commit end_commit_flush
[junit4:junit4]   2> 19136 T38 oasc.SolrCore.registerSearcher [collection1] Registered new searcher Searcher@55e7455d main{StandardDirectoryReader(segments_1:1)}
[junit4:junit4]   2> 19138 T27 C4 P17764 /update {waitSearcher=true&wt=javabin&commit=true&softCommit=false&version=2} {commit=} 0 23
[junit4:junit4]   2> 19139 T14 oaz.ZooKeeper.<init> Initiating client connection, connectString=127.0.0.1:10849/solr sessionTimeout=10000 watcher=org.apache.solr.common.cloud.ConnectionManager@1b7a0d6f
[junit4:junit4]   2> 19141 T95 oaz.ClientCnxn$SendThread.startConnect Opening socket connection to server /127.0.0.1:10849
[junit4:junit4]   2> 19141 T14 oascc.ConnectionManager.waitForConnected Waiting for client to connect to ZooKeeper
[junit4:junit4]   2> 19142 T95 oaz.ClientCnxn$SendThread.primeConnection Socket connection established to localhost/127.0.0.1:10849, initiating session
[junit4:junit4]   2> 19143 T16 oazs.NIOServerCnxn$Factory.run Accepted socket connection from /140.211.11.196:21682
[junit4:junit4]   2> 19144 T16 oazs.NIOServerCnxn.readConnectRequest Client attempting to establish new session at /140.211.11.196:21682
[junit4:junit4]   2> 19171 T18 oazs.NIOServerCnxn.finishSessionInit Established session 0x139d8295c820008 with negotiated timeout 10000 for client /140.211.11.196:21682
[junit4:junit4]   2> 19171 T95 oaz.ClientCnxn$SendThread.readConnectResult Session establishment complete on server localhost/127.0.0.1:10849, sessionid = 0x139d8295c820008, negotiated timeout = 10000
[junit4:junit4]   2> 19172 T96 oascc.ConnectionManager.process Watcher org.apache.solr.common.cloud.ConnectionManager@1b7a0d6f name:ZooKeeperConnection Watcher:127.0.0.1:10849/solr got event WatchedEvent state:SyncConnected type:None path:null path:null type:None
[junit4:junit4]   2> 19172 T14 oascc.ConnectionManager.waitForConnected Client is connected to ZooKeeper
[junit4:junit4]   2> 19174 T14 oascc.ZkStateReader.createClusterStateWatchersAndUpdate Updating cluster state from ZooKeeper... 
[junit4:junit4]   2> 19194 T43 C1 P33309 oasu.DirectUpdateHandler2.commit start commit{flags=0,_version_=0,optimize=false,openSearcher=true,waitSearcher=true,expungeDeletes=false,softCommit=false}
[junit4:junit4]   2> 19198 T43 C1 P33309 oass.SolrIndexSearcher.<init> Opening Searcher@60db07a6 main
[junit4:junit4]   2> 19199 T43 C1 P33309 oasu.DirectUpdateHandler2.commit end_commit_flush
[junit4:junit4]   2> 19203 T50 oasc.SolrCore.registerSearcher [collection1] Registered new searcher Searcher@60db07a6 main{StandardDirectoryReader(segments_1:1)}
[junit4:junit4]   2> 19224 T43 C1 P33309 oasu.SolrCmdDistributor.distribCommit Distrib commit to:[StdNode: http://127.0.0.1:58754/solr/collection1/, StdNode: http://127.0.0.1:57303/solr/collection1/, StdNode: http://127.0.0.1:48810/solr/collection1/]
[junit4:junit4]   2>  C3_STATE=coll:collection1 core:collection1 props:{shard=shard1, roles=null, state=active, core=collection1, collection=collection1, node_name=127.0.0.1:48810_solr, base_url=http://127.0.0.1:48810/solr}
[junit4:junit4]   2> 19249 T81 C3 P48810 oasu.DirectUpdateHandler2.commit start commit{flags=0,_version_=0,optimize=false,openSearcher=true,waitSearcher=true,expungeDeletes=false,softCommit=false}
[junit4:junit4]   2>  C0_STATE=coll:collection1 core:collection1 props:{shard=shard1, roles=null, state=active, core=collection1, collection=collection1, node_name=127.0.0.1:58754_solr, base_url=http://127.0.0.1:58754/solr}
[junit4:junit4]   2> 19252 T53 C0 P58754 oasu.DirectUpdateHandler2.commit start commit{flags=0,_version_=0,optimize=false,openSearcher=true,waitSearcher=true,expungeDeletes=false,softCommit=false}
[junit4:junit4]   2> 19253 T81 C3 P48810 oass.SolrIndexSearcher.<init> Opening Searcher@5f5fe5b9 main
[junit4:junit4]   2> 19254 T81 C3 P48810 oasu.DirectUpdateHandler2.commit end_commit_flush
[junit4:junit4]   2>  C2_STATE=coll:collection1 core:collection1 props:{shard=shard1, roles=null, state=active, core=collection1, collection=collection1, node_name=127.0.0.1:57303_solr, base_url=http://127.0.0.1:57303/solr}
[junit4:junit4]   2> 19254 T67 C2 P57303 oasu.DirectUpdateHandler2.commit start commit{flags=0,_version_=0,optimize=false,openSearcher=true,waitSearcher=true,expungeDeletes=false,softCommit=false}
[junit4:junit4]   2> 19256 T53 C0 P58754 oass.SolrIndexSearcher.<init> Opening Searcher@7f5fe2bf main
[junit4:junit4]   2> 19257 T53 C0 P58754 oasu.DirectUpdateHandler2.commit end_commit_flush
[junit4:junit4]   2> 19290 T67 C2 P57303 oass.SolrIndexSearcher.<init> Opening Searcher@4bd33a89 main
[junit4:junit4]   2> 19290 T90 oasc.SolrCore.registerSearcher [collection1] Registered new searcher Searcher@5f5fe5b9 main{StandardDirectoryReader(segments_2:2)}
[junit4:junit4]   2> 19291 T62 oasc.SolrCore.registerSearcher [collection1] Registered new searcher Searcher@7f5fe2bf main{StandardDirectoryReader(segments_2:2)}
[junit4:junit4]   2> 19291 T67 C2 P57303 oasu.DirectUpdateHandler2.commit end_commit_flush
[junit4:junit4]   2> 19292 T81 C3 P48810 /update {waitSearcher=true&commit=true&wt=javabin&commit_end_point=true&expungeDeletes=false&softCommit=false&version=2} {commit=} 0 43
[junit4:junit4]   2> 19292 T53 C0 P58754 /update {waitSearcher=true&commit=true&wt=javabin&commit_end_point=true&expungeDeletes=false&softCommit=false&version=2} {commit=} 0 40
[junit4:junit4]   2> 19294 T76 oasc.SolrCore.registerSearcher [collection1] Registered new searcher Searcher@4bd33a89 main{StandardDirectoryReader(segments_2:2)}
[junit4:junit4]   2> 19295 T67 C2 P57303 /update {waitSearcher=true&commit=true&wt=javabin&commit_end_point=true&expungeDeletes=false&softCommit=false&version=2} {commit=} 0 41
[junit4:junit4]   2> 19296 T43 C1 P33309 /update {waitSearcher=true&wt=javabin&commit=true&softCommit=false&version=2} {commit=} 0 102
[junit4:junit4]   2> 19298 T14 oascc.ZkStateReader.updateClusterState Updating cloud state from ZooKeeper... 
[junit4:junit4]   2> 19569 T44 C1 P33309 REQ /select {distrib=false&wt=javabin&q=*:*&version=2} hits=0 status=0 QTime=251 
[junit4:junit4]   2> 19580 T54 C0 P58754 REQ /select {distrib=false&wt=javabin&q=*:*&version=2} hits=0 status=0 QTime=1 
[junit4:junit4]   2> 19583 T68 C2 P57303 REQ /select {distrib=false&wt=javabin&q=*:*&version=2} hits=0 status=0 QTime=0 
[junit4:junit4]   2> 19587 T82 C3 P48810 REQ /select {distrib=false&wt=javabin&q=*:*&version=2} hits=0 status=0 QTime=1 
[junit4:junit4]   2> 21961 T27 C4 P17764 oass.SolrIndexSearcher.<init> Opening Searcher@1a5c786a realtime
[junit4:junit4]   2> 21964 T27 C4 P17764 /update {wt=javabin&version=2} {deleteByQuery=*:* (-1413429460438351872)} 0 323
[junit4:junit4]   2> 21970 T43 C1 P33309 oass.SolrIndexSearcher.<init> Opening Searcher@5bd9e937 realtime
[junit4:junit4]   2> 21981 T81 C3 P48810 oass.SolrIndexSearcher.<init> Opening Searcher@5a99b50a realtime
[junit4:junit4]   2> 21981 T67 C2 P57303 oass.SolrIndexSearcher.<init> Opening Searcher@4342dc7d realtime
[junit4:junit4]   2> 21981 T53 C0 P58754 oass.SolrIndexSearcher.<init> Opening Searcher@5a99b50a realtime
[junit4:junit4]   2> 21982 T67 C2 P57303 REQ /update {update.distrib=FROMLEADER&_version_=-1413429460515946496&update.from=http://127.0.0.1:33309/solr/collection1/&wt=javabin&version=2} status=0 QTime=3 
[junit4:junit4]   2> 21982 T81 C3 P48810 REQ /update {update.distrib=FROMLEADER&_version_=-1413429460515946496&update.from=http://127.0.0.1:33309/solr/collection1/&wt=javabin&version=2} status=0 QTime=3 
[junit4:junit4]   2> 21983 T53 C0 P58754 REQ /update {update.distrib=FROMLEADER&_version_=-1413429460515946496&update.from=http://127.0.0.1:33309/solr/collection1/&wt=javabin&version=2} status=0 QTime=4 
[junit4:junit4]   2> 21984 T43 C1 P33309 /update {wt=javabin&version=2} {deleteByQuery=*:* (-1413429460515946496)} 0 16
[junit4:junit4]   2> 22318 T27 C4 P17764 /update {wt=javabin&version=2} {add=[0 (1413429460553695232)]} 0 324
[junit4:junit4]   2> 22345 T67 C2 P57303 REQ /update {distrib.from=http://127.0.0.1:33309/solr/collection1/&update.distrib=FROMLEADER&wt=javabin&version=2} status=0 QTime=6 
[junit4:junit4]   2> 22345 T53 C0 P58754 REQ /update {distrib.from=http://127.0.0.1:33309/solr/collection1/&update.distrib=FROMLEADER&wt=javabin&version=2} status=0 QTime=7 
[junit4:junit4]   2> 22345 T81 C3 P48810 REQ /update {distrib.from=http://127.0.0.1:33309/solr/collection1/&update.distrib=FROMLEADER&wt=javabin&version=2} status=0 QTime=7 
[junit4:junit4]   2> 22346 T43 C1 P33309 /update {wt=javabin&version=2} {add=[0 (1413429460886093824)]} 0 25
[junit4:junit4]   2> 22352 T27 C4 P17764 /update {wt=javabin&version=2} {add=[1 (1413429460915453952)]} 0 3
[junit4:junit4]   2> 22363 T67 C2 P57303 REQ /update {distrib.from=http://127.0.0.1:33309/solr/collection1/&update.distrib=FROMLEADER&wt=javabin&version=2} status=0 QTime=3 
[junit4:junit4]   2> 22363 T53 C0 P58754 REQ /update {distrib.from=http://127.0.0.1:33309/solr/collection1/&update.distrib=FROMLEADER&wt=javabin&version=2} status=0 QTime=3 
[junit4:junit4]   2> 22363 T81 C3 P48810 REQ /update {distrib.from=http://127.0.0.1:33309/solr/collection1/&update.distrib=FROMLEADER&wt=javabin&version=2} status=0 QTime=2 
[junit4:junit4]   2> 22364 T43 C1 P33309 /update {wt=javabin&version=2} {add=[1 (1413429460921745408)]} 0 9
[junit4:junit4]   2> 22370 T27 C4 P17764 /update {wt=javabin&version=2} {add=[2 (1413429460934328320)]} 0 3
[junit4:junit4]   2> 22383 T81 C3 P48810 REQ /update {distrib.from=http://127.0.0.1:33309/solr/collection1/&update.distrib=FROMLEADER&test.distrib.skip.servers=http://127.0.0.1:58754/solr/collection1/&wt=javabin&version=2} status=0 QTime=3 
[junit4:junit4]   2> 22384 T67 C2 P57303 REQ /update {distrib.from=http://127.0.0.1:33309/solr/collection1/&update.distrib=FROMLEADER&test.distrib.skip.servers=http://127.0.0.1:58754/solr/collection1/&wt=javabin&version=2} status=0 QTime=4 
[junit4:junit4]   2> 22385 T43 C1 P33309 /update {test.distrib.skip.servers=http://127.0.0.1:58754/solr/collection1/&wt=javabin&version=2} {add=[2 (1413429460940619776)]} 0 12
[junit4:junit4]   2> 22391 T27 C4 P17764 /update {wt=javabin&version=2} {add=[3 (1413429460956348416)]} 0 3
[junit4:junit4]   2> 22406 T81 C3 P48810 REQ /update {distrib.from=http://127.0.0.1:33309/solr/collection1/&update.distrib=FROMLEADER&test.distrib.skip.servers=http://127.0.0.1:58754/solr/collection1/&test.distrib.skip.servers=http://127.0.0.1:57303/solr/collection1/&wt=javabin&version=2} status=0 QTime=3 
[junit4:junit4]   2> 22407 T43 C1 P33309 /update {test.distrib.skip.servers=http://127.0.0.1:58754/solr/collection1/&test.distrib.skip.servers=http://127.0.0.1:57303/solr/collection1/&wt=javabin&version=2} {add=[3 (1413429460963688448)]} 0 11
[junit4:junit4]   2> 22411 T27 C4 P17764 oasu.DirectUpdateHandler2.commit start commit{flags=0,_version_=0,optimize=false,openSearcher=true,waitSearcher=true,expungeDeletes=false,softCommit=false}
[junit4:junit4]   2> 22610 T27 C4 P17764 oasc.SolrDeletionPolicy.onCommit SolrDeletionPolicy.onCommit: commits:num=2
[junit4:junit4]   2> 		commit{dir=/usr/home/hudson/hudson-slave/workspace/Lucene-Solr-Tests-4.x-java7/solr/build/solr-core/test/J1/org.apache.solr.cloud.SyncSliceTest-1347951352588/control/data/index,segFN=segments_1,generation=1,filenames=[segments_1]
[junit4:junit4]   2> 		commit{dir=/usr/home/hudson/hudson-slave/workspace/Lucene-Solr-Tests-4.x-java7/solr/build/solr-core/test/J1/org.apache.solr.cloud.SyncSliceTest-1347951352588/control/data/index,segFN=segments_2,generation=2,filenames=[_0.fnm, _0.frq, _0.tim, _0_nrm.cfe, segments_2, _0.fdx, _0_nrm.cfs, _0.si, _0.prx, _0.tip, _0.fdt]
[junit4:junit4]   2> 22611 T27 C4 P17764 oasc.SolrDeletionPolicy.updateCommits newest commit = 2
[junit4:junit4]   2> 22738 T27 C4 P17764 oass.SolrIndexSearcher.<init> Opening Searcher@288ef68c main
[junit4:junit4]   2> 22739 T27 C4 P17764 oasu.DirectUpdateHandler2.commit end_commit_flush
[junit4:junit4]   2> 22742 T38 oasc.SolrCore.registerSearcher [collection1] Registered new searcher Searcher@288ef68c main{StandardDirectoryReader(segments_2:3:nrt _0(4.0.0.2):C4)}
[junit4:junit4]   2> 22742 T27 C4 P17764 /update {waitSearcher=true&wt=javabin&commit=true&softCommit=false&version=2} {commit=} 0 331
[junit4:junit4]   2> 22747 T43 C1 P33309 oasu.DirectUpdateHandler2.commit start commit{flags=0,_version_=0,optimize=false,openSearcher=true,waitSearcher=true,expungeDeletes=false,softCommit=false}
[junit4:junit4]   2> 22805 T43 C1 P33309 oasc.SolrDeletionPolicy.onCommit SolrDeletionPolicy.onCommit: commits:num=2
[junit4:junit4]   2> 		commit{dir=/usr/home/hudson/hudson-slave/workspace/Lucene-Solr-Tests-4.x-java7/solr/build/solr-core/test/J1/org.apache.solr.cloud.SyncSliceTest-1347951352588/jetty1/index,segFN=segments_1,generation=1,filenames=[segments_1]
[junit4:junit4]   2> 		commit{dir=/usr/home/hudson/hudson-slave/workspace/Lucene-Solr-Tests-4.x-java7/solr/build/solr-core/test/J1/org.apache.solr.cloud.SyncSliceTest-1347951352588/jetty1/index,segFN=segments_2,generation=2,filenames=[_0.fnm, _0.frq, _0.tim, _0_nrm.cfe, segments_2, _0.fdx, _0_nrm.cfs, _0.si, _0.prx, _0.tip, _0.fdt]
[junit4:junit4]   2> 22806 T43 C1 P33309 oasc.SolrDeletionPolicy.updateCommits newest commit = 2
[junit4:junit4]   2> 22812 T43 C1 P33309 oass.SolrIndexSearcher.<init> Opening Searcher@3794d72e main
[junit4:junit4]   2> 22813 T43 C1 P33309 oasu.DirectUpdateHandler2.commit end_commit_flush
[junit4:junit4]   2> 22841 T50 oasc.SolrCore.registerSearcher [collection1] Registered new searcher Searcher@3794d72e main{StandardDirectoryReader(segments_2:3:nrt _0(4.0.0.2):C4)}
[junit4:junit4]   2> 22842 T43 C1 P33309 oasu.SolrCmdDistributor.distribCommit Distrib commit to:[StdNode: http://127.0.0.1:58754/solr/collection1/, StdNode: http://127.0.0.1:57303/solr/collection1/, StdNode: http://127.0.0.1:48810/solr/collection1/]
[junit4:junit4]   2> 22846 T67 C2 P57303 oasu.DirectUpdateHandler2.commit start commit{flags=0,_version_=0,optimize=false,openSearcher=true,waitSearcher=true,expungeDeletes=false,softCommit=false}
[junit4:junit4]   2> 22846 T81 C3 P48810 oasu.DirectUpdateHandler2.commit start commit{flags=0,_version_=0,optimize=false,openSearcher=true,waitSearcher=true,expungeDeletes=false,softCommit=false}
[junit4:junit4]   2> 22846 T53 C0 P58754 oasu.DirectUpdateHandler2.commit start commit{flags=0,_version_=0,optimize=false,openSearcher=true,waitSearcher=true,expungeDeletes=false,softCommit=false}
[junit4:junit4]   2> 22900 T67 C2 P57303 oasc.SolrDeletionPolicy.onCommit SolrDeletionPolicy.onCommit: commits:num=2
[junit4:junit4]   2> 		commit{dir=/usr/home/hudson/hudson-slave/workspace/Lucene-Solr-Tests-4.x-java7/solr/build/solr-core/test/J1/org.apache.solr.cloud.SyncSliceTest-1347951352588/jetty3/index,segFN=segments_2,generation=2,filenames=[segments_2]
[junit4:junit4]   2> 		commit{dir=/usr/home/hudson/hudson-slave/workspace/Lucene-Solr-Tests-4.x-java7/solr/build/solr-core/test/J1/org.apache.solr.cloud.SyncSliceTest-1347951352588/jetty3/index,segFN=segments_3,generation=3,filenames=[_0.fnm, _0.frq, _0.tim, _0_nrm.cfe, _0.fdx, _0_nrm.cfs, _0.si, _0.prx, _0.tip, _0.fdt, segments_3]
[junit4:junit4]   2> 22901 T67 C2 P57303 oasc.SolrDeletionPolicy.updateCommits newest commit = 3
[junit4:junit4]   2> 22907 T67 C2 P57303 oass.SolrIndexSearcher.<init> Opening Searcher@1c7d7259 main
[junit4:junit4]   2> 22908 T67 C2 P57303 oasu.DirectUpdateHandler2.commit end_commit_flush
[junit4:junit4]   2> 22910 T81 C3 P48810 oasc.SolrDeletionPolicy.onCommit SolrDeletionPolicy.onCommit: commits:num=2
[junit4:junit4]   2> 		commit{dir=/usr/home/hudson/hudson-slave/workspace/Lucene-Solr-Tests-4.x-java7/solr/build/solr-core/test/J1/org.apache.solr.cloud.SyncSliceTest-1347951352588/jetty4/index,segFN=segments_2,generation=2,filenames=[segments_2]
[junit4:junit4]   2> 		commit{dir=/usr/home/hudson/hudson-slave/workspace/Lucene-Solr-Tests-4.x-java7/solr/build/solr-core/test/J1/org.apache.solr.cloud.SyncSliceTest-1347951352588/jetty4/index,segFN=segments_3,generation=3,filenames=[_0.fnm, _0.frq, _0.tim, _0_nrm.cfe, _0.fdx, _0_nrm.cfs, _0.si, _0.prx, _0.tip, _0.fdt, segments_3]
[junit4:junit4]   2> 22910 T53 C0 P58754 oasc.SolrDeletionPolicy.onCommit SolrDeletionPolicy.onCommit: commits:num=2
[junit4:junit4]   2> 		commit{dir=/usr/home/hudson/hudson-slave/workspace/Lucene-Solr-Tests-4.x-java7/solr/build/solr-core/test/J1/org.apache.solr.cloud.SyncSliceTest-1347951352588/jetty2/index,segFN=segments_2,generation=2,filenames=[segments_2]
[junit4:junit4]   2> 		commit{dir=/usr/home/hudson/hudson-slave/workspace/Lucene-Solr-Tests-4.x-java7/solr/build/solr-core/test/J1/org.apache.solr.cloud.SyncSliceTest-1347951352588/jetty2/index,segFN=segments_3,generation=3,filenames=[_0.fnm, _0.frq, _0.tim, _0_nrm.cfe, _0.fdx, _0_nrm.cfs, _0.si, _0.prx, _0.tip, _0.fdt, segments_3]
[junit4:junit4]   2> 22911 T76 oasc.SolrCore.registerSearcher [collection1] Registered new searcher Searcher@1c7d7259 main{StandardDirectoryReader(segments_3:4:nrt _0(4.0.0.2):C3)}
[junit4:junit4]   2> 22911 T53 C0 P58754 oasc.SolrDeletionPolicy.updateCommits newest commit = 3
[junit4:junit4]   2> 22912 T81 C3 P48810 oasc.SolrDeletionPolicy.updateCommits newest commit = 3
[junit4:junit4]   2> 22912 T67 C2 P57303 /update {waitSearcher=true&commit=true&wt=javabin&commit_end_point=true&expungeDeletes=false&softCommit=false&version=2} {commit=} 0 66
[junit4:junit4]   2> 22920 T81 C3 P48810 oass.SolrIndexSearcher.<init> Opening Searcher@7070d8c9 main
[junit4:junit4]   2> 22920 T53 C0 P58754 oass.SolrIndexSearcher.<init> Opening Searcher@7259f725 main
[junit4:junit4]   2> 22921 T81 C3 P48810 oasu.DirectUpdateHandler2.commit end_commit_flush
[junit4:junit4]   2> 22922 T53 C0 P58754 oasu.DirectUpdateHandler2.commit end_commit_flush
[junit4:junit4]   2> 22922 T62 oasc.JmxMonitoredMap.put WARNING Failed to register info bean: searcher javax.management.InstanceNotFoundException: solr/collection1:type=searcher,id=org.apache.solr.search.SolrIndexSearcher
[junit4:junit4]   2> 	at com.sun.jmx.interceptor.DefaultMBeanServerInterceptor.getMBean(DefaultMBeanServerInterceptor.java:1095)
[junit4:junit4]   2> 	at com.sun.jmx.interceptor.DefaultMBeanServerInterceptor.exclusiveUnregisterMBean(DefaultMBeanServerInterceptor.java:427)
[junit4:junit4]   2> 	at com.sun.jmx.interceptor.DefaultMBeanServerInterceptor.unregisterMBean(DefaultMBeanServerInterceptor.java:415)
[junit4:junit4]   2> 	at com.sun.jmx.mbeanserver.JmxMBeanServer.unregisterMBean(JmxMBeanServer.java:536)
[junit4:junit4]   2> 	at org.apache.solr.core.JmxMonitoredMap.put(JmxMonitoredMap.java:138)
[junit4:junit4]   2> 	at org.apache.solr.core.JmxMonitoredMap.put(JmxMonitoredMap.java:51)
[junit4:junit4]   2> 	at org.apache.solr.search.SolrIndexSearcher.register(SolrIndexSearcher.java:242)
[junit4:junit4]   2> 	at org.apache.solr.core.SolrCore.registerSearcher(SolrCore.java:1642)
[junit4:junit4]   2> 	at org.apache.solr.core.SolrCore.access$000(SolrCore.java:121)
[junit4:junit4]   2> 	at org.apache.solr.core.SolrCore$7.call(SolrCore.java:1519)
[junit4:junit4]   2> 	at java.util.concurrent.FutureTask$Sync.innerRun(FutureTask.java:334)
[junit4:junit4]   2> 	at java.util.concurrent.FutureTask.run(FutureTask.java:166)
[junit4:junit4]   2> 	at java.util.concurrent.ThreadPoolExecutor.runWorker(ThreadPoolExecutor.java:1110)
[junit4:junit4]   2> 	at java.util.concurrent.ThreadPoolExecutor$Worker.run(ThreadPoolExecutor.java:603)
[junit4:junit4]   2> 	at java.lang.Thread.run(Thread.java:722)
[junit4:junit4]   2> 
[junit4:junit4]   2> 22925 T90 oasc.SolrCore.registerSearcher [collection1] Registered new searcher Searcher@7070d8c9 main{StandardDirectoryReader(segments_3:4:nrt _0(4.0.0.2):C4)}
[junit4:junit4]   2> 22926 T62 oasc.SolrCore.registerSearcher [collection1] Registered new searcher Searcher@7259f725 main{StandardDirectoryReader(segments_3:4:nrt _0(4.0.0.2):C2)}
[junit4:junit4]   2> 22927 T81 C3 P48810 /update {waitSearcher=true&commit=true&wt=javabin&commit_end_point=true&expungeDeletes=false&softCommit=false&version=2} {commit=} 0 81
[junit4:junit4]   2> 22927 T53 C0 P58754 /update {waitSearcher=true&commit=true&wt=javabin&commit_end_point=true&expungeDeletes=false&softCommit=false&version=2} {commit=} 0 81
[junit4:junit4]   2> 22928 T43 C1 P33309 /update {waitSearcher=true&wt=javabin&commit=true&softCommit=false&version=2} {commit=} 0 181
[junit4:junit4]   2> 22929 T14 oasc.AbstractDistribZkTestBase.waitForRecoveriesToFinish Wait for recoveries to finish - collection: collection1 failOnTimeout:true timeout (sec):1800
[junit4:junit4]   2> 22930 T14 oascc.ZkStateReader.updateClusterState Updating cloud state from ZooKeeper... 
[junit4:junit4]   2> check const of shard1
[junit4:junit4]   2> client0
[junit4:junit4]   2> PROPS:shard=shard1
[junit4:junit4]   2> roles=null
[junit4:junit4]   2> leader=true
[junit4:junit4]   2> state=active
[junit4:junit4]   2> core=collection1
[junit4:junit4]   2> collection=collection1
[junit4:junit4]   2> node_name=127.0.0.1:33309_solr
[junit4:junit4]   2> base_url=http://127.0.0.1:33309/solr
[junit4:junit4]   2> 
[junit4:junit4]   2> 22935 T44 C1 P33309 REQ /select {distrib=false&wt=javabin&q=*:*&version=2} hits=4 status=0 QTime=1 
[junit4:junit4]   2>  live:true
[junit4:junit4]   2>  num:4
[junit4:junit4]   2> 
[junit4:junit4]   2> client1
[junit4:junit4]   2> PROPS:shard=shard1
[junit4:junit4]   2> roles=null
[junit4:junit4]   2> state=active
[junit4:junit4]   2> core=collection1
[junit4:junit4]   2> collection=collection1
[junit4:junit4]   2> node_name=127.0.0.1:58754_solr
[junit4:junit4]   2> base_url=http://127.0.0.1:58754/solr
[junit4:junit4]   2> 
[junit4:junit4]   2> 22958 T54 C0 P58754 REQ /select {distrib=false&wt=javabin&q=*:*&version=2} hits=2 status=0 QTime=1 
[junit4:junit4]   2>  live:true
[junit4:junit4]   2>  num:2
[junit4:junit4]   2> 
[junit4:junit4]   2> ######shard1 is not consistent.  Got 4 from http://127.0.0.1:33309/solr/collection1lastClient and got 2 from http://127.0.0.1:58754/solr/collection1
[junit4:junit4]   2> 23135 T44 C1 P33309 REQ /select {fl=id,_version_&sort=id+asc&q=*:*&distrib=false&wt=javabin&rows=1000&version=2} hits=4 status=0 QTime=173 
[junit4:junit4]   2> 23140 T54 C0 P58754 REQ /select {fl=id,_version_&sort=id+asc&q=*:*&distrib=false&wt=javabin&rows=1000&version=2} hits=2 status=0 QTime=2 
[junit4:junit4]   2> ######http://127.0.0.1:33309/solr/collection1: {numFound=4,start=0,docs=[SolrDocument{id=0, _version_=1413429460886093824}, SolrDocument{id=1, _version_=1413429460921745408}, SolrDocument{id=2, _version_=1413429460940619776}, SolrDocument{id=3, _version_=1413429460963688448}]}
[junit4:junit4]   2> ######http://127.0.0.1:58754/solr/collection1: {numFound=2,start=0,docs=[SolrDocument{id=0, _version_=1413429460886093824}, SolrDocument{id=1, _version_=1413429460921745408}]}
[junit4:junit4]   2> ###### sizes=4,2
[junit4:junit4]   2> ###### Only in http://127.0.0.1:33309/solr/collection1: [{id=3, _version_=1413429460963688448}, {id=2, _version_=1413429460940619776}]
[junit4:junit4]   2> client2
[junit4:junit4]   2> PROPS:shard=shard1
[junit4:junit4]   2> roles=null
[junit4:junit4]   2> state=active
[junit4:junit4]   2> core=collection1
[junit4:junit4]   2> collection=collection1
[junit4:junit4]   2> node_name=127.0.0.1:57303_solr
[junit4:junit4]   2> base_url=http://127.0.0.1:57303/solr
[junit4:junit4]   2> 
[junit4:junit4]   2> 23144 T68 C2 P57303 REQ /select {distrib=false&wt=javabin&q=*:*&version=2} hits=3 status=0 QTime=1 
[junit4:junit4]   2>  live:true
[junit4:junit4]   2>  num:3
[junit4:junit4]   2> 
[junit4:junit4]   2> client3
[junit4:junit4]   2> PROPS:shard=shard1
[junit4:junit4]   2> roles=null
[junit4:junit4]   2> state=active
[junit4:junit4]   2> core=collection1
[junit4:junit4]   2> collection=collection1
[junit4:junit4]   2> node_name=127.0.0.1:48810_solr
[junit4:junit4]   2> base_url=http://127.0.0.1:48810/solr
[junit4:junit4]   2> 
[junit4:junit4]   2> 23150 T82 C3 P48810 REQ /select {distrib=false&wt=javabin&q=*:*&version=2} hits=4 status=0 QTime=1 
[junit4:junit4]   2>  live:true
[junit4:junit4]   2>  num:4
[junit4:junit4]   2> 
[junit4:junit4]   2> 23157 T14 oascsi.HttpClientUtil.createClient Creating new http client, config:maxConnections=128&maxConnectionsPerHost=32&followRedirects=false
[junit4:junit4]   2> 23177 T69 oasha.CollectionsHandler.handleSyncShardAction Syncing shard : action=SYNCSHARD&collection=collection1&shard=shard1&wt=javabin&version=2
[junit4:junit4]   2> 23178 T69 oascsi.HttpClientUtil.createClient Creating new http client, config:maxConnections=128&maxConnectionsPerHost=32&followRedirects=false
[junit4:junit4]   2> 23188 T46 oasha.CoreAdminHandler.handleRequestSyncAction I have been requested to sync up my shard
[junit4:junit4]   2> 23189 T46 oasc.SyncStrategy.sync Sync replicas to http://127.0.0.1:33309/solr/collection1/
[junit4:junit4]   2> 23189 T46 oasu.PeerSync.sync PeerSync: core=collection1 url=http://127.0.0.1:33309/solr START replicas=[http://127.0.0.1:58754/solr/collection1/, http://127.0.0.1:57303/solr/collection1/, http://127.0.0.1:48810/solr/collection1/] nUpdates=100
[junit4:junit4]   2> 23201 T83 C3 P48810 REQ /get {distrib=false&qt=/get&wt=javabin&version=2&getVersions=100} status=0 QTime=8 
[junit4:junit4]   2> 23201 T55 C0 P58754 REQ /get {distrib=false&qt=/get&wt=javabin&version=2&getVersions=100} status=0 QTime=7 
[junit4:junit4]   2> 23201 T70 C2 P57303 REQ /get {distrib=false&qt=/get&wt=javabin&version=2&getVersions=100} status=0 QTime=8 
[junit4:junit4]   2> 23202 T46 oasu.PeerSync.handleVersions PeerSync: core=collection1 url=http://127.0.0.1:33309/solr  Received 3 versions from 127.0.0.1:58754/solr/collection1/
[junit4:junit4]   2> 23202 T46 oasu.PeerSync.handleVersions PeerSync: core=collection1 url=http://127.0.0.1:33309/solr  Our versions are newer. ourLowThreshold=1413429460515946496 otherHigh=1413429460921745408
[junit4:junit4]   2> 23203 T46 oasu.PeerSync.handleVersions PeerSync: core=collection1 url=http://127.0.0.1:33309/solr  Received 5 versions from 127.0.0.1:48810/solr/collection1/
[junit4:junit4]   2> 23203 T46 oasu.PeerSync.handleVersions PeerSync: core=collection1 url=http://127.0.0.1:33309/solr  Our versions are newer. ourLowThreshold=1413429460515946496 otherHigh=1413429460940619776
[junit4:junit4]   2> 23203 T46 oasu.PeerSync.handleVersions PeerSync: core=collection1 url=http://127.0.0.1:33309/solr  Received 4 versions from 127.0.0.1:57303/solr/collection1/
[junit4:junit4]   2> 23204 T46 oasu.PeerSync.handleVersions PeerSync: core=collection1 url=http://127.0.0.1:33309/solr  Our versions are newer. ourLowThreshold=1413429460515946496 otherHigh=1413429460940619776
[junit4:junit4]   2> 23204 T46 oasu.PeerSync.sync PeerSync: core=collection1 url=http://127.0.0.1:33309/solr DONE. sync succeeded
[junit4:junit4]   2> 23205 T46 oasc.SyncStrategy.syncReplicas Sync Success - now sync replicas to me
[junit4:junit4]   2> 23205 T46 oasc.SyncStrategy.syncToMe http://127.0.0.1:33309/solr/collection1/: try and ask http://127.0.0.1:58754/solr/collection1/ to sync
[junit4:junit4]   2> 23206 T46 oasc.SyncStrategy.syncToMe http://127.0.0.1:33309/solr/collection1/: try and ask http://127.0.0.1:57303/solr/collection1/ to sync
[junit4:junit4]   2> 23207 T46 oasc.SyncStrategy.syncToMe http://127.0.0.1:33309/solr/collection1/: try and ask http://127.0.0.1:48810/solr/collection1/ to sync
[junit4:junit4]   2> 23209 T56 C0 P58754 oasu.PeerSync.sync PeerSync: core=collection1 url=http://127.0.0.1:58754/solr START replicas=[http://127.0.0.1:33309/solr/collection1/] nUpdates=100
[junit4:junit4]   2> 23210 T71 C2 P57303 oasu.PeerSync.sync PeerSync: core=collection1 url=http://127.0.0.1:57303/solr START replicas=[http://127.0.0.1:33309/solr/collection1/] nUpdates=100
[junit4:junit4]   2> 23210 T84 C3 P48810 oasu.PeerSync.sync PeerSync: core=collection1 url=http://127.0.0.1:48810/solr START replicas=[http://127.0.0.1:33309/solr/collection1/] nUpdates=100
[junit4:junit4]   2> 23213 T47 C1 P33309 REQ /get {distrib=false&qt=/get&wt=javabin&version=2&getVersions=100} status=0 QTime=1 
[junit4:junit4]   2> 23213 T41 C1 P33309 REQ /get {distrib=false&qt=/get&wt=javabin&version=2&getVersions=100} status=0 QTime=0 
[junit4:junit4]   2> 23213 T42 C1 P33309 REQ /get {distrib=false&qt=/get&wt=javabin&version=2&getVersions=100} status=0 QTime=0 
[junit4:junit4]   2> 23214 T71 C2 P57303 oasu.PeerSync.handleVersions PeerSync: core=collection1 url=http://127.0.0.1:57303/solr  Received 5 versions from 127.0.0.1:33309/solr/collection1/
[junit4:junit4]   2> 23214 T84 C3 P48810 oasu.PeerSync.handleVersions PeerSync: core=collection1 url=http://127.0.0.1:48810/solr  Received 5 versions from 127.0.0.1:33309/solr/collection1/
[junit4:junit4]   2> 23214 T71 C2 P57303 oasu.PeerSync.requestUpdates PeerSync: core=collection1 url=http://127.0.0.1:57303/solr Requesting updates from 127.0.0.1:33309/solr/collection1/n=1 versions=[1413429460963688448]
[junit4:junit4]   2> 23214 T56 C0 P58754 oasu.PeerSync.handleVersions PeerSync: core=collection1 url=http://127.0.0.1:58754/solr  Received 5 versions from 127.0.0.1:33309/solr/collection1/
[junit4:junit4]   2> 23215 T84 C3 P48810 oasu.PeerSync.handleVersions PeerSync: core=collection1 url=http://127.0.0.1:48810/solr  Our versions are newer. ourLowThreshold=1413429460515946496 otherHigh=1413429460940619776
[junit4:junit4]   2> 23215 T56 C0 P58754 oasu.PeerSync.requestUpdates PeerSync: core=collection1 url=http://127.0.0.1:58754/solr Requesting updates from 127.0.0.1:33309/solr/collection1/n=2 versions=[1413429460963688448, 1413429460940619776]
[junit4:junit4]   2> 23215 T84 C3 P48810 oasu.PeerSync.sync PeerSync: core=collection1 url=http://127.0.0.1:48810/solr DONE. sync succeeded
[junit4:junit4]   2> 23216 T84 C3 P48810 REQ /get {sync=http://127.0.0.1:33309/solr/collection1/&getVersions=100&distrib=false&qt=/get&wt=javabin&version=2} status=0 QTime=6 
[junit4:junit4]   2> 23217 T46 oasc.SyncStrategy.syncToMe http://127.0.0.1:33309/solr/collection1/:  sync completed with http://127.0.0.1:48810/solr/collection1/
[junit4:junit4]   2> 23218 T42 C1 P33309 REQ /get {distrib=false&getUpdates=1413429460963688448&qt=/get&wt=javabin&version=2} status=0 QTime=0 
[junit4:junit4]   2> 23219 T41 C1 P33309 REQ /get {distrib=false&getUpdates=1413429460963688448,1413429460940619776&qt=/get&wt=javabin&version=2} status=0 QTime=1 
[junit4:junit4]   2> 23229 T71 C2 P57303 oasu.PeerSync.sync PeerSync: core=collection1 url=http://127.0.0.1:57303/solr DONE. sync succeeded
[junit4:junit4]   2> 23230 T71 C2 P57303 REQ /get {sync=http://127.0.0.1:33309/solr/collection1/&getVersions=100&distrib=false&qt=/get&wt=javabin&version=2} status=0 QTime=20 
[junit4:junit4]   2> 23231 T46 oasc.SyncStrategy.syncToMe http://127.0.0.1:33309/solr/collection1/:  sync completed with http://127.0.0.1:57303/solr/collection1/
[junit4:junit4]   2> 23232 T56 C0 P58754 oasu.PeerSync.sync PeerSync: core=collection1 url=http://127.0.0.1:58754/solr DONE. sync succeeded
[junit4:junit4]   2> 23232 T56 C0 P58754 REQ /get {sync=http://127.0.0.1:33309/solr/collection1/&getVersions=100&distrib=false&qt=/get&wt=javabin&version=2} status=0 QTime=23 
[junit4:junit4]   2> 23233 T46 oasc.SyncStrategy.syncToMe http://127.0.0.1:33309/solr/collection1/:  sync completed with http://127.0.0.1:58754/solr/collection1/
[junit4:junit4]   2> 23234 T14 oasc.AbstractFullDistribZkTestBase.waitForThingsToLevelOut Wait for recoveries to finish - wait 15 for each attempt
[junit4:junit4]   2> 23234 T14 oasc.AbstractDistribZkTestBase.waitForRecoveriesToFinish Wait for recoveries to finish - collection: collection1 failOnTimeout:true timeout (sec):15
[junit4:junit4]   2> 23236 T14 oascc.ZkStateReader.updateClusterState Updating cloud state from ZooKeeper... 
[junit4:junit4]   2> 23240 T27 C4 P17764 oasu.DirectUpdateHandler2.commit start commit{flags=0,_version_=0,optimize=false,openSearcher=true,waitSearcher=true,expungeDeletes=false,softCommit=false}
[junit4:junit4]   2> 23242 T27 C4 P17764 oass.SolrIndexSearcher.<init> Opening Searcher@1256b347 main
[junit4:junit4]   2> 23242 T27 C4 P17764 oasu.DirectUpdateHandler2.commit end_commit_flush
[junit4:junit4]   2> 23245 T38 oasc.SolrCore.registerSearcher [collection1] Registered new searcher Searcher@1256b347 main{StandardDirectoryReader(segments_2:3:nrt _0(4.0.0.2):C4)}
[junit4:junit4]   2> 23246 T27 C4 P17764 /update {waitSearcher=true&wt=javabin&commit=true&softCommit=false&version=2} {commit=} 0 6
[junit4:junit4]   2> 23250 T43 C1 P33309 oasu.DirectUpdateHandler2.commit start commit{flags=0,_version_=0,optimize=false,openSearcher=true,waitSearcher=true,expungeDeletes=false,softCommit=false}
[junit4:junit4]   2> 23251 T43 C1 P33309 oass.SolrIndexSearcher.<init> Opening Searcher@380063a5 main
[junit4:junit4]   2> 23252 T43 C1 P33309 oasu.DirectUpdateHandler2.commit end_commit_flush
[junit4:junit4]   2> 23256 T50 oasc.SolrCore.registerSearcher [collection1] Registered new searcher Searcher@380063a5 main{StandardDirectoryReader(segments_2:3:nrt _0(4.0.0.2):C4)}
[junit4:junit4]   2> 23257 T43 C1 P33309 oasu.SolrCmdDistributor.distribCommit Distrib commit to:[StdNode: http://127.0.0.1:58754/solr/collection1/, StdNode: http://127.0.0.1:57303/solr/collection1/, StdNode: http://127.0.0.1:48810/solr/collection1/]
[junit4:junit4]   2> 23261 T67 C2 P57303 oasu.DirectUpdateHandler2.commit start commit{flags=0,_version_=0,optimize=false,openSearcher=true,waitSearcher=true,expungeDeletes=false,softCommit=false}
[junit4:junit4]   2> 23261 T81 C3 P48810 oasu.DirectUpdateHandler2.commit start commit{flags=0,_version_=0,optimize=false,openSearcher=true,waitSearcher=true,expungeDeletes=false,softCommit=false}
[junit4:junit4]   2> 23261 T53 C0 P58754 oasu.DirectUpdateHandler2.commit start commit{flags=0,_version_=0,optimize=false,openSearcher=true,waitSearcher=true,expungeDeletes=false,softCommit=false}
[junit4:junit4]   2> 23264 T81 C3 P48810 oass.SolrIndexSearcher.<init> Opening Searcher@48835253 main
[junit4:junit4]   2> 23265 T81 C3 P48810 oasu.DirectUpdateHandler2.commit end_commit_flush
[junit4:junit4]   2> 23269 T90 oasc.SolrCore.registerSearcher [collection1] Registered new searcher Searcher@48835253 main{StandardDirectoryReader(segments_3:4:nrt _0(4.0.0.2):C4)}
[junit4:junit4]   2> 23270 T81 C3 P48810 /update {waitSearcher=true&commit=true&wt=javabin&commit_end_point=true&expungeDeletes=false&softCommit=false&version=2} {commit=} 0 9
[junit4:junit4]   2> 23375 T67 C2 P57303 oasc.SolrDeletionPolicy.onCommit SolrDeletionPolicy.onCommit: commits:num=2
[junit4:junit4]   2> 		commit{dir=/usr/home/hudson/hudson-slave/workspace/Lucene-Solr-Tests-4.x-java7/solr/build/solr-core/test/J1/org.apache.solr.cloud.SyncSliceTest-1347951352588/jetty3/index,segFN=segments_3,generation=3,filenames=[_0.fnm, _0.frq, _0.tim, _0_nrm.cfe, _0.fdx, _0_nrm.cfs, _0.si, _0.prx, _0.tip, _0.fdt, segments_3]
[junit4:junit4]   2> 		commit{dir=/usr/home/hudson/hudson-slave/workspace/Lucene-Solr-Tests-4.x-java7/solr/build/solr-core/test/J1/org.apache.solr.cloud.SyncSliceTest-1347951352588/jetty3/index,segFN=segments_4,generation=4,filenames=[_1_nrm.cfs, _0.fnm, _1.frq, _0_nrm.cfs, _1.fnm, _1_nrm.cfe, _1.fdx, _1.prx, _1.fdt, _1.si, _0_nrm.cfe, _0.tim, _0.frq, _0.fdx, _0.si, _1.tip, _0.tip, _0.prx, _1.tim, _0.fdt, segments_4]
[junit4:junit4]   2> 23376 T67 C2 P57303 oasc.SolrDeletionPolicy.updateCommits newest commit = 4
[junit4:junit4]   2> 23386 T67 C2 P57303 oass.SolrIndexSearcher.<init> Opening Searcher@7345a361 main
[junit4:junit4]   2> 23388 T67 C2 P57303 oasu.DirectUpdateHandler2.commit end_commit_flush
[junit4:junit4]   2> 23391 T76 oasc.SolrCore.registerSearcher [collection1] Registered new searcher Searcher@7345a361 main{StandardDirectoryReader(segments_4:6:nrt _0(4.0.0.2):C3 _1(4.0.0.2):C1)}
[junit4:junit4]   2> 23393 T67 C2 P57303 /update {waitSearcher=true&commit=true&wt=javabin&commit_end_point=true&expungeDeletes=false&softCommit=false&version=2} {commit=} 0 132
[junit4:junit4]   2> 23430 T53 C0 P58754 oasc.SolrDeletionPolicy.onCommit SolrDeletionPolicy.onCommit: commits:num=2
[junit4:junit4]   2> 		commit{dir=/usr/home/hudson/hudson-slave/workspace/Lucene-Solr-Tests-4.x-java7/solr/build/solr-core/test/J1/org.apache.solr.cloud.SyncSliceTest-1347951352588/jetty2/index,segFN=segments_3,generation=3,filenames=[_0.fnm, _0.frq, _0.tim, _0_nrm.cfe, _0.fdx, _0_nrm.cfs, _0.si, _0.prx, _0.tip, _0.fdt, segments_3]
[junit4:junit4]   2> 		commit{dir=/usr/home/hudson/hudson-slave/workspace/Lucene-Solr-Tests-4.x-java7/solr/build/solr-core/test/J1/org.apache.solr.cloud.SyncSliceTest-1347951352588/jetty2/index,segFN=segments_4,generation=4,filenames=[_1_nrm.cfs, _0.fnm, _1.frq, _0_nrm.cfs, _1.fnm, _1_nrm.cfe, _1.fdx, _1.prx, _1.fdt, _1.si, _0_nrm.cfe, _0.tim, _0.frq, _0.fdx, _0.si, _1.tip, _0.tip, _0.prx, _1.tim, _0.fdt, segments_4]
[junit4:junit4]   2> 23431 T53 C0 P58754 oasc.SolrDeletionPolicy.updateCommits newest commit = 4
[junit4:junit4]   2> 23436 T53 C0 P58754 oass.SolrIndexSearcher.<init> Opening Searcher@5398a7a5 main
[junit4:junit4]   2> 23437 T53 C0 P58754 oasu.DirectUpdateHandler2.commit end_commit_flush
[junit4:junit4]   2> 23440 T62 oasc.SolrCore.registerSearcher [collection1] Registered new searcher Searcher@5398a7a5 main{StandardDirectoryReader(segments_4:6:nrt _0(4.0.0.2):C2 _1(4.0.0.2):C2)}
[junit4:junit4]   2> 23441 T53 C0 P58754 /update {waitSearcher=true&commit=true&wt=javabin&commit_end_point=true&expungeDeletes=false&softCommit=false&version=2} {commit=} 0 180
[junit4:junit4]   2> 23442 T43 C1 P33309 /update {waitSearcher=true&wt=javabin&commit=true&softCommit=false&version=2} {commit=} 0 192
[junit4:junit4]   2> 23443 T14 oascc.ZkStateReader.updateClusterState Updating cloud state from ZooKeeper... 
[junit4:junit4]   2> 23448 T44 C1 P33309 REQ /select {distrib=false&wt=javabin&q=*:*&version=2} hits=4 status=0 QTime=1 
[junit4:junit4]   2> 23453 T54 C0 P58754 REQ /select {distrib=false&wt=javabin&q=*:*&version=2} hits=4 status=0 QTime=1 
[junit4:junit4]   2> 23460 T68 C2 P57303 REQ /select {distrib=false&wt=javabin&q=*:*&version=2} hits=4 status=0 QTime=1 
[junit4:junit4]   2> 23465 T82 C3 P48810 REQ /select {distrib=false&wt=javabin&q=*:*&version=2} hits=4 status=0 QTime=1 
[junit4:junit4]   2> 25477 T28 C4 P17764 REQ /select {fl=id,score&shard.url=127.0.0.1:17764/solr/collection1/&NOW=1347951378047&start=0&q=*:*&distrib=false&isShard=true&wt=javabin&fsv=true&rows=10&version=2} hits=4 status=0 QTime=1 
[junit4:junit4]   2> 25511 T28 C4 P17764 REQ /select {shard.url=127.0.0.1:17764/solr/collection1/&NOW=1347951378047&q=*:*&ids=3,2,1,0&distrib=false&isShard=true&wt=javabin&version=2} status=0 QTime=1 
[junit4:junit4]   2> 25513 T27 C4 P17764 REQ /select {wt=javabin&q=*:*&version=2} hits=4 status=0 QTime=43 
[junit4:junit4]   2> Control Docs:4
[junit4:junit4]   2> 25515 T14 oascc.ZkStateReader.updateClusterState Updating cloud state from ZooKeeper... 
[junit4:junit4]   2> check const of shard1
[junit4:junit4]   2> client0
[junit4:junit4]   2> PROPS:shard=shard1
[junit4:junit4]   2> roles=null
[junit4:junit4]   2> leader=true
[junit4:junit4]   2> state=active
[junit4:junit4]   2> core=collection1
[junit4:junit4]   2> collection=collection1
[junit4:junit4]   2> node_name=127.0.0.1:33309_solr
[junit4:junit4]   2> base_url=http://127.0.0.1:33309/solr
[junit4:junit4]   2> 
[junit4:junit4]   2> 25521 T44 C1 P33309 REQ /select {distrib=false&wt=javabin&q=*:*&version=2} hits=4 status=0 QTime=1 
[junit4:junit4]   2>  live:true
[junit4:junit4]   2>  num:4
[junit4:junit4]   2> 
[junit4:junit4]   2> client1
[junit4:junit4]   2> PROPS:shard=shard1
[junit4:junit4]   2> roles=null
[junit4:junit4]   2> state=active
[junit4:junit4]   2> core=collection1
[junit4:junit4]   2> collection=collection1
[junit4:junit4]   2> node_name=127.0.0.1:58754_solr
[junit4:junit4]   2> base_url=http://127.0.0.1:58754/solr
[junit4:junit4]   2> 
[junit4:junit4]   2> 25525 T54 C0 P58754 REQ /select {distrib=false&wt=javabin&q=*:*&version=2} hits=4 status=0 QTime=1 
[junit4:junit4]   2>  live:true
[junit4:junit4]   2>  num:4
[junit4:junit4]   2> 
[junit4:junit4]   2> client2
[junit4:junit4]   2> PROPS:shard=shard1
[junit4:junit4]   2> roles=null
[junit4:junit4]   2> state=active
[junit4:junit4]   2> core=collection1
[junit4:junit4]   2> collection=collection1
[junit4:junit4]   2> node_name=127.0.0.1:57303_solr
[junit4:junit4]   2> base_url=http://127.0.0.1:57303/solr
[junit4:junit4]   2> 
[junit4:junit4]   2> 25530 T68 C2 P57303 REQ /select {distrib=false&wt=javabin&q=*:*&version=2} hits=4 status=0 QTime=1 
[junit4:junit4]   2>  live:true
[junit4:junit4]   2>  num:4
[junit4:junit4]   2> 
[junit4:junit4]   2> client3
[junit4:junit4]   2> PROPS:shard=shard1
[junit4:junit4]   2> roles=null
[junit4:junit4]   2> state=active
[junit4:junit4]   2> core=collection1
[junit4:junit4]   2> collection=collection1
[junit4:junit4]   2> node_name=127.0.0.1:48810_solr
[junit4:junit4]   2> base_url=http://127.0.0.1:48810/solr
[junit4:junit4]   2> 
[junit4:junit4]   2> 25535 T82 C3 P48810 REQ /select {distrib=false&wt=javabin&q=*:*&version=2} hits=4 status=0 QTime=1 
[junit4:junit4]   2>  live:true
[junit4:junit4]   2>  num:4
[junit4:junit4]   2> 
[junit4:junit4]   2> 25544 T111 C1 P33309 REQ /select {fl=id,score&shard.url=127.0.0.1:33309/solr/collection1/|127.0.0.1:58754/solr/collection1/|127.0.0.1:57303/solr/collection1/|127.0.0.1:48810/sol

[...truncated too long message...]

ore@6d27bd4b
[junit4:junit4]   2> 136605 T14 oasc.SolrCore.closeSearcher [collection1] Closing main searcher on request.
[junit4:junit4]   2> 136606 T14 oasu.DirectUpdateHandler2.close closing DirectUpdateHandler2{commits=5,autocommits=0,soft autocommits=0,optimizes=0,rollbacks=0,expungeDeletes=0,docsPending=0,adds=0,deletesById=0,deletesByQuery=0,errors=0,cumulative_adds=5,cumulative_deletesById=0,cumulative_deletesByQuery=1,cumulative_errors=0}
[junit4:junit4]   2> 136607 T14 oasu.DefaultSolrCoreState.decref SolrCoreState ref count has reached 0 - closing IndexWriter
[junit4:junit4]   2> 136611 T14 oasu.DefaultSolrCoreState.decref Closing SolrCoreState - canceling any ongoing recovery
[junit4:junit4]   2> 139446 T75 oaz.ClientCnxn$EventThread.run EventThread shut down
[junit4:junit4]   2> 139446 T14 oaz.ZooKeeper.close Session: 0x139d8295c820005 closed
[junit4:junit4]   2> 139449 T14 oejsh.ContextHandler.doStop stopped o.e.j.s.ServletContextHandler{/solr,null}
[junit4:junit4]   2> 139502 T14 oasc.ChaosMonkey.monkeyLog monkey: stop shard! 48810
[junit4:junit4]   2> 139502 T14 oasc.CoreContainer.shutdown Shutting down CoreContainer instance=1737932744
[junit4:junit4]   2> 139503 T14 oasc.RecoveryStrategy.close WARNING Stopping recovery for zkNodeName=127.0.0.1:48810_solr_collection1core=collection1
[junit4:junit4]   2> 139504 T14 oasc.SolrCore.close [collection1]  CLOSING SolrCore org.apache.solr.core.SolrCore@6475c0ab
[junit4:junit4]   2> 139554 T14 oasc.SolrCore.closeSearcher [collection1] Closing main searcher on request.
[junit4:junit4]   2> 139555 T14 oasu.DirectUpdateHandler2.close closing DirectUpdateHandler2{commits=6,autocommits=0,soft autocommits=0,optimizes=0,rollbacks=0,expungeDeletes=0,docsPending=0,adds=0,deletesById=0,deletesByQuery=0,errors=0,cumulative_adds=5,cumulative_deletesById=0,cumulative_deletesByQuery=1,cumulative_errors=0}
[junit4:junit4]   2> 139555 T14 oasu.DefaultSolrCoreState.decref SolrCoreState ref count has reached 0 - closing IndexWriter
[junit4:junit4]   2> 139558 T14 oasu.DefaultSolrCoreState.decref Closing SolrCoreState - canceling any ongoing recovery
[junit4:junit4]   2> 139660 T89 oaz.ClientCnxn$EventThread.run EventThread shut down
[junit4:junit4]   2> 139660 T14 oaz.ZooKeeper.close Session: 0x139d8295c820006 closed
[junit4:junit4]   2> 139661 T14 oejsh.ContextHandler.doStop stopped o.e.j.s.ServletContextHandler{/solr,null}
[junit4:junit4]   2> 139795 T14 oas.SolrTestCaseJ4.tearDown ###Ending testDistribSearch
[junit4:junit4]   2> NOTE: reproduce with: ant test  -Dtestcase=SyncSliceTest -Dtests.method=testDistribSearch -Dtests.seed=3FB5447824053B5 -Dtests.multiplier=3 -Dtests.slow=true -Dtests.locale=de_LU -Dtests.timezone=Etc/UTC -Dtests.file.encoding=US-ASCII
[junit4:junit4] FAILURE  140s J1 | SyncSliceTest.testDistribSearch <<<
[junit4:junit4]    > Throwable #1: java.lang.AssertionError: There are still nodes recoverying
[junit4:junit4]    > 	at __randomizedtesting.SeedInfo.seed([3FB5447824053B5:821DDA5FF51F3389]:0)
[junit4:junit4]    > 	at org.junit.Assert.fail(Assert.java:93)
[junit4:junit4]    > 	at org.apache.solr.cloud.AbstractDistribZkTestBase.waitForRecoveriesToFinish(AbstractDistribZkTestBase.java:154)
[junit4:junit4]    > 	at org.apache.solr.cloud.AbstractFullDistribZkTestBase.waitForRecoveriesToFinish(AbstractFullDistribZkTestBase.java:560)
[junit4:junit4]    > 	at org.apache.solr.cloud.AbstractFullDistribZkTestBase.waitForThingsToLevelOut(AbstractFullDistribZkTestBase.java:1135)
[junit4:junit4]    > 	at org.apache.solr.cloud.SyncSliceTest.doTest(SyncSliceTest.java:162)
[junit4:junit4]    > 	at org.apache.solr.BaseDistributedSearchTestCase.testDistribSearch(BaseDistributedSearchTestCase.java:695)
[junit4:junit4]    > 	at sun.reflect.NativeMethodAccessorImpl.invoke0(Native Method)
[junit4:junit4]    > 	at sun.reflect.NativeMethodAccessorImpl.invoke(NativeMethodAccessorImpl.java:57)
[junit4:junit4]    > 	at sun.reflect.DelegatingMethodAccessorImpl.invoke(DelegatingMethodAccessorImpl.java:43)
[junit4:junit4]    > 	at java.lang.reflect.Method.invoke(Method.java:601)
[junit4:junit4]    > 	at com.carrotsearch.randomizedtesting.RandomizedRunner.invoke(RandomizedRunner.java:1559)
[junit4:junit4]    > 	at com.carrotsearch.randomizedtesting.RandomizedRunner.access$600(RandomizedRunner.java:79)
[junit4:junit4]    > 	at com.carrotsearch.randomizedtesting.RandomizedRunner$6.evaluate(RandomizedRunner.java:737)
[junit4:junit4]    > 	at com.carrotsearch.randomizedtesting.RandomizedRunner$7.evaluate(RandomizedRunner.java:773)
[junit4:junit4]    > 	at com.carrotsearch.randomizedtesting.RandomizedRunner$8.evaluate(RandomizedRunner.java:787)
[junit4:junit4]    > 	at com.carrotsearch.randomizedtesting.rules.SystemPropertiesRestoreRule$1.evaluate(SystemPropertiesRestoreRule.java:53)
[junit4:junit4]    > 	at org.apache.lucene.util.TestRuleSetupTeardownChained$1.evaluate(TestRuleSetupTeardownChained.java:50)
[junit4:junit4]    > 	at org.apache.lucene.util.TestRuleFieldCacheSanity$1.evaluate(TestRuleFieldCacheSanity.java:51)
[junit4:junit4]    > 	at org.apache.lucene.util.AbstractBeforeAfterRule$1.evaluate(AbstractBeforeAfterRule.java:45)
[junit4:junit4]    > 	at com.carrotsearch.randomizedtesting.rules.SystemPropertiesInvariantRule$1.evaluate(SystemPropertiesInvariantRule.java:55)
[junit4:junit4]    > 	at org.apache.lucene.util.TestRuleThreadAndTestName$1.evaluate(TestRuleThreadAndTestName.java:48)
[junit4:junit4]    > 	at org.apache.lucene.util.TestRuleIgnoreAfterMaxFailures$1.evaluate(TestRuleIgnoreAfterMaxFailures.java:70)
[junit4:junit4]    > 	at org.apache.lucene.util.TestRuleMarkFailure$1.evaluate(TestRuleMarkFailure.java:48)
[junit4:junit4]    > 	at com.carrotsearch.randomizedtesting.rules.StatementAdapter.evaluate(StatementAdapter.java:36)
[junit4:junit4]    > 	at com.carrotsearch.randomizedtesting.ThreadLeakControl$StatementRunner.run(ThreadLeakControl.java:358)
[junit4:junit4]    > 	at com.carrotsearch.randomizedtesting.ThreadLeakControl.forkTimeoutingTask(ThreadLeakControl.java:782)
[junit4:junit4]    > 	at com.carrotsearch.randomizedtesting.ThreadLeakControl$3.evaluate(ThreadLeakControl.java:442)
[junit4:junit4]    > 	at com.carrotsearch.randomizedtesting.RandomizedRunner.runSingleTest(RandomizedRunner.java:746)
[junit4:junit4]    > 	at com.carrotsearch.randomizedtesting.RandomizedRunner$3.evaluate(RandomizedRunner.java:648)
[junit4:junit4]    > 	at com.carrotsearch.randomizedtesting.RandomizedRunner$4.evaluate(RandomizedRunner.java:682)
[junit4:junit4]    > 	at com.carrotsearch.randomizedtesting.RandomizedRunner$5.evaluate(RandomizedRunner.java:693)
[junit4:junit4]    > 	at com.carrotsearch.randomizedtesting.rules.StatementAdapter.evaluate(StatementAdapter.java:36)
[junit4:junit4]    > 	at com.carrotsearch.randomizedtesting.rules.SystemPropertiesRestoreRule$1.evaluate(SystemPropertiesRestoreRule.java:53)
[junit4:junit4]    > 	at org.apache.lucene.util.AbstractBeforeAfterRule$1.evaluate(AbstractBeforeAfterRule.java:45)
[junit4:junit4]    > 	at org.apache.lucene.util.TestRuleStoreClassName$1.evaluate(TestRuleStoreClassName.java:42)
[junit4:junit4]    > 	at com.carrotsearch.randomizedtesting.rules.SystemPropertiesInvariantRule$1.evaluate(SystemPropertiesInvariantRule.java:55)
[junit4:junit4]    > 	at com.carrotsearch.randomizedtesting.rules.NoShadowingOrOverridesOnMethodsRule$1.evaluate(NoShadowingOrOverridesOnMethodsRule.java:39)
[junit4:junit4]    > 	at com.carrotsearch.randomizedtesting.rules.NoShadowingOrOverridesOnMethodsRule$1.evaluate(NoShadowingOrOverridesOnMethodsRule.java:39)
[junit4:junit4]    > 	at com.carrotsearch.randomizedtesting.rules.StatementAdapter.evaluate(StatementAdapter.java:36)
[junit4:junit4]    > 	at org.apache.lucene.util.TestRuleAssertionsRequired$1.evaluate(TestRuleAssertionsRequired.java:43)
[junit4:junit4]    > 	at org.apache.lucene.util.TestRuleMarkFailure$1.evaluate(TestRuleMarkFailure.java:48)
[junit4:junit4]    > 	at org.apache.lucene.util.TestRuleIgnoreAfterMaxFailures$1.evaluate(TestRuleIgnoreAfterMaxFailures.java:70)
[junit4:junit4]    > 	at org.apache.lucene.util.TestRuleIgnoreTestSuites$1.evaluate(TestRuleIgnoreTestSuites.java:55)
[junit4:junit4]    > 	at com.carrotsearch.randomizedtesting.rules.StatementAdapter.evaluate(StatementAdapter.java:36)
[junit4:junit4]    > 	at com.carrotsearch.randomizedtesting.ThreadLeakControl$StatementRunner.run(ThreadLeakControl.java:358)
[junit4:junit4]    > 	at java.lang.Thread.run(Thread.java:722)
[junit4:junit4]   2> 139896 T14 oas.SolrTestCaseJ4.deleteCore ###deleteCore
[junit4:junit4]   2> NOTE: test params are: codec=Asserting, sim=RandomSimilarityProvider(queryNorm=false,coord=crazy): {}, locale=de_LU, timezone=Etc/UTC
[junit4:junit4]   2> NOTE: FreeBSD 9.0-RELEASE amd64/Oracle Corporation 1.7.0_06 (64-bit)/cpus=16,threads=1,free=135529728,total=156237824
[junit4:junit4]   2> NOTE: All tests run in this JVM: [TestPropInjectDefaults, SyncSliceTest]
[junit4:junit4] Completed on J1 in 139.95s, 1 test, 1 failure <<< FAILURES!

[...truncated 627 lines...]
BUILD FAILED
/usr/home/hudson/hudson-slave/workspace/Lucene-Solr-Tests-4.x-java7/build.xml:32: The following error occurred while executing this line:
/usr/home/hudson/hudson-slave/workspace/Lucene-Solr-Tests-4.x-java7/solr/build.xml:146: The following error occurred while executing this line:
/usr/home/hudson/hudson-slave/workspace/Lucene-Solr-Tests-4.x-java7/lucene/module-build.xml:63: The following error occurred while executing this line:
/usr/home/hudson/hudson-slave/workspace/Lucene-Solr-Tests-4.x-java7/lucene/common-build.xml:1133: The following error occurred while executing this line:
/usr/home/hudson/hudson-slave/workspace/Lucene-Solr-Tests-4.x-java7/lucene/common-build.xml:810: There were test failures: 230 suites, 951 tests, 1 failure, 8 ignored (2 assumptions)

Total time: 30 minutes 45 seconds
Build step 'Invoke Ant' marked build as failure
Recording test results
Email was triggered for: Failure
Sending email for trigger: Failure



Mime
View raw message