lucene-dev mailing list archives

Site index · List index
Message view « Date » · « Thread »
Top « Date » · « Thread »
From Apache Jenkins Server <jenk...@builds.apache.org>
Subject [JENKINS-MAVEN] Lucene-Solr-Maven-4.x #102: POMs out of sync
Date Thu, 20 Sep 2012 14:44:37 GMT
Build: https://builds.apache.org/job/Lucene-Solr-Maven-4.x/102/

3 tests failed.
REGRESSION:  org.apache.solr.cloud.SyncSliceTest.testDistribSearch

Error Message:
No live SolrServers available to handle this request

Stack Trace:
org.apache.solr.client.solrj.SolrServerException: No live SolrServers available to handle this request
	at __randomizedtesting.SeedInfo.seed([BE4C91CEF7E85737:3FAA1FD680B7370B]:0)
	at org.apache.solr.client.solrj.impl.LBHttpSolrServer.request(LBHttpSolrServer.java:323)
	at org.apache.solr.client.solrj.impl.CloudSolrServer.request(CloudSolrServer.java:257)
	at org.apache.solr.client.solrj.request.QueryRequest.process(QueryRequest.java:90)
	at org.apache.solr.client.solrj.SolrServer.query(SolrServer.java:324)
	at org.apache.solr.cloud.AbstractFullDistribZkTestBase.checkShardConsistency(AbstractFullDistribZkTestBase.java:909)
	at org.apache.solr.cloud.SyncSliceTest.doTest(SyncSliceTest.java:226)
	at org.apache.solr.BaseDistributedSearchTestCase.testDistribSearch(BaseDistributedSearchTestCase.java:695)
	at sun.reflect.NativeMethodAccessorImpl.invoke0(Native Method)
	at sun.reflect.NativeMethodAccessorImpl.invoke(NativeMethodAccessorImpl.java:57)
	at sun.reflect.DelegatingMethodAccessorImpl.invoke(DelegatingMethodAccessorImpl.java:43)
	at java.lang.reflect.Method.invoke(Method.java:616)
	at com.carrotsearch.randomizedtesting.RandomizedRunner.invoke(RandomizedRunner.java:1559)
	at com.carrotsearch.randomizedtesting.RandomizedRunner.access$600(RandomizedRunner.java:79)
	at com.carrotsearch.randomizedtesting.RandomizedRunner$6.evaluate(RandomizedRunner.java:737)
	at com.carrotsearch.randomizedtesting.RandomizedRunner$7.evaluate(RandomizedRunner.java:773)
	at com.carrotsearch.randomizedtesting.RandomizedRunner$8.evaluate(RandomizedRunner.java:787)
	at com.carrotsearch.randomizedtesting.rules.SystemPropertiesRestoreRule$1.evaluate(SystemPropertiesRestoreRule.java:53)
	at org.apache.lucene.util.TestRuleSetupTeardownChained$1.evaluate(TestRuleSetupTeardownChained.java:50)
	at org.apache.lucene.util.TestRuleFieldCacheSanity$1.evaluate(TestRuleFieldCacheSanity.java:51)
	at org.apache.lucene.util.AbstractBeforeAfterRule$1.evaluate(AbstractBeforeAfterRule.java:45)
	at com.carrotsearch.randomizedtesting.rules.SystemPropertiesInvariantRule$1.evaluate(SystemPropertiesInvariantRule.java:55)
	at org.apache.lucene.util.TestRuleThreadAndTestName$1.evaluate(TestRuleThreadAndTestName.java:48)
	at org.apache.lucene.util.TestRuleIgnoreAfterMaxFailures$1.evaluate(TestRuleIgnoreAfterMaxFailures.java:70)
	at org.apache.lucene.util.TestRuleMarkFailure$1.evaluate(TestRuleMarkFailure.java:48)
	at com.carrotsearch.randomizedtesting.rules.StatementAdapter.evaluate(StatementAdapter.java:36)
	at com.carrotsearch.randomizedtesting.ThreadLeakControl$StatementRunner.run(ThreadLeakControl.java:358)
	at com.carrotsearch.randomizedtesting.ThreadLeakControl.forkTimeoutingTask(ThreadLeakControl.java:782)
	at com.carrotsearch.randomizedtesting.ThreadLeakControl$3.evaluate(ThreadLeakControl.java:442)
	at com.carrotsearch.randomizedtesting.RandomizedRunner.runSingleTest(RandomizedRunner.java:746)
	at com.carrotsearch.randomizedtesting.RandomizedRunner$3.evaluate(RandomizedRunner.java:648)
	at com.carrotsearch.randomizedtesting.RandomizedRunner$4.evaluate(RandomizedRunner.java:682)
	at com.carrotsearch.randomizedtesting.RandomizedRunner$5.evaluate(RandomizedRunner.java:693)
	at com.carrotsearch.randomizedtesting.rules.StatementAdapter.evaluate(StatementAdapter.java:36)
	at com.carrotsearch.randomizedtesting.rules.SystemPropertiesRestoreRule$1.evaluate(SystemPropertiesRestoreRule.java:53)
	at org.apache.lucene.util.AbstractBeforeAfterRule$1.evaluate(AbstractBeforeAfterRule.java:45)
	at org.apache.lucene.util.TestRuleStoreClassName$1.evaluate(TestRuleStoreClassName.java:42)
	at com.carrotsearch.randomizedtesting.rules.SystemPropertiesInvariantRule$1.evaluate(SystemPropertiesInvariantRule.java:55)
	at com.carrotsearch.randomizedtesting.rules.NoShadowingOrOverridesOnMethodsRule$1.evaluate(NoShadowingOrOverridesOnMethodsRule.java:39)
	at com.carrotsearch.randomizedtesting.rules.NoShadowingOrOverridesOnMethodsRule$1.evaluate(NoShadowingOrOverridesOnMethodsRule.java:39)
	at com.carrotsearch.randomizedtesting.rules.StatementAdapter.evaluate(StatementAdapter.java:36)
	at org.apache.lucene.util.TestRuleAssertionsRequired$1.evaluate(TestRuleAssertionsRequired.java:43)
	at org.apache.lucene.util.TestRuleMarkFailure$1.evaluate(TestRuleMarkFailure.java:48)
	at org.apache.lucene.util.TestRuleIgnoreAfterMaxFailures$1.evaluate(TestRuleIgnoreAfterMaxFailures.java:70)
	at org.apache.lucene.util.TestRuleIgnoreTestSuites$1.evaluate(TestRuleIgnoreTestSuites.java:55)
	at com.carrotsearch.randomizedtesting.rules.StatementAdapter.evaluate(StatementAdapter.java:36)
	at com.carrotsearch.randomizedtesting.ThreadLeakControl$StatementRunner.run(ThreadLeakControl.java:358)
	at java.lang.Thread.run(Thread.java:679)


REGRESSION:  org.apache.solr.spelling.suggest.SuggesterFSTTest.testReload

Error Message:
Exception during query

Stack Trace:
java.lang.RuntimeException: Exception during query
	at __randomizedtesting.SeedInfo.seed([A789D6394D2D6F3C:6079AE3A876E972E]:0)
	at org.apache.solr.SolrTestCaseJ4.assertQ(SolrTestCaseJ4.java:510)
	at org.apache.solr.SolrTestCaseJ4.assertQ(SolrTestCaseJ4.java:477)
	at org.apache.solr.spelling.suggest.SuggesterTest.testReload(SuggesterTest.java:91)
	at sun.reflect.NativeMethodAccessorImpl.invoke0(Native Method)
	at sun.reflect.NativeMethodAccessorImpl.invoke(NativeMethodAccessorImpl.java:57)
	at sun.reflect.DelegatingMethodAccessorImpl.invoke(DelegatingMethodAccessorImpl.java:43)
	at java.lang.reflect.Method.invoke(Method.java:616)
	at com.carrotsearch.randomizedtesting.RandomizedRunner.invoke(RandomizedRunner.java:1559)
	at com.carrotsearch.randomizedtesting.RandomizedRunner.access$600(RandomizedRunner.java:79)
	at com.carrotsearch.randomizedtesting.RandomizedRunner$6.evaluate(RandomizedRunner.java:737)
	at com.carrotsearch.randomizedtesting.RandomizedRunner$7.evaluate(RandomizedRunner.java:773)
	at com.carrotsearch.randomizedtesting.RandomizedRunner$8.evaluate(RandomizedRunner.java:787)
	at com.carrotsearch.randomizedtesting.rules.SystemPropertiesRestoreRule$1.evaluate(SystemPropertiesRestoreRule.java:53)
	at org.apache.lucene.util.TestRuleSetupTeardownChained$1.evaluate(TestRuleSetupTeardownChained.java:50)
	at org.apache.lucene.util.TestRuleFieldCacheSanity$1.evaluate(TestRuleFieldCacheSanity.java:51)
	at org.apache.lucene.util.AbstractBeforeAfterRule$1.evaluate(AbstractBeforeAfterRule.java:45)
	at com.carrotsearch.randomizedtesting.rules.SystemPropertiesInvariantRule$1.evaluate(SystemPropertiesInvariantRule.java:55)
	at org.apache.lucene.util.TestRuleThreadAndTestName$1.evaluate(TestRuleThreadAndTestName.java:48)
	at org.apache.lucene.util.TestRuleIgnoreAfterMaxFailures$1.evaluate(TestRuleIgnoreAfterMaxFailures.java:70)
	at org.apache.lucene.util.TestRuleMarkFailure$1.evaluate(TestRuleMarkFailure.java:48)
	at com.carrotsearch.randomizedtesting.rules.StatementAdapter.evaluate(StatementAdapter.java:36)
	at com.carrotsearch.randomizedtesting.ThreadLeakControl$StatementRunner.run(ThreadLeakControl.java:358)
	at com.carrotsearch.randomizedtesting.ThreadLeakControl.forkTimeoutingTask(ThreadLeakControl.java:782)
	at com.carrotsearch.randomizedtesting.ThreadLeakControl$3.evaluate(ThreadLeakControl.java:442)
	at com.carrotsearch.randomizedtesting.RandomizedRunner.runSingleTest(RandomizedRunner.java:746)
	at com.carrotsearch.randomizedtesting.RandomizedRunner$3.evaluate(RandomizedRunner.java:648)
	at com.carrotsearch.randomizedtesting.RandomizedRunner$4.evaluate(RandomizedRunner.java:682)
	at com.carrotsearch.randomizedtesting.RandomizedRunner$5.evaluate(RandomizedRunner.java:693)
	at com.carrotsearch.randomizedtesting.rules.StatementAdapter.evaluate(StatementAdapter.java:36)
	at com.carrotsearch.randomizedtesting.rules.SystemPropertiesRestoreRule$1.evaluate(SystemPropertiesRestoreRule.java:53)
	at org.apache.lucene.util.AbstractBeforeAfterRule$1.evaluate(AbstractBeforeAfterRule.java:45)
	at org.apache.lucene.util.TestRuleStoreClassName$1.evaluate(TestRuleStoreClassName.java:42)
	at com.carrotsearch.randomizedtesting.rules.SystemPropertiesInvariantRule$1.evaluate(SystemPropertiesInvariantRule.java:55)
	at com.carrotsearch.randomizedtesting.rules.NoShadowingOrOverridesOnMethodsRule$1.evaluate(NoShadowingOrOverridesOnMethodsRule.java:39)
	at com.carrotsearch.randomizedtesting.rules.NoShadowingOrOverridesOnMethodsRule$1.evaluate(NoShadowingOrOverridesOnMethodsRule.java:39)
	at com.carrotsearch.randomizedtesting.rules.StatementAdapter.evaluate(StatementAdapter.java:36)
	at org.apache.lucene.util.TestRuleAssertionsRequired$1.evaluate(TestRuleAssertionsRequired.java:43)
	at org.apache.lucene.util.TestRuleMarkFailure$1.evaluate(TestRuleMarkFailure.java:48)
	at org.apache.lucene.util.TestRuleIgnoreAfterMaxFailures$1.evaluate(TestRuleIgnoreAfterMaxFailures.java:70)
	at org.apache.lucene.util.TestRuleIgnoreTestSuites$1.evaluate(TestRuleIgnoreTestSuites.java:55)
	at com.carrotsearch.randomizedtesting.rules.StatementAdapter.evaluate(StatementAdapter.java:36)
	at com.carrotsearch.randomizedtesting.ThreadLeakControl$StatementRunner.run(ThreadLeakControl.java:358)
	at java.lang.Thread.run(Thread.java:679)
Caused by: java.lang.NullPointerException
	at org.apache.lucene.search.suggest.fst.FSTCompletionLookup.lookup(FSTCompletionLookup.java:237)
	at org.apache.solr.spelling.suggest.Suggester.getSuggestions(Suggester.java:190)
	at org.apache.solr.handler.component.SpellCheckComponent.process(SpellCheckComponent.java:172)
	at org.apache.solr.handler.component.SearchHandler.handleRequestBody(SearchHandler.java:206)
	at org.apache.solr.handler.RequestHandlerBase.handleRequest(RequestHandlerBase.java:129)
	at org.apache.solr.core.SolrCore.execute(SolrCore.java:1701)
	at org.apache.solr.util.TestHarness.query(TestHarness.java:364)
	at org.apache.solr.util.TestHarness.query(TestHarness.java:346)
	at org.apache.solr.SolrTestCaseJ4.assertQ(SolrTestCaseJ4.java:484)
	... 42 more


FAILED:  org.apache.solr.cloud.BasicDistributedZk2Test.testDistribSearch

Error Message:
Shard still reported as live in zk

Stack Trace:
java.lang.AssertionError: Shard still reported as live in zk
	at __randomizedtesting.SeedInfo.seed([B0A7D8262AE8651F:3141563E5DB70523]:0)
	at org.junit.Assert.fail(Assert.java:93)
	at org.apache.solr.cloud.AbstractFullDistribZkTestBase.waitToSeeNotLive(AbstractFullDistribZkTestBase.java:1220)
	at org.apache.solr.cloud.BasicDistributedZk2Test.brindDownShardIndexSomeDocsAndRecover(BasicDistributedZk2Test.java:190)
	at org.apache.solr.cloud.BasicDistributedZk2Test.doTest(BasicDistributedZk2Test.java:83)
	at org.apache.solr.BaseDistributedSearchTestCase.testDistribSearch(BaseDistributedSearchTestCase.java:695)
	at sun.reflect.NativeMethodAccessorImpl.invoke0(Native Method)
	at sun.reflect.NativeMethodAccessorImpl.invoke(NativeMethodAccessorImpl.java:57)
	at sun.reflect.DelegatingMethodAccessorImpl.invoke(DelegatingMethodAccessorImpl.java:43)
	at java.lang.reflect.Method.invoke(Method.java:616)
	at com.carrotsearch.randomizedtesting.RandomizedRunner.invoke(RandomizedRunner.java:1559)
	at com.carrotsearch.randomizedtesting.RandomizedRunner.access$600(RandomizedRunner.java:79)
	at com.carrotsearch.randomizedtesting.RandomizedRunner$6.evaluate(RandomizedRunner.java:737)
	at com.carrotsearch.randomizedtesting.RandomizedRunner$7.evaluate(RandomizedRunner.java:773)
	at com.carrotsearch.randomizedtesting.RandomizedRunner$8.evaluate(RandomizedRunner.java:787)
	at com.carrotsearch.randomizedtesting.rules.SystemPropertiesRestoreRule$1.evaluate(SystemPropertiesRestoreRule.java:53)
	at org.apache.lucene.util.TestRuleSetupTeardownChained$1.evaluate(TestRuleSetupTeardownChained.java:50)
	at org.apache.lucene.util.TestRuleFieldCacheSanity$1.evaluate(TestRuleFieldCacheSanity.java:51)
	at org.apache.lucene.util.AbstractBeforeAfterRule$1.evaluate(AbstractBeforeAfterRule.java:45)
	at com.carrotsearch.randomizedtesting.rules.SystemPropertiesInvariantRule$1.evaluate(SystemPropertiesInvariantRule.java:55)
	at org.apache.lucene.util.TestRuleThreadAndTestName$1.evaluate(TestRuleThreadAndTestName.java:48)
	at org.apache.lucene.util.TestRuleIgnoreAfterMaxFailures$1.evaluate(TestRuleIgnoreAfterMaxFailures.java:70)
	at org.apache.lucene.util.TestRuleMarkFailure$1.evaluate(TestRuleMarkFailure.java:48)
	at com.carrotsearch.randomizedtesting.rules.StatementAdapter.evaluate(StatementAdapter.java:36)
	at com.carrotsearch.randomizedtesting.ThreadLeakControl$StatementRunner.run(ThreadLeakControl.java:358)
	at com.carrotsearch.randomizedtesting.ThreadLeakControl.forkTimeoutingTask(ThreadLeakControl.java:782)
	at com.carrotsearch.randomizedtesting.ThreadLeakControl$3.evaluate(ThreadLeakControl.java:442)
	at com.carrotsearch.randomizedtesting.RandomizedRunner.runSingleTest(RandomizedRunner.java:746)
	at com.carrotsearch.randomizedtesting.RandomizedRunner$3.evaluate(RandomizedRunner.java:648)
	at com.carrotsearch.randomizedtesting.RandomizedRunner$4.evaluate(RandomizedRunner.java:682)
	at com.carrotsearch.randomizedtesting.RandomizedRunner$5.evaluate(RandomizedRunner.java:693)
	at com.carrotsearch.randomizedtesting.rules.StatementAdapter.evaluate(StatementAdapter.java:36)
	at com.carrotsearch.randomizedtesting.rules.SystemPropertiesRestoreRule$1.evaluate(SystemPropertiesRestoreRule.java:53)
	at org.apache.lucene.util.AbstractBeforeAfterRule$1.evaluate(AbstractBeforeAfterRule.java:45)
	at org.apache.lucene.util.TestRuleStoreClassName$1.evaluate(TestRuleStoreClassName.java:42)
	at com.carrotsearch.randomizedtesting.rules.SystemPropertiesInvariantRule$1.evaluate(SystemPropertiesInvariantRule.java:55)
	at com.carrotsearch.randomizedtesting.rules.NoShadowingOrOverridesOnMethodsRule$1.evaluate(NoShadowingOrOverridesOnMethodsRule.java:39)
	at com.carrotsearch.randomizedtesting.rules.NoShadowingOrOverridesOnMethodsRule$1.evaluate(NoShadowingOrOverridesOnMethodsRule.java:39)
	at com.carrotsearch.randomizedtesting.rules.StatementAdapter.evaluate(StatementAdapter.java:36)
	at org.apache.lucene.util.TestRuleAssertionsRequired$1.evaluate(TestRuleAssertionsRequired.java:43)
	at org.apache.lucene.util.TestRuleMarkFailure$1.evaluate(TestRuleMarkFailure.java:48)
	at org.apache.lucene.util.TestRuleIgnoreAfterMaxFailures$1.evaluate(TestRuleIgnoreAfterMaxFailures.java:70)
	at org.apache.lucene.util.TestRuleIgnoreTestSuites$1.evaluate(TestRuleIgnoreTestSuites.java:55)
	at com.carrotsearch.randomizedtesting.rules.StatementAdapter.evaluate(StatementAdapter.java:36)
	at com.carrotsearch.randomizedtesting.ThreadLeakControl$StatementRunner.run(ThreadLeakControl.java:358)
	at java.lang.Thread.run(Thread.java:679)




Build Log:
[...truncated 6079 lines...]
      [mvn] 1271 T3 oasc.SolrCore.finalize SEVERE REFCOUNT ERROR: unreferenced org.apache.solr.core.SolrCore@df76c5e (collection1) has a reference count of 1
      [mvn] 1385 T894 oasup.StatelessScriptUpdateProcessorFactory.inform SEVERE Unable to initialize scripts: Unable to evaluate script: a-file-name-that-does-not-exist.js Ignoring exception matching \Qa-file-name-that-does-not-exist.js\E
      [mvn] Creating dataDir: /usr/home/hudson/hudson-slave/workspace/Lucene-Solr-Maven-4.x/maven-build/solr/core/src/test/target/test/./solrtest-TestBadConfig-1348150810636
      [mvn] 1684 T3 oasc.CoreContainer.finalize SEVERE CoreContainer was not shutdown prior to finalize(), indicates a bug -- POSSIBLE RESOURCE LEAK!!!  instance=753180193
      [mvn] 1812 T894 oasup.StatelessScriptUpdateProcessorFactory.inform SEVERE Unable to initialize scripts: Unable to evaluate script: currency.xml Ignoring exception matching \Qcurrency.xml\E
      [mvn] Tests run: 6, Failures: 0, Errors: 0, Skipped: 0, Time elapsed: 1.84 sec
      [mvn] Running org.apache.solr.handler.admin.LoggingHandlerTest
      [mvn] Creating dataDir: /usr/home/hudson/hudson-slave/workspace/Lucene-Solr-Maven-4.x/maven-build/solr/core/src/test/target/test/./solrtest-LoggingHandlerTest-1348150811074
      [mvn] 263 T3 oasc.CoreContainer.finalize SEVERE CoreContainer was not shutdown prior to finalize(), indicates a bug -- POSSIBLE RESOURCE LEAK!!!  instance=1822990968
      [mvn] Tests run: 1, Failures: 0, Errors: 0, Skipped: 0, Time elapsed: 0.584 sec
      [mvn] Running org.apache.solr.handler.JsonLoaderTest
      [mvn] Creating dataDir: /usr/home/hudson/hudson-slave/workspace/Lucene-Solr-Maven-4.x/maven-build/solr/core/src/test/target/test/./solrtest-JsonLoaderTest-1348150811660
      [mvn] Tests run: 6, Failures: 0, Errors: 0, Skipped: 0, Time elapsed: 0.567 sec
      [mvn] Running org.apache.solr.update.PeerSyncTest
      [mvn] Tests run: 1, Failures: 0, Errors: 0, Skipped: 0, Time elapsed: 2.526 sec
      [mvn] Running org.apache.solr.core.SOLR749Test
      [mvn] Creating dataDir: /usr/home/hudson/hudson-slave/workspace/Lucene-Solr-Maven-4.x/maven-build/solr/core/src/test/target/test/./solrtest-SOLR749Test-1348150814753
      [mvn] Tests run: 1, Failures: 0, Errors: 0, Skipped: 0, Time elapsed: 0.316 sec
      [mvn] Running org.apache.solr.core.TestQuerySenderNoQuery
      [mvn] Creating dataDir: /usr/home/hudson/hudson-slave/workspace/Lucene-Solr-Maven-4.x/maven-build/solr/core/src/test/target/test/./solrtest-TestQuerySenderNoQuery-1348150815071
      [mvn] Tests run: 3, Failures: 0, Errors: 0, Skipped: 0, Time elapsed: 0.321 sec
      [mvn] Running org.apache.solr.core.TestCodecSupport
      [mvn] Creating dataDir: /usr/home/hudson/hudson-slave/workspace/Lucene-Solr-Maven-4.x/maven-build/solr/core/src/test/target/test/./solrtest-TestCodecSupport-1348150815390
      [mvn] Tests run: 3, Failures: 0, Errors: 0, Skipped: 0, Time elapsed: 0.079 sec
      [mvn] Running org.apache.solr.search.TestDocSet
      [mvn] Tests run: 2, Failures: 0, Errors: 0, Skipped: 0, Time elapsed: 0.471 sec
      [mvn] Running org.apache.solr.internal.csv.CSVStrategyTest
      [mvn] Tests run: 5, Failures: 0, Errors: 0, Skipped: 0, Time elapsed: 0.001 sec
      [mvn] Running org.apache.solr.search.similarities.TestLMDirichletSimilarityFactory
      [mvn] Creating dataDir: /usr/home/hudson/hudson-slave/workspace/Lucene-Solr-Maven-4.x/maven-build/solr/core/src/test/target/test/./solrtest-TestLMDirichletSimilarityFactory-1348150815941
      [mvn] Tests run: 2, Failures: 0, Errors: 0, Skipped: 0, Time elapsed: 0.077 sec
      [mvn] Running org.apache.solr.handler.MoreLikeThisHandlerTest
      [mvn] Creating dataDir: /usr/home/hudson/hudson-slave/workspace/Lucene-Solr-Maven-4.x/maven-build/solr/core/src/test/target/test/./solrtest-MoreLikeThisHandlerTest-1348150816019
      [mvn] Tests run: 1, Failures: 0, Errors: 0, Skipped: 0, Time elapsed: 0.496 sec
      [mvn] Running org.apache.solr.spelling.suggest.SuggesterTest
      [mvn] Creating dataDir: /usr/home/hudson/hudson-slave/workspace/Lucene-Solr-Maven-4.x/maven-build/solr/core/src/test/target/test/./solrtest-SuggesterTest-1348150816518
      [mvn] NOTE: per solr.test.leavedatadir, dataDir will not be removed: /usr/home/hudson/hudson-slave/workspace/Lucene-Solr-Maven-4.x/maven-build/solr/core/src/test/target/test/./solrtest-SuggesterTest-1348150816518
      [mvn] Tests run: 4, Failures: 0, Errors: 0, Skipped: 0, Time elapsed: 1.301 sec
      [mvn] Running org.apache.solr.internal.csv.CSVParserTest
      [mvn] Tests run: 23, Failures: 0, Errors: 0, Skipped: 0, Time elapsed: 0.007 sec
      [mvn] Running org.apache.solr.response.TestCSVResponseWriter
      [mvn] Creating dataDir: /usr/home/hudson/hudson-slave/workspace/Lucene-Solr-Maven-4.x/maven-build/solr/core/src/test/target/test/./solrtest-TestCSVResponseWriter-1348150817833
      [mvn] Tests run: 1, Failures: 0, Errors: 0, Skipped: 0, Time elapsed: 0.455 sec
      [mvn] Running org.apache.solr.cloud.ClusterStateUpdateTest
      [mvn] Creating dataDir: /usr/home/hudson/hudson-slave/workspace/Lucene-Solr-Maven-4.x/maven-build/solr/core/src/test/target/test/./solrtest-ClusterStateUpdateTest-1348150818286
      [mvn] Tests run: 1, Failures: 0, Errors: 0, Skipped: 0, Time elapsed: 8.25 sec
      [mvn] Running org.apache.solr.core.TestSolrDeletionPolicy1
      [mvn] Creating dataDir: /usr/home/hudson/hudson-slave/workspace/Lucene-Solr-Maven-4.x/maven-build/solr/core/src/test/target/test/./solrtest-TestSolrDeletionPolicy1-1348150826540
      [mvn] Tests run: 3, Failures: 0, Errors: 0, Skipped: 0, Time elapsed: 0.946 sec
      [mvn] Running org.apache.solr.TestDistributedSearch
      [mvn] 11643 T3 oasc.CoreContainer.finalize SEVERE CoreContainer was not shutdown prior to finalize(), indicates a bug -- POSSIBLE RESOURCE LEAK!!!  instance=1653818762
      [mvn] Tests run: 1, Failures: 0, Errors: 0, Skipped: 0, Time elapsed: 88.729 sec
      [mvn] Running org.apache.solr.util.DateMathParserTest
      [mvn] Tests run: 8, Failures: 0, Errors: 0, Skipped: 0, Time elapsed: 0.051 sec
      [mvn] Running org.apache.solr.handler.DocumentAnalysisRequestHandlerTest
      [mvn] Creating dataDir: /usr/home/hudson/hudson-slave/workspace/Lucene-Solr-Maven-4.x/maven-build/solr/core/src/test/target/test/./solrtest-DocumentAnalysisRequestHandlerTest-1348150916290
      [mvn] Tests run: 4, Failures: 0, Errors: 0, Skipped: 0, Time elapsed: 0.401 sec
      [mvn] Running org.apache.solr.util.TestNumberUtils
      [mvn] Tests run: 1, Failures: 0, Errors: 0, Skipped: 0, Time elapsed: 0.186 sec
      [mvn] Running org.apache.solr.search.TestFoldingMultitermQuery
      [mvn] Creating dataDir: /usr/home/hudson/hudson-slave/workspace/Lucene-Solr-Maven-4.x/maven-build/solr/core/src/test/target/test/./solrtest-TestFoldingMultitermQuery-1348150916875
      [mvn] Tests run: 18, Failures: 0, Errors: 0, Skipped: 0, Time elapsed: 0.646 sec
      [mvn] Running org.apache.solr.analysis.LegacyHTMLStripCharFilterTest
      [mvn] Tests run: 13, Failures: 0, Errors: 0, Skipped: 1, Time elapsed: 0.161 sec
      [mvn] Running org.apache.solr.handler.StandardRequestHandlerTest
      [mvn] Tests run: 1, Failures: 0, Errors: 0, Skipped: 0, Time elapsed: 0.417 sec
      [mvn] Running org.apache.solr.search.TestRTGBase
      [mvn] Tests run: 0, Failures: 0, Errors: 0, Skipped: 0, Time elapsed: 0.02 sec
      [mvn] Running org.apache.solr.analysis.TestReversedWildcardFilterFactory
      [mvn] Creating dataDir: /usr/home/hudson/hudson-slave/workspace/Lucene-Solr-Maven-4.x/maven-build/solr/core/src/test/target/test/./solrtest-TestReversedWildcardFilterFactory-1348150918172
      [mvn] Tests run: 4, Failures: 0, Errors: 0, Skipped: 0, Time elapsed: 0.432 sec
      [mvn] Running org.apache.solr.search.similarities.TestIBSimilarityFactory
      [mvn] Creating dataDir: /usr/home/hudson/hudson-slave/workspace/Lucene-Solr-Maven-4.x/maven-build/solr/core/src/test/target/test/./solrtest-TestIBSimilarityFactory-1348150918560
      [mvn] Tests run: 2, Failures: 0, Errors: 0, Skipped: 0, Time elapsed: 0.093 sec
      [mvn] Running org.apache.solr.internal.csv.CSVUtilsTest
      [mvn] Tests run: 14, Failures: 0, Errors: 0, Skipped: 0, Time elapsed: 0.005 sec
      [mvn] Running org.apache.solr.cloud.ClusterStateTest
      [mvn] Tests run: 1, Failures: 0, Errors: 0, Skipped: 0, Time elapsed: 0.021 sec
      [mvn] Running org.apache.solr.core.TestArbitraryIndexDir
      [mvn] Tests run: 1, Failures: 0, Errors: 0, Skipped: 0, Time elapsed: 0.586 sec
      [mvn] Running org.apache.solr.schema.PolyFieldTest
      [mvn] Creating dataDir: /usr/home/hudson/hudson-slave/workspace/Lucene-Solr-Maven-4.x/maven-build/solr/core/src/test/target/test/./solrtest-PolyFieldTest-1348150919271
      [mvn] Tests run: 4, Failures: 0, Errors: 0, Skipped: 0, Time elapsed: 0.858 sec
      [mvn] Running org.apache.solr.search.similarities.TestPerFieldSimilarity
      [mvn] Creating dataDir: /usr/home/hudson/hudson-slave/workspace/Lucene-Solr-Maven-4.x/maven-build/solr/core/src/test/target/test/./solrtest-TestPerFieldSimilarity-1348150920127
      [mvn] Tests run: 7, Failures: 0, Errors: 0, Skipped: 0, Time elapsed: 0.119 sec
      [mvn] Running org.apache.solr.schema.BadIndexSchemaTest
      [mvn] Creating dataDir: /usr/home/hudson/hudson-slave/workspace/Lucene-Solr-Maven-4.x/maven-build/solr/core/src/test/target/test/./solrtest-BadIndexSchemaTest-1348150920249
      [mvn] Creating dataDir: /usr/home/hudson/hudson-slave/workspace/Lucene-Solr-Maven-4.x/maven-build/solr/core/src/test/target/test/./solrtest-BadIndexSchemaTest-1348150920323
      [mvn] 135 T1183 oasc.SolrCore.initCodec SEVERE FieldType 'pulsing1' is configured with a postings format, but the codec does not support it: class org.apache.solr.core.SolrCore$3
      [mvn] Creating dataDir: /usr/home/hudson/hudson-slave/workspace/Lucene-Solr-Maven-4.x/maven-build/solr/core/src/test/target/test/./solrtest-BadIndexSchemaTest-1348150920389
      [mvn] 198 T1183 oass.IndexSchema.readSchema SEVERE FieldType 'sim1' is configured with a similarity, but the global similarity does not support it: class org.apache.solr.search.similarities.DefaultSimilarityFactory
      [mvn] Creating dataDir: /usr/home/hudson/hudson-slave/workspace/Lucene-Solr-Maven-4.x/maven-build/solr/core/src/test/target/test/./solrtest-BadIndexSchemaTest-1348150920448
      [mvn] Creating dataDir: /usr/home/hudson/hudson-slave/workspace/Lucene-Solr-Maven-4.x/maven-build/solr/core/src/test/target/test/./solrtest-BadIndexSchemaTest-1348150920498
      [mvn] Creating dataDir: /usr/home/hudson/hudson-slave/workspace/Lucene-Solr-Maven-4.x/maven-build/solr/core/src/test/target/test/./solrtest-BadIndexSchemaTest-1348150920548
      [mvn] Creating dataDir: /usr/home/hudson/hudson-slave/workspace/Lucene-Solr-Maven-4.x/maven-build/solr/core/src/test/target/test/./solrtest-BadIndexSchemaTest-1348150920597
      [mvn] 375 T3 oasc.CoreContainer.finalize SEVERE CoreContainer was not shutdown prior to finalize(), indicates a bug -- POSSIBLE RESOURCE LEAK!!!  instance=1786371458
      [mvn] 381 T3 oasc.SolrCore.finalize SEVERE REFCOUNT ERROR: unreferenced org.apache.solr.core.SolrCore@66bdb86a (collection1) has a reference count of 1
      [mvn] Creating dataDir: /usr/home/hudson/hudson-slave/workspace/Lucene-Solr-Maven-4.x/maven-build/solr/core/src/test/target/test/./solrtest-BadIndexSchemaTest-1348150920658
      [mvn] Creating dataDir: /usr/home/hudson/hudson-slave/workspace/Lucene-Solr-Maven-4.x/maven-build/solr/core/src/test/target/test/./solrtest-BadIndexSchemaTest-1348150920709
      [mvn] Creating dataDir: /usr/home/hudson/hudson-slave/workspace/Lucene-Solr-Maven-4.x/maven-build/solr/core/src/test/target/test/./solrtest-BadIndexSchemaTest-1348150920793
      [mvn] Creating dataDir: /usr/home/hudson/hudson-slave/workspace/Lucene-Solr-Maven-4.x/maven-build/solr/core/src/test/target/test/./solrtest-BadIndexSchemaTest-1348150920846
      [mvn] Creating dataDir: /usr/home/hudson/hudson-slave/workspace/Lucene-Solr-Maven-4.x/maven-build/solr/core/src/test/target/test/./solrtest-BadIndexSchemaTest-1348150920899
      [mvn] Creating dataDir: /usr/home/hudson/hudson-slave/workspace/Lucene-Solr-Maven-4.x/maven-build/solr/core/src/test/target/test/./solrtest-BadIndexSchemaTest-1348150920949
      [mvn] Creating dataDir: /usr/home/hudson/hudson-slave/workspace/Lucene-Solr-Maven-4.x/maven-build/solr/core/src/test/target/test/./solrtest-BadIndexSchemaTest-1348150921004
      [mvn] 807 T1183 oass.IndexSchema.readSchema SEVERE uniqueKey field (id) can not be the dest of a copyField (src=XXX)
      [mvn] Creating dataDir: /usr/home/hudson/hudson-slave/workspace/Lucene-Solr-Maven-4.x/maven-build/solr/core/src/test/target/test/./solrtest-BadIndexSchemaTest-1348150921055
      [mvn] 859 T1183 oass.IndexSchema.readSchema SEVERE uniqueKey field (null) can not be configured with a default value (XXX)
      [mvn] Creating dataDir: /usr/home/hudson/hudson-slave/workspace/Lucene-Solr-Maven-4.x/maven-build/solr/core/src/test/target/test/./solrtest-BadIndexSchemaTest-1348150921106
      [mvn] 910 T1183 oass.IndexSchema.readSchema SEVERE uniqueKey field (null) can not be configured to be multivalued
      [mvn] Creating dataDir: /usr/home/hudson/hudson-slave/workspace/Lucene-Solr-Maven-4.x/maven-build/solr/core/src/test/target/test/./solrtest-BadIndexSchemaTest-1348150921160
      [mvn] Creating dataDir: /usr/home/hudson/hudson-slave/workspace/Lucene-Solr-Maven-4.x/maven-build/solr/core/src/test/target/test/./solrtest-BadIndexSchemaTest-1348150921212
      [mvn] Tests run: 10, Failures: 0, Errors: 0, Skipped: 0, Time elapsed: 1.033 sec
      [mvn] Running org.apache.solr.cloud.SyncSliceTest
      [mvn] Creating dataDir: /usr/home/hudson/hudson-slave/workspace/Lucene-Solr-Maven-4.x/maven-build/solr/core/src/test/target/test/./solrtest-SyncSliceTest-1348150921292
      [mvn] check const of shard1
      [mvn] client0
      [mvn] PROPS:127.0.0.1:52206_solr_collection1:{"shard":"shard1","roles":null,"state":"active","core":"collection1","collection":"collection1","node_name":"127.0.0.1:52206_solr","base_url":"http://127.0.0.1:52206/solr","leader":"true"}
      [mvn]  live:true
      [mvn]  num:4
      [mvn] 
      [mvn] client1
      [mvn] PROPS:127.0.0.1:51453_solr_collection1:{"shard":"shard1","roles":null,"state":"active","core":"collection1","collection":"collection1","node_name":"127.0.0.1:51453_solr","base_url":"http://127.0.0.1:51453/solr"}
      [mvn]  live:true
      [mvn]  num:2
      [mvn] 
      [mvn] ######shard1 is not consistent.  Got 4 from http://127.0.0.1:52206/solr/collection1lastClient and got 2 from http://127.0.0.1:51453/solr/collection1
      [mvn] ######http://127.0.0.1:52206/solr/collection1: {numFound=4,start=0,docs=[SolrDocument{id=0, _version_=1413638714484064256}, SolrDocument{id=1, _version_=1413638714496647168}, SolrDocument{id=2, _version_=1413638714507132928}, SolrDocument{id=3, _version_=1413638714516570112}]}
      [mvn] ######http://127.0.0.1:51453/solr/collection1: {numFound=2,start=0,docs=[SolrDocument{id=0, _version_=1413638714484064256}, SolrDocument{id=1, _version_=1413638714496647168}]}
      [mvn] ###### sizes=4,2
      [mvn] ###### Only in http://127.0.0.1:52206/solr/collection1: [{id=3, _version_=1413638714516570112}, {id=2, _version_=1413638714507132928}]
      [mvn] client2
      [mvn] PROPS:127.0.0.1:52185_solr_collection1:{"shard":"shard1","roles":null,"state":"active","core":"collection1","collection":"collection1","node_name":"127.0.0.1:52185_solr","base_url":"http://127.0.0.1:52185/solr"}
      [mvn]  live:true
      [mvn]  num:3
      [mvn] 
      [mvn] client3
      [mvn] PROPS:127.0.0.1:13244_solr_collection1:{"shard":"shard1","roles":null,"state":"active","core":"collection1","collection":"collection1","node_name":"127.0.0.1:13244_solr","base_url":"http://127.0.0.1:13244/solr"}
      [mvn]  live:true
      [mvn]  num:4
      [mvn] 
      [mvn] Control Docs:4
      [mvn] check const of shard1
      [mvn] client0
      [mvn] PROPS:127.0.0.1:52206_solr_collection1:{"shard":"shard1","roles":null,"state":"active","core":"collection1","collection":"collection1","node_name":"127.0.0.1:52206_solr","base_url":"http://127.0.0.1:52206/solr","leader":"true"}
      [mvn]  live:true
      [mvn]  num:4
      [mvn] 
      [mvn] client1
      [mvn] PROPS:127.0.0.1:51453_solr_collection1:{"shard":"shard1","roles":null,"state":"active","core":"collection1","collection":"collection1","node_name":"127.0.0.1:51453_solr","base_url":"http://127.0.0.1:51453/solr"}
      [mvn]  live:true
      [mvn]  num:4
      [mvn] 
      [mvn] client2
      [mvn] PROPS:127.0.0.1:52185_solr_collection1:{"shard":"shard1","roles":null,"state":"active","core":"collection1","collection":"collection1","node_name":"127.0.0.1:52185_solr","base_url":"http://127.0.0.1:52185/solr"}
      [mvn]  live:true
      [mvn]  num:4
      [mvn] 
      [mvn] client3
      [mvn] PROPS:127.0.0.1:13244_solr_collection1:{"shard":"shard1","roles":null,"state":"active","core":"collection1","collection":"collection1","node_name":"127.0.0.1:13244_solr","base_url":"http://127.0.0.1:13244/solr"}
      [mvn]  live:true
      [mvn]  num:4
      [mvn] 
      [mvn] Control Docs:5
      [mvn] check const of shard1
      [mvn] client0
      [mvn] PROPS:127.0.0.1:52206_solr_collection1:{"shard":"shard1","roles":null,"state":"active","core":"collection1","collection":"collection1","node_name":"127.0.0.1:52206_solr","base_url":"http://127.0.0.1:52206/solr"}
      [mvn] error contacting client: IOException occured when talking to server at: http://127.0.0.1:52206/solr/collection1
      [mvn] 
      [mvn] client1
      [mvn] PROPS:127.0.0.1:51453_solr_collection1:{"shard":"shard1","roles":null,"state":"active","core":"collection1","collection":"collection1","node_name":"127.0.0.1:51453_solr","base_url":"http://127.0.0.1:51453/solr","leader":"true"}
      [mvn]  live:true
      [mvn]  num:5
      [mvn] 
      [mvn] client2
      [mvn] PROPS:127.0.0.1:52185_solr_collection1:{"shard":"shard1","roles":null,"state":"active","core":"collection1","collection":"collection1","node_name":"127.0.0.1:52185_solr","base_url":"http://127.0.0.1:52185/solr"}
      [mvn]  live:true
      [mvn]  num:5
      [mvn] 
      [mvn] client3
      [mvn] PROPS:127.0.0.1:13244_solr_collection1:{"shard":"shard1","roles":null,"state":"active","core":"collection1","collection":"collection1","node_name":"127.0.0.1:13244_solr","base_url":"http://127.0.0.1:13244/solr"}
      [mvn]  live:true
      [mvn]  num:5
      [mvn] 
      [mvn] check const of shard1
      [mvn] client0
      [mvn] PROPS:127.0.0.1:52206_solr_collection1:{"shard":"shard1","roles":null,"state":"active","core":"collection1","collection":"collection1","node_name":"127.0.0.1:52206_solr","base_url":"http://127.0.0.1:52206/solr"}
      [mvn]  live:true
      [mvn]  num:5
      [mvn] 
      [mvn] client1
      [mvn] PROPS:127.0.0.1:51453_solr_collection1:{"shard":"shard1","roles":null,"state":"active","core":"collection1","collection":"collection1","node_name":"127.0.0.1:51453_solr","base_url":"http://127.0.0.1:51453/solr","leader":"true"}
      [mvn]  live:true
      [mvn]  num:305
      [mvn] 
      [mvn] ######shard1 is not consistent.  Got 5 from http://127.0.0.1:52206/solr/collection1lastClient and got 305 from http://127.0.0.1:51453/solr/collection1
      [mvn] ######http://127.0.0.1:52206/solr/collection1: {numFound=5,start=0,docs=[SolrDocument{id=0, _version_=1413638714484064256}, SolrDocument{id=1, _version_=1413638714496647168}, SolrDocument{id=2, _version_=1413638714507132928}, SolrDocument{id=3, _version_=1413638714516570112}, SolrDocument{id=4, _version_=1413638717172613120}]}
      [mvn] ######http://127.0.0.1:51453/solr/collection1: {numFound=305,start=0,docs=[SolrDocument{id=0, _version_=1413638714484064256}, SolrDocument{id=1, _version_=1413638714496647168}, SolrDocument{id=2, _version_=1413638714507132928}, SolrDocument{id=3, _version_=1413638714516570112}, SolrDocument{id=4, _version_=1413638717172613120}, SolrDocument{id=5, _version_=1413638726598262784}, SolrDocument{id=6, _version_=1413638726610845696}, SolrDocument{id=7, _version_=1413638726620282880}, SolrDocument{id=8, _version_=1413638726629720064}, SolrDocument{id=9, _version_=1413638726639157248}, SolrDocument{id=10, _version_=1413638726648594432}, SolrDocument{id=11, _version_=1413638726658031616}, SolrDocument{id=12, _version_=1413638726667468800}, SolrDocument{id=13, _version_=1413638726676905984}, SolrDocument{id=14, _version_=1413638726688440320}, SolrDocument{id=15, _version_=1413638726705217536}, SolrDocument{id=16, _version_=1413638726715703296}, SolrDocument{id=17, _version_=1413638726725140480}, SolrDocument{id=18, _version_=1413638726734577664}, SolrDocument{id=19, _version_=1413638726744014848}, SolrDocument{id=20, _version_=1413638726753452032}, SolrDocument{id=21, _version_=1413638726763937792}, SolrDocument{id=22, _version_=1413638726773374976}, SolrDocument{id=23, _version_=1413638726782812160}, SolrDocument{id=24, _version_=1413638726795395072}, SolrDocument{id=25, _version_=1413638726812172288}, SolrDocument{id=26, _version_=1413638726822658048}, SolrDocument{id=27, _version_=1413638726832095232}, SolrDocument{id=28, _version_=1413638726841532416}, SolrDocument{id=29, _version_=1413638726850969600}, SolrDocument{id=30, _version_=1413638726860406784}, SolrDocument{id=31, _version_=1413638726869843968}, SolrDocument{id=32, _version_=1413638726879281152}, SolrDocument{id=33, _version_=1413638726888718336}, SolrDocument{id=34, _version_=1413638726901301248}, SolrDocument{id=35, _version_=1413638726918078464}, SolrDocument{id=36, _version_=1413638726928564224}, SolrDocument{id=37, _version_=1413638726938001408}, SolrDocument{id=38, _version_=1413638726947438592}, SolrDocument{id=39, _version_=1413638726956875776}, SolrDocument{id=40, _version_=1413638726966312960}, SolrDocument{id=41, _version_=1413638726975750144}, SolrDocument{id=42, _version_=1413638726985187328}, SolrDocument{id=43, _version_=1413638726994624512}, SolrDocument{id=44, _version_=1413638727007207424}, SolrDocument{id=45, _version_=1413638727025033216}, SolrDocument{id=46, _version_=1413638727036567552}, SolrDocument{id=47, _version_=1413638727046004736}, SolrDocument{id=48, _version_=1413638727055441920}, SolrDocument{id=49, _version_=1413638727064879104}, SolrDocument{id=50, _version_=1413638727075364864}, SolrDocument{id=51, _version_=1413638727084802048}, SolrDocument{id=52, _version_=1413638727094239232}, SolrDocument{id=53, _version_=1413638727103676416}, SolrDocument{id=54, _version_=1413638727116259328}, SolrDocument{id=55, _version_=1413638727149813760}, SolrDocument{id=56, _version_=1413638727161348096}, SolrDocument{id=57, _version_=1413638727170785280}, SolrDocument{id=58, _version_=1413638727180222464}, SolrDocument{id=59, _version_=1413638727189659648}, SolrDocument{id=60, _version_=1413638727199096832}, SolrDocument{id=61, _version_=1413638727208534016}, SolrDocument{id=62, _version_=1413638727217971200}, SolrDocument{id=63, _version_=1413638727227408384}, SolrDocument{id=64, _version_=1413638727258865664}, SolrDocument{id=65, _version_=1413638727273545728}, SolrDocument{id=66, _version_=1413638727284031488}, SolrDocument{id=67, _version_=1413638727293468672}, SolrDocument{id=68, _version_=1413638727302905856}, SolrDocument{id=69, _version_=1413638727312343040}, SolrDocument{id=70, _version_=1413638727321780224}, SolrDocument{id=71, _version_=1413638727331217408}, SolrDocument{id=72, _version_=1413638727340654592}, SolrDocument{id=73, _version_=1413638727350091776}, SolrDocument{id=74, _version_=1413638727362674688}, SolrDocument{id=75, _version_=1413638727376306176}, SolrDocument{id=76, _version_=1413638727387840512}, SolrDocument{id=77, _version_=1413638727397277696}, SolrDocument{id=78, _version_=1413638727406714880}, SolrDocument{id=79, _version_=1413638727416152064}, SolrDocument{id=80, _version_=1413638727425589248}, SolrDocument{id=81, _version_=1413638727435026432}, SolrDocument{id=82, _version_=1413638727444463616}, SolrDocument{id=83, _version_=1413638727453900800}, SolrDocument{id=84, _version_=1413638727465435136}, SolrDocument{id=85, _version_=1413638727482212352}, SolrDocument{id=86, _version_=1413638727493746688}, SolrDocument{id=87, _version_=1413638727504232448}, SolrDocument{id=88, _version_=1413638727513669632}, SolrDocument{id=89, _version_=1413638727523106816}, SolrDocument{id=90, _version_=1413638727532544000}, SolrDocument{id=91, _version_=1413638727541981184}, SolrDocument{id=92, _version_=1413638727551418368}, SolrDocument{id=93, _version_=1413638727560855552}, SolrDocument{id=94, _version_=1413638727573438464}, SolrDocument{id=95, _version_=1413638727590215680}, SolrDocument{id=96, _version_=1413638727600701440}, SolrDocument{id=97, _version_=1413638727610138624}, SolrDocument{id=98, _version_=1413638727619575808}, SolrDocument{id=99, _version_=1413638727630061568}, SolrDocument{id=100, _version_=1413638727639498752}, SolrDocument{id=101, _version_=1413638727648935936}, SolrDocument{id=102, _version_=1413638727658373120}, SolrDocument{id=103, _version_=1413638727667810304}, SolrDocument{id=104, _version_=1413638727680393216}, SolrDocument{id=105, _version_=1413638727695073280}, SolrDocument{id=106, _version_=1413638727705559040}, SolrDocument{id=107, _version_=1413638727714996224}, SolrDocument{id=108, _version_=1413638727724433408}, SolrDocument{id=109, _version_=1413638727733870592}, SolrDocument{id=110, _version_=1413638727743307776}, SolrDocument{id=111, _version_=1413638727752744960}, SolrDocument{id=112, _version_=1413638727762182144}, SolrDocument{id=113, _version_=1413638727771619328}, SolrDocument{id=114, _version_=1413638727784202240}, SolrDocument{id=115, _version_=1413638727800979456}, SolrDocument{id=116, _version_=1413638727811465216}, SolrDocument{id=117, _version_=1413638727820902400}, SolrDocument{id=118, _version_=1413638727830339584}, SolrDocument{id=119, _version_=1413638727839776768}, SolrDocument{id=120, _version_=1413638727849213952}, SolrDocument{id=121, _version_=1413638727858651136}, SolrDocument{id=122, _version_=1413638727868088320}, SolrDocument{id=123, _version_=1413638727877525504}, SolrDocument{id=124, _version_=1413638727890108416}, SolrDocument{id=125, _version_=1413638727925760000}, SolrDocument{id=126, _version_=1413638727937294336}, SolrDocument{id=127, _version_=1413638727946731520}, SolrDocument{id=128, _version_=1413638727956168704}, SolrDocument{id=129, _version_=1413638727965605888}, SolrDocument{id=130, _version_=1413638727975043072}, SolrDocument{id=131, _version_=1413638727984480256}, SolrDocument{id=132, _version_=1413638727998111744}, SolrDocument{id=133, _version_=1413638728008597504}, SolrDocument{id=134, _version_=1413638728036909056}, SolrDocument{id=135, _version_=1413638728058929152}, SolrDocument{id=136, _version_=1413638728071512064}, SolrDocument{id=137, _version_=1413638728081997824}, SolrDocument{id=138, _version_=1413638728092483584}, SolrDocument{id=139, _version_=1413638728102969344}, SolrDocument{id=140, _version_=1413638728113455104}, SolrDocument{id=141, _version_=1413638728123940864}, SolrDocument{id=142, _version_=1413638728133378048}, SolrDocument{id=143, _version_=1413638728142815232}, SolrDocument{id=144, _version_=1413638728157495296}, SolrDocument{id=145, _version_=1413638728173223936}, SolrDocument{id=146, _version_=1413638728182661120}, SolrDocument{id=147, _version_=1413638728192098304}, SolrDocument{id=148, _version_=1413638728201535488}, SolrDocument{id=149, _version_=1413638728210972672}, SolrDocument{id=150, _version_=1413638728220409856}, SolrDocument{id=151, _version_=1413638728229847040}, SolrDocument{id=152, _version_=1413638728239284224}, SolrDocument{id=153, _version_=1413638728248721408}, SolrDocument{id=154, _version_=1413638728261304320}, SolrDocument{id=155, _version_=1413638728277032960}, SolrDocument{id=156, _version_=1413638728287518720}, SolrDocument{id=157, _version_=1413638728296955904}, SolrDocument{id=158, _version_=1413638728306393088}, SolrDocument{id=159, _version_=1413638728315830272}, SolrDocument{id=160, _version_=1413638728325267456}, SolrDocument{id=161, _version_=1413638728334704640}, SolrDocument{id=162, _version_=1413638728344141824}, SolrDocument{id=163, _version_=1413638728353579008}, SolrDocument{id=164, _version_=1413638728366161920}, SolrDocument{id=165, _version_=1413638728381890560}, SolrDocument{id=166, _version_=1413638728392376320}, SolrDocument{id=167, _version_=1413638728401813504}, SolrDocument{id=168, _version_=1413638728411250688}, SolrDocument{id=169, _version_=1413638728420687872}, SolrDocument{id=170, _version_=1413638728430125056}, SolrDocument{id=171, _version_=1413638728439562240}, SolrDocument{id=172, _version_=1413638728448999424}, SolrDocument{id=173, _version_=1413638728458436608}, SolrDocument{id=174, _version_=1413638728469970944}, SolrDocument{id=175, _version_=1413638728486748160}, SolrDocument{id=176, _version_=1413638728497233920}, SolrDocument{id=177, _version_=1413638728506671104}, SolrDocument{id=178, _version_=1413638728516108288}, SolrDocument{id=179, _version_=1413638728525545472}, SolrDocument{id=180, _version_=1413638728564342784}, SolrDocument{id=181, _version_=1413638728573779968}, SolrDocument{id=182, _version_=1413638728583217152}, SolrDocument{id=183, _version_=1413638728592654336}, SolrDocument{id=184, _version_=1413638728605237248}, SolrDocument{id=185, _version_=1413638728624111616}, SolrDocument{id=186, _version_=1413638728635645952}, SolrDocument{id=187, _version_=1413638728645083136}, SolrDocument{id=188, _version_=1413638728654520320}, SolrDocument{id=189, _version_=1413638728663957504}, SolrDocument{id=190, _version_=1413638728673394688}, SolrDocument{id=191, _version_=1413638728682831872}, SolrDocument{id=192, _version_=1413638728692269056}, SolrDocument{id=193, _version_=1413638728702754816}, SolrDocument{id=194, _version_=1413638728714289152}, SolrDocument{id=195, _version_=1413638728745746432}, SolrDocument{id=196, _version_=1413638728756232192}, SolrDocument{id=197, _version_=1413638728765669376}, SolrDocument{id=198, _version_=1413638728775106560}, SolrDocument{id=199, _version_=1413638728784543744}, SolrDocument{id=200, _version_=1413638728793980928}, SolrDocument{id=201, _version_=1413638728803418112}, SolrDocument{id=202, _version_=1413638728812855296}, SolrDocument{id=203, _version_=1413638728822292480}, SolrDocument{id=204, _version_=1413638728842215424}, SolrDocument{id=205, _version_=1413638728861089792}, SolrDocument{id=206, _version_=1413638728871575552}, SolrDocument{id=207, _version_=1413638728881012736}, SolrDocument{id=208, _version_=1413638728890449920}, SolrDocument{id=209, _version_=1413638728899887104}, SolrDocument{id=210, _version_=1413638728909324288}, SolrDocument{id=211, _version_=1413638728918761472}, SolrDocument{id=212, _version_=1413638728928198656}, SolrDocument{id=213, _version_=1413638728937635840}, SolrDocument{id=214, _version_=1413638728951267328}, SolrDocument{id=215, _version_=1413638728966995968}, SolrDocument{id=216, _version_=1413638728977481728}, SolrDocument{id=217, _version_=1413638728986918912}, SolrDocument{id=218, _version_=1413638728996356096}, SolrDocument{id=219, _version_=1413638729005793280}, SolrDocument{id=220, _version_=1413638729015230464}, SolrDocument{id=221, _version_=1413638729024667648}, SolrDocument{id=222, _version_=1413638729034104832}, SolrDocument{id=223, _version_=1413638729043542016}, SolrDocument{id=224, _version_=1413638729056124928}, SolrDocument{id=225, _version_=1413638729071853568}, SolrDocument{id=226, _version_=1413638729082339328}, SolrDocument{id=227, _version_=1413638729091776512}, SolrDocument{id=228, _version_=1413638729101213696}, SolrDocument{id=229, _version_=1413638729110650880}, SolrDocument{id=230, _version_=1413638729120088064}, SolrDocument{id=231, _version_=1413638729129525248}, SolrDocument{id=232, _version_=1413638729138962432}, SolrDocument{id=233, _version_=1413638729148399616}, SolrDocument{id=234, _version_=1413638729160982528}, SolrDocument{id=235, _version_=1413638729175662592}, SolrDocument{id=236, _version_=1413638729186148352}, SolrDocument{id=237, _version_=1413638729195585536}, SolrDocument{id=238, _version_=1413638729205022720}, SolrDocument{id=239, _version_=1413638729214459904}, SolrDocument{id=240, _version_=1413638729223897088}, SolrDocument{id=241, _version_=1413638729233334272}, SolrDocument{id=242, _version_=1413638729242771456}, SolrDocument{id=243, _version_=1413638729252208640}, SolrDocument{id=244, _version_=1413638729264791552}, SolrDocument{id=245, _version_=1413638729280520192}, SolrDocument{id=246, _version_=1413638729291005952}, SolrDocument{id=247, _version_=1413638729300443136}, SolrDocument{id=248, _version_=1413638729309880320}, SolrDocument{id=249, _version_=1413638729319317504}, SolrDocument{id=250, _version_=1413638729328754688}, SolrDocument{id=251, _version_=1413638729338191872}, SolrDocument{id=252, _version_=1413638729347629056}, SolrDocument{id=253, _version_=1413638729357066240}, SolrDocument{id=254, _version_=1413638729369649152}, SolrDocument{id=255, _version_=1413638729385377792}, SolrDocument{id=256, _version_=1413638729394814976}, SolrDocument{id=257, _version_=1413638729404252160}, SolrDocument{id=258, _version_=1413638729413689344}, SolrDocument{id=259, _version_=1413638729423126528}, SolrDocument{id=260, _version_=1413638729432563712}, SolrDocument{id=261, _version_=1413638729442000896}, SolrDocument{id=262, _version_=1413638729451438080}, SolrDocument{id=263, _version_=1413638729460875264}, SolrDocument{id=264, _version_=1413638729473458176}, SolrDocument{id=265, _version_=1413638729509109760}, SolrDocument{id=266, _version_=1413638729520644096}, SolrDocument{id=267, _version_=1413638729530081280}, SolrDocument{id=268, _version_=1413638729539518464}, SolrDocument{id=269, _version_=1413638729548955648}, SolrDocument{id=270, _version_=1413638729558392832}, SolrDocument{id=271, _version_=1413638729567830016}, SolrDocument{id=272, _version_=1413638729577267200}, SolrDocument{id=273, _version_=1413638729586704384}, SolrDocument{id=274, _version_=1413638729607675904}, SolrDocument{id=275, _version_=1413638729624453120}, SolrDocument{id=276, _version_=1413638729634938880}, SolrDocument{id=277, _version_=1413638729644376064}, SolrDocument{id=278, _version_=1413638729653813248}, SolrDocument{id=279, _version_=1413638729663250432}, SolrDocument{id=280, _version_=1413638729672687616}, SolrDocument{id=281, _version_=1413638729682124800}, SolrDocument{id=282, _version_=1413638729691561984}, SolrDocument{id=283, _version_=1413638729700999168}, SolrDocument{id=284, _version_=1413638729714630656}, SolrDocument{id=285, _version_=1413638729732456448}, SolrDocument{id=286, _version_=1413638729742942208}, SolrDocument{id=287, _version_=1413638729752379392}, SolrDocument{id=288, _version_=1413638729761816576}, SolrDocument{id=289, _version_=1413638729771253760}, SolrDocument{id=290, _version_=1413638729780690944}, SolrDocument{id=291, _version_=1413638729790128128}, SolrDocument{id=292, _version_=1413638729799565312}, SolrDocument{id=293, _version_=1413638729809002496}, SolrDocument{id=294, _version_=1413638729820536832}, SolrDocument{id=295, _version_=1413638729838362624}, SolrDocument{id=296, _version_=1413638729848848384}, SolrDocument{id=297, _version_=1413638729858285568}, SolrDocument{id=298, _version_=1413638729868771328}, SolrDocument{id=299, _version_=1413638729879257088}, SolrDocument{id=300, _version_=1413638729888694272}, SolrDocument{id=301, _version_=1413638729898131456}, SolrDocument{id=302, _version_=1413638729907568640}, SolrDocument{id=303, _version_=1413638729917005824}, SolrDocument{id=304, _version_=1413638729929588736}]}
      [mvn] ###### sizes=5,305
      [mvn] ###### Only in http://127.0.0.1:51453/solr/collection1: [{id=264, _version_=1413638729473458176}, {id=96, _version_=1413638727600701440}, {id=293, _version_=1413638729809002496}, {id=280, _version_=1413638729672687616}, {id=46, _version_=1413638727036567552}, {id=23, _version_=1413638726782812160}, {id=298, _version_=1413638729868771328}, {id=243, _version_=1413638729252208640}, {id=11, _version_=1413638726658031616}, {id=82, _version_=1413638727444463616}, {id=215, _version_=1413638728966995968}, {id=286, _version_=1413638729742942208}, {id=177, _version_=1413638728506671104}, {id=267, _version_=1413638729530081280}, {id=184, _version_=1413638728605237248}, {id=300, _version_=1413638729888694272}, {id=137, _version_=1413638728081997824}, {id=86, _version_=1413638727493746688}, {id=246, _version_=1413638729291005952}, {id=51, _version_=1413638727084802048}, {id=94, _version_=1413638727573438464}, {id=148, _version_=1413638728201535488}, {id=38, _version_=1413638726947438592}, {id=20, _version_=1413638726753452032}, {id=154, _version_=1413638728261304320}, {id=250, _version_=1413638729328754688}, {id=128, _version_=1413638727956168704}, {id=168, _version_=1413638728411250688}, {id=135, _version_=1413638728058929152}, {id=115, _version_=1413638727800979456}, {id=226, _version_=1413638729082339328}, {id=43, _version_=1413638726994624512}, {id=6, _version_=1413638726610845696}, {id=218, _version_=1413638728996356096}, {id=276, _version_=1413638729634938880}, {id=29, _version_=1413638726850969600}, {id=170, _version_=1413638728430125056}, {id=292, _version_=1413638729799565312}, {id=187, _version_=1413638728645083136}, {id=181, _version_=1413638728573779968}, {id=61, _version_=1413638727208534016}, {id=196, _version_=1413638728756232192}, {id=109, _version_=1413638727733870592}, {id=223, _version_=1413638729043542016}, {id=230, _version_=1413638729120088064}, {id=60, _version_=1413638727199096832}, {id=211, _version_=1413638728918761472}, {id=282, _version_=1413638729691561984}, {id=159, _version_=1413638728315830272}, {id=121, _version_=1413638727858651136}, {id=101, _version_=1413638727648935936}, {id=54, _version_=1413638727116259328}, {id=66, _version_=1413638727284031488}, {id=155, _version_=1413638728277032960}, {id=104, _version_=1413638727680393216}, {id=165, _version_=1413638728381890560}, {id=288, _version_=1413638729761816576}, {id=271, _version_=1413638729567830016}, {id=231, _version_=1413638729129525248}, {id=39, _version_=1413638726956875776}, {id=191, _version_=1413638728682831872}, {id=117, _version_=1413638727820902400}, {id=88, _version_=1413638727513669632}, {id=151, _version_=1413638728229847040}, {id=212, _version_=1413638728928198656}, {id=175, _version_=1413638728486748160}, {id=158, _version_=1413638728306393088}, {id=201, _version_=1413638728803418112}, {id=70, _version_=1413638727321780224}, {id=142, _version_=1413638728133378048}, {id=15, _version_=1413638726705217536}, {id=76, _version_=1413638727387840512}, {id=56, _version_=1413638727161348096}, {id=85, _version_=1413638727482212352}, {id=261, _version_=1413638729442000896}, {id=17, _version_=1413638726725140480}, {id=92, _version_=1413638727551418368}, {id=116, _version_=1413638727811465216}, {id=225, _version_=1413638729071853568}, {id=188, _version_=1413638728654520320}, {id=224, _version_=1413638729056124928}, {id=176, _version_=1413638728497233920}, {id=275, _version_=1413638729624453120}, {id=277, _version_=1413638729644376064}, {id=162, _version_=1413638728344141824}, {id=113, _version_=1413638727771619328}, {id=256, _version_=1413638729394814976}, {id=233, _version_=1413638729148399616}, {id=30, _version_=1413638726860406784}, {id=291, _version_=1413638729790128128}, {id=91, _version_=1413638727541981184}, {id=80, _version_=1413638727425589248}, {id=147, _version_=1413638728192098304}, {id=219, _version_=1413638729005793280}, {id=52, _version_=1413638727094239232}, {id=237, _version_=1413638729195585536}, {id=37, _version_=1413638726938001408}, {id=134, _version_=1413638728036909056}, {id=87, _version_=1413638727504232448}, {id=77, _version_=1413638727397277696}, {id=138, _version_=1413638728092483584}, {id=205, _version_=1413638728861089792}, {id=296, _version_=1413638729848848384}, {id=129, _version_=1413638727965605888}, {id=10, _version_=1413638726648594432}, {id=207, _version_=1413638728881012736}, {id=26, _version_=1413638726822658048}, {id=281, _version_=1413638729682124800}, {id=235, _version_=1413638729175662592}, {id=16, _version_=1413638726715703296}, {id=213, _version_=1413638728937635840}, {id=157, _version_=1413638728296955904}, {id=208, _version_=1413638728890449920}, {id=93, _version_=1413638727560855552}, {id=200, _version_=1413638728793980928}, {id=73, _version_=1413638727350091776}, {id=301, _version_=1413638729898131456}, {id=35, _version_=1413638726918078464}, {id=71, _version_=1413638727331217408}, {id=304, _version_=1413638729929588736}, {id=222, _version_=1413638729034104832}, {id=118, _version_=1413638727830339584}, {id=152, _version_=1413638728239284224}, {id=227, _version_=1413638729091776512}, {id=249, _version_=1413638729319317504}, {id=272, _version_=1413638729577267200}, {id=81, _version_=1413638727435026432}, {id=199, _version_=1413638728784543744}, {id=180, _version_=1413638728564342784}, {id=47, _version_=1413638727046004736}, {id=171, _version_=1413638728439562240}, {id=240, _version_=1413638729223897088}, {id=33, _version_=1413638726888718336}, {id=67, _version_=1413638727293468672}, {id=122, _version_=1413638727868088320}, {id=141, _version_=1413638728123940864}, {id=193, _version_=1413638728702754816}, {id=100, _version_=1413638727639498752}, {id=59, _version_=1413638727189659648}, {id=238, _version_=1413638729205022720}, {id=266, _version_=1413638729520644096}, {id=98, _version_=1413638727619575808}, {id=42, _version_=1413638726985187328}, {id=260, _version_=1413638729432563712}, {id=108, _version_=1413638727724433408}, {id=163, _version_=1413638728353579008}, {id=55, _version_=1413638727149813760}, {id=153, _version_=1413638728248721408}, {id=112, _version_=1413638727762182144}, {id=161, _version_=1413638728334704640}, {id=253, _version_=1413638729357066240}, {id=36, _version_=1413638726928564224}, {id=114, _version_=1413638727784202240}, {id=265, _version_=1413638729509109760}, {id=107, _version_=1413638727714996224}, {id=284, _version_=1413638729714630656}, {id=125, _version_=1413638727925760000}, {id=31, _version_=1413638726869843968}, {id=9, _version_=1413638726639157248}, {id=79, _version_=1413638727416152064}, {id=244, _version_=1413638729264791552}, {id=124, _version_=1413638727890108416}, {id=78, _version_=1413638727406714880}, {id=195, _version_=1413638728745746432}, {id=14, _version_=1413638726688440320}, {id=214, _version_=1413638728951267328}, {id=172, _version_=1413638728448999424}, {id=204, _version_=1413638728842215424}, {id=194, _version_=1413638728714289152}, {id=273, _version_=1413638729586704384}, {id=245, _version_=1413638729280520192}, {id=146, _version_=1413638728182661120}, {id=27, _version_=1413638726832095232}, {id=220, _version_=1413638729015230464}, {id=90, _version_=1413638727532544000}, {id=232, _version_=1413638729138962432}, {id=290, _version_=1413638729780690944}, {id=130, _version_=1413638727975043072}, {id=257, _version_=1413638729404252160}, {id=297, _version_=1413638729858285568}, {id=206, _version_=1413638728871575552}, {id=295, _version_=1413638729838362624}, {id=58, _version_=1413638727180222464}, {id=111, _version_=1413638727752744960}, {id=53, _version_=1413638727103676416}, {id=209, _version_=1413638728899887104}, {id=263, _version_=1413638729460875264}, {id=13, _version_=1413638726676905984}, {id=285, _version_=1413638729732456448}, {id=123, _version_=1413638727877525504}, {id=103, _version_=1413638727667810304}, {id=95, _version_=1413638727590215680}, {id=68, _version_=1413638727302905856}, {id=198, _version_=1413638728775106560}, {id=64, _version_=1413638727258865664}, {id=241, _version_=1413638729233334272}, {id=228, _version_=1413638729101213696}, {id=248, _version_=1413638729309880320}, {id=166, _version_=1413638728392376320}, {id=221, _version_=1413638729024667648}, {id=63, _version_=1413638727227408384}, {id=133, _version_=1413638728008597504}, {id=72, _version_=1413638727340654592}, {id=99, _version_=1413638727630061568}, {id=302, _version_=1413638729907568640}, {id=239, _version_=1413638729214459904}, {id=127, _version_=1413638727946731520}, {id=41, _version_=1413638726975750144}, {id=139, _version_=1413638728102969344}, {id=32, _version_=1413638726879281152}, {id=278, _version_=1413638729653813248}, {id=259, _version_=1413638729423126528}, {id=21, _version_=1413638726763937792}, {id=105, _version_=1413638727695073280}, {id=84, _version_=1413638727465435136}, {id=189, _version_=1413638728663957504}, {id=119, _version_=1413638727839776768}, {id=203, _version_=1413638728822292480}, {id=173, _version_=1413638728458436608}, {id=156, _version_=1413638728287518720}, {id=48, _version_=1413638727055441920}, {id=5, _version_=1413638726598262784}, {id=258, _version_=1413638729413689344}, {id=19, _version_=1413638726744014848}, {id=242, _version_=1413638729242771456}, {id=289, _version_=1413638729771253760}, {id=274, _version_=1413638729607675904}, {id=131, _version_=1413638727984480256}, {id=126, _version_=1413638727937294336}, {id=299, _version_=1413638729879257088}, {id=97, _version_=1413638727610138624}, {id=164, _version_=1413638728366161920}, {id=89, _version_=1413638727523106816}, {id=247, _version_=1413638729300443136}, {id=69, _version_=1413638727312343040}, {id=40, _version_=1413638726966312960}, {id=216, _version_=1413638728977481728}, {id=178, _version_=1413638728516108288}, {id=57, _version_=1413638727170785280}, {id=160, _version_=1413638728325267456}, {id=34, _version_=1413638726901301248}, {id=18, _version_=1413638726734577664}, {id=236, _version_=1413638729186148352}, {id=185, _version_=1413638728624111616}, {id=83, _version_=1413638727453900800}, {id=65, _version_=1413638727273545728}, {id=251, _version_=1413638729338191872}, {id=268, _version_=1413638729539518464}, {id=22, _version_=1413638726773374976}, {id=294, _version_=1413638729820536832}, {id=179, _version_=1413638728525545472}, {id=279, _version_=1413638729663250432}, {id=50, _version_=1413638727075364864}, {id=7, _version_=1413638726620282880}, {id=192, _version_=1413638728692269056}, {id=74, _version_=1413638727362674688}, {id=217, _version_=1413638728986918912}, {id=287, _version_=1413638729752379392}, {id=120, _version_=1413638727849213952}, {id=8, _version_=1413638726629720064}, {id=62, _version_=1413638727217971200}, {id=45, _version_=1413638727025033216}, {id=182, _version_=1413638728583217152}, {id=149, _version_=1413638728210972672}, {id=190, _version_=1413638728673394688}, {id=229, _version_=1413638729110650880}, {id=167, _version_=1413638728401813504}, {id=49, _version_=1413638727064879104}, {id=169, _version_=1413638728420687872}, {id=106, _version_=1413638727705559040}, {id=28, _version_=1413638726841532416}, {id=144, _version_=1413638728157495296}, {id=270, _version_=1413638729558392832}, {id=197, _version_=1413638728765669376}, {id=234, _version_=1413638729160982528}, {id=140, _version_=1413638728113455104}, {id=75, _version_=1413638727376306176}, {id=254, _version_=1413638729369649152}, {id=102, _version_=1413638727658373120}, {id=269, _version_=1413638729548955648}, {id=202, _version_=1413638728812855296}, {id=303, _version_=1413638729917005824}, {id=210, _version_=1413638728909324288}, {id=150, _version_=1413638728220409856}, {id=283, _version_=1413638729700999168}, {id=110, _version_=1413638727743307776}, {id=132, _version_=1413638727998111744}, {id=25, _version_=1413638726812172288}, {id=44, _version_=1413638727007207424}, {id=174, _version_=1413638728469970944}, {id=145, _version_=1413638728173223936}, {id=186, _version_=1413638728635645952}, {id=12, _version_=1413638726667468800}, {id=183, _version_=1413638728592654336}, {id=136, _version_=1413638728071512064}, {id=252, _version_=1413638729347629056}, {id=255, _version_=1413638729385377792}, {id=262, _version_=1413638729451438080}, {id=143, _version_=1413638728142815232}, {id=24, _version_=1413638726795395072}]
      [mvn] client2
      [mvn] PROPS:127.0.0.1:52185_solr_collection1:{"shard":"shard1","roles":null,"state":"active","core":"collection1","collection":"collection1","node_name":"127.0.0.1:52185_solr","base_url":"http://127.0.0.1:52185/solr"}
      [mvn]  live:true
      [mvn]  num:305
      [mvn] 
      [mvn] client3
      [mvn] PROPS:127.0.0.1:13244_solr_collection1:{"shard":"shard1","roles":null,"state":"active","core":"collection1","collection":"collection1","node_name":"127.0.0.1:13244_solr","base_url":"http://127.0.0.1:13244/solr"}
      [mvn]  live:true
      [mvn]  num:5
      [mvn] 
      [mvn] 59154 T1245 oasc.SolrException.log SEVERE Sync Failed
      [mvn] 59195 T1259 oasc.SolrException.log SEVERE Sync Failed
      [mvn] 59215 T1302 oasc.SolrException.log SEVERE Sync Failed
      [mvn] ASYNC  NEW_CORE C2 name=collection1 org.apache.solr.core.SolrCore@f9ae96e url=http://127.0.0.1:13244/solr/collection1 node=127.0.0.1:13244_solr
      [mvn] 60218 T1330 C2 P13244 oasc.SolrException.log SEVERE Error while trying to recover. core=collection1
      [mvn] 60218 T1330 C2 P13244 oasc.SolrException.log SEVERE Error while trying to recover. core=collection1:org.apache.solr.common.SolrException: No registered leader was found, collection:collection1 slice:shard1
      [mvn] 		at org.apache.solr.common.cloud.ZkStateReader.getLeaderProps(ZkStateReader.java:413)
      [mvn] 		at org.apache.solr.common.cloud.ZkStateReader.getLeaderProps(ZkStateReader.java:399)
      [mvn] 		at org.apache.solr.cloud.RecoveryStrategy.doRecovery(RecoveryStrategy.java:318)
      [mvn] 		at org.apache.solr.cloud.RecoveryStrategy.run(RecoveryStrategy.java:220)
      [mvn] 	
      [mvn] 60218 T1330 C2 P13244 oasc.RecoveryStrategy.doRecovery SEVERE Recovery failed - trying again... core=collection1
      [mvn] 60219 T1330 C2 P13244 oasc.SolrException.log SEVERE Recovery failed - max retries exceeded. core=collection1
      [mvn] 60219 T1330 C2 P13244 oasc.SolrException.log SEVERE Recovery failed - I give up. core=collection1
      [mvn] ASYNC  NEW_CORE C3 name=collection1 org.apache.solr.core.SolrCore@52ac9a2c url=http://127.0.0.1:52206/solr/collection1 node=127.0.0.1:52206_solr
      [mvn] 60238 T1333 C3 P52206 oasc.SolrException.log SEVERE Error while trying to recover. core=collection1
      [mvn] 60238 T1333 C3 P52206 oasc.SolrException.log SEVERE Error while trying to recover. core=collection1:org.apache.solr.common.SolrException: No registered leader was found, collection:collection1 slice:shard1
      [mvn] 		at org.apache.solr.common.cloud.ZkStateReader.getLeaderProps(ZkStateReader.java:413)
      [mvn] 		at org.apache.solr.common.cloud.ZkStateReader.getLeaderProps(ZkStateReader.java:399)
      [mvn] 		at org.apache.solr.cloud.RecoveryStrategy.doRecovery(RecoveryStrategy.java:318)
      [mvn] 		at org.apache.solr.cloud.RecoveryStrategy.run(RecoveryStrategy.java:220)
      [mvn] 	
      [mvn] 60238 T1333 C3 P52206 oasc.RecoveryStrategy.doRecovery SEVERE Recovery failed - trying again... core=collection1
      [mvn] 60239 T1333 C3 P52206 oasc.SolrException.log SEVERE Recovery failed - max retries exceeded. core=collection1
      [mvn] 60239 T1333 C3 P52206 oasc.SolrException.log SEVERE Recovery failed - I give up. core=collection1
      [mvn] 61241 T1334 C2 P13244 oasc.SolrException.log SEVERE Error while trying to recover. core=collection1
      [mvn] 61241 T1334 C2 P13244 oasc.SolrException.log SEVERE Error while trying to recover. core=collection1:org.apache.solr.common.SolrException: No registered leader was found, collection:collection1 slice:shard1
      [mvn] 		at org.apache.solr.common.cloud.ZkStateReader.getLeaderProps(ZkStateReader.java:413)
      [mvn] 		at org.apache.solr.common.cloud.ZkStateReader.getLeaderProps(ZkStateReader.java:399)
      [mvn] 		at org.apache.solr.cloud.RecoveryStrategy.doRecovery(RecoveryStrategy.java:318)
      [mvn] 		at org.apache.solr.cloud.RecoveryStrategy.run(RecoveryStrategy.java:220)
      [mvn] 	
      [mvn] 61241 T1334 C2 P13244 oasc.RecoveryStrategy.doRecovery SEVERE Recovery failed - trying again... core=collection1
      [mvn]  C3_STATE=coll:collection1 core:collection1 props:{shard=shard1, roles=null, state=recovery_failed, core=collection1, collection=collection1, node_name=127.0.0.1:52206_solr, base_url=http://127.0.0.1:52206/solr}
      [mvn] 61260 T1335 C3 P52206 oasc.SolrException.log SEVERE Error while trying to recover. core=collection1
      [mvn] 61260 T1335 C3 P52206 oasc.SolrException.log SEVERE Error while trying to recover. core=collection1:org.apache.solr.common.SolrException: No registered leader was found, collection:collection1 slice:shard1
      [mvn] 		at org.apache.solr.common.cloud.ZkStateReader.getLeaderProps(ZkStateReader.java:413)
      [mvn] 		at org.apache.solr.common.cloud.ZkStateReader.getLeaderProps(ZkStateReader.java:399)
      [mvn] 		at org.apache.solr.cloud.RecoveryStrategy.doRecovery(RecoveryStrategy.java:318)
      [mvn] 		at org.apache.solr.cloud.RecoveryStrategy.run(RecoveryStrategy.java:220)
      [mvn] 	
      [mvn] 61260 T1335 C3 P52206 oasc.RecoveryStrategy.doRecovery SEVERE Recovery failed - trying again... core=collection1
      [mvn] 64264 T1334 C2 P13244 oasc.SolrException.log SEVERE Error while trying to recover. core=collection1
      [mvn] 64264 T1334 C2 P13244 oasc.SolrException.log SEVERE Error while trying to recover. core=collection1:org.apache.solr.common.SolrException: No registered leader was found, collection:collection1 slice:shard1
      [mvn] 		at org.apache.solr.common.cloud.ZkStateReader.getLeaderProps(ZkStateReader.java:413)
      [mvn] 		at org.apache.solr.common.cloud.ZkStateReader.getLeaderProps(ZkStateReader.java:399)
      [mvn] 		at org.apache.solr.cloud.RecoveryStrategy.doRecovery(RecoveryStrategy.java:318)
      [mvn] 		at org.apache.solr.cloud.RecoveryStrategy.run(RecoveryStrategy.java:220)
      [mvn] 	
      [mvn] 64264 T1334 C2 P13244 oasc.RecoveryStrategy.doRecovery SEVERE Recovery failed - trying again... core=collection1
      [mvn] 64282 T1335 C3 P52206 oasc.SolrException.log SEVERE Error while trying to recover. core=collection1
      [mvn] 64282 T1335 C3 P52206 oasc.SolrException.log SEVERE Error while trying to recover. core=collection1:org.apache.solr.common.SolrException: No registered leader was found, collection:collection1 slice:shard1
      [mvn] 		at org.apache.solr.common.cloud.ZkStateReader.getLeaderProps(ZkStateReader.java:413)
      [mvn] 		at org.apache.solr.common.cloud.ZkStateReader.getLeaderProps(ZkStateReader.java:399)
      [mvn] 		at org.apache.solr.cloud.RecoveryStrategy.doRecovery(RecoveryStrategy.java:318)
      [mvn] 		at org.apache.solr.cloud.RecoveryStrategy.run(RecoveryStrategy.java:220)
      [mvn] 	
      [mvn] 64282 T1335 C3 P52206 oasc.RecoveryStrategy.doRecovery SEVERE Recovery failed - trying again... core=collection1
      [mvn] 69289 T1334 C2 P13244 oasc.SolrException.log SEVERE Error while trying to recover. core=collection1
      [mvn] 69289 T1334 C2 P13244 oasc.SolrException.log SEVERE Error while trying to recover. core=collection1:org.apache.solr.common.SolrException: No registered leader was found, collection:collection1 slice:shard1
      [mvn] 		at org.apache.solr.common.cloud.ZkStateReader.getLeaderProps(ZkStateReader.java:413)
      [mvn] 		at org.apache.solr.common.cloud.ZkStateReader.getLeaderProps(ZkStateReader.java:399)
      [mvn] 		at org.apache.solr.cloud.RecoveryStrategy.doRecovery(RecoveryStrategy.java:318)
      [mvn] 		at org.apache.solr.cloud.RecoveryStrategy.run(RecoveryStrategy.java:220)
      [mvn] 	
      [mvn] 69289 T1334 C2 P13244 oasc.RecoveryStrategy.doRecovery SEVERE Recovery failed - trying again... core=collection1
      [mvn] 69306 T1335 C3 P52206 oasc.SolrException.log SEVERE Error while trying to recover. core=collection1
      [mvn] 69306 T1335 C3 P52206 oasc.SolrException.log SEVERE Error while trying to recover. core=collection1:org.apache.solr.common.SolrException: No registered leader was found, collection:collection1 slice:shard1
      [mvn] 		at org.apache.solr.common.cloud.ZkStateReader.getLeaderProps(ZkStateReader.java:413)
      [mvn] 		at org.apache.solr.common.cloud.ZkStateReader.getLeaderProps(ZkStateReader.java:399)
      [mvn] 		at org.apache.solr.cloud.RecoveryStrategy.doRecovery(RecoveryStrategy.java:318)
      [mvn] 		at org.apache.solr.cloud.RecoveryStrategy.run(RecoveryStrategy.java:220)
      [mvn] 	
      [mvn] 69306 T1335 C3 P52206 oasc.RecoveryStrategy.doRecovery SEVERE Recovery failed - trying again... core=collection1
      [mvn] 78317 T1334 C2 P13244 oasc.SolrException.log SEVERE Error while trying to recover. core=collection1
      [mvn] 78317 T1334 C2 P13244 oasc.SolrException.log SEVERE Error while trying to recover. core=collection1:org.apache.solr.common.SolrException: No registered leader was found, collection:collection1 slice:shard1
      [mvn] 		at org.apache.solr.common.cloud.ZkStateReader.getLeaderProps(ZkStateReader.java:413)
      [mvn] 		at org.apache.solr.common.cloud.ZkStateReader.getLeaderProps(ZkStateReader.java:399)
      [mvn] 		at org.apache.solr.cloud.RecoveryStrategy.doRecovery(RecoveryStrategy.java:318)
      [mvn] 		at org.apache.solr.cloud.RecoveryStrategy.run(RecoveryStrategy.java:220)
      [mvn] 	
      [mvn] 78317 T1334 C2 P13244 oasc.RecoveryStrategy.doRecovery SEVERE Recovery failed - trying again... core=collection1
      [mvn] 78335 T1335 C3 P52206 oasc.SolrException.log SEVERE Error while trying to recover. core=collection1
      [mvn] 78335 T1335 C3 P52206 oasc.SolrException.log SEVERE Error while trying to recover. core=collection1:org.apache.solr.common.SolrException: No registered leader was found, collection:collection1 slice:shard1
      [mvn] 		at org.apache.solr.common.cloud.ZkStateReader.getLeaderProps(ZkStateReader.java:413)
      [mvn] 		at org.apache.solr.common.cloud.ZkStateReader.getLeaderProps(ZkStateReader.java:399)
      [mvn] 		at org.apache.solr.cloud.RecoveryStrategy.doRecovery(RecoveryStrategy.java:318)
      [mvn] 		at org.apache.solr.cloud.RecoveryStrategy.run(RecoveryStrategy.java:220)
      [mvn] 	
      [mvn] 78335 T1335 C3 P52206 oasc.RecoveryStrategy.doRecovery SEVERE Recovery failed - trying again... core=collection1
      [mvn] 95353 T1334 C2 P13244 oasc.SolrException.log SEVERE Error while trying to recover. core=collection1
      [mvn] 95353 T1334 C2 P13244 oasc.SolrException.log SEVERE Error while trying to recover. core=collection1:org.apache.solr.common.SolrException: No registered leader was found, collection:collection1 slice:shard1
      [mvn] 		at org.apache.solr.common.cloud.ZkStateReader.getLeaderProps(ZkStateReader.java:413)
      [mvn] 		at org.apache.solr.common.cloud.ZkStateReader.getLeaderProps(ZkStateReader.java:399)
      [mvn] 		at org.apache.solr.cloud.RecoveryStrategy.doRecovery(RecoveryStrategy.java:318)
      [mvn] 		at org.apache.solr.cloud.RecoveryStrategy.run(RecoveryStrategy.java:220)
      [mvn] 	
      [mvn] 95353 T1334 C2 P13244 oasc.RecoveryStrategy.doRecovery SEVERE Recovery failed - trying again... core=collection1
      [mvn] 95371 T1335 C3 P52206 oasc.SolrException.log SEVERE Error while trying to recover. core=collection1
      [mvn] 95371 T1335 C3 P52206 oasc.SolrException.log SEVERE Error while trying to recover. core=collection1:org.apache.solr.common.SolrException: No registered leader was found, collection:collection1 slice:shard1
      [mvn] 		at org.apache.solr.common.cloud.ZkStateReader.getLeaderProps(ZkStateReader.java:413)
      [mvn] 		at org.apache.solr.common.cloud.ZkStateReader.getLeaderProps(ZkStateReader.java:399)
      [mvn] 		at org.apache.solr.cloud.RecoveryStrategy.doRecovery(RecoveryStrategy.java:318)
      [mvn] 		at org.apache.solr.cloud.RecoveryStrategy.run(RecoveryStrategy.java:220)
      [mvn] 	
      [mvn] 95371 T1335 C3 P52206 oasc.RecoveryStrategy.doRecovery SEVERE Recovery failed - trying again... core=collection1
      [mvn] 128405 T1334 C2 P13244 oasc.SolrException.log SEVERE Error while trying to recover. core=collection1
      [mvn] 128405 T1334 C2 P13244 oasc.SolrException.log SEVERE Error while trying to recover. core=collection1:org.apache.solr.common.SolrException: No registered leader was found, collection:collection1 slice:shard1
      [mvn] 		at org.apache.solr.common.cloud.ZkStateReader.getLeaderProps(ZkStateReader.java:413)
      [mvn] 		at org.apache.solr.common.cloud.ZkStateReader.getLeaderProps(ZkStateReader.java:399)
      [mvn] 		at org.apache.solr.cloud.RecoveryStrategy.doRecovery(RecoveryStrategy.java:318)
      [mvn] 		at org.apache.solr.cloud.RecoveryStrategy.run(RecoveryStrategy.java:220)
      [mvn] 	
      [mvn] 128405 T1334 C2 P13244 oasc.RecoveryStrategy.doRecovery SEVERE Recovery failed - trying again... core=collection1
      [mvn] 128423 T1335 C3 P52206 oasc.SolrException.log SEVERE Error while trying to recover. core=collection1
      [mvn] 128423 T1335 C3 P52206 oasc.SolrException.log SEVERE Error while trying to recover. core=collection1:org.apache.solr.common.SolrException: No registered leader was found, collection:collection1 slice:shard1
      [mvn] 		at org.apache.solr.common.cloud.ZkStateReader.getLeaderProps(ZkStateReader.java:413)
      [mvn] 		at org.apache.solr.common.cloud.ZkStateReader.getLeaderProps(ZkStateReader.java:399)
      [mvn] 		at org.apache.solr.cloud.RecoveryStrategy.doRecovery(RecoveryStrategy.java:318)
      [mvn] 		at org.apache.solr.cloud.RecoveryStrategy.run(RecoveryStrategy.java:220)
      [mvn] 	
      [mvn] 128423 T1335 C3 P52206 oasc.RecoveryStrategy.doRecovery SEVERE Recovery failed - trying again... core=collection1
      [mvn] ASYNC  NEW_CORE C4 name=collection1 org.apache.solr.core.SolrCore@3519b4af url=http://127.0.0.1:52185/solr/collection1 node=127.0.0.1:52185_solr
      [mvn] 134192 T1326 C4 P52185 oasc.SolrException.log SEVERE Error while trying to recover. core=collection1:org.apache.solr.client.solrj.SolrServerException: IOException occured when talking to server at: http://127.0.0.1:51453/solr
      [mvn] 		at org.apache.solr.client.solrj.impl.HttpSolrServer.request(HttpSolrServer.java:414)
      [mvn] 		at org.apache.solr.client.solrj.impl.HttpSolrServer.request(HttpSolrServer.java:182)
      [mvn] 		at org.apache.solr.cloud.RecoveryStrategy.sendPrepRecoveryCmd(RecoveryStrategy.java:199)
      [mvn] 		at org.apache.solr.cloud.RecoveryStrategy.doRecovery(RecoveryStrategy.java:388)
      [mvn] 		at org.apache.solr.cloud.RecoveryStrategy.run(RecoveryStrategy.java:220)
      [mvn] 	Caused by: org.apache.http.conn.ConnectTimeoutException: Connect to 127.0.0.1:51453 timed out
      [mvn] 		at org.apache.http.conn.scheme.PlainSocketFactory.connectSocket(PlainSocketFactory.java:125)
      [mvn] 		at org.apache.http.impl.conn.DefaultClientConnectionOperator.openConnection(DefaultClientConnectionOperator.java:148)
      [mvn] 		at org.apache.http.impl.conn.AbstractPoolEntry.open(AbstractPoolEntry.java:150)
      [mvn] 		at org.apache.http.impl.conn.AbstractPooledConnAdapter.open(AbstractPooledConnAdapter.java:121)
      [mvn] 		at org.apache.http.impl.client.DefaultRequestDirector.tryConnect(DefaultRequestDirector.java:575)
      [mvn] 		at org.apache.http.impl.client.DefaultRequestDirector.execute(DefaultRequestDirector.java:425)
      [mvn] 		at org.apache.http.impl.client.AbstractHttpClient.execute(AbstractHttpClient.java:820)
      [mvn] 		at org.apache.http.impl.client.AbstractHttpClient.execute(AbstractHttpClient.java:754)
      [mvn] 		at org.apache.http.impl.client.AbstractHttpClient.execute(AbstractHttpClient.java:732)
      [mvn] 		at org.apache.solr.client.solrj.impl.HttpSolrServer.request(HttpSolrServer.java:353)
      [mvn] 		... 4 more
      [mvn] 	
      [mvn] 134193 T1326 C4 P52185 oasc.RecoveryStrategy.doRecovery SEVERE Recovery failed - trying again... core=collection1
      [mvn] 134193 T1326 C4 P52185 oasc.SolrException.log SEVERE Recovery failed - max retries exceeded. core=collection1
      [mvn] 134194 T1326 C4 P52185 oasc.SolrException.log SEVERE Recovery failed - I give up. core=collection1
      [mvn]  C4_STATE=coll:collection1 core:collection1 props:{shard=shard1, roles=null, state=recovery_failed, core=collection1, collection=collection1, node_name=127.0.0.1:52185_solr, base_url=http://127.0.0.1:52185/solr}
      [mvn] 135219 T1336 C4 P52185 oasc.SolrException.log SEVERE Error while trying to recover. core=collection1
      [mvn] 135219 T1336 C4 P52185 oasc.SolrException.log SEVERE Error while trying to recover. core=collection1:org.apache.solr.common.SolrException: No registered leader was found, collection:collection1 slice:shard1
      [mvn] 		at org.apache.solr.common.cloud.ZkStateReader.getLeaderProps(ZkStateReader.java:413)
      [mvn] 		at org.apache.solr.common.cloud.ZkStateReader.getLeaderProps(ZkStateReader.java:399)
      [mvn] 		at org.apache.solr.cloud.RecoveryStrategy.doRecovery(RecoveryStrategy.java:318)
      [mvn] 		at org.apache.solr.cloud.RecoveryStrategy.run(RecoveryStrategy.java:220)
      [mvn] 	
      [mvn] 135219 T1336 C4 P52185 oasc.RecoveryStrategy.doRecovery SEVERE Recovery failed - trying again... core=collection1
      [mvn] Control Docs:305
      [mvn] check const of shard1
      [mvn] client0
      [mvn] PROPS:127.0.0.1:52206_solr_collection1:{"shard":"shard1","roles":null,"state":"recovery_failed","core":"collection1","collection":"collection1","node_name":"127.0.0.1:52206_solr","base_url":"http://127.0.0.1:52206/solr"}
      [mvn]  live:true
      [mvn]  num:5
      [mvn] 
      [mvn] client1
      [mvn] PROPS:127.0.0.1:51453_solr_collection1:{"shard":"shard1","roles":null,"state":"active","core":"collection1","collection":"collection1","node_name":"127.0.0.1:51453_solr","base_url":"http://127.0.0.1:51453/solr"}
      [mvn] error contacting client: IOException occured when talking to server at: http://127.0.0.1:51453/solr/collection1
      [mvn] 
      [mvn] client2
      [mvn] PROPS:127.0.0.1:52185_solr_collection1:{"shard":"shard1","roles":null,"state":"recovery_failed","core":"collection1","collection":"collection1","node_name":"127.0.0.1:52185_solr","base_url":"http://127.0.0.1:52185/solr"}
      [mvn]  live:true
      [mvn]  num:305
      [mvn] 
      [mvn] client3
      [mvn] PROPS:127.0.0.1:13244_solr_collection1:{"shard":"shard1","roles":null,"state":"recovery_failed","core":"collection1","collection":"collection1","node_name":"127.0.0.1:13244_solr","base_url":"http://127.0.0.1:13244/solr"}
      [mvn]  live:true
      [mvn]  num:5
      [mvn] 
      [mvn] 138241 T1336 C4 P52185 oasc.SolrException.log SEVERE Error while trying to recover. core=collection1
      [mvn] 138241 T1336 C4 P52185 oasc.SolrException.log SEVERE Error while trying to recover. core=collection1:org.apache.solr.common.SolrException: No registered leader was found, collection:collection1 slice:shard1
      [mvn] 		at org.apache.solr.common.cloud.ZkStateReader.getLeaderProps(ZkStateReader.java:413)
      [mvn] 		at org.apache.solr.common.cloud.ZkStateReader.getLeaderProps(ZkStateReader.java:399)
      [mvn] 		at org.apache.solr.cloud.RecoveryStrategy.doRecovery(RecoveryStrategy.java:318)
      [mvn] 		at org.apache.solr.cloud.RecoveryStrategy.run(RecoveryStrategy.java:220)
      [mvn] 	
      [mvn] 138241 T1336 C4 P52185 oasc.RecoveryStrategy.doRecovery SEVERE Recovery failed - trying again... core=collection1
      [mvn] 139453 T1335 C3 P52206 oasc.SolrException.log SEVERE Error while trying to recover. core=collection1
      [mvn] 139453 T1335 C3 P52206 oasc.SolrException.log SEVERE Error while trying to recover. core=collection1:org.apache.solr.common.SolrException: No registered leader was found, collection:collection1 slice:shard1
      [mvn] 		at org.apache.solr.common.cloud.ZkStateReader.getLeaderProps(ZkStateReader.java:413)
      [mvn] 		at org.apache.solr.common.cloud.ZkStateReader.getLeaderProps(ZkStateReader.java:399)
      [mvn] 		at org.apache.solr.cloud.RecoveryStrategy.doRecovery(RecoveryStrategy.java:318)
      [mvn] 		at org.apache.solr.cloud.RecoveryStrategy.run(RecoveryStrategy.java:220)
      [mvn] 	
      [mvn] 139453 T1335 C3 P52206 oasc.RecoveryStrategy.doRecovery SEVERE Recovery failed - trying again... core=collection1
      [mvn] 139454 T1335 C3 P52206 oasc.SolrException.log SEVERE Recovery failed - max retries exceeded. core=collection1
      [mvn] 139454 T1335 C3 P52206 oasc.SolrException.log SEVERE Recovery failed - I give up. core=collection1
      [mvn] 142643 T1335 C3 P52206 oasc.SolrException.log SEVERE Could not publish that recovery failed:org.apache.zookeeper.KeeperException$ConnectionLossException: KeeperErrorCode = ConnectionLoss for /overseer/queue/qn-
      [mvn] 		at org.apache.zookeeper.KeeperException.create(KeeperException.java:90)
      [mvn] 		at org.apache.zookeeper.KeeperException.create(KeeperException.java:42)
      [mvn] 		at org.apache.zookeeper.ZooKeeper.create(ZooKeeper.java:643)
      [mvn] 		at org.apache.solr.common.cloud.SolrZkClient$5.execute(SolrZkClient.java:247)
      [mvn] 		at org.apache.solr.common.cloud.SolrZkClient$5.execute(SolrZkClient.java:244)
      [mvn] 		at org.apache.solr.common.cloud.ZkCmdExecutor.retryOperation(ZkCmdExecutor.java:67)
      [mvn] 		at org.apache.solr.common.cloud.SolrZkClient.create(SolrZkClient.java:244)
      [mvn] 		at org.apache.solr.cloud.DistributedQueue.offer(DistributedQueue.java:236)
      [mvn] 		at org.apache.solr.cloud.ZkController.publish(ZkController.java:866)
      [mvn] 		at org.apache.solr.cloud.ZkController.publish(ZkController.java:837)
      [mvn] 		at org.apache.solr.cloud.RecoveryStrategy.recoveryFailed(RecoveryStrategy.java:112)
      [mvn] 		at org.apache.solr.cloud.RecoveryStrategy.doRecovery(RecoveryStrategy.java:466)
      [mvn] 		at org.apache.solr.cloud.RecoveryStrategy.run(RecoveryStrategy.java:220)
      [mvn] 	
      [mvn] 143266 T1336 C4 P52185 oasc.SolrException.log SEVERE Error while trying to recover. core=collection1
      [mvn] 143266 T1336 C4 P52185 oasc.SolrException.log SEVERE Error while trying to recover. core=collection1:org.apache.solr.common.SolrException: No registered leader was found, collection:collection1 slice:shard1
      [mvn] 		at org.apache.solr.common.cloud.ZkStateReader.getLeaderProps(ZkStateReader.java:413)
      [mvn] 		at org.apache.solr.common.cloud.ZkStateReader.getLeaderProps(ZkStateReader.java:399)
      [mvn] 		at org.apache.solr.cloud.RecoveryStrategy.doRecovery(RecoveryStrategy.java:318)
      [mvn] 		at org.apache.solr.cloud.RecoveryStrategy.run(RecoveryStrategy.java:220)
      [mvn] 	
      [mvn] 143266 T1336 C4 P52185 oasc.RecoveryStrategy.doRecovery SEVERE Recovery failed - trying again... core=collection1
      [mvn] 149291 T1336 C4 P52185 oasc.SolrException.log SEVERE Error while trying to recover. core=collection1
      [mvn] 149291 T1336 C4 P52185 oasc.SolrException.log SEVERE Error while trying to recover. core=collection1:org.apache.solr.common.SolrException: No registered leader was found, collection:collection1 slice:shard1
      [mvn] 		at org.apache.solr.common.cloud.ZkStateReader.getLeaderProps(ZkStateReader.java:413)
      [mvn] 		at org.apache.solr.common.cloud.ZkStateReader.getLeaderProps(ZkStateReader.java:399)
      [mvn] 		at org.apache.solr.cloud.RecoveryStrategy.doRecovery(RecoveryStrategy.java:318)
      [mvn] 		at org.apache.solr.cloud.RecoveryStrategy.run(RecoveryStrategy.java:220)
      [mvn] 	
      [mvn] 149291 T1336 C4 P52185 oasc.RecoveryStrategy.doRecovery SEVERE Recovery failed - trying again... core=collection1
      [mvn] 149292 T1336 C4 P52185 oasc.SolrException.log SEVERE Recovery failed - max retries exceeded. core=collection1
      [mvn] 149292 T1336 C4 P52185 oasc.SolrException.log SEVERE Recovery failed - I give up. core=collection1
      [mvn] 152847 T1336 C4 P52185 oasc.SolrException.log SEVERE Could not publish that recovery failed:org.apache.zookeeper.KeeperException$ConnectionLossException: KeeperErrorCode = ConnectionLoss for /overseer/queue/qn-
      [mvn] 		at org.apache.zookeeper.KeeperException.create(KeeperException.java:90)
      [mvn] 		at org.apache.zookeeper.KeeperException.create(KeeperException.java:42)
      [mvn] 		at org.apache.zookeeper.ZooKeeper.create(ZooKeeper.java:643)
      [mvn] 		at org.apache.solr.common.cloud.SolrZkClient$5.execute(SolrZkClient.java:247)
      [mvn] 		at org.apache.solr.common.cloud.SolrZkClient$5.execute(SolrZkClient.java:244)
      [mvn] 		at org.apache.solr.common.cloud.ZkCmdExecutor.retryOperation(ZkCmdExecutor.java:67)
      [mvn] 		at org.apache.solr.common.cloud.SolrZkClient.create(SolrZkClient.java:244)
      [mvn] 		at org.apache.solr.cloud.DistributedQueue.offer(DistributedQueue.java:236)
      [mvn] 		at org.apache.solr.cloud.ZkController.publish(ZkController.java:866)
      [mvn] 		at org.apache.solr.cloud.ZkController.publish(ZkController.java:837)
      [mvn] 		at org.apache.solr.cloud.RecoveryStrategy.recoveryFailed(RecoveryStrategy.java:112)
      [mvn] 		at org.apache.solr.cloud.RecoveryStrategy.doRecovery(RecoveryStrategy.java:466)
      [mvn] 		at org.apache.solr.cloud.RecoveryStrategy.run(RecoveryStrategy.java:220)
      [mvn] 	
      [mvn] 159456 T1334 C2 P13244 oasc.SolrException.log SEVERE Error while trying to recover. core=collection1
      [mvn] 159456 T1334 C2 P13244 oasc.SolrException.log SEVERE Error while trying to recover. core=collection1:org.apache.solr.common.SolrException: No registered leader was found, collection:collection1 slice:shard1
      [mvn] 		at org.apache.solr.common.cloud.ZkStateReader.getLeaderProps(ZkStateReader.java:413)
      [mvn] 		at org.apache.solr.common.cloud.ZkStateReader.getLeaderProps(ZkStateReader.java:399)
      [mvn] 		at org.apache.solr.cloud.RecoveryStrategy.doRecovery(RecoveryStrategy.java:318)
      [mvn] 		at org.apache.solr.cloud.RecoveryStrategy.run(RecoveryStrategy.java:220)
      [mvn] 	
      [mvn] 159456 T1334 C2 P13244 oasc.RecoveryStrategy.doRecovery SEVERE Recovery failed - trying again... core=collection1
      [mvn] 159457 T1334 C2 P13244 oasc.SolrException.log SEVERE Recovery failed - max retries exceeded. core=collection1
      [mvn] 159457 T1334 C2 P13244 oasc.SolrException.log SEVERE Recovery failed - I give up. core=collection1
      [mvn] 163051 T1334 C2 P13244 oasc.SolrException.log SEVERE Could not publish that recovery failed:org.apache.zookeeper.KeeperException$ConnectionLossException: KeeperErrorCode = ConnectionLoss for /overseer/queue/qn-
      [mvn] 		at org.apache.zookeeper.KeeperException.create(KeeperException.java:90)
      [mvn] 		at org.apache.zookeeper.KeeperException.create(KeeperException.java:42)
      [mvn] 		at org.apache.zookeeper.ZooKeeper.create(ZooKeeper.java:643)
      [mvn] 		at org.apache.solr.common.cloud.SolrZkClient$5.execute(SolrZkClient.java:247)
      [mvn] 		at org.apache.solr.common.cloud.SolrZkClient$5.execute(SolrZkClient.java:244)
      [mvn] 		at org.apache.solr.common.cloud.ZkCmdExecutor.retryOperation(ZkCmdExecutor.java:67)
      [mvn] 		at org.apache.solr.common.cloud.SolrZkClient.create(SolrZkClient.java:244)
      [mvn] 		at org.apache.solr.cloud.DistributedQueue.offer(DistributedQueue.java:236)
      [mvn] 		at org.apache.solr.cloud.ZkController.publish(ZkController.java:866)
      [mvn] 		at org.apache.solr.cloud.ZkController.publish(ZkController.java:837)
      [mvn] 		at org.apache.solr.cloud.RecoveryStrategy.recoveryFailed(RecoveryStrategy.java:112)
      [mvn] 		at org.apache.solr.cloud.RecoveryStrategy.doRecovery(RecoveryStrategy.java:466)
      [mvn] 		at org.apache.solr.cloud.RecoveryStrategy.run(RecoveryStrategy.java:220)
      [mvn] 	
      [mvn] NOTE: reproduce with: ant test  -Dtestcase=SyncSliceTest -Dtests.method=testDistribSearch -Dtests.seed=BE4C91CEF7E85737 -Dtests.locale=ar_LB -Dtests.timezone=SystemV/CST6CDT -Dtests.file.encoding=ISO8859-1
      [mvn] 174053 T1259 oasc.SolrException.log SEVERE Errir checking for the number of election participants:org.apache.zookeeper.KeeperException$SessionExpiredException: KeeperErrorCode = Session expired for /collections/collection1/leader_elect/shard1/election
      [mvn] 		at org.apache.zookeeper.KeeperException.create(KeeperException.java:118)
      [mvn] 		at org.apache.zookeeper.KeeperException.create(KeeperException.java:42)
      [mvn] 		at org.apache.zookeeper.ZooKeeper.getChildren(ZooKeeper.java:1249)
      [mvn] 		at org.apache.solr.common.cloud.SolrZkClient$6.execute(SolrZkClient.java:269)
      [mvn] 		at org.apache.solr.common.cloud.SolrZkClient$6.execute(SolrZkClient.java:266)
      [mvn] 		at org.apache.solr.common.cloud.ZkCmdExecutor.retryOperation(ZkCmdExecutor.java:67)
      [mvn] 		at org.apache.solr.common.cloud.SolrZkClient.getChildren(SolrZkClient.java:266)
      [mvn] 		at org.apache.solr.cloud.ShardLeaderElectionContext.waitForReplicasToComeUp(ElectionContext.java:275)
      [mvn] 		at org.apache.solr.cloud.ShardLeaderElectionContext.runLeaderProcess(ElectionContext.java:142)
      [mvn] 		at org.apache.solr.cloud.LeaderElector.runIamLeaderProcess(LeaderElector.java:158)
      [mvn] 		at org.apache.solr.cloud.LeaderElector.checkIfIamLeader(LeaderElector.java:102)
      [mvn] 		at org.apache.solr.cloud.LeaderElector.joinElection(LeaderElector.java:274)
      [mvn] 		at org.apache.solr.cloud.ShardLeaderElectionContext.rejoinLeaderElection(ElectionContext.java:326)
      [mvn] 		at org.apache.solr.cloud.ShardLeaderElectionContext.runLeaderProcess(ElectionContext.java:159)
      [mvn] 		at org.apache.solr.cloud.LeaderElector.runIamLeaderProcess(LeaderElector.java:158)
      [mvn] 		at org.apache.solr.cloud.LeaderElector.checkIfIamLeader(LeaderElector.java:102)
      [mvn] 		at org.apache.solr.cloud.LeaderElector.access$000(LeaderElector.java:56)
      [mvn] 		at org.apache.solr.cloud.LeaderElector$1.process(LeaderElector.java:131)
      [mvn] 		at org.apache.zookeeper.ClientCnxn$EventThread.processEvent(ClientCnxn.java:526)
      [mvn] 		at org.apache.zookeeper.ClientCnxn$EventThread.run(ClientCnxn.java:502)
      [mvn] 	
      [mvn] NOTE: test params are: codec=Lucene40: {range_facet_l=PostingsFormat(name=Lucene40WithOrds), text=PostingsFormat(name=Direct), _version_=Lucene40(minBlockSize=38 maxBlockSize=161), rnd_b=PostingsFormat(name=Memory doPackFST= true), intDefault=Lucene40(minBlockSize=38 maxBlockSize=161), id=PostingsFormat(name=Memory doPackFST= true), timestamp=PostingsFormat(name=Lucene40WithOrds), a_t=PostingsFormat(name=Lucene40WithOrds), range_facet_sl=PostingsFormat(name=Memory doPackFST= true), range_facet_si=PostingsFormat(name=Lucene40WithOrds), other_tl1=Lucene40(minBlockSize=38 maxBlockSize=161), multiDefault=PostingsFormat(name=Lucene40WithOrds), a_si=Lucene40(minBlockSize=38 maxBlockSize=161)}, sim=RandomSimilarityProvider(queryNorm=false,coord=crazy): {}, locale=ar_LB, timezone=SystemV/CST6CDT
      [mvn] NOTE: FreeBSD 9.0-RELEASE amd64/Sun Microsystems Inc. 1.6.0_32 (64-bit)/cpus=16,threads=1,free=49015168,total=253820928
      [mvn] NOTE: All tests run in this JVM: [TestJmxMonitoredMap, StatsComponentTest, NoCacheHeaderTest, DistributedTermsComponentTest, SolrCmdDistributorTest, ShowFileRequestHandlerTest, ZkNodePropsTest, UpdateParamsTest, TestBinaryField, TestLMJelinekMercerSimilarityFactory, TestQueryTypes, FileBasedSpellCheckerTest, LeaderElectionTest, TestSolrXMLSerializer, BasicDistributedZkTest, TestDocumentBuilder, TestDFRSimilarityFactory, TestDefaultSimilarityFactory, ZkControllerTest, DateFieldTest, RequiredFieldsTest, TestRealTimeGet, SpatialFilterTest, UniqFieldsUpdateProcessorFactoryTest, EchoParamsTest, TestPhraseSuggestions, MinimalSchemaTest, TestMultiCoreConfBootstrap, IndexReaderFactoryTest, TestUpdate, TestLuceneMatchVersion, TestBadConfig, LoggingHandlerTest, JsonLoaderTest, PeerSyncTest, SOLR749Test, TestQuerySenderNoQuery, TestCodecSupport, TestDocSet, TestLMDirichletSimilarityFactory, MoreLikeThisHandlerTest, SuggesterTest, TestCSVResponseWriter, ClusterStateUpdateTest, TestSolrDeletionPolicy1, TestDistributedSearch, DateMathParserTest, DocumentAnalysisRequestHandlerTest, TestNumberUtils, TestFoldingMultitermQuery, LegacyHTMLStripCharFilterTest, StandardRequestHandlerTest, TestRTGBase, TestReversedWildcardFilterFactory, TestIBSimilarityFactory, ClusterStateTest, TestArbitraryIndexDir, PolyFieldTest, TestPerFieldSimilarity, BadIndexSchemaTest, SyncSliceTest]
      [mvn] Tests run: 1, Failures: 0, Errors: 1, Skipped: 0, Time elapsed: 175.293 sec <<< FAILURE!
      [mvn] Running org.apache.solr.update.DirectUpdateHandlerTest
      [mvn] Creating dataDir: /usr/home/hudson/hudson-slave/workspace/Lucene-Solr-Maven-4.x/maven-build/solr/core/src/test/target/test/./solrtest-DirectUpdateHandlerTest-1348151096573
      [mvn] Creating dataDir: /usr/home/hudson/hudson-slave/workspace/Lucene-Solr-Maven-4.x/maven-build/solr/core/src/test/target/test/./solrtest-DirectUpdateHandlerTest-1348151096983
      [mvn] Creating dataDir: /usr/home/hudson/hudson-slave/workspace/Lucene-Solr-Maven-4.x/maven-build/solr/core/src/test/target/test/./solrtest-DirectUpdateHandlerTest-1348151097411
      [mvn] Tests run: 6, Failures: 0, Errors: 0, Skipped: 0, Time elapsed: 1.618 sec
      [mvn] Running org.apache.solr.servlet.SolrRequestParserTest
      [mvn] Creating dataDir: /usr/home/hudson/hudson-slave/workspace/Lucene-Solr-Maven-4.x/maven-build/solr/core/src/test/target/test/./solrtest-SolrRequestParserTest-1348151098195
      [mvn] Tests run: 4, Failures: 0, Errors: 0, Skipped: 0, Time elapsed: 0.421 sec
      [mvn] Running org.apache.solr.cloud.ZkCLITest
      [mvn] Creating dataDir: /usr/home/hudson/hudson-slave/workspace/Lucene-Solr-Maven-4.x/maven-build/solr/core/src/test/target/test/./solrtest-ZkCLITest-1348151098621
      [mvn] Creating dataDir: /usr/home/hudson/hudson-slave/workspace/Lucene-Solr-Maven-4.x/maven-build/solr/core/src/test/target/test/./solrtest-ZkCLITest-1348151099375
      [mvn] Creating dataDir: /usr/home/hudson/hudson-slave/workspace/Lucene-Solr-Maven-4.x/maven-build/solr/core/src/test/target/test/./solrtest-ZkCLITest-1348151099633
      [mvn] Tests run: 3, Failures: 0, Errors: 0, Skipped: 0, Time elapsed: 3.453 sec
      [mvn] Running org.apache.solr.search.TestStressReorder
      [mvn] Creating dataDir: /usr/home/hudson/hudson-slave/workspace/Lucene-Solr-Maven-4.x/maven-build/solr/core/src/test/target/test/./solrtest-TestStressReorder-1348151102070
      [mvn] Tests run: 1, Failures: 0, Errors: 0, Skipped: 0, Time elapsed: 4.405 sec
      [mvn] Running org.apache.solr.search.TestRangeQuery
      [mvn] Creating dataDir: /usr/home/hudson/hudson-slave/workspace/Lucene-Solr-Maven-4.x/maven-build/solr/core/src/test/target/test/./solrtest-TestRangeQuery-1348151106478
      [mvn] Tests run: 2, Failures: 0, Errors: 0, Skipped: 0, Time elapsed: 2.523 sec
      [mvn] Running org.apache.solr.ConvertedLegacyTest
      [mvn] Creating dataDir: /usr/home/hudson/hudson-slave/workspace/Lucene-Solr-Maven-4.x/maven-build/solr/core/src/test/target/test/./solrtest-ConvertedLegacyTest-1348151108999
      [mvn] Tests run: 1, Failures: 0, Errors: 0, Skipped: 0, Time elapsed: 1.498 sec
      [mvn] Running org.apache.solr.schema.CopyFieldTest
      [mvn] Creating dataDir: /usr/home/hudson/hudson-slave/workspace/Lucene-Solr-Maven-4.x/maven-build/solr/core/src/test/target/test/./solrtest-CopyFieldTest-1348151110501
      [mvn] Tests run: 6, Failures: 0, Errors: 0, Skipped: 0, Time elapsed: 0.376 sec
      [mvn] Running org.apache.solr.core.TestPropInject
      [mvn] Tests run: 2, Failures: 0, Errors: 0, Skipped: 0, Time elapsed: 0.544 sec
      [mvn] Running org.apache.solr.search.function.SortByFunctionTest
      [mvn] Tests run: 2, Failures: 0, Errors: 0, Skipped: 0, Time elapsed: 0.785 sec
      [mvn] Running org.apache.solr.search.TestFiltering
      [mvn] Creating dataDir: /usr/home/hudson/hudson-slave/workspace/Lucene-Solr-Maven-4.x/maven-build/solr/core/src/test/target/test/./solrtest-TestFiltering-1348151112207
      [mvn] Tests run: 2, Failures: 0, Errors: 0, Skipped: 0, Time elapsed: 13.765 sec
      [mvn] Running org.apache.solr.spelling.suggest.SuggesterWFSTTest
      [mvn] Creating dataDir: /usr/home/hudson/hudson-slave/workspace/Lucene-Solr-Maven-4.x/maven-build/solr/core/src/test/target/test/./solrtest-SuggesterWFSTTest-1348151125978
      [mvn] NOTE: per solr.test.leavedatadir, dataDir will not be removed: /usr/home/hudson/hudson-slave/workspace/Lucene-Solr-Maven-4.x/maven-build/solr/core/src/test/target/test/./solrtest-SuggesterWFSTTest-1348151125978
      [mvn] Tests run: 4, Failures: 0, Errors: 0, Skipped: 0, Time elapsed: 0.816 sec
      [mvn] Running org.apache.solr.analysis.TestWordDelimiterFilterFactory
      [mvn] Creating dataDir: /usr/home/hudson/hudson-slave/workspace/Lucene-Solr-Maven-4.x/maven-build/solr/core/src/test/target/test/./solrtest-TestWordDelimiterFilterFactory-1348151126796
      [mvn] Tests run: 7, Failures: 0, Errors: 0, Skipped: 0, Time elapsed: 0.804 sec
      [mvn] Running org.apache.solr.util.SimplePostToolTest
      [mvn] Indexing directory /usr/home/hudson/hudson-slave/workspace/Lucene-Solr-Maven-4.x/maven-build/solr/core/src/test/target/test-classes/exampledocs (2 files, depth=0)
      [mvn] POSTing file example.txt (text/plain)
      [mvn] POSTing file example.html (text/html)
      [mvn] Entering crawl at level 0 (1 links total, 1 new)
      [mvn] POSTed web resource http://example.com (depth: 0)
      [mvn] Entering crawl at level 1 (2 links total, 2 new)
      [mvn] POSTed web resource http://example.com/page2 (depth: 1)
      [mvn] POSTed web resource http://example.com/page1 (depth: 1)
      [mvn] Entering crawl at level 2 (2 links total, 2 new)
      [mvn] SimplePostTool: WARNING: The URL http://example.com/disallowed returned a HTTP result status of 403
      [mvn] POSTed web resource http://example.com/page1/foo (depth: 2)
      [mvn] Entering crawl at level 3 (1 links total, 1 new)
      [mvn] POSTed web resource http://example.com/page1/foo/bar (depth: 3)
      [mvn] Entering crawl at level 0 (1 links total, 1 new)
      [mvn] POSTed web resource http://example.com (depth: 0)
      [mvn] Entering crawl at level 1 (2 links total, 2 new)
      [mvn] POSTed web resource http://example.com/page2 (depth: 1)
      [mvn] POSTed web resource http://example.com/page1 (depth: 1)
      [mvn] Entering crawl at level 0 (1 links total, 1 new)
      [mvn] POSTed web resource http://example.com (depth: 0)
      [mvn] Entering crawl at level 1 (2 links total, 2 new)
      [mvn] POSTed web resource http://example.com/page2 (depth: 1)
      [mvn] POSTed web resource http://example.com/page1 (depth: 1)
      [mvn] Entering crawl at level 2 (2 links total, 2 new)
      [mvn] POSTed web resource http://example.com/disallowed (depth: 2)
      [mvn] POSTed web resource http://example.com/page1/foo (depth: 2)
      [mvn] Entering crawl at level 3 (1 links total, 1 new)
      [mvn] POSTed web resource http://example.com/page1/foo/bar (depth: 3)
      [mvn] Tests run: 11, Failures: 0, Errors: 0, Skipped: 0, Time elapsed: 1.389 sec
      [mvn] Running org.apache.solr.request.TestRemoteStreaming
      [mvn] Creating dataDir: /usr/home/hudson/hudson-slave/workspace/Lucene-Solr-Maven-4.x/maven-build/solr/core/src/test/target/test/./solrtest-TestRemoteStreaming-1348151128992
      [mvn] Tests run: 4, Failures: 0, Errors: 0, Skipped: 0, Time elapsed: 0.69 sec
      [mvn] Running org.apache.solr.analysis.TestCollationKeyRangeQueries
      [mvn] Creating dataDir: /usr/home/hudson/hudson-slave/workspace/Lucene-Solr-Maven-4.x/maven-build/solr/core/src/test/target/test/./solrtest-TestCollationKeyRangeQueries-1348151129683
      [mvn] Tests run: 3, Failures: 0, Errors: 0, Skipped: 0, Time elapsed: 0.212 sec
      [mvn] Running org.apache.solr.util.TestSystemIdResolver
      [mvn] Tests run: 1, Failures: 0, Errors: 0, Skipped: 0, Time elapsed: 0.023 sec
      [mvn] Running org.apache.solr.update.processor.DefaultValueUpdateProcessorTest
      [mvn] Creating dataDir: /usr/home/hudson/hudson-slave/workspace/Lucene-Solr-Maven-4.x/maven-build/solr/core/src/test/target/test/./solrtest-DefaultValueUpdateProcessorTest-1348151129921
      [mvn] Tests run: 1, Failures: 0, Errors: 0, Skipped: 0, Time elapsed: 0.504 sec
      [mvn] Running org.apache.solr.spelling.SpellPossibilityIteratorTest
      [mvn] Tests run: 3, Failures: 0, Errors: 0, Skipped: 0, Time elapsed: 0.23 sec
      [mvn] Running org.apache.solr.core.TestConfig
      [mvn] Creating dataDir: /usr/home/hudson/hudson-slave/workspace/Lucene-Solr-Maven-4.x/maven-build/solr/core/src/test/target/test/./solrtest-TestConfig-1348151130653
      [mvn] Tests run: 8, Failures: 0, Errors: 0, Skipped: 0, Time elapsed: 0.159 sec
      [mvn] Running org.apache.solr.internal.csv.writer.CSVConfigGuesserTest
      [mvn] Tests run: 3, Failures: 0, Errors: 0, Skipped: 0, Time elapsed: 0 sec
      [mvn] Running org.apache.solr.util.SolrPluginUtilsTest
      [mvn] Creating dataDir: /usr/home/hudson/hudson-slave/workspace/Lucene-Solr-Maven-4.x/maven-build/solr/core/src/test/target/test/./solrtest-SolrPluginUtilsTest-1348151130814
      [mvn] Tests run: 7, Failures: 0, Errors: 0, Skipped: 0, Time elapsed: 0.403 sec
      [mvn] Running org.apache.solr.search.TestSearchPerf
      [mvn] Tests run: 1, Failures: 0, Errors: 0, Skipped: 0, Time elapsed: 0.24 sec
      [mvn] Running org.apache.solr.handler.admin.CoreAdminHandlerTest
      [mvn] Creating dataDir: /usr/home/hudson/hudson-slave/workspace/Lucene-Solr-Maven-4.x/maven-build/solr/core/src/test/target/test/./solrtest-CoreAdminHandlerTest-1348151131463
      [mvn] 1021 T1503 oasc.CoreContainer.create SEVERE Unable to create core: bogus_dir_core java.io.IOException: Can't find resource 'solrconfig.xml' in classpath or '/usr/home/hudson/hudson-slave/workspace/Lucene-Solr-Maven-4.x/maven-build/solr/core/src/test/target/test-classes/solr/dir_does_not_exist_127896/conf/', cwd=/usr/home/hudson/hudson-slave/workspace/Lucene-Solr-Maven-4.x/maven-build/solr/core/src/test/target/test
      [mvn] 	at org.apache.solr.core.SolrResourceLoader.openResource(SolrResourceLoader.java:314)
      [mvn] 	at org.apache.solr.core.SolrResourceLoader.openConfig(SolrResourceLoader.java:280)
      [mvn] 	at org.apache.solr.core.Config.<init>(Config.java:111)
      [mvn] 	at org.apache.solr.core.Config.<init>(Config.java:78)
      [mvn] 	at org.apache.solr.core.SolrConfig.<init>(SolrConfig.java:117)
      [mvn] 	at org.apache.solr.core.CoreContainer.create(CoreContainer.java:791)
      [mvn] 	at org.apache.solr.handler.admin.CoreAdminHandler.handleCreateAction(CoreAdminHandler.java:519)
      [mvn] 	at org.apache.solr.handler.admin.CoreAdminHandler.handleRequestBody(CoreAdminHandler.java:142)
      [mvn] 	at org.apache.solr.handler.admin.CoreAdminHandlerTest.testCoreAdminHandler(CoreAdminHandlerTest.java:105)
      [mvn] 	at sun.reflect.NativeMethodAccessorImpl.invoke0(Native Method)
      [mvn] 	at sun.reflect.NativeMethodAccessorImpl.invoke(NativeMethodAccessorImpl.java:57)
      [mvn] 	at sun.reflect.DelegatingMethodAccessorImpl.invoke(DelegatingMethodAccessorImpl.java:43)
      [mvn] 	at java.lang.reflect.Method.invoke(Method.java:616)
      [mvn] 	at com.carrotsearch.randomizedtesting.RandomizedRunner.invoke(RandomizedRunner.java:1559)
      [mvn] 	at com.carrotsearch.randomizedtesting.RandomizedRunner.access$600(RandomizedRunner.java:79)
      [mvn] 	at com.carrotsearch.randomizedtesting.RandomizedRunner$6.evaluate(RandomizedRunner.java:737)
      [mvn] 	at com.carrotsearch.randomizedtesting.RandomizedRunner$7.evaluate(RandomizedRunner.java:773)
      [mvn] 	at com.carrotsearch.randomizedtesting.RandomizedRunner$8.evaluate(RandomizedRunner.java:787)
      [mvn] 	at com.carrotsearch.randomizedtesting.rules.SystemPropertiesRestoreRule$1.evaluate(SystemPropertiesRestoreRule.java:53)
      [mvn] 	at org.apache.lucene.util.TestRuleSetupTeardownChained$1.evaluate(TestRuleSetupTeardownChained.java:50)
      [mvn] 	at org.apache.lucene.util.TestRuleFieldCacheSanity$1.evaluate(TestRuleFieldCacheSanity.java:51)
      [mvn] 	at org.apache.lucene.util.AbstractBeforeAfterRule$1.evaluate(AbstractBeforeAfterRule.java:45)
      [mvn] 	at com.carrotsearch.randomizedtesting.rules.SystemPropertiesInvariantRule$1.evaluate(SystemPropertiesInvariantRule.java:55)
      [mvn] 	at org.apache.lucene.util.TestRuleThreadAndTestName$1.evaluate(TestRuleThreadAndTestName.java:48)
      [mvn] 	at org.apache.lucene.util.TestRuleIgnoreAfterMaxFailures$1.evaluate(TestRuleIgnoreAfterMaxFailures.java:70)
      [mvn] 	at org.apache.lucene.util.TestRuleMarkFailure$1.evaluate(TestRuleMarkFailure.java:48)
      [mvn] 	at com.carrotsearch.randomizedtesting.rules.StatementAdapter.evaluate(StatementAdapter.java:36)
      [mvn] 	at com.carrotsearch.randomizedtesting.ThreadLeakControl$StatementRunner.run(ThreadLeakControl.java:358)
      [mvn] 	at com.carrotsearch.randomizedtesting.ThreadLeakControl.forkTimeoutingTask(ThreadLeakControl.java:782)
      [mvn] 	at com.carrotsearch.randomizedtesting.ThreadLeakControl$3.evaluate(ThreadLeakControl.java:442)
      [mvn] 	at com.carrotsearch.randomizedtesting.RandomizedRunner.runSingleTest(RandomizedRunner.java:746)
      [mvn] 	at com.carrotsearch.randomizedtesting.RandomizedRunner$3.evaluate(RandomizedRunner.java:648)
      [mvn] 	at com.carrotsearch.randomizedtesting.RandomizedRunner$4.evaluate(RandomizedRunner.java:682)
      [mvn] 	at com.carrotsearch.randomizedtesting.RandomizedRunner$5.evaluate(RandomizedRunner.java:693)
      [mvn] 	at com.carrotsearch.randomizedtesting.rules.StatementAdapter.evaluate(StatementAdapter.java:36)
      [mvn] 	at com.carrotsearch.randomizedtesting.rules.SystemPropertiesRestoreRule$1.evaluate(SystemPropertiesRestoreRule.java:53)
      [mvn] 	at org.apache.lucene.util.AbstractBeforeAfterRule$1.evaluate(AbstractBeforeAfterRule.java:45)
      [mvn] 	at org.apache.lucene.util.TestRuleStoreClassName$1.evaluate(TestRuleStoreClassName.java:42)
      [mvn] 	at com.carrotsearch.randomizedtesting.rules.SystemPropertiesInvariantRule$1.evaluate(SystemPropertiesInvariantRule.java:55)
      [mvn] 	at com.carrotsearch.randomizedtesting.rules.NoShadowingOrOverridesOnMethodsRule$1.evaluate(NoShadowingOrOverridesOnMethodsRule.java:39)
      [mvn] 	at com.carrotsearch.randomizedtesting.rules.NoShadowingOrOverridesOnMethodsRule$1.evaluate(NoShadowingOrOverridesOnMethodsRule.java:39)
      [mvn] 	at com.carrotsearch.randomizedtesting.rules.StatementAdapter.evaluate(StatementAdapter.java:36)
      [mvn] 	at org.apache.lucene.util.TestRuleAssertionsRequired$1.evaluate(TestRuleAssertionsRequired.java:43)
      [mvn] 	at org.apache.lucene.util.TestRuleMarkFailure$1.evaluate(TestRuleMarkFailure.java:48)
      [mvn] 	at org.apache.lucene.util.TestRuleIgnoreAfterMaxFailures$1.evaluate(TestRuleIgnoreAfterMaxFailures.java:70)
      [mvn] 	at org.apache.lucene.util.TestRuleIgnoreTestSuites$1.evaluate(TestRuleIgnoreTestSuites.java:55)
      [mvn] 	at com.carrotsearch.randomizedtesting.rules.StatementAdapter.evaluate(StatementAdapter.java:36)
      [mvn] 	at com.carrotsearch.randomizedtesting.ThreadLeakControl$StatementRunner.run(ThreadLeakControl.java:358)
      [mvn] 	at java.lang.Thread.run(Thread.java:679)
      [mvn] 
      [mvn] Tests run: 1, Failures: 0, Errors: 0, Skipped: 0, Time elapsed: 1.046 sec
      [mvn] Running org.apache.solr.handler.XmlUpdateRequestHandlerTest
      [mvn] Creating dataDir: /usr/home/hudson/hudson-slave/workspace/Lucene-Solr-Maven-4.x/maven-build/solr/core/src/test/target/test/./solrtest-XmlUpdateRequestHandlerTest-1348151132512
      [mvn] Tests run: 3, Failures: 0, Errors: 0, Skipped: 0, Time elapsed: 0.489 sec
      [mvn] Running org.apache.solr.update.processor.URLClassifyProcessorTest
      [mvn] Tests run: 7, Failures: 0, Errors: 0, Skipped: 0, Time elapsed: 0.043 sec
      [mvn] Running org.apache.solr.util.DOMUtilTest
      [mvn] Tests run: 1, Failures: 0, Errors: 0, Skipped: 0, Time elapsed: 0.015 sec
      [mvn] Running org.apache.solr.SolrInfoMBeanTest
      [mvn] Creating dataDir: /usr/home/hudson/hudson-slave/workspace/Lucene-Solr-Maven-4.x/maven-build/solr/core/src/test/target/test/./solrtest-SolrInfoMBeanTest-1348151133063
      [mvn] Tests run: 1, Failures: 0, Errors: 0, Skipped: 0, Time elapsed: 0.575 sec
      [mvn] Running org.apache.solr.search.similarities.TestBM25SimilarityFactory
      [mvn] Creating dataDir: /usr/home/hudson/hudson-slave/workspace/Lucene-Solr-Maven-4.x/maven-build/solr/core/src/test/target/test/./solrtest-TestBM25SimilarityFactory-1348151133633
      [mvn] Tests run: 2, Failures: 0, Errors: 0, Skipped: 0, Time elapsed: 0.072 sec
      [mvn] Running org.apache.solr.search.TestRecovery
      [mvn] Creating dataDir: /usr/home/hudson/hudson-slave/workspace/Lucene-Solr-Maven-4.x/maven-build/solr/core/src/test/target/test/./solrtest-TestRecovery-1348151133707
      [mvn] Tests run: 10, Failures: 0, Errors: 0, Skipped: 0, Time elapsed: 5.812 sec
      [mvn] Running org.apache.solr.core.PluginInfoTest
      [mvn] Tests run: 9, Failures: 0, Errors: 0, Skipped: 0, Time elapsed: 0.032 sec
      [mvn] Running org.apache.solr.handler.component.DebugComponentTest
      [mvn] Creating dataDir: /usr/home/hudson/hudson-slave/workspace/Lucene-Solr-Maven-4.x/maven-build/solr/core/src/test/target/test/./solrtest-DebugComponentTest-1348151139551
      [mvn] Tests run: 2, Failures: 0, Errors: 0, Skipped: 0, Time elapsed: 0.584 sec
      [mvn] Running org.apache.solr.handler.XsltUpdateRequestHandlerTest
      [mvn] Creating dataDir: /usr/home/hudson/hudson-slave/workspace/Lucene-Solr-Maven-4.x/maven-build/solr/core/src/test/target/test/./solrtest-XsltUpdateRequestHandlerTest-1348151140142
      [mvn] Tests run: 1, Failures: 0, Errors: 0, Skipped: 0, Time elapsed: 0.765 sec
      [mvn] Running org.apache.solr.cloud.FullSolrCloudDistribCmdsTest
      [mvn] Creating dataDir: /usr/home/hudson/hudson-slave/workspace/Lucene-Solr-Maven-4.x/maven-build/solr/core/src/test/target/test/./solrtest-FullSolrCloudDistribCmdsTest-1348151140911
      [mvn] 43404 T1613 oasc.SolrException.log SEVERE Sync Failed
      [mvn] ASYNC  NEW_CORE C5 name=collection1 org.apache.solr.core.SolrCore@473c6c79 url=http://127.0.0.1:36450/solr/collection1 node=127.0.0.1:36450_solr
      [mvn] 88567 T1597 C5 P36450 oasc.SolrException.log SEVERE shard update error http://127.0.0.1:38819/solr/collection1/:org.apache.solr.client.solrj.SolrServerException: Server refused connection at: http://127.0.0.1:38819/solr/collection1
      [mvn] 		at org.apache.solr.client.solrj.impl.HttpSolrServer.request(HttpSolrServer.java:407)
      [mvn] 		at org.apache.solr.client.solrj.impl.HttpSolrServer.request(HttpSolrServer.java:182)
      [mvn] 		at org.apache.solr.update.SolrCmdDistributor$1.call(SolrCmdDistributor.java:335)
      [mvn] 		at org.apache.solr.update.SolrCmdDistributor$1.call(SolrCmdDistributor.java:309)
      [mvn] 		at java.util.concurrent.FutureTask$Sync.innerRun(FutureTask.java:334)
      [mvn] 		at java.util.concurrent.FutureTask.run(FutureTask.java:166)
      [mvn] 		at java.util.concurrent.Executors$RunnableAdapter.call(Executors.java:471)
      [mvn] 		at java.util.concurrent.FutureTask$Sync.innerRun(FutureTask.java:334)
      [mvn] 		at java.util.concurrent.FutureTask.run(FutureTask.java:166)
      [mvn] 		at java.util.concurrent.ThreadPoolExecutor.runWorker(ThreadPoolExecutor.java:1110)
      [mvn] 		at java.util.concurrent.ThreadPoolExecutor$Worker.run(ThreadPoolExecutor.java:603)
      [mvn] 		at java.lang.Thread.run(Thread.java:679)
      [mvn] 	Caused by: org.apache.http.conn.HttpHostConnectException: Connection to http://127.0.0.1:38819 refused
      [mvn] 		at org.apache.http.impl.conn.DefaultClientConnectionOperator.openConnection(DefaultClientConnectionOperator.java:158)
      [mvn] 		at org.apache.http.impl.conn.AbstractPoolEntry.open(AbstractPoolEntry.java:150)
      [mvn] 		at org.apache.http.impl.conn.AbstractPooledConnAdapter.open(AbstractPooledConnAdapter.java:121)
      [mvn] 		at org.apache.http.impl.client.DefaultRequestDirector.tryConnect(DefaultRequestDirector.java:575)
      [mvn] 		at org.apache.http.impl.client.DefaultRequestDirector.execute(DefaultRequestDirector.java:425)
      [mvn] 		at org.apache.http.impl.client.AbstractHttpClient.execute(AbstractHttpClient.java:820)
      [mvn] 		at org.apache.http.impl.client.AbstractHttpClient.execute(AbstractHttpClient.java:754)
      [mvn] 		at org.apache.http.impl.client.AbstractHttpClient.execute(AbstractHttpClient.java:732)
      [mvn] 		at org.apache.solr.client.solrj.impl.HttpSolrServer.request(HttpSolrServer.java:353)
      [mvn] 		... 11 more
      [mvn] 	Caused by: java.net.ConnectException: Operation timed out
      [mvn] 		at java.net.PlainSocketImpl.socketConnect(Native Method)
      [mvn] 		at java.net.AbstractPlainSocketImpl.doConnect(AbstractPlainSocketImpl.java:327)
      [mvn] 		at java.net.AbstractPlainSocketImpl.connectToAddress(AbstractPlainSocketImpl.java:193)
      [mvn] 		at java.net.AbstractPlainSocketImpl.connect(AbstractPlainSocketImpl.java:180)
      [mvn] 		at java.net.SocksSocketImpl.connect(SocksSocketImpl.java:384)
      [mvn] 		at java.net.Socket.connect(Socket.java:546)
      [mvn] 		at org.apache.http.conn.scheme.PlainSocketFactory.connectSocket(PlainSocketFactory.java:123)
      [mvn] 		at org.apache.http.impl.conn.DefaultClientConnectionOperator.openConnection(DefaultClientConnectionOperator.java:148)
      [mvn] 		... 19 more
      [mvn] 	
      [mvn] 88572 T1597 C5 P36450 oasc.SolrException.log SEVERE null:org.apache.solr.client.solrj.SolrServerException: Server refused connection at: http://127.0.0.1:38819/solr/collection1
      [mvn] 		at org.apache.solr.client.solrj.impl.HttpSolrServer.request(HttpSolrServer.java:407)
      [mvn] 		at org.apache.solr.client.solrj.impl.HttpSolrServer.request(HttpSolrServer.java:182)
      [mvn] 		at org.apache.solr.update.SolrCmdDistributor$1.call(SolrCmdDistributor.java:335)
      [mvn] 		at org.apache.solr.update.SolrCmdDistributor$1.call(SolrCmdDistributor.java:309)
      [mvn] 		at java.util.concurrent.FutureTask$Sync.innerRun(FutureTask.java:334)
      [mvn] 		at java.util.concurrent.FutureTask.run(FutureTask.java:166)
      [mvn] 		at java.util.concurrent.Executors$RunnableAdapter.call(Executors.java:471)
      [mvn] 		at java.util.concurrent.FutureTask$Sync.innerRun(FutureTask.java:334)
      [mvn] 		at java.util.concurrent.FutureTask.run(FutureTask.java:166)
      [mvn] 		at java.util.concurrent.ThreadPoolExecutor.runWorker(ThreadPoolExecutor.java:1110)
      [mvn] 		at java.util.concurrent.ThreadPoolExecutor$Worker.run(ThreadPoolExecutor.java:603)
      [mvn] 		at java.lang.Thread.run(Thread.java:679)
      [mvn] 	Caused by: org.apache.http.conn.HttpHostConnectException: Connection to http://127.0.0.1:38819 refused
      [mvn] 		at org.apache.http.impl.conn.DefaultClientConnectionOperator.openConnection(DefaultClientConnectionOperator.java:158)
      [mvn] 		at org.apache.http.impl.conn.AbstractPoolEntry.open(AbstractPoolEntry.java:150)
      [mvn] 		at org.apache.http.impl.conn.AbstractPooledConnAdapter.open(AbstractPooledConnAdapter.java:121)
      [mvn] 		at org.apache.http.impl.client.DefaultRequestDirector.tryConnect(DefaultRequestDirector.java:575)
      [mvn] 		at org.apache.http.impl.client.DefaultRequestDirector.execute(DefaultRequestDirector.java:425)
      [mvn] 		at org.apache.http.impl.client.AbstractHttpClient.execute(AbstractHttpClient.java:820)
      [mvn] 		at org.apache.http.impl.client.AbstractHttpClient.execute(AbstractHttpClient.java:754)
      [mvn] 		at org.apache.http.impl.client.AbstractHttpClient.execute(AbstractHttpClient.java:732)
      [mvn] 		at org.apache.solr.client.solrj.impl.HttpSolrServer.request(HttpSolrServer.java:353)
      [mvn] 		... 11 more
      [mvn] 	Caused by: java.net.ConnectException: Operation timed out
      [mvn] 		at java.net.PlainSocketImpl.socketConnect(Native Method)
      [mvn] 		at java.net.AbstractPlainSocketImpl.doConnect(AbstractPlainSocketImpl.java:327)
      [mvn] 		at java.net.AbstractPlainSocketImpl.connectToAddress(AbstractPlainSocketImpl.java:193)
      [mvn] 		at java.net.AbstractPlainSocketImpl.connect(AbstractPlainSocketImpl.java:180)
      [mvn] 		at java.net.SocksSocketImpl.connect(SocksSocketImpl.java:384)
      [mvn] 		at java.net.Socket.connect(Socket.java:546)
      [mvn] 		at org.apache.http.conn.scheme.PlainSocketFactory.connectSocket(PlainSocketFactory.java:123)
      [mvn] 		at org.apache.http.impl.conn.DefaultClientConnectionOperator.openConnection(DefaultClientConnectionOperator.java:148)
      [mvn] 		... 19 more
      [mvn] 	
      [mvn] 88573 T1597 C5 P36450 oasc.SolrException.log SEVERE null:org.eclipse.jetty.io.EofException
      [mvn] 		at org.eclipse.jetty.server.HttpOutput.write(HttpOutput.java:154)
      [mvn] 		at org.eclipse.jetty.server.HttpOutput.write(HttpOutput.java:101)
      [mvn] 		at org.apache.solr.common.util.FastOutputStream.flush(FastOutputStream.java:204)
      [mvn] 		at org.apache.solr.common.util.FastOutputStream.flushBuffer(FastOutputStream.java:197)
      [mvn] 		at org.apache.solr.common.util.JavaBinCodec.marshal(JavaBinCodec.java:94)
      [mvn] 		at org.apache.solr.response.BinaryResponseWriter.write(BinaryResponseWriter.java:49)
      [mvn] 		at org.apache.solr.servlet.SolrDispatchFilter.writeResponse(SolrDispatchFilter.java:404)
      [mvn] 		at org.apache.solr.servlet.SolrDispatchFilter.doFilter(SolrDispatchFilter.java:289)
      [mvn] 		at org.eclipse.jetty.servlet.ServletHandler$CachedChain.doFilter(ServletHandler.java:1337)
      [mvn] 		at org.eclipse.jetty.servlet.ServletHandler.doHandle(ServletHandler.java:484)
      [mvn] 		at org.eclipse.jetty.server.session.SessionHandler.doHandle(SessionHandler.java:231)
      [mvn] 		at org.eclipse.jetty.server.handler.ScopedHandler.handle(ScopedHandler.java:119)
      [mvn] 		at org.eclipse.jetty.server.handler.GzipHandler.handle(GzipHandler.java:267)
      [mvn] 		at org.eclipse.jetty.server.handler.ContextHandler.doHandle(ContextHandler.java:1067)
      [mvn] 		at org.eclipse.jetty.servlet.ServletHandler.doScope(ServletHandler.java:413)
      [mvn] 		at org.eclipse.jetty.server.session.SessionHandler.doScope(SessionHandler.java:192)
      [mvn] 		at org.eclipse.jetty.server.handler.ContextHandler.doScope(ContextHandler.java:999)
      [mvn] 		at org.eclipse.jetty.server.handler.ScopedHandler.handle(ScopedHandler.java:117)
      [mvn] 		at org.eclipse.jetty.server.handler.HandlerWrapper.handle(HandlerWrapper.java:111)
      [mvn] 		at org.eclipse.jetty.server.Server.handle(Server.java:351)
      [mvn] 		at org.eclipse.jetty.server.AbstractHttpConnection.handleRequest(AbstractHttpConnection.java:454)
      [mvn] 		at org.eclipse.jetty.server.BlockingHttpConnection.handleRequest(BlockingHttpConnection.java:47)
      [mvn] 		at org.eclipse.jetty.server.AbstractHttpConnection.content(AbstractHttpConnection.java:900)
      [mvn] 		at org.eclipse.jetty.server.AbstractHttpConnection$RequestHandler.content(AbstractHttpConnection.java:954)
      [mvn] 		at org.eclipse.jetty.http.HttpParser.parseNext(HttpParser.java:952)
      [mvn] 		at org.eclipse.jetty.http.HttpParser.parseAvailable(HttpParser.java:235)
      [mvn] 		at org.eclipse.jetty.server.BlockingHttpConnection.handle(BlockingHttpConnection.java:66)
      [mvn] 		at org.eclipse.jetty.server.bio.SocketConnector$ConnectorEndPoint.run(SocketConnector.java:254)
      [mvn] 		at org.eclipse.jetty.util.thread.QueuedThreadPool.runJob(QueuedThreadPool.java:599)
      [mvn] 		at org.eclipse.jetty.util.thread.QueuedThreadPool$3.run(QueuedThreadPool.java:534)
      [mvn] 		at java.lang.Thread.run(Thread.java:679)
      [mvn] 	
      [mvn] 88574 T1597 C5 P36450 oasc.SolrException.log SEVERE null:org.eclipse.jetty.io.EofException
      [mvn] 		at org.eclipse.jetty.server.HttpOutput.write(HttpOutput.java:154)
      [mvn] 		at org.eclipse.jetty.server.HttpOutput.write(HttpOutput.java:101)
      [mvn] 		at org.apache.solr.common.util.FastOutputStream.flush(FastOutputStream.java:204)
      [mvn] 		at org.apache.solr.common.util.FastOutputStream.flushBuffer(FastOutputStream.java:197)
      [mvn] 		at org.apache.solr.common.util.JavaBinCodec.marshal(JavaBinCodec.java:94)
      [mvn] 		at org.apache.solr.response.BinaryResponseWriter.write(BinaryResponseWriter.java:49)
      [mvn] 		at org.apache.solr.servlet.SolrDispatchFilter.writeResponse(SolrDispatchFilter.java:404)
      [mvn] 		at org.apache.solr.servlet.SolrDispatchFilter.doFilter(SolrDispatchFilter.java:289)
      [mvn] 		at org.eclipse.jetty.servlet.ServletHandler$CachedChain.doFilter(ServletHandler.java:1337)
      [mvn] 		at org.eclipse.jetty.servlet.ServletHandler.doHandle(ServletHandler.java:484)
      [mvn] 		at org.eclipse.jetty.server.session.SessionHandler.doHandle(SessionHandler.java:231)
      [mvn] 		at org.eclipse.jetty.server.handler.ScopedHandler.handle(ScopedHandler.java:119)
      [mvn] 		at org.eclipse.jetty.server.handler.GzipHandler.handle(GzipHandler.java:267)
      [mvn] 		at org.eclipse.jetty.server.handler.ContextHandler.doHandle(ContextHandler.java:1067)
      [mvn] 		at org.eclipse.jetty.servlet.ServletHandler.doScope(ServletHandler.java:413)
      [mvn] 		at org.eclipse.jetty.server.session.SessionHandler.doScope(SessionHandler.java:192)
      [mvn] 		at org.eclipse.jetty.server.handler.ContextHandler.doScope(ContextHandler.java:999)
      [mvn] 		at org.eclipse.jetty.server.handler.ScopedHandler.handle(ScopedHandler.java:117)
      [mvn] 		at org.eclipse.jetty.server.handler.HandlerWrapper.handle(HandlerWrapper.java:111)
      [mvn] 		at org.eclipse.jetty.server.Server.handle(Server.java:351)
      [mvn] 		at org.eclipse.jetty.server.AbstractHttpConnection.handleRequest(AbstractHttpConnection.java:454)
      [mvn] 		at org.eclipse.jetty.server.BlockingHttpConnection.handleRequest(BlockingHttpConnection.java:47)
      [mvn] 		at org.eclipse.jetty.server.AbstractHttpConnection.content(AbstractHttpConnection.java:900)
      [mvn] 		at org.eclipse.jetty.server.AbstractHttpConnection$RequestHandler.content(AbstractHttpConnection.java:954)
      [mvn] 		at org.eclipse.jetty.http.HttpParser.parseNext(HttpParser.java:952)
      [mvn] 		at org.eclipse.jetty.http.HttpParser.parseAvailable(HttpParser.java:235)
      [mvn] 		at org.eclipse.jetty.server.BlockingHttpConnection.handle(BlockingHttpConnection.java:66)
      [mvn] 		at org.eclipse.jetty.server.bio.SocketConnector$ConnectorEndPoint.run(SocketConnector.java:254)
      [mvn] 		at org.eclipse.jetty.util.thread.QueuedThreadPool.runJob(QueuedThreadPool.java:599)
      [mvn] 		at org.eclipse.jetty.util.thread.QueuedThreadPool$3.run(QueuedThreadPool.java:534)
      [mvn] 		at java.lang.Thread.run(Thread.java:679)
      [mvn] 	
      [mvn] 118554 T1627 oasc.SolrException.log SEVERE Sync Failed
      [mvn] Tests run: 1, Failures: 0, Errors: 0, Skipped: 0, Time elapsed: 118.665 sec
      [mvn] Running org.apache.solr.update.processor.UpdateRequestProcessorFactoryTest
      [mvn] Tests run: 2, Failures: 0, Errors: 0, Skipped: 0, Time elapsed: 0.85 sec
      [mvn] Running org.apache.solr.analysis.PathHierarchyTokenizerFactoryTest
      [mvn] Creating dataDir: /usr/home/hudson/hudson-slave/workspace/Lucene-Solr-Maven-4.x/maven-build/solr/core/src/test/target/test/./solrtest-PathHierarchyTokenizerFactoryTest-1348151260420
      [mvn] Tests run: 2, Failures: 0, Errors: 0, Skipped: 0, Time elapsed: 0.421 sec
      [mvn] Running org.apache.solr.cloud.RecoveryZkTest
      [mvn] Creating dataDir: /usr/home/hudson/hudson-slave/workspace/Lucene-Solr-Maven-4.x/maven-build/solr/core/src/test/target/test/./solrtest-RecoveryZkTest-1348151260856
      [mvn] ASYNC  NEW_CORE C6 name=collection1 org.apache.solr.core.SolrCore@2e4d6053 url=http://127.0.0.1:53093/solr/collection1 node=127.0.0.1:53093_solr
      [mvn] 9326 T1708 C6 P53093 oasc.SolrException.log SEVERE shard update error StdNode: http://127.0.0.1:47549/solr/collection1/:org.apache.solr.client.solrj.SolrServerException: IOException occured when talking to server at: http://127.0.0.1:47549/solr/collection1
      [mvn] 		at org.apache.solr.client.solrj.impl.HttpSolrServer.request(HttpSolrServer.java:414)
      [mvn] 		at org.apache.solr.client.solrj.impl.HttpSolrServer.request(HttpSolrServer.java:182)
      [mvn] 		at org.apache.solr.update.SolrCmdDistributor$1.call(SolrCmdDistributor.java:335)
      [mvn] 		at org.apache.solr.update.SolrCmdDistributor$1.call(SolrCmdDistributor.java:309)
      [mvn] 		at java.util.concurrent.FutureTask$Sync.innerRun(FutureTask.java:334)
      [mvn] 		at java.util.concurrent.FutureTask.run(FutureTask.java:166)
      [mvn] 		at java.util.concurrent.Executors$RunnableAdapter.call(Executors.java:471)
      [mvn] 		at java.util.concurrent.FutureTask$Sync.innerRun(FutureTask.java:334)
      [mvn] 		at java.util.concurrent.FutureTask.run(FutureTask.java:166)
      [mvn] 		at java.util.concurrent.ThreadPoolExecutor.runWorker(ThreadPoolExecutor.java:1110)
      [mvn] 		at java.util.concurrent.ThreadPoolExecutor$Worker.run(ThreadPoolExecutor.java:603)
      [mvn] 		at java.lang.Thread.run(Thread.java:679)
      [mvn] 	Caused by: org.apache.http.NoHttpResponseException: The target server failed to respond
      [mvn] 		at org.apache.http.impl.conn.DefaultResponseParser.parseHead(DefaultResponseParser.java:101)
      [mvn] 		at org.apache.http.impl.io.AbstractMessageParser.parse(AbstractMessageParser.java:252)
      [mvn] 		at org.apache.http.impl.AbstractHttpClientConnection.receiveResponseHeader(AbstractHttpClientConnection.java:282)
      [mvn] 		at org.apache.http.impl.conn.DefaultClientConnection.receiveResponseHeader(DefaultClientConnection.java:247)
      [mvn] 		at org.apache.http.impl.conn.AbstractClientConnAdapter.receiveResponseHeader(AbstractClientConnAdapter.java:216)
      [mvn] 		at org.apache.http.protocol.HttpRequestExecutor.doReceiveResponse(HttpRequestExecutor.java:298)
      [mvn] 		at org.apache.http.protocol.HttpRequestExecutor.execute(HttpRequestExecutor.java:125)
      [mvn] 		at org.apache.http.impl.client.DefaultRequestDirector.tryExecute(DefaultRequestDirector.java:647)
      [mvn] 		at org.apache.http.impl.client.DefaultRequestDirector.execute(DefaultRequestDirector.java:464)
      [mvn] 		at org.apache.http.impl.client.AbstractHttpClient.execute(AbstractHttpClient.java:820)
      [mvn] 		at org.apache.http.impl.client.AbstractHttpClient.execute(AbstractHttpClient.java:754)
      [mvn] 		at org.apache.http.impl.client.AbstractHttpClient.execute(AbstractHttpClient.java:732)
      [mvn] 		at org.apache.solr.client.solrj.impl.HttpSolrServer.request(HttpSolrServer.java:353)
      [mvn] 		... 11 more
      [mvn] 	
      [mvn] 9326 T1709 C6 P53093 oasc.SolrException.log SEVERE shard update error StdNode: http://127.0.0.1:47549/solr/collection1/:org.apache.solr.client.solrj.SolrServerException: IOException occured when talking to server at: http://127.0.0.1:47549/solr/collection1
      [mvn] 		at org.apache.solr.client.solrj.impl.HttpSolrServer.request(HttpSolrServer.java:414)
      [mvn] 		at org.apache.solr.client.solrj.impl.HttpSolrServer.request(HttpSolrServer.java:182)
      [mvn] 		at org.apache.solr.update.SolrCmdDistributor$1.call(SolrCmdDistributor.java:335)
      [mvn] 		at org.apache.solr.update.SolrCmdDistributor$1.call(SolrCmdDistributor.java:309)
      [mvn] 		at java.util.concurrent.FutureTask$Sync.innerRun(FutureTask.java:334)
      [mvn] 		at java.util.concurrent.FutureTask.run(FutureTask.java:166)
      [mvn] 		at java.util.concurrent.Executors$RunnableAdapter.call(Executors.java:471)
      [mvn] 		at java.util.concurrent.FutureTask$Sync.innerRun(FutureTask.java:334)
      [mvn] 		at java.util.concurrent.FutureTask.run(FutureTask.java:166)
      [mvn] 		at java.util.concurrent.ThreadPoolExecutor.runWorker(ThreadPoolExecutor.java:1110)
      [mvn] 		at java.util.concurrent.ThreadPoolExecutor$Worker.run(ThreadPoolExecutor.java:603)
      [mvn] 		at java.lang.Thread.run(Thread.java:679)
      [mvn] 	Caused by: org.apache.http.NoHttpResponseException: The target server failed to respond
      [mvn] 		at org.apache.http.impl.conn.DefaultResponseParser.parseHead(DefaultResponseParser.java:101)
      [mvn] 		at org.apache.http.impl.io.AbstractMessageParser.parse(AbstractMessageParser.java:252)
      [mvn] 		at org.apache.http.impl.AbstractHttpClientConnection.receiveResponseHeader(AbstractHttpClientConnection.java:282)
      [mvn] 		at org.apache.http.impl.conn.DefaultClientConnection.receiveResponseHeader(DefaultClientConnection.java:247)
      [mvn] 		at org.apache.http.impl.conn.AbstractClientConnAdapter.receiveResponseHeader(AbstractClientConnAdapter.java:216)
      [mvn] 		at org.apache.http.protocol.HttpRequestExecutor.doReceiveResponse(HttpRequestExecutor.java:298)
      [mvn] 		at org.apache.http.protocol.HttpRequestExecutor.execute(HttpRequestExecutor.java:125)
      [mvn] 		at org.apache.http.impl.client.DefaultRequestDirector.tryExecute(DefaultRequestDirector.java:647)
      [mvn] 		at org.apache.http.impl.client.DefaultRequestDirector.execute(DefaultRequestDirector.java:464)
      [mvn] 		at org.apache.http.impl.client.AbstractHttpClient.execute(AbstractHttpClient.java:820)
      [mvn] 		at org.apache.http.impl.client.AbstractHttpClient.execute(AbstractHttpClient.java:754)
      [mvn] 		at org.apache.http.impl.client.AbstractHttpClient.execute(AbstractHttpClient.java:732)
      [mvn] 		at org.apache.solr.client.solrj.impl.HttpSolrServer.request(HttpSolrServer.java:353)
      [mvn] 		... 11 more
      [mvn] 	
      [mvn] added docs:341 with 0 fails deletes:162
      [mvn] added docs:345 with 0 fails deletes:164
      [mvn] Tests run: 1, Failures: 0, Errors: 0, Skipped: 0, Time elapsed: 15.827 sec
      [mvn] Running org.apache.solr.update.DocumentBuilderTest
      [mvn] Creating dataDir: /usr/home/hudson/hudson-slave/workspace/Lucene-Solr-Maven-4.x/maven-build/solr/core/src/test/target/test/./solrtest-DocumentBuilderTest-1348151276682
      [mvn] Tests run: 11, Failures: 0, Errors: 0, Skipped: 0, Time elapsed: 0.582 sec
      [mvn] Running org.apache.solr.handler.component.DistributedQueryElevationComponentTest
      [mvn] Tests run: 1, Failures: 0, Errors: 0, Skipped: 0, Time elapsed: 1.051 sec
      [mvn] Running org.apache.solr.core.AlternateDirectoryTest
      [mvn] Creating dataDir: /usr/home/hudson/hudson-slave/workspace/Lucene-Solr-Maven-4.x/maven-build/solr/core/src/test/target/test/./solrtest-AlternateDirectoryTest-1348151278309
      [mvn] Tests run: 1, Failures: 0, Errors: 0, Skipped: 0, Time elapsed: 0.295 sec
      [mvn] Running org.apache.solr.handler.admin.SystemInfoHandlerTest
      [mvn] Tests run: 1, Failures: 0, Errors: 0, Skipped: 0, Time elapsed: 0.008 sec
      [mvn] Running org.apache.solr.search.TestStressRecovery
      [mvn] Creating dataDir: /usr/home/hudson/hudson-slave/workspace/Lucene-Solr-Maven-4.x/maven-build/solr/core/src/test/target/test/./solrtest-TestStressRecovery-1348151278614
      [mvn] Tests run: 1, Failures: 0, Errors: 0, Skipped: 0, Time elapsed: 4.368 sec
      [mvn] Running org.apache.solr.TestDistributedGrouping
      [mvn] Tests run: 1, Failures: 0, Errors: 0, Skipped: 0, Time elapsed: 11.225 sec
      [mvn] Running org.apache.solr.search.TestLFUCache
      [mvn] Creating dataDir: /usr/home/hudson/hudson-slave/workspace/Lucene-Solr-Maven-4.x/maven-build/solr/core/src/test/target/test/./solrtest-TestLFUCache-1348151294213
      [mvn] {39=39, 38=38, 37=37, 36=36, 35=35, 34=34, 33=33, 32=32, 31=31, 30=30}
      [mvn] Tests run: 5, Failures: 0, Errors: 0, Skipped: 0, Time elapsed: 0.708 sec
      [mvn] Running org.apache.solr.cloud.BasicZkTest
      [mvn] azt beforeclass
      [mvn] Creating dataDir: /usr/home/hudson/hudson-slave/workspace/Lucene-Solr-Maven-4.x/maven-build/solr/core/src/test/target/test/./solrtest-BasicZkTest-1348151294918
      [mvn] 4103 T1996 oasc.CoreContainer.reload SEVERE Unable to reload core: collection1 Ignoring exception matching SAXParseException
      [mvn] Tests run: 1, Failures: 0, Errors: 0, Skipped: 0, Time elapsed: 14.363 sec
      [mvn] Running org.apache.solr.core.RAMDirectoryFactoryTest
      [mvn] Tests run: 1, Failures: 0, Errors: 0, Skipped: 0, Time elapsed: 0.014 sec
      [mvn] Running org.apache.solr.search.TestIndexSearcher
      [mvn] Creating dataDir: /usr/home/hudson/hudson-slave/workspace/Lucene-Solr-Maven-4.x/maven-build/solr/core/src/test/target/test/./solrtest-TestIndexSearcher-1348151309305
      [mvn] Tests run: 2, Failures: 0, Errors: 0, Skipped: 0, Time elapsed: 1.411 sec
      [mvn] Running org.apache.solr.internal.csv.CharBufferTest
      [mvn] Tests run: 13, Failures: 0, Errors: 0, Skipped: 0, Time elapsed: 0.002 sec
      [mvn] Running org.apache.solr.core.RequestHandlersTest
      [mvn] Creating dataDir: /usr/home/hudson/hudson-slave/workspace/Lucene-Solr-Maven-4.x/maven-build/solr/core/src/test/target/test/./solrtest-RequestHandlersTest-1348151310717
      [mvn] Tests run: 3, Failures: 0, Errors: 0, Skipped: 0, Time elapsed: 0.566 sec
      [mvn] Running org.apache.solr.search.TestExtendedDismaxParser
      [mvn] Tests run: 10, Failures: 0, Errors: 0, Skipped: 0, Time elapsed: 4.663 sec
      [mvn] Running org.apache.solr.handler.component.DistributedSpellCheckComponentTest
      [mvn] Tests run: 1, Failures: 0, Errors: 0, Skipped: 0, Time elapsed: 8.018 sec
      [mvn] Running org.apache.solr.update.processor.StatelessScriptUpdateProcessorFactoryTest
      [mvn] Creating dataDir: /usr/home/hudson/hudson-slave/workspace/Lucene-Solr-Maven-4.x/maven-build/solr/core/src/test/target/test/./solrtest-StatelessScriptUpdateProcessorFactoryTest-1348151323977
      [mvn] Tests run: 7, Failures: 0, Errors: 0, Skipped: 0, Time elapsed: 1.181 sec
      [mvn] Running org.apache.solr.handler.component.SearchHandlerTest
      [mvn] Creating dataDir: /usr/home/hudson/hudson-slave/workspace/Lucene-Solr-Maven-4.x/maven-build/solr/core/src/test/target/test/./solrtest-SearchHandlerTest-1348151325156
      [mvn] Tests run: 1, Failures: 0, Errors: 0, Skipped: 0, Time elapsed: 0.541 sec
      [mvn] Running org.apache.solr.schema.CurrencyFieldTest
      [mvn] Creating dataDir: /usr/home/hudson/hudson-slave/workspace/Lucene-Solr-Maven-4.x/maven-build/solr/core/src/test/target/test/./solrtest-CurrencyFieldTest-1348151325694
      [mvn] Tests run: 8, Failures: 0, Errors: 0, Skipped: 1, Time elapsed: 0.662 sec
      [mvn] Running org.apache.solr.search.function.TestFunctionQuery
      [mvn] Creating dataDir: /usr/home/hudson/hudson-slave/workspace/Lucene-Solr-Maven-4.x/maven-build/solr/core/src/test/target/test/./solrtest-TestFunctionQuery-1348151326360
      [mvn] ASYNC  NEW_CORE C7 name=collection1 org.apache.solr.core.SolrCore@140dcdc5
      [mvn] 307 T2173 C7 oassf.FileFloatSource.getFloats SEVERE Error loading external value source + fileName + java.lang.NumberFormatException: For input string: ""
      [mvn] Tests run: 14, Failures: 0, Errors: 0, Skipped: 1, Time elapsed: 1.562 sec
      [mvn] Running org.apache.solr.request.TestBinaryResponseWriter
      [mvn] Tests run: 2, Failures: 0, Errors: 0, Skipped: 0, Time elapsed: 0.806 sec
      [mvn] Running org.apache.solr.core.SolrCoreTest
      [mvn] Creating dataDir: /usr/home/hudson/hudson-slave/workspace/Lucene-Solr-Maven-4.x/maven-build/solr/core/src/test/target/test/./solrtest-SolrCoreTest-1348151328727
      [mvn] Creating dataDir: /usr/home/hudson/hudson-slave/workspace/Lucene-Solr-Maven-4.x/maven-build/solr/core/src/test/target/test/./solrtest-SolrCoreTest-1348151329151
      [mvn] Creating dataDir: /usr/home/hudson/hudson-slave/workspace/Lucene-Solr-Maven-4.x/maven-build/solr/core/src/test/target/test/./solrtest-SolrCoreTest-1348151329567
      [mvn] Creating dataDir: /usr/home/hudson/hudson-slave/workspace/Lucene-Solr-Maven-4.x/maven-build/solr/core/src/test/target/test/./solrtest-SolrCoreTest-1348151330119
      [mvn] Creating dataDir: /usr/home/hudson/hudson-slave/workspace/Lucene-Solr-Maven-4.x/maven-build/solr/core/src/test/target/test/./solrtest-SolrCoreTest-1348151330619
      [mvn] Creating dataDir: /usr/home/hudson/hudson-slave/workspace/Lucene-Solr-Maven-4.x/maven-build/solr/core/src/test/target/test/./solrtest-SolrCoreTest-1348151332003
      [mvn] Tests run: 6, Failures: 0, Errors: 0, Skipped: 0, Time elapsed: 3.757 sec
      [mvn] Running org.apache.solr.cloud.OverseerTest
      [mvn] Creating dataDir: /usr/home/hudson/hudson-slave/workspace/Lucene-Solr-Maven-4.x/maven-build/solr/core/src/test/target/test/./solrtest-OverseerTest-1348151332487
      [mvn] 5929 T2398 oasc.Overseer.createOverseerNode SEVERE Could not create Overseer node org.apache.zookeeper.KeeperException$SessionExpiredException: KeeperErrorCode = Session expired for /overseer
      [mvn] 	at org.apache.zookeeper.KeeperException.create(KeeperException.java:118)
      [mvn] 	at org.apache.zookeeper.KeeperException.create(KeeperException.java:42)
      [mvn] 	at org.apache.zookeeper.ZooKeeper.create(ZooKeeper.java:643)
      [mvn] 	at org.apache.solr.common.cloud.SolrZkClient$9.execute(SolrZkClient.java:340)
      [mvn] 	at org.apache.solr.common.cloud.SolrZkClient$9.execute(SolrZkClient.java:337)
      [mvn] 	at org.apache.solr.common.cloud.ZkCmdExecutor.retryOperation(ZkCmdExecutor.java:67)
      [mvn] 	at org.apache.solr.common.cloud.SolrZkClient.create(SolrZkClient.java:337)
      [mvn] 	at org.apache.solr.cloud.Overseer.createOverseerNode(Overseer.java:541)
      [mvn] 	at org.apache.solr.cloud.Overseer.getInQueue(Overseer.java:523)
      [mvn] 	at org.apache.solr.cloud.ShardLeaderElectionContextBase.runLeaderProcess(ElectionContext.java:97)
      [mvn] 	at org.apache.solr.cloud.LeaderElector.runIamLeaderProcess(LeaderElector.java:158)
      [mvn] 	at org.apache.solr.cloud.LeaderElector.checkIfIamLeader(LeaderElector.java:102)
      [mvn] 	at org.apache.solr.cloud.LeaderElector.access$000(LeaderElector.java:56)
      [mvn] 	at org.apache.solr.cloud.LeaderElector$1.process(LeaderElector.java:131)
      [mvn] 	at org.apache.zookeeper.ClientCnxn$EventThread.processEvent(ClientCnxn.java:526)
      [mvn] 	at org.apache.zookeeper.ClientCnxn$EventThread.run(ClientCnxn.java:502)
      [mvn] 
      [mvn] 17335 T2572 oasc.SolrException.log SEVERE Failed setting watch:org.apache.zookeeper.KeeperException$NoNodeException: KeeperErrorCode = NoNode for /collections/collection1/leader_elect/shard1/election/88352446577770499-node1_core1-n_0000000000
      [mvn] 		at org.apache.zookeeper.KeeperException.create(KeeperException.java:102)
      [mvn] 		at org.apache.zookeeper.KeeperException.create(KeeperException.java:42)
      [mvn] 		at org.apache.zookeeper.ZooKeeper.getData(ZooKeeper.java:927)
      [mvn] 		at org.apache.solr.common.cloud.SolrZkClient$7.execute(SolrZkClient.java:292)
      [mvn] 		at org.apache.solr.common.cloud.SolrZkClient$7.execute(SolrZkClient.java:289)
      [mvn] 		at org.apache.solr.common.cloud.ZkCmdExecutor.retryOperation(ZkCmdExecutor.java:67)
      [mvn] 		at org.apache.solr.common.cloud.SolrZkClient.getData(SolrZkClient.java:289)
      [mvn] 		at org.apache.solr.cloud.LeaderElector.checkIfIamLeader(LeaderElector.java:119)
      [mvn] 		at org.apache.solr.cloud.LeaderElector.access$000(LeaderElector.java:56)
      [mvn] 		at org.apache.solr.cloud.LeaderElector$1.process(LeaderElector.java:131)
      [mvn] 		at org.apache.zookeeper.ClientCnxn$EventThread.processEvent(ClientCnxn.java:526)
      [mvn] 		at org.apache.zookeeper.ClientCnxn$EventThread.run(ClientCnxn.java:502)
      [mvn] 	
      [mvn] 17460 T2579 oasc.SolrException.log SEVERE Problem cleaning up collection in zk:collection1:org.apache.zookeeper.KeeperException$NotEmptyException: KeeperErrorCode = Directory not empty for /collections/collection1/leaders
      [mvn] 		at org.apache.zookeeper.KeeperException.create(KeeperException.java:116)
      [mvn] 		at org.apache.zookeeper.KeeperException.create(KeeperException.java:42)
      [mvn] 		at org.apache.zookeeper.ZooKeeper.delete(ZooKeeper.java:734)
      [mvn] 		at org.apache.solr.common.cloud.SolrZkClient$2.execute(SolrZkClient.java:169)
      [mvn] 		at org.apache.solr.common.cloud.SolrZkClient$2.execute(SolrZkClient.java:166)
      [mvn] 		at org.apache.solr.common.cloud.ZkCmdExecutor.retryOperation(ZkCmdExecutor.java:67)
      [mvn] 		at org.apache.solr.common.cloud.SolrZkClient.delete(SolrZkClient.java:166)
      [mvn] 		at org.apache.solr.common.cloud.SolrZkClient.clean(SolrZkClient.java:720)
      [mvn] 		at org.apache.solr.common.cloud.SolrZkClient.clean(SolrZkClient.java:715)
      [mvn] 		at org.apache.solr.cloud.Overseer$ClusterStateUpdater.removeCore(Overseer.java:418)
      [mvn] 		at org.apache.solr.cloud.Overseer$ClusterStateUpdater.processMessage(Overseer.java:171)
      [mvn] 		at org.apache.solr.cloud.Overseer$ClusterStateUpdater.run(Overseer.java:132)
      [mvn] 		at java.lang.Thread.run(Thread.java:679)
      [mvn] 	
      [mvn] 17472 T2579 oasc.Overseer$ClusterStateUpdater.setShardLeader SEVERE Could not mark shard leader for non existing collection:collection1
      [mvn] Tests run: 8, Failures: 0, Errors: 0, Skipped: 0, Time elapsed: 26.239 sec
      [mvn] Running org.apache.solr.util.TestUtils
      [mvn] Tests run: 3, Failures: 0, Errors: 0, Skipped: 0, Time elapsed: 0.033 sec
      [mvn] Running org.apache.solr.spelling.TestSuggestSpellingConverter
      [mvn] Tests run: 2, Failures: 0, Errors: 0, Skipped: 0, Time elapsed: 0.033 sec
      [mvn] Running org.apache.solr.TestRandomFaceting
      [mvn] Creating dataDir: /usr/home/hudson/hudson-slave/workspace/Lucene-Solr-Maven-4.x/maven-build/solr/core/src/test/target/test/./solrtest-TestRandomFaceting-1348151358794
      [mvn] Tests run: 1, Failures: 0, Errors: 0, Skipped: 0, Time elapsed: 9.267 sec
      [mvn] Running org.apache.solr.util.FileUtilsTest
      [mvn] Tests run: 1, Failures: 0, Errors: 0, Skipped: 0, Time elapsed: 0.021 sec
      [mvn] Running org.apache.solr.search.TestReload
      [mvn] Creating dataDir: /usr/home/hudson/hudson-slave/workspace/Lucene-Solr-Maven-4.x/maven-build/solr/core/src/test/target/test/./solrtest-TestReload-1348151368079
      [mvn] !!! softCommittrue
      [mvn] !!! softCommitfalse
      [mvn] !!! softCommitfalse
      [mvn] !!! softCommittrue
      [mvn] !!! softCommitfalse
      [mvn] !!! softCommittrue
      [mvn] Tests run: 1, Failures: 0, Errors: 0, Skipped: 0, Time elapsed: 2.523 sec
      [mvn] Running org.apache.solr.search.TestQueryUtils
      [mvn] Tests run: 1, Failures: 0, Errors: 0, Skipped: 0, Time elapsed: 0.603 sec
      [mvn] Running org.apache.solr.update.processor.ScriptEngineTest
      [mvn] Tests run: 6, Failures: 0, Errors: 0, Skipped: 1, Time elapsed: 0.098 sec
      [mvn] Running org.apache.solr.search.TestStressLucene
      [mvn] Tests run: 1, Failures: 0, Errors: 0, Skipped: 0, Time elapsed: 1.535 sec
      [mvn] Running org.apache.solr.request.TestWriterPerf
      [mvn] Tests run: 1, Failures: 0, Errors: 0, Skipped: 0, Time elapsed: 1.094 sec
      [mvn] Running org.apache.solr.request.TestFaceting
      [mvn] Creating dataDir: /usr/home/hudson/hudson-slave/workspace/Lucene-Solr-Maven-4.x/maven-build/solr/core/src/test/target/test/./solrtest-TestFaceting-1348151373942
      [mvn] Tests run: 3, Failures: 0, Errors: 0, Skipped: 0, Time elapsed: 5.379 sec
      [mvn] Running org.apache.solr.core.TestCoreContainer
      [mvn] Creating dataDir: /usr/home/hudson/hudson-slave/workspace/Lucene-Solr-Maven-4.x/maven-build/solr/core/src/test/target/test/./solrtest-TestCoreContainer-1348151379317
      [mvn] Tests run: 3, Failures: 0, Errors: 0, Skipped: 0, Time elapsed: 2.289 sec
      [mvn] Running org.apache.solr.internal.csv.writer.CSVFieldTest
      [mvn] Tests run: 2, Failures: 0, Errors: 0, Skipped: 0, Time elapsed: 0 sec
      [mvn] Running org.apache.solr.schema.IndexSchemaRuntimeFieldTest
      [mvn] Creating dataDir: /usr/home/hudson/hudson-slave/workspace/Lucene-Solr-Maven-4.x/maven-build/solr/core/src/test/target/test/./solrtest-IndexSchemaRuntimeFieldTest-1348151381611
      [mvn] Tests run: 1, Failures: 0, Errors: 0, Skipped: 0, Time elapsed: 0.522 sec
      [mvn] Running org.apache.solr.analysis.TestCharFilters
      [mvn] Creating dataDir: /usr/home/hudson/hudson-slave/workspace/Lucene-Solr-Maven-4.x/maven-build/solr/core/src/test/target/test/./solrtest-TestCharFilters-1348151382134
      [mvn] Tests run: 2, Failures: 0, Errors: 0, Skipped: 0, Time elapsed: 0.128 sec
      [mvn] Running org.apache.solr.schema.UUIDFieldTest
      [mvn] Tests run: 1, Failures: 0, Errors: 0, Skipped: 0, Time elapsed: 0.036 sec
      [mvn] Running org.apache.solr.handler.component.TermsComponentTest
      [mvn] Creating dataDir: /usr/home/hudson/hudson-slave/workspace/Lucene-Solr-Maven-4.x/maven-build/solr/core/src/test/target/test/./solrtest-TermsComponentTest-1348151382302
      [mvn] Tests run: 13, Failures: 0, Errors: 0, Skipped: 0, Time elapsed: 0.622 sec
      [mvn] Running org.apache.solr.handler.FieldAnalysisRequestHandlerTest
      [mvn] Creating dataDir: /usr/home/hudson/hudson-slave/workspace/Lucene-Solr-Maven-4.x/maven-build/solr/core/src/test/target/test/./solrtest-FieldAnalysisRequestHandlerTest-1348151382923
      [mvn] Tests run: 4, Failures: 0, Errors: 0, Skipped: 0, Time elapsed: 0.577 sec
      [mvn] Running org.apache.solr.search.TestSolrJ
      [mvn] Tests run: 1, Failures: 0, Errors: 0, Skipped: 0, Time elapsed: 0.017 sec
      [mvn] Running org.apache.solr.schema.NotRequiredUniqueKeyTest
      [mvn] Creating dataDir: /usr/home/hudson/hudson-slave/workspace/Lucene-Solr-Maven-4.x/maven-build/solr/core/src/test/target/test/./solrtest-NotRequiredUniqueKeyTest-1348151383518
      [mvn] Tests run: 1, Failures: 0, Errors: 0, Skipped: 0, Time elapsed: 0.16 sec
      [mvn] Running org.apache.solr.handler.component.QueryElevationComponentTest
      [mvn] Creating dataDir: /usr/home/hudson/hudson-slave/workspace/Lucene-Solr-Maven-4.x/maven-build/solr/core/src/test/target/test/./solrtest-QueryElevationComponentTest-1348151383684
      [mvn] Creating dataDir: /usr/home/hudson/hudson-slave/workspace/Lucene-Solr-Maven-4.x/maven-build/solr/core/src/test/target/test/./solrtest-QueryElevationComponentTest-1348151384085
      [mvn] Creating dataDir: /usr/home/hudson/hudson-slave/workspace/Lucene-Solr-Maven-4.x/maven-build/solr/core/src/test/target/test/./solrtest-QueryElevationComponentTest-1348151384331
      [mvn] Creating dataDir: /usr/home/hudson/hudson-slave/workspace/Lucene-Solr-Maven-4.x/maven-build/solr/core/src/test/target/test/./solrtest-QueryElevationComponentTest-1348151384640
      [mvn] Creating dataDir: /usr/home/hudson/hudson-slave/workspace/Lucene-Solr-Maven-4.x/maven-build/solr/core/src/test/target/test/./solrtest-QueryElevationComponentTest-1348151384964
      [mvn] Creating dataDir: /usr/home/hudson/hudson-slave/workspace/Lucene-Solr-Maven-4.x/maven-build/solr/core/src/test/target/test/./solrtest-QueryElevationComponentTest-1348151385258
      [mvn] Creating dataDir: /usr/home/hudson/hudson-slave/workspace/Lucene-Solr-Maven-4.x/maven-build/solr/core/src/test/target/test/./solrtest-QueryElevationComponentTest-1348151385542
      [mvn] Tests run: 7, Failures: 0, Errors: 0, Skipped: 0, Time elapsed: 2.14 sec
      [mvn] Running org.apache.solr.update.processor.SignatureUpdateProcessorFactoryTest
      [mvn] Creating dataDir: /usr/home/hudson/hudson-slave/workspace/Lucene-Solr-Maven-4.x/maven-build/solr/core/src/test/target/test/./solrtest-SignatureUpdateProcessorFactoryTest-1348151385817
      [mvn] Tests run: 6, Failures: 0, Errors: 0, Skipped: 0, Time elapsed: 0.569 sec
      [mvn] Running org.apache.solr.schema.NumericFieldsTest
      [mvn] Creating dataDir: /usr/home/hudson/hudson-slave/workspace/Lucene-Solr-Maven-4.x/maven-build/solr/core/src/test/target/test/./solrtest-NumericFieldsTest-1348151386387
      [mvn] Tests run: 1, Failures: 0, Errors: 0, Skipped: 0, Time elapsed: 0.192 sec
      [mvn] Running org.apache.solr.request.SimpleFacetsTest
      [mvn] Creating dataDir: /usr/home/hudson/hudson-slave/workspace/Lucene-Solr-Maven-4.x/maven-build/solr/core/src/test/target/test/./solrtest-SimpleFacetsTest-1348151386585
      [mvn] ASYNC  NEW_CORE C8 name=collection1 org.apache.solr.core.SolrCore@13b5bee0
      [mvn] 1853 T2842 C8 oasc.SolrException.log SEVERE org.apache.solr.common.SolrException: range facet infinite loop: gap is either zero, or too small relative start/end and caused underflow: 23.0 + 0 = 23.0
      [mvn] 		at org.apache.solr.request.SimpleFacets.getFacetRangeCounts(SimpleFacets.java:1122)
      [mvn] 		at org.apache.solr.request.SimpleFacets.getFacetRangeCounts(SimpleFacets.java:1074)
      [mvn] 		at org.apache.solr.request.SimpleFacets.getFacetRangeCounts(SimpleFacets.java:1018)
      [mvn] 		at org.apache.solr.request.SimpleFacets.getFacetCounts(SimpleFacets.java:208)
      [mvn] 		at org.apache.solr.handler.component.FacetComponent.process(FacetComponent.java:87)
      [mvn] 		at org.apache.solr.handler.component.SearchHandler.handleRequestBody(SearchHandler.java:206)
      [mvn] 		at org.apache.solr.handler.RequestHandlerBase.handleRequest(RequestHandlerBase.java:129)
      [mvn] 		at org.apache.solr.core.SolrCore.execute(SolrCore.java:1701)
      [mvn] 		at org.apache.solr.util.TestHarness.query(TestHarness.java:364)
      [mvn] 		at org.apache.solr.util.TestHarness.query(TestHarness.java:346)
      [mvn] 		at org.apache.solr.SolrTestCaseJ4.assertQEx(SolrTestCaseJ4.java:618)
      [mvn] 		at org.apache.solr.request.SimpleFacetsTest.testRangeFacetInfiniteLoopDetection(SimpleFacetsTest.java:2052)
      [mvn] 		at sun.reflect.NativeMethodAccessorImpl.invoke0(Native Method)
      [mvn] 		at sun.reflect.NativeMethodAccessorImpl.invoke(NativeMethodAccessorImpl.java:57)
      [mvn] 		at sun.reflect.DelegatingMethodAccessorImpl.invoke(DelegatingMethodAccessorImpl.java:43)
      [mvn] 		at java.lang.reflect.Method.invoke(Method.java:616)
      [mvn] 		at com.carrotsearch.randomizedtesting.RandomizedRunner.invoke(RandomizedRunner.java:1559)
      [mvn] 		at com.carrotsearch.randomizedtesting.RandomizedRunner.access$600(RandomizedRunner.java:79)
      [mvn] 		at com.carrotsearch.randomizedtesting.RandomizedRunner$6.evaluate(RandomizedRunner.java:737)
      [mvn] 		at com.carrotsearch.randomizedtesting.RandomizedRunner$7.evaluate(RandomizedRunner.java:773)
      [mvn] 		at com.carrotsearch.randomizedtesting.RandomizedRunner$8.evaluate(RandomizedRunner.java:787)
      [mvn] 		at com.carrotsearch.randomizedtesting.rules.SystemPropertiesRestoreRule$1.evaluate(SystemPropertiesRestoreRule.java:53)
      [mvn] 		at org.apache.lucene.util.TestRuleSetupTeardownChained$1.evaluate(TestRuleSetupTeardownChained.java:50)
      [mvn] 		at org.apache.lucene.util.TestRuleFieldCacheSanity$1.evaluate(TestRuleFieldCacheSanity.java:51)
      [mvn] 		at org.apache.lucene.util.AbstractBeforeAfterRule$1.evaluate(AbstractBeforeAfterRule.java:45)
      [mvn] 		at com.carrotsearch.randomizedtesting.rules.SystemPropertiesInvariantRule$1.evaluate(SystemPropertiesInvariantRule.java:55)
      [mvn] 		at org.apache.lucene.util.TestRuleThreadAndTestName$1.evaluate(TestRuleThreadAndTestName.java:48)
      [mvn] 		at org.apache.lucene.util.TestRuleIgnoreAfterMaxFailures$1.evaluate(TestRuleIgnoreAfterMaxFailures.java:70)
      [mvn] 		at org.apache.lucene.util.TestRuleMarkFailure$1.evaluate(TestRuleMarkFailure.java:48)
      [mvn] 		at com.carrotsearch.randomizedtesting.rules.StatementAdapter.evaluate(StatementAdapter.java:36)
      [mvn] 		at com.carrotsearch.randomizedtesting.ThreadLeakControl$StatementRunner.run(ThreadLeakControl.java:358)
      [mvn] 		at com.carrotsearch.randomizedtesting.ThreadLeakControl.forkTimeoutingTask(ThreadLeakControl.java:782)
      [mvn] 		at com.carrotsearch.randomizedtesting.ThreadLeakControl$3.evaluate(ThreadLeakControl.java:442)
      [mvn] 		at com.carrotsearch.randomizedtesting.RandomizedRunner.runSingleTest(RandomizedRunner.java:746)
      [mvn] 		at com.carrotsearch.randomizedtesting.RandomizedRunner$3.evaluate(RandomizedRunner.java:648)
      [mvn] 		at com.carrotsearch.randomizedtesting.RandomizedRunner$4.evaluate(RandomizedRunner.java:682)
      [mvn] 		at com.carrotsearch.randomizedtesting.RandomizedRunner$5.evaluate(RandomizedRunner.java:693)
      [mvn] 		at com.carrotsearch.randomizedtesting.rules.StatementAdapter.evaluate(StatementAdapter.java:36)
      [mvn] 		at com.carrotsearch.randomizedtesting.rules.SystemPropertiesRestoreRule$1.evaluate(SystemPropertiesRestoreRule.java:53)
      [mvn] 		at org.apache.lucene.util.AbstractBeforeAfterRule$1.evaluate(AbstractBeforeAfterRule.java:45)
      [mvn] 		at org.apache.lucene.util.TestRuleStoreClassName$1.evaluate(TestRuleStoreClassName.java:42)
      [mvn] 		at com.carrotsearch.randomizedtesting.rules.SystemPropertiesInvariantRule$1.evaluate(SystemPropertiesInvariantRule.java:55)
      [mvn] 		at com.carrotsearch.randomizedtesting.rules.NoShadowingOrOverridesOnMethodsRule$1.evaluate(NoShadowingOrOverridesOnMethodsRule.java:39)
      [mvn] 		at com.carrotsearch.randomizedtesting.rules.NoShadowingOrOverridesOnMethodsRule$1.evaluate(NoShadowingOrOverridesOnMethodsRule.java:39)
      [mvn] 		at com.carrotsearch.randomizedtesting.rules.StatementAdapter.evaluate(StatementAdapter.java:36)
      [mvn] 		at org.apache.lucene.util.TestRuleAssertionsRequired$1.evaluate(TestRuleAssertionsRequired.java:43)
      [mvn] 		at org.apache.lucene.util.TestRuleMarkFailure$1.evaluate(TestRuleMarkFailure.java:48)
      [mvn] 		at org.apache.lucene.util.TestRuleIgnoreAfterMaxFailures$1.evaluate(TestRuleIgnoreAfterMaxFailures.java:70)
      [mvn] 		at org.apache.lucene.util.TestRuleIgnoreTestSuites$1.evaluate(TestRuleIgnoreTestSuites.java:55)
      [mvn] 		at com.carrotsearch.randomizedtesting.rules.StatementAdapter.evaluate(StatementAdapter.java:36)
      [mvn] 		at com.carrotsearch.randomizedtesting.ThreadLeakControl$StatementRunner.run(ThreadLeakControl.java:358)
      [mvn] 		at java.lang.Thread.run(Thread.java:679)
      [mvn] 	
      [mvn] 1854 T2842 C8 oasc.SolrException.log SEVERE org.apache.solr.common.SolrException: range facet infinite loop: gap is either zero, or too small relative start/end and caused underflow: 23.0 + 0 = 23.0
      [mvn] 		at org.apache.solr.request.SimpleFacets.getFacetRangeCounts(SimpleFacets.java:1122)
      [mvn] 		at org.apache.solr.request.SimpleFacets.getFacetRangeCounts(SimpleFacets.java:1074)
      [mvn] 		at org.apache.solr.request.SimpleFacets.getFacetRangeCounts(SimpleFacets.java:1018)
      [mvn] 		at org.apache.solr.request.SimpleFacets.getFacetCounts(SimpleFacets.java:208)
      [mvn] 		at org.apache.solr.handler.component.FacetComponent.process(FacetComponent.java:87)
      [mvn] 		at org.apache.solr.handler.component.SearchHandler.handleRequestBody(SearchHandler.java:206)
      [mvn] 		at org.apache.solr.handler.RequestHandlerBase.handleRequest(RequestHandlerBase.java:129)
      [mvn] 		at org.apache.solr.core.SolrCore.execute(SolrCore.java:1701)
      [mvn] 		at org.apache.solr.util.TestHarness.query(TestHarness.java:364)
      [mvn] 		at org.apache.solr.util.TestHarness.query(TestHarness.java:346)
      [mvn] 		at org.apache.solr.SolrTestCaseJ4.assertQEx(SolrTestCaseJ4.java:618)
      [mvn] 		at org.apache.solr.request.SimpleFacetsTest.testRangeFacetInfiniteLoopDetection(SimpleFacetsTest.java:2052)
      [mvn] 		at sun.reflect.NativeMethodAccessorImpl.invoke0(Native Method)
      [mvn] 		at sun.reflect.NativeMethodAccessorImpl.invoke(NativeMethodAccessorImpl.java:57)
      [mvn] 		at sun.reflect.DelegatingMethodAccessorImpl.invoke(DelegatingMethodAccessorImpl.java:43)
      [mvn] 		at java.lang.reflect.Method.invoke(Method.java:616)
      [mvn] 		at com.carrotsearch.randomizedtesting.RandomizedRunner.invoke(RandomizedRunner.java:1559)
      [mvn] 		at com.carrotsearch.randomizedtesting.RandomizedRunner.access$600(RandomizedRunner.java:79)
      [mvn] 		at com.carrotsearch.randomizedtesting.RandomizedRunner$6.evaluate(RandomizedRunner.java:737)
      [mvn] 		at com.carrotsearch.randomizedtesting.RandomizedRunner$7.evaluate(RandomizedRunner.java:773)
      [mvn] 		at com.carrotsearch.randomizedtesting.RandomizedRunner$8.evaluate(RandomizedRunner.java:787)
      [mvn] 		at com.carrotsearch.randomizedtesting.rules.SystemPropertiesRestoreRule$1.evaluate(SystemPropertiesRestoreRule.java:53)
      [mvn] 		at org.apache.lucene.util.TestRuleSetupTeardownChained$1.evaluate(TestRuleSetupTeardownChained.java:50)
      [mvn] 		at org.apache.lucene.util.TestRuleFieldCacheSanity$1.evaluate(TestRuleFieldCacheSanity.java:51)
      [mvn] 		at org.apache.lucene.util.AbstractBeforeAfterRule$1.evaluate(AbstractBeforeAfterRule.java:45)
      [mvn] 		at com.carrotsearch.randomizedtesting.rules.SystemPropertiesInvariantRule$1.evaluate(SystemPropertiesInvariantRule.java:55)
      [mvn] 		at org.apache.lucene.util.TestRuleThreadAndTestName$1.evaluate(TestRuleThreadAndTestName.java:48)
      [mvn] 		at org.apache.lucene.util.TestRuleIgnoreAfterMaxFailures$1.evaluate(TestRuleIgnoreAfterMaxFailures.java:70)
      [mvn] 		at org.apache.lucene.util.TestRuleMarkFailure$1.evaluate(TestRuleMarkFailure.java:48)
      [mvn] 		at com.carrotsearch.randomizedtesting.rules.StatementAdapter.evaluate(StatementAdapter.java:36)
      [mvn] 		at com.carrotsearch.randomizedtesting.ThreadLeakControl$StatementRunner.run(ThreadLeakControl.java:358)
      [mvn] 		at com.carrotsearch.randomizedtesting.ThreadLeakControl.forkTimeoutingTask(ThreadLeakControl.java:782)
      [mvn] 		at com.carrotsearch.randomizedtesting.ThreadLeakControl$3.evaluate(ThreadLeakControl.java:442)
      [mvn] 		at com.carrotsearch.randomizedtesting.RandomizedRunner.runSingleTest(RandomizedRunner.java:746)
      [mvn] 		at com.carrotsearch.randomizedtesting.RandomizedRunner$3.evaluate(RandomizedRunner.java:648)
      [mvn] 		at com.carrotsearch.randomizedtesting.RandomizedRunner$4.evaluate(RandomizedRunner.java:682)
      [mvn] 		at com.carrotsearch.randomizedtesting.RandomizedRunner$5.evaluate(RandomizedRunner.java:693)
      [mvn] 		at com.carrotsearch.randomizedtesting.rules.StatementAdapter.evaluate(StatementAdapter.java:36)
      [mvn] 		at com.carrotsearch.randomizedtesting.rules.SystemPropertiesRestoreRule$1.evaluate(SystemPropertiesRestoreRule.java:53)
      [mvn] 		at org.apache.lucene.util.AbstractBeforeAfterRule$1.evaluate(AbstractBeforeAfterRule.java:45)
      [mvn] 		at org.apache.lucene.util.TestRuleStoreClassName$1.evaluate(TestRuleStoreClassName.java:42)
      [mvn] 		at com.carrotsearch.randomizedtesting.rules.SystemPropertiesInvariantRule$1.evaluate(SystemPropertiesInvariantRule.java:55)
      [mvn] 		at com.carrotsearch.randomizedtesting.rules.NoShadowingOrOverridesOnMethodsRule$1.evaluate(NoShadowingOrOverridesOnMethodsRule.java:39)
      [mvn] 		at com.carrotsearch.randomizedtesting.rules.NoShadowingOrOverridesOnMethodsRule$1.evaluate(NoShadowingOrOverridesOnMethodsRule.java:39)
      [mvn] 		at com.carrotsearch.randomizedtesting.rules.StatementAdapter.evaluate(StatementAdapter.java:36)
      [mvn] 		at org.apache.lucene.util.TestRuleAssertionsRequired$1.evaluate(TestRuleAssertionsRequired.java:43)
      [mvn] 		at org.apache.lucene.util.TestRuleMarkFailure$1.evaluate(TestRuleMarkFailure.java:48)
      [mvn] 		at org.apache.lucene.util.TestRuleIgnoreAfterMaxFailures$1.evaluate(TestRuleIgnoreAfterMaxFailures.java:70)
      [mvn] 		at org.apache.lucene.util.TestRuleIgnoreTestSuites$1.evaluate(TestRuleIgnoreTestSuites.java:55)
      [mvn] 		at com.carrotsearch.randomizedtesting.rules.StatementAdapter.evaluate(StatementAdapter.java:36)
      [mvn] 		at com.carrotsearch.randomizedtesting.ThreadLeakControl$StatementRunner.run(ThreadLeakControl.java:358)
      [mvn] 		at java.lang.Thread.run(Thread.java:679)
      [mvn] 	
      [mvn] 1855 T2842 C8 oasc.SolrException.log SEVERE org.apache.solr.common.SolrException: range facet infinite loop: gap is either zero, or too small relative start/end and caused underflow: 23.0 + 0 = 23.0
      [mvn] 		at org.apache.solr.request.SimpleFacets.getFacetRangeCounts(SimpleFacets.java:1122)
      [mvn] 		at org.apache.solr.request.SimpleFacets.getFacetRangeCounts(SimpleFacets.java:1074)
      [mvn] 		at org.apache.solr.request.SimpleFacets.getFacetRangeCounts(SimpleFacets.java:1018)
      [mvn] 		at org.apache.solr.request.SimpleFacets.getFacetCounts(SimpleFacets.java:208)
      [mvn] 		at org.apache.solr.handler.component.FacetComponent.process(FacetComponent.java:87)
      [mvn] 		at org.apache.solr.handler.component.SearchHandler.handleRequestBody(SearchHandler.java:206)
      [mvn] 		at org.apache.solr.handler.RequestHandlerBase.handleRequest(RequestHandlerBase.java:129)
      [mvn] 		at org.apache.solr.core.SolrCore.execute(SolrCore.java:1701)
      [mvn] 		at org.apache.solr.util.TestHarness.query(TestHarness.java:364)
      [mvn] 		at org.apache.solr.util.TestHarness.query(TestHarness.java:346)
      [mvn] 		at org.apache.solr.SolrTestCaseJ4.assertQEx(SolrTestCaseJ4.java:618)
      [mvn] 		at org.apache.solr.request.SimpleFacetsTest.testRangeFacetInfiniteLoopDetection(SimpleFacetsTest.java:2052)
      [mvn] 		at sun.reflect.NativeMethodAccessorImpl.invoke0(Native Method)
      [mvn] 		at sun.reflect.NativeMethodAccessorImpl.invoke(NativeMethodAccessorImpl.java:57)
      [mvn] 		at sun.reflect.DelegatingMethodAccessorImpl.invoke(DelegatingMethodAccessorImpl.java:43)
      [mvn] 		at java.lang.reflect.Method.invoke(Method.java:616)
      [mvn] 		at com.carrotsearch.randomizedtesting.RandomizedRunner.invoke(RandomizedRunner.java:1559)
      [mvn] 		at com.carrotsearch.randomizedtesting.RandomizedRunner.access$600(RandomizedRunner.java:79)
      [mvn] 		at com.carrotsearch.randomizedtesting.RandomizedRunner$6.evaluate(RandomizedRunner.java:737)
      [mvn] 		at com.carrotsearch.randomizedtesting.RandomizedRunner$7.evaluate(RandomizedRunner.java:773)
      [mvn] 		at com.carrotsearch.randomizedtesting.RandomizedRunner$8.evaluate(RandomizedRunner.java:787)
      [mvn] 		at com.carrotsearch.randomizedtesting.rules.SystemPropertiesRestoreRule$1.evaluate(SystemPropertiesRestoreRule.java:53)
      [mvn] 		at org.apache.lucene.util.TestRuleSetupTeardownChained$1.evaluate(TestRuleSetupTeardownChained.java:50)
      [mvn] 		at org.apache.lucene.util.TestRuleFieldCacheSanity$1.evaluate(TestRuleFieldCacheSanity.java:51)
      [mvn] 		at org.apache.lucene.util.AbstractBeforeAfterRule$1.evaluate(AbstractBeforeAfterRule.java:45)
      [mvn] 		at com.carrotsearch.randomizedtesting.rules.SystemPropertiesInvariantRule$1.evaluate(SystemPropertiesInvariantRule.java:55)
      [mvn] 		at org.apache.lucene.util.TestRuleThreadAndTestName$1.evaluate(TestRuleThreadAndTestName.java:48)
      [mvn] 		at org.apache.lucene.util.TestRuleIgnoreAfterMaxFailures$1.evaluate(TestRuleIgnoreAfterMaxFailures.java:70)
      [mvn] 		at org.apache.lucene.util.TestRuleMarkFailure$1.evaluate(TestRuleMarkFailure.java:48)
      [mvn] 		at com.carrotsearch.randomizedtesting.rules.StatementAdapter.evaluate(StatementAdapter.java:36)
      [mvn] 		at com.carrotsearch.randomizedtesting.ThreadLeakControl$StatementRunner.run(ThreadLeakControl.java:358)
      [mvn] 		at com.carrotsearch.randomizedtesting.ThreadLeakControl.forkTimeoutingTask(ThreadLeakControl.java:782)
      [mvn] 		at com.carrotsearch.randomizedtesting.ThreadLeakControl$3.evaluate(ThreadLeakControl.java:442)
      [mvn] 		at com.carrotsearch.randomizedtesting.RandomizedRunner.runSingleTest(RandomizedRunner.java:746)
      [mvn] 		at com.carrotsearch.randomizedtesting.RandomizedRunner$3.evaluate(RandomizedRunner.java:648)
      [mvn] 		at com.carrotsearch.randomizedtesting.RandomizedRunner$4.evaluate(RandomizedRunner.java:682)
      [mvn] 		at com.carrotsearch.randomizedtesting.RandomizedRunner$5.evaluate(RandomizedRunner.java:693)
      [mvn] 		at com.carrotsearch.randomizedtesting.rules.StatementAdapter.evaluate(StatementAdapter.java:36)
      [mvn] 		at com.carrotsearch.randomizedtesting.rules.SystemPropertiesRestoreRule$1.evaluate(SystemPropertiesRestoreRule.java:53)
      [mvn] 		at org.apache.lucene.util.AbstractBeforeAfterRule$1.evaluate(AbstractBeforeAfterRule.java:45)
      [mvn] 		at org.apache.lucene.util.TestRuleStoreClassName$1.evaluate(TestRuleStoreClassName.java:42)
      [mvn] 		at com.carrotsearch.randomizedtesting.rules.SystemPropertiesInvariantRule$1.evaluate(SystemPropertiesInvariantRule.java:55)
      [mvn] 		at com.carrotsearch.randomizedtesting.rules.NoShadowingOrOverridesOnMethodsRule$1.evaluate(NoShadowingOrOverridesOnMethodsRule.java:39)
      [mvn] 		at com.carrotsearch.randomizedtesting.rules.NoShadowingOrOverridesOnMethodsRule$1.evaluate(NoShadowingOrOverridesOnMethodsRule.java:39)
      [mvn] 		at com.carrotsearch.randomizedtesting.rules.StatementAdapter.evaluate(StatementAdapter.java:36)
      [mvn] 		at org.apache.lucene.util.TestRuleAssertionsRequired$1.evaluate(TestRuleAssertionsRequired.java:43)
      [mvn] 		at org.apache.lucene.util.TestRuleMarkFailure$1.evaluate(TestRuleMarkFailure.java:48)
      [mvn] 		at org.apache.lucene.util.TestRuleIgnoreAfterMaxFailures$1.evaluate(TestRuleIgnoreAfterMaxFailures.java:70)
      [mvn] 		at org.apache.lucene.util.TestRuleIgnoreTestSuites$1.evaluate(TestRuleIgnoreTestSuites.java:55)
      [mvn] 		at com.carrotsearch.randomizedtesting.rules.StatementAdapter.evaluate(StatementAdapter.java:36)
      [mvn] 		at com.carrotsearch.randomizedtesting.ThreadLeakControl$StatementRunner.run(ThreadLeakControl.java:358)
      [mvn] 		at java.lang.Thread.run(Thread.java:679)
      [mvn] 	
      [mvn] 1856 T2842 C8 oasc.SolrException.log SEVERE org.apache.solr.common.SolrException: range facet infinite loop: gap is either zero, or too small relative start/end and caused underflow: 23.0 + 0 = 23.0
      [mvn] 		at org.apache.solr.request.SimpleFacets.getFacetRangeCounts(SimpleFacets.java:1122)
      [mvn] 		at org.apache.solr.request.SimpleFacets.getFacetRangeCounts(SimpleFacets.java:1074)
      [mvn] 		at org.apache.solr.request.SimpleFacets.getFacetRangeCounts(SimpleFacets.java:1018)
      [mvn] 		at org.apache.solr.request.SimpleFacets.getFacetCounts(SimpleFacets.java:208)
      [mvn] 		at org.apache.solr.handler.component.FacetComponent.process(FacetComponent.java:87)
      [mvn] 		at org.apache.solr.handler.component.SearchHandler.handleRequestBody(SearchHandler.java:206)
      [mvn] 		at org.apache.solr.handler.RequestHandlerBase.handleRequest(RequestHandlerBase.java:129)
      [mvn] 		at org.apache.solr.core.SolrCore.execute(SolrCore.java:1701)
      [mvn] 		at org.apache.solr.util.TestHarness.query(TestHarness.java:364)
      [mvn] 		at org.apache.solr.util.TestHarness.query(TestHarness.java:346)
      [mvn] 		at org.apache.solr.SolrTestCaseJ4.assertQEx(SolrTestCaseJ4.java:618)
      [mvn] 		at org.apache.solr.request.SimpleFacetsTest.testRangeFacetInfiniteLoopDetection(SimpleFacetsTest.java:2052)
      [mvn] 		at sun.reflect.NativeMethodAccessorImpl.invoke0(Native Method)
      [mvn] 		at sun.reflect.NativeMethodAccessorImpl.invoke(NativeMethodAccessorImpl.java:57)
      [mvn] 		at sun.reflect.DelegatingMethodAccessorImpl.invoke(DelegatingMethodAccessorImpl.java:43)
      [mvn] 		at java.lang.reflect.Method.invoke(Method.java:616)
      [mvn] 		at com.carrotsearch.randomizedtesting.RandomizedRunner.invoke(RandomizedRunner.java:1559)
      [mvn] 		at com.carrotsearch.randomizedtesting.RandomizedRunner.access$600(RandomizedRunner.java:79)
      [mvn] 		at com.carrotsearch.randomizedtesting.RandomizedRunner$6.evaluate(RandomizedRunner.java:737)
      [mvn] 		at com.carrotsearch.randomizedtesting.RandomizedRunner$7.evaluate(RandomizedRunner.java:773)
      [mvn] 		at com.carrotsearch.randomizedtesting.RandomizedRunner$8.evaluate(RandomizedRunner.java:787)
      [mvn] 		at com.carrotsearch.randomizedtesting.rules.SystemPropertiesRestoreRule$1.evaluate(SystemPropertiesRestoreRule.java:53)
      [mvn] 		at org.apache.lucene.util.TestRuleSetupTeardownChained$1.evaluate(TestRuleSetupTeardownChained.java:50)
      [mvn] 		at org.apache.lucene.util.TestRuleFieldCacheSanity$1.evaluate(TestRuleFieldCacheSanity.java:51)
      [mvn] 		at org.apache.lucene.util.AbstractBeforeAfterRule$1.evaluate(AbstractBeforeAfterRule.java:45)
      [mvn] 		at com.carrotsearch.randomizedtesting.rules.SystemPropertiesInvariantRule$1.evaluate(SystemPropertiesInvariantRule.java:55)
      [mvn] 		at org.apache.lucene.util.TestRuleThreadAndTestName$1.evaluate(TestRuleThreadAndTestName.java:48)
      [mvn] 		at org.apache.lucene.util.TestRuleIgnoreAfterMaxFailures$1.evaluate(TestRuleIgnoreAfterMaxFailures.java:70)
      [mvn] 		at org.apache.lucene.util.TestRuleMarkFailure$1.evaluate(TestRuleMarkFailure.java:48)
      [mvn] 		at com.carrotsearch.randomizedtesting.rules.StatementAdapter.evaluate(StatementAdapter.java:36)
      [mvn] 		at com.carrotsearch.randomizedtesting.ThreadLeakControl$StatementRunner.run(ThreadLeakControl.java:358)
      [mvn] 		at com.carrotsearch.randomizedtesting.ThreadLeakControl.forkTimeoutingTask(ThreadLeakControl.java:782)
      [mvn] 		at com.carrotsearch.randomizedtesting.ThreadLeakControl$3.evaluate(ThreadLeakControl.java:442)
      [mvn] 		at com.carrotsearch.randomizedtesting.RandomizedRunner.runSingleTest(RandomizedRunner.java:746)
      [mvn] 		at com.carrotsearch.randomizedtesting.RandomizedRunner$3.evaluate(RandomizedRunner.java:648)
      [mvn] 		at com.carrotsearch.randomizedtesting.RandomizedRunner$4.evaluate(RandomizedRunner.java:682)
      [mvn] 		at com.carrotsearch.randomizedtesting.RandomizedRunner$5.evaluate(RandomizedRunner.java:693)
      [mvn] 		at com.carrotsearch.randomizedtesting.rules.StatementAdapter.evaluate(StatementAdapter.java:36)
      [mvn] 		at com.carrotsearch.randomizedtesting.rules.SystemPropertiesRestoreRule$1.evaluate(SystemPropertiesRestoreRule.java:53)
      [mvn] 		at org.apache.lucene.util.AbstractBeforeAfterRule$1.evaluate(AbstractBeforeAfterRule.java:45)
      [mvn] 		at org.apache.lucene.util.TestRuleStoreClassName$1.evaluate(TestRuleStoreClassName.java:42)
      [mvn] 		at com.carrotsearch.randomizedtesting.rules.SystemPropertiesInvariantRule$1.evaluate(SystemPropertiesInvariantRule.java:55)
      [mvn] 		at com.carrotsearch.randomizedtesting.rules.NoShadowingOrOverridesOnMethodsRule$1.evaluate(NoShadowingOrOverridesOnMethodsRule.java:39)
      [mvn] 		at com.carrotsearch.randomizedtesting.rules.NoShadowingOrOverridesOnMethodsRule$1.evaluate(NoShadowingOrOverridesOnMethodsRule.java:39)
      [mvn] 		at com.carrotsearch.randomizedtesting.rules.StatementAdapter.evaluate(StatementAdapter.java:36)
      [mvn] 		at org.apache.lucene.util.TestRuleAssertionsRequired$1.evaluate(TestRuleAssertionsRequired.java:43)
      [mvn] 		at org.apache.lucene.util.TestRuleMarkFailure$1.evaluate(TestRuleMarkFailure.java:48)
      [mvn] 		at org.apache.lucene.util.TestRuleIgnoreAfterMaxFailures$1.evaluate(TestRuleIgnoreAfterMaxFailures.java:70)
      [mvn] 		at org.apache.lucene.util.TestRuleIgnoreTestSuites$1.evaluate(TestRuleIgnoreTestSuites.java:55)
      [mvn] 		at com.carrotsearch.randomizedtesting.rules.StatementAdapter.evaluate(StatementAdapter.java:36)
      [mvn] 		at com.carrotsearch.randomizedtesting.ThreadLeakControl$StatementRunner.run(ThreadLeakControl.java:358)
      [mvn] 		at java.lang.Thread.run(Thread.java:679)
      [mvn] 	
      [mvn] 1857 T2842 C8 oasc.SolrException.log SEVERE org.apache.solr.common.SolrException: range facet infinite loop: gap is either zero, or too small relative start/end and caused underflow: 23 + 0 = 23
      [mvn] 		at org.apache.solr.request.SimpleFacets.getFacetRangeCounts(SimpleFacets.java:1122)
      [mvn] 		at org.apache.solr.request.SimpleFacets.getFacetRangeCounts(SimpleFacets.java:1074)
      [mvn] 		at org.apache.solr.request.SimpleFacets.getFacetRangeCounts(SimpleFacets.java:1018)
      [mvn] 		at org.apache.solr.request.SimpleFacets.getFacetCounts(SimpleFacets.java:208)
      [mvn] 		at org.apache.solr.handler.component.FacetComponent.process(FacetComponent.java:87)
      [mvn] 		at org.apache.solr.handler.component.SearchHandler.handleRequestBody(SearchHandler.java:206)
      [mvn] 		at org.apache.solr.handler.RequestHandlerBase.handleRequest(RequestHandlerBase.java:129)
      [mvn] 		at org.apache.solr.core.SolrCore.execute(SolrCore.java:1701)
      [mvn] 		at org.apache.solr.util.TestHarness.query(TestHarness.java:364)
      [mvn] 		at org.apache.solr.util.TestHarness.query(TestHarness.java:346)
      [mvn] 		at org.apache.solr.SolrTestCaseJ4.assertQEx(SolrTestCaseJ4.java:618)
      [mvn] 		at org.apache.solr.request.SimpleFacetsTest.testRangeFacetInfiniteLoopDetection(SimpleFacetsTest.java:2052)
      [mvn] 		at sun.reflect.NativeMethodAccessorImpl.invoke0(Native Method)
      [mvn] 		at sun.reflect.NativeMethodAccessorImpl.invoke(NativeMethodAccessorImpl.java:57)
      [mvn] 		at sun.reflect.DelegatingMethodAccessorImpl.invoke(DelegatingMethodAccessorImpl.java:43)
      [mvn] 		at java.lang.reflect.Method.invoke(Method.java:616)
      [mvn] 		at com.carrotsearch.randomizedtesting.RandomizedRunner.invoke(RandomizedRunner.java:1559)
      [mvn] 		at com.carrotsearch.randomizedtesting.RandomizedRunner.access$600(RandomizedRunner.java:79)
      [mvn] 		at com.carrotsearch.randomizedtesting.RandomizedRunner$6.evaluate(RandomizedRunner.java:737)
      [mvn] 		at com.carrotsearch.randomizedtesting.RandomizedRunner$7.evaluate(RandomizedRunner.java:773)
      [mvn] 		at com.carrotsearch.randomizedtesting.RandomizedRunner$8.evaluate(RandomizedRunner.java:787)
      [mvn] 		at com.carrotsearch.randomizedtesting.rules.SystemPropertiesRestoreRule$1.evaluate(SystemPropertiesRestoreRule.java:53)
      [mvn] 		at org.apache.lucene.util.TestRuleSetupTeardownChained$1.evaluate(TestRuleSetupTeardownChained.java:50)
      [mvn] 		at org.apache.lucene.util.TestRuleFieldCacheSanity$1.evaluate(TestRuleFieldCacheSanity.java:51)
      [mvn] 		at org.apache.lucene.util.AbstractBeforeAfterRule$1.evaluate(AbstractBeforeAfterRule.java:45)
      [mvn] 		at com.carrotsearch.randomizedtesting.rules.SystemPropertiesInvariantRule$1.evaluate(SystemPropertiesInvariantRule.java:55)
      [mvn] 		at org.apache.lucene.util.TestRuleThreadAndTestName$1.evaluate(TestRuleThreadAndTestName.java:48)
      [mvn] 		at org.apache.lucene.util.TestRuleIgnoreAfterMaxFailures$1.evaluate(TestRuleIgnoreAfterMaxFailures.java:70)
      [mvn] 		at org.apache.lucene.util.TestRuleMarkFailure$1.evaluate(TestRuleMarkFailure.java:48)
      [mvn] 		at com.carrotsearch.randomizedtesting.rules.StatementAdapter.evaluate(StatementAdapter.java:36)
      [mvn] 		at com.carrotsearch.randomizedtesting.ThreadLeakControl$StatementRunner.run(ThreadLeakControl.java:358)
      [mvn] 		at com.carrotsearch.randomizedtesting.ThreadLeakControl.forkTimeoutingTask(ThreadLeakControl.java:782)
      [mvn] 		at com.carrotsearch.randomizedtesting.ThreadLeakControl$3.evaluate(ThreadLeakControl.java:442)
      [mvn] 		at com.carrotsearch.randomizedtesting.RandomizedRunner.runSingleTest(RandomizedRunner.java:746)
      [mvn] 		at com.carrotsearch.randomizedtesting.RandomizedRunner$3.evaluate(RandomizedRunner.java:648)
      [mvn] 		at com.carrotsearch.randomizedtesting.RandomizedRunner$4.evaluate(RandomizedRunner.java:682)
      [mvn] 		at com.carrotsearch.randomizedtesting.RandomizedRunner$5.evaluate(RandomizedRunner.java:693)
      [mvn] 		at com.carrotsearch.randomizedtesting.rules.StatementAdapter.evaluate(StatementAdapter.java:36)
      [mvn] 		at com.carrotsearch.randomizedtesting.rules.SystemPropertiesRestoreRule$1.evaluate(SystemPropertiesRestoreRule.java:53)
      [mvn] 		at org.apache.lucene.util.AbstractBeforeAfterRule$1.evaluate(AbstractBeforeAfterRule.java:45)
      [mvn] 		at org.apache.lucene.util.TestRuleStoreClassName$1.evaluate(TestRuleStoreClassName.java:42)
      [mvn] 		at com.carrotsearch.randomizedtesting.rules.SystemPropertiesInvariantRule$1.evaluate(SystemPropertiesInvariantRule.java:55)
      [mvn] 		at com.carrotsearch.randomizedtesting.rules.NoShadowingOrOverridesOnMethodsRule$1.evaluate(NoShadowingOrOverridesOnMethodsRule.java:39)
      [mvn] 		at com.carrotsearch.randomizedtesting.rules.NoShadowingOrOverridesOnMethodsRule$1.evaluate(NoShadowingOrOverridesOnMethodsRule.java:39)
      [mvn] 		at com.carrotsearch.randomizedtesting.rules.StatementAdapter.evaluate(StatementAdapter.java:36)
      [mvn] 		at org.apache.lucene.util.TestRuleAssertionsRequired$1.evaluate(TestRuleAssertionsRequired.java:43)
      [mvn] 		at org.apache.lucene.util.TestRuleMarkFailure$1.evaluate(TestRuleMarkFailure.java:48)
      [mvn] 		at org.apache.lucene.util.TestRuleIgnoreAfterMaxFailures$1.evaluate(TestRuleIgnoreAfterMaxFailures.java:70)
      [mvn] 		at org.apache.lucene.util.TestRuleIgnoreTestSuites$1.evaluate(TestRuleIgnoreTestSuites.java:55)
      [mvn] 		at com.carrotsearch.randomizedtesting.rules.StatementAdapter.evaluate(StatementAdapter.java:36)
      [mvn] 		at com.carrotsearch.randomizedtesting.ThreadLeakControl$StatementRunner.run(ThreadLeakControl.java:358)
      [mvn] 		at java.lang.Thread.run(Thread.java:679)
      [mvn] 	
      [mvn] 1858 T2842 C8 oasc.SolrException.log SEVERE org.apache.solr.common.SolrException: range facet infinite loop: gap is either zero, or too small relative start/end and caused underflow: 23 + 0 = 23
      [mvn] 		at org.apache.solr.request.SimpleFacets.getFacetRangeCounts(SimpleFacets.java:1122)
      [mvn] 		at org.apache.solr.request.SimpleFacets.getFacetRangeCounts(SimpleFacets.java:1074)
      [mvn] 		at org.apache.solr.request.SimpleFacets.getFacetRangeCounts(SimpleFacets.java:1018)
      [mvn] 		at org.apache.solr.request.SimpleFacets.getFacetCounts(SimpleFacets.java:208)
      [mvn] 		at org.apache.solr.handler.component.FacetComponent.process(FacetComponent.java:87)
      [mvn] 		at org.apache.solr.handler.component.SearchHandler.handleRequestBody(SearchHandler.java:206)
      [mvn] 		at org.apache.solr.handler.RequestHandlerBase.handleRequest(RequestHandlerBase.java:129)
      [mvn] 		at org.apache.solr.core.SolrCore.execute(SolrCore.java:1701)
      [mvn] 		at org.apache.solr.util.TestHarness.query(TestHarness.java:364)
      [mvn] 		at org.apache.solr.util.TestHarness.query(TestHarness.java:346)
      [mvn] 		at org.apache.solr.SolrTestCaseJ4.assertQEx(SolrTestCaseJ4.java:618)
      [mvn] 		at org.apache.solr.request.SimpleFacetsTest.testRangeFacetInfiniteLoopDetection(SimpleFacetsTest.java:2052)
      [mvn] 		at sun.reflect.NativeMethodAccessorImpl.invoke0(Native Method)
      [mvn] 		at sun.reflect.NativeMethodAccessorImpl.invoke(NativeMethodAccessorImpl.java:57)
      [mvn] 		at sun.reflect.DelegatingMethodAccessorImpl.invoke(DelegatingMethodAccessorImpl.java:43)
      [mvn] 		at java.lang.reflect.Method.invoke(Method.java:616)
      [mvn] 		at com.carrotsearch.randomizedtesting.RandomizedRunner.invoke(RandomizedRunner.java:1559)
      [mvn] 		at com.carrotsearch.randomizedtesting.RandomizedRunner.access$600(RandomizedRunner.java:79)
      [mvn] 		at com.carrotsearch.randomizedtesting.RandomizedRunner$6.evaluate(RandomizedRunner.java:737)
      [mvn] 		at com.carrotsearch.randomizedtesting.RandomizedRunner$7.evaluate(RandomizedRunner.java:773)
      [mvn] 		at com.carrotsearch.randomizedtesting.RandomizedRunner$8.evaluate(RandomizedRunner.java:787)
      [mvn] 		at com.carrotsearch.randomizedtesting.rules.SystemPropertiesRestoreRule$1.evaluate(SystemPropertiesRestoreRule.java:53)
      [mvn] 		at org.apache.lucene.util.TestRuleSetupTeardownChained$1.evaluate(TestRuleSetupTeardownChained.java:50)
      [mvn] 		at org.apache.lucene.util.TestRuleFieldCacheSanity$1.evaluate(TestRuleFieldCacheSanity.java:51)
      [mvn] 		at org.apache.lucene.util.AbstractBeforeAfterRule$1.evaluate(AbstractBeforeAfterRule.java:45)
      [mvn] 		at com.carrotsearch.randomizedtesting.rules.SystemPropertiesInvariantRule$1.evaluate(SystemPropertiesInvariantRule.java:55)
      [mvn] 		at org.apache.lucene.util.TestRuleThreadAndTestName$1.evaluate(TestRuleThreadAndTestName.java:48)
      [mvn] 		at org.apache.lucene.util.TestRuleIgnoreAfterMaxFailures$1.evaluate(TestRuleIgnoreAfterMaxFailures.java:70)
      [mvn] 		at org.apache.lucene.util.TestRuleMarkFailure$1.evaluate(TestRuleMarkFailure.java:48)
      [mvn] 		at com.carrotsearch.randomizedtesting.rules.StatementAdapter.evaluate(StatementAdapter.java:36)
      [mvn] 		at com.carrotsearch.randomizedtesting.ThreadLeakControl$StatementRunner.run(ThreadLeakControl.java:358)
      [mvn] 		at com.carrotsearch.randomizedtesting.ThreadLeakControl.forkTimeoutingTask(ThreadLeakControl.java:782)
      [mvn] 		at com.carrotsearch.randomizedtesting.ThreadLeakControl$3.evaluate(ThreadLeakControl.java:442)
      [mvn] 		at com.carrotsearch.randomizedtesting.RandomizedRunner.runSingleTest(RandomizedRunner.java:746)
      [mvn] 		at com.carrotsearch.randomizedtesting.RandomizedRunner$3.evaluate(RandomizedRunner.java:648)
      [mvn] 		at com.carrotsearch.randomizedtesting.RandomizedRunner$4.evaluate(RandomizedRunner.java:682)
      [mvn] 		at com.carrotsearch.randomizedtesting.RandomizedRunner$5.evaluate(RandomizedRunner.java:693)
      [mvn] 		at com.carrotsearch.randomizedtesting.rules.StatementAdapter.evaluate(StatementAdapter.java:36)
      [mvn] 		at com.carrotsearch.randomizedtesting.rules.SystemPropertiesRestoreRule$1.evaluate(SystemPropertiesRestoreRule.java:53)
      [mvn] 		at org.apache.lucene.util.AbstractBeforeAfterRule$1.evaluate(AbstractBeforeAfterRule.java:45)
      [mvn] 		at org.apache.lucene.util.TestRuleStoreClassName$1.evaluate(TestRuleStoreClassName.java:42)
      [mvn] 		at com.carrotsearch.randomizedtesting.rules.SystemPropertiesInvariantRule$1.evaluate(SystemPropertiesInvariantRule.java:55)
      [mvn] 		at com.carrotsearch.randomizedtesting.rules.NoShadowingOrOverridesOnMethodsRule$1.evaluate(NoShadowingOrOverridesOnMethodsRule.java:39)
      [mvn] 		at com.carrotsearch.randomizedtesting.rules.NoShadowingOrOverridesOnMethodsRule$1.evaluate(NoShadowingOrOverridesOnMethodsRule.java:39)
      [mvn] 		at com.carrotsearch.randomizedtesting.rules.StatementAdapter.evaluate(StatementAdapter.java:36)
      [mvn] 		at org.apache.lucene.util.TestRuleAssertionsRequired$1.evaluate(TestRuleAssertionsRequired.java:43)
      [mvn] 		at org.apache.lucene.util.TestRuleMarkFailure$1.evaluate(TestRuleMarkFailure.java:48)
      [mvn] 		at org.apache.lucene.util.TestRuleIgnoreAfterMaxFailures$1.evaluate(TestRuleIgnoreAfterMaxFailures.java:70)
      [mvn] 		at org.apache.lucene.util.TestRuleIgnoreTestSuites$1.evaluate(TestRuleIgnoreTestSuites.java:55)
      [mvn] 		at com.carrotsearch.randomizedtesting.rules.StatementAdapter.evaluate(StatementAdapter.java:36)
      [mvn] 		at com.carrotsearch.randomizedtesting.ThreadLeakControl$StatementRunner.run(ThreadLeakControl.java:358)
      [mvn] 		at java.lang.Thread.run(Thread.java:679)
      [mvn] 	
      [mvn] 1859 T2842 C8 oasc.SolrException.log SEVERE org.apache.solr.common.SolrException: date facet infinite loop: gap is effectively zero
      [mvn] 		at org.apache.solr.request.SimpleFacets.getFacetDateCounts(SimpleFacets.java:928)
      [mvn] 		at org.apache.solr.request.SimpleFacets.getFacetDateCounts(SimpleFacets.java:837)
      [mvn] 		at org.apache.solr.request.SimpleFacets.getFacetCounts(SimpleFacets.java:207)
      [mvn] 		at org.apache.solr.handler.component.FacetComponent.process(FacetComponent.java:87)
      [mvn] 		at org.apache.solr.handler.component.SearchHandler.handleRequestBody(SearchHandler.java:206)
      [mvn] 		at org.apache.solr.handler.RequestHandlerBase.handleRequest(RequestHandlerBase.java:129)
      [mvn] 		at org.apache.solr.core.SolrCore.execute(SolrCore.java:1701)
      [mvn] 		at org.apache.solr.util.TestHarness.query(TestHarness.java:364)
      [mvn] 		at org.apache.solr.util.TestHarness.query(TestHarness.java:346)
      [mvn] 		at org.apache.solr.SolrTestCaseJ4.assertQEx(SolrTestCaseJ4.java:618)
      [mvn] 		at org.apache.solr.request.SimpleFacetsTest.testRangeFacetInfiniteLoopDetection(SimpleFacetsTest.java:2063)
      [mvn] 		at sun.reflect.NativeMethodAccessorImpl.invoke0(Native Method)
      [mvn] 		at sun.reflect.NativeMethodAccessorImpl.invoke(NativeMethodAccessorImpl.java:57)
      [mvn] 		at sun.reflect.DelegatingMethodAccessorImpl.invoke(DelegatingMethodAccessorImpl.java:43)
      [mvn] 		at java.lang.reflect.Method.invoke(Method.java:616)
      [mvn] 		at com.carrotsearch.randomizedtesting.RandomizedRunner.invoke(RandomizedRunner.java:1559)
      [mvn] 		at com.carrotsearch.randomizedtesting.RandomizedRunner.access$600(RandomizedRunner.java:79)
      [mvn] 		at com.carrotsearch.randomizedtesting.RandomizedRunner$6.evaluate(RandomizedRunner.java:737)
      [mvn] 		at com.carrotsearch.randomizedtesting.RandomizedRunner$7.evaluate(RandomizedRunner.java:773)
      [mvn] 		at com.carrotsearch.randomizedtesting.RandomizedRunner$8.evaluate(RandomizedRunner.java:787)
      [mvn] 		at com.carrotsearch.randomizedtesting.rules.SystemPropertiesRestoreRule$1.evaluate(SystemPropertiesRestoreRule.java:53)
      [mvn] 		at org.apache.lucene.util.TestRuleSetupTeardownChained$1.evaluate(TestRuleSetupTeardownChained.java:50)
      [mvn] 		at org.apache.lucene.util.TestRuleFieldCacheSanity$1.evaluate(TestRuleFieldCacheSanity.java:51)
      [mvn] 		at org.apache.lucene.util.AbstractBeforeAfterRule$1.evaluate(AbstractBeforeAfterRule.java:45)
      [mvn] 		at com.carrotsearch.randomizedtesting.rules.SystemPropertiesInvariantRule$1.evaluate(SystemPropertiesInvariantRule.java:55)
      [mvn] 		at org.apache.lucene.util.TestRuleThreadAndTestName$1.evaluate(TestRuleThreadAndTestName.java:48)
      [mvn] 		at org.apache.lucene.util.TestRuleIgnoreAfterMaxFailures$1.evaluate(TestRuleIgnoreAfterMaxFailures.java:70)
      [mvn] 		at org.apache.lucene.util.TestRuleMarkFailure$1.evaluate(TestRuleMarkFailure.java:48)
      [mvn] 		at com.carrotsearch.randomizedtesting.rules.StatementAdapter.evaluate(StatementAdapter.java:36)
      [mvn] 		at com.carrotsearch.randomizedtesting.ThreadLeakControl$StatementRunner.run(ThreadLeakControl.java:358)
      [mvn] 		at com.carrotsearch.randomizedtesting.ThreadLeakControl.forkTimeoutingTask(ThreadLeakControl.java:782)
      [mvn] 		at com.carrotsearch.randomizedtesting.ThreadLeakControl$3.evaluate(ThreadLeakControl.java:442)
      [mvn] 		at com.carrotsearch.randomizedtesting.RandomizedRunner.runSingleTest(RandomizedRunner.java:746)
      [mvn] 		at com.carrotsearch.randomizedtesting.RandomizedRunner$3.evaluate(RandomizedRunner.java:648)
      [mvn] 		at com.carrotsearch.randomizedtesting.RandomizedRunner$

[...truncated too long message...]

-8' encoding to copy filtered resources.
      [mvn] [INFO] skip non existing resourceDirectory /usr/home/hudson/hudson-slave/workspace/Lucene-Solr-Maven-4.x/maven-build/solr/contrib/velocity/src/main/resources
      [mvn] [INFO] Copying 3 resources
      [mvn] [INFO] [compiler:compile {execution: default-compile}]
      [mvn] [INFO] Compiling 4 source files to /usr/home/hudson/hudson-slave/workspace/Lucene-Solr-Maven-4.x/maven-build/solr/contrib/velocity/target/classes
      [mvn] [INFO] [bundle:manifest {execution: bundle-manifest}]
      [mvn] [debug] execute contextualize
      [mvn] [INFO] [resources:testResources {execution: default-testResources}]
      [mvn] [INFO] Using 'UTF-8' encoding to copy filtered resources.
      [mvn] [INFO] Copying 3 resources
      [mvn] [INFO] Copying 1 resource
      [mvn] [INFO] Copying 3 resources
      [mvn] [INFO] [compiler:testCompile {execution: default-testCompile}]
      [mvn] [INFO] Compiling 1 source file to /usr/home/hudson/hudson-slave/workspace/Lucene-Solr-Maven-4.x/maven-build/solr/contrib/velocity/target/test-classes
      [mvn] [INFO] [surefire:test {execution: default-test}]
      [mvn] [INFO] Surefire report directory: /usr/home/hudson/hudson-slave/workspace/Lucene-Solr-Maven-4.x/maven-build/solr/contrib/velocity/target/surefire-reports
      [mvn] 
      [mvn] -------------------------------------------------------
      [mvn]  T E S T S
      [mvn] -------------------------------------------------------
      [mvn] Running org.apache.solr.velocity.VelocityResponseWriterTest
      [mvn] Creating dataDir: /usr/home/hudson/hudson-slave/workspace/Lucene-Solr-Maven-4.x/maven-build/solr/contrib/velocity/target/test/./solrtest-VelocityResponseWriterTest-1348152268276
      [mvn] Tests run: 1, Failures: 0, Errors: 0, Skipped: 0, Time elapsed: 1.634 sec
      [mvn] 
      [mvn] Results :
      [mvn] 
      [mvn] Tests run: 1, Failures: 0, Errors: 0, Skipped: 0
      [mvn] 
      [mvn] [INFO] [jar:jar {execution: default-jar}]
      [mvn] [INFO] Building jar: /usr/home/hudson/hudson-slave/workspace/Lucene-Solr-Maven-4.x/maven-build/solr/contrib/velocity/target/solr-velocity-4.0-SNAPSHOT.jar
      [mvn] [INFO] [install:install {execution: default-install}]
      [mvn] [INFO] Installing /usr/home/hudson/hudson-slave/workspace/Lucene-Solr-Maven-4.x/maven-build/solr/contrib/velocity/target/solr-velocity-4.0-SNAPSHOT.jar to /home/hudson/.m2/repository/org/apache/solr/solr-velocity/4.0-SNAPSHOT/solr-velocity-4.0-SNAPSHOT.jar
      [mvn] [INFO] ------------------------------------------------------------------------
      [mvn] [INFO] Building Apache Solr Contrib aggregator POM
      [mvn] [INFO]    task-segment: [install]
      [mvn] [INFO] ------------------------------------------------------------------------
      [mvn] [INFO] [groovy:execute {execution: generate-timestamps}]
      [mvn] [INFO] [buildnumber:create {execution: default}]
      [mvn] [INFO] [enforcer:enforce {execution: enforce-java-compat-version-and-maven-2.2.1}]
      [mvn] [INFO] [remote-resources:process {execution: default}]
      [mvn] [INFO] [bundle:manifest {execution: bundle-manifest}]
      [mvn] [WARNING] Ignoring project type pom - supportedProjectTypes = [jar, bundle]
      [mvn] [INFO] [site:attach-descriptor {execution: default-attach-descriptor}]
      [mvn] [INFO] [install:install {execution: default-install}]
      [mvn] [INFO] Installing /usr/home/hudson/hudson-slave/workspace/Lucene-Solr-Maven-4.x/maven-build/solr/contrib/pom.xml to /home/hudson/.m2/repository/org/apache/solr/solr-contrib-aggregator/4.0-SNAPSHOT/solr-contrib-aggregator-4.0-SNAPSHOT.pom
      [mvn] [INFO] 
      [mvn] [INFO] 
      [mvn] [INFO] ------------------------------------------------------------------------
      [mvn] [INFO] Reactor Summary:
      [mvn] [INFO] ------------------------------------------------------------------------
      [mvn] [INFO] Grandparent POM for Apache Lucene Core and Apache Solr  SUCCESS [10.461s]
      [mvn] [INFO] Lucene parent POM ..................................... SUCCESS [0.060s]
      [mvn] [INFO] Lucene Core ........................................... SUCCESS [15.493s]
      [mvn] [INFO] Lucene codecs ......................................... SUCCESS [3.485s]
      [mvn] [INFO] Lucene Test Framework ................................. SUCCESS [5.679s]
      [mvn] [INFO] Lucene Core tests ..................................... SUCCESS [4:14.248s]
      [mvn] [INFO] Lucene Core aggregator POM ............................ SUCCESS [0.100s]
      [mvn] [INFO] Lucene codecs tests ................................... SUCCESS [3.226s]
      [mvn] [INFO] Lucene codecs aggregator POM .......................... SUCCESS [0.091s]
      [mvn] [INFO] Lucene Common Analyzers ............................... SUCCESS [2:14.179s]
      [mvn] [INFO] Lucene ICU Analysis Components ........................ SUCCESS [12.464s]
      [mvn] [INFO] Lucene Kuromoji Japanese Morphological Analyzer ....... SUCCESS [29.136s]
      [mvn] [INFO] Lucene Morfologik Polish Lemmatizer ................... SUCCESS [3.738s]
      [mvn] [INFO] Lucene Phonetic Filters ............................... SUCCESS [23.837s]
      [mvn] [INFO] Lucene Smart Chinese Analyzer ......................... SUCCESS [9.355s]
      [mvn] [INFO] Lucene Stempel Analyzer ............................... SUCCESS [7.088s]
      [mvn] [INFO] Lucene UIMA Analysis Components ....................... SUCCESS [19.450s]
      [mvn] [INFO] Lucene Analysis Modules aggregator POM ................ SUCCESS [0.081s]
      [mvn] [INFO] Lucene Queries ........................................ SUCCESS [9.518s]
      [mvn] [INFO] Lucene Sandbox ........................................ SUCCESS [28.453s]
      [mvn] [INFO] Lucene QueryParsers ................................... SUCCESS [14.787s]
      [mvn] [INFO] Lucene Memory ......................................... SUCCESS [8.665s]
      [mvn] [INFO] Lucene Highlighter .................................... SUCCESS [9.651s]
      [mvn] [INFO] Lucene Facets ......................................... SUCCESS [1:28.588s]
      [mvn] [INFO] Lucene Benchmark ...................................... SUCCESS [25.420s]
      [mvn] [INFO] Lucene Demo ........................................... SUCCESS [3.893s]
      [mvn] [INFO] Lucene Grouping ....................................... SUCCESS [17.440s]
      [mvn] [INFO] Lucene Join ........................................... SUCCESS [17.200s]
      [mvn] [INFO] Lucene Miscellaneous .................................. SUCCESS [6.302s]
      [mvn] [INFO] Lucene Spatial ........................................ SUCCESS [10.142s]
      [mvn] [INFO] Lucene Suggest ........................................ SUCCESS [17.461s]
      [mvn] [INFO] Apache Solr parent POM ................................ SUCCESS [0.107s]
      [mvn] [INFO] Apache Solr Solrj ..................................... SUCCESS [4.679s]
      [mvn] [INFO] Apache Solr Core ...................................... SUCCESS [13.913s]
      [mvn] [INFO] Apache Solr Test Framework ............................ SUCCESS [2.687s]
      [mvn] [INFO] Apache Solr Core tests ................................ FAILED [20:34.370s]
      [mvn] [INFO] Apache Solr Core aggregator POM ....................... SUCCESS [0.090s]
      [mvn] [INFO] Apache Solr Solrj tests ............................... SUCCESS [3:47.173s]
      [mvn] [INFO] Apache Solr Solrj aggregator POM ...................... SUCCESS [0.087s]
      [mvn] [INFO] Apache Solr Search Server ............................. SUCCESS [5.111s]
      [mvn] [INFO] Apache Solr Analysis Extras ........................... SUCCESS [8.964s]
      [mvn] [INFO] Apache Solr Clustering ................................ SUCCESS [14.805s]
      [mvn] [INFO] Apache Solr DataImportHandler ......................... SUCCESS [1:33.745s]
      [mvn] [INFO] Apache Solr DataImportHandler Extras .................. SUCCESS [6.883s]
      [mvn] [INFO] Apache Solr Content Extraction Library ................ SUCCESS [10.262s]
      [mvn] [INFO] Apache Solr Language Identifier ....................... SUCCESS [7.152s]
      [mvn] [INFO] Apache Solr UIMA integration .......................... SUCCESS [32.058s]
      [mvn] [INFO] Apache Solr Velocity .................................. SUCCESS [4.374s]
      [mvn] [INFO] Apache Solr Contrib aggregator POM .................... SUCCESS [0.053s]
      [mvn] [INFO] ------------------------------------------------------------------------
      [mvn] [INFO] Error for project: Apache Solr Core tests (during install)
      [mvn] [INFO] ------------------------------------------------------------------------
      [mvn] [INFO] There are test failures.
      [mvn] 
      [mvn] Please refer to /usr/home/hudson/hudson-slave/workspace/Lucene-Solr-Maven-4.x/maven-build/solr/core/src/test/target/surefire-reports for the individual test results.
      [mvn] [INFO] ------------------------------------------------------------------------
      [mvn] [INFO] For more information, run Maven with the -e switch
      [mvn] [INFO] ------------------------------------------------------------------------
      [mvn] [INFO] BUILD ERRORS
      [mvn] [INFO] ------------------------------------------------------------------------
      [mvn] [INFO] Total time: 40 minutes 57 seconds
      [mvn] [INFO] Finished at: Thu Sep 20 14:44:30 UTC 2012
      [mvn] [INFO] Final Memory: 287M/1530M
      [mvn] [INFO] ------------------------------------------------------------------------

BUILD FAILED
/usr/home/hudson/hudson-slave/workspace/Lucene-Solr-Maven-4.x/build.xml:160: The following error occurred while executing this line:
/usr/home/hudson/hudson-slave/workspace/Lucene-Solr-Maven-4.x/extra-targets.xml:56: Java returned: 1

Total time: 41 minutes 3 seconds
Build step 'Invoke Ant' marked build as failure
Recording test results
Email was triggered for: Failure
Sending email for trigger: Failure




Mime
View raw message