lucene-dev mailing list archives

Site index · List index
Message view « Date » · « Thread »
Top « Date » · « Thread »
From Apache Jenkins Server <jenk...@builds.apache.org>
Subject [JENKINS] Lucene-Solr-NightlyTests-4.x - Build # 40 - Still Failing
Date Thu, 20 Sep 2012 17:00:57 GMT
Build: https://builds.apache.org/job/Lucene-Solr-NightlyTests-4.x/40/

1 tests failed.
FAILED:  org.apache.solr.cloud.BasicDistributedZk2Test.testDistribSearch

Error Message:
Shard still reported as live in zk

Stack Trace:
java.lang.AssertionError: Shard still reported as live in zk
	at __randomizedtesting.SeedInfo.seed([8A6A5328786B96A6:B8CDD300F34F69A]:0)
	at org.junit.Assert.fail(Assert.java:93)
	at org.apache.solr.cloud.AbstractFullDistribZkTestBase.waitToSeeNotLive(AbstractFullDistribZkTestBase.java:1220)
	at org.apache.solr.cloud.BasicDistributedZk2Test.brindDownShardIndexSomeDocsAndRecover(BasicDistributedZk2Test.java:190)
	at org.apache.solr.cloud.BasicDistributedZk2Test.doTest(BasicDistributedZk2Test.java:83)
	at org.apache.solr.BaseDistributedSearchTestCase.testDistribSearch(BaseDistributedSearchTestCase.java:695)
	at sun.reflect.NativeMethodAccessorImpl.invoke0(Native Method)
	at sun.reflect.NativeMethodAccessorImpl.invoke(NativeMethodAccessorImpl.java:57)
	at sun.reflect.DelegatingMethodAccessorImpl.invoke(DelegatingMethodAccessorImpl.java:43)
	at java.lang.reflect.Method.invoke(Method.java:616)
	at com.carrotsearch.randomizedtesting.RandomizedRunner.invoke(RandomizedRunner.java:1559)
	at com.carrotsearch.randomizedtesting.RandomizedRunner.access$600(RandomizedRunner.java:79)
	at com.carrotsearch.randomizedtesting.RandomizedRunner$6.evaluate(RandomizedRunner.java:737)
	at com.carrotsearch.randomizedtesting.RandomizedRunner$7.evaluate(RandomizedRunner.java:773)
	at com.carrotsearch.randomizedtesting.RandomizedRunner$8.evaluate(RandomizedRunner.java:787)
	at com.carrotsearch.randomizedtesting.rules.SystemPropertiesRestoreRule$1.evaluate(SystemPropertiesRestoreRule.java:53)
	at org.apache.lucene.util.TestRuleSetupTeardownChained$1.evaluate(TestRuleSetupTeardownChained.java:50)
	at org.apache.lucene.util.TestRuleFieldCacheSanity$1.evaluate(TestRuleFieldCacheSanity.java:51)
	at org.apache.lucene.util.AbstractBeforeAfterRule$1.evaluate(AbstractBeforeAfterRule.java:45)
	at com.carrotsearch.randomizedtesting.rules.SystemPropertiesInvariantRule$1.evaluate(SystemPropertiesInvariantRule.java:55)
	at org.apache.lucene.util.TestRuleThreadAndTestName$1.evaluate(TestRuleThreadAndTestName.java:48)
	at org.apache.lucene.util.TestRuleIgnoreAfterMaxFailures$1.evaluate(TestRuleIgnoreAfterMaxFailures.java:70)
	at org.apache.lucene.util.TestRuleMarkFailure$1.evaluate(TestRuleMarkFailure.java:48)
	at com.carrotsearch.randomizedtesting.rules.StatementAdapter.evaluate(StatementAdapter.java:36)
	at com.carrotsearch.randomizedtesting.ThreadLeakControl$StatementRunner.run(ThreadLeakControl.java:358)
	at com.carrotsearch.randomizedtesting.ThreadLeakControl.forkTimeoutingTask(ThreadLeakControl.java:782)
	at com.carrotsearch.randomizedtesting.ThreadLeakControl$3.evaluate(ThreadLeakControl.java:442)
	at com.carrotsearch.randomizedtesting.RandomizedRunner.runSingleTest(RandomizedRunner.java:746)
	at com.carrotsearch.randomizedtesting.RandomizedRunner$3.evaluate(RandomizedRunner.java:648)
	at com.carrotsearch.randomizedtesting.RandomizedRunner$4.evaluate(RandomizedRunner.java:682)
	at com.carrotsearch.randomizedtesting.RandomizedRunner$5.evaluate(RandomizedRunner.java:693)
	at com.carrotsearch.randomizedtesting.rules.StatementAdapter.evaluate(StatementAdapter.java:36)
	at com.carrotsearch.randomizedtesting.rules.SystemPropertiesRestoreRule$1.evaluate(SystemPropertiesRestoreRule.java:53)
	at org.apache.lucene.util.AbstractBeforeAfterRule$1.evaluate(AbstractBeforeAfterRule.java:45)
	at org.apache.lucene.util.TestRuleStoreClassName$1.evaluate(TestRuleStoreClassName.java:42)
	at com.carrotsearch.randomizedtesting.rules.SystemPropertiesInvariantRule$1.evaluate(SystemPropertiesInvariantRule.java:55)
	at com.carrotsearch.randomizedtesting.rules.NoShadowingOrOverridesOnMethodsRule$1.evaluate(NoShadowingOrOverridesOnMethodsRule.java:39)
	at com.carrotsearch.randomizedtesting.rules.NoShadowingOrOverridesOnMethodsRule$1.evaluate(NoShadowingOrOverridesOnMethodsRule.java:39)
	at com.carrotsearch.randomizedtesting.rules.StatementAdapter.evaluate(StatementAdapter.java:36)
	at org.apache.lucene.util.TestRuleAssertionsRequired$1.evaluate(TestRuleAssertionsRequired.java:43)
	at org.apache.lucene.util.TestRuleMarkFailure$1.evaluate(TestRuleMarkFailure.java:48)
	at org.apache.lucene.util.TestRuleIgnoreAfterMaxFailures$1.evaluate(TestRuleIgnoreAfterMaxFailures.java:70)
	at org.apache.lucene.util.TestRuleIgnoreTestSuites$1.evaluate(TestRuleIgnoreTestSuites.java:55)
	at com.carrotsearch.randomizedtesting.rules.StatementAdapter.evaluate(StatementAdapter.java:36)
	at com.carrotsearch.randomizedtesting.ThreadLeakControl$StatementRunner.run(ThreadLeakControl.java:358)
	at java.lang.Thread.run(Thread.java:679)




Build Log:
[...truncated 7316 lines...]
[junit4:junit4] Suite: org.apache.solr.cloud.BasicDistributedZk2Test
[junit4:junit4]   2> 3 T1692 oas.SolrTestCaseJ4.setUp ###Starting testDistribSearch
[junit4:junit4]   2> Creating dataDir: /usr/home/hudson/hudson-slave/workspace/Lucene-Solr-NightlyTests-4.x/solr/build/solr-core/test/J1/./solrtest-BasicDistributedZk2Test-1348159690546
[junit4:junit4]   2> 4 T1692 oasc.ZkTestServer.run STARTING ZK TEST SERVER
[junit4:junit4]   2> 7 T1693 oazs.ZooKeeperServer.setTickTime tickTime set to 1000
[junit4:junit4]   2> 8 T1693 oazs.NIOServerCnxn$Factory.<init> binding to port 0.0.0.0/0.0.0.0:0
[junit4:junit4]   2> 9 T1693 oazsp.FileTxnSnapLog.save Snapshotting: 0
[junit4:junit4]   2> 105 T1692 oasc.ZkTestServer.run start zk server on port:56190
[junit4:junit4]   2> 105 T1692 oaz.ZooKeeper.<init> Initiating client connection, connectString=127.0.0.1:56190 sessionTimeout=10000 watcher=org.apache.solr.common.cloud.ConnectionManager@62898cdb
[junit4:junit4]   2> 106 T1698 oaz.ClientCnxn$SendThread.startConnect Opening socket connection to server /127.0.0.1:56190
[junit4:junit4]   2> 106 T1692 oascc.ConnectionManager.waitForConnected Waiting for client to connect to ZooKeeper
[junit4:junit4]   2> 107 T1698 oaz.ClientCnxn$SendThread.primeConnection Socket connection established to localhost/127.0.0.1:56190, initiating session
[junit4:junit4]   2> 107 T1694 oazs.NIOServerCnxn$Factory.run Accepted socket connection from /140.211.11.196:56191
[junit4:junit4]   2> 107 T1694 oazs.NIOServerCnxn.readConnectRequest Client attempting to establish new session at /140.211.11.196:56191
[junit4:junit4]   2> 108 T1696 oazsp.FileTxnLog.append Creating new log file: log.1
[junit4:junit4]   2> 114 T1696 oazs.NIOServerCnxn.finishSessionInit Established session 0x139e49457390000 with negotiated timeout 10000 for client /140.211.11.196:56191
[junit4:junit4]   2> 114 T1698 oaz.ClientCnxn$SendThread.readConnectResult Session establishment complete on server localhost/127.0.0.1:56190, sessionid = 0x139e49457390000, negotiated timeout = 10000
[junit4:junit4]   2> 114 T1699 oascc.ConnectionManager.process Watcher org.apache.solr.common.cloud.ConnectionManager@62898cdb name:ZooKeeperConnection Watcher:127.0.0.1:56190 got event WatchedEvent state:SyncConnected type:None path:null path:null type:None
[junit4:junit4]   2> 114 T1692 oascc.ConnectionManager.waitForConnected Client is connected to ZooKeeper
[junit4:junit4]   2> 115 T1692 oascc.SolrZkClient.makePath makePath: /solr
[junit4:junit4]   2> 125 T1697 oazs.PrepRequestProcessor.pRequest Processed session termination for sessionid: 0x139e49457390000
[junit4:junit4]   2> 131 T1699 oaz.ClientCnxn$EventThread.run EventThread shut down
[junit4:junit4]   2> 131 T1694 oazs.NIOServerCnxn.closeSock Closed socket connection for client /140.211.11.196:56191 which had sessionid 0x139e49457390000
[junit4:junit4]   2> 131 T1692 oaz.ZooKeeper.close Session: 0x139e49457390000 closed
[junit4:junit4]   2> 132 T1692 oaz.ZooKeeper.<init> Initiating client connection, connectString=127.0.0.1:56190/solr sessionTimeout=10000 watcher=org.apache.solr.common.cloud.ConnectionManager@5a352115
[junit4:junit4]   2> 132 T1700 oaz.ClientCnxn$SendThread.startConnect Opening socket connection to server /127.0.0.1:56190
[junit4:junit4]   2> 132 T1692 oascc.ConnectionManager.waitForConnected Waiting for client to connect to ZooKeeper
[junit4:junit4]   2> 133 T1700 oaz.ClientCnxn$SendThread.primeConnection Socket connection established to localhost/127.0.0.1:56190, initiating session
[junit4:junit4]   2> 133 T1694 oazs.NIOServerCnxn$Factory.run Accepted socket connection from /140.211.11.196:56192
[junit4:junit4]   2> 133 T1694 oazs.NIOServerCnxn.readConnectRequest Client attempting to establish new session at /140.211.11.196:56192
[junit4:junit4]   2> 139 T1696 oazs.NIOServerCnxn.finishSessionInit Established session 0x139e49457390001 with negotiated timeout 10000 for client /140.211.11.196:56192
[junit4:junit4]   2> 139 T1700 oaz.ClientCnxn$SendThread.readConnectResult Session establishment complete on server localhost/127.0.0.1:56190, sessionid = 0x139e49457390001, negotiated timeout = 10000
[junit4:junit4]   2> 140 T1701 oascc.ConnectionManager.process Watcher org.apache.solr.common.cloud.ConnectionManager@5a352115 name:ZooKeeperConnection Watcher:127.0.0.1:56190/solr got event WatchedEvent state:SyncConnected type:None path:null path:null type:None
[junit4:junit4]   2> 140 T1692 oascc.ConnectionManager.waitForConnected Client is connected to ZooKeeper
[junit4:junit4]   2> 140 T1692 oascc.SolrZkClient.makePath makePath: /collections/collection1
[junit4:junit4]   2> 163 T1692 oascc.SolrZkClient.makePath makePath: /collections/collection1/shards
[junit4:junit4]   2> 172 T1692 oascc.SolrZkClient.makePath makePath: /collections/control_collection
[junit4:junit4]   2> 182 T1692 oascc.SolrZkClient.makePath makePath: /collections/control_collection/shards
[junit4:junit4]   2> 185 T1692 oasc.AbstractZkTestCase.putConfig put /usr/home/hudson/hudson-slave/workspace/Lucene-Solr-NightlyTests-4.x/solr/build/solr-core/test-files/solr/collection1/conf/solrconfig.xml to /configs/conf1/solrconfig.xml
[junit4:junit4]   2> 186 T1692 oascc.SolrZkClient.makePath makePath: /configs/conf1/solrconfig.xml
[junit4:junit4]   2> 192 T1692 oasc.AbstractZkTestCase.putConfig put /usr/home/hudson/hudson-slave/workspace/Lucene-Solr-NightlyTests-4.x/solr/build/solr-core/test-files/solr/collection1/conf/schema.xml to /configs/conf1/schema.xml
[junit4:junit4]   2> 193 T1692 oascc.SolrZkClient.makePath makePath: /configs/conf1/schema.xml
[junit4:junit4]   2> 301 T1692 oasc.AbstractZkTestCase.putConfig put /usr/home/hudson/hudson-slave/workspace/Lucene-Solr-NightlyTests-4.x/solr/build/solr-core/test-files/solr/collection1/conf/solrconfig.xml to /configs/conf1/solrconfig.xml
[junit4:junit4]   2> 302 T1692 oascc.SolrZkClient.makePath makePath: /configs/conf1/solrconfig.xml
[junit4:junit4]   2> 318 T1692 oasc.AbstractZkTestCase.putConfig put /usr/home/hudson/hudson-slave/workspace/Lucene-Solr-NightlyTests-4.x/solr/build/solr-core/test-files/solr/collection1/conf/stopwords.txt to /configs/conf1/stopwords.txt
[junit4:junit4]   2> 319 T1692 oascc.SolrZkClient.makePath makePath: /configs/conf1/stopwords.txt
[junit4:junit4]   2> 326 T1692 oasc.AbstractZkTestCase.putConfig put /usr/home/hudson/hudson-slave/workspace/Lucene-Solr-NightlyTests-4.x/solr/build/solr-core/test-files/solr/collection1/conf/protwords.txt to /configs/conf1/protwords.txt
[junit4:junit4]   2> 326 T1692 oascc.SolrZkClient.makePath makePath: /configs/conf1/protwords.txt
[junit4:junit4]   2> 333 T1692 oasc.AbstractZkTestCase.putConfig put /usr/home/hudson/hudson-slave/workspace/Lucene-Solr-NightlyTests-4.x/solr/build/solr-core/test-files/solr/collection1/conf/currency.xml to /configs/conf1/currency.xml
[junit4:junit4]   2> 334 T1692 oascc.SolrZkClient.makePath makePath: /configs/conf1/currency.xml
[junit4:junit4]   2> 341 T1692 oasc.AbstractZkTestCase.putConfig put /usr/home/hudson/hudson-slave/workspace/Lucene-Solr-NightlyTests-4.x/solr/build/solr-core/test-files/solr/collection1/conf/open-exchange-rates.json to /configs/conf1/open-exchange-rates.json
[junit4:junit4]   2> 342 T1692 oascc.SolrZkClient.makePath makePath: /configs/conf1/open-exchange-rates.json
[junit4:junit4]   2> 352 T1692 oasc.AbstractZkTestCase.putConfig put /usr/home/hudson/hudson-slave/workspace/Lucene-Solr-NightlyTests-4.x/solr/build/solr-core/test-files/solr/collection1/conf/mapping-ISOLatin1Accent.txt to /configs/conf1/mapping-ISOLatin1Accent.txt
[junit4:junit4]   2> 353 T1692 oascc.SolrZkClient.makePath makePath: /configs/conf1/mapping-ISOLatin1Accent.txt
[junit4:junit4]   2> 360 T1692 oasc.AbstractZkTestCase.putConfig put /usr/home/hudson/hudson-slave/workspace/Lucene-Solr-NightlyTests-4.x/solr/build/solr-core/test-files/solr/collection1/conf/old_synonyms.txt to /configs/conf1/old_synonyms.txt
[junit4:junit4]   2> 361 T1692 oascc.SolrZkClient.makePath makePath: /configs/conf1/old_synonyms.txt
[junit4:junit4]   2> 372 T1692 oasc.AbstractZkTestCase.putConfig put /usr/home/hudson/hudson-slave/workspace/Lucene-Solr-NightlyTests-4.x/solr/build/solr-core/test-files/solr/collection1/conf/synonyms.txt to /configs/conf1/synonyms.txt
[junit4:junit4]   2> 372 T1692 oascc.SolrZkClient.makePath makePath: /configs/conf1/synonyms.txt
[junit4:junit4]   2> 378 T1697 oazs.PrepRequestProcessor.pRequest Processed session termination for sessionid: 0x139e49457390001
[junit4:junit4]   2> 391 T1701 oaz.ClientCnxn$EventThread.run EventThread shut down
[junit4:junit4]   2> 391 T1692 oaz.ZooKeeper.close Session: 0x139e49457390001 closed
[junit4:junit4]   2> 391 T1694 oazs.NIOServerCnxn.closeSock Closed socket connection for client /140.211.11.196:56192 which had sessionid 0x139e49457390001
[junit4:junit4]   2> 394 T1692 oejs.Server.doStart jetty-8.1.2.v20120308
[junit4:junit4]   2> 396 T1692 oejs.AbstractConnector.doStart Started SocketConnector@0.0.0.0:56193
[junit4:junit4]   2> 396 T1692 oasc.SolrResourceLoader.locateSolrHome JNDI not configured for solr (NoInitialContextEx)
[junit4:junit4]   2> 397 T1692 oasc.SolrResourceLoader.locateSolrHome using system property solr.solr.home: /usr/home/hudson/hudson-slave/workspace/Lucene-Solr-NightlyTests-4.x/solr/build/solr-core/test-files/solr
[junit4:junit4]   2> 397 T1692 oasc.SolrResourceLoader.<init> new SolrResourceLoader for deduced Solr Home: '/usr/home/hudson/hudson-slave/workspace/Lucene-Solr-NightlyTests-4.x/solr/build/solr-core/test-files/solr/'
[junit4:junit4]   2> 436 T1692 oass.SolrDispatchFilter.init SolrDispatchFilter.init()
[junit4:junit4]   2> 437 T1692 oasc.SolrResourceLoader.locateSolrHome JNDI not configured for solr (NoInitialContextEx)
[junit4:junit4]   2> 437 T1692 oasc.SolrResourceLoader.locateSolrHome using system property solr.solr.home: /usr/home/hudson/hudson-slave/workspace/Lucene-Solr-NightlyTests-4.x/solr/build/solr-core/test-files/solr
[junit4:junit4]   2> 438 T1692 oasc.CoreContainer$Initializer.initialize looking for solr.xml: /usr/home/hudson/hudson-slave/workspace/Lucene-Solr-NightlyTests-4.x/solr/build/solr-core/test-files/solr/solr.xml
[junit4:junit4]   2> 438 T1692 oasc.CoreContainer.<init> New CoreContainer 1055151832
[junit4:junit4]   2> 439 T1692 oasc.CoreContainer.load Loading CoreContainer using Solr Home: '/usr/home/hudson/hudson-slave/workspace/Lucene-Solr-NightlyTests-4.x/solr/build/solr-core/test-files/solr/'
[junit4:junit4]   2> 439 T1692 oasc.SolrResourceLoader.<init> new SolrResourceLoader for directory: '/usr/home/hudson/hudson-slave/workspace/Lucene-Solr-NightlyTests-4.x/solr/build/solr-core/test-files/solr/'
[junit4:junit4]   2> 466 T1692 oasc.CoreContainer.load Registering Log Listener
[junit4:junit4]   2> 482 T1692 oasc.CoreContainer.initZooKeeper Zookeeper client=127.0.0.1:56190/solr
[junit4:junit4]   2> 482 T1692 oaz.ZooKeeper.<init> Initiating client connection, connectString=127.0.0.1:56190/solr sessionTimeout=5000 watcher=org.apache.solr.common.cloud.ConnectionManager@11787eea
[junit4:junit4]   2> 483 T1711 oaz.ClientCnxn$SendThread.startConnect Opening socket connection to server /127.0.0.1:56190
[junit4:junit4]   2> 483 T1692 oascc.ConnectionManager.waitForConnected Waiting for client to connect to ZooKeeper
[junit4:junit4]   2> 484 T1711 oaz.ClientCnxn$SendThread.primeConnection Socket connection established to localhost/127.0.0.1:56190, initiating session
[junit4:junit4]   2> 484 T1694 oazs.NIOServerCnxn$Factory.run Accepted socket connection from /140.211.11.196:56194
[junit4:junit4]   2> 485 T1694 oazs.NIOServerCnxn.readConnectRequest Client attempting to establish new session at /140.211.11.196:56194
[junit4:junit4]   2> 487 T1696 oazs.NIOServerCnxn.finishSessionInit Established session 0x139e49457390002 with negotiated timeout 5000 for client /140.211.11.196:56194
[junit4:junit4]   2> 487 T1711 oaz.ClientCnxn$SendThread.readConnectResult Session establishment complete on server localhost/127.0.0.1:56190, sessionid = 0x139e49457390002, negotiated timeout = 5000
[junit4:junit4]   2> 488 T1712 oascc.ConnectionManager.process Watcher org.apache.solr.common.cloud.ConnectionManager@11787eea name:ZooKeeperConnection Watcher:127.0.0.1:56190/solr got event WatchedEvent state:SyncConnected type:None path:null path:null type:None
[junit4:junit4]   2> 488 T1692 oascc.ConnectionManager.waitForConnected Client is connected to ZooKeeper
[junit4:junit4]   2> 495 T1697 oazs.PrepRequestProcessor.pRequest Got user-level KeeperException when processing sessionid:0x139e49457390002 type:create cxid:0x2 zxid:0xfffffffffffffffe txntype:unknown reqpath:n/a Error Path:/solr/overseer Error:KeeperErrorCode = NodeExists for /solr/overseer
[junit4:junit4]   2> 501 T1692 oascc.SolrZkClient.makePath makePath: /live_nodes
[junit4:junit4]   2> 519 T1692 oasc.ZkController.createEphemeralLiveNode Register node as live in ZooKeeper:/live_nodes/127.0.0.1:56193_solr
[junit4:junit4]   2> 520 T1697 oazs.PrepRequestProcessor.pRequest Got user-level KeeperException when processing sessionid:0x139e49457390002 type:delete cxid:0x7 zxid:0xfffffffffffffffe txntype:unknown reqpath:n/a Error Path:/solr/live_nodes/127.0.0.1:56193_solr Error:KeeperErrorCode = NoNode for /solr/live_nodes/127.0.0.1:56193_solr
[junit4:junit4]   2> 530 T1692 oascc.SolrZkClient.makePath makePath: /live_nodes/127.0.0.1:56193_solr
[junit4:junit4]   2> 543 T1692 oashc.HttpShardHandlerFactory.getParameter Setting socketTimeout to: 0
[junit4:junit4]   2> 543 T1692 oashc.HttpShardHandlerFactory.getParameter Setting urlScheme to: http://
[junit4:junit4]   2> 544 T1692 oashc.HttpShardHandlerFactory.getParameter Setting connTimeout to: 0
[junit4:junit4]   2> 544 T1692 oashc.HttpShardHandlerFactory.getParameter Setting maxConnectionsPerHost to: 20
[junit4:junit4]   2> 545 T1692 oashc.HttpShardHandlerFactory.getParameter Setting corePoolSize to: 0
[junit4:junit4]   2> 545 T1692 oashc.HttpShardHandlerFactory.getParameter Setting maximumPoolSize to: 2147483647
[junit4:junit4]   2> 546 T1692 oashc.HttpShardHandlerFactory.getParameter Setting maxThreadIdleTime to: 5
[junit4:junit4]   2> 546 T1692 oashc.HttpShardHandlerFactory.getParameter Setting sizeOfQueue to: -1
[junit4:junit4]   2> 547 T1692 oashc.HttpShardHandlerFactory.getParameter Setting fairnessPolicy to: false
[junit4:junit4]   2> 547 T1692 oascsi.HttpClientUtil.createClient Creating new http client, config:maxConnectionsPerHost=20&maxConnections=10000&socketTimeout=0&connTimeout=0&retry=false
[junit4:junit4]   2> 564 T1692 oascc.SolrZkClient.makePath makePath: /overseer_elect/election
[junit4:junit4]   2> 583 T1697 oazs.PrepRequestProcessor.pRequest Got user-level KeeperException when processing sessionid:0x139e49457390002 type:delete cxid:0x15 zxid:0xfffffffffffffffe txntype:unknown reqpath:n/a Error Path:/solr/overseer_elect/leader Error:KeeperErrorCode = NoNode for /solr/overseer_elect/leader
[junit4:junit4]   2> 593 T1692 oascc.SolrZkClient.makePath makePath: /overseer_elect/leader
[junit4:junit4]   2> 609 T1692 oasc.Overseer.start Overseer (id=88352993480081410-127.0.0.1:56193_solr-n_0000000000) starting
[junit4:junit4]   2> 609 T1697 oazs.PrepRequestProcessor.pRequest Got user-level KeeperException when processing sessionid:0x139e49457390002 type:create cxid:0x1a zxid:0xfffffffffffffffe txntype:unknown reqpath:n/a Error Path:/solr/overseer Error:KeeperErrorCode = NodeExists for /solr/overseer
[junit4:junit4]   2> 620 T1697 oazs.PrepRequestProcessor.pRequest Got user-level KeeperException when processing sessionid:0x139e49457390002 type:create cxid:0x1b zxid:0xfffffffffffffffe txntype:unknown reqpath:n/a Error Path:/solr/overseer Error:KeeperErrorCode = NodeExists for /solr/overseer
[junit4:junit4]   2> 628 T1697 oazs.PrepRequestProcessor.pRequest Got user-level KeeperException when processing sessionid:0x139e49457390002 type:create cxid:0x1c zxid:0xfffffffffffffffe txntype:unknown reqpath:n/a Error Path:/solr/overseer Error:KeeperErrorCode = NodeExists for /solr/overseer
[junit4:junit4]   2> 639 T1697 oazs.PrepRequestProcessor.pRequest Got user-level KeeperException when processing sessionid:0x139e49457390002 type:create cxid:0x1d zxid:0xfffffffffffffffe txntype:unknown reqpath:n/a Error Path:/solr/overseer Error:KeeperErrorCode = NodeExists for /solr/overseer
[junit4:junit4]   2> 647 T1714 oasc.OverseerCollectionProcessor.run Process current queue of collection creations
[junit4:junit4]   2> 648 T1692 oascc.SolrZkClient.makePath makePath: /clusterstate.json
[junit4:junit4]   2> 667 T1692 oascc.ZkStateReader.createClusterStateWatchersAndUpdate Updating cluster state from ZooKeeper... 
[junit4:junit4]   2> 669 T1713 oasc.Overseer$ClusterStateUpdater.run Starting to work on the main queue
[junit4:junit4]   2> 673 T1692 oasc.CoreContainer.create Creating SolrCore 'collection1' using instanceDir: /usr/home/hudson/hudson-slave/workspace/Lucene-Solr-NightlyTests-4.x/solr/build/solr-core/test-files/solr/collection1
[junit4:junit4]   2> 673 T1692 oasc.ZkController.createCollectionZkNode Check for collection zkNode:control_collection
[junit4:junit4]   2> 674 T1692 oasc.ZkController.createCollectionZkNode Collection zkNode exists
[junit4:junit4]   2> 674 T1692 oasc.ZkController.readConfigName Load collection config from:/collections/control_collection
[junit4:junit4]   2> 676 T1692 oasc.SolrResourceLoader.<init> new SolrResourceLoader for directory: '/usr/home/hudson/hudson-slave/workspace/Lucene-Solr-NightlyTests-4.x/solr/build/solr-core/test-files/solr/collection1/'
[junit4:junit4]   2> 677 T1692 oasc.SolrResourceLoader.replaceClassLoader Adding 'file:/usr/home/hudson/hudson-slave/workspace/Lucene-Solr-NightlyTests-4.x/solr/build/solr-core/test-files/solr/collection1/lib/README' to classloader
[junit4:junit4]   2> 677 T1692 oasc.SolrResourceLoader.replaceClassLoader Adding 'file:/usr/home/hudson/hudson-slave/workspace/Lucene-Solr-NightlyTests-4.x/solr/build/solr-core/test-files/solr/collection1/lib/classes/' to classloader
[junit4:junit4]   2> 717 T1692 oasc.SolrConfig.<init> Using Lucene MatchVersion: LUCENE_40
[junit4:junit4]   2> 770 T1692 oasc.SolrConfig.<init> Loaded SolrConfig: solrconfig.xml
[junit4:junit4]   2> 871 T1692 oass.IndexSchema.readSchema Reading Solr Schema
[junit4:junit4]   2> 875 T1692 oass.IndexSchema.readSchema Schema name=test
[junit4:junit4]   2> 1292 T1692 oass.OpenExchangeRatesOrgProvider.init Initialized with rates=open-exchange-rates.json, refreshInterval=1440.
[junit4:junit4]   2> 1299 T1692 oass.IndexSchema.readSchema default search field in schema is text
[junit4:junit4]   2> 1302 T1692 oass.IndexSchema.readSchema unique key field: id
[junit4:junit4]   2> 1314 T1692 oass.FileExchangeRateProvider.reload Reloading exchange rates from file currency.xml
[junit4:junit4]   2> 1318 T1692 oass.FileExchangeRateProvider.reload Reloading exchange rates from file currency.xml
[junit4:junit4]   2> 1321 T1692 oass.OpenExchangeRatesOrgProvider.reload Reloading exchange rates from open-exchange-rates.json
[junit4:junit4]   2> 1322 T1692 oass.OpenExchangeRatesOrgProvider.reload Reloading exchange rates from open-exchange-rates.json
[junit4:junit4]   2> 1323 T1692 oasc.SolrCore.<init> [collection1] Opening new SolrCore at /usr/home/hudson/hudson-slave/workspace/Lucene-Solr-NightlyTests-4.x/solr/build/solr-core/test-files/solr/collection1/, dataDir=./org.apache.solr.cloud.BasicDistributedZk2Test-1348159690546/control/data/
[junit4:junit4]   2> 1324 T1692 oasc.JmxMonitoredMap.<init> JMX monitoring is enabled. Adding Solr mbeans to JMX Server: com.sun.jmx.mbeanserver.JmxMBeanServer@402fb002
[junit4:junit4]   2> 1325 T1692 oasc.SolrCore.getNewIndexDir WARNING New index directory detected: old=null new=./org.apache.solr.cloud.BasicDistributedZk2Test-1348159690546/control/data/index/
[junit4:junit4]   2> 1326 T1692 oasc.SolrCore.initIndex WARNING [collection1] Solr index directory './org.apache.solr.cloud.BasicDistributedZk2Test-1348159690546/control/data/index' doesn't exist. Creating new index...
[junit4:junit4]   2> 1326 T1692 oasc.CachingDirectoryFactory.get return new directory for /usr/home/hudson/hudson-slave/workspace/Lucene-Solr-NightlyTests-4.x/solr/build/solr-core/test/J1/./org.apache.solr.cloud.BasicDistributedZk2Test-1348159690546/control/data/index forceNew:false
[junit4:junit4]   2> 1340 T1692 oasc.SolrDeletionPolicy.onCommit SolrDeletionPolicy.onCommit: commits:num=1
[junit4:junit4]   2> 		commit{dir=NRTCachingDirectory(org.apache.lucene.store.NIOFSDirectory@/usr/home/hudson/hudson-slave/workspace/Lucene-Solr-NightlyTests-4.x/solr/build/solr-core/test/J1/org.apache.solr.cloud.BasicDistributedZk2Test-1348159690546/control/data/index lockFactory=org.apache.lucene.store.NativeFSLockFactory@f31e702; maxCacheMB=48.0 maxMergeSizeMB=4.0),segFN=segments_1,generation=1,filenames=[segments_1]
[junit4:junit4]   2> 1340 T1692 oasc.SolrDeletionPolicy.updateCommits newest commit = 1
[junit4:junit4]   2> 1341 T1692 oasc.SolrCore.initWriters created xml: solr.XMLResponseWriter
[junit4:junit4]   2> 1343 T1692 oasup.UpdateRequestProcessorChain.init inserting DistributedUpdateProcessorFactory into updateRequestProcessorChain "dedupe"
[junit4:junit4]   2> 1343 T1692 oasup.UpdateRequestProcessorChain.init inserting DistributedUpdateProcessorFactory into updateRequestProcessorChain "dedupe-allfields"
[junit4:junit4]   2> 1343 T1692 oasup.UpdateRequestProcessorChain.init inserting DistributedUpdateProcessorFactory into updateRequestProcessorChain "stored_sig"
[junit4:junit4]   2> 1344 T1692 oasup.UpdateRequestProcessorChain.init inserting DistributedUpdateProcessorFactory into updateRequestProcessorChain "uniq-fields"
[junit4:junit4]   2> 1344 T1692 oasup.UpdateRequestProcessorChain.init inserting DistributedUpdateProcessorFactory into updateRequestProcessorChain "distrib-dup-test-chain-implicit"
[junit4:junit4]   2> 1345 T1692 oasc.RequestHandlers.initHandlersFromConfig adding lazy requestHandler: solr.ReplicationHandler
[junit4:junit4]   2> 1345 T1692 oasc.RequestHandlers.initHandlersFromConfig created /replication: solr.ReplicationHandler
[junit4:junit4]   2> 1345 T1692 oasc.RequestHandlers.initHandlersFromConfig created standard: solr.StandardRequestHandler
[junit4:junit4]   2> 1346 T1692 oasc.RequestHandlers.initHandlersFromConfig created /get: solr.RealTimeGetHandler
[junit4:junit4]   2> 1346 T1692 oasc.RequestHandlers.initHandlersFromConfig created dismax: solr.SearchHandler
[junit4:junit4]   2> 1347 T1692 oasc.RequestHandlers.initHandlersFromConfig created mock: org.apache.solr.core.MockQuerySenderListenerReqHandler
[junit4:junit4]   2> 1347 T1692 oasc.RequestHandlers.initHandlersFromConfig created /admin/: org.apache.solr.handler.admin.AdminHandlers
[junit4:junit4]   2> 1348 T1692 oasc.RequestHandlers.initHandlersFromConfig created defaults: solr.StandardRequestHandler
[junit4:junit4]   2> 1348 T1692 oasc.RequestHandlers.initHandlersFromConfig adding lazy requestHandler: solr.StandardRequestHandler
[junit4:junit4]   2> 1348 T1692 oasc.RequestHandlers.initHandlersFromConfig created lazy: solr.StandardRequestHandler
[junit4:junit4]   2> 1349 T1692 oasc.RequestHandlers.initHandlersFromConfig created /update: solr.UpdateRequestHandler
[junit4:junit4]   2> 1349 T1692 oasc.RequestHandlers.initHandlersFromConfig created /terms: org.apache.solr.handler.component.SearchHandler
[junit4:junit4]   2> 1350 T1692 oasc.RequestHandlers.initHandlersFromConfig created spellCheckCompRH: org.apache.solr.handler.component.SearchHandler
[junit4:junit4]   2> 1350 T1692 oasc.RequestHandlers.initHandlersFromConfig created spellCheckCompRH_Direct: org.apache.solr.handler.component.SearchHandler
[junit4:junit4]   2> 1350 T1692 oasc.RequestHandlers.initHandlersFromConfig created spellCheckWithWordbreak: org.apache.solr.handler.component.SearchHandler
[junit4:junit4]   2> 1351 T1692 oasc.RequestHandlers.initHandlersFromConfig created spellCheckWithWordbreak_Direct: org.apache.solr.handler.component.SearchHandler
[junit4:junit4]   2> 1351 T1692 oasc.RequestHandlers.initHandlersFromConfig created spellCheckCompRH1: org.apache.solr.handler.component.SearchHandler
[junit4:junit4]   2> 1352 T1692 oasc.RequestHandlers.initHandlersFromConfig created tvrh: org.apache.solr.handler.component.SearchHandler
[junit4:junit4]   2> 1352 T1692 oasc.RequestHandlers.initHandlersFromConfig created /mlt: solr.MoreLikeThisHandler
[junit4:junit4]   2> 1352 T1692 oasc.RequestHandlers.initHandlersFromConfig created /debug/dump: solr.DumpRequestHandler
[junit4:junit4]   2> 1355 T1692 oashl.XMLLoader.init xsltCacheLifetimeSeconds=60
[junit4:junit4]   2> 1359 T1692 oasc.SolrCore.initDeprecatedSupport WARNING solrconfig.xml uses deprecated <admin/gettableFiles>, Please update your config to use the ShowFileRequestHandler.
[junit4:junit4]   2> 1360 T1692 oasc.SolrCore.initDeprecatedSupport WARNING adding ShowFileRequestHandler with hidden files: [SCHEMA.XML, OLD_SYNONYMS.TXT, STOPWORDS.TXT, PROTWORDS.TXT, OPEN-EXCHANGE-RATES.JSON, SYNONYMS.TXT, CURRENCY.XML, MAPPING-ISOLATIN1ACCENT.TXT]
[junit4:junit4]   2> 1363 T1692 oass.SolrIndexSearcher.<init> Opening Searcher@8bae7aa main
[junit4:junit4]   2> 1364 T1692 oasu.CommitTracker.<init> Hard AutoCommit: disabled
[junit4:junit4]   2> 1364 T1692 oasu.CommitTracker.<init> Soft AutoCommit: disabled
[junit4:junit4]   2> 1365 T1692 oashc.SpellCheckComponent.inform Initializing spell checkers
[junit4:junit4]   2> 1372 T1692 oass.DirectSolrSpellChecker.init init: {name=direct,classname=DirectSolrSpellChecker,field=lowerfilt,minQueryLength=3}
[junit4:junit4]   2> 1421 T1715 oasc.SolrCore.registerSearcher [collection1] Registered new searcher Searcher@8bae7aa main{StandardDirectoryReader(segments_1:1)}
[junit4:junit4]   2> 1424 T1697 oazs.PrepRequestProcessor.pRequest Got user-level KeeperException when processing sessionid:0x139e49457390002 type:create cxid:0x53 zxid:0xfffffffffffffffe txntype:unknown reqpath:n/a Error Path:/solr/overseer/queue Error:KeeperErrorCode = NoNode for /solr/overseer/queue
[junit4:junit4]   2> 1436 T1692 oasc.CoreContainer.register registering core: collection1
[junit4:junit4]   2> 1437 T1692 oasc.ZkController.register Register shard - core:collection1 address:http://127.0.0.1:56193/solr shardId:control_shard
[junit4:junit4]   2> 1437 T1692 oascc.SolrZkClient.makePath makePath: /collections/control_collection/leader_elect/control_shard/election
[junit4:junit4]   2> 1456 T1697 oazs.PrepRequestProcessor.pRequest Got user-level KeeperException when processing sessionid:0x139e49457390002 type:delete cxid:0x62 zxid:0xfffffffffffffffe txntype:unknown reqpath:n/a Error Path:/solr/collections/control_collection/leaders Error:KeeperErrorCode = NoNode for /solr/collections/control_collection/leaders
[junit4:junit4]   2> 1457 T1692 oasc.ShardLeaderElectionContext.runLeaderProcess Running the leader process.
[junit4:junit4]   2> 1457 T1697 oazs.PrepRequestProcessor.pRequest Got user-level KeeperException when processing sessionid:0x139e49457390002 type:create cxid:0x63 zxid:0xfffffffffffffffe txntype:unknown reqpath:n/a Error Path:/solr/overseer Error:KeeperErrorCode = NodeExists for /solr/overseer
[junit4:junit4]   2> 1678 T1713 oascc.ZkStateReader.updateClusterState Updating cloud state from ZooKeeper... 
[junit4:junit4]   2> 1681 T1697 oazs.PrepRequestProcessor.pRequest Got user-level KeeperException when processing sessionid:0x139e49457390002 type:create cxid:0x6a zxid:0xfffffffffffffffe txntype:unknown reqpath:n/a Error Path:/solr/overseer/queue-work Error:KeeperErrorCode = NoNode for /solr/overseer/queue-work
[junit4:junit4]   2> 1745 T1712 oascc.ZkStateReader$2.process A cluster state change has occurred - updating...
[junit4:junit4]   2> 1968 T1692 oasc.ShardLeaderElectionContext.waitForReplicasToComeUp Enough replicas found to continue.
[junit4:junit4]   2> 1969 T1692 oasc.ShardLeaderElectionContext.runLeaderProcess I may be the new leader - try and sync
[junit4:junit4]   2> 1969 T1692 oasc.SyncStrategy.sync Sync replicas to http://127.0.0.1:56193/solr/collection1/
[junit4:junit4]   2> 1969 T1692 oasc.SyncStrategy.syncReplicas Sync Success - now sync replicas to me
[junit4:junit4]   2> 1970 T1692 oasc.SyncStrategy.syncToMe http://127.0.0.1:56193/solr/collection1/ has no replicas
[junit4:junit4]   2> 1970 T1692 oasc.ShardLeaderElectionContext.runLeaderProcess I am the new leader: http://127.0.0.1:56193/solr/collection1/
[junit4:junit4]   2> 1970 T1692 oascc.SolrZkClient.makePath makePath: /collections/control_collection/leaders/control_shard
[junit4:junit4]   2> 1975 T1697 oazs.PrepRequestProcessor.pRequest Got user-level KeeperException when processing sessionid:0x139e49457390002 type:create cxid:0x88 zxid:0xfffffffffffffffe txntype:unknown reqpath:n/a Error Path:/solr/overseer Error:KeeperErrorCode = NodeExists for /solr/overseer
[junit4:junit4]   2> 2260 T1713 oascc.ZkStateReader.updateClusterState Updating cloud state from ZooKeeper... 
[junit4:junit4]   2> 2276 T1712 oascc.ZkStateReader$2.process A cluster state change has occurred - updating...
[junit4:junit4]   2> 2303 T1692 oasc.ZkController.register We are http://127.0.0.1:56193/solr/collection1/ and leader is http://127.0.0.1:56193/solr/collection1/
[junit4:junit4]   2> 2303 T1692 oasc.ZkController.register No LogReplay needed for core=collection1 baseURL=http://127.0.0.1:56193/solr
[junit4:junit4]   2> 2303 T1692 oasc.ZkController.checkRecovery I am the leader, no recovery necessary
[junit4:junit4]   2> 2306 T1692 oascc.ZkStateReader.updateClusterState Updating cloud state from ZooKeeper... 
[junit4:junit4]   2> 2307 T1692 oass.SolrDispatchFilter.init user.dir=/usr/home/hudson/hudson-slave/workspace/Lucene-Solr-NightlyTests-4.x/solr/build/solr-core/test/J1
[junit4:junit4]   2> 2308 T1692 oass.SolrDispatchFilter.init SolrDispatchFilter.init() done
[junit4:junit4]   2> 2308 T1692 oascsi.HttpClientUtil.createClient Creating new http client, config:maxConnections=128&maxConnectionsPerHost=32&followRedirects=false
[junit4:junit4]   2> 2437 T1692 oejs.Server.doStart jetty-8.1.2.v20120308
[junit4:junit4]   2> 2440 T1692 oejs.AbstractConnector.doStart Started SocketConnector@0.0.0.0:56195
[junit4:junit4]   2> 2440 T1692 oasc.SolrResourceLoader.locateSolrHome JNDI not configured for solr (NoInitialContextEx)
[junit4:junit4]   2> 2440 T1692 oasc.SolrResourceLoader.locateSolrHome using system property solr.solr.home: /usr/home/hudson/hudson-slave/workspace/Lucene-Solr-NightlyTests-4.x/solr/build/solr-core/test/J1/./solrtest-jetty1-1348159692861
[junit4:junit4]   2> 2441 T1692 oasc.SolrResourceLoader.<init> new SolrResourceLoader for deduced Solr Home: '/usr/home/hudson/hudson-slave/workspace/Lucene-Solr-NightlyTests-4.x/solr/build/solr-core/test/J1/./solrtest-jetty1-1348159692861/'
[junit4:junit4]   2> 2467 T1692 oass.SolrDispatchFilter.init SolrDispatchFilter.init()
[junit4:junit4]   2> 2468 T1692 oasc.SolrResourceLoader.locateSolrHome JNDI not configured for solr (NoInitialContextEx)
[junit4:junit4]   2> 2468 T1692 oasc.SolrResourceLoader.locateSolrHome using system property solr.solr.home: /usr/home/hudson/hudson-slave/workspace/Lucene-Solr-NightlyTests-4.x/solr/build/solr-core/test/J1/./solrtest-jetty1-1348159692861
[junit4:junit4]   2> 2468 T1692 oasc.CoreContainer$Initializer.initialize looking for solr.xml: /usr/home/hudson/hudson-slave/workspace/Lucene-Solr-NightlyTests-4.x/solr/build/solr-core/test/J1/./solrtest-jetty1-1348159692861/solr.xml
[junit4:junit4]   2> 2469 T1692 oasc.CoreContainer.<init> New CoreContainer 22643817
[junit4:junit4]   2> 2469 T1692 oasc.CoreContainer.load Loading CoreContainer using Solr Home: '/usr/home/hudson/hudson-slave/workspace/Lucene-Solr-NightlyTests-4.x/solr/build/solr-core/test/J1/./solrtest-jetty1-1348159692861/'
[junit4:junit4]   2> 2469 T1692 oasc.SolrResourceLoader.<init> new SolrResourceLoader for directory: '/usr/home/hudson/hudson-slave/workspace/Lucene-Solr-NightlyTests-4.x/solr/build/solr-core/test/J1/./solrtest-jetty1-1348159692861/'
[junit4:junit4]   2> 2487 T1692 oasc.CoreContainer.load Registering Log Listener
[junit4:junit4]   2> 2498 T1692 oasc.CoreContainer.initZooKeeper Zookeeper client=127.0.0.1:56190/solr
[junit4:junit4]   2> 2498 T1692 oaz.ZooKeeper.<init> Initiating client connection, connectString=127.0.0.1:56190/solr sessionTimeout=5000 watcher=org.apache.solr.common.cloud.ConnectionManager@4d38e3ae
[junit4:junit4]   2> 2499 T1725 oaz.ClientCnxn$SendThread.startConnect Opening socket connection to server /127.0.0.1:56190
[junit4:junit4]   2> 2499 T1692 oascc.ConnectionManager.waitForConnected Waiting for client to connect to ZooKeeper
[junit4:junit4]   2> 2500 T1725 oaz.ClientCnxn$SendThread.primeConnection Socket connection established to localhost/127.0.0.1:56190, initiating session
[junit4:junit4]   2> 2501 T1694 oazs.NIOServerCnxn$Factory.run Accepted socket connection from /140.211.11.196:56196
[junit4:junit4]   2> 2501 T1694 oazs.NIOServerCnxn.readConnectRequest Client attempting to establish new session at /140.211.11.196:56196
[junit4:junit4]   2> 2505 T1696 oazs.NIOServerCnxn.finishSessionInit Established session 0x139e49457390003 with negotiated timeout 5000 for client /140.211.11.196:56196
[junit4:junit4]   2> 2505 T1725 oaz.ClientCnxn$SendThread.readConnectResult Session establishment complete on server localhost/127.0.0.1:56190, sessionid = 0x139e49457390003, negotiated timeout = 5000
[junit4:junit4]   2> 2506 T1726 oascc.ConnectionManager.process Watcher org.apache.solr.common.cloud.ConnectionManager@4d38e3ae name:ZooKeeperConnection Watcher:127.0.0.1:56190/solr got event WatchedEvent state:SyncConnected type:None path:null path:null type:None
[junit4:junit4]   2> 2506 T1692 oascc.ConnectionManager.waitForConnected Client is connected to ZooKeeper
[junit4:junit4]   2> 2507 T1697 oazs.PrepRequestProcessor.pRequest Got user-level KeeperException when processing sessionid:0x139e49457390003 type:create cxid:0x1 zxid:0xfffffffffffffffe txntype:unknown reqpath:n/a Error Path:/solr/overseer Error:KeeperErrorCode = NodeExists for /solr/overseer
[junit4:junit4]   2> 2513 T1697 oazs.PrepRequestProcessor.pRequest Got user-level KeeperException when processing sessionid:0x139e49457390003 type:create cxid:0x2 zxid:0xfffffffffffffffe txntype:unknown reqpath:n/a Error Path:/solr/overseer Error:KeeperErrorCode = NodeExists for /solr/overseer
[junit4:junit4]   2> 2524 T1692 oasc.ZkController.createEphemeralLiveNode Register node as live in ZooKeeper:/live_nodes/127.0.0.1:56195_solr
[junit4:junit4]   2> 2525 T1697 oazs.PrepRequestProcessor.pRequest Got user-level KeeperException when processing sessionid:0x139e49457390003 type:delete cxid:0x4 zxid:0xfffffffffffffffe txntype:unknown reqpath:n/a Error Path:/solr/live_nodes/127.0.0.1:56195_solr Error:KeeperErrorCode = NoNode for /solr/live_nodes/127.0.0.1:56195_solr
[junit4:junit4]   2> 2531 T1692 oascc.SolrZkClient.makePath makePath: /live_nodes/127.0.0.1:56195_solr
[junit4:junit4]   2> 2540 T1712 oascc.ZkStateReader$3.process Updating live nodes
[junit4:junit4]   2> 2541 T1692 oashc.HttpShardHandlerFactory.getParameter Setting socketTimeout to: 0
[junit4:junit4]   2> 2541 T1692 oashc.HttpShardHandlerFactory.getParameter Setting urlScheme to: http://
[junit4:junit4]   2> 2542 T1692 oashc.HttpShardHandlerFactory.getParameter Setting connTimeout to: 0
[junit4:junit4]   2> 2542 T1692 oashc.HttpShardHandlerFactory.getParameter Setting maxConnectionsPerHost to: 20
[junit4:junit4]   2> 2542 T1692 oashc.HttpShardHandlerFactory.getParameter Setting corePoolSize to: 0
[junit4:junit4]   2> 2542 T1692 oashc.HttpShardHandlerFactory.getParameter Setting maximumPoolSize to: 2147483647
[junit4:junit4]   2> 2543 T1692 oashc.HttpShardHandlerFactory.getParameter Setting maxThreadIdleTime to: 5
[junit4:junit4]   2> 2543 T1692 oashc.HttpShardHandlerFactory.getParameter Setting sizeOfQueue to: -1
[junit4:junit4]   2> 2543 T1692 oashc.HttpShardHandlerFactory.getParameter Setting fairnessPolicy to: false
[junit4:junit4]   2> 2544 T1692 oascsi.HttpClientUtil.createClient Creating new http client, config:maxConnectionsPerHost=20&maxConnections=10000&socketTimeout=0&connTimeout=0&retry=false
[junit4:junit4]   2> 2559 T1692 oascc.ZkStateReader.createClusterStateWatchersAndUpdate Updating cluster state from ZooKeeper... 
[junit4:junit4]   2> 2567 T1692 oasc.CoreContainer.create Creating SolrCore 'collection1' using instanceDir: /usr/home/hudson/hudson-slave/workspace/Lucene-Solr-NightlyTests-4.x/solr/build/solr-core/test/J1/./solrtest-jetty1-1348159692861/collection1
[junit4:junit4]   2> 2567 T1692 oasc.ZkController.createCollectionZkNode Check for collection zkNode:collection1
[junit4:junit4]   2> 2569 T1692 oasc.ZkController.createCollectionZkNode Collection zkNode exists
[junit4:junit4]   2> 2569 T1692 oasc.ZkController.readConfigName Load collection config from:/collections/collection1
[junit4:junit4]   2> 2573 T1692 oasc.SolrResourceLoader.<init> new SolrResourceLoader for directory: '/usr/home/hudson/hudson-slave/workspace/Lucene-Solr-NightlyTests-4.x/solr/build/solr-core/test/J1/./solrtest-jetty1-1348159692861/collection1/'
[junit4:junit4]   2> 2574 T1692 oasc.SolrResourceLoader.replaceClassLoader Adding 'file:/usr/home/hudson/hudson-slave/workspace/Lucene-Solr-NightlyTests-4.x/solr/build/solr-core/test/J1/solrtest-jetty1-1348159692861/collection1/lib/README' to classloader
[junit4:junit4]   2> 2575 T1692 oasc.SolrResourceLoader.replaceClassLoader Adding 'file:/usr/home/hudson/hudson-slave/workspace/Lucene-Solr-NightlyTests-4.x/solr/build/solr-core/test/J1/solrtest-jetty1-1348159692861/collection1/lib/classes/' to classloader
[junit4:junit4]   2> 2640 T1692 oasc.SolrConfig.<init> Using Lucene MatchVersion: LUCENE_40
[junit4:junit4]   2> 2716 T1692 oasc.SolrConfig.<init> Loaded SolrConfig: solrconfig.xml
[junit4:junit4]   2> 2787 T1713 oascc.ZkStateReader.updateClusterState Updating cloud state from ZooKeeper... 
[junit4:junit4]   2> 2817 T1692 oass.IndexSchema.readSchema Reading Solr Schema
[junit4:junit4]   2> 2824 T1692 oass.IndexSchema.readSchema Schema name=test
[junit4:junit4]   2> 2906 T1712 oascc.ZkStateReader$2.process A cluster state change has occurred - updating...
[junit4:junit4]   2> 2907 T1726 oascc.ZkStateReader$2.process A cluster state change has occurred - updating...
[junit4:junit4]   2> 3480 T1692 oass.OpenExchangeRatesOrgProvider.init Initialized with rates=open-exchange-rates.json, refreshInterval=1440.
[junit4:junit4]   2> 3488 T1692 oass.IndexSchema.readSchema default search field in schema is text
[junit4:junit4]   2> 3491 T1692 oass.IndexSchema.readSchema unique key field: id
[junit4:junit4]   2> 3502 T1692 oass.FileExchangeRateProvider.reload Reloading exchange rates from file currency.xml
[junit4:junit4]   2> 3506 T1692 oass.FileExchangeRateProvider.reload Reloading exchange rates from file currency.xml
[junit4:junit4]   2> 3510 T1692 oass.OpenExchangeRatesOrgProvider.reload Reloading exchange rates from open-exchange-rates.json
[junit4:junit4]   2> 3512 T1692 oass.OpenExchangeRatesOrgProvider.reload Reloading exchange rates from open-exchange-rates.json
[junit4:junit4]   2> 3513 T1692 oasc.SolrCore.<init> [collection1] Opening new SolrCore at /usr/home/hudson/hudson-slave/workspace/Lucene-Solr-NightlyTests-4.x/solr/build/solr-core/test/J1/./solrtest-jetty1-1348159692861/collection1/, dataDir=./org.apache.solr.cloud.BasicDistributedZk2Test-1348159690546/jetty1/
[junit4:junit4]   2> 3514 T1692 oasc.JmxMonitoredMap.<init> JMX monitoring is enabled. Adding Solr mbeans to JMX Server: com.sun.jmx.mbeanserver.JmxMBeanServer@402fb002
[junit4:junit4]   2> 3515 T1692 oasc.SolrCore.getNewIndexDir WARNING New index directory detected: old=null new=./org.apache.solr.cloud.BasicDistributedZk2Test-1348159690546/jetty1/index/
[junit4:junit4]   2> 3516 T1692 oasc.SolrCore.initIndex WARNING [collection1] Solr index directory './org.apache.solr.cloud.BasicDistributedZk2Test-1348159690546/jetty1/index' doesn't exist. Creating new index...
[junit4:junit4]   2> 3516 T1692 oasc.CachingDirectoryFactory.get return new directory for /usr/home/hudson/hudson-slave/workspace/Lucene-Solr-NightlyTests-4.x/solr/build/solr-core/test/J1/./org.apache.solr.cloud.BasicDistributedZk2Test-1348159690546/jetty1/index forceNew:false
[junit4:junit4]   2> 3530 T1692 oasc.SolrDeletionPolicy.onCommit SolrDeletionPolicy.onCommit: commits:num=1
[junit4:junit4]   2> 		commit{dir=NRTCachingDirectory(org.apache.lucene.store.NIOFSDirectory@/usr/home/hudson/hudson-slave/workspace/Lucene-Solr-NightlyTests-4.x/solr/build/solr-core/test/J1/org.apache.solr.cloud.BasicDistributedZk2Test-1348159690546/jetty1/index lockFactory=org.apache.lucene.store.NativeFSLockFactory@14c4a1ea; maxCacheMB=48.0 maxMergeSizeMB=4.0),segFN=segments_1,generation=1,filenames=[segments_1]
[junit4:junit4]   2> 3531 T1692 oasc.SolrDeletionPolicy.updateCommits newest commit = 1
[junit4:junit4]   2> 3532 T1692 oasc.SolrCore.initWriters created xml: solr.XMLResponseWriter
[junit4:junit4]   2> 3533 T1692 oasup.UpdateRequestProcessorChain.init inserting DistributedUpdateProcessorFactory into updateRequestProcessorChain "dedupe"
[junit4:junit4]   2> 3534 T1692 oasup.UpdateRequestProcessorChain.init inserting DistributedUpdateProcessorFactory into updateRequestProcessorChain "dedupe-allfields"
[junit4:junit4]   2> 3534 T1692 oasup.UpdateRequestProcessorChain.init inserting DistributedUpdateProcessorFactory into updateRequestProcessorChain "stored_sig"
[junit4:junit4]   2> 3534 T1692 oasup.UpdateRequestProcessorChain.init inserting DistributedUpdateProcessorFactory into updateRequestProcessorChain "uniq-fields"
[junit4:junit4]   2> 3535 T1692 oasup.UpdateRequestProcessorChain.init inserting DistributedUpdateProcessorFactory into updateRequestProcessorChain "distrib-dup-test-chain-implicit"
[junit4:junit4]   2> 3535 T1692 oasc.RequestHandlers.initHandlersFromConfig adding lazy requestHandler: solr.ReplicationHandler
[junit4:junit4]   2> 3536 T1692 oasc.RequestHandlers.initHandlersFromConfig created /replication: solr.ReplicationHandler
[junit4:junit4]   2> 3536 T1692 oasc.RequestHandlers.initHandlersFromConfig created standard: solr.StandardRequestHandler
[junit4:junit4]   2> 3537 T1692 oasc.RequestHandlers.initHandlersFromConfig created /get: solr.RealTimeGetHandler
[junit4:junit4]   2> 3537 T1692 oasc.RequestHandlers.initHandlersFromConfig created dismax: solr.SearchHandler
[junit4:junit4]   2> 3538 T1692 oasc.RequestHandlers.initHandlersFromConfig created mock: org.apache.solr.core.MockQuerySenderListenerReqHandler
[junit4:junit4]   2> 3538 T1692 oasc.RequestHandlers.initHandlersFromConfig created /admin/: org.apache.solr.handler.admin.AdminHandlers
[junit4:junit4]   2> 3539 T1692 oasc.RequestHandlers.initHandlersFromConfig created defaults: solr.StandardRequestHandler
[junit4:junit4]   2> 3539 T1692 oasc.RequestHandlers.initHandlersFromConfig adding lazy requestHandler: solr.StandardRequestHandler
[junit4:junit4]   2> 3540 T1692 oasc.RequestHandlers.initHandlersFromConfig created lazy: solr.StandardRequestHandler
[junit4:junit4]   2> 3540 T1692 oasc.RequestHandlers.initHandlersFromConfig created /update: solr.UpdateRequestHandler
[junit4:junit4]   2> 3540 T1692 oasc.RequestHandlers.initHandlersFromConfig created /terms: org.apache.solr.handler.component.SearchHandler
[junit4:junit4]   2> 3541 T1692 oasc.RequestHandlers.initHandlersFromConfig created spellCheckCompRH: org.apache.solr.handler.component.SearchHandler
[junit4:junit4]   2> 3541 T1692 oasc.RequestHandlers.initHandlersFromConfig created spellCheckCompRH_Direct: org.apache.solr.handler.component.SearchHandler
[junit4:junit4]   2> 3542 T1692 oasc.RequestHandlers.initHandlersFromConfig created spellCheckWithWordbreak: org.apache.solr.handler.component.SearchHandler
[junit4:junit4]   2> 3542 T1692 oasc.RequestHandlers.initHandlersFromConfig created spellCheckWithWordbreak_Direct: org.apache.solr.handler.component.SearchHandler
[junit4:junit4]   2> 3543 T1692 oasc.RequestHandlers.initHandlersFromConfig created spellCheckCompRH1: org.apache.solr.handler.component.SearchHandler
[junit4:junit4]   2> 3543 T1692 oasc.RequestHandlers.initHandlersFromConfig created tvrh: org.apache.solr.handler.component.SearchHandler
[junit4:junit4]   2> 3544 T1692 oasc.RequestHandlers.initHandlersFromConfig created /mlt: solr.MoreLikeThisHandler
[junit4:junit4]   2> 3544 T1692 oasc.RequestHandlers.initHandlersFromConfig created /debug/dump: solr.DumpRequestHandler
[junit4:junit4]   2> 3548 T1692 oashl.XMLLoader.init xsltCacheLifetimeSeconds=60
[junit4:junit4]   2> 3553 T1692 oasc.SolrCore.initDeprecatedSupport WARNING solrconfig.xml uses deprecated <admin/gettableFiles>, Please update your config to use the ShowFileRequestHandler.
[junit4:junit4]   2> 3554 T1692 oasc.SolrCore.initDeprecatedSupport WARNING adding ShowFileRequestHandler with hidden files: [SCHEMA.XML, OLD_SYNONYMS.TXT, STOPWORDS.TXT, PROTWORDS.TXT, OPEN-EXCHANGE-RATES.JSON, SYNONYMS.TXT, CURRENCY.XML, MAPPING-ISOLATIN1ACCENT.TXT]
[junit4:junit4]   2> 3558 T1692 oass.SolrIndexSearcher.<init> Opening Searcher@33040186 main
[junit4:junit4]   2> 3559 T1692 oasu.CommitTracker.<init> Hard AutoCommit: disabled
[junit4:junit4]   2> 3560 T1692 oasu.CommitTracker.<init> Soft AutoCommit: disabled
[junit4:junit4]   2> 3560 T1692 oashc.SpellCheckComponent.inform Initializing spell checkers
[junit4:junit4]   2> 3573 T1692 oass.DirectSolrSpellChecker.init init: {name=direct,classname=DirectSolrSpellChecker,field=lowerfilt,minQueryLength=3}
[junit4:junit4]   2> 3627 T1727 oasc.SolrCore.registerSearcher [collection1] Registered new searcher Searcher@33040186 main{StandardDirectoryReader(segments_1:1)}
[junit4:junit4]   2> 3914 T1713 oascc.ZkStateReader.updateClusterState Updating cloud state from ZooKeeper... 
[junit4:junit4]   2> 3943 T1712 oascc.ZkStateReader$2.process A cluster state change has occurred - updating...
[junit4:junit4]   2> 3943 T1726 oascc.ZkStateReader$2.process A cluster state change has occurred - updating...
[junit4:junit4]   2> 4136 T1692 oasc.CoreContainer.register registering core: collection1
[junit4:junit4]   2> 4136 T1692 oasc.ZkController.register Register shard - core:collection1 address:http://127.0.0.1:56195/solr shardId:shard1
[junit4:junit4]   2> 4137 T1692 oascc.SolrZkClient.makePath makePath: /collections/collection1/leader_elect/shard1/election
[junit4:junit4]   2> 4155 T1697 oazs.PrepRequestProcessor.pRequest Got user-level KeeperException when processing sessionid:0x139e49457390003 type:delete cxid:0x43 zxid:0xfffffffffffffffe txntype:unknown reqpath:n/a Error Path:/solr/collections/collection1/leaders Error:KeeperErrorCode = NoNode for /solr/collections/collection1/leaders
[junit4:junit4]   2> 4168 T1692 oasc.ShardLeaderElectionContext.runLeaderProcess Running the leader process.
[junit4:junit4]   2> 4169 T1697 oazs.PrepRequestProcessor.pRequest Got user-level KeeperException when processing sessionid:0x139e49457390003 type:create cxid:0x44 zxid:0xfffffffffffffffe txntype:unknown reqpath:n/a Error Path:/solr/overseer Error:KeeperErrorCode = NodeExists for /solr/overseer
[junit4:junit4]   2> 4172 T1692 oasc.ShardLeaderElectionContext.waitForReplicasToComeUp Enough replicas found to continue.
[junit4:junit4]   2> 4172 T1692 oasc.ShardLeaderElectionContext.runLeaderProcess I may be the new leader - try and sync
[junit4:junit4]   2> 4172 T1692 oasc.SyncStrategy.sync Sync replicas to http://127.0.0.1:56195/solr/collection1/
[junit4:junit4]   2> 4173 T1692 oasc.SyncStrategy.syncReplicas Sync Success - now sync replicas to me
[junit4:junit4]   2> 4173 T1692 oasc.SyncStrategy.syncToMe http://127.0.0.1:56195/solr/collection1/ has no replicas
[junit4:junit4]   2> 4173 T1692 oasc.ShardLeaderElectionContext.runLeaderProcess I am the new leader: http://127.0.0.1:56195/solr/collection1/
[junit4:junit4]   2> 4173 T1692 oascc.SolrZkClient.makePath makePath: /collections/collection1/leaders/shard1
[junit4:junit4]   2> 4184 T1697 oazs.PrepRequestProcessor.pRequest Got user-level KeeperException when processing sessionid:0x139e49457390003 type:create cxid:0x4e zxid:0xfffffffffffffffe txntype:unknown reqpath:n/a Error Path:/solr/overseer Error:KeeperErrorCode = NodeExists for /solr/overseer
[junit4:junit4]   2> 4453 T1713 oascc.ZkStateReader.updateClusterState Updating cloud state from ZooKeeper... 
[junit4:junit4]   2> 4471 T1712 oascc.ZkStateReader$2.process A cluster state change has occurred - updating...
[junit4:junit4]   2> 4471 T1726 oascc.ZkStateReader$2.process A cluster state change has occurred - updating...
[junit4:junit4]   2> 4493 T1692 oasc.ZkController.register We are http://127.0.0.1:56195/solr/collection1/ and leader is http://127.0.0.1:56195/solr/collection1/
[junit4:junit4]   2> 4493 T1692 oasc.ZkController.register No LogReplay needed for core=collection1 baseURL=http://127.0.0.1:56195/solr
[junit4:junit4]   2> 4493 T1692 oasc.ZkController.checkRecovery I am the leader, no recovery necessary
[junit4:junit4]   2> 4495 T1692 oascc.ZkStateReader.updateClusterState Updating cloud state from ZooKeeper... 
[junit4:junit4]   2> 4496 T1692 oass.SolrDispatchFilter.init user.dir=/usr/home/hudson/hudson-slave/workspace/Lucene-Solr-NightlyTests-4.x/solr/build/solr-core/test/J1
[junit4:junit4]   2> 4497 T1692 oass.SolrDispatchFilter.init SolrDispatchFilter.init() done
[junit4:junit4]   2> 4497 T1692 oascsi.HttpClientUtil.createClient Creating new http client, config:maxConnections=128&maxConnectionsPerHost=32&followRedirects=false
[junit4:junit4]   2> 4625 T1692 oejs.Server.doStart jetty-8.1.2.v20120308
[junit4:junit4]   2> 4628 T1692 oejs.AbstractConnector.doStart Started SocketConnector@0.0.0.0:56201
[junit4:junit4]   2> 4628 T1692 oasc.SolrResourceLoader.locateSolrHome JNDI not configured for solr (NoInitialContextEx)
[junit4:junit4]   2> 4629 T1692 oasc.SolrResourceLoader.locateSolrHome using system property solr.solr.home: /usr/home/hudson/hudson-slave/workspace/Lucene-Solr-NightlyTests-4.x/solr/build/solr-core/test/J1/./solrtest-jetty2-1348159695050
[junit4:junit4]   2> 4629 T1692 oasc.SolrResourceLoader.<init> new SolrResourceLoader for deduced Solr Home: '/usr/home/hudson/hudson-slave/workspace/Lucene-Solr-NightlyTests-4.x/solr/build/solr-core/test/J1/./solrtest-jetty2-1348159695050/'
[junit4:junit4]   2> 4656 T1692 oass.SolrDispatchFilter.init SolrDispatchFilter.init()
[junit4:junit4]   2> 4657 T1692 oasc.SolrResourceLoader.locateSolrHome JNDI not configured for solr (NoInitialContextEx)
[junit4:junit4]   2> 4657 T1692 oasc.SolrResourceLoader.locateSolrHome using system property solr.solr.home: /usr/home/hudson/hudson-slave/workspace/Lucene-Solr-NightlyTests-4.x/solr/build/solr-core/test/J1/./solrtest-jetty2-1348159695050
[junit4:junit4]   2> 4657 T1692 oasc.CoreContainer$Initializer.initialize looking for solr.xml: /usr/home/hudson/hudson-slave/workspace/Lucene-Solr-NightlyTests-4.x/solr/build/solr-core/test/J1/./solrtest-jetty2-1348159695050/solr.xml
[junit4:junit4]   2> 4657 T1692 oasc.CoreContainer.<init> New CoreContainer 1513392935
[junit4:junit4]   2> 4658 T1692 oasc.CoreContainer.load Loading CoreContainer using Solr Home: '/usr/home/hudson/hudson-slave/workspace/Lucene-Solr-NightlyTests-4.x/solr/build/solr-core/test/J1/./solrtest-jetty2-1348159695050/'
[junit4:junit4]   2> 4658 T1692 oasc.SolrResourceLoader.<init> new SolrResourceLoader for directory: '/usr/home/hudson/hudson-slave/workspace/Lucene-Solr-NightlyTests-4.x/solr/build/solr-core/test/J1/./solrtest-jetty2-1348159695050/'
[junit4:junit4]   2> 4676 T1692 oasc.CoreContainer.load Registering Log Listener
[junit4:junit4]   2> 4686 T1692 oasc.CoreContainer.initZooKeeper Zookeeper client=127.0.0.1:56190/solr
[junit4:junit4]   2> 4687 T1692 oaz.ZooKeeper.<init> Initiating client connection, connectString=127.0.0.1:56190/solr sessionTimeout=5000 watcher=org.apache.solr.common.cloud.ConnectionManager@2175607e
[junit4:junit4]   2> 4688 T1737 oaz.ClientCnxn$SendThread.startConnect Opening socket connection to server /127.0.0.1:56190
[junit4:junit4]   2> 4688 T1692 oascc.ConnectionManager.waitForConnected Waiting for client to connect to ZooKeeper
[junit4:junit4]   2> 4689 T1737 oaz.ClientCnxn$SendThread.primeConnection Socket connection established to localhost/127.0.0.1:56190, initiating session
[junit4:junit4]   2> 4689 T1694 oazs.NIOServerCnxn$Factory.run Accepted socket connection from /140.211.11.196:56202
[junit4:junit4]   2> 4689 T1694 oazs.NIOServerCnxn.readConnectRequest Client attempting to establish new session at /140.211.11.196:56202
[junit4:junit4]   2> 4694 T1696 oazs.NIOServerCnxn.finishSessionInit Established session 0x139e49457390004 with negotiated timeout 5000 for client /140.211.11.196:56202
[junit4:junit4]   2> 4694 T1737 oaz.ClientCnxn$SendThread.readConnectResult Session establishment complete on server localhost/127.0.0.1:56190, sessionid = 0x139e49457390004, negotiated timeout = 5000
[junit4:junit4]   2> 4694 T1738 oascc.ConnectionManager.process Watcher org.apache.solr.common.cloud.ConnectionManager@2175607e name:ZooKeeperConnection Watcher:127.0.0.1:56190/solr got event WatchedEvent state:SyncConnected type:None path:null path:null type:None
[junit4:junit4]   2> 4695 T1692 oascc.ConnectionManager.waitForConnected Client is connected to ZooKeeper
[junit4:junit4]   2> 4695 T1697 oazs.PrepRequestProcessor.pRequest Got user-level KeeperException when processing sessionid:0x139e49457390004 type:create cxid:0x1 zxid:0xfffffffffffffffe txntype:unknown reqpath:n/a Error Path:/solr/overseer Error:KeeperErrorCode = NodeExists for /solr/overseer
[junit4:junit4]   2> 4700 T1697 oazs.PrepRequestProcessor.pRequest Got user-level KeeperException when processing sessionid:0x139e49457390004 type:create cxid:0x2 zxid:0xfffffffffffffffe txntype:unknown reqpath:n/a Error Path:/solr/overseer Error:KeeperErrorCode = NodeExists for /solr/overseer
[junit4:junit4]   2> 4708 T1692 oasc.ZkController.createEphemeralLiveNode Register node as live in ZooKeeper:/live_nodes/127.0.0.1:56201_solr
[junit4:junit4]   2> 4709 T1697 oazs.PrepRequestProcessor.pRequest Got user-level KeeperException when processing sessionid:0x139e49457390004 type:delete cxid:0x4 zxid:0xfffffffffffffffe txntype:unknown reqpath:n/a Error Path:/solr/live_nodes/127.0.0.1:56201_solr Error:KeeperErrorCode = NoNode for /solr/live_nodes/127.0.0.1:56201_solr
[junit4:junit4]   2> 4716 T1692 oascc.SolrZkClient.makePath makePath: /live_nodes/127.0.0.1:56201_solr
[junit4:junit4]   2> 4726 T1712 oascc.ZkStateReader$3.process Updating live nodes
[junit4:junit4]   2> 4726 T1726 oascc.ZkStateReader$3.process Updating live nodes
[junit4:junit4]   2> 4727 T1692 oashc.HttpShardHandlerFactory.getParameter Setting socketTimeout to: 0
[junit4:junit4]   2> 4728 T1692 oashc.HttpShardHandlerFactory.getParameter Setting urlScheme to: http://
[junit4:junit4]   2> 4728 T1692 oashc.HttpShardHandlerFactory.getParameter Setting connTimeout to: 0
[junit4:junit4]   2> 4728 T1692 oashc.HttpShardHandlerFactory.getParameter Setting maxConnectionsPerHost to: 20
[junit4:junit4]   2> 4728 T1692 oashc.HttpShardHandlerFactory.getParameter Setting corePoolSize to: 0
[junit4:junit4]   2> 4729 T1692 oashc.HttpShardHandlerFactory.getParameter Setting maximumPoolSize to: 2147483647
[junit4:junit4]   2> 4729 T1692 oashc.HttpShardHandlerFactory.getParameter Setting maxThreadIdleTime to: 5
[junit4:junit4]   2> 4729 T1692 oashc.HttpShardHandlerFactory.getParameter Setting sizeOfQueue to: -1
[junit4:junit4]   2> 4730 T1692 oashc.HttpShardHandlerFactory.getParameter Setting fairnessPolicy to: false
[junit4:junit4]   2> 4730 T1692 oascsi.HttpClientUtil.createClient Creating new http client, config:maxConnectionsPerHost=20&maxConnections=10000&socketTimeout=0&connTimeout=0&retry=false
[junit4:junit4]   2> 4750 T1692 oascc.ZkStateReader.createClusterStateWatchersAndUpdate Updating cluster state from ZooKeeper... 
[junit4:junit4]   2> 4755 T1692 oasc.CoreContainer.create Creating SolrCore 'collection1' using instanceDir: /usr/home/hudson/hudson-slave/workspace/Lucene-Solr-NightlyTests-4.x/solr/build/solr-core/test/J1/./solrtest-jetty2-1348159695050/collection1
[junit4:junit4]   2> 4755 T1692 oasc.ZkController.createCollectionZkNode Check for collection zkNode:collection1
[junit4:junit4]   2> 4756 T1692 oasc.ZkController.createCollectionZkNode Collection zkNode exists
[junit4:junit4]   2> 4756 T1692 oasc.ZkController.readConfigName Load collection config from:/collections/collection1
[junit4:junit4]   2> 4757 T1692 oasc.SolrResourceLoader.<init> new SolrResourceLoader for directory: '/usr/home/hudson/hudson-slave/workspace/Lucene-Solr-NightlyTests-4.x/solr/build/solr-core/test/J1/./solrtest-jetty2-1348159695050/collection1/'
[junit4:junit4]   2> 4758 T1692 oasc.SolrResourceLoader.replaceClassLoader Adding 'file:/usr/home/hudson/hudson-slave/workspace/Lucene-Solr-NightlyTests-4.x/solr/build/solr-core/test/J1/solrtest-jetty2-1348159695050/collection1/lib/classes/' to classloader
[junit4:junit4]   2> 4759 T1692 oasc.SolrResourceLoader.replaceClassLoader Adding 'file:/usr/home/hudson/hudson-slave/workspace/Lucene-Solr-NightlyTests-4.x/solr/build/solr-core/test/J1/solrtest-jetty2-1348159695050/collection1/lib/README' to classloader
[junit4:junit4]   2> 4796 T1692 oasc.SolrConfig.<init> Using Lucene MatchVersion: LUCENE_40
[junit4:junit4]   2> 4850 T1692 oasc.SolrConfig.<init> Loaded SolrConfig: solrconfig.xml
[junit4:junit4]   2> 4951 T1692 oass.IndexSchema.readSchema Reading Solr Schema
[junit4:junit4]   2> 4956 T1692 oass.IndexSchema.readSchema Schema name=test
[junit4:junit4]   2> 4981 T1713 oascc.ZkStateReader.updateClusterState Updating cloud state from ZooKeeper... 
[junit4:junit4]   2> 4999 T1712 oascc.ZkStateReader$2.process A cluster state change has occurred - updating...
[junit4:junit4]   2> 4999 T1726 oascc.ZkStateReader$2.process A cluster state change has occurred - updating...
[junit4:junit4]   2> 4999 T1738 oascc.ZkStateReader$2.process A cluster state change has occurred - updating...
[junit4:junit4]   2> 5396 T1692 oass.OpenExchangeRatesOrgProvider.init Initialized with rates=open-exchange-rates.json, refreshInterval=1440.
[junit4:junit4]   2> 5409 T1692 oass.IndexSchema.readSchema default search field in schema is text
[junit4:junit4]   2> 5414 T1692 oass.IndexSchema.readSchema unique key field: id
[junit4:junit4]   2> 5428 T1692 oass.FileExchangeRateProvider.reload Reloading exchange rates from file currency.xml
[junit4:junit4]   2> 5434 T1692 oass.FileExchangeRateProvider.reload Reloading exchange rates from file currency.xml
[junit4:junit4]   2> 5440 T1692 oass.OpenExchangeRatesOrgProvider.reload Reloading exchange rates from open-exchange-rates.json
[junit4:junit4]   2> 5441 T1692 oass.OpenExchangeRatesOrgProvider.reload Reloading exchange rates from open-exchange-rates.json
[junit4:junit4]   2> 5443 T1692 oasc.SolrCore.<init> [collection1] Opening new SolrCore at /usr/home/hudson/hudson-slave/workspace/Lucene-Solr-NightlyTests-4.x/solr/build/solr-core/test/J1/./solrtest-jetty2-1348159695050/collection1/, dataDir=./org.apache.solr.cloud.BasicDistributedZk2Test-1348159690546/jetty2/
[junit4:junit4]   2> 5443 T1692 oasc.JmxMonitoredMap.<init> JMX monitoring is enabled. Adding Solr mbeans to JMX Server: com.sun.jmx.mbeanserver.JmxMBeanServer@402fb002
[junit4:junit4]   2> 5445 T1692 oasc.SolrCore.getNewIndexDir WARNING New index directory detected: old=null new=./org.apache.solr.cloud.BasicDistributedZk2Test-1348159690546/jetty2/index/
[junit4:junit4]   2> 5446 T1692 oasc.SolrCore.initIndex WARNING [collection1] Solr index directory './org.apache.solr.cloud.BasicDistributedZk2Test-1348159690546/jetty2/index' doesn't exist. Creating new index...
[junit4:junit4]   2> 5447 T1692 oasc.CachingDirectoryFactory.get return new directory for /usr/home/hudson/hudson-slave/workspace/Lucene-Solr-NightlyTests-4.x/solr/build/solr-core/test/J1/./org.apache.solr.cloud.BasicDistributedZk2Test-1348159690546/jetty2/index forceNew:false
[junit4:junit4]   2> 5465 T1692 oasc.SolrDeletionPolicy.onCommit SolrDeletionPolicy.onCommit: commits:num=1
[junit4:junit4]   2> 		commit{dir=NRTCachingDirectory(org.apache.lucene.store.NIOFSDirectory@/usr/home/hudson/hudson-slave/workspace/Lucene-Solr-NightlyTests-4.x/solr/build/solr-core/test/J1/org.apache.solr.cloud.BasicDistributedZk2Test-1348159690546/jetty2/index lockFactory=org.apache.lucene.store.NativeFSLockFactory@16452e85; maxCacheMB=48.0 maxMergeSizeMB=4.0),segFN=segments_1,generation=1,filenames=[segments_1]
[junit4:junit4]   2> 5465 T1692 oasc.SolrDeletionPolicy.updateCommits newest commit = 1
[junit4:junit4]   2> 5467 T1692 oasc.SolrCore.initWriters created xml: solr.XMLResponseWriter
[junit4:junit4]   2> 5469 T1692 oasup.UpdateRequestProcessorChain.init inserting DistributedUpdateProcessorFactory into updateRequestProcessorChain "dedupe"
[junit4:junit4]   2> 5470 T1692 oasup.UpdateRequestProcessorChain.init inserting DistributedUpdateProcessorFactory into updateRequestProcessorChain "dedupe-allfields"
[junit4:junit4]   2> 5470 T1692 oasup.UpdateRequestProcessorChain.init inserting DistributedUpdateProcessorFactory into updateRequestProcessorChain "stored_sig"
[junit4:junit4]   2> 5471 T1692 oasup.UpdateRequestProcessorChain.init inserting DistributedUpdateProcessorFactory into updateRequestProcessorChain "uniq-fields"
[junit4:junit4]   2> 5472 T1692 oasup.UpdateRequestProcessorChain.init inserting DistributedUpdateProcessorFactory into updateRequestProcessorChain "distrib-dup-test-chain-implicit"
[junit4:junit4]   2> 5472 T1692 oasc.RequestHandlers.initHandlersFromConfig adding lazy requestHandler: solr.ReplicationHandler
[junit4:junit4]   2> 5473 T1692 oasc.RequestHandlers.initHandlersFromConfig created /replication: solr.ReplicationHandler
[junit4:junit4]   2> 5474 T1692 oasc.RequestHandlers.initHandlersFromConfig created standard: solr.StandardRequestHandler
[junit4:junit4]   2> 5474 T1692 oasc.RequestHandlers.initHandlersFromConfig created /get: solr.RealTimeGetHandler
[junit4:junit4]   2> 5475 T1692 oasc.RequestHandlers.initHandlersFromConfig created dismax: solr.SearchHandler
[junit4:junit4]   2> 5476 T1692 oasc.RequestHandlers.initHandlersFromConfig created mock: org.apache.solr.core.MockQuerySenderListenerReqHandler
[junit4:junit4]   2> 5477 T1692 oasc.RequestHandlers.initHandlersFromConfig created /admin/: org.apache.solr.handler.admin.AdminHandlers
[junit4:junit4]   2> 5477 T1692 oasc.RequestHandlers.initHandlersFromConfig created defaults: solr.StandardRequestHandler
[junit4:junit4]   2> 5478 T1692 oasc.RequestHandlers.initHandlersFromConfig adding lazy requestHandler: solr.StandardRequestHandler
[junit4:junit4]   2> 5478 T1692 oasc.RequestHandlers.initHandlersFromConfig created lazy: solr.StandardRequestHandler
[junit4:junit4]   2> 5479 T1692 oasc.RequestHandlers.initHandlersFromConfig created /update: solr.UpdateRequestHandler
[junit4:junit4]   2> 5480 T1692 oasc.RequestHandlers.initHandlersFromConfig created /terms: org.apache.solr.handler.component.SearchHandler
[junit4:junit4]   2> 5481 T1692 oasc.RequestHandlers.initHandlersFromConfig created spellCheckCompRH: org.apache.solr.handler.component.SearchHandler
[junit4:junit4]   2> 5481 T1692 oasc.RequestHandlers.initHandlersFromConfig created spellCheckCompRH_Direct: org.apache.solr.handler.component.SearchHandler
[junit4:junit4]   2> 5482 T1692 oasc.RequestHandlers.initHandlersFromConfig created spellCheckWithWordbreak: org.apache.solr.handler.component.SearchHandler
[junit4:junit4]   2> 5483 T1692 oasc.RequestHandlers.initHandlersFromConfig created spellCheckWithWordbreak_Direct: org.apache.solr.handler.component.SearchHandler
[junit4:junit4]   2> 5483 T1692 oasc.RequestHandlers.initHandlersFromConfig created spellCheckCompRH1: org.apache.solr.handler.component.SearchHandler
[junit4:junit4]   2> 5484 T1692 oasc.RequestHandlers.initHandlersFromConfig created tvrh: org.apache.solr.handler.component.SearchHandler
[junit4:junit4]   2> 5485 T1692 oasc.RequestHandlers.initHandlersFromConfig created /mlt: solr.MoreLikeThisHandler
[junit4:junit4]   2> 5486 T1692 oasc.RequestHandlers.initHandlersFromConfig created /debug/dump: solr.DumpRequestHandler
[junit4:junit4]   2> 5489 T1692 oashl.XMLLoader.init xsltCacheLifetimeSeconds=60
[junit4:junit4]   2> 5495 T1692 oasc.SolrCore.initDeprecatedSupport WARNING solrconfig.xml uses deprecated <admin/gettableFiles>, Please update your config to use the ShowFileRequestHandler.
[junit4:junit4]   2> 5496 T1692 oasc.SolrCore.initDeprecatedSupport WARNING adding ShowFileRequestHandler with hidden files: [SCHEMA.XML, OLD_SYNONYMS.TXT, STOPWORDS.TXT, PROTWORDS.TXT, OPEN-EXCHANGE-RATES.JSON, SYNONYMS.TXT, CURRENCY.XML, MAPPING-ISOLATIN1ACCENT.TXT]
[junit4:junit4]   2> 5500 T1692 oass.SolrIndexSearcher.<init> Opening Searcher@43ccb601 main
[junit4:junit4]   2> 5501 T1692 oasu.CommitTracker.<init> Hard AutoCommit: disabled
[junit4:junit4]   2> 5502 T1692 oasu.CommitTracker.<init> Soft AutoCommit: disabled
[junit4:junit4]   2> 5503 T1692 oashc.SpellCheckComponent.inform Initializing spell checkers
[junit4:junit4]   2> 5524 T1692 oass.DirectSolrSpellChecker.init init: {name=direct,classname=DirectSolrSpellChecker,field=lowerfilt,minQueryLength=3}
[junit4:junit4]   2> 5609 T1739 oasc.SolrCore.registerSearcher [collection1] Registered new searcher Searcher@43ccb601 main{StandardDirectoryReader(segments_1:1)}
[junit4:junit4]   2> 6008 T1713 oascc.ZkStateReader.updateClusterState Updating cloud state from ZooKeeper... 
[junit4:junit4]   2> 6028 T1712 oascc.ZkStateReader$2.process A cluster state change has occurred - updating...
[junit4:junit4]   2> 6028 T1738 oascc.ZkStateReader$2.process A cluster state change has occurred - updating...
[junit4:junit4]   2> 6028 T1726 oascc.ZkStateReader$2.process A cluster state change has occurred - updating...
[junit4:junit4]   2> 6117 T1692 oasc.CoreContainer.register registering core: collection1
[junit4:junit4]   2> 6117 T1692 oasc.ZkController.register Register shard - core:collection1 address:http://127.0.0.1:56201/solr shardId:shard2
[junit4:junit4]   2> 6119 T1692 oascc.SolrZkClient.makePath makePath: /collections/collection1/leader_elect/shard2/election
[junit4:junit4]   2> 6142 T1697 oazs.PrepRequestProcessor.pRequest Got user-level KeeperException when processing sessionid:0x139e49457390004 type:delete cxid:0x42 zxid:0xfffffffffffffffe txntype:unknown reqpath:n/a Error Path:/solr/collections/collection1/leaders/shard2 Error:KeeperErrorCode = NoNode for /solr/collections/collection1/leaders/shard2
[junit4:junit4]   2> 6145 T1692 oasc.ShardLeaderElectionContext.runLeaderProcess Running the leader process.
[junit4:junit4]   2> 6147 T1697 oazs.PrepRequestProcessor.pRequest Got user-level KeeperException when processing sessionid:0x139e49457390004 type:create cxid:0x43 zxid:0xfffffffffffffffe txntype:unknown reqpath:n/a Error Path:/solr/overseer Error:KeeperErrorCode = NodeExists for /solr/overseer
[junit4:junit4]   2> 6150 T1692 oasc.ShardLeaderElectionContext.waitForReplicasToComeUp Enough replicas found to continue.
[junit4:junit4]   2> 6150 T1692 oasc.ShardLeaderElectionContext.runLeaderProcess I may be the new leader - try and sync
[junit4:junit4]   2> 6151 T1692 oasc.SyncStrategy.sync Sync replicas to http://127.0.0.1:56201/solr/collection1/
[junit4:junit4]   2> 6151 T1692 oasc.SyncStrategy.syncReplicas Sync Success - now sync replicas to me
[junit4:junit4]   2> 6152 T1692 oasc.SyncStrategy.syncToMe http://127.0.0.1:56201/solr/collection1/ has no replicas
[junit4:junit4]   2> 6152 T1692 oasc.ShardLeaderElectionContext.runLeaderProcess I am the new leader: http://127.0.0.1:56201/solr/collection1/
[junit4:junit4]   2> 6153 T1692 oascc.SolrZkClient.makePath makePath: /collections/collection1/leaders/shard2
[junit4:junit4]   2> 6157 T1697 oazs.PrepRequestProcessor.pRequest Got user-level KeeperException when processing sessionid:0x139e49457390004 type:create cxid:0x4c zxid:0xfffffffffffffffe txntype:unknown reqpath:n/a Error Path:/solr/overseer Error:KeeperErrorCode = NodeExists for /solr/overseer
[junit4:junit4]   2> 6535 T1713 oascc.ZkStateReader.updateClusterState Updating cloud state from ZooKeeper... 
[junit4:junit4]   2> 6573 T1712 oascc.ZkStateReader$2.process A cluster state change has occurred - updating...
[junit4:junit4]   2> 6573 T1726 oascc.ZkStateReader$2.process A cluster state change has occurred - updating...
[junit4:junit4]   2> 6573 T1738 oascc.ZkStateReader$2.process A cluster state change has occurred - updating...
[junit4:junit4]   2> 6576 T1692 oasc.ZkController.register We are http://127.0.0.1:56201/solr/collection1/ and leader is http://127.0.0.1:56201/solr/collection1/
[junit4:junit4]   2> 6576 T1692 oasc.ZkController.register No LogReplay needed for core=collection1 baseURL=http://127.0.0.1:56201/solr
[junit4:junit4]   2> 6576 T1692 oasc.ZkController.checkRecovery I am the leader, no recovery necessary
[junit4:junit4]   2> 6583 T1692 oascc.ZkStateReader.updateClusterState Updating cloud state from ZooKeeper... 
[junit4:junit4]   2> 6584 T1692 oass.SolrDispatchFilter.init user.dir=/usr/home/hudson/hudson-slave/workspace/Lucene-Solr-NightlyTests-4.x/solr/build/solr-core/test/J1
[junit4:junit4]   2> 6584 T1692 oass.SolrDispatchFilter.init SolrDispatchFilter.init() done
[junit4:junit4]   2> 6584 T1692 oascsi.HttpClientUtil.createClient Creating new http client, config:maxConnections=128&maxConnectionsPerHost=32&followRedirects=false
[junit4:junit4]   2> 6719 T1692 oejs.Server.doStart jetty-8.1.2.v20120308
[junit4:junit4]   2> 6721 T1692 oejs.AbstractConnector.doStart Started SocketConnector@0.0.0.0:56205
[junit4:junit4]   2> 6722 T1692 oasc.SolrResourceLoader.locateSolrHome JNDI not configured for solr (NoInitialContextEx)
[junit4:junit4]   2> 6722 T1692 oasc.SolrResourceLoader.locateSolrHome using system property solr.solr.home: /usr/home/hudson/hudson-slave/workspace/Lucene-Solr-NightlyTests-4.x/solr/build/solr-core/test/J1/./solrtest-jetty3-1348159697139
[junit4:junit4]   2> 6723 T1692 oasc.SolrResourceLoader.<init> new SolrResourceLoader for deduced Solr Home: '/usr/home/hudson/hudson-slave/workspace/Lucene-Solr-NightlyTests-4.x/solr/build/solr-core/test/J1/./solrtest-jetty3-1348159697139/'
[junit4:junit4]   2> 6751 T1692 oass.SolrDispatchFilter.init SolrDispatchFilter.init()
[junit4:junit4]   2> 6751 T1692 oasc.SolrResourceLoader.locateSolrHome JNDI not configured for solr (NoInitialContextEx)
[junit4:junit4]   2> 6752 T1692 oasc.SolrResourceLoader.locateSolrHome using system property solr.solr.home: /usr/home/hudson/hudson-slave/workspace/Lucene-Solr-NightlyTests-4.x/solr/build/solr-core/test/J1/./solrtest-jetty3-1348159697139
[junit4:junit4]   2> 6752 T1692 oasc.CoreContainer$Initializer.initialize looking for solr.xml: /usr/home/hudson/hudson-slave/workspace/Lucene-Solr-NightlyTests-4.x/solr/build/solr-core/test/J1/./solrtest-jetty3-1348159697139/solr.xml
[junit4:junit4]   2> 6752 T1692 oasc.CoreContainer.<init> New CoreContainer 1011053326
[junit4:junit4]   2> 6753 T1692 oasc.CoreContainer.load Loading CoreContainer using Solr Home: '/usr/home/hudson/hudson-slave/workspace/Lucene-Solr-NightlyTests-4.x/solr/build/solr-core/test/J1/./solrtest-jetty3-1348159697139/'
[junit4:junit4]   2> 6753 T1692 oasc.SolrResourceLoader.<init> new SolrResourceLoader for directory: '/usr/home/hudson/hudson-slave/workspace/Lucene-Solr-NightlyTests-4.x/solr/build/solr-core/test/J1/./solrtest-jetty3-1348159697139/'
[junit4:junit4]   2> 6771 T1692 oasc.CoreContainer.load Registering Log Listener
[junit4:junit4]   2> 6782 T1692 oasc.CoreContainer.initZooKeeper Zookeeper client=127.0.0.1:56190/solr
[junit4:junit4]   2> 6782 T1692 oaz.ZooKeeper.<init> Initiating client connection, connectString=127.0.0.1:56190/solr sessionTimeout=5000 watcher=org.apache.solr.common.cloud.ConnectionManager@1931c714
[junit4:junit4]   2> 6783 T1692 oascc.ConnectionManager.waitForConnected Waiting for client to connect to ZooKeeper
[junit4:junit4]   2> 6783 T1749 oaz.ClientCnxn$SendThread.startConnect Opening socket connection to server /127.0.0.1:56190
[junit4:junit4]   2> 6785 T1749 oaz.ClientCnxn$SendThread.primeConnection Socket connection established to localhost/127.0.0.1:56190, initiating session
[junit4:junit4]   2> 6785 T1694 oazs.NIOServerCnxn$Factory.run Accepted socket connection from /140.211.11.196:56206
[junit4:junit4]   2> 6786 T1694 oazs.NIOServerCnxn.readConnectRequest Client attempting to establish new session at /140.211.11.196:56206
[junit4:junit4]   2> 6792 T1696 oazs.NIOServerCnxn.finishSessionInit Established session 0x139e49457390005 with negotiated timeout 5000 for client /140.211.11.196:56206
[junit4:junit4]   2> 6792 T1749 oaz.ClientCnxn$SendThread.readConnectResult Session establishment complete on server localhost/127.0.0.1:56190, sessionid = 0x139e49457390005, negotiated timeout = 5000
[junit4:junit4]   2> 6792 T1750 oascc.ConnectionManager.process Watcher org.apache.solr.common.cloud.ConnectionManager@1931c714 name:ZooKeeperConnection Watcher:127.0.0.1:56190/solr got event WatchedEvent state:SyncConnected type:None path:null path:null type:None
[junit4:junit4]   2> 6793 T1692 oascc.ConnectionManager.waitForConnected Client is connected to ZooKeeper
[junit4:junit4]   2> 6794 T1697 oazs.PrepRequestProcessor.pRequest Got user-level KeeperException when processing sessionid:0x139e49457390005 type:create cxid:0x1 zxid:0xfffffffffffffffe txntype:unknown reqpath:n/a Error Path:/solr/overseer Error:KeeperErrorCode = NodeExists for /solr/overseer
[junit4:junit4]   2> 6799 T1697 oazs.PrepRequestProcessor.pRequest Got user-level KeeperException when processing sessionid:0x139e49457390005 type:create cxid:0x2 zxid:0xfffffffffffffffe txntype:unknown reqpath:n/a Error Path:/solr/overseer Error:KeeperErrorCode = NodeExists for /solr/overseer
[junit4:junit4]   2> 6810 T1692 oasc.ZkController.createEphemeralLiveNode Register node as live in ZooKeeper:/live_nodes/127.0.0.1:56205_solr
[junit4:junit4]   2> 6810 T1697 oazs.PrepRequestProcessor.pRequest Got user-level KeeperException when processing sessionid:0x139e49457390005 type:delete cxid:0x4 zxid:0xfffffffffffffffe txntype:unknown reqpath:n/a Error Path:/solr/live_nodes/127.0.0.1:56205_solr Error:KeeperErrorCode = NoNode for /solr/live_nodes/127.0.0.1:56205_solr
[junit4:junit4]   2> 6822 T1692 oascc.SolrZkClient.makePath makePath: /live_nodes/127.0.0.1:56205_solr
[junit4:junit4]   2> 6825 T1712 oascc.ZkStateReader$3.process Updating live nodes
[junit4:junit4]   2> 6825 T1738 oascc.ZkStateReader$3.process Updating live nodes
[junit4:junit4]   2> 6825 T1726 oascc.ZkStateReader$3.process Updating live nodes
[junit4:junit4]   2> 6826 T1692 oashc.HttpShardHandlerFactory.getParameter Setting socketTimeout to: 0
[junit4:junit4]   2> 6827 T1692 oashc.HttpShardHandlerFactory.getParameter Setting urlScheme to: http://
[junit4:junit4]   2> 6827 T1692 oashc.HttpShardHandlerFactory.getParameter Setting connTimeout to: 0
[junit4:junit4]   2> 6828 T1692 oashc.HttpShardHandlerFactory.getParameter Setting maxConnectionsPerHost to: 20
[junit4:junit4]   2> 6828 T1692 oashc.HttpShardHandlerFactory.getParameter Setting corePoolSize to: 0
[junit4:junit4]   2> 6829 T1692 oashc.HttpShardHandlerFactory.getParameter Setting maximumPoolSize to: 2147483647
[junit4:junit4]   2> 6829 T1692 oashc.HttpShardHandlerFactory.getParameter Setting maxThreadIdleTime to: 5
[junit4:junit4]   2> 6830 T1692 oashc.HttpShardHandlerFactory.getParameter Setting sizeOfQueue to: -1
[junit4:junit4]   2> 6830 T1692 oashc.HttpShardHandlerFactory.getParameter Setting fairnessPolicy to: false
[junit4:junit4]   2> 6831 T1692 oascsi.HttpClientUtil.createClient Creating new http client, config:maxConnectionsPerHost=20&maxConnections=10000&socketTimeout=0&connTimeout=0&retry=false
[junit4:junit4]   2> 6854 T1692 oascc.ZkStateReader.createClusterStateWatchersAndUpdate Updating cluster state from ZooKeeper... 
[junit4:junit4]   2> 6861 T1692 oasc.CoreContainer.create Creating SolrCore 'collection1' using instanceDir: /usr/home/hudson/hudson-slave/workspace/Lucene-Solr-NightlyTests-4.x/solr/build/solr-core/test/J1/./solrtest-jetty3-1348159697139/collection1
[junit4:junit4]   2> 6862 T1692 oasc.ZkController.createCollectionZkNode Check for collection zkNode:collection1
[junit4:junit4]   2> 6863 T1692 oasc.ZkController.createCollectionZkNode Collection zkNode exists
[junit4:junit4]   2> 6864 T1692 oasc.ZkController.readConfigName Load collection config from:/collections/collection1
[junit4:junit4]   2> 6865 T1692 oasc.SolrResourceLoader.<init> new SolrResourceLoader for directory: '/usr/home/hudson/hudson-slave/workspace/Lucene-Solr-NightlyTests-4.x/solr/build/solr-core/test/J1/./solrtest-jetty3-1348159697139/collection1/'
[junit4:junit4]   2> 6867 T1692 oasc.SolrResourceLoader.replaceClassLoader Adding 'file:/usr/home/hudson/hudson-slave/workspace/Lucene-Solr-NightlyTests-4.x/solr/build/solr-core/test/J1/solrtest-jetty3-1348159697139/collection1/lib/classes/' to classloader
[junit4:junit4]   2> 6868 T1692 oasc.SolrResourceLoader.replaceClassLoader Adding 'file:/usr/home/hudson/hudson-slave/workspace/Lucene-Solr-NightlyTests-4.x/solr/build/solr-core/test/J1/solrtest-jetty3-1348159697139/collection1/lib/README' to classloader
[junit4:junit4]   2> 6919 T1692 oasc.SolrConfig.<init> Using Lucene MatchVersion: LUCENE_40
[junit4:junit4]   2> 6971 T1692 oasc.SolrConfig.<init> Loaded SolrConfig: solrconfig.xml
[junit4:junit4]   2> 7072 T1692 oass.IndexSchema.readSchema Reading Solr Schema
[junit4:junit4]   2> 7076 T1692 oass.IndexSchema.readSchema Schema name=test
[junit4:junit4]   2> 7079 T1713 oascc.ZkStateReader.updateClusterState Updating cloud state from ZooKeeper... 
[junit4:junit4]   2> 7097 T1712 oascc.ZkStateReader$2.process A cluster state change has occurred - updating...
[junit4:junit4]   2> 7097 T1750 oascc.ZkStateReader$2.process A cluster state change has occurred - updating...
[junit4:junit4]   2> 7097 T1726 oascc.ZkStateReader$2.process A cluster state change has occurred - updating...
[junit4:junit4]   2> 7097 T1738 oascc.ZkStateReader$2.process A cluster state change has occurred - updating...
[junit4:junit4]   2> 7511 T1692 oass.OpenExchangeRatesOrgProvider.init Initialized with rates=open-exchange-rates.json, refreshInterval=1440.
[junit4:junit4]   2> 7519 T1692 oass.IndexSchema.readSchema default search field in schema is text
[junit4:junit4]   2> 7522 T1692 oass.IndexSchema.readSchema unique key field: id
[junit4:junit4]   2> 7533 T1692 oass.FileExchangeRateProvider.reload Reloading exchange rates from file currency.xml
[junit4:junit4]   2> 7537 T1692 oass.FileExchangeRateProvider.reload Reloading exchange rates from file currency.xml
[junit4:junit4]   2> 7542 T1692 oass.OpenExchangeRatesOrgProvider.reload Reloading exchange rates from open-exchange-rates.json
[junit4:junit4]   2> 7543 T1692 oass.OpenExchangeRatesOrgProvider.reload Reloading exchange rates from open-exchange-rates.json
[junit4:junit4]   2> 7544 T1692 oasc.SolrCore.<init> [collection1] Opening new SolrCore at /usr/home/hudson/hudson-slave/workspace/Lucene-Solr-NightlyTests-4.x/solr/build/solr-core/test/J1/./solrtest-jetty3-1348159697139/collection1/, dataDir=./org.apache.solr.cloud.BasicDistributedZk2Test-1348159690546/jetty3/
[junit4:junit4]   2> 7544 T1692 oasc.JmxMonitoredMap.<init> JMX monitoring is enabled. Adding Solr mbeans to JMX Server: com.sun.jmx.mbeanserver.JmxMBeanServer@402fb002
[junit4:junit4]   2> 7545 T1692 oasc.SolrCore.getNewIndexDir WARNING New index directory detected: old=null new=./org.apache.solr.cloud.BasicDistributedZk2Test-1348159690546/jetty3/index/
[junit4:junit4]   2> 7546 T1692 oasc.SolrCore.initIndex WARNING [collection1] Solr index directory './org.apache.solr.cloud.BasicDistributedZk2Test-1348159690546/jetty3/index' doesn't exist. Creating new index...
[junit4:junit4]   2> 7547 T1692 oasc.CachingDirectoryFactory.get return new directory for /usr/home/hudson/hudson-slave/workspace/Lucene-Solr-NightlyTests-4.x/solr/build/solr-core/test/J1/./org.apache.solr.cloud.BasicDistributedZk2Test-1348159690546/jetty3/index forceNew:false
[junit4:junit4]   2> 7572 T1692 oasc.SolrDeletionPolicy.onCommit SolrDeletionPolicy.onCommit: commits:num=1
[junit4:junit4]   2> 		commit{dir=NRTCachingDirectory(org.apache.lucene.store.NIOFSDirectory@/usr/home/hudson/hudson-slave/workspace/Lucene-Solr-NightlyTests-4.x/solr/build/solr-core/test/J1/org.apache.solr.cloud.BasicDistributedZk2Test-1348159690546/jetty3/index lockFactory=org.apache.lucene.store.NativeFSLockFactory@70f52030; maxCacheMB=48.0 maxMergeSizeMB=4.0),segFN=segments_1,generation=1,filenames=[segments_1]
[junit4:junit4]   2> 7573 T1692 oasc.SolrDeletionPolicy.updateCommits newest commit = 1
[junit4:junit4]   2> 7574 T1692 oasc.SolrCore.initWriters created xml: solr.XMLResponseWriter
[junit4:junit4]   2> 7576 T1692 oasup.UpdateRequestProcessorChain.init inserting DistributedUpdateProcessorFactory into updateRequestProcessorChain "dedupe"
[junit4:junit4]   2> 7581 T1692 oasup.UpdateRequestProcessorChain.init inserting DistributedUpdateProcessorFactory into updateRequestProcessorChain "dedupe-allfields"
[junit4:junit4]   2> 7583 T1692 oasup.UpdateRequestProcessorChain.init inserting DistributedUpdateProcessorFactory into updateRequestProcessorChain "stored_sig"
[junit4:junit4]   2> 7583 T1692 oasup.UpdateRequestProcessorChain.init inserting DistributedUpdateProcessorFactory into updateRequestProcessorChain "uniq-fields"
[junit4:junit4]   2> 7588 T1692 oasup.UpdateRequestProcessorChain.init inserting DistributedUpdateProcessorFactory into updateRequestProcessorChain "distrib-dup-test-chain-implicit"
[junit4:junit4]   2> 7589 T1692 oasc.RequestHandlers.initHandlersFromConfig adding lazy requestHandler: solr.ReplicationHandler
[junit4:junit4]   2> 7590 T1692 oasc.RequestHandlers.initHandlersFromConfig created /replication: solr.ReplicationHandler
[junit4:junit4]   2> 7591 T1692 oasc.RequestHandlers.initHandlersFromConfig created standard: solr.StandardRequestHandler
[junit4:junit4]   2> 7591 T1692 oasc.RequestHandlers.initHandlersFromConfig created /get: solr.RealTimeGetHandler
[junit4:junit4]   2> 7592 T1692 oasc.RequestHandlers.initHandlersFromConfig created dismax: solr.SearchHandler
[junit4:junit4]   2> 7592 T1692 oasc.RequestHandlers.initHandlersFromConfig created mock: org.apache.solr.core.MockQuerySenderListenerReqHandler
[junit4:junit4]   2> 7593 T1692 oasc.RequestHandlers.initHandlersFromConfig created /admin/: org.apache.solr.handler.admin.AdminHandlers
[junit4:junit4]   2> 7593 T1692 oasc.RequestHandlers.initHandlersFromConfig created defaults: solr.StandardRequestHandler
[junit4:junit4]   2> 7594 T1692 oasc.RequestHandlers.initHandlersFromConfig adding lazy requestHandler: solr.StandardRequestHandler
[junit4:junit4]   2> 7594 T1692 oasc.RequestHandlers.initHandlersFromConfig created lazy: solr.StandardRequestHandler
[junit4:junit4]   2> 7595 T1692 oasc.RequestHandlers.initHandlersFromConfig created /update: solr.UpdateRequestHandler
[junit4:junit4]   2> 7595 T1692 oasc.RequestHandlers.initHandlersFromConfig created /terms: org.apache.solr.handler.component.SearchHandler
[junit4:junit4]   2> 7596 T1692 oasc.RequestHandlers.initHandlersFromConfig created spellCheckCompRH: org.apache.solr.handler.component.SearchHandler
[junit4:junit4]   2> 7596 T1692 oasc.RequestHandlers.initHandlersFromConfig created spellCheckCompRH_Direct: org.apache.solr.handler.component.SearchHandler
[junit4:junit4]   2> 7597 T1692 oasc.RequestHandlers.initHandlersFromConfig created spellCheckWithWordbreak: org.apache.solr.handler.component.SearchHandler
[junit4:junit4]   2> 7597 T1692 oasc.RequestHandlers.initHandlersFromConfig created spellCheckWithWordbreak_Direct: org.apache.solr.handler.component.SearchHandler
[junit4:junit4]   2> 7597 T1692 oasc.RequestHandlers.initHandlersFromConfig created spellCheckCompRH1: org.apache.solr.handler.component.SearchHandler
[junit4:junit4]   2> 7598 T1692 oasc.RequestHandlers.initHandlersFromConfig created tvrh: org.apache.solr.handler.component.SearchHandler
[junit4:junit4]   2> 7598 T1692 oasc.RequestHandlers.initHandlersFromConfig created /mlt: solr.MoreLikeThisHandler
[junit4:junit4]   2> 7599 T1692 oasc.RequestHandlers.initHandlersFromConfig created /debug/dump: solr.DumpRequestHandler
[junit4:junit4]   2> 7601 T1692 oashl.XMLLoader.init xsltCacheLifetimeSeconds=60
[junit4:junit4]   2> 7605 T1692 oasc.SolrCore.initDeprecatedSupport WARNING solrconfig.xml uses deprecated <admin/gettableFiles>, Please update your config to use the ShowFileRequestHandler.
[junit4:junit4]   2> 7606 T1692 oasc.SolrCore.initDeprecatedSupport WARNING adding ShowFileRequestHandler with hidden files: [SCHEMA.XML, OLD_SYNONYMS.TXT, STOPWORDS.TXT, PROTWORDS.TXT, OPEN-EXCHANGE-RATES.JSON, SYNONYMS.TXT, CURRENCY.XML, MAPPING-ISOLATIN1ACCENT.TXT]
[junit4:junit4]   2> 7609 T1692 oass.SolrIndexSearcher.<init> Opening Searcher@add3d82 main
[junit4:junit4]   2> 7610 T1692 oasu.CommitTracker.<init> Hard AutoCommit: disabled
[junit4:junit4]   2> 7610 T1692 oasu.CommitTracker.<init> Soft AutoCommit: disabled
[junit4:junit4]   2> 7611 T1692 oashc.SpellCheckComponent.inform Initializing spell checkers
[junit4:junit4]   2> 7670 T1692 oass.DirectSolrSpellChecker.init init: {name=direct,classname=DirectSolrSpellChecker,field=lowerfilt,minQueryLength=3}
[junit4:junit4]   2> 7901 T1751 oasc.SolrCore.registerSearcher [collection1] Registered new searcher Searcher@add3d82 main{StandardDirectoryReader(segments_1:1)}
[junit4:junit4]   2> 8117 T1713 oascc.ZkStateReader.updateClusterState Updating cloud state from ZooKeeper... 
[junit4:junit4]   2> 8129 T1712 oascc.ZkStateReader$2.process A cluster state change has occurred - updating...
[junit4:junit4]   2> 8129 T1750 oascc.ZkStateReader$2.process A cluster state change has occurred - updating...
[junit4:junit4]   2> 8129 T1726 oascc.ZkStateReader$2.process A cluster state change has occurred - updating...
[junit4:junit4]   2> 8129 T1738 oascc.ZkStateReader$2.process A cluster state change has occurred - updating...
[junit4:junit4]   2> 8416 T1692 oasc.CoreContainer.register registering core: collection1
[junit4:junit4]   2> 8416 T1692 oasc.ZkController.register Register shard - core:collection1 address:http://127.0.0.1:56205/solr shardId:shard1
[junit4:junit4]   2> 8420 T1692 oasc.ZkController.register We are http://127.0.0.1:56205/solr/collection1/ and leader is http://127.0.0.1:56195/solr/collection1/
[junit4:junit4]   2> 8420 T1692 oasc.ZkController.register No LogReplay needed for core=collection1 baseURL=http://127.0.0.1:56205/solr
[junit4:junit4]   2> 8421 T1692 oasc.ZkController.checkRecovery Core needs to recover:collection1
[junit4:junit4]   2> 8421 T1692 oasu.DefaultSolrCoreState.doRecovery Running recovery - first canceling any ongoing recovery
[junit4:junit4]   2> ASYNC  NEW_CORE C127 name=collection1 org.apache.solr.core.SolrCore@666c5d67 url=http://127.0.0.1:56205/solr/collection1 node=127.0.0.1:56205_solr
[junit4:junit4]   2> 8422 T1752 C127 P56205 oasc.RecoveryStrategy.run Starting recovery process.  core=collection1 recoveringAfterStartup=true
[junit4:junit4]   2> 8422 T1752 C127 P56205 oasc.RecoveryStrategy.doRecovery ###### startupVersions=[]
[junit4:junit4]   2> 8422 T1692 oascc.ZkStateReader.updateClusterState Updating cloud state from ZooKeeper... 
[junit4:junit4]   2> 8423 T1752 C127 P56205 oasc.RecoveryStrategy.doRecovery Attempting to PeerSync from http://127.0.0.1:56195/solr/collection1/ core=collection1 - recoveringAfterStartup=true
[junit4:junit4]   2> 8423 T1752 C127 P56205 oasu.PeerSync.sync PeerSync: core=collection1 url=http://127.0.0.1:56205/solr START replicas=[http://127.0.0.1:56195/solr/collection1/] nUpdates=100
[junit4:junit4]   2> 8424 T1692 oass.SolrDispatchFilter.init user.dir=/usr/home/hudson/hudson-slave/workspace/Lucene-Solr-NightlyTests-4.x/solr/build/solr-core/test/J1
[junit4:junit4]   2> 8424 T1752 C127 P56205 oasu.PeerSync.sync WARNING no frame of reference to tell of we've missed updates
[junit4:junit4]   2> 8424 T1692 oass.SolrDispatchFilter.init SolrDispatchFilter.init() done
[junit4:junit4]   2> 8424 T1692 oascsi.HttpClientUtil.createClient Creating new http client, config:maxConnections=128&maxConnectionsPerHost=32&followRedirects=false
[junit4:junit4]   2> 8425 T1752 C127 P56205 oasc.RecoveryStrategy.doRecovery PeerSync Recovery was not successful - trying replication. core=collection1
[junit4:junit4]   2> 8425 T1752 C127 P56205 oasc.RecoveryStrategy.doRecovery Starting Replication Recovery. core=collection1
[junit4:junit4]   2> 8425 T1752 C127 P56205 oascsi.HttpClientUtil.createClient Creating new http client, config:maxConnections=128&maxConnectionsPerHost=32&followRedirects=false
[junit4:junit4]   2> ASYNC  NEW_CORE C128 name=collection1 org.apache.solr.core.SolrCore@3a6b22fa url=http://127.0.0.1:56195/solr/collection1 node=127.0.0.1:56195_solr
[junit4:junit4]   2> 8440 T1718 C128 P56195 REQ /get {distrib=false&qt=/get&wt=javabin&version=2&getVersions=100} status=0 QTime=0 
[junit4:junit4]   2> 8557 T1692 oejs.Server.doStart jetty-8.1.2.v20120308
[junit4:junit4]   2> 8560 T1692 oejs.AbstractConnector.doStart Started SocketConnector@0.0.0.0:56209
[junit4:junit4]   2> 8561 T1692 oasc.SolrResourceLoader.locateSolrHome JNDI not configured for solr (NoInitialContextEx)
[junit4:junit4]   2> 8561 T1692 oasc.SolrResourceLoader.locateSolrHome using system property solr.solr.home: /usr/home/hudson/hudson-slave/workspace/Lucene-Solr-NightlyTests-4.x/solr/build/solr-core/test/J1/./solrtest-jetty4-1348159698982
[junit4:junit4]   2> 8562 T1692 oasc.SolrResourceLoader.<init> new SolrResourceLoader for deduced Solr Home: '/usr/home/hudson/hudson-slave/workspace/Lucene-Solr-NightlyTests-4.x/solr/build/solr-core/test/J1/./solrtest-jetty4-1348159698982/'
[junit4:junit4]   2> 8587 T1692 oass.SolrDispatchFilter.init SolrDispatchFilter.init()
[junit4:junit4]   2> 8588 T1692 oasc.SolrResourceLoader.locateSolrHome JNDI not configured for solr (NoInitialContextEx)
[junit4:junit4]   2> 8588 T1692 oasc.SolrResourceLoader.locateSolrHome using system property solr.solr.home: /usr/home/hudson/hudson-slave/workspace/Lucene-Solr-NightlyTests-4.x/solr/build/solr-core/test/J1/./solrtest-jetty4-1348159698982
[junit4:junit4]   2> 8589 T1692 oasc.CoreContainer$Initializer.initialize looking for solr.xml: /usr/home/hudson/hudson-slave/workspace/Lucene-Solr-NightlyTests-4.x/solr/build/solr-core/test/J1/./solrtest-jetty4-1348159698982/solr.xml
[junit4:junit4]   2> 8589 T1692 oasc.CoreContainer.<init> New CoreContainer 782526567
[junit4:junit4]   2> 8589 T1692 oasc.CoreContainer.load Loading CoreContainer using Solr Home: '/usr/home/hudson/hudson-slave/workspace/Lucene-Solr-NightlyTests-4.x/solr/build/solr-core/test/J1/./solrtest-jetty4-1348159698982/'
[junit4:junit4]   2> 8590 T1692 oasc.SolrResourceLoader.<init> new SolrResourceLoader for directory: '/usr/home/hudson/hudson-slave/workspace/Lucene-Solr-NightlyTests-4.x/solr/build/solr-core/test/J1/./solrtest-jetty4-1348159698982/'
[junit4:junit4]   2> 8608 T1692 oasc.CoreContainer.load Registering Log Listener
[junit4:junit4]   2> 8619 T1692 oasc.CoreContainer.initZooKeeper Zookeeper client=127.0.0.1:56190/solr
[junit4:junit4]   2> 8620 T1692 oaz.ZooKeeper.<init> Initiating client connection, connectString=127.0.0.1:56190/solr sessionTimeout=5000 watcher=org.apache.solr.common.cloud.ConnectionManager@6460efa5
[junit4:junit4]   2> 8621 T1763 oaz.ClientCnxn$SendThread.startConnect Opening socket connection to server /127.0.0.1:56190
[junit4:junit4]   2> 8621 T1692 oascc.ConnectionManager.waitForConnected Waiting for client to connect to ZooKeeper
[junit4:junit4]   2> 8622 T1763 oaz.ClientCnxn$SendThread.primeConnection Socket connection established to localhost/127.0.0.1:56190, initiating session
[junit4:junit4]   2> 8622 T1694 oazs.NIOServerCnxn$Factory.run Accepted socket connection from /140.211.11.196:56210
[junit4:junit4]   2> 8623 T1694 oazs.NIOServerCnxn.readConnectRequest Client attempting to establish new session at /140.211.11.196:56210
[junit4:junit4]   2> 8635 T1696 oazs.NIOServerCnxn.finishSessionInit Established session 0x139e49457390006 with negotiated timeout 5000 for client /140.211.11.196:56210
[junit4:junit4]   2> 8635 T1763 oaz.ClientCnxn$SendThread.readConnectResult Session establishment complete on server localhost/127.0.0.1:56190, sessionid = 0x139e49457390006, negotiated timeout = 5000
[junit4:junit4]   2> 8636 T1764 oascc.ConnectionManager.process Watcher org.apache.solr.common.cloud.ConnectionManager@6460efa5 name:ZooKeeperConnection Watcher:127.0.0.1:56190/solr got event WatchedEvent state:SyncConnected type:None path:null path:null type:None
[junit4:junit4]   2> 8636 T1692 oascc.ConnectionManager.waitForConnected Client is connected to ZooKeeper
[junit4:junit4]   2> 8637 T1697 oazs.PrepRequestProcessor.pRequest Got user-level KeeperException when processing sessionid:0x139e49457390006 type:create cxid:0x1 zxid:0xfffffffffffffffe txntype:unknown reqpath:n/a Error Path:/solr/overseer Error:KeeperErrorCode = NodeExists for /solr/overseer
[junit4:junit4]   2> 8643 T1697 oazs.PrepRequestProcessor.pRequest Got user-level KeeperException when processing sessionid:0x139e49457390006 type:create cxid:0x2 zxid:0xfffffffffffffffe txntype:unknown reqpath:n/a Error Path:/solr/overseer Error:KeeperErrorCode = NodeExists for /solr/overseer
[junit4:junit4]   2> 8654 T1692 oasc.ZkController.createEphemeralLiveNode Register node as live in ZooKeeper:/live_nodes/127.0.0.1:56209_solr
[junit4:junit4]   2> 8654 T1713 oascc.ZkStateReader.updateClusterState Updating cloud state from ZooKeeper... 
[junit4:junit4]   2> 8655 T1697 oazs.PrepRequestProcessor.pRequest Got user-level KeeperException when processing sessionid:0x139e49457390006 type:delete cxid:0x4 zxid:0xfffffffffffffffe txntype:unknown reqpath:n/a Error Path:/solr/live_nodes/127.0.0.1:56209_solr Error:KeeperErrorCode = NoNode for /solr/live_nodes/127.0.0.1:56209_solr
[junit4:junit4]   2> 8661 T1692 oascc.SolrZkClient.makePath makePath: /live_nodes/127.0.0.1:56209_solr
[junit4:junit4]   2> 8679 T1738 oascc.ZkStateReader$3.process Updating live nodes
[junit4:junit4]   2> 8679 T1726 oascc.ZkStateReader$3.process Updating live nodes
[junit4:junit4]   2> 8679 T1712 oascc.ZkStateReader$3.process Updating live nodes
[junit4:junit4]   2> 8679 T1750 oascc.ZkStateReader$3.process Updating live nodes
[junit4:junit4]   2> 8687 T1692 oashc.HttpShardHandlerFactory.getParameter Setting socketTimeout to: 0
[junit4:junit4]   2> 8688 T1692 oashc.HttpShardHandlerFactory.getParameter Setting urlScheme to: http://
[junit4:junit4]   2> 8688 T1692 oashc.HttpShardHandlerFactory.getParameter Setting connTimeout to: 0
[junit4:junit4]   2> 8689 T1692 oashc.HttpShardHandlerFactory.getParameter Setting maxConnectionsPerHost to: 20
[junit4:junit4]   2> 8689 T1692 oashc.HttpShardHandlerFactory.getParameter Setting corePoolSize to: 0
[junit4:junit4]   2> 8689 T1692 oashc.HttpShardHandlerFactory.getParameter Setting maximumPoolSize to: 2147483647
[junit4:junit4]   2> 8689 T1692 oashc.HttpShardHandlerFactory.getParameter Setting maxThreadIdleTime to: 5
[junit4:junit4]   2> 8690 T1692 oashc.HttpShardHandlerFactory.getParameter Setting sizeOfQueue to: -1
[junit4:junit4]   2> 8690 T1692 oashc.HttpShardHandlerFactory.getParameter Setting fairnessPolicy to: false
[junit4:junit4]   2> 8690 T1692 oascsi.HttpClientUtil.createClient Creating new http client, config:maxConnectionsPerHost=20&maxConnections=10000&socketTimeout=0&connTimeout=0&retry=false
[junit4:junit4]   2> 8697 T1750 oascc.ZkStateReader$2.process A cluster state change has occurred - updating...
[junit4:junit4]   2> 8697 T1726 oascc.ZkStateReader$2.process A cluster state change has occurred - updating...
[junit4:junit4]   2> 8697 T1738 oascc.ZkStateReader$2.process A cluster state change has occurred - updating...
[junit4:junit4]   2> 8710 T1712 oascc.ZkStateReader$2.process A cluster state change has occurred - updating...
[junit4:junit4]   2> 8711 T1692 oascc.ZkStateReader.createClusterStateWatchersAndUpdate Updating cluster state from ZooKeeper... 
[junit4:junit4]   2> 8717 T1692 oasc.CoreContainer.create Creating SolrCore 'collection1' using instanceDir: /usr/home/hudson/hudson-slave/workspace/Lucene-Solr-NightlyTests-4.x/solr/build/solr-core/test/J1/./solrtest-jetty4-1348159698982/collection1
[junit4:junit4]   2> 8717 T1692 oasc.ZkController.createCollectionZkNode Check for collection zkNode:collection1
[junit4:junit4]   2> 8718 T1692 oasc.ZkController.createCollectionZkNode Collection zkNode exists
[junit4:junit4]   2> 8718 T1692 oasc.ZkController.readConfigName Load collection config from:/collections/collection1
[junit4:junit4]   2> 8720 T1692 oasc.SolrResourceLoader.<init> new SolrResourceLoader for directory: '/usr/home/hudson/hudson-slave/workspace/Lucene-Solr-NightlyTests-4.x/solr/build/solr-core/test/J1/./solrtest-jetty4-1348159698982/collection1/'
[junit4:junit4]   2> 8721 T1692 oasc.SolrResourceLoader.replaceClassLoader Adding 'file:/usr/home/hudson/hudson-slave/workspace/Lucene-Solr-NightlyTests-4.x/solr/build/solr-core/test/J1/solrtest-jetty4-1348159698982/collection1/lib/README' to classloader
[junit4:junit4]   2> 8721 T1692 oasc.SolrResourceLoader.replaceClassLoader Adding 'file:/usr/home/hudson/hudson-slave/workspace/Lucene-Solr-NightlyTests-4.x/solr/build/solr-core/test/J1/solrtest-jetty4-1348159698982/collection1/lib/classes/' to classloader
[junit4:junit4]   2> 8762 T1692 oasc.SolrConfig.<init> Using Lucene MatchVersion: LUCENE_40
[junit4:junit4]   2> 8812 T1692 oasc.SolrConfig.<init> Loaded SolrConfig: solrconfig.xml
[junit4:junit4]   2> 8913 T1692 oass.IndexSchema.readSchema Reading Solr Schema
[junit4:junit4]   2> 8917 T1692 oass.IndexSchema.readSchema Schema name=test
[junit4:junit4]   2> 9340 T1692 oass.OpenExchangeRatesOrgProvider.init Initialized with rates=open-exchange-rates.json, refreshInterval=1440.
[junit4:junit4]   2> 9348 T1692 oass.IndexSchema.readSchema default search field in schema is text
[junit4:junit4]   2> 9351 T1692 oass.IndexSchema.readSchema unique key field: id
[junit4:junit4]   2> 9366 T1692 oass.FileExchangeRateProvider.reload Reloading exchange rates from file currency.xml
[junit4:junit4]   2> 9370 T1692 oass.FileExchangeRateProvider.reload Reloading exchange rates from file currency.xml
[junit4:junit4]   2> 9373 T1692 oass.OpenExchangeRatesOrgProvider.reload Reloading exchange rates from open-exchange-rates.json
[junit4:junit4]   2> 9374 T1692 oass.OpenExchangeRatesOrgProvider.reload Reloading exchange rates from open-exchange-rates.json
[junit4:junit4]   2> 9375 T1692 oasc.SolrCore.<init> [collection1] Opening new SolrCore at /usr/home/hudson/hudson-slave/workspace/Lucene-Solr-NightlyTests-4.x/solr/build/solr-core/test/J1/./solrtest-jetty4-1348159698982/collection1/, dataDir=./org.apache.solr.cloud.BasicDistributedZk2Test-1348159690546/jetty4/
[junit4:junit4]   2> 9376 T1692 oasc.JmxMonitoredMap.<init> JMX monitoring is enabled. Adding Solr mbeans to JMX Server: com.sun.jmx.mbeanserver.JmxMBeanServer@402fb002
[junit4:junit4]   2> 9376 T1692 oasc.SolrCore.getNewIndexDir WARNING New index directory detected: old=null new=./org.apache.solr.cloud.BasicDistributedZk2Test-1348159690546/jetty4/index/
[junit4:junit4]   2> 9377 T1692 oasc.SolrCore.initIndex WARNING [collection1] Solr index directory './org.apache.solr.cloud.BasicDistributedZk2Test-1348159690546/jetty4/index' doesn't exist. Creating new index...
[junit4:junit4]   2> 9378 T1692 oasc.CachingDirectoryFactory.get return new directory for /usr/home/hudson/hudson-slave/workspace/Lucene-Solr-NightlyTests-4.x/solr/build/solr-core/test/J1/./org.apache.solr.cloud.BasicDistributedZk2Test-1348159690546/jetty4/index forceNew:false
[junit4:junit4]   2> 9398 T1692 oasc.SolrDeletionPolicy.onCommit SolrDeletionPolicy.onCommit: commits:num=1
[junit4:junit4]   2> 		commit{dir=NRTCachingDirectory(org.apache.lucene.store.NIOFSDirectory@/usr/home/hudson/hudson-slave/workspace/Lucene-Solr-NightlyTests-4.x/solr/build/solr-core/test/J1/org.apache.solr.cloud.BasicDistributedZk2Test-1348159690546/jetty4/index lockFactory=org.apache.lucene.store.NativeFSLockFactory@5f4bd814; maxCacheMB=48.0 maxMergeSizeMB=4.0),segFN=segments_1,generation=1,filenames=[segments_1]
[junit4:junit4]   2> 9398 T1692 oasc.SolrDeletionPolicy.updateCommits newest commit = 1
[junit4:junit4]   2> 9399 T1692 oasc.SolrCore.initWriters created xml: solr.XMLResponseWriter
[junit4:junit4]   2> 9401 T1692 oasup.UpdateRequestProcessorChain.init inserting DistributedUpdateProcessorFactory into updateRequestProcessorChain "dedupe"
[junit4:junit4]   2> 9401 T1692 oasup.UpdateRequestProcessorChain.init inserting DistributedUpdateProcessorFactory into updateRequestProcessorChain "dedupe-allfields"
[junit4:junit4]   2> 9402 T1692 oasup.UpdateRequestProcessorChain.init inserting DistributedUpdateProcessorFactory into updateRequestProcessorChain "stored_sig"
[junit4:junit4]   2> 9402 T1692 oasup.UpdateRequestProcessorChain.init inserting DistributedUpdateProcessorFactory into updateRequestProcessorChain "uniq-fields"
[junit4:junit4]   2> 9403 T1692 oasup.UpdateRequestProcessorChain.init inserting DistributedUpdateProcessorFactory into updateRequestProcessorChain "distrib-dup-test-chain-implicit"
[junit4:junit4]   2> 9403 T1692 oasc.RequestHandlers.initHandlersFromConfig adding lazy requestHandler: solr.ReplicationHandler
[junit4:junit4]   2> 9403 T1692 oasc.RequestHandlers.initHandlersFromConfig created /replication: solr.ReplicationHandler
[junit4:junit4]   2> 9404 T1692 oasc.RequestHandlers.initHandlersFromConfig created standard: solr.StandardRequestHandler
[junit4:junit4]   2> 9404 T1692 oasc.RequestHandlers.initHandlersFromConfig created /get: solr.RealTimeGetHandler
[junit4:junit4]   2> 9405 T1692 oasc.RequestHandlers.initHandlersFromConfig created dismax: solr.SearchHandler
[junit4:junit4]   2> 9405 T1692 oasc.RequestHandlers.initHandlersFromConfig created mock: org.apache.solr.core.MockQuerySenderListenerReqHandler
[junit4:junit4]   2> 9406 T1692 oasc.RequestHandlers.initHandlersFromConfig created /admin/: org.apache.solr.handler.admin.AdminHandlers
[junit4:junit4]   2> 9406 T1692 oasc.RequestHandlers.initHandlersFromConfig created defaults: solr.StandardRequestHandler
[junit4:junit4]   2> 9406 T1692 oasc.RequestHandlers.initHandlersFromConfig adding lazy requestHandler: solr.StandardRequestHandler
[junit4:junit4]   2> 9407 T1692 oasc.RequestHandlers.initHandlersFromConfig created lazy: solr.StandardRequestHandler
[junit4:junit4]   2> 9407 T1692 oasc.RequestHandlers.initHandlersFromConfig created /update: solr.UpdateRequestHandler
[junit4:junit4]   2> 9408 T1692 oasc.RequestHandlers.initHandlersFromConfig created /terms: org.apache.solr.handler.component.SearchHandler
[junit4:junit4]   2> 9408 T1692 oasc.RequestHandlers.initHandlersFromConfig created spellCheckCompRH: org.apache.solr.handler.component.SearchHandler
[junit4:junit4]   2> 9409 T1692 oasc.RequestHandlers.initHandlersFromConfig created spellCheckCompRH_Direct: org.apache.solr.handler.component.SearchHandler
[junit4:junit4]   2> 9409 T1692 oasc.RequestHandlers.initHandlersFromConfig created spellCheckWithWordbreak: org.apache.solr.handler.component.SearchHandler
[junit4:junit4]   2> 9410 T1692 oasc.RequestHandlers.initHandlersFromConfig created spellCheckWithWordbreak_Direct: org.apache.solr.handler.component.SearchHandler
[junit4:junit4]   2> 9410 T1692 oasc.RequestHandlers.initHandlersFromConfig created spellCheckCompRH1: org.apache.solr.handler.component.SearchHandler
[junit4:junit4]   2> 9411 T1692 oasc.RequestHandlers.initHandlersFromConfig created tvrh: org.apache.solr.handler.component.SearchHandler
[junit4:junit4]   2> 9411 T1692 oasc.RequestHandlers.initHandlersFromConfig created /mlt: solr.MoreLikeThisHandler
[junit4:junit4]   2> 9412 T1692 oasc.RequestHandlers.initHandlersFromConfig created /debug/dump: solr.DumpRequestHandler
[junit4:junit4]   2> 9414 T1692 oashl.XMLLoader.init xsltCacheLifetimeSeconds=60
[junit4:junit4]   2> 9418 T1692 oasc.SolrCore.initDeprecatedSupport WARNING solrconfig.xml uses deprecated <admin/gettableFiles>, Please update your config to use the ShowFileRequestHandler.
[junit4:junit4]   2> 9419 T1692 oasc.SolrCore.initDeprecatedSupport WARNING adding ShowFileRequestHandler with hidden files: [SCHEMA.XML, OLD_SYNONYMS.TXT, STOPWORDS.TXT, PROTWORDS.TXT, OPEN-EXCHANGE-RATES.JSON, SYNONYMS.TXT, CURRENCY.XML, MAPPING-ISOLATIN1ACCENT.TXT]
[junit4:junit4]   2> 9422 T1692 oass.SolrIndexSearcher.<init> Opening Searcher@7158dcff main
[junit4:junit4]   2> 9423 T1692 oasu.CommitTracker.<init> Hard AutoCommit: disabled
[junit4:junit4]   2> 9423 T1692 oasu.CommitTracker.<init> Soft AutoCommit: disabled
[junit4:junit4]   2> 9424 T1692 oashc.SpellCheckComponent.inform Initializing spell checkers
[junit4:junit4]   2> 9444 T1692 oass.DirectSolrSpellChecker.init init: {name=direct,classname=DirectSolrSpellChecker,field=lowerfilt,minQueryLength=3}
[junit4:junit4]   2> 9502 T1765 oasc.SolrCore.registerSearcher [collection1] Registered new searcher Searcher@7158dcff main{StandardDirectoryReader(segments_1:1)}
[junit4:junit4]   2> 9715 T1713 oascc.ZkStateReader.updateClusterState Updating cloud state from ZooKeeper... 
[junit4:junit4]   2> 9733 T1712 oascc.ZkStateReader$2.process A cluster state change has occurred - updating...
[junit4:junit4]   2> 9733 T1726 oascc.ZkStateReader$2.process A cluster state change has occurred - updating...
[junit4:junit4]   2> 9733 T1764 oascc.ZkStateReader$2.process A cluster state change has occurred - updating...
[junit4:junit4]   2> 9733 T1750 oascc.ZkStateReader$2.process A cluster state change has occurred - updating...
[junit4:junit4]   2> 9733 T1738 oascc.ZkStateReader$2.process A cluster state change has occurred - updating...
[junit4:junit4]   2> 10018 T1692 oasc.CoreContainer.register registering core: collection1
[junit4:junit4]   2> 10018 T1692 oasc.ZkController.register Register shard - core:collection1 address:http://127.0.0.1:56209/solr shardId:shard2
[junit4:junit4]   2> 10028 T1692 oasc.ZkController.register We are http://127.0.0.1:56209/solr/collection1/ and leader is http://127.0.0.1:56201/solr/collection1/
[junit4:junit4]   2> 10028 T1692 oasc.ZkController.register No LogReplay needed for core=collection1 baseURL=http://127.0.0.1:56209/solr
[junit4:junit4]   2> 10028 T1692 oasc.ZkController.checkRecovery Core needs to recover:collection1
[junit4:junit4]   2> 10029 T1692 oasu.DefaultSolrCoreState.doRecovery Running recovery - first canceling any ongoing recovery
[junit4:junit4]   2> ASYNC  NEW_CORE C129 name=collection1 org.apache.solr.core.SolrCore@1a8ffd20 url=http://127.0.0.1:56209/solr/collection1 node=127.0.0.1:56209_solr
[junit4:junit4]   2> 10029 T1766 C129 P56209 oasc.RecoveryStrategy.run Starting recovery process.  core=collection1 recoveringAfterStartup=true
[junit4:junit4]   2> 10030 T1766 C129 P56209 oasc.RecoveryStrategy.doRecovery ###### startupVersions=[]
[junit4:junit4]   2> 10030 T1692 oascc.ZkStateReader.updateClusterState Updating cloud state from ZooKeeper... 
[junit4:junit4]   2> 10037 T1766 C129 P56209 oasc.RecoveryStrategy.doRecovery Attempting to PeerSync from http://127.0.0.1:56201/solr/collection1/ core=collection1 - recoveringAfterStartup=true
[junit4:junit4]   2> 10037 T1766 C129 P56209 oasu.PeerSync.sync PeerSync: core=collection1 url=http://127.0.0.1:56209/solr START replicas=[http://127.0.0.1:56201/solr/collection1/] nUpdates=100
[junit4:junit4]   2> 10037 T1692 oass.SolrDispatchFilter.init user.dir=/usr/home/hudson/hudson-slave/workspace/Lucene-Solr-NightlyTests-4.x/solr/build/solr-core/test/J1
[junit4:junit4]   2> 10038 T1766 C129 P56209 oasu.PeerSync.sync WARNING no frame of reference to tell of we've missed updates
[junit4:junit4]   2> 10038 T1692 oass.SolrDispatchFilter.init SolrDispatchFilter.init() done
[junit4:junit4]   2> 10038 T1766 C129 P56209 oasc.RecoveryStrategy.doRecovery PeerSync Recovery was not successful - trying replication. core=collection1
[junit4:junit4]   2> 10038 T1692 oascsi.HttpClientUtil.createClient Creating new http client, config:maxConnections=128&maxConnectionsPerHost=32&followRedirects=false
[junit4:junit4]   2> 10039 T1766 C129 P56209 oasc.RecoveryStrategy.doRecovery Starting Replication Recovery. core=collection1
[junit4:junit4]   2> 10039 T1766 C129 P56209 oascsi.HttpClientUtil.createClient Creating new http client, config:maxConnections=128&maxConnectionsPerHost=32&followRedirects=false
[junit4:junit4]   2> ASYNC  NEW_CORE C130 name=collection1 org.apache.solr.core.SolrCore@3c7b1b33 url=http://127.0.0.1:56201/solr/collection1 node=127.0.0.1:56201_solr
[junit4:junit4]   2> 10045 T1730 C130 P56201 REQ /get {distrib=false&qt=/get&wt=javabin&version=2&getVersions=100} status=0 QTime=0 
[junit4:junit4]   2> 10051 T1692 oaz.ZooKeeper.<init> Initiating client connection, connectString=127.0.0.1:56190/solr sessionTimeout=10000 watcher=org.apache.solr.common.cloud.ConnectionManager@54711d75
[junit4:junit4]   2> 10052 T1768 oaz.ClientCnxn$SendThread.startConnect Opening socket connection to server /127.0.0.1:56190
[junit4:junit4]   2> 10052 T1692 oascc.ConnectionManager.waitForConnected Waiting for client to connect to ZooKeeper
[junit4:junit4]   2> 10052 T1768 oaz.ClientCnxn$SendThread.primeConnection Socket connection established to localhost/127.0.0.1:56190, initiating session
[junit4:junit4]   2> 10053 T1694 oazs.NIOServerCnxn$Factory.run Accepted socket connection from /140.211.11.196:56214
[junit4:junit4]   2> 10053 T1694 oazs.NIOServerCnxn.readConnectRequest Client attempting to establish new session at /140.211.11.196:56214
[junit4:junit4]   2> 10060 T1696 oazs.NIOServerCnxn.finishSessionInit Established session 0x139e49457390007 with negotiated timeout 10000 for client /140.211.11.196:56214
[junit4:junit4]   2> 10060 T1768 oaz.ClientCnxn$SendThread.readConnectResult Session establishment complete on server localhost/127.0.0.1:56190, sessionid = 0x139e49457390007, negotiated timeout = 10000
[junit4:junit4]   2> 10060 T1769 oascc.ConnectionManager.process Watcher org.apache.solr.common.cloud.ConnectionManager@54711d75 name:ZooKeeperConnection Watcher:127.0.0.1:56190/solr got event WatchedEvent state:SyncConnected type:None path:null path:null type:None
[junit4:junit4]   2> 10061 T1692 oascc.ConnectionManager.waitForConnected Client is connected to ZooKeeper
[junit4:junit4]   2> 10061 T1692 oascc.ZkStateReader.createClusterStateWatchersAndUpdate Updating cluster state from ZooKeeper... 
[junit4:junit4]   2> 10063 T1692 oasc.ChaosMonkey.monkeyLog monkey: init - expire sessions:true cause connection loss:true
[junit4:junit4]   2> 10063 T1692 oascsi.HttpClientUtil.createClient Creating new http client, config:
[junit4:junit4]   2> 10071 T1692 oascc.ZkStateReader.updateClusterState Updating cloud state from ZooKeeper... 
[junit4:junit4]   2> ASYNC  NEW_CORE C131 name=collection1 org.apache.solr.core.SolrCore@1675bb28 url=http://127.0.0.1:56193/solr/collection1 node=127.0.0.1:56193_solr
[junit4:junit4]   2> 10079 T1704 C131 P56193 oasc.SolrDeletionPolicy.onInit SolrDeletionPolicy.onInit: commits:num=1
[junit4:junit4]   2> 		commit{dir=NRTCachingDirectory(org.apache.lucene.store.NIOFSDirectory@/usr/home/hudson/hudson-slave/workspace/Lucene-Solr-NightlyTests-4.x/solr/build/solr-core/test/J1/org.apache.solr.cloud.BasicDistributedZk2Test-1348159690546/control/data/index lockFactory=org.apache.lucene.store.NativeFSLockFactory@f31e702; maxCacheMB=48.0 maxMergeSizeMB=4.0),segFN=segments_1,generation=1,filenames=[segments_1]
[junit4:junit4]   2> 10080 T1704 C131 P56193 oasc.SolrDeletionPolicy.updateCommits newest commit = 1
[junit4:junit4]   2> 10083 T1704 C131 P56193 /update {wt=javabin&version=2} {add=[1 (1413647906236268544)]} 0 7
[junit4:junit4]   2> 10083 T1692 oaz.ZooKeeper.<init> Initiating client connection, connectString=127.0.0.1:56190/solr sessionTimeout=10000 watcher=org.apache.solr.common.cloud.ConnectionManager@5931aa19
[junit4:junit4]   2> 10084 T1770 oaz.ClientCnxn$SendThread.startConnect Opening socket connection to server /127.0.0.1:56190
[junit4:junit4]   2> 10084 T1692 oascc.ConnectionManager.waitForConnected Waiting for client to connect to ZooKeeper
[junit4:junit4]   2> 10085 T1770 oaz.ClientCnxn$SendThread.primeConnection Socket connection established to localhost/127.0.0.1:56190, initiating session
[junit4:junit4]   2> 10085 T1694 oazs.NIOServerCnxn$Factory.run Accepted socket connection from /140.211.11.196:56216
[junit4:junit4]   2> 10085 T1694 oazs.NIOServerCnxn.readConnectRequest Client attempting to establish new session at /140.211.11.196:56216
[junit4:junit4]   2> 10092 T1696 oazs.NIOServerCnxn.finishSessionInit Established session 0x139e49457390008 with negotiated timeout 10000 for client /140.211.11.196:56216
[junit4:junit4]   2> 10092 T1770 oaz.ClientCnxn$SendThread.readConnectResult Session establishment complete on server localhost/127.0.0.1:56190, sessionid = 0x139e49457390008, negotiated timeout = 10000
[junit4:junit4]   2> 10092 T1771 oascc.ConnectionManager.process Watcher org.apache.solr.common.cloud.ConnectionManager@5931aa19 name:ZooKeeperConnection Watcher:127.0.0.1:56190/solr got event WatchedEvent state:SyncConnected type:None path:null path:null type:None
[junit4:junit4]   2> 10093 T1692 oascc.ConnectionManager.waitForConnected Client is connected to ZooKeeper
[junit4:junit4]   2> 10093 T1692 oascc.ZkStateReader.createClusterStateWatchersAndUpdate Updating cluster state from ZooKeeper... 
[junit4:junit4]   2> 10100 T1720 C128 P56195 oasc.SolrDeletionPolicy.onInit SolrDeletionPolicy.onInit: commits:num=1
[junit4:junit4]   2> 		commit{dir=NRTCachingDirectory(org.apache.lucene.store.NIOFSDirectory@/usr/home/hudson/hudson-slave/workspace/Lucene-Solr-NightlyTests-4.x/solr/build/solr-core/test/J1/org.apache.solr.cloud.BasicDistributedZk2Test-1348159690546/jetty1/index lockFactory=org.apache.lucene.store.NativeFSLockFactory@14c4a1ea; maxCacheMB=48.0 maxMergeSizeMB=4.0),segFN=segments_1,generation=1,filenames=[segments_1]
[junit4:junit4]   2> 10101 T1720 C128 P56195 oasc.SolrDeletionPolicy.updateCommits newest commit = 1
[junit4:junit4]   2>  C127_STATE=coll:collection1 core:collection1 props:{shard=shard1, roles=null, state=recovering, core=collection1, collection=collection1, node_name=127.0.0.1:56205_solr, base_url=http://127.0.0.1:56205/solr}
[junit4:junit4]   2> 10115 T1742 C127 P56205 oasc.SolrDeletionPolicy.onInit SolrDeletionPolicy.onInit: commits:num=1
[junit4:junit4]   2> 		commit{dir=NRTCachingDirectory(org.apache.lucene.store.NIOFSDirectory@/usr/home/hudson/hudson-slave/workspace/Lucene-Solr-NightlyTests-4.x/solr/build/solr-core/test/J1/org.apache.solr.cloud.BasicDistributedZk2Test-1348159690546/jetty3/index lockFactory=org.apache.lucene.store.NativeFSLockFactory@70f52030; maxCacheMB=48.0 maxMergeSizeMB=4.0),segFN=segments_1,generation=1,filenames=[segments_1]
[junit4:junit4]   2> 10116 T1742 C127 P56205 oasc.SolrDeletionPolicy.updateCommits newest commit = 1
[junit4:junit4]   2> 10120 T1742 C127 P56205 REQ /update {distrib.from=http://127.0.0.1:56195/solr/collection1/&update.distrib=FROMLEADER&wt=javabin&version=2} status=0 QTime=7 
[junit4:junit4]   2> 10123 T1720 C128 P56195 /update {wt=javabin&version=2} {add=[1 (1413647906257240064)]} 0 27
[junit4:junit4]   2> 10124 T1692 oasc.AbstractDistribZkTestBase.waitForRecoveriesToFinish Wait for recoveries to finish - collection: collection1 failOnTimeout:true timeout (sec):3600
[junit4:junit4]   2> 10125 T1692 oascc.ZkStateReader.updateClusterState Updating cloud state from ZooKeeper... 
[junit4:junit4]   2> 10239 T1713 oascc.ZkStateReader.updateClusterState Updating cloud state from ZooKeeper... 
[junit4:junit4]   2> 10261 T1712 oascc.ZkStateReader$2.process A cluster state change has occurred - updating...
[junit4:junit4]   2> 10262 T1726 oascc.ZkStateReader$2.process A cluster state change has occurred - updating...
[junit4:junit4]   2> 10262 T1764 oascc.ZkStateReader$2.process A cluster state change has occurred - updating...
[junit4:junit4]   2> 10262 T1771 oascc.ZkStateReader$2.process A cluster state change has occurred - updating...
[junit4:junit4]   2> 10262 T1738 oascc.ZkStateReader$2.process A cluster state change has occurred - updating...
[junit4:junit4]   2> 10262 T1769 oascc.ZkStateReader$2.process A cluster state change has occurred - updating...
[junit4:junit4]   2> 10262 T1750 oascc.ZkStateReader$2.process A cluster state change has occurred - updating...
[junit4:junit4]   2> 11127 T1692 oascc.ZkStateReader.updateClusterState Updating cloud state from ZooKeeper... 
[junit4:junit4]   2> 11442 T1752 C127 P56205 oasc.RecoveryStrategy.doRecovery Begin buffering updates. core=collection1
[junit4:junit4]   2> 11442 T1752 C127 P56205 oasu.UpdateLog.bufferUpdates Starting to buffer updates. FSUpdateLog{state=ACTIVE, tlog=tlog{file=./org.apache.solr.cloud.BasicDistributedZk2Test-1348159690546/jetty3/tlog/tlog.0000000000000000000 refcount=1}}
[junit4:junit4]   2> 11443 T1752 C127 P56205 oasc.RecoveryStrategy.replicate Attempting to replicate from http://127.0.0.1:56195/solr/collection1/. core=collection1
[junit4:junit4]   2> 11443 T1752 C127 P56205 oascsi.HttpClientUtil.createClient Creating new http client, config:maxConnections=128&maxConnectionsPerHost=32&followRedirects=false
[junit4:junit4]   2> 11454 T1721 C128 P56195 oasu.DirectUpdateHandler2.commit start commit{flags=0,_version_=0,optimize=false,openSearcher=true,waitSearcher=true,expungeDeletes=false,softCommit=false}
[junit4:junit4]   2> 11585 T1721 C128 P56195 oasc.SolrDeletionPolicy.onCommit SolrDeletionPolicy.onCommit: commits:num=2
[junit4:junit4]   2> 		commit{dir=NRTCachingDirectory(org.apache.lucene.store.NIOFSDirectory@/usr/home/hudson/hudson-slave/workspace/Lucene-Solr-NightlyTests-4.x/solr/build/solr-core/test/J1/org.apache.solr.cloud.BasicDistributedZk2Test-1348159690546/jetty1/index lockFactory=org.apache.lucene.store.NativeFSLockFactory@14c4a1ea; maxCacheMB=48.0 maxMergeSizeMB=4.0),segFN=segments_1,generation=1,filenames=[segments_1]
[junit4:junit4]   2> 		commit{dir=NRTCachingDirectory(org.apache.lucene.store.NIOFSDirectory@/usr/home/hudson/hudson-slave/workspace/Lucene-Solr-NightlyTests-4.x/solr/build/solr-core/test/J1/org.apache.solr.cloud.BasicDistributedZk2Test-1348159690546/jetty1/index lockFactory=org.apache.lucene.store.NativeFSLockFactory@14c4a1ea; maxCacheMB=48.0 maxMergeSizeMB=4.0),segFN=segments_2,generation=2,filenames=[_0.fnm, _0_Pulsing40_0.tim, _0_MockSep_0.pos, _0_MockRandom_0.prx, _0_nrm.cfs, _0_Pulsing40_0.prx, _0_Pulsing40_0.frq, _0_MockSep_0.tib, _0_MockRandom_0.tip, _0_MockRandom_0.frq, _0_MockRandom_0.sd, _0_MockSep_0.skp, _0_SimpleText_0.pst, _0_nrm.cfe, _0_Pulsing40_0.tip, _0_MockSep_0.frq, segments_2, _0.fdx, _0_MockSep_0.tii, _0.si, _0_MockSep_0.pyl, _0_MockSep_0.doc, _0_MockRandom_0.tim, _0.fdt]
[junit4:junit4]   2> 11586 T1721 C128 P56195 oasc.SolrDeletionPolicy.updateCommits newest commit = 2
[junit4:junit4]   2> 11598 T1721 C128 P56195 oass.SolrIndexSearcher.<init> Opening Searcher@6a5dd990 main
[junit4:junit4]   2> 11599 T1721 C128 P56195 oasu.DirectUpdateHandler2.commit end_commit_flush
[junit4:junit4]   2> 11599 T1727 oasc.SolrCore.registerSearcher [collection1] Registered new searcher Searcher@6a5dd990 main{StandardDirectoryReader(segments_2:3 _0(4.0.0.2):C1)}
[junit4:junit4]   2> 11600 T1721 C128 P56195 /update {waitSearcher=true&commit=true&commit_end_point=true&wt=javabin&softCommit=false&version=2} {commit=} 0 146
[junit4:junit4]   2> 11601 T1752 C127 P56205 oash.ReplicationHandler.inform Commits will be reserved for  10000
[junit4:junit4]   2> 11601 T1752 C127 P56205 oash.SnapPuller.<init>  No value set for 'pollInterval'. Timer Task not started.
[junit4:junit4]   2> 11602 T1722 C128 P56195 oash.ReplicationHandler.inform Commits will be reserved for  10000
[junit4:junit4]   2> 11602 T1722 C128 P56195 REQ /replication {command=indexversion&wt=javabin&qt=/replication&version=2} status=0 QTime=0 
[junit4:junit4]   2> 11603 T1752 C127 P56205 oash.SnapPuller.fetchLatestIndex Master's generation: 2
[junit4:junit4]   2> 11603 T1752 C127 P56205 oash.SnapPuller.fetchLatestIndex Slave's generation: 1
[junit4:junit4]   2> 11603 T1752 C127 P56205 oash.SnapPuller.fetchLatestIndex Starting replication process
[junit4:junit4]   2> 11607 T1722 C128 P56195 REQ /replication {command=filelist&generation=2&wt=javabin&qt=/replication&version=2} status=0 QTime=2 
[junit4:junit4]   2> 11607 T1752 C127 P56205 oash.SnapPuller.fetchLatestIndex Number of files in latest index in master: 24
[junit4:junit4]   2> 11615 T1752 C127 P56205 oash.SnapPuller.fetchLatestIndex Starting download to ./org.apache.solr.cloud.BasicDistributedZk2Test-1348159690546/jetty3/index.20120920154822151 fullCopy=true
[junit4:junit4]   2> 11628 T1722 C128 P56195 REQ /replication {file=_0_MockSep_0.pos&command=filecontent&checksum=true&generation=2&qt=/replication&wt=filestream} status=0 QTime=4 
[junit4:junit4]   2> 11637 T1722 C128 P56195 REQ /replication {file=_0_MockRandom_0.prx&command=filecontent&checksum=true&generation=2&qt=/replication&wt=filestream} status=0 QTime=0 
[junit4:junit4]   2> 11641 T1722 C128 P56195 REQ /replication {file=_0_Pulsing40_0.prx&command=filecontent&checksum=true&generation=2&qt=/replication&wt=filestream} status=0 QTime=0 
[junit4:junit4]   2> 11645 T1722 C128 P56195 REQ /replication {file=_0_Pulsing40_0.frq&command=filecontent&checksum=true&generation=2&qt=/replication&wt=filestream} status=0 QTime=0 
[junit4:junit4]   2> 11648 T1722 C128 P56195 REQ /replication {file=_0_MockSep_0.skp&command=filecontent&checksum=true&generation=2&qt=/replication&wt=filestream} status=0 QTime=0 
[junit4:junit4]   2> 11649 T1752 C127 P56205 oash.SnapPuller$FileFetcher.fetchPackets WARNING No content recieved for file: {name=_0_MockSep_0.skp, lastmodified=1348159702000, size=0}
[junit4:junit4]   2> 11652 T1722 C128 P56195 REQ /replication {file=_0_SimpleText_0.pst&command=filecontent&checksum=true&generation=2&qt=/replication&wt=filestream} status=0 QTime=0 
[junit4:junit4]   2> 11655 T1722 C128 P56195 REQ /replication {file=_0_Pulsing40_0.tip&command=filecontent&checksum=true&generation=2&qt=/replication&wt=filestream} status=0 QTime=0 
[junit4:junit4]   2> 11659 T1722 C128 P56195 REQ /replication {file=_0_MockSep_0.doc&command=filecontent&checksum=true&generation=2&qt=/replication&wt=filestream} status=0 QTime=0 
[junit4:junit4]   2> 11663 T1722 C128 P56195 REQ /replication {file=_0.si&command=filecontent&checksum=true&generation=2&qt=/replication&wt=filestream} status=0 QTime=0 
[junit4:junit4]   2> 11667 T1722 C128 P56195 REQ /replication {file=_0_Pulsing40_0.tim&command=filecontent&checksum=true&generation=2&qt=/replication&wt=filestream} status=0 QTime=0 
[junit4:junit4]   2> 11671 T1722 C128 P56195 REQ /replication {file=_0.fnm&command=filecontent&checksum=true&generation=2&qt=/replication&wt=filestream} status=0 QTime=0 
[junit4:junit4]   2> 11675 T1722 C128 P56195 REQ /replication {file=_0_nrm.cfs&command=filecontent&checksum=true&generation=2&qt=/replication&wt=filestream} status=0 QTime=0 
[junit4:junit4]   2> 11679 T1722 C128 P56195 REQ /replication {file=_0_MockSep_0.tib&command=filecontent&checksum=true&generation=2&qt=/replication&wt=filestream} status=0 QTime=0 
[junit4:junit4]   2> 11683 T1722 C128 P56195 REQ /replication {file=_0_MockRandom_0.sd&command=filecontent&checksum=true&generation=2&qt=/replication&wt=filestream} status=0 QTime=0 
[junit4:junit4]   2> 11687 T1722 C128 P56195 REQ /replication {file=_0_MockRandom_0.frq&command=filecontent&checksum=true&generation=2&qt=/replication&wt=filestream} status=0 QTime=0 
[junit4:junit4]   2> 11691 T1722 C128 P56195 REQ /replication {file=_0_MockRandom_0.tip&command=filecontent&checksum=true&generation=2&qt=/replication&wt=filestream} status=0 QTime=0 
[junit4:junit4]   2> 11695 T1722 C128 P56195 REQ /replication {file=_0_nrm.cfe&command=filecontent&checksum=true&generation=2&qt=/replication&wt=filestream} status=0 QTime=0 
[junit4:junit4]   2> 11699 T1722 C128 P56195 REQ /replication {file=segments_2&command=filecontent&checksum=true&generation=2&qt=/replication&wt=filestream} status=0 QTime=0 
[junit4:junit4]   2> 11703 T1722 C128 P56195 REQ /replication {file=_0_MockSep_0.frq&command=filecontent&checksum=true&generation=2&qt=/replication&wt=filestream} status=0 QTime=0 
[junit4:junit4]   2> 11706 T1722 C128 P56195 REQ /replication {file=_0.fdx&command=filecontent&checksum=true&generation=2&qt=/replication&wt=filestream} status=0 QTime=0 
[junit4:junit4]   2> 11709 T1722 C128 P56195 REQ /replication {file=_0_MockSep_0.tii&command=filecontent&checksum=true&generation=2&qt=/replication&wt=filestream} status=0 QTime=0 
[junit4:junit4]   2> 11712 T1722 C128 P56195 REQ /replication {file=_0_MockSep_0.pyl&command=filecontent&checksum=true&generation=2&qt=/replication&wt=filestream} status=0 QTime=0 
[junit4:junit4]   2> 11713 T1752 C127 P56205 oash.SnapPuller$FileFetcher.fetchPackets WARNING No content recieved for file: {name=_0_MockSep_0.pyl, lastmodified=1348159702000, size=0}
[junit4:junit4]   2> 11715 T1722 C128 P56195 REQ /replication {file=_0_MockRandom_0.tim&command=filecontent&checksum=true&generation=2&qt=/replication&wt=filestream} status=0 QTime=0 
[junit4:junit4]   2> 11718 T1722 C128 P56195 REQ /replication {file=_0.fdt&command=filecontent&checksum=true&generation=2&qt=/replication&wt=filestream} status=0 QTime=0 
[junit4:junit4]   2> 11719 T1752 C127 P56205 oash.SnapPuller.fetchLatestIndex Total time taken for download : 0 secs
[junit4:junit4]   2> 11728 T1752 C127 P56205 oash.SnapPuller.modifyIndexProps New index installed. Updating index properties... index=index.20120920154822151
[junit4:junit4]   2> 11732 T1752 C127 P56205 oasu.DefaultSolrCoreState.newIndexWriter Creating new IndexWriter...
[junit4:junit4]   2> 11733 T1752 C127 P56205 oasu.DefaultSolrCoreState.newIndexWriter Waiting until IndexWriter is unused... core=collection1
[junit4:junit4]   2> 11733 T1752 C127 P56205 oasu.DefaultSolrCoreState.newIndexWriter Rollback old IndexWriter... core=collection1
[junit4:junit4]   2> 11736 T1752 C127 P56205 oasc.SolrCore.getNewIndexDir WARNING New index directory detected: old=./org.apache.solr.cloud.BasicDistributedZk2Test-1348159690546/jetty3/index/ new=./org.apache.solr.cloud.BasicDistributedZk2Test-1348159690546/jetty3/index.20120920154822151
[junit4:junit4]   2> 11736 T1752 C127 P56205 oasc.CachingDirectoryFactory.get return new directory for /usr/home/hudson/hudson-slave/workspace/Lucene-Solr-NightlyTests-4.x/solr/build/solr-core/test/J1/./org.apache.solr.cloud.BasicDistributedZk2Test-1348159690546/jetty3/index.20120920154822151 forceNew:true
[junit4:junit4]   2> 11745 T1752 C127 P56205 oasc.SolrDeletionPolicy.onInit SolrDeletionPolicy.onInit: commits:num=1
[junit4:junit4]   2> 		commit{dir=NRTCachingDirectory(org.apache.lucene.store.NIOFSDirectory@/usr/home/hudson/hudson-slave/workspace/Lucene-Solr-NightlyTests-4.x/solr/build/solr-core/test/J1/org.apache.solr.cloud.BasicDistributedZk2Test-1348159690546/jetty3/index.20120920154822151 lockFactory=org.apache.lucene.store.NativeFSLockFactory@414f5d2c; maxCacheMB=48.0 maxMergeSizeMB=4.0),segFN=segments_2,generation=2,filenames=[_0.fnm, _0_Pulsing40_0.tim, _0_MockSep_0.pos, _0_MockRandom_0.prx, _0_nrm.cfs, _0_Pulsing40_0.prx, _0_Pulsing40_0.frq, _0_MockSep_0.tib, _0_MockRandom_0.tip, _0_MockRandom_0.frq, _0_MockRandom_0.sd, _0_MockSep_0.skp, _0_nrm.cfe, _0_SimpleText_0.pst, _0_MockSep_0.frq, _0_Pulsing40_0.tip, segments_2, _0.fdx, _0_MockSep_0.tii, _0_MockSep_0.doc, _0_MockSep_0.pyl, _0.si, _0_MockRandom_0.tim, _0.fdt]
[junit4:junit4]   2> 11746 T1752 C127 P56205 oasc.SolrDeletionPolicy.updateCommits newest commit = 2
[junit4:junit4]   2> 11746 T1752 C127 P56205 oasu.DefaultSolrCoreState.newIndexWriter New IndexWriter is ready to be used.
[junit4:junit4]   2> 11750 T1752 C127 P56205 oass.SolrIndexSearcher.<init> Opening Searcher@d96eae9 main
[junit4:junit4]   2> 11751 T1751 oasc.SolrCore.registerSearcher [collection1] Registered new searcher Searcher@d96eae9 main{StandardDirectoryReader(segments_2:3:nrt _0(4.0.0.2):C1)}
[junit4:junit4]   2> 11752 T1751 oasc.CachingDirectoryFactory.close Closing directory:/usr/home/hudson/hudson-slave/workspace/Lucene-Solr-NightlyTests-4.x/solr/build/solr-core/test/J1/./org.apache.solr.cloud.BasicDistributedZk2Test-1348159690546/jetty3/index
[junit4:junit4]   2> 11752 T1751 oash.SnapPuller$2.onClose removing old index directory ./org.apache.solr.cloud.BasicDistributedZk2Test-1348159690546/jetty3/index
[junit4:junit4]   2> 11753 T1752 C127 P56205 oasu.DirectUpdateHandler2.commit start commit{flags=0,_version_=0,optimize=false,openSearcher=false,waitSearcher=false,expungeDeletes=false,softCommit=false}
[junit4:junit4]   2> 11754 T1752 C127 P56205 oasu.DirectUpdateHandler2.commit end_commit_flush
[junit4:junit4]   2> 11758 T1752 C127 P56205 oasc.RecoveryStrategy.replay Replaying buffered documents. core=collection1
[junit4:junit4]   2> 11759 T1774 C127 P56205 oasu.UpdateLog$LogReplayer.doReplay WARNING Starting log replay tlog{file=./org.apache.solr.cloud.BasicDistributedZk2Test-1348159690546/jetty3/tlog/tlog.0000000000000000000 refcount=2} active=true starting pos=430
[junit4:junit4]   2> 11762 T1774 C127 P56205 oasu.DirectUpdateHandler2.commit start commit{flags=2,_version_=0,optimize=false,openSearcher=true,waitSearcher=true,expungeDeletes=false,softCommit=false}
[junit4:junit4]   2> 11763 T1774 C127 P56205 oass.SolrIndexSearcher.<init> Opening Searcher@4b08044b main
[junit4:junit4]   2> 11764 T1774 C127 P56205 oasu.DirectUpdateHandler2.commit end_commit_flush
[junit4:junit4]   2> 11765 T1751 oasc.SolrCore.registerSearcher [collection1] Registered new searcher Searcher@4b08044b main{StandardDirectoryReader(segments_2:3:nrt _0(4.0.0.2):C1)}
[junit4:junit4]   2> 11765 T1774 C127 P56205 oasu.UpdateLog$LogReplayer.run WARNING Log replay finished. recoveryInfo=RecoveryInfo{adds=0 deletes=0 deleteByQuery=0 errors=0 positionOfStart=430}
[junit4:junit4]   2> 11765 T1752 C127 P56205 oasc.RecoveryStrategy.doRecovery Replication Recovery was successful - registering as Active. core=collection1
[junit4:junit4]   2> 11768 T1752 C127 P56205 oasc.RecoveryStrategy.doRecovery Finished recovery process. core=collection1
[junit4:junit4]   2> 11778 T1713 oascc.ZkStateReader.updateClusterState Updating cloud state from ZooKeeper... 
[junit4:junit4]   2> 11791 T1712 oascc.ZkStateReader$2.process A cluster state change has occurred - updating...
[junit4:junit4]   2> 11791 T1738 oascc.ZkStateReader$2.process A cluster state change has occurred - updating...
[junit4:junit4]   2> 11791 T1750 oascc.ZkStateReader$2.process A cluster state change has occurred - updating...
[junit4:junit4]   2> 11791 T1771 oascc.ZkStateReader$2.process A cluster state change has occurred - updating...
[junit4:junit4]   2> 11791 T1764 oascc.ZkStateReader$2.process A cluster state change has occurred - updating...
[junit4:junit4]   2> 11791 T1726 oascc.ZkStateReader$2.process A cluster state change has occurred - updating...
[junit4:junit4]   2> 11791 T1769 oascc.ZkStateReader$2.process A cluster state change has occurred - updating...
[junit4:junit4]   2> 12129 T1692 oascc.ZkStateReader.updateClusterState Updating cloud state from ZooKeeper... 
[junit4:junit4]   2>  C129_STATE=coll:collection1 core:collection1 props:{shard=shard2, roles=null, state=recovering, core=collection1, collection=collection1, node_name=127.0.0.1:56209_solr, base_url=http://127.0.0.1:56209/solr}
[junit4:junit4]   2> 13054 T1766 C129 P56209 oasc.RecoveryStrategy.doRecovery Begin buffering updates. core=collection1
[junit4:junit4]   2> 13054 T1766 C129 P56209 oasu.UpdateLog.bufferUpdates Starting to buffer updates. FSUpdateLog{state=ACTIVE, tlog=null}
[junit4:junit4]   2> 13054 T1766 C129 P56209 oasc.RecoveryStrategy.replicate Attempting to replicate from http://127.0.0.1:56201/solr/collection1/. core=collection1
[junit4:junit4]   2> 13054 T1766 C129 P56209 oascsi.HttpClientUtil.createClient Creating new http client, config:maxConnections=128&maxConnectionsPerHost=32&followRedirects=false
[junit4:junit4]   2> 13074 T1732 C130 P56201 oasu.DirectUpdateHandler2.commit start commit{flags=0,_version_=0,optimize=false,openSearcher=true,waitSearcher=true,expungeDeletes=false,softCommit=false}
[junit4:junit4]   2> 13079 T1732 C130 P56201 oasc.SolrDeletionPolicy.onInit SolrDeletionPolicy.onInit: commits:num=1
[junit4:junit4]   2> 		commit{dir=NRTCachingDirectory(org.apache.lucene.store.NIOFSDirectory@/usr/home/hudson/hudson-slave/workspace/Lucene-Solr-NightlyTests-4.x/solr/build/solr-core/test/J1/org.apache.solr.cloud.BasicDistributedZk2Test-1348159690546/jetty2/index lockFactory=org.apache.lucene.store.NativeFSLockFactory@16452e85; maxCacheMB=48.0 maxMergeSizeMB=4.0),segFN=segments_1,generation=1,filenames=[segments_1]
[junit4:junit4]   2> 13080 T1732 C130 P56201 oasc.SolrDeletionPolicy.updateCommits newest commit = 1
[junit4:junit4]   2> 13081 T1732 C130 P56201 oass.SolrIndexSearcher.<init> Opening Searcher@14a80f58 main
[junit4:junit4]   2> 13082 T1732 C130 P56201 oasu.DirectUpdateHandler2.commit end_commit_flush
[junit4:junit4]   2> 13083 T1739 oasc.SolrCore.registerSearcher [collection1] Registered new searcher Searcher@14a80f58 main{StandardDirectoryReader(segments_1:1)}
[junit4:junit4]   2> 13084 T1732 C130 P56201 /update {waitSearcher=true&commit=true&commit_end_point=true&wt=javabin&softCommit=false&version=2} {commit=} 0 10
[junit4:junit4]   2> 13085 T1766 C129 P56209 oash.ReplicationHandler.inform Commits will be reserved for  10000
[junit4:junit4]   2> 13085 T1766 C129 P56209 oash.SnapPuller.<init>  No value set for 'pollInterval'. Timer Task not started.
[junit4:junit4]   2> 13086 T1733 C130 P56201 oash.ReplicationHandler.inform Commits will be reserved for  10000
[junit4:junit4]   2> 13087 T1733 C130 P56201 REQ /replication {command=indexversion&wt=javabin&qt=/replication&version=2} status=0 QTime=1 
[junit4:junit4]   2> 13093 T1766 C129 P56209 oasc.SolrDeletionPolicy.onInit SolrDeletionPolicy.onInit: commits:num=1
[junit4:junit4]   2> 		commit{dir=NRTCachingDirectory(org.apache.lucene.store.NIOFSDirectory@/usr/home/hudson/hudson-slave/workspace/Lucene-Solr-NightlyTests-4.x/solr/build/solr-core/test/J1/org.apache.solr.cloud.BasicDistributedZk2Test-1348159690546/jetty4/index lockFactory=org.apache.lucene.store.NativeFSLockFactory@5f4bd814; maxCacheMB=48.0 maxMergeSizeMB=4.0),segFN=segments_1,generation=1,filenames=[segments_1]
[junit4:junit4]   2> 13093 T1766 C129 P56209 oasc.SolrDeletionPolicy.updateCommits newest commit = 1
[junit4:junit4]   2> 13094 T1766 C129 P56209 oasu.DirectUpdateHandler2.commit start commit{flags=0,_version_=0,optimize=false,openSearcher=true,waitSearcher=true,expungeDeletes=false,softCommit=false}
[junit4:junit4]   2> 13104 T1766 C129 P56209 oasc.SolrDeletionPolicy.onCommit SolrDeletionPolicy.onCommit: commits:num=2
[junit4:junit4]   2> 		commit{dir=NRTCachingDirectory(org.apache.lucene.store.NIOFSDirectory@/usr/home/hudson/hudson-slave/workspace/Lucene-Solr-NightlyTests-4.x/solr/build/solr-core/test/J1/org.apache.solr.cloud.BasicDistributedZk2Test-1348159690546/jetty4/index lockFactory=org.apache.lucene.store.NativeFSLockFactory@5f4bd814; maxCacheMB=48.0 maxMergeSizeMB=4.0),segFN=segments_1,generation=1,filenames=[segments_1]
[junit4:junit4]   2> 		commit{dir=NRTCachingDirectory(org.apache.lucene.store.NIOFSDirectory@/usr/home/hudson/hudson-slave/workspace/Lucene-Solr-NightlyTests-4.x/solr/build/solr-core/test/J1/org.apache.solr.cloud.BasicDistributedZk2Test-1348159690546/jetty4/index lockFactory=org.apache.lucene.store.NativeFSLockFactory@5f4bd814; maxCacheMB=48.0 maxMergeSizeMB=4.0),segFN=segments_2,generation=2,filenames=[segments_2]
[junit4:junit4]   2> 13104 T1766 C129 P56209 oasc.SolrDeletionPolicy.updateCommits newest commit = 2
[junit4:junit4]   2> 13108 T1766 C129 P56209 oass.SolrIndexSearcher.<init> Opening Searcher@40f2cb4a main
[junit4:junit4]   2> 13109 T1766 C129 P56209 oasu.DirectUpdateHandler2.commit end_commit_flush
[junit4:junit4]   2> 13110 T1765 oasc.SolrCore.registerSearcher [collection1] Registered new searcher Searcher@40f2cb4a main{StandardDirectoryReader(segments_2:2)}
[junit4:junit4]   2> 13110 T1766 C129 P56209 oasc.RecoveryStrategy.replay No replay needed. core=collection1
[junit4:junit4]   2> 13111 T1766 C129 P56209 oasc.RecoveryStrategy.doRecovery Replication Recovery was successful - registering as Active. core=collection1
[junit4:junit4]   2> 13112 T1766 C129 P56209 oasc.RecoveryStrategy.doRecovery Finished recovery process. core=collection1
[junit4:junit4]   2> 13131 T1692 oascc.ZkStateReader.updateClusterState Updating cloud state from ZooKeeper... 
[junit4:junit4]   2> 13299 T1713 oascc.ZkStateReader.updateClusterState Updating cloud state from ZooKeeper... 
[junit4:junit4]   2> 13314 T1764 oascc.ZkStateReader$2.process A cluster state change has occurred - updating...
[junit4:junit4]   2> 13314 T1712 oascc.ZkStateReader$2.process A cluster state change has occurred - updating...
[junit4:junit4]   2> 13314 T1726 oascc.ZkStateReader$2.process A cluster state change has occurred - updating...
[junit4:junit4]   2> 13314 T1771 oascc.ZkStateReader$2.process A cluster state change has occurred - updating...
[junit4:junit4]   2> 13314 T1750 oascc.ZkStateReader$2.process A cluster state change has occurred - updating...
[junit4:junit4]   2> 13314 T1769 oascc.ZkStateReader$2.process A cluster state change has occurred - updating...
[junit4:junit4]   2> 13314 T1738 oascc.ZkStateReader$2.process A cluster state change has occurred - updating...
[junit4:junit4]   2> 14133 T1692 oascc.ZkStateReader.updateClusterState Updating cloud state from ZooKeeper... 
[junit4:junit4]   2> 14137 T1704 C131 P56193 oasu.DirectUpdateHandler2.commit start commit{flags=0,_version_=0,optimize=false,openSearcher=true,waitSearcher=true,expungeDeletes=false,softCommit=false}
[junit4:junit4]   2> 14268 T1704 C131 P56193 oasc.SolrDeletionPolicy.onCommit SolrDeletionPolicy.onCommit: commits:num=2
[junit4:junit4]   2> 		commit{dir=NRTCachingDirectory(org.apache.lucene.store.NIOFSDirectory@/usr/home/hudson/hudson-slave/workspace/Lucene-Solr-NightlyTests-4.x/solr/build/solr-core/test/J1/org.apache.solr.cloud.BasicDistributedZk2Test-1348159690546/control/data/index lockFactory=org.apache.lucene.store.NativeFSLockFactory@f31e702; maxCacheMB=48.0 maxMergeSizeMB=4.0),segFN=segments_1,generation=1,filenames=[segments_1]
[junit4:junit4]   2> 		commit{dir=NRTCachingDirectory(org.apache.lucene.store.NIOFSDirectory@/usr/home/hudson/hudson-slave/workspace/Lucene-Solr-NightlyTests-4.x/solr/build/solr-core/test/J1/org.apache.solr.cloud.BasicDistributedZk2Test-1348159690546/control/data/index lockFactory=org.apache.lucene.store.NativeFSLockFactory@f31e702; maxCacheMB=48.0 maxMergeSizeMB=4.0),segFN=segments_2,generation=2,filenames=[_0.fnm, _0_Pulsing40_0.tim, _0_MockSep_0.pos, _0_MockRandom_0.prx, _0_nrm.cfs, _0_Pulsing40_0.prx, _0_Pulsing40_0.frq, _0_MockSep_0.tib, _0_MockRandom_0.tip, _0_MockRandom_0.frq, _0_MockRandom_0.sd, _0_MockSep_0.skp, _0_SimpleText_0.pst, _0_nrm.cfe, _0_Pulsing40_0.tip, _0_MockSep_0.frq, segments_2, _0.fdx, _0_MockSep_0.tii, _0.si, _0_MockSep_0.pyl, _0_MockSep_0.doc, _0_MockRandom_0.tim, _0.fdt]
[junit4:junit4]   2> 14269 T1704 C131 P56193 oasc.SolrDeletionPolicy.updateCommits newest commit = 2
[junit4:junit4]   2> 14280 T1704 C131 P56193 oass.SolrIndexSearcher.<init> Opening Searcher@4cc0976b main
[junit4:junit4]   2> 14281 T1704 C131 P56193 oasu.DirectUpdateHandler2.commit end_commit_flush
[junit4:junit4]   2> 14283 T1715 oasc.SolrCore.registerSearcher [collection1] Registered new searcher Searcher@4cc0976b main{StandardDirectoryReader(segments_2:3 _0(4.0.0.2):C1)}
[junit4:junit4]   2> 14284 T1704 C131 P56193 /update {waitSearcher=true&wt=javabin&commit=true&softCommit=false&version=2} {commit=} 0 147
[junit4:junit4]   2> 14287 T1720 C128 P56195 oasu.DirectUpdateHandler2.commit start commit{flags=0,_version_=0,optimize=false,openSearcher=true,waitSearcher=true,expungeDeletes=false,softCommit=false}
[junit4:junit4]   2> 14298 T1720 C128 P56195 oass.SolrIndexSearcher.<init> Opening Searcher@1130788e main
[junit4:junit4]   2> 14299 T1720 C128 P56195 oasu.DirectUpdateHandler2.commit end_commit_flush
[junit4:junit4]   2> 14300 T1727 oasc.SolrCore.registerSearcher [collection1] Registered new searcher Searcher@1130788e main{StandardDirectoryReader(segments_2:3 _0(4.0.0.2):C1)}
[junit4:junit4]   2> 14301 T1720 C128 P56195 oasu.SolrCmdDistributor.distribCommit Distrib commit to:[StdNode: http://127.0.0.1:56205/solr/collection1/, StdNode: http://127.0.0.1:56201/solr/collection1/, StdNode: http://127.0.0.1:56209/solr/collection1/]
[junit4:junit4]   2> 14303 T1734 C130 P56201 oasu.DirectUpdateHandler2.commit start commit{flags=0,_version_=0,optimize=false,openSearcher=true,waitSearcher=true,expungeDeletes=false,softCommit=false}
[junit4:junit4]   2>  C127_STATE=coll:collection1 core:collection1 props:{shard=shard1, roles=null, state=active, core=collection1, collection=collection1, node_name=127.0.0.1:56205_solr, base_url=http://127.0.0.1:56205/solr}
[junit4:junit4]   2> 14303 T1742 C127 P56205 oasu.DirectUpdateHandler2.commit start commit{flags=0,_version_=0,optimize=false,openSearcher=true,waitSearcher=true,expungeDeletes=false,softCommit=false}
[junit4:junit4]   2> 14307 T1734 C130 P56201 oass.SolrIndexSearcher.<init> Opening Searcher@7cdca1b0 main
[junit4:junit4]   2> 14307 T1742 C127 P56205 oass.SolrIndexSearcher.<init> Opening Searcher@41e2a543 main
[junit4:junit4]   2> 14307 T1734 C130 P56201 oasu.DirectUpdateHandler2.commit end_commit_flush
[junit4:junit4]   2> 14308 T1742 C127 P56205 oasu.DirectUpdateHandler2.commit end_commit_flush
[junit4:junit4]   2> 14309 T1739 oasc.SolrCore.registerSearcher [collection1] Registered new searcher Searcher@7cdca1b0 main{StandardDirectoryReader(segments_1:1)}
[junit4:junit4]   2> 14309 T1751 oasc.SolrCore.registerSearcher [collection1] Registered new searcher Searcher@41e2a543 main{StandardDirectoryReader(segments_2:3:nrt _0(4.0.0.2):C1)}
[junit4:junit4]   2> 14309 T1734 C130 P56201 /update {waitSearcher=true&commit=true&wt=javabin&commit_end_point=true&expungeDeletes=false&softCommit=false&version=2} {commit=} 0 6
[junit4:junit4]   2> 14309 T1742 C127 P56205 /update {waitSearcher=true&commit=true&wt=javabin&commit_end_point=true&expungeDeletes=false&softCommit=false&version=2} {commit=} 0 6
[junit4:junit4]   2>  C129_STATE=coll:collection1 core:collection1 props:{shard=shard2, roles=null, state=active, core=collection1, collection=collection1, node_name=127.0.0.1:56209_solr, base_url=http://127.0.0.1:56209/solr}
[junit4:junit4]   2> 14313 T1756 C129 P56209 oasu.DirectUpdateHandler2.commit start commit{flags=0,_version_=0,optimize=false,openSearcher=true,waitSearcher=true,expungeDeletes=false,softCommit=false}
[junit4:junit4]   2> 14316 T1756 C129 P56209 oass.SolrIndexSearcher.<init> Opening Searcher@5a587f23 main
[junit4:junit4]   2> 14316 T1756 C129 P56209 oasu.DirectUpdateHandler2.commit end_commit_flush
[junit4:junit4]   2> 14318 T1765 oasc.SolrCore.registerSearcher [collection1] Registered new searcher Searcher@5a587f23 main{StandardDirectoryReader(segments_2:2)}
[junit4:junit4]   2> 14318 T1756 C129 P56209 /update {waitSearcher=true&commit=true&wt=javabin&commit_end_point=true&expungeDeletes=false&softCommit=false&version=2} {commit=} 0 5
[junit4:junit4]   2> 14319 T1720 C128 P56195 /update {waitSearcher=true&wt=javabin&commit=true&softCommit=false&version=2} {commit=} 0 32
[junit4:junit4]   2> 14323 T1705 C131 P56193 REQ /select {fl=id,score&shard.url=127.0.0.1:56193/solr/collection1/&NOW=1348159704864&start=0&q=*:*&distrib=false&isShard=true&wt=javabin&fsv=true&rows=10&version=2} hits=1 status=0 QTime=0 
[junit4:junit4]   2> 14326 T1705 C131 P56193 REQ /select {shard.url=127.0.0.1:56193/solr/collection1/&NOW=1348159704864&q=*:*&ids=1&distrib=false&isShard=true&wt=javabin&version=2} status=0 QTime=0 
[junit4:junit4]   2> 14327 T1704 C131 P56193 REQ /select {wt=javabin&q=*:*&version=2} hits=1 status=0 QTime=6 
[junit4:junit4]   2> 14327 T1692 oaz.ZooKeeper.<init> Initiating client connection, connectString=127.0.0.1:56190/solr sessionTimeout=10000 watcher=org.apache.solr.common.cloud.ConnectionManager@70fbc7e
[junit4:junit4]   2> 14328 T1778 oaz.ClientCnxn$SendThread.startConnect Opening socket connection to server /127.0.0.1:56190
[junit4:junit4]   2> 14328 T1692 oascc.ConnectionManager.waitForConnected Waiting for client to connect to ZooKeeper
[junit4:junit4]   2> 14329 T1778 oaz.ClientCnxn$SendThread.primeConnection Socket connection established to localhost/127.0.0.1:56190, initiating session
[junit4:junit4]   2> 14329 T1694 oazs.NIOServerCnxn$Factory.run Accepted socket connection from /140.211.11.196:56229
[junit4:junit4]   2> 14329 T1694 oazs.NIOServerCnxn.readConnectRequest Client attempting to establish new session at /140.211.11.196:56229
[junit4:junit4]   2> 14340 T1696 oazs.NIOServerCnxn.finishSessionInit Established session 0x139e49457390009 with negotiated timeout 10000 for client /140.211.11.196:56229
[junit4:junit4]   2> 14340 T1778 oaz.ClientCnxn$SendThread.readConnectResult Session establishment complete on server localhost/127.0.0.1:56190, sessionid = 0x139e49457390009, negotiated timeout = 10000
[junit4:junit4]   2> 14340 T1779 oascc.ConnectionManager.process Watcher org.apache.solr.common.cloud.ConnectionManager@70fbc7e name:ZooKeeperConnection Watcher:127.0.0.1:56190/solr got event WatchedEvent state:SyncConnected type:None path:null path:null type:None
[junit4:junit4]   2> 14340 T1692 oascc.ConnectionManager.waitForConnected Client is connected to ZooKeeper
[junit4:junit4]   2> 14341 T1692 oascc.ZkStateReader.createClusterStateWatchersAndUpdate Updating cluster state from ZooKeeper... 
[junit4:junit4]   2> 14343 T1697 oazs.PrepRequestProcessor.pRequest Processed session termination for sessionid: 0x139e49457390009
[junit4:junit4]   2> 14347 T1779 oaz.ClientCnxn$EventThread.run EventThread shut down
[junit4:junit4]   2> 14347 T1692 oaz.ZooKeeper.close Session: 0x139e49457390009 closed
[junit4:junit4]   2> 14347 T1694 oazs.NIOServerCnxn.closeSock Closed socket connection for client /140.211.11.196:56229 which had sessionid 0x139e49457390009
[junit4:junit4]   2> 14349 T1723 C128 P56195 REQ /select {distrib=false&wt=javabin&q=*:*&version=2} hits=1 status=0 QTime=1 
[junit4:junit4]   2> 14350 T1735 C130 P56201 REQ /select {distrib=false&wt=javabin&q=*:*&version=2} hits=0 status=0 QTime=0 
[junit4:junit4]   2> 14354 T1757 C129 P56209 REQ /select {fl=id,score&shard.url=127.0.0.1:56201/solr/collection1/|127.0.0.1:56209/solr/collection1/&NOW=1348159704895&start=0&q=*:*&distrib=false&isShard=true&wt=javabin&fsv=true&rows=10&version=2} hits=0 status=0 QTime=0 
[junit4:junit4]   2> 14354 T1744 C127 P56205 REQ /select {fl=id,score&shard.url=127.0.0.1:56195/solr/collection1/|127.0.0.1:56205/solr/collection1/&NOW=1348159704895&start=0&q=*:*&distrib=false&isShard=true&wt=javabin&fsv=true&rows=10&version=2} hits=1 status=0 QTime=0 
[junit4:junit4]   2> 14357 T1744 C127 P56205 REQ /select {shard.url=127.0.0.1:56195/solr/collection1/|127.0.0.1:56205/solr/collection1/&NOW=1348159704895&q=*:*&ids=1&distrib=false&isShard=true&wt=javabin&version=2} status=0 QTime=0 
[junit4:junit4]   2> 14358 T1743 C127 P56205 REQ /select {wt=javabin&q=*:*&version=2} hits=1 status=0 QTime=6 
[junit4:junit4]   2> 14365 T1704 C131 P56193 /update {wt=javabin&version=2} {add=[2 (1413647910729416704)]} 0 4
[junit4:junit4]   2> 14381 T1756 C129 P56209 REQ /update {update.distrib=FROMLEADER&distrib.from=http://127.0.0.1:56201/solr/collection1/&wt=javabin&version=2} status=0 QTime=6 
[junit4:junit4]   2> 14382 T1734 C130 P56201 REQ /update {distrib.from=http://127.0.0.1:56195/solr/collection1/&update.distrib=TOLEADER&wt=javabin&version=2} status=0 QTime=12 
[junit4:junit4]   2> 14382 T1720 C128 P56195 /update {wt=javabin&version=2} {add=[2]} 0 14
[junit4:junit4]   2> 14386 T1704 C131 P56193 /update {wt=javabin&version=2} {add=[3 (1413647910754582528)]} 0 1
[junit4:junit4]   2> 14396 T1756 C129 P56209 REQ /update {update.distrib=FROMLEADER&distrib.from=http://127.0.0.1:56201/solr/collection1/&wt=javabin&version=2} status=0 QTime=2 
[junit4:junit4]   2> 14397 T1734 C130 P56201 REQ /update {distrib.from=http://127.0.0.1:56195/solr/collection1/&update.distrib=TOLEADER&wt=javabin&version=2} status=0 QTime=6 
[junit4:junit4]   2> 14398 T1720 C128 P56195 /update {wt=javabin&version=2} {add=[3]} 0 9
[junit4:junit4]   2> 14401 T1704 C131 P56193 /update {wt=javabin&version=2} {add=[4 (1413647910770311168)]} 0 1
[junit4:junit4]   2> 14412 T1742 C127 P56205 REQ /update {distrib.from=http://127.0.0.1:56195/solr/collection1/&update.distrib=FROMLEADER&wt=javabin&version=2} status=0 QTime=3 
[junit4:junit4]   2> 14412 T1720 C128 P56195 /update {wt=javabin&version=2} {add=[4 (1413647910774505472)]} 0 8
[junit4:junit4]   2> 14416 T1704 C131 P56193 /update {wt=javabin&version=2} {add=[5 (1413647910786039808)]} 0 1
[junit4:junit4]   2> 14423 T1756 C129 P56209 REQ /update {distrib.from=http://127.0.0.1:56201/solr/collection1/&update.distrib=FROMLEADER&wt=javabin&version=2} status=0 QTime=2 
[junit4:junit4]   2> 14424 T1736 C130 P56201 /update {wt=javabin&version=2} {add=[5 (1413647910789185536)]} 0 7
[junit4:junit4]   2> 14427 T1704 C131 P56193 /update {wt=javabin&version=2} {add=[6 (1413647910797574144)]} 0 1
[junit4:junit4]   2> 14435 T1756 C129 P56209 REQ /update {distrib.from=http://127.0.0.1:56201/solr/collection1/&update.distrib=FROMLEADER&wt=javabin&version=2} status=0 QTime=1 
[junit4:junit4]   2> 14436 T1736 C130 P56201 /update {wt=javabin&version=2} {add=[6 (1413647910801768448)]} 0 6
[junit4:junit4]   2> 14440 T1704 C131 P56193 /update {wt=javabin&version=2} {add=[7 (1413647910811205632)]} 0 1
[junit4:junit4]   2> 14447 T1756 C129 P56209 REQ /update {distrib.from=http://127.0.0.1:56201/solr/collection1/&update.distrib=FROMLEADER&wt=javabin&version=2} status=0 QTime=1 
[junit4:junit4]   2> 14448 T1736 C130 P56201 /update {wt=javabin&version=2} {add=[7 (1413647910814351360)]} 0 6
[junit4:junit4]   2> 14452 T1704 C131 P56193 /update {wt=javabin&version=2} {add=[8 (1413647910823788544)]} 0 1
[junit4:junit4]   2> 14461 T1742 C127 P56205 REQ /update {update.distrib=FROMLEADER&distrib.from=http://127.0.0.1:56195/solr/collection1/&wt=javabin&version=2} status=0 QTime=1 
[junit4:junit4]   2> 14462 T1724 C128 P56195 REQ /update {distrib.from=http://127.0.0.1:56201/solr/collection1/&update.distrib=TOLEADER&wt=javabin&version=2} status=0 QTime=6 
[junit4:junit4]   2> 14462 T1736 C130 P56201 /update {wt=javabin&version=2} {add=[8]} 0 7
[junit4:junit4]   2> 14466 T1704 C131 P56193 /update {wt=javabin&version=2} {add=[9 (1413647910838468608)]} 0 1
[junit4:junit4]   2> 14474 T1756 C129 P56209 REQ /update {distrib.from=http://127.0.0.1:56201/solr/collection1/&update.distrib=FROMLEADER&wt=javabin&version=2} status=0 QTime=1 
[junit4:junit4]   2> 14475 T1736 C130 P56201 /update {wt=javabin&version=2} {add=[9 (1413647910842662912)]} 0 6
[junit4:junit4]   2> 14479 T1704 C131 P56193 /update {wt=javabin&version=2} {add=[10 (1413647910852100096)]} 0 1
[junit4:junit4]   2> 14486 T1742 C127 P56205 REQ /update {distrib.from=http://127.0.0.1:56195/solr/collection1/&update.distrib=FROMLEADER&wt=javabin&version=2} status=0 QTime=1 
[junit4:junit4]   2> 14487 T1720 C128 P56195 /update {wt=javabin&version=2} {add=[10 (1413647910856294400)]} 0 5
[junit4:junit4]   2> 14505 T1704 C131 P56193 /update {wt=javabin&version=2} {add=[11 (1413647910863634432)]} 0 16
[junit4:junit4]   2> 14514 T1742 C127 P56205 REQ /update {update.distrib=FROMLEADER&distrib.from=http://127.0.0.1:56195/solr/collection1/&wt=javabin&version=2} status=0 QTime=1 
[junit4:junit4]   2> 14515 T1724 C128 P56195 REQ /update {distrib.from=http://127.0.0.1:56201/solr/collection1/&update.distrib=TOLEADER&wt=javabin&version=2} status=0 QTime=5 
[junit4:junit4]   2> 14515 T1736 C130 P56201 /update {wt=javabin&version=2} {add=[11]} 0 7
[junit4:junit4]   2> 14520 T1704 C131 P56193 /update {wt=javabin&version=2} {add=[12 (1413647910894043136)]} 0 2
[junit4:junit4]   2> 14529 T1742 C127 P56205 REQ /update {update.distrib=FROMLEADER&distrib.from=http://127.0.0.1:56195/solr/collection1/&wt=javabin&version=2} status=0 QTime=1 
[junit4:junit4]   2> 14530 T1724 C128 P56195 REQ /update {distrib.from=http://127.0.0.1:56201/solr/collection1/&update.distrib=TOLEADER&wt=javabin&version=2} status=0 QTime=5 
[junit4:junit4]   2> 14530 T1736 C130 P56201 /update {wt=javabin&version=2} {add=[12]} 0 7
[junit4:junit4]   2> 14534 T1704 C131 P56193 /update {wt=javabin&version=2} {add=[13 (1413647910909771776)]} 0 1
[junit4:junit4]   2> 14541 T1742 C127 P56205 REQ /update {distrib.from=http://127.0.0.1:56195/solr/collection1/&update.distrib=FROMLEADER&wt=javabin&version=2} status=0 QTime=1 
[junit4:junit4]   2> 14542 T1720 C128 P56195 /update {wt=javabin&version=2} {add=[13 (1413647910913966080)]} 0 5
[junit4:junit4]   2> 14547 T1704 C131 P56193 /update {wt=javabin&version=2} {add=[14 (1413647910922354688)]} 0 2
[junit4:junit4]   2> 14556 T1742 C127 P56205 REQ /update {update.distrib=FROMLEADER&distrib.from=http://127.0.0.1:56195/solr/collection1/&wt=javabin&version=2} status=0 QTime=1 
[junit4:junit4]   2> 14557 T1724 C128 P56195 REQ /update {distrib.from=http://127.0.0.1:56201/solr/collection1/&update.distrib=TOLEADER&wt=javabin&version=2} status=0 QTime=6 
[junit4:junit4]   2> 14557 T1736 C130 P56201 /update {wt=javabin&version=2} {add=[14]} 0 8
[junit4:junit4]   2> 14561 T1704 C131 P56193 /update {wt=javabin&version=2} {add=[15 (1413647910938083328)]} 0 1
[junit4:junit4]   2> 14568 T1742 C127 P56205 REQ /update {distrib.from=http://127.0.0.1:56195/solr/collection1/&update.distrib=FROMLEADER&wt=javabin&version=2} status=0 QTime=1 
[junit4:junit4]   2> 14568 T1720 C128 P56195 /update {wt=javabin&version=2} {add=[15 (1413647910942277632)]} 0 4
[junit4:junit4]   2> 14572 T1704 C131 P56193 /update {wt=javabin&version=2} {add=[16 (1413647910949617664)]} 0 1
[junit4:junit4]   2> 14581 T1742 C127 P56205 REQ /update {update.distrib=FROMLEADER&distrib.from=http://127.0.0.1:56195/solr/collection1/&wt=javabin&version=2} status=0 QTime=1 
[junit4:junit4]   2> 14581 T1724 C128 P56195 REQ /update {distrib.from=http://127.0.0.1:56201/solr/collection1/&update.distrib=TOLEADER&wt=javabin&version=2} status=0 QTime=4 
[junit4:junit4]   2> 14582 T1736 C130 P56201 /update {wt=javabin&version=2} {add=[16]} 0 7
[junit4:junit4]   2> 14589 T1704 C131 P56193 /update {wt=javabin&version=2} {add=[17 (1413647910965346304)]} 0 4
[junit4:junit4]   2> 14602 T1756 C129 P56209 REQ /update {distrib.from=http://127.0.0.1:56201/solr/collection1/&update.distrib=FROMLEADER&wt=javabin&version=2} status=0 QTime=3 
[junit4:junit4]   2> 14603 T1736 C130 P56201 /update {wt=javabin&version=2} {add=[17 (1413647910972686336)]} 0 11
[junit4:junit4]   2> 14606 T1704 C131 P56193 /update {wt=javabin&version=2} {add=[100 (1413647910985269248)]} 0 1
[junit4:junit4]   2> 14637 T1742 C127 P56205 REQ /update {distrib.from=http://127.0.0.1:56195/solr/collection1/&update.distrib=FROMLEADER&wt=javabin&version=2} status=0 QTime=14 
[junit4:junit4]   2> 14638 T1720 C128 P56195 /update {wt=javabin&version=2} {add=[100 (1413647910989463552)]} 0 29
[junit4:junit4]   2> 14642 T1704 C131 P56193 /update {wt=javabin&version=2} {add=[101 (1413647911023017984)]} 0 1
[junit4:junit4]   2> 14657 T1742 C127 P56205 REQ /update {update.distrib=FROMLEADER&distrib.from=http://127.0.0.1:56195/solr/collection1/&wt=javabin&version=2} status=0 QTime=3 
[junit4:junit4]   2> 14658 T1724 C128 P56195 REQ /update {distrib.from=http://127.0.0.1:56201/solr/collection1/&update.distrib=TOLEADER&wt=javabin&version=2} status=0 QTime=11 
[junit4:junit4]   2> 14658 T1736 C130 P56201 /update {wt=javabin&version=2} {add=[101]} 0 13
[junit4:junit4]   2> 14662 T1704 C131 P56193 /update {wt=javabin&version=2} {add=[102 (1413647911043989504)]} 0 1
[junit4:junit4]   2> 14673 T1742 C127 P56205 REQ /update {update.distrib=FROMLEADER&distrib.from=http://127.0.0.1:56195/solr/collection1/&wt=javabin&version=2} status=0 QTime=2 
[junit4:junit4]   2> 14673 T1724 C128 P56195 REQ /update {distrib.from=http://127.0.0.1:56201/solr/collection1/&update.distrib=TOLEADER&wt=javabin&version=2} status=0 QTime=6 
[junit4:junit4]   2> 14674 T1736 C130 P56201 /update {wt=javabin&version=2} {add=[102]} 0 9
[junit4:junit4]   2> 14697 T1704 C131 P56193 /update {wt=javabin&version=2} {add=[103 (1413647911060766720)]} 0 20
[junit4:junit4]   2> 14704 T1756 C129 P56209 REQ /update {distrib.from=http://127.0.0.1:56201/solr/collection1/&update.distrib=FROMLEADER&wt=javabin&version=2} status=0 QTime=1 
[junit4:junit4]   2> 14705 T1736 C130 P56201 /update {wt=javabin&version=2} {add=[103 (1413647911084883968)]} 0 5
[junit4:junit4]   2> 14710 T1704 C131 P56193 /update {wt=javabin&version=2} {add=[104 (1413647911093272576)]} 0 2
[junit4:junit4]   2> 14719 T1756 C129 P56209 REQ /update {update.distrib=FROMLEADER&distrib.from=http://127.0.0.1:56201/solr/collection1/&wt=javabin&version=2} status=0 QTime=1 
[junit4:junit4]   2> 14720 T1734 C130 P56201 REQ /update {distrib.from=http://127.0.0.1:56195/solr/collection1/&update.distrib=TOLEADER&wt=javabin&version=2} status=0 QTime=5 
[junit4:junit4]   2> 14720 T1720 C128 P56195 /update {wt=javabin&version=2} {add=[104]} 0 7
[junit4:junit4]   2> 14724 T1704 C131 P56193 /update {wt=javabin&version=2} {add=[105 (1413647911109001216)]} 0 1
[junit4:junit4]   2> 14768 T1756 C129 P56209 REQ /update {update.distrib=FROMLEADER&distrib.from=http://127.0.0.1:56201/solr/collection1/&wt=javabin&version=2} status=0 QTime=15 
[junit4:junit4]   2> 14769 T1734 C130 P56201 REQ /update {distrib.from=http://127.0.0.1:56195/solr/collection1/&update.distrib=TOLEADER&wt=javabin&version=2} status=0 QTime=40 
[junit4:junit4]   2> 14769 T1720 C128 P56195 /update {wt=javabin&version=2} {add=[105]} 0 42
[junit4:junit4]   2> 14774 T1704 C131 P56193 /update {wt=javabin&version=2} {add=[106 (1413647911160381440)]} 0 2
[junit4:junit4]   2> 14786 T1756 C129 P56209 REQ /update {update.distrib=FROMLEADER&distrib.from=http://127.0.0.1:56201/solr/collection1/&wt=javabin&version=2} status=0 QTime=2 
[junit4:junit4]   2> 14787 T1734 C130 P56201 REQ /update {distrib.from=http://127.0.0.1:56195/solr/collection1/&update.distrib=TOLEADER&wt=javabin&version=2} status=0 QTime=8 
[junit4:junit4]   2> 14788 T1720 C128 P56195 /update {wt=javabin&version=2} {add=[106]} 0 11
[junit4:junit4]   2> 14793 T1704 C131 P56193 /update {wt=javabin&version=2} {add=[107 (1413647911180304384)]} 0 2
[junit4:junit4]   2> 14805 T1742 C127 P56205 REQ /update {update.distrib=FROMLEADER&distrib.from=http://127.0.0.1:56195/solr/collection1/&wt=javabin&version=2} status=0 QTime=2 
[junit4:junit4]   2> 14806 T1724 C128 P56195 REQ /update {distrib.from=http://127.0.0.1:56201/solr/collection1/&update.distrib=TOLEADER&wt=javabin&version=2} status=0 QTime=7 
[junit4:junit4]   2> 14807 T1736 C130 P56201 /update {wt=javabin&version=2} {add=[107]} 0 11
[junit4:junit4]   2> 14811 T1704 C131 P56193 /update {wt=javabin&version=2} {add=[108 (1413647911199178752)]} 0 2
[junit4:junit4]   2> 14820 T1742 C127 P56205 REQ /update {distrib.from=http://127.0.0.1:56195/solr/collection1/&update.distrib=FROMLEADER&wt=javabin&version=2} status=0 QTime=2 
[junit4:junit4]   2> 14820 T1720 C128 P56195 /update {wt=javabin&version=2} {add=[108 (1413647911205470208)]} 0 6
[junit4:junit4]   2> 14825 T1704 C131 P56193 /update {wt=javabin&version=2} {add=[109 (1413647911213858816)]} 0 2
[junit4:junit4]   2> 14833 T1742 C127 P56205 REQ /update {distrib.from=http://127.0.0.1:56195/solr/collection1/&update.distrib=FROMLEADER&wt=javabin&version=2} status=0 QTime=2 
[junit4:junit4]   2> 14834 T1720 C128 P56195 /update {wt=javabin&version=2} {add=[109 (1413647911219101696)]} 0 6
[junit4:junit4]   2> 14838 T1704 C131 P56193 /update {wt=javabin&version=2} {add=[110 (1413647911228538880)]} 0 1
[junit4:junit4]   2> 14847 T1742 C127 P56205 REQ /update {distrib.from=http://127.0.0.1:56195/solr/collection1/&update.distrib=FROMLEADER&wt=javabin&version=2} status=0 QTime=2 
[junit4:junit4]   2> 14848 T1720 C128 P56195 /update {wt=javabin&version=2} {add=[110 (1413647911232733184)]} 0 7
[junit4:junit4]   2> 14852 T1704 C131 P56193 /update {wt=javabin&version=2} {add=[111 (1413647911243218944)]} 0 1
[junit4:junit4]   2> 14861 T1742 C127 P56205 REQ /update {distrib.from=http://127.0.0.1:56195/solr/collection1/&update.distrib=FROMLEADER&wt=javabin&version=2} status=0 QTime=2 
[junit4:junit4]   2> 14861 T1720 C128 P56195 /update {wt=javabin&version=2} {add=[111 (1413647911247413248)]} 0 6
[junit4:junit4]   2> 14865 T1704 C131 P56193 /update {wt=javabin&version=2} {add=[112 (1413647911256850432)]} 0 1
[junit4:junit4]   2> 14873 T1756 C129 P56209 REQ /update {distrib.from=http://127.0.0.1:56201/solr/collection1/&update.distrib=FROMLEADER&wt=javabin&version=2} status=0 QTime=1 
[junit4:junit4]   2> 14874 T1736 C130 P56201 /update {wt=javabin&version=2} {add=[112 (1413647911261044736)]} 0 6
[junit4:junit4]   2> 14890 T1704 C131 P56193 /update {wt=javabin&version=2} {add=[113 (1413647911270481920)]} 0 13
[junit4:junit4]   2> 14898 T1742 C127 P56205 REQ /update {distrib.from=http://127.0.0.1:56195/solr/collection1/&update.distrib=FROMLEADER&wt=javabin&version=2} status=0 QTime=1 
[junit4:junit4]   2> 14899 T1720 C128 P56195 /update {wt=javabin&version=2} {add=[113 (1413647911287259136)]} 0 6
[junit4:junit4]   2> 14903 T1704 C131 P56193 /update {wt=javabin&version=2} {add=[114 (1413647911295647744)]} 0 2
[junit4:junit4]   2> 14913 T1742 C127 P56205 REQ /update {update.distrib=FROMLEADER&distrib.from=http://127.0.0.1:56195/solr/collection1/&wt=javabin&version=2} status=0 QTime=1 
[junit4:junit4]   2> 14914 T1724 C128 P56195 REQ /update {distrib.from=http://127.0.0.1:56201/solr/collection1/&update.distrib=TOLEADER&wt=javabin&version=2} status=0 QTime=6 
[junit4:junit4]   2> 14915 T1736 C130 P56201 /update {wt=javabin&version=2} {add=[114]} 0 9
[junit4:junit4]   2> 14918 T1704 C131 P56193 /update {wt=javabin&version=2} {add=[115 (1413647911312424960)]} 0 1
[junit4:junit4]   2> 14928 T1756 C129 P56209 REQ /update {update.distrib=FROMLEADER&distrib.from=http://127.0.0.1:56201/solr/collection1/&wt=javabin&version=2} status=0 QTime=1 
[junit4:junit4]   2> 14929 T1734 C130 P56201 REQ /update {distrib.from=http://127.0.0.1:56195/solr/collection1/&update.distrib=TOLEADER&wt=javabin&version=2} status=0 QTime=6 
[junit4:junit4]   2> 14929 T1720 C128 P56195 /update {wt=javabin&version=2} {add=[115]} 0 8
[junit4:junit4]   2> 14933 T1704 C131 P56193 /update {wt=javabin&version=2} {add=[116 (1413647911328153600)]} 0 1
[junit4:junit4]   2> 14940 T1756 C129 P56209 REQ /update {distrib.from=http://127.0.0.1:56201/solr/collection1/&update.distrib=FROMLEADER&wt=javabin&version=2} status=0 QTime=1 
[junit4:junit4]   2> 14941 T1736 C130 P56201 /update {wt=javabin&version=2} {add=[116 (1413647911332347904)]} 0 5
[junit4:junit4]   2> 14944 T1704 C131 P56193 /update {wt=javabin&version=2} {add=[117 (1413647911339687936)]} 0 1
[junit4:junit4]   2> 14951 T1756 C129 P56209 REQ /update {distrib.from=http://127.0.0.1:56201/solr/collection1/&update.distrib=FROMLEADER&wt=javabin&version=2} status=0 QTime=1 
[junit4:junit4]   2> 14952 T1736 C130 P56201 /update {wt=javabin&version=2} {add=[117 (1413647911343882240)]} 0 5
[junit4:junit4]   2> 14955 T1704 C131 P56193 /update {wt=javabin&version=2} {add=[118 (1413647911351222272)]} 0 1
[junit4:junit4]   2> 15003 T1742 C127 P56205 REQ /update {distrib.from=http://127.0.0.1:56195/solr/collection1/&update.distrib=FROMLEADER&wt=javabin&version=2} status=0 QTime=19 
[junit4:junit4]   2> 15004 T1720 C128 P56195 /update {wt=javabin&version=2} {add=[118 (1413647911354368000)]} 0 47
[junit4:junit4]   2> 15008 T1704 C131 P56193 /update {wt=javabin&version=2} {add=[119 (1413647911405748224)]} 0 2
[junit4:junit4]   2> 15016 T1756 C129 P56209 REQ /update {distrib.from=http://127.0.0.1:56201/solr/collection1/&update.distrib=FROMLEADER&wt=javabin&version=2} status=0 QTime=1 
[junit4:junit4]   2> 15017 T1736 C130 P56201 /update {wt=javabin&version=2} {add=[119 (1413647911410991104)]} 0 6
[junit4:junit4]   2> 15022 T1704 C131 P56193 /update {wt=javabin&version=2} {add=[120 (1413647911421476864)]} 0 2
[junit4:junit4]   2> 15031 T1756 C129 P56209 REQ /update {distrib.from=http://127.0.0.1:56201/solr/collection1/&update.distrib=FROMLEADER&wt=javabin&version=2} status=0 QTime=2 
[junit4:junit4]   2> 15032 T1736 C130 P56201 /update {wt=javabin&version=2} {add=[120 (1413647911425671168)]} 0 7
[junit4:junit4]   2> 15037 T1704 C131 P56193 /update {wt=javabin&version=2} {add=[121 (1413647911436156928)]} 0 2
[junit4:junit4]   2> 15046 T1756 C129 P56209 REQ /update {distrib.from=http://127.0.0.1:56201/solr/collection1/&update.distrib=FROMLEADER&wt=javabin&version=2} status=0 QTime=2 
[junit4:junit4]   2> 15046 T1736 C130 P56201 /update {wt=javabin&version=2} {add=[121 (1413647911441399808)]} 0 6
[junit4:junit4]   2> 15051 T1704 C131 P56193 /update {wt=javabin&version=2} {add=[122 (1413647911450836992)]} 0 2
[junit4:junit4]   2> 15064 T1742 C127 P56205 REQ /update {update.distrib=FROMLEADER&distrib.from=http://127.0.0.1:56195/solr/collection1/&wt=javabin&version=2} status=0 QTime=2 
[junit4:junit4]   2> 15065 T1724 C128 P56195 REQ /update {distrib.from=http://127.0.0.1:56201/solr/collection1/&update.distrib=TOLEADER&wt=javabin&version=2} status=0 QTime=8 
[junit4:junit4]   2> 15065 T1736 C130 P56201 /update {wt=javabin&version=2} {add=[122]} 0 11
[junit4:junit4]   2> 15079 T1704 C131 P56193 /update {wt=javabin&version=2} {add=[123 (1413647911470759936)]} 0 11
[junit4:junit4]   2> 15088 T1742 C127 P56205 REQ /update {distrib.from=http://127.0.0.1:56195/solr/collection1/&update.distrib=FROMLEADER&wt=javabin&version=2} status=0 QTime=2 
[junit4:junit4]   2> 15089 T1720 C128 P56195 /update {wt=javabin&version=2} {add=[123 (1413647911485440000)]} 0 7
[junit4:junit4]   2> 15094 T1704 C131 P56193 /update {wt=javabin&version=2} {add=[124 (1413647911495925760)]} 0 2
[junit4:junit4]   2> 15105 T1742 C127 P56205 REQ /update {update.distrib=FROMLEADER&distrib.from=http://127.0.0.1:56195/solr/collection1/&wt=javabin&version=2} status=0 QTime=1 
[junit4:junit4]   2> 15106 T1724 C128 P56195 REQ /update {distrib.from=http://127.0.0.1:56201/solr/collection1/&update.distrib=TOLEADER&wt=javabin&version=2} status=0 QTime=6 
[junit4:junit4]   2> 15107 T1736 C130 P56201 /update {wt=javabin&version=2} {add=[124]} 0 10
[junit4:junit4]   2> 15110 T1704 C131 P56193 /update {wt=javabin&version=2} {add=[125 (1413647911513751552)]} 0 1
[junit4:junit4]   2> 15117 T1742 C127 P56205 REQ /update {distrib.from=http://127.0.0.1:56195/solr/collection1/&update.distrib=FROMLEADER&wt=javabin&version=2} status=0 QTime=1 
[junit4:junit4]   2> 15118 T1720 C128 P56195 /update {wt=javabin&version=2} {add=[125 (1413647911517945856)]} 0 4
[junit4:junit4]   2> 15121 T1704 C131 P56193 /update {wt=javabin&version=2} {add=[126 (1413647911525285888)]} 0 1
[junit4:junit4]   2> 15127 T1756 C129 P56209 REQ /update {distrib.from=http://127.0.0.1:56201/solr/collection1/&update.distrib=FROMLEADER&wt=javabin&version=2} status=0 QTime=1 
[junit4:junit4]   2> 15128 T1736 C130 P56201 /update {wt=javabin&version=2} {add=[126 (1413647911528431616)]} 0 5
[junit4:junit4]   2> 15132 T1704 C131 P56193 /update {wt=javabin&version=2} {add=[127 (1413647911536820224)]} 0 1
[junit4:junit4]   2> 15168 T1756 C129 P56209 REQ /update {distrib.from=http://127.0.0.1:56201/solr/collection1/&update.distrib=FROMLEADER&wt=javabin&version=2} status=0 QTime=16 
[junit4:junit4]   2> 15169 T1736 C130 P56201 /update {wt=javabin&version=2} {add=[127 (1413647911541014528)]} 0 34
[junit4:junit4]   2> 15173 T1704 C131 P56193 /update {wt=javabin&version=2} {add=[128 (1413647911579811840)]} 0 1
[junit4:junit4]   2> 15185 T1756 C129 P56209 REQ /update {update.distrib=FROMLEADER&distrib.from=http://127.0.0.1:56201/solr/collection1/&wt=javabin&version=2} status=0 QTime=3 
[junit4:junit4]   2> 15185 T1734 C130 P56201 REQ /update {distrib.from=http://127.0.0.1:56195/solr/collection1/&update.distrib=TOLEADER&wt=javabin&version=2} status=0 QTime=7 
[junit4:junit4]   2> 15186 T1720 C128 P56195 /update {wt=javabin&version=2} {add=[128]} 0 10
[junit4:junit4]   2> 15190 T1704 C131 P56193 /update {wt=javabin&version=2} {add=[129 (1413647911597637632)]} 0 1
[junit4:junit4]   2> 15197 T1742 C127 P56205 REQ /update {distrib.from=http://127.0.0.1:56195/solr/collection1/&update.distrib=FROMLEADER&wt=javabin&version=2} status=0 QTime=1 
[junit4:junit4]   2> 15198 T1720 C128 P56195 /update {wt=javabin&version=2} {add=[129 (1413647911601831936)]} 0 5
[junit4:junit4]   2> 15201 T1704 C131 P56193 /update {wt=javabin&version=2} {add=[130 (1413647911609171968)]} 0 1
[junit4:junit4]   2> 15208 T1756 C129 P56209 REQ /update {distrib.from=http://127.0.0.1:56201/solr/collection1/&update.distrib=FROMLEADER&wt=javabin&version=2} status=0 QTime=1 
[junit4:junit4]   2> 15208 T1736 C130 P56201 /update {wt=javabin&version=2} {add=[130 (1413647911613366272)]} 0 4
[junit4:junit4]   2> 15212 T1704 C131 P56193 /update {wt=javabin&version=2} {add=[131 (1413647911620706304)]} 0 1
[junit4:junit4]   2> 15220 T1756 C129 P56209 REQ /update {update.distrib=FROMLEADER&distrib.from=http://127.0.0.1:56201/solr/collection1/&wt=javabin&version=2} status=0 QTime=1 
[junit4:junit4]   2> 15220 T1734 C130 P56201 REQ /update {distrib.from=http://127.0.0.1:56195/solr/collection1/&update.distrib=TOLEADER&wt=javabin&version=2} status=0 QTime=4 
[junit4:junit4]   2> 15221 T1720 C128 P56195 /update {wt=javabin&version=2} {add=[131]} 0 7
[junit4:junit4]   2> 15224 T1704 C131 P56193 /update {wt=javabin&version=2} {add=[132 (1413647911633289216)]} 0 1
[junit4:junit4]   2> 15230 T1742 C127 P56205 REQ /update {distrib.from=http://127.0.0.1:56195/solr/collection1/&update.distrib=FROMLEADER&wt=javabin&version=2} status=0 QTime=1 
[junit4:junit4]   2> 15230 T1720 C128 P56195 /update {wt=javabin&version=2} {add=[132 (1413647911636434944)]} 0 4
[junit4:junit4]   2> 15248 T1704 C131 P56193 /update {wt=javabin&version=2} {add=[133 (1413647911643774976)]} 0 15
[junit4:junit4]   2> 15256 T1742 C127 P56205 REQ /update {distrib.from=http://127.0.0.1:56195/solr/collection1/&update.distrib=FROMLEADER&wt=javabin&version=2} status=0 QTime=1 
[junit4:junit4]   2> 15257 T1720 C128 P56195 /update {wt=javabin&version=2} {add=[133 (1413647911662649344)]} 0 6
[junit4:junit4]   2> 15261 T1704 C131 P56193 /update {wt=javabin&version=2} {add=[134 (1413647911671037952)]} 0 2
[junit4:junit4]   2> 15269 T1756 C129 P56209 REQ /update {update.distrib=FROMLEADER&distrib.from=http://127.0.0.1:56201/solr/collection1/&wt=javabin&version=2} status=0 QTime=1 
[junit4:junit4]   2> 15269 T1734 C130 P56201 REQ /update {distrib.from=http://127.0.0.1:56195/solr/collection1/&update.distrib=TOLEADER&wt=javabin&version=2} status=0 QTime=4 
[junit4:junit4]   2> 15270 T1720 C128 P56195 /update {wt=javabin&version=2} {add=[134]} 0 7
[junit4:junit4]   2> 15273 T1704 C131 P56193 /update {wt=javabin&version=2} {add=[135 (1413647911684669440)]} 0 1
[junit4:junit4]   2> 15279 T1742 C127 P56205 REQ /update {distrib.from=http://127.0.0.1:56195/solr/collection1/&update.distrib=FROMLEADER&wt=javabin&version=2} status=0 QTime=1 
[junit4:junit4]   2> 15279 T1720 C128 P56195 /update {wt=javabin&version=2} {add=[135 (1413647911687815168)]} 0 4
[junit4:junit4]   2> 15283 T1704 C131 P56193 /update {wt=javabin&version=2} {add=[136 (1413647911695155200)]} 0 1
[junit4:junit4]   2> 15291 T1756 C129 P56209 REQ /update {update.distrib=FROMLEADER&distrib.from=http://127.0.0.1:56201/solr/collection1/&wt=javabin&version=2} status=0 QTime=1 
[junit4:junit4]   2> 15291 T1734 C130 P56201 REQ /update {distrib.from=http://127.0.0.1:56195/solr/collection1/&update.distrib=TOLEADER&wt=javabin&version=2} status=0 QTime=4 
[junit4:junit4]   2> 15291 T1720 C128 P56195 /update {wt=javabin&version=2} {add=[136]} 0 6
[junit4:junit4]   2> 15295 T1704 C131 P56193 /update {wt=javabin&version=2} {add=[137 (1413647911707738112)]} 0 1
[junit4:junit4]   2> 15303 T1756 C129 P56209 REQ /update {update.distrib=FROMLEADER&distrib.from=http://127.0.0.1:56201/solr/collection1/&wt=javabin&version=2} status=0 QTime=1 
[junit4:junit4]   2> 15303 T1734 C130 P56201 REQ /update {distrib.from=http://127.0.0.1:56195/solr/collection1/&update.distrib=TOLEADER&wt=javabin&version=2} status=0 QTime=4 
[junit4:junit4]   2> 15304 T1720 C128 P56195 /update {wt=javabin&version=2} {add=[137]} 0 7
[junit4:junit4]   2> 15307 T1704 C131 P56193 /update {wt=javabin&version=2} {add=[138 (1413647911720321024)]} 0 1
[junit4:junit4]   2> 15316 T1742 C127 P56205 REQ /update {update.distrib=FROMLEADER&distrib.from=http://127.0.0.1:56195/solr/collection1/&wt=javabin&version=2} status=0 QTime=1 
[junit4:junit4]   2> 15316 T1724 C128 P56195 REQ /update {distrib.from=http://127.0.0.1:56201/solr/collection1/&update.distrib=TOLEADER&wt=javabin&version=2} status=0 QTime=5 
[junit4:junit4]   2> 15317 T1736 C130 P56201 /update {wt=javabin&version=2} {add=[138]} 0 8
[junit4:junit4]   2> 15320 T1704 C131 P56193 /update {wt=javabin&version=2} {add=[139 (1413647911733952512)]} 0 1
[junit4:junit4]   2> 15326 T1756 C129 P56209 REQ /update {distrib.from=http://127.0.0.1:56201/solr/collection1/&update.distrib=FROMLEADER&wt=javabin&version=2} status=0 QTime=1 
[junit4:junit4]   2> 15326 T1736 C130 P56201 /update {wt=javabin&version=2} {add=[139 (1413647911737098240)]} 0 4
[junit4:junit4]   2> 15330 T1704 C131 P56193 /update {wt=javabin&version=2} {add=[140 (1413647911744438272)]} 0 1
[junit4:junit4]   2> 15337 T1756 C129 P56209 REQ /update {distrib.from=http://127.0.0.1:56201/solr/collection1/&update.distrib=FROMLEADER&wt=javabin&version=2} status=0 QTime=1 
[junit4:junit4]   2> 15337 T1736 C130 P56201 /update {wt=javabin&version=2} {add=[140 (1413647911747584000)]} 0 5
[junit4:junit4]   2> 15341 T1704 C131 P56193 /update {wt=javabin&version=2} {add=[141 (1413647911755972608)]} 0 1
[junit4:junit4]   2> 15348 T1756 C129 P56209 REQ /update {distrib.from=http://127.0.0.1:56201/solr/collection1/&update.distrib=FROMLEADER&wt=javabin&version=2} status=0 QTime=1 
[junit4:junit4]   2> 15349 T1736 C130 P56201 /update {wt=javabin&version=2} {add=[141 (1413647911759118336)]} 0 6
[junit4:junit4]   2> 15352 T1704 C131 P56193 /update {wt=javabin&version=2} {add=[142 (1413647911767506944)]} 0 1
[junit4:junit4]   2> 15385 T1756 C129 P56209 REQ /update {update.distrib=FROMLEADER&distrib.from=http://127.0.0.1:56201/solr/collection1/&wt=javabin&version=2} status=0 QTime=14 
[junit4:junit4]   2> 15386 T1734 C130 P56201 REQ /update {distrib.from=http://127.0.0.1:56195/solr/collection1/&update.distrib=TOLEADER&wt=javabin&version=2} status=0 QTime=29 
[junit4:junit4]   2> 15386 T1720 C128 P56195 /update {wt=javabin&version=2} {add=[142]} 0 31
[junit4:junit4]   2> 15403 T1704 C131 P56193 /update {wt=javabin&version=2} {add=[143 (1413647911807352832)]} 0 14
[junit4:junit4]   2> 15415 T1756 C129 P56209 REQ /update {update.distrib=FROMLEADER&distrib.from=http://127.0.0.1:56201/solr/collection1/&wt=javabin&version=2} status=0 QTime=2 
[junit4:junit4]   2> 15416 T1734 C130 P56201 REQ /update {distrib.from=http://127.0.0.1:56195/solr/collection1/&update.distrib=TOLEADER&wt=javabin&version=2} status=0 QTime=7 
[junit4:junit4]   2> 15416 T1720 C128 P56195 /update {wt=javabin&version=2} {add=[143]} 0 10
[junit4:junit4]   2> 15421 T1704 C131 P56193 /update {wt=javabin&version=2} {add=[144 (1413647911838810112)]} 0 2
[junit4:junit4]   2> 15428 T1756 C129 P56209 REQ /update {distrib.from=http://127.0.0.1:56201/solr/collection1/&update.distrib=FROMLEADER&wt=javabin&version=2} status=0 QTime=1 
[junit4:junit4]   2> 15428 T1736 C130 P56201 /update {wt=javabin&version=2} {add=[144 (1413647911843004416)]} 0 5
[junit4:junit4]   2> 15432 T1704 C131 P56193 /update {wt=javabin&version=2} {add=[145 (1413647911851393024)]} 0 1
[junit4:junit4]   2> 15438 T1756 C129 P56209 REQ /update {distrib.from=http://127.0.0.1:56201/solr/collection1/&update.distrib=FROMLEADER&wt=javabin&version=2} status=0 QTime=1 
[junit4:junit4]   2> 15438 T1736 C130 P56201 /update {wt=javabin&version=2} {add=[145 (1413647911854538752)]} 0 4
[junit4:junit4]   2> 15442 T1704 C131 P56193 /update {wt=javabin&version=2} {add=[146 (1413647911861878784)]} 0 1
[junit4:junit4]   2> 15466 T1742 C127 P56205 REQ /update {update.distrib=FROMLEADER&distrib.from=http://127.0.0.1:56195/solr/collection1/&wt=javabin&version=2} status=0 QTime=9 
[junit4:junit4]   2> 15466 T1724 C128 P56195 REQ /update {distrib.from=http://127.0.0.1:56201/solr/collection1/&update.distrib=TOLEADER&wt=javabin&version=2} status=0 QTime=20 
[junit4:junit4]   2> 15466 T1736 C130 P56201 /update {wt=javabin&version=2} {add=[146]} 0 22
[junit4:junit4]   2> 15470 T1704 C131 P56193 /update {wt=javabin&version=2} {add=[147 (1413647911891238912)]} 0 1
[junit4:junit4]   2> 15477 T1756 C129 P56209 REQ /update {distrib.from=http://127.0.0.1:56201/solr/collection1/&update.distrib=FROMLEADER&wt=javabin&version=2} status=0 QTime=1 
[junit4:junit4]   2> 15477 T1736 C130 P56201 /update {wt=javabin&version=2} {add=[147 (1413647911894384640)]} 0 5
[junit4:junit4]   2> 15481 T1704 C131 P56193 /update {wt=javabin&version=2} {add=[148 (1413647911902773248)]} 0 1
[junit4:junit4]   2> 15489 T1742 C127 P56205 REQ /update {distrib.from=http://127.0.0.1:56195/solr/collection1/&update.distrib=FROMLEADER&wt=javabin&version=2} status=0 QTime=2 
[junit4:junit4]   2> 15489 T1720 C128 P56195 /update {wt=javabin&version=2} {add=[148 (1413647911905918976)]} 0 6
[junit4:junit4]   2> 15492 T1704 C131 P56193 /update {wt=javabin&version=2} {add=[149 (1413647911914307584)]} 0 1
[junit4:junit4]   2> 15498 T1756 C129 P56209 REQ /update {distrib.from=http://127.0.0.1:56201/solr/collection1/&update.distrib=FROMLEADER&wt=javabin&version=2} status=0 QTime=1 
[junit4:junit4]   2> 15498 T1736 C130 P56201 /update {wt=javabin&version=2} {add=[149 (1413647911917453312)]} 0 4
[junit4:junit4]   2> 15499 T1692 oasc.AbstractDistribZkTestBase.waitForRecoveriesToFinish Wait for recoveries to finish - collection: collection1 failOnTimeout:true timeout (sec):3600
[junit4:junit4]   2> 15499 T1692 oascc.ZkStateReader.updateClusterState Updating cloud state from ZooKeeper... 
[junit4:junit4]   2> 15502 T1704 C131 P56193 oasu.DirectUpdateHandler2.commit start commit{flags=0,_version_=0,optimize=false,openSearcher=true,waitSearcher=true,expungeDeletes=false,softCommit=false}
[junit4:junit4]   2> 16191 T1704 C131 P56193 oasc.SolrDeletionPolicy.onCommit SolrDeletionPolicy.onCommit: commits:num=2
[junit4:junit4]   2> 		commit{dir=NRTCachingDirectory(org.apache.lucene.store.NIOFSDirectory@/usr/home/hudson/hudson-slave/workspace/Lucene-Solr-NightlyTests-4.x/solr/build/solr-core/test/J1/org.apache.solr.cloud.BasicDistributedZk2Test-1348159690546/control/data/index lockFactory=org.apache.lucene.store.NativeFSLockFactory@f31e702; maxCacheMB=48.0 maxMergeSizeMB=4.0),segFN=segments_2,generation=2,filenames=[_0.fnm, _0_Pulsing40_0.tim, _0_MockSep_0.pos, _0_MockRandom_0.prx, _0_nrm.cfs, _0_Pulsing40_0.prx, _0_Pulsing40_0.frq, _0_MockSep_0.tib, _0_MockRandom_0.tip, _0_MockRandom_0.frq, _0_MockRandom_0.sd, _0_MockSep_0.skp, _0_SimpleText_0.pst, _0_nrm.cfe, _0_Pulsing40_0.tip, _0_MockSep_0.frq, segments_2, _0.fdx, _0_MockSep_0.tii, _0.si, _0_MockSep_0.pyl, _0_MockSep_0.doc, _0_MockRandom_0.tim, _0.fdt]
[junit4:junit4]   2> 		commit{dir=NRTCachingDirectory(org.apache.lucene.store.NIOFSDirectory@/usr/home/hudson/hudson-slave/workspace/Lucene-Solr-NightlyTests-4.x/solr/build/solr-core/test/J1/org.apache.solr.cloud.BasicDistributedZk2Test-1348159690546/control/data/index lockFactory=org.apache.lucene.store.NativeFSLockFactory@f31e702; maxCacheMB=48.0 maxMergeSizeMB=4.0),segFN=segments_3,generation=3,filenames=[_5_nrm.cfe, _0_MockRandom_0.prx, _4_MockSep_0.skp, _3.fdt, _2_MockSep_0.doc, _1_MockRandom_0.pos, _7.fnm, _6_MockSep_0.doc, _5_MockSep_0.skp, _3_MockRandom_0.skp, _5_MockRandom_0.pyl, _5_Pulsing40_0.tip, _6_MockSep_0.frq, _5_Pulsing40_0.tim, _7_MockSep_0.tib, _1_MockSep_0.pyl, _0_Pulsing40_0.tim, _7_MockSep_0.tii, _1_MockSep_0.tib, _1_MockRandom_0.sd, _5_MockSep_0.doc, _7_MockRandom_0.skp, _1_MockSep_0.tii, _1.fdx, _0_MockRandom_0.frq, _7_MockRandom_0.doc, _3_MockSep_0.pos, _1.fdt, _5_nrm.cfs, _4_MockRandom_0.sd, _7_MockRandom_0.sd, _1_MockRandom_0.doc, _6.fdt, _3_Pulsing40_0.frq, _2.si, _2_Pulsing40_0.tim, _6_MockRandom_0.tip, _6_MockSep_0.pyl, _2_Pulsing40_0.tip, _2_MockSep_0.skp, _6.fdx, _6_MockRandom_0.tim, _5_MockSep_0.tii, _2_nrm.cfe, _5_Pulsing40_0.frq, _7_MockRandom_0.pyl, _0_Pulsing40_0.tip, _2_nrm.cfs, _2_MockRandom_0.prx, _2.fnm, _3.fdx, _7_Pulsing40_0.tim, _2_MockRandom_0.sd, _4_Pulsing40_0.tip, _2_MockSep_0.pyl, _4_Pulsing40_0.tim, _1.si, _5_MockSep_0.tib, _3_MockSep_0.skp, _3_MockRandom_0.pos, _7_Pulsing40_0.tip, _3_nrm.cfe, _3_MockSep_0.doc, _4_nrm.cfe, _0_Pulsing40_0.prx, _4.fdx, _7_MockRandom_0.frq, _1_Pulsing40_0.prx, _5_MockRandom_0.sd, _4_MockRandom_0.tip, _7_MockSep_0.pos, _4_MockRandom_0.tim, _6_MockSep_0.tii, _1_MockSep_0.doc, _6_MockSep_0.tib, _5.si, _3_nrm.cfs, _6_MockRandom_0.sd, _3_MockRandom_0.tip, _3_MockRandom_0.tim, _6_Pulsing40_0.prx, _4_nrm.cfs, _1_MockRandom_0.frq, _5_MockSep_0.pyl, _5_MockRandom_0.frq, _5_MockRandom_0.tip, _6_nrm.cfs, _5_MockRandom_0.tim, _7_nrm.cfs, _0_MockSep_0.doc, _1_nrm.cfs, _5.fnm, _7_nrm.cfe, _6_nrm.cfe, _2_MockSep_0.frq, _4.fdt, _4.si, _6_SimpleText_0.pst, _3_MockRandom_0.sd, _1_nrm.cfe, _4_SimpleText_0.pst, _7_SimpleText_0.pst, _0_MockRandom_0.tip, _4_Pulsing40_0.frq, _1_MockRandom_0.pyl, _2_MockRandom_0.frq, _0_MockSep_0.frq, _0_MockRandom_0.tim, _2_SimpleText_0.pst, _0_MockSep_0.pos, _4_MockSep_0.tib, _7.si, _3_MockSep_0.frq, _0_Pulsing40_0.frq, _0_SimpleText_0.pst, _4_MockSep_0.doc, _5_MockRandom_0.pos, _1_MockRandom_0.tiv, _1_MockSep_0.skp, _3_Pulsing40_0.tip, _2.fdt, _7.fdx, _2.fdx, _3_Pulsing40_0.tim, _7.fdt, _7_Pulsing40_0.frq, _1_MockRandom_0.tib, _4_MockRandom_0.prx, _7_MockSep_0.doc, _4_MockSep_0.pyl, _3.si, _4_MockSep_0.tii, _1_SimpleText_0.pst, _2_MockRandom_0.tip, _2_MockRandom_0.tim, _3_MockRandom_0.frq, _3.fnm, _3_MockSep_0.pyl, _7_MockRandom_0.pos, _4_Pulsing40_0.prx, _7_MockSep_0.frq, _6_MockSep_0.pos, _5_MockRandom_0.doc, _1_MockSep_0.pos, _5_MockRandom_0.skp, _6_MockSep_0.skp, _5_Pulsing40_0.prx, _3_MockRandom_0.pyl, _6_MockRandom_0.prx, _6.fnm, _6.si, _6_MockRandom_0.frq, _5_MockSep_0.pos, _5.fdt, _1_Pulsing40_0.tip, _6_Pulsing40_0.frq, _1_Pulsing40_0.tim, _4.fnm, _1.fnm, _7_Pulsing40_0.prx, _7_MockRandom_0.tip, _1_Pulsing40_0.frq, _7_MockRandom_0.tim, _0_MockSep_0.skp, _3_SimpleText_0.pst, _3_MockSep_0.tib, _7_MockSep_0.skp, _6_Pulsing40_0.tim, _6_Pulsing40_0.tip, _2_Pulsing40_0.prx, _0.fnm, _4_MockSep_0.pos, _5_MockSep_0.frq, _2_MockSep_0.tii, _3_MockSep_0.tii, _2_MockSep_0.tib, _2_Pulsing40_0.frq, _2_MockSep_0.pos, _1_MockSep_0.frq, _3_MockRandom_0.doc, _7_MockSep_0.pyl, _0.si, _5_SimpleText_0.pst, _0_nrm.cfs, _1_MockRandom_0.skp, _0_MockSep_0.tib, _3_Pulsing40_0.prx, _0_MockRandom_0.sd, _4_MockRandom_0.frq, _0_nrm.cfe, _4_MockSep_0.frq, _5.fdx, _0.fdx, _0_MockSep_0.tii, _0_MockSep_0.pyl, _0.fdt, segments_3]
[junit4:junit4]   2> 16192 T1704 C131 P56193 oasc.SolrDeletionPolicy.updateCommits newest commit = 3
[junit4:junit4]   2> 16278 T1704 C131 P56193 oass.SolrIndexSearcher.<init> Opening Searcher@2a18fdd7 main
[junit4:junit4]   2> 16279 T1704 C131 P56193 oasu.DirectUpdateHandler2.commit end_commit_flush
[junit4:junit4]   2> 16280 T1715 oasc.SolrCore.registerSearcher [collection1] Registered new searcher Searcher@2a18fdd7 main{StandardDirectoryReader(segments_3:17 _0(4.0.0.2):C1 _1(4.0.0.2):C10 _2(4.0.0.2):C10 _3(4.0.0.2):C10 _4(4.0.0.2):C10 _5(4.0.0.2):C10 _6(4.0.0.2):C10 _7(4.0.0.2):C6)}
[junit4:junit4]   2> 16280 T1704 C131 P56193 /update {waitSearcher=true&wt=javabin&commit=true&softCommit=false&version=2} {commit=} 0 778
[junit4:junit4]   2> 16283 T1720 C128 P56195 oasu.DirectUpdateHandler2.commit start commit{flags=0,_version_=0,optimize=false,openSearcher=true,waitSearcher=true,expungeDeletes=false,softCommit=false}
[junit4:junit4]   2> 16583 T1720 C128 P56195 oasc.SolrDeletionPolicy.onCommit SolrDeletionPolicy.onCommit: commits:num=2
[junit4:junit4]   2> 		commit{dir=NRTCachingDirectory(org.apache.lucene.store.NIOFSDirectory@/usr/home/hudson/hudson-slave/workspace/Lucene-Solr-NightlyTests-4.x/solr/build/solr-core/test/J1/org.apache.solr.cloud.BasicDistributedZk2Test-1348159690546/jetty1/index lockFactory=org.apache.lucene.store.NativeFSLockFactory@14c4a1ea; maxCacheMB=48.0 maxMergeSizeMB=4.0),segFN=segments_2,generation=2,filenames=[_0.fnm, _0_Pulsing40_0.tim, 

[...truncated too long message...]

etIndexSize(ReplicationHandler.java:477)
[junit4:junit4]   2> 	at org.apache.solr.handler.ReplicationHandler.getStatistics(ReplicationHandler.java:525)
[junit4:junit4]   2> 	at org.apache.solr.core.RequestHandlers$LazyRequestHandlerWrapper.getStatistics(RequestHandlers.java:310)
[junit4:junit4]   2> 	at org.apache.solr.core.JmxMonitoredMap$SolrDynamicMBean.getMBeanInfo(JmxMonitoredMap.java:231)
[junit4:junit4]   2> 	at com.sun.jmx.interceptor.DefaultMBeanServerInterceptor.getClassName(DefaultMBeanServerInterceptor.java:1824)
[junit4:junit4]   2> 	at com.sun.jmx.interceptor.DefaultMBeanServerInterceptor.safeGetClassName(DefaultMBeanServerInterceptor.java:1661)
[junit4:junit4]   2> 	at com.sun.jmx.interceptor.DefaultMBeanServerInterceptor.checkMBeanPermission(DefaultMBeanServerInterceptor.java:1833)
[junit4:junit4]   2> 	at com.sun.jmx.interceptor.DefaultMBeanServerInterceptor.getAttribute(DefaultMBeanServerInterceptor.java:680)
[junit4:junit4]   2> 	at com.sun.jmx.mbeanserver.JmxMBeanServer.getAttribute(JmxMBeanServer.java:672)
[junit4:junit4]   2> 	at org.apache.solr.core.JmxMonitoredMap.unregister(JmxMonitoredMap.java:174)
[junit4:junit4]   2> 	at org.apache.solr.core.JmxMonitoredMap.clear(JmxMonitoredMap.java:116)
[junit4:junit4]   2> 	at org.apache.solr.core.SolrCore.close(SolrCore.java:864)
[junit4:junit4]   2> 	at org.apache.solr.cloud.ShardLeaderElectionContext.runLeaderProcess(ElectionContext.java:213)
[junit4:junit4]   2> 	at org.apache.solr.cloud.LeaderElector.runIamLeaderProcess(LeaderElector.java:158)
[junit4:junit4]   2> 	at org.apache.solr.cloud.LeaderElector.checkIfIamLeader(LeaderElector.java:102)
[junit4:junit4]   2> 	at org.apache.solr.cloud.LeaderElector.access$000(LeaderElector.java:56)
[junit4:junit4]   2> 	at org.apache.solr.cloud.LeaderElector$1.process(LeaderElector.java:131)
[junit4:junit4]   2> 	at org.apache.zookeeper.ClientCnxn$EventThread.processEvent(ClientCnxn.java:526)
[junit4:junit4]   2> 	at org.apache.zookeeper.ClientCnxn$EventThread.run(ClientCnxn.java:502)
[junit4:junit4]   2> 
[junit4:junit4]   2> 306719 T1764 oasc.JmxMonitoredMap$SolrDynamicMBean.getMBeanInfo WARNING Could not getStatistics on info bean Lazy[solr.ReplicationHandler] java.lang.IllegalArgumentException: /usr/home/hudson/hudson-slave/workspace/Lucene-Solr-NightlyTests-4.x/solr/build/solr-core/test/J1/org.apache.solr.cloud.BasicDistributedZk2Test-1348159690546/jetty4/index does not exist
[junit4:junit4]   2> 	at org.apache.commons.io.FileUtils.sizeOfDirectory(FileUtils.java:2074)
[junit4:junit4]   2> 	at org.apache.solr.handler.ReplicationHandler.getIndexSize(ReplicationHandler.java:477)
[junit4:junit4]   2> 	at org.apache.solr.handler.ReplicationHandler.getStatistics(ReplicationHandler.java:525)
[junit4:junit4]   2> 	at org.apache.solr.core.RequestHandlers$LazyRequestHandlerWrapper.getStatistics(RequestHandlers.java:310)
[junit4:junit4]   2> 	at org.apache.solr.core.JmxMonitoredMap$SolrDynamicMBean.getMBeanInfo(JmxMonitoredMap.java:231)
[junit4:junit4]   2> 	at com.sun.jmx.interceptor.DefaultMBeanServerInterceptor.getClassName(DefaultMBeanServerInterceptor.java:1824)
[junit4:junit4]   2> 	at com.sun.jmx.interceptor.DefaultMBeanServerInterceptor.safeGetClassName(DefaultMBeanServerInterceptor.java:1661)
[junit4:junit4]   2> 	at com.sun.jmx.interceptor.DefaultMBeanServerInterceptor.checkMBeanPermission(DefaultMBeanServerInterceptor.java:1833)
[junit4:junit4]   2> 	at com.sun.jmx.interceptor.DefaultMBeanServerInterceptor.exclusiveUnregisterMBean(DefaultMBeanServerInterceptor.java:436)
[junit4:junit4]   2> 	at com.sun.jmx.interceptor.DefaultMBeanServerInterceptor.unregisterMBean(DefaultMBeanServerInterceptor.java:421)
[junit4:junit4]   2> 	at com.sun.jmx.mbeanserver.JmxMBeanServer.unregisterMBean(JmxMBeanServer.java:540)
[junit4:junit4]   2> 	at org.apache.solr.core.JmxMonitoredMap.unregister(JmxMonitoredMap.java:175)
[junit4:junit4]   2> 	at org.apache.solr.core.JmxMonitoredMap.clear(JmxMonitoredMap.java:116)
[junit4:junit4]   2> 	at org.apache.solr.core.SolrCore.close(SolrCore.java:864)
[junit4:junit4]   2> 	at org.apache.solr.cloud.ShardLeaderElectionContext.runLeaderProcess(ElectionContext.java:213)
[junit4:junit4]   2> 	at org.apache.solr.cloud.LeaderElector.runIamLeaderProcess(LeaderElector.java:158)
[junit4:junit4]   2> 	at org.apache.solr.cloud.LeaderElector.checkIfIamLeader(LeaderElector.java:102)
[junit4:junit4]   2> 	at org.apache.solr.cloud.LeaderElector.access$000(LeaderElector.java:56)
[junit4:junit4]   2> 	at org.apache.solr.cloud.LeaderElector$1.process(LeaderElector.java:131)
[junit4:junit4]   2> 	at org.apache.zookeeper.ClientCnxn$EventThread.processEvent(ClientCnxn.java:526)
[junit4:junit4]   2> 	at org.apache.zookeeper.ClientCnxn$EventThread.run(ClientCnxn.java:502)
[junit4:junit4]   2> 
[junit4:junit4]   2> 306724 T1764 oasc.SolrCore.closeSearcher [collection1] Closing main searcher on request.
[junit4:junit4]   2> 306728 T1764 oasu.DirectUpdateHandler2.close closing DirectUpdateHandler2{commits=5,autocommits=0,soft autocommits=0,optimizes=0,rollbacks=0,expungeDeletes=0,docsPending=0,adds=0,deletesById=0,deletesByQuery=0,errors=0,cumulative_adds=35,cumulative_deletesById=0,cumulative_deletesByQuery=0,cumulative_errors=0}
[junit4:junit4]   2> 306728 T1764 oasu.DefaultSolrCoreState.decref SolrCoreState ref count has reached 0 - closing IndexWriter
[junit4:junit4]   2> 306730 T1764 oasu.DefaultSolrCoreState.decref Closing SolrCoreState - canceling any ongoing recovery
[junit4:junit4]   2> 306730 T1764 oascc.ZkStateReader$3.process Updating live nodes
[junit4:junit4]   2> 306731 T1764 oascc.ZkStateReader$3.process WARNING ZooKeeper watch triggered, but Solr cannot talk to ZK
[junit4:junit4]   2> 306731 T1764 oascc.ZkStateReader$2.process A cluster state change has occurred - updating...
[junit4:junit4]   2> 306731 T1764 oascc.ZkStateReader$2.process WARNING ZooKeeper watch triggered, but Solr cannot talk to ZK
[junit4:junit4]   2> 306731 T1764 oascc.ConnectionManager.process Watcher org.apache.solr.common.cloud.ConnectionManager@6460efa5 name:ZooKeeperConnection Watcher:127.0.0.1:56190/solr got event WatchedEvent state:Disconnected type:None path:null path:null type:None
[junit4:junit4]   2> 306731 T1764 oascc.ConnectionManager.process Client->ZooKeeper status change trigger but we are already closed
[junit4:junit4]   2> 306732 T1764 oaz.ClientCnxn$EventThread.run EventThread shut down
[junit4:junit4]   2> NOTE: test params are: codec=Lucene40: {n_f1=Pulsing40(freqCutoff=3 minBlockSize=96 maxBlockSize=285), foo_b=PostingsFormat(name=SimpleText), foo_d=PostingsFormat(name=MockRandom), foo_f=PostingsFormat(name=SimpleText), n_tl1=Pulsing40(freqCutoff=3 minBlockSize=96 maxBlockSize=285), n_d1=PostingsFormat(name=MockSep), rnd_b=PostingsFormat(name=MockRandom), intDefault=PostingsFormat(name=MockSep), n_td1=Pulsing40(freqCutoff=3 minBlockSize=96 maxBlockSize=285), id=PostingsFormat(name=MockRandom), timestamp=PostingsFormat(name=MockSep), range_facet_sl=PostingsFormat(name=SimpleText), range_facet_si=Pulsing40(freqCutoff=3 minBlockSize=96 maxBlockSize=285), oddField_s=PostingsFormat(name=MockRandom), multiDefault=Pulsing40(freqCutoff=3 minBlockSize=96 maxBlockSize=285), n_tf1=PostingsFormat(name=MockSep), n_dt1=Pulsing40(freqCutoff=3 minBlockSize=96 maxBlockSize=285), n_ti1=PostingsFormat(name=MockRandom), range_facet_l=PostingsFormat(name=MockSep), text=PostingsFormat(name=SimpleText), _version_=PostingsFormat(name=MockSep), SubjectTerms_mfacet=PostingsFormat(name=MockSep), a_t=PostingsFormat(name=MockSep), n_tdt1=PostingsFormat(name=MockSep), other_tl1=PostingsFormat(name=MockSep), n_l1=PostingsFormat(name=MockSep), a_si=Pulsing40(freqCutoff=3 minBlockSize=96 maxBlockSize=285)}, sim=RandomSimilarityProvider(queryNorm=false,coord=crazy): {}, locale=zh, timezone=Atlantic/Cape_Verde
[junit4:junit4]   2> NOTE: FreeBSD 9.0-RELEASE amd64/Sun Microsystems Inc. 1.6.0_32 (64-bit)/cpus=16,threads=2,free=37123200,total=242614272
[junit4:junit4]   2> NOTE: All tests run in this JVM: [IndexSchemaTest, URLClassifyProcessorTest, TestDistributedSearch, TestPropInject, TestSolrXMLSerializer, TestOmitPositions, DebugComponentTest, ZkNodePropsTest, QueryEqualityTest, PeerSyncTest, DocumentBuilderTest, XsltUpdateRequestHandlerTest, TestValueSourceCache, MultiTermTest, TestReload, DirectSolrSpellCheckerTest, PrimitiveFieldTypeTest, LegacyHTMLStripCharFilterTest, QueryParsingTest, TermVectorComponentTest, SolrIndexConfigTest, FullSolrCloudDistribCmdsTest, TestDocumentBuilder, LukeRequestHandlerTest, SuggesterTest, TestQueryUtils, StatsComponentTest, PrimUtilsTest, SoftAutoCommitTest, IndexSchemaRuntimeFieldTest, EchoParamsTest, TestFunctionQuery, DocumentAnalysisRequestHandlerTest, TestCSVLoader, ShowFileRequestHandlerTest, TestQuerySenderListener, TermVectorComponentDistributedTest, TestPropInjectDefaults, TestCharFilters, TestMergePolicyConfig, BasicDistributedZk2Test]
[junit4:junit4] Completed on J1 in 307.18s, 1 test, 1 failure <<< FAILURES!

[...truncated 408 lines...]
BUILD FAILED
/usr/home/hudson/hudson-slave/workspace/Lucene-Solr-NightlyTests-4.x/build.xml:32: The following error occurred while executing this line:
/usr/home/hudson/hudson-slave/workspace/Lucene-Solr-NightlyTests-4.x/solr/build.xml:146: The following error occurred while executing this line:
/usr/home/hudson/hudson-slave/workspace/Lucene-Solr-NightlyTests-4.x/lucene/module-build.xml:63: The following error occurred while executing this line:
/usr/home/hudson/hudson-slave/workspace/Lucene-Solr-NightlyTests-4.x/lucene/common-build.xml:1140: The following error occurred while executing this line:
/usr/home/hudson/hudson-slave/workspace/Lucene-Solr-NightlyTests-4.x/lucene/common-build.xml:813: There were test failures: 230 suites, 951 tests, 1 failure, 7 ignored (2 assumptions)

Total time: 71 minutes 41 seconds
Build step 'Invoke Ant' marked build as failure
Recording test results
Email was triggered for: Failure
Sending email for trigger: Failure



Mime
View raw message