lucene-dev mailing list archives

Site index · List index
Message view « Date » · « Thread »
Top « Date » · « Thread »
From Apache Jenkins Server <jenk...@builds.apache.org>
Subject [JENKINS] Lucene-Solr-Tests-trunk-Java6 - Build # 15233 - Still Failing
Date Sat, 15 Sep 2012 01:54:23 GMT
Build: https://builds.apache.org/job/Lucene-Solr-Tests-trunk-Java6/15233/

2 tests failed.
REGRESSION:  org.apache.solr.cloud.BasicDistributedZk2Test.testDistribSearch

Error Message:
Shard still reported as live in zk

Stack Trace:
java.lang.AssertionError: Shard still reported as live in zk
	at __randomizedtesting.SeedInfo.seed([CFE9EB562D78B952:4E0F654E5A27D96E]:0)
	at org.junit.Assert.fail(Assert.java:93)
	at org.apache.solr.cloud.AbstractFullDistribZkTestBase.waitToSeeNotLive(AbstractFullDistribZkTestBase.java:1215)
	at org.apache.solr.cloud.BasicDistributedZk2Test.brindDownShardIndexSomeDocsAndRecover(BasicDistributedZk2Test.java:190)
	at org.apache.solr.cloud.BasicDistributedZk2Test.doTest(BasicDistributedZk2Test.java:83)
	at org.apache.solr.BaseDistributedSearchTestCase.testDistribSearch(BaseDistributedSearchTestCase.java:691)
	at sun.reflect.NativeMethodAccessorImpl.invoke0(Native Method)
	at sun.reflect.NativeMethodAccessorImpl.invoke(NativeMethodAccessorImpl.java:57)
	at sun.reflect.DelegatingMethodAccessorImpl.invoke(DelegatingMethodAccessorImpl.java:43)
	at java.lang.reflect.Method.invoke(Method.java:616)
	at com.carrotsearch.randomizedtesting.RandomizedRunner.invoke(RandomizedRunner.java:1559)
	at com.carrotsearch.randomizedtesting.RandomizedRunner.access$600(RandomizedRunner.java:79)
	at com.carrotsearch.randomizedtesting.RandomizedRunner$6.evaluate(RandomizedRunner.java:737)
	at com.carrotsearch.randomizedtesting.RandomizedRunner$7.evaluate(RandomizedRunner.java:773)
	at com.carrotsearch.randomizedtesting.RandomizedRunner$8.evaluate(RandomizedRunner.java:787)
	at com.carrotsearch.randomizedtesting.rules.SystemPropertiesRestoreRule$1.evaluate(SystemPropertiesRestoreRule.java:53)
	at org.apache.lucene.util.TestRuleSetupTeardownChained$1.evaluate(TestRuleSetupTeardownChained.java:50)
	at org.apache.lucene.util.TestRuleFieldCacheSanity$1.evaluate(TestRuleFieldCacheSanity.java:51)
	at org.apache.lucene.util.AbstractBeforeAfterRule$1.evaluate(AbstractBeforeAfterRule.java:45)
	at com.carrotsearch.randomizedtesting.rules.SystemPropertiesInvariantRule$1.evaluate(SystemPropertiesInvariantRule.java:55)
	at org.apache.lucene.util.TestRuleThreadAndTestName$1.evaluate(TestRuleThreadAndTestName.java:48)
	at org.apache.lucene.util.TestRuleIgnoreAfterMaxFailures$1.evaluate(TestRuleIgnoreAfterMaxFailures.java:70)
	at org.apache.lucene.util.TestRuleMarkFailure$1.evaluate(TestRuleMarkFailure.java:48)
	at com.carrotsearch.randomizedtesting.rules.StatementAdapter.evaluate(StatementAdapter.java:36)
	at com.carrotsearch.randomizedtesting.ThreadLeakControl$StatementRunner.run(ThreadLeakControl.java:358)
	at com.carrotsearch.randomizedtesting.ThreadLeakControl.forkTimeoutingTask(ThreadLeakControl.java:782)
	at com.carrotsearch.randomizedtesting.ThreadLeakControl$3.evaluate(ThreadLeakControl.java:442)
	at com.carrotsearch.randomizedtesting.RandomizedRunner.runSingleTest(RandomizedRunner.java:746)
	at com.carrotsearch.randomizedtesting.RandomizedRunner$3.evaluate(RandomizedRunner.java:648)
	at com.carrotsearch.randomizedtesting.RandomizedRunner$4.evaluate(RandomizedRunner.java:682)
	at com.carrotsearch.randomizedtesting.RandomizedRunner$5.evaluate(RandomizedRunner.java:693)
	at com.carrotsearch.randomizedtesting.rules.StatementAdapter.evaluate(StatementAdapter.java:36)
	at com.carrotsearch.randomizedtesting.rules.SystemPropertiesRestoreRule$1.evaluate(SystemPropertiesRestoreRule.java:53)
	at org.apache.lucene.util.AbstractBeforeAfterRule$1.evaluate(AbstractBeforeAfterRule.java:45)
	at org.apache.lucene.util.TestRuleStoreClassName$1.evaluate(TestRuleStoreClassName.java:42)
	at com.carrotsearch.randomizedtesting.rules.SystemPropertiesInvariantRule$1.evaluate(SystemPropertiesInvariantRule.java:55)
	at com.carrotsearch.randomizedtesting.rules.NoShadowingOrOverridesOnMethodsRule$1.evaluate(NoShadowingOrOverridesOnMethodsRule.java:39)
	at com.carrotsearch.randomizedtesting.rules.NoShadowingOrOverridesOnMethodsRule$1.evaluate(NoShadowingOrOverridesOnMethodsRule.java:39)
	at com.carrotsearch.randomizedtesting.rules.StatementAdapter.evaluate(StatementAdapter.java:36)
	at org.apache.lucene.util.TestRuleAssertionsRequired$1.evaluate(TestRuleAssertionsRequired.java:43)
	at org.apache.lucene.util.TestRuleMarkFailure$1.evaluate(TestRuleMarkFailure.java:48)
	at org.apache.lucene.util.TestRuleIgnoreAfterMaxFailures$1.evaluate(TestRuleIgnoreAfterMaxFailures.java:70)
	at org.apache.lucene.util.TestRuleIgnoreTestSuites$1.evaluate(TestRuleIgnoreTestSuites.java:55)
	at com.carrotsearch.randomizedtesting.rules.StatementAdapter.evaluate(StatementAdapter.java:36)
	at com.carrotsearch.randomizedtesting.ThreadLeakControl$StatementRunner.run(ThreadLeakControl.java:358)
	at java.lang.Thread.run(Thread.java:679)


FAILED:  org.apache.solr.update.SolrCmdDistributorTest.testDistribSearch

Error Message:


Stack Trace:
java.util.concurrent.RejectedExecutionException
	at __randomizedtesting.SeedInfo.seed([CFE9EB562D78B952:4E0F654E5A27D96E]:0)
	at java.util.concurrent.ThreadPoolExecutor$AbortPolicy.rejectedExecution(ThreadPoolExecutor.java:1956)
	at java.util.concurrent.ThreadPoolExecutor.reject(ThreadPoolExecutor.java:816)
	at java.util.concurrent.ThreadPoolExecutor.execute(ThreadPoolExecutor.java:1337)
	at java.util.concurrent.ExecutorCompletionService.submit(ExecutorCompletionService.java:181)
	at org.apache.solr.update.SolrCmdDistributor.submit(SolrCmdDistributor.java:356)
	at org.apache.solr.update.SolrCmdDistributor.submit(SolrCmdDistributor.java:301)
	at org.apache.solr.update.SolrCmdDistributor.flushAdds(SolrCmdDistributor.java:233)
	at org.apache.solr.update.SolrCmdDistributor.distribAdd(SolrCmdDistributor.java:147)
	at org.apache.solr.update.SolrCmdDistributorTest.doTest(SolrCmdDistributorTest.java:204)
	at org.apache.solr.BaseDistributedSearchTestCase.testDistribSearch(BaseDistributedSearchTestCase.java:691)
	at sun.reflect.NativeMethodAccessorImpl.invoke0(Native Method)
	at sun.reflect.NativeMethodAccessorImpl.invoke(NativeMethodAccessorImpl.java:57)
	at sun.reflect.DelegatingMethodAccessorImpl.invoke(DelegatingMethodAccessorImpl.java:43)
	at java.lang.reflect.Method.invoke(Method.java:616)
	at com.carrotsearch.randomizedtesting.RandomizedRunner.invoke(RandomizedRunner.java:1559)
	at com.carrotsearch.randomizedtesting.RandomizedRunner.access$600(RandomizedRunner.java:79)
	at com.carrotsearch.randomizedtesting.RandomizedRunner$6.evaluate(RandomizedRunner.java:737)
	at com.carrotsearch.randomizedtesting.RandomizedRunner$7.evaluate(RandomizedRunner.java:773)
	at com.carrotsearch.randomizedtesting.RandomizedRunner$8.evaluate(RandomizedRunner.java:787)
	at com.carrotsearch.randomizedtesting.rules.SystemPropertiesRestoreRule$1.evaluate(SystemPropertiesRestoreRule.java:53)
	at org.apache.lucene.util.TestRuleSetupTeardownChained$1.evaluate(TestRuleSetupTeardownChained.java:50)
	at org.apache.lucene.util.TestRuleFieldCacheSanity$1.evaluate(TestRuleFieldCacheSanity.java:51)
	at org.apache.lucene.util.AbstractBeforeAfterRule$1.evaluate(AbstractBeforeAfterRule.java:45)
	at com.carrotsearch.randomizedtesting.rules.SystemPropertiesInvariantRule$1.evaluate(SystemPropertiesInvariantRule.java:55)
	at org.apache.lucene.util.TestRuleThreadAndTestName$1.evaluate(TestRuleThreadAndTestName.java:48)
	at org.apache.lucene.util.TestRuleIgnoreAfterMaxFailures$1.evaluate(TestRuleIgnoreAfterMaxFailures.java:70)
	at org.apache.lucene.util.TestRuleMarkFailure$1.evaluate(TestRuleMarkFailure.java:48)
	at com.carrotsearch.randomizedtesting.rules.StatementAdapter.evaluate(StatementAdapter.java:36)
	at com.carrotsearch.randomizedtesting.ThreadLeakControl$StatementRunner.run(ThreadLeakControl.java:358)
	at com.carrotsearch.randomizedtesting.ThreadLeakControl.forkTimeoutingTask(ThreadLeakControl.java:782)
	at com.carrotsearch.randomizedtesting.ThreadLeakControl$3.evaluate(ThreadLeakControl.java:442)
	at com.carrotsearch.randomizedtesting.RandomizedRunner.runSingleTest(RandomizedRunner.java:746)
	at com.carrotsearch.randomizedtesting.RandomizedRunner$3.evaluate(RandomizedRunner.java:648)
	at com.carrotsearch.randomizedtesting.RandomizedRunner$4.evaluate(RandomizedRunner.java:682)
	at com.carrotsearch.randomizedtesting.RandomizedRunner$5.evaluate(RandomizedRunner.java:693)
	at com.carrotsearch.randomizedtesting.rules.StatementAdapter.evaluate(StatementAdapter.java:36)
	at com.carrotsearch.randomizedtesting.rules.SystemPropertiesRestoreRule$1.evaluate(SystemPropertiesRestoreRule.java:53)
	at org.apache.lucene.util.AbstractBeforeAfterRule$1.evaluate(AbstractBeforeAfterRule.java:45)
	at org.apache.lucene.util.TestRuleStoreClassName$1.evaluate(TestRuleStoreClassName.java:42)
	at com.carrotsearch.randomizedtesting.rules.SystemPropertiesInvariantRule$1.evaluate(SystemPropertiesInvariantRule.java:55)
	at com.carrotsearch.randomizedtesting.rules.NoShadowingOrOverridesOnMethodsRule$1.evaluate(NoShadowingOrOverridesOnMethodsRule.java:39)
	at com.carrotsearch.randomizedtesting.rules.NoShadowingOrOverridesOnMethodsRule$1.evaluate(NoShadowingOrOverridesOnMethodsRule.java:39)
	at com.carrotsearch.randomizedtesting.rules.StatementAdapter.evaluate(StatementAdapter.java:36)
	at org.apache.lucene.util.TestRuleAssertionsRequired$1.evaluate(TestRuleAssertionsRequired.java:43)
	at org.apache.lucene.util.TestRuleMarkFailure$1.evaluate(TestRuleMarkFailure.java:48)
	at org.apache.lucene.util.TestRuleIgnoreAfterMaxFailures$1.evaluate(TestRuleIgnoreAfterMaxFailures.java:70)
	at org.apache.lucene.util.TestRuleIgnoreTestSuites$1.evaluate(TestRuleIgnoreTestSuites.java:55)
	at com.carrotsearch.randomizedtesting.rules.StatementAdapter.evaluate(StatementAdapter.java:36)
	at com.carrotsearch.randomizedtesting.ThreadLeakControl$StatementRunner.run(ThreadLeakControl.java:358)
	at java.lang.Thread.run(Thread.java:679)




Build Log:
[...truncated 7190 lines...]
[junit4:junit4] Suite: org.apache.solr.cloud.BasicDistributedZk2Test
[junit4:junit4]   2> 3 T566 oas.SolrTestCaseJ4.setUp ###Starting testDistribSearch
[junit4:junit4]   2> Creating dataDir: /usr/home/hudson/hudson-slave/workspace/Lucene-Solr-Tests-trunk-Java6/solr/build/solr-core/test/J1/./solrtest-BasicDistributedZk2Test-1347673224881
[junit4:junit4]   2> 4 T566 oasc.ZkTestServer.run STARTING ZK TEST SERVER
[junit4:junit4]   2> 7 T567 oazs.ZooKeeperServer.setTickTime tickTime set to 1000
[junit4:junit4]   2> 8 T567 oazs.NIOServerCnxn$Factory.<init> binding to port 0.0.0.0/0.0.0.0:0
[junit4:junit4]   2> 9 T567 oazsp.FileTxnSnapLog.save Snapshotting: 0
[junit4:junit4]   2> 105 T566 oasc.ZkTestServer.run start zk server on port:16173
[junit4:junit4]   2> 105 T566 oaz.ZooKeeper.<init> Initiating client connection, connectString=127.0.0.1:16173 sessionTimeout=10000 watcher=org.apache.solr.common.cloud.ConnectionManager@1711c350
[junit4:junit4]   2> 106 T572 oaz.ClientCnxn$SendThread.startConnect Opening socket connection to server /127.0.0.1:16173
[junit4:junit4]   2> 106 T566 oascc.ConnectionManager.waitForConnected Waiting for client to connect to ZooKeeper
[junit4:junit4]   2> 107 T572 oaz.ClientCnxn$SendThread.primeConnection Socket connection established to localhost/127.0.0.1:16173, initiating session
[junit4:junit4]   2> 108 T568 oazs.NIOServerCnxn$Factory.run Accepted socket connection from /140.211.11.196:16288
[junit4:junit4]   2> 108 T568 oazs.NIOServerCnxn.readConnectRequest Client attempting to establish new session at /140.211.11.196:16288
[junit4:junit4]   2> 108 T570 oazsp.FileTxnLog.append Creating new log file: log.1
[junit4:junit4]   2> 111 T570 oazs.NIOServerCnxn.finishSessionInit Established session 0x139c79576b70000 with negotiated timeout 10000 for client /140.211.11.196:16288
[junit4:junit4]   2> 111 T572 oaz.ClientCnxn$SendThread.readConnectResult Session establishment complete on server localhost/127.0.0.1:16173, sessionid = 0x139c79576b70000, negotiated timeout = 10000
[junit4:junit4]   2> 111 T573 oascc.ConnectionManager.process Watcher org.apache.solr.common.cloud.ConnectionManager@1711c350 name:ZooKeeperConnection Watcher:127.0.0.1:16173 got event WatchedEvent state:SyncConnected type:None path:null path:null type:None
[junit4:junit4]   2> 111 T566 oascc.ConnectionManager.waitForConnected Client is connected to ZooKeeper
[junit4:junit4]   2> 112 T566 oascc.SolrZkClient.makePath makePath: /solr
[junit4:junit4]   2> 115 T571 oazs.PrepRequestProcessor.pRequest Processed session termination for sessionid: 0x139c79576b70000
[junit4:junit4]   2> 123 T573 oaz.ClientCnxn$EventThread.run EventThread shut down
[junit4:junit4]   2> 123 T566 oaz.ZooKeeper.close Session: 0x139c79576b70000 closed
[junit4:junit4]   2> 123 T568 oazs.NIOServerCnxn.closeSock Closed socket connection for client /140.211.11.196:16288 which had sessionid 0x139c79576b70000
[junit4:junit4]   2> 123 T566 oaz.ZooKeeper.<init> Initiating client connection, connectString=127.0.0.1:16173/solr sessionTimeout=10000 watcher=org.apache.solr.common.cloud.ConnectionManager@2d82bda8
[junit4:junit4]   2> 124 T574 oaz.ClientCnxn$SendThread.startConnect Opening socket connection to server /127.0.0.1:16173
[junit4:junit4]   2> 124 T566 oascc.ConnectionManager.waitForConnected Waiting for client to connect to ZooKeeper
[junit4:junit4]   2> 125 T574 oaz.ClientCnxn$SendThread.primeConnection Socket connection established to localhost/127.0.0.1:16173, initiating session
[junit4:junit4]   2> 125 T568 oazs.NIOServerCnxn$Factory.run Accepted socket connection from /140.211.11.196:14617
[junit4:junit4]   2> 125 T568 oazs.NIOServerCnxn.readConnectRequest Client attempting to establish new session at /140.211.11.196:14617
[junit4:junit4]   2> 127 T570 oazs.NIOServerCnxn.finishSessionInit Established session 0x139c79576b70001 with negotiated timeout 10000 for client /140.211.11.196:14617
[junit4:junit4]   2> 127 T574 oaz.ClientCnxn$SendThread.readConnectResult Session establishment complete on server localhost/127.0.0.1:16173, sessionid = 0x139c79576b70001, negotiated timeout = 10000
[junit4:junit4]   2> 127 T575 oascc.ConnectionManager.process Watcher org.apache.solr.common.cloud.ConnectionManager@2d82bda8 name:ZooKeeperConnection Watcher:127.0.0.1:16173/solr got event WatchedEvent state:SyncConnected type:None path:null path:null type:None
[junit4:junit4]   2> 127 T566 oascc.ConnectionManager.waitForConnected Client is connected to ZooKeeper
[junit4:junit4]   2> 127 T566 oascc.SolrZkClient.makePath makePath: /collections/collection1
[junit4:junit4]   2> 137 T566 oascc.SolrZkClient.makePath makePath: /collections/collection1/shards
[junit4:junit4]   2> 140 T566 oascc.SolrZkClient.makePath makePath: /collections/control_collection
[junit4:junit4]   2> 143 T566 oascc.SolrZkClient.makePath makePath: /collections/control_collection/shards
[junit4:junit4]   2> 151 T566 oasc.AbstractZkTestCase.putConfig put /usr/home/hudson/hudson-slave/workspace/Lucene-Solr-Tests-trunk-Java6/solr/build/solr-core/test-files/solr/collection1/conf/solrconfig.xml to /configs/conf1/solrconfig.xml
[junit4:junit4]   2> 152 T566 oascc.SolrZkClient.makePath makePath: /configs/conf1/solrconfig.xml
[junit4:junit4]   2> 165 T566 oasc.AbstractZkTestCase.putConfig put /usr/home/hudson/hudson-slave/workspace/Lucene-Solr-Tests-trunk-Java6/solr/build/solr-core/test-files/solr/collection1/conf/schema.xml to /configs/conf1/schema.xml
[junit4:junit4]   2> 165 T566 oascc.SolrZkClient.makePath makePath: /configs/conf1/schema.xml
[junit4:junit4]   2> 269 T566 oasc.AbstractZkTestCase.putConfig put /usr/home/hudson/hudson-slave/workspace/Lucene-Solr-Tests-trunk-Java6/solr/build/solr-core/test-files/solr/collection1/conf/solrconfig.xml to /configs/conf1/solrconfig.xml
[junit4:junit4]   2> 270 T566 oascc.SolrZkClient.makePath makePath: /configs/conf1/solrconfig.xml
[junit4:junit4]   2> 273 T566 oasc.AbstractZkTestCase.putConfig put /usr/home/hudson/hudson-slave/workspace/Lucene-Solr-Tests-trunk-Java6/solr/build/solr-core/test-files/solr/collection1/conf/stopwords.txt to /configs/conf1/stopwords.txt
[junit4:junit4]   2> 274 T566 oascc.SolrZkClient.makePath makePath: /configs/conf1/stopwords.txt
[junit4:junit4]   2> 283 T566 oasc.AbstractZkTestCase.putConfig put /usr/home/hudson/hudson-slave/workspace/Lucene-Solr-Tests-trunk-Java6/solr/build/solr-core/test-files/solr/collection1/conf/protwords.txt to /configs/conf1/protwords.txt
[junit4:junit4]   2> 283 T566 oascc.SolrZkClient.makePath makePath: /configs/conf1/protwords.txt
[junit4:junit4]   2> 286 T566 oasc.AbstractZkTestCase.putConfig put /usr/home/hudson/hudson-slave/workspace/Lucene-Solr-Tests-trunk-Java6/solr/build/solr-core/test-files/solr/collection1/conf/currency.xml to /configs/conf1/currency.xml
[junit4:junit4]   2> 286 T566 oascc.SolrZkClient.makePath makePath: /configs/conf1/currency.xml
[junit4:junit4]   2> 289 T566 oasc.AbstractZkTestCase.putConfig put /usr/home/hudson/hudson-slave/workspace/Lucene-Solr-Tests-trunk-Java6/solr/build/solr-core/test-files/solr/collection1/conf/open-exchange-rates.json to /configs/conf1/open-exchange-rates.json
[junit4:junit4]   2> 290 T566 oascc.SolrZkClient.makePath makePath: /configs/conf1/open-exchange-rates.json
[junit4:junit4]   2> 293 T566 oasc.AbstractZkTestCase.putConfig put /usr/home/hudson/hudson-slave/workspace/Lucene-Solr-Tests-trunk-Java6/solr/build/solr-core/test-files/solr/collection1/conf/mapping-ISOLatin1Accent.txt to /configs/conf1/mapping-ISOLatin1Accent.txt
[junit4:junit4]   2> 293 T566 oascc.SolrZkClient.makePath makePath: /configs/conf1/mapping-ISOLatin1Accent.txt
[junit4:junit4]   2> 296 T566 oasc.AbstractZkTestCase.putConfig put /usr/home/hudson/hudson-slave/workspace/Lucene-Solr-Tests-trunk-Java6/solr/build/solr-core/test-files/solr/collection1/conf/old_synonyms.txt to /configs/conf1/old_synonyms.txt
[junit4:junit4]   2> 297 T566 oascc.SolrZkClient.makePath makePath: /configs/conf1/old_synonyms.txt
[junit4:junit4]   2> 304 T566 oasc.AbstractZkTestCase.putConfig put /usr/home/hudson/hudson-slave/workspace/Lucene-Solr-Tests-trunk-Java6/solr/build/solr-core/test-files/solr/collection1/conf/synonyms.txt to /configs/conf1/synonyms.txt
[junit4:junit4]   2> 305 T566 oascc.SolrZkClient.makePath makePath: /configs/conf1/synonyms.txt
[junit4:junit4]   2> 308 T571 oazs.PrepRequestProcessor.pRequest Processed session termination for sessionid: 0x139c79576b70001
[junit4:junit4]   2> 309 T575 oaz.ClientCnxn$EventThread.run EventThread shut down
[junit4:junit4]   2> 309 T568 oazs.NIOServerCnxn.closeSock Closed socket connection for client /140.211.11.196:14617 which had sessionid 0x139c79576b70001
[junit4:junit4]   2> 309 T566 oaz.ZooKeeper.close Session: 0x139c79576b70001 closed
[junit4:junit4]   2> 311 T566 oejs.Server.doStart jetty-8.1.2.v20120308
[junit4:junit4]   2> 314 T566 oejs.AbstractConnector.doStart Started SocketConnector@0.0.0.0:12347
[junit4:junit4]   2> 315 T566 oasc.SolrResourceLoader.locateSolrHome JNDI not configured for solr (NoInitialContextEx)
[junit4:junit4]   2> 315 T566 oasc.SolrResourceLoader.locateSolrHome using system property solr.solr.home: /usr/home/hudson/hudson-slave/workspace/Lucene-Solr-Tests-trunk-Java6/solr/build/solr-core/test-files/solr
[junit4:junit4]   2> 316 T566 oasc.SolrResourceLoader.<init> new SolrResourceLoader for deduced Solr Home: '/usr/home/hudson/hudson-slave/workspace/Lucene-Solr-Tests-trunk-Java6/solr/build/solr-core/test-files/solr/'
[junit4:junit4]   2> 340 T566 oass.SolrDispatchFilter.init SolrDispatchFilter.init()
[junit4:junit4]   2> 340 T566 oasc.SolrResourceLoader.locateSolrHome JNDI not configured for solr (NoInitialContextEx)
[junit4:junit4]   2> 341 T566 oasc.SolrResourceLoader.locateSolrHome using system property solr.solr.home: /usr/home/hudson/hudson-slave/workspace/Lucene-Solr-Tests-trunk-Java6/solr/build/solr-core/test-files/solr
[junit4:junit4]   2> 341 T566 oasc.CoreContainer$Initializer.initialize looking for solr.xml: /usr/home/hudson/hudson-slave/workspace/Lucene-Solr-Tests-trunk-Java6/solr/build/solr-core/test-files/solr/solr.xml
[junit4:junit4]   2> 341 T566 oasc.CoreContainer.<init> New CoreContainer 1364393169
[junit4:junit4]   2> 342 T566 oasc.CoreContainer.load Loading CoreContainer using Solr Home: '/usr/home/hudson/hudson-slave/workspace/Lucene-Solr-Tests-trunk-Java6/solr/build/solr-core/test-files/solr/'
[junit4:junit4]   2> 342 T566 oasc.SolrResourceLoader.<init> new SolrResourceLoader for directory: '/usr/home/hudson/hudson-slave/workspace/Lucene-Solr-Tests-trunk-Java6/solr/build/solr-core/test-files/solr/'
[junit4:junit4]   2> 360 T566 oasc.CoreContainer.load Registering Log Listener
[junit4:junit4]   2> 372 T566 oasc.CoreContainer.initZooKeeper Zookeeper client=127.0.0.1:16173/solr
[junit4:junit4]   2> 372 T566 oaz.ZooKeeper.<init> Initiating client connection, connectString=127.0.0.1:16173/solr sessionTimeout=5000 watcher=org.apache.solr.common.cloud.ConnectionManager@4dcfd68c
[junit4:junit4]   2> 373 T585 oaz.ClientCnxn$SendThread.startConnect Opening socket connection to server /127.0.0.1:16173
[junit4:junit4]   2> 373 T566 oascc.ConnectionManager.waitForConnected Waiting for client to connect to ZooKeeper
[junit4:junit4]   2> 374 T585 oaz.ClientCnxn$SendThread.primeConnection Socket connection established to localhost/127.0.0.1:16173, initiating session
[junit4:junit4]   2> 375 T568 oazs.NIOServerCnxn$Factory.run Accepted socket connection from /140.211.11.196:51452
[junit4:junit4]   2> 375 T568 oazs.NIOServerCnxn.readConnectRequest Client attempting to establish new session at /140.211.11.196:51452
[junit4:junit4]   2> 376 T570 oazs.NIOServerCnxn.finishSessionInit Established session 0x139c79576b70002 with negotiated timeout 5000 for client /140.211.11.196:51452
[junit4:junit4]   2> 377 T585 oaz.ClientCnxn$SendThread.readConnectResult Session establishment complete on server localhost/127.0.0.1:16173, sessionid = 0x139c79576b70002, negotiated timeout = 5000
[junit4:junit4]   2> 377 T586 oascc.ConnectionManager.process Watcher org.apache.solr.common.cloud.ConnectionManager@4dcfd68c name:ZooKeeperConnection Watcher:127.0.0.1:16173/solr got event WatchedEvent state:SyncConnected type:None path:null path:null type:None
[junit4:junit4]   2> 377 T566 oascc.ConnectionManager.waitForConnected Client is connected to ZooKeeper
[junit4:junit4]   2> 379 T571 oazs.PrepRequestProcessor.pRequest Got user-level KeeperException when processing sessionid:0x139c79576b70002 type:create cxid:0x2 zxid:0xfffffffffffffffe txntype:unknown reqpath:n/a Error Path:/solr/overseer Error:KeeperErrorCode = NodeExists for /solr/overseer
[junit4:junit4]   2> 388 T566 oascc.SolrZkClient.makePath makePath: /live_nodes
[junit4:junit4]   2> 390 T566 oasc.ZkController.createEphemeralLiveNode Register node as live in ZooKeeper:/live_nodes/127.0.0.1:12347_solr
[junit4:junit4]   2> 391 T571 oazs.PrepRequestProcessor.pRequest Got user-level KeeperException when processing sessionid:0x139c79576b70002 type:delete cxid:0x7 zxid:0xfffffffffffffffe txntype:unknown reqpath:n/a Error Path:/solr/live_nodes/127.0.0.1:12347_solr Error:KeeperErrorCode = NoNode for /solr/live_nodes/127.0.0.1:12347_solr
[junit4:junit4]   2> 392 T566 oascc.SolrZkClient.makePath makePath: /live_nodes/127.0.0.1:12347_solr
[junit4:junit4]   2> 402 T566 oashc.HttpShardHandlerFactory.getParameter Setting socketTimeout to: 0
[junit4:junit4]   2> 402 T566 oashc.HttpShardHandlerFactory.getParameter Setting urlScheme to: http://
[junit4:junit4]   2> 402 T566 oashc.HttpShardHandlerFactory.getParameter Setting connTimeout to: 0
[junit4:junit4]   2> 403 T566 oashc.HttpShardHandlerFactory.getParameter Setting maxConnectionsPerHost to: 20
[junit4:junit4]   2> 403 T566 oashc.HttpShardHandlerFactory.getParameter Setting corePoolSize to: 0
[junit4:junit4]   2> 403 T566 oashc.HttpShardHandlerFactory.getParameter Setting maximumPoolSize to: 2147483647
[junit4:junit4]   2> 403 T566 oashc.HttpShardHandlerFactory.getParameter Setting maxThreadIdleTime to: 5
[junit4:junit4]   2> 404 T566 oashc.HttpShardHandlerFactory.getParameter Setting sizeOfQueue to: -1
[junit4:junit4]   2> 404 T566 oashc.HttpShardHandlerFactory.getParameter Setting fairnessPolicy to: false
[junit4:junit4]   2> 404 T566 oascsi.HttpClientUtil.createClient Creating new http client, config:maxConnectionsPerHost=20&maxConnections=10000&socketTimeout=0&connTimeout=0&retry=false
[junit4:junit4]   2> 416 T566 oascc.SolrZkClient.makePath makePath: /overseer_elect/election
[junit4:junit4]   2> 427 T571 oazs.PrepRequestProcessor.pRequest Got user-level KeeperException when processing sessionid:0x139c79576b70002 type:delete cxid:0x15 zxid:0xfffffffffffffffe txntype:unknown reqpath:n/a Error Path:/solr/overseer_elect/leader Error:KeeperErrorCode = NoNode for /solr/overseer_elect/leader
[junit4:junit4]   2> 428 T566 oascc.SolrZkClient.makePath makePath: /overseer_elect/leader
[junit4:junit4]   2> 439 T566 oasc.Overseer.start Overseer (id=88321112466194434-127.0.0.1:12347_solr-n_0000000000) starting
[junit4:junit4]   2> 440 T571 oazs.PrepRequestProcessor.pRequest Got user-level KeeperException when processing sessionid:0x139c79576b70002 type:create cxid:0x1a zxid:0xfffffffffffffffe txntype:unknown reqpath:n/a Error Path:/solr/overseer Error:KeeperErrorCode = NodeExists for /solr/overseer
[junit4:junit4]   2> 441 T571 oazs.PrepRequestProcessor.pRequest Got user-level KeeperException when processing sessionid:0x139c79576b70002 type:create cxid:0x1b zxid:0xfffffffffffffffe txntype:unknown reqpath:n/a Error Path:/solr/overseer Error:KeeperErrorCode = NodeExists for /solr/overseer
[junit4:junit4]   2> 442 T571 oazs.PrepRequestProcessor.pRequest Got user-level KeeperException when processing sessionid:0x139c79576b70002 type:create cxid:0x1c zxid:0xfffffffffffffffe txntype:unknown reqpath:n/a Error Path:/solr/overseer Error:KeeperErrorCode = NodeExists for /solr/overseer
[junit4:junit4]   2> 451 T571 oazs.PrepRequestProcessor.pRequest Got user-level KeeperException when processing sessionid:0x139c79576b70002 type:create cxid:0x1d zxid:0xfffffffffffffffe txntype:unknown reqpath:n/a Error Path:/solr/overseer Error:KeeperErrorCode = NodeExists for /solr/overseer
[junit4:junit4]   2> 453 T588 oasc.OverseerCollectionProcessor.run Process current queue of collection creations
[junit4:junit4]   2> 453 T566 oascc.SolrZkClient.makePath makePath: /clusterstate.json
[junit4:junit4]   2> 462 T566 oascc.ZkStateReader.createClusterStateWatchersAndUpdate Updating cluster state from ZooKeeper... 
[junit4:junit4]   2> 468 T566 oasc.CoreContainer.create Creating SolrCore 'collection1' using instanceDir: /usr/home/hudson/hudson-slave/workspace/Lucene-Solr-Tests-trunk-Java6/solr/build/solr-core/test-files/solr/collection1
[junit4:junit4]   2> 468 T566 oasc.ZkController.createCollectionZkNode Check for collection zkNode:control_collection
[junit4:junit4]   2> 468 T587 oasc.Overseer$ClusterStateUpdater.run Starting to work on the main queue
[junit4:junit4]   2> 469 T566 oasc.ZkController.createCollectionZkNode Collection zkNode exists
[junit4:junit4]   2> 469 T566 oasc.ZkController.readConfigName Load collection config from:/collections/control_collection
[junit4:junit4]   2> 470 T566 oasc.SolrResourceLoader.<init> new SolrResourceLoader for directory: '/usr/home/hudson/hudson-slave/workspace/Lucene-Solr-Tests-trunk-Java6/solr/build/solr-core/test-files/solr/collection1/'
[junit4:junit4]   2> 471 T566 oasc.SolrResourceLoader.replaceClassLoader Adding 'file:/usr/home/hudson/hudson-slave/workspace/Lucene-Solr-Tests-trunk-Java6/solr/build/solr-core/test-files/solr/collection1/lib/README' to classloader
[junit4:junit4]   2> 472 T566 oasc.SolrResourceLoader.replaceClassLoader Adding 'file:/usr/home/hudson/hudson-slave/workspace/Lucene-Solr-Tests-trunk-Java6/solr/build/solr-core/test-files/solr/collection1/lib/classes/' to classloader
[junit4:junit4]   2> 537 T566 oasc.SolrConfig.<init> Using Lucene MatchVersion: LUCENE_50
[junit4:junit4]   2> 632 T566 oasc.SolrConfig.<init> Loaded SolrConfig: solrconfig.xml
[junit4:junit4]   2> 733 T566 oass.IndexSchema.readSchema Reading Solr Schema
[junit4:junit4]   2> 742 T566 oass.IndexSchema.readSchema Schema name=test
[junit4:junit4]   2> 1174 T566 oass.OpenExchangeRatesOrgProvider.init Initialized with rates=open-exchange-rates.json, refreshInterval=1440.
[junit4:junit4]   2> 1183 T566 oass.IndexSchema.readSchema default search field in schema is text
[junit4:junit4]   2> 1187 T566 oass.IndexSchema.readSchema unique key field: id
[junit4:junit4]   2> 1203 T566 oass.FileExchangeRateProvider.reload Reloading exchange rates from file currency.xml
[junit4:junit4]   2> 1208 T566 oass.FileExchangeRateProvider.reload Reloading exchange rates from file currency.xml
[junit4:junit4]   2> 1212 T566 oass.OpenExchangeRatesOrgProvider.reload Reloading exchange rates from open-exchange-rates.json
[junit4:junit4]   2> 1213 T566 oass.OpenExchangeRatesOrgProvider.reload Reloading exchange rates from open-exchange-rates.json
[junit4:junit4]   2> 1214 T566 oasc.SolrCore.<init> [collection1] Opening new SolrCore at /usr/home/hudson/hudson-slave/workspace/Lucene-Solr-Tests-trunk-Java6/solr/build/solr-core/test-files/solr/collection1/, dataDir=./org.apache.solr.cloud.BasicDistributedZk2Test-1347673224880/control/data/
[junit4:junit4]   2> 1215 T566 oasc.JmxMonitoredMap.<init> JMX monitoring is enabled. Adding Solr mbeans to JMX Server: com.sun.jmx.mbeanserver.JmxMBeanServer@558041e0
[junit4:junit4]   2> 1238 T566 oasc.SolrCore.getNewIndexDir WARNING New index directory detected: old=null new=./org.apache.solr.cloud.BasicDistributedZk2Test-1347673224880/control/data/index/
[junit4:junit4]   2> 1240 T566 oasc.SolrCore.initIndex WARNING [collection1] Solr index directory './org.apache.solr.cloud.BasicDistributedZk2Test-1347673224880/control/data/index' doesn't exist. Creating new index...
[junit4:junit4]   2> 1240 T566 oasc.CachingDirectoryFactory.get return new directory for /usr/home/hudson/hudson-slave/workspace/Lucene-Solr-Tests-trunk-Java6/solr/build/solr-core/test/J1/./org.apache.solr.cloud.BasicDistributedZk2Test-1347673224880/control/data/index forceNew:false
[junit4:junit4]   2> 1245 T566 oasc.SolrDeletionPolicy.onCommit SolrDeletionPolicy.onCommit: commits:num=1
[junit4:junit4]   2> 		commit{dir=NRTCachingDirectory(org.apache.lucene.store.NIOFSDirectory@/usr/home/hudson/hudson-slave/workspace/Lucene-Solr-Tests-trunk-Java6/solr/build/solr-core/test/J1/org.apache.solr.cloud.BasicDistributedZk2Test-1347673224880/control/data/index lockFactory=org.apache.lucene.store.NativeFSLockFactory@18b198d1; maxCacheMB=48.0 maxMergeSizeMB=4.0),segFN=segments_1,generation=1,filenames=[segments_1]
[junit4:junit4]   2> 1246 T566 oasc.SolrDeletionPolicy.updateCommits newest commit = 1
[junit4:junit4]   2> 1247 T566 oasc.SolrCore.initWriters created xml: solr.XMLResponseWriter
[junit4:junit4]   2> 1248 T566 oasup.UpdateRequestProcessorChain.init inserting DistributedUpdateProcessorFactory into updateRequestProcessorChain "dedupe"
[junit4:junit4]   2> 1249 T566 oasup.UpdateRequestProcessorChain.init inserting DistributedUpdateProcessorFactory into updateRequestProcessorChain "dedupe-allfields"
[junit4:junit4]   2> 1249 T566 oasup.UpdateRequestProcessorChain.init inserting DistributedUpdateProcessorFactory into updateRequestProcessorChain "stored_sig"
[junit4:junit4]   2> 1249 T566 oasup.UpdateRequestProcessorChain.init inserting DistributedUpdateProcessorFactory into updateRequestProcessorChain "uniq-fields"
[junit4:junit4]   2> 1250 T566 oasup.UpdateRequestProcessorChain.init inserting DistributedUpdateProcessorFactory into updateRequestProcessorChain "distrib-dup-test-chain-implicit"
[junit4:junit4]   2> 1250 T566 oasc.RequestHandlers.initHandlersFromConfig adding lazy requestHandler: solr.ReplicationHandler
[junit4:junit4]   2> 1250 T566 oasc.RequestHandlers.initHandlersFromConfig created /replication: solr.ReplicationHandler
[junit4:junit4]   2> 1251 T566 oasc.RequestHandlers.initHandlersFromConfig created standard: solr.StandardRequestHandler
[junit4:junit4]   2> 1251 T566 oasc.RequestHandlers.initHandlersFromConfig created /get: solr.RealTimeGetHandler
[junit4:junit4]   2> 1252 T566 oasc.RequestHandlers.initHandlersFromConfig created dismax: solr.SearchHandler
[junit4:junit4]   2> 1252 T566 oasc.RequestHandlers.initHandlersFromConfig created mock: org.apache.solr.core.MockQuerySenderListenerReqHandler
[junit4:junit4]   2> 1253 T566 oasc.RequestHandlers.initHandlersFromConfig created /admin/: org.apache.solr.handler.admin.AdminHandlers
[junit4:junit4]   2> 1253 T566 oasc.RequestHandlers.initHandlersFromConfig created defaults: solr.StandardRequestHandler
[junit4:junit4]   2> 1253 T566 oasc.RequestHandlers.initHandlersFromConfig adding lazy requestHandler: solr.StandardRequestHandler
[junit4:junit4]   2> 1254 T566 oasc.RequestHandlers.initHandlersFromConfig created lazy: solr.StandardRequestHandler
[junit4:junit4]   2> 1254 T566 oasc.RequestHandlers.initHandlersFromConfig created /update: solr.UpdateRequestHandler
[junit4:junit4]   2> 1254 T566 oasc.RequestHandlers.initHandlersFromConfig created /terms: org.apache.solr.handler.component.SearchHandler
[junit4:junit4]   2> 1255 T566 oasc.RequestHandlers.initHandlersFromConfig created spellCheckCompRH: org.apache.solr.handler.component.SearchHandler
[junit4:junit4]   2> 1255 T566 oasc.RequestHandlers.initHandlersFromConfig created spellCheckCompRH_Direct: org.apache.solr.handler.component.SearchHandler
[junit4:junit4]   2> 1256 T566 oasc.RequestHandlers.initHandlersFromConfig created spellCheckWithWordbreak: org.apache.solr.handler.component.SearchHandler
[junit4:junit4]   2> 1256 T566 oasc.RequestHandlers.initHandlersFromConfig created spellCheckWithWordbreak_Direct: org.apache.solr.handler.component.SearchHandler
[junit4:junit4]   2> 1257 T566 oasc.RequestHandlers.initHandlersFromConfig created spellCheckCompRH1: org.apache.solr.handler.component.SearchHandler
[junit4:junit4]   2> 1257 T566 oasc.RequestHandlers.initHandlersFromConfig created tvrh: org.apache.solr.handler.component.SearchHandler
[junit4:junit4]   2> 1257 T566 oasc.RequestHandlers.initHandlersFromConfig created /mlt: solr.MoreLikeThisHandler
[junit4:junit4]   2> 1258 T566 oasc.RequestHandlers.initHandlersFromConfig created /debug/dump: solr.DumpRequestHandler
[junit4:junit4]   2> 1260 T566 oashl.XMLLoader.init xsltCacheLifetimeSeconds=60
[junit4:junit4]   2> 1264 T566 oasc.SolrCore.initDeprecatedSupport WARNING solrconfig.xml uses deprecated <admin/gettableFiles>, Please update your config to use the ShowFileRequestHandler.
[junit4:junit4]   2> 1265 T566 oasc.SolrCore.initDeprecatedSupport WARNING adding ShowFileRequestHandler with hidden files: [SCHEMA.XML, OLD_SYNONYMS.TXT, STOPWORDS.TXT, PROTWORDS.TXT, OPEN-EXCHANGE-RATES.JSON, SYNONYMS.TXT, CURRENCY.XML, MAPPING-ISOLATIN1ACCENT.TXT]
[junit4:junit4]   2> 1268 T566 oass.SolrIndexSearcher.<init> Opening Searcher@7b034f45 main
[junit4:junit4]   2> 1269 T566 oasu.CommitTracker.<init> Hard AutoCommit: disabled
[junit4:junit4]   2> 1270 T566 oasu.CommitTracker.<init> Soft AutoCommit: disabled
[junit4:junit4]   2> 1270 T566 oashc.SpellCheckComponent.inform Initializing spell checkers
[junit4:junit4]   2> 1286 T566 oass.DirectSolrSpellChecker.init init: {name=direct,classname=DirectSolrSpellChecker,field=lowerfilt,minQueryLength=3}
[junit4:junit4]   2> 1341 T589 oasc.SolrCore.registerSearcher [collection1] Registered new searcher Searcher@7b034f45 main{StandardDirectoryReader(segments_1:1)}
[junit4:junit4]   2> 1344 T571 oazs.PrepRequestProcessor.pRequest Got user-level KeeperException when processing sessionid:0x139c79576b70002 type:create cxid:0x53 zxid:0xfffffffffffffffe txntype:unknown reqpath:n/a Error Path:/solr/overseer/queue Error:KeeperErrorCode = NoNode for /solr/overseer/queue
[junit4:junit4]   2> 1356 T566 oasc.CoreContainer.register registering core: collection1
[junit4:junit4]   2> 1357 T566 oasc.ZkController.register Register shard - core:collection1 address:http://127.0.0.1:12347/solr shardId:control_shard
[junit4:junit4]   2> 1357 T566 oascc.SolrZkClient.makePath makePath: /collections/control_collection/leader_elect/control_shard/election
[junit4:junit4]   2> 1373 T571 oazs.PrepRequestProcessor.pRequest Got user-level KeeperException when processing sessionid:0x139c79576b70002 type:delete cxid:0x62 zxid:0xfffffffffffffffe txntype:unknown reqpath:n/a Error Path:/solr/collections/control_collection/leaders Error:KeeperErrorCode = NoNode for /solr/collections/control_collection/leaders
[junit4:junit4]   2> 1374 T566 oasc.ShardLeaderElectionContext.runLeaderProcess Running the leader process.
[junit4:junit4]   2> 1375 T571 oazs.PrepRequestProcessor.pRequest Got user-level KeeperException when processing sessionid:0x139c79576b70002 type:create cxid:0x63 zxid:0xfffffffffffffffe txntype:unknown reqpath:n/a Error Path:/solr/overseer Error:KeeperErrorCode = NodeExists for /solr/overseer
[junit4:junit4]   2> 1474 T587 oascc.ZkStateReader.updateClusterState Updating cloud state from ZooKeeper... 
[junit4:junit4]   2> 1475 T571 oazs.PrepRequestProcessor.pRequest Got user-level KeeperException when processing sessionid:0x139c79576b70002 type:create cxid:0x6a zxid:0xfffffffffffffffe txntype:unknown reqpath:n/a Error Path:/solr/overseer/queue-work Error:KeeperErrorCode = NoNode for /solr/overseer/queue-work
[junit4:junit4]   2> 1493 T586 oascc.ZkStateReader$2.process A cluster state change has occurred - updating...
[junit4:junit4]   2> 1884 T566 oasc.ShardLeaderElectionContext.waitForReplicasToComeUp Enough replicas found to continue.
[junit4:junit4]   2> 1885 T566 oasc.ShardLeaderElectionContext.runLeaderProcess I may be the new leader - try and sync
[junit4:junit4]   2> 1885 T566 oasc.SyncStrategy.sync Sync replicas to http://127.0.0.1:12347/solr/collection1/
[junit4:junit4]   2> 1886 T566 oasc.SyncStrategy.syncReplicas Sync Success - now sync replicas to me
[junit4:junit4]   2> 1886 T566 oasc.SyncStrategy.syncToMe http://127.0.0.1:12347/solr/collection1/ has no replicas
[junit4:junit4]   2> 1886 T566 oasc.ShardLeaderElectionContext.runLeaderProcess I am the new leader: http://127.0.0.1:12347/solr/collection1/
[junit4:junit4]   2> 1887 T566 oascc.SolrZkClient.makePath makePath: /collections/control_collection/leaders/control_shard
[junit4:junit4]   2> 1900 T571 oazs.PrepRequestProcessor.pRequest Got user-level KeeperException when processing sessionid:0x139c79576b70002 type:create cxid:0x88 zxid:0xfffffffffffffffe txntype:unknown reqpath:n/a Error Path:/solr/overseer Error:KeeperErrorCode = NodeExists for /solr/overseer
[junit4:junit4]   2> 1997 T587 oascc.ZkStateReader.updateClusterState Updating cloud state from ZooKeeper... 
[junit4:junit4]   2> 2011 T586 oascc.ZkStateReader$2.process A cluster state change has occurred - updating...
[junit4:junit4]   2> 2055 T566 oasc.ZkController.register We are http://127.0.0.1:12347/solr/collection1/ and leader is http://127.0.0.1:12347/solr/collection1/
[junit4:junit4]   2> 2055 T566 oasc.ZkController.register No LogReplay needed for core=collection1 baseURL=http://127.0.0.1:12347/solr
[junit4:junit4]   2> 2055 T566 oasc.ZkController.checkRecovery I am the leader, no recovery necessary
[junit4:junit4]   2> 2057 T566 oascc.ZkStateReader.updateClusterState Updating cloud state from ZooKeeper... 
[junit4:junit4]   2> 2058 T566 oass.SolrDispatchFilter.init user.dir=/usr/home/hudson/hudson-slave/workspace/Lucene-Solr-Tests-trunk-Java6/solr/build/solr-core/test/J1
[junit4:junit4]   2> 2058 T566 oass.SolrDispatchFilter.init SolrDispatchFilter.init() done
[junit4:junit4]   2> 2059 T566 oascsi.HttpClientUtil.createClient Creating new http client, config:maxConnections=128&maxConnectionsPerHost=32&followRedirects=false
[junit4:junit4]   2> 2071 T566 oejs.Server.doStart jetty-8.1.2.v20120308
[junit4:junit4]   2> 2088 T566 oejs.AbstractConnector.doStart Started SocketConnector@0.0.0.0:23908
[junit4:junit4]   2> 2089 T566 oasc.SolrResourceLoader.locateSolrHome JNDI not configured for solr (NoInitialContextEx)
[junit4:junit4]   2> 2090 T566 oasc.SolrResourceLoader.locateSolrHome using system property solr.solr.home: /usr/home/hudson/hudson-slave/workspace/Lucene-Solr-Tests-trunk-Java6/solr/build/solr-core/test-files/solr
[junit4:junit4]   2> 2091 T566 oasc.SolrResourceLoader.<init> new SolrResourceLoader for deduced Solr Home: '/usr/home/hudson/hudson-slave/workspace/Lucene-Solr-Tests-trunk-Java6/solr/build/solr-core/test-files/solr/'
[junit4:junit4]   2> 2133 T566 oass.SolrDispatchFilter.init SolrDispatchFilter.init()
[junit4:junit4]   2> 2134 T566 oasc.SolrResourceLoader.locateSolrHome JNDI not configured for solr (NoInitialContextEx)
[junit4:junit4]   2> 2135 T566 oasc.SolrResourceLoader.locateSolrHome using system property solr.solr.home: /usr/home/hudson/hudson-slave/workspace/Lucene-Solr-Tests-trunk-Java6/solr/build/solr-core/test-files/solr
[junit4:junit4]   2> 2135 T566 oasc.CoreContainer$Initializer.initialize looking for solr.xml: /usr/home/hudson/hudson-slave/workspace/Lucene-Solr-Tests-trunk-Java6/solr/build/solr-core/test-files/solr/solr.xml
[junit4:junit4]   2> 2135 T566 oasc.CoreContainer.<init> New CoreContainer 1083452325
[junit4:junit4]   2> 2136 T566 oasc.CoreContainer.load Loading CoreContainer using Solr Home: '/usr/home/hudson/hudson-slave/workspace/Lucene-Solr-Tests-trunk-Java6/solr/build/solr-core/test-files/solr/'
[junit4:junit4]   2> 2137 T566 oasc.SolrResourceLoader.<init> new SolrResourceLoader for directory: '/usr/home/hudson/hudson-slave/workspace/Lucene-Solr-Tests-trunk-Java6/solr/build/solr-core/test-files/solr/'
[junit4:junit4]   2> 2164 T566 oasc.CoreContainer.load Registering Log Listener
[junit4:junit4]   2> 2181 T566 oasc.CoreContainer.initZooKeeper Zookeeper client=127.0.0.1:16173/solr
[junit4:junit4]   2> 2181 T566 oaz.ZooKeeper.<init> Initiating client connection, connectString=127.0.0.1:16173/solr sessionTimeout=5000 watcher=org.apache.solr.common.cloud.ConnectionManager@31cd133f
[junit4:junit4]   2> 2183 T599 oaz.ClientCnxn$SendThread.startConnect Opening socket connection to server /127.0.0.1:16173
[junit4:junit4]   2> 2182 T566 oascc.ConnectionManager.waitForConnected Waiting for client to connect to ZooKeeper
[junit4:junit4]   2> 2184 T599 oaz.ClientCnxn$SendThread.primeConnection Socket connection established to localhost/127.0.0.1:16173, initiating session
[junit4:junit4]   2> 2184 T568 oazs.NIOServerCnxn$Factory.run Accepted socket connection from /140.211.11.196:44674
[junit4:junit4]   2> 2185 T568 oazs.NIOServerCnxn.readConnectRequest Client attempting to establish new session at /140.211.11.196:44674
[junit4:junit4]   2> 2186 T570 oazs.NIOServerCnxn.finishSessionInit Established session 0x139c79576b70003 with negotiated timeout 5000 for client /140.211.11.196:44674
[junit4:junit4]   2> 2186 T599 oaz.ClientCnxn$SendThread.readConnectResult Session establishment complete on server localhost/127.0.0.1:16173, sessionid = 0x139c79576b70003, negotiated timeout = 5000
[junit4:junit4]   2> 2186 T600 oascc.ConnectionManager.process Watcher org.apache.solr.common.cloud.ConnectionManager@31cd133f name:ZooKeeperConnection Watcher:127.0.0.1:16173/solr got event WatchedEvent state:SyncConnected type:None path:null path:null type:None
[junit4:junit4]   2> 2187 T566 oascc.ConnectionManager.waitForConnected Client is connected to ZooKeeper
[junit4:junit4]   2> 2188 T571 oazs.PrepRequestProcessor.pRequest Got user-level KeeperException when processing sessionid:0x139c79576b70003 type:create cxid:0x1 zxid:0xfffffffffffffffe txntype:unknown reqpath:n/a Error Path:/solr/overseer Error:KeeperErrorCode = NodeExists for /solr/overseer
[junit4:junit4]   2> 2189 T571 oazs.PrepRequestProcessor.pRequest Got user-level KeeperException when processing sessionid:0x139c79576b70003 type:create cxid:0x2 zxid:0xfffffffffffffffe txntype:unknown reqpath:n/a Error Path:/solr/overseer Error:KeeperErrorCode = NodeExists for /solr/overseer
[junit4:junit4]   2> 2226 T566 oasc.ZkController.createEphemeralLiveNode Register node as live in ZooKeeper:/live_nodes/127.0.0.1:23908_solr
[junit4:junit4]   2> 2227 T571 oazs.PrepRequestProcessor.pRequest Got user-level KeeperException when processing sessionid:0x139c79576b70003 type:delete cxid:0x4 zxid:0xfffffffffffffffe txntype:unknown reqpath:n/a Error Path:/solr/live_nodes/127.0.0.1:23908_solr Error:KeeperErrorCode = NoNode for /solr/live_nodes/127.0.0.1:23908_solr
[junit4:junit4]   2> 2229 T566 oascc.SolrZkClient.makePath makePath: /live_nodes/127.0.0.1:23908_solr
[junit4:junit4]   2> 2231 T586 oascc.ZkStateReader$3.process Updating live nodes
[junit4:junit4]   2> 2232 T566 oashc.HttpShardHandlerFactory.getParameter Setting socketTimeout to: 0
[junit4:junit4]   2> 2232 T566 oashc.HttpShardHandlerFactory.getParameter Setting urlScheme to: http://
[junit4:junit4]   2> 2233 T566 oashc.HttpShardHandlerFactory.getParameter Setting connTimeout to: 0
[junit4:junit4]   2> 2233 T566 oashc.HttpShardHandlerFactory.getParameter Setting maxConnectionsPerHost to: 20
[junit4:junit4]   2> 2234 T566 oashc.HttpShardHandlerFactory.getParameter Setting corePoolSize to: 0
[junit4:junit4]   2> 2234 T566 oashc.HttpShardHandlerFactory.getParameter Setting maximumPoolSize to: 2147483647
[junit4:junit4]   2> 2235 T566 oashc.HttpShardHandlerFactory.getParameter Setting maxThreadIdleTime to: 5
[junit4:junit4]   2> 2235 T566 oashc.HttpShardHandlerFactory.getParameter Setting sizeOfQueue to: -1
[junit4:junit4]   2> 2235 T566 oashc.HttpShardHandlerFactory.getParameter Setting fairnessPolicy to: false
[junit4:junit4]   2> 2236 T566 oascsi.HttpClientUtil.createClient Creating new http client, config:maxConnectionsPerHost=20&maxConnections=10000&socketTimeout=0&connTimeout=0&retry=false
[junit4:junit4]   2> 2279 T566 oascc.ZkStateReader.createClusterStateWatchersAndUpdate Updating cluster state from ZooKeeper... 
[junit4:junit4]   2> 2286 T566 oasc.CoreContainer.create Creating SolrCore 'collection1' using instanceDir: /usr/home/hudson/hudson-slave/workspace/Lucene-Solr-Tests-trunk-Java6/solr/build/solr-core/test-files/solr/collection1
[junit4:junit4]   2> 2287 T566 oasc.ZkController.createCollectionZkNode Check for collection zkNode:collection1
[junit4:junit4]   2> 2288 T566 oasc.ZkController.createCollectionZkNode Collection zkNode exists
[junit4:junit4]   2> 2288 T566 oasc.ZkController.readConfigName Load collection config from:/collections/collection1
[junit4:junit4]   2> 2289 T566 oasc.SolrResourceLoader.<init> new SolrResourceLoader for directory: '/usr/home/hudson/hudson-slave/workspace/Lucene-Solr-Tests-trunk-Java6/solr/build/solr-core/test-files/solr/collection1/'
[junit4:junit4]   2> 2291 T566 oasc.SolrResourceLoader.replaceClassLoader Adding 'file:/usr/home/hudson/hudson-slave/workspace/Lucene-Solr-Tests-trunk-Java6/solr/build/solr-core/test-files/solr/collection1/lib/README' to classloader
[junit4:junit4]   2> 2292 T566 oasc.SolrResourceLoader.replaceClassLoader Adding 'file:/usr/home/hudson/hudson-slave/workspace/Lucene-Solr-Tests-trunk-Java6/solr/build/solr-core/test-files/solr/collection1/lib/classes/' to classloader
[junit4:junit4]   2> 2348 T566 oasc.SolrConfig.<init> Using Lucene MatchVersion: LUCENE_50
[junit4:junit4]   2> 2424 T566 oasc.SolrConfig.<init> Loaded SolrConfig: solrconfig.xml
[junit4:junit4]   2> 2515 T587 oascc.ZkStateReader.updateClusterState Updating cloud state from ZooKeeper... 
[junit4:junit4]   2> 2525 T566 oass.IndexSchema.readSchema Reading Solr Schema
[junit4:junit4]   2> 2527 T600 oascc.ZkStateReader$2.process A cluster state change has occurred - updating...
[junit4:junit4]   2> 2527 T586 oascc.ZkStateReader$2.process A cluster state change has occurred - updating...
[junit4:junit4]   2> 2544 T566 oass.IndexSchema.readSchema Schema name=test
[junit4:junit4]   2> 3005 T566 oass.OpenExchangeRatesOrgProvider.init Initialized with rates=open-exchange-rates.json, refreshInterval=1440.
[junit4:junit4]   2> 3013 T566 oass.IndexSchema.readSchema default search field in schema is text
[junit4:junit4]   2> 3016 T566 oass.IndexSchema.readSchema unique key field: id
[junit4:junit4]   2> 3029 T566 oass.FileExchangeRateProvider.reload Reloading exchange rates from file currency.xml
[junit4:junit4]   2> 3033 T566 oass.FileExchangeRateProvider.reload Reloading exchange rates from file currency.xml
[junit4:junit4]   2> 3036 T566 oass.OpenExchangeRatesOrgProvider.reload Reloading exchange rates from open-exchange-rates.json
[junit4:junit4]   2> 3037 T566 oass.OpenExchangeRatesOrgProvider.reload Reloading exchange rates from open-exchange-rates.json
[junit4:junit4]   2> 3039 T566 oasc.SolrCore.<init> [collection1] Opening new SolrCore at /usr/home/hudson/hudson-slave/workspace/Lucene-Solr-Tests-trunk-Java6/solr/build/solr-core/test-files/solr/collection1/, dataDir=./org.apache.solr.cloud.BasicDistributedZk2Test-1347673224880/jetty1/
[junit4:junit4]   2> 3039 T566 oasc.JmxMonitoredMap.<init> JMX monitoring is enabled. Adding Solr mbeans to JMX Server: com.sun.jmx.mbeanserver.JmxMBeanServer@558041e0
[junit4:junit4]   2> 3040 T566 oasc.SolrCore.getNewIndexDir WARNING New index directory detected: old=null new=./org.apache.solr.cloud.BasicDistributedZk2Test-1347673224880/jetty1/index/
[junit4:junit4]   2> 3041 T566 oasc.SolrCore.initIndex WARNING [collection1] Solr index directory './org.apache.solr.cloud.BasicDistributedZk2Test-1347673224880/jetty1/index' doesn't exist. Creating new index...
[junit4:junit4]   2> 3041 T566 oasc.CachingDirectoryFactory.get return new directory for /usr/home/hudson/hudson-slave/workspace/Lucene-Solr-Tests-trunk-Java6/solr/build/solr-core/test/J1/./org.apache.solr.cloud.BasicDistributedZk2Test-1347673224880/jetty1/index forceNew:false
[junit4:junit4]   2> 3053 T566 oasc.SolrDeletionPolicy.onCommit SolrDeletionPolicy.onCommit: commits:num=1
[junit4:junit4]   2> 		commit{dir=NRTCachingDirectory(org.apache.lucene.store.NIOFSDirectory@/usr/home/hudson/hudson-slave/workspace/Lucene-Solr-Tests-trunk-Java6/solr/build/solr-core/test/J1/org.apache.solr.cloud.BasicDistributedZk2Test-1347673224880/jetty1/index lockFactory=org.apache.lucene.store.NativeFSLockFactory@3d8d0720; maxCacheMB=48.0 maxMergeSizeMB=4.0),segFN=segments_1,generation=1,filenames=[segments_1]
[junit4:junit4]   2> 3053 T566 oasc.SolrDeletionPolicy.updateCommits newest commit = 1
[junit4:junit4]   2> 3054 T566 oasc.SolrCore.initWriters created xml: solr.XMLResponseWriter
[junit4:junit4]   2> 3056 T566 oasup.UpdateRequestProcessorChain.init inserting DistributedUpdateProcessorFactory into updateRequestProcessorChain "dedupe"
[junit4:junit4]   2> 3056 T566 oasup.UpdateRequestProcessorChain.init inserting DistributedUpdateProcessorFactory into updateRequestProcessorChain "dedupe-allfields"
[junit4:junit4]   2> 3056 T566 oasup.UpdateRequestProcessorChain.init inserting DistributedUpdateProcessorFactory into updateRequestProcessorChain "stored_sig"
[junit4:junit4]   2> 3057 T566 oasup.UpdateRequestProcessorChain.init inserting DistributedUpdateProcessorFactory into updateRequestProcessorChain "uniq-fields"
[junit4:junit4]   2> 3057 T566 oasup.UpdateRequestProcessorChain.init inserting DistributedUpdateProcessorFactory into updateRequestProcessorChain "distrib-dup-test-chain-implicit"
[junit4:junit4]   2> 3058 T566 oasc.RequestHandlers.initHandlersFromConfig adding lazy requestHandler: solr.ReplicationHandler
[junit4:junit4]   2> 3058 T566 oasc.RequestHandlers.initHandlersFromConfig created /replication: solr.ReplicationHandler
[junit4:junit4]   2> 3058 T566 oasc.RequestHandlers.initHandlersFromConfig created standard: solr.StandardRequestHandler
[junit4:junit4]   2> 3059 T566 oasc.RequestHandlers.initHandlersFromConfig created /get: solr.RealTimeGetHandler
[junit4:junit4]   2> 3059 T566 oasc.RequestHandlers.initHandlersFromConfig created dismax: solr.SearchHandler
[junit4:junit4]   2> 3060 T566 oasc.RequestHandlers.initHandlersFromConfig created mock: org.apache.solr.core.MockQuerySenderListenerReqHandler
[junit4:junit4]   2> 3060 T566 oasc.RequestHandlers.initHandlersFromConfig created /admin/: org.apache.solr.handler.admin.AdminHandlers
[junit4:junit4]   2> 3061 T566 oasc.RequestHandlers.initHandlersFromConfig created defaults: solr.StandardRequestHandler
[junit4:junit4]   2> 3061 T566 oasc.RequestHandlers.initHandlersFromConfig adding lazy requestHandler: solr.StandardRequestHandler
[junit4:junit4]   2> 3062 T566 oasc.RequestHandlers.initHandlersFromConfig created lazy: solr.StandardRequestHandler
[junit4:junit4]   2> 3062 T566 oasc.RequestHandlers.initHandlersFromConfig created /update: solr.UpdateRequestHandler
[junit4:junit4]   2> 3062 T566 oasc.RequestHandlers.initHandlersFromConfig created /terms: org.apache.solr.handler.component.SearchHandler
[junit4:junit4]   2> 3063 T566 oasc.RequestHandlers.initHandlersFromConfig created spellCheckCompRH: org.apache.solr.handler.component.SearchHandler
[junit4:junit4]   2> 3063 T566 oasc.RequestHandlers.initHandlersFromConfig created spellCheckCompRH_Direct: org.apache.solr.handler.component.SearchHandler
[junit4:junit4]   2> 3064 T566 oasc.RequestHandlers.initHandlersFromConfig created spellCheckWithWordbreak: org.apache.solr.handler.component.SearchHandler
[junit4:junit4]   2> 3064 T566 oasc.RequestHandlers.initHandlersFromConfig created spellCheckWithWordbreak_Direct: org.apache.solr.handler.component.SearchHandler
[junit4:junit4]   2> 3065 T566 oasc.RequestHandlers.initHandlersFromConfig created spellCheckCompRH1: org.apache.solr.handler.component.SearchHandler
[junit4:junit4]   2> 3065 T566 oasc.RequestHandlers.initHandlersFromConfig created tvrh: org.apache.solr.handler.component.SearchHandler
[junit4:junit4]   2> 3066 T566 oasc.RequestHandlers.initHandlersFromConfig created /mlt: solr.MoreLikeThisHandler
[junit4:junit4]   2> 3066 T566 oasc.RequestHandlers.initHandlersFromConfig created /debug/dump: solr.DumpRequestHandler
[junit4:junit4]   2> 3069 T566 oashl.XMLLoader.init xsltCacheLifetimeSeconds=60
[junit4:junit4]   2> 3073 T566 oasc.SolrCore.initDeprecatedSupport WARNING solrconfig.xml uses deprecated <admin/gettableFiles>, Please update your config to use the ShowFileRequestHandler.
[junit4:junit4]   2> 3074 T566 oasc.SolrCore.initDeprecatedSupport WARNING adding ShowFileRequestHandler with hidden files: [SCHEMA.XML, OLD_SYNONYMS.TXT, STOPWORDS.TXT, PROTWORDS.TXT, OPEN-EXCHANGE-RATES.JSON, SYNONYMS.TXT, CURRENCY.XML, MAPPING-ISOLATIN1ACCENT.TXT]
[junit4:junit4]   2> 3077 T566 oass.SolrIndexSearcher.<init> Opening Searcher@ae46d8b main
[junit4:junit4]   2> 3078 T566 oasu.CommitTracker.<init> Hard AutoCommit: disabled
[junit4:junit4]   2> 3078 T566 oasu.CommitTracker.<init> Soft AutoCommit: disabled
[junit4:junit4]   2> 3079 T566 oashc.SpellCheckComponent.inform Initializing spell checkers
[junit4:junit4]   2> 3095 T566 oass.DirectSolrSpellChecker.init init: {name=direct,classname=DirectSolrSpellChecker,field=lowerfilt,minQueryLength=3}
[junit4:junit4]   2> 3147 T601 oasc.SolrCore.registerSearcher [collection1] Registered new searcher Searcher@ae46d8b main{StandardDirectoryReader(segments_1:1)}
[junit4:junit4]   2> 3543 T587 oascc.ZkStateReader.updateClusterState Updating cloud state from ZooKeeper... 
[junit4:junit4]   2> 3557 T600 oascc.ZkStateReader$2.process A cluster state change has occurred - updating...
[junit4:junit4]   2> 3557 T586 oascc.ZkStateReader$2.process A cluster state change has occurred - updating...
[junit4:junit4]   2> 3656 T566 oasc.CoreContainer.register registering core: collection1
[junit4:junit4]   2> 3656 T566 oasc.ZkController.register Register shard - core:collection1 address:http://127.0.0.1:23908/solr shardId:shard1
[junit4:junit4]   2> 3657 T566 oascc.SolrZkClient.makePath makePath: /collections/collection1/leader_elect/shard1/election
[junit4:junit4]   2> 3673 T571 oazs.PrepRequestProcessor.pRequest Got user-level KeeperException when processing sessionid:0x139c79576b70003 type:delete cxid:0x43 zxid:0xfffffffffffffffe txntype:unknown reqpath:n/a Error Path:/solr/collections/collection1/leaders Error:KeeperErrorCode = NoNode for /solr/collections/collection1/leaders
[junit4:junit4]   2> 3674 T566 oasc.ShardLeaderElectionContext.runLeaderProcess Running the leader process.
[junit4:junit4]   2> 3674 T571 oazs.PrepRequestProcessor.pRequest Got user-level KeeperException when processing sessionid:0x139c79576b70003 type:create cxid:0x44 zxid:0xfffffffffffffffe txntype:unknown reqpath:n/a Error Path:/solr/overseer Error:KeeperErrorCode = NodeExists for /solr/overseer
[junit4:junit4]   2> 3676 T566 oasc.ShardLeaderElectionContext.waitForReplicasToComeUp Enough replicas found to continue.
[junit4:junit4]   2> 3676 T566 oasc.ShardLeaderElectionContext.runLeaderProcess I may be the new leader - try and sync
[junit4:junit4]   2> 3677 T566 oasc.SyncStrategy.sync Sync replicas to http://127.0.0.1:23908/solr/collection1/
[junit4:junit4]   2> 3677 T566 oasc.SyncStrategy.syncReplicas Sync Success - now sync replicas to me
[junit4:junit4]   2> 3677 T566 oasc.SyncStrategy.syncToMe http://127.0.0.1:23908/solr/collection1/ has no replicas
[junit4:junit4]   2> 3678 T566 oasc.ShardLeaderElectionContext.runLeaderProcess I am the new leader: http://127.0.0.1:23908/solr/collection1/
[junit4:junit4]   2> 3678 T566 oascc.SolrZkClient.makePath makePath: /collections/collection1/leaders/shard1
[junit4:junit4]   2> 3682 T571 oazs.PrepRequestProcessor.pRequest Got user-level KeeperException when processing sessionid:0x139c79576b70003 type:create cxid:0x4e zxid:0xfffffffffffffffe txntype:unknown reqpath:n/a Error Path:/solr/overseer Error:KeeperErrorCode = NodeExists for /solr/overseer
[junit4:junit4]   2> 4062 T587 oascc.ZkStateReader.updateClusterState Updating cloud state from ZooKeeper... 
[junit4:junit4]   2> 4078 T586 oascc.ZkStateReader$2.process A cluster state change has occurred - updating...
[junit4:junit4]   2> 4078 T600 oascc.ZkStateReader$2.process A cluster state change has occurred - updating...
[junit4:junit4]   2> 4091 T566 oasc.ZkController.register We are http://127.0.0.1:23908/solr/collection1/ and leader is http://127.0.0.1:23908/solr/collection1/
[junit4:junit4]   2> 4091 T566 oasc.ZkController.register No LogReplay needed for core=collection1 baseURL=http://127.0.0.1:23908/solr
[junit4:junit4]   2> 4091 T566 oasc.ZkController.checkRecovery I am the leader, no recovery necessary
[junit4:junit4]   2> 4094 T566 oascc.ZkStateReader.updateClusterState Updating cloud state from ZooKeeper... 
[junit4:junit4]   2> 4094 T566 oass.SolrDispatchFilter.init user.dir=/usr/home/hudson/hudson-slave/workspace/Lucene-Solr-Tests-trunk-Java6/solr/build/solr-core/test/J1
[junit4:junit4]   2> 4095 T566 oass.SolrDispatchFilter.init SolrDispatchFilter.init() done
[junit4:junit4]   2> 4095 T566 oascsi.HttpClientUtil.createClient Creating new http client, config:maxConnections=128&maxConnectionsPerHost=32&followRedirects=false
[junit4:junit4]   2> 4107 T566 oejs.Server.doStart jetty-8.1.2.v20120308
[junit4:junit4]   2> 4109 T566 oejs.AbstractConnector.doStart Started SocketConnector@0.0.0.0:18317
[junit4:junit4]   2> 4109 T566 oasc.SolrResourceLoader.locateSolrHome JNDI not configured for solr (NoInitialContextEx)
[junit4:junit4]   2> 4109 T566 oasc.SolrResourceLoader.locateSolrHome using system property solr.solr.home: /usr/home/hudson/hudson-slave/workspace/Lucene-Solr-Tests-trunk-Java6/solr/build/solr-core/test-files/solr
[junit4:junit4]   2> 4110 T566 oasc.SolrResourceLoader.<init> new SolrResourceLoader for deduced Solr Home: '/usr/home/hudson/hudson-slave/workspace/Lucene-Solr-Tests-trunk-Java6/solr/build/solr-core/test-files/solr/'
[junit4:junit4]   2> 4139 T566 oass.SolrDispatchFilter.init SolrDispatchFilter.init()
[junit4:junit4]   2> 4139 T566 oasc.SolrResourceLoader.locateSolrHome JNDI not configured for solr (NoInitialContextEx)
[junit4:junit4]   2> 4140 T566 oasc.SolrResourceLoader.locateSolrHome using system property solr.solr.home: /usr/home/hudson/hudson-slave/workspace/Lucene-Solr-Tests-trunk-Java6/solr/build/solr-core/test-files/solr
[junit4:junit4]   2> 4140 T566 oasc.CoreContainer$Initializer.initialize looking for solr.xml: /usr/home/hudson/hudson-slave/workspace/Lucene-Solr-Tests-trunk-Java6/solr/build/solr-core/test-files/solr/solr.xml
[junit4:junit4]   2> 4140 T566 oasc.CoreContainer.<init> New CoreContainer 116094078
[junit4:junit4]   2> 4141 T566 oasc.CoreContainer.load Loading CoreContainer using Solr Home: '/usr/home/hudson/hudson-slave/workspace/Lucene-Solr-Tests-trunk-Java6/solr/build/solr-core/test-files/solr/'
[junit4:junit4]   2> 4141 T566 oasc.SolrResourceLoader.<init> new SolrResourceLoader for directory: '/usr/home/hudson/hudson-slave/workspace/Lucene-Solr-Tests-trunk-Java6/solr/build/solr-core/test-files/solr/'
[junit4:junit4]   2> 4158 T566 oasc.CoreContainer.load Registering Log Listener
[junit4:junit4]   2> 4170 T566 oasc.CoreContainer.initZooKeeper Zookeeper client=127.0.0.1:16173/solr
[junit4:junit4]   2> 4170 T566 oaz.ZooKeeper.<init> Initiating client connection, connectString=127.0.0.1:16173/solr sessionTimeout=5000 watcher=org.apache.solr.common.cloud.ConnectionManager@1e4a3a04
[junit4:junit4]   2> 4171 T611 oaz.ClientCnxn$SendThread.startConnect Opening socket connection to server /127.0.0.1:16173
[junit4:junit4]   2> 4171 T566 oascc.ConnectionManager.waitForConnected Waiting for client to connect to ZooKeeper
[junit4:junit4]   2> 4172 T611 oaz.ClientCnxn$SendThread.primeConnection Socket connection established to localhost/127.0.0.1:16173, initiating session
[junit4:junit4]   2> 4172 T568 oazs.NIOServerCnxn$Factory.run Accepted socket connection from /140.211.11.196:22009
[junit4:junit4]   2> 4172 T568 oazs.NIOServerCnxn.readConnectRequest Client attempting to establish new session at /140.211.11.196:22009
[junit4:junit4]   2> 4174 T570 oazs.NIOServerCnxn.finishSessionInit Established session 0x139c79576b70004 with negotiated timeout 5000 for client /140.211.11.196:22009
[junit4:junit4]   2> 4174 T611 oaz.ClientCnxn$SendThread.readConnectResult Session establishment complete on server localhost/127.0.0.1:16173, sessionid = 0x139c79576b70004, negotiated timeout = 5000
[junit4:junit4]   2> 4174 T612 oascc.ConnectionManager.process Watcher org.apache.solr.common.cloud.ConnectionManager@1e4a3a04 name:ZooKeeperConnection Watcher:127.0.0.1:16173/solr got event WatchedEvent state:SyncConnected type:None path:null path:null type:None
[junit4:junit4]   2> 4174 T566 oascc.ConnectionManager.waitForConnected Client is connected to ZooKeeper
[junit4:junit4]   2> 4175 T571 oazs.PrepRequestProcessor.pRequest Got user-level KeeperException when processing sessionid:0x139c79576b70004 type:create cxid:0x1 zxid:0xfffffffffffffffe txntype:unknown reqpath:n/a Error Path:/solr/overseer Error:KeeperErrorCode = NodeExists for /solr/overseer
[junit4:junit4]   2> 4176 T571 oazs.PrepRequestProcessor.pRequest Got user-level KeeperException when processing sessionid:0x139c79576b70004 type:create cxid:0x2 zxid:0xfffffffffffffffe txntype:unknown reqpath:n/a Error Path:/solr/overseer Error:KeeperErrorCode = NodeExists for /solr/overseer
[junit4:junit4]   2> 4184 T566 oasc.ZkController.createEphemeralLiveNode Register node as live in ZooKeeper:/live_nodes/127.0.0.1:18317_solr
[junit4:junit4]   2> 4184 T571 oazs.PrepRequestProcessor.pRequest Got user-level KeeperException when processing sessionid:0x139c79576b70004 type:delete cxid:0x4 zxid:0xfffffffffffffffe txntype:unknown reqpath:n/a Error Path:/solr/live_nodes/127.0.0.1:18317_solr Error:KeeperErrorCode = NoNode for /solr/live_nodes/127.0.0.1:18317_solr
[junit4:junit4]   2> 4185 T566 oascc.SolrZkClient.makePath makePath: /live_nodes/127.0.0.1:18317_solr
[junit4:junit4]   2> 4187 T600 oascc.ZkStateReader$3.process Updating live nodes
[junit4:junit4]   2> 4187 T586 oascc.ZkStateReader$3.process Updating live nodes
[junit4:junit4]   2> 4188 T566 oashc.HttpShardHandlerFactory.getParameter Setting socketTimeout to: 0
[junit4:junit4]   2> 4188 T566 oashc.HttpShardHandlerFactory.getParameter Setting urlScheme to: http://
[junit4:junit4]   2> 4188 T566 oashc.HttpShardHandlerFactory.getParameter Setting connTimeout to: 0
[junit4:junit4]   2> 4189 T566 oashc.HttpShardHandlerFactory.getParameter Setting maxConnectionsPerHost to: 20
[junit4:junit4]   2> 4189 T566 oashc.HttpShardHandlerFactory.getParameter Setting corePoolSize to: 0
[junit4:junit4]   2> 4189 T566 oashc.HttpShardHandlerFactory.getParameter Setting maximumPoolSize to: 2147483647
[junit4:junit4]   2> 4190 T566 oashc.HttpShardHandlerFactory.getParameter Setting maxThreadIdleTime to: 5
[junit4:junit4]   2> 4190 T566 oashc.HttpShardHandlerFactory.getParameter Setting sizeOfQueue to: -1
[junit4:junit4]   2> 4190 T566 oashc.HttpShardHandlerFactory.getParameter Setting fairnessPolicy to: false
[junit4:junit4]   2> 4191 T566 oascsi.HttpClientUtil.createClient Creating new http client, config:maxConnectionsPerHost=20&maxConnections=10000&socketTimeout=0&connTimeout=0&retry=false
[junit4:junit4]   2> 4200 T566 oascc.ZkStateReader.createClusterStateWatchersAndUpdate Updating cluster state from ZooKeeper... 
[junit4:junit4]   2> 4205 T566 oasc.CoreContainer.create Creating SolrCore 'collection1' using instanceDir: /usr/home/hudson/hudson-slave/workspace/Lucene-Solr-Tests-trunk-Java6/solr/build/solr-core/test-files/solr/collection1
[junit4:junit4]   2> 4205 T566 oasc.ZkController.createCollectionZkNode Check for collection zkNode:collection1
[junit4:junit4]   2> 4206 T566 oasc.ZkController.createCollectionZkNode Collection zkNode exists
[junit4:junit4]   2> 4206 T566 oasc.ZkController.readConfigName Load collection config from:/collections/collection1
[junit4:junit4]   2> 4207 T566 oasc.SolrResourceLoader.<init> new SolrResourceLoader for directory: '/usr/home/hudson/hudson-slave/workspace/Lucene-Solr-Tests-trunk-Java6/solr/build/solr-core/test-files/solr/collection1/'
[junit4:junit4]   2> 4208 T566 oasc.SolrResourceLoader.replaceClassLoader Adding 'file:/usr/home/hudson/hudson-slave/workspace/Lucene-Solr-Tests-trunk-Java6/solr/build/solr-core/test-files/solr/collection1/lib/README' to classloader
[junit4:junit4]   2> 4209 T566 oasc.SolrResourceLoader.replaceClassLoader Adding 'file:/usr/home/hudson/hudson-slave/workspace/Lucene-Solr-Tests-trunk-Java6/solr/build/solr-core/test-files/solr/collection1/lib/classes/' to classloader
[junit4:junit4]   2> 4244 T566 oasc.SolrConfig.<init> Using Lucene MatchVersion: LUCENE_50
[junit4:junit4]   2> 4304 T566 oasc.SolrConfig.<init> Loaded SolrConfig: solrconfig.xml
[junit4:junit4]   2> 4405 T566 oass.IndexSchema.readSchema Reading Solr Schema
[junit4:junit4]   2> 4411 T566 oass.IndexSchema.readSchema Schema name=test
[junit4:junit4]   2> 4591 T587 oascc.ZkStateReader.updateClusterState Updating cloud state from ZooKeeper... 
[junit4:junit4]   2> 4604 T612 oascc.ZkStateReader$2.process A cluster state change has occurred - updating...
[junit4:junit4]   2> 4604 T586 oascc.ZkStateReader$2.process A cluster state change has occurred - updating...
[junit4:junit4]   2> 4604 T600 oascc.ZkStateReader$2.process A cluster state change has occurred - updating...
[junit4:junit4]   2> 4838 T566 oass.OpenExchangeRatesOrgProvider.init Initialized with rates=open-exchange-rates.json, refreshInterval=1440.
[junit4:junit4]   2> 4846 T566 oass.IndexSchema.readSchema default search field in schema is text
[junit4:junit4]   2> 4849 T566 oass.IndexSchema.readSchema unique key field: id
[junit4:junit4]   2> 4860 T566 oass.FileExchangeRateProvider.reload Reloading exchange rates from file currency.xml
[junit4:junit4]   2> 4864 T566 oass.FileExchangeRateProvider.reload Reloading exchange rates from file currency.xml
[junit4:junit4]   2> 4867 T566 oass.OpenExchangeRatesOrgProvider.reload Reloading exchange rates from open-exchange-rates.json
[junit4:junit4]   2> 4868 T566 oass.OpenExchangeRatesOrgProvider.reload Reloading exchange rates from open-exchange-rates.json
[junit4:junit4]   2> 4870 T566 oasc.SolrCore.<init> [collection1] Opening new SolrCore at /usr/home/hudson/hudson-slave/workspace/Lucene-Solr-Tests-trunk-Java6/solr/build/solr-core/test-files/solr/collection1/, dataDir=./org.apache.solr.cloud.BasicDistributedZk2Test-1347673224880/jetty2/
[junit4:junit4]   2> 4870 T566 oasc.JmxMonitoredMap.<init> JMX monitoring is enabled. Adding Solr mbeans to JMX Server: com.sun.jmx.mbeanserver.JmxMBeanServer@558041e0
[junit4:junit4]   2> 4871 T566 oasc.SolrCore.getNewIndexDir WARNING New index directory detected: old=null new=./org.apache.solr.cloud.BasicDistributedZk2Test-1347673224880/jetty2/index/
[junit4:junit4]   2> 4871 T566 oasc.SolrCore.initIndex WARNING [collection1] Solr index directory './org.apache.solr.cloud.BasicDistributedZk2Test-1347673224880/jetty2/index' doesn't exist. Creating new index...
[junit4:junit4]   2> 4872 T566 oasc.CachingDirectoryFactory.get return new directory for /usr/home/hudson/hudson-slave/workspace/Lucene-Solr-Tests-trunk-Java6/solr/build/solr-core/test/J1/./org.apache.solr.cloud.BasicDistributedZk2Test-1347673224880/jetty2/index forceNew:false
[junit4:junit4]   2> 4884 T566 oasc.SolrDeletionPolicy.onCommit SolrDeletionPolicy.onCommit: commits:num=1
[junit4:junit4]   2> 		commit{dir=NRTCachingDirectory(org.apache.lucene.store.NIOFSDirectory@/usr/home/hudson/hudson-slave/workspace/Lucene-Solr-Tests-trunk-Java6/solr/build/solr-core/test/J1/org.apache.solr.cloud.BasicDistributedZk2Test-1347673224880/jetty2/index lockFactory=org.apache.lucene.store.NativeFSLockFactory@74cff77f; maxCacheMB=48.0 maxMergeSizeMB=4.0),segFN=segments_1,generation=1,filenames=[segments_1]
[junit4:junit4]   2> 4885 T566 oasc.SolrDeletionPolicy.updateCommits newest commit = 1
[junit4:junit4]   2> 4885 T566 oasc.SolrCore.initWriters created xml: solr.XMLResponseWriter
[junit4:junit4]   2> 4887 T566 oasup.UpdateRequestProcessorChain.init inserting DistributedUpdateProcessorFactory into updateRequestProcessorChain "dedupe"
[junit4:junit4]   2> 4887 T566 oasup.UpdateRequestProcessorChain.init inserting DistributedUpdateProcessorFactory into updateRequestProcessorChain "dedupe-allfields"
[junit4:junit4]   2> 4888 T566 oasup.UpdateRequestProcessorChain.init inserting DistributedUpdateProcessorFactory into updateRequestProcessorChain "stored_sig"
[junit4:junit4]   2> 4888 T566 oasup.UpdateRequestProcessorChain.init inserting DistributedUpdateProcessorFactory into updateRequestProcessorChain "uniq-fields"
[junit4:junit4]   2> 4889 T566 oasup.UpdateRequestProcessorChain.init inserting DistributedUpdateProcessorFactory into updateRequestProcessorChain "distrib-dup-test-chain-implicit"
[junit4:junit4]   2> 4889 T566 oasc.RequestHandlers.initHandlersFromConfig adding lazy requestHandler: solr.ReplicationHandler
[junit4:junit4]   2> 4889 T566 oasc.RequestHandlers.initHandlersFromConfig created /replication: solr.ReplicationHandler
[junit4:junit4]   2> 4890 T566 oasc.RequestHandlers.initHandlersFromConfig created standard: solr.StandardRequestHandler
[junit4:junit4]   2> 4890 T566 oasc.RequestHandlers.initHandlersFromConfig created /get: solr.RealTimeGetHandler
[junit4:junit4]   2> 4891 T566 oasc.RequestHandlers.initHandlersFromConfig created dismax: solr.SearchHandler
[junit4:junit4]   2> 4891 T566 oasc.RequestHandlers.initHandlersFromConfig created mock: org.apache.solr.core.MockQuerySenderListenerReqHandler
[junit4:junit4]   2> 4892 T566 oasc.RequestHandlers.initHandlersFromConfig created /admin/: org.apache.solr.handler.admin.AdminHandlers
[junit4:junit4]   2> 4892 T566 oasc.RequestHandlers.initHandlersFromConfig created defaults: solr.StandardRequestHandler
[junit4:junit4]   2> 4892 T566 oasc.RequestHandlers.initHandlersFromConfig adding lazy requestHandler: solr.StandardRequestHandler
[junit4:junit4]   2> 4893 T566 oasc.RequestHandlers.initHandlersFromConfig created lazy: solr.StandardRequestHandler
[junit4:junit4]   2> 4894 T566 oasc.RequestHandlers.initHandlersFromConfig created /update: solr.UpdateRequestHandler
[junit4:junit4]   2> 4894 T566 oasc.RequestHandlers.initHandlersFromConfig created /terms: org.apache.solr.handler.component.SearchHandler
[junit4:junit4]   2> 4895 T566 oasc.RequestHandlers.initHandlersFromConfig created spellCheckCompRH: org.apache.solr.handler.component.SearchHandler
[junit4:junit4]   2> 4895 T566 oasc.RequestHandlers.initHandlersFromConfig created spellCheckCompRH_Direct: org.apache.solr.handler.component.SearchHandler
[junit4:junit4]   2> 4895 T566 oasc.RequestHandlers.initHandlersFromConfig created spellCheckWithWordbreak: org.apache.solr.handler.component.SearchHandler
[junit4:junit4]   2> 4896 T566 oasc.RequestHandlers.initHandlersFromConfig created spellCheckWithWordbreak_Direct: org.apache.solr.handler.component.SearchHandler
[junit4:junit4]   2> 4896 T566 oasc.RequestHandlers.initHandlersFromConfig created spellCheckCompRH1: org.apache.solr.handler.component.SearchHandler
[junit4:junit4]   2> 4897 T566 oasc.RequestHandlers.initHandlersFromConfig created tvrh: org.apache.solr.handler.component.SearchHandler
[junit4:junit4]   2> 4897 T566 oasc.RequestHandlers.initHandlersFromConfig created /mlt: solr.MoreLikeThisHandler
[junit4:junit4]   2> 4898 T566 oasc.RequestHandlers.initHandlersFromConfig created /debug/dump: solr.DumpRequestHandler
[junit4:junit4]   2> 4901 T566 oashl.XMLLoader.init xsltCacheLifetimeSeconds=60
[junit4:junit4]   2> 4904 T566 oasc.SolrCore.initDeprecatedSupport WARNING solrconfig.xml uses deprecated <admin/gettableFiles>, Please update your config to use the ShowFileRequestHandler.
[junit4:junit4]   2> 4905 T566 oasc.SolrCore.initDeprecatedSupport WARNING adding ShowFileRequestHandler with hidden files: [SCHEMA.XML, OLD_SYNONYMS.TXT, STOPWORDS.TXT, PROTWORDS.TXT, OPEN-EXCHANGE-RATES.JSON, SYNONYMS.TXT, CURRENCY.XML, MAPPING-ISOLATIN1ACCENT.TXT]
[junit4:junit4]   2> 4908 T566 oass.SolrIndexSearcher.<init> Opening Searcher@5d098870 main
[junit4:junit4]   2> 4909 T566 oasu.CommitTracker.<init> Hard AutoCommit: disabled
[junit4:junit4]   2> 4909 T566 oasu.CommitTracker.<init> Soft AutoCommit: disabled
[junit4:junit4]   2> 4909 T566 oashc.SpellCheckComponent.inform Initializing spell checkers
[junit4:junit4]   2> 4922 T566 oass.DirectSolrSpellChecker.init init: {name=direct,classname=DirectSolrSpellChecker,field=lowerfilt,minQueryLength=3}
[junit4:junit4]   2> 4956 T613 oasc.SolrCore.registerSearcher [collection1] Registered new searcher Searcher@5d098870 main{StandardDirectoryReader(segments_1:1)}
[junit4:junit4]   2> 5110 T587 oascc.ZkStateReader.updateClusterState Updating cloud state from ZooKeeper... 
[junit4:junit4]   2> 5122 T586 oascc.ZkStateReader$2.process A cluster state change has occurred - updating...
[junit4:junit4]   2> 5122 T612 oascc.ZkStateReader$2.process A cluster state change has occurred - updating...
[junit4:junit4]   2> 5122 T600 oascc.ZkStateReader$2.process A cluster state change has occurred - updating...
[junit4:junit4]   2> 5462 T566 oasc.CoreContainer.register registering core: collection1
[junit4:junit4]   2> 5462 T566 oasc.ZkController.register Register shard - core:collection1 address:http://127.0.0.1:18317/solr shardId:shard2
[junit4:junit4]   2> 5464 T566 oascc.SolrZkClient.makePath makePath: /collections/collection1/leader_elect/shard2/election
[junit4:junit4]   2> 5478 T571 oazs.PrepRequestProcessor.pRequest Got user-level KeeperException when processing sessionid:0x139c79576b70004 type:delete cxid:0x42 zxid:0xfffffffffffffffe txntype:unknown reqpath:n/a Error Path:/solr/collections/collection1/leaders/shard2 Error:KeeperErrorCode = NoNode for /solr/collections/collection1/leaders/shard2
[junit4:junit4]   2> 5478 T566 oasc.ShardLeaderElectionContext.runLeaderProcess Running the leader process.
[junit4:junit4]   2> 5479 T571 oazs.PrepRequestProcessor.pRequest Got user-level KeeperException when processing sessionid:0x139c79576b70004 type:create cxid:0x43 zxid:0xfffffffffffffffe txntype:unknown reqpath:n/a Error Path:/solr/overseer Error:KeeperErrorCode = NodeExists for /solr/overseer
[junit4:junit4]   2> 5489 T566 oasc.ShardLeaderElectionContext.waitForReplicasToComeUp Enough replicas found to continue.
[junit4:junit4]   2> 5489 T566 oasc.ShardLeaderElectionContext.runLeaderProcess I may be the new leader - try and sync
[junit4:junit4]   2> 5490 T566 oasc.SyncStrategy.sync Sync replicas to http://127.0.0.1:18317/solr/collection1/
[junit4:junit4]   2> 5490 T566 oasc.SyncStrategy.syncReplicas Sync Success - now sync replicas to me
[junit4:junit4]   2> 5491 T566 oasc.SyncStrategy.syncToMe http://127.0.0.1:18317/solr/collection1/ has no replicas
[junit4:junit4]   2> 5491 T566 oasc.ShardLeaderElectionContext.runLeaderProcess I am the new leader: http://127.0.0.1:18317/solr/collection1/
[junit4:junit4]   2> 5492 T566 oascc.SolrZkClient.makePath makePath: /collections/collection1/leaders/shard2
[junit4:junit4]   2> 5495 T571 oazs.PrepRequestProcessor.pRequest Got user-level KeeperException when processing sessionid:0x139c79576b70004 type:create cxid:0x4c zxid:0xfffffffffffffffe txntype:unknown reqpath:n/a Error Path:/solr/overseer Error:KeeperErrorCode = NodeExists for /solr/overseer
[junit4:junit4]   2> 5626 T587 oascc.ZkStateReader.updateClusterState Updating cloud state from ZooKeeper... 
[junit4:junit4]   2> 5643 T612 oascc.ZkStateReader$2.process A cluster state change has occurred - updating...
[junit4:junit4]   2> 5643 T600 oascc.ZkStateReader$2.process A cluster state change has occurred - updating...
[junit4:junit4]   2> 5643 T586 oascc.ZkStateReader$2.process A cluster state change has occurred - updating...
[junit4:junit4]   2> 5658 T566 oasc.ZkController.register We are http://127.0.0.1:18317/solr/collection1/ and leader is http://127.0.0.1:18317/solr/collection1/
[junit4:junit4]   2> 5658 T566 oasc.ZkController.register No LogReplay needed for core=collection1 baseURL=http://127.0.0.1:18317/solr
[junit4:junit4]   2> 5659 T566 oasc.ZkController.checkRecovery I am the leader, no recovery necessary
[junit4:junit4]   2> 5660 T566 oascc.ZkStateReader.updateClusterState Updating cloud state from ZooKeeper... 
[junit4:junit4]   2> 5661 T566 oass.SolrDispatchFilter.init user.dir=/usr/home/hudson/hudson-slave/workspace/Lucene-Solr-Tests-trunk-Java6/solr/build/solr-core/test/J1
[junit4:junit4]   2> 5662 T566 oass.SolrDispatchFilter.init SolrDispatchFilter.init() done
[junit4:junit4]   2> 5662 T566 oascsi.HttpClientUtil.createClient Creating new http client, config:maxConnections=128&maxConnectionsPerHost=32&followRedirects=false
[junit4:junit4]   2> 5678 T566 oejs.Server.doStart jetty-8.1.2.v20120308
[junit4:junit4]   2> 5681 T566 oejs.AbstractConnector.doStart Started SocketConnector@0.0.0.0:38547
[junit4:junit4]   2> 5682 T566 oasc.SolrResourceLoader.locateSolrHome JNDI not configured for solr (NoInitialContextEx)
[junit4:junit4]   2> 5682 T566 oasc.SolrResourceLoader.locateSolrHome using system property solr.solr.home: /usr/home/hudson/hudson-slave/workspace/Lucene-Solr-Tests-trunk-Java6/solr/build/solr-core/test-files/solr
[junit4:junit4]   2> 5683 T566 oasc.SolrResourceLoader.<init> new SolrResourceLoader for deduced Solr Home: '/usr/home/hudson/hudson-slave/workspace/Lucene-Solr-Tests-trunk-Java6/solr/build/solr-core/test-files/solr/'
[junit4:junit4]   2> 5721 T566 oass.SolrDispatchFilter.init SolrDispatchFilter.init()
[junit4:junit4]   2> 5721 T566 oasc.SolrResourceLoader.locateSolrHome JNDI not configured for solr (NoInitialContextEx)
[junit4:junit4]   2> 5722 T566 oasc.SolrResourceLoader.locateSolrHome using system property solr.solr.home: /usr/home/hudson/hudson-slave/workspace/Lucene-Solr-Tests-trunk-Java6/solr/build/solr-core/test-files/solr
[junit4:junit4]   2> 5722 T566 oasc.CoreContainer$Initializer.initialize looking for solr.xml: /usr/home/hudson/hudson-slave/workspace/Lucene-Solr-Tests-trunk-Java6/solr/build/solr-core/test-files/solr/solr.xml
[junit4:junit4]   2> 5722 T566 oasc.CoreContainer.<init> New CoreContainer 2134148107
[junit4:junit4]   2> 5723 T566 oasc.CoreContainer.load Loading CoreContainer using Solr Home: '/usr/home/hudson/hudson-slave/workspace/Lucene-Solr-Tests-trunk-Java6/solr/build/solr-core/test-files/solr/'
[junit4:junit4]   2> 5724 T566 oasc.SolrResourceLoader.<init> new SolrResourceLoader for directory: '/usr/home/hudson/hudson-slave/workspace/Lucene-Solr-Tests-trunk-Java6/solr/build/solr-core/test-files/solr/'
[junit4:junit4]   2> 5749 T566 oasc.CoreContainer.load Registering Log Listener
[junit4:junit4]   2> 5765 T566 oasc.CoreContainer.initZooKeeper Zookeeper client=127.0.0.1:16173/solr
[junit4:junit4]   2> 5766 T566 oaz.ZooKeeper.<init> Initiating client connection, connectString=127.0.0.1:16173/solr sessionTimeout=5000 watcher=org.apache.solr.common.cloud.ConnectionManager@4848433c
[junit4:junit4]   2> 5767 T623 oaz.ClientCnxn$SendThread.startConnect Opening socket connection to server /127.0.0.1:16173
[junit4:junit4]   2> 5767 T566 oascc.ConnectionManager.waitForConnected Waiting for client to connect to ZooKeeper
[junit4:junit4]   2> 5768 T623 oaz.ClientCnxn$SendThread.primeConnection Socket connection established to localhost/127.0.0.1:16173, initiating session
[junit4:junit4]   2> 5769 T568 oazs.NIOServerCnxn$Factory.run Accepted socket connection from /140.211.11.196:16055
[junit4:junit4]   2> 5769 T568 oazs.NIOServerCnxn.readConnectRequest Client attempting to establish new session at /140.211.11.196:16055
[junit4:junit4]   2> 5771 T570 oazs.NIOServerCnxn.finishSessionInit Established session 0x139c79576b70005 with negotiated timeout 5000 for client /140.211.11.196:16055
[junit4:junit4]   2> 5771 T623 oaz.ClientCnxn$SendThread.readConnectResult Session establishment complete on server localhost/127.0.0.1:16173, sessionid = 0x139c79576b70005, negotiated timeout = 5000
[junit4:junit4]   2> 5771 T624 oascc.ConnectionManager.process Watcher org.apache.solr.common.cloud.ConnectionManager@4848433c name:ZooKeeperConnection Watcher:127.0.0.1:16173/solr got event WatchedEvent state:SyncConnected type:None path:null path:null type:None
[junit4:junit4]   2> 5772 T566 oascc.ConnectionManager.waitForConnected Client is connected to ZooKeeper
[junit4:junit4]   2> 5772 T571 oazs.PrepRequestProcessor.pRequest Got user-level KeeperException when processing sessionid:0x139c79576b70005 type:create cxid:0x1 zxid:0xfffffffffffffffe txntype:unknown reqpath:n/a Error Path:/solr/overseer Error:KeeperErrorCode = NodeExists for /solr/overseer
[junit4:junit4]   2> 5780 T571 oazs.PrepRequestProcessor.pRequest Got user-level KeeperException when processing sessionid:0x139c79576b70005 type:create cxid:0x2 zxid:0xfffffffffffffffe txntype:unknown reqpath:n/a Error Path:/solr/overseer Error:KeeperErrorCode = NodeExists for /solr/overseer
[junit4:junit4]   2> 5781 T566 oasc.ZkController.createEphemeralLiveNode Register node as live in ZooKeeper:/live_nodes/127.0.0.1:38547_solr
[junit4:junit4]   2> 5782 T571 oazs.PrepRequestProcessor.pRequest Got user-level KeeperException when processing sessionid:0x139c79576b70005 type:delete cxid:0x4 zxid:0xfffffffffffffffe txntype:unknown reqpath:n/a Error Path:/solr/live_nodes/127.0.0.1:38547_solr Error:KeeperErrorCode = NoNode for /solr/live_nodes/127.0.0.1:38547_solr
[junit4:junit4]   2> 5783 T566 oascc.SolrZkClient.makePath makePath: /live_nodes/127.0.0.1:38547_solr
[junit4:junit4]   2> 5785 T612 oascc.ZkStateReader$3.process Updating live nodes
[junit4:junit4]   2> 5786 T600 oascc.ZkStateReader$3.process Updating live nodes
[junit4:junit4]   2> 5785 T586 oascc.ZkStateReader$3.process Updating live nodes
[junit4:junit4]   2> 5786 T566 oashc.HttpShardHandlerFactory.getParameter Setting socketTimeout to: 0
[junit4:junit4]   2> 5787 T566 oashc.HttpShardHandlerFactory.getParameter Setting urlScheme to: http://
[junit4:junit4]   2> 5787 T566 oashc.HttpShardHandlerFactory.getParameter Setting connTimeout to: 0
[junit4:junit4]   2> 5788 T566 oashc.HttpShardHandlerFactory.getParameter Setting maxConnectionsPerHost to: 20
[junit4:junit4]   2> 5788 T566 oashc.HttpShardHandlerFactory.getParameter Setting corePoolSize to: 0
[junit4:junit4]   2> 5788 T566 oashc.HttpShardHandlerFactory.getParameter Setting maximumPoolSize to: 2147483647
[junit4:junit4]   2> 5789 T566 oashc.HttpShardHandlerFactory.getParameter Setting maxThreadIdleTime to: 5
[junit4:junit4]   2> 5789 T566 oashc.HttpShardHandlerFactory.getParameter Setting sizeOfQueue to: -1
[junit4:junit4]   2> 5790 T566 oashc.HttpShardHandlerFactory.getParameter Setting fairnessPolicy to: false
[junit4:junit4]   2> 5790 T566 oascsi.HttpClientUtil.createClient Creating new http client, config:maxConnectionsPerHost=20&maxConnections=10000&socketTimeout=0&connTimeout=0&retry=false
[junit4:junit4]   2> 5803 T566 oascc.ZkStateReader.createClusterStateWatchersAndUpdate Updating cluster state from ZooKeeper... 
[junit4:junit4]   2> 5809 T566 oasc.CoreContainer.create Creating SolrCore 'collection1' using instanceDir: /usr/home/hudson/hudson-slave/workspace/Lucene-Solr-Tests-trunk-Java6/solr/build/solr-core/test-files/solr/collection1
[junit4:junit4]   2> 5810 T566 oasc.ZkController.createCollectionZkNode Check for collection zkNode:collection1
[junit4:junit4]   2> 5810 T566 oasc.ZkController.createCollectionZkNode Collection zkNode exists
[junit4:junit4]   2> 5811 T566 oasc.ZkController.readConfigName Load collection config from:/collections/collection1
[junit4:junit4]   2> 5812 T566 oasc.SolrResourceLoader.<init> new SolrResourceLoader for directory: '/usr/home/hudson/hudson-slave/workspace/Lucene-Solr-Tests-trunk-Java6/solr/build/solr-core/test-files/solr/collection1/'
[junit4:junit4]   2> 5813 T566 oasc.SolrResourceLoader.replaceClassLoader Adding 'file:/usr/home/hudson/hudson-slave/workspace/Lucene-Solr-Tests-trunk-Java6/solr/build/solr-core/test-files/solr/collection1/lib/README' to classloader
[junit4:junit4]   2> 5814 T566 oasc.SolrResourceLoader.replaceClassLoader Adding 'file:/usr/home/hudson/hudson-slave/workspace/Lucene-Solr-Tests-trunk-Java6/solr/build/solr-core/test-files/solr/collection1/lib/classes/' to classloader
[junit4:junit4]   2> 5865 T566 oasc.SolrConfig.<init> Using Lucene MatchVersion: LUCENE_50
[junit4:junit4]   2> 5940 T566 oasc.SolrConfig.<init> Loaded SolrConfig: solrconfig.xml
[junit4:junit4]   2> 6041 T566 oass.IndexSchema.readSchema Reading Solr Schema
[junit4:junit4]   2> 6050 T566 oass.IndexSchema.readSchema Schema name=test
[junit4:junit4]   2> 6156 T587 oascc.ZkStateReader.updateClusterState Updating cloud state from ZooKeeper... 
[junit4:junit4]   2> 6173 T624 oascc.ZkStateReader$2.process A cluster state change has occurred - updating...
[junit4:junit4]   2> 6173 T612 oascc.ZkStateReader$2.process A cluster state change has occurred - updating...
[junit4:junit4]   2> 6173 T600 oascc.ZkStateReader$2.process A cluster state change has occurred - updating...
[junit4:junit4]   2> 6173 T586 oascc.ZkStateReader$2.process A cluster state change has occurred - updating...
[junit4:junit4]   2> 6670 T566 oass.OpenExchangeRatesOrgProvider.init Initialized with rates=open-exchange-rates.json, refreshInterval=1440.
[junit4:junit4]   2> 6679 T566 oass.IndexSchema.readSchema default search field in schema is text
[junit4:junit4]   2> 6682 T566 oass.IndexSchema.readSchema unique key field: id
[junit4:junit4]   2> 6693 T566 oass.FileExchangeRateProvider.reload Reloading exchange rates from file currency.xml
[junit4:junit4]   2> 6697 T566 oass.FileExchangeRateProvider.reload Reloading exchange rates from file currency.xml
[junit4:junit4]   2> 6701 T566 oass.OpenExchangeRatesOrgProvider.reload Reloading exchange rates from open-exchange-rates.json
[junit4:junit4]   2> 6702 T566 oass.OpenExchangeRatesOrgProvider.reload Reloading exchange rates from open-exchange-rates.json
[junit4:junit4]   2> 6703 T566 oasc.SolrCore.<init> [collection1] Opening new SolrCore at /usr/home/hudson/hudson-slave/workspace/Lucene-Solr-Tests-trunk-Java6/solr/build/solr-core/test-files/solr/collection1/, dataDir=./org.apache.solr.cloud.BasicDistributedZk2Test-1347673224880/jetty3/
[junit4:junit4]   2> 6703 T566 oasc.JmxMonitoredMap.<init> JMX monitoring is enabled. Adding Solr mbeans to JMX Server: com.sun.jmx.mbeanserver.JmxMBeanServer@558041e0
[junit4:junit4]   2> 6704 T566 oasc.SolrCore.getNewIndexDir WARNING New index directory detected: old=null new=./org.apache.solr.cloud.BasicDistributedZk2Test-1347673224880/jetty3/index/
[junit4:junit4]   2> 6705 T566 oasc.SolrCore.initIndex WARNING [collection1] Solr index directory './org.apache.solr.cloud.BasicDistributedZk2Test-1347673224880/jetty3/index' doesn't exist. Creating new index...
[junit4:junit4]   2> 6706 T566 oasc.CachingDirectoryFactory.get return new directory for /usr/home/hudson/hudson-slave/workspace/Lucene-Solr-Tests-trunk-Java6/solr/build/solr-core/test/J1/./org.apache.solr.cloud.BasicDistributedZk2Test-1347673224880/jetty3/index forceNew:false
[junit4:junit4]   2> 6712 T566 oasc.SolrDeletionPolicy.onCommit SolrDeletionPolicy.onCommit: commits:num=1
[junit4:junit4]   2> 		commit{dir=NRTCachingDirectory(org.apache.lucene.store.NIOFSDirectory@/usr/home/hudson/hudson-slave/workspace/Lucene-Solr-Tests-trunk-Java6/solr/build/solr-core/test/J1/org.apache.solr.cloud.BasicDistributedZk2Test-1347673224880/jetty3/index lockFactory=org.apache.lucene.store.NativeFSLockFactory@7d33dbab; maxCacheMB=48.0 maxMergeSizeMB=4.0),segFN=segments_1,generation=1,filenames=[segments_1]
[junit4:junit4]   2> 6712 T566 oasc.SolrDeletionPolicy.updateCommits newest commit = 1
[junit4:junit4]   2> 6713 T566 oasc.SolrCore.initWriters created xml: solr.XMLResponseWriter
[junit4:junit4]   2> 6714 T566 oasup.UpdateRequestProcessorChain.init inserting DistributedUpdateProcessorFactory into updateRequestProcessorChain "dedupe"
[junit4:junit4]   2> 6715 T566 oasup.UpdateRequestProcessorChain.init inserting DistributedUpdateProcessorFactory into updateRequestProcessorChain "dedupe-allfields"
[junit4:junit4]   2> 6715 T566 oasup.UpdateRequestProcessorChain.init inserting DistributedUpdateProcessorFactory into updateRequestProcessorChain "stored_sig"
[junit4:junit4]   2> 6716 T566 oasup.UpdateRequestProcessorChain.init inserting DistributedUpdateProcessorFactory into updateRequestProcessorChain "uniq-fields"
[junit4:junit4]   2> 6716 T566 oasup.UpdateRequestProcessorChain.init inserting DistributedUpdateProcessorFactory into updateRequestProcessorChain "distrib-dup-test-chain-implicit"
[junit4:junit4]   2> 6716 T566 oasc.RequestHandlers.initHandlersFromConfig adding lazy requestHandler: solr.ReplicationHandler
[junit4:junit4]   2> 6717 T566 oasc.RequestHandlers.initHandlersFromConfig created /replication: solr.ReplicationHandler
[junit4:junit4]   2> 6717 T566 oasc.RequestHandlers.initHandlersFromConfig created standard: solr.StandardRequestHandler
[junit4:junit4]   2> 6718 T566 oasc.RequestHandlers.initHandlersFromConfig created /get: solr.RealTimeGetHandler
[junit4:junit4]   2> 6718 T566 oasc.RequestHandlers.initHandlersFromConfig created dismax: solr.SearchHandler
[junit4:junit4]   2> 6719 T566 oasc.RequestHandlers.initHandlersFromConfig created mock: org.apache.solr.core.MockQuerySenderListenerReqHandler
[junit4:junit4]   2> 6719 T566 oasc.RequestHandlers.initHandlersFromConfig created /admin/: org.apache.solr.handler.admin.AdminHandlers
[junit4:junit4]   2> 6720 T566 oasc.RequestHandlers.initHandlersFromConfig created defaults: solr.StandardRequestHandler
[junit4:junit4]   2> 6720 T566 oasc.RequestHandlers.initHandlersFromConfig adding lazy requestHandler: solr.StandardRequestHandler
[junit4:junit4]   2> 6720 T566 oasc.RequestHandlers.initHandlersFromConfig created lazy: solr.StandardRequestHandler
[junit4:junit4]   2> 6721 T566 oasc.RequestHandlers.initHandlersFromConfig created /update: solr.UpdateRequestHandler
[junit4:junit4]   2> 6721 T566 oasc.RequestHandlers.initHandlersFromConfig created /terms: org.apache.solr.handler.component.SearchHandler
[junit4:junit4]   2> 6722 T566 oasc.RequestHandlers.initHandlersFromConfig created spellCheckCompRH: org.apache.solr.handler.component.SearchHandler
[junit4:junit4]   2> 6722 T566 oasc.RequestHandlers.initHandlersFromConfig created spellCheckCompRH_Direct: org.apache.solr.handler.component.SearchHandler
[junit4:junit4]   2> 6723 T566 oasc.RequestHandlers.initHandlersFromConfig created spellCheckWithWordbreak: org.apache.solr.handler.component.SearchHandler
[junit4:junit4]   2> 6723 T566 oasc.RequestHandlers.initHandlersFromConfig created spellCheckWithWordbreak_Direct: org.apache.solr.handler.component.SearchHandler
[junit4:junit4]   2> 6724 T566 oasc.RequestHandlers.initHandlersFromConfig created spellCheckCompRH1: org.apache.solr.handler.component.SearchHandler
[junit4:junit4]   2> 6724 T566 oasc.RequestHandlers.initHandlersFromConfig created tvrh: org.apache.solr.handler.component.SearchHandler
[junit4:junit4]   2> 6725 T566 oasc.RequestHandlers.initHandlersFromConfig created /mlt: solr.MoreLikeThisHandler
[junit4:junit4]   2> 6725 T566 oasc.RequestHandlers.initHandlersFromConfig created /debug/dump: solr.DumpRequestHandler
[junit4:junit4]   2> 6727 T566 oashl.XMLLoader.init xsltCacheLifetimeSeconds=60
[junit4:junit4]   2> 6731 T566 oasc.SolrCore.initDeprecatedSupport WARNING solrconfig.xml uses deprecated <admin/gettableFiles>, Please update your config to use the ShowFileRequestHandler.
[junit4:junit4]   2> 6732 T566 oasc.SolrCore.initDeprecatedSupport WARNING adding ShowFileRequestHandler with hidden files: [SCHEMA.XML, OLD_SYNONYMS.TXT, STOPWORDS.TXT, PROTWORDS.TXT, OPEN-EXCHANGE-RATES.JSON, SYNONYMS.TXT, CURRENCY.XML, MAPPING-ISOLATIN1ACCENT.TXT]
[junit4:junit4]   2> 6734 T566 oass.SolrIndexSearcher.<init> Opening Searcher@23cf5b45 main
[junit4:junit4]   2> 6735 T566 oasu.CommitTracker.<init> Hard AutoCommit: disabled
[junit4:junit4]   2> 6736 T566 oasu.CommitTracker.<init> Soft AutoCommit: disabled
[junit4:junit4]   2> 6736 T566 oashc.SpellCheckComponent.inform Initializing spell checkers
[junit4:junit4]   2> 6760 T566 oass.DirectSolrSpellChecker.init init: {name=direct,classname=DirectSolrSpellChecker,field=lowerfilt,minQueryLength=3}
[junit4:junit4]   2> 6804 T625 oasc.SolrCore.registerSearcher [collection1] Registered new searcher Searcher@23cf5b45 main{StandardDirectoryReader(segments_1:1)}
[junit4:junit4]   2> 7185 T587 oascc.ZkStateReader.updateClusterState Updating cloud state from ZooKeeper... 
[junit4:junit4]   2> 7212 T624 oascc.ZkStateReader$2.process A cluster state change has occurred - updating...
[junit4:junit4]   2> 7212 T586 oascc.ZkStateReader$2.process A cluster state change has occurred - updating...
[junit4:junit4]   2> 7212 T612 oascc.ZkStateReader$2.process A cluster state change has occurred - updating...
[junit4:junit4]   2> 7212 T600 oascc.ZkStateReader$2.process A cluster state change has occurred - updating...
[junit4:junit4]   2> 7310 T566 oasc.CoreContainer.register registering core: collection1
[junit4:junit4]   2> 7310 T566 oasc.ZkController.register Register shard - core:collection1 address:http://127.0.0.1:38547/solr shardId:shard1
[junit4:junit4]   2> 7313 T566 oasc.ZkController.register We are http://127.0.0.1:38547/solr/collection1/ and leader is http://127.0.0.1:23908/solr/collection1/
[junit4:junit4]   2> 7313 T566 oasc.ZkController.register No LogReplay needed for core=collection1 baseURL=http://127.0.0.1:38547/solr
[junit4:junit4]   2> 7313 T566 oasc.ZkController.checkRecovery Core needs to recover:collection1
[junit4:junit4]   2> 7314 T566 oasu.DefaultSolrCoreState.doRecovery Running recovery - first canceling any ongoing recovery
[junit4:junit4]   2> ASYNC  NEW_CORE C79 name=collection1 org.apache.solr.core.SolrCore@43ac640d url=http://127.0.0.1:38547/solr/collection1 node=127.0.0.1:38547_solr
[junit4:junit4]   2> 7314 T626 C79 P38547 oasc.RecoveryStrategy.run Starting recovery process.  core=collection1 recoveringAfterStartup=true
[junit4:junit4]   2> 7315 T626 C79 P38547 oasc.RecoveryStrategy.doRecovery ###### startupVersions=[]
[junit4:junit4]   2> 7315 T566 oascc.ZkStateReader.updateClusterState Updating cloud state from ZooKeeper... 
[junit4:junit4]   2> 7346 T626 C79 P38547 oasc.RecoveryStrategy.doRecovery Attempting to PeerSync from http://127.0.0.1:23908/solr/collection1/ core=collection1 - recoveringAfterStartup=true
[junit4:junit4]   2> 7346 T626 C79 P38547 oasu.PeerSync.sync PeerSync: core=collection1 url=http://127.0.0.1:38547/solr START replicas=[http://127.0.0.1:23908/solr/collection1/] nUpdates=100
[junit4:junit4]   2> 7346 T566 oass.SolrDispatchFilter.init user.dir=/usr/home/hudson/hudson-slave/workspace/Lucene-Solr-Tests-trunk-Java6/solr/build/solr-core/test/J1
[junit4:junit4]   2> 7347 T566 oass.SolrDispatchFilter.init SolrDispatchFilter.init() done
[junit4:junit4]   2> 7347 T626 C79 P38547 oasu.PeerSync.sync WARNING no frame of reference to tell of we've missed updates
[junit4:junit4]   2> 7347 T566 oascsi.HttpClientUtil.createClient Creating new http client, config:maxConnections=128&maxConnectionsPerHost=32&followRedirects=false
[junit4:junit4]   2> 7348 T626 C79 P38547 oasc.RecoveryStrategy.doRecovery PeerSync Recovery was not successful - trying replication. core=collection1
[junit4:junit4]   2> 7348 T626 C79 P38547 oasc.RecoveryStrategy.doRecovery Starting Replication Recovery. core=collection1
[junit4:junit4]   2> 7348 T626 C79 P38547 oascsi.HttpClientUtil.createClient Creating new http client, config:maxConnections=128&maxConnectionsPerHost=32&followRedirects=false
[junit4:junit4]   2> ASYNC  NEW_CORE C80 name=collection1 org.apache.solr.core.SolrCore@4bdb7309 url=http://127.0.0.1:23908/solr/collection1 node=127.0.0.1:23908_solr
[junit4:junit4]   2> 7359 T592 C80 P23908 REQ /get {distrib=false&qt=/get&wt=javabin&version=2&getVersions=100} status=0 QTime=1 
[junit4:junit4]   2> 7364 T566 oejs.Server.doStart jetty-8.1.2.v20120308
[junit4:junit4]   2> 7367 T566 oejs.AbstractConnector.doStart Started SocketConnector@0.0.0.0:12334
[junit4:junit4]   2> 7367 T566 oasc.SolrResourceLoader.locateSolrHome JNDI not configured for solr (NoInitialContextEx)
[junit4:junit4]   2> 7367 T566 oasc.SolrResourceLoader.locateSolrHome using system property solr.solr.home: /usr/home/hudson/hudson-slave/workspace/Lucene-Solr-Tests-trunk-Java6/solr/build/solr-core/test-files/solr
[junit4:junit4]   2> 7368 T566 oasc.SolrResourceLoader.<init> new SolrResourceLoader for deduced Solr Home: '/usr/home/hudson/hudson-slave/workspace/Lucene-Solr-Tests-trunk-Java6/solr/build/solr-core/test-files/solr/'
[junit4:junit4]   2> 7392 T566 oass.SolrDispatchFilter.init SolrDispatchFilter.init()
[junit4:junit4]   2> 7392 T566 oasc.SolrResourceLoader.locateSolrHome JNDI not configured for solr (NoInitialContextEx)
[junit4:junit4]   2> 7392 T566 oasc.SolrResourceLoader.locateSolrHome using system property solr.solr.home: /usr/home/hudson/hudson-slave/workspace/Lucene-Solr-Tests-trunk-Java6/solr/build/solr-core/test-files/solr
[junit4:junit4]   2> 7392 T566 oasc.CoreContainer$Initializer.initialize looking for solr.xml: /usr/home/hudson/hudson-slave/workspace/Lucene-Solr-Tests-trunk-Java6/solr/build/solr-core/test-files/solr/solr.xml
[junit4:junit4]   2> 7393 T566 oasc.CoreContainer.<init> New CoreContainer 2074724911
[junit4:junit4]   2> 7393 T566 oasc.CoreContainer.load Loading CoreContainer using Solr Home: '/usr/home/hudson/hudson-slave/workspace/Lucene-Solr-Tests-trunk-Java6/solr/build/solr-core/test-files/solr/'
[junit4:junit4]   2> 7393 T566 oasc.SolrResourceLoader.<init> new SolrResourceLoader for directory: '/usr/home/hudson/hudson-slave/workspace/Lucene-Solr-Tests-trunk-Java6/solr/build/solr-core/test-files/solr/'
[junit4:junit4]   2> 7415 T566 oasc.CoreContainer.load Registering Log Listener
[junit4:junit4]   2> 7427 T566 oasc.CoreContainer.initZooKeeper Zookeeper client=127.0.0.1:16173/solr
[junit4:junit4]   2> 7427 T566 oaz.ZooKeeper.<init> Initiating client connection, connectString=127.0.0.1:16173/solr sessionTimeout=5000 watcher=org.apache.solr.common.cloud.ConnectionManager@271f0ef
[junit4:junit4]   2> 7428 T637 oaz.ClientCnxn$SendThread.startConnect Opening socket connection to server /127.0.0.1:16173
[junit4:junit4]   2> 7428 T566 oascc.ConnectionManager.waitForConnected Waiting for client to connect to ZooKeeper
[junit4:junit4]   2> 7429 T637 oaz.ClientCnxn$SendThread.primeConnection Socket connection established to localhost/127.0.0.1:16173, initiating session
[junit4:junit4]   2> 7429 T568 oazs.NIOServerCnxn$Factory.run Accepted socket connection from /140.211.11.196:49473
[junit4:junit4]   2> 7430 T568 oazs.NIOServerCnxn.readConnectRequest Client attempting to establish new session at /140.211.11.196:49473
[junit4:junit4]   2> 7436 T570 oazs.NIOServerCnxn.finishSessionInit Established session 0x139c79576b70006 with negotiated timeout 5000 for client /140.211.11.196:49473
[junit4:junit4]   2> 7436 T637 oaz.ClientCnxn$SendThread.readConnectResult Session establishment complete on server localhost/127.0.0.1:16173, sessionid = 0x139c79576b70006, negotiated timeout = 5000
[junit4:junit4]   2> 7436 T638 oascc.ConnectionManager.process Watcher org.apache.solr.common.cloud.ConnectionManager@271f0ef name:ZooKeeperConnection Watcher:127.0.0.1:16173/solr got event WatchedEvent state:SyncConnected type:None path:null path:null type:None
[junit4:junit4]   2> 7436 T566 oascc.ConnectionManager.waitForConnected Client is connected to ZooKeeper
[junit4:junit4]   2> 7437 T571 oazs.PrepRequestProcessor.pRequest Got user-level KeeperException when processing sessionid:0x139c79576b70006 type:create cxid:0x1 zxid:0xfffffffffffffffe txntype:unknown reqpath:n/a Error Path:/solr/overseer Error:KeeperErrorCode = NodeExists for /solr/overseer
[junit4:junit4]   2> 7449 T571 oazs.PrepRequestProcessor.pRequest Got user-level KeeperException when processing sessionid:0x139c79576b70006 type:create cxid:0x2 zxid:0xfffffffffffffffe txntype:unknown reqpath:n/a Error Path:/solr/overseer Error:KeeperErrorCode = NodeExists for /solr/overseer
[junit4:junit4]   2> 7450 T566 oasc.ZkController.createEphemeralLiveNode Register node as live in ZooKeeper:/live_nodes/127.0.0.1:12334_solr
[junit4:junit4]   2> 7451 T571 oazs.PrepRequestProcessor.pRequest Got user-level KeeperException when processing sessionid:0x139c79576b70006 type:delete cxid:0x4 zxid:0xfffffffffffffffe txntype:unknown reqpath:n/a Error Path:/solr/live_nodes/127.0.0.1:12334_solr Error:KeeperErrorCode = NoNode for /solr/live_nodes/127.0.0.1:12334_solr
[junit4:junit4]   2> 7452 T566 oascc.SolrZkClient.makePath makePath: /live_nodes/127.0.0.1:12334_solr
[junit4:junit4]   2> 7460 T624 oascc.ZkStateReader$3.process Updating live nodes
[junit4:junit4]   2> 7460 T586 oascc.ZkStateReader$3.process Updating live nodes
[junit4:junit4]   2> 7460 T600 oascc.ZkStateReader$3.process Updating live nodes
[junit4:junit4]   2> 7460 T612 oascc.ZkStateReader$3.process Updating live nodes
[junit4:junit4]   2> 7461 T566 oashc.HttpShardHandlerFactory.getParameter Setting socketTimeout to: 0
[junit4:junit4]   2> 7461 T566 oashc.HttpShardHandlerFactory.getParameter Setting urlScheme to: http://
[junit4:junit4]   2> 7461 T566 oashc.HttpShardHandlerFactory.getParameter Setting connTimeout to: 0
[junit4:junit4]   2> 7462 T566 oashc.HttpShardHandlerFactory.getParameter Setting maxConnectionsPerHost to: 20
[junit4:junit4]   2> 7462 T566 oashc.HttpShardHandlerFactory.getParameter Setting corePoolSize to: 0
[junit4:junit4]   2> 7462 T566 oashc.HttpShardHandlerFactory.getParameter Setting maximumPoolSize to: 2147483647
[junit4:junit4]   2> 7463 T566 oashc.HttpShardHandlerFactory.getParameter Setting maxThreadIdleTime to: 5
[junit4:junit4]   2> 7463 T566 oashc.HttpShardHandlerFactory.getParameter Setting sizeOfQueue to: -1
[junit4:junit4]   2> 7463 T566 oashc.HttpShardHandlerFactory.getParameter Setting fairnessPolicy to: false
[junit4:junit4]   2> 7463 T566 oascsi.HttpClientUtil.createClient Creating new http client, config:maxConnectionsPerHost=20&maxConnections=10000&socketTimeout=0&connTimeout=0&retry=false
[junit4:junit4]   2> 7474 T566 oascc.ZkStateReader.createClusterStateWatchersAndUpdate Updating cluster state from ZooKeeper... 
[junit4:junit4]   2> 7478 T566 oasc.CoreContainer.create Creating SolrCore 'collection1' using instanceDir: /usr/home/hudson/hudson-slave/workspace/Lucene-Solr-Tests-trunk-Java6/solr/build/solr-core/test-files/solr/collection1
[junit4:junit4]   2> 7479 T566 oasc.ZkController.createCollectionZkNode Check for collection zkNode:collection1
[junit4:junit4]   2> 7479 T566 oasc.ZkController.createCollectionZkNode Collection zkNode exists
[junit4:junit4]   2> 7479 T566 oasc.ZkController.readConfigName Load collection config from:/collections/collection1
[junit4:junit4]   2> 7481 T566 oasc.SolrResourceLoader.<init> new SolrResourceLoader for directory: '/usr/home/hudson/hudson-slave/workspace/Lucene-Solr-Tests-trunk-Java6/solr/build/solr-core/test-files/solr/collection1/'
[junit4:junit4]   2> 7481 T566 oasc.SolrResourceLoader.replaceClassLoader Adding 'file:/usr/home/hudson/hudson-slave/workspace/Lucene-Solr-Tests-trunk-Java6/solr/build/solr-core/test-files/solr/collection1/lib/README' to classloader
[junit4:junit4]   2> 7482 T566 oasc.SolrResourceLoader.replaceClassLoader Adding 'file:/usr/home/hudson/hudson-slave/workspace/Lucene-Solr-Tests-trunk-Java6/solr/build/solr-core/test-files/solr/collection1/lib/classes/' to classloader
[junit4:junit4]   2> 7516 T566 oasc.SolrConfig.<init> Using Lucene MatchVersion: LUCENE_50
[junit4:junit4]   2> 7563 T566 oasc.SolrConfig.<init> Loaded SolrConfig: solrconfig.xml
[junit4:junit4]   2> 7664 T566 oass.IndexSchema.readSchema Reading Solr Schema
[junit4:junit4]   2> 7670 T566 oass.IndexSchema.readSchema Schema name=test
[junit4:junit4]   2> 7757 T587 oascc.ZkStateReader.updateClusterState Updating cloud state from ZooKeeper... 
[junit4:junit4]   2> 7782 T624 oascc.ZkStateReader$2.process A cluster state change has occurred - updating...
[junit4:junit4]   2> 7782 T586 oascc.ZkStateReader$2.process A cluster state change has occurred - updating...
[junit4:junit4]   2> 7782 T600 oascc.ZkStateReader$2.process A cluster state change has occurred - updating...
[junit4:junit4]   2> 7782 T638 oascc.ZkStateReader$2.process A cluster state change has occurred - updating...
[junit4:junit4]   2> 7782 T612 oascc.ZkStateReader$2.process A cluster state change has occurred - updating...
[junit4:junit4]   2> 8095 T566 oass.OpenExchangeRatesOrgProvider.init Initialized with rates=open-exchange-rates.json, refreshInterval=1440.
[junit4:junit4]   2> 8103 T566 oass.IndexSchema.readSchema default search field in schema is text
[junit4:junit4]   2> 8106 T566 oass.IndexSchema.readSchema unique key field: id
[junit4:junit4]   2> 8118 T566 oass.FileExchangeRateProvider.reload Reloading exchange rates from file currency.xml
[junit4:junit4]   2> 8122 T566 oass.FileExchangeRateProvider.reload Reloading exchange rates from file currency.xml
[junit4:junit4]   2> 8125 T566 oass.OpenExchangeRatesOrgProvider.reload Reloading exchange rates from open-exchange-rates.json
[junit4:junit4]   2> 8126 T566 oass.OpenExchangeRatesOrgProvider.reload Reloading exchange rates from open-exchange-rates.json
[junit4:junit4]   2> 8128 T566 oasc.SolrCore.<init> [collection1] Opening new SolrCore at /usr/home/hudson/hudson-slave/workspace/Lucene-Solr-Tests-trunk-Java6/solr/build/solr-core/test-files/solr/collection1/, dataDir=./org.apache.solr.cloud.BasicDistributedZk2Test-1347673224880/jetty4/
[junit4:junit4]   2> 8128 T566 oasc.JmxMonitoredMap.<init> JMX monitoring is enabled. Adding Solr mbeans to JMX Server: com.sun.jmx.mbeanserver.JmxMBeanServer@558041e0
[junit4:junit4]   2> 8129 T566 oasc.SolrCore.getNewIndexDir WARNING New index directory detected: old=null new=./org.apache.solr.cloud.BasicDistributedZk2Test-1347673224880/jetty4/index/
[junit4:junit4]   2> 8130 T566 oasc.SolrCore.initIndex WARNING [collection1] Solr index directory './org.apache.solr.cloud.BasicDistributedZk2Test-1347673224880/jetty4/index' doesn't exist. Creating new index...
[junit4:junit4]   2> 8130 T566 oasc.CachingDirectoryFactory.get return new directory for /usr/home/hudson/hudson-slave/workspace/Lucene-Solr-Tests-trunk-Java6/solr/build/solr-core/test/J1/./org.apache.solr.cloud.BasicDistributedZk2Test-1347673224880/jetty4/index forceNew:false
[junit4:junit4]   2> 8161 T566 oasc.SolrDeletionPolicy.onCommit SolrDeletionPolicy.onCommit: commits:num=1
[junit4:junit4]   2> 		commit{dir=NRTCachingDirectory(org.apache.lucene.store.NIOFSDirectory@/usr/home/hudson/hudson-slave/workspace/Lucene-Solr-Tests-trunk-Java6/solr/build/solr-core/test/J1/org.apache.solr.cloud.BasicDistributedZk2Test-1347673224880/jetty4/index lockFactory=org.apache.lucene.store.NativeFSLockFactory@5dd9ed0d; maxCacheMB=48.0 maxMergeSizeMB=4.0),segFN=segments_1,generation=1,filenames=[segments_1]
[junit4:junit4]   2> 8161 T566 oasc.SolrDeletionPolicy.updateCommits newest commit = 1
[junit4:junit4]   2> 8162 T566 oasc.SolrCore.initWriters created xml: solr.XMLResponseWriter
[junit4:junit4]   2> 8164 T566 oasup.UpdateRequestProcessorChain.init inserting DistributedUpdateProcessorFactory into updateRequestProcessorChain "dedupe"
[junit4:junit4]   2> 8164 T566 oasup.UpdateRequestProcessorChain.init inserting DistributedUpdateProcessorFactory into updateRequestProcessorChain "dedupe-allfields"
[junit4:junit4]   2> 8165 T566 oasup.UpdateRequestProcessorChain.init inserting DistributedUpdateProcessorFactory into updateRequestProcessorChain "stored_sig"
[junit4:junit4]   2> 8165 T566 oasup.UpdateRequestProcessorChain.init inserting DistributedUpdateProcessorFactory into updateRequestProcessorChain "uniq-fields"
[junit4:junit4]   2> 8166 T566 oasup.UpdateRequestProcessorChain.init inserting DistributedUpdateProcessorFactory into updateRequestProcessorChain "distrib-dup-test-chain-implicit"
[junit4:junit4]   2> 8166 T566 oasc.RequestHandlers.initHandlersFromConfig adding lazy requestHandler: solr.ReplicationHandler
[junit4:junit4]   2> 8166 T566 oasc.RequestHandlers.initHandlersFromConfig created /replication: solr.ReplicationHandler
[junit4:junit4]   2> 8167 T566 oasc.RequestHandlers.initHandlersFromConfig created standard: solr.StandardRequestHandler
[junit4:junit4]   2> 8167 T566 oasc.RequestHandlers.initHandlersFromConfig created /get: solr.RealTimeGetHandler
[junit4:junit4]   2> 8168 T566 oasc.RequestHandlers.initHandlersFromConfig created dismax: solr.SearchHandler
[junit4:junit4]   2> 8168 T566 oasc.RequestHandlers.initHandlersFromConfig created mock: org.apache.solr.core.MockQuerySenderListenerReqHandler
[junit4:junit4]   2> 8169 T566 oasc.RequestHandlers.initHandlersFromConfig created /admin/: org.apache.solr.handler.admin.AdminHandlers
[junit4:junit4]   2> 8169 T566 oasc.RequestHandlers.initHandlersFromConfig created defaults: solr.StandardRequestHandler
[junit4:junit4]   2> 8169 T566 oasc.RequestHandlers.initHandlersFromConfig adding lazy requestHandler: solr.StandardRequestHandler
[junit4:junit4]   2> 8170 T566 oasc.RequestHandlers.initHandlersFromConfig created lazy: solr.StandardRequestHandler
[junit4:junit4]   2> 8170 T566 oasc.RequestHandlers.initHandlersFromConfig created /update: solr.UpdateRequestHandler
[junit4:junit4]   2> 8171 T566 oasc.RequestHandlers.initHandlersFromConfig created /terms: org.apache.solr.handler.component.SearchHandler
[junit4:junit4]   2> 8171 T566 oasc.RequestHandlers.initHandlersFromConfig created spellCheckCompRH: org.apache.solr.handler.component.SearchHandler
[junit4:junit4]   2> 8172 T566 oasc.RequestHandlers.initHandlersFromConfig created spellCheckCompRH_Direct: org.apache.solr.handler.component.SearchHandler
[junit4:junit4]   2> 8172 T566 oasc.RequestHandlers.initHandlersFromConfig created spellCheckWithWordbreak: org.apache.solr.handler.component.SearchHandler
[junit4:junit4]   2> 8173 T566 oasc.RequestHandlers.initHandlersFromConfig created spellCheckWithWordbreak_Direct: org.apache.solr.handler.component.SearchHandler
[junit4:junit4]   2> 8173 T566 oasc.RequestHandlers.initHandlersFromConfig created spellCheckCompRH1: org.apache.solr.handler.component.SearchHandler
[junit4:junit4]   2> 8174 T566 oasc.RequestHandlers.initHandlersFromConfig created tvrh: org.apache.solr.handler.component.SearchHandler
[junit4:junit4]   2> 8174 T566 oasc.RequestHandlers.initHandlersFromConfig created /mlt: solr.MoreLikeThisHandler
[junit4:junit4]   2> 8175 T566 oasc.RequestHandlers.initHandlersFromConfig created /debug/dump: solr.DumpRequestHandler
[junit4:junit4]   2> 8177 T566 oashl.XMLLoader.init xsltCacheLifetimeSeconds=60
[junit4:junit4]   2> 8181 T566 oasc.SolrCore.initDeprecatedSupport WARNING solrconfig.xml uses deprecated <admin/gettableFiles>, Please update your config to use the ShowFileRequestHandler.
[junit4:junit4]   2> 8182 T566 oasc.SolrCore.initDeprecatedSupport WARNING adding ShowFileRequestHandler with hidden files: [SCHEMA.XML, OLD_SYNONYMS.TXT, STOPWORDS.TXT, PROTWORDS.TXT, OPEN-EXCHANGE-RATES.JSON, SYNONYMS.TXT, CURRENCY.XML, MAPPING-ISOLATIN1ACCENT.TXT]
[junit4:junit4]   2> 8185 T566 oass.SolrIndexSearcher.<init> Opening Searcher@4482496e main
[junit4:junit4]   2> 8186 T566 oasu.CommitTracker.<init> Hard AutoCommit: disabled
[junit4:junit4]   2> 8186 T566 oasu.CommitTracker.<init> Soft AutoCommit: disabled
[junit4:junit4]   2> 8186 T566 oashc.SpellCheckComponent.inform Initializing spell checkers
[junit4:junit4]   2> 8192 T566 oass.DirectSolrSpellChecker.init init: {name=direct,classname=DirectSolrSpellChecker,field=lowerfilt,minQueryLength=3}
[junit4:junit4]   2> 8239 T639 oasc.SolrCore.registerSearcher [collection1] Registered new searcher Searcher@4482496e main{StandardDirectoryReader(segments_1:1)}
[junit4:junit4]   2> 8287 T587 oascc.ZkStateReader.updateClusterState Updating cloud state from ZooKeeper... 
[junit4:junit4]   2> 8314 T638 oascc.ZkStateReader$2.process A cluster state change has occurred - updating...
[junit4:junit4]   2> 8314 T624 oascc.ZkStateReader$2.process A cluster state change has occurred - updating...
[junit4:junit4]   2> 8314 T586 oascc.ZkStateReader$2.process A cluster state change has occurred - updating...
[junit4:junit4]   2> 8314 T600 oascc.ZkStateReader$2.process A cluster state change has occurred - updating...
[junit4:junit4]   2> 8314 T612 oascc.ZkStateReader$2.process A cluster state change has occurred - updating...
[junit4:junit4]   2> 8744 T566 oasc.CoreContainer.register registering core: collection1
[junit4:junit4]   2> 8744 T566 oasc.ZkController.register Register shard - core:collection1 address:http://127.0.0.1:12334/solr shardId:shard2
[junit4:junit4]   2> 8748 T566 oasc.ZkController.register We are http://127.0.0.1:12334/solr/collection1/ and leader is http://127.0.0.1:18317/solr/collection1/
[junit4:junit4]   2> 8748 T566 oasc.ZkController.register No LogReplay needed for core=collection1 baseURL=http://127.0.0.1:12334/solr
[junit4:junit4]   2> 8749 T566 oasc.ZkController.checkRecovery Core needs to recover:collection1
[junit4:junit4]   2> 8749 T566 oasu.DefaultSolrCoreState.doRecovery Running recovery - first canceling any ongoing recovery
[junit4:junit4]   2> ASYNC  NEW_CORE C81 name=collection1 org.apache.solr.core.SolrCore@535ac0f0 url=http://127.0.0.1:12334/solr/collection1 node=127.0.0.1:12334_solr
[junit4:junit4]   2> 8750 T640 C81 P12334 oasc.RecoveryStrategy.run Starting recovery process.  core=collection1 recoveringAfterStartup=true
[junit4:junit4]   2> 8750 T640 C81 P12334 oasc.RecoveryStrategy.doRecovery ###### startupVersions=[]
[junit4:junit4]   2> 8750 T566 oascc.ZkStateReader.updateClusterState Updating cloud state from ZooKeeper... 
[junit4:junit4]   2> 8752 T640 C81 P12334 oasc.RecoveryStrategy.doRecovery Attempting to PeerSync from http://127.0.0.1:18317/solr/collection1/ core=collection1 - recoveringAfterStartup=true
[junit4:junit4]   2> 8752 T640 C81 P12334 oasu.PeerSync.sync PeerSync: core=collection1 url=http://127.0.0.1:12334/solr START replicas=[http://127.0.0.1:18317/solr/collection1/] nUpdates=100
[junit4:junit4]   2> 8752 T566 oass.SolrDispatchFilter.init user.dir=/usr/home/hudson/hudson-slave/workspace/Lucene-Solr-Tests-trunk-Java6/solr/build/solr-core/test/J1
[junit4:junit4]   2> 8752 T640 C81 P12334 oasu.PeerSync.sync WARNING no frame of reference to tell of we've missed updates
[junit4:junit4]   2> 8753 T640 C81 P12334 oasc.RecoveryStrategy.doRecovery PeerSync Recovery was not successful - trying replication. core=collection1
[junit4:junit4]   2> 8752 T566 oass.SolrDispatchFilter.init SolrDispatchFilter.init() done
[junit4:junit4]   2> 8753 T640 C81 P12334 oasc.RecoveryStrategy.doRecovery Starting Replication Recovery. core=collection1
[junit4:junit4]   2> 8753 T640 C81 P12334 oascsi.HttpClientUtil.createClient Creating new http client, config:maxConnections=128&maxConnectionsPerHost=32&followRedirects=false
[junit4:junit4]   2> 8753 T566 oascsi.HttpClientUtil.createClient Creating new http client, config:maxConnections=128&maxConnectionsPerHost=32&followRedirects=false
[junit4:junit4]   2> ASYNC  NEW_CORE C82 name=collection1 org.apache.solr.core.SolrCore@650f5b42 url=http://127.0.0.1:18317/solr/collection1 node=127.0.0.1:18317_solr
[junit4:junit4]   2> 8760 T604 C82 P18317 REQ /get {distrib=false&qt=/get&wt=javabin&version=2&getVersions=100} status=0 QTime=1 
[junit4:junit4]   2> 8769 T566 oaz.ZooKeeper.<init> Initiating client connection, connectString=127.0.0.1:16173/solr sessionTimeout=10000 watcher=org.apache.solr.common.cloud.ConnectionManager@189ffe8b
[junit4:junit4]   2> 8770 T642 oaz.ClientCnxn$SendThread.startConnect Opening socket connection to server /127.0.0.1:16173
[junit4:junit4]   2> 8770 T566 oascc.ConnectionManager.waitForConnected Waiting for client to connect to ZooKeeper
[junit4:junit4]   2> 8771 T642 oaz.ClientCnxn$SendThread.primeConnection Socket connection established to localhost/127.0.0.1:16173, initiating session
[junit4:junit4]   2> 8771 T568 oazs.NIOServerCnxn$Factory.run Accepted socket connection from /140.211.11.196:38610
[junit4:junit4]   2> 8771 T568 oazs.NIOServerCnxn.readConnectRequest Client attempting to establish new session at /140.211.11.196:38610
[junit4:junit4]   2> 8773 T570 oazs.NIOServerCnxn.finishSessionInit Established session 0x139c79576b70007 with negotiated timeout 10000 for client /140.211.11.196:38610
[junit4:junit4]   2> 8773 T642 oaz.ClientCnxn$SendThread.readConnectResult Session establishment complete on server localhost/127.0.0.1:16173, sessionid = 0x139c79576b70007, negotiated timeout = 10000
[junit4:junit4]   2> 8773 T643 oascc.ConnectionManager.process Watcher org.apache.solr.common.cloud.ConnectionManager@189ffe8b name:ZooKeeperConnection Watcher:127.0.0.1:16173/solr got event WatchedEvent state:SyncConnected type:None path:null path:null type:None
[junit4:junit4]   2> 8773 T566 oascc.ConnectionManager.waitForConnected Client is connected to ZooKeeper
[junit4:junit4]   2> 8774 T566 oascc.ZkStateReader.createClusterStateWatchersAndUpdate Updating cluster state from ZooKeeper... 
[junit4:junit4]   2> 8776 T566 oasc.ChaosMonkey.monkeyLog monkey: init - expire sessions:true cause connection loss:true
[junit4:junit4]   2> 8776 T566 oascsi.HttpClientUtil.createClient Creating new http client, config:
[junit4:junit4]   2> 8788 T566 oascc.ZkStateReader.updateClusterState Updating cloud state from ZooKeeper... 
[junit4:junit4]   2> ASYNC  NEW_CORE C83 name=collection1 org.apache.solr.core.SolrCore@659deb25 url=http://127.0.0.1:12347/solr/collection1 node=127.0.0.1:12347_solr
[junit4:junit4]   2> 8802 T578 C83 P12347 oasc.SolrDeletionPolicy.onInit SolrDeletionPolicy.onInit: commits:num=1
[junit4:junit4]   2> 		commit{dir=NRTCachingDirectory(org.apache.lucene.store.NIOFSDirectory@/usr/home/hudson/hudson-slave/workspace/Lucene-Solr-Tests-trunk-Java6/solr/build/solr-core/test/J1/org.apache.solr.cloud.BasicDistributedZk2Test-1347673224880/control/data/index lockFactory=org.apache.lucene.store.NativeFSLockFactory@18b198d1; maxCacheMB=48.0 maxMergeSizeMB=4.0),segFN=segments_1,generation=1,filenames=[segments_1]
[junit4:junit4]   2> 8803 T578 C83 P12347 oasc.SolrDeletionPolicy.updateCommits newest commit = 1
[junit4:junit4]   2> 8807 T578 C83 P12347 /update {wt=javabin&version=2} {add=[1 (1413137808672948224)]} 0 10
[junit4:junit4]   2> 8809 T566 oaz.ZooKeeper.<init> Initiating client connection, connectString=127.0.0.1:16173/solr sessionTimeout=10000 watcher=org.apache.solr.common.cloud.ConnectionManager@77a2cba6
[junit4:junit4]   2> 8810 T644 oaz.ClientCnxn$SendThread.startConnect Opening socket connection to server /127.0.0.1:16173
[junit4:junit4]   2> 8810 T566 oascc.ConnectionManager.waitForConnected Waiting for client to connect to ZooKeeper
[junit4:junit4]   2> 8811 T644 oaz.ClientCnxn$SendThread.primeConnection Socket connection established to localhost/127.0.0.1:16173, initiating session
[junit4:junit4]   2> 8811 T568 oazs.NIOServerCnxn$Factory.run Accepted socket connection from /140.211.11.196:12043
[junit4:junit4]   2> 8812 T568 oazs.NIOServerCnxn.readConnectRequest Client attempting to establish new session at /140.211.11.196:12043
[junit4:junit4]   2> 8813 T570 oazs.NIOServerCnxn.finishSessionInit Established session 0x139c79576b70008 with negotiated timeout 10000 for client /140.211.11.196:12043
[junit4:junit4]   2> 8813 T644 oaz.ClientCnxn$SendThread.readConnectResult Session establishment complete on server localhost/127.0.0.1:16173, sessionid = 0x139c79576b70008, negotiated timeout = 10000
[junit4:junit4]   2> 8813 T645 oascc.ConnectionManager.process Watcher org.apache.solr.common.cloud.ConnectionManager@77a2cba6 name:ZooKeeperConnection Watcher:127.0.0.1:16173/solr got event WatchedEvent state:SyncConnected type:None path:null path:null type:None
[junit4:junit4]   2> 8814 T566 oascc.ConnectionManager.waitForConnected Client is connected to ZooKeeper
[junit4:junit4]   2> 8815 T566 oascc.ZkStateReader.createClusterStateWatchersAndUpdate Updating cluster state from ZooKeeper... 
[junit4:junit4]   2> 8819 T587 oascc.ZkStateReader.updateClusterState Updating cloud state from ZooKeeper... 
[junit4:junit4]   2> 8824 T594 C80 P23908 oasc.SolrDeletionPolicy.onInit SolrDeletionPolicy.onInit: commits:num=1
[junit4:junit4]   2> 		commit{dir=NRTCachingDirectory(org.apache.lucene.store.NIOFSDirectory@/usr/home/hudson/hudson-slave/workspace/Lucene-Solr-Tests-trunk-Java6/solr/build/solr-core/test/J1/org.apache.solr.cloud.BasicDistributedZk2Test-1347673224880/jetty1/index lockFactory=org.apache.lucene.store.NativeFSLockFactory@3d8d0720; maxCacheMB=48.0 maxMergeSizeMB=4.0),segFN=segments_1,generation=1,filenames=[segments_1]
[junit4:junit4]   2> 8827 T594 C80 P23908 oasc.SolrDeletionPolicy.updateCommits newest commit = 1
[junit4:junit4]   2> 8832 T600 oascc.ZkStateReader$2.process A cluster state change has occurred - updating...
[junit4:junit4]   2> 8832 T586 oascc.ZkStateReader$2.process A cluster state change has occurred - updating...
[junit4:junit4]   2> 8832 T638 oascc.ZkStateReader$2.process A cluster state change has occurred - updating...
[junit4:junit4]   2> 8833 T612 oascc.ZkStateReader$2.process A cluster state change has occurred - updating...
[junit4:junit4]   2> 8833 T643 oascc.ZkStateReader$2.process A cluster state change has occurred - updating...
[junit4:junit4]   2> 8832 T624 oascc.ZkStateReader$2.process A cluster state change has occurred - updating...
[junit4:junit4]   2> 8833 T645 oascc.ZkStateReader$2.process A cluster state change has occurred - updating...
[junit4:junit4]   2>  C79_STATE=coll:collection1 core:collection1 props:{shard=shard1, roles=null, state=recovering, core=collection1, collection=collection1, node_name=127.0.0.1:38547_solr, base_url=http://127.0.0.1:38547/solr}
[junit4:junit4]   2> 8842 T616 C79 P38547 oasc.SolrDeletionPolicy.onInit SolrDeletionPolicy.onInit: commits:num=1
[junit4:junit4]   2> 		commit{dir=NRTCachingDirectory(org.apache.lucene.store.NIOFSDirectory@/usr/home/hudson/hudson-slave/workspace/Lucene-Solr-Tests-trunk-Java6/solr/build/solr-core/test/J1/org.apache.solr.cloud.BasicDistributedZk2Test-1347673224880/jetty3/index lockFactory=org.apache.lucene.store.NativeFSLockFactory@7d33dbab; maxCacheMB=48.0 maxMergeSizeMB=4.0),segFN=segments_1,generation=1,filenames=[segments_1]
[junit4:junit4]   2> 8842 T616 C79 P38547 oasc.SolrDeletionPolicy.updateCommits newest commit = 1
[junit4:junit4]   2> 8845 T616 C79 P38547 REQ /update {distrib.from=http://127.0.0.1:23908/solr/collection1/&update.distrib=FROMLEADER&wt=javabin&version=2} status=0 QTime=7 
[junit4:junit4]   2> 8845 T594 C80 P23908 /update {wt=javabin&version=2} {add=[1 (1413137808696016896)]} 0 27
[junit4:junit4]   2> 8846 T566 oasc.AbstractDistribZkTestBase.waitForRecoveriesToFinish Wait for recoveries to finish - collection: collection1 failOnTimeout:true timeout (sec):1440
[junit4:junit4]   2> 8847 T566 oascc.ZkStateReader.updateClusterState Updating cloud state from ZooKeeper... 
[junit4:junit4]   2> 9849 T566 oascc.ZkStateReader.updateClusterState Updating cloud state from ZooKeeper... 
[junit4:junit4]   2> 10366 T626 C79 P38547 oasc.RecoveryStrategy.doRecovery Begin buffering updates. core=collection1
[junit4:junit4]   2> 10366 T626 C79 P38547 oasu.UpdateLog.bufferUpdates Starting to buffer updates. FSUpdateLog{state=ACTIVE, tlog=tlog{file=./org.apache.solr.cloud.BasicDistributedZk2Test-1347673224880/jetty3/tlog/tlog.0000000000000000000 refcount=1}}
[junit4:junit4]   2> 10366 T626 C79 P38547 oasc.RecoveryStrategy.replicate Attempting to replicate from http://127.0.0.1:23908/solr/collection1/. core=collection1
[junit4:junit4]   2> 10366 T626 C79 P38547 oascsi.HttpClientUtil.createClient Creating new http client, config:maxConnections=128&maxConnectionsPerHost=32&followRedirects=false
[junit4:junit4]   2> 10383 T595 C80 P23908 oasu.DirectUpdateHandler2.commit start commit{flags=0,_version_=0,optimize=false,openSearcher=true,waitSearcher=true,expungeDeletes=false,softCommit=false}
[junit4:junit4]   2> 10497 T595 C80 P23908 oasc.SolrDeletionPolicy.onCommit SolrDeletionPolicy.onCommit: commits:num=2
[junit4:junit4]   2> 		commit{dir=NRTCachingDirectory(org.apache.lucene.store.NIOFSDirectory@/usr/home/hudson/hudson-slave/workspace/Lucene-Solr-Tests-trunk-Java6/solr/build/solr-core/test/J1/org.apache.solr.cloud.BasicDistributedZk2Test-1347673224880/jetty1/index lockFactory=org.apache.lucene.store.NativeFSLockFactory@3d8d0720; maxCacheMB=48.0 maxMergeSizeMB=4.0),segFN=segments_1,generation=1,filenames=[segments_1]
[junit4:junit4]   2> 		commit{dir=NRTCachingDirectory(org.apache.lucene.store.NIOFSDirectory@/usr/home/hudson/hudson-slave/workspace/Lucene-Solr-Tests-trunk-Java6/solr/build/solr-core/test/J1/org.apache.solr.cloud.BasicDistributedZk2Test-1347673224880/jetty1/index lockFactory=org.apache.lucene.store.NativeFSLockFactory@3d8d0720; maxCacheMB=48.0 maxMergeSizeMB=4.0),segFN=segments_2,generation=2,filenames=[_0_Asserting_0.tim, _0_Asserting_0.tip, _0_MockSep_0.pos, _0_MockFixedIntBlock_0.tib, _0_Pulsing40_0.prx, _0_Pulsing40_0.frq, _0_Asserting_0.prx, _0_MockFixedIntBlock_0.skp, _0_MockFixedIntBlock_0.pyl, _0_MockSep_0.skp, _0_MockFixedIntBlock_0.tii, _0_Pulsing40_0.tip, _0_MockSep_0.doc, _0.si, _0.fnm, _0_Pulsing40_0.tim, _0_MockFixedIntBlock_0.pos, _0_nrm.cfs, _0_MockSep_0.tib, _0_MockFixedIntBlock_0.frq, _0_Asserting_0.frq, _0_MockFixedIntBlock_0.doc, _0_nrm.cfe, segments_2, _0_MockSep_0.frq, _0.fdx, _0_MockSep_0.tii, _0_MockSep_0.pyl, _0.fdt]
[junit4:junit4]   2> 10498 T595 C80 P23908 oasc.SolrDeletionPolicy.updateCommits newest commit = 2
[junit4:junit4]   2> 10510 T595 C80 P23908 oass.SolrIndexSearcher.<init> Opening Searcher@61683052 main
[junit4:junit4]   2> 10510 T595 C80 P23908 oasu.DirectUpdateHandler2.commit end_commit_flush
[junit4:junit4]   2> 10511 T601 oasc.SolrCore.registerSearcher [collection1] Registered new searcher Searcher@61683052 main{StandardDirectoryReader(segments_2:3 _0(5.0):C1)}
[junit4:junit4]   2> 10512 T595 C80 P23908 /update {waitSearcher=true&commit=true&commit_end_point=true&wt=javabin&softCommit=false&version=2} {commit=} 0 129
[junit4:junit4]   2> 10513 T626 C79 P38547 oash.ReplicationHandler.inform Commits will be reserved for  10000
[junit4:junit4]   2> 10513 T626 C79 P38547 oash.SnapPuller.<init>  No value set for 'pollInterval'. Timer Task not started.
[junit4:junit4]   2> 10515 T596 C80 P23908 oash.ReplicationHandler.inform Commits will be reserved for  10000
[junit4:junit4]   2> 10516 T596 C80 P23908 REQ /replication {command=indexversion&wt=javabin&qt=/replication&version=2} status=0 QTime=1 
[junit4:junit4]   2> 10516 T626 C79 P38547 oash.SnapPuller.fetchLatestIndex Master's generation: 2
[junit4:junit4]   2> 10516 T626 C79 P38547 oash.SnapPuller.fetchLatestIndex Slave's generation: 1
[junit4:junit4]   2> 10516 T626 C79 P38547 oash.SnapPuller.fetchLatestIndex Starting replication process
[junit4:junit4]   2> 10522 T596 C80 P23908 REQ /replication {command=filelist&generation=2&wt=javabin&qt=/replication&version=2} status=0 QTime=3 
[junit4:junit4]   2> 10523 T626 C79 P38547 oash.SnapPuller.fetchLatestIndex Number of files in latest index in master: 29
[junit4:junit4]   2> 10529 T626 C79 P38547 oash.SnapPuller.fetchLatestIndex Starting download to ./org.apache.solr.cloud.BasicDistributedZk2Test-1347673224880/jetty3/index.20120915044035400 fullCopy=true
[junit4:junit4]   2> 10532 T596 C80 P23908 REQ /replication {file=_0_Asserting_0.tim&command=filecontent&checksum=true&generation=2&qt=/replication&wt=filestream} status=0 QTime=0 
[junit4:junit4]   2> 10537 T596 C80 P23908 REQ /replication {file=_0_MockSep_0.pos&command=filecontent&checksum=true&generation=2&qt=/replication&wt=filestream} status=0 QTime=0 
[junit4:junit4]   2> 10541 T596 C80 P23908 REQ /replication {file=_0_Asserting_0.tip&command=filecontent&checksum=true&generation=2&qt=/replication&wt=filestream} status=0 QTime=0 
[junit4:junit4]   2> 10545 T596 C80 P23908 REQ /replication {file=_0_Pulsing40_0.prx&command=filecontent&checksum=true&generation=2&qt=/replication&wt=filestream} status=0 QTime=0 
[junit4:junit4]   2> 10549 T596 C80 P23908 REQ /replication {file=_0_MockFixedIntBlock_0.tib&command=filecontent&checksum=true&generation=2&qt=/replication&wt=filestream} status=0 QTime=0 
[junit4:junit4]   2> 10553 T596 C80 P23908 REQ /replication {file=_0_Pulsing40_0.frq&command=filecontent&checksum=true&generation=2&qt=/replication&wt=filestream} status=0 QTime=0 
[junit4:junit4]   2> 10557 T596 C80 P23908 REQ /replication {file=_0_Asserting_0.prx&command=filecontent&checksum=true&generation=2&qt=/replication&wt=filestream} status=0 QTime=0 
[junit4:junit4]   2> 10561 T596 C80 P23908 REQ /replication {file=_0_MockFixedIntBlock_0.pyl&command=filecontent&checksum=true&generation=2&qt=/replication&wt=filestream} status=0 QTime=0 
[junit4:junit4]   2> 10562 T626 C79 P38547 oash.SnapPuller$FileFetcher.fetchPackets WARNING No content recieved for file: {name=_0_MockFixedIntBlock_0.pyl, lastmodified=1347673235000, size=0}
[junit4:junit4]   2> 10565 T596 C80 P23908 REQ /replication {file=_0_MockFixedIntBlock_0.skp&command=filecontent&checksum=true&generation=2&qt=/replication&wt=filestream} status=0 QTime=0 
[junit4:junit4]   2> 10566 T626 C79 P38547 oash.SnapPuller$FileFetcher.fetchPackets WARNING No content recieved for file: {name=_0_MockFixedIntBlock_0.skp, lastmodified=1347673235000, size=0}
[junit4:junit4]   2> 10569 T596 C80 P23908 REQ /replication {file=_0_MockSep_0.skp&command=filecontent&checksum=true&generation=2&qt=/replication&wt=filestream} status=0 QTime=0 
[junit4:junit4]   2> 10570 T626 C79 P38547 oash.SnapPuller$FileFetcher.fetchPackets WARNING No content recieved for file: {name=_0_MockSep_0.skp, lastmodified=1347673235000, size=0}
[junit4:junit4]   2> 10573 T596 C80 P23908 REQ /replication {file=_0_MockFixedIntBlock_0.tii&command=filecontent&checksum=true&generation=2&qt=/replication&wt=filestream} status=0 QTime=0 
[junit4:junit4]   2> 10577 T596 C80 P23908 REQ /replication {file=_0_Pulsing40_0.tip&command=filecontent&checksum=true&generation=2&qt=/replication&wt=filestream} status=0 QTime=0 
[junit4:junit4]   2> 10581 T596 C80 P23908 REQ /replication {file=_0.si&command=filecontent&checksum=true&generation=2&qt=/replication&wt=filestream} status=0 QTime=0 
[junit4:junit4]   2> 10585 T596 C80 P23908 REQ /replication {file=_0_MockSep_0.doc&command=filecontent&checksum=true&generation=2&qt=/replication&wt=filestream} status=0 QTime=0 
[junit4:junit4]   2> 10589 T596 C80 P23908 REQ /replication {file=_0_Pulsing40_0.tim&command=filecontent&checksum=true&generation=2&qt=/replication&wt=filestream} status=0 QTime=0 
[junit4:junit4]   2> 10593 T596 C80 P23908 REQ /replication {file=_0.fnm&command=filecontent&checksum=true&generation=2&qt=/replication&wt=filestream} status=0 QTime=0 
[junit4:junit4]   2> 10597 T596 C80 P23908 REQ /replication {file=_0_MockFixedIntBlock_0.pos&command=filecontent&checksum=true&generation=2&qt=/replication&wt=filestream} status=0 QTime=0 
[junit4:junit4]   2> 10601 T596 C80 P23908 REQ /replication {file=_0_nrm.cfs&command=filecontent&checksum=true&generation=2&qt=/replication&wt=filestream} status=0 QTime=0 
[junit4:junit4]   2> 10605 T596 C80 P23908 REQ /replication {file=_0_MockFixedIntBlock_0.frq&command=filecontent&checksum=true&generation=2&qt=/replication&wt=filestream} status=0 QTime=0 
[junit4:junit4]   2> 10609 T596 C80 P23908 REQ /replication {file=_0_MockSep_0.tib&command=filecontent&checksum=true&generation=2&qt=/replication&wt=filestream} status=0 QTime=0 
[junit4:junit4]   2> 10613 T596 C80 P23908 REQ /replication {file=_0_Asserting_0.frq&command=filecontent&checksum=true&generation=2&qt=/replication&wt=filestream} status=0 QTime=0 
[junit4:junit4]   2> 10617 T596 C80 P23908 REQ /replication {file=_0_MockFixedIntBlock_0.doc&command=filecontent&checksum=true&generation=2&qt=/replication&wt=filestream} status=0 QTime=0 
[junit4:junit4]   2> 10621 T596 C80 P23908 REQ /replication {file=_0_nrm.cfe&command=filecontent&checksum=true&generation=2&qt=/replication&wt=filestream} status=0 QTime=0 
[junit4:junit4]   2> 10625 T596 C80 P23908 REQ /replication {file=_0_MockSep_0.frq&command=filecontent&checksum=true&generation=2&qt=/replication&wt=filestream} status=0 QTime=0 
[junit4:junit4]   2> 10629 T596 C80 P23908 REQ /replication {file=segments_2&command=filecontent&checksum=true&generation=2&qt=/replication&wt=filestream} status=0 QTime=0 
[junit4:junit4]   2> 10633 T596 C80 P23908 REQ /replication {file=_0.fdx&command=filecontent&checksum=true&generation=2&qt=/replication&wt=filestream} status=0 QTime=0 
[junit4:junit4]   2> 10637 T596 C80 P23908 REQ /replication {file=_0_MockSep_0.tii&command=filecontent&checksum=true&generation=2&qt=/replication&wt=filestream} status=0 QTime=0 
[junit4:junit4]   2> 10641 T596 C80 P23908 REQ /replication {file=_0_MockSep_0.pyl&command=filecontent&checksum=true&generation=2&qt=/replication&wt=filestream} status=0 QTime=0 
[junit4:junit4]   2> 10642 T626 C79 P38547 oash.SnapPuller$FileFetcher.fetchPackets WARNING No content recieved for file: {name=_0_MockSep_0.pyl, lastmodified=1347673235000, size=0}
[junit4:junit4]   2> 10645 T596 C80 P23908 REQ /replication {file=_0.fdt&command=filecontent&checksum=true&generation=2&qt=/replication&wt=filestream} status=0 QTime=0 
[junit4:junit4]   2> 10646 T626 C79 P38547 oash.SnapPuller.fetchLatestIndex Total time taken for download : 0 secs
[junit4:junit4]   2> 10647 T626 C79 P38547 oash.SnapPuller.modifyIndexProps New index installed. Updating index properties... index=index.20120915044035400
[junit4:junit4]   2> 10648 T626 C79 P38547 oasu.DefaultSolrCoreState.newIndexWriter Creating new IndexWriter...
[junit4:junit4]   2> 10648 T626 C79 P38547 oasu.DefaultSolrCoreState.newIndexWriter Waiting until IndexWriter is unused... core=collection1
[junit4:junit4]   2> 10649 T626 C79 P38547 oasu.DefaultSolrCoreState.newIndexWriter Rollback old IndexWriter... core=collection1
[junit4:junit4]   2> 10653 T626 C79 P38547 oasc.SolrCore.getNewIndexDir WARNING New index directory detected: old=./org.apache.solr.cloud.BasicDistributedZk2Test-1347673224880/jetty3/index/ new=./org.apache.solr.cloud.BasicDistributedZk2Test-1347673224880/jetty3/index.20120915044035400
[junit4:junit4]   2> 10654 T626 C79 P38547 oasc.CachingDirectoryFactory.get return new directory for /usr/home/hudson/hudson-slave/workspace/Lucene-Solr-Tests-trunk-Java6/solr/build/solr-core/test/J1/./org.apache.solr.cloud.BasicDistributedZk2Test-1347673224880/jetty3/index.20120915044035400 forceNew:true
[junit4:junit4]   2> 10668 T626 C79 P38547 oasc.SolrDeletionPolicy.onInit SolrDeletionPolicy.onInit: commits:num=1
[junit4:junit4]   2> 		commit{dir=NRTCachingDirectory(org.apache.lucene.store.NIOFSDirectory@/usr/home/hudson/hudson-slave/workspace/Lucene-Solr-Tests-trunk-Java6/solr/build/solr-core/test/J1/org.apache.solr.cloud.BasicDistributedZk2Test-1347673224880/jetty3/index.20120915044035400 lockFactory=org.apache.lucene.store.NativeFSLockFactory@201a137f; maxCacheMB=48.0 maxMergeSizeMB=4.0),segFN=segments_2,generation=2,filenames=[_0_Asserting_0.tim, _0_MockSep_0.pos, _0_Asserting_0.tip, _0_Pulsing40_0.prx, _0_MockFixedIntBlock_0.tib, _0_Pulsing40_0.frq, _0_Asserting_0.prx, _0_MockFixedIntBlock_0.pyl, _0_MockFixedIntBlock_0.skp, _0_MockSep_0.skp, _0_MockFixedIntBlock_0.tii, _0_Pulsing40_0.tip, _0_MockSep_0.doc, _0.si, _0.fnm, _0_Pulsing40_0.tim, _0_MockFixedIntBlock_0.pos, _0_nrm.cfs, _0_MockSep_0.tib, _0_MockFixedIntBlock_0.frq, _0_Asserting_0.frq, _0_MockFixedIntBlock_0.doc, _0_nrm.cfe, segments_2, _0_MockSep_0.frq, _0.fdx, _0_MockSep_0.tii, _0_MockSep_0.pyl, _0.fdt]
[junit4:junit4]   2> 10669 T626 C79 P38547 oasc.SolrDeletionPolicy.updateCommits newest commit = 2
[junit4:junit4]   2> 10669 T626 C79 P38547 oasu.DefaultSolrCoreState.newIndexWriter New IndexWriter is ready to be used.
[junit4:junit4]   2> 10674 T626 C79 P38547 oass.SolrIndexSearcher.<init> Opening Searcher@56ad79d main
[junit4:junit4]   2> 10675 T625 oasc.SolrCore.registerSearcher [collection1] Registered new searcher Searcher@56ad79d main{StandardDirectoryReader(segments_2:3:nrt _0(5.0):C1)}
[junit4:junit4]   2> 10676 T625 oasc.CachingDirectoryFactory.close Closing directory:/usr/home/hudson/hudson-slave/workspace/Lucene-Solr-Tests-trunk-Java6/solr/build/solr-core/test/J1/./org.apache.solr.cloud.BasicDistributedZk2Test-1347673224880/jetty3/index
[junit4:junit4]   2> 10676 T625 oash.SnapPuller$2.onClose removing old index directory ./org.apache.solr.cloud.BasicDistributedZk2Test-1347673224880/jetty3/index
[junit4:junit4]   2> 10677 T626 C79 P38547 oasu.DirectUpdateHandler2.commit start commit{flags=0,_version_=0,optimize=false,openSearcher=true,waitSearcher=true,expungeDeletes=false,softCommit=false}
[junit4:junit4]   2> 10678 T626 C79 P38547 oass.SolrIndexSearcher.<init> Opening Searcher@5c62f8df main
[junit4:junit4]   2> 10679 T626 C79 P38547 oasu.DirectUpdateHandler2.commit end_commit_flush
[junit4:junit4]   2> 10680 T625 oasc.SolrCore.registerSearcher [collection1] Registered new searcher Searcher@5c62f8df main{StandardDirectoryReader(segments_2:3:nrt _0(5.0):C1)}
[junit4:junit4]   2> 10680 T626 C79 P38547 oasc.RecoveryStrategy.replay Replaying buffered documents. core=collection1
[junit4:junit4]   2> 10680 T648 C79 P38547 oasu.UpdateLog$LogReplayer.doReplay WARNING Starting log replay tlog{file=./org.apache.solr.cloud.BasicDistributedZk2Test-1347673224880/jetty3/tlog/tlog.0000000000000000000 refcount=2} active=true starting pos=427
[junit4:junit4]   2> 10680 T648 C79 P38547 oasu.DirectUpdateHandler2.commit start commit{flags=2,_version_=0,optimize=false,openSearcher=true,waitSearcher=true,expungeDeletes=false,softCommit=false}
[junit4:junit4]   2> 10682 T648 C79 P38547 oass.SolrIndexSearcher.<init> Opening Searcher@3e071894 main
[junit4:junit4]   2> 10683 T648 C79 P38547 oasu.DirectUpdateHandler2.commit end_commit_flush
[junit4:junit4]   2> 10684 T625 oasc.SolrCore.registerSearcher [collection1] Registered new searcher Searcher@3e071894 main{StandardDirectoryReader(segments_2:3:nrt _0(5.0):C1)}
[junit4:junit4]   2> 10684 T648 C79 P38547 oasu.UpdateLog$LogReplayer.run WARNING Log replay finished. recoveryInfo=RecoveryInfo{adds=0 deletes=0 deleteByQuery=0 errors=0 positionOfStart=427}
[junit4:junit4]   2> 10685 T626 C79 P38547 oasc.RecoveryStrategy.doRecovery Replication Recovery was successful - registering as Active. core=collection1
[junit4:junit4]   2> 10686 T626 C79 P38547 oasc.RecoveryStrategy.doRecovery Finished recovery process. core=collection1
[junit4:junit4]   2> 10844 T587 oascc.ZkStateReader.updateClusterState Updating cloud state from ZooKeeper... 
[junit4:junit4]   2> 10858 T600 oascc.ZkStateReader$2.process A cluster state change has occurred - updating...
[junit4:junit4]   2> 10858 T638 oascc.ZkStateReader$2.process A cluster state change has occurred - updating...
[junit4:junit4]   2> 10859 T645 oascc.ZkStateReader$2.process A cluster state change has occurred - updating...
[junit4:junit4]   2> 10858 T612 oascc.ZkStateReader$2.process A cluster state change has occurred - updating...
[junit4:junit4]   2> 10859 T643 oascc.ZkStateReader$2.process A cluster state change has occurred - updating...
[junit4:junit4]   2> 10858 T624 oascc.ZkStateReader$2.process A cluster state change has occurred - updating...
[junit4:junit4]   2> 10859 T566 oascc.ZkStateReader.updateClusterState Updating cloud state from ZooKeeper... 
[junit4:junit4]   2> 10858 T586 oascc.ZkStateReader$2.process A cluster state change has occurred - updating...
[junit4:junit4]   2>  C81_STATE=coll:collection1 core:collection1 props:{shard=shard2, roles=null, state=recovering, core=collection1, collection=collection1, node_name=127.0.0.1:12334_solr, base_url=http://127.0.0.1:12334/solr}
[junit4:junit4]   2> 11772 T640 C81 P12334 oasc.RecoveryStrategy.doRecovery Begin buffering updates. core=collection1
[junit4:junit4]   2> 11772 T640 C81 P12334 oasu.UpdateLog.bufferUpdates Starting to buffer updates. FSUpdateLog{state=ACTIVE, tlog=null}
[junit4:junit4]   2> 11772 T640 C81 P12334 oasc.RecoveryStrategy.replicate Attempting to replicate from http://127.0.0.1:18317/solr/collection1/. core=collection1
[junit4:junit4]   2> 11772 T640 C81 P12334 oascsi.HttpClientUtil.createClient Creating new http client, config:maxConnections=128&maxConnectionsPerHost=32&followRedirects=false
[junit4:junit4]   2> 11784 T606 C82 P18317 oasu.DirectUpdateHandler2.commit start commit{flags=0,_version_=0,optimize=false,openSearcher=true,waitSearcher=true,expungeDeletes=false,softCommit=false}
[junit4:junit4]   2> 11787 T606 C82 P18317 oasc.SolrDeletionPolicy.onInit SolrDeletionPolicy.onInit: commits:num=1
[junit4:junit4]   2> 		commit{dir=NRTCachingDirectory(org.apache.lucene.store.NIOFSDirectory@/usr/home/hudson/hudson-slave/workspace/Lucene-Solr-Tests-trunk-Java6/solr/build/solr-core/test/J1/org.apache.solr.cloud.BasicDistributedZk2Test-1347673224880/jetty2/index lockFactory=org.apache.lucene.store.NativeFSLockFactory@74cff77f; maxCacheMB=48.0 maxMergeSizeMB=4.0),segFN=segments_1,generation=1,filenames=[segments_1]
[junit4:junit4]   2> 11788 T606 C82 P18317 oasc.SolrDeletionPolicy.updateCommits newest commit = 1
[junit4:junit4]   2> 11788 T606 C82 P18317 oass.SolrIndexSearcher.<init> Opening Searcher@3ffd379f main
[junit4:junit4]   2> 11789 T606 C82 P18317 oasu.DirectUpdateHandler2.commit end_commit_flush
[junit4:junit4]   2> 11790 T613 oasc.SolrCore.registerSearcher [collection1] Registered new searcher Searcher@3ffd379f main{StandardDirectoryReader(segments_1:1)}
[junit4:junit4]   2> 11791 T606 C82 P18317 /update {waitSearcher=true&commit=true&commit_end_point=true&wt=javabin&softCommit=false&version=2} {commit=} 0 7
[junit4:junit4]   2> 11792 T640 C81 P12334 oash.ReplicationHandler.inform Commits will be reserved for  10000
[junit4:junit4]   2> 11792 T640 C81 P12334 oash.SnapPuller.<init>  No value set for 'pollInterval'. Timer Task not started.
[junit4:junit4]   2> 11794 T607 C82 P18317 oash.ReplicationHandler.inform Commits will be reserved for  10000
[junit4:junit4]   2> 11794 T607 C82 P18317 REQ /replication {command=indexversion&wt=javabin&qt=/replication&version=2} status=0 QTime=1 
[junit4:junit4]   2> 11798 T640 C81 P12334 oasc.SolrDeletionPolicy.onInit SolrDeletionPolicy.onInit: commits:num=1
[junit4:junit4]   2> 		commit{dir=NRTCachingDirectory(org.apache.lucene.store.NIOFSDirectory@/usr/home/hudson/hudson-slave/workspace/Lucene-Solr-Tests-trunk-Java6/solr/build/solr-core/test/J1/org.apache.solr.cloud.BasicDistributedZk2Test-1347673224880/jetty4/index lockFactory=org.apache.lucene.store.NativeFSLockFactory@5dd9ed0d; maxCacheMB=48.0 maxMergeSizeMB=4.0),segFN=segments_1,generation=1,filenames=[segments_1]
[junit4:junit4]   2> 11799 T640 C81 P12334 oasc.SolrDeletionPolicy.updateCommits newest commit = 1
[junit4:junit4]   2> 11799 T640 C81 P12334 oasu.DirectUpdateHandler2.commit start commit{flags=0,_version_=0,optimize=false,openSearcher=true,waitSearcher=true,expungeDeletes=false,softCommit=false}
[junit4:junit4]   2> 11828 T640 C81 P12334 oasc.SolrDeletionPolicy.onCommit SolrDeletionPolicy.onCommit: commits:num=2
[junit4:junit4]   2> 		commit{dir=NRTCachingDirectory(org.apache.lucene.store.NIOFSDirectory@/usr/home/hudson/hudson-slave/workspace/Lucene-Solr-Tests-trunk-Java6/solr/build/solr-core/test/J1/org.apache.solr.cloud.BasicDistributedZk2Test-1347673224880/jetty4/index lockFactory=org.apache.lucene.store.NativeFSLockFactory@5dd9ed0d; maxCacheMB=48.0 maxMergeSizeMB=4.0),segFN=segments_1,generation=1,filenames=[segments_1]
[junit4:junit4]   2> 		commit{dir=NRTCachingDirectory(org.apache.lucene.store.NIOFSDirectory@/usr/home/hudson/hudson-slave/workspace/Lucene-Solr-Tests-trunk-Java6/solr/build/solr-core/test/J1/org.apache.solr.cloud.BasicDistributedZk2Test-1347673224880/jetty4/index lockFactory=org.apache.lucene.store.NativeFSLockFactory@5dd9ed0d; maxCacheMB=48.0 maxMergeSizeMB=4.0),segFN=segments_2,generation=2,filenames=[segments_2]
[junit4:junit4]   2> 11829 T640 C81 P12334 oasc.SolrDeletionPolicy.updateCommits newest commit = 2
[junit4:junit4]   2> 11832 T640 C81 P12334 oass.SolrIndexSearcher.<init> Opening Searcher@7ab39f1e main
[junit4:junit4]   2> 11832 T640 C81 P12334 oasu.DirectUpdateHandler2.commit end_commit_flush
[junit4:junit4]   2> 11834 T639 oasc.SolrCore.registerSearcher [collection1] Registered new searcher Searcher@7ab39f1e main{StandardDirectoryReader(segments_2:2)}
[junit4:junit4]   2> 11834 T640 C81 P12334 oasc.RecoveryStrategy.replay No replay needed. core=collection1
[junit4:junit4]   2> 11834 T640 C81 P12334 oasc.RecoveryStrategy.doRecovery Replication Recovery was successful - registering as Active. core=collection1
[junit4:junit4]   2> 11836 T640 C81 P12334 oasc.RecoveryStrategy.doRecovery Finished recovery process. core=collection1
[junit4:junit4]   2> 11861 T566 oascc.ZkStateReader.updateClusterState Updating cloud state from ZooKeeper... 
[junit4:junit4]   2> 11865 T587 oascc.ZkStateReader.updateClusterState Updating cloud state from ZooKeeper... 
[junit4:junit4]   2> 11877 T600 oascc.ZkStateReader$2.process A cluster state change has occurred - updating...
[junit4:junit4]   2> 11877 T638 oascc.ZkStateReader$2.process A cluster state change has occurred - updating...
[junit4:junit4]   2> 11877 T643 oascc.ZkStateReader$2.process A cluster state change has occurred - updating...
[junit4:junit4]   2> 11877 T612 oascc.ZkStateReader$2.process A cluster state change has occurred - updating...
[junit4:junit4]   2> 11877 T645 oascc.ZkStateReader$2.process A cluster state change has occurred - updating...
[junit4:junit4]   2> 11877 T586 oascc.ZkStateReader$2.process A cluster state change has occurred - updating...
[junit4:junit4]   2> 11877 T624 oascc.ZkStateReader$2.process A cluster state change has occurred - updating...
[junit4:junit4]   2> 12863 T566 oascc.ZkStateReader.updateClusterState Updating cloud state from ZooKeeper... 
[junit4:junit4]   2> 12867 T578 C83 P12347 oasu.DirectUpdateHandler2.commit start commit{flags=0,_version_=0,optimize=false,openSearcher=true,waitSearcher=true,expungeDeletes=false,softCommit=false}
[junit4:junit4]   2> 13013 T578 C83 P12347 oasc.SolrDeletionPolicy.onCommit SolrDeletionPolicy.onCommit: commits:num=2
[junit4:junit4]   2> 		commit{dir=NRTCachingDirectory(org.apache.lucene.store.NIOFSDirectory@/usr/home/hudson/hudson-slave/workspace/Lucene-Solr-Tests-trunk-Java6/solr/build/solr-core/test/J1/org.apache.solr.cloud.BasicDistributedZk2Test-1347673224880/control/data/index lockFactory=org.apache.lucene.store.NativeFSLockFactory@18b198d1; maxCacheMB=48.0 maxMergeSizeMB=4.0),segFN=segments_1,generation=1,filenames=[segments_1]
[junit4:junit4]   2> 		commit{dir=NRTCachingDirectory(org.apache.lucene.store.NIOFSDirectory@/usr/home/hudson/hudson-slave/workspace/Lucene-Solr-Tests-trunk-Java6/solr/build/solr-core/test/J1/org.apache.solr.cloud.BasicDistributedZk2Test-1347673224880/control/data/index lockFactory=org.apache.lucene.store.NativeFSLockFactory@18b198d1; maxCacheMB=48.0 maxMergeSizeMB=4.0),segFN=segments_2,generation=2,filenames=[_0_Asserting_0.tim, _0_Asserting_0.tip, _0_MockSep_0.pos, _0_MockFixedIntBlock_0.tib, _0_Pulsing40_0.prx, _0_Pulsing40_0.frq, _0_Asserting_0.prx, _0_MockFixedIntBlock_0.skp, _0_MockFixedIntBlock_0.pyl, _0_MockSep_0.skp, _0_MockFixedIntBlock_0.tii, _0_Pulsing40_0.tip, _0_MockSep_0.doc, _0.si, _0.fnm, _0_Pulsing40_0.tim, _0_MockFixedIntBlock_0.pos, _0_nrm.cfs, _0_MockSep_0.tib, _0_MockFixedIntBlock_0.frq, _0_Asserting_0.frq, _0_MockFixedIntBlock_0.doc, _0_nrm.cfe, segments_2, _0_MockSep_0.frq, _0.fdx, _0_MockSep_0.tii, _0_MockSep_0.pyl, _0.fdt]
[junit4:junit4]   2> 13014 T578 C83 P12347 oasc.SolrDeletionPolicy.updateCommits newest commit = 2
[junit4:junit4]   2> 13034 T578 C83 P12347 oass.SolrIndexSearcher.<init> Opening Searcher@256e3879 main
[junit4:junit4]   2> 13035 T578 C83 P12347 oasu.DirectUpdateHandler2.commit end_commit_flush
[junit4:junit4]   2> 13036 T589 oasc.SolrCore.registerSearcher [collection1] Registered new searcher Searcher@256e3879 main{StandardDirectoryReader(segments_2:3 _0(5.0):C1)}
[junit4:junit4]   2> 13037 T578 C83 P12347 /update {waitSearcher=true&wt=javabin&commit=true&softCommit=false&version=2} {commit=} 0 170
[junit4:junit4]   2> 13039 T608 C82 P18317 oasu.DirectUpdateHandler2.commit start commit{flags=0,_version_=0,optimize=false,openSearcher=true,waitSearcher=true,expungeDeletes=false,softCommit=false}
[junit4:junit4]   2> 13043 T608 C82 P18317 oass.SolrIndexSearcher.<init> Opening Searcher@62e245b6 main
[junit4:junit4]   2> 13044 T608 C82 P18317 oasu.DirectUpdateHandler2.commit end_commit_flush
[junit4:junit4]   2> 13045 T613 oasc.SolrCore.registerSearcher [collection1] Registered new searcher Searcher@62e245b6 main{StandardDirectoryReader(segments_1:1)}
[junit4:junit4]   2> 13046 T608 C82 P18317 oasu.SolrCmdDistributor.distribCommit Distrib commit to:[StdNode: http://127.0.0.1:23908/solr/collection1/, StdNode: http://127.0.0.1:38547/solr/collection1/, StdNode: http://127.0.0.1:12334/solr/collection1/]
[junit4:junit4]   2> 13049 T597 C80 P23908 oasu.DirectUpdateHandler2.commit start commit{flags=0,_version_=0,optimize=false,openSearcher=true,waitSearcher=true,expungeDeletes=false,softCommit=false}
[junit4:junit4]   2>  C79_STATE=coll:collection1 core:collection1 props:{shard=shard1, roles=null, state=active, core=collection1, collection=collection1, node_name=127.0.0.1:38547_solr, base_url=http://127.0.0.1:38547/solr}
[junit4:junit4]   2> 13049 T616 C79 P38547 oasu.DirectUpdateHandler2.commit start commit{flags=0,_version_=0,optimize=false,openSearcher=true,waitSearcher=true,expungeDeletes=false,softCommit=false}
[junit4:junit4]   2> 13051 T616 C79 P38547 oass.SolrIndexSearcher.<init> Opening Searcher@5bd13aa main
[junit4:junit4]   2> 13051 T616 C79 P38547 oasu.DirectUpdateHandler2.commit end_commit_flush
[junit4:junit4]   2> 13053 T625 oasc.SolrCore.registerSearcher [collection1] Registered new searcher Searcher@5bd13aa main{StandardDirectoryReader(segments_2:3:nrt _0(5.0):C1)}
[junit4:junit4]   2> 13053 T616 C79 P38547 /update {waitSearcher=true&commit=true&wt=javabin&commit_end_point=true&expungeDeletes=false&softCommit=false&version=2} {commit=} 0 4
[junit4:junit4]   2> 13067 T597 C80 P23908 oass.SolrIndexSearcher.<init> Opening Searcher@29a59249 main
[junit4:junit4]   2> 13068 T597 C80 P23908 oasu.DirectUpdateHandler2.commit end_commit_flush
[junit4:junit4]   2>  C81_STATE=coll:collection1 core:collection1 props:{shard=shard2, roles=null, state=active, core=collection1, collection=collection1, node_name=127.0.0.1:12334_solr, base_url=http://127.0.0.1:12334/solr}
[junit4:junit4]   2> 13068 T630 C81 P12334 oasu.DirectUpdateHandler2.commit start commit{flags=0,_version_=0,optimize=false,openSearcher=true,waitSearcher=true,expungeDeletes=false,softCommit=false}
[junit4:junit4]   2> 13070 T601 oasc.SolrCore.registerSearcher [collection1] Registered new searcher Searcher@29a59249 main{StandardDirectoryReader(segments_2:3 _0(5.0):C1)}
[junit4:junit4]   2> 13070 T597 C80 P23908 /update {waitSearcher=true&commit=true&wt=javabin&commit_end_point=true&expungeDeletes=false&softCommit=false&version=2} {commit=} 0 21
[junit4:junit4]   2> 13073 T630 C81 P12334 oass.SolrIndexSearcher.<init> Opening Searcher@74ddb0f9 main
[junit4:junit4]   2> 13073 T630 C81 P12334 oasu.DirectUpdateHandler2.commit end_commit_flush
[junit4:junit4]   2> 13075 T639 oasc.SolrCore.registerSearcher [collection1] Registered new searcher Searcher@74ddb0f9 main{StandardDirectoryReader(segments_2:2)}
[junit4:junit4]   2> 13075 T630 C81 P12334 /update {waitSearcher=true&commit=true&wt=javabin&commit_end_point=true&expungeDeletes=false&softCommit=false&version=2} {commit=} 0 7
[junit4:junit4]   2> 13076 T608 C82 P18317 /update {waitSearcher=true&wt=javabin&commit=true&softCommit=false&version=2} {commit=} 0 37
[junit4:junit4]   2> 13083 T579 C83 P12347 REQ /select {fl=id,score&shard.url=127.0.0.1:12347/solr/collection1/&NOW=1347673237956&start=0&q=*:*&distrib=false&isShard=true&wt=javabin&fsv=true&rows=10&version=2} hits=1 status=0 QTime=1 
[junit4:junit4]   2> 13100 T579 C83 P12347 REQ /select {shard.url=127.0.0.1:12347/solr/collection1/&NOW=1347673237956&q=*:*&ids=1&distrib=false&isShard=true&wt=javabin&version=2} status=0 QTime=0 
[junit4:junit4]   2> 13102 T578 C83 P12347 REQ /select {wt=javabin&q=*:*&version=2} hits=1 status=0 QTime=23 
[junit4:junit4]   2> 13103 T566 oaz.ZooKeeper.<init> Initiating client connection, connectString=127.0.0.1:16173/solr sessionTimeout=10000 watcher=org.apache.solr.common.cloud.ConnectionManager@2acdfc37
[junit4:junit4]   2> 13103 T653 oaz.ClientCnxn$SendThread.startConnect Opening socket connection to server /127.0.0.1:16173
[junit4:junit4]   2> 13103 T566 oascc.ConnectionManager.waitForConnected Waiting for client to connect to ZooKeeper
[junit4:junit4]   2> 13104 T653 oaz.ClientCnxn$SendThread.primeConnection Socket connection established to localhost/127.0.0.1:16173, initiating session
[junit4:junit4]   2> 13104 T568 oazs.NIOServerCnxn$Factory.run Accepted socket connection from /140.211.11.196:21322
[junit4:junit4]   2> 13105 T568 oazs.NIOServerCnxn.readConnectRequest Client attempting to establish new session at /140.211.11.196:21322
[junit4:junit4]   2> 13113 T570 oazs.NIOServerCnxn.finishSessionInit Established session 0x139c79576b70009 with negotiated timeout 10000 for client /140.211.11.196:21322
[junit4:junit4]   2> 13113 T653 oaz.ClientCnxn$SendThread.readConnectResult Session establishment complete on server localhost/127.0.0.1:16173, sessionid = 0x139c79576b70009, negotiated timeout = 10000
[junit4:junit4]   2> 13113 T654 oascc.ConnectionManager.process Watcher org.apache.solr.common.cloud.ConnectionManager@2acdfc37 name:ZooKeeperConnection Watcher:127.0.0.1:16173/solr got event WatchedEvent state:SyncConnected type:None path:null path:null type:None
[junit4:junit4]   2> 13113 T566 oascc.ConnectionManager.waitForConnected Client is connected to ZooKeeper
[junit4:junit4]   2> 13114 T566 oascc.ZkStateReader.createClusterStateWatchersAndUpdate Updating cluster state from ZooKeeper... 
[junit4:junit4]   2> 13116 T571 oazs.PrepRequestProcessor.pRequest Processed session termination for sessionid: 0x139c79576b70009
[junit4:junit4]   2> 13117 T654 oaz.ClientCnxn$EventThread.run EventThread shut down
[junit4:junit4]   2> 13117 T568 oazs.NIOServerCnxn.closeSock Closed socket connection for client /140.211.11.196:21322 which had sessionid 0x139c79576b70009
[junit4:junit4]   2> 13117 T566 oaz.ZooKeeper.close Session: 0x139c79576b70009 closed
[junit4:junit4]   2> 13119 T598 C80 P23908 REQ /select {distrib=false&wt=javabin&q=*:*&version=2} hits=1 status=0 QTime=0 
[junit4:junit4]   2> 13122 T609 C82 P18317 REQ /select {distrib=false&wt=javabin&q=*:*&version=2} hits=0 status=0 QTime=0 
[junit4:junit4]   2> 13128 T593 C80 P23908 REQ /select {fl=id,score&shard.url=127.0.0.1:23908/solr/collection1/|127.0.0.1:38547/solr/collection1/&NOW=1347673238001&start=0&q=*:*&distrib=false&isShard=true&wt=javabin&fsv=true&rows=10&version=2} hits=1 status=0 QTime=0 
[junit4:junit4]   2> 13128 T631 C81 P12334 REQ /select {fl=id,score&shard.url=127.0.0.1:18317/solr/collection1/|127.0.0.1:12334/solr/collection1/&NOW=1347673238001&start=0&q=*:*&distrib=false&isShard=true&wt=javabin&fsv=true&rows=10&version=2} hits=0 status=0 QTime=0 
[junit4:junit4]   2> 13131 T593 C80 P23908 REQ /select {shard.url=127.0.0.1:23908/solr/collection1/|127.0.0.1:38547/solr/collection1/&NOW=1347673238001&q=*:*&ids=1&distrib=false&isShard=true&wt=javabin&version=2} status=0 QTime=0 
[junit4:junit4]   2> 13132 T617 C79 P38547 REQ /select {wt=javabin&q=*:*&version=2} hits=1 status=0 QTime=8 
[junit4:junit4]   2> 13137 T578 C83 P12347 /update {wt=javabin&version=2} {add=[2 (1413137813221670912)]} 0 2
[junit4:junit4]   2> 13150 T630 C81 P12334 REQ /update {distrib.from=http://127.0.0.1:18317/solr/collection1/&update.distrib=FROMLEADER&wt=javabin&version=2} status=0 QTime=6 
[junit4:junit4]   2> 13150 T608 C82 P18317 /update {wt=javabin&version=2} {add=[2 (1413137813226913792)]} 0 10
[junit4:junit4]   2> 13154 T578 C83 P12347 /update {wt=javabin&version=2} {add=[3 (1413137813240545280)]} 0 1
[junit4:junit4]   2> 13161 T630 C81 P12334 REQ /update {distrib.from=http://127.0.0.1:18317/solr/collection1/&update.distrib=FROMLEADER&wt=javabin&version=2} status=0 QTime=2 
[junit4:junit4]   2> 13162 T608 C82 P18317 /update {wt=javabin&version=2} {add=[3 (1413137813243691008)]} 0 6
[junit4:junit4]   2> 13165 T578 C83 P12347 /update {wt=javabin&version=2} {add=[4 (1413137813252079616)]} 0 1
[junit4:junit4]   2> 13176 T616 C79 P38547 REQ /update {distrib.from=http://127.0.0.1:23908/solr/collection1/&update.distrib=FROMLEADER&wt=javabin&version=2} status=0 QTime=3 
[junit4:junit4]   2> 13176 T594 C80 P23908 /update {wt=javabin&version=2} {add=[4 (1413137813256273920)]} 0 8
[junit4:junit4]   2> 13181 T578 C83 P12347 /update {wt=javabin&version=2} {add=[5 (1413137813267808256)]} 0 2
[junit4:junit4]   2> 13189 T630 C81 P12334 REQ /update {distrib.from=http://127.0.0.1:18317/solr/collection1/&update.distrib=FROMLEADER&wt=javabin&version=2} status=0 QTime=2 
[junit4:junit4]   2> 13190 T608 C82 P18317 /update {wt=javabin&version=2} {add=[5 (1413137813272002560)]} 0 7
[junit4:junit4]   2> 13194 T578 C83 P12347 /update {wt=javabin&version=2} {add=[6 (1413137813282488320)]} 0 1
[junit4:junit4]   2> 13204 T630 C81 P12334 REQ /update {update.distrib=FROMLEADER&distrib.from=http://127.0.0.1:18317/solr/collection1/&wt=javabin&version=2} status=0 QTime=2 
[junit4:junit4]   2> 13205 T610 C82 P18317 REQ /update {distrib.from=http://127.0.0.1:23908/solr/collection1/&update.distrib=TOLEADER&wt=javabin&version=2} status=0 QTime=7 
[junit4:junit4]   2> 13205 T594 C80 P23908 /update {wt=javabin&version=2} {add=[6]} 0 8
[junit4:junit4]   2> 13209 T578 C83 P12347 /update {wt=javabin&version=2} {add=[7 (1413137813298216960)]} 0 1
[junit4:junit4]   2> 13219 T630 C81 P12334 REQ /update {update.distrib=FROMLEADER&distrib.from=http://127.0.0.1:18317/solr/collection1/&wt=javabin&version=2} status=0 QTime=2 
[junit4:junit4]   2> 13220 T610 C82 P18317 REQ /update {distrib.from=http://127.0.0.1:23908/solr/collection1/&update.distrib=TOLEADER&wt=javabin&version=2} status=0 QTime=6 
[junit4:junit4]   2> 13220 T594 C80 P23908 /update {wt=javabin&version=2} {add=[7]} 0 8
[junit4:junit4]   2> 13224 T578 C83 P12347 /update {wt=javabin&version=2} {add=[8 (1413137813313945600)]} 0 1
[junit4:junit4]   2> 13231 T616 C79 P38547 REQ /update {distrib.from=http://127.0.0.1:23908/solr/collection1/&update.distrib=FROMLEADER&wt=javabin&version=2} status=0 QTime=1 
[junit4:junit4]   2> 13232 T594 C80 P23908 /update {wt=javabin&version=2} {add=[8 (1413137813318139904)]} 0 5
[junit4:junit4]   2> 13236 T578 C83 P12347 /update {wt=javabin&version=2} {add=[9 (1413137813326528512)]} 0 1
[junit4:junit4]   2> 13245 T630 C81 P12334 REQ /update {distrib.from=http://127.0.0.1:18317/solr/collection1/&update.distrib=FROMLEADER&wt=javabin&version=2} status=0 QTime=2 
[junit4:junit4]   2> 13246 T608 C82 P18317 /update {wt=javabin&version=2} {add=[9 (1413137813330722816)]} 0 7
[junit4:junit4]   2> 13250 T578 C83 P12347 /update {wt=javabin&version=2} {add=[10 (1413137813341208576)]} 0 1
[junit4:junit4]   2> 13260 T616 C79 P38547 REQ /update {update.distrib=FROMLEADER&distrib.from=http://127.0.0.1:23908/solr/collection1/&wt=javabin&version=2} status=0 QTime=1 
[junit4:junit4]   2> 13261 T597 C80 P23908 REQ /update {distrib.from=http://127.0.0.1:18317/solr/collection1/&update.distrib=TOLEADER&wt=javabin&version=2} status=0 QTime=5 
[junit4:junit4]   2> 13261 T608 C82 P18317 /update {wt=javabin&version=2} {add=[10]} 0 8
[junit4:junit4]   2> 13284 T578 C83 P12347 /update {wt=javabin&version=2} {add=[11 (1413137813356937216)]} 0 20
[junit4:junit4]   2> 13294 T616 C79 P38547 REQ /update {update.distrib=FROMLEADER&distrib.from=http://127.0.0.1:23908/solr/collection1/&wt=javabin&version=2} status=0 QTime=1 
[junit4:junit4]   2> 13295 T597 C80 P23908 REQ /update {distrib.from=http://127.0.0.1:18317/solr/collection1/&update.distrib=TOLEADER&wt=javabin&version=2} status=0 QTime=5 
[junit4:junit4]   2> 13295 T608 C82 P18317 /update {wt=javabin&version=2} {add=[11]} 0 8
[junit4:junit4]   2> 13300 T578 C83 P12347 /update {wt=javabin&version=2} {add=[12 (1413137813392588800)]} 0 2
[junit4:junit4]   2> 13307 T616 C79 P38547 REQ /update {distrib.from=http://127.0.0.1:23908/solr/collection1/&update.distrib=FROMLEADER&wt=javabin&version=2} status=0 QTime=1 
[junit4:junit4]   2> 13307 T594 C80 P23908 /update {wt=javabin&version=2} {add=[12 (1413137813396783104)]} 0 5
[junit4:junit4]   2> 13311 T578 C83 P12347 /update {wt=javabin&version=2} {add=[13 (1413137813405171712)]} 0 1
[junit4:junit4]   2> 13320 T616 C79 P38547 REQ /update {update.distrib=FROMLEADER&distrib.from=http://127.0.0.1:23908/solr/collection1/&wt=javabin&version=2} status=0 QTime=1 
[junit4:junit4]   2> 13321 T597 C80 P23908 REQ /update {distrib.from=http://127.0.0.1:18317/solr/collection1/&update.distrib=TOLEADER&wt=javabin&version=2} status=0 QTime=5 
[junit4:junit4]   2> 13321 T608 C82 P18317 /update {wt=javabin&version=2} {add=[13]} 0 7
[junit4:junit4]   2> 13325 T578 C83 P12347 /update {wt=javabin&version=2} {add=[14 (1413137813419851776)]} 0 1
[junit4:junit4]   2> 13334 T616 C79 P38547 REQ /update {update.distrib=FROMLEADER&distrib.from=http://127.0.0.1:23908/solr/collection1/&wt=javabin&version=2} status=0 QTime=1 
[junit4:junit4]   2> 13334 T597 C80 P23908 REQ /update {distrib.from=http://127.0.0.1:18317/solr/collection1/&update.distrib=TOLEADER&wt=javabin&version=2} status=0 QTime=4 
[junit4:junit4]   2> 13335 T608 C82 P18317 /update {wt=javabin&version=2} {add=[14]} 0 7
[junit4:junit4]   2> 13339 T578 C83 P12347 /update {wt=javabin&version=2} {add=[15 (1413137813434531840)]} 0 1
[junit4:junit4]   2> 13346 T616 C79 P38547 REQ /update {distrib.from=http://127.0.0.1:23908/solr/collection1/&update.distrib=FROMLEADER&wt=javabin&version=2} status=0 QTime=1 
[junit4:junit4]   2> 13347 T594 C80 P23908 /update {wt=javabin&version=2} {add=[15 (1413137813437677568)]} 0 6
[junit4:junit4]   2> 13351 T578 C83 P12347 /update {wt=javabin&version=2} {add=[16 (1413137813447114752)]} 0 1
[junit4:junit4]   2> 13359 T616 C79 P38547 REQ /update {update.distrib=FROMLEADER&distrib.from=http://127.0.0.1:23908/solr/collection1/&wt=javabin&version=2} status=0 QTime=1 
[junit4:junit4]   2> 13359 T597 C80 P23908 REQ /update {distrib.from=http://127.0.0.1:18317/solr/collection1/&update.distrib=TOLEADER&wt=javabin&version=2} status=0 QTime=4 
[junit4:junit4]   2> 13360 T608 C82 P18317 /update {wt=javabin&version=2} {add=[16]} 0 7
[junit4:junit4]   2> 13365 T578 C83 P12347 /update {wt=javabin&version=2} {add=[17 (1413137813461794816)]} 0 2
[junit4:junit4]   2> 13381 T630 C81 P12334 REQ /update {distrib.from=http://127.0.0.1:18317/solr/collection1/&update.distrib=FROMLEADER&wt=javabin&version=2} status=0 QTime=7 
[junit4:junit4]   2> 13382 T608 C82 P18317 /update {wt=javabin&version=2} {add=[17 (1413137813467037696)]} 0 14
[junit4:junit4]   2> 13385 T578 C83 P12347 /update {wt=javabin&version=2} {add=[100 (1413137813482766336)]} 0 1
[junit4:junit4]   2> 13420 T616 C79 P38547 REQ /update {update.distrib=FROMLEADER&distrib.from=http://127.0.0.1:23908/solr/collection1/&wt=javabin&version=2} status=0 QTime=12 
[junit4:junit4]   2> 13420 T597 C80 P23908 REQ /update {distrib.from=http://127.0.0.1:18317/solr/collection1/&update.distrib=TOLEADER&wt=javabin&version=2} status=0 QTime=29 
[junit4:junit4]   2> 13421 T608 C82 P18317 /update {wt=javabin&version=2} {add=[100]} 0 33
[junit4:junit4]   2> 13425 T578 C83 P12347 /update {wt=javabin&version=2} {add=[101 (1413137813524709376)]} 0 1
[junit4:junit4]   2> 13436 T616 C79 P38547 REQ /update {update.distrib=FROMLEADER&distrib.from=http://127.0.0.1:23908/solr/collection1/&wt=javabin&version=2} status=0 QTime=2 
[junit4:junit4]   2> 13436 T597 C80 P23908 REQ /update {distrib.from=http://127.0.0.1:18317/solr/collection1/&update.distrib=TOLEADER&wt=javabin&version=2} status=0 QTime=6 
[junit4:junit4]   2> 13437 T608 C82 P18317 /update {wt=javabin&version=2} {add=[101]} 0 9
[junit4:junit4]   2> 13440 T578 C83 P12347 /update {wt=javabin&version=2} {add=[102 (1413137813540438016)]} 0 1
[junit4:junit4]   2> 13448 T616 C79 P38547 REQ /update {update.distrib=FROMLEADER&distrib.from=http://127.0.0.1:23908/solr/collection1/&wt=javabin&version=2} status=0 QTime=1 
[junit4:junit4]   2> 13449 T597 C80 P23908 REQ /update {distrib.from=http://127.0.0.1:18317/solr/collection1/&update.distrib=TOLEADER&wt=javabin&version=2} status=0 QTime=5 
[junit4:junit4]   2> 13449 T608 C82 P18317 /update {wt=javabin&version=2} {add=[102]} 0 7
[junit4:junit4]   2> 13464 T578 C83 P12347 /update {wt=javabin&version=2} {add=[103 (1413137813554069504)]} 0 12
[junit4:junit4]   2> 13472 T630 C81 P12334 REQ /update {distrib.from=http://127.0.0.1:18317/solr/collection1/&update.distrib=FROMLEADER&wt=javabin&version=2} status=0 QTime=2 
[junit4:junit4]   2> 13473 T608 C82 P18317 /update {wt=javabin&version=2} {add=[103 (1413137813569798144)]} 0 6
[junit4:junit4]   2> 13476 T578 C83 P12347 /update {wt=javabin&version=2} {add=[104 (1413137813578186752)]} 0 1
[junit4:junit4]   2> 13486 T630 C81 P12334 REQ /update {update.distrib=FROMLEADER&distrib.from=http://127.0.0.1:18317/solr/collection1/&wt=javabin&version=2} status=0 QTime=2 
[junit4:junit4]   2> 13487 T610 C82 P18317 REQ /update {distrib.from=http://127.0.0.1:23908/solr/collection1/&update.distrib=TOLEADER&wt=javabin&version=2} status=0 QTime=6 
[junit4:junit4]   2> 13487 T594 C80 P23908 /update {wt=javabin&version=2} {add=[104]} 0 8
[junit4:junit4]   2> 13491 T578 C83 P12347 /update {wt=javabin&version=2} {add=[105 (1413137813593915392)]} 0 1
[junit4:junit4]   2> 13535 T630 C81 P12334 REQ /update {distrib.from=http://127.0.0.1:18317/solr/collection1/&update.distrib=FROMLEADER&wt=javabin&version=2} status=0 QTime=28 
[junit4:junit4]   2> 13536 T608 C82 P18317 /update {wt=javabin&version=2} {add=[105 (1413137813597061120)]} 0 43
[junit4:junit4]   2> 13540 T578 C83 P12347 /update {wt=javabin&version=2} {add=[106 (1413137813645295616)]} 0 1
[junit4:junit4]   2> 13553 T630 C81 P12334 REQ /update {update.distrib=FROMLEADER&distrib.from=http://127.0.0.1:18317/solr/collection1/&wt=javabin&version=2} status=0 QTime=3 
[junit4:junit4]   2> 13554 T610 C82 P18317 REQ /update {distrib.from=http://127.0.0.1:23908/solr/collection1/&update.distrib=TOLEADER&wt=javabin&version=2} status=0 QTime=9 
[junit4:junit4]   2> 13555 T594 C80 P23908 /update {wt=javabin&version=2} {add=[106]} 0 12
[junit4:junit4]   2> 13558 T578 C83 P12347 /update {wt=javabin&version=2} {add=[107 (1413137813664169984)]} 0 1
[junit4:junit4]   2> 13564 T616 C79 P38547 REQ /update {distrib.from=http://127.0.0.1:23908/solr/collection1/&update.distrib=FROMLEADER&wt=javabin&version=2} status=0 QTime=1 
[junit4:junit4]   2> 13564 T594 C80 P23908 /update {wt=javabin&version=2} {add=[107 (1413137813667315712)]} 0 4
[junit4:junit4]   2> 13568 T578 C83 P12347 /update {wt=javabin&version=2} {add=[108 (1413137813674655744)]} 0 1
[junit4:junit4]   2> 13576 T616 C79 P38547 REQ /update {update.distrib=FROMLEADER&distrib.from=http://127.0.0.1:23908/solr/collection1/&wt=javabin&version=2} status=0 QTime=1 
[junit4:junit4]   2> 13576 T597 C80 P23908 REQ /update {distrib.from=http://127.0.0.1:18317/solr/collection1/&update.distrib=TOLEADER&wt=javabin&version=2} status=0 QTime=4 
[junit4:junit4]   2> 13576 T608 C82 P18317 /update {wt=javabin&version=2} {add=[108]} 0 6
[junit4:junit4]   2> 13580 T578 C83 P12347 /update {wt=javabin&version=2} {add=[109 (1413137813687238656)]} 0 1
[junit4:junit4]   2> 13588 T616 C79 P38547 REQ /update {update.distrib=FROMLEADER&distrib.from=http://127.0.0.1:23908/solr/collection1/&wt=javabin&version=2} status=0 QTime=1 
[junit4:junit4]   2> 13588 T597 C80 P23908 REQ /update {distrib.from=http://127.0.0.1:18317/solr/collection1/&update.distrib=TOLEADER&wt=javabin&version=2} status=0 QTime=4 
[junit4:junit4]   2> 13588 T608 C82 P18317 /update {wt=javabin&version=2} {add=[109]} 0 6
[junit4:junit4]   2> 13592 T578 C83 P12347 /update {wt=javabin&version=2} {add=[110 (1413137813699821568)]} 0 1
[junit4:junit4]   2> 13598 T616 C79 P38547 REQ /update {distrib.from=http://127.0.0.1:23908/solr/collection1/&update.distrib=FROMLEADER&wt=javabin&version=2} status=0 QTime=1 
[junit4:junit4]   2> 13598 T594 C80 P23908 /update {wt=javabin&version=2} {add=[110 (1413137813702967296)]} 0 4
[junit4:junit4]   2> 13602 T578 C83 P12347 /update {wt=javabin&version=2} {add=[111 (1413137813710307328)]} 0 1
[junit4:junit4]   2> 13608 T616 C79 P38547 REQ /update {distrib.from=http://127.0.0.1:23908/solr/collection1/&update.distrib=FROMLEADER&wt=javabin&version=2} status=0 QTime=1 
[junit4:junit4]   2> 13608 T594 C80 P23908 /update {wt=javabin&version=2} {add=[111 (1413137813713453056)]} 0 4
[junit4:junit4]   2> 13612 T578 C83 P12347 /update {wt=javabin&version=2} {add=[112 (1413137813720793088)]} 0 1
[junit4:junit4]   2> 13618 T630 C81 P12334 REQ /update {distrib.from=http://127.0.0.1:18317/solr/collection1/&update.distrib=FROMLEADER&wt=javabin&version=2} status=0 QTime=1 
[junit4:junit4]   2> 13619 T608 C82 P18317 /update {wt=javabin&version=2} {add=[112 (1413137813723938816)]} 0 5
[junit4:junit4]   2> 13632 T578 C83 P12347 /update {wt=javabin&version=2} {add=[113 (1413137813731278848)]} 0 11
[junit4:junit4]   2> 13640 T616 C79 P38547 REQ /update {distrib.from=http://127.0.0.1:23908/solr/collection1/&update.distrib=FROMLEADER&wt=javabin&version=2} status=0 QTime=1 
[junit4:junit4]   2> 13640 T594 C80 P23908 /update {wt=javabin&version=2} {add=[113 (1413137813745958912)]} 0 5
[junit4:junit4]   2> 13645 T578 C83 P12347 /update {wt=javabin&version=2} {add=[114 (1413137813754347520)]} 0 2
[junit4:junit4]   2> 13653 T616 C79 P38547 REQ /update {distrib.from=http://127.0.0.1:23908/solr/collection1/&update.distrib=FROMLEADER&wt=javabin&version=2} status=0 QTime=1 
[junit4:junit4]   2> 13654 T594 C80 P23908 /update {wt=javabin&version=2} {add=[114 (1413137813759590400)]} 0 6
[junit4:junit4]   2> 13658 T578 C83 P12347 /update {wt=javabin&version=2} {add=[115 (1413137813769027584)]} 0 1
[junit4:junit4]   2> 13667 T630 C81 P12334 REQ /update {update.distrib=FROMLEADER&distrib.from=http://127.0.0.1:18317/solr/collection1/&wt=javabin&version=2} status=0 QTime=1 
[junit4:junit4]   2> 13668 T610 C82 P18317 REQ /update {distrib.from=http://127.0.0.1:23908/solr/collection1/&update.distrib=TOLEADER&wt=javabin&version=2} status=0 QTime=5 
[junit4:junit4]   2> 13668 T594 C80 P23908 /update {wt=javabin&version=2} {add=[115]} 0 7
[junit4:junit4]   2> 13672 T578 C83 P12347 /update {wt=javabin&version=2} {add=[116 (1413137813783707648)]} 0 1
[junit4:junit4]   2> 13681 T630 C81 P12334 REQ /update {update.distrib=FROMLEADER&distrib.from=http://127.0.0.1:18317/solr/collection1/&wt=javabin&version=2} status=0 QTime=1 
[junit4:junit4]   2> 13682 T610 C82 P18317 REQ /update {distrib.from=http://127.0.0.1:23908/solr/collection1/&update.distrib=TOLEADER&wt=javabin&version=2} status=0 QTime=5 
[junit4:junit4]   2> 13683 T594 C80 P23908 /update {wt=javabin&version=2} {add=[116]} 0 8
[junit4:junit4]   2> 13686 T578 C83 P12347 /update {wt=javabin&version=2} {add=[117 (1413137813798387712)]} 0 1
[junit4:junit4]   2> 13694 T630 C81 P12334 REQ /update {update.distrib=FROMLEADER&distrib.from=http://127.0.0.1:18317/solr/collection1/&wt=javabin&version=2} status=0 QTime=1 
[junit4:junit4]   2> 13695 T610 C82 P18317 REQ /update {distrib.from=http://127.0.0.1:23908/solr/collection1/&update.distrib=TOLEADER&wt=javabin&version=2} status=0 QTime=5 
[junit4:junit4]   2> 13695 T594 C80 P23908 /update {wt=javabin&version=2} {add=[117]} 0 7
[junit4:junit4]   2> 13699 T578 C83 P12347 /update {wt=javabin&version=2} {add=[118 (1413137813812019200)]} 0 1
[junit4:junit4]   2> 13726 T616 C79 P38547 REQ /update {update.distrib=FROMLEADER&distrib.from=http://127.0.0.1:23908/solr/collection1/&wt=javabin&version=2} status=0 QTime=10 
[junit4:junit4]   2> 13727 T597 C80 P23908 REQ /update {distrib.from=http://127.0.0.1:18317/solr/collection1/&update.distrib=TOLEADER&wt=javabin&version=2} status=0 QTime=23 
[junit4:junit4]   2> 13727 T608 C82 P18317 /update {wt=javabin&version=2} {add=[118]} 0 25
[junit4:junit4]   2> 13731 T578 C83 P12347 /update {wt=javabin&version=2} {add=[119 (1413137813845573632)]} 0 1
[junit4:junit4]   2> 13737 T630 C81 P12334 REQ /update {distrib.from=http://127.0.0.1:18317/solr/collection1/&update.distrib=FROMLEADER&wt=javabin&version=2} status=0 QTime=1 
[junit4:junit4]   2> 13738 T608 C82 P18317 /update {wt=javabin&version=2} {add=[119 (1413137813848719360)]} 0 5
[junit4:junit4]   2> 13742 T578 C83 P12347 /update {wt=javabin&version=2} {add=[120 (1413137813857107968)]} 0 1
[junit4:junit4]   2> 13750 T630 C81 P12334 REQ /update {update.distrib=FROMLEADER&distrib.from=http://127.0.0.1:18317/solr/collection1/&wt=javabin&version=2} status=0 QTime=1 
[junit4:junit4]   2> 13751 T610 C82 P18317 REQ /update {distrib.from=http://127.0.0.1:23908/solr/collection1/&update.distrib=TOLEADER&wt=javabin&version=2} status=0 QTime=5 
[junit4:junit4]   2> 13752 T594 C80 P23908 /update {wt=javabin&version=2} {add=[120]} 0 8
[junit4:junit4]   2> 13755 T578 C83 P12347 /update {wt=javabin&version=2} {add=[121 (1413137813870739456)]} 0 1
[junit4:junit4]   2> 13763 T630 C81 P12334 REQ /update {update.distrib=FROMLEADER&distrib.from=http://127.0.0.1:18317/solr/collection1/&wt=javabin&version=2} status=0 QTime=1 
[junit4:junit4]   2> 13764 T610 C82 P18317 REQ /update {distrib.from=http://127.0.0.1:23908/solr/collection1/&update.distrib=TOLEADER&wt=javabin&version=2} status=0 QTime=5 
[junit4:junit4]   2> 13764 T594 C80 P23908 /update {wt=javabin&version=2} {add=[121]} 0 7
[junit4:junit4]   2> 13768 T578 C83 P12347 /update {wt=javabin&version=2} {add=[122 (1413137813884370944)]} 0 1
[junit4:junit4]   2> 13775 T616 C79 P38547 REQ /update {distrib.from=http://127.0.0.1:23908/solr/collection1/&update.distrib=FROMLEADER&wt=javabin&version=2} status=0 QTime=1 
[junit4:junit4]   2> 13775 T594 C80 P23908 /update {wt=javabin&version=2} {add=[122 (1413137813887516672)]} 0 5
[junit4:junit4]   2> 13788 T578 C83 P12347 /update {wt=javabin&version=2} {add=[123 (1413137813894856704)]} 0 11
[junit4:junit4]   2> 13794 T616 C79 P38547 REQ /update {distrib.from=http://127.0.0.1:23908/solr/collection1/&update.distrib=FROMLEADER&wt=javabin&version=2} status=0 QTime=1 
[junit4:junit4]   2> 13794 T594 C80 P23908 /update {wt=javabin&version=2} {add=[123 (1413137813908488192)]} 0 4
[junit4:junit4]   2> 13799 T578 C83 P12347 /update {wt=javabin&version=2} {add=[124 (1413137813915828224)]} 0 2
[junit4:junit4]   2> 13807 T616 C79 P38547 REQ /update {update.distrib=FROMLEADER&distrib.from=http://127.0.0.1:23908/solr/collection1/&wt=javabin&version=2} status=0 QTime=1 
[junit4:junit4]   2> 13807 T597 C80 P23908 REQ /update {distrib.from=http://127.0.0.1:18317/solr/collection1/&update.distrib=TOLEADER&wt=javabin&version=2} status=0 QTime=4 
[junit4:junit4]   2> 13808 T608 C82 P18317 /update {wt=javabin&version=2} {add=[124]} 0 7
[junit4:junit4]   2> 13811 T578 C83 P12347 /update {wt=javabin&version=2} {add=[125 (1413137813929459712)]} 0 1
[junit4:junit4]   2> 13819 T616 C79 P38547 REQ /update {update.distrib=FROMLEADER&distrib.from=http://127.0.0.1:23908/solr/collection1/&wt=javabin&version=2} status=0 QTime=1 
[junit4:junit4]   2> 13819 T597 C80 P23908 REQ /update {distrib.from=http://127.0.0.1:18317/solr/collection1/&update.distrib=TOLEADER&wt=javabin&version=2} status=0 QTime=4 
[junit4:junit4]   2> 13819 T608 C82 P18317 /update {wt=javabin&version=2} {add=[125]} 0 6
[junit4:junit4]   2> 13823 T578 C83 P12347 /update {wt=javabin&version=2} {add=[126 (1413137813942042624)]} 0 1
[junit4:junit4]   2> 13829 T630 C81 P12334 REQ /update {distrib.from=http://127.0.0.1:18317/solr/collection1/&update.distrib=FROMLEADER&wt=javabin&version=2} status=0 QTime=1 
[junit4:junit4]   2> 13830 T608 C82 P18317 /update {wt=javabin&version=2} {add=[126 (1413137813945188352)]} 0 5
[junit4:junit4]   2> 13834 T578 C83 P12347 /update {wt=javabin&version=2} {add=[127 (1413137813953576960)]} 0 1
[junit4:junit4]   2> 13866 T630 C81 P12334 REQ /update {update.distrib=FROMLEADER&distrib.from=http://127.0.0.1:18317/solr/collection1/&wt=javabin&version=2} status=0 QTime=14 
[junit4:junit4]   2> 13867 T610 C82 P18317 REQ /update {distrib.from=http://127.0.0.1:23908/solr/collection1/&update.distrib=TOLEADER&wt=javabin&version=2} status=0 QTime=28 
[junit4:junit4]   2> 13868 T594 C80 P23908 /update {wt=javabin&version=2} {add=[127]} 0 31
[junit4:junit4]   2> 13871 T578 C83 P12347 /update {wt=javabin&version=2} {add=[128 (1413137813992374272)]} 0 1
[junit4:junit4]   2> 13880 T630 C81 P12334 REQ /update {distrib.from=http://127.0.0.1:18317/solr/collection1/&update.distrib=FROMLEADER&wt=javabin&version=2} status=0 QTime=2 
[junit4:junit4]   2> 13881 T608 C82 P18317 /update {wt=javabin&version=2} {add=[128 (1413137813996568576)]} 0 7
[junit4:junit4]   2> 13885 T578 C83 P12347 /update {wt=javabin&version=2} {add=[129 (1413137814007054336)]} 0 1
[junit4:junit4]   2> 13893 T616 C79 P38547 REQ /update {update.distrib=FROMLEADER&distrib.from=http://127.0.0.1:23908/solr/collection1/&wt=javabin&version=2} status=0 QTime=1 
[junit4:junit4]   2> 13893 T597 C80 P23908 REQ /update {distrib.from=http://127.0.0.1:18317/solr/collection1/&update.distrib=TOLEADER&wt=javabin&version=2} status=0 QTime=4 
[junit4:junit4]   2> 13894 T608 C82 P18317 /update {wt=javabin&version=2} {add=[129]} 0 7
[junit4:junit4]   2> 13897 T578 C83 P12347 /update {wt=javabin&version=2} {add=[130 (1413137814019637248)]} 0 1
[junit4:junit4]   2> 13903 T630 C81 P12334 REQ /update {distrib.from=http://127.0.0.1:18317/solr/collection1/&update.distrib=FROMLEADER&wt=javabin&version=2} status=0 QTime=1 
[junit4:junit4]   2> 13904 T608 C82 P18317 /update {wt=javabin&version=2} {add=[130 (1413137814022782976)]} 0 5
[junit4:junit4]   2> 13907 T578 C83 P12347 /update {wt=javabin&version=2} {add=[131 (1413137814030123008)]} 0 1
[junit4:junit4]   2> 13915 T630 C81 P12334 REQ /update {update.distrib=FROMLEADER&distrib.from=http://127.0.0.1:18317/solr/collection1/&wt=javabin&version=2} status=0 QTime=1 
[junit4:junit4]   2> 13915 T610 C82 P18317 REQ /update {distrib.from=http://127.0.0.1:23908/solr/collection1/&update.distrib=TOLEADER&wt=javabin&version=2} status=0 QTime=4 
[junit4:junit4]   2> 13915 T594 C80 P23908 /update {wt=javabin&version=2} {add=[131]} 0 6
[junit4:junit4]   2> 13919 T578 C83 P12347 /update {wt=javabin&version=2} {add=[132 (1413137814042705920)]} 0 1
[junit4:junit4]   2> 13926 T616 C79 P38547 REQ /update {distrib.from=http://127.0.0.1:23908/solr/collection1/&update.distrib=FROMLEADER&wt=javabin&version=2} status=0 QTime=1 
[junit4:junit4]   2> 13926 T594 C80 P23908 /update {wt=javabin&version=2} {add=[132 (1413137814046900224)]} 0 4
[junit4:junit4]   2> 13939 T578 C83 P12347 /update {wt=javabin&version=2} {add=[133 (1413137814054240256)]} 0 10
[junit4:junit4]   2> 13945 T616 C79 P38547 REQ /update {distrib.from=http://127.0.0.1:23908/solr/collection1/&update.distrib=FROMLEADER&wt=javabin&version=2} status=0 QTime=1 
[junit4:junit4]   2> 13945 T594 C80 P23908 /update {wt=javabin&version=2} {add=[133 (1413137814066823168)]} 0 4
[junit4:junit4]   2> 13950 T578 C83 P12347 /update {wt=javabin&version=2} {add=[134 (1413137814074163200)]} 0 2
[junit4:junit4]   2> 13958 T630 C81 P12334 REQ /update {update.distrib=FROMLEADER&distrib.from=http://127.0.0.1:18317/solr/collection1/&wt=javabin&version=2} status=0 QTime=1 
[junit4:junit4]   2> 13958 T610 C82 P18317 REQ /update {distrib.from=http://127.0.0.1:23908/solr/collection1/&update.distrib=TOLEADER&wt=javabin&version=2} status=0 QTime=4 
[junit4:junit4]   2> 13958 T594 C80 P23908 /update {wt=javabin&version=2} {add=[134]} 0 6
[junit4:junit4]   2> 13962 T578 C83 P12347 /update {wt=javabin&version=2} {add=[135 (1413137814087794688)]} 0 1
[junit4:junit4]   2> 13970 T616 C79 P38547 REQ /update {update.distrib=FROMLEADER&distrib.from=http://127.0.0.1:23908/solr/collection1/&wt=javabin&version=2} status=0 QTime=1 
[junit4:junit4]   2> 13971 T597 C80 P23908 REQ /update {distrib.from=http://127.0.0.1:18317/solr/collection1/&update.distrib=TOLEADER&wt=javabin&version=2} status=0 QTime=5 
[junit4:junit4]   2> 13971 T608 C82 P18317 /update {wt=javabin&version=2} {add=[135]} 0 7
[junit4:junit4]   2> 13975 T578 C83 P12347 /update {wt=javabin&version=2} {add=[136 (1413137814101426176)]} 0 1
[junit4:junit4]   2> 13983 T630 C81 P12334 REQ /update {update.distrib=FROMLEADER&distrib.from=http://127.0.0.1:18317/solr/collection1/&wt=javabin&version=2} status=0 QTime=1 
[junit4:junit4]   2> 13983 T610 C82 P18317 REQ /update {distrib.from=http://127.0.0.1:23908/solr/collection1/&update.distrib=TOLEADER&wt=javabin&version=2} status=0 QTime=4 
[junit4:junit4]   2> 13983 T594 C80 P23908 /update {wt=javabin&version=2} {add=[136]} 0 6
[junit4:junit4]   2> 13987 T578 C83 P12347 /update {wt=javabin&version=2} {add=[137 (1413137814114009088)]} 0 1
[junit4:junit4]   2> 13995 T630 C81 P12334 REQ /update {update.distrib=FROMLEADER&distrib.from=http://127.0.0.1:18317/solr/collection1/&wt=javabin&version=2} status=0 QTime=1 
[junit4:junit4]   2> 13995 T610 C82 P18317 REQ /update {distrib.from=http://127.0.0.1:23908/solr/collection1/&update.distrib=TOLEADER&wt=javabin&version=2} status=0 QTime=4 
[junit4:junit4]   2> 13995 T594 C80 P23908 /update {wt=javabin&version=2} {add=[137]} 0 6
[junit4:junit4]   2> 13999 T578 C83 P12347 /update {wt=javabin&version=2} {add=[138 (1413137814126592000)]} 0 1
[junit4:junit4]   2> 14005 T616 C79 P38547 REQ /update {distrib.from=http://127.0.0.1:23908/solr/collection1/&update.distrib=FROMLEADER&wt=javabin&version=2} status=0 QTime=1 
[junit4:junit4]   2> 14006 T594 C80 P23908 /update {wt=javabin&version=2} {add=[138 (1413137814129737728)]} 0 5
[junit4:junit4]   2> 14009 T578 C83 P12347 /update {wt=javabin&version=2} {add=[139 (1413137814137077760)]} 0 1
[junit4:junit4]   2> 14017 T630 C81 P12334 REQ /update {update.distrib=FROMLEADER&distrib.from=http://127.0.0.1:18317/solr/collection1/&wt=javabin&version=2} status=0 QTime=1 
[junit4:junit4]   2> 14017 T610 C82 P18317 REQ /update {distrib.from=http://127.0.0.1:23908/solr/collection1/&update.distrib=TOLEADER&wt=javabin&version=2} status=0 QTime=4 
[junit4:junit4]   2> 14017 T594 C80 P23908 /update {wt=javabin&version=2} {add=[139]} 0 6
[junit4:junit4]   2> 14021 T578 C83 P12347 /update {wt=javabin&version=2} {add=[140 (1413137814149660672)]} 0 1
[junit4:junit4]   2> 14029 T630 C81 P12334 REQ /update {update.distrib=FROMLEADER&distrib.from=http://127.0.0.1:18317/solr/collection1/&wt=javabin&version=2} status=0 QTime=1 
[junit4:junit4]   2> 14029 T610 C82 P18317 REQ /update {distrib.from=http://127.0.0.1:23908/solr/collection1/&update.distrib=TOLEADER&wt=javabin&version=2} status=0 QTime=4 
[junit4:junit4]   2> 14030 T594 C80 P23908 /update {wt=javabin&version=2} {add=[140]} 0 7
[junit4:junit4]   2> 14033 T578 C83 P12347 /update {wt=javabin&version=2} {add=[141 (1413137814162243584)]} 0 1
[junit4:junit4]   2> 14039 T630 C81 P12334 REQ /update {distrib.from=http://127.0.0.1:18317/solr/collection1/&update.distrib=FROMLEADER&wt=javabin&version=2} status=0 QTime=1 
[junit4:junit4]   2> 14039 T608 C82 P18317 /update {wt=javabin&version=2} {add=[141 (1413137814165389312)]} 0 4
[junit4:junit4]   2> 14042 T578 C83 P12347 /update {wt=javabin&version=2} {add=[142 (1413137814172729344)]} 0 0
[junit4:junit4]   2> 14067 T630 C81 P12334 REQ /update {distrib.from=http://127.0.0.1:18317/solr/collection1/&update.distrib=FROMLEADER&wt=javabin&version=2} status=0 QTime=10 
[junit4:junit4]   2> 14068 T608 C82 P18317 /update {wt=javabin&version=2} {add=[142 (1413137814175875072)]} 0 23
[junit4:junit4]   2> 14085 T578 C83 P12347 /update {wt=javabin&version=2} {add=[143 (1413137814202089472)]} 0 15
[junit4:junit4]   2> 14093 T630 C81 P12334 REQ /update {distrib.from=http://127.0.0.1:18317/solr/collection1/&update.distrib=FROMLEADER&wt=javabin&version=2} status=0 QTime=1 
[junit4:junit4]   2> 14094 T608 C82 P18317 /update {wt=javabin&version=2} {add=[143 (1413137814220963840)]} 0 6
[junit4:junit4]   2> 14098 T578 C83 P12347 /update {wt=javabin&version=2} {add=[144 (1413137814229352448)]} 0 2
[junit4:junit4]   2> 14105 T630 C81 P12334 REQ /update {distrib.from=http://127.0.0.1:18317/solr/collection1/&update.distrib=FROMLEADER&wt=javabin&version=2} status=0 QTime=1 
[junit4:junit4]   2> 14105 T608 C82 P18317 /update {wt=javabin&version=2} {add=[144 (1413137814234595328)]} 0 4
[junit4:junit4]   2> 14109 T578 C83 P12347 /update {wt=javabin&version=2} {add=[145 (1413137814241935360)]} 0 1
[junit4:junit4]   2> 14118 T630 C81 P12334 REQ /update {update.distrib=FROMLEADER&distrib.from=http://127.0.0.1:18317/solr/collection1/&wt=javabin&version=2} status=0 QTime=1 
[junit4:junit4]   2> 14118 T610 C82 P18317 REQ /update {distrib.from=http://127.0.0.1:23908/solr/collection1/&update.distrib=TOLEADER&wt=javabin&version=2} status=0 QTime=4 
[junit4:junit4]   2> 14118 T594 C80 P23908 /update {wt=javabin&version=2} {add=[145]} 0 6
[junit4:junit4]   2> 14122 T578 C83 P12347 /update {wt=javabin&version=2} {add=[146 (1413137814255566848)]} 0 1
[junit4:junit4]   2> 14151 T616 C79 P38547 REQ /update {update.distrib=FROMLEADER&distrib.from=http://127.0.0.1:23908/solr/collection1/&wt=javabin&version=2} status=0 QTime=13 
[junit4:junit4]   2> 14151 T597 C80 P23908 REQ /update {distrib.from=http://127.0.0.1:18317/solr/collection1/&update.distrib=TOLEADER&wt=javabin&version=2} status=0 QTime=25 
[junit4:junit4]   2> 14152 T608 C82 P18317 /update {wt=javabin&version=2} {add=[146]} 0 28
[junit4:junit4]   2> 14157 T578 C83 P12347 /update {wt=javabin&version=2} {add=[147 (1413137814291218432)]} 0 2
[junit4:junit4]   2> 14164 T630 C81 P12334 REQ /update {distrib.from=http://127.0.0.1:18317/solr/collection1/&update.distrib=FROMLEADER&wt=javabin&version=2} status=0 QTime=1 
[junit4:junit4]   2> 14164 T608 C82 P18317 /update {wt=javabin&version=2} {add=[147 (1413137814296461312)]} 0 4
[junit4:junit4]   2> 14168 T578 C83 P12347 /update {wt=javabin&version=2} {add=[148 (1413137814303801344)]} 0 1
[junit4:junit4]   2> 14181 T616 C79 P38547 REQ /update {update.distrib=FROMLEADER&distrib.from=http://127.0.0.1:23908/solr/collection1/&wt=javabin&version=2} status=0 QTime=3 
[junit4:junit4]   2> 14181 T597 C80 P23908 REQ /update {distrib.from=http://127.0.0.1:18317/solr/collection1/&update.distrib=TOLEADER&wt=javabin&version=2} status=0 QTime=7 
[junit4:junit4]   2> 14182 T608 C82 P18317 /update {wt=javabin&version=2} {add=[148]} 0 11
[junit4:junit4]   2> 14186 T578 C83 P12347 /update {wt=javabin&version=2} {add=[149 (1413137814322675712)]} 0 1
[junit4:junit4]   2> 14195 T630 C81 P12334 REQ /update {update.distrib=FROMLEADER&distrib.from=http://127.0.0.1:18317/solr/collection1/&wt=javabin&version=2} status=0 QTime=1 
[junit4:junit4]   2> 14195 T610 C82 P18317 REQ /update {distrib.from=http://127.0.0.1:23908/solr/collection1/&update.distrib=TOLEADER&wt=javabin&version=2} status=0 QTime=4 
[junit4:junit4]   2> 14196 T594 C80 P23908 /update {wt=javabin&version=2} {add=[149]} 0 7
[junit4:junit4]   2> 14196 T566 oasc.AbstractDistribZkTestBase.waitForRecoveriesToFinish Wait for recoveries to finish - collection: collection1 failOnTimeout:true timeout (sec):1440
[junit4:junit4]   2> 14197 T566 oascc.ZkStateReader.updateClusterState Updating cloud state from ZooKeeper... 
[junit4:junit4]   2> 14200 T578 C83 P12347 oasu.DirectUpdateHandler2.commit start commit{flags=0,_version_=0,optimize=false,openSearcher=true,waitSearcher=true,expungeDeletes=false,softCommit=false}
[junit4:junit4]   2> 14658 T578 C83 P12347 oasc.SolrDeletionPolicy.onCommit SolrDeletionPolicy.onCommit: commits:num=2
[junit4:junit4]   2> 		commit{dir=NRTCachingDirecto

[...truncated too long message...]

ped o.e.j.s.ServletContextHandler{/solr,null}
[junit4:junit4]   2> 4548 T1833 oas.SolrTestCaseJ4.tearDown ###Ending testDistribSearch
[junit4:junit4]   2> NOTE: reproduce with: ant test  -Dtestcase=SolrCmdDistributorTest -Dtests.method=testDistribSearch -Dtests.seed=CFE9EB562D78B952 -Dtests.multiplier=3 -Dtests.slow=true -Dtests.locale=fr -Dtests.timezone=Pacific/Easter -Dtests.file.encoding=UTF-8
[junit4:junit4] ERROR   4.56s J1 | SolrCmdDistributorTest.testDistribSearch <<<
[junit4:junit4]    > Throwable #1: java.util.concurrent.RejectedExecutionException
[junit4:junit4]    > 	at __randomizedtesting.SeedInfo.seed([CFE9EB562D78B952:4E0F654E5A27D96E]:0)
[junit4:junit4]    > 	at java.util.concurrent.ThreadPoolExecutor$AbortPolicy.rejectedExecution(ThreadPoolExecutor.java:1956)
[junit4:junit4]    > 	at java.util.concurrent.ThreadPoolExecutor.reject(ThreadPoolExecutor.java:816)
[junit4:junit4]    > 	at java.util.concurrent.ThreadPoolExecutor.execute(ThreadPoolExecutor.java:1337)
[junit4:junit4]    > 	at java.util.concurrent.ExecutorCompletionService.submit(ExecutorCompletionService.java:181)
[junit4:junit4]    > 	at org.apache.solr.update.SolrCmdDistributor.submit(SolrCmdDistributor.java:356)
[junit4:junit4]    > 	at org.apache.solr.update.SolrCmdDistributor.submit(SolrCmdDistributor.java:301)
[junit4:junit4]    > 	at org.apache.solr.update.SolrCmdDistributor.flushAdds(SolrCmdDistributor.java:233)
[junit4:junit4]    > 	at org.apache.solr.update.SolrCmdDistributor.distribAdd(SolrCmdDistributor.java:147)
[junit4:junit4]    > 	at org.apache.solr.update.SolrCmdDistributorTest.doTest(SolrCmdDistributorTest.java:204)
[junit4:junit4]    > 	at org.apache.solr.BaseDistributedSearchTestCase.testDistribSearch(BaseDistributedSearchTestCase.java:691)
[junit4:junit4]    > 	at sun.reflect.NativeMethodAccessorImpl.invoke0(Native Method)
[junit4:junit4]    > 	at sun.reflect.NativeMethodAccessorImpl.invoke(NativeMethodAccessorImpl.java:57)
[junit4:junit4]    > 	at sun.reflect.DelegatingMethodAccessorImpl.invoke(DelegatingMethodAccessorImpl.java:43)
[junit4:junit4]    > 	at java.lang.reflect.Method.invoke(Method.java:616)
[junit4:junit4]    > 	at com.carrotsearch.randomizedtesting.RandomizedRunner.invoke(RandomizedRunner.java:1559)
[junit4:junit4]    > 	at com.carrotsearch.randomizedtesting.RandomizedRunner.access$600(RandomizedRunner.java:79)
[junit4:junit4]    > 	at com.carrotsearch.randomizedtesting.RandomizedRunner$6.evaluate(RandomizedRunner.java:737)
[junit4:junit4]    > 	at com.carrotsearch.randomizedtesting.RandomizedRunner$7.evaluate(RandomizedRunner.java:773)
[junit4:junit4]    > 	at com.carrotsearch.randomizedtesting.RandomizedRunner$8.evaluate(RandomizedRunner.java:787)
[junit4:junit4]    > 	at com.carrotsearch.randomizedtesting.rules.SystemPropertiesRestoreRule$1.evaluate(SystemPropertiesRestoreRule.java:53)
[junit4:junit4]    > 	at org.apache.lucene.util.TestRuleSetupTeardownChained$1.evaluate(TestRuleSetupTeardownChained.java:50)
[junit4:junit4]    > 	at org.apache.lucene.util.TestRuleFieldCacheSanity$1.evaluate(TestRuleFieldCacheSanity.java:51)
[junit4:junit4]    > 	at org.apache.lucene.util.AbstractBeforeAfterRule$1.evaluate(AbstractBeforeAfterRule.java:45)
[junit4:junit4]    > 	at com.carrotsearch.randomizedtesting.rules.SystemPropertiesInvariantRule$1.evaluate(SystemPropertiesInvariantRule.java:55)
[junit4:junit4]    > 	at org.apache.lucene.util.TestRuleThreadAndTestName$1.evaluate(TestRuleThreadAndTestName.java:48)
[junit4:junit4]    > 	at org.apache.lucene.util.TestRuleIgnoreAfterMaxFailures$1.evaluate(TestRuleIgnoreAfterMaxFailures.java:70)
[junit4:junit4]    > 	at org.apache.lucene.util.TestRuleMarkFailure$1.evaluate(TestRuleMarkFailure.java:48)
[junit4:junit4]    > 	at com.carrotsearch.randomizedtesting.rules.StatementAdapter.evaluate(StatementAdapter.java:36)
[junit4:junit4]    > 	at com.carrotsearch.randomizedtesting.ThreadLeakControl$StatementRunner.run(ThreadLeakControl.java:358)
[junit4:junit4]    > 	at com.carrotsearch.randomizedtesting.ThreadLeakControl.forkTimeoutingTask(ThreadLeakControl.java:782)
[junit4:junit4]    > 	at com.carrotsearch.randomizedtesting.ThreadLeakControl$3.evaluate(ThreadLeakControl.java:442)
[junit4:junit4]    > 	at com.carrotsearch.randomizedtesting.RandomizedRunner.runSingleTest(RandomizedRunner.java:746)
[junit4:junit4]    > 	at com.carrotsearch.randomizedtesting.RandomizedRunner$3.evaluate(RandomizedRunner.java:648)
[junit4:junit4]    > 	at com.carrotsearch.randomizedtesting.RandomizedRunner$4.evaluate(RandomizedRunner.java:682)
[junit4:junit4]    > 	at com.carrotsearch.randomizedtesting.RandomizedRunner$5.evaluate(RandomizedRunner.java:693)
[junit4:junit4]    > 	at com.carrotsearch.randomizedtesting.rules.StatementAdapter.evaluate(StatementAdapter.java:36)
[junit4:junit4]    > 	at com.carrotsearch.randomizedtesting.rules.SystemPropertiesRestoreRule$1.evaluate(SystemPropertiesRestoreRule.java:53)
[junit4:junit4]    > 	at org.apache.lucene.util.AbstractBeforeAfterRule$1.evaluate(AbstractBeforeAfterRule.java:45)
[junit4:junit4]    > 	at org.apache.lucene.util.TestRuleStoreClassName$1.evaluate(TestRuleStoreClassName.java:42)
[junit4:junit4]    > 	at com.carrotsearch.randomizedtesting.rules.SystemPropertiesInvariantRule$1.evaluate(SystemPropertiesInvariantRule.java:55)
[junit4:junit4]    > 	at com.carrotsearch.randomizedtesting.rules.NoShadowingOrOverridesOnMethodsRule$1.evaluate(NoShadowingOrOverridesOnMethodsRule.java:39)
[junit4:junit4]    > 	at com.carrotsearch.randomizedtesting.rules.NoShadowingOrOverridesOnMethodsRule$1.evaluate(NoShadowingOrOverridesOnMethodsRule.java:39)
[junit4:junit4]    > 	at com.carrotsearch.randomizedtesting.rules.StatementAdapter.evaluate(StatementAdapter.java:36)
[junit4:junit4]    > 	at org.apache.lucene.util.TestRuleAssertionsRequired$1.evaluate(TestRuleAssertionsRequired.java:43)
[junit4:junit4]    > 	at org.apache.lucene.util.TestRuleMarkFailure$1.evaluate(TestRuleMarkFailure.java:48)
[junit4:junit4]    > 	at org.apache.lucene.util.TestRuleIgnoreAfterMaxFailures$1.evaluate(TestRuleIgnoreAfterMaxFailures.java:70)
[junit4:junit4]    > 	at org.apache.lucene.util.TestRuleIgnoreTestSuites$1.evaluate(TestRuleIgnoreTestSuites.java:55)
[junit4:junit4]    > 	at com.carrotsearch.randomizedtesting.rules.StatementAdapter.evaluate(StatementAdapter.java:36)
[junit4:junit4]    > 	at com.carrotsearch.randomizedtesting.ThreadLeakControl$StatementRunner.run(ThreadLeakControl.java:358)
[junit4:junit4]    > 	at java.lang.Thread.run(Thread.java:679)
[junit4:junit4]   2> 4558 T1833 oas.SolrTestCaseJ4.deleteCore ###deleteCore
[junit4:junit4]   2> NOTE: test params are: codec=Lucene40: {timestamp=PostingsFormat(name=Direct), range_facet_l=PostingsFormat(name=Direct), id=PostingsFormat(name=Memory doPackFST= false), range_facet_sl=PostingsFormat(name=Asserting), range_facet_si=PostingsFormat(name=NestedPulsing), _version_=PostingsFormat(name=Direct), multiDefault=PostingsFormat(name=NestedPulsing), intDefault=PostingsFormat(name=Direct)}, sim=DefaultSimilarity, locale=fr, timezone=Pacific/Easter
[junit4:junit4]   2> NOTE: FreeBSD 9.0-RELEASE amd64/Sun Microsystems Inc. 1.6.0_32 (64-bit)/cpus=16,threads=1,free=110106512,total=282066944
[junit4:junit4]   2> NOTE: All tests run in this JVM: [TestWriterPerf, SignatureUpdateProcessorFactoryTest, LukeRequestHandlerTest, IndexSchemaRuntimeFieldTest, QueryEqualityTest, XmlUpdateRequestHandlerTest, EchoParamsTest, URLClassifyProcessorTest, TestReload, TestQueryUtils, TestUpdate, BasicZkTest, SuggesterTest, TestFunctionQuery, StatsComponentTest, PeerSyncTest, DebugComponentTest, FileUtilsTest, TestRealTimeGet, TestSolrDeletionPolicy1, RecoveryZkTest, PathHierarchyTokenizerFactoryTest, StatelessScriptUpdateProcessorFactoryTest, TestPluginEnable, SuggesterTSTTest, DirectUpdateHandlerTest, TestUtils, UpdateParamsTest, TestBM25SimilarityFactory, DirectSolrSpellCheckerTest, SolrInfoMBeanTest, TestValueSourceCache, TestBinaryField, TimeZoneUtilsTest, TestRTGBase, OutputWriterTest, BasicDistributedZk2Test, TestStressLucene, PrimUtilsTest, ReturnFieldsTest, TestRemoteStreaming, MultiTermTest, SoftAutoCommitTest, DocumentAnalysisRequestHandlerTest, TestDocSet, TestReversedWildcardFilterFactory, ClusterStateUpdateTest, TestDocumentBuilder, TestQuerySenderListener, TestMergePolicyConfig, TestFoldingMultitermQuery, PingRequestHandlerTest, TestPhraseSuggestions, UUIDFieldTest, RAMDirectoryFactoryTest, PrimitiveFieldTypeTest, TestRecovery, OverseerTest, SpellCheckComponentTest, FullSolrCloudDistribCmdsTest, TestDistributedGrouping, SpellCheckCollatorTest, TestExtendedDismaxParser, AutoCommitTest, ZkSolrClientTest, TestFaceting, TestHashPartitioner, DistributedTermsComponentTest, TestJoin, IndexSchemaTest, XsltUpdateRequestHandlerTest, TestPHPSerializedResponseWriter, SuggesterWFSTTest, TestSolrQueryParser, SearchHandlerTest, RequiredFieldsTest, CopyFieldTest, SolrCmdDistributorTest]
[junit4:junit4] Completed on J1 in 4.65s, 1 test, 1 error <<< FAILURES!

[...truncated 167 lines...]
BUILD FAILED
/usr/home/hudson/hudson-slave/workspace/Lucene-Solr-Tests-trunk-Java6/build.xml:29: The following error occurred while executing this line:
/usr/home/hudson/hudson-slave/workspace/Lucene-Solr-Tests-trunk-Java6/solr/build.xml:146: The following error occurred while executing this line:
/usr/home/hudson/hudson-slave/workspace/Lucene-Solr-Tests-trunk-Java6/lucene/module-build.xml:63: The following error occurred while executing this line:
/usr/home/hudson/hudson-slave/workspace/Lucene-Solr-Tests-trunk-Java6/lucene/common-build.xml:1133: The following error occurred while executing this line:
/usr/home/hudson/hudson-slave/workspace/Lucene-Solr-Tests-trunk-Java6/lucene/common-build.xml:810: There were test failures: 228 suites, 923 tests, 1 error, 1 failure, 6 ignored (1 assumption)

Total time: 34 minutes 50 seconds
Build step 'Invoke Ant' marked build as failure
Recording test results
Email was triggered for: Failure
Sending email for trigger: Failure



Mime
View raw message