lucene-dev mailing list archives

Site index · List index
Message view « Date » · « Thread »
Top « Date » · « Thread »
From Apache Jenkins Server <jenk...@builds.apache.org>
Subject [JENKINS] Lucene-Solr-Tests-4.x-Java6 - Build # 691 - Still Failing
Date Sat, 22 Sep 2012 11:17:35 GMT
Build: https://builds.apache.org/job/Lucene-Solr-Tests-4.x-Java6/691/

1 tests failed.
REGRESSION:  org.apache.solr.cloud.SyncSliceTest.testDistribSearch

Error Message:
There are still nodes recoverying

Stack Trace:
java.lang.AssertionError: There are still nodes recoverying
	at __randomizedtesting.SeedInfo.seed([2EE09C8ABBAC4530:AF061292CCF3250C]:0)
	at org.junit.Assert.fail(Assert.java:93)
	at org.apache.solr.cloud.AbstractDistribZkTestBase.waitForRecoveriesToFinish(AbstractDistribZkTestBase.java:154)
	at org.apache.solr.cloud.AbstractFullDistribZkTestBase.waitForRecoveriesToFinish(AbstractFullDistribZkTestBase.java:560)
	at org.apache.solr.cloud.AbstractFullDistribZkTestBase.waitForThingsToLevelOut(AbstractFullDistribZkTestBase.java:1135)
	at org.apache.solr.cloud.SyncSliceTest.doTest(SyncSliceTest.java:162)
	at org.apache.solr.BaseDistributedSearchTestCase.testDistribSearch(BaseDistributedSearchTestCase.java:695)
	at sun.reflect.NativeMethodAccessorImpl.invoke0(Native Method)
	at sun.reflect.NativeMethodAccessorImpl.invoke(NativeMethodAccessorImpl.java:57)
	at sun.reflect.DelegatingMethodAccessorImpl.invoke(DelegatingMethodAccessorImpl.java:43)
	at java.lang.reflect.Method.invoke(Method.java:616)
	at com.carrotsearch.randomizedtesting.RandomizedRunner.invoke(RandomizedRunner.java:1559)
	at com.carrotsearch.randomizedtesting.RandomizedRunner.access$600(RandomizedRunner.java:79)
	at com.carrotsearch.randomizedtesting.RandomizedRunner$6.evaluate(RandomizedRunner.java:737)
	at com.carrotsearch.randomizedtesting.RandomizedRunner$7.evaluate(RandomizedRunner.java:773)
	at com.carrotsearch.randomizedtesting.RandomizedRunner$8.evaluate(RandomizedRunner.java:787)
	at com.carrotsearch.randomizedtesting.rules.SystemPropertiesRestoreRule$1.evaluate(SystemPropertiesRestoreRule.java:53)
	at org.apache.lucene.util.TestRuleSetupTeardownChained$1.evaluate(TestRuleSetupTeardownChained.java:50)
	at org.apache.lucene.util.TestRuleFieldCacheSanity$1.evaluate(TestRuleFieldCacheSanity.java:51)
	at org.apache.lucene.util.AbstractBeforeAfterRule$1.evaluate(AbstractBeforeAfterRule.java:45)
	at com.carrotsearch.randomizedtesting.rules.SystemPropertiesInvariantRule$1.evaluate(SystemPropertiesInvariantRule.java:55)
	at org.apache.lucene.util.TestRuleThreadAndTestName$1.evaluate(TestRuleThreadAndTestName.java:48)
	at org.apache.lucene.util.TestRuleIgnoreAfterMaxFailures$1.evaluate(TestRuleIgnoreAfterMaxFailures.java:70)
	at org.apache.lucene.util.TestRuleMarkFailure$1.evaluate(TestRuleMarkFailure.java:48)
	at com.carrotsearch.randomizedtesting.rules.StatementAdapter.evaluate(StatementAdapter.java:36)
	at com.carrotsearch.randomizedtesting.ThreadLeakControl$StatementRunner.run(ThreadLeakControl.java:358)
	at com.carrotsearch.randomizedtesting.ThreadLeakControl.forkTimeoutingTask(ThreadLeakControl.java:782)
	at com.carrotsearch.randomizedtesting.ThreadLeakControl$3.evaluate(ThreadLeakControl.java:442)
	at com.carrotsearch.randomizedtesting.RandomizedRunner.runSingleTest(RandomizedRunner.java:746)
	at com.carrotsearch.randomizedtesting.RandomizedRunner$3.evaluate(RandomizedRunner.java:648)
	at com.carrotsearch.randomizedtesting.RandomizedRunner$4.evaluate(RandomizedRunner.java:682)
	at com.carrotsearch.randomizedtesting.RandomizedRunner$5.evaluate(RandomizedRunner.java:693)
	at com.carrotsearch.randomizedtesting.rules.StatementAdapter.evaluate(StatementAdapter.java:36)
	at com.carrotsearch.randomizedtesting.rules.SystemPropertiesRestoreRule$1.evaluate(SystemPropertiesRestoreRule.java:53)
	at org.apache.lucene.util.AbstractBeforeAfterRule$1.evaluate(AbstractBeforeAfterRule.java:45)
	at org.apache.lucene.util.TestRuleStoreClassName$1.evaluate(TestRuleStoreClassName.java:42)
	at com.carrotsearch.randomizedtesting.rules.SystemPropertiesInvariantRule$1.evaluate(SystemPropertiesInvariantRule.java:55)
	at com.carrotsearch.randomizedtesting.rules.NoShadowingOrOverridesOnMethodsRule$1.evaluate(NoShadowingOrOverridesOnMethodsRule.java:39)
	at com.carrotsearch.randomizedtesting.rules.NoShadowingOrOverridesOnMethodsRule$1.evaluate(NoShadowingOrOverridesOnMethodsRule.java:39)
	at com.carrotsearch.randomizedtesting.rules.StatementAdapter.evaluate(StatementAdapter.java:36)
	at org.apache.lucene.util.TestRuleAssertionsRequired$1.evaluate(TestRuleAssertionsRequired.java:43)
	at org.apache.lucene.util.TestRuleMarkFailure$1.evaluate(TestRuleMarkFailure.java:48)
	at org.apache.lucene.util.TestRuleIgnoreAfterMaxFailures$1.evaluate(TestRuleIgnoreAfterMaxFailures.java:70)
	at org.apache.lucene.util.TestRuleIgnoreTestSuites$1.evaluate(TestRuleIgnoreTestSuites.java:55)
	at com.carrotsearch.randomizedtesting.rules.StatementAdapter.evaluate(StatementAdapter.java:36)
	at com.carrotsearch.randomizedtesting.ThreadLeakControl$StatementRunner.run(ThreadLeakControl.java:358)
	at java.lang.Thread.run(Thread.java:679)




Build Log:
[...truncated 7511 lines...]
[junit4:junit4] Suite: org.apache.solr.cloud.SyncSliceTest
[junit4:junit4]   2> 24 T1828 oas.SolrTestCaseJ4.setUp ###Starting testDistribSearch
[junit4:junit4]   2> Creating dataDir: /usr/home/hudson/hudson-slave/workspace/Lucene-Solr-Tests-4.x-Java6/solr/build/solr-core/test/J1/./solrtest-SyncSliceTest-1348312507720
[junit4:junit4]   2> 25 T1828 oasc.ZkTestServer.run STARTING ZK TEST SERVER
[junit4:junit4]   2> 27 T1829 oazs.ZooKeeperServer.setTickTime tickTime set to 1000
[junit4:junit4]   2> 28 T1829 oazs.NIOServerCnxn$Factory.<init> binding to port 0.0.0.0/0.0.0.0:0
[junit4:junit4]   2> 28 T1829 oazsp.FileTxnSnapLog.save Snapshotting: 0
[junit4:junit4]   2> 126 T1828 oasc.ZkTestServer.run start zk server on port:57805
[junit4:junit4]   2> 126 T1828 oaz.ZooKeeper.<init> Initiating client connection, connectString=127.0.0.1:57805 sessionTimeout=10000 watcher=org.apache.solr.common.cloud.ConnectionManager@a3a26f2
[junit4:junit4]   2> 126 T1834 oaz.ClientCnxn$SendThread.startConnect Opening socket connection to server /127.0.0.1:57805
[junit4:junit4]   2> 126 T1828 oascc.ConnectionManager.waitForConnected Waiting for client to connect to ZooKeeper
[junit4:junit4]   2> 127 T1834 oaz.ClientCnxn$SendThread.primeConnection Socket connection established to localhost/127.0.0.1:57805, initiating session
[junit4:junit4]   2> 127 T1830 oazs.NIOServerCnxn$Factory.run Accepted socket connection from /140.211.11.196:57806
[junit4:junit4]   2> 128 T1830 oazs.NIOServerCnxn.readConnectRequest Client attempting to establish new session at /140.211.11.196:57806
[junit4:junit4]   2> 128 T1832 oazsp.FileTxnLog.append Creating new log file: log.1
[junit4:junit4]   2> 130 T1832 oazs.NIOServerCnxn.finishSessionInit Established session 0x139edb0254d0000 with negotiated timeout 10000 for client /140.211.11.196:57806
[junit4:junit4]   2> 130 T1834 oaz.ClientCnxn$SendThread.readConnectResult Session establishment complete on server localhost/127.0.0.1:57805, sessionid = 0x139edb0254d0000, negotiated timeout = 10000
[junit4:junit4]   2> 131 T1835 oascc.ConnectionManager.process Watcher org.apache.solr.common.cloud.ConnectionManager@a3a26f2 name:ZooKeeperConnection Watcher:127.0.0.1:57805 got event WatchedEvent state:SyncConnected type:None path:null path:null type:None
[junit4:junit4]   2> 131 T1828 oascc.ConnectionManager.waitForConnected Client is connected to ZooKeeper
[junit4:junit4]   2> 131 T1828 oascc.SolrZkClient.makePath makePath: /solr
[junit4:junit4]   2> 134 T1833 oazs.PrepRequestProcessor.pRequest Processed session termination for sessionid: 0x139edb0254d0000
[junit4:junit4]   2> 142 T1835 oaz.ClientCnxn$EventThread.run EventThread shut down
[junit4:junit4]   2> 143 T1830 oazs.NIOServerCnxn.closeSock Closed socket connection for client /140.211.11.196:57806 which had sessionid 0x139edb0254d0000
[junit4:junit4]   2> 142 T1828 oaz.ZooKeeper.close Session: 0x139edb0254d0000 closed
[junit4:junit4]   2> 143 T1828 oaz.ZooKeeper.<init> Initiating client connection, connectString=127.0.0.1:57805/solr sessionTimeout=10000 watcher=org.apache.solr.common.cloud.ConnectionManager@a128d91
[junit4:junit4]   2> 144 T1836 oaz.ClientCnxn$SendThread.startConnect Opening socket connection to server /127.0.0.1:57805
[junit4:junit4]   2> 144 T1828 oascc.ConnectionManager.waitForConnected Waiting for client to connect to ZooKeeper
[junit4:junit4]   2> 144 T1836 oaz.ClientCnxn$SendThread.primeConnection Socket connection established to localhost/127.0.0.1:57805, initiating session
[junit4:junit4]   2> 144 T1830 oazs.NIOServerCnxn$Factory.run Accepted socket connection from /140.211.11.196:57807
[junit4:junit4]   2> 144 T1830 oazs.NIOServerCnxn.readConnectRequest Client attempting to establish new session at /140.211.11.196:57807
[junit4:junit4]   2> 145 T1832 oazs.NIOServerCnxn.finishSessionInit Established session 0x139edb0254d0001 with negotiated timeout 10000 for client /140.211.11.196:57807
[junit4:junit4]   2> 145 T1836 oaz.ClientCnxn$SendThread.readConnectResult Session establishment complete on server localhost/127.0.0.1:57805, sessionid = 0x139edb0254d0001, negotiated timeout = 10000
[junit4:junit4]   2> 146 T1837 oascc.ConnectionManager.process Watcher org.apache.solr.common.cloud.ConnectionManager@a128d91 name:ZooKeeperConnection Watcher:127.0.0.1:57805/solr got event WatchedEvent state:SyncConnected type:None path:null path:null type:None
[junit4:junit4]   2> 146 T1828 oascc.ConnectionManager.waitForConnected Client is connected to ZooKeeper
[junit4:junit4]   2> 146 T1828 oascc.SolrZkClient.makePath makePath: /collections/collection1
[junit4:junit4]   2> 157 T1828 oascc.SolrZkClient.makePath makePath: /collections/collection1/shards
[junit4:junit4]   2> 159 T1828 oascc.SolrZkClient.makePath makePath: /collections/control_collection
[junit4:junit4]   2> 161 T1828 oascc.SolrZkClient.makePath makePath: /collections/control_collection/shards
[junit4:junit4]   2> 163 T1828 oasc.AbstractZkTestCase.putConfig put /usr/home/hudson/hudson-slave/workspace/Lucene-Solr-Tests-4.x-Java6/solr/build/solr-core/test-files/solr/collection1/conf/solrconfig.xml to /configs/conf1/solrconfig.xml
[junit4:junit4]   2> 163 T1828 oascc.SolrZkClient.makePath makePath: /configs/conf1/solrconfig.xml
[junit4:junit4]   2> 172 T1828 oasc.AbstractZkTestCase.putConfig put /usr/home/hudson/hudson-slave/workspace/Lucene-Solr-Tests-4.x-Java6/solr/build/solr-core/test-files/solr/collection1/conf/schema.xml to /configs/conf1/schema.xml
[junit4:junit4]   2> 173 T1828 oascc.SolrZkClient.makePath makePath: /configs/conf1/schema.xml
[junit4:junit4]   2> 276 T1828 oasc.AbstractZkTestCase.putConfig put /usr/home/hudson/hudson-slave/workspace/Lucene-Solr-Tests-4.x-Java6/solr/build/solr-core/test-files/solr/collection1/conf/solrconfig.xml to /configs/conf1/solrconfig.xml
[junit4:junit4]   2> 277 T1828 oascc.SolrZkClient.makePath makePath: /configs/conf1/solrconfig.xml
[junit4:junit4]   2> 279 T1828 oasc.AbstractZkTestCase.putConfig put /usr/home/hudson/hudson-slave/workspace/Lucene-Solr-Tests-4.x-Java6/solr/build/solr-core/test-files/solr/collection1/conf/stopwords.txt to /configs/conf1/stopwords.txt
[junit4:junit4]   2> 279 T1828 oascc.SolrZkClient.makePath makePath: /configs/conf1/stopwords.txt
[junit4:junit4]   2> 290 T1828 oasc.AbstractZkTestCase.putConfig put /usr/home/hudson/hudson-slave/workspace/Lucene-Solr-Tests-4.x-Java6/solr/build/solr-core/test-files/solr/collection1/conf/protwords.txt to /configs/conf1/protwords.txt
[junit4:junit4]   2> 290 T1828 oascc.SolrZkClient.makePath makePath: /configs/conf1/protwords.txt
[junit4:junit4]   2> 293 T1828 oasc.AbstractZkTestCase.putConfig put /usr/home/hudson/hudson-slave/workspace/Lucene-Solr-Tests-4.x-Java6/solr/build/solr-core/test-files/solr/collection1/conf/currency.xml to /configs/conf1/currency.xml
[junit4:junit4]   2> 293 T1828 oascc.SolrZkClient.makePath makePath: /configs/conf1/currency.xml
[junit4:junit4]   2> 299 T1828 oasc.AbstractZkTestCase.putConfig put /usr/home/hudson/hudson-slave/workspace/Lucene-Solr-Tests-4.x-Java6/solr/build/solr-core/test-files/solr/collection1/conf/open-exchange-rates.json to /configs/conf1/open-exchange-rates.json
[junit4:junit4]   2> 300 T1828 oascc.SolrZkClient.makePath makePath: /configs/conf1/open-exchange-rates.json
[junit4:junit4]   2> 302 T1828 oasc.AbstractZkTestCase.putConfig put /usr/home/hudson/hudson-slave/workspace/Lucene-Solr-Tests-4.x-Java6/solr/build/solr-core/test-files/solr/collection1/conf/mapping-ISOLatin1Accent.txt to /configs/conf1/mapping-ISOLatin1Accent.txt
[junit4:junit4]   2> 302 T1828 oascc.SolrZkClient.makePath makePath: /configs/conf1/mapping-ISOLatin1Accent.txt
[junit4:junit4]   2> 305 T1828 oasc.AbstractZkTestCase.putConfig put /usr/home/hudson/hudson-slave/workspace/Lucene-Solr-Tests-4.x-Java6/solr/build/solr-core/test-files/solr/collection1/conf/old_synonyms.txt to /configs/conf1/old_synonyms.txt
[junit4:junit4]   2> 305 T1828 oascc.SolrZkClient.makePath makePath: /configs/conf1/old_synonyms.txt
[junit4:junit4]   2> 312 T1828 oasc.AbstractZkTestCase.putConfig put /usr/home/hudson/hudson-slave/workspace/Lucene-Solr-Tests-4.x-Java6/solr/build/solr-core/test-files/solr/collection1/conf/synonyms.txt to /configs/conf1/synonyms.txt
[junit4:junit4]   2> 313 T1828 oascc.SolrZkClient.makePath makePath: /configs/conf1/synonyms.txt
[junit4:junit4]   2> 321 T1833 oazs.PrepRequestProcessor.pRequest Processed session termination for sessionid: 0x139edb0254d0001
[junit4:junit4]   2> 328 T1837 oaz.ClientCnxn$EventThread.run EventThread shut down
[junit4:junit4]   2> 328 T1830 oazs.NIOServerCnxn.closeSock Closed socket connection for client /140.211.11.196:57807 which had sessionid 0x139edb0254d0001
[junit4:junit4]   2> 328 T1828 oaz.ZooKeeper.close Session: 0x139edb0254d0001 closed
[junit4:junit4]   2> 330 T1828 oejs.Server.doStart jetty-8.1.2.v20120308
[junit4:junit4]   2> 334 T1828 oejs.AbstractConnector.doStart Started SocketConnector@0.0.0.0:57809
[junit4:junit4]   2> 335 T1828 oasc.SolrResourceLoader.locateSolrHome JNDI not configured for solr (NoInitialContextEx)
[junit4:junit4]   2> 335 T1828 oasc.SolrResourceLoader.locateSolrHome using system property solr.solr.home: /usr/home/hudson/hudson-slave/workspace/Lucene-Solr-Tests-4.x-Java6/solr/build/solr-core/test-files/solr
[junit4:junit4]   2> 336 T1828 oasc.SolrResourceLoader.<init> new SolrResourceLoader for deduced Solr Home: '/usr/home/hudson/hudson-slave/workspace/Lucene-Solr-Tests-4.x-Java6/solr/build/solr-core/test-files/solr/'
[junit4:junit4]   2> 378 T1828 oass.SolrDispatchFilter.init SolrDispatchFilter.init()
[junit4:junit4]   2> 379 T1828 oasc.SolrResourceLoader.locateSolrHome JNDI not configured for solr (NoInitialContextEx)
[junit4:junit4]   2> 379 T1828 oasc.SolrResourceLoader.locateSolrHome using system property solr.solr.home: /usr/home/hudson/hudson-slave/workspace/Lucene-Solr-Tests-4.x-Java6/solr/build/solr-core/test-files/solr
[junit4:junit4]   2> 380 T1828 oasc.CoreContainer$Initializer.initialize looking for solr.xml: /usr/home/hudson/hudson-slave/workspace/Lucene-Solr-Tests-4.x-Java6/solr/build/solr-core/test-files/solr/solr.xml
[junit4:junit4]   2> 380 T1828 oasc.CoreContainer.<init> New CoreContainer 185202815
[junit4:junit4]   2> 381 T1828 oasc.CoreContainer.load Loading CoreContainer using Solr Home: '/usr/home/hudson/hudson-slave/workspace/Lucene-Solr-Tests-4.x-Java6/solr/build/solr-core/test-files/solr/'
[junit4:junit4]   2> 382 T1828 oasc.SolrResourceLoader.<init> new SolrResourceLoader for directory: '/usr/home/hudson/hudson-slave/workspace/Lucene-Solr-Tests-4.x-Java6/solr/build/solr-core/test-files/solr/'
[junit4:junit4]   2> 418 T1828 oasc.CoreContainer.load Registering Log Listener
[junit4:junit4]   2> 441 T1828 oasc.CoreContainer.initZooKeeper Zookeeper client=127.0.0.1:57805/solr
[junit4:junit4]   2> 442 T1828 oaz.ZooKeeper.<init> Initiating client connection, connectString=127.0.0.1:57805/solr sessionTimeout=5000 watcher=org.apache.solr.common.cloud.ConnectionManager@524d6e5f
[junit4:junit4]   2> 443 T1847 oaz.ClientCnxn$SendThread.startConnect Opening socket connection to server /127.0.0.1:57805
[junit4:junit4]   2> 443 T1828 oascc.ConnectionManager.waitForConnected Waiting for client to connect to ZooKeeper
[junit4:junit4]   2> 444 T1847 oaz.ClientCnxn$SendThread.primeConnection Socket connection established to localhost/127.0.0.1:57805, initiating session
[junit4:junit4]   2> 444 T1830 oazs.NIOServerCnxn$Factory.run Accepted socket connection from /140.211.11.196:57810
[junit4:junit4]   2> 444 T1830 oazs.NIOServerCnxn.readConnectRequest Client attempting to establish new session at /140.211.11.196:57810
[junit4:junit4]   2> 446 T1832 oazs.NIOServerCnxn.finishSessionInit Established session 0x139edb0254d0002 with negotiated timeout 5000 for client /140.211.11.196:57810
[junit4:junit4]   2> 446 T1847 oaz.ClientCnxn$SendThread.readConnectResult Session establishment complete on server localhost/127.0.0.1:57805, sessionid = 0x139edb0254d0002, negotiated timeout = 5000
[junit4:junit4]   2> 446 T1848 oascc.ConnectionManager.process Watcher org.apache.solr.common.cloud.ConnectionManager@524d6e5f name:ZooKeeperConnection Watcher:127.0.0.1:57805/solr got event WatchedEvent state:SyncConnected type:None path:null path:null type:None
[junit4:junit4]   2> 447 T1828 oascc.ConnectionManager.waitForConnected Client is connected to ZooKeeper
[junit4:junit4]   2> 456 T1833 oazs.PrepRequestProcessor.pRequest Got user-level KeeperException when processing sessionid:0x139edb0254d0002 type:create cxid:0x2 zxid:0xfffffffffffffffe txntype:unknown reqpath:n/a Error Path:/solr/overseer Error:KeeperErrorCode = NodeExists for /solr/overseer
[junit4:junit4]   2> 458 T1828 oascc.SolrZkClient.makePath makePath: /live_nodes
[junit4:junit4]   2> 465 T1828 oasc.ZkController.createEphemeralLiveNode Register node as live in ZooKeeper:/live_nodes/127.0.0.1:57809_solr
[junit4:junit4]   2> 466 T1833 oazs.PrepRequestProcessor.pRequest Got user-level KeeperException when processing sessionid:0x139edb0254d0002 type:delete cxid:0x7 zxid:0xfffffffffffffffe txntype:unknown reqpath:n/a Error Path:/solr/live_nodes/127.0.0.1:57809_solr Error:KeeperErrorCode = NoNode for /solr/live_nodes/127.0.0.1:57809_solr
[junit4:junit4]   2> 466 T1828 oascc.SolrZkClient.makePath makePath: /live_nodes/127.0.0.1:57809_solr
[junit4:junit4]   2> 470 T1828 oashc.HttpShardHandlerFactory.getParameter Setting socketTimeout to: 0
[junit4:junit4]   2> 470 T1828 oashc.HttpShardHandlerFactory.getParameter Setting urlScheme to: http://
[junit4:junit4]   2> 471 T1828 oashc.HttpShardHandlerFactory.getParameter Setting connTimeout to: 0
[junit4:junit4]   2> 472 T1828 oashc.HttpShardHandlerFactory.getParameter Setting maxConnectionsPerHost to: 20
[junit4:junit4]   2> 472 T1828 oashc.HttpShardHandlerFactory.getParameter Setting corePoolSize to: 0
[junit4:junit4]   2> 473 T1828 oashc.HttpShardHandlerFactory.getParameter Setting maximumPoolSize to: 2147483647
[junit4:junit4]   2> 474 T1828 oashc.HttpShardHandlerFactory.getParameter Setting maxThreadIdleTime to: 5
[junit4:junit4]   2> 474 T1828 oashc.HttpShardHandlerFactory.getParameter Setting sizeOfQueue to: -1
[junit4:junit4]   2> 475 T1828 oashc.HttpShardHandlerFactory.getParameter Setting fairnessPolicy to: false
[junit4:junit4]   2> 476 T1828 oascsi.HttpClientUtil.createClient Creating new http client, config:maxConnectionsPerHost=20&maxConnections=10000&socketTimeout=0&connTimeout=0&retry=false
[junit4:junit4]   2> 498 T1828 oascc.SolrZkClient.makePath makePath: /overseer_elect/election
[junit4:junit4]   2> 512 T1833 oazs.PrepRequestProcessor.pRequest Got user-level KeeperException when processing sessionid:0x139edb0254d0002 type:delete cxid:0x15 zxid:0xfffffffffffffffe txntype:unknown reqpath:n/a Error Path:/solr/overseer_elect/leader Error:KeeperErrorCode = NoNode for /solr/overseer_elect/leader
[junit4:junit4]   2> 513 T1828 oascc.SolrZkClient.makePath makePath: /overseer_elect/leader
[junit4:junit4]   2> 515 T1828 oasc.Overseer.start Overseer (id=88363008506265602-127.0.0.1:57809_solr-n_0000000000) starting
[junit4:junit4]   2> 516 T1833 oazs.PrepRequestProcessor.pRequest Got user-level KeeperException when processing sessionid:0x139edb0254d0002 type:create cxid:0x1a zxid:0xfffffffffffffffe txntype:unknown reqpath:n/a Error Path:/solr/overseer Error:KeeperErrorCode = NodeExists for /solr/overseer
[junit4:junit4]   2> 517 T1833 oazs.PrepRequestProcessor.pRequest Got user-level KeeperException when processing sessionid:0x139edb0254d0002 type:create cxid:0x1b zxid:0xfffffffffffffffe txntype:unknown reqpath:n/a Error Path:/solr/overseer Error:KeeperErrorCode = NodeExists for /solr/overseer
[junit4:junit4]   2> 525 T1833 oazs.PrepRequestProcessor.pRequest Got user-level KeeperException when processing sessionid:0x139edb0254d0002 type:create cxid:0x1c zxid:0xfffffffffffffffe txntype:unknown reqpath:n/a Error Path:/solr/overseer Error:KeeperErrorCode = NodeExists for /solr/overseer
[junit4:junit4]   2> 527 T1833 oazs.PrepRequestProcessor.pRequest Got user-level KeeperException when processing sessionid:0x139edb0254d0002 type:create cxid:0x1d zxid:0xfffffffffffffffe txntype:unknown reqpath:n/a Error Path:/solr/overseer Error:KeeperErrorCode = NodeExists for /solr/overseer
[junit4:junit4]   2> 534 T1850 oasc.OverseerCollectionProcessor.run Process current queue of collection creations
[junit4:junit4]   2> 534 T1828 oascc.SolrZkClient.makePath makePath: /clusterstate.json
[junit4:junit4]   2> 537 T1828 oascc.ZkStateReader.createClusterStateWatchersAndUpdate Updating cluster state from ZooKeeper... 
[junit4:junit4]   2> 539 T1849 oasc.Overseer$ClusterStateUpdater.run Starting to work on the main queue
[junit4:junit4]   2> 546 T1828 oasc.CoreContainer.create Creating SolrCore 'collection1' using instanceDir: /usr/home/hudson/hudson-slave/workspace/Lucene-Solr-Tests-4.x-Java6/solr/build/solr-core/test-files/solr/collection1
[junit4:junit4]   2> 547 T1828 oasc.ZkController.createCollectionZkNode Check for collection zkNode:control_collection
[junit4:junit4]   2> 548 T1828 oasc.ZkController.createCollectionZkNode Collection zkNode exists
[junit4:junit4]   2> 548 T1828 oasc.ZkController.readConfigName Load collection config from:/collections/control_collection
[junit4:junit4]   2> 550 T1828 oasc.SolrResourceLoader.<init> new SolrResourceLoader for directory: '/usr/home/hudson/hudson-slave/workspace/Lucene-Solr-Tests-4.x-Java6/solr/build/solr-core/test-files/solr/collection1/'
[junit4:junit4]   2> 552 T1828 oasc.SolrResourceLoader.replaceClassLoader Adding 'file:/usr/home/hudson/hudson-slave/workspace/Lucene-Solr-Tests-4.x-Java6/solr/build/solr-core/test-files/solr/collection1/lib/README' to classloader
[junit4:junit4]   2> 553 T1828 oasc.SolrResourceLoader.replaceClassLoader Adding 'file:/usr/home/hudson/hudson-slave/workspace/Lucene-Solr-Tests-4.x-Java6/solr/build/solr-core/test-files/solr/collection1/lib/classes/' to classloader
[junit4:junit4]   2> 625 T1828 oasc.SolrConfig.<init> Using Lucene MatchVersion: LUCENE_40
[junit4:junit4]   2> 697 T1828 oasc.SolrConfig.<init> Loaded SolrConfig: solrconfig.xml
[junit4:junit4]   2> 798 T1828 oass.IndexSchema.readSchema Reading Solr Schema
[junit4:junit4]   2> 803 T1828 oass.IndexSchema.readSchema Schema name=test
[junit4:junit4]   2> 1391 T1828 oass.OpenExchangeRatesOrgProvider.init Initialized with rates=open-exchange-rates.json, refreshInterval=1440.
[junit4:junit4]   2> 1399 T1828 oass.IndexSchema.readSchema default search field in schema is text
[junit4:junit4]   2> 1402 T1828 oass.IndexSchema.readSchema unique key field: id
[junit4:junit4]   2> 1413 T1828 oass.FileExchangeRateProvider.reload Reloading exchange rates from file currency.xml
[junit4:junit4]   2> 1417 T1828 oass.FileExchangeRateProvider.reload Reloading exchange rates from file currency.xml
[junit4:junit4]   2> 1420 T1828 oass.OpenExchangeRatesOrgProvider.reload Reloading exchange rates from open-exchange-rates.json
[junit4:junit4]   2> 1421 T1828 oass.OpenExchangeRatesOrgProvider.reload Reloading exchange rates from open-exchange-rates.json
[junit4:junit4]   2> 1422 T1828 oasc.SolrCore.<init> [collection1] Opening new SolrCore at /usr/home/hudson/hudson-slave/workspace/Lucene-Solr-Tests-4.x-Java6/solr/build/solr-core/test-files/solr/collection1/, dataDir=./org.apache.solr.cloud.SyncSliceTest-1348312507720/control/data/
[junit4:junit4]   2> 1422 T1828 oasc.JmxMonitoredMap.<init> JMX monitoring is enabled. Adding Solr mbeans to JMX Server: com.sun.jmx.mbeanserver.JmxMBeanServer@3c3228a1
[junit4:junit4]   2> 1423 T1828 oasc.SolrCore.getNewIndexDir WARNING New index directory detected: old=null new=./org.apache.solr.cloud.SyncSliceTest-1348312507720/control/data/index/
[junit4:junit4]   2> 1424 T1828 oasc.SolrCore.initIndex WARNING [collection1] Solr index directory './org.apache.solr.cloud.SyncSliceTest-1348312507720/control/data/index' doesn't exist. Creating new index...
[junit4:junit4]   2> 1425 T1828 oasc.CachingDirectoryFactory.get return new directory for /usr/home/hudson/hudson-slave/workspace/Lucene-Solr-Tests-4.x-Java6/solr/build/solr-core/test/J1/./org.apache.solr.cloud.SyncSliceTest-1348312507720/control/data/index forceNew:false
[junit4:junit4]   2> 1440 T1828 oasc.SolrDeletionPolicy.onCommit SolrDeletionPolicy.onCommit: commits:num=1
[junit4:junit4]   2> 		commit{dir=NRTCachingDirectory(org.apache.lucene.store.NIOFSDirectory@/usr/home/hudson/hudson-slave/workspace/Lucene-Solr-Tests-4.x-Java6/solr/build/solr-core/test/J1/org.apache.solr.cloud.SyncSliceTest-1348312507720/control/data/index lockFactory=org.apache.lucene.store.NativeFSLockFactory@468fd26e; maxCacheMB=48.0 maxMergeSizeMB=4.0),segFN=segments_1,generation=1,filenames=[segments_1]
[junit4:junit4]   2> 1441 T1828 oasc.SolrDeletionPolicy.updateCommits newest commit = 1
[junit4:junit4]   2> 1441 T1828 oasc.SolrCore.initWriters created xml: solr.XMLResponseWriter
[junit4:junit4]   2> 1443 T1828 oasup.UpdateRequestProcessorChain.init inserting DistributedUpdateProcessorFactory into updateRequestProcessorChain "dedupe"
[junit4:junit4]   2> 1443 T1828 oasup.UpdateRequestProcessorChain.init inserting DistributedUpdateProcessorFactory into updateRequestProcessorChain "dedupe-allfields"
[junit4:junit4]   2> 1444 T1828 oasup.UpdateRequestProcessorChain.init inserting DistributedUpdateProcessorFactory into updateRequestProcessorChain "stored_sig"
[junit4:junit4]   2> 1444 T1828 oasup.UpdateRequestProcessorChain.init inserting DistributedUpdateProcessorFactory into updateRequestProcessorChain "uniq-fields"
[junit4:junit4]   2> 1444 T1828 oasup.UpdateRequestProcessorChain.init inserting DistributedUpdateProcessorFactory into updateRequestProcessorChain "distrib-dup-test-chain-implicit"
[junit4:junit4]   2> 1445 T1828 oasc.RequestHandlers.initHandlersFromConfig adding lazy requestHandler: solr.ReplicationHandler
[junit4:junit4]   2> 1445 T1828 oasc.RequestHandlers.initHandlersFromConfig created /replication: solr.ReplicationHandler
[junit4:junit4]   2> 1446 T1828 oasc.RequestHandlers.initHandlersFromConfig created standard: solr.StandardRequestHandler
[junit4:junit4]   2> 1446 T1828 oasc.RequestHandlers.initHandlersFromConfig created /get: solr.RealTimeGetHandler
[junit4:junit4]   2> 1446 T1828 oasc.RequestHandlers.initHandlersFromConfig created dismax: solr.SearchHandler
[junit4:junit4]   2> 1447 T1828 oasc.RequestHandlers.initHandlersFromConfig created mock: org.apache.solr.core.MockQuerySenderListenerReqHandler
[junit4:junit4]   2> 1447 T1828 oasc.RequestHandlers.initHandlersFromConfig created /admin/: org.apache.solr.handler.admin.AdminHandlers
[junit4:junit4]   2> 1448 T1828 oasc.RequestHandlers.initHandlersFromConfig created defaults: solr.StandardRequestHandler
[junit4:junit4]   2> 1448 T1828 oasc.RequestHandlers.initHandlersFromConfig adding lazy requestHandler: solr.StandardRequestHandler
[junit4:junit4]   2> 1448 T1828 oasc.RequestHandlers.initHandlersFromConfig created lazy: solr.StandardRequestHandler
[junit4:junit4]   2> 1449 T1828 oasc.RequestHandlers.initHandlersFromConfig created /update: solr.UpdateRequestHandler
[junit4:junit4]   2> 1449 T1828 oasc.RequestHandlers.initHandlersFromConfig created /terms: org.apache.solr.handler.component.SearchHandler
[junit4:junit4]   2> 1449 T1828 oasc.RequestHandlers.initHandlersFromConfig created spellCheckCompRH: org.apache.solr.handler.component.SearchHandler
[junit4:junit4]   2> 1450 T1828 oasc.RequestHandlers.initHandlersFromConfig created spellCheckCompRH_Direct: org.apache.solr.handler.component.SearchHandler
[junit4:junit4]   2> 1450 T1828 oasc.RequestHandlers.initHandlersFromConfig created spellCheckWithWordbreak: org.apache.solr.handler.component.SearchHandler
[junit4:junit4]   2> 1451 T1828 oasc.RequestHandlers.initHandlersFromConfig created spellCheckWithWordbreak_Direct: org.apache.solr.handler.component.SearchHandler
[junit4:junit4]   2> 1451 T1828 oasc.RequestHandlers.initHandlersFromConfig created spellCheckCompRH1: org.apache.solr.handler.component.SearchHandler
[junit4:junit4]   2> 1451 T1828 oasc.RequestHandlers.initHandlersFromConfig created tvrh: org.apache.solr.handler.component.SearchHandler
[junit4:junit4]   2> 1452 T1828 oasc.RequestHandlers.initHandlersFromConfig created /mlt: solr.MoreLikeThisHandler
[junit4:junit4]   2> 1452 T1828 oasc.RequestHandlers.initHandlersFromConfig created /debug/dump: solr.DumpRequestHandler
[junit4:junit4]   2> 1455 T1828 oashl.XMLLoader.init xsltCacheLifetimeSeconds=60
[junit4:junit4]   2> 1459 T1828 oasc.SolrCore.initDeprecatedSupport WARNING solrconfig.xml uses deprecated <admin/gettableFiles>, Please update your config to use the ShowFileRequestHandler.
[junit4:junit4]   2> 1460 T1828 oasc.SolrCore.initDeprecatedSupport WARNING adding ShowFileRequestHandler with hidden files: [SCHEMA.XML, OLD_SYNONYMS.TXT, STOPWORDS.TXT, PROTWORDS.TXT, OPEN-EXCHANGE-RATES.JSON, SYNONYMS.TXT, CURRENCY.XML, MAPPING-ISOLATIN1ACCENT.TXT]
[junit4:junit4]   2> 1463 T1828 oass.SolrIndexSearcher.<init> Opening Searcher@16081363 main
[junit4:junit4]   2> 1464 T1828 oasu.CommitTracker.<init> Hard AutoCommit: disabled
[junit4:junit4]   2> 1464 T1828 oasu.CommitTracker.<init> Soft AutoCommit: disabled
[junit4:junit4]   2> 1464 T1828 oashc.SpellCheckComponent.inform Initializing spell checkers
[junit4:junit4]   2> 1470 T1828 oass.DirectSolrSpellChecker.init init: {name=direct,classname=DirectSolrSpellChecker,field=lowerfilt,minQueryLength=3}
[junit4:junit4]   2> 1515 T1851 oasc.SolrCore.registerSearcher [collection1] Registered new searcher Searcher@16081363 main{StandardDirectoryReader(segments_1:1)}
[junit4:junit4]   2> 1518 T1833 oazs.PrepRequestProcessor.pRequest Got user-level KeeperException when processing sessionid:0x139edb0254d0002 type:create cxid:0x53 zxid:0xfffffffffffffffe txntype:unknown reqpath:n/a Error Path:/solr/overseer/queue Error:KeeperErrorCode = NoNode for /solr/overseer/queue
[junit4:junit4]   2> 1529 T1828 oasc.CoreContainer.register registering core: collection1
[junit4:junit4]   2> 1529 T1828 oasc.ZkController.register Register shard - core:collection1 address:http://127.0.0.1:57809/solr shardId:control_shard
[junit4:junit4]   2> 1530 T1828 oascc.SolrZkClient.makePath makePath: /collections/control_collection/leader_elect/control_shard/election
[junit4:junit4]   2> 1546 T1833 oazs.PrepRequestProcessor.pRequest Got user-level KeeperException when processing sessionid:0x139edb0254d0002 type:delete cxid:0x64 zxid:0xfffffffffffffffe txntype:unknown reqpath:n/a Error Path:/solr/collections/control_collection/leaders Error:KeeperErrorCode = NoNode for /solr/collections/control_collection/leaders
[junit4:junit4]   2> 1547 T1828 oasc.ShardLeaderElectionContext.runLeaderProcess Running the leader process.
[junit4:junit4]   2> 1547 T1849 oascc.ZkStateReader.updateClusterState Updating cloud state from ZooKeeper... 
[junit4:junit4]   2> 1548 T1833 oazs.PrepRequestProcessor.pRequest Got user-level KeeperException when processing sessionid:0x139edb0254d0002 type:create cxid:0x67 zxid:0xfffffffffffffffe txntype:unknown reqpath:n/a Error Path:/solr/overseer Error:KeeperErrorCode = NodeExists for /solr/overseer
[junit4:junit4]   2> 1548 T1833 oazs.PrepRequestProcessor.pRequest Got user-level KeeperException when processing sessionid:0x139edb0254d0002 type:create cxid:0x6a zxid:0xfffffffffffffffe txntype:unknown reqpath:n/a Error Path:/solr/overseer/queue-work Error:KeeperErrorCode = NoNode for /solr/overseer/queue-work
[junit4:junit4]   2> 1572 T1848 oascc.ZkStateReader$2.process A cluster state change has occurred - updating...
[junit4:junit4]   2> 2059 T1828 oasc.ShardLeaderElectionContext.waitForReplicasToComeUp Enough replicas found to continue.
[junit4:junit4]   2> 2060 T1828 oasc.ShardLeaderElectionContext.runLeaderProcess I may be the new leader - try and sync
[junit4:junit4]   2> 2060 T1828 oasc.SyncStrategy.sync Sync replicas to http://127.0.0.1:57809/solr/collection1/
[junit4:junit4]   2> 2061 T1828 oasc.SyncStrategy.syncReplicas Sync Success - now sync replicas to me
[junit4:junit4]   2> 2061 T1828 oasc.SyncStrategy.syncToMe http://127.0.0.1:57809/solr/collection1/ has no replicas
[junit4:junit4]   2> 2062 T1828 oasc.ShardLeaderElectionContext.runLeaderProcess I am the new leader: http://127.0.0.1:57809/solr/collection1/
[junit4:junit4]   2> 2062 T1828 oascc.SolrZkClient.makePath makePath: /collections/control_collection/leaders/control_shard
[junit4:junit4]   2> 2066 T1833 oazs.PrepRequestProcessor.pRequest Got user-level KeeperException when processing sessionid:0x139edb0254d0002 type:create cxid:0x88 zxid:0xfffffffffffffffe txntype:unknown reqpath:n/a Error Path:/solr/overseer Error:KeeperErrorCode = NodeExists for /solr/overseer
[junit4:junit4]   2> 2079 T1849 oascc.ZkStateReader.updateClusterState Updating cloud state from ZooKeeper... 
[junit4:junit4]   2> 2082 T1848 oascc.ZkStateReader$2.process A cluster state change has occurred - updating...
[junit4:junit4]   2> 2129 T1828 oasc.ZkController.register We are http://127.0.0.1:57809/solr/collection1/ and leader is http://127.0.0.1:57809/solr/collection1/
[junit4:junit4]   2> 2129 T1828 oasc.ZkController.register No LogReplay needed for core=collection1 baseURL=http://127.0.0.1:57809/solr
[junit4:junit4]   2> 2130 T1828 oasc.ZkController.checkRecovery I am the leader, no recovery necessary
[junit4:junit4]   2> 2146 T1828 oascc.ZkStateReader.updateClusterState Updating cloud state from ZooKeeper... 
[junit4:junit4]   2> 2146 T1828 oass.SolrDispatchFilter.init user.dir=/usr/home/hudson/hudson-slave/workspace/Lucene-Solr-Tests-4.x-Java6/solr/build/solr-core/test/J1
[junit4:junit4]   2> 2147 T1828 oass.SolrDispatchFilter.init SolrDispatchFilter.init() done
[junit4:junit4]   2> 2147 T1828 oascsi.HttpClientUtil.createClient Creating new http client, config:maxConnections=128&maxConnectionsPerHost=32&followRedirects=false
[junit4:junit4]   2> 2586 T1849 oascc.ZkStateReader.updateClusterState Updating cloud state from ZooKeeper... 
[junit4:junit4]   2> 2599 T1828 oejs.Server.doStart jetty-8.1.2.v20120308
[junit4:junit4]   2> 2602 T1828 oejs.AbstractConnector.doStart Started SocketConnector@0.0.0.0:57811
[junit4:junit4]   2> 2603 T1828 oasc.SolrResourceLoader.locateSolrHome JNDI not configured for solr (NoInitialContextEx)
[junit4:junit4]   2> 2603 T1828 oasc.SolrResourceLoader.locateSolrHome using system property solr.solr.home: /usr/home/hudson/hudson-slave/workspace/Lucene-Solr-Tests-4.x-Java6/solr/build/solr-core/test/J1/./solrtest-jetty1-1348312509858
[junit4:junit4]   2> 2604 T1828 oasc.SolrResourceLoader.<init> new SolrResourceLoader for deduced Solr Home: '/usr/home/hudson/hudson-slave/workspace/Lucene-Solr-Tests-4.x-Java6/solr/build/solr-core/test/J1/./solrtest-jetty1-1348312509858/'
[junit4:junit4]   2> 2612 T1848 oascc.ZkStateReader$2.process A cluster state change has occurred - updating...
[junit4:junit4]   2> 2643 T1828 oass.SolrDispatchFilter.init SolrDispatchFilter.init()
[junit4:junit4]   2> 2644 T1828 oasc.SolrResourceLoader.locateSolrHome JNDI not configured for solr (NoInitialContextEx)
[junit4:junit4]   2> 2644 T1828 oasc.SolrResourceLoader.locateSolrHome using system property solr.solr.home: /usr/home/hudson/hudson-slave/workspace/Lucene-Solr-Tests-4.x-Java6/solr/build/solr-core/test/J1/./solrtest-jetty1-1348312509858
[junit4:junit4]   2> 2645 T1828 oasc.CoreContainer$Initializer.initialize looking for solr.xml: /usr/home/hudson/hudson-slave/workspace/Lucene-Solr-Tests-4.x-Java6/solr/build/solr-core/test/J1/./solrtest-jetty1-1348312509858/solr.xml
[junit4:junit4]   2> 2645 T1828 oasc.CoreContainer.<init> New CoreContainer 1980029812
[junit4:junit4]   2> 2646 T1828 oasc.CoreContainer.load Loading CoreContainer using Solr Home: '/usr/home/hudson/hudson-slave/workspace/Lucene-Solr-Tests-4.x-Java6/solr/build/solr-core/test/J1/./solrtest-jetty1-1348312509858/'
[junit4:junit4]   2> 2646 T1828 oasc.SolrResourceLoader.<init> new SolrResourceLoader for directory: '/usr/home/hudson/hudson-slave/workspace/Lucene-Solr-Tests-4.x-Java6/solr/build/solr-core/test/J1/./solrtest-jetty1-1348312509858/'
[junit4:junit4]   2> 2672 T1828 oasc.CoreContainer.load Registering Log Listener
[junit4:junit4]   2> 2689 T1828 oasc.CoreContainer.initZooKeeper Zookeeper client=127.0.0.1:57805/solr
[junit4:junit4]   2> 2689 T1828 oaz.ZooKeeper.<init> Initiating client connection, connectString=127.0.0.1:57805/solr sessionTimeout=5000 watcher=org.apache.solr.common.cloud.ConnectionManager@76c90219
[junit4:junit4]   2> 2690 T1861 oaz.ClientCnxn$SendThread.startConnect Opening socket connection to server /127.0.0.1:57805
[junit4:junit4]   2> 2690 T1828 oascc.ConnectionManager.waitForConnected Waiting for client to connect to ZooKeeper
[junit4:junit4]   2> 2691 T1861 oaz.ClientCnxn$SendThread.primeConnection Socket connection established to localhost/127.0.0.1:57805, initiating session
[junit4:junit4]   2> 2692 T1830 oazs.NIOServerCnxn$Factory.run Accepted socket connection from /140.211.11.196:57812
[junit4:junit4]   2> 2692 T1830 oazs.NIOServerCnxn.readConnectRequest Client attempting to establish new session at /140.211.11.196:57812
[junit4:junit4]   2> 2697 T1832 oazs.NIOServerCnxn.finishSessionInit Established session 0x139edb0254d0003 with negotiated timeout 5000 for client /140.211.11.196:57812
[junit4:junit4]   2> 2697 T1861 oaz.ClientCnxn$SendThread.readConnectResult Session establishment complete on server localhost/127.0.0.1:57805, sessionid = 0x139edb0254d0003, negotiated timeout = 5000
[junit4:junit4]   2> 2697 T1862 oascc.ConnectionManager.process Watcher org.apache.solr.common.cloud.ConnectionManager@76c90219 name:ZooKeeperConnection Watcher:127.0.0.1:57805/solr got event WatchedEvent state:SyncConnected type:None path:null path:null type:None
[junit4:junit4]   2> 2697 T1828 oascc.ConnectionManager.waitForConnected Client is connected to ZooKeeper
[junit4:junit4]   2> 2698 T1833 oazs.PrepRequestProcessor.pRequest Got user-level KeeperException when processing sessionid:0x139edb0254d0003 type:create cxid:0x1 zxid:0xfffffffffffffffe txntype:unknown reqpath:n/a Error Path:/solr/overseer Error:KeeperErrorCode = NodeExists for /solr/overseer
[junit4:junit4]   2> 2700 T1833 oazs.PrepRequestProcessor.pRequest Got user-level KeeperException when processing sessionid:0x139edb0254d0003 type:create cxid:0x2 zxid:0xfffffffffffffffe txntype:unknown reqpath:n/a Error Path:/solr/overseer Error:KeeperErrorCode = NodeExists for /solr/overseer
[junit4:junit4]   2> 2708 T1828 oasc.ZkController.createEphemeralLiveNode Register node as live in ZooKeeper:/live_nodes/127.0.0.1:57811_solr
[junit4:junit4]   2> 2708 T1833 oazs.PrepRequestProcessor.pRequest Got user-level KeeperException when processing sessionid:0x139edb0254d0003 type:delete cxid:0x4 zxid:0xfffffffffffffffe txntype:unknown reqpath:n/a Error Path:/solr/live_nodes/127.0.0.1:57811_solr Error:KeeperErrorCode = NoNode for /solr/live_nodes/127.0.0.1:57811_solr
[junit4:junit4]   2> 2710 T1828 oascc.SolrZkClient.makePath makePath: /live_nodes/127.0.0.1:57811_solr
[junit4:junit4]   2> 2712 T1848 oascc.ZkStateReader$3.process Updating live nodes
[junit4:junit4]   2> 2713 T1828 oashc.HttpShardHandlerFactory.getParameter Setting socketTimeout to: 0
[junit4:junit4]   2> 2713 T1828 oashc.HttpShardHandlerFactory.getParameter Setting urlScheme to: http://
[junit4:junit4]   2> 2714 T1828 oashc.HttpShardHandlerFactory.getParameter Setting connTimeout to: 0
[junit4:junit4]   2> 2714 T1828 oashc.HttpShardHandlerFactory.getParameter Setting maxConnectionsPerHost to: 20
[junit4:junit4]   2> 2715 T1828 oashc.HttpShardHandlerFactory.getParameter Setting corePoolSize to: 0
[junit4:junit4]   2> 2715 T1828 oashc.HttpShardHandlerFactory.getParameter Setting maximumPoolSize to: 2147483647
[junit4:junit4]   2> 2716 T1828 oashc.HttpShardHandlerFactory.getParameter Setting maxThreadIdleTime to: 5
[junit4:junit4]   2> 2716 T1828 oashc.HttpShardHandlerFactory.getParameter Setting sizeOfQueue to: -1
[junit4:junit4]   2> 2716 T1828 oashc.HttpShardHandlerFactory.getParameter Setting fairnessPolicy to: false
[junit4:junit4]   2> 2717 T1828 oascsi.HttpClientUtil.createClient Creating new http client, config:maxConnectionsPerHost=20&maxConnections=10000&socketTimeout=0&connTimeout=0&retry=false
[junit4:junit4]   2> 2734 T1828 oascc.ZkStateReader.createClusterStateWatchersAndUpdate Updating cluster state from ZooKeeper... 
[junit4:junit4]   2> 2740 T1828 oasc.CoreContainer.create Creating SolrCore 'collection1' using instanceDir: /usr/home/hudson/hudson-slave/workspace/Lucene-Solr-Tests-4.x-Java6/solr/build/solr-core/test/J1/./solrtest-jetty1-1348312509858/collection1
[junit4:junit4]   2> 2741 T1828 oasc.ZkController.createCollectionZkNode Check for collection zkNode:collection1
[junit4:junit4]   2> 2742 T1828 oasc.ZkController.createCollectionZkNode Collection zkNode exists
[junit4:junit4]   2> 2742 T1828 oasc.ZkController.readConfigName Load collection config from:/collections/collection1
[junit4:junit4]   2> 2743 T1828 oasc.SolrResourceLoader.<init> new SolrResourceLoader for directory: '/usr/home/hudson/hudson-slave/workspace/Lucene-Solr-Tests-4.x-Java6/solr/build/solr-core/test/J1/./solrtest-jetty1-1348312509858/collection1/'
[junit4:junit4]   2> 2745 T1828 oasc.SolrResourceLoader.replaceClassLoader Adding 'file:/usr/home/hudson/hudson-slave/workspace/Lucene-Solr-Tests-4.x-Java6/solr/build/solr-core/test/J1/solrtest-jetty1-1348312509858/collection1/lib/classes/' to classloader
[junit4:junit4]   2> 2746 T1828 oasc.SolrResourceLoader.replaceClassLoader Adding 'file:/usr/home/hudson/hudson-slave/workspace/Lucene-Solr-Tests-4.x-Java6/solr/build/solr-core/test/J1/solrtest-jetty1-1348312509858/collection1/lib/README' to classloader
[junit4:junit4]   2> 2799 T1828 oasc.SolrConfig.<init> Using Lucene MatchVersion: LUCENE_40
[junit4:junit4]   2> 2876 T1828 oasc.SolrConfig.<init> Loaded SolrConfig: solrconfig.xml
[junit4:junit4]   2> 2977 T1828 oass.IndexSchema.readSchema Reading Solr Schema
[junit4:junit4]   2> 2983 T1828 oass.IndexSchema.readSchema Schema name=test
[junit4:junit4]   2> 3606 T1828 oass.OpenExchangeRatesOrgProvider.init Initialized with rates=open-exchange-rates.json, refreshInterval=1440.
[junit4:junit4]   2> 3618 T1828 oass.IndexSchema.readSchema default search field in schema is text
[junit4:junit4]   2> 3622 T1828 oass.IndexSchema.readSchema unique key field: id
[junit4:junit4]   2> 3633 T1828 oass.FileExchangeRateProvider.reload Reloading exchange rates from file currency.xml
[junit4:junit4]   2> 3638 T1828 oass.FileExchangeRateProvider.reload Reloading exchange rates from file currency.xml
[junit4:junit4]   2> 3642 T1828 oass.OpenExchangeRatesOrgProvider.reload Reloading exchange rates from open-exchange-rates.json
[junit4:junit4]   2> 3643 T1828 oass.OpenExchangeRatesOrgProvider.reload Reloading exchange rates from open-exchange-rates.json
[junit4:junit4]   2> 3644 T1828 oasc.SolrCore.<init> [collection1] Opening new SolrCore at /usr/home/hudson/hudson-slave/workspace/Lucene-Solr-Tests-4.x-Java6/solr/build/solr-core/test/J1/./solrtest-jetty1-1348312509858/collection1/, dataDir=./org.apache.solr.cloud.SyncSliceTest-1348312507720/jetty1/
[junit4:junit4]   2> 3645 T1828 oasc.JmxMonitoredMap.<init> JMX monitoring is enabled. Adding Solr mbeans to JMX Server: com.sun.jmx.mbeanserver.JmxMBeanServer@3c3228a1
[junit4:junit4]   2> 3646 T1828 oasc.SolrCore.getNewIndexDir WARNING New index directory detected: old=null new=./org.apache.solr.cloud.SyncSliceTest-1348312507720/jetty1/index/
[junit4:junit4]   2> 3647 T1828 oasc.SolrCore.initIndex WARNING [collection1] Solr index directory './org.apache.solr.cloud.SyncSliceTest-1348312507720/jetty1/index' doesn't exist. Creating new index...
[junit4:junit4]   2> 3648 T1828 oasc.CachingDirectoryFactory.get return new directory for /usr/home/hudson/hudson-slave/workspace/Lucene-Solr-Tests-4.x-Java6/solr/build/solr-core/test/J1/./org.apache.solr.cloud.SyncSliceTest-1348312507720/jetty1/index forceNew:false
[junit4:junit4]   2> 3681 T1828 oasc.SolrDeletionPolicy.onCommit SolrDeletionPolicy.onCommit: commits:num=1
[junit4:junit4]   2> 		commit{dir=NRTCachingDirectory(org.apache.lucene.store.NIOFSDirectory@/usr/home/hudson/hudson-slave/workspace/Lucene-Solr-Tests-4.x-Java6/solr/build/solr-core/test/J1/org.apache.solr.cloud.SyncSliceTest-1348312507720/jetty1/index lockFactory=org.apache.lucene.store.NativeFSLockFactory@3bee56b5; maxCacheMB=48.0 maxMergeSizeMB=4.0),segFN=segments_1,generation=1,filenames=[segments_1]
[junit4:junit4]   2> 3682 T1828 oasc.SolrDeletionPolicy.updateCommits newest commit = 1
[junit4:junit4]   2> 3683 T1828 oasc.SolrCore.initWriters created xml: solr.XMLResponseWriter
[junit4:junit4]   2> 3685 T1828 oasup.UpdateRequestProcessorChain.init inserting DistributedUpdateProcessorFactory into updateRequestProcessorChain "dedupe"
[junit4:junit4]   2> 3685 T1828 oasup.UpdateRequestProcessorChain.init inserting DistributedUpdateProcessorFactory into updateRequestProcessorChain "dedupe-allfields"
[junit4:junit4]   2> 3686 T1828 oasup.UpdateRequestProcessorChain.init inserting DistributedUpdateProcessorFactory into updateRequestProcessorChain "stored_sig"
[junit4:junit4]   2> 3686 T1828 oasup.UpdateRequestProcessorChain.init inserting DistributedUpdateProcessorFactory into updateRequestProcessorChain "uniq-fields"
[junit4:junit4]   2> 3687 T1828 oasup.UpdateRequestProcessorChain.init inserting DistributedUpdateProcessorFactory into updateRequestProcessorChain "distrib-dup-test-chain-implicit"
[junit4:junit4]   2> 3688 T1828 oasc.RequestHandlers.initHandlersFromConfig adding lazy requestHandler: solr.ReplicationHandler
[junit4:junit4]   2> 3688 T1828 oasc.RequestHandlers.initHandlersFromConfig created /replication: solr.ReplicationHandler
[junit4:junit4]   2> 3689 T1828 oasc.RequestHandlers.initHandlersFromConfig created standard: solr.StandardRequestHandler
[junit4:junit4]   2> 3690 T1828 oasc.RequestHandlers.initHandlersFromConfig created /get: solr.RealTimeGetHandler
[junit4:junit4]   2> 3690 T1828 oasc.RequestHandlers.initHandlersFromConfig created dismax: solr.SearchHandler
[junit4:junit4]   2> 3691 T1828 oasc.RequestHandlers.initHandlersFromConfig created mock: org.apache.solr.core.MockQuerySenderListenerReqHandler
[junit4:junit4]   2> 3692 T1828 oasc.RequestHandlers.initHandlersFromConfig created /admin/: org.apache.solr.handler.admin.AdminHandlers
[junit4:junit4]   2> 3692 T1828 oasc.RequestHandlers.initHandlersFromConfig created defaults: solr.StandardRequestHandler
[junit4:junit4]   2> 3693 T1828 oasc.RequestHandlers.initHandlersFromConfig adding lazy requestHandler: solr.StandardRequestHandler
[junit4:junit4]   2> 3693 T1828 oasc.RequestHandlers.initHandlersFromConfig created lazy: solr.StandardRequestHandler
[junit4:junit4]   2> 3694 T1828 oasc.RequestHandlers.initHandlersFromConfig created /update: solr.UpdateRequestHandler
[junit4:junit4]   2> 3694 T1828 oasc.RequestHandlers.initHandlersFromConfig created /terms: org.apache.solr.handler.component.SearchHandler
[junit4:junit4]   2> 3695 T1828 oasc.RequestHandlers.initHandlersFromConfig created spellCheckCompRH: org.apache.solr.handler.component.SearchHandler
[junit4:junit4]   2> 3696 T1828 oasc.RequestHandlers.initHandlersFromConfig created spellCheckCompRH_Direct: org.apache.solr.handler.component.SearchHandler
[junit4:junit4]   2> 3696 T1828 oasc.RequestHandlers.initHandlersFromConfig created spellCheckWithWordbreak: org.apache.solr.handler.component.SearchHandler
[junit4:junit4]   2> 3697 T1828 oasc.RequestHandlers.initHandlersFromConfig created spellCheckWithWordbreak_Direct: org.apache.solr.handler.component.SearchHandler
[junit4:junit4]   2> 3697 T1828 oasc.RequestHandlers.initHandlersFromConfig created spellCheckCompRH1: org.apache.solr.handler.component.SearchHandler
[junit4:junit4]   2> 3698 T1828 oasc.RequestHandlers.initHandlersFromConfig created tvrh: org.apache.solr.handler.component.SearchHandler
[junit4:junit4]   2> 3699 T1828 oasc.RequestHandlers.initHandlersFromConfig created /mlt: solr.MoreLikeThisHandler
[junit4:junit4]   2> 3699 T1828 oasc.RequestHandlers.initHandlersFromConfig created /debug/dump: solr.DumpRequestHandler
[junit4:junit4]   2> 3703 T1828 oashl.XMLLoader.init xsltCacheLifetimeSeconds=60
[junit4:junit4]   2> 3708 T1828 oasc.SolrCore.initDeprecatedSupport WARNING solrconfig.xml uses deprecated <admin/gettableFiles>, Please update your config to use the ShowFileRequestHandler.
[junit4:junit4]   2> 3709 T1828 oasc.SolrCore.initDeprecatedSupport WARNING adding ShowFileRequestHandler with hidden files: [SCHEMA.XML, OLD_SYNONYMS.TXT, STOPWORDS.TXT, PROTWORDS.TXT, OPEN-EXCHANGE-RATES.JSON, SYNONYMS.TXT, CURRENCY.XML, MAPPING-ISOLATIN1ACCENT.TXT]
[junit4:junit4]   2> 3713 T1828 oass.SolrIndexSearcher.<init> Opening Searcher@10770aed main
[junit4:junit4]   2> 3714 T1828 oasu.CommitTracker.<init> Hard AutoCommit: disabled
[junit4:junit4]   2> 3715 T1828 oasu.CommitTracker.<init> Soft AutoCommit: disabled
[junit4:junit4]   2> 3716 T1828 oashc.SpellCheckComponent.inform Initializing spell checkers
[junit4:junit4]   2> 3723 T1828 oass.DirectSolrSpellChecker.init init: {name=direct,classname=DirectSolrSpellChecker,field=lowerfilt,minQueryLength=3}
[junit4:junit4]   2> 3780 T1863 oasc.SolrCore.registerSearcher [collection1] Registered new searcher Searcher@10770aed main{StandardDirectoryReader(segments_1:1)}
[junit4:junit4]   2> 4120 T1849 oascc.ZkStateReader.updateClusterState Updating cloud state from ZooKeeper... 
[junit4:junit4]   2> 4139 T1862 oascc.ZkStateReader$2.process A cluster state change has occurred - updating...
[junit4:junit4]   2> 4139 T1848 oascc.ZkStateReader$2.process A cluster state change has occurred - updating...
[junit4:junit4]   2> 4286 T1828 oasc.CoreContainer.register registering core: collection1
[junit4:junit4]   2> 4286 T1828 oasc.ZkController.register Register shard - core:collection1 address:http://127.0.0.1:57811/solr shardId:shard1
[junit4:junit4]   2> 4287 T1828 oascc.SolrZkClient.makePath makePath: /collections/collection1/leader_elect/shard1/election
[junit4:junit4]   2> 4302 T1833 oazs.PrepRequestProcessor.pRequest Got user-level KeeperException when processing sessionid:0x139edb0254d0003 type:delete cxid:0x42 zxid:0xfffffffffffffffe txntype:unknown reqpath:n/a Error Path:/solr/collections/collection1/leaders Error:KeeperErrorCode = NoNode for /solr/collections/collection1/leaders
[junit4:junit4]   2> 4303 T1828 oasc.ShardLeaderElectionContext.runLeaderProcess Running the leader process.
[junit4:junit4]   2> 4304 T1833 oazs.PrepRequestProcessor.pRequest Got user-level KeeperException when processing sessionid:0x139edb0254d0003 type:create cxid:0x43 zxid:0xfffffffffffffffe txntype:unknown reqpath:n/a Error Path:/solr/overseer Error:KeeperErrorCode = NodeExists for /solr/overseer
[junit4:junit4]   2> 4314 T1828 oasc.ShardLeaderElectionContext.waitForReplicasToComeUp Enough replicas found to continue.
[junit4:junit4]   2> 4314 T1828 oasc.ShardLeaderElectionContext.runLeaderProcess I may be the new leader - try and sync
[junit4:junit4]   2> 4315 T1828 oasc.SyncStrategy.sync Sync replicas to http://127.0.0.1:57811/solr/collection1/
[junit4:junit4]   2> 4315 T1828 oasc.SyncStrategy.syncReplicas Sync Success - now sync replicas to me
[junit4:junit4]   2> 4315 T1828 oasc.SyncStrategy.syncToMe http://127.0.0.1:57811/solr/collection1/ has no replicas
[junit4:junit4]   2> 4316 T1828 oasc.ShardLeaderElectionContext.runLeaderProcess I am the new leader: http://127.0.0.1:57811/solr/collection1/
[junit4:junit4]   2> 4316 T1828 oascc.SolrZkClient.makePath makePath: /collections/collection1/leaders/shard1
[junit4:junit4]   2> 4319 T1833 oazs.PrepRequestProcessor.pRequest Got user-level KeeperException when processing sessionid:0x139edb0254d0003 type:create cxid:0x4d zxid:0xfffffffffffffffe txntype:unknown reqpath:n/a Error Path:/solr/overseer Error:KeeperErrorCode = NodeExists for /solr/overseer
[junit4:junit4]   2> 4643 T1849 oascc.ZkStateReader.updateClusterState Updating cloud state from ZooKeeper... 
[junit4:junit4]   2> 4660 T1848 oascc.ZkStateReader$2.process A cluster state change has occurred - updating...
[junit4:junit4]   2> 4660 T1862 oascc.ZkStateReader$2.process A cluster state change has occurred - updating...
[junit4:junit4]   2> 4686 T1828 oasc.ZkController.register We are http://127.0.0.1:57811/solr/collection1/ and leader is http://127.0.0.1:57811/solr/collection1/
[junit4:junit4]   2> 4686 T1828 oasc.ZkController.register No LogReplay needed for core=collection1 baseURL=http://127.0.0.1:57811/solr
[junit4:junit4]   2> 4687 T1828 oasc.ZkController.checkRecovery I am the leader, no recovery necessary
[junit4:junit4]   2> 4688 T1828 oascc.ZkStateReader.updateClusterState Updating cloud state from ZooKeeper... 
[junit4:junit4]   2> 4689 T1828 oass.SolrDispatchFilter.init user.dir=/usr/home/hudson/hudson-slave/workspace/Lucene-Solr-Tests-4.x-Java6/solr/build/solr-core/test/J1
[junit4:junit4]   2> 4690 T1828 oass.SolrDispatchFilter.init SolrDispatchFilter.init() done
[junit4:junit4]   2> 4690 T1828 oascsi.HttpClientUtil.createClient Creating new http client, config:maxConnections=128&maxConnectionsPerHost=32&followRedirects=false
[junit4:junit4]   2> 5128 T1828 oejs.Server.doStart jetty-8.1.2.v20120308
[junit4:junit4]   2> 5131 T1828 oejs.AbstractConnector.doStart Started SocketConnector@0.0.0.0:57815
[junit4:junit4]   2> 5131 T1828 oasc.SolrResourceLoader.locateSolrHome JNDI not configured for solr (NoInitialContextEx)
[junit4:junit4]   2> 5132 T1828 oasc.SolrResourceLoader.locateSolrHome using system property solr.solr.home: /usr/home/hudson/hudson-slave/workspace/Lucene-Solr-Tests-4.x-Java6/solr/build/solr-core/test/J1/./solrtest-jetty2-1348312512400
[junit4:junit4]   2> 5132 T1828 oasc.SolrResourceLoader.<init> new SolrResourceLoader for deduced Solr Home: '/usr/home/hudson/hudson-slave/workspace/Lucene-Solr-Tests-4.x-Java6/solr/build/solr-core/test/J1/./solrtest-jetty2-1348312512400/'
[junit4:junit4]   2> 5165 T1849 oascc.ZkStateReader.updateClusterState Updating cloud state from ZooKeeper... 
[junit4:junit4]   2> 5170 T1848 oascc.ZkStateReader$2.process A cluster state change has occurred - updating...
[junit4:junit4]   2> 5170 T1862 oascc.ZkStateReader$2.process A cluster state change has occurred - updating...
[junit4:junit4]   2> 5172 T1828 oass.SolrDispatchFilter.init SolrDispatchFilter.init()
[junit4:junit4]   2> 5172 T1828 oasc.SolrResourceLoader.locateSolrHome JNDI not configured for solr (NoInitialContextEx)
[junit4:junit4]   2> 5173 T1828 oasc.SolrResourceLoader.locateSolrHome using system property solr.solr.home: /usr/home/hudson/hudson-slave/workspace/Lucene-Solr-Tests-4.x-Java6/solr/build/solr-core/test/J1/./solrtest-jetty2-1348312512400
[junit4:junit4]   2> 5173 T1828 oasc.CoreContainer$Initializer.initialize looking for solr.xml: /usr/home/hudson/hudson-slave/workspace/Lucene-Solr-Tests-4.x-Java6/solr/build/solr-core/test/J1/./solrtest-jetty2-1348312512400/solr.xml
[junit4:junit4]   2> 5173 T1828 oasc.CoreContainer.<init> New CoreContainer 1588800931
[junit4:junit4]   2> 5174 T1828 oasc.CoreContainer.load Loading CoreContainer using Solr Home: '/usr/home/hudson/hudson-slave/workspace/Lucene-Solr-Tests-4.x-Java6/solr/build/solr-core/test/J1/./solrtest-jetty2-1348312512400/'
[junit4:junit4]   2> 5175 T1828 oasc.SolrResourceLoader.<init> new SolrResourceLoader for directory: '/usr/home/hudson/hudson-slave/workspace/Lucene-Solr-Tests-4.x-Java6/solr/build/solr-core/test/J1/./solrtest-jetty2-1348312512400/'
[junit4:junit4]   2> 5201 T1828 oasc.CoreContainer.load Registering Log Listener
[junit4:junit4]   2> 5217 T1828 oasc.CoreContainer.initZooKeeper Zookeeper client=127.0.0.1:57805/solr
[junit4:junit4]   2> 5217 T1828 oaz.ZooKeeper.<init> Initiating client connection, connectString=127.0.0.1:57805/solr sessionTimeout=5000 watcher=org.apache.solr.common.cloud.ConnectionManager@21bbc953
[junit4:junit4]   2> 5218 T1873 oaz.ClientCnxn$SendThread.startConnect Opening socket connection to server /127.0.0.1:57805
[junit4:junit4]   2> 5218 T1828 oascc.ConnectionManager.waitForConnected Waiting for client to connect to ZooKeeper
[junit4:junit4]   2> 5219 T1873 oaz.ClientCnxn$SendThread.primeConnection Socket connection established to localhost/127.0.0.1:57805, initiating session
[junit4:junit4]   2> 5219 T1830 oazs.NIOServerCnxn$Factory.run Accepted socket connection from /140.211.11.196:57816
[junit4:junit4]   2> 5219 T1830 oazs.NIOServerCnxn.readConnectRequest Client attempting to establish new session at /140.211.11.196:57816
[junit4:junit4]   2> 5221 T1832 oazs.NIOServerCnxn.finishSessionInit Established session 0x139edb0254d0004 with negotiated timeout 5000 for client /140.211.11.196:57816
[junit4:junit4]   2> 5221 T1873 oaz.ClientCnxn$SendThread.readConnectResult Session establishment complete on server localhost/127.0.0.1:57805, sessionid = 0x139edb0254d0004, negotiated timeout = 5000
[junit4:junit4]   2> 5221 T1874 oascc.ConnectionManager.process Watcher org.apache.solr.common.cloud.ConnectionManager@21bbc953 name:ZooKeeperConnection Watcher:127.0.0.1:57805/solr got event WatchedEvent state:SyncConnected type:None path:null path:null type:None
[junit4:junit4]   2> 5221 T1828 oascc.ConnectionManager.waitForConnected Client is connected to ZooKeeper
[junit4:junit4]   2> 5222 T1833 oazs.PrepRequestProcessor.pRequest Got user-level KeeperException when processing sessionid:0x139edb0254d0004 type:create cxid:0x1 zxid:0xfffffffffffffffe txntype:unknown reqpath:n/a Error Path:/solr/overseer Error:KeeperErrorCode = NodeExists for /solr/overseer
[junit4:junit4]   2> 5223 T1833 oazs.PrepRequestProcessor.pRequest Got user-level KeeperException when processing sessionid:0x139edb0254d0004 type:create cxid:0x2 zxid:0xfffffffffffffffe txntype:unknown reqpath:n/a Error Path:/solr/overseer Error:KeeperErrorCode = NodeExists for /solr/overseer
[junit4:junit4]   2> 5225 T1828 oasc.ZkController.createEphemeralLiveNode Register node as live in ZooKeeper:/live_nodes/127.0.0.1:57815_solr
[junit4:junit4]   2> 5225 T1833 oazs.PrepRequestProcessor.pRequest Got user-level KeeperException when processing sessionid:0x139edb0254d0004 type:delete cxid:0x4 zxid:0xfffffffffffffffe txntype:unknown reqpath:n/a Error Path:/solr/live_nodes/127.0.0.1:57815_solr Error:KeeperErrorCode = NoNode for /solr/live_nodes/127.0.0.1:57815_solr
[junit4:junit4]   2> 5226 T1828 oascc.SolrZkClient.makePath makePath: /live_nodes/127.0.0.1:57815_solr
[junit4:junit4]   2> 5228 T1848 oascc.ZkStateReader$3.process Updating live nodes
[junit4:junit4]   2> 5228 T1862 oascc.ZkStateReader$3.process Updating live nodes
[junit4:junit4]   2> 5229 T1828 oashc.HttpShardHandlerFactory.getParameter Setting socketTimeout to: 0
[junit4:junit4]   2> 5229 T1828 oashc.HttpShardHandlerFactory.getParameter Setting urlScheme to: http://
[junit4:junit4]   2> 5230 T1828 oashc.HttpShardHandlerFactory.getParameter Setting connTimeout to: 0
[junit4:junit4]   2> 5230 T1828 oashc.HttpShardHandlerFactory.getParameter Setting maxConnectionsPerHost to: 20
[junit4:junit4]   2> 5231 T1828 oashc.HttpShardHandlerFactory.getParameter Setting corePoolSize to: 0
[junit4:junit4]   2> 5231 T1828 oashc.HttpShardHandlerFactory.getParameter Setting maximumPoolSize to: 2147483647
[junit4:junit4]   2> 5232 T1828 oashc.HttpShardHandlerFactory.getParameter Setting maxThreadIdleTime to: 5
[junit4:junit4]   2> 5232 T1828 oashc.HttpShardHandlerFactory.getParameter Setting sizeOfQueue to: -1
[junit4:junit4]   2> 5233 T1828 oashc.HttpShardHandlerFactory.getParameter Setting fairnessPolicy to: false
[junit4:junit4]   2> 5233 T1828 oascsi.HttpClientUtil.createClient Creating new http client, config:maxConnectionsPerHost=20&maxConnections=10000&socketTimeout=0&connTimeout=0&retry=false
[junit4:junit4]   2> 5250 T1828 oascc.ZkStateReader.createClusterStateWatchersAndUpdate Updating cluster state from ZooKeeper... 
[junit4:junit4]   2> 5257 T1828 oasc.CoreContainer.create Creating SolrCore 'collection1' using instanceDir: /usr/home/hudson/hudson-slave/workspace/Lucene-Solr-Tests-4.x-Java6/solr/build/solr-core/test/J1/./solrtest-jetty2-1348312512400/collection1
[junit4:junit4]   2> 5257 T1828 oasc.ZkController.createCollectionZkNode Check for collection zkNode:collection1
[junit4:junit4]   2> 5258 T1828 oasc.ZkController.createCollectionZkNode Collection zkNode exists
[junit4:junit4]   2> 5258 T1828 oasc.ZkController.readConfigName Load collection config from:/collections/collection1
[junit4:junit4]   2> 5260 T1828 oasc.SolrResourceLoader.<init> new SolrResourceLoader for directory: '/usr/home/hudson/hudson-slave/workspace/Lucene-Solr-Tests-4.x-Java6/solr/build/solr-core/test/J1/./solrtest-jetty2-1348312512400/collection1/'
[junit4:junit4]   2> 5261 T1828 oasc.SolrResourceLoader.replaceClassLoader Adding 'file:/usr/home/hudson/hudson-slave/workspace/Lucene-Solr-Tests-4.x-Java6/solr/build/solr-core/test/J1/solrtest-jetty2-1348312512400/collection1/lib/classes/' to classloader
[junit4:junit4]   2> 5262 T1828 oasc.SolrResourceLoader.replaceClassLoader Adding 'file:/usr/home/hudson/hudson-slave/workspace/Lucene-Solr-Tests-4.x-Java6/solr/build/solr-core/test/J1/solrtest-jetty2-1348312512400/collection1/lib/README' to classloader
[junit4:junit4]   2> 5315 T1828 oasc.SolrConfig.<init> Using Lucene MatchVersion: LUCENE_40
[junit4:junit4]   2> 5392 T1828 oasc.SolrConfig.<init> Loaded SolrConfig: solrconfig.xml
[junit4:junit4]   2> 5493 T1828 oass.IndexSchema.readSchema Reading Solr Schema
[junit4:junit4]   2> 5500 T1828 oass.IndexSchema.readSchema Schema name=test
[junit4:junit4]   2> 6166 T1828 oass.OpenExchangeRatesOrgProvider.init Initialized with rates=open-exchange-rates.json, refreshInterval=1440.
[junit4:junit4]   2> 6179 T1828 oass.IndexSchema.readSchema default search field in schema is text
[junit4:junit4]   2> 6184 T1828 oass.IndexSchema.readSchema unique key field: id
[junit4:junit4]   2> 6196 T1828 oass.FileExchangeRateProvider.reload Reloading exchange rates from file currency.xml
[junit4:junit4]   2> 6201 T1828 oass.FileExchangeRateProvider.reload Reloading exchange rates from file currency.xml
[junit4:junit4]   2> 6205 T1828 oass.OpenExchangeRatesOrgProvider.reload Reloading exchange rates from open-exchange-rates.json
[junit4:junit4]   2> 6206 T1828 oass.OpenExchangeRatesOrgProvider.reload Reloading exchange rates from open-exchange-rates.json
[junit4:junit4]   2> 6207 T1828 oasc.SolrCore.<init> [collection1] Opening new SolrCore at /usr/home/hudson/hudson-slave/workspace/Lucene-Solr-Tests-4.x-Java6/solr/build/solr-core/test/J1/./solrtest-jetty2-1348312512400/collection1/, dataDir=./org.apache.solr.cloud.SyncSliceTest-1348312507720/jetty2/
[junit4:junit4]   2> 6208 T1828 oasc.JmxMonitoredMap.<init> JMX monitoring is enabled. Adding Solr mbeans to JMX Server: com.sun.jmx.mbeanserver.JmxMBeanServer@3c3228a1
[junit4:junit4]   2> 6209 T1828 oasc.SolrCore.getNewIndexDir WARNING New index directory detected: old=null new=./org.apache.solr.cloud.SyncSliceTest-1348312507720/jetty2/index/
[junit4:junit4]   2> 6210 T1828 oasc.SolrCore.initIndex WARNING [collection1] Solr index directory './org.apache.solr.cloud.SyncSliceTest-1348312507720/jetty2/index' doesn't exist. Creating new index...
[junit4:junit4]   2> 6211 T1828 oasc.CachingDirectoryFactory.get return new directory for /usr/home/hudson/hudson-slave/workspace/Lucene-Solr-Tests-4.x-Java6/solr/build/solr-core/test/J1/./org.apache.solr.cloud.SyncSliceTest-1348312507720/jetty2/index forceNew:false
[junit4:junit4]   2> 6219 T1828 oasc.SolrDeletionPolicy.onCommit SolrDeletionPolicy.onCommit: commits:num=1
[junit4:junit4]   2> 		commit{dir=NRTCachingDirectory(org.apache.lucene.store.NIOFSDirectory@/usr/home/hudson/hudson-slave/workspace/Lucene-Solr-Tests-4.x-Java6/solr/build/solr-core/test/J1/org.apache.solr.cloud.SyncSliceTest-1348312507720/jetty2/index lockFactory=org.apache.lucene.store.NativeFSLockFactory@67f9f9bb; maxCacheMB=48.0 maxMergeSizeMB=4.0),segFN=segments_1,generation=1,filenames=[segments_1]
[junit4:junit4]   2> 6219 T1828 oasc.SolrDeletionPolicy.updateCommits newest commit = 1
[junit4:junit4]   2> 6220 T1828 oasc.SolrCore.initWriters created xml: solr.XMLResponseWriter
[junit4:junit4]   2> 6222 T1828 oasup.UpdateRequestProcessorChain.init inserting DistributedUpdateProcessorFactory into updateRequestProcessorChain "dedupe"
[junit4:junit4]   2> 6223 T1828 oasup.UpdateRequestProcessorChain.init inserting DistributedUpdateProcessorFactory into updateRequestProcessorChain "dedupe-allfields"
[junit4:junit4]   2> 6224 T1828 oasup.UpdateRequestProcessorChain.init inserting DistributedUpdateProcessorFactory into updateRequestProcessorChain "stored_sig"
[junit4:junit4]   2> 6224 T1828 oasup.UpdateRequestProcessorChain.init inserting DistributedUpdateProcessorFactory into updateRequestProcessorChain "uniq-fields"
[junit4:junit4]   2> 6225 T1828 oasup.UpdateRequestProcessorChain.init inserting DistributedUpdateProcessorFactory into updateRequestProcessorChain "distrib-dup-test-chain-implicit"
[junit4:junit4]   2> 6225 T1828 oasc.RequestHandlers.initHandlersFromConfig adding lazy requestHandler: solr.ReplicationHandler
[junit4:junit4]   2> 6226 T1828 oasc.RequestHandlers.initHandlersFromConfig created /replication: solr.ReplicationHandler
[junit4:junit4]   2> 6227 T1828 oasc.RequestHandlers.initHandlersFromConfig created standard: solr.StandardRequestHandler
[junit4:junit4]   2> 6227 T1828 oasc.RequestHandlers.initHandlersFromConfig created /get: solr.RealTimeGetHandler
[junit4:junit4]   2> 6228 T1828 oasc.RequestHandlers.initHandlersFromConfig created dismax: solr.SearchHandler
[junit4:junit4]   2> 6229 T1828 oasc.RequestHandlers.initHandlersFromConfig created mock: org.apache.solr.core.MockQuerySenderListenerReqHandler
[junit4:junit4]   2> 6229 T1828 oasc.RequestHandlers.initHandlersFromConfig created /admin/: org.apache.solr.handler.admin.AdminHandlers
[junit4:junit4]   2> 6230 T1828 oasc.RequestHandlers.initHandlersFromConfig created defaults: solr.StandardRequestHandler
[junit4:junit4]   2> 6230 T1828 oasc.RequestHandlers.initHandlersFromConfig adding lazy requestHandler: solr.StandardRequestHandler
[junit4:junit4]   2> 6231 T1828 oasc.RequestHandlers.initHandlersFromConfig created lazy: solr.StandardRequestHandler
[junit4:junit4]   2> 6232 T1828 oasc.RequestHandlers.initHandlersFromConfig created /update: solr.UpdateRequestHandler
[junit4:junit4]   2> 6232 T1828 oasc.RequestHandlers.initHandlersFromConfig created /terms: org.apache.solr.handler.component.SearchHandler
[junit4:junit4]   2> 6233 T1828 oasc.RequestHandlers.initHandlersFromConfig created spellCheckCompRH: org.apache.solr.handler.component.SearchHandler
[junit4:junit4]   2> 6234 T1828 oasc.RequestHandlers.initHandlersFromConfig created spellCheckCompRH_Direct: org.apache.solr.handler.component.SearchHandler
[junit4:junit4]   2> 6234 T1828 oasc.RequestHandlers.initHandlersFromConfig created spellCheckWithWordbreak: org.apache.solr.handler.component.SearchHandler
[junit4:junit4]   2> 6235 T1828 oasc.RequestHandlers.initHandlersFromConfig created spellCheckWithWordbreak_Direct: org.apache.solr.handler.component.SearchHandler
[junit4:junit4]   2> 6236 T1828 oasc.RequestHandlers.initHandlersFromConfig created spellCheckCompRH1: org.apache.solr.handler.component.SearchHandler
[junit4:junit4]   2> 6236 T1828 oasc.RequestHandlers.initHandlersFromConfig created tvrh: org.apache.solr.handler.component.SearchHandler
[junit4:junit4]   2> 6237 T1828 oasc.RequestHandlers.initHandlersFromConfig created /mlt: solr.MoreLikeThisHandler
[junit4:junit4]   2> 6238 T1828 oasc.RequestHandlers.initHandlersFromConfig created /debug/dump: solr.DumpRequestHandler
[junit4:junit4]   2> 6242 T1828 oashl.XMLLoader.init xsltCacheLifetimeSeconds=60
[junit4:junit4]   2> 6247 T1828 oasc.SolrCore.initDeprecatedSupport WARNING solrconfig.xml uses deprecated <admin/gettableFiles>, Please update your config to use the ShowFileRequestHandler.
[junit4:junit4]   2> 6248 T1828 oasc.SolrCore.initDeprecatedSupport WARNING adding ShowFileRequestHandler with hidden files: [SCHEMA.XML, OLD_SYNONYMS.TXT, STOPWORDS.TXT, PROTWORDS.TXT, OPEN-EXCHANGE-RATES.JSON, SYNONYMS.TXT, CURRENCY.XML, MAPPING-ISOLATIN1ACCENT.TXT]
[junit4:junit4]   2> 6253 T1828 oass.SolrIndexSearcher.<init> Opening Searcher@79c0bf9f main
[junit4:junit4]   2> 6254 T1828 oasu.CommitTracker.<init> Hard AutoCommit: disabled
[junit4:junit4]   2> 6254 T1828 oasu.CommitTracker.<init> Soft AutoCommit: disabled
[junit4:junit4]   2> 6255 T1828 oashc.SpellCheckComponent.inform Initializing spell checkers
[junit4:junit4]   2> 6263 T1828 oass.DirectSolrSpellChecker.init init: {name=direct,classname=DirectSolrSpellChecker,field=lowerfilt,minQueryLength=3}
[junit4:junit4]   2> 6312 T1875 oasc.SolrCore.registerSearcher [collection1] Registered new searcher Searcher@79c0bf9f main{StandardDirectoryReader(segments_1:1)}
[junit4:junit4]   2> 6693 T1849 oascc.ZkStateReader.updateClusterState Updating cloud state from ZooKeeper... 
[junit4:junit4]   2> 6708 T1862 oascc.ZkStateReader$2.process A cluster state change has occurred - updating...
[junit4:junit4]   2> 6708 T1874 oascc.ZkStateReader$2.process A cluster state change has occurred - updating...
[junit4:junit4]   2> 6708 T1848 oascc.ZkStateReader$2.process A cluster state change has occurred - updating...
[junit4:junit4]   2> 6817 T1828 oasc.CoreContainer.register registering core: collection1
[junit4:junit4]   2> 6817 T1828 oasc.ZkController.register Register shard - core:collection1 address:http://127.0.0.1:57815/solr shardId:shard1
[junit4:junit4]   2> 6820 T1828 oasc.ZkController.register We are http://127.0.0.1:57815/solr/collection1/ and leader is http://127.0.0.1:57811/solr/collection1/
[junit4:junit4]   2> 6821 T1828 oasc.ZkController.register No LogReplay needed for core=collection1 baseURL=http://127.0.0.1:57815/solr
[junit4:junit4]   2> 6821 T1828 oasc.ZkController.checkRecovery Core needs to recover:collection1
[junit4:junit4]   2> 6822 T1828 oasu.DefaultSolrCoreState.doRecovery Running recovery - first canceling any ongoing recovery
[junit4:junit4]   2> ASYNC  NEW_CORE C117 name=collection1 org.apache.solr.core.SolrCore@4c79ee9e url=http://127.0.0.1:57815/solr/collection1 node=127.0.0.1:57815_solr
[junit4:junit4]   2> 6823 T1876 C117 P57815 oasc.RecoveryStrategy.run Starting recovery process.  core=collection1 recoveringAfterStartup=true
[junit4:junit4]   2> 6823 T1828 oascc.ZkStateReader.updateClusterState Updating cloud state from ZooKeeper... 
[junit4:junit4]   2> 6823 T1876 C117 P57815 oasc.RecoveryStrategy.doRecovery ###### startupVersions=[]
[junit4:junit4]   2> 6824 T1828 oass.SolrDispatchFilter.init user.dir=/usr/home/hudson/hudson-slave/workspace/Lucene-Solr-Tests-4.x-Java6/solr/build/solr-core/test/J1
[junit4:junit4]   2> 6824 T1876 C117 P57815 oasc.RecoveryStrategy.doRecovery Attempting to PeerSync from http://127.0.0.1:57811/solr/collection1/ core=collection1 - recoveringAfterStartup=true
[junit4:junit4]   2> 6824 T1828 oass.SolrDispatchFilter.init SolrDispatchFilter.init() done
[junit4:junit4]   2> 6825 T1876 C117 P57815 oasu.PeerSync.sync PeerSync: core=collection1 url=http://127.0.0.1:57815/solr START replicas=[http://127.0.0.1:57811/solr/collection1/] nUpdates=100
[junit4:junit4]   2> 6825 T1828 oascsi.HttpClientUtil.createClient Creating new http client, config:maxConnections=128&maxConnectionsPerHost=32&followRedirects=false
[junit4:junit4]   2> 6825 T1876 C117 P57815 oasu.PeerSync.sync WARNING no frame of reference to tell of we've missed updates
[junit4:junit4]   2> 6825 T1876 C117 P57815 oasc.RecoveryStrategy.doRecovery PeerSync Recovery was not successful - trying replication. core=collection1
[junit4:junit4]   2> 6825 T1876 C117 P57815 oasc.RecoveryStrategy.doRecovery Starting Replication Recovery. core=collection1
[junit4:junit4]   2> 6825 T1876 C117 P57815 oascsi.HttpClientUtil.createClient Creating new http client, config:maxConnections=128&maxConnectionsPerHost=32&followRedirects=false
[junit4:junit4]   2> ASYNC  NEW_CORE C118 name=collection1 org.apache.solr.core.SolrCore@27f9f2e4 url=http://127.0.0.1:57811/solr/collection1 node=127.0.0.1:57811_solr
[junit4:junit4]   2> 6832 T1854 C118 P57811 REQ /get {distrib=false&qt=/get&wt=javabin&version=2&getVersions=100} status=0 QTime=0 
[junit4:junit4]   2> 7212 T1849 oascc.ZkStateReader.updateClusterState Updating cloud state from ZooKeeper... 
[junit4:junit4]   2> 7221 T1828 oejs.Server.doStart jetty-8.1.2.v20120308
[junit4:junit4]   2> 7223 T1828 oejs.AbstractConnector.doStart Started SocketConnector@0.0.0.0:57819
[junit4:junit4]   2> 7224 T1828 oasc.SolrResourceLoader.locateSolrHome JNDI not configured for solr (NoInitialContextEx)
[junit4:junit4]   2> 7224 T1828 oasc.SolrResourceLoader.locateSolrHome using system property solr.solr.home: /usr/home/hudson/hudson-slave/workspace/Lucene-Solr-Tests-4.x-Java6/solr/build/solr-core/test/J1/./solrtest-jetty3-1348312514536
[junit4:junit4]   2> 7224 T1828 oasc.SolrResourceLoader.<init> new SolrResourceLoader for deduced Solr Home: '/usr/home/hudson/hudson-slave/workspace/Lucene-Solr-Tests-4.x-Java6/solr/build/solr-core/test/J1/./solrtest-jetty3-1348312514536/'
[junit4:junit4]   2> 7251 T1828 oass.SolrDispatchFilter.init SolrDispatchFilter.init()
[junit4:junit4]   2> 7252 T1828 oasc.SolrResourceLoader.locateSolrHome JNDI not configured for solr (NoInitialContextEx)
[junit4:junit4]   2> 7252 T1828 oasc.SolrResourceLoader.locateSolrHome using system property solr.solr.home: /usr/home/hudson/hudson-slave/workspace/Lucene-Solr-Tests-4.x-Java6/solr/build/solr-core/test/J1/./solrtest-jetty3-1348312514536
[junit4:junit4]   2> 7252 T1828 oasc.CoreContainer$Initializer.initialize looking for solr.xml: /usr/home/hudson/hudson-slave/workspace/Lucene-Solr-Tests-4.x-Java6/solr/build/solr-core/test/J1/./solrtest-jetty3-1348312514536/solr.xml
[junit4:junit4]   2> 7252 T1828 oasc.CoreContainer.<init> New CoreContainer 687177661
[junit4:junit4]   2> 7253 T1828 oasc.CoreContainer.load Loading CoreContainer using Solr Home: '/usr/home/hudson/hudson-slave/workspace/Lucene-Solr-Tests-4.x-Java6/solr/build/solr-core/test/J1/./solrtest-jetty3-1348312514536/'
[junit4:junit4]   2> 7253 T1828 oasc.SolrResourceLoader.<init> new SolrResourceLoader for directory: '/usr/home/hudson/hudson-slave/workspace/Lucene-Solr-Tests-4.x-Java6/solr/build/solr-core/test/J1/./solrtest-jetty3-1348312514536/'
[junit4:junit4]   2> 7271 T1828 oasc.CoreContainer.load Registering Log Listener
[junit4:junit4]   2> 7282 T1828 oasc.CoreContainer.initZooKeeper Zookeeper client=127.0.0.1:57805/solr
[junit4:junit4]   2> 7282 T1828 oaz.ZooKeeper.<init> Initiating client connection, connectString=127.0.0.1:57805/solr sessionTimeout=5000 watcher=org.apache.solr.common.cloud.ConnectionManager@4b6f5032
[junit4:junit4]   2> 7283 T1887 oaz.ClientCnxn$SendThread.startConnect Opening socket connection to server /127.0.0.1:57805
[junit4:junit4]   2> 7283 T1828 oascc.ConnectionManager.waitForConnected Waiting for client to connect to ZooKeeper
[junit4:junit4]   2> 7284 T1887 oaz.ClientCnxn$SendThread.primeConnection Socket connection established to localhost/127.0.0.1:57805, initiating session
[junit4:junit4]   2> 7284 T1830 oazs.NIOServerCnxn$Factory.run Accepted socket connection from /140.211.11.196:57820
[junit4:junit4]   2> 7285 T1830 oazs.NIOServerCnxn.readConnectRequest Client attempting to establish new session at /140.211.11.196:57820
[junit4:junit4]   2> 7302 T1832 oazs.NIOServerCnxn.finishSessionInit Established session 0x139edb0254d0005 with negotiated timeout 5000 for client /140.211.11.196:57820
[junit4:junit4]   2> 7302 T1887 oaz.ClientCnxn$SendThread.readConnectResult Session establishment complete on server localhost/127.0.0.1:57805, sessionid = 0x139edb0254d0005, negotiated timeout = 5000
[junit4:junit4]   2> 7303 T1888 oascc.ConnectionManager.process Watcher org.apache.solr.common.cloud.ConnectionManager@4b6f5032 name:ZooKeeperConnection Watcher:127.0.0.1:57805/solr got event WatchedEvent state:SyncConnected type:None path:null path:null type:None
[junit4:junit4]   2> 7303 T1828 oascc.ConnectionManager.waitForConnected Client is connected to ZooKeeper
[junit4:junit4]   2> 7304 T1833 oazs.PrepRequestProcessor.pRequest Got user-level KeeperException when processing sessionid:0x139edb0254d0005 type:create cxid:0x1 zxid:0xfffffffffffffffe txntype:unknown reqpath:n/a Error Path:/solr/overseer Error:KeeperErrorCode = NodeExists for /solr/overseer
[junit4:junit4]   2> 7324 T1874 oascc.ZkStateReader$2.process A cluster state change has occurred - updating...
[junit4:junit4]   2> 7324 T1862 oascc.ZkStateReader$2.process A cluster state change has occurred - updating...
[junit4:junit4]   2> 7324 T1848 oascc.ZkStateReader$2.process A cluster state change has occurred - updating...
[junit4:junit4]   2> 7360 T1833 oazs.PrepRequestProcessor.pRequest Got user-level KeeperException when processing sessionid:0x139edb0254d0005 type:create cxid:0x2 zxid:0xfffffffffffffffe txntype:unknown reqpath:n/a Error Path:/solr/overseer Error:KeeperErrorCode = NodeExists for /solr/overseer
[junit4:junit4]   2> 7362 T1828 oasc.ZkController.createEphemeralLiveNode Register node as live in ZooKeeper:/live_nodes/127.0.0.1:57819_solr
[junit4:junit4]   2> 7363 T1833 oazs.PrepRequestProcessor.pRequest Got user-level KeeperException when processing sessionid:0x139edb0254d0005 type:delete cxid:0x4 zxid:0xfffffffffffffffe txntype:unknown reqpath:n/a Error Path:/solr/live_nodes/127.0.0.1:57819_solr Error:KeeperErrorCode = NoNode for /solr/live_nodes/127.0.0.1:57819_solr
[junit4:junit4]   2> 7384 T1828 oascc.SolrZkClient.makePath makePath: /live_nodes/127.0.0.1:57819_solr
[junit4:junit4]   2> 7386 T1874 oascc.ZkStateReader$3.process Updating live nodes
[junit4:junit4]   2> 7386 T1848 oascc.ZkStateReader$3.process Updating live nodes
[junit4:junit4]   2> 7386 T1862 oascc.ZkStateReader$3.process Updating live nodes
[junit4:junit4]   2> 7387 T1828 oashc.HttpShardHandlerFactory.getParameter Setting socketTimeout to: 0
[junit4:junit4]   2> 7387 T1828 oashc.HttpShardHandlerFactory.getParameter Setting urlScheme to: http://
[junit4:junit4]   2> 7388 T1828 oashc.HttpShardHandlerFactory.getParameter Setting connTimeout to: 0
[junit4:junit4]   2> 7388 T1828 oashc.HttpShardHandlerFactory.getParameter Setting maxConnectionsPerHost to: 20
[junit4:junit4]   2> 7388 T1828 oashc.HttpShardHandlerFactory.getParameter Setting corePoolSize to: 0
[junit4:junit4]   2> 7388 T1828 oashc.HttpShardHandlerFactory.getParameter Setting maximumPoolSize to: 2147483647
[junit4:junit4]   2> 7389 T1828 oashc.HttpShardHandlerFactory.getParameter Setting maxThreadIdleTime to: 5
[junit4:junit4]   2> 7389 T1828 oashc.HttpShardHandlerFactory.getParameter Setting sizeOfQueue to: -1
[junit4:junit4]   2> 7389 T1828 oashc.HttpShardHandlerFactory.getParameter Setting fairnessPolicy to: false
[junit4:junit4]   2> 7390 T1828 oascsi.HttpClientUtil.createClient Creating new http client, config:maxConnectionsPerHost=20&maxConnections=10000&socketTimeout=0&connTimeout=0&retry=false
[junit4:junit4]   2> 7403 T1828 oascc.ZkStateReader.createClusterStateWatchersAndUpdate Updating cluster state from ZooKeeper... 
[junit4:junit4]   2> 7409 T1828 oasc.CoreContainer.create Creating SolrCore 'collection1' using instanceDir: /usr/home/hudson/hudson-slave/workspace/Lucene-Solr-Tests-4.x-Java6/solr/build/solr-core/test/J1/./solrtest-jetty3-1348312514536/collection1
[junit4:junit4]   2> 7410 T1828 oasc.ZkController.createCollectionZkNode Check for collection zkNode:collection1
[junit4:junit4]   2> 7410 T1828 oasc.ZkController.createCollectionZkNode Collection zkNode exists
[junit4:junit4]   2> 7411 T1828 oasc.ZkController.readConfigName Load collection config from:/collections/collection1
[junit4:junit4]   2> 7412 T1828 oasc.SolrResourceLoader.<init> new SolrResourceLoader for directory: '/usr/home/hudson/hudson-slave/workspace/Lucene-Solr-Tests-4.x-Java6/solr/build/solr-core/test/J1/./solrtest-jetty3-1348312514536/collection1/'
[junit4:junit4]   2> 7414 T1828 oasc.SolrResourceLoader.replaceClassLoader Adding 'file:/usr/home/hudson/hudson-slave/workspace/Lucene-Solr-Tests-4.x-Java6/solr/build/solr-core/test/J1/solrtest-jetty3-1348312514536/collection1/lib/README' to classloader
[junit4:junit4]   2> 7415 T1828 oasc.SolrResourceLoader.replaceClassLoader Adding 'file:/usr/home/hudson/hudson-slave/workspace/Lucene-Solr-Tests-4.x-Java6/solr/build/solr-core/test/J1/solrtest-jetty3-1348312514536/collection1/lib/classes/' to classloader
[junit4:junit4]   2> 7466 T1828 oasc.SolrConfig.<init> Using Lucene MatchVersion: LUCENE_40
[junit4:junit4]   2> 7543 T1828 oasc.SolrConfig.<init> Loaded SolrConfig: solrconfig.xml
[junit4:junit4]   2> 7644 T1828 oass.IndexSchema.readSchema Reading Solr Schema
[junit4:junit4]   2> 7650 T1828 oass.IndexSchema.readSchema Schema name=test
[junit4:junit4]   2> 8319 T1828 oass.OpenExchangeRatesOrgProvider.init Initialized with rates=open-exchange-rates.json, refreshInterval=1440.
[junit4:junit4]   2> 8332 T1828 oass.IndexSchema.readSchema default search field in schema is text
[junit4:junit4]   2> 8335 T1828 oass.IndexSchema.readSchema unique key field: id
[junit4:junit4]   2> 8352 T1828 oass.FileExchangeRateProvider.reload Reloading exchange rates from file currency.xml
[junit4:junit4]   2> 8356 T1828 oass.FileExchangeRateProvider.reload Reloading exchange rates from file currency.xml
[junit4:junit4]   2> 8359 T1828 oass.OpenExchangeRatesOrgProvider.reload Reloading exchange rates from open-exchange-rates.json
[junit4:junit4]   2> 8360 T1828 oass.OpenExchangeRatesOrgProvider.reload Reloading exchange rates from open-exchange-rates.json
[junit4:junit4]   2> 8361 T1828 oasc.SolrCore.<init> [collection1] Opening new SolrCore at /usr/home/hudson/hudson-slave/workspace/Lucene-Solr-Tests-4.x-Java6/solr/build/solr-core/test/J1/./solrtest-jetty3-1348312514536/collection1/, dataDir=./org.apache.solr.cloud.SyncSliceTest-1348312507720/jetty3/
[junit4:junit4]   2> 8361 T1828 oasc.JmxMonitoredMap.<init> JMX monitoring is enabled. Adding Solr mbeans to JMX Server: com.sun.jmx.mbeanserver.JmxMBeanServer@3c3228a1
[junit4:junit4]   2> 8362 T1828 oasc.SolrCore.getNewIndexDir WARNING New index directory detected: old=null new=./org.apache.solr.cloud.SyncSliceTest-1348312507720/jetty3/index/
[junit4:junit4]   2> 8363 T1828 oasc.SolrCore.initIndex WARNING [collection1] Solr index directory './org.apache.solr.cloud.SyncSliceTest-1348312507720/jetty3/index' doesn't exist. Creating new index...
[junit4:junit4]   2> 8364 T1828 oasc.CachingDirectoryFactory.get return new directory for /usr/home/hudson/hudson-slave/workspace/Lucene-Solr-Tests-4.x-Java6/solr/build/solr-core/test/J1/./org.apache.solr.cloud.SyncSliceTest-1348312507720/jetty3/index forceNew:false
[junit4:junit4]   2> 8395 T1828 oasc.SolrDeletionPolicy.onCommit SolrDeletionPolicy.onCommit: commits:num=1
[junit4:junit4]   2> 		commit{dir=NRTCachingDirectory(org.apache.lucene.store.NIOFSDirectory@/usr/home/hudson/hudson-slave/workspace/Lucene-Solr-Tests-4.x-Java6/solr/build/solr-core/test/J1/org.apache.solr.cloud.SyncSliceTest-1348312507720/jetty3/index lockFactory=org.apache.lucene.store.NativeFSLockFactory@7b0f9a5c; maxCacheMB=48.0 maxMergeSizeMB=4.0),segFN=segments_1,generation=1,filenames=[segments_1]
[junit4:junit4]   2> 8395 T1828 oasc.SolrDeletionPolicy.updateCommits newest commit = 1
[junit4:junit4]   2> 8396 T1828 oasc.SolrCore.initWriters created xml: solr.XMLResponseWriter
[junit4:junit4]   2> 8398 T1828 oasup.UpdateRequestProcessorChain.init inserting DistributedUpdateProcessorFactory into updateRequestProcessorChain "dedupe"
[junit4:junit4]   2> 8398 T1828 oasup.UpdateRequestProcessorChain.init inserting DistributedUpdateProcessorFactory into updateRequestProcessorChain "dedupe-allfields"
[junit4:junit4]   2> 8398 T1828 oasup.UpdateRequestProcessorChain.init inserting DistributedUpdateProcessorFactory into updateRequestProcessorChain "stored_sig"
[junit4:junit4]   2> 8399 T1828 oasup.UpdateRequestProcessorChain.init inserting DistributedUpdateProcessorFactory into updateRequestProcessorChain "uniq-fields"
[junit4:junit4]   2> 8399 T1828 oasup.UpdateRequestProcessorChain.init inserting DistributedUpdateProcessorFactory into updateRequestProcessorChain "distrib-dup-test-chain-implicit"
[junit4:junit4]   2> 8400 T1828 oasc.RequestHandlers.initHandlersFromConfig adding lazy requestHandler: solr.ReplicationHandler
[junit4:junit4]   2> 8400 T1828 oasc.RequestHandlers.initHandlersFromConfig created /replication: solr.ReplicationHandler
[junit4:junit4]   2> 8401 T1828 oasc.RequestHandlers.initHandlersFromConfig created standard: solr.StandardRequestHandler
[junit4:junit4]   2> 8401 T1828 oasc.RequestHandlers.initHandlersFromConfig created /get: solr.RealTimeGetHandler
[junit4:junit4]   2> 8401 T1828 oasc.RequestHandlers.initHandlersFromConfig created dismax: solr.SearchHandler
[junit4:junit4]   2> 8402 T1828 oasc.RequestHandlers.initHandlersFromConfig created mock: org.apache.solr.core.MockQuerySenderListenerReqHandler
[junit4:junit4]   2> 8402 T1828 oasc.RequestHandlers.initHandlersFromConfig created /admin/: org.apache.solr.handler.admin.AdminHandlers
[junit4:junit4]   2> 8403 T1828 oasc.RequestHandlers.initHandlersFromConfig created defaults: solr.StandardRequestHandler
[junit4:junit4]   2> 8403 T1828 oasc.RequestHandlers.initHandlersFromConfig adding lazy requestHandler: solr.StandardRequestHandler
[junit4:junit4]   2> 8403 T1828 oasc.RequestHandlers.initHandlersFromConfig created lazy: solr.StandardRequestHandler
[junit4:junit4]   2> 8404 T1828 oasc.RequestHandlers.initHandlersFromConfig created /update: solr.UpdateRequestHandler
[junit4:junit4]   2> 8404 T1828 oasc.RequestHandlers.initHandlersFromConfig created /terms: org.apache.solr.handler.component.SearchHandler
[junit4:junit4]   2> 8405 T1828 oasc.RequestHandlers.initHandlersFromConfig created spellCheckCompRH: org.apache.solr.handler.component.SearchHandler
[junit4:junit4]   2> 8405 T1828 oasc.RequestHandlers.initHandlersFromConfig created spellCheckCompRH_Direct: org.apache.solr.handler.component.SearchHandler
[junit4:junit4]   2> 8406 T1828 oasc.RequestHandlers.initHandlersFromConfig created spellCheckWithWordbreak: org.apache.solr.handler.component.SearchHandler
[junit4:junit4]   2> 8406 T1828 oasc.RequestHandlers.initHandlersFromConfig created spellCheckWithWordbreak_Direct: org.apache.solr.handler.component.SearchHandler
[junit4:junit4]   2> 8407 T1828 oasc.RequestHandlers.initHandlersFromConfig created spellCheckCompRH1: org.apache.solr.handler.component.SearchHandler
[junit4:junit4]   2> 8407 T1828 oasc.RequestHandlers.initHandlersFromConfig created tvrh: org.apache.solr.handler.component.SearchHandler
[junit4:junit4]   2> 8408 T1828 oasc.RequestHandlers.initHandlersFromConfig created /mlt: solr.MoreLikeThisHandler
[junit4:junit4]   2> 8408 T1828 oasc.RequestHandlers.initHandlersFromConfig created /debug/dump: solr.DumpRequestHandler
[junit4:junit4]   2> 8411 T1828 oashl.XMLLoader.init xsltCacheLifetimeSeconds=60
[junit4:junit4]   2> 8414 T1828 oasc.SolrCore.initDeprecatedSupport WARNING solrconfig.xml uses deprecated <admin/gettableFiles>, Please update your config to use the ShowFileRequestHandler.
[junit4:junit4]   2> 8415 T1828 oasc.SolrCore.initDeprecatedSupport WARNING adding ShowFileRequestHandler with hidden files: [SCHEMA.XML, OLD_SYNONYMS.TXT, STOPWORDS.TXT, PROTWORDS.TXT, OPEN-EXCHANGE-RATES.JSON, SYNONYMS.TXT, CURRENCY.XML, MAPPING-ISOLATIN1ACCENT.TXT]
[junit4:junit4]   2> 8418 T1828 oass.SolrIndexSearcher.<init> Opening Searcher@f3e11e3 main
[junit4:junit4]   2> 8419 T1828 oasu.CommitTracker.<init> Hard AutoCommit: disabled
[junit4:junit4]   2> 8419 T1828 oasu.CommitTracker.<init> Soft AutoCommit: disabled
[junit4:junit4]   2> 8419 T1828 oashc.SpellCheckComponent.inform Initializing spell checkers
[junit4:junit4]   2> 8425 T1828 oass.DirectSolrSpellChecker.init init: {name=direct,classname=DirectSolrSpellChecker,field=lowerfilt,minQueryLength=3}
[junit4:junit4]   2> 8474 T1889 oasc.SolrCore.registerSearcher [collection1] Registered new searcher Searcher@f3e11e3 main{StandardDirectoryReader(segments_1:1)}
[junit4:junit4]   2> 8889 T1849 oascc.ZkStateReader.updateClusterState Updating cloud state from ZooKeeper... 
[junit4:junit4]   2> 8905 T1848 oascc.ZkStateReader$2.process A cluster state change has occurred - updating...
[junit4:junit4]   2> 8905 T1874 oascc.ZkStateReader$2.process A cluster state change has occurred - updating...
[junit4:junit4]   2> 8905 T1862 oascc.ZkStateReader$2.process A cluster state change has occurred - updating...
[junit4:junit4]   2> 8905 T1888 oascc.ZkStateReader$2.process A cluster state change has occurred - updating...
[junit4:junit4]   2> 8979 T1828 oasc.CoreContainer.register registering core: collection1
[junit4:junit4]   2> 8979 T1828 oasc.ZkController.register Register shard - core:collection1 address:http://127.0.0.1:57819/solr shardId:shard1
[junit4:junit4]   2> 8982 T1828 oasc.ZkController.register We are http://127.0.0.1:57819/solr/collection1/ and leader is http://127.0.0.1:57811/solr/collection1/
[junit4:junit4]   2> 8982 T1828 oasc.ZkController.register No LogReplay needed for core=collection1 baseURL=http://127.0.0.1:57819/solr
[junit4:junit4]   2> 8982 T1828 oasc.ZkController.checkRecovery Core needs to recover:collection1
[junit4:junit4]   2> 8982 T1828 oasu.DefaultSolrCoreState.doRecovery Running recovery - first canceling any ongoing recovery
[junit4:junit4]   2> ASYNC  NEW_CORE C119 name=collection1 org.apache.solr.core.SolrCore@7c08ca40 url=http://127.0.0.1:57819/solr/collection1 node=127.0.0.1:57819_solr
[junit4:junit4]   2> 8983 T1890 C119 P57819 oasc.RecoveryStrategy.run Starting recovery process.  core=collection1 recoveringAfterStartup=true
[junit4:junit4]   2> 8983 T1890 C119 P57819 oasc.RecoveryStrategy.doRecovery ###### startupVersions=[]
[junit4:junit4]   2> 8983 T1828 oascc.ZkStateReader.updateClusterState Updating cloud state from ZooKeeper... 
[junit4:junit4]   2> 8984 T1890 C119 P57819 oasc.RecoveryStrategy.doRecovery Attempting to PeerSync from http://127.0.0.1:57811/solr/collection1/ core=collection1 - recoveringAfterStartup=true
[junit4:junit4]   2> 8985 T1890 C119 P57819 oasu.PeerSync.sync PeerSync: core=collection1 url=http://127.0.0.1:57819/solr START replicas=[http://127.0.0.1:57811/solr/collection1/] nUpdates=100
[junit4:junit4]   2> 8984 T1828 oass.SolrDispatchFilter.init user.dir=/usr/home/hudson/hudson-slave/workspace/Lucene-Solr-Tests-4.x-Java6/solr/build/solr-core/test/J1
[junit4:junit4]   2> 8985 T1890 C119 P57819 oasu.PeerSync.sync WARNING no frame of reference to tell of we've missed updates
[junit4:junit4]   2> 8985 T1828 oass.SolrDispatchFilter.init SolrDispatchFilter.init() done
[junit4:junit4]   2> 8985 T1890 C119 P57819 oasc.RecoveryStrategy.doRecovery PeerSync Recovery was not successful - trying replication. core=collection1
[junit4:junit4]   2> 8985 T1890 C119 P57819 oasc.RecoveryStrategy.doRecovery Starting Replication Recovery. core=collection1
[junit4:junit4]   2> 8985 T1828 oascsi.HttpClientUtil.createClient Creating new http client, config:maxConnections=128&maxConnectionsPerHost=32&followRedirects=false
[junit4:junit4]   2> 8985 T1890 C119 P57819 oascsi.HttpClientUtil.createClient Creating new http client, config:maxConnections=128&maxConnectionsPerHost=32&followRedirects=false
[junit4:junit4]   2> 8987 T1854 C118 P57811 REQ /get {distrib=false&qt=/get&wt=javabin&version=2&getVersions=100} status=0 QTime=0 
[junit4:junit4]   2> 9282 T1828 oejs.Server.doStart jetty-8.1.2.v20120308
[junit4:junit4]   2> 9284 T1828 oejs.AbstractConnector.doStart Started SocketConnector@0.0.0.0:57822
[junit4:junit4]   2> 9284 T1828 oasc.SolrResourceLoader.locateSolrHome JNDI not configured for solr (NoInitialContextEx)
[junit4:junit4]   2> 9284 T1828 oasc.SolrResourceLoader.locateSolrHome using system property solr.solr.home: /usr/home/hudson/hudson-slave/workspace/Lucene-Solr-Tests-4.x-Java6/solr/build/solr-core/test/J1/./solrtest-jetty4-1348312516693
[junit4:junit4]   2> 9285 T1828 oasc.SolrResourceLoader.<init> new SolrResourceLoader for deduced Solr Home: '/usr/home/hudson/hudson-slave/workspace/Lucene-Solr-Tests-4.x-Java6/solr/build/solr-core/test/J1/./solrtest-jetty4-1348312516693/'
[junit4:junit4]   2> 9311 T1828 oass.SolrDispatchFilter.init SolrDispatchFilter.init()
[junit4:junit4]   2> 9311 T1828 oasc.SolrResourceLoader.locateSolrHome JNDI not configured for solr (NoInitialContextEx)
[junit4:junit4]   2> 9312 T1828 oasc.SolrResourceLoader.locateSolrHome using system property solr.solr.home: /usr/home/hudson/hudson-slave/workspace/Lucene-Solr-Tests-4.x-Java6/solr/build/solr-core/test/J1/./solrtest-jetty4-1348312516693
[junit4:junit4]   2> 9312 T1828 oasc.CoreContainer$Initializer.initialize looking for solr.xml: /usr/home/hudson/hudson-slave/workspace/Lucene-Solr-Tests-4.x-Java6/solr/build/solr-core/test/J1/./solrtest-jetty4-1348312516693/solr.xml
[junit4:junit4]   2> 9312 T1828 oasc.CoreContainer.<init> New CoreContainer 1270547387
[junit4:junit4]   2> 9313 T1828 oasc.CoreContainer.load Loading CoreContainer using Solr Home: '/usr/home/hudson/hudson-slave/workspace/Lucene-Solr-Tests-4.x-Java6/solr/build/solr-core/test/J1/./solrtest-jetty4-1348312516693/'
[junit4:junit4]   2> 9313 T1828 oasc.SolrResourceLoader.<init> new SolrResourceLoader for directory: '/usr/home/hudson/hudson-slave/workspace/Lucene-Solr-Tests-4.x-Java6/solr/build/solr-core/test/J1/./solrtest-jetty4-1348312516693/'
[junit4:junit4]   2> 9331 T1828 oasc.CoreContainer.load Registering Log Listener
[junit4:junit4]   2> 9346 T1828 oasc.CoreContainer.initZooKeeper Zookeeper client=127.0.0.1:57805/solr
[junit4:junit4]   2> 9346 T1828 oaz.ZooKeeper.<init> Initiating client connection, connectString=127.0.0.1:57805/solr sessionTimeout=5000 watcher=org.apache.solr.common.cloud.ConnectionManager@22f010c
[junit4:junit4]   2> 9348 T1901 oaz.ClientCnxn$SendThread.startConnect Opening socket connection to server /127.0.0.1:57805
[junit4:junit4]   2> 9348 T1828 oascc.ConnectionManager.waitForConnected Waiting for client to connect to ZooKeeper
[junit4:junit4]   2> 9348 T1901 oaz.ClientCnxn$SendThread.primeConnection Socket connection established to localhost/127.0.0.1:57805, initiating session
[junit4:junit4]   2> 9348 T1830 oazs.NIOServerCnxn$Factory.run Accepted socket connection from /140.211.11.196:57823
[junit4:junit4]   2> 9349 T1830 oazs.NIOServerCnxn.readConnectRequest Client attempting to establish new session at /140.211.11.196:57823
[junit4:junit4]   2> 9351 T1832 oazs.NIOServerCnxn.finishSessionInit Established session 0x139edb0254d0006 with negotiated timeout 5000 for client /140.211.11.196:57823
[junit4:junit4]   2> 9351 T1901 oaz.ClientCnxn$SendThread.readConnectResult Session establishment complete on server localhost/127.0.0.1:57805, sessionid = 0x139edb0254d0006, negotiated timeout = 5000
[junit4:junit4]   2> 9351 T1902 oascc.ConnectionManager.process Watcher org.apache.solr.common.cloud.ConnectionManager@22f010c name:ZooKeeperConnection Watcher:127.0.0.1:57805/solr got event WatchedEvent state:SyncConnected type:None path:null path:null type:None
[junit4:junit4]   2> 9351 T1828 oascc.ConnectionManager.waitForConnected Client is connected to ZooKeeper
[junit4:junit4]   2> 9352 T1833 oazs.PrepRequestProcessor.pRequest Got user-level KeeperException when processing sessionid:0x139edb0254d0006 type:create cxid:0x1 zxid:0xfffffffffffffffe txntype:unknown reqpath:n/a Error Path:/solr/overseer Error:KeeperErrorCode = NodeExists for /solr/overseer
[junit4:junit4]   2> 9353 T1833 oazs.PrepRequestProcessor.pRequest Got user-level KeeperException when processing sessionid:0x139edb0254d0006 type:create cxid:0x2 zxid:0xfffffffffffffffe txntype:unknown reqpath:n/a Error Path:/solr/overseer Error:KeeperErrorCode = NodeExists for /solr/overseer
[junit4:junit4]   2> 9355 T1828 oasc.ZkController.createEphemeralLiveNode Register node as live in ZooKeeper:/live_nodes/127.0.0.1:57822_solr
[junit4:junit4]   2> 9355 T1833 oazs.PrepRequestProcessor.pRequest Got user-level KeeperException when processing sessionid:0x139edb0254d0006 type:delete cxid:0x4 zxid:0xfffffffffffffffe txntype:unknown reqpath:n/a Error Path:/solr/live_nodes/127.0.0.1:57822_solr Error:KeeperErrorCode = NoNode for /solr/live_nodes/127.0.0.1:57822_solr
[junit4:junit4]   2> 9369 T1828 oascc.SolrZkClient.makePath makePath: /live_nodes/127.0.0.1:57822_solr
[junit4:junit4]   2> 9371 T1862 oascc.ZkStateReader$3.process Updating live nodes
[junit4:junit4]   2> 9371 T1874 oascc.ZkStateReader$3.process Updating live nodes
[junit4:junit4]   2> 9371 T1888 oascc.ZkStateReader$3.process Updating live nodes
[junit4:junit4]   2> 9371 T1848 oascc.ZkStateReader$3.process Updating live nodes
[junit4:junit4]   2> 9372 T1828 oashc.HttpShardHandlerFactory.getParameter Setting socketTimeout to: 0
[junit4:junit4]   2> 9373 T1828 oashc.HttpShardHandlerFactory.getParameter Setting urlScheme to: http://
[junit4:junit4]   2> 9373 T1828 oashc.HttpShardHandlerFactory.getParameter Setting connTimeout to: 0
[junit4:junit4]   2> 9373 T1828 oashc.HttpShardHandlerFactory.getParameter Setting maxConnectionsPerHost to: 20
[junit4:junit4]   2> 9374 T1828 oashc.HttpShardHandlerFactory.getParameter Setting corePoolSize to: 0
[junit4:junit4]   2> 9374 T1828 oashc.HttpShardHandlerFactory.getParameter Setting maximumPoolSize to: 2147483647
[junit4:junit4]   2> 9374 T1828 oashc.HttpShardHandlerFactory.getParameter Setting maxThreadIdleTime to: 5
[junit4:junit4]   2> 9375 T1828 oashc.HttpShardHandlerFactory.getParameter Setting sizeOfQueue to: -1
[junit4:junit4]   2> 9375 T1828 oashc.HttpShardHandlerFactory.getParameter Setting fairnessPolicy to: false
[junit4:junit4]   2> 9375 T1828 oascsi.HttpClientUtil.createClient Creating new http client, config:maxConnectionsPerHost=20&maxConnections=10000&socketTimeout=0&connTimeout=0&retry=false
[junit4:junit4]   2> 9391 T1828 oascc.ZkStateReader.createClusterStateWatchersAndUpdate Updating cluster state from ZooKeeper... 
[junit4:junit4]   2> 9396 T1828 oasc.CoreContainer.create Creating SolrCore 'collection1' using instanceDir: /usr/home/hudson/hudson-slave/workspace/Lucene-Solr-Tests-4.x-Java6/solr/build/solr-core/test/J1/./solrtest-jetty4-1348312516693/collection1
[junit4:junit4]   2> 9397 T1828 oasc.ZkController.createCollectionZkNode Check for collection zkNode:collection1
[junit4:junit4]   2> 9397 T1828 oasc.ZkController.createCollectionZkNode Collection zkNode exists
[junit4:junit4]   2> 9398 T1828 oasc.ZkController.readConfigName Load collection config from:/collections/collection1
[junit4:junit4]   2> 9399 T1828 oasc.SolrResourceLoader.<init> new SolrResourceLoader for directory: '/usr/home/hudson/hudson-slave/workspace/Lucene-Solr-Tests-4.x-Java6/solr/build/solr-core/test/J1/./solrtest-jetty4-1348312516693/collection1/'
[junit4:junit4]   2> 9400 T1828 oasc.SolrResourceLoader.replaceClassLoader Adding 'file:/usr/home/hudson/hudson-slave/workspace/Lucene-Solr-Tests-4.x-Java6/solr/build/solr-core/test/J1/solrtest-jetty4-1348312516693/collection1/lib/classes/' to classloader
[junit4:junit4]   2> 9401 T1828 oasc.SolrResourceLoader.replaceClassLoader Adding 'file:/usr/home/hudson/hudson-slave/workspace/Lucene-Solr-Tests-4.x-Java6/solr/build/solr-core/test/J1/solrtest-jetty4-1348312516693/collection1/lib/README' to classloader
[junit4:junit4]   2> 9409 T1849 oascc.ZkStateReader.updateClusterState Updating cloud state from ZooKeeper... 
[junit4:junit4]   2> 9422 T1848 oascc.ZkStateReader$2.process A cluster state change has occurred - updating...
[junit4:junit4]   2> 9422 T1902 oascc.ZkStateReader$2.process A cluster state change has occurred - updating...
[junit4:junit4]   2> 9422 T1862 oascc.ZkStateReader$2.process A cluster state change has occurred - updating...
[junit4:junit4]   2> 9422 T1888 oascc.ZkStateReader$2.process A cluster state change has occurred - updating...
[junit4:junit4]   2> 9422 T1874 oascc.ZkStateReader$2.process A cluster state change has occurred - updating...
[junit4:junit4]   2> 9453 T1828 oasc.SolrConfig.<init> Using Lucene MatchVersion: LUCENE_40
[junit4:junit4]   2> 9516 T1828 oasc.SolrConfig.<init> Loaded SolrConfig: solrconfig.xml
[junit4:junit4]   2> 9617 T1828 oass.IndexSchema.readSchema Reading Solr Schema
[junit4:junit4]   2> 9622 T1828 oass.IndexSchema.readSchema Schema name=test
[junit4:junit4]   2>  C117_STATE=coll:collection1 core:collection1 props:{shard=shard1, roles=null, state=recovering, core=collection1, collection=collection1, node_name=127.0.0.1:57815_solr, base_url=http://127.0.0.1:57815/solr}
[junit4:junit4]   2> 9843 T1876 C117 P57815 oasc.RecoveryStrategy.doRecovery Begin buffering updates. core=collection1
[junit4:junit4]   2> 9843 T1876 C117 P57815 oasu.UpdateLog.bufferUpdates Starting to buffer updates. FSUpdateLog{state=ACTIVE, tlog=null}
[junit4:junit4]   2> 9843 T1876 C117 P57815 oasc.RecoveryStrategy.replicate Attempting to replicate from http://127.0.0.1:57811/solr/collection1/. core=collection1
[junit4:junit4]   2> 9843 T1876 C117 P57815 oascsi.HttpClientUtil.createClient Creating new http client, config:maxConnections=128&maxConnectionsPerHost=32&followRedirects=false
[junit4:junit4]   2> 9852 T1857 C118 P57811 oasu.DirectUpdateHandler2.commit start commit{flags=0,_version_=0,optimize=false,openSearcher=true,waitSearcher=true,expungeDeletes=false,softCommit=false}
[junit4:junit4]   2> 9855 T1857 C118 P57811 oasc.SolrDeletionPolicy.onInit SolrDeletionPolicy.onInit: commits:num=1
[junit4:junit4]   2> 		commit{dir=NRTCachingDirectory(org.apache.lucene.store.NIOFSDirectory@/usr/home/hudson/hudson-slave/workspace/Lucene-Solr-Tests-4.x-Java6/solr/build/solr-core/test/J1/org.apache.solr.cloud.SyncSliceTest-1348312507720/jetty1/index lockFactory=org.apache.lucene.store.NativeFSLockFactory@3bee56b5; maxCacheMB=48.0 maxMergeSizeMB=4.0),segFN=segments_1,generation=1,filenames=[segments_1]
[junit4:junit4]   2> 9856 T1857 C118 P57811 oasc.SolrDeletionPolicy.updateCommits newest commit = 1
[junit4:junit4]   2> 9857 T1857 C118 P57811 oass.SolrIndexSearcher.<init> Opening Searcher@13862166 main
[junit4:junit4]   2> 9857 T1857 C118 P57811 oasu.DirectUpdateHandler2.commit end_commit_flush
[junit4:junit4]   2> 9858 T1863 oasc.SolrCore.registerSearcher [collection1] Registered new searcher Searcher@13862166 main{StandardDirectoryReader(segments_1:1)}
[junit4:junit4]   2> 9859 T1857 C118 P57811 /update {waitSearcher=true&commit=true&commit_end_point=true&wt=javabin&softCommit=false&version=2} {commit=} 0 8
[junit4:junit4]   2> 9859 T1876 C117 P57815 oash.ReplicationHandler.inform Commits will be reserved for  10000
[junit4:junit4]   2> 9859 T1876 C117 P57815 oash.SnapPuller.<init>  No value set for 'pollInterval'. Timer Task not started.
[junit4:junit4]   2> 9861 T1858 C118 P57811 oash.ReplicationHandler.inform Commits will be reserved for  10000
[junit4:junit4]   2> 9861 T1858 C118 P57811 REQ /replication {command=indexversion&wt=javabin&qt=/replication&version=2} status=0 QTime=1 
[junit4:junit4]   2> 9865 T1876 C117 P57815 oasc.SolrDeletionPolicy.onInit SolrDeletionPolicy.onInit: commits:num=1
[junit4:junit4]   2> 		commit{dir=NRTCachingDirectory(org.apache.lucene.store.NIOFSDirectory@/usr/home/hudson/hudson-slave/workspace/Lucene-Solr-Tests-4.x-Java6/solr/build/solr-core/test/J1/org.apache.solr.cloud.SyncSliceTest-1348312507720/jetty2/index lockFactory=org.apache.lucene.store.NativeFSLockFactory@67f9f9bb; maxCacheMB=48.0 maxMergeSizeMB=4.0),segFN=segments_1,generation=1,filenames=[segments_1]
[junit4:junit4]   2> 9866 T1876 C117 P57815 oasc.SolrDeletionPolicy.updateCommits newest commit = 1
[junit4:junit4]   2> 9866 T1876 C117 P57815 oasu.DirectUpdateHandler2.commit start commit{flags=0,_version_=0,optimize=false,openSearcher=true,waitSearcher=true,expungeDeletes=false,softCommit=false}
[junit4:junit4]   2> 9870 T1876 C117 P57815 oasc.SolrDeletionPolicy.onCommit SolrDeletionPolicy.onCommit: commits:num=2
[junit4:junit4]   2> 		commit{dir=NRTCachingDirectory(org.apache.lucene.store.NIOFSDirectory@/usr/home/hudson/hudson-slave/workspace/Lucene-Solr-Tests-4.x-Java6/solr/build/solr-core/test/J1/org.apache.solr.cloud.SyncSliceTest-1348312507720/jetty2/index lockFactory=org.apache.lucene.store.NativeFSLockFactory@67f9f9bb; maxCacheMB=48.0 maxMergeSizeMB=4.0),segFN=segments_1,generation=1,filenames=[segments_1]
[junit4:junit4]   2> 		commit{dir=NRTCachingDirectory(org.apache.lucene.store.NIOFSDirectory@/usr/home/hudson/hudson-slave/workspace/Lucene-Solr-Tests-4.x-Java6/solr/build/solr-core/test/J1/org.apache.solr.cloud.SyncSliceTest-1348312507720/jetty2/index lockFactory=org.apache.lucene.store.NativeFSLockFactory@67f9f9bb; maxCacheMB=48.0 maxMergeSizeMB=4.0),segFN=segments_2,generation=2,filenames=[segments_2]
[junit4:junit4]   2> 9870 T1876 C117 P57815 oasc.SolrDeletionPolicy.updateCommits newest commit = 2
[junit4:junit4]   2> 9874 T1876 C117 P57815 oass.SolrIndexSearcher.<init> Opening Searcher@47c0c722 main
[junit4:junit4]   2> 9874 T1876 C117 P57815 oasu.DirectUpdateHandler2.commit end_commit_flush
[junit4:junit4]   2> 9875 T1875 oasc.SolrCore.registerSearcher [collection1] Registered new searcher Searcher@47c0c722 main{StandardDirectoryReader(segments_2:2)}
[junit4:junit4]   2> 9876 T1876 C117 P57815 oasc.RecoveryStrategy.replay No replay needed. core=collection1
[junit4:junit4]   2> 9876 T1876 C117 P57815 oasc.RecoveryStrategy.doRecovery Replication Recovery was successful - registering as Active. core=collection1
[junit4:junit4]   2> 9878 T1876 C117 P57815 oasc.RecoveryStrategy.doRecovery Finished recovery process. core=collection1
[junit4:junit4]   2> 9926 T1849 oascc.ZkStateReader.updateClusterState Updating cloud state from ZooKeeper... 
[junit4:junit4]   2> 9939 T1874 oascc.ZkStateReader$2.process A cluster state change has occurred - updating...
[junit4:junit4]   2> 9939 T1848 oascc.ZkStateReader$2.process A cluster state change has occurred - updating...
[junit4:junit4]   2> 9939 T1862 oascc.ZkStateReader$2.process A cluster state change has occurred - updating...
[junit4:junit4]   2> 9939 T1888 oascc.ZkStateReader$2.process A cluster state change has occurred - updating...
[junit4:junit4]   2> 9939 T1902 oascc.ZkStateReader$2.process A cluster state change has occurred - updating...
[junit4:junit4]   2> 10184 T1828 oass.OpenExchangeRatesOrgProvider.init Initialized with rates=open-exchange-rates.json, refreshInterval=1440.
[junit4:junit4]   2> 10195 T1828 oass.IndexSchema.readSchema default search field in schema is text
[junit4:junit4]   2> 10199 T1828 oass.IndexSchema.readSchema unique key field: id
[junit4:junit4]   2> 10210 T1828 oass.FileExchangeRateProvider.reload Reloading exchange rates from file currency.xml
[junit4:junit4]   2> 10220 T1828 oass.FileExchangeRateProvider.reload Reloading exchange rates from file currency.xml
[junit4:junit4]   2> 10224 T1828 oass.OpenExchangeRatesOrgProvider.reload Reloading exchange rates from open-exchange-rates.json
[junit4:junit4]   2> 10225 T1828 oass.OpenExchangeRatesOrgProvider.reload Reloading exchange rates from open-exchange-rates.json
[junit4:junit4]   2> 10226 T1828 oasc.SolrCore.<init> [collection1] Opening new SolrCore at /usr/home/hudson/hudson-slave/workspace/Lucene-Solr-Tests-4.x-Java6/solr/build/solr-core/test/J1/./solrtest-jetty4-1348312516693/collection1/, dataDir=./org.apache.solr.cloud.SyncSliceTest-1348312507720/jetty4/
[junit4:junit4]   2> 10226 T1828 oasc.JmxMonitoredMap.<init> JMX monitoring is enabled. Adding Solr mbeans to JMX Server: com.sun.jmx.mbeanserver.JmxMBeanServer@3c3228a1
[junit4:junit4]   2> 10227 T1828 oasc.SolrCore.getNewIndexDir WARNING New index directory detected: old=null new=./org.apache.solr.cloud.SyncSliceTest-1348312507720/jetty4/index/
[junit4:junit4]   2> 10228 T1828 oasc.SolrCore.initIndex WARNING [collection1] Solr index directory './org.apache.solr.cloud.SyncSliceTest-1348312507720/jetty4/index' doesn't exist. Creating new index...
[junit4:junit4]   2> 10229 T1828 oasc.CachingDirectoryFactory.get return new directory for /usr/home/hudson/hudson-slave/workspace/Lucene-Solr-Tests-4.x-Java6/solr/build/solr-core/test/J1/./org.apache.solr.cloud.SyncSliceTest-1348312507720/jetty4/index forceNew:false
[junit4:junit4]   2> 10235 T1828 oasc.SolrDeletionPolicy.onCommit SolrDeletionPolicy.onCommit: commits:num=1
[junit4:junit4]   2> 		commit{dir=NRTCachingDirectory(org.apache.lucene.store.NIOFSDirectory@/usr/home/hudson/hudson-slave/workspace/Lucene-Solr-Tests-4.x-Java6/solr/build/solr-core/test/J1/org.apache.solr.cloud.SyncSliceTest-1348312507720/jetty4/index lockFactory=org.apache.lucene.store.NativeFSLockFactory@db1d892; maxCacheMB=48.0 maxMergeSizeMB=4.0),segFN=segments_1,generation=1,filenames=[segments_1]
[junit4:junit4]   2> 10235 T1828 oasc.SolrDeletionPolicy.updateCommits newest commit = 1
[junit4:junit4]   2> 10236 T1828 oasc.SolrCore.initWriters created xml: solr.XMLResponseWriter
[junit4:junit4]   2> 10238 T1828 oasup.UpdateRequestProcessorChain.init inserting DistributedUpdateProcessorFactory into updateRequestProcessorChain "dedupe"
[junit4:junit4]   2> 10239 T1828 oasup.UpdateRequestProcessorChain.init inserting DistributedUpdateProcessorFactory into updateRequestProcessorChain "dedupe-allfields"
[junit4:junit4]   2> 10239 T1828 oasup.UpdateRequestProcessorChain.init inserting DistributedUpdateProcessorFactory into updateRequestProcessorChain "stored_sig"
[junit4:junit4]   2> 10240 T1828 oasup.UpdateRequestProcessorChain.init inserting DistributedUpdateProcessorFactory into updateRequestProcessorChain "uniq-fields"
[junit4:junit4]   2> 10240 T1828 oasup.UpdateRequestProcessorChain.init inserting DistributedUpdateProcessorFactory into updateRequestProcessorChain "distrib-dup-test-chain-implicit"
[junit4:junit4]   2> 10241 T1828 oasc.RequestHandlers.initHandlersFromConfig adding lazy requestHandler: solr.ReplicationHandler
[junit4:junit4]   2> 10241 T1828 oasc.RequestHandlers.initHandlersFromConfig created /replication: solr.ReplicationHandler
[junit4:junit4]   2> 10242 T1828 oasc.RequestHandlers.initHandlersFromConfig created standard: solr.StandardRequestHandler
[junit4:junit4]   2> 10242 T1828 oasc.RequestHandlers.initHandlersFromConfig created /get: solr.RealTimeGetHandler
[junit4:junit4]   2> 10243 T1828 oasc.RequestHandlers.initHandlersFromConfig created dismax: solr.SearchHandler
[junit4:junit4]   2> 10243 T1828 oasc.RequestHandlers.initHandlersFromConfig created mock: org.apache.solr.core.MockQuerySenderListenerReqHandler
[junit4:junit4]   2> 10244 T1828 oasc.RequestHandlers.initHandlersFromConfig created /admin/: org.apache.solr.handler.admin.AdminHandlers
[junit4:junit4]   2> 10244 T1828 oasc.RequestHandlers.initHandlersFromConfig created defaults: solr.StandardRequestHandler
[junit4:junit4]   2> 10245 T1828 oasc.RequestHandlers.initHandlersFromConfig adding lazy requestHandler: solr.StandardRequestHandler
[junit4:junit4]   2> 10245 T1828 oasc.RequestHandlers.initHandlersFromConfig created lazy: solr.StandardRequestHandler
[junit4:junit4]   2> 10246 T1828 oasc.RequestHandlers.initHandlersFromConfig created /update: solr.UpdateRequestHandler
[junit4:junit4]   2> 10246 T1828 oasc.RequestHandlers.initHandlersFromConfig created /terms: org.apache.solr.handler.component.SearchHandler
[junit4:junit4]   2> 10247 T1828 oasc.RequestHandlers.initHandlersFromConfig created spellCheckCompRH: org.apache.solr.handler.component.SearchHandler
[junit4:junit4]   2> 10247 T1828 oasc.RequestHandlers.initHandlersFromConfig created spellCheckCompRH_Direct: org.apache.solr.handler.component.SearchHandler
[junit4:junit4]   2> 10248 T1828 oasc.RequestHandlers.initHandlersFromConfig created spellCheckWithWordbreak: org.apache.solr.handler.component.SearchHandler
[junit4:junit4]   2> 10248 T1828 oasc.RequestHandlers.initHandlersFromConfig created spellCheckWithWordbreak_Direct: org.apache.solr.handler.component.SearchHandler
[junit4:junit4]   2> 10249 T1828 oasc.RequestHandlers.initHandlersFromConfig created spellCheckCompRH1: org.apache.solr.handler.component.SearchHandler
[junit4:junit4]   2> 10249 T1828 oasc.RequestHandlers.initHandlersFromConfig created tvrh: org.apache.solr.handler.component.SearchHandler
[junit4:junit4]   2> 10250 T1828 oasc.RequestHandlers.initHandlersFromConfig created /mlt: solr.MoreLikeThisHandler
[junit4:junit4]   2> 10251 T1828 oasc.RequestHandlers.initHandlersFromConfig created /debug/dump: solr.DumpRequestHandler
[junit4:junit4]   2> 10254 T1828 oashl.XMLLoader.init xsltCacheLifetimeSeconds=60
[junit4:junit4]   2> 10259 T1828 oasc.SolrCore.initDeprecatedSupport WARNING solrconfig.xml uses deprecated <admin/gettableFiles>, Please update your config to use the ShowFileRequestHandler.
[junit4:junit4]   2> 10260 T1828 oasc.SolrCore.initDeprecatedSupport WARNING adding ShowFileRequestHandler with hidden files: [SCHEMA.XML, OLD_SYNONYMS.TXT, STOPWORDS.TXT, PROTWORDS.TXT, OPEN-EXCHANGE-RATES.JSON, SYNONYMS.TXT, CURRENCY.XML, MAPPING-ISOLATIN1ACCENT.TXT]
[junit4:junit4]   2> 10264 T1828 oass.SolrIndexSearcher.<init> Opening Searcher@d7e786a main
[junit4:junit4]   2> 10265 T1828 oasu.CommitTracker.<init> Hard AutoCommit: disabled
[junit4:junit4]   2> 10265 T1828 oasu.CommitTracker.<init> Soft AutoCommit: disabled
[junit4:junit4]   2> 10266 T1828 oashc.SpellCheckComponent.inform Initializing spell checkers
[junit4:junit4]   2> 10273 T1828 oass.DirectSolrSpellChecker.init init: {name=direct,classname=DirectSolrSpellChecker,field=lowerfilt,minQueryLength=3}
[junit4:junit4]   2> 10324 T1903 oasc.SolrCore.registerSearcher [collection1] Registered new searcher Searcher@d7e786a main{StandardDirectoryReader(segments_1:1)}
[junit4:junit4]   2> 10443 T1849 oascc.ZkStateReader.updateClusterState Updating cloud state from ZooKeeper... 
[junit4:junit4]   2> 10456 T1902 oascc.ZkStateReader$2.process A cluster state change has occurred - updating...
[junit4:junit4]   2> 10456 T1862 oascc.ZkStateReader$2.process A cluster state change has occurred - updating...
[junit4:junit4]   2> 10456 T1888 oascc.ZkStateReader$2.process A cluster state change has occurred - updating...
[junit4:junit4]   2> 10456 T1874 oascc.ZkStateReader$2.process A cluster state change has occurred - updating...
[junit4:junit4]   2> 10456 T1848 oascc.ZkStateReader$2.process A cluster state change has occurred - updating...
[junit4:junit4]   2> 10832 T1828 oasc.CoreContainer.register registering core: collection1
[junit4:junit4]   2> 10832 T1828 oasc.ZkController.register Register shard - core:collection1 address:http://127.0.0.1:57822/solr shardId:shard1
[junit4:junit4]   2> 10840 T1828 oasc.ZkController.register We are http://127.0.0.1:57822/solr/collection1/ and leader is http://127.0.0.1:57811/solr/collection1/
[junit4:junit4]   2> 10840 T1828 oasc.ZkController.register No LogReplay needed for core=collection1 baseURL=http://127.0.0.1:57822/solr
[junit4:junit4]   2> 10841 T1828 oasc.ZkController.checkRecovery Core needs to recover:collection1
[junit4:junit4]   2> 10841 T1828 oasu.DefaultSolrCoreState.doRecovery Running recovery - first canceling any ongoing recovery
[junit4:junit4]   2> ASYNC  NEW_CORE C120 name=collection1 org.apache.solr.core.SolrCore@537b7a65 url=http://127.0.0.1:57822/solr/collection1 node=127.0.0.1:57822_solr
[junit4:junit4]   2> 10842 T1904 C120 P57822 oasc.RecoveryStrategy.run Starting recovery process.  core=collection1 recoveringAfterStartup=true
[junit4:junit4]   2> 10843 T1904 C120 P57822 oasc.RecoveryStrategy.doRecovery ###### startupVersions=[]
[junit4:junit4]   2> 10842 T1828 oascc.ZkStateReader.updateClusterState Updating cloud state from ZooKeeper... 
[junit4:junit4]   2> 10844 T1904 C120 P57822 oasc.RecoveryStrategy.doRecovery Attempting to PeerSync from http://127.0.0.1:57811/solr/collection1/ core=collection1 - recoveringAfterStartup=true
[junit4:junit4]   2> 10844 T1904 C120 P57822 oasu.PeerSync.sync PeerSync: core=collection1 url=http://127.0.0.1:57822/solr START replicas=[http://127.0.0.1:57811/solr/collection1/] nUpdates=100
[junit4:junit4]   2> 10844 T1828 oass.SolrDispatchFilter.init user.dir=/usr/home/hudson/hudson-slave/workspace/Lucene-Solr-Tests-4.x-Java6/solr/build/solr-core/test/J1
[junit4:junit4]   2> 10844 T1904 C120 P57822 oasu.PeerSync.sync WARNING no frame of reference to tell of we've missed updates
[junit4:junit4]   2> 10845 T1904 C120 P57822 oasc.RecoveryStrategy.doRecovery PeerSync Recovery was not successful - trying replication. core=collection1
[junit4:junit4]   2> 10844 T1828 oass.SolrDispatchFilter.init SolrDispatchFilter.init() done
[junit4:junit4]   2> 10845 T1904 C120 P57822 oasc.RecoveryStrategy.doRecovery Starting Replication Recovery. core=collection1
[junit4:junit4]   2> 10845 T1904 C120 P57822 oascsi.HttpClientUtil.createClient Creating new http client, config:maxConnections=128&maxConnectionsPerHost=32&followRedirects=false
[junit4:junit4]   2> 10845 T1828 oascsi.HttpClientUtil.createClient Creating new http client, config:maxConnections=128&maxConnectionsPerHost=32&followRedirects=false
[junit4:junit4]   2> 10846 T1854 C118 P57811 REQ /get {distrib=false&qt=/get&wt=javabin&version=2&getVersions=100} status=0 QTime=0 
[junit4:junit4]   2> 10859 T1828 oaz.ZooKeeper.<init> Initiating client connection, connectString=127.0.0.1:57805/solr sessionTimeout=10000 watcher=org.apache.solr.common.cloud.ConnectionManager@16ae126
[junit4:junit4]   2> 10859 T1906 oaz.ClientCnxn$SendThread.startConnect Opening socket connection to server /127.0.0.1:57805
[junit4:junit4]   2> 10859 T1828 oascc.ConnectionManager.waitForConnected Waiting for client to connect to ZooKeeper
[junit4:junit4]   2> 10860 T1906 oaz.ClientCnxn$SendThread.primeConnection Socket connection established to localhost/127.0.0.1:57805, initiating session
[junit4:junit4]   2> 10860 T1830 oazs.NIOServerCnxn$Factory.run Accepted socket connection from /140.211.11.196:57830
[junit4:junit4]   2> 10861 T1830 oazs.NIOServerCnxn.readConnectRequest Client attempting to establish new session at /140.211.11.196:57830
[junit4:junit4]   2> 10862 T1832 oazs.NIOServerCnxn.finishSessionInit Established session 0x139edb0254d0007 with negotiated timeout 10000 for client /140.211.11.196:57830
[junit4:junit4]   2> 10862 T1906 oaz.ClientCnxn$SendThread.readConnectResult Session establishment complete on server localhost/127.0.0.1:57805, sessionid = 0x139edb0254d0007, negotiated timeout = 10000
[junit4:junit4]   2> 10862 T1907 oascc.ConnectionManager.process Watcher org.apache.solr.common.cloud.ConnectionManager@16ae126 name:ZooKeeperConnection Watcher:127.0.0.1:57805/solr got event WatchedEvent state:SyncConnected type:None path:null path:null type:None
[junit4:junit4]   2> 10862 T1828 oascc.ConnectionManager.waitForConnected Client is connected to ZooKeeper
[junit4:junit4]   2> 10863 T1828 oascc.ZkStateReader.createClusterStateWatchersAndUpdate Updating cluster state from ZooKeeper... 
[junit4:junit4]   2> 10865 T1828 oasc.ChaosMonkey.monkeyLog monkey: init - expire sessions:true cause connection loss:true
[junit4:junit4]   2> 10865 T1828 oascsi.HttpClientUtil.createClient Creating new http client, config:
[junit4:junit4]   2> 10874 T1828 oascc.ZkStateReader.updateClusterState Updating cloud state from ZooKeeper... 
[junit4:junit4]   2> 10875 T1828 oasc.AbstractFullDistribZkTestBase.waitForThingsToLevelOut Wait for recoveries to finish - wait 15 for each attempt
[junit4:junit4]   2> 10875 T1828 oasc.AbstractDistribZkTestBase.waitForRecoveriesToFinish Wait for recoveries to finish - collection: collection1 failOnTimeout:true timeout (sec):15
[junit4:junit4]   2> 10876 T1828 oascc.ZkStateReader.updateClusterState Updating cloud state from ZooKeeper... 
[junit4:junit4]   2> 10960 T1849 oascc.ZkStateReader.updateClusterState Updating cloud state from ZooKeeper... 
[junit4:junit4]   2> 10973 T1848 oascc.ZkStateReader$2.process A cluster state change has occurred - updating...
[junit4:junit4]   2> 10973 T1902 oascc.ZkStateReader$2.process A cluster state change has occurred - updating...
[junit4:junit4]   2> 10973 T1907 oascc.ZkStateReader$2.process A cluster state change has occurred - updating...
[junit4:junit4]   2> 10973 T1888 oascc.ZkStateReader$2.process A cluster state change has occurred - updating...
[junit4:junit4]   2> 10973 T1874 oascc.ZkStateReader$2.process A cluster state change has occurred - updating...
[junit4:junit4]   2> 10973 T1862 oascc.ZkStateReader$2.process A cluster state change has occurred - updating...
[junit4:junit4]   2> 11878 T1828 oascc.ZkStateReader.updateClusterState Updating cloud state from ZooKeeper... 
[junit4:junit4]   2>  C119_STATE=coll:collection1 core:collection1 props:{shard=shard1, roles=null, state=recovering, core=collection1, collection=collection1, node_name=127.0.0.1:57819_solr, base_url=http://127.0.0.1:57819/solr}
[junit4:junit4]   2> 12000 T1890 C119 P57819 oasc.RecoveryStrategy.doRecovery Begin buffering updates. core=collection1
[junit4:junit4]   2> 12000 T1890 C119 P57819 oasu.UpdateLog.bufferUpdates Starting to buffer updates. FSUpdateLog{state=ACTIVE, tlog=null}
[junit4:junit4]   2> 12000 T1890 C119 P57819 oasc.RecoveryStrategy.replicate Attempting to replicate from http://127.0.0.1:57811/solr/collection1/. core=collection1
[junit4:junit4]   2> 12000 T1890 C119 P57819 oascsi.HttpClientUtil.createClient Creating new http client, config:maxConnections=128&maxConnectionsPerHost=32&followRedirects=false
[junit4:junit4]   2> 12010 T1860 C118 P57811 oasu.DirectUpdateHandler2.commit start commit{flags=0,_version_=0,optimize=false,openSearcher=true,waitSearcher=true,expungeDeletes=false,softCommit=false}
[junit4:junit4]   2> 12013 T1860 C118 P57811 oass.SolrIndexSearcher.<init> Opening Searcher@60a3df8d main
[junit4:junit4]   2> 12014 T1860 C118 P57811 oasu.DirectUpdateHandler2.commit end_commit_flush
[junit4:junit4]   2> 12015 T1863 oasc.SolrCore.registerSearcher [collection1] Registered new searcher Searcher@60a3df8d main{StandardDirectoryReader(segments_1:1)}
[junit4:junit4]   2> 12015 T1860 C118 P57811 /update {waitSearcher=true&commit=true&commit_end_point=true&wt=javabin&softCommit=false&version=2} {commit=} 0 5
[junit4:junit4]   2> 12016 T1890 C119 P57819 oash.ReplicationHandler.inform Commits will be reserved for  10000
[junit4:junit4]   2> 12016 T1890 C119 P57819 oash.SnapPuller.<init>  No value set for 'pollInterval'. Timer Task not started.
[junit4:junit4]   2> 12018 T1858 C118 P57811 REQ /replication {command=indexversion&wt=javabin&qt=/replication&version=2} status=0 QTime=0 
[junit4:junit4]   2> 12021 T1890 C119 P57819 oasc.SolrDeletionPolicy.onInit SolrDeletionPolicy.onInit: commits:num=1
[junit4:junit4]   2> 		commit{dir=NRTCachingDirectory(org.apache.lucene.store.NIOFSDirectory@/usr/home/hudson/hudson-slave/workspace/Lucene-Solr-Tests-4.x-Java6/solr/build/solr-core/test/J1/org.apache.solr.cloud.SyncSliceTest-1348312507720/jetty3/index lockFactory=org.apache.lucene.store.NativeFSLockFactory@7b0f9a5c; maxCacheMB=48.0 maxMergeSizeMB=4.0),segFN=segments_1,generation=1,filenames=[segments_1]
[junit4:junit4]   2> 12022 T1890 C119 P57819 oasc.SolrDeletionPolicy.updateCommits newest commit = 1
[junit4:junit4]   2> 12022 T1890 C119 P57819 oasu.DirectUpdateHandler2.commit start commit{flags=0,_version_=0,optimize=false,openSearcher=true,waitSearcher=true,expungeDeletes=false,softCommit=false}
[junit4:junit4]   2> 12025 T1890 C119 P57819 oasc.SolrDeletionPolicy.onCommit SolrDeletionPolicy.onCommit: commits:num=2
[junit4:junit4]   2> 		commit{dir=NRTCachingDirectory(org.apache.lucene.store.NIOFSDirectory@/usr/home/hudson/hudson-slave/workspace/Lucene-Solr-Tests-4.x-Java6/solr/build/solr-core/test/J1/org.apache.solr.cloud.SyncSliceTest-1348312507720/jetty3/index lockFactory=org.apache.lucene.store.NativeFSLockFactory@7b0f9a5c; maxCacheMB=48.0 maxMergeSizeMB=4.0),segFN=segments_1,generation=1,filenames=[segments_1]
[junit4:junit4]   2> 		commit{dir=NRTCachingDirectory(org.apache.lucene.store.NIOFSDirectory@/usr/home/hudson/hudson-slave/workspace/Lucene-Solr-Tests-4.x-Java6/solr/build/solr-core/test/J1/org.apache.solr.cloud.SyncSliceTest-1348312507720/jetty3/index lockFactory=org.apache.lucene.store.NativeFSLockFactory@7b0f9a5c; maxCacheMB=48.0 maxMergeSizeMB=4.0),segFN=segments_2,generation=2,filenames=[segments_2]
[junit4:junit4]   2> 12025 T1890 C119 P57819 oasc.SolrDeletionPolicy.updateCommits newest commit = 2
[junit4:junit4]   2> 12027 T1890 C119 P57819 oass.SolrIndexSearcher.<init> Opening Searcher@36613b57 main
[junit4:junit4]   2> 12027 T1890 C119 P57819 oasu.DirectUpdateHandler2.commit end_commit_flush
[junit4:junit4]   2> 12029 T1889 oasc.SolrCore.registerSearcher [collection1] Registered new searcher Searcher@36613b57 main{StandardDirectoryReader(segments_2:2)}
[junit4:junit4]   2> 12029 T1890 C119 P57819 oasc.RecoveryStrategy.replay No replay needed. core=collection1
[junit4:junit4]   2> 12029 T1890 C119 P57819 oasc.RecoveryStrategy.doRecovery Replication Recovery was successful - registering as Active. core=collection1
[junit4:junit4]   2> 12036 T1890 C119 P57819 oasc.RecoveryStrategy.doRecovery Finished recovery process. core=collection1
[junit4:junit4]   2> 12481 T1849 oascc.ZkStateReader.updateClusterState Updating cloud state from ZooKeeper... 
[junit4:junit4]   2> 12546 T1862 oascc.ZkStateReader$2.process A cluster state change has occurred - updating...
[junit4:junit4]   2> 12546 T1874 oascc.ZkStateReader$2.process A cluster state change has occurred - updating...
[junit4:junit4]   2> 12546 T1888 oascc.ZkStateReader$2.process A cluster state change has occurred - updating...
[junit4:junit4]   2> 12546 T1907 oascc.ZkStateReader$2.process A cluster state change has occurred - updating...
[junit4:junit4]   2> 12546 T1902 oascc.ZkStateReader$2.process A cluster state change has occurred - updating...
[junit4:junit4]   2> 12546 T1848 oascc.ZkStateReader$2.process A cluster state change has occurred - updating...
[junit4:junit4]   2> 12880 T1828 oascc.ZkStateReader.updateClusterState Updating cloud state from ZooKeeper... 
[junit4:junit4]   2>  C120_STATE=coll:collection1 core:collection1 props:{shard=shard1, roles=null, state=recovering, core=collection1, collection=collection1, node_name=127.0.0.1:57822_solr, base_url=http://127.0.0.1:57822/solr}
[junit4:junit4]   2> 13861 T1904 C120 P57822 oasc.RecoveryStrategy.doRecovery Begin buffering updates. core=collection1
[junit4:junit4]   2> 13861 T1904 C120 P57822 oasu.UpdateLog.bufferUpdates Starting to buffer updates. FSUpdateLog{state=ACTIVE, tlog=null}
[junit4:junit4]   2> 13861 T1904 C120 P57822 oasc.RecoveryStrategy.replicate Attempting to replicate from http://127.0.0.1:57811/solr/collection1/. core=collection1
[junit4:junit4]   2> 13861 T1904 C120 P57822 oascsi.HttpClientUtil.createClient Creating new http client, config:maxConnections=128&maxConnectionsPerHost=32&followRedirects=false
[junit4:junit4]   2> 13876 T1855 C118 P57811 oasu.DirectUpdateHandler2.commit start commit{flags=0,_version_=0,optimize=false,openSearcher=true,waitSearcher=true,expungeDeletes=false,softCommit=false}
[junit4:junit4]   2> 13879 T1855 C118 P57811 oass.SolrIndexSearcher.<init> Opening Searcher@3c70a074 main
[junit4:junit4]   2> 13880 T1855 C118 P57811 oasu.DirectUpdateHandler2.commit end_commit_flush
[junit4:junit4]   2> 13881 T1863 oasc.SolrCore.registerSearcher [collection1] Registered new searcher Searcher@3c70a074 main{StandardDirectoryReader(segments_1:1)}
[junit4:junit4]   2> 13881 T1855 C118 P57811 /update {waitSearcher=true&commit=true&commit_end_point=true&wt=javabin&softCommit=false&version=2} {commit=} 0 5
[junit4:junit4]   2> 13882 T1904 C120 P57822 oash.ReplicationHandler.inform Commits will be reserved for  10000
[junit4:junit4]   2> 13882 T1904 C120 P57822 oash.SnapPuller.<init>  No value set for 'pollInterval'. Timer Task not started.
[junit4:junit4]   2> 13882 T1828 oascc.ZkStateReader.updateClusterState Updating cloud state from ZooKeeper... 
[junit4:junit4]   2> 13884 T1858 C118 P57811 REQ /replication {command=indexversion&wt=javabin&qt=/replication&version=2} status=0 QTime=0 
[junit4:junit4]   2> 13888 T1904 C120 P57822 oasc.SolrDeletionPolicy.onInit SolrDeletionPolicy.onInit: commits:num=1
[junit4:junit4]   2> 		commit{dir=NRTCachingDirectory(org.apache.lucene.store.NIOFSDirectory@/usr/home/hudson/hudson-slave/workspace/Lucene-Solr-Tests-4.x-Java6/solr/build/solr-core/test/J1/org.apache.solr.cloud.SyncSliceTest-1348312507720/jetty4/index lockFactory=org.apache.lucene.store.NativeFSLockFactory@db1d892; maxCacheMB=48.0 maxMergeSizeMB=4.0),segFN=segments_1,generation=1,filenames=[segments_1]
[junit4:junit4]   2> 13889 T1904 C120 P57822 oasc.SolrDeletionPolicy.updateCommits newest commit = 1
[junit4:junit4]   2> 13890 T1904 C120 P57822 oasu.DirectUpdateHandler2.commit start commit{flags=0,_version_=0,optimize=false,openSearcher=true,waitSearcher=true,expungeDeletes=false,softCommit=false}
[junit4:junit4]   2> 13895 T1904 C120 P57822 oasc.SolrDeletionPolicy.onCommit SolrDeletionPolicy.onCommit: commits:num=2
[junit4:junit4]   2> 		commit{dir=NRTCachingDirectory(org.apache.lucene.store.NIOFSDirectory@/usr/home/hudson/hudson-slave/workspace/Lucene-Solr-Tests-4.x-Java6/solr/build/solr-core/test/J1/org.apache.solr.cloud.SyncSliceTest-1348312507720/jetty4/index lockFactory=org.apache.lucene.store.NativeFSLockFactory@db1d892; maxCacheMB=48.0 maxMergeSizeMB=4.0),segFN=segments_1,generation=1,filenames=[segments_1]
[junit4:junit4]   2> 		commit{dir=NRTCachingDirectory(org.apache.lucene.store.NIOFSDirectory@/usr/home/hudson/hudson-slave/workspace/Lucene-Solr-Tests-4.x-Java6/solr/build/solr-core/test/J1/org.apache.solr.cloud.SyncSliceTest-1348312507720/jetty4/index lockFactory=org.apache.lucene.store.NativeFSLockFactory@db1d892; maxCacheMB=48.0 maxMergeSizeMB=4.0),segFN=segments_2,generation=2,filenames=[segments_2]
[junit4:junit4]   2> 13895 T1904 C120 P57822 oasc.SolrDeletionPolicy.updateCommits newest commit = 2
[junit4:junit4]   2> 13898 T1904 C120 P57822 oass.SolrIndexSearcher.<init> Opening Searcher@47dd254e main
[junit4:junit4]   2> 13898 T1904 C120 P57822 oasu.DirectUpdateHandler2.commit end_commit_flush
[junit4:junit4]   2> 13899 T1903 oasc.SolrCore.registerSearcher [collection1] Registered new searcher Searcher@47dd254e main{StandardDirectoryReader(segments_2:2)}
[junit4:junit4]   2> 13900 T1904 C120 P57822 oasc.RecoveryStrategy.replay No replay needed. core=collection1
[junit4:junit4]   2> 13900 T1904 C120 P57822 oasc.RecoveryStrategy.doRecovery Replication Recovery was successful - registering as Active. core=collection1
[junit4:junit4]   2> 13901 T1904 C120 P57822 oasc.RecoveryStrategy.doRecovery Finished recovery process. core=collection1
[junit4:junit4]   2> 14054 T1849 oascc.ZkStateReader.updateClusterState Updating cloud state from ZooKeeper... 
[junit4:junit4]   2> 14069 T1848 oascc.ZkStateReader$2.process A cluster state change has occurred - updating...
[junit4:junit4]   2> 14069 T1907 oascc.ZkStateReader$2.process A cluster state change has occurred - updating...
[junit4:junit4]   2> 14069 T1862 oascc.ZkStateReader$2.process A cluster state change has occurred - updating...
[junit4:junit4]   2> 14069 T1874 oascc.ZkStateReader$2.process A cluster state change has occurred - updating...
[junit4:junit4]   2> 14070 T1888 oascc.ZkStateReader$2.process A cluster state change has occurred - updating...
[junit4:junit4]   2> 14070 T1902 oascc.ZkStateReader$2.process A cluster state change has occurred - updating...
[junit4:junit4]   2> 14884 T1828 oascc.ZkStateReader.updateClusterState Updating cloud state from ZooKeeper... 
[junit4:junit4]   2> ASYNC  NEW_CORE C121 name=collection1 org.apache.solr.core.SolrCore@78a939c0 url=http://127.0.0.1:57809/solr/collection1 node=127.0.0.1:57809_solr
[junit4:junit4]   2> 14892 T1840 C121 P57809 oasu.DirectUpdateHandler2.commit start commit{flags=0,_version_=0,optimize=false,openSearcher=true,waitSearcher=true,expungeDeletes=false,softCommit=false}
[junit4:junit4]   2> 14896 T1840 C121 P57809 oasc.SolrDeletionPolicy.onInit SolrDeletionPolicy.onInit: commits:num=1
[junit4:junit4]   2> 		commit{dir=NRTCachingDirectory(org.apache.lucene.store.NIOFSDirectory@/usr/home/hudson/hudson-slave/workspace/Lucene-Solr-Tests-4.x-Java6/solr/build/solr-core/test/J1/org.apache.solr.cloud.SyncSliceTest-1348312507720/control/data/index lockFactory=org.apache.lucene.store.NativeFSLockFactory@468fd26e; maxCacheMB=48.0 maxMergeSizeMB=4.0),segFN=segments_1,generation=1,filenames=[segments_1]
[junit4:junit4]   2> 14896 T1840 C121 P57809 oasc.SolrDeletionPolicy.updateCommits newest commit = 1
[junit4:junit4]   2> 14897 T1840 C121 P57809 oass.SolrIndexSearcher.<init> Opening Searcher@7d3d1ee6 main
[junit4:junit4]   2> 14898 T1840 C121 P57809 oasu.DirectUpdateHandler2.commit end_commit_flush
[junit4:junit4]   2> 14899 T1851 oasc.SolrCore.registerSearcher [collection1] Registered new searcher Searcher@7d3d1ee6 main{StandardDirectoryReader(segments_1:1)}
[junit4:junit4]   2> 14899 T1840 C121 P57809 /update {waitSearcher=true&wt=javabin&commit=true&softCommit=false&version=2} {commit=} 0 7
[junit4:junit4]   2> 14900 T1828 oaz.ZooKeeper.<init> Initiating client connection, connectString=127.0.0.1:57805/solr sessionTimeout=10000 watcher=org.apache.solr.common.cloud.ConnectionManager@447723e
[junit4:junit4]   2> 14901 T1908 oaz.ClientCnxn$SendThread.startConnect Opening socket connection to server /127.0.0.1:57805
[junit4:junit4]   2> 14901 T1828 oascc.ConnectionManager.waitForConnected Waiting for client to connect to ZooKeeper
[junit4:junit4]   2> 14902 T1908 oaz.ClientCnxn$SendThread.primeConnection Socket connection established to localhost/127.0.0.1:57805, initiating session
[junit4:junit4]   2> 14902 T1830 oazs.NIOServerCnxn$Factory.run Accepted socket connection from /140.211.11.196:57836
[junit4:junit4]   2> 14902 T1830 oazs.NIOServerCnxn.readConnectRequest Client attempting to establish new session at /140.211.11.196:57836
[junit4:junit4]   2> 14904 T1832 oazs.NIOServerCnxn.finishSessionInit Established session 0x139edb0254d0008 with negotiated timeout 10000 for client /140.211.11.196:57836
[junit4:junit4]   2> 14904 T1908 oaz.ClientCnxn$SendThread.readConnectResult Session establishment complete on server localhost/127.0.0.1:57805, sessionid = 0x139edb0254d0008, negotiated timeout = 10000
[junit4:junit4]   2> 14904 T1909 oascc.ConnectionManager.process Watcher org.apache.solr.common.cloud.ConnectionManager@447723e name:ZooKeeperConnection Watcher:127.0.0.1:57805/solr got event WatchedEvent state:SyncConnected type:None path:null path:null type:None
[junit4:junit4]   2> 14904 T1828 oascc.ConnectionManager.waitForConnected Client is connected to ZooKeeper
[junit4:junit4]   2> 14905 T1828 oascc.ZkStateReader.createClusterStateWatchersAndUpdate Updating cluster state from ZooKeeper... 
[junit4:junit4]   2> 14907 T1857 C118 P57811 oasu.DirectUpdateHandler2.commit start commit{flags=0,_version_=0,optimize=false,openSearcher=true,waitSearcher=true,expungeDeletes=false,softCommit=false}
[junit4:junit4]   2> 14909 T1857 C118 P57811 oass.SolrIndexSearcher.<init> Opening Searcher@d2f1d0b main
[junit4:junit4]   2> 14910 T1857 C118 P57811 oasu.DirectUpdateHandler2.commit end_commit_flush
[junit4:junit4]   2> 14911 T1863 oasc.SolrCore.registerSearcher [collection1] Registered new searcher Searcher@d2f1d0b main{StandardDirectoryReader(segments_1:1)}
[junit4:junit4]   2> 14911 T1857 C118 P57811 oasu.SolrCmdDistributor.distribCommit Distrib commit to:[StdNode: http://127.0.0.1:57815/solr/collection1/, StdNode: http://127.0.0.1:57819/solr/collection1/, StdNode: http://127.0.0.1:57822/solr/collection1/]
[junit4:junit4]   2>  C119_STATE=coll:collection1 core:collection1 props:{shard=shard1, roles=null, state=active, core=collection1, collection=collection1, node_name=127.0.0.1:57819_solr, base_url=http://127.0.0.1:57819/solr}
[junit4:junit4]   2> 14916 T1880 C119 P57819 oasu.DirectUpdateHandler2.commit start commit{flags=0,_version_=0,optimize=false,openSearcher=true,waitSearcher=true,expungeDeletes=false,softCommit=false}
[junit4:junit4]   2>  C117_STATE=coll:collection1 core:collection1 props:{shard=shard1, roles=null, state=active, core=collection1, collection=collection1, node_name=127.0.0.1:57815_solr, base_url=http://127.0.0.1:57815/solr}
[junit4:junit4]   2> 14918 T1866 C117 P57815 oasu.DirectUpdateHandler2.commit start commit{flags=0,_version_=0,optimize=false,openSearcher=true,waitSearcher=true,expungeDeletes=false,softCommit=false}
[junit4:junit4]   2>  C120_STATE=coll:collection1 core:collection1 props:{shard=shard1, roles=null, state=active, core=collection1, collection=collection1, node_name=127.0.0.1:57822_solr, base_url=http://127.0.0.1:57822/solr}
[junit4:junit4]   2> 14919 T1894 C120 P57822 oasu.DirectUpdateHandler2.commit start commit{flags=0,_version_=0,optimize=false,openSearcher=true,waitSearcher=true,expungeDeletes=false,softCommit=false}
[junit4:junit4]   2> 14920 T1880 C119 P57819 oass.SolrIndexSearcher.<init> Opening Searcher@6b51f932 main
[junit4:junit4]   2> 14920 T1880 C119 P57819 oasu.DirectUpdateHandler2.commit end_commit_flush
[junit4:junit4]   2> 14921 T1894 C120 P57822 oass.SolrIndexSearcher.<init> Opening Searcher@5bad1e12 main
[junit4:junit4]   2> 14922 T1889 oasc.SolrCore.registerSearcher [collection1] Registered new searcher Searcher@6b51f932 main{StandardDirectoryReader(segments_2:2)}
[junit4:junit4]   2> 14922 T1894 C120 P57822 oasu.DirectUpdateHandler2.commit end_commit_flush
[junit4:junit4]   2> 14922 T1866 C117 P57815 oass.SolrIndexSearcher.<init> Opening Searcher@55e47659 main
[junit4:junit4]   2> 14922 T1880 C119 P57819 /update {waitSearcher=true&commit=true&wt=javabin&commit_end_point=true&expungeDeletes=false&softCommit=false&version=2} {commit=} 0 6
[junit4:junit4]   2> 14922 T1866 C117 P57815 oasu.DirectUpdateHandler2.commit end_commit_flush
[junit4:junit4]   2> 14923 T1903 oasc.SolrCore.registerSearcher [collection1] Registered new searcher Searcher@5bad1e12 main{StandardDirectoryReader(segments_2:2)}
[junit4:junit4]   2> 14923 T1875 oasc.SolrCore.registerSearcher [collection1] Registered new searcher Searcher@55e47659 main{StandardDirectoryReader(segments_2:2)}
[junit4:junit4]   2> 14923 T1894 C120 P57822 /update {waitSearcher=true&commit=true&wt=javabin&commit_end_point=true&expungeDeletes=false&softCommit=false&version=2} {commit=} 0 4
[junit4:junit4]   2> 14924 T1866 C117 P57815 /update {waitSearcher=true&commit=true&wt=javabin&commit_end_point=true&expungeDeletes=false&softCommit=false&version=2} {commit=} 0 6
[junit4:junit4]   2> 14924 T1857 C118 P57811 /update {waitSearcher=true&wt=javabin&commit=true&softCommit=false&version=2} {commit=} 0 17
[junit4:junit4]   2> 14925 T1828 oascc.ZkStateReader.updateClusterState Updating cloud state from ZooKeeper... 
[junit4:junit4]   2> 14927 T1856 C118 P57811 REQ /select {distrib=false&wt=javabin&q=*:*&version=2} hits=0 status=0 QTime=0 
[junit4:junit4]   2> 14928 T1867 C117 P57815 REQ /select {distrib=false&wt=javabin&q=*:*&version=2} hits=0 status=0 QTime=0 
[junit4:junit4]   2> 14930 T1881 C119 P57819 REQ /select {distrib=false&wt=javabin&q=*:*&version=2} hits=0 status=0 QTime=0 
[junit4:junit4]   2> 14931 T1895 C120 P57822 REQ /select {distrib=false&wt=javabin&q=*:*&version=2} hits=0 status=0 QTime=0 
[junit4:junit4]   2> 16938 T1840 C121 P57809 oass.SolrIndexSearcher.<init> Opening Searcher@67dd7266 realtime
[junit4:junit4]   2> 16939 T1840 C121 P57809 /update {wt=javabin&version=2} {deleteByQuery=*:* (-1413808153827475456)} 0 4
[junit4:junit4]   2> 16943 T1857 C118 P57811 oass.SolrIndexSearcher.<init> Opening Searcher@2515262 realtime
[junit4:junit4]   2> 16947 T1880 C119 P57819 oass.SolrIndexSearcher.<init> Opening Searcher@1d2dfdfc realtime
[junit4:junit4]   2> 16947 T1866 C117 P57815 oass.SolrIndexSearcher.<init> Opening Searcher@7855c84f realtime
[junit4:junit4]   2> 16947 T1880 C119 P57819 REQ /update {update.distrib=FROMLEADER&_version_=-1413808153834815488&update.from=http://127.0.0.1:57811/solr/collection1/&wt=javabin&version=2} status=0 QTime=1 
[junit4:junit4]   2> 16947 T1894 C120 P57822 oass.SolrIndexSearcher.<init> Opening Searcher@2a01983d realtime
[junit4:junit4]   2> 16948 T1866 C117 P57815 REQ /update {update.distrib=FROMLEADER&_version_=-1413808153834815488&update.from=http://127.0.0.1:57811/solr/collection1/&wt=javabin&version=2} status=0 QTime=2 
[junit4:junit4]   2> 16948 T1894 C120 P57822 REQ /update {update.distrib=FROMLEADER&_version_=-1413808153834815488&update.from=http://127.0.0.1:57811/solr/collection1/&wt=javabin&version=2} status=0 QTime=2 
[junit4:junit4]   2> 16949 T1857 C118 P57811 /update {wt=javabin&version=2} {deleteByQuery=*:* (-1413808153834815488)} 0 7
[junit4:junit4]   2> 16955 T1840 C121 P57809 /update {wt=javabin&version=2} {add=[0 (1413808153845301248)]} 0 4
[junit4:junit4]   2> 16971 T1894 C120 P57822 REQ /update {distrib.from=http://127.0.0.1:57811/solr/collection1/&update.distrib=FROMLEADER&wt=javabin&version=2} status=0 QTime=6 
[junit4:junit4]   2> 16971 T1866 C117 P57815 REQ /update {distrib.from=http://127.0.0.1:57811/solr/collection1/&update.distrib=FROMLEADER&wt=javabin&version=2} status=0 QTime=6 
[junit4:junit4]   2> 16972 T1880 C119 P57819 REQ /update {distrib.from=http://127.0.0.1:57811/solr/collection1/&update.distrib=FROMLEADER&wt=javabin&version=2} status=0 QTime=6 
[junit4:junit4]   2> 16973 T1857 C118 P57811 /update {wt=javabin&version=2} {add=[0 (1413808153852641280)]} 0 14
[junit4:junit4]   2> 16978 T1840 C121 P57809 /update {wt=javabin&version=2} {add=[1 (1413808153871515648)]} 0 2
[junit4:junit4]   2> 16988 T1866 C117 P57815 REQ /update {distrib.from=http://127.0.0.1:57811/solr/collection1/&update.distrib=FROMLEADER&wt=javabin&version=2} status=0 QTime=3 
[junit4:junit4]   2> 16988 T1894 C120 P57822 REQ /update {distrib.from=http://127.0.0.1:57811/solr/collection1/&update.distrib=FROMLEADER&wt=javabin&version=2} status=0 QTime=3 
[junit4:junit4]   2> 16988 T1880 C119 P57819 REQ /update {distrib.from=http://127.0.0.1:57811/solr/collection1/&update.distrib=FROMLEADER&wt=javabin&version=2} status=0 QTime=2 
[junit4:junit4]   2> 16989 T1857 C118 P57811 /update {wt=javabin&version=2} {add=[1 (1413808153876758528)]} 0 8
[junit4:junit4]   2> 16994 T1840 C121 P57809 /update {wt=javabin&version=2} {add=[2 (1413808153888292864)]} 0 1
[junit4:junit4]   2> 17003 T1894 C120 P57822 REQ /update {distrib.from=http://127.0.0.1:57811/solr/collection1/&update.distrib=FROMLEADER&test.distrib.skip.servers=http://127.0.0.1:57815/solr/collection1/&wt=javabin&version=2} status=0 QTime=2 
[junit4:junit4]   2> 17004 T1880 C119 P57819 REQ /update {distrib.from=http://127.0.0.1:57811/solr/collection1/&update.distrib=FROMLEADER&test.distrib.skip.servers=http://127.0.0.1:57815/solr/collection1/&wt=javabin&version=2} status=0 QTime=3 
[junit4:junit4]   2> 17005 T1857 C118 P57811 /update {test.distrib.skip.servers=http://127.0.0.1:57815/solr/collection1/&wt=javabin&version=2} {add=[2 (1413808153893535744)]} 0 8
[junit4:junit4]   2> 17011 T1840 C121 P57809 /update {wt=javabin&version=2} {add=[3 (1413808153906118656)]} 0 2
[junit4:junit4]   2> 17022 T1894 C120 P57822 REQ /update {distrib.from=http://127.0.0.1:57811/solr/collection1/&update.distrib=FROMLEADER&test.distrib.skip.servers=http://127.0.0.1:57815/solr/collection1/&test.distrib.skip.servers=http://127.0.0.1:57819/solr/collection1/&wt=javabin&version=2} status=0 QTime=2 
[junit4:junit4]   2> 17024 T1857 C118 P57811 /update {test.distrib.skip.servers=http://127.0.0.1:57815/solr/collection1/&test.distrib.skip.servers=http://127.0.0.1:57819/solr/collection1/&wt=javabin&version=2} {add=[3 (1413808153911361536)]} 0 10
[junit4:junit4]   2> 17027 T1840 C121 P57809 oasu.DirectUpdateHandler2.commit start commit{flags=0,_version_=0,optimize=false,openSearcher=true,waitSearcher=true,expungeDeletes=false,softCommit=false}
[junit4:junit4]   2> 17550 T1840 C121 P57809 oasc.SolrDeletionPolicy.onCommit SolrDeletionPolicy.onCommit: commits:num=2
[junit4:junit4]   2> 		commit{dir=NRTCachingDirectory(org.apache.lucene.store.NIOFSDirectory@/usr/home/hudson/hudson-slave/workspace/Lucene-Solr-Tests-4.x-Java6/solr/build/solr-core/test/J1/org.apache.solr.cloud.SyncSliceTest-1348312507720/control/data/index lockFactory=org.apache.lucene.store.NativeFSLockFactory@468fd26e; maxCacheMB=48.0 maxMergeSizeMB=4.0),segFN=segments_1,generation=1,filenames=[segments_1]
[junit4:junit4]   2> 		commit{dir=NRTCachingDirectory(org.apache.lucene.store.NIOFSDirectory@/usr/home/hudson/hudson-slave/workspace/Lucene-Solr-Tests-4.x-Java6/solr/build/solr-core/test/J1/org.apache.solr.cloud.SyncSliceTest-1348312507720/control/data/index lockFactory=org.apache.lucene.store.NativeFSLockFactory@468fd26e; maxCacheMB=48.0 maxMergeSizeMB=4.0),segFN=segments_2,generation=2,filenames=[_0_Asserting_0.tim, _0_Asserting_0.tip, _0_MockSep_0.pos, _0_MockVariableIntBlock_0.doc, _0_MockVariableIntBlock_0.skp, _0_Lucene40_0.prx, _0_Asserting_0.prx, _0_MockVariableIntBlock_0.pyl, _0_Lucene40_0.frq, _0_MockSep_0.skp, _0_MockVariableIntBlock_0.tib, _0_MockVariableIntBlock_0.pos, _0_MockSep_0.doc, _0.si, _0_MockVariableIntBlock_0.tii, _0_Lucene40_0.tim, _0.fnm, _0_nrm.cfs, _0_Lucene40_0.tip, _0_MockSep_0.tib, _0_Asserting_0.frq, _0_nrm.cfe, _0_MockVariableIntBlock_0.frq, segments_2, _0_MockSep_0.frq, _0.fdx, _0_MockSep_0.tii, _0_MockSep_0.pyl, _0.fdt]
[junit4:junit4]   2> 17551 T1840 C121 P57809 oasc.SolrDeletionPolicy.updateCommits newest commit = 2
[junit4:junit4]   2> 17576 T1840 C121 P57809 oass.SolrIndexSearcher.<init> Opening Searcher@445e7c24 main
[junit4:junit4]   2> 17578 T1840 C121 P57809 oasu.DirectUpdateHandler2.commit end_commit_flush
[junit4:junit4]   2> 17581 T1851 oasc.SolrCore.registerSearcher [collection1] Registered new searcher Searcher@445e7c24 main{StandardDirectoryReader(segments_2:3:nrt _0(4.0.0.2):C4)}
[junit4:junit4]   2> 17583 T1840 C121 P57809 /update {waitSearcher=true&wt=javabin&commit=true&softCommit=false&version=2} {commit=} 0 557
[junit4:junit4]   2> 17587 T1857 C118 P57811 oasu.DirectUpdateHandler2.commit start commit{flags=0,_version_=0,optimize=false,openSearcher=true,waitSearcher=true,expungeDeletes=false,softCommit=false}
[junit4:junit4]   2> 17711 T1857 C118 P57811 oasc.SolrDeletionPolicy.onCommit SolrDeletionPolicy.onCommit: commits:num=2
[junit4:junit4]   2> 		commit{dir=NRTCachingDirectory(org.apache.lucene.store.NIOFSDirectory@/usr/home/hudson/hudson-slave/workspace/Lucene-Solr-Tests-4.x-Java6/solr/build/solr-core/test/J1/org.apache.solr.cloud.SyncSliceTest-1348312507720/jetty1/index lockFactory=org.apache.lucene.store.NativeFSLockFactory@3bee56b5; maxCacheMB=48.0 maxMergeSizeMB=4.0),segFN=segments_1,generation=1,filenames=[segments_1]
[junit4:junit4]   2> 		commit{dir=NRTCachingDirectory(org.apache.lucene.store.NIOFSDirectory@/usr/home/hudson/hudson-slave/workspace/Lucene-Solr-Tests-4.x-Java6/solr/build/solr-core/test/J1/org.apache.solr.cloud.SyncSliceTest-1348312507720/jetty1/index lockFactory=org.apache.lucene.store.NativeFSLockFactory@3bee56b5; maxCacheMB=48.0 maxMergeSizeMB=4.0),segFN=segments_2,generation=2,filenames=[_0_Asserting_0.tim, _0_Asserting_0.tip, _0_MockSep_0.pos, _0_MockVariableIntBlock_0.doc, _0_MockVariableIntBlock_0.skp, _0_Lucene40_0.prx, _0_Asserting_0.prx, _0_MockVariableIntBlock_0.pyl, _0_Lucene40_0.frq, _0_MockSep_0.skp, _0_MockVariableIntBlock_0.tib, _0_MockVariableIntBlock_0.pos, _0_MockSep_0.doc, _0.si, _0_MockVariableIntBlock_0.tii, _0_Lucene40_0.tim, _0.fnm, _0_nrm.cfs, _0_Lucene40_0.tip, _0_MockSep_0.tib, _0_Asserting_0.frq, _0_nrm.cfe, _0_MockVariableIntBlock_0.frq, segments_2, _0_MockSep_0.frq, _0.fdx, _0_MockSep_0.tii, _0_MockSep_0.pyl, _0.fdt]
[junit4:junit4]   2> 17712 T1857 C118 P57811 oasc.SolrDeletionPolicy.updateCommits newest commit = 2
[junit4:junit4]   2> 17724 T1857 C118 P57811 oass.SolrIndexSearcher.<init> Opening Searcher@6bf1b693 main
[junit4:junit4]   2> 17725 T1857 C118 P57811 oasu.DirectUpdateHandler2.commit end_commit_flush
[junit4:junit4]   2> 17728 T1863 oasc.SolrCore.registerSearcher [collection1] Registered new searcher Searcher@6bf1b693 main{StandardDirectoryReader(segments_2:3:nrt _0(4.0.0.2):C4)}
[junit4:junit4]   2> 17729 T1857 C118 P57811 oasu.SolrCmdDistributor.distribCommit Distrib commit to:[StdNode: http://127.0.0.1:57815/solr/collection1/, StdNode: http://127.0.0.1:57819/solr/collection1/, StdNode: http://127.0.0.1:57822/solr/collection1/]
[junit4:junit4]   2> 17733 T1880 C119 P57819 oasu.DirectUpdateHandler2.commit start commit{flags=0,_version_=0,optimize=false,openSearcher=true,waitSearcher=true,expungeDeletes=false,softCommit=false}
[junit4:junit4]   2> 17733 T1894 C120 P57822 oasu.DirectUpdateHandler2.commit start commit{flags=0,_version_=0,optimize=false,openSearcher=true,waitSearcher=true,expungeDeletes=false,softCommit=false}
[junit4:junit4]   2> 17733 T1866 C117 P57815 oasu.DirectUpdateHandler2.commit start commit{flags=0,_version_=0,optimize=false,openSearcher=true,waitSearcher=true,expungeDeletes=false,softCommit=false}
[junit4:junit4]   2> 18002 T1880 C119 P57819 oasc.SolrDeletionPolicy.onCommit SolrDeletionPolicy.onCommit: commits:num=2
[junit4:junit4]   2> 		commit{dir=NRTCachingDirectory(org.apache.lucene.store.NIOFSDirectory@/usr/home/hudson/hudson-slave/workspace/Lucene-Solr-Tests-4.x-Java6/solr/build/solr-core/test/J1/org.apache.solr.cloud.SyncSliceTest-1348312507720/jetty3/index lockFactory=org.apache.lucene.store.NativeFSLockFactory@7b0f9a5c; maxCacheMB=48.0 maxMergeSizeMB=4.0),segFN=segments_2,generation=2,filenames=[segments_2]
[junit4:junit4]   2> 		commit{dir=NRTCachingDirectory(org.apache.lucene.store.NIOFSDirectory@/usr/home/hudson/hudson-slave/workspace/Lucene-Solr-Tests-4.x-Java6/solr/build/solr-core/test/J1/org.apache.solr.cloud.SyncSliceTest-1348312507720/jetty3/index lockFactory=org.apache.lucene.store.NativeFSLockFactory@7b0f9a5c; maxCacheMB=48.0 maxMergeSizeMB=4.0),segFN=segments_3,generation=3,filenames=[_0_Asserting_0.tim, _0_Asserting_0.tip, _0_MockSep_0.pos, _0_MockVariableIntBlock_0.doc, _0_MockVariableIntBlock_0.skp, _0_Lucene40_0.prx, _0_Asserting_0.prx, _0_MockVariableIntBlock_0.pyl, _0_Lucene40_0.frq, _0_MockSep_0.skp, _0_MockVariableIntBlock_0.tib, _0_MockVariableIntBlock_0.pos, _0_MockSep_0.doc, _0.si, _0_MockVariableIntBlock_0.tii, _0_Lucene40_0.tim, _0.fnm, _0_nrm.cfs, _0_Lucene40_0.tip, _0_MockSep_0.tib, _0_Asserting_0.frq, _0_nrm.cfe, _0_MockVariableIntBlock_0.frq, _0_MockSep_0.frq, _0.fdx, _0_MockSep_0.tii, _0_MockSep_0.pyl, _0.fdt, segments_3]
[junit4:junit4]   2> 18004 T1880 C119 P57819 oasc.SolrDeletionPolicy.updateCommits newest commit = 3
[junit4:junit4]   2> 18006 T1894 C120 P57822 oasc.SolrDeletionPolicy.onCommit SolrDeletionPolicy.onCommit: commits:num=2
[junit4:junit4]   2> 		commit{dir=NRTCachingDirectory(org.apache.lucene.store.NIOFSDirectory@/usr/home/hudson/hudson-slave/workspace/Lucene-Solr-Tests-4.x-Java6/solr/build/solr-core/test/J1/org.apache.solr.cloud.SyncSliceTest-1348312507720/jetty4/index lockFactory=org.apache.lucene.store.NativeFSLockFactory@db1d892; maxCacheMB=48.0 maxMergeSizeMB=4.0),segFN=segments_2,generation=2,filenames=[segments_2]
[junit4:junit4]   2> 		commit{dir=NRTCachingDirectory(org.apache.lucene.store.NIOFSDirectory@/usr/home/hudson/hudson-slave/workspace/Lucene-Solr-Tests-4.x-Java6/solr/build/solr-core/test/J1/org.apache.solr.cloud.SyncSliceTest-1348312507720/jetty4/index lockFactory=org.apache.lucene.store.NativeFSLockFactory@db1d892; maxCacheMB=48.0 maxMergeSizeMB=4.0),segFN=segments_3,generation=3,filenames=[_0_Asserting_0.tim, _0_Asserting_0.tip, _0_MockSep_0.pos, _0_MockVariableIntBlock_0.doc, _0_MockVariableIntBlock_0.skp, _0_Lucene40_0.prx, _0_Asserting_0.prx, _0_MockVariableIntBlock_0.pyl, _0_Lucene40_0.frq, _0_MockSep_0.skp, _0_MockVariableIntBlock_0.tib, _0_MockVariableIntBlock_0.pos, _0_MockSep_0.doc, _0.si, _0_MockVariableIntBlock_0.tii, _0_Lucene40_0.tim, _0.fnm, _0_nrm.cfs, _0_Lucene40_0.tip, _0_MockSep_0.tib, _0_Asserting_0.frq, _0_nrm.cfe, _0_MockVariableIntBlock_0.frq, _0_MockSep_0.frq, _0.fdx, _0_MockSep_0.tii, _0_MockSep_0.pyl, _0.fdt, segments_3]
[junit4:junit4]   2> 18008 T1866 C117 P57815 oasc.SolrDeletionPolicy.onCommit SolrDeletionPolicy.onCommit: commits:num=2
[junit4:junit4]   2> 		commit{dir=NRTCachingDirectory(org.apache.lucene.store.NIOFSDirectory@/usr/home/hudson/hudson-slave/workspace/Lucene-Solr-Tests-4.x-Java6/solr/build/solr-core/test/J1/org.apache.solr.cloud.SyncSliceTest-1348312507720/jetty2/index lockFactory=org.apache.lucene.store.NativeFSLockFactory@67f9f9bb; maxCacheMB=48.0 maxMergeSizeMB=4.0),segFN=segments_2,generation=2,filenames=[segments_2]
[junit4:junit4]   2> 		commit{dir=NRTCachingDirectory(org.apache.lucene.store.NIOFSDirectory@/usr/home/hudson/hudson-slave/workspace/Lucene-Solr-Tests-4.x-Java6/solr/build/solr-core/test/J1/org.apache.solr.cloud.SyncSliceTest-1348312507720/jetty2/index lockFactory=org.apache.lucene.store.NativeFSLockFactory@67f9f9bb; maxCacheMB=48.0 maxMergeSizeMB=4.0),segFN=segments_3,generation=3,filenames=[_0_Asserting_0.tim, _0_Asserting_0.tip, _0_MockSep_0.pos, _0_MockVariableIntBlock_0.doc, _0_MockVariableIntBlock_0.skp, _0_Lucene40_0.prx, _0_Asserting_0.prx, _0_MockVariableIntBlock_0.pyl, _0_Lucene40_0.frq, _0_MockSep_0.skp, _0_MockVariableIntBlock_0.tib, _0_MockVariableIntBlock_0.pos, _0_MockSep_0.doc, _0.si, _0_MockVariableIntBlock_0.tii, _0_Lucene40_0.tim, _0.fnm, _0_nrm.cfs, _0_Lucene40_0.tip, _0_MockSep_0.tib, _0_Asserting_0.frq, _0_nrm.cfe, _0_MockVariableIntBlock_0.frq, _0_MockSep_0.frq, _0.fdx, _0_MockSep_0.tii, _0_MockSep_0.pyl, _0.fdt, segments_3]
[junit4:junit4]   2> 18008 T1894 C120 P57822 oasc.SolrDeletionPolicy.updateCommits newest commit = 3
[junit4:junit4]   2> 18009 T1866 C117 P57815 oasc.SolrDeletionPolicy.updateCommits newest commit = 3
[junit4:junit4]   2> 18029 T1880 C119 P57819 oass.SolrIndexSearcher.<init> Opening Searcher@1423bfee main
[junit4:junit4]   2> 18033 T1880 C119 P57819 oasu.DirectUpdateHandler2.commit end_commit_flush
[junit4:junit4]   2> 18035 T1866 C117 P57815 oass.SolrIndexSearcher.<init> Opening Searcher@273881ae main
[junit4:junit4]   2> 18036 T1866 C117 P57815 oasu.DirectUpdateHandler2.commit end_commit_flush
[junit4:junit4]   2> 18036 T1875 oasc.JmxMonitoredMap.put WARNING Failed to register info bean: searcher javax.management.InstanceNotFoundException: solr/collection1:type=searcher,id=org.apache.solr.search.SolrIndexSearcher
[junit4:junit4]   2> 	at com.sun.jmx.interceptor.DefaultMBeanServerInterceptor.getMBean(DefaultMBeanServerInterceptor.java:1118)
[junit4:junit4]   2> 	at com.sun.jmx.interceptor.DefaultMBeanServerInterceptor.exclusiveUnregisterMBean(DefaultMBeanServerInterceptor.java:433)
[junit4:junit4]   2> 	at com.sun.jmx.interceptor.DefaultMBeanServerInterceptor.unregisterMBean(DefaultMBeanServerInterceptor.java:421)
[junit4:junit4]   2> 	at com.sun.jmx.mbeanserver.JmxMBeanServer.unregisterMBean(JmxMBeanServer.java:540)
[junit4:junit4]   2> 	at org.apache.solr.core.JmxMonitoredMap.put(JmxMonitoredMap.java:138)
[junit4:junit4]   2> 	at org.apache.solr.core.JmxMonitoredMap.put(JmxMonitoredMap.java:51)
[junit4:junit4]   2> 	at org.apache.solr.search.SolrIndexSearcher.register(SolrIndexSearcher.java:242)
[junit4:junit4]   2> 	at org.apache.solr.core.SolrCore.registerSearcher(SolrCore.java:1642)
[junit4:junit4]   2> 	at org.apache.solr.core.SolrCore.access$000(SolrCore.java:121)
[junit4:junit4]   2> 	at org.apache.solr.core.SolrCore$7.call(SolrCore.java:1519)
[junit4:junit4]   2> 	at java.util.concurrent.FutureTask$Sync.innerRun(FutureTask.java:334)
[junit4:junit4]   2> 	at java.util.concurrent.FutureTask.run(FutureTask.java:166)
[junit4:junit4]   2> 	at java.util.concurrent.ThreadPoolExecutor.runWorker(ThreadPoolExecutor.java:1110)
[junit4:junit4]   2> 	at java.util.concurrent.ThreadPoolExecutor$Worker.run(ThreadPoolExecutor.java:603)
[junit4:junit4]   2> 	at java.lang.Thread.run(Thread.java:679)
[junit4:junit4]   2> 
[junit4:junit4]   2> 18037 T1889 oasc.SolrCore.registerSearcher [collection1] Registered new searcher Searcher@1423bfee main{StandardDirectoryReader(segments_3:4:nrt _0(4.0.0.2):C3)}
[junit4:junit4]   2> 18038 T1880 C119 P57819 /update {waitSearcher=true&commit=true&wt=javabin&commit_end_point=true&expungeDeletes=false&softCommit=false&version=2} {commit=} 0 306
[junit4:junit4]   2> 18038 T1875 oasc.SolrCore.registerSearcher [collection1] Registered new searcher Searcher@273881ae main{StandardDirectoryReader(segments_3:4:nrt _0(4.0.0.2):C2)}
[junit4:junit4]   2> 18038 T1866 C117 P57815 /update {waitSearcher=true&commit=true&wt=javabin&commit_end_point=true&expungeDeletes=false&softCommit=false&version=2} {commit=} 0 305
[junit4:junit4]   2> 18043 T1894 C120 P57822 oass.SolrIndexSearcher.<init> Opening Searcher@4a675d6c main
[junit4:junit4]   2> 18044 T1894 C120 P57822 oasu.DirectUpdateHandler2.commit end_commit_flush
[junit4:junit4]   2> 18046 T1903 oasc.SolrCore.registerSearcher [collection1] Registered new searcher Searcher@4a675d6c main{StandardDirectoryReader(segments_3:4:nrt _0(4.0.0.2):C4)}
[junit4:junit4]   2> 18047 T1894 C120 P57822 /update {waitSearcher=true&commit=true&wt=javabin&commit_end_point=true&expungeDeletes=false&softCommit=false&version=2} {commit=} 0 315
[junit4:junit4]   2> 18048 T1857 C118 P57811 /update {waitSearcher=true&wt=javabin&commit=true&softCommit=false&version=2} {commit=} 0 461
[junit4:junit4]   2> 18049 T1828 oasc.AbstractDistribZkTestBase.waitForRecoveriesToFinish Wait for recoveries to finish - collection: collection1 failOnTimeout:true timeout (sec):1800
[junit4:junit4]   2> 18051 T1828 oascc.ZkStateReader.updateClusterState Updating cloud state from ZooKeeper... 
[junit4:junit4]   2> check const of shard1
[junit4:junit4]   2> client0
[junit4:junit4]   2> PROPS:127.0.0.1:57811_solr_collection1:{"shard":"shard1","roles":null,"state":"active","core":"collection1","collection":"collection1","node_name":"127.0.0.1:57811_solr","base_url":"http://127.0.0.1:57811/solr","leader":"true"}
[junit4:junit4]   2> 18055 T1856 C118 P57811 REQ /select {distrib=false&wt=javabin&q=*:*&version=2} hits=4 status=0 QTime=1 
[junit4:junit4]   2>  live:true
[junit4:junit4]   2>  num:4
[junit4:junit4]   2> 
[junit4:junit4]   2> client1
[junit4:junit4]   2> PROPS:127.0.0.1:57815_solr_collection1:{"shard":"shard1","roles":null,"state":"active","core":"collection1","collection":"collection1","node_name":"127.0.0.1:57815_solr","base_url":"http://127.0.0.1:57815/solr"}
[junit4:junit4]   2> 18060 T1867 C117 P57815 REQ /select {distrib=false&wt=javabin&q=*:*&version=2} hits=2 status=0 QTime=1 
[junit4:junit4]   2>  live:true
[junit4:junit4]   2>  num:2
[junit4:junit4]   2> 
[junit4:junit4]   2> ######shard1 is not consistent.  Got 4 from http://127.0.0.1:57811/solr/collection1lastClient and got 2 from http://127.0.0.1:57815/solr/collection1
[junit4:junit4]   2> 18065 T1856 C118 P57811 REQ /select {fl=id,_version_&sort=id+asc&q=*:*&distrib=false&wt=javabin&rows=1000&version=2} hits=4 status=0 QTime=1 
[junit4:junit4]   2> 18070 T1867 C117 P57815 REQ /select {fl=id,_version_&sort=id+asc&q=*:*&distrib=false&wt=javabin&rows=1000&version=2} hits=2 status=0 QTime=0 
[junit4:junit4]   2> ######http://127.0.0.1:57811/solr/collection1: {numFound=4,start=0,docs=[SolrDocument{id=0, _version_=1413808153852641280}, SolrDocument{id=1, _version_=1413808153876758528}, SolrDocument{id=2, _version_=1413808153893535744}, SolrDocument{id=3, _version_=1413808153911361536}]}
[junit4:junit4]   2> ######http://127.0.0.1:57815/solr/collection1: {numFound=2,start=0,docs=[SolrDocument{id=0, _version_=1413808153852641280}, SolrDocument{id=1, _version_=1413808153876758528}]}
[junit4:junit4]   2> ###### sizes=4,2
[junit4:junit4]   2> ###### Only in http://127.0.0.1:57811/solr/collection1: [{id=2, _version_=1413808153893535744}, {id=3, _version_=1413808153911361536}]
[junit4:junit4]   2> client2
[junit4:junit4]   2> PROPS:127.0.0.1:57819_solr_collection1:{"shard":"shard1","roles":null,"state":"active","core":"collection1","collection":"collection1","node_name":"127.0.0.1:57819_solr","base_url":"http://127.0.0.1:57819/solr"}
[junit4:junit4]   2> 18076 T1881 C119 P57819 REQ /select {distrib=false&wt=javabin&q=*:*&version=2} hits=3 status=0 QTime=1 
[junit4:junit4]   2>  live:true
[junit4:junit4]   2>  num:3
[junit4:junit4]   2> 
[junit4:junit4]   2> client3
[junit4:junit4]   2> PROPS:127.0.0.1:57822_solr_collection1:{"shard":"shard1","roles":null,"state":"active","core":"collection1","collection":"collection1","node_name":"127.0.0.1:57822_solr","base_url":"http://127.0.0.1:57822/solr"}
[junit4:junit4]   2> 18080 T1895 C120 P57822 REQ /select {distrib=false&wt=javabin&q=*:*&version=2} hits=4 status=0 QTime=0 
[junit4:junit4]   2>  live:true
[junit4:junit4]   2>  num:4
[junit4:junit4]   2> 
[junit4:junit4]   2> 18082 T1828 oascsi.HttpClientUtil.createClient Creating new http client, config:maxConnections=128&maxConnectionsPerHost=32&followRedirects=false
[junit4:junit4]   2> 18114 T1882 oasha.CollectionsHandler.handleSyncShardAction Syncing shard : action=SYNCSHARD&collection=collection1&shard=shard1&wt=javabin&version=2
[junit4:junit4]   2> 18115 T1882 oascsi.HttpClientUtil.createClient Creating new http client, config:maxConnections=128&maxConnectionsPerHost=32&followRedirects=false
[junit4:junit4]   2> 18131 T1859 oasha.CoreAdminHandler.handleRequestSyncAction I have been requested to sync up my shard
[junit4:junit4]   2> 18132 T1859 oasc.SyncStrategy.sync Sync replicas to http://127.0.0.1:57811/solr/collection1/
[junit4:junit4]   2> 18132 T1859 oasu.PeerSync.sync PeerSync: core=collection1 url=http://127.0.0.1:57811/solr START replicas=[http://127.0.0.1:57815/solr/collection1/, http://127.0.0.1:57819/solr/collection1/, http://127.0.0.1:57822/solr/collection1/] nUpdates=100
[junit4:junit4]   2> 18135 T1868 C117 P57815 REQ /get {distrib=false&qt=/get&wt=javabin&version=2&getVersions=100} status=0 QTime=0 
[junit4:junit4]   2> 18136 T1896 C120 P57822 REQ /get {distrib=false&qt=/get&wt=javabin&version=2&getVersions=100} status=0 QTime=0 
[junit4:junit4]   2> 18136 T1883 C119 P57819 REQ /get {distrib=false&qt=/get&wt=javabin&version=2&getVersions=100} status=0 QTime=0 
[junit4:junit4]   2> 18137 T1859 oasu.PeerSync.handleVersions PeerSync: core=collection1 url=http://127.0.0.1:57811/solr  Received 3 versions from 127.0.0.1:57815/solr/collection1/
[junit4:junit4]   2> 18137 T1859 oasu.PeerSync.handleVersions PeerSync: core=collection1 url=http://127.0.0.1:57811/solr  Our versions are newer. ourLowThreshold=1413808153834815488 otherHigh=1413808153876758528
[junit4:junit4]   2> 18138 T1859 oasu.PeerSync.handleVersions PeerSync: core=collection1 url=http://127.0.0.1:57811/solr  Received 5 versions from 127.0.0.1:57822/solr/collection1/
[junit4:junit4]   2> 18138 T1859 oasu.PeerSync.handleVersions PeerSync: core=collection1 url=http://127.0.0.1:57811/solr  Our versions are newer. ourLowThreshold=1413808153834815488 otherHigh=1413808153893535744
[junit4:junit4]   2> 18139 T1859 oasu.PeerSync.handleVersions PeerSync: core=collection1 url=http://127.0.0.1:57811/solr  Received 4 versions from 127.0.0.1:57819/solr/collection1/
[junit4:junit4]   2> 18139 T1859 oasu.PeerSync.handleVersions PeerSync: core=collection1 url=http://127.0.0.1:57811/solr  Our versions are newer. ourLowThreshold=1413808153834815488 otherHigh=1413808153893535744
[junit4:junit4]   2> 18139 T1859 oasu.PeerSync.sync PeerSync: core=collection1 url=http://127.0.0.1:57811/solr DONE. sync succeeded
[junit4:junit4]   2> 18140 T1859 oasc.SyncStrategy.syncReplicas Sync Success - now sync replicas to me
[junit4:junit4]   2> 18140 T1859 oasc.SyncStrategy.syncToMe http://127.0.0.1:57811/solr/collection1/: try and ask http://127.0.0.1:57815/solr/collection1/ to sync
[junit4:junit4]   2> 18141 T1859 oasc.SyncStrategy.syncToMe http://127.0.0.1:57811/solr/collection1/: try and ask http://127.0.0.1:57819/solr/collection1/ to sync
[junit4:junit4]   2> 18142 T1859 oasc.SyncStrategy.syncToMe http://127.0.0.1:57811/solr/collection1/: try and ask http://127.0.0.1:57822/solr/collection1/ to sync
[junit4:junit4]   2> 18145 T1869 C117 P57815 oasu.PeerSync.sync PeerSync: core=collection1 url=http://127.0.0.1:57815/solr START replicas=[http://127.0.0.1:57811/solr/collection1/] nUpdates=100
[junit4:junit4]   2> 18147 T1897 C120 P57822 oasu.PeerSync.sync PeerSync: core=collection1 url=http://127.0.0.1:57822/solr START replicas=[http://127.0.0.1:57811/solr/collection1/] nUpdates=100
[junit4:junit4]   2> 18148 T1884 C119 P57819 oasu.PeerSync.sync PeerSync: core=collection1 url=http://127.0.0.1:57819/solr START replicas=[http://127.0.0.1:57811/solr/collection1/] nUpdates=100
[junit4:junit4]   2> 18150 T1860 C118 P57811 REQ /get {distrib=false&qt=/get&wt=javabin&version=2&getVersions=100} status=0 QTime=1 
[junit4:junit4]   2> 18150 T1854 C118 P57811 REQ /get {distrib=false&qt=/get&wt=javabin&version=2&getVersions=100} status=0 QTime=0 
[junit4:junit4]   2> 18151 T1897 C120 P57822 oasu.PeerSync.handleVersions PeerSync: core=collection1 url=http://127.0.0.1:57822/solr  Received 5 versions from 127.0.0.1:57811/solr/collection1/
[junit4:junit4]   2> 18152 T1897 C120 P57822 oasu.PeerSync.handleVersions PeerSync: core=collection1 url=http://127.0.0.1:57822/solr  Our versions are newer. ourLowThreshold=1413808153834815488 otherHigh=1413808153893535744
[junit4:junit4]   2> 18152 T1869 C117 P57815 oasu.PeerSync.handleVersions PeerSync: core=collection1 url=http://127.0.0.1:57815/solr  Received 5 versions from 127.0.0.1:57811/solr/collection1/
[junit4:junit4]   2> 18153 T1897 C120 P57822 oasu.PeerSync.sync PeerSync: core=collection1 url=http://127.0.0.1:57822/solr DONE. sync succeeded
[junit4:junit4]   2> 18154 T1869 C117 P57815 oasu.PeerSync.requestUpdates PeerSync: core=collection1 url=http://127.0.0.1:57815/solr Requesting updates from 127.0.0.1:57811/solr/collection1/n=2 versions=[1413808153911361536, 1413808153893535744]
[junit4:junit4]   2> 18154 T1855 C118 P57811 REQ /get {distrib=false&qt=/get&wt=javabin&version=2&getVersions=100} status=0 QTime=1 
[junit4:junit4]   2> 18154 T1897 C120 P57822 REQ /get {sync=http://127.0.0.1:57811/solr/collection1/&getVersions=100&distrib=false&qt=/get&wt=javabin&version=2} status=0 QTime=7 
[junit4:junit4]   2> 18155 T1884 C119 P57819 oasu.PeerSync.handleVersions PeerSync: core=collection1 url=http://127.0.0.1:57819/solr  Received 5 versions from 127.0.0.1:57811/solr/collection1/
[junit4:junit4]   2> 18155 T1859 oasc.SyncStrategy.syncToMe http://127.0.0.1:57811/solr/collection1/:  sync completed with http://127.0.0.1:57822/solr/collection1/
[junit4:junit4]   2> 18156 T1884 C119 P57819 oasu.PeerSync.requestUpdates PeerSync: core=collection1 url=http://127.0.0.1:57819/solr Requesting updates from 127.0.0.1:57811/solr/collection1/n=1 versions=[1413808153911361536]
[junit4:junit4]   2> 18157 T1854 C118 P57811 REQ /get {distrib=false&getUpdates=1413808153911361536,1413808153893535744&qt=/get&wt=javabin&version=2} status=0 QTime=0 
[junit4:junit4]   2> 18159 T1855 C118 P57811 REQ /get {distrib=false&getUpdates=1413808153911361536&qt=/get&wt=javabin&version=2} status=0 QTime=0 
[junit4:junit4]   2> 18166 T1884 C119 P57819 oasu.PeerSync.sync PeerSync: core=collection1 url=http://127.0.0.1:57819/solr DONE. sync succeeded
[junit4:junit4]   2> 18167 T1884 C119 P57819 REQ /get {sync=http://127.0.0.1:57811/solr/collection1/&getVersions=100&distrib=false&qt=/get&wt=javabin&version=2} status=0 QTime=20 
[junit4:junit4]   2> 18168 T1869 C117 P57815 oasu.PeerSync.sync PeerSync: core=collection1 url=http://127.0.0.1:57815/solr DONE. sync succeeded
[junit4:junit4]   2> 18169 T1869 C117 P57815 REQ /get {sync=http://127.0.0.1:57811/solr/collection1/&getVersions=100&distrib=false&qt=/get&wt=javabin&version=2} status=0 QTime=24 
[junit4:junit4]   2> 18169 T1859 oasc.SyncStrategy.syncToMe http://127.0.0.1:57811/solr/collection1/:  sync completed with http://127.0.0.1:57819/solr/collection1/
[junit4:junit4]   2> 18170 T1859 oasc.SyncStrategy.syncToMe http://127.0.0.1:57811/solr/collection1/:  sync completed with http://127.0.0.1:57815/solr/collection1/
[junit4:junit4]   2> 18172 T1828 oasc.AbstractFullDistribZkTestBase.waitForThingsToLevelOut Wait for recoveries to finish - wait 15 for each attempt
[junit4:junit4]   2> 18174 T1828 oasc.AbstractDistribZkTestBase.waitForRecoveriesToFinish Wait for recoveries to finish - collection: collection1 failOnTimeout:true timeout (sec):15
[junit4:junit4]   2> 18176 T1828 oascc.ZkStateReader.updateClusterState Updating cloud state from ZooKeeper... 
[junit4:junit4]   2> 18182 T1840 C121 P57809 oasu.DirectUpdateHandler2.commit start commit{flags=0,_version_=0,optimize=false,openSearcher=true,waitSearcher=true,expungeDeletes=false,softCommit=false}
[junit4:junit4]   2> 18186 T1840 C121 P57809 oass.SolrIndexSearcher.<init> Opening Searcher@1419a2e7 main
[junit4:junit4]   2> 18188 T1840 C121 P57809 oasu.DirectUpdateHandler2.commit end_commit_flush
[junit4:junit4]   2> 18192 T1851 oasc.SolrCore.registerSearcher [collection1] Registered new searcher Searcher@1419a2e7 main{StandardDirectoryReader(segments_2:3:nrt _0(4.0.0.2):C4)}
[junit4:junit4]   2> 18194 T1840 C121 P57809 /update {waitSearcher=true&wt=javabin&commit=true&softCommit=false&version=2} {commit=} 0 12
[junit4:junit4]   2> 18197 T1857 C118 P57811 oasu.DirectUpdateHandler2.commit start commit{flags=0,_version_=0,optimize=false,openSearcher=true,waitSearcher=true,expungeDeletes=false,softCommit=false}
[junit4:junit4]   2> 18199 T1857 C118 P57811 oass.SolrIndexSearcher.<init> Opening Searcher@5ac989f1 main
[junit4:junit4]   2> 18200 T1857 C118 P57811 oasu.DirectUpdateHandler2.commit end_commit_flush
[junit4:junit4]   2> 18202 T1863 oasc.SolrCore.registerSearcher [collection1] Registered new searcher Searcher@5ac989f1 main{StandardDirectoryReader(segments_2:3:nrt _0(4.0.0.2):C4)}
[junit4:junit4]   2> 18203 T1857 C118 P57811 oasu.SolrCmdDistributor.distribCommit Distrib commit to:[StdNode: http://127.0.0.1:57815/solr/collection1/, StdNode: http://127.0.0.1:57819/solr/collection1/, StdNode: http://127.0.0.1:57822/solr/collection1/]
[junit4:junit4]   2> 18208 T1866 C117 P57815 oasu.DirectUpdateHandler2.commit start commit{flags=0,_version_=0,optimize=false,openSearcher=true,waitSearcher=true,expungeDeletes=false,softCommit=false}
[junit4:junit4]   2> 18208 T1894 C120 P57822 oasu.DirectUpdateHandler2.commit start commit{flags=0,_version_=0,optimize=false,openSearcher=true,waitSearcher=true,expungeDeletes=false,softCommit=false}
[junit4:junit4]   2> 18208 T1880 C119 P57819 oasu.DirectUpdateHandler2.commit start commit{flags=0,_version_=0,optimize=false,openSearcher=true,waitSearcher=true,expungeDeletes=false,softCommit=false}
[junit4:junit4]   2> 18211 T1894 C120 P57822 oass.SolrIndexSearcher.<init> Opening Searcher@67afba82 main
[junit4:junit4]   2> 18213 T1894 C120 P57822 oasu.DirectUpdateHandler2.commit end_commit_flush
[junit4:junit4]   2> 18217 T1903 oasc.SolrCore.registerSearcher [collection1] Registered new searcher Searcher@67afba82 main{StandardDirectoryReader(segments_3:4:nrt _0(4.0.0.2):C4)}
[junit4:junit4]   2> 18218 T1894 C120 P57822 /update {waitSearcher=true&commit=true&wt=javabin&commit_end_point=true&expungeDeletes=false&softCommit=false&version=2} {commit=} 0 10
[junit4:junit4]   2> 18404 T1880 C119 P57819 oasc.SolrDeletionPolicy.onCommit SolrDeletionPolicy.onCommit: commits:num=2
[junit4:junit4]   2> 		commit{dir=NRTCachingDirectory(org.apache.lucene.store.NIOFSDirectory@/usr/home/hudson/hudson-slave/workspace/Lucene-Solr-Tests-4.x-Java6/solr/build/solr-core/test/J1/org.apache.solr.cloud.SyncSliceTest-1348312507720/jetty3/index lockFactory=org.apache.lucene.store.NativeFSLockFactory@7b0f9a5c; maxCacheMB=48.0 maxMergeSizeMB=4.0),segFN=segments_3,generation=3,filenames=[_0_Asserting_0.tim, _0_Asserting_0.tip, _0_MockSep_0.pos, _0_MockVariableIntBlock_0.doc, _0_MockVariableIntBlock_0.skp, _0_Lucene40_0.prx, _0_Asserting_0.prx, _0_MockVariableIntBlock_0.pyl, _0_Lucene40_0.frq, _0_MockSep_0.skp, _0_MockVariableIntBlock_0.tib, _0_MockVariableIntBlock_0.pos, _0_MockSep_0.doc, _0.si, _0_MockVariableIntBlock_0.tii, _0_Lucene40_0.tim, _0.fnm, _0_nrm.cfs, _0_Lucene40_0.tip, _0_MockSep_0.tib, _0_Asserting_0.frq, _0_nrm.cfe, _0_MockVariableIntBlock_0.frq, _0_MockSep_0.frq, _0.fdx, _0_MockSep_0.tii, _0_MockSep_0.pyl, _0.fdt, segments_3]
[junit4:junit4]   2> 		commit{dir=NRTCachingDirectory(org.apache.lucene.store.NIOFSDirectory@/usr/home/hudson/hudson-slave/workspace/Lucene-Solr-Tests-4.x-Java6/solr/build/solr-core/test/J1/org.apache.solr.cloud.SyncSliceTest-1348312507720/jetty3/index lockFactory=org.apache.lucene.store.NativeFSLockFactory@7b0f9a5c; maxCacheMB=48.0 maxMergeSizeMB=4.0),segFN=segments_4,generation=4,filenames=[_1_Lucene40_0.tim, _0_MockSep_0.pos, _0_MockVariableIntBlock_0.skp, _0_Lucene40_0.prx, _1.fnm, _1_Lucene40_0.tip, _0_Asserting_0.prx, _1_Asserting_0.tim, _0_MockSep_0.skp, _1_Asserting_0.tip, _1_MockSep_0.doc, _1_MockSep_0.pyl, _0_Lucene40_0.tim, _1_MockSep_0.skp, _0.fnm, _1_MockVariableIntBlock_0.tii, _1_MockSep_0.tib, _1_MockSep_0.tii, _1_MockVariableIntBlock_0.tib, _1_Lucene40_0.prx, _0_Lucene40_0.tip, _1.fdx, _0_Asserting_0.frq, _1.fdt, _0_MockVariableIntBlock_0.frq, _0_Asserting_0.tim, _1_MockVariableIntBlock_0.skp, _1_MockSep_0.frq, _0_Asserting_0.tip, _0_MockVariableIntBlock_0.doc, _1_MockVariableIntBlock_0.pyl, _0_MockVariableIntBlock_0.pyl, _0_Lucene40_0.frq, _0_MockVariableIntBlock_0.tib, _1_MockVariableIntBlock_0.doc, _0_MockVariableIntBlock_0.pos, _0.si, _0_MockSep_0.doc, _0_MockVariableIntBlock_0.tii, _1_nrm.cfs, _1_MockSep_0.pos, _1_MockVariableIntBlock_0.pos, _1_Lucene40_0.frq, _1_Asserting_0.frq, _0_nrm.cfs, _1_nrm.cfe, _0_MockSep_0.tib, _1_MockVariableIntBlock_0.frq, _1_Asserting_0.prx, _1.si, _0_nrm.cfe, _0_MockSep_0.frq, _0.fdx, _0_MockSep_0.tii, _0_MockSep_0.pyl, _0.fdt, segments_4]
[junit4:junit4]   2> 18406 T1880 C119 P57819 oasc.SolrDeletionPolicy.updateCommits newest commit = 4
[junit4:junit4]   2> 18422 T1866 C117 P57815 oasc.SolrDeletionPolicy.onCommit SolrDeletionPolicy.onCommit: commits:num=2
[junit4:junit4]   2> 		commit{dir=NRTCachingDirectory(org.apache.lucene.store.NIOFSDirectory@/usr/home/hudson/hudson-slave/workspace/Lucene-Solr-Tests-4.x-Java6/solr/build/solr-core/test/J1/org.apache.solr.cloud.SyncSliceTest-1348312507720/jetty2/index lockFactory=org.apache.lucene.store.NativeFSLockFactory@67f9f9bb; maxCacheMB=48.0 maxMergeSizeMB=4.0),segFN=segments_3,generation=3,filenames=[_0_Asserting_0.tim, _0_Asserting_0.tip, _0_MockSep_0.pos, _0_MockVariableIntBlock_0.doc, _0_MockVariableIntBlock_0.skp, _0_Lucene40_0.prx, _0_Asserting_0.prx, _0_MockVariableIntBlock_0.pyl, _0_Lucene40_0.frq, _0_MockSep_0.skp, _0_MockVariableIntBlock_0.tib, _0_MockVariableIntBlock_0.pos, _0_MockSep_0.doc, _0.si, _0_MockVariableIntBlock_0.tii, _0_Lucene40_0.tim, _0.fnm, _0_nrm.cfs, _0_Lucene40_0.tip, _0_MockSep_0.tib, _0_Asserting_0.frq, _0_nrm.cfe, _0_MockVariableIntBlock_0.frq, _0_MockSep_0.frq, _0.fdx, _0_MockSep_0.tii, _0_MockSep_0.pyl, _0.fdt, segments_3]
[junit4:junit4]   2> 		commit{dir=NRTCachingDirectory(org.apache.lucene.store.NIOFSDirectory@/usr/home/hudson/hudson-slave/workspace/Lucene-Solr-Tests-4.x-Java6/solr/build/solr-core/test/J1/org.apache.solr.cloud.SyncSliceTest-1348312507720/jetty2/index lockFactory=org.apache.lucene.store.NativeFSLockFactory@67f9f9bb; maxCacheMB=48.0 maxMergeSizeMB=4.0),segFN=segments_4,generation=4,filenames=[_1_Lucene40_0.tim, _0_MockSep_0.pos, _0_MockVariableIntBlock_0.skp, _0_Lucene40_0.prx, _1.fnm, _1_Lucene40_0.tip, _0_Asserting_0.prx, _1_Asserting_0.tim, _0_MockSep_0.skp, _1_Asserting_0.tip, _1_MockSep_0.doc, _1_MockSep_0.pyl, _0_Lucene40_0.tim, _1_MockSep_0.skp, _0.fnm, _1_MockVariableIntBlock_0.tii, _1_MockSep_0.tib, _1_MockSep_0.tii, _1_MockVariableIntBlock_0.tib, _1_Lucene40_0.prx, _0_Lucene40_0.tip, _1.fdx, _0_Asserting_0.frq, _1.fdt, _0_MockVariableIntBlock_0.frq, _0_Asserting_0.tim, _1_MockVariableIntBlock_0.skp, _1_MockSep_0.frq, _0_Asserting_0.tip, _0_MockVariableIntBlock_0.doc, _1_MockVariableIntBlock_0.pyl, _0_MockVariableIntBlock_0.pyl, _0_Lucene40_0.frq, _0_MockVariableIntBlock_0.tib, _1_MockVariableIntBlock_0.doc, _0_MockVariableIntBlock_0.pos, _0.si, _0_MockSep_0.doc, _0_MockVariableIntBlock_0.tii, _1_nrm.cfs, _1_MockSep_0.pos, _1_MockVariableIntBlock_0.pos, _1_Lucene40_0.frq, _1_Asserting_0.frq, _0_nrm.cfs, _1_nrm.cfe, _0_MockSep_0.tib, _1_MockVariableIntBlock_0.frq, _1_Asserting_0.prx, _1.si, _0_nrm.cfe, _0_MockSep_0.frq, _0.fdx, _0_MockSep_0.tii, _0_MockSep_0.pyl, _0.fdt, segments_4]
[junit4:junit4]   2> 18423 T1880 C119 P57819 oass.SolrIndexSearcher.<init> Opening Searcher@7a9a0e3f main
[junit4:junit4]   2> 18423 T1866 C117 P57815 oasc.SolrDeletionPolicy.updateCommits newest commit = 4
[junit4:junit4]   2> 18424 T1880 C119 P57819 oasu.DirectUpdateHandler2.commit end_commit_flush
[junit4:junit4]   2> 18428 T1889 oasc.SolrCore.registerSearcher [collection1] Registered new searcher Searcher@7a9a0e3f main{StandardDirectoryReader(segments_4:6:nrt _0(4.0.0.2):C3 _1(4.0.0.2):C1)}
[junit4:junit4]   2> 18430 T1880 C119 P57819 /update {waitSearcher=true&commit=true&wt=javabin&commit_end_point=true&expungeDeletes=false&softCommit=false&version=2} {commit=} 0 222
[junit4:junit4]   2> 18447 T1866 C117 P57815 oass.SolrIndexSearcher.<init> Opening Searcher@3b5c7b7f main
[junit4:junit4]   2> 18448 T1866 C117 P57815 oasu.DirectUpdateHandler2.commit end_commit_flush
[junit4:junit4]   2> 18450 T1875 oasc.SolrCore.registerSearcher [collection1] Registered new searcher Searcher@3b5c7b7f main{StandardDirectoryReader(segments_4:6:nrt _0(4.0.0.2):C2 _1(4.0.0.2):C2)}
[junit4:junit4]   2> 18451 T1866 C117 P57815 /update {waitSearcher=true&commit=true&wt=javabin&commit_end_point=true&expungeDeletes=false&softCommit=false&version=2} {commit=} 0 243
[junit4:junit4]   2> 18452 T1857 C118 P57811 /update {waitSearcher=true&wt=javabin&commit=true&softCommit=false&version=2} {commit=} 0 255
[junit4:junit4]   2> 18455 T1828 oascc.ZkStateReader.updateClusterState Updating cloud state from ZooKeeper... 
[junit4:junit4]   2> 18463 T1856 C118 P57811 REQ /select {distrib=false&wt=javabin&q=*:*&version=2} hits=4 status=0 QTime=1 
[junit4:junit4]   2> 18471 T1867 C117 P57815 REQ /select {distrib=false&wt=javabin&q=*:*&version=2} hits=4 status=0 QTime=1 
[junit4:junit4]   2> 18477 T1881 C119 P57819 REQ /select {distrib=false&wt=javabin&q=*:*&version=2} hits=4 status=0 QTime=0 
[junit4:junit4]   2> 18484 T1895 C120 P57822 REQ /select {distrib=false&wt=javabin&q=*:*&version=2} hits=4 status=0 QTime=0 
[junit4:junit4]   2> 20497 T1841 C121 P57809 REQ /select {fl=id,score&shard.url=127.0.0.1:57809/solr/collection1/&NOW=1348312528186&start=0&q=*:*&distrib=false&isShard=true&wt=javabin&fsv=true&rows=10&version=2} hits=4 status=0 QTime=0 
[junit4:junit4]   2> 20504 T1841 C121 P57809 REQ /select {shard.url=127.0.0.1:57809/solr/collection1/&NOW=1348312528186&q=*:*&ids=3,2,1,0&distrib=false&isShard=true&wt=javabin&version=2} status=0 QTime=1 
[junit4:junit4]   2> 20506 T1840 C121 P57809 REQ /select {wt=javabin&q=*:*&version=2} hits=4 status=0 QTime=16 
[junit4:junit4]   2> Control Docs:4
[junit4:junit4]   2> 20508 T1828 oascc.ZkStateReader.updateClusterState Updating cloud state from ZooKeeper... 
[junit4:junit4]   2> check const of shard1
[junit4:junit4]   2> client0
[junit4:junit4]   2> PROPS:127.0.0.1:57811_solr_collection1:{"shard":"shard1","roles":null,"state":"active","core":"collection1","collection":"collection1","node_name":"127.0.0.1:57811_solr","base_url":"http://127.0.0.1:57811/solr","leader":"true"}
[junit4:junit4]   2> 20513 T1856 C118 P57811 REQ /select {distrib=false&wt=javabin&q=*:*&version=2} hits=4 status=0 QTime=1 
[junit4:junit4]   2>  live:true
[junit4:junit4]   2>  num:4
[junit4:junit4]   2> 
[junit4:junit4]   2> client1
[junit4:junit4]   2> PROPS:127.0.0.1:57815_solr_collection1:{"shard":"shard1","roles":null,"state":"active","core":"collection1","collection":"collection1","node_name":"127.0.0.1:57815_solr","base_url":"http://127.0.0.1:57815/solr"}
[junit4:junit4]   2> 20517 T1867 C117 P57815 REQ /select {distrib=false&wt=javabin&q=*:*&version=2} hits=4 status=0 QTime=1 
[junit4:junit4]   2>  live:true
[junit4:junit4]   2>  num:4
[junit4:junit4]   2> 
[junit4:junit4]   2> client2
[junit4:junit4]   2> PROPS:127.0.0.1:57819_solr_collection1:{"shard":"shard1","roles":null,"state":"active","core":"collection1","collection":"collection1","node_name":"127.0.0.1:57819_solr","base_url":"http://127.0.0.1:57819/solr"}
[junit4:junit4]   2> 20521 T1881 C119 P57819 REQ /select {distrib=false&wt=javabin&q=*:*&version=2} hits=4 status=0 QTime=0 
[junit4:junit4]   2>  live:true
[junit4:junit4]   2>  num:4
[junit4:junit4]   2> 
[junit4:junit4]   2> client3
[junit4:junit4]   2> PROPS:127.0.0.1:57822_solr_collection1:{"shard":"shard1","roles":null,"state":"active","core":"collection1","collection":"collection1","node_name":"127.0.0.1:57822_solr","base_url":"http://127.0.0.1:57822/solr"}
[junit4:junit4]   2> 20527 T1895 C120 P57822 REQ /select {distrib=false&wt=javabin&q=*:*&version=2} hits=4 status=0 QTime=1 
[junit4:junit4]   2>  live:true
[junit4:junit4]   2>  num:4
[junit4:junit4]   2> 
[junit4:junit4]   2> 20537 T1924 C118 P57811 REQ /select {fl=id,score&shard.url=127.0.0.1:57811/solr/collection1/|127.0.0.1:57815/solr/collection1/|127.0.0.1:57819/solr/collection1/|127.0.0.1:57822/solr/collection1/&NOW=1348312528226&start=0&q=*:*&distrib=false&isShard=true&wt=javabin&fsv=true&rows=10&version=2} hits=4 status=0 QTime=0 
[junit4:junit4]   2> 20543 T1924 C118 P57811 REQ /select {shard.url=127.0.0.1:57811/solr/collection1/|127.0.0.1:57815/solr/collection1/|127.0.0.1:57819/solr/collection1/|127.0.0.1:57822/solr/collection1/&NOW=1348312528226&q=*:*&ids=3,2,1,0&distrib=false&isShard=true&wt=javabin&version=2} status=0 QTime=1 
[junit4:junit4]   2> 20545 T1898 C120 P57822 REQ /select {wt=javabin&q=*:*&version=2} hits=4 status=0 QTime=15 
[junit4:junit4]   2> 20556 T1840 C121 P57809 /update {wt=javabin&version=2} {add=[4 (1413808157618077696)]} 0 7
[junit4:junit4]   2> 20575 T1894 C120 P57822 REQ /update {distrib.from=http://127.0.0.1:57811/solr/collection1/&update.distrib=FROMLEADER&test.distrib.skip.servers=http://127.0.0.1:57819/solr/collection1/&wt=javabin&version=2} status=0 QTime=6 
[junit4:junit4]   2> 20578 T1866 C117 P57815 REQ /update {distrib.from=http://127.0.0.1:57811/solr/collection1/&update.distrib=FROMLEADER&test.distrib.skip.servers=http://127.0.0.1:57819/solr/collection1/&wt=javabin&version=2} status=0 QTime=9 
[junit4:junit4]   2> 20580 T1857 C118 P57811 /update {test.distrib.skip.servers=http://127.0.0.1:57819/solr/collection1/&wt=javabin&version=2} {add=[4 (1413808157629612032)]} 0 19
[junit4:junit4]   2> 20582 T1828 oasc.ChaosMonkey.monkeyLog monkey: kill shard! 57811
[junit4:junit4]   2> 20587 T1828 oasc.CoreContainer.shutdown Shutting down CoreContainer instance=1980029812
[junit4:junit4]   2> 20590 T1828 oasc.SolrCore.close [collection1]  CLOSING SolrCore org.apache.solr.core.SolrCore@27f9f2e4
[junit4:junit4]   2> 20627 T1828 oasc.SolrCore.closeSearcher [collection1] Closing main searcher on request.
[junit4:junit4]   2> 20628 T1828 oasu.DirectUpdateHandler2.close closing DirectUpdateHandler2{commits=6,autocommits=0,soft autocommits=0,optimizes=0,rollbacks=0,expungeDeletes=0,docsPending=1,adds=1,deletesById=0,deletesByQuery=0,errors=0,cumulative_adds=5,cumulative_deletesById=0,cumulative_deletesByQuery=1,cumulative_errors=0}
[junit4:junit4]   2> 20628 T1828 oasu.DefaultSolrCoreState.decref SolrCoreState ref count has reached 0 - closing IndexWriter
[junit4:junit4]   2> 20744 T1828 C118 P57811 oasc.SolrDeletionPolicy.onCommit SolrDeletionPolicy.onCommit: commits:num=3
[junit4:junit4]   2> 		commit{dir=NRTCachingDirectory(org.apache.lucene.store.NIOFSDirectory@/usr/home/hudson/hudson-slave/workspace/Lucene-Solr-Tests-4.x-Java6/solr/build/solr-core/test/J1/org.apache.solr.cloud.SyncSliceTest-1348312507720/jetty1/index lockFactory=org.apache.lucene.store.NativeFSLockFactory@3bee56b5; maxCacheMB=48.0 maxMergeSizeMB=4.0),segFN=segments_1,generation=1,filenames=[segments_1]
[junit4:junit4]   2> 		commit{dir=NRTCachingDirectory(org.apache.lucene.store.NIOFSDirectory@/usr/home/hudson/hudson-slave/workspace/Lucene-Solr-Tests-4.x-Java6/solr/build/solr-core/test/J1/org.apache.solr.cloud.SyncSliceTest-1348312507720/jetty1/index lockFactory=org.apache.lucene.store.NativeFSLockFactory@3bee56b5; maxCacheMB=48.0 maxMergeSizeMB=4.0),segFN=segments_2,generation=2,filenames=[_0_Asserting_0.tim, _0_Asserting_0.tip, _0_MockSep_0.pos, _0_MockVariableIntBlock_0.doc, _0_MockVariableIntBlock_0.skp, _0_Lucene40_0.prx, _0_Asserting_0.prx, _0_MockVariableIntBlock_0.pyl, _0_Lucene40_0.frq, _0_MockSep_0.skp, _0_MockVariableIntBlock_0.tib, _0_MockVariableIntBlock_0.pos, _0_MockSep_0.doc, _0.si, _0_MockVariableIntBlock_0.tii, _0_Lucene40_0.tim, _0.fnm, _0_nrm.cfs, _0_Lucene40_0.tip, _0_MockSep_0.tib, _0_Asserting_0.frq, _0_nrm.cfe, _0_MockVariableIntBlock_0.frq, segments_2, _0_MockSep_0.frq, _0.fdx, _0_MockSep_0.tii, _0_MockSep_0.pyl, _0.fdt]
[junit4:junit4]   2> 		commit{dir=NRTCachingDirectory(org.apache.lucene.store.NIOFSDirectory@/usr/home/hudson/hudson-slave/workspace/Lucene-Solr-Tests-4.x-Java6/solr/build/solr-core/test/J1/org.apache.solr.cloud.SyncSliceTest-1348312507720/jetty1/index lockFactory=org.apache.lucene.store.NativeFSLockFactory@3bee56b5; maxCacheMB=48.0 maxMergeSizeMB=4.0),segFN=segments_3,generation=3,filenames=[_1_Lucene40_0.tim, _0_MockSep_0.pos, _0_MockVariableIntBlock_0.skp, _0_Lucene40_0.prx, _1.fnm, _1_Lucene40_0.tip, _0_Asserting_0.prx, _1_Asserting_0.tim, _0_MockSep_0.skp, _1_Asserting_0.tip, _1_MockSep_0.doc, _1_MockSep_0.pyl, _0_Lucene40_0.tim, _1_MockSep_0.skp, _0.fnm, _1_MockVariableIntBlock_0.tii, _1_MockSep_0.tib, _1_MockSep_0.tii, _1_MockVariableIntBlock_0.tib, _1_Lucene40_0.prx, _0_Lucene40_0.tip, _1.fdx, _0_Asserting_0.frq, _1.fdt, _0_MockVariableIntBlock_0.frq, _0_Asserting_0.tim, _1_MockVariableIntBlock_0.skp, _1_MockSep_0.frq, _0_Asserting_0.tip, _0_MockVariableIntBlock_0.doc, _1_MockVariableIntBlock_0.pyl, _0_MockVariableIntBlock_0.pyl, _0_Lucene40_0.frq, _0_MockVariableIntBlock_0.tib, _1_MockVariableIntBlock_0.doc, _0_MockVariableIntBlock_0.pos, _0.si, _0_MockSep_0.doc, _0_MockVariableIntBlock_0.tii, _1_nrm.cfs, _1_MockSep_0.pos, _1_MockVariableIntBlock_0.pos, _1_Lucene40_0.frq, _1_Asserting_0.frq, _0_nrm.cfs, _1_nrm.cfe, _0_MockSep_0.tib, _1_MockVariableIntBlock_0.frq, _1_Asserting_0.prx, _1.si, _0_nrm.cfe, _0_MockSep_0.frq, _0.fdx, _0_MockSep_0.tii, _0_MockSep_0.pyl, segments_3, _0.fdt]
[junit4:junit4]   2> 20745 T1828 C118 P57811 oasc.SolrDeletionPolicy.updateCommits newest commit = 3
[junit4:junit4]   2> 20747 T1828 oasu.DefaultSolrCoreState.decref Closing SolrCoreState - canceling any ongoing recovery
[junit4:junit4]   2> 20748 T1833 oazs.PrepRequestProcessor.pRequest Processed session termination for sessionid: 0x139edb0254d0003
[junit4:junit4]   2> 20749 T1862 oascc.ZkStateReader$3.process Updating live nodes
[junit4:junit4]   2> 20749 T1902 oascc.ZkStateReader$3.process Updating live nodes
[junit4:junit4]   2> 20749 T1888 oascc.ZkStateReader$3.process Updating live nodes
[junit4:junit4]   2> 20749 T1862 oascc.ZkStateReader$3.process WARNING ZooKeeper watch triggered, but Solr cannot talk to ZK
[junit4:junit4]   2> 20749 T1909 oascc.ZkStateReader$3.process Updating live nodes
[junit4:junit4]   2> 20749 T1907 oascc.ZkStateReader$3.process Updating live nodes
[junit4:junit4]   2> 20749 T1848 oascc.ZkStateReader$3.process Updating live nodes
[junit4:junit4]   2> 20750 T1862 oaz.ClientCnxn$EventThread.run EventThread shut down
[junit4:junit4]   2> 20749 T1828 oaz.ZooKeeper.close Session: 0x139edb0254d0003 closed
[junit4:junit4]   2> 20750 T1830 oazs.NIOServerCnxn.closeSock Closed socket connection for client /140.211.11.196:57812 which had sessionid 0x139edb0254d0003
[junit4:junit4]   2> 20751 T1828 oejsh.ContextHandler.doStop stopped o.e.j.s.ServletContextHandler{/solr,null}
[junit4:junit4]   2> 20751 T1833 oazs.PrepRequestProcessor.pRequest Got user-level KeeperException when processing sessionid:0x139edb0254d0004 type:delete cxid:0x4a zxid:0xfffffffffffffffe txntype:unknown reqpath:n/a Error Path:/solr/collections/collection1/leaders/shard1 Error:KeeperErrorCode = NoNode for /solr/collections/collection1/leaders/shard1
[junit4:junit4]   2> 20753 T1874 oasc.ShardLeaderElectionContext.runLeaderProcess Running the leader process.
[junit4:junit4]   2> 20753 T1833 oazs.PrepRequestProcessor.pRequest Got user-level KeeperException when processing sessionid:0x139edb0254d0004 type:create cxid:0x4b zxid:0xfffffffffffffffe txntype:unknown reqpath:n/a Error Path:/solr/overseer Error:Keepe

[...truncated too long message...]

9C8ABBAC4530 -Dtests.multiplier=3 -Dtests.slow=true -Dtests.locale=ar_SA -Dtests.timezone=Pacific/Guam -Dtests.file.encoding=US-ASCII
[junit4:junit4] FAILURE  142s J1 | SyncSliceTest.testDistribSearch <<<
[junit4:junit4]    > Throwable #1: java.lang.AssertionError: There are still nodes recoverying
[junit4:junit4]    > 	at __randomizedtesting.SeedInfo.seed([2EE09C8ABBAC4530:AF061292CCF3250C]:0)
[junit4:junit4]    > 	at org.junit.Assert.fail(Assert.java:93)
[junit4:junit4]    > 	at org.apache.solr.cloud.AbstractDistribZkTestBase.waitForRecoveriesToFinish(AbstractDistribZkTestBase.java:154)
[junit4:junit4]    > 	at org.apache.solr.cloud.AbstractFullDistribZkTestBase.waitForRecoveriesToFinish(AbstractFullDistribZkTestBase.java:560)
[junit4:junit4]    > 	at org.apache.solr.cloud.AbstractFullDistribZkTestBase.waitForThingsToLevelOut(AbstractFullDistribZkTestBase.java:1135)
[junit4:junit4]    > 	at org.apache.solr.cloud.SyncSliceTest.doTest(SyncSliceTest.java:162)
[junit4:junit4]    > 	at org.apache.solr.BaseDistributedSearchTestCase.testDistribSearch(BaseDistributedSearchTestCase.java:695)
[junit4:junit4]    > 	at sun.reflect.NativeMethodAccessorImpl.invoke0(Native Method)
[junit4:junit4]    > 	at sun.reflect.NativeMethodAccessorImpl.invoke(NativeMethodAccessorImpl.java:57)
[junit4:junit4]    > 	at sun.reflect.DelegatingMethodAccessorImpl.invoke(DelegatingMethodAccessorImpl.java:43)
[junit4:junit4]    > 	at java.lang.reflect.Method.invoke(Method.java:616)
[junit4:junit4]    > 	at com.carrotsearch.randomizedtesting.RandomizedRunner.invoke(RandomizedRunner.java:1559)
[junit4:junit4]    > 	at com.carrotsearch.randomizedtesting.RandomizedRunner.access$600(RandomizedRunner.java:79)
[junit4:junit4]    > 	at com.carrotsearch.randomizedtesting.RandomizedRunner$6.evaluate(RandomizedRunner.java:737)
[junit4:junit4]    > 	at com.carrotsearch.randomizedtesting.RandomizedRunner$7.evaluate(RandomizedRunner.java:773)
[junit4:junit4]    > 	at com.carrotsearch.randomizedtesting.RandomizedRunner$8.evaluate(RandomizedRunner.java:787)
[junit4:junit4]    > 	at com.carrotsearch.randomizedtesting.rules.SystemPropertiesRestoreRule$1.evaluate(SystemPropertiesRestoreRule.java:53)
[junit4:junit4]    > 	at org.apache.lucene.util.TestRuleSetupTeardownChained$1.evaluate(TestRuleSetupTeardownChained.java:50)
[junit4:junit4]    > 	at org.apache.lucene.util.TestRuleFieldCacheSanity$1.evaluate(TestRuleFieldCacheSanity.java:51)
[junit4:junit4]    > 	at org.apache.lucene.util.AbstractBeforeAfterRule$1.evaluate(AbstractBeforeAfterRule.java:45)
[junit4:junit4]    > 	at com.carrotsearch.randomizedtesting.rules.SystemPropertiesInvariantRule$1.evaluate(SystemPropertiesInvariantRule.java:55)
[junit4:junit4]    > 	at org.apache.lucene.util.TestRuleThreadAndTestName$1.evaluate(TestRuleThreadAndTestName.java:48)
[junit4:junit4]    > 	at org.apache.lucene.util.TestRuleIgnoreAfterMaxFailures$1.evaluate(TestRuleIgnoreAfterMaxFailures.java:70)
[junit4:junit4]    > 	at org.apache.lucene.util.TestRuleMarkFailure$1.evaluate(TestRuleMarkFailure.java:48)
[junit4:junit4]    > 	at com.carrotsearch.randomizedtesting.rules.StatementAdapter.evaluate(StatementAdapter.java:36)
[junit4:junit4]    > 	at com.carrotsearch.randomizedtesting.ThreadLeakControl$StatementRunner.run(ThreadLeakControl.java:358)
[junit4:junit4]    > 	at com.carrotsearch.randomizedtesting.ThreadLeakControl.forkTimeoutingTask(ThreadLeakControl.java:782)
[junit4:junit4]    > 	at com.carrotsearch.randomizedtesting.ThreadLeakControl$3.evaluate(ThreadLeakControl.java:442)
[junit4:junit4]    > 	at com.carrotsearch.randomizedtesting.RandomizedRunner.runSingleTest(RandomizedRunner.java:746)
[junit4:junit4]    > 	at com.carrotsearch.randomizedtesting.RandomizedRunner$3.evaluate(RandomizedRunner.java:648)
[junit4:junit4]    > 	at com.carrotsearch.randomizedtesting.RandomizedRunner$4.evaluate(RandomizedRunner.java:682)
[junit4:junit4]    > 	at com.carrotsearch.randomizedtesting.RandomizedRunner$5.evaluate(RandomizedRunner.java:693)
[junit4:junit4]    > 	at com.carrotsearch.randomizedtesting.rules.StatementAdapter.evaluate(StatementAdapter.java:36)
[junit4:junit4]    > 	at com.carrotsearch.randomizedtesting.rules.SystemPropertiesRestoreRule$1.evaluate(SystemPropertiesRestoreRule.java:53)
[junit4:junit4]    > 	at org.apache.lucene.util.AbstractBeforeAfterRule$1.evaluate(AbstractBeforeAfterRule.java:45)
[junit4:junit4]    > 	at org.apache.lucene.util.TestRuleStoreClassName$1.evaluate(TestRuleStoreClassName.java:42)
[junit4:junit4]    > 	at com.carrotsearch.randomizedtesting.rules.SystemPropertiesInvariantRule$1.evaluate(SystemPropertiesInvariantRule.java:55)
[junit4:junit4]    > 	at com.carrotsearch.randomizedtesting.rules.NoShadowingOrOverridesOnMethodsRule$1.evaluate(NoShadowingOrOverridesOnMethodsRule.java:39)
[junit4:junit4]    > 	at com.carrotsearch.randomizedtesting.rules.NoShadowingOrOverridesOnMethodsRule$1.evaluate(NoShadowingOrOverridesOnMethodsRule.java:39)
[junit4:junit4]    > 	at com.carrotsearch.randomizedtesting.rules.StatementAdapter.evaluate(StatementAdapter.java:36)
[junit4:junit4]    > 	at org.apache.lucene.util.TestRuleAssertionsRequired$1.evaluate(TestRuleAssertionsRequired.java:43)
[junit4:junit4]    > 	at org.apache.lucene.util.TestRuleMarkFailure$1.evaluate(TestRuleMarkFailure.java:48)
[junit4:junit4]    > 	at org.apache.lucene.util.TestRuleIgnoreAfterMaxFailures$1.evaluate(TestRuleIgnoreAfterMaxFailures.java:70)
[junit4:junit4]    > 	at org.apache.lucene.util.TestRuleIgnoreTestSuites$1.evaluate(TestRuleIgnoreTestSuites.java:55)
[junit4:junit4]    > 	at com.carrotsearch.randomizedtesting.rules.StatementAdapter.evaluate(StatementAdapter.java:36)
[junit4:junit4]    > 	at com.carrotsearch.randomizedtesting.ThreadLeakControl$StatementRunner.run(ThreadLeakControl.java:358)
[junit4:junit4]    > 	at java.lang.Thread.run(Thread.java:679)
[junit4:junit4]   2> 141756 T1828 oas.SolrTestCaseJ4.deleteCore ###deleteCore
[junit4:junit4]   2> NOTE: test params are: codec=Lucene40: {range_facet_l=MockVariableIntBlock(baseBlockSize=45), text=PostingsFormat(name=Asserting), _version_=MockVariableIntBlock(baseBlockSize=45), rnd_b=PostingsFormat(name=MockSep), intDefault=MockVariableIntBlock(baseBlockSize=45), id=PostingsFormat(name=MockSep), timestamp=MockVariableIntBlock(baseBlockSize=45), a_t=MockVariableIntBlock(baseBlockSize=45), range_facet_sl=PostingsFormat(name=Asserting), range_facet_si=Lucene40(minBlockSize=50 maxBlockSize=124), other_tl1=MockVariableIntBlock(baseBlockSize=45), multiDefault=Lucene40(minBlockSize=50 maxBlockSize=124), a_si=Lucene40(minBlockSize=50 maxBlockSize=124)}, sim=RandomSimilarityProvider(queryNorm=false,coord=crazy): {}, locale=ar_SA, timezone=Pacific/Guam
[junit4:junit4]   2> NOTE: FreeBSD 9.0-RELEASE amd64/Sun Microsystems Inc. 1.6.0_32 (64-bit)/cpus=16,threads=1,free=160080448,total=282394624
[junit4:junit4]   2> NOTE: All tests run in this JVM: [TestReversedWildcardFilterFactory, TestQuerySenderListener, TestUtils, BadIndexSchemaTest, TestDistributedSearch, TestFoldingMultitermQuery, IndexReaderFactoryTest, TermVectorComponentDistributedTest, TestFunctionQuery, TestCharFilters, TestRemoteStreaming, IndexSchemaRuntimeFieldTest, TestSort, TestOmitPositions, ClusterStateUpdateTest, TestUpdate, TestDistributedGrouping, FullSolrCloudDistribCmdsTest, BasicDistributedZk2Test, SolrIndexConfigTest, BasicFunctionalityTest, QueryEqualityTest, EchoParamsTest, FieldMutatingUpdateProcessorTest, TestDocSet, HighlighterTest, ZkNodePropsTest, TestPluginEnable, ScriptEngineTest, TestMultiCoreConfBootstrap, ZkSolrClientTest, TestPropInject, SoftAutoCommitTest, TestArbitraryIndexDir, TestTrie, LukeRequestHandlerTest, RequiredFieldsTest, TestSolrXMLSerializer, TestPropInjectDefaults, UpdateParamsTest, TestStressRecovery, TestRecovery, TestSolrCoreProperties, DocumentBuilderTest, TestSolrDeletionPolicy1, DebugComponentTest, BasicZkTest, TestSurroundQueryParser, PolyFieldTest, LegacyHTMLStripCharFilterTest, PrimitiveFieldTypeTest, IndexSchemaTest, SuggesterTest, TestRealTimeGet, TestWriterPerf, TestCSVLoader, PingRequestHandlerTest, RecoveryZkTest, LeaderElectionTest, TestRandomFaceting, TestCoreContainer, TestFiltering, TestCSVResponseWriter, DisMaxRequestHandlerTest, QueryParsingTest, SolrInfoMBeanTest, XsltUpdateRequestHandlerTest, TestPHPSerializedResponseWriter, TermVectorComponentTest, JsonLoaderTest, DocumentAnalysisRequestHandlerTest, SolrPluginUtilsTest, JSONWriterTest, RequestHandlersTest, CopyFieldTest, LoggingHandlerTest, UniqFieldsUpdateProcessorFactoryTest, ShowFileRequestHandlerTest, TestIndexingPerformance, AlternateDirectoryTest, TestBinaryField, SOLR749Test, TestMergePolicyConfig, TestCollationField, OutputWriterTest, MultiTermTest, TestPhraseSuggestions, TestLMJelinekMercerSimilarityFactory, TestDFRSimilarityFactory, TestCodecSupport, TimeZoneUtilsTest, URLClassifyProcessorTest, TestBadConfig, TestCollationKeyRangeQueries, SyncSliceTest]
[junit4:junit4] Completed on J1 in 141.77s, 1 test, 1 failure <<< FAILURES!

[...truncated 10 lines...]
BUILD FAILED
/usr/home/hudson/hudson-slave/workspace/Lucene-Solr-Tests-4.x-Java6/build.xml:32: The following error occurred while executing this line:
/usr/home/hudson/hudson-slave/workspace/Lucene-Solr-Tests-4.x-Java6/solr/build.xml:179: The following error occurred while executing this line:
/usr/home/hudson/hudson-slave/workspace/Lucene-Solr-Tests-4.x-Java6/lucene/module-build.xml:63: The following error occurred while executing this line:
/usr/home/hudson/hudson-slave/workspace/Lucene-Solr-Tests-4.x-Java6/lucene/common-build.xml:1140: The following error occurred while executing this line:
/usr/home/hudson/hudson-slave/workspace/Lucene-Solr-Tests-4.x-Java6/lucene/common-build.xml:813: There were test failures: 231 suites, 954 tests, 1 failure, 7 ignored (2 assumptions)

Total time: 27 minutes 20 seconds
Build step 'Invoke Ant' marked build as failure
Recording test results
Email was triggered for: Failure
Sending email for trigger: Failure



Mime
View raw message