lucene-dev mailing list archives

Site index · List index
Message view « Date » · « Thread »
Top « Date » · « Thread »
From Policeman Jenkins Server <jenk...@sd-datasolutions.de>
Subject [JENKINS] Lucene-Solr-4.x-Linux (64bit/jdk1.6.0_35) - Build # 958 - Failure!
Date Sat, 08 Sep 2012 19:53:58 GMT
Build: http://jenkins.sd-datasolutions.de/job/Lucene-Solr-4.x-Linux/958/
Java: 64bit/jdk1.6.0_35 -XX:+UseConcMarkSweepGC

1 tests failed.
REGRESSION:  org.apache.lucene.spatial.prefix.TestRecursivePrefixTreeStrategy.geohashRecursiveRandom

Error Message:
Intersects(Circle(Pt(x=-179.99999916180968,y=-2.598389983177185E-6), d=0.0° 0.00km) distErrPct=0.00%)
expected:<20> but was:<19>

Stack Trace:
java.lang.AssertionError: Intersects(Circle(Pt(x=-179.99999916180968,y=-2.598389983177185E-6),
d=0.0° 0.00km) distErrPct=0.00%) expected:<20> but was:<19>
	at __randomizedtesting.SeedInfo.seed([F4BC772AC7054E2D:901C1F7D6305E7C3]:0)
	at org.junit.Assert.fail(Assert.java:93)
	at org.junit.Assert.failNotEquals(Assert.java:647)
	at org.junit.Assert.assertEquals(Assert.java:128)
	at org.junit.Assert.assertEquals(Assert.java:472)
	at org.apache.lucene.spatial.prefix.TestRecursivePrefixTreeStrategy.checkHits(TestRecursivePrefixTreeStrategy.java:190)
	at org.apache.lucene.spatial.prefix.TestRecursivePrefixTreeStrategy.geohashRecursiveRandom(TestRecursivePrefixTreeStrategy.java:152)
	at sun.reflect.NativeMethodAccessorImpl.invoke0(Native Method)
	at sun.reflect.NativeMethodAccessorImpl.invoke(NativeMethodAccessorImpl.java:39)
	at sun.reflect.DelegatingMethodAccessorImpl.invoke(DelegatingMethodAccessorImpl.java:25)
	at java.lang.reflect.Method.invoke(Method.java:597)
	at com.carrotsearch.randomizedtesting.RandomizedRunner.invoke(RandomizedRunner.java:1559)
	at com.carrotsearch.randomizedtesting.RandomizedRunner.access$600(RandomizedRunner.java:79)
	at com.carrotsearch.randomizedtesting.RandomizedRunner$6.evaluate(RandomizedRunner.java:737)
	at com.carrotsearch.randomizedtesting.RandomizedRunner$7.evaluate(RandomizedRunner.java:773)
	at com.carrotsearch.randomizedtesting.RandomizedRunner$8.evaluate(RandomizedRunner.java:787)
	at org.apache.lucene.util.TestRuleSetupTeardownChained$1.evaluate(TestRuleSetupTeardownChained.java:50)
	at org.apache.lucene.util.TestRuleFieldCacheSanity$1.evaluate(TestRuleFieldCacheSanity.java:51)
	at org.apache.lucene.util.AbstractBeforeAfterRule$1.evaluate(AbstractBeforeAfterRule.java:45)
	at com.carrotsearch.randomizedtesting.rules.SystemPropertiesInvariantRule$1.evaluate(SystemPropertiesInvariantRule.java:55)
	at org.apache.lucene.util.TestRuleThreadAndTestName$1.evaluate(TestRuleThreadAndTestName.java:48)
	at org.apache.lucene.util.TestRuleIgnoreAfterMaxFailures$1.evaluate(TestRuleIgnoreAfterMaxFailures.java:70)
	at org.apache.lucene.util.TestRuleMarkFailure$1.evaluate(TestRuleMarkFailure.java:48)
	at com.carrotsearch.randomizedtesting.rules.StatementAdapter.evaluate(StatementAdapter.java:36)
	at com.carrotsearch.randomizedtesting.ThreadLeakControl$StatementRunner.run(ThreadLeakControl.java:358)
	at com.carrotsearch.randomizedtesting.ThreadLeakControl.forkTimeoutingTask(ThreadLeakControl.java:782)
	at com.carrotsearch.randomizedtesting.ThreadLeakControl$3.evaluate(ThreadLeakControl.java:442)
	at com.carrotsearch.randomizedtesting.RandomizedRunner.runSingleTest(RandomizedRunner.java:746)
	at com.carrotsearch.randomizedtesting.RandomizedRunner$3.evaluate(RandomizedRunner.java:648)
	at com.carrotsearch.randomizedtesting.RandomizedRunner$4.evaluate(RandomizedRunner.java:682)
	at com.carrotsearch.randomizedtesting.RandomizedRunner$5.evaluate(RandomizedRunner.java:693)
	at org.apache.lucene.util.AbstractBeforeAfterRule$1.evaluate(AbstractBeforeAfterRule.java:45)
	at org.apache.lucene.util.TestRuleStoreClassName$1.evaluate(TestRuleStoreClassName.java:42)
	at com.carrotsearch.randomizedtesting.rules.SystemPropertiesInvariantRule$1.evaluate(SystemPropertiesInvariantRule.java:55)
	at com.carrotsearch.randomizedtesting.rules.NoShadowingOrOverridesOnMethodsRule$1.evaluate(NoShadowingOrOverridesOnMethodsRule.java:39)
	at com.carrotsearch.randomizedtesting.rules.NoShadowingOrOverridesOnMethodsRule$1.evaluate(NoShadowingOrOverridesOnMethodsRule.java:39)
	at org.apache.lucene.util.TestRuleAssertionsRequired$1.evaluate(TestRuleAssertionsRequired.java:40)
	at org.apache.lucene.util.TestRuleMarkFailure$1.evaluate(TestRuleMarkFailure.java:48)
	at org.apache.lucene.util.TestRuleIgnoreAfterMaxFailures$1.evaluate(TestRuleIgnoreAfterMaxFailures.java:70)
	at org.apache.lucene.util.TestRuleIgnoreTestSuites$1.evaluate(TestRuleIgnoreTestSuites.java:55)
	at com.carrotsearch.randomizedtesting.rules.StatementAdapter.evaluate(StatementAdapter.java:36)
	at com.carrotsearch.randomizedtesting.ThreadLeakControl$StatementRunner.run(ThreadLeakControl.java:358)
	at java.lang.Thread.run(Thread.java:662)




Build Log:
[...truncated 6284 lines...]
[junit4:junit4] Suite: org.apache.lucene.spatial.prefix.TestRecursivePrefixTreeStrategy
[junit4:junit4]   2> 8-set-2012 15:53:52 org.apache.lucene.spatial.StrategyTestCase executeQueries
[junit4:junit4]   2> INFO: testing queried for strategy RecursivePrefixTreeStrategy(prefixGridScanLevel:0,SPG:(GeohashPrefixTree(maxLevels:24,ctx:SpatialContext.GEO)))
[junit4:junit4]   2> 8-set-2012 15:53:53 org.apache.lucene.spatial.StrategyTestCase executeQueries
[junit4:junit4]   2> INFO: testing queried for strategy RecursivePrefixTreeStrategy(prefixGridScanLevel:1,SPG:(GeohashPrefixTree(maxLevels:24,ctx:SpatialContext.GEO)))
[junit4:junit4]   2> 8-set-2012 15:53:53 org.apache.lucene.spatial.StrategyTestCase executeQueries
[junit4:junit4]   2> INFO: testing queried for strategy RecursivePrefixTreeStrategy(prefixGridScanLevel:2,SPG:(GeohashPrefixTree(maxLevels:24,ctx:SpatialContext.GEO)))
[junit4:junit4]   2> 8-set-2012 15:53:53 org.apache.lucene.spatial.StrategyTestCase executeQueries
[junit4:junit4]   2> INFO: testing queried for strategy RecursivePrefixTreeStrategy(prefixGridScanLevel:3,SPG:(GeohashPrefixTree(maxLevels:24,ctx:SpatialContext.GEO)))
[junit4:junit4]   2> 8-set-2012 15:53:53 org.apache.lucene.spatial.StrategyTestCase executeQueries
[junit4:junit4]   2> INFO: testing queried for strategy RecursivePrefixTreeStrategy(prefixGridScanLevel:4,SPG:(GeohashPrefixTree(maxLevels:24,ctx:SpatialContext.GEO)))
[junit4:junit4]   2> 8-set-2012 15:53:53 org.apache.lucene.spatial.StrategyTestCase executeQueries
[junit4:junit4]   2> INFO: testing queried for strategy RecursivePrefixTreeStrategy(prefixGridScanLevel:5,SPG:(GeohashPrefixTree(maxLevels:24,ctx:SpatialContext.GEO)))
[junit4:junit4]   2> 8-set-2012 15:53:53 org.apache.lucene.spatial.StrategyTestCase executeQueries
[junit4:junit4]   2> INFO: testing queried for strategy RecursivePrefixTreeStrategy(prefixGridScanLevel:6,SPG:(GeohashPrefixTree(maxLevels:24,ctx:SpatialContext.GEO)))
[junit4:junit4]   2> 8-set-2012 15:53:53 org.apache.lucene.spatial.StrategyTestCase executeQueries
[junit4:junit4]   2> INFO: testing queried for strategy RecursivePrefixTreeStrategy(prefixGridScanLevel:7,SPG:(GeohashPrefixTree(maxLevels:24,ctx:SpatialContext.GEO)))
[junit4:junit4]   2> 8-set-2012 15:53:53 org.apache.lucene.spatial.StrategyTestCase executeQueries
[junit4:junit4]   2> INFO: testing queried for strategy RecursivePrefixTreeStrategy(prefixGridScanLevel:8,SPG:(GeohashPrefixTree(maxLevels:24,ctx:SpatialContext.GEO)))
[junit4:junit4]   2> 8-set-2012 15:53:53 org.apache.lucene.spatial.StrategyTestCase executeQueries
[junit4:junit4]   2> INFO: testing queried for strategy RecursivePrefixTreeStrategy(prefixGridScanLevel:9,SPG:(GeohashPrefixTree(maxLevels:24,ctx:SpatialContext.GEO)))
[junit4:junit4]   2> 8-set-2012 15:53:53 org.apache.lucene.spatial.StrategyTestCase executeQueries
[junit4:junit4]   2> INFO: testing queried for strategy RecursivePrefixTreeStrategy(prefixGridScanLevel:10,SPG:(GeohashPrefixTree(maxLevels:24,ctx:SpatialContext.GEO)))
[junit4:junit4]   2> 8-set-2012 15:53:53 org.apache.lucene.spatial.StrategyTestCase executeQueries
[junit4:junit4]   2> INFO: testing queried for strategy RecursivePrefixTreeStrategy(prefixGridScanLevel:11,SPG:(GeohashPrefixTree(maxLevels:24,ctx:SpatialContext.GEO)))
[junit4:junit4]   2> 8-set-2012 15:53:53 org.apache.lucene.spatial.StrategyTestCase executeQueries
[junit4:junit4]   2> INFO: testing queried for strategy RecursivePrefixTreeStrategy(prefixGridScanLevel:12,SPG:(GeohashPrefixTree(maxLevels:24,ctx:SpatialContext.GEO)))
[junit4:junit4]   2> 8-set-2012 15:53:53 org.apache.lucene.spatial.StrategyTestCase executeQueries
[junit4:junit4]   2> INFO: testing queried for strategy RecursivePrefixTreeStrategy(prefixGridScanLevel:13,SPG:(GeohashPrefixTree(maxLevels:24,ctx:SpatialContext.GEO)))
[junit4:junit4]   2> 8-set-2012 15:53:53 org.apache.lucene.spatial.StrategyTestCase executeQueries
[junit4:junit4]   2> INFO: testing queried for strategy RecursivePrefixTreeStrategy(prefixGridScanLevel:14,SPG:(GeohashPrefixTree(maxLevels:24,ctx:SpatialContext.GEO)))
[junit4:junit4]   2> 8-set-2012 15:53:53 org.apache.lucene.spatial.StrategyTestCase executeQueries
[junit4:junit4]   2> INFO: testing queried for strategy RecursivePrefixTreeStrategy(prefixGridScanLevel:15,SPG:(GeohashPrefixTree(maxLevels:24,ctx:SpatialContext.GEO)))
[junit4:junit4]   2> 8-set-2012 15:53:53 org.apache.lucene.spatial.StrategyTestCase executeQueries
[junit4:junit4]   2> INFO: testing queried for strategy RecursivePrefixTreeStrategy(prefixGridScanLevel:16,SPG:(GeohashPrefixTree(maxLevels:24,ctx:SpatialContext.GEO)))
[junit4:junit4]   2> 8-set-2012 15:53:53 org.apache.lucene.spatial.StrategyTestCase executeQueries
[junit4:junit4]   2> INFO: testing queried for strategy RecursivePrefixTreeStrategy(prefixGridScanLevel:17,SPG:(GeohashPrefixTree(maxLevels:24,ctx:SpatialContext.GEO)))
[junit4:junit4]   2> 8-set-2012 15:53:53 org.apache.lucene.spatial.StrategyTestCase executeQueries
[junit4:junit4]   2> INFO: testing queried for strategy RecursivePrefixTreeStrategy(prefixGridScanLevel:18,SPG:(GeohashPrefixTree(maxLevels:24,ctx:SpatialContext.GEO)))
[junit4:junit4]   2> 8-set-2012 15:53:53 org.apache.lucene.spatial.StrategyTestCase executeQueries
[junit4:junit4]   2> INFO: testing queried for strategy RecursivePrefixTreeStrategy(prefixGridScanLevel:19,SPG:(GeohashPrefixTree(maxLevels:24,ctx:SpatialContext.GEO)))
[junit4:junit4]   2> 8-set-2012 15:53:53 org.apache.lucene.spatial.StrategyTestCase executeQueries
[junit4:junit4]   2> INFO: testing queried for strategy RecursivePrefixTreeStrategy(prefixGridScanLevel:20,SPG:(GeohashPrefixTree(maxLevels:24,ctx:SpatialContext.GEO)))
[junit4:junit4]   2> 8-set-2012 15:53:53 org.apache.lucene.spatial.StrategyTestCase executeQueries
[junit4:junit4]   2> INFO: testing queried for strategy RecursivePrefixTreeStrategy(prefixGridScanLevel:21,SPG:(GeohashPrefixTree(maxLevels:24,ctx:SpatialContext.GEO)))
[junit4:junit4]   2> 8-set-2012 15:53:53 org.apache.lucene.spatial.StrategyTestCase executeQueries
[junit4:junit4]   2> INFO: testing queried for strategy RecursivePrefixTreeStrategy(prefixGridScanLevel:22,SPG:(GeohashPrefixTree(maxLevels:24,ctx:SpatialContext.GEO)))
[junit4:junit4]   2> 8-set-2012 15:53:53 org.apache.lucene.spatial.StrategyTestCase executeQueries
[junit4:junit4]   2> INFO: testing queried for strategy RecursivePrefixTreeStrategy(prefixGridScanLevel:23,SPG:(GeohashPrefixTree(maxLevels:24,ctx:SpatialContext.GEO)))
[junit4:junit4]   2> 8-set-2012 15:53:53 org.apache.lucene.spatial.StrategyTestCase executeQueries
[junit4:junit4]   2> INFO: testing queried for strategy RecursivePrefixTreeStrategy(prefixGridScanLevel:24,SPG:(GeohashPrefixTree(maxLevels:24,ctx:SpatialContext.GEO)))
[junit4:junit4]   2> NOTE: reproduce with: ant test  -Dtestcase=TestRecursivePrefixTreeStrategy
-Dtests.method=geohashRecursiveRandom -Dtests.seed=F4BC772AC7054E2D -Dtests.multiplier=3 -Dtests.slow=true
-Dtests.locale=it_CH -Dtests.timezone=America/Cuiaba -Dtests.file.encoding=UTF-8
[junit4:junit4] FAILURE 0.21s J1 | TestRecursivePrefixTreeStrategy.geohashRecursiveRandom
<<<
[junit4:junit4]    > Throwable #1: java.lang.AssertionError: Intersects(Circle(Pt(x=-179.99999916180968,y=-2.598389983177185E-6),
d=0.0° 0.00km) distErrPct=0.00%) expected:<20> but was:<19>
[junit4:junit4]    > 	at __randomizedtesting.SeedInfo.seed([F4BC772AC7054E2D:901C1F7D6305E7C3]:0)
[junit4:junit4]    > 	at org.junit.Assert.fail(Assert.java:93)
[junit4:junit4]    > 	at org.junit.Assert.failNotEquals(Assert.java:647)
[junit4:junit4]    > 	at org.junit.Assert.assertEquals(Assert.java:128)
[junit4:junit4]    > 	at org.junit.Assert.assertEquals(Assert.java:472)
[junit4:junit4]    > 	at org.apache.lucene.spatial.prefix.TestRecursivePrefixTreeStrategy.checkHits(TestRecursivePrefixTreeStrategy.java:190)
[junit4:junit4]    > 	at org.apache.lucene.spatial.prefix.TestRecursivePrefixTreeStrategy.geohashRecursiveRandom(TestRecursivePrefixTreeStrategy.java:152)
[junit4:junit4]    > 	at sun.reflect.NativeMethodAccessorImpl.invoke0(Native Method)
[junit4:junit4]    > 	at sun.reflect.NativeMethodAccessorImpl.invoke(NativeMethodAccessorImpl.java:39)
[junit4:junit4]    > 	at sun.reflect.DelegatingMethodAccessorImpl.invoke(DelegatingMethodAccessorImpl.java:25)
[junit4:junit4]    > 	at java.lang.reflect.Method.invoke(Method.java:597)
[junit4:junit4]    > 	at com.carrotsearch.randomizedtesting.RandomizedRunner.invoke(RandomizedRunner.java:1559)
[junit4:junit4]    > 	at com.carrotsearch.randomizedtesting.RandomizedRunner.access$600(RandomizedRunner.java:79)
[junit4:junit4]    > 	at com.carrotsearch.randomizedtesting.RandomizedRunner$6.evaluate(RandomizedRunner.java:737)
[junit4:junit4]    > 	at com.carrotsearch.randomizedtesting.RandomizedRunner$7.evaluate(RandomizedRunner.java:773)
[junit4:junit4]    > 	at com.carrotsearch.randomizedtesting.RandomizedRunner$8.evaluate(RandomizedRunner.java:787)
[junit4:junit4]    > 	at org.apache.lucene.util.TestRuleSetupTeardownChained$1.evaluate(TestRuleSetupTeardownChained.java:50)
[junit4:junit4]    > 	at org.apache.lucene.util.TestRuleFieldCacheSanity$1.evaluate(TestRuleFieldCacheSanity.java:51)
[junit4:junit4]    > 	at org.apache.lucene.util.AbstractBeforeAfterRule$1.evaluate(AbstractBeforeAfterRule.java:45)
[junit4:junit4]    > 	at com.carrotsearch.randomizedtesting.rules.SystemPropertiesInvariantRule$1.evaluate(SystemPropertiesInvariantRule.java:55)
[junit4:junit4]    > 	at org.apache.lucene.util.TestRuleThreadAndTestName$1.evaluate(TestRuleThreadAndTestName.java:48)
[junit4:junit4]    > 	at org.apache.lucene.util.TestRuleIgnoreAfterMaxFailures$1.evaluate(TestRuleIgnoreAfterMaxFailures.java:70)
[junit4:junit4]    > 	at org.apache.lucene.util.TestRuleMarkFailure$1.evaluate(TestRuleMarkFailure.java:48)
[junit4:junit4]    > 	at com.carrotsearch.randomizedtesting.rules.StatementAdapter.evaluate(StatementAdapter.java:36)
[junit4:junit4]    > 	at com.carrotsearch.randomizedtesting.ThreadLeakControl$StatementRunner.run(ThreadLeakControl.java:358)
[junit4:junit4]    > 	at com.carrotsearch.randomizedtesting.ThreadLeakControl.forkTimeoutingTask(ThreadLeakControl.java:782)
[junit4:junit4]    > 	at com.carrotsearch.randomizedtesting.ThreadLeakControl$3.evaluate(ThreadLeakControl.java:442)
[junit4:junit4]    > 	at com.carrotsearch.randomizedtesting.RandomizedRunner.runSingleTest(RandomizedRunner.java:746)
[junit4:junit4]    > 	at com.carrotsearch.randomizedtesting.RandomizedRunner$3.evaluate(RandomizedRunner.java:648)
[junit4:junit4]    > 	at com.carrotsearch.randomizedtesting.RandomizedRunner$4.evaluate(RandomizedRunner.java:682)
[junit4:junit4]    > 	at com.carrotsearch.randomizedtesting.RandomizedRunner$5.evaluate(RandomizedRunner.java:693)
[junit4:junit4]    > 	at org.apache.lucene.util.AbstractBeforeAfterRule$1.evaluate(AbstractBeforeAfterRule.java:45)
[junit4:junit4]    > 	at org.apache.lucene.util.TestRuleStoreClassName$1.evaluate(TestRuleStoreClassName.java:42)
[junit4:junit4]    > 	at com.carrotsearch.randomizedtesting.rules.SystemPropertiesInvariantRule$1.evaluate(SystemPropertiesInvariantRule.java:55)
[junit4:junit4]    > 	at com.carrotsearch.randomizedtesting.rules.NoShadowingOrOverridesOnMethodsRule$1.evaluate(NoShadowingOrOverridesOnMethodsRule.java:39)
[junit4:junit4]    > 	at com.carrotsearch.randomizedtesting.rules.NoShadowingOrOverridesOnMethodsRule$1.evaluate(NoShadowingOrOverridesOnMethodsRule.java:39)
[junit4:junit4]    > 	at org.apache.lucene.util.TestRuleAssertionsRequired$1.evaluate(TestRuleAssertionsRequired.java:40)
[junit4:junit4]    > 	at org.apache.lucene.util.TestRuleMarkFailure$1.evaluate(TestRuleMarkFailure.java:48)
[junit4:junit4]    > 	at org.apache.lucene.util.TestRuleIgnoreAfterMaxFailures$1.evaluate(TestRuleIgnoreAfterMaxFailures.java:70)
[junit4:junit4]    > 	at org.apache.lucene.util.TestRuleIgnoreTestSuites$1.evaluate(TestRuleIgnoreTestSuites.java:55)
[junit4:junit4]    > 	at com.carrotsearch.randomizedtesting.rules.StatementAdapter.evaluate(StatementAdapter.java:36)
[junit4:junit4]    > 	at com.carrotsearch.randomizedtesting.ThreadLeakControl$StatementRunner.run(ThreadLeakControl.java:358)
[junit4:junit4]    > 	at java.lang.Thread.run(Thread.java:662)
[junit4:junit4]   2> NOTE: test params are: codec=Lucene40: {id=PostingsFormat(name=Direct),
name=PostingsFormat(name=Direct), TestRecursivePrefixTreeStrategy=PostingsFormat(name=Direct)},
sim=DefaultSimilarity, locale=it_CH, timezone=America/Cuiaba
[junit4:junit4]   2> NOTE: Linux 3.2.0-29-generic amd64/Sun Microsystems Inc. 1.6.0_35
(64-bit)/cpus=8,threads=1,free=27658080,total=85000192
[junit4:junit4]   2> NOTE: All tests run in this JVM: [SpatialArgsParserTest, TestTermQueryPrefixGridStrategy,
TestTestFramework, TestRecursivePrefixTreeStrategy]
[junit4:junit4] Completed on J1 in 5.50s, 4 tests, 1 failure <<< FAILURES!

[...truncated 11 lines...]
BUILD FAILED
/mnt/ssd/jenkins/workspace/Lucene-Solr-4.x-Linux/build.xml:29: The following error occurred
while executing this line:
/mnt/ssd/jenkins/workspace/Lucene-Solr-4.x-Linux/lucene/build.xml:492: The following error
occurred while executing this line:
/mnt/ssd/jenkins/workspace/Lucene-Solr-4.x-Linux/lucene/common-build.xml:1569: The following
error occurred while executing this line:
/mnt/ssd/jenkins/workspace/Lucene-Solr-4.x-Linux/lucene/module-build.xml:63: The following
error occurred while executing this line:
/mnt/ssd/jenkins/workspace/Lucene-Solr-4.x-Linux/lucene/common-build.xml:1133: The following
error occurred while executing this line:
/mnt/ssd/jenkins/workspace/Lucene-Solr-4.x-Linux/lucene/common-build.xml:810: There were test
failures: 7 suites, 17 tests, 1 failure

Total time: 16 minutes 13 seconds
Build step 'Invoke Ant' marked build as failure
Recording test results
Description set: Java: 64bit/jdk1.6.0_35 -XX:+UseConcMarkSweepGC
Email was triggered for: Failure
Sending email for trigger: Failure



Mime
View raw message