lucene-dev mailing list archives

Site index · List index
Message view « Date » · « Thread »
Top « Date » · « Thread »
From Apache Jenkins Server <jenk...@builds.apache.org>
Subject [JENKINS] Lucene-Solr-Tests-4.x-java7 - Build # 454 - Failure
Date Sun, 16 Sep 2012 01:27:02 GMT
Build: https://builds.apache.org/job/Lucene-Solr-Tests-4.x-java7/454/

1 tests failed.
REGRESSION:  org.apache.solr.cloud.BasicDistributedZk2Test.testDistribSearch

Error Message:
Shard still reported as live in zk

Stack Trace:
java.lang.AssertionError: Shard still reported as live in zk
	at __randomizedtesting.SeedInfo.seed([DB75CD57BD29AEE0:5A93434FCA76CEDC]:0)
	at org.junit.Assert.fail(Assert.java:93)
	at org.apache.solr.cloud.AbstractFullDistribZkTestBase.waitToSeeNotLive(AbstractFullDistribZkTestBase.java:1220)
	at org.apache.solr.cloud.BasicDistributedZk2Test.brindDownShardIndexSomeDocsAndRecover(BasicDistributedZk2Test.java:190)
	at org.apache.solr.cloud.BasicDistributedZk2Test.doTest(BasicDistributedZk2Test.java:83)
	at org.apache.solr.BaseDistributedSearchTestCase.testDistribSearch(BaseDistributedSearchTestCase.java:695)
	at sun.reflect.NativeMethodAccessorImpl.invoke0(Native Method)
	at sun.reflect.NativeMethodAccessorImpl.invoke(NativeMethodAccessorImpl.java:57)
	at sun.reflect.DelegatingMethodAccessorImpl.invoke(DelegatingMethodAccessorImpl.java:43)
	at java.lang.reflect.Method.invoke(Method.java:601)
	at com.carrotsearch.randomizedtesting.RandomizedRunner.invoke(RandomizedRunner.java:1559)
	at com.carrotsearch.randomizedtesting.RandomizedRunner.access$600(RandomizedRunner.java:79)
	at com.carrotsearch.randomizedtesting.RandomizedRunner$6.evaluate(RandomizedRunner.java:737)
	at com.carrotsearch.randomizedtesting.RandomizedRunner$7.evaluate(RandomizedRunner.java:773)
	at com.carrotsearch.randomizedtesting.RandomizedRunner$8.evaluate(RandomizedRunner.java:787)
	at com.carrotsearch.randomizedtesting.rules.SystemPropertiesRestoreRule$1.evaluate(SystemPropertiesRestoreRule.java:53)
	at org.apache.lucene.util.TestRuleSetupTeardownChained$1.evaluate(TestRuleSetupTeardownChained.java:50)
	at org.apache.lucene.util.TestRuleFieldCacheSanity$1.evaluate(TestRuleFieldCacheSanity.java:51)
	at org.apache.lucene.util.AbstractBeforeAfterRule$1.evaluate(AbstractBeforeAfterRule.java:45)
	at com.carrotsearch.randomizedtesting.rules.SystemPropertiesInvariantRule$1.evaluate(SystemPropertiesInvariantRule.java:55)
	at org.apache.lucene.util.TestRuleThreadAndTestName$1.evaluate(TestRuleThreadAndTestName.java:48)
	at org.apache.lucene.util.TestRuleIgnoreAfterMaxFailures$1.evaluate(TestRuleIgnoreAfterMaxFailures.java:70)
	at org.apache.lucene.util.TestRuleMarkFailure$1.evaluate(TestRuleMarkFailure.java:48)
	at com.carrotsearch.randomizedtesting.rules.StatementAdapter.evaluate(StatementAdapter.java:36)
	at com.carrotsearch.randomizedtesting.ThreadLeakControl$StatementRunner.run(ThreadLeakControl.java:358)
	at com.carrotsearch.randomizedtesting.ThreadLeakControl.forkTimeoutingTask(ThreadLeakControl.java:782)
	at com.carrotsearch.randomizedtesting.ThreadLeakControl$3.evaluate(ThreadLeakControl.java:442)
	at com.carrotsearch.randomizedtesting.RandomizedRunner.runSingleTest(RandomizedRunner.java:746)
	at com.carrotsearch.randomizedtesting.RandomizedRunner$3.evaluate(RandomizedRunner.java:648)
	at com.carrotsearch.randomizedtesting.RandomizedRunner$4.evaluate(RandomizedRunner.java:682)
	at com.carrotsearch.randomizedtesting.RandomizedRunner$5.evaluate(RandomizedRunner.java:693)
	at com.carrotsearch.randomizedtesting.rules.StatementAdapter.evaluate(StatementAdapter.java:36)
	at com.carrotsearch.randomizedtesting.rules.SystemPropertiesRestoreRule$1.evaluate(SystemPropertiesRestoreRule.java:53)
	at org.apache.lucene.util.AbstractBeforeAfterRule$1.evaluate(AbstractBeforeAfterRule.java:45)
	at org.apache.lucene.util.TestRuleStoreClassName$1.evaluate(TestRuleStoreClassName.java:42)
	at com.carrotsearch.randomizedtesting.rules.SystemPropertiesInvariantRule$1.evaluate(SystemPropertiesInvariantRule.java:55)
	at com.carrotsearch.randomizedtesting.rules.NoShadowingOrOverridesOnMethodsRule$1.evaluate(NoShadowingOrOverridesOnMethodsRule.java:39)
	at com.carrotsearch.randomizedtesting.rules.NoShadowingOrOverridesOnMethodsRule$1.evaluate(NoShadowingOrOverridesOnMethodsRule.java:39)
	at com.carrotsearch.randomizedtesting.rules.StatementAdapter.evaluate(StatementAdapter.java:36)
	at org.apache.lucene.util.TestRuleAssertionsRequired$1.evaluate(TestRuleAssertionsRequired.java:43)
	at org.apache.lucene.util.TestRuleMarkFailure$1.evaluate(TestRuleMarkFailure.java:48)
	at org.apache.lucene.util.TestRuleIgnoreAfterMaxFailures$1.evaluate(TestRuleIgnoreAfterMaxFailures.java:70)
	at org.apache.lucene.util.TestRuleIgnoreTestSuites$1.evaluate(TestRuleIgnoreTestSuites.java:55)
	at com.carrotsearch.randomizedtesting.rules.StatementAdapter.evaluate(StatementAdapter.java:36)
	at com.carrotsearch.randomizedtesting.ThreadLeakControl$StatementRunner.run(ThreadLeakControl.java:358)
	at java.lang.Thread.run(Thread.java:722)




Build Log:
[...truncated 8285 lines...]
[junit4:junit4] Suite: org.apache.solr.cloud.BasicDistributedZk2Test
[junit4:junit4]   2> 3043 T3 oasc.SolrCore.finalize SEVERE REFCOUNT ERROR: unreferenced org.apache.solr.core.SolrCore@6add21fb (collection1) has a reference count of 1
[junit4:junit4]   2> 3043 T3 oasc.CoreContainer.finalize SEVERE CoreContainer was not shutdown prior to finalize(), indicates a bug -- POSSIBLE RESOURCE LEAK!!!  instance=762581291
[junit4:junit4]   2> 3043 T3 oasc.CoreContainer.finalize SEVERE CoreContainer was not shutdown prior to finalize(), indicates a bug -- POSSIBLE RESOURCE LEAK!!!  instance=1830461938
[junit4:junit4]   2> 3043 T3 oasc.CoreContainer.finalize SEVERE CoreContainer was not shutdown prior to finalize(), indicates a bug -- POSSIBLE RESOURCE LEAK!!!  instance=1570066267
[junit4:junit4]   2> 3 T2264 oas.SolrTestCaseJ4.setUp ###Starting testDistribSearch
[junit4:junit4]   2> Creating dataDir: /usr/home/hudson/hudson-slave/workspace/Lucene-Solr-Tests-4.x-java7/solr/build/solr-core/test/J1/./solrtest-BasicDistributedZk2Test-1347758510162
[junit4:junit4]   2> 4 T2264 oasc.ZkTestServer.run STARTING ZK TEST SERVER
[junit4:junit4]   2> 7 T2265 oazs.ZooKeeperServer.setTickTime tickTime set to 1000
[junit4:junit4]   2> 8 T2265 oazs.NIOServerCnxn$Factory.<init> binding to port 0.0.0.0/0.0.0.0:0
[junit4:junit4]   2> 9 T2265 oazsp.FileTxnSnapLog.save Snapshotting: 0
[junit4:junit4]   2> 105 T2264 oasc.ZkTestServer.run start zk server on port:49230
[junit4:junit4]   2> 105 T2264 oaz.ZooKeeper.<init> Initiating client connection, connectString=127.0.0.1:49230 sessionTimeout=10000 watcher=org.apache.solr.common.cloud.ConnectionManager@4a462d1b
[junit4:junit4]   2> 106 T2270 oaz.ClientCnxn$SendThread.startConnect Opening socket connection to server /127.0.0.1:49230
[junit4:junit4]   2> 106 T2264 oascc.ConnectionManager.waitForConnected Waiting for client to connect to ZooKeeper
[junit4:junit4]   2> 107 T2270 oaz.ClientCnxn$SendThread.primeConnection Socket connection established to localhost/127.0.0.1:49230, initiating session
[junit4:junit4]   2> 107 T2266 oazs.NIOServerCnxn$Factory.run Accepted socket connection from /140.211.11.196:49232
[junit4:junit4]   2> 107 T2266 oazs.NIOServerCnxn.readConnectRequest Client attempting to establish new session at /140.211.11.196:49232
[junit4:junit4]   2> 107 T2268 oazsp.FileTxnLog.append Creating new log file: log.1
[junit4:junit4]   2> 110 T2268 oazs.NIOServerCnxn.finishSessionInit Established session 0x139ccaad0590000 with negotiated timeout 10000 for client /140.211.11.196:49232
[junit4:junit4]   2> 110 T2270 oaz.ClientCnxn$SendThread.readConnectResult Session establishment complete on server localhost/127.0.0.1:49230, sessionid = 0x139ccaad0590000, negotiated timeout = 10000
[junit4:junit4]   2> 111 T2271 oascc.ConnectionManager.process Watcher org.apache.solr.common.cloud.ConnectionManager@4a462d1b name:ZooKeeperConnection Watcher:127.0.0.1:49230 got event WatchedEvent state:SyncConnected type:None path:null path:null type:None
[junit4:junit4]   2> 111 T2264 oascc.ConnectionManager.waitForConnected Client is connected to ZooKeeper
[junit4:junit4]   2> 111 T2264 oascc.SolrZkClient.makePath makePath: /solr
[junit4:junit4]   2> 113 T2269 oazs.PrepRequestProcessor.pRequest Processed session termination for sessionid: 0x139ccaad0590000
[junit4:junit4]   2> 123 T2271 oaz.ClientCnxn$EventThread.run EventThread shut down
[junit4:junit4]   2> 123 T2266 oazs.NIOServerCnxn.closeSock Closed socket connection for client /140.211.11.196:49232 which had sessionid 0x139ccaad0590000
[junit4:junit4]   2> 123 T2264 oaz.ZooKeeper.close Session: 0x139ccaad0590000 closed
[junit4:junit4]   2> 123 T2264 oaz.ZooKeeper.<init> Initiating client connection, connectString=127.0.0.1:49230/solr sessionTimeout=10000 watcher=org.apache.solr.common.cloud.ConnectionManager@14116d4a
[junit4:junit4]   2> 124 T2272 oaz.ClientCnxn$SendThread.startConnect Opening socket connection to server /127.0.0.1:49230
[junit4:junit4]   2> 124 T2264 oascc.ConnectionManager.waitForConnected Waiting for client to connect to ZooKeeper
[junit4:junit4]   2> 125 T2272 oaz.ClientCnxn$SendThread.primeConnection Socket connection established to localhost/127.0.0.1:49230, initiating session
[junit4:junit4]   2> 125 T2266 oazs.NIOServerCnxn$Factory.run Accepted socket connection from /140.211.11.196:49233
[junit4:junit4]   2> 125 T2266 oazs.NIOServerCnxn.readConnectRequest Client attempting to establish new session at /140.211.11.196:49233
[junit4:junit4]   2> 127 T2268 oazs.NIOServerCnxn.finishSessionInit Established session 0x139ccaad0590001 with negotiated timeout 10000 for client /140.211.11.196:49233
[junit4:junit4]   2> 127 T2272 oaz.ClientCnxn$SendThread.readConnectResult Session establishment complete on server localhost/127.0.0.1:49230, sessionid = 0x139ccaad0590001, negotiated timeout = 10000
[junit4:junit4]   2> 127 T2273 oascc.ConnectionManager.process Watcher org.apache.solr.common.cloud.ConnectionManager@14116d4a name:ZooKeeperConnection Watcher:127.0.0.1:49230/solr got event WatchedEvent state:SyncConnected type:None path:null path:null type:None
[junit4:junit4]   2> 127 T2264 oascc.ConnectionManager.waitForConnected Client is connected to ZooKeeper
[junit4:junit4]   2> 128 T2264 oascc.SolrZkClient.makePath makePath: /collections/collection1
[junit4:junit4]   2> 135 T2264 oascc.SolrZkClient.makePath makePath: /collections/collection1/shards
[junit4:junit4]   2> 137 T2264 oascc.SolrZkClient.makePath makePath: /collections/control_collection
[junit4:junit4]   2> 147 T2264 oascc.SolrZkClient.makePath makePath: /collections/control_collection/shards
[junit4:junit4]   2> 149 T2264 oasc.AbstractZkTestCase.putConfig put /usr/home/hudson/hudson-slave/workspace/Lucene-Solr-Tests-4.x-java7/solr/build/solr-core/test-files/solr/collection1/conf/solrconfig.xml to /configs/conf1/solrconfig.xml
[junit4:junit4]   2> 150 T2264 oascc.SolrZkClient.makePath makePath: /configs/conf1/solrconfig.xml
[junit4:junit4]   2> 162 T2264 oasc.AbstractZkTestCase.putConfig put /usr/home/hudson/hudson-slave/workspace/Lucene-Solr-Tests-4.x-java7/solr/build/solr-core/test-files/solr/collection1/conf/schema.xml to /configs/conf1/schema.xml
[junit4:junit4]   2> 163 T2264 oascc.SolrZkClient.makePath makePath: /configs/conf1/schema.xml
[junit4:junit4]   2> 266 T2264 oasc.AbstractZkTestCase.putConfig put /usr/home/hudson/hudson-slave/workspace/Lucene-Solr-Tests-4.x-java7/solr/build/solr-core/test-files/solr/collection1/conf/solrconfig.xml to /configs/conf1/solrconfig.xml
[junit4:junit4]   2> 267 T2264 oascc.SolrZkClient.makePath makePath: /configs/conf1/solrconfig.xml
[junit4:junit4]   2> 270 T2264 oasc.AbstractZkTestCase.putConfig put /usr/home/hudson/hudson-slave/workspace/Lucene-Solr-Tests-4.x-java7/solr/build/solr-core/test-files/solr/collection1/conf/stopwords.txt to /configs/conf1/stopwords.txt
[junit4:junit4]   2> 270 T2264 oascc.SolrZkClient.makePath makePath: /configs/conf1/stopwords.txt
[junit4:junit4]   2> 280 T2264 oasc.AbstractZkTestCase.putConfig put /usr/home/hudson/hudson-slave/workspace/Lucene-Solr-Tests-4.x-java7/solr/build/solr-core/test-files/solr/collection1/conf/protwords.txt to /configs/conf1/protwords.txt
[junit4:junit4]   2> 280 T2264 oascc.SolrZkClient.makePath makePath: /configs/conf1/protwords.txt
[junit4:junit4]   2> 283 T2264 oasc.AbstractZkTestCase.putConfig put /usr/home/hudson/hudson-slave/workspace/Lucene-Solr-Tests-4.x-java7/solr/build/solr-core/test-files/solr/collection1/conf/currency.xml to /configs/conf1/currency.xml
[junit4:junit4]   2> 283 T2264 oascc.SolrZkClient.makePath makePath: /configs/conf1/currency.xml
[junit4:junit4]   2> 285 T2264 oasc.AbstractZkTestCase.putConfig put /usr/home/hudson/hudson-slave/workspace/Lucene-Solr-Tests-4.x-java7/solr/build/solr-core/test-files/solr/collection1/conf/open-exchange-rates.json to /configs/conf1/open-exchange-rates.json
[junit4:junit4]   2> 286 T2264 oascc.SolrZkClient.makePath makePath: /configs/conf1/open-exchange-rates.json
[junit4:junit4]   2> 294 T2264 oasc.AbstractZkTestCase.putConfig put /usr/home/hudson/hudson-slave/workspace/Lucene-Solr-Tests-4.x-java7/solr/build/solr-core/test-files/solr/collection1/conf/mapping-ISOLatin1Accent.txt to /configs/conf1/mapping-ISOLatin1Accent.txt
[junit4:junit4]   2> 294 T2264 oascc.SolrZkClient.makePath makePath: /configs/conf1/mapping-ISOLatin1Accent.txt
[junit4:junit4]   2> 296 T2264 oasc.AbstractZkTestCase.putConfig put /usr/home/hudson/hudson-slave/workspace/Lucene-Solr-Tests-4.x-java7/solr/build/solr-core/test-files/solr/collection1/conf/old_synonyms.txt to /configs/conf1/old_synonyms.txt
[junit4:junit4]   2> 297 T2264 oascc.SolrZkClient.makePath makePath: /configs/conf1/old_synonyms.txt
[junit4:junit4]   2> 299 T2264 oasc.AbstractZkTestCase.putConfig put /usr/home/hudson/hudson-slave/workspace/Lucene-Solr-Tests-4.x-java7/solr/build/solr-core/test-files/solr/collection1/conf/synonyms.txt to /configs/conf1/synonyms.txt
[junit4:junit4]   2> 300 T2264 oascc.SolrZkClient.makePath makePath: /configs/conf1/synonyms.txt
[junit4:junit4]   2> 307 T2269 oazs.PrepRequestProcessor.pRequest Processed session termination for sessionid: 0x139ccaad0590001
[junit4:junit4]   2> 308 T2273 oaz.ClientCnxn$EventThread.run EventThread shut down
[junit4:junit4]   2> 308 T2264 oaz.ZooKeeper.close Session: 0x139ccaad0590001 closed
[junit4:junit4]   2> 308 T2266 oazs.NIOServerCnxn.closeSock Closed socket connection for client /140.211.11.196:49233 which had sessionid 0x139ccaad0590001
[junit4:junit4]   2> 309 T2264 oejs.Server.doStart jetty-8.1.2.v20120308
[junit4:junit4]   2> 314 T2264 oejs.AbstractConnector.doStart Started SocketConnector@0.0.0.0:49236
[junit4:junit4]   2> 314 T2264 oasc.SolrResourceLoader.locateSolrHome JNDI not configured for solr (NoInitialContextEx)
[junit4:junit4]   2> 315 T2264 oasc.SolrResourceLoader.locateSolrHome using system property solr.solr.home: /usr/home/hudson/hudson-slave/workspace/Lucene-Solr-Tests-4.x-java7/solr/build/solr-core/test-files/solr
[junit4:junit4]   2> 315 T2264 oasc.SolrResourceLoader.<init> new SolrResourceLoader for deduced Solr Home: '/usr/home/hudson/hudson-slave/workspace/Lucene-Solr-Tests-4.x-java7/solr/build/solr-core/test-files/solr/'
[junit4:junit4]   2> 342 T2264 oass.SolrDispatchFilter.init SolrDispatchFilter.init()
[junit4:junit4]   2> 343 T2264 oasc.SolrResourceLoader.locateSolrHome JNDI not configured for solr (NoInitialContextEx)
[junit4:junit4]   2> 343 T2264 oasc.SolrResourceLoader.locateSolrHome using system property solr.solr.home: /usr/home/hudson/hudson-slave/workspace/Lucene-Solr-Tests-4.x-java7/solr/build/solr-core/test-files/solr
[junit4:junit4]   2> 344 T2264 oasc.CoreContainer$Initializer.initialize looking for solr.xml: /usr/home/hudson/hudson-slave/workspace/Lucene-Solr-Tests-4.x-java7/solr/build/solr-core/test-files/solr/solr.xml
[junit4:junit4]   2> 344 T2264 oasc.CoreContainer.<init> New CoreContainer 480892315
[junit4:junit4]   2> 344 T2264 oasc.CoreContainer.load Loading CoreContainer using Solr Home: '/usr/home/hudson/hudson-slave/workspace/Lucene-Solr-Tests-4.x-java7/solr/build/solr-core/test-files/solr/'
[junit4:junit4]   2> 345 T2264 oasc.SolrResourceLoader.<init> new SolrResourceLoader for directory: '/usr/home/hudson/hudson-slave/workspace/Lucene-Solr-Tests-4.x-java7/solr/build/solr-core/test-files/solr/'
[junit4:junit4]   2> 367 T2264 oasc.CoreContainer.load Registering Log Listener
[junit4:junit4]   2> 379 T2264 oasc.CoreContainer.initZooKeeper Zookeeper client=127.0.0.1:49230/solr
[junit4:junit4]   2> 379 T2264 oaz.ZooKeeper.<init> Initiating client connection, connectString=127.0.0.1:49230/solr sessionTimeout=5000 watcher=org.apache.solr.common.cloud.ConnectionManager@1d4c652d
[junit4:junit4]   2> 380 T2283 oaz.ClientCnxn$SendThread.startConnect Opening socket connection to server /127.0.0.1:49230
[junit4:junit4]   2> 380 T2264 oascc.ConnectionManager.waitForConnected Waiting for client to connect to ZooKeeper
[junit4:junit4]   2> 381 T2283 oaz.ClientCnxn$SendThread.primeConnection Socket connection established to localhost/127.0.0.1:49230, initiating session
[junit4:junit4]   2> 381 T2266 oazs.NIOServerCnxn$Factory.run Accepted socket connection from /140.211.11.196:49237
[junit4:junit4]   2> 381 T2266 oazs.NIOServerCnxn.readConnectRequest Client attempting to establish new session at /140.211.11.196:49237
[junit4:junit4]   2> 391 T2268 oazs.NIOServerCnxn.finishSessionInit Established session 0x139ccaad0590002 with negotiated timeout 5000 for client /140.211.11.196:49237
[junit4:junit4]   2> 391 T2283 oaz.ClientCnxn$SendThread.readConnectResult Session establishment complete on server localhost/127.0.0.1:49230, sessionid = 0x139ccaad0590002, negotiated timeout = 5000
[junit4:junit4]   2> 391 T2284 oascc.ConnectionManager.process Watcher org.apache.solr.common.cloud.ConnectionManager@1d4c652d name:ZooKeeperConnection Watcher:127.0.0.1:49230/solr got event WatchedEvent state:SyncConnected type:None path:null path:null type:None
[junit4:junit4]   2> 391 T2264 oascc.ConnectionManager.waitForConnected Client is connected to ZooKeeper
[junit4:junit4]   2> 394 T2269 oazs.PrepRequestProcessor.pRequest Got user-level KeeperException when processing sessionid:0x139ccaad0590002 type:create cxid:0x2 zxid:0xfffffffffffffffe txntype:unknown reqpath:n/a Error Path:/solr/overseer Error:KeeperErrorCode = NodeExists for /solr/overseer
[junit4:junit4]   2> 402 T2264 oascc.SolrZkClient.makePath makePath: /live_nodes
[junit4:junit4]   2> 409 T2264 oasc.ZkController.createEphemeralLiveNode Register node as live in ZooKeeper:/live_nodes/127.0.0.1:49236_solr
[junit4:junit4]   2> 410 T2269 oazs.PrepRequestProcessor.pRequest Got user-level KeeperException when processing sessionid:0x139ccaad0590002 type:delete cxid:0x7 zxid:0xfffffffffffffffe txntype:unknown reqpath:n/a Error Path:/solr/live_nodes/127.0.0.1:49236_solr Error:KeeperErrorCode = NoNode for /solr/live_nodes/127.0.0.1:49236_solr
[junit4:junit4]   2> 417 T2264 oascc.SolrZkClient.makePath makePath: /live_nodes/127.0.0.1:49236_solr
[junit4:junit4]   2> 424 T2264 oashc.HttpShardHandlerFactory.getParameter Setting socketTimeout to: 0
[junit4:junit4]   2> 425 T2264 oashc.HttpShardHandlerFactory.getParameter Setting urlScheme to: http://
[junit4:junit4]   2> 425 T2264 oashc.HttpShardHandlerFactory.getParameter Setting connTimeout to: 0
[junit4:junit4]   2> 426 T2264 oashc.HttpShardHandlerFactory.getParameter Setting maxConnectionsPerHost to: 20
[junit4:junit4]   2> 426 T2264 oashc.HttpShardHandlerFactory.getParameter Setting corePoolSize to: 0
[junit4:junit4]   2> 427 T2264 oashc.HttpShardHandlerFactory.getParameter Setting maximumPoolSize to: 2147483647
[junit4:junit4]   2> 427 T2264 oashc.HttpShardHandlerFactory.getParameter Setting maxThreadIdleTime to: 5
[junit4:junit4]   2> 428 T2264 oashc.HttpShardHandlerFactory.getParameter Setting sizeOfQueue to: -1
[junit4:junit4]   2> 428 T2264 oashc.HttpShardHandlerFactory.getParameter Setting fairnessPolicy to: false
[junit4:junit4]   2> 429 T2264 oascsi.HttpClientUtil.createClient Creating new http client, config:maxConnectionsPerHost=20&maxConnections=10000&socketTimeout=0&connTimeout=0&retry=false
[junit4:junit4]   2> 446 T2264 oascc.SolrZkClient.makePath makePath: /overseer_elect/election
[junit4:junit4]   2> 451 T2269 oazs.PrepRequestProcessor.pRequest Got user-level KeeperException when processing sessionid:0x139ccaad0590002 type:delete cxid:0x15 zxid:0xfffffffffffffffe txntype:unknown reqpath:n/a Error Path:/solr/overseer_elect/leader Error:KeeperErrorCode = NoNode for /solr/overseer_elect/leader
[junit4:junit4]   2> 463 T2264 oascc.SolrZkClient.makePath makePath: /overseer_elect/leader
[junit4:junit4]   2> 465 T2264 oasc.Overseer.start Overseer (id=88326701722435586-127.0.0.1:49236_solr-n_0000000000) starting
[junit4:junit4]   2> 466 T2269 oazs.PrepRequestProcessor.pRequest Got user-level KeeperException when processing sessionid:0x139ccaad0590002 type:create cxid:0x1a zxid:0xfffffffffffffffe txntype:unknown reqpath:n/a Error Path:/solr/overseer Error:KeeperErrorCode = NodeExists for /solr/overseer
[junit4:junit4]   2> 473 T2269 oazs.PrepRequestProcessor.pRequest Got user-level KeeperException when processing sessionid:0x139ccaad0590002 type:create cxid:0x1b zxid:0xfffffffffffffffe txntype:unknown reqpath:n/a Error Path:/solr/overseer Error:KeeperErrorCode = NodeExists for /solr/overseer
[junit4:junit4]   2> 474 T2269 oazs.PrepRequestProcessor.pRequest Got user-level KeeperException when processing sessionid:0x139ccaad0590002 type:create cxid:0x1c zxid:0xfffffffffffffffe txntype:unknown reqpath:n/a Error Path:/solr/overseer Error:KeeperErrorCode = NodeExists for /solr/overseer
[junit4:junit4]   2> 475 T2269 oazs.PrepRequestProcessor.pRequest Got user-level KeeperException when processing sessionid:0x139ccaad0590002 type:create cxid:0x1d zxid:0xfffffffffffffffe txntype:unknown reqpath:n/a Error Path:/solr/overseer Error:KeeperErrorCode = NodeExists for /solr/overseer
[junit4:junit4]   2> 476 T2286 oasc.OverseerCollectionProcessor.run Process current queue of collection creations
[junit4:junit4]   2> 476 T2264 oascc.SolrZkClient.makePath makePath: /clusterstate.json
[junit4:junit4]   2> 487 T2264 oascc.ZkStateReader.createClusterStateWatchersAndUpdate Updating cluster state from ZooKeeper... 
[junit4:junit4]   2> 489 T2285 oasc.Overseer$ClusterStateUpdater.run Starting to work on the main queue
[junit4:junit4]   2> 493 T2264 oasc.CoreContainer.create Creating SolrCore 'collection1' using instanceDir: /usr/home/hudson/hudson-slave/workspace/Lucene-Solr-Tests-4.x-java7/solr/build/solr-core/test-files/solr/collection1
[junit4:junit4]   2> 493 T2264 oasc.ZkController.createCollectionZkNode Check for collection zkNode:control_collection
[junit4:junit4]   2> 494 T2264 oasc.ZkController.createCollectionZkNode Collection zkNode exists
[junit4:junit4]   2> 494 T2264 oasc.ZkController.readConfigName Load collection config from:/collections/control_collection
[junit4:junit4]   2> 495 T2264 oasc.SolrResourceLoader.<init> new SolrResourceLoader for directory: '/usr/home/hudson/hudson-slave/workspace/Lucene-Solr-Tests-4.x-java7/solr/build/solr-core/test-files/solr/collection1/'
[junit4:junit4]   2> 496 T2264 oasc.SolrResourceLoader.replaceClassLoader Adding 'file:/usr/home/hudson/hudson-slave/workspace/Lucene-Solr-Tests-4.x-java7/solr/build/solr-core/test-files/solr/collection1/lib/README' to classloader
[junit4:junit4]   2> 497 T2264 oasc.SolrResourceLoader.replaceClassLoader Adding 'file:/usr/home/hudson/hudson-slave/workspace/Lucene-Solr-Tests-4.x-java7/solr/build/solr-core/test-files/solr/collection1/lib/classes/' to classloader
[junit4:junit4]   2> 532 T2264 oasc.SolrConfig.<init> Using Lucene MatchVersion: LUCENE_40
[junit4:junit4]   2> 585 T2264 oasc.SolrConfig.<init> Loaded SolrConfig: solrconfig.xml
[junit4:junit4]   2> 686 T2264 oass.IndexSchema.readSchema Reading Solr Schema
[junit4:junit4]   2> 693 T2264 oass.IndexSchema.readSchema Schema name=test
[junit4:junit4]   2> 1320 T2264 oass.OpenExchangeRatesOrgProvider.init Initialized with rates=open-exchange-rates.json, refreshInterval=1440.
[junit4:junit4]   2> 1332 T2264 oass.IndexSchema.readSchema default search field in schema is text
[junit4:junit4]   2> 1336 T2264 oass.IndexSchema.readSchema unique key field: id
[junit4:junit4]   2> 1348 T2264 oass.FileExchangeRateProvider.reload Reloading exchange rates from file currency.xml
[junit4:junit4]   2> 1353 T2264 oass.FileExchangeRateProvider.reload Reloading exchange rates from file currency.xml
[junit4:junit4]   2> 1357 T2264 oass.OpenExchangeRatesOrgProvider.reload Reloading exchange rates from open-exchange-rates.json
[junit4:junit4]   2> 1358 T2264 oass.OpenExchangeRatesOrgProvider.reload Reloading exchange rates from open-exchange-rates.json
[junit4:junit4]   2> 1359 T2264 oasc.SolrCore.<init> [collection1] Opening new SolrCore at /usr/home/hudson/hudson-slave/workspace/Lucene-Solr-Tests-4.x-java7/solr/build/solr-core/test-files/solr/collection1/, dataDir=./org.apache.solr.cloud.BasicDistributedZk2Test-1347758510162/control/data/
[junit4:junit4]   2> 1360 T2264 oasc.JmxMonitoredMap.<init> JMX monitoring is enabled. Adding Solr mbeans to JMX Server: com.sun.jmx.mbeanserver.JmxMBeanServer@399342e7
[junit4:junit4]   2> 1361 T2264 oasc.SolrCore.getNewIndexDir WARNING New index directory detected: old=null new=./org.apache.solr.cloud.BasicDistributedZk2Test-1347758510162/control/data/index/
[junit4:junit4]   2> 1362 T2264 oasc.SolrCore.initIndex WARNING [collection1] Solr index directory './org.apache.solr.cloud.BasicDistributedZk2Test-1347758510162/control/data/index' doesn't exist. Creating new index...
[junit4:junit4]   2> 1363 T2264 oasc.CachingDirectoryFactory.get return new directory for /usr/home/hudson/hudson-slave/workspace/Lucene-Solr-Tests-4.x-java7/solr/build/solr-core/test/J1/./org.apache.solr.cloud.BasicDistributedZk2Test-1347758510162/control/data/index forceNew:false
[junit4:junit4]   2> 1371 T2264 oasc.SolrDeletionPolicy.onCommit SolrDeletionPolicy.onCommit: commits:num=1
[junit4:junit4]   2> 		commit{dir=NRTCachingDirectory(org.apache.lucene.store.NIOFSDirectory@/usr/home/hudson/hudson-slave/workspace/Lucene-Solr-Tests-4.x-java7/solr/build/solr-core/test/J1/org.apache.solr.cloud.BasicDistributedZk2Test-1347758510162/control/data/index lockFactory=org.apache.lucene.store.NativeFSLockFactory@158a78eb; maxCacheMB=48.0 maxMergeSizeMB=4.0),segFN=segments_1,generation=1,filenames=[segments_1]
[junit4:junit4]   2> 1371 T2264 oasc.SolrDeletionPolicy.updateCommits newest commit = 1
[junit4:junit4]   2> 1373 T2264 oasc.SolrCore.initWriters created xml: solr.XMLResponseWriter
[junit4:junit4]   2> 1375 T2264 oasup.UpdateRequestProcessorChain.init inserting DistributedUpdateProcessorFactory into updateRequestProcessorChain "dedupe"
[junit4:junit4]   2> 1375 T2264 oasup.UpdateRequestProcessorChain.init inserting DistributedUpdateProcessorFactory into updateRequestProcessorChain "dedupe-allfields"
[junit4:junit4]   2> 1376 T2264 oasup.UpdateRequestProcessorChain.init inserting DistributedUpdateProcessorFactory into updateRequestProcessorChain "stored_sig"
[junit4:junit4]   2> 1376 T2264 oasup.UpdateRequestProcessorChain.init inserting DistributedUpdateProcessorFactory into updateRequestProcessorChain "uniq-fields"
[junit4:junit4]   2> 1377 T2264 oasup.UpdateRequestProcessorChain.init inserting DistributedUpdateProcessorFactory into updateRequestProcessorChain "distrib-dup-test-chain-implicit"
[junit4:junit4]   2> 1378 T2264 oasc.RequestHandlers.initHandlersFromConfig adding lazy requestHandler: solr.ReplicationHandler
[junit4:junit4]   2> 1378 T2264 oasc.RequestHandlers.initHandlersFromConfig created /replication: solr.ReplicationHandler
[junit4:junit4]   2> 1379 T2264 oasc.RequestHandlers.initHandlersFromConfig created standard: solr.StandardRequestHandler
[junit4:junit4]   2> 1380 T2264 oasc.RequestHandlers.initHandlersFromConfig created /get: solr.RealTimeGetHandler
[junit4:junit4]   2> 1380 T2264 oasc.RequestHandlers.initHandlersFromConfig created dismax: solr.SearchHandler
[junit4:junit4]   2> 1381 T2264 oasc.RequestHandlers.initHandlersFromConfig created mock: org.apache.solr.core.MockQuerySenderListenerReqHandler
[junit4:junit4]   2> 1382 T2264 oasc.RequestHandlers.initHandlersFromConfig created /admin/: org.apache.solr.handler.admin.AdminHandlers
[junit4:junit4]   2> 1382 T2264 oasc.RequestHandlers.initHandlersFromConfig created defaults: solr.StandardRequestHandler
[junit4:junit4]   2> 1383 T2264 oasc.RequestHandlers.initHandlersFromConfig adding lazy requestHandler: solr.StandardRequestHandler
[junit4:junit4]   2> 1383 T2264 oasc.RequestHandlers.initHandlersFromConfig created lazy: solr.StandardRequestHandler
[junit4:junit4]   2> 1384 T2264 oasc.RequestHandlers.initHandlersFromConfig created /update: solr.UpdateRequestHandler
[junit4:junit4]   2> 1385 T2264 oasc.RequestHandlers.initHandlersFromConfig created /terms: org.apache.solr.handler.component.SearchHandler
[junit4:junit4]   2> 1385 T2264 oasc.RequestHandlers.initHandlersFromConfig created spellCheckCompRH: org.apache.solr.handler.component.SearchHandler
[junit4:junit4]   2> 1386 T2264 oasc.RequestHandlers.initHandlersFromConfig created spellCheckCompRH_Direct: org.apache.solr.handler.component.SearchHandler
[junit4:junit4]   2> 1386 T2264 oasc.RequestHandlers.initHandlersFromConfig created spellCheckWithWordbreak: org.apache.solr.handler.component.SearchHandler
[junit4:junit4]   2> 1387 T2264 oasc.RequestHandlers.initHandlersFromConfig created spellCheckWithWordbreak_Direct: org.apache.solr.handler.component.SearchHandler
[junit4:junit4]   2> 1388 T2264 oasc.RequestHandlers.initHandlersFromConfig created spellCheckCompRH1: org.apache.solr.handler.component.SearchHandler
[junit4:junit4]   2> 1388 T2264 oasc.RequestHandlers.initHandlersFromConfig created tvrh: org.apache.solr.handler.component.SearchHandler
[junit4:junit4]   2> 1389 T2264 oasc.RequestHandlers.initHandlersFromConfig created /mlt: solr.MoreLikeThisHandler
[junit4:junit4]   2> 1390 T2264 oasc.RequestHandlers.initHandlersFromConfig created /debug/dump: solr.DumpRequestHandler
[junit4:junit4]   2> 1394 T2264 oashl.XMLLoader.init xsltCacheLifetimeSeconds=60
[junit4:junit4]   2> 1400 T2264 oasc.SolrCore.initDeprecatedSupport WARNING solrconfig.xml uses deprecated <admin/gettableFiles>, Please update your config to use the ShowFileRequestHandler.
[junit4:junit4]   2> 1403 T2264 oasc.SolrCore.initDeprecatedSupport WARNING adding ShowFileRequestHandler with hidden files: [SCHEMA.XML, OLD_SYNONYMS.TXT, STOPWORDS.TXT, PROTWORDS.TXT, OPEN-EXCHANGE-RATES.JSON, SYNONYMS.TXT, CURRENCY.XML, MAPPING-ISOLATIN1ACCENT.TXT]
[junit4:junit4]   2> 1408 T2264 oass.SolrIndexSearcher.<init> Opening Searcher@2eb316d9 main
[junit4:junit4]   2> 1410 T2264 oasu.CommitTracker.<init> Hard AutoCommit: disabled
[junit4:junit4]   2> 1410 T2264 oasu.CommitTracker.<init> Soft AutoCommit: disabled
[junit4:junit4]   2> 1411 T2264 oashc.SpellCheckComponent.inform Initializing spell checkers
[junit4:junit4]   2> 1430 T2264 oass.DirectSolrSpellChecker.init init: {name=direct,classname=DirectSolrSpellChecker,field=lowerfilt,minQueryLength=3}
[junit4:junit4]   2> 1483 T2287 oasc.SolrCore.registerSearcher [collection1] Registered new searcher Searcher@2eb316d9 main{StandardDirectoryReader(segments_1:1)}
[junit4:junit4]   2> 1487 T2269 oazs.PrepRequestProcessor.pRequest Got user-level KeeperException when processing sessionid:0x139ccaad0590002 type:create cxid:0x53 zxid:0xfffffffffffffffe txntype:unknown reqpath:n/a Error Path:/solr/overseer/queue Error:KeeperErrorCode = NoNode for /solr/overseer/queue
[junit4:junit4]   2> 1498 T2264 oasc.CoreContainer.register registering core: collection1
[junit4:junit4]   2> 1499 T2285 oascc.ZkStateReader.updateClusterState Updating cloud state from ZooKeeper... 
[junit4:junit4]   2> 1499 T2264 oasc.ZkController.register Register shard - core:collection1 address:http://127.0.0.1:49236/solr shardId:control_shard
[junit4:junit4]   2> 1500 T2269 oazs.PrepRequestProcessor.pRequest Got user-level KeeperException when processing sessionid:0x139ccaad0590002 type:create cxid:0x5c zxid:0xfffffffffffffffe txntype:unknown reqpath:n/a Error Path:/solr/overseer/queue-work Error:KeeperErrorCode = NoNode for /solr/overseer/queue-work
[junit4:junit4]   2> 1500 T2264 oascc.SolrZkClient.makePath makePath: /collections/control_collection/leader_elect/control_shard/election
[junit4:junit4]   2> 1521 T2284 oascc.ZkStateReader$2.process A cluster state change has occurred - updating...
[junit4:junit4]   2> 1532 T2269 oazs.PrepRequestProcessor.pRequest Got user-level KeeperException when processing sessionid:0x139ccaad0590002 type:delete cxid:0x73 zxid:0xfffffffffffffffe txntype:unknown reqpath:n/a Error Path:/solr/collections/control_collection/leaders Error:KeeperErrorCode = NoNode for /solr/collections/control_collection/leaders
[junit4:junit4]   2> 1533 T2264 oasc.ShardLeaderElectionContext.runLeaderProcess Running the leader process.
[junit4:junit4]   2> 1534 T2269 oazs.PrepRequestProcessor.pRequest Got user-level KeeperException when processing sessionid:0x139ccaad0590002 type:create cxid:0x75 zxid:0xfffffffffffffffe txntype:unknown reqpath:n/a Error Path:/solr/overseer Error:KeeperErrorCode = NodeExists for /solr/overseer
[junit4:junit4]   2> 1536 T2264 oasc.ShardLeaderElectionContext.waitForReplicasToComeUp Enough replicas found to continue.
[junit4:junit4]   2> 1537 T2264 oasc.ShardLeaderElectionContext.runLeaderProcess I may be the new leader - try and sync
[junit4:junit4]   2> 1537 T2264 oasc.SyncStrategy.sync Sync replicas to http://127.0.0.1:49236/solr/collection1/
[junit4:junit4]   2> 1538 T2264 oasc.SyncStrategy.syncReplicas Sync Success - now sync replicas to me
[junit4:junit4]   2> 1539 T2264 oasc.SyncStrategy.syncToMe http://127.0.0.1:49236/solr/collection1/ has no replicas
[junit4:junit4]   2> 1539 T2264 oasc.ShardLeaderElectionContext.runLeaderProcess I am the new leader: http://127.0.0.1:49236/solr/collection1/
[junit4:junit4]   2> 1540 T2264 oascc.SolrZkClient.makePath makePath: /collections/control_collection/leaders/control_shard
[junit4:junit4]   2> 1544 T2269 oazs.PrepRequestProcessor.pRequest Got user-level KeeperException when processing sessionid:0x139ccaad0590002 type:create cxid:0x7f zxid:0xfffffffffffffffe txntype:unknown reqpath:n/a Error Path:/solr/overseer Error:KeeperErrorCode = NodeExists for /solr/overseer
[junit4:junit4]   2> 2034 T2285 oascc.ZkStateReader.updateClusterState Updating cloud state from ZooKeeper... 
[junit4:junit4]   2> 2050 T2284 oascc.ZkStateReader$2.process A cluster state change has occurred - updating...
[junit4:junit4]   2> 2065 T2264 oasc.ZkController.register We are http://127.0.0.1:49236/solr/collection1/ and leader is http://127.0.0.1:49236/solr/collection1/
[junit4:junit4]   2> 2065 T2264 oasc.ZkController.register No LogReplay needed for core=collection1 baseURL=http://127.0.0.1:49236/solr
[junit4:junit4]   2> 2066 T2264 oasc.ZkController.checkRecovery I am the leader, no recovery necessary
[junit4:junit4]   2> 2067 T2264 oascc.ZkStateReader.updateClusterState Updating cloud state from ZooKeeper... 
[junit4:junit4]   2> 2068 T2264 oass.SolrDispatchFilter.init user.dir=/usr/home/hudson/hudson-slave/workspace/Lucene-Solr-Tests-4.x-java7/solr/build/solr-core/test/J1
[junit4:junit4]   2> 2069 T2264 oass.SolrDispatchFilter.init SolrDispatchFilter.init() done
[junit4:junit4]   2> 2069 T2264 oascsi.HttpClientUtil.createClient Creating new http client, config:maxConnections=128&maxConnectionsPerHost=32&followRedirects=false
[junit4:junit4]   2> 2554 T2264 oejs.Server.doStart jetty-8.1.2.v20120308
[junit4:junit4]   2> 2557 T2264 oejs.AbstractConnector.doStart Started SocketConnector@0.0.0.0:49239
[junit4:junit4]   2> 2558 T2264 oasc.SolrResourceLoader.locateSolrHome JNDI not configured for solr (NoInitialContextEx)
[junit4:junit4]   2> 2558 T2264 oasc.SolrResourceLoader.locateSolrHome using system property solr.solr.home: /usr/home/hudson/hudson-slave/workspace/Lucene-Solr-Tests-4.x-java7/solr/build/solr-core/test/J1/./solrtest-jetty1-1347758512242
[junit4:junit4]   2> 2559 T2264 oasc.SolrResourceLoader.<init> new SolrResourceLoader for deduced Solr Home: '/usr/home/hudson/hudson-slave/workspace/Lucene-Solr-Tests-4.x-java7/solr/build/solr-core/test/J1/./solrtest-jetty1-1347758512242/'
[junit4:junit4]   2> 2563 T2285 oascc.ZkStateReader.updateClusterState Updating cloud state from ZooKeeper... 
[junit4:junit4]   2> 2582 T2284 oascc.ZkStateReader$2.process A cluster state change has occurred - updating...
[junit4:junit4]   2> 2601 T2264 oass.SolrDispatchFilter.init SolrDispatchFilter.init()
[junit4:junit4]   2> 2601 T2264 oasc.SolrResourceLoader.locateSolrHome JNDI not configured for solr (NoInitialContextEx)
[junit4:junit4]   2> 2602 T2264 oasc.SolrResourceLoader.locateSolrHome using system property solr.solr.home: /usr/home/hudson/hudson-slave/workspace/Lucene-Solr-Tests-4.x-java7/solr/build/solr-core/test/J1/./solrtest-jetty1-1347758512242
[junit4:junit4]   2> 2602 T2264 oasc.CoreContainer$Initializer.initialize looking for solr.xml: /usr/home/hudson/hudson-slave/workspace/Lucene-Solr-Tests-4.x-java7/solr/build/solr-core/test/J1/./solrtest-jetty1-1347758512242/solr.xml
[junit4:junit4]   2> 2603 T2264 oasc.CoreContainer.<init> New CoreContainer 1152661766
[junit4:junit4]   2> 2604 T2264 oasc.CoreContainer.load Loading CoreContainer using Solr Home: '/usr/home/hudson/hudson-slave/workspace/Lucene-Solr-Tests-4.x-java7/solr/build/solr-core/test/J1/./solrtest-jetty1-1347758512242/'
[junit4:junit4]   2> 2604 T2264 oasc.SolrResourceLoader.<init> new SolrResourceLoader for directory: '/usr/home/hudson/hudson-slave/workspace/Lucene-Solr-Tests-4.x-java7/solr/build/solr-core/test/J1/./solrtest-jetty1-1347758512242/'
[junit4:junit4]   2> 2637 T2264 oasc.CoreContainer.load Registering Log Listener
[junit4:junit4]   2> 2654 T2264 oasc.CoreContainer.initZooKeeper Zookeeper client=127.0.0.1:49230/solr
[junit4:junit4]   2> 2655 T2264 oaz.ZooKeeper.<init> Initiating client connection, connectString=127.0.0.1:49230/solr sessionTimeout=5000 watcher=org.apache.solr.common.cloud.ConnectionManager@266e96d2
[junit4:junit4]   2> 2656 T2297 oaz.ClientCnxn$SendThread.startConnect Opening socket connection to server /127.0.0.1:49230
[junit4:junit4]   2> 2656 T2264 oascc.ConnectionManager.waitForConnected Waiting for client to connect to ZooKeeper
[junit4:junit4]   2> 2657 T2297 oaz.ClientCnxn$SendThread.primeConnection Socket connection established to localhost/127.0.0.1:49230, initiating session
[junit4:junit4]   2> 2657 T2266 oazs.NIOServerCnxn$Factory.run Accepted socket connection from /140.211.11.196:49240
[junit4:junit4]   2> 2657 T2266 oazs.NIOServerCnxn.readConnectRequest Client attempting to establish new session at /140.211.11.196:49240
[junit4:junit4]   2> 2659 T2268 oazs.NIOServerCnxn.finishSessionInit Established session 0x139ccaad0590003 with negotiated timeout 5000 for client /140.211.11.196:49240
[junit4:junit4]   2> 2659 T2297 oaz.ClientCnxn$SendThread.readConnectResult Session establishment complete on server localhost/127.0.0.1:49230, sessionid = 0x139ccaad0590003, negotiated timeout = 5000
[junit4:junit4]   2> 2659 T2298 oascc.ConnectionManager.process Watcher org.apache.solr.common.cloud.ConnectionManager@266e96d2 name:ZooKeeperConnection Watcher:127.0.0.1:49230/solr got event WatchedEvent state:SyncConnected type:None path:null path:null type:None
[junit4:junit4]   2> 2660 T2264 oascc.ConnectionManager.waitForConnected Client is connected to ZooKeeper
[junit4:junit4]   2> 2660 T2269 oazs.PrepRequestProcessor.pRequest Got user-level KeeperException when processing sessionid:0x139ccaad0590003 type:create cxid:0x1 zxid:0xfffffffffffffffe txntype:unknown reqpath:n/a Error Path:/solr/overseer Error:KeeperErrorCode = NodeExists for /solr/overseer
[junit4:junit4]   2> 2662 T2269 oazs.PrepRequestProcessor.pRequest Got user-level KeeperException when processing sessionid:0x139ccaad0590003 type:create cxid:0x2 zxid:0xfffffffffffffffe txntype:unknown reqpath:n/a Error Path:/solr/overseer Error:KeeperErrorCode = NodeExists for /solr/overseer
[junit4:junit4]   2> 2669 T2264 oasc.ZkController.createEphemeralLiveNode Register node as live in ZooKeeper:/live_nodes/127.0.0.1:49239_solr
[junit4:junit4]   2> 2670 T2269 oazs.PrepRequestProcessor.pRequest Got user-level KeeperException when processing sessionid:0x139ccaad0590003 type:delete cxid:0x4 zxid:0xfffffffffffffffe txntype:unknown reqpath:n/a Error Path:/solr/live_nodes/127.0.0.1:49239_solr Error:KeeperErrorCode = NoNode for /solr/live_nodes/127.0.0.1:49239_solr
[junit4:junit4]   2> 2670 T2264 oascc.SolrZkClient.makePath makePath: /live_nodes/127.0.0.1:49239_solr
[junit4:junit4]   2> 2681 T2284 oascc.ZkStateReader$3.process Updating live nodes
[junit4:junit4]   2> 2681 T2264 oashc.HttpShardHandlerFactory.getParameter Setting socketTimeout to: 0
[junit4:junit4]   2> 2682 T2264 oashc.HttpShardHandlerFactory.getParameter Setting urlScheme to: http://
[junit4:junit4]   2> 2682 T2264 oashc.HttpShardHandlerFactory.getParameter Setting connTimeout to: 0
[junit4:junit4]   2> 2683 T2264 oashc.HttpShardHandlerFactory.getParameter Setting maxConnectionsPerHost to: 20
[junit4:junit4]   2> 2683 T2264 oashc.HttpShardHandlerFactory.getParameter Setting corePoolSize to: 0
[junit4:junit4]   2> 2684 T2264 oashc.HttpShardHandlerFactory.getParameter Setting maximumPoolSize to: 2147483647
[junit4:junit4]   2> 2684 T2264 oashc.HttpShardHandlerFactory.getParameter Setting maxThreadIdleTime to: 5
[junit4:junit4]   2> 2684 T2264 oashc.HttpShardHandlerFactory.getParameter Setting sizeOfQueue to: -1
[junit4:junit4]   2> 2685 T2264 oashc.HttpShardHandlerFactory.getParameter Setting fairnessPolicy to: false
[junit4:junit4]   2> 2685 T2264 oascsi.HttpClientUtil.createClient Creating new http client, config:maxConnectionsPerHost=20&maxConnections=10000&socketTimeout=0&connTimeout=0&retry=false
[junit4:junit4]   2> 2702 T2264 oascc.ZkStateReader.createClusterStateWatchersAndUpdate Updating cluster state from ZooKeeper... 
[junit4:junit4]   2> 2709 T2264 oasc.CoreContainer.create Creating SolrCore 'collection1' using instanceDir: /usr/home/hudson/hudson-slave/workspace/Lucene-Solr-Tests-4.x-java7/solr/build/solr-core/test/J1/./solrtest-jetty1-1347758512242/collection1
[junit4:junit4]   2> 2709 T2264 oasc.ZkController.createCollectionZkNode Check for collection zkNode:collection1
[junit4:junit4]   2> 2710 T2264 oasc.ZkController.createCollectionZkNode Collection zkNode exists
[junit4:junit4]   2> 2710 T2264 oasc.ZkController.readConfigName Load collection config from:/collections/collection1
[junit4:junit4]   2> 2711 T2264 oasc.SolrResourceLoader.<init> new SolrResourceLoader for directory: '/usr/home/hudson/hudson-slave/workspace/Lucene-Solr-Tests-4.x-java7/solr/build/solr-core/test/J1/./solrtest-jetty1-1347758512242/collection1/'
[junit4:junit4]   2> 2713 T2264 oasc.SolrResourceLoader.replaceClassLoader Adding 'file:/usr/home/hudson/hudson-slave/workspace/Lucene-Solr-Tests-4.x-java7/solr/build/solr-core/test/J1/solrtest-jetty1-1347758512242/collection1/lib/README' to classloader
[junit4:junit4]   2> 2714 T2264 oasc.SolrResourceLoader.replaceClassLoader Adding 'file:/usr/home/hudson/hudson-slave/workspace/Lucene-Solr-Tests-4.x-java7/solr/build/solr-core/test/J1/solrtest-jetty1-1347758512242/collection1/lib/classes/' to classloader
[junit4:junit4]   2> 2764 T2264 oasc.SolrConfig.<init> Using Lucene MatchVersion: LUCENE_40
[junit4:junit4]   2> 2836 T2264 oasc.SolrConfig.<init> Loaded SolrConfig: solrconfig.xml
[junit4:junit4]   2> 2938 T2264 oass.IndexSchema.readSchema Reading Solr Schema
[junit4:junit4]   2> 2944 T2264 oass.IndexSchema.readSchema Schema name=test
[junit4:junit4]   2> 3678 T2264 oass.OpenExchangeRatesOrgProvider.init Initialized with rates=open-exchange-rates.json, refreshInterval=1440.
[junit4:junit4]   2> 3687 T2264 oass.IndexSchema.readSchema default search field in schema is text
[junit4:junit4]   2> 3690 T2264 oass.IndexSchema.readSchema unique key field: id
[junit4:junit4]   2> 3699 T2264 oass.FileExchangeRateProvider.reload Reloading exchange rates from file currency.xml
[junit4:junit4]   2> 3703 T2264 oass.FileExchangeRateProvider.reload Reloading exchange rates from file currency.xml
[junit4:junit4]   2> 3706 T2264 oass.OpenExchangeRatesOrgProvider.reload Reloading exchange rates from open-exchange-rates.json
[junit4:junit4]   2> 3707 T2264 oass.OpenExchangeRatesOrgProvider.reload Reloading exchange rates from open-exchange-rates.json
[junit4:junit4]   2> 3708 T2264 oasc.SolrCore.<init> [collection1] Opening new SolrCore at /usr/home/hudson/hudson-slave/workspace/Lucene-Solr-Tests-4.x-java7/solr/build/solr-core/test/J1/./solrtest-jetty1-1347758512242/collection1/, dataDir=./org.apache.solr.cloud.BasicDistributedZk2Test-1347758510162/jetty1/
[junit4:junit4]   2> 3708 T2264 oasc.JmxMonitoredMap.<init> JMX monitoring is enabled. Adding Solr mbeans to JMX Server: com.sun.jmx.mbeanserver.JmxMBeanServer@399342e7
[junit4:junit4]   2> 3709 T2264 oasc.SolrCore.getNewIndexDir WARNING New index directory detected: old=null new=./org.apache.solr.cloud.BasicDistributedZk2Test-1347758510162/jetty1/index/
[junit4:junit4]   2> 3710 T2264 oasc.SolrCore.initIndex WARNING [collection1] Solr index directory './org.apache.solr.cloud.BasicDistributedZk2Test-1347758510162/jetty1/index' doesn't exist. Creating new index...
[junit4:junit4]   2> 3710 T2264 oasc.CachingDirectoryFactory.get return new directory for /usr/home/hudson/hudson-slave/workspace/Lucene-Solr-Tests-4.x-java7/solr/build/solr-core/test/J1/./org.apache.solr.cloud.BasicDistributedZk2Test-1347758510162/jetty1/index forceNew:false
[junit4:junit4]   2> 3749 T2264 oasc.SolrDeletionPolicy.onCommit SolrDeletionPolicy.onCommit: commits:num=1
[junit4:junit4]   2> 		commit{dir=NRTCachingDirectory(org.apache.lucene.store.NIOFSDirectory@/usr/home/hudson/hudson-slave/workspace/Lucene-Solr-Tests-4.x-java7/solr/build/solr-core/test/J1/org.apache.solr.cloud.BasicDistributedZk2Test-1347758510162/jetty1/index lockFactory=org.apache.lucene.store.NativeFSLockFactory@24564365; maxCacheMB=48.0 maxMergeSizeMB=4.0),segFN=segments_1,generation=1,filenames=[segments_1]
[junit4:junit4]   2> 3750 T2264 oasc.SolrDeletionPolicy.updateCommits newest commit = 1
[junit4:junit4]   2> 3751 T2264 oasc.SolrCore.initWriters created xml: solr.XMLResponseWriter
[junit4:junit4]   2> 3752 T2264 oasup.UpdateRequestProcessorChain.init inserting DistributedUpdateProcessorFactory into updateRequestProcessorChain "dedupe"
[junit4:junit4]   2> 3753 T2264 oasup.UpdateRequestProcessorChain.init inserting DistributedUpdateProcessorFactory into updateRequestProcessorChain "dedupe-allfields"
[junit4:junit4]   2> 3753 T2264 oasup.UpdateRequestProcessorChain.init inserting DistributedUpdateProcessorFactory into updateRequestProcessorChain "stored_sig"
[junit4:junit4]   2> 3754 T2264 oasup.UpdateRequestProcessorChain.init inserting DistributedUpdateProcessorFactory into updateRequestProcessorChain "uniq-fields"
[junit4:junit4]   2> 3754 T2264 oasup.UpdateRequestProcessorChain.init inserting DistributedUpdateProcessorFactory into updateRequestProcessorChain "distrib-dup-test-chain-implicit"
[junit4:junit4]   2> 3755 T2264 oasc.RequestHandlers.initHandlersFromConfig adding lazy requestHandler: solr.ReplicationHandler
[junit4:junit4]   2> 3755 T2264 oasc.RequestHandlers.initHandlersFromConfig created /replication: solr.ReplicationHandler
[junit4:junit4]   2> 3756 T2264 oasc.RequestHandlers.initHandlersFromConfig created standard: solr.StandardRequestHandler
[junit4:junit4]   2> 3756 T2264 oasc.RequestHandlers.initHandlersFromConfig created /get: solr.RealTimeGetHandler
[junit4:junit4]   2> 3757 T2264 oasc.RequestHandlers.initHandlersFromConfig created dismax: solr.SearchHandler
[junit4:junit4]   2> 3757 T2264 oasc.RequestHandlers.initHandlersFromConfig created mock: org.apache.solr.core.MockQuerySenderListenerReqHandler
[junit4:junit4]   2> 3758 T2264 oasc.RequestHandlers.initHandlersFromConfig created /admin/: org.apache.solr.handler.admin.AdminHandlers
[junit4:junit4]   2> 3758 T2264 oasc.RequestHandlers.initHandlersFromConfig created defaults: solr.StandardRequestHandler
[junit4:junit4]   2> 3759 T2264 oasc.RequestHandlers.initHandlersFromConfig adding lazy requestHandler: solr.StandardRequestHandler
[junit4:junit4]   2> 3759 T2264 oasc.RequestHandlers.initHandlersFromConfig created lazy: solr.StandardRequestHandler
[junit4:junit4]   2> 3760 T2264 oasc.RequestHandlers.initHandlersFromConfig created /update: solr.UpdateRequestHandler
[junit4:junit4]   2> 3760 T2264 oasc.RequestHandlers.initHandlersFromConfig created /terms: org.apache.solr.handler.component.SearchHandler
[junit4:junit4]   2> 3761 T2264 oasc.RequestHandlers.initHandlersFromConfig created spellCheckCompRH: org.apache.solr.handler.component.SearchHandler
[junit4:junit4]   2> 3761 T2264 oasc.RequestHandlers.initHandlersFromConfig created spellCheckCompRH_Direct: org.apache.solr.handler.component.SearchHandler
[junit4:junit4]   2> 3762 T2264 oasc.RequestHandlers.initHandlersFromConfig created spellCheckWithWordbreak: org.apache.solr.handler.component.SearchHandler
[junit4:junit4]   2> 3762 T2264 oasc.RequestHandlers.initHandlersFromConfig created spellCheckWithWordbreak_Direct: org.apache.solr.handler.component.SearchHandler
[junit4:junit4]   2> 3763 T2264 oasc.RequestHandlers.initHandlersFromConfig created spellCheckCompRH1: org.apache.solr.handler.component.SearchHandler
[junit4:junit4]   2> 3763 T2264 oasc.RequestHandlers.initHandlersFromConfig created tvrh: org.apache.solr.handler.component.SearchHandler
[junit4:junit4]   2> 3764 T2264 oasc.RequestHandlers.initHandlersFromConfig created /mlt: solr.MoreLikeThisHandler
[junit4:junit4]   2> 3764 T2264 oasc.RequestHandlers.initHandlersFromConfig created /debug/dump: solr.DumpRequestHandler
[junit4:junit4]   2> 3767 T2264 oashl.XMLLoader.init xsltCacheLifetimeSeconds=60
[junit4:junit4]   2> 3770 T2264 oasc.SolrCore.initDeprecatedSupport WARNING solrconfig.xml uses deprecated <admin/gettableFiles>, Please update your config to use the ShowFileRequestHandler.
[junit4:junit4]   2> 3771 T2264 oasc.SolrCore.initDeprecatedSupport WARNING adding ShowFileRequestHandler with hidden files: [SCHEMA.XML, OLD_SYNONYMS.TXT, STOPWORDS.TXT, PROTWORDS.TXT, OPEN-EXCHANGE-RATES.JSON, SYNONYMS.TXT, CURRENCY.XML, MAPPING-ISOLATIN1ACCENT.TXT]
[junit4:junit4]   2> 3774 T2264 oass.SolrIndexSearcher.<init> Opening Searcher@2a885efe main
[junit4:junit4]   2> 3775 T2264 oasu.CommitTracker.<init> Hard AutoCommit: disabled
[junit4:junit4]   2> 3776 T2264 oasu.CommitTracker.<init> Soft AutoCommit: disabled
[junit4:junit4]   2> 3776 T2264 oashc.SpellCheckComponent.inform Initializing spell checkers
[junit4:junit4]   2> 3796 T2264 oass.DirectSolrSpellChecker.init init: {name=direct,classname=DirectSolrSpellChecker,field=lowerfilt,minQueryLength=3}
[junit4:junit4]   2> 3848 T2299 oasc.SolrCore.registerSearcher [collection1] Registered new searcher Searcher@2a885efe main{StandardDirectoryReader(segments_1:1)}
[junit4:junit4]   2> 4088 T2285 oascc.ZkStateReader.updateClusterState Updating cloud state from ZooKeeper... 
[junit4:junit4]   2> 4101 T2298 oascc.ZkStateReader$2.process A cluster state change has occurred - updating...
[junit4:junit4]   2> 4101 T2284 oascc.ZkStateReader$2.process A cluster state change has occurred - updating...
[junit4:junit4]   2> 4353 T2264 oasc.CoreContainer.register registering core: collection1
[junit4:junit4]   2> 4353 T2264 oasc.ZkController.register Register shard - core:collection1 address:http://127.0.0.1:49239/solr shardId:shard1
[junit4:junit4]   2> 4354 T2264 oascc.SolrZkClient.makePath makePath: /collections/collection1/leader_elect/shard1/election
[junit4:junit4]   2> 4369 T2269 oazs.PrepRequestProcessor.pRequest Got user-level KeeperException when processing sessionid:0x139ccaad0590003 type:delete cxid:0x42 zxid:0xfffffffffffffffe txntype:unknown reqpath:n/a Error Path:/solr/collections/collection1/leaders Error:KeeperErrorCode = NoNode for /solr/collections/collection1/leaders
[junit4:junit4]   2> 4375 T2264 oasc.ShardLeaderElectionContext.runLeaderProcess Running the leader process.
[junit4:junit4]   2> 4376 T2269 oazs.PrepRequestProcessor.pRequest Got user-level KeeperException when processing sessionid:0x139ccaad0590003 type:create cxid:0x43 zxid:0xfffffffffffffffe txntype:unknown reqpath:n/a Error Path:/solr/overseer Error:KeeperErrorCode = NodeExists for /solr/overseer
[junit4:junit4]   2> 4378 T2264 oasc.ShardLeaderElectionContext.waitForReplicasToComeUp Enough replicas found to continue.
[junit4:junit4]   2> 4379 T2264 oasc.ShardLeaderElectionContext.runLeaderProcess I may be the new leader - try and sync
[junit4:junit4]   2> 4379 T2264 oasc.SyncStrategy.sync Sync replicas to http://127.0.0.1:49239/solr/collection1/
[junit4:junit4]   2> 4380 T2264 oasc.SyncStrategy.syncReplicas Sync Success - now sync replicas to me
[junit4:junit4]   2> 4380 T2264 oasc.SyncStrategy.syncToMe http://127.0.0.1:49239/solr/collection1/ has no replicas
[junit4:junit4]   2> 4381 T2264 oasc.ShardLeaderElectionContext.runLeaderProcess I am the new leader: http://127.0.0.1:49239/solr/collection1/
[junit4:junit4]   2> 4381 T2264 oascc.SolrZkClient.makePath makePath: /collections/collection1/leaders/shard1
[junit4:junit4]   2> 4384 T2269 oazs.PrepRequestProcessor.pRequest Got user-level KeeperException when processing sessionid:0x139ccaad0590003 type:create cxid:0x4d zxid:0xfffffffffffffffe txntype:unknown reqpath:n/a Error Path:/solr/overseer Error:KeeperErrorCode = NodeExists for /solr/overseer
[junit4:junit4]   2> 4604 T2285 oascc.ZkStateReader.updateClusterState Updating cloud state from ZooKeeper... 
[junit4:junit4]   2> 4624 T2284 oascc.ZkStateReader$2.process A cluster state change has occurred - updating...
[junit4:junit4]   2> 4624 T2298 oascc.ZkStateReader$2.process A cluster state change has occurred - updating...
[junit4:junit4]   2> 4641 T2264 oasc.ZkController.register We are http://127.0.0.1:49239/solr/collection1/ and leader is http://127.0.0.1:49239/solr/collection1/
[junit4:junit4]   2> 4641 T2264 oasc.ZkController.register No LogReplay needed for core=collection1 baseURL=http://127.0.0.1:49239/solr
[junit4:junit4]   2> 4642 T2264 oasc.ZkController.checkRecovery I am the leader, no recovery necessary
[junit4:junit4]   2> 4644 T2264 oascc.ZkStateReader.updateClusterState Updating cloud state from ZooKeeper... 
[junit4:junit4]   2> 4644 T2264 oass.SolrDispatchFilter.init user.dir=/usr/home/hudson/hudson-slave/workspace/Lucene-Solr-Tests-4.x-java7/solr/build/solr-core/test/J1
[junit4:junit4]   2> 4645 T2264 oass.SolrDispatchFilter.init SolrDispatchFilter.init() done
[junit4:junit4]   2> 4645 T2264 oascsi.HttpClientUtil.createClient Creating new http client, config:maxConnections=128&maxConnectionsPerHost=32&followRedirects=false
[junit4:junit4]   2> 5135 T2285 oascc.ZkStateReader.updateClusterState Updating cloud state from ZooKeeper... 
[junit4:junit4]   2> 5142 T2264 oejs.Server.doStart jetty-8.1.2.v20120308
[junit4:junit4]   2> 5145 T2264 oejs.AbstractConnector.doStart Started SocketConnector@0.0.0.0:49244
[junit4:junit4]   2> 5145 T2264 oasc.SolrResourceLoader.locateSolrHome JNDI not configured for solr (NoInitialContextEx)
[junit4:junit4]   2> 5146 T2264 oasc.SolrResourceLoader.locateSolrHome using system property solr.solr.home: /usr/home/hudson/hudson-slave/workspace/Lucene-Solr-Tests-4.x-java7/solr/build/solr-core/test/J1/./solrtest-jetty2-1347758514818
[junit4:junit4]   2> 5146 T2264 oasc.SolrResourceLoader.<init> new SolrResourceLoader for deduced Solr Home: '/usr/home/hudson/hudson-slave/workspace/Lucene-Solr-Tests-4.x-java7/solr/build/solr-core/test/J1/./solrtest-jetty2-1347758514818/'
[junit4:junit4]   2> 5155 T2284 oascc.ZkStateReader$2.process A cluster state change has occurred - updating...
[junit4:junit4]   2> 5155 T2298 oascc.ZkStateReader$2.process A cluster state change has occurred - updating...
[junit4:junit4]   2> 5175 T2264 oass.SolrDispatchFilter.init SolrDispatchFilter.init()
[junit4:junit4]   2> 5176 T2264 oasc.SolrResourceLoader.locateSolrHome JNDI not configured for solr (NoInitialContextEx)
[junit4:junit4]   2> 5176 T2264 oasc.SolrResourceLoader.locateSolrHome using system property solr.solr.home: /usr/home/hudson/hudson-slave/workspace/Lucene-Solr-Tests-4.x-java7/solr/build/solr-core/test/J1/./solrtest-jetty2-1347758514818
[junit4:junit4]   2> 5176 T2264 oasc.CoreContainer$Initializer.initialize looking for solr.xml: /usr/home/hudson/hudson-slave/workspace/Lucene-Solr-Tests-4.x-java7/solr/build/solr-core/test/J1/./solrtest-jetty2-1347758514818/solr.xml
[junit4:junit4]   2> 5177 T2264 oasc.CoreContainer.<init> New CoreContainer 633448440
[junit4:junit4]   2> 5177 T2264 oasc.CoreContainer.load Loading CoreContainer using Solr Home: '/usr/home/hudson/hudson-slave/workspace/Lucene-Solr-Tests-4.x-java7/solr/build/solr-core/test/J1/./solrtest-jetty2-1347758514818/'
[junit4:junit4]   2> 5178 T2264 oasc.SolrResourceLoader.<init> new SolrResourceLoader for directory: '/usr/home/hudson/hudson-slave/workspace/Lucene-Solr-Tests-4.x-java7/solr/build/solr-core/test/J1/./solrtest-jetty2-1347758514818/'
[junit4:junit4]   2> 5201 T2264 oasc.CoreContainer.load Registering Log Listener
[junit4:junit4]   2> 5213 T2264 oasc.CoreContainer.initZooKeeper Zookeeper client=127.0.0.1:49230/solr
[junit4:junit4]   2> 5213 T2264 oaz.ZooKeeper.<init> Initiating client connection, connectString=127.0.0.1:49230/solr sessionTimeout=5000 watcher=org.apache.solr.common.cloud.ConnectionManager@1163c429
[junit4:junit4]   2> 5214 T2309 oaz.ClientCnxn$SendThread.startConnect Opening socket connection to server /127.0.0.1:49230
[junit4:junit4]   2> 5214 T2264 oascc.ConnectionManager.waitForConnected Waiting for client to connect to ZooKeeper
[junit4:junit4]   2> 5216 T2309 oaz.ClientCnxn$SendThread.primeConnection Socket connection established to localhost/127.0.0.1:49230, initiating session
[junit4:junit4]   2> 5216 T2266 oazs.NIOServerCnxn$Factory.run Accepted socket connection from /140.211.11.196:49245
[junit4:junit4]   2> 5216 T2266 oazs.NIOServerCnxn.readConnectRequest Client attempting to establish new session at /140.211.11.196:49245
[junit4:junit4]   2> 5220 T2268 oazs.NIOServerCnxn.finishSessionInit Established session 0x139ccaad0590004 with negotiated timeout 5000 for client /140.211.11.196:49245
[junit4:junit4]   2> 5220 T2309 oaz.ClientCnxn$SendThread.readConnectResult Session establishment complete on server localhost/127.0.0.1:49230, sessionid = 0x139ccaad0590004, negotiated timeout = 5000
[junit4:junit4]   2> 5221 T2310 oascc.ConnectionManager.process Watcher org.apache.solr.common.cloud.ConnectionManager@1163c429 name:ZooKeeperConnection Watcher:127.0.0.1:49230/solr got event WatchedEvent state:SyncConnected type:None path:null path:null type:None
[junit4:junit4]   2> 5221 T2264 oascc.ConnectionManager.waitForConnected Client is connected to ZooKeeper
[junit4:junit4]   2> 5222 T2269 oazs.PrepRequestProcessor.pRequest Got user-level KeeperException when processing sessionid:0x139ccaad0590004 type:create cxid:0x1 zxid:0xfffffffffffffffe txntype:unknown reqpath:n/a Error Path:/solr/overseer Error:KeeperErrorCode = NodeExists for /solr/overseer
[junit4:junit4]   2> 5223 T2269 oazs.PrepRequestProcessor.pRequest Got user-level KeeperException when processing sessionid:0x139ccaad0590004 type:create cxid:0x2 zxid:0xfffffffffffffffe txntype:unknown reqpath:n/a Error Path:/solr/overseer Error:KeeperErrorCode = NodeExists for /solr/overseer
[junit4:junit4]   2> 5225 T2264 oasc.ZkController.createEphemeralLiveNode Register node as live in ZooKeeper:/live_nodes/127.0.0.1:49244_solr
[junit4:junit4]   2> 5225 T2269 oazs.PrepRequestProcessor.pRequest Got user-level KeeperException when processing sessionid:0x139ccaad0590004 type:delete cxid:0x4 zxid:0xfffffffffffffffe txntype:unknown reqpath:n/a Error Path:/solr/live_nodes/127.0.0.1:49244_solr Error:KeeperErrorCode = NoNode for /solr/live_nodes/127.0.0.1:49244_solr
[junit4:junit4]   2> 5235 T2264 oascc.SolrZkClient.makePath makePath: /live_nodes/127.0.0.1:49244_solr
[junit4:junit4]   2> 5237 T2284 oascc.ZkStateReader$3.process Updating live nodes
[junit4:junit4]   2> 5237 T2298 oascc.ZkStateReader$3.process Updating live nodes
[junit4:junit4]   2> 5238 T2264 oashc.HttpShardHandlerFactory.getParameter Setting socketTimeout to: 0
[junit4:junit4]   2> 5238 T2264 oashc.HttpShardHandlerFactory.getParameter Setting urlScheme to: http://
[junit4:junit4]   2> 5238 T2264 oashc.HttpShardHandlerFactory.getParameter Setting connTimeout to: 0
[junit4:junit4]   2> 5239 T2264 oashc.HttpShardHandlerFactory.getParameter Setting maxConnectionsPerHost to: 20
[junit4:junit4]   2> 5239 T2264 oashc.HttpShardHandlerFactory.getParameter Setting corePoolSize to: 0
[junit4:junit4]   2> 5239 T2264 oashc.HttpShardHandlerFactory.getParameter Setting maximumPoolSize to: 2147483647
[junit4:junit4]   2> 5240 T2264 oashc.HttpShardHandlerFactory.getParameter Setting maxThreadIdleTime to: 5
[junit4:junit4]   2> 5240 T2264 oashc.HttpShardHandlerFactory.getParameter Setting sizeOfQueue to: -1
[junit4:junit4]   2> 5240 T2264 oashc.HttpShardHandlerFactory.getParameter Setting fairnessPolicy to: false
[junit4:junit4]   2> 5241 T2264 oascsi.HttpClientUtil.createClient Creating new http client, config:maxConnectionsPerHost=20&maxConnections=10000&socketTimeout=0&connTimeout=0&retry=false
[junit4:junit4]   2> 5252 T2264 oascc.ZkStateReader.createClusterStateWatchersAndUpdate Updating cluster state from ZooKeeper... 
[junit4:junit4]   2> 5257 T2264 oasc.CoreContainer.create Creating SolrCore 'collection1' using instanceDir: /usr/home/hudson/hudson-slave/workspace/Lucene-Solr-Tests-4.x-java7/solr/build/solr-core/test/J1/./solrtest-jetty2-1347758514818/collection1
[junit4:junit4]   2> 5257 T2264 oasc.ZkController.createCollectionZkNode Check for collection zkNode:collection1
[junit4:junit4]   2> 5258 T2264 oasc.ZkController.createCollectionZkNode Collection zkNode exists
[junit4:junit4]   2> 5258 T2264 oasc.ZkController.readConfigName Load collection config from:/collections/collection1
[junit4:junit4]   2> 5259 T2264 oasc.SolrResourceLoader.<init> new SolrResourceLoader for directory: '/usr/home/hudson/hudson-slave/workspace/Lucene-Solr-Tests-4.x-java7/solr/build/solr-core/test/J1/./solrtest-jetty2-1347758514818/collection1/'
[junit4:junit4]   2> 5260 T2264 oasc.SolrResourceLoader.replaceClassLoader Adding 'file:/usr/home/hudson/hudson-slave/workspace/Lucene-Solr-Tests-4.x-java7/solr/build/solr-core/test/J1/solrtest-jetty2-1347758514818/collection1/lib/classes/' to classloader
[junit4:junit4]   2> 5261 T2264 oasc.SolrResourceLoader.replaceClassLoader Adding 'file:/usr/home/hudson/hudson-slave/workspace/Lucene-Solr-Tests-4.x-java7/solr/build/solr-core/test/J1/solrtest-jetty2-1347758514818/collection1/lib/README' to classloader
[junit4:junit4]   2> 5297 T2264 oasc.SolrConfig.<init> Using Lucene MatchVersion: LUCENE_40
[junit4:junit4]   2> 5347 T2264 oasc.SolrConfig.<init> Loaded SolrConfig: solrconfig.xml
[junit4:junit4]   2> 5448 T2264 oass.IndexSchema.readSchema Reading Solr Schema
[junit4:junit4]   2> 5456 T2264 oass.IndexSchema.readSchema Schema name=test
[junit4:junit4]   2> 5973 T2264 oass.OpenExchangeRatesOrgProvider.init Initialized with rates=open-exchange-rates.json, refreshInterval=1440.
[junit4:junit4]   2> 5982 T2264 oass.IndexSchema.readSchema default search field in schema is text
[junit4:junit4]   2> 5985 T2264 oass.IndexSchema.readSchema unique key field: id
[junit4:junit4]   2> 5994 T2264 oass.FileExchangeRateProvider.reload Reloading exchange rates from file currency.xml
[junit4:junit4]   2> 5998 T2264 oass.FileExchangeRateProvider.reload Reloading exchange rates from file currency.xml
[junit4:junit4]   2> 6002 T2264 oass.OpenExchangeRatesOrgProvider.reload Reloading exchange rates from open-exchange-rates.json
[junit4:junit4]   2> 6003 T2264 oass.OpenExchangeRatesOrgProvider.reload Reloading exchange rates from open-exchange-rates.json
[junit4:junit4]   2> 6004 T2264 oasc.SolrCore.<init> [collection1] Opening new SolrCore at /usr/home/hudson/hudson-slave/workspace/Lucene-Solr-Tests-4.x-java7/solr/build/solr-core/test/J1/./solrtest-jetty2-1347758514818/collection1/, dataDir=./org.apache.solr.cloud.BasicDistributedZk2Test-1347758510162/jetty2/
[junit4:junit4]   2> 6004 T2264 oasc.JmxMonitoredMap.<init> JMX monitoring is enabled. Adding Solr mbeans to JMX Server: com.sun.jmx.mbeanserver.JmxMBeanServer@399342e7
[junit4:junit4]   2> 6005 T2264 oasc.SolrCore.getNewIndexDir WARNING New index directory detected: old=null new=./org.apache.solr.cloud.BasicDistributedZk2Test-1347758510162/jetty2/index/
[junit4:junit4]   2> 6006 T2264 oasc.SolrCore.initIndex WARNING [collection1] Solr index directory './org.apache.solr.cloud.BasicDistributedZk2Test-1347758510162/jetty2/index' doesn't exist. Creating new index...
[junit4:junit4]   2> 6007 T2264 oasc.CachingDirectoryFactory.get return new directory for /usr/home/hudson/hudson-slave/workspace/Lucene-Solr-Tests-4.x-java7/solr/build/solr-core/test/J1/./org.apache.solr.cloud.BasicDistributedZk2Test-1347758510162/jetty2/index forceNew:false
[junit4:junit4]   2> 6012 T2264 oasc.SolrDeletionPolicy.onCommit SolrDeletionPolicy.onCommit: commits:num=1
[junit4:junit4]   2> 		commit{dir=NRTCachingDirectory(org.apache.lucene.store.NIOFSDirectory@/usr/home/hudson/hudson-slave/workspace/Lucene-Solr-Tests-4.x-java7/solr/build/solr-core/test/J1/org.apache.solr.cloud.BasicDistributedZk2Test-1347758510162/jetty2/index lockFactory=org.apache.lucene.store.NativeFSLockFactory@62eace1a; maxCacheMB=48.0 maxMergeSizeMB=4.0),segFN=segments_1,generation=1,filenames=[segments_1]
[junit4:junit4]   2> 6013 T2264 oasc.SolrDeletionPolicy.updateCommits newest commit = 1
[junit4:junit4]   2> 6013 T2264 oasc.SolrCore.initWriters created xml: solr.XMLResponseWriter
[junit4:junit4]   2> 6015 T2264 oasup.UpdateRequestProcessorChain.init inserting DistributedUpdateProcessorFactory into updateRequestProcessorChain "dedupe"
[junit4:junit4]   2> 6016 T2264 oasup.UpdateRequestProcessorChain.init inserting DistributedUpdateProcessorFactory into updateRequestProcessorChain "dedupe-allfields"
[junit4:junit4]   2> 6016 T2264 oasup.UpdateRequestProcessorChain.init inserting DistributedUpdateProcessorFactory into updateRequestProcessorChain "stored_sig"
[junit4:junit4]   2> 6016 T2264 oasup.UpdateRequestProcessorChain.init inserting DistributedUpdateProcessorFactory into updateRequestProcessorChain "uniq-fields"
[junit4:junit4]   2> 6017 T2264 oasup.UpdateRequestProcessorChain.init inserting DistributedUpdateProcessorFactory into updateRequestProcessorChain "distrib-dup-test-chain-implicit"
[junit4:junit4]   2> 6017 T2264 oasc.RequestHandlers.initHandlersFromConfig adding lazy requestHandler: solr.ReplicationHandler
[junit4:junit4]   2> 6018 T2264 oasc.RequestHandlers.initHandlersFromConfig created /replication: solr.ReplicationHandler
[junit4:junit4]   2> 6018 T2264 oasc.RequestHandlers.initHandlersFromConfig created standard: solr.StandardRequestHandler
[junit4:junit4]   2> 6019 T2264 oasc.RequestHandlers.initHandlersFromConfig created /get: solr.RealTimeGetHandler
[junit4:junit4]   2> 6019 T2264 oasc.RequestHandlers.initHandlersFromConfig created dismax: solr.SearchHandler
[junit4:junit4]   2> 6020 T2264 oasc.RequestHandlers.initHandlersFromConfig created mock: org.apache.solr.core.MockQuerySenderListenerReqHandler
[junit4:junit4]   2> 6021 T2264 oasc.RequestHandlers.initHandlersFromConfig created /admin/: org.apache.solr.handler.admin.AdminHandlers
[junit4:junit4]   2> 6021 T2264 oasc.RequestHandlers.initHandlersFromConfig created defaults: solr.StandardRequestHandler
[junit4:junit4]   2> 6022 T2264 oasc.RequestHandlers.initHandlersFromConfig adding lazy requestHandler: solr.StandardRequestHandler
[junit4:junit4]   2> 6022 T2264 oasc.RequestHandlers.initHandlersFromConfig created lazy: solr.StandardRequestHandler
[junit4:junit4]   2> 6022 T2264 oasc.RequestHandlers.initHandlersFromConfig created /update: solr.UpdateRequestHandler
[junit4:junit4]   2> 6023 T2264 oasc.RequestHandlers.initHandlersFromConfig created /terms: org.apache.solr.handler.component.SearchHandler
[junit4:junit4]   2> 6024 T2264 oasc.RequestHandlers.initHandlersFromConfig created spellCheckCompRH: org.apache.solr.handler.component.SearchHandler
[junit4:junit4]   2> 6024 T2264 oasc.RequestHandlers.initHandlersFromConfig created spellCheckCompRH_Direct: org.apache.solr.handler.component.SearchHandler
[junit4:junit4]   2> 6025 T2264 oasc.RequestHandlers.initHandlersFromConfig created spellCheckWithWordbreak: org.apache.solr.handler.component.SearchHandler
[junit4:junit4]   2> 6025 T2264 oasc.RequestHandlers.initHandlersFromConfig created spellCheckWithWordbreak_Direct: org.apache.solr.handler.component.SearchHandler
[junit4:junit4]   2> 6026 T2264 oasc.RequestHandlers.initHandlersFromConfig created spellCheckCompRH1: org.apache.solr.handler.component.SearchHandler
[junit4:junit4]   2> 6026 T2264 oasc.RequestHandlers.initHandlersFromConfig created tvrh: org.apache.solr.handler.component.SearchHandler
[junit4:junit4]   2> 6027 T2264 oasc.RequestHandlers.initHandlersFromConfig created /mlt: solr.MoreLikeThisHandler
[junit4:junit4]   2> 6027 T2264 oasc.RequestHandlers.initHandlersFromConfig created /debug/dump: solr.DumpRequestHandler
[junit4:junit4]   2> 6030 T2264 oashl.XMLLoader.init xsltCacheLifetimeSeconds=60
[junit4:junit4]   2> 6034 T2264 oasc.SolrCore.initDeprecatedSupport WARNING solrconfig.xml uses deprecated <admin/gettableFiles>, Please update your config to use the ShowFileRequestHandler.
[junit4:junit4]   2> 6035 T2264 oasc.SolrCore.initDeprecatedSupport WARNING adding ShowFileRequestHandler with hidden files: [SCHEMA.XML, OLD_SYNONYMS.TXT, STOPWORDS.TXT, PROTWORDS.TXT, OPEN-EXCHANGE-RATES.JSON, SYNONYMS.TXT, CURRENCY.XML, MAPPING-ISOLATIN1ACCENT.TXT]
[junit4:junit4]   2> 6038 T2264 oass.SolrIndexSearcher.<init> Opening Searcher@288eb74 main
[junit4:junit4]   2> 6039 T2264 oasu.CommitTracker.<init> Hard AutoCommit: disabled
[junit4:junit4]   2> 6040 T2264 oasu.CommitTracker.<init> Soft AutoCommit: disabled
[junit4:junit4]   2> 6040 T2264 oashc.SpellCheckComponent.inform Initializing spell checkers
[junit4:junit4]   2> 6058 T2264 oass.DirectSolrSpellChecker.init init: {name=direct,classname=DirectSolrSpellChecker,field=lowerfilt,minQueryLength=3}
[junit4:junit4]   2> 6109 T2311 oasc.SolrCore.registerSearcher [collection1] Registered new searcher Searcher@288eb74 main{StandardDirectoryReader(segments_1:1)}
[junit4:junit4]   2> 6161 T2285 oascc.ZkStateReader.updateClusterState Updating cloud state from ZooKeeper... 
[junit4:junit4]   2> 6166 T2284 oascc.ZkStateReader$2.process A cluster state change has occurred - updating...
[junit4:junit4]   2> 6166 T2310 oascc.ZkStateReader$2.process A cluster state change has occurred - updating...
[junit4:junit4]   2> 6166 T2298 oascc.ZkStateReader$2.process A cluster state change has occurred - updating...
[junit4:junit4]   2> 6615 T2264 oasc.CoreContainer.register registering core: collection1
[junit4:junit4]   2> 6615 T2264 oasc.ZkController.register Register shard - core:collection1 address:http://127.0.0.1:49244/solr shardId:shard2
[junit4:junit4]   2> 6617 T2264 oascc.SolrZkClient.makePath makePath: /collections/collection1/leader_elect/shard2/election
[junit4:junit4]   2> 6631 T2269 oazs.PrepRequestProcessor.pRequest Got user-level KeeperException when processing sessionid:0x139ccaad0590004 type:delete cxid:0x41 zxid:0xfffffffffffffffe txntype:unknown reqpath:n/a Error Path:/solr/collections/collection1/leaders/shard2 Error:KeeperErrorCode = NoNode for /solr/collections/collection1/leaders/shard2
[junit4:junit4]   2> 6632 T2264 oasc.ShardLeaderElectionContext.runLeaderProcess Running the leader process.
[junit4:junit4]   2> 6633 T2269 oazs.PrepRequestProcessor.pRequest Got user-level KeeperException when processing sessionid:0x139ccaad0590004 type:create cxid:0x42 zxid:0xfffffffffffffffe txntype:unknown reqpath:n/a Error Path:/solr/overseer Error:KeeperErrorCode = NodeExists for /solr/overseer
[junit4:junit4]   2> 6634 T2264 oasc.ShardLeaderElectionContext.waitForReplicasToComeUp Enough replicas found to continue.
[junit4:junit4]   2> 6635 T2264 oasc.ShardLeaderElectionContext.runLeaderProcess I may be the new leader - try and sync
[junit4:junit4]   2> 6635 T2264 oasc.SyncStrategy.sync Sync replicas to http://127.0.0.1:49244/solr/collection1/
[junit4:junit4]   2> 6636 T2264 oasc.SyncStrategy.syncReplicas Sync Success - now sync replicas to me
[junit4:junit4]   2> 6636 T2264 oasc.SyncStrategy.syncToMe http://127.0.0.1:49244/solr/collection1/ has no replicas
[junit4:junit4]   2> 6637 T2264 oasc.ShardLeaderElectionContext.runLeaderProcess I am the new leader: http://127.0.0.1:49244/solr/collection1/
[junit4:junit4]   2> 6637 T2264 oascc.SolrZkClient.makePath makePath: /collections/collection1/leaders/shard2
[junit4:junit4]   2> 6640 T2269 oazs.PrepRequestProcessor.pRequest Got user-level KeeperException when processing sessionid:0x139ccaad0590004 type:create cxid:0x4b zxid:0xfffffffffffffffe txntype:unknown reqpath:n/a Error Path:/solr/overseer Error:KeeperErrorCode = NodeExists for /solr/overseer
[junit4:junit4]   2> 6677 T2285 oascc.ZkStateReader.updateClusterState Updating cloud state from ZooKeeper... 
[junit4:junit4]   2> 6694 T2298 oascc.ZkStateReader$2.process A cluster state change has occurred - updating...
[junit4:junit4]   2> 6694 T2284 oascc.ZkStateReader$2.process A cluster state change has occurred - updating...
[junit4:junit4]   2> 6694 T2310 oascc.ZkStateReader$2.process A cluster state change has occurred - updating...
[junit4:junit4]   2> 6702 T2264 oasc.ZkController.register We are http://127.0.0.1:49244/solr/collection1/ and leader is http://127.0.0.1:49244/solr/collection1/
[junit4:junit4]   2> 6702 T2264 oasc.ZkController.register No LogReplay needed for core=collection1 baseURL=http://127.0.0.1:49244/solr
[junit4:junit4]   2> 6703 T2264 oasc.ZkController.checkRecovery I am the leader, no recovery necessary
[junit4:junit4]   2> 6704 T2264 oascc.ZkStateReader.updateClusterState Updating cloud state from ZooKeeper... 
[junit4:junit4]   2> 6705 T2264 oass.SolrDispatchFilter.init user.dir=/usr/home/hudson/hudson-slave/workspace/Lucene-Solr-Tests-4.x-java7/solr/build/solr-core/test/J1
[junit4:junit4]   2> 6706 T2264 oass.SolrDispatchFilter.init SolrDispatchFilter.init() done
[junit4:junit4]   2> 6706 T2264 oascsi.HttpClientUtil.createClient Creating new http client, config:maxConnections=128&maxConnectionsPerHost=32&followRedirects=false
[junit4:junit4]   2> 7199 T2285 oascc.ZkStateReader.updateClusterState Updating cloud state from ZooKeeper... 
[junit4:junit4]   2> 7200 T2264 oejs.Server.doStart jetty-8.1.2.v20120308
[junit4:junit4]   2> 7203 T2264 oejs.AbstractConnector.doStart Started SocketConnector@0.0.0.0:49249
[junit4:junit4]   2> 7204 T2264 oasc.SolrResourceLoader.locateSolrHome JNDI not configured for solr (NoInitialContextEx)
[junit4:junit4]   2> 7204 T2264 oasc.SolrResourceLoader.locateSolrHome using system property solr.solr.home: /usr/home/hudson/hudson-slave/workspace/Lucene-Solr-Tests-4.x-java7/solr/build/solr-core/test/J1/./solrtest-jetty3-1347758516880
[junit4:junit4]   2> 7205 T2264 oasc.SolrResourceLoader.<init> new SolrResourceLoader for deduced Solr Home: '/usr/home/hudson/hudson-slave/workspace/Lucene-Solr-Tests-4.x-java7/solr/build/solr-core/test/J1/./solrtest-jetty3-1347758516880/'
[junit4:junit4]   2> 7246 T2264 oass.SolrDispatchFilter.init SolrDispatchFilter.init()
[junit4:junit4]   2> 7247 T2264 oasc.SolrResourceLoader.locateSolrHome JNDI not configured for solr (NoInitialContextEx)
[junit4:junit4]   2> 7248 T2264 oasc.SolrResourceLoader.locateSolrHome using system property solr.solr.home: /usr/home/hudson/hudson-slave/workspace/Lucene-Solr-Tests-4.x-java7/solr/build/solr-core/test/J1/./solrtest-jetty3-1347758516880
[junit4:junit4]   2> 7248 T2264 oasc.CoreContainer$Initializer.initialize looking for solr.xml: /usr/home/hudson/hudson-slave/workspace/Lucene-Solr-Tests-4.x-java7/solr/build/solr-core/test/J1/./solrtest-jetty3-1347758516880/solr.xml
[junit4:junit4]   2> 7249 T2264 oasc.CoreContainer.<init> New CoreContainer 646197350
[junit4:junit4]   2> 7250 T2264 oasc.CoreContainer.load Loading CoreContainer using Solr Home: '/usr/home/hudson/hudson-slave/workspace/Lucene-Solr-Tests-4.x-java7/solr/build/solr-core/test/J1/./solrtest-jetty3-1347758516880/'
[junit4:junit4]   2> 7250 T2264 oasc.SolrResourceLoader.<init> new SolrResourceLoader for directory: '/usr/home/hudson/hudson-slave/workspace/Lucene-Solr-Tests-4.x-java7/solr/build/solr-core/test/J1/./solrtest-jetty3-1347758516880/'
[junit4:junit4]   2> 7260 T2298 oascc.ZkStateReader$2.process A cluster state change has occurred - updating...
[junit4:junit4]   2> 7260 T2310 oascc.ZkStateReader$2.process A cluster state change has occurred - updating...
[junit4:junit4]   2> 7260 T2284 oascc.ZkStateReader$2.process A cluster state change has occurred - updating...
[junit4:junit4]   2> 7282 T2264 oasc.CoreContainer.load Registering Log Listener
[junit4:junit4]   2> 7299 T2264 oasc.CoreContainer.initZooKeeper Zookeeper client=127.0.0.1:49230/solr
[junit4:junit4]   2> 7299 T2264 oaz.ZooKeeper.<init> Initiating client connection, connectString=127.0.0.1:49230/solr sessionTimeout=5000 watcher=org.apache.solr.common.cloud.ConnectionManager@1d2447f7
[junit4:junit4]   2> 7300 T2321 oaz.ClientCnxn$SendThread.startConnect Opening socket connection to server /127.0.0.1:49230
[junit4:junit4]   2> 7300 T2264 oascc.ConnectionManager.waitForConnected Waiting for client to connect to ZooKeeper
[junit4:junit4]   2> 7301 T2321 oaz.ClientCnxn$SendThread.primeConnection Socket connection established to localhost/127.0.0.1:49230, initiating session
[junit4:junit4]   2> 7301 T2266 oazs.NIOServerCnxn$Factory.run Accepted socket connection from /140.211.11.196:49250
[junit4:junit4]   2> 7301 T2266 oazs.NIOServerCnxn.readConnectRequest Client attempting to establish new session at /140.211.11.196:49250
[junit4:junit4]   2> 7306 T2268 oazs.NIOServerCnxn.finishSessionInit Established session 0x139ccaad0590005 with negotiated timeout 5000 for client /140.211.11.196:49250
[junit4:junit4]   2> 7306 T2321 oaz.ClientCnxn$SendThread.readConnectResult Session establishment complete on server localhost/127.0.0.1:49230, sessionid = 0x139ccaad0590005, negotiated timeout = 5000
[junit4:junit4]   2> 7307 T2322 oascc.ConnectionManager.process Watcher org.apache.solr.common.cloud.ConnectionManager@1d2447f7 name:ZooKeeperConnection Watcher:127.0.0.1:49230/solr got event WatchedEvent state:SyncConnected type:None path:null path:null type:None
[junit4:junit4]   2> 7307 T2264 oascc.ConnectionManager.waitForConnected Client is connected to ZooKeeper
[junit4:junit4]   2> 7308 T2269 oazs.PrepRequestProcessor.pRequest Got user-level KeeperException when processing sessionid:0x139ccaad0590005 type:create cxid:0x1 zxid:0xfffffffffffffffe txntype:unknown reqpath:n/a Error Path:/solr/overseer Error:KeeperErrorCode = NodeExists for /solr/overseer
[junit4:junit4]   2> 7309 T2269 oazs.PrepRequestProcessor.pRequest Got user-level KeeperException when processing sessionid:0x139ccaad0590005 type:create cxid:0x2 zxid:0xfffffffffffffffe txntype:unknown reqpath:n/a Error Path:/solr/overseer Error:KeeperErrorCode = NodeExists for /solr/overseer
[junit4:junit4]   2> 7311 T2264 oasc.ZkController.createEphemeralLiveNode Register node as live in ZooKeeper:/live_nodes/127.0.0.1:49249_solr
[junit4:junit4]   2> 7312 T2269 oazs.PrepRequestProcessor.pRequest Got user-level KeeperException when processing sessionid:0x139ccaad0590005 type:delete cxid:0x4 zxid:0xfffffffffffffffe txntype:unknown reqpath:n/a Error Path:/solr/live_nodes/127.0.0.1:49249_solr Error:KeeperErrorCode = NoNode for /solr/live_nodes/127.0.0.1:49249_solr
[junit4:junit4]   2> 7313 T2264 oascc.SolrZkClient.makePath makePath: /live_nodes/127.0.0.1:49249_solr
[junit4:junit4]   2> 7338 T2284 oascc.ZkStateReader$3.process Updating live nodes
[junit4:junit4]   2> 7338 T2310 oascc.ZkStateReader$3.process Updating live nodes
[junit4:junit4]   2> 7338 T2298 oascc.ZkStateReader$3.process Updating live nodes
[junit4:junit4]   2> 7339 T2264 oashc.HttpShardHandlerFactory.getParameter Setting socketTimeout to: 0
[junit4:junit4]   2> 7339 T2264 oashc.HttpShardHandlerFactory.getParameter Setting urlScheme to: http://
[junit4:junit4]   2> 7340 T2264 oashc.HttpShardHandlerFactory.getParameter Setting connTimeout to: 0
[junit4:junit4]   2> 7340 T2264 oashc.HttpShardHandlerFactory.getParameter Setting maxConnectionsPerHost to: 20
[junit4:junit4]   2> 7341 T2264 oashc.HttpShardHandlerFactory.getParameter Setting corePoolSize to: 0
[junit4:junit4]   2> 7341 T2264 oashc.HttpShardHandlerFactory.getParameter Setting maximumPoolSize to: 2147483647
[junit4:junit4]   2> 7342 T2264 oashc.HttpShardHandlerFactory.getParameter Setting maxThreadIdleTime to: 5
[junit4:junit4]   2> 7342 T2264 oashc.HttpShardHandlerFactory.getParameter Setting sizeOfQueue to: -1
[junit4:junit4]   2> 7343 T2264 oashc.HttpShardHandlerFactory.getParameter Setting fairnessPolicy to: false
[junit4:junit4]   2> 7343 T2264 oascsi.HttpClientUtil.createClient Creating new http client, config:maxConnectionsPerHost=20&maxConnections=10000&socketTimeout=0&connTimeout=0&retry=false
[junit4:junit4]   2> 7394 T2264 oascc.ZkStateReader.createClusterStateWatchersAndUpdate Updating cluster state from ZooKeeper... 
[junit4:junit4]   2> 7401 T2264 oasc.CoreContainer.create Creating SolrCore 'collection1' using instanceDir: /usr/home/hudson/hudson-slave/workspace/Lucene-Solr-Tests-4.x-java7/solr/build/solr-core/test/J1/./solrtest-jetty3-1347758516880/collection1
[junit4:junit4]   2> 7401 T2264 oasc.ZkController.createCollectionZkNode Check for collection zkNode:collection1
[junit4:junit4]   2> 7402 T2264 oasc.ZkController.createCollectionZkNode Collection zkNode exists
[junit4:junit4]   2> 7403 T2264 oasc.ZkController.readConfigName Load collection config from:/collections/collection1
[junit4:junit4]   2> 7404 T2264 oasc.SolrResourceLoader.<init> new SolrResourceLoader for directory: '/usr/home/hudson/hudson-slave/workspace/Lucene-Solr-Tests-4.x-java7/solr/build/solr-core/test/J1/./solrtest-jetty3-1347758516880/collection1/'
[junit4:junit4]   2> 7405 T2264 oasc.SolrResourceLoader.replaceClassLoader Adding 'file:/usr/home/hudson/hudson-slave/workspace/Lucene-Solr-Tests-4.x-java7/solr/build/solr-core/test/J1/solrtest-jetty3-1347758516880/collection1/lib/classes/' to classloader
[junit4:junit4]   2> 7406 T2264 oasc.SolrResourceLoader.replaceClassLoader Adding 'file:/usr/home/hudson/hudson-slave/workspace/Lucene-Solr-Tests-4.x-java7/solr/build/solr-core/test/J1/solrtest-jetty3-1347758516880/collection1/lib/README' to classloader
[junit4:junit4]   2> 7457 T2264 oasc.SolrConfig.<init> Using Lucene MatchVersion: LUCENE_40
[junit4:junit4]   2> 7529 T2264 oasc.SolrConfig.<init> Loaded SolrConfig: solrconfig.xml
[junit4:junit4]   2> 7630 T2264 oass.IndexSchema.readSchema Reading Solr Schema
[junit4:junit4]   2> 7637 T2264 oass.IndexSchema.readSchema Schema name=test
[junit4:junit4]   2> 8249 T2264 oass.OpenExchangeRatesOrgProvider.init Initialized with rates=open-exchange-rates.json, refreshInterval=1440.
[junit4:junit4]   2> 8258 T2264 oass.IndexSchema.readSchema default search field in schema is text
[junit4:junit4]   2> 8261 T2264 oass.IndexSchema.readSchema unique key field: id
[junit4:junit4]   2> 8271 T2264 oass.FileExchangeRateProvider.reload Reloading exchange rates from file currency.xml
[junit4:junit4]   2> 8275 T2264 oass.FileExchangeRateProvider.reload Reloading exchange rates from file currency.xml
[junit4:junit4]   2> 8279 T2264 oass.OpenExchangeRatesOrgProvider.reload Reloading exchange rates from open-exchange-rates.json
[junit4:junit4]   2> 8280 T2264 oass.OpenExchangeRatesOrgProvider.reload Reloading exchange rates from open-exchange-rates.json
[junit4:junit4]   2> 8281 T2264 oasc.SolrCore.<init> [collection1] Opening new SolrCore at /usr/home/hudson/hudson-slave/workspace/Lucene-Solr-Tests-4.x-java7/solr/build/solr-core/test/J1/./solrtest-jetty3-1347758516880/collection1/, dataDir=./org.apache.solr.cloud.BasicDistributedZk2Test-1347758510162/jetty3/
[junit4:junit4]   2> 8281 T2264 oasc.JmxMonitoredMap.<init> JMX monitoring is enabled. Adding Solr mbeans to JMX Server: com.sun.jmx.mbeanserver.JmxMBeanServer@399342e7
[junit4:junit4]   2> 8282 T2264 oasc.SolrCore.getNewIndexDir WARNING New index directory detected: old=null new=./org.apache.solr.cloud.BasicDistributedZk2Test-1347758510162/jetty3/index/
[junit4:junit4]   2> 8283 T2264 oasc.SolrCore.initIndex WARNING [collection1] Solr index directory './org.apache.solr.cloud.BasicDistributedZk2Test-1347758510162/jetty3/index' doesn't exist. Creating new index...
[junit4:junit4]   2> 8283 T2264 oasc.CachingDirectoryFactory.get return new directory for /usr/home/hudson/hudson-slave/workspace/Lucene-Solr-Tests-4.x-java7/solr/build/solr-core/test/J1/./org.apache.solr.cloud.BasicDistributedZk2Test-1347758510162/jetty3/index forceNew:false
[junit4:junit4]   2> 8289 T2264 oasc.SolrDeletionPolicy.onCommit SolrDeletionPolicy.onCommit: commits:num=1
[junit4:junit4]   2> 		commit{dir=NRTCachingDirectory(org.apache.lucene.store.NIOFSDirectory@/usr/home/hudson/hudson-slave/workspace/Lucene-Solr-Tests-4.x-java7/solr/build/solr-core/test/J1/org.apache.solr.cloud.BasicDistributedZk2Test-1347758510162/jetty3/index lockFactory=org.apache.lucene.store.NativeFSLockFactory@511d754f; maxCacheMB=48.0 maxMergeSizeMB=4.0),segFN=segments_1,generation=1,filenames=[segments_1]
[junit4:junit4]   2> 8289 T2264 oasc.SolrDeletionPolicy.updateCommits newest commit = 1
[junit4:junit4]   2> 8290 T2264 oasc.SolrCore.initWriters created xml: solr.XMLResponseWriter
[junit4:junit4]   2> 8292 T2264 oasup.UpdateRequestProcessorChain.init inserting DistributedUpdateProcessorFactory into updateRequestProcessorChain "dedupe"
[junit4:junit4]   2> 8292 T2264 oasup.UpdateRequestProcessorChain.init inserting DistributedUpdateProcessorFactory into updateRequestProcessorChain "dedupe-allfields"
[junit4:junit4]   2> 8293 T2264 oasup.UpdateRequestProcessorChain.init inserting DistributedUpdateProcessorFactory into updateRequestProcessorChain "stored_sig"
[junit4:junit4]   2> 8293 T2264 oasup.UpdateRequestProcessorChain.init inserting DistributedUpdateProcessorFactory into updateRequestProcessorChain "uniq-fields"
[junit4:junit4]   2> 8294 T2264 oasup.UpdateRequestProcessorChain.init inserting DistributedUpdateProcessorFactory into updateRequestProcessorChain "distrib-dup-test-chain-implicit"
[junit4:junit4]   2> 8294 T2264 oasc.RequestHandlers.initHandlersFromConfig adding lazy requestHandler: solr.ReplicationHandler
[junit4:junit4]   2> 8294 T2264 oasc.RequestHandlers.initHandlersFromConfig created /replication: solr.ReplicationHandler
[junit4:junit4]   2> 8295 T2264 oasc.RequestHandlers.initHandlersFromConfig created standard: solr.StandardRequestHandler
[junit4:junit4]   2> 8295 T2264 oasc.RequestHandlers.initHandlersFromConfig created /get: solr.RealTimeGetHandler
[junit4:junit4]   2> 8296 T2264 oasc.RequestHandlers.initHandlersFromConfig created dismax: solr.SearchHandler
[junit4:junit4]   2> 8296 T2264 oasc.RequestHandlers.initHandlersFromConfig created mock: org.apache.solr.core.MockQuerySenderListenerReqHandler
[junit4:junit4]   2> 8297 T2264 oasc.RequestHandlers.initHandlersFromConfig created /admin/: org.apache.solr.handler.admin.AdminHandlers
[junit4:junit4]   2> 8297 T2264 oasc.RequestHandlers.initHandlersFromConfig created defaults: solr.StandardRequestHandler
[junit4:junit4]   2> 8298 T2264 oasc.RequestHandlers.initHandlersFromConfig adding lazy requestHandler: solr.StandardRequestHandler
[junit4:junit4]   2> 8298 T2264 oasc.RequestHandlers.initHandlersFromConfig created lazy: solr.StandardRequestHandler
[junit4:junit4]   2> 8299 T2264 oasc.RequestHandlers.initHandlersFromConfig created /update: solr.UpdateRequestHandler
[junit4:junit4]   2> 8299 T2264 oasc.RequestHandlers.initHandlersFromConfig created /terms: org.apache.solr.handler.component.SearchHandler
[junit4:junit4]   2> 8300 T2264 oasc.RequestHandlers.initHandlersFromConfig created spellCheckCompRH: org.apache.solr.handler.component.SearchHandler
[junit4:junit4]   2> 8300 T2264 oasc.RequestHandlers.initHandlersFromConfig created spellCheckCompRH_Direct: org.apache.solr.handler.component.SearchHandler
[junit4:junit4]   2> 8301 T2264 oasc.RequestHandlers.initHandlersFromConfig created spellCheckWithWordbreak: org.apache.solr.handler.component.SearchHandler
[junit4:junit4]   2> 8301 T2264 oasc.RequestHandlers.initHandlersFromConfig created spellCheckWithWordbreak_Direct: org.apache.solr.handler.component.SearchHandler
[junit4:junit4]   2> 8302 T2264 oasc.RequestHandlers.initHandlersFromConfig created spellCheckCompRH1: org.apache.solr.handler.component.SearchHandler
[junit4:junit4]   2> 8302 T2264 oasc.RequestHandlers.initHandlersFromConfig created tvrh: org.apache.solr.handler.component.SearchHandler
[junit4:junit4]   2> 8303 T2264 oasc.RequestHandlers.initHandlersFromConfig created /mlt: solr.MoreLikeThisHandler
[junit4:junit4]   2> 8303 T2264 oasc.RequestHandlers.initHandlersFromConfig created /debug/dump: solr.DumpRequestHandler
[junit4:junit4]   2> 8306 T2264 oashl.XMLLoader.init xsltCacheLifetimeSeconds=60
[junit4:junit4]   2> 8310 T2264 oasc.SolrCore.initDeprecatedSupport WARNING solrconfig.xml uses deprecated <admin/gettableFiles>, Please update your config to use the ShowFileRequestHandler.
[junit4:junit4]   2> 8311 T2264 oasc.SolrCore.initDeprecatedSupport WARNING adding ShowFileRequestHandler with hidden files: [SCHEMA.XML, OLD_SYNONYMS.TXT, STOPWORDS.TXT, PROTWORDS.TXT, OPEN-EXCHANGE-RATES.JSON, SYNONYMS.TXT, CURRENCY.XML, MAPPING-ISOLATIN1ACCENT.TXT]
[junit4:junit4]   2> 8314 T2264 oass.SolrIndexSearcher.<init> Opening Searcher@72daa97d main
[junit4:junit4]   2> 8315 T2264 oasu.CommitTracker.<init> Hard AutoCommit: disabled
[junit4:junit4]   2> 8316 T2264 oasu.CommitTracker.<init> Soft AutoCommit: disabled
[junit4:junit4]   2> 8316 T2264 oashc.SpellCheckComponent.inform Initializing spell checkers
[junit4:junit4]   2> 8322 T2264 oass.DirectSolrSpellChecker.init init: {name=direct,classname=DirectSolrSpellChecker,field=lowerfilt,minQueryLength=3}
[junit4:junit4]   2> 8397 T2323 oasc.SolrCore.registerSearcher [collection1] Registered new searcher Searcher@72daa97d main{StandardDirectoryReader(segments_1:1)}
[junit4:junit4]   2> 8785 T2285 oascc.ZkStateReader.updateClusterState Updating cloud state from ZooKeeper... 
[junit4:junit4]   2> 8800 T2298 oascc.ZkStateReader$2.process A cluster state change has occurred - updating...
[junit4:junit4]   2> 8800 T2284 oascc.ZkStateReader$2.process A cluster state change has occurred - updating...
[junit4:junit4]   2> 8800 T2310 oascc.ZkStateReader$2.process A cluster state change has occurred - updating...
[junit4:junit4]   2> 8800 T2322 oascc.ZkStateReader$2.process A cluster state change has occurred - updating...
[junit4:junit4]   2> 8909 T2264 oasc.CoreContainer.register registering core: collection1
[junit4:junit4]   2> 8909 T2264 oasc.ZkController.register Register shard - core:collection1 address:http://127.0.0.1:49249/solr shardId:shard1
[junit4:junit4]   2> 8913 T2264 oasc.ZkController.register We are http://127.0.0.1:49249/solr/collection1/ and leader is http://127.0.0.1:49239/solr/collection1/
[junit4:junit4]   2> 8913 T2264 oasc.ZkController.register No LogReplay needed for core=collection1 baseURL=http://127.0.0.1:49249/solr
[junit4:junit4]   2> 8914 T2264 oasc.ZkController.checkRecovery Core needs to recover:collection1
[junit4:junit4]   2> 8914 T2264 oasu.DefaultSolrCoreState.doRecovery Running recovery - first canceling any ongoing recovery
[junit4:junit4]   2> ASYNC  NEW_CORE C141 name=collection1 org.apache.solr.core.SolrCore@4a1eb29e url=http://127.0.0.1:49249/solr/collection1 node=127.0.0.1:49249_solr
[junit4:junit4]   2> 8917 T2324 C141 P49249 oasc.RecoveryStrategy.run Starting recovery process.  core=collection1 recoveringAfterStartup=true
[junit4:junit4]   2> 8917 T2324 C141 P49249 oasc.RecoveryStrategy.doRecovery ###### startupVersions=[]
[junit4:junit4]   2> 8917 T2264 oascc.ZkStateReader.updateClusterState Updating cloud state from ZooKeeper... 
[junit4:junit4]   2> 8919 T2324 C141 P49249 oasc.RecoveryStrategy.doRecovery Attempting to PeerSync from http://127.0.0.1:49239/solr/collection1/ core=collection1 - recoveringAfterStartup=true
[junit4:junit4]   2> 8919 T2324 C141 P49249 oasu.PeerSync.sync PeerSync: core=collection1 url=http://127.0.0.1:49249/solr START replicas=[http://127.0.0.1:49239/solr/collection1/] nUpdates=100
[junit4:junit4]   2> 8919 T2264 oass.SolrDispatchFilter.init user.dir=/usr/home/hudson/hudson-slave/workspace/Lucene-Solr-Tests-4.x-java7/solr/build/solr-core/test/J1
[junit4:junit4]   2> 8919 T2324 C141 P49249 oasu.PeerSync.sync WARNING no frame of reference to tell of we've missed updates
[junit4:junit4]   2> 8919 T2324 C141 P49249 oasc.RecoveryStrategy.doRecovery PeerSync Recovery was not successful - trying replication. core=collection1
[junit4:junit4]   2> 8919 T2264 oass.SolrDispatchFilter.init SolrDispatchFilter.init() done
[junit4:junit4]   2> 8919 T2324 C141 P49249 oasc.RecoveryStrategy.doRecovery Starting Replication Recovery. core=collection1
[junit4:junit4]   2> 8920 T2324 C141 P49249 oascsi.HttpClientUtil.createClient Creating new http client, config:maxConnections=128&maxConnectionsPerHost=32&followRedirects=false
[junit4:junit4]   2> 8920 T2264 oascsi.HttpClientUtil.createClient Creating new http client, config:maxConnections=128&maxConnectionsPerHost=32&followRedirects=false
[junit4:junit4]   2> ASYNC  NEW_CORE C142 name=collection1 org.apache.solr.core.SolrCore@5840493 url=http://127.0.0.1:49239/solr/collection1 node=127.0.0.1:49239_solr
[junit4:junit4]   2> 8934 T2290 C142 P49239 REQ /get {distrib=false&qt=/get&wt=javabin&version=2&getVersions=100} status=0 QTime=0 
[junit4:junit4]   2> 9304 T2285 oascc.ZkStateReader.updateClusterState Updating cloud state from ZooKeeper... 
[junit4:junit4]   2> 9318 T2284 oascc.ZkStateReader$2.process A cluster state change has occurred - updating...
[junit4:junit4]   2> 9318 T2298 oascc.ZkStateReader$2.process A cluster state change has occurred - updating...
[junit4:junit4]   2> 9318 T2322 oascc.ZkStateReader$2.process A cluster state change has occurred - updating...
[junit4:junit4]   2> 9318 T2310 oascc.ZkStateReader$2.process A cluster state change has occurred - updating...
[junit4:junit4]   2> 9390 T2264 oejs.Server.doStart jetty-8.1.2.v20120308
[junit4:junit4]   2> 9393 T2264 oejs.AbstractConnector.doStart Started SocketConnector@0.0.0.0:49256
[junit4:junit4]   2> 9393 T2264 oasc.SolrResourceLoader.locateSolrHome JNDI not configured for solr (NoInitialContextEx)
[junit4:junit4]   2> 9394 T2264 oasc.SolrResourceLoader.locateSolrHome using system property solr.solr.home: /usr/home/hudson/hudson-slave/workspace/Lucene-Solr-Tests-4.x-java7/solr/build/solr-core/test/J1/./solrtest-jetty4-1347758519095
[junit4:junit4]   2> 9394 T2264 oasc.SolrResourceLoader.<init> new SolrResourceLoader for deduced Solr Home: '/usr/home/hudson/hudson-slave/workspace/Lucene-Solr-Tests-4.x-java7/solr/build/solr-core/test/J1/./solrtest-jetty4-1347758519095/'
[junit4:junit4]   2> 9432 T2264 oass.SolrDispatchFilter.init SolrDispatchFilter.init()
[junit4:junit4]   2> 9433 T2264 oasc.SolrResourceLoader.locateSolrHome JNDI not configured for solr (NoInitialContextEx)
[junit4:junit4]   2> 9433 T2264 oasc.SolrResourceLoader.locateSolrHome using system property solr.solr.home: /usr/home/hudson/hudson-slave/workspace/Lucene-Solr-Tests-4.x-java7/solr/build/solr-core/test/J1/./solrtest-jetty4-1347758519095
[junit4:junit4]   2> 9434 T2264 oasc.CoreContainer$Initializer.initialize looking for solr.xml: /usr/home/hudson/hudson-slave/workspace/Lucene-Solr-Tests-4.x-java7/solr/build/solr-core/test/J1/./solrtest-jetty4-1347758519095/solr.xml
[junit4:junit4]   2> 9434 T2264 oasc.CoreContainer.<init> New CoreContainer 89048069
[junit4:junit4]   2> 9435 T2264 oasc.CoreContainer.load Loading CoreContainer using Solr Home: '/usr/home/hudson/hudson-slave/workspace/Lucene-Solr-Tests-4.x-java7/solr/build/solr-core/test/J1/./solrtest-jetty4-1347758519095/'
[junit4:junit4]   2> 9435 T2264 oasc.SolrResourceLoader.<init> new SolrResourceLoader for directory: '/usr/home/hudson/hudson-slave/workspace/Lucene-Solr-Tests-4.x-java7/solr/build/solr-core/test/J1/./solrtest-jetty4-1347758519095/'
[junit4:junit4]   2> 9465 T2264 oasc.CoreContainer.load Registering Log Listener
[junit4:junit4]   2> 9480 T2264 oasc.CoreContainer.initZooKeeper Zookeeper client=127.0.0.1:49230/solr
[junit4:junit4]   2> 9480 T2264 oaz.ZooKeeper.<init> Initiating client connection, connectString=127.0.0.1:49230/solr sessionTimeout=5000 watcher=org.apache.solr.common.cloud.ConnectionManager@2ec62d6e
[junit4:junit4]   2> 9481 T2335 oaz.ClientCnxn$SendThread.startConnect Opening socket connection to server /127.0.0.1:49230
[junit4:junit4]   2> 9481 T2264 oascc.ConnectionManager.waitForConnected Waiting for client to connect to ZooKeeper
[junit4:junit4]   2> 9482 T2335 oaz.ClientCnxn$SendThread.primeConnection Socket connection established to localhost/127.0.0.1:49230, initiating session
[junit4:junit4]   2> 9483 T2266 oazs.NIOServerCnxn$Factory.run Accepted socket connection from /140.211.11.196:49257
[junit4:junit4]   2> 9483 T2266 oazs.NIOServerCnxn.readConnectRequest Client attempting to establish new session at /140.211.11.196:49257
[junit4:junit4]   2> 9485 T2268 oazs.NIOServerCnxn.finishSessionInit Established session 0x139ccaad0590006 with negotiated timeout 5000 for client /140.211.11.196:49257
[junit4:junit4]   2> 9485 T2335 oaz.ClientCnxn$SendThread.readConnectResult Session establishment complete on server localhost/127.0.0.1:49230, sessionid = 0x139ccaad0590006, negotiated timeout = 5000
[junit4:junit4]   2> 9485 T2336 oascc.ConnectionManager.process Watcher org.apache.solr.common.cloud.ConnectionManager@2ec62d6e name:ZooKeeperConnection Watcher:127.0.0.1:49230/solr got event WatchedEvent state:SyncConnected type:None path:null path:null type:None
[junit4:junit4]   2> 9485 T2264 oascc.ConnectionManager.waitForConnected Client is connected to ZooKeeper
[junit4:junit4]   2> 9486 T2269 oazs.PrepRequestProcessor.pRequest Got user-level KeeperException when processing sessionid:0x139ccaad0590006 type:create cxid:0x1 zxid:0xfffffffffffffffe txntype:unknown reqpath:n/a Error Path:/solr/overseer Error:KeeperErrorCode = NodeExists for /solr/overseer
[junit4:junit4]   2> 9488 T2269 oazs.PrepRequestProcessor.pRequest Got user-level KeeperException when processing sessionid:0x139ccaad0590006 type:create cxid:0x2 zxid:0xfffffffffffffffe txntype:unknown reqpath:n/a Error Path:/solr/overseer Error:KeeperErrorCode = NodeExists for /solr/overseer
[junit4:junit4]   2> 9496 T2264 oasc.ZkController.createEphemeralLiveNode Register node as live in ZooKeeper:/live_nodes/127.0.0.1:49256_solr
[junit4:junit4]   2> 9497 T2269 oazs.PrepRequestProcessor.pRequest Got user-level KeeperException when processing sessionid:0x139ccaad0590006 type:delete cxid:0x4 zxid:0xfffffffffffffffe txntype:unknown reqpath:n/a Error Path:/solr/live_nodes/127.0.0.1:49256_solr Error:KeeperErrorCode = NoNode for /solr/live_nodes/127.0.0.1:49256_solr
[junit4:junit4]   2> 9498 T2264 oascc.SolrZkClient.makePath makePath: /live_nodes/127.0.0.1:49256_solr
[junit4:junit4]   2> 9500 T2298 oascc.ZkStateReader$3.process Updating live nodes
[junit4:junit4]   2> 9500 T2284 oascc.ZkStateReader$3.process Updating live nodes
[junit4:junit4]   2> 9500 T2310 oascc.ZkStateReader$3.process Updating live nodes
[junit4:junit4]   2> 9500 T2322 oascc.ZkStateReader$3.process Updating live nodes
[junit4:junit4]   2> 9501 T2264 oashc.HttpShardHandlerFactory.getParameter Setting socketTimeout to: 0
[junit4:junit4]   2> 9501 T2264 oashc.HttpShardHandlerFactory.getParameter Setting urlScheme to: http://
[junit4:junit4]   2> 9502 T2264 oashc.HttpShardHandlerFactory.getParameter Setting connTimeout to: 0
[junit4:junit4]   2> 9502 T2264 oashc.HttpShardHandlerFactory.getParameter Setting maxConnectionsPerHost to: 20
[junit4:junit4]   2> 9502 T2264 oashc.HttpShardHandlerFactory.getParameter Setting corePoolSize to: 0
[junit4:junit4]   2> 9503 T2264 oashc.HttpShardHandlerFactory.getParameter Setting maximumPoolSize to: 2147483647
[junit4:junit4]   2> 9503 T2264 oashc.HttpShardHandlerFactory.getParameter Setting maxThreadIdleTime to: 5
[junit4:junit4]   2> 9504 T2264 oashc.HttpShardHandlerFactory.getParameter Setting sizeOfQueue to: -1
[junit4:junit4]   2> 9504 T2264 oashc.HttpShardHandlerFactory.getParameter Setting fairnessPolicy to: false
[junit4:junit4]   2> 9505 T2264 oascsi.HttpClientUtil.createClient Creating new http client, config:maxConnectionsPerHost=20&maxConnections=10000&socketTimeout=0&connTimeout=0&retry=false
[junit4:junit4]   2> 9522 T2264 oascc.ZkStateReader.createClusterStateWatchersAndUpdate Updating cluster state from ZooKeeper... 
[junit4:junit4]   2> 9528 T2264 oasc.CoreContainer.create Creating SolrCore 'collection1' using instanceDir: /usr/home/hudson/hudson-slave/workspace/Lucene-Solr-Tests-4.x-java7/solr/build/solr-core/test/J1/./solrtest-jetty4-1347758519095/collection1
[junit4:junit4]   2> 9528 T2264 oasc.ZkController.createCollectionZkNode Check for collection zkNode:collection1
[junit4:junit4]   2> 9529 T2264 oasc.ZkController.createCollectionZkNode Collection zkNode exists
[junit4:junit4]   2> 9529 T2264 oasc.ZkController.readConfigName Load collection config from:/collections/collection1
[junit4:junit4]   2> 9530 T2264 oasc.SolrResourceLoader.<init> new SolrResourceLoader for directory: '/usr/home/hudson/hudson-slave/workspace/Lucene-Solr-Tests-4.x-java7/solr/build/solr-core/test/J1/./solrtest-jetty4-1347758519095/collection1/'
[junit4:junit4]   2> 9532 T2264 oasc.SolrResourceLoader.replaceClassLoader Adding 'file:/usr/home/hudson/hudson-slave/workspace/Lucene-Solr-Tests-4.x-java7/solr/build/solr-core/test/J1/solrtest-jetty4-1347758519095/collection1/lib/README' to classloader
[junit4:junit4]   2> 9532 T2264 oasc.SolrResourceLoader.replaceClassLoader Adding 'file:/usr/home/hudson/hudson-slave/workspace/Lucene-Solr-Tests-4.x-java7/solr/build/solr-core/test/J1/solrtest-jetty4-1347758519095/collection1/lib/classes/' to classloader
[junit4:junit4]   2> 9580 T2264 oasc.SolrConfig.<init> Using Lucene MatchVersion: LUCENE_40
[junit4:junit4]   2> 9646 T2264 oasc.SolrConfig.<init> Loaded SolrConfig: solrconfig.xml
[junit4:junit4]   2> 9747 T2264 oass.IndexSchema.readSchema Reading Solr Schema
[junit4:junit4]   2> 9754 T2264 oass.IndexSchema.readSchema Schema name=test
[junit4:junit4]   2> 10316 T2264 oass.OpenExchangeRatesOrgProvider.init Initialized with rates=open-exchange-rates.json, refreshInterval=1440.
[junit4:junit4]   2> 10327 T2264 oass.IndexSchema.readSchema default search field in schema is text
[junit4:junit4]   2> 10331 T2264 oass.IndexSchema.readSchema unique key field: id
[junit4:junit4]   2> 10341 T2264 oass.FileExchangeRateProvider.reload Reloading exchange rates from file currency.xml
[junit4:junit4]   2> 10346 T2264 oass.FileExchangeRateProvider.reload Reloading exchange rates from file currency.xml
[junit4:junit4]   2> 10351 T2264 oass.OpenExchangeRatesOrgProvider.reload Reloading exchange rates from open-exchange-rates.json
[junit4:junit4]   2> 10352 T2264 oass.OpenExchangeRatesOrgProvider.reload Reloading exchange rates from open-exchange-rates.json
[junit4:junit4]   2> 10353 T2264 oasc.SolrCore.<init> [collection1] Opening new SolrCore at /usr/home/hudson/hudson-slave/workspace/Lucene-Solr-Tests-4.x-java7/solr/build/solr-core/test/J1/./solrtest-jetty4-1347758519095/collection1/, dataDir=./org.apache.solr.cloud.BasicDistributedZk2Test-1347758510162/jetty4/
[junit4:junit4]   2> 10353 T2264 oasc.JmxMonitoredMap.<init> JMX monitoring is enabled. Adding Solr mbeans to JMX Server: com.sun.jmx.mbeanserver.JmxMBeanServer@399342e7
[junit4:junit4]   2> 10354 T2264 oasc.SolrCore.getNewIndexDir WARNING New index directory detected: old=null new=./org.apache.solr.cloud.BasicDistributedZk2Test-1347758510162/jetty4/index/
[junit4:junit4]   2> 10355 T2264 oasc.SolrCore.initIndex WARNING [collection1] Solr index directory './org.apache.solr.cloud.BasicDistributedZk2Test-1347758510162/jetty4/index' doesn't exist. Creating new index...
[junit4:junit4]   2> 10357 T2264 oasc.CachingDirectoryFactory.get return new directory for /usr/home/hudson/hudson-slave/workspace/Lucene-Solr-Tests-4.x-java7/solr/build/solr-core/test/J1/./org.apache.solr.cloud.BasicDistributedZk2Test-1347758510162/jetty4/index forceNew:false
[junit4:junit4]   2> 10363 T2264 oasc.SolrDeletionPolicy.onCommit SolrDeletionPolicy.onCommit: commits:num=1
[junit4:junit4]   2> 		commit{dir=NRTCachingDirectory(org.apache.lucene.store.NIOFSDirectory@/usr/home/hudson/hudson-slave/workspace/Lucene-Solr-Tests-4.x-java7/solr/build/solr-core/test/J1/org.apache.solr.cloud.BasicDistributedZk2Test-1347758510162/jetty4/index lockFactory=org.apache.lucene.store.NativeFSLockFactory@370ff28c; maxCacheMB=48.0 maxMergeSizeMB=4.0),segFN=segments_1,generation=1,filenames=[segments_1]
[junit4:junit4]   2> 10364 T2264 oasc.SolrDeletionPolicy.updateCommits newest commit = 1
[junit4:junit4]   2> 10365 T2264 oasc.SolrCore.initWriters created xml: solr.XMLResponseWriter
[junit4:junit4]   2> 10367 T2264 oasup.UpdateRequestProcessorChain.init inserting DistributedUpdateProcessorFactory into updateRequestProcessorChain "dedupe"
[junit4:junit4]   2> 10368 T2264 oasup.UpdateRequestProcessorChain.init inserting DistributedUpdateProcessorFactory into updateRequestProcessorChain "dedupe-allfields"
[junit4:junit4]   2> 10368 T2264 oasup.UpdateRequestProcessorChain.init inserting DistributedUpdateProcessorFactory into updateRequestProcessorChain "stored_sig"
[junit4:junit4]   2> 10369 T2264 oasup.UpdateRequestProcessorChain.init inserting DistributedUpdateProcessorFactory into updateRequestProcessorChain "uniq-fields"
[junit4:junit4]   2> 10370 T2264 oasup.UpdateRequestProcessorChain.init inserting DistributedUpdateProcessorFactory into updateRequestProcessorChain "distrib-dup-test-chain-implicit"
[junit4:junit4]   2> 10370 T2264 oasc.RequestHandlers.initHandlersFromConfig adding lazy requestHandler: solr.ReplicationHandler
[junit4:junit4]   2> 10371 T2264 oasc.RequestHandlers.initHandlersFromConfig created /replication: solr.ReplicationHandler
[junit4:junit4]   2> 10371 T2264 oasc.RequestHandlers.initHandlersFromConfig created standard: solr.StandardRequestHandler
[junit4:junit4]   2> 10372 T2264 oasc.RequestHandlers.initHandlersFromConfig created /get: solr.RealTimeGetHandler
[junit4:junit4]   2> 10373 T2264 oasc.RequestHandlers.initHandlersFromConfig created dismax: solr.SearchHandler
[junit4:junit4]   2> 10373 T2264 oasc.RequestHandlers.initHandlersFromConfig created mock: org.apache.solr.core.MockQuerySenderListenerReqHandler
[junit4:junit4]   2> 10374 T2264 oasc.RequestHandlers.initHandlersFromConfig created /admin/: org.apache.solr.handler.admin.AdminHandlers
[junit4:junit4]   2> 10375 T2264 oasc.RequestHandlers.initHandlersFromConfig created defaults: solr.StandardRequestHandler
[junit4:junit4]   2> 10375 T2264 oasc.RequestHandlers.initHandlersFromConfig adding lazy requestHandler: solr.StandardRequestHandler
[junit4:junit4]   2> 10376 T2264 oasc.RequestHandlers.initHandlersFromConfig created lazy: solr.StandardRequestHandler
[junit4:junit4]   2> 10376 T2264 oasc.RequestHandlers.initHandlersFromConfig created /update: solr.UpdateRequestHandler
[junit4:junit4]   2> 10377 T2264 oasc.RequestHandlers.initHandlersFromConfig created /terms: org.apache.solr.handler.component.SearchHandler
[junit4:junit4]   2> 10378 T2264 oasc.RequestHandlers.initHandlersFromConfig created spellCheckCompRH: org.apache.solr.handler.component.SearchHandler
[junit4:junit4]   2> 10378 T2264 oasc.RequestHandlers.initHandlersFromConfig created spellCheckCompRH_Direct: org.apache.solr.handler.component.SearchHandler
[junit4:junit4]   2> 10379 T2264 oasc.RequestHandlers.initHandlersFromConfig created spellCheckWithWordbreak: org.apache.solr.handler.component.SearchHandler
[junit4:junit4]   2> 10380 T2264 oasc.RequestHandlers.initHandlersFromConfig created spellCheckWithWordbreak_Direct: org.apache.solr.handler.component.SearchHandler
[junit4:junit4]   2> 10380 T2264 oasc.RequestHandlers.initHandlersFromConfig created spellCheckCompRH1: org.apache.solr.handler.component.SearchHandler
[junit4:junit4]   2> 10381 T2264 oasc.RequestHandlers.initHandlersFromConfig created tvrh: org.apache.solr.handler.component.SearchHandler
[junit4:junit4]   2> 10382 T2264 oasc.RequestHandlers.initHandlersFromConfig created /mlt: solr.MoreLikeThisHandler
[junit4:junit4]   2> 10382 T2264 oasc.RequestHandlers.initHandlersFromConfig created /debug/dump: solr.DumpRequestHandler
[junit4:junit4]   2> 10386 T2264 oashl.XMLLoader.init xsltCacheLifetimeSeconds=60
[junit4:junit4]   2> 10390 T2264 oasc.SolrCore.initDeprecatedSupport WARNING solrconfig.xml uses deprecated <admin/gettableFiles>, Please update your config to use the ShowFileRequestHandler.
[junit4:junit4]   2> 10392 T2264 oasc.SolrCore.initDeprecatedSupport WARNING adding ShowFileRequestHandler with hidden files: [SCHEMA.XML, OLD_SYNONYMS.TXT, STOPWORDS.TXT, PROTWORDS.TXT, OPEN-EXCHANGE-RATES.JSON, SYNONYMS.TXT, CURRENCY.XML, MAPPING-ISOLATIN1ACCENT.TXT]
[junit4:junit4]   2> 10395 T2264 oass.SolrIndexSearcher.<init> Opening Searcher@5042776f main
[junit4:junit4]   2> 10397 T2264 oasu.CommitTracker.<init> Hard AutoCommit: disabled
[junit4:junit4]   2> 10397 T2264 oasu.CommitTracker.<init> Soft AutoCommit: disabled
[junit4:junit4]   2> 10398 T2264 oashc.SpellCheckComponent.inform Initializing spell checkers
[junit4:junit4]   2> 10411 T2264 oass.DirectSolrSpellChecker.init init: {name=direct,classname=DirectSolrSpellChecker,field=lowerfilt,minQueryLength=3}
[junit4:junit4]   2> 10477 T2337 oasc.SolrCore.registerSearcher [collection1] Registered new searcher Searcher@5042776f main{StandardDirectoryReader(segments_1:1)}
[junit4:junit4]   2> 10826 T2285 oascc.ZkStateReader.updateClusterState Updating cloud state from ZooKeeper... 
[junit4:junit4]   2> 10840 T2284 oascc.ZkStateReader$2.process A cluster state change has occurred - updating...
[junit4:junit4]   2> 10840 T2298 oascc.ZkStateReader$2.process A cluster state change has occurred - updating...
[junit4:junit4]   2> 10840 T2336 oascc.ZkStateReader$2.process A cluster state change has occurred - updating...
[junit4:junit4]   2> 10840 T2310 oascc.ZkStateReader$2.process A cluster state change has occurred - updating...
[junit4:junit4]   2> 10840 T2322 oascc.ZkStateReader$2.process A cluster state change has occurred - updating...
[junit4:junit4]   2> 10984 T2264 oasc.CoreContainer.register registering core: collection1
[junit4:junit4]   2> 10984 T2264 oasc.ZkController.register Register shard - core:collection1 address:http://127.0.0.1:49256/solr shardId:shard2
[junit4:junit4]   2> 10988 T2264 oasc.ZkController.register We are http://127.0.0.1:49256/solr/collection1/ and leader is http://127.0.0.1:49244/solr/collection1/
[junit4:junit4]   2> 10988 T2264 oasc.ZkController.register No LogReplay needed for core=collection1 baseURL=http://127.0.0.1:49256/solr
[junit4:junit4]   2> 10989 T2264 oasc.ZkController.checkRecovery Core needs to recover:collection1
[junit4:junit4]   2> 10989 T2264 oasu.DefaultSolrCoreState.doRecovery Running recovery - first canceling any ongoing recovery
[junit4:junit4]   2> ASYNC  NEW_CORE C143 name=collection1 org.apache.solr.core.SolrCore@3006943a url=http://127.0.0.1:49256/solr/collection1 node=127.0.0.1:49256_solr
[junit4:junit4]   2> 10990 T2338 C143 P49256 oasc.RecoveryStrategy.run Starting recovery process.  core=collection1 recoveringAfterStartup=true
[junit4:junit4]   2> 10991 T2264 oascc.ZkStateReader.updateClusterState Updating cloud state from ZooKeeper... 
[junit4:junit4]   2> 10991 T2338 C143 P49256 oasc.RecoveryStrategy.doRecovery ###### startupVersions=[]
[junit4:junit4]   2> 10992 T2264 oass.SolrDispatchFilter.init user.dir=/usr/home/hudson/hudson-slave/workspace/Lucene-Solr-Tests-4.x-java7/solr/build/solr-core/test/J1
[junit4:junit4]   2> 10993 T2338 C143 P49256 oasc.RecoveryStrategy.doRecovery Attempting to PeerSync from http://127.0.0.1:49244/solr/collection1/ core=collection1 - recoveringAfterStartup=true
[junit4:junit4]   2> 10993 T2264 oass.SolrDispatchFilter.init SolrDispatchFilter.init() done
[junit4:junit4]   2> 10993 T2338 C143 P49256 oasu.PeerSync.sync PeerSync: core=collection1 url=http://127.0.0.1:49256/solr START replicas=[http://127.0.0.1:49244/solr/collection1/] nUpdates=100
[junit4:junit4]   2> 10993 T2264 oascsi.HttpClientUtil.createClient Creating new http client, config:maxConnections=128&maxConnectionsPerHost=32&followRedirects=false
[junit4:junit4]   2> 10994 T2338 C143 P49256 oasu.PeerSync.sync WARNING no frame of reference to tell of we've missed updates
[junit4:junit4]   2> 10994 T2338 C143 P49256 oasc.RecoveryStrategy.doRecovery PeerSync Recovery was not successful - trying replication. core=collection1
[junit4:junit4]   2> 10994 T2338 C143 P49256 oasc.RecoveryStrategy.doRecovery Starting Replication Recovery. core=collection1
[junit4:junit4]   2> 10994 T2338 C143 P49256 oascsi.HttpClientUtil.createClient Creating new http client, config:maxConnections=128&maxConnectionsPerHost=32&followRedirects=false
[junit4:junit4]   2> ASYNC  NEW_CORE C144 name=collection1 org.apache.solr.core.SolrCore@465d3a20 url=http://127.0.0.1:49244/solr/collection1 node=127.0.0.1:49244_solr
[junit4:junit4]   2> 11004 T2302 C144 P49244 REQ /get {distrib=false&qt=/get&wt=javabin&version=2&getVersions=100} status=0 QTime=1 
[junit4:junit4]   2> 11012 T2264 oaz.ZooKeeper.<init> Initiating client connection, connectString=127.0.0.1:49230/solr sessionTimeout=10000 watcher=org.apache.solr.common.cloud.ConnectionManager@1ca2eec6
[junit4:junit4]   2> 11013 T2340 oaz.ClientCnxn$SendThread.startConnect Opening socket connection to server /127.0.0.1:49230
[junit4:junit4]   2> 11013 T2264 oascc.ConnectionManager.waitForConnected Waiting for client to connect to ZooKeeper
[junit4:junit4]   2> 11014 T2340 oaz.ClientCnxn$SendThread.primeConnection Socket connection established to localhost/127.0.0.1:49230, initiating session
[junit4:junit4]   2> 11014 T2266 oazs.NIOServerCnxn$Factory.run Accepted socket connection from /140.211.11.196:49265
[junit4:junit4]   2> 11015 T2266 oazs.NIOServerCnxn.readConnectRequest Client attempting to establish new session at /140.211.11.196:49265
[junit4:junit4]   2> 11016 T2268 oazs.NIOServerCnxn.finishSessionInit Established session 0x139ccaad0590007 with negotiated timeout 10000 for client /140.211.11.196:49265
[junit4:junit4]   2> 11016 T2340 oaz.ClientCnxn$SendThread.readConnectResult Session establishment complete on server localhost/127.0.0.1:49230, sessionid = 0x139ccaad0590007, negotiated timeout = 10000
[junit4:junit4]   2> 11016 T2341 oascc.ConnectionManager.process Watcher org.apache.solr.common.cloud.ConnectionManager@1ca2eec6 name:ZooKeeperConnection Watcher:127.0.0.1:49230/solr got event WatchedEvent state:SyncConnected type:None path:null path:null type:None
[junit4:junit4]   2> 11017 T2264 oascc.ConnectionManager.waitForConnected Client is connected to ZooKeeper
[junit4:junit4]   2> 11017 T2264 oascc.ZkStateReader.createClusterStateWatchersAndUpdate Updating cluster state from ZooKeeper... 
[junit4:junit4]   2> 11019 T2264 oasc.ChaosMonkey.monkeyLog monkey: init - expire sessions:true cause connection loss:true
[junit4:junit4]   2> 11019 T2264 oascsi.HttpClientUtil.createClient Creating new http client, config:
[junit4:junit4]   2> 11030 T2264 oascc.ZkStateReader.updateClusterState Updating cloud state from ZooKeeper... 
[junit4:junit4]   2> ASYNC  NEW_CORE C145 name=collection1 org.apache.solr.core.SolrCore@693acffd url=http://127.0.0.1:49236/solr/collection1 node=127.0.0.1:49236_solr
[junit4:junit4]   2> 11043 T2276 C145 P49236 oasc.SolrDeletionPolicy.onInit SolrDeletionPolicy.onInit: commits:num=1
[junit4:junit4]   2> 		commit{dir=NRTCachingDirectory(org.apache.lucene.store.NIOFSDirectory@/usr/home/hudson/hudson-slave/workspace/Lucene-Solr-Tests-4.x-java7/solr/build/solr-core/test/J1/org.apache.solr.cloud.BasicDistributedZk2Test-1347758510162/control/data/index lockFactory=org.apache.lucene.store.NativeFSLockFactory@158a78eb; maxCacheMB=48.0 maxMergeSizeMB=4.0),segFN=segments_1,generation=1,filenames=[segments_1]
[junit4:junit4]   2> 11044 T2276 C145 P49236 oasc.SolrDeletionPolicy.updateCommits newest commit = 1
[junit4:junit4]   2> 11048 T2276 C145 P49236 /update {wt=javabin&version=2} {add=[1 (1413227239122665472)]} 0 10
[junit4:junit4]   2> 11049 T2264 oaz.ZooKeeper.<init> Initiating client connection, connectString=127.0.0.1:49230/solr sessionTimeout=10000 watcher=org.apache.solr.common.cloud.ConnectionManager@21958c87
[junit4:junit4]   2> 11050 T2342 oaz.ClientCnxn$SendThread.startConnect Opening socket connection to server /127.0.0.1:49230
[junit4:junit4]   2> 11050 T2264 oascc.ConnectionManager.waitForConnected Waiting for client to connect to ZooKeeper
[junit4:junit4]   2> 11051 T2342 oaz.ClientCnxn$SendThread.primeConnection Socket connection established to localhost/127.0.0.1:49230, initiating session
[junit4:junit4]   2> 11051 T2266 oazs.NIOServerCnxn$Factory.run Accepted socket connection from /140.211.11.196:49267
[junit4:junit4]   2> 11051 T2266 oazs.NIOServerCnxn.readConnectRequest Client attempting to establish new session at /140.211.11.196:49267
[junit4:junit4]   2> 11053 T2268 oazs.NIOServerCnxn.finishSessionInit Established session 0x139ccaad0590008 with negotiated timeout 10000 for client /140.211.11.196:49267
[junit4:junit4]   2> 11053 T2342 oaz.ClientCnxn$SendThread.readConnectResult Session establishment complete on server localhost/127.0.0.1:49230, sessionid = 0x139ccaad0590008, negotiated timeout = 10000
[junit4:junit4]   2> 11053 T2343 oascc.ConnectionManager.process Watcher org.apache.solr.common.cloud.ConnectionManager@21958c87 name:ZooKeeperConnection Watcher:127.0.0.1:49230/solr got event WatchedEvent state:SyncConnected type:None path:null path:null type:None
[junit4:junit4]   2> 11054 T2264 oascc.ConnectionManager.waitForConnected Client is connected to ZooKeeper
[junit4:junit4]   2> 11054 T2264 oascc.ZkStateReader.createClusterStateWatchersAndUpdate Updating cluster state from ZooKeeper... 
[junit4:junit4]   2> 11062 T2292 C142 P49239 oasc.SolrDeletionPolicy.onInit SolrDeletionPolicy.onInit: commits:num=1
[junit4:junit4]   2> 		commit{dir=NRTCachingDirectory(org.apache.lucene.store.NIOFSDirectory@/usr/home/hudson/hudson-slave/workspace/Lucene-Solr-Tests-4.x-java7/solr/build/solr-core/test/J1/org.apache.solr.cloud.BasicDistributedZk2Test-1347758510162/jetty1/index lockFactory=org.apache.lucene.store.NativeFSLockFactory@24564365; maxCacheMB=48.0 maxMergeSizeMB=4.0),segFN=segments_1,generation=1,filenames=[segments_1]
[junit4:junit4]   2> 11063 T2292 C142 P49239 oasc.SolrDeletionPolicy.updateCommits newest commit = 1
[junit4:junit4]   2>  C141_STATE=coll:collection1 core:collection1 props:{shard=shard1, roles=null, state=recovering, core=collection1, collection=collection1, node_name=127.0.0.1:49249_solr, base_url=http://127.0.0.1:49249/solr}
[junit4:junit4]   2> 11087 T2314 C141 P49249 oasc.SolrDeletionPolicy.onInit SolrDeletionPolicy.onInit: commits:num=1
[junit4:junit4]   2> 		commit{dir=NRTCachingDirectory(org.apache.lucene.store.NIOFSDirectory@/usr/home/hudson/hudson-slave/workspace/Lucene-Solr-Tests-4.x-java7/solr/build/solr-core/test/J1/org.apache.solr.cloud.BasicDistributedZk2Test-1347758510162/jetty3/index lockFactory=org.apache.lucene.store.NativeFSLockFactory@511d754f; maxCacheMB=48.0 maxMergeSizeMB=4.0),segFN=segments_1,generation=1,filenames=[segments_1]
[junit4:junit4]   2> 11089 T2314 C141 P49249 oasc.SolrDeletionPolicy.updateCommits newest commit = 1
[junit4:junit4]   2> 11094 T2314 C141 P49249 REQ /update {distrib.from=http://127.0.0.1:49239/solr/collection1/&update.distrib=FROMLEADER&wt=javabin&version=2} status=0 QTime=13 
[junit4:junit4]   2> 11095 T2292 C142 P49239 /update {wt=javabin&version=2} {add=[1 (1413227239143636992)]} 0 38
[junit4:junit4]   2> 11096 T2264 oasc.AbstractDistribZkTestBase.waitForRecoveriesToFinish Wait for recoveries to finish - collection: collection1 failOnTimeout:true timeout (sec):1800
[junit4:junit4]   2> 11097 T2264 oascc.ZkStateReader.updateClusterState Updating cloud state from ZooKeeper... 
[junit4:junit4]   2> 11343 T2285 oascc.ZkStateReader.updateClusterState Updating cloud state from ZooKeeper... 
[junit4:junit4]   2> 11356 T2284 oascc.ZkStateReader$2.process A cluster state change has occurred - updating...
[junit4:junit4]   2> 11356 T2310 oascc.ZkStateReader$2.process A cluster state change has occurred - updating...
[junit4:junit4]   2> 11356 T2341 oascc.ZkStateReader$2.process A cluster state change has occurred - updating...
[junit4:junit4]   2> 11356 T2298 oascc.ZkStateReader$2.process A cluster state change has occurred - updating...
[junit4:junit4]   2> 11356 T2322 oascc.ZkStateReader$2.process A cluster state change has occurred - updating...
[junit4:junit4]   2> 11356 T2343 oascc.ZkStateReader$2.process A cluster state change has occurred - updating...
[junit4:junit4]   2> 11356 T2336 oascc.ZkStateReader$2.process A cluster state change has occurred - updating...
[junit4:junit4]   2> 11939 T2324 C141 P49249 oasc.RecoveryStrategy.doRecovery Begin buffering updates. core=collection1
[junit4:junit4]   2> 11939 T2324 C141 P49249 oasu.UpdateLog.bufferUpdates Starting to buffer updates. FSUpdateLog{state=ACTIVE, tlog=tlog{file=./org.apache.solr.cloud.BasicDistributedZk2Test-1347758510162/jetty3/tlog/tlog.0000000000000000000 refcount=1}}
[junit4:junit4]   2> 11939 T2324 C141 P49249 oasc.RecoveryStrategy.replicate Attempting to replicate from http://127.0.0.1:49239/solr/collection1/. core=collection1
[junit4:junit4]   2> 11939 T2324 C141 P49249 oascsi.HttpClientUtil.createClient Creating new http client, config:maxConnections=128&maxConnectionsPerHost=32&followRedirects=false
[junit4:junit4]   2> 11957 T2293 C142 P49239 oasu.DirectUpdateHandler2.commit start commit{flags=0,_version_=0,optimize=false,openSearcher=true,waitSearcher=true,expungeDeletes=false,softCommit=false}
[junit4:junit4]   2> 12005 T2293 C142 P49239 oasc.SolrDeletionPolicy.onCommit SolrDeletionPolicy.onCommit: commits:num=2
[junit4:junit4]   2> 		commit{dir=NRTCachingDirectory(org.apache.lucene.store.NIOFSDirectory@/usr/home/hudson/hudson-slave/workspace/Lucene-Solr-Tests-4.x-java7/solr/build/solr-core/test/J1/org.apache.solr.cloud.BasicDistributedZk2Test-1347758510162/jetty1/index lockFactory=org.apache.lucene.store.NativeFSLockFactory@24564365; maxCacheMB=48.0 maxMergeSizeMB=4.0),segFN=segments_1,generation=1,filenames=[segments_1]
[junit4:junit4]   2> 		commit{dir=NRTCachingDirectory(org.apache.lucene.store.NIOFSDirectory@/usr/home/hudson/hudson-slave/workspace/Lucene-Solr-Tests-4.x-java7/solr/build/solr-core/test/J1/org.apache.solr.cloud.BasicDistributedZk2Test-1347758510162/jetty1/index lockFactory=org.apache.lucene.store.NativeFSLockFactory@24564365; maxCacheMB=48.0 maxMergeSizeMB=4.0),segFN=segments_2,generation=2,filenames=[_0.fnm, _0_Pulsing40_0.tim, _0_Memory_0.ram, _0_NestedPulsing_0.frq, _0_MockFixedIntBlock_0.pos, _0_nrm.cfs, _0_NestedPulsing_0.tip, _0_MockFixedIntBlock_0.tib, _0_Pulsing40_0.prx, _0_Pulsing40_0.frq, _0_NestedPulsing_0.prx, _0_NestedPulsing_0.tim, _0_MockFixedIntBlock_0.frq, _0_MockFixedIntBlock_0.skp, _0_MockFixedIntBlock_0.pyl, _0_MockFixedIntBlock_0.doc, _0_MockFixedIntBlock_0.tii, _0_nrm.cfe, _0_Pulsing40_0.tip, segments_2, _0.fdx, _0.si, _0.fdt]
[junit4:junit4]   2> 12006 T2293 C142 P49239 oasc.SolrDeletionPolicy.updateCommits newest commit = 2
[junit4:junit4]   2> 12021 T2293 C142 P49239 oass.SolrIndexSearcher.<init> Opening Searcher@3df2da13 main
[junit4:junit4]   2> 12022 T2293 C142 P49239 oasu.DirectUpdateHandler2.commit end_commit_flush
[junit4:junit4]   2> 12023 T2299 oasc.SolrCore.registerSearcher [collection1] Registered new searcher Searcher@3df2da13 main{StandardDirectoryReader(segments_2:3 _0(4.0.0.2):C1)}
[junit4:junit4]   2> 12023 T2293 C142 P49239 /update {waitSearcher=true&commit=true&commit_end_point=true&wt=javabin&softCommit=false&version=2} {commit=} 0 66
[junit4:junit4]   2> 12024 T2324 C141 P49249 oash.ReplicationHandler.inform Commits will be reserved for  10000
[junit4:junit4]   2> 12024 T2324 C141 P49249 oash.SnapPuller.<init>  No value set for 'pollInterval'. Timer Task not started.
[junit4:junit4]   2> 12027 T2294 C142 P49239 oash.ReplicationHandler.inform Commits will be reserved for  10000
[junit4:junit4]   2> 12028 T2294 C142 P49239 REQ /replication {command=indexversion&wt=javabin&qt=/replication&version=2} status=0 QTime=2 
[junit4:junit4]   2> 12028 T2324 C141 P49249 oash.SnapPuller.fetchLatestIndex Master's generation: 2
[junit4:junit4]   2> 12029 T2324 C141 P49249 oash.SnapPuller.fetchLatestIndex Slave's generation: 1
[junit4:junit4]   2> 12029 T2324 C141 P49249 oash.SnapPuller.fetchLatestIndex Starting replication process
[junit4:junit4]   2> 12034 T2294 C142 P49239 REQ /replication {command=filelist&generation=2&wt=javabin&qt=/replication&version=2} status=0 QTime=3 
[junit4:junit4]   2> 12034 T2324 C141 P49249 oash.SnapPuller.fetchLatestIndex Number of files in latest index in master: 23
[junit4:junit4]   2> 12042 T2324 C141 P49249 oash.SnapPuller.fetchLatestIndex Starting download to ./org.apache.solr.cloud.BasicDistributedZk2Test-1347758510162/jetty3/index.20120915205202194 fullCopy=true
[junit4:junit4]   2> 12045 T2294 C142 P49239 REQ /replication {file=_0_Pulsing40_0.tim&command=filecontent&checksum=true&generation=2&qt=/replication&wt=filestream} status=0 QTime=0 
[junit4:junit4]   2> 12050 T2294 C142 P49239 REQ /replication {file=_0.fnm&command=filecontent&checksum=true&generation=2&qt=/replication&wt=filestream} status=0 QTime=0 
[junit4:junit4]   2> 12054 T2294 C142 P49239 REQ /replication {file=_0_Memory_0.ram&command=filecontent&checksum=true&generation=2&qt=/replication&wt=filestream} status=0 QTime=0 
[junit4:junit4]   2> 12058 T2294 C142 P49239 REQ /replication {file=_0_NestedPulsing_0.frq&command=filecontent&checksum=true&generation=2&qt=/replication&wt=filestream} status=0 QTime=0 
[junit4:junit4]   2> 12062 T2294 C142 P49239 REQ /replication {file=_0_MockFixedIntBlock_0.pos&command=filecontent&checksum=true&generation=2&qt=/replication&wt=filestream} status=0 QTime=0 
[junit4:junit4]   2> 12067 T2294 C142 P49239 REQ /replication {file=_0_nrm.cfs&command=filecontent&checksum=true&generation=2&qt=/replication&wt=filestream} status=0 QTime=0 
[junit4:junit4]   2> 12073 T2294 C142 P49239 REQ /replication {file=_0_Pulsing40_0.prx&command=filecontent&checksum=true&generation=2&qt=/replication&wt=filestream} status=0 QTime=0 
[junit4:junit4]   2> 12079 T2294 C142 P49239 REQ /replication {file=_0_MockFixedIntBlock_0.tib&command=filecontent&checksum=true&generation=2&qt=/replication&wt=filestream} status=0 QTime=0 
[junit4:junit4]   2> 12085 T2294 C142 P49239 REQ /replication {file=_0_NestedPulsing_0.tip&command=filecontent&checksum=true&generation=2&qt=/replication&wt=filestream} status=0 QTime=0 
[junit4:junit4]   2> 12091 T2294 C142 P49239 REQ /replication {file=_0_Pulsing40_0.frq&command=filecontent&checksum=true&generation=2&qt=/replication&wt=filestream} status=0 QTime=0 
[junit4:junit4]   2> 12097 T2294 C142 P49239 REQ /replication {file=_0_NestedPulsing_0.prx&command=filecontent&checksum=true&generation=2&qt=/replication&wt=filestream} status=0 QTime=0 
[junit4:junit4]   2> 12098 T2264 oascc.ZkStateReader.updateClusterState Updating cloud state from ZooKeeper... 
[junit4:junit4]   2> 12102 T2294 C142 P49239 REQ /replication {file=_0_NestedPulsing_0.tim&command=filecontent&checksum=true&generation=2&qt=/replication&wt=filestream} status=0 QTime=0 
[junit4:junit4]   2> 12108 T2294 C142 P49239 REQ /replication {file=_0_MockFixedIntBlock_0.frq&command=filecontent&checksum=true&generation=2&qt=/replication&wt=filestream} status=0 QTime=0 
[junit4:junit4]   2> 12114 T2294 C142 P49239 REQ /replication {file=_0_MockFixedIntBlock_0.pyl&command=filecontent&checksum=true&generation=2&qt=/replication&wt=filestream} status=0 QTime=0 
[junit4:junit4]   2> 12116 T2324 C141 P49249 oash.SnapPuller$FileFetcher.fetchPackets WARNING No content recieved for file: {name=_0_MockFixedIntBlock_0.pyl, lastmodified=1347758522000, size=0}
[junit4:junit4]   2> 12120 T2294 C142 P49239 REQ /replication {file=_0_MockFixedIntBlock_0.skp&command=filecontent&checksum=true&generation=2&qt=/replication&wt=filestream} status=0 QTime=0 
[junit4:junit4]   2> 12122 T2324 C141 P49249 oash.SnapPuller$FileFetcher.fetchPackets WARNING No content recieved for file: {name=_0_MockFixedIntBlock_0.skp, lastmodified=1347758522000, size=0}
[junit4:junit4]   2> 12126 T2294 C142 P49239 REQ /replication {file=_0_MockFixedIntBlock_0.tii&command=filecontent&checksum=true&generation=2&qt=/replication&wt=filestream} status=0 QTime=0 
[junit4:junit4]   2> 12132 T2294 C142 P49239 REQ /replication {file=_0_MockFixedIntBlock_0.doc&command=filecontent&checksum=true&generation=2&qt=/replication&wt=filestream} status=0 QTime=0 
[junit4:junit4]   2> 12138 T2294 C142 P49239 REQ /replication {file=_0_nrm.cfe&command=filecontent&checksum=true&generation=2&qt=/replication&wt=filestream} status=0 QTime=0 
[junit4:junit4]   2> 12144 T2294 C142 P49239 REQ /replication {file=segments_2&command=filecontent&checksum=true&generation=2&qt=/replication&wt=filestream} status=0 QTime=0 
[junit4:junit4]   2> 12150 T2294 C142 P49239 REQ /replication {file=_0_Pulsing40_0.tip&command=filecontent&checksum=true&generation=2&qt=/replication&wt=filestream} status=0 QTime=0 
[junit4:junit4]   2> 12156 T2294 C142 P49239 REQ /replication {file=_0.fdx&command=filecontent&checksum=true&generation=2&qt=/replication&wt=filestream} status=0 QTime=0 
[junit4:junit4]   2> 12168 T2294 C142 P49239 REQ /replication {file=_0.si&command=filecontent&checksum=true&generation=2&qt=/replication&wt=filestream} status=0 QTime=0 
[junit4:junit4]   2> 12177 T2294 C142 P49239 REQ /replication {file=_0.fdt&command=filecontent&checksum=true&generation=2&qt=/replication&wt=filestream} status=0 QTime=0 
[junit4:junit4]   2> 12180 T2324 C141 P49249 oash.SnapPuller.fetchLatestIndex Total time taken for download : 0 secs
[junit4:junit4]   2> 12219 T2324 C141 P49249 oash.SnapPuller.modifyIndexProps New index installed. Updating index properties... index=index.20120915205202194
[junit4:junit4]   2> 12221 T2324 C141 P49249 oasu.DefaultSolrCoreState.newIndexWriter Creating new IndexWriter...
[junit4:junit4]   2> 12250 T2324 C141 P49249 oasu.DefaultSolrCoreState.newIndexWriter Waiting until IndexWriter is unused... core=collection1
[junit4:junit4]   2> 12250 T2324 C141 P49249 oasu.DefaultSolrCoreState.newIndexWriter Rollback old IndexWriter... core=collection1
[junit4:junit4]   2> 12255 T2324 C141 P49249 oasc.SolrCore.getNewIndexDir WARNING New index directory detected: old=./org.apache.solr.cloud.BasicDistributedZk2Test-1347758510162/jetty3/index/ new=./org.apache.solr.cloud.BasicDistributedZk2Test-1347758510162/jetty3/index.20120915205202194
[junit4:junit4]   2> 12256 T2324 C141 P49249 oasc.CachingDirectoryFactory.get return new directory for /usr/home/hudson/hudson-slave/workspace/Lucene-Solr-Tests-4.x-java7/solr/build/solr-core/test/J1/./org.apache.solr.cloud.BasicDistributedZk2Test-1347758510162/jetty3/index.20120915205202194 forceNew:true
[junit4:junit4]   2> 12267 T2324 C141 P49249 oasc.SolrDeletionPolicy.onInit SolrDeletionPolicy.onInit: commits:num=1
[junit4:junit4]   2> 		commit{dir=NRTCachingDirectory(org.apache.lucene.store.NIOFSDirectory@/usr/home/hudson/hudson-slave/workspace/Lucene-Solr-Tests-4.x-java7/solr/build/solr-core/test/J1/org.apache.solr.cloud.BasicDistributedZk2Test-1347758510162/jetty3/index.20120915205202194 lockFactory=org.apache.lucene.store.NativeFSLockFactory@1b96b6a; maxCacheMB=48.0 maxMergeSizeMB=4.0),segFN=segments_2,generation=2,filenames=[_0.fnm, _0_Pulsing40_0.tim, _0_Memory_0.ram, _0_NestedPulsing_0.frq, _0_MockFixedIntBlock_0.pos, _0_nrm.cfs, _0_NestedPulsing_0.tip, _0_MockFixedIntBlock_0.tib, _0_Pulsing40_0.prx, _0_Pulsing40_0.frq, _0_NestedPulsing_0.prx, _0_NestedPulsing_0.tim, _0_MockFixedIntBlock_0.frq, _0_MockFixedIntBlock_0.pyl, _0_MockFixedIntBlock_0.skp, _0_MockFixedIntBlock_0.tii, _0_MockFixedIntBlock_0.doc, _0_nrm.cfe, _0_Pulsing40_0.tip, segments_2, _0.fdx, _0.si, _0.fdt]
[junit4:junit4]   2> 12267 T2324 C141 P49249 oasc.SolrDeletionPolicy.updateCommits newest commit = 2
[junit4:junit4]   2> 12267 T2324 C141 P49249 oasu.DefaultSolrCoreState.newIndexWriter New IndexWriter is ready to be used.
[junit4:junit4]   2> 12271 T2324 C141 P49249 oass.SolrIndexSearcher.<init> Opening Searcher@632e31a3 main
[junit4:junit4]   2> 12273 T2323 oasc.SolrCore.registerSearcher [collection1] Registered new searcher Searcher@632e31a3 main{StandardDirectoryReader(segments_2:3:nrt _0(4.0.0.2):C1)}
[junit4:junit4]   2> 12274 T2323 oasc.CachingDirectoryFactory.close Closing directory:/usr/home/hudson/hudson-slave/workspace/Lucene-Solr-Tests-4.x-java7/solr/build/solr-core/test/J1/./org.apache.solr.cloud.BasicDistributedZk2Test-1347758510162/jetty3/index
[junit4:junit4]   2> 12274 T2323 oash.SnapPuller$2.onClose removing old index directory ./org.apache.solr.cloud.BasicDistributedZk2Test-1347758510162/jetty3/index
[junit4:junit4]   2> 12276 T2324 C141 P49249 oasu.DirectUpdateHandler2.commit start commit{flags=0,_version_=0,optimize=false,openSearcher=false,waitSearcher=false,expungeDeletes=false,softCommit=false}
[junit4:junit4]   2> 12277 T2324 C141 P49249 oasu.DirectUpdateHandler2.commit end_commit_flush
[junit4:junit4]   2> 12278 T2324 C141 P49249 oasc.RecoveryStrategy.replay Replaying buffered documents. core=collection1
[junit4:junit4]   2> 12278 T2346 C141 P49249 oasu.UpdateLog$LogReplayer.doReplay WARNING Starting log replay tlog{file=./org.apache.solr.cloud.BasicDistributedZk2Test-1347758510162/jetty3/tlog/tlog.0000000000000000000 refcount=2} active=true starting pos=432
[junit4:junit4]   2> 12278 T2346 C141 P49249 oasu.DirectUpdateHandler2.commit start commit{flags=2,_version_=0,optimize=false,openSearcher=true,waitSearcher=true,expungeDeletes=false,softCommit=false}
[junit4:junit4]   2> 12281 T2346 C141 P49249 oass.SolrIndexSearcher.<init> Opening Searcher@73b77c76 main
[junit4:junit4]   2> 12282 T2346 C141 P49249 oasu.DirectUpdateHandler2.commit end_commit_flush
[junit4:junit4]   2> 12283 T2323 oasc.SolrCore.registerSearcher [collection1] Registered new searcher Searcher@73b77c76 main{StandardDirectoryReader(segments_2:3:nrt _0(4.0.0.2):C1)}
[junit4:junit4]   2> 12283 T2346 C141 P49249 oasu.UpdateLog$LogReplayer.run WARNING Log replay finished. recoveryInfo=RecoveryInfo{adds=0 deletes=0 deleteByQuery=0 errors=0 positionOfStart=432}
[junit4:junit4]   2> 12284 T2324 C141 P49249 oasc.RecoveryStrategy.doRecovery Replication Recovery was successful - registering as Active. core=collection1
[junit4:junit4]   2> 12285 T2324 C141 P49249 oasc.RecoveryStrategy.doRecovery Finished recovery process. core=collection1
[junit4:junit4]   2> 12361 T2285 oascc.ZkStateReader.updateClusterState Updating cloud state from ZooKeeper... 
[junit4:junit4]   2> 12382 T2284 oascc.ZkStateReader$2.process A cluster state change has occurred - updating...
[junit4:junit4]   2> 12383 T2322 oascc.ZkStateReader$2.process A cluster state change has occurred - updating...
[junit4:junit4]   2> 12383 T2336 oascc.ZkStateReader$2.process A cluster state change has occurred - updating...
[junit4:junit4]   2> 12383 T2343 oascc.ZkStateReader$2.process A cluster state change has occurred - updating...
[junit4:junit4]   2> 12383 T2298 oascc.ZkStateReader$2.process A cluster state change has occurred - updating...
[junit4:junit4]   2> 12383 T2341 oascc.ZkStateReader$2.process A cluster state change has occurred - updating...
[junit4:junit4]   2> 12383 T2310 oascc.ZkStateReader$2.process A cluster state change has occurred - updating...
[junit4:junit4]   2> 13100 T2264 oascc.ZkStateReader.updateClusterState Updating cloud state from ZooKeeper... 
[junit4:junit4]   2>  C143_STATE=coll:collection1 core:collection1 props:{shard=shard2, roles=null, state=recovering, core=collection1, collection=collection1, node_name=127.0.0.1:49256_solr, base_url=http://127.0.0.1:49256/solr}
[junit4:junit4]   2> 14016 T2338 C143 P49256 oasc.RecoveryStrategy.doRecovery Begin buffering updates. core=collection1
[junit4:junit4]   2> 14016 T2338 C143 P49256 oasu.UpdateLog.bufferUpdates Starting to buffer updates. FSUpdateLog{state=ACTIVE, tlog=null}
[junit4:junit4]   2> 14016 T2338 C143 P49256 oasc.RecoveryStrategy.replicate Attempting to replicate from http://127.0.0.1:49244/solr/collection1/. core=collection1
[junit4:junit4]   2> 14016 T2338 C143 P49256 oascsi.HttpClientUtil.createClient Creating new http client, config:maxConnections=128&maxConnectionsPerHost=32&followRedirects=false
[junit4:junit4]   2> 14028 T2304 C144 P49244 oasu.DirectUpdateHandler2.commit start commit{flags=0,_version_=0,optimize=false,openSearcher=true,waitSearcher=true,expungeDeletes=false,softCommit=false}
[junit4:junit4]   2> 14033 T2304 C144 P49244 oasc.SolrDeletionPolicy.onInit SolrDeletionPolicy.onInit: commits:num=1
[junit4:junit4]   2> 		commit{dir=NRTCachingDirectory(org.apache.lucene.store.NIOFSDirectory@/usr/home/hudson/hudson-slave/workspace/Lucene-Solr-Tests-4.x-java7/solr/build/solr-core/test/J1/org.apache.solr.cloud.BasicDistributedZk2Test-1347758510162/jetty2/index lockFactory=org.apache.lucene.store.NativeFSLockFactory@62eace1a; maxCacheMB=48.0 maxMergeSizeMB=4.0),segFN=segments_1,generation=1,filenames=[segments_1]
[junit4:junit4]   2> 14034 T2304 C144 P49244 oasc.SolrDeletionPolicy.updateCommits newest commit = 1
[junit4:junit4]   2> 14035 T2304 C144 P49244 oass.SolrIndexSearcher.<init> Opening Searcher@1b5ca132 main
[junit4:junit4]   2> 14036 T2304 C144 P49244 oasu.DirectUpdateHandler2.commit end_commit_flush
[junit4:junit4]   2> 14037 T2311 oasc.SolrCore.registerSearcher [collection1] Registered new searcher Searcher@1b5ca132 main{StandardDirectoryReader(segments_1:1)}
[junit4:junit4]   2> 14037 T2304 C144 P49244 /update {waitSearcher=true&commit=true&commit_end_point=true&wt=javabin&softCommit=false&version=2} {commit=} 0 9
[junit4:junit4]   2> 14038 T2338 C143 P49256 oash.ReplicationHandler.inform Commits will be reserved for  10000
[junit4:junit4]   2> 14038 T2338 C143 P49256 oash.SnapPuller.<init>  No value set for 'pollInterval'. Timer Task not started.
[junit4:junit4]   2> 14040 T2305 C144 P49244 oash.ReplicationHandler.inform Commits will be reserved for  10000
[junit4:junit4]   2> 14040 T2305 C144 P49244 REQ /replication {command=indexversion&wt=javabin&qt=/replication&version=2} status=0 QTime=1 
[junit4:junit4]   2> 14044 T2338 C143 P49256 oasc.SolrDeletionPolicy.onInit SolrDeletionPolicy.onInit: commits:num=1
[junit4:junit4]   2> 		commit{dir=NRTCachingDirectory(org.apache.lucene.store.NIOFSDirectory@/usr/home/hudson/hudson-slave/workspace/Lucene-Solr-Tests-4.x-java7/solr/build/solr-core/test/J1/org.apache.solr.cloud.BasicDistributedZk2Test-1347758510162/jetty4/index lockFactory=org.apache.lucene.store.NativeFSLockFactory@370ff28c; maxCacheMB=48.0 maxMergeSizeMB=4.0),segFN=segments_1,generation=1,filenames=[segments_1]
[junit4:junit4]   2> 14044 T2338 C143 P49256 oasc.SolrDeletionPolicy.updateCommits newest commit = 1
[junit4:junit4]   2> 14045 T2338 C143 P49256 oasu.DirectUpdateHandler2.commit start commit{flags=0,_version_=0,optimize=false,openSearcher=true,waitSearcher=true,expungeDeletes=false,softCommit=false}
[junit4:junit4]   2> 14077 T2338 C143 P49256 oasc.SolrDeletionPolicy.onCommit SolrDeletionPolicy.onCommit: commits:num=2
[junit4:junit4]   2> 		commit{dir=NRTCachingDirectory(org.apache.lucene.store.NIOFSDirectory@/usr/home/hudson/hudson-slave/workspace/Lucene-Solr-Tests-4.x-java7/solr/build/solr-core/test/J1/org.apache.solr.cloud.BasicDistributedZk2Test-1347758510162/jetty4/index lockFactory=org.apache.lucene.store.NativeFSLockFactory@370ff28c; maxCacheMB=48.0 maxMergeSizeMB=4.0),segFN=segments_1,generation=1,filenames=[segments_1]
[junit4:junit4]   2> 		commit{dir=NRTCachingDirectory(org.apache.lucene.store.NIOFSDirectory@/usr/home/hudson/hudson-slave/workspace/Lucene-Solr-Tests-4.x-java7/solr/build/solr-core/test/J1/org.apache.solr.cloud.BasicDistributedZk2Test-1347758510162/jetty4/index lockFactory=org.apache.lucene.store.NativeFSLockFactory@370ff28c; maxCacheMB=48.0 maxMergeSizeMB=4.0),segFN=segments_2,generation=2,filenames=[segments_2]
[junit4:junit4]   2> 14077 T2338 C143 P49256 oasc.SolrDeletionPolicy.updateCommits newest commit = 2
[junit4:junit4]   2> 14079 T2338 C143 P49256 oass.SolrIndexSearcher.<init> Opening Searcher@48fc7180 main
[junit4:junit4]   2> 14080 T2338 C143 P49256 oasu.DirectUpdateHandler2.commit end_commit_flush
[junit4:junit4]   2> 14080 T2337 oasc.SolrCore.registerSearcher [collection1] Registered new searcher Searcher@48fc7180 main{StandardDirectoryReader(segments_2:2)}
[junit4:junit4]   2> 14081 T2338 C143 P49256 oasc.RecoveryStrategy.replay No replay needed. core=collection1
[junit4:junit4]   2> 14081 T2338 C143 P49256 oasc.RecoveryStrategy.doRecovery Replication Recovery was successful - registering as Active. core=collection1
[junit4:junit4]   2> 14087 T2338 C143 P49256 oasc.RecoveryStrategy.doRecovery Finished recovery process. core=collection1
[junit4:junit4]   2> 14102 T2264 oascc.ZkStateReader.updateClusterState Updating cloud state from ZooKeeper... 
[junit4:junit4]   2> 14419 T2285 oascc.ZkStateReader.updateClusterState Updating cloud state from ZooKeeper... 
[junit4:junit4]   2> 14431 T2341 oascc.ZkStateReader$2.process A cluster state change has occurred - updating...
[junit4:junit4]   2> 14431 T2284 oascc.ZkStateReader$2.process A cluster state change has occurred - updating...
[junit4:junit4]   2> 14431 T2322 oascc.ZkStateReader$2.process A cluster state change has occurred - updating...
[junit4:junit4]   2> 14431 T2336 oascc.ZkStateReader$2.process A cluster state change has occurred - updating...
[junit4:junit4]   2> 14431 T2310 oascc.ZkStateReader$2.process A cluster state change has occurred - updating...
[junit4:junit4]   2> 14431 T2343 oascc.ZkStateReader$2.process A cluster state change has occurred - updating...
[junit4:junit4]   2> 14431 T2298 oascc.ZkStateReader$2.process A cluster state change has occurred - updating...
[junit4:junit4]   2> 15104 T2264 oascc.ZkStateReader.updateClusterState Updating cloud state from ZooKeeper... 
[junit4:junit4]   2> 15107 T2276 C145 P49236 oasu.DirectUpdateHandler2.commit start commit{flags=0,_version_=0,optimize=false,openSearcher=true,waitSearcher=true,expungeDeletes=false,softCommit=false}
[junit4:junit4]   2> 15154 T2276 C145 P49236 oasc.SolrDeletionPolicy.onCommit SolrDeletionPolicy.onCommit: commits:num=2
[junit4:junit4]   2> 		commit{dir=NRTCachingDirectory(org.apache.lucene.store.NIOFSDirectory@/usr/home/hudson/hudson-slave/workspace/Lucene-Solr-Tests-4.x-java7/solr/build/solr-core/test/J1/org.apache.solr.cloud.BasicDistributedZk2Test-1347758510162/control/data/index lockFactory=org.apache.lucene.store.NativeFSLockFactory@158a78eb; maxCacheMB=48.0 maxMergeSizeMB=4.0),segFN=segments_1,generation=1,filenames=[segments_1]
[junit4:junit4]   2> 		commit{dir=NRTCachingDirectory(org.apache.lucene.store.NIOFSDirectory@/usr/home/hudson/hudson-slave/workspace/Lucene-Solr-Tests-4.x-java7/solr/build/solr-core/test/J1/org.apache.solr.cloud.BasicDistributedZk2Test-1347758510162/control/data/index lockFactory=org.apache.lucene.store.NativeFSLockFactory@158a78eb; maxCacheMB=48.0 maxMergeSizeMB=4.0),segFN=segments_2,generation=2,filenames=[_0.fnm, _0_Pulsing40_0.tim, _0_Memory_0.ram, _0_NestedPulsing_0.frq, _0_MockFixedIntBlock_0.pos, _0_nrm.cfs, _0_NestedPulsing_0.tip, _0_MockFixedIntBlock_0.tib, _0_Pulsing40_0.prx, _0_Pulsing40_0.frq, _0_NestedPulsing_0.prx, _0_NestedPulsing_0.tim, _0_MockFixedIntBlock_0.frq, _0_MockFixedIntBlock_0.skp, _0_MockFixedIntBlock_0.pyl, _0_MockFixedIntBlock_0.doc, _0_MockFixedIntBlock_0.tii, _0_nrm.cfe, _0_Pulsing40_0.tip, segments_2, _0.fdx, _0.si, _0.fdt]
[junit4:junit4]   2> 15155 T2276 C145 P49236 oasc.SolrDeletionPolicy.updateCommits newest commit = 2
[junit4:junit4]   2> 15171 T2276 C145 P49236 oass.SolrIndexSearcher.<init> Opening Searcher@5a2af597 main
[junit4:junit4]   2> 15171 T2276 C145 P49236 oasu.DirectUpdateHandler2.commit end_commit_flush
[junit4:junit4]   2> 15173 T2287 oasc.SolrCore.registerSearcher [collection1] Registered new searcher Searcher@5a2af597 main{StandardDirectoryReader(segments_2:3 _0(4.0.0.2):C1)}
[junit4:junit4]   2> 15173 T2276 C145 P49236 /update {waitSearcher=true&wt=javabin&commit=true&softCommit=false&version=2} {commit=} 0 66
[junit4:junit4]   2> 15176 T2306 C144 P49244 oasu.DirectUpdateHandler2.commit start commit{flags=0,_version_=0,optimize=false,openSearcher=true,waitSearcher=true,expungeDeletes=false,softCommit=false}
[junit4:junit4]   2> 15180 T2306 C144 P49244 oass.SolrIndexSearcher.<init> Opening Searcher@13cc99e3 main
[junit4:junit4]   2> 15181 T2306 C144 P49244 oasu.DirectUpdateHandler2.commit end_commit_flush
[junit4:junit4]   2> 15182 T2311 oasc.SolrCore.registerSearcher [collection1] Registered new searcher Searcher@13cc99e3 main{StandardDirectoryReader(segments_1:1)}
[junit4:junit4]   2> 15183 T2306 C144 P49244 oasu.SolrCmdDistributor.distribCommit Distrib commit to:[StdNode: http://127.0.0.1:49239/solr/collection1/, StdNode: http://127.0.0.1:49249/solr/collection1/, StdNode: http://127.0.0.1:49256/solr/collection1/]
[junit4:junit4]   2> 15185 T2295 C142 P49239 oasu.DirectUpdateHandler2.commit start commit{flags=0,_version_=0,optimize=false,openSearcher=true,waitSearcher=true,expungeDeletes=false,softCommit=false}
[junit4:junit4]   2>  C141_STATE=coll:collection1 core:collection1 props:{shard=shard1, roles=null, state=active, core=collection1, collection=collection1, node_name=127.0.0.1:49249_solr, base_url=http://127.0.0.1:49249/solr}
[junit4:junit4]   2> 15186 T2314 C141 P49249 oasu.DirectUpdateHandler2.commit start commit{flags=0,_version_=0,optimize=false,openSearcher=true,waitSearcher=true,expungeDeletes=false,softCommit=false}
[junit4:junit4]   2> 15190 T2314 C141 P49249 oass.SolrIndexSearcher.<init> Opening Searcher@6642ffd2 main
[junit4:junit4]   2> 15191 T2314 C141 P49249 oasu.DirectUpdateHandler2.commit end_commit_flush
[junit4:junit4]   2> 15192 T2323 oasc.SolrCore.registerSearcher [collection1] Registered new searcher Searcher@6642ffd2 main{StandardDirectoryReader(segments_2:3:nrt _0(4.0.0.2):C1)}
[junit4:junit4]   2> 15193 T2314 C141 P49249 /update {waitSearcher=true&commit=true&wt=javabin&commit_end_point=true&expungeDeletes=false&softCommit=false&version=2} {commit=} 0 7
[junit4:junit4]   2>  C143_STATE=coll:collection1 core:collection1 props:{shard=shard2, roles=null, state=active, core=collection1, collection=collection1, node_name=127.0.0.1:49256_solr, base_url=http://127.0.0.1:49256/solr}
[junit4:junit4]   2> 15196 T2328 C143 P49256 oasu.DirectUpdateHandler2.commit start commit{flags=0,_version_=0,optimize=false,openSearcher=true,waitSearcher=true,expungeDeletes=false,softCommit=false}
[junit4:junit4]   2> 15203 T2328 C143 P49256 oass.SolrIndexSearcher.<init> Opening Searcher@6fecc2cb main
[junit4:junit4]   2> 15203 T2328 C143 P49256 oasu.DirectUpdateHandler2.commit end_commit_flush
[junit4:junit4]   2> 15204 T2295 C142 P49239 oass.SolrIndexSearcher.<init> Opening Searcher@16704ad4 main
[junit4:junit4]   2> 15205 T2337 oasc.SolrCore.registerSearcher [collection1] Registered new searcher Searcher@6fecc2cb main{StandardDirectoryReader(segments_2:2)}
[junit4:junit4]   2> 15205 T2295 C142 P49239 oasu.DirectUpdateHandler2.commit end_commit_flush
[junit4:junit4]   2> 15205 T2328 C143 P49256 /update {waitSearcher=true&commit=true&wt=javabin&commit_end_point=true&expungeDeletes=false&softCommit=false&version=2} {commit=} 0 9
[junit4:junit4]   2> 15206 T2299 oasc.SolrCore.registerSearcher [collection1] Registered new searcher Searcher@16704ad4 main{StandardDirectoryReader(segments_2:3 _0(4.0.0.2):C1)}
[junit4:junit4]   2> 15207 T2295 C142 P49239 /update {waitSearcher=true&commit=true&wt=javabin&commit_end_point=true&expungeDeletes=false&softCommit=false&version=2} {commit=} 0 22
[junit4:junit4]   2> 15208 T2306 C144 P49244 /update {waitSearcher=true&wt=javabin&commit=true&softCommit=false&version=2} {commit=} 0 32
[junit4:junit4]   2> 15215 T2277 C145 P49236 REQ /select {fl=id,score&shard.url=127.0.0.1:49236/solr/collection1/&NOW=1347758525369&start=0&q=*:*&distrib=false&isShard=true&wt=javabin&fsv=true&rows=10&version=2} hits=1 status=0 QTime=1 
[junit4:junit4]   2> 15218 T2277 C145 P49236 REQ /select {shard.url=127.0.0.1:49236/solr/collection1/&NOW=1347758525369&q=*:*&ids=1&distrib=false&isShard=true&wt=javabin&version=2} status=0 QTime=0 
[junit4:junit4]   2> 15219 T2276 C145 P49236 REQ /select {wt=javabin&q=*:*&version=2} hits=1 status=0 QTime=9 
[junit4:junit4]   2> 15220 T2264 oaz.ZooKeeper.<init> Initiating client connection, connectString=127.0.0.1:49230/solr sessionTimeout=10000 watcher=org.apache.solr.common.cloud.ConnectionManager@415c02c9
[junit4:junit4]   2> 15221 T2351 oaz.ClientCnxn$SendThread.startConnect Opening socket connection to server /127.0.0.1:49230
[junit4:junit4]   2> 15221 T2264 oascc.ConnectionManager.waitForConnected Waiting for client to connect to ZooKeeper
[junit4:junit4]   2> 15222 T2351 oaz.ClientCnxn$SendThread.primeConnection Socket connection established to localhost/127.0.0.1:49230, initiating session
[junit4:junit4]   2> 15222 T2266 oazs.NIOServerCnxn$Factory.run Accepted socket connection from /140.211.11.196:49281
[junit4:junit4]   2> 15223 T2266 oazs.NIOServerCnxn.readConnectRequest Client attempting to establish new session at /140.211.11.196:49281
[junit4:junit4]   2> 15230 T2268 oazs.NIOServerCnxn.finishSessionInit Established session 0x139ccaad0590009 with negotiated timeout 10000 for client /140.211.11.196:49281
[junit4:junit4]   2> 15230 T2351 oaz.ClientCnxn$SendThread.readConnectResult Session establishment complete on server localhost/127.0.0.1:49230, sessionid = 0x139ccaad0590009, negotiated timeout = 10000
[junit4:junit4]   2> 15231 T2352 oascc.ConnectionManager.process Watcher org.apache.solr.common.cloud.ConnectionManager@415c02c9 name:ZooKeeperConnection Watcher:127.0.0.1:49230/solr got event WatchedEvent state:SyncConnected type:None path:null path:null type:None
[junit4:junit4]   2> 15231 T2264 oascc.ConnectionManager.waitForConnected Client is connected to ZooKeeper
[junit4:junit4]   2> 15232 T2264 oascc.ZkStateReader.createClusterStateWatchersAndUpdate Updating cluster state from ZooKeeper... 
[junit4:junit4]   2> 15234 T2269 oazs.PrepRequestProcessor.pRequest Processed session termination for sessionid: 0x139ccaad0590009
[junit4:junit4]   2> 15247 T2352 oaz.ClientCnxn$EventThread.run EventThread shut down
[junit4:junit4]   2> 15247 T2266 oazs.NIOServerCnxn.closeSock Closed socket connection for client /140.211.11.196:49281 which had sessionid 0x139ccaad0590009
[junit4:junit4]   2> 15247 T2264 oaz.ZooKeeper.close Session: 0x139ccaad0590009 closed
[junit4:junit4]   2> 15250 T2296 C142 P49239 REQ /select {distrib=false&wt=javabin&q=*:*&version=2} hits=1 status=0 QTime=0 
[junit4:junit4]   2> 15253 T2307 C144 P49244 REQ /select {distrib=false&wt=javabin&q=*:*&version=2} hits=0 status=0 QTime=0 
[junit4:junit4]   2> 15260 T2315 C141 P49249 REQ /select {fl=id,score&shard.url=127.0.0.1:49239/solr/collection1/|127.0.0.1:49249/solr/collection1/&NOW=1347758525414&start=0&q=*:*&distrib=false&isShard=true&wt=javabin&fsv=true&rows=10&version=2} hits=1 status=0 QTime=1 
[junit4:junit4]   2> 15260 T2308 C144 P49244 REQ /select {fl=id,score&shard.url=127.0.0.1:49244/solr/collection1/|127.0.0.1:49256/solr/collection1/&NOW=1347758525414&start=0&q=*:*&distrib=false&isShard=true&wt=javabin&fsv=true&rows=10&version=2} hits=0 status=0 QTime=0 
[junit4:junit4]   2> 15265 T2315 C141 P49249 REQ /select {shard.url=127.0.0.1:49239/solr/collection1/|127.0.0.1:49249/solr/collection1/&NOW=1347758525414&q=*:*&ids=1&distrib=false&isShard=true&wt=javabin&version=2} status=0 QTime=0 
[junit4:junit4]   2> 15265 T2329 C143 P49256 REQ /select {wt=javabin&q=*:*&version=2} hits=1 status=0 QTime=10 
[junit4:junit4]   2> 15272 T2276 C145 P49236 /update {wt=javabin&version=2} {add=[2 (1413227243558141952)]} 0 4
[junit4:junit4]   2> 15285 T2328 C143 P49256 REQ /update {distrib.from=http://127.0.0.1:49244/solr/collection1/&update.distrib=FROMLEADER&wt=javabin&version=2} status=0 QTime=4 
[junit4:junit4]   2> 15285 T2306 C144 P49244 /update {wt=javabin&version=2} {add=[2 (1413227243565481984)]} 0 10
[junit4:junit4]   2> 15289 T2276 C145 P49236 /update {wt=javabin&version=2} {add=[3 (1413227243579113472)]} 0 1
[junit4:junit4]   2> 15296 T2328 C143 P49256 REQ /update {distrib.from=http://127.0.0.1:49244/solr/collection1/&update.distrib=FROMLEADER&wt=javabin&version=2} status=0 QTime=1 
[junit4:junit4]   2> 15297 T2306 C144 P49244 /update {wt=javabin&version=2} {add=[3 (1413227243583307776)]} 0 5
[junit4:junit4]   2> 15301 T2276 C145 P49236 /update {wt=javabin&version=2} {add=[4 (1413227243591696384)]} 0 1
[junit4:junit4]   2> 15313 T2314 C141 P49249 REQ /update {distrib.from=http://127.0.0.1:49239/solr/collection1/&update.distrib=FROMLEADER&wt=javabin&version=2} status=0 QTime=4 
[junit4:junit4]   2> 15313 T2292 C142 P49239 /update {wt=javabin&version=2} {add=[4 (1413227243595890688)]} 0 9
[junit4:junit4]   2> 15317 T2276 C145 P49236 /update {wt=javabin&version=2} {add=[5 (1413227243608473600)]} 0 1
[junit4:junit4]   2> 15327 T2328 C143 P49256 REQ /update {update.distrib=FROMLEADER&distrib.from=http://127.0.0.1:49244/solr/collection1/&wt=javabin&version=2} status=0 QTime=1 
[junit4:junit4]   2> 15328 T2303 C144 P49244 REQ /update {distrib.from=http://127.0.0.1:49239/solr/collection1/&update.distrib=TOLEADER&wt=javabin&version=2} status=0 QTime=6 
[junit4:junit4]   2> 15329 T2292 C142 P49239 /update {wt=javabin&version=2} {add=[5]} 0 9
[junit4:junit4]   2> 15333 T2276 C145 P49236 /update {wt=javabin&version=2} {add=[6 (1413227243625250816)]} 0 1
[junit4:junit4]   2> 15343 T2328 C143 P49256 REQ /update {update.distrib=FROMLEADER&distrib.from=http://127.0.0.1:49244/solr/collection1/&wt=javabin&version=2} status=0 QTime=1 
[junit4:junit4]   2> 15344 T2303 C144 P49244 REQ /update {distrib.from=http://127.0.0.1:49239/solr/collection1/&update.distrib=TOLEADER&wt=javabin&version=2} status=0 QTime=6 
[junit4:junit4]   2> 15345 T2292 C142 P49239 /update {wt=javabin&version=2} {add=[6]} 0 8
[junit4:junit4]   2> 15348 T2276 C145 P49236 /update {wt=javabin&version=2} {add=[7 (1413227243640979456)]} 0 1
[junit4:junit4]   2> 15358 T2328 C143 P49256 REQ /update {update.distrib=FROMLEADER&distrib.from=http://127.0.0.1:49244/solr/collection1/&wt=javabin&version=2} status=0 QTime=1 
[junit4:junit4]   2> 15359 T2303 C144 P49244 REQ /update {distrib.from=http://127.0.0.1:49239/solr/collection1/&update.distrib=TOLEADER&wt=javabin&version=2} status=0 QTime=6 
[junit4:junit4]   2> 15360 T2292 C142 P49239 /update {wt=javabin&version=2} {add=[7]} 0 9
[junit4:junit4]   2> 15363 T2276 C145 P49236 /update {wt=javabin&version=2} {add=[8 (1413227243656708096)]} 0 1
[junit4:junit4]   2> 15373 T2314 C141 P49249 REQ /update {update.distrib=FROMLEADER&distrib.from=http://127.0.0.1:49239/solr/collection1/&wt=javabin&version=2} status=0 QTime=1 
[junit4:junit4]   2> 15374 T2295 C142 P49239 REQ /update {distrib.from=http://127.0.0.1:49244/solr/collection1/&update.distrib=TOLEADER&wt=javabin&version=2} status=0 QTime=6 
[junit4:junit4]   2> 15374 T2306 C144 P49244 /update {wt=javabin&version=2} {add=[8]} 0 8
[junit4:junit4]   2> 15378 T2276 C145 P49236 /update {wt=javabin&version=2} {add=[9 (1413227243672436736)]} 0 1
[junit4:junit4]   2> 15388 T2328 C143 P49256 REQ /update {update.distrib=FROMLEADER&distrib.from=http://127.0.0.1:49244/solr/collection1/&wt=javabin&version=2} status=0 QTime=1 
[junit4:junit4]   2> 15389 T2303 C144 P49244 REQ /update {distrib.from=http://127.0.0.1:49239/solr/collection1/&update.distrib=TOLEADER&wt=javabin&version=2} status=0 QTime=6 
[junit4:junit4]   2> 15389 T2292 C142 P49239 /update {wt=javabin&version=2} {add=[9]} 0 8
[junit4:junit4]   2> 15393 T2276 C145 P49236 /update {wt=javabin&version=2} {add=[10 (1413227243688165376)]} 0 1
[junit4:junit4]   2> 15400 T2314 C141 P49249 REQ /update {distrib.from=http://127.0.0.1:49239/solr/collection1/&update.distrib=FROMLEADER&wt=javabin&version=2} status=0 QTime=1 
[junit4:junit4]   2> 15401 T2292 C142 P49239 /update {wt=javabin&version=2} {add=[10 (1413227243692359680)]} 0 5
[junit4:junit4]   2> 15431 T2276 C145 P49236 /update {wt=javabin&version=2} {add=[11 (1413227243700748288)]} 0 27
[junit4:junit4]   2> 15440 T2314 C141 P49249 REQ /update {update.distrib=FROMLEADER&distrib.from=http://127.0.0.1:49239/solr/collection1/&wt=javabin&version=2} status=0 QTime=1 
[junit4:junit4]   2> 15441 T2295 C142 P49239 REQ /update {distrib.from=http://127.0.0.1:49244/solr/collection1/&update.distrib=TOLEADER&wt=javabin&version=2} status=0 QTime=6 
[junit4:junit4]   2> 15442 T2306 C144 P49244 /update {wt=javabin&version=2} {add=[11]} 0 8
[junit4:junit4]   2> 15447 T2276 C145 P49236 /update {wt=javabin&version=2} {add=[12 (1413227243742691328)]} 0 3
[junit4:junit4]   2> 15454 T2314 C141 P49249 REQ /update {distrib.from=http://127.0.0.1:49239/solr/collection1/&update.distrib=FROMLEADER&wt=javabin&version=2} status=0 QTime=1 
[junit4:junit4]   2> 15455 T2292 C142 P49239 /update {wt=javabin&version=2} {add=[12 (1413227243748982784)]} 0 5
[junit4:junit4]   2> 15459 T2276 C145 P49236 /update {wt=javabin&version=2} {add=[13 (1413227243757371392)]} 0 1
[junit4:junit4]   2> 15467 T2314 C141 P49249 REQ /update {distrib.from=http://127.0.0.1:49239/solr/collection1/&update.distrib=FROMLEADER&wt=javabin&version=2} status=0 QTime=1 
[junit4:junit4]   2> 15468 T2292 C142 P49239 /update {wt=javabin&version=2} {add=[13 (1413227243761565696)]} 0 6
[junit4:junit4]   2> 15472 T2276 C145 P49236 /update {wt=javabin&version=2} {add=[14 (1413227243771002880)]} 0 1
[junit4:junit4]   2> 15478 T2314 C141 P49249 REQ /update {distrib.from=http://127.0.0.1:49239/solr/collection1/&update.distrib=FROMLEADER&wt=javabin&version=2} status=0 QTime=1 
[junit4:junit4]   2> 15479 T2292 C142 P49239 /update {wt=javabin&version=2} {add=[14 (1413227243775197184)]} 0 4
[junit4:junit4]   2> 15483 T2276 C145 P49236 /update {wt=javabin&version=2} {add=[15 (1413227243782537216)]} 0 1
[junit4:junit4]   2> 15492 T2314 C141 P49249 REQ /update {update.distrib=FROMLEADER&distrib.from=http://127.0.0.1:49239/solr/collection1/&wt=javabin&version=2} status=0 QTime=1 
[junit4:junit4]   2> 15493 T2295 C142 P49239 REQ /update {distrib.from=http://127.0.0.1:49244/solr/collection1/&update.distrib=TOLEADER&wt=javabin&version=2} status=0 QTime=5 
[junit4:junit4]   2> 15494 T2306 C144 P49244 /update {wt=javabin&version=2} {add=[15]} 0 8
[junit4:junit4]   2> 15498 T2276 C145 P49236 /update {wt=javabin&version=2} {add=[16 (1413227243798265856)]} 0 1
[junit4:junit4]   2> 15507 T2314 C141 P49249 REQ /update {update.distrib=FROMLEADER&distrib.from=http://127.0.0.1:49239/solr/collection1/&wt=javabin&version=2} status=0 QTime=1 
[junit4:junit4]   2> 15508 T2295 C142 P49239 REQ /update {distrib.from=http://127.0.0.1:49244/solr/collection1/&update.distrib=TOLEADER&wt=javabin&version=2} status=0 QTime=5 
[junit4:junit4]   2> 15509 T2306 C144 P49244 /update {wt=javabin&version=2} {add=[16]} 0 8
[junit4:junit4]   2> 15515 T2276 C145 P49236 /update {wt=javabin&version=2} {add=[17 (1413227243815043072)]} 0 3
[junit4:junit4]   2> 15532 T2328 C143 P49256 REQ /update {update.distrib=FROMLEADER&distrib.from=http://127.0.0.1:49244/solr/collection1/&wt=javabin&version=2} status=0 QTime=3 
[junit4:junit4]   2> 15533 T2303 C144 P49244 REQ /update {distrib.from=http://127.0.0.1:49239/solr/collection1/&update.distrib=TOLEADER&wt=javabin&version=2} status=0 QTime=12 
[junit4:junit4]   2> 15533 T2292 C142 P49239 /update {wt=javabin&version=2} {add=[17]} 0 15
[junit4:junit4]   2> 15537 T2276 C145 P49236 /update {wt=javabin&version=2} {add=[100 (1413227243839160320)]} 0 1
[junit4:junit4]   2> 15604 T2314 C141 P49249 REQ /update {distrib.from=http://127.0.0.1:49239/solr/collection1/&update.distrib=FROMLEADER&wt=javabin&version=2} status=0 QTime=30 
[junit4:junit4]   2> 15605 T2292 C142 P49239 /update {wt=javabin&version=2} {add=[100 (1413227243843354624)]} 0 65
[junit4:junit4]   2> 15609 T2276 C145 P49236 /update {wt=javabin&version=2} {add=[101 (1413227243914657792)]} 0 1
[junit4:junit4]   2> 15620 T2314 C141 P49249 REQ /update {distrib.from=http://127.0.0.1:49239/solr/collection1/&update.distrib=FROMLEADER&wt=javabin&version=2} status=0 QTime=3 
[junit4:junit4]   2> 15620 T2292 C142 P49239 /update {wt=javabin&version=2} {add=[101 (1413227243918852096)]} 0 8
[junit4:junit4]   2> 15624 T2276 C145 P49236 /update {wt=javabin&version=2} {add=[102 (1413227243930386432)]} 0 1
[junit4:junit4]   2> 15631 T2314 C141 P49249 REQ /update {distrib.from=http://127.0.0.1:49239/solr/collection1/&update.distrib=FROMLEADER&wt=javabin&version=2} status=0 QTime=1 
[junit4:junit4]   2> 15632 T2292 C142 P49239 /update {wt=javabin&version=2} {add=[102 (1413227243934580736)]} 0 5
[junit4:junit4]   2> 15660 T2276 C145 P49236 /update {wt=javabin&version=2} {add=[103 (1413227243942969344)]} 0 25
[junit4:junit4]   2> 15668 T2328 C143 P49256 REQ /update {distrib.from=http://127.0.0.1:49244/solr/collection1/&update.distrib=FROMLEADER&wt=javabin&version=2} status=0 QTime=1 
[junit4:junit4]   2> 15669 T2306 C144 P49244 /update {wt=javabin&version=2} {add=[103 (1413227243972329472)]} 0 6
[junit4:junit4]   2> 15674 T2276 C145 P49236 /update {wt=javabin&version=2} {add=[104 (1413227243981766656)]} 0 2
[junit4:junit4]   2> 15681 T2328 C143 P49256 REQ /update {distrib.from=http://127.0.0.1:49244/solr/collection1/&update.distrib=FROMLEADER&wt=javabin&version=2} status=0 QTime=1 
[junit4:junit4]   2> 15682 T2306 C144 P49244 /update {wt=javabin&version=2} {add=[104 (1413227243987009536)]} 0 5
[junit4:junit4]   2> 15685 T2276 C145 P49236 /update {wt=javabin&version=2} {add=[105 (1413227243994349568)]} 0 1
[junit4:junit4]   2> 15739 T2328 C143 P49256 REQ /update {distrib.from=http://127.0.0.1:49244/solr/collection1/&update.distrib=FROMLEADER&wt=javabin&version=2} status=0 QTime=25 
[junit4:junit4]   2> 15739 T2306 C144 P49244 /update {wt=javabin&version=2} {add=[105 (1413227243998543872)]} 0 51
[junit4:junit4]   2> 15745 T2276 C145 P49236 /update {wt=javabin&version=2} {add=[106 (1413227244057264128)]} 0 2
[junit4:junit4]   2> 15759 T2328 C143 P49256 REQ /update {update.distrib=FROMLEADER&distrib.from=http://127.0.0.1:49244/solr/collection1/&wt=javabin&version=2} status=0 QTime=3 
[junit4:junit4]   2> 15760 T2303 C144 P49244 REQ /update {distrib.from=http://127.0.0.1:49239/solr/collection1/&update.distrib=TOLEADER&wt=javabin&version=2} status=0 QTime=9 
[junit4:junit4]   2> 15760 T2292 C142 P49239 /update {wt=javabin&version=2} {add=[106]} 0 12
[junit4:junit4]   2> 15764 T2276 C145 P49236 /update {wt=javabin&version=2} {add=[107 (1413227244077187072)]} 0 1
[junit4:junit4]   2> 15774 T2314 C141 P49249 REQ /update {update.distrib=FROMLEADER&distrib.from=http://127.0.0.1:49239/solr/collection1/&wt=javabin&version=2} status=0 QTime=1 
[junit4:junit4]   2> 15775 T2295 C142 P49239 REQ /update {distrib.from=http://127.0.0.1:49244/solr/collection1/&update.distrib=TOLEADER&wt=javabin&version=2} status=0 QTime=5 
[junit4:junit4]   2> 15775 T2306 C144 P49244 /update {wt=javabin&version=2} {add=[107]} 0 8
[junit4:junit4]   2> 15779 T2276 C145 P49236 /update {wt=javabin&version=2} {add=[108 (1413227244092915712)]} 0 1
[junit4:junit4]   2> 15789 T2314 C141 P49249 REQ /update {update.distrib=FROMLEADER&distrib.from=http://127.0.0.1:49239/solr/collection1/&wt=javabin&version=2} status=0 QTime=1 
[junit4:junit4]   2> 15790 T2295 C142 P49239 REQ /update {distrib.from=http://127.0.0.1:49244/solr/collection1/&update.distrib=TOLEADER&wt=javabin&version=2} status=0 QTime=5 
[junit4:junit4]   2> 15791 T2306 C144 P49244 /update {wt=javabin&version=2} {add=[108]} 0 9
[junit4:junit4]   2> 15794 T2276 C145 P49236 /update {wt=javabin&version=2} {add=[109 (1413227244108644352)]} 0 1
[junit4:junit4]   2> 15801 T2314 C141 P49249 REQ /update {distrib.from=http://127.0.0.1:49239/solr/collection1/&update.distrib=FROMLEADER&wt=javabin&version=2} status=0 QTime=1 
[junit4:junit4]   2> 15802 T2292 C142 P49239 /update {wt=javabin&version=2} {add=[109 (1413227244112838656)]} 0 5
[junit4:junit4]   2> 15806 T2276 C145 P49236 /update {wt=javabin&version=2} {add=[110 (1413227244121227264)]} 0 1
[junit4:junit4]   2> 15813 T2314 C141 P49249 REQ /update {distrib.from=http://127.0.0.1:49239/solr/collection1/&update.distrib=FROMLEADER&wt=javabin&version=2} status=0 QTime=1 
[junit4:junit4]   2> 15814 T2292 C142 P49239 /update {wt=javabin&version=2} {add=[110 (1413227244125421568)]} 0 5
[junit4:junit4]   2> 15818 T2276 C145 P49236 /update {wt=javabin&version=2} {add=[111 (1413227244133810176)]} 0 1
[junit4:junit4]   2> 15825 T2314 C141 P49249 REQ /update {distrib.from=http://127.0.0.1:49239/solr/collection1/&update.distrib=FROMLEADER&wt=javabin&version=2} status=0 QTime=1 
[junit4:junit4]   2> 15826 T2292 C142 P49239 /update {wt=javabin&version=2} {add=[111 (1413227244138004480)]} 0 5
[junit4:junit4]   2> 15831 T2276 C145 P49236 /update {wt=javabin&version=2} {add=[112 (1413227244147441664)]} 0 2
[junit4:junit4]   2> 15838 T2328 C143 P49256 REQ /update {distrib.from=http://127.0.0.1:49244/solr/collection1/&update.distrib=FROMLEADER&wt=javabin&version=2} status=0 QTime=1 
[junit4:junit4]   2> 15839 T2306 C144 P49244 /update {wt=javabin&version=2} {add=[112 (1413227244151635968)]} 0 5
[junit4:junit4]   2> 15854 T2276 C145 P49236 /update {wt=javabin&version=2} {add=[113 (1413227244158976000)]} 0 13
[junit4:junit4]   2> 15862 T2314 C141 P49249 REQ /update {distrib.from=http://127.0.0.1:49239/solr/collection1/&update.distrib=FROMLEADER&wt=javabin&version=2} status=0 QTime=1 
[junit4:junit4]   2> 15863 T2292 C142 P49239 /update {wt=javabin&version=2} {add=[113 (1413227244176801792)]} 0 6
[junit4:junit4]   2> 15868 T2276 C145 P49236 /update {wt=javabin&version=2} {add=[114 (1413227244185190400)]} 0 2
[junit4:junit4]   2> 15877 T2314 C141 P49249 REQ /update {update.distrib=FROMLEADER&distrib.from=http://127.0.0.1:49239/solr/collection1/&wt=javabin&version=2} status=0 QTime=1 
[junit4:junit4]   2> 15878 T2295 C142 P49239 REQ /update {distrib.from=http://127.0.0.1:49244/solr/collection1/&update.distrib=TOLEADER&wt=javabin&version=2} status=0 QTime=5 
[junit4:junit4]   2> 15878 T2306 C144 P49244 /update {wt=javabin&version=2} {add=[114]} 0 7
[junit4:junit4]   2> 15882 T2276 C145 P49236 /update {wt=javabin&version=2} {add=[115 (1413227244200919040)]} 0 1
[junit4:junit4]   2> 15889 T2328 C143 P49256 REQ /update {distrib.from=http://127.0.0.1:49244/solr/collection1/&update.distrib=FROMLEADER&wt=javabin&version=2} status=0 QTime=1 
[junit4:junit4]   2> 15890 T2306 C144 P49244 /update {wt=javabin&version=2} {add=[115 (1413227244205113344)]} 0 5
[junit4:junit4]   2> 15894 T2276 C145 P49236 /update {wt=javabin&version=2} {add=[116 (1413227244213501952)]} 0 1
[junit4:junit4]   2> 15901 T2328 C143 P49256 REQ /update {distrib.from=http://127.0.0.1:49244/solr/collection1/&update.distrib=FROMLEADER&wt=javabin&version=2} status=0 QTime=1 
[junit4:junit4]   2> 15902 T2306 C144 P49244 /update {wt=javabin&version=2} {add=[116 (1413227244217696256)]} 0 5
[junit4:junit4]   2> 15905 T2276 C145 P49236 /update {wt=javabin&version=2} {add=[117 (1413227244225036288)]} 0 1
[junit4:junit4]   2> 15912 T2328 C143 P49256 REQ /update {distrib.from=http://127.0.0.1:49244/solr/collection1/&update.distrib=FROMLEADER&wt=javabin&version=2} status=0 QTime=1 
[junit4:junit4]   2> 15913 T2306 C144 P49244 /update {wt=javabin&version=2} {add=[117 (1413227244229230592)]} 0 5
[junit4:junit4]   2> 15917 T2276 C145 P49236 /update {wt=javabin&version=2} {add=[118 (1413227244237619200)]} 0 1
[junit4:junit4]   2> 15956 T2314 C141 P49249 REQ /update {update.distrib=FROMLEADER&distrib.from=http://127.0.0.1:49239/solr/collection1/&wt=javabin&version=2} status=0 QTime=19 
[junit4:junit4]   2> 15957 T2295 C142 P49239 REQ /update {distrib.from=http://127.0.0.1:49244/solr/collection1/&update.distrib=TOLEADER&wt=javabin&version=2} status=0 QTime=35 
[junit4:junit4]   2> 15958 T2306 C144 P49244 /update {wt=javabin&version=2} {add=[118]} 0 38
[junit4:junit4]   2> 15962 T2276 C145 P49236 /update {wt=javabin&version=2} {add=[119 (1413227244284805120)]} 0 1
[junit4:junit4]   2> 15972 T2328 C143 P49256 REQ /update {update.distrib=FROMLEADER&distrib.from=http://127.0.0.1:49244/solr/collection1/&wt=javabin&version=2} status=0 QTime=1 
[junit4:junit4]   2> 15973 T2303 C144 P49244 REQ /update {distrib.from=http://127.0.0.1:49239/solr/collection1/&update.distrib=TOLEADER&wt=javabin&version=2} status=0 QTime=5 
[junit4:junit4]   2> 15974 T2292 C142 P49239 /update {wt=javabin&version=2} {add=[119]} 0 9
[junit4:junit4]   2> 15978 T2276 C145 P49236 /update {wt=javabin&version=2} {add=[120 (1413227244301582336)]} 0 1
[junit4:junit4]   2> 15988 T2328 C143 P49256 REQ /update {update.distrib=FROMLEADER&distrib.from=http://127.0.0.1:49244/solr/collection1/&wt=javabin&version=2} status=0 QTime=1 
[junit4:junit4]   2> 15989 T2303 C144 P49244 REQ /update {distrib.from=http://127.0.0.1:49239/solr/collection1/&update.distrib=TOLEADER&wt=javabin&version=2} status=0 QTime=5 
[junit4:junit4]   2> 15990 T2292 C142 P49239 /update {wt=javabin&version=2} {add=[120]} 0 9
[junit4:junit4]   2> 15994 T2276 C145 P49236 /update {wt=javabin&version=2} {add=[121 (1413227244318359552)]} 0 1
[junit4:junit4]   2> 16004 T2328 C143 P49256 REQ /update {update.distrib=FROMLEADER&distrib.from=http://127.0.0.1:49244/solr/collection1/&wt=javabin&version=2} status=0 QTime=1 
[junit4:junit4]   2> 16005 T2303 C144 P49244 REQ /update {distrib.from=http://127.0.0.1:49239/solr/collection1/&update.distrib=TOLEADER&wt=javabin&version=2} status=0 QTime=5 
[junit4:junit4]   2> 16005 T2292 C142 P49239 /update {wt=javabin&version=2} {add=[121]} 0 8
[junit4:junit4]   2> 16009 T2276 C145 P49236 /update {wt=javabin&version=2} {add=[122 (1413227244334088192)]} 0 1
[junit4:junit4]   2> 16023 T2314 C141 P49249 REQ /update {update.distrib=FROMLEADER&distrib.from=http://127.0.0.1:49239/solr/collection1/&wt=javabin&version=2} status=0 QTime=4 
[junit4:junit4]   2> 16024 T2295 C142 P49239 REQ /update {distrib.from=http://127.0.0.1:49244/solr/collection1/&update.distrib=TOLEADER&wt=javabin&version=2} status=0 QTime=10 
[junit4:junit4]   2> 16024 T2306 C144 P49244 /update {wt=javabin&version=2} {add=[122]} 0 12
[junit4:junit4]   2> 16039 T2276 C145 P49236 /update {wt=javabin&version=2} {add=[123 (1413227244354011136)]} 0 12
[junit4:junit4]   2> 16047 T2314 C141 P49249 REQ /update {distrib.from=http://127.0.0.1:49239/solr/collection1/&update.distrib=FROMLEADER&wt=javabin&version=2} status=0 QTime=2 
[junit4:junit4]   2> 16047 T2292 C142 P49239 /update {wt=javabin&version=2} {add=[123 (1413227244368691200)]} 0 6
[junit4:junit4]   2> 16053 T2276 C145 P49236 /update {wt=javabin&version=2} {add=[124 (1413227244379176960)]} 0 2
[junit4:junit4]   2> 16062 T2314 C141 P49249 REQ /update {distrib.from=http://127.0.0.1:49239/solr/collection1/&update.distrib=FROMLEADER&wt=javabin&version=2} status=0 QTime=2 
[junit4:junit4]   2> 16062 T2292 C142 P49239 /update {wt=javabin&version=2} {add=[124 (1413227244384419840)]} 0 6
[junit4:junit4]   2> 16066 T2276 C145 P49236 /update {wt=javabin&version=2} {add=[125 (1413227244393857024)]} 0 1
[junit4:junit4]   2> 16077 T2314 C141 P49249 REQ /update {update.distrib=FROMLEADER&distrib.from=http://127.0.0.1:49239/solr/collection1/&wt=javabin&version=2} status=0 QTime=2 
[junit4:junit4]   2> 16078 T2295 C142 P49239 REQ /update {distrib.from=http://127.0.0.1:49244/solr/collection1/&update.distrib=TOLEADER&wt=javabin&version=2} status=0 QTime=6 
[junit4:junit4]   2> 16078 T2306 C144 P49244 /update {wt=javabin&version=2} {add=[125]} 0 9
[junit4:junit4]   2> 16082 T2276 C145 P49236 /update {wt=javabin&version=2} {add=[126 (1413227244410634240)]} 0 1
[junit4:junit4]   2> 16092 T2328 C143 P49256 REQ /update {update.distrib=FROMLEADER&distrib.from=http://127.0.0.1:49244/solr/collection1/&wt=javabin&version=2} status=0 QTime=1 
[junit4:junit4]   2> 16093 T2303 C144 P49244 REQ /update {distrib.from=http://127.0.0.1:49239/solr/collection1/&update.distrib=TOLEADER&wt=javabin&version=2} status=0 QTime=5 
[junit4:junit4]   2> 16093 T2292 C142 P49239 /update {wt=javabin&version=2} {add=[126]} 0 8
[junit4:junit4]   2> 16098 T2276 C145 P49236 /update {wt=javabin&version=2} {add=[127 (1413227244427411456)]} 0 1
[junit4:junit4]   2> 16129 T2328 C143 P49256 REQ /update {distrib.from=http://127.0.0.1:49244/solr/collection1/&update.distrib=FROMLEADER&wt=javabin&version=2} status=0 QTime=14 
[junit4:junit4]   2> 16129 T2306 C144 P49244 /update {wt=javabin&version=2} {add=[127 (1413227244431605760)]} 0 28
[junit4:junit4]   2> 16133 T2276 C145 P49236 /update {wt=javabin&version=2} {add=[128 (1413227244463063040)]} 0 2
[junit4:junit4]   2> 16144 T2328 C143 P49256 REQ /update {update.distrib=FROMLEADER&distrib.from=http://127.0.0.1:49244/solr/collection1/&wt=javabin&version=2} status=0 QTime=2 
[junit4:junit4]   2> 16145 T2303 C144 P49244 REQ /update {distrib.from=http://127.0.0.1:49239/solr/collection1/&update.distrib=TOLEADER&wt=javabin&version=2} status=0 QTime=7 
[junit4:junit4]   2> 16146 T2292 C142 P49239 /update {wt=javabin&version=2} {add=[128]} 0 11
[junit4:junit4]   2> 16149 T2276 C145 P49236 /update {wt=javabin&version=2} {add=[129 (1413227244480888832)]} 0 1
[junit4:junit4]   2> 16156 T2314 C141 P49249 REQ /update {distrib.from=http://127.0.0.1:49239/solr/collection1/&update.distrib=FROMLEADER&wt=javabin&version=2} status=0 QTime=1 
[junit4:junit4]   2> 16157 T2292 C142 P49239 /update {wt=javabin&version=2} {add=[129 (1413227244485083136)]} 0 5
[junit4:junit4]   2> 16160 T2276 C145 P49236 /update {wt=javabin&version=2} {add=[130 (1413227244492423168)]} 0 1
[junit4:junit4]   2> 16167 T2328 C143 P49256 REQ /update {distrib.from=http://127.0.0.1:49244/solr/collection1/&update.distrib=FROMLEADER&wt=javabin&version=2} status=0 QTime=1 
[junit4:junit4]   2> 16168 T2306 C144 P49244 /update {wt=javabin&version=2} {add=[130 (1413227244496617472)]} 0 5
[junit4:junit4]   2> 16171 T2276 C145 P49236 /update {wt=javabin&version=2} {add=[131 (1413227244503957504)]} 0 1
[junit4:junit4]   2> 16178 T2328 C143 P49256 REQ /update {distrib.from=http://127.0.0.1:49244/solr/collection1/&update.distrib=FROMLEADER&wt=javabin&version=2} status=0 QTime=1 
[junit4:junit4]   2> 16179 T2306 C144 P49244 /update {wt=javabin&version=2} {add=[131 (1413227244508151808)]} 0 5
[junit4:junit4]   2> 16182 T2276 C145 P49236 /update {wt=javabin&version=2} {add=[132 (1413227244515491840)]} 0 1
[junit4:junit4]   2> 16189 T2314 C141 P49249 REQ /update {distrib.from=http://127.0.0.1:49239/solr/collection1/&update.distrib=FROMLEADER&wt=javabin&version=2} status=0 QTime=1 
[junit4:junit4]   2> 16190 T2292 C142 P49239 /update {wt=javabin&version=2} {add=[132 (1413227244519686144)]} 0 5
[junit4:junit4]   2> 16204 T2276 C145 P49236 /update {wt=javabin&version=2} {add=[133 (1413227244527026176)]} 0 12
[junit4:junit4]   2> 16215 T2314 C141 P49249 REQ /update {update.distrib=FROMLEADER&distrib.from=http://127.0.0.1:49239/solr/collection1/&wt=javabin&version=2} status=0 QTime=2 
[junit4:junit4]   2> 16216 T2295 C142 P49239 REQ /update {distrib.from=http://127.0.0.1:49244/solr/collection1/&update.distrib=TOLEADER&wt=javabin&version=2} status=0 QTime=6 
[junit4:junit4]   2> 16216 T2306 C144 P49244 /update {wt=javabin&version=2} {add=[133]} 0 9
[junit4:junit4]   2> 16221 T2276 C145 P49236 /update {wt=javabin&version=2} {add=[134 (1413227244555337728)]} 0 2
[junit4:junit4]   2> 16227 T2328 C143 P49256 REQ /update {distrib.from=http://127.0.0.1:49244/solr/collection1/&update.distrib=FROMLEADER&wt=javabin&version=2} status=0 QTime=1 
[junit4:junit4]   2> 16228 T2306 C144 P49244 /update {wt=javabin&version=2} {add=[134 (1413227244560580608)]} 0 4
[junit4:junit4]   2> 16232 T2276 C145 P49236 /update {wt=javabin&version=2} {add=[135 (1413227244567920640)]} 0 1
[junit4:junit4]   2> 16241 T2314 C141 P49249 REQ /update {update.distrib=FROMLEADER&distrib.from=http://127.0.0.1:49239/solr/collection1/&wt=javabin&version=2} status=0 QTime=1 
[junit4:junit4]   2> 16242 T2295 C142 P49239 REQ /update {distrib.from=http://127.0.0.1:49244/solr/collection1/&update.distrib=TOLEADER&wt=javabin&version=2} status=0 QTime=5 
[junit4:junit4]   2> 16242 T2306 C144 P49244 /update {wt=javabin&version=2} {add=[135]} 0 7
[junit4:junit4]   2> 16246 T2276 C145 P49236 /update {wt=javabin&version=2} {add=[136 (1413227244582600704)]} 0 1
[junit4:junit4]   2> 16253 T2328 C143 P49256 REQ /update {distrib.from=http://127.0.0.1:49244/solr/collection1/&update.distrib=FROMLEADER&wt=javabin&version=2} status=0 QTime=1 
[junit4:junit4]   2> 16254 T2306 C144 P49244 /update {wt=javabin&version=2} {add=[136 (1413227244586795008)]} 0 5
[junit4:junit4]   2> 16257 T2276 C145 P49236 /update {wt=javabin&version=2} {add=[137 (1413227244594135040)]} 0 1
[junit4:junit4]   2> 16264 T2328 C143 P49256 REQ /update {distrib.from=http://127.0.0.1:49244/solr/collection1/&update.distrib=FROMLEADER&wt=javabin&version=2} status=0 QTime=1 
[junit4:junit4]   2> 16265 T2306 C144 P49244 /update {wt=javabin&version=2} {add=[137 (1413227244598329344)]} 0 5
[junit4:junit4]   2> 16268 T2276 C145 P49236 /update {wt=javabin&version=2} {add=[138 (1413227244605669376)]} 0 1
[junit4:junit4]   2> 16277 T2314 C141 P49249 REQ /update {update.distrib=FROMLEADER&distrib.from=http://127.0.0.1:49239/solr/collection1/&wt=javabin&version=2} status=0 QTime=1 
[junit4:junit4]   2> 16278 T2295 C142 P49239 REQ /update {distrib.from=http://127.0.0.1:49244/solr/collection1/&update.distrib=TOLEADER&wt=javabin&version=2} status=0 QTime=5 
[junit4:junit4]   2> 16279 T2306 C144 P49244 /update {wt=javabin&version=2} {add=[138]} 0 8
[junit4:junit4]   2> 16282 T2276 C145 P49236 /update {wt=javabin&version=2} {add=[139 (1413227244620349440)]} 0 1
[junit4:junit4]   2> 16291 T2328 C143 P49256 REQ /update {update.distrib=FROMLEADER&distrib.from=http://127.0.0.1:49244/solr/collection1/&wt=javabin&version=2} status=0 QTime=1 
[junit4:junit4]   2> 16292 T2303 C144 P49244 REQ /update {distrib.from=http://127.0.0.1:49239/solr/collection1/&update.distrib=TOLEADER&wt=javabin&version=2} status=0 QTime=5 
[junit4:junit4]   2> 16292 T2292 C142 P49239 /update {wt=javabin&version=2} {add=[139]} 0 7
[junit4:junit4]   2> 16296 T2276 C145 P49236 /update {wt=javabin&version=2} {add=[140 (1413227244635029504)]} 0 1
[junit4:junit4]   2> 16303 T2328 C143 P49256 REQ /update {distrib.from=http://127.0.0.1:49244/solr/collection1/&update.distrib=FROMLEADER&wt=javabin&version=2} status=0 QTime=1 
[junit4:junit4]   2> 16303 T2306 C144 P49244 /update {wt=javabin&version=2} {add=[140 (1413227244639223808)]} 0 4
[junit4:junit4]   2> 16307 T2276 C145 P49236 /update {wt=javabin&version=2} {add=[141 (1413227244646563840)]} 0 1
[junit4:junit4]   2> 16314 T2328 C143 P49256 REQ /update {distrib.from=http://127.0.0.1:49244/solr/collection1/&update.distrib=FROMLEADER&wt=javabin&version=2} status=0 QTime=1 
[junit4:junit4]   2> 16314 T2306 C144 P49244 /update {wt=javabin&version=2} {add=[141 (1413227244650758144)]} 0 4
[junit4:junit4]   2> 16318 T2276 C145 P49236 /update {wt=javabin&version=2} {add=[142 (1413227244658098176)]} 0 1
[junit4:junit4]   2> 16351 T2328 C143 P49256 REQ /update {update.distrib=FROMLEADER&distrib.from=http://127.0.0.1:49244/solr/collection1/&wt=javabin&version=2} status=0 QTime=13 
[junit4:junit4]   2> 16352 T2303 C144 P49244 REQ /update {distrib.from=http://127.0.0.1:49239/solr/collection1/&update.distrib=TOLEADER&wt=javabin&version=2} status=0 QTime=29 
[junit4:junit4]   2> 16352 T2292 C142 P49239 /update {wt=javabin&version=2} {add=[142]} 0 31
[junit4:junit4]   2> 16368 T2276 C145 P49236 /update {wt=javabin&version=2} {add=[143 (1413227244697944064)]} 0 13
[junit4:junit4]   2> 16378 T2328 C143 P49256 REQ /update {distrib.from=http://127.0.0.1:49244/solr/collection1/&update.distrib=FROMLEADER&wt=javabin&version=2} status=0 QTime=2 
[junit4:junit4]   2> 16379 T2306 C144 P49244 /update {wt=javabin&version=2} {add=[143 (1413227244714721280)]} 0 8
[junit4:junit4]   2> 16384 T2276 C145 P49236 /update {wt=javabin&version=2} {add=[144 (1413227244726255616)]} 0 2
[junit4:junit4]   2> 16393 T2328 C143 P49256 REQ /update {update.distrib=FROMLEADER&distrib.from=http://127.0.0.1:49244/solr/collection1/&wt=javabin&version=2} status=0 QTime=1 
[junit4:junit4]   2> 16394 T2303 C144 P49244 REQ /update {distrib.from=http://127.0.0.1:49239/solr/collection1/&update.distrib=TOLEADER&wt=javabin&version=2} status=0 QTime=5 
[junit4:junit4]   2> 16395 T2292 C142 P49239 /update {wt=javabin&version=2} {add=[144]} 0 8
[junit4:junit4]   2> 16398 T2276 C145 P49236 /update {wt=javabin&version=2} {add=[145 (1413227244741984256)]} 0 1
[junit4:junit4]   2> 16418 T2328 C143 P49256 REQ /update {update.distrib=FROMLEADER&distrib.from=http://127.0.0.1:49244/solr/collection1/&wt=javabin&version=2} status=0 QTime=1 
[junit4:junit4]   2> 16419 T2303 C144 P49244 REQ /update {distrib.from=http://127.0.0.1:49239/solr/collection1/&update.distrib=TOLEADER&wt=javabin&version=2} status=0 QTime=6 
[junit4:junit4]   2> 16420 T2292 C142 P49239 /update {wt=javabin&version=2} {add=[145]} 0 10
[junit4:junit4]   2> 16424 T2276 C145 P49236 /update {wt=javabin&version=2} {add=[146 (1413227244769247232)]} 0 1
[junit4:junit4]   2> 16456 T2314 C141 P49249 REQ /update {update.distrib=FROMLEADER&distrib.from=http://127.0.0.1:49239/solr/collection1/&wt=javabin&version=2} status=0 QTime=13 
[junit4:junit4]   2> 16457 T2295 C142 P49239 REQ /update {distrib.from=http://127.0.0.1:49244/solr/collection1/&update.distrib=TOLEADER&wt=javabin&version=2} status=0 QTime=28 
[junit4:junit4]   2> 16458 T2306 C144 P49244 /update {wt=javabin&version=2} {add=[146]} 0 31
[junit4:junit4]   2> 16462 T2276 C145 P49236 /update {wt=javabin&version=2} {add=[147 (1413227244809093120)]} 0 1
[junit4:junit4]   2> 16469 T2328 C143 P49256 REQ /update {distrib.from=http://127.0.0.1:49244/solr/collection1/&update.distrib=FROMLEADER&wt=javabin&version=2} status=0 QTime=1 
[junit4:junit4]   2> 16470 T2306 C144 P49244 /update {wt=javabin&version=2} {add=[147 (1413227244813287424)]} 0 5
[junit4:junit4]   2> 16473 T2276 C145 P49236 /update {wt=javabin&version=2} {add=[148 (1413227244820627456)]} 0 1
[junit4:junit4]   2> 16484 T2314 C141 P49249 REQ /update {update.distrib=FROMLEADER&distrib.from=http://127.0.0.1:49239/solr/collection1/&wt=javabin&version=2} status=0 QTime=2 
[junit4:junit4]   2> 16485 T2295 C142 P49239 REQ /update {distrib.from=http://127.0.0.1:49244/solr/collection1/&update.distrib=TOLEADER&wt=javabin&version=2} status=0 QTime=7 
[junit4:junit4]   2> 16486 T2306 C144 P49244 /update {wt=javabin&version=2} {add=[148]} 0 10
[junit4:junit4]   2> 16489 T2276 C145 P49236 /update {wt=javabin&version=2} {add=[149 (1413227244837404672)]} 0 1
[junit4:junit4]   2> 16496 T2328 C143 P49256 REQ /update {distrib.from=http://127.0.0.1:49244/solr/collection1/&update.distrib=FROMLEADER&wt=javabin&version=2} status=0 QTime=1 
[junit4:junit4]   2> 16497 T2306 C144 P49244 /update {wt=javabin&version=2} {add=[149 (1413227244841598976)]} 0 5
[junit4:junit4]   2> 16497 T2264 oasc.AbstractDistribZkTestBase.waitForRecoveriesToFinish Wait for recoveries to finish - collection: collection1 failOnTimeout:true timeout (sec):1800
[junit4:junit4]   2> 16498 T2264 oascc.ZkStateReader.updateClusterState Updating cloud state from ZooKeeper... 
[junit4:junit4]   2> 16501 T2276 C145 P49236 oasu.DirectUpdateHandler2.commit start commit{flags=0,_version_=0,optimize=false,openSearcher=true,waitSearcher=true,expungeDeletes=false,softCommit=false}
[junit4:junit4]   2> 17003 T2276 C145 P49236 oasc.SolrDeletionPolicy.onCommit SolrDeletionPolicy.onCommit: commits:num=2
[junit4:junit4]   2> 		commit{dir=NRTCachingDirectory(org.apache.lucene.store.NIOFSDirectory@/usr/home/hudson/hudson-slave/workspace/Lucene-Solr-Tests-4.x-java7/solr/build/solr-core/test/J1/org.apache.solr.cloud.BasicDistributedZk2Test-1347758510162/control/data/index lockFactory=org.apache.lucene.store.NativeFSLockFactory@158a78eb; maxCacheMB=48.0 maxMergeSizeMB=4.0),segFN=segments_2,generation=2,filenames=[_0.fnm, _0_Pulsing40_0.tim, _0_Memory_0.ram, _0_NestedPulsing_0.frq, _0_MockFixedIntBlock_0.pos, _0_nrm.cfs, _0_NestedPulsing_0.tip, _0_MockFixedIntBlock_0.tib, _0_Pulsing40_0.prx, _0_Pulsing40_0.frq, _0_NestedPulsing_0.prx, _0_NestedPulsing_0.tim, _0_MockFixedIntBlock_0.frq, _0_MockFixedIntBlock_0.skp, _0_MockFixedIntBlock_0.pyl, _0_MockFixedIntBlock_0.doc, _0_MockFixedIntBlock_0.tii, _0_nrm.cfe, _0_Pulsing40_0.tip, segments_2, _0.fdx, _0.si, _0.fdt]
[junit4:junit4]   2> 		commit{dir=NRTCachingDirectory(org.apache.lucene.store.NIOFSDirectory@/usr/home/hudson/hudson-slave/workspace/Lucene-Solr-Tests-4.x-java7/solr/build/solr-core/test/J1/org.apache.solr.cloud.BasicDistributedZk2Test-1347758510162/control/data/index lockFactory=org.apache.lucene.store.NativeFSLockFactory@158a78eb; maxCacheMB=48.0 maxMergeSizeMB=4.0),segFN=segments_3,generation=3,filenames=[_5_nrm.cfe, _2_NestedPulsing_0.tim, _1_NestedPulsing_0.tip, _5_NestedPulsing_0.tip, _5_Memory_0.ram, _5_NestedPulsing_0.tim, _7.si, _3.fdt, _0_MockFixedIntBlock_0.tib, _3_NestedPulsing_0.prx, _0_Pulsing40_0.frq, _7_Memory_0.ram, _7.fnm, _7_NestedPulsing_0.frq, _6_NestedPulsing_0.prx, _0_MockFixedIntBlock_0.tii, _5_Pulsing40_0.tip, _1_NestedPulsing_0.tim, _2_NestedPulsing_0.tip, _5_Pulsing40_0.tim, _0_Pulsing40_0.tim, _0_Memory_0.ram, _2.fdt, _3_NestedPulsing_0.tim, _3_Pulsing40_0.tip, _7.fdx, _2.fdx, _7.fdt, _3_Pulsing40_0.tim, _1.fdx, _7_Pulsing40_0.frq, _5_nrm.cfs, _1.fdt, _3_NestedPulsing_0.tip, _7_NestedPulsing_0.tim, _2_MockFixedIntBlock_0.doc, _3.si, _1_MockFixedIntBlock_0.pos, _4_NestedPulsing_0.frq, _6.fdt, _7_NestedPulsing_0.tip, _6_Memory_0.ram, _2.si, _3_Pulsing40_0.frq, _6_NestedPulsing_0.frq, _2_Pulsing40_0.tim, _6.fdx, _2_Pulsing40_0.tip, _2_MockFixedIntBlock_0.skp, _3.fnm, _0_NestedPulsing_0.tip, _0_NestedPulsing_0.tim, _4_Pulsing40_0.prx, _1_Memory_0.ram, _2_nrm.cfe, _5_Pulsing40_0.frq, _0_MockFixedIntBlock_0.pyl, _0_Pulsing40_0.tip, _4_NestedPulsing_0.tip, _4_NestedPulsing_0.tim, _2_nrm.cfs, _2_NestedPulsing_0.prx, _0_NestedPulsing_0.frq, _0_NestedPulsing_0.prx, _2.fnm, _7_Pulsing40_0.tim, _3.fdx, _4_Pulsing40_0.tip, _1_NestedPulsing_0.frq, _4_Pulsing40_0.tim, _5_NestedPulsing_0.frq, _5_Pulsing40_0.prx, _0_MockFixedIntBlock_0.doc, _1.si, _2_NestedPulsing_0.frq, _6_NestedPulsing_0.tip, _6.si, _6.fnm, _6_NestedPulsing_0.tim, _7_Pulsing40_0.tip, _3_nrm.cfe, _5.fdt, _1_Pulsing40_0.tip, _6_Pulsing40_0.frq, _1_Pulsing40_0.tim, _1_MockFixedIntBlock_0.pyl, _4.fnm, _4_nrm.cfe, _0_Pulsing40_0.prx, _7_Pulsing40_0.prx, _1.fnm, _2_MockFixedIntBlock_0.tii, _1_Pulsing40_0.frq, _4.fdx, _2_MockFixedIntBlock_0.tib, _2_MockFixedIntBlock_0.pyl, _6_Pulsing40_0.tim, _1_Pulsing40_0.prx, _2_MockFixedIntBlock_0.frq, _6_Pulsing40_0.tip, _4_NestedPulsing_0.prx, _2_Pulsing40_0.prx, _0.fnm, _1_MockFixedIntBlock_0.frq, _0_MockFixedIntBlock_0.pos, _2_Pulsing40_0.frq, _5.si, _3_nrm.cfs, _3_NestedPulsing_0.frq, _1_MockFixedIntBlock_0.skp, _2_MockFixedIntBlock_0.pos, _6_Pulsing40_0.prx, _4_Memory_0.ram, _4_nrm.cfs, _1_NestedPulsing_0.prx, _1_MockFixedIntBlock_0.doc, _6_nrm.cfs, _0_MockFixedIntBlock_0.skp, _7_nrm.cfs, _2_Memory_0.ram, _0.si, _3_Memory_0.ram, _1_MockFixedIntBlock_0.tii, _1_nrm.cfs, _5.fnm, _7_NestedPulsing_0.prx, _7_nrm.cfe, _6_nrm.cfe, _0_nrm.cfs, _4.fdt, _4.si, _1_nrm.cfe, _0_MockFixedIntBlock_0.frq, _5_NestedPulsing_0.prx, _3_Pulsing40_0.prx, _4_Pulsing40_0.frq, _0_nrm.cfe, _5.fdx, _1_MockFixedIntBlock_0.tib, _0.fdx, segments_3, _0.fdt]
[junit4:junit4]   2> 17004 T2276 C145 P49236 oasc.SolrDeletionPolicy.updateCommits newest commit = 3
[junit4:junit4]   2> 17078 T2276 C145 P49236 oass.SolrIndexSearcher.<init> Opening Searcher@42e67391 main
[junit4:junit4]   2> 17079 T2276 C145 P49236 oasu.DirectUpdateHandler2.commit end_commit_flush
[junit4:junit4]   2> 17080 T2287 oasc.SolrCore.registerSearcher [collection1] Registered new searcher Searcher@42e67391 main{StandardDirectoryReader(segments_3:17 _0(4.0.0.2):C1 _1(4.0.0.2):C10 _2(4.0.0.2):C10 _3(4.0.0.2):C10 _4(4.0.0.2):C10 _5(4.0.0.2):C10 _6(4.0.0.2):C10 _7(4.0.0.2):C6)}
[junit4:junit4]   2> 17081 T2276 C145 P49236 /update {waitSearcher=true&wt=javabin&commit=true&softCommit=false&version=2} {commit=} 0 580
[junit4:junit4]   2> 17084 T2306 C144 P49244 oasu.DirectUpdateHandler2.commit start commit{flags=0,_version_=0,optimize=false,openSearcher=true,waitSearcher=true,expungeDeletes=false,softCommit=false}
[junit4:junit4]   2> 17844 T2306 C144 P49244 oasc.SolrDeletionPolicy.onCommit SolrDeletionPolicy.onCommit: commits:num=2
[junit4:junit4]   2> 		commit{dir=NRTCachingDirectory(org.apache.lucene.store.NIOFSDirectory

[...truncated too long message...]

:131)
[junit4:junit4]   2> 	at org.apache.zookeeper.ClientCnxn$EventThread.processEvent(ClientCnxn.java:526)
[junit4:junit4]   2> 	at org.apache.zookeeper.ClientCnxn$EventThread.run(ClientCnxn.java:502)
[junit4:junit4]   2> 
[junit4:junit4]   2> 305545 T2336 oasc.JmxMonitoredMap$SolrDynamicMBean.getMBeanInfo WARNING Could not getStatistics on info bean Lazy[solr.ReplicationHandler] java.lang.IllegalArgumentException: /usr/home/hudson/hudson-slave/workspace/Lucene-Solr-Tests-4.x-java7/solr/build/solr-core/test/J1/org.apache.solr.cloud.BasicDistributedZk2Test-1347758510162/jetty4/index does not exist
[junit4:junit4]   2> 	at org.apache.commons.io.FileUtils.sizeOfDirectory(FileUtils.java:2074)
[junit4:junit4]   2> 	at org.apache.solr.handler.ReplicationHandler.getIndexSize(ReplicationHandler.java:477)
[junit4:junit4]   2> 	at org.apache.solr.handler.ReplicationHandler.getStatistics(ReplicationHandler.java:525)
[junit4:junit4]   2> 	at org.apache.solr.core.RequestHandlers$LazyRequestHandlerWrapper.getStatistics(RequestHandlers.java:310)
[junit4:junit4]   2> 	at org.apache.solr.core.JmxMonitoredMap$SolrDynamicMBean.getMBeanInfo(JmxMonitoredMap.java:231)
[junit4:junit4]   2> 	at com.sun.jmx.interceptor.DefaultMBeanServerInterceptor.getClassName(DefaultMBeanServerInterceptor.java:1804)
[junit4:junit4]   2> 	at com.sun.jmx.interceptor.DefaultMBeanServerInterceptor.safeGetClassName(DefaultMBeanServerInterceptor.java:1595)
[junit4:junit4]   2> 	at com.sun.jmx.interceptor.DefaultMBeanServerInterceptor.checkMBeanPermission(DefaultMBeanServerInterceptor.java:1813)
[junit4:junit4]   2> 	at com.sun.jmx.interceptor.DefaultMBeanServerInterceptor.exclusiveUnregisterMBean(DefaultMBeanServerInterceptor.java:430)
[junit4:junit4]   2> 	at com.sun.jmx.interceptor.DefaultMBeanServerInterceptor.unregisterMBean(DefaultMBeanServerInterceptor.java:415)
[junit4:junit4]   2> 	at com.sun.jmx.mbeanserver.JmxMBeanServer.unregisterMBean(JmxMBeanServer.java:536)
[junit4:junit4]   2> 	at org.apache.solr.core.JmxMonitoredMap.unregister(JmxMonitoredMap.java:175)
[junit4:junit4]   2> 	at org.apache.solr.core.JmxMonitoredMap.clear(JmxMonitoredMap.java:116)
[junit4:junit4]   2> 	at org.apache.solr.core.SolrCore.close(SolrCore.java:864)
[junit4:junit4]   2> 	at org.apache.solr.cloud.ShardLeaderElectionContext.runLeaderProcess(ElectionContext.java:213)
[junit4:junit4]   2> 	at org.apache.solr.cloud.LeaderElector.runIamLeaderProcess(LeaderElector.java:158)
[junit4:junit4]   2> 	at org.apache.solr.cloud.LeaderElector.checkIfIamLeader(LeaderElector.java:102)
[junit4:junit4]   2> 	at org.apache.solr.cloud.LeaderElector.access$000(LeaderElector.java:56)
[junit4:junit4]   2> 	at org.apache.solr.cloud.LeaderElector$1.process(LeaderElector.java:131)
[junit4:junit4]   2> 	at org.apache.zookeeper.ClientCnxn$EventThread.processEvent(ClientCnxn.java:526)
[junit4:junit4]   2> 	at org.apache.zookeeper.ClientCnxn$EventThread.run(ClientCnxn.java:502)
[junit4:junit4]   2> 
[junit4:junit4]   2> 305550 T2336 oasc.SolrCore.closeSearcher [collection1] Closing main searcher on request.
[junit4:junit4]   2> 305552 T2336 oasu.DirectUpdateHandler2.close closing DirectUpdateHandler2{commits=5,autocommits=0,soft autocommits=0,optimizes=0,rollbacks=0,expungeDeletes=0,docsPending=0,adds=0,deletesById=0,deletesByQuery=0,errors=0,cumulative_adds=35,cumulative_deletesById=0,cumulative_deletesByQuery=0,cumulative_errors=0}
[junit4:junit4]   2> 305553 T2336 oasu.DefaultSolrCoreState.decref SolrCoreState ref count has reached 0 - closing IndexWriter
[junit4:junit4]   2> 305555 T2336 oasu.DefaultSolrCoreState.decref Closing SolrCoreState - canceling any ongoing recovery
[junit4:junit4]   2> 305555 T2336 oascc.ZkStateReader$3.process Updating live nodes
[junit4:junit4]   2> 305556 T2336 oascc.ZkStateReader$3.process WARNING ZooKeeper watch triggered, but Solr cannot talk to ZK
[junit4:junit4]   2> 305556 T2336 oascc.ZkStateReader$2.process A cluster state change has occurred - updating...
[junit4:junit4]   2> 305556 T2336 oascc.ZkStateReader$2.process WARNING ZooKeeper watch triggered, but Solr cannot talk to ZK
[junit4:junit4]   2> 305556 T2336 oascc.ConnectionManager.process Watcher org.apache.solr.common.cloud.ConnectionManager@2ec62d6e name:ZooKeeperConnection Watcher:127.0.0.1:49230/solr got event WatchedEvent state:Disconnected type:None path:null path:null type:None
[junit4:junit4]   2> 305556 T2336 oascc.ConnectionManager.process Client->ZooKeeper status change trigger but we are already closed
[junit4:junit4]   2> 305557 T2336 oaz.ClientCnxn$EventThread.run EventThread shut down
[junit4:junit4]   2> NOTE: test params are: codec=Lucene40: {n_f1=PostingsFormat(name=Memory doPackFST= true), foo_b=MockFixedIntBlock(blockSize=1234), foo_d=PostingsFormat(name=NestedPulsing), foo_f=MockFixedIntBlock(blockSize=1234), n_tl1=PostingsFormat(name=Memory doPackFST= true), n_d1=Pulsing40(freqCutoff=11 minBlockSize=92 maxBlockSize=182), rnd_b=PostingsFormat(name=NestedPulsing), intDefault=PostingsFormat(name=Memory doPackFST= true), n_td1=PostingsFormat(name=Memory doPackFST= true), timestamp=Pulsing40(freqCutoff=11 minBlockSize=92 maxBlockSize=182), id=PostingsFormat(name=NestedPulsing), range_facet_sl=PostingsFormat(name=NestedPulsing), range_facet_si=Pulsing40(freqCutoff=11 minBlockSize=92 maxBlockSize=182), oddField_s=PostingsFormat(name=NestedPulsing), multiDefault=Pulsing40(freqCutoff=11 minBlockSize=92 maxBlockSize=182), n_tf1=Pulsing40(freqCutoff=11 minBlockSize=92 maxBlockSize=182), n_dt1=PostingsFormat(name=Memory doPackFST= true), n_ti1=PostingsFormat(name=NestedPulsing), range_facet_l=Pulsing40(freqCutoff=11 minBlockSize=92 maxBlockSize=182), text=MockFixedIntBlock(blockSize=1234), _version_=PostingsFormat(name=Memory doPackFST= true), SubjectTerms_mfacet=PostingsFormat(name=Memory doPackFST= true), a_t=Pulsing40(freqCutoff=11 minBlockSize=92 maxBlockSize=182), n_tdt1=PostingsFormat(name=Memory doPackFST= true), other_tl1=PostingsFormat(name=Memory doPackFST= true), n_l1=Pulsing40(freqCutoff=11 minBlockSize=92 maxBlockSize=182), a_si=PostingsFormat(name=Memory doPackFST= true)}, sim=RandomSimilarityProvider(queryNorm=false,coord=yes): {}, locale=hr_HR, timezone=America/Caracas
[junit4:junit4]   2> NOTE: FreeBSD 9.0-RELEASE amd64/Oracle Corporation 1.7.0_06 (64-bit)/cpus=16,threads=2,free=336035912,total=473956352
[junit4:junit4]   2> NOTE: All tests run in this JVM: [PathHierarchyTokenizerFactoryTest, TestUtils, TestFoldingMultitermQuery, StatelessScriptUpdateProcessorFactoryTest, TestSolrXMLSerializer, IndexReaderFactoryTest, TestMultiCoreConfBootstrap, TestPhraseSuggestions, LegacyHTMLStripCharFilterTest, SignatureUpdateProcessorFactoryTest, PrimUtilsTest, TestReversedWildcardFilterFactory, DebugComponentTest, QueryParsingTest, TestOmitPositions, TestMergePolicyConfig, StandardRequestHandlerTest, TestCodecSupport, OverseerTest, TimeZoneUtilsTest, BasicFunctionalityTest, TestBinaryField, TestRemoteStreaming, TestHashPartitioner, UUIDFieldTest, TestDocumentBuilder, LukeRequestHandlerTest, ZkNodePropsTest, TestSolrDeletionPolicy1, TestSolrDeletionPolicy2, XsltUpdateRequestHandlerTest, TestDFRSimilarityFactory, StatsComponentTest, TermVectorComponentTest, TestPropInjectDefaults, QueryEqualityTest, TestArbitraryIndexDir, TestSurroundQueryParser, DisMaxRequestHandlerTest, TestBM25SimilarityFactory, TestPluginEnable, TestRTGBase, FieldMutatingUpdateProcessorTest, TestStressRecovery, TestTrie, SpellingQueryConverterTest, TestCSVLoader, PolyFieldTest, TestUpdate, XmlUpdateRequestHandlerTest, TestFastWriter, HighlighterTest, DirectSolrSpellCheckerTest, SolrIndexConfigTest, OutputWriterTest, TestFunctionQuery, TestQueryUtils, RecoveryZkTest, FullSolrCloudDistribCmdsTest, TestReplicationHandler, LeaderElectionIntegrationTest, LeaderElectionTest, TestRealTimeGet, ZkControllerTest, TestDistributedGrouping, TestRandomFaceting, SpellCheckCollatorTest, SoftAutoCommitTest, AutoCommitTest, BasicZkTest, ZkSolrClientTest, TestRecovery, SolrCoreTest, DirectUpdateHandlerTest, SimpleFacetsTest, TestCoreContainer, TestSort, TestGroupingSearch, FileBasedSpellCheckerTest, ConvertedLegacyTest, PeerSyncTest, TestBinaryResponseWriter, TestJmxIntegration, SampleTest, TestIndexSearcher, SolrRequestParserTest, DirectSolrConnectionTest, CacheHeaderTest, SpatialFilterTest, MoreLikeThisHandlerTest, DistributedQueryElevationComponentTest, DistanceFunctionTest, MinimalSchemaTest, JsonLoaderTest, IndexSchemaRuntimeFieldTest, TestSolrQueryParser, JSONWriterTest, RequiredFieldsTest, SuggesterTSTTest, SuggesterTest, TestSearchPerf, BadIndexSchemaTest, TestWriterPerf, NoCacheHeaderTest, AlternateDirectoryTest, DefaultValueUpdateProcessorTest, TestDocSet, TestQuerySenderListener, TestQuerySenderNoQuery, TestSolrCoreProperties, TestConfig, TestLMJelinekMercerSimilarityFactory, URLClassifyProcessorTest, ResourceLoaderTest, TestSystemIdResolver, TestBadConfig, BasicDistributedZk2Test]
[junit4:junit4] Completed on J1 in 306.13s, 1 test, 1 failure <<< FAILURES!

[...truncated 5 lines...]
BUILD FAILED
/usr/home/hudson/hudson-slave/workspace/Lucene-Solr-Tests-4.x-java7/build.xml:32: The following error occurred while executing this line:
/usr/home/hudson/hudson-slave/workspace/Lucene-Solr-Tests-4.x-java7/solr/build.xml:146: The following error occurred while executing this line:
/usr/home/hudson/hudson-slave/workspace/Lucene-Solr-Tests-4.x-java7/lucene/module-build.xml:63: The following error occurred while executing this line:
/usr/home/hudson/hudson-slave/workspace/Lucene-Solr-Tests-4.x-java7/lucene/common-build.xml:1133: The following error occurred while executing this line:
/usr/home/hudson/hudson-slave/workspace/Lucene-Solr-Tests-4.x-java7/lucene/common-build.xml:810: There were test failures: 229 suites, 927 tests, 1 failure, 6 ignored (1 assumption)

Total time: 32 minutes 45 seconds
Build step 'Invoke Ant' marked build as failure
Recording test results
Email was triggered for: Failure
Sending email for trigger: Failure



Mime
View raw message