lucene-dev mailing list archives

Site index · List index
Message view « Date » · « Thread »
Top « Date » · « Thread »
From Apache Jenkins Server <jenk...@builds.apache.org>
Subject [JENKINS] Lucene-Solr-Tests-trunk-java7 - Build # 3241 - Failure
Date Sat, 22 Sep 2012 02:55:43 GMT
Build: https://builds.apache.org/job/Lucene-Solr-Tests-trunk-java7/3241/

2 tests failed.
REGRESSION:  org.apache.solr.cloud.BasicDistributedZk2Test.testDistribSearch

Error Message:
Shard still reported as live in zk

Stack Trace:
java.lang.AssertionError: Shard still reported as live in zk
	at __randomizedtesting.SeedInfo.seed([118D3B38BDF3728E:906BB520CAAC12B2]:0)
	at org.junit.Assert.fail(Assert.java:93)
	at org.apache.solr.cloud.AbstractFullDistribZkTestBase.waitToSeeNotLive(AbstractFullDistribZkTestBase.java:1225)
	at org.apache.solr.cloud.BasicDistributedZk2Test.brindDownShardIndexSomeDocsAndRecover(BasicDistributedZk2Test.java:190)
	at org.apache.solr.cloud.BasicDistributedZk2Test.doTest(BasicDistributedZk2Test.java:83)
	at org.apache.solr.BaseDistributedSearchTestCase.testDistribSearch(BaseDistributedSearchTestCase.java:695)
	at sun.reflect.NativeMethodAccessorImpl.invoke0(Native Method)
	at sun.reflect.NativeMethodAccessorImpl.invoke(NativeMethodAccessorImpl.java:57)
	at sun.reflect.DelegatingMethodAccessorImpl.invoke(DelegatingMethodAccessorImpl.java:43)
	at java.lang.reflect.Method.invoke(Method.java:601)
	at com.carrotsearch.randomizedtesting.RandomizedRunner.invoke(RandomizedRunner.java:1559)
	at com.carrotsearch.randomizedtesting.RandomizedRunner.access$600(RandomizedRunner.java:79)
	at com.carrotsearch.randomizedtesting.RandomizedRunner$6.evaluate(RandomizedRunner.java:737)
	at com.carrotsearch.randomizedtesting.RandomizedRunner$7.evaluate(RandomizedRunner.java:773)
	at com.carrotsearch.randomizedtesting.RandomizedRunner$8.evaluate(RandomizedRunner.java:787)
	at com.carrotsearch.randomizedtesting.rules.SystemPropertiesRestoreRule$1.evaluate(SystemPropertiesRestoreRule.java:53)
	at org.apache.lucene.util.TestRuleSetupTeardownChained$1.evaluate(TestRuleSetupTeardownChained.java:50)
	at org.apache.lucene.util.TestRuleFieldCacheSanity$1.evaluate(TestRuleFieldCacheSanity.java:51)
	at org.apache.lucene.util.AbstractBeforeAfterRule$1.evaluate(AbstractBeforeAfterRule.java:45)
	at com.carrotsearch.randomizedtesting.rules.SystemPropertiesInvariantRule$1.evaluate(SystemPropertiesInvariantRule.java:55)
	at org.apache.lucene.util.TestRuleThreadAndTestName$1.evaluate(TestRuleThreadAndTestName.java:48)
	at org.apache.lucene.util.TestRuleIgnoreAfterMaxFailures$1.evaluate(TestRuleIgnoreAfterMaxFailures.java:70)
	at org.apache.lucene.util.TestRuleMarkFailure$1.evaluate(TestRuleMarkFailure.java:48)
	at com.carrotsearch.randomizedtesting.rules.StatementAdapter.evaluate(StatementAdapter.java:36)
	at com.carrotsearch.randomizedtesting.ThreadLeakControl$StatementRunner.run(ThreadLeakControl.java:358)
	at com.carrotsearch.randomizedtesting.ThreadLeakControl.forkTimeoutingTask(ThreadLeakControl.java:782)
	at com.carrotsearch.randomizedtesting.ThreadLeakControl$3.evaluate(ThreadLeakControl.java:442)
	at com.carrotsearch.randomizedtesting.RandomizedRunner.runSingleTest(RandomizedRunner.java:746)
	at com.carrotsearch.randomizedtesting.RandomizedRunner$3.evaluate(RandomizedRunner.java:648)
	at com.carrotsearch.randomizedtesting.RandomizedRunner$4.evaluate(RandomizedRunner.java:682)
	at com.carrotsearch.randomizedtesting.RandomizedRunner$5.evaluate(RandomizedRunner.java:693)
	at com.carrotsearch.randomizedtesting.rules.StatementAdapter.evaluate(StatementAdapter.java:36)
	at com.carrotsearch.randomizedtesting.rules.SystemPropertiesRestoreRule$1.evaluate(SystemPropertiesRestoreRule.java:53)
	at org.apache.lucene.util.AbstractBeforeAfterRule$1.evaluate(AbstractBeforeAfterRule.java:45)
	at org.apache.lucene.util.TestRuleStoreClassName$1.evaluate(TestRuleStoreClassName.java:42)
	at com.carrotsearch.randomizedtesting.rules.SystemPropertiesInvariantRule$1.evaluate(SystemPropertiesInvariantRule.java:55)
	at com.carrotsearch.randomizedtesting.rules.NoShadowingOrOverridesOnMethodsRule$1.evaluate(NoShadowingOrOverridesOnMethodsRule.java:39)
	at com.carrotsearch.randomizedtesting.rules.NoShadowingOrOverridesOnMethodsRule$1.evaluate(NoShadowingOrOverridesOnMethodsRule.java:39)
	at com.carrotsearch.randomizedtesting.rules.StatementAdapter.evaluate(StatementAdapter.java:36)
	at org.apache.lucene.util.TestRuleAssertionsRequired$1.evaluate(TestRuleAssertionsRequired.java:43)
	at org.apache.lucene.util.TestRuleMarkFailure$1.evaluate(TestRuleMarkFailure.java:48)
	at org.apache.lucene.util.TestRuleIgnoreAfterMaxFailures$1.evaluate(TestRuleIgnoreAfterMaxFailures.java:70)
	at org.apache.lucene.util.TestRuleIgnoreTestSuites$1.evaluate(TestRuleIgnoreTestSuites.java:55)
	at com.carrotsearch.randomizedtesting.rules.StatementAdapter.evaluate(StatementAdapter.java:36)
	at com.carrotsearch.randomizedtesting.ThreadLeakControl$StatementRunner.run(ThreadLeakControl.java:358)
	at java.lang.Thread.run(Thread.java:722)


REGRESSION:  org.apache.solr.cloud.SyncSliceTest.testDistribSearch

Error Message:
There are still nodes recoverying

Stack Trace:
java.lang.AssertionError: There are still nodes recoverying
	at __randomizedtesting.SeedInfo.seed([118D3B38BDF3728E:906BB520CAAC12B2]:0)
	at org.junit.Assert.fail(Assert.java:93)
	at org.apache.solr.cloud.AbstractDistribZkTestBase.waitForRecoveriesToFinish(AbstractDistribZkTestBase.java:154)
	at org.apache.solr.cloud.AbstractFullDistribZkTestBase.waitForRecoveriesToFinish(AbstractFullDistribZkTestBase.java:565)
	at org.apache.solr.cloud.AbstractFullDistribZkTestBase.waitForThingsToLevelOut(AbstractFullDistribZkTestBase.java:1140)
	at org.apache.solr.cloud.SyncSliceTest.doTest(SyncSliceTest.java:162)
	at org.apache.solr.BaseDistributedSearchTestCase.testDistribSearch(BaseDistributedSearchTestCase.java:695)
	at sun.reflect.NativeMethodAccessorImpl.invoke0(Native Method)
	at sun.reflect.NativeMethodAccessorImpl.invoke(NativeMethodAccessorImpl.java:57)
	at sun.reflect.DelegatingMethodAccessorImpl.invoke(DelegatingMethodAccessorImpl.java:43)
	at java.lang.reflect.Method.invoke(Method.java:601)
	at com.carrotsearch.randomizedtesting.RandomizedRunner.invoke(RandomizedRunner.java:1559)
	at com.carrotsearch.randomizedtesting.RandomizedRunner.access$600(RandomizedRunner.java:79)
	at com.carrotsearch.randomizedtesting.RandomizedRunner$6.evaluate(RandomizedRunner.java:737)
	at com.carrotsearch.randomizedtesting.RandomizedRunner$7.evaluate(RandomizedRunner.java:773)
	at com.carrotsearch.randomizedtesting.RandomizedRunner$8.evaluate(RandomizedRunner.java:787)
	at com.carrotsearch.randomizedtesting.rules.SystemPropertiesRestoreRule$1.evaluate(SystemPropertiesRestoreRule.java:53)
	at org.apache.lucene.util.TestRuleSetupTeardownChained$1.evaluate(TestRuleSetupTeardownChained.java:50)
	at org.apache.lucene.util.TestRuleFieldCacheSanity$1.evaluate(TestRuleFieldCacheSanity.java:51)
	at org.apache.lucene.util.AbstractBeforeAfterRule$1.evaluate(AbstractBeforeAfterRule.java:45)
	at com.carrotsearch.randomizedtesting.rules.SystemPropertiesInvariantRule$1.evaluate(SystemPropertiesInvariantRule.java:55)
	at org.apache.lucene.util.TestRuleThreadAndTestName$1.evaluate(TestRuleThreadAndTestName.java:48)
	at org.apache.lucene.util.TestRuleIgnoreAfterMaxFailures$1.evaluate(TestRuleIgnoreAfterMaxFailures.java:70)
	at org.apache.lucene.util.TestRuleMarkFailure$1.evaluate(TestRuleMarkFailure.java:48)
	at com.carrotsearch.randomizedtesting.rules.StatementAdapter.evaluate(StatementAdapter.java:36)
	at com.carrotsearch.randomizedtesting.ThreadLeakControl$StatementRunner.run(ThreadLeakControl.java:358)
	at com.carrotsearch.randomizedtesting.ThreadLeakControl.forkTimeoutingTask(ThreadLeakControl.java:782)
	at com.carrotsearch.randomizedtesting.ThreadLeakControl$3.evaluate(ThreadLeakControl.java:442)
	at com.carrotsearch.randomizedtesting.RandomizedRunner.runSingleTest(RandomizedRunner.java:746)
	at com.carrotsearch.randomizedtesting.RandomizedRunner$3.evaluate(RandomizedRunner.java:648)
	at com.carrotsearch.randomizedtesting.RandomizedRunner$4.evaluate(RandomizedRunner.java:682)
	at com.carrotsearch.randomizedtesting.RandomizedRunner$5.evaluate(RandomizedRunner.java:693)
	at com.carrotsearch.randomizedtesting.rules.StatementAdapter.evaluate(StatementAdapter.java:36)
	at com.carrotsearch.randomizedtesting.rules.SystemPropertiesRestoreRule$1.evaluate(SystemPropertiesRestoreRule.java:53)
	at org.apache.lucene.util.AbstractBeforeAfterRule$1.evaluate(AbstractBeforeAfterRule.java:45)
	at org.apache.lucene.util.TestRuleStoreClassName$1.evaluate(TestRuleStoreClassName.java:42)
	at com.carrotsearch.randomizedtesting.rules.SystemPropertiesInvariantRule$1.evaluate(SystemPropertiesInvariantRule.java:55)
	at com.carrotsearch.randomizedtesting.rules.NoShadowingOrOverridesOnMethodsRule$1.evaluate(NoShadowingOrOverridesOnMethodsRule.java:39)
	at com.carrotsearch.randomizedtesting.rules.NoShadowingOrOverridesOnMethodsRule$1.evaluate(NoShadowingOrOverridesOnMethodsRule.java:39)
	at com.carrotsearch.randomizedtesting.rules.StatementAdapter.evaluate(StatementAdapter.java:36)
	at org.apache.lucene.util.TestRuleAssertionsRequired$1.evaluate(TestRuleAssertionsRequired.java:43)
	at org.apache.lucene.util.TestRuleMarkFailure$1.evaluate(TestRuleMarkFailure.java:48)
	at org.apache.lucene.util.TestRuleIgnoreAfterMaxFailures$1.evaluate(TestRuleIgnoreAfterMaxFailures.java:70)
	at org.apache.lucene.util.TestRuleIgnoreTestSuites$1.evaluate(TestRuleIgnoreTestSuites.java:55)
	at com.carrotsearch.randomizedtesting.rules.StatementAdapter.evaluate(StatementAdapter.java:36)
	at com.carrotsearch.randomizedtesting.ThreadLeakControl$StatementRunner.run(ThreadLeakControl.java:358)
	at java.lang.Thread.run(Thread.java:722)




Build Log:
[...truncated 7764 lines...]
[junit4:junit4] Suite: org.apache.solr.cloud.BasicDistributedZk2Test
[junit4:junit4]   2> 226 T11 oas.SolrTestCaseJ4.setUp ###Starting testDistribSearch
[junit4:junit4]   2> Creating dataDir: /usr/home/hudson/hudson-slave/workspace/Lucene-Solr-Tests-trunk-java7/solr/build/solr-core/test/J1/./solrtest-BasicDistributedZk2Test-1348281604742
[junit4:junit4]   2> 239 T11 oasc.ZkTestServer.run STARTING ZK TEST SERVER
[junit4:junit4]   2> 375 T12 oaz.Environment.logEnv Server environment:zookeeper.version=3.3.6-1366786, built on 07/29/2012 06:22 GMT
[junit4:junit4]   2> 376 T12 oaz.Environment.logEnv Server environment:host.name=lucene.zones.apache.org
[junit4:junit4]   2> 377 T12 oaz.Environment.logEnv Server environment:java.version=1.7.0_06
[junit4:junit4]   2> 377 T12 oaz.Environment.logEnv Server environment:java.vendor=Oracle Corporation
[junit4:junit4]   2> 378 T12 oaz.Environment.logEnv Server environment:java.home=/usr/local/openjdk7/jre
[junit4:junit4]   2> 378 T12 oaz.Environment.logEnv Server environment:java.class.path=/usr/home/hudson/hudson-slave/workspace/Lucene-Solr-Tests-trunk-java7/solr/build/solr-core/classes/test:/usr/home/hudson/hudson-slave/workspace/Lucene-Solr-Tests-trunk-java7/solr/build/solr-test-framework/classes/java:/usr/home/hudson/hudson-slave/workspace/Lucene-Solr-Tests-trunk-java7/solr/build/solr-core/test-files:/usr/home/hudson/hudson-slave/workspace/Lucene-Solr-Tests-trunk-java7/lucene/build/codecs/classes/java:/usr/home/hudson/hudson-slave/workspace/Lucene-Solr-Tests-trunk-java7/lucene/build/test-framework/classes/java:/usr/home/hudson/hudson-slave/workspace/Lucene-Solr-Tests-trunk-java7/solr/build/solr-solrj/classes/java:/usr/home/hudson/hudson-slave/workspace/Lucene-Solr-Tests-trunk-java7/solr/build/solr-core/classes/java:/usr/home/hudson/hudson-slave/workspace/Lucene-Solr-Tests-trunk-java7/lucene/build/analysis/common/lucene-analyzers-common-5.0-SNAPSHOT.jar:/usr/home/hudson/hudson-slave/workspace/Lucene-Solr-Tests-trunk-java7/lucene/build/analysis/kuromoji/lucene-analyzers-kuromoji-5.0-SNAPSHOT.jar:/usr/home/hudson/hudson-slave/workspace/Lucene-Solr-Tests-trunk-java7/lucene/build/analysis/phonetic/lucene-analyzers-phonetic-5.0-SNAPSHOT.jar:/usr/home/hudson/hudson-slave/workspace/Lucene-Solr-Tests-trunk-java7/lucene/build/highlighter/lucene-highlighter-5.0-SNAPSHOT.jar:/usr/home/hudson/hudson-slave/workspace/Lucene-Solr-Tests-trunk-java7/lucene/build/memory/lucene-memory-5.0-SNAPSHOT.jar:/usr/home/hudson/hudson-slave/workspace/Lucene-Solr-Tests-trunk-java7/lucene/build/misc/lucene-misc-5.0-SNAPSHOT.jar:/usr/home/hudson/hudson-slave/workspace/Lucene-Solr-Tests-trunk-java7/lucene/build/spatial/lucene-spatial-5.0-SNAPSHOT.jar:/usr/home/hudson/hudson-slave/workspace/Lucene-Solr-Tests-trunk-java7/lucene/build/suggest/lucene-suggest-5.0-SNAPSHOT.jar:/usr/home/hudson/hudson-slave/workspace/Lucene-Solr-Tests-trunk-java7/lucene/build/grouping/lucene-grouping-5.0-SNAPSHOT.jar:/usr/home/hudson/hudson-slave/workspace/Lucene-Solr-Tests-trunk-java7/lucene/build/queries/lucene-queries-5.0-SNAPSHOT.jar:/usr/home/hudson/hudson-slave/workspace/Lucene-Solr-Tests-trunk-java7/lucene/build/queryparser/lucene-queryparser-5.0-SNAPSHOT.jar:/usr/home/hudson/hudson-slave/workspace/Lucene-Solr-Tests-trunk-java7/solr/core/lib/commons-cli-1.2.jar:/usr/home/hudson/hudson-slave/workspace/Lucene-Solr-Tests-trunk-java7/solr/core/lib/commons-codec-1.7.jar:/usr/home/hudson/hudson-slave/workspace/Lucene-Solr-Tests-trunk-java7/solr/core/lib/commons-fileupload-1.2.1.jar:/usr/home/hudson/hudson-slave/workspace/Lucene-Solr-Tests-trunk-java7/solr/core/lib/commons-lang-2.6.jar:/usr/home/hudson/hudson-slave/workspace/Lucene-Solr-Tests-trunk-java7/solr/core/lib/easymock-2.2.jar:/usr/home/hudson/hudson-slave/workspace/Lucene-Solr-Tests-trunk-java7/solr/core/lib/guava-r05.jar:/usr/home/hudson/hudson-slave/workspace/Lucene-Solr-Tests-trunk-java7/solr/core/lib/javax.servlet-api-3.0.1.jar:/usr/home/hudson/hudson-slave/workspace/Lucene-Solr-Tests-trunk-java7/solr/core/lib/spatial4j-0.3.jar:/usr/home/hudson/hudson-slave/workspace/Lucene-Solr-Tests-trunk-java7/solr/solrj/lib/commons-io-2.1.jar:/usr/home/hudson/hudson-slave/workspace/Lucene-Solr-Tests-trunk-java7/solr/solrj/lib/httpclient-4.1.3.jar:/usr/home/hudson/hudson-slave/workspace/Lucene-Solr-Tests-trunk-java7/solr/solrj/lib/httpcore-4.1.4.jar:/usr/home/hudson/hudson-slave/workspace/Lucene-Solr-Tests-trunk-java7/solr/solrj/lib/httpmime-4.1.3.jar:/usr/home/hudson/hudson-slave/workspace/Lucene-Solr-Tests-trunk-java7/solr/solrj/lib/jcl-over-slf4j-1.6.4.jar:/usr/home/hudson/hudson-slave/workspace/Lucene-Solr-Tests-trunk-java7/solr/solrj/lib/log4j-over-slf4j-1.6.4.jar:/usr/home/hudson/hudson-slave/workspace/Lucene-Solr-Tests-trunk-java7/solr/solrj/lib/slf4j-api-1.6.4.jar:/usr/home/hudson/hudson-slave/workspace/Lucene-Solr-Tests-trunk-java7/solr/solrj/lib/slf4j-jdk14-1.6.4.jar:/usr/home/hudson/hudson-slave/workspace/Lucene-Solr-Tests-trunk-java7/solr/solrj/lib/wstx-asl-3.2.7.jar:/usr/home/hudson/hudson-slave/workspace/Lucene-Solr-Tests-trunk-java7/solr/solrj/lib/zookeeper-3.3.6.jar:/usr/home/hudson/hudson-slave/workspace/Lucene-Solr-Tests-trunk-java7/solr/example/lib/jetty-continuation-8.1.2.v20120308.jar:/usr/home/hudson/hudson-slave/workspace/Lucene-Solr-Tests-trunk-java7/solr/example/lib/jetty-deploy-8.1.2.v20120308.jar:/usr/home/hudson/hudson-slave/workspace/Lucene-Solr-Tests-trunk-java7/solr/example/lib/jetty-http-8.1.2.v20120308.jar:/usr/home/hudson/hudson-slave/workspace/Lucene-Solr-Tests-trunk-java7/solr/example/lib/jetty-io-8.1.2.v20120308.jar:/usr/home/hudson/hudson-slave/workspace/Lucene-Solr-Tests-trunk-java7/solr/example/lib/jetty-jmx-8.1.2.v20120308.jar:/usr/home/hudson/hudson-slave/workspace/Lucene-Solr-Tests-trunk-java7/solr/example/lib/jetty-security-8.1.2.v20120308.jar:/usr/home/hudson/hudson-slave/workspace/Lucene-Solr-Tests-trunk-java7/solr/example/lib/jetty-server-8.1.2.v20120308.jar:/usr/home/hudson/hudson-slave/workspace/Lucene-Solr-Tests-trunk-java7/solr/example/lib/jetty-servlet-8.1.2.v20120308.jar:/usr/home/hudson/hudson-slave/workspace/Lucene-Solr-Tests-trunk-java7/solr/example/lib/jetty-util-8.1.2.v20120308.jar:/usr/home/hudson/hudson-slave/workspace/Lucene-Solr-Tests-trunk-java7/solr/example/lib/jetty-webapp-8.1.2.v20120308.jar:/usr/home/hudson/hudson-slave/workspace/Lucene-Solr-Tests-trunk-java7/solr/example/lib/jetty-xml-8.1.2.v20120308.jar:/usr/home/hudson/hudson-slave/workspace/Lucene-Solr-Tests-trunk-java7/solr/example/lib/servlet-api-3.0.jar:/usr/home/hudson/hudson-slave/workspace/Lucene-Solr-Tests-trunk-java7/solr/example/example-DIH/solr/db/lib/hsqldb-1.8.0.10.jar:/usr/home/hudson/hudson-slave/workspace/Lucene-Solr-Tests-trunk-java7/lucene/build/core/classes/java:/usr/home/hudson/hudson-slave/workspace/Lucene-Solr-Tests-trunk-java7/lucene/test-framework/lib/junit-4.10.jar:/usr/home/hudson/hudson-slave/workspace/Lucene-Solr-Tests-trunk-java7/lucene/test-framework/lib/randomizedtesting-runner-2.0.1.jar:/home/hudson/hudson-slave/tools/Ant/ant-1.8.2/lib/ant-launcher.jar:/home/hudson/.ant/lib/ivy-2.2.0.jar:/home/hudson/hudson-slave/tools/Ant/ant-1.8.2/lib/ant-apache-regexp.jar:/home/hudson/hudson-slave/tools/Ant/ant-1.8.2/lib/ant-junit.jar:/home/hudson/hudson-slave/tools/Ant/ant-1.8.2/lib/ant-apache-bsf.jar:/home/hudson/hudson-slave/tools/Ant/ant-1.8.2/lib/ant-commons-net.jar:/home/hudson/hudson-slave/tools/Ant/ant-1.8.2/lib/ant-antlr.jar:/home/hudson/hudson-slave/tools/Ant/ant-1.8.2/lib/ant-apache-log4j.jar:/home/hudson/hudson-slave/tools/Ant/ant-1.8.2/lib/ant-commons-logging.jar:/home/hudson/hudson-slave/tools/Ant/ant-1.8.2/lib/ant-apache-xalan2.jar:/home/hudson/hudson-slave/tools/Ant/ant-1.8.2/lib/ant-apache-oro.jar:/home/hudson/hudson-slave/tools/Ant/ant-1.8.2/lib/ant-junit4.jar:/home/hudson/hudson-slave/tools/Ant/ant-1.8.2/lib/ant-netrexx.jar:/home/hudson/hudson-slave/tools/Ant/ant-1.8.2/lib/ant-swing.jar:/home/hudson/hudson-slave/tools/Ant/ant-1.8.2/lib/ant-javamail.jar:/home/hudson/hudson-slave/tools/Ant/ant-1.8.2/lib/ant-jsch.jar:/home/hudson/hudson-slave/tools/Ant/ant-1.8.2/lib/ant-jmf.jar:/home/hudson/hudson-slave/tools/Ant/ant-1.8.2/lib/ant.jar:/home/hudson/hudson-slave/tools/Ant/ant-1.8.2/lib/ant-apache-bcel.jar:/home/hudson/hudson-slave/tools/Ant/ant-1.8.2/lib/ant-jai.jar:/home/hudson/hudson-slave/tools/Ant/ant-1.8.2/lib/ant-testutil.jar:/home/hudson/hudson-slave/tools/Ant/ant-1.8.2/lib/ant-apache-resolver.jar:/home/hudson/hudson-slave/tools/Ant/ant-1.8.2/lib/ant-jdepend.jar:/usr/local/openjdk7/lib/tools.jar:/home/hudson/.ivy2/cache/com.carrotsearch.randomizedtesting/junit4-ant/jars/junit4-ant-2.0.1.jar
[junit4:junit4]   2> 382 T12 oaz.Environment.logEnv Server environment:java.library.path=/usr/local/openjdk7/jre/lib/amd64/server:/usr/local/openjdk7/jre/lib/amd64:/usr/local/openjdk7/jre/../lib/amd64:/usr/local/openjdk6/jre/lib/amd64/server:/usr/local/openjdk6/jre/lib/amd64:/usr/local/openjdk6/jre/../lib/amd64:/usr/java/packages/lib/amd64:/lib:/usr/lib:/usr/local/lib
[junit4:junit4]   2> 382 T12 oaz.Environment.logEnv Server environment:java.io.tmpdir=.
[junit4:junit4]   2> 383 T12 oaz.Environment.logEnv Server environment:java.compiler=<NA>
[junit4:junit4]   2> 383 T12 oaz.Environment.logEnv Server environment:os.name=FreeBSD
[junit4:junit4]   2> 384 T12 oaz.Environment.logEnv Server environment:os.arch=amd64
[junit4:junit4]   2> 384 T12 oaz.Environment.logEnv Server environment:os.version=9.0-RELEASE
[junit4:junit4]   2> 385 T12 oaz.Environment.logEnv Server environment:user.name=hudson
[junit4:junit4]   2> 385 T12 oaz.Environment.logEnv Server environment:user.home=/home/hudson
[junit4:junit4]   2> 386 T12 oaz.Environment.logEnv Server environment:user.dir=/usr/home/hudson/hudson-slave/workspace/Lucene-Solr-Tests-trunk-java7/solr/build/solr-core/test/J1
[junit4:junit4]   2> 440 T12 oazs.ZooKeeperServer.setTickTime tickTime set to 1000
[junit4:junit4]   2> 483 T12 oazs.NIOServerCnxn$Factory.<init> binding to port 0.0.0.0/0.0.0.0:0
[junit4:junit4]   2> 543 T12 oazsp.FileTxnSnapLog.save Snapshotting: 0
[junit4:junit4]   2> 547 T11 oasc.ZkTestServer.run start zk server on port:15988
[junit4:junit4]   2> 642 T11 oaz.Environment.logEnv Client environment:zookeeper.version=3.3.6-1366786, built on 07/29/2012 06:22 GMT
[junit4:junit4]   2> 643 T11 oaz.Environment.logEnv Client environment:host.name=lucene.zones.apache.org
[junit4:junit4]   2> 644 T11 oaz.Environment.logEnv Client environment:java.version=1.7.0_06
[junit4:junit4]   2> 644 T11 oaz.Environment.logEnv Client environment:java.vendor=Oracle Corporation
[junit4:junit4]   2> 645 T11 oaz.Environment.logEnv Client environment:java.home=/usr/local/openjdk7/jre
[junit4:junit4]   2> 646 T11 oaz.Environment.logEnv Client environment:java.class.path=/usr/home/hudson/hudson-slave/workspace/Lucene-Solr-Tests-trunk-java7/solr/build/solr-core/classes/test:/usr/home/hudson/hudson-slave/workspace/Lucene-Solr-Tests-trunk-java7/solr/build/solr-test-framework/classes/java:/usr/home/hudson/hudson-slave/workspace/Lucene-Solr-Tests-trunk-java7/solr/build/solr-core/test-files:/usr/home/hudson/hudson-slave/workspace/Lucene-Solr-Tests-trunk-java7/lucene/build/codecs/classes/java:/usr/home/hudson/hudson-slave/workspace/Lucene-Solr-Tests-trunk-java7/lucene/build/test-framework/classes/java:/usr/home/hudson/hudson-slave/workspace/Lucene-Solr-Tests-trunk-java7/solr/build/solr-solrj/classes/java:/usr/home/hudson/hudson-slave/workspace/Lucene-Solr-Tests-trunk-java7/solr/build/solr-core/classes/java:/usr/home/hudson/hudson-slave/workspace/Lucene-Solr-Tests-trunk-java7/lucene/build/analysis/common/lucene-analyzers-common-5.0-SNAPSHOT.jar:/usr/home/hudson/hudson-slave/workspace/Lucene-Solr-Tests-trunk-java7/lucene/build/analysis/kuromoji/lucene-analyzers-kuromoji-5.0-SNAPSHOT.jar:/usr/home/hudson/hudson-slave/workspace/Lucene-Solr-Tests-trunk-java7/lucene/build/analysis/phonetic/lucene-analyzers-phonetic-5.0-SNAPSHOT.jar:/usr/home/hudson/hudson-slave/workspace/Lucene-Solr-Tests-trunk-java7/lucene/build/highlighter/lucene-highlighter-5.0-SNAPSHOT.jar:/usr/home/hudson/hudson-slave/workspace/Lucene-Solr-Tests-trunk-java7/lucene/build/memory/lucene-memory-5.0-SNAPSHOT.jar:/usr/home/hudson/hudson-slave/workspace/Lucene-Solr-Tests-trunk-java7/lucene/build/misc/lucene-misc-5.0-SNAPSHOT.jar:/usr/home/hudson/hudson-slave/workspace/Lucene-Solr-Tests-trunk-java7/lucene/build/spatial/lucene-spatial-5.0-SNAPSHOT.jar:/usr/home/hudson/hudson-slave/workspace/Lucene-Solr-Tests-trunk-java7/lucene/build/suggest/lucene-suggest-5.0-SNAPSHOT.jar:/usr/home/hudson/hudson-slave/workspace/Lucene-Solr-Tests-trunk-java7/lucene/build/grouping/lucene-grouping-5.0-SNAPSHOT.jar:/usr/home/hudson/hudson-slave/workspace/Lucene-Solr-Tests-trunk-java7/lucene/build/queries/lucene-queries-5.0-SNAPSHOT.jar:/usr/home/hudson/hudson-slave/workspace/Lucene-Solr-Tests-trunk-java7/lucene/build/queryparser/lucene-queryparser-5.0-SNAPSHOT.jar:/usr/home/hudson/hudson-slave/workspace/Lucene-Solr-Tests-trunk-java7/solr/core/lib/commons-cli-1.2.jar:/usr/home/hudson/hudson-slave/workspace/Lucene-Solr-Tests-trunk-java7/solr/core/lib/commons-codec-1.7.jar:/usr/home/hudson/hudson-slave/workspace/Lucene-Solr-Tests-trunk-java7/solr/core/lib/commons-fileupload-1.2.1.jar:/usr/home/hudson/hudson-slave/workspace/Lucene-Solr-Tests-trunk-java7/solr/core/lib/commons-lang-2.6.jar:/usr/home/hudson/hudson-slave/workspace/Lucene-Solr-Tests-trunk-java7/solr/core/lib/easymock-2.2.jar:/usr/home/hudson/hudson-slave/workspace/Lucene-Solr-Tests-trunk-java7/solr/core/lib/guava-r05.jar:/usr/home/hudson/hudson-slave/workspace/Lucene-Solr-Tests-trunk-java7/solr/core/lib/javax.servlet-api-3.0.1.jar:/usr/home/hudson/hudson-slave/workspace/Lucene-Solr-Tests-trunk-java7/solr/core/lib/spatial4j-0.3.jar:/usr/home/hudson/hudson-slave/workspace/Lucene-Solr-Tests-trunk-java7/solr/solrj/lib/commons-io-2.1.jar:/usr/home/hudson/hudson-slave/workspace/Lucene-Solr-Tests-trunk-java7/solr/solrj/lib/httpclient-4.1.3.jar:/usr/home/hudson/hudson-slave/workspace/Lucene-Solr-Tests-trunk-java7/solr/solrj/lib/httpcore-4.1.4.jar:/usr/home/hudson/hudson-slave/workspace/Lucene-Solr-Tests-trunk-java7/solr/solrj/lib/httpmime-4.1.3.jar:/usr/home/hudson/hudson-slave/workspace/Lucene-Solr-Tests-trunk-java7/solr/solrj/lib/jcl-over-slf4j-1.6.4.jar:/usr/home/hudson/hudson-slave/workspace/Lucene-Solr-Tests-trunk-java7/solr/solrj/lib/log4j-over-slf4j-1.6.4.jar:/usr/home/hudson/hudson-slave/workspace/Lucene-Solr-Tests-trunk-java7/solr/solrj/lib/slf4j-api-1.6.4.jar:/usr/home/hudson/hudson-slave/workspace/Lucene-Solr-Tests-trunk-java7/solr/solrj/lib/slf4j-jdk14-1.6.4.jar:/usr/home/hudson/hudson-slave/workspace/Lucene-Solr-Tests-trunk-java7/solr/solrj/lib/wstx-asl-3.2.7.jar:/usr/home/hudson/hudson-slave/workspace/Lucene-Solr-Tests-trunk-java7/solr/solrj/lib/zookeeper-3.3.6.jar:/usr/home/hudson/hudson-slave/workspace/Lucene-Solr-Tests-trunk-java7/solr/example/lib/jetty-continuation-8.1.2.v20120308.jar:/usr/home/hudson/hudson-slave/workspace/Lucene-Solr-Tests-trunk-java7/solr/example/lib/jetty-deploy-8.1.2.v20120308.jar:/usr/home/hudson/hudson-slave/workspace/Lucene-Solr-Tests-trunk-java7/solr/example/lib/jetty-http-8.1.2.v20120308.jar:/usr/home/hudson/hudson-slave/workspace/Lucene-Solr-Tests-trunk-java7/solr/example/lib/jetty-io-8.1.2.v20120308.jar:/usr/home/hudson/hudson-slave/workspace/Lucene-Solr-Tests-trunk-java7/solr/example/lib/jetty-jmx-8.1.2.v20120308.jar:/usr/home/hudson/hudson-slave/workspace/Lucene-Solr-Tests-trunk-java7/solr/example/lib/jetty-security-8.1.2.v20120308.jar:/usr/home/hudson/hudson-slave/workspace/Lucene-Solr-Tests-trunk-java7/solr/example/lib/jetty-server-8.1.2.v20120308.jar:/usr/home/hudson/hudson-slave/workspace/Lucene-Solr-Tests-trunk-java7/solr/example/lib/jetty-servlet-8.1.2.v20120308.jar:/usr/home/hudson/hudson-slave/workspace/Lucene-Solr-Tests-trunk-java7/solr/example/lib/jetty-util-8.1.2.v20120308.jar:/usr/home/hudson/hudson-slave/workspace/Lucene-Solr-Tests-trunk-java7/solr/example/lib/jetty-webapp-8.1.2.v20120308.jar:/usr/home/hudson/hudson-slave/workspace/Lucene-Solr-Tests-trunk-java7/solr/example/lib/jetty-xml-8.1.2.v20120308.jar:/usr/home/hudson/hudson-slave/workspace/Lucene-Solr-Tests-trunk-java7/solr/example/lib/servlet-api-3.0.jar:/usr/home/hudson/hudson-slave/workspace/Lucene-Solr-Tests-trunk-java7/solr/example/example-DIH/solr/db/lib/hsqldb-1.8.0.10.jar:/usr/home/hudson/hudson-slave/workspace/Lucene-Solr-Tests-trunk-java7/lucene/build/core/classes/java:/usr/home/hudson/hudson-slave/workspace/Lucene-Solr-Tests-trunk-java7/lucene/test-framework/lib/junit-4.10.jar:/usr/home/hudson/hudson-slave/workspace/Lucene-Solr-Tests-trunk-java7/lucene/test-framework/lib/randomizedtesting-runner-2.0.1.jar:/home/hudson/hudson-slave/tools/Ant/ant-1.8.2/lib/ant-launcher.jar:/home/hudson/.ant/lib/ivy-2.2.0.jar:/home/hudson/hudson-slave/tools/Ant/ant-1.8.2/lib/ant-apache-regexp.jar:/home/hudson/hudson-slave/tools/Ant/ant-1.8.2/lib/ant-junit.jar:/home/hudson/hudson-slave/tools/Ant/ant-1.8.2/lib/ant-apache-bsf.jar:/home/hudson/hudson-slave/tools/Ant/ant-1.8.2/lib/ant-commons-net.jar:/home/hudson/hudson-slave/tools/Ant/ant-1.8.2/lib/ant-antlr.jar:/home/hudson/hudson-slave/tools/Ant/ant-1.8.2/lib/ant-apache-log4j.jar:/home/hudson/hudson-slave/tools/Ant/ant-1.8.2/lib/ant-commons-logging.jar:/home/hudson/hudson-slave/tools/Ant/ant-1.8.2/lib/ant-apache-xalan2.jar:/home/hudson/hudson-slave/tools/Ant/ant-1.8.2/lib/ant-apache-oro.jar:/home/hudson/hudson-slave/tools/Ant/ant-1.8.2/lib/ant-junit4.jar:/home/hudson/hudson-slave/tools/Ant/ant-1.8.2/lib/ant-netrexx.jar:/home/hudson/hudson-slave/tools/Ant/ant-1.8.2/lib/ant-swing.jar:/home/hudson/hudson-slave/tools/Ant/ant-1.8.2/lib/ant-javamail.jar:/home/hudson/hudson-slave/tools/Ant/ant-1.8.2/lib/ant-jsch.jar:/home/hudson/hudson-slave/tools/Ant/ant-1.8.2/lib/ant-jmf.jar:/home/hudson/hudson-slave/tools/Ant/ant-1.8.2/lib/ant.jar:/home/hudson/hudson-slave/tools/Ant/ant-1.8.2/lib/ant-apache-bcel.jar:/home/hudson/hudson-slave/tools/Ant/ant-1.8.2/lib/ant-jai.jar:/home/hudson/hudson-slave/tools/Ant/ant-1.8.2/lib/ant-testutil.jar:/home/hudson/hudson-slave/tools/Ant/ant-1.8.2/lib/ant-apache-resolver.jar:/home/hudson/hudson-slave/tools/Ant/ant-1.8.2/lib/ant-jdepend.jar:/usr/local/openjdk7/lib/tools.jar:/home/hudson/.ivy2/cache/com.carrotsearch.randomizedtesting/junit4-ant/jars/junit4-ant-2.0.1.jar
[junit4:junit4]   2> 649 T11 oaz.Environment.logEnv Client environment:java.library.path=/usr/local/openjdk7/jre/lib/amd64/server:/usr/local/openjdk7/jre/lib/amd64:/usr/local/openjdk7/jre/../lib/amd64:/usr/local/openjdk6/jre/lib/amd64/server:/usr/local/openjdk6/jre/lib/amd64:/usr/local/openjdk6/jre/../lib/amd64:/usr/java/packages/lib/amd64:/lib:/usr/lib:/usr/local/lib
[junit4:junit4]   2> 649 T11 oaz.Environment.logEnv Client environment:java.io.tmpdir=.
[junit4:junit4]   2> 650 T11 oaz.Environment.logEnv Client environment:java.compiler=<NA>
[junit4:junit4]   2> 651 T11 oaz.Environment.logEnv Client environment:os.name=FreeBSD
[junit4:junit4]   2> 651 T11 oaz.Environment.logEnv Client environment:os.arch=amd64
[junit4:junit4]   2> 652 T11 oaz.Environment.logEnv Client environment:os.version=9.0-RELEASE
[junit4:junit4]   2> 653 T11 oaz.Environment.logEnv Client environment:user.name=hudson
[junit4:junit4]   2> 654 T11 oaz.Environment.logEnv Client environment:user.home=/home/hudson
[junit4:junit4]   2> 654 T11 oaz.Environment.logEnv Client environment:user.dir=/usr/home/hudson/hudson-slave/workspace/Lucene-Solr-Tests-trunk-java7/solr/build/solr-core/test/J1
[junit4:junit4]   2> 660 T11 oaz.ZooKeeper.<init> Initiating client connection, connectString=127.0.0.1:15988 sessionTimeout=10000 watcher=org.apache.solr.common.cloud.ConnectionManager@3dbae443
[junit4:junit4]   2> 717 T17 oaz.ClientCnxn$SendThread.startConnect Opening socket connection to server /127.0.0.1:15988
[junit4:junit4]   2> 717 T11 oascc.ConnectionManager.waitForConnected Waiting for client to connect to ZooKeeper
[junit4:junit4]   2> 721 T17 oaz.ClientCnxn$SendThread.primeConnection Socket connection established to localhost/127.0.0.1:15988, initiating session
[junit4:junit4]   2> 722 T13 oazs.NIOServerCnxn$Factory.run Accepted socket connection from /140.211.11.196:48663
[junit4:junit4]   2> 736 T13 oazs.NIOServerCnxn.doIO WARNING Exception causing close of session 0x0 due to java.io.IOException: ZooKeeperServer not running
[junit4:junit4]   2> 736 T13 oazs.NIOServerCnxn.closeSock Closed socket connection for client /140.211.11.196:48663 (no session established for client)
[junit4:junit4]   2> 737 T17 oaz.ClientCnxn$SendThread.run Unable to read additional data from server sessionid 0x0, likely server has closed socket, closing socket connection and attempting reconnect
[junit4:junit4]   2> 2017 T17 oaz.ClientCnxn$SendThread.startConnect Opening socket connection to server localhost/127.0.0.1:15988
[junit4:junit4]   2> 2018 T17 oaz.ClientCnxn$SendThread.primeConnection Socket connection established to localhost/127.0.0.1:15988, initiating session
[junit4:junit4]   2> 2019 T13 oazs.NIOServerCnxn$Factory.run Accepted socket connection from /140.211.11.196:20906
[junit4:junit4]   2> 2020 T13 oazs.NIOServerCnxn.readConnectRequest Client attempting to establish new session at /140.211.11.196:20906
[junit4:junit4]   2> 2039 T15 oazsp.FileTxnLog.append Creating new log file: log.1
[junit4:junit4]   2> 2098 T15 oazs.NIOServerCnxn.finishSessionInit Established session 0x139ebd89bf60000 with negotiated timeout 10000 for client /140.211.11.196:20906
[junit4:junit4]   2> 2099 T17 oaz.ClientCnxn$SendThread.readConnectResult Session establishment complete on server localhost/127.0.0.1:15988, sessionid = 0x139ebd89bf60000, negotiated timeout = 10000
[junit4:junit4]   2> 2107 T18 oascc.ConnectionManager.process Watcher org.apache.solr.common.cloud.ConnectionManager@3dbae443 name:ZooKeeperConnection Watcher:127.0.0.1:15988 got event WatchedEvent state:SyncConnected type:None path:null path:null type:None
[junit4:junit4]   2> 2108 T11 oascc.ConnectionManager.waitForConnected Client is connected to ZooKeeper
[junit4:junit4]   2> 2111 T11 oascc.SolrZkClient.makePath makePath: /solr
[junit4:junit4]   2> 2189 T16 oazs.PrepRequestProcessor.pRequest Processed session termination for sessionid: 0x139ebd89bf60000
[junit4:junit4]   2> 2192 T18 oaz.ClientCnxn$EventThread.run EventThread shut down
[junit4:junit4]   2> 2192 T11 oaz.ZooKeeper.close Session: 0x139ebd89bf60000 closed
[junit4:junit4]   2> 2193 T13 oazs.NIOServerCnxn.closeSock Closed socket connection for client /140.211.11.196:20906 which had sessionid 0x139ebd89bf60000
[junit4:junit4]   2> 2194 T11 oaz.ZooKeeper.<init> Initiating client connection, connectString=127.0.0.1:15988/solr sessionTimeout=10000 watcher=org.apache.solr.common.cloud.ConnectionManager@18f6c074
[junit4:junit4]   2> 2195 T19 oaz.ClientCnxn$SendThread.startConnect Opening socket connection to server /127.0.0.1:15988
[junit4:junit4]   2> 2195 T11 oascc.ConnectionManager.waitForConnected Waiting for client to connect to ZooKeeper
[junit4:junit4]   2> 2198 T19 oaz.ClientCnxn$SendThread.primeConnection Socket connection established to localhost/127.0.0.1:15988, initiating session
[junit4:junit4]   2> 2198 T13 oazs.NIOServerCnxn$Factory.run Accepted socket connection from /140.211.11.196:41788
[junit4:junit4]   2> 2199 T13 oazs.NIOServerCnxn.readConnectRequest Client attempting to establish new session at /140.211.11.196:41788
[junit4:junit4]   2> 2202 T15 oazs.NIOServerCnxn.finishSessionInit Established session 0x139ebd89bf60001 with negotiated timeout 10000 for client /140.211.11.196:41788
[junit4:junit4]   2> 2202 T19 oaz.ClientCnxn$SendThread.readConnectResult Session establishment complete on server localhost/127.0.0.1:15988, sessionid = 0x139ebd89bf60001, negotiated timeout = 10000
[junit4:junit4]   2> 2203 T20 oascc.ConnectionManager.process Watcher org.apache.solr.common.cloud.ConnectionManager@18f6c074 name:ZooKeeperConnection Watcher:127.0.0.1:15988/solr got event WatchedEvent state:SyncConnected type:None path:null path:null type:None
[junit4:junit4]   2> 2204 T11 oascc.ConnectionManager.waitForConnected Client is connected to ZooKeeper
[junit4:junit4]   2> 2227 T11 oascc.SolrZkClient.makePath makePath: /collections/collection1
[junit4:junit4]   2> 2234 T11 oascc.SolrZkClient.makePath makePath: /collections/collection1/shards
[junit4:junit4]   2> 2239 T11 oascc.SolrZkClient.makePath makePath: /collections/control_collection
[junit4:junit4]   2> 2243 T11 oascc.SolrZkClient.makePath makePath: /collections/control_collection/shards
[junit4:junit4]   2> 2249 T11 oasc.AbstractZkTestCase.putConfig put /usr/home/hudson/hudson-slave/workspace/Lucene-Solr-Tests-trunk-java7/solr/build/solr-core/test-files/solr/collection1/conf/solrconfig.xml to /configs/conf1/solrconfig.xml
[junit4:junit4]   2> 2320 T11 oascc.SolrZkClient.makePath makePath: /configs/conf1/solrconfig.xml
[junit4:junit4]   2> 2337 T11 oasc.AbstractZkTestCase.putConfig put /usr/home/hudson/hudson-slave/workspace/Lucene-Solr-Tests-trunk-java7/solr/build/solr-core/test-files/solr/collection1/conf/schema.xml to /configs/conf1/schema.xml
[junit4:junit4]   2> 2340 T11 oascc.SolrZkClient.makePath makePath: /configs/conf1/schema.xml
[junit4:junit4]   2> 2446 T11 oasc.AbstractZkTestCase.putConfig put /usr/home/hudson/hudson-slave/workspace/Lucene-Solr-Tests-trunk-java7/solr/build/solr-core/test-files/solr/collection1/conf/solrconfig.xml to /configs/conf1/solrconfig.xml
[junit4:junit4]   2> 2449 T11 oascc.SolrZkClient.makePath makePath: /configs/conf1/solrconfig.xml
[junit4:junit4]   2> 2468 T11 oasc.AbstractZkTestCase.putConfig put /usr/home/hudson/hudson-slave/workspace/Lucene-Solr-Tests-trunk-java7/solr/build/solr-core/test-files/solr/collection1/conf/stopwords.txt to /configs/conf1/stopwords.txt
[junit4:junit4]   2> 2470 T11 oascc.SolrZkClient.makePath makePath: /configs/conf1/stopwords.txt
[junit4:junit4]   2> 2475 T11 oasc.AbstractZkTestCase.putConfig put /usr/home/hudson/hudson-slave/workspace/Lucene-Solr-Tests-trunk-java7/solr/build/solr-core/test-files/solr/collection1/conf/protwords.txt to /configs/conf1/protwords.txt
[junit4:junit4]   2> 2477 T11 oascc.SolrZkClient.makePath makePath: /configs/conf1/protwords.txt
[junit4:junit4]   2> 2482 T11 oasc.AbstractZkTestCase.putConfig put /usr/home/hudson/hudson-slave/workspace/Lucene-Solr-Tests-trunk-java7/solr/build/solr-core/test-files/solr/collection1/conf/currency.xml to /configs/conf1/currency.xml
[junit4:junit4]   2> 2484 T11 oascc.SolrZkClient.makePath makePath: /configs/conf1/currency.xml
[junit4:junit4]   2> 2489 T11 oasc.AbstractZkTestCase.putConfig put /usr/home/hudson/hudson-slave/workspace/Lucene-Solr-Tests-trunk-java7/solr/build/solr-core/test-files/solr/collection1/conf/open-exchange-rates.json to /configs/conf1/open-exchange-rates.json
[junit4:junit4]   2> 2491 T11 oascc.SolrZkClient.makePath makePath: /configs/conf1/open-exchange-rates.json
[junit4:junit4]   2> 2497 T11 oasc.AbstractZkTestCase.putConfig put /usr/home/hudson/hudson-slave/workspace/Lucene-Solr-Tests-trunk-java7/solr/build/solr-core/test-files/solr/collection1/conf/mapping-ISOLatin1Accent.txt to /configs/conf1/mapping-ISOLatin1Accent.txt
[junit4:junit4]   2> 2499 T11 oascc.SolrZkClient.makePath makePath: /configs/conf1/mapping-ISOLatin1Accent.txt
[junit4:junit4]   2> 2505 T11 oasc.AbstractZkTestCase.putConfig put /usr/home/hudson/hudson-slave/workspace/Lucene-Solr-Tests-trunk-java7/solr/build/solr-core/test-files/solr/collection1/conf/old_synonyms.txt to /configs/conf1/old_synonyms.txt
[junit4:junit4]   2> 2506 T11 oascc.SolrZkClient.makePath makePath: /configs/conf1/old_synonyms.txt
[junit4:junit4]   2> 2511 T11 oasc.AbstractZkTestCase.putConfig put /usr/home/hudson/hudson-slave/workspace/Lucene-Solr-Tests-trunk-java7/solr/build/solr-core/test-files/solr/collection1/conf/synonyms.txt to /configs/conf1/synonyms.txt
[junit4:junit4]   2> 2513 T11 oascc.SolrZkClient.makePath makePath: /configs/conf1/synonyms.txt
[junit4:junit4]   2> 2518 T16 oazs.PrepRequestProcessor.pRequest Processed session termination for sessionid: 0x139ebd89bf60001
[junit4:junit4]   2> 2520 T20 oaz.ClientCnxn$EventThread.run EventThread shut down
[junit4:junit4]   2> 2520 T11 oaz.ZooKeeper.close Session: 0x139ebd89bf60001 closed
[junit4:junit4]   2> 2523 T13 oazs.NIOServerCnxn.closeSock Closed socket connection for client /140.211.11.196:41788 which had sessionid 0x139ebd89bf60001
[junit4:junit4]   2> 3697 T11 oejs.Server.doStart jetty-8.1.2.v20120308
[junit4:junit4]   2> 4193 T11 oejs.AbstractConnector.doStart Started SocketConnector@0.0.0.0:11348
[junit4:junit4]   2> 4400 T11 oasc.SolrResourceLoader.locateSolrHome JNDI not configured for solr (NoInitialContextEx)
[junit4:junit4]   2> 4401 T11 oasc.SolrResourceLoader.locateSolrHome using system property solr.solr.home: /usr/home/hudson/hudson-slave/workspace/Lucene-Solr-Tests-trunk-java7/solr/build/solr-core/test/J1/./org.apache.solr.cloud.BasicDistributedZk2Test-controljetty-1348281607032
[junit4:junit4]   2> 4402 T11 oasc.SolrResourceLoader.<init> new SolrResourceLoader for deduced Solr Home: '/usr/home/hudson/hudson-slave/workspace/Lucene-Solr-Tests-trunk-java7/solr/build/solr-core/test/J1/./org.apache.solr.cloud.BasicDistributedZk2Test-controljetty-1348281607032/'
[junit4:junit4]   2> 5232 T11 oass.SolrDispatchFilter.init SolrDispatchFilter.init()
[junit4:junit4]   2> 5237 T11 oasc.SolrResourceLoader.locateSolrHome JNDI not configured for solr (NoInitialContextEx)
[junit4:junit4]   2> 5237 T11 oasc.SolrResourceLoader.locateSolrHome using system property solr.solr.home: /usr/home/hudson/hudson-slave/workspace/Lucene-Solr-Tests-trunk-java7/solr/build/solr-core/test/J1/./org.apache.solr.cloud.BasicDistributedZk2Test-controljetty-1348281607032
[junit4:junit4]   2> 5278 T11 oasc.CoreContainer$Initializer.initialize looking for solr.xml: /usr/home/hudson/hudson-slave/workspace/Lucene-Solr-Tests-trunk-java7/solr/build/solr-core/test/J1/./org.apache.solr.cloud.BasicDistributedZk2Test-controljetty-1348281607032/solr.xml
[junit4:junit4]   2> 5283 T11 oasc.CoreContainer.<init> New CoreContainer 1013989859
[junit4:junit4]   2> 5284 T11 oasc.CoreContainer.load Loading CoreContainer using Solr Home: '/usr/home/hudson/hudson-slave/workspace/Lucene-Solr-Tests-trunk-java7/solr/build/solr-core/test/J1/./org.apache.solr.cloud.BasicDistributedZk2Test-controljetty-1348281607032/'
[junit4:junit4]   2> 5285 T11 oasc.SolrResourceLoader.<init> new SolrResourceLoader for directory: '/usr/home/hudson/hudson-slave/workspace/Lucene-Solr-Tests-trunk-java7/solr/build/solr-core/test/J1/./org.apache.solr.cloud.BasicDistributedZk2Test-controljetty-1348281607032/'
[junit4:junit4]   2> 5391 T11 oasc.CoreContainer.load Registering Log Listener
[junit4:junit4]   2> 5424 T11 oasc.CoreContainer.initZooKeeper Zookeeper client=127.0.0.1:15988/solr
[junit4:junit4]   2> 5477 T11 oaz.ZooKeeper.<init> Initiating client connection, connectString=127.0.0.1:15988/solr sessionTimeout=5000 watcher=org.apache.solr.common.cloud.ConnectionManager@1be776bc
[junit4:junit4]   2> 5478 T31 oaz.ClientCnxn$SendThread.startConnect Opening socket connection to server /127.0.0.1:15988
[junit4:junit4]   2> 5478 T11 oascc.ConnectionManager.waitForConnected Waiting for client to connect to ZooKeeper
[junit4:junit4]   2> 5482 T31 oaz.ClientCnxn$SendThread.primeConnection Socket connection established to localhost/127.0.0.1:15988, initiating session
[junit4:junit4]   2> 5482 T13 oazs.NIOServerCnxn$Factory.run Accepted socket connection from /140.211.11.196:19461
[junit4:junit4]   2> 5483 T13 oazs.NIOServerCnxn.readConnectRequest Client attempting to establish new session at /140.211.11.196:19461
[junit4:junit4]   2> 5485 T15 oazs.NIOServerCnxn.finishSessionInit Established session 0x139ebd89bf60002 with negotiated timeout 5000 for client /140.211.11.196:19461
[junit4:junit4]   2> 5485 T31 oaz.ClientCnxn$SendThread.readConnectResult Session establishment complete on server localhost/127.0.0.1:15988, sessionid = 0x139ebd89bf60002, negotiated timeout = 5000
[junit4:junit4]   2> 5486 T32 oascc.ConnectionManager.process Watcher org.apache.solr.common.cloud.ConnectionManager@1be776bc name:ZooKeeperConnection Watcher:127.0.0.1:15988/solr got event WatchedEvent state:SyncConnected type:None path:null path:null type:None
[junit4:junit4]   2> 5487 T11 oascc.ConnectionManager.waitForConnected Client is connected to ZooKeeper
[junit4:junit4]   2> 5508 T16 oazs.PrepRequestProcessor.pRequest Got user-level KeeperException when processing sessionid:0x139ebd89bf60002 type:create cxid:0x2 zxid:0xfffffffffffffffe txntype:unknown reqpath:n/a Error Path:/solr/overseer Error:KeeperErrorCode = NodeExists for /solr/overseer
[junit4:junit4]   2> 5521 T11 oascc.SolrZkClient.makePath makePath: /live_nodes
[junit4:junit4]   2> 5525 T11 oasc.ZkController.createEphemeralLiveNode Register node as live in ZooKeeper:/live_nodes/127.0.0.1:11348_solr
[junit4:junit4]   2> 5532 T16 oazs.PrepRequestProcessor.pRequest Got user-level KeeperException when processing sessionid:0x139ebd89bf60002 type:delete cxid:0x7 zxid:0xfffffffffffffffe txntype:unknown reqpath:n/a Error Path:/solr/live_nodes/127.0.0.1:11348_solr Error:KeeperErrorCode = NoNode for /solr/live_nodes/127.0.0.1:11348_solr
[junit4:junit4]   2> 5533 T11 oascc.SolrZkClient.makePath makePath: /live_nodes/127.0.0.1:11348_solr
[junit4:junit4]   2> 5554 T11 oashc.HttpShardHandlerFactory.getParameter Setting socketTimeout to: 0
[junit4:junit4]   2> 5554 T11 oashc.HttpShardHandlerFactory.getParameter Setting urlScheme to: http://
[junit4:junit4]   2> 5555 T11 oashc.HttpShardHandlerFactory.getParameter Setting connTimeout to: 0
[junit4:junit4]   2> 5555 T11 oashc.HttpShardHandlerFactory.getParameter Setting maxConnectionsPerHost to: 20
[junit4:junit4]   2> 5556 T11 oashc.HttpShardHandlerFactory.getParameter Setting corePoolSize to: 0
[junit4:junit4]   2> 5557 T11 oashc.HttpShardHandlerFactory.getParameter Setting maximumPoolSize to: 2147483647
[junit4:junit4]   2> 5557 T11 oashc.HttpShardHandlerFactory.getParameter Setting maxThreadIdleTime to: 5
[junit4:junit4]   2> 5558 T11 oashc.HttpShardHandlerFactory.getParameter Setting sizeOfQueue to: -1
[junit4:junit4]   2> 5558 T11 oashc.HttpShardHandlerFactory.getParameter Setting fairnessPolicy to: false
[junit4:junit4]   2> 5614 T11 oascsi.HttpClientUtil.createClient Creating new http client, config:maxConnectionsPerHost=20&maxConnections=10000&socketTimeout=0&connTimeout=0&retry=false
[junit4:junit4]   2> 6090 T11 oascc.SolrZkClient.makePath makePath: /overseer_elect/election
[junit4:junit4]   2> 6122 T16 oazs.PrepRequestProcessor.pRequest Got user-level KeeperException when processing sessionid:0x139ebd89bf60002 type:delete cxid:0x15 zxid:0xfffffffffffffffe txntype:unknown reqpath:n/a Error Path:/solr/overseer_elect/leader Error:KeeperErrorCode = NoNode for /solr/overseer_elect/leader
[junit4:junit4]   2> 6124 T11 oascc.SolrZkClient.makePath makePath: /overseer_elect/leader
[junit4:junit4]   2> 6128 T11 oasc.Overseer.start Overseer (id=88360983272488962-127.0.0.1:11348_solr-n_0000000000) starting
[junit4:junit4]   2> 6129 T16 oazs.PrepRequestProcessor.pRequest Got user-level KeeperException when processing sessionid:0x139ebd89bf60002 type:create cxid:0x1a zxid:0xfffffffffffffffe txntype:unknown reqpath:n/a Error Path:/solr/overseer Error:KeeperErrorCode = NodeExists for /solr/overseer
[junit4:junit4]   2> 6145 T16 oazs.PrepRequestProcessor.pRequest Got user-level KeeperException when processing sessionid:0x139ebd89bf60002 type:create cxid:0x1b zxid:0xfffffffffffffffe txntype:unknown reqpath:n/a Error Path:/solr/overseer Error:KeeperErrorCode = NodeExists for /solr/overseer
[junit4:junit4]   2> 6147 T16 oazs.PrepRequestProcessor.pRequest Got user-level KeeperException when processing sessionid:0x139ebd89bf60002 type:create cxid:0x1c zxid:0xfffffffffffffffe txntype:unknown reqpath:n/a Error Path:/solr/overseer Error:KeeperErrorCode = NodeExists for /solr/overseer
[junit4:junit4]   2> 6152 T16 oazs.PrepRequestProcessor.pRequest Got user-level KeeperException when processing sessionid:0x139ebd89bf60002 type:create cxid:0x1d zxid:0xfffffffffffffffe txntype:unknown reqpath:n/a Error Path:/solr/overseer Error:KeeperErrorCode = NodeExists for /solr/overseer
[junit4:junit4]   2> 6153 T34 oasc.OverseerCollectionProcessor.run Process current queue of collection creations
[junit4:junit4]   2> 6154 T11 oascc.SolrZkClient.makePath makePath: /clusterstate.json
[junit4:junit4]   2> 6161 T11 oascc.ZkStateReader.createClusterStateWatchersAndUpdate Updating cluster state from ZooKeeper... 
[junit4:junit4]   2> 6188 T33 oasc.Overseer$ClusterStateUpdater.run Starting to work on the main queue
[junit4:junit4]   2> 6243 T11 oasc.CoreContainer.create Creating SolrCore 'collection1' using instanceDir: /usr/home/hudson/hudson-slave/workspace/Lucene-Solr-Tests-trunk-java7/solr/build/solr-core/test/J1/./org.apache.solr.cloud.BasicDistributedZk2Test-controljetty-1348281607032/collection1
[junit4:junit4]   2> 6244 T11 oasc.ZkController.createCollectionZkNode Check for collection zkNode:control_collection
[junit4:junit4]   2> 6246 T11 oasc.ZkController.createCollectionZkNode Collection zkNode exists
[junit4:junit4]   2> 6247 T11 oasc.ZkController.readConfigName Load collection config from:/collections/control_collection
[junit4:junit4]   2> 6249 T11 oasc.SolrResourceLoader.<init> new SolrResourceLoader for directory: '/usr/home/hudson/hudson-slave/workspace/Lucene-Solr-Tests-trunk-java7/solr/build/solr-core/test/J1/./org.apache.solr.cloud.BasicDistributedZk2Test-controljetty-1348281607032/collection1/'
[junit4:junit4]   2> 6251 T11 oasc.SolrResourceLoader.replaceClassLoader Adding 'file:/usr/home/hudson/hudson-slave/workspace/Lucene-Solr-Tests-trunk-java7/solr/build/solr-core/test/J1/org.apache.solr.cloud.BasicDistributedZk2Test-controljetty-1348281607032/collection1/lib/README' to classloader
[junit4:junit4]   2> 6252 T11 oasc.SolrResourceLoader.replaceClassLoader Adding 'file:/usr/home/hudson/hudson-slave/workspace/Lucene-Solr-Tests-trunk-java7/solr/build/solr-core/test/J1/org.apache.solr.cloud.BasicDistributedZk2Test-controljetty-1348281607032/collection1/lib/classes/' to classloader
[junit4:junit4]   2> 6469 T11 oasc.SolrConfig.<init> Using Lucene MatchVersion: LUCENE_50
[junit4:junit4]   2> 6669 T11 oasc.SolrConfig.<init> Loaded SolrConfig: solrconfig.xml
[junit4:junit4]   2> 6720 T11 oass.IndexSchema.readSchema Reading Solr Schema
[junit4:junit4]   2> 6792 T11 oass.IndexSchema.readSchema Schema name=test
[junit4:junit4]   2> 8482 T11 oass.OpenExchangeRatesOrgProvider.init Initialized with rates=open-exchange-rates.json, refreshInterval=1440.
[junit4:junit4]   2> 8506 T11 oass.IndexSchema.readSchema default search field in schema is text
[junit4:junit4]   2> 8512 T11 oass.IndexSchema.readSchema unique key field: id
[junit4:junit4]   2> 8840 T11 oass.FileExchangeRateProvider.reload Reloading exchange rates from file currency.xml
[junit4:junit4]   2> 8856 T11 oass.FileExchangeRateProvider.reload Reloading exchange rates from file currency.xml
[junit4:junit4]   2> 8863 T11 oass.OpenExchangeRatesOrgProvider.reload Reloading exchange rates from open-exchange-rates.json
[junit4:junit4]   2> 8871 T11 oass.OpenExchangeRatesOrgProvider.reload Reloading exchange rates from open-exchange-rates.json
[junit4:junit4]   2> 8965 T11 oasc.SolrCore.<init> [collection1] Opening new SolrCore at /usr/home/hudson/hudson-slave/workspace/Lucene-Solr-Tests-trunk-java7/solr/build/solr-core/test/J1/./org.apache.solr.cloud.BasicDistributedZk2Test-controljetty-1348281607032/collection1/, dataDir=./org.apache.solr.cloud.BasicDistributedZk2Test-1348281604741/control/data/
[junit4:junit4]   2> 8977 T11 oasc.JmxMonitoredMap.<init> JMX monitoring is enabled. Adding Solr mbeans to JMX Server: com.sun.jmx.mbeanserver.JmxMBeanServer@250a51
[junit4:junit4]   2> 9311 T11 oasc.SolrCore.getNewIndexDir WARNING New index directory detected: old=null new=./org.apache.solr.cloud.BasicDistributedZk2Test-1348281604741/control/data/index/
[junit4:junit4]   2> 9313 T11 oasc.SolrCore.initIndex WARNING [collection1] Solr index directory './org.apache.solr.cloud.BasicDistributedZk2Test-1348281604741/control/data/index' doesn't exist. Creating new index...
[junit4:junit4]   2> 9472 T11 oasc.CachingDirectoryFactory.get return new directory for /usr/home/hudson/hudson-slave/workspace/Lucene-Solr-Tests-trunk-java7/solr/build/solr-core/test/J1/./org.apache.solr.cloud.BasicDistributedZk2Test-1348281604741/control/data/index forceNew:false
[junit4:junit4]   2> 9867 T11 oasc.SolrDeletionPolicy.onCommit SolrDeletionPolicy.onCommit: commits:num=1
[junit4:junit4]   2> 		commit{dir=NRTCachingDirectory(org.apache.lucene.store.NIOFSDirectory@/usr/home/hudson/hudson-slave/workspace/Lucene-Solr-Tests-trunk-java7/solr/build/solr-core/test/J1/org.apache.solr.cloud.BasicDistributedZk2Test-1348281604741/control/data/index lockFactory=org.apache.lucene.store.NativeFSLockFactory@68240bb; maxCacheMB=48.0 maxMergeSizeMB=4.0),segFN=segments_1,generation=1,filenames=[segments_1]
[junit4:junit4]   2> 9868 T11 oasc.SolrDeletionPolicy.updateCommits newest commit = 1
[junit4:junit4]   2> 9903 T11 oasc.SolrCore.initWriters created xml: solr.XMLResponseWriter
[junit4:junit4]   2> 10832 T11 oasup.UpdateRequestProcessorChain.init inserting DistributedUpdateProcessorFactory into updateRequestProcessorChain "dedupe"
[junit4:junit4]   2> 10833 T11 oasup.UpdateRequestProcessorChain.init inserting DistributedUpdateProcessorFactory into updateRequestProcessorChain "dedupe-allfields"
[junit4:junit4]   2> 10834 T11 oasup.UpdateRequestProcessorChain.init inserting DistributedUpdateProcessorFactory into updateRequestProcessorChain "stored_sig"
[junit4:junit4]   2> 10841 T11 oasup.UpdateRequestProcessorChain.init inserting DistributedUpdateProcessorFactory into updateRequestProcessorChain "uniq-fields"
[junit4:junit4]   2> 10926 T11 oasup.UpdateRequestProcessorChain.init inserting DistributedUpdateProcessorFactory into updateRequestProcessorChain "distrib-dup-test-chain-implicit"
[junit4:junit4]   2> 10936 T11 oasc.RequestHandlers.initHandlersFromConfig adding lazy requestHandler: solr.ReplicationHandler
[junit4:junit4]   2> 10940 T11 oasc.RequestHandlers.initHandlersFromConfig created /replication: solr.ReplicationHandler
[junit4:junit4]   2> 10963 T11 oasc.RequestHandlers.initHandlersFromConfig created standard: solr.StandardRequestHandler
[junit4:junit4]   2> 10978 T11 oasc.RequestHandlers.initHandlersFromConfig created /get: solr.RealTimeGetHandler
[junit4:junit4]   2> 11023 T11 oasc.RequestHandlers.initHandlersFromConfig created dismax: solr.SearchHandler
[junit4:junit4]   2> 11025 T11 oasc.RequestHandlers.initHandlersFromConfig created mock: org.apache.solr.core.MockQuerySenderListenerReqHandler
[junit4:junit4]   2> 11029 T11 oasc.RequestHandlers.initHandlersFromConfig created /admin/: org.apache.solr.handler.admin.AdminHandlers
[junit4:junit4]   2> 11031 T11 oasc.RequestHandlers.initHandlersFromConfig created defaults: solr.StandardRequestHandler
[junit4:junit4]   2> 11031 T11 oasc.RequestHandlers.initHandlersFromConfig adding lazy requestHandler: solr.StandardRequestHandler
[junit4:junit4]   2> 11032 T11 oasc.RequestHandlers.initHandlersFromConfig created lazy: solr.StandardRequestHandler
[junit4:junit4]   2> 11056 T11 oasc.RequestHandlers.initHandlersFromConfig created /update: solr.UpdateRequestHandler
[junit4:junit4]   2> 11058 T11 oasc.RequestHandlers.initHandlersFromConfig created /terms: org.apache.solr.handler.component.SearchHandler
[junit4:junit4]   2> 11059 T11 oasc.RequestHandlers.initHandlersFromConfig created spellCheckCompRH: org.apache.solr.handler.component.SearchHandler
[junit4:junit4]   2> 11060 T11 oasc.RequestHandlers.initHandlersFromConfig created spellCheckCompRH_Direct: org.apache.solr.handler.component.SearchHandler
[junit4:junit4]   2> 11061 T11 oasc.RequestHandlers.initHandlersFromConfig created spellCheckWithWordbreak: org.apache.solr.handler.component.SearchHandler
[junit4:junit4]   2> 11062 T11 oasc.RequestHandlers.initHandlersFromConfig created spellCheckWithWordbreak_Direct: org.apache.solr.handler.component.SearchHandler
[junit4:junit4]   2> 11063 T11 oasc.RequestHandlers.initHandlersFromConfig created spellCheckCompRH1: org.apache.solr.handler.component.SearchHandler
[junit4:junit4]   2> 11064 T11 oasc.RequestHandlers.initHandlersFromConfig created tvrh: org.apache.solr.handler.component.SearchHandler
[junit4:junit4]   2> 11081 T11 oasc.RequestHandlers.initHandlersFromConfig created /mlt: solr.MoreLikeThisHandler
[junit4:junit4]   2> 11096 T11 oasc.RequestHandlers.initHandlersFromConfig created /debug/dump: solr.DumpRequestHandler
[junit4:junit4]   2> 11188 T11 oashl.XMLLoader.init xsltCacheLifetimeSeconds=60
[junit4:junit4]   2> 11209 T11 oasc.SolrCore.initDeprecatedSupport WARNING solrconfig.xml uses deprecated <admin/gettableFiles>, Please update your config to use the ShowFileRequestHandler.
[junit4:junit4]   2> 11216 T11 oasc.SolrCore.initDeprecatedSupport WARNING adding ShowFileRequestHandler with hidden files: [SCHEMA.XML, OLD_SYNONYMS.TXT, STOPWORDS.TXT, PROTWORDS.TXT, OPEN-EXCHANGE-RATES.JSON, SYNONYMS.TXT, CURRENCY.XML, MAPPING-ISOLATIN1ACCENT.TXT]
[junit4:junit4]   2> 11262 T11 oass.SolrIndexSearcher.<init> Opening Searcher@321c1cca main
[junit4:junit4]   2> 11352 T11 oasu.CommitTracker.<init> Hard AutoCommit: disabled
[junit4:junit4]   2> 11352 T11 oasu.CommitTracker.<init> Soft AutoCommit: disabled
[junit4:junit4]   2> 11354 T11 oashc.SpellCheckComponent.inform Initializing spell checkers
[junit4:junit4]   2> 11473 T11 oass.DirectSolrSpellChecker.init init: {name=direct,classname=DirectSolrSpellChecker,field=lowerfilt,minQueryLength=3}
[junit4:junit4]   2> 11778 T35 oasc.SolrCore.registerSearcher [collection1] Registered new searcher Searcher@321c1cca main{StandardDirectoryReader(segments_1:1)}
[junit4:junit4]   2> 11789 T16 oazs.PrepRequestProcessor.pRequest Got user-level KeeperException when processing sessionid:0x139ebd89bf60002 type:create cxid:0x71 zxid:0xfffffffffffffffe txntype:unknown reqpath:n/a Error Path:/solr/overseer/queue Error:KeeperErrorCode = NoNode for /solr/overseer/queue
[junit4:junit4]   2> 11823 T11 oasc.CoreContainer.register registering core: collection1
[junit4:junit4]   2> 11824 T11 oasc.ZkController.register Register shard - core:collection1 address:http://127.0.0.1:11348/solr shardId:control_shard
[junit4:junit4]   2> 11839 T11 oascsi.HttpClientUtil.createClient Creating new http client, config:maxConnections=10000&maxConnectionsPerHost=20&connTimeout=30000&socketTimeout=30000&retry=false
[junit4:junit4]   2> 11855 T11 oascc.SolrZkClient.makePath makePath: /collections/control_collection/leader_elect/control_shard/election
[junit4:junit4]   2> 11883 T16 oazs.PrepRequestProcessor.pRequest Got user-level KeeperException when processing sessionid:0x139ebd89bf60002 type:delete cxid:0x80 zxid:0xfffffffffffffffe txntype:unknown reqpath:n/a Error Path:/solr/collections/control_collection/leaders Error:KeeperErrorCode = NoNode for /solr/collections/control_collection/leaders
[junit4:junit4]   2> 11885 T11 oasc.ShardLeaderElectionContext.runLeaderProcess Running the leader process.
[junit4:junit4]   2> 11886 T16 oazs.PrepRequestProcessor.pRequest Got user-level KeeperException when processing sessionid:0x139ebd89bf60002 type:create cxid:0x81 zxid:0xfffffffffffffffe txntype:unknown reqpath:n/a Error Path:/solr/overseer Error:KeeperErrorCode = NodeExists for /solr/overseer
[junit4:junit4]   2> 12226 T33 oascc.ZkStateReader.updateClusterState Updating cloud state from ZooKeeper... 
[junit4:junit4]   2> 12238 T16 oazs.PrepRequestProcessor.pRequest Got user-level KeeperException when processing sessionid:0x139ebd89bf60002 type:create cxid:0x88 zxid:0xfffffffffffffffe txntype:unknown reqpath:n/a Error Path:/solr/overseer/queue-work Error:KeeperErrorCode = NoNode for /solr/overseer/queue-work
[junit4:junit4]   2> 12268 T32 oascc.ZkStateReader$2.process A cluster state change has occurred - updating...
[junit4:junit4]   2> 12397 T11 oasc.ShardLeaderElectionContext.waitForReplicasToComeUp Enough replicas found to continue.
[junit4:junit4]   2> 12398 T11 oasc.ShardLeaderElectionContext.runLeaderProcess I may be the new leader - try and sync
[junit4:junit4]   2> 12399 T11 oasc.SyncStrategy.sync Sync replicas to http://127.0.0.1:11348/solr/collection1/
[junit4:junit4]   2> 12400 T11 oasc.SyncStrategy.syncReplicas Sync Success - now sync replicas to me
[junit4:junit4]   2> 12400 T11 oasc.SyncStrategy.syncToMe http://127.0.0.1:11348/solr/collection1/ has no replicas
[junit4:junit4]   2> 12401 T11 oasc.ShardLeaderElectionContext.runLeaderProcess I am the new leader: http://127.0.0.1:11348/solr/collection1/
[junit4:junit4]   2> 12401 T11 oascc.SolrZkClient.makePath makePath: /collections/control_collection/leaders/control_shard
[junit4:junit4]   2> 12407 T16 oazs.PrepRequestProcessor.pRequest Got user-level KeeperException when processing sessionid:0x139ebd89bf60002 type:create cxid:0xa6 zxid:0xfffffffffffffffe txntype:unknown reqpath:n/a Error Path:/solr/overseer Error:KeeperErrorCode = NodeExists for /solr/overseer
[junit4:junit4]   2> 12776 T33 oascc.ZkStateReader.updateClusterState Updating cloud state from ZooKeeper... 
[junit4:junit4]   2> 12789 T32 oascc.ZkStateReader$2.process A cluster state change has occurred - updating...
[junit4:junit4]   2> 12826 T11 oasc.ZkController.register We are http://127.0.0.1:11348/solr/collection1/ and leader is http://127.0.0.1:11348/solr/collection1/
[junit4:junit4]   2> 12829 T11 oasc.ZkController.register No LogReplay needed for core=collection1 baseURL=http://127.0.0.1:11348/solr
[junit4:junit4]   2> 12830 T11 oasc.ZkController.checkRecovery I am the leader, no recovery necessary
[junit4:junit4]   2> 12832 T11 oascc.ZkStateReader.updateClusterState Updating cloud state from ZooKeeper... 
[junit4:junit4]   2> 12833 T11 oass.SolrDispatchFilter.init user.dir=/usr/home/hudson/hudson-slave/workspace/Lucene-Solr-Tests-trunk-java7/solr/build/solr-core/test/J1
[junit4:junit4]   2> 12834 T11 oass.SolrDispatchFilter.init SolrDispatchFilter.init() done
[junit4:junit4]   2> 12886 T11 oascsi.HttpClientUtil.createClient Creating new http client, config:maxConnections=128&maxConnectionsPerHost=32&followRedirects=false
[junit4:junit4]   2> 13019 T11 oejs.Server.doStart jetty-8.1.2.v20120308
[junit4:junit4]   2> 13022 T11 oejs.AbstractConnector.doStart Started SocketConnector@0.0.0.0:36679
[junit4:junit4]   2> 13023 T11 oasc.SolrResourceLoader.locateSolrHome JNDI not configured for solr (NoInitialContextEx)
[junit4:junit4]   2> 13024 T11 oasc.SolrResourceLoader.locateSolrHome using system property solr.solr.home: /usr/home/hudson/hudson-slave/workspace/Lucene-Solr-Tests-trunk-java7/solr/build/solr-core/test/J1/./org.apache.solr.cloud.BasicDistributedZk2Test-jetty1-1348281617413
[junit4:junit4]   2> 13024 T11 oasc.SolrResourceLoader.<init> new SolrResourceLoader for deduced Solr Home: '/usr/home/hudson/hudson-slave/workspace/Lucene-Solr-Tests-trunk-java7/solr/build/solr-core/test/J1/./org.apache.solr.cloud.BasicDistributedZk2Test-jetty1-1348281617413/'
[junit4:junit4]   2> 13057 T11 oass.SolrDispatchFilter.init SolrDispatchFilter.init()
[junit4:junit4]   2> 13057 T11 oasc.SolrResourceLoader.locateSolrHome JNDI not configured for solr (NoInitialContextEx)
[junit4:junit4]   2> 13058 T11 oasc.SolrResourceLoader.locateSolrHome using system property solr.solr.home: /usr/home/hudson/hudson-slave/workspace/Lucene-Solr-Tests-trunk-java7/solr/build/solr-core/test/J1/./org.apache.solr.cloud.BasicDistributedZk2Test-jetty1-1348281617413
[junit4:junit4]   2> 13058 T11 oasc.CoreContainer$Initializer.initialize looking for solr.xml: /usr/home/hudson/hudson-slave/workspace/Lucene-Solr-Tests-trunk-java7/solr/build/solr-core/test/J1/./org.apache.solr.cloud.BasicDistributedZk2Test-jetty1-1348281617413/solr.xml
[junit4:junit4]   2> 13059 T11 oasc.CoreContainer.<init> New CoreContainer 1830411704
[junit4:junit4]   2> 13060 T11 oasc.CoreContainer.load Loading CoreContainer using Solr Home: '/usr/home/hudson/hudson-slave/workspace/Lucene-Solr-Tests-trunk-java7/solr/build/solr-core/test/J1/./org.apache.solr.cloud.BasicDistributedZk2Test-jetty1-1348281617413/'
[junit4:junit4]   2> 13060 T11 oasc.SolrResourceLoader.<init> new SolrResourceLoader for directory: '/usr/home/hudson/hudson-slave/workspace/Lucene-Solr-Tests-trunk-java7/solr/build/solr-core/test/J1/./org.apache.solr.cloud.BasicDistributedZk2Test-jetty1-1348281617413/'
[junit4:junit4]   2> 13088 T11 oasc.CoreContainer.load Registering Log Listener
[junit4:junit4]   2> 13109 T11 oasc.CoreContainer.initZooKeeper Zookeeper client=127.0.0.1:15988/solr
[junit4:junit4]   2> 13110 T11 oaz.ZooKeeper.<init> Initiating client connection, connectString=127.0.0.1:15988/solr sessionTimeout=5000 watcher=org.apache.solr.common.cloud.ConnectionManager@51bb8cae
[junit4:junit4]   2> 13111 T45 oaz.ClientCnxn$SendThread.startConnect Opening socket connection to server /127.0.0.1:15988
[junit4:junit4]   2> 13111 T11 oascc.ConnectionManager.waitForConnected Waiting for client to connect to ZooKeeper
[junit4:junit4]   2> 13113 T45 oaz.ClientCnxn$SendThread.primeConnection Socket connection established to localhost/127.0.0.1:15988, initiating session
[junit4:junit4]   2> 13113 T13 oazs.NIOServerCnxn$Factory.run Accepted socket connection from /140.211.11.196:61405
[junit4:junit4]   2> 13114 T13 oazs.NIOServerCnxn.readConnectRequest Client attempting to establish new session at /140.211.11.196:61405
[junit4:junit4]   2> 13117 T15 oazs.NIOServerCnxn.finishSessionInit Established session 0x139ebd89bf60003 with negotiated timeout 5000 for client /140.211.11.196:61405
[junit4:junit4]   2> 13117 T45 oaz.ClientCnxn$SendThread.readConnectResult Session establishment complete on server localhost/127.0.0.1:15988, sessionid = 0x139ebd89bf60003, negotiated timeout = 5000
[junit4:junit4]   2> 13118 T46 oascc.ConnectionManager.process Watcher org.apache.solr.common.cloud.ConnectionManager@51bb8cae name:ZooKeeperConnection Watcher:127.0.0.1:15988/solr got event WatchedEvent state:SyncConnected type:None path:null path:null type:None
[junit4:junit4]   2> 13118 T11 oascc.ConnectionManager.waitForConnected Client is connected to ZooKeeper
[junit4:junit4]   2> 13119 T16 oazs.PrepRequestProcessor.pRequest Got user-level KeeperException when processing sessionid:0x139ebd89bf60003 type:create cxid:0x1 zxid:0xfffffffffffffffe txntype:unknown reqpath:n/a Error Path:/solr/overseer Error:KeeperErrorCode = NodeExists for /solr/overseer
[junit4:junit4]   2> 13121 T16 oazs.PrepRequestProcessor.pRequest Got user-level KeeperException when processing sessionid:0x139ebd89bf60003 type:create cxid:0x2 zxid:0xfffffffffffffffe txntype:unknown reqpath:n/a Error Path:/solr/overseer Error:KeeperErrorCode = NodeExists for /solr/overseer
[junit4:junit4]   2> 13136 T11 oasc.ZkController.createEphemeralLiveNode Register node as live in ZooKeeper:/live_nodes/127.0.0.1:36679_solr
[junit4:junit4]   2> 13137 T16 oazs.PrepRequestProcessor.pRequest Got user-level KeeperException when processing sessionid:0x139ebd89bf60003 type:delete cxid:0x4 zxid:0xfffffffffffffffe txntype:unknown reqpath:n/a Error Path:/solr/live_nodes/127.0.0.1:36679_solr Error:KeeperErrorCode = NoNode for /solr/live_nodes/127.0.0.1:36679_solr
[junit4:junit4]   2> 13138 T11 oascc.SolrZkClient.makePath makePath: /live_nodes/127.0.0.1:36679_solr
[junit4:junit4]   2> 13141 T32 oascc.ZkStateReader$3.process Updating live nodes
[junit4:junit4]   2> 13143 T11 oashc.HttpShardHandlerFactory.getParameter Setting socketTimeout to: 0
[junit4:junit4]   2> 13143 T11 oashc.HttpShardHandlerFactory.getParameter Setting urlScheme to: http://
[junit4:junit4]   2> 13144 T11 oashc.HttpShardHandlerFactory.getParameter Setting connTimeout to: 0
[junit4:junit4]   2> 13145 T11 oashc.HttpShardHandlerFactory.getParameter Setting maxConnectionsPerHost to: 20
[junit4:junit4]   2> 13146 T11 oashc.HttpShardHandlerFactory.getParameter Setting corePoolSize to: 0
[junit4:junit4]   2> 13147 T11 oashc.HttpShardHandlerFactory.getParameter Setting maximumPoolSize to: 2147483647
[junit4:junit4]   2> 13148 T11 oashc.HttpShardHandlerFactory.getParameter Setting maxThreadIdleTime to: 5
[junit4:junit4]   2> 13148 T11 oashc.HttpShardHandlerFactory.getParameter Setting sizeOfQueue to: -1
[junit4:junit4]   2> 13149 T11 oashc.HttpShardHandlerFactory.getParameter Setting fairnessPolicy to: false
[junit4:junit4]   2> 13150 T11 oascsi.HttpClientUtil.createClient Creating new http client, config:maxConnectionsPerHost=20&maxConnections=10000&socketTimeout=0&connTimeout=0&retry=false
[junit4:junit4]   2> 13175 T11 oascc.ZkStateReader.createClusterStateWatchersAndUpdate Updating cluster state from ZooKeeper... 
[junit4:junit4]   2> 13185 T11 oasc.CoreContainer.create Creating SolrCore 'collection1' using instanceDir: /usr/home/hudson/hudson-slave/workspace/Lucene-Solr-Tests-trunk-java7/solr/build/solr-core/test/J1/./org.apache.solr.cloud.BasicDistributedZk2Test-jetty1-1348281617413/collection1
[junit4:junit4]   2> 13186 T11 oasc.ZkController.createCollectionZkNode Check for collection zkNode:collection1
[junit4:junit4]   2> 13188 T11 oasc.ZkController.createCollectionZkNode Collection zkNode exists
[junit4:junit4]   2> 13189 T11 oasc.ZkController.readConfigName Load collection config from:/collections/collection1
[junit4:junit4]   2> 13191 T11 oasc.SolrResourceLoader.<init> new SolrResourceLoader for directory: '/usr/home/hudson/hudson-slave/workspace/Lucene-Solr-Tests-trunk-java7/solr/build/solr-core/test/J1/./org.apache.solr.cloud.BasicDistributedZk2Test-jetty1-1348281617413/collection1/'
[junit4:junit4]   2> 13193 T11 oasc.SolrResourceLoader.replaceClassLoader Adding 'file:/usr/home/hudson/hudson-slave/workspace/Lucene-Solr-Tests-trunk-java7/solr/build/solr-core/test/J1/org.apache.solr.cloud.BasicDistributedZk2Test-jetty1-1348281617413/collection1/lib/classes/' to classloader
[junit4:junit4]   2> 13194 T11 oasc.SolrResourceLoader.replaceClassLoader Adding 'file:/usr/home/hudson/hudson-slave/workspace/Lucene-Solr-Tests-trunk-java7/solr/build/solr-core/test/J1/org.apache.solr.cloud.BasicDistributedZk2Test-jetty1-1348281617413/collection1/lib/README' to classloader
[junit4:junit4]   2> 13295 T33 oascc.ZkStateReader.updateClusterState Updating cloud state from ZooKeeper... 
[junit4:junit4]   2> 13297 T11 oasc.SolrConfig.<init> Using Lucene MatchVersion: LUCENE_50
[junit4:junit4]   2> 13302 T32 oascc.ZkStateReader$2.process A cluster state change has occurred - updating...
[junit4:junit4]   2> 13302 T46 oascc.ZkStateReader$2.process A cluster state change has occurred - updating...
[junit4:junit4]   2> 13368 T11 oasc.SolrConfig.<init> Loaded SolrConfig: solrconfig.xml
[junit4:junit4]   2> 13469 T11 oass.IndexSchema.readSchema Reading Solr Schema
[junit4:junit4]   2> 13516 T11 oass.IndexSchema.readSchema Schema name=test
[junit4:junit4]   2> 14112 T11 oass.OpenExchangeRatesOrgProvider.init Initialized with rates=open-exchange-rates.json, refreshInterval=1440.
[junit4:junit4]   2> 14127 T11 oass.IndexSchema.readSchema default search field in schema is text
[junit4:junit4]   2> 14130 T11 oass.IndexSchema.readSchema unique key field: id
[junit4:junit4]   2> 14158 T11 oass.FileExchangeRateProvider.reload Reloading exchange rates from file currency.xml
[junit4:junit4]   2> 14165 T11 oass.FileExchangeRateProvider.reload Reloading exchange rates from file currency.xml
[junit4:junit4]   2> 14170 T11 oass.OpenExchangeRatesOrgProvider.reload Reloading exchange rates from open-exchange-rates.json
[junit4:junit4]   2> 14174 T11 oass.OpenExchangeRatesOrgProvider.reload Reloading exchange rates from open-exchange-rates.json
[junit4:junit4]   2> 14178 T11 oasc.SolrCore.<init> [collection1] Opening new SolrCore at /usr/home/hudson/hudson-slave/workspace/Lucene-Solr-Tests-trunk-java7/solr/build/solr-core/test/J1/./org.apache.solr.cloud.BasicDistributedZk2Test-jetty1-1348281617413/collection1/, dataDir=./org.apache.solr.cloud.BasicDistributedZk2Test-1348281604741/jetty1/
[junit4:junit4]   2> 14179 T11 oasc.JmxMonitoredMap.<init> JMX monitoring is enabled. Adding Solr mbeans to JMX Server: com.sun.jmx.mbeanserver.JmxMBeanServer@250a51
[junit4:junit4]   2> 14180 T11 oasc.SolrCore.getNewIndexDir WARNING New index directory detected: old=null new=./org.apache.solr.cloud.BasicDistributedZk2Test-1348281604741/jetty1/index/
[junit4:junit4]   2> 14181 T11 oasc.SolrCore.initIndex WARNING [collection1] Solr index directory './org.apache.solr.cloud.BasicDistributedZk2Test-1348281604741/jetty1/index' doesn't exist. Creating new index...
[junit4:junit4]   2> 14182 T11 oasc.CachingDirectoryFactory.get return new directory for /usr/home/hudson/hudson-slave/workspace/Lucene-Solr-Tests-trunk-java7/solr/build/solr-core/test/J1/./org.apache.solr.cloud.BasicDistributedZk2Test-1348281604741/jetty1/index forceNew:false
[junit4:junit4]   2> 14189 T11 oasc.SolrDeletionPolicy.onCommit SolrDeletionPolicy.onCommit: commits:num=1
[junit4:junit4]   2> 		commit{dir=NRTCachingDirectory(org.apache.lucene.store.NIOFSDirectory@/usr/home/hudson/hudson-slave/workspace/Lucene-Solr-Tests-trunk-java7/solr/build/solr-core/test/J1/org.apache.solr.cloud.BasicDistributedZk2Test-1348281604741/jetty1/index lockFactory=org.apache.lucene.store.NativeFSLockFactory@556c08de; maxCacheMB=48.0 maxMergeSizeMB=4.0),segFN=segments_1,generation=1,filenames=[segments_1]
[junit4:junit4]   2> 14189 T11 oasc.SolrDeletionPolicy.updateCommits newest commit = 1
[junit4:junit4]   2> 14190 T11 oasc.SolrCore.initWriters created xml: solr.XMLResponseWriter
[junit4:junit4]   2> 14194 T11 oasup.UpdateRequestProcessorChain.init inserting DistributedUpdateProcessorFactory into updateRequestProcessorChain "dedupe"
[junit4:junit4]   2> 14194 T11 oasup.UpdateRequestProcessorChain.init inserting DistributedUpdateProcessorFactory into updateRequestProcessorChain "dedupe-allfields"
[junit4:junit4]   2> 14195 T11 oasup.UpdateRequestProcessorChain.init inserting DistributedUpdateProcessorFactory into updateRequestProcessorChain "stored_sig"
[junit4:junit4]   2> 14196 T11 oasup.UpdateRequestProcessorChain.init inserting DistributedUpdateProcessorFactory into updateRequestProcessorChain "uniq-fields"
[junit4:junit4]   2> 14197 T11 oasup.UpdateRequestProcessorChain.init inserting DistributedUpdateProcessorFactory into updateRequestProcessorChain "distrib-dup-test-chain-implicit"
[junit4:junit4]   2> 14197 T11 oasc.RequestHandlers.initHandlersFromConfig adding lazy requestHandler: solr.ReplicationHandler
[junit4:junit4]   2> 14198 T11 oasc.RequestHandlers.initHandlersFromConfig created /replication: solr.ReplicationHandler
[junit4:junit4]   2> 14200 T11 oasc.RequestHandlers.initHandlersFromConfig created standard: solr.StandardRequestHandler
[junit4:junit4]   2> 14201 T11 oasc.RequestHandlers.initHandlersFromConfig created /get: solr.RealTimeGetHandler
[junit4:junit4]   2> 14203 T11 oasc.RequestHandlers.initHandlersFromConfig created dismax: solr.SearchHandler
[junit4:junit4]   2> 14204 T11 oasc.RequestHandlers.initHandlersFromConfig created mock: org.apache.solr.core.MockQuerySenderListenerReqHandler
[junit4:junit4]   2> 14205 T11 oasc.RequestHandlers.initHandlersFromConfig created /admin/: org.apache.solr.handler.admin.AdminHandlers
[junit4:junit4]   2> 14207 T11 oasc.RequestHandlers.initHandlersFromConfig created defaults: solr.StandardRequestHandler
[junit4:junit4]   2> 14207 T11 oasc.RequestHandlers.initHandlersFromConfig adding lazy requestHandler: solr.StandardRequestHandler
[junit4:junit4]   2> 14208 T11 oasc.RequestHandlers.initHandlersFromConfig created lazy: solr.StandardRequestHandler
[junit4:junit4]   2> 14210 T11 oasc.RequestHandlers.initHandlersFromConfig created /update: solr.UpdateRequestHandler
[junit4:junit4]   2> 14211 T11 oasc.RequestHandlers.initHandlersFromConfig created /terms: org.apache.solr.handler.component.SearchHandler
[junit4:junit4]   2> 14213 T11 oasc.RequestHandlers.initHandlersFromConfig created spellCheckCompRH: org.apache.solr.handler.component.SearchHandler
[junit4:junit4]   2> 14214 T11 oasc.RequestHandlers.initHandlersFromConfig created spellCheckCompRH_Direct: org.apache.solr.handler.component.SearchHandler
[junit4:junit4]   2> 14216 T11 oasc.RequestHandlers.initHandlersFromConfig created spellCheckWithWordbreak: org.apache.solr.handler.component.SearchHandler
[junit4:junit4]   2> 14217 T11 oasc.RequestHandlers.initHandlersFromConfig created spellCheckWithWordbreak_Direct: org.apache.solr.handler.component.SearchHandler
[junit4:junit4]   2> 14219 T11 oasc.RequestHandlers.initHandlersFromConfig created spellCheckCompRH1: org.apache.solr.handler.component.SearchHandler
[junit4:junit4]   2> 14220 T11 oasc.RequestHandlers.initHandlersFromConfig created tvrh: org.apache.solr.handler.component.SearchHandler
[junit4:junit4]   2> 14222 T11 oasc.RequestHandlers.initHandlersFromConfig created /mlt: solr.MoreLikeThisHandler
[junit4:junit4]   2> 14223 T11 oasc.RequestHandlers.initHandlersFromConfig created /debug/dump: solr.DumpRequestHandler
[junit4:junit4]   2> 14226 T11 oashl.XMLLoader.init xsltCacheLifetimeSeconds=60
[junit4:junit4]   2> 14230 T11 oasc.SolrCore.initDeprecatedSupport WARNING solrconfig.xml uses deprecated <admin/gettableFiles>, Please update your config to use the ShowFileRequestHandler.
[junit4:junit4]   2> 14232 T11 oasc.SolrCore.initDeprecatedSupport WARNING adding ShowFileRequestHandler with hidden files: [SCHEMA.XML, OLD_SYNONYMS.TXT, STOPWORDS.TXT, PROTWORDS.TXT, OPEN-EXCHANGE-RATES.JSON, SYNONYMS.TXT, CURRENCY.XML, MAPPING-ISOLATIN1ACCENT.TXT]
[junit4:junit4]   2> 14237 T11 oass.SolrIndexSearcher.<init> Opening Searcher@ed57bbe main
[junit4:junit4]   2> 14238 T11 oasu.CommitTracker.<init> Hard AutoCommit: disabled
[junit4:junit4]   2> 14238 T11 oasu.CommitTracker.<init> Soft AutoCommit: disabled
[junit4:junit4]   2> 14240 T11 oashc.SpellCheckComponent.inform Initializing spell checkers
[junit4:junit4]   2> 14247 T11 oass.DirectSolrSpellChecker.init init: {name=direct,classname=DirectSolrSpellChecker,field=lowerfilt,minQueryLength=3}
[junit4:junit4]   2> 14315 T47 oasc.SolrCore.registerSearcher [collection1] Registered new searcher Searcher@ed57bbe main{StandardDirectoryReader(segments_1:1)}
[junit4:junit4]   2> 14813 T33 oascc.ZkStateReader.updateClusterState Updating cloud state from ZooKeeper... 
[junit4:junit4]   2> 14838 T32 oascc.ZkStateReader$2.process A cluster state change has occurred - updating...
[junit4:junit4]   2> 14838 T46 oascc.ZkStateReader$2.process A cluster state change has occurred - updating...
[junit4:junit4]   2> 15331 T11 oasc.CoreContainer.register registering core: collection1
[junit4:junit4]   2> 15332 T11 oasc.ZkController.register Register shard - core:collection1 address:http://127.0.0.1:36679/solr shardId:shard1
[junit4:junit4]   2> 15333 T11 oascc.SolrZkClient.makePath makePath: /collections/collection1/leader_elect/shard1/election
[junit4:junit4]   2> 15352 T16 oazs.PrepRequestProcessor.pRequest Got user-level KeeperException when processing sessionid:0x139ebd89bf60003 type:delete cxid:0x43 zxid:0xfffffffffffffffe txntype:unknown reqpath:n/a Error Path:/solr/collections/collection1/leaders Error:KeeperErrorCode = NoNode for /solr/collections/collection1/leaders
[junit4:junit4]   2> 15354 T11 oasc.ShardLeaderElectionContext.runLeaderProcess Running the leader process.
[junit4:junit4]   2> 15355 T16 oazs.PrepRequestProcessor.pRequest Got user-level KeeperException when processing sessionid:0x139ebd89bf60003 type:create cxid:0x44 zxid:0xfffffffffffffffe txntype:unknown reqpath:n/a Error Path:/solr/overseer Error:KeeperErrorCode = NodeExists for /solr/overseer
[junit4:junit4]   2> 15363 T11 oasc.ShardLeaderElectionContext.waitForReplicasToComeUp Enough replicas found to continue.
[junit4:junit4]   2> 15364 T11 oasc.ShardLeaderElectionContext.runLeaderProcess I may be the new leader - try and sync
[junit4:junit4]   2> 15364 T11 oasc.SyncStrategy.sync Sync replicas to http://127.0.0.1:36679/solr/collection1/
[junit4:junit4]   2> 15365 T11 oasc.SyncStrategy.syncReplicas Sync Success - now sync replicas to me
[junit4:junit4]   2> 15366 T11 oasc.SyncStrategy.syncToMe http://127.0.0.1:36679/solr/collection1/ has no replicas
[junit4:junit4]   2> 15366 T11 oasc.ShardLeaderElectionContext.runLeaderProcess I am the new leader: http://127.0.0.1:36679/solr/collection1/
[junit4:junit4]   2> 15367 T11 oascc.SolrZkClient.makePath makePath: /collections/collection1/leaders/shard1
[junit4:junit4]   2> 15468 T16 oazs.PrepRequestProcessor.pRequest Got user-level KeeperException when processing sessionid:0x139ebd89bf60003 type:create cxid:0x4e zxid:0xfffffffffffffffe txntype:unknown reqpath:n/a Error Path:/solr/overseer Error:KeeperErrorCode = NodeExists for /solr/overseer
[junit4:junit4]   2> 15854 T33 oascc.ZkStateReader.updateClusterState Updating cloud state from ZooKeeper... 
[junit4:junit4]   2> 15882 T46 oascc.ZkStateReader$2.process A cluster state change has occurred - updating...
[junit4:junit4]   2> 15882 T32 oascc.ZkStateReader$2.process A cluster state change has occurred - updating...
[junit4:junit4]   2> 15887 T11 oasc.ZkController.register We are http://127.0.0.1:36679/solr/collection1/ and leader is http://127.0.0.1:36679/solr/collection1/
[junit4:junit4]   2> 15887 T11 oasc.ZkController.register No LogReplay needed for core=collection1 baseURL=http://127.0.0.1:36679/solr
[junit4:junit4]   2> 15888 T11 oasc.ZkController.checkRecovery I am the leader, no recovery necessary
[junit4:junit4]   2> 15892 T11 oascc.ZkStateReader.updateClusterState Updating cloud state from ZooKeeper... 
[junit4:junit4]   2> 15894 T11 oass.SolrDispatchFilter.init user.dir=/usr/home/hudson/hudson-slave/workspace/Lucene-Solr-Tests-trunk-java7/solr/build/solr-core/test/J1
[junit4:junit4]   2> 15895 T11 oass.SolrDispatchFilter.init SolrDispatchFilter.init() done
[junit4:junit4]   2> 15896 T11 oascsi.HttpClientUtil.createClient Creating new http client, config:maxConnections=128&maxConnectionsPerHost=32&followRedirects=false
[junit4:junit4]   2> 16073 T11 oejs.Server.doStart jetty-8.1.2.v20120308
[junit4:junit4]   2> 16077 T11 oejs.AbstractConnector.doStart Started SocketConnector@0.0.0.0:31843
[junit4:junit4]   2> 16078 T11 oasc.SolrResourceLoader.locateSolrHome JNDI not configured for solr (NoInitialContextEx)
[junit4:junit4]   2> 16079 T11 oasc.SolrResourceLoader.locateSolrHome using system property solr.solr.home: /usr/home/hudson/hudson-slave/workspace/Lucene-Solr-Tests-trunk-java7/solr/build/solr-core/test/J1/./org.apache.solr.cloud.BasicDistributedZk2Test-jetty2-1348281620422
[junit4:junit4]   2> 16079 T11 oasc.SolrResourceLoader.<init> new SolrResourceLoader for deduced Solr Home: '/usr/home/hudson/hudson-slave/workspace/Lucene-Solr-Tests-trunk-java7/solr/build/solr-core/test/J1/./org.apache.solr.cloud.BasicDistributedZk2Test-jetty2-1348281620422/'
[junit4:junit4]   2> 16125 T11 oass.SolrDispatchFilter.init SolrDispatchFilter.init()
[junit4:junit4]   2> 16126 T11 oasc.SolrResourceLoader.locateSolrHome JNDI not configured for solr (NoInitialContextEx)
[junit4:junit4]   2> 16127 T11 oasc.SolrResourceLoader.locateSolrHome using system property solr.solr.home: /usr/home/hudson/hudson-slave/workspace/Lucene-Solr-Tests-trunk-java7/solr/build/solr-core/test/J1/./org.apache.solr.cloud.BasicDistributedZk2Test-jetty2-1348281620422
[junit4:junit4]   2> 16127 T11 oasc.CoreContainer$Initializer.initialize looking for solr.xml: /usr/home/hudson/hudson-slave/workspace/Lucene-Solr-Tests-trunk-java7/solr/build/solr-core/test/J1/./org.apache.solr.cloud.BasicDistributedZk2Test-jetty2-1348281620422/solr.xml
[junit4:junit4]   2> 16128 T11 oasc.CoreContainer.<init> New CoreContainer 6097843
[junit4:junit4]   2> 16129 T11 oasc.CoreContainer.load Loading CoreContainer using Solr Home: '/usr/home/hudson/hudson-slave/workspace/Lucene-Solr-Tests-trunk-java7/solr/build/solr-core/test/J1/./org.apache.solr.cloud.BasicDistributedZk2Test-jetty2-1348281620422/'
[junit4:junit4]   2> 16130 T11 oasc.SolrResourceLoader.<init> new SolrResourceLoader for directory: '/usr/home/hudson/hudson-slave/workspace/Lucene-Solr-Tests-trunk-java7/solr/build/solr-core/test/J1/./org.apache.solr.cloud.BasicDistributedZk2Test-jetty2-1348281620422/'
[junit4:junit4]   2> 16171 T11 oasc.CoreContainer.load Registering Log Listener
[junit4:junit4]   2> 16193 T11 oasc.CoreContainer.initZooKeeper Zookeeper client=127.0.0.1:15988/solr
[junit4:junit4]   2> 16194 T11 oaz.ZooKeeper.<init> Initiating client connection, connectString=127.0.0.1:15988/solr sessionTimeout=5000 watcher=org.apache.solr.common.cloud.ConnectionManager@3c2e19e5
[junit4:junit4]   2> 16195 T57 oaz.ClientCnxn$SendThread.startConnect Opening socket connection to server /127.0.0.1:15988
[junit4:junit4]   2> 16195 T11 oascc.ConnectionManager.waitForConnected Waiting for client to connect to ZooKeeper
[junit4:junit4]   2> 16197 T57 oaz.ClientCnxn$SendThread.primeConnection Socket connection established to localhost/127.0.0.1:15988, initiating session
[junit4:junit4]   2> 16197 T13 oazs.NIOServerCnxn$Factory.run Accepted socket connection from /140.211.11.196:35490
[junit4:junit4]   2> 16198 T13 oazs.NIOServerCnxn.readConnectRequest Client attempting to establish new session at /140.211.11.196:35490
[junit4:junit4]   2> 16204 T15 oazs.NIOServerCnxn.finishSessionInit Established session 0x139ebd89bf60004 with negotiated timeout 5000 for client /140.211.11.196:35490
[junit4:junit4]   2> 16204 T57 oaz.ClientCnxn$SendThread.readConnectResult Session establishment complete on server localhost/127.0.0.1:15988, sessionid = 0x139ebd89bf60004, negotiated timeout = 5000
[junit4:junit4]   2> 16204 T58 oascc.ConnectionManager.process Watcher org.apache.solr.common.cloud.ConnectionManager@3c2e19e5 name:ZooKeeperConnection Watcher:127.0.0.1:15988/solr got event WatchedEvent state:SyncConnected type:None path:null path:null type:None
[junit4:junit4]   2> 16205 T11 oascc.ConnectionManager.waitForConnected Client is connected to ZooKeeper
[junit4:junit4]   2> 16206 T16 oazs.PrepRequestProcessor.pRequest Got user-level KeeperException when processing sessionid:0x139ebd89bf60004 type:create cxid:0x1 zxid:0xfffffffffffffffe txntype:unknown reqpath:n/a Error Path:/solr/overseer Error:KeeperErrorCode = NodeExists for /solr/overseer
[junit4:junit4]   2> 16208 T16 oazs.PrepRequestProcessor.pRequest Got user-level KeeperException when processing sessionid:0x139ebd89bf60004 type:create cxid:0x2 zxid:0xfffffffffffffffe txntype:unknown reqpath:n/a Error Path:/solr/overseer Error:KeeperErrorCode = NodeExists for /solr/overseer
[junit4:junit4]   2> 16225 T11 oasc.ZkController.createEphemeralLiveNode Register node as live in ZooKeeper:/live_nodes/127.0.0.1:31843_solr
[junit4:junit4]   2> 16226 T16 oazs.PrepRequestProcessor.pRequest Got user-level KeeperException when processing sessionid:0x139ebd89bf60004 type:delete cxid:0x4 zxid:0xfffffffffffffffe txntype:unknown reqpath:n/a Error Path:/solr/live_nodes/127.0.0.1:31843_solr Error:KeeperErrorCode = NoNode for /solr/live_nodes/127.0.0.1:31843_solr
[junit4:junit4]   2> 16228 T11 oascc.SolrZkClient.makePath makePath: /live_nodes/127.0.0.1:31843_solr
[junit4:junit4]   2> 16232 T32 oascc.ZkStateReader$3.process Updating live nodes
[junit4:junit4]   2> 16232 T46 oascc.ZkStateReader$3.process Updating live nodes
[junit4:junit4]   2> 16234 T11 oashc.HttpShardHandlerFactory.getParameter Setting socketTimeout to: 0
[junit4:junit4]   2> 16234 T11 oashc.HttpShardHandlerFactory.getParameter Setting urlScheme to: http://
[junit4:junit4]   2> 16235 T11 oashc.HttpShardHandlerFactory.getParameter Setting connTimeout to: 0
[junit4:junit4]   2> 16236 T11 oashc.HttpShardHandlerFactory.getParameter Setting maxConnectionsPerHost to: 20
[junit4:junit4]   2> 16237 T11 oashc.HttpShardHandlerFactory.getParameter Setting corePoolSize to: 0
[junit4:junit4]   2> 16237 T11 oashc.HttpShardHandlerFactory.getParameter Setting maximumPoolSize to: 2147483647
[junit4:junit4]   2> 16238 T11 oashc.HttpShardHandlerFactory.getParameter Setting maxThreadIdleTime to: 5
[junit4:junit4]   2> 16239 T11 oashc.HttpShardHandlerFactory.getParameter Setting sizeOfQueue to: -1
[junit4:junit4]   2> 16240 T11 oashc.HttpShardHandlerFactory.getParameter Setting fairnessPolicy to: false
[junit4:junit4]   2> 16240 T11 oascsi.HttpClientUtil.createClient Creating new http client, config:maxConnectionsPerHost=20&maxConnections=10000&socketTimeout=0&connTimeout=0&retry=false
[junit4:junit4]   2> 16261 T11 oascc.ZkStateReader.createClusterStateWatchersAndUpdate Updating cluster state from ZooKeeper... 
[junit4:junit4]   2> 16271 T11 oasc.CoreContainer.create Creating SolrCore 'collection1' using instanceDir: /usr/home/hudson/hudson-slave/workspace/Lucene-Solr-Tests-trunk-java7/solr/build/solr-core/test/J1/./org.apache.solr.cloud.BasicDistributedZk2Test-jetty2-1348281620422/collection1
[junit4:junit4]   2> 16271 T11 oasc.ZkController.createCollectionZkNode Check for collection zkNode:collection1
[junit4:junit4]   2> 16273 T11 oasc.ZkController.createCollectionZkNode Collection zkNode exists
[junit4:junit4]   2> 16274 T11 oasc.ZkController.readConfigName Load collection config from:/collections/collection1
[junit4:junit4]   2> 16276 T11 oasc.SolrResourceLoader.<init> new SolrResourceLoader for directory: '/usr/home/hudson/hudson-slave/workspace/Lucene-Solr-Tests-trunk-java7/solr/build/solr-core/test/J1/./org.apache.solr.cloud.BasicDistributedZk2Test-jetty2-1348281620422/collection1/'
[junit4:junit4]   2> 16278 T11 oasc.SolrResourceLoader.replaceClassLoader Adding 'file:/usr/home/hudson/hudson-slave/workspace/Lucene-Solr-Tests-trunk-java7/solr/build/solr-core/test/J1/org.apache.solr.cloud.BasicDistributedZk2Test-jetty2-1348281620422/collection1/lib/classes/' to classloader
[junit4:junit4]   2> 16279 T11 oasc.SolrResourceLoader.replaceClassLoader Adding 'file:/usr/home/hudson/hudson-slave/workspace/Lucene-Solr-Tests-trunk-java7/solr/build/solr-core/test/J1/org.apache.solr.cloud.BasicDistributedZk2Test-jetty2-1348281620422/collection1/lib/README' to classloader
[junit4:junit4]   2> 16364 T11 oasc.SolrConfig.<init> Using Lucene MatchVersion: LUCENE_50
[junit4:junit4]   2> 16398 T33 oascc.ZkStateReader.updateClusterState Updating cloud state from ZooKeeper... 
[junit4:junit4]   2> 16413 T46 oascc.ZkStateReader$2.process A cluster state change has occurred - updating...
[junit4:junit4]   2> 16413 T32 oascc.ZkStateReader$2.process A cluster state change has occurred - updating...
[junit4:junit4]   2> 16413 T58 oascc.ZkStateReader$2.process A cluster state change has occurred - updating...
[junit4:junit4]   2> 16454 T11 oasc.SolrConfig.<init> Loaded SolrConfig: solrconfig.xml
[junit4:junit4]   2> 16556 T11 oass.IndexSchema.readSchema Reading Solr Schema
[junit4:junit4]   2> 16615 T11 oass.IndexSchema.readSchema Schema name=test
[junit4:junit4]   2> 17382 T11 oass.OpenExchangeRatesOrgProvider.init Initialized with rates=open-exchange-rates.json, refreshInterval=1440.
[junit4:junit4]   2> 17401 T11 oass.IndexSchema.readSchema default search field in schema is text
[junit4:junit4]   2> 17406 T11 oass.IndexSchema.readSchema unique key field: id
[junit4:junit4]   2> 17441 T11 oass.FileExchangeRateProvider.reload Reloading exchange rates from file currency.xml
[junit4:junit4]   2> 17448 T11 oass.FileExchangeRateProvider.reload Reloading exchange rates from file currency.xml
[junit4:junit4]   2> 17454 T11 oass.OpenExchangeRatesOrgProvider.reload Reloading exchange rates from open-exchange-rates.json
[junit4:junit4]   2> 17458 T11 oass.OpenExchangeRatesOrgProvider.reload Reloading exchange rates from open-exchange-rates.json
[junit4:junit4]   2> 17462 T11 oasc.SolrCore.<init> [collection1] Opening new SolrCore at /usr/home/hudson/hudson-slave/workspace/Lucene-Solr-Tests-trunk-java7/solr/build/solr-core/test/J1/./org.apache.solr.cloud.BasicDistributedZk2Test-jetty2-1348281620422/collection1/, dataDir=./org.apache.solr.cloud.BasicDistributedZk2Test-1348281604741/jetty2/
[junit4:junit4]   2> 17463 T11 oasc.JmxMonitoredMap.<init> JMX monitoring is enabled. Adding Solr mbeans to JMX Server: com.sun.jmx.mbeanserver.JmxMBeanServer@250a51
[junit4:junit4]   2> 17465 T11 oasc.SolrCore.getNewIndexDir WARNING New index directory detected: old=null new=./org.apache.solr.cloud.BasicDistributedZk2Test-1348281604741/jetty2/index/
[junit4:junit4]   2> 17466 T11 oasc.SolrCore.initIndex WARNING [collection1] Solr index directory './org.apache.solr.cloud.BasicDistributedZk2Test-1348281604741/jetty2/index' doesn't exist. Creating new index...
[junit4:junit4]   2> 17467 T11 oasc.CachingDirectoryFactory.get return new directory for /usr/home/hudson/hudson-slave/workspace/Lucene-Solr-Tests-trunk-java7/solr/build/solr-core/test/J1/./org.apache.solr.cloud.BasicDistributedZk2Test-1348281604741/jetty2/index forceNew:false
[junit4:junit4]   2> 17500 T11 oasc.SolrDeletionPolicy.onCommit SolrDeletionPolicy.onCommit: commits:num=1
[junit4:junit4]   2> 		commit{dir=NRTCachingDirectory(org.apache.lucene.store.NIOFSDirectory@/usr/home/hudson/hudson-slave/workspace/Lucene-Solr-Tests-trunk-java7/solr/build/solr-core/test/J1/org.apache.solr.cloud.BasicDistributedZk2Test-1348281604741/jetty2/index lockFactory=org.apache.lucene.store.NativeFSLockFactory@2dae9baf; maxCacheMB=48.0 maxMergeSizeMB=4.0),segFN=segments_1,generation=1,filenames=[segments_1]
[junit4:junit4]   2> 17501 T11 oasc.SolrDeletionPolicy.updateCommits newest commit = 1
[junit4:junit4]   2> 17502 T11 oasc.SolrCore.initWriters created xml: solr.XMLResponseWriter
[junit4:junit4]   2> 17506 T11 oasup.UpdateRequestProcessorChain.init inserting DistributedUpdateProcessorFactory into updateRequestProcessorChain "dedupe"
[junit4:junit4]   2> 17507 T11 oasup.UpdateRequestProcessorChain.init inserting DistributedUpdateProcessorFactory into updateRequestProcessorChain "dedupe-allfields"
[junit4:junit4]   2> 17508 T11 oasup.UpdateRequestProcessorChain.init inserting DistributedUpdateProcessorFactory into updateRequestProcessorChain "stored_sig"
[junit4:junit4]   2> 17509 T11 oasup.UpdateRequestProcessorChain.init inserting DistributedUpdateProcessorFactory into updateRequestProcessorChain "uniq-fields"
[junit4:junit4]   2> 17511 T11 oasup.UpdateRequestProcessorChain.init inserting DistributedUpdateProcessorFactory into updateRequestProcessorChain "distrib-dup-test-chain-implicit"
[junit4:junit4]   2> 17511 T11 oasc.RequestHandlers.initHandlersFromConfig adding lazy requestHandler: solr.ReplicationHandler
[junit4:junit4]   2> 17513 T11 oasc.RequestHandlers.initHandlersFromConfig created /replication: solr.ReplicationHandler
[junit4:junit4]   2> 17514 T11 oasc.RequestHandlers.initHandlersFromConfig created standard: solr.StandardRequestHandler
[junit4:junit4]   2> 17516 T11 oasc.RequestHandlers.initHandlersFromConfig created /get: solr.RealTimeGetHandler
[junit4:junit4]   2> 17517 T11 oasc.RequestHandlers.initHandlersFromConfig created dismax: solr.SearchHandler
[junit4:junit4]   2> 17519 T11 oasc.RequestHandlers.initHandlersFromConfig created mock: org.apache.solr.core.MockQuerySenderListenerReqHandler
[junit4:junit4]   2> 17520 T11 oasc.RequestHandlers.initHandlersFromConfig created /admin/: org.apache.solr.handler.admin.AdminHandlers
[junit4:junit4]   2> 17522 T11 oasc.RequestHandlers.initHandlersFromConfig created defaults: solr.StandardRequestHandler
[junit4:junit4]   2> 17522 T11 oasc.RequestHandlers.initHandlersFromConfig adding lazy requestHandler: solr.StandardRequestHandler
[junit4:junit4]   2> 17523 T11 oasc.RequestHandlers.initHandlersFromConfig created lazy: solr.StandardRequestHandler
[junit4:junit4]   2> 17525 T11 oasc.RequestHandlers.initHandlersFromConfig created /update: solr.UpdateRequestHandler
[junit4:junit4]   2> 17526 T11 oasc.RequestHandlers.initHandlersFromConfig created /terms: org.apache.solr.handler.component.SearchHandler
[junit4:junit4]   2> 17528 T11 oasc.RequestHandlers.initHandlersFromConfig created spellCheckCompRH: org.apache.solr.handler.component.SearchHandler
[junit4:junit4]   2> 17529 T11 oasc.RequestHandlers.initHandlersFromConfig created spellCheckCompRH_Direct: org.apache.solr.handler.component.SearchHandler
[junit4:junit4]   2> 17531 T11 oasc.RequestHandlers.initHandlersFromConfig created spellCheckWithWordbreak: org.apache.solr.handler.component.SearchHandler
[junit4:junit4]   2> 17533 T11 oasc.RequestHandlers.initHandlersFromConfig created spellCheckWithWordbreak_Direct: org.apache.solr.handler.component.SearchHandler
[junit4:junit4]   2> 17534 T11 oasc.RequestHandlers.initHandlersFromConfig created spellCheckCompRH1: org.apache.solr.handler.component.SearchHandler
[junit4:junit4]   2> 17536 T11 oasc.RequestHandlers.initHandlersFromConfig created tvrh: org.apache.solr.handler.component.SearchHandler
[junit4:junit4]   2> 17537 T11 oasc.RequestHandlers.initHandlersFromConfig created /mlt: solr.MoreLikeThisHandler
[junit4:junit4]   2> 17539 T11 oasc.RequestHandlers.initHandlersFromConfig created /debug/dump: solr.DumpRequestHandler
[junit4:junit4]   2> 17543 T11 oashl.XMLLoader.init xsltCacheLifetimeSeconds=60
[junit4:junit4]   2> 17548 T11 oasc.SolrCore.initDeprecatedSupport WARNING solrconfig.xml uses deprecated <admin/gettableFiles>, Please update your config to use the ShowFileRequestHandler.
[junit4:junit4]   2> 17551 T11 oasc.SolrCore.initDeprecatedSupport WARNING adding ShowFileRequestHandler with hidden files: [SCHEMA.XML, OLD_SYNONYMS.TXT, STOPWORDS.TXT, PROTWORDS.TXT, OPEN-EXCHANGE-RATES.JSON, SYNONYMS.TXT, CURRENCY.XML, MAPPING-ISOLATIN1ACCENT.TXT]
[junit4:junit4]   2> 17556 T11 oass.SolrIndexSearcher.<init> Opening Searcher@f88bafd main
[junit4:junit4]   2> 17558 T11 oasu.CommitTracker.<init> Hard AutoCommit: disabled
[junit4:junit4]   2> 17558 T11 oasu.CommitTracker.<init> Soft AutoCommit: disabled
[junit4:junit4]   2> 17560 T11 oashc.SpellCheckComponent.inform Initializing spell checkers
[junit4:junit4]   2> 17569 T11 oass.DirectSolrSpellChecker.init init: {name=direct,classname=DirectSolrSpellChecker,field=lowerfilt,minQueryLength=3}
[junit4:junit4]   2> 17634 T59 oasc.SolrCore.registerSearcher [collection1] Registered new searcher Searcher@f88bafd main{StandardDirectoryReader(segments_1:1)}
[junit4:junit4]   2> 17926 T33 oascc.ZkStateReader.updateClusterState Updating cloud state from ZooKeeper... 
[junit4:junit4]   2> 17946 T32 oascc.ZkStateReader$2.process A cluster state change has occurred - updating...
[junit4:junit4]   2> 17946 T58 oascc.ZkStateReader$2.process A cluster state change has occurred - updating...
[junit4:junit4]   2> 17946 T46 oascc.ZkStateReader$2.process A cluster state change has occurred - updating...
[junit4:junit4]   2> 18150 T11 oasc.CoreContainer.register registering core: collection1
[junit4:junit4]   2> 18151 T11 oasc.ZkController.register Register shard - core:collection1 address:http://127.0.0.1:31843/solr shardId:shard2
[junit4:junit4]   2> 18152 T11 oascc.SolrZkClient.makePath makePath: /collections/collection1/leader_elect/shard2/election
[junit4:junit4]   2> 18161 T16 oazs.PrepRequestProcessor.pRequest Got user-level KeeperException when processing sessionid:0x139ebd89bf60004 type:delete cxid:0x42 zxid:0xfffffffffffffffe txntype:unknown reqpath:n/a Error Path:/solr/collections/collection1/leaders/shard2 Error:KeeperErrorCode = NoNode for /solr/collections/collection1/leaders/shard2
[junit4:junit4]   2> 18170 T11 oasc.ShardLeaderElectionContext.runLeaderProcess Running the leader process.
[junit4:junit4]   2> 18171 T16 oazs.PrepRequestProcessor.pRequest Got user-level KeeperException when processing sessionid:0x139ebd89bf60004 type:create cxid:0x43 zxid:0xfffffffffffffffe txntype:unknown reqpath:n/a Error Path:/solr/overseer Error:KeeperErrorCode = NodeExists for /solr/overseer
[junit4:junit4]   2> 18174 T11 oasc.ShardLeaderElectionContext.waitForReplicasToComeUp Enough replicas found to continue.
[junit4:junit4]   2> 18175 T11 oasc.ShardLeaderElectionContext.runLeaderProcess I may be the new leader - try and sync
[junit4:junit4]   2> 18175 T11 oasc.SyncStrategy.sync Sync replicas to http://127.0.0.1:31843/solr/collection1/
[junit4:junit4]   2> 18176 T11 oasc.SyncStrategy.syncReplicas Sync Success - now sync replicas to me
[junit4:junit4]   2> 18177 T11 oasc.SyncStrategy.syncToMe http://127.0.0.1:31843/solr/collection1/ has no replicas
[junit4:junit4]   2> 18177 T11 oasc.ShardLeaderElectionContext.runLeaderProcess I am the new leader: http://127.0.0.1:31843/solr/collection1/
[junit4:junit4]   2> 18178 T11 oascc.SolrZkClient.makePath makePath: /collections/collection1/leaders/shard2
[junit4:junit4]   2> 18183 T16 oazs.PrepRequestProcessor.pRequest Got user-level KeeperException when processing sessionid:0x139ebd89bf60004 type:create cxid:0x4c zxid:0xfffffffffffffffe txntype:unknown reqpath:n/a Error Path:/solr/overseer Error:KeeperErrorCode = NodeExists for /solr/overseer
[junit4:junit4]   2> 18452 T33 oascc.ZkStateReader.updateClusterState Updating cloud state from ZooKeeper... 
[junit4:junit4]   2> 18475 T32 oascc.ZkStateReader$2.process A cluster state change has occurred - updating...
[junit4:junit4]   2> 18475 T46 oascc.ZkStateReader$2.process A cluster state change has occurred - updating...
[junit4:junit4]   2> 18475 T58 oascc.ZkStateReader$2.process A cluster state change has occurred - updating...
[junit4:junit4]   2> 18492 T11 oasc.ZkController.register We are http://127.0.0.1:31843/solr/collection1/ and leader is http://127.0.0.1:31843/solr/collection1/
[junit4:junit4]   2> 18493 T11 oasc.ZkController.register No LogReplay needed for core=collection1 baseURL=http://127.0.0.1:31843/solr
[junit4:junit4]   2> 18493 T11 oasc.ZkController.checkRecovery I am the leader, no recovery necessary
[junit4:junit4]   2> 18497 T11 oascc.ZkStateReader.updateClusterState Updating cloud state from ZooKeeper... 
[junit4:junit4]   2> 18499 T11 oass.SolrDispatchFilter.init user.dir=/usr/home/hudson/hudson-slave/workspace/Lucene-Solr-Tests-trunk-java7/solr/build/solr-core/test/J1
[junit4:junit4]   2> 18499 T11 oass.SolrDispatchFilter.init SolrDispatchFilter.init() done
[junit4:junit4]   2> 18500 T11 oascsi.HttpClientUtil.createClient Creating new http client, config:maxConnections=128&maxConnectionsPerHost=32&followRedirects=false
[junit4:junit4]   2> 18685 T11 oejs.Server.doStart jetty-8.1.2.v20120308
[junit4:junit4]   2> 18689 T11 oejs.AbstractConnector.doStart Started SocketConnector@0.0.0.0:58640
[junit4:junit4]   2> 18690 T11 oasc.SolrResourceLoader.locateSolrHome JNDI not configured for solr (NoInitialContextEx)
[junit4:junit4]   2> 18691 T11 oasc.SolrResourceLoader.locateSolrHome using system property solr.solr.home: /usr/home/hudson/hudson-slave/workspace/Lucene-Solr-Tests-trunk-java7/solr/build/solr-core/test/J1/./org.apache.solr.cloud.BasicDistributedZk2Test-jetty3-1348281623027
[junit4:junit4]   2> 18692 T11 oasc.SolrResourceLoader.<init> new SolrResourceLoader for deduced Solr Home: '/usr/home/hudson/hudson-slave/workspace/Lucene-Solr-Tests-trunk-java7/solr/build/solr-core/test/J1/./org.apache.solr.cloud.BasicDistributedZk2Test-jetty3-1348281623027/'
[junit4:junit4]   2> 18737 T11 oass.SolrDispatchFilter.init SolrDispatchFilter.init()
[junit4:junit4]   2> 18738 T11 oasc.SolrResourceLoader.locateSolrHome JNDI not configured for solr (NoInitialContextEx)
[junit4:junit4]   2> 18738 T11 oasc.SolrResourceLoader.locateSolrHome using system property solr.solr.home: /usr/home/hudson/hudson-slave/workspace/Lucene-Solr-Tests-trunk-java7/solr/build/solr-core/test/J1/./org.apache.solr.cloud.BasicDistributedZk2Test-jetty3-1348281623027
[junit4:junit4]   2> 18739 T11 oasc.CoreContainer$Initializer.initialize looking for solr.xml: /usr/home/hudson/hudson-slave/workspace/Lucene-Solr-Tests-trunk-java7/solr/build/solr-core/test/J1/./org.apache.solr.cloud.BasicDistributedZk2Test-jetty3-1348281623027/solr.xml
[junit4:junit4]   2> 18740 T11 oasc.CoreContainer.<init> New CoreContainer 376595562
[junit4:junit4]   2> 18741 T11 oasc.CoreContainer.load Loading CoreContainer using Solr Home: '/usr/home/hudson/hudson-slave/workspace/Lucene-Solr-Tests-trunk-java7/solr/build/solr-core/test/J1/./org.apache.solr.cloud.BasicDistributedZk2Test-jetty3-1348281623027/'
[junit4:junit4]   2> 18742 T11 oasc.SolrResourceLoader.<init> new SolrResourceLoader for directory: '/usr/home/hudson/hudson-slave/workspace/Lucene-Solr-Tests-trunk-java7/solr/build/solr-core/test/J1/./org.apache.solr.cloud.BasicDistributedZk2Test-jetty3-1348281623027/'
[junit4:junit4]   2> 18780 T11 oasc.CoreContainer.load Registering Log Listener
[junit4:junit4]   2> 18801 T11 oasc.CoreContainer.initZooKeeper Zookeeper client=127.0.0.1:15988/solr
[junit4:junit4]   2> 18802 T11 oaz.ZooKeeper.<init> Initiating client connection, connectString=127.0.0.1:15988/solr sessionTimeout=5000 watcher=org.apache.solr.common.cloud.ConnectionManager@127cdc
[junit4:junit4]   2> 18804 T69 oaz.ClientCnxn$SendThread.startConnect Opening socket connection to server /127.0.0.1:15988
[junit4:junit4]   2> 18804 T11 oascc.ConnectionManager.waitForConnected Waiting for client to connect to ZooKeeper
[junit4:junit4]   2> 18805 T69 oaz.ClientCnxn$SendThread.primeConnection Socket connection established to localhost/127.0.0.1:15988, initiating session
[junit4:junit4]   2> 18806 T13 oazs.NIOServerCnxn$Factory.run Accepted socket connection from /140.211.11.196:27218
[junit4:junit4]   2> 18806 T13 oazs.NIOServerCnxn.readConnectRequest Client attempting to establish new session at /140.211.11.196:27218
[junit4:junit4]   2> 18809 T15 oazs.NIOServerCnxn.finishSessionInit Established session 0x139ebd89bf60005 with negotiated timeout 5000 for client /140.211.11.196:27218
[junit4:junit4]   2> 18809 T69 oaz.ClientCnxn$SendThread.readConnectResult Session establishment complete on server localhost/127.0.0.1:15988, sessionid = 0x139ebd89bf60005, negotiated timeout = 5000
[junit4:junit4]   2> 18810 T70 oascc.ConnectionManager.process Watcher org.apache.solr.common.cloud.ConnectionManager@127cdc name:ZooKeeperConnection Watcher:127.0.0.1:15988/solr got event WatchedEvent state:SyncConnected type:None path:null path:null type:None
[junit4:junit4]   2> 18810 T11 oascc.ConnectionManager.waitForConnected Client is connected to ZooKeeper
[junit4:junit4]   2> 18812 T16 oazs.PrepRequestProcessor.pRequest Got user-level KeeperException when processing sessionid:0x139ebd89bf60005 type:create cxid:0x1 zxid:0xfffffffffffffffe txntype:unknown reqpath:n/a Error Path:/solr/overseer Error:KeeperErrorCode = NodeExists for /solr/overseer
[junit4:junit4]   2> 18813 T16 oazs.PrepRequestProcessor.pRequest Got user-level KeeperException when processing sessionid:0x139ebd89bf60005 type:create cxid:0x2 zxid:0xfffffffffffffffe txntype:unknown reqpath:n/a Error Path:/solr/overseer Error:KeeperErrorCode = NodeExists for /solr/overseer
[junit4:junit4]   2> 18830 T11 oasc.ZkController.createEphemeralLiveNode Register node as live in ZooKeeper:/live_nodes/127.0.0.1:58640_solr
[junit4:junit4]   2> 18831 T16 oazs.PrepRequestProcessor.pRequest Got user-level KeeperException when processing sessionid:0x139ebd89bf60005 type:delete cxid:0x4 zxid:0xfffffffffffffffe txntype:unknown reqpath:n/a Error Path:/solr/live_nodes/127.0.0.1:58640_solr Error:KeeperErrorCode = NoNode for /solr/live_nodes/127.0.0.1:58640_solr
[junit4:junit4]   2> 18832 T11 oascc.SolrZkClient.makePath makePath: /live_nodes/127.0.0.1:58640_solr
[junit4:junit4]   2> 18836 T58 oascc.ZkStateReader$3.process Updating live nodes
[junit4:junit4]   2> 18836 T46 oascc.ZkStateReader$3.process Updating live nodes
[junit4:junit4]   2> 18836 T32 oascc.ZkStateReader$3.process Updating live nodes
[junit4:junit4]   2> 18837 T11 oashc.HttpShardHandlerFactory.getParameter Setting socketTimeout to: 0
[junit4:junit4]   2> 18838 T11 oashc.HttpShardHandlerFactory.getParameter Setting urlScheme to: http://
[junit4:junit4]   2> 18839 T11 oashc.HttpShardHandlerFactory.getParameter Setting connTimeout to: 0
[junit4:junit4]   2> 18840 T11 oashc.HttpShardHandlerFactory.getParameter Setting maxConnectionsPerHost to: 20
[junit4:junit4]   2> 18840 T11 oashc.HttpShardHandlerFactory.getParameter Setting corePoolSize to: 0
[junit4:junit4]   2> 18841 T11 oashc.HttpShardHandlerFactory.getParameter Setting maximumPoolSize to: 2147483647
[junit4:junit4]   2> 18842 T11 oashc.HttpShardHandlerFactory.getParameter Setting maxThreadIdleTime to: 5
[junit4:junit4]   2> 18843 T11 oashc.HttpShardHandlerFactory.getParameter Setting sizeOfQueue to: -1
[junit4:junit4]   2> 18843 T11 oashc.HttpShardHandlerFactory.getParameter Setting fairnessPolicy to: false
[junit4:junit4]   2> 18844 T11 oascsi.HttpClientUtil.createClient Creating new http client, config:maxConnectionsPerHost=20&maxConnections=10000&socketTimeout=0&connTimeout=0&retry=false
[junit4:junit4]   2> 18866 T11 oascc.ZkStateReader.createClusterStateWatchersAndUpdate Updating cluster state from ZooKeeper... 
[junit4:junit4]   2> 18874 T11 oasc.CoreContainer.create Creating SolrCore 'collection1' using instanceDir: /usr/home/hudson/hudson-slave/workspace/Lucene-Solr-Tests-trunk-java7/solr/build/solr-core/test/J1/./org.apache.solr.cloud.BasicDistributedZk2Test-jetty3-1348281623027/collection1
[junit4:junit4]   2> 18875 T11 oasc.ZkController.createCollectionZkNode Check for collection zkNode:collection1
[junit4:junit4]   2> 18876 T11 oasc.ZkController.createCollectionZkNode Collection zkNode exists
[junit4:junit4]   2> 18877 T11 oasc.ZkController.readConfigName Load collection config from:/collections/collection1
[junit4:junit4]   2> 18879 T11 oasc.SolrResourceLoader.<init> new SolrResourceLoader for directory: '/usr/home/hudson/hudson-slave/workspace/Lucene-Solr-Tests-trunk-java7/solr/build/solr-core/test/J1/./org.apache.solr.cloud.BasicDistributedZk2Test-jetty3-1348281623027/collection1/'
[junit4:junit4]   2> 18881 T11 oasc.SolrResourceLoader.replaceClassLoader Adding 'file:/usr/home/hudson/hudson-slave/workspace/Lucene-Solr-Tests-trunk-java7/solr/build/solr-core/test/J1/org.apache.solr.cloud.BasicDistributedZk2Test-jetty3-1348281623027/collection1/lib/README' to classloader
[junit4:junit4]   2> 18883 T11 oasc.SolrResourceLoader.replaceClassLoader Adding 'file:/usr/home/hudson/hudson-slave/workspace/Lucene-Solr-Tests-trunk-java7/solr/build/solr-core/test/J1/org.apache.solr.cloud.BasicDistributedZk2Test-jetty3-1348281623027/collection1/lib/classes/' to classloader
[junit4:junit4]   2> 18968 T11 oasc.SolrConfig.<init> Using Lucene MatchVersion: LUCENE_50
[junit4:junit4]   2> 18985 T33 oascc.ZkStateReader.updateClusterState Updating cloud state from ZooKeeper... 
[junit4:junit4]   2> 19001 T70 oascc.ZkStateReader$2.process A cluster state change has occurred - updating...
[junit4:junit4]   2> 19001 T32 oascc.ZkStateReader$2.process A cluster state change has occurred - updating...
[junit4:junit4]   2> 19001 T58 oascc.ZkStateReader$2.process A cluster state change has occurred - updating...
[junit4:junit4]   2> 19001 T46 oascc.ZkStateReader$2.process A cluster state change has occurred - updating...
[junit4:junit4]   2> 19061 T11 oasc.SolrConfig.<init> Loaded SolrConfig: solrconfig.xml
[junit4:junit4]   2> 19162 T11 oass.IndexSchema.readSchema Reading Solr Schema
[junit4:junit4]   2> 19208 T11 oass.IndexSchema.readSchema Schema name=test
[junit4:junit4]   2> 19960 T11 oass.OpenExchangeRatesOrgProvider.init Initialized with rates=open-exchange-rates.json, refreshInterval=1440.
[junit4:junit4]   2> 19973 T11 oass.IndexSchema.readSchema default search field in schema is text
[junit4:junit4]   2> 19977 T11 oass.IndexSchema.readSchema unique key field: id
[junit4:junit4]   2> 20006 T11 oass.FileExchangeRateProvider.reload Reloading exchange rates from file currency.xml
[junit4:junit4]   2> 20012 T11 oass.FileExchangeRateProvider.reload Reloading exchange rates from file currency.xml
[junit4:junit4]   2> 20017 T11 oass.OpenExchangeRatesOrgProvider.reload Reloading exchange rates from open-exchange-rates.json
[junit4:junit4]   2> 20021 T11 oass.OpenExchangeRatesOrgProvider.reload Reloading exchange rates from open-exchange-rates.json
[junit4:junit4]   2> 20024 T11 oasc.SolrCore.<init> [collection1] Opening new SolrCore at /usr/home/hudson/hudson-slave/workspace/Lucene-Solr-Tests-trunk-java7/solr/build/solr-core/test/J1/./org.apache.solr.cloud.BasicDistributedZk2Test-jetty3-1348281623027/collection1/, dataDir=./org.apache.solr.cloud.BasicDistributedZk2Test-1348281604741/jetty3/
[junit4:junit4]   2> 20024 T11 oasc.JmxMonitoredMap.<init> JMX monitoring is enabled. Adding Solr mbeans to JMX Server: com.sun.jmx.mbeanserver.JmxMBeanServer@250a51
[junit4:junit4]   2> 20026 T11 oasc.SolrCore.getNewIndexDir WARNING New index directory detected: old=null new=./org.apache.solr.cloud.BasicDistributedZk2Test-1348281604741/jetty3/index/
[junit4:junit4]   2> 20027 T11 oasc.SolrCore.initIndex WARNING [collection1] Solr index directory './org.apache.solr.cloud.BasicDistributedZk2Test-1348281604741/jetty3/index' doesn't exist. Creating new index...
[junit4:junit4]   2> 20027 T11 oasc.CachingDirectoryFactory.get return new directory for /usr/home/hudson/hudson-slave/workspace/Lucene-Solr-Tests-trunk-java7/solr/build/solr-core/test/J1/./org.apache.solr.cloud.BasicDistributedZk2Test-1348281604741/jetty3/index forceNew:false
[junit4:junit4]   2> 20059 T11 oasc.SolrDeletionPolicy.onCommit SolrDeletionPolicy.onCommit: commits:num=1
[junit4:junit4]   2> 		commit{dir=NRTCachingDirectory(org.apache.lucene.store.NIOFSDirectory@/usr/home/hudson/hudson-slave/workspace/Lucene-Solr-Tests-trunk-java7/solr/build/solr-core/test/J1/org.apache.solr.cloud.BasicDistributedZk2Test-1348281604741/jetty3/index lockFactory=org.apache.lucene.store.NativeFSLockFactory@1c529aa0; maxCacheMB=48.0 maxMergeSizeMB=4.0),segFN=segments_1,generation=1,filenames=[segments_1]
[junit4:junit4]   2> 20060 T11 oasc.SolrDeletionPolicy.updateCommits newest commit = 1
[junit4:junit4]   2> 20061 T11 oasc.SolrCore.initWriters created xml: solr.XMLResponseWriter
[junit4:junit4]   2> 20064 T11 oasup.UpdateRequestProcessorChain.init inserting DistributedUpdateProcessorFactory into updateRequestProcessorChain "dedupe"
[junit4:junit4]   2> 20064 T11 oasup.UpdateRequestProcessorChain.init inserting DistributedUpdateProcessorFactory into updateRequestProcessorChain "dedupe-allfields"
[junit4:junit4]   2> 20065 T11 oasup.UpdateRequestProcessorChain.init inserting DistributedUpdateProcessorFactory into updateRequestProcessorChain "stored_sig"
[junit4:junit4]   2> 20066 T11 oasup.UpdateRequestProcessorChain.init inserting DistributedUpdateProcessorFactory into updateRequestProcessorChain "uniq-fields"
[junit4:junit4]   2> 20067 T11 oasup.UpdateRequestProcessorChain.init inserting DistributedUpdateProcessorFactory into updateRequestProcessorChain "distrib-dup-test-chain-implicit"
[junit4:junit4]   2> 20068 T11 oasc.RequestHandlers.initHandlersFromConfig adding lazy requestHandler: solr.ReplicationHandler
[junit4:junit4]   2> 20068 T11 oasc.RequestHandlers.initHandlersFromConfig created /replication: solr.ReplicationHandler
[junit4:junit4]   2> 20069 T11 oasc.RequestHandlers.initHandlersFromConfig created standard: solr.StandardRequestHandler
[junit4:junit4]   2> 20070 T11 oasc.RequestHandlers.initHandlersFromConfig created /get: solr.RealTimeGetHandler
[junit4:junit4]   2> 20071 T11 oasc.RequestHandlers.initHandlersFromConfig created dismax: solr.SearchHandler
[junit4:junit4]   2> 20072 T11 oasc.RequestHandlers.initHandlersFromConfig created mock: org.apache.solr.core.MockQuerySenderListenerReqHandler
[junit4:junit4]   2> 20073 T11 oasc.RequestHandlers.initHandlersFromConfig created /admin/: org.apache.solr.handler.admin.AdminHandlers
[junit4:junit4]   2> 20074 T11 oasc.RequestHandlers.initHandlersFromConfig created defaults: solr.StandardRequestHandler
[junit4:junit4]   2> 20075 T11 oasc.RequestHandlers.initHandlersFromConfig adding lazy requestHandler: solr.StandardRequestHandler
[junit4:junit4]   2> 20075 T11 oasc.RequestHandlers.initHandlersFromConfig created lazy: solr.StandardRequestHandler
[junit4:junit4]   2> 20076 T11 oasc.RequestHandlers.initHandlersFromConfig created /update: solr.UpdateRequestHandler
[junit4:junit4]   2> 20077 T11 oasc.RequestHandlers.initHandlersFromConfig created /terms: org.apache.solr.handler.component.SearchHandler
[junit4:junit4]   2> 20078 T11 oasc.RequestHandlers.initHandlersFromConfig created spellCheckCompRH: org.apache.solr.handler.component.SearchHandler
[junit4:junit4]   2> 20079 T11 oasc.RequestHandlers.initHandlersFromConfig created spellCheckCompRH_Direct: org.apache.solr.handler.component.SearchHandler
[junit4:junit4]   2> 20080 T11 oasc.RequestHandlers.initHandlersFromConfig created spellCheckWithWordbreak: org.apache.solr.handler.component.SearchHandler
[junit4:junit4]   2> 20081 T11 oasc.RequestHandlers.initHandlersFromConfig created spellCheckWithWordbreak_Direct: org.apache.solr.handler.component.SearchHandler
[junit4:junit4]   2> 20082 T11 oasc.RequestHandlers.initHandlersFromConfig created spellCheckCompRH1: org.apache.solr.handler.component.SearchHandler
[junit4:junit4]   2> 20083 T11 oasc.RequestHandlers.initHandlersFromConfig created tvrh: org.apache.solr.handler.component.SearchHandler
[junit4:junit4]   2> 20084 T11 oasc.RequestHandlers.initHandlersFromConfig created /mlt: solr.MoreLikeThisHandler
[junit4:junit4]   2> 20085 T11 oasc.RequestHandlers.initHandlersFromConfig created /debug/dump: solr.DumpRequestHandler
[junit4:junit4]   2> 20088 T11 oashl.XMLLoader.init xsltCacheLifetimeSeconds=60
[junit4:junit4]   2> 20092 T11 oasc.SolrCore.initDeprecatedSupport WARNING solrconfig.xml uses deprecated <admin/gettableFiles>, Please update your config to use the ShowFileRequestHandler.
[junit4:junit4]   2> 20094 T11 oasc.SolrCore.initDeprecatedSupport WARNING adding ShowFileRequestHandler with hidden files: [SCHEMA.XML, OLD_SYNONYMS.TXT, STOPWORDS.TXT, PROTWORDS.TXT, OPEN-EXCHANGE-RATES.JSON, SYNONYMS.TXT, CURRENCY.XML, MAPPING-ISOLATIN1ACCENT.TXT]
[junit4:junit4]   2> 20098 T11 oass.SolrIndexSearcher.<init> Opening Searcher@6646b074 main
[junit4:junit4]   2> 20100 T11 oasu.CommitTracker.<init> Hard AutoCommit: disabled
[junit4:junit4]   2> 20100 T11 oasu.CommitTracker.<init> Soft AutoCommit: disabled
[junit4:junit4]   2> 20101 T11 oashc.SpellCheckComponent.inform Initializing spell checkers
[junit4:junit4]   2> 20109 T11 oass.DirectSolrSpellChecker.init init: {name=direct,classname=DirectSolrSpellChecker,field=lowerfilt,minQueryLength=3}
[junit4:junit4]   2> 20164 T71 oasc.SolrCore.registerSearcher [collection1] Registered new searcher Searcher@6646b074 main{StandardDirectoryReader(segments_1:1)}
[junit4:junit4]   2> 20514 T33 oascc.ZkStateReader.updateClusterState Updating cloud state from ZooKeeper... 
[junit4:junit4]   2> 20531 T70 oascc.ZkStateReader$2.process A cluster state change has occurred - updating...
[junit4:junit4]   2> 20531 T32 oascc.ZkStateReader$2.process A cluster state change has occurred - updating...
[junit4:junit4]   2> 20531 T58 oascc.ZkStateReader$2.process A cluster state change has occurred - updating...
[junit4:junit4]   2> 20531 T46 oascc.ZkStateReader$2.process A cluster state change has occurred - updating...
[junit4:junit4]   2> 20679 T11 oasc.CoreContainer.register registering core: collection1
[junit4:junit4]   2> 20679 T11 oasc.ZkController.register Register shard - core:collection1 address:http://127.0.0.1:58640/solr shardId:shard1
[junit4:junit4]   2> 20684 T11 oasc.ZkController.register We are http://127.0.0.1:58640/solr/collection1/ and leader is http://127.0.0.1:36679/solr/collection1/
[junit4:junit4]   2> 20685 T11 oasc.ZkController.register No LogReplay needed for core=collection1 baseURL=http://127.0.0.1:58640/solr
[junit4:junit4]   2> 20685 T11 oasc.ZkController.checkRecovery Core needs to recover:collection1
[junit4:junit4]   2> 20686 T11 oasu.DefaultSolrCoreState.doRecovery Running recovery - first canceling any ongoing recovery
[junit4:junit4]   2> 20691 T11 oascc.ZkStateReader.updateClusterState Updating cloud state from ZooKeeper... 
[junit4:junit4]   2> 20693 T11 oass.SolrDispatchFilter.init user.dir=/usr/home/hudson/hudson-slave/workspace/Lucene-Solr-Tests-trunk-java7/solr/build/solr-core/test/J1
[junit4:junit4]   2> 20693 T11 oass.SolrDispatchFilter.init SolrDispatchFilter.init() done
[junit4:junit4]   2> 20694 T11 oascsi.HttpClientUtil.createClient Creating new http client, config:maxConnections=128&maxConnectionsPerHost=32&followRedirects=false
[junit4:junit4]   2> ASYNC  NEW_CORE C0 name=collection1 org.apache.solr.core.SolrCore@3f3b33fc url=http://127.0.0.1:58640/solr/collection1 node=127.0.0.1:58640_solr
[junit4:junit4]   2> 20696 T72 C0 P58640 oasc.RecoveryStrategy.run Starting recovery process.  core=collection1 recoveringAfterStartup=true
[junit4:junit4]   2> 20699 T72 C0 P58640 oasc.RecoveryStrategy.doRecovery ###### startupVersions=[]
[junit4:junit4]   2> 20701 T72 C0 P58640 oasc.RecoveryStrategy.doRecovery Attempting to PeerSync from http://127.0.0.1:36679/solr/collection1/ core=collection1 - recoveringAfterStartup=true
[junit4:junit4]   2> 20709 T72 C0 P58640 oascsi.HttpClientUtil.createClient Creating new http client, config:maxConnectionsPerHost=20&maxConnections=10000&connTimeout=30000&socketTimeout=30000&retry=false
[junit4:junit4]   2> 20726 T72 C0 P58640 oasu.PeerSync.sync PeerSync: core=collection1 url=http://127.0.0.1:58640/solr START replicas=[http://127.0.0.1:36679/solr/collection1/] nUpdates=100
[junit4:junit4]   2> 20741 T72 C0 P58640 oasu.PeerSync.sync WARNING no frame of reference to tell of we've missed updates
[junit4:junit4]   2> 20741 T72 C0 P58640 oasc.RecoveryStrategy.doRecovery PeerSync Recovery was not successful - trying replication. core=collection1
[junit4:junit4]   2> 20742 T72 C0 P58640 oasc.RecoveryStrategy.doRecovery Starting Replication Recovery. core=collection1
[junit4:junit4]   2> 20742 T72 C0 P58640 oascsi.HttpClientUtil.createClient Creating new http client, config:maxConnections=128&maxConnectionsPerHost=32&followRedirects=false
[junit4:junit4]   2> 20845 T11 oejs.Server.doStart jetty-8.1.2.v20120308
[junit4:junit4]   2> 20848 T11 oejs.AbstractConnector.doStart Started SocketConnector@0.0.0.0:62376
[junit4:junit4]   2> 20849 T11 oasc.SolrResourceLoader.locateSolrHome JNDI not configured for solr (NoInitialContextEx)
[junit4:junit4]   2> 20849 T11 oasc.SolrResourceLoader.locateSolrHome using system property solr.solr.home: /usr/home/hudson/hudson-slave/workspace/Lucene-Solr-Tests-trunk-java7/solr/build/solr-core/test/J1/./org.apache.solr.cloud.BasicDistributedZk2Test-jetty4-1348281625219
[junit4:junit4]   2> 20850 T11 oasc.SolrResourceLoader.<init> new SolrResourceLoader for deduced Solr Home: '/usr/home/hudson/hudson-slave/workspace/Lucene-Solr-Tests-trunk-java7/solr/build/solr-core/test/J1/./org.apache.solr.cloud.BasicDistributedZk2Test-jetty4-1348281625219/'
[junit4:junit4]   2> 20884 T11 oass.SolrDispatchFilter.init SolrDispatchFilter.init()
[junit4:junit4]   2> 20885 T11 oasc.SolrResourceLoader.locateSolrHome JNDI not configured for solr (NoInitialContextEx)
[junit4:junit4]   2> 20885 T11 oasc.SolrResourceLoader.locateSolrHome using system property solr.solr.home: /usr/home/hudson/hudson-slave/workspace/Lucene-Solr-Tests-trunk-java7/solr/build/solr-core/test/J1/./org.apache.solr.cloud.BasicDistributedZk2Test-jetty4-1348281625219
[junit4:junit4]   2> 20886 T11 oasc.CoreContainer$Initializer.initialize looking for solr.xml: /usr/home/hudson/hudson-slave/workspace/Lucene-Solr-Tests-trunk-java7/solr/build/solr-core/test/J1/./org.apache.solr.cloud.BasicDistributedZk2Test-jetty4-1348281625219/solr.xml
[junit4:junit4]   2> 20886 T11 oasc.CoreContainer.<init> New CoreContainer 359728887
[junit4:junit4]   2> 20887 T11 oasc.CoreContainer.load Loading CoreContainer using Solr Home: '/usr/home/hudson/hudson-slave/workspace/Lucene-Solr-Tests-trunk-java7/solr/build/solr-core/test/J1/./org.apache.solr.cloud.BasicDistributedZk2Test-jetty4-1348281625219/'
[junit4:junit4]   2> 20887 T11 oasc.SolrResourceLoader.<init> new SolrResourceLoader for directory: '/usr/home/hudson/hudson-slave/workspace/Lucene-Solr-Tests-trunk-java7/solr/build/solr-core/test/J1/./org.apache.solr.cloud.BasicDistributedZk2Test-jetty4-1348281625219/'
[junit4:junit4]   2> 20914 T11 oasc.CoreContainer.load Registering Log Listener
[junit4:junit4]   2> 20928 T11 oasc.CoreContainer.initZooKeeper Zookeeper client=127.0.0.1:15988/solr
[junit4:junit4]   2> 20929 T11 oaz.ZooKeeper.<init> Initiating client connection, connectString=127.0.0.1:15988/solr sessionTimeout=5000 watcher=org.apache.solr.common.cloud.ConnectionManager@540cc285
[junit4:junit4]   2> 20930 T83 oaz.ClientCnxn$SendThread.startConnect Opening socket connection to server /127.0.0.1:15988
[junit4:junit4]   2> 20930 T11 oascc.ConnectionManager.waitForConnected Waiting for client to connect to ZooKeeper
[junit4:junit4]   2> 20932 T83 oaz.ClientCnxn$SendThread.primeConnection Socket connection established to localhost/127.0.0.1:15988, initiating session
[junit4:junit4]   2> 20932 T13 oazs.NIOServerCnxn$Factory.run Accepted socket connection from /140.211.11.196:25088
[junit4:junit4]   2> 20933 T13 oazs.NIOServerCnxn.readConnectRequest Client attempting to establish new session at /140.211.11.196:25088
[junit4:junit4]   2> 20936 T15 oazs.NIOServerCnxn.finishSessionInit Established session 0x139ebd89bf60006 with negotiated timeout 5000 for client /140.211.11.196:25088
[junit4:junit4]   2> 20936 T83 oaz.ClientCnxn$SendThread.readConnectResult Session establishment complete on server localhost/127.0.0.1:15988, sessionid = 0x139ebd89bf60006, negotiated timeout = 5000
[junit4:junit4]   2> 20937 T84 oascc.ConnectionManager.process Watcher org.apache.solr.common.cloud.ConnectionManager@540cc285 name:ZooKeeperConnection Watcher:127.0.0.1:15988/solr got event WatchedEvent state:SyncConnected type:None path:null path:null type:None
[junit4:junit4]   2> 20937 T11 oascc.ConnectionManager.waitForConnected Client is connected to ZooKeeper
[junit4:junit4]   2> 20938 T16 oazs.PrepRequestProcessor.pRequest Got user-level KeeperException when processing sessionid:0x139ebd89bf60006 type:create cxid:0x1 zxid:0xfffffffffffffffe txntype:unknown reqpath:n/a Error Path:/solr/overseer Error:KeeperErrorCode = NodeExists for /solr/overseer
[junit4:junit4]   2> 20940 T16 oazs.PrepRequestProcessor.pRequest Got user-level KeeperException when processing sessionid:0x139ebd89bf60006 type:create cxid:0x2 zxid:0xfffffffffffffffe txntype:unknown reqpath:n/a Error Path:/solr/overseer Error:KeeperErrorCode = NodeExists for /solr/overseer
[junit4:junit4]   2> 20959 T11 oasc.ZkController.createEphemeralLiveNode Register node as live in ZooKeeper:/live_nodes/127.0.0.1:62376_solr
[junit4:junit4]   2> 20960 T16 oazs.PrepRequestProcessor.pRequest Got user-level KeeperException when processing sessionid:0x139ebd89bf60006 type:delete cxid:0x4 zxid:0xfffffffffffffffe txntype:unknown reqpath:n/a Error Path:/solr/live_nodes/127.0.0.1:62376_solr Error:KeeperErrorCode = NoNode for /solr/live_nodes/127.0.0.1:62376_solr
[junit4:junit4]   2> 20961 T11 oascc.SolrZkClient.makePath makePath: /live_nodes/127.0.0.1:62376_solr
[junit4:junit4]   2> 20969 T70 oascc.ZkStateReader$3.process Updating live nodes
[junit4:junit4]   2> 20969 T46 oascc.ZkStateReader$3.process Updating live nodes
[junit4:junit4]   2> 20969 T58 oascc.ZkStateReader$3.process Updating live nodes
[junit4:junit4]   2> 20969 T32 oascc.ZkStateReader$3.process Updating live nodes
[junit4:junit4]   2> 20970 T11 oashc.HttpShardHandlerFactory.getParameter Setting socketTimeout to: 0
[junit4:junit4]   2> 20971 T11 oashc.HttpShardHandlerFactory.getParameter Setting urlScheme to: http://
[junit4:junit4]   2> 20971 T11 oashc.HttpShardHandlerFactory.getParameter Setting connTimeout to: 0
[junit4:junit4]   2> 20971 T11 oashc.HttpShardHandlerFactory.getParameter Setting maxConnectionsPerHost to: 20
[junit4:junit4]   2> 20972 T11 oashc.HttpShardHandlerFactory.getParameter Setting corePoolSize to: 0
[junit4:junit4]   2> 20972 T11 oashc.HttpShardHandlerFactory.getParameter Setting maximumPoolSize to: 2147483647
[junit4:junit4]   2> 20973 T11 oashc.HttpShardHandlerFactory.getParameter Setting maxThreadIdleTime to: 5
[junit4:junit4]   2> 20973 T11 oashc.HttpShardHandlerFactory.getParameter Setting sizeOfQueue to: -1
[junit4:junit4]   2> 20974 T11 oashc.HttpShardHandlerFactory.getParameter Setting fairnessPolicy to: false
[junit4:junit4]   2> 20974 T11 oascsi.HttpClientUtil.createClient Creating new http client, config:maxConnectionsPerHost=20&maxConnections=10000&socketTimeout=0&connTimeout=0&retry=false
[junit4:junit4]   2> 21017 T11 oascc.ZkStateReader.createClusterStateWatchersAndUpdate Updating cluster state from ZooKeeper... 
[junit4:junit4]   2> 21037 T33 oascc.ZkStateReader.updateClusterState Updating cloud state from ZooKeeper... 
[junit4:junit4]   2> 21038 T11 oasc.CoreContainer.create Creating SolrCore 'collection1' using instanceDir: /usr/home/hudson/hudson-slave/workspace/Lucene-Solr-Tests-trunk-java7/solr/build/solr-core/test/J1/./org.apache.solr.cloud.BasicDistributedZk2Test-jetty4-1348281625219/collection1
[junit4:junit4]   2> 21039 T11 oasc.ZkController.createCollectionZkNode Check for collection zkNode:collection1
[junit4:junit4]   2> 21041 T11 oasc.ZkController.createCollectionZkNode Collection zkNode exists
[junit4:junit4]   2> 21041 T11 oasc.ZkController.readConfigName Load collection config from:/collections/collection1
[junit4:junit4]   2> 21044 T11 oasc.SolrResourceLoader.<init> new SolrResourceLoader for directory: '/usr/home/hudson/hudson-slave/workspace/Lucene-Solr-Tests-trunk-java7/solr/build/solr-core/test/J1/./org.apache.solr.cloud.BasicDistributedZk2Test-jetty4-1348281625219/collection1/'
[junit4:junit4]   2> 21045 T11 oasc.SolrResourceLoader.replaceClassLoader Adding 'file:/usr/home/hudson/hudson-slave/workspace/Lucene-Solr-Tests-trunk-java7/solr/build/solr-core/test/J1/org.apache.solr.cloud.BasicDistributedZk2Test-jetty4-1348281625219/collection1/lib/classes/' to classloader
[junit4:junit4]   2> 21046 T11 oasc.SolrResourceLoader.replaceClassLoader Adding 'file:/usr/home/hudson/hudson-slave/workspace/Lucene-Solr-Tests-trunk-java7/solr/build/solr-core/test/J1/org.apache.solr.cloud.BasicDistributedZk2Test-jetty4-1348281625219/collection1/lib/README' to classloader
[junit4:junit4]   2> 21053 T84 oascc.ZkStateReader$2.process A cluster state change has occurred - updating...
[junit4:junit4]   2> 21053 T70 oascc.ZkStateReader$2.process A cluster state change has occurred - updating...
[junit4:junit4]   2> 21053 T32 oascc.ZkStateReader$2.process A cluster state change has occurred - updating...
[junit4:junit4]   2> 21053 T58 oascc.ZkStateReader$2.process A cluster state change has occurred - updating...
[junit4:junit4]   2> 21053 T46 oascc.ZkStateReader$2.process A cluster state change has occurred - updating...
[junit4:junit4]   2> 21128 T11 oasc.SolrConfig.<init> Using Lucene MatchVersion: LUCENE_50
[junit4:junit4]   2> 21191 T11 oasc.SolrConfig.<init> Loaded SolrConfig: solrconfig.xml
[junit4:junit4]   2> 21293 T11 oass.IndexSchema.readSchema Reading Solr Schema
[junit4:junit4]   2> 21333 T11 oass.IndexSchema.readSchema Schema name=test
[junit4:junit4]   2> ASYNC  NEW_CORE C1 name=collection1 org.apache.solr.core.SolrCore@418a4019 url=http://127.0.0.1:36679/solr/collection1 node=127.0.0.1:36679_solr
[junit4:junit4]   2> 21691 T38 C1 P36679 REQ /get {distrib=false&qt=/get&wt=javabin&version=2&getVersions=100} status=0 QTime=43 
[junit4:junit4]   2> 21955 T11 oass.OpenExchangeRatesOrgProvider.init Initialized with rates=open-exchange-rates.json, refreshInterval=1440.
[junit4:junit4]   2> 21969 T11 oass.IndexSchema.readSchema default search field in schema is text
[junit4:junit4]   2> 21972 T11 oass.IndexSchema.readSchema unique key field: id
[junit4:junit4]   2> 21997 T11 oass.FileExchangeRateProvider.reload Reloading exchange rates from file currency.xml
[junit4:junit4]   2> 22012 T11 oass.FileExchangeRateProvider.reload Reloading exchange rates from file currency.xml
[junit4:junit4]   2> 22018 T11 oass.OpenExchangeRatesOrgProvider.reload Reloading exchange rates from open-exchange-rates.json
[junit4:junit4]   2> 22021 T11 oass.OpenExchangeRatesOrgProvider.reload Reloading exchange rates from open-exchange-rates.json
[junit4:junit4]   2> 22023 T11 oasc.SolrCore.<init> [collection1] Opening new SolrCore at /usr/home/hudson/hudson-slave/workspace/Lucene-Solr-Tests-trunk-java7/solr/build/solr-core/test/J1/./org.apache.solr.cloud.BasicDistributedZk2Test-jetty4-1348281625219/collection1/, dataDir=./org.apache.solr.cloud.BasicDistributedZk2Test-1348281604741/jetty4/
[junit4:junit4]   2> 22023 T11 oasc.JmxMonitoredMap.<init> JMX monitoring is enabled. Adding Solr mbeans to JMX Server: com.sun.jmx.mbeanserver.JmxMBeanServer@250a51
[junit4:junit4]   2> 22025 T11 oasc.SolrCore.getNewIndexDir WARNING New index directory detected: old=null new=./org.apache.solr.cloud.BasicDistributedZk2Test-1348281604741/jetty4/index/
[junit4:junit4]   2> 22026 T11 oasc.SolrCore.initIndex WARNING [collection1] Solr index directory './org.apache.solr.cloud.BasicDistributedZk2Test-1348281604741/jetty4/index' doesn't exist. Creating new index...
[junit4:junit4]   2> 22026 T11 oasc.CachingDirectoryFactory.get return new directory for /usr/home/hudson/hudson-slave/workspace/Lucene-Solr-Tests-trunk-java7/solr/build/solr-core/test/J1/./org.apache.solr.cloud.BasicDistributedZk2Test-1348281604741/jetty4/index forceNew:false
[junit4:junit4]   2> 22058 T11 oasc.SolrDeletionPolicy.onCommit SolrDeletionPolicy.onCommit: commits:num=1
[junit4:junit4]   2> 		commit{dir=NRTCachingDirectory(org.apache.lucene.store.NIOFSDirectory@/usr/home/hudson/hudson-slave/workspace/Lucene-Solr-Tests-trunk-java7/solr/build/solr-core/test/J1/org.apache.solr.cloud.BasicDistributedZk2Test-1348281604741/jetty4/index lockFactory=org.apache.lucene.store.NativeFSLockFactory@2a9f4041; maxCacheMB=48.0 maxMergeSizeMB=4.0),segFN=segments_1,generation=1,filenames=[segments_1]
[junit4:junit4]   2> 22059 T11 oasc.SolrDeletionPolicy.updateCommits newest commit = 1
[junit4:junit4]   2> 22060 T11 oasc.SolrCore.initWriters created xml: solr.XMLResponseWriter
[junit4:junit4]   2> 22063 T11 oasup.UpdateRequestProcessorChain.init inserting DistributedUpdateProcessorFactory into updateRequestProcessorChain "dedupe"
[junit4:junit4]   2> 22064 T11 oasup.UpdateRequestProcessorChain.init inserting DistributedUpdateProcessorFactory into updateRequestProcessorChain "dedupe-allfields"
[junit4:junit4]   2> 22064 T11 oasup.UpdateRequestProcessorChain.init inserting DistributedUpdateProcessorFactory into updateRequestProcessorChain "stored_sig"
[junit4:junit4]   2> 22065 T11 oasup.UpdateRequestProcessorChain.init inserting DistributedUpdateProcessorFactory into updateRequestProcessorChain "uniq-fields"
[junit4:junit4]   2> 22066 T11 oasup.UpdateRequestProcessorChain.init inserting DistributedUpdateProcessorFactory into updateRequestProcessorChain "distrib-dup-test-chain-implicit"
[junit4:junit4]   2> 22066 T11 oasc.RequestHandlers.initHandlersFromConfig adding lazy requestHandler: solr.ReplicationHandler
[junit4:junit4]   2> 22067 T11 oasc.RequestHandlers.initHandlersFromConfig created /replication: solr.ReplicationHandler
[junit4:junit4]   2> 22068 T11 oasc.RequestHandlers.initHandlersFromConfig created standard: solr.StandardRequestHandler
[junit4:junit4]   2> 22069 T11 oasc.RequestHandlers.initHandlersFromConfig created /get: solr.RealTimeGetHandler
[junit4:junit4]   2> 22070 T11 oasc.RequestHandlers.initHandlersFromConfig created dismax: solr.SearchHandler
[junit4:junit4]   2> 22071 T11 oasc.RequestHandlers.initHandlersFromConfig created mock: org.apache.solr.core.MockQuerySenderListenerReqHandler
[junit4:junit4]   2> 22072 T11 oasc.RequestHandlers.initHandlersFromConfig created /admin/: org.apache.solr.handler.admin.AdminHandlers
[junit4:junit4]   2> 22073 T11 oasc.RequestHandlers.initHandlersFromConfig created defaults: solr.StandardRequestHandler
[junit4:junit4]   2> 22073 T11 oasc.RequestHandlers.initHandlersFromConfig adding lazy requestHandler: solr.StandardRequestHandler
[junit4:junit4]   2> 22074 T11 oasc.RequestHandlers.initHandlersFromConfig created lazy: solr.StandardRequestHandler
[junit4:junit4]   2> 22075 T11 oasc.RequestHandlers.initHandlersFromConfig created /update: solr.UpdateRequestHandler
[junit4:junit4]   2> 22076 T11 oasc.RequestHandlers.initHandlersFromConfig created /terms: org.apache.solr.handler.component.SearchHandler
[junit4:junit4]   2> 22077 T11 oasc.RequestHandlers.initHandlersFromConfig created spellCheckCompRH: org.apache.solr.handler.component.SearchHandler
[junit4:junit4]   2> 22078 T11 oasc.RequestHandlers.initHandlersFromConfig created spellCheckCompRH_Direct: org.apache.solr.handler.component.SearchHandler
[junit4:junit4]   2> 22078 T11 oasc.RequestHandlers.initHandlersFromConfig created spellCheckWithWordbreak: org.apache.solr.handler.component.SearchHandler
[junit4:junit4]   2> 22079 T11 oasc.RequestHandlers.initHandlersFromConfig created spellCheckWithWordbreak_Direct: org.apache.solr.handler.component.SearchHandler
[junit4:junit4]   2> 22080 T11 oasc.RequestHandlers.initHandlersFromConfig created spellCheckCompRH1: org.apache.solr.handler.component.SearchHandler
[junit4:junit4]   2> 22081 T11 oasc.RequestHandlers.initHandlersFromConfig created tvrh: org.apache.solr.handler.component.SearchHandler
[junit4:junit4]   2> 22082 T11 oasc.RequestHandlers.initHandlersFromConfig created /mlt: solr.MoreLikeThisHandler
[junit4:junit4]   2> 22083 T11 oasc.RequestHandlers.initHandlersFromConfig created /debug/dump: solr.DumpRequestHandler
[junit4:junit4]   2> 22086 T11 oashl.XMLLoader.init xsltCacheLifetimeSeconds=60
[junit4:junit4]   2> 22090 T11 oasc.SolrCore.initDeprecatedSupport WARNING solrconfig.xml uses deprecated <admin/gettableFiles>, Please update your config to use the ShowFileRequestHandler.
[junit4:junit4]   2> 22091 T11 oasc.SolrCore.initDeprecatedSupport WARNING adding ShowFileRequestHandler with hidden files: [SCHEMA.XML, OLD_SYNONYMS.TXT, STOPWORDS.TXT, PROTWORDS.TXT, OPEN-EXCHANGE-RATES.JSON, SYNONYMS.TXT, CURRENCY.XML, MAPPING-ISOLATIN1ACCENT.TXT]
[junit4:junit4]   2> 22095 T11 oass.SolrIndexSearcher.<init> Opening Searcher@7469d7f4 main
[junit4:junit4]   2> 22096 T11 oasu.CommitTracker.<init> Hard AutoCommit: disabled
[junit4:junit4]   2> 22097 T11 oasu.CommitTracker.<init> Soft AutoCommit: disabled
[junit4:junit4]   2> 22098 T11 oashc.SpellCheckComponent.inform Initializing spell checkers
[junit4:junit4]   2> 22105 T11 oass.DirectSolrSpellChecker.init init: {name=direct,classname=DirectSolrSpellChecker,field=lowerfilt,minQueryLength=3}
[junit4:junit4]   2> 22159 T85 oasc.SolrCore.registerSearcher [collection1] Registered new searcher Searcher@7469d7f4 main{StandardDirectoryReader(segments_1:1)}
[junit4:junit4]   2> 22563 T33 oascc.ZkStateReader.updateClusterState Updating cloud state from ZooKeeper... 
[junit4:junit4]   2> 22579 T32 oascc.ZkStateReader$2.process A cluster state change has occurred - updating...
[junit4:junit4]   2> 22579 T84 oascc.ZkStateReader$2.process A cluster state change has occurred - updating...
[junit4:junit4]   2> 22579 T46 oascc.ZkStateReader$2.process A cluster state change has occurred - updating...
[junit4:junit4]   2> 22579 T58 oascc.ZkStateReader$2.process A cluster state change has occurred - updating...
[junit4:junit4]   2> 22579 T70 oascc.ZkStateReader$2.process A cluster state change has occurred - updating...
[junit4:junit4]   2> 22670 T11 oasc.CoreContainer.register registering core: collection1
[junit4:junit4]   2> 22670 T11 oasc.ZkController.register Register shard - core:collection1 address:http://127.0.0.1:62376/solr shardId:shard2
[junit4:junit4]   2> 22674 T11 oasc.ZkController.register We are http://127.0.0.1:62376/solr/collection1/ and leader is http://127.0.0.1:31843/solr/collection1/
[junit4:junit4]   2> 22675 T11 oasc.ZkController.register No LogReplay needed for core=collection1 baseURL=http://127.0.0.1:62376/solr
[junit4:junit4]   2> 22675 T11 oasc.ZkController.checkRecovery Core needs to recover:collection1
[junit4:junit4]   2> 22676 T11 oasu.DefaultSolrCoreState.doRecovery Running recovery - first canceling any ongoing recovery
[junit4:junit4]   2> ASYNC  NEW_CORE C2 name=collection1 org.apache.solr.core.SolrCore@36b4eea5 url=http://127.0.0.1:62376/solr/collection1 node=127.0.0.1:62376_solr
[junit4:junit4]   2> 22677 T86 C2 P62376 oasc.RecoveryStrategy.run Starting recovery process.  core=collection1 recoveringAfterStartup=true
[junit4:junit4]   2> 22677 T86 C2 P62376 oasc.RecoveryStrategy.doRecovery ###### startupVersions=[]
[junit4:junit4]   2> 22677 T11 oascc.ZkStateReader.updateClusterState Updating cloud state from ZooKeeper... 
[junit4:junit4]   2> 22679 T86 C2 P62376 oasc.RecoveryStrategy.doRecovery Attempting to PeerSync from http://127.0.0.1:31843/solr/collection1/ core=collection1 - recoveringAfterStartup=true
[junit4:junit4]   2> 22679 T11 oass.SolrDispatchFilter.init user.dir=/usr/home/hudson/hudson-slave/workspace/Lucene-Solr-Tests-trunk-java7/solr/build/solr-core/test/J1
[junit4:junit4]   2> 22679 T86 C2 P62376 oasu.PeerSync.sync PeerSync: core=collection1 url=http://127.0.0.1:62376/solr START replicas=[http://127.0.0.1:31843/solr/collection1/] nUpdates=100
[junit4:junit4]   2> 22679 T11 oass.SolrDispatchFilter.init SolrDispatchFilter.init() done
[junit4:junit4]   2> 22680 T86 C2 P62376 oasu.PeerSync.sync WARNING no frame of reference to tell of we've missed updates
[junit4:junit4]   2> 22680 T11 oascsi.HttpClientUtil.createClient Creating new http client, config:maxConnections=128&maxConnectionsPerHost=32&followRedirects=false
[junit4:junit4]   2> 22680 T86 C2 P62376 oasc.RecoveryStrategy.doRecovery PeerSync Recovery was not successful - trying replication. core=collection1
[junit4:junit4]   2> 22681 T86 C2 P62376 oasc.RecoveryStrategy.doRecovery Starting Replication Recovery. core=collection1
[junit4:junit4]   2> 22682 T86 C2 P62376 oascsi.HttpClientUtil.createClient Creating new http client, config:maxConnections=128&maxConnectionsPerHost=32&followRedirects=false
[junit4:junit4]   2> ASYNC  NEW_CORE C3 name=collection1 org.apache.solr.core.SolrCore@d391410 url=http://127.0.0.1:31843/solr/collection1 node=127.0.0.1:31843_solr
[junit4:junit4]   2> 22693 T50 C3 P31843 REQ /get {distrib=false&qt=/get&wt=javabin&version=2&getVersions=100} status=0 QTime=0 
[junit4:junit4]   2> 22698 T11 oaz.ZooKeeper.<init> Initiating client connection, connectString=127.0.0.1:15988/solr sessionTimeout=10000 watcher=org.apache.solr.common.cloud.ConnectionManager@720a366b
[junit4:junit4]   2> 22699 T88 oaz.ClientCnxn$SendThread.startConnect Opening socket connection to server /127.0.0.1:15988
[junit4:junit4]   2> 22699 T11 oascc.ConnectionManager.waitForConnected Waiting for client to connect to ZooKeeper
[junit4:junit4]   2> 22700 T88 oaz.ClientCnxn$SendThread.primeConnection Socket connection established to localhost/127.0.0.1:15988, initiating session
[junit4:junit4]   2> 22700 T13 oazs.NIOServerCnxn$Factory.run Accepted socket connection from /140.211.11.196:14753
[junit4:junit4]   2> 22701 T13 oazs.NIOServerCnxn.readConnectRequest Client attempting to establish new session at /140.211.11.196:14753
[junit4:junit4]   2> 22703 T15 oazs.NIOServerCnxn.finishSessionInit Established session 0x139ebd89bf60007 with negotiated timeout 10000 for client /140.211.11.196:14753
[junit4:junit4]   2> 22703 T88 oaz.ClientCnxn$SendThread.readConnectResult Session establishment complete on server localhost/127.0.0.1:15988, sessionid = 0x139ebd89bf60007, negotiated timeout = 10000
[junit4:junit4]   2> 22703 T89 oascc.ConnectionManager.process Watcher org.apache.solr.common.cloud.ConnectionManager@720a366b name:ZooKeeperConnection Watcher:127.0.0.1:15988/solr got event WatchedEvent state:SyncConnected type:None path:null path:null type:None
[junit4:junit4]   2> 22703 T11 oascc.ConnectionManager.waitForConnected Client is connected to ZooKeeper
[junit4:junit4]   2> 22705 T11 oascc.ZkStateReader.createClusterStateWatchersAndUpdate Updating cluster state from ZooKeeper... 
[junit4:junit4]   2> 22709 T11 oasc.ChaosMonkey.monkeyLog monkey: init - expire sessions:true cause connection loss:true
[junit4:junit4]   2> 22709 T11 oascsi.HttpClientUtil.createClient Creating new http client, config:
[junit4:junit4]   2> 22719 T11 oascc.ZkStateReader.updateClusterState Updating cloud state from ZooKeeper... 
[junit4:junit4]   2> ASYNC  NEW_CORE C4 name=collection1 org.apache.solr.core.SolrCore@2470d6c5 url=http://127.0.0.1:11348/solr/collection1 node=127.0.0.1:11348_solr
[junit4:junit4]   2> 22797 T24 C4 P11348 oascsi.HttpClientUtil.createClient Creating new http client, config:maxConnections=500&maxConnectionsPerHost=16
[junit4:junit4]   2> 23073 T24 C4 P11348 oasc.SolrDeletionPolicy.onInit SolrDeletionPolicy.onInit: commits:num=1
[junit4:junit4]   2> 		commit{dir=NRTCachingDirectory(org.apache.lucene.store.NIOFSDirectory@/usr/home/hudson/hudson-slave/workspace/Lucene-Solr-Tests-trunk-java7/solr/build/solr-core/test/J1/org.apache.solr.cloud.BasicDistributedZk2Test-1348281604741/control/data/index lockFactory=org.apache.lucene.store.NativeFSLockFactory@68240bb; maxCacheMB=48.0 maxMergeSizeMB=4.0),segFN=segments_1,generation=1,filenames=[segments_1]
[junit4:junit4]   2> 23074 T24 C4 P11348 oasc.SolrDeletionPolicy.updateCommits newest commit = 1
[junit4:junit4]   2> 23086 T33 oascc.ZkStateReader.updateClusterState Updating cloud state from ZooKeeper... 
[junit4:junit4]   2> 23100 T32 oascc.ZkStateReader$2.process A cluster state change has occurred - updating...
[junit4:junit4]   2> 23100 T46 oascc.ZkStateReader$2.process A cluster state change has occurred - updating...
[junit4:junit4]   2> 23100 T70 oascc.ZkStateReader$2.process A cluster state change has occurred - updating...
[junit4:junit4]   2> 23100 T58 oascc.ZkStateReader$2.process A cluster state change has occurred - updating...
[junit4:junit4]   2> 23100 T84 oascc.ZkStateReader$2.process A cluster state change has occurred - updating...
[junit4:junit4]   2> 23100 T89 oascc.ZkStateReader$2.process A cluster state change has occurred - updating...
[junit4:junit4]   2> 23350 T24 C4 P11348 /update {wt=javabin&version=2} {add=[1 (1413775755919228928)]} 0 566
[junit4:junit4]   2> 23352 T11 oaz.ZooKeeper.<init> Initiating client connection, connectString=127.0.0.1:15988/solr sessionTimeout=10000 watcher=org.apache.solr.common.cloud.ConnectionManager@36baffbc
[junit4:junit4]   2> 23353 T11 oascc.ConnectionManager.waitForConnected Waiting for client to connect to ZooKeeper
[junit4:junit4]   2> 23353 T90 oaz.ClientCnxn$SendThread.startConnect Opening socket connection to server /127.0.0.1:15988
[junit4:junit4]   2> 23355 T90 oaz.ClientCnxn$SendThread.primeConnection Socket connection established to localhost/127.0.0.1:15988, initiating session
[junit4:junit4]   2> 23355 T13 oazs.NIOServerCnxn$Factory.run Accepted socket connection from /140.211.11.196:15736
[junit4:junit4]   2> 23356 T13 oazs.NIOServerCnxn.readConnectRequest Client attempting to establish new session at /140.211.11.196:15736
[junit4:junit4]   2> 23357 T15 oazs.NIOServerCnxn.finishSessionInit Established session 0x139ebd89bf60008 with negotiated timeout 10000 for client /140.211.11.196:15736
[junit4:junit4]   2> 23357 T90 oaz.ClientCnxn$SendThread.readConnectResult Session establishment complete on server localhost/127.0.0.1:15988, sessionid = 0x139ebd89bf60008, negotiated timeout = 10000
[junit4:junit4]   2> 23358 T91 oascc.ConnectionManager.process Watcher org.apache.solr.common.cloud.ConnectionManager@36baffbc name:ZooKeeperConnection Watcher:127.0.0.1:15988/solr got event WatchedEvent state:SyncConnected type:None path:null path:null type:None
[junit4:junit4]   2> 23359 T11 oascc.ConnectionManager.waitForConnected Client is connected to ZooKeeper
[junit4:junit4]   2> 23360 T11 oascc.ZkStateReader.createClusterStateWatchersAndUpdate Updating cluster state from ZooKeeper... 
[junit4:junit4]   2> 23386 T40 C1 P36679 oasc.SolrDeletionPolicy.onInit SolrDeletionPolicy.onInit: commits:num=1
[junit4:junit4]   2> 		commit{dir=NRTCachingDirectory(org.apache.lucene.store.NIOFSDirectory@/usr/home/hudson/hudson-slave/workspace/Lucene-Solr-Tests-trunk-java7/solr/build/solr-core/test/J1/org.apache.solr.cloud.BasicDistributedZk2Test-1348281604741/jetty1/index lockFactory=org.apache.lucene.store.NativeFSLockFactory@556c08de; maxCacheMB=48.0 maxMergeSizeMB=4.0),segFN=segments_1,generation=1,filenames=[segments_1]
[junit4:junit4]   2> 23387 T40 C1 P36679 oasc.SolrDeletionPolicy.updateCommits newest commit = 1
[junit4:junit4]   2>  C0_STATE=coll:collection1 core:collection1 props:{shard=shard1, roles=null, state=recovering, core=collection1, collection=collection1, node_name=127.0.0.1:58640_solr, base_url=http://127.0.0.1:58640/solr}
[junit4:junit4]   2> 23452 T62 C0 P58640 oasc.SolrDeletionPolicy.onInit SolrDeletionPolicy.onInit: commits:num=1
[junit4:junit4]   2> 		commit{dir=NRTCachingDirectory(org.apache.lucene.store.NIOFSDirectory@/usr/home/hudson/hudson-slave/workspace/Lucene-Solr-Tests-trunk-java7/solr/build/solr-core/test/J1/org.apache.solr.cloud.BasicDistributedZk2Test-1348281604741/jetty3/index lockFactory=org.apache.lucene.store.NativeFSLockFactory@1c529aa0; maxCacheMB=48.0 maxMergeSizeMB=4.0),segFN=segments_1,generation=1,filenames=[segments_1]
[junit4:junit4]   2> 23453 T62 C0 P58640 oasc.SolrDeletionPolicy.updateCommits newest commit = 1
[junit4:junit4]   2> 23465 T62 C0 P58640 REQ /update {distrib.from=http://127.0.0.1:36679/solr/collection1/&update.distrib=FROMLEADER&wt=javabin&version=2} status=0 QTime=19 
[junit4:junit4]   2> 23467 T40 C1 P36679 /update {wt=javabin&version=2} {add=[1 (1413775756247433216)]} 0 95
[junit4:junit4]   2> 23468 T11 oasc.AbstractDistribZkTestBase.waitForRecoveriesToFinish Wait for recoveries to finish - collection: collection1 failOnTimeout:true timeout (sec):1800
[junit4:junit4]   2> 23470 T11 oascc.ZkStateReader.updateClusterState Updating cloud state from ZooKeeper... 
[junit4:junit4]   2> 23803 T72 C0 P58640 oasc.RecoveryStrategy.doRecovery Begin buffering updates. core=collection1
[junit4:junit4]   2> 23803 T72 C0 P58640 oasu.UpdateLog.bufferUpdates Starting to buffer updates. FSUpdateLog{state=ACTIVE, tlog=tlog{file=./org.apache.solr.cloud.BasicDistributedZk2Test-1348281604741/jetty3/tlog/tlog.0000000000000000000 refcount=1}}
[junit4:junit4]   2> 23804 T72 C0 P58640 oasc.RecoveryStrategy.replicate Attempting to replicate from http://127.0.0.1:36679/solr/collection1/. core=collection1
[junit4:junit4]   2> 23805 T72 C0 P58640 oascsi.HttpClientUtil.createClient Creating new http client, config:maxConnections=128&maxConnectionsPerHost=32&followRedirects=false
[junit4:junit4]   2> 23835 T41 C1 P36679 oasu.DirectUpdateHandler2.commit start commit{flags=0,_version_=0,optimize=false,openSearcher=true,waitSearcher=true,expungeDeletes=false,softCommit=false}
[junit4:junit4]   2> 24472 T11 oascc.ZkStateReader.updateClusterState Updating cloud state from ZooKeeper... 
[junit4:junit4]   2> 24484 T41 C1 P36679 oasc.SolrDeletionPolicy.onCommit SolrDeletionPolicy.onCommit: commits:num=2
[junit4:junit4]   2> 		commit{dir=NRTCachingDirectory(org.apache.lucene.store.NIOFSDirectory@/usr/home/hudson/hudson-slave/workspace/Lucene-Solr-Tests-trunk-java7/solr/build/solr-core/test/J1/org.apache.solr.cloud.BasicDistributedZk2Test-1348281604741/jetty1/index lockFactory=org.apache.lucene.store.NativeFSLockFactory@556c08de; maxCacheMB=48.0 maxMergeSizeMB=4.0),segFN=segments_1,generation=1,filenames=[segments_1]
[junit4:junit4]   2> 		commit{dir=NRTCachingDirectory(org.apache.lucene.store.NIOFSDirectory@/usr/home/hudson/hudson-slave/workspace/Lucene-Solr-Tests-trunk-java7/solr/build/solr-core/test/J1/org.apache.solr.cloud.BasicDistributedZk2Test-1348281604741/jetty1/index lockFactory=org.apache.lucene.store.NativeFSLockFactory@556c08de; maxCacheMB=48.0 maxMergeSizeMB=4.0),segFN=segments_2,generation=2,filenames=[_0_Asserting_0.tim, _0_Block_0.tip, _0_Block_0.pos, _0.fnm, _0_Block_0.doc, _0_Pulsing40_0.tim, _0_Asserting_0.tip, _0_Block_0.tim, _0_nrm.cfs, _0_Pulsing40_0.prx, _0_Pulsing40_0.frq, _0_Asserting_0.prx, _0_Asserting_0.frq, _0_Lucene40WithOrds_0.tii, _0_Lucene40WithOrds_0.frq, _0_nrm.cfe, _0_Pulsing40_0.tip, segments_2, _0.fdx, _0_Lucene40WithOrds_0.prx, _0.si, _0_Lucene40WithOrds_0.tib, _0.fdt]
[junit4:junit4]   2> 24485 T41 C1 P36679 oasc.SolrDeletionPolicy.updateCommits newest commit = 2
[junit4:junit4]   2> 24664 T41 C1 P36679 oass.SolrIndexSearcher.<init> Opening Searcher@5679c2b3 main
[junit4:junit4]   2> 24668 T41 C1 P36679 oasu.DirectUpdateHandler2.commit end_commit_flush
[junit4:junit4]   2> 24677 T47 oasc.SolrCore.registerSearcher [collection1] Registered new searcher Searcher@5679c2b3 main{StandardDirectoryReader(segments_2:3 _0(5.0):C1)}
[junit4:junit4]   2> 24679 T41 C1 P36679 /update {waitSearcher=true&commit=true&commit_end_point=true&wt=javabin&softCommit=false&version=2} {commit=} 0 849
[junit4:junit4]   2> 24715 T72 C0 P58640 oash.ReplicationHandler.inform Commits will be reserved for  10000
[junit4:junit4]   2> 24716 T72 C0 P58640 oascsi.HttpClientUtil.createClient Creating new http client, config:connTimeout=5000&socketTimeout=20000&allowCompression=false&maxConnections=10000&maxConnectionsPerHost=10000
[junit4:junit4]   2> 24734 T72 C0 P58640 oash.SnapPuller.<init>  No value set for 'pollInterval'. Timer Task not started.
[junit4:junit4]   2> 24773 T42 C1 P36679 oash.ReplicationHandler.inform Commits will be reserved for  10000
[junit4:junit4]   2> 24774 T42 C1 P36679 REQ /replication {command=indexversion&wt=javabin&qt=/replication&version=2} status=0 QTime=38 
[junit4:junit4]   2> 24775 T72 C0 P58640 oash.SnapPuller.fetchLatestIndex Master's generation: 2
[junit4:junit4]   2> 24776 T72 C0 P58640 oash.SnapPuller.fetchLatestIndex Slave's generation: 1
[junit4:junit4]   2> 24776 T72 C0 P58640 oash.SnapPuller.fetchLatestIndex Starting replication process
[junit4:junit4]   2> 24786 T42 C1 P36679 REQ /replication {command=filelist&generation=2&wt=javabin&qt=/replication&version=2} status=0 QTime=6 
[junit4:junit4]   2> 24788 T72 C0 P58640 oash.SnapPuller.fetchLatestIndex Number of files in latest index in master: 23
[junit4:junit4]   2> 24794 T72 C0 P58640 oash.SnapPuller.fetchLatestIndex Starting download to ./org.apache.solr.cloud.BasicDistributedZk2Test-1348281604741/jetty3/index.20120921164029299 fullCopy=true
[junit4:junit4]   2> 24805 T42 C1 P36679 REQ /replication {file=_0_Asserting_0.tim&command=filecontent&checksum=true&generation=2&qt=/replication&wt=filestream} status=0 QTime=4 
[junit4:junit4]   2> 24818 T42 C1 P36679 REQ /replication {file=_0_Block_0.pos&command=filecontent&checksum=true&generation=2&qt=/replication&wt=filestream} status=0 QTime=0 
[junit4:junit4]   2> 24823 T42 C1 P36679 REQ /replication {file=_0_Block_0.tip&command=filecontent&checksum=true&generation=2&qt=/replication&wt=filestream} status=0 QTime=0 
[junit4:junit4]   2> 24829 T42 C1 P36679 REQ /replication {file=_0_Pulsing40_0.tim&command=filecontent&checksum=true&generation=2&qt=/replication&wt=filestream} status=0 QTime=0 
[junit4:junit4]   2> 24833 T42 C1 P36679 REQ /replication {file=_0_Block_0.doc&command=filecontent&checksum=true&generation=2&qt=/replication&wt=filestream} status=0 QTime=0 
[junit4:junit4]   2> 24837 T42 C1 P36679 REQ /replication {file=_0.fnm&command=filecontent&checksum=true&generation=2&qt=/replication&wt=filestream} status=0 QTime=0 
[junit4:junit4]   2> 24842 T42 C1 P36679 REQ /replication {file=_0_Asserting_0.tip&command=filecontent&checksum=true&generation=2&qt=/replication&wt=filestream} status=0 QTime=0 
[junit4:junit4]   2> 24847 T42 C1 P36679 REQ /replication {file=_0_Block_0.tim&command=filecontent&checksum=true&generation=2&qt=/replication&wt=filestream} status=0 QTime=0 
[junit4:junit4]   2> 24852 T42 C1 P36679 REQ /replication {file=_0_nrm.cfs&command=filecontent&checksum=true&generation=2&qt=/replication&wt=filestream} status=0 QTime=0 
[junit4:junit4]   2> 24855 T42 C1 P36679 REQ /replication {file=_0_Pulsing40_0.prx&command=filecontent&checksum=true&generation=2&qt=/replication&wt=filestream} status=0 QTime=0 
[junit4:junit4]   2> 24859 T42 C1 P36679 REQ /replication {file=_0_Pulsing40_0.frq&command=filecontent&checksum=true&generation=2&qt=/replication&wt=filestream} status=0 QTime=0 
[junit4:junit4]   2> 24864 T42 C1 P36679 REQ /replication {file=_0_Asserting_0.prx&command=filecontent&checksum=true&generation=2&qt=/replication&wt=filestream} status=0 QTime=0 
[junit4:junit4]   2> 24878 T42 C1 P36679 REQ /replication {file=_0_Lucene40WithOrds_0.tii&command=filecontent&checksum=true&generation=2&qt=/replication&wt=filestream} status=0 QTime=1 
[junit4:junit4]   2> 24882 T42 C1 P36679 REQ /replication {file=_0_Asserting_0.frq&command=filecontent&checksum=true&generation=2&qt=/replication&wt=filestream} status=0 QTime=0 
[junit4:junit4]   2> 24887 T42 C1 P36679 REQ /replication {file=_0_Lucene40WithOrds_0.frq&command=filecontent&checksum=true&generation=2&qt=/replication&wt=filestream} status=0 QTime=0 
[junit4:junit4]   2> 24901 T42 C1 P36679 REQ /replication {file=_0_nrm.cfe&command=filecontent&checksum=true&generation=2&qt=/replication&wt=filestream} status=0 QTime=1 
[junit4:junit4]   2> 24908 T42 C1 P36679 REQ /replication {file=segments_2&command=filecontent&checksum=true&generation=2&qt=/replication&wt=filestream} status=0 QTime=1 
[junit4:junit4]   2> 24913 T42 C1 P36679 REQ /replication {file=_0_Pulsing40_0.tip&command=filecontent&checksum=true&generation=2&qt=/replication&wt=filestream} status=0 QTime=0 
[junit4:junit4]   2> 24920 T42 C1 P36679 REQ /replication {file=_0.fdx&command=filecontent&checksum=true&generation=2&qt=/replication&wt=filestream} status=0 QTime=0 
[junit4:junit4]   2> 24924 T42 C1 P36679 REQ /replication {file=_0_Lucene40WithOrds_0.prx&command=filecontent&checksum=true&generation=2&qt=/replication&wt=filestream} status=0 QTime=0 
[junit4:junit4]   2> 24929 T42 C1 P36679 REQ /replication {file=_0.si&command=filecontent&checksum=true&generation=2&qt=/replication&wt=filestream} status=0 QTime=0 
[junit4:junit4]   2> 24934 T42 C1 P36679 REQ /replication {file=_0_Lucene40WithOrds_0.tib&command=filecontent&checksum=true&generation=2&qt=/replication&wt=filestream} status=0 QTime=0 
[junit4:junit4]   2> 24939 T42 C1 P36679 REQ /replication {file=_0.fdt&command=filecontent&checksum=true&generation=2&qt=/replication&wt=filestream} status=0 QTime=0 
[junit4:junit4]   2> 24941 T72 C0 P58640 oash.SnapPuller.fetchLatestIndex Total time taken for download : 0 secs
[junit4:junit4]   2> 24942 T72 C0 P58640 oash.SnapPuller.modifyIndexProps New index installed. Updating index properties... index=index.20120921164029299
[junit4:junit4]   2> 24950 T72 C0 P58640 oasu.DefaultSolrCoreState.newIndexWriter Creating new IndexWriter...
[junit4:junit4]   2> 24950 T72 C0 P58640 oasu.DefaultSolrCoreState.newIndexWriter Waiting until IndexWriter is unused... core=collection1
[junit4:junit4]   2> 24951 T72 C0 P58640 oasu.DefaultSolrCoreState.newIndexWriter Rollback old IndexWriter... core=collection1
[junit4:junit4]   2> 24955 T72 C0 P58640 oasc.SolrCore.getNewIndexDir WARNING New index directory detected: old=./org.apache.solr.cloud.BasicDistributedZk2Test-1348281604741/jetty3/index/ new=./org.apache.solr.cloud.BasicDistributedZk2Test-1348281604741/jetty3/index.20120921164029299
[junit4:junit4]   2> 24955 T72 C0 P58640 oasc.CachingDirectoryFactory.get return new directory for /usr/home/hudson/hudson-slave/workspace/Lucene-Solr-Tests-trunk-java7/solr/build/solr-core/test/J1/./org.apache.solr.cloud.BasicDistributedZk2Test-1348281604741/jetty3/index.20120921164029299 forceNew:true
[junit4:junit4]   2> 24965 T72 C0 P58640 oasc.SolrDeletionPolicy.onInit SolrDeletionPolicy.onInit: commits:num=1
[junit4:junit4]   2> 		commit{dir=NRTCachingDirectory(org.apache.lucene.store.NIOFSDirectory@/usr/home/hudson/hudson-slave/workspace/Lucene-Solr-Tests-trunk-java7/solr/build/solr-core/test/J1/org.apache.solr.cloud.BasicDistributedZk2Test-1348281604741/jetty3/index.20120921164029299 lockFactory=org.apache.lucene.store.NativeFSLockFactory@54170d32; maxCacheMB=48.0 maxMergeSizeMB=4.0),segFN=segments_2,generation=2,filenames=[_0_Asserting_0.tim, _0_Block_0.tip, _0_Block_0.pos, _0.fnm, _0_Block_0.doc, _0_Pulsing40_0.tim, _0_Asserting_0.tip, _0_Block_0.tim, _0_nrm.cfs, _0_Pulsing40_0.prx, _0_Pulsing40_0.frq, _0_Asserting_0.prx, _0_Lucene40WithOrds_0.tii, _0_Asserting_0.frq, _0_Lucene40WithOrds_0.frq, _0_nrm.cfe, _0_Pulsing40_0.tip, segments_2, _0.fdx, _0_Lucene40WithOrds_0.prx, _0.si, _0_Lucene40WithOrds_0.tib, _0.fdt]
[junit4:junit4]   2> 24966 T72 C0 P58640 oasc.SolrDeletionPolicy.updateCommits newest commit = 2
[junit4:junit4]   2> 24966 T72 C0 P58640 oasu.DefaultSolrCoreState.newIndexWriter New IndexWriter is ready to be used.
[junit4:junit4]   2> 24976 T72 C0 P58640 oass.SolrIndexSearcher.<init> Opening Searcher@6dbf4a72 main
[junit4:junit4]   2> 24981 T71 oasc.SolrCore.registerSearcher [collection1] Registered new searcher Searcher@6dbf4a72 main{StandardDirectoryReader(segments_2:3:nrt _0(5.0):C1)}
[junit4:junit4]   2> 24982 T71 oasc.CachingDirectoryFactory.close Closing directory:/usr/home/hudson/hudson-slave/workspace/Lucene-Solr-Tests-trunk-java7/solr/build/solr-core/test/J1/./org.apache.solr.cloud.BasicDistributedZk2Test-1348281604741/jetty3/index
[junit4:junit4]   2> 24983 T71 oash.SnapPuller$2.onClose removing old index directory ./org.apache.solr.cloud.BasicDistributedZk2Test-1348281604741/jetty3/index
[junit4:junit4]   2> 24985 T72 C0 P58640 oasu.DirectUpdateHandler2.commit start commit{flags=0,_version_=0,optimize=false,openSearcher=false,waitSearcher=false,expungeDeletes=false,softCommit=false}
[junit4:junit4]   2> 24987 T72 C0 P58640 oasu.DirectUpdateHandler2.commit end_commit_flush
[junit4:junit4]   2> 24990 T72 C0 P58640 oasc.RecoveryStrategy.replay Replaying buffered documents. core=collection1
[junit4:junit4]   2> 24991 T94 C0 P58640 oasu.UpdateLog$LogReplayer.doReplay WARNING Starting log replay tlog{file=./org.apache.solr.cloud.BasicDistributedZk2Test-1348281604741/jetty3/tlog/tlog.0000000000000000000 refcount=2} active=true starting pos=432
[junit4:junit4]   2> 24994 T94 C0 P58640 oasu.DirectUpdateHandler2.commit start commit{flags=2,_version_=0,optimize=false,openSearcher=true,waitSearcher=true,expungeDeletes=false,softCommit=false}
[junit4:junit4]   2> 24996 T94 C0 P58640 oass.SolrIndexSearcher.<init> Opening Searcher@39df17cd main
[junit4:junit4]   2> 24998 T94 C0 P58640 oasu.DirectUpdateHandler2.commit end_commit_flush
[junit4:junit4]   2> 25002 T71 oasc.SolrCore.registerSearcher [collection1] Registered new searcher Searcher@39df17cd main{StandardDirectoryReader(segments_2:3:nrt _0(5.0):C1)}
[junit4:junit4]   2> 25003 T94 C0 P58640 oasu.UpdateLog$LogReplayer.run WARNING Log replay finished. recoveryInfo=RecoveryInfo{adds=0 deletes=0 deleteByQuery=0 errors=0 positionOfStart=432}
[junit4:junit4]   2> 25003 T72 C0 P58640 oasc.RecoveryStrategy.doRecovery Replication Recovery was successful - registering as Active. core=collection1
[junit4:junit4]   2> 25006 T72 C0 P58640 oasc.RecoveryStrategy.doRecovery Finished recovery process. core=collection1
[junit4:junit4]   2> 25116 T33 oascc.ZkStateReader.updateClusterState Updating cloud state from ZooKeeper... 
[junit4:junit4]   2> 25130 T91 oascc.ZkStateReader$2.process A cluster state change has occurred - updating...
[junit4:junit4]   2> 25130 T32 oascc.ZkStateReader$2.process A cluster state change has occurred - updating...
[junit4:junit4]   2> 25130 T58 oascc.ZkStateReader$2.process A cluster state change has occurred - updating...
[junit4:junit4]   2> 25130 T89 oascc.ZkStateReader$2.process A cluster state change has occurred - updating...
[junit4:junit4]   2> 25130 T46 oascc.ZkStateReader$2.process A cluster state change has occurred - updating...
[junit4:junit4]   2> 25130 T70 oascc.ZkStateReader$2.process A cluster state change has occurred - updating...
[junit4:junit4]   2> 25130 T84 oascc.ZkStateReader$2.process A cluster state change has occurred - updating...
[junit4:junit4]   2> 25476 T11 oascc.ZkStateReader.updateClusterState Updating cloud state from ZooKeeper... 
[junit4:junit4]   2>  C2_STATE=coll:collection1 core:collection1 props:{shard=shard2, roles=null, state=recovering, core=collection1, collection=collection1, node_name=127.0.0.1:62376_solr, base_url=http://127.0.0.1:62376/solr}
[junit4:junit4]   2> 25699 T86 C2 P62376 oasc.RecoveryStrategy.doRecovery Begin buffering updates. core=collection1
[junit4:junit4]   2> 25699 T86 C2 P62376 oasu.UpdateLog.bufferUpdates Starting to buffer updates. FSUpdateLog{state=ACTIVE, tlog=null}
[junit4:junit4]   2> 25700 T86 C2 P62376 oasc.RecoveryStrategy.replicate Attempting to replicate from http://127.0.0.1:31843/solr/collection1/. core=collection1
[junit4:junit4]   2> 25701 T86 C2 P62376 oascsi.HttpClientUtil.createClient Creating new http client, config:maxConnections=128&maxConnectionsPerHost=32&followRedirects=false
[junit4:junit4]   2> 25723 T52 C3 P31843 oasu.DirectUpdateHandler2.commit start commit{flags=0,_version_=0,optimize=false,openSearcher=true,waitSearcher=true,expungeDeletes=false,softCommit=false}
[junit4:junit4]   2> 25727 T52 C3 P31843 oasc.SolrDeletionPolicy.onInit SolrDeletionPolicy.onInit: commits:num=1
[junit4:junit4]   2> 		commit{dir=NRTCachingDirectory(org.apache.lucene.store.NIOFSDirectory@/usr/home/hudson/hudson-slave/workspace/Lucene-Solr-Tests-trunk-java7/solr/build/solr-core/test/J1/org.apache.solr.cloud.BasicDistributedZk2Test-1348281604741/jetty2/index lockFactory=org.apache.lucene.store.NativeFSLockFactory@2dae9baf; maxCacheMB=48.0 maxMergeSizeMB=4.0),segFN=segments_1,generation=1,filenames=[segments_1]
[junit4:junit4]   2> 25728 T52 C3 P31843 oasc.SolrDeletionPolicy.updateCommits newest commit = 1
[junit4:junit4]   2> 25730 T52 C3 P31843 oass.SolrIndexSearcher.<init> Opening Searcher@30b6b321 main
[junit4:junit4]   2> 25730 T52 C3 P31843 oasu.DirectUpdateHandler2.commit end_commit_flush
[junit4:junit4]   2> 25734 T59 oasc.SolrCore.registerSearcher [collection1] Registered new searcher Searcher@30b6b321 main{StandardDirectoryReader(segments_1:1)}
[junit4:junit4]   2> 25736 T52 C3 P31843 /update {waitSearcher=true&commit=true&commit_end_point=true&wt=javabin&softCommit=false&version=2} {commit=} 0 13
[junit4:junit4]   2> 25737 T86 C2 P62376 oash.ReplicationHandler.inform Commits will be reserved for  10000
[junit4:junit4]   2> 25737 T86 C2 P62376 oash.SnapPuller.<init>  No value set for 'pollInterval'. Timer Task not started.
[junit4:junit4]   2> 25741 T53 C3 P31843 oash.ReplicationHandler.inform Commits will be reserved for  10000
[junit4:junit4]   2> 25741 T53 C3 P31843 REQ /replication {command=indexversion&wt=javabin&qt=/replication&version=2} status=0 QTime=1 
[junit4:junit4]   2> 25748 T86 C2 P62376 oasc.SolrDeletionPolicy.onInit SolrDeletionPolicy.onInit: commits:num=1
[junit4:junit4]   2> 		commit{dir=NRTCachingDirectory(org.apache.lucene.store.NIOFSDirectory@/usr/home/hudson/hudson-slave/workspace/Lucene-Solr-Tests-trunk-java7/solr/build/solr-core/test/J1/org.apache.solr.cloud.BasicDistributedZk2Test-1348281604741/jetty4/index lockFactory=org.apache.lucene.store.NativeFSLockFactory@2a9f4041; maxCacheMB=48.0 maxMergeSizeMB=4.0),segFN=segments_1,generation=1,filenames=[segments_1]
[junit4:junit4]   2> 25748 T86 C2 P62376 oasc.SolrDeletionPolicy.updateCommits newest commit = 1
[junit4:junit4]   2> 25750 T86 C2 P62376 oasu.DirectUpdateHandler2.commit start commit{flags=0,_version_=0,optimize=false,openSearcher=true,waitSearcher=true,expungeDeletes=false,softCommit=false}
[junit4:junit4]   2> 25755 T86 C2 P62376 oasc.SolrDeletionPolicy.onCommit SolrDeletionPolicy.onCommit: commits:num=2
[junit4:junit4]   2> 		commit{dir=NRTCachingDirectory(org.apache.lucene.store.NIOFSDirectory@/usr/home/hudson/hudson-slave/workspace/Lucene-Solr-Tests-trunk-java7/solr/build/solr-core/test/J1/org.apache.solr.cloud.BasicDistributedZk2Test-1348281604741/jetty4/index lockFactory=org.apache.lucene.store.NativeFSLockFactory@2a9f4041; maxCacheMB=48.0 maxMergeSizeMB=4.0),segFN=segments_1,generation=1,filenames=[segments_1]
[junit4:junit4]   2> 		commit{dir=NRTCachingDirectory(org.apache.lucene.store.NIOFSDirectory@/usr/home/hudson/hudson-slave/workspace/Lucene-Solr-Tests-trunk-java7/solr/build/solr-core/test/J1/org.apache.solr.cloud.BasicDistributedZk2Test-1348281604741/jetty4/index lockFactory=org.apache.lucene.store.NativeFSLockFactory@2a9f4041; maxCacheMB=48.0 maxMergeSizeMB=4.0),segFN=segments_2,generation=2,filenames=[segments_2]
[junit4:junit4]   2> 25755 T86 C2 P62376 oasc.SolrDeletionPolicy.updateCommits newest commit = 2
[junit4:junit4]   2> 25760 T86 C2 P62376 oass.SolrIndexSearcher.<init> Opening Searcher@460cf4b9 main
[junit4:junit4]   2> 25761 T86 C2 P62376 oasu.DirectUpdateHandler2.commit end_commit_flush
[junit4:junit4]   2> 25768 T85 oasc.SolrCore.registerSearcher [collection1] Registered new searcher Searcher@460cf4b9 main{StandardDirectoryReader(segments_2:2)}
[junit4:junit4]   2> 25770 T86 C2 P62376 oasc.RecoveryStrategy.replay No replay needed. core=collection1
[junit4:junit4]   2> 25771 T86 C2 P62376 oasc.RecoveryStrategy.doRecovery Replication Recovery was successful - registering as Active. core=collection1
[junit4:junit4]   2> 25811 T86 C2 P62376 oasc.RecoveryStrategy.doRecovery Finished recovery process. core=collection1
[junit4:junit4]   2> 26140 T33 oascc.ZkStateReader.updateClusterState Updating cloud state from ZooKeeper... 
[junit4:junit4]   2> 26162 T32 oascc.ZkStateReader$2.process A cluster state change has occurred - updating...
[junit4:junit4]   2> 26162 T91 oascc.ZkStateReader$2.process A cluster state change has occurred - updating...
[junit4:junit4]   2> 26162 T58 oascc.ZkStateReader$2.process A cluster state change has occurred - updating...
[junit4:junit4]   2> 26162 T89 oascc.ZkStateReader$2.process A cluster state change has occurred - updating...
[junit4:junit4]   2> 26162 T70 oascc.ZkStateReader$2.process A cluster state change has occurred - updating...
[junit4:junit4]   2> 26162 T46 oascc.ZkStateReader$2.process A cluster state change has occurred - updating...
[junit4:junit4]   2> 26162 T84 oascc.ZkStateReader$2.process A cluster state change has occurred - updating...
[junit4:junit4]   2> 26479 T11 oascc.ZkStateReader.updateClusterState Updating cloud state from ZooKeeper... 
[junit4:junit4]   2> 26484 T24 C4 P11348 oasu.DirectUpdateHandler2.commit start commit{flags=0,_version_=0,optimize=false,openSearcher=true,waitSearcher=true,expungeDeletes=false,softCommit=false}
[junit4:junit4]   2> 26549 T24 C4 P11348 oasc.SolrDeletionPolicy.onCommit SolrDeletionPolicy.onCommit: commits:num=2
[junit4:junit4]   2> 		commit{dir=NRTCachingDirectory(org.apache.lucene.store.NIOFSDirectory@/usr/home/hudson/hudson-slave/workspace/Lucene-Solr-Tests-trunk-java7/solr/build/solr-core/test/J1/org.apache.solr.cloud.BasicDistributedZk2Test-1348281604741/control/data/index lockFactory=org.apache.lucene.store.NativeFSLockFactory@68240bb; maxCacheMB=48.0 maxMergeSizeMB=4.0),segFN=segments_1,generation=1,filenames=[segments_1]
[junit4:junit4]   2> 		commit{dir=NRTCachingDirectory(org.apache.lucene.store.NIOFSDirectory@/usr/home/hudson/hudson-slave/workspace/Lucene-Solr-Tests-trunk-java7/solr/build/solr-core/test/J1/org.apache.solr.cloud.BasicDistributedZk2Test-1348281604741/control/data/index lockFactory=org.apache.lucene.store.NativeFSLockFactory@68240bb; maxCacheMB=48.0 maxMergeSizeMB=4.0),segFN=segments_2,generation=2,filenames=[_0_Asserting_0.tim, _0_Block_0.tip, _0_Block_0.pos, _0.fnm, _0_Block_0.doc, _0_Pulsing40_0.tim, _0_Asserting_0.tip, _0_Block_0.tim, _0_nrm.cfs, _0_Pulsing40_0.prx, _0_Pulsing40_0.frq, _0_Asserting_0.prx, _0_Asserting_0.frq, _0_Lucene40WithOrds_0.tii, _0_Lucene40WithOrds_0.frq, _0_nrm.cfe, _0_Pulsing40_0.tip, segments_2, _0.fdx, _0_Lucene40WithOrds_0.prx, _0.si, _0_Lucene40WithOrds_0.tib, _0.fdt]
[junit4:junit4]   2> 26550 T24 C4 P11348 oasc.SolrDeletionPolicy.updateCommits newest commit = 2
[junit4:junit4]   2> 26573 T24 C4 P11348 oass.SolrIndexSearcher.<init> Opening Searcher@e5e2bd7 main
[junit4:junit4]   2> 26574 T24 C4 P11348 oasu.DirectUpdateHandler2.commit end_commit_flush
[junit4:junit4]   2> 26577 T35 oasc.SolrCore.registerSearcher [collection1] Registered new searcher Searcher@e5e2bd7 main{StandardDirectoryReader(segments_2:3 _0(5.0):C1)}
[junit4:junit4]   2> 26579 T24 C4 P11348 /update {waitSearcher=true&wt=javabin&commit=true&softCommit=false&version=2} {commit=} 0 95
[junit4:junit4]   2> 26582 T54 C3 P31843 oasu.DirectUpdateHandler2.commit start commit{flags=0,_version_=0,optimize=false,openSearcher=true,waitSearcher=true,expungeDeletes=false,softCommit=false}
[junit4:junit4]   2> 26585 T54 C3 P31843 oass.SolrIndexSearcher.<init> Opening Searcher@1f50ad9a main
[junit4:junit4]   2> 26586 T54 C3 P31843 oasu.DirectUpdateHandler2.commit end_commit_flush
[junit4:junit4]   2> 26590 T59 oasc.SolrCore.registerSearcher [collection1] Registered new searcher Searcher@1f50ad9a main{StandardDirectoryReader(segments_1:1)}
[junit4:junit4]   2> 26592 T54 C3 P31843 oasu.SolrCmdDistributor.distribCommit Distrib commit to:[StdNode: http://127.0.0.1:36679/solr/collection1/, StdNode: http://127.0.0.1:58640/solr/collection1/, StdNode: http://127.0.0.1:62376/solr/collection1/]
[junit4:junit4]   2> 26596 T43 C1 P36679 oasu.DirectUpdateHandler2.commit start commit{flags=0,_version_=0,optimize=false,openSearcher=true,waitSearcher=true,expungeDeletes=false,softCommit=false}
[junit4:junit4]   2>  C0_STATE=coll:collection1 core:collection1 props:{shard=shard1, roles=null, state=active, core=collection1, collection=collection1, node_name=127.0.0.1:58640_solr, base_url=http://127.0.0.1:58640/solr}
[junit4:junit4]   2> 26597 T62 C0 P58640 oasu.DirectUpdateHandler2.commit start commit{flags=0,_version_=0,optimize=false,openSearcher=true,waitSearcher=true,expungeDeletes=false,softCommit=false}
[junit4:junit4]   2> 26600 T62 C0 P58640 oass.SolrIndexSearcher.<init> Opening Searcher@26fe26cc main
[junit4:junit4]   2> 26601 T62 C0 P58640 oasu.DirectUpdateHandler2.commit end_commit_flush
[junit4:junit4]   2>  C2_STATE=coll:collection1 core:collection1 props:{shard=shard2, roles=null, state=active, core=collection1, collection=collection1, node_name=127.0.0.1:62376_solr, base_url=http://127.0.0.1:62376/solr}
[junit4:junit4]   2> 26605 T76 C2 P62376 oasu.DirectUpdateHandler2.commit start commit{flags=0,_version_=0,optimize=false,openSearcher=true,waitSearcher=true,expungeDeletes=false,softCommit=false}
[junit4:junit4]   2> 26606 T71 oasc.SolrCore.registerSearcher [collection1] Registered new searcher Searcher@26fe26cc main{StandardDirectoryReader(segments_2:3:nrt _0(5.0):C1)}
[junit4:junit4]   2> 26605 T43 C1 P36679 oass.SolrIndexSearcher.<init> Opening Searcher@623a61ff main
[junit4:junit4]   2> 26607 T62 C0 P58640 /update {waitSearcher=true&commit=true&wt=javabin&commit_end_point=true&expungeDeletes=false&softCommit=false&version=2} {commit=} 0 11
[junit4:junit4]   2> 26607 T43 C1 P36679 oasu.DirectUpdateHandler2.commit end_commit_flush
[junit4:junit4]   2> 26609 T76 C2 P62376 oass.SolrIndexSearcher.<init> Opening Searcher@32a67bb8 main
[junit4:junit4]   2> 26610 T76 C2 P62376 oasu.DirectUpdateHandler2.commit end_commit_flush
[junit4:junit4]   2> 26612 T47 oasc.SolrCore.registerSearcher [collection1] Registered new searcher Searcher@623a61ff main{StandardDirectoryReader(segments_2:3 _0(5.0):C1)}
[junit4:junit4]   2> 26613 T43 C1 P36679 /update {waitSearcher=true&commit=true&wt=javabin&commit_end_point=true&expungeDeletes=false&softCommit=false&version=2} {commit=} 0 17
[junit4:junit4]   2> 26614 T85 oasc.SolrCore.registerSearcher [collection1] Registered new searcher Searcher@32a67bb8 main{StandardDirectoryReader(segments_2:2)}
[junit4:junit4]   2> 26615 T76 C2 P62376 /update {waitSearcher=true&commit=true&wt=javabin&commit_end_point=true&expungeDeletes=false&softCommit=false&version=2} {commit=} 0 10
[junit4:junit4]   2> 26616 T54 C3 P31843 /update {waitSearcher=true&wt=javabin&commit=true&softCommit=false&version=2} {commit=} 0 34
[junit4:junit4]   2> 27034 T25 C4 P11348 REQ /select {fl=id,score&shard.url=127.0.0.1:11348/solr/collection1/&NOW=1348281631140&start=0&q=*:*&distrib=false&isShard=true&wt=javabin&fsv=true&rows=10&version=2} hits=1 status=0 QTime=198 
[junit4:junit4]   2> 27123 T25 C4 P11348 REQ /select {shard.url=127.0.0.1:11348/solr/collection1/&NOW=1348281631140&q=*:*&ids=1&distrib=false&isShard=true&wt=javabin&version=2} status=0 QTime=27 
[junit4:junit4]   2> 27127 T24 C4 P11348 REQ /select {wt=javabin&q=*:*&version=2} hits=1 status=0 QTime=497 
[junit4:junit4]   2> 27129 T11 oaz.ZooKeeper.<init> Initiating client connection, connectString=127.0.0.1:15988/solr sessionTimeout=10000 watcher=org.apache.solr.common.cloud.ConnectionManager@5a31599e
[junit4:junit4]   2> 27130 T99 oaz.ClientCnxn$SendThread.startConnect Opening socket connection to server /127.0.0.1:15988
[junit4:junit4]   2> 27130 T11 oascc.ConnectionManager.waitForConnected Waiting for client to connect to ZooKeeper
[junit4:junit4]   2> 27131 T99 oaz.ClientCnxn$SendThread.primeConnection Socket connection established to localhost/127.0.0.1:15988, initiating session
[junit4:junit4]   2> 27132 T13 oazs.NIOServerCnxn$Factory.run Accepted socket connection from /140.211.11.196:61899
[junit4:junit4]   2> 27132 T13 oazs.NIOServerCnxn.readConnectRequest Client attempting to establish new session at /140.211.11.196:61899
[junit4:junit4]   2> 27161 T15 oazs.NIOServerCnxn.finishSessionInit Established session 0x139ebd89bf60009 with negotiated timeout 10000 for client /140.211.11.196:61899
[junit4:junit4]   2> 27161 T99 oaz.ClientCnxn$SendThread.readConnectResult Session establishment complete on server localhost/127.0.0.1:15988, sessionid = 0x139ebd89bf60009, negotiated timeout = 10000
[junit4:junit4]   2> 27162 T100 oascc.ConnectionManager.process Watcher org.apache.solr.common.cloud.ConnectionManager@5a31599e name:ZooKeeperConnection Watcher:127.0.0.1:15988/solr got event WatchedEvent state:SyncConnected type:None path:null path:null type:None
[junit4:junit4]   2> 27162 T11 oascc.ConnectionManager.waitForConnected Client is connected to ZooKeeper
[junit4:junit4]   2> 27164 T11 oascc.ZkStateReader.createClusterStateWatchersAndUpdate Updating cluster state from ZooKeeper... 
[junit4:junit4]   2> 27166 T16 oazs.PrepRequestProcessor.pRequest Processed session termination for sessionid: 0x139ebd89bf60009
[junit4:junit4]   2> 27167 T100 oaz.ClientCnxn$EventThread.run EventThread shut down
[junit4:junit4]   2> 27167 T13 oazs.NIOServerCnxn.closeSock Closed socket connection for client /140.211.11.196:61899 which had sessionid 0x139ebd89bf60009
[junit4:junit4]   2> 27167 T11 oaz.ZooKeeper.close Session: 0x139ebd89bf60009 closed
[junit4:junit4]   2> 27171 T44 C1 P36679 REQ /select {distrib=false&wt=javabin&q=*:*&version=2} hits=1 status=0 QTime=1 
[junit4:junit4]   2> 27175 T55 C3 P31843 REQ /select {distrib=false&wt=javabin&q=*:*&version=2} hits=0 status=0 QTime=0 
[junit4:junit4]   2> 27184 T56 C3 P31843 REQ /select {fl=id,score&shard.url=127.0.0.1:31843/solr/collection1/|127.0.0.1:62376/solr/collection1/&NOW=1348281631688&start=0&q=*:*&distrib=false&isShard=true&wt=javabin&fsv=true&rows=10&version=2} hits=0 status=0 QTime=0 
[junit4:junit4]   2> 27184 T39 C1 P36679 REQ /select {fl=id,score&shard.url=127.0.0.1:36679/solr/collection1/|127.0.0.1:58640/solr/collection1/&NOW=1348281631688&start=0&q=*:*&distrib=false&isShard=true&wt=javabin&fsv=true&rows=10&version=2} hits=1 status=0 QTime=0 
[junit4:junit4]   2> 27189 T39 C1 P36679 REQ /select {shard.url=127.0.0.1:36679/solr/collection1/|127.0.0.1:58640/solr/collection1/&NOW=1348281631688&q=*:*&ids=1&distrib=false&isShard=true&wt=javabin&version=2} status=0 QTime=0 
[junit4:junit4]   2> 27191 T77 C2 P62376 REQ /select {wt=javabin&q=*:*&version=2} hits=1 status=0 QTime=13 
[junit4:junit4]   2> 27202 T24 C4 P11348 /update {wt=javabin&version=2} {add=[2 (1413775760247750656)]} 0 6
[junit4:junit4]   2> 27235 T76 C2 P62376 REQ /update {update.distrib=FROMLEADER&distrib.from=http://127.0.0.1:31843/solr/collection1/&wt=javabin&version=2} status=0 QTime=10 
[junit4:junit4]   2> 27236 T51 C3 P31843 REQ /update {distrib.from=http://127.0.0.1:36679/solr/collection1/&update.distrib=TOLEADER&wt=javabin&version=2} status=0 QTime=21 
[junit4:junit4]   2> 27237 T40 C1 P36679 /update {wt=javabin&version=2} {add=[2]} 0 30
[junit4:junit4]   2> 27245 T24 C4 P11348 /update {wt=javabin&version=2} {add=[3 (1413775760294936576)]} 0 5
[junit4:junit4]   2> 27269 T76 C2 P62376 REQ /update {update.distrib=FROMLEADER&distrib.from=http://127.0.0.1:31843/solr/collection1/&wt=javabin&version=2} status=0 QTime=6 
[junit4:junit4]   2> 27270 T51 C3 P31843 REQ /update {distrib.from=http://127.0.0.1:36679/solr/collection1/&update.distrib=TOLEADER&wt=javabin&version=2} status=0 QTime=17 
[junit4:junit4]   2> 27271 T40 C1 P36679 /update {wt=javabin&version=2} {add=[3]} 0 22
[junit4:junit4]   2> 27279 T24 C4 P11348 /update {wt=javabin&version=2} {add=[4 (1413775760330588160)]} 0 5
[junit4:junit4]   2> 27307 T62 C0 P58640 REQ /update {update.distrib=FROMLEADER&distrib.from=http://127.0.0.1:36679/solr/collection1/&wt=javabin&version=2} status=0 QTime=10 
[junit4:junit4]   2> 27308 T43 C1 P36679 REQ /update {distrib.from=http://127.0.0.1:31843/solr/collection1/&update.distrib=TOLEADER&wt=javabin&version=2} status=0 QTime=22 
[junit4:junit4]   2> 27309 T54 C3 P31843 /update {wt=javabin&version=2} {add=[4]} 0 27
[junit4:junit4]   2> 27318 T24 C4 P11348 /update {wt=javabin&version=2} {add=[5 (1413775760371482624)]} 0 4
[junit4:junit4]   2> 27339 T76 C2 P62376 REQ /update {distrib.from=http://127.0.0.1:31843/solr/collection1/&update.distrib=FROMLEADER&wt=javabin&version=2} status=0 QTime=6 
[junit4:junit4]   2> 27340 T54 C3 P31843 /update {wt=javabin&version=2} {add=[5 (1413775760380919808)]} 0 18
[junit4:junit4]   2> 27350 T24 C4 P11348 /update {wt=javabin&version=2} {add=[6 (1413775760402939904)]} 0 6
[junit4:junit4]   2> 27368 T76 C2 P62376 REQ /update {distrib.from=http://127.0.0.1:31843/solr/collection1/&update.distrib=FROMLEADER&wt=javabin&version=2} status=0 QTime=6 
[junit4:junit4]   2> 27369 T54 C3 P31843 /update {wt=javabin&version=2} {add=[6 (1413775760413425664)]} 0 15
[junit4:junit4]   2> 27381 T24 C4 P11348 /update {wt=javabin&version=2} {add=[7 (1413775760435445760)]} 0 7
[junit4:junit4]   2> 27400 T76 C2 P62376 REQ /update {distrib.from=http://127.0.0.1:31843/solr/collection1/&update.distrib=FROMLEADER&wt=javabin&version=2} status=0 QTime=7 
[junit4:junit4]   2> 27402 T54 C3 P31843 /update {wt=javabin&version=2} {add=[7 (1413775760445931520)]} 0 17
[junit4:junit4]   2> 27414 T24 C4 P11348 /update {wt=javabin&version=2} {add=[8 (1413775760470048768)]} 0 7
[junit4:junit4]   2> 27435 T62 C0 P58640 REQ /update {distrib.from=http://127.0.0.1:36679/solr/collection1/&update.distrib=FROMLEADER&wt=javabin&version=2} status=0 QTime=6 
[junit4:junit4]   2> 27436 T40 C1 P36679 /update {wt=javabin&version=2} {add=[8 (1413775760482631680)]} 0 17
[junit4:junit4]   2> 27447 T24 C4 P11348 /update {wt=javabin&version=2} {add=[9 (1413775760504651776)]} 0 7
[junit4:junit4]   2> 27470 T76 C2 P62376 REQ /update {update.distrib=FROMLEADER&distrib.from=http://127.0.0.1:31843/solr/collection1/&wt=javabin&version=2} status=0 QTime=6 
[junit4:junit4]   2> 27471 T51 C3 P31843 REQ /update {distrib.from=http://127.0.0.1:36679/solr/collection1/&update.distrib=TOLEADER&wt=javabin&version=2} status=0 QTime=16 
[junit4:junit4]   2> 27472 T40 C1 P36679 /update {wt=javabin&version=2} {add=[9]} 0 22
[junit4:junit4]   2> 27483 T24 C4 P11348 /update {wt=javabin&version=2} {add=[10 (1413775760542400512)]} 0 7
[junit4:junit4]   2> 27502 T62 C0 P58640 REQ /update {distrib.from=http://127.0.0.1:36679/solr/collection1/&update.distrib=FROMLEADER&wt=javabin&version=2} status=0 QTime=6 
[junit4:junit4]   2> 27503 T40 C1 P36679 /update {wt=javabin&version=2} {add=[10 (1413775760552886272)]} 0 17
[junit4:junit4]   2> 27564 T24 C4 P11348 /update {wt=javabin&version=2} {add=[11 (1413775760574906368)]} 0 56
[junit4:junit4]   2> 27587 T62 C0 P58640 REQ /update {update.distrib=FROMLEADER&distrib.from=http://127.0.0.1:36679/solr/collection1/&wt=javabin&version=2} status=0 QTime=7 
[junit4:junit4]   2> 27588 T43 C1 P36679 REQ /update {distrib.from=http://127.0.0.1:31843/solr/collection1/&update.distrib=TOLEADER&wt=javabin&version=2} status=0 QTime=16 
[junit4:junit4]   2> 27589 T54 C3 P31843 /update {wt=javabin&version=2} {add=[11]} 0 20
[junit4:junit4]   2> 27601 T24 C4 P11348 /update {wt=javabin&version=2} {add=[12 (1413775760665083904)]} 0 8
[junit4:junit4]   2> 27620 T62 C0 P58640 REQ /update {distrib.from=http://127.0.0.1:36679/solr/collection1/&update.distrib=FROMLEADER&wt=javabin&version=2} status=0 QTime=7 
[junit4:junit4]   2> 27621 T40 C1 P36679 /update {wt=javabin&version=2} {add=[12 (1413775760676618240)]} 0 16
[junit4:junit4]   2> 27630 T24 C4 P11348 /update {wt=javabin&version=2} {add=[13 (1413775760697589760)]} 0 6
[junit4:junit4]   2> 27650 T62 C0 P58640 REQ /update {update.distrib=FROMLEADER&distrib.from=http://127.0.0.1:36679/solr/collection1/&wt=javabin&version=2} status=0 QTime=5 
[junit4:junit4]   2> 27651 T43 C1 P36679 REQ /update {distrib.from=http://127.0.0.1:31843/solr/collection1/&update.distrib=TOLEADER&wt=javabin&version=2} status=0 QTime=13 
[junit4:junit4]   2> 27652 T54 C3 P31843 /update {wt=javabin&version=2} {add=[13]} 0 18
[junit4:junit4]   2> 27660 T24 C4 P11348 /update {wt=javabin&version=2} {add=[14 (1413775760731144192)]} 0 4
[junit4:junit4]   2> 27676 T62 C0 P58640 REQ /update {distrib.from=http://127.0.0.1:36679/solr/collection1/&update.distrib=FROMLEADER&wt=javabin&version=2} status=0 QTime=4 
[junit4:junit4]   2> 27677 T40 C1 P36679 /update {wt=javabin&version=2} {add=[14 (1413775760739532800)]} 0 13
[junit4:junit4]   2> 27685 T24 C4 P11348 /update {wt=javabin&version=2} {add=[15 (1413775760757358592)]} 0 4
[junit4:junit4]   2> 27703 T62 C0 P58640 REQ /update {update.distrib=FROMLEADER&distrib.from=http://127.0.0.1:36679/solr/collection1/&wt=javabin&version=2} status=0 QTime=4 
[junit4:junit4]   2> 27704 T43 C1 P36679 REQ /update {distrib.from=http://127.0.0.1:31843/solr/collection1/&update.distrib=TOLEADER&wt=javabin&version=2} status=0 QTime=12 
[junit4:junit4]   2> 27705 T54 C3 P31843 /update {wt=javabin&version=2} {add=[15]} 0 17
[junit4:junit4]   2> 27714 T24 C4 P11348 /update {wt=javabin&version=2} {add=[16 (1413775760785670144)]} 0 6
[junit4:junit4]   2> 27731 T62 C0 P58640 REQ /update {update.distrib=FROMLEADER&distrib.from=http://127.0.0.1:36679/solr/collection1/&wt=javabin&version=2} status=0 QTime=3 
[junit4:junit4]   2> 27732 T43 C1 P36679 REQ /update {distrib.from=http://127.0.0.1:31843/solr/collection1/&update.distrib=TOLEADER&wt=javabin&version=2} status=0 QTime=12 
[junit4:junit4]   2> 27732 T54 C3 P31843 /update {wt=javabin&version=2} {add=[16]} 0 15
[junit4:junit4]   2> 27756 T24 C4 P11348 /update {wt=javabin&version=2} {add=[17 (1413775760819224576)]} 0 20
[junit4:junit4]   2> 27805 T76 C2 P62376 REQ /update {distrib.from=http://127.0.0.1:31843/solr/collection1/&update.distrib=FROMLEADER&wt=javabin&version=2} status=0 QTime=21 
[junit4:junit4]   2> 27806 T54 C3 P31843 /update {wt=javabin&version=2} {add=[17 (1413775760844390400)]} 0 46
[junit4:junit4]   2> 27815 T24 C4 P11348 /update {wt=javabin&version=2} {add=[100 (1413775760892624896)]} 0 5
[junit4:junit4]   2> 27917 T62 C0 P58640 REQ /update {update.distrib=FROMLEADER&distrib.from=http://127.0.0.1:36679/solr/collection1/&wt=javabin&version=2} status=0 QTime=52 
[junit4:junit4]   2> 27919 T43 C1 P36679 REQ /update {distrib.from=http://127.0.0.1:31843/solr/collection1/&update.distrib=TOLEADER&wt=javabin&version=2} status=0 QTime=95 
[junit4:junit4]   2> 27920 T54 C3 P31843 /update {wt=javabin&version=2} {add=[100]} 0 101
[junit4:junit4]   2> 27929 T24 C4 P11348 /update {wt=javabin&version=2} {add=[101 (1413775761012162560)]} 0 4
[junit4:junit4]   2> 27949 T62 C0 P58640 REQ /update {update.distrib=FROMLEADER&distrib.from=http://127.0.0.1:36679/solr/collection1/&wt=javabin&version=2} status=0 QTime=6 
[junit4:junit4]   2> 27950 T43 C1 P36679 REQ /update {distrib.from=http://127.0.0.1:31843/solr/collection1/&update.distrib=TOLEADER&wt=javabin&version=2} status=0 QTime=15 
[junit4:junit4]   2> 27951 T54 C3 P31843 /update {wt=javabin&version=2} {add=[101]} 0 19
[junit4:junit4]   2> 27959 T24 C4 P11348 /update {wt=javabin&version=2} {add=[102 (1413775761043619840)]} 0 5
[junit4:junit4]   2> 27976 T62 C0 P58640 REQ /update {update.distrib=FROMLEADER&distrib.from=http://127.0.0.1:36679/solr/collection1/&wt=javabin&version=2} status=0 QTime=4 
[junit4:junit4]   2> 27977 T43 C1 P36679 REQ /update {distrib.from=http://127.0.0.1:31843/solr/collection1/&update.distrib=TOLEADER&wt=javabin&version=2} status=0 QTime=11 
[junit4:junit4]   2> 27978 T54 C3 P31843 /update {wt=javabin&version=2} {add=[102]} 0 16
[junit4:junit4]   2> 28052 T24 C4 P11348 /update {wt=javabin&version=2} {add=[103 (1413775761072979968)]} 0 70
[junit4:junit4]   2> 28071 T76 C2 P62376 REQ /update {update.distrib=FROMLEADER&distrib.from=http://127.0.0.1:31843/solr/collection1/&wt=javabin&version=2} status=0 QTime=4 
[junit4:junit4]   2> 28072 T51 C3 P31843 REQ /update {distrib.from=http://127.0.0.1:36679/solr/collection1/&update.distrib=TOLEADER&wt=javabin&version=2} status=0 QTime=12 
[junit4:junit4]   2> 28073 T40 C1 P36679 /update {wt=javabin&version=2} {add=[103]} 0 18
[junit4:junit4]   2> 28096 T24 C4 P11348 /update {wt=javabin&version=2} {add=[104 (1413775761172594688)]} 0 19
[junit4:junit4]   2> 28113 T76 C2 P62376 REQ /update {update.distrib=FROMLEADER&distrib.from=http://127.0.0.1:31843/solr/collection1/&wt=javabin&version=2} status=0 QTime=3 
[junit4:junit4]   2> 28114 T51 C3 P31843 REQ /update {distrib.from=http://127.0.0.1:36679/solr/collection1/&update.distrib=TOLEADER&wt=javabin&version=2} status=0 QTime=10 
[junit4:junit4]   2> 28115 T40 C1 P36679 /update {wt=javabin&version=2} {add=[104]} 0 15
[junit4:junit4]   2> 28123 T24 C4 P11348 /update {wt=javabin&version=2} {add=[105 (1413775761216634880)]} 0 4
[junit4:junit4]   2> 28191 T76 C2 P62376 REQ /update {update.distrib=FROMLEADER&distrib.from=http://127.0.0.1:31843/solr/collection1/&wt=javabin&version=2} status=0 QTime=23 
[junit4:junit4]   2> 28192 T51 C3 P31843 REQ /update {distrib.from=http://127.0.0.1:36679/solr/collection1/&update.distrib=TOLEADER&wt=javabin&version=2} status=0 QTime=62 
[junit4:junit4]   2> 28193 T40 C1 P36679 /update {wt=javabin&version=2} {add=[105]} 0 67
[junit4:junit4]   2> 28201 T24 C4 P11348 /update {wt=javabin&version=2} {add=[106 (1413775761298423808)]} 0 3
[junit4:junit4]   2> 28220 T76 C2 P62376 REQ /update {update.distrib=FROMLEADER&distrib.from=http://127.0.0.1:31843/solr/collection1/&wt=javabin&version=2} status=0 QTime=5 
[junit4:junit4]   2> 28221 T51 C3 P31843 REQ /update {distrib.from=http://127.0.0.1:36679/solr/collection1/&update.distrib=TOLEADER&wt=javabin&version=2} status=0 QTime=14 
[junit4:junit4]   2> 28222 T40 C1 P36679 /update {wt=javabin&version=2} {add=[106]} 0 18
[junit4:junit4]   2> 28229 T24 C4 P11348 /update {wt=javabin&version=2} {add=[107 (1413775761328832512)]} 0 3
[junit4:junit4]   2> 28244 T62 C0 P58640 REQ /update {distrib.from=http://127.0.0.1:36679/solr/collection1/&update.distrib=FROMLEADER&wt=javabin&version=2} status=0 QTime=4 
[junit4:junit4]   2> 28245 T40 C1 P36679 /update {wt=javabin&version=2} {add=[107 (1413775761336172544)]} 0 12
[junit4:junit4]   2> 28252 T24 C4 P11348 /update {wt=javabin&version=2} {add=[108 (1413775761351901184)]} 0 4
[junit4:junit4]   2> 28265 T62 C0 P58640 REQ /update {distrib.from=http://127.0.0.1:36679/solr/c

[...truncated too long message...]

RecoveriesToFinish(AbstractFullDistribZkTestBase.java:565)
[junit4:junit4]    > 	at org.apache.solr.cloud.AbstractFullDistribZkTestBase.waitForThingsToLevelOut(AbstractFullDistribZkTestBase.java:1140)
[junit4:junit4]    > 	at org.apache.solr.cloud.SyncSliceTest.doTest(SyncSliceTest.java:162)
[junit4:junit4]    > 	at org.apache.solr.BaseDistributedSearchTestCase.testDistribSearch(BaseDistributedSearchTestCase.java:695)
[junit4:junit4]    > 	at sun.reflect.NativeMethodAccessorImpl.invoke0(Native Method)
[junit4:junit4]    > 	at sun.reflect.NativeMethodAccessorImpl.invoke(NativeMethodAccessorImpl.java:57)
[junit4:junit4]    > 	at sun.reflect.DelegatingMethodAccessorImpl.invoke(DelegatingMethodAccessorImpl.java:43)
[junit4:junit4]    > 	at java.lang.reflect.Method.invoke(Method.java:601)
[junit4:junit4]    > 	at com.carrotsearch.randomizedtesting.RandomizedRunner.invoke(RandomizedRunner.java:1559)
[junit4:junit4]    > 	at com.carrotsearch.randomizedtesting.RandomizedRunner.access$600(RandomizedRunner.java:79)
[junit4:junit4]    > 	at com.carrotsearch.randomizedtesting.RandomizedRunner$6.evaluate(RandomizedRunner.java:737)
[junit4:junit4]    > 	at com.carrotsearch.randomizedtesting.RandomizedRunner$7.evaluate(RandomizedRunner.java:773)
[junit4:junit4]    > 	at com.carrotsearch.randomizedtesting.RandomizedRunner$8.evaluate(RandomizedRunner.java:787)
[junit4:junit4]    > 	at com.carrotsearch.randomizedtesting.rules.SystemPropertiesRestoreRule$1.evaluate(SystemPropertiesRestoreRule.java:53)
[junit4:junit4]    > 	at org.apache.lucene.util.TestRuleSetupTeardownChained$1.evaluate(TestRuleSetupTeardownChained.java:50)
[junit4:junit4]    > 	at org.apache.lucene.util.TestRuleFieldCacheSanity$1.evaluate(TestRuleFieldCacheSanity.java:51)
[junit4:junit4]    > 	at org.apache.lucene.util.AbstractBeforeAfterRule$1.evaluate(AbstractBeforeAfterRule.java:45)
[junit4:junit4]    > 	at com.carrotsearch.randomizedtesting.rules.SystemPropertiesInvariantRule$1.evaluate(SystemPropertiesInvariantRule.java:55)
[junit4:junit4]    > 	at org.apache.lucene.util.TestRuleThreadAndTestName$1.evaluate(TestRuleThreadAndTestName.java:48)
[junit4:junit4]    > 	at org.apache.lucene.util.TestRuleIgnoreAfterMaxFailures$1.evaluate(TestRuleIgnoreAfterMaxFailures.java:70)
[junit4:junit4]    > 	at org.apache.lucene.util.TestRuleMarkFailure$1.evaluate(TestRuleMarkFailure.java:48)
[junit4:junit4]    > 	at com.carrotsearch.randomizedtesting.rules.StatementAdapter.evaluate(StatementAdapter.java:36)
[junit4:junit4]    > 	at com.carrotsearch.randomizedtesting.ThreadLeakControl$StatementRunner.run(ThreadLeakControl.java:358)
[junit4:junit4]    > 	at com.carrotsearch.randomizedtesting.ThreadLeakControl.forkTimeoutingTask(ThreadLeakControl.java:782)
[junit4:junit4]    > 	at com.carrotsearch.randomizedtesting.ThreadLeakControl$3.evaluate(ThreadLeakControl.java:442)
[junit4:junit4]    > 	at com.carrotsearch.randomizedtesting.RandomizedRunner.runSingleTest(RandomizedRunner.java:746)
[junit4:junit4]    > 	at com.carrotsearch.randomizedtesting.RandomizedRunner$3.evaluate(RandomizedRunner.java:648)
[junit4:junit4]    > 	at com.carrotsearch.randomizedtesting.RandomizedRunner$4.evaluate(RandomizedRunner.java:682)
[junit4:junit4]    > 	at com.carrotsearch.randomizedtesting.RandomizedRunner$5.evaluate(RandomizedRunner.java:693)
[junit4:junit4]    > 	at com.carrotsearch.randomizedtesting.rules.StatementAdapter.evaluate(StatementAdapter.java:36)
[junit4:junit4]    > 	at com.carrotsearch.randomizedtesting.rules.SystemPropertiesRestoreRule$1.evaluate(SystemPropertiesRestoreRule.java:53)
[junit4:junit4]    > 	at org.apache.lucene.util.AbstractBeforeAfterRule$1.evaluate(AbstractBeforeAfterRule.java:45)
[junit4:junit4]    > 	at org.apache.lucene.util.TestRuleStoreClassName$1.evaluate(TestRuleStoreClassName.java:42)
[junit4:junit4]    > 	at com.carrotsearch.randomizedtesting.rules.SystemPropertiesInvariantRule$1.evaluate(SystemPropertiesInvariantRule.java:55)
[junit4:junit4]    > 	at com.carrotsearch.randomizedtesting.rules.NoShadowingOrOverridesOnMethodsRule$1.evaluate(NoShadowingOrOverridesOnMethodsRule.java:39)
[junit4:junit4]    > 	at com.carrotsearch.randomizedtesting.rules.NoShadowingOrOverridesOnMethodsRule$1.evaluate(NoShadowingOrOverridesOnMethodsRule.java:39)
[junit4:junit4]    > 	at com.carrotsearch.randomizedtesting.rules.StatementAdapter.evaluate(StatementAdapter.java:36)
[junit4:junit4]    > 	at org.apache.lucene.util.TestRuleAssertionsRequired$1.evaluate(TestRuleAssertionsRequired.java:43)
[junit4:junit4]    > 	at org.apache.lucene.util.TestRuleMarkFailure$1.evaluate(TestRuleMarkFailure.java:48)
[junit4:junit4]    > 	at org.apache.lucene.util.TestRuleIgnoreAfterMaxFailures$1.evaluate(TestRuleIgnoreAfterMaxFailures.java:70)
[junit4:junit4]    > 	at org.apache.lucene.util.TestRuleIgnoreTestSuites$1.evaluate(TestRuleIgnoreTestSuites.java:55)
[junit4:junit4]    > 	at com.carrotsearch.randomizedtesting.rules.StatementAdapter.evaluate(StatementAdapter.java:36)
[junit4:junit4]    > 	at com.carrotsearch.randomizedtesting.ThreadLeakControl$StatementRunner.run(ThreadLeakControl.java:358)
[junit4:junit4]    > 	at java.lang.Thread.run(Thread.java:722)
[junit4:junit4]   2> 131964 T2734 oas.SolrTestCaseJ4.deleteCore ###deleteCore
[junit4:junit4]   2> NOTE: test params are: codec=Lucene40: {range_facet_l=PostingsFormat(name=SimpleText), text=PostingsFormat(name=TestBloomFilteredLucene40Postings), _version_=PostingsFormat(name=Memory doPackFST= true), rnd_b=Pulsing40(freqCutoff=14 minBlockSize=53 maxBlockSize=107), intDefault=PostingsFormat(name=Memory doPackFST= true), timestamp=PostingsFormat(name=SimpleText), id=Pulsing40(freqCutoff=14 minBlockSize=53 maxBlockSize=107), a_t=PostingsFormat(name=SimpleText), range_facet_sl=Pulsing40(freqCutoff=14 minBlockSize=53 maxBlockSize=107), range_facet_si=PostingsFormat(name=SimpleText), other_tl1=PostingsFormat(name=Memory doPackFST= true), multiDefault=PostingsFormat(name=SimpleText), a_si=PostingsFormat(name=Memory doPackFST= true)}, sim=RandomSimilarityProvider(queryNorm=false,coord=no): {}, locale=zh, timezone=Asia/Yakutsk
[junit4:junit4]   2> NOTE: FreeBSD 9.0-RELEASE amd64/Oracle Corporation 1.7.0_06 (64-bit)/cpus=16,threads=1,free=235569280,total=521142272
[junit4:junit4]   2> NOTE: All tests run in this JVM: [TestFiltering, TestFaceting, DirectSolrConnectionTest, TestIBSimilarityFactory, TestIndexingPerformance, TestSolrJ, SampleTest, BinaryUpdateRequestHandlerTest, FastVectorHighlighterTest, SuggesterWFSTTest, DirectUpdateHandlerOptimizeTest, TestSearchPerf, TestLFUCache, UpdateRequestProcessorFactoryTest, SolrCmdDistributorTest, CSVRequestHandlerTest, TestPerFieldSimilarity, PreAnalyzedFieldTest, TestLMDirichletSimilarityFactory, HighlighterConfigTest, DistributedSpellCheckComponentTest, TestJmxMonitoredMap, CopyFieldTest, JSONWriterTest, ResponseLogComponentTest, AlternateDirectoryTest, BadComponentTest, TestSolrQueryParser, TestFastWriter, BasicDistributedZkTest, QueryElevationComponentTest, TestStressReorder, CoreAdminHandlerTest, TestExtendedDismaxParser, TestStressVersions, MoreLikeThisHandlerTest, TestPHPSerializedResponseWriter, DateMathParserTest, TermsComponentTest, ClusterStateTest, NotRequiredUniqueKeyTest, AnalysisAfterCoreReloadTest, SolrCoreCheckLockOnStartupTest, TestCoreContainer, TestConfig, TestFastLRUCache, TestQueryTypes, IndexBasedSpellCheckerTest, AutoCommitTest, NoCacheHeaderTest, SearchHandlerTest, CircularListTest, SimplePostToolTest, TestDefaultSimilarityFactory, TestRandomFaceting, OverseerTest, SpellCheckComponentTest, TestReplicationHandler, LeaderElectionIntegrationTest, ZkControllerTest, SpellCheckCollatorTest, ZkSolrClientTest, WordBreakSolrSpellCheckerTest, TestHashPartitioner, DistributedTermsComponentTest, TestRecovery, TestJoin, TestRangeQuery, DirectUpdateHandlerTest, TestMultiCoreConfBootstrap, SimpleFacetsTest, TestSort, TestGroupingSearch, FileBasedSpellCheckerTest, ConvertedLegacyTest, PeerSyncTest, SortByFunctionTest, SignatureUpdateProcessorFactoryTest, TestBinaryResponseWriter, HighlighterTest, TestIndexSearcher, TestFunctionQuery, TestTrie, SolrRequestParserTest, TestRemoteStreaming, CacheHeaderTest, TestWordDelimiterFilterFactory, SpatialFilterTest, MBeansHandlerTest, CurrencyFieldTest, TestPseudoReturnFields, IndexSchemaTest, DistanceFunctionTest, XsltUpdateRequestHandlerTest, StandardRequestHandlerTest, FieldAnalysisRequestHandlerTest, TestSurroundQueryParser, TestValueSourceCache, TestOmitPositions, SuggesterFSTTest, UpdateParamsTest, BadIndexSchemaTest, FieldMutatingUpdateProcessorTest, TestBinaryField, TestPropInjectDefaults, TestXIncludeConfig, TestDocSet, TestCollationField, TestQuerySenderNoQuery, OutputWriterTest, TestSolrCoreProperties, TestPhraseSuggestions, TestCodecSupport, TimeZoneUtilsTest, PluginInfoTest, OpenExchangeRatesOrgProviderTest, ResourceLoaderTest, DateFieldTest, TestBadConfig, TestCharFilters, SyncSliceTest]
[junit4:junit4] Completed on J0 in 131.98s, 1 test, 1 failure <<< FAILURES!

[...truncated 11 lines...]
BUILD FAILED
/usr/home/hudson/hudson-slave/workspace/Lucene-Solr-Tests-trunk-java7/build.xml:32: The following error occurred while executing this line:
/usr/home/hudson/hudson-slave/workspace/Lucene-Solr-Tests-trunk-java7/solr/build.xml:179: The following error occurred while executing this line:
/usr/home/hudson/hudson-slave/workspace/Lucene-Solr-Tests-trunk-java7/lucene/module-build.xml:63: The following error occurred while executing this line:
/usr/home/hudson/hudson-slave/workspace/Lucene-Solr-Tests-trunk-java7/lucene/common-build.xml:1140: The following error occurred while executing this line:
/usr/home/hudson/hudson-slave/workspace/Lucene-Solr-Tests-trunk-java7/lucene/common-build.xml:813: There were test failures: 230 suites, 950 tests, 2 failures, 7 ignored (2 assumptions)

Total time: 31 minutes 52 seconds
Build step 'Invoke Ant' marked build as failure
Recording test results
Email was triggered for: Failure
Sending email for trigger: Failure



Mime
View raw message