lucene-dev mailing list archives

Site index · List index
Message view « Date » · « Thread »
Top « Date » · « Thread »
From Apache Jenkins Server <jenk...@builds.apache.org>
Subject [JENKINS] Lucene-Solr-Tests-trunk-java7 - Build # 3202 - Failure
Date Fri, 14 Sep 2012 08:26:26 GMT
Build: https://builds.apache.org/job/Lucene-Solr-Tests-trunk-java7/3202/

1 tests failed.
REGRESSION:  org.apache.solr.cloud.BasicDistributedZk2Test.testDistribSearch

Error Message:
No live SolrServers available to handle this request:[http://127.0.0.1:49951/solr/collection1, http://127.0.0.1:44139/solr/collection1, http://127.0.0.1:59593/solr/collection1, http://127.0.0.1:49956/solr/collection1]

Stack Trace:
org.apache.solr.client.solrj.SolrServerException: No live SolrServers available to handle this request:[http://127.0.0.1:49951/solr/collection1, http://127.0.0.1:44139/solr/collection1, http://127.0.0.1:59593/solr/collection1, http://127.0.0.1:49956/solr/collection1]
	at __randomizedtesting.SeedInfo.seed([4668E06DC1F16D14:C78E6E75B6AE0D28]:0)
	at org.apache.solr.client.solrj.impl.LBHttpSolrServer.request(LBHttpSolrServer.java:325)
	at org.apache.solr.client.solrj.impl.CloudSolrServer.request(CloudSolrServer.java:257)
	at org.apache.solr.client.solrj.request.QueryRequest.process(QueryRequest.java:90)
	at org.apache.solr.client.solrj.SolrServer.query(SolrServer.java:324)
	at org.apache.solr.cloud.AbstractFullDistribZkTestBase.queryServer(AbstractFullDistribZkTestBase.java:991)
	at org.apache.solr.BaseDistributedSearchTestCase.query(BaseDistributedSearchTestCase.java:390)
	at org.apache.solr.cloud.AbstractFullDistribZkTestBase.checkQueries(AbstractFullDistribZkTestBase.java:567)
	at org.apache.solr.cloud.BasicDistributedZk2Test.doTest(BasicDistributedZk2Test.java:77)
	at org.apache.solr.BaseDistributedSearchTestCase.testDistribSearch(BaseDistributedSearchTestCase.java:691)
	at sun.reflect.NativeMethodAccessorImpl.invoke0(Native Method)
	at sun.reflect.NativeMethodAccessorImpl.invoke(NativeMethodAccessorImpl.java:57)
	at sun.reflect.DelegatingMethodAccessorImpl.invoke(DelegatingMethodAccessorImpl.java:43)
	at java.lang.reflect.Method.invoke(Method.java:601)
	at com.carrotsearch.randomizedtesting.RandomizedRunner.invoke(RandomizedRunner.java:1559)
	at com.carrotsearch.randomizedtesting.RandomizedRunner.access$600(RandomizedRunner.java:79)
	at com.carrotsearch.randomizedtesting.RandomizedRunner$6.evaluate(RandomizedRunner.java:737)
	at com.carrotsearch.randomizedtesting.RandomizedRunner$7.evaluate(RandomizedRunner.java:773)
	at com.carrotsearch.randomizedtesting.RandomizedRunner$8.evaluate(RandomizedRunner.java:787)
	at com.carrotsearch.randomizedtesting.rules.SystemPropertiesRestoreRule$1.evaluate(SystemPropertiesRestoreRule.java:53)
	at org.apache.lucene.util.TestRuleSetupTeardownChained$1.evaluate(TestRuleSetupTeardownChained.java:50)
	at org.apache.lucene.util.TestRuleFieldCacheSanity$1.evaluate(TestRuleFieldCacheSanity.java:51)
	at org.apache.lucene.util.AbstractBeforeAfterRule$1.evaluate(AbstractBeforeAfterRule.java:45)
	at com.carrotsearch.randomizedtesting.rules.SystemPropertiesInvariantRule$1.evaluate(SystemPropertiesInvariantRule.java:55)
	at org.apache.lucene.util.TestRuleThreadAndTestName$1.evaluate(TestRuleThreadAndTestName.java:48)
	at org.apache.lucene.util.TestRuleIgnoreAfterMaxFailures$1.evaluate(TestRuleIgnoreAfterMaxFailures.java:70)
	at org.apache.lucene.util.TestRuleMarkFailure$1.evaluate(TestRuleMarkFailure.java:48)
	at com.carrotsearch.randomizedtesting.rules.StatementAdapter.evaluate(StatementAdapter.java:36)
	at com.carrotsearch.randomizedtesting.ThreadLeakControl$StatementRunner.run(ThreadLeakControl.java:358)
	at com.carrotsearch.randomizedtesting.ThreadLeakControl.forkTimeoutingTask(ThreadLeakControl.java:782)
	at com.carrotsearch.randomizedtesting.ThreadLeakControl$3.evaluate(ThreadLeakControl.java:442)
	at com.carrotsearch.randomizedtesting.RandomizedRunner.runSingleTest(RandomizedRunner.java:746)
	at com.carrotsearch.randomizedtesting.RandomizedRunner$3.evaluate(RandomizedRunner.java:648)
	at com.carrotsearch.randomizedtesting.RandomizedRunner$4.evaluate(RandomizedRunner.java:682)
	at com.carrotsearch.randomizedtesting.RandomizedRunner$5.evaluate(RandomizedRunner.java:693)
	at com.carrotsearch.randomizedtesting.rules.StatementAdapter.evaluate(StatementAdapter.java:36)
	at com.carrotsearch.randomizedtesting.rules.SystemPropertiesRestoreRule$1.evaluate(SystemPropertiesRestoreRule.java:53)
	at org.apache.lucene.util.AbstractBeforeAfterRule$1.evaluate(AbstractBeforeAfterRule.java:45)
	at org.apache.lucene.util.TestRuleStoreClassName$1.evaluate(TestRuleStoreClassName.java:42)
	at com.carrotsearch.randomizedtesting.rules.SystemPropertiesInvariantRule$1.evaluate(SystemPropertiesInvariantRule.java:55)
	at com.carrotsearch.randomizedtesting.rules.NoShadowingOrOverridesOnMethodsRule$1.evaluate(NoShadowingOrOverridesOnMethodsRule.java:39)
	at com.carrotsearch.randomizedtesting.rules.NoShadowingOrOverridesOnMethodsRule$1.evaluate(NoShadowingOrOverridesOnMethodsRule.java:39)
	at com.carrotsearch.randomizedtesting.rules.StatementAdapter.evaluate(StatementAdapter.java:36)
	at org.apache.lucene.util.TestRuleAssertionsRequired$1.evaluate(TestRuleAssertionsRequired.java:43)
	at org.apache.lucene.util.TestRuleMarkFailure$1.evaluate(TestRuleMarkFailure.java:48)
	at org.apache.lucene.util.TestRuleIgnoreAfterMaxFailures$1.evaluate(TestRuleIgnoreAfterMaxFailures.java:70)
	at org.apache.lucene.util.TestRuleIgnoreTestSuites$1.evaluate(TestRuleIgnoreTestSuites.java:55)
	at com.carrotsearch.randomizedtesting.rules.StatementAdapter.evaluate(StatementAdapter.java:36)
	at com.carrotsearch.randomizedtesting.ThreadLeakControl$StatementRunner.run(ThreadLeakControl.java:358)
	at java.lang.Thread.run(Thread.java:722)
Caused by: org.apache.solr.client.solrj.SolrServerException: Timeout occured while waiting response from server at: http://127.0.0.1:49956/solr/collection1
	at org.apache.solr.client.solrj.impl.HttpSolrServer.request(HttpSolrServer.java:410)
	at org.apache.solr.client.solrj.impl.HttpSolrServer.request(HttpSolrServer.java:182)
	at org.apache.solr.client.solrj.impl.LBHttpSolrServer.request(LBHttpSolrServer.java:290)
	... 48 more
Caused by: java.net.SocketTimeoutException: Read timed out
	at java.net.SocketInputStream.socketRead0(Native Method)
	at java.net.SocketInputStream.read(SocketInputStream.java:150)
	at java.net.SocketInputStream.read(SocketInputStream.java:121)
	at org.apache.http.impl.io.AbstractSessionInputBuffer.fillBuffer(AbstractSessionInputBuffer.java:149)
	at org.apache.http.impl.io.SocketInputBuffer.fillBuffer(SocketInputBuffer.java:111)
	at org.apache.http.impl.io.AbstractSessionInputBuffer.readLine(AbstractSessionInputBuffer.java:264)
	at org.apache.http.impl.conn.DefaultResponseParser.parseHead(DefaultResponseParser.java:98)
	at org.apache.http.impl.io.AbstractMessageParser.parse(AbstractMessageParser.java:252)
	at org.apache.http.impl.AbstractHttpClientConnection.receiveResponseHeader(AbstractHttpClientConnection.java:282)
	at org.apache.http.impl.conn.DefaultClientConnection.receiveResponseHeader(DefaultClientConnection.java:247)
	at org.apache.http.impl.conn.AbstractClientConnAdapter.receiveResponseHeader(AbstractClientConnAdapter.java:216)
	at org.apache.http.protocol.HttpRequestExecutor.doReceiveResponse(HttpRequestExecutor.java:298)
	at org.apache.http.protocol.HttpRequestExecutor.execute(HttpRequestExecutor.java:125)
	at org.apache.http.impl.client.DefaultRequestDirector.tryExecute(DefaultRequestDirector.java:647)
	at org.apache.http.impl.client.DefaultRequestDirector.execute(DefaultRequestDirector.java:464)
	at org.apache.http.impl.client.AbstractHttpClient.execute(AbstractHttpClient.java:820)
	at org.apache.http.impl.client.AbstractHttpClient.execute(AbstractHttpClient.java:754)
	at org.apache.http.impl.client.AbstractHttpClient.execute(AbstractHttpClient.java:732)
	at org.apache.solr.client.solrj.impl.HttpSolrServer.request(HttpSolrServer.java:353)
	... 50 more




Build Log:
[...truncated 8150 lines...]
[junit4:junit4] Suite: org.apache.solr.cloud.BasicDistributedZk2Test
[junit4:junit4]   2> 3 T816 oas.SolrTestCaseJ4.setUp ###Starting testDistribSearch
[junit4:junit4]   2> Creating dataDir: /usr/home/hudson/hudson-slave/workspace/Lucene-Solr-Tests-trunk-java7/solr/build/solr-core/test/J1/./solrtest-BasicDistributedZk2Test-1347610871850
[junit4:junit4]   2> 4 T816 oasc.ZkTestServer.run STARTING ZK TEST SERVER
[junit4:junit4]   2> 7 T817 oazs.ZooKeeperServer.setTickTime tickTime set to 3000
[junit4:junit4]   2> 7 T817 oazs.NIOServerCnxn$Factory.<init> binding to port 0.0.0.0/0.0.0.0:0
[junit4:junit4]   2> 8 T817 oazsp.FileTxnSnapLog.save Snapshotting: 0
[junit4:junit4]   2> 106 T816 oasc.ZkTestServer.run start zk server on port:11384
[junit4:junit4]   2> 106 T816 oaz.ZooKeeper.<init> Initiating client connection, connectString=127.0.0.1:11384 sessionTimeout=10000 watcher=org.apache.solr.common.cloud.ConnectionManager@1d85f293
[junit4:junit4]   2> 107 T822 oaz.ClientCnxn$SendThread.startConnect Opening socket connection to server /127.0.0.1:11384
[junit4:junit4]   2> 107 T816 oascc.ConnectionManager.waitForConnected Waiting for client to connect to ZooKeeper
[junit4:junit4]   2> 108 T822 oaz.ClientCnxn$SendThread.primeConnection Socket connection established to localhost/127.0.0.1:11384, initiating session
[junit4:junit4]   2> 109 T818 oazs.NIOServerCnxn$Factory.run Accepted socket connection from /140.211.11.196:47284
[junit4:junit4]   2> 109 T818 oazs.NIOServerCnxn.readConnectRequest Client attempting to establish new session at /140.211.11.196:47284
[junit4:junit4]   2> 109 T820 oazsp.FileTxnLog.append Creating new log file: log.1
[junit4:junit4]   2> 113 T820 oazs.NIOServerCnxn.finishSessionInit Established session 0x139c3de082f0000 with negotiated timeout 10000 for client /140.211.11.196:47284
[junit4:junit4]   2> 113 T822 oaz.ClientCnxn$SendThread.readConnectResult Session establishment complete on server localhost/127.0.0.1:11384, sessionid = 0x139c3de082f0000, negotiated timeout = 10000
[junit4:junit4]   2> 113 T823 oascc.ConnectionManager.process Watcher org.apache.solr.common.cloud.ConnectionManager@1d85f293 name:ZooKeeperConnection Watcher:127.0.0.1:11384 got event WatchedEvent state:SyncConnected type:None path:null path:null type:None
[junit4:junit4]   2> 113 T816 oascc.ConnectionManager.waitForConnected Client is connected to ZooKeeper
[junit4:junit4]   2> 113 T816 oascc.SolrZkClient.makePath makePath: /solr
[junit4:junit4]   2> 116 T821 oazs.PrepRequestProcessor.pRequest Processed session termination for sessionid: 0x139c3de082f0000
[junit4:junit4]   2> 117 T823 oaz.ClientCnxn$EventThread.run EventThread shut down
[junit4:junit4]   2> 117 T818 oazs.NIOServerCnxn.closeSock Closed socket connection for client /140.211.11.196:47284 which had sessionid 0x139c3de082f0000
[junit4:junit4]   2> 117 T816 oaz.ZooKeeper.close Session: 0x139c3de082f0000 closed
[junit4:junit4]   2> 118 T816 oaz.ZooKeeper.<init> Initiating client connection, connectString=127.0.0.1:11384/solr sessionTimeout=10000 watcher=org.apache.solr.common.cloud.ConnectionManager@126158d3
[junit4:junit4]   2> 119 T824 oaz.ClientCnxn$SendThread.startConnect Opening socket connection to server /127.0.0.1:11384
[junit4:junit4]   2> 119 T816 oascc.ConnectionManager.waitForConnected Waiting for client to connect to ZooKeeper
[junit4:junit4]   2> 119 T824 oaz.ClientCnxn$SendThread.primeConnection Socket connection established to localhost/127.0.0.1:11384, initiating session
[junit4:junit4]   2> 119 T818 oazs.NIOServerCnxn$Factory.run Accepted socket connection from /140.211.11.196:57497
[junit4:junit4]   2> 120 T818 oazs.NIOServerCnxn.readConnectRequest Client attempting to establish new session at /140.211.11.196:57497
[junit4:junit4]   2> 127 T820 oazs.NIOServerCnxn.finishSessionInit Established session 0x139c3de082f0001 with negotiated timeout 10000 for client /140.211.11.196:57497
[junit4:junit4]   2> 127 T824 oaz.ClientCnxn$SendThread.readConnectResult Session establishment complete on server localhost/127.0.0.1:11384, sessionid = 0x139c3de082f0001, negotiated timeout = 10000
[junit4:junit4]   2> 127 T825 oascc.ConnectionManager.process Watcher org.apache.solr.common.cloud.ConnectionManager@126158d3 name:ZooKeeperConnection Watcher:127.0.0.1:11384/solr got event WatchedEvent state:SyncConnected type:None path:null path:null type:None
[junit4:junit4]   2> 127 T816 oascc.ConnectionManager.waitForConnected Client is connected to ZooKeeper
[junit4:junit4]   2> 128 T816 oascc.SolrZkClient.makePath makePath: /collections/collection1
[junit4:junit4]   2> 131 T816 oascc.SolrZkClient.makePath makePath: /collections/collection1/shards
[junit4:junit4]   2> 142 T816 oascc.SolrZkClient.makePath makePath: /collections/control_collection
[junit4:junit4]   2> 144 T816 oascc.SolrZkClient.makePath makePath: /collections/control_collection/shards
[junit4:junit4]   2> 147 T816 oasc.AbstractZkTestCase.putConfig put /usr/home/hudson/hudson-slave/workspace/Lucene-Solr-Tests-trunk-java7/solr/build/solr-core/test-files/solr/collection1/conf/solrconfig.xml to /configs/conf1/solrconfig.xml
[junit4:junit4]   2> 148 T816 oascc.SolrZkClient.makePath makePath: /configs/conf1/solrconfig.xml
[junit4:junit4]   2> 163 T816 oasc.AbstractZkTestCase.putConfig put /usr/home/hudson/hudson-slave/workspace/Lucene-Solr-Tests-trunk-java7/solr/build/solr-core/test-files/solr/collection1/conf/schema.xml to /configs/conf1/schema.xml
[junit4:junit4]   2> 164 T816 oascc.SolrZkClient.makePath makePath: /configs/conf1/schema.xml
[junit4:junit4]   2> 268 T816 oasc.AbstractZkTestCase.putConfig put /usr/home/hudson/hudson-slave/workspace/Lucene-Solr-Tests-trunk-java7/solr/build/solr-core/test-files/solr/collection1/conf/solrconfig.xml to /configs/conf1/solrconfig.xml
[junit4:junit4]   2> 269 T816 oascc.SolrZkClient.makePath makePath: /configs/conf1/solrconfig.xml
[junit4:junit4]   2> 272 T816 oasc.AbstractZkTestCase.putConfig put /usr/home/hudson/hudson-slave/workspace/Lucene-Solr-Tests-trunk-java7/solr/build/solr-core/test-files/solr/collection1/conf/stopwords.txt to /configs/conf1/stopwords.txt
[junit4:junit4]   2> 272 T816 oascc.SolrZkClient.makePath makePath: /configs/conf1/stopwords.txt
[junit4:junit4]   2> 282 T816 oasc.AbstractZkTestCase.putConfig put /usr/home/hudson/hudson-slave/workspace/Lucene-Solr-Tests-trunk-java7/solr/build/solr-core/test-files/solr/collection1/conf/protwords.txt to /configs/conf1/protwords.txt
[junit4:junit4]   2> 282 T816 oascc.SolrZkClient.makePath makePath: /configs/conf1/protwords.txt
[junit4:junit4]   2> 285 T816 oasc.AbstractZkTestCase.putConfig put /usr/home/hudson/hudson-slave/workspace/Lucene-Solr-Tests-trunk-java7/solr/build/solr-core/test-files/solr/collection1/conf/currency.xml to /configs/conf1/currency.xml
[junit4:junit4]   2> 286 T816 oascc.SolrZkClient.makePath makePath: /configs/conf1/currency.xml
[junit4:junit4]   2> 289 T816 oasc.AbstractZkTestCase.putConfig put /usr/home/hudson/hudson-slave/workspace/Lucene-Solr-Tests-trunk-java7/solr/build/solr-core/test-files/solr/collection1/conf/open-exchange-rates.json to /configs/conf1/open-exchange-rates.json
[junit4:junit4]   2> 290 T816 oascc.SolrZkClient.makePath makePath: /configs/conf1/open-exchange-rates.json
[junit4:junit4]   2> 292 T816 oasc.AbstractZkTestCase.putConfig put /usr/home/hudson/hudson-slave/workspace/Lucene-Solr-Tests-trunk-java7/solr/build/solr-core/test-files/solr/collection1/conf/mapping-ISOLatin1Accent.txt to /configs/conf1/mapping-ISOLatin1Accent.txt
[junit4:junit4]   2> 293 T816 oascc.SolrZkClient.makePath makePath: /configs/conf1/mapping-ISOLatin1Accent.txt
[junit4:junit4]   2> 296 T816 oasc.AbstractZkTestCase.putConfig put /usr/home/hudson/hudson-slave/workspace/Lucene-Solr-Tests-trunk-java7/solr/build/solr-core/test-files/solr/collection1/conf/old_synonyms.txt to /configs/conf1/old_synonyms.txt
[junit4:junit4]   2> 296 T816 oascc.SolrZkClient.makePath makePath: /configs/conf1/old_synonyms.txt
[junit4:junit4]   2> 304 T816 oasc.AbstractZkTestCase.putConfig put /usr/home/hudson/hudson-slave/workspace/Lucene-Solr-Tests-trunk-java7/solr/build/solr-core/test-files/solr/collection1/conf/synonyms.txt to /configs/conf1/synonyms.txt
[junit4:junit4]   2> 304 T816 oascc.SolrZkClient.makePath makePath: /configs/conf1/synonyms.txt
[junit4:junit4]   2> 307 T821 oazs.PrepRequestProcessor.pRequest Processed session termination for sessionid: 0x139c3de082f0001
[junit4:junit4]   2> 308 T825 oaz.ClientCnxn$EventThread.run EventThread shut down
[junit4:junit4]   2> 308 T818 oazs.NIOServerCnxn.closeSock Closed socket connection for client /140.211.11.196:57497 which had sessionid 0x139c3de082f0001
[junit4:junit4]   2> 308 T816 oaz.ZooKeeper.close Session: 0x139c3de082f0001 closed
[junit4:junit4]   2> 311 T816 oejs.Server.doStart jetty-8.1.2.v20120308
[junit4:junit4]   2> 316 T816 oejs.AbstractConnector.doStart Started SocketConnector@0.0.0.0:27274
[junit4:junit4]   2> 317 T816 oasc.SolrResourceLoader.locateSolrHome JNDI not configured for solr (NoInitialContextEx)
[junit4:junit4]   2> 317 T816 oasc.SolrResourceLoader.locateSolrHome using system property solr.solr.home: /usr/home/hudson/hudson-slave/workspace/Lucene-Solr-Tests-trunk-java7/solr/build/solr-core/test-files/solr
[junit4:junit4]   2> 318 T816 oasc.SolrResourceLoader.<init> new SolrResourceLoader for deduced Solr Home: '/usr/home/hudson/hudson-slave/workspace/Lucene-Solr-Tests-trunk-java7/solr/build/solr-core/test-files/solr/'
[junit4:junit4]   2> 362 T816 oass.SolrDispatchFilter.init SolrDispatchFilter.init()
[junit4:junit4]   2> 363 T816 oasc.SolrResourceLoader.locateSolrHome JNDI not configured for solr (NoInitialContextEx)
[junit4:junit4]   2> 363 T816 oasc.SolrResourceLoader.locateSolrHome using system property solr.solr.home: /usr/home/hudson/hudson-slave/workspace/Lucene-Solr-Tests-trunk-java7/solr/build/solr-core/test-files/solr
[junit4:junit4]   2> 364 T816 oasc.CoreContainer$Initializer.initialize looking for solr.xml: /usr/home/hudson/hudson-slave/workspace/Lucene-Solr-Tests-trunk-java7/solr/build/solr-core/test-files/solr/solr.xml
[junit4:junit4]   2> 364 T816 oasc.CoreContainer.<init> New CoreContainer 314213431
[junit4:junit4]   2> 365 T816 oasc.CoreContainer.load Loading CoreContainer using Solr Home: '/usr/home/hudson/hudson-slave/workspace/Lucene-Solr-Tests-trunk-java7/solr/build/solr-core/test-files/solr/'
[junit4:junit4]   2> 365 T816 oasc.SolrResourceLoader.<init> new SolrResourceLoader for directory: '/usr/home/hudson/hudson-slave/workspace/Lucene-Solr-Tests-trunk-java7/solr/build/solr-core/test-files/solr/'
[junit4:junit4]   2> 398 T816 oasc.CoreContainer.load Registering Log Listener
[junit4:junit4]   2> 413 T816 oasc.CoreContainer.initZooKeeper Zookeeper client=127.0.0.1:11384/solr
[junit4:junit4]   2> 414 T816 oaz.ZooKeeper.<init> Initiating client connection, connectString=127.0.0.1:11384/solr sessionTimeout=8000 watcher=org.apache.solr.common.cloud.ConnectionManager@13192444
[junit4:junit4]   2> 415 T835 oaz.ClientCnxn$SendThread.startConnect Opening socket connection to server /127.0.0.1:11384
[junit4:junit4]   2> 415 T816 oascc.ConnectionManager.waitForConnected Waiting for client to connect to ZooKeeper
[junit4:junit4]   2> 416 T835 oaz.ClientCnxn$SendThread.primeConnection Socket connection established to localhost/127.0.0.1:11384, initiating session
[junit4:junit4]   2> 416 T818 oazs.NIOServerCnxn$Factory.run Accepted socket connection from /140.211.11.196:47418
[junit4:junit4]   2> 416 T818 oazs.NIOServerCnxn.readConnectRequest Client attempting to establish new session at /140.211.11.196:47418
[junit4:junit4]   2> 418 T820 oazs.NIOServerCnxn.finishSessionInit Established session 0x139c3de082f0002 with negotiated timeout 8000 for client /140.211.11.196:47418
[junit4:junit4]   2> 418 T835 oaz.ClientCnxn$SendThread.readConnectResult Session establishment complete on server localhost/127.0.0.1:11384, sessionid = 0x139c3de082f0002, negotiated timeout = 8000
[junit4:junit4]   2> 418 T836 oascc.ConnectionManager.process Watcher org.apache.solr.common.cloud.ConnectionManager@13192444 name:ZooKeeperConnection Watcher:127.0.0.1:11384/solr got event WatchedEvent state:SyncConnected type:None path:null path:null type:None
[junit4:junit4]   2> 418 T816 oascc.ConnectionManager.waitForConnected Client is connected to ZooKeeper
[junit4:junit4]   2> 420 T821 oazs.PrepRequestProcessor.pRequest Got user-level KeeperException when processing sessionid:0x139c3de082f0002 type:create cxid:0x2 zxid:0xfffffffffffffffe txntype:unknown reqpath:n/a Error Path:/solr/overseer Error:KeeperErrorCode = NodeExists for /solr/overseer
[junit4:junit4]   2> 430 T816 oascc.SolrZkClient.makePath makePath: /live_nodes
[junit4:junit4]   2> 432 T816 oasc.ZkController.createEphemeralLiveNode Register node as live in ZooKeeper:/live_nodes/127.0.0.1:27274_solr
[junit4:junit4]   2> 432 T821 oazs.PrepRequestProcessor.pRequest Got user-level KeeperException when processing sessionid:0x139c3de082f0002 type:delete cxid:0x7 zxid:0xfffffffffffffffe txntype:unknown reqpath:n/a Error Path:/solr/live_nodes/127.0.0.1:27274_solr Error:KeeperErrorCode = NoNode for /solr/live_nodes/127.0.0.1:27274_solr
[junit4:junit4]   2> 433 T816 oascc.SolrZkClient.makePath makePath: /live_nodes/127.0.0.1:27274_solr
[junit4:junit4]   2> 443 T816 oashc.HttpShardHandlerFactory.getParameter Setting socketTimeout to: 0
[junit4:junit4]   2> 443 T816 oashc.HttpShardHandlerFactory.getParameter Setting urlScheme to: http://
[junit4:junit4]   2> 444 T816 oashc.HttpShardHandlerFactory.getParameter Setting connTimeout to: 0
[junit4:junit4]   2> 444 T816 oashc.HttpShardHandlerFactory.getParameter Setting maxConnectionsPerHost to: 20
[junit4:junit4]   2> 445 T816 oashc.HttpShardHandlerFactory.getParameter Setting corePoolSize to: 0
[junit4:junit4]   2> 445 T816 oashc.HttpShardHandlerFactory.getParameter Setting maximumPoolSize to: 2147483647
[junit4:junit4]   2> 445 T816 oashc.HttpShardHandlerFactory.getParameter Setting maxThreadIdleTime to: 5
[junit4:junit4]   2> 446 T816 oashc.HttpShardHandlerFactory.getParameter Setting sizeOfQueue to: -1
[junit4:junit4]   2> 446 T816 oashc.HttpShardHandlerFactory.getParameter Setting fairnessPolicy to: false
[junit4:junit4]   2> 447 T816 oascsi.HttpClientUtil.createClient Creating new http client, config:maxConnectionsPerHost=20&maxConnections=10000&socketTimeout=0&connTimeout=0&retry=false
[junit4:junit4]   2> 463 T816 oascc.SolrZkClient.makePath makePath: /overseer_elect/election
[junit4:junit4]   2> 468 T821 oazs.PrepRequestProcessor.pRequest Got user-level KeeperException when processing sessionid:0x139c3de082f0002 type:delete cxid:0x15 zxid:0xfffffffffffffffe txntype:unknown reqpath:n/a Error Path:/solr/overseer_elect/leader Error:KeeperErrorCode = NoNode for /solr/overseer_elect/leader
[junit4:junit4]   2> 477 T816 oascc.SolrZkClient.makePath makePath: /overseer_elect/leader
[junit4:junit4]   2> 479 T816 oasc.Overseer.start Overseer (id=88317026097889282-127.0.0.1:27274_solr-n_0000000000) starting
[junit4:junit4]   2> 480 T821 oazs.PrepRequestProcessor.pRequest Got user-level KeeperException when processing sessionid:0x139c3de082f0002 type:create cxid:0x1a zxid:0xfffffffffffffffe txntype:unknown reqpath:n/a Error Path:/solr/overseer Error:KeeperErrorCode = NodeExists for /solr/overseer
[junit4:junit4]   2> 481 T821 oazs.PrepRequestProcessor.pRequest Got user-level KeeperException when processing sessionid:0x139c3de082f0002 type:create cxid:0x1b zxid:0xfffffffffffffffe txntype:unknown reqpath:n/a Error Path:/solr/overseer Error:KeeperErrorCode = NodeExists for /solr/overseer
[junit4:junit4]   2> 482 T821 oazs.PrepRequestProcessor.pRequest Got user-level KeeperException when processing sessionid:0x139c3de082f0002 type:create cxid:0x1c zxid:0xfffffffffffffffe txntype:unknown reqpath:n/a Error Path:/solr/overseer Error:KeeperErrorCode = NodeExists for /solr/overseer
[junit4:junit4]   2> 493 T821 oazs.PrepRequestProcessor.pRequest Got user-level KeeperException when processing sessionid:0x139c3de082f0002 type:create cxid:0x1d zxid:0xfffffffffffffffe txntype:unknown reqpath:n/a Error Path:/solr/overseer Error:KeeperErrorCode = NodeExists for /solr/overseer
[junit4:junit4]   2> 495 T838 oasc.OverseerCollectionProcessor.run Process current queue of collection creations
[junit4:junit4]   2> 495 T816 oascc.SolrZkClient.makePath makePath: /clusterstate.json
[junit4:junit4]   2> 504 T816 oascc.ZkStateReader.createClusterStateWatchersAndUpdate Updating cluster state from ZooKeeper... 
[junit4:junit4]   2> 506 T837 oasc.Overseer$ClusterStateUpdater.run Starting to work on the main queue
[junit4:junit4]   2> 510 T816 oasc.CoreContainer.create Creating SolrCore 'collection1' using instanceDir: /usr/home/hudson/hudson-slave/workspace/Lucene-Solr-Tests-trunk-java7/solr/build/solr-core/test-files/solr/collection1
[junit4:junit4]   2> 510 T816 oasc.ZkController.createCollectionZkNode Check for collection zkNode:control_collection
[junit4:junit4]   2> 511 T816 oasc.ZkController.createCollectionZkNode Collection zkNode exists
[junit4:junit4]   2> 511 T816 oasc.ZkController.readConfigName Load collection config from:/collections/control_collection
[junit4:junit4]   2> 512 T816 oasc.SolrResourceLoader.<init> new SolrResourceLoader for directory: '/usr/home/hudson/hudson-slave/workspace/Lucene-Solr-Tests-trunk-java7/solr/build/solr-core/test-files/solr/collection1/'
[junit4:junit4]   2> 513 T816 oasc.SolrResourceLoader.replaceClassLoader Adding 'file:/usr/home/hudson/hudson-slave/workspace/Lucene-Solr-Tests-trunk-java7/solr/build/solr-core/test-files/solr/collection1/lib/README' to classloader
[junit4:junit4]   2> 514 T816 oasc.SolrResourceLoader.replaceClassLoader Adding 'file:/usr/home/hudson/hudson-slave/workspace/Lucene-Solr-Tests-trunk-java7/solr/build/solr-core/test-files/solr/collection1/lib/classes/' to classloader
[junit4:junit4]   2> 551 T816 oasc.SolrConfig.<init> Using Lucene MatchVersion: LUCENE_50
[junit4:junit4]   2> 618 T816 oasc.SolrConfig.<init> Loaded SolrConfig: solrconfig.xml
[junit4:junit4]   2> 719 T816 oass.IndexSchema.readSchema Reading Solr Schema
[junit4:junit4]   2> 724 T816 oass.IndexSchema.readSchema Schema name=test
[junit4:junit4]   2> 1370 T816 oass.OpenExchangeRatesOrgProvider.init Initialized with rates=open-exchange-rates.json, refreshInterval=1440.
[junit4:junit4]   2> 1382 T816 oass.IndexSchema.readSchema default search field in schema is text
[junit4:junit4]   2> 1387 T816 oass.IndexSchema.readSchema unique key field: id
[junit4:junit4]   2> 1402 T816 oass.FileExchangeRateProvider.reload Reloading exchange rates from file currency.xml
[junit4:junit4]   2> 1407 T816 oass.FileExchangeRateProvider.reload Reloading exchange rates from file currency.xml
[junit4:junit4]   2> 1412 T816 oass.OpenExchangeRatesOrgProvider.reload Reloading exchange rates from open-exchange-rates.json
[junit4:junit4]   2> 1414 T816 oass.OpenExchangeRatesOrgProvider.reload Reloading exchange rates from open-exchange-rates.json
[junit4:junit4]   2> 1417 T816 oasc.SolrCore.<init> [collection1] Opening new SolrCore at /usr/home/hudson/hudson-slave/workspace/Lucene-Solr-Tests-trunk-java7/solr/build/solr-core/test-files/solr/collection1/, dataDir=./org.apache.solr.cloud.BasicDistributedZk2Test-1347610871850/control/data/
[junit4:junit4]   2> 1417 T816 oasc.JmxMonitoredMap.<init> JMX monitoring is enabled. Adding Solr mbeans to JMX Server: com.sun.jmx.mbeanserver.JmxMBeanServer@6d9c83b2
[junit4:junit4]   2> 1419 T816 oasc.SolrCore.getNewIndexDir WARNING New index directory detected: old=null new=./org.apache.solr.cloud.BasicDistributedZk2Test-1347610871850/control/data/index/
[junit4:junit4]   2> 1420 T816 oasc.SolrCore.initIndex WARNING [collection1] Solr index directory './org.apache.solr.cloud.BasicDistributedZk2Test-1347610871850/control/data/index' doesn't exist. Creating new index...
[junit4:junit4]   2> 1421 T816 oasc.CachingDirectoryFactory.get return new directory for /usr/home/hudson/hudson-slave/workspace/Lucene-Solr-Tests-trunk-java7/solr/build/solr-core/test/J1/./org.apache.solr.cloud.BasicDistributedZk2Test-1347610871850/control/data/index forceNew:false
[junit4:junit4]   2> 1498 T816 oasc.SolrDeletionPolicy.onCommit SolrDeletionPolicy.onCommit: commits:num=1
[junit4:junit4]   2> 		commit{dir=NRTCachingDirectory(org.apache.lucene.store.NIOFSDirectory@/usr/home/hudson/hudson-slave/workspace/Lucene-Solr-Tests-trunk-java7/solr/build/solr-core/test/J1/org.apache.solr.cloud.BasicDistributedZk2Test-1347610871850/control/data/index lockFactory=org.apache.lucene.store.NativeFSLockFactory@43375017; maxCacheMB=48.0 maxMergeSizeMB=4.0),segFN=segments_1,generation=1,filenames=[segments_1]
[junit4:junit4]   2> 1499 T816 oasc.SolrDeletionPolicy.updateCommits newest commit = 1
[junit4:junit4]   2> 1500 T816 oasc.SolrCore.initWriters created xml: solr.XMLResponseWriter
[junit4:junit4]   2> 1502 T816 oasup.UpdateRequestProcessorChain.init inserting DistributedUpdateProcessorFactory into updateRequestProcessorChain "dedupe"
[junit4:junit4]   2> 1503 T816 oasup.UpdateRequestProcessorChain.init inserting DistributedUpdateProcessorFactory into updateRequestProcessorChain "dedupe-allfields"
[junit4:junit4]   2> 1504 T816 oasup.UpdateRequestProcessorChain.init inserting DistributedUpdateProcessorFactory into updateRequestProcessorChain "stored_sig"
[junit4:junit4]   2> 1504 T816 oasup.UpdateRequestProcessorChain.init inserting DistributedUpdateProcessorFactory into updateRequestProcessorChain "uniq-fields"
[junit4:junit4]   2> 1505 T816 oasup.UpdateRequestProcessorChain.init inserting DistributedUpdateProcessorFactory into updateRequestProcessorChain "distrib-dup-test-chain-implicit"
[junit4:junit4]   2> 1506 T816 oasc.RequestHandlers.initHandlersFromConfig adding lazy requestHandler: solr.ReplicationHandler
[junit4:junit4]   2> 1506 T816 oasc.RequestHandlers.initHandlersFromConfig created /replication: solr.ReplicationHandler
[junit4:junit4]   2> 1507 T816 oasc.RequestHandlers.initHandlersFromConfig created standard: solr.StandardRequestHandler
[junit4:junit4]   2> 1508 T816 oasc.RequestHandlers.initHandlersFromConfig created /get: solr.RealTimeGetHandler
[junit4:junit4]   2> 1508 T816 oasc.RequestHandlers.initHandlersFromConfig created dismax: solr.SearchHandler
[junit4:junit4]   2> 1509 T816 oasc.RequestHandlers.initHandlersFromConfig created mock: org.apache.solr.core.MockQuerySenderListenerReqHandler
[junit4:junit4]   2> 1510 T816 oasc.RequestHandlers.initHandlersFromConfig created /admin/: org.apache.solr.handler.admin.AdminHandlers
[junit4:junit4]   2> 1510 T816 oasc.RequestHandlers.initHandlersFromConfig created defaults: solr.StandardRequestHandler
[junit4:junit4]   2> 1511 T816 oasc.RequestHandlers.initHandlersFromConfig adding lazy requestHandler: solr.StandardRequestHandler
[junit4:junit4]   2> 1512 T816 oasc.RequestHandlers.initHandlersFromConfig created lazy: solr.StandardRequestHandler
[junit4:junit4]   2> 1512 T816 oasc.RequestHandlers.initHandlersFromConfig created /update: solr.UpdateRequestHandler
[junit4:junit4]   2> 1513 T816 oasc.RequestHandlers.initHandlersFromConfig created /terms: org.apache.solr.handler.component.SearchHandler
[junit4:junit4]   2> 1514 T816 oasc.RequestHandlers.initHandlersFromConfig created spellCheckCompRH: org.apache.solr.handler.component.SearchHandler
[junit4:junit4]   2> 1514 T816 oasc.RequestHandlers.initHandlersFromConfig created spellCheckCompRH_Direct: org.apache.solr.handler.component.SearchHandler
[junit4:junit4]   2> 1515 T816 oasc.RequestHandlers.initHandlersFromConfig created spellCheckWithWordbreak: org.apache.solr.handler.component.SearchHandler
[junit4:junit4]   2> 1516 T816 oasc.RequestHandlers.initHandlersFromConfig created spellCheckWithWordbreak_Direct: org.apache.solr.handler.component.SearchHandler
[junit4:junit4]   2> 1516 T816 oasc.RequestHandlers.initHandlersFromConfig created spellCheckCompRH1: org.apache.solr.handler.component.SearchHandler
[junit4:junit4]   2> 1517 T816 oasc.RequestHandlers.initHandlersFromConfig created tvrh: org.apache.solr.handler.component.SearchHandler
[junit4:junit4]   2> 1518 T816 oasc.RequestHandlers.initHandlersFromConfig created /mlt: solr.MoreLikeThisHandler
[junit4:junit4]   2> 1518 T816 oasc.RequestHandlers.initHandlersFromConfig created /debug/dump: solr.DumpRequestHandler
[junit4:junit4]   2> 1523 T816 oashl.XMLLoader.init xsltCacheLifetimeSeconds=60
[junit4:junit4]   2> 1528 T816 oasc.SolrCore.initDeprecatedSupport WARNING solrconfig.xml uses deprecated <admin/gettableFiles>, Please update your config to use the ShowFileRequestHandler.
[junit4:junit4]   2> 1530 T816 oasc.SolrCore.initDeprecatedSupport WARNING adding ShowFileRequestHandler with hidden files: [SCHEMA.XML, OLD_SYNONYMS.TXT, STOPWORDS.TXT, PROTWORDS.TXT, OPEN-EXCHANGE-RATES.JSON, SYNONYMS.TXT, CURRENCY.XML, MAPPING-ISOLATIN1ACCENT.TXT]
[junit4:junit4]   2> 1535 T816 oass.SolrIndexSearcher.<init> Opening Searcher@3081d743 main
[junit4:junit4]   2> 1537 T816 oasu.CommitTracker.<init> Hard AutoCommit: disabled
[junit4:junit4]   2> 1538 T816 oasu.CommitTracker.<init> Soft AutoCommit: disabled
[junit4:junit4]   2> 1539 T816 oashc.SpellCheckComponent.inform Initializing spell checkers
[junit4:junit4]   2> 1595 T816 oass.DirectSolrSpellChecker.init init: {name=direct,classname=DirectSolrSpellChecker,field=lowerfilt,minQueryLength=3}
[junit4:junit4]   2> 1793 T839 oasc.SolrCore.registerSearcher [collection1] Registered new searcher Searcher@3081d743 main{StandardDirectoryReader(segments_1:1)}
[junit4:junit4]   2> 1799 T821 oazs.PrepRequestProcessor.pRequest Got user-level KeeperException when processing sessionid:0x139c3de082f0002 type:create cxid:0x56 zxid:0xfffffffffffffffe txntype:unknown reqpath:n/a Error Path:/solr/overseer/queue Error:KeeperErrorCode = NoNode for /solr/overseer/queue
[junit4:junit4]   2> 1815 T816 oasc.CoreContainer.register registering core: collection1
[junit4:junit4]   2> 1816 T816 oasc.ZkController.register Register shard - core:collection1 address:http://127.0.0.1:27274/solr shardId:control_shard
[junit4:junit4]   2> 1817 T816 oascc.SolrZkClient.makePath makePath: /collections/control_collection/leader_elect/control_shard/election
[junit4:junit4]   2> 1858 T821 oazs.PrepRequestProcessor.pRequest Got user-level KeeperException when processing sessionid:0x139c3de082f0002 type:delete cxid:0x65 zxid:0xfffffffffffffffe txntype:unknown reqpath:n/a Error Path:/solr/collections/control_collection/leaders Error:KeeperErrorCode = NoNode for /solr/collections/control_collection/leaders
[junit4:junit4]   2> 1859 T816 oasc.ShardLeaderElectionContext.runLeaderProcess Running the leader process. afterExpiration=false
[junit4:junit4]   2> 1860 T821 oazs.PrepRequestProcessor.pRequest Got user-level KeeperException when processing sessionid:0x139c3de082f0002 type:create cxid:0x66 zxid:0xfffffffffffffffe txntype:unknown reqpath:n/a Error Path:/solr/overseer Error:KeeperErrorCode = NodeExists for /solr/overseer
[junit4:junit4]   2> 1862 T816 oasc.ShardLeaderElectionContext.runLeaderProcess I am the new leader: http://127.0.0.1:27274/solr/collection1/
[junit4:junit4]   2> 1863 T816 oascc.SolrZkClient.makePath makePath: /collections/control_collection/leaders/control_shard
[junit4:junit4]   2> 1866 T821 oazs.PrepRequestProcessor.pRequest Got user-level KeeperException when processing sessionid:0x139c3de082f0002 type:create cxid:0x6f zxid:0xfffffffffffffffe txntype:unknown reqpath:n/a Error Path:/solr/overseer Error:KeeperErrorCode = NodeExists for /solr/overseer
[junit4:junit4]   2> 2013 T837 oascc.ZkStateReader.updateClusterState Updating cloud state from ZooKeeper... 
[junit4:junit4]   2> 2014 T821 oazs.PrepRequestProcessor.pRequest Got user-level KeeperException when processing sessionid:0x139c3de082f0002 type:create cxid:0x77 zxid:0xfffffffffffffffe txntype:unknown reqpath:n/a Error Path:/solr/overseer/queue-work Error:KeeperErrorCode = NoNode for /solr/overseer/queue-work
[junit4:junit4]   2> 2036 T836 oascc.ZkStateReader$2.process A cluster state change has occurred - updating...
[junit4:junit4]   2> 2072 T816 oasc.ZkController.register We are http://127.0.0.1:27274/solr/collection1/ and leader is http://127.0.0.1:27274/solr/collection1/
[junit4:junit4]   2> 2072 T816 oasc.ZkController.register No LogReplay needed for core=collection1 baseURL=http://127.0.0.1:27274/solr
[junit4:junit4]   2> 2073 T816 oasc.ZkController.checkRecovery I am the leader, no recovery necessary
[junit4:junit4]   2> 2074 T816 oascc.ZkStateReader.updateClusterState Updating cloud state from ZooKeeper... 
[junit4:junit4]   2> 2075 T816 oass.SolrDispatchFilter.init user.dir=/usr/home/hudson/hudson-slave/workspace/Lucene-Solr-Tests-trunk-java7/solr/build/solr-core/test/J1
[junit4:junit4]   2> 2075 T816 oass.SolrDispatchFilter.init SolrDispatchFilter.init() done
[junit4:junit4]   2> 2076 T816 oascsi.HttpClientUtil.createClient Creating new http client, config:maxConnections=128&maxConnectionsPerHost=32&followRedirects=false
[junit4:junit4]   2> 2086 T816 oejs.Server.doStart jetty-8.1.2.v20120308
[junit4:junit4]   2> 2089 T816 oejs.AbstractConnector.doStart Started SocketConnector@0.0.0.0:59593
[junit4:junit4]   2> 2089 T816 oasc.SolrResourceLoader.locateSolrHome JNDI not configured for solr (NoInitialContextEx)
[junit4:junit4]   2> 2090 T816 oasc.SolrResourceLoader.locateSolrHome using system property solr.solr.home: /usr/home/hudson/hudson-slave/workspace/Lucene-Solr-Tests-trunk-java7/solr/build/solr-core/test-files/solr
[junit4:junit4]   2> 2090 T816 oasc.SolrResourceLoader.<init> new SolrResourceLoader for deduced Solr Home: '/usr/home/hudson/hudson-slave/workspace/Lucene-Solr-Tests-trunk-java7/solr/build/solr-core/test-files/solr/'
[junit4:junit4]   2> 2120 T816 oass.SolrDispatchFilter.init SolrDispatchFilter.init()
[junit4:junit4]   2> 2120 T816 oasc.SolrResourceLoader.locateSolrHome JNDI not configured for solr (NoInitialContextEx)
[junit4:junit4]   2> 2121 T816 oasc.SolrResourceLoader.locateSolrHome using system property solr.solr.home: /usr/home/hudson/hudson-slave/workspace/Lucene-Solr-Tests-trunk-java7/solr/build/solr-core/test-files/solr
[junit4:junit4]   2> 2121 T816 oasc.CoreContainer$Initializer.initialize looking for solr.xml: /usr/home/hudson/hudson-slave/workspace/Lucene-Solr-Tests-trunk-java7/solr/build/solr-core/test-files/solr/solr.xml
[junit4:junit4]   2> 2121 T816 oasc.CoreContainer.<init> New CoreContainer 252486585
[junit4:junit4]   2> 2122 T816 oasc.CoreContainer.load Loading CoreContainer using Solr Home: '/usr/home/hudson/hudson-slave/workspace/Lucene-Solr-Tests-trunk-java7/solr/build/solr-core/test-files/solr/'
[junit4:junit4]   2> 2122 T816 oasc.SolrResourceLoader.<init> new SolrResourceLoader for directory: '/usr/home/hudson/hudson-slave/workspace/Lucene-Solr-Tests-trunk-java7/solr/build/solr-core/test-files/solr/'
[junit4:junit4]   2> 2146 T816 oasc.CoreContainer.load Registering Log Listener
[junit4:junit4]   2> 2157 T816 oasc.CoreContainer.initZooKeeper Zookeeper client=127.0.0.1:11384/solr
[junit4:junit4]   2> 2158 T816 oaz.ZooKeeper.<init> Initiating client connection, connectString=127.0.0.1:11384/solr sessionTimeout=8000 watcher=org.apache.solr.common.cloud.ConnectionManager@71cbe5bf
[junit4:junit4]   2> 2158 T849 oaz.ClientCnxn$SendThread.startConnect Opening socket connection to server /127.0.0.1:11384
[junit4:junit4]   2> 2159 T816 oascc.ConnectionManager.waitForConnected Waiting for client to connect to ZooKeeper
[junit4:junit4]   2> 2160 T849 oaz.ClientCnxn$SendThread.primeConnection Socket connection established to localhost/127.0.0.1:11384, initiating session
[junit4:junit4]   2> 2160 T818 oazs.NIOServerCnxn$Factory.run Accepted socket connection from /140.211.11.196:10320
[junit4:junit4]   2> 2160 T818 oazs.NIOServerCnxn.readConnectRequest Client attempting to establish new session at /140.211.11.196:10320
[junit4:junit4]   2> 2165 T820 oazs.NIOServerCnxn.finishSessionInit Established session 0x139c3de082f0003 with negotiated timeout 8000 for client /140.211.11.196:10320
[junit4:junit4]   2> 2165 T849 oaz.ClientCnxn$SendThread.readConnectResult Session establishment complete on server localhost/127.0.0.1:11384, sessionid = 0x139c3de082f0003, negotiated timeout = 8000
[junit4:junit4]   2> 2165 T850 oascc.ConnectionManager.process Watcher org.apache.solr.common.cloud.ConnectionManager@71cbe5bf name:ZooKeeperConnection Watcher:127.0.0.1:11384/solr got event WatchedEvent state:SyncConnected type:None path:null path:null type:None
[junit4:junit4]   2> 2166 T816 oascc.ConnectionManager.waitForConnected Client is connected to ZooKeeper
[junit4:junit4]   2> 2166 T821 oazs.PrepRequestProcessor.pRequest Got user-level KeeperException when processing sessionid:0x139c3de082f0003 type:create cxid:0x1 zxid:0xfffffffffffffffe txntype:unknown reqpath:n/a Error Path:/solr/overseer Error:KeeperErrorCode = NodeExists for /solr/overseer
[junit4:junit4]   2> 2167 T821 oazs.PrepRequestProcessor.pRequest Got user-level KeeperException when processing sessionid:0x139c3de082f0003 type:create cxid:0x2 zxid:0xfffffffffffffffe txntype:unknown reqpath:n/a Error Path:/solr/overseer Error:KeeperErrorCode = NodeExists for /solr/overseer
[junit4:junit4]   2> 2176 T816 oasc.ZkController.createEphemeralLiveNode Register node as live in ZooKeeper:/live_nodes/127.0.0.1:59593_solr
[junit4:junit4]   2> 2177 T821 oazs.PrepRequestProcessor.pRequest Got user-level KeeperException when processing sessionid:0x139c3de082f0003 type:delete cxid:0x4 zxid:0xfffffffffffffffe txntype:unknown reqpath:n/a Error Path:/solr/live_nodes/127.0.0.1:59593_solr Error:KeeperErrorCode = NoNode for /solr/live_nodes/127.0.0.1:59593_solr
[junit4:junit4]   2> 2178 T816 oascc.SolrZkClient.makePath makePath: /live_nodes/127.0.0.1:59593_solr
[junit4:junit4]   2> 2179 T836 oascc.ZkStateReader$3.process Updating live nodes
[junit4:junit4]   2> 2180 T816 oashc.HttpShardHandlerFactory.getParameter Setting socketTimeout to: 0
[junit4:junit4]   2> 2180 T816 oashc.HttpShardHandlerFactory.getParameter Setting urlScheme to: http://
[junit4:junit4]   2> 2181 T816 oashc.HttpShardHandlerFactory.getParameter Setting connTimeout to: 0
[junit4:junit4]   2> 2181 T816 oashc.HttpShardHandlerFactory.getParameter Setting maxConnectionsPerHost to: 20
[junit4:junit4]   2> 2181 T816 oashc.HttpShardHandlerFactory.getParameter Setting corePoolSize to: 0
[junit4:junit4]   2> 2182 T816 oashc.HttpShardHandlerFactory.getParameter Setting maximumPoolSize to: 2147483647
[junit4:junit4]   2> 2182 T816 oashc.HttpShardHandlerFactory.getParameter Setting maxThreadIdleTime to: 5
[junit4:junit4]   2> 2182 T816 oashc.HttpShardHandlerFactory.getParameter Setting sizeOfQueue to: -1
[junit4:junit4]   2> 2183 T816 oashc.HttpShardHandlerFactory.getParameter Setting fairnessPolicy to: false
[junit4:junit4]   2> 2183 T816 oascsi.HttpClientUtil.createClient Creating new http client, config:maxConnectionsPerHost=20&maxConnections=10000&socketTimeout=0&connTimeout=0&retry=false
[junit4:junit4]   2> 2193 T816 oascc.ZkStateReader.createClusterStateWatchersAndUpdate Updating cluster state from ZooKeeper... 
[junit4:junit4]   2> 2198 T816 oasc.CoreContainer.create Creating SolrCore 'collection1' using instanceDir: /usr/home/hudson/hudson-slave/workspace/Lucene-Solr-Tests-trunk-java7/solr/build/solr-core/test-files/solr/collection1
[junit4:junit4]   2> 2198 T816 oasc.ZkController.createCollectionZkNode Check for collection zkNode:collection1
[junit4:junit4]   2> 2199 T816 oasc.ZkController.createCollectionZkNode Collection zkNode exists
[junit4:junit4]   2> 2199 T816 oasc.ZkController.readConfigName Load collection config from:/collections/collection1
[junit4:junit4]   2> 2201 T816 oasc.SolrResourceLoader.<init> new SolrResourceLoader for directory: '/usr/home/hudson/hudson-slave/workspace/Lucene-Solr-Tests-trunk-java7/solr/build/solr-core/test-files/solr/collection1/'
[junit4:junit4]   2> 2202 T816 oasc.SolrResourceLoader.replaceClassLoader Adding 'file:/usr/home/hudson/hudson-slave/workspace/Lucene-Solr-Tests-trunk-java7/solr/build/solr-core/test-files/solr/collection1/lib/README' to classloader
[junit4:junit4]   2> 2202 T816 oasc.SolrResourceLoader.replaceClassLoader Adding 'file:/usr/home/hudson/hudson-slave/workspace/Lucene-Solr-Tests-trunk-java7/solr/build/solr-core/test-files/solr/collection1/lib/classes/' to classloader
[junit4:junit4]   2> 2239 T816 oasc.SolrConfig.<init> Using Lucene MatchVersion: LUCENE_50
[junit4:junit4]   2> 2290 T816 oasc.SolrConfig.<init> Loaded SolrConfig: solrconfig.xml
[junit4:junit4]   2> 2391 T816 oass.IndexSchema.readSchema Reading Solr Schema
[junit4:junit4]   2> 2396 T816 oass.IndexSchema.readSchema Schema name=test
[junit4:junit4]   2> 2542 T837 oascc.ZkStateReader.updateClusterState Updating cloud state from ZooKeeper... 
[junit4:junit4]   2> 2559 T850 oascc.ZkStateReader$2.process A cluster state change has occurred - updating...
[junit4:junit4]   2> 2559 T836 oascc.ZkStateReader$2.process A cluster state change has occurred - updating...
[junit4:junit4]   2> 2849 T816 oass.OpenExchangeRatesOrgProvider.init Initialized with rates=open-exchange-rates.json, refreshInterval=1440.
[junit4:junit4]   2> 2858 T816 oass.IndexSchema.readSchema default search field in schema is text
[junit4:junit4]   2> 2862 T816 oass.IndexSchema.readSchema unique key field: id
[junit4:junit4]   2> 2874 T816 oass.FileExchangeRateProvider.reload Reloading exchange rates from file currency.xml
[junit4:junit4]   2> 2879 T816 oass.FileExchangeRateProvider.reload Reloading exchange rates from file currency.xml
[junit4:junit4]   2> 2882 T816 oass.OpenExchangeRatesOrgProvider.reload Reloading exchange rates from open-exchange-rates.json
[junit4:junit4]   2> 2884 T816 oass.OpenExchangeRatesOrgProvider.reload Reloading exchange rates from open-exchange-rates.json
[junit4:junit4]   2> 2886 T816 oasc.SolrCore.<init> [collection1] Opening new SolrCore at /usr/home/hudson/hudson-slave/workspace/Lucene-Solr-Tests-trunk-java7/solr/build/solr-core/test-files/solr/collection1/, dataDir=./org.apache.solr.cloud.BasicDistributedZk2Test-1347610871850/jetty1/
[junit4:junit4]   2> 2886 T816 oasc.JmxMonitoredMap.<init> JMX monitoring is enabled. Adding Solr mbeans to JMX Server: com.sun.jmx.mbeanserver.JmxMBeanServer@6d9c83b2
[junit4:junit4]   2> 2887 T816 oasc.SolrCore.getNewIndexDir WARNING New index directory detected: old=null new=./org.apache.solr.cloud.BasicDistributedZk2Test-1347610871850/jetty1/index/
[junit4:junit4]   2> 2888 T816 oasc.SolrCore.initIndex WARNING [collection1] Solr index directory './org.apache.solr.cloud.BasicDistributedZk2Test-1347610871850/jetty1/index' doesn't exist. Creating new index...
[junit4:junit4]   2> 2889 T816 oasc.CachingDirectoryFactory.get return new directory for /usr/home/hudson/hudson-slave/workspace/Lucene-Solr-Tests-trunk-java7/solr/build/solr-core/test/J1/./org.apache.solr.cloud.BasicDistributedZk2Test-1347610871850/jetty1/index forceNew:false
[junit4:junit4]   2> 2904 T816 oasc.SolrDeletionPolicy.onCommit SolrDeletionPolicy.onCommit: commits:num=1
[junit4:junit4]   2> 		commit{dir=NRTCachingDirectory(org.apache.lucene.store.NIOFSDirectory@/usr/home/hudson/hudson-slave/workspace/Lucene-Solr-Tests-trunk-java7/solr/build/solr-core/test/J1/org.apache.solr.cloud.BasicDistributedZk2Test-1347610871850/jetty1/index lockFactory=org.apache.lucene.store.NativeFSLockFactory@785066ce; maxCacheMB=48.0 maxMergeSizeMB=4.0),segFN=segments_1,generation=1,filenames=[segments_1]
[junit4:junit4]   2> 2904 T816 oasc.SolrDeletionPolicy.updateCommits newest commit = 1
[junit4:junit4]   2> 2905 T816 oasc.SolrCore.initWriters created xml: solr.XMLResponseWriter
[junit4:junit4]   2> 2907 T816 oasup.UpdateRequestProcessorChain.init inserting DistributedUpdateProcessorFactory into updateRequestProcessorChain "dedupe"
[junit4:junit4]   2> 2908 T816 oasup.UpdateRequestProcessorChain.init inserting DistributedUpdateProcessorFactory into updateRequestProcessorChain "dedupe-allfields"
[junit4:junit4]   2> 2908 T816 oasup.UpdateRequestProcessorChain.init inserting DistributedUpdateProcessorFactory into updateRequestProcessorChain "stored_sig"
[junit4:junit4]   2> 2908 T816 oasup.UpdateRequestProcessorChain.init inserting DistributedUpdateProcessorFactory into updateRequestProcessorChain "uniq-fields"
[junit4:junit4]   2> 2909 T816 oasup.UpdateRequestProcessorChain.init inserting DistributedUpdateProcessorFactory into updateRequestProcessorChain "distrib-dup-test-chain-implicit"
[junit4:junit4]   2> 2909 T816 oasc.RequestHandlers.initHandlersFromConfig adding lazy requestHandler: solr.ReplicationHandler
[junit4:junit4]   2> 2910 T816 oasc.RequestHandlers.initHandlersFromConfig created /replication: solr.ReplicationHandler
[junit4:junit4]   2> 2911 T816 oasc.RequestHandlers.initHandlersFromConfig created standard: solr.StandardRequestHandler
[junit4:junit4]   2> 2911 T816 oasc.RequestHandlers.initHandlersFromConfig created /get: solr.RealTimeGetHandler
[junit4:junit4]   2> 2912 T816 oasc.RequestHandlers.initHandlersFromConfig created dismax: solr.SearchHandler
[junit4:junit4]   2> 2912 T816 oasc.RequestHandlers.initHandlersFromConfig created mock: org.apache.solr.core.MockQuerySenderListenerReqHandler
[junit4:junit4]   2> 2913 T816 oasc.RequestHandlers.initHandlersFromConfig created /admin/: org.apache.solr.handler.admin.AdminHandlers
[junit4:junit4]   2> 2913 T816 oasc.RequestHandlers.initHandlersFromConfig created defaults: solr.StandardRequestHandler
[junit4:junit4]   2> 2914 T816 oasc.RequestHandlers.initHandlersFromConfig adding lazy requestHandler: solr.StandardRequestHandler
[junit4:junit4]   2> 2914 T816 oasc.RequestHandlers.initHandlersFromConfig created lazy: solr.StandardRequestHandler
[junit4:junit4]   2> 2915 T816 oasc.RequestHandlers.initHandlersFromConfig created /update: solr.UpdateRequestHandler
[junit4:junit4]   2> 2915 T816 oasc.RequestHandlers.initHandlersFromConfig created /terms: org.apache.solr.handler.component.SearchHandler
[junit4:junit4]   2> 2916 T816 oasc.RequestHandlers.initHandlersFromConfig created spellCheckCompRH: org.apache.solr.handler.component.SearchHandler
[junit4:junit4]   2> 2916 T816 oasc.RequestHandlers.initHandlersFromConfig created spellCheckCompRH_Direct: org.apache.solr.handler.component.SearchHandler
[junit4:junit4]   2> 2917 T816 oasc.RequestHandlers.initHandlersFromConfig created spellCheckWithWordbreak: org.apache.solr.handler.component.SearchHandler
[junit4:junit4]   2> 2917 T816 oasc.RequestHandlers.initHandlersFromConfig created spellCheckWithWordbreak_Direct: org.apache.solr.handler.component.SearchHandler
[junit4:junit4]   2> 2918 T816 oasc.RequestHandlers.initHandlersFromConfig created spellCheckCompRH1: org.apache.solr.handler.component.SearchHandler
[junit4:junit4]   2> 2919 T816 oasc.RequestHandlers.initHandlersFromConfig created tvrh: org.apache.solr.handler.component.SearchHandler
[junit4:junit4]   2> 2919 T816 oasc.RequestHandlers.initHandlersFromConfig created /mlt: solr.MoreLikeThisHandler
[junit4:junit4]   2> 2920 T816 oasc.RequestHandlers.initHandlersFromConfig created /debug/dump: solr.DumpRequestHandler
[junit4:junit4]   2> 2923 T816 oashl.XMLLoader.init xsltCacheLifetimeSeconds=60
[junit4:junit4]   2> 2927 T816 oasc.SolrCore.initDeprecatedSupport WARNING solrconfig.xml uses deprecated <admin/gettableFiles>, Please update your config to use the ShowFileRequestHandler.
[junit4:junit4]   2> 2928 T816 oasc.SolrCore.initDeprecatedSupport WARNING adding ShowFileRequestHandler with hidden files: [SCHEMA.XML, OLD_SYNONYMS.TXT, STOPWORDS.TXT, PROTWORDS.TXT, OPEN-EXCHANGE-RATES.JSON, SYNONYMS.TXT, CURRENCY.XML, MAPPING-ISOLATIN1ACCENT.TXT]
[junit4:junit4]   2> 2931 T816 oass.SolrIndexSearcher.<init> Opening Searcher@4eff5453 main
[junit4:junit4]   2> 2932 T816 oasu.CommitTracker.<init> Hard AutoCommit: disabled
[junit4:junit4]   2> 2933 T816 oasu.CommitTracker.<init> Soft AutoCommit: disabled
[junit4:junit4]   2> 2933 T816 oashc.SpellCheckComponent.inform Initializing spell checkers
[junit4:junit4]   2> 2950 T816 oass.DirectSolrSpellChecker.init init: {name=direct,classname=DirectSolrSpellChecker,field=lowerfilt,minQueryLength=3}
[junit4:junit4]   2> 3008 T851 oasc.SolrCore.registerSearcher [collection1] Registered new searcher Searcher@4eff5453 main{StandardDirectoryReader(segments_1:1)}
[junit4:junit4]   2> 3063 T837 oascc.ZkStateReader.updateClusterState Updating cloud state from ZooKeeper... 
[junit4:junit4]   2> 3075 T836 oascc.ZkStateReader$2.process A cluster state change has occurred - updating...
[junit4:junit4]   2> 3075 T850 oascc.ZkStateReader$2.process A cluster state change has occurred - updating...
[junit4:junit4]   2> 3515 T816 oasc.CoreContainer.register registering core: collection1
[junit4:junit4]   2> 3515 T816 oasc.ZkController.register Register shard - core:collection1 address:http://127.0.0.1:59593/solr shardId:shard1
[junit4:junit4]   2> 3516 T816 oascc.SolrZkClient.makePath makePath: /collections/collection1/leader_elect/shard1/election
[junit4:junit4]   2> 3540 T821 oazs.PrepRequestProcessor.pRequest Got user-level KeeperException when processing sessionid:0x139c3de082f0003 type:delete cxid:0x43 zxid:0xfffffffffffffffe txntype:unknown reqpath:n/a Error Path:/solr/collections/collection1/leaders Error:KeeperErrorCode = NoNode for /solr/collections/collection1/leaders
[junit4:junit4]   2> 3541 T816 oasc.ShardLeaderElectionContext.runLeaderProcess Running the leader process. afterExpiration=false
[junit4:junit4]   2> 3542 T821 oazs.PrepRequestProcessor.pRequest Got user-level KeeperException when processing sessionid:0x139c3de082f0003 type:create cxid:0x44 zxid:0xfffffffffffffffe txntype:unknown reqpath:n/a Error Path:/solr/overseer Error:KeeperErrorCode = NodeExists for /solr/overseer
[junit4:junit4]   2> 3553 T816 oasc.ShardLeaderElectionContext.runLeaderProcess I am the new leader: http://127.0.0.1:59593/solr/collection1/
[junit4:junit4]   2> 3553 T816 oascc.SolrZkClient.makePath makePath: /collections/collection1/leaders/shard1
[junit4:junit4]   2> 3564 T821 oazs.PrepRequestProcessor.pRequest Got user-level KeeperException when processing sessionid:0x139c3de082f0003 type:create cxid:0x4d zxid:0xfffffffffffffffe txntype:unknown reqpath:n/a Error Path:/solr/overseer Error:KeeperErrorCode = NodeExists for /solr/overseer
[junit4:junit4]   2> 3579 T837 oascc.ZkStateReader.updateClusterState Updating cloud state from ZooKeeper... 
[junit4:junit4]   2> 3584 T836 oascc.ZkStateReader$2.process A cluster state change has occurred - updating...
[junit4:junit4]   2> 3584 T850 oascc.ZkStateReader$2.process A cluster state change has occurred - updating...
[junit4:junit4]   2> 3617 T816 oasc.ZkController.register We are http://127.0.0.1:59593/solr/collection1/ and leader is http://127.0.0.1:59593/solr/collection1/
[junit4:junit4]   2> 3617 T816 oasc.ZkController.register No LogReplay needed for core=collection1 baseURL=http://127.0.0.1:59593/solr
[junit4:junit4]   2> 3618 T816 oasc.ZkController.checkRecovery I am the leader, no recovery necessary
[junit4:junit4]   2> 3620 T816 oascc.ZkStateReader.updateClusterState Updating cloud state from ZooKeeper... 
[junit4:junit4]   2> 3621 T816 oass.SolrDispatchFilter.init user.dir=/usr/home/hudson/hudson-slave/workspace/Lucene-Solr-Tests-trunk-java7/solr/build/solr-core/test/J1
[junit4:junit4]   2> 3621 T816 oass.SolrDispatchFilter.init SolrDispatchFilter.init() done
[junit4:junit4]   2> 3622 T816 oascsi.HttpClientUtil.createClient Creating new http client, config:maxConnections=128&maxConnectionsPerHost=32&followRedirects=false
[junit4:junit4]   2> 3634 T816 oejs.Server.doStart jetty-8.1.2.v20120308
[junit4:junit4]   2> 3637 T816 oejs.AbstractConnector.doStart Started SocketConnector@0.0.0.0:44139
[junit4:junit4]   2> 3637 T816 oasc.SolrResourceLoader.locateSolrHome JNDI not configured for solr (NoInitialContextEx)
[junit4:junit4]   2> 3637 T816 oasc.SolrResourceLoader.locateSolrHome using system property solr.solr.home: /usr/home/hudson/hudson-slave/workspace/Lucene-Solr-Tests-trunk-java7/solr/build/solr-core/test-files/solr
[junit4:junit4]   2> 3638 T816 oasc.SolrResourceLoader.<init> new SolrResourceLoader for deduced Solr Home: '/usr/home/hudson/hudson-slave/workspace/Lucene-Solr-Tests-trunk-java7/solr/build/solr-core/test-files/solr/'
[junit4:junit4]   2> 3669 T816 oass.SolrDispatchFilter.init SolrDispatchFilter.init()
[junit4:junit4]   2> 3669 T816 oasc.SolrResourceLoader.locateSolrHome JNDI not configured for solr (NoInitialContextEx)
[junit4:junit4]   2> 3669 T816 oasc.SolrResourceLoader.locateSolrHome using system property solr.solr.home: /usr/home/hudson/hudson-slave/workspace/Lucene-Solr-Tests-trunk-java7/solr/build/solr-core/test-files/solr
[junit4:junit4]   2> 3670 T816 oasc.CoreContainer$Initializer.initialize looking for solr.xml: /usr/home/hudson/hudson-slave/workspace/Lucene-Solr-Tests-trunk-java7/solr/build/solr-core/test-files/solr/solr.xml
[junit4:junit4]   2> 3670 T816 oasc.CoreContainer.<init> New CoreContainer 155389476
[junit4:junit4]   2> 3671 T816 oasc.CoreContainer.load Loading CoreContainer using Solr Home: '/usr/home/hudson/hudson-slave/workspace/Lucene-Solr-Tests-trunk-java7/solr/build/solr-core/test-files/solr/'
[junit4:junit4]   2> 3671 T816 oasc.SolrResourceLoader.<init> new SolrResourceLoader for directory: '/usr/home/hudson/hudson-slave/workspace/Lucene-Solr-Tests-trunk-java7/solr/build/solr-core/test-files/solr/'
[junit4:junit4]   2> 3693 T816 oasc.CoreContainer.load Registering Log Listener
[junit4:junit4]   2> 3704 T816 oasc.CoreContainer.initZooKeeper Zookeeper client=127.0.0.1:11384/solr
[junit4:junit4]   2> 3704 T816 oaz.ZooKeeper.<init> Initiating client connection, connectString=127.0.0.1:11384/solr sessionTimeout=8000 watcher=org.apache.solr.common.cloud.ConnectionManager@3d5e9ac7
[junit4:junit4]   2> 3705 T861 oaz.ClientCnxn$SendThread.startConnect Opening socket connection to server /127.0.0.1:11384
[junit4:junit4]   2> 3705 T816 oascc.ConnectionManager.waitForConnected Waiting for client to connect to ZooKeeper
[junit4:junit4]   2> 3706 T861 oaz.ClientCnxn$SendThread.primeConnection Socket connection established to localhost/127.0.0.1:11384, initiating session
[junit4:junit4]   2> 3707 T818 oazs.NIOServerCnxn$Factory.run Accepted socket connection from /140.211.11.196:30015
[junit4:junit4]   2> 3707 T818 oazs.NIOServerCnxn.readConnectRequest Client attempting to establish new session at /140.211.11.196:30015
[junit4:junit4]   2> 3708 T820 oazs.NIOServerCnxn.finishSessionInit Established session 0x139c3de082f0004 with negotiated timeout 8000 for client /140.211.11.196:30015
[junit4:junit4]   2> 3708 T861 oaz.ClientCnxn$SendThread.readConnectResult Session establishment complete on server localhost/127.0.0.1:11384, sessionid = 0x139c3de082f0004, negotiated timeout = 8000
[junit4:junit4]   2> 3709 T862 oascc.ConnectionManager.process Watcher org.apache.solr.common.cloud.ConnectionManager@3d5e9ac7 name:ZooKeeperConnection Watcher:127.0.0.1:11384/solr got event WatchedEvent state:SyncConnected type:None path:null path:null type:None
[junit4:junit4]   2> 3709 T816 oascc.ConnectionManager.waitForConnected Client is connected to ZooKeeper
[junit4:junit4]   2> 3709 T821 oazs.PrepRequestProcessor.pRequest Got user-level KeeperException when processing sessionid:0x139c3de082f0004 type:create cxid:0x1 zxid:0xfffffffffffffffe txntype:unknown reqpath:n/a Error Path:/solr/overseer Error:KeeperErrorCode = NodeExists for /solr/overseer
[junit4:junit4]   2> 3716 T821 oazs.PrepRequestProcessor.pRequest Got user-level KeeperException when processing sessionid:0x139c3de082f0004 type:create cxid:0x2 zxid:0xfffffffffffffffe txntype:unknown reqpath:n/a Error Path:/solr/overseer Error:KeeperErrorCode = NodeExists for /solr/overseer
[junit4:junit4]   2> 3718 T816 oasc.ZkController.createEphemeralLiveNode Register node as live in ZooKeeper:/live_nodes/127.0.0.1:44139_solr
[junit4:junit4]   2> 3718 T821 oazs.PrepRequestProcessor.pRequest Got user-level KeeperException when processing sessionid:0x139c3de082f0004 type:delete cxid:0x4 zxid:0xfffffffffffffffe txntype:unknown reqpath:n/a Error Path:/solr/live_nodes/127.0.0.1:44139_solr Error:KeeperErrorCode = NoNode for /solr/live_nodes/127.0.0.1:44139_solr
[junit4:junit4]   2> 3728 T816 oascc.SolrZkClient.makePath makePath: /live_nodes/127.0.0.1:44139_solr
[junit4:junit4]   2> 3730 T850 oascc.ZkStateReader$3.process Updating live nodes
[junit4:junit4]   2> 3730 T836 oascc.ZkStateReader$3.process Updating live nodes
[junit4:junit4]   2> 3731 T816 oashc.HttpShardHandlerFactory.getParameter Setting socketTimeout to: 0
[junit4:junit4]   2> 3732 T816 oashc.HttpShardHandlerFactory.getParameter Setting urlScheme to: http://
[junit4:junit4]   2> 3732 T816 oashc.HttpShardHandlerFactory.getParameter Setting connTimeout to: 0
[junit4:junit4]   2> 3732 T816 oashc.HttpShardHandlerFactory.getParameter Setting maxConnectionsPerHost to: 20
[junit4:junit4]   2> 3733 T816 oashc.HttpShardHandlerFactory.getParameter Setting corePoolSize to: 0
[junit4:junit4]   2> 3733 T816 oashc.HttpShardHandlerFactory.getParameter Setting maximumPoolSize to: 2147483647
[junit4:junit4]   2> 3733 T816 oashc.HttpShardHandlerFactory.getParameter Setting maxThreadIdleTime to: 5
[junit4:junit4]   2> 3734 T816 oashc.HttpShardHandlerFactory.getParameter Setting sizeOfQueue to: -1
[junit4:junit4]   2> 3734 T816 oashc.HttpShardHandlerFactory.getParameter Setting fairnessPolicy to: false
[junit4:junit4]   2> 3734 T816 oascsi.HttpClientUtil.createClient Creating new http client, config:maxConnectionsPerHost=20&maxConnections=10000&socketTimeout=0&connTimeout=0&retry=false
[junit4:junit4]   2> 3753 T816 oascc.ZkStateReader.createClusterStateWatchersAndUpdate Updating cluster state from ZooKeeper... 
[junit4:junit4]   2> 3758 T816 oasc.CoreContainer.create Creating SolrCore 'collection1' using instanceDir: /usr/home/hudson/hudson-slave/workspace/Lucene-Solr-Tests-trunk-java7/solr/build/solr-core/test-files/solr/collection1
[junit4:junit4]   2> 3759 T816 oasc.ZkController.createCollectionZkNode Check for collection zkNode:collection1
[junit4:junit4]   2> 3759 T816 oasc.ZkController.createCollectionZkNode Collection zkNode exists
[junit4:junit4]   2> 3760 T816 oasc.ZkController.readConfigName Load collection config from:/collections/collection1
[junit4:junit4]   2> 3761 T816 oasc.SolrResourceLoader.<init> new SolrResourceLoader for directory: '/usr/home/hudson/hudson-slave/workspace/Lucene-Solr-Tests-trunk-java7/solr/build/solr-core/test-files/solr/collection1/'
[junit4:junit4]   2> 3762 T816 oasc.SolrResourceLoader.replaceClassLoader Adding 'file:/usr/home/hudson/hudson-slave/workspace/Lucene-Solr-Tests-trunk-java7/solr/build/solr-core/test-files/solr/collection1/lib/README' to classloader
[junit4:junit4]   2> 3762 T816 oasc.SolrResourceLoader.replaceClassLoader Adding 'file:/usr/home/hudson/hudson-slave/workspace/Lucene-Solr-Tests-trunk-java7/solr/build/solr-core/test-files/solr/collection1/lib/classes/' to classloader
[junit4:junit4]   2> 3798 T816 oasc.SolrConfig.<init> Using Lucene MatchVersion: LUCENE_50
[junit4:junit4]   2> 3871 T816 oasc.SolrConfig.<init> Loaded SolrConfig: solrconfig.xml
[junit4:junit4]   2> 3973 T816 oass.IndexSchema.readSchema Reading Solr Schema
[junit4:junit4]   2> 3980 T816 oass.IndexSchema.readSchema Schema name=test
[junit4:junit4]   2> 4089 T837 oascc.ZkStateReader.updateClusterState Updating cloud state from ZooKeeper... 
[junit4:junit4]   2> 4108 T836 oascc.ZkStateReader$2.process A cluster state change has occurred - updating...
[junit4:junit4]   2> 4108 T862 oascc.ZkStateReader$2.process A cluster state change has occurred - updating...
[junit4:junit4]   2> 4108 T850 oascc.ZkStateReader$2.process A cluster state change has occurred - updating...
[junit4:junit4]   2> 4606 T816 oass.OpenExchangeRatesOrgProvider.init Initialized with rates=open-exchange-rates.json, refreshInterval=1440.
[junit4:junit4]   2> 4631 T816 oass.IndexSchema.readSchema default search field in schema is text
[junit4:junit4]   2> 4636 T816 oass.IndexSchema.readSchema unique key field: id
[junit4:junit4]   2> 4652 T816 oass.FileExchangeRateProvider.reload Reloading exchange rates from file currency.xml
[junit4:junit4]   2> 4657 T816 oass.FileExchangeRateProvider.reload Reloading exchange rates from file currency.xml
[junit4:junit4]   2> 4662 T816 oass.OpenExchangeRatesOrgProvider.reload Reloading exchange rates from open-exchange-rates.json
[junit4:junit4]   2> 4664 T816 oass.OpenExchangeRatesOrgProvider.reload Reloading exchange rates from open-exchange-rates.json
[junit4:junit4]   2> 4667 T816 oasc.SolrCore.<init> [collection1] Opening new SolrCore at /usr/home/hudson/hudson-slave/workspace/Lucene-Solr-Tests-trunk-java7/solr/build/solr-core/test-files/solr/collection1/, dataDir=./org.apache.solr.cloud.BasicDistributedZk2Test-1347610871850/jetty2/
[junit4:junit4]   2> 4667 T816 oasc.JmxMonitoredMap.<init> JMX monitoring is enabled. Adding Solr mbeans to JMX Server: com.sun.jmx.mbeanserver.JmxMBeanServer@6d9c83b2
[junit4:junit4]   2> 4669 T816 oasc.SolrCore.getNewIndexDir WARNING New index directory detected: old=null new=./org.apache.solr.cloud.BasicDistributedZk2Test-1347610871850/jetty2/index/
[junit4:junit4]   2> 4670 T816 oasc.SolrCore.initIndex WARNING [collection1] Solr index directory './org.apache.solr.cloud.BasicDistributedZk2Test-1347610871850/jetty2/index' doesn't exist. Creating new index...
[junit4:junit4]   2> 4670 T816 oasc.CachingDirectoryFactory.get return new directory for /usr/home/hudson/hudson-slave/workspace/Lucene-Solr-Tests-trunk-java7/solr/build/solr-core/test/J1/./org.apache.solr.cloud.BasicDistributedZk2Test-1347610871850/jetty2/index forceNew:false
[junit4:junit4]   2> 4702 T816 oasc.SolrDeletionPolicy.onCommit SolrDeletionPolicy.onCommit: commits:num=1
[junit4:junit4]   2> 		commit{dir=NRTCachingDirectory(org.apache.lucene.store.NIOFSDirectory@/usr/home/hudson/hudson-slave/workspace/Lucene-Solr-Tests-trunk-java7/solr/build/solr-core/test/J1/org.apache.solr.cloud.BasicDistributedZk2Test-1347610871850/jetty2/index lockFactory=org.apache.lucene.store.NativeFSLockFactory@4516569f; maxCacheMB=48.0 maxMergeSizeMB=4.0),segFN=segments_1,generation=1,filenames=[segments_1]
[junit4:junit4]   2> 4702 T816 oasc.SolrDeletionPolicy.updateCommits newest commit = 1
[junit4:junit4]   2> 4703 T816 oasc.SolrCore.initWriters created xml: solr.XMLResponseWriter
[junit4:junit4]   2> 4706 T816 oasup.UpdateRequestProcessorChain.init inserting DistributedUpdateProcessorFactory into updateRequestProcessorChain "dedupe"
[junit4:junit4]   2> 4707 T816 oasup.UpdateRequestProcessorChain.init inserting DistributedUpdateProcessorFactory into updateRequestProcessorChain "dedupe-allfields"
[junit4:junit4]   2> 4708 T816 oasup.UpdateRequestProcessorChain.init inserting DistributedUpdateProcessorFactory into updateRequestProcessorChain "stored_sig"
[junit4:junit4]   2> 4708 T816 oasup.UpdateRequestProcessorChain.init inserting DistributedUpdateProcessorFactory into updateRequestProcessorChain "uniq-fields"
[junit4:junit4]   2> 4709 T816 oasup.UpdateRequestProcessorChain.init inserting DistributedUpdateProcessorFactory into updateRequestProcessorChain "distrib-dup-test-chain-implicit"
[junit4:junit4]   2> 4710 T816 oasc.RequestHandlers.initHandlersFromConfig adding lazy requestHandler: solr.ReplicationHandler
[junit4:junit4]   2> 4710 T816 oasc.RequestHandlers.initHandlersFromConfig created /replication: solr.ReplicationHandler
[junit4:junit4]   2> 4711 T816 oasc.RequestHandlers.initHandlersFromConfig created standard: solr.StandardRequestHandler
[junit4:junit4]   2> 4712 T816 oasc.RequestHandlers.initHandlersFromConfig created /get: solr.RealTimeGetHandler
[junit4:junit4]   2> 4713 T816 oasc.RequestHandlers.initHandlersFromConfig created dismax: solr.SearchHandler
[junit4:junit4]   2> 4714 T816 oasc.RequestHandlers.initHandlersFromConfig created mock: org.apache.solr.core.MockQuerySenderListenerReqHandler
[junit4:junit4]   2> 4715 T816 oasc.RequestHandlers.initHandlersFromConfig created /admin/: org.apache.solr.handler.admin.AdminHandlers
[junit4:junit4]   2> 4715 T816 oasc.RequestHandlers.initHandlersFromConfig created defaults: solr.StandardRequestHandler
[junit4:junit4]   2> 4716 T816 oasc.RequestHandlers.initHandlersFromConfig adding lazy requestHandler: solr.StandardRequestHandler
[junit4:junit4]   2> 4717 T816 oasc.RequestHandlers.initHandlersFromConfig created lazy: solr.StandardRequestHandler
[junit4:junit4]   2> 4718 T816 oasc.RequestHandlers.initHandlersFromConfig created /update: solr.UpdateRequestHandler
[junit4:junit4]   2> 4718 T816 oasc.RequestHandlers.initHandlersFromConfig created /terms: org.apache.solr.handler.component.SearchHandler
[junit4:junit4]   2> 4719 T816 oasc.RequestHandlers.initHandlersFromConfig created spellCheckCompRH: org.apache.solr.handler.component.SearchHandler
[junit4:junit4]   2> 4720 T816 oasc.RequestHandlers.initHandlersFromConfig created spellCheckCompRH_Direct: org.apache.solr.handler.component.SearchHandler
[junit4:junit4]   2> 4721 T816 oasc.RequestHandlers.initHandlersFromConfig created spellCheckWithWordbreak: org.apache.solr.handler.component.SearchHandler
[junit4:junit4]   2> 4722 T816 oasc.RequestHandlers.initHandlersFromConfig created spellCheckWithWordbreak_Direct: org.apache.solr.handler.component.SearchHandler
[junit4:junit4]   2> 4722 T816 oasc.RequestHandlers.initHandlersFromConfig created spellCheckCompRH1: org.apache.solr.handler.component.SearchHandler
[junit4:junit4]   2> 4723 T816 oasc.RequestHandlers.initHandlersFromConfig created tvrh: org.apache.solr.handler.component.SearchHandler
[junit4:junit4]   2> 4724 T816 oasc.RequestHandlers.initHandlersFromConfig created /mlt: solr.MoreLikeThisHandler
[junit4:junit4]   2> 4725 T816 oasc.RequestHandlers.initHandlersFromConfig created /debug/dump: solr.DumpRequestHandler
[junit4:junit4]   2> 4729 T816 oashl.XMLLoader.init xsltCacheLifetimeSeconds=60
[junit4:junit4]   2> 4734 T816 oasc.SolrCore.initDeprecatedSupport WARNING solrconfig.xml uses deprecated <admin/gettableFiles>, Please update your config to use the ShowFileRequestHandler.
[junit4:junit4]   2> 4736 T816 oasc.SolrCore.initDeprecatedSupport WARNING adding ShowFileRequestHandler with hidden files: [SCHEMA.XML, OLD_SYNONYMS.TXT, STOPWORDS.TXT, PROTWORDS.TXT, OPEN-EXCHANGE-RATES.JSON, SYNONYMS.TXT, CURRENCY.XML, MAPPING-ISOLATIN1ACCENT.TXT]
[junit4:junit4]   2> 4740 T816 oass.SolrIndexSearcher.<init> Opening Searcher@5919b0f9 main
[junit4:junit4]   2> 4742 T816 oasu.CommitTracker.<init> Hard AutoCommit: disabled
[junit4:junit4]   2> 4742 T816 oasu.CommitTracker.<init> Soft AutoCommit: disabled
[junit4:junit4]   2> 4743 T816 oashc.SpellCheckComponent.inform Initializing spell checkers
[junit4:junit4]   2> 4752 T816 oass.DirectSolrSpellChecker.init init: {name=direct,classname=DirectSolrSpellChecker,field=lowerfilt,minQueryLength=3}
[junit4:junit4]   2> 4803 T863 oasc.SolrCore.registerSearcher [collection1] Registered new searcher Searcher@5919b0f9 main{StandardDirectoryReader(segments_1:1)}
[junit4:junit4]   2> 5128 T837 oascc.ZkStateReader.updateClusterState Updating cloud state from ZooKeeper... 
[junit4:junit4]   2> 5134 T836 oascc.ZkStateReader$2.process A cluster state change has occurred - updating...
[junit4:junit4]   2> 5134 T850 oascc.ZkStateReader$2.process A cluster state change has occurred - updating...
[junit4:junit4]   2> 5134 T862 oascc.ZkStateReader$2.process A cluster state change has occurred - updating...
[junit4:junit4]   2> 5312 T816 oasc.CoreContainer.register registering core: collection1
[junit4:junit4]   2> 5312 T816 oasc.ZkController.register Register shard - core:collection1 address:http://127.0.0.1:44139/solr shardId:shard2
[junit4:junit4]   2> 5314 T816 oascc.SolrZkClient.makePath makePath: /collections/collection1/leader_elect/shard2/election
[junit4:junit4]   2> 5326 T821 oazs.PrepRequestProcessor.pRequest Got user-level KeeperException when processing sessionid:0x139c3de082f0004 type:delete cxid:0x42 zxid:0xfffffffffffffffe txntype:unknown reqpath:n/a Error Path:/solr/collections/collection1/leaders/shard2 Error:KeeperErrorCode = NoNode for /solr/collections/collection1/leaders/shard2
[junit4:junit4]   2> 5333 T816 oasc.ShardLeaderElectionContext.runLeaderProcess Running the leader process. afterExpiration=false
[junit4:junit4]   2> 5334 T821 oazs.PrepRequestProcessor.pRequest Got user-level KeeperException when processing sessionid:0x139c3de082f0004 type:create cxid:0x43 zxid:0xfffffffffffffffe txntype:unknown reqpath:n/a Error Path:/solr/overseer Error:KeeperErrorCode = NodeExists for /solr/overseer
[junit4:junit4]   2> 5335 T816 oasc.ShardLeaderElectionContext.runLeaderProcess I am the new leader: http://127.0.0.1:44139/solr/collection1/
[junit4:junit4]   2> 5336 T816 oascc.SolrZkClient.makePath makePath: /collections/collection1/leaders/shard2
[junit4:junit4]   2> 5346 T821 oazs.PrepRequestProcessor.pRequest Got user-level KeeperException when processing sessionid:0x139c3de082f0004 type:create cxid:0x4b zxid:0xfffffffffffffffe txntype:unknown reqpath:n/a Error Path:/solr/overseer Error:KeeperErrorCode = NodeExists for /solr/overseer
[junit4:junit4]   2> 5652 T837 oascc.ZkStateReader.updateClusterState Updating cloud state from ZooKeeper... 
[junit4:junit4]   2> 5668 T862 oascc.ZkStateReader$2.process A cluster state change has occurred - updating...
[junit4:junit4]   2> 5668 T836 oascc.ZkStateReader$2.process A cluster state change has occurred - updating...
[junit4:junit4]   2> 5668 T850 oascc.ZkStateReader$2.process A cluster state change has occurred - updating...
[junit4:junit4]   2> 5705 T816 oasc.ZkController.register We are http://127.0.0.1:44139/solr/collection1/ and leader is http://127.0.0.1:44139/solr/collection1/
[junit4:junit4]   2> 5719 T816 oasc.ZkController.register No LogReplay needed for core=collection1 baseURL=http://127.0.0.1:44139/solr
[junit4:junit4]   2> 5720 T816 oasc.ZkController.checkRecovery I am the leader, no recovery necessary
[junit4:junit4]   2> 5722 T816 oascc.ZkStateReader.updateClusterState Updating cloud state from ZooKeeper... 
[junit4:junit4]   2> 5725 T816 oass.SolrDispatchFilter.init user.dir=/usr/home/hudson/hudson-slave/workspace/Lucene-Solr-Tests-trunk-java7/solr/build/solr-core/test/J1
[junit4:junit4]   2> 5725 T816 oass.SolrDispatchFilter.init SolrDispatchFilter.init() done
[junit4:junit4]   2> 5726 T816 oascsi.HttpClientUtil.createClient Creating new http client, config:maxConnections=128&maxConnectionsPerHost=32&followRedirects=false
[junit4:junit4]   2> 5759 T816 oejs.Server.doStart jetty-8.1.2.v20120308
[junit4:junit4]   2> 5762 T816 oejs.AbstractConnector.doStart Started SocketConnector@0.0.0.0:49951
[junit4:junit4]   2> 5763 T816 oasc.SolrResourceLoader.locateSolrHome JNDI not configured for solr (NoInitialContextEx)
[junit4:junit4]   2> 5764 T816 oasc.SolrResourceLoader.locateSolrHome using system property solr.solr.home: /usr/home/hudson/hudson-slave/workspace/Lucene-Solr-Tests-trunk-java7/solr/build/solr-core/test-files/solr
[junit4:junit4]   2> 5764 T816 oasc.SolrResourceLoader.<init> new SolrResourceLoader for deduced Solr Home: '/usr/home/hudson/hudson-slave/workspace/Lucene-Solr-Tests-trunk-java7/solr/build/solr-core/test-files/solr/'
[junit4:junit4]   2> 5831 T816 oass.SolrDispatchFilter.init SolrDispatchFilter.init()
[junit4:junit4]   2> 5832 T816 oasc.SolrResourceLoader.locateSolrHome JNDI not configured for solr (NoInitialContextEx)
[junit4:junit4]   2> 5833 T816 oasc.SolrResourceLoader.locateSolrHome using system property solr.solr.home: /usr/home/hudson/hudson-slave/workspace/Lucene-Solr-Tests-trunk-java7/solr/build/solr-core/test-files/solr
[junit4:junit4]   2> 5833 T816 oasc.CoreContainer$Initializer.initialize looking for solr.xml: /usr/home/hudson/hudson-slave/workspace/Lucene-Solr-Tests-trunk-java7/solr/build/solr-core/test-files/solr/solr.xml
[junit4:junit4]   2> 5834 T816 oasc.CoreContainer.<init> New CoreContainer 2038895645
[junit4:junit4]   2> 5836 T816 oasc.CoreContainer.load Loading CoreContainer using Solr Home: '/usr/home/hudson/hudson-slave/workspace/Lucene-Solr-Tests-trunk-java7/solr/build/solr-core/test-files/solr/'
[junit4:junit4]   2> 5837 T816 oasc.SolrResourceLoader.<init> new SolrResourceLoader for directory: '/usr/home/hudson/hudson-slave/workspace/Lucene-Solr-Tests-trunk-java7/solr/build/solr-core/test-files/solr/'
[junit4:junit4]   2> 5900 T816 oasc.CoreContainer.load Registering Log Listener
[junit4:junit4]   2> 5920 T816 oasc.CoreContainer.initZooKeeper Zookeeper client=127.0.0.1:11384/solr
[junit4:junit4]   2> 5921 T816 oaz.ZooKeeper.<init> Initiating client connection, connectString=127.0.0.1:11384/solr sessionTimeout=8000 watcher=org.apache.solr.common.cloud.ConnectionManager@2c615a64
[junit4:junit4]   2> 5923 T873 oaz.ClientCnxn$SendThread.startConnect Opening socket connection to server /127.0.0.1:11384
[junit4:junit4]   2> 5923 T816 oascc.ConnectionManager.waitForConnected Waiting for client to connect to ZooKeeper
[junit4:junit4]   2> 5924 T873 oaz.ClientCnxn$SendThread.primeConnection Socket connection established to localhost/127.0.0.1:11384, initiating session
[junit4:junit4]   2> 5925 T818 oazs.NIOServerCnxn$Factory.run Accepted socket connection from /140.211.11.196:49952
[junit4:junit4]   2> 5925 T818 oazs.NIOServerCnxn.readConnectRequest Client attempting to establish new session at /140.211.11.196:49952
[junit4:junit4]   2> 5928 T820 oazs.NIOServerCnxn.finishSessionInit Established session 0x139c3de082f0005 with negotiated timeout 8000 for client /140.211.11.196:49952
[junit4:junit4]   2> 5928 T873 oaz.ClientCnxn$SendThread.readConnectResult Session establishment complete on server localhost/127.0.0.1:11384, sessionid = 0x139c3de082f0005, negotiated timeout = 8000
[junit4:junit4]   2> 5928 T874 oascc.ConnectionManager.process Watcher org.apache.solr.common.cloud.ConnectionManager@2c615a64 name:ZooKeeperConnection Watcher:127.0.0.1:11384/solr got event WatchedEvent state:SyncConnected type:None path:null path:null type:None
[junit4:junit4]   2> 5928 T816 oascc.ConnectionManager.waitForConnected Client is connected to ZooKeeper
[junit4:junit4]   2> 5929 T821 oazs.PrepRequestProcessor.pRequest Got user-level KeeperException when processing sessionid:0x139c3de082f0005 type:create cxid:0x1 zxid:0xfffffffffffffffe txntype:unknown reqpath:n/a Error Path:/solr/overseer Error:KeeperErrorCode = NodeExists for /solr/overseer
[junit4:junit4]   2> 5938 T821 oazs.PrepRequestProcessor.pRequest Got user-level KeeperException when processing sessionid:0x139c3de082f0005 type:create cxid:0x2 zxid:0xfffffffffffffffe txntype:unknown reqpath:n/a Error Path:/solr/overseer Error:KeeperErrorCode = NodeExists for /solr/overseer
[junit4:junit4]   2> 5941 T816 oasc.ZkController.createEphemeralLiveNode Register node as live in ZooKeeper:/live_nodes/127.0.0.1:49951_solr
[junit4:junit4]   2> 5942 T821 oazs.PrepRequestProcessor.pRequest Got user-level KeeperException when processing sessionid:0x139c3de082f0005 type:delete cxid:0x4 zxid:0xfffffffffffffffe txntype:unknown reqpath:n/a Error Path:/solr/live_nodes/127.0.0.1:49951_solr Error:KeeperErrorCode = NoNode for /solr/live_nodes/127.0.0.1:49951_solr
[junit4:junit4]   2> 5943 T816 oascc.SolrZkClient.makePath makePath: /live_nodes/127.0.0.1:49951_solr
[junit4:junit4]   2> 5951 T850 oascc.ZkStateReader$3.process Updating live nodes
[junit4:junit4]   2> 5951 T836 oascc.ZkStateReader$3.process Updating live nodes
[junit4:junit4]   2> 5951 T862 oascc.ZkStateReader$3.process Updating live nodes
[junit4:junit4]   2> 5954 T816 oashc.HttpShardHandlerFactory.getParameter Setting socketTimeout to: 0
[junit4:junit4]   2> 5955 T816 oashc.HttpShardHandlerFactory.getParameter Setting urlScheme to: http://
[junit4:junit4]   2> 5956 T816 oashc.HttpShardHandlerFactory.getParameter Setting connTimeout to: 0
[junit4:junit4]   2> 5957 T816 oashc.HttpShardHandlerFactory.getParameter Setting maxConnectionsPerHost to: 20
[junit4:junit4]   2> 5957 T816 oashc.HttpShardHandlerFactory.getParameter Setting corePoolSize to: 0
[junit4:junit4]   2> 5958 T816 oashc.HttpShardHandlerFactory.getParameter Setting maximumPoolSize to: 2147483647
[junit4:junit4]   2> 5959 T816 oashc.HttpShardHandlerFactory.getParameter Setting maxThreadIdleTime to: 5
[junit4:junit4]   2> 5959 T816 oashc.HttpShardHandlerFactory.getParameter Setting sizeOfQueue to: -1
[junit4:junit4]   2> 5960 T816 oashc.HttpShardHandlerFactory.getParameter Setting fairnessPolicy to: false
[junit4:junit4]   2> 5961 T816 oascsi.HttpClientUtil.createClient Creating new http client, config:maxConnectionsPerHost=20&maxConnections=10000&socketTimeout=0&connTimeout=0&retry=false
[junit4:junit4]   2> 5991 T816 oascc.ZkStateReader.createClusterStateWatchersAndUpdate Updating cluster state from ZooKeeper... 
[junit4:junit4]   2> 6011 T816 oasc.CoreContainer.create Creating SolrCore 'collection1' using instanceDir: /usr/home/hudson/hudson-slave/workspace/Lucene-Solr-Tests-trunk-java7/solr/build/solr-core/test-files/solr/collection1
[junit4:junit4]   2> 6012 T816 oasc.ZkController.createCollectionZkNode Check for collection zkNode:collection1
[junit4:junit4]   2> 6015 T816 oasc.ZkController.createCollectionZkNode Collection zkNode exists
[junit4:junit4]   2> 6016 T816 oasc.ZkController.readConfigName Load collection config from:/collections/collection1
[junit4:junit4]   2> 6020 T816 oasc.SolrResourceLoader.<init> new SolrResourceLoader for directory: '/usr/home/hudson/hudson-slave/workspace/Lucene-Solr-Tests-trunk-java7/solr/build/solr-core/test-files/solr/collection1/'
[junit4:junit4]   2> 6026 T816 oasc.SolrResourceLoader.replaceClassLoader Adding 'file:/usr/home/hudson/hudson-slave/workspace/Lucene-Solr-Tests-trunk-java7/solr/build/solr-core/test-files/solr/collection1/lib/README' to classloader
[junit4:junit4]   2> 6028 T816 oasc.SolrResourceLoader.replaceClassLoader Adding 'file:/usr/home/hudson/hudson-slave/workspace/Lucene-Solr-Tests-trunk-java7/solr/build/solr-core/test-files/solr/collection1/lib/classes/' to classloader
[junit4:junit4]   2> 6137 T816 oasc.SolrConfig.<init> Using Lucene MatchVersion: LUCENE_50
[junit4:junit4]   2> 6174 T837 oascc.ZkStateReader.updateClusterState Updating cloud state from ZooKeeper... 
[junit4:junit4]   2> 6189 T862 oascc.ZkStateReader$2.process A cluster state change has occurred - updating...
[junit4:junit4]   2> 6189 T850 oascc.ZkStateReader$2.process A cluster state change has occurred - updating...
[junit4:junit4]   2> 6197 T836 oascc.ZkStateReader$2.process A cluster state change has occurred - updating...
[junit4:junit4]   2> 6233 T874 oascc.ZkStateReader$2.process A cluster state change has occurred - updating...
[junit4:junit4]   2> 6252 T816 oasc.SolrConfig.<init> Loaded SolrConfig: solrconfig.xml
[junit4:junit4]   2> 6353 T816 oass.IndexSchema.readSchema Reading Solr Schema
[junit4:junit4]   2> 6379 T816 oass.IndexSchema.readSchema Schema name=test
[junit4:junit4]   2> 7843 T816 oass.OpenExchangeRatesOrgProvider.init Initialized with rates=open-exchange-rates.json, refreshInterval=1440.
[junit4:junit4]   2> 7890 T816 oass.IndexSchema.readSchema default search field in schema is text
[junit4:junit4]   2> 7906 T816 oass.IndexSchema.readSchema unique key field: id
[junit4:junit4]   2> 7940 T816 oass.FileExchangeRateProvider.reload Reloading exchange rates from file currency.xml
[junit4:junit4]   2> 7952 T816 oass.FileExchangeRateProvider.reload Reloading exchange rates from file currency.xml
[junit4:junit4]   2> 7976 T816 oass.OpenExchangeRatesOrgProvider.reload Reloading exchange rates from open-exchange-rates.json
[junit4:junit4]   2> 7978 T816 oass.OpenExchangeRatesOrgProvider.reload Reloading exchange rates from open-exchange-rates.json
[junit4:junit4]   2> 7980 T816 oasc.SolrCore.<init> [collection1] Opening new SolrCore at /usr/home/hudson/hudson-slave/workspace/Lucene-Solr-Tests-trunk-java7/solr/build/solr-core/test-files/solr/collection1/, dataDir=./org.apache.solr.cloud.BasicDistributedZk2Test-1347610871850/jetty3/
[junit4:junit4]   2> 7980 T816 oasc.JmxMonitoredMap.<init> JMX monitoring is enabled. Adding Solr mbeans to JMX Server: com.sun.jmx.mbeanserver.JmxMBeanServer@6d9c83b2
[junit4:junit4]   2> 7982 T816 oasc.SolrCore.getNewIndexDir WARNING New index directory detected: old=null new=./org.apache.solr.cloud.BasicDistributedZk2Test-1347610871850/jetty3/index/
[junit4:junit4]   2> 7983 T816 oasc.SolrCore.initIndex WARNING [collection1] Solr index directory './org.apache.solr.cloud.BasicDistributedZk2Test-1347610871850/jetty3/index' doesn't exist. Creating new index...
[junit4:junit4]   2> 7985 T816 oasc.CachingDirectoryFactory.get return new directory for /usr/home/hudson/hudson-slave/workspace/Lucene-Solr-Tests-trunk-java7/solr/build/solr-core/test/J1/./org.apache.solr.cloud.BasicDistributedZk2Test-1347610871850/jetty3/index forceNew:false
[junit4:junit4]   2> 8005 T816 oasc.SolrDeletionPolicy.onCommit SolrDeletionPolicy.onCommit: commits:num=1
[junit4:junit4]   2> 		commit{dir=NRTCachingDirectory(org.apache.lucene.store.NIOFSDirectory@/usr/home/hudson/hudson-slave/workspace/Lucene-Solr-Tests-trunk-java7/solr/build/solr-core/test/J1/org.apache.solr.cloud.BasicDistributedZk2Test-1347610871850/jetty3/index lockFactory=org.apache.lucene.store.NativeFSLockFactory@45b1c0b1; maxCacheMB=48.0 maxMergeSizeMB=4.0),segFN=segments_1,generation=1,filenames=[segments_1]
[junit4:junit4]   2> 8006 T816 oasc.SolrDeletionPolicy.updateCommits newest commit = 1
[junit4:junit4]   2> 8008 T816 oasc.SolrCore.initWriters created xml: solr.XMLResponseWriter
[junit4:junit4]   2> 8011 T816 oasup.UpdateRequestProcessorChain.init inserting DistributedUpdateProcessorFactory into updateRequestProcessorChain "dedupe"
[junit4:junit4]   2> 8011 T816 oasup.UpdateRequestProcessorChain.init inserting DistributedUpdateProcessorFactory into updateRequestProcessorChain "dedupe-allfields"
[junit4:junit4]   2> 8012 T816 oasup.UpdateRequestProcessorChain.init inserting DistributedUpdateProcessorFactory into updateRequestProcessorChain "stored_sig"
[junit4:junit4]   2> 8012 T816 oasup.UpdateRequestProcessorChain.init inserting DistributedUpdateProcessorFactory into updateRequestProcessorChain "uniq-fields"
[junit4:junit4]   2> 8013 T816 oasup.UpdateRequestProcessorChain.init inserting DistributedUpdateProcessorFactory into updateRequestProcessorChain "distrib-dup-test-chain-implicit"
[junit4:junit4]   2> 8014 T816 oasc.RequestHandlers.initHandlersFromConfig adding lazy requestHandler: solr.ReplicationHandler
[junit4:junit4]   2> 8015 T816 oasc.RequestHandlers.initHandlersFromConfig created /replication: solr.ReplicationHandler
[junit4:junit4]   2> 8016 T816 oasc.RequestHandlers.initHandlersFromConfig created standard: solr.StandardRequestHandler
[junit4:junit4]   2> 8017 T816 oasc.RequestHandlers.initHandlersFromConfig created /get: solr.RealTimeGetHandler
[junit4:junit4]   2> 8018 T816 oasc.RequestHandlers.initHandlersFromConfig created dismax: solr.SearchHandler
[junit4:junit4]   2> 8020 T816 oasc.RequestHandlers.initHandlersFromConfig created mock: org.apache.solr.core.MockQuerySenderListenerReqHandler
[junit4:junit4]   2> 8021 T816 oasc.RequestHandlers.initHandlersFromConfig created /admin/: org.apache.solr.handler.admin.AdminHandlers
[junit4:junit4]   2> 8022 T816 oasc.RequestHandlers.initHandlersFromConfig created defaults: solr.StandardRequestHandler
[junit4:junit4]   2> 8023 T816 oasc.RequestHandlers.initHandlersFromConfig adding lazy requestHandler: solr.StandardRequestHandler
[junit4:junit4]   2> 8024 T816 oasc.RequestHandlers.initHandlersFromConfig created lazy: solr.StandardRequestHandler
[junit4:junit4]   2> 8025 T816 oasc.RequestHandlers.initHandlersFromConfig created /update: solr.UpdateRequestHandler
[junit4:junit4]   2> 8027 T816 oasc.RequestHandlers.initHandlersFromConfig created /terms: org.apache.solr.handler.component.SearchHandler
[junit4:junit4]   2> 8029 T816 oasc.RequestHandlers.initHandlersFromConfig created spellCheckCompRH: org.apache.solr.handler.component.SearchHandler
[junit4:junit4]   2> 8029 T816 oasc.RequestHandlers.initHandlersFromConfig created spellCheckCompRH_Direct: org.apache.solr.handler.component.SearchHandler
[junit4:junit4]   2> 8030 T816 oasc.RequestHandlers.initHandlersFromConfig created spellCheckWithWordbreak: org.apache.solr.handler.component.SearchHandler
[junit4:junit4]   2> 8031 T816 oasc.RequestHandlers.initHandlersFromConfig created spellCheckWithWordbreak_Direct: org.apache.solr.handler.component.SearchHandler
[junit4:junit4]   2> 8032 T816 oasc.RequestHandlers.initHandlersFromConfig created spellCheckCompRH1: org.apache.solr.handler.component.SearchHandler
[junit4:junit4]   2> 8033 T816 oasc.RequestHandlers.initHandlersFromConfig created tvrh: org.apache.solr.handler.component.SearchHandler
[junit4:junit4]   2> 8034 T816 oasc.RequestHandlers.initHandlersFromConfig created /mlt: solr.MoreLikeThisHandler
[junit4:junit4]   2> 8034 T816 oasc.RequestHandlers.initHandlersFromConfig created /debug/dump: solr.DumpRequestHandler
[junit4:junit4]   2> 8041 T816 oashl.XMLLoader.init xsltCacheLifetimeSeconds=60
[junit4:junit4]   2> 8053 T816 oasc.SolrCore.initDeprecatedSupport WARNING solrconfig.xml uses deprecated <admin/gettableFiles>, Please update your config to use the ShowFileRequestHandler.
[junit4:junit4]   2> 8056 T816 oasc.SolrCore.initDeprecatedSupport WARNING adding ShowFileRequestHandler with hidden files: [SCHEMA.XML, OLD_SYNONYMS.TXT, STOPWORDS.TXT, PROTWORDS.TXT, OPEN-EXCHANGE-RATES.JSON, SYNONYMS.TXT, CURRENCY.XML, MAPPING-ISOLATIN1ACCENT.TXT]
[junit4:junit4]   2> 8061 T816 oass.SolrIndexSearcher.<init> Opening Searcher@4c6f44a0 main
[junit4:junit4]   2> 8063 T816 oasu.CommitTracker.<init> Hard AutoCommit: disabled
[junit4:junit4]   2> 8064 T816 oasu.CommitTracker.<init> Soft AutoCommit: disabled
[junit4:junit4]   2> 8065 T816 oashc.SpellCheckComponent.inform Initializing spell checkers
[junit4:junit4]   2> 8076 T816 oass.DirectSolrSpellChecker.init init: {name=direct,classname=DirectSolrSpellChecker,field=lowerfilt,minQueryLength=3}
[junit4:junit4]   2> 8195 T875 oasc.SolrCore.registerSearcher [collection1] Registered new searcher Searcher@4c6f44a0 main{StandardDirectoryReader(segments_1:1)}
[junit4:junit4]   2> 8726 T837 oascc.ZkStateReader.updateClusterState Updating cloud state from ZooKeeper... 
[junit4:junit4]   2> 8740 T862 oascc.ZkStateReader$2.process A cluster state change has occurred - updating...
[junit4:junit4]   2> 8741 T836 oascc.ZkStateReader$2.process A cluster state change has occurred - updating...
[junit4:junit4]   2> 8740 T850 oascc.ZkStateReader$2.process A cluster state change has occurred - updating...
[junit4:junit4]   2> 8741 T874 oascc.ZkStateReader$2.process A cluster state change has occurred - updating...
[junit4:junit4]   2> 9224 T816 oasc.CoreContainer.register registering core: collection1
[junit4:junit4]   2> 9225 T816 oasc.ZkController.register Register shard - core:collection1 address:http://127.0.0.1:49951/solr shardId:shard1
[junit4:junit4]   2> 9237 T816 oasc.ZkController.register We are http://127.0.0.1:49951/solr/collection1/ and leader is http://127.0.0.1:59593/solr/collection1/
[junit4:junit4]   2> 9239 T816 oasc.ZkController.register No LogReplay needed for core=collection1 baseURL=http://127.0.0.1:49951/solr
[junit4:junit4]   2> 9239 T816 oasc.ZkController.checkRecovery Core needs to recover:collection1
[junit4:junit4]   2> 9245 T816 oasu.DefaultSolrCoreState.doRecovery Running recovery - first canceling any ongoing recovery
[junit4:junit4]   2> ASYNC  NEW_CORE C108 name=collection1 org.apache.solr.core.SolrCore@6b2728bb url=http://127.0.0.1:49951/solr/collection1 node=127.0.0.1:49951_solr
[junit4:junit4]   2> 9250 T876 C108 P49951 oasc.RecoveryStrategy.run Starting recovery process.  core=collection1 recoveringAfterStartup=true
[junit4:junit4]   2> 9254 T876 C108 P49951 oasc.RecoveryStrategy.doRecovery ###### startupVersions=[]
[junit4:junit4]   2> 9253 T816 oascc.ZkStateReader.updateClusterState Updating cloud state from ZooKeeper... 
[junit4:junit4]   2> 9270 T876 C108 P49951 oascsi.HttpClientUtil.createClient Creating new http client, config:maxConnections=128&maxConnectionsPerHost=32&followRedirects=false
[junit4:junit4]   2> 9271 T816 oass.SolrDispatchFilter.init user.dir=/usr/home/hudson/hudson-slave/workspace/Lucene-Solr-Tests-trunk-java7/solr/build/solr-core/test/J1
[junit4:junit4]   2> 9272 T816 oass.SolrDispatchFilter.init SolrDispatchFilter.init() done
[junit4:junit4]   2> 9283 T816 oascsi.HttpClientUtil.createClient Creating new http client, config:maxConnections=128&maxConnectionsPerHost=32&followRedirects=false
[junit4:junit4]   2> 9362 T816 oejs.Server.doStart jetty-8.1.2.v20120308
[junit4:junit4]   2> 9383 T816 oejs.AbstractConnector.doStart Started SocketConnector@0.0.0.0:49956
[junit4:junit4]   2> 9385 T816 oasc.SolrResourceLoader.locateSolrHome JNDI not configured for solr (NoInitialContextEx)
[junit4:junit4]   2> 9386 T816 oasc.SolrResourceLoader.locateSolrHome using system property solr.solr.home: /usr/home/hudson/hudson-slave/workspace/Lucene-Solr-Tests-trunk-java7/solr/build/solr-core/test-files/solr
[junit4:junit4]   2> 9386 T816 oasc.SolrResourceLoader.<init> new SolrResourceLoader for deduced Solr Home: '/usr/home/hudson/hudson-slave/workspace/Lucene-Solr-Tests-trunk-java7/solr/build/solr-core/test-files/solr/'
[junit4:junit4]   2> 9494 T816 oass.SolrDispatchFilter.init SolrDispatchFilter.init()
[junit4:junit4]   2> 9495 T816 oasc.SolrResourceLoader.locateSolrHome JNDI not configured for solr (NoInitialContextEx)
[junit4:junit4]   2> 9495 T816 oasc.SolrResourceLoader.locateSolrHome using system property solr.solr.home: /usr/home/hudson/hudson-slave/workspace/Lucene-Solr-Tests-trunk-java7/solr/build/solr-core/test-files/solr
[junit4:junit4]   2> 9496 T816 oasc.CoreContainer$Initializer.initialize looking for solr.xml: /usr/home/hudson/hudson-slave/workspace/Lucene-Solr-Tests-trunk-java7/solr/build/solr-core/test-files/solr/solr.xml
[junit4:junit4]   2> 9496 T816 oasc.CoreContainer.<init> New CoreContainer 1549949229
[junit4:junit4]   2> 9497 T816 oasc.CoreContainer.load Loading CoreContainer using Solr Home: '/usr/home/hudson/hudson-slave/workspace/Lucene-Solr-Tests-trunk-java7/solr/build/solr-core/test-files/solr/'
[junit4:junit4]   2> 9498 T816 oasc.SolrResourceLoader.<init> new SolrResourceLoader for directory: '/usr/home/hudson/hudson-slave/workspace/Lucene-Solr-Tests-trunk-java7/solr/build/solr-core/test-files/solr/'
[junit4:junit4]   2> 9581 T816 oasc.CoreContainer.load Registering Log Listener
[junit4:junit4]   2> 9599 T816 oasc.CoreContainer.initZooKeeper Zookeeper client=127.0.0.1:11384/solr
[junit4:junit4]   2> 9600 T816 oaz.ZooKeeper.<init> Initiating client connection, connectString=127.0.0.1:11384/solr sessionTimeout=8000 watcher=org.apache.solr.common.cloud.ConnectionManager@2167fe91
[junit4:junit4]   2> 9601 T886 oaz.ClientCnxn$SendThread.startConnect Opening socket connection to server /127.0.0.1:11384
[junit4:junit4]   2> 9601 T816 oascc.ConnectionManager.waitForConnected Waiting for client to connect to ZooKeeper
[junit4:junit4]   2> 9603 T886 oaz.ClientCnxn$SendThread.primeConnection Socket connection established to localhost/127.0.0.1:11384, initiating session
[junit4:junit4]   2> 9603 T818 oazs.NIOServerCnxn$Factory.run Accepted socket connection from /140.211.11.196:49957
[junit4:junit4]   2> 9603 T818 oazs.NIOServerCnxn.readConnectRequest Client attempting to establish new session at /140.211.11.196:49957
[junit4:junit4]   2> 9605 T820 oazs.NIOServerCnxn.finishSessionInit Established session 0x139c3de082f0006 with negotiated timeout 8000 for client /140.211.11.196:49957
[junit4:junit4]   2> 9605 T886 oaz.ClientCnxn$SendThread.readConnectResult Session establishment complete on server localhost/127.0.0.1:11384, sessionid = 0x139c3de082f0006, negotiated timeout = 8000
[junit4:junit4]   2> 9606 T887 oascc.ConnectionManager.process Watcher org.apache.solr.common.cloud.ConnectionManager@2167fe91 name:ZooKeeperConnection Watcher:127.0.0.1:11384/solr got event WatchedEvent state:SyncConnected type:None path:null path:null type:None
[junit4:junit4]   2> 9606 T816 oascc.ConnectionManager.waitForConnected Client is connected to ZooKeeper
[junit4:junit4]   2> 9607 T821 oazs.PrepRequestProcessor.pRequest Got user-level KeeperException when processing sessionid:0x139c3de082f0006 type:create cxid:0x1 zxid:0xfffffffffffffffe txntype:unknown reqpath:n/a Error Path:/solr/overseer Error:KeeperErrorCode = NodeExists for /solr/overseer
[junit4:junit4]   2> 9609 T821 oazs.PrepRequestProcessor.pRequest Got user-level KeeperException when processing sessionid:0x139c3de082f0006 type:create cxid:0x2 zxid:0xfffffffffffffffe txntype:unknown reqpath:n/a Error Path:/solr/overseer Error:KeeperErrorCode = NodeExists for /solr/overseer
[junit4:junit4]   2> 9618 T816 oasc.ZkController.createEphemeralLiveNode Register node as live in ZooKeeper:/live_nodes/127.0.0.1:49956_solr
[junit4:junit4]   2> 9619 T821 oazs.PrepRequestProcessor.pRequest Got user-level KeeperException when processing sessionid:0x139c3de082f0006 type:delete cxid:0x4 zxid:0xfffffffffffffffe txntype:unknown reqpath:n/a Error Path:/solr/live_nodes/127.0.0.1:49956_solr Error:KeeperErrorCode = NoNode for /solr/live_nodes/127.0.0.1:49956_solr
[junit4:junit4]   2> 9620 T816 oascc.SolrZkClient.makePath makePath: /live_nodes/127.0.0.1:49956_solr
[junit4:junit4]   2> 9623 T850 oascc.ZkStateReader$3.process Updating live nodes
[junit4:junit4]   2> 9623 T862 oascc.ZkStateReader$3.process Updating live nodes
[junit4:junit4]   2> 9624 T874 oascc.ZkStateReader$3.process Updating live nodes
[junit4:junit4]   2> 9624 T836 oascc.ZkStateReader$3.process Updating live nodes
[junit4:junit4]   2> 9626 T816 oashc.HttpShardHandlerFactory.getParameter Setting socketTimeout to: 0
[junit4:junit4]   2> 9627 T816 oashc.HttpShardHandlerFactory.getParameter Setting urlScheme to: http://
[junit4:junit4]   2> 9628 T816 oashc.HttpShardHandlerFactory.getParameter Setting connTimeout to: 0
[junit4:junit4]   2> 9629 T816 oashc.HttpShardHandlerFactory.getParameter Setting maxConnectionsPerHost to: 20
[junit4:junit4]   2> 9629 T816 oashc.HttpShardHandlerFactory.getParameter Setting corePoolSize to: 0
[junit4:junit4]   2> 9630 T816 oashc.HttpShardHandlerFactory.getParameter Setting maximumPoolSize to: 2147483647
[junit4:junit4]   2> 9631 T816 oashc.HttpShardHandlerFactory.getParameter Setting maxThreadIdleTime to: 5
[junit4:junit4]   2> 9631 T816 oashc.HttpShardHandlerFactory.getParameter Setting sizeOfQueue to: -1
[junit4:junit4]   2> 9632 T816 oashc.HttpShardHandlerFactory.getParameter Setting fairnessPolicy to: false
[junit4:junit4]   2> 9632 T816 oascsi.HttpClientUtil.createClient Creating new http client, config:maxConnectionsPerHost=20&maxConnections=10000&socketTimeout=0&connTimeout=0&retry=false
[junit4:junit4]   2> 9672 T816 oascc.ZkStateReader.createClusterStateWatchersAndUpdate Updating cluster state from ZooKeeper... 
[junit4:junit4]   2> 9684 T816 oasc.CoreContainer.create Creating SolrCore 'collection1' using instanceDir: /usr/home/hudson/hudson-slave/workspace/Lucene-Solr-Tests-trunk-java7/solr/build/solr-core/test-files/solr/collection1
[junit4:junit4]   2> 9685 T816 oasc.ZkController.createCollectionZkNode Check for collection zkNode:collection1
[junit4:junit4]   2> 9686 T816 oasc.ZkController.createCollectionZkNode Collection zkNode exists
[junit4:junit4]   2> 9687 T816 oasc.ZkController.readConfigName Load collection config from:/collections/collection1
[junit4:junit4]   2> 9689 T816 oasc.SolrResourceLoader.<init> new SolrResourceLoader for directory: '/usr/home/hudson/hudson-slave/workspace/Lucene-Solr-Tests-trunk-java7/solr/build/solr-core/test-files/solr/collection1/'
[junit4:junit4]   2> 9691 T816 oasc.SolrResourceLoader.replaceClassLoader Adding 'file:/usr/home/hudson/hudson-slave/workspace/Lucene-Solr-Tests-trunk-java7/solr/build/solr-core/test-files/solr/collection1/lib/README' to classloader
[junit4:junit4]   2> 9692 T816 oasc.SolrResourceLoader.replaceClassLoader Adding 'file:/usr/home/hudson/hudson-slave/workspace/Lucene-Solr-Tests-trunk-java7/solr/build/solr-core/test-files/solr/collection1/lib/classes/' to classloader
[junit4:junit4]   2> 9765 T837 oascc.ZkStateReader.updateClusterState Updating cloud state from ZooKeeper... 
[junit4:junit4]   2> 9774 T816 oasc.SolrConfig.<init> Using Lucene MatchVersion: LUCENE_50
[junit4:junit4]   2> 9782 T850 oascc.ZkStateReader$2.process A cluster state change has occurred - updating...
[junit4:junit4]   2> 9782 T862 oascc.ZkStateReader$2.process A cluster state change has occurred - updating...
[junit4:junit4]   2> 9784 T836 oascc.ZkStateReader$2.process A cluster state change has occurred - updating...
[junit4:junit4]   2> 9784 T887 oascc.ZkStateReader$2.process A cluster state change has occurred - updating...
[junit4:junit4]   2> 9787 T874 oascc.ZkStateReader$2.process A cluster state change has occurred - updating...
[junit4:junit4]   2> 9941 T816 oasc.SolrConfig.<init> Loaded SolrConfig: solrconfig.xml
[junit4:junit4]   2> 10042 T816 oass.IndexSchema.readSchema Reading Solr Schema
[junit4:junit4]   2> 10054 T816 oass.IndexSchema.readSchema Schema name=test
[junit4:junit4]   2> 11418 T816 oass.OpenExchangeRatesOrgProvider.init Initialized with rates=open-exchange-rates.json, refreshInterval=1440.
[junit4:junit4]   2> 11459 T816 oass.IndexSchema.readSchema default search field in schema is text
[junit4:junit4]   2> 11467 T816 oass.IndexSchema.readSchema unique key field: id
[junit4:junit4]   2> 11485 T816 oass.FileExchangeRateProvider.reload Reloading exchange rates from file currency.xml
[junit4:junit4]   2> 11491 T816 oass.FileExchangeRateProvider.reload Reloading exchange rates from file currency.xml
[junit4:junit4]   2> 11496 T816 oass.OpenExchangeRatesOrgProvider.reload Reloading exchange rates from open-exchange-rates.json
[junit4:junit4]   2> 11498 T816 oass.OpenExchangeRatesOrgProvider.reload Reloading exchange rates from open-exchange-rates.json
[junit4:junit4]   2> 11499 T816 oasc.SolrCore.<init> [collection1] Opening new SolrCore at /usr/home/hudson/hudson-slave/workspace/Lucene-Solr-Tests-trunk-java7/solr/build/solr-core/test-files/solr/collection1/, dataDir=./org.apache.solr.cloud.BasicDistributedZk2Test-1347610871850/jetty4/
[junit4:junit4]   2> 11500 T816 oasc.JmxMonitoredMap.<init> JMX monitoring is enabled. Adding Solr mbeans to JMX Server: com.sun.jmx.mbeanserver.JmxMBeanServer@6d9c83b2
[junit4:junit4]   2> 11502 T816 oasc.SolrCore.getNewIndexDir WARNING New index directory detected: old=null new=./org.apache.solr.cloud.BasicDistributedZk2Test-1347610871850/jetty4/index/
[junit4:junit4]   2> 11505 T816 oasc.SolrCore.initIndex WARNING [collection1] Solr index directory './org.apache.solr.cloud.BasicDistributedZk2Test-1347610871850/jetty4/index' doesn't exist. Creating new index...
[junit4:junit4]   2> 11513 T816 oasc.CachingDirectoryFactory.get return new directory for /usr/home/hudson/hudson-slave/workspace/Lucene-Solr-Tests-trunk-java7/solr/build/solr-core/test/J1/./org.apache.solr.cloud.BasicDistributedZk2Test-1347610871850/jetty4/index forceNew:false
[junit4:junit4]   2> 11586 T816 oasc.SolrDeletionPolicy.onCommit SolrDeletionPolicy.onCommit: commits:num=1
[junit4:junit4]   2> 		commit{dir=NRTCachingDirectory(org.apache.lucene.store.NIOFSDirectory@/usr/home/hudson/hudson-slave/workspace/Lucene-Solr-Tests-trunk-java7/solr/build/solr-core/test/J1/org.apache.solr.cloud.BasicDistributedZk2Test-1347610871850/jetty4/index lockFactory=org.apache.lucene.store.NativeFSLockFactory@1a0c9fea; maxCacheMB=48.0 maxMergeSizeMB=4.0),segFN=segments_1,generation=1,filenames=[segments_1]
[junit4:junit4]   2> 11587 T816 oasc.SolrDeletionPolicy.updateCommits newest commit = 1
[junit4:junit4]   2> 11592 T816 oasc.SolrCore.initWriters created xml: solr.XMLResponseWriter
[junit4:junit4]   2> 11596 T816 oasup.UpdateRequestProcessorChain.init inserting DistributedUpdateProcessorFactory into updateRequestProcessorChain "dedupe"
[junit4:junit4]   2> 11597 T816 oasup.UpdateRequestProcessorChain.init inserting DistributedUpdateProcessorFactory into updateRequestProcessorChain "dedupe-allfields"
[junit4:junit4]   2> 11598 T816 oasup.UpdateRequestProcessorChain.init inserting DistributedUpdateProcessorFactory into updateRequestProcessorChain "stored_sig"
[junit4:junit4]   2> 11598 T816 oasup.UpdateRequestProcessorChain.init inserting DistributedUpdateProcessorFactory into updateRequestProcessorChain "uniq-fields"
[junit4:junit4]   2> 11600 T816 oasup.UpdateRequestProcessorChain.init inserting DistributedUpdateProcessorFactory into updateRequestProcessorChain "distrib-dup-test-chain-implicit"
[junit4:junit4]   2> 11600 T816 oasc.RequestHandlers.initHandlersFromConfig adding lazy requestHandler: solr.ReplicationHandler
[junit4:junit4]   2> 11601 T816 oasc.RequestHandlers.initHandlersFromConfig created /replication: solr.ReplicationHandler
[junit4:junit4]   2> 11602 T816 oasc.RequestHandlers.initHandlersFromConfig created standard: solr.StandardRequestHandler
[junit4:junit4]   2> 11603 T816 oasc.RequestHandlers.initHandlersFromConfig created /get: solr.RealTimeGetHandler
[junit4:junit4]   2> 11605 T816 oasc.RequestHandlers.initHandlersFromConfig created dismax: solr.SearchHandler
[junit4:junit4]   2> 11606 T816 oasc.RequestHandlers.initHandlersFromConfig created mock: org.apache.solr.core.MockQuerySenderListenerReqHandler
[junit4:junit4]   2> 11607 T816 oasc.RequestHandlers.initHandlersFromConfig created /admin/: org.apache.solr.handler.admin.AdminHandlers
[junit4:junit4]   2> 11610 T816 oasc.RequestHandlers.initHandlersFromConfig created defaults: solr.StandardRequestHandler
[junit4:junit4]   2> 11610 T816 oasc.RequestHandlers.initHandlersFromConfig adding lazy requestHandler: solr.StandardRequestHandler
[junit4:junit4]   2> 11611 T816 oasc.RequestHandlers.initHandlersFromConfig created lazy: solr.StandardRequestHandler
[junit4:junit4]   2> 11614 T816 oasc.RequestHandlers.initHandlersFromConfig created /update: solr.UpdateRequestHandler
[junit4:junit4]   2> 11616 T816 oasc.RequestHandlers.initHandlersFromConfig created /terms: org.apache.solr.handler.component.SearchHandler
[junit4:junit4]   2> 11617 T816 oasc.RequestHandlers.initHandlersFromConfig created spellCheckCompRH: org.apache.solr.handler.component.SearchHandler
[junit4:junit4]   2> 11618 T816 oasc.RequestHandlers.initHandlersFromConfig created spellCheckCompRH_Direct: org.apache.solr.handler.component.SearchHandler
[junit4:junit4]   2> 11619 T816 oasc.RequestHandlers.initHandlersFromConfig created spellCheckWithWordbreak: org.apache.solr.handler.component.SearchHandler
[junit4:junit4]   2> 11621 T816 oasc.RequestHandlers.initHandlersFromConfig created spellCheckWithWordbreak_Direct: org.apache.solr.handler.component.SearchHandler
[junit4:junit4]   2> 11622 T816 oasc.RequestHandlers.initHandlersFromConfig created spellCheckCompRH1: org.apache.solr.handler.component.SearchHandler
[junit4:junit4]   2> 11623 T816 oasc.RequestHandlers.initHandlersFromConfig created tvrh: org.apache.solr.handler.component.SearchHandler
[junit4:junit4]   2> 11631 T816 oasc.RequestHandlers.initHandlersFromConfig created /mlt: solr.MoreLikeThisHandler
[junit4:junit4]   2> 11632 T816 oasc.RequestHandlers.initHandlersFromConfig created /debug/dump: solr.DumpRequestHandler
[junit4:junit4]   2> 11636 T816 oashl.XMLLoader.init xsltCacheLifetimeSeconds=60
[junit4:junit4]   2> 11641 T816 oasc.SolrCore.initDeprecatedSupport WARNING solrconfig.xml uses deprecated <admin/gettableFiles>, Please update your config to use the ShowFileRequestHandler.
[junit4:junit4]   2> 11643 T816 oasc.SolrCore.initDeprecatedSupport WARNING adding ShowFileRequestHandler with hidden files: [SCHEMA.XML, OLD_SYNONYMS.TXT, STOPWORDS.TXT, PROTWORDS.TXT, OPEN-EXCHANGE-RATES.JSON, SYNONYMS.TXT, CURRENCY.XML, MAPPING-ISOLATIN1ACCENT.TXT]
[junit4:junit4]   2> 11650 T816 oass.SolrIndexSearcher.<init> Opening Searcher@77ba2ad8 main
[junit4:junit4]   2> 11652 T816 oasu.CommitTracker.<init> Hard AutoCommit: disabled
[junit4:junit4]   2> 11652 T816 oasu.CommitTracker.<init> Soft AutoCommit: disabled
[junit4:junit4]   2> 11654 T816 oashc.SpellCheckComponent.inform Initializing spell checkers
[junit4:junit4]   2> 11695 T816 oass.DirectSolrSpellChecker.init init: {name=direct,classname=DirectSolrSpellChecker,field=lowerfilt,minQueryLength=3}
[junit4:junit4]   2> 11807 T888 oasc.SolrCore.registerSearcher [collection1] Registered new searcher Searcher@77ba2ad8 main{StandardDirectoryReader(segments_1:1)}
[junit4:junit4]   2> 11826 T837 oascc.ZkStateReader.updateClusterState Updating cloud state from ZooKeeper... 
[junit4:junit4]   2> 11842 T874 oascc.ZkStateReader$2.process A cluster state change has occurred - updating...
[junit4:junit4]   2> 11842 T887 oascc.ZkStateReader$2.process A cluster state change has occurred - updating...
[junit4:junit4]   2> 11842 T836 oascc.ZkStateReader$2.process A cluster state change has occurred - updating...
[junit4:junit4]   2> 11842 T850 oascc.ZkStateReader$2.process A cluster state change has occurred - updating...
[junit4:junit4]   2> 11842 T862 oascc.ZkStateReader$2.process A cluster state change has occurred - updating...
[junit4:junit4]   2> 12324 T816 oasc.CoreContainer.register registering core: collection1
[junit4:junit4]   2> 12325 T816 oasc.ZkController.register Register shard - core:collection1 address:http://127.0.0.1:49956/solr shardId:shard2
[junit4:junit4]   2> 12330 T816 oasc.ZkController.register We are http://127.0.0.1:49956/solr/collection1/ and leader is http://127.0.0.1:44139/solr/collection1/
[junit4:junit4]   2> 12331 T816 oasc.ZkController.register No LogReplay needed for core=collection1 baseURL=http://127.0.0.1:49956/solr
[junit4:junit4]   2> 12331 T816 oasc.ZkController.checkRecovery Core needs to recover:collection1
[junit4:junit4]   2> 12332 T816 oasu.DefaultSolrCoreState.doRecovery Running recovery - first canceling any ongoing recovery
[junit4:junit4]   2> ASYNC  NEW_CORE C109 name=collection1 org.apache.solr.core.SolrCore@2c1e69ec url=http://127.0.0.1:49956/solr/collection1 node=127.0.0.1:49956_solr
[junit4:junit4]   2> 12333 T889 C109 P49956 oasc.RecoveryStrategy.run Starting recovery process.  core=collection1 recoveringAfterStartup=true
[junit4:junit4]   2> 12334 T889 C109 P49956 oasc.RecoveryStrategy.doRecovery ###### startupVersions=[]
[junit4:junit4]   2> 12334 T816 oascc.ZkStateReader.updateClusterState Updating cloud state from ZooKeeper... 
[junit4:junit4]   2> 12336 T889 C109 P49956 oascsi.HttpClientUtil.createClient Creating new http client, config:maxConnections=128&maxConnectionsPerHost=32&followRedirects=false
[junit4:junit4]   2> 12336 T816 oass.SolrDispatchFilter.init user.dir=/usr/home/hudson/hudson-slave/workspace/Lucene-Solr-Tests-trunk-java7/solr/build/solr-core/test/J1
[junit4:junit4]   2> 12337 T816 oass.SolrDispatchFilter.init SolrDispatchFilter.init() done
[junit4:junit4]   2> 12338 T816 oascsi.HttpClientUtil.createClient Creating new http client, config:maxConnections=128&maxConnectionsPerHost=32&followRedirects=false
[junit4:junit4]   2> 12352 T837 oascc.ZkStateReader.updateClusterState Updating cloud state from ZooKeeper... 
[junit4:junit4]   2> 12363 T816 oaz.ZooKeeper.<init> Initiating client connection, connectString=127.0.0.1:11384/solr sessionTimeout=10000 watcher=org.apache.solr.common.cloud.ConnectionManager@1d838541
[junit4:junit4]   2> 12364 T890 oaz.ClientCnxn$SendThread.startConnect Opening socket connection to server /127.0.0.1:11384
[junit4:junit4]   2> 12364 T850 oascc.ZkStateReader$2.process A cluster state change has occurred - updating...
[junit4:junit4]   2> 12364 T887 oascc.ZkStateReader$2.process A cluster state change has occurred - updating...
[junit4:junit4]   2> 12364 T816 oascc.ConnectionManager.waitForConnected Waiting for client to connect to ZooKeeper
[junit4:junit4]   2> 12364 T836 oascc.ZkStateReader$2.process A cluster state change has occurred - updating...
[junit4:junit4]   2> 12366 T890 oaz.ClientCnxn$SendThread.primeConnection Socket connection established to localhost/127.0.0.1:11384, initiating session
[junit4:junit4]   2> 12366 T818 oazs.NIOServerCnxn$Factory.run Accepted socket connection from /140.211.11.196:49961
[junit4:junit4]   2> 12364 T874 oascc.ZkStateReader$2.process A cluster state change has occurred - updating...
[junit4:junit4]   2> 12364 T862 oascc.ZkStateReader$2.process A cluster state change has occurred - updating...
[junit4:junit4]   2> 12366 T818 oazs.NIOServerCnxn.readConnectRequest Client attempting to establish new session at /140.211.11.196:49961
[junit4:junit4]   2> 12369 T820 oazs.NIOServerCnxn.finishSessionInit Established session 0x139c3de082f0007 with negotiated timeout 10000 for client /140.211.11.196:49961
[junit4:junit4]   2> 12369 T890 oaz.ClientCnxn$SendThread.readConnectResult Session establishment complete on server localhost/127.0.0.1:11384, sessionid = 0x139c3de082f0007, negotiated timeout = 10000
[junit4:junit4]   2> 12370 T891 oascc.ConnectionManager.process Watcher org.apache.solr.common.cloud.ConnectionManager@1d838541 name:ZooKeeperConnection Watcher:127.0.0.1:11384/solr got event WatchedEvent state:SyncConnected type:None path:null path:null type:None
[junit4:junit4]   2> 12370 T816 oascc.ConnectionManager.waitForConnected Client is connected to ZooKeeper
[junit4:junit4]   2> 12371 T816 oascc.ZkStateReader.createClusterStateWatchersAndUpdate Updating cluster state from ZooKeeper... 
[junit4:junit4]   2> 12373 T816 oasc.ChaosMonkey.monkeyLog monkey: init - expire sessions:true cause connection loss:true
[junit4:junit4]   2> 12374 T816 oascsi.HttpClientUtil.createClient Creating new http client, config:
[junit4:junit4]   2> 12400 T816 oascc.ZkStateReader.updateClusterState Updating cloud state from ZooKeeper... 
[junit4:junit4]   2> ASYNC  NEW_CORE C110 name=collection1 org.apache.solr.core.SolrCore@15039ea6 url=http://127.0.0.1:27274/solr/collection1 node=127.0.0.1:27274_solr
[junit4:junit4]   2> 12439 T828 C110 P27274 oasc.SolrDeletionPolicy.onInit SolrDeletionPolicy.onInit: commits:num=1
[junit4:junit4]   2> 		commit{dir=NRTCachingDirectory(org.apache.lucene.store.NIOFSDirectory@/usr/home/hudson/hudson-slave/workspace/Lucene-Solr-Tests-trunk-java7/solr/build/solr-core/test/J1/org.apache.solr.cloud.BasicDistributedZk2Test-1347610871850/control/data/index lockFactory=org.apache.lucene.store.NativeFSLockFactory@43375017; maxCacheMB=48.0 maxMergeSizeMB=4.0),segFN=segments_1,generation=1,filenames=[segments_1]
[junit4:junit4]   2> 12440 T828 C110 P27274 oasc.SolrDeletionPolicy.updateCommits newest commit = 1
[junit4:junit4]   2> 12446 T828 C110 P27274 /update {wt=javabin&version=2} {add=[1 (1413072430592688128)]} 0 14
[junit4:junit4]   2> 12447 T816 oaz.ZooKeeper.<init> Initiating client connection, connectString=127.0.0.1:11384/solr sessionTimeout=10000 watcher=org.apache.solr.common.cloud.ConnectionManager@4ae1647e
[junit4:junit4]   2> 12448 T892 oaz.ClientCnxn$SendThread.startConnect Opening socket connection to server /127.0.0.1:11384
[junit4:junit4]   2> 12448 T816 oascc.ConnectionManager.waitForConnected Waiting for client to connect to ZooKeeper
[junit4:junit4]   2> 12450 T892 oaz.ClientCnxn$SendThread.primeConnection Socket connection established to localhost/127.0.0.1:11384, initiating session
[junit4:junit4]   2> 12450 T818 oazs.NIOServerCnxn$Factory.run Accepted socket connection from /140.211.11.196:49963
[junit4:junit4]   2> 12451 T818 oazs.NIOServerCnxn.readConnectRequest Client attempting to establish new session at /140.211.11.196:49963
[junit4:junit4]   2> 12452 T820 oazs.NIOServerCnxn.finishSessionInit Established session 0x139c3de082f0008 with negotiated timeout 10000 for client /140.211.11.196:49963
[junit4:junit4]   2> 12452 T892 oaz.ClientCnxn$SendThread.readConnectResult Session establishment complete on server localhost/127.0.0.1:11384, sessionid = 0x139c3de082f0008, negotiated timeout = 10000
[junit4:junit4]   2> 12453 T893 oascc.ConnectionManager.process Watcher org.apache.solr.common.cloud.ConnectionManager@4ae1647e name:ZooKeeperConnection Watcher:127.0.0.1:11384/solr got event WatchedEvent state:SyncConnected type:None path:null path:null type:None
[junit4:junit4]   2> 12453 T816 oascc.ConnectionManager.waitForConnected Client is connected to ZooKeeper
[junit4:junit4]   2> 12454 T816 oascc.ZkStateReader.createClusterStateWatchersAndUpdate Updating cluster state from ZooKeeper... 
[junit4:junit4]   2> ASYNC  NEW_CORE C111 name=collection1 org.apache.solr.core.SolrCore@1f491ded url=http://127.0.0.1:59593/solr/collection1 node=127.0.0.1:59593_solr
[junit4:junit4]   2> 12504 T843 C111 P59593 oasc.SolrDeletionPolicy.onInit SolrDeletionPolicy.onInit: commits:num=1
[junit4:junit4]   2> 		commit{dir=NRTCachingDirectory(org.apache.lucene.store.NIOFSDirectory@/usr/home/hudson/hudson-slave/workspace/Lucene-Solr-Tests-trunk-java7/solr/build/solr-core/test/J1/org.apache.solr.cloud.BasicDistributedZk2Test-1347610871850/jetty1/index lockFactory=org.apache.lucene.store.NativeFSLockFactory@785066ce; maxCacheMB=48.0 maxMergeSizeMB=4.0),segFN=segments_1,generation=1,filenames=[segments_1]
[junit4:junit4]   2> 12505 T843 C111 P59593 oasc.SolrDeletionPolicy.updateCommits newest commit = 1
[junit4:junit4]   2>  C108_STATE=coll:collection1 core:collection1 props:{shard=shard1, roles=null, state=recovering, core=collection1, collection=collection1, node_name=127.0.0.1:49951_solr, base_url=http://127.0.0.1:49951/solr}
[junit4:junit4]   2> 12538 T866 C108 P49951 oasc.SolrDeletionPolicy.onInit SolrDeletionPolicy.onInit: commits:num=1
[junit4:junit4]   2> 		commit{dir=NRTCachingDirectory(org.apache.lucene.store.NIOFSDirectory@/usr/home/hudson/hudson-slave/workspace/Lucene-Solr-Tests-trunk-java7/solr/build/solr-core/test/J1/org.apache.solr.cloud.BasicDistributedZk2Test-1347610871850/jetty3/index lockFactory=org.apache.lucene.store.NativeFSLockFactory@45b1c0b1; maxCacheMB=48.0 maxMergeSizeMB=4.0),segFN=segments_1,generation=1,filenames=[segments_1]
[junit4:junit4]   2> 12540 T866 C108 P49951 oasc.SolrDeletionPolicy.updateCommits newest commit = 1
[junit4:junit4]   2> 12548 T866 C108 P49951 REQ /update {update.distrib=FROMLEADER&distrib.from=http://127.0.0.1:59593/solr/collection1/&wt=javabin&version=2} status=0 QTime=24 
[junit4:junit4]   2> 12551 T843 C111 P59593 REQ /update {distrib.from=http://127.0.0.1:44139/solr/collection1/&update.distrib=TOLEADER&wt=javabin&version=2} status=0 QTime=60 
[junit4:junit4]   2> ASYNC  NEW_CORE C112 name=collection1 org.apache.solr.core.SolrCore@5917c544 url=http://127.0.0.1:44139/solr/collection1 node=127.0.0.1:44139_solr
[junit4:junit4]   2> 12552 T855 C112 P44139 /update {wt=javabin&version=2} {add=[1]} 0 81
[junit4:junit4]   2> 12554 T816 oasc.AbstractDistribZkTestBase.waitForRecoveriesToFinish Wait for recoveries to finish - collection: collection1 failOnTimeout:true timeout (sec):1440
[junit4:junit4]   2> 12556 T816 oascc.ZkStateReader.updateClusterState Updating cloud state from ZooKeeper... 
[junit4:junit4]   2> 13559 T816 oascc.ZkStateReader.updateClusterState Updating cloud state from ZooKeeper... 
[junit4:junit4]   2> 14562 T816 oascc.ZkStateReader.updateClusterState Updating cloud state from ZooKeeper... 
[junit4:junit4]   2> 15565 T816 oascc.ZkStateReader.updateClusterState Updating cloud state from ZooKeeper... 
[junit4:junit4]   2> 16362 T876 C108 P49951 oasc.RecoveryStrategy.doRecovery Attempting to PeerSync from http://127.0.0.1:59593/solr/collection1/ core=collection1 - recoveringAfterStartup=true
[junit4:junit4]   2> 16364 T876 C108 P49951 oasu.PeerSync.sync PeerSync: core=collection1 url=http://127.0.0.1:49951/solr START replicas=[http://127.0.0.1:59593/solr/collection1/] nUpdates=100
[junit4:junit4]   2> 16365 T876 C108 P49951 oasc.RecoveryStrategy.doRecovery PeerSync Recovery was not successful - trying replication. core=collection1
[junit4:junit4]   2> 16365 T876 C108 P49951 oasc.RecoveryStrategy.doRecovery Starting Replication Recovery. core=collection1
[junit4:junit4]   2> 16365 T876 C108 P49951 oasc.RecoveryStrategy.doRecovery Begin buffering updates. core=collection1
[junit4:junit4]   2> 16366 T876 C108 P49951 oasu.UpdateLog.bufferUpdates Starting to buffer updates. FSUpdateLog{state=ACTIVE, tlog=tlog{file=./org.apache.solr.cloud.BasicDistributedZk2Test-1347610871850/jetty3/tlog/tlog.0000000000000000000 refcount=1}}
[junit4:junit4]   2> 16366 T876 C108 P49951 oasc.RecoveryStrategy.replicate Attempting to replicate from http://127.0.0.1:59593/solr/collection1/. core=collection1
[junit4:junit4]   2> 16367 T876 C108 P49951 oascsi.HttpClientUtil.createClient Creating new http client, config:maxConnections=128&maxConnectionsPerHost=32&followRedirects=false
[junit4:junit4]   2> 16368 T844 C111 P59593 REQ /get {distrib=false&qt=/get&wt=javabin&version=2&getVersions=100} status=0 QTime=0 
[junit4:junit4]   2> 16397 T845 C111 P59593 oasu.DirectUpdateHandler2.commit start commit{flags=0,_version_=0,optimize=false,openSearcher=true,waitSearcher=true,expungeDeletes=false,softCommit=false}
[junit4:junit4]   2> 16569 T816 oascc.ZkStateReader.updateClusterState Updating cloud state from ZooKeeper... 
[junit4:junit4]   2> 16713 T845 C111 P59593 oasc.SolrDeletionPolicy.onCommit SolrDeletionPolicy.onCommit: commits:num=2
[junit4:junit4]   2> 		commit{dir=NRTCachingDirectory(org.apache.lucene.store.NIOFSDirectory@/usr/home/hudson/hudson-slave/workspace/Lucene-Solr-Tests-trunk-java7/solr/build/solr-core/test/J1/org.apache.solr.cloud.BasicDistributedZk2Test-1347610871850/jetty1/index lockFactory=org.apache.lucene.store.NativeFSLockFactory@785066ce; maxCacheMB=48.0 maxMergeSizeMB=4.0),segFN=segments_1,generation=1,filenames=[segments_1]
[junit4:junit4]   2> 		commit{dir=NRTCachingDirectory(org.apache.lucene.store.NIOFSDirectory@/usr/home/hudson/hudson-slave/workspace/Lucene-Solr-Tests-trunk-java7/solr/build/solr-core/test/J1/org.apache.solr.cloud.BasicDistributedZk2Test-1347610871850/jetty1/index lockFactory=org.apache.lucene.store.NativeFSLockFactory@785066ce; maxCacheMB=48.0 maxMergeSizeMB=4.0),segFN=segments_2,generation=2,filenames=[_0_MockSep_0.pos, _0_MockVariableIntBlock_0.doc, _0_MockVariableIntBlock_0.skp, _0_MockVariableIntBlock_0.pyl, _0_MockSep_0.skp, _0_MockVariableIntBlock_0.tib, _0_MockVariableIntBlock_0.pos, _0.si, _0_MockSep_0.doc, _0_MockVariableIntBlock_0.tii, _0_MockRandom_0.tib, _0.fnm, _0_Memory_0.ram, _0_nrm.cfs, _0_MockRandom_0.skp, _0_MockSep_0.tib, _0_MockRandom_0.sd, _0_MockRandom_0.frq, _0_MockRandom_0.tiv, _0_MockRandom_0.doc, _0_nrm.cfe, _0_MockVariableIntBlock_0.frq, _0_MockRandom_0.pos, _0_MockSep_0.frq, segments_2, _0.fdx, _0_MockSep_0.tii, _0_MockSep_0.pyl, _0_MockRandom_0.pyl, _0.fdt]
[junit4:junit4]   2> 16714 T845 C111 P59593 oasc.SolrDeletionPolicy.updateCommits newest commit = 2
[junit4:junit4]   2> 16761 T845 C111 P59593 oass.SolrIndexSearcher.<init> Opening Searcher@5b967893 main
[junit4:junit4]   2> 16762 T845 C111 P59593 oasu.DirectUpdateHandler2.commit end_commit_flush
[junit4:junit4]   2> 16764 T851 oasc.SolrCore.registerSearcher [collection1] Registered new searcher Searcher@5b967893 main{StandardDirectoryReader(segments_2:3 _0(5.0):C1)}
[junit4:junit4]   2> 16765 T845 C111 P59593 /update {waitSearcher=true&commit=true&commit_end_point=true&wt=javabin&softCommit=false&version=2} {commit=} 0 368
[junit4:junit4]   2> 16766 T876 C108 P49951 oash.ReplicationHandler.inform Commits will be reserved for  10000
[junit4:junit4]   2> 16766 T876 C108 P49951 oash.SnapPuller.<init>  No value set for 'pollInterval'. Timer Task not started.
[junit4:junit4]   2> 16770 T846 C111 P59593 oash.ReplicationHandler.inform Commits will be reserved for  10000
[junit4:junit4]   2> 16770 T846 C111 P59593 REQ /replication {command=indexversion&wt=javabin&qt=/replication&version=2} status=0 QTime=3 
[junit4:junit4]   2> 16771 T876 C108 P49951 oash.SnapPuller.fetchLatestIndex Master's generation: 2
[junit4:junit4]   2> 16772 T876 C108 P49951 oash.SnapPuller.fetchLatestIndex Slave's generation: 1
[junit4:junit4]   2> 16772 T876 C108 P49951 oash.SnapPuller.fetchLatestIndex Starting replication process
[junit4:junit4]   2> 16783 T846 C111 P59593 REQ /replication {command=filelist&generation=2&wt=javabin&qt=/replication&version=2} status=0 QTime=8 
[junit4:junit4]   2> 16785 T876 C108 P49951 oash.SnapPuller.fetchLatestIndex Number of files in latest index in master: 30
[junit4:junit4]   2> 16818 T876 C108 P49951 oash.SnapPuller.fetchLatestIndex Starting download to ./org.apache.solr.cloud.BasicDistributedZk2Test-1347610871850/jetty3/index.20120914042128632 fullCopy=true
[junit4:junit4]   2> 16826 T846 C111 P59593 REQ /replication {file=_0_MockSep_0.pos&command=filecontent&checksum=true&generation=2&qt=/replication&wt=filestream} status=0 QTime=1 
[junit4:junit4]   2> 16838 T846 C111 P59593 REQ /replication {file=_0_MockVariableIntBlock_0.doc&command=filecontent&checksum=true&generation=2&qt=/replication&wt=filestream} status=0 QTime=1 
[junit4:junit4]   2> 16846 T846 C111 P59593 REQ /replication {file=_0_MockVariableIntBlock_0.skp&command=filecontent&checksum=true&generation=2&qt=/replication&wt=filestream} status=0 QTime=1 
[junit4:junit4]   2> 16847 T876 C108 P49951 oash.SnapPuller$FileFetcher.fetchPackets WARNING No content recieved for file: {name=_0_MockVariableIntBlock_0.skp, lastmodified=1347610888000, size=0}
[junit4:junit4]   2> 16853 T846 C111 P59593 REQ /replication {file=_0_MockVariableIntBlock_0.pyl&command=filecontent&checksum=true&generation=2&qt=/replication&wt=filestream} status=0 QTime=0 
[junit4:junit4]   2> 16855 T876 C108 P49951 oash.SnapPuller$FileFetcher.fetchPackets WARNING No content recieved for file: {name=_0_MockVariableIntBlock_0.pyl, lastmodified=1347610888000, size=0}
[junit4:junit4]   2> 16859 T846 C111 P59593 REQ /replication {file=_0_MockVariableIntBlock_0.tib&command=filecontent&checksum=true&generation=2&qt=/replication&wt=filestream} status=0 QTime=0 
[junit4:junit4]   2> 16864 T846 C111 P59593 REQ /replication {file=_0_MockSep_0.skp&command=filecontent&checksum=true&generation=2&qt=/replication&wt=filestream} status=0 QTime=0 
[junit4:junit4]   2> 16866 T876 C108 P49951 oash.SnapPuller$FileFetcher.fetchPackets WARNING No content recieved for file: {name=_0_MockSep_0.skp, lastmodified=1347610888000, size=0}
[junit4:junit4]   2> 16870 T846 C111 P59593 REQ /replication {file=_0_MockVariableIntBlock_0.pos&command=filecontent&checksum=true&generation=2&qt=/replication&wt=filestream} status=0 QTime=0 
[junit4:junit4]   2> 16876 T846 C111 P59593 REQ /replication {file=_0_MockSep_0.doc&command=filecontent&checksum=true&generation=2&qt=/replication&wt=filestream} status=0 QTime=1 
[junit4:junit4]   2> 16911 T846 C111 P59593 REQ /replication {file=_0.si&command=filecontent&checksum=true&generation=2&qt=/replication&wt=filestream} status=0 QTime=1 
[junit4:junit4]   2> 16917 T846 C111 P59593 REQ /replication {file=_0_MockVariableIntBlock_0.tii&command=filecontent&checksum=true&generation=2&qt=/replication&wt=filestream} status=0 QTime=0 
[junit4:junit4]   2> 16925 T846 C111 P59593 REQ /replication {file=_0_MockRandom_0.tib&command=filecontent&checksum=true&generation=2&qt=/replication&wt=filestream} status=0 QTime=1 
[junit4:junit4]   2> 16935 T846 C111 P59593 REQ /replication {file=_0.fnm&command=filecontent&checksum=true&generation=2&qt=/replication&wt=filestream} status=0 QTime=1 
[junit4:junit4]   2> 16940 T846 C111 P59593 REQ /replication {file=_0_Memory_0.ram&command=filecontent&checksum=true&generation=2&qt=/replication&wt=filestream} status=0 QTime=0 
[junit4:junit4]   2> 16946 T846 C111 P59593 REQ /replication {file=_0_nrm.cfs&command=filecontent&checksum=true&generation=2&qt=/replication&wt=filestream} status=0 QTime=0 
[junit4:junit4]   2> 16952 T846 C111 P59593 REQ /replication {file=_0_MockRandom_0.skp&command=filecontent&checksum=true&generation=2&qt=/replication&wt=filestream} status=0 QTime=0 
[junit4:junit4]   2> 16954 T876 C108 P49951 oash.SnapPuller$FileFetcher.fetchPackets WARNING No content recieved for file: {name=_0_MockRandom_0.skp, lastmodified=1347610888000, size=0}
[junit4:junit4]   2> 17006 T846 C111 P59593 REQ /replication {file=_0_MockSep_0.tib&command=filecontent&checksum=true&generation=2&qt=/replication&wt=filestream} status=0 QTime=0 
[junit4:junit4]   2> 17049 T846 C111 P59593 REQ /replication {file=_0_MockRandom_0.frq&command=filecontent&checksum=true&generation=2&qt=/replication&wt=filestream} status=0 QTime=0 
[junit4:junit4]   2> 17054 T846 C111 P59593 REQ /replication {file=_0_MockRandom_0.sd&command=filecontent&checksum=true&generation=2&qt=/replication&wt=filestream} status=0 QTime=0 
[junit4:junit4]   2> 17059 T846 C111 P59593 REQ /replication {file=_0_MockRandom_0.tiv&command=filecontent&checksum=true&generation=2&qt=/replication&wt=filestream} status=0 QTime=0 
[junit4:junit4]   2> 17070 T846 C111 P59593 REQ /replication {file=_0_MockRandom_0.doc&command=filecontent&checksum=true&generation=2&qt=/replication&wt=filestream} status=0 QTime=0 
[junit4:junit4]   2> 17075 T846 C111 P59593 REQ /replication {file=_0_MockRandom_0.pos&command=filecontent&checksum=true&generation=2&qt=/replication&wt=filestream} status=0 QTime=0 
[junit4:junit4]   2> 17080 T846 C111 P59593 REQ /replication {file=_0_MockVariableIntBlock_0.frq&command=filecontent&checksum=true&generation=2&qt=/replication&wt=filestream} status=0 QTime=0 
[junit4:junit4]   2> 17088 T846 C111 P59593 REQ /replication {file=_0_nrm.cfe&command=filecontent&checksum=true&generation=2&qt=/replication&wt=filestream} status=0 QTime=0 
[junit4:junit4]   2> 17099 T846 C111 P59593 REQ /replication {file=segments_2&command=filecontent&checksum=true&generation=2&qt=/replication&wt=filestream} status=0 QTime=1 
[junit4:junit4]   2> 17126 T846 C111 P59593 REQ /replication {file=_0_MockSep_0.frq&command=filecontent&checksum=true&generation=2&qt=/replication&wt=filestream} status=0 QTime=1 
[junit4:junit4]   2> 17189 T846 C111 P59593 REQ /replication {file=_0.fdx&command=filecontent&checksum=true&generation=2&qt=/replication&wt=filestream} status=0 QTime=1 
[junit4:junit4]   2> 17197 T846 C111 P59593 REQ /replication {file=_0_MockSep_0.tii&command=filecontent&checksum=true&generation=2&qt=/replication&wt=filestream} status=0 QTime=0 
[junit4:junit4]   2> 17204 T846 C111 P59593 REQ /replication {file=_0_MockRandom_0.pyl&command=filecontent&checksum=true&generation=2&qt=/replication&wt=filestream} status=0 QTime=1 
[junit4:junit4]   2> 17207 T876 C108 P49951 oash.SnapPuller$FileFetcher.fetchPackets WARNING No content recieved for file: {name=_0_MockRandom_0.pyl, lastmodified=1347610888000, size=0}
[junit4:junit4]   2> 17212 T846 C111 P59593 REQ /replication {file=_0_MockSep_0.pyl&command=filecontent&checksum=true&generation=2&qt=/replication&wt=filestream} status=0 QTime=1 
[junit4:junit4]   2> 17214 T876 C108 P49951 oash.SnapPuller$FileFetcher.fetchPackets WARNING No content recieved for file: {name=_0_MockSep_0.pyl, lastmodified=1347610888000, size=0}
[junit4:junit4]   2> 17220 T846 C111 P59593 REQ /replication {file=_0.fdt&command=filecontent&checksum=true&generation=2&qt=/replication&wt=filestream} status=0 QTime=1 
[junit4:junit4]   2> 17223 T876 C108 P49951 oash.SnapPuller.fetchLatestIndex Total time taken for download : 0 secs
[junit4:junit4]   2> 17223 T876 C108 P49951 oash.SnapPuller.modifyIndexProps New index installed. Updating index properties... index=index.20120914042128632
[junit4:junit4]   2> 17226 T876 C108 P49951 oasu.DefaultSolrCoreState.newIndexWriter Creating new IndexWriter...
[junit4:junit4]   2> 17227 T876 C108 P49951 oasu.DefaultSolrCoreState.newIndexWriter Waiting until IndexWriter is unused... core=collection1
[junit4:junit4]   2> 17227 T876 C108 P49951 oasu.DefaultSolrCoreState.newIndexWriter Rollback old IndexWriter... core=collection1
[junit4:junit4]   2> 17256 T876 C108 P49951 oasc.SolrCore.getNewIndexDir WARNING New index directory detected: old=./org.apache.solr.cloud.BasicDistributedZk2Test-1347610871850/jetty3/index/ new=./org.apache.solr.cloud.BasicDistributedZk2Test-1347610871850/jetty3/index.20120914042128632
[junit4:junit4]   2> 17258 T876 C108 P49951 oasc.CachingDirectoryFactory.get return new directory for /usr/home/hudson/hudson-slave/workspace/Lucene-Solr-Tests-trunk-java7/solr/build/solr-core/test/J1/./org.apache.solr.cloud.BasicDistributedZk2Test-1347610871850/jetty3/index.20120914042128632 forceNew:true
[junit4:junit4]   2> 17291 T876 C108 P49951 oasc.SolrDeletionPolicy.onInit SolrDeletionPolicy.onInit: commits:num=1
[junit4:junit4]   2> 		commit{dir=NRTCachingDirectory(org.apache.lucene.store.NIOFSDirectory@/usr/home/hudson/hudson-slave/workspace/Lucene-Solr-Tests-trunk-java7/solr/build/solr-core/test/J1/org.apache.solr.cloud.BasicDistributedZk2Test-1347610871850/jetty3/index.20120914042128632 lockFactory=org.apache.lucene.store.NativeFSLockFactory@c73606; maxCacheMB=48.0 maxMergeSizeMB=4.0),segFN=segments_2,generation=2,filenames=[_0_MockSep_0.pos, _0_MockVariableIntBlock_0.doc, _0_MockVariableIntBlock_0.skp, _0_MockVariableIntBlock_0.pyl, _0_MockVariableIntBlock_0.tib, _0_MockSep_0.skp, _0_MockVariableIntBlock_0.pos, _0_MockSep_0.doc, _0.si, _0_MockVariableIntBlock_0.tii, _0_MockRandom_0.tib, _0.fnm, _0_Memory_0.ram, _0_nrm.cfs, _0_MockRandom_0.skp, _0_MockSep_0.tib, _0_MockRandom_0.sd, _0_MockRandom_0.frq, _0_MockRandom_0.tiv, _0_MockRandom_0.doc, _0_nrm.cfe, _0_MockVariableIntBlock_0.frq, _0_MockRandom_0.pos, _0_MockSep_0.frq, segments_2, _0.fdx, _0_MockSep_0.tii, _0_MockRandom_0.pyl, _0_MockSep_0.pyl, _0.fdt]
[junit4:junit4]   2> 17292 T876 C108 P49951 oasc.SolrDeletionPolicy.updateCommits newest commit = 2
[junit4:junit4]   2> 17293 T876 C108 P49951 oasu.DefaultSolrCoreState.newIndexWriter New IndexWriter is ready to be used.
[junit4:junit4]   2> 17304 T876 C108 P49951 oass.SolrIndexSearcher.<init> Opening Searcher@3466873 main
[junit4:junit4]   2> 17308 T875 oasc.SolrCore.registerSearcher [collection1] Registered new searcher Searcher@3466873 main{StandardDirectoryReader(segments_2:3:nrt _0(5.0):C1)}
[junit4:junit4]   2> 17309 T875 oasc.CachingDirectoryFactory.close Closing directory:/usr/home/hudson/hudson-slave/workspace/Lucene-Solr-Tests-trunk-java7/solr/build/solr-core/test/J1/./org.apache.solr.cloud.BasicDistributedZk2Test-1347610871850/jetty3/index
[junit4:junit4]   2> 17310 T875 oash.SnapPuller$2.onClose removing old index directory ./org.apache.solr.cloud.BasicDistributedZk2Test-1347610871850/jetty3/index
[junit4:junit4]   2> 17315 T876 C108 P49951 oasu.DirectUpdateHandler2.commit start commit{flags=0,_version_=0,optimize=false,openSearcher=true,waitSearcher=true,expungeDeletes=false,softCommit=false}
[junit4:junit4]   2> 17319 T876 C108 P49951 oass.SolrIndexSearcher.<init> Opening Searcher@982aa8a main
[junit4:junit4]   2> 17322 T876 C108 P49951 oasu.DirectUpdateHandler2.commit end_commit_flush
[junit4:junit4]   2> 17323 T875 oasc.SolrCore.registerSearcher [collection1] Registered new searcher Searcher@982aa8a main{StandardDirectoryReader(segments_2:3:nrt _0(5.0):C1)}
[junit4:junit4]   2> 17324 T876 C108 P49951 oasc.RecoveryStrategy.replay Replaying buffered documents. core=collection1
[junit4:junit4]   2> 17325 T898 C108 P49951 oasu.UpdateLog$LogReplayer.doReplay WARNING Starting log replay tlog{file=./org.apache.solr.cloud.BasicDistributedZk2Test-1347610871850/jetty3/tlog/tlog.0000000000000000000 refcount=2} active=true starting pos=432
[junit4:junit4]   2> 17325 T898 C108 P49951 oasu.DirectUpdateHandler2.commit start commit{flags=2,_version_=0,optimize=false,openSearcher=true,waitSearcher=true,expungeDeletes=false,softCommit=false}
[junit4:junit4]   2> 17328 T898 C108 P49951 oass.SolrIndexSearcher.<init> Opening Searcher@778ade03 main
[junit4:junit4]   2> 17330 T898 C108 P49951 oasu.DirectUpdateHandler2.commit end_commit_flush
[junit4:junit4]   2> 17333 T875 oasc.SolrCore.registerSearcher [collection1] Registered new searcher Searcher@778ade03 main{StandardDirectoryReader(segments_2:3:nrt _0(5.0):C1)}
[junit4:junit4]   2> 17334 T898 C108 P49951 oasu.UpdateLog$LogReplayer.run WARNING Log replay finished. recoveryInfo=RecoveryInfo{adds=0 deletes=0 deleteByQuery=0 errors=0 positionOfStart=432}
[junit4:junit4]   2> 17334 T876 C108 P49951 oasc.RecoveryStrategy.doRecovery Replication Recovery was successful - registering as Active. core=collection1
[junit4:junit4]   2> 17340 T876 C108 P49951 oasc.RecoveryStrategy.doRecovery Finished recovery process. core=collection1
[junit4:junit4]   2> 17417 T837 oascc.ZkStateReader.updateClusterState Updating cloud state from ZooKeeper... 
[junit4:junit4]   2> 17436 T874 oascc.ZkStateReader$2.process A cluster state change has occurred - updating...
[junit4:junit4]   2> 17437 T836 oascc.ZkStateReader$2.process A cluster state change has occurred - updating...
[junit4:junit4]   2> 17437 T893 oascc.ZkStateReader$2.process A cluster state change has occurred - updating...
[junit4:junit4]   2> 17437 T850 oascc.ZkStateReader$2.process A cluster state change has occurred - updating...
[junit4:junit4]   2> 17437 T891 oascc.ZkStateReader$2.process A cluster state change has occurred - updating...
[junit4:junit4]   2> 17437 T887 oascc.ZkStateReader$2.process A cluster state change has occurred - updating...
[junit4:junit4]   2> 17437 T862 oascc.ZkStateReader$2.process A cluster state change has occurred - updating...
[junit4:junit4]   2> 17574 T816 oascc.ZkStateReader.updateClusterState Updating cloud state from ZooKeeper... 
[junit4:junit4]   2> 18579 T816 oascc.ZkStateReader.updateClusterState Updating cloud state from ZooKeeper... 
[junit4:junit4]   2>  C109_STATE=coll:collection1 core:collection1 props:{shard=shard2, roles=null, state=recovering, core=collection1, collection=collection1, node_name=127.0.0.1:49956_solr, base_url=http://127.0.0.1:49956/solr}
[junit4:junit4]   2> 19367 T889 C109 P49956 oasc.RecoveryStrategy.doRecovery Attempting to PeerSync from http://127.0.0.1:44139/solr/collection1/ core=collection1 - recoveringAfterStartup=true
[junit4:junit4]   2> 19368 T889 C109 P49956 oasu.PeerSync.sync PeerSync: core=collection1 url=http://127.0.0.1:49956/solr START replicas=[http://127.0.0.1:44139/solr/collection1/] nUpdates=100
[junit4:junit4]   2> 19368 T889 C109 P49956 oasc.RecoveryStrategy.doRecovery PeerSync Recovery was not successful - trying replication. core=collection1
[junit4:junit4]   2> 19369 T889 C109 P49956 oasc.RecoveryStrategy.doRecovery Starting Replication Recovery. core=collection1
[junit4:junit4]   2> 19369 T889 C109 P49956 oasc.RecoveryStrategy.doRecovery Begin buffering updates. core=collection1
[junit4:junit4]   2> 19369 T889 C109 P49956 oasu.UpdateLog.bufferUpdates Starting to buffer updates. FSUpdateLog{state=ACTIVE, tlog=null}
[junit4:junit4]   2> 19369 T889 C109 P49956 oasc.RecoveryStrategy.replicate Attempting to replicate from http://127.0.0.1:44139/solr/collection1/. core=collection1
[junit4:junit4]   2> 19370 T889 C109 P49956 oascsi.HttpClientUtil.createClient Creating new http client, config:maxConnections=128&maxConnectionsPerHost=32&followRedirects=false
[junit4:junit4]   2> 19371 T856 C112 P44139 REQ /get {distrib=false&qt=/get&wt=javabin&version=2&getVersions=100} status=0 QTime=1 
[junit4:junit4]   2> 19393 T857 C112 P44139 oasu.DirectUpdateHandler2.commit start commit{flags=0,_version_=0,optimize=false,openSearcher=true,waitSearcher=true,expungeDeletes=false,softCommit=false}
[junit4:junit4]   2> 19414 T857 C112 P44139 oasc.SolrDeletionPolicy.onInit SolrDeletionPolicy.onInit: commits:num=1
[junit4:junit4]   2> 		commit{dir=NRTCachingDirectory(org.apache.lucene.store.NIOFSDirectory@/usr/home/hudson/hudson-slave/workspace/Lucene-Solr-Tests-trunk-java7/solr/build/solr-core/test/J1/org.apache.solr.cloud.BasicDistributedZk2Test-1347610871850/jetty2/index lockFactory=org.apache.lucene.store.NativeFSLockFactory@4516569f; maxCacheMB=48.0 maxMergeSizeMB=4.0),segFN=segments_1,generation=1,filenames=[segments_1]
[junit4:junit4]   2> 19415 T857 C112 P44139 oasc.SolrDeletionPolicy.updateCommits newest commit = 1
[junit4:junit4]   2> 19418 T857 C112 P44139 oass.SolrIndexSearcher.<init> Opening Searcher@10c11ab0 main
[junit4:junit4]   2> 19419 T857 C112 P44139 oasu.DirectUpdateHandler2.commit end_commit_flush
[junit4:junit4]   2> 19421 T863 oasc.SolrCore.registerSearcher [collection1] Registered new searcher Searcher@10c11ab0 main{StandardDirectoryReader(segments_1:1)}
[junit4:junit4]   2> 19422 T857 C112 P44139 /update {waitSearcher=true&commit=true&commit_end_point=true&wt=javabin&softCommit=false&version=2} {commit=} 0 29
[junit4:junit4]   2> 19424 T889 C109 P49956 oash.ReplicationHandler.inform Commits will be reserved for  10000
[junit4:junit4]   2> 19424 T889 C109 P49956 oash.SnapPuller.<init>  No value set for 'pollInterval'. Timer Task not started.
[junit4:junit4]   2> 19427 T857 C112 P44139 oash.ReplicationHandler.inform Commits will be reserved for  10000
[junit4:junit4]   2> 19428 T857 C112 P44139 REQ /replication {command=indexversion&wt=javabin&qt=/replication&version=2} status=0 QTime=1 
[junit4:junit4]   2> 19437 T889 C109 P49956 oasc.SolrDeletionPolicy.onInit SolrDeletionPolicy.onInit: commits:num=1
[junit4:junit4]   2> 		commit{dir=NRTCachingDirectory(org.apache.lucene.store.NIOFSDirectory@/usr/home/hudson/hudson-slave/workspace/Lucene-Solr-Tests-trunk-java7/solr/build/solr-core/test/J1/org.apache.solr.cloud.BasicDistributedZk2Test-1347610871850/jetty4/index lockFactory=org.apache.lucene.store.NativeFSLockFactory@1a0c9fea; maxCacheMB=48.0 maxMergeSizeMB=4.0),segFN=segments_1,generation=1,filenames=[segments_1]
[junit4:junit4]   2> 19438 T889 C109 P49956 oasc.SolrDeletionPolicy.updateCommits newest commit = 1
[junit4:junit4]   2> 19439 T889 C109 P49956 oasu.DirectUpdateHandler2.commit start commit{flags=0,_version_=0,optimize=false,openSearcher=true,waitSearcher=true,expungeDeletes=false,softCommit=false}
[junit4:junit4]   2> 19461 T889 C109 P49956 oasc.SolrDeletionPolicy.onCommit SolrDeletionPolicy.onCommit: commits:num=2
[junit4:junit4]   2> 		commit{dir=NRTCachingDirectory(org.apache.lucene.store.NIOFSDirectory@/usr/home/hudson/hudson-slave/workspace/Lucene-Solr-Tests-trunk-java7/solr/build/solr-core/test/J1/org.apache.solr.cloud.BasicDistributedZk2Test-1347610871850/jetty4/index lockFactory=org.apache.lucene.store.NativeFSLockFactory@1a0c9fea; maxCacheMB=48.0 maxMergeSizeMB=4.0),segFN=segments_1,generation=1,filenames=[segments_1]
[junit4:junit4]   2> 		commit{dir=NRTCachingDirectory(org.apache.lucene.store.NIOFSDirectory@/usr/home/hudson/hudson-slave/workspace/Lucene-Solr-Tests-trunk-java7/solr/build/solr-core/test/J1/org.apache.solr.cloud.BasicDistributedZk2Test-1347610871850/jetty4/index lockFactory=org.apache.lucene.store.NativeFSLockFactory@1a0c9fea; maxCacheMB=48.0 maxMergeSizeMB=4.0),segFN=segments_2,generation=2,filenames=[segments_2]
[junit4:junit4]   2> 19461 T889 C109 P49956 oasc.SolrDeletionPolicy.updateCommits newest commit = 2
[junit4:junit4]   2> 19469 T889 C109 P49956 oass.SolrIndexSearcher.<init> Opening Searcher@6b61dd06 main
[junit4:junit4]   2> 19469 T889 C109 P49956 oasu.DirectUpdateHandler2.commit end_commit_flush
[junit4:junit4]   2> 19472 T888 oasc.SolrCore.registerSearcher [collection1] Registered new searcher Searcher@6b61dd06 main{StandardDirectoryReader(segments_2:2)}
[junit4:junit4]   2> 19473 T889 C109 P49956 oasc.RecoveryStrategy.replay No replay needed. core=collection1
[junit4:junit4]   2> 19473 T889 C109 P49956 oasc.RecoveryStrategy.doRecovery Replication Recovery was successful - registering as Active. core=collection1
[junit4:junit4]   2> 19475 T889 C109 P49956 oasc.RecoveryStrategy.doRecovery Finished recovery process. core=collection1
[junit4:junit4]   2> 19582 T816 oascc.ZkStateReader.updateClusterState Updating cloud state from ZooKeeper... 
[junit4:junit4]   2> 19980 T837 oascc.ZkStateReader.updateClusterState Updating cloud state from ZooKeeper... 
[junit4:junit4]   2> 19987 T891 oascc.ZkStateReader$2.process A cluster state change has occurred - updating...
[junit4:junit4]   2> 19987 T836 oascc.ZkStateReader$2.process A cluster state change has occurred - updating...
[junit4:junit4]   2> 19987 T893 oascc.ZkStateReader$2.process A cluster state change has occurred - updating...
[junit4:junit4]   2> 19987 T850 oascc.ZkStateReader$2.process A cluster state change has occurred - updating...
[junit4:junit4]   2> 19987 T874 oascc.ZkStateReader$2.process A cluster state change has occurred - updating...
[junit4:junit4]   2> 19987 T862 oascc.ZkStateReader$2.process A cluster state change has occurred - updating...
[junit4:junit4]   2> 19987 T887 oascc.ZkStateReader$2.process A cluster state change has occurred - updating...
[junit4:junit4]   2> 20585 T816 oascc.ZkStateReader.updateClusterState Updating cloud state from ZooKeeper... 
[junit4:junit4]   2> 20589 T828 C110 P27274 oasu.DirectUpdateHandler2.commit start commit{flags=0,_version_=0,optimize=false,openSearcher=true,waitSearcher=true,expungeDeletes=false,softCommit=false}
[junit4:junit4]   2> 20754 T828 C110 P27274 oasc.SolrDeletionPolicy.onCommit SolrDeletionPolicy.onCommit: commits:num=2
[junit4:junit4]   2> 		commit{dir=NRTCachingDirectory(org.apache.lucene.store.NIOFSDirectory@/usr/home/hudson/hudson-slave/workspace/Lucene-Solr-Tests-trunk-java7/solr/build/solr-core/test/J1/org.apache.solr.cloud.BasicDistributedZk2Test-1347610871850/control/data/index lockFactory=org.apache.lucene.store.NativeFSLockFactory@43375017; maxCacheMB=48.0 maxMergeSizeMB=4.0),segFN=segments_1,generation=1,filenames=[segments_1]
[junit4:junit4]   2> 		commit{dir=NRTCachingDirectory(org.apache.lucene.store.NIOFSDirectory@/usr/home/hudson/hudson-slave/workspace/Lucene-Solr-Tests-trunk-java7/solr/build/solr-core/test/J1/org.apache.solr.cloud.BasicDistributedZk2Test-1347610871850/control/data/index lockFactory=org.apache.lucene.store.NativeFSLockFactory@43375017; maxCacheMB=48.0 maxMergeSizeMB=4.0),segFN=segments_2,generation=2,filenames=[_0_MockSep_0.pos, _0_MockVariableIntBlock_0.doc, _0_MockRandom_0.prx, _0_MockVariableIntBlock_0.skp, _0_MockVariableIntBlock_0.pyl, _0_MockVariableIntBlock_0.tib, _0_MockSep_0.skp, _0_MockVariableIntBlock_0.pos, _0.si, _0_MockSep_0.doc, _0_MockVariableIntBlock_0.tii, _0_MockRandom_0.tib, _0.fnm, _0_Memory_0.ram, _0_nrm.cfs, _0_MockSep_0.tib, _0_MockRandom_0.sd, _0_MockRandom_0.frq, _0_nrm.cfe, _0_MockVariableIntBlock_0.frq, segments_2, _0_MockSep_0.frq, _0_MockRandom_0.tii, _0.fdx, _0_MockSep_0.tii, _0_MockSep_0.pyl, _0.fdt]
[junit4:junit4]   2> 20755 T828 C110 P27274 oasc.SolrDeletionPolicy.updateCommits newest commit = 2
[junit4:junit4]   2> 20841 T828 C110 P27274 oass.SolrIndexSearcher.<init> Opening Searcher@64d3257c main
[junit4:junit4]   2> 20842 T828 C110 P27274 oasu.DirectUpdateHandler2.commit end_commit_flush
[junit4:junit4]   2> 20845 T839 oasc.SolrCore.registerSearcher [collection1] Registered new searcher Searcher@64d3257c main{StandardDirectoryReader(segments_2:3 _0(5.0):C1)}
[junit4:junit4]   2> 20846 T828 C110 P27274 /update {waitSearcher=true&wt=javabin&commit=true&softCommit=false&version=2} {commit=} 0 257
[junit4:junit4]   2> 20848 T847 C111 P59593 oasu.DirectUpdateHandler2.commit start commit{flags=0,_version_=0,optimize=false,openSearcher=true,waitSearcher=true,expungeDeletes=false,softCommit=false}
[junit4:junit4]   2> 20860 T847 C111 P59593 oass.SolrIndexSearcher.<init> Opening Searcher@591caf25 main
[junit4:junit4]   2> 20860 T847 C111 P59593 oasu.DirectUpdateHandler2.commit end_commit_flush
[junit4:junit4]   2> 20862 T851 oasc.SolrCore.registerSearcher [collection1] Registered new searcher Searcher@591caf25 main{StandardDirectoryReader(segments_2:3 _0(5.0):C1)}
[junit4:junit4]   2> 20863 T847 C111 P59593 oasu.SolrCmdDistributor.distribCommit Distrib commit to:[StdNode: http://127.0.0.1:49951/solr/collection1/, StdNode: http://127.0.0.1:44139/solr/collection1/, StdNode: http://127.0.0.1:49956/solr/collection1/]
[junit4:junit4]   2> 20866 T859 C112 P44139 oasu.DirectUpdateHandler2.commit start commit{flags=0,_version_=0,optimize=false,openSearcher=true,waitSearcher=true,expungeDeletes=false,softCommit=false}
[junit4:junit4]   2>  C108_STATE=coll:collection1 core:collection1 props:{shard=shard1, roles=null, state=active, core=collection1, collection=collection1, node_name=127.0.0.1:49951_solr, base_url=http://127.0.0.1:49951/solr}
[junit4:junit4]   2> 20867 T866 C108 P49951 oasu.DirectUpdateHandler2.commit start commit{flags=0,_version_=0,optimize=false,openSearcher=true,waitSearcher=true,expungeDeletes=false,softCommit=false}
[junit4:junit4]   2> 20869 T866 C108 P49951 oass.SolrIndexSearcher.<init> Opening Searcher@479d0c7 main
[junit4:junit4]   2> 20870 T866 C108 P49951 oasu.DirectUpdateHandler2.commit end_commit_flush
[junit4:junit4]   2> 20871 T859 C112 P44139 oass.SolrIndexSearcher.<init> Opening Searcher@46eb5928 main
[junit4:junit4]   2> 20871 T859 C112 P44139 oasu.DirectUpdateHandler2.commit end_commit_flush
[junit4:junit4]   2> 20872 T875 oasc.SolrCore.registerSearcher [collection1] Registered new searcher Searcher@479d0c7 main{StandardDirectoryReader(segments_2:3:nrt _0(5.0):C1)}
[junit4:junit4]   2> 20873 T866 C108 P49951 /update {waitSearcher=true&commit=true&wt=javabin&commit_end_point=true&softCommit=false&version=2} {commit=} 0 6
[junit4:junit4]   2> 20874 T863 oasc.SolrCore.registerSearcher [collection1] Registered new searcher Searcher@46eb5928 main{StandardDirectoryReader(segments_1:1)}
[junit4:junit4]   2> 20875 T859 C112 P44139 /update {waitSearcher=true&commit=true&wt=javabin&commit_end_point=true&softCommit=false&version=2} {commit=} 0 9
[junit4:junit4]   2>  C109_STATE=coll:collection1 core:collection1 props:{shard=shard2, roles=null, state=active, core=collection1, collection=collection1, node_name=127.0.0.1:49956_solr, base_url=http://127.0.0.1:49956/solr}
[junit4:junit4]   2> 20876 T879 C109 P49956 oasu.DirectUpdateHandler2.commit start commit{flags=0,_version_=0,optimize=false,openSearcher=true,waitSearcher=true,expungeDeletes=false,softCommit=false}
[junit4:junit4]   2> 20887 T879 C109 P49956 oass.SolrIndexSearcher.<init> Opening Searcher@13258644 main
[junit4:junit4]   2> 20888 T879 C109 P49956 oasu.DirectUpdateHandler2.commit end_commit_flush
[junit4:junit4]   2> 20891 T888 oasc.SolrCore.registerSearcher [collection1] Registered new searcher Searcher@13258644 main{StandardDirectoryReader(segments_2:2)}
[junit4:junit4]   2> 20892 T879 C109 P49956 /update {waitSearcher=true&commit=true&wt=javabin&commit_end_point=true&softCommit=false&version=2} {commit=} 0 16
[junit4:junit4]   2> 20893 T847 C111 P59593 /update {waitSearcher=true&wt=javabin&commit=true&softCommit=false&version=2} {commit=} 0 45
[junit4:junit4]   2> 20901 T829 C110 P27274 REQ /select {fl=id,score&shard.url=127.0.0.1:27274/solr/collection1/&NOW=1347610892742&start=0&q=*:*&distrib=false&isShard=true&wt=javabin&fsv=true&rows=10&version=2} hits=1 status=0 QTime=1 
[junit4:junit4]   2> 20907 T829 C110 P27274 REQ /select {shard.url=127.0.0.1:27274/solr/collection1/&NOW=1347610892742&q=*:*&ids=1&distrib=false&isShard=true&wt=javabin&version=2} status=0 QTime=1 
[junit4:junit4]   2> 20912 T828 C110 P27274 REQ /select {wt=javabin&q=*:*&version=2} hits=1 status=0 QTime=16 
[junit4:junit4]   2> 20914 T816 oaz.ZooKeeper.<init> Initiating client connection, connectString=127.0.0.1:11384/solr sessionTimeout=10000 watcher=org.apache.solr.common.cloud.ConnectionManager@3b2fd70c
[junit4:junit4]   2> 20915 T904 oaz.ClientCnxn$SendThread.startConnect Opening socket connection to server /127.0.0.1:11384
[junit4:junit4]   2> 20915 T816 oascc.ConnectionManager.waitForConnected Waiting for client to connect to ZooKeeper
[junit4:junit4]   2> 20916 T904 oaz.ClientCnxn$SendThread.primeConnection Socket connection established to localhost/127.0.0.1:11384, initiating session
[junit4:junit4]   2> 20917 T818 oazs.NIOServerCnxn$Factory.run Accepted socket connection from /140.211.11.196:49981
[junit4:junit4]   2> 20917 T818 oazs.NIOServerCnxn.readConnectRequest Client attempting to establish new session at /140.211.11.196:49981
[junit4:junit4]   2> 20923 T820 oazs.NIOServerCnxn.finishSessionInit Established session 0x139c3de082f0009 with negotiated timeout 10000 for client /140.211.11.196:49981
[junit4:junit4]   2> 20924 T904 oaz.ClientCnxn$SendThread.readConnectResult Session establishment complete on server localhost/127.0.0.1:11384, sessionid = 0x139c3de082f0009, negotiated timeout = 10000
[junit4:junit4]   2> 20924 T905 oascc.ConnectionManager.process Watcher org.apache.solr.common.cloud.ConnectionManager@3b2fd70c name:ZooKeeperConnection Watcher:127.0.0.1:11384/solr got event WatchedEvent state:SyncConnected type:None path:null path:null type:None
[junit4:junit4]   2> 20924 T816 oascc.ConnectionManager.waitForConnected Client is connected to ZooKeeper
[junit4:junit4]   2> 20926 T816 oascc.ZkStateReader.createClusterStateWatchersAndUpdate Updating cluster state from ZooKeeper... 
[junit4:junit4]   2> 20930 T821 oazs.PrepRequestProcessor.pRequest Processed session termination for sessionid: 0x139c3de082f0009
[junit4:junit4]   2> 20934 T905 oaz.ClientCnxn$EventThread.run EventThread shut down
[junit4:junit4]   2> 20935 T818 oazs.NIOServerCnxn.closeSock Closed socket connection for client /140.211.11.196:49981 which had sessionid 0x139c3de082f0009
[junit4:junit4]   2> 20934 T816 oaz.ZooKeeper.close Session: 0x139c3de082f0009 closed
[junit4:junit4]   2> 20939 T848 C111 P59593 REQ /select {distrib=false&wt=javabin&q=*:*&version=2} hits=1 status=0 QTime=1 
[junit4:junit4]   2> 20942 T860 C112 P44139 REQ /select {distrib=false&wt=javabin&q=*:*&version=2} hits=0 status=0 QTime=1 
[junit4:junit4]   2> 20948 T842 C111 P59593 REQ /select {fl=id,score&shard.url=127.0.0.1:59593/solr/collection1/|127.0.0.1:49951/solr/collection1/&NOW=1347610892790&start=0&q=*:*&distrib=false&isShard=true&wt=javabin&fsv=true&rows=10&version=2} hits=1 status=0 QTime=1 
[junit4:junit4]   2> 20948 T880 C109 P49956 REQ /select {fl=id,score&shard.url=127.0.0.1:44139/solr/collection1/|127.0.0.1:49956/solr/collection1/&NOW=1347610892790&start=0&q=*:*&distrib=false&isShard=true&wt=javabin&fsv=true&rows=10&version=2} hits=0 status=0 QTime=1 
[junit4:junit4]   2> 20952 T842 C111 P59593 REQ /select {shard.url=127.0.0.1:59593/solr/collection1/|127.0.0.1:49951/solr/collection1/&NOW=1347610892790&q=*:*&ids=1&distrib=false&isShard=true&wt=javabin&version=2} status=0 QTime=1 
[junit4:junit4]   2> 20953 T867 C108 P49951 REQ /select {wt=javabin&q=*:*&version=2} hits=1 status=0 QTime=9 
[junit4:junit4]   2> 20976 T828 C110 P27274 /update {wt=javabin&version=2} {add=[2 (1413072439531798528)]} 0 20
[junit4:junit4]   2> 21022 T879 C109 P49956 REQ /update {update.distrib=FROMLEADER&distrib.from=http://127.0.0.1:44139/solr/collection1/&wt=javabin&version=2} status=0 QTime=15 
[junit4:junit4]   2> 21024 T859 C112 P44139 REQ /update {distrib.from=http://127.0.0.1:59593/solr/collection1/&update.distrib=TOLEADER&wt=javabin&version=2} status=0 QTime=38 
[junit4:junit4]   2> 21025 T847 C111 P59593 /update {wt=javabin&version=2} {add=[2]} 0 43
[junit4:junit4]   2> 21031 T828 C110 P27274 /update {wt=javabin&version=2} {add=[3 (1413072439607296000)]} 0 3
[junit4:junit4]   2> 21048 T879 C109 P49956 REQ /update {update.distrib=FROMLEADER&distrib.from=http://127.0.0.1:44139/solr/collection1/&wt=javabin&version=2} status=0 QTime=2 
[junit4:junit4]   2> 21050 T859 C112 P44139 REQ /update {distrib.from=http://127.0.0.1:59593/solr/collection1/&update.distrib=TOLEADER&wt=javabin&version=2} status=0 QTime=10 
[junit4:junit4]   2> 21051 T847 C111 P59593 /update {wt=javabin&version=2} {add=[3]} 0 15
[junit4:junit4]   2> 21058 T828 C110 P27274 /update {wt=javabin&version=2} {add=[4 (1413072439634558976)]} 0 3
[junit4:junit4]   2> 21084 T866 C108 P49951 REQ /update {distrib.from=http://127.0.0.1:59593/solr/collection1/&update.distrib=FROMLEADER&wt=javabin&version=2} status=0 QTime=9 
[junit4:junit4]   2> 21086 T847 C111 P59593 /update {wt=javabin&version=2} {add=[4 (1413072439642947584)]} 0 23
[junit4:junit4]   2> 21093 T828 C110 P27274 /update {wt=javabin&version=2} {add=[5 (1413072439672307712)]} 0 2
[junit4:junit4]   2> 21105 T879 C109 P49956 REQ /update {update.distrib=FROMLEADER&distrib.from=http://127.0.0.1:44139/solr/collection1/&wt=javabin&version=2} status=0 QTime=2 
[junit4:junit4]   2> 21106 T859 C112 P44139 REQ /update {distrib.from=http://127.0.0.1:59593/solr/collection1/&update.distrib=TOLEADER&wt=javabin&version=2} status=0 QTime=7 
[junit4:junit4]   2> 21107 T847 C111 P59593 /update {wt=javabin&version=2} {add=[5]} 0 11
[junit4:junit4]   2> 21113 T828 C110 P27274 /update {wt=javabin&version=2} {add=[6 (1413072439693279232)]} 0 3
[junit4:junit4]   2> 21124 T879 C109 P49956 REQ /update {distrib.from=http://127.0.0.1:44139/solr/collection1/&update.distrib=FROMLEADER&wt=javabin&version=2} status=0 QTime=3 
[junit4:junit4]   2> 21127 T855 C112 P44139 /update {wt=javabin&version=2} {add=[6 (1413072439699570688)]} 0 11
[junit4:junit4]   2> 21133 T828 C110 P27274 /update {wt=javabin&version=2} {add=[7 (1413072439714250752)]} 0 3
[junit4:junit4]   2> 21149 T879 C109 P49956 REQ /update {update.distrib=FROMLEADER&distrib.from=http://127.0.0.1:44139/solr/collection1/&wt=javabin&version=2} status=0 QTime=3 
[junit4:junit4]   2> 21150 T859 C112 P44139 REQ /update {distrib.from=http://127.0.0.1:59593/solr/collection1/&update.distrib=TOLEADER&wt=javabin&version=2} status=0 QTime=9 
[junit4:junit4]   2> 21151 T847 C111 P59593 /update {wt=javabin&version=2} {add=[7]} 0 13
[junit4:junit4]   2> 21157 T828 C110 P27274 /update {wt=javabin&version=2} {add=[8 (1413072439739416576)]} 0 2
[junit4:junit4]   2> 21169 T866 C108 P49951 REQ /update {update.distrib=FROMLEADER&distrib.from=http://127.0.0.1:59593/solr/collection1/&wt=javabin&version=2} status=0 QTime=2 
[junit4:junit4]   2> 21170 T843 C111 P59593 REQ /update {distrib.from=http://127.0.0.1:44139/solr/collection1/&update.distrib=TOLEADER&wt=javabin&version=2} status=0 QTime=7 
[junit4:junit4]   2> 21171 T855 C112 P44139 /update {wt=javabin&version=2} {add=[8]} 0 11
[junit4:junit4]   2> 21176 T828 C110 P27274 /update {wt=javabin&version=2} {add=[9 (1413072439760388096)]} 0 2
[junit4:junit4]   2> 21185 T879 C109 P49956 REQ /update {distrib.from=http://127.0.0.1:44139/solr/collection1/&update.distrib=FROMLEADER&wt=javabin&version=2} status=0 QTime=2 
[junit4:junit4]   2> 21186 T855 C112 P44139 /update {wt=javabin&version=2} {add=[9 (1413072439765630976)]} 0 7
[junit4:junit4]   2> 21192 T828 C110 P27274 /update {wt=javabin&version=2} {add=[10 (1413072439776116736)]} 0 3
[junit4:junit4]   2> 21205 T866 C108 P49951 REQ /update {update.distrib=FROMLEADER&distrib.from=http://127.0.0.1:59593/solr/collection1/&wt=javabin&version=2} status=0 QTime=3 
[junit4:junit4]   2> 21206 T843 C111 P59593 REQ /update {distrib.from=http://127.0.0.1:44139/solr/collection1/&update.distrib=TOLEADER&wt=javabin&version=2} status=0 QTime=8 
[junit4:junit4]   2> 21207 T855 C112 P44139 /update {wt=javabin&version=2} {add=[10]} 0 12
[junit4:junit4]   2> 21258 T828 C110 P27274 /update {wt=javabin&version=2} {add=[11 (1413072439799185408)]} 0 46
[junit4:junit4]   2> 21271 T866 C108 P49951 REQ /update {distrib.from=http://127.0.0.1:59593/solr/collection1/&update.distrib=FROMLEADER&wt=javabin&version=2} status=0 QTime=3 
[junit4:junit4]   2> 21273 T847 C111 P59593 /update {wt=javabin&version=2} {add=[11 (1413072439852662784)]} 0 11
[junit4:junit4]   2> 21285 T828 C110 P27274 /update {wt=javabin&version=2} {add=[12 (1413072439868391424)]} 0 7
[junit4:junit4]   2> 21295 T866 C108 P49951 REQ /update {distrib.from=http://127.0.0.1:59593/solr/collection1/&update.distrib=FROMLEADER&wt=javabin&version=2} status=0 QTime=2 
[junit4:junit4]   2> 21296 T847 C111 P59593 /update {wt=javabin&version=2} {add=[12 (1413072439879925760)]} 0 8
[junit4:junit4]   2> 21301 T828 C110 P27274 /update {wt=javabin&version=2} {add=[13 (1413072439891460096)]} 0 2
[junit4:junit4]   2> 21312 T866 C108 P49951 REQ /update {distrib.from=http://127.0.0.1:59593/solr/collection1/&update.distrib=FROMLEADER&wt=javabin&version=2} status=0 QTime=3 
[junit4:junit4]   2> 21314 T847 C111 P59593 /update {wt=javabin&version=2} {add=[13 (1413072439896702976)]} 0 10
[junit4:junit4]   2> 21325 T828 C110 P27274 /update {wt=javabin&version=2} {add=[14 (1413072439914528768)]} 0 4
[junit4:junit4]   2> 21338 T866 C108 P49951 REQ /update {distrib.from=http://127.0.0.1:59593/solr/collection1/&update.distrib=FROMLEADER&wt=javabin&version=2} status=0 QTime=3 
[junit4:junit4]   2> 21339 T847 C111 P59593 /update {wt=javabin&version=2} {add=[14 (1413072439921868800)]} 0 10
[junit4:junit4]   2> 21345 T828 C110 P27274 /update {wt=javabin&version=2} {add=[15 (1413072439936548864)]} 0 2
[junit4:junit4]   2> 21363 T866 C108 P49951 REQ /update {update.distrib=FROMLEADER&distrib.from=http://127.0.0.1:59593/solr/collection1/&wt=javabin&version=2} status=0 QTime=3 
[junit4:junit4]   2> 21364 T843 C111 P59593 REQ /update {distrib.from=http://127.0.0.1:44139/solr/collection1/&update.distrib=TOLEADER&wt=javabin&version=2} status=0 QTime=10 
[junit4:junit4]   2> 21365 T855 C112 P44139 /update {wt=javabin&version=2} {add=[15]} 0 15
[junit4:junit4]   2> 21370 T828 C110 P27274 /update {wt=javabin&version=2} {add=[16 (1413072439963811840)]} 0 2
[junit4:junit4]   2> 21383 T866 C108 P49951 REQ /update {update.distrib=FROMLEADER&distrib.from=http://127.0.0.1:59593/solr/collection1/&wt=javabin&version=2} status=0 QTime=3 
[junit4:junit4]   2> 21384 T843 C111 P59593 REQ /update {distrib.from=http://127.0.0.1:44139/solr/collection1/&update.distrib=TOLEADER&wt=javabin&version=2} status=0 QTime=8 
[junit4:junit4]   2> 21385 T855 C112 P44139 /update {wt=javabin&version=2} {add=[16]} 0 12
[junit4:junit4]   2> 21392 T828 C110 P27274 /update {wt=javabin&version=2} {add=[17 (1413072439984783360)]} 0 4
[junit4:junit4]   2> 21413 T879 C109 P49956 REQ /update {update.distrib=FROMLEADER&distrib.from=http://127.0.0.1:44139/solr/collection1/&wt=javabin&version=2} status=0 QTime=4 
[junit4:junit4]   2> 21414 T859 C112 P44139 REQ /update {distrib.from=http://127.0.0.1:59593/solr/collection1/&update.distrib=TOLEADER&wt=javabin&version=2} status=0 QTime=15 
[junit4:junit4]   2> 21415 T847 C111 P59593 /update {wt=javabin&version=2} {add=[17]} 0 19
[junit4:junit4]   2> 21420 T828 C110 P27274 /update {wt=javabin&version=2} {add=[100 (1413072440016240640)]} 0 2
[junit4:junit4]   2> 21536 T866 C108 P49951 REQ /update {distrib.from=http://127.0.0.1:59593/solr/collection1/&update.distrib=FROMLEADER&wt=javabin&version=2} status=0 QTime=55 
[junit4:junit4]   2> 21537 T847 C111 P59593 /update {wt=javabin&version=2} {add=[100 (1413072440020434944)]} 0 114
[junit4:junit4]   2> 21544 T828 C110 P27274 /update {wt=javabin&version=2} {add=[101 (1413072440145215488)]} 0 2
[junit4:junit4]   2> 21559 T866 C108 P49951 REQ /update {distrib.from=http://127.0.0.1:59593/solr/collection1/&update.distrib=FROMLEADER&wt=javabin&version=2} status=0 QTime=4 
[junit4:junit4]   2> 21560 T847 C111 P59593 /update {wt=javabin&version=2} {add=[101 (1413072440152555520)]} 0 12
[junit4:junit4]   2> 21565 T828 C110 P27274 /update {wt=javabin&version=2} {add=[102 (1413072440168284160)]} 0 1
[junit4:junit4]   2> 21577 T866 C108 P49951 REQ /update {distrib.from=http://127.0.0.1:59593/solr/collection1/&update.distrib=FROMLEADER&wt=javabin&version=2} status=0 QTime=2 
[junit4:junit4]   2> 21579 T847 C111 P59593 /update {wt=javabin&version=2} {add=[102 (1413072440174575616)]} 0 9
[junit4:junit4]   2> 21633 T828 C110 P27274 /update {wt=javabin&version=2} {add=[103 (1413072440188207104)]} 0 50
[junit4:junit4]   2> 21646 T879 C109 P49956 REQ /update {update.distrib=FROMLEADER&distrib.from=http://127.0.0.1:44139/solr/collection1/&wt=javabin&version=2} status=0 QTime=3 
[junit4:junit4]   2> 21647 T859 C112 P44139 REQ /update {distrib.from=http://127.0.0.1:59593/solr/collection1/&update.distrib=TOLEADER&wt=javabin&version=2} status=0 QTime=8 
[junit4:junit4]   2> 21648 T847 C111 P59593 /update {wt=javabin&version=2} {add=[103]} 0 12
[junit4:junit4]   2> 21655 T828 C110 P27274 /update {wt=javabin&version=2} {add=[104 (1413072440260558848)]} 0 4
[junit4:junit4]   2> 21668 T879 C109 P49956 REQ /update {update.distrib=FROMLEADER&distrib.from=http://127.0.0.1:44139/solr/collection1/&wt=javabin&version=2} status=0 QTime=2 
[junit4:junit4]   2> 21670 T859 C112 P44139 REQ /update {distrib.from=http://127.0.0.1:59593/solr/collection1/&update.distrib=TOLEADER&wt=javabin&version=2} status=0 QTime=9 
[junit4:junit4]   2> 21671 T847 C111 P59593 /update {wt=javabin&version=2} {add=[104]} 0 12
[junit4:junit4]   2> 21676 T828 C110 P27274 /update {wt=javabin&version=2} {add=[105 (1413072440284676096)]} 0 2
[junit4:junit4]   2> 21774 T879 C109 P49956 REQ /update {distrib.from=http://127.0.0.1:44139/solr/collection1/&update.distrib=FROMLEADER&wt=javabin&version=2} status=0 QTime=46 
[junit4:junit4]   2> 21776 T855 C112 P44139 /update {wt=javabin&version=2} {add=[105 (1413072440290967552)]} 0 95
[junit4:junit4]   2> 21783 T828 C110 P27274 /update {wt=javabin&version=2} {add=[106 (1413072440395825152)]} 0 2
[junit4:junit4]   2> 21800 T879 C109 P49956 REQ /update {distrib.from=http://127.0.0.1:44139/solr/collection1/&update.distrib=FROMLEADER&wt=javabin&version=2} status=0 QTime=4 
[junit4:junit4]   2> 21801 T855 C112 P44139 /update {wt=javabin&version=2} {add=[106 (1413072440404213760)]} 0 12
[junit4:junit4]   2> 21807 T828 C110 P27274 /update {wt=javabin&version=2} {add=[107 (1413072440420990976)]} 0 3
[junit4:junit4]   2> 21816 T866 C108 P49951 REQ /update {distrib.from=http://127.0.0.1:59593/solr/collection1/&update.distrib=FROMLEADER&wt=javabin&version=2} status=0 QTime=2 
[junit4:junit4]   2> 21817 T847 C111 P59593 /update {wt=javabin&version=2} {add=[107 (1413072440426233856)]} 0 7
[junit4:junit4]   2> 21823 T828 C110 P27274 /update {wt=javabin&version=2} {add=[108 (1413072440437768192)]} 0 3
[junit4:junit4]   2> 21836 T866 C108 P49951 REQ /update {update.distrib=FROMLEADER&distrib.from=http://127.0.0.1:59593/solr/collection1/&wt=javabin&version=2} status=0 QTime=1 
[junit4:junit4]   2> 21843 T843 C111 P59593 REQ /update {distrib.from=http://127.0.0.1:44139/solr/collection1/&update.distrib=TOLEADER&wt=javabin&version=2} status=0 QTime=14 
[junit4:junit4]   2> 21890 T855 C112 P44139 /update {wt=javabin&version=2} {add=[108]} 0 64
[junit4:junit4]   2> 21896 T828 C110 P27274 /update {wt=javabin&version=2} {add=[109 (1413072440515362816)]} 0 2
[junit4:junit4]   2> 21906 T866 C108 P49951 REQ /update {distrib.from=http://127.0.0.1:59593/solr/collection1/&update.distrib=FROMLEADER&wt=javabin&version=2} status=0 QTime=2 
[junit4:junit4]   2> 21907 T847 C111 P59593 /update {wt=javabin&version=2} {add=[109 (1413072440520605696)]} 0 8
[junit4:junit4]   2> 21912 T828 C110 P27274 /update {wt=javabin&version=2} {add=[110 (1413072440531091456)]} 0 2
[junit4:junit4]   2> 21923 T866 C108 P49951 REQ /update {update.distrib=FROMLEADER&distrib.from=http://127.0.0.1:59593/solr/collection1/&wt=javabin&version=2} status=0 QTime=1 
[junit4:junit4]   2> 21924 T843 C111 P59593 REQ /update {distrib.from=http://127.0.0.1:44139/solr/collection1/&update.distrib=TOLEADER&wt=javabin&version=2} status=0 QTime=6 
[junit4:junit4]   2> 21925 T855 C112 P44139 /update {wt=javabin&version=2} {add=[110]} 0 10
[junit4:junit4]   2> 21939 T828 C110 P27274 /update {wt=javabin&version=2} {add=[111 (1413072440549965824)]} 0 11
[junit4:junit4]   2> 21957 T866 C108 P49951 REQ /update {update.distrib=FROMLEADER&distrib.from=http://127.0.0.1:59593/solr/collection1/&wt=javabin&version=2} status=0 QTime=2 
[junit4:junit4]   2> 21958 T843 C111 P59593 REQ /update {distrib.from=http://127.0.0.1:44139/solr/collection1/&update.distrib=TOLEADER&wt=javabin&version=2} status=0 QTime=8 
[junit4:junit4]   2> 21959 T855 C112 P44139 /update {wt=javabin&version=2} {add=[111]} 0 13
[junit4:junit4]   2> 21965 T828 C110 P27274 /update {wt=javabin&version=2} {add=[112 (1413072440586665984)]} 0 3
[junit4:junit4]   2> 21982 T879 C109 P49956 REQ /update {update.distrib=FROMLEADER&distrib.from=http://127.0.0.1:44139/solr/collection1/&wt=javabin&version=2} status=0 QTime=2 
[junit4:junit4]   2> 21983 T859 C112 P44139 REQ /update {distrib.from=http://127.0.0.1:59593/solr/collection1/&update.distrib=TOLEADER&wt=javabin&version=2} status=0 QTime=9 
[junit4:junit4]   2> 21984 T847 C111 P59593 /update {wt=javabin&version=2} {add=[112]} 0 15
[junit4:junit4]   2> 22025 T828 C110 P27274 /update {wt=javabin&version=2} {add=[113 (1413072440613928960)]} 0 36
[junit4:junit4]   2> 22039 T866 C108 P49951 REQ /update {update.distrib=FROMLEADER&distrib.from=http://127.0.0.1:59593/solr/collection1/&wt=javabin&version=2} status=0 QTime=2 
[junit4:junit4]   2> 22041 T843 C111 P59593 REQ /update {distrib.from=http://127.0.0.1:44139/solr/collection1/&update.distrib=TOLEADER&wt=javabin&version=2} status=0 QTime=10 
[junit4:junit4]   2> 22042 T855 C112 P44139 /update {wt=javabin&version=2} {add=[113]} 0 14
[junit4:junit4]   2> 22051 T828 C110 P27274 /update {wt=javabin&version=2} {add=[114 (1413072440674746368)]} 0 5
[junit4:junit4]   2> 22068 T866 C108 P49951 REQ /update {update.distrib=FROMLEADER&distrib.from=http://127.0.0.1:59593/solr/collection1/&wt=javabin&version=2} status=0 QTime=2 
[junit4:junit4]   2> 22070 T843 C111 P59593 REQ /update {distrib.from=http://127.0.0.1:44139/solr/collection1/&update.distrib=TOLEADER&wt=javabin&version=2} status=0 QTime=10 
[junit4:junit4]   2> 22072 T855 C112 P44139 /update {wt=javabin&version=2} {add=[114]} 0 16
[junit4:junit4]   2> 22078 T828 C110 P27274 /update {wt=javabin&version=2} {add=[115 (1413072440705155072)]} 0 3
[junit4:junit4]   2> 22094 T879 C109 P49956 REQ /update {update.distrib=FROMLEADER&distrib.from=http://127.0.0.1:44139/solr/collection1/&wt=javabin&version=2} status=0 QTime=2 
[junit4:junit4]   2> 22095 T859 C112 P44139 REQ /update {distrib.from=http://127.0.0.1:59593/solr/collection1/&update.distrib=TOLEADER&wt=javabin&version=2} status=0 QTime=8 
[junit4:junit4]   2> 22096 T847 C111 P59593 /update {wt=javabin&version=2} {add=[115]} 0 14
[junit4:junit4]   2> 22104 T828 C110 P27274 /update {wt=javabin&version=2} {add=[116 (1413072440732418048)]} 0 3
[junit4:junit4]   2> 22116 T879 C109 P49956 REQ /update {distrib.from=http://127.0.0.1:44139/solr/collection1/&update.distrib=FROMLEADER&wt=javabin&version=2} status=0 QTime=2 
[junit4:junit4]   2> 22117 T855 C112 P44139 /update {wt=javabin&version=2} {add=[116 (1413072440739758080)]} 0 9
[junit4:junit4]   2> 22125 T828 C110 P27274 /update {wt=javabin&version=2} {add=[117 (1413072440754438144)]} 0 3
[junit4:junit4]   2> 22138 T879 C109 P49956 REQ /update {update.distrib=FROMLEADER&distrib.from=http://127.0.0.1:44139/solr/collection1/&wt=javabin&version=2} status=0 QTime=2 
[junit4:junit4]   2> 22139 T859 C112 P44139 REQ /update {distrib.from=http://127.0.0.1:59593/solr/collection1/&update.distrib=TOLEADER&wt=javabin&version=2} status=0 QTime=7 
[junit4:junit4]   2> 22139 T847 C111 P59593 /update {wt=javabin&version=2} {add=[117]} 0 10
[junit4:junit4]   2> 22146 T828 C110 P27274 /update {wt=javabin&version=2} {add=[118 (1413072440776458240)]} 0 2
[junit4:junit4]   2> 22218 T866 C108 P49951 REQ /update {update.distrib=FROMLEADER&distrib.from=http://127.0.0.1:59593/solr/collection1/&wt=javabin&version=2} status=0 QTime=33 
[junit4:junit4]   2> 22219 T843 C111 P59593 REQ /update {distrib.from=http://127.0.0.1:44139/solr/collection1/&update.distrib=TOLEADER&wt=javabin&version=2} status=0 QTime=67 
[junit4:junit4]   2> 22220 T855 C112 P44139 /update {wt=javabin&version=2} {add=[118]} 0 71
[junit4:junit4]   2> 22230 T828 C110 P27274 /update {wt=javabin&version=2} {add=[119 (1413072440864538624)]} 0 2
[junit4:junit4]   2> 22277 T879 C109 P49956 REQ /update {update.distrib=FROMLEADER&distrib.from=http://127.0.0.1:44139/solr/collection1/&wt=javabin&version=2} status=0 QTime=2 
[junit4:junit4]   2> 22278 T859 C112 P44139 REQ /update {distrib.from=http://127.0.0.1:59593/solr/collection1/&update.distrib=TOLEADER&wt=javabin&version=2} status=0 QTime=9 
[junit4:junit4]   2> 22279 T847 C111 P59593 /update {wt=javabin&version=2} {add=[119]} 0 14
[junit4:junit4]   2> 22285 T828 C110 P27274 /update {wt=javabin&version=2} {add=[120 (1413072440922210304)]} 0 3
[junit4:junit4]   2> 22294 T879 C109 P49956 REQ /update {distrib.from=http://127.0.0.1:44139/solr/collection1/&update.distrib=FROMLEADER&wt=javabin&version=2} status=0 QTime=2 
[junit4:junit4]   2> 22295 T855 C112 P44139 /update {wt=javabin&version=2} {add=[120 (1413072440928501760)]} 0 7
[junit4:junit4]   2> 22300 T828 C110 P27274 /update {wt=javabin&version=2} {add=[121 (1413072440938987520)]} 0 2
[junit4:junit4]   2> 22312 T879 C109 P49956 REQ /update {update.distrib=FROMLEADER&distrib.from=http://127.0.0.1:44139/solr/collection1/&wt=javabin&version=2} status=0 QTime=2 
[junit4:junit4]   2> 22313 T859 C112 P44139 REQ /update {distrib.from=http://127.0.0.1:59593/solr/collection1/&update.distrib=TOLEADER&wt=javabin&version=2} status=0 QTime=7 
[junit4:junit4]   2> 22313 T847 C111 P59593 /update {wt=javabin&version=2} {add=[121]} 0 10
[junit4:junit4]   2> 22318 T828 C110 P27274 /update {wt=javabin&version=2} {add=[122 (1413072440957861888)]} 0 2
[junit4:junit4]   2> 22333 T866 C108 P49951 REQ /update {distrib.from=http://127.0.0.1:59593/solr/collection1/&update.distrib=FROMLEADER&wt=javabin&version=2} status=0 QTime=4 
[junit4:junit4]   2> 22335 T847 C111 P59593 /update {wt=javabin&version=2} {add=[122 (1413072440963104768)]} 0 14
[junit4:junit4]   2> 22379 T828 C110 P27274 /update {wt=javabin&version=2} {add=[123 (1413072440980930560)]} 0 40
[junit4:junit4]   2> 22389 T866 C108 P49951 REQ /update {distrib.from=http://127.0.0.1:59593/solr/collection1/&update.distrib=FROMLEADER&wt=javabin&version=2} status=0 QTime=2 
[junit4:junit4]   2> 22390 T847 C111 P59593 /update {wt=javabin&version=2} {add=[123 (1413072441028116480)]} 0 7
[junit4:junit4]   2> 22402 T828 C110 P27274 /update {wt=javabin&version=2} {add=[124 (1413072441040699392)]} 0 7
[junit4:junit4]   2> 22417 T866 C108 P49951 REQ /update {update.distrib=FROMLEADER&distrib.from=http://127.0.0.1:59593/solr/collection1/&wt=javabin&version=2} status=0 QTime=2 
[junit4:junit4]   2> 22418 T843 C111 P59593 REQ /update {distrib.from=http://127.0.0.1:44139/solr/collection1/&update.distrib=TOLEADER&wt=javabin&version=2} status=0 QTime=9 
[junit4:junit4]   2> 22419 T855 C112 P44139 /update {wt=javabin&version=2} {add=[124]} 0 13
[junit4:junit4]   2> 22426 T828 C110 P27274 /update {wt=javabin&version=2} {add=[125 (1413072441070059520)]} 0 2
[junit4:junit4]   2> 22442 T866 C108 P49951 REQ /update {distrib.from=http://127.0.0.1:59593/solr/collection1/&update.distrib=FROMLEADER&wt=javabin&version=2} status=0 QTime=2 
[junit4:junit4]   2> 22443 T847 C111 P59593 /update {wt=javabin&version=2} {add=[125 (1413072441079496704)]} 0 10
[junit4:junit4]   2> 22450 T828 C110 P27274 /update {wt=javabin&version=2} {add=[126 (1413072441095225344)]} 0 2
[junit4:junit4]   2> 22461 T879 C109 P49956 REQ /update {distrib.from=http://127.0.0.1:44139/solr/collection1/&update.distrib=FROMLEADER&wt=javabin&version=2} status=0 QTime=3 
[junit4:junit4]   2> 22462 T855 C112 P44139 /update {wt=javabin&version=2} {add=[126 (1413072441102565376)]} 0 8
[junit4:junit4]   2> 22469 T828 C110 P27274 /update {wt=javabin&version=2} {add=[127 (1413072441115148288)]} 0 2
[junit4:junit4]   2> 22554 T879 C109 P49956 REQ /update {distrib.from=http://127.0.0.1:44139/solr/collection1/&update.distrib=FROMLEADER&wt=javabin&version=2} status=0 QTime=31 
[junit4:junit4]   2> 22555 T855 C112 P44139 /update {wt=javabin&version=2} {add=[127 (1413072441122488320)]} 0 81
[junit4:junit4]   2> 22562 T828 C110 P27274 /update {wt=javabin&version=2} {add=[128 (1413072441213714432)]} 0 2
[junit4:junit4]   2> 22586 T879 C109 P49956 REQ /update {distrib.from=http://127.0.0.1:44139/solr/collection1/&update.distrib=FROMLEADER&wt=javabin&version=2} status=0 QTime=6 
[junit4:junit4]   2> 22587 T855 C112 P44139 /update {wt=javabin&version=2} {add=[128 (1413072441220005888)]} 0 21
[junit4:junit4]   2> 22593 T828 C110 P27274 /update {wt=javabin&version=2} {add=[129 (1413072441246220288)]} 0 2
[junit4:junit4]   2> 22608 T866 C108 P49951 REQ /update {update.distrib=FROMLEADER&distrib.from=http://127.0.0.1:59593/solr/collection1/&wt=javabin&version=2} status=0 QTime=2 
[junit4:junit4]   2> 22609 T843 C111 P59593 REQ /update {distrib.from=http://127.0.0.1:44139/solr/collection1/&update.distrib=TOLEADER&wt=javabin&version=2} status=0 QTime=9 
[junit4:junit4]   2> 22610 T855 C112 P44139 /update {wt=javabin&version=2} {add=[129]} 0 14
[junit4:junit4]   2> 22617 T828 C110 P27274 /update {wt=javabin&version=2} {add=[130 (1413072441270337536)]} 0 2
[junit4:junit4]   2> 22627 T879 C109 P49956 REQ /update {distrib.from=http://127.0.0.1:44139/solr/collection1/&update.distrib=FROMLEADER&wt=javabin&version=2} status=0 QTime=2 
[junit4:junit4]   2> 22628 T855 C112 P44139 /update {wt=javabin&version=2} {add=[130 (1413072441277677568)]} 0 7
[junit4:junit4]   2> 22633 T828 C110 P27274 /update {wt=javabin&version=2} {add=[131 (1413072441288163328)]} 0 2
[junit4:junit4]   2> 22652 T879 C109 P49956 REQ /update {update.distrib=FROMLEADER&distrib.from=http://127.0.0.1:44139/solr/collection1/&wt=javabin&version=2} status=0 QTime=3 
[junit4:junit4]   2> 22653 T859 C112 P44139 REQ /update {distrib.from=http://127.0.0.1:59593/solr/collection1/&update.distrib=TOLEADER&wt=javabin&version=2} status=0 QTime=11 
[junit4:junit4]   2> 22654 T847 C111 P59593 /update {wt=javabin&version=2} {add=[131]} 0 17
[junit4:junit4]   2> 22660 T828 C110 P27274 /update {wt=javabin&version=2} {add=[132 (1413072441315426304)]} 0 3
[junit4:junit4]   2> 22674 T866 C108 P49951 REQ /update {update.distrib=FROMLEADER&distrib.from=http://127.0.0.1:59593/solr/collection1/&wt=javabin&version=2} status=0 QTime=2 
[junit4:junit4]   2> 22675 T843 C111 P59593 REQ /update {distrib.from=http://127.0.0.1:44139/solr/collection1/&update.distrib=TOLEADER&wt=javabin&version=2} status=0 QTime=7 
[junit4:junit4]   2> 22676 T855 C112 P44139 /update {wt=javabin&version=2} {add=[132]} 0 11
[junit4:junit4]   2> 22712 T828 C110 P27274 /update {wt=javabin&version=2} {add=[133 (1413072441338494976)]} 0 33
[junit4:junit4]   2> 22724 T866 C108 P49951 REQ /update {distrib.from=http://127.0.0.1:59593/solr/collection1/&update.distrib=FROMLEADER&wt=javabin&version=2} status=0 QTime=2 
[junit4:junit4]   2> 22725 T847 C111 P59593 /update {wt=javabin&version=2} {add=[133 (1413072441377292288)]} 0 9
[junit4:junit4]   2> 22736 T828 C110 P27274 /update {wt=javabin&version=2} {add=[134 (1413072441391972352)]} 0 6
[junit4:junit4]   2> 22749 T879 C109 P49956 REQ /update {distrib.from=http://127.0.0.1:44139/solr/collection1/&update.distrib=FROMLEADER&wt=javabin&version=2} status=0 QTime=3 
[junit4:junit4]   2> 22750 T855 C112 P44139 /update {wt=javabin&version=2} {add=[134 (1413072441403506688)]} 0 9
[junit4:junit4]   2> 22756 T828 C110 P27274 /update {wt=javabin&version=2} {add=[135 (1413072441416089600)]} 0 2
[junit4:junit4]   2> 22775 T866 C108 P49951 REQ /update {update.distrib=FROMLEADER&distrib.from=http://127.0.0.1:59593/solr/collection1/&wt=javabin&version=2} status=0 QTime=2 
[junit4:junit4]   2> 22776 T843 C111 P59593 REQ /update {distrib.from=http://127.0.0.1:44139/solr/collection1/&update.distrib=TOLEADER&wt=javabin&version=2} status=0 QTime=13 
[junit4:junit4]   2> 22777 T855 C112 P44139 /update {wt=javabin&version=2} {add=[135]} 0 17
[junit4:junit4]   2> 22783 T828 C110 P27274 /update {wt=javabin&version=2} {add=[136 (1413072441444401152)]} 0 2
[junit4:junit4]   2> 22796 T879 C109 P49956 REQ /update {distrib.from=http://127.0.0.1:44139/solr/collection1/&update.distrib=FROMLEADER&wt=javabin&version=2} status=0 QTime=2 
[junit4:junit4]   2> 22797 T855 C112 P44139 /update {wt=javabin&version=2} {add=[136 (1413072441451741184)]} 0 9
[junit4:junit4]   2> 22802 T828 C110 P27274 /update {wt=javabin&version=2} {add=[137 (1413072441465372672)]} 0 2
[junit4:junit4]   2> 22817 T879 C109 P49956 REQ /update {distrib.from=http://127.0.0.1:44139/solr/collection1/&update.distrib=FROMLEADER&wt=javabin&version=2} status=0 QTime=3 
[junit4:junit4]   2> 22818 T855 C112 P44139 /update {wt=javabin&version=2} {add=[137 (1413072441471664128)]} 0 11
[junit4:junit4]   2> 22825 T828 C110 P27274 /update {wt=javabin&version=2} {add=[138 (1413072441488441344)]} 0 3
[junit4:junit4]   2> 22838 T866 C108 P49951 REQ /update {update.distrib=FROMLEADER&distrib.from=http://127.0.0.1:59593/solr/collection1/&wt=javabin&version=2} status=0 QTime=1 
[junit4:junit4]   2> 22844 T843 C111 P59593 REQ /update {distrib.from=http://127.0.0.1:44139/solr/collection1/&update.distrib=TOLEADER&wt=javabin&version=2} status=0 QTime=12 
[junit4:junit4]   2> 22848 T855 C112 P44139 /update {wt=javabin&version=2} {add=[138]} 0 20
[junit4:junit4]   2> 22853 T828 C110 P27274 /update {wt=javabin&version=2} {add=[139 (1413072441518850048)]} 0 2
[junit4:junit4]   2> 22864 T879 C109 P49956 REQ /update {distrib.from=http://127.0.0.1:44139/solr/collection1/&update.distrib=FROMLEADER&wt=javabin&version=2} status=0 QTime=3 
[junit4:junit4]   2> 22866 T855 C112 P44139 /update {wt=javabin&version=2} {add=[139 (1413072441523044352)]} 0 10
[junit4:junit4]   2> 22873 T828 C110 P27274 /update {wt=javabin&version=2} {add=[140 (1413072441538772992)]} 0 3
[junit4:junit4]   2> 22888 T879 C109 P49956 REQ /update {update.distrib=FROMLEADER&distrib.from=http://127.0.0.1:44139/solr/collection1/&wt=javabin&version=2} status=0 QTime=2 
[junit4:junit4]   2> 22889 T859 C112 P44139 REQ /update {distrib.from=http://127.0.0.1:59593/solr/collection1/&update.distrib=TOLEADER&wt=javabin&version=2} status=0 QTime=9 
[junit4:junit4]   2> 22890 T847 C111 P59593 /update {wt=javabin&version=2} {add=[140]} 0 13
[junit4:junit4]   2> 22895 T828 C110 P27274 /update {wt=javabin&version=2} {add=[141 (1413072441562890240)]} 0 2
[junit4:junit4]   2> 22910 T879 C109 P49956 REQ /update {update.distrib=FROMLEADER&distrib.from=http://127.0.0.1:44139/solr/collection1/&wt=javabin&version=2} status=0 QTime=3 
[junit4:junit4]   2> 22911 T859 C112 P44139 REQ /update {distrib.from=http://127.0.0.1:59593/solr/collection1/&update.distrib=TOLEADER&wt=javabin&version=2} status=0 QTime=10 
[junit4:junit4]   2> 22914 T847 C111 P59593 /update {wt=javabin&version=2} {add=[141]} 0 16
[junit4:junit4]   2> 22924 T828 C110 P27274 /update {wt=javabin&version=2} {add=[142 (1413072441592250368)]} 0 2
[junit4:junit4]   2> 23014 T879 C109 P49956 REQ /update {distrib.from=http://127.0.0.1:44139/solr/collection1/&update.distrib=FROMLEADER&wt=javabin&version=2} status=0 QTime=38 
[junit4:junit4]   2> 23015 T855 C112 P44139 /update {wt=javabin&version=2} {add=[142 (1413072441599590400)]} 0 86
[junit4:junit4]   2> 23046 T828 C110 P27274 /update {wt=javabin&version=2} {add=[143 (1413072441693962240)]} 0 28
[junit4:junit4]   2> 23068 T879 C109 P49956 REQ /update {distrib.from=http://127.0.0.1:44139/solr/collection1/&update.distrib=FROMLEADER&wt=javabin&version=2} status=0 QTime=7 
[junit4:junit4]   2> 23070 T855 C112 P44139 /update {wt=javabin&version=2} {add=[143 (1413072441727516672)]} 0 20
[junit4:junit4]   2> 23078 T828 C110 P27274 /update {wt=javabin&version=2} {add=[144 (1413072441751633920)]} 0 5
[junit4:junit4]   2> 23091 T879 C109 P49956 REQ /update {update.distrib=FROMLEADER&distrib.from=http://127.0.0.1:44139/solr/collection1/&wt=javabin&version=2} status=0 QTime=2 
[junit4:junit4]   2> 23092 T859 C112 P44139 REQ /update {distrib.from=http://127.0.0.1:59593/solr/collection1/&update.distrib=TOLEADER&wt=javabin&version=2} status=0 QTime=8 
[junit4:junit4]   2> 23092 T847 C111 P59593 /update {wt=javabin&version=2} {add=[144]} 0 11
[junit4:junit4]   2> 23097 T828 C110 P27274 /update {wt=javabin&version=2} {add=[145 (1413072441773654016)]} 0 2
[junit4:junit4]   2> 23110 T879 C109 P49956 REQ /update {update.distrib=FROMLEADER&distrib.from=http://127.0.0.1:44139/solr/collection1/&wt=javabin&version=2} status=0 QTime=1 
[junit4:junit4]   2> 23112 T859 C112 P44139 REQ /update {distrib.from=http://127.0.0.1:59593/solr/collection1/&update.distrib=TOLEADER&wt=javabin&version=2} status=0 QTime=8 
[junit4:junit4]   2> 23114 T847 C111 P59593 /update {wt=javabin&version=2} {add=[145]} 0 14
[junit4:junit4]   2> 23120 T828 C110 P27274 /update {wt=javabin&version=2} {add=[146 (1413072441797771264)]} 0 2
[junit4:junit4]   2> 23177 T866 C108 P49951 REQ /update {distrib.from=http://127.0.0.1:59593/solr/collection1/&update.distrib=FROMLEADER&wt=javabin&version=2} status=0 QTime=24 
[junit4:junit4]   2> 23234 T847 C111 P59593 /update {wt=javabin&version=2} {add=[146 (1413072441804062720)]} 0 111
[junit4:junit4]   2> 23241 T828 C110 P27274 /update {wt=javabin&version=2} {add=[147 (1413072441924648960)]} 0 3
[junit4:junit4]   2> 23251 T879 C109 P49956 REQ /update {distrib.from=http://127.0.0.1:44139/solr/collection1/&update.distrib=FROMLEADER&wt=javabin&version=2} status=0 QTime=2 
[junit4:junit4]   2> 23252 T855 C112 P44139 /update {wt=javabin&version=2} {add=[147 (1413072441930940416)]} 0 8
[junit4:junit4]   2> 23257 T828 C110 P27274 /update {wt=javabin&version=2} {add=[148 (1413072441942474752)]} 0 2
[junit4:junit4]   2> 23271 T866 C108 P49951 REQ /update {distrib.from=http://127.0.0.1:59593/solr/collection1/&update.distrib=FROMLEADER&wt=javabin&version=2} status=0 QTime=5 
[junit4:junit4]   2> 23273 T847 C111 P59593 /update {wt=javabin&version=2} {add=[148 (1413072441947717632)]} 0 13
[junit4:junit4]   2> 23280 T828 C110 P27274 /update {wt=javabin&version=2} {add=[149 (1413072441965543424)]} 0 2
[junit4:junit4]   2> 23294 T879 C109 P49956 REQ /update {update.distrib=FROMLEADER&distrib.from=http://127.0.0.1:44139/solr/collection1/&wt=javabin&version=2} status=0 QTime=2 
[junit4:junit4]   2> 23295 T859 C112 P44139 REQ /update {distrib.from=http://127.0.0.1:59593/solr/collection1/&update.distrib=TOLEADER&wt=javabin&version=2} status=0 QTime=8 
[junit4:junit4]   2> 23296 T847 C111 P59593 /update {wt=javabin&version=2} {add=[149]} 0 12
[junit4:junit4]   2> 23296 T816 oasc.AbstractDistribZkTestBase.waitForRecoveriesToFinish Wait for recoveries to finish - collection: collection1 failOnTimeout:true timeout (sec):1440
[junit4:junit4]   2> 23298 T816 oascc.ZkStateReader.updateClusterState Updating cloud state from ZooKeeper... 
[junit4:junit4]   2> 23303 T828 C110 P27274 oasu.DirectUpdateHandler2.commit start commit{flags=0,_version_=0,optimize=false,openSearcher=true,waitSearcher=true,expungeDeletes=false,softCommit=false}
[junit4:junit4]   2> 24160 T828 C110 P27274 oasc.SolrDeletionPolicy.onCommit SolrDeletionPolicy.onCommit: commits:num=2
[junit4:junit4]   2> 		commit{dir=NRTCachingDirectory(org.apache.lucene.store.NIOFSDirectory@/usr/home/hudson/hudson-slave/workspace/Lucene-Solr-Tests-trunk-java7/solr/build/solr-core/test/J1/org.apache.solr.cloud.BasicDistributedZk2Test-1347610871850/control/data/index lockFactory=org.apache.lucene.store.NativeFSLockFactory@43375017; maxCacheMB=48.0 maxMergeSizeMB=4.0),segFN=segments_2,generation=2,filenames=[_0_MockSep_0.pos, _0_MockVariableIntBlock_0.doc, _0_MockRandom_0.prx, _0_MockVariableIntBlock_0.skp, _0_MockVariableIntBlock_0.pyl, _0_MockVariableIntBlock_0.tib, _0_MockSep_0.skp, _0_MockVariableIntBlock_0.pos, _0.si, _0_MockSep_0.doc, _0_MockVariableIntBlock_0.tii, _0_MockRandom_0.tib, _0.fnm, _0_Memory_0.ram, _0_nrm.cfs, _0_MockSep_0.tib, _0_MockRandom_0.sd, _0_MockRandom_0.frq, _0_nrm.cfe, _0_MockVariableIntBlock_0.frq, segments_2, _0_MockSep_0.frq, _0_MockRandom_0.tii, _0.fdx, _0_MockSep_0.tii, _0_MockSep_0.pyl, _0.fdt]
[junit4:junit4]   2> 		commit{dir=NRTCachingDirectory(org.apache.lucene.store.NIOFSDirectory@/usr/home/hudson/hudson-slave/workspace/Lucene-Solr-Tests-trunk-java7/solr/build/solr-core/test/J1/org.apache.solr.cloud.BasicDistributedZk2Test-1347610871850/control/data/index lockFactory=org.apache.lucene.store.NativeFSLockFactory@43375017; maxCacheMB=48.0 maxMergeSizeMB=4.0),segFN=segments_3,generation=3,filenames=[_5_nrm.cfe, _5_Memory_0.ram, _3_MockVariableIntBlock_0.frq, _0_MockRandom_0.prx, _4_MockSep_0.skp, _3.fdt, _4_MockVariableIntBlock_0.tii, _2_MockSep_0.doc, _7.fnm, _6_MockSep_0.doc, _5_MockSep_0.skp, _3_MockRandom_0.skp, _4_MockRandom_0.pyl, _6_MockSep_0.frq, _7_MockSep_0.tib, _6_MockVariableIntBlock_0.tii, _1_MockSep_0.pyl, _6_MockVariableIntBlock_0.tib, _7_MockSep_0.tii, _0_Memory_0.ram, _1_MockSep_0.tib, _1_MockVariableIntBlock_0.tii, _1_MockRandom_0.sd, _5_MockSep_0.doc, _1_MockSep_0.tii, _1_MockVariableIntBlock_0.tib, _1.fdx, _0_MockRandom_0.frq, _4_MockVariableIntBlock_0.tib, _1.fdt, _3_MockSep_0.pos, _5_nrm.cfs, _4_MockRandom_0.sd, _0_MockVariableIntBlock_0.frq, _7_MockRandom_0.sd, _6.fdt, _2.si, _1_MockVariableIntBlock_0.skp, _7_MockVariableIntBlock_0.pos, _0_MockVariableIntBlock_0.doc, _6_MockSep_0.pyl, _2_MockSep_0.skp, _6.fdx, _1_MockVariableIntBlock_0.pyl, _5_MockSep_0.tii, _3_MockVariableIntBlock_0.tii, _6_MockRandom_0.tiv, _2_nrm.cfe, _1_Memory_0.ram, _6_MockRandom_0.tib, _0_MockVariableIntBlock_0.pos, _7_MockVariableIntBlock_0.skp, _2_nrm.cfs, _4_MockRandom_0.skp, _4_MockVariableIntBlock_0.frq, _2.fnm, _5_MockVariableIntBlock_0.frq, _3.fdx, _2_MockRandom_0.sd, _2_MockSep_0.pyl, _2_MockRandom_0.skp, _1.si, _5_MockSep_0.tib, _3_MockSep_0.skp, _2_MockRandom_0.doc, _3_MockRandom_0.pos, _3_MockVariableIntBlock_0.pos, _3_MockSep_0.doc, _3_nrm.cfe, _4_MockRandom_0.tii, _5_MockVariableIntBlock_0.pyl, _4_nrm.cfe, _4_MockRandom_0.tib, _4.fdx, _7_MockRandom_0.frq, _5_MockRandom_0.sd, _7_MockVariableIntBlock_0.tii, _7_MockSep_0.pos, _6_MockVariableIntBlock_0.frq, _6_MockSep_0.tii, _

[...truncated too long message...]

arch.randomizedtesting.rules.SystemPropertiesRestoreRule$1.evaluate(SystemPropertiesRestoreRule.java:53)
[junit4:junit4]    > 	at org.apache.lucene.util.TestRuleSetupTeardownChained$1.evaluate(TestRuleSetupTeardownChained.java:50)
[junit4:junit4]    > 	at org.apache.lucene.util.TestRuleFieldCacheSanity$1.evaluate(TestRuleFieldCacheSanity.java:51)
[junit4:junit4]    > 	at org.apache.lucene.util.AbstractBeforeAfterRule$1.evaluate(AbstractBeforeAfterRule.java:45)
[junit4:junit4]    > 	at com.carrotsearch.randomizedtesting.rules.SystemPropertiesInvariantRule$1.evaluate(SystemPropertiesInvariantRule.java:55)
[junit4:junit4]    > 	at org.apache.lucene.util.TestRuleThreadAndTestName$1.evaluate(TestRuleThreadAndTestName.java:48)
[junit4:junit4]    > 	at org.apache.lucene.util.TestRuleIgnoreAfterMaxFailures$1.evaluate(TestRuleIgnoreAfterMaxFailures.java:70)
[junit4:junit4]    > 	at org.apache.lucene.util.TestRuleMarkFailure$1.evaluate(TestRuleMarkFailure.java:48)
[junit4:junit4]    > 	at com.carrotsearch.randomizedtesting.rules.StatementAdapter.evaluate(StatementAdapter.java:36)
[junit4:junit4]    > 	at com.carrotsearch.randomizedtesting.ThreadLeakControl$StatementRunner.run(ThreadLeakControl.java:358)
[junit4:junit4]    > 	at com.carrotsearch.randomizedtesting.ThreadLeakControl.forkTimeoutingTask(ThreadLeakControl.java:782)
[junit4:junit4]    > 	at com.carrotsearch.randomizedtesting.ThreadLeakControl$3.evaluate(ThreadLeakControl.java:442)
[junit4:junit4]    > 	at com.carrotsearch.randomizedtesting.RandomizedRunner.runSingleTest(RandomizedRunner.java:746)
[junit4:junit4]    > 	at com.carrotsearch.randomizedtesting.RandomizedRunner$3.evaluate(RandomizedRunner.java:648)
[junit4:junit4]    > 	at com.carrotsearch.randomizedtesting.RandomizedRunner$4.evaluate(RandomizedRunner.java:682)
[junit4:junit4]    > 	at com.carrotsearch.randomizedtesting.RandomizedRunner$5.evaluate(RandomizedRunner.java:693)
[junit4:junit4]    > 	at com.carrotsearch.randomizedtesting.rules.StatementAdapter.evaluate(StatementAdapter.java:36)
[junit4:junit4]    > 	at com.carrotsearch.randomizedtesting.rules.SystemPropertiesRestoreRule$1.evaluate(SystemPropertiesRestoreRule.java:53)
[junit4:junit4]    > 	at org.apache.lucene.util.AbstractBeforeAfterRule$1.evaluate(AbstractBeforeAfterRule.java:45)
[junit4:junit4]    > 	at org.apache.lucene.util.TestRuleStoreClassName$1.evaluate(TestRuleStoreClassName.java:42)
[junit4:junit4]    > 	at com.carrotsearch.randomizedtesting.rules.SystemPropertiesInvariantRule$1.evaluate(SystemPropertiesInvariantRule.java:55)
[junit4:junit4]    > 	at com.carrotsearch.randomizedtesting.rules.NoShadowingOrOverridesOnMethodsRule$1.evaluate(NoShadowingOrOverridesOnMethodsRule.java:39)
[junit4:junit4]    > 	at com.carrotsearch.randomizedtesting.rules.NoShadowingOrOverridesOnMethodsRule$1.evaluate(NoShadowingOrOverridesOnMethodsRule.java:39)
[junit4:junit4]    > 	at com.carrotsearch.randomizedtesting.rules.StatementAdapter.evaluate(StatementAdapter.java:36)
[junit4:junit4]    > 	at org.apache.lucene.util.TestRuleAssertionsRequired$1.evaluate(TestRuleAssertionsRequired.java:43)
[junit4:junit4]    > 	at org.apache.lucene.util.TestRuleMarkFailure$1.evaluate(TestRuleMarkFailure.java:48)
[junit4:junit4]    > 	at org.apache.lucene.util.TestRuleIgnoreAfterMaxFailures$1.evaluate(TestRuleIgnoreAfterMaxFailures.java:70)
[junit4:junit4]    > 	at org.apache.lucene.util.TestRuleIgnoreTestSuites$1.evaluate(TestRuleIgnoreTestSuites.java:55)
[junit4:junit4]    > 	at com.carrotsearch.randomizedtesting.rules.StatementAdapter.evaluate(StatementAdapter.java:36)
[junit4:junit4]    > 	at com.carrotsearch.randomizedtesting.ThreadLeakControl$StatementRunner.run(ThreadLeakControl.java:358)
[junit4:junit4]    > 	at java.lang.Thread.run(Thread.java:722)
[junit4:junit4]    > Caused by: org.apache.solr.client.solrj.SolrServerException: Timeout occured while waiting response from server at: http://127.0.0.1:49956/solr/collection1
[junit4:junit4]    > 	at org.apache.solr.client.solrj.impl.HttpSolrServer.request(HttpSolrServer.java:410)
[junit4:junit4]    > 	at org.apache.solr.client.solrj.impl.HttpSolrServer.request(HttpSolrServer.java:182)
[junit4:junit4]    > 	at org.apache.solr.client.solrj.impl.LBHttpSolrServer.request(LBHttpSolrServer.java:290)
[junit4:junit4]    > 	... 48 more
[junit4:junit4]    > Caused by: java.net.SocketTimeoutException: Read timed out
[junit4:junit4]    > 	at java.net.SocketInputStream.socketRead0(Native Method)
[junit4:junit4]    > 	at java.net.SocketInputStream.read(SocketInputStream.java:150)
[junit4:junit4]    > 	at java.net.SocketInputStream.read(SocketInputStream.java:121)
[junit4:junit4]    > 	at org.apache.http.impl.io.AbstractSessionInputBuffer.fillBuffer(AbstractSessionInputBuffer.java:149)
[junit4:junit4]    > 	at org.apache.http.impl.io.SocketInputBuffer.fillBuffer(SocketInputBuffer.java:111)
[junit4:junit4]    > 	at org.apache.http.impl.io.AbstractSessionInputBuffer.readLine(AbstractSessionInputBuffer.java:264)
[junit4:junit4]    > 	at org.apache.http.impl.conn.DefaultResponseParser.parseHead(DefaultResponseParser.java:98)
[junit4:junit4]    > 	at org.apache.http.impl.io.AbstractMessageParser.parse(AbstractMessageParser.java:252)
[junit4:junit4]    > 	at org.apache.http.impl.AbstractHttpClientConnection.receiveResponseHeader(AbstractHttpClientConnection.java:282)
[junit4:junit4]    > 	at org.apache.http.impl.conn.DefaultClientConnection.receiveResponseHeader(DefaultClientConnection.java:247)
[junit4:junit4]    > 	at org.apache.http.impl.conn.AbstractClientConnAdapter.receiveResponseHeader(AbstractClientConnAdapter.java:216)
[junit4:junit4]    > 	at org.apache.http.protocol.HttpRequestExecutor.doReceiveResponse(HttpRequestExecutor.java:298)
[junit4:junit4]    > 	at org.apache.http.protocol.HttpRequestExecutor.execute(HttpRequestExecutor.java:125)
[junit4:junit4]    > 	at org.apache.http.impl.client.DefaultRequestDirector.tryExecute(DefaultRequestDirector.java:647)
[junit4:junit4]    > 	at org.apache.http.impl.client.DefaultRequestDirector.execute(DefaultRequestDirector.java:464)
[junit4:junit4]    > 	at org.apache.http.impl.client.AbstractHttpClient.execute(AbstractHttpClient.java:820)
[junit4:junit4]    > 	at org.apache.http.impl.client.AbstractHttpClient.execute(AbstractHttpClient.java:754)
[junit4:junit4]    > 	at org.apache.http.impl.client.AbstractHttpClient.execute(AbstractHttpClient.java:732)
[junit4:junit4]    > 	at org.apache.solr.client.solrj.impl.HttpSolrServer.request(HttpSolrServer.java:353)
[junit4:junit4]    > 	... 50 more
[junit4:junit4]   2> 235444 T816 oas.SolrTestCaseJ4.deleteCore ###deleteCore
[junit4:junit4]   2> NOTE: test params are: codec=Lucene40: {n_f1=PostingsFormat(name=Memory doPackFST= true), foo_b=PostingsFormat(name=MockRandom), foo_d=PostingsFormat(name=MockSep), foo_f=PostingsFormat(name=MockRandom), n_tl1=PostingsFormat(name=Memory doPackFST= true), n_d1=MockVariableIntBlock(baseBlockSize=91), rnd_b=PostingsFormat(name=MockSep), intDefault=MockVariableIntBlock(baseBlockSize=91), n_td1=PostingsFormat(name=Memory doPackFST= true), timestamp=MockVariableIntBlock(baseBlockSize=91), id=PostingsFormat(name=MockSep), range_facet_sl=PostingsFormat(name=MockRandom), range_facet_si=PostingsFormat(name=Memory doPackFST= true), oddField_s=PostingsFormat(name=MockRandom), multiDefault=PostingsFormat(name=Memory doPackFST= true), n_tf1=MockVariableIntBlock(baseBlockSize=91), n_dt1=PostingsFormat(name=Memory doPackFST= true), n_ti1=PostingsFormat(name=MockSep), range_facet_l=MockVariableIntBlock(baseBlockSize=91), text=PostingsFormat(name=MockRandom), _version_=MockVariableIntBlock(baseBlockSize=91), SubjectTerms_mfacet=MockVariableIntBlock(baseBlockSize=91), a_t=MockVariableIntBlock(baseBlockSize=91), n_tdt1=MockVariableIntBlock(baseBlockSize=91), other_tl1=MockVariableIntBlock(baseBlockSize=91), n_l1=MockVariableIntBlock(baseBlockSize=91), a_si=PostingsFormat(name=Memory doPackFST= true)}, sim=RandomSimilarityProvider(queryNorm=false,coord=no): {}, locale=sr_BA_#Latn, timezone=America/Thunder_Bay
[junit4:junit4]   2> NOTE: FreeBSD 9.0-RELEASE amd64/Oracle Corporation 1.7.0_06 (64-bit)/cpus=16,threads=5,free=93893048,total=184549376
[junit4:junit4]   2> NOTE: All tests run in this JVM: [OpenExchangeRatesOrgProviderTest, IndexSchemaTest, PingRequestHandlerTest, TestDFRSimilarityFactory, TestUpdate, TestReversedWildcardFilterFactory, LukeRequestHandlerTest, PrimUtilsTest, TestQueryUtils, TestSurroundQueryParser, TestSolrCoreProperties, TestReplicationHandler, TestRecovery, TestArbitraryIndexDir, TestReload, FullSolrCloudDistribCmdsTest, DirectSolrSpellCheckerTest, SyncSliceTest, StandardRequestHandlerTest, ClusterStateUpdateTest, TestDistributedSearch, XmlUpdateRequestHandlerTest, ZkNodePropsTest, SolrInfoMBeanTest, URLClassifyProcessorTest, FileUtilsTest, ConvertedLegacyTest, ScriptEngineTest, SuggesterTest, BasicFunctionalityTest, BasicDistributedZk2Test]
[junit4:junit4] Completed on J1 in 235.47s, 1 test, 1 error <<< FAILURES!

[...truncated 218 lines...]
BUILD FAILED
/usr/home/hudson/hudson-slave/workspace/Lucene-Solr-Tests-trunk-java7/build.xml:29: The following error occurred while executing this line:
/usr/home/hudson/hudson-slave/workspace/Lucene-Solr-Tests-trunk-java7/solr/build.xml:146: The following error occurred while executing this line:
/usr/home/hudson/hudson-slave/workspace/Lucene-Solr-Tests-trunk-java7/lucene/module-build.xml:63: The following error occurred while executing this line:
/usr/home/hudson/hudson-slave/workspace/Lucene-Solr-Tests-trunk-java7/lucene/common-build.xml:1133: The following error occurred while executing this line:
/usr/home/hudson/hudson-slave/workspace/Lucene-Solr-Tests-trunk-java7/lucene/common-build.xml:810: There were test failures: 228 suites, 923 tests, 1 error, 7 ignored (1 assumption)

Total time: 30 minutes 52 seconds
Build step 'Invoke Ant' marked build as failure
Recording test results
Email was triggered for: Failure
Sending email for trigger: Failure



Mime
View raw message