lucene-dev mailing list archives

Site index · List index
Message view « Date » · « Thread »
Top « Date » · « Thread »
From Policeman Jenkins Server <jenk...@sd-datasolutions.de>
Subject [JENKINS] Lucene-Solr-trunk-Linux (64bit/ibm-j9-jdk7) - Build # 1027 - Failure!
Date Tue, 11 Sep 2012 02:06:25 GMT
Build: http://jenkins.sd-datasolutions.de/job/Lucene-Solr-trunk-Linux/1027/
Java: 64bit/ibm-j9-jdk7 -Xjit:exclude={org/apache/lucene/util/fst/FST.pack(IIF)Lorg/apache/lucene/util/fst/FST;}

2 tests failed.
REGRESSION:  org.apache.solr.handler.component.DistributedQueryElevationComponentTest.testDistribSearch

Error Message:
Server at http://localhost:59265/solr returned non ok status:500, message:Server Error

Stack Trace:
org.apache.solr.common.SolrException: Server at http://localhost:59265/solr returned non ok status:500, message:Server Error
	at __randomizedtesting.SeedInfo.seed([8E7DF5FB0A1CFF89:F9B7BE37D439FB5]:0)
	at org.apache.solr.client.solrj.impl.HttpSolrServer.request(HttpSolrServer.java:373)
	at org.apache.solr.client.solrj.impl.HttpSolrServer.request(HttpSolrServer.java:182)
	at org.apache.solr.client.solrj.request.QueryRequest.process(QueryRequest.java:90)
	at org.apache.solr.client.solrj.SolrServer.query(SolrServer.java:324)
	at org.apache.solr.BaseDistributedSearchTestCase.queryServer(BaseDistributedSearchTestCase.java:371)
	at org.apache.solr.BaseDistributedSearchTestCase.query(BaseDistributedSearchTestCase.java:390)
	at org.apache.solr.handler.component.DistributedQueryElevationComponentTest.doTest(DistributedQueryElevationComponentTest.java:83)
	at org.apache.solr.BaseDistributedSearchTestCase.testDistribSearch(BaseDistributedSearchTestCase.java:691)
	at sun.reflect.NativeMethodAccessorImpl.invoke0(Native Method)
	at sun.reflect.NativeMethodAccessorImpl.invoke(NativeMethodAccessorImpl.java:88)
	at sun.reflect.DelegatingMethodAccessorImpl.invoke(DelegatingMethodAccessorImpl.java:55)
	at java.lang.reflect.Method.invoke(Method.java:613)
	at com.carrotsearch.randomizedtesting.RandomizedRunner.invoke(RandomizedRunner.java:1559)
	at com.carrotsearch.randomizedtesting.RandomizedRunner.access$600(RandomizedRunner.java:79)
	at com.carrotsearch.randomizedtesting.RandomizedRunner$6.evaluate(RandomizedRunner.java:737)
	at com.carrotsearch.randomizedtesting.RandomizedRunner$7.evaluate(RandomizedRunner.java:773)
	at com.carrotsearch.randomizedtesting.RandomizedRunner$8.evaluate(RandomizedRunner.java:787)
	at com.carrotsearch.randomizedtesting.rules.SystemPropertiesRestoreRule$1.evaluate(SystemPropertiesRestoreRule.java:53)
	at org.apache.lucene.util.TestRuleSetupTeardownChained$1.evaluate(TestRuleSetupTeardownChained.java:50)
	at org.apache.lucene.util.TestRuleFieldCacheSanity$1.evaluate(TestRuleFieldCacheSanity.java:51)
	at org.apache.lucene.util.AbstractBeforeAfterRule$1.evaluate(AbstractBeforeAfterRule.java:45)
	at com.carrotsearch.randomizedtesting.rules.SystemPropertiesInvariantRule$1.evaluate(SystemPropertiesInvariantRule.java:55)
	at org.apache.lucene.util.TestRuleThreadAndTestName$1.evaluate(TestRuleThreadAndTestName.java:48)
	at org.apache.lucene.util.TestRuleIgnoreAfterMaxFailures$1.evaluate(TestRuleIgnoreAfterMaxFailures.java:70)
	at org.apache.lucene.util.TestRuleMarkFailure$1.evaluate(TestRuleMarkFailure.java:48)
	at com.carrotsearch.randomizedtesting.rules.StatementAdapter.evaluate(StatementAdapter.java:36)
	at com.carrotsearch.randomizedtesting.ThreadLeakControl$StatementRunner.run(ThreadLeakControl.java:358)
	at com.carrotsearch.randomizedtesting.ThreadLeakControl.forkTimeoutingTask(ThreadLeakControl.java:782)
	at com.carrotsearch.randomizedtesting.ThreadLeakControl$3.evaluate(ThreadLeakControl.java:442)
	at com.carrotsearch.randomizedtesting.RandomizedRunner.runSingleTest(RandomizedRunner.java:746)
	at com.carrotsearch.randomizedtesting.RandomizedRunner$3.evaluate(RandomizedRunner.java:648)
	at com.carrotsearch.randomizedtesting.RandomizedRunner$4.evaluate(RandomizedRunner.java:682)
	at com.carrotsearch.randomizedtesting.RandomizedRunner$5.evaluate(RandomizedRunner.java:693)
	at com.carrotsearch.randomizedtesting.rules.StatementAdapter.evaluate(StatementAdapter.java:36)
	at com.carrotsearch.randomizedtesting.rules.SystemPropertiesRestoreRule$1.evaluate(SystemPropertiesRestoreRule.java:53)
	at org.apache.lucene.util.AbstractBeforeAfterRule$1.evaluate(AbstractBeforeAfterRule.java:45)
	at org.apache.lucene.util.TestRuleStoreClassName$1.evaluate(TestRuleStoreClassName.java:42)
	at com.carrotsearch.randomizedtesting.rules.SystemPropertiesInvariantRule$1.evaluate(SystemPropertiesInvariantRule.java:55)
	at com.carrotsearch.randomizedtesting.rules.NoShadowingOrOverridesOnMethodsRule$1.evaluate(NoShadowingOrOverridesOnMethodsRule.java:39)
	at com.carrotsearch.randomizedtesting.rules.NoShadowingOrOverridesOnMethodsRule$1.evaluate(NoShadowingOrOverridesOnMethodsRule.java:39)
	at org.apache.lucene.util.TestRuleAssertionsRequired$1.evaluate(TestRuleAssertionsRequired.java:40)
	at org.apache.lucene.util.TestRuleMarkFailure$1.evaluate(TestRuleMarkFailure.java:48)
	at org.apache.lucene.util.TestRuleIgnoreAfterMaxFailures$1.evaluate(TestRuleIgnoreAfterMaxFailures.java:70)
	at org.apache.lucene.util.TestRuleIgnoreTestSuites$1.evaluate(TestRuleIgnoreTestSuites.java:55)
	at com.carrotsearch.randomizedtesting.rules.StatementAdapter.evaluate(StatementAdapter.java:36)
	at com.carrotsearch.randomizedtesting.ThreadLeakControl$StatementRunner.run(ThreadLeakControl.java:358)
	at java.lang.Thread.run(Thread.java:777)


REGRESSION:  org.apache.solr.handler.component.StatsComponentTest.testStats

Error Message:
Exception during query

Stack Trace:
java.lang.RuntimeException: Exception during query
	at __randomizedtesting.SeedInfo.seed([8E7DF5FB0A1CFF89:14FCAC4462C031AA]:0)
	at org.apache.solr.util.AbstractSolrTestCase.assertQ(AbstractSolrTestCase.java:283)
	at org.apache.solr.handler.component.StatsComponentTest.doTestFacetStatisticsResult(StatsComponentTest.java:239)
	at org.apache.solr.handler.component.StatsComponentTest.testStats(StatsComponentTest.java:68)
	at sun.reflect.NativeMethodAccessorImpl.invoke0(Native Method)
	at sun.reflect.NativeMethodAccessorImpl.invoke(NativeMethodAccessorImpl.java:88)
	at sun.reflect.DelegatingMethodAccessorImpl.invoke(DelegatingMethodAccessorImpl.java:55)
	at java.lang.reflect.Method.invoke(Method.java:613)
	at com.carrotsearch.randomizedtesting.RandomizedRunner.invoke(RandomizedRunner.java:1559)
	at com.carrotsearch.randomizedtesting.RandomizedRunner.access$600(RandomizedRunner.java:79)
	at com.carrotsearch.randomizedtesting.RandomizedRunner$6.evaluate(RandomizedRunner.java:737)
	at com.carrotsearch.randomizedtesting.RandomizedRunner$7.evaluate(RandomizedRunner.java:773)
	at com.carrotsearch.randomizedtesting.RandomizedRunner$8.evaluate(RandomizedRunner.java:787)
	at com.carrotsearch.randomizedtesting.rules.SystemPropertiesRestoreRule$1.evaluate(SystemPropertiesRestoreRule.java:53)
	at org.apache.lucene.util.TestRuleSetupTeardownChained$1.evaluate(TestRuleSetupTeardownChained.java:50)
	at org.apache.lucene.util.TestRuleFieldCacheSanity$1.evaluate(TestRuleFieldCacheSanity.java:51)
	at org.apache.lucene.util.AbstractBeforeAfterRule$1.evaluate(AbstractBeforeAfterRule.java:45)
	at com.carrotsearch.randomizedtesting.rules.SystemPropertiesInvariantRule$1.evaluate(SystemPropertiesInvariantRule.java:55)
	at org.apache.lucene.util.TestRuleThreadAndTestName$1.evaluate(TestRuleThreadAndTestName.java:48)
	at org.apache.lucene.util.TestRuleIgnoreAfterMaxFailures$1.evaluate(TestRuleIgnoreAfterMaxFailures.java:70)
	at org.apache.lucene.util.TestRuleMarkFailure$1.evaluate(TestRuleMarkFailure.java:48)
	at com.carrotsearch.randomizedtesting.rules.StatementAdapter.evaluate(StatementAdapter.java:36)
	at com.carrotsearch.randomizedtesting.ThreadLeakControl$StatementRunner.run(ThreadLeakControl.java:358)
	at com.carrotsearch.randomizedtesting.ThreadLeakControl.forkTimeoutingTask(ThreadLeakControl.java:782)
	at com.carrotsearch.randomizedtesting.ThreadLeakControl$3.evaluate(ThreadLeakControl.java:442)
	at com.carrotsearch.randomizedtesting.RandomizedRunner.runSingleTest(RandomizedRunner.java:746)
	at com.carrotsearch.randomizedtesting.RandomizedRunner$3.evaluate(RandomizedRunner.java:648)
	at com.carrotsearch.randomizedtesting.RandomizedRunner$4.evaluate(RandomizedRunner.java:682)
	at com.carrotsearch.randomizedtesting.RandomizedRunner$5.evaluate(RandomizedRunner.java:693)
	at com.carrotsearch.randomizedtesting.rules.StatementAdapter.evaluate(StatementAdapter.java:36)
	at com.carrotsearch.randomizedtesting.rules.SystemPropertiesRestoreRule$1.evaluate(SystemPropertiesRestoreRule.java:53)
	at org.apache.lucene.util.AbstractBeforeAfterRule$1.evaluate(AbstractBeforeAfterRule.java:45)
	at org.apache.lucene.util.TestRuleStoreClassName$1.evaluate(TestRuleStoreClassName.java:42)
	at com.carrotsearch.randomizedtesting.rules.SystemPropertiesInvariantRule$1.evaluate(SystemPropertiesInvariantRule.java:55)
	at com.carrotsearch.randomizedtesting.rules.NoShadowingOrOverridesOnMethodsRule$1.evaluate(NoShadowingOrOverridesOnMethodsRule.java:39)
	at com.carrotsearch.randomizedtesting.rules.NoShadowingOrOverridesOnMethodsRule$1.evaluate(NoShadowingOrOverridesOnMethodsRule.java:39)
	at org.apache.lucene.util.TestRuleAssertionsRequired$1.evaluate(TestRuleAssertionsRequired.java:40)
	at org.apache.lucene.util.TestRuleMarkFailure$1.evaluate(TestRuleMarkFailure.java:48)
	at org.apache.lucene.util.TestRuleIgnoreAfterMaxFailures$1.evaluate(TestRuleIgnoreAfterMaxFailures.java:70)
	at org.apache.lucene.util.TestRuleIgnoreTestSuites$1.evaluate(TestRuleIgnoreTestSuites.java:55)
	at com.carrotsearch.randomizedtesting.rules.StatementAdapter.evaluate(StatementAdapter.java:36)
	at com.carrotsearch.randomizedtesting.ThreadLeakControl$StatementRunner.run(ThreadLeakControl.java:358)
	at java.lang.Thread.run(Thread.java:777)
Caused by: java.lang.NullPointerException
	at org.apache.solr.util.NumberUtils.SortableStr2int(NumberUtils.java:162)
	at org.apache.solr.schema.SortableIntField.toObject(SortableIntField.java:98)
	at org.apache.solr.schema.SortableIntField.toObject(SortableIntField.java:57)
	at org.apache.solr.schema.FieldType.toObject(FieldType.java:344)
	at org.apache.solr.handler.component.AbstractStatsValues.accumulate(StatsValuesFactory.java:129)
	at org.apache.solr.handler.component.SimpleStats.getFieldCacheStats(StatsComponent.java:281)
	at org.apache.solr.handler.component.SimpleStats.getStatsFields(StatsComponent.java:227)
	at org.apache.solr.handler.component.SimpleStats.getStatsCounts(StatsComponent.java:201)
	at org.apache.solr.handler.component.StatsComponent.process(StatsComponent.java:70)
	at org.apache.solr.handler.component.SearchHandler.handleRequestBody(SearchHandler.java:206)
	at org.apache.solr.handler.RequestHandlerBase.handleRequest(RequestHandlerBase.java:129)
	at org.apache.solr.core.SolrCore.execute(SolrCore.java:1701)
	at org.apache.solr.util.TestHarness.query(TestHarness.java:351)
	at org.apache.solr.util.TestHarness.query(TestHarness.java:333)
	at org.apache.solr.util.AbstractSolrTestCase.assertQ(AbstractSolrTestCase.java:273)
	... 41 more




Build Log:
[...truncated 7870 lines...]
[junit4:junit4] Suite: org.apache.solr.handler.component.StatsComponentTest
[junit4:junit4]   2> 53888 T1718 oasu.AbstractSolrTestCase.setUp ####SETUP_START testFieldStatisticsResultsDateFieldAlwaysMissing
[junit4:junit4]   2> 53889 T1718 oasc.SolrResourceLoader.<init> new SolrResourceLoader for directory: '/mnt/ssd/jenkins/workspace/Lucene-Solr-trunk-Linux/solr/build/solr-core/test-files/solr/collection1/'
[junit4:junit4]   2> 53890 T1718 oasc.SolrResourceLoader.replaceClassLoader Adding 'file:/mnt/ssd/jenkins/workspace/Lucene-Solr-trunk-Linux/solr/build/solr-core/test-files/solr/collection1/lib/README' to classloader
[junit4:junit4]   2> 53890 T1718 oasc.SolrResourceLoader.replaceClassLoader Adding 'file:/mnt/ssd/jenkins/workspace/Lucene-Solr-trunk-Linux/solr/build/solr-core/test-files/solr/collection1/lib/classes/' to classloader
[junit4:junit4]   2> 53911 T1718 oasc.SolrConfig.<init> Using Lucene MatchVersion: LUCENE_50
[junit4:junit4]   2> 53941 T1718 oasc.SolrConfig.<init> Loaded SolrConfig: solrconfig.xml
[junit4:junit4]   2> 53942 T1718 oass.IndexSchema.readSchema Reading Solr Schema
[junit4:junit4]   2> 53945 T1718 oass.IndexSchema.readSchema Schema name=example
[junit4:junit4]   2> 54049 T1718 oass.IndexSchema.readSchema default search field in schema is text
[junit4:junit4]   2> 54051 T1718 oass.IndexSchema.readSchema unique key field: id
[junit4:junit4]   2> 54054 T1718 oasc.SolrResourceLoader.locateSolrHome JNDI not configured for solr (NoInitialContextEx)
[junit4:junit4]   2> 54054 T1718 oasc.SolrResourceLoader.locateSolrHome using system property solr.solr.home: /mnt/ssd/jenkins/workspace/Lucene-Solr-trunk-Linux/solr/build/solr-core/test-files/solr
[junit4:junit4]   2> 54054 T1718 oasc.SolrResourceLoader.<init> new SolrResourceLoader for directory: '/mnt/ssd/jenkins/workspace/Lucene-Solr-trunk-Linux/solr/build/solr-core/test-files/solr/'
[junit4:junit4]   2> 54059 T1718 oasc.CoreContainer.<init> New CoreContainer 1951869568
[junit4:junit4]   2> 54059 T1718 oasc.SolrCore.<init> [collection1] Opening new SolrCore at /mnt/ssd/jenkins/workspace/Lucene-Solr-trunk-Linux/solr/build/solr-core/test-files/solr/collection1/, dataDir=/mnt/ssd/jenkins/workspace/Lucene-Solr-trunk-Linux/solr/build/solr-core/test/J0/./org.apache.solr.handler.component.StatsComponentTest-1347329058086/
[junit4:junit4]   2> 54060 T1718 oasc.JmxMonitoredMap.<init> JMX monitoring is enabled. Adding Solr mbeans to JMX Server: com.sun.jmx.mbeanserver.JmxMBeanServer@cc6d7070
[junit4:junit4]   2> 54060 T1718 oasc.SolrCore.getNewIndexDir WARNING New index directory detected: old=null new=/mnt/ssd/jenkins/workspace/Lucene-Solr-trunk-Linux/solr/build/solr-core/test/J0/./org.apache.solr.handler.component.StatsComponentTest-1347329058086/index/
[junit4:junit4]   2> 54061 T1718 oasc.SolrCore.initIndex WARNING [collection1] Solr index directory '/mnt/ssd/jenkins/workspace/Lucene-Solr-trunk-Linux/solr/build/solr-core/test/J0/./org.apache.solr.handler.component.StatsComponentTest-1347329058086/index' doesn't exist. Creating new index...
[junit4:junit4]   2> 54061 T1718 oasc.CachingDirectoryFactory.get return new directory for /mnt/ssd/jenkins/workspace/Lucene-Solr-trunk-Linux/solr/build/solr-core/test/J0/./org.apache.solr.handler.component.StatsComponentTest-1347329058086/index forceNew:false
[junit4:junit4]   2> 54062 T1718 oasc.SolrDeletionPolicy.onCommit SolrDeletionPolicy.onCommit: commits:num=1
[junit4:junit4]   2> 		commit{dir=MockDirWrapper(org.apache.lucene.store.RAMDirectory@4aa95f5b lockFactory=org.apache.lucene.store.NativeFSLockFactory@b55865bc),segFN=segments_1,generation=1,filenames=[segments_1]
[junit4:junit4]   2> 54063 T1718 oasc.SolrDeletionPolicy.updateCommits newest commit = 1
[junit4:junit4]   2> 54063 T1718 oasc.SolrCore.initWriters created xml: solr.XMLResponseWriter
[junit4:junit4]   2> 54064 T1718 oasup.UpdateRequestProcessorChain.init inserting DistributedUpdateProcessorFactory into updateRequestProcessorChain "dedupe"
[junit4:junit4]   2> 54064 T1718 oasup.UpdateRequestProcessorChain.init inserting DistributedUpdateProcessorFactory into updateRequestProcessorChain "dedupe-allfields"
[junit4:junit4]   2> 54065 T1718 oasup.UpdateRequestProcessorChain.init inserting DistributedUpdateProcessorFactory into updateRequestProcessorChain "stored_sig"
[junit4:junit4]   2> 54065 T1718 oasup.UpdateRequestProcessorChain.init inserting DistributedUpdateProcessorFactory into updateRequestProcessorChain "uniq-fields"
[junit4:junit4]   2> 54066 T1718 oasup.UpdateRequestProcessorChain.init inserting DistributedUpdateProcessorFactory into updateRequestProcessorChain "distrib-dup-test-chain-implicit"
[junit4:junit4]   2> 54066 T1718 oasc.RequestHandlers.initHandlersFromConfig adding lazy requestHandler: solr.ReplicationHandler
[junit4:junit4]   2> 54066 T1718 oasc.RequestHandlers.initHandlersFromConfig created /replication: solr.ReplicationHandler
[junit4:junit4]   2> 54067 T1718 oasc.RequestHandlers.initHandlersFromConfig created standard: solr.StandardRequestHandler
[junit4:junit4]   2> 54067 T1718 oasc.RequestHandlers.initHandlersFromConfig created /get: solr.RealTimeGetHandler
[junit4:junit4]   2> 54068 T1718 oasc.RequestHandlers.initHandlersFromConfig created dismax: solr.SearchHandler
[junit4:junit4]   2> 54068 T1718 oasc.RequestHandlers.initHandlersFromConfig created mock: org.apache.solr.core.MockQuerySenderListenerReqHandler
[junit4:junit4]   2> 54069 T1718 oasc.RequestHandlers.initHandlersFromConfig created /admin/: org.apache.solr.handler.admin.AdminHandlers
[junit4:junit4]   2> 54069 T1718 oasc.RequestHandlers.initHandlersFromConfig created defaults: solr.StandardRequestHandler
[junit4:junit4]   2> 54069 T1718 oasc.RequestHandlers.initHandlersFromConfig adding lazy requestHandler: solr.StandardRequestHandler
[junit4:junit4]   2> 54070 T1718 oasc.RequestHandlers.initHandlersFromConfig created lazy: solr.StandardRequestHandler
[junit4:junit4]   2> 54070 T1718 oasc.RequestHandlers.initHandlersFromConfig created /update: solr.UpdateRequestHandler
[junit4:junit4]   2> 54070 T1718 oasc.RequestHandlers.initHandlersFromConfig created /terms: org.apache.solr.handler.component.SearchHandler
[junit4:junit4]   2> 54071 T1718 oasc.RequestHandlers.initHandlersFromConfig created spellCheckCompRH: org.apache.solr.handler.component.SearchHandler
[junit4:junit4]   2> 54071 T1718 oasc.RequestHandlers.initHandlersFromConfig created spellCheckCompRH_Direct: org.apache.solr.handler.component.SearchHandler
[junit4:junit4]   2> 54072 T1718 oasc.RequestHandlers.initHandlersFromConfig created spellCheckWithWordbreak: org.apache.solr.handler.component.SearchHandler
[junit4:junit4]   2> 54072 T1718 oasc.RequestHandlers.initHandlersFromConfig created spellCheckWithWordbreak_Direct: org.apache.solr.handler.component.SearchHandler
[junit4:junit4]   2> 54073 T1718 oasc.RequestHandlers.initHandlersFromConfig created spellCheckCompRH1: org.apache.solr.handler.component.SearchHandler
[junit4:junit4]   2> 54073 T1718 oasc.RequestHandlers.initHandlersFromConfig created tvrh: org.apache.solr.handler.component.SearchHandler
[junit4:junit4]   2> 54073 T1718 oasc.RequestHandlers.initHandlersFromConfig created /mlt: solr.MoreLikeThisHandler
[junit4:junit4]   2> 54074 T1718 oasc.RequestHandlers.initHandlersFromConfig created /debug/dump: solr.DumpRequestHandler
[junit4:junit4]   2> 54074 T1718 oashl.XMLLoader.init xsltCacheLifetimeSeconds=60
[junit4:junit4]   2> 54076 T1718 oasc.SolrCore.initDeprecatedSupport WARNING solrconfig.xml uses deprecated <admin/gettableFiles>, Please update your config to use the ShowFileRequestHandler.
[junit4:junit4]   2> 54077 T1718 oasc.SolrCore.initDeprecatedSupport WARNING adding ShowFileRequestHandler with hidden files: [BAD-SCHEMA-NOT-INDEXED-BUT-TF.XML, SCHEMA-REQUIRED-FIELDS.XML, SOLRCONFIG-MASTER1-KEEPONEBACKUP.XML, BAD-SCHEMA-NONTEXT-ANALYZER.XML, SOLRCONFIG-PROPINJECT.XML, SOLRCONFIG-PROPINJECT-INDEXDEFAULT.XML, STOP-2.TXT, SCHEMA11.XML, BAD-SCHEMA-UNIQUEKEY-USES-DEFAULT.XML, SCHEMA15.XML, SOLRCONFIG-NATIVELOCK.XML, SCHEMA-SIM.XML, CONDITIONAL.UPDATEPROCESSOR.JS, BAD-SOLRCONFIG-MISSING-SCRIPTFILE.XML, SOLRCONFIG-SCRIPT-UPDATEPROCESSOR.XML, SOLRCONFIG-REPEATER.XML, SOLRCONFIG-SPELLCHECKER.XML, SOLRCONFIG-NOCACHE.XML, SCHEMA-CHARFILTERS.XML, SOLRCONFIG-SOLCOREPROPERTIES.XML, SOLRCONFIG_CODEC.XML, BAD-SCHEMA-EXTERNAL-FILEFIELD.XML, HYPHENATION.DTD, SCHEMA.XML, SOLRCONFIG-MERGEPOLICY.XML, TRIVIAL.UPDATEPROCESSOR1.JS, SOLRCONFIG-PHRASESUGGEST.XML, SOLRCONFIG-SLAVE1.XML, SOLRCONFIG-BASIC.XML, SCHEMA-LMJELINEKMERCER.XML, BAD-MP-SOLRCONFIG.XML, BAD-SCHEMA-DUP-FIELD.XML, BAD-SCHEMA-UNIQUEKEY-MULTIVALUED.XML, SOLRCONFIG-MASTER.XML, SOLRCONFIG-HIGHLIGHT.XML, SCHEMA-TFIDF.XML, SCHEMA-REPLICATION1.XML, SYNONYMS.TXT, SOLRCONFIG-ELEVATE.XML, STOPWITHBOM.TXT, SOLRCONFIG-QUERYSENDER.XML, WDFTYPES.TXT, SOLRCONFIG-DELPOLICY1.XML, BAD_SOLRCONFIG.XML, HUNSPELL-TEST.DIC, SCHEMA-NUMERIC.XML, SCHEMA-LUCENEMATCHVERSION.XML, KEEP-2.TXT, SCHEMA-STOP-KEEP.XML, SCHEMA-IB.XML, STOP-SNOWBALL.TXT, SOLRCONFIG-SLAVE.XML, BAD-SCHEMA-NOT-INDEXED-BUT-NORMS.XML, STOPWORDSWRONGENCODING.TXT, THROW.ERROR.ON.ADD.UPDATEPROCESSOR.JS, SOLRCONFIG-SPELLCHECKCOMPONENT.XML, STOPTYPES-1.TXT, SOLRCONFIG-TLOG.XML, COMPOUNDDICTIONARY.TXT, DA_COMPOUNDDICTIONARY.TXT, SOLRCONFIG-TERMINDEX.XML, BAD-SOLRCONFIG-INVALID-SCRIPTFILE.XML, SCHEMASURROUND.XML, OPEN-EXCHANGE-RATES.JSON, BAD-SCHEMA-DUP-FIELDTYPE.XML, PHRASESUGGEST.TXT, SOLRCONFIG-MASTER2.XML, OLD_SYNONYMS.TXT, BAD-SCHEMA-UNIQUEKEY-IS-COPYFIELD-DEST.XML, SCHEMA-NOT-REQUIRED-UNIQUE-KEY.XML, BAD-SCHEMA-CODEC-GLOBAL-VS-FT-MISMATCH.XML, SCHEMA-LMDIRICHLET.XML, SCHEMA-REVERSED.XML, BAD-SCHEMA-NOT-INDEXED-BUT-POS.XML, SCHEMA-FOLDING.XML, SOLRCONFIG-CACHING.XML, MAPPING-ISOLATIN1ACCENT.TXT, ADDFIELDS.UPDATEPROCESSOR.JS, SCHEMA-BM25.XML, STOP-1.TXT, SOLRCONFIG-ENABLEPLUGIN.XML, MISSING.FUNCTIONS.UPDATEPROCESSOR.JS, SCHEMA12.XML, SOLRCONFIG-TRANSFORMERS.XML, SCHEMA-COPYFIELD-TEST.XML, BAD-SCHEMA-DUP-DYNAMICFIELD.XML, CURRENCY.XML, DA_UTF8.XML, MISSLEADING.EXTENSION.UPDATEPROCESSOR.JS.TXT, SOLRCONFIG-SOLR-749.XML, STOPWORDS.TXT, HUNSPELL-TEST.AFF, SOLRCONFIG_PERF.XML, SOLRCONFIG-SIMPLELOCK.XML, FRENCHARTICLES.TXT, SOLRCONFIG-LAZYWRITER.XML, SCHEMA-REPLICATION2.XML, SOLRCONFIG-XINCLUDE.XML, SCHEMA-SPELLCHECKER.XML, XSLT, SOLRCONFIG-DELPOLICY2.XML, TRIVIAL.UPDATEPROCESSOR0.JS, KEEP-1.TXT, SCHEMA-TRIE.XML, SCHEMA-BINARYFIELD.XML, BAD-SCHEMA-OMIT-TF-BUT-NOT-POS.XML, SCHEMA-MINIMAL.XML, STOPTYPES-2.TXT, STEMDICT.TXT, SCHEMA_CODEC.XML, ELEVATE.XML, SCHEMA-COLLATE.XML, PROTWORDS.TXT, SOLRCONFIG-REQHANDLER.INCL, SCHEMA-PHRASESUGGEST.XML, SCHEMA-DFR.XML, BAD-SCHEMA-ANALYZER-CLASS-AND-NESTED.XML, SOLRCONFIG-MASTER1.XML, SOLRCONFIG-FUNCTIONQUERY.XML, SOLRCONFIG-MASTER3.XML, SOLRCONFIG-UPDATE-PROCESSOR-CHAINS.XML, SOLRCONFIG-ALTDIRECTORY.XML, BAD-SCHEMA-SIM-GLOBAL-VS-FT-MISMATCH.XML, SOLRCONFIG-QUERYSENDER-NOQUERY.XML, BAD-SOLRCONFIG-BOGUS-SCRIPTENGINE-NAME.XML]
[junit4:junit4]   2> 54078 T1718 oass.SolrIndexSearcher.<init> Opening Searcher@913160d4 main
[junit4:junit4]   2> 54078 T1718 oass.SolrIndexSearcher.getIndexDir WARNING WARNING: Directory impl does not support setting indexDir: org.apache.lucene.store.MockDirectoryWrapper
[junit4:junit4]   2> 54079 T1718 oasu.CommitTracker.<init> Hard AutoCommit: disabled
[junit4:junit4]   2> 54079 T1718 oasu.CommitTracker.<init> Soft AutoCommit: disabled
[junit4:junit4]   2> 54080 T1718 oashc.SpellCheckComponent.inform Initializing spell checkers
[junit4:junit4]   2> 54187 T1718 oass.DirectSolrSpellChecker.init init: {name=direct,classname=DirectSolrSpellChecker,field=lowerfilt,minQueryLength=3}
[junit4:junit4]   2> 54202 T1718 oashc.HttpShardHandlerFactory.getParameter Setting socketTimeout to: 0
[junit4:junit4]   2> 54202 T1718 oashc.HttpShardHandlerFactory.getParameter Setting urlScheme to: http://
[junit4:junit4]   2> 54202 T1718 oashc.HttpShardHandlerFactory.getParameter Setting connTimeout to: 0
[junit4:junit4]   2> 54203 T1718 oashc.HttpShardHandlerFactory.getParameter Setting maxConnectionsPerHost to: 20
[junit4:junit4]   2> 54203 T1718 oashc.HttpShardHandlerFactory.getParameter Setting corePoolSize to: 0
[junit4:junit4]   2> 54203 T1718 oashc.HttpShardHandlerFactory.getParameter Setting maximumPoolSize to: 2147483647
[junit4:junit4]   2> 54204 T1718 oashc.HttpShardHandlerFactory.getParameter Setting maxThreadIdleTime to: 5
[junit4:junit4]   2> 54204 T1718 oashc.HttpShardHandlerFactory.getParameter Setting sizeOfQueue to: -1
[junit4:junit4]   2> 54205 T1718 oashc.HttpShardHandlerFactory.getParameter Setting fairnessPolicy to: false
[junit4:junit4]   2> 54205 T1718 oascsi.HttpClientUtil.createClient Creating new http client, config:maxConnectionsPerHost=20&maxConnections=10000&socketTimeout=0&connTimeout=0&retry=false
[junit4:junit4]   2> 54211 T1719 oasc.SolrCore.registerSearcher [collection1] Registered new searcher Searcher@913160d4 main{StandardDirectoryReader(segments_1:1)}
[junit4:junit4]   2> 54212 T1718 oasc.CoreContainer.register registering core: collection1
[junit4:junit4]   2> 54213 T1718 oasu.AbstractSolrTestCase.setUp ####SETUP_END testFieldStatisticsResultsDateFieldAlwaysMissing
[junit4:junit4]   2> ASYNC  NEW_CORE C138 name=collection1 org.apache.solr.core.SolrCore@349149e6
[junit4:junit4]   2> 54216 T1718 C138 oasc.SolrDeletionPolicy.onInit SolrDeletionPolicy.onInit: commits:num=1
[junit4:junit4]   2> 		commit{dir=MockDirWrapper(org.apache.lucene.store.RAMDirectory@4aa95f5b lockFactory=org.apache.lucene.store.NativeFSLockFactory@b55865bc),segFN=segments_1,generation=1,filenames=[segments_1]
[junit4:junit4]   2> 54217 T1718 C138 oasc.SolrDeletionPolicy.updateCommits newest commit = 1
[junit4:junit4]   2> 54218 T1718 C138 UPDATE [collection1] webapp=null path=null params={} {add=[1]} 0 2
[junit4:junit4]   2> 54223 T1718 C138 UPDATE [collection1] webapp=null path=null params={} {add=[2]} 0 0
[junit4:junit4]   2> 54226 T1718 C138 UPDATE [collection1] webapp=null path=null params={} {add=[3]} 0 0
[junit4:junit4]   2> 54229 T1718 C138 oasu.DirectUpdateHandler2.commit start commit{flags=0,_version_=0,optimize=false,openSearcher=true,waitSearcher=true,expungeDeletes=false,softCommit=false}
[junit4:junit4]   2> 54230 T1718 C138 oasc.SolrDeletionPolicy.onCommit SolrDeletionPolicy.onCommit: commits:num=2
[junit4:junit4]   2> 		commit{dir=MockDirWrapper(org.apache.lucene.store.RAMDirectory@4aa95f5b lockFactory=org.apache.lucene.store.NativeFSLockFactory@b55865bc),segFN=segments_1,generation=1,filenames=[segments_1]
[junit4:junit4]   2> 		commit{dir=MockDirWrapper(org.apache.lucene.store.RAMDirectory@4aa95f5b lockFactory=org.apache.lucene.store.NativeFSLockFactory@b55865bc),segFN=segments_2,generation=2,filenames=[_0_MockVariableIntBlock_0.tib, _0.si, segments_2, _0_MockVariableIntBlock_0.pyl, _0.fnm, _0.fdt, _0_MockVariableIntBlock_0.pos, _0_MockVariableIntBlock_0.tii, _0_MockVariableIntBlock_0.frq, _0.fdx, _0_MockVariableIntBlock_0.doc, _0_MockVariableIntBlock_0.skp]
[junit4:junit4]   2> 54231 T1718 C138 oasc.SolrDeletionPolicy.updateCommits newest commit = 2
[junit4:junit4]   2> 54232 T1718 C138 oass.SolrIndexSearcher.<init> Opening Searcher@409d8d66 main
[junit4:junit4]   2> 54232 T1718 C138 oass.SolrIndexSearcher.getIndexDir WARNING WARNING: Directory impl does not support setting indexDir: org.apache.lucene.store.MockDirectoryWrapper
[junit4:junit4]   2> 54233 T1718 C138 oasu.DirectUpdateHandler2.commit end_commit_flush
[junit4:junit4]   2> 54234 T1719 oasc.SolrCore.registerSearcher [collection1] Registered new searcher Searcher@409d8d66 main{StandardDirectoryReader(segments_2:3 _0(5.0):C3)}
[junit4:junit4]   2> 54234 T1718 C138 UPDATE [collection1] webapp=null path=null params={} {commit=} 0 5
[junit4:junit4]   2> 54236 T1718 C138 REQ [collection1] webapp=null path=null params={q=*:*&stats.field=active_dt&indent=true&stats=true} hits=3 status=0 QTime=1 
[junit4:junit4]   2> 54237 T1718 oasu.AbstractSolrTestCase.tearDown ####TEARDOWN_START testFieldStatisticsResultsDateFieldAlwaysMissing
[junit4:junit4]   2> 54237 T1718 oasc.CoreContainer.shutdown Shutting down CoreContainer instance=1951869568
[junit4:junit4]   2> 54238 T1718 oasc.SolrCore.close [collection1]  CLOSING SolrCore org.apache.solr.core.SolrCore@349149e6
[junit4:junit4]   2> 54243 T1718 oasc.SolrCore.closeSearcher [collection1] Closing main searcher on request.
[junit4:junit4]   2> 54243 T1718 oasu.DirectUpdateHandler2.close closing DirectUpdateHandler2{commits=1,autocommits=0,soft autocommits=0,optimizes=0,rollbacks=0,expungeDeletes=0,docsPending=0,adds=0,deletesById=0,deletesByQuery=0,errors=0,cumulative_adds=3,cumulative_deletesById=0,cumulative_deletesByQuery=0,cumulative_errors=0}
[junit4:junit4]   2> 54244 T1718 oasu.DefaultSolrCoreState.decref SolrCoreState ref count has reached 0 - closing IndexWriter
[junit4:junit4]   2> 54246 T1718 oasu.DefaultSolrCoreState.decref Closing SolrCoreState - canceling any ongoing recovery
[junit4:junit4]   2> 54256 T1718 oasu.AbstractSolrTestCase.setUp ####SETUP_START testFieldStatisticsResultsStringFieldAlwaysMissing
[junit4:junit4]   2> 54258 T1718 oasc.SolrResourceLoader.<init> new SolrResourceLoader for directory: '/mnt/ssd/jenkins/workspace/Lucene-Solr-trunk-Linux/solr/build/solr-core/test-files/solr/collection1/'
[junit4:junit4]   2> 54258 T1718 oasc.SolrResourceLoader.replaceClassLoader Adding 'file:/mnt/ssd/jenkins/workspace/Lucene-Solr-trunk-Linux/solr/build/solr-core/test-files/solr/collection1/lib/README' to classloader
[junit4:junit4]   2> 54259 T1718 oasc.SolrResourceLoader.replaceClassLoader Adding 'file:/mnt/ssd/jenkins/workspace/Lucene-Solr-trunk-Linux/solr/build/solr-core/test-files/solr/collection1/lib/classes/' to classloader
[junit4:junit4]   2> 54281 T1718 oasc.SolrConfig.<init> Using Lucene MatchVersion: LUCENE_50
[junit4:junit4]   2> 54312 T1718 oasc.SolrConfig.<init> Loaded SolrConfig: solrconfig.xml
[junit4:junit4]   2> 54312 T1718 oass.IndexSchema.readSchema Reading Solr Schema
[junit4:junit4]   2> 54315 T1718 oass.IndexSchema.readSchema Schema name=example
[junit4:junit4]   2> 54413 T1718 oass.IndexSchema.readSchema default search field in schema is text
[junit4:junit4]   2> 54415 T1718 oass.IndexSchema.readSchema unique key field: id
[junit4:junit4]   2> 54418 T1718 oasc.SolrResourceLoader.locateSolrHome JNDI not configured for solr (NoInitialContextEx)
[junit4:junit4]   2> 54418 T1718 oasc.SolrResourceLoader.locateSolrHome using system property solr.solr.home: /mnt/ssd/jenkins/workspace/Lucene-Solr-trunk-Linux/solr/build/solr-core/test-files/solr
[junit4:junit4]   2> 54418 T1718 oasc.SolrResourceLoader.<init> new SolrResourceLoader for directory: '/mnt/ssd/jenkins/workspace/Lucene-Solr-trunk-Linux/solr/build/solr-core/test-files/solr/'
[junit4:junit4]   2> 54423 T1718 oasc.CoreContainer.<init> New CoreContainer -131829588
[junit4:junit4]   2> 54423 T1718 oasc.SolrCore.<init> [collection1] Opening new SolrCore at /mnt/ssd/jenkins/workspace/Lucene-Solr-trunk-Linux/solr/build/solr-core/test-files/solr/collection1/, dataDir=/mnt/ssd/jenkins/workspace/Lucene-Solr-trunk-Linux/solr/build/solr-core/test/J0/./org.apache.solr.handler.component.StatsComponentTest-1347329058454/
[junit4:junit4]   2> 54424 T1718 oasc.JmxMonitoredMap.<init> JMX monitoring is enabled. Adding Solr mbeans to JMX Server: com.sun.jmx.mbeanserver.JmxMBeanServer@cc6d7070
[junit4:junit4]   2> 54424 T1718 oasc.SolrCore.getNewIndexDir WARNING New index directory detected: old=null new=/mnt/ssd/jenkins/workspace/Lucene-Solr-trunk-Linux/solr/build/solr-core/test/J0/./org.apache.solr.handler.component.StatsComponentTest-1347329058454/index/
[junit4:junit4]   2> 54425 T1718 oasc.SolrCore.initIndex WARNING [collection1] Solr index directory '/mnt/ssd/jenkins/workspace/Lucene-Solr-trunk-Linux/solr/build/solr-core/test/J0/./org.apache.solr.handler.component.StatsComponentTest-1347329058454/index' doesn't exist. Creating new index...
[junit4:junit4]   2> 54425 T1718 oasc.CachingDirectoryFactory.get return new directory for /mnt/ssd/jenkins/workspace/Lucene-Solr-trunk-Linux/solr/build/solr-core/test/J0/./org.apache.solr.handler.component.StatsComponentTest-1347329058454/index forceNew:false
[junit4:junit4]   2> 54426 T1718 oasc.SolrDeletionPolicy.onCommit SolrDeletionPolicy.onCommit: commits:num=1
[junit4:junit4]   2> 		commit{dir=MockDirWrapper(org.apache.lucene.store.RAMDirectory@ca0f9221 lockFactory=org.apache.lucene.store.NativeFSLockFactory@8304259),segFN=segments_1,generation=1,filenames=[segments_1]
[junit4:junit4]   2> 54427 T1718 oasc.SolrDeletionPolicy.updateCommits newest commit = 1
[junit4:junit4]   2> 54427 T1718 oasc.SolrCore.initWriters created xml: solr.XMLResponseWriter
[junit4:junit4]   2> 54428 T1718 oasup.UpdateRequestProcessorChain.init inserting DistributedUpdateProcessorFactory into updateRequestProcessorChain "dedupe"
[junit4:junit4]   2> 54429 T1718 oasup.UpdateRequestProcessorChain.init inserting DistributedUpdateProcessorFactory into updateRequestProcessorChain "dedupe-allfields"
[junit4:junit4]   2> 54429 T1718 oasup.UpdateRequestProcessorChain.init inserting DistributedUpdateProcessorFactory into updateRequestProcessorChain "stored_sig"
[junit4:junit4]   2> 54429 T1718 oasup.UpdateRequestProcessorChain.init inserting DistributedUpdateProcessorFactory into updateRequestProcessorChain "uniq-fields"
[junit4:junit4]   2> 54430 T1718 oasup.UpdateRequestProcessorChain.init inserting DistributedUpdateProcessorFactory into updateRequestProcessorChain "distrib-dup-test-chain-implicit"
[junit4:junit4]   2> 54430 T1718 oasc.RequestHandlers.initHandlersFromConfig adding lazy requestHandler: solr.ReplicationHandler
[junit4:junit4]   2> 54431 T1718 oasc.RequestHandlers.initHandlersFromConfig created /replication: solr.ReplicationHandler
[junit4:junit4]   2> 54431 T1718 oasc.RequestHandlers.initHandlersFromConfig created standard: solr.StandardRequestHandler
[junit4:junit4]   2> 54432 T1718 oasc.RequestHandlers.initHandlersFromConfig created /get: solr.RealTimeGetHandler
[junit4:junit4]   2> 54432 T1718 oasc.RequestHandlers.initHandlersFromConfig created dismax: solr.SearchHandler
[junit4:junit4]   2> 54432 T1718 oasc.RequestHandlers.initHandlersFromConfig created mock: org.apache.solr.core.MockQuerySenderListenerReqHandler
[junit4:junit4]   2> 54433 T1718 oasc.RequestHandlers.initHandlersFromConfig created /admin/: org.apache.solr.handler.admin.AdminHandlers
[junit4:junit4]   2> 54433 T1718 oasc.RequestHandlers.initHandlersFromConfig created defaults: solr.StandardRequestHandler
[junit4:junit4]   2> 54434 T1718 oasc.RequestHandlers.initHandlersFromConfig adding lazy requestHandler: solr.StandardRequestHandler
[junit4:junit4]   2> 54434 T1718 oasc.RequestHandlers.initHandlersFromConfig created lazy: solr.StandardRequestHandler
[junit4:junit4]   2> 54434 T1718 oasc.RequestHandlers.initHandlersFromConfig created /update: solr.UpdateRequestHandler
[junit4:junit4]   2> 54435 T1718 oasc.RequestHandlers.initHandlersFromConfig created /terms: org.apache.solr.handler.component.SearchHandler
[junit4:junit4]   2> 54435 T1718 oasc.RequestHandlers.initHandlersFromConfig created spellCheckCompRH: org.apache.solr.handler.component.SearchHandler
[junit4:junit4]   2> 54436 T1718 oasc.RequestHandlers.initHandlersFromConfig created spellCheckCompRH_Direct: org.apache.solr.handler.component.SearchHandler
[junit4:junit4]   2> 54436 T1718 oasc.RequestHandlers.initHandlersFromConfig created spellCheckWithWordbreak: org.apache.solr.handler.component.SearchHandler
[junit4:junit4]   2> 54437 T1718 oasc.RequestHandlers.initHandlersFromConfig created spellCheckWithWordbreak_Direct: org.apache.solr.handler.component.SearchHandler
[junit4:junit4]   2> 54437 T1718 oasc.RequestHandlers.initHandlersFromConfig created spellCheckCompRH1: org.apache.solr.handler.component.SearchHandler
[junit4:junit4]   2> 54437 T1718 oasc.RequestHandlers.initHandlersFromConfig created tvrh: org.apache.solr.handler.component.SearchHandler
[junit4:junit4]   2> 54438 T1718 oasc.RequestHandlers.initHandlersFromConfig created /mlt: solr.MoreLikeThisHandler
[junit4:junit4]   2> 54438 T1718 oasc.RequestHandlers.initHandlersFromConfig created /debug/dump: solr.DumpRequestHandler
[junit4:junit4]   2> 54439 T1718 oashl.XMLLoader.init xsltCacheLifetimeSeconds=60
[junit4:junit4]   2> 54440 T1718 oasc.SolrCore.initDeprecatedSupport WARNING solrconfig.xml uses deprecated <admin/gettableFiles>, Please update your config to use the ShowFileRequestHandler.
[junit4:junit4]   2> 54441 T1718 oasc.SolrCore.initDeprecatedSupport WARNING adding ShowFileRequestHandler with hidden files: [BAD-SCHEMA-NOT-INDEXED-BUT-TF.XML, SCHEMA-REQUIRED-FIELDS.XML, SOLRCONFIG-MASTER1-KEEPONEBACKUP.XML, BAD-SCHEMA-NONTEXT-ANALYZER.XML, SOLRCONFIG-PROPINJECT.XML, SOLRCONFIG-PROPINJECT-INDEXDEFAULT.XML, STOP-2.TXT, SCHEMA11.XML, BAD-SCHEMA-UNIQUEKEY-USES-DEFAULT.XML, SCHEMA15.XML, SOLRCONFIG-NATIVELOCK.XML, SCHEMA-SIM.XML, CONDITIONAL.UPDATEPROCESSOR.JS, BAD-SOLRCONFIG-MISSING-SCRIPTFILE.XML, SOLRCONFIG-SCRIPT-UPDATEPROCESSOR.XML, SOLRCONFIG-REPEATER.XML, SOLRCONFIG-SPELLCHECKER.XML, SOLRCONFIG-NOCACHE.XML, SCHEMA-CHARFILTERS.XML, SOLRCONFIG-SOLCOREPROPERTIES.XML, SOLRCONFIG_CODEC.XML, BAD-SCHEMA-EXTERNAL-FILEFIELD.XML, HYPHENATION.DTD, SCHEMA.XML, SOLRCONFIG-MERGEPOLICY.XML, TRIVIAL.UPDATEPROCESSOR1.JS, SOLRCONFIG-PHRASESUGGEST.XML, SOLRCONFIG-SLAVE1.XML, SOLRCONFIG-BASIC.XML, SCHEMA-LMJELINEKMERCER.XML, BAD-MP-SOLRCONFIG.XML, BAD-SCHEMA-DUP-FIELD.XML, BAD-SCHEMA-UNIQUEKEY-MULTIVALUED.XML, SOLRCONFIG-MASTER.XML, SOLRCONFIG-HIGHLIGHT.XML, SCHEMA-TFIDF.XML, SCHEMA-REPLICATION1.XML, SYNONYMS.TXT, SOLRCONFIG-ELEVATE.XML, STOPWITHBOM.TXT, SOLRCONFIG-QUERYSENDER.XML, WDFTYPES.TXT, SOLRCONFIG-DELPOLICY1.XML, BAD_SOLRCONFIG.XML, HUNSPELL-TEST.DIC, SCHEMA-NUMERIC.XML, SCHEMA-LUCENEMATCHVERSION.XML, KEEP-2.TXT, SCHEMA-STOP-KEEP.XML, SCHEMA-IB.XML, STOP-SNOWBALL.TXT, SOLRCONFIG-SLAVE.XML, BAD-SCHEMA-NOT-INDEXED-BUT-NORMS.XML, STOPWORDSWRONGENCODING.TXT, THROW.ERROR.ON.ADD.UPDATEPROCESSOR.JS, SOLRCONFIG-SPELLCHECKCOMPONENT.XML, STOPTYPES-1.TXT, SOLRCONFIG-TLOG.XML, COMPOUNDDICTIONARY.TXT, DA_COMPOUNDDICTIONARY.TXT, SOLRCONFIG-TERMINDEX.XML, BAD-SOLRCONFIG-INVALID-SCRIPTFILE.XML, SCHEMASURROUND.XML, OPEN-EXCHANGE-RATES.JSON, BAD-SCHEMA-DUP-FIELDTYPE.XML, PHRASESUGGEST.TXT, SOLRCONFIG-MASTER2.XML, OLD_SYNONYMS.TXT, BAD-SCHEMA-UNIQUEKEY-IS-COPYFIELD-DEST.XML, SCHEMA-NOT-REQUIRED-UNIQUE-KEY.XML, BAD-SCHEMA-CODEC-GLOBAL-VS-FT-MISMATCH.XML, SCHEMA-LMDIRICHLET.XML, SCHEMA-REVERSED.XML, BAD-SCHEMA-NOT-INDEXED-BUT-POS.XML, SCHEMA-FOLDING.XML, SOLRCONFIG-CACHING.XML, MAPPING-ISOLATIN1ACCENT.TXT, ADDFIELDS.UPDATEPROCESSOR.JS, SCHEMA-BM25.XML, STOP-1.TXT, SOLRCONFIG-ENABLEPLUGIN.XML, MISSING.FUNCTIONS.UPDATEPROCESSOR.JS, SCHEMA12.XML, SOLRCONFIG-TRANSFORMERS.XML, SCHEMA-COPYFIELD-TEST.XML, BAD-SCHEMA-DUP-DYNAMICFIELD.XML, CURRENCY.XML, DA_UTF8.XML, MISSLEADING.EXTENSION.UPDATEPROCESSOR.JS.TXT, SOLRCONFIG-SOLR-749.XML, STOPWORDS.TXT, HUNSPELL-TEST.AFF, SOLRCONFIG_PERF.XML, SOLRCONFIG-SIMPLELOCK.XML, FRENCHARTICLES.TXT, SOLRCONFIG-LAZYWRITER.XML, SCHEMA-REPLICATION2.XML, SOLRCONFIG-XINCLUDE.XML, SCHEMA-SPELLCHECKER.XML, XSLT, SOLRCONFIG-DELPOLICY2.XML, TRIVIAL.UPDATEPROCESSOR0.JS, KEEP-1.TXT, SCHEMA-TRIE.XML, SCHEMA-BINARYFIELD.XML, BAD-SCHEMA-OMIT-TF-BUT-NOT-POS.XML, SCHEMA-MINIMAL.XML, STOPTYPES-2.TXT, STEMDICT.TXT, SCHEMA_CODEC.XML, ELEVATE.XML, SCHEMA-COLLATE.XML, PROTWORDS.TXT, SOLRCONFIG-REQHANDLER.INCL, SCHEMA-PHRASESUGGEST.XML, SCHEMA-DFR.XML, BAD-SCHEMA-ANALYZER-CLASS-AND-NESTED.XML, SOLRCONFIG-MASTER1.XML, SOLRCONFIG-FUNCTIONQUERY.XML, SOLRCONFIG-MASTER3.XML, SOLRCONFIG-UPDATE-PROCESSOR-CHAINS.XML, SOLRCONFIG-ALTDIRECTORY.XML, BAD-SCHEMA-SIM-GLOBAL-VS-FT-MISMATCH.XML, SOLRCONFIG-QUERYSENDER-NOQUERY.XML, BAD-SOLRCONFIG-BOGUS-SCRIPTENGINE-NAME.XML]
[junit4:junit4]   2> 54442 T1718 oass.SolrIndexSearcher.<init> Opening Searcher@46b2ed81 main
[junit4:junit4]   2> 54443 T1718 oass.SolrIndexSearcher.getIndexDir WARNING WARNING: Directory impl does not support setting indexDir: org.apache.lucene.store.MockDirectoryWrapper
[junit4:junit4]   2> 54443 T1718 oasu.CommitTracker.<init> Hard AutoCommit: disabled
[junit4:junit4]   2> 54444 T1718 oasu.CommitTracker.<init> Soft AutoCommit: disabled
[junit4:junit4]   2> 54444 T1718 oashc.SpellCheckComponent.inform Initializing spell checkers
[junit4:junit4]   2> 54537 T1718 oass.DirectSolrSpellChecker.init init: {name=direct,classname=DirectSolrSpellChecker,field=lowerfilt,minQueryLength=3}
[junit4:junit4]   2> 54552 T1718 oashc.HttpShardHandlerFactory.getParameter Setting socketTimeout to: 0
[junit4:junit4]   2> 54552 T1718 oashc.HttpShardHandlerFactory.getParameter Setting urlScheme to: http://
[junit4:junit4]   2> 54553 T1718 oashc.HttpShardHandlerFactory.getParameter Setting connTimeout to: 0
[junit4:junit4]   2> 54553 T1718 oashc.HttpShardHandlerFactory.getParameter Setting maxConnectionsPerHost to: 20
[junit4:junit4]   2> 54553 T1718 oashc.HttpShardHandlerFactory.getParameter Setting corePoolSize to: 0
[junit4:junit4]   2> 54554 T1718 oashc.HttpShardHandlerFactory.getParameter Setting maximumPoolSize to: 2147483647
[junit4:junit4]   2> 54554 T1718 oashc.HttpShardHandlerFactory.getParameter Setting maxThreadIdleTime to: 5
[junit4:junit4]   2> 54555 T1718 oashc.HttpShardHandlerFactory.getParameter Setting sizeOfQueue to: -1
[junit4:junit4]   2> 54555 T1718 oashc.HttpShardHandlerFactory.getParameter Setting fairnessPolicy to: false
[junit4:junit4]   2> 54555 T1718 oascsi.HttpClientUtil.createClient Creating new http client, config:maxConnectionsPerHost=20&maxConnections=10000&socketTimeout=0&connTimeout=0&retry=false
[junit4:junit4]   2> 54560 T1720 oasc.SolrCore.registerSearcher [collection1] Registered new searcher Searcher@46b2ed81 main{StandardDirectoryReader(segments_1:1)}
[junit4:junit4]   2> 54561 T1718 oasc.CoreContainer.register registering core: collection1
[junit4:junit4]   2> 54562 T1718 oasu.AbstractSolrTestCase.setUp ####SETUP_END testFieldStatisticsResultsStringFieldAlwaysMissing
[junit4:junit4]   2> ASYNC  NEW_CORE C139 name=collection1 org.apache.solr.core.SolrCore@311baf41
[junit4:junit4]   2> 54565 T1718 C139 oasc.SolrDeletionPolicy.onInit SolrDeletionPolicy.onInit: commits:num=1
[junit4:junit4]   2> 		commit{dir=MockDirWrapper(org.apache.lucene.store.RAMDirectory@ca0f9221 lockFactory=org.apache.lucene.store.NativeFSLockFactory@8304259),segFN=segments_1,generation=1,filenames=[segments_1]
[junit4:junit4]   2> 54565 T1718 C139 oasc.SolrDeletionPolicy.updateCommits newest commit = 1
[junit4:junit4]   2> 54566 T1718 C139 UPDATE [collection1] webapp=null path=null params={} {add=[1]} 0 2
[junit4:junit4]   2> 54571 T1718 C139 UPDATE [collection1] webapp=null path=null params={} {add=[2]} 0 0
[junit4:junit4]   2> 54574 T1718 C139 UPDATE [collection1] webapp=null path=null params={} {add=[3]} 0 0
[junit4:junit4]   2> 54577 T1718 C139 UPDATE [collection1] webapp=null path=null params={} {add=[4]} 0 1
[junit4:junit4]   2> 54579 T1718 C139 oasu.DirectUpdateHandler2.commit start commit{flags=0,_version_=0,optimize=false,openSearcher=true,waitSearcher=true,expungeDeletes=false,softCommit=false}
[junit4:junit4]   2> 54580 T1718 C139 oasc.SolrDeletionPolicy.onCommit SolrDeletionPolicy.onCommit: commits:num=2
[junit4:junit4]   2> 		commit{dir=MockDirWrapper(org.apache.lucene.store.RAMDirectory@ca0f9221 lockFactory=org.apache.lucene.store.NativeFSLockFactory@8304259),segFN=segments_1,generation=1,filenames=[segments_1]
[junit4:junit4]   2> 		commit{dir=MockDirWrapper(org.apache.lucene.store.RAMDirectory@ca0f9221 lockFactory=org.apache.lucene.store.NativeFSLockFactory@8304259),segFN=segments_2,generation=2,filenames=[_0_MockVariableIntBlock_0.tib, _0.si, segments_2, _0_MockVariableIntBlock_0.pyl, _0.fnm, _0.fdt, _0_MockVariableIntBlock_0.pos, _0_MockVariableIntBlock_0.tii, _0_MockVariableIntBlock_0.frq, _0.fdx, _0_MockVariableIntBlock_0.doc, _0_MockVariableIntBlock_0.skp]
[junit4:junit4]   2> 54581 T1718 C139 oasc.SolrDeletionPolicy.updateCommits newest commit = 2
[junit4:junit4]   2> 54582 T1718 C139 oass.SolrIndexSearcher.<init> Opening Searcher@acbc23a7 main
[junit4:junit4]   2> 54582 T1718 C139 oass.SolrIndexSearcher.getIndexDir WARNING WARNING: Directory impl does not support setting indexDir: org.apache.lucene.store.MockDirectoryWrapper
[junit4:junit4]   2> 54583 T1718 C139 oasu.DirectUpdateHandler2.commit end_commit_flush
[junit4:junit4]   2> 54584 T1720 oasc.SolrCore.registerSearcher [collection1] Registered new searcher Searcher@acbc23a7 main{StandardDirectoryReader(segments_2:3 _0(5.0):C4)}
[junit4:junit4]   2> 54584 T1718 C139 UPDATE [collection1] webapp=null path=null params={} {commit=} 0 5
[junit4:junit4]   2> 54586 T1718 C139 REQ [collection1] webapp=null path=null params={q=*:*&stats.field=active_s&indent=true&stats=true} hits=4 status=0 QTime=1 
[junit4:junit4]   2> 54587 T1718 oasu.AbstractSolrTestCase.tearDown ####TEARDOWN_START testFieldStatisticsResultsStringFieldAlwaysMissing
[junit4:junit4]   2> 54587 T1718 oasc.CoreContainer.shutdown Shutting down CoreContainer instance=-131829588
[junit4:junit4]   2> 54588 T1718 oasc.SolrCore.close [collection1]  CLOSING SolrCore org.apache.solr.core.SolrCore@311baf41
[junit4:junit4]   2> 54593 T1718 oasc.SolrCore.closeSearcher [collection1] Closing main searcher on request.
[junit4:junit4]   2> 54593 T1718 oasu.DirectUpdateHandler2.close closing DirectUpdateHandler2{commits=1,autocommits=0,soft autocommits=0,optimizes=0,rollbacks=0,expungeDeletes=0,docsPending=0,adds=0,deletesById=0,deletesByQuery=0,errors=0,cumulative_adds=4,cumulative_deletesById=0,cumulative_deletesByQuery=0,cumulative_errors=0}
[junit4:junit4]   2> 54593 T1718 oasu.DefaultSolrCoreState.decref SolrCoreState ref count has reached 0 - closing IndexWriter
[junit4:junit4]   2> 54595 T1718 oasu.DefaultSolrCoreState.decref Closing SolrCoreState - canceling any ongoing recovery
[junit4:junit4]   2> 54601 T1718 oasu.AbstractSolrTestCase.setUp ####SETUP_START testStats
[junit4:junit4]   2> 54602 T1718 oasc.SolrResourceLoader.<init> new SolrResourceLoader for directory: '/mnt/ssd/jenkins/workspace/Lucene-Solr-trunk-Linux/solr/build/solr-core/test-files/solr/collection1/'
[junit4:junit4]   2> 54602 T1718 oasc.SolrResourceLoader.replaceClassLoader Adding 'file:/mnt/ssd/jenkins/workspace/Lucene-Solr-trunk-Linux/solr/build/solr-core/test-files/solr/collection1/lib/README' to classloader
[junit4:junit4]   2> 54603 T1718 oasc.SolrResourceLoader.replaceClassLoader Adding 'file:/mnt/ssd/jenkins/workspace/Lucene-Solr-trunk-Linux/solr/build/solr-core/test-files/solr/collection1/lib/classes/' to classloader
[junit4:junit4]   2> 54623 T1718 oasc.SolrConfig.<init> Using Lucene MatchVersion: LUCENE_50
[junit4:junit4]   2> 54659 T1718 oasc.SolrConfig.<init> Loaded SolrConfig: solrconfig.xml
[junit4:junit4]   2> 54660 T1718 oass.IndexSchema.readSchema Reading Solr Schema
[junit4:junit4]   2> 54663 T1718 oass.IndexSchema.readSchema Schema name=example
[junit4:junit4]   2> 54766 T1718 oass.IndexSchema.readSchema default search field in schema is text
[junit4:junit4]   2> 54768 T1718 oass.IndexSchema.readSchema unique key field: id
[junit4:junit4]   2> 54770 T1718 oasc.SolrResourceLoader.locateSolrHome JNDI not configured for solr (NoInitialContextEx)
[junit4:junit4]   2> 54771 T1718 oasc.SolrResourceLoader.locateSolrHome using system property solr.solr.home: /mnt/ssd/jenkins/workspace/Lucene-Solr-trunk-Linux/solr/build/solr-core/test-files/solr
[junit4:junit4]   2> 54771 T1718 oasc.SolrResourceLoader.<init> new SolrResourceLoader for directory: '/mnt/ssd/jenkins/workspace/Lucene-Solr-trunk-Linux/solr/build/solr-core/test-files/solr/'
[junit4:junit4]   2> 54775 T1718 oasc.CoreContainer.<init> New CoreContainer 1301823638
[junit4:junit4]   2> 54776 T1718 oasc.SolrCore.<init> [collection1] Opening new SolrCore at /mnt/ssd/jenkins/workspace/Lucene-Solr-trunk-Linux/solr/build/solr-core/test-files/solr/collection1/, dataDir=/mnt/ssd/jenkins/workspace/Lucene-Solr-trunk-Linux/solr/build/solr-core/test/J0/./org.apache.solr.handler.component.StatsComponentTest-1347329058798/
[junit4:junit4]   2> 54776 T1718 oasc.JmxMonitoredMap.<init> JMX monitoring is enabled. Adding Solr mbeans to JMX Server: com.sun.jmx.mbeanserver.JmxMBeanServer@cc6d7070
[junit4:junit4]   2> 54777 T1718 oasc.SolrCore.getNewIndexDir WARNING New index directory detected: old=null new=/mnt/ssd/jenkins/workspace/Lucene-Solr-trunk-Linux/solr/build/solr-core/test/J0/./org.apache.solr.handler.component.StatsComponentTest-1347329058798/index/
[junit4:junit4]   2> 54777 T1718 oasc.SolrCore.initIndex WARNING [collection1] Solr index directory '/mnt/ssd/jenkins/workspace/Lucene-Solr-trunk-Linux/solr/build/solr-core/test/J0/./org.apache.solr.handler.component.StatsComponentTest-1347329058798/index' doesn't exist. Creating new index...
[junit4:junit4]   2> 54778 T1718 oasc.CachingDirectoryFactory.get return new directory for /mnt/ssd/jenkins/workspace/Lucene-Solr-trunk-Linux/solr/build/solr-core/test/J0/./org.apache.solr.handler.component.StatsComponentTest-1347329058798/index forceNew:false
[junit4:junit4]   2> 54779 T1718 oasc.SolrDeletionPolicy.onCommit SolrDeletionPolicy.onCommit: commits:num=1
[junit4:junit4]   2> 		commit{dir=MockDirWrapper(org.apache.lucene.store.RAMDirectory@b14287c3 lockFactory=org.apache.lucene.store.NativeFSLockFactory@7d08a298),segFN=segments_1,generation=1,filenames=[segments_1]
[junit4:junit4]   2> 54779 T1718 oasc.SolrDeletionPolicy.updateCommits newest commit = 1
[junit4:junit4]   2> 54779 T1718 oasc.SolrCore.initWriters created xml: solr.XMLResponseWriter
[junit4:junit4]   2> 54781 T1718 oasup.UpdateRequestProcessorChain.init inserting DistributedUpdateProcessorFactory into updateRequestProcessorChain "dedupe"
[junit4:junit4]   2> 54781 T1718 oasup.UpdateRequestProcessorChain.init inserting DistributedUpdateProcessorFactory into updateRequestProcessorChain "dedupe-allfields"
[junit4:junit4]   2> 54781 T1718 oasup.UpdateRequestProcessorChain.init inserting DistributedUpdateProcessorFactory into updateRequestProcessorChain "stored_sig"
[junit4:junit4]   2> 54782 T1718 oasup.UpdateRequestProcessorChain.init inserting DistributedUpdateProcessorFactory into updateRequestProcessorChain "uniq-fields"
[junit4:junit4]   2> 54782 T1718 oasup.UpdateRequestProcessorChain.init inserting DistributedUpdateProcessorFactory into updateRequestProcessorChain "distrib-dup-test-chain-implicit"
[junit4:junit4]   2> 54783 T1718 oasc.RequestHandlers.initHandlersFromConfig adding lazy requestHandler: solr.ReplicationHandler
[junit4:junit4]   2> 54783 T1718 oasc.RequestHandlers.initHandlersFromConfig created /replication: solr.ReplicationHandler
[junit4:junit4]   2> 54783 T1718 oasc.RequestHandlers.initHandlersFromConfig created standard: solr.StandardRequestHandler
[junit4:junit4]   2> 54784 T1718 oasc.RequestHandlers.initHandlersFromConfig created /get: solr.RealTimeGetHandler
[junit4:junit4]   2> 54784 T1718 oasc.RequestHandlers.initHandlersFromConfig created dismax: solr.SearchHandler
[junit4:junit4]   2> 54785 T1718 oasc.RequestHandlers.initHandlersFromConfig created mock: org.apache.solr.core.MockQuerySenderListenerReqHandler
[junit4:junit4]   2> 54785 T1718 oasc.RequestHandlers.initHandlersFromConfig created /admin/: org.apache.solr.handler.admin.AdminHandlers
[junit4:junit4]   2> 54785 T1718 oasc.RequestHandlers.initHandlersFromConfig created defaults: solr.StandardRequestHandler
[junit4:junit4]   2> 54786 T1718 oasc.RequestHandlers.initHandlersFromConfig adding lazy requestHandler: solr.StandardRequestHandler
[junit4:junit4]   2> 54786 T1718 oasc.RequestHandlers.initHandlersFromConfig created lazy: solr.StandardRequestHandler
[junit4:junit4]   2> 54786 T1718 oasc.RequestHandlers.initHandlersFromConfig created /update: solr.UpdateRequestHandler
[junit4:junit4]   2> 54787 T1718 oasc.RequestHandlers.initHandlersFromConfig created /terms: org.apache.solr.handler.component.SearchHandler
[junit4:junit4]   2> 54787 T1718 oasc.RequestHandlers.initHandlersFromConfig created spellCheckCompRH: org.apache.solr.handler.component.SearchHandler
[junit4:junit4]   2> 54788 T1718 oasc.RequestHandlers.initHandlersFromConfig created spellCheckCompRH_Direct: org.apache.solr.handler.component.SearchHandler
[junit4:junit4]   2> 54788 T1718 oasc.RequestHandlers.initHandlersFromConfig created spellCheckWithWordbreak: org.apache.solr.handler.component.SearchHandler
[junit4:junit4]   2> 54788 T1718 oasc.RequestHandlers.initHandlersFromConfig created spellCheckWithWordbreak_Direct: org.apache.solr.handler.component.SearchHandler
[junit4:junit4]   2> 54789 T1718 oasc.RequestHandlers.initHandlersFromConfig created spellCheckCompRH1: org.apache.solr.handler.component.SearchHandler
[junit4:junit4]   2> 54789 T1718 oasc.RequestHandlers.initHandlersFromConfig created tvrh: org.apache.solr.handler.component.SearchHandler
[junit4:junit4]   2> 54790 T1718 oasc.RequestHandlers.initHandlersFromConfig created /mlt: solr.MoreLikeThisHandler
[junit4:junit4]   2> 54790 T1718 oasc.RequestHandlers.initHandlersFromConfig created /debug/dump: solr.DumpRequestHandler
[junit4:junit4]   2> 54791 T1718 oashl.XMLLoader.init xsltCacheLifetimeSeconds=60
[junit4:junit4]   2> 54792 T1718 oasc.SolrCore.initDeprecatedSupport WARNING solrconfig.xml uses deprecated <admin/gettableFiles>, Please update your config to use the ShowFileRequestHandler.
[junit4:junit4]   2> 54793 T1718 oasc.SolrCore.initDeprecatedSupport WARNING adding ShowFileRequestHandler with hidden files: [BAD-SCHEMA-NOT-INDEXED-BUT-TF.XML, SCHEMA-REQUIRED-FIELDS.XML, SOLRCONFIG-MASTER1-KEEPONEBACKUP.XML, BAD-SCHEMA-NONTEXT-ANALYZER.XML, SOLRCONFIG-PROPINJECT.XML, SOLRCONFIG-PROPINJECT-INDEXDEFAULT.XML, STOP-2.TXT, SCHEMA11.XML, BAD-SCHEMA-UNIQUEKEY-USES-DEFAULT.XML, SCHEMA15.XML, SOLRCONFIG-NATIVELOCK.XML, SCHEMA-SIM.XML, CONDITIONAL.UPDATEPROCESSOR.JS, BAD-SOLRCONFIG-MISSING-SCRIPTFILE.XML, SOLRCONFIG-SCRIPT-UPDATEPROCESSOR.XML, SOLRCONFIG-REPEATER.XML, SOLRCONFIG-SPELLCHECKER.XML, SOLRCONFIG-NOCACHE.XML, SCHEMA-CHARFILTERS.XML, SOLRCONFIG-SOLCOREPROPERTIES.XML, SOLRCONFIG_CODEC.XML, BAD-SCHEMA-EXTERNAL-FILEFIELD.XML, HYPHENATION.DTD, SCHEMA.XML, SOLRCONFIG-MERGEPOLICY.XML, TRIVIAL.UPDATEPROCESSOR1.JS, SOLRCONFIG-PHRASESUGGEST.XML, SOLRCONFIG-SLAVE1.XML, SOLRCONFIG-BASIC.XML, SCHEMA-LMJELINEKMERCER.XML, BAD-MP-SOLRCONFIG.XML, BAD-SCHEMA-DUP-FIELD.XML, BAD-SCHEMA-UNIQUEKEY-MULTIVALUED.XML, SOLRCONFIG-MASTER.XML, SOLRCONFIG-HIGHLIGHT.XML, SCHEMA-TFIDF.XML, SCHEMA-REPLICATION1.XML, SYNONYMS.TXT, SOLRCONFIG-ELEVATE.XML, STOPWITHBOM.TXT, SOLRCONFIG-QUERYSENDER.XML, WDFTYPES.TXT, SOLRCONFIG-DELPOLICY1.XML, BAD_SOLRCONFIG.XML, HUNSPELL-TEST.DIC, SCHEMA-NUMERIC.XML, SCHEMA-LUCENEMATCHVERSION.XML, KEEP-2.TXT, SCHEMA-STOP-KEEP.XML, SCHEMA-IB.XML, STOP-SNOWBALL.TXT, SOLRCONFIG-SLAVE.XML, BAD-SCHEMA-NOT-INDEXED-BUT-NORMS.XML, STOPWORDSWRONGENCODING.TXT, THROW.ERROR.ON.ADD.UPDATEPROCESSOR.JS, SOLRCONFIG-SPELLCHECKCOMPONENT.XML, STOPTYPES-1.TXT, SOLRCONFIG-TLOG.XML, COMPOUNDDICTIONARY.TXT, DA_COMPOUNDDICTIONARY.TXT, SOLRCONFIG-TERMINDEX.XML, BAD-SOLRCONFIG-INVALID-SCRIPTFILE.XML, SCHEMASURROUND.XML, OPEN-EXCHANGE-RATES.JSON, BAD-SCHEMA-DUP-FIELDTYPE.XML, PHRASESUGGEST.TXT, SOLRCONFIG-MASTER2.XML, OLD_SYNONYMS.TXT, BAD-SCHEMA-UNIQUEKEY-IS-COPYFIELD-DEST.XML, SCHEMA-NOT-REQUIRED-UNIQUE-KEY.XML, BAD-SCHEMA-CODEC-GLOBAL-VS-FT-MISMATCH.XML, SCHEMA-LMDIRICHLET.XML, SCHEMA-REVERSED.XML, BAD-SCHEMA-NOT-INDEXED-BUT-POS.XML, SCHEMA-FOLDING.XML, SOLRCONFIG-CACHING.XML, MAPPING-ISOLATIN1ACCENT.TXT, ADDFIELDS.UPDATEPROCESSOR.JS, SCHEMA-BM25.XML, STOP-1.TXT, SOLRCONFIG-ENABLEPLUGIN.XML, MISSING.FUNCTIONS.UPDATEPROCESSOR.JS, SCHEMA12.XML, SOLRCONFIG-TRANSFORMERS.XML, SCHEMA-COPYFIELD-TEST.XML, BAD-SCHEMA-DUP-DYNAMICFIELD.XML, CURRENCY.XML, DA_UTF8.XML, MISSLEADING.EXTENSION.UPDATEPROCESSOR.JS.TXT, SOLRCONFIG-SOLR-749.XML, STOPWORDS.TXT, HUNSPELL-TEST.AFF, SOLRCONFIG_PERF.XML, SOLRCONFIG-SIMPLELOCK.XML, FRENCHARTICLES.TXT, SOLRCONFIG-LAZYWRITER.XML, SCHEMA-REPLICATION2.XML, SOLRCONFIG-XINCLUDE.XML, SCHEMA-SPELLCHECKER.XML, XSLT, SOLRCONFIG-DELPOLICY2.XML, TRIVIAL.UPDATEPROCESSOR0.JS, KEEP-1.TXT, SCHEMA-TRIE.XML, SCHEMA-BINARYFIELD.XML, BAD-SCHEMA-OMIT-TF-BUT-NOT-POS.XML, SCHEMA-MINIMAL.XML, STOPTYPES-2.TXT, STEMDICT.TXT, SCHEMA_CODEC.XML, ELEVATE.XML, SCHEMA-COLLATE.XML, PROTWORDS.TXT, SOLRCONFIG-REQHANDLER.INCL, SCHEMA-PHRASESUGGEST.XML, SCHEMA-DFR.XML, BAD-SCHEMA-ANALYZER-CLASS-AND-NESTED.XML, SOLRCONFIG-MASTER1.XML, SOLRCONFIG-FUNCTIONQUERY.XML, SOLRCONFIG-MASTER3.XML, SOLRCONFIG-UPDATE-PROCESSOR-CHAINS.XML, SOLRCONFIG-ALTDIRECTORY.XML, BAD-SCHEMA-SIM-GLOBAL-VS-FT-MISMATCH.XML, SOLRCONFIG-QUERYSENDER-NOQUERY.XML, BAD-SOLRCONFIG-BOGUS-SCRIPTENGINE-NAME.XML]
[junit4:junit4]   2> 54795 T1718 oass.SolrIndexSearcher.<init> Opening Searcher@1c7991dc main
[junit4:junit4]   2> 54795 T1718 oass.SolrIndexSearcher.getIndexDir WARNING WARNING: Directory impl does not support setting indexDir: org.apache.lucene.store.MockDirectoryWrapper
[junit4:junit4]   2> 54795 T1718 oasu.CommitTracker.<init> Hard AutoCommit: disabled
[junit4:junit4]   2> 54796 T1718 oasu.CommitTracker.<init> Soft AutoCommit: disabled
[junit4:junit4]   2> 54796 T1718 oashc.SpellCheckComponent.inform Initializing spell checkers
[junit4:junit4]   2> 54877 T1718 oass.DirectSolrSpellChecker.init init: {name=direct,classname=DirectSolrSpellChecker,field=lowerfilt,minQueryLength=3}
[junit4:junit4]   2> 54892 T1718 oashc.HttpShardHandlerFactory.getParameter Setting socketTimeout to: 0
[junit4:junit4]   2> 54892 T1718 oashc.HttpShardHandlerFactory.getParameter Setting urlScheme to: http://
[junit4:junit4]   2> 54892 T1718 oashc.HttpShardHandlerFactory.getParameter Setting connTimeout to: 0
[junit4:junit4]   2> 54893 T1718 oashc.HttpShardHandlerFactory.getParameter Setting maxConnectionsPerHost to: 20
[junit4:junit4]   2> 54893 T1718 oashc.HttpShardHandlerFactory.getParameter Setting corePoolSize to: 0
[junit4:junit4]   2> 54893 T1718 oashc.HttpShardHandlerFactory.getParameter Setting maximumPoolSize to: 2147483647
[junit4:junit4]   2> 54894 T1718 oashc.HttpShardHandlerFactory.getParameter Setting maxThreadIdleTime to: 5
[junit4:junit4]   2> 54894 T1718 oashc.HttpShardHandlerFactory.getParameter Setting sizeOfQueue to: -1
[junit4:junit4]   2> 54895 T1718 oashc.HttpShardHandlerFactory.getParameter Setting fairnessPolicy to: false
[junit4:junit4]   2> 54895 T1718 oascsi.HttpClientUtil.createClient Creating new http client, config:maxConnectionsPerHost=20&maxConnections=10000&socketTimeout=0&connTimeout=0&retry=false
[junit4:junit4]   2> 54900 T1721 oasc.SolrCore.registerSearcher [collection1] Registered new searcher Searcher@1c7991dc main{StandardDirectoryReader(segments_1:1)}
[junit4:junit4]   2> 54901 T1718 oasc.CoreContainer.register registering core: collection1
[junit4:junit4]   2> 54902 T1718 oasu.AbstractSolrTestCase.setUp ####SETUP_END testStats
[junit4:junit4]   2> ASYNC  NEW_CORE C140 name=collection1 org.apache.solr.core.SolrCore@dc71b3eb
[junit4:junit4]   2> 54905 T1718 C140 oasc.SolrDeletionPolicy.onInit SolrDeletionPolicy.onInit: commits:num=1
[junit4:junit4]   2> 		commit{dir=MockDirWrapper(org.apache.lucene.store.RAMDirectory@b14287c3 lockFactory=org.apache.lucene.store.NativeFSLockFactory@7d08a298),segFN=segments_1,generation=1,filenames=[segments_1]
[junit4:junit4]   2> 54906 T1718 C140 oasc.SolrDeletionPolicy.updateCommits newest commit = 1
[junit4:junit4]   2> 54906 T1718 C140 UPDATE [collection1] webapp=null path=null params={} {add=[1]} 0 1
[junit4:junit4]   2> 54911 T1718 C140 UPDATE [collection1] webapp=null path=null params={} {add=[2]} 0 0
[junit4:junit4]   2> 54914 T1718 C140 UPDATE [collection1] webapp=null path=null params={} {add=[3]} 0 0
[junit4:junit4]   2> 54917 T1718 C140 UPDATE [collection1] webapp=null path=null params={} {add=[4]} 0 0
[junit4:junit4]   2> 54920 T1718 C140 oasu.DirectUpdateHandler2.commit start commit{flags=0,_version_=0,optimize=false,openSearcher=true,waitSearcher=true,expungeDeletes=false,softCommit=false}
[junit4:junit4]   2> 54921 T1718 C140 oasc.SolrDeletionPolicy.onCommit SolrDeletionPolicy.onCommit: commits:num=2
[junit4:junit4]   2> 		commit{dir=MockDirWrapper(org.apache.lucene.store.RAMDirectory@b14287c3 lockFactory=org.apache.lucene.store.NativeFSLockFactory@7d08a298),segFN=segments_1,generation=1,filenames=[segments_1]
[junit4:junit4]   2> 		commit{dir=MockDirWrapper(org.apache.lucene.store.RAMDirectory@b14287c3 lockFactory=org.apache.lucene.store.NativeFSLockFactory@7d08a298),segFN=segments_2,generation=2,filenames=[_0_MockVariableIntBlock_0.tib, _0_Pulsing40_0.tip, _0.fnm, _0_MockVariableIntBlock_0.pos, _0_MockVariableIntBlock_0.tii, _0_Pulsing40_0.frq, _0_MockVariableIntBlock_0.doc, _0_MockVariableIntBlock_0.skp, segments_2, _0.si, _0_MockVariableIntBlock_0.pyl, _0.fdt, _0_MockVariableIntBlock_0.frq, _0_Pulsing40_0.prx, _0.fdx, _0_Pulsing40_0.tim]
[junit4:junit4]   2> 54922 T1718 C140 oasc.SolrDeletionPolicy.updateCommits newest commit = 2
[junit4:junit4]   2> 54923 T1718 C140 oass.SolrIndexSearcher.<init> Opening Searcher@8a353b1 main
[junit4:junit4]   2> 54923 T1718 C140 oass.SolrIndexSearcher.getIndexDir WARNING WARNING: Directory impl does not support setting indexDir: org.apache.lucene.store.MockDirectoryWrapper
[junit4:junit4]   2> 54924 T1718 C140 oasu.DirectUpdateHandler2.commit end_commit_flush
[junit4:junit4]   2> 54925 T1721 oasc.SolrCore.registerSearcher [collection1] Registered new searcher Searcher@8a353b1 main{StandardDirectoryReader(segments_2:3 _0(5.0):C4)}
[junit4:junit4]   2> 54925 T1718 C140 UPDATE [collection1] webapp=null path=null params={} {commit=} 0 5
[junit4:junit4]   2> 54927 T1718 C140 REQ [collection1] webapp=null path=null params={q=*:*&stats.field=stats_i&stats=true} hits=4 status=0 QTime=1 
[junit4:junit4]   2> 54933 T1718 C140 UPDATE [collection1] webapp=null path=null params={} {add=[1]} 0 0
[junit4:junit4]   2> 54936 T1718 C140 UPDATE [collection1] webapp=null path=null params={} {add=[2]} 0 0
[junit4:junit4]   2> 54939 T1718 C140 UPDATE [collection1] webapp=null path=null params={} {add=[3]} 0 0
[junit4:junit4]   2> 54943 T1718 C140 UPDATE [collection1] webapp=null path=null params={} {add=[4]} 0 1
[junit4:junit4]   2> 54946 T1718 C140 oasu.DirectUpdateHandler2.commit start commit{flags=0,_version_=0,optimize=false,openSearcher=true,waitSearcher=true,expungeDeletes=false,softCommit=false}
[junit4:junit4]   2> 54947 T1718 C140 oasc.SolrDeletionPolicy.onCommit SolrDeletionPolicy.onCommit: commits:num=2
[junit4:junit4]   2> 		commit{dir=MockDirWrapper(org.apache.lucene.store.RAMDirectory@b14287c3 lockFactory=org.apache.lucene.store.NativeFSLockFactory@7d08a298),segFN=segments_2,generation=2,filenames=[_0_MockVariableIntBlock_0.tib, _0_Pulsing40_0.tip, _0.fnm, _0_MockVariableIntBlock_0.pos, _0_MockVariableIntBlock_0.tii, _0_Pulsing40_0.frq, _0_MockVariableIntBlock_0.doc, _0_MockVariableIntBlock_0.skp, segments_2, _0.si, _0_MockVariableIntBlock_0.pyl, _0.fdt, _0_MockVariableIntBlock_0.frq, _0_Pulsing40_0.prx, _0.fdx, _0_Pulsing40_0.tim]
[junit4:junit4]   2> 		commit{dir=MockDirWrapper(org.apache.lucene.store.RAMDirectory@b14287c3 lockFactory=org.apache.lucene.store.NativeFSLockFactory@7d08a298),segFN=segments_3,generation=3,filenames=[_1_Pulsing40_0.tim, _1_MockVariableIntBlock_0.tib, _1_Pulsing40_0.tip, _1_MockVariableIntBlock_0.pos, _1_MockVariableIntBlock_0.tii, _1.fnm, _1_MockVariableIntBlock_0.doc, _1_MockVariableIntBlock_0.skp, _1_Pulsing40_0.frq, _1.si, segments_3, _1_MockVariableIntBlock_0.pyl, _1_MockVariableIntBlock_0.frq, _1.fdt, _1_Pulsing40_0.prx, _1.fdx]
[junit4:junit4]   2> 54948 T1718 C140 oasc.SolrDeletionPolicy.updateCommits newest commit = 3
[junit4:junit4]   2> 54949 T1718 C140 oass.SolrIndexSearcher.<init> Opening Searcher@96c6717d main
[junit4:junit4]   2> 54949 T1718 C140 oass.SolrIndexSearcher.getIndexDir WARNING WARNING: Directory impl does not support setting indexDir: org.apache.lucene.store.MockDirectoryWrapper
[junit4:junit4]   2> 54950 T1718 C140 oasu.DirectUpdateHandler2.commit end_commit_flush
[junit4:junit4]   2> 54951 T1721 oasc.SolrCore.registerSearcher [collection1] Registered new searcher Searcher@96c6717d main{StandardDirectoryReader(segments_3:7 _1(5.0):C4)}
[junit4:junit4]   2> 54951 T1718 C140 UPDATE [collection1] webapp=null path=null params={} {commit=} 0 5
[junit4:junit4]   2> 54952 T1718 C140 REQ [collection1] webapp=null path=null params={q=*:*&stats.field=stats_i&stats=true} hits=4 status=0 QTime=0 
[junit4:junit4]   2> 54959 T1718 C140 UPDATE [collection1] webapp=null path=null params={} {add=[1]} 0 0
[junit4:junit4]   2> 54962 T1718 C140 UPDATE [collection1] webapp=null path=null params={} {add=[2]} 0 0
[junit4:junit4]   2> 54966 T1718 C140 UPDATE [collection1] webapp=null path=null params={} {add=[3]} 0 1
[junit4:junit4]   2> 54969 T1718 C140 UPDATE [collection1] webapp=null path=null params={} {add=[4]} 0 0
[junit4:junit4]   2> 54972 T1718 C140 oasu.DirectUpdateHandler2.commit start commit{flags=0,_version_=0,optimize=false,openSearcher=true,waitSearcher=true,expungeDeletes=false,softCommit=false}
[junit4:junit4]   2> 54974 T1718 C140 oasc.SolrDeletionPolicy.onCommit SolrDeletionPolicy.onCommit: commits:num=2
[junit4:junit4]   2> 		commit{dir=MockDirWrapper(org.apache.lucene.store.RAMDirectory@b14287c3 lockFactory=org.apache.lucene.store.NativeFSLockFactory@7d08a298),segFN=segments_3,generation=3,filenames=[_1_Pulsing40_0.tim, _1_MockVariableIntBlock_0.tib, _1_Pulsing40_0.tip, _1_MockVariableIntBlock_0.pos, _1_MockVariableIntBlock_0.tii, _1.fnm, _1_MockVariableIntBlock_0.doc, _1_MockVariableIntBlock_0.skp, _1_Pulsing40_0.frq, _1.si, segments_3, _1_MockVariableIntBlock_0.pyl, _1_MockVariableIntBlock_0.frq, _1.fdt, _1_Pulsing40_0.prx, _1.fdx]
[junit4:junit4]   2> 		commit{dir=MockDirWrapper(org.apache.lucene.store.RAMDirectory@b14287c3 lockFactory=org.apache.lucene.store.NativeFSLockFactory@7d08a298),segFN=segments_4,generation=4,filenames=[_2_Pulsing40_0.tim, _2_MockRandom_0.frq, _2_Pulsing40_0.tip, _2_MockFixedIntBlock_0.frq, _2_MockVariableIntBlock_0.doc, _2_Pulsing40_0.frq, _2_MockRandom_0.prx, segments_4, _2_MockVariableIntBlock_0.pyl, _2_MockFixedIntBlock_0.doc, _2_Pulsing40_0.prx, _2_MockVariableIntBlock_0.tib, _2_MockFixedIntBlock_0.pyl, _2_MockVariableIntBlock_0.tii, _2_MockVariableIntBlock_0.pos, _2.fnm, _2_MockVariableIntBlock_0.skp, _2_MockFixedIntBlock_0.tib, _2.si, _2_MockFixedIntBlock_0.pos, _2_MockFixedIntBlock_0.tii, _2_MockRandom_0.tim, _2_MockRandom_0.sd, _2_MockRandom_0.tip, _2_MockFixedIntBlock_0.skp, _2_MockVariableIntBlock_0.frq, _2.fdt, _2.fdx]
[junit4:junit4]   2> 54975 T1718 C140 oasc.SolrDeletionPolicy.updateCommits newest commit = 4
[junit4:junit4]   2> 54976 T1718 C140 oass.SolrIndexSearcher.<init> Opening Searcher@54261e6d main
[junit4:junit4]   2> 54976 T1718 C140 oass.SolrIndexSearcher.getIndexDir WARNING WARNING: Directory impl does not support setting indexDir: org.apache.lucene.store.MockDirectoryWrapper
[junit4:junit4]   2> 54977 T1718 C140 oasu.DirectUpdateHandler2.commit end_commit_flush
[junit4:junit4]   2> 54978 T1721 oasc.SolrCore.registerSearcher [collection1] Registered new searcher Searcher@54261e6d main{StandardDirectoryReader(segments_4:11 _2(5.0):C4)}
[junit4:junit4]   2> 54978 T1718 C140 UPDATE [collection1] webapp=null path=null params={} {commit=} 0 6
[junit4:junit4]   2> 54981 T1718 C140 oasc.SolrException.log SEVERE java.lang.NullPointerException
[junit4:junit4]   2> 		at org.apache.solr.util.NumberUtils.SortableStr2int(NumberUtils.java:162)
[junit4:junit4]   2> 		at org.apache.solr.schema.SortableIntField.toObject(SortableIntField.java:98)
[junit4:junit4]   2> 		at org.apache.solr.schema.SortableIntField.toObject(SortableIntField.java:57)
[junit4:junit4]   2> 		at org.apache.solr.schema.FieldType.toObject(FieldType.java:344)
[junit4:junit4]   2> 		at org.apache.solr.handler.component.AbstractStatsValues.accumulate(StatsValuesFactory.java:129)
[junit4:junit4]   2> 		at org.apache.solr.handler.component.SimpleStats.getFieldCacheStats(StatsComponent.java:281)
[junit4:junit4]   2> 		at org.apache.solr.handler.component.SimpleStats.getStatsFields(StatsComponent.java:227)
[junit4:junit4]   2> 		at org.apache.solr.handler.component.SimpleStats.getStatsCounts(StatsComponent.java:201)
[junit4:junit4]   2> 		at org.apache.solr.handler.component.StatsComponent.process(StatsComponent.java:70)
[junit4:junit4]   2> 		at org.apache.solr.handler.component.SearchHandler.handleRequestBody(SearchHandler.java:206)
[junit4:junit4]   2> 		at org.apache.solr.handler.RequestHandlerBase.handleRequest(RequestHandlerBase.java:129)
[junit4:junit4]   2> 		at org.apache.solr.core.SolrCore.execute(SolrCore.java:1701)
[junit4:junit4]   2> 		at org.apache.solr.util.TestHarness.query(TestHarness.java:351)
[junit4:junit4]   2> 		at org.apache.solr.util.TestHarness.query(TestHarness.java:333)
[junit4:junit4]   2> 		at org.apache.solr.util.AbstractSolrTestCase.assertQ(AbstractSolrTestCase.java:273)
[junit4:junit4]   2> 		at org.apache.solr.handler.component.StatsComponentTest.doTestFacetStatisticsResult(StatsComponentTest.java:239)
[junit4:junit4]   2> 		at org.apache.solr.handler.component.StatsComponentTest.testStats(StatsComponentTest.java:68)
[junit4:junit4]   2> 		at sun.reflect.NativeMethodAccessorImpl.invoke0(Native Method)
[junit4:junit4]   2> 		at sun.reflect.NativeMethodAccessorImpl.invoke(NativeMethodAccessorImpl.java:88)
[junit4:junit4]   2> 		at sun.reflect.DelegatingMethodAccessorImpl.invoke(DelegatingMethodAccessorImpl.java:55)
[junit4:junit4]   2> 		at java.lang.reflect.Method.invoke(Method.java:613)
[junit4:junit4]   2> 		at com.carrotsearch.randomizedtesting.RandomizedRunner.invoke(RandomizedRunner.java:1559)
[junit4:junit4]   2> 		at com.carrotsearch.randomizedtesting.RandomizedRunner.access$600(RandomizedRunner.java:79)
[junit4:junit4]   2> 		at com.carrotsearch.randomizedtesting.RandomizedRunner$6.evaluate(RandomizedRunner.java:737)
[junit4:junit4]   2> 		at com.carrotsearch.randomizedtesting.RandomizedRunner$7.evaluate(RandomizedRunner.java:773)
[junit4:junit4]   2> 		at com.carrotsearch.randomizedtesting.RandomizedRunner$8.evaluate(RandomizedRunner.java:787)
[junit4:junit4]   2> 		at com.carrotsearch.randomizedtesting.rules.SystemPropertiesRestoreRule$1.evaluate(SystemPropertiesRestoreRule.java:53)
[junit4:junit4]   2> 		at org.apache.lucene.util.TestRuleSetupTeardownChained$1.evaluate(TestRuleSetupTeardownChained.java:50)
[junit4:junit4]   2> 		at org.apache.lucene.util.TestRuleFieldCacheSanity$1.evaluate(TestRuleFieldCacheSanity.java:51)
[junit4:junit4]   2> 		at org.apache.lucene.util.AbstractBeforeAfterRule$1.evaluate(AbstractBeforeAfterRule.java:45)
[junit4:junit4]   2> 		at com.carrotsearch.randomizedtesting.rules.SystemPropertiesInvariantRule$1.evaluate(SystemPropertiesInvariantRule.java:55)
[junit4:junit4]   2> 		at org.apache.lucene.util.TestRuleThreadAndTestName$1.evaluate(TestRuleThreadAndTestName.java:48)
[junit4:junit4]   2> 		at org.apache.lucene.util.TestRuleIgnoreAfterMaxFailures$1.evaluate(TestRuleIgnoreAfterMaxFailures.java:70)
[junit4:junit4]   2> 		at org.apache.lucene.util.TestRuleMarkFailure$1.evaluate(TestRuleMarkFailure.java:48)
[junit4:junit4]   2> 		at com.carrotsearch.randomizedtesting.rules.StatementAdapter.evaluate(StatementAdapter.java:36)
[junit4:junit4]   2> 		at com.carrotsearch.randomizedtesting.ThreadLeakControl$StatementRunner.run(ThreadLeakControl.java:358)
[junit4:junit4]   2> 		at com.carrotsearch.randomizedtesting.ThreadLeakControl.forkTimeoutingTask(ThreadLeakControl.java:782)
[junit4:junit4]   2> 		at com.carrotsearch.randomizedtesting.ThreadLeakControl$3.evaluate(ThreadLeakControl.java:442)
[junit4:junit4]   2> 		at com.carrotsearch.randomizedtesting.RandomizedRunner.runSingleTest(RandomizedRunner.java:746)
[junit4:junit4]   2> 		at com.carrotsearch.randomizedtesting.RandomizedRunner$3.evaluate(RandomizedRunner.java:648)
[junit4:junit4]   2> 		at com.carrotsearch.randomizedtesting.RandomizedRunner$4.evaluate(RandomizedRunner.java:682)
[junit4:junit4]   2> 		at com.carrotsearch.randomizedtesting.RandomizedRunner$5.evaluate(RandomizedRunner.java:693)
[junit4:junit4]   2> 		at com.carrotsearch.randomizedtesting.rules.StatementAdapter.evaluate(StatementAdapter.java:36)
[junit4:junit4]   2> 		at com.carrotsearch.randomizedtesting.rules.SystemPropertiesRestoreRule$1.evaluate(SystemPropertiesRestoreRule.java:53)
[junit4:junit4]   2> 		at org.apache.lucene.util.AbstractBeforeAfterRule$1.evaluate(AbstractBeforeAfterRule.java:45)
[junit4:junit4]   2> 		at org.apache.lucene.util.TestRuleStoreClassName$1.evaluate(TestRuleStoreClassName.java:42)
[junit4:junit4]   2> 		at com.carrotsearch.randomizedtesting.rules.SystemPropertiesInvariantRule$1.evaluate(SystemPropertiesInvariantRule.java:55)
[junit4:junit4]   2> 		at com.carrotsearch.randomizedtesting.rules.NoShadowingOrOverridesOnMethodsRule$1.evaluate(NoShadowingOrOverridesOnMethodsRule.java:39)
[junit4:junit4]   2> 		at com.carrotsearch.randomizedtesting.rules.NoShadowingOrOverridesOnMethodsRule$1.evaluate(NoShadowingOrOverridesOnMethodsRule.java:39)
[junit4:junit4]   2> 		at org.apache.lucene.util.TestRuleAssertionsRequired$1.evaluate(TestRuleAssertionsRequired.java:40)
[junit4:junit4]   2> 		at org.apache.lucene.util.TestRuleMarkFailure$1.evaluate(TestRuleMarkFailure.java:48)
[junit4:junit4]   2> 		at org.apache.lucene.util.TestRuleIgnoreAfterMaxFailures$1.evaluate(TestRuleIgnoreAfterMaxFailures.java:70)
[junit4:junit4]   2> 		at org.apache.lucene.util.TestRuleIgnoreTestSuites$1.evaluate(TestRuleIgnoreTestSuites.java:55)
[junit4:junit4]   2> 		at com.carrotsearch.randomizedtesting.rules.StatementAdapter.evaluate(StatementAdapter.java:36)
[junit4:junit4]   2> 		at com.carrotsearch.randomizedtesting.ThreadLeakControl$StatementRunner.run(ThreadLeakControl.java:358)
[junit4:junit4]   2> 		at java.lang.Thread.run(Thread.java:777)
[junit4:junit4]   2> 	
[junit4:junit4]   2> 54981 T1718 C140 REQ [collection1] webapp=null path=null params={q=*:*&stats.facet=active_s&stats.facet=other_s&stats.field=stats_i&indent=true&stats=true} hits=4 status=500 QTime=2 
[junit4:junit4]   2> 54982 T1718 oasu.AbstractSolrTestCase.tearDown ####TEARDOWN_START testStats
[junit4:junit4]   2> 54982 T1718 oasc.CoreContainer.shutdown Shutting down CoreContainer instance=1301823638
[junit4:junit4]   2> 54982 T1718 oasc.SolrCore.close [collection1]  CLOSING SolrCore org.apache.solr.core.SolrCore@dc71b3eb
[junit4:junit4]   2> 54987 T1718 oasc.SolrCore.closeSearcher [collection1] Closing main searcher on request.
[junit4:junit4]   2> 54988 T1718 oasu.DirectUpdateHandler2.close closing DirectUpdateHandler2{commits=3,autocommits=0,soft autocommits=0,optimizes=0,rollbacks=0,expungeDeletes=0,docsPending=0,adds=0,deletesById=0,deletesByQuery=0,errors=0,cumulative_adds=12,cumulative_deletesById=0,cumulative_deletesByQuery=0,cumulative_errors=0}
[junit4:junit4]   2> 54988 T1718 oasu.DefaultSolrCoreState.decref SolrCoreState ref count has reached 0 - closing IndexWriter
[junit4:junit4]   2> 54991 T1718 oasu.DefaultSolrCoreState.decref Closing SolrCoreState - canceling any ongoing recovery
[junit4:junit4]   2> NOTE: reproduce with: ant test  -Dtestcase=StatsComponentTest -Dtests.method=testStats -Dtests.seed=8E7DF5FB0A1CFF89 -Dtests.multiplier=3 -Dtests.slow=true -Dtests.locale=sl_SI_PREEURO -Dtests.timezone=Mexico/BajaSur -Dtests.file.encoding=UTF-8
[junit4:junit4] ERROR   0.41s J0 | StatsComponentTest.testStats <<<
[junit4:junit4]    > Throwable #1: java.lang.RuntimeException: Exception during query
[junit4:junit4]    > 	at __randomizedtesting.SeedInfo.seed([8E7DF5FB0A1CFF89:14FCAC4462C031AA]:0)
[junit4:junit4]    > 	at org.apache.solr.util.AbstractSolrTestCase.assertQ(AbstractSolrTestCase.java:283)
[junit4:junit4]    > 	at org.apache.solr.handler.component.StatsComponentTest.doTestFacetStatisticsResult(StatsComponentTest.java:239)
[junit4:junit4]    > 	at org.apache.solr.handler.component.StatsComponentTest.testStats(StatsComponentTest.java:68)
[junit4:junit4]    > 	at sun.reflect.NativeMethodAccessorImpl.invoke0(Native Method)
[junit4:junit4]    > 	at sun.reflect.NativeMethodAccessorImpl.invoke(NativeMethodAccessorImpl.java:88)
[junit4:junit4]    > 	at sun.reflect.DelegatingMethodAccessorImpl.invoke(DelegatingMethodAccessorImpl.java:55)
[junit4:junit4]    > 	at java.lang.reflect.Method.invoke(Method.java:613)
[junit4:junit4]    > 	at com.carrotsearch.randomizedtesting.RandomizedRunner.invoke(RandomizedRunner.java:1559)
[junit4:junit4]    > 	at com.carrotsearch.randomizedtesting.RandomizedRunner.access$600(RandomizedRunner.java:79)
[junit4:junit4]    > 	at com.carrotsearch.randomizedtesting.RandomizedRunner$6.evaluate(RandomizedRunner.java:737)
[junit4:junit4]    > 	at com.carrotsearch.randomizedtesting.RandomizedRunner$7.evaluate(RandomizedRunner.java:773)
[junit4:junit4]    > 	at com.carrotsearch.randomizedtesting.RandomizedRunner$8.evaluate(RandomizedRunner.java:787)
[junit4:junit4]    > 	at com.carrotsearch.randomizedtesting.rules.SystemPropertiesRestoreRule$1.evaluate(SystemPropertiesRestoreRule.java:53)
[junit4:junit4]    > 	at org.apache.lucene.util.TestRuleSetupTeardownChained$1.evaluate(TestRuleSetupTeardownChained.java:50)
[junit4:junit4]    > 	at org.apache.lucene.util.TestRuleFieldCacheSanity$1.evaluate(TestRuleFieldCacheSanity.java:51)
[junit4:junit4]    > 	at org.apache.lucene.util.AbstractBeforeAfterRule$1.evaluate(AbstractBeforeAfterRule.java:45)
[junit4:junit4]    > 	at com.carrotsearch.randomizedtesting.rules.SystemPropertiesInvariantRule$1.evaluate(SystemPropertiesInvariantRule.java:55)
[junit4:junit4]    > 	at org.apache.lucene.util.TestRuleThreadAndTestName$1.evaluate(TestRuleThreadAndTestName.java:48)
[junit4:junit4]    > 	at org.apache.lucene.util.TestRuleIgnoreAfterMaxFailures$1.evaluate(TestRuleIgnoreAfterMaxFailures.java:70)
[junit4:junit4]    > 	at org.apache.lucene.util.TestRuleMarkFailure$1.evaluate(TestRuleMarkFailure.java:48)
[junit4:junit4]    > 	at com.carrotsearch.randomizedtesting.rules.StatementAdapter.evaluate(StatementAdapter.java:36)
[junit4:junit4]    > 	at com.carrotsearch.randomizedtesting.ThreadLeakControl$StatementRunner.run(ThreadLeakControl.java:358)
[junit4:junit4]    > 	at com.carrotsearch.randomizedtesting.ThreadLeakControl.forkTimeoutingTask(ThreadLeakControl.java:782)
[junit4:junit4]    > 	at com.carrotsearch.randomizedtesting.ThreadLeakControl$3.evaluate(ThreadLeakControl.java:442)
[junit4:junit4]    > 	at com.carrotsearch.randomizedtesting.RandomizedRunner.runSingleTest(RandomizedRunner.java:746)
[junit4:junit4]    > 	at com.carrotsearch.randomizedtesting.RandomizedRunner$3.evaluate(RandomizedRunner.java:648)
[junit4:junit4]    > 	at com.carrotsearch.randomizedtesting.RandomizedRunner$4.evaluate(RandomizedRunner.java:682)
[junit4:junit4]    > 	at com.carrotsearch.randomizedtesting.RandomizedRunner$5.evaluate(RandomizedRunner.java:693)
[junit4:junit4]    > 	at com.carrotsearch.randomizedtesting.rules.StatementAdapter.evaluate(StatementAdapter.java:36)
[junit4:junit4]    > 	at com.carrotsearch.randomizedtesting.rules.SystemPropertiesRestoreRule$1.evaluate(SystemPropertiesRestoreRule.java:53)
[junit4:junit4]    > 	at org.apache.lucene.util.AbstractBeforeAfterRule$1.evaluate(AbstractBeforeAfterRule.java:45)
[junit4:junit4]    > 	at org.apache.lucene.util.TestRuleStoreClassName$1.evaluate(TestRuleStoreClassName.java:42)
[junit4:junit4]    > 	at com.carrotsearch.randomizedtesting.rules.SystemPropertiesInvariantRule$1.evaluate(SystemPropertiesInvariantRule.java:55)
[junit4:junit4]    > 	at com.carrotsearch.randomizedtesting.rules.NoShadowingOrOverridesOnMethodsRule$1.evaluate(NoShadowingOrOverridesOnMethodsRule.java:39)
[junit4:junit4]    > 	at com.carrotsearch.randomizedtesting.rules.NoShadowingOrOverridesOnMethodsRule$1.evaluate(NoShadowingOrOverridesOnMethodsRule.java:39)
[junit4:junit4]    > 	at org.apache.lucene.util.TestRuleAssertionsRequired$1.evaluate(TestRuleAssertionsRequired.java:40)
[junit4:junit4]    > 	at org.apache.lucene.util.TestRuleMarkFailure$1.evaluate(TestRuleMarkFailure.java:48)
[junit4:junit4]    > 	at org.apache.lucene.util.TestRuleIgnoreAfterMaxFailures$1.evaluate(TestRuleIgnoreAfterMaxFailures.java:70)
[junit4:junit4]    > 	at org.apache.lucene.util.TestRuleIgnoreTestSuites$1.evaluate(TestRuleIgnoreTestSuites.java:55)
[junit4:junit4]    > 	at com.carrotsearch.randomizedtesting.rules.StatementAdapter.evaluate(StatementAdapter.java:36)
[junit4:junit4]    > 	at com.carrotsearch.randomizedtesting.ThreadLeakControl$StatementRunner.run(ThreadLeakControl.java:358)
[junit4:junit4]    > 	at java.lang.Thread.run(Thread.java:777)
[junit4:junit4]    > Caused by: java.lang.NullPointerException
[junit4:junit4]    > 	at org.apache.solr.util.NumberUtils.SortableStr2int(NumberUtils.java:162)
[junit4:junit4]    > 	at org.apache.solr.schema.SortableIntField.toObject(SortableIntField.java:98)
[junit4:junit4]    > 	at org.apache.solr.schema.SortableIntField.toObject(SortableIntField.java:57)
[junit4:junit4]    > 	at org.apache.solr.schema.FieldType.toObject(FieldType.java:344)
[junit4:junit4]    > 	at org.apache.solr.handler.component.AbstractStatsValues.accumulate(StatsValuesFactory.java:129)
[junit4:junit4]    > 	at org.apache.solr.handler.component.SimpleStats.getFieldCacheStats(StatsComponent.java:281)
[junit4:junit4]    > 	at org.apache.solr.handler.component.SimpleStats.getStatsFields(StatsComponent.java:227)
[junit4:junit4]    > 	at org.apache.solr.handler.component.SimpleStats.getStatsCounts(StatsComponent.java:201)
[junit4:junit4]    > 	at org.apache.solr.handler.component.StatsComponent.process(StatsComponent.java:70)
[junit4:junit4]    > 	at org.apache.solr.handler.component.SearchHandler.handleRequestBody(SearchHandler.java:206)
[junit4:junit4]    > 	at org.apache.solr.handler.RequestHandlerBase.handleRequest(RequestHandlerBase.java:129)
[junit4:junit4]    > 	at org.apache.solr.core.SolrCore.execute(SolrCore.java:1701)
[junit4:junit4]    > 	at org.apache.solr.util.TestHarness.query(TestHarness.java:351)
[junit4:junit4]    > 	at org.apache.solr.util.TestHarness.query(TestHarness.java:333)
[junit4:junit4]    > 	at org.apache.solr.util.AbstractSolrTestCase.assertQ(AbstractSolrTestCase.java:273)
[junit4:junit4]    > 	... 41 more
[junit4:junit4]   2> 55014 T1718 oasu.AbstractSolrTestCase.setUp ####SETUP_START testFieldStatisticsResultsNumericFieldAlwaysMissing
[junit4:junit4]   2> 55015 T1718 oasc.SolrResourceLoader.<init> new SolrResourceLoader for directory: '/mnt/ssd/jenkins/workspace/Lucene-Solr-trunk-Linux/solr/build/solr-core/test-files/solr/collection1/'
[junit4:junit4]   2> 55016 T1718 oasc.SolrResourceLoader.replaceClassLoader Adding 'file:/mnt/ssd/jenkins/workspace/Lucene-Solr-trunk-Linux/solr/build/solr-core/test-files/solr/collection1/lib/README' to classloader
[junit4:junit4]   2> 55016 T1718 oasc.SolrResourceLoader.replaceClassLoader Adding 'file:/mnt/ssd/jenkins/workspace/Lucene-Solr-trunk-Linux/solr/build/solr-core/test-files/solr/collection1/lib/classes/' to classloader
[junit4:junit4]   2> 55036 T1718 oasc.SolrConfig.<init> Using Lucene MatchVersion: LUCENE_50
[junit4:junit4]   2> 55067 T1718 oasc.SolrConfig.<init> Loaded SolrConfig: solrconfig.xml
[junit4:junit4]   2> 55067 T1718 oass.IndexSchema.readSchema Reading Solr Schema
[junit4:junit4]   2> 55070 T1718 oass.IndexSchema.readSchema Schema name=example
[junit4:junit4]   2> 55177 T1718 oass.IndexSchema.readSchema default search field in schema is text
[junit4:junit4]   2> 55179 T1718 oass.IndexSchema.readSchema unique key field: id
[junit4:junit4]   2> 55182 T1718 oasc.SolrResourceLoader.locateSolrHome JNDI not configured for solr (NoInitialContextEx)
[junit4:junit4]   2> 55183 T1718 oasc.SolrResourceLoader.locateSolrHome using system property solr.solr.home: /mnt/ssd/jenkins/workspace/Lucene-Solr-trunk-Linux/solr/build/solr-core/test-files/solr
[junit4:junit4]   2> 55183 T1718 oasc.SolrResourceLoader.<init> new SolrResourceLoader for directory: '/mnt/ssd/jenkins/workspace/Lucene-Solr-trunk-Linux/solr/build/solr-core/test-files/solr/'
[junit4:junit4]   2> 55188 T1718 oasc.CoreContainer.<init> New CoreContainer 1712322380
[junit4:junit4]   2> 55188 T1718 oasc.SolrCore.<init> [collection1] Opening new SolrCore at /mnt/ssd/jenkins/workspace/Lucene-Solr-trunk-Linux/solr/build/solr-core/test-files/solr/collection1/, dataDir=/mnt/ssd/jenkins/workspace/Lucene-Solr-trunk-Linux/solr/build/solr-core/test/J0/./org.apache.solr.handler.component.StatsComponentTest-1347329059212/
[junit4:junit4]   2> 55189 T1718 oasc.JmxMonitoredMap.<init> JMX monitoring is enabled. Adding Solr mbeans to JMX Server: com.sun.jmx.mbeanserver.JmxMBeanServer@cc6d7070
[junit4:junit4]   2> 55189 T1718 oasc.SolrCore.getNewIndexDir WARNING New index directory detected: old=null new=/mnt/ssd/jenkins/workspace/Lucene-Solr-trunk-Linux/solr/build/solr-core/test/J0/./org.apache.solr.handler.component.StatsComponentTest-1347329059212/index/
[junit4:junit4]   2> 55190 T1718 oasc.SolrCore.initIndex WARNING [collection1] Solr index directory '/mnt/ssd/jenkins/workspace/Lucene-Solr-trunk-Linux/solr/build/solr-core/test/J0/./org.apache.solr.handler.component.StatsComponentTest-1347329059212/index' doesn't exist. Creating new index...
[junit4:junit4]   2> 55190 T1718 oasc.CachingDirectoryFactory.get return new directory for /mnt/ssd/jenkins/workspace/Lucene-Solr-trunk-Linux/solr/build/solr-core/test/J0/./org.apache.solr.handler.component.StatsComponentTest-1347329059212/index forceNew:false
[junit4:junit4]   2> 55191 T1718 oasc.SolrDeletionPolicy.onCommit SolrDeletionPolicy.onCommit: commits:num=1
[junit4:junit4]   2> 		commit{dir=MockDirWrapper(org.apache.lucene.store.RAMDirectory@9865c459 lockFactory=org.apache.lucene.store.NativeFSLockFactory@3ee8dfa2),segFN=segments_1,generation=1,filenames=[segments_1]
[junit4:junit4]   2> 55192 T1718 oasc.SolrDeletionPolicy.updateCommits newest commit = 1
[junit4:junit4]   2> 55192 T1718 oasc.SolrCore.initWriters created xml: solr.XMLResponseWriter
[junit4:junit4]   2> 55193 T1718 oasup.UpdateRequestProcessorChain.init inserting DistributedUpdateProcessorFactory into updateRequestProcessorChain "dedupe"
[junit4:junit4]   2> 55194 T1718 oasup.UpdateRequestProcessorChain.init inserting DistributedUpdateProcessorFactory into updateRequestProcessorChain "dedupe-allfields"
[junit4:junit4]   2> 55194 T1718 oasup.UpdateRequestProcessorChain.init inserting DistributedUpdateProcessorFactory into updateRequestProcessorChain "stored_sig"
[junit4:junit4]   2> 55194 T1718 oasup.UpdateRequestProcessorChain.init inserting DistributedUpdateProcessorFactory into updateRequestProcessorChain "uniq-fields"
[junit4:junit4]   2> 55195 T1718 oasup.UpdateRequestProcessorChain.init inserting DistributedUpdateProcessorFactory into updateRequestProcessorChain "distrib-dup-test-chain-implicit"
[junit4:junit4]   2> 55195 T1718 oasc.RequestHandlers.initHandlersFromConfig adding lazy requestHandler: solr.ReplicationHandler
[junit4:junit4]   2> 55196 T1718 oasc.RequestHandlers.initHandlersFromConfig created /replication: solr.ReplicationHandler
[junit4:junit4]   2> 55196 T1718 oasc.RequestHandlers.initHandlersFromConfig created standard: solr.StandardRequestHandler
[junit4:junit4]   2> 55197 T1718 oasc.RequestHandlers.initHandlersFromConfig created /get: solr.RealTimeGetHandler
[junit4:junit4]   2> 55197 T1718 oasc.RequestHandlers.initHandlersFromConfig created dismax: solr.SearchHandler
[junit4:junit4]   2> 55198 T1718 oasc.RequestHandlers.initHandlersFromConfig created mock: org.apache.solr.core.MockQuerySenderListenerReqHandler
[junit4:junit4]   2> 55198 T1718 oasc.RequestHandlers.initHandlersFromConfig created /admin/: org.apache.solr.handler.admin.AdminHandlers
[junit4:junit4]   2> 55198 T1718 oasc.RequestHandlers.initHandlersFromConfig created defaults: solr.StandardRequestHandler
[junit4:junit4]   2> 55199 T1718 oasc.RequestHandlers.initHandlersFromConfig adding lazy requestHandler: solr.StandardRequestHandler
[junit4:junit4]   2> 55199 T1718 oasc.RequestHandlers.initHandlersFromConfig created lazy: solr.StandardRequestHandler
[junit4:junit4]   2> 55200 T1718 oasc.RequestHandlers.initHandlersFromConfig created /update: solr.UpdateRequestHandler
[junit4:junit4]   2> 55200 T1718 oasc.RequestHandlers.initHandlersFromConfig created /terms: org.apache.solr.handler.component.SearchHandler
[junit4:junit4]   2> 55200 T1718 oasc.RequestHandlers.initHandlersFromConfig created spellCheckCompRH: org.apache.solr.handler.component.SearchHandler
[junit4:junit4]   2> 55201 T1718 oasc.RequestHandlers.initHandlersFromConfig created spellCheckCompRH_Direct: org.apache.solr.handler.component.SearchHandler
[junit4:junit4]   2> 55201 T1718 oasc.RequestHandlers.initHandlersFromConfig created spellCheckWithWordbreak: org.apache.solr.handler.component.SearchHandler
[junit4:junit4]   2> 55202 T1718 oasc.RequestHandlers.initHandlersFromConfig created spellCheckWithWordbreak_Direct: org.apache.solr.handler.component.SearchHandler
[junit4:junit4]   2> 55202 T1718 oasc.RequestHandlers.initHandlersFromConfig created spellCheckCompRH1: org.apache.solr.handler.component.SearchHandler
[junit4:junit4]   2> 55203 T1718 oasc.RequestHandlers.initHandlersFromConfig created tvrh: org.apache.solr.handler.component.SearchHandler
[junit4:junit4]   2> 55203 T1718 oasc.RequestHandlers.initHandlersFromConfig created /mlt: solr.MoreLikeThisHandler
[junit4:junit4]   2> 55204 T1718 oasc.RequestHandlers.initHandlersFromConfig created /debug/dump: solr.DumpRequestHandler
[junit4:junit4]   2> 55205 T1718 oashl.XMLLoader.init xsltCacheLifetimeSeconds=60
[junit4:junit4]   2> 55207 T1718 oasc.SolrCore.initDeprecatedSupport WARNING solrconfig.xml uses deprecated <admin/gettableFiles>, Please update your config to use the ShowFileRequestHandler.
[junit4:junit4]   2> 55208 T1718 oasc.SolrCore.initDeprecatedSupport WARNING adding ShowFileRequestHandler with hidden files: [BAD-SCHEMA-NOT-INDEXED-BUT-TF.XML, SCHEMA-REQUIRED-FIELDS.XML, SOLRCONFIG-MASTER1-KEEPONEBACKUP.XML, BAD-SCHEMA-NONTEXT-ANALYZER.XML, SOLRCONFIG-PROPINJECT.XML, SOLRCONFIG-PROPINJECT-INDEXDEFAULT.XML, STOP-2.TXT, SCHEMA11.XML, BAD-SCHEMA-UNIQUEKEY-USES-DEFAULT.XML, SCHEMA15.XML, SOLRCONFIG-NATIVELOCK.XML, SCHEMA-SIM.XML, CONDITIONAL.UPDATEPROCESSOR.JS, BAD-SOLRCONFIG-MISSING-SCRIPTFILE.XML, SOLRCONFIG-SCRIPT-UPDATEPROCESSOR.XML, SOLRCONFIG-REPEATER.XML, SOLRCONFIG-SPELLCHECKER.XML, SOLRCONFIG-NOCACHE.XML, SCHEMA-CHARFILTERS.XML, SOLRCONFIG-SOLCOREPROPERTIES.XML, SOLRCONFIG_CODEC.XML, BAD-SCHEMA-EXTERNAL-FILEFIELD.XML, HYPHENATION.DTD, SCHEMA.XML, SOLRCONFIG-MERGEPOLICY.XML, TRIVIAL.UPDATEPROCESSOR1.JS, SOLRCONFIG-PHRASESUGGEST.XML, SOLRCONFIG-SLAVE1.XML, SOLRCONFIG-BASIC.XML, SCHEMA-LMJELINEKMERCER.XML, BAD-MP-SOLRCONFIG.XML, BAD-SCHEMA-DUP-FIELD.XML, BAD-SCHEMA-UNIQUEKEY-MULTIVALUED.XML, SOLRCONFIG-MASTER.XML, SOLRCONFIG-HIGHLIGHT.XML, SCHEMA-TFIDF.XML, SCHEMA-REPLICATION1.XML, SYNONYMS.TXT, SOLRCONFIG-ELEVATE.XML, STOPWITHBOM.TXT, SOLRCONFIG-QUERYSENDER.XML, WDFTYPES.TXT, SOLRCONFIG-DELPOLICY1.XML, BAD_SOLRCONFIG.XML, HUNSPELL-TEST.DIC, SCHEMA-NUMERIC.XML, SCHEMA-LUCENEMATCHVERSION.XML, KEEP-2.TXT, SCHEMA-STOP-KEEP.XML, SCHEMA-IB.XML, STOP-SNOWBALL.TXT, SOLRCONFIG-SLAVE.XML, BAD-SCHEMA-NOT-INDEXED-BUT-NORMS.XML, STOPWORDSWRONGENCODING.TXT, THROW.ERROR.ON.ADD.UPDATEPROCESSOR.JS, SOLRCONFIG-SPELLCHECKCOMPONENT.XML, STOPTYPES-1.TXT, SOLRCONFIG-TLOG.XML, COMPOUNDDICTIONARY.TXT, DA_COMPOUNDDICTIONARY.TXT, SOLRCONFIG-TERMINDEX.XML, BAD-SOLRCONFIG-INVALID-SCRIPTFILE.XML, SCHEMASURROUND.XML, OPEN-EXCHANGE-RATES.JSON, BAD-SCHEMA-DUP-FIELDTYPE.XML, PHRASESUGGEST.TXT, SOLRCONFIG-MASTER2.XML, OLD_SYNONYMS.TXT, BAD-SCHEMA-UNIQUEKEY-IS-COPYFIELD-DEST.XML, SCHEMA-NOT-REQUIRED-UNIQUE-KEY.XML, BAD-SCHEMA-CODEC-GLOBAL-VS-FT-MISMATCH.XML, SCHEMA-LMDIRICHLET.XML, SCHEMA-REVERSED.XML, BAD-SCHEMA-NOT-INDEXED-BUT-POS.XML, SCHEMA-FOLDING.XML, SOLRCONFIG-CACHING.XML, MAPPING-ISOLATIN1ACCENT.TXT, ADDFIELDS.UPDATEPROCESSOR.JS, SCHEMA-BM25.XML, STOP-1.TXT, SOLRCONFIG-ENABLEPLUGIN.XML, MISSING.FUNCTIONS.UPDATEPROCESSOR.JS, SCHEMA12.XML, SOLRCONFIG-TRANSFORMERS.XML, SCHEMA-COPYFIELD-TEST.XML, BAD-SCHEMA-DUP-DYNAMICFIELD.XML, CURRENCY.XML, DA_UTF8.XML, MISSLEADING.EXTENSION.UPDATEPROCESSOR.JS.TXT, SOLRCONFIG-SOLR-749.XML, STOPWORDS.TXT, HUNSPELL-TEST.AFF, SOLRCONFIG_PERF.XML, SOLRCONFIG-SIMPLELOCK.XML, FRENCHARTICLES.TXT, SOLRCONFIG-LAZYWRITER.XML, SCHEMA-REPLICATION2.XML, SOLRCONFIG-XINCLUDE.XML, SCHEMA-SPELLCHECKER.XML, XSLT, SOLRCONFIG-DELPOLICY2.XML, TRIVIAL.UPDATEPROCESSOR0.JS, KEEP-1.TXT, SCHEMA-TRIE.XML, SCHEMA-BINARYFIELD.XML, BAD-SCHEMA-OMIT-TF-BUT-NOT-POS.XML, SCHEMA-MINIMAL.XML, STOPTYPES-2.TXT, STEMDICT.TXT, SCHEMA_CODEC.XML, ELEVATE.XML, SCHEMA-COLLATE.XML, PROTWORDS.TXT, SOLRCONFIG-REQHANDLER.INCL, SCHEMA-PHRASESUGGEST.XML, SCHEMA-DFR.XML, BAD-SCHEMA-ANALYZER-CLASS-AND-NESTED.XML, SOLRCONFIG-MASTER1.XML, SOLRCONFIG-FUNCTIONQUERY.XML, SOLRCONFIG-MASTER3.XML, SOLRCONFIG-UPDATE-PROCESSOR-CHAINS.XML, SOLRCONFIG-ALTDIRECTORY.XML, BAD-SCHEMA-SIM-GLOBAL-VS-FT-MISMATCH.XML, SOLRCONFIG-QUERYSENDER-NOQUERY.XML, BAD-SOLRCONFIG-BOGUS-SCRIPTENGINE-NAME.XML]
[junit4:junit4]   2> 55209 T1718 oass.SolrIndexSearcher.<init> Opening Searcher@49852307 main
[junit4:junit4]   2> 55209 T1718 oass.SolrIndexSearcher.getIndexDir WARNING WARNING: Directory impl does not support setting indexDir: org.apache.lucene.store.MockDirectoryWrapper
[junit4:junit4]   2> 55210 T1718 oasu.CommitTracker.<init> Hard AutoCommit: disabled
[junit4:junit4]   2> 55210 T1718 oasu.CommitTracker.<init> Soft AutoCommit: disabled
[junit4:junit4]   2> 55211 T1718 oashc.SpellCheckComponent.inform Initializing spell checkers
[junit4:junit4]   2> 55317 T1718 oass.DirectSolrSpellChecker.init init: {name=direct,classname=DirectSolrSpellChecker,field=lowerfilt,minQueryLength=3}
[junit4:junit4]   2> 55332 T1718 oashc.HttpShardHandlerFactory.getParameter Setting socketTimeout to: 0
[junit4:junit4]   2> 55332 T1718 oashc.HttpShardHandlerFactory.getParameter Setting urlScheme to: http://
[junit4:junit4]   2> 55332 T1718 oashc.HttpShardHandlerFactory.getParameter Setting connTimeout to: 0
[junit4:junit4]   2> 55333 T1718 oashc.HttpShardHandlerFactory.getParameter Setting maxConnectionsPerHost to: 20
[junit4:junit4]   2> 55333 T1718 oashc.HttpShardHandlerFactory.getParameter Setting corePoolSize to: 0
[junit4:junit4]   2> 55333 T1718 oashc.HttpShardHandlerFactory.getParameter Setting maximumPoolSize to: 2147483647
[junit4:junit4]   2> 55334 T1718 oashc.HttpShardHandlerFactory.getParameter Setting maxThreadIdleTime to: 5
[junit4:junit4]   2> 55334 T1718 oashc.HttpShardHandlerFactory.getParameter Setting sizeOfQueue to: -1
[junit4:junit4]   2> 55334 T1718 oashc.HttpShardHandlerFactory.getParameter Setting fairnessPolicy to: false
[junit4:junit4]   2> 55335 T1718 oascsi.HttpClientUtil.createClient Creating new http client, config:maxConnectionsPerHost=20&maxConnections=10000&socketTimeout=0&connTimeout=0&retry=false
[junit4:junit4]   2> 55340 T1722 oasc.SolrCore.registerSearcher [collection1] Registered new searcher Searcher@49852307 main{StandardDirectoryReader(segments_1:1)}
[junit4:junit4]   2> 55344 T1718 oasc.CoreContainer.register registering core: collection1
[junit4:junit4]   2> 55345 T1718 oasu.AbstractSolrTestCase.setUp ####SETUP_END testFieldStatisticsResultsNumericFieldAlwaysMissing
[junit4:junit4]   2> ASYNC  NEW_CORE C141 name=collection1 org.apache.solr.core.SolrCore@7534055e
[junit4:junit4]   2> 55350 T1718 C141 oasc.SolrDeletionPolicy.onInit SolrDeletionPolicy.onInit: commits:num=1
[junit4:junit4]   2> 		commit{dir=MockDirWrapper(org.apache.lucene.store.RAMDirectory@9865c459 lockFactory=org.apache.lucene.store.NativeFSLockFactory@3ee8dfa2),segFN=segments_1,generation=1,filenames=[segments_1]
[junit4:junit4]   2> 55350 T1718 C141 oasc.SolrDeletionPolicy.updateCommits newest commit = 1
[junit4:junit4]   2> 55351 T1718 C141 UPDATE [collection1] webapp=null path=null params={} {add=[1]} 0 2
[junit4:junit4]   2> 55359 T1718 C141 UPDATE [collection1] webapp=null path=null params={} {add=[2]} 0 0
[junit4:junit4]   2> 55365 T1718 C141 UPDATE [collection1] webapp=null path=null params={} {add=[3]} 0 1
[junit4:junit4]   2> 55369 T1718 C141 UPDATE [collection1] webapp=null path=null params={} {add=[4]} 0 0
[junit4:junit4]   2> 55373 T1718 C141 oasu.DirectUpdateHandler2.commit start commit{flags=0,_version_=0,optimize=false,openSearcher=true,waitSearcher=true,expungeDeletes=false,softCommit=false}
[junit4:junit4]   2> 55375 T1718 C141 oasc.SolrDeletionPolicy.onCommit SolrDeletionPolicy.onCommit: commits:num=2
[junit4:junit4]   2> 		commit{dir=MockDirWrapper(org.apache.lucene.store.RAMDirectory@9865c459 lockFactory=org.apache.lucene.store.NativeFSLockFactory@3ee8dfa2),segFN=segments_1,generation=1,filenames=[segments_1]
[junit4:junit4]   2> 		commit{dir=MockDirWrapper(org.apache.lucene.store.RAMDirectory@9865c459 lockFactory=org.apache.lucene.store.NativeFSLockFactory@3ee8dfa2),segFN=segments_2,generation=2,filenames=[_0_MockVariableIntBlock_0.tib, _0.si, segments_2, _0_MockVariableIntBlock_0.pyl, _0.fnm, _0.fdt, _0_MockVariableIntBlock_0.pos, _0_MockVariableIntBlock_0.tii, _0_MockVariableIntBlock_0.frq, _0.fdx, _0_MockVariableIntBlock_0.doc, _0_MockVariableIntBlock_0.skp]
[junit4:junit4]   2> 55376 T1718 C141 oasc.SolrDeletionPolicy.updateCommits newest commit = 2
[junit4:junit4]   2> 55376 T1718 C141 oass.SolrIndexSearcher.<init> Opening Searcher@9113c316 main
[junit4:junit4]   2> 55377 T1718 C141 oass.SolrIndexSearcher.getIndexDir WARNING WARNING: Directory impl does not support setting indexDir: org.apache.lucene.store.MockDirectoryWrapper
[junit4:junit4]   2> 55378 T1718 C141 oasu.DirectUpdateHandler2.commit end_commit_flush
[junit4:junit4]   2> 55378 T1722 oasc.SolrCore.registerSearcher [collection1] Registered new searcher Searcher@9113c316 main{StandardDirectoryReader(segments_2:3 _0(5.0):C4)}
[junit4:junit4]   2> 55379 T1718 C141 UPDATE [collection1] webapp=null path=null params={} {commit=} 0 6
[junit4:junit4]   2> 55380 T1718 C141 REQ [collection1] webapp=null path=null params={q=*:*&stats.field=active_i&indent=true&stats=true} hits=4 status=0 QTime=0 
[junit4:junit4]   2> 55381 T1718 oasu.AbstractSolrTestCase.tearDown ####TEARDOWN_START testFieldStatisticsResultsNumericFieldAlwaysMissing
[junit4:junit4]   2> 55381 T1718 oasc.CoreContainer.shutdown Shutting down CoreContainer instance=1712322380
[junit4:junit4]   2> 55382 T1718 oasc.SolrCore.close [collection1]  CLOSING SolrCore org.apache.solr.core.SolrCore@7534055e
[junit4:junit4]   2> 55387 T1718 oasc.SolrCore.closeSearcher [collection1] Closing main searcher on request.
[junit4:junit4]   2> 55387 T1718 oasu.DirectUpdateHandler2.close closing DirectUpdateHandler2{commits=1,autocommits=0,soft autocommits=0,optimizes=0,rollbacks=0,expungeDeletes=0,docsPending=0,adds=0,deletesById=0,deletesByQuery=0,errors=0,cumulative_adds=4,cumulative_deletesById=0,cumulative_deletesByQuery=0,cumulative_errors=0}
[junit4:junit4]   2> 55387 T1718 oasu.DefaultSolrCoreState.decref SolrCoreState ref count has reached 0 - closing IndexWriter
[junit4:junit4]   2> 55389 T1718 oasu.DefaultSolrCoreState.decref Closing SolrCoreState - canceling any ongoing recovery
[junit4:junit4]   2> 55395 T1718 oasu.AbstractSolrTestCase.setUp ####SETUP_START testStatsFacetMultivaluedErrorHandling
[junit4:junit4]   2> 55396 T1718 oasc.SolrResourceLoader.<init> new SolrResourceLoader for directory: '/mnt/ssd/jenkins/workspace/Lucene-Solr-trunk-Linux/solr/build/solr-core/test-files/solr/collection1/'
[junit4:junit4]   2> 55396 T1718 oasc.SolrResourceLoader.replaceClassLoader Adding 'file:/mnt/ssd/jenkins/workspace/Lucene-Solr-trunk-Linux/solr/build/solr-core/test-files/solr/collection1/lib/README' to classloader
[junit4:junit4]   2> 55397 T1718 oasc.SolrResourceLoader.replaceClassLoader Adding 'file:/mnt/ssd/jenkins/workspace/Lucene-Solr-trunk-Linux/solr/build/solr-core/test-files/solr/collection1/lib/classes/' to classloader
[junit4:junit4]   2> 55417 T1718 oasc.SolrConfig.<init> Using Lucene MatchVersion: LUCENE_50
[junit4:junit4]   2> 55447 T1718 oasc.SolrConfig.<init> Loaded SolrConfig: solrconfig.xml
[junit4:junit4]   2> 55448 T1718 oass.IndexSchema.readSchema Reading Solr Schema
[junit4:junit4]   2> 55451 T1718 oass.IndexSchema.readSchema Schema name=example
[junit4:junit4]   2> 55548 T1718 oass.IndexSchema.readSchema default search field in schema is text
[junit4:junit4]   2> 55549 T1718 oass.IndexSchema.readSchema unique key field: id
[junit4:junit4]   2> 55552 T1718 oasc.SolrResourceLoader.locateSolrHome JNDI not configured for solr (NoInitialContextEx)
[junit4:junit4]   2> 55552 T1718 oasc.SolrResourceLoader.locateSolrHome using system property solr.solr.home: /mnt/ssd/jenkins/workspace/Lucene-Solr-trunk-Linux/solr/build/solr-core/test-files/solr
[junit4:junit4]   2> 55553 T1718 oasc.SolrResourceLoader.<init> new SolrResourceLoader for directory: '/mnt/ssd/jenkins/workspace/Lucene-Solr-trunk-Linux/solr/build/solr-core/test-files/solr/'
[junit4:junit4]   2> 55557 T1718 oasc.CoreContainer.<init> New CoreContainer 1418763308
[junit4:junit4]   2> 55558 T1718 oasc.SolrCore.<init> [collection1] Opening new SolrCore at /mnt/ssd/jenkins/workspace/Lucene-Solr-trunk-Linux/solr/build/solr-core/test-files/solr/collection1/, dataDir=/mnt/ssd/jenkins/workspace/Lucene-Solr-trunk-Linux/solr/build/solr-core/test/J0/./org.apache.solr.handler.component.StatsComponentTest-1347329059592/
[junit4:junit4]   2> 55558 T1718 oasc.JmxMonitoredMap.<init> JMX monitoring is enabled. Adding Solr mbeans to JMX Server: com.sun.jmx.mbeanserver.JmxMBeanServer@cc6d7070
[junit4:junit4]   2> 55559 T1718 oasc.SolrCore.getNewIndexDir WARNING New index directory detected: old=null new=/mnt/ssd/jenkins/workspace/Lucene-Solr-trunk-Linux/solr/build/solr-core/test/J0/./org.apache.solr.handler.component.StatsComponentTest-1347329059592/index/
[junit4:junit4]   2> 55559 T1718 oasc.SolrCore.initIndex WARNING [collection1] Solr index directory '/mnt/ssd/jenkins/workspace/Lucene-Solr-trunk-Linux/solr/build/solr-core/test/J0/./org.apache.solr.handler.component.StatsComponentTest-1347329059592/index' doesn't exist. Creating new index...
[junit4:junit4]   2> 55560 T1718 oasc.CachingDirectoryFactory.get return new directory for /mnt/ssd/jenkins/workspace/Lucene-Solr-trunk-Linux/solr/build/solr-core/test/J0/./org.apache.solr.handler.component.StatsComponentTest-1347329059592/index forceNew:false
[junit4:junit4]   2> 55561 T1718 oasc.SolrDeletionPolicy.onCommit SolrDeletionPolicy.onCommit: commits:num=1
[junit4:junit4]   2> 		commit{dir=MockDirWrapper(org.apache.lucene.store.RAMDirectory@c42655c1 lockFactory=org.apache.lucene.store.NativeFSLockFactory@883724ef),segFN=segments_1,generation=1,filenames=[segments_1]
[junit4:junit4]   2> 55561 T1718 oasc.SolrDeletionPolicy.updateCommits newest commit = 1
[junit4:junit4]   2> 55562 T1718 oasc.SolrCore.initWriters created xml: solr.XMLResponseWriter
[junit4:junit4]   2> 55563 T1718 oasup.UpdateRequestProcessorChain.init inserting DistributedUpdateProcessorFactory into updateRequestProcessorChain "dedupe"
[junit4:junit4]   2> 55563 T1718 oasup.UpdateRequestProcessorChain.init inserting DistributedUpdateProcessorFactory into updateRequestProcessorChain "dedupe-allfields"
[junit4:junit4]   2> 55563 T1718 oasup.UpdateRequestProcessorChain.init inserting DistributedUpdateProcessorFactory into updateRequestProcessorChain "stored_sig"
[junit4:junit4]   2> 55564 T1718 oasup.UpdateRequestProcessorChain.init inserting DistributedUpdateProcessorFactory into updateRequestProcessorChain "uniq-fields"
[junit4:junit4]   2> 55564 T1718 oasup.UpdateRequestProcessorChain.init inserting DistributedUpdateProcessorFactory into updateRequestProcessorChain "distrib-dup-test-chain-implicit"
[junit4:junit4]   2> 55565 T1718 oasc.RequestHandlers.initHandlersFromConfig adding lazy requestHandler: solr.ReplicationHandler
[junit4:junit4]   2> 55565 T1718 oasc.RequestHandlers.initHandlersFromConfig created /replication: solr.ReplicationHandler
[junit4:junit4]   2> 55565 T1718 oasc.RequestHandlers.initHandlersFromConfig created standard: solr.StandardRequestHandler
[junit4:junit4]   2> 55566 T1718 oasc.RequestHandlers.initHandlersFromConfig created /get: solr.RealTimeGetHandler
[junit4:junit4]   2> 55566 T1718 oasc.RequestHandlers.initHandlersFromConfig created dismax: solr.SearchHandler
[junit4:junit4]   2> 55567 T1718 oasc.RequestHandlers.initHandlersFromConfig created mock: org.apache.solr.core.MockQuerySenderListenerReqHandler
[junit4:junit4]   2> 55567 T1718 oasc.RequestHandlers.initHandlersFromConfig created /admin/: org.apache.solr.handler.admin.AdminHandlers
[junit4:junit4]   2> 55568 T1718 oasc.RequestHandlers.initHandlersFromConfig created defaults: solr.StandardRequestHandler
[junit4:junit4]   2> 55568 T1718 oasc.RequestHandlers.initHandlersFromConfig adding lazy requestHandler: solr.StandardRequestHandler
[junit4:junit4]   2> 55568 T1718 oasc.RequestHandlers.initHandlersFromConfig created lazy: solr.StandardRequestHandler
[junit4:junit4]   2> 55569 T1718 oasc.RequestHandlers.initHandlersFromConfig created /update: solr.UpdateRequestHandler
[junit4:junit4]   2> 55569 T1718 oasc.RequestHandlers.initHandlersFromConfig created /terms: org.apache.solr.handler.component.SearchHandler
[junit4:junit4]   2> 55569 T1718 oasc.RequestHandlers.initHandlersFromConfig created spellCheckCompRH: org.apache.solr.handler.component.SearchHandler
[junit4:junit4]   2> 55570 T1718 oasc.RequestHandlers.initHandlersFromConfig created spellCheckCompRH_Direct: org.apache.solr.handler.component.SearchHandler
[junit4:junit4]   2> 55570 T1718 oasc.RequestHandlers.initHandlersFromConfig created spellCheckWithWordbreak: org.apache.solr.handler.component.SearchHandler
[junit4:junit4]   2> 55571 T1718 oasc.RequestHandlers.initHandlersFromConfig created spellCheckWithWordbreak_Direct: org.apache.solr.handler.component.SearchHandler
[junit4:junit4]   2> 55571 T1718 oasc.RequestHandlers.initHandlersFromConfig created spellCheckCompRH1: org.apache.solr.handler.component.SearchHandler
[junit4:junit4]   2> 55571 T1718 oasc.RequestHandlers.initHandlersFromConfig created tvrh: org.apache.solr.handler.component.SearchHandler
[junit4:junit4]   2> 55572 T1718 oasc.RequestHandlers.initHandlersFromConfig created /mlt: solr.MoreLikeThisHandler
[junit4:junit4]   2> 55572 T1718 oasc.RequestHandlers.initHandlersFromConfig created /debug/dump: solr.DumpRequestHandler
[junit4:junit4]   2> 55573 T1718 oashl.XMLLoader.init xsltCacheLifetimeSeconds=60
[junit4:junit4]   2> 55574 T1718 oasc.SolrCore.initDeprecatedSupport WARNING solrconfig.xml uses deprecated <admin/gettableFiles>, Please update your config to use the ShowFileRequestHandler.
[junit4:junit4]   2> 55575 T1718 oasc.SolrCore.initDeprecatedSupport WARNING adding ShowFileRequestHandler with hidden files: [BAD-SCHEMA-NOT-INDEXED-BUT-TF.XML, SCHEMA-REQUIRED-FIELDS.XML, SOLRCONFIG-MASTER1-KEEPONEBACKUP.XML, BAD-SCHEMA-NONTEXT-ANALYZER.XML, SOLRCONFIG-PROPINJECT.XML, SOLRCONFIG-PROPINJECT-INDEXDEFAULT.XML, STOP-2.TXT, SCHEMA11.XML, BAD-SCHEMA-UNIQUEKEY-USES-DEFAULT.XML, SCHEMA15.XML, SOLRCONFIG-NATIVELOCK.XML, SCHEMA-SIM.XML, CONDITIONAL.UPDATEPROCESSOR.JS, BAD-SOLRCONFIG-MISSING-SCRIPTFILE.XML, SOLRCONFIG-SCRIPT-UPDATEPROCESSOR.XML, SOLRCONFIG-REPEATER.XML, SOLRCONFIG-SPELLCHECKER.XML, SOLRCONFIG-NOCACHE.XML, SCHEMA-CHARFILTERS.XML, SOLRCONFIG-SOLCOREPROPERTIES.XML, SOLRCONFIG_CODEC.XML, BAD-SCHEMA-EXTERNAL-FILEFIELD.XML, HYPHENATION.DTD, SCHEMA.XML, SOLRCONFIG-MERGEPOLICY.XML, TRIVIAL.UPDATEPROCESSOR1.JS, SOLRCONFIG-PHRASESUGGEST.XML, SOLRCONFIG-SLAVE1.XML, SOLRCONFIG-BASIC.XML, SCHEMA-LMJELINEKMERCER.XML, BAD-MP-SOLRCONFIG.XML, BAD-SCHEMA-DUP-FIELD.XML, BAD-SCHEMA-UNIQUEKEY-MULTIVALUED.XML, SOLRCONFIG-MASTER.XML, SOLRCONFIG-HIGHLIGHT.XML, SCHEMA-TFIDF.XML, SCHEMA-REPLICATION1.XML, SYNONYMS.TXT, SOLRCONFIG-ELEVATE.XML, STOPWITHBOM.TXT, SOLRCONFIG-QUERYSENDER.XML, WDFTYPES.TXT, SOLRCONFIG-DELPOLICY1.XML, BAD_SOLRCONFIG.XML, HUNSPELL-TEST.DIC, SCHEMA-NUMERIC.XML, SCHEMA-LUCENEMATCHVERSION.XML, KEEP-2.TXT, SCHEMA-STOP-KEEP.XML, SCHEMA-IB.XML, STOP-SNOWBALL.TXT, SOLRCONFIG-SLAVE.XML, BAD-SCHEMA-NOT-INDEXED-BUT-NORMS.XML, STOPWORDSWRONGENCODING.TXT, THROW.ERROR.ON.ADD.UPDATEPROCESSOR.JS, SOLRCONFIG-SPELLCHECKCOMPONENT.XML, STOPTYPES-1.TXT, SOLRCONFIG-TLOG.XML, COMPOUNDDICTIONARY.TXT, DA_COMPOUNDDICTIONARY.TXT, SOLRCONFIG-TERMINDEX.XML, BAD-SOLRCONFIG-INVALID-SCRIPTFILE.XML, SCHEMASURROUND.XML, OPEN-EXCHANGE-RATES.JSON, BAD-SCHEMA-DUP-FIELDTYPE.XML, PHRASESUGGEST.TXT, SOLRCONFIG-MASTER2.XML, OLD_SYNONYMS.TXT, BAD-SCHEMA-UNIQUEKEY-IS-COPYFIELD-DEST.XML, SCHEMA-NOT-REQUIRED-UNIQUE-KEY.XML, BAD-SCHEMA-CODEC-GLOBAL-VS-FT-MISMATCH.XML, SCHEMA-LMDIRICHLET.XML, SCHEMA-REVERSED.XML, BAD-SCHEMA-NOT-INDEXED-BUT-POS.XML, SCHEMA-FOLDING.XML, SOLRCONFIG-CACHING.XML, MAPPING-ISOLATIN1ACCENT.TXT, ADDFIELDS.UPDATEPROCESSOR.JS, SCHEMA-BM25.XML, STOP-1.TXT, SOLRCONFIG-ENABLEPLUGIN.XML, MISSING.FUNCTIONS.UPDATEPROCESSOR.JS, SCHEMA12.XML, SOLRCONFIG-TRANSFORMERS.XML, SCHEMA-COPYFIELD-TEST.XML, BAD-SCHEMA-DUP-DYNAMICFIELD.XML, CURRENCY.XML, DA_UTF8.XML, MISSLEADING.EXTENSION.UPDATEPROCESSOR.JS.TXT, SOLRCONFIG-SOLR-749.XML, STOPWORDS.TXT, HUNSPELL-TEST.AFF, SOLRCONFIG_PERF.XML, SOLRCONFIG-SIMPLELOCK.XML, FRENCHARTICLES.TXT, SOLRCONFIG-LAZYWRITER.XML, SCHEMA-REPLICATION2.XML, SOLRCONFIG-XINCLUDE.XML, SCHEMA-SPELLCHECKER.XML, XSLT, SOLRCONFIG-DELPOLICY2.XML, TRIVIAL.UPDATEPROCESSOR0.JS, KEEP-1.TXT, SCHEMA-TRIE.XML, SCHEMA-BINARYFIELD.XML, BAD-SCHEMA-OMIT-TF-BUT-NOT-POS.XML, SCHEMA-MINIMAL.XML, STOPTYPES-2.TXT, STEMDICT.TXT, SCHEMA_CODEC.XML, ELEVATE.XML, SCHEMA-COLLATE.XML, PROTWORDS.TXT, SOLRCONFIG-REQHANDLER.INCL, SCHEMA-PHRASESUGGEST.XML, SCHEMA-DFR.XML, BAD-SCHEMA-ANALYZER-CLASS-AND-NESTED.XML, SOLRCONFIG-MASTER1.XML, SOLRCONFIG-FUNCTIONQUERY.XML, SOLRCONFIG-MASTER3.XML, SOLRCONFIG-UPDATE-PROCESSOR-CHAINS.XML, SOLRCONFIG-ALTDIRECTORY.XML, BAD-SCHEMA-SIM-GLOBAL-VS-FT-MISMATCH.XML, SOLRCONFIG-QUERYSENDER-NOQUERY.XML, BAD-SOLRCONFIG-BOGUS-SCRIPTENGINE-NAME.XML]
[junit4:junit4]   2> 55577 T1718 oass.SolrIndexSearcher.<init> Opening Searcher@8a375bb5 main
[junit4:junit4]   2> 55577 T1718 oass.SolrIndexSearcher.getIndexDir WARNING WARNING: Directory impl does not support setting indexDir: org.apache.lucene.store.MockDirectoryWrapper
[junit4:junit4]   2> 55577 T1718 oasu.CommitTracker.<init> Hard AutoCommit: disabled
[junit4:junit4]   2> 55578 T1718 oasu.CommitTracker.<init> Soft AutoCommit: disabled
[junit4:junit4]   2> 55578 T1718 oashc.SpellCheckComponent.inform Initializing spell checkers
[junit4:junit4]   2> 55659 T1718 oass.DirectSolrSpellChecker.init init: {name=direct,classname=DirectSolrSpellChecker,field=lowerfilt,minQueryLength=3}
[junit4:junit4]   2> 55674 T1718 oashc.HttpShardHandlerFactory.getParameter Setting socketTimeout to: 0
[junit4:junit4]   2> 55674 T1718 oashc.HttpShardHandlerFactory.getParameter Setting urlScheme to: http://
[junit4:junit4]   2> 55674 T1718 oashc.HttpShardHandlerFactory.getParameter Setting connTimeout to: 0
[junit4:junit4]   2> 55675 T1718 oashc.HttpShardHandlerFactory.getParameter Setting maxConnectionsPerHost to: 20
[junit4:junit4]   2> 55675 T1718 oashc.HttpShardHandlerFactory.getParameter Setting corePoolSize to: 0
[junit4:junit4]   2> 55676 T1718 oashc.HttpShardHandlerFactory.getParameter Setting maximumPoolSize to: 2147483647
[junit4:junit4]   2> 55676 T1718 oashc.HttpShardHandlerFactory.getParameter Setting maxThreadIdleTime to: 5
[junit4:junit4]   2> 55676 T1718 oashc.HttpShardHandlerFactory.getParameter Setting sizeOfQueue to: -1
[junit4:junit4]   2> 55677 T1718 oashc.HttpShardHandlerFactory.getParameter Setting fairnessPolicy to: false
[junit4:junit4]   2> 55677 T1718 oascsi.HttpClientUtil.createClient Creating new http client, config:maxConnectionsPerHost=20&maxConnections=10000&socketTimeout=0&connTimeout=0&retry=false
[junit4:junit4]   2> 55682 T1723 oasc.SolrCore.registerSearcher [collection1] Registered new searcher Searcher@8a375bb5 main{StandardDirectoryReader(segments_1:1)}
[junit4:junit4]   2> 55684 T1718 oasc.CoreContainer.register registering core: collection1
[junit4:junit4]   2> 55684 T1718 oasu.AbstractSolrTestCase.setUp ####SETUP_END testStatsFacetMultivaluedErrorHandling
[junit4:junit4]   2> ASYNC  NEW_CORE C142 name=collection1 org.apache.solr.core.SolrCore@2252d533
[junit4:junit4]   2> 55687 T1718 C142 oasc.SolrDeletionPolicy.onInit SolrDeletionPolicy.onInit: commits:num=1
[junit4:junit4]   2> 		commit{dir=MockDirWrapper(org.apache.lucene.store.RAMDirectory@c42655c1 lockFactory=org.apache.lucene.store.NativeFSLockFactory@883724ef),segFN=segments_1,generation=1,filenames=[segments_1]
[junit4:junit4]   2> 55688 T1718 C142 oasc.SolrDeletionPolicy.updateCommits newest commit = 1
[junit4:junit4]   2> 55688 T1718 C142 UPDATE [collection1] webapp=null path=null params={} {add=[1]} 0 1
[junit4:junit4]   2> 55693 T1718 C142 UPDATE [collection1] webapp=null path=null params={} {add=[2]} 0 0
[junit4:junit4]   2> 55696 T1718 C142 UPDATE [collection1] webapp=null path=null params={} {add=[3]} 0 0
[junit4:junit4]   2> 55699 T1718 C142 oasu.DirectUpdateHandler2.commit start commit{flags=0,_version_=0,optimize=false,openSearcher=true,waitSearcher=true,expungeDeletes=false,softCommit=false}
[junit4:junit4]   2> 55700 T1718 C142 oasc.SolrDeletionPolicy.onCommit SolrDeletionPolicy.onCommit: commits:num=2
[junit4:junit4]   2> 		commit{dir=MockDirWrapper(org.apache.lucene.store.RAMDirectory@c42655c1 lockFactory=org.apache.lucene.store.NativeFSLockFactory@883724ef),segFN=segments_1,generation=1,filenames=[segments_1]
[junit4:junit4]   2> 		commit{dir=MockDirWrapper(org.apache.lucene.store.RAMDirectory@c42655c1 lockFactory=org.apache.lucene.store.NativeFSLockFactory@883724ef),segFN=segments_2,generation=2,filenames=[_0_MockFixedIntBlock_0.pyl, _0_MockFixedIntBlock_0.frq, _0_Pulsing40_0.tip, _0_MockVariableIntBlock_0.tib, _0.fnm, _0_MockVariableIntBlock_0.tii, _0_MockVariableIntBlock_0.pos, _0_MockFixedIntBlock_0.tib, _0_Pulsing40_0.frq, _0_MockVariableIntBlock_0.skp, _0_MockVariableIntBlock_0.doc, _0_MockFixedIntBlock_0.tii, _0_MockFixedIntBlock_0.pos, _0.si, segments_2, _0_MockFixedIntBlock_0.skp, _0_MockFixedIntBlock_0.doc, _0_MockVariableIntBlock_0.pyl, _0.fdt, _0_MockVariableIntBlock_0.frq, _0.fdx, _0_Pulsing40_0.prx, _0_Pulsing40_0.tim]
[junit4:junit4]   2> 55701 T1718 C142 oasc.SolrDeletionPolicy.updateCommits newest commit = 2
[junit4:junit4]   2> 55702 T1718 C142 oass.SolrIndexSearcher.<init> Opening Searcher@30249f1f main
[junit4:junit4]   2> 55703 T1718 C142 oass.SolrIndexSearcher.getIndexDir WARNING WARNING: Directory impl does not support setting indexDir: org.apache.lucene.store.MockDirectoryWrapper
[junit4:junit4]   2> 55703 T1718 C142 oasu.DirectUpdateHandler2.commit end_commit_flush
[junit4:junit4]   2> 55704 T1723 oasc.SolrCore.registerSearcher [collection1] Registered new searcher Searcher@30249f1f main{StandardDirectoryReader(segments_2:3 _0(5.0):C3)}
[junit4:junit4]   2> 55704 T1718 C142 UPDATE [collection1] webapp=null path=null params={} {commit=} 0 5
[junit4:junit4]   2> 55706 T1718 C142 oasc.SolrException.log SEVERE org.apache.solr.common.SolrException: Stats can only facet on single-valued fields, not: foo_ss
[junit4:junit4]   2> 		at org.apache.solr.handler.component.SimpleStats.getFieldCacheStats(StatsComponent.java:261)
[junit4:junit4]   2> 		at org.apache.solr.handler.component.SimpleStats.getStatsFields(StatsComponent.java:227)
[junit4:junit4]   2> 		at org.apache.solr.handler.component.SimpleStats.getStatsCounts(StatsComponent.java:201)
[junit4:junit4]   2> 		at org.apache.solr.handler.component.StatsComponent.process(StatsComponent.java:70)
[junit4:junit4]   2> 		at org.apache.solr.handler.component.SearchHandler.handleRequestBody(SearchHandler.java:206)
[junit4:junit4]   2> 		at org.apache.solr.handler.RequestHandlerBase.handleRequest(RequestHandlerBase.java:129)
[junit4:junit4]   2> 		at org.apache.solr.core.SolrCore.execute(SolrCore.java:1701)
[junit4:junit4]   2> 		at org.apache.solr.util.TestHarness.query(TestHarness.java:351)
[junit4:junit4]   2> 		at org.apache.solr.util.TestHarness.query(TestHarness.java:333)
[junit4:junit4]   2> 		at org.apache.solr.util.AbstractSolrTestCase.assertQEx(AbstractSolrTestCase.java:290)
[junit4:junit4]   2> 		at org.apache.solr.handler.component.StatsComponentTest.testStatsFacetMultivaluedErrorHandling(StatsComponentTest.java:363)
[junit4:junit4]   2> 		at sun.reflect.NativeMethodAccessorImpl.invoke0(Native Method)
[junit4:junit4]   2> 		at sun.reflect.NativeMethodAccessorImpl.invoke(NativeMethodAccessorImpl.java:88)
[junit4:junit4]   2> 		at sun.reflect.DelegatingMethodAccessorImpl.invoke(DelegatingMethodAccessorImpl.java:55)
[junit4:junit4]   2> 		at java.lang.reflect.Method.invoke(Method.java:613)
[junit4:junit4]   2> 		at com.carrotsearch.randomizedtesting.RandomizedRunner.invoke(RandomizedRunner.java:1559)
[junit4:junit4]   2> 		at com.carrotsearch.randomizedtesting.RandomizedRunner.access$600(RandomizedRunner.java:79)
[junit4:junit4]   2> 		at com.carrotsearch.randomizedtesting.RandomizedRunner$6.evaluate(RandomizedRunner.java:737)
[junit4:junit4]   2> 		at com.carrotsearch.randomizedtesting.RandomizedRunner$7.evaluate(RandomizedRunner.java:773)
[junit4:junit4]   2> 		at com.carrotsearch.randomizedtesting.RandomizedRunner$8.evaluate(RandomizedRunner.java:787)
[junit4:junit4]   2> 		at com.carrotsearch.randomizedtesting.rules.SystemPropertiesRestoreRule$1.evaluate(SystemPropertiesRestoreRule.java:53)
[junit4:junit4]   2> 		at org.apache.lucene.util.TestRuleSetupTeardownChained$1.evaluate(TestRuleSetupTeardownChained.java:50)
[junit4:junit4]   2> 		at org.apache.lucene.util.TestRuleFieldCacheSanity$1.evaluate(TestRuleFieldCacheSanity.java:51)
[junit4:junit4]   2> 		at org.apache.lucene.util.AbstractBeforeAfterRule$1.evaluate(AbstractBeforeAfterRule.java:45)
[junit4:junit4]   2> 		at com.carrotsearch.randomizedtesting.rules.SystemPropertiesInvariantRule$1.evaluate(SystemPropertiesInvariantRule.java:55)
[junit4:junit4]   2> 		at org.apache.lucene.util.TestRuleThreadAndTestName$1.evaluate(TestRuleThreadAndTestName.java:48)
[junit4:junit4]   2> 		at org.apache.lucene.util.TestRuleIgnoreAfterMaxFailures$1.evaluate(TestRuleIgnoreAfterMaxFailures.java:70)
[junit4:junit4]   2> 		at org.apache.lucene.util.TestRuleMarkFailure$1.evaluate(TestRuleMarkFailure.java:48)
[junit4:junit4]   2> 		at com.carrotsearch.randomizedtesting.rules.StatementAdapter.evaluate(StatementAdapter.java:36)
[junit4:junit4]   2> 		at com.carrotsearch.randomizedtesting.ThreadLeakControl$StatementRunner.run(ThreadLeakControl.java:358)
[junit4:junit4]   2> 		at com.carrotsearch.randomizedtesting.ThreadLeakControl.forkTimeoutingTask(ThreadLeakControl.java:782)
[junit4:junit4]   2> 		at com.carrotsearch.randomizedtesting.ThreadLeakControl$3.evaluate(ThreadLeakControl.java:442)
[junit4:junit4]   2> 		at com.carrotsearch.randomizedtesting.RandomizedRunner.runSingleTest(RandomizedRunner.java:746)
[junit4:junit4]   2> 		at com.carrotsearch.randomizedtesting.RandomizedRunner$3.evaluate(RandomizedRunner.java:648)
[junit4:junit4]   2> 		at com.carrotsearch.randomizedtesting.RandomizedRunner$4.evaluate(RandomizedRunner.java:682)
[junit4:junit4]   2> 		at com.carrotsearch.randomizedtesting.RandomizedRunner$5.evaluate(RandomizedRunner.java:693)
[junit4:junit4]   2> 		at com.carrotsearch.randomizedtesting.rules.StatementAdapter.evaluate(StatementAdapter.java:36)
[junit4:junit4]   2> 		at com.carrotsearch.randomizedtesting.rules.SystemPropertiesRestoreRule$1.evaluate(SystemPropertiesRestoreRule.java:53)
[junit4:junit4]   2> 		at org.apache.lucene.util.AbstractBeforeAfterRule$1.evaluate(AbstractBeforeAfterRule.java:45)
[junit4:junit4]   2> 		at org.apache.lucene.util.TestRuleStoreClassName$1.evaluate(TestRuleStoreClassName.java:42)
[junit4:junit4]   2> 		at com.carrotsearch.randomizedtesting.rules.SystemPropertiesInvariantRule$1.evaluate(SystemPropertiesInvariantRule.java:55)
[junit4:junit4]   2> 		at com.carrotsearch.randomizedtesting.rules.NoShadowingOrOverridesOnMethodsRule$1.evaluate(NoShadowingOrOverridesOnMethodsRule.java:39)
[junit4:junit4]   2> 		at com.carrotsearch.randomizedtesting.rules.NoShadowingOrOverridesOnMethodsRule$1.evaluate(NoShadowingOrOverridesOnMethodsRule.java:39)
[junit4:junit4]   2> 		at org.apache.lucene.util.TestRuleAssertionsRequired$1.evaluate(TestRuleAssertionsRequired.java:40)
[junit4:junit4]   2> 		at org.apache.lucene.util.TestRuleMarkFailure$1.evaluate(TestRuleMarkFailure.java:48)
[junit4:junit4]   2> 		at org.apache.lucene.util.TestRuleIgnoreAfterMaxFailures$1.evaluate(TestRuleIgnoreAfterMaxFailures.java:70)
[junit4:junit4]   2> 		at org.apache.lucene.util.TestRuleIgnoreTestSuites$1.evaluate(TestRuleIgnoreTestSuites.java:55)
[junit4:junit4]   2> 		at com.carrotsearch.randomizedtesting.rules.StatementAdapter.evaluate(StatementAdapter.java:36)
[junit4:junit4]   2> 		at com.carrotsearch.randomizedtesting.ThreadLeakControl$StatementRunner.run(ThreadLeakControl.java:358)
[junit4:junit4]   2> 		at java.lang.Thread.run(Thread.java:777)
[junit4:junit4]   2> 	
[junit4:junit4]   2> 55707 T1718 C142 REQ [collection1] webapp=null path=null params={q=*:*&stats.facet=foo_ss&stats.field=active_i&stats=true} hits=3 status=400 QTime=1 
[junit4:junit4]   2> 55707 T1718 oasu.AbstractSolrTestCase.tearDown ####TEARDOWN_START testStatsFacetMultivaluedErrorHandling
[junit4:junit4]   2> 55707 T1718 oasc.CoreContainer.shutdown Shutting down CoreContainer instance=1418763308
[junit4:junit4]   2> 55708 T1718 oasc.SolrCore.close [collection1]  CLOSING SolrCore org.apache.solr.core.SolrCore@2252d533
[junit4:junit4]   2> 55713 T1718 oasc.SolrCore.closeSearcher [collection1] Closing main searcher on request.
[junit4:junit4]   2> 55713 T1718 oasu.DirectUpdateHandler2.close closing DirectUpdateHandler2{commits=1,autocommits=0,soft autocommits=0,optimizes=0,rollbacks=0,expungeDeletes=0,docsPending=0,adds=0,deletesById=0,deletesByQuery=0,errors=0,cumulative_adds=3,cumulative_deletesById=0,cumulative_deletesByQuery=0,cumulative_errors=0}
[junit4:junit4]   2> 55714 T1718 oasu.DefaultSolrCoreState.decref SolrCoreState ref count has reached 0 - closing IndexWriter
[junit4:junit4]   2> 55716 T1718 oasu.DefaultSolrCoreState.decref Closing SolrCoreState - canceling any ongoing recovery
[junit4:junit4]   2> 55726 T1718 oasu.AbstractSolrTestCase.setUp ####SETUP_START testFieldStatisticsResultsStringField
[junit4:junit4]   2> 55727 T1718 oasc.SolrResourceLoader.<init> new SolrResourceLoader for directory: '/mnt/ssd/jenkins/workspace/Lucene-Solr-trunk-Linux/solr/build/solr-core/test-files/solr/collection1/'
[junit4:junit4]   2> 55728 T1718 oasc.SolrResourceLoader.replaceClassLoader Adding 'file:/mnt/ssd/jenkins/workspace/Lucene-Solr-trunk-Linux/solr/build/solr-core/test-files/solr/collection1/lib/README' to classloader
[junit4:junit4]   2> 55728 T1718 oasc.SolrResourceLoader.replaceClassLoader Adding 'file:/mnt/ssd/jenkins/workspace/Lucene-Solr-trunk-Linux/solr/build/solr-core/test-files/solr/collection1/lib/classes/' to classloader
[junit4:junit4]   2> 55752 T1718 oasc.SolrConfig.<init> Using Lucene MatchVersion: LUCENE_50
[junit4:junit4]   2> 55783 T1718 oasc.SolrConfig.<init> Loaded SolrConfig: solrconfig.xml
[junit4:junit4]   2> 55783 T1718 oass.IndexSchema.readSchema Reading Solr Schema
[junit4:junit4]   2> 55786 T1718 oass.IndexSchema.readSchema Schema name=example
[junit4:junit4]   2> 55882 T1718 oass.IndexSchema.readSchema default search field in schema is text
[junit4:junit4]   2> 55884 T1718 oass.IndexSchema.readSchema unique key field: id
[junit4:junit4]   2> 55887 T1718 oasc.SolrResourceLoader.locateSolrHome JNDI not configured for solr (NoInitialContextEx)
[junit4:junit4]   2> 55887 T1718 oasc.SolrResourceLoader.locateSolrHome using system property solr.solr.home: /mnt/ssd/jenkins/workspace/Lucene-Solr-trunk-Linux/solr/build/solr-core/test-files/solr
[junit4:junit4]   2> 55887 T1718 oasc.SolrResourceLoader.<init> new SolrResourceLoader for directory: '/mnt/ssd/jenkins/workspace/Lucene-Solr-trunk-Linux/solr/build/solr-core/test-files/solr/'
[junit4:junit4]   2> 55892 T1718 oasc.CoreContainer.<init> New CoreContainer -2061003207
[junit4:junit4]   2> 55892 T1718 oasc.SolrCore.<init> [collection1] Opening new SolrCore at /mnt/ssd/jenkins/workspace/Lucene-Solr-trunk-Linux/solr/build/solr-core/test-files/solr/collection1/, dataDir=/mnt/ssd/jenkins/workspace/Lucene-Solr-trunk-Linux/solr/build/solr-core/test/J0/./org.apache.solr.handler.component.StatsComponentTest-1347329059924/
[junit4:junit4]   2> 55892 T1718 oasc.JmxMonitoredMap.<init> JMX monitoring is enabled. Adding Solr mbeans to JMX Server: com.sun.jmx.mbeanserver.JmxMBeanServer@cc6d7070
[junit4:junit4]   2> 55893 T1718 oasc.SolrCore.getNewIndexDir WARNING New index directory detected: old=null new=/mnt/ssd/jenkins/workspace/Lucene-Solr-trunk-Linux/solr/build/solr-core/test/J0/./org.apache.solr.handler.component.StatsComponentTest-1347329059924/index/
[junit4:junit4]   2> 55893 T1718 oasc.SolrCore.initIndex WARNING [collection1] Solr index directory '/mnt/ssd/jenkins/workspace/Lucene-Solr-trunk-Linux/solr/build/solr-core/test/J0/./org.apache.solr.handler.component.StatsComponentTest-1347329059924/index' doesn't exist. Creating new index...
[junit4:junit4]   2> 55894 T1718 oasc.CachingDirectoryFactory.get return new directory for /mnt/ssd/jenkins/workspace/Lucene-Solr-trunk-Linux/solr/build/solr-core/test/J0/./org.apache.solr.handler.component.StatsComponentTest-1347329059924/index forceNew:false
[junit4:junit4]   2> 55895 T1718 oasc.SolrDeletionPolicy.onCommit SolrDeletionPolicy.onCommit: commits:num=1
[junit4:junit4]   2> 		commit{dir=MockDirWrapper(org.apache.lucene.store.RAMDirectory@d2c45928 lockFactory=org.apache.lucene.store.NativeFSLockFactory@f7c66412),segFN=segments_1,generation=1,filenames=[segments_1]
[junit4:junit4]   2> 55895 T1718 oasc.SolrDeletionPolicy.updateCommits newest commit = 1
[junit4:junit4]   2> 55896 T1718 oasc.SolrCore.initWriters created xml: solr.XMLResponseWriter
[junit4:junit4]   2> 55897 T1718 oasup.UpdateRequestProcessorChain.init inserting DistributedUpdateProcessorFactory into updateRequestProcessorChain "dedupe"
[junit4:junit4]   2> 55897 T1718 oasup.UpdateRequestProcessorChain.init inserting DistributedUpdateProcessorFactory into updateRequestProcessorChain "dedupe-allfields"
[junit4:junit4]   2> 55898 T1718 oasup.UpdateRequestProcessorChain.init inserting DistributedUpdateProcessorFactory into updateRequestProcessorChain "stored_sig"
[junit4:junit4]   2> 55898 T1718 oasup.UpdateRequestProcessorChain.init inserting DistributedUpdateProcessorFactory into updateRequestProcessorChain "uniq-fields"
[junit4:junit4]   2> 55898 T1718 oasup.UpdateRequestProcessorChain.init inserting DistributedUpdateProcessorFactory into updateRequestProcessorChain "distrib-dup-test-chain-implicit"
[junit4:junit4]   2> 55899 T1718 oasc.RequestHandlers.initHandlersFromConfig adding lazy requestHandler: solr.ReplicationHandler
[junit4:junit4]   2> 55899 T1718 oasc.RequestHandlers.initHandlersFromConfig created /replication: solr.ReplicationHandler
[junit4:junit4]   2> 55900 T1718 oasc.RequestHandlers.initHandlersFromConfig created standard: solr.StandardRequestHandler
[junit4:junit4]   2> 55900 T1718 oasc.RequestHandlers.initHandlersFromConfig created /get: solr.RealTimeGetHandler
[junit4:junit4]   2> 55900 T1718 oasc.RequestHandlers.initHandlersFromConfig created dismax: solr.SearchHandler
[junit4:junit4]   2> 55901 T1718 oasc.RequestHandlers.initHandlersFromConfig created mock: org.apache.solr.core.MockQuerySenderListenerReqHandler
[junit4:junit4]   2> 55901 T1718 oasc.RequestHandlers.initHandlersFromConfig created /admin/: org.apache.solr.handler.admin.AdminHandlers
[junit4:junit4]   2> 55902 T1718 oasc.RequestHandlers.initHandlersFromConfig created defaults: solr.StandardRequestHandler
[junit4:junit4]   2> 55902 T1718 oasc.RequestHandlers.initHandlersFromConfig adding lazy requestHandler: solr.StandardRequestHandler
[junit4:junit4]   2> 55902 T1718 oasc.RequestHandlers.initHandlersFromConfig created lazy: solr.StandardRequestHandler
[junit4:junit4]   2> 55903 T1718 oasc.RequestHandlers.initHandlersFromConfig created /update: solr.UpdateRequestHandler
[junit4:junit4]   2> 55903 T1718 oasc.RequestHandlers.initHandlersFromConfig created /terms: org.apache.solr.handler.component.SearchHandler
[junit4:junit4]   2> 55904 T1718 oasc.RequestHandlers.initHandlersFromConfig created spellCheckCompRH: org.apache.solr.handler.component.SearchHandler
[junit4:junit4]   2> 55904 T1718 oasc.RequestHandlers.initHandlersFromConfig created spellCheckCompRH_Direct: org.apache.solr.handler.component.SearchHandler
[junit4:junit4]   2> 55904 T1718 oasc.RequestHandlers.initHandlersFromConfig created spellCheckWithWordbreak: org.apache.solr.handler.component.SearchHandler
[junit4:junit4]   2> 55905 T1718 oasc.RequestHandlers.initHandlersFromConfig created spellCheckWithWordbreak_Direct: org.apache.solr.handler.component.SearchHandler
[junit4:junit4]   2> 55905 T1718 oasc.RequestHandlers.initHandlersFromConfig created spellCheckCompRH1: org.apache.solr.handler.component.SearchHandler
[junit4:junit4]   2> 55906 T1718 oasc.RequestHandlers.initHandlersFromConfig created tvrh: org.apache.solr.handler.component.SearchHandler
[junit4:junit4]   2> 55906 T1718 oasc.RequestHandlers.initHandlersFromConfig created /mlt: solr.MoreLikeThisHandler
[junit4:junit4]   2> 55906 T1718 oasc.RequestHandlers.initHandlersFromConfig created /debug/dump: solr.DumpRequestHandler
[junit4:junit4]   2> 55907 T1718 oashl.XMLLoader.init xsltCacheLifetimeSeconds=60
[junit4:junit4]   2> 55908 T1718 oasc.SolrCore.initDeprecatedSupport WARNING solrconfig.xml uses deprecated <admin/gettableFiles>, Please update your config to use the ShowFileRequestHandler.
[junit4:junit4]   2> 55909 T1718 oasc.SolrCore.initDeprecatedSupport WARNING adding ShowFileRequestHandler with hidden files: [BAD-SCHEMA-NOT-INDEXED-BUT-TF.XML, SCHEMA-REQUIRED-FIELDS.XML, SOLRCONFIG-MASTER1-KEEPONEBACKUP.XML, BAD-SCHEMA-NONTEXT-ANALYZER.XML, SOLRCONFIG-PROPINJECT.XML, SOLRCONFIG-PROPINJECT-INDEXDEFAULT.XML, STOP-2.TXT, SCHEMA11.XML, BAD-SCHEMA-UNIQUEKEY-USES-DEFAULT.XML, SCHEMA15.XML, SOLRCONFIG-NATIVELOCK.XML, SCHEMA-SIM.XML, CONDITIONAL.UPDATEPROCESSOR.JS, BAD-SOLRCONFIG-MISSING-SCRIPTFILE.XML, SOLRCONFIG-SCRIPT-UPDATEPROCESSOR.XML, SOLRCONFIG-REPEATER.XML, SOLRCONFIG-SPELLCHECKER.XML, SOLRCONFIG-NOCACHE.XML, SCHEMA-CHARFILTERS.XML, SOLRCONFIG-SOLCOREPROPERTIES.XML, SOLRCONFIG_CODEC.XML, BAD-SCHEMA-EXTERNAL-FILEFIELD.XML, HYPHENATION.DTD, SCHEMA.XML, SOLRCONFIG-MERGEPOLICY.XML, TRIVIAL.UPDATEPROCESSOR1.JS, SOLRCONFIG-PHRASESUGGEST.XML, SOLRCONFIG-SLAVE1.XML, SOLRCONFIG-BASIC.XML, SCHEMA-LMJELINEKMERCER.XML, BAD-MP-SOLRCONFIG.XML, BAD-SCHEMA-DUP-FIELD.XML, BAD-SCHEMA-UNIQUEKEY-MULTIVALUED.XML, SOLRCONFIG-MASTER.XML, SOLRCONFIG-HIGHLIGHT.XML, SCHEMA-TFIDF.XML, SCHEMA-REPLICATION1.XML, SYNONYMS.TXT, SOLRCONFIG-ELEVATE.XML, STOPWITHBOM.TXT, SOLRCONFIG-QUERYSENDER.XML, WDFTYPES.TXT, SOLRCONFIG-DELPOLICY1.XML, BAD_SOLRCONFIG.XML, HUNSPELL-TEST.DIC, SCHEMA-NUMERIC.XML, SCHEMA-LUCENEMATCHVERSION.XML, KEEP-2.TXT, SCHEMA-STOP-KEEP.XML, SCHEMA-IB.XML, STOP-SNOWBALL.TXT, SOLRCONFIG-SLAVE.XML, BAD-SCHEMA-NOT-INDEXED-BUT-NORMS.XML, STOPWORDSWRONGENCODING.TXT, THROW.ERROR.ON.ADD.UPDATEPROCESSOR.JS, SOLRCONFIG-SPELLCHECKCOMPONENT.XML, STOPTYPES-1.TXT, SOLRCONFIG-TLOG.XML, COMPOUNDDICTIONARY.TXT, DA_COMPOUNDDICTIONARY.TXT, SOLRCONFIG-TERMINDEX.XML, BAD-SOLRCONFIG-INVALID-SCRIPTFILE.XML, SCHEMASURROUND.XML, OPEN-EXCHANGE-RATES.JSON, BAD-SCHEMA-DUP-FIELDTYPE.XML, PHRASESUGGEST.TXT, SOLRCONFIG-MASTER2.XML, OLD_SYNONYMS.TXT, BAD-SCHEMA-UNIQUEKEY-IS-COPYFIELD-DEST.XML, SCHEMA-NOT-REQUIRED-UNIQUE-KEY.XML, BAD-SCHEMA-CODEC-GLOBAL-VS-FT-MISMATCH.XML, SCHEMA-LMDIRICHLET.XML, SCHEMA-REVERSED.XML, BAD-SCHEMA-NOT-INDEXED-BUT-POS.XML, SCHEMA-FOLDING.XML, SOLRCONFIG-CACHING.XML, MAPPING-ISOLATIN1ACCENT.TXT, ADDFIELDS.UPDATEPROCESSOR.JS, SCHEMA-BM25.XML, STOP-1.TXT, SOLRCONFIG-ENABLEPLUGIN.XML, MISSING.FUNCTIONS.UPDATEPROCESSOR.JS, SCHEMA12.XML, SOLRCONFIG-TRANSFORMERS.XML, SCHEMA-COPYFIELD-TEST.XML, BAD-SCHEMA-DUP-DYNAMICFIELD.XML, CURRENCY.XML, DA_UTF8.XML, MISSLEADING.EXTENSION.UPDATEPROCESSOR.JS.TXT, SOLRCONFIG-SOLR-749.XML, STOPWORDS.TXT, HUNSPELL-TEST.AFF, SOLRCONFIG_PERF.XML, SOLRCONFIG-SIMPLELOCK.XML, FRENCHARTICLES.TXT, SOLRCONFIG-LAZYWRITER.XML, SCHEMA-REPLICATION2.XML, SOLRCONFIG-XINCLUDE.XML, SCHEMA-SPELLCHECKER.XML, XSLT, SOLRCONFIG-DELPOLICY2.XML, TRIVIAL.UPDATEPROCESSOR0.JS, KEEP-1.TXT, SCHEMA-TRIE.XML, SCHEMA-BINARYFIELD.XML, BAD-SCHEMA-OMIT-TF-BUT-NOT-POS.XML, SCHEMA-MINIMAL.XML, STOPTYPES-2.TXT, STEMDICT.TXT, SCHEMA_CODEC.XML, ELEVATE.XML, SCHEMA-COLLATE.XML, PROTWORDS.TXT, SOLRCONFIG-REQHANDLER.INCL, SCHEMA-PHRASESUGGEST.XML, SCHEMA-DFR.XML, BAD-SCHEMA-ANALYZER-CLASS-AND-NESTED.XML, SOLRCONFIG-MASTER1.XML, SOLRCONFIG-FUNCTIONQUERY.XML, SOLRCONFIG-MASTER3.XML, SOLRCONFIG-UPDATE-PROCESSOR-CHAINS.XML, SOLRCONFIG-ALTDIRECTORY.XML, BAD-SCHEMA-SIM-GLOBAL-VS-FT-MISMATCH.XML, SOLRCONFIG-QUERYSENDER-NOQUERY.XML, BAD-SOLRCONFIG-BOGUS-SCRIPTENGINE-NAME.XML]
[junit4:junit4]   2> 55911 T1718 oass.SolrIndexSearcher.<init> Opening Searcher@750030c5 main
[junit4:junit4]   2> 55911 T1718 oass.SolrIndexSearcher.getIndexDir WARNING WARNING: Directory impl does not support setting indexDir: org.apache.lucene.store.MockDirectoryWrapper
[junit4:junit4]   2> 55911 T1718 oasu.CommitTracker.<init> Hard AutoCommit: disabled
[junit4:junit4]   2> 55912 T1718 oasu.CommitTracker.<init> Soft AutoCommit: disabled
[junit4:junit4]   2> 55912 T1718 oashc.SpellCheckComponent.inform Initializing spell checkers
[junit4:junit4]   2> 55987 T1718 oass.DirectSolrSpellChecker.init init: {name=direct,classname=DirectSolrSpellChecker,field=lowerfilt,minQueryLength=3}
[junit4:junit4]   2> 56003 T1718 oashc.HttpShardHandlerFactory.getParameter Setting socketTimeout to: 0
[junit4:junit4]   2> 56004 T1718 oashc.HttpShardHandlerFactory.getParameter Setting urlScheme to: http://
[junit4:junit4]   2> 56004 T1718 oashc.HttpShardHandlerFactory.getParameter Setting connTimeout to: 0
[junit4:junit4]   2> 56005 T1718 oashc.HttpShardHandlerFactory.getParameter Setting maxConnectionsPerHost to: 20
[junit4:junit4]   2> 56005 T1718 oashc.HttpShardHandlerFactory.getParameter Setting corePoolSize to: 0
[junit4:junit4]   2> 56005 T1718 oashc.HttpShardHandlerFactory.getParameter Setting maximumPoolSize to: 2147483647
[junit4:junit4]   2> 56006 T1718 oashc.HttpShardHandlerFactory.getParameter Setting maxThreadIdleTime to: 5
[junit4:junit4]   2> 56006 T1718 oashc.HttpShardHandlerFactory.getParameter Setting sizeOfQueue to: -1
[junit4:junit4]   2> 56006 T1718 oashc.HttpShardHandlerFactory.getParameter Setting fairnessPolicy to: false
[junit4:junit4]   2> 56007 T1718 oascsi.HttpClientUtil.createClient Creating new http client, config:maxConnectionsPerHost=20&maxConnections=10000&socketTimeout=0&connTimeout=0&retry=false
[junit4:junit4]   2> 56012 T1724 oasc.SolrCore.registerSearcher [collection1] Registered new searcher Searcher@750030c5 main{StandardDirectoryReader(segments_1:1)}
[junit4:junit4]   2> 56013 T1718 oasc.CoreContainer.register registering core: collection1
[junit4:junit4]   2> 56014 T1718 oasu.AbstractSolrTestCase.setUp ####SETUP_END testFieldStatisticsResultsStringField
[junit4:junit4]   2> ASYNC  NEW_CORE C143 name=collection1 org.apache.solr.core.SolrCore@b61623c0
[junit4:junit4]   2> 56017 T1718 C143 oasc.SolrDeletionPolicy.onInit SolrDeletionPolicy.onInit: commits:num=1
[junit4:junit4]   2> 		commit{dir=MockDirWrapper(org.apache.lucene.store.RAMDirectory@d2c45928 lockFactory=org.apache.lucene.store.NativeFSLockFactory@f7c66412),segFN=segments_1,generation=1,filenames=[segments_1]
[junit4:junit4]   2> 56018 T1718 C143 oasc.SolrDeletionPolicy.updateCommits newest commit = 1
[junit4:junit4]   2> 56018 T1718 C143 UPDATE [collection1] webapp=null path=null params={} {add=[1]} 0 2
[junit4:junit4]   2> 56023 T1718 C143 UPDATE [collection1] webapp=null path=null params={} {add=[2]} 0 0
[junit4:junit4]   2> 56026 T1718 C143 UPDATE [collection1] webapp=null path=null params={} {add=[3]} 0 0
[junit4:junit4]   2> 56029 T1718 C143 UPDATE [collection1] webapp=null path=null params={} {add=[4]} 0 0
[junit4:junit4]   2> 56032 T1718 C143 oasu.DirectUpdateHandler2.commit start commit{flags=0,_version_=0,optimize=false,openSearcher=true,waitSearcher=true,expungeDeletes=false,softCommit=false}
[junit4:junit4]   2> 56033 T1718 C143 oasc.SolrDeletionPolicy.onCommit SolrDeletionPolicy.onCommit: commits:num=2
[junit4:junit4]   2> 		commit{dir=MockDirWrapper(org.apache.lucene.store.RAMDirectory@d2c45928 lockFactory=org.apache.lucene.store.NativeFSLockFactory@f7c66412),segFN=segments_1,generation=1,filenames=[segments_1]
[junit4:junit4]   2> 		commit{dir=MockDirWrapper(org.apache.lucene.store.RAMDirectory@d2c45928 lockFactory=org.apache.lucene.store.NativeFSLockFactory@f7c66412),segFN=segments_2,generation=2,filenames=[_0_MockRandom_0.pyl, _0_MockVariableIntBlock_0.tib, _0_MockRandom_0.frq, _0.fnm, _0_MockVariableIntBlock_0.tii, _0_MockVariableIntBlock_0.pos, _0_MockVariableIntBlock_0.doc, _0_MockVariableIntBlock_0.skp, _0_MockRandom_0.pos, _0.si, segments_2, _0_MockRandom_0.sd, _0_MockRandom_0.tim, _0_MockRandom_0.skp, _0_MockRandom_0.doc, _0_MockVariableIntBlock_0.pyl, _0_MockRandom_0.tip, _0.fdt, _0_MockVariableIntBlock_0.frq, _0.fdx]
[junit4:junit4]   2> 56034 T1718 C143 oasc.SolrDeletionPolicy.updateCommits newest commit = 2
[junit4:junit4]   2> 56035 T1718 C143 oass.SolrIndexSearcher.<init> Opening Searcher@618774ab main
[junit4:junit4]   2> 56035 T1718 C143 oass.SolrIndexSearcher.getIndexDir WARNING WARNING: Directory impl does not support setting indexDir: org.apache.lucene.store.MockDirectoryWrapper
[junit4:junit4]   2> 56036 T1718 C143 oasu.DirectUpdateHandler2.commit end_commit_flush
[junit4:junit4]   2> 56037 T1724 oasc.SolrCore.registerSearcher [collection1] Registered new searcher Searcher@618774ab main{StandardDirectoryReader(segments_2:3 _0(5.0):C4)}
[junit4:junit4]   2> 56037 T1718 C143 UPDATE [collection1] webapp=null path=null params={} {commit=} 0 5
[junit4:junit4]   2> 56038 T1718 C143 REQ [collection1] webapp=null path=null params={q=*:*&stats.field=active_s&indent=true&stats=true} hits=4 status=0 QTime=0 
[junit4:junit4]   2> 56041 T1718 oasu.AbstractSolrTestCase.tearDown ####TEARDOWN_START testFieldStatisticsResultsStringField
[junit4:junit4]   2> 56041 T1718 oasc.CoreContainer.shutdown Shutting down CoreContainer instance=-2061003207
[junit4:junit4]   2> 56042 T1718 oasc.SolrCore.close [collection1]  CLOSING SolrCore org.apache.solr.core.SolrCore@b61623c0
[junit4:junit4]   2> 56047 T1718 oasc.SolrCore.closeSearcher [collection1] Closing main searcher on request.
[junit4:junit4]   2> 56047 T1718 oasu.DirectUpdateHandler2.close closing DirectUpdateHandler2{commits=1,autocommits=0,soft autocommits=0,optimizes=0,rollbacks=0,expungeDeletes=0,docsPending=0,adds=0,deletesById=0,deletesByQuery=0,errors=0,cumulative_adds=4,cumulative_deletesById=0,cumulative_deletesByQuery=0,cumulative_errors=0}
[junit4:junit4]   2> 56047 T1718 oasu.DefaultSolrCoreState.decref SolrCoreState ref count has reached 0 - closing IndexWriter
[junit4:junit4]   2> 56049 T1718 oasu.DefaultSolrCoreState.decref Closing SolrCoreState - canceling any ongoing recovery
[junit4:junit4]   2> 56055 T1718 oasu.AbstractSolrTestCase.setUp ####SETUP_START testFieldStatisticsResultsDateField
[junit4:junit4]   2> 56056 T1718 oasc.SolrResourceLoader.<init> new SolrResourceLoader for directory: '/mnt/ssd/jenkins/workspace/Lucene-Solr-trunk-Linux/solr/build/solr-core/test-files/solr/collection1/'
[junit4:junit4]   2> 56056 T1718 oasc.SolrResourceLoader.replaceClassLoader Adding 'file:/mnt/ssd/jenkins/workspace/Lucene-Solr-trunk-Linux/solr/build/solr-core/test-files/solr/collection1/lib/README' to classloader
[junit4:junit4]   2> 56057 T1718 oasc.SolrResourceLoader.replaceClassLoader Adding 'file:/mnt/ssd/jenkins/workspace/Lucene-Solr-trunk-Linux/solr/build/solr-core/test-files/solr/collection1/lib/classes/' to classloader
[junit4:junit4]   2> 56077 T1718 oasc.SolrConfig.<init> Using Lucene MatchVersion: LUCENE_50
[junit4:junit4]   2> 56108 T1718 oasc.SolrConfig.<init> Loaded SolrConfig: solrconfig.xml
[junit4:junit4]   2> 56109 T1718 oass.IndexSchema.readSchema Reading Solr Schema
[junit4:junit4]   2> 56111 T1718 oass.IndexSchema.readSchema Schema name=example
[junit4:junit4]   2> 56214 T1718 oass.IndexSchema.readSchema default search field in schema is text
[junit4:junit4]   2> 56215 T1718 oass.IndexSchema.readSchema unique key field: id
[junit4:junit4]   2> 56218 T1718 oasc.SolrResourceLoader.locateSolrHome JNDI not configured for solr (NoInitialContextEx)
[junit4:junit4]   2> 56218 T1718 oasc.SolrResourceLoader.locateSolrHome using system property solr.solr.home: /mnt/ssd/jenkins/workspace/Lucene-Solr-trunk-Linux/solr/build/solr-core/test-files/solr
[junit4:junit4]   2> 56219 T1718 oasc.SolrResourceLoader.<init> new SolrResourceLoader for directory: '/mnt/ssd/jenkins/workspace/Lucene-Solr-trunk-Linux/solr/build/solr-core/test-files/solr/'
[junit4:junit4]   2> 56223 T1718 oasc.CoreContainer.<init> New CoreContainer 2006668485
[junit4:junit4]   2> 56224 T1718 oasc.SolrCore.<init> [collection1] Opening new SolrCore at /mnt/ssd/jenkins/workspace/Lucene-Solr-trunk-Linux/solr/build/solr-core/test-files/solr/collection1/, dataDir=/mnt/ssd/jenkins/workspace/Lucene-Solr-trunk-Linux/solr/build/solr-core/test/J0/./org.apache.solr.handler.component.StatsComponentTest-1347329060252/
[junit4:junit4]   2> 56224 T1718 oasc.JmxMonitoredMap.<init> JMX monitoring is enabled. Adding Solr mbeans to JMX Server: com.sun.jmx.mbeanserver.JmxMBeanServer@cc6d7070
[junit4:junit4]   2> 56224 T1718 oasc.SolrCore.getNewIndexDir WARNING New index directory detected: old=null new=/mnt/ssd/jenkins/workspace/Lucene-Solr-trunk-Linux/solr/build/solr-core/test/J0/./org.apache.solr.handler.component.StatsComponentTest-1347329060252/index/
[junit4:junit4]   2> 56225 T1718 oasc.SolrCore.initIndex WARNING [collection1] Solr index directory '/mnt/ssd/jenkins/workspace/Lucene-Solr-trunk-Linux/solr/build/solr-core/test/J0/./org.apache.solr.handler.component.StatsComponentTest-1347329060252/index' doesn't exist. Creating new index...
[junit4:junit4]   2> 56225 T1718 oasc.CachingDirectoryFactory.get return new directory for /mnt/ssd/jenkins/workspace/Lucene-Solr-trunk-Linux/solr/build/solr-core/test/J0/./org.apache.solr.handler.component.StatsComponentTest-1347329060252/index forceNew:false
[junit4:junit4]   2> 56226 T1718 oasc.SolrDeletionPolicy.onCommit SolrDeletionPolicy.onCommit: commits:num=1
[junit4:junit4]   2> 		commit{dir=MockDirWrapper(NRTCachingDirectory(org.apache.lucene.store.RAMDirectory@18194e8b lockFactory=org.apache.lucene.store.NativeFSLockFactory@f7c73747; maxCacheMB=0.76171875 maxMergeSizeMB=0.833984375)),segFN=segments_1,generation=1,filenames=[segments_1]
[junit4:junit4]   2> 56227 T1718 oasc.SolrDeletionPolicy.updateCommits newest commit = 1
[junit4:junit4]   2> 56227 T1718 oasc.SolrCore.initWriters created xml: solr.XMLResponseWriter
[junit4:junit4]   2> 56228 T1718 oasup.UpdateRequestProcessorChain.init inserting DistributedUpdateProcessorFactory into updateRequestProcessorChain "dedupe"
[junit4:junit4]   2> 56229 T1718 oasup.UpdateRequestProcessorChain.init inserting DistributedUpdateProcessorFactory into updateRequestProcessorChain "dedupe-allfields"
[junit4:junit4]   2> 56229 T1718 oasup.UpdateRequestProcessorChain.init inserting DistributedUpdateProcessorFactory into updateRequestProcessorChain "stored_sig"
[junit4:junit4]   2> 56230 T1718 oasup.UpdateRequestProcessorChain.init inserting DistributedUpdateProcessorFactory into updateRequestProcessorChain "uniq-fields"
[junit4:junit4]   2> 56230 T1718 oasup.UpdateRequestProcessorChain.init inserting DistributedUpdateProcessorFactory into updateRequestProcessorChain "distrib-dup-test-chain-implicit"
[junit4:junit4]   2> 56230 T1718 oasc.RequestHandlers.initHandlersFromConfig adding lazy requestHandler: solr.ReplicationHandler
[junit4:junit4]   2> 56231 T1718 oasc.RequestHandlers.initHandlersFromConfig created /replication: solr.ReplicationHandler
[junit4:junit4]   2> 56231 T1718 oasc.RequestHandlers.initHandlersFromConfig created standard: solr.StandardRequestHandler
[junit4:junit4]   2> 56232 T1718 oasc.RequestHandlers.initHandlersFromConfig created /get: solr.RealTimeGetHandler
[junit4:junit4]   2> 56232 T1718 oasc.RequestHandlers.initHandlersFromConfig created dismax: solr.SearchHandler
[junit4:junit4]   2> 56232 T1718 oasc.RequestHandlers.initHandlersFromConfig created mock: org.apache.solr.core.MockQuerySenderListenerReqHandler
[junit4:junit4]   2> 56233 T1718 oasc.RequestHandlers.initHandlersFromConfig created /admin/: org.apache.solr.handler.admin.AdminHandlers
[junit4:junit4]   2> 56233 T1718 oasc.RequestHandlers.initHandlersFromConfig created defaults: solr.StandardRequestHandler
[junit4:junit4]   2> 56234 T1718 oasc.RequestHandlers.initHandlersFromConfig adding lazy requestHandler: solr.StandardRequestHandler
[junit4:junit4]   2> 56234 T1718 oasc.RequestHandlers.initHandlersFromConfig created lazy: solr.StandardRequestHandler
[junit4:junit4]   2> 56234 T1718 oasc.RequestHandlers.initHandlersFromConfig created /update: solr.UpdateRequestHandler
[junit4:junit4]   2> 56235 T1718 oasc.RequestHandlers.initHandlersFromConfig created /terms: org.apache.solr.handler.component.SearchHandler
[junit4:junit4]   2> 56235 T1718 oasc.RequestHandlers.initHandlersFromConfig created spellCheckCompRH: org.apache.solr.handler.component.SearchHandler
[junit4:junit4]   2> 56236 T1718 oasc.RequestHandlers.initHandlersFromConfig created spellCheckCompRH_Direct: org.apache.solr.handler.component.SearchHandler
[junit4:junit4]   2> 56236 T1718 oasc.RequestHandlers.initHandlersFromConfig created spellCheckWithWordbreak: org.apache.solr.handler.component.SearchHandler
[junit4:junit4]   2> 56236 T1718 oasc.RequestHandlers.initHandlersFromConfig created spellCheckWithWordbreak_Direct: org.apache.solr.handler.component.SearchHandler
[junit4:junit4]   2> 56237 T1718 oasc.RequestHandlers.initHandlersFromConfig created spellCheckCompRH1: org.apache.solr.handler.component.SearchHandler
[junit4:junit4]   2> 56237 T1718 oasc.RequestHandlers.initHandlersFromConfig created tvrh: org.apache.solr.handler.component.SearchHandler
[junit4:junit4]   2> 56238 T1718 oasc.RequestHandlers.initHandlersFromConfig created /mlt: solr.MoreLikeThisHandler
[junit4:junit4]   2> 56238 T1718 oasc.RequestHandlers.initHandlersFromConfig created /debug/dump: solr.DumpRequestHandler
[junit4:junit4]   2> 56239 T1718 oashl.XMLLoader.init xsltCacheLifetimeSeconds=60
[junit4:junit4]   2> 56240 T1718 oasc.SolrCore.initDeprecatedSupport WARNING solrconfig.xml uses deprecated <admin/gettableFiles>, Please update your config to use the ShowFileRequestHandler.
[junit4:junit4]   2> 56241 T1718 oasc.SolrCore.initDeprecatedSupport WARNING adding ShowFileRequestHandler with hidden files: [BAD-SCHEMA-NOT-INDEXED-BUT-TF.XML, SCHEMA-REQUIRED-FIELDS.XML, SOLRCONFIG-MASTER1-KEEPONEBACKUP.XML, BAD-SCHEMA-NONTEXT-ANALYZER.XML, SOLRCONFIG-PROPINJECT.XML, SOLRCONFIG-PROPINJECT-INDEXDEFAULT.XML, STOP-2.TXT, SCHEMA11.XML, BAD-SCHEMA-UNIQUEKEY-USES-DEFAULT.XML, SCHEMA15.XML, SOLRCONFIG-NATIVELOCK.XML, SCHEMA-SIM.XML, CONDITIONAL.UPDATEPROCESSOR.JS, BAD-SOLRCONFIG-MISSING-SCRIPTFILE.XML, SOLRCONFIG-SCRIPT-UPDATEPROCESSOR.XML, SOLRCONFIG-REPEATER.XML, SOLRCONFIG-SPELLCHECKER.XML, SOLRCONFIG-NOCACHE.XML, SCHEMA-CHARFILTERS.XML, SOLRCONFIG-SOLCOREPROPERTIES.XML, SOLRCONFIG_CODEC.XML, BAD-SCHEMA-EXTERNAL-FILEFIELD.XML, HYPHENATION.DTD, SCHEMA.XML, SOLRCONFIG-MERGEPOLICY.XML, TRIVIAL.UPDATEPROCESSOR1.JS, SOLRCONFIG-PHRASESUGGEST.XML, SOLRCONFIG-SLAVE1.XML, SOLRCONFIG-BASIC.XML, SCHEMA-LMJELINEKMERCER.XML, BAD-MP-SOLRCONFIG.XML, BAD-SCHEMA-DUP-FIELD.XML, BAD-SCHEMA-UNIQUEKEY-MULTIVALUED.XML, SOLRCONFIG-MASTER.XML, SOLRCONFIG-HIGHLIGHT.XML, SCHEMA-TFIDF.XML, SCHEMA-REPLICATION1.XML, SYNONYMS.TXT, SOLRCONFIG-ELEVATE.XML, STOPWITHBOM.TXT, SOLRCONFIG-QUERYSENDER.XML, WDFTYPES.TXT, SOLRCONFIG-DELPOLICY1.XML, BAD_SOLRCONFIG.XML, HUNSPELL-TEST.DIC, SCHEMA-NUMERIC.XML, SCHEMA-LUCENEMATCHVERSION.XML, KEEP-2.TXT, SCHEMA-STOP-KEEP.XML, SCHEMA-IB.XML, STOP-SNOWBALL.TXT, SOLRCONFIG-SLAVE.XML, BAD-SCHEMA-NOT-INDEXED-BUT-NORMS.XML, STOPWORDSWRONGENCODING.TXT, THROW.ERROR.ON.ADD.UPDATEPROCESSOR.JS, SOLRCONFIG-SPELLCHECKCOMPONENT.XML, STOPTYPES-1.TXT, SOLRCONFIG-TLOG.XML, COMPOUNDDICTIONARY.TXT, DA_COMPOUNDDICTIONARY.TXT, SOLRCONFIG-TERMINDEX.XML, BAD-SOLRCONFIG-INVALID-SCRIPTFILE.XML, SCHEMASURROUND.XML, OPEN-EXCHANGE-RATES.JSON, BAD-SCHEMA-DUP-FIELDTYPE.XML, PHRASESUGGEST.TXT, SOLRCONFIG-MASTER2.XML, OLD_SYNONYMS.TXT, BAD-SCHEMA-UNIQUEKEY-IS-COPYFIELD-DEST.XML, SCHEMA-NOT-REQUIRED-UNIQUE-KEY.XML, BAD-SCHEMA-CODEC-GLOBAL-VS-FT-MISMATCH.XML, SCHEMA-LMDIRICHLET.XML, SCHEMA-REVERSED.XML, BAD-SCHEMA-NOT-INDEXED-BUT-POS.XML, SCHEMA-FOLDING.XML, SOLRCONFIG-CACHING.XML, MAPPING-ISOLATIN1ACCENT.TXT, ADDFIELDS.UPDATEPROCESSOR.JS, SCHEMA-BM25.XML, STOP-1.TXT, SOLRCONFIG-ENABLEPLUGIN.XML, MISSING.FUNCTIONS.UPDATEPROCESSOR.JS, SCHEMA12.XML, SOLRCONFIG-TRANSFORMERS.XML, SCHEMA-COPYFIELD-TEST.XML, BAD-SCHEMA-DUP-DYNAMICFIELD.XML, CURRENCY.XML, DA_UTF8.XML, MISSLEADING.EXTENSION.UPDATEPROCESSOR.JS.TXT, SOLRCONFIG-SOLR-749.XML, STOPWORDS.TXT, HUNSPELL-TEST.AFF, SOLRCONFIG_PERF.XML, SOLRCONFIG-SIMPLELOCK.XML, FRENCHARTICLES.TXT, SOLRCONFIG-LAZYWRITER.XML, SCHEMA-REPLICATION2.XML, SOLRCONFIG-XINCLUDE.XML, SCHEMA-SPELLCHECKER.XML, XSLT, SOLRCONFIG-DELPOLICY2.XML, TRIVIAL.UPDATEPROCESSOR0.JS, KEEP-1.TXT, SCHEMA-TRIE.XML, SCHEMA-BINARYFIELD.XML, BAD-SCHEMA-OMIT-TF-BUT-NOT-POS.XML, SCHEMA-MINIMAL.XML, STOPTYPES-2.TXT, STEMDICT.TXT, SCHEMA_CODEC.XML, ELEVATE.XML, SCHEMA-COLLATE.XML, PROTWORDS.TXT, SOLRCONFIG-REQHANDLER.INCL, SCHEMA-PHRASESUGGEST.XML, SCHEMA-DFR.XML, BAD-SCHEMA-ANALYZER-CLASS-AND-NESTED.XML, SOLRCONFIG-MASTER1.XML, SOLRCONFIG-FUNCTIONQUERY.XML, SOLRCONFIG-MASTER3.XML, SOLRCONFIG-UPDATE-PROCESSOR-CHAINS.XML, SOLRCONFIG-ALTDIRECTORY.XML, BAD-SCHEMA-SIM-GLOBAL-VS-FT-MISMATCH.XML, SOLRCONFIG-QUERYSENDER-NOQUERY.XML, BAD-SOLRCONFIG-BOGUS-SCRIPTENGINE-NAME.XML]
[junit4:junit4]   2> 56242 T1718 oass.SolrIndexSearcher.<init> Opening Searcher@c26604a main
[junit4:junit4]   2> 56243 T1718 oass.SolrIndexSearcher.getIndexDir WARNING WARNING: Directory impl does not support setting indexDir: org.apache.lucene.store.MockDirectoryWrapper
[junit4:junit4]   2> 56243 T1718 oasu.CommitTracker.<init> Hard AutoCommit: disabled
[junit4:junit4]   2> 56243 T1718 oasu.CommitTracker.<init> Soft AutoCommit: disabled
[junit4:junit4]   2> 56244 T1718 oashc.SpellCheckComponent.inform Initializing spell checkers
[junit4:junit4]   2> 56327 T1718 oass.DirectSolrSpellChecker.init init: {name=direct,classname=DirectSolrSpellChecker,field=lowerfilt,minQueryLength=3}
[junit4:junit4]   2> 56343 T1718 oashc.HttpShardHandlerFactory.getParameter Setting socketTimeout to: 0
[junit4:junit4]   2> 56343 T1718 oashc.HttpShardHandlerFactory.getParameter Setting urlScheme to: http://
[junit4:junit4]   2> 56343 T1718 oashc.HttpShardHandlerFactory.getParameter Setting connTimeout to: 0
[junit4:junit4]   2> 56344 T1718 oashc.HttpShardHandlerFactory.getParameter Setting maxConnectionsPerHost to: 20
[junit4:junit4]   2> 56344 T1718 oashc.HttpShardHandlerFactory.getParameter Setting corePoolSize to: 0
[junit4:junit4]   2> 56344 T1718 oashc.HttpShardHandlerFactory.getParameter Setting maximumPoolSize to: 2147483647
[junit4:junit4]   2> 56345 T1718 oashc.HttpShardHandlerFactory.getParameter Setting maxThreadIdleTime to: 5
[junit4:junit4]   2> 56345 T1718 oashc.HttpShardHandlerFactory.getParameter Setting sizeOfQueue to: -1
[junit4:junit4]   2> 56345 T1718 oashc.HttpShardHandlerFactory.getParameter Setting fairnessPolicy to: false
[junit4:junit4]   2> 56346 T1718 oascsi.HttpClientUtil.createClient Creating new http client, config:maxConnectionsPerHost=20&maxConnections=10000&socketTimeout=0&connTimeout=0&retry=false
[junit4:junit4]   2> 56351 T1725 oasc.SolrCore.registerSearcher [collection1] Registered new searcher Searcher@c26604a main{StandardDirectoryReader(segments_1:1)}
[junit4:junit4]   2> 56352 T1718 oasc.CoreContainer.register registering core: collection1
[junit4:junit4]   2> 56353 T1718 oasu.AbstractSolrTestCase.setUp ####SETUP_END testFieldStatisticsResultsDateField
[junit4:junit4]   2> ASYNC  NEW_CORE C144 name=collection1 org.apache.solr.core.SolrCore@736c9848
[junit4:junit4]   2> 56356 T1718 C144 oasc.SolrDeletionPolicy.onInit SolrDeletionPolicy.onInit: commits:num=1
[junit4:junit4]   2> 		commit{dir=MockDirWrapper(NRTCachingDirectory(org.apache.lucene.store.RAMDirectory@18194e8b lockFactory=org.apache.lucene.store.NativeFSLockFactory@f7c73747; maxCacheMB=0.76171875 maxMergeSizeMB=0.833984375)),segFN=segments_1,generation=1,filenames=[segments_1]
[junit4:junit4]   2> 56357 T1718 C144 oasc.SolrDeletionPolicy.updateCommits newest commit = 1
[junit4:junit4]   2> 56357 T1718 C144 UPDATE [collection1] webapp=null path=null params={} {add=[1]} 0 2
[junit4:junit4]   2> 56362 T1718 C144 UPDATE [collection1] webapp=null path=null params={} {add=[2]} 0 0
[junit4:junit4]   2> 56365 T1718 C144 UPDATE [collection1] webapp=null path=null params={} {add=[3]} 0 0
[junit4:junit4]   2> 56368 T1718 C144 oasu.DirectUpdateHandler2.commit start commit{flags=0,_version_=0,optimize=false,openSearcher=true,waitSearcher=true,expungeDeletes=false,softCommit=false}
[junit4:junit4]   2> 56370 T1718 C144 oasc.SolrDeletionPolicy.onCommit SolrDeletionPolicy.onCommit: commits:num=2
[junit4:junit4]   2> 		commit{dir=MockDirWrapper(NRTCachingDirectory(org.apache.lucene.store.RAMDirectory@18194e8b lockFactory=org.apache.lucene.store.NativeFSLockFactory@f7c73747; maxCacheMB=0.76171875 maxMergeSizeMB=0.833984375)),segFN=segments_1,generation=1,filenames=[segments_1]
[junit4:junit4]   2> 		commit{dir=MockDirWrapper(NRTCachingDirectory(org.apache.lucene.store.RAMDirectory@18194e8b lockFactory=org.apache.lucene.store.NativeFSLockFactory@f7c73747; maxCacheMB=0.76171875 maxMergeSizeMB=0.833984375)),segFN=segments_2,generation=2,filenames=[_0_Pulsing40_0.tip, _0_MockVariableIntBlock_0.tib, _0.fnm, _0_MockVariableIntBlock_0.pos, _0_MockVariableIntBlock_0.tii, _0_Pulsing40_0.frq, _0_MockVariableIntBlock_0.doc, _0_MockVariableIntBlock_0.skp, segments_2, _0.si, _0_MockVariableIntBlock_0.pyl, _0.fdt, _0_MockVariableIntBlock_0.frq, _0_Pulsing40_0.prx, _0.fdx, _0_Pulsing40_0.tim]
[junit4:junit4]   2> 56370 T1718 C144 oasc.SolrDeletionPolicy.updateCommits newest commit = 2
[junit4:junit4]   2> 56371 T1718 C144 oass.SolrIndexSearcher.<init> Opening Searcher@e809edf2 main
[junit4:junit4]   2> 56372 T1718 C144 oass.SolrIndexSearcher.getIndexDir WARNING WARNING: Directory impl does not support setting indexDir: org.apache.lucene.store.MockDirectoryWrapper
[junit4:junit4]   2> 56372 T1718 C144 oasu.DirectUpdateHandler2.commit end_commit_flush
[junit4:junit4]   2> 56373 T1725 oasc.SolrCore.registerSearcher [collection1] Registered new searcher Searcher@e809edf2 main{StandardDirectoryReader(segments_2:3 _0(5.0):C3)}
[junit4:junit4]   2> 56374 T1718 C144 UPDATE [collection1] webapp=null path=null params={} {commit=} 0 6
[junit4:junit4]   2> 56375 T1718 C144 REQ [collection1] webapp=null path=null params={q=*:*&stats.field=active_dt&indent=true&stats=true} hits=3 status=0 QTime=0 
[junit4:junit4]   2> 56378 T1718 oasu.AbstractSolrTestCase.tearDown ####TEARDOWN_START testFieldStatisticsResultsDateField
[junit4:junit4]   2> 56378 T1718 oasc.CoreContainer.shutdown Shutting down CoreContainer instance=2006668485
[junit4:junit4]   2> 56378 T1718 oasc.SolrCore.close [collection1]  CLOSING SolrCore org.apache.solr.core.SolrCore@736c9848
[junit4:junit4]   2> 56384 T1718 oasc.SolrCore.closeSearcher [collection1] Closing main searcher on request.
[junit4:junit4]   2> 56384 T1718 oasu.DirectUpdateHandler2.close closing DirectUpdateHandler2{commits=1,autocommits=0,soft autocommits=0,optimizes=0,rollbacks=0,expungeDeletes=0,docsPending=0,adds=0,deletesById=0,deletesByQuery=0,errors=0,cumulative_adds=3,cumulative_deletesById=0,cumulative_deletesByQuery=0,cumulative_errors=0}
[junit4:junit4]   2> 56384 T1718 oasu.DefaultSolrCoreState.decref SolrCoreState ref count has reached 0 - closing IndexWriter
[junit4:junit4]   2> 56386 T1718 oasu.DefaultSolrCoreState.decref Closing SolrCoreState - canceling any ongoing recovery
[junit4:junit4]   2> NOTE: test params are: codec=Lucene40: {active_i=MockFixedIntBlock(blockSize=1165), other_s=MockFixedIntBlock(blockSize=1165), active_dt=Pulsing40(freqCutoff=15 minBlockSize=78 maxBlockSize=202), foo_ss=Pulsing40(freqCutoff=15 minBlockSize=78 maxBlockSize=202), stats_i=Pulsing40(freqCutoff=15 minBlockSize=78 maxBlockSize=202), active_s=PostingsFormat(name=MockRandom), id=MockVariableIntBlock(baseBlockSize=85)}, sim=RandomSimilarityProvider(queryNorm=true,coord=no): {}, locale=sl_SI_PREEURO, timezone=Mexico/BajaSur
[junit4:junit4]   2> NOTE: Linux 3.2.0-29-generic amd64/IBM Corporation 1.7.0 (64-bit)/cpus=8,threads=1,free=156244640,total=244252672
[junit4:junit4]   2> NOTE: All tests run in this JVM: [TestDocumentBuilder, SearchHandlerTest, JSONWriterTest, DistanceFunctionTest, TestDefaultSimilarityFactory, BadComponentTest, NoCacheHeaderTest, TestJmxMonitoredMap, DistributedTermsComponentTest, TestLFUCache, TestBadConfig, MBeansHandlerTest, TermVectorComponentDistributedTest, PreAnalyzedFieldTest, TermsComponentTest, TestFaceting, TestSystemIdResolver, WordBreakSolrSpellCheckerTest, SolrPluginUtilsTest, FastVectorHighlighterTest, CurrencyFieldTest, TestQuerySenderNoQuery, FieldAnalysisRequestHandlerTest, CacheHeaderTest, TestNumberUtils, TestXIncludeConfig, SuggesterWFSTTest, TestConfig, TestSearchPerf, TestPseudoReturnFields, MoreLikeThisHandlerTest, AlternateDirectoryTest, AutoCommitTest, TestCharFilters, TestFastOutputStream, TestStressVersions, JsonLoaderTest, ResourceLoaderTest, TestIndexSearcher, CSVRequestHandlerTest, SpellCheckCollatorTest, TestWordDelimiterFilterFactory, TestPHPSerializedResponseWriter, FileBasedSpellCheckerTest, CoreAdminHandlerTest, HighlighterConfigTest, DirectUpdateHandlerOptimizeTest, TestRangeQuery, TestJoin, PluginInfoTest, ZkControllerTest, MinimalSchemaTest, BasicDistributedZkTest, SpellCheckComponentTest, FullSolrCloudDistribCmdsTest, TestReplicationHandler, LeaderElectionIntegrationTest, TestRandomFaceting, TestExtendedDismaxParser, StatsComponentTest]
[junit4:junit4] Completed on J0 in 2.51s, 7 tests, 1 error <<< FAILURES!

[...truncated 122 lines...]
[junit4:junit4] Suite: org.apache.solr.handler.component.DistributedQueryElevationComponentTest
[junit4:junit4]   2> 4 T1848 oas.SolrTestCaseJ4.setUp ###Starting testDistribSearch
[junit4:junit4]   2> 5 T1848 oejs.Server.doStart jetty-8.1.2.v20120308
[junit4:junit4]   2> 8 T1848 oejs.AbstractConnector.doStart Started SocketConnector@0.0.0.0:60953
[junit4:junit4]   2> 9 T1848 oasc.SolrResourceLoader.locateSolrHome JNDI not configured for solr (NoInitialContextEx)
[junit4:junit4]   2> 10 T1848 oasc.SolrResourceLoader.locateSolrHome using system property solr.solr.home: /mnt/ssd/jenkins/workspace/Lucene-Solr-trunk-Linux/solr/build/solr-core/test-files/solr
[junit4:junit4]   2> 11 T1848 oasc.SolrResourceLoader.<init> new SolrResourceLoader for deduced Solr Home: '/mnt/ssd/jenkins/workspace/Lucene-Solr-trunk-Linux/solr/build/solr-core/test-files/solr/'
[junit4:junit4]   2> 19 T1848 oass.SolrDispatchFilter.init SolrDispatchFilter.init()
[junit4:junit4]   2> 20 T1848 oasc.SolrResourceLoader.locateSolrHome JNDI not configured for solr (NoInitialContextEx)
[junit4:junit4]   2> 20 T1848 oasc.SolrResourceLoader.locateSolrHome using system property solr.solr.home: /mnt/ssd/jenkins/workspace/Lucene-Solr-trunk-Linux/solr/build/solr-core/test-files/solr
[junit4:junit4]   2> 20 T1848 oasc.CoreContainer$Initializer.initialize looking for solr.xml: /mnt/ssd/jenkins/workspace/Lucene-Solr-trunk-Linux/solr/build/solr-core/test-files/solr/solr.xml
[junit4:junit4]   2> 21 T1848 oasc.CoreContainer.<init> New CoreContainer -805485460
[junit4:junit4]   2> 21 T1848 oasc.CoreContainer.load Loading CoreContainer using Solr Home: '/mnt/ssd/jenkins/workspace/Lucene-Solr-trunk-Linux/solr/build/solr-core/test-files/solr/'
[junit4:junit4]   2> 22 T1848 oasc.SolrResourceLoader.<init> new SolrResourceLoader for directory: '/mnt/ssd/jenkins/workspace/Lucene-Solr-trunk-Linux/solr/build/solr-core/test-files/solr/'
[junit4:junit4]   2> 32 T1848 oasc.CoreContainer.load Registering Log Listener
[junit4:junit4]   2> 41 T1848 oasc.CoreContainer.create Creating SolrCore 'collection1' using instanceDir: /mnt/ssd/jenkins/workspace/Lucene-Solr-trunk-Linux/solr/build/solr-core/test-files/solr/collection1
[junit4:junit4]   2> 41 T1848 oasc.SolrResourceLoader.<init> new SolrResourceLoader for directory: '/mnt/ssd/jenkins/workspace/Lucene-Solr-trunk-Linux/solr/build/solr-core/test-files/solr/collection1/'
[junit4:junit4]   2> 42 T1848 oasc.SolrResourceLoader.replaceClassLoader Adding 'file:/mnt/ssd/jenkins/workspace/Lucene-Solr-trunk-Linux/solr/build/solr-core/test-files/solr/collection1/lib/README' to classloader
[junit4:junit4]   2> 42 T1848 oasc.SolrResourceLoader.replaceClassLoader Adding 'file:/mnt/ssd/jenkins/workspace/Lucene-Solr-trunk-Linux/solr/build/solr-core/test-files/solr/collection1/lib/classes/' to classloader
[junit4:junit4]   2> 60 T1848 oasc.SolrConfig.<init> Using Lucene MatchVersion: LUCENE_50
[junit4:junit4]   2> 87 T1848 oasc.SolrConfig.<init> Loaded SolrConfig: solrconfig-elevate.xml
[junit4:junit4]   2> 88 T1848 oass.IndexSchema.readSchema Reading Solr Schema
[junit4:junit4]   2> 91 T1848 oass.IndexSchema.readSchema Schema name=example
[junit4:junit4]   2> 211 T1848 oass.IndexSchema.readSchema default search field in schema is text
[junit4:junit4]   2> 213 T1848 oass.IndexSchema.readSchema unique key field: id
[junit4:junit4]   2> 216 T1848 oasc.SolrCore.<init> [collection1] Opening new SolrCore at /mnt/ssd/jenkins/workspace/Lucene-Solr-trunk-Linux/solr/build/solr-core/test-files/solr/collection1/, dataDir=./org.apache.solr.handler.component.DistributedQueryElevationComponentTest-1347329112872/control/data/
[junit4:junit4]   2> 216 T1848 oasc.JmxMonitoredMap.<init> JMX monitoring is enabled. Adding Solr mbeans to JMX Server: com.sun.jmx.mbeanserver.JmxMBeanServer@cc6d7070
[junit4:junit4]   2> 217 T1848 oasc.SolrCore.getNewIndexDir WARNING New index directory detected: old=null new=./org.apache.solr.handler.component.DistributedQueryElevationComponentTest-1347329112872/control/data/index/
[junit4:junit4]   2> 217 T1848 oasc.SolrCore.initIndex WARNING [collection1] Solr index directory './org.apache.solr.handler.component.DistributedQueryElevationComponentTest-1347329112872/control/data/index' doesn't exist. Creating new index...
[junit4:junit4]   2> 218 T1848 oasc.CachingDirectoryFactory.get return new directory for /mnt/ssd/jenkins/workspace/Lucene-Solr-trunk-Linux/solr/build/solr-core/test/J0/./org.apache.solr.handler.component.DistributedQueryElevationComponentTest-1347329112872/control/data/index forceNew:false
[junit4:junit4]   2> 219 T1848 oasc.SolrDeletionPolicy.onCommit SolrDeletionPolicy.onCommit: commits:num=1
[junit4:junit4]   2> 		commit{dir=MockDirWrapper(org.apache.lucene.store.RAMDirectory@da7765f7 lockFactory=org.apache.lucene.store.SingleInstanceLockFactory@d8e2aea),segFN=segments_1,generation=1,filenames=[segments_1]
[junit4:junit4]   2> 219 T1848 oasc.SolrDeletionPolicy.updateCommits newest commit = 1
[junit4:junit4]   2> 221 T1848 oasc.RequestHandlers.initHandlersFromConfig created /update: solr.UpdateRequestHandler
[junit4:junit4]   2> 221 T1848 oasc.RequestHandlers.initHandlersFromConfig created /elevate: org.apache.solr.handler.component.SearchHandler
[junit4:junit4]   2> 222 T1848 oasc.RequestHandlers.initHandlersFromConfig created /dataElevate: org.apache.solr.handler.component.SearchHandler
[junit4:junit4]   2> 222 T1848 oashl.XMLLoader.init xsltCacheLifetimeSeconds=60
[junit4:junit4]   2> 223 T1848 oasc.RequestHandlers.initHandlersFromConfig WARNING no default request handler is registered (either '/select' or 'standard')
[junit4:junit4]   2> 224 T1848 oasc.SolrCore.initDeprecatedSupport WARNING solrconfig.xml uses deprecated <admin/gettableFiles>, Please update your config to use the ShowFileRequestHandler.
[junit4:junit4]   2> 225 T1848 oasc.SolrCore.initDeprecatedSupport WARNING adding ShowFileRequestHandler with hidden files: [BAD-SCHEMA-NOT-INDEXED-BUT-TF.XML, SCHEMA-REQUIRED-FIELDS.XML, SOLRCONFIG-MASTER1-KEEPONEBACKUP.XML, BAD-SCHEMA-NONTEXT-ANALYZER.XML, SOLRCONFIG-PROPINJECT.XML, SOLRCONFIG-PROPINJECT-INDEXDEFAULT.XML, STOP-2.TXT, SCHEMA11.XML, BAD-SCHEMA-UNIQUEKEY-USES-DEFAULT.XML, SCHEMA15.XML, SOLRCONFIG-NATIVELOCK.XML, SCHEMA-SIM.XML, CONDITIONAL.UPDATEPROCESSOR.JS, BAD-SOLRCONFIG-MISSING-SCRIPTFILE.XML, SOLRCONFIG-SCRIPT-UPDATEPROCESSOR.XML, SOLRCONFIG-REPEATER.XML, SOLRCONFIG-SPELLCHECKER.XML, SOLRCONFIG-NOCACHE.XML, SCHEMA-CHARFILTERS.XML, SOLRCONFIG-SOLCOREPROPERTIES.XML, SOLRCONFIG_CODEC.XML, BAD-SCHEMA-EXTERNAL-FILEFIELD.XML, HYPHENATION.DTD, SCHEMA.XML, SOLRCONFIG-MERGEPOLICY.XML, TRIVIAL.UPDATEPROCESSOR1.JS, SOLRCONFIG-PHRASESUGGEST.XML, SOLRCONFIG-SLAVE1.XML, SOLRCONFIG-BASIC.XML, SCHEMA-LMJELINEKMERCER.XML, BAD-MP-SOLRCONFIG.XML, BAD-SCHEMA-DUP-FIELD.XML, BAD-SCHEMA-UNIQUEKEY-MULTIVALUED.XML, SOLRCONFIG-MASTER.XML, SOLRCONFIG-HIGHLIGHT.XML, SCHEMA-TFIDF.XML, SCHEMA-REPLICATION1.XML, SYNONYMS.TXT, SOLRCONFIG-ELEVATE.XML, STOPWITHBOM.TXT, SOLRCONFIG-QUERYSENDER.XML, WDFTYPES.TXT, SOLRCONFIG-DELPOLICY1.XML, BAD_SOLRCONFIG.XML, HUNSPELL-TEST.DIC, SCHEMA-NUMERIC.XML, SCHEMA-LUCENEMATCHVERSION.XML, KEEP-2.TXT, SCHEMA-STOP-KEEP.XML, SCHEMA-IB.XML, STOP-SNOWBALL.TXT, SOLRCONFIG-SLAVE.XML, BAD-SCHEMA-NOT-INDEXED-BUT-NORMS.XML, STOPWORDSWRONGENCODING.TXT, THROW.ERROR.ON.ADD.UPDATEPROCESSOR.JS, SOLRCONFIG-SPELLCHECKCOMPONENT.XML, STOPTYPES-1.TXT, SOLRCONFIG-TLOG.XML, COMPOUNDDICTIONARY.TXT, DA_COMPOUNDDICTIONARY.TXT, SOLRCONFIG-TERMINDEX.XML, BAD-SOLRCONFIG-INVALID-SCRIPTFILE.XML, SCHEMASURROUND.XML, OPEN-EXCHANGE-RATES.JSON, BAD-SCHEMA-DUP-FIELDTYPE.XML, PHRASESUGGEST.TXT, SOLRCONFIG-MASTER2.XML, OLD_SYNONYMS.TXT, BAD-SCHEMA-UNIQUEKEY-IS-COPYFIELD-DEST.XML, SCHEMA-NOT-REQUIRED-UNIQUE-KEY.XML, BAD-SCHEMA-CODEC-GLOBAL-VS-FT-MISMATCH.XML, SCHEMA-LMDIRICHLET.XML, SCHEMA-REVERSED.XML, BAD-SCHEMA-NOT-INDEXED-BUT-POS.XML, SCHEMA-FOLDING.XML, SOLRCONFIG-CACHING.XML, MAPPING-ISOLATIN1ACCENT.TXT, ADDFIELDS.UPDATEPROCESSOR.JS, SCHEMA-BM25.XML, STOP-1.TXT, SOLRCONFIG-ENABLEPLUGIN.XML, MISSING.FUNCTIONS.UPDATEPROCESSOR.JS, SCHEMA12.XML, SOLRCONFIG-TRANSFORMERS.XML, SCHEMA-COPYFIELD-TEST.XML, BAD-SCHEMA-DUP-DYNAMICFIELD.XML, CURRENCY.XML, DA_UTF8.XML, MISSLEADING.EXTENSION.UPDATEPROCESSOR.JS.TXT, SOLRCONFIG-SOLR-749.XML, STOPWORDS.TXT, HUNSPELL-TEST.AFF, SOLRCONFIG_PERF.XML, SOLRCONFIG-SIMPLELOCK.XML, FRENCHARTICLES.TXT, SOLRCONFIG-LAZYWRITER.XML, SCHEMA-REPLICATION2.XML, SOLRCONFIG-XINCLUDE.XML, SCHEMA-SPELLCHECKER.XML, XSLT, SOLRCONFIG-DELPOLICY2.XML, TRIVIAL.UPDATEPROCESSOR0.JS, KEEP-1.TXT, SCHEMA-TRIE.XML, SCHEMA-BINARYFIELD.XML, BAD-SCHEMA-OMIT-TF-BUT-NOT-POS.XML, SCHEMA-MINIMAL.XML, STOPTYPES-2.TXT, STEMDICT.TXT, SCHEMA_CODEC.XML, ELEVATE.XML, SCHEMA-COLLATE.XML, PROTWORDS.TXT, SOLRCONFIG-REQHANDLER.INCL, SCHEMA-PHRASESUGGEST.XML, SCHEMA-DFR.XML, BAD-SCHEMA-ANALYZER-CLASS-AND-NESTED.XML, SOLRCONFIG-MASTER1.XML, SOLRCONFIG-FUNCTIONQUERY.XML, SOLRCONFIG-MASTER3.XML, SOLRCONFIG-UPDATE-PROCESSOR-CHAINS.XML, SOLRCONFIG-ALTDIRECTORY.XML, BAD-SCHEMA-SIM-GLOBAL-VS-FT-MISMATCH.XML, SOLRCONFIG-QUERYSENDER-NOQUERY.XML, BAD-SOLRCONFIG-BOGUS-SCRIPTENGINE-NAME.XML]
[junit4:junit4]   2> 226 T1848 oass.SolrIndexSearcher.<init> Opening Searcher@5b90da22 main
[junit4:junit4]   2> 227 T1848 oass.SolrIndexSearcher.getIndexDir WARNING WARNING: Directory impl does not support setting indexDir: org.apache.lucene.store.MockDirectoryWrapper
[junit4:junit4]   2> 227 T1848 oasu.CommitTracker.<init> Hard AutoCommit: disabled
[junit4:junit4]   2> 228 T1848 oasu.CommitTracker.<init> Soft AutoCommit: disabled
[junit4:junit4]   2> 228 T1848 oashc.QueryElevationComponent.inform Loading QueryElevation from: /mnt/ssd/jenkins/workspace/Lucene-Solr-trunk-Linux/solr/build/solr-core/test-files/solr/collection1/conf/elevate.xml
[junit4:junit4]   2> 235 T1848 oashc.QueryElevationComponent.inform Loading QueryElevation from: /mnt/ssd/jenkins/workspace/Lucene-Solr-trunk-Linux/solr/build/solr-core/test-files/solr/collection1/conf/elevate.xml
[junit4:junit4]   2> 241 T1848 oashc.HttpShardHandlerFactory.getParameter Setting socketTimeout to: 0
[junit4:junit4]   2> 242 T1848 oashc.HttpShardHandlerFactory.getParameter Setting urlScheme to: http://
[junit4:junit4]   2> 242 T1848 oashc.HttpShardHandlerFactory.getParameter Setting connTimeout to: 0
[junit4:junit4]   2> 242 T1848 oashc.HttpShardHandlerFactory.getParameter Setting maxConnectionsPerHost to: 20
[junit4:junit4]   2> 243 T1848 oashc.HttpShardHandlerFactory.getParameter Setting corePoolSize to: 0
[junit4:junit4]   2> 243 T1848 oashc.HttpShardHandlerFactory.getParameter Setting maximumPoolSize to: 2147483647
[junit4:junit4]   2> 244 T1848 oashc.HttpShardHandlerFactory.getParameter Setting maxThreadIdleTime to: 5
[junit4:junit4]   2> 244 T1848 oashc.HttpShardHandlerFactory.getParameter Setting sizeOfQueue to: -1
[junit4:junit4]   2> 245 T1848 oashc.HttpShardHandlerFactory.getParameter Setting fairnessPolicy to: false
[junit4:junit4]   2> 245 T1848 oascsi.HttpClientUtil.createClient Creating new http client, config:maxConnectionsPerHost=20&maxConnections=10000&socketTimeout=0&connTimeout=0&retry=false
[junit4:junit4]   2> 248 T1858 oasc.SolrCore.registerSearcher [collection1] Registered new searcher Searcher@5b90da22 main{StandardDirectoryReader(segments_1:1)}
[junit4:junit4]   2> 249 T1848 oasc.CoreContainer.register registering core: collection1
[junit4:junit4]   2> 249 T1848 oass.SolrDispatchFilter.init user.dir=/mnt/ssd/jenkins/workspace/Lucene-Solr-trunk-Linux/solr/build/solr-core/test/J0
[junit4:junit4]   2> 250 T1848 oass.SolrDispatchFilter.init SolrDispatchFilter.init() done
[junit4:junit4]   2> 250 T1848 oascsi.HttpClientUtil.createClient Creating new http client, config:maxConnections=128&maxConnectionsPerHost=32&followRedirects=false
[junit4:junit4]   2> 253 T1848 oejs.Server.doStart jetty-8.1.2.v20120308
[junit4:junit4]   2> 254 T1848 oejs.AbstractConnector.doStart Started SocketConnector@0.0.0.0:36032
[junit4:junit4]   2> 255 T1848 oasc.SolrResourceLoader.locateSolrHome JNDI not configured for solr (NoInitialContextEx)
[junit4:junit4]   2> 255 T1848 oasc.SolrResourceLoader.locateSolrHome using system property solr.solr.home: /mnt/ssd/jenkins/workspace/Lucene-Solr-trunk-Linux/solr/build/solr-core/test-files/solr
[junit4:junit4]   2> 255 T1848 oasc.SolrResourceLoader.<init> new SolrResourceLoader for deduced Solr Home: '/mnt/ssd/jenkins/workspace/Lucene-Solr-trunk-Linux/solr/build/solr-core/test-files/solr/'
[junit4:junit4]   2> 263 T1848 oass.SolrDispatchFilter.init SolrDispatchFilter.init()
[junit4:junit4]   2> 263 T1848 oasc.SolrResourceLoader.locateSolrHome JNDI not configured for solr (NoInitialContextEx)
[junit4:junit4]   2> 263 T1848 oasc.SolrResourceLoader.locateSolrHome using system property solr.solr.home: /mnt/ssd/jenkins/workspace/Lucene-Solr-trunk-Linux/solr/build/solr-core/test-files/solr
[junit4:junit4]   2> 264 T1848 oasc.CoreContainer$Initializer.initialize looking for solr.xml: /mnt/ssd/jenkins/workspace/Lucene-Solr-trunk-Linux/solr/build/solr-core/test-files/solr/solr.xml
[junit4:junit4]   2> 264 T1848 oasc.CoreContainer.<init> New CoreContainer 1346386901
[junit4:junit4]   2> 265 T1848 oasc.CoreContainer.load Loading CoreContainer using Solr Home: '/mnt/ssd/jenkins/workspace/Lucene-Solr-trunk-Linux/solr/build/solr-core/test-files/solr/'
[junit4:junit4]   2> 265 T1848 oasc.SolrResourceLoader.<init> new SolrResourceLoader for directory: '/mnt/ssd/jenkins/workspace/Lucene-Solr-trunk-Linux/solr/build/solr-core/test-files/solr/'
[junit4:junit4]   2> 275 T1848 oasc.CoreContainer.load Registering Log Listener
[junit4:junit4]   2> 284 T1848 oasc.CoreContainer.create Creating SolrCore 'collection1' using instanceDir: /mnt/ssd/jenkins/workspace/Lucene-Solr-trunk-Linux/solr/build/solr-core/test-files/solr/collection1
[junit4:junit4]   2> 284 T1848 oasc.SolrResourceLoader.<init> new SolrResourceLoader for directory: '/mnt/ssd/jenkins/workspace/Lucene-Solr-trunk-Linux/solr/build/solr-core/test-files/solr/collection1/'
[junit4:junit4]   2> 285 T1848 oasc.SolrResourceLoader.replaceClassLoader Adding 'file:/mnt/ssd/jenkins/workspace/Lucene-Solr-trunk-Linux/solr/build/solr-core/test-files/solr/collection1/lib/README' to classloader
[junit4:junit4]   2> 285 T1848 oasc.SolrResourceLoader.replaceClassLoader Adding 'file:/mnt/ssd/jenkins/workspace/Lucene-Solr-trunk-Linux/solr/build/solr-core/test-files/solr/collection1/lib/classes/' to classloader
[junit4:junit4]   2> 303 T1848 oasc.SolrConfig.<init> Using Lucene MatchVersion: LUCENE_50
[junit4:junit4]   2> 335 T1848 oasc.SolrConfig.<init> Loaded SolrConfig: solrconfig-elevate.xml
[junit4:junit4]   2> 336 T1848 oass.IndexSchema.readSchema Reading Solr Schema
[junit4:junit4]   2> 339 T1848 oass.IndexSchema.readSchema Schema name=example
[junit4:junit4]   2> 445 T1848 oass.IndexSchema.readSchema default search field in schema is text
[junit4:junit4]   2> 447 T1848 oass.IndexSchema.readSchema unique key field: id
[junit4:junit4]   2> 450 T1848 oasc.SolrCore.<init> [collection1] Opening new SolrCore at /mnt/ssd/jenkins/workspace/Lucene-Solr-trunk-Linux/solr/build/solr-core/test-files/solr/collection1/, dataDir=./org.apache.solr.handler.component.DistributedQueryElevationComponentTest-1347329112872/shard0/data/
[junit4:junit4]   2> 450 T1848 oasc.JmxMonitoredMap.<init> JMX monitoring is enabled. Adding Solr mbeans to JMX Server: com.sun.jmx.mbeanserver.JmxMBeanServer@cc6d7070
[junit4:junit4]   2> 451 T1848 oasc.SolrCore.getNewIndexDir WARNING New index directory detected: old=null new=./org.apache.solr.handler.component.DistributedQueryElevationComponentTest-1347329112872/shard0/data/index/
[junit4:junit4]   2> 451 T1848 oasc.SolrCore.initIndex WARNING [collection1] Solr index directory './org.apache.solr.handler.component.DistributedQueryElevationComponentTest-1347329112872/shard0/data/index' doesn't exist. Creating new index...
[junit4:junit4]   2> 452 T1848 oasc.CachingDirectoryFactory.get return new directory for /mnt/ssd/jenkins/workspace/Lucene-Solr-trunk-Linux/solr/build/solr-core/test/J0/./org.apache.solr.handler.component.DistributedQueryElevationComponentTest-1347329112872/shard0/data/index forceNew:false
[junit4:junit4]   2> 453 T1848 oasc.SolrDeletionPolicy.onCommit SolrDeletionPolicy.onCommit: commits:num=1
[junit4:junit4]   2> 		commit{dir=MockDirWrapper(org.apache.lucene.store.RAMDirectory@2a48101b lockFactory=org.apache.lucene.store.SingleInstanceLockFactory@4b0cb1e4),segFN=segments_1,generation=1,filenames=[segments_1]
[junit4:junit4]   2> 453 T1848 oasc.SolrDeletionPolicy.updateCommits newest commit = 1
[junit4:junit4]   2> 455 T1848 oasc.RequestHandlers.initHandlersFromConfig created /update: solr.UpdateRequestHandler
[junit4:junit4]   2> 456 T1848 oasc.RequestHandlers.initHandlersFromConfig created /elevate: org.apache.solr.handler.component.SearchHandler
[junit4:junit4]   2> 456 T1848 oasc.RequestHandlers.initHandlersFromConfig created /dataElevate: org.apache.solr.handler.component.SearchHandler
[junit4:junit4]   2> 457 T1848 oashl.XMLLoader.init xsltCacheLifetimeSeconds=60
[junit4:junit4]   2> 457 T1848 oasc.RequestHandlers.initHandlersFromConfig WARNING no default request handler is registered (either '/select' or 'standard')
[junit4:junit4]   2> 458 T1848 oasc.SolrCore.initDeprecatedSupport WARNING solrconfig.xml uses deprecated <admin/gettableFiles>, Please update your config to use the ShowFileRequestHandler.
[junit4:junit4]   2> 460 T1848 oasc.SolrCore.initDeprecatedSupport WARNING adding ShowFileRequestHandler with hidden files: [BAD-SCHEMA-NOT-INDEXED-BUT-TF.XML, SCHEMA-REQUIRED-FIELDS.XML, SOLRCONFIG-MASTER1-KEEPONEBACKUP.XML, BAD-SCHEMA-NONTEXT-ANALYZER.XML, SOLRCONFIG-PROPINJECT.XML, SOLRCONFIG-PROPINJECT-INDEXDEFAULT.XML, STOP-2.TXT, SCHEMA11.XML, BAD-SCHEMA-UNIQUEKEY-USES-DEFAULT.XML, SCHEMA15.XML, SOLRCONFIG-NATIVELOCK.XML, SCHEMA-SIM.XML, CONDITIONAL.UPDATEPROCESSOR.JS, BAD-SOLRCONFIG-MISSING-SCRIPTFILE.XML, SOLRCONFIG-SCRIPT-UPDATEPROCESSOR.XML, SOLRCONFIG-REPEATER.XML, SOLRCONFIG-SPELLCHECKER.XML, SOLRCONFIG-NOCACHE.XML, SCHEMA-CHARFILTERS.XML, SOLRCONFIG-SOLCOREPROPERTIES.XML, SOLRCONFIG_CODEC.XML, BAD-SCHEMA-EXTERNAL-FILEFIELD.XML, HYPHENATION.DTD, SCHEMA.XML, SOLRCONFIG-MERGEPOLICY.XML, TRIVIAL.UPDATEPROCESSOR1.JS, SOLRCONFIG-PHRASESUGGEST.XML, SOLRCONFIG-SLAVE1.XML, SOLRCONFIG-BASIC.XML, SCHEMA-LMJELINEKMERCER.XML, BAD-MP-SOLRCONFIG.XML, BAD-SCHEMA-DUP-FIELD.XML, BAD-SCHEMA-UNIQUEKEY-MULTIVALUED.XML, SOLRCONFIG-MASTER.XML, SOLRCONFIG-HIGHLIGHT.XML, SCHEMA-TFIDF.XML, SCHEMA-REPLICATION1.XML, SYNONYMS.TXT, SOLRCONFIG-ELEVATE.XML, STOPWITHBOM.TXT, SOLRCONFIG-QUERYSENDER.XML, WDFTYPES.TXT, SOLRCONFIG-DELPOLICY1.XML, BAD_SOLRCONFIG.XML, HUNSPELL-TEST.DIC, SCHEMA-NUMERIC.XML, SCHEMA-LUCENEMATCHVERSION.XML, KEEP-2.TXT, SCHEMA-STOP-KEEP.XML, SCHEMA-IB.XML, STOP-SNOWBALL.TXT, SOLRCONFIG-SLAVE.XML, BAD-SCHEMA-NOT-INDEXED-BUT-NORMS.XML, STOPWORDSWRONGENCODING.TXT, THROW.ERROR.ON.ADD.UPDATEPROCESSOR.JS, SOLRCONFIG-SPELLCHECKCOMPONENT.XML, STOPTYPES-1.TXT, SOLRCONFIG-TLOG.XML, COMPOUNDDICTIONARY.TXT, DA_COMPOUNDDICTIONARY.TXT, SOLRCONFIG-TERMINDEX.XML, BAD-SOLRCONFIG-INVALID-SCRIPTFILE.XML, SCHEMASURROUND.XML, OPEN-EXCHANGE-RATES.JSON, BAD-SCHEMA-DUP-FIELDTYPE.XML, PHRASESUGGEST.TXT, SOLRCONFIG-MASTER2.XML, OLD_SYNONYMS.TXT, BAD-SCHEMA-UNIQUEKEY-IS-COPYFIELD-DEST.XML, SCHEMA-NOT-REQUIRED-UNIQUE-KEY.XML, BAD-SCHEMA-CODEC-GLOBAL-VS-FT-MISMATCH.XML, SCHEMA-LMDIRICHLET.XML, SCHEMA-REVERSED.XML, BAD-SCHEMA-NOT-INDEXED-BUT-POS.XML, SCHEMA-FOLDING.XML, SOLRCONFIG-CACHING.XML, MAPPING-ISOLATIN1ACCENT.TXT, ADDFIELDS.UPDATEPROCESSOR.JS, SCHEMA-BM25.XML, STOP-1.TXT, SOLRCONFIG-ENABLEPLUGIN.XML, MISSING.FUNCTIONS.UPDATEPROCESSOR.JS, SCHEMA12.XML, SOLRCONFIG-TRANSFORMERS.XML, SCHEMA-COPYFIELD-TEST.XML, BAD-SCHEMA-DUP-DYNAMICFIELD.XML, CURRENCY.XML, DA_UTF8.XML, MISSLEADING.EXTENSION.UPDATEPROCESSOR.JS.TXT, SOLRCONFIG-SOLR-749.XML, STOPWORDS.TXT, HUNSPELL-TEST.AFF, SOLRCONFIG_PERF.XML, SOLRCONFIG-SIMPLELOCK.XML, FRENCHARTICLES.TXT, SOLRCONFIG-LAZYWRITER.XML, SCHEMA-REPLICATION2.XML, SOLRCONFIG-XINCLUDE.XML, SCHEMA-SPELLCHECKER.XML, XSLT, SOLRCONFIG-DELPOLICY2.XML, TRIVIAL.UPDATEPROCESSOR0.JS, KEEP-1.TXT, SCHEMA-TRIE.XML, SCHEMA-BINARYFIELD.XML, BAD-SCHEMA-OMIT-TF-BUT-NOT-POS.XML, SCHEMA-MINIMAL.XML, STOPTYPES-2.TXT, STEMDICT.TXT, SCHEMA_CODEC.XML, ELEVATE.XML, SCHEMA-COLLATE.XML, PROTWORDS.TXT, SOLRCONFIG-REQHANDLER.INCL, SCHEMA-PHRASESUGGEST.XML, SCHEMA-DFR.XML, BAD-SCHEMA-ANALYZER-CLASS-AND-NESTED.XML, SOLRCONFIG-MASTER1.XML, SOLRCONFIG-FUNCTIONQUERY.XML, SOLRCONFIG-MASTER3.XML, SOLRCONFIG-UPDATE-PROCESSOR-CHAINS.XML, SOLRCONFIG-ALTDIRECTORY.XML, BAD-SCHEMA-SIM-GLOBAL-VS-FT-MISMATCH.XML, SOLRCONFIG-QUERYSENDER-NOQUERY.XML, BAD-SOLRCONFIG-BOGUS-SCRIPTENGINE-NAME.XML]
[junit4:junit4]   2> 461 T1848 oass.SolrIndexSearcher.<init> Opening Searcher@d6851d93 main
[junit4:junit4]   2> 462 T1848 oass.SolrIndexSearcher.getIndexDir WARNING WARNING: Directory impl does not support setting indexDir: org.apache.lucene.store.MockDirectoryWrapper
[junit4:junit4]   2> 462 T1848 oasu.CommitTracker.<init> Hard AutoCommit: disabled
[junit4:junit4]   2> 463 T1848 oasu.CommitTracker.<init> Soft AutoCommit: disabled
[junit4:junit4]   2> 464 T1848 oashc.QueryElevationComponent.inform Loading QueryElevation from: /mnt/ssd/jenkins/workspace/Lucene-Solr-trunk-Linux/solr/build/solr-core/test-files/solr/collection1/conf/elevate.xml
[junit4:junit4]   2> 471 T1848 oashc.QueryElevationComponent.inform Loading QueryElevation from: /mnt/ssd/jenkins/workspace/Lucene-Solr-trunk-Linux/solr/build/solr-core/test-files/solr/collection1/conf/elevate.xml
[junit4:junit4]   2> 478 T1848 oashc.HttpShardHandlerFactory.getParameter Setting socketTimeout to: 0
[junit4:junit4]   2> 478 T1848 oashc.HttpShardHandlerFactory.getParameter Setting urlScheme to: http://
[junit4:junit4]   2> 479 T1848 oashc.HttpShardHandlerFactory.getParameter Setting connTimeout to: 0
[junit4:junit4]   2> 479 T1848 oashc.HttpShardHandlerFactory.getParameter Setting maxConnectionsPerHost to: 20
[junit4:junit4]   2> 479 T1848 oashc.HttpShardHandlerFactory.getParameter Setting corePoolSize to: 0
[junit4:junit4]   2> 481 T1848 oashc.HttpShardHandlerFactory.getParameter Setting maximumPoolSize to: 2147483647
[junit4:junit4]   2> 481 T1848 oashc.HttpShardHandlerFactory.getParameter Setting maxThreadIdleTime to: 5
[junit4:junit4]   2> 482 T1848 oashc.HttpShardHandlerFactory.getParameter Setting sizeOfQueue to: -1
[junit4:junit4]   2> 482 T1848 oashc.HttpShardHandlerFactory.getParameter Setting fairnessPolicy to: false
[junit4:junit4]   2> 483 T1848 oascsi.HttpClientUtil.createClient Creating new http client, config:maxConnectionsPerHost=20&maxConnections=10000&socketTimeout=0&connTimeout=0&retry=false
[junit4:junit4]   2> 486 T1868 oasc.SolrCore.registerSearcher [collection1] Registered new searcher Searcher@d6851d93 main{StandardDirectoryReader(segments_1:1)}
[junit4:junit4]   2> 487 T1848 oasc.CoreContainer.register registering core: collection1
[junit4:junit4]   2> 487 T1848 oass.SolrDispatchFilter.init user.dir=/mnt/ssd/jenkins/workspace/Lucene-Solr-trunk-Linux/solr/build/solr-core/test/J0
[junit4:junit4]   2> 488 T1848 oass.SolrDispatchFilter.init SolrDispatchFilter.init() done
[junit4:junit4]   2> 488 T1848 oascsi.HttpClientUtil.createClient Creating new http client, config:maxConnections=128&maxConnectionsPerHost=32&followRedirects=false
[junit4:junit4]   2> 492 T1848 oejs.Server.doStart jetty-8.1.2.v20120308
[junit4:junit4]   2> 494 T1848 oejs.AbstractConnector.doStart Started SocketConnector@0.0.0.0:59265
[junit4:junit4]   2> 495 T1848 oasc.SolrResourceLoader.locateSolrHome JNDI not configured for solr (NoInitialContextEx)
[junit4:junit4]   2> 496 T1848 oasc.SolrResourceLoader.locateSolrHome using system property solr.solr.home: /mnt/ssd/jenkins/workspace/Lucene-Solr-trunk-Linux/solr/build/solr-core/test-files/solr
[junit4:junit4]   2> 496 T1848 oasc.SolrResourceLoader.<init> new SolrResourceLoader for deduced Solr Home: '/mnt/ssd/jenkins/workspace/Lucene-Solr-trunk-Linux/solr/build/solr-core/test-files/solr/'
[junit4:junit4]   2> 507 T1848 oass.SolrDispatchFilter.init SolrDispatchFilter.init()
[junit4:junit4]   2> 507 T1848 oasc.SolrResourceLoader.locateSolrHome JNDI not configured for solr (NoInitialContextEx)
[junit4:junit4]   2> 508 T1848 oasc.SolrResourceLoader.locateSolrHome using system property solr.solr.home: /mnt/ssd/jenkins/workspace/Lucene-Solr-trunk-Linux/solr/build/solr-core/test-files/solr
[junit4:junit4]   2> 508 T1848 oasc.CoreContainer$Initializer.initialize looking for solr.xml: /mnt/ssd/jenkins/workspace/Lucene-Solr-trunk-Linux/solr/build/solr-core/test-files/solr/solr.xml
[junit4:junit4]   2> 508 T1848 oasc.CoreContainer.<init> New CoreContainer -1032522969
[junit4:junit4]   2> 509 T1848 oasc.CoreContainer.load Loading CoreContainer using Solr Home: '/mnt/ssd/jenkins/workspace/Lucene-Solr-trunk-Linux/solr/build/solr-core/test-files/solr/'
[junit4:junit4]   2> 509 T1848 oasc.SolrResourceLoader.<init> new SolrResourceLoader for directory: '/mnt/ssd/jenkins/workspace/Lucene-Solr-trunk-Linux/solr/build/solr-core/test-files/solr/'
[junit4:junit4]   2> 519 T1848 oasc.CoreContainer.load Registering Log Listener
[junit4:junit4]   2> 528 T1848 oasc.CoreContainer.create Creating SolrCore 'collection1' using instanceDir: /mnt/ssd/jenkins/workspace/Lucene-Solr-trunk-Linux/solr/build/solr-core/test-files/solr/collection1
[junit4:junit4]   2> 529 T1848 oasc.SolrResourceLoader.<init> new SolrResourceLoader for directory: '/mnt/ssd/jenkins/workspace/Lucene-Solr-trunk-Linux/solr/build/solr-core/test-files/solr/collection1/'
[junit4:junit4]   2> 529 T1848 oasc.SolrResourceLoader.replaceClassLoader Adding 'file:/mnt/ssd/jenkins/workspace/Lucene-Solr-trunk-Linux/solr/build/solr-core/test-files/solr/collection1/lib/README' to classloader
[junit4:junit4]   2> 530 T1848 oasc.SolrResourceLoader.replaceClassLoader Adding 'file:/mnt/ssd/jenkins/workspace/Lucene-Solr-trunk-Linux/solr/build/solr-core/test-files/solr/collection1/lib/classes/' to classloader
[junit4:junit4]   2> 548 T1848 oasc.SolrConfig.<init> Using Lucene MatchVersion: LUCENE_50
[junit4:junit4]   2> 577 T1848 oasc.SolrConfig.<init> Loaded SolrConfig: solrconfig-elevate.xml
[junit4:junit4]   2> 577 T1848 oass.IndexSchema.readSchema Reading Solr Schema
[junit4:junit4]   2> 580 T1848 oass.IndexSchema.readSchema Schema name=example
[junit4:junit4]   2> 721 T1848 oass.IndexSchema.readSchema default search field in schema is text
[junit4:junit4]   2> 723 T1848 oass.IndexSchema.readSchema unique key field: id
[junit4:junit4]   2> 726 T1848 oasc.SolrCore.<init> [collection1] Opening new SolrCore at /mnt/ssd/jenkins/workspace/Lucene-Solr-trunk-Linux/solr/build/solr-core/test-files/solr/collection1/, dataDir=./org.apache.solr.handler.component.DistributedQueryElevationComponentTest-1347329112872/shard1/data/
[junit4:junit4]   2> 727 T1848 oasc.JmxMonitoredMap.<init> JMX monitoring is enabled. Adding Solr mbeans to JMX Server: com.sun.jmx.mbeanserver.JmxMBeanServer@cc6d7070
[junit4:junit4]   2> 727 T1848 oasc.SolrCore.getNewIndexDir WARNING New index directory detected: old=null new=./org.apache.solr.handler.component.DistributedQueryElevationComponentTest-1347329112872/shard1/data/index/
[junit4:junit4]   2> 728 T1848 oasc.SolrCore.initIndex WARNING [collection1] Solr index directory './org.apache.solr.handler.component.DistributedQueryElevationComponentTest-1347329112872/shard1/data/index' doesn't exist. Creating new index...
[junit4:junit4]   2> 729 T1848 oasc.CachingDirectoryFactory.get return new directory for /mnt/ssd/jenkins/workspace/Lucene-Solr-trunk-Linux/solr/build/solr-core/test/J0/./org.apache.solr.handler.component.DistributedQueryElevationComponentTest-1347329112872/shard1/data/index forceNew:false
[junit4:junit4]   2> 730 T1848 oasc.SolrDeletionPolicy.onCommit SolrDeletionPolicy.onCommit: commits:num=1
[junit4:junit4]   2> 		commit{dir=MockDirWrapper(NRTCachingDirectory(org.apache.lucene.store.RAMDirectory@e65dd08b lockFactory=org.apache.lucene.store.SingleInstanceLockFactory@72e2b49e; maxCacheMB=0.6826171875 maxMergeSizeMB=0.474609375)),segFN=segments_1,generation=1,filenames=[segments_1]
[junit4:junit4]   2> 731 T1848 oasc.SolrDeletionPolicy.updateCommits newest commit = 1
[junit4:junit4]   2> 733 T1848 oasc.RequestHandlers.initHandlersFromConfig created /update: solr.UpdateRequestHandler
[junit4:junit4]   2> 733 T1848 oasc.RequestHandlers.initHandlersFromConfig created /elevate: org.apache.solr.handler.component.SearchHandler
[junit4:junit4]   2> 734 T1848 oasc.RequestHandlers.initHandlersFromConfig created /dataElevate: org.apache.solr.handler.component.SearchHandler
[junit4:junit4]   2> 735 T1848 oashl.XMLLoader.init xsltCacheLifetimeSeconds=60
[junit4:junit4]   2> 735 T1848 oasc.RequestHandlers.initHandlersFromConfig WARNING no default request handler is registered (either '/select' or 'standard')
[junit4:junit4]   2> 736 T1848 oasc.SolrCore.initDeprecatedSupport WARNING solrconfig.xml uses deprecated <admin/gettableFiles>, Please update your config to use the ShowFileRequestHandler.
[junit4:junit4]   2> 737 T1848 oasc.SolrCore.initDeprecatedSupport WARNING adding ShowFileRequestHandler with hidden files: [BAD-SCHEMA-NOT-INDEXED-BUT-TF.XML, SCHEMA-REQUIRED-FIELDS.XML, SOLRCONFIG-MASTER1-KEEPONEBACKUP.XML, BAD-SCHEMA-NONTEXT-ANALYZER.XML, SOLRCONFIG-PROPINJECT.XML, SOLRCONFIG-PROPINJECT-INDEXDEFAULT.XML, STOP-2.TXT, SCHEMA11.XML, BAD-SCHEMA-UNIQUEKEY-USES-DEFAULT.XML, SCHEMA15.XML, SOLRCONFIG-NATIVELOCK.XML, SCHEMA-SIM.XML, CONDITIONAL.UPDATEPROCESSOR.JS, BAD-SOLRCONFIG-MISSING-SCRIPTFILE.XML, SOLRCONFIG-SCRIPT-UPDATEPROCESSOR.XML, SOLRCONFIG-REPEATER.XML, SOLRCONFIG-SPELLCHECKER.XML, SOLRCONFIG-NOCACHE.XML, SCHEMA-CHARFILTERS.XML, SOLRCONFIG-SOLCOREPROPERTIES.XML, SOLRCONFIG_CODEC.XML, BAD-SCHEMA-EXTERNAL-FILEFIELD.XML, HYPHENATION.DTD, SCHEMA.XML, SOLRCONFIG-MERGEPOLICY.XML, TRIVIAL.UPDATEPROCESSOR1.JS, SOLRCONFIG-PHRASESUGGEST.XML, SOLRCONFIG-SLAVE1.XML, SOLRCONFIG-BASIC.XML, SCHEMA-LMJELINEKMERCER.XML, BAD-MP-SOLRCONFIG.XML, BAD-SCHEMA-DUP-FIELD.XML, BAD-SCHEMA-UNIQUEKEY-MULTIVALUED.XML, SOLRCONFIG-MASTER.XML, SOLRCONFIG-HIGHLIGHT.XML, SCHEMA-TFIDF.XML, SCHEMA-REPLICATION1.XML, SYNONYMS.TXT, SOLRCONFIG-ELEVATE.XML, STOPWITHBOM.TXT, SOLRCONFIG-QUERYSENDER.XML, WDFTYPES.TXT, SOLRCONFIG-DELPOLICY1.XML, BAD_SOLRCONFIG.XML, HUNSPELL-TEST.DIC, SCHEMA-NUMERIC.XML, SCHEMA-LUCENEMATCHVERSION.XML, KEEP-2.TXT, SCHEMA-STOP-KEEP.XML, SCHEMA-IB.XML, STOP-SNOWBALL.TXT, SOLRCONFIG-SLAVE.XML, BAD-SCHEMA-NOT-INDEXED-BUT-NORMS.XML, STOPWORDSWRONGENCODING.TXT, THROW.ERROR.ON.ADD.UPDATEPROCESSOR.JS, SOLRCONFIG-SPELLCHECKCOMPONENT.XML, STOPTYPES-1.TXT, SOLRCONFIG-TLOG.XML, COMPOUNDDICTIONARY.TXT, DA_COMPOUNDDICTIONARY.TXT, SOLRCONFIG-TERMINDEX.XML, BAD-SOLRCONFIG-INVALID-SCRIPTFILE.XML, SCHEMASURROUND.XML, OPEN-EXCHANGE-RATES.JSON, BAD-SCHEMA-DUP-FIELDTYPE.XML, PHRASESUGGEST.TXT, SOLRCONFIG-MASTER2.XML, OLD_SYNONYMS.TXT, BAD-SCHEMA-UNIQUEKEY-IS-COPYFIELD-DEST.XML, SCHEMA-NOT-REQUIRED-UNIQUE-KEY.XML, BAD-SCHEMA-CODEC-GLOBAL-VS-FT-MISMATCH.XML, SCHEMA-LMDIRICHLET.XML, SCHEMA-REVERSED.XML, BAD-SCHEMA-NOT-INDEXED-BUT-POS.XML, SCHEMA-FOLDING.XML, SOLRCONFIG-CACHING.XML, MAPPING-ISOLATIN1ACCENT.TXT, ADDFIELDS.UPDATEPROCESSOR.JS, SCHEMA-BM25.XML, STOP-1.TXT, SOLRCONFIG-ENABLEPLUGIN.XML, MISSING.FUNCTIONS.UPDATEPROCESSOR.JS, SCHEMA12.XML, SOLRCONFIG-TRANSFORMERS.XML, SCHEMA-COPYFIELD-TEST.XML, BAD-SCHEMA-DUP-DYNAMICFIELD.XML, CURRENCY.XML, DA_UTF8.XML, MISSLEADING.EXTENSION.UPDATEPROCESSOR.JS.TXT, SOLRCONFIG-SOLR-749.XML, STOPWORDS.TXT, HUNSPELL-TEST.AFF, SOLRCONFIG_PERF.XML, SOLRCONFIG-SIMPLELOCK.XML, FRENCHARTICLES.TXT, SOLRCONFIG-LAZYWRITER.XML, SCHEMA-REPLICATION2.XML, SOLRCONFIG-XINCLUDE.XML, SCHEMA-SPELLCHECKER.XML, XSLT, SOLRCONFIG-DELPOLICY2.XML, TRIVIAL.UPDATEPROCESSOR0.JS, KEEP-1.TXT, SCHEMA-TRIE.XML, SCHEMA-BINARYFIELD.XML, BAD-SCHEMA-OMIT-TF-BUT-NOT-POS.XML, SCHEMA-MINIMAL.XML, STOPTYPES-2.TXT, STEMDICT.TXT, SCHEMA_CODEC.XML, ELEVATE.XML, SCHEMA-COLLATE.XML, PROTWORDS.TXT, SOLRCONFIG-REQHANDLER.INCL, SCHEMA-PHRASESUGGEST.XML, SCHEMA-DFR.XML, BAD-SCHEMA-ANALYZER-CLASS-AND-NESTED.XML, SOLRCONFIG-MASTER1.XML,

[...truncated too long message...]

its=0,optimizes=0,rollbacks=0,expungeDeletes=0,docsPending=0,adds=0,deletesById=0,deletesByQuery=0,errors=0,cumulative_adds=3,cumulative_deletesById=0,cumulative_deletesByQuery=1,cumulative_errors=0}
[junit4:junit4]   2> 11168 T1848 oasu.DefaultSolrCoreState.decref SolrCoreState ref count has reached 0 - closing IndexWriter
[junit4:junit4]   2> 11169 T1848 oasu.DefaultSolrCoreState.decref Closing SolrCoreState - canceling any ongoing recovery
[junit4:junit4]   2> 11170 T1848 oejsh.ContextHandler.doStop stopped o.e.j.s.ServletContextHandler{/solr,null}
[junit4:junit4]   2> 11222 T1848 oas.SolrTestCaseJ4.tearDown ###Ending testDistribSearch
[junit4:junit4]   2> NOTE: reproduce with: ant test  -Dtestcase=DistributedQueryElevationComponentTest -Dtests.method=testDistribSearch -Dtests.seed=8E7DF5FB0A1CFF89 -Dtests.multiplier=3 -Dtests.slow=true -Dtests.locale=vi_VN -Dtests.timezone=Brazil/DeNoronha -Dtests.file.encoding=UTF-8
[junit4:junit4] ERROR   11.2s J0 | DistributedQueryElevationComponentTest.testDistribSearch <<<
[junit4:junit4]    > Throwable #1: org.apache.solr.common.SolrException: Server at http://localhost:59265/solr returned non ok status:500, message:Server Error
[junit4:junit4]    > 	at __randomizedtesting.SeedInfo.seed([8E7DF5FB0A1CFF89:F9B7BE37D439FB5]:0)
[junit4:junit4]    > 	at org.apache.solr.client.solrj.impl.HttpSolrServer.request(HttpSolrServer.java:373)
[junit4:junit4]    > 	at org.apache.solr.client.solrj.impl.HttpSolrServer.request(HttpSolrServer.java:182)
[junit4:junit4]    > 	at org.apache.solr.client.solrj.request.QueryRequest.process(QueryRequest.java:90)
[junit4:junit4]    > 	at org.apache.solr.client.solrj.SolrServer.query(SolrServer.java:324)
[junit4:junit4]    > 	at org.apache.solr.BaseDistributedSearchTestCase.queryServer(BaseDistributedSearchTestCase.java:371)
[junit4:junit4]    > 	at org.apache.solr.BaseDistributedSearchTestCase.query(BaseDistributedSearchTestCase.java:390)
[junit4:junit4]    > 	at org.apache.solr.handler.component.DistributedQueryElevationComponentTest.doTest(DistributedQueryElevationComponentTest.java:83)
[junit4:junit4]    > 	at org.apache.solr.BaseDistributedSearchTestCase.testDistribSearch(BaseDistributedSearchTestCase.java:691)
[junit4:junit4]    > 	at sun.reflect.NativeMethodAccessorImpl.invoke0(Native Method)
[junit4:junit4]    > 	at sun.reflect.NativeMethodAccessorImpl.invoke(NativeMethodAccessorImpl.java:88)
[junit4:junit4]    > 	at sun.reflect.DelegatingMethodAccessorImpl.invoke(DelegatingMethodAccessorImpl.java:55)
[junit4:junit4]    > 	at java.lang.reflect.Method.invoke(Method.java:613)
[junit4:junit4]    > 	at com.carrotsearch.randomizedtesting.RandomizedRunner.invoke(RandomizedRunner.java:1559)
[junit4:junit4]    > 	at com.carrotsearch.randomizedtesting.RandomizedRunner.access$600(RandomizedRunner.java:79)
[junit4:junit4]    > 	at com.carrotsearch.randomizedtesting.RandomizedRunner$6.evaluate(RandomizedRunner.java:737)
[junit4:junit4]    > 	at com.carrotsearch.randomizedtesting.RandomizedRunner$7.evaluate(RandomizedRunner.java:773)
[junit4:junit4]    > 	at com.carrotsearch.randomizedtesting.RandomizedRunner$8.evaluate(RandomizedRunner.java:787)
[junit4:junit4]    > 	at com.carrotsearch.randomizedtesting.rules.SystemPropertiesRestoreRule$1.evaluate(SystemPropertiesRestoreRule.java:53)
[junit4:junit4]    > 	at org.apache.lucene.util.TestRuleSetupTeardownChained$1.evaluate(TestRuleSetupTeardownChained.java:50)
[junit4:junit4]    > 	at org.apache.lucene.util.TestRuleFieldCacheSanity$1.evaluate(TestRuleFieldCacheSanity.java:51)
[junit4:junit4]    > 	at org.apache.lucene.util.AbstractBeforeAfterRule$1.evaluate(AbstractBeforeAfterRule.java:45)
[junit4:junit4]    > 	at com.carrotsearch.randomizedtesting.rules.SystemPropertiesInvariantRule$1.evaluate(SystemPropertiesInvariantRule.java:55)
[junit4:junit4]    > 	at org.apache.lucene.util.TestRuleThreadAndTestName$1.evaluate(TestRuleThreadAndTestName.java:48)
[junit4:junit4]    > 	at org.apache.lucene.util.TestRuleIgnoreAfterMaxFailures$1.evaluate(TestRuleIgnoreAfterMaxFailures.java:70)
[junit4:junit4]    > 	at org.apache.lucene.util.TestRuleMarkFailure$1.evaluate(TestRuleMarkFailure.java:48)
[junit4:junit4]    > 	at com.carrotsearch.randomizedtesting.rules.StatementAdapter.evaluate(StatementAdapter.java:36)
[junit4:junit4]    > 	at com.carrotsearch.randomizedtesting.ThreadLeakControl$StatementRunner.run(ThreadLeakControl.java:358)
[junit4:junit4]    > 	at com.carrotsearch.randomizedtesting.ThreadLeakControl.forkTimeoutingTask(ThreadLeakControl.java:782)
[junit4:junit4]    > 	at com.carrotsearch.randomizedtesting.ThreadLeakControl$3.evaluate(ThreadLeakControl.java:442)
[junit4:junit4]    > 	at com.carrotsearch.randomizedtesting.RandomizedRunner.runSingleTest(RandomizedRunner.java:746)
[junit4:junit4]    > 	at com.carrotsearch.randomizedtesting.RandomizedRunner$3.evaluate(RandomizedRunner.java:648)
[junit4:junit4]    > 	at com.carrotsearch.randomizedtesting.RandomizedRunner$4.evaluate(RandomizedRunner.java:682)
[junit4:junit4]    > 	at com.carrotsearch.randomizedtesting.RandomizedRunner$5.evaluate(RandomizedRunner.java:693)
[junit4:junit4]    > 	at com.carrotsearch.randomizedtesting.rules.StatementAdapter.evaluate(StatementAdapter.java:36)
[junit4:junit4]    > 	at com.carrotsearch.randomizedtesting.rules.SystemPropertiesRestoreRule$1.evaluate(SystemPropertiesRestoreRule.java:53)
[junit4:junit4]    > 	at org.apache.lucene.util.AbstractBeforeAfterRule$1.evaluate(AbstractBeforeAfterRule.java:45)
[junit4:junit4]    > 	at org.apache.lucene.util.TestRuleStoreClassName$1.evaluate(TestRuleStoreClassName.java:42)
[junit4:junit4]    > 	at com.carrotsearch.randomizedtesting.rules.SystemPropertiesInvariantRule$1.evaluate(SystemPropertiesInvariantRule.java:55)
[junit4:junit4]    > 	at com.carrotsearch.randomizedtesting.rules.NoShadowingOrOverridesOnMethodsRule$1.evaluate(NoShadowingOrOverridesOnMethodsRule.java:39)
[junit4:junit4]    > 	at com.carrotsearch.randomizedtesting.rules.NoShadowingOrOverridesOnMethodsRule$1.evaluate(NoShadowingOrOverridesOnMethodsRule.java:39)
[junit4:junit4]    > 	at org.apache.lucene.util.TestRuleAssertionsRequired$1.evaluate(TestRuleAssertionsRequired.java:40)
[junit4:junit4]    > 	at org.apache.lucene.util.TestRuleMarkFailure$1.evaluate(TestRuleMarkFailure.java:48)
[junit4:junit4]    > 	at org.apache.lucene.util.TestRuleIgnoreAfterMaxFailures$1.evaluate(TestRuleIgnoreAfterMaxFailures.java:70)
[junit4:junit4]    > 	at org.apache.lucene.util.TestRuleIgnoreTestSuites$1.evaluate(TestRuleIgnoreTestSuites.java:55)
[junit4:junit4]    > 	at com.carrotsearch.randomizedtesting.rules.StatementAdapter.evaluate(StatementAdapter.java:36)
[junit4:junit4]    > 	at com.carrotsearch.randomizedtesting.ThreadLeakControl$StatementRunner.run(ThreadLeakControl.java:358)
[junit4:junit4]    > 	at java.lang.Thread.run(Thread.java:777)
[junit4:junit4]   2> 11232 T1848 oas.SolrTestCaseJ4.deleteCore ###deleteCore
[junit4:junit4]   2> NOTE: test params are: codec=Asserting, sim=DefaultSimilarity, locale=vi_VN, timezone=Brazil/DeNoronha
[junit4:junit4]   2> NOTE: Linux 3.2.0-29-generic amd64/IBM Corporation 1.7.0 (64-bit)/cpus=8,threads=1,free=61496744,total=241631232
[junit4:junit4]   2> NOTE: All tests run in this JVM: [TestDocumentBuilder, SearchHandlerTest, JSONWriterTest, DistanceFunctionTest, TestDefaultSimilarityFactory, BadComponentTest, NoCacheHeaderTest, TestJmxMonitoredMap, DistributedTermsComponentTest, TestLFUCache, TestBadConfig, MBeansHandlerTest, TermVectorComponentDistributedTest, PreAnalyzedFieldTest, TermsComponentTest, TestFaceting, TestSystemIdResolver, WordBreakSolrSpellCheckerTest, SolrPluginUtilsTest, FastVectorHighlighterTest, CurrencyFieldTest, TestQuerySenderNoQuery, FieldAnalysisRequestHandlerTest, CacheHeaderTest, TestNumberUtils, TestXIncludeConfig, SuggesterWFSTTest, TestConfig, TestSearchPerf, TestPseudoReturnFields, MoreLikeThisHandlerTest, AlternateDirectoryTest, AutoCommitTest, TestCharFilters, TestFastOutputStream, TestStressVersions, JsonLoaderTest, ResourceLoaderTest, TestIndexSearcher, CSVRequestHandlerTest, SpellCheckCollatorTest, TestWordDelimiterFilterFactory, TestPHPSerializedResponseWriter, FileBasedSpellCheckerTest, CoreAdminHandlerTest, HighlighterConfigTest, DirectUpdateHandlerOptimizeTest, TestRangeQuery, TestJoin, PluginInfoTest, ZkControllerTest, MinimalSchemaTest, BasicDistributedZkTest, SpellCheckComponentTest, FullSolrCloudDistribCmdsTest, TestReplicationHandler, LeaderElectionIntegrationTest, TestRandomFaceting, TestExtendedDismaxParser, StatsComponentTest, TestRecovery, SolrCoreTest, IndexBasedSpellCheckerTest, DirectUpdateHandlerTest, SimpleFacetsTest, TestCoreContainer, TestFiltering, BasicFunctionalityTest, TestBinaryResponseWriter, SampleTest, HighlighterTest, DirectSolrConnectionTest, TestRemoteStreaming, PolyFieldTest, DocumentBuilderTest, DistributedQueryElevationComponentTest]
[junit4:junit4] Completed on J0 in 11.25s, 1 test, 1 error <<< FAILURES!

[...truncated 197 lines...]
BUILD FAILED
/mnt/ssd/jenkins/workspace/Lucene-Solr-trunk-Linux/build.xml:29: The following error occurred while executing this line:
/mnt/ssd/jenkins/workspace/Lucene-Solr-trunk-Linux/solr/build.xml:146: The following error occurred while executing this line:
/mnt/ssd/jenkins/workspace/Lucene-Solr-trunk-Linux/lucene/module-build.xml:63: The following error occurred while executing this line:
/mnt/ssd/jenkins/workspace/Lucene-Solr-trunk-Linux/lucene/common-build.xml:1133: The following error occurred while executing this line:
/mnt/ssd/jenkins/workspace/Lucene-Solr-trunk-Linux/lucene/common-build.xml:810: There were test failures: 228 suites, 920 tests, 2 errors, 6 ignored (1 assumption)

Total time: 24 minutes 13 seconds
Build step 'Invoke Ant' marked build as failure
Recording test results
Description set: Java: 64bit/ibm-j9-jdk7 -Xjit:exclude={org/apache/lucene/util/fst/FST.pack(IIF)Lorg/apache/lucene/util/fst/FST;}
Email was triggered for: Failure
Sending email for trigger: Failure



Mime
View raw message