lucene-dev mailing list archives

Site index · List index
Message view « Date » · « Thread »
Top « Date » · « Thread »
From Apache Jenkins Server <jenk...@builds.apache.org>
Subject [JENKINS] Lucene-Solr-Tests-trunk-Java6 - Build # 15264 - Failure
Date Wed, 19 Sep 2012 09:30:59 GMT
Build: https://builds.apache.org/job/Lucene-Solr-Tests-trunk-Java6/15264/

2 tests failed.
REGRESSION:  org.apache.solr.cloud.BasicDistributedZk2Test.testDistribSearch

Error Message:
Shard still reported as live in zk

Stack Trace:
java.lang.AssertionError: Shard still reported as live in zk
	at __randomizedtesting.SeedInfo.seed([ECF880845A114B28:6D1E0E9C2D4E2B14]:0)
	at org.junit.Assert.fail(Assert.java:93)
	at org.apache.solr.cloud.AbstractFullDistribZkTestBase.waitToSeeNotLive(AbstractFullDistribZkTestBase.java:1220)
	at org.apache.solr.cloud.BasicDistributedZk2Test.brindDownShardIndexSomeDocsAndRecover(BasicDistributedZk2Test.java:190)
	at org.apache.solr.cloud.BasicDistributedZk2Test.doTest(BasicDistributedZk2Test.java:83)
	at org.apache.solr.BaseDistributedSearchTestCase.testDistribSearch(BaseDistributedSearchTestCase.java:695)
	at sun.reflect.NativeMethodAccessorImpl.invoke0(Native Method)
	at sun.reflect.NativeMethodAccessorImpl.invoke(NativeMethodAccessorImpl.java:57)
	at sun.reflect.DelegatingMethodAccessorImpl.invoke(DelegatingMethodAccessorImpl.java:43)
	at java.lang.reflect.Method.invoke(Method.java:616)
	at com.carrotsearch.randomizedtesting.RandomizedRunner.invoke(RandomizedRunner.java:1559)
	at com.carrotsearch.randomizedtesting.RandomizedRunner.access$600(RandomizedRunner.java:79)
	at com.carrotsearch.randomizedtesting.RandomizedRunner$6.evaluate(RandomizedRunner.java:737)
	at com.carrotsearch.randomizedtesting.RandomizedRunner$7.evaluate(RandomizedRunner.java:773)
	at com.carrotsearch.randomizedtesting.RandomizedRunner$8.evaluate(RandomizedRunner.java:787)
	at com.carrotsearch.randomizedtesting.rules.SystemPropertiesRestoreRule$1.evaluate(SystemPropertiesRestoreRule.java:53)
	at org.apache.lucene.util.TestRuleSetupTeardownChained$1.evaluate(TestRuleSetupTeardownChained.java:50)
	at org.apache.lucene.util.TestRuleFieldCacheSanity$1.evaluate(TestRuleFieldCacheSanity.java:51)
	at org.apache.lucene.util.AbstractBeforeAfterRule$1.evaluate(AbstractBeforeAfterRule.java:45)
	at com.carrotsearch.randomizedtesting.rules.SystemPropertiesInvariantRule$1.evaluate(SystemPropertiesInvariantRule.java:55)
	at org.apache.lucene.util.TestRuleThreadAndTestName$1.evaluate(TestRuleThreadAndTestName.java:48)
	at org.apache.lucene.util.TestRuleIgnoreAfterMaxFailures$1.evaluate(TestRuleIgnoreAfterMaxFailures.java:70)
	at org.apache.lucene.util.TestRuleMarkFailure$1.evaluate(TestRuleMarkFailure.java:48)
	at com.carrotsearch.randomizedtesting.rules.StatementAdapter.evaluate(StatementAdapter.java:36)
	at com.carrotsearch.randomizedtesting.ThreadLeakControl$StatementRunner.run(ThreadLeakControl.java:358)
	at com.carrotsearch.randomizedtesting.ThreadLeakControl.forkTimeoutingTask(ThreadLeakControl.java:782)
	at com.carrotsearch.randomizedtesting.ThreadLeakControl$3.evaluate(ThreadLeakControl.java:442)
	at com.carrotsearch.randomizedtesting.RandomizedRunner.runSingleTest(RandomizedRunner.java:746)
	at com.carrotsearch.randomizedtesting.RandomizedRunner$3.evaluate(RandomizedRunner.java:648)
	at com.carrotsearch.randomizedtesting.RandomizedRunner$4.evaluate(RandomizedRunner.java:682)
	at com.carrotsearch.randomizedtesting.RandomizedRunner$5.evaluate(RandomizedRunner.java:693)
	at com.carrotsearch.randomizedtesting.rules.StatementAdapter.evaluate(StatementAdapter.java:36)
	at com.carrotsearch.randomizedtesting.rules.SystemPropertiesRestoreRule$1.evaluate(SystemPropertiesRestoreRule.java:53)
	at org.apache.lucene.util.AbstractBeforeAfterRule$1.evaluate(AbstractBeforeAfterRule.java:45)
	at org.apache.lucene.util.TestRuleStoreClassName$1.evaluate(TestRuleStoreClassName.java:42)
	at com.carrotsearch.randomizedtesting.rules.SystemPropertiesInvariantRule$1.evaluate(SystemPropertiesInvariantRule.java:55)
	at com.carrotsearch.randomizedtesting.rules.NoShadowingOrOverridesOnMethodsRule$1.evaluate(NoShadowingOrOverridesOnMethodsRule.java:39)
	at com.carrotsearch.randomizedtesting.rules.NoShadowingOrOverridesOnMethodsRule$1.evaluate(NoShadowingOrOverridesOnMethodsRule.java:39)
	at com.carrotsearch.randomizedtesting.rules.StatementAdapter.evaluate(StatementAdapter.java:36)
	at org.apache.lucene.util.TestRuleAssertionsRequired$1.evaluate(TestRuleAssertionsRequired.java:43)
	at org.apache.lucene.util.TestRuleMarkFailure$1.evaluate(TestRuleMarkFailure.java:48)
	at org.apache.lucene.util.TestRuleIgnoreAfterMaxFailures$1.evaluate(TestRuleIgnoreAfterMaxFailures.java:70)
	at org.apache.lucene.util.TestRuleIgnoreTestSuites$1.evaluate(TestRuleIgnoreTestSuites.java:55)
	at com.carrotsearch.randomizedtesting.rules.StatementAdapter.evaluate(StatementAdapter.java:36)
	at com.carrotsearch.randomizedtesting.ThreadLeakControl$StatementRunner.run(ThreadLeakControl.java:358)
	at java.lang.Thread.run(Thread.java:679)


REGRESSION:  org.apache.solr.cloud.SyncSliceTest.testDistribSearch

Error Message:
No live SolrServers available to handle this request

Stack Trace:
org.apache.solr.client.solrj.SolrServerException: No live SolrServers available to handle this request
	at __randomizedtesting.SeedInfo.seed([ECF880845A114B28:6D1E0E9C2D4E2B14]:0)
	at org.apache.solr.client.solrj.impl.LBHttpSolrServer.request(LBHttpSolrServer.java:323)
	at org.apache.solr.client.solrj.impl.CloudSolrServer.request(CloudSolrServer.java:257)
	at org.apache.solr.client.solrj.request.QueryRequest.process(QueryRequest.java:90)
	at org.apache.solr.client.solrj.SolrServer.query(SolrServer.java:324)
	at org.apache.solr.cloud.AbstractFullDistribZkTestBase.checkShardConsistency(AbstractFullDistribZkTestBase.java:909)
	at org.apache.solr.cloud.SyncSliceTest.doTest(SyncSliceTest.java:226)
	at org.apache.solr.BaseDistributedSearchTestCase.testDistribSearch(BaseDistributedSearchTestCase.java:695)
	at sun.reflect.NativeMethodAccessorImpl.invoke0(Native Method)
	at sun.reflect.NativeMethodAccessorImpl.invoke(NativeMethodAccessorImpl.java:57)
	at sun.reflect.DelegatingMethodAccessorImpl.invoke(DelegatingMethodAccessorImpl.java:43)
	at java.lang.reflect.Method.invoke(Method.java:616)
	at com.carrotsearch.randomizedtesting.RandomizedRunner.invoke(RandomizedRunner.java:1559)
	at com.carrotsearch.randomizedtesting.RandomizedRunner.access$600(RandomizedRunner.java:79)
	at com.carrotsearch.randomizedtesting.RandomizedRunner$6.evaluate(RandomizedRunner.java:737)
	at com.carrotsearch.randomizedtesting.RandomizedRunner$7.evaluate(RandomizedRunner.java:773)
	at com.carrotsearch.randomizedtesting.RandomizedRunner$8.evaluate(RandomizedRunner.java:787)
	at com.carrotsearch.randomizedtesting.rules.SystemPropertiesRestoreRule$1.evaluate(SystemPropertiesRestoreRule.java:53)
	at org.apache.lucene.util.TestRuleSetupTeardownChained$1.evaluate(TestRuleSetupTeardownChained.java:50)
	at org.apache.lucene.util.TestRuleFieldCacheSanity$1.evaluate(TestRuleFieldCacheSanity.java:51)
	at org.apache.lucene.util.AbstractBeforeAfterRule$1.evaluate(AbstractBeforeAfterRule.java:45)
	at com.carrotsearch.randomizedtesting.rules.SystemPropertiesInvariantRule$1.evaluate(SystemPropertiesInvariantRule.java:55)
	at org.apache.lucene.util.TestRuleThreadAndTestName$1.evaluate(TestRuleThreadAndTestName.java:48)
	at org.apache.lucene.util.TestRuleIgnoreAfterMaxFailures$1.evaluate(TestRuleIgnoreAfterMaxFailures.java:70)
	at org.apache.lucene.util.TestRuleMarkFailure$1.evaluate(TestRuleMarkFailure.java:48)
	at com.carrotsearch.randomizedtesting.rules.StatementAdapter.evaluate(StatementAdapter.java:36)
	at com.carrotsearch.randomizedtesting.ThreadLeakControl$StatementRunner.run(ThreadLeakControl.java:358)
	at com.carrotsearch.randomizedtesting.ThreadLeakControl.forkTimeoutingTask(ThreadLeakControl.java:782)
	at com.carrotsearch.randomizedtesting.ThreadLeakControl$3.evaluate(ThreadLeakControl.java:442)
	at com.carrotsearch.randomizedtesting.RandomizedRunner.runSingleTest(RandomizedRunner.java:746)
	at com.carrotsearch.randomizedtesting.RandomizedRunner$3.evaluate(RandomizedRunner.java:648)
	at com.carrotsearch.randomizedtesting.RandomizedRunner$4.evaluate(RandomizedRunner.java:682)
	at com.carrotsearch.randomizedtesting.RandomizedRunner$5.evaluate(RandomizedRunner.java:693)
	at com.carrotsearch.randomizedtesting.rules.StatementAdapter.evaluate(StatementAdapter.java:36)
	at com.carrotsearch.randomizedtesting.rules.SystemPropertiesRestoreRule$1.evaluate(SystemPropertiesRestoreRule.java:53)
	at org.apache.lucene.util.AbstractBeforeAfterRule$1.evaluate(AbstractBeforeAfterRule.java:45)
	at org.apache.lucene.util.TestRuleStoreClassName$1.evaluate(TestRuleStoreClassName.java:42)
	at com.carrotsearch.randomizedtesting.rules.SystemPropertiesInvariantRule$1.evaluate(SystemPropertiesInvariantRule.java:55)
	at com.carrotsearch.randomizedtesting.rules.NoShadowingOrOverridesOnMethodsRule$1.evaluate(NoShadowingOrOverridesOnMethodsRule.java:39)
	at com.carrotsearch.randomizedtesting.rules.NoShadowingOrOverridesOnMethodsRule$1.evaluate(NoShadowingOrOverridesOnMethodsRule.java:39)
	at com.carrotsearch.randomizedtesting.rules.StatementAdapter.evaluate(StatementAdapter.java:36)
	at org.apache.lucene.util.TestRuleAssertionsRequired$1.evaluate(TestRuleAssertionsRequired.java:43)
	at org.apache.lucene.util.TestRuleMarkFailure$1.evaluate(TestRuleMarkFailure.java:48)
	at org.apache.lucene.util.TestRuleIgnoreAfterMaxFailures$1.evaluate(TestRuleIgnoreAfterMaxFailures.java:70)
	at org.apache.lucene.util.TestRuleIgnoreTestSuites$1.evaluate(TestRuleIgnoreTestSuites.java:55)
	at com.carrotsearch.randomizedtesting.rules.StatementAdapter.evaluate(StatementAdapter.java:36)
	at com.carrotsearch.randomizedtesting.ThreadLeakControl$StatementRunner.run(ThreadLeakControl.java:358)
	at java.lang.Thread.run(Thread.java:679)




Build Log:
[...truncated 7188 lines...]
[junit4:junit4] Suite: org.apache.solr.cloud.BasicDistributedZk2Test
[junit4:junit4]   2> 5 T441 oas.SolrTestCaseJ4.setUp ###Starting testDistribSearch
[junit4:junit4]   2> Creating dataDir: /usr/home/hudson/hudson-slave/workspace/Lucene-Solr-Tests-trunk-Java6/solr/build/solr-core/test/J1/./solrtest-BasicDistributedZk2Test-1348046267212
[junit4:junit4]   2> 6 T441 oasc.ZkTestServer.run STARTING ZK TEST SERVER
[junit4:junit4]   2> 9 T442 oazs.ZooKeeperServer.setTickTime tickTime set to 1000
[junit4:junit4]   2> 9 T442 oazs.NIOServerCnxn$Factory.<init> binding to port 0.0.0.0/0.0.0.0:0
[junit4:junit4]   2> 10 T442 oazsp.FileTxnSnapLog.save Snapshotting: 0
[junit4:junit4]   2> 108 T441 oasc.ZkTestServer.run start zk server on port:55606
[junit4:junit4]   2> 108 T441 oaz.ZooKeeper.<init> Initiating client connection, connectString=127.0.0.1:55606 sessionTimeout=10000 watcher=org.apache.solr.common.cloud.ConnectionManager@18185576
[junit4:junit4]   2> 109 T447 oaz.ClientCnxn$SendThread.startConnect Opening socket connection to server /127.0.0.1:55606
[junit4:junit4]   2> 109 T441 oascc.ConnectionManager.waitForConnected Waiting for client to connect to ZooKeeper
[junit4:junit4]   2> 110 T447 oaz.ClientCnxn$SendThread.primeConnection Socket connection established to localhost/127.0.0.1:55606, initiating session
[junit4:junit4]   2> 111 T443 oazs.NIOServerCnxn$Factory.run Accepted socket connection from /140.211.11.196:53256
[junit4:junit4]   2> 111 T443 oazs.NIOServerCnxn.readConnectRequest Client attempting to establish new session at /140.211.11.196:53256
[junit4:junit4]   2> 111 T445 oazsp.FileTxnLog.append Creating new log file: log.1
[junit4:junit4]   2> 140 T445 oazs.NIOServerCnxn.finishSessionInit Established session 0x139ddd1a3510000 with negotiated timeout 10000 for client /140.211.11.196:53256
[junit4:junit4]   2> 140 T447 oaz.ClientCnxn$SendThread.readConnectResult Session establishment complete on server localhost/127.0.0.1:55606, sessionid = 0x139ddd1a3510000, negotiated timeout = 10000
[junit4:junit4]   2> 141 T448 oascc.ConnectionManager.process Watcher org.apache.solr.common.cloud.ConnectionManager@18185576 name:ZooKeeperConnection Watcher:127.0.0.1:55606 got event WatchedEvent state:SyncConnected type:None path:null path:null type:None
[junit4:junit4]   2> 141 T441 oascc.ConnectionManager.waitForConnected Client is connected to ZooKeeper
[junit4:junit4]   2> 141 T441 oascc.SolrZkClient.makePath makePath: /solr
[junit4:junit4]   2> 145 T446 oazs.PrepRequestProcessor.pRequest Processed session termination for sessionid: 0x139ddd1a3510000
[junit4:junit4]   2> 153 T448 oaz.ClientCnxn$EventThread.run EventThread shut down
[junit4:junit4]   2> 153 T443 oazs.NIOServerCnxn.closeSock Closed socket connection for client /140.211.11.196:53256 which had sessionid 0x139ddd1a3510000
[junit4:junit4]   2> 153 T441 oaz.ZooKeeper.close Session: 0x139ddd1a3510000 closed
[junit4:junit4]   2> 154 T441 oaz.ZooKeeper.<init> Initiating client connection, connectString=127.0.0.1:55606/solr sessionTimeout=10000 watcher=org.apache.solr.common.cloud.ConnectionManager@5f3f333c
[junit4:junit4]   2> 155 T449 oaz.ClientCnxn$SendThread.startConnect Opening socket connection to server /127.0.0.1:55606
[junit4:junit4]   2> 155 T441 oascc.ConnectionManager.waitForConnected Waiting for client to connect to ZooKeeper
[junit4:junit4]   2> 156 T449 oaz.ClientCnxn$SendThread.primeConnection Socket connection established to localhost/127.0.0.1:55606, initiating session
[junit4:junit4]   2> 156 T443 oazs.NIOServerCnxn$Factory.run Accepted socket connection from /140.211.11.196:64904
[junit4:junit4]   2> 156 T443 oazs.NIOServerCnxn.readConnectRequest Client attempting to establish new session at /140.211.11.196:64904
[junit4:junit4]   2> 158 T445 oazs.NIOServerCnxn.finishSessionInit Established session 0x139ddd1a3510001 with negotiated timeout 10000 for client /140.211.11.196:64904
[junit4:junit4]   2> 158 T449 oaz.ClientCnxn$SendThread.readConnectResult Session establishment complete on server localhost/127.0.0.1:55606, sessionid = 0x139ddd1a3510001, negotiated timeout = 10000
[junit4:junit4]   2> 158 T450 oascc.ConnectionManager.process Watcher org.apache.solr.common.cloud.ConnectionManager@5f3f333c name:ZooKeeperConnection Watcher:127.0.0.1:55606/solr got event WatchedEvent state:SyncConnected type:None path:null path:null type:None
[junit4:junit4]   2> 159 T441 oascc.ConnectionManager.waitForConnected Client is connected to ZooKeeper
[junit4:junit4]   2> 159 T441 oascc.SolrZkClient.makePath makePath: /collections/collection1
[junit4:junit4]   2> 166 T441 oascc.SolrZkClient.makePath makePath: /collections/collection1/shards
[junit4:junit4]   2> 174 T441 oascc.SolrZkClient.makePath makePath: /collections/control_collection
[junit4:junit4]   2> 177 T441 oascc.SolrZkClient.makePath makePath: /collections/control_collection/shards
[junit4:junit4]   2> 181 T441 oasc.AbstractZkTestCase.putConfig put /usr/home/hudson/hudson-slave/workspace/Lucene-Solr-Tests-trunk-Java6/solr/build/solr-core/test-files/solr/collection1/conf/solrconfig.xml to /configs/conf1/solrconfig.xml
[junit4:junit4]   2> 182 T441 oascc.SolrZkClient.makePath makePath: /configs/conf1/solrconfig.xml
[junit4:junit4]   2> 194 T441 oasc.AbstractZkTestCase.putConfig put /usr/home/hudson/hudson-slave/workspace/Lucene-Solr-Tests-trunk-Java6/solr/build/solr-core/test-files/solr/collection1/conf/schema.xml to /configs/conf1/schema.xml
[junit4:junit4]   2> 196 T441 oascc.SolrZkClient.makePath makePath: /configs/conf1/schema.xml
[junit4:junit4]   2> 300 T441 oasc.AbstractZkTestCase.putConfig put /usr/home/hudson/hudson-slave/workspace/Lucene-Solr-Tests-trunk-Java6/solr/build/solr-core/test-files/solr/collection1/conf/solrconfig.xml to /configs/conf1/solrconfig.xml
[junit4:junit4]   2> 301 T441 oascc.SolrZkClient.makePath makePath: /configs/conf1/solrconfig.xml
[junit4:junit4]   2> 305 T441 oasc.AbstractZkTestCase.putConfig put /usr/home/hudson/hudson-slave/workspace/Lucene-Solr-Tests-trunk-Java6/solr/build/solr-core/test-files/solr/collection1/conf/stopwords.txt to /configs/conf1/stopwords.txt
[junit4:junit4]   2> 305 T441 oascc.SolrZkClient.makePath makePath: /configs/conf1/stopwords.txt
[junit4:junit4]   2> 315 T441 oasc.AbstractZkTestCase.putConfig put /usr/home/hudson/hudson-slave/workspace/Lucene-Solr-Tests-trunk-Java6/solr/build/solr-core/test-files/solr/collection1/conf/protwords.txt to /configs/conf1/protwords.txt
[junit4:junit4]   2> 316 T441 oascc.SolrZkClient.makePath makePath: /configs/conf1/protwords.txt
[junit4:junit4]   2> 319 T441 oasc.AbstractZkTestCase.putConfig put /usr/home/hudson/hudson-slave/workspace/Lucene-Solr-Tests-trunk-Java6/solr/build/solr-core/test-files/solr/collection1/conf/currency.xml to /configs/conf1/currency.xml
[junit4:junit4]   2> 320 T441 oascc.SolrZkClient.makePath makePath: /configs/conf1/currency.xml
[junit4:junit4]   2> 324 T441 oasc.AbstractZkTestCase.putConfig put /usr/home/hudson/hudson-slave/workspace/Lucene-Solr-Tests-trunk-Java6/solr/build/solr-core/test-files/solr/collection1/conf/open-exchange-rates.json to /configs/conf1/open-exchange-rates.json
[junit4:junit4]   2> 324 T441 oascc.SolrZkClient.makePath makePath: /configs/conf1/open-exchange-rates.json
[junit4:junit4]   2> 328 T441 oasc.AbstractZkTestCase.putConfig put /usr/home/hudson/hudson-slave/workspace/Lucene-Solr-Tests-trunk-Java6/solr/build/solr-core/test-files/solr/collection1/conf/mapping-ISOLatin1Accent.txt to /configs/conf1/mapping-ISOLatin1Accent.txt
[junit4:junit4]   2> 329 T441 oascc.SolrZkClient.makePath makePath: /configs/conf1/mapping-ISOLatin1Accent.txt
[junit4:junit4]   2> 332 T441 oasc.AbstractZkTestCase.putConfig put /usr/home/hudson/hudson-slave/workspace/Lucene-Solr-Tests-trunk-Java6/solr/build/solr-core/test-files/solr/collection1/conf/old_synonyms.txt to /configs/conf1/old_synonyms.txt
[junit4:junit4]   2> 333 T441 oascc.SolrZkClient.makePath makePath: /configs/conf1/old_synonyms.txt
[junit4:junit4]   2> 336 T441 oasc.AbstractZkTestCase.putConfig put /usr/home/hudson/hudson-slave/workspace/Lucene-Solr-Tests-trunk-Java6/solr/build/solr-core/test-files/solr/collection1/conf/synonyms.txt to /configs/conf1/synonyms.txt
[junit4:junit4]   2> 337 T441 oascc.SolrZkClient.makePath makePath: /configs/conf1/synonyms.txt
[junit4:junit4]   2> 340 T446 oazs.PrepRequestProcessor.pRequest Processed session termination for sessionid: 0x139ddd1a3510001
[junit4:junit4]   2> 347 T450 oaz.ClientCnxn$EventThread.run EventThread shut down
[junit4:junit4]   2> 347 T441 oaz.ZooKeeper.close Session: 0x139ddd1a3510001 closed
[junit4:junit4]   2> 347 T443 oazs.NIOServerCnxn.closeSock Closed socket connection for client /140.211.11.196:64904 which had sessionid 0x139ddd1a3510001
[junit4:junit4]   2> 350 T441 oejs.Server.doStart jetty-8.1.2.v20120308
[junit4:junit4]   2> 353 T441 oejs.AbstractConnector.doStart Started SocketConnector@0.0.0.0:32220
[junit4:junit4]   2> 354 T441 oasc.SolrResourceLoader.locateSolrHome JNDI not configured for solr (NoInitialContextEx)
[junit4:junit4]   2> 354 T441 oasc.SolrResourceLoader.locateSolrHome using system property solr.solr.home: /usr/home/hudson/hudson-slave/workspace/Lucene-Solr-Tests-trunk-Java6/solr/build/solr-core/test-files/solr
[junit4:junit4]   2> 355 T441 oasc.SolrResourceLoader.<init> new SolrResourceLoader for deduced Solr Home: '/usr/home/hudson/hudson-slave/workspace/Lucene-Solr-Tests-trunk-Java6/solr/build/solr-core/test-files/solr/'
[junit4:junit4]   2> 401 T441 oass.SolrDispatchFilter.init SolrDispatchFilter.init()
[junit4:junit4]   2> 401 T441 oasc.SolrResourceLoader.locateSolrHome JNDI not configured for solr (NoInitialContextEx)
[junit4:junit4]   2> 402 T441 oasc.SolrResourceLoader.locateSolrHome using system property solr.solr.home: /usr/home/hudson/hudson-slave/workspace/Lucene-Solr-Tests-trunk-Java6/solr/build/solr-core/test-files/solr
[junit4:junit4]   2> 402 T441 oasc.CoreContainer$Initializer.initialize looking for solr.xml: /usr/home/hudson/hudson-slave/workspace/Lucene-Solr-Tests-trunk-Java6/solr/build/solr-core/test-files/solr/solr.xml
[junit4:junit4]   2> 403 T441 oasc.CoreContainer.<init> New CoreContainer 1346358504
[junit4:junit4]   2> 404 T441 oasc.CoreContainer.load Loading CoreContainer using Solr Home: '/usr/home/hudson/hudson-slave/workspace/Lucene-Solr-Tests-trunk-Java6/solr/build/solr-core/test-files/solr/'
[junit4:junit4]   2> 404 T441 oasc.SolrResourceLoader.<init> new SolrResourceLoader for directory: '/usr/home/hudson/hudson-slave/workspace/Lucene-Solr-Tests-trunk-Java6/solr/build/solr-core/test-files/solr/'
[junit4:junit4]   2> 430 T441 oasc.CoreContainer.load Registering Log Listener
[junit4:junit4]   2> 447 T441 oasc.CoreContainer.initZooKeeper Zookeeper client=127.0.0.1:55606/solr
[junit4:junit4]   2> 448 T441 oaz.ZooKeeper.<init> Initiating client connection, connectString=127.0.0.1:55606/solr sessionTimeout=5000 watcher=org.apache.solr.common.cloud.ConnectionManager@54fabfa3
[junit4:junit4]   2> 449 T460 oaz.ClientCnxn$SendThread.startConnect Opening socket connection to server /127.0.0.1:55606
[junit4:junit4]   2> 449 T441 oascc.ConnectionManager.waitForConnected Waiting for client to connect to ZooKeeper
[junit4:junit4]   2> 450 T460 oaz.ClientCnxn$SendThread.primeConnection Socket connection established to localhost/127.0.0.1:55606, initiating session
[junit4:junit4]   2> 450 T443 oazs.NIOServerCnxn$Factory.run Accepted socket connection from /140.211.11.196:64330
[junit4:junit4]   2> 451 T443 oazs.NIOServerCnxn.readConnectRequest Client attempting to establish new session at /140.211.11.196:64330
[junit4:junit4]   2> 453 T445 oazs.NIOServerCnxn.finishSessionInit Established session 0x139ddd1a3510002 with negotiated timeout 5000 for client /140.211.11.196:64330
[junit4:junit4]   2> 453 T460 oaz.ClientCnxn$SendThread.readConnectResult Session establishment complete on server localhost/127.0.0.1:55606, sessionid = 0x139ddd1a3510002, negotiated timeout = 5000
[junit4:junit4]   2> 454 T461 oascc.ConnectionManager.process Watcher org.apache.solr.common.cloud.ConnectionManager@54fabfa3 name:ZooKeeperConnection Watcher:127.0.0.1:55606/solr got event WatchedEvent state:SyncConnected type:None path:null path:null type:None
[junit4:junit4]   2> 454 T441 oascc.ConnectionManager.waitForConnected Client is connected to ZooKeeper
[junit4:junit4]   2> 456 T446 oazs.PrepRequestProcessor.pRequest Got user-level KeeperException when processing sessionid:0x139ddd1a3510002 type:create cxid:0x2 zxid:0xfffffffffffffffe txntype:unknown reqpath:n/a Error Path:/solr/overseer Error:KeeperErrorCode = NodeExists for /solr/overseer
[junit4:junit4]   2> 464 T441 oascc.SolrZkClient.makePath makePath: /live_nodes
[junit4:junit4]   2> 467 T441 oasc.ZkController.createEphemeralLiveNode Register node as live in ZooKeeper:/live_nodes/127.0.0.1:32220_solr
[junit4:junit4]   2> 467 T446 oazs.PrepRequestProcessor.pRequest Got user-level KeeperException when processing sessionid:0x139ddd1a3510002 type:delete cxid:0x7 zxid:0xfffffffffffffffe txntype:unknown reqpath:n/a Error Path:/solr/live_nodes/127.0.0.1:32220_solr Error:KeeperErrorCode = NoNode for /solr/live_nodes/127.0.0.1:32220_solr
[junit4:junit4]   2> 469 T441 oascc.SolrZkClient.makePath makePath: /live_nodes/127.0.0.1:32220_solr
[junit4:junit4]   2> 478 T441 oashc.HttpShardHandlerFactory.getParameter Setting socketTimeout to: 0
[junit4:junit4]   2> 479 T441 oashc.HttpShardHandlerFactory.getParameter Setting urlScheme to: http://
[junit4:junit4]   2> 479 T441 oashc.HttpShardHandlerFactory.getParameter Setting connTimeout to: 0
[junit4:junit4]   2> 480 T441 oashc.HttpShardHandlerFactory.getParameter Setting maxConnectionsPerHost to: 20
[junit4:junit4]   2> 480 T441 oashc.HttpShardHandlerFactory.getParameter Setting corePoolSize to: 0
[junit4:junit4]   2> 481 T441 oashc.HttpShardHandlerFactory.getParameter Setting maximumPoolSize to: 2147483647
[junit4:junit4]   2> 481 T441 oashc.HttpShardHandlerFactory.getParameter Setting maxThreadIdleTime to: 5
[junit4:junit4]   2> 482 T441 oashc.HttpShardHandlerFactory.getParameter Setting sizeOfQueue to: -1
[junit4:junit4]   2> 482 T441 oashc.HttpShardHandlerFactory.getParameter Setting fairnessPolicy to: false
[junit4:junit4]   2> 483 T441 oascsi.HttpClientUtil.createClient Creating new http client, config:maxConnectionsPerHost=20&maxConnections=10000&socketTimeout=0&connTimeout=0&retry=false
[junit4:junit4]   2> 500 T441 oascc.SolrZkClient.makePath makePath: /overseer_elect/election
[junit4:junit4]   2> 514 T446 oazs.PrepRequestProcessor.pRequest Got user-level KeeperException when processing sessionid:0x139ddd1a3510002 type:delete cxid:0x15 zxid:0xfffffffffffffffe txntype:unknown reqpath:n/a Error Path:/solr/overseer_elect/leader Error:KeeperErrorCode = NoNode for /solr/overseer_elect/leader
[junit4:junit4]   2> 520 T441 oascc.SolrZkClient.makePath makePath: /overseer_elect/leader
[junit4:junit4]   2> 523 T441 oasc.Overseer.start Overseer (id=88345560168333314-127.0.0.1:32220_solr-n_0000000000) starting
[junit4:junit4]   2> 524 T446 oazs.PrepRequestProcessor.pRequest Got user-level KeeperException when processing sessionid:0x139ddd1a3510002 type:create cxid:0x1a zxid:0xfffffffffffffffe txntype:unknown reqpath:n/a Error Path:/solr/overseer Error:KeeperErrorCode = NodeExists for /solr/overseer
[junit4:junit4]   2> 525 T446 oazs.PrepRequestProcessor.pRequest Got user-level KeeperException when processing sessionid:0x139ddd1a3510002 type:create cxid:0x1b zxid:0xfffffffffffffffe txntype:unknown reqpath:n/a Error Path:/solr/overseer Error:KeeperErrorCode = NodeExists for /solr/overseer
[junit4:junit4]   2> 534 T446 oazs.PrepRequestProcessor.pRequest Got user-level KeeperException when processing sessionid:0x139ddd1a3510002 type:create cxid:0x1c zxid:0xfffffffffffffffe txntype:unknown reqpath:n/a Error Path:/solr/overseer Error:KeeperErrorCode = NodeExists for /solr/overseer
[junit4:junit4]   2> 536 T446 oazs.PrepRequestProcessor.pRequest Got user-level KeeperException when processing sessionid:0x139ddd1a3510002 type:create cxid:0x1d zxid:0xfffffffffffffffe txntype:unknown reqpath:n/a Error Path:/solr/overseer Error:KeeperErrorCode = NodeExists for /solr/overseer
[junit4:junit4]   2> 537 T463 oasc.OverseerCollectionProcessor.run Process current queue of collection creations
[junit4:junit4]   2> 545 T441 oascc.SolrZkClient.makePath makePath: /clusterstate.json
[junit4:junit4]   2> 547 T441 oascc.ZkStateReader.createClusterStateWatchersAndUpdate Updating cluster state from ZooKeeper... 
[junit4:junit4]   2> 550 T462 oasc.Overseer$ClusterStateUpdater.run Starting to work on the main queue
[junit4:junit4]   2> 554 T441 oasc.CoreContainer.create Creating SolrCore 'collection1' using instanceDir: /usr/home/hudson/hudson-slave/workspace/Lucene-Solr-Tests-trunk-Java6/solr/build/solr-core/test-files/solr/collection1
[junit4:junit4]   2> 555 T441 oasc.ZkController.createCollectionZkNode Check for collection zkNode:control_collection
[junit4:junit4]   2> 556 T441 oasc.ZkController.createCollectionZkNode Collection zkNode exists
[junit4:junit4]   2> 556 T441 oasc.ZkController.readConfigName Load collection config from:/collections/control_collection
[junit4:junit4]   2> 558 T441 oasc.SolrResourceLoader.<init> new SolrResourceLoader for directory: '/usr/home/hudson/hudson-slave/workspace/Lucene-Solr-Tests-trunk-Java6/solr/build/solr-core/test-files/solr/collection1/'
[junit4:junit4]   2> 559 T441 oasc.SolrResourceLoader.replaceClassLoader Adding 'file:/usr/home/hudson/hudson-slave/workspace/Lucene-Solr-Tests-trunk-Java6/solr/build/solr-core/test-files/solr/collection1/lib/README' to classloader
[junit4:junit4]   2> 560 T441 oasc.SolrResourceLoader.replaceClassLoader Adding 'file:/usr/home/hudson/hudson-slave/workspace/Lucene-Solr-Tests-trunk-Java6/solr/build/solr-core/test-files/solr/collection1/lib/classes/' to classloader
[junit4:junit4]   2> 612 T441 oasc.SolrConfig.<init> Using Lucene MatchVersion: LUCENE_50
[junit4:junit4]   2> 686 T441 oasc.SolrConfig.<init> Loaded SolrConfig: solrconfig.xml
[junit4:junit4]   2> 787 T441 oass.IndexSchema.readSchema Reading Solr Schema
[junit4:junit4]   2> 795 T441 oass.IndexSchema.readSchema Schema name=test
[junit4:junit4]   2> 1453 T441 oass.OpenExchangeRatesOrgProvider.init Initialized with rates=open-exchange-rates.json, refreshInterval=1440.
[junit4:junit4]   2> 1466 T441 oass.IndexSchema.readSchema default search field in schema is text
[junit4:junit4]   2> 1471 T441 oass.IndexSchema.readSchema unique key field: id
[junit4:junit4]   2> 1490 T441 oass.FileExchangeRateProvider.reload Reloading exchange rates from file currency.xml
[junit4:junit4]   2> 1496 T441 oass.FileExchangeRateProvider.reload Reloading exchange rates from file currency.xml
[junit4:junit4]   2> 1501 T441 oass.OpenExchangeRatesOrgProvider.reload Reloading exchange rates from open-exchange-rates.json
[junit4:junit4]   2> 1503 T441 oass.OpenExchangeRatesOrgProvider.reload Reloading exchange rates from open-exchange-rates.json
[junit4:junit4]   2> 1505 T441 oasc.SolrCore.<init> [collection1] Opening new SolrCore at /usr/home/hudson/hudson-slave/workspace/Lucene-Solr-Tests-trunk-Java6/solr/build/solr-core/test-files/solr/collection1/, dataDir=./org.apache.solr.cloud.BasicDistributedZk2Test-1348046267211/control/data/
[junit4:junit4]   2> 1506 T441 oasc.JmxMonitoredMap.<init> JMX monitoring is enabled. Adding Solr mbeans to JMX Server: com.sun.jmx.mbeanserver.JmxMBeanServer@6b7599cc
[junit4:junit4]   2> 1546 T441 oasc.SolrCore.getNewIndexDir WARNING New index directory detected: old=null new=./org.apache.solr.cloud.BasicDistributedZk2Test-1348046267211/control/data/index/
[junit4:junit4]   2> 1548 T441 oasc.SolrCore.initIndex WARNING [collection1] Solr index directory './org.apache.solr.cloud.BasicDistributedZk2Test-1348046267211/control/data/index' doesn't exist. Creating new index...
[junit4:junit4]   2> 1549 T441 oasc.CachingDirectoryFactory.get return new directory for /usr/home/hudson/hudson-slave/workspace/Lucene-Solr-Tests-trunk-Java6/solr/build/solr-core/test/J1/./org.apache.solr.cloud.BasicDistributedZk2Test-1348046267211/control/data/index forceNew:false
[junit4:junit4]   2> 1556 T441 oasc.SolrDeletionPolicy.onCommit SolrDeletionPolicy.onCommit: commits:num=1
[junit4:junit4]   2> 		commit{dir=/usr/home/hudson/hudson-slave/workspace/Lucene-Solr-Tests-trunk-Java6/solr/build/solr-core/test/J1/org.apache.solr.cloud.BasicDistributedZk2Test-1348046267211/control/data/index,segFN=segments_1,generation=1,filenames=[segments_1]
[junit4:junit4]   2> 1557 T441 oasc.SolrDeletionPolicy.updateCommits newest commit = 1
[junit4:junit4]   2> 1558 T441 oasc.SolrCore.initWriters created xml: solr.XMLResponseWriter
[junit4:junit4]   2> 1560 T441 oasup.UpdateRequestProcessorChain.init inserting DistributedUpdateProcessorFactory into updateRequestProcessorChain "dedupe"
[junit4:junit4]   2> 1561 T441 oasup.UpdateRequestProcessorChain.init inserting DistributedUpdateProcessorFactory into updateRequestProcessorChain "dedupe-allfields"
[junit4:junit4]   2> 1561 T441 oasup.UpdateRequestProcessorChain.init inserting DistributedUpdateProcessorFactory into updateRequestProcessorChain "stored_sig"
[junit4:junit4]   2> 1562 T441 oasup.UpdateRequestProcessorChain.init inserting DistributedUpdateProcessorFactory into updateRequestProcessorChain "uniq-fields"
[junit4:junit4]   2> 1563 T441 oasup.UpdateRequestProcessorChain.init inserting DistributedUpdateProcessorFactory into updateRequestProcessorChain "distrib-dup-test-chain-implicit"
[junit4:junit4]   2> 1563 T441 oasc.RequestHandlers.initHandlersFromConfig adding lazy requestHandler: solr.ReplicationHandler
[junit4:junit4]   2> 1564 T441 oasc.RequestHandlers.initHandlersFromConfig created /replication: solr.ReplicationHandler
[junit4:junit4]   2> 1565 T441 oasc.RequestHandlers.initHandlersFromConfig created standard: solr.StandardRequestHandler
[junit4:junit4]   2> 1565 T441 oasc.RequestHandlers.initHandlersFromConfig created /get: solr.RealTimeGetHandler
[junit4:junit4]   2> 1566 T441 oasc.RequestHandlers.initHandlersFromConfig created dismax: solr.SearchHandler
[junit4:junit4]   2> 1567 T441 oasc.RequestHandlers.initHandlersFromConfig created mock: org.apache.solr.core.MockQuerySenderListenerReqHandler
[junit4:junit4]   2> 1568 T441 oasc.RequestHandlers.initHandlersFromConfig created /admin/: org.apache.solr.handler.admin.AdminHandlers
[junit4:junit4]   2> 1568 T441 oasc.RequestHandlers.initHandlersFromConfig created defaults: solr.StandardRequestHandler
[junit4:junit4]   2> 1569 T441 oasc.RequestHandlers.initHandlersFromConfig adding lazy requestHandler: solr.StandardRequestHandler
[junit4:junit4]   2> 1569 T441 oasc.RequestHandlers.initHandlersFromConfig created lazy: solr.StandardRequestHandler
[junit4:junit4]   2> 1570 T441 oasc.RequestHandlers.initHandlersFromConfig created /update: solr.UpdateRequestHandler
[junit4:junit4]   2> 1571 T441 oasc.RequestHandlers.initHandlersFromConfig created /terms: org.apache.solr.handler.component.SearchHandler
[junit4:junit4]   2> 1571 T441 oasc.RequestHandlers.initHandlersFromConfig created spellCheckCompRH: org.apache.solr.handler.component.SearchHandler
[junit4:junit4]   2> 1572 T441 oasc.RequestHandlers.initHandlersFromConfig created spellCheckCompRH_Direct: org.apache.solr.handler.component.SearchHandler
[junit4:junit4]   2> 1573 T441 oasc.RequestHandlers.initHandlersFromConfig created spellCheckWithWordbreak: org.apache.solr.handler.component.SearchHandler
[junit4:junit4]   2> 1573 T441 oasc.RequestHandlers.initHandlersFromConfig created spellCheckWithWordbreak_Direct: org.apache.solr.handler.component.SearchHandler
[junit4:junit4]   2> 1574 T441 oasc.RequestHandlers.initHandlersFromConfig created spellCheckCompRH1: org.apache.solr.handler.component.SearchHandler
[junit4:junit4]   2> 1575 T441 oasc.RequestHandlers.initHandlersFromConfig created tvrh: org.apache.solr.handler.component.SearchHandler
[junit4:junit4]   2> 1575 T441 oasc.RequestHandlers.initHandlersFromConfig created /mlt: solr.MoreLikeThisHandler
[junit4:junit4]   2> 1576 T441 oasc.RequestHandlers.initHandlersFromConfig created /debug/dump: solr.DumpRequestHandler
[junit4:junit4]   2> 1581 T441 oashl.XMLLoader.init xsltCacheLifetimeSeconds=60
[junit4:junit4]   2> 1586 T441 oasc.SolrCore.initDeprecatedSupport WARNING solrconfig.xml uses deprecated <admin/gettableFiles>, Please update your config to use the ShowFileRequestHandler.
[junit4:junit4]   2> 1588 T441 oasc.SolrCore.initDeprecatedSupport WARNING adding ShowFileRequestHandler with hidden files: [SCHEMA.XML, OLD_SYNONYMS.TXT, STOPWORDS.TXT, PROTWORDS.TXT, OPEN-EXCHANGE-RATES.JSON, SYNONYMS.TXT, CURRENCY.XML, MAPPING-ISOLATIN1ACCENT.TXT]
[junit4:junit4]   2> 1592 T441 oass.SolrIndexSearcher.<init> Opening Searcher@190de279 main
[junit4:junit4]   2> 1620 T441 oasu.CommitTracker.<init> Hard AutoCommit: disabled
[junit4:junit4]   2> 1621 T441 oasu.CommitTracker.<init> Soft AutoCommit: disabled
[junit4:junit4]   2> 1621 T441 oashc.SpellCheckComponent.inform Initializing spell checkers
[junit4:junit4]   2> 1637 T441 oass.DirectSolrSpellChecker.init init: {name=direct,classname=DirectSolrSpellChecker,field=lowerfilt,minQueryLength=3}
[junit4:junit4]   2> 1696 T464 oasc.SolrCore.registerSearcher [collection1] Registered new searcher Searcher@190de279 main{StandardDirectoryReader(segments_1:1)}
[junit4:junit4]   2> 1703 T446 oazs.PrepRequestProcessor.pRequest Got user-level KeeperException when processing sessionid:0x139ddd1a3510002 type:create cxid:0x56 zxid:0xfffffffffffffffe txntype:unknown reqpath:n/a Error Path:/solr/overseer/queue Error:KeeperErrorCode = NoNode for /solr/overseer/queue
[junit4:junit4]   2> 1715 T441 oasc.CoreContainer.register registering core: collection1
[junit4:junit4]   2> 1716 T441 oasc.ZkController.register Register shard - core:collection1 address:http://127.0.0.1:32220/solr shardId:control_shard
[junit4:junit4]   2> 1717 T441 oascc.SolrZkClient.makePath makePath: /collections/control_collection/leader_elect/control_shard/election
[junit4:junit4]   2> 1726 T446 oazs.PrepRequestProcessor.pRequest Got user-level KeeperException when processing sessionid:0x139ddd1a3510002 type:delete cxid:0x65 zxid:0xfffffffffffffffe txntype:unknown reqpath:n/a Error Path:/solr/collections/control_collection/leaders Error:KeeperErrorCode = NoNode for /solr/collections/control_collection/leaders
[junit4:junit4]   2> 1727 T441 oasc.ShardLeaderElectionContext.runLeaderProcess Running the leader process.
[junit4:junit4]   2> 1727 T446 oazs.PrepRequestProcessor.pRequest Got user-level KeeperException when processing sessionid:0x139ddd1a3510002 type:create cxid:0x66 zxid:0xfffffffffffffffe txntype:unknown reqpath:n/a Error Path:/solr/overseer Error:KeeperErrorCode = NodeExists for /solr/overseer
[junit4:junit4]   2> 2060 T462 oascc.ZkStateReader.updateClusterState Updating cloud state from ZooKeeper... 
[junit4:junit4]   2> 2061 T446 oazs.PrepRequestProcessor.pRequest Got user-level KeeperException when processing sessionid:0x139ddd1a3510002 type:create cxid:0x6d zxid:0xfffffffffffffffe txntype:unknown reqpath:n/a Error Path:/solr/overseer/queue-work Error:KeeperErrorCode = NoNode for /solr/overseer/queue-work
[junit4:junit4]   2> 2088 T461 oascc.ZkStateReader$2.process A cluster state change has occurred - updating...
[junit4:junit4]   2> 2237 T441 oasc.ShardLeaderElectionContext.waitForReplicasToComeUp Enough replicas found to continue.
[junit4:junit4]   2> 2238 T441 oasc.ShardLeaderElectionContext.runLeaderProcess I may be the new leader - try and sync
[junit4:junit4]   2> 2239 T441 oasc.SyncStrategy.sync Sync replicas to http://127.0.0.1:32220/solr/collection1/
[junit4:junit4]   2> 2239 T441 oasc.SyncStrategy.syncReplicas Sync Success - now sync replicas to me
[junit4:junit4]   2> 2240 T441 oasc.SyncStrategy.syncToMe http://127.0.0.1:32220/solr/collection1/ has no replicas
[junit4:junit4]   2> 2240 T441 oasc.ShardLeaderElectionContext.runLeaderProcess I am the new leader: http://127.0.0.1:32220/solr/collection1/
[junit4:junit4]   2> 2241 T441 oascc.SolrZkClient.makePath makePath: /collections/control_collection/leaders/control_shard
[junit4:junit4]   2> 2267 T446 oazs.PrepRequestProcessor.pRequest Got user-level KeeperException when processing sessionid:0x139ddd1a3510002 type:create cxid:0x8b zxid:0xfffffffffffffffe txntype:unknown reqpath:n/a Error Path:/solr/overseer Error:KeeperErrorCode = NodeExists for /solr/overseer
[junit4:junit4]   2> 2596 T462 oascc.ZkStateReader.updateClusterState Updating cloud state from ZooKeeper... 
[junit4:junit4]   2> 2611 T461 oascc.ZkStateReader$2.process A cluster state change has occurred - updating...
[junit4:junit4]   2> 2634 T441 oasc.ZkController.register We are http://127.0.0.1:32220/solr/collection1/ and leader is http://127.0.0.1:32220/solr/collection1/
[junit4:junit4]   2> 2638 T441 oasc.ZkController.register No LogReplay needed for core=collection1 baseURL=http://127.0.0.1:32220/solr
[junit4:junit4]   2> 2639 T441 oasc.ZkController.checkRecovery I am the leader, no recovery necessary
[junit4:junit4]   2> 2642 T441 oascc.ZkStateReader.updateClusterState Updating cloud state from ZooKeeper... 
[junit4:junit4]   2> 2643 T441 oass.SolrDispatchFilter.init user.dir=/usr/home/hudson/hudson-slave/workspace/Lucene-Solr-Tests-trunk-Java6/solr/build/solr-core/test/J1
[junit4:junit4]   2> 2643 T441 oass.SolrDispatchFilter.init SolrDispatchFilter.init() done
[junit4:junit4]   2> 2644 T441 oascsi.HttpClientUtil.createClient Creating new http client, config:maxConnections=128&maxConnectionsPerHost=32&followRedirects=false
[junit4:junit4]   2> 2817 T441 oejs.Server.doStart jetty-8.1.2.v20120308
[junit4:junit4]   2> 2820 T441 oejs.AbstractConnector.doStart Started SocketConnector@0.0.0.0:39666
[junit4:junit4]   2> 2820 T441 oasc.SolrResourceLoader.locateSolrHome JNDI not configured for solr (NoInitialContextEx)
[junit4:junit4]   2> 2821 T441 oasc.SolrResourceLoader.locateSolrHome using system property solr.solr.home: /usr/home/hudson/hudson-slave/workspace/Lucene-Solr-Tests-trunk-Java6/solr/build/solr-core/test/J1/./solrtest-jetty1-1348046269865
[junit4:junit4]   2> 2821 T441 oasc.SolrResourceLoader.<init> new SolrResourceLoader for deduced Solr Home: '/usr/home/hudson/hudson-slave/workspace/Lucene-Solr-Tests-trunk-Java6/solr/build/solr-core/test/J1/./solrtest-jetty1-1348046269865/'
[junit4:junit4]   2> 2861 T441 oass.SolrDispatchFilter.init SolrDispatchFilter.init()
[junit4:junit4]   2> 2861 T441 oasc.SolrResourceLoader.locateSolrHome JNDI not configured for solr (NoInitialContextEx)
[junit4:junit4]   2> 2862 T441 oasc.SolrResourceLoader.locateSolrHome using system property solr.solr.home: /usr/home/hudson/hudson-slave/workspace/Lucene-Solr-Tests-trunk-Java6/solr/build/solr-core/test/J1/./solrtest-jetty1-1348046269865
[junit4:junit4]   2> 2862 T441 oasc.CoreContainer$Initializer.initialize looking for solr.xml: /usr/home/hudson/hudson-slave/workspace/Lucene-Solr-Tests-trunk-Java6/solr/build/solr-core/test/J1/./solrtest-jetty1-1348046269865/solr.xml
[junit4:junit4]   2> 2863 T441 oasc.CoreContainer.<init> New CoreContainer 1746579125
[junit4:junit4]   2> 2864 T441 oasc.CoreContainer.load Loading CoreContainer using Solr Home: '/usr/home/hudson/hudson-slave/workspace/Lucene-Solr-Tests-trunk-Java6/solr/build/solr-core/test/J1/./solrtest-jetty1-1348046269865/'
[junit4:junit4]   2> 2864 T441 oasc.SolrResourceLoader.<init> new SolrResourceLoader for directory: '/usr/home/hudson/hudson-slave/workspace/Lucene-Solr-Tests-trunk-Java6/solr/build/solr-core/test/J1/./solrtest-jetty1-1348046269865/'
[junit4:junit4]   2> 2891 T441 oasc.CoreContainer.load Registering Log Listener
[junit4:junit4]   2> 2908 T441 oasc.CoreContainer.initZooKeeper Zookeeper client=127.0.0.1:55606/solr
[junit4:junit4]   2> 2909 T441 oaz.ZooKeeper.<init> Initiating client connection, connectString=127.0.0.1:55606/solr sessionTimeout=5000 watcher=org.apache.solr.common.cloud.ConnectionManager@75b30cc7
[junit4:junit4]   2> 2910 T474 oaz.ClientCnxn$SendThread.startConnect Opening socket connection to server /127.0.0.1:55606
[junit4:junit4]   2> 2910 T441 oascc.ConnectionManager.waitForConnected Waiting for client to connect to ZooKeeper
[junit4:junit4]   2> 2911 T474 oaz.ClientCnxn$SendThread.primeConnection Socket connection established to localhost/127.0.0.1:55606, initiating session
[junit4:junit4]   2> 2911 T443 oazs.NIOServerCnxn$Factory.run Accepted socket connection from /140.211.11.196:23656
[junit4:junit4]   2> 2912 T443 oazs.NIOServerCnxn.readConnectRequest Client attempting to establish new session at /140.211.11.196:23656
[junit4:junit4]   2> 2914 T445 oazs.NIOServerCnxn.finishSessionInit Established session 0x139ddd1a3510003 with negotiated timeout 5000 for client /140.211.11.196:23656
[junit4:junit4]   2> 2914 T474 oaz.ClientCnxn$SendThread.readConnectResult Session establishment complete on server localhost/127.0.0.1:55606, sessionid = 0x139ddd1a3510003, negotiated timeout = 5000
[junit4:junit4]   2> 2915 T475 oascc.ConnectionManager.process Watcher org.apache.solr.common.cloud.ConnectionManager@75b30cc7 name:ZooKeeperConnection Watcher:127.0.0.1:55606/solr got event WatchedEvent state:SyncConnected type:None path:null path:null type:None
[junit4:junit4]   2> 2915 T441 oascc.ConnectionManager.waitForConnected Client is connected to ZooKeeper
[junit4:junit4]   2> 2916 T446 oazs.PrepRequestProcessor.pRequest Got user-level KeeperException when processing sessionid:0x139ddd1a3510003 type:create cxid:0x1 zxid:0xfffffffffffffffe txntype:unknown reqpath:n/a Error Path:/solr/overseer Error:KeeperErrorCode = NodeExists for /solr/overseer
[junit4:junit4]   2> 2925 T446 oazs.PrepRequestProcessor.pRequest Got user-level KeeperException when processing sessionid:0x139ddd1a3510003 type:create cxid:0x2 zxid:0xfffffffffffffffe txntype:unknown reqpath:n/a Error Path:/solr/overseer Error:KeeperErrorCode = NodeExists for /solr/overseer
[junit4:junit4]   2> 2926 T441 oasc.ZkController.createEphemeralLiveNode Register node as live in ZooKeeper:/live_nodes/127.0.0.1:39666_solr
[junit4:junit4]   2> 2927 T446 oazs.PrepRequestProcessor.pRequest Got user-level KeeperException when processing sessionid:0x139ddd1a3510003 type:delete cxid:0x4 zxid:0xfffffffffffffffe txntype:unknown reqpath:n/a Error Path:/solr/live_nodes/127.0.0.1:39666_solr Error:KeeperErrorCode = NoNode for /solr/live_nodes/127.0.0.1:39666_solr
[junit4:junit4]   2> 2933 T441 oascc.SolrZkClient.makePath makePath: /live_nodes/127.0.0.1:39666_solr
[junit4:junit4]   2> 2935 T461 oascc.ZkStateReader$3.process Updating live nodes
[junit4:junit4]   2> 2938 T441 oashc.HttpShardHandlerFactory.getParameter Setting socketTimeout to: 0
[junit4:junit4]   2> 2938 T441 oashc.HttpShardHandlerFactory.getParameter Setting urlScheme to: http://
[junit4:junit4]   2> 2939 T441 oashc.HttpShardHandlerFactory.getParameter Setting connTimeout to: 0
[junit4:junit4]   2> 2939 T441 oashc.HttpShardHandlerFactory.getParameter Setting maxConnectionsPerHost to: 20
[junit4:junit4]   2> 2940 T441 oashc.HttpShardHandlerFactory.getParameter Setting corePoolSize to: 0
[junit4:junit4]   2> 2940 T441 oashc.HttpShardHandlerFactory.getParameter Setting maximumPoolSize to: 2147483647
[junit4:junit4]   2> 2941 T441 oashc.HttpShardHandlerFactory.getParameter Setting maxThreadIdleTime to: 5
[junit4:junit4]   2> 2941 T441 oashc.HttpShardHandlerFactory.getParameter Setting sizeOfQueue to: -1
[junit4:junit4]   2> 2942 T441 oashc.HttpShardHandlerFactory.getParameter Setting fairnessPolicy to: false
[junit4:junit4]   2> 2942 T441 oascsi.HttpClientUtil.createClient Creating new http client, config:maxConnectionsPerHost=20&maxConnections=10000&socketTimeout=0&connTimeout=0&retry=false
[junit4:junit4]   2> 2962 T441 oascc.ZkStateReader.createClusterStateWatchersAndUpdate Updating cluster state from ZooKeeper... 
[junit4:junit4]   2> 2969 T441 oasc.CoreContainer.create Creating SolrCore 'collection1' using instanceDir: /usr/home/hudson/hudson-slave/workspace/Lucene-Solr-Tests-trunk-Java6/solr/build/solr-core/test/J1/./solrtest-jetty1-1348046269865/collection1
[junit4:junit4]   2> 2969 T441 oasc.ZkController.createCollectionZkNode Check for collection zkNode:collection1
[junit4:junit4]   2> 2970 T441 oasc.ZkController.createCollectionZkNode Collection zkNode exists
[junit4:junit4]   2> 2971 T441 oasc.ZkController.readConfigName Load collection config from:/collections/collection1
[junit4:junit4]   2> 2972 T441 oasc.SolrResourceLoader.<init> new SolrResourceLoader for directory: '/usr/home/hudson/hudson-slave/workspace/Lucene-Solr-Tests-trunk-Java6/solr/build/solr-core/test/J1/./solrtest-jetty1-1348046269865/collection1/'
[junit4:junit4]   2> 2974 T441 oasc.SolrResourceLoader.replaceClassLoader Adding 'file:/usr/home/hudson/hudson-slave/workspace/Lucene-Solr-Tests-trunk-Java6/solr/build/solr-core/test/J1/solrtest-jetty1-1348046269865/collection1/lib/classes/' to classloader
[junit4:junit4]   2> 2975 T441 oasc.SolrResourceLoader.replaceClassLoader Adding 'file:/usr/home/hudson/hudson-slave/workspace/Lucene-Solr-Tests-trunk-Java6/solr/build/solr-core/test/J1/solrtest-jetty1-1348046269865/collection1/lib/README' to classloader
[junit4:junit4]   2> 3028 T441 oasc.SolrConfig.<init> Using Lucene MatchVersion: LUCENE_50
[junit4:junit4]   2> 3106 T441 oasc.SolrConfig.<init> Loaded SolrConfig: solrconfig.xml
[junit4:junit4]   2> 3116 T462 oascc.ZkStateReader.updateClusterState Updating cloud state from ZooKeeper... 
[junit4:junit4]   2> 3123 T461 oascc.ZkStateReader$2.process A cluster state change has occurred - updating...
[junit4:junit4]   2> 3207 T475 oascc.ZkStateReader$2.process A cluster state change has occurred - updating...
[junit4:junit4]   2> 3207 T441 oass.IndexSchema.readSchema Reading Solr Schema
[junit4:junit4]   2> 3215 T441 oass.IndexSchema.readSchema Schema name=test
[junit4:junit4]   2> 3827 T441 oass.OpenExchangeRatesOrgProvider.init Initialized with rates=open-exchange-rates.json, refreshInterval=1440.
[junit4:junit4]   2> 3836 T441 oass.IndexSchema.readSchema default search field in schema is text
[junit4:junit4]   2> 3839 T441 oass.IndexSchema.readSchema unique key field: id
[junit4:junit4]   2> 3853 T441 oass.FileExchangeRateProvider.reload Reloading exchange rates from file currency.xml
[junit4:junit4]   2> 3856 T441 oass.FileExchangeRateProvider.reload Reloading exchange rates from file currency.xml
[junit4:junit4]   2> 3860 T441 oass.OpenExchangeRatesOrgProvider.reload Reloading exchange rates from open-exchange-rates.json
[junit4:junit4]   2> 3861 T441 oass.OpenExchangeRatesOrgProvider.reload Reloading exchange rates from open-exchange-rates.json
[junit4:junit4]   2> 3863 T441 oasc.SolrCore.<init> [collection1] Opening new SolrCore at /usr/home/hudson/hudson-slave/workspace/Lucene-Solr-Tests-trunk-Java6/solr/build/solr-core/test/J1/./solrtest-jetty1-1348046269865/collection1/, dataDir=./org.apache.solr.cloud.BasicDistributedZk2Test-1348046267211/jetty1/
[junit4:junit4]   2> 3863 T441 oasc.JmxMonitoredMap.<init> JMX monitoring is enabled. Adding Solr mbeans to JMX Server: com.sun.jmx.mbeanserver.JmxMBeanServer@6b7599cc
[junit4:junit4]   2> 3864 T441 oasc.SolrCore.getNewIndexDir WARNING New index directory detected: old=null new=./org.apache.solr.cloud.BasicDistributedZk2Test-1348046267211/jetty1/index/
[junit4:junit4]   2> 3865 T441 oasc.SolrCore.initIndex WARNING [collection1] Solr index directory './org.apache.solr.cloud.BasicDistributedZk2Test-1348046267211/jetty1/index' doesn't exist. Creating new index...
[junit4:junit4]   2> 3865 T441 oasc.CachingDirectoryFactory.get return new directory for /usr/home/hudson/hudson-slave/workspace/Lucene-Solr-Tests-trunk-Java6/solr/build/solr-core/test/J1/./org.apache.solr.cloud.BasicDistributedZk2Test-1348046267211/jetty1/index forceNew:false
[junit4:junit4]   2> 3870 T441 oasc.SolrDeletionPolicy.onCommit SolrDeletionPolicy.onCommit: commits:num=1
[junit4:junit4]   2> 		commit{dir=/usr/home/hudson/hudson-slave/workspace/Lucene-Solr-Tests-trunk-Java6/solr/build/solr-core/test/J1/org.apache.solr.cloud.BasicDistributedZk2Test-1348046267211/jetty1/index,segFN=segments_1,generation=1,filenames=[segments_1]
[junit4:junit4]   2> 3871 T441 oasc.SolrDeletionPolicy.updateCommits newest commit = 1
[junit4:junit4]   2> 3871 T441 oasc.SolrCore.initWriters created xml: solr.XMLResponseWriter
[junit4:junit4]   2> 3873 T441 oasup.UpdateRequestProcessorChain.init inserting DistributedUpdateProcessorFactory into updateRequestProcessorChain "dedupe"
[junit4:junit4]   2> 3873 T441 oasup.UpdateRequestProcessorChain.init inserting DistributedUpdateProcessorFactory into updateRequestProcessorChain "dedupe-allfields"
[junit4:junit4]   2> 3874 T441 oasup.UpdateRequestProcessorChain.init inserting DistributedUpdateProcessorFactory into updateRequestProcessorChain "stored_sig"
[junit4:junit4]   2> 3874 T441 oasup.UpdateRequestProcessorChain.init inserting DistributedUpdateProcessorFactory into updateRequestProcessorChain "uniq-fields"
[junit4:junit4]   2> 3875 T441 oasup.UpdateRequestProcessorChain.init inserting DistributedUpdateProcessorFactory into updateRequestProcessorChain "distrib-dup-test-chain-implicit"
[junit4:junit4]   2> 3875 T441 oasc.RequestHandlers.initHandlersFromConfig adding lazy requestHandler: solr.ReplicationHandler
[junit4:junit4]   2> 3876 T441 oasc.RequestHandlers.initHandlersFromConfig created /replication: solr.ReplicationHandler
[junit4:junit4]   2> 3876 T441 oasc.RequestHandlers.initHandlersFromConfig created standard: solr.StandardRequestHandler
[junit4:junit4]   2> 3877 T441 oasc.RequestHandlers.initHandlersFromConfig created /get: solr.RealTimeGetHandler
[junit4:junit4]   2> 3877 T441 oasc.RequestHandlers.initHandlersFromConfig created dismax: solr.SearchHandler
[junit4:junit4]   2> 3878 T441 oasc.RequestHandlers.initHandlersFromConfig created mock: org.apache.solr.core.MockQuerySenderListenerReqHandler
[junit4:junit4]   2> 3878 T441 oasc.RequestHandlers.initHandlersFromConfig created /admin/: org.apache.solr.handler.admin.AdminHandlers
[junit4:junit4]   2> 3879 T441 oasc.RequestHandlers.initHandlersFromConfig created defaults: solr.StandardRequestHandler
[junit4:junit4]   2> 3879 T441 oasc.RequestHandlers.initHandlersFromConfig adding lazy requestHandler: solr.StandardRequestHandler
[junit4:junit4]   2> 3880 T441 oasc.RequestHandlers.initHandlersFromConfig created lazy: solr.StandardRequestHandler
[junit4:junit4]   2> 3880 T441 oasc.RequestHandlers.initHandlersFromConfig created /update: solr.UpdateRequestHandler
[junit4:junit4]   2> 3881 T441 oasc.RequestHandlers.initHandlersFromConfig created /terms: org.apache.solr.handler.component.SearchHandler
[junit4:junit4]   2> 3881 T441 oasc.RequestHandlers.initHandlersFromConfig created spellCheckCompRH: org.apache.solr.handler.component.SearchHandler
[junit4:junit4]   2> 3882 T441 oasc.RequestHandlers.initHandlersFromConfig created spellCheckCompRH_Direct: org.apache.solr.handler.component.SearchHandler
[junit4:junit4]   2> 3882 T441 oasc.RequestHandlers.initHandlersFromConfig created spellCheckWithWordbreak: org.apache.solr.handler.component.SearchHandler
[junit4:junit4]   2> 3883 T441 oasc.RequestHandlers.initHandlersFromConfig created spellCheckWithWordbreak_Direct: org.apache.solr.handler.component.SearchHandler
[junit4:junit4]   2> 3883 T441 oasc.RequestHandlers.initHandlersFromConfig created spellCheckCompRH1: org.apache.solr.handler.component.SearchHandler
[junit4:junit4]   2> 3884 T441 oasc.RequestHandlers.initHandlersFromConfig created tvrh: org.apache.solr.handler.component.SearchHandler
[junit4:junit4]   2> 3884 T441 oasc.RequestHandlers.initHandlersFromConfig created /mlt: solr.MoreLikeThisHandler
[junit4:junit4]   2> 3885 T441 oasc.RequestHandlers.initHandlersFromConfig created /debug/dump: solr.DumpRequestHandler
[junit4:junit4]   2> 3888 T441 oashl.XMLLoader.init xsltCacheLifetimeSeconds=60
[junit4:junit4]   2> 3891 T441 oasc.SolrCore.initDeprecatedSupport WARNING solrconfig.xml uses deprecated <admin/gettableFiles>, Please update your config to use the ShowFileRequestHandler.
[junit4:junit4]   2> 3892 T441 oasc.SolrCore.initDeprecatedSupport WARNING adding ShowFileRequestHandler with hidden files: [SCHEMA.XML, OLD_SYNONYMS.TXT, STOPWORDS.TXT, PROTWORDS.TXT, OPEN-EXCHANGE-RATES.JSON, SYNONYMS.TXT, CURRENCY.XML, MAPPING-ISOLATIN1ACCENT.TXT]
[junit4:junit4]   2> 3895 T441 oass.SolrIndexSearcher.<init> Opening Searcher@621fb2b9 main
[junit4:junit4]   2> 3896 T441 oasu.CommitTracker.<init> Hard AutoCommit: disabled
[junit4:junit4]   2> 3896 T441 oasu.CommitTracker.<init> Soft AutoCommit: disabled
[junit4:junit4]   2> 3897 T441 oashc.SpellCheckComponent.inform Initializing spell checkers
[junit4:junit4]   2> 3903 T441 oass.DirectSolrSpellChecker.init init: {name=direct,classname=DirectSolrSpellChecker,field=lowerfilt,minQueryLength=3}
[junit4:junit4]   2> 3948 T476 oasc.SolrCore.registerSearcher [collection1] Registered new searcher Searcher@621fb2b9 main{StandardDirectoryReader(segments_1:1)}
[junit4:junit4]   2> 4141 T462 oascc.ZkStateReader.updateClusterState Updating cloud state from ZooKeeper... 
[junit4:junit4]   2> 4156 T461 oascc.ZkStateReader$2.process A cluster state change has occurred - updating...
[junit4:junit4]   2> 4156 T475 oascc.ZkStateReader$2.process A cluster state change has occurred - updating...
[junit4:junit4]   2> 4455 T441 oasc.CoreContainer.register registering core: collection1
[junit4:junit4]   2> 4455 T441 oasc.ZkController.register Register shard - core:collection1 address:http://127.0.0.1:39666/solr shardId:shard1
[junit4:junit4]   2> 4456 T441 oascc.SolrZkClient.makePath makePath: /collections/collection1/leader_elect/shard1/election
[junit4:junit4]   2> 4473 T446 oazs.PrepRequestProcessor.pRequest Got user-level KeeperException when processing sessionid:0x139ddd1a3510003 type:delete cxid:0x43 zxid:0xfffffffffffffffe txntype:unknown reqpath:n/a Error Path:/solr/collections/collection1/leaders Error:KeeperErrorCode = NoNode for /solr/collections/collection1/leaders
[junit4:junit4]   2> 4473 T441 oasc.ShardLeaderElectionContext.runLeaderProcess Running the leader process.
[junit4:junit4]   2> 4474 T446 oazs.PrepRequestProcessor.pRequest Got user-level KeeperException when processing sessionid:0x139ddd1a3510003 type:create cxid:0x44 zxid:0xfffffffffffffffe txntype:unknown reqpath:n/a Error Path:/solr/overseer Error:KeeperErrorCode = NodeExists for /solr/overseer
[junit4:junit4]   2> 4476 T441 oasc.ShardLeaderElectionContext.waitForReplicasToComeUp Enough replicas found to continue.
[junit4:junit4]   2> 4476 T441 oasc.ShardLeaderElectionContext.runLeaderProcess I may be the new leader - try and sync
[junit4:junit4]   2> 4476 T441 oasc.SyncStrategy.sync Sync replicas to http://127.0.0.1:39666/solr/collection1/
[junit4:junit4]   2> 4477 T441 oasc.SyncStrategy.syncReplicas Sync Success - now sync replicas to me
[junit4:junit4]   2> 4477 T441 oasc.SyncStrategy.syncToMe http://127.0.0.1:39666/solr/collection1/ has no replicas
[junit4:junit4]   2> 4477 T441 oasc.ShardLeaderElectionContext.runLeaderProcess I am the new leader: http://127.0.0.1:39666/solr/collection1/
[junit4:junit4]   2> 4478 T441 oascc.SolrZkClient.makePath makePath: /collections/collection1/leaders/shard1
[junit4:junit4]   2> 4482 T446 oazs.PrepRequestProcessor.pRequest Got user-level KeeperException when processing sessionid:0x139ddd1a3510003 type:create cxid:0x4e zxid:0xfffffffffffffffe txntype:unknown reqpath:n/a Error Path:/solr/overseer Error:KeeperErrorCode = NodeExists for /solr/overseer
[junit4:junit4]   2> 4661 T462 oascc.ZkStateReader.updateClusterState Updating cloud state from ZooKeeper... 
[junit4:junit4]   2> 4686 T461 oascc.ZkStateReader$2.process A cluster state change has occurred - updating...
[junit4:junit4]   2> 4686 T475 oascc.ZkStateReader$2.process A cluster state change has occurred - updating...
[junit4:junit4]   2> 4688 T441 oasc.ZkController.register We are http://127.0.0.1:39666/solr/collection1/ and leader is http://127.0.0.1:39666/solr/collection1/
[junit4:junit4]   2> 4688 T441 oasc.ZkController.register No LogReplay needed for core=collection1 baseURL=http://127.0.0.1:39666/solr
[junit4:junit4]   2> 4689 T441 oasc.ZkController.checkRecovery I am the leader, no recovery necessary
[junit4:junit4]   2> 4696 T441 oascc.ZkStateReader.updateClusterState Updating cloud state from ZooKeeper... 
[junit4:junit4]   2> 4703 T441 oass.SolrDispatchFilter.init user.dir=/usr/home/hudson/hudson-slave/workspace/Lucene-Solr-Tests-trunk-Java6/solr/build/solr-core/test/J1
[junit4:junit4]   2> 4704 T441 oass.SolrDispatchFilter.init SolrDispatchFilter.init() done
[junit4:junit4]   2> 4704 T441 oascsi.HttpClientUtil.createClient Creating new http client, config:maxConnections=128&maxConnectionsPerHost=32&followRedirects=false
[junit4:junit4]   2> 4813 T441 oejs.Server.doStart jetty-8.1.2.v20120308
[junit4:junit4]   2> 4815 T441 oejs.AbstractConnector.doStart Started SocketConnector@0.0.0.0:15812
[junit4:junit4]   2> 4816 T441 oasc.SolrResourceLoader.locateSolrHome JNDI not configured for solr (NoInitialContextEx)
[junit4:junit4]   2> 4816 T441 oasc.SolrResourceLoader.locateSolrHome using system property solr.solr.home: /usr/home/hudson/hudson-slave/workspace/Lucene-Solr-Tests-trunk-Java6/solr/build/solr-core/test/J1/./solrtest-jetty2-1348046271919
[junit4:junit4]   2> 4816 T441 oasc.SolrResourceLoader.<init> new SolrResourceLoader for deduced Solr Home: '/usr/home/hudson/hudson-slave/workspace/Lucene-Solr-Tests-trunk-Java6/solr/build/solr-core/test/J1/./solrtest-jetty2-1348046271919/'
[junit4:junit4]   2> 4841 T441 oass.SolrDispatchFilter.init SolrDispatchFilter.init()
[junit4:junit4]   2> 4841 T441 oasc.SolrResourceLoader.locateSolrHome JNDI not configured for solr (NoInitialContextEx)
[junit4:junit4]   2> 4841 T441 oasc.SolrResourceLoader.locateSolrHome using system property solr.solr.home: /usr/home/hudson/hudson-slave/workspace/Lucene-Solr-Tests-trunk-Java6/solr/build/solr-core/test/J1/./solrtest-jetty2-1348046271919
[junit4:junit4]   2> 4842 T441 oasc.CoreContainer$Initializer.initialize looking for solr.xml: /usr/home/hudson/hudson-slave/workspace/Lucene-Solr-Tests-trunk-Java6/solr/build/solr-core/test/J1/./solrtest-jetty2-1348046271919/solr.xml
[junit4:junit4]   2> 4842 T441 oasc.CoreContainer.<init> New CoreContainer 843083567
[junit4:junit4]   2> 4843 T441 oasc.CoreContainer.load Loading CoreContainer using Solr Home: '/usr/home/hudson/hudson-slave/workspace/Lucene-Solr-Tests-trunk-Java6/solr/build/solr-core/test/J1/./solrtest-jetty2-1348046271919/'
[junit4:junit4]   2> 4843 T441 oasc.SolrResourceLoader.<init> new SolrResourceLoader for directory: '/usr/home/hudson/hudson-slave/workspace/Lucene-Solr-Tests-trunk-Java6/solr/build/solr-core/test/J1/./solrtest-jetty2-1348046271919/'
[junit4:junit4]   2> 4861 T441 oasc.CoreContainer.load Registering Log Listener
[junit4:junit4]   2> 4871 T441 oasc.CoreContainer.initZooKeeper Zookeeper client=127.0.0.1:55606/solr
[junit4:junit4]   2> 4872 T441 oaz.ZooKeeper.<init> Initiating client connection, connectString=127.0.0.1:55606/solr sessionTimeout=5000 watcher=org.apache.solr.common.cloud.ConnectionManager@4fbf7a02
[junit4:junit4]   2> 4872 T486 oaz.ClientCnxn$SendThread.startConnect Opening socket connection to server /127.0.0.1:55606
[junit4:junit4]   2> 4872 T441 oascc.ConnectionManager.waitForConnected Waiting for client to connect to ZooKeeper
[junit4:junit4]   2> 4874 T486 oaz.ClientCnxn$SendThread.primeConnection Socket connection established to localhost/127.0.0.1:55606, initiating session
[junit4:junit4]   2> 4874 T443 oazs.NIOServerCnxn$Factory.run Accepted socket connection from /140.211.11.196:23031
[junit4:junit4]   2> 4875 T443 oazs.NIOServerCnxn.readConnectRequest Client attempting to establish new session at /140.211.11.196:23031
[junit4:junit4]   2> 4877 T445 oazs.NIOServerCnxn.finishSessionInit Established session 0x139ddd1a3510004 with negotiated timeout 5000 for client /140.211.11.196:23031
[junit4:junit4]   2> 4877 T486 oaz.ClientCnxn$SendThread.readConnectResult Session establishment complete on server localhost/127.0.0.1:55606, sessionid = 0x139ddd1a3510004, negotiated timeout = 5000
[junit4:junit4]   2> 4877 T487 oascc.ConnectionManager.process Watcher org.apache.solr.common.cloud.ConnectionManager@4fbf7a02 name:ZooKeeperConnection Watcher:127.0.0.1:55606/solr got event WatchedEvent state:SyncConnected type:None path:null path:null type:None
[junit4:junit4]   2> 4877 T441 oascc.ConnectionManager.waitForConnected Client is connected to ZooKeeper
[junit4:junit4]   2> 4878 T446 oazs.PrepRequestProcessor.pRequest Got user-level KeeperException when processing sessionid:0x139ddd1a3510004 type:create cxid:0x1 zxid:0xfffffffffffffffe txntype:unknown reqpath:n/a Error Path:/solr/overseer Error:KeeperErrorCode = NodeExists for /solr/overseer
[junit4:junit4]   2> 4889 T446 oazs.PrepRequestProcessor.pRequest Got user-level KeeperException when processing sessionid:0x139ddd1a3510004 type:create cxid:0x2 zxid:0xfffffffffffffffe txntype:unknown reqpath:n/a Error Path:/solr/overseer Error:KeeperErrorCode = NodeExists for /solr/overseer
[junit4:junit4]   2> 4891 T441 oasc.ZkController.createEphemeralLiveNode Register node as live in ZooKeeper:/live_nodes/127.0.0.1:15812_solr
[junit4:junit4]   2> 4891 T446 oazs.PrepRequestProcessor.pRequest Got user-level KeeperException when processing sessionid:0x139ddd1a3510004 type:delete cxid:0x4 zxid:0xfffffffffffffffe txntype:unknown reqpath:n/a Error Path:/solr/live_nodes/127.0.0.1:15812_solr Error:KeeperErrorCode = NoNode for /solr/live_nodes/127.0.0.1:15812_solr
[junit4:junit4]   2> 4897 T441 oascc.SolrZkClient.makePath makePath: /live_nodes/127.0.0.1:15812_solr
[junit4:junit4]   2> 4899 T461 oascc.ZkStateReader$3.process Updating live nodes
[junit4:junit4]   2> 4900 T475 oascc.ZkStateReader$3.process Updating live nodes
[junit4:junit4]   2> 4901 T441 oashc.HttpShardHandlerFactory.getParameter Setting socketTimeout to: 0
[junit4:junit4]   2> 4901 T441 oashc.HttpShardHandlerFactory.getParameter Setting urlScheme to: http://
[junit4:junit4]   2> 4901 T441 oashc.HttpShardHandlerFactory.getParameter Setting connTimeout to: 0
[junit4:junit4]   2> 4902 T441 oashc.HttpShardHandlerFactory.getParameter Setting maxConnectionsPerHost to: 20
[junit4:junit4]   2> 4902 T441 oashc.HttpShardHandlerFactory.getParameter Setting corePoolSize to: 0
[junit4:junit4]   2> 4902 T441 oashc.HttpShardHandlerFactory.getParameter Setting maximumPoolSize to: 2147483647
[junit4:junit4]   2> 4903 T441 oashc.HttpShardHandlerFactory.getParameter Setting maxThreadIdleTime to: 5
[junit4:junit4]   2> 4903 T441 oashc.HttpShardHandlerFactory.getParameter Setting sizeOfQueue to: -1
[junit4:junit4]   2> 4903 T441 oashc.HttpShardHandlerFactory.getParameter Setting fairnessPolicy to: false
[junit4:junit4]   2> 4904 T441 oascsi.HttpClientUtil.createClient Creating new http client, config:maxConnectionsPerHost=20&maxConnections=10000&socketTimeout=0&connTimeout=0&retry=false
[junit4:junit4]   2> 4917 T441 oascc.ZkStateReader.createClusterStateWatchersAndUpdate Updating cluster state from ZooKeeper... 
[junit4:junit4]   2> 4922 T441 oasc.CoreContainer.create Creating SolrCore 'collection1' using instanceDir: /usr/home/hudson/hudson-slave/workspace/Lucene-Solr-Tests-trunk-Java6/solr/build/solr-core/test/J1/./solrtest-jetty2-1348046271919/collection1
[junit4:junit4]   2> 4922 T441 oasc.ZkController.createCollectionZkNode Check for collection zkNode:collection1
[junit4:junit4]   2> 4923 T441 oasc.ZkController.createCollectionZkNode Collection zkNode exists
[junit4:junit4]   2> 4923 T441 oasc.ZkController.readConfigName Load collection config from:/collections/collection1
[junit4:junit4]   2> 4925 T441 oasc.SolrResourceLoader.<init> new SolrResourceLoader for directory: '/usr/home/hudson/hudson-slave/workspace/Lucene-Solr-Tests-trunk-Java6/solr/build/solr-core/test/J1/./solrtest-jetty2-1348046271919/collection1/'
[junit4:junit4]   2> 4926 T441 oasc.SolrResourceLoader.replaceClassLoader Adding 'file:/usr/home/hudson/hudson-slave/workspace/Lucene-Solr-Tests-trunk-Java6/solr/build/solr-core/test/J1/solrtest-jetty2-1348046271919/collection1/lib/classes/' to classloader
[junit4:junit4]   2> 4926 T441 oasc.SolrResourceLoader.replaceClassLoader Adding 'file:/usr/home/hudson/hudson-slave/workspace/Lucene-Solr-Tests-trunk-Java6/solr/build/solr-core/test/J1/solrtest-jetty2-1348046271919/collection1/lib/README' to classloader
[junit4:junit4]   2> 4962 T441 oasc.SolrConfig.<init> Using Lucene MatchVersion: LUCENE_50
[junit4:junit4]   2> 5009 T441 oasc.SolrConfig.<init> Loaded SolrConfig: solrconfig.xml
[junit4:junit4]   2> 5110 T441 oass.IndexSchema.readSchema Reading Solr Schema
[junit4:junit4]   2> 5115 T441 oass.IndexSchema.readSchema Schema name=test
[junit4:junit4]   2> 5206 T462 oascc.ZkStateReader.updateClusterState Updating cloud state from ZooKeeper... 
[junit4:junit4]   2> 5212 T487 oascc.ZkStateReader$2.process A cluster state change has occurred - updating...
[junit4:junit4]   2> 5212 T461 oascc.ZkStateReader$2.process A cluster state change has occurred - updating...
[junit4:junit4]   2> 5212 T475 oascc.ZkStateReader$2.process A cluster state change has occurred - updating...
[junit4:junit4]   2> 5608 T441 oass.OpenExchangeRatesOrgProvider.init Initialized with rates=open-exchange-rates.json, refreshInterval=1440.
[junit4:junit4]   2> 5617 T441 oass.IndexSchema.readSchema default search field in schema is text
[junit4:junit4]   2> 5620 T441 oass.IndexSchema.readSchema unique key field: id
[junit4:junit4]   2> 5635 T441 oass.FileExchangeRateProvider.reload Reloading exchange rates from file currency.xml
[junit4:junit4]   2> 5639 T441 oass.FileExchangeRateProvider.reload Reloading exchange rates from file currency.xml
[junit4:junit4]   2> 5643 T441 oass.OpenExchangeRatesOrgProvider.reload Reloading exchange rates from open-exchange-rates.json
[junit4:junit4]   2> 5645 T441 oass.OpenExchangeRatesOrgProvider.reload Reloading exchange rates from open-exchange-rates.json
[junit4:junit4]   2> 5646 T441 oasc.SolrCore.<init> [collection1] Opening new SolrCore at /usr/home/hudson/hudson-slave/workspace/Lucene-Solr-Tests-trunk-Java6/solr/build/solr-core/test/J1/./solrtest-jetty2-1348046271919/collection1/, dataDir=./org.apache.solr.cloud.BasicDistributedZk2Test-1348046267211/jetty2/
[junit4:junit4]   2> 5647 T441 oasc.JmxMonitoredMap.<init> JMX monitoring is enabled. Adding Solr mbeans to JMX Server: com.sun.jmx.mbeanserver.JmxMBeanServer@6b7599cc
[junit4:junit4]   2> 5648 T441 oasc.SolrCore.getNewIndexDir WARNING New index directory detected: old=null new=./org.apache.solr.cloud.BasicDistributedZk2Test-1348046267211/jetty2/index/
[junit4:junit4]   2> 5648 T441 oasc.SolrCore.initIndex WARNING [collection1] Solr index directory './org.apache.solr.cloud.BasicDistributedZk2Test-1348046267211/jetty2/index' doesn't exist. Creating new index...
[junit4:junit4]   2> 5649 T441 oasc.CachingDirectoryFactory.get return new directory for /usr/home/hudson/hudson-slave/workspace/Lucene-Solr-Tests-trunk-Java6/solr/build/solr-core/test/J1/./org.apache.solr.cloud.BasicDistributedZk2Test-1348046267211/jetty2/index forceNew:false
[junit4:junit4]   2> 5653 T441 oasc.SolrDeletionPolicy.onCommit SolrDeletionPolicy.onCommit: commits:num=1
[junit4:junit4]   2> 		commit{dir=/usr/home/hudson/hudson-slave/workspace/Lucene-Solr-Tests-trunk-Java6/solr/build/solr-core/test/J1/org.apache.solr.cloud.BasicDistributedZk2Test-1348046267211/jetty2/index,segFN=segments_1,generation=1,filenames=[segments_1]
[junit4:junit4]   2> 5654 T441 oasc.SolrDeletionPolicy.updateCommits newest commit = 1
[junit4:junit4]   2> 5654 T441 oasc.SolrCore.initWriters created xml: solr.XMLResponseWriter
[junit4:junit4]   2> 5656 T441 oasup.UpdateRequestProcessorChain.init inserting DistributedUpdateProcessorFactory into updateRequestProcessorChain "dedupe"
[junit4:junit4]   2> 5657 T441 oasup.UpdateRequestProcessorChain.init inserting DistributedUpdateProcessorFactory into updateRequestProcessorChain "dedupe-allfields"
[junit4:junit4]   2> 5657 T441 oasup.UpdateRequestProcessorChain.init inserting DistributedUpdateProcessorFactory into updateRequestProcessorChain "stored_sig"
[junit4:junit4]   2> 5657 T441 oasup.UpdateRequestProcessorChain.init inserting DistributedUpdateProcessorFactory into updateRequestProcessorChain "uniq-fields"
[junit4:junit4]   2> 5658 T441 oasup.UpdateRequestProcessorChain.init inserting DistributedUpdateProcessorFactory into updateRequestProcessorChain "distrib-dup-test-chain-implicit"
[junit4:junit4]   2> 5658 T441 oasc.RequestHandlers.initHandlersFromConfig adding lazy requestHandler: solr.ReplicationHandler
[junit4:junit4]   2> 5659 T441 oasc.RequestHandlers.initHandlersFromConfig created /replication: solr.ReplicationHandler
[junit4:junit4]   2> 5659 T441 oasc.RequestHandlers.initHandlersFromConfig created standard: solr.StandardRequestHandler
[junit4:junit4]   2> 5660 T441 oasc.RequestHandlers.initHandlersFromConfig created /get: solr.RealTimeGetHandler
[junit4:junit4]   2> 5660 T441 oasc.RequestHandlers.initHandlersFromConfig created dismax: solr.SearchHandler
[junit4:junit4]   2> 5661 T441 oasc.RequestHandlers.initHandlersFromConfig created mock: org.apache.solr.core.MockQuerySenderListenerReqHandler
[junit4:junit4]   2> 5661 T441 oasc.RequestHandlers.initHandlersFromConfig created /admin/: org.apache.solr.handler.admin.AdminHandlers
[junit4:junit4]   2> 5662 T441 oasc.RequestHandlers.initHandlersFromConfig created defaults: solr.StandardRequestHandler
[junit4:junit4]   2> 5662 T441 oasc.RequestHandlers.initHandlersFromConfig adding lazy requestHandler: solr.StandardRequestHandler
[junit4:junit4]   2> 5663 T441 oasc.RequestHandlers.initHandlersFromConfig created lazy: solr.StandardRequestHandler
[junit4:junit4]   2> 5663 T441 oasc.RequestHandlers.initHandlersFromConfig created /update: solr.UpdateRequestHandler
[junit4:junit4]   2> 5664 T441 oasc.RequestHandlers.initHandlersFromConfig created /terms: org.apache.solr.handler.component.SearchHandler
[junit4:junit4]   2> 5664 T441 oasc.RequestHandlers.initHandlersFromConfig created spellCheckCompRH: org.apache.solr.handler.component.SearchHandler
[junit4:junit4]   2> 5665 T441 oasc.RequestHandlers.initHandlersFromConfig created spellCheckCompRH_Direct: org.apache.solr.handler.component.SearchHandler
[junit4:junit4]   2> 5665 T441 oasc.RequestHandlers.initHandlersFromConfig created spellCheckWithWordbreak: org.apache.solr.handler.component.SearchHandler
[junit4:junit4]   2> 5666 T441 oasc.RequestHandlers.initHandlersFromConfig created spellCheckWithWordbreak_Direct: org.apache.solr.handler.component.SearchHandler
[junit4:junit4]   2> 5666 T441 oasc.RequestHandlers.initHandlersFromConfig created spellCheckCompRH1: org.apache.solr.handler.component.SearchHandler
[junit4:junit4]   2> 5667 T441 oasc.RequestHandlers.initHandlersFromConfig created tvrh: org.apache.solr.handler.component.SearchHandler
[junit4:junit4]   2> 5667 T441 oasc.RequestHandlers.initHandlersFromConfig created /mlt: solr.MoreLikeThisHandler
[junit4:junit4]   2> 5668 T441 oasc.RequestHandlers.initHandlersFromConfig created /debug/dump: solr.DumpRequestHandler
[junit4:junit4]   2> 5671 T441 oashl.XMLLoader.init xsltCacheLifetimeSeconds=60
[junit4:junit4]   2> 5674 T441 oasc.SolrCore.initDeprecatedSupport WARNING solrconfig.xml uses deprecated <admin/gettableFiles>, Please update your config to use the ShowFileRequestHandler.
[junit4:junit4]   2> 5675 T441 oasc.SolrCore.initDeprecatedSupport WARNING adding ShowFileRequestHandler with hidden files: [SCHEMA.XML, OLD_SYNONYMS.TXT, STOPWORDS.TXT, PROTWORDS.TXT, OPEN-EXCHANGE-RATES.JSON, SYNONYMS.TXT, CURRENCY.XML, MAPPING-ISOLATIN1ACCENT.TXT]
[junit4:junit4]   2> 5678 T441 oass.SolrIndexSearcher.<init> Opening Searcher@4b63e085 main
[junit4:junit4]   2> 5679 T441 oasu.CommitTracker.<init> Hard AutoCommit: disabled
[junit4:junit4]   2> 5679 T441 oasu.CommitTracker.<init> Soft AutoCommit: disabled
[junit4:junit4]   2> 5680 T441 oashc.SpellCheckComponent.inform Initializing spell checkers
[junit4:junit4]   2> 5685 T441 oass.DirectSolrSpellChecker.init init: {name=direct,classname=DirectSolrSpellChecker,field=lowerfilt,minQueryLength=3}
[junit4:junit4]   2> 5733 T488 oasc.SolrCore.registerSearcher [collection1] Registered new searcher Searcher@4b63e085 main{StandardDirectoryReader(segments_1:1)}
[junit4:junit4]   2> 6220 T462 oascc.ZkStateReader.updateClusterState Updating cloud state from ZooKeeper... 
[junit4:junit4]   2> 6234 T461 oascc.ZkStateReader$2.process A cluster state change has occurred - updating...
[junit4:junit4]   2> 6234 T475 oascc.ZkStateReader$2.process A cluster state change has occurred - updating...
[junit4:junit4]   2> 6234 T487 oascc.ZkStateReader$2.process A cluster state change has occurred - updating...
[junit4:junit4]   2> 6239 T441 oasc.CoreContainer.register registering core: collection1
[junit4:junit4]   2> 6239 T441 oasc.ZkController.register Register shard - core:collection1 address:http://127.0.0.1:15812/solr shardId:shard2
[junit4:junit4]   2> 6240 T441 oascc.SolrZkClient.makePath makePath: /collections/collection1/leader_elect/shard2/election
[junit4:junit4]   2> 6257 T446 oazs.PrepRequestProcessor.pRequest Got user-level KeeperException when processing sessionid:0x139ddd1a3510004 type:delete cxid:0x42 zxid:0xfffffffffffffffe txntype:unknown reqpath:n/a Error Path:/solr/collections/collection1/leaders/shard2 Error:KeeperErrorCode = NoNode for /solr/collections/collection1/leaders/shard2
[junit4:junit4]   2> 6258 T441 oasc.ShardLeaderElectionContext.runLeaderProcess Running the leader process.
[junit4:junit4]   2> 6258 T446 oazs.PrepRequestProcessor.pRequest Got user-level KeeperException when processing sessionid:0x139ddd1a3510004 type:create cxid:0x43 zxid:0xfffffffffffffffe txntype:unknown reqpath:n/a Error Path:/solr/overseer Error:KeeperErrorCode = NodeExists for /solr/overseer
[junit4:junit4]   2> 6261 T441 oasc.ShardLeaderElectionContext.waitForReplicasToComeUp Enough replicas found to continue.
[junit4:junit4]   2> 6261 T441 oasc.ShardLeaderElectionContext.runLeaderProcess I may be the new leader - try and sync
[junit4:junit4]   2> 6262 T441 oasc.SyncStrategy.sync Sync replicas to http://127.0.0.1:15812/solr/collection1/
[junit4:junit4]   2> 6262 T441 oasc.SyncStrategy.syncReplicas Sync Success - now sync replicas to me
[junit4:junit4]   2> 6263 T441 oasc.SyncStrategy.syncToMe http://127.0.0.1:15812/solr/collection1/ has no replicas
[junit4:junit4]   2> 6263 T441 oasc.ShardLeaderElectionContext.runLeaderProcess I am the new leader: http://127.0.0.1:15812/solr/collection1/
[junit4:junit4]   2> 6264 T441 oascc.SolrZkClient.makePath makePath: /collections/collection1/leaders/shard2
[junit4:junit4]   2> 6268 T446 oazs.PrepRequestProcessor.pRequest Got user-level KeeperException when processing sessionid:0x139ddd1a3510004 type:create cxid:0x4c zxid:0xfffffffffffffffe txntype:unknown reqpath:n/a Error Path:/solr/overseer Error:KeeperErrorCode = NodeExists for /solr/overseer
[junit4:junit4]   2> 6740 T462 oascc.ZkStateReader.updateClusterState Updating cloud state from ZooKeeper... 
[junit4:junit4]   2> 6758 T461 oascc.ZkStateReader$2.process A cluster state change has occurred - updating...
[junit4:junit4]   2> 6758 T475 oascc.ZkStateReader$2.process A cluster state change has occurred - updating...
[junit4:junit4]   2> 6758 T487 oascc.ZkStateReader$2.process A cluster state change has occurred - updating...
[junit4:junit4]   2> 6780 T441 oasc.ZkController.register We are http://127.0.0.1:15812/solr/collection1/ and leader is http://127.0.0.1:15812/solr/collection1/
[junit4:junit4]   2> 6780 T441 oasc.ZkController.register No LogReplay needed for core=collection1 baseURL=http://127.0.0.1:15812/solr
[junit4:junit4]   2> 6781 T441 oasc.ZkController.checkRecovery I am the leader, no recovery necessary
[junit4:junit4]   2> 6783 T441 oascc.ZkStateReader.updateClusterState Updating cloud state from ZooKeeper... 
[junit4:junit4]   2> 6784 T441 oass.SolrDispatchFilter.init user.dir=/usr/home/hudson/hudson-slave/workspace/Lucene-Solr-Tests-trunk-Java6/solr/build/solr-core/test/J1
[junit4:junit4]   2> 6784 T441 oass.SolrDispatchFilter.init SolrDispatchFilter.init() done
[junit4:junit4]   2> 6785 T441 oascsi.HttpClientUtil.createClient Creating new http client, config:maxConnections=128&maxConnectionsPerHost=32&followRedirects=false
[junit4:junit4]   2> 6958 T441 oejs.Server.doStart jetty-8.1.2.v20120308
[junit4:junit4]   2> 6961 T441 oejs.AbstractConnector.doStart Started SocketConnector@0.0.0.0:62806
[junit4:junit4]   2> 6961 T441 oasc.SolrResourceLoader.locateSolrHome JNDI not configured for solr (NoInitialContextEx)
[junit4:junit4]   2> 6962 T441 oasc.SolrResourceLoader.locateSolrHome using system property solr.solr.home: /usr/home/hudson/hudson-slave/workspace/Lucene-Solr-Tests-trunk-Java6/solr/build/solr-core/test/J1/./solrtest-jetty3-1348046274006
[junit4:junit4]   2> 6962 T441 oasc.SolrResourceLoader.<init> new SolrResourceLoader for deduced Solr Home: '/usr/home/hudson/hudson-slave/workspace/Lucene-Solr-Tests-trunk-Java6/solr/build/solr-core/test/J1/./solrtest-jetty3-1348046274006/'
[junit4:junit4]   2> 7000 T441 oass.SolrDispatchFilter.init SolrDispatchFilter.init()
[junit4:junit4]   2> 7001 T441 oasc.SolrResourceLoader.locateSolrHome JNDI not configured for solr (NoInitialContextEx)
[junit4:junit4]   2> 7001 T441 oasc.SolrResourceLoader.locateSolrHome using system property solr.solr.home: /usr/home/hudson/hudson-slave/workspace/Lucene-Solr-Tests-trunk-Java6/solr/build/solr-core/test/J1/./solrtest-jetty3-1348046274006
[junit4:junit4]   2> 7002 T441 oasc.CoreContainer$Initializer.initialize looking for solr.xml: /usr/home/hudson/hudson-slave/workspace/Lucene-Solr-Tests-trunk-Java6/solr/build/solr-core/test/J1/./solrtest-jetty3-1348046274006/solr.xml
[junit4:junit4]   2> 7002 T441 oasc.CoreContainer.<init> New CoreContainer 369115109
[junit4:junit4]   2> 7003 T441 oasc.CoreContainer.load Loading CoreContainer using Solr Home: '/usr/home/hudson/hudson-slave/workspace/Lucene-Solr-Tests-trunk-Java6/solr/build/solr-core/test/J1/./solrtest-jetty3-1348046274006/'
[junit4:junit4]   2> 7003 T441 oasc.SolrResourceLoader.<init> new SolrResourceLoader for directory: '/usr/home/hudson/hudson-slave/workspace/Lucene-Solr-Tests-trunk-Java6/solr/build/solr-core/test/J1/./solrtest-jetty3-1348046274006/'
[junit4:junit4]   2> 7029 T441 oasc.CoreContainer.load Registering Log Listener
[junit4:junit4]   2> 7045 T441 oasc.CoreContainer.initZooKeeper Zookeeper client=127.0.0.1:55606/solr
[junit4:junit4]   2> 7046 T441 oaz.ZooKeeper.<init> Initiating client connection, connectString=127.0.0.1:55606/solr sessionTimeout=5000 watcher=org.apache.solr.common.cloud.ConnectionManager@108e31e
[junit4:junit4]   2> 7047 T498 oaz.ClientCnxn$SendThread.startConnect Opening socket connection to server /127.0.0.1:55606
[junit4:junit4]   2> 7047 T441 oascc.ConnectionManager.waitForConnected Waiting for client to connect to ZooKeeper
[junit4:junit4]   2> 7048 T498 oaz.ClientCnxn$SendThread.primeConnection Socket connection established to localhost/127.0.0.1:55606, initiating session
[junit4:junit4]   2> 7048 T443 oazs.NIOServerCnxn$Factory.run Accepted socket connection from /140.211.11.196:43810
[junit4:junit4]   2> 7048 T443 oazs.NIOServerCnxn.readConnectRequest Client attempting to establish new session at /140.211.11.196:43810
[junit4:junit4]   2> 7051 T445 oazs.NIOServerCnxn.finishSessionInit Established session 0x139ddd1a3510005 with negotiated timeout 5000 for client /140.211.11.196:43810
[junit4:junit4]   2> 7051 T498 oaz.ClientCnxn$SendThread.readConnectResult Session establishment complete on server localhost/127.0.0.1:55606, sessionid = 0x139ddd1a3510005, negotiated timeout = 5000
[junit4:junit4]   2> 7051 T499 oascc.ConnectionManager.process Watcher org.apache.solr.common.cloud.ConnectionManager@108e31e name:ZooKeeperConnection Watcher:127.0.0.1:55606/solr got event WatchedEvent state:SyncConnected type:None path:null path:null type:None
[junit4:junit4]   2> 7051 T441 oascc.ConnectionManager.waitForConnected Client is connected to ZooKeeper
[junit4:junit4]   2> 7052 T446 oazs.PrepRequestProcessor.pRequest Got user-level KeeperException when processing sessionid:0x139ddd1a3510005 type:create cxid:0x1 zxid:0xfffffffffffffffe txntype:unknown reqpath:n/a Error Path:/solr/overseer Error:KeeperErrorCode = NodeExists for /solr/overseer
[junit4:junit4]   2> 7067 T446 oazs.PrepRequestProcessor.pRequest Got user-level KeeperException when processing sessionid:0x139ddd1a3510005 type:create cxid:0x2 zxid:0xfffffffffffffffe txntype:unknown reqpath:n/a Error Path:/solr/overseer Error:KeeperErrorCode = NodeExists for /solr/overseer
[junit4:junit4]   2> 7075 T441 oasc.ZkController.createEphemeralLiveNode Register node as live in ZooKeeper:/live_nodes/127.0.0.1:62806_solr
[junit4:junit4]   2> 7076 T446 oazs.PrepRequestProcessor.pRequest Got user-level KeeperException when processing sessionid:0x139ddd1a3510005 type:delete cxid:0x4 zxid:0xfffffffffffffffe txntype:unknown reqpath:n/a Error Path:/solr/live_nodes/127.0.0.1:62806_solr Error:KeeperErrorCode = NoNode for /solr/live_nodes/127.0.0.1:62806_solr
[junit4:junit4]   2> 7077 T441 oascc.SolrZkClient.makePath makePath: /live_nodes/127.0.0.1:62806_solr
[junit4:junit4]   2> 7085 T487 oascc.ZkStateReader$3.process Updating live nodes
[junit4:junit4]   2> 7085 T475 oascc.ZkStateReader$3.process Updating live nodes
[junit4:junit4]   2> 7085 T461 oascc.ZkStateReader$3.process Updating live nodes
[junit4:junit4]   2> 7086 T441 oashc.HttpShardHandlerFactory.getParameter Setting socketTimeout to: 0
[junit4:junit4]   2> 7087 T441 oashc.HttpShardHandlerFactory.getParameter Setting urlScheme to: http://
[junit4:junit4]   2> 7088 T441 oashc.HttpShardHandlerFactory.getParameter Setting connTimeout to: 0
[junit4:junit4]   2> 7088 T441 oashc.HttpShardHandlerFactory.getParameter Setting maxConnectionsPerHost to: 20
[junit4:junit4]   2> 7089 T441 oashc.HttpShardHandlerFactory.getParameter Setting corePoolSize to: 0
[junit4:junit4]   2> 7090 T441 oashc.HttpShardHandlerFactory.getParameter Setting maximumPoolSize to: 2147483647
[junit4:junit4]   2> 7091 T441 oashc.HttpShardHandlerFactory.getParameter Setting maxThreadIdleTime to: 5
[junit4:junit4]   2> 7091 T441 oashc.HttpShardHandlerFactory.getParameter Setting sizeOfQueue to: -1
[junit4:junit4]   2> 7092 T441 oashc.HttpShardHandlerFactory.getParameter Setting fairnessPolicy to: false
[junit4:junit4]   2> 7092 T441 oascsi.HttpClientUtil.createClient Creating new http client, config:maxConnectionsPerHost=20&maxConnections=10000&socketTimeout=0&connTimeout=0&retry=false
[junit4:junit4]   2> 7110 T441 oascc.ZkStateReader.createClusterStateWatchersAndUpdate Updating cluster state from ZooKeeper... 
[junit4:junit4]   2> 7117 T441 oasc.CoreContainer.create Creating SolrCore 'collection1' using instanceDir: /usr/home/hudson/hudson-slave/workspace/Lucene-Solr-Tests-trunk-Java6/solr/build/solr-core/test/J1/./solrtest-jetty3-1348046274006/collection1
[junit4:junit4]   2> 7117 T441 oasc.ZkController.createCollectionZkNode Check for collection zkNode:collection1
[junit4:junit4]   2> 7118 T441 oasc.ZkController.createCollectionZkNode Collection zkNode exists
[junit4:junit4]   2> 7119 T441 oasc.ZkController.readConfigName Load collection config from:/collections/collection1
[junit4:junit4]   2> 7120 T441 oasc.SolrResourceLoader.<init> new SolrResourceLoader for directory: '/usr/home/hudson/hudson-slave/workspace/Lucene-Solr-Tests-trunk-Java6/solr/build/solr-core/test/J1/./solrtest-jetty3-1348046274006/collection1/'
[junit4:junit4]   2> 7122 T441 oasc.SolrResourceLoader.replaceClassLoader Adding 'file:/usr/home/hudson/hudson-slave/workspace/Lucene-Solr-Tests-trunk-Java6/solr/build/solr-core/test/J1/solrtest-jetty3-1348046274006/collection1/lib/classes/' to classloader
[junit4:junit4]   2> 7123 T441 oasc.SolrResourceLoader.replaceClassLoader Adding 'file:/usr/home/hudson/hudson-slave/workspace/Lucene-Solr-Tests-trunk-Java6/solr/build/solr-core/test/J1/solrtest-jetty3-1348046274006/collection1/lib/README' to classloader
[junit4:junit4]   2> 7175 T441 oasc.SolrConfig.<init> Using Lucene MatchVersion: LUCENE_50
[junit4:junit4]   2> 7247 T441 oasc.SolrConfig.<init> Loaded SolrConfig: solrconfig.xml
[junit4:junit4]   2> 7271 T462 oascc.ZkStateReader.updateClusterState Updating cloud state from ZooKeeper... 
[junit4:junit4]   2> 7284 T475 oascc.ZkStateReader$2.process A cluster state change has occurred - updating...
[junit4:junit4]   2> 7284 T461 oascc.ZkStateReader$2.process A cluster state change has occurred - updating...
[junit4:junit4]   2> 7284 T487 oascc.ZkStateReader$2.process A cluster state change has occurred - updating...
[junit4:junit4]   2> 7348 T499 oascc.ZkStateReader$2.process A cluster state change has occurred - updating...
[junit4:junit4]   2> 7348 T441 oass.IndexSchema.readSchema Reading Solr Schema
[junit4:junit4]   2> 7356 T441 oass.IndexSchema.readSchema Schema name=test
[junit4:junit4]   2> 8015 T441 oass.OpenExchangeRatesOrgProvider.init Initialized with rates=open-exchange-rates.json, refreshInterval=1440.
[junit4:junit4]   2> 8027 T441 oass.IndexSchema.readSchema default search field in schema is text
[junit4:junit4]   2> 8043 T441 oass.IndexSchema.readSchema unique key field: id
[junit4:junit4]   2> 8062 T441 oass.FileExchangeRateProvider.reload Reloading exchange rates from file currency.xml
[junit4:junit4]   2> 8068 T441 oass.FileExchangeRateProvider.reload Reloading exchange rates from file currency.xml
[junit4:junit4]   2> 8074 T441 oass.OpenExchangeRatesOrgProvider.reload Reloading exchange rates from open-exchange-rates.json
[junit4:junit4]   2> 8076 T441 oass.OpenExchangeRatesOrgProvider.reload Reloading exchange rates from open-exchange-rates.json
[junit4:junit4]   2> 8078 T441 oasc.SolrCore.<init> [collection1] Opening new SolrCore at /usr/home/hudson/hudson-slave/workspace/Lucene-Solr-Tests-trunk-Java6/solr/build/solr-core/test/J1/./solrtest-jetty3-1348046274006/collection1/, dataDir=./org.apache.solr.cloud.BasicDistributedZk2Test-1348046267211/jetty3/
[junit4:junit4]   2> 8078 T441 oasc.JmxMonitoredMap.<init> JMX monitoring is enabled. Adding Solr mbeans to JMX Server: com.sun.jmx.mbeanserver.JmxMBeanServer@6b7599cc
[junit4:junit4]   2> 8080 T441 oasc.SolrCore.getNewIndexDir WARNING New index directory detected: old=null new=./org.apache.solr.cloud.BasicDistributedZk2Test-1348046267211/jetty3/index/
[junit4:junit4]   2> 8081 T441 oasc.SolrCore.initIndex WARNING [collection1] Solr index directory './org.apache.solr.cloud.BasicDistributedZk2Test-1348046267211/jetty3/index' doesn't exist. Creating new index...
[junit4:junit4]   2> 8082 T441 oasc.CachingDirectoryFactory.get return new directory for /usr/home/hudson/hudson-slave/workspace/Lucene-Solr-Tests-trunk-Java6/solr/build/solr-core/test/J1/./org.apache.solr.cloud.BasicDistributedZk2Test-1348046267211/jetty3/index forceNew:false
[junit4:junit4]   2> 8089 T441 oasc.SolrDeletionPolicy.onCommit SolrDeletionPolicy.onCommit: commits:num=1
[junit4:junit4]   2> 		commit{dir=/usr/home/hudson/hudson-slave/workspace/Lucene-Solr-Tests-trunk-Java6/solr/build/solr-core/test/J1/org.apache.solr.cloud.BasicDistributedZk2Test-1348046267211/jetty3/index,segFN=segments_1,generation=1,filenames=[segments_1]
[junit4:junit4]   2> 8089 T441 oasc.SolrDeletionPolicy.updateCommits newest commit = 1
[junit4:junit4]   2> 8090 T441 oasc.SolrCore.initWriters created xml: solr.XMLResponseWriter
[junit4:junit4]   2> 8093 T441 oasup.UpdateRequestProcessorChain.init inserting DistributedUpdateProcessorFactory into updateRequestProcessorChain "dedupe"
[junit4:junit4]   2> 8094 T441 oasup.UpdateRequestProcessorChain.init inserting DistributedUpdateProcessorFactory into updateRequestProcessorChain "dedupe-allfields"
[junit4:junit4]   2> 8094 T441 oasup.UpdateRequestProcessorChain.init inserting DistributedUpdateProcessorFactory into updateRequestProcessorChain "stored_sig"
[junit4:junit4]   2> 8095 T441 oasup.UpdateRequestProcessorChain.init inserting DistributedUpdateProcessorFactory into updateRequestProcessorChain "uniq-fields"
[junit4:junit4]   2> 8096 T441 oasup.UpdateRequestProcessorChain.init inserting DistributedUpdateProcessorFactory into updateRequestProcessorChain "distrib-dup-test-chain-implicit"
[junit4:junit4]   2> 8096 T441 oasc.RequestHandlers.initHandlersFromConfig adding lazy requestHandler: solr.ReplicationHandler
[junit4:junit4]   2> 8097 T441 oasc.RequestHandlers.initHandlersFromConfig created /replication: solr.ReplicationHandler
[junit4:junit4]   2> 8098 T441 oasc.RequestHandlers.initHandlersFromConfig created standard: solr.StandardRequestHandler
[junit4:junit4]   2> 8098 T441 oasc.RequestHandlers.initHandlersFromConfig created /get: solr.RealTimeGetHandler
[junit4:junit4]   2> 8099 T441 oasc.RequestHandlers.initHandlersFromConfig created dismax: solr.SearchHandler
[junit4:junit4]   2> 8100 T441 oasc.RequestHandlers.initHandlersFromConfig created mock: org.apache.solr.core.MockQuerySenderListenerReqHandler
[junit4:junit4]   2> 8101 T441 oasc.RequestHandlers.initHandlersFromConfig created /admin/: org.apache.solr.handler.admin.AdminHandlers
[junit4:junit4]   2> 8102 T441 oasc.RequestHandlers.initHandlersFromConfig created defaults: solr.StandardRequestHandler
[junit4:junit4]   2> 8102 T441 oasc.RequestHandlers.initHandlersFromConfig adding lazy requestHandler: solr.StandardRequestHandler
[junit4:junit4]   2> 8103 T441 oasc.RequestHandlers.initHandlersFromConfig created lazy: solr.StandardRequestHandler
[junit4:junit4]   2> 8103 T441 oasc.RequestHandlers.initHandlersFromConfig created /update: solr.UpdateRequestHandler
[junit4:junit4]   2> 8104 T441 oasc.RequestHandlers.initHandlersFromConfig created /terms: org.apache.solr.handler.component.SearchHandler
[junit4:junit4]   2> 8105 T441 oasc.RequestHandlers.initHandlersFromConfig created spellCheckCompRH: org.apache.solr.handler.component.SearchHandler
[junit4:junit4]   2> 8106 T441 oasc.RequestHandlers.initHandlersFromConfig created spellCheckCompRH_Direct: org.apache.solr.handler.component.SearchHandler
[junit4:junit4]   2> 8107 T441 oasc.RequestHandlers.initHandlersFromConfig created spellCheckWithWordbreak: org.apache.solr.handler.component.SearchHandler
[junit4:junit4]   2> 8107 T441 oasc.RequestHandlers.initHandlersFromConfig created spellCheckWithWordbreak_Direct: org.apache.solr.handler.component.SearchHandler
[junit4:junit4]   2> 8108 T441 oasc.RequestHandlers.initHandlersFromConfig created spellCheckCompRH1: org.apache.solr.handler.component.SearchHandler
[junit4:junit4]   2> 8109 T441 oasc.RequestHandlers.initHandlersFromConfig created tvrh: org.apache.solr.handler.component.SearchHandler
[junit4:junit4]   2> 8110 T441 oasc.RequestHandlers.initHandlersFromConfig created /mlt: solr.MoreLikeThisHandler
[junit4:junit4]   2> 8110 T441 oasc.RequestHandlers.initHandlersFromConfig created /debug/dump: solr.DumpRequestHandler
[junit4:junit4]   2> 8115 T441 oashl.XMLLoader.init xsltCacheLifetimeSeconds=60
[junit4:junit4]   2> 8120 T441 oasc.SolrCore.initDeprecatedSupport WARNING solrconfig.xml uses deprecated <admin/gettableFiles>, Please update your config to use the ShowFileRequestHandler.
[junit4:junit4]   2> 8122 T441 oasc.SolrCore.initDeprecatedSupport WARNING adding ShowFileRequestHandler with hidden files: [SCHEMA.XML, OLD_SYNONYMS.TXT, STOPWORDS.TXT, PROTWORDS.TXT, OPEN-EXCHANGE-RATES.JSON, SYNONYMS.TXT, CURRENCY.XML, MAPPING-ISOLATIN1ACCENT.TXT]
[junit4:junit4]   2> 8127 T441 oass.SolrIndexSearcher.<init> Opening Searcher@492e5810 main
[junit4:junit4]   2> 8128 T441 oasu.CommitTracker.<init> Hard AutoCommit: disabled
[junit4:junit4]   2> 8129 T441 oasu.CommitTracker.<init> Soft AutoCommit: disabled
[junit4:junit4]   2> 8129 T441 oashc.SpellCheckComponent.inform Initializing spell checkers
[junit4:junit4]   2> 8222 T441 oass.DirectSolrSpellChecker.init init: {name=direct,classname=DirectSolrSpellChecker,field=lowerfilt,minQueryLength=3}
[junit4:junit4]   2> 8373 T500 oasc.SolrCore.registerSearcher [collection1] Registered new searcher Searcher@492e5810 main{StandardDirectoryReader(segments_1:1)}
[junit4:junit4]   2> 8794 T462 oascc.ZkStateReader.updateClusterState Updating cloud state from ZooKeeper... 
[junit4:junit4]   2> 8814 T487 oascc.ZkStateReader$2.process A cluster state change has occurred - updating...
[junit4:junit4]   2> 8814 T475 oascc.ZkStateReader$2.process A cluster state change has occurred - updating...
[junit4:junit4]   2> 8814 T461 oascc.ZkStateReader$2.process A cluster state change has occurred - updating...
[junit4:junit4]   2> 8814 T499 oascc.ZkStateReader$2.process A cluster state change has occurred - updating...
[junit4:junit4]   2> 8882 T441 oasc.CoreContainer.register registering core: collection1
[junit4:junit4]   2> 8882 T441 oasc.ZkController.register Register shard - core:collection1 address:http://127.0.0.1:62806/solr shardId:shard1
[junit4:junit4]   2> 8887 T441 oasc.ZkController.register We are http://127.0.0.1:62806/solr/collection1/ and leader is http://127.0.0.1:39666/solr/collection1/
[junit4:junit4]   2> 8887 T441 oasc.ZkController.register No LogReplay needed for core=collection1 baseURL=http://127.0.0.1:62806/solr
[junit4:junit4]   2> 8888 T441 oasc.ZkController.checkRecovery Core needs to recover:collection1
[junit4:junit4]   2> 8888 T441 oasu.DefaultSolrCoreState.doRecovery Running recovery - first canceling any ongoing recovery
[junit4:junit4]   2> ASYNC  NEW_CORE C33 name=collection1 org.apache.solr.core.SolrCore@40234594 url=http://127.0.0.1:62806/solr/collection1 node=127.0.0.1:62806_solr
[junit4:junit4]   2> 8896 T501 C33 P62806 oasc.RecoveryStrategy.run Starting recovery process.  core=collection1 recoveringAfterStartup=true
[junit4:junit4]   2> 8897 T501 C33 P62806 oasc.RecoveryStrategy.doRecovery ###### startupVersions=[]
[junit4:junit4]   2> 8897 T441 oascc.ZkStateReader.updateClusterState Updating cloud state from ZooKeeper... 
[junit4:junit4]   2> 8899 T501 C33 P62806 oasc.RecoveryStrategy.doRecovery Attempting to PeerSync from http://127.0.0.1:39666/solr/collection1/ core=collection1 - recoveringAfterStartup=true
[junit4:junit4]   2> 8899 T441 oass.SolrDispatchFilter.init user.dir=/usr/home/hudson/hudson-slave/workspace/Lucene-Solr-Tests-trunk-Java6/solr/build/solr-core/test/J1
[junit4:junit4]   2> 8899 T441 oass.SolrDispatchFilter.init SolrDispatchFilter.init() done
[junit4:junit4]   2> 8900 T441 oascsi.HttpClientUtil.createClient Creating new http client, config:maxConnections=128&maxConnectionsPerHost=32&followRedirects=false
[junit4:junit4]   2> 8909 T501 C33 P62806 oascsi.HttpClientUtil.createClient Creating new http client, config:maxConnectionsPerHost=20&maxConnections=10000&connTimeout=30000&socketTimeout=30000&retry=false
[junit4:junit4]   2> 8931 T501 C33 P62806 oasu.PeerSync.sync PeerSync: core=collection1 url=http://127.0.0.1:62806/solr START replicas=[http://127.0.0.1:39666/solr/collection1/] nUpdates=100
[junit4:junit4]   2> 8932 T501 C33 P62806 oasu.PeerSync.sync WARNING no frame of reference to tell of we've missed updates
[junit4:junit4]   2> 8933 T501 C33 P62806 oasc.RecoveryStrategy.doRecovery PeerSync Recovery was not successful - trying replication. core=collection1
[junit4:junit4]   2> 8933 T501 C33 P62806 oasc.RecoveryStrategy.doRecovery Starting Replication Recovery. core=collection1
[junit4:junit4]   2> 8933 T501 C33 P62806 oascsi.HttpClientUtil.createClient Creating new http client, config:maxConnections=128&maxConnectionsPerHost=32&followRedirects=false
[junit4:junit4]   2> ASYNC  NEW_CORE C34 name=collection1 org.apache.solr.core.SolrCore@441357d7 url=http://127.0.0.1:39666/solr/collection1 node=127.0.0.1:39666_solr
[junit4:junit4]   2> 8953 T467 C34 P39666 REQ /get {distrib=false&qt=/get&wt=javabin&version=2&getVersions=100} status=0 QTime=0 
[junit4:junit4]   2> 9093 T441 oejs.Server.doStart jetty-8.1.2.v20120308
[junit4:junit4]   2> 9096 T441 oejs.AbstractConnector.doStart Started SocketConnector@0.0.0.0:53958
[junit4:junit4]   2> 9097 T441 oasc.SolrResourceLoader.locateSolrHome JNDI not configured for solr (NoInitialContextEx)
[junit4:junit4]   2> 9097 T441 oasc.SolrResourceLoader.locateSolrHome using system property solr.solr.home: /usr/home/hudson/hudson-slave/workspace/Lucene-Solr-Tests-trunk-Java6/solr/build/solr-core/test/J1/./solrtest-jetty4-1348046276124
[junit4:junit4]   2> 9098 T441 oasc.SolrResourceLoader.<init> new SolrResourceLoader for deduced Solr Home: '/usr/home/hudson/hudson-slave/workspace/Lucene-Solr-Tests-trunk-Java6/solr/build/solr-core/test/J1/./solrtest-jetty4-1348046276124/'
[junit4:junit4]   2> 9138 T441 oass.SolrDispatchFilter.init SolrDispatchFilter.init()
[junit4:junit4]   2> 9138 T441 oasc.SolrResourceLoader.locateSolrHome JNDI not configured for solr (NoInitialContextEx)
[junit4:junit4]   2> 9139 T441 oasc.SolrResourceLoader.locateSolrHome using system property solr.solr.home: /usr/home/hudson/hudson-slave/workspace/Lucene-Solr-Tests-trunk-Java6/solr/build/solr-core/test/J1/./solrtest-jetty4-1348046276124
[junit4:junit4]   2> 9139 T441 oasc.CoreContainer$Initializer.initialize looking for solr.xml: /usr/home/hudson/hudson-slave/workspace/Lucene-Solr-Tests-trunk-Java6/solr/build/solr-core/test/J1/./solrtest-jetty4-1348046276124/solr.xml
[junit4:junit4]   2> 9140 T441 oasc.CoreContainer.<init> New CoreContainer 585299069
[junit4:junit4]   2> 9140 T441 oasc.CoreContainer.load Loading CoreContainer using Solr Home: '/usr/home/hudson/hudson-slave/workspace/Lucene-Solr-Tests-trunk-Java6/solr/build/solr-core/test/J1/./solrtest-jetty4-1348046276124/'
[junit4:junit4]   2> 9141 T441 oasc.SolrResourceLoader.<init> new SolrResourceLoader for directory: '/usr/home/hudson/hudson-slave/workspace/Lucene-Solr-Tests-trunk-Java6/solr/build/solr-core/test/J1/./solrtest-jetty4-1348046276124/'
[junit4:junit4]   2> 9167 T441 oasc.CoreContainer.load Registering Log Listener
[junit4:junit4]   2> 9184 T441 oasc.CoreContainer.initZooKeeper Zookeeper client=127.0.0.1:55606/solr
[junit4:junit4]   2> 9185 T441 oaz.ZooKeeper.<init> Initiating client connection, connectString=127.0.0.1:55606/solr sessionTimeout=5000 watcher=org.apache.solr.common.cloud.ConnectionManager@78213dbd
[junit4:junit4]   2> 9186 T512 oaz.ClientCnxn$SendThread.startConnect Opening socket connection to server /127.0.0.1:55606
[junit4:junit4]   2> 9186 T441 oascc.ConnectionManager.waitForConnected Waiting for client to connect to ZooKeeper
[junit4:junit4]   2> 9187 T512 oaz.ClientCnxn$SendThread.primeConnection Socket connection established to localhost/127.0.0.1:55606, initiating session
[junit4:junit4]   2> 9187 T443 oazs.NIOServerCnxn$Factory.run Accepted socket connection from /140.211.11.196:14277
[junit4:junit4]   2> 9188 T443 oazs.NIOServerCnxn.readConnectRequest Client attempting to establish new session at /140.211.11.196:14277
[junit4:junit4]   2> 9189 T445 oazs.NIOServerCnxn.finishSessionInit Established session 0x139ddd1a3510006 with negotiated timeout 5000 for client /140.211.11.196:14277
[junit4:junit4]   2> 9189 T512 oaz.ClientCnxn$SendThread.readConnectResult Session establishment complete on server localhost/127.0.0.1:55606, sessionid = 0x139ddd1a3510006, negotiated timeout = 5000
[junit4:junit4]   2> 9190 T513 oascc.ConnectionManager.process Watcher org.apache.solr.common.cloud.ConnectionManager@78213dbd name:ZooKeeperConnection Watcher:127.0.0.1:55606/solr got event WatchedEvent state:SyncConnected type:None path:null path:null type:None
[junit4:junit4]   2> 9190 T441 oascc.ConnectionManager.waitForConnected Client is connected to ZooKeeper
[junit4:junit4]   2> 9191 T446 oazs.PrepRequestProcessor.pRequest Got user-level KeeperException when processing sessionid:0x139ddd1a3510006 type:create cxid:0x1 zxid:0xfffffffffffffffe txntype:unknown reqpath:n/a Error Path:/solr/overseer Error:KeeperErrorCode = NodeExists for /solr/overseer
[junit4:junit4]   2> 9193 T446 oazs.PrepRequestProcessor.pRequest Got user-level KeeperException when processing sessionid:0x139ddd1a3510006 type:create cxid:0x2 zxid:0xfffffffffffffffe txntype:unknown reqpath:n/a Error Path:/solr/overseer Error:KeeperErrorCode = NodeExists for /solr/overseer
[junit4:junit4]   2> 9201 T441 oasc.ZkController.createEphemeralLiveNode Register node as live in ZooKeeper:/live_nodes/127.0.0.1:53958_solr
[junit4:junit4]   2> 9202 T446 oazs.PrepRequestProcessor.pRequest Got user-level KeeperException when processing sessionid:0x139ddd1a3510006 type:delete cxid:0x4 zxid:0xfffffffffffffffe txntype:unknown reqpath:n/a Error Path:/solr/live_nodes/127.0.0.1:53958_solr Error:KeeperErrorCode = NoNode for /solr/live_nodes/127.0.0.1:53958_solr
[junit4:junit4]   2> 9203 T441 oascc.SolrZkClient.makePath makePath: /live_nodes/127.0.0.1:53958_solr
[junit4:junit4]   2> 9207 T487 oascc.ZkStateReader$3.process Updating live nodes
[junit4:junit4]   2> 9207 T499 oascc.ZkStateReader$3.process Updating live nodes
[junit4:junit4]   2> 9207 T461 oascc.ZkStateReader$3.process Updating live nodes
[junit4:junit4]   2> 9207 T475 oascc.ZkStateReader$3.process Updating live nodes
[junit4:junit4]   2> 9208 T441 oashc.HttpShardHandlerFactory.getParameter Setting socketTimeout to: 0
[junit4:junit4]   2> 9209 T441 oashc.HttpShardHandlerFactory.getParameter Setting urlScheme to: http://
[junit4:junit4]   2> 9209 T441 oashc.HttpShardHandlerFactory.getParameter Setting connTimeout to: 0
[junit4:junit4]   2> 9210 T441 oashc.HttpShardHandlerFactory.getParameter Setting maxConnectionsPerHost to: 20
[junit4:junit4]   2> 9210 T441 oashc.HttpShardHandlerFactory.getParameter Setting corePoolSize to: 0
[junit4:junit4]   2> 9211 T441 oashc.HttpShardHandlerFactory.getParameter Setting maximumPoolSize to: 2147483647
[junit4:junit4]   2> 9211 T441 oashc.HttpShardHandlerFactory.getParameter Setting maxThreadIdleTime to: 5
[junit4:junit4]   2> 9212 T441 oashc.HttpShardHandlerFactory.getParameter Setting sizeOfQueue to: -1
[junit4:junit4]   2> 9212 T441 oashc.HttpShardHandlerFactory.getParameter Setting fairnessPolicy to: false
[junit4:junit4]   2> 9213 T441 oascsi.HttpClientUtil.createClient Creating new http client, config:maxConnectionsPerHost=20&maxConnections=10000&socketTimeout=0&connTimeout=0&retry=false
[junit4:junit4]   2> 9233 T441 oascc.ZkStateReader.createClusterStateWatchersAndUpdate Updating cluster state from ZooKeeper... 
[junit4:junit4]   2> 9274 T441 oasc.CoreContainer.create Creating SolrCore 'collection1' using instanceDir: /usr/home/hudson/hudson-slave/workspace/Lucene-Solr-Tests-trunk-Java6/solr/build/solr-core/test/J1/./solrtest-jetty4-1348046276124/collection1
[junit4:junit4]   2> 9275 T441 oasc.ZkController.createCollectionZkNode Check for collection zkNode:collection1
[junit4:junit4]   2> 9276 T441 oasc.ZkController.createCollectionZkNode Collection zkNode exists
[junit4:junit4]   2> 9276 T441 oasc.ZkController.readConfigName Load collection config from:/collections/collection1
[junit4:junit4]   2> 9278 T441 oasc.SolrResourceLoader.<init> new SolrResourceLoader for directory: '/usr/home/hudson/hudson-slave/workspace/Lucene-Solr-Tests-trunk-Java6/solr/build/solr-core/test/J1/./solrtest-jetty4-1348046276124/collection1/'
[junit4:junit4]   2> 9279 T441 oasc.SolrResourceLoader.replaceClassLoader Adding 'file:/usr/home/hudson/hudson-slave/workspace/Lucene-Solr-Tests-trunk-Java6/solr/build/solr-core/test/J1/solrtest-jetty4-1348046276124/collection1/lib/classes/' to classloader
[junit4:junit4]   2> 9280 T441 oasc.SolrResourceLoader.replaceClassLoader Adding 'file:/usr/home/hudson/hudson-slave/workspace/Lucene-Solr-Tests-trunk-Java6/solr/build/solr-core/test/J1/solrtest-jetty4-1348046276124/collection1/lib/README' to classloader
[junit4:junit4]   2> 9320 T462 oascc.ZkStateReader.updateClusterState Updating cloud state from ZooKeeper... 
[junit4:junit4]   2> 9330 T441 oasc.SolrConfig.<init> Using Lucene MatchVersion: LUCENE_50
[junit4:junit4]   2> 9334 T513 oascc.ZkStateReader$2.process A cluster state change has occurred - updating...
[junit4:junit4]   2> 9334 T461 oascc.ZkStateReader$2.process A cluster state change has occurred - updating...
[junit4:junit4]   2> 9334 T499 oascc.ZkStateReader$2.process A cluster state change has occurred - updating...
[junit4:junit4]   2> 9334 T487 oascc.ZkStateReader$2.process A cluster state change has occurred - updating...
[junit4:junit4]   2> 9334 T475 oascc.ZkStateReader$2.process A cluster state change has occurred - updating...
[junit4:junit4]   2> 9401 T441 oasc.SolrConfig.<init> Loaded SolrConfig: solrconfig.xml
[junit4:junit4]   2> 9502 T441 oass.IndexSchema.readSchema Reading Solr Schema
[junit4:junit4]   2> 9509 T441 oass.IndexSchema.readSchema Schema name=test
[junit4:junit4]   2> 10031 T441 oass.OpenExchangeRatesOrgProvider.init Initialized with rates=open-exchange-rates.json, refreshInterval=1440.
[junit4:junit4]   2> 10040 T441 oass.IndexSchema.readSchema default search field in schema is text
[junit4:junit4]   2> 10043 T441 oass.IndexSchema.readSchema unique key field: id
[junit4:junit4]   2> 10056 T441 oass.FileExchangeRateProvider.reload Reloading exchange rates from file currency.xml
[junit4:junit4]   2> 10060 T441 oass.FileExchangeRateProvider.reload Reloading exchange rates from file currency.xml
[junit4:junit4]   2> 10064 T441 oass.OpenExchangeRatesOrgProvider.reload Reloading exchange rates from open-exchange-rates.json
[junit4:junit4]   2> 10065 T441 oass.OpenExchangeRatesOrgProvider.reload Reloading exchange rates from open-exchange-rates.json
[junit4:junit4]   2> 10067 T441 oasc.SolrCore.<init> [collection1] Opening new SolrCore at /usr/home/hudson/hudson-slave/workspace/Lucene-Solr-Tests-trunk-Java6/solr/build/solr-core/test/J1/./solrtest-jetty4-1348046276124/collection1/, dataDir=./org.apache.solr.cloud.BasicDistributedZk2Test-1348046267211/jetty4/
[junit4:junit4]   2> 10067 T441 oasc.JmxMonitoredMap.<init> JMX monitoring is enabled. Adding Solr mbeans to JMX Server: com.sun.jmx.mbeanserver.JmxMBeanServer@6b7599cc
[junit4:junit4]   2> 10068 T441 oasc.SolrCore.getNewIndexDir WARNING New index directory detected: old=null new=./org.apache.solr.cloud.BasicDistributedZk2Test-1348046267211/jetty4/index/
[junit4:junit4]   2> 10069 T441 oasc.SolrCore.initIndex WARNING [collection1] Solr index directory './org.apache.solr.cloud.BasicDistributedZk2Test-1348046267211/jetty4/index' doesn't exist. Creating new index...
[junit4:junit4]   2> 10069 T441 oasc.CachingDirectoryFactory.get return new directory for /usr/home/hudson/hudson-slave/workspace/Lucene-Solr-Tests-trunk-Java6/solr/build/solr-core/test/J1/./org.apache.solr.cloud.BasicDistributedZk2Test-1348046267211/jetty4/index forceNew:false
[junit4:junit4]   2> 10084 T441 oasc.SolrDeletionPolicy.onCommit SolrDeletionPolicy.onCommit: commits:num=1
[junit4:junit4]   2> 		commit{dir=/usr/home/hudson/hudson-slave/workspace/Lucene-Solr-Tests-trunk-Java6/solr/build/solr-core/test/J1/org.apache.solr.cloud.BasicDistributedZk2Test-1348046267211/jetty4/index,segFN=segments_1,generation=1,filenames=[segments_1]
[junit4:junit4]   2> 10085 T441 oasc.SolrDeletionPolicy.updateCommits newest commit = 1
[junit4:junit4]   2> 10085 T441 oasc.SolrCore.initWriters created xml: solr.XMLResponseWriter
[junit4:junit4]   2> 10087 T441 oasup.UpdateRequestProcessorChain.init inserting DistributedUpdateProcessorFactory into updateRequestProcessorChain "dedupe"
[junit4:junit4]   2> 10087 T441 oasup.UpdateRequestProcessorChain.init inserting DistributedUpdateProcessorFactory into updateRequestProcessorChain "dedupe-allfields"
[junit4:junit4]   2> 10088 T441 oasup.UpdateRequestProcessorChain.init inserting DistributedUpdateProcessorFactory into updateRequestProcessorChain "stored_sig"
[junit4:junit4]   2> 10088 T441 oasup.UpdateRequestProcessorChain.init inserting DistributedUpdateProcessorFactory into updateRequestProcessorChain "uniq-fields"
[junit4:junit4]   2> 10089 T441 oasup.UpdateRequestProcessorChain.init inserting DistributedUpdateProcessorFactory into updateRequestProcessorChain "distrib-dup-test-chain-implicit"
[junit4:junit4]   2> 10089 T441 oasc.RequestHandlers.initHandlersFromConfig adding lazy requestHandler: solr.ReplicationHandler
[junit4:junit4]   2> 10090 T441 oasc.RequestHandlers.initHandlersFromConfig created /replication: solr.ReplicationHandler
[junit4:junit4]   2> 10090 T441 oasc.RequestHandlers.initHandlersFromConfig created standard: solr.StandardRequestHandler
[junit4:junit4]   2> 10091 T441 oasc.RequestHandlers.initHandlersFromConfig created /get: solr.RealTimeGetHandler
[junit4:junit4]   2> 10091 T441 oasc.RequestHandlers.initHandlersFromConfig created dismax: solr.SearchHandler
[junit4:junit4]   2> 10092 T441 oasc.RequestHandlers.initHandlersFromConfig created mock: org.apache.solr.core.MockQuerySenderListenerReqHandler
[junit4:junit4]   2> 10092 T441 oasc.RequestHandlers.initHandlersFromConfig created /admin/: org.apache.solr.handler.admin.AdminHandlers
[junit4:junit4]   2> 10093 T441 oasc.RequestHandlers.initHandlersFromConfig created defaults: solr.StandardRequestHandler
[junit4:junit4]   2> 10093 T441 oasc.RequestHandlers.initHandlersFromConfig adding lazy requestHandler: solr.StandardRequestHandler
[junit4:junit4]   2> 10093 T441 oasc.RequestHandlers.initHandlersFromConfig created lazy: solr.StandardRequestHandler
[junit4:junit4]   2> 10094 T441 oasc.RequestHandlers.initHandlersFromConfig created /update: solr.UpdateRequestHandler
[junit4:junit4]   2> 10095 T441 oasc.RequestHandlers.initHandlersFromConfig created /terms: org.apache.solr.handler.component.SearchHandler
[junit4:junit4]   2> 10095 T441 oasc.RequestHandlers.initHandlersFromConfig created spellCheckCompRH: org.apache.solr.handler.component.SearchHandler
[junit4:junit4]   2> 10096 T441 oasc.RequestHandlers.initHandlersFromConfig created spellCheckCompRH_Direct: org.apache.solr.handler.component.SearchHandler
[junit4:junit4]   2> 10096 T441 oasc.RequestHandlers.initHandlersFromConfig created spellCheckWithWordbreak: org.apache.solr.handler.component.SearchHandler
[junit4:junit4]   2> 10097 T441 oasc.RequestHandlers.initHandlersFromConfig created spellCheckWithWordbreak_Direct: org.apache.solr.handler.component.SearchHandler
[junit4:junit4]   2> 10097 T441 oasc.RequestHandlers.initHandlersFromConfig created spellCheckCompRH1: org.apache.solr.handler.component.SearchHandler
[junit4:junit4]   2> 10098 T441 oasc.RequestHandlers.initHandlersFromConfig created tvrh: org.apache.solr.handler.component.SearchHandler
[junit4:junit4]   2> 10098 T441 oasc.RequestHandlers.initHandlersFromConfig created /mlt: solr.MoreLikeThisHandler
[junit4:junit4]   2> 10099 T441 oasc.RequestHandlers.initHandlersFromConfig created /debug/dump: solr.DumpRequestHandler
[junit4:junit4]   2> 10102 T441 oashl.XMLLoader.init xsltCacheLifetimeSeconds=60
[junit4:junit4]   2> 10105 T441 oasc.SolrCore.initDeprecatedSupport WARNING solrconfig.xml uses deprecated <admin/gettableFiles>, Please update your config to use the ShowFileRequestHandler.
[junit4:junit4]   2> 10106 T441 oasc.SolrCore.initDeprecatedSupport WARNING adding ShowFileRequestHandler with hidden files: [SCHEMA.XML, OLD_SYNONYMS.TXT, STOPWORDS.TXT, PROTWORDS.TXT, OPEN-EXCHANGE-RATES.JSON, SYNONYMS.TXT, CURRENCY.XML, MAPPING-ISOLATIN1ACCENT.TXT]
[junit4:junit4]   2> 10109 T441 oass.SolrIndexSearcher.<init> Opening Searcher@7e664d6a main
[junit4:junit4]   2> 10110 T441 oasu.CommitTracker.<init> Hard AutoCommit: disabled
[junit4:junit4]   2> 10110 T441 oasu.CommitTracker.<init> Soft AutoCommit: disabled
[junit4:junit4]   2> 10111 T441 oashc.SpellCheckComponent.inform Initializing spell checkers
[junit4:junit4]   2> 10127 T441 oass.DirectSolrSpellChecker.init init: {name=direct,classname=DirectSolrSpellChecker,field=lowerfilt,minQueryLength=3}
[junit4:junit4]   2> 10206 T514 oasc.SolrCore.registerSearcher [collection1] Registered new searcher Searcher@7e664d6a main{StandardDirectoryReader(segments_1:1)}
[junit4:junit4]   2> 10341 T462 oascc.ZkStateReader.updateClusterState Updating cloud state from ZooKeeper... 
[junit4:junit4]   2> 10362 T513 oascc.ZkStateReader$2.process A cluster state change has occurred - updating...
[junit4:junit4]   2> 10362 T475 oascc.ZkStateReader$2.process A cluster state change has occurred - updating...
[junit4:junit4]   2> 10362 T499 oascc.ZkStateReader$2.process A cluster state change has occurred - updating...
[junit4:junit4]   2> 10362 T461 oascc.ZkStateReader$2.process A cluster state change has occurred - updating...
[junit4:junit4]   2> 10362 T487 oascc.ZkStateReader$2.process A cluster state change has occurred - updating...
[junit4:junit4]   2> 10717 T441 oasc.CoreContainer.register registering core: collection1
[junit4:junit4]   2> 10717 T441 oasc.ZkController.register Register shard - core:collection1 address:http://127.0.0.1:53958/solr shardId:shard2
[junit4:junit4]   2> 10721 T441 oasc.ZkController.register We are http://127.0.0.1:53958/solr/collection1/ and leader is http://127.0.0.1:15812/solr/collection1/
[junit4:junit4]   2> 10722 T441 oasc.ZkController.register No LogReplay needed for core=collection1 baseURL=http://127.0.0.1:53958/solr
[junit4:junit4]   2> 10722 T441 oasc.ZkController.checkRecovery Core needs to recover:collection1
[junit4:junit4]   2> 10722 T441 oasu.DefaultSolrCoreState.doRecovery Running recovery - first canceling any ongoing recovery
[junit4:junit4]   2> ASYNC  NEW_CORE C35 name=collection1 org.apache.solr.core.SolrCore@5aee869a url=http://127.0.0.1:53958/solr/collection1 node=127.0.0.1:53958_solr
[junit4:junit4]   2> 10723 T515 C35 P53958 oasc.RecoveryStrategy.run Starting recovery process.  core=collection1 recoveringAfterStartup=true
[junit4:junit4]   2> 10724 T515 C35 P53958 oasc.RecoveryStrategy.doRecovery ###### startupVersions=[]
[junit4:junit4]   2> 10724 T441 oascc.ZkStateReader.updateClusterState Updating cloud state from ZooKeeper... 
[junit4:junit4]   2> 10725 T515 C35 P53958 oasc.RecoveryStrategy.doRecovery Attempting to PeerSync from http://127.0.0.1:15812/solr/collection1/ core=collection1 - recoveringAfterStartup=true
[junit4:junit4]   2> 10725 T515 C35 P53958 oasu.PeerSync.sync PeerSync: core=collection1 url=http://127.0.0.1:53958/solr START replicas=[http://127.0.0.1:15812/solr/collection1/] nUpdates=100
[junit4:junit4]   2> 10725 T441 oass.SolrDispatchFilter.init user.dir=/usr/home/hudson/hudson-slave/workspace/Lucene-Solr-Tests-trunk-Java6/solr/build/solr-core/test/J1
[junit4:junit4]   2> 10726 T515 C35 P53958 oasu.PeerSync.sync WARNING no frame of reference to tell of we've missed updates
[junit4:junit4]   2> 10726 T441 oass.SolrDispatchFilter.init SolrDispatchFilter.init() done
[junit4:junit4]   2> 10726 T515 C35 P53958 oasc.RecoveryStrategy.doRecovery PeerSync Recovery was not successful - trying replication. core=collection1
[junit4:junit4]   2> 10727 T515 C35 P53958 oasc.RecoveryStrategy.doRecovery Starting Replication Recovery. core=collection1
[junit4:junit4]   2> 10726 T441 oascsi.HttpClientUtil.createClient Creating new http client, config:maxConnections=128&maxConnectionsPerHost=32&followRedirects=false
[junit4:junit4]   2> 10727 T515 C35 P53958 oascsi.HttpClientUtil.createClient Creating new http client, config:maxConnections=128&maxConnectionsPerHost=32&followRedirects=false
[junit4:junit4]   2> ASYNC  NEW_CORE C36 name=collection1 org.apache.solr.core.SolrCore@5489e163 url=http://127.0.0.1:15812/solr/collection1 node=127.0.0.1:15812_solr
[junit4:junit4]   2> 10733 T479 C36 P15812 REQ /get {distrib=false&qt=/get&wt=javabin&version=2&getVersions=100} status=0 QTime=0 
[junit4:junit4]   2> 10748 T441 oaz.ZooKeeper.<init> Initiating client connection, connectString=127.0.0.1:55606/solr sessionTimeout=10000 watcher=org.apache.solr.common.cloud.ConnectionManager@37f6b4df
[junit4:junit4]   2> 10749 T441 oascc.ConnectionManager.waitForConnected Waiting for client to connect to ZooKeeper
[junit4:junit4]   2> 10749 T517 oaz.ClientCnxn$SendThread.startConnect Opening socket connection to server /127.0.0.1:55606
[junit4:junit4]   2> 10750 T517 oaz.ClientCnxn$SendThread.primeConnection Socket connection established to localhost/127.0.0.1:55606, initiating session
[junit4:junit4]   2> 10750 T443 oazs.NIOServerCnxn$Factory.run Accepted socket connection from /140.211.11.196:39560
[junit4:junit4]   2> 10750 T443 oazs.NIOServerCnxn.readConnectRequest Client attempting to establish new session at /140.211.11.196:39560
[junit4:junit4]   2> 10752 T445 oazs.NIOServerCnxn.finishSessionInit Established session 0x139ddd1a3510007 with negotiated timeout 10000 for client /140.211.11.196:39560
[junit4:junit4]   2> 10752 T517 oaz.ClientCnxn$SendThread.readConnectResult Session establishment complete on server localhost/127.0.0.1:55606, sessionid = 0x139ddd1a3510007, negotiated timeout = 10000
[junit4:junit4]   2> 10752 T518 oascc.ConnectionManager.process Watcher org.apache.solr.common.cloud.ConnectionManager@37f6b4df name:ZooKeeperConnection Watcher:127.0.0.1:55606/solr got event WatchedEvent state:SyncConnected type:None path:null path:null type:None
[junit4:junit4]   2> 10752 T441 oascc.ConnectionManager.waitForConnected Client is connected to ZooKeeper
[junit4:junit4]   2> 10753 T441 oascc.ZkStateReader.createClusterStateWatchersAndUpdate Updating cluster state from ZooKeeper... 
[junit4:junit4]   2> 10756 T441 oasc.ChaosMonkey.monkeyLog monkey: init - expire sessions:true cause connection loss:true
[junit4:junit4]   2> 10757 T441 oascsi.HttpClientUtil.createClient Creating new http client, config:
[junit4:junit4]   2> 10764 T441 oascc.ZkStateReader.updateClusterState Updating cloud state from ZooKeeper... 
[junit4:junit4]   2> ASYNC  NEW_CORE C37 name=collection1 org.apache.solr.core.SolrCore@660674e3 url=http://127.0.0.1:32220/solr/collection1 node=127.0.0.1:32220_solr
[junit4:junit4]   2> 10785 T453 C37 P32220 oascsi.HttpClientUtil.createClient Creating new http client, config:maxConnections=500&maxConnectionsPerHost=16
[junit4:junit4]   2> 10798 T453 C37 P32220 oasc.SolrDeletionPolicy.onInit SolrDeletionPolicy.onInit: commits:num=1
[junit4:junit4]   2> 		commit{dir=/usr/home/hudson/hudson-slave/workspace/Lucene-Solr-Tests-trunk-Java6/solr/build/solr-core/test/J1/org.apache.solr.cloud.BasicDistributedZk2Test-1348046267211/control/data/index,segFN=segments_1,generation=1,filenames=[segments_1]
[junit4:junit4]   2> 10799 T453 C37 P32220 oasc.SolrDeletionPolicy.updateCommits newest commit = 1
[junit4:junit4]   2> 10824 T453 C37 P32220 /update {wt=javabin&version=2} {add=[1 (1413528974001176576)]} 0 50
[junit4:junit4]   2> 10825 T441 oaz.ZooKeeper.<init> Initiating client connection, connectString=127.0.0.1:55606/solr sessionTimeout=10000 watcher=org.apache.solr.common.cloud.ConnectionManager@5292d5fb
[junit4:junit4]   2> 10826 T519 oaz.ClientCnxn$SendThread.startConnect Opening socket connection to server /127.0.0.1:55606
[junit4:junit4]   2> 10826 T441 oascc.ConnectionManager.waitForConnected Waiting for client to connect to ZooKeeper
[junit4:junit4]   2> 10827 T519 oaz.ClientCnxn$SendThread.primeConnection Socket connection established to localhost/127.0.0.1:55606, initiating session
[junit4:junit4]   2> 10827 T443 oazs.NIOServerCnxn$Factory.run Accepted socket connection from /140.211.11.196:24405
[junit4:junit4]   2> 10828 T443 oazs.NIOServerCnxn.readConnectRequest Client attempting to establish new session at /140.211.11.196:24405
[junit4:junit4]   2> 10829 T445 oazs.NIOServerCnxn.finishSessionInit Established session 0x139ddd1a3510008 with negotiated timeout 10000 for client /140.211.11.196:24405
[junit4:junit4]   2> 10829 T519 oaz.ClientCnxn$SendThread.readConnectResult Session establishment complete on server localhost/127.0.0.1:55606, sessionid = 0x139ddd1a3510008, negotiated timeout = 10000
[junit4:junit4]   2> 10830 T520 oascc.ConnectionManager.process Watcher org.apache.solr.common.cloud.ConnectionManager@5292d5fb name:ZooKeeperConnection Watcher:127.0.0.1:55606/solr got event WatchedEvent state:SyncConnected type:None path:null path:null type:None
[junit4:junit4]   2> 10830 T441 oascc.ConnectionManager.waitForConnected Client is connected to ZooKeeper
[junit4:junit4]   2> 10831 T441 oascc.ZkStateReader.createClusterStateWatchersAndUpdate Updating cluster state from ZooKeeper... 
[junit4:junit4]   2> 10872 T462 oascc.ZkStateReader.updateClusterState Updating cloud state from ZooKeeper... 
[junit4:junit4]   2> 10885 T487 oascc.ZkStateReader$2.process A cluster state change has occurred - updating...
[junit4:junit4]   2> 10886 T513 oascc.ZkStateReader$2.process A cluster state change has occurred - updating...
[junit4:junit4]   2> 10886 T461 oascc.ZkStateReader$2.process A cluster state change has occurred - updating...
[junit4:junit4]   2> 10886 T499 oascc.ZkStateReader$2.process A cluster state change has occurred - updating...
[junit4:junit4]   2> 10885 T518 oascc.ZkStateReader$2.process A cluster state change has occurred - updating...
[junit4:junit4]   2> 10886 T520 oascc.ZkStateReader$2.process A cluster state change has occurred - updating...
[junit4:junit4]   2> 10886 T475 oascc.ZkStateReader$2.process A cluster state change has occurred - updating...
[junit4:junit4]   2> 10888 T469 C34 P39666 oasc.SolrDeletionPolicy.onInit SolrDeletionPolicy.onInit: commits:num=1
[junit4:junit4]   2> 		commit{dir=/usr/home/hudson/hudson-slave/workspace/Lucene-Solr-Tests-trunk-Java6/solr/build/solr-core/test/J1/org.apache.solr.cloud.BasicDistributedZk2Test-1348046267211/jetty1/index,segFN=segments_1,generation=1,filenames=[segments_1]
[junit4:junit4]   2> 10888 T469 C34 P39666 oasc.SolrDeletionPolicy.updateCommits newest commit = 1
[junit4:junit4]   2>  C33_STATE=coll:collection1 core:collection1 props:{shard=shard1, roles=null, state=recovering, core=collection1, collection=collection1, node_name=127.0.0.1:62806_solr, base_url=http://127.0.0.1:62806/solr}
[junit4:junit4]   2> 10903 T491 C33 P62806 oasc.SolrDeletionPolicy.onInit SolrDeletionPolicy.onInit: commits:num=1
[junit4:junit4]   2> 		commit{dir=/usr/home/hudson/hudson-slave/workspace/Lucene-Solr-Tests-trunk-Java6/solr/build/solr-core/test/J1/org.apache.solr.cloud.BasicDistributedZk2Test-1348046267211/jetty3/index,segFN=segments_1,generation=1,filenames=[segments_1]
[junit4:junit4]   2> 10904 T491 C33 P62806 oasc.SolrDeletionPolicy.updateCommits newest commit = 1
[junit4:junit4]   2> 10908 T491 C33 P62806 REQ /update {update.distrib=FROMLEADER&distrib.from=http://127.0.0.1:39666/solr/collection1/&wt=javabin&version=2} status=0 QTime=9 
[junit4:junit4]   2> 10909 T469 C34 P39666 REQ /update {distrib.from=http://127.0.0.1:15812/solr/collection1/&update.distrib=TOLEADER&wt=javabin&version=2} status=0 QTime=26 
[junit4:junit4]   2> 10910 T481 C36 P15812 /update {wt=javabin&version=2} {add=[1]} 0 72
[junit4:junit4]   2> 10910 T441 oasc.AbstractDistribZkTestBase.waitForRecoveriesToFinish Wait for recoveries to finish - collection: collection1 failOnTimeout:true timeout (sec):1800
[junit4:junit4]   2> 10911 T441 oascc.ZkStateReader.updateClusterState Updating cloud state from ZooKeeper... 
[junit4:junit4]   2> 11913 T441 oascc.ZkStateReader.updateClusterState Updating cloud state from ZooKeeper... 
[junit4:junit4]   2> 11957 T501 C33 P62806 oasc.RecoveryStrategy.doRecovery Begin buffering updates. core=collection1
[junit4:junit4]   2> 11957 T501 C33 P62806 oasu.UpdateLog.bufferUpdates Starting to buffer updates. FSUpdateLog{state=ACTIVE, tlog=tlog{file=./org.apache.solr.cloud.BasicDistributedZk2Test-1348046267211/jetty3/tlog/tlog.0000000000000000000 refcount=1}}
[junit4:junit4]   2> 11957 T501 C33 P62806 oasc.RecoveryStrategy.replicate Attempting to replicate from http://127.0.0.1:39666/solr/collection1/. core=collection1
[junit4:junit4]   2> 11958 T501 C33 P62806 oascsi.HttpClientUtil.createClient Creating new http client, config:maxConnections=128&maxConnectionsPerHost=32&followRedirects=false
[junit4:junit4]   2> 11966 T470 C34 P39666 oasu.DirectUpdateHandler2.commit start commit{flags=0,_version_=0,optimize=false,openSearcher=true,waitSearcher=true,expungeDeletes=false,softCommit=false}
[junit4:junit4]   2> 12053 T470 C34 P39666 oasc.SolrDeletionPolicy.onCommit SolrDeletionPolicy.onCommit: commits:num=2
[junit4:junit4]   2> 		commit{dir=/usr/home/hudson/hudson-slave/workspace/Lucene-Solr-Tests-trunk-Java6/solr/build/solr-core/test/J1/org.apache.solr.cloud.BasicDistributedZk2Test-1348046267211/jetty1/index,segFN=segments_1,generation=1,filenames=[segments_1]
[junit4:junit4]   2> 		commit{dir=/usr/home/hudson/hudson-slave/workspace/Lucene-Solr-Tests-trunk-Java6/solr/build/solr-core/test/J1/org.apache.solr.cloud.BasicDistributedZk2Test-1348046267211/jetty1/index,segFN=segments_2,generation=2,filenames=[_0_Block_0.tip, _0_TestBloomFilteredLucene40Postings_0.tim, _0_Block_0.pos, _0_TestBloomFilteredLucene40Postings_0.blm, _0_TestBloomFilteredLucene40Postings_0.tip, _0.fnm, _0_Pulsing40_0.tim, _0_Block_0.doc, _0_Block_0.tim, _0_TestBloomFilteredLucene40Postings_0.prx, _0_nrm.cfs, _0_Pulsing40_0.prx, _0_Pulsing40_0.frq, _0_SimpleText_0.pst, _0_nrm.cfe, _0_Pulsing40_0.tip, segments_2, _0_TestBloomFilteredLucene40Postings_0.frq, _0.fdx, _0.si, _0.fdt]
[junit4:junit4]   2> 12054 T470 C34 P39666 oasc.SolrDeletionPolicy.updateCommits newest commit = 2
[junit4:junit4]   2> 12066 T470 C34 P39666 oass.SolrIndexSearcher.<init> Opening Searcher@207fd4ec main
[junit4:junit4]   2> 12067 T470 C34 P39666 oasu.DirectUpdateHandler2.commit end_commit_flush
[junit4:junit4]   2> 12068 T476 oasc.SolrCore.registerSearcher [collection1] Registered new searcher Searcher@207fd4ec main{StandardDirectoryReader(segments_2:3 _0(5.0):C1)}
[junit4:junit4]   2> 12069 T470 C34 P39666 /update {waitSearcher=true&commit=true&commit_end_point=true&wt=javabin&softCommit=false&version=2} {commit=} 0 104
[junit4:junit4]   2> 12070 T501 C33 P62806 oash.ReplicationHandler.inform Commits will be reserved for  10000
[junit4:junit4]   2> 12070 T501 C33 P62806 oash.SnapPuller.<init>  No value set for 'pollInterval'. Timer Task not started.
[junit4:junit4]   2> 12072 T471 C34 P39666 oash.ReplicationHandler.inform Commits will be reserved for  10000
[junit4:junit4]   2> 12072 T471 C34 P39666 REQ /replication {command=indexversion&wt=javabin&qt=/replication&version=2} status=0 QTime=1 
[junit4:junit4]   2> 12073 T501 C33 P62806 oash.SnapPuller.fetchLatestIndex Master's generation: 2
[junit4:junit4]   2> 12073 T501 C33 P62806 oash.SnapPuller.fetchLatestIndex Slave's generation: 1
[junit4:junit4]   2> 12073 T501 C33 P62806 oash.SnapPuller.fetchLatestIndex Starting replication process
[junit4:junit4]   2> 12078 T471 C34 P39666 REQ /replication {command=filelist&generation=2&wt=javabin&qt=/replication&version=2} status=0 QTime=3 
[junit4:junit4]   2> 12079 T501 C33 P62806 oash.SnapPuller.fetchLatestIndex Number of files in latest index in master: 21
[junit4:junit4]   2> 12083 T501 C33 P62806 oash.SnapPuller.fetchLatestIndex Starting download to ./org.apache.solr.cloud.BasicDistributedZk2Test-1348046267211/jetty3/index.20120919141759285 fullCopy=true
[junit4:junit4]   2> 12086 T471 C34 P39666 REQ /replication {file=_0_Block_0.pos&command=filecontent&checksum=true&generation=2&qt=/replication&wt=filestream} status=0 QTime=0 
[junit4:junit4]   2> 12090 T471 C34 P39666 REQ /replication {file=_0_TestBloomFilteredLucene40Postings_0.tim&command=filecontent&checksum=true&generation=2&qt=/replication&wt=filestream} status=0 QTime=0 
[junit4:junit4]   2> 12094 T471 C34 P39666 REQ /replication {file=_0_Block_0.tip&command=filecontent&checksum=true&generation=2&qt=/replication&wt=filestream} status=0 QTime=0 
[junit4:junit4]   2> 12098 T471 C34 P39666 REQ /replication {file=_0_TestBloomFilteredLucene40Postings_0.tip&command=filecontent&checksum=true&generation=2&qt=/replication&wt=filestream} status=0 QTime=0 
[junit4:junit4]   2> 12102 T471 C34 P39666 REQ /replication {file=_0_TestBloomFilteredLucene40Postings_0.blm&command=filecontent&checksum=true&generation=2&qt=/replication&wt=filestream} status=0 QTime=0 
[junit4:junit4]   2> 12106 T471 C34 P39666 REQ /replication {file=_0_Block_0.doc&command=filecontent&checksum=true&generation=2&qt=/replication&wt=filestream} status=0 QTime=0 
[junit4:junit4]   2> 12110 T471 C34 P39666 REQ /replication {file=_0_Pulsing40_0.tim&command=filecontent&checksum=true&generation=2&qt=/replication&wt=filestream} status=0 QTime=0 
[junit4:junit4]   2> 12114 T471 C34 P39666 REQ /replication {file=_0.fnm&command=filecontent&checksum=true&generation=2&qt=/replication&wt=filestream} status=0 QTime=0 
[junit4:junit4]   2> 12118 T471 C34 P39666 REQ /replication {file=_0_Block_0.tim&command=filecontent&checksum=true&generation=2&qt=/replication&wt=filestream} status=0 QTime=0 
[junit4:junit4]   2> 12122 T471 C34 P39666 REQ /replication {file=_0_TestBloomFilteredLucene40Postings_0.prx&command=filecontent&checksum=true&generation=2&qt=/replication&wt=filestream} status=0 QTime=0 
[junit4:junit4]   2> 12126 T471 C34 P39666 REQ /replication {file=_0_nrm.cfs&command=filecontent&checksum=true&generation=2&qt=/replication&wt=filestream} status=0 QTime=0 
[junit4:junit4]   2> 12130 T471 C34 P39666 REQ /replication {file=_0_Pulsing40_0.prx&command=filecontent&checksum=true&generation=2&qt=/replication&wt=filestream} status=0 QTime=0 
[junit4:junit4]   2> 12134 T471 C34 P39666 REQ /replication {file=_0_Pulsing40_0.frq&command=filecontent&checksum=true&generation=2&qt=/replication&wt=filestream} status=0 QTime=0 
[junit4:junit4]   2> 12138 T471 C34 P39666 REQ /replication {file=_0_nrm.cfe&command=filecontent&checksum=true&generation=2&qt=/replication&wt=filestream} status=0 QTime=0 
[junit4:junit4]   2> 12142 T471 C34 P39666 REQ /replication {file=_0_SimpleText_0.pst&command=filecontent&checksum=true&generation=2&qt=/replication&wt=filestream} status=0 QTime=0 
[junit4:junit4]   2> 12146 T471 C34 P39666 REQ /replication {file=segments_2&command=filecontent&checksum=true&generation=2&qt=/replication&wt=filestream} status=0 QTime=0 
[junit4:junit4]   2> 12150 T471 C34 P39666 REQ /replication {file=_0_Pulsing40_0.tip&command=filecontent&checksum=true&generation=2&qt=/replication&wt=filestream} status=0 QTime=0 
[junit4:junit4]   2> 12154 T471 C34 P39666 REQ /replication {file=_0.fdx&command=filecontent&checksum=true&generation=2&qt=/replication&wt=filestream} status=0 QTime=0 
[junit4:junit4]   2> 12158 T471 C34 P39666 REQ /replication {file=_0_TestBloomFilteredLucene40Postings_0.frq&command=filecontent&checksum=true&generation=2&qt=/replication&wt=filestream} status=0 QTime=0 
[junit4:junit4]   2> 12162 T471 C34 P39666 REQ /replication {file=_0.si&command=filecontent&checksum=true&generation=2&qt=/replication&wt=filestream} status=0 QTime=0 
[junit4:junit4]   2> 12166 T471 C34 P39666 REQ /replication {file=_0.fdt&command=filecontent&checksum=true&generation=2&qt=/replication&wt=filestream} status=0 QTime=0 
[junit4:junit4]   2> 12167 T501 C33 P62806 oash.SnapPuller.fetchLatestIndex Total time taken for download : 0 secs
[junit4:junit4]   2> 12167 T501 C33 P62806 oash.SnapPuller.modifyIndexProps New index installed. Updating index properties... index=index.20120919141759285
[junit4:junit4]   2> 12168 T501 C33 P62806 oasu.DefaultSolrCoreState.newIndexWriter Creating new IndexWriter...
[junit4:junit4]   2> 12169 T501 C33 P62806 oasu.DefaultSolrCoreState.newIndexWriter Waiting until IndexWriter is unused... core=collection1
[junit4:junit4]   2> 12169 T501 C33 P62806 oasu.DefaultSolrCoreState.newIndexWriter Rollback old IndexWriter... core=collection1
[junit4:junit4]   2> 12173 T501 C33 P62806 oasc.SolrCore.getNewIndexDir WARNING New index directory detected: old=./org.apache.solr.cloud.BasicDistributedZk2Test-1348046267211/jetty3/index/ new=./org.apache.solr.cloud.BasicDistributedZk2Test-1348046267211/jetty3/index.20120919141759285
[junit4:junit4]   2> 12174 T501 C33 P62806 oasc.CachingDirectoryFactory.get return new directory for /usr/home/hudson/hudson-slave/workspace/Lucene-Solr-Tests-trunk-Java6/solr/build/solr-core/test/J1/./org.apache.solr.cloud.BasicDistributedZk2Test-1348046267211/jetty3/index.20120919141759285 forceNew:true
[junit4:junit4]   2> 12182 T501 C33 P62806 oasc.SolrDeletionPolicy.onInit SolrDeletionPolicy.onInit: commits:num=1
[junit4:junit4]   2> 		commit{dir=/usr/home/hudson/hudson-slave/workspace/Lucene-Solr-Tests-trunk-Java6/solr/build/solr-core/test/J1/org.apache.solr.cloud.BasicDistributedZk2Test-1348046267211/jetty3/index.20120919141759285,segFN=segments_2,generation=2,filenames=[_0_Block_0.tip, _0_TestBloomFilteredLucene40Postings_0.tim, _0_Block_0.pos, _0_TestBloomFilteredLucene40Postings_0.blm, _0_TestBloomFilteredLucene40Postings_0.tip, _0.fnm, _0_Pulsing40_0.tim, _0_Block_0.doc, _0_Block_0.tim, _0_TestBloomFilteredLucene40Postings_0.prx, _0_nrm.cfs, _0_Pulsing40_0.prx, _0_Pulsing40_0.frq, _0_nrm.cfe, _0_SimpleText_0.pst, _0_Pulsing40_0.tip, segments_2, _0.fdx, _0_TestBloomFilteredLucene40Postings_0.frq, _0.si, _0.fdt]
[junit4:junit4]   2> 12182 T501 C33 P62806 oasc.SolrDeletionPolicy.updateCommits newest commit = 2
[junit4:junit4]   2> 12182 T501 C33 P62806 oasu.DefaultSolrCoreState.newIndexWriter New IndexWriter is ready to be used.
[junit4:junit4]   2> 12186 T501 C33 P62806 oass.SolrIndexSearcher.<init> Opening Searcher@31102445 main
[junit4:junit4]   2> 12187 T500 oasc.SolrCore.registerSearcher [collection1] Registered new searcher Searcher@31102445 main{StandardDirectoryReader(segments_2:3:nrt _0(5.0):C1)}
[junit4:junit4]   2> 12188 T500 oasc.CachingDirectoryFactory.close Closing directory:/usr/home/hudson/hudson-slave/workspace/Lucene-Solr-Tests-trunk-Java6/solr/build/solr-core/test/J1/./org.apache.solr.cloud.BasicDistributedZk2Test-1348046267211/jetty3/index
[junit4:junit4]   2> 12188 T500 oash.SnapPuller$2.onClose removing old index directory ./org.apache.solr.cloud.BasicDistributedZk2Test-1348046267211/jetty3/index
[junit4:junit4]   2> 12189 T501 C33 P62806 oasu.DirectUpdateHandler2.commit start commit{flags=0,_version_=0,optimize=false,openSearcher=false,waitSearcher=false,expungeDeletes=false,softCommit=false}
[junit4:junit4]   2> 12190 T501 C33 P62806 oasu.DirectUpdateHandler2.commit end_commit_flush
[junit4:junit4]   2> 12194 T501 C33 P62806 oasc.RecoveryStrategy.replay Replaying buffered documents. core=collection1
[junit4:junit4]   2> 12194 T524 C33 P62806 oasu.UpdateLog$LogReplayer.doReplay WARNING Starting log replay tlog{file=./org.apache.solr.cloud.BasicDistributedZk2Test-1348046267211/jetty3/tlog/tlog.0000000000000000000 refcount=2} active=true starting pos=431
[junit4:junit4]   2> 12198 T524 C33 P62806 oasu.DirectUpdateHandler2.commit start commit{flags=2,_version_=0,optimize=false,openSearcher=true,waitSearcher=true,expungeDeletes=false,softCommit=false}
[junit4:junit4]   2> 12199 T524 C33 P62806 oass.SolrIndexSearcher.<init> Opening Searcher@7f7bdccd main
[junit4:junit4]   2> 12200 T500 oasc.SolrCore.registerSearcher [collection1] Registered new searcher Searcher@7f7bdccd main{StandardDirectoryReader(segments_2:3:nrt _0(5.0):C1)}
[junit4:junit4]   2> 12201 T524 C33 P62806 oasu.DirectUpdateHandler2.commit end_commit_flush
[junit4:junit4]   2> 12201 T524 C33 P62806 oasu.UpdateLog$LogReplayer.run WARNING Log replay finished. recoveryInfo=RecoveryInfo{adds=0 deletes=0 deleteByQuery=0 errors=0 positionOfStart=431}
[junit4:junit4]   2> 12201 T501 C33 P62806 oasc.RecoveryStrategy.doRecovery Replication Recovery was successful - registering as Active. core=collection1
[junit4:junit4]   2> 12203 T501 C33 P62806 oasc.RecoveryStrategy.doRecovery Finished recovery process. core=collection1
[junit4:junit4]   2> 12396 T462 oascc.ZkStateReader.updateClusterState Updating cloud state from ZooKeeper... 
[junit4:junit4]   2> 12410 T513 oascc.ZkStateReader$2.process A cluster state change has occurred - updating...
[junit4:junit4]   2> 12410 T487 oascc.ZkStateReader$2.process A cluster state change has occurred - updating...
[junit4:junit4]   2> 12410 T518 oascc.ZkStateReader$2.process A cluster state change has occurred - updating...
[junit4:junit4]   2> 12410 T520 oascc.ZkStateReader$2.process A cluster state change has occurred - updating...
[junit4:junit4]   2> 12410 T475 oascc.ZkStateReader$2.process A cluster state change has occurred - updating...
[junit4:junit4]   2> 12410 T461 oascc.ZkStateReader$2.process A cluster state change has occurred - updating...
[junit4:junit4]   2> 12410 T499 oascc.ZkStateReader$2.process A cluster state change has occurred - updating...
[junit4:junit4]   2> 12915 T441 oascc.ZkStateReader.updateClusterState Updating cloud state from ZooKeeper... 
[junit4:junit4]   2>  C35_STATE=coll:collection1 core:collection1 props:{shard=shard2, roles=null, state=recovering, core=collection1, collection=collection1, node_name=127.0.0.1:53958_solr, base_url=http://127.0.0.1:53958/solr}
[junit4:junit4]   2> 13748 T515 C35 P53958 oasc.RecoveryStrategy.doRecovery Begin buffering updates. core=collection1
[junit4:junit4]   2> 13748 T515 C35 P53958 oasu.UpdateLog.bufferUpdates Starting to buffer updates. FSUpdateLog{state=ACTIVE, tlog=null}
[junit4:junit4]   2> 13748 T515 C35 P53958 oasc.RecoveryStrategy.replicate Attempting to replicate from http://127.0.0.1:15812/solr/collection1/. core=collection1
[junit4:junit4]   2> 13749 T515 C35 P53958 oascsi.HttpClientUtil.createClient Creating new http client, config:maxConnections=128&maxConnectionsPerHost=32&followRedirects=false
[junit4:junit4]   2> 13766 T482 C36 P15812 oasu.DirectUpdateHandler2.commit start commit{flags=0,_version_=0,optimize=false,openSearcher=true,waitSearcher=true,expungeDeletes=false,softCommit=false}
[junit4:junit4]   2> 13769 T482 C36 P15812 oasc.SolrDeletionPolicy.onInit SolrDeletionPolicy.onInit: commits:num=1
[junit4:junit4]   2> 		commit{dir=/usr/home/hudson/hudson-slave/workspace/Lucene-Solr-Tests-trunk-Java6/solr/build/solr-core/test/J1/org.apache.solr.cloud.BasicDistributedZk2Test-1348046267211/jetty2/index,segFN=segments_1,generation=1,filenames=[segments_1]
[junit4:junit4]   2> 13769 T482 C36 P15812 oasc.SolrDeletionPolicy.updateCommits newest commit = 1
[junit4:junit4]   2> 13770 T482 C36 P15812 oass.SolrIndexSearcher.<init> Opening Searcher@7d311feb main
[junit4:junit4]   2> 13771 T482 C36 P15812 oasu.DirectUpdateHandler2.commit end_commit_flush
[junit4:junit4]   2> 13772 T488 oasc.SolrCore.registerSearcher [collection1] Registered new searcher Searcher@7d311feb main{StandardDirectoryReader(segments_1:1)}
[junit4:junit4]   2> 13773 T482 C36 P15812 /update {waitSearcher=true&commit=true&commit_end_point=true&wt=javabin&softCommit=false&version=2} {commit=} 0 7
[junit4:junit4]   2> 13774 T515 C35 P53958 oash.ReplicationHandler.inform Commits will be reserved for  10000
[junit4:junit4]   2> 13774 T515 C35 P53958 oash.SnapPuller.<init>  No value set for 'pollInterval'. Timer Task not started.
[junit4:junit4]   2> 13776 T483 C36 P15812 oash.ReplicationHandler.inform Commits will be reserved for  10000
[junit4:junit4]   2> 13776 T483 C36 P15812 REQ /replication {command=indexversion&wt=javabin&qt=/replication&version=2} status=0 QTime=1 
[junit4:junit4]   2> 13781 T515 C35 P53958 oasc.SolrDeletionPolicy.onInit SolrDeletionPolicy.onInit: commits:num=1
[junit4:junit4]   2> 		commit{dir=/usr/home/hudson/hudson-slave/workspace/Lucene-Solr-Tests-trunk-Java6/solr/build/solr-core/test/J1/org.apache.solr.cloud.BasicDistributedZk2Test-1348046267211/jetty4/index,segFN=segments_1,generation=1,filenames=[segments_1]
[junit4:junit4]   2> 13782 T515 C35 P53958 oasc.SolrDeletionPolicy.updateCommits newest commit = 1
[junit4:junit4]   2> 13782 T515 C35 P53958 oasu.DirectUpdateHandler2.commit start commit{flags=0,_version_=0,optimize=false,openSearcher=true,waitSearcher=true,expungeDeletes=false,softCommit=false}
[junit4:junit4]   2> 13785 T515 C35 P53958 oasc.SolrDeletionPolicy.onCommit SolrDeletionPolicy.onCommit: commits:num=2
[junit4:junit4]   2> 		commit{dir=/usr/home/hudson/hudson-slave/workspace/Lucene-Solr-Tests-trunk-Java6/solr/build/solr-core/test/J1/org.apache.solr.cloud.BasicDistributedZk2Test-1348046267211/jetty4/index,segFN=segments_1,generation=1,filenames=[segments_1]
[junit4:junit4]   2> 		commit{dir=/usr/home/hudson/hudson-slave/workspace/Lucene-Solr-Tests-trunk-Java6/solr/build/solr-core/test/J1/org.apache.solr.cloud.BasicDistributedZk2Test-1348046267211/jetty4/index,segFN=segments_2,generation=2,filenames=[segments_2]
[junit4:junit4]   2> 13786 T515 C35 P53958 oasc.SolrDeletionPolicy.updateCommits newest commit = 2
[junit4:junit4]   2> 13789 T515 C35 P53958 oass.SolrIndexSearcher.<init> Opening Searcher@4510f345 main
[junit4:junit4]   2> 13790 T515 C35 P53958 oasu.DirectUpdateHandler2.commit end_commit_flush
[junit4:junit4]   2> 13791 T514 oasc.SolrCore.registerSearcher [collection1] Registered new searcher Searcher@4510f345 main{StandardDirectoryReader(segments_2:2)}
[junit4:junit4]   2> 13791 T515 C35 P53958 oasc.RecoveryStrategy.replay No replay needed. core=collection1
[junit4:junit4]   2> 13792 T515 C35 P53958 oasc.RecoveryStrategy.doRecovery Replication Recovery was successful - registering as Active. core=collection1
[junit4:junit4]   2> 13793 T515 C35 P53958 oasc.RecoveryStrategy.doRecovery Finished recovery process. core=collection1
[junit4:junit4]   2> 13917 T441 oascc.ZkStateReader.updateClusterState Updating cloud state from ZooKeeper... 
[junit4:junit4]   2> 13928 T462 oascc.ZkStateReader.updateClusterState Updating cloud state from ZooKeeper... 
[junit4:junit4]   2> 13944 T513 oascc.ZkStateReader$2.process A cluster state change has occurred - updating...
[junit4:junit4]   2> 13944 T487 oascc.ZkStateReader$2.process A cluster state change has occurred - updating...
[junit4:junit4]   2> 13944 T520 oascc.ZkStateReader$2.process A cluster state change has occurred - updating...
[junit4:junit4]   2> 13944 T499 oascc.ZkStateReader$2.process A cluster state change has occurred - updating...
[junit4:junit4]   2> 13944 T461 oascc.ZkStateReader$2.process A cluster state change has occurred - updating...
[junit4:junit4]   2> 13944 T475 oascc.ZkStateReader$2.process A cluster state change has occurred - updating...
[junit4:junit4]   2> 13944 T518 oascc.ZkStateReader$2.process A cluster state change has occurred - updating...
[junit4:junit4]   2> 14920 T441 oascc.ZkStateReader.updateClusterState Updating cloud state from ZooKeeper... 
[junit4:junit4]   2> 14924 T453 C37 P32220 oasu.DirectUpdateHandler2.commit start commit{flags=0,_version_=0,optimize=false,openSearcher=true,waitSearcher=true,expungeDeletes=false,softCommit=false}
[junit4:junit4]   2> 14986 T453 C37 P32220 oasc.SolrDeletionPolicy.onCommit SolrDeletionPolicy.onCommit: commits:num=2
[junit4:junit4]   2> 		commit{dir=/usr/home/hudson/hudson-slave/workspace/Lucene-Solr-Tests-trunk-Java6/solr/build/solr-core/test/J1/org.apache.solr.cloud.BasicDistributedZk2Test-1348046267211/control/data/index,segFN=segments_1,generation=1,filenames=[segments_1]
[junit4:junit4]   2> 		commit{dir=/usr/home/hudson/hudson-slave/workspace/Lucene-Solr-Tests-trunk-Java6/solr/build/solr-core/test/J1/org.apache.solr.cloud.BasicDistributedZk2Test-1348046267211/control/data/index,segFN=segments_2,generation=2,filenames=[_0_Block_0.tip, _0_TestBloomFilteredLucene40Postings_0.tim, _0_Block_0.pos, _0_TestBloomFilteredLucene40Postings_0.blm, _0_TestBloomFilteredLucene40Postings_0.tip, _0.fnm, _0_Pulsing40_0.tim, _0_Block_0.doc, _0_Block_0.tim, _0_TestBloomFilteredLucene40Postings_0.prx, _0_nrm.cfs, _0_Pulsing40_0.prx, _0_Pulsing40_0.frq, _0_SimpleText_0.pst, _0_nrm.cfe, _0_Pulsing40_0.tip, segments_2, _0_TestBloomFilteredLucene40Postings_0.frq, _0.fdx, _0.si, _0.fdt]
[junit4:junit4]   2> 14987 T453 C37 P32220 oasc.SolrDeletionPolicy.updateCommits newest commit = 2
[junit4:junit4]   2> 15002 T453 C37 P32220 oass.SolrIndexSearcher.<init> Opening Searcher@438f17eb main
[junit4:junit4]   2> 15003 T453 C37 P32220 oasu.DirectUpdateHandler2.commit end_commit_flush
[junit4:junit4]   2> 15005 T464 oasc.SolrCore.registerSearcher [collection1] Registered new searcher Searcher@438f17eb main{StandardDirectoryReader(segments_2:3 _0(5.0):C1)}
[junit4:junit4]   2> 15006 T453 C37 P32220 /update {waitSearcher=true&wt=javabin&commit=true&softCommit=false&version=2} {commit=} 0 82
[junit4:junit4]   2> 15008 T481 C36 P15812 oasu.DirectUpdateHandler2.commit start commit{flags=0,_version_=0,optimize=false,openSearcher=true,waitSearcher=true,expungeDeletes=false,softCommit=false}
[junit4:junit4]   2> 15011 T481 C36 P15812 oass.SolrIndexSearcher.<init> Opening Searcher@14e50583 main
[junit4:junit4]   2> 15012 T481 C36 P15812 oasu.DirectUpdateHandler2.commit end_commit_flush
[junit4:junit4]   2> 15013 T488 oasc.SolrCore.registerSearcher [collection1] Registered new searcher Searcher@14e50583 main{StandardDirectoryReader(segments_1:1)}
[junit4:junit4]   2> 15014 T481 C36 P15812 oasu.SolrCmdDistributor.distribCommit Distrib commit to:[StdNode: http://127.0.0.1:39666/solr/collection1/, StdNode: http://127.0.0.1:62806/solr/collection1/, StdNode: http://127.0.0.1:53958/solr/collection1/]
[junit4:junit4]   2>  C33_STATE=coll:collection1 core:collection1 props:{shard=shard1, roles=null, state=active, core=collection1, collection=collection1, node_name=127.0.0.1:62806_solr, base_url=http://127.0.0.1:62806/solr}
[junit4:junit4]   2> 15017 T491 C33 P62806 oasu.DirectUpdateHandler2.commit start commit{flags=0,_version_=0,optimize=false,openSearcher=true,waitSearcher=true,expungeDeletes=false,softCommit=false}
[junit4:junit4]   2> 15017 T469 C34 P39666 oasu.DirectUpdateHandler2.commit start commit{flags=0,_version_=0,optimize=false,openSearcher=true,waitSearcher=true,expungeDeletes=false,softCommit=false}
[junit4:junit4]   2> 15019 T491 C33 P62806 oass.SolrIndexSearcher.<init> Opening Searcher@39974439 main
[junit4:junit4]   2> 15020 T491 C33 P62806 oasu.DirectUpdateHandler2.commit end_commit_flush
[junit4:junit4]   2> 15021 T500 oasc.SolrCore.registerSearcher [collection1] Registered new searcher Searcher@39974439 main{StandardDirectoryReader(segments_2:3:nrt _0(5.0):C1)}
[junit4:junit4]   2> 15022 T491 C33 P62806 /update {waitSearcher=true&commit=true&wt=javabin&commit_end_point=true&expungeDeletes=false&softCommit=false&version=2} {commit=} 0 5
[junit4:junit4]   2>  C35_STATE=coll:collection1 core:collection1 props:{shard=shard2, roles=null, state=active, core=collection1, collection=collection1, node_name=127.0.0.1:53958_solr, base_url=http://127.0.0.1:53958/solr}
[junit4:junit4]   2> 15026 T505 C35 P53958 oasu.DirectUpdateHandler2.commit start commit{flags=0,_version_=0,optimize=false,openSearcher=true,waitSearcher=true,expungeDeletes=false,softCommit=false}
[junit4:junit4]   2> 15028 T469 C34 P39666 oass.SolrIndexSearcher.<init> Opening Searcher@5e4e6c9d main
[junit4:junit4]   2> 15029 T469 C34 P39666 oasu.DirectUpdateHandler2.commit end_commit_flush
[junit4:junit4]   2> 15030 T505 C35 P53958 oass.SolrIndexSearcher.<init> Opening Searcher@341575eb main
[junit4:junit4]   2> 15030 T476 oasc.SolrCore.registerSearcher [collection1] Registered new searcher Searcher@5e4e6c9d main{StandardDirectoryReader(segments_2:3 _0(5.0):C1)}
[junit4:junit4]   2> 15030 T505 C35 P53958 oasu.DirectUpdateHandler2.commit end_commit_flush
[junit4:junit4]   2> 15031 T469 C34 P39666 /update {waitSearcher=true&commit=true&wt=javabin&commit_end_point=true&expungeDeletes=false&softCommit=false&version=2} {commit=} 0 14
[junit4:junit4]   2> 15032 T514 oasc.SolrCore.registerSearcher [collection1] Registered new searcher Searcher@341575eb main{StandardDirectoryReader(segments_2:2)}
[junit4:junit4]   2> 15032 T505 C35 P53958 /update {waitSearcher=true&commit=true&wt=javabin&commit_end_point=true&expungeDeletes=false&softCommit=false&version=2} {commit=} 0 6
[junit4:junit4]   2> 15033 T481 C36 P15812 /update {waitSearcher=true&wt=javabin&commit=true&softCommit=false&version=2} {commit=} 0 25
[junit4:junit4]   2> 15040 T454 C37 P32220 REQ /select {fl=id,score&shard.url=127.0.0.1:32220/solr/collection1/&NOW=1348046282242&start=0&q=*:*&distrib=false&isShard=true&wt=javabin&fsv=true&rows=10&version=2} hits=1 status=0 QTime=1 
[junit4:junit4]   2> 15063 T454 C37 P32220 REQ /select {shard.url=127.0.0.1:32220/solr/collection1/&NOW=1348046282242&q=*:*&ids=1&distrib=false&isShard=true&wt=javabin&version=2} status=0 QTime=5 
[junit4:junit4]   2> 15065 T453 C37 P32220 REQ /select {wt=javabin&q=*:*&version=2} hits=1 status=0 QTime=29 
[junit4:junit4]   2> 15066 T441 oaz.ZooKeeper.<init> Initiating client connection, connectString=127.0.0.1:55606/solr sessionTimeout=10000 watcher=org.apache.solr.common.cloud.ConnectionManager@7c1ba98b
[junit4:junit4]   2> 15067 T528 oaz.ClientCnxn$SendThread.startConnect Opening socket connection to server /127.0.0.1:55606
[junit4:junit4]   2> 15067 T441 oascc.ConnectionManager.waitForConnected Waiting for client to connect to ZooKeeper
[junit4:junit4]   2> 15068 T443 oazs.NIOServerCnxn$Factory.run Accepted socket connection from /140.211.11.196:56936
[junit4:junit4]   2> 15068 T528 oaz.ClientCnxn$SendThread.primeConnection Socket connection established to localhost/127.0.0.1:55606, initiating session
[junit4:junit4]   2> 15069 T443 oazs.NIOServerCnxn.readConnectRequest Client attempting to establish new session at /140.211.11.196:56936
[junit4:junit4]   2> 15071 T445 oazs.NIOServerCnxn.finishSessionInit Established session 0x139ddd1a3510009 with negotiated timeout 10000 for client /140.211.11.196:56936
[junit4:junit4]   2> 15071 T528 oaz.ClientCnxn$SendThread.readConnectResult Session establishment complete on server localhost/127.0.0.1:55606, sessionid = 0x139ddd1a3510009, negotiated timeout = 10000
[junit4:junit4]   2> 15071 T529 oascc.ConnectionManager.process Watcher org.apache.solr.common.cloud.ConnectionManager@7c1ba98b name:ZooKeeperConnection Watcher:127.0.0.1:55606/solr got event WatchedEvent state:SyncConnected type:None path:null path:null type:None
[junit4:junit4]   2> 15071 T441 oascc.ConnectionManager.waitForConnected Client is connected to ZooKeeper
[junit4:junit4]   2> 15072 T441 oascc.ZkStateReader.createClusterStateWatchersAndUpdate Updating cluster state from ZooKeeper... 
[junit4:junit4]   2> 15074 T446 oazs.PrepRequestProcessor.pRequest Processed session termination for sessionid: 0x139ddd1a3510009
[junit4:junit4]   2> 15075 T529 oaz.ClientCnxn$EventThread.run EventThread shut down
[junit4:junit4]   2> 15075 T443 oazs.NIOServerCnxn.closeSock Closed socket connection for client /140.211.11.196:56936 which had sessionid 0x139ddd1a3510009
[junit4:junit4]   2> 15075 T441 oaz.ZooKeeper.close Session: 0x139ddd1a3510009 closed
[junit4:junit4]   2> 15078 T472 C34 P39666 REQ /select {distrib=false&wt=javabin&q=*:*&version=2} hits=1 status=0 QTime=1 
[junit4:junit4]   2> 15081 T484 C36 P15812 REQ /select {distrib=false&wt=javabin&q=*:*&version=2} hits=0 status=0 QTime=1 
[junit4:junit4]   2> 15086 T492 C33 P62806 REQ /select {fl=id,score&shard.url=127.0.0.1:39666/solr/collection1/|127.0.0.1:62806/solr/collection1/&NOW=1348046282289&start=0&q=*:*&distrib=false&isShard=true&wt=javabin&fsv=true&rows=10&version=2} hits=1 status=0 QTime=0 
[junit4:junit4]   2> 15086 T506 C35 P53958 REQ /select {fl=id,score&shard.url=127.0.0.1:15812/solr/collection1/|127.0.0.1:53958/solr/collection1/&NOW=1348046282289&start=0&q=*:*&distrib=false&isShard=true&wt=javabin&fsv=true&rows=10&version=2} hits=0 status=0 QTime=0 
[junit4:junit4]   2> 15089 T492 C33 P62806 REQ /select {shard.url=127.0.0.1:39666/solr/collection1/|127.0.0.1:62806/solr/collection1/&NOW=1348046282289&q=*:*&ids=1&distrib=false&isShard=true&wt=javabin&version=2} status=0 QTime=0 
[junit4:junit4]   2> 15090 T481 C36 P15812 REQ /select {wt=javabin&q=*:*&version=2} hits=1 status=0 QTime=7 
[junit4:junit4]   2> 15097 T453 C37 P32220 /update {wt=javabin&version=2} {add=[2 (1413528978509004800)]} 0 3
[junit4:junit4]   2> 15111 T505 C35 P53958 REQ /update {distrib.from=http://127.0.0.1:15812/solr/collection1/&update.distrib=FROMLEADER&wt=javabin&version=2} status=0 QTime=4 
[junit4:junit4]   2> 15112 T481 C36 P15812 /update {wt=javabin&version=2} {add=[2 (1413528978515296256)]} 0 12
[junit4:junit4]   2> 15117 T453 C37 P32220 /update {wt=javabin&version=2} {add=[3 (1413528978531024896)]} 0 2
[junit4:junit4]   2> 15125 T505 C35 P53958 REQ /update {distrib.from=http://127.0.0.1:15812/solr/collection1/&update.distrib=FROMLEADER&wt=javabin&version=2} status=0 QTime=1 
[junit4:junit4]   2> 15126 T481 C36 P15812 /update {wt=javabin&version=2} {add=[3 (1413528978536267776)]} 0 6
[junit4:junit4]   2> 15129 T453 C37 P32220 /update {wt=javabin&version=2} {add=[4 (1413528978544656384)]} 0 1
[junit4:junit4]   2> 15144 T491 C33 P62806 REQ /update {update.distrib=FROMLEADER&distrib.from=http://127.0.0.1:39666/solr/collection1/&wt=javabin&version=2} status=0 QTime=3 
[junit4:junit4]   2> 15145 T469 C34 P39666 REQ /update {distrib.from=http://127.0.0.1:15812/solr/collection1/&update.distrib=TOLEADER&wt=javabin&version=2} status=0 QTime=10 
[junit4:junit4]   2> 15146 T481 C36 P15812 /update {wt=javabin&version=2} {add=[4]} 0 14
[junit4:junit4]   2> 15149 T453 C37 P32220 /update {wt=javabin&version=2} {add=[5 (1413528978565627904)]} 0 1
[junit4:junit4]   2> 15156 T505 C35 P53958 REQ /update {distrib.from=http://127.0.0.1:15812/solr/collection1/&update.distrib=FROMLEADER&wt=javabin&version=2} status=0 QTime=1 
[junit4:junit4]   2> 15157 T481 C36 P15812 /update {wt=javabin&version=2} {add=[5 (1413528978569822208)]} 0 5
[junit4:junit4]   2> 15160 T453 C37 P32220 /update {wt=javabin&version=2} {add=[6 (1413528978577162240)]} 0 1
[junit4:junit4]   2> 15167 T505 C35 P53958 REQ /update {distrib.from=http://127.0.0.1:15812/solr/collection1/&update.distrib=FROMLEADER&wt=javabin&version=2} status=0 QTime=1 
[junit4:junit4]   2> 15167 T481 C36 P15812 /update {wt=javabin&version=2} {add=[6 (1413528978581356544)]} 0 4
[junit4:junit4]   2> 15171 T453 C37 P32220 /update {wt=javabin&version=2} {add=[7 (1413528978588696576)]} 0 1
[junit4:junit4]   2> 15179 T505 C35 P53958 REQ /update {update.distrib=FROMLEADER&distrib.from=http://127.0.0.1:15812/solr/collection1/&wt=javabin&version=2} status=0 QTime=1 
[junit4:junit4]   2> 15180 T485 C36 P15812 REQ /update {distrib.from=http://127.0.0.1:39666/solr/collection1/&update.distrib=TOLEADER&wt=javabin&version=2} status=0 QTime=5 
[junit4:junit4]   2> 15181 T473 C34 P39666 /update {wt=javabin&version=2} {add=[7]} 0 8
[junit4:junit4]   2> 15184 T453 C37 P32220 /update {wt=javabin&version=2} {add=[8 (1413528978602328064)]} 0 1
[junit4:junit4]   2> 15194 T491 C33 P62806 REQ /update {update.distrib=FROMLEADER&distrib.from=http://127.0.0.1:39666/solr/collection1/&wt=javabin&version=2} status=0 QTime=2 
[junit4:junit4]   2> 15194 T469 C34 P39666 REQ /update {distrib.from=http://127.0.0.1:15812/solr/collection1/&update.distrib=TOLEADER&wt=javabin&version=2} status=0 QTime=5 
[junit4:junit4]   2> 15195 T481 C36 P15812 /update {wt=javabin&version=2} {add=[8]} 0 8
[junit4:junit4]   2> 15198 T453 C37 P32220 /update {wt=javabin&version=2} {add=[9 (1413528978617008128)]} 0 1
[junit4:junit4]   2> 15205 T505 C35 P53958 REQ /update {distrib.from=http://127.0.0.1:15812/solr/collection1/&update.distrib=FROMLEADER&wt=javabin&version=2} status=0 QTime=1 
[junit4:junit4]   2> 15205 T481 C36 P15812 /update {wt=javabin&version=2} {add=[9 (1413528978621202432)]} 0 4
[junit4:junit4]   2> 15209 T453 C37 P32220 /update {wt=javabin&version=2} {add=[10 (1413528978628542464)]} 0 1
[junit4:junit4]   2> 15218 T491 C33 P62806 REQ /update {update.distrib=FROMLEADER&distrib.from=http://127.0.0.1:39666/solr/collection1/&wt=javabin&version=2} status=0 QTime=1 
[junit4:junit4]   2> 15219 T469 C34 P39666 REQ /update {distrib.from=http://127.0.0.1:15812/solr/collection1/&update.distrib=TOLEADER&wt=javabin&version=2} status=0 QTime=5 
[junit4:junit4]   2> 15219 T481 C36 P15812 /update {wt=javabin&version=2} {add=[10]} 0 7
[junit4:junit4]   2> 15246 T453 C37 P32220 /update {wt=javabin&version=2} {add=[11 (1413528978643222528)]} 0 24
[junit4:junit4]   2> 15254 T491 C33 P62806 REQ /update {distrib.from=http://127.0.0.1:39666/solr/collection1/&update.distrib=FROMLEADER&wt=javabin&version=2} status=0 QTime=1 
[junit4:junit4]   2> 15255 T473 C34 P39666 /update {wt=javabin&version=2} {add=[11 (1413528978671534080)]} 0 6
[junit4:junit4]   2> 15259 T453 C37 P32220 /update {wt=javabin&version=2} {add=[12 (1413528978679922688)]} 0 2
[junit4:junit4]   2> 15266 T491 C33 P62806 REQ /update {distrib.from=http://127.0.0.1:39666/solr/collection1/&update.distrib=FROMLEADER&wt=javabin&version=2} status=0 QTime=1 
[junit4:junit4]   2> 15266 T473 C34 P39666 /update {wt=javabin&version=2} {add=[12 (1413528978685165568)]} 0 4
[junit4:junit4]   2> 15270 T453 C37 P32220 /update {wt=javabin&version=2} {add=[13 (1413528978692505600)]} 0 1
[junit4:junit4]   2> 15276 T491 C33 P62806 REQ /update {distrib.from=http://127.0.0.1:39666/solr/collection1/&update.distrib=FROMLEADER&wt=javabin&version=2} status=0 QTime=1 
[junit4:junit4]   2> 15276 T473 C34 P39666 /update {wt=javabin&version=2} {add=[13 (1413528978695651328)]} 0 4
[junit4:junit4]   2> 15280 T453 C37 P32220 /update {wt=javabin&version=2} {add=[14 (1413528978702991360)]} 0 1
[junit4:junit4]   2> 15288 T491 C33 P62806 REQ /update {update.distrib=FROMLEADER&distrib.from=http://127.0.0.1:39666/solr/collection1/&wt=javabin&version=2} status=0 QTime=1 
[junit4:junit4]   2> 15289 T469 C34 P39666 REQ /update {distrib.from=http://127.0.0.1:15812/solr/collection1/&update.distrib=TOLEADER&wt=javabin&version=2} status=0 QTime=5 
[junit4:junit4]   2> 15289 T481 C36 P15812 /update {wt=javabin&version=2} {add=[14]} 0 7
[junit4:junit4]   2> 15293 T453 C37 P32220 /update {wt=javabin&version=2} {add=[15 (1413528978716622848)]} 0 1
[junit4:junit4]   2> 15299 T491 C33 P62806 REQ /update {distrib.from=http://127.0.0.1:39666/solr/collection1/&update.distrib=FROMLEADER&wt=javabin&version=2} status=0 QTime=1 
[junit4:junit4]   2> 15299 T473 C34 P39666 /update {wt=javabin&version=2} {add=[15 (1413528978719768576)]} 0 4
[junit4:junit4]   2> 15303 T453 C37 P32220 /update {wt=javabin&version=2} {add=[16 (1413528978727108608)]} 0 1
[junit4:junit4]   2> 15318 T491 C33 P62806 REQ /update {update.distrib=FROMLEADER&distrib.from=http://127.0.0.1:39666/solr/collection1/&wt=javabin&version=2} status=0 QTime=1 
[junit4:junit4]   2> 15319 T469 C34 P39666 REQ /update {distrib.from=http://127.0.0.1:15812/solr/collection1/&update.distrib=TOLEADER&wt=javabin&version=2} status=0 QTime=5 
[junit4:junit4]   2> 15320 T481 C36 P15812 /update {wt=javabin&version=2} {add=[16]} 0 9
[junit4:junit4]   2> 15324 T453 C37 P32220 /update {wt=javabin&version=2} {add=[17 (1413528978748080128)]} 0 2
[junit4:junit4]   2> 15334 T505 C35 P53958 REQ /update {update.distrib=FROMLEADER&distrib.from=http://127.0.0.1:15812/solr/collection1/&wt=javabin&version=2} status=0 QTime=2 
[junit4:junit4]   2> 15334 T485 C36 P15812 REQ /update {distrib.from=http://127.0.0.1:39666/solr/collection1/&update.distrib=TOLEADER&wt=javabin&version=2} status=0 QTime=6 
[junit4:junit4]   2> 15335 T473 C34 P39666 /update {wt=javabin&version=2} {add=[17]} 0 9
[junit4:junit4]   2> 15338 T453 C37 P32220 /update {wt=javabin&version=2} {add=[100 (1413528978763808768)]} 0 1
[junit4:junit4]   2> 15590 T491 C33 P62806 REQ /update {update.distrib=FROMLEADER&distrib.from=http://127.0.0.1:39666/solr/collection1/&wt=javabin&version=2} status=0 QTime=15 
[junit4:junit4]   2> 15591 T469 C34 P39666 REQ /update {distrib.from=http://127.0.0.1:15812/solr/collection1/&update.distrib=TOLEADER&wt=javabin&version=2} status=0 QTime=249 
[junit4:junit4]   2> 15592 T481 C36 P15812 /update {wt=javabin&version=2} {add=[100]} 0 252
[junit4:junit4]   2> 15595 T453 C37 P32220 /update {wt=javabin&version=2} {add=[101 (1413528979033292800)]} 0 1
[junit4:junit4]   2> 15606 T491 C33 P62806 REQ /update {update.distrib=FROMLEADER&distrib.from=http://127.0.0.1:39666/solr/collection1/&wt=javabin&version=2} status=0 QTime=2 
[junit4:junit4]   2> 15607 T469 C34 P39666 REQ /update {distrib.from=http://127.0.0.1:15812/solr/collection1/&update.distrib=TOLEADER&wt=javabin&version=2} status=0 QTime=7 
[junit4:junit4]   2> 15607 T481 C36 P15812 /update {wt=javabin&version=2} {add=[101]} 0 9
[junit4:junit4]   2> 15611 T453 C37 P32220 /update {wt=javabin&version=2} {add=[102 (1413528979050070016)]} 0 1
[junit4:junit4]   2> 15619 T491 C33 P62806 REQ /update {update.distrib=FROMLEADER&distrib.from=http://127.0.0.1:39666/solr/collection1/&wt=javabin&version=2} status=0 QTime=1 
[junit4:junit4]   2> 15619 T469 C34 P39666 REQ /update {distrib.from=http://127.0.0.1:15812/solr/collection1/&update.distrib=TOLEADER&wt=javabin&version=2} status=0 QTime=4 
[junit4:junit4]   2> 15620 T481 C36 P15812 /update {wt=javabin&version=2} {add=[102]} 0 7
[junit4:junit4]   2> 15637 T453 C37 P32220 /update {wt=javabin&version=2} {add=[103 (1413528979062652928)]} 0 15
[junit4:junit4]   2> 15646 T505 C35 P53958 REQ /update {update.distrib=FROMLEADER&distrib.from=http://127.0.0.1:15812/solr/collection1/&wt=javabin&version=2} status=0 QTime=1 
[junit4:junit4]   2> 15646 T485 C36 P15812 REQ /update {distrib.from=http://127.0.0.1:39666/solr/collection1/&update.distrib=TOLEADER&wt=javabin&version=2} status=0 QTime=4 
[junit4:junit4]   2> 15647 T473 C34 P39666 /update {wt=javabin&version=2} {add=[103]} 0 7
[junit4:junit4]   2> 15652 T453 C37 P32220 /update {wt=javabin&version=2} {add=[104 (1413528979092013056)]} 0 2
[junit4:junit4]   2> 15658 T505 C35 P53958 REQ /update {distrib.from=http://127.0.0.1:15812/solr/collection1/&update.distrib=FROMLEADER&wt=javabin&version=2} status=0 QTime=1 
[junit4:junit4]   2> 15658 T481 C36 P15812 /update {wt=javabin&version=2} {add=[104 (1413528979096207360)]} 0 4
[junit4:junit4]   2> 15662 T453 C37 P32220 /update {wt=javabin&version=2} {add=[105 (1413528979103547392)]} 0 1
[junit4:junit4]   2> 15700 T505 C35 P53958 REQ /update {update.distrib=FROMLEADER&distrib.from=http://127.0.0.1:15812/solr/collection1/&wt=javabin&version=2} status=0 QTime=15 
[junit4:junit4]   2> 15701 T485 C36 P15812 REQ /update {distrib.from=http://127.0.0.1:39666/solr/collection1/&update.distrib=TOLEADER&wt=javabin&version=2} status=0 QTime=35 
[junit4:junit4]   2> 15701 T473 C34 P39666 /update {wt=javabin&version=2} {add=[105]} 0 37
[junit4:junit4]   2> 15705 T453 C37 P32220 /update {wt=javabin&version=2} {add=[106 (1413528979148636160)]} 0 1
[junit4:junit4]   2> 15715 T505 C35 P53958 REQ /update {distrib.from=http://127.0.0.1:15812/solr/collection1/&update.distrib=FROMLEADER&wt=javabin&version=2} status=0 QTime=2 
[junit4:junit4]   2> 15716 T481 C36 P15812 /update {wt=javabin&version=2} {add=[106 (1413528979152830464)]} 0 8
[junit4:junit4]   2> 15720 T453 C37 P32220 /update {wt=javabin&version=2} {add=[107 (1413528979164364800)]} 0 1
[junit4:junit4]   2> 15726 T491 C33 P62806 REQ /update {distrib.from=http://127.0.0.1:39666/solr/collection1/&update.distrib=FROMLEADER&wt=javabin&version=2} status=0 QTime=1 
[junit4:junit4]   2> 15726 T473 C34 P39666 /update {wt=javabin&version=2} {add=[107 (1413528979167510528)]} 0 4
[junit4:junit4]   2> 15730 T453 C37 P32220 /update {wt=javabin&version=2} {add=[108 (1413528979174850560)]} 0 1
[junit4:junit4]   2> 15737 T491 C33 P62806 REQ /update {distrib.from=http://127.0.0.1:39666/solr/collection1/&update.distrib=FROMLEADER&wt=javabin&version=2} status=0 QTime=1 
[junit4:junit4]   2> 15737 T473 C34 P39666 /update {wt=javabin&version=2} {add=[108 (1413528979179044864)]} 0 4
[junit4:junit4]   2> 15741 T453 C37 P32220 /update {wt=javabin&version=2} {add=[109 (1413528979186384896)]} 0 1
[junit4:junit4]   2> 15748 T491 C33 P62806 REQ /update {distrib.from=http://127.0.0.1:39666/solr/collection1/&update.distrib=FROMLEADER&wt=javabin&version=2} status=0 QTime=1 
[junit4:junit4]   2> 15748 T473 C34 P39666 /update {wt=javabin&version=2} {add=[109 (1413528979190579200)]} 0 4
[junit4:junit4]   2> 15752 T453 C37 P32220 /update {wt=javabin&version=2} {add=[110 (1413528979197919232)]} 0 1
[junit4:junit4]   2> 15760 T491 C33 P62806 REQ /update {update.distrib=FROMLEADER&distrib.from=http://127.0.0.1:39666/solr/collection1/&wt=javabin&version=2} status=0 QTime=1 
[junit4:junit4]   2> 15760 T469 C34 P39666 REQ /update {distrib.from=http://127.0.0.1:15812/solr/collection1/&update.distrib=TOLEADER&wt=javabin&version=2} status=0 QTime=4 
[junit4:junit4]   2> 15760 T481 C36 P15812 /update {wt=javabin&version=2} {add=[110]} 0 6
[junit4:junit4]   2> 15764 T453 C37 P32220 /update {wt=javabin&version=2} {add=[111 (1413528979210502144)]} 0 1
[junit4:junit4]   2> 15773 T491 C33 P62806 REQ /update {update.distrib=FROMLEADER&distrib.from=http://127.0.0.1:39666/solr/collection1/&wt=javabin&version=2} status=0 QTime=1 
[junit4:junit4]   2> 15773 T469 C34 P39666 REQ /update {distrib.from=http://127.0.0.1:15812/solr/collection1/&update.distrib=TOLEADER&wt=javabin&version=2} status=0 QTime=4 
[junit4:junit4]   2> 15773 T481 C36 P15812 /update {wt=javabin&version=2} {add=[111]} 0 6
[junit4:junit4]   2> 15777 T453 C37 P32220 /update {wt=javabin&version=2} {add=[112 (1413528979224133632)]} 0 1
[junit4:junit4]   2> 15785 T505 C35 P53958 REQ /update {update.distrib=FROMLEADER&distrib.from=http://127.0.0.1:15812/solr/collection1/&wt=javabin&version=2} status=0 QTime=1 
[junit4:junit4]   2> 15785 T485 C36 P15812 REQ /update {distrib.from=http://127.0.0.1:39666/solr/collection1/&update.distrib=TOLEADER&wt=javabin&version=2} status=0 QTime=4 
[junit4:junit4]   2> 15786 T473 C34 P39666 /update {wt=javabin&version=2} {add=[112]} 0 7
[junit4:junit4]   2> 15799 T453 C37 P32220 /update {wt=javabin&version=2} {add=[113 (1413528979236716544)]} 0 11
[junit4:junit4]   2> 15806 T491 C33 P62806 REQ /update {distrib.from=http://127.0.0.1:39666/solr/collection1/&update.distrib=FROMLEADER&wt=javabin&version=2} status=0 QTime=1 
[junit4:junit4]   2> 15806 T473 C34 P39666 /update {wt=javabin&version=2} {add=[113 (1413528979251396608)]} 0 4
[junit4:junit4]   2> 15811 T453 C37 P32220 /update {wt=javabin&version=2} {add=[114 (1413528979258736640)]} 0 2
[junit4:junit4]   2> 15821 T491 C33 P62806 REQ /update {update.distrib=FROMLEADER&distrib.from=http://127.0.0.1:39666/solr/collection1/&wt=javabin&version=2} status=0 QTime=1 
[junit4:junit4]   2> 15821 T469 C34 P39666 REQ /update {distrib.from=http://127.0.0.1:15812/solr/collection1/&update.distrib=TOLEADER&wt=javabin&version=2} status=0 QTime=4 
[junit4:junit4]   2> 15822 T481 C36 P15812 /update {wt=javabin&version=2} {add=[114]} 0 8
[junit4:junit4]   2> 15825 T453 C37 P32220 /update {wt=javabin&version=2} {add=[115 (1413528979274465280)]} 0 1
[junit4:junit4]   2> 15833 T505 C35 P53958 REQ /update {update.distrib=FROMLEADER&distrib.from=http://127.0.0.1:15812/solr/collection1/&wt=javabin&version=2} status=0 QTime=1 
[junit4:junit4]   2> 15833 T485 C36 P15812 REQ /update {distrib.from=http://127.0.0.1:39666/solr/collection1/&update.distrib=TOLEADER&wt=javabin&version=2} status=0 QTime=4 
[junit4:junit4]   2> 15834 T473 C34 P39666 /update {wt=javabin&version=2} {add=[115]} 0 7
[junit4:junit4]   2> 15838 T453 C37 P32220 /update {wt=javabin&version=2} {add=[116 (1413528979288096768)]} 0 1
[junit4:junit4]   2> 15846 T505 C35 P53958 REQ /update {update.distrib=FROMLEADER&distrib.from=http://127.0.0.1:15812/solr/collection1/&wt=javabin&version=2} status=0 QTime=1 
[junit4:junit4]   2> 15847 T485 C36 P15812 REQ /update {distrib.from=http://127.0.0.1:39666/solr/collection1/&update.distrib=TOLEADER&wt=javabin&version=2} status=0 QTime=5 
[junit4:junit4]   2> 15847 T473 C34 P39666 /update {wt=javabin&version=2} {add=[116]} 0 7
[junit4:junit4]   2> 15851 T453 C37 P32220 /update {wt=javabin&version=2} {add=[117 (1413528979301728256)]} 0 1
[junit4:junit4]   2> 15857 T505 C35 P53958 REQ /update {distrib.from=http://127.0.0.1:15812/solr/collection1/&update.distrib=FROMLEADER&wt=javabin&version=2} status=0 QTime=1 
[junit4:junit4]   2> 15858 T481 C36 P15812 /update {wt=javabin&version=2} {add=[117 (1413528979304873984)]} 0 5
[junit4:junit4]   2> 15862 T453 C37 P32220 /update {wt=javabin&version=2} {add=[118 (1413528979313262592)]} 0 1
[junit4:junit4]   2> 15890 T491 C33 P62806 REQ /update {distrib.from=http://127.0.0.1:39666/solr/collection1/&update.distrib=FROMLEADER&wt=javabin&version=2} status=0 QTime=11 
[junit4:junit4]   2> 15890 T473 C34 P39666 /update {wt=javabin&version=2} {add=[118 (1413528979316408320)]} 0 26
[junit4:junit4]   2> 15894 T453 C37 P32220 /update {wt=javabin&version=2} {add=[119 (1413528979346817024)]} 0 1
[junit4:junit4]   2> 15900 T505 C35 P53958 REQ /update {distrib.from=http://127.0.0.1:15812/solr/collection1/&update.distrib=FROMLEADER&wt=javabin&version=2} status=0 QTime=1 
[junit4:junit4]   2> 15901 T481 C36 P15812 /update {wt=javabin&version=2} {add=[119 (1413528979349962752)]} 0 5
[junit4:junit4]   2> 15904 T453 C37 P32220 /update {wt=javabin&version=2} {add=[120 (1413528979357302784)]} 0 1
[junit4:junit4]   2> 15910 T505 C35 P53958 REQ /update {distrib.from=http://127.0.0.1:15812/solr/collection1/&update.distrib=FROMLEADER&wt=javabin&version=2} status=0 QTime=1 
[junit4:junit4]   2> 15911 T481 C36 P15812 /update {wt=javabin&version=2} {add=[120 (1413528979360448512)]} 0 5
[junit4:junit4]   2> 15915 T453 C37 P32220 /update {wt=javabin&version=2} {add=[121 (1413528979368837120)]} 0 1
[junit4:junit4]   2> 15923 T505 C35 P53958 REQ /update {update.distrib=FROMLEADER&distrib.from=http://127.0.0.1:15812/solr/collection1/&wt=javabin&version=2} status=0 QTime=1 
[junit4:junit4]   2> 15924 T485 C36 P15812 REQ /update {distrib.from=http://127.0.0.1:39666/solr/collection1/&update.distrib=TOLEADER&wt=javabin&version=2} status=0 QTime=5 
[junit4:junit4]   2> 15924 T473 C34 P39666 /update {wt=javabin&version=2} {add=[121]} 0 7
[junit4:junit4]   2> 15928 T453 C37 P32220 /update {wt=javabin&version=2} {add=[122 (1413528979382468608)]} 0 1
[junit4:junit4]   2> 15939 T491 C33 P62806 REQ /update {update.distrib=FROMLEADER&distrib.from=http://127.0.0.1:39666/solr/collection1/&wt=javabin&version=2} status=0 QTime=2 
[junit4:junit4]   2> 15940 T469 C34 P39666 REQ /update {distrib.from=http://127.0.0.1:15812/solr/collection1/&update.distrib=TOLEADER&wt=javabin&version=2} status=0 QTime=7 
[junit4:junit4]   2> 15940 T481 C36 P15812 /update {wt=javabin&version=2} {add=[122]} 0 10
[junit4:junit4]   2> 15955 T453 C37 P32220 /update {wt=javabin&version=2} {add=[123 (1413528979399245824)]} 0 12
[junit4:junit4]   2> 15962 T491 C33 P62806 REQ /update {distrib.from=http://127.0.0.1:39666/solr/collection1/&update.distrib=FROMLEADER&wt=javabin&version=2} status=0 QTime=1 
[junit4:junit4]   2> 15963 T473 C34 P39666 /update {wt=javabin&version=2} {add=[123 (1413528979414974464)]} 0 5
[junit4:junit4]   2> 15968 T453 C37 P32220 /update {wt=javabin&version=2} {add=[124 (1413528979423363072)]} 0 2
[junit4:junit4]   2> 15975 T491 C33 P62806 REQ /update {distrib.from=http://127.0.0.1:39666/solr/collection1/&update.distrib=FROMLEADER&wt=javabin&version=2} status=0 QTime=1 
[junit4:junit4]   2> 15976 T473 C34 P39666 /update {wt=javabin&version=2} {add=[124 (1413528979428605952)]} 0 5
[junit4:junit4]   2> 15979 T453 C37 P32220 /update {wt=javabin&version=2} {add=[125 (1413528979435945984)]} 0 1
[junit4:junit4]   2> 15987 T491 C33 P62806 REQ /update {update.distrib=FROMLEADER&distrib.from=http://127.0.0.1:39666/solr/collection1/&wt=javabin&version=2} status=0 QTime=1 
[junit4:junit4]   2> 15988 T469 C34 P39666 REQ /update {distrib.from=http://127.0.0.1:15812/solr/collection1/&update.distrib=TOLEADER&wt=javabin&version=2} status=0 QTime=5 
[junit4:junit4]   2> 15989 T481 C36 P15812 /update {wt=javabin&version=2} {add=[125]} 0 8
[junit4:junit4]   2> 15992 T453 C37 P32220 /update {wt=javabin&version=2} {add=[126 (1413528979449577472)]} 0 1
[junit4:junit4]   2> 15998 T505 C35 P53958 REQ /update {distrib.from=http://127.0.0.1:15812/solr/collection1/&update.distrib=FROMLEADER&wt=javabin&version=2} status=0 QTime=1 
[junit4:junit4]   2> 15999 T481 C36 P15812 /update {wt=javabin&version=2} {add=[126 (1413528979452723200)]} 0 5
[junit4:junit4]   2> 16002 T453 C37 P32220 /update {wt=javabin&version=2} {add=[127 (1413528979460063232)]} 0 1
[junit4:junit4]   2> 16031 T505 C35 P53958 REQ /update {update.distrib=FROMLEADER&distrib.from=http://127.0.0.1:15812/solr/collection1/&wt=javabin&version=2} status=0 QTime=12 
[junit4:junit4]   2> 16032 T485 C36 P15812 REQ /update {distrib.from=http://127.0.0.1:39666/solr/collection1/&update.distrib=TOLEADER&wt=javabin&version=2} status=0 QTime=26 
[junit4:junit4]   2> 16032 T473 C34 P39666 /update {wt=javabin&version=2} {add=[127]} 0 28
[junit4:junit4]   2> 16036 T453 C37 P32220 /update {wt=javabin&version=2} {add=[128 (1413528979495714816)]} 0 1
[junit4:junit4]   2> 16044 T505 C35 P53958 REQ /update {distrib.from=http://127.0.0.1:15812/solr/collection1/&update.distrib=FROMLEADER&wt=javabin&version=2} status=0 QTime=2 
[junit4:junit4]   2> 16045 T481 C36 P15812 /update {wt=javabin&version=2} {add=[128 (1413528979498860544)]} 0 7
[junit4:junit4]   2> 16049 T453 C37 P32220 /update {wt=javabin&version=2} {add=[129 (1413528979509346304)]} 0 1
[junit4:junit4]   2> 16057 T491 C33 P62806 REQ /update {distrib.from=http://127.0.0.1:39666/solr/collection1/&update.distrib=FROMLEADER&wt=javabin&version=2} status=0 QTime=1 
[junit4:junit4]   2> 16058 T473 C34 P39666 /update {wt=javabin&version=2} {add=[129 (1413528979514589184)]} 0 5
[junit4:junit4]   2> 16063 T453 C37 P32220 /update {wt=javabin&version=2} {add=[130 (1413528979522977792)]} 0 2
[junit4:junit4]   2> 16071 T505 C35 P53958 REQ /update {update.distrib=FROMLEADER&distrib.from=http://127.0.0.1:15812/solr/collection1/&wt=javabin&version=2} status=0 QTime=1 
[junit4:junit4]   2> 16071 T485 C36 P15812 REQ /update {distrib.from=http://127.0.0.1:39666/solr/collection1/&update.distrib=TOLEADER&wt=javabin&version=2} status=0 QTime=4 
[junit4:junit4]   2> 16072 T473 C34 P39666 /update {wt=javabin&version=2} {add=[130]} 0 7
[junit4:junit4]   2> 16076 T453 C37 P32220 /update {wt=javabin&version=2} {add=[131 (1413528979537657856)]} 0 1
[junit4:junit4]   2> 16085 T505 C35 P53958 REQ /update {update.distrib=FROMLEADER&distrib.from=http://127.0.0.1:15812/solr/collection1/&wt=javabin&version=2} status=0 QTime=1 
[junit4:junit4]   2> 16085 T485 C36 P15812 REQ /update {distrib.from=http://127.0.0.1:39666/solr/collection1/&update.distrib=TOLEADER&wt=javabin&version=2} status=0 QTime=4 
[junit4:junit4]   2> 16086 T473 C34 P39666 /update {wt=javabin&version=2} {add=[131]} 0 7
[junit4:junit4]   2> 16089 T453 C37 P32220 /update {wt=javabin&version=2} {add=[132 (1413528979551289344)]} 0 1
[junit4:junit4]   2> 16096 T491 C33 P62806 REQ /update {distrib.from=http://127.0.0.1:39666/solr/collection1/&update.distrib=FROMLEADER&wt=javabin&version=2} status=0 QTime=1 
[junit4:junit4]   2> 16097 T473 C34 P39666 /update {wt=javabin&version=2} {add=[132 (1413528979555483648)]} 0 5
[junit4:junit4]   2> 16114 T453 C37 P32220 /update {wt=javabin&version=2} {add=[133 (1413528979562823680)]} 0 15
[junit4:junit4]   2> 16123 T491 C33 P62806 REQ /update {update.distrib=FROMLEADER&distrib.from=http://127.0.0.1:39666/solr/collection1/&wt=javabin&version=2} status=0 QTime=1 
[junit4:junit4]   2> 16124 T469 C34 P39666 REQ /update {distrib.from=http://127.0.0.1:15812/solr/collection1/&update.distrib=TOLEADER&wt=javabin&version=2} status=0 QTime=5 
[junit4:junit4]   2> 16124 T481 C36 P15812 /update {wt=javabin&version=2} {add=[133]} 0 7
[junit4:junit4]   2> 16130 T453 C37 P32220 /update {wt=javabin&version=2} {add=[134 (1413528979592183808)]} 0 3
[junit4:junit4]   2> 16136 T505 C35 P53958 REQ /update {distrib.from=http://127.0.0.1:15812/solr/collection1/&update.distrib=FROMLEADER&wt=javabin&version=2} status=0 QTime=1 
[junit4:junit4]   2> 16136 T481 C36 P15812 /update {wt=javabin&version=2} {add=[134 (1413528979597426688)]} 0 4
[junit4:junit4]   2> 16140 T453 C37 P32220 /update {wt=javabin&version=2} {add=[135 (1413528979604766720)]} 0 1
[junit4:junit4]   2> 16149 T491 C33 P62806 REQ /update {update.distrib=FROMLEADER&distrib.from=http://127.0.0.1:39666/solr/collection1/&wt=javabin&version=2} status=0 QTime=1 
[junit4:junit4]   2> 16149 T469 C34 P39666 REQ /update {distrib.from=http://127.0.0.1:15812/solr/collection1/&update.distrib=TOLEADER&wt=javabin&version=2} status=0 QTime=4 
[junit4:junit4]   2> 16150 T481 C36 P15812 /update {wt=javabin&version=2} {add=[135]} 0 7
[junit4:junit4]   2> 16153 T453 C37 P32220 /update {wt=javabin&version=2} {add=[136 (1413528979618398208)]} 0 1
[junit4:junit4]   2> 16160 T505 C35 P53958 REQ /update {distrib.from=http://127.0.0.1:15812/solr/collection1/&update.distrib=FROMLEADER&wt=javabin&version=2} status=0 QTime=1 
[junit4:junit4]   2> 16160 T481 C36 P15812 /update {wt=javabin&version=2} {add=[136 (1413528979622592512)]} 0 4
[junit4:junit4]   2> 16164 T453 C37 P32220 /update {wt=javabin&version=2} {add=[137 (1413528979629932544)]} 0 1
[junit4:junit4]   2> 16171 T505 C35 P53958 REQ /update {distrib.from=http://127.0.0.1:15812/solr/collection1/&update.distrib=FROMLEADER&wt=javabin&version=2} status=0 QTime=1 
[junit4:junit4]   2> 16171 T481 C36 P15812 /update {wt=javabin&version=2} {add=[137 (1413528979634126848)]} 0 4
[junit4:junit4]   2> 16175 T453 C37 P32220 /update {wt=javabin&version=2} {add=[138 (1413528979641466880)]} 0 1
[junit4:junit4]   2> 16182 T491 C33 P62806 REQ /update {distrib.from=http://127.0.0.1:39666/solr/collection1/&update.distrib=FROMLEADER&wt=javabin&version=2} status=0 QTime=1 
[junit4:junit4]   2> 16183 T473 C34 P39666 /update {wt=javabin&version=2} {add=[138 (1413528979645661184)]} 0 5
[junit4:junit4]   2> 16186 T453 C37 P32220 /update {wt=javabin&version=2} {add=[139 (1413528979653001216)]} 0 1
[junit4:junit4]   2> 16192 T505 C35 P53958 REQ /update {distrib.from=http://127.0.0.1:15812/solr/collection1/&update.distrib=FROMLEADER&wt=javabin&version=2} status=0 QTime=1 
[junit4:junit4]   2> 16192 T481 C36 P15812 /update {wt=javabin&version=2} {add=[139 (1413528979656146944)]} 0 4
[junit4:junit4]   2> 16196 T453 C37 P32220 /update {wt=javabin&version=2} {add=[140 (1413528979663486976)]} 0 1
[junit4:junit4]   2> 16204 T505 C35 P53958 REQ /update {update.distrib=FROMLEADER&distrib.from=http://127.0.0.1:15812/solr/collection1/&wt=javabin&version=2} status=0 QTime=1 
[junit4:junit4]   2> 16204 T485 C36 P15812 REQ /update {distrib.from=http://127.0.0.1:39666/solr/collection1/&update.distrib=TOLEADER&wt=javabin&version=2} status=0 QTime=4 
[junit4:junit4]   2> 16205 T473 C34 P39666 /update {wt=javabin&version=2} {add=[140]} 0 7
[junit4:junit4]   2> 16208 T453 C37 P32220 /update {wt=javabin&version=2} {add=[141 (1413528979676069888)]} 0 1
[junit4:junit4]   2> 16216 T505 C35 P53958 REQ /update {update.distrib=FROMLEADER&distrib.from=http://127.0.0.1:15812/solr/collection1/&wt=javabin&version=2} status=0 QTime=1 
[junit4:junit4]   2> 16216 T485 C36 P15812 REQ /update {distrib.from=http://127.0.0.1:39666/solr/collection1/&update.distrib=TOLEADER&wt=javabin&version=2} status=0 QTime=4 
[junit4:junit4]   2> 16217 T473 C34 P39666 /update {wt=javabin&version=2} {add=[141]} 0 6
[junit4:junit4]   2> 16220 T453 C37 P32220 /update {wt=javabin&version=2} {add=[142 (1413528979688652800)]} 0 1
[junit4:junit4]   2> 16246 T505 C35 P53958 REQ /update {update.distrib=FROMLEADER&distrib.from=http://127.0.0.1:15812/solr/collection1/&wt=javabin&version=2} status=0 QTime=10 
[junit4:junit4]   2> 16247 T485 C36 P15812 REQ /update {distrib.from=http://127.0.0.1:39666/solr/collection1/&update.distrib=TOLEADER&wt=javabin&version=2} status=0 QTime=23 
[junit4:junit4]   2> 16247 T473 C34 P39666 /update {wt=javabin&version=2} {add=[142]} 0 25
[junit4:junit4]   2> 16263 T453 C37 P32220 /update {wt=javabin&version=2} {add=[143 (1413528979721158656)]} 0 13
[junit4:junit4]   2> 16271 T505 C35 P53958 REQ /update {distrib.from=http://127.0.0.1:15812/solr/collection1/&update.distrib=FROMLEADER&wt=javabin&version=2} status=0 QTime=2 
[junit4:junit4]   2> 16272 T481 C36 P15812 /update {wt=javabin&version=2} {add=[143 (1413528979736887296)]} 0 7
[junit4:junit4]   2> 16276 T453 C37 P32220 /update {wt=javabin&version=2} {add=[144 (1413528979746324480)]} 0 2
[junit4:junit4]   2> 16284 T505 C35 P53958 REQ /update {update.distrib=FROMLEADER&distrib.from=http://127.0.0.1:15812/solr/collection1/&wt=javabin&version=2} status=0 QTime=1 
[junit4:junit4]   2> 16284 T485 C36 P15812 REQ /update {distrib.from=http://127.0.0.1:39666/solr/collection1/&update.distrib=TOLEADER&wt=javabin&version=2} status=0 QTime=4 
[junit4:junit4]   2> 16285 T473 C34 P39666 /update {wt=javabin&version=2} {add=[144]} 0 7
[junit4:junit4]   2> 16288 T453 C37 P32220 /update {wt=javabin&version=2} {add=[145 (1413528979759955968)]} 0 1
[junit4:junit4]   2> 16294 T505 C35 P53958 REQ /update {distrib.from=http://127.0.0.1:15812/solr/collection1/&update.distrib=FROMLEADER&wt=javabin&version=2} status=0 QTime=1 
[junit4:junit4]   2> 16295 T481 C36 P15812 /update {wt=javabin&version=2} {add=[145 (1413528979763101696)]} 0 5
[junit4:junit4]   2> 16298 T453 C37 P32220 /update {wt=javabin&version=2} {add=[146 (1413528979770441728)]} 0 1
[junit4:junit4]   2> 16324 T491 C33 P62806 REQ /update {update.distrib=FROMLEADER&distrib.from=http://127.0.0.1:39666/solr/collection1/&wt=javabin&version=2} status=0 QTime=10 
[junit4:junit4]   2> 16325 T469 C34 P39666 REQ /update {distrib.from=http://127.0.0.1:15812/solr/collection1/&update.distrib=TOLEADER&wt=javabin&version=2} status=0 QTime=23 
[junit4:junit4]   2> 16326 T481 C36 P15812 /update {wt=javabin&version=2} {add=[146]} 0 26
[junit4:junit4]   2> 16329 T453 C37 P32220 /update {wt=javabin&version=2} {add=[147 (1413528979802947584)]} 0 1
[junit4:junit4]   2> 16337 T505 C35 P53958 REQ /update {update.distrib=FROMLEADER&distrib.from=http://127.0.0.1:15812/solr/collection1/&wt=javabin&version=2} status=0 QTime=1 
[junit4:junit4]   2> 16337 T485 C36 P15812 REQ /update {distrib.from=http://127.0.0.1:39666/solr/collection1/&update.distrib=TOLEADER&wt=javabin&version=2} status=0 QTime=4 
[junit4:junit4]   2> 16338 T473 C34 P39666 /update {wt=javabin&version=2} {add=[147]} 0 7
[junit4:junit4]   2> 16341 T453 C37 P32220 /update {wt=javabin&version=2} {add=[148 (1413528979815530496)]} 0 1
[junit4:junit4]   2> 16349 T491 C33 P62806 REQ /update {distrib.from=http://127.0.0.1:39666/solr/collection1/&update.distrib=FROMLEADER&wt=javabin&version=2} status=0 QTime=2 
[junit4:junit4]   2> 16350 T473 C34 P39666 /update {wt=javabin&version=2} {add=[148 (1413528979818676224)]} 0 7
[junit4:junit4]   2> 16354 T453 C37 P32220 /update {wt=javabin&version=2} {add=[149 (1413528979829161984)]} 0 1
[junit4:junit4]   2> 16362 T505 C35 P53958 REQ /update {update.distrib=FROMLEADER&distrib.from=http://127.0.0.1:15812/solr/collection1/&wt=javabin&version=2} status=0 QTime=1 
[junit4:junit4]   2> 16362 T485 C36 P15812 REQ /update {distrib.from=http://127.0.0.1:39666/solr/collection1/&update.distrib=TOLEADER&wt=javabin&version=2} status=0 QTime=4 
[junit4:junit4]   2> 16363 T473 C34 P39666 /update {wt=javabin&version=2} {add=[149]} 0 7
[junit4:junit4]   2> 16363 T441 oasc.AbstractDistribZkTestBase.waitForRecoveriesToFinish Wait for recoveries to finish - collection: collection1 failOnTimeout:true timeout (sec):1800
[junit4:junit4]   2> 16364 T441 oascc.ZkStateReader.updateClusterState Updating cloud state from ZooKeeper... 
[junit4:junit4]   2> 16367 T453 C37 P32220 oasu.DirectUpdateHandler2.commit start commit{flags=0,_version_=0,optimize=false,openSearcher=true,waitSearcher=true,expungeDeletes=false,softCommit=false}
[junit4:junit4]   2> 16867 T453 C37 P32220 oasc.SolrDeletionPolicy.onCommit SolrDeletionPolicy.onCommit: commits:num=2
[junit4:junit4]   2> 		commit{dir=/usr/home/hudson/hudson-slave/workspace/Lucene-Solr-Tests-trunk-Java6/solr/build/solr-core/test/J1/org.apache.solr.cloud.BasicDistributedZk2Test-1348046267211/control/data/index,segFN=segments_2,generation=2,filenames=[_0_Block_0.tip, _0_TestBloomFilteredLucene40Postings_0.tim, _0_Block_0.pos, _0_TestBloomFilteredLucene40Postings_0.blm, _0_TestBloomFilteredLucene40Postings_0.tip, _0.fnm, _0_Pulsing40_0.tim, _0_Block_0.doc, _0_Block_0.tim, _0_TestBloomFilteredLucene40Postings_0.prx, _0_nrm.cfs, _0_Pulsing40_0.prx, _0_Pulsing40_0.frq, _0_SimpleText_0.pst, _0_nrm.cfe, _0_Pulsing40_0.tip, segments_2, _0_TestBloomFilteredLucene40Postings_0.frq, _0.fdx, _0.si, _0.fdt]
[junit4:junit4]   2> 		commit{dir=/usr/home/hudson/hudson-slave/workspace/Lucene-Solr-Tests-trunk-Java6/solr/build/solr-core/test/J1/org.apache.solr.cloud.BasicDistributedZk2Test-1348046267211/control/data/index,segFN=segments_3,generation=3,filenames=[_4_TestBloomFilteredLucene40Postings_0.frq, _5_nrm.cfe, _2_Block_0.pos, _2_SimpleText_0.pst, _3_TestBloomFilteredLucene40Postings_0.prx, _2_TestBloomFilteredLucene40Postings_0.blm, _7.si, _7_TestBloomFilteredLucene40Postings_0.tip, _3.fdt, _0_Pulsing40_0.frq, _7_TestBloomFilteredLucene40Postings_0.tim, _7.fnm, _6_Block_0.pos, _0_SimpleText_0.pst, _0_TestBloomFilteredLucene40Postings_0.frq, _3_TestBloomFilteredLucene40Postings_0.frq, _1_Block_0.pos, _1_Block_0.tip, _3_TestBloomFilteredLucene40Postings_0.tim, _0_TestBloomFilteredLucene40Postings_0.blm, _0_Pulsing40_0.tim, _1_Block_0.tim, _2.fdt, _7.fdx, _3_TestBloomFilteredLucene40Postings_0.tip, _2.fdx, _7.fdt, _3_Block_0.pos, _5_TestBloomFilteredLucene40Postings_0.frq, _3_Block_0.doc, _1.fdx, _5_nrm.cfs, _1.fdt, _7_Block_0.pos, _3.si, _6.fdt, _3_TestBloomFilteredLucene40Postings_0.blm, _1_SimpleText_0.pst, _2.si, _2_Pulsing40_0.tim, _2_Block_0.tim, _6.fdx, _2_Pulsing40_0.tip, _2_Block_0.tip, _3.fnm, _5_Block_0.tim, _4_TestBloomFilteredLucene40Postings_0.prx, _2_nrm.cfe, _5_TestBloomFilteredLucene40Postings_0.blm, _0_Pulsing40_0.tip, _2_nrm.cfs, _5_Block_0.doc, _4_Block_0.pos, _2_TestBloomFilteredLucene40Postings_0.frq, _3_Block_0.tip, _4_TestBloomFilteredLucene40Postings_0.blm, _4_Block_0.tip, _2.fnm, _3.fdx, _1.si, _4_TestBloomFilteredLucene40Postings_0.tim, _6.si, _6.fnm, _4_TestBloomFilteredLucene40Postings_0.tip, _3_nrm.cfe, _0_Block_0.tip, _7_TestBloomFilteredLucene40Postings_0.blm, _5.fdt, _2_TestBloomFilteredLucene40Postings_0.prx, _1_Pulsing40_0.tip, _0_Block_0.tim, _1_Pulsing40_0.tim, _7_Block_0.tim, _4.fnm, _4_nrm.cfe, _7_Block_0.tip, _0_Pulsing40_0.prx, _1.fnm, _1_Pulsing40_0.frq, _4.fdx, _3_Block_0.tim, _3_SimpleText_0.pst, _1_Pulsing40_0.prx, _5_TestBloomFilteredLucene40Postings_0.prx, _1_Block_0.doc, _2_Pulsing40_0.prx, _2_TestBloomFilteredLucene40Postings_0.tim, _0_TestBloomFilteredLucene40Postings_0.tim, _0_TestBloomFilteredLucene40Postings_0.tip, _0.fnm, _4_Block_0.tim, _6_Block_0.doc, _1_TestBloomFilteredLucene40Postings_0.frq, _2_TestBloomFilteredLucene40Postings_0.tip, _2_Pulsing40_0.frq, _5.si, _3_nrm.cfs, _4_nrm.cfs, _5_Block_0.tip, _7_Block_0.doc, _0_Block_0.pos, _0_TestBloomFilteredLucene40Postings_0.prx, _1_TestBloomFilteredLucene40Postings_0.blm, _4_Block_0.doc, _1_TestBloomFilteredLucene40Postings_0.tip, _6_nrm.cfs, _7_nrm.cfs, _5_Block_0.pos, _6_TestBloomFilteredLucene40Postings_0.tip, _1_TestBloomFilteredLucene40Postings_0.tim, _0.si, _6_TestBloomFilteredLucene40Postings_0.tim, _6_TestBloomFilteredLucene40Postings_0.frq, _5_SimpleText_0.pst, _1_nrm.cfs, _5.fnm, _0_Block_0.doc, _1_TestBloomFilteredLucene40Postings_0.prx, _7_nrm.cfe, _6_nrm.cfe, _7_TestBloomFilteredLucene40Postings_0.frq, _0_nrm.cfs, _4.fdt, _4.si, _7_TestBloomFilteredLucene40Postings_0.prx, _6_SimpleText_0.pst, _1_nrm.cfe, _7_SimpleText_0.pst, _4_SimpleText_0.pst, _6_Block_0.tip, _0_nrm.cfe, _5.fdx, _6_TestBloomFilteredLucene40Postings_0.blm, _0.fdx, _6_TestBloomFilteredLucene40Postings_0.prx, _6_Block_0.tim, _5_TestBloomFilteredLucene40Postings_0.tim, _2_Block_0.doc, _5_TestBloomFilteredLucene40Postings_0.tip, segments_3, _0.fdt]
[junit4:junit4]   2> 16868 T453 C37 P32220 oasc.SolrDeletionPolicy.updateCommits newest commit = 3
[junit4:junit4]   2> 16939 T453 C37 P32220 oass.SolrIndexSearcher.<init> Opening Searcher

[...truncated too long message...]

equired.java:43)
[junit4:junit4]    > 	at org.apache.lucene.util.TestRuleMarkFailure$1.evaluate(TestRuleMarkFailure.java:48)
[junit4:junit4]    > 	at org.apache.lucene.util.TestRuleIgnoreAfterMaxFailures$1.evaluate(TestRuleIgnoreAfterMaxFailures.java:70)
[junit4:junit4]    > 	at org.apache.lucene.util.TestRuleIgnoreTestSuites$1.evaluate(TestRuleIgnoreTestSuites.java:55)
[junit4:junit4]    > 	at com.carrotsearch.randomizedtesting.rules.StatementAdapter.evaluate(StatementAdapter.java:36)
[junit4:junit4]    > 	at com.carrotsearch.randomizedtesting.ThreadLeakControl$StatementRunner.run(ThreadLeakControl.java:358)
[junit4:junit4]    > 	at java.lang.Thread.run(Thread.java:679)
[junit4:junit4]   2> 176764 T651 oas.SolrTestCaseJ4.deleteCore ###deleteCore
[junit4:junit4]   2> 180208 T725 oasc.SolrException.log SEVERE Errir checking for the number of election participants:org.apache.zookeeper.KeeperException$SessionExpiredException: KeeperErrorCode = Session expired for /collections/collection1/leader_elect/shard1/election
[junit4:junit4]   2> 		at org.apache.zookeeper.KeeperException.create(KeeperException.java:118)
[junit4:junit4]   2> 		at org.apache.zookeeper.KeeperException.create(KeeperException.java:42)
[junit4:junit4]   2> 		at org.apache.zookeeper.ZooKeeper.getChildren(ZooKeeper.java:1249)
[junit4:junit4]   2> 		at org.apache.solr.common.cloud.SolrZkClient$6.execute(SolrZkClient.java:278)
[junit4:junit4]   2> 		at org.apache.solr.common.cloud.SolrZkClient$6.execute(SolrZkClient.java:275)
[junit4:junit4]   2> 		at org.apache.solr.common.cloud.ZkCmdExecutor.retryOperation(ZkCmdExecutor.java:67)
[junit4:junit4]   2> 		at org.apache.solr.common.cloud.SolrZkClient.getChildren(SolrZkClient.java:275)
[junit4:junit4]   2> 		at org.apache.solr.cloud.ShardLeaderElectionContext.waitForReplicasToComeUp(ElectionContext.java:275)
[junit4:junit4]   2> 		at org.apache.solr.cloud.ShardLeaderElectionContext.runLeaderProcess(ElectionContext.java:142)
[junit4:junit4]   2> 		at org.apache.solr.cloud.LeaderElector.runIamLeaderProcess(LeaderElector.java:158)
[junit4:junit4]   2> 		at org.apache.solr.cloud.LeaderElector.checkIfIamLeader(LeaderElector.java:102)
[junit4:junit4]   2> 		at org.apache.solr.cloud.LeaderElector.joinElection(LeaderElector.java:275)
[junit4:junit4]   2> 		at org.apache.solr.cloud.ShardLeaderElectionContext.rejoinLeaderElection(ElectionContext.java:326)
[junit4:junit4]   2> 		at org.apache.solr.cloud.ShardLeaderElectionContext.runLeaderProcess(ElectionContext.java:159)
[junit4:junit4]   2> 		at org.apache.solr.cloud.LeaderElector.runIamLeaderProcess(LeaderElector.java:158)
[junit4:junit4]   2> 		at org.apache.solr.cloud.LeaderElector.checkIfIamLeader(LeaderElector.java:102)
[junit4:junit4]   2> 		at org.apache.solr.cloud.LeaderElector.access$000(LeaderElector.java:56)
[junit4:junit4]   2> 		at org.apache.solr.cloud.LeaderElector$1.process(LeaderElector.java:131)
[junit4:junit4]   2> 		at org.apache.zookeeper.ClientCnxn$EventThread.processEvent(ClientCnxn.java:526)
[junit4:junit4]   2> 		at org.apache.zookeeper.ClientCnxn$EventThread.run(ClientCnxn.java:502)
[junit4:junit4]   2> 	
[junit4:junit4]   2> 180208 T725 oasc.ShardLeaderElectionContext.waitForReplicasToComeUp Waiting until we see more replicas up: total=4 found=0 timeoutin=68959
[junit4:junit4]   2> 180710 T725 oasc.SolrCore.close [collection1]  CLOSING SolrCore org.apache.solr.core.SolrCore@73da4496
[junit4:junit4]   2> 180711 T725 oasc.SolrCore.closeSearcher [collection1] Closing main searcher on request.
[junit4:junit4]   2> 180712 T725 oasu.DirectUpdateHandler2.close closing DirectUpdateHandler2{commits=7,autocommits=0,soft autocommits=0,optimizes=0,rollbacks=0,expungeDeletes=0,docsPending=0,adds=0,deletesById=0,deletesByQuery=0,errors=0,cumulative_adds=5,cumulative_deletesById=0,cumulative_deletesByQuery=1,cumulative_errors=0}
[junit4:junit4]   2> 180712 T725 oasu.DefaultSolrCoreState.decref SolrCoreState ref count has reached 0 - closing IndexWriter
[junit4:junit4]   2> 180715 T725 oasu.DefaultSolrCoreState.decref Closing SolrCoreState - canceling any ongoing recovery
[junit4:junit4]   2> 180716 T725 oasc.LeaderElector$1.process WARNING  org.apache.zookeeper.KeeperException$SessionExpiredException: KeeperErrorCode = Session expired for /collections/collection1/leader_elect/shard1/election/88345583518613510-127.0.0.1:20260_solr_collection1-n_0000000016
[junit4:junit4]   2> 	at org.apache.zookeeper.KeeperException.create(KeeperException.java:118)
[junit4:junit4]   2> 	at org.apache.zookeeper.KeeperException.create(KeeperException.java:42)
[junit4:junit4]   2> 	at org.apache.zookeeper.ZooKeeper.delete(ZooKeeper.java:734)
[junit4:junit4]   2> 	at org.apache.solr.common.cloud.SolrZkClient$2.execute(SolrZkClient.java:178)
[junit4:junit4]   2> 	at org.apache.solr.common.cloud.SolrZkClient$2.execute(SolrZkClient.java:175)
[junit4:junit4]   2> 	at org.apache.solr.common.cloud.ZkCmdExecutor.retryOperation(ZkCmdExecutor.java:67)
[junit4:junit4]   2> 	at org.apache.solr.common.cloud.SolrZkClient.delete(SolrZkClient.java:175)
[junit4:junit4]   2> 	at org.apache.solr.cloud.ElectionContext.cancelElection(ElectionContext.java:60)
[junit4:junit4]   2> 	at org.apache.solr.cloud.ShardLeaderElectionContext.runLeaderProcess(ElectionContext.java:151)
[junit4:junit4]   2> 	at org.apache.solr.cloud.LeaderElector.runIamLeaderProcess(LeaderElector.java:158)
[junit4:junit4]   2> 	at org.apache.solr.cloud.LeaderElector.checkIfIamLeader(LeaderElector.java:102)
[junit4:junit4]   2> 	at org.apache.solr.cloud.LeaderElector.joinElection(LeaderElector.java:275)
[junit4:junit4]   2> 	at org.apache.solr.cloud.ShardLeaderElectionContext.rejoinLeaderElection(ElectionContext.java:326)
[junit4:junit4]   2> 	at org.apache.solr.cloud.ShardLeaderElectionContext.runLeaderProcess(ElectionContext.java:159)
[junit4:junit4]   2> 	at org.apache.solr.cloud.LeaderElector.runIamLeaderProcess(LeaderElector.java:158)
[junit4:junit4]   2> 	at org.apache.solr.cloud.LeaderElector.checkIfIamLeader(LeaderElector.java:102)
[junit4:junit4]   2> 	at org.apache.solr.cloud.LeaderElector.access$000(LeaderElector.java:56)
[junit4:junit4]   2> 	at org.apache.solr.cloud.LeaderElector$1.process(LeaderElector.java:131)
[junit4:junit4]   2> 	at org.apache.zookeeper.ClientCnxn$EventThread.processEvent(ClientCnxn.java:526)
[junit4:junit4]   2> 	at org.apache.zookeeper.ClientCnxn$EventThread.run(ClientCnxn.java:502)
[junit4:junit4]   2> 
[junit4:junit4]   2> 180716 T725 oascc.ZkStateReader$2.process A cluster state change has occurred - updating...
[junit4:junit4]   2> 180716 T725 oascc.ZkStateReader$2.process WARNING ZooKeeper watch triggered, but Solr cannot talk to ZK
[junit4:junit4]   2> 180716 T725 oascc.ConnectionManager.process Watcher org.apache.solr.common.cloud.ConnectionManager@6341683a name:ZooKeeperConnection Watcher:127.0.0.1:20230/solr got event WatchedEvent state:Disconnected type:None path:null path:null type:None
[junit4:junit4]   2> 180717 T725 oascc.ConnectionManager.process Client->ZooKeeper status change trigger but we are already closed
[junit4:junit4]   2> 180717 T725 oaz.ClientCnxn$EventThread.run EventThread shut down
[junit4:junit4]   2> NOTE: test params are: codec=Lucene40: {range_facet_l=MockVariableIntBlock(baseBlockSize=109), text=MockFixedIntBlock(blockSize=970), _version_=Pulsing40(freqCutoff=12 minBlockSize=78 maxBlockSize=164), rnd_b=PostingsFormat(name=TestBloomFilteredLucene40Postings), intDefault=Pulsing40(freqCutoff=12 minBlockSize=78 maxBlockSize=164), id=PostingsFormat(name=TestBloomFilteredLucene40Postings), timestamp=MockVariableIntBlock(baseBlockSize=109), a_t=MockVariableIntBlock(baseBlockSize=109), range_facet_sl=PostingsFormat(name=TestBloomFilteredLucene40Postings), range_facet_si=MockVariableIntBlock(baseBlockSize=109), other_tl1=Pulsing40(freqCutoff=12 minBlockSize=78 maxBlockSize=164), multiDefault=MockVariableIntBlock(baseBlockSize=109), a_si=Pulsing40(freqCutoff=12 minBlockSize=78 maxBlockSize=164)}, sim=DefaultSimilarity, locale=it, timezone=America/Iqaluit
[junit4:junit4]   2> NOTE: FreeBSD 9.0-RELEASE amd64/Sun Microsystems Inc. 1.6.0_32 (64-bit)/cpus=16,threads=1,free=64515688,total=144703488
[junit4:junit4]   2> NOTE: All tests run in this JVM: [TestHashPartitioner, TestFoldingMultitermQuery, PingRequestHandlerTest, PrimUtilsTest, TestPropInjectDefaults, TestArbitraryIndexDir, TestDistributedGrouping, TestReplicationHandler, ClusterStateUpdateTest, TestLRUCache, StandardRequestHandlerTest, SignatureUpdateProcessorFactoryTest, TestDFRSimilarityFactory, TestFunctionQuery, SolrIndexConfigTest, DebugComponentTest, TestPropInject, BasicDistributedZk2Test, TestRecovery, ScriptEngineTest, TestSort, TestReload, TermVectorComponentTest, TestUpdate, PathHierarchyTokenizerFactoryTest, SuggesterTest, PrimitiveFieldTypeTest, QueryParsingTest, DocumentBuilderTest, DocumentAnalysisRequestHandlerTest, SyncSliceTest]
[junit4:junit4] Completed on J1 in 180.79s, 1 test, 1 error <<< FAILURES!

[...truncated 402 lines...]
BUILD FAILED
/usr/home/hudson/hudson-slave/workspace/Lucene-Solr-Tests-trunk-Java6/build.xml:32: The following error occurred while executing this line:
/usr/home/hudson/hudson-slave/workspace/Lucene-Solr-Tests-trunk-Java6/solr/build.xml:146: The following error occurred while executing this line:
/usr/home/hudson/hudson-slave/workspace/Lucene-Solr-Tests-trunk-Java6/lucene/module-build.xml:63: The following error occurred while executing this line:
/usr/home/hudson/hudson-slave/workspace/Lucene-Solr-Tests-trunk-Java6/lucene/common-build.xml:1136: The following error occurred while executing this line:
/usr/home/hudson/hudson-slave/workspace/Lucene-Solr-Tests-trunk-Java6/lucene/common-build.xml:810: There were test failures: 230 suites, 950 tests, 1 error, 1 failure, 7 ignored (2 assumptions)

Total time: 30 minutes 53 seconds
Build step 'Invoke Ant' marked build as failure
Recording test results
Email was triggered for: Failure
Sending email for trigger: Failure



Mime
View raw message