lucene-dev mailing list archives

Site index · List index
Message view « Date » · « Thread »
Top « Date » · « Thread »
From Apache Jenkins Server <jenk...@builds.apache.org>
Subject [JENKINS-MAVEN] Lucene-Solr-Maven-trunk #619: POMs out of sync
Date Thu, 20 Sep 2012 17:41:37 GMT
Build: https://builds.apache.org/job/Lucene-Solr-Maven-trunk/619/

2 tests failed.
REGRESSION:  org.apache.solr.cloud.BasicDistributedZk2Test.testDistribSearch

Error Message:
Shard still reported as live in zk

Stack Trace:
java.lang.AssertionError: Shard still reported as live in zk
	at __randomizedtesting.SeedInfo.seed([3E689B61D313DC01:BF8E1579A44CBC3D]:0)
	at org.junit.Assert.fail(Assert.java:93)
	at org.apache.solr.cloud.AbstractFullDistribZkTestBase.waitToSeeNotLive(AbstractFullDistribZkTestBase.java:1220)
	at org.apache.solr.cloud.BasicDistributedZk2Test.brindDownShardIndexSomeDocsAndRecover(BasicDistributedZk2Test.java:190)
	at org.apache.solr.cloud.BasicDistributedZk2Test.doTest(BasicDistributedZk2Test.java:83)
	at org.apache.solr.BaseDistributedSearchTestCase.testDistribSearch(BaseDistributedSearchTestCase.java:695)
	at sun.reflect.NativeMethodAccessorImpl.invoke0(Native Method)
	at sun.reflect.NativeMethodAccessorImpl.invoke(NativeMethodAccessorImpl.java:57)
	at sun.reflect.DelegatingMethodAccessorImpl.invoke(DelegatingMethodAccessorImpl.java:43)
	at java.lang.reflect.Method.invoke(Method.java:616)
	at com.carrotsearch.randomizedtesting.RandomizedRunner.invoke(RandomizedRunner.java:1559)
	at com.carrotsearch.randomizedtesting.RandomizedRunner.access$600(RandomizedRunner.java:79)
	at com.carrotsearch.randomizedtesting.RandomizedRunner$6.evaluate(RandomizedRunner.java:737)
	at com.carrotsearch.randomizedtesting.RandomizedRunner$7.evaluate(RandomizedRunner.java:773)
	at com.carrotsearch.randomizedtesting.RandomizedRunner$8.evaluate(RandomizedRunner.java:787)
	at com.carrotsearch.randomizedtesting.rules.SystemPropertiesRestoreRule$1.evaluate(SystemPropertiesRestoreRule.java:53)
	at org.apache.lucene.util.TestRuleSetupTeardownChained$1.evaluate(TestRuleSetupTeardownChained.java:50)
	at org.apache.lucene.util.TestRuleFieldCacheSanity$1.evaluate(TestRuleFieldCacheSanity.java:51)
	at org.apache.lucene.util.AbstractBeforeAfterRule$1.evaluate(AbstractBeforeAfterRule.java:45)
	at com.carrotsearch.randomizedtesting.rules.SystemPropertiesInvariantRule$1.evaluate(SystemPropertiesInvariantRule.java:55)
	at org.apache.lucene.util.TestRuleThreadAndTestName$1.evaluate(TestRuleThreadAndTestName.java:48)
	at org.apache.lucene.util.TestRuleIgnoreAfterMaxFailures$1.evaluate(TestRuleIgnoreAfterMaxFailures.java:70)
	at org.apache.lucene.util.TestRuleMarkFailure$1.evaluate(TestRuleMarkFailure.java:48)
	at com.carrotsearch.randomizedtesting.rules.StatementAdapter.evaluate(StatementAdapter.java:36)
	at com.carrotsearch.randomizedtesting.ThreadLeakControl$StatementRunner.run(ThreadLeakControl.java:358)
	at com.carrotsearch.randomizedtesting.ThreadLeakControl.forkTimeoutingTask(ThreadLeakControl.java:782)
	at com.carrotsearch.randomizedtesting.ThreadLeakControl$3.evaluate(ThreadLeakControl.java:442)
	at com.carrotsearch.randomizedtesting.RandomizedRunner.runSingleTest(RandomizedRunner.java:746)
	at com.carrotsearch.randomizedtesting.RandomizedRunner$3.evaluate(RandomizedRunner.java:648)
	at com.carrotsearch.randomizedtesting.RandomizedRunner$4.evaluate(RandomizedRunner.java:682)
	at com.carrotsearch.randomizedtesting.RandomizedRunner$5.evaluate(RandomizedRunner.java:693)
	at com.carrotsearch.randomizedtesting.rules.StatementAdapter.evaluate(StatementAdapter.java:36)
	at com.carrotsearch.randomizedtesting.rules.SystemPropertiesRestoreRule$1.evaluate(SystemPropertiesRestoreRule.java:53)
	at org.apache.lucene.util.AbstractBeforeAfterRule$1.evaluate(AbstractBeforeAfterRule.java:45)
	at org.apache.lucene.util.TestRuleStoreClassName$1.evaluate(TestRuleStoreClassName.java:42)
	at com.carrotsearch.randomizedtesting.rules.SystemPropertiesInvariantRule$1.evaluate(SystemPropertiesInvariantRule.java:55)
	at com.carrotsearch.randomizedtesting.rules.NoShadowingOrOverridesOnMethodsRule$1.evaluate(NoShadowingOrOverridesOnMethodsRule.java:39)
	at com.carrotsearch.randomizedtesting.rules.NoShadowingOrOverridesOnMethodsRule$1.evaluate(NoShadowingOrOverridesOnMethodsRule.java:39)
	at com.carrotsearch.randomizedtesting.rules.StatementAdapter.evaluate(StatementAdapter.java:36)
	at org.apache.lucene.util.TestRuleAssertionsRequired$1.evaluate(TestRuleAssertionsRequired.java:43)
	at org.apache.lucene.util.TestRuleMarkFailure$1.evaluate(TestRuleMarkFailure.java:48)
	at org.apache.lucene.util.TestRuleIgnoreAfterMaxFailures$1.evaluate(TestRuleIgnoreAfterMaxFailures.java:70)
	at org.apache.lucene.util.TestRuleIgnoreTestSuites$1.evaluate(TestRuleIgnoreTestSuites.java:55)
	at com.carrotsearch.randomizedtesting.rules.StatementAdapter.evaluate(StatementAdapter.java:36)
	at com.carrotsearch.randomizedtesting.ThreadLeakControl$StatementRunner.run(ThreadLeakControl.java:358)
	at java.lang.Thread.run(Thread.java:679)


REGRESSION:  org.apache.solr.cloud.SyncSliceTest.testDistribSearch

Error Message:
No live SolrServers available to handle this request

Stack Trace:
org.apache.solr.client.solrj.SolrServerException: No live SolrServers available to handle this request
	at __randomizedtesting.SeedInfo.seed([37C28F39F26B2F4:829AA6EBE879D2C8]:0)
	at org.apache.solr.client.solrj.impl.LBHttpSolrServer.request(LBHttpSolrServer.java:323)
	at org.apache.solr.client.solrj.impl.CloudSolrServer.request(CloudSolrServer.java:257)
	at org.apache.solr.client.solrj.request.QueryRequest.process(QueryRequest.java:90)
	at org.apache.solr.client.solrj.SolrServer.query(SolrServer.java:324)
	at org.apache.solr.cloud.AbstractFullDistribZkTestBase.checkShardConsistency(AbstractFullDistribZkTestBase.java:909)
	at org.apache.solr.cloud.SyncSliceTest.doTest(SyncSliceTest.java:226)
	at org.apache.solr.BaseDistributedSearchTestCase.testDistribSearch(BaseDistributedSearchTestCase.java:695)
	at sun.reflect.NativeMethodAccessorImpl.invoke0(Native Method)
	at sun.reflect.NativeMethodAccessorImpl.invoke(NativeMethodAccessorImpl.java:57)
	at sun.reflect.DelegatingMethodAccessorImpl.invoke(DelegatingMethodAccessorImpl.java:43)
	at java.lang.reflect.Method.invoke(Method.java:616)
	at com.carrotsearch.randomizedtesting.RandomizedRunner.invoke(RandomizedRunner.java:1559)
	at com.carrotsearch.randomizedtesting.RandomizedRunner.access$600(RandomizedRunner.java:79)
	at com.carrotsearch.randomizedtesting.RandomizedRunner$6.evaluate(RandomizedRunner.java:737)
	at com.carrotsearch.randomizedtesting.RandomizedRunner$7.evaluate(RandomizedRunner.java:773)
	at com.carrotsearch.randomizedtesting.RandomizedRunner$8.evaluate(RandomizedRunner.java:787)
	at com.carrotsearch.randomizedtesting.rules.SystemPropertiesRestoreRule$1.evaluate(SystemPropertiesRestoreRule.java:53)
	at org.apache.lucene.util.TestRuleSetupTeardownChained$1.evaluate(TestRuleSetupTeardownChained.java:50)
	at org.apache.lucene.util.TestRuleFieldCacheSanity$1.evaluate(TestRuleFieldCacheSanity.java:51)
	at org.apache.lucene.util.AbstractBeforeAfterRule$1.evaluate(AbstractBeforeAfterRule.java:45)
	at com.carrotsearch.randomizedtesting.rules.SystemPropertiesInvariantRule$1.evaluate(SystemPropertiesInvariantRule.java:55)
	at org.apache.lucene.util.TestRuleThreadAndTestName$1.evaluate(TestRuleThreadAndTestName.java:48)
	at org.apache.lucene.util.TestRuleIgnoreAfterMaxFailures$1.evaluate(TestRuleIgnoreAfterMaxFailures.java:70)
	at org.apache.lucene.util.TestRuleMarkFailure$1.evaluate(TestRuleMarkFailure.java:48)
	at com.carrotsearch.randomizedtesting.rules.StatementAdapter.evaluate(StatementAdapter.java:36)
	at com.carrotsearch.randomizedtesting.ThreadLeakControl$StatementRunner.run(ThreadLeakControl.java:358)
	at com.carrotsearch.randomizedtesting.ThreadLeakControl.forkTimeoutingTask(ThreadLeakControl.java:782)
	at com.carrotsearch.randomizedtesting.ThreadLeakControl$3.evaluate(ThreadLeakControl.java:442)
	at com.carrotsearch.randomizedtesting.RandomizedRunner.runSingleTest(RandomizedRunner.java:746)
	at com.carrotsearch.randomizedtesting.RandomizedRunner$3.evaluate(RandomizedRunner.java:648)
	at com.carrotsearch.randomizedtesting.RandomizedRunner$4.evaluate(RandomizedRunner.java:682)
	at com.carrotsearch.randomizedtesting.RandomizedRunner$5.evaluate(RandomizedRunner.java:693)
	at com.carrotsearch.randomizedtesting.rules.StatementAdapter.evaluate(StatementAdapter.java:36)
	at com.carrotsearch.randomizedtesting.rules.SystemPropertiesRestoreRule$1.evaluate(SystemPropertiesRestoreRule.java:53)
	at org.apache.lucene.util.AbstractBeforeAfterRule$1.evaluate(AbstractBeforeAfterRule.java:45)
	at org.apache.lucene.util.TestRuleStoreClassName$1.evaluate(TestRuleStoreClassName.java:42)
	at com.carrotsearch.randomizedtesting.rules.SystemPropertiesInvariantRule$1.evaluate(SystemPropertiesInvariantRule.java:55)
	at com.carrotsearch.randomizedtesting.rules.NoShadowingOrOverridesOnMethodsRule$1.evaluate(NoShadowingOrOverridesOnMethodsRule.java:39)
	at com.carrotsearch.randomizedtesting.rules.NoShadowingOrOverridesOnMethodsRule$1.evaluate(NoShadowingOrOverridesOnMethodsRule.java:39)
	at com.carrotsearch.randomizedtesting.rules.StatementAdapter.evaluate(StatementAdapter.java:36)
	at org.apache.lucene.util.TestRuleAssertionsRequired$1.evaluate(TestRuleAssertionsRequired.java:43)
	at org.apache.lucene.util.TestRuleMarkFailure$1.evaluate(TestRuleMarkFailure.java:48)
	at org.apache.lucene.util.TestRuleIgnoreAfterMaxFailures$1.evaluate(TestRuleIgnoreAfterMaxFailures.java:70)
	at org.apache.lucene.util.TestRuleIgnoreTestSuites$1.evaluate(TestRuleIgnoreTestSuites.java:55)
	at com.carrotsearch.randomizedtesting.rules.StatementAdapter.evaluate(StatementAdapter.java:36)
	at com.carrotsearch.randomizedtesting.ThreadLeakControl$StatementRunner.run(ThreadLeakControl.java:358)
	at java.lang.Thread.run(Thread.java:679)




Build Log:
[...truncated 3351 lines...]
      [mvn] 1234 T3 oasc.SolrCore.finalize SEVERE REFCOUNT ERROR: unreferenced org.apache.solr.core.SolrCore@1ded246d (collection1) has a reference count of 1
      [mvn] 1235 T3 oasc.CoreContainer.finalize SEVERE CoreContainer was not shutdown prior to finalize(), indicates a bug -- POSSIBLE RESOURCE LEAK!!!  instance=653618388
      [mvn] 1364 T102 oasup.StatelessScriptUpdateProcessorFactory.inform SEVERE Unable to initialize scripts: Unable to evaluate script: currency.xml Ignoring exception matching \Qcurrency.xml\E
      [mvn] Creating dataDir: /usr/home/hudson/hudson-slave/workspace/Lucene-Solr-Maven-trunk/maven-build/solr/core/src/test/target/test/./solrtest-TestBadConfig-1348161274107
      [mvn] 1512 T3 oasc.CoreContainer.finalize SEVERE CoreContainer was not shutdown prior to finalize(), indicates a bug -- POSSIBLE RESOURCE LEAK!!!  instance=265591894
      [mvn] 1633 T102 oasup.StatelessScriptUpdateProcessorFactory.inform SEVERE Unable to initialize scripts: Unable to evaluate script: a-file-name-that-does-not-exist.js Ignoring exception matching \Qa-file-name-that-does-not-exist.js\E
      [mvn] Tests run: 6, Failures: 0, Errors: 0, Skipped: 0, Time elapsed: 1.663 sec
      [mvn] Running org.apache.solr.schema.MultiTermTest
      [mvn] Creating dataDir: /usr/home/hudson/hudson-slave/workspace/Lucene-Solr-Maven-trunk/maven-build/solr/core/src/test/target/test/./solrtest-MultiTermTest-1348161274388
      [mvn] 87 T3 oasc.CoreContainer.finalize SEVERE CoreContainer was not shutdown prior to finalize(), indicates a bug -- POSSIBLE RESOURCE LEAK!!!  instance=1032546686
      [mvn] Tests run: 3, Failures: 0, Errors: 0, Skipped: 0, Time elapsed: 0.17 sec
      [mvn] Running org.apache.solr.AnalysisAfterCoreReloadTest
      [mvn] Tests run: 1, Failures: 0, Errors: 0, Skipped: 0, Time elapsed: 1.659 sec
      [mvn] Running org.apache.solr.search.similarities.TestLMJelinekMercerSimilarityFactory
      [mvn] Creating dataDir: /usr/home/hudson/hudson-slave/workspace/Lucene-Solr-Maven-trunk/maven-build/solr/core/src/test/target/test/./solrtest-TestLMJelinekMercerSimilarityFactory-1348161276224
      [mvn] Tests run: 2, Failures: 0, Errors: 0, Skipped: 0, Time elapsed: 0.109 sec
      [mvn] Running org.apache.solr.handler.DocumentAnalysisRequestHandlerTest
      [mvn] Creating dataDir: /usr/home/hudson/hudson-slave/workspace/Lucene-Solr-Maven-trunk/maven-build/solr/core/src/test/target/test/./solrtest-DocumentAnalysisRequestHandlerTest-1348161276339
      [mvn] Tests run: 4, Failures: 0, Errors: 0, Skipped: 0, Time elapsed: 0.583 sec
      [mvn] Running org.apache.solr.update.processor.StatelessScriptUpdateProcessorFactoryTest
      [mvn] Creating dataDir: /usr/home/hudson/hudson-slave/workspace/Lucene-Solr-Maven-trunk/maven-build/solr/core/src/test/target/test/./solrtest-StatelessScriptUpdateProcessorFactoryTest-1348161276923
      [mvn] Tests run: 7, Failures: 0, Errors: 0, Skipped: 0, Time elapsed: 1.277 sec
      [mvn] Running org.apache.solr.handler.XmlUpdateRequestHandlerTest
      [mvn] Creating dataDir: /usr/home/hudson/hudson-slave/workspace/Lucene-Solr-Maven-trunk/maven-build/solr/core/src/test/target/test/./solrtest-XmlUpdateRequestHandlerTest-1348161278192
      [mvn] Tests run: 3, Failures: 0, Errors: 0, Skipped: 0, Time elapsed: 0.392 sec
      [mvn] Running org.apache.solr.schema.IndexSchemaTest
      [mvn] Creating dataDir: /usr/home/hudson/hudson-slave/workspace/Lucene-Solr-Maven-trunk/maven-build/solr/core/src/test/target/test/./solrtest-IndexSchemaTest-1348161278582
      [mvn] Tests run: 3, Failures: 0, Errors: 0, Skipped: 0, Time elapsed: 0.406 sec
      [mvn] Running org.apache.solr.EchoParamsTest
      [mvn] Creating dataDir: /usr/home/hudson/hudson-slave/workspace/Lucene-Solr-Maven-trunk/maven-build/solr/core/src/test/target/test/./solrtest-EchoParamsTest-1348161278993
      [mvn] Tests run: 1, Failures: 0, Errors: 0, Skipped: 0, Time elapsed: 0.127 sec
      [mvn] Running org.apache.solr.search.TestExtendedDismaxParser
      [mvn] Tests run: 10, Failures: 0, Errors: 0, Skipped: 0, Time elapsed: 6.275 sec
      [mvn] Running org.apache.solr.schema.DateFieldTest
      [mvn] Tests run: 8, Failures: 0, Errors: 0, Skipped: 1, Time elapsed: 0.047 sec
      [mvn] Running org.apache.solr.analysis.TestWordDelimiterFilterFactory
      [mvn] Creating dataDir: /usr/home/hudson/hudson-slave/workspace/Lucene-Solr-Maven-trunk/maven-build/solr/core/src/test/target/test/./solrtest-TestWordDelimiterFilterFactory-1348161285449
      [mvn] Tests run: 7, Failures: 0, Errors: 0, Skipped: 0, Time elapsed: 1.138 sec
      [mvn] Running org.apache.solr.update.processor.FieldMutatingUpdateProcessorTest
      [mvn] Creating dataDir: /usr/home/hudson/hudson-slave/workspace/Lucene-Solr-Maven-trunk/maven-build/solr/core/src/test/target/test/./solrtest-FieldMutatingUpdateProcessorTest-1348161286590
      [mvn] Tests run: 26, Failures: 0, Errors: 0, Skipped: 0, Time elapsed: 0.64 sec
      [mvn] Running org.apache.solr.analysis.LegacyHTMLStripCharFilterTest
      [mvn] Tests run: 13, Failures: 0, Errors: 0, Skipped: 1, Time elapsed: 0.237 sec
      [mvn] Running org.apache.solr.handler.component.DistributedQueryElevationComponentTest
      [mvn] Tests run: 1, Failures: 0, Errors: 0, Skipped: 0, Time elapsed: 1.223 sec
      [mvn] Running org.apache.solr.cloud.FullSolrCloudDistribCmdsTest
      [mvn] Creating dataDir: /usr/home/hudson/hudson-slave/workspace/Lucene-Solr-Maven-trunk/maven-build/solr/core/src/test/target/test/./solrtest-FullSolrCloudDistribCmdsTest-1348161288703
      [mvn] ASYNC  NEW_CORE C0 name=collection1 org.apache.solr.core.SolrCore@ae13409 url=http://127.0.0.1:37008/solr/collection1 node=127.0.0.1:37008_solr
      [mvn] 90755 T258 C0 P37008 oasc.SolrException.log SEVERE forwarding update to http://127.0.0.1:37013/solr/collection1/ failed - retrying ... 
      [mvn] 90810 T258 C0 P37008 oasc.SolrException.log SEVERE null:org.eclipse.jetty.io.EofException
      [mvn] 		at org.eclipse.jetty.server.HttpOutput.write(HttpOutput.java:154)
      [mvn] 		at org.eclipse.jetty.server.HttpOutput.write(HttpOutput.java:101)
      [mvn] 		at org.apache.solr.common.util.FastOutputStream.flush(FastOutputStream.java:204)
      [mvn] 		at org.apache.solr.common.util.FastOutputStream.flushBuffer(FastOutputStream.java:197)
      [mvn] 		at org.apache.solr.common.util.JavaBinCodec.marshal(JavaBinCodec.java:94)
      [mvn] 		at org.apache.solr.response.BinaryResponseWriter.write(BinaryResponseWriter.java:51)
      [mvn] 		at org.apache.solr.servlet.SolrDispatchFilter.writeResponse(SolrDispatchFilter.java:404)
      [mvn] 		at org.apache.solr.servlet.SolrDispatchFilter.doFilter(SolrDispatchFilter.java:289)
      [mvn] 		at org.eclipse.jetty.servlet.ServletHandler$CachedChain.doFilter(ServletHandler.java:1337)
      [mvn] 		at org.eclipse.jetty.servlet.ServletHandler.doHandle(ServletHandler.java:484)
      [mvn] 		at org.eclipse.jetty.server.session.SessionHandler.doHandle(SessionHandler.java:231)
      [mvn] 		at org.eclipse.jetty.server.handler.ScopedHandler.handle(ScopedHandler.java:119)
      [mvn] 		at org.eclipse.jetty.server.handler.GzipHandler.handle(GzipHandler.java:267)
      [mvn] 		at org.eclipse.jetty.server.handler.ContextHandler.doHandle(ContextHandler.java:1067)
      [mvn] 		at org.eclipse.jetty.servlet.ServletHandler.doScope(ServletHandler.java:413)
      [mvn] 		at org.eclipse.jetty.server.session.SessionHandler.doScope(SessionHandler.java:192)
      [mvn] 		at org.eclipse.jetty.server.handler.ContextHandler.doScope(ContextHandler.java:999)
      [mvn] 		at org.eclipse.jetty.server.handler.ScopedHandler.handle(ScopedHandler.java:117)
      [mvn] 		at org.eclipse.jetty.server.handler.HandlerWrapper.handle(HandlerWrapper.java:111)
      [mvn] 		at org.eclipse.jetty.server.Server.handle(Server.java:351)
      [mvn] 		at org.eclipse.jetty.server.AbstractHttpConnection.handleRequest(AbstractHttpConnection.java:454)
      [mvn] 		at org.eclipse.jetty.server.BlockingHttpConnection.handleRequest(BlockingHttpConnection.java:47)
      [mvn] 		at org.eclipse.jetty.server.AbstractHttpConnection.content(AbstractHttpConnection.java:900)
      [mvn] 		at org.eclipse.jetty.server.AbstractHttpConnection$RequestHandler.content(AbstractHttpConnection.java:954)
      [mvn] 		at org.eclipse.jetty.http.HttpParser.parseNext(HttpParser.java:952)
      [mvn] 		at org.eclipse.jetty.http.HttpParser.parseAvailable(HttpParser.java:235)
      [mvn] 		at org.eclipse.jetty.server.BlockingHttpConnection.handle(BlockingHttpConnection.java:66)
      [mvn] 		at org.eclipse.jetty.server.bio.SocketConnector$ConnectorEndPoint.run(SocketConnector.java:254)
      [mvn] 		at org.eclipse.jetty.util.thread.QueuedThreadPool.runJob(QueuedThreadPool.java:599)
      [mvn] 		at org.eclipse.jetty.util.thread.QueuedThreadPool$3.run(QueuedThreadPool.java:534)
      [mvn] 		at java.lang.Thread.run(Thread.java:679)
      [mvn] 	
      [mvn] 90811 T258 C0 P37008 oasc.SolrException.log SEVERE null:org.eclipse.jetty.io.EofException
      [mvn] 		at org.eclipse.jetty.server.HttpOutput.write(HttpOutput.java:154)
      [mvn] 		at org.eclipse.jetty.server.HttpOutput.write(HttpOutput.java:101)
      [mvn] 		at org.apache.solr.common.util.FastOutputStream.flush(FastOutputStream.java:204)
      [mvn] 		at org.apache.solr.common.util.FastOutputStream.flushBuffer(FastOutputStream.java:197)
      [mvn] 		at org.apache.solr.common.util.JavaBinCodec.marshal(JavaBinCodec.java:94)
      [mvn] 		at org.apache.solr.response.BinaryResponseWriter.write(BinaryResponseWriter.java:51)
      [mvn] 		at org.apache.solr.servlet.SolrDispatchFilter.writeResponse(SolrDispatchFilter.java:404)
      [mvn] 		at org.apache.solr.servlet.SolrDispatchFilter.doFilter(SolrDispatchFilter.java:289)
      [mvn] 		at org.eclipse.jetty.servlet.ServletHandler$CachedChain.doFilter(ServletHandler.java:1337)
      [mvn] 		at org.eclipse.jetty.servlet.ServletHandler.doHandle(ServletHandler.java:484)
      [mvn] 		at org.eclipse.jetty.server.session.SessionHandler.doHandle(SessionHandler.java:231)
      [mvn] 		at org.eclipse.jetty.server.handler.ScopedHandler.handle(ScopedHandler.java:119)
      [mvn] 		at org.eclipse.jetty.server.handler.GzipHandler.handle(GzipHandler.java:267)
      [mvn] 		at org.eclipse.jetty.server.handler.ContextHandler.doHandle(ContextHandler.java:1067)
      [mvn] 		at org.eclipse.jetty.servlet.ServletHandler.doScope(ServletHandler.java:413)
      [mvn] 		at org.eclipse.jetty.server.session.SessionHandler.doScope(SessionHandler.java:192)
      [mvn] 		at org.eclipse.jetty.server.handler.ContextHandler.doScope(ContextHandler.java:999)
      [mvn] 		at org.eclipse.jetty.server.handler.ScopedHandler.handle(ScopedHandler.java:117)
      [mvn] 		at org.eclipse.jetty.server.handler.HandlerWrapper.handle(HandlerWrapper.java:111)
      [mvn] 		at org.eclipse.jetty.server.Server.handle(Server.java:351)
      [mvn] 		at org.eclipse.jetty.server.AbstractHttpConnection.handleRequest(AbstractHttpConnection.java:454)
      [mvn] 		at org.eclipse.jetty.server.BlockingHttpConnection.handleRequest(BlockingHttpConnection.java:47)
      [mvn] 		at org.eclipse.jetty.server.AbstractHttpConnection.content(AbstractHttpConnection.java:900)
      [mvn] 		at org.eclipse.jetty.server.AbstractHttpConnection$RequestHandler.content(AbstractHttpConnection.java:954)
      [mvn] 		at org.eclipse.jetty.http.HttpParser.parseNext(HttpParser.java:952)
      [mvn] 		at org.eclipse.jetty.http.HttpParser.parseAvailable(HttpParser.java:235)
      [mvn] 		at org.eclipse.jetty.server.BlockingHttpConnection.handle(BlockingHttpConnection.java:66)
      [mvn] 		at org.eclipse.jetty.server.bio.SocketConnector$ConnectorEndPoint.run(SocketConnector.java:254)
      [mvn] 		at org.eclipse.jetty.util.thread.QueuedThreadPool.runJob(QueuedThreadPool.java:599)
      [mvn] 		at org.eclipse.jetty.util.thread.QueuedThreadPool$3.run(QueuedThreadPool.java:534)
      [mvn] 		at java.lang.Thread.run(Thread.java:679)
      [mvn] 	
      [mvn] ASYNC  NEW_CORE C1 name=collection1 org.apache.solr.core.SolrCore@2db9ec6c url=http://127.0.0.1:37018/solr/collection1 node=127.0.0.1:37018_solr
      [mvn] 110757 T283 C1 P37018 oasc.SolrException.log SEVERE forwarding update to http://127.0.0.1:37013/solr/collection1/ failed - retrying ... 
      [mvn] 110813 T283 C1 P37018 oasc.SolrException.log SEVERE null:org.eclipse.jetty.io.EofException
      [mvn] 		at org.eclipse.jetty.server.HttpOutput.write(HttpOutput.java:154)
      [mvn] 		at org.eclipse.jetty.server.HttpOutput.write(HttpOutput.java:101)
      [mvn] 		at org.apache.solr.common.util.FastOutputStream.flush(FastOutputStream.java:204)
      [mvn] 		at org.apache.solr.common.util.FastOutputStream.flushBuffer(FastOutputStream.java:197)
      [mvn] 		at org.apache.solr.common.util.JavaBinCodec.marshal(JavaBinCodec.java:94)
      [mvn] 		at org.apache.solr.response.BinaryResponseWriter.write(BinaryResponseWriter.java:51)
      [mvn] 		at org.apache.solr.servlet.SolrDispatchFilter.writeResponse(SolrDispatchFilter.java:404)
      [mvn] 		at org.apache.solr.servlet.SolrDispatchFilter.doFilter(SolrDispatchFilter.java:289)
      [mvn] 		at org.eclipse.jetty.servlet.ServletHandler$CachedChain.doFilter(ServletHandler.java:1337)
      [mvn] 		at org.eclipse.jetty.servlet.ServletHandler.doHandle(ServletHandler.java:484)
      [mvn] 		at org.eclipse.jetty.server.session.SessionHandler.doHandle(SessionHandler.java:231)
      [mvn] 		at org.eclipse.jetty.server.handler.ScopedHandler.handle(ScopedHandler.java:119)
      [mvn] 		at org.eclipse.jetty.server.handler.GzipHandler.handle(GzipHandler.java:267)
      [mvn] 		at org.eclipse.jetty.server.handler.ContextHandler.doHandle(ContextHandler.java:1067)
      [mvn] 		at org.eclipse.jetty.servlet.ServletHandler.doScope(ServletHandler.java:413)
      [mvn] 		at org.eclipse.jetty.server.session.SessionHandler.doScope(SessionHandler.java:192)
      [mvn] 		at org.eclipse.jetty.server.handler.ContextHandler.doScope(ContextHandler.java:999)
      [mvn] 		at org.eclipse.jetty.server.handler.ScopedHandler.handle(ScopedHandler.java:117)
      [mvn] 		at org.eclipse.jetty.server.handler.HandlerWrapper.handle(HandlerWrapper.java:111)
      [mvn] 		at org.eclipse.jetty.server.Server.handle(Server.java:351)
      [mvn] 		at org.eclipse.jetty.server.AbstractHttpConnection.handleRequest(AbstractHttpConnection.java:454)
      [mvn] 		at org.eclipse.jetty.server.BlockingHttpConnection.handleRequest(BlockingHttpConnection.java:47)
      [mvn] 		at org.eclipse.jetty.server.AbstractHttpConnection.content(AbstractHttpConnection.java:900)
      [mvn] 		at org.eclipse.jetty.server.AbstractHttpConnection$RequestHandler.content(AbstractHttpConnection.java:954)
      [mvn] 		at org.eclipse.jetty.http.HttpParser.parseNext(HttpParser.java:952)
      [mvn] 		at org.eclipse.jetty.http.HttpParser.parseAvailable(HttpParser.java:235)
      [mvn] 		at org.eclipse.jetty.server.BlockingHttpConnection.handle(BlockingHttpConnection.java:66)
      [mvn] 		at org.eclipse.jetty.server.bio.SocketConnector$ConnectorEndPoint.run(SocketConnector.java:254)
      [mvn] 		at org.eclipse.jetty.util.thread.QueuedThreadPool.runJob(QueuedThreadPool.java:599)
      [mvn] 		at org.eclipse.jetty.util.thread.QueuedThreadPool$3.run(QueuedThreadPool.java:534)
      [mvn] 		at java.lang.Thread.run(Thread.java:679)
      [mvn] 	
      [mvn] 110814 T283 C1 P37018 oasc.SolrException.log SEVERE null:org.eclipse.jetty.io.EofException
      [mvn] 		at org.eclipse.jetty.server.HttpOutput.write(HttpOutput.java:154)
      [mvn] 		at org.eclipse.jetty.server.HttpOutput.write(HttpOutput.java:101)
      [mvn] 		at org.apache.solr.common.util.FastOutputStream.flush(FastOutputStream.java:204)
      [mvn] 		at org.apache.solr.common.util.FastOutputStream.flushBuffer(FastOutputStream.java:197)
      [mvn] 		at org.apache.solr.common.util.JavaBinCodec.marshal(JavaBinCodec.java:94)
      [mvn] 		at org.apache.solr.response.BinaryResponseWriter.write(BinaryResponseWriter.java:51)
      [mvn] 		at org.apache.solr.servlet.SolrDispatchFilter.writeResponse(SolrDispatchFilter.java:404)
      [mvn] 		at org.apache.solr.servlet.SolrDispatchFilter.doFilter(SolrDispatchFilter.java:289)
      [mvn] 		at org.eclipse.jetty.servlet.ServletHandler$CachedChain.doFilter(ServletHandler.java:1337)
      [mvn] 		at org.eclipse.jetty.servlet.ServletHandler.doHandle(ServletHandler.java:484)
      [mvn] 		at org.eclipse.jetty.server.session.SessionHandler.doHandle(SessionHandler.java:231)
      [mvn] 		at org.eclipse.jetty.server.handler.ScopedHandler.handle(ScopedHandler.java:119)
      [mvn] 		at org.eclipse.jetty.server.handler.GzipHandler.handle(GzipHandler.java:267)
      [mvn] 		at org.eclipse.jetty.server.handler.ContextHandler.doHandle(ContextHandler.java:1067)
      [mvn] 		at org.eclipse.jetty.servlet.ServletHandler.doScope(ServletHandler.java:413)
      [mvn] 		at org.eclipse.jetty.server.session.SessionHandler.doScope(SessionHandler.java:192)
      [mvn] 		at org.eclipse.jetty.server.handler.ContextHandler.doScope(ContextHandler.java:999)
      [mvn] 		at org.eclipse.jetty.server.handler.ScopedHandler.handle(ScopedHandler.java:117)
      [mvn] 		at org.eclipse.jetty.server.handler.HandlerWrapper.handle(HandlerWrapper.java:111)
      [mvn] 		at org.eclipse.jetty.server.Server.handle(Server.java:351)
      [mvn] 		at org.eclipse.jetty.server.AbstractHttpConnection.handleRequest(AbstractHttpConnection.java:454)
      [mvn] 		at org.eclipse.jetty.server.BlockingHttpConnection.handleRequest(BlockingHttpConnection.java:47)
      [mvn] 		at org.eclipse.jetty.server.AbstractHttpConnection.content(AbstractHttpConnection.java:900)
      [mvn] 		at org.eclipse.jetty.server.AbstractHttpConnection$RequestHandler.content(AbstractHttpConnection.java:954)
      [mvn] 		at org.eclipse.jetty.http.HttpParser.parseNext(HttpParser.java:952)
      [mvn] 		at org.eclipse.jetty.http.HttpParser.parseAvailable(HttpParser.java:235)
      [mvn] 		at org.eclipse.jetty.server.BlockingHttpConnection.handle(BlockingHttpConnection.java:66)
      [mvn] 		at org.eclipse.jetty.server.bio.SocketConnector$ConnectorEndPoint.run(SocketConnector.java:254)
      [mvn] 		at org.eclipse.jetty.util.thread.QueuedThreadPool.runJob(QueuedThreadPool.java:599)
      [mvn] 		at org.eclipse.jetty.util.thread.QueuedThreadPool$3.run(QueuedThreadPool.java:534)
      [mvn] 		at java.lang.Thread.run(Thread.java:679)
      [mvn] 	
      [mvn] 120798 T290 oasc.SolrException.log SEVERE Sync Failed
      [mvn] Tests run: 1, Failures: 0, Errors: 0, Skipped: 0, Time elapsed: 120.972 sec
      [mvn] Running org.apache.solr.update.processor.ScriptEngineTest
      [mvn] Tests run: 6, Failures: 0, Errors: 0, Skipped: 1, Time elapsed: 0.079 sec
      [mvn] Running org.apache.solr.core.TestCoreContainer
      [mvn] Creating dataDir: /usr/home/hudson/hudson-slave/workspace/Lucene-Solr-Maven-trunk/maven-build/solr/core/src/test/target/test/./solrtest-TestCoreContainer-1348161409744
      [mvn] Tests run: 3, Failures: 0, Errors: 0, Skipped: 0, Time elapsed: 3.053 sec
      [mvn] Running org.apache.solr.handler.MoreLikeThisHandlerTest
      [mvn] Creating dataDir: /usr/home/hudson/hudson-slave/workspace/Lucene-Solr-Maven-trunk/maven-build/solr/core/src/test/target/test/./solrtest-MoreLikeThisHandlerTest-1348161412798
      [mvn] Tests run: 1, Failures: 0, Errors: 0, Skipped: 0, Time elapsed: 0.597 sec
      [mvn] Running org.apache.solr.handler.component.SearchHandlerTest
      [mvn] Creating dataDir: /usr/home/hudson/hudson-slave/workspace/Lucene-Solr-Maven-trunk/maven-build/solr/core/src/test/target/test/./solrtest-SearchHandlerTest-1348161413390
      [mvn] Tests run: 1, Failures: 0, Errors: 0, Skipped: 0, Time elapsed: 0.395 sec
      [mvn] Running org.apache.solr.core.SolrCoreTest
      [mvn] Creating dataDir: /usr/home/hudson/hudson-slave/workspace/Lucene-Solr-Maven-trunk/maven-build/solr/core/src/test/target/test/./solrtest-SolrCoreTest-1348161413789
      [mvn] Creating dataDir: /usr/home/hudson/hudson-slave/workspace/Lucene-Solr-Maven-trunk/maven-build/solr/core/src/test/target/test/./solrtest-SolrCoreTest-1348161414144
      [mvn] Creating dataDir: /usr/home/hudson/hudson-slave/workspace/Lucene-Solr-Maven-trunk/maven-build/solr/core/src/test/target/test/./solrtest-SolrCoreTest-1348161415515
      [mvn] Creating dataDir: /usr/home/hudson/hudson-slave/workspace/Lucene-Solr-Maven-trunk/maven-build/solr/core/src/test/target/test/./solrtest-SolrCoreTest-1348161415988
      [mvn] Creating dataDir: /usr/home/hudson/hudson-slave/workspace/Lucene-Solr-Maven-trunk/maven-build/solr/core/src/test/target/test/./solrtest-SolrCoreTest-1348161416571
      [mvn] 3201 T3 oasc.CoreContainer.finalize SEVERE CoreContainer was not shutdown prior to finalize(), indicates a bug -- POSSIBLE RESOURCE LEAK!!!  instance=1829574210
      [mvn] Creating dataDir: /usr/home/hudson/hudson-slave/workspace/Lucene-Solr-Maven-trunk/maven-build/solr/core/src/test/target/test/./solrtest-SolrCoreTest-1348161417287
      [mvn] Tests run: 6, Failures: 0, Errors: 0, Skipped: 0, Time elapsed: 4.01 sec
      [mvn] Running org.apache.solr.MinimalSchemaTest
      [mvn] Creating dataDir: /usr/home/hudson/hudson-slave/workspace/Lucene-Solr-Maven-trunk/maven-build/solr/core/src/test/target/test/./solrtest-MinimalSchemaTest-1348161417801
      [mvn] Tests run: 3, Failures: 0, Errors: 0, Skipped: 0, Time elapsed: 0.427 sec
      [mvn] Running org.apache.solr.cloud.ZkCLITest
      [mvn] Creating dataDir: /usr/home/hudson/hudson-slave/workspace/Lucene-Solr-Maven-trunk/maven-build/solr/core/src/test/target/test/./solrtest-ZkCLITest-1348161418241
      [mvn] Creating dataDir: /usr/home/hudson/hudson-slave/workspace/Lucene-Solr-Maven-trunk/maven-build/solr/core/src/test/target/test/./solrtest-ZkCLITest-1348161418513
      [mvn] Creating dataDir: /usr/home/hudson/hudson-slave/workspace/Lucene-Solr-Maven-trunk/maven-build/solr/core/src/test/target/test/./solrtest-ZkCLITest-1348161419903
      [mvn] Tests run: 3, Failures: 0, Errors: 0, Skipped: 0, Time elapsed: 2.955 sec
      [mvn] Running org.apache.solr.update.TestIndexingPerformance
      [mvn] Tests run: 1, Failures: 0, Errors: 0, Skipped: 0, Time elapsed: 0.821 sec
      [mvn] Running org.apache.solr.core.TestJmxIntegration
      [mvn] Tests run: 3, Failures: 0, Errors: 0, Skipped: 1, Time elapsed: 1.046 sec
      [mvn] Running org.apache.solr.TestDistributedSearch
      [mvn] Tests run: 1, Failures: 0, Errors: 0, Skipped: 0, Time elapsed: 88.735 sec
      [mvn] Running org.apache.solr.util.DateMathParserTest
      [mvn] Tests run: 8, Failures: 0, Errors: 0, Skipped: 0, Time elapsed: 0.072 sec
      [mvn] Running org.apache.solr.core.TestPropInjectDefaults
      [mvn] Creating dataDir: /usr/home/hudson/hudson-slave/workspace/Lucene-Solr-Maven-trunk/maven-build/solr/core/src/test/target/test/./solrtest-TestPropInjectDefaults-1348161511863
      [mvn] Tests run: 2, Failures: 0, Errors: 0, Skipped: 0, Time elapsed: 0.417 sec
      [mvn] Running org.apache.solr.TestSolrCoreProperties
      [mvn] Tests run: 1, Failures: 0, Errors: 0, Skipped: 0, Time elapsed: 0.183 sec
      [mvn] Running org.apache.solr.internal.csv.writer.CSVFieldTest
      [mvn] Tests run: 2, Failures: 0, Errors: 0, Skipped: 0, Time elapsed: 0.001 sec
      [mvn] Running org.apache.solr.cloud.ZkSolrClientTest
      [mvn] Tests run: 4, Failures: 0, Errors: 0, Skipped: 0, Time elapsed: 7.507 sec
      [mvn] Running org.apache.solr.search.function.TestFunctionQuery
      [mvn] Creating dataDir: /usr/home/hudson/hudson-slave/workspace/Lucene-Solr-Maven-trunk/maven-build/solr/core/src/test/target/test/./solrtest-TestFunctionQuery-1348161519979
      [mvn] ASYNC  NEW_CORE C2 name=collection1 org.apache.solr.core.SolrCore@2f4f069b
      [mvn] 794 T617 C2 oassf.FileFloatSource.getFloats SEVERE Error loading external value source + fileName + java.lang.NumberFormatException: For input string: ""
      [mvn] Tests run: 14, Failures: 0, Errors: 0, Skipped: 0, Time elapsed: 1.656 sec
      [mvn] Running org.apache.solr.TestDistributedGrouping
      [mvn] Tests run: 1, Failures: 0, Errors: 0, Skipped: 0, Time elapsed: 13.207 sec
      [mvn] Running org.apache.solr.search.TestFastLRUCache
      [mvn] Tests run: 7, Failures: 0, Errors: 0, Skipped: 0, Time elapsed: 0.081 sec
      [mvn] Running org.apache.solr.core.TestSolrDeletionPolicy1
      [mvn] Creating dataDir: /usr/home/hudson/hudson-slave/workspace/Lucene-Solr-Maven-trunk/maven-build/solr/core/src/test/target/test/./solrtest-TestSolrDeletionPolicy1-1348161534922
      [mvn] 69 T3 oasu.ConcurrentLRUCache.finalize SEVERE ConcurrentLRUCache was not destroyed prior to finalize(), indicates a bug -- POSSIBLE RESOURCE LEAK!!!
      [mvn] Tests run: 3, Failures: 0, Errors: 0, Skipped: 0, Time elapsed: 0.791 sec
      [mvn] Running org.apache.solr.core.TestQuerySenderListener
      [mvn] Creating dataDir: /usr/home/hudson/hudson-slave/workspace/Lucene-Solr-Maven-trunk/maven-build/solr/core/src/test/target/test/./solrtest-TestQuerySenderListener-1348161535715
      [mvn] Tests run: 3, Failures: 0, Errors: 0, Skipped: 0, Time elapsed: 0.422 sec
      [mvn] Running org.apache.solr.search.function.distance.DistanceFunctionTest
      [mvn] Creating dataDir: /usr/home/hudson/hudson-slave/workspace/Lucene-Solr-Maven-trunk/maven-build/solr/core/src/test/target/test/./solrtest-DistanceFunctionTest-1348161536137
      [mvn] Tests run: 3, Failures: 0, Errors: 0, Skipped: 0, Time elapsed: 0.545 sec
      [mvn] Running org.apache.solr.search.TestRecovery
      [mvn] Creating dataDir: /usr/home/hudson/hudson-slave/workspace/Lucene-Solr-Maven-trunk/maven-build/solr/core/src/test/target/test/./solrtest-TestRecovery-1348161536680
      [mvn] Tests run: 10, Failures: 0, Errors: 0, Skipped: 0, Time elapsed: 6.426 sec
      [mvn] Running org.apache.solr.search.TestIndexSearcher
      [mvn] Creating dataDir: /usr/home/hudson/hudson-slave/workspace/Lucene-Solr-Maven-trunk/maven-build/solr/core/src/test/target/test/./solrtest-TestIndexSearcher-1348161543108
      [mvn] Tests run: 2, Failures: 0, Errors: 0, Skipped: 0, Time elapsed: 1.068 sec
      [mvn] Running org.apache.solr.schema.TestOmitPositions
      [mvn] Creating dataDir: /usr/home/hudson/hudson-slave/workspace/Lucene-Solr-Maven-trunk/maven-build/solr/core/src/test/target/test/./solrtest-TestOmitPositions-1348161544178
      [mvn] Tests run: 2, Failures: 0, Errors: 0, Skipped: 0, Time elapsed: 0.518 sec
      [mvn] Running org.apache.solr.servlet.SolrRequestParserTest
      [mvn] Creating dataDir: /usr/home/hudson/hudson-slave/workspace/Lucene-Solr-Maven-trunk/maven-build/solr/core/src/test/target/test/./solrtest-SolrRequestParserTest-1348161544699
      [mvn] Tests run: 4, Failures: 0, Errors: 0, Skipped: 1, Time elapsed: 1.632 sec
      [mvn] Running org.apache.solr.search.similarities.TestLMDirichletSimilarityFactory
      [mvn] Creating dataDir: /usr/home/hudson/hudson-slave/workspace/Lucene-Solr-Maven-trunk/maven-build/solr/core/src/test/target/test/./solrtest-TestLMDirichletSimilarityFactory-1348161546331
      [mvn] Tests run: 2, Failures: 0, Errors: 0, Skipped: 0, Time elapsed: 0.096 sec
      [mvn] Running org.apache.solr.request.SimpleFacetsTest
      [mvn] Creating dataDir: /usr/home/hudson/hudson-slave/workspace/Lucene-Solr-Maven-trunk/maven-build/solr/core/src/test/target/test/./solrtest-SimpleFacetsTest-1348161546436
      [mvn] ASYNC  NEW_CORE C3 name=collection1 org.apache.solr.core.SolrCore@625a643c
      [mvn] 1610 T834 C3 oasc.SolrException.log SEVERE org.apache.solr.common.SolrException: range facet infinite loop: gap is either zero, or too small relative start/end and caused underflow: 23.0 + 0 = 23.0
      [mvn] 		at org.apache.solr.request.SimpleFacets.getFacetRangeCounts(SimpleFacets.java:1122)
      [mvn] 		at org.apache.solr.request.SimpleFacets.getFacetRangeCounts(SimpleFacets.java:1074)
      [mvn] 		at org.apache.solr.request.SimpleFacets.getFacetRangeCounts(SimpleFacets.java:1018)
      [mvn] 		at org.apache.solr.request.SimpleFacets.getFacetCounts(SimpleFacets.java:208)
      [mvn] 		at org.apache.solr.handler.component.FacetComponent.process(FacetComponent.java:87)
      [mvn] 		at org.apache.solr.handler.component.SearchHandler.handleRequestBody(SearchHandler.java:206)
      [mvn] 		at org.apache.solr.handler.RequestHandlerBase.handleRequest(RequestHandlerBase.java:129)
      [mvn] 		at org.apache.solr.core.SolrCore.execute(SolrCore.java:1701)
      [mvn] 		at org.apache.solr.util.TestHarness.query(TestHarness.java:364)
      [mvn] 		at org.apache.solr.util.TestHarness.query(TestHarness.java:346)
      [mvn] 		at org.apache.solr.SolrTestCaseJ4.assertQEx(SolrTestCaseJ4.java:618)
      [mvn] 		at org.apache.solr.request.SimpleFacetsTest.testRangeFacetInfiniteLoopDetection(SimpleFacetsTest.java:2052)
      [mvn] 		at sun.reflect.NativeMethodAccessorImpl.invoke0(Native Method)
      [mvn] 		at sun.reflect.NativeMethodAccessorImpl.invoke(NativeMethodAccessorImpl.java:57)
      [mvn] 		at sun.reflect.DelegatingMethodAccessorImpl.invoke(DelegatingMethodAccessorImpl.java:43)
      [mvn] 		at java.lang.reflect.Method.invoke(Method.java:616)
      [mvn] 		at com.carrotsearch.randomizedtesting.RandomizedRunner.invoke(RandomizedRunner.java:1559)
      [mvn] 		at com.carrotsearch.randomizedtesting.RandomizedRunner.access$600(RandomizedRunner.java:79)
      [mvn] 		at com.carrotsearch.randomizedtesting.RandomizedRunner$6.evaluate(RandomizedRunner.java:737)
      [mvn] 		at com.carrotsearch.randomizedtesting.RandomizedRunner$7.evaluate(RandomizedRunner.java:773)
      [mvn] 		at com.carrotsearch.randomizedtesting.RandomizedRunner$8.evaluate(RandomizedRunner.java:787)
      [mvn] 		at com.carrotsearch.randomizedtesting.rules.SystemPropertiesRestoreRule$1.evaluate(SystemPropertiesRestoreRule.java:53)
      [mvn] 		at org.apache.lucene.util.TestRuleSetupTeardownChained$1.evaluate(TestRuleSetupTeardownChained.java:50)
      [mvn] 		at org.apache.lucene.util.TestRuleFieldCacheSanity$1.evaluate(TestRuleFieldCacheSanity.java:51)
      [mvn] 		at org.apache.lucene.util.AbstractBeforeAfterRule$1.evaluate(AbstractBeforeAfterRule.java:45)
      [mvn] 		at com.carrotsearch.randomizedtesting.rules.SystemPropertiesInvariantRule$1.evaluate(SystemPropertiesInvariantRule.java:55)
      [mvn] 		at org.apache.lucene.util.TestRuleThreadAndTestName$1.evaluate(TestRuleThreadAndTestName.java:48)
      [mvn] 		at org.apache.lucene.util.TestRuleIgnoreAfterMaxFailures$1.evaluate(TestRuleIgnoreAfterMaxFailures.java:70)
      [mvn] 		at org.apache.lucene.util.TestRuleMarkFailure$1.evaluate(TestRuleMarkFailure.java:48)
      [mvn] 		at com.carrotsearch.randomizedtesting.rules.StatementAdapter.evaluate(StatementAdapter.java:36)
      [mvn] 		at com.carrotsearch.randomizedtesting.ThreadLeakControl$StatementRunner.run(ThreadLeakControl.java:358)
      [mvn] 		at com.carrotsearch.randomizedtesting.ThreadLeakControl.forkTimeoutingTask(ThreadLeakControl.java:782)
      [mvn] 		at com.carrotsearch.randomizedtesting.ThreadLeakControl$3.evaluate(ThreadLeakControl.java:442)
      [mvn] 		at com.carrotsearch.randomizedtesting.RandomizedRunner.runSingleTest(RandomizedRunner.java:746)
      [mvn] 		at com.carrotsearch.randomizedtesting.RandomizedRunner$3.evaluate(RandomizedRunner.java:648)
      [mvn] 		at com.carrotsearch.randomizedtesting.RandomizedRunner$4.evaluate(RandomizedRunner.java:682)
      [mvn] 		at com.carrotsearch.randomizedtesting.RandomizedRunner$5.evaluate(RandomizedRunner.java:693)
      [mvn] 		at com.carrotsearch.randomizedtesting.rules.StatementAdapter.evaluate(StatementAdapter.java:36)
      [mvn] 		at com.carrotsearch.randomizedtesting.rules.SystemPropertiesRestoreRule$1.evaluate(SystemPropertiesRestoreRule.java:53)
      [mvn] 		at org.apache.lucene.util.AbstractBeforeAfterRule$1.evaluate(AbstractBeforeAfterRule.java:45)
      [mvn] 		at org.apache.lucene.util.TestRuleStoreClassName$1.evaluate(TestRuleStoreClassName.java:42)
      [mvn] 		at com.carrotsearch.randomizedtesting.rules.SystemPropertiesInvariantRule$1.evaluate(SystemPropertiesInvariantRule.java:55)
      [mvn] 		at com.carrotsearch.randomizedtesting.rules.NoShadowingOrOverridesOnMethodsRule$1.evaluate(NoShadowingOrOverridesOnMethodsRule.java:39)
      [mvn] 		at com.carrotsearch.randomizedtesting.rules.NoShadowingOrOverridesOnMethodsRule$1.evaluate(NoShadowingOrOverridesOnMethodsRule.java:39)
      [mvn] 		at com.carrotsearch.randomizedtesting.rules.StatementAdapter.evaluate(StatementAdapter.java:36)
      [mvn] 		at org.apache.lucene.util.TestRuleAssertionsRequired$1.evaluate(TestRuleAssertionsRequired.java:43)
      [mvn] 		at org.apache.lucene.util.TestRuleMarkFailure$1.evaluate(TestRuleMarkFailure.java:48)
      [mvn] 		at org.apache.lucene.util.TestRuleIgnoreAfterMaxFailures$1.evaluate(TestRuleIgnoreAfterMaxFailures.java:70)
      [mvn] 		at org.apache.lucene.util.TestRuleIgnoreTestSuites$1.evaluate(TestRuleIgnoreTestSuites.java:55)
      [mvn] 		at com.carrotsearch.randomizedtesting.rules.StatementAdapter.evaluate(StatementAdapter.java:36)
      [mvn] 		at com.carrotsearch.randomizedtesting.ThreadLeakControl$StatementRunner.run(ThreadLeakControl.java:358)
      [mvn] 		at java.lang.Thread.run(Thread.java:679)
      [mvn] 	
      [mvn] 1612 T834 C3 oasc.SolrException.log SEVERE org.apache.solr.common.SolrException: range facet infinite loop: gap is either zero, or too small relative start/end and caused underflow: 23.0 + 0 = 23.0
      [mvn] 		at org.apache.solr.request.SimpleFacets.getFacetRangeCounts(SimpleFacets.java:1122)
      [mvn] 		at org.apache.solr.request.SimpleFacets.getFacetRangeCounts(SimpleFacets.java:1074)
      [mvn] 		at org.apache.solr.request.SimpleFacets.getFacetRangeCounts(SimpleFacets.java:1018)
      [mvn] 		at org.apache.solr.request.SimpleFacets.getFacetCounts(SimpleFacets.java:208)
      [mvn] 		at org.apache.solr.handler.component.FacetComponent.process(FacetComponent.java:87)
      [mvn] 		at org.apache.solr.handler.component.SearchHandler.handleRequestBody(SearchHandler.java:206)
      [mvn] 		at org.apache.solr.handler.RequestHandlerBase.handleRequest(RequestHandlerBase.java:129)
      [mvn] 		at org.apache.solr.core.SolrCore.execute(SolrCore.java:1701)
      [mvn] 		at org.apache.solr.util.TestHarness.query(TestHarness.java:364)
      [mvn] 		at org.apache.solr.util.TestHarness.query(TestHarness.java:346)
      [mvn] 		at org.apache.solr.SolrTestCaseJ4.assertQEx(SolrTestCaseJ4.java:618)
      [mvn] 		at org.apache.solr.request.SimpleFacetsTest.testRangeFacetInfiniteLoopDetection(SimpleFacetsTest.java:2052)
      [mvn] 		at sun.reflect.NativeMethodAccessorImpl.invoke0(Native Method)
      [mvn] 		at sun.reflect.NativeMethodAccessorImpl.invoke(NativeMethodAccessorImpl.java:57)
      [mvn] 		at sun.reflect.DelegatingMethodAccessorImpl.invoke(DelegatingMethodAccessorImpl.java:43)
      [mvn] 		at java.lang.reflect.Method.invoke(Method.java:616)
      [mvn] 		at com.carrotsearch.randomizedtesting.RandomizedRunner.invoke(RandomizedRunner.java:1559)
      [mvn] 		at com.carrotsearch.randomizedtesting.RandomizedRunner.access$600(RandomizedRunner.java:79)
      [mvn] 		at com.carrotsearch.randomizedtesting.RandomizedRunner$6.evaluate(RandomizedRunner.java:737)
      [mvn] 		at com.carrotsearch.randomizedtesting.RandomizedRunner$7.evaluate(RandomizedRunner.java:773)
      [mvn] 		at com.carrotsearch.randomizedtesting.RandomizedRunner$8.evaluate(RandomizedRunner.java:787)
      [mvn] 		at com.carrotsearch.randomizedtesting.rules.SystemPropertiesRestoreRule$1.evaluate(SystemPropertiesRestoreRule.java:53)
      [mvn] 		at org.apache.lucene.util.TestRuleSetupTeardownChained$1.evaluate(TestRuleSetupTeardownChained.java:50)
      [mvn] 		at org.apache.lucene.util.TestRuleFieldCacheSanity$1.evaluate(TestRuleFieldCacheSanity.java:51)
      [mvn] 		at org.apache.lucene.util.AbstractBeforeAfterRule$1.evaluate(AbstractBeforeAfterRule.java:45)
      [mvn] 		at com.carrotsearch.randomizedtesting.rules.SystemPropertiesInvariantRule$1.evaluate(SystemPropertiesInvariantRule.java:55)
      [mvn] 		at org.apache.lucene.util.TestRuleThreadAndTestName$1.evaluate(TestRuleThreadAndTestName.java:48)
      [mvn] 		at org.apache.lucene.util.TestRuleIgnoreAfterMaxFailures$1.evaluate(TestRuleIgnoreAfterMaxFailures.java:70)
      [mvn] 		at org.apache.lucene.util.TestRuleMarkFailure$1.evaluate(TestRuleMarkFailure.java:48)
      [mvn] 		at com.carrotsearch.randomizedtesting.rules.StatementAdapter.evaluate(StatementAdapter.java:36)
      [mvn] 		at com.carrotsearch.randomizedtesting.ThreadLeakControl$StatementRunner.run(ThreadLeakControl.java:358)
      [mvn] 		at com.carrotsearch.randomizedtesting.ThreadLeakControl.forkTimeoutingTask(ThreadLeakControl.java:782)
      [mvn] 		at com.carrotsearch.randomizedtesting.ThreadLeakControl$3.evaluate(ThreadLeakControl.java:442)
      [mvn] 		at com.carrotsearch.randomizedtesting.RandomizedRunner.runSingleTest(RandomizedRunner.java:746)
      [mvn] 		at com.carrotsearch.randomizedtesting.RandomizedRunner$3.evaluate(RandomizedRunner.java:648)
      [mvn] 		at com.carrotsearch.randomizedtesting.RandomizedRunner$4.evaluate(RandomizedRunner.java:682)
      [mvn] 		at com.carrotsearch.randomizedtesting.RandomizedRunner$5.evaluate(RandomizedRunner.java:693)
      [mvn] 		at com.carrotsearch.randomizedtesting.rules.StatementAdapter.evaluate(StatementAdapter.java:36)
      [mvn] 		at com.carrotsearch.randomizedtesting.rules.SystemPropertiesRestoreRule$1.evaluate(SystemPropertiesRestoreRule.java:53)
      [mvn] 		at org.apache.lucene.util.AbstractBeforeAfterRule$1.evaluate(AbstractBeforeAfterRule.java:45)
      [mvn] 		at org.apache.lucene.util.TestRuleStoreClassName$1.evaluate(TestRuleStoreClassName.java:42)
      [mvn] 		at com.carrotsearch.randomizedtesting.rules.SystemPropertiesInvariantRule$1.evaluate(SystemPropertiesInvariantRule.java:55)
      [mvn] 		at com.carrotsearch.randomizedtesting.rules.NoShadowingOrOverridesOnMethodsRule$1.evaluate(NoShadowingOrOverridesOnMethodsRule.java:39)
      [mvn] 		at com.carrotsearch.randomizedtesting.rules.NoShadowingOrOverridesOnMethodsRule$1.evaluate(NoShadowingOrOverridesOnMethodsRule.java:39)
      [mvn] 		at com.carrotsearch.randomizedtesting.rules.StatementAdapter.evaluate(StatementAdapter.java:36)
      [mvn] 		at org.apache.lucene.util.TestRuleAssertionsRequired$1.evaluate(TestRuleAssertionsRequired.java:43)
      [mvn] 		at org.apache.lucene.util.TestRuleMarkFailure$1.evaluate(TestRuleMarkFailure.java:48)
      [mvn] 		at org.apache.lucene.util.TestRuleIgnoreAfterMaxFailures$1.evaluate(TestRuleIgnoreAfterMaxFailures.java:70)
      [mvn] 		at org.apache.lucene.util.TestRuleIgnoreTestSuites$1.evaluate(TestRuleIgnoreTestSuites.java:55)
      [mvn] 		at com.carrotsearch.randomizedtesting.rules.StatementAdapter.evaluate(StatementAdapter.java:36)
      [mvn] 		at com.carrotsearch.randomizedtesting.ThreadLeakControl$StatementRunner.run(ThreadLeakControl.java:358)
      [mvn] 		at java.lang.Thread.run(Thread.java:679)
      [mvn] 	
      [mvn] 1613 T834 C3 oasc.SolrException.log SEVERE org.apache.solr.common.SolrException: range facet infinite loop: gap is either zero, or too small relative start/end and caused underflow: 23.0 + 0 = 23.0
      [mvn] 		at org.apache.solr.request.SimpleFacets.getFacetRangeCounts(SimpleFacets.java:1122)
      [mvn] 		at org.apache.solr.request.SimpleFacets.getFacetRangeCounts(SimpleFacets.java:1074)
      [mvn] 		at org.apache.solr.request.SimpleFacets.getFacetRangeCounts(SimpleFacets.java:1018)
      [mvn] 		at org.apache.solr.request.SimpleFacets.getFacetCounts(SimpleFacets.java:208)
      [mvn] 		at org.apache.solr.handler.component.FacetComponent.process(FacetComponent.java:87)
      [mvn] 		at org.apache.solr.handler.component.SearchHandler.handleRequestBody(SearchHandler.java:206)
      [mvn] 		at org.apache.solr.handler.RequestHandlerBase.handleRequest(RequestHandlerBase.java:129)
      [mvn] 		at org.apache.solr.core.SolrCore.execute(SolrCore.java:1701)
      [mvn] 		at org.apache.solr.util.TestHarness.query(TestHarness.java:364)
      [mvn] 		at org.apache.solr.util.TestHarness.query(TestHarness.java:346)
      [mvn] 		at org.apache.solr.SolrTestCaseJ4.assertQEx(SolrTestCaseJ4.java:618)
      [mvn] 		at org.apache.solr.request.SimpleFacetsTest.testRangeFacetInfiniteLoopDetection(SimpleFacetsTest.java:2052)
      [mvn] 		at sun.reflect.NativeMethodAccessorImpl.invoke0(Native Method)
      [mvn] 		at sun.reflect.NativeMethodAccessorImpl.invoke(NativeMethodAccessorImpl.java:57)
      [mvn] 		at sun.reflect.DelegatingMethodAccessorImpl.invoke(DelegatingMethodAccessorImpl.java:43)
      [mvn] 		at java.lang.reflect.Method.invoke(Method.java:616)
      [mvn] 		at com.carrotsearch.randomizedtesting.RandomizedRunner.invoke(RandomizedRunner.java:1559)
      [mvn] 		at com.carrotsearch.randomizedtesting.RandomizedRunner.access$600(RandomizedRunner.java:79)
      [mvn] 		at com.carrotsearch.randomizedtesting.RandomizedRunner$6.evaluate(RandomizedRunner.java:737)
      [mvn] 		at com.carrotsearch.randomizedtesting.RandomizedRunner$7.evaluate(RandomizedRunner.java:773)
      [mvn] 		at com.carrotsearch.randomizedtesting.RandomizedRunner$8.evaluate(RandomizedRunner.java:787)
      [mvn] 		at com.carrotsearch.randomizedtesting.rules.SystemPropertiesRestoreRule$1.evaluate(SystemPropertiesRestoreRule.java:53)
      [mvn] 		at org.apache.lucene.util.TestRuleSetupTeardownChained$1.evaluate(TestRuleSetupTeardownChained.java:50)
      [mvn] 		at org.apache.lucene.util.TestRuleFieldCacheSanity$1.evaluate(TestRuleFieldCacheSanity.java:51)
      [mvn] 		at org.apache.lucene.util.AbstractBeforeAfterRule$1.evaluate(AbstractBeforeAfterRule.java:45)
      [mvn] 		at com.carrotsearch.randomizedtesting.rules.SystemPropertiesInvariantRule$1.evaluate(SystemPropertiesInvariantRule.java:55)
      [mvn] 		at org.apache.lucene.util.TestRuleThreadAndTestName$1.evaluate(TestRuleThreadAndTestName.java:48)
      [mvn] 		at org.apache.lucene.util.TestRuleIgnoreAfterMaxFailures$1.evaluate(TestRuleIgnoreAfterMaxFailures.java:70)
      [mvn] 		at org.apache.lucene.util.TestRuleMarkFailure$1.evaluate(TestRuleMarkFailure.java:48)
      [mvn] 		at com.carrotsearch.randomizedtesting.rules.StatementAdapter.evaluate(StatementAdapter.java:36)
      [mvn] 		at com.carrotsearch.randomizedtesting.ThreadLeakControl$StatementRunner.run(ThreadLeakControl.java:358)
      [mvn] 		at com.carrotsearch.randomizedtesting.ThreadLeakControl.forkTimeoutingTask(ThreadLeakControl.java:782)
      [mvn] 		at com.carrotsearch.randomizedtesting.ThreadLeakControl$3.evaluate(ThreadLeakControl.java:442)
      [mvn] 		at com.carrotsearch.randomizedtesting.RandomizedRunner.runSingleTest(RandomizedRunner.java:746)
      [mvn] 		at com.carrotsearch.randomizedtesting.RandomizedRunner$3.evaluate(RandomizedRunner.java:648)
      [mvn] 		at com.carrotsearch.randomizedtesting.RandomizedRunner$4.evaluate(RandomizedRunner.java:682)
      [mvn] 		at com.carrotsearch.randomizedtesting.RandomizedRunner$5.evaluate(RandomizedRunner.java:693)
      [mvn] 		at com.carrotsearch.randomizedtesting.rules.StatementAdapter.evaluate(StatementAdapter.java:36)
      [mvn] 		at com.carrotsearch.randomizedtesting.rules.SystemPropertiesRestoreRule$1.evaluate(SystemPropertiesRestoreRule.java:53)
      [mvn] 		at org.apache.lucene.util.AbstractBeforeAfterRule$1.evaluate(AbstractBeforeAfterRule.java:45)
      [mvn] 		at org.apache.lucene.util.TestRuleStoreClassName$1.evaluate(TestRuleStoreClassName.java:42)
      [mvn] 		at com.carrotsearch.randomizedtesting.rules.SystemPropertiesInvariantRule$1.evaluate(SystemPropertiesInvariantRule.java:55)
      [mvn] 		at com.carrotsearch.randomizedtesting.rules.NoShadowingOrOverridesOnMethodsRule$1.evaluate(NoShadowingOrOverridesOnMethodsRule.java:39)
      [mvn] 		at com.carrotsearch.randomizedtesting.rules.NoShadowingOrOverridesOnMethodsRule$1.evaluate(NoShadowingOrOverridesOnMethodsRule.java:39)
      [mvn] 		at com.carrotsearch.randomizedtesting.rules.StatementAdapter.evaluate(StatementAdapter.java:36)
      [mvn] 		at org.apache.lucene.util.TestRuleAssertionsRequired$1.evaluate(TestRuleAssertionsRequired.java:43)
      [mvn] 		at org.apache.lucene.util.TestRuleMarkFailure$1.evaluate(TestRuleMarkFailure.java:48)
      [mvn] 		at org.apache.lucene.util.TestRuleIgnoreAfterMaxFailures$1.evaluate(TestRuleIgnoreAfterMaxFailures.java:70)
      [mvn] 		at org.apache.lucene.util.TestRuleIgnoreTestSuites$1.evaluate(TestRuleIgnoreTestSuites.java:55)
      [mvn] 		at com.carrotsearch.randomizedtesting.rules.StatementAdapter.evaluate(StatementAdapter.java:36)
      [mvn] 		at com.carrotsearch.randomizedtesting.ThreadLeakControl$StatementRunner.run(ThreadLeakControl.java:358)
      [mvn] 		at java.lang.Thread.run(Thread.java:679)
      [mvn] 	
      [mvn] 1614 T834 C3 oasc.SolrException.log SEVERE org.apache.solr.common.SolrException: range facet infinite loop: gap is either zero, or too small relative start/end and caused underflow: 23.0 + 0 = 23.0
      [mvn] 		at org.apache.solr.request.SimpleFacets.getFacetRangeCounts(SimpleFacets.java:1122)
      [mvn] 		at org.apache.solr.request.SimpleFacets.getFacetRangeCounts(SimpleFacets.java:1074)
      [mvn] 		at org.apache.solr.request.SimpleFacets.getFacetRangeCounts(SimpleFacets.java:1018)
      [mvn] 		at org.apache.solr.request.SimpleFacets.getFacetCounts(SimpleFacets.java:208)
      [mvn] 		at org.apache.solr.handler.component.FacetComponent.process(FacetComponent.java:87)
      [mvn] 		at org.apache.solr.handler.component.SearchHandler.handleRequestBody(SearchHandler.java:206)
      [mvn] 		at org.apache.solr.handler.RequestHandlerBase.handleRequest(RequestHandlerBase.java:129)
      [mvn] 		at org.apache.solr.core.SolrCore.execute(SolrCore.java:1701)
      [mvn] 		at org.apache.solr.util.TestHarness.query(TestHarness.java:364)
      [mvn] 		at org.apache.solr.util.TestHarness.query(TestHarness.java:346)
      [mvn] 		at org.apache.solr.SolrTestCaseJ4.assertQEx(SolrTestCaseJ4.java:618)
      [mvn] 		at org.apache.solr.request.SimpleFacetsTest.testRangeFacetInfiniteLoopDetection(SimpleFacetsTest.java:2052)
      [mvn] 		at sun.reflect.NativeMethodAccessorImpl.invoke0(Native Method)
      [mvn] 		at sun.reflect.NativeMethodAccessorImpl.invoke(NativeMethodAccessorImpl.java:57)
      [mvn] 		at sun.reflect.DelegatingMethodAccessorImpl.invoke(DelegatingMethodAccessorImpl.java:43)
      [mvn] 		at java.lang.reflect.Method.invoke(Method.java:616)
      [mvn] 		at com.carrotsearch.randomizedtesting.RandomizedRunner.invoke(RandomizedRunner.java:1559)
      [mvn] 		at com.carrotsearch.randomizedtesting.RandomizedRunner.access$600(RandomizedRunner.java:79)
      [mvn] 		at com.carrotsearch.randomizedtesting.RandomizedRunner$6.evaluate(RandomizedRunner.java:737)
      [mvn] 		at com.carrotsearch.randomizedtesting.RandomizedRunner$7.evaluate(RandomizedRunner.java:773)
      [mvn] 		at com.carrotsearch.randomizedtesting.RandomizedRunner$8.evaluate(RandomizedRunner.java:787)
      [mvn] 		at com.carrotsearch.randomizedtesting.rules.SystemPropertiesRestoreRule$1.evaluate(SystemPropertiesRestoreRule.java:53)
      [mvn] 		at org.apache.lucene.util.TestRuleSetupTeardownChained$1.evaluate(TestRuleSetupTeardownChained.java:50)
      [mvn] 		at org.apache.lucene.util.TestRuleFieldCacheSanity$1.evaluate(TestRuleFieldCacheSanity.java:51)
      [mvn] 		at org.apache.lucene.util.AbstractBeforeAfterRule$1.evaluate(AbstractBeforeAfterRule.java:45)
      [mvn] 		at com.carrotsearch.randomizedtesting.rules.SystemPropertiesInvariantRule$1.evaluate(SystemPropertiesInvariantRule.java:55)
      [mvn] 		at org.apache.lucene.util.TestRuleThreadAndTestName$1.evaluate(TestRuleThreadAndTestName.java:48)
      [mvn] 		at org.apache.lucene.util.TestRuleIgnoreAfterMaxFailures$1.evaluate(TestRuleIgnoreAfterMaxFailures.java:70)
      [mvn] 		at org.apache.lucene.util.TestRuleMarkFailure$1.evaluate(TestRuleMarkFailure.java:48)
      [mvn] 		at com.carrotsearch.randomizedtesting.rules.StatementAdapter.evaluate(StatementAdapter.java:36)
      [mvn] 		at com.carrotsearch.randomizedtesting.ThreadLeakControl$StatementRunner.run(ThreadLeakControl.java:358)
      [mvn] 		at com.carrotsearch.randomizedtesting.ThreadLeakControl.forkTimeoutingTask(ThreadLeakControl.java:782)
      [mvn] 		at com.carrotsearch.randomizedtesting.ThreadLeakControl$3.evaluate(ThreadLeakControl.java:442)
      [mvn] 		at com.carrotsearch.randomizedtesting.RandomizedRunner.runSingleTest(RandomizedRunner.java:746)
      [mvn] 		at com.carrotsearch.randomizedtesting.RandomizedRunner$3.evaluate(RandomizedRunner.java:648)
      [mvn] 		at com.carrotsearch.randomizedtesting.RandomizedRunner$4.evaluate(RandomizedRunner.java:682)
      [mvn] 		at com.carrotsearch.randomizedtesting.RandomizedRunner$5.evaluate(RandomizedRunner.java:693)
      [mvn] 		at com.carrotsearch.randomizedtesting.rules.StatementAdapter.evaluate(StatementAdapter.java:36)
      [mvn] 		at com.carrotsearch.randomizedtesting.rules.SystemPropertiesRestoreRule$1.evaluate(SystemPropertiesRestoreRule.java:53)
      [mvn] 		at org.apache.lucene.util.AbstractBeforeAfterRule$1.evaluate(AbstractBeforeAfterRule.java:45)
      [mvn] 		at org.apache.lucene.util.TestRuleStoreClassName$1.evaluate(TestRuleStoreClassName.java:42)
      [mvn] 		at com.carrotsearch.randomizedtesting.rules.SystemPropertiesInvariantRule$1.evaluate(SystemPropertiesInvariantRule.java:55)
      [mvn] 		at com.carrotsearch.randomizedtesting.rules.NoShadowingOrOverridesOnMethodsRule$1.evaluate(NoShadowingOrOverridesOnMethodsRule.java:39)
      [mvn] 		at com.carrotsearch.randomizedtesting.rules.NoShadowingOrOverridesOnMethodsRule$1.evaluate(NoShadowingOrOverridesOnMethodsRule.java:39)
      [mvn] 		at com.carrotsearch.randomizedtesting.rules.StatementAdapter.evaluate(StatementAdapter.java:36)
      [mvn] 		at org.apache.lucene.util.TestRuleAssertionsRequired$1.evaluate(TestRuleAssertionsRequired.java:43)
      [mvn] 		at org.apache.lucene.util.TestRuleMarkFailure$1.evaluate(TestRuleMarkFailure.java:48)
      [mvn] 		at org.apache.lucene.util.TestRuleIgnoreAfterMaxFailures$1.evaluate(TestRuleIgnoreAfterMaxFailures.java:70)
      [mvn] 		at org.apache.lucene.util.TestRuleIgnoreTestSuites$1.evaluate(TestRuleIgnoreTestSuites.java:55)
      [mvn] 		at com.carrotsearch.randomizedtesting.rules.StatementAdapter.evaluate(StatementAdapter.java:36)
      [mvn] 		at com.carrotsearch.randomizedtesting.ThreadLeakControl$StatementRunner.run(ThreadLeakControl.java:358)
      [mvn] 		at java.lang.Thread.run(Thread.java:679)
      [mvn] 	
      [mvn] 1615 T834 C3 oasc.SolrException.log SEVERE org.apache.solr.common.SolrException: range facet infinite loop: gap is either zero, or too small relative start/end and caused underflow: 23 + 0 = 23
      [mvn] 		at org.apache.solr.request.SimpleFacets.getFacetRangeCounts(SimpleFacets.java:1122)
      [mvn] 		at org.apache.solr.request.SimpleFacets.getFacetRangeCounts(SimpleFacets.java:1074)
      [mvn] 		at org.apache.solr.request.SimpleFacets.getFacetRangeCounts(SimpleFacets.java:1018)
      [mvn] 		at org.apache.solr.request.SimpleFacets.getFacetCounts(SimpleFacets.java:208)
      [mvn] 		at org.apache.solr.handler.component.FacetComponent.process(FacetComponent.java:87)
      [mvn] 		at org.apache.solr.handler.component.SearchHandler.handleRequestBody(SearchHandler.java:206)
      [mvn] 		at org.apache.solr.handler.RequestHandlerBase.handleRequest(RequestHandlerBase.java:129)
      [mvn] 		at org.apache.solr.core.SolrCore.execute(SolrCore.java:1701)
      [mvn] 		at org.apache.solr.util.TestHarness.query(TestHarness.java:364)
      [mvn] 		at org.apache.solr.util.TestHarness.query(TestHarness.java:346)
      [mvn] 		at org.apache.solr.SolrTestCaseJ4.assertQEx(SolrTestCaseJ4.java:618)
      [mvn] 		at org.apache.solr.request.SimpleFacetsTest.testRangeFacetInfiniteLoopDetection(SimpleFacetsTest.java:2052)
      [mvn] 		at sun.reflect.NativeMethodAccessorImpl.invoke0(Native Method)
      [mvn] 		at sun.reflect.NativeMethodAccessorImpl.invoke(NativeMethodAccessorImpl.java:57)
      [mvn] 		at sun.reflect.DelegatingMethodAccessorImpl.invoke(DelegatingMethodAccessorImpl.java:43)
      [mvn] 		at java.lang.reflect.Method.invoke(Method.java:616)
      [mvn] 		at com.carrotsearch.randomizedtesting.RandomizedRunner.invoke(RandomizedRunner.java:1559)
      [mvn] 		at com.carrotsearch.randomizedtesting.RandomizedRunner.access$600(RandomizedRunner.java:79)
      [mvn] 		at com.carrotsearch.randomizedtesting.RandomizedRunner$6.evaluate(RandomizedRunner.java:737)
      [mvn] 		at com.carrotsearch.randomizedtesting.RandomizedRunner$7.evaluate(RandomizedRunner.java:773)
      [mvn] 		at com.carrotsearch.randomizedtesting.RandomizedRunner$8.evaluate(RandomizedRunner.java:787)
      [mvn] 		at com.carrotsearch.randomizedtesting.rules.SystemPropertiesRestoreRule$1.evaluate(SystemPropertiesRestoreRule.java:53)
      [mvn] 		at org.apache.lucene.util.TestRuleSetupTeardownChained$1.evaluate(TestRuleSetupTeardownChained.java:50)
      [mvn] 		at org.apache.lucene.util.TestRuleFieldCacheSanity$1.evaluate(TestRuleFieldCacheSanity.java:51)
      [mvn] 		at org.apache.lucene.util.AbstractBeforeAfterRule$1.evaluate(AbstractBeforeAfterRule.java:45)
      [mvn] 		at com.carrotsearch.randomizedtesting.rules.SystemPropertiesInvariantRule$1.evaluate(SystemPropertiesInvariantRule.java:55)
      [mvn] 		at org.apache.lucene.util.TestRuleThreadAndTestName$1.evaluate(TestRuleThreadAndTestName.java:48)
      [mvn] 		at org.apache.lucene.util.TestRuleIgnoreAfterMaxFailures$1.evaluate(TestRuleIgnoreAfterMaxFailures.java:70)
      [mvn] 		at org.apache.lucene.util.TestRuleMarkFailure$1.evaluate(TestRuleMarkFailure.java:48)
      [mvn] 		at com.carrotsearch.randomizedtesting.rules.StatementAdapter.evaluate(StatementAdapter.java:36)
      [mvn] 		at com.carrotsearch.randomizedtesting.ThreadLeakControl$StatementRunner.run(ThreadLeakControl.java:358)
      [mvn] 		at com.carrotsearch.randomizedtesting.ThreadLeakControl.forkTimeoutingTask(ThreadLeakControl.java:782)
      [mvn] 		at com.carrotsearch.randomizedtesting.ThreadLeakControl$3.evaluate(ThreadLeakControl.java:442)
      [mvn] 		at com.carrotsearch.randomizedtesting.RandomizedRunner.runSingleTest(RandomizedRunner.java:746)
      [mvn] 		at com.carrotsearch.randomizedtesting.RandomizedRunner$3.evaluate(RandomizedRunner.java:648)
      [mvn] 		at com.carrotsearch.randomizedtesting.RandomizedRunner$4.evaluate(RandomizedRunner.java:682)
      [mvn] 		at com.carrotsearch.randomizedtesting.RandomizedRunner$5.evaluate(RandomizedRunner.java:693)
      [mvn] 		at com.carrotsearch.randomizedtesting.rules.StatementAdapter.evaluate(StatementAdapter.java:36)
      [mvn] 		at com.carrotsearch.randomizedtesting.rules.SystemPropertiesRestoreRule$1.evaluate(SystemPropertiesRestoreRule.java:53)
      [mvn] 		at org.apache.lucene.util.AbstractBeforeAfterRule$1.evaluate(AbstractBeforeAfterRule.java:45)
      [mvn] 		at org.apache.lucene.util.TestRuleStoreClassName$1.evaluate(TestRuleStoreClassName.java:42)
      [mvn] 		at com.carrotsearch.randomizedtesting.rules.SystemPropertiesInvariantRule$1.evaluate(SystemPropertiesInvariantRule.java:55)
      [mvn] 		at com.carrotsearch.randomizedtesting.rules.NoShadowingOrOverridesOnMethodsRule$1.evaluate(NoShadowingOrOverridesOnMethodsRule.java:39)
      [mvn] 		at com.carrotsearch.randomizedtesting.rules.NoShadowingOrOverridesOnMethodsRule$1.evaluate(NoShadowingOrOverridesOnMethodsRule.java:39)
      [mvn] 		at com.carrotsearch.randomizedtesting.rules.StatementAdapter.evaluate(StatementAdapter.java:36)
      [mvn] 		at org.apache.lucene.util.TestRuleAssertionsRequired$1.evaluate(TestRuleAssertionsRequired.java:43)
      [mvn] 		at org.apache.lucene.util.TestRuleMarkFailure$1.evaluate(TestRuleMarkFailure.java:48)
      [mvn] 		at org.apache.lucene.util.TestRuleIgnoreAfterMaxFailures$1.evaluate(TestRuleIgnoreAfterMaxFailures.java:70)
      [mvn] 		at org.apache.lucene.util.TestRuleIgnoreTestSuites$1.evaluate(TestRuleIgnoreTestSuites.java:55)
      [mvn] 		at com.carrotsearch.randomizedtesting.rules.StatementAdapter.evaluate(StatementAdapter.java:36)
      [mvn] 		at com.carrotsearch.randomizedtesting.ThreadLeakControl$StatementRunner.run(ThreadLeakControl.java:358)
      [mvn] 		at java.lang.Thread.run(Thread.java:679)
      [mvn] 	
      [mvn] 1616 T834 C3 oasc.SolrException.log SEVERE org.apache.solr.common.SolrException: range facet infinite loop: gap is either zero, or too small relative start/end and caused underflow: 23 + 0 = 23
      [mvn] 		at org.apache.solr.request.SimpleFacets.getFacetRangeCounts(SimpleFacets.java:1122)
      [mvn] 		at org.apache.solr.request.SimpleFacets.getFacetRangeCounts(SimpleFacets.java:1074)
      [mvn] 		at org.apache.solr.request.SimpleFacets.getFacetRangeCounts(SimpleFacets.java:1018)
      [mvn] 		at org.apache.solr.request.SimpleFacets.getFacetCounts(SimpleFacets.java:208)
      [mvn] 		at org.apache.solr.handler.component.FacetComponent.process(FacetComponent.java:87)
      [mvn] 		at org.apache.solr.handler.component.SearchHandler.handleRequestBody(SearchHandler.java:206)
      [mvn] 		at org.apache.solr.handler.RequestHandlerBase.handleRequest(RequestHandlerBase.java:129)
      [mvn] 		at org.apache.solr.core.SolrCore.execute(SolrCore.java:1701)
      [mvn] 		at org.apache.solr.util.TestHarness.query(TestHarness.java:364)
      [mvn] 		at org.apache.solr.util.TestHarness.query(TestHarness.java:346)
      [mvn] 		at org.apache.solr.SolrTestCaseJ4.assertQEx(SolrTestCaseJ4.java:618)
      [mvn] 		at org.apache.solr.request.SimpleFacetsTest.testRangeFacetInfiniteLoopDetection(SimpleFacetsTest.java:2052)
      [mvn] 		at sun.reflect.NativeMethodAccessorImpl.invoke0(Native Method)
      [mvn] 		at sun.reflect.NativeMethodAccessorImpl.invoke(NativeMethodAccessorImpl.java:57)
      [mvn] 		at sun.reflect.DelegatingMethodAccessorImpl.invoke(DelegatingMethodAccessorImpl.java:43)
      [mvn] 		at java.lang.reflect.Method.invoke(Method.java:616)
      [mvn] 		at com.carrotsearch.randomizedtesting.RandomizedRunner.invoke(RandomizedRunner.java:1559)
      [mvn] 		at com.carrotsearch.randomizedtesting.RandomizedRunner.access$600(RandomizedRunner.java:79)
      [mvn] 		at com.carrotsearch.randomizedtesting.RandomizedRunner$6.evaluate(RandomizedRunner.java:737)
      [mvn] 		at com.carrotsearch.randomizedtesting.RandomizedRunner$7.evaluate(RandomizedRunner.java:773)
      [mvn] 		at com.carrotsearch.randomizedtesting.RandomizedRunner$8.evaluate(RandomizedRunner.java:787)
      [mvn] 		at com.carrotsearch.randomizedtesting.rules.SystemPropertiesRestoreRule$1.evaluate(SystemPropertiesRestoreRule.java:53)
      [mvn] 		at org.apache.lucene.util.TestRuleSetupTeardownChained$1.evaluate(TestRuleSetupTeardownChained.java:50)
      [mvn] 		at org.apache.lucene.util.TestRuleFieldCacheSanity$1.evaluate(TestRuleFieldCacheSanity.java:51)
      [mvn] 		at org.apache.lucene.util.AbstractBeforeAfterRule$1.evaluate(AbstractBeforeAfterRule.java:45)
      [mvn] 		at com.carrotsearch.randomizedtesting.rules.SystemPropertiesInvariantRule$1.evaluate(SystemPropertiesInvariantRule.java:55)
      [mvn] 		at org.apache.lucene.util.TestRuleThreadAndTestName$1.evaluate(TestRuleThreadAndTestName.java:48)
      [mvn] 		at org.apache.lucene.util.TestRuleIgnoreAfterMaxFailures$1.evaluate(TestRuleIgnoreAfterMaxFailures.java:70)
      [mvn] 		at org.apache.lucene.util.TestRuleMarkFailure$1.evaluate(TestRuleMarkFailure.java:48)
      [mvn] 		at com.carrotsearch.randomizedtesting.rules.StatementAdapter.evaluate(StatementAdapter.java:36)
      [mvn] 		at com.carrotsearch.randomizedtesting.ThreadLeakControl$StatementRunner.run(ThreadLeakControl.java:358)
      [mvn] 		at com.carrotsearch.randomizedtesting.ThreadLeakControl.forkTimeoutingTask(ThreadLeakControl.java:782)
      [mvn] 		at com.carrotsearch.randomizedtesting.ThreadLeakControl$3.evaluate(ThreadLeakControl.java:442)
      [mvn] 		at com.carrotsearch.randomizedtesting.RandomizedRunner.runSingleTest(RandomizedRunner.java:746)
      [mvn] 		at com.carrotsearch.randomizedtesting.RandomizedRunner$3.evaluate(RandomizedRunner.java:648)
      [mvn] 		at com.carrotsearch.randomizedtesting.RandomizedRunner$4.evaluate(RandomizedRunner.java:682)
      [mvn] 		at com.carrotsearch.randomizedtesting.RandomizedRunner$5.evaluate(RandomizedRunner.java:693)
      [mvn] 		at com.carrotsearch.randomizedtesting.rules.StatementAdapter.evaluate(StatementAdapter.java:36)
      [mvn] 		at com.carrotsearch.randomizedtesting.rules.SystemPropertiesRestoreRule$1.evaluate(SystemPropertiesRestoreRule.java:53)
      [mvn] 		at org.apache.lucene.util.AbstractBeforeAfterRule$1.evaluate(AbstractBeforeAfterRule.java:45)
      [mvn] 		at org.apache.lucene.util.TestRuleStoreClassName$1.evaluate(TestRuleStoreClassName.java:42)
      [mvn] 		at com.carrotsearch.randomizedtesting.rules.SystemPropertiesInvariantRule$1.evaluate(SystemPropertiesInvariantRule.java:55)
      [mvn] 		at com.carrotsearch.randomizedtesting.rules.NoShadowingOrOverridesOnMethodsRule$1.evaluate(NoShadowingOrOverridesOnMethodsRule.java:39)
      [mvn] 		at com.carrotsearch.randomizedtesting.rules.NoShadowingOrOverridesOnMethodsRule$1.evaluate(NoShadowingOrOverridesOnMethodsRule.java:39)
      [mvn] 		at com.carrotsearch.randomizedtesting.rules.StatementAdapter.evaluate(StatementAdapter.java:36)
      [mvn] 		at org.apache.lucene.util.TestRuleAssertionsRequired$1.evaluate(TestRuleAssertionsRequired.java:43)
      [mvn] 		at org.apache.lucene.util.TestRuleMarkFailure$1.evaluate(TestRuleMarkFailure.java:48)
      [mvn] 		at org.apache.lucene.util.TestRuleIgnoreAfterMaxFailures$1.evaluate(TestRuleIgnoreAfterMaxFailures.java:70)
      [mvn] 		at org.apache.lucene.util.TestRuleIgnoreTestSuites$1.evaluate(TestRuleIgnoreTestSuites.java:55)
      [mvn] 		at com.carrotsearch.randomizedtesting.rules.StatementAdapter.evaluate(StatementAdapter.java:36)
      [mvn] 		at com.carrotsearch.randomizedtesting.ThreadLeakControl$StatementRunner.run(ThreadLeakControl.java:358)
      [mvn] 		at java.lang.Thread.run(Thread.java:679)
      [mvn] 	
      [mvn] 1617 T834 C3 oasc.SolrException.log SEVERE org.apache.solr.common.SolrException: date facet infinite loop: gap is effectively zero
      [mvn] 		at org.apache.solr.request.SimpleFacets.getFacetDateCounts(SimpleFacets.java:928)
      [mvn] 		at org.apache.solr.request.SimpleFacets.getFacetDateCounts(SimpleFacets.java:837)
      [mvn] 		at org.apache.solr.request.SimpleFacets.getFacetCounts(SimpleFacets.java:207)
      [mvn] 		at org.apache.solr.handler.component.FacetComponent.process(FacetComponent.java:87)
      [mvn] 		at org.apache.solr.handler.component.SearchHandler.handleRequestBody(SearchHandler.java:206)
      [mvn] 		at org.apache.solr.handler.RequestHandlerBase.handleRequest(RequestHandlerBase.java:129)
      [mvn] 		at org.apache.solr.core.SolrCore.execute(SolrCore.java:1701)
      [mvn] 		at org.apache.solr.util.TestHarness.query(TestHarness.java:364)
      [mvn] 		at org.apache.solr.util.TestHarness.query(TestHarness.java:346)
      [mvn] 		at org.apache.solr.SolrTestCaseJ4.assertQEx(SolrTestCaseJ4.java:618)
      [mvn] 		at org.apache.solr.request.SimpleFacetsTest.testRangeFacetInfiniteLoopDetection(SimpleFacetsTest.java:2063)
      [mvn] 		at sun.reflect.NativeMethodAccessorImpl.invoke0(Native Method)
      [mvn] 		at sun.reflect.NativeMethodAccessorImpl.invoke(NativeMethodAccessorImpl.java:57)
      [mvn] 		at sun.reflect.DelegatingMethodAccessorImpl.invoke(DelegatingMethodAccessorImpl.java:43)
      [mvn] 		at java.lang.reflect.Method.invoke(Method.java:616)
      [mvn] 		at com.carrotsearch.randomizedtesting.RandomizedRunner.invoke(RandomizedRunner.java:1559)
      [mvn] 		at com.carrotsearch.randomizedtesting.RandomizedRunner.access$600(RandomizedRunner.java:79)
      [mvn] 		at com.carrotsearch.randomizedtesting.RandomizedRunner$6.evaluate(RandomizedRunner.java:737)
      [mvn] 		at com.carrotsearch.randomizedtesting.RandomizedRunner$7.evaluate(RandomizedRunner.java:773)
      [mvn] 		at com.carrotsearch.randomizedtesting.RandomizedRunner$8.evaluate(RandomizedRunner.java:787)
      [mvn] 		at com.carrotsearch.randomizedtesting.rules.SystemPropertiesRestoreRule$1.evaluate(SystemPropertiesRestoreRule.java:53)
      [mvn] 		at org.apache.lucene.util.TestRuleSetupTeardownChained$1.evaluate(TestRuleSetupTeardownChained.java:50)
      [mvn] 		at org.apache.lucene.util.TestRuleFieldCacheSanity$1.evaluate(TestRuleFieldCacheSanity.java:51)
      [mvn] 		at org.apache.lucene.util.AbstractBeforeAfterRule$1.evaluate(AbstractBeforeAfterRule.java:45)
      [mvn] 		at com.carrotsearch.randomizedtesting.rules.SystemPropertiesInvariantRule$1.evaluate(SystemPropertiesInvariantRule.java:55)
      [mvn] 		at org.apache.lucene.util.TestRuleThreadAndTestName$1.evaluate(TestRuleThreadAndTestName.java:48)
      [mvn] 		at org.apache.lucene.util.TestRuleIgnoreAfterMaxFailures$1.evaluate(TestRuleIgnoreAfterMaxFailures.java:70)
      [mvn] 		at org.apache.lucene.util.TestRuleMarkFailure$1.evaluate(TestRuleMarkFailure.java:48)
      [mvn] 		at com.carrotsearch.randomizedtesting.rules.StatementAdapter.evaluate(StatementAdapter.java:36)
      [mvn] 		at com.carrotsearch.randomizedtesting.ThreadLeakControl$StatementRunner.run(ThreadLeakControl.java:358)
      [mvn] 		at com.carrotsearch.randomizedtesting.ThreadLeakControl.forkTimeoutingTask(ThreadLeakControl.java:782)
      [mvn] 		at com.carrotsearch.randomizedtesting.ThreadLeakControl$3.evaluate(ThreadLeakControl.java:442)
      [mvn] 		at com.carrotsearch.randomizedtesting.RandomizedRunner.runSingleTest(RandomizedRunner.java:746)
      [mvn] 		at com.carrotsearch.randomizedtesting.RandomizedRunner$3.evaluate(RandomizedRunner.java:648)
      [mvn] 		at com.carrotsearch.randomizedtesting.RandomizedRunner$4.evaluate(RandomizedRunner.java:682)
      [mvn] 		at com.carrotsearch.randomizedtesting.RandomizedRunner$5.evaluate(RandomizedRunner.java:693)
      [mvn] 		at com.carrotsearch.randomizedtesting.rules.StatementAdapter.evaluate(StatementAdapter.java:36)
      [mvn] 		at com.carrotsearch.randomizedtesting.rules.SystemPropertiesRestoreRule$1.evaluate(SystemPropertiesRestoreRule.java:53)
      [mvn] 		at org.apache.lucene.util.AbstractBeforeAfterRule$1.evaluate(AbstractBeforeAfterRule.java:45)
      [mvn] 		at org.apache.lucene.util.TestRuleStoreClassName$1.evaluate(TestRuleStoreClassName.java:42)
      [mvn] 		at com.carrotsearch.randomizedtesting.rules.SystemPropertiesInvariantRule$1.evaluate(SystemPropertiesInvariantRule.java:55)
      [mvn] 		at com.carrotsearch.randomizedtesting.rules.NoShadowingOrOverridesOnMethodsRule$1.evaluate(NoShadowingOrOverridesOnMethodsRule.java:39)
      [mvn] 		at com.carrotsearch.randomizedtesting.rules.NoShadowingOrOverridesOnMethodsRule$1.evaluate(NoShadowingOrOverridesOnMethodsRule.java:39)
      [mvn] 		at com.carrotsearch.randomizedtesting.rules.StatementAdapter.evaluate(StatementAdapter.java:36)
      [mvn] 		at org.apache.lucene.util.TestRuleAssertionsRequired$1.evaluate(TestRuleAssertionsRequired.java:43)
      [mvn] 		at org.apache.lucene.util.TestRuleMarkFailure$1.evaluate(TestRuleMarkFailure.java:48)
      [mvn] 		at org.apache.lucene.util.TestRuleIgnoreAfterMaxFailures$1.evaluate(TestRuleIgnoreAfterMaxFailures.java:70)
      [mvn] 		at org.apache.lucene.util.TestRuleIgnoreTestSuites$1.evaluate(TestRuleIgnoreTestSuites.java:55)
      [mvn] 		at com.carrotsearch.randomizedtesting.rules.StatementAdapter.evaluate(StatementAdapter.java:36)
      [mvn] 		at com.carrotsearch.randomizedtesting.ThreadLeakControl$StatementRunner.run(ThreadLeakControl.java:358)
      [mvn] 		at java.lang.Thread.run(Thread.java:679)
      [mvn] 	
      [mvn] 1618 T834 C3 oasc.SolrException.log SEVERE org.apache.solr.common.SolrException: range facet infinite loop: gap is either zero, or too small relative start/end and caused underflow: Thu Sep 20 14:19:08 ART 2012 + +0DAYS = Thu Sep 20 14:19:08 ART 2012
      [mvn] 		at org.apache.solr.request.SimpleFacets.getFacetRangeCounts(SimpleFacets.java:1122)
      [mvn] 		at org.apache.solr.request.SimpleFacets.getFacetRangeCounts(SimpleFacets.java:1074)
      [mvn] 		at org.apache.solr.request.SimpleFacets.getFacetRangeCounts(SimpleFacets.java:1018)
      [mvn] 		at org.apache.solr.request.SimpleFacets.getFacetCounts(SimpleFacets.java:208)
      [mvn] 		at org.apache.solr.handler.component.FacetComponent.process(FacetComponent.java:87)
      [mvn] 		at org.apache.solr.handler.component.SearchHandler.handleRequestBody(SearchHandler.java:206)
      [mvn] 		at org.apache.solr.handler.RequestHandlerBase.handleRequest(RequestHandlerBase.java:129)
      [mvn] 		at org.apache.solr.core.SolrCore.execute(SolrCore.java:1701)
      [mvn] 		at org.apache.solr.util.TestHarness.query(TestHarness.java:364)
      [mvn] 		at org.apache.solr.util.TestHarness.query(TestHarness.java:346)
      [mvn] 		at org.apache.solr.SolrTestCaseJ4.assertQEx(SolrTestCaseJ4.java:618)
      [mvn] 		at org.apache.solr.request.SimpleFacetsTest.testRangeFacetInfiniteLoopDetection(SimpleFacetsTest.java:2063)
      [mvn] 		at sun.reflect.NativeMethodAccessorImpl.invoke0(Native Method)
      [mvn] 		at sun.reflect.NativeMethodAccessorImpl.invoke(NativeMethodAccessorImpl.java:57)
      [mvn] 		at sun.reflect.DelegatingMethodAccessorImpl.invoke(DelegatingMethodAccessorImpl.java:43)
      [mvn] 		at java.lang.reflect.Method.invoke(Method.java:616)
      [mvn] 		at com.carrotsearch.randomizedtesting.RandomizedRunner.invoke(RandomizedRunner.java:1559)
      [mvn] 		at com.carrotsearch.randomizedtesting.RandomizedRunner.access$600(RandomizedRunner.java:79)
      [mvn] 		at com.carrotsearch.randomizedtesting.RandomizedRunner$6.evaluate(RandomizedRunner.java:737)
      [mvn] 		at com.carrotsearch.randomizedtesting.RandomizedRunner$7.evaluate(RandomizedRunner.java:773)
      [mvn] 		at com.carrotsearch.randomizedtesting.RandomizedRunner$8.evaluate(RandomizedRunner.java:787)
      [mvn] 		at com.carrotsearch.randomizedtesting.rules.SystemPropertiesRestoreRule$1.evaluate(SystemPropertiesRestoreRule.java:53)
      [mvn] 		at org.apache.lucene.util.TestRuleSetupTeardownChained$1.evaluate(TestRuleSetupTeardownChained.java:50)
      [mvn] 		at org.apache.lucene.util.TestRuleFieldCacheSanity$1.evaluate(TestRuleFieldCacheSanity.java:51)
      [mvn] 		at org.apache.lucene.util.AbstractBeforeAfterRule$1.evaluate(AbstractBeforeAfterRule.java:45)
      [mvn] 		at com.carrotsearch.randomizedtesting.rules.SystemPropertiesInvariantRule$1.evaluate(SystemPropertiesInvariantRule.java:55)
      [mvn] 		at org.apache.lucene.util.TestRuleThreadAndTestName$1.evaluate(TestRuleThreadAndTestName.java:48)
      [mvn] 		at org.apache.lucene.util.TestRuleIgnoreAfterMaxFailures$1.evaluate(TestRuleIgnoreAfterMaxFailures.java:70)
      [mvn] 		at org.apache.lucene.util.TestRuleMarkFailure$1.evaluate(TestRuleMarkFailure.java:48)
      [mvn] 		at com.carrotsearch.randomizedtesting.rules.StatementAdapter.evaluate(StatementAdapter.java:36)
      [mvn] 		at com.carrotsearch.randomizedtesting.ThreadLeakControl$StatementRunner.run(ThreadLeakControl.java:358)
      [mvn] 		at com.carrotsearch.randomizedtesting.ThreadLeakControl.forkTimeoutingTask(ThreadLeakControl.java:782)
      [mvn] 		at com.carrotsearch.randomizedtesting.ThreadLeakControl$3.evaluate(ThreadLeakControl.java:442)
      [mvn] 		at com.carrotsearch.randomizedtesting.RandomizedRunner.runSingleTest(RandomizedRunner.java:746)
      [mvn] 		at com.carrotsearch.randomizedtesting.RandomizedRunner$3.evaluate(RandomizedRunner.java:648)
      [mvn] 		at com.carrotsearch.randomizedtesting.RandomizedRunner$4.evaluate(RandomizedRunner.java:682)
      [mvn] 		at com.carrotsearch.randomizedtesting.RandomizedRunner$5.evaluate(RandomizedRunner.java:693)
      [mvn] 		at com.carrotsearch.randomizedtesting.rules.StatementAdapter.evaluate(StatementAdapter.java:36)
      [mvn] 		at com.carrotsearch.randomizedtesting.rules.SystemPropertiesRestoreRule$1.evaluate(SystemPropertiesRestoreRule.java:53)
      [mvn] 		at org.apache.lucene.util.AbstractBeforeAfterRule$1.evaluate(AbstractBeforeAfterRule.java:45)
      [mvn] 		at org.apache.lucene.util.TestRuleStoreClassName$1.evaluate(TestRuleStoreClassName.java:42)
      [mvn] 		at com.carrotsearch.randomizedtesting.rules.SystemPropertiesInvariantRule$1.evaluate(SystemPropertiesInvariantRule.java:55)
      [mvn] 		at com.carrotsearch.randomizedtesting.rules.NoShadowingOrOverridesOnMethodsRule$1.evaluate(NoShadowingOrOverridesOnMethodsRule.java:39)
      [mvn] 		at com.carrotsearch.randomizedtesting.rules.NoShadowingOrOverridesOnMethodsRule$1.evaluate(NoShadowingOrOverridesOnMethodsRule.java:39)
      [mvn] 		at com.carrotsearch.randomizedtesting.rules.StatementAdapter.evaluate(StatementAdapter.java:36)
      [mvn] 		at org.apache.lucene.util.TestRuleAssertionsRequired$1.evaluate(TestRuleAssertionsRequired.java:43)
      [mvn] 		at org.apache.lucene.util.TestRuleMarkFailure$1.evaluate(TestRuleMarkFailure.java:48)
      [mvn] 		at org.apache.lucene.util.TestRuleIgnoreAfterMaxFailures$1.evaluate(TestRuleIgnoreAfterMaxFailures.java:70)
      [mvn] 		at org.apache.lucene.util.TestRuleIgnoreTestSuites$1.evaluate(TestRuleIgnoreTestSuites.java:55)
      [mvn] 		at com.carrotsearch.randomizedtesting.rules.StatementAdapter.evaluate(StatementAdapter.java:36)
      [mvn] 		at com.carrotsearch.randomizedtesting.ThreadLeakControl$StatementRunner.run(ThreadLeakControl.java:358)
      [mvn] 		at java.lang.Thread.run(Thread.java:679)
      [mvn] 	
      [mvn] 1620 T834 C3 oasc.SolrException.log SEVERE org.apache.solr.common.SolrException: date facet infinite loop: gap is effectively zero
      [mvn] 		at org.apache.solr.request.SimpleFacets.getFacetDateCounts(SimpleFacets.java:928)
      [mvn] 		at org.apache.solr.request.SimpleFacets.getFacetDateCounts(SimpleFacets.java:837)
      [mvn] 		at org.apache.solr.request.SimpleFacets.getFacetCounts(SimpleFacets.java:207)
      [mvn] 		at org.apache.solr.handler.component.FacetComponent.process(FacetComponent.java:87)
      [mvn] 		at org.apache.solr.handler.component.SearchHandler.handleRequestBody(SearchHandler.java:206)
      [mvn] 		at org.apache.solr.handler.RequestHandlerBase.handleRequest(RequestHandlerBase.java:129)
      [mvn] 		at org.apache.solr.core.SolrCore.execute(SolrCore.java:1701)
      [mvn] 		at org.apache.solr.util.TestHarness.query(TestHarness.java:364)
      [mvn] 		at org.apache.solr.util.TestHarness.query(TestHarness.java:346)
      [mvn] 		at org.apache.solr.SolrTestCaseJ4.assertQEx(SolrTestCaseJ4.java:618)
      [mvn] 		at org.apache.solr.request.SimpleFacetsTest.testRangeFacetInfiniteLoopDetection(SimpleFacetsTest.java:2063)
      [mvn] 		at sun.reflect.NativeMethodAccessorImpl.invoke0(Native Method)
      [mvn] 		at sun.reflect.NativeMethodAccessorImpl.invoke(NativeMethodAccessorImpl.java:57)
      [mvn] 		at sun.reflect.DelegatingMethodAccessorImpl.invoke(DelegatingMethodAccessorImpl.java:43)
      [mvn] 		at java.lang.reflect.Method.invoke(Method.java:616)
      [mvn] 		at com.carrotsearch.randomizedtesting.RandomizedRunner.invoke(RandomizedRunner.java:1559)
      [mvn] 		at com.carrotsearch.randomizedtesting.RandomizedRunner.access$600(RandomizedRunner.java:79)
      [mvn] 		at com.carrotsearch.randomizedtesting.RandomizedRunner$6.evaluate(RandomizedRunner.java:737)
      [mvn] 		at com.carrotsearch.randomizedtesting.RandomizedRunner$7.evaluate(RandomizedRunner.java:773)
      [mvn] 		at com.carrotsearch.randomizedtesting.RandomizedRunner$8.evaluate(RandomizedRunner.java:787)
      [mvn] 		at com.carrotsearch.randomizedtesting.rules.SystemPropertiesRestoreRule$1.evaluate(SystemPropertiesRestoreRule.java:53)
      [mvn] 		at org.apache.lucene.util.TestRuleSetupTeardownChained$1.evaluate(TestRuleSetupTeardownChained.java:50)
      [mvn] 		at org.apache.lucene.util.TestRuleFieldCacheSanity$1.evaluate(TestRuleFieldCacheSanity.java:51)
      [mvn] 		at org.apache.lucene.util.AbstractBeforeAfterRule$1.evaluate(AbstractBeforeAfterRule.java:45)
      [mvn] 		at com.carrotsearch.randomizedtesting.rules.SystemPropertiesInvariantRule$1.evaluate(SystemPropertiesInvariantRule.java:55)
      [mvn] 		at org.apache.lucene.util.TestRuleThreadAndTestName$1.evaluate(TestRuleThreadAndTestName.java:48)
      [mvn] 		at org.apache.lucene.util.TestRuleIgnoreAfterMaxFailures$1.evaluate(TestRuleIgnoreAfterMaxFailures.java:70)
      [mvn] 		at org.apache.lucene.util.TestRuleMarkFailure$1.evaluate(TestRuleMarkFailure.java:48)
      [mvn] 		at com.carrotsearch.randomizedtesting.rules.StatementAdapter.evaluate(StatementAdapter.java:36)
      [mvn] 		at com.carrotsearch.randomizedtesting.ThreadLeakControl$StatementRunner.run(ThreadLeakControl.java:358)
      [mvn] 		at com.carrotsearch.randomizedtesting.ThreadLeakControl.forkTimeoutingTask(ThreadLeakControl.java:782)
      [mvn] 		at com.carrotsearch.randomizedtesting.ThreadLeakControl$3.evaluate(ThreadLeakControl.java:442)
      [mvn] 		at com.carrotsearch.randomizedtesting.RandomizedRunner.runSingleTest(RandomizedRunner.java:746)
      [mvn] 		at com.carrotsearch.randomizedtesting.RandomizedRunner$3.evaluate(RandomizedRunner.java:648)
      [mvn] 		at com.carrotsearch.randomizedtesting.RandomizedRunner$4.evaluate(RandomizedRunner.java:682)
      [mvn] 		at com.carrotsearch.randomizedtesting.RandomizedRunner$5.evaluate(RandomizedRunner.java:693)
      [mvn] 		at com.carrotsearch.randomizedtesting.rules.StatementAdapter.evaluate(StatementAdapter.java:36)
      [mvn] 		at com.carrotsearch.randomizedtesting.rules.SystemPropertiesRestoreRule$1.evaluate(SystemPropertiesRestoreRule.java:53)
      [mvn] 		at org.apache.lucene.util.AbstractBeforeAfterRule$1.evaluate(AbstractBeforeAfterRule.java:45)
      [mvn] 		at org.apache.lucene.util.TestRuleStoreClassName$1.evaluate(TestRuleStoreClassName.java:42)
      [mvn] 		at com.carrotsearch.randomizedtesting.rules.SystemPropertiesInvariantRule$1.evaluate(SystemPropertiesInvariantRule.java:55)
      [mvn] 		at com.carrotsearch.randomizedtesting.rules.NoShadowingOrOverridesOnMethodsRule$1.evaluate(NoShadowingOrOverridesOnMethodsRule.java:39)
      [mvn] 		at com.carrotsearch.randomizedtesting.rules.NoShadowingOrOverridesOnMethodsRule$1.evaluate(NoShadowingOrOverridesOnMethodsRule.java:39)
      [mvn] 		at com.carrotsearch.randomizedtesting.rules.StatementAdapter.evaluate(StatementAdapter.java:36)
      [mvn] 		at org.apache.lucene.util.TestRuleAssertionsRequired$1.evaluate(TestRuleAssertionsRequired.java:43)
      [mvn] 		at org.apache.lucene.util.TestRuleMarkFailure$1.evaluate(TestRuleMarkFailure.java:48)
      [mvn] 		at org.apache.lucene.util.TestRuleIgnoreAfterMaxFailures$1.evaluate(TestRuleIgnoreAfterMaxFailures.java:70)
      [mvn] 		at org.apache.lucene.util.TestRuleIgnoreTestSuites$1.evaluate(TestRuleIgnoreTestSuites.java:55)
      [mvn] 		at com.carrotsearch.randomizedtesting.rules.StatementAdapter.evaluate(StatementAdapter.java:36)
      [mvn] 		at com.carrotsearch.randomizedtesting.ThreadLeakControl$StatementRunner.run(ThreadLeakControl.java:358)
      [mvn] 		at java.lang.Thread.run(Thread.java:679)
      [mvn] 	
      [mvn] 1621 T834 C3 oasc.SolrException.log SEVERE org.apache.solr.common.SolrException: range facet infinite loop: gap is either zero, or too small relative start/end and caused underflow: Thu Sep 20 14:19:08 ART 2012 + +0DAYS = Thu Sep 20 14:19:08 ART 2012
      [mvn] 		at org.apache.solr.request.SimpleFacets.getFacetRangeCounts(SimpleFacets.java:1122)
      [mvn] 		at org.apache.solr.request.SimpleFacets.getFacetRangeCounts(SimpleFacets.java:1074)
      [mvn] 		at org.apache.solr.request.SimpleFacets.getFacetRangeCounts(SimpleFacets.java:1018)
      [mvn] 		at org.apache.solr.request.SimpleFacets.getFacetCounts(SimpleFacets.java:208)
      [mvn] 		at org.apache.solr.handler.component.FacetComponent.process(FacetComponent.java:87)
      [mvn] 		at org.apache.solr.handler.component.SearchHandler.handleRequestBody(SearchHandler.java:206)
      [mvn] 		at org.apache.solr.handler.RequestHandlerBase.handleRequest(RequestHandlerBase.java:129)
      [mvn] 		at org.apache.solr.core.SolrCore.execute(SolrCore.java:1701)
      [mvn] 		at org.apache.solr.util.TestHarness.query(TestHarness.java:364)
      [mvn] 		at org.apache.solr.util.TestHarness.query(TestHarness.java:346)
      [mvn] 		at org.apache.solr.SolrTestCaseJ4.assertQEx(SolrTestCaseJ4.java:618)
      [mvn] 		at org.apache.solr.request.SimpleFacetsTest.testRangeFacetInfiniteLoopDetection(SimpleFacetsTest.java:2063)
      [mvn] 		at sun.reflect.NativeMethodAccessorImpl.invoke0(Native Method)
      [mvn] 		at sun.reflect.NativeMethodAccessorImpl.invoke(NativeMethodAccessorImpl.java:57)
      [mvn] 		at sun.reflect.DelegatingMethodAccessorImpl.invoke(DelegatingMethodAccessorImpl.java:43)
      [mvn] 		at java.lang.reflect.Method.invoke(Method.java:616)
      [mvn] 		at com.carrotsearch.randomizedtesting.RandomizedRunner.invoke(RandomizedRunner.java:1559)
      [mvn] 		at com.carrotsearch.randomizedtesting.RandomizedRunner.access$600(RandomizedRunner.java:79)
      [mvn] 		at com.carrotsearch.randomizedtesting.RandomizedRunner$6.evaluate(RandomizedRunner.java:737)
      [mvn] 		at com.carrotsearch.randomizedtesting.RandomizedRunner$7.evaluate(RandomizedRunner.java:773)
      [mvn] 		at com.carrotsearch.randomizedtesting.RandomizedRunner$8.evaluate(RandomizedRunner.java:787)
      [mvn] 		at com.carrotsearch.randomizedtesting.rules.SystemPropertiesRestoreRule$1.evaluate(SystemPropertiesRestoreRule.java:53)
      [mvn] 		at org.apache.lucene.util.TestRuleSetupTeardownChained$1.evaluate(TestRuleSetupTeardownChained.java:50)
      [mvn] 		at org.apache.lucene.util.TestRuleFieldCacheSanity$1.evaluate(TestRuleFieldCacheSanity.java:51)
      [mvn] 		at org.apache.lucene.util.AbstractBeforeAfterRule$1.evaluate(AbstractBeforeAfterRule.java:45)
      [mvn] 		at com.carrotsearch.randomizedtesting.rules.SystemPropertiesInvariantRule$1.evaluate(SystemPropertiesInvariantRule.java:55)
      [mvn] 		at org.apache.lucene.util.TestRuleThreadAndTestName$1.evaluate(TestRuleThreadAndTestName.java:48)
      [mvn] 		at org.apache.lucene.util.TestRuleIgnoreAfterMaxFailures$1.evaluate(TestRuleIgnoreAfterMaxFailures.java:70)
      [mvn] 		at org.apache.lucene.util.TestRuleMarkFailure$1.evaluate(TestRuleMarkFailure.java:48)
      [mvn] 		at com.carrotsearch.randomizedtesting.rules.StatementAdapter.evaluate(StatementAdapter.java:36)
      [mvn] 		at com.carrotsearch.randomizedtesting.ThreadLeakControl$StatementRunner.run(ThreadLeakControl.java:358)
      [mvn] 		at com.carrotsearch.randomizedtesting.ThreadLeakControl.forkTimeoutingTask(ThreadLeakControl.java:782)
      [mvn] 		at com.carrotsearch.randomizedtesting.ThreadLeakControl$3.evaluate(ThreadLeakControl.java:442)
      [mvn] 		at com.carrotsearch.randomizedtesting.RandomizedRunner.runSingleTest(RandomizedRunner.java:746)
      [mvn] 		at com.carrotsearch.randomizedtesting.RandomizedRunner$3.evaluate(RandomizedRunner.java:648)
      [mvn] 		at com.carrotsearch.randomizedtesting.RandomizedRunner$4.evaluate(RandomizedRunner.java:682)
      [mvn] 		at com.carrotsearch.randomizedtesting.RandomizedRunner$5.evaluate(RandomizedRunner.java:693)
      [mvn] 		at com.carrotsearch.randomizedtesting.rules.StatementAdapter.evaluate(StatementAdapter.java:36)
      [mvn] 		at com.carrotsearch.randomizedtesting.rules.SystemPropertiesRestoreRule$1.evaluate(SystemPropertiesRestoreRule.java:53)
      [mvn] 		at org.apache.lucene.util.AbstractBeforeAfterRule$1.evaluate(AbstractBeforeAfterRule.java:45)
      [mvn] 		at org.apache.lucene.util.TestRuleStoreClassName$1.evaluate(TestRuleStoreClassName.java:42)
      [mvn] 		at com.carrotsearch.randomizedtesting.rules.SystemPropertiesInvariantRule$1.evaluate(SystemPropertiesInvariantRule.java:55)
      [mvn] 		at com.carrotsearch.randomizedtesting.rules.NoShadowingOrOverridesOnMethodsRule$1.evaluate(NoShadowingOrOverridesOnMethodsRule.java:39)
      [mvn] 		at com.carrotsearch.randomizedtesting.rules.NoShadowingOrOverridesOnMethodsRule$1.evaluate(NoShadowingOrOverridesOnMethodsRule.java:39)
      [mvn] 		at com.carrotsearch.randomizedtesting.rules.StatementAdapter.evaluate(StatementAdapter.java:36)
      [mvn] 		at org.apache.lucene.util.TestRuleAssertionsRequired$1.evaluate(TestRuleAssertionsRequired.java:43)
      [mvn] 		at org.apache.lucene.util.TestRuleMarkFailure$1.evaluate(TestRuleMarkFailure.java:48)
      [mvn] 		at org.apache.lucene.util.TestRuleIgnoreAfterMaxFailures$1.evaluate(TestRuleIgnoreAfterMaxFailures.java:70)
      [mvn] 		at org.apache.lucene.util.TestRuleIgnoreTestSuites$1.evaluate(TestRuleIgnoreTestSuites.java:55)
      [mvn] 		at com.carrotsearch.randomizedtesting.rules.StatementAdapter.evaluate(StatementAdapter.java:36)
      [mvn] 		at com.carrotsearch.randomizedtesting.ThreadLeakControl$StatementRunner.run(ThreadLeakControl.java:358)
      [mvn] 		at java.lang.Thread.run(Thread.java:679)
      [mvn] 	
      [mvn] 1622 T834 C3 oasc.SolrException.log SEVERE org.apache.solr.common.SolrException: range facet infinite loop: gap is either zero, or too small relative start/end and caused underflow: 9.9999998E10 + 2160 = 9.9999998E10
      [mvn] 		at org.apache.solr.request.SimpleFacets.getFacetRangeCounts(SimpleFacets.java:1122)
      [mvn] 		at org.apache.solr.request.SimpleFacets.getFacetRangeCounts(SimpleFacets.java:1074)
      [mvn] 		at org.apache.solr.request.SimpleFacets.getFacetRangeCounts(SimpleFacets.java:1018)
      [mvn] 		at org.apache.solr.request.SimpleFacets.getFacetCounts(SimpleFacets.java:208)
      [mvn] 		at org.apache.solr.handler.component.FacetComponent.process(FacetComponent.java:87)
      [mvn] 		at org.apache.solr.handler.component.SearchHandler.handleRequestBody(SearchHandler.java:206)
      [mvn] 		at org.apache.solr.handler.RequestHandlerBase.handleRequest(RequestHandlerBase.java:129)
      [mvn] 		at org.apache.solr.core.SolrCore.execute(SolrCore.java:1701)
      [mvn] 		at org.apache.solr.util.TestHarness.query(TestHarness.java:364)
      [mvn] 		at org.apache.solr.util.TestHarness.query(TestHarness.java:346)
      [mvn] 		at org.apache.solr.SolrTestCaseJ4.assertQEx(SolrTestCaseJ4.java:618)
      [mvn] 		at org.apache.solr.request.SimpleFacetsTest.testRangeFacetInfiniteLoopDetection(SimpleFacetsTest.java:2075)
      [mvn] 		at sun.reflect.NativeMethodAccessorImpl.invoke0(Native Method)
      [mvn] 		at sun.reflect.NativeMethodAccessorImpl.invoke(NativeMethodAccessorImpl.java:57)
      [mvn] 		at sun.reflect.DelegatingMethodAccessorImpl.invoke(DelegatingMethodAccessorImpl.java:43)
      [mvn] 		at java.lang.reflect.Method.invoke(Method.java:616)
      [mvn] 		at com.carrotsearch.randomizedtesting.RandomizedRunner.invoke(RandomizedRunner.java:1559)
      [mvn] 		at com.carrotsearch.randomizedtesting.RandomizedRunner.access$600(RandomizedRunner.java:79)
      [mvn] 		at com.carrotsearch.randomizedtesting.RandomizedRunner$6.evaluate(RandomizedRunner.java:737)
      [mvn] 		at com.carrotsearch.randomizedtesting.RandomizedRunner$7.evaluate(RandomizedRunner.java:773)
      [mvn] 		at com.carrotsearch.randomizedtesting.RandomizedRunner$8.evaluate(RandomizedRunner.java:787)
      [mvn] 		at com.carrotsearch.randomizedtesting.rules.SystemPropertiesRestoreRule$1.evaluate(SystemPropertiesRestoreRule.java:53)
      [mvn] 		at org.apache.lucene.util.TestRuleSetupTeardownChained$1.evaluate(TestRuleSetupTeardownChained.java:50)
      [mvn] 		at org.apache.lucene.util.TestRuleFieldCacheSanity$1.evaluate(TestRuleFieldCacheSanity.java:51)
      [mvn] 		at org.apache.lucene.util.AbstractBeforeAfterRule$1.evaluate(AbstractBeforeAfterRule.java:45)
      [mvn] 		at com.carrotsearch.randomizedtesting.rules.SystemPropertiesInvariantRule$1.evaluate(SystemPropertiesInvariantRule.java:55)
      [mvn] 		at org.apache.lucene.util.TestRuleThreadAndTestName$1.evaluate(TestRuleThreadAndTestName.java:48)
      [mvn] 		at org.apache.lucene.util.TestRuleIgnoreAfterMaxFailures$1.evaluate(TestRuleIgnoreAfterMaxFailures.java:70)
      [mvn] 		at org.apache.lucene.util.TestRuleMarkFailure$1.evaluate(TestRuleMarkFailure.java:48)
      [mvn] 		at com.carrotsearch.randomizedtesting.rules.StatementAdapter.evaluate(StatementAdapter.java:36)
      [mvn] 		at com.carrotsearch.randomizedtesting.ThreadLeakControl$StatementRunner.run(ThreadLeakControl.java:358)
      [mvn] 		at com.carrotsearch.randomizedtesting.ThreadLeakControl.forkTimeoutingTask(ThreadLeakControl.java:782)
      [mvn] 		at com.carrotsearch.randomizedtesting.ThreadLeakControl$3.evaluate(ThreadLeakControl.java:442)
      [mvn] 		at com.carrotsearch.randomizedtesting.RandomizedRunner.runSingleTest(RandomizedRunner.java:746)
      [mvn] 		at com.carrotsearch.randomizedtesting.RandomizedRunner$3.evaluate(RandomizedRunner.java:648)
      [mvn] 		at com.carrotsearch.randomizedtesting.RandomizedRunner$4.evaluate(RandomizedRunner.java:682)
      [mvn] 		at com.carrotsearch.randomizedtesting.RandomizedRunner$5.evaluate(RandomizedRunner.java:693)
      [mvn] 		at com.carrotsearch.randomizedtesting.rules.StatementAdapter.evaluate(StatementAdapter.java:36)
      [mvn] 		at com.carrotsearch.randomizedtesting.rules.SystemPropertiesRestoreRule$1.evaluate(SystemPropertiesRestoreRule.java:53)
      [mvn] 		at org.apache.lucene.util.AbstractBeforeAfterRule$1.evaluate(AbstractBeforeAfterRule.java:45)
      [mvn] 		at org.apache.lucene.util.TestRuleStoreClassName$1.evaluate(TestRuleStoreClassName.java:42)
      [mvn] 		at com.carrotsearch.randomizedtesting.rules.SystemPropertiesInvariantRule$1.evaluate(SystemPropertiesInvariantRule.java:55)
      [mvn] 		at com.carrotsearch.randomizedtesting.rules.NoShadowingOrOverridesOnMethodsRule$1.evaluate(NoShadowingOrOverridesOnMethodsRule.java:39)
      [mvn] 		at com.carrotsearch.randomizedtesting.rules.NoShadowingOrOverridesOnMethodsRule$1.evaluate(NoShadowingOrOverridesOnMethodsRule.java:39)
      [mvn] 		at com.carrotsearch.randomizedtesting.rules.StatementAdapter.evaluate(StatementAdapter.java:36)
      [mvn] 		at org.apache.lucene.util.TestRuleAssertionsRequired$1.evaluate(TestRuleAssertionsRequired.java:43)
      [mvn] 		at org.apache.lucene.util.TestRuleMarkFailure$1.evaluate(TestRuleMarkFailure.java:48)
      [mvn] 		at org.apache.lucene.util.TestRuleIgnoreAfterMaxFailures$1.evaluate(TestRuleIgnoreAfterMaxFailures.java:70)
      [mvn] 		at org.apache.lucene.util.TestRuleIgnoreTestSuites$1.evaluate(TestRuleIgnoreTestSuites.java:55)
      [mvn] 		at com.carrotsearch.randomizedtesting.rules.StatementAdapter.evaluate(StatementAdapter.java:36)
      [mvn] 		at com.carrotsearch.randomizedtesting.ThreadLeakControl$StatementRunner.run(ThreadLeakControl.java:358)
      [mvn] 		at java.lang.Thread.run(Thread.java:679)
      [mvn] 	
      [mvn] 1623 T834 C3 oasc.SolrException.log SEVERE org.apache.solr.common.SolrException: range facet infinite loop: gap is either zero, or too small relative start/end and caused underflow: 9.9999998E10 + 2160 = 9.9999998E10
      [mvn] 		at org.apache.solr.request.SimpleFacets.getFacetRangeCounts(SimpleFacets.java:1122)
      [mvn] 		at org.apache.solr.request.SimpleFacets.getFacetRangeCounts(SimpleFacets.java:1074)
      [mvn] 		at org.apache.solr.request.SimpleFacets.getFacetRangeCounts(SimpleFacets.java:1018)
      [mvn] 		at org.apache.solr.request.SimpleFacets.getFacetCounts(SimpleFacets.java:208)
      [mvn] 		at org.apache.solr.handler.component.FacetComponent.process(FacetComponent.java:87)
      [mvn] 		at org.apache.solr.handler.component.SearchHandler.handleRequestBody(SearchHandler.java:206)
      [mvn] 		at org.apache.solr.handler.RequestHandlerBase.handleRequest(RequestHandlerBase.java:129)
      [mvn] 		at org.apache.solr.core.SolrCore.execute(SolrCore.java:1701)
      [mvn] 		at org.apache.solr.util.TestHarness.query(TestHarness.java:364)
      [mvn] 		at org.apache.solr.util.TestHarness.query(TestHarness.java:346)
      [mvn] 		at org.apache.solr.SolrTestCaseJ4.assertQEx(SolrTestCaseJ4.java:618)
      [mvn] 		at org.apache.solr.request.SimpleFacetsTest.testRangeFacetInfiniteLoopDetection(SimpleFacetsTest.java:2075)
      [mvn] 		at sun.reflect.NativeMethodAccessorImpl.invoke0(Native Method)
      [mvn] 		at sun.reflect.NativeMethodAccessorImpl.invoke(NativeMethodAccessorImpl.java:57)
      [mvn] 		at sun.reflect.DelegatingMethodAccessorImpl.invoke(DelegatingMethodAccessorImpl.java:43)
      [mvn] 		at java.lang.reflect.Method.invoke(Method.java:616)
      [mvn] 		at com.carrotsearch.randomizedtesting.RandomizedRunner.invoke(RandomizedRunner.java:1559)
      [mvn] 		at com.carrotsearch.randomizedtesting.RandomizedRunner.access$600(RandomizedRunner.java:79)
      [mvn] 		at com.carrotsearch.randomizedtesting.RandomizedRunner$6.evaluate(RandomizedRunner.java:737)
      [mvn] 		at com.carrotsearch.randomizedtesting.RandomizedRunner$7.evaluate(RandomizedRunner.java:773)
      [mvn] 		at com.carrotsearch.randomizedtesting.RandomizedRunner$8.evaluate(RandomizedRunner.java:787)
      [mvn] 		at com.carrotsearch.randomizedtesting.rules.SystemPropertiesRestoreRule$1.evaluate(SystemPropertiesRestoreRule.java:53)
      [mvn] 		at org.apache.lucene.util.TestRuleSetupTeardownChained$1.evaluate(TestRuleSetupTeardownChained.java:50)
      [mvn] 		at org.apache.lucene.util.TestRuleFieldCacheSanity$1.evaluate(TestRuleFieldCacheSanity.java:51)
      [mvn] 		at org.apache.lucene.util.AbstractBeforeAfterRule$1.evaluate(AbstractBeforeAfterRule.java:45)
      [mvn] 		at com.carrotsearch.randomizedtesting.rules.SystemPropertiesInvariantRule$1.evaluate(SystemPropertiesInvariantRule.java:55)
      [mvn] 		at org.apache.lucene.util.TestRuleThreadAndTestName$1.evaluate(TestRuleThreadAndTestName.java:48)
      [mvn] 		at org.apache.lucene.util.TestRuleIgnoreAfterMaxFailures$1.evaluate(TestRuleIgnoreAfterMaxFailures.java:70)
      [mvn] 		at org.apache.lucene.util.TestRuleMarkFailure$1.evaluate(TestRuleMarkFailure.java:48)
      [mvn] 		at com.carrotsearch.randomizedtesting.rules.StatementAdapter.evaluate(StatementAdapter.java:36)
      [mvn] 		at com.carrotsearch.randomizedtesting.ThreadLeakControl$StatementRunner.run(ThreadLeakControl.java:358)
      [mvn] 		at com.carrotsearch.randomizedtesting.ThreadLeakControl.forkTimeoutingTask(ThreadLeakControl.java:782)
      [mvn] 		at com.carrotsearch.randomizedtesting.ThreadLeakControl$3.evaluate(ThreadLeakControl.java:442)
      [mvn] 		at com.carrotsearch.randomizedtesting.RandomizedRunner.runSingleTest(RandomizedRunner.java:746)
      [mvn] 		at com.carrotsearch.randomizedtesting.RandomizedRunner$3.evaluate(RandomizedRunner.java:648)
      [mvn] 		at com.carrotsearch.randomizedtesting.RandomizedRunner$4.evaluate(RandomizedRunner.java:682)
      [mvn] 		at com.carrotsearch.randomizedtesting.RandomizedRunner$5.evaluate(RandomizedRunner.java:693)
      [mvn] 		at com.carrotsearch.randomizedtesting.rules.StatementAdapter.evaluate(StatementAdapter.java:36)
      [mvn] 		at com.carrotsearch.randomizedtesting.rules.SystemPropertiesRestoreRule$1.evaluate(SystemPropertiesRestoreRule.java:53)
      [mvn] 		at org.apache.lucene.util.AbstractBeforeAfterRule$1.evaluate(AbstractBeforeAfterRule.java:45)
      [mvn] 		at org.apache.lucene.util.TestRuleStoreClassName$1.evaluate(TestRuleStoreClassName.java:42)
      [mvn] 		at com.carrotsearch.randomizedtesting.rules.SystemPropertiesInvariantRule$1.evaluate(SystemPropertiesInvariantRule.java:55)
      [mvn] 		at com.carrotsearch.randomizedtesting.rules.NoShadowingOrOverridesOnMethodsRule$1.evaluate(NoShadowingOrOverridesOnMethodsRule.java:39)
      [mvn] 		at com.carrotsearch.randomizedtesting.rules.NoShadowingOrOverridesOnMethodsRule$1.evaluate(NoShadowingOrOverridesOnMethodsRule.java:39)
      [mvn] 		at com.carrotsearch.randomizedtesting.rules.StatementAdapter.evaluate(StatementAdapter.java:36)
      [mvn] 		at org.apache.lucene.util.TestRuleAssertionsRequired$1.evaluate(TestRuleAssertionsRequired.java:43)
      [mvn] 		at org.apache.lucene.util.TestRuleMarkFailure$1.evaluate(TestRuleMarkFailure.java:48)
      [mvn] 		at org.apache.lucene.util.TestRuleIgnoreAfterMaxFailures$1.evaluate(TestRuleIgnoreAfterMaxFailures.java:70)
      [mvn] 		at org.apache.lucene.util.TestRuleIgnoreTestSuites$1.evaluate(TestRuleIgnoreTestSuites.java:55)
      [mvn] 		at com.carrotsearch.randomizedtesting.rules.StatementAdapter.evaluate(StatementAdapter.java:36)
      [mvn] 		at com.carrotsearch.randomizedtesting.ThreadLeakControl$StatementRunner.run(ThreadLeakControl.java:358)
      [mvn] 		at java.lang.Thread.run(Thread.java:679)
      [mvn] 	
      [mvn] 1624 T834 C3 oasc.SolrException.log SEVERE org.apache.solr.common.SolrException: range facet infinite loop: gap is either zero, or too small relative start/end and caused underflow: 9.9E12 + 0.0003 = 9.9E12
      [mvn] 		at org.apache.solr.request.SimpleFacets.getFacetRangeCounts(SimpleFacets.java:1122)
      [mvn] 		at org.apache.solr.request.SimpleFacets.getFacetRangeCounts(SimpleFacets.java:1074)
      [mvn] 		at org.apache.solr.request.SimpleFacets.getFacetRangeCounts(SimpleFacets.java:1018)
      [mvn] 		at org.apache.solr.request.SimpleFacets.getFacetCounts(SimpleFacets.java:208)
      [mvn] 		at org.apache.solr.handler.component.FacetComponent.process(FacetComponent.java:87)
      [mvn] 		at org.apache.solr.handler.component.SearchHandler.handleRequestBody(SearchHandler.java:206)
      [mvn] 		at org.apache.solr.handler.RequestHandlerBase.handleRequest(RequestHandlerBase.java:129)
      [mvn] 		at org.apache.solr.core.SolrCore.execute(SolrCore.java:1701)
      [mvn] 		at org.apache.solr.util.TestHarness.query(TestHarness.java:364)
      [mvn] 		at org.apache.solr.util.TestHarness.query(TestHarness.java:346)
      [mvn] 		at org.apache.solr.SolrTestCaseJ4.assertQEx(SolrTestCaseJ4.java:618)
      [mvn] 		at org.apache.solr.request.SimpleFacetsTest.testRangeFacetInfiniteLoopDetection(SimpleFacetsTest.java:2086)
      [mvn] 		at sun.reflect.NativeMethodAccessorImpl.invoke0(Native Method)
      [mvn] 		at sun.reflect.NativeMethodAccessorImpl.invoke(NativeMethodAccessorImpl.java:57)
      [mvn] 		at sun.reflect.DelegatingMethodAccessorImpl.invoke(DelegatingMethodAccessorImpl.java:43)
      [mvn] 		at java.lang.reflect.Method.invoke(Method.java:616)
      [mvn] 		at com.carrotsearch.randomizedtesting.RandomizedRunner.invoke(RandomizedRunner.java:1559)
      [mvn] 		at com.carrotsearch.randomizedtesting.RandomizedRunner.access$600(RandomizedRunner.java:79)
      [mvn] 		at com.carrotsearch.randomizedtesting.RandomizedRunner$6.evaluate(RandomizedRunner.java:737)
      [mvn] 		at com.carrotsearch.randomizedtesting.RandomizedRunner$7.evaluate(RandomizedRunner.java:773)
      [mvn] 		at com.carrotsearch.randomizedtesting.RandomizedRunner$8.evaluate(RandomizedRunner.java:787)
      [mvn] 		at com.carrotsearch.randomizedtesting.rules.SystemPropertiesRestoreRule$1.evaluate(SystemPropertiesRestoreRule.java:53)
      [mvn] 		at org.apache.lucene.util.TestRuleSetupTeardownChained$1.evaluate(TestRuleSetupTeardownChained.java:50)
      [mvn] 		at org.apache.lucene.util.TestRuleFieldCacheSanity$1.evaluate(TestRuleFieldCacheSanity.java:51)
      [mvn] 		at org.apache.lucene.util.AbstractBeforeAfterRule$1.evaluate(AbstractBeforeAfterRule.java:45)
      [mvn] 		at com.carrotsearch.randomizedtesting.rules.SystemPropertiesInvariantRule$1.evaluate(SystemPropertiesInvariantRule.java:55)
      [mvn] 		at org.apache.lucene.util.TestRuleThreadAndTestName$1.evaluate(TestRuleThreadAndTestName.java:48)
      [mvn] 		at org.apache.lucene.util.TestRuleIgnoreAfterMaxFailures$1.evaluate(TestRuleIgnoreAfterMaxFailures.java:70)
      [mvn] 		at org.apache.lucene.util.TestRuleMarkFailure$1.evaluate(TestRuleMarkFailure.java:48)
      [mvn] 		at com.carrotsearch.randomizedtesting.rules.StatementAdapter.evaluate(StatementAdapter.java:36)
      [mvn] 		at com.carrotsearch.randomizedtesting.ThreadLeakControl$StatementRunner.run(ThreadLeakControl.java:358)
      [mvn] 		at com.carrotsearch.randomizedtesting.ThreadLeakControl.forkTimeoutingTask(ThreadLeakControl.java:782)
      [mvn] 		at com.carrotsearch.randomizedtesting.ThreadLeakControl$3.evaluate(ThreadLeakControl.java:442)
      [mvn] 		at com.carrotsearch.randomizedtesting.RandomizedRunner.runSingleTest(RandomizedRunner.java:746)
      [mvn] 		at com.carrotsearch.randomizedtesting.RandomizedRunner$3.evaluate(RandomizedRunner.java:648)
      [mvn] 		at com.carrotsearch.randomizedtesting.RandomizedRunner$4.evaluate(RandomizedRunner.java:682)
      [mvn] 		at com.carrotsearch.randomizedtesting.RandomizedRunner$5.evaluate(RandomizedRunner.java:693)
      [mvn] 		at com.carrotsearch.randomizedtesting.rules.StatementAdapter.evaluate(StatementAdapter.java:36)
      [mvn] 		at com.carrotsearch.randomizedtesting.rules.SystemPropertiesRestoreRule$1.evaluate(SystemPropertiesRestoreRule.java:53)
      [mvn] 		at org.apache.lucene.util.AbstractBeforeAfterRule$1.evaluate(AbstractBeforeAfterRule.java:45)
      [mvn] 		at org.apache.lucene.util.TestRuleStoreClassName$1.evaluate(TestRuleStoreClassName.java:42)
      [mvn] 		at com.carrotsearch.randomizedtesting.rules.SystemPropertiesInvariantRule$1.evaluate(SystemPropertiesInvariantRule.java:55)
      [mvn] 		at com.carrotsearch.randomizedtesting.rules.NoShadowingOrOverridesOnMethodsRule$1.evaluate(NoShadowingOrOverridesOnMethodsRule.java:39)
      [mvn] 		at com.carrotsearch.randomizedtesting.rules.NoShadowingOrOverridesOnMethodsRule$1.evaluate(NoShadowingOrOverridesOnMethodsRule.java:39)
      [mvn] 		at com.carrotsearch.randomizedtesting.rules.StatementAdapter.evaluate(StatementAdapter.java:36)
      [mvn] 		at org.apache.lucene.util.TestRuleAssertionsRequired$1.evaluate(TestRuleAssertionsRequired.java:43)
      [mvn] 		at org.apache.lucene.util.TestRuleMarkFailure$1.evaluate(TestRuleMarkFailure.java:48)
      [mvn] 		at org.apache.lucene.util.TestRuleIgnoreAfterMaxFailures$1.evaluate(TestRuleIgnoreAfterMaxFailures.java:70)
      [mvn] 		at org.apache.lucene.util.TestRuleIgnoreTestSuites$1.evaluate(TestRuleIgnoreTestSuites.java:55)
      [mvn] 		at com.carrotsearch.randomizedtesting.rules.StatementAdapter.evaluate(StatementAdapter.java:36)
      [mvn] 		at com.carrotsearch.randomizedtesting.ThreadLeakControl$StatementRunner.run(ThreadLeakControl.java:358)
      [mvn] 		at java.lang.Thread.run(Thread.java:679)
      [mvn] 	
      [mvn] 1625 T834 C3 oasc.SolrException.log SEVERE org.apache.solr.common.SolrException: range facet infinite loop: gap is either zero, or too small relative start/end and caused underflow: 9.9E12 + 0.0003 = 9.9E12
      [mvn] 		at org.apache.solr.request.SimpleFacets.getFacetRangeCounts(SimpleFacets.java:1122)
      [mvn] 		at org.apache.solr.request.SimpleFacets.getFacetRangeCounts(SimpleFacets.java:1074)
      [mvn] 		at org.apache.solr.request.SimpleFacets.getFacetRangeCounts(SimpleFacets.java:1018)
      [mvn] 		at org.apache.solr.request.SimpleFacets.getFacetCounts(SimpleFacets.java:208)
      [mvn] 		at org.apache.solr.handler.component.FacetComponent.process(FacetComponent.java:87)
      [mvn] 		at org.apache.solr.handler.component.SearchHandler.handleRequestBody(SearchHandler.java:206)
      [mvn] 		at org.apache.solr.handler.RequestHandlerBase.handleRequest(RequestHandlerBase.java:129)
      [mvn] 		at org.apache.solr.core.SolrCore.execute(SolrCore.java:1701)
      [mvn] 		at org.apache.solr.util.TestHarness.query(TestHarness.java:364)
      [mvn] 		at org.apache.solr.util.TestHarness.query(TestHarness.java:346)
      [mvn] 		at org.apache.solr.SolrTestCaseJ4.assertQEx(SolrTestCaseJ4.java:618)
      [mvn] 		at org.apache.solr.request.SimpleFacetsTest.testRangeFacetInfiniteLoopDetection(SimpleFacetsTest.java:2086)
      [mvn] 		at sun.reflect.NativeMethodAccessorImpl.invoke0(Native Method)
      [mvn] 		at sun.reflect.NativeMethodAccessorImpl.invoke(NativeMethodAccessorImpl.java:57)
      [mvn] 		at sun.reflect.DelegatingMethodAccessorImpl.invoke(DelegatingMethodAccessorImpl.java:43)
      [mvn] 		at java.lang.reflect.Method.invoke(Method.java:616)
      [mvn] 		at com.carrotsearch.randomizedtesting.RandomizedRunner.invoke(RandomizedRunner.java:1559)
      [mvn] 		at com.carrotsearch.randomizedtesting.RandomizedRunner.access$600(RandomizedRunner.java:79)
      [mvn] 		at com.carrotsearch.randomizedtesting.RandomizedRunner$6.evaluate(RandomizedRunner.java:737)
      [mvn] 		at com.carrotsearch.randomizedtesting.RandomizedRunner$7.evaluate(RandomizedRunner.java:773)
      [mvn] 		at com.carrotsearch.randomizedtesting.RandomizedRunner$8.evaluate(RandomizedRunner.java:787)
      [mvn] 		at com.carrotsearch.randomizedtesting.rules.SystemPropertiesRestoreRule$1.evaluate(SystemPropertiesRestoreRule.java:53)
      [mvn] 		at org.apache.lucene.util.TestRuleSetupTeardownChained$1.evaluate(TestRuleSetupTeardownChained.java:50)
      [mvn] 		at org.apache.lucene.util.TestRuleFieldCacheSanity$1.evaluate(TestRuleFieldCacheSanity.java:51)
      [mvn] 		at org.apache.lucene.util.AbstractBeforeAfterRule$1.evaluate(AbstractBeforeAfterRule.java:45)
      [mvn] 		at com.carrotsearch.randomizedtesting.rules.SystemPropertiesInvariantRule$1.evaluate(SystemPropertiesInvariantRule.java:55)
      [mvn] 		at org.apache.lucene.util.TestRuleThreadAndTestName$1.evaluate(TestRuleThreadAndTestName.java:48)
      [mvn] 		at org.apache.lucene.util.TestRuleIgnoreAfterMaxFailures$1.evaluate(TestRuleIgnoreAfterMaxFailures.java:70)
      [mvn] 		at org.apache.lucene.util.TestRuleMarkFailure$1.evaluate(TestRuleMarkFailure.java:48)
      [mvn] 		at com.carrotsearch.randomizedtesting.rules.StatementAdapter.evaluate(StatementAdapter.java:36)
      [mvn] 		at com.carrotsearch.randomizedtesting.ThreadLeakControl$StatementRunner.run(ThreadLeakControl.java:358)
      [mvn] 		at com.carrotsearch.randomizedtesting.ThreadLeakControl.forkTimeoutingTask(ThreadLeakControl.java:782)
      [mvn] 		at com.carrotsearch.randomizedtesting.ThreadLeakControl$3.evaluate(ThreadLeakControl.java:442)
      [mvn] 		at com.carrotsearch.randomizedtesting.RandomizedRunner.runSingleTest(RandomizedRunner.java:746)
      [mvn] 		at com.carrotsearch.randomizedtesting.RandomizedRunner$3.evaluate(RandomizedRunner.java:648)
      [mvn] 		at com.carrotsearch.randomizedtesting.RandomizedRunner$4.evaluate(RandomizedRunner.java:682)
      [mvn] 		at com.carrotsearch.randomizedtesting.RandomizedRunner$5.evaluate(RandomizedRunner.java:693)
      [mvn] 		at com.carrotsearch.randomizedtesting.rules.StatementAdapter.evaluate(StatementAdapter.java:36)
      [mvn] 		at com.carrotsearch.randomizedtesting.rules.SystemPropertiesRestoreRule$1.evaluate(SystemPropertiesRestoreRule.java:53)
      [mvn] 		at org.apache.lucene.util.AbstractBeforeAfterRule$1.evaluate(AbstractBeforeAfterRule.java:45)
      [mvn] 		at org.apache.lucene.util.TestRuleStoreClassName$1.evaluate(TestRuleStoreClassName.java:42)
      [mvn] 		at com.carrotsearch.randomizedtesting.rules.SystemPropertiesInvariantRule$1.evaluate(SystemPropertiesInvariantRule.java:55)
      [mvn] 		at com.carrotsearch.randomizedtesting.rules.NoShadowingOrOverridesOnMethodsRule$1.evaluate(NoShadowingOrOverridesOnMethodsRule.java:39)
      [mvn] 		at com.carrotsearch.randomizedtesting.rules.NoShadowingOrOverridesOnMethodsRule$1.evaluate(NoShadowingOrOverridesOnMethodsRule.java:39)
      [mvn] 		at com.carrotsearch.randomizedtesting.rules.StatementAdapter.evaluate(StatementAdapter.java:36)
      [mvn] 		at org.apache.lucene.util.TestRuleAssertionsRequired$1.evaluate(TestRuleAssertionsRequired.java:43)
      [mvn] 		at org.apache.lucene.util.TestRuleMarkFailure$1.evaluate(TestRuleMarkFailure.java:48)
      [mvn] 		at org.apache.lucene.util.TestRuleIgnoreAfterMaxFailures$1.evaluate(TestRuleIgnoreAfterMaxFailures.java:70)
      [mvn] 		at org.apache.lucene.util.TestRuleIgnoreTestSuites$1.evaluate(TestRuleIgnoreTestSuites.java:55)
      [mvn] 		at com.carrotsearch.randomizedtesting.rules.StatementAdapter.evaluate(StatementAdapter.java:36)
      [mvn] 		at com.carrotsearch.randomizedtesting.ThreadLeakControl$StatementRunner.run(ThreadLeakControl.java:358)
      [mvn] 		at java.lang.Thread.run(Thread.java:679)
      [mvn] 	
      [mvn] 2990 T834 C3 oasc.SolrException.log SEVERE org.apache.solr.common.SolrException: Specify the group.field as parameter or local parameter
      [mvn] 		at org.apache.solr.request.SimpleFacets.getGroupedCounts(SimpleFacets.java:360)
      [mvn] 		at org.apache.solr.request.SimpleFacets.getTermCounts(SimpleFacets.java:319)
      [mvn] 		at org.apache.solr.request.SimpleFacets.getFacetFieldCounts(SimpleFacets.java:423)
      [mvn] 		at org.apache.solr.request.SimpleFacets.getFacetCounts(SimpleFacets.java:206)
      [mvn] 		at org.apache.solr.handler.component.FacetComponent.process(FacetComponent.java:87)
      [mvn] 		at org.apache.solr.handler.component.SearchHandler.handleRequestBody(SearchHandler.java:206)
      [mvn] 		at org.apache.solr.handler.RequestHandlerBase.handleRequest(RequestHandlerBase.java:129)
      [mvn] 		at org.apache.solr.core.SolrCore.execute(SolrCore.java:1701)
      [mvn] 		at org.apache.solr.util.TestHarness.query(TestHarness.java:364)
      [mvn] 		at org.apache.solr.util.TestHarness.query(TestHarness.java:346)
      [mvn] 		at org.apache.solr.request.SimpleFacetsTest.testSimpleGroupedFacets(SimpleFacetsTest.java:245)
      [mvn] 		at sun.reflect.NativeMethodAccessorImpl.invoke0(Native Method)
      [mvn] 		at sun.reflect.NativeMethodAccessorImpl.invoke(NativeMethodAccessorImpl.java:57)
      [mvn] 		at sun.reflect.DelegatingMethodAccessorImpl.invoke(DelegatingMethodAccessorImpl.java:43)
      [mvn] 		at java.lang.reflect.Method.invoke(Method.java:616)
      [mvn] 		at com.carrotsearch.randomizedtesting.RandomizedRunner.invoke(RandomizedRunner.java:1559)
      [mvn] 		at com.carrotsearch.randomizedtesting.RandomizedRunner.access$600(RandomizedRunner.java:79)
      [mvn] 		at com.carrotsearch.randomizedtesting.RandomizedRunner$6.evaluate(RandomizedRunner.java:737)
      [mvn] 		at com.carrotsearch.randomizedtesting.RandomizedRunner$7.evaluate(RandomizedRunner.java:773)
      [mvn] 		at com.carrotsearch.randomizedtesting.RandomizedRunner$8.evaluate(RandomizedRunner.java:787)
      [mvn] 		at com.carrotsearch.randomizedtesting.rules.SystemPropertiesRestoreRule$1.evaluate(SystemPropertiesRestoreRule.java:53)
      [mvn] 		at org.apache.lucene.util.TestRuleSetupTeardownChained$1.evaluate(TestRuleSetupTeardownChained.java:50)
      [mvn] 		at org.apache.lucene.util.TestRuleFieldCacheSanity$1.evaluate(TestRuleFieldCacheSanity.java:51)
      [mvn] 		at org.apache.lucene.util.AbstractBeforeAfterRule$1.evaluate(AbstractBeforeAfterRule.java:45)
      [mvn] 		at com.carrotsearch.randomizedtesting.rules.SystemPropertiesInvariantRule$1.evaluate(SystemPropertiesInvariantRule.java:55)
      [mvn] 		at org.apache.lucene.util.TestRuleThreadAndTestName$1.evaluate(TestRuleThreadAndTestName.java:48)
      [mvn] 		at org.apache.lucene.util.TestRuleIgnoreAfterMaxFailures$1.evaluate(TestRuleIgnoreAfterMaxFailures.java:70)
      [mvn] 		at org.apache.lucene.util.TestRuleMarkFailure$1.evaluate(TestRuleMarkFailure.java:48)
      [mvn] 		at com.carrotsearch.randomizedtesting.rules.StatementAdapter.evaluate(StatementAdapter.java:36)
      [mvn] 		at com.carrotsearch.randomizedtesting.ThreadLeakControl$StatementRunner.run(ThreadLeakControl.java:358)
      [mvn] 		at com.carrotsearch.randomizedtesting.ThreadLeakControl.forkTimeoutingTask(ThreadLeakControl.java:782)
      [mvn] 		at com.carrotsearch.randomizedtesting.ThreadLeakControl$3.evaluate(ThreadLeakControl.java:442)
      [mvn] 		at com.carrotsearch.randomizedtesting.RandomizedRunner.runSingleTest(RandomizedRunner.java:746)
      [mvn] 		at com.carrotsearch.randomizedtesting.RandomizedRunner$3.evaluate(RandomizedRunner.java:648)
      [mvn] 		at com.carrotsearch.randomizedtesting.RandomizedRunner$4.evaluate(RandomizedRunner.java:682)
      [mvn] 		at com.carrotsearch.randomizedtesting.RandomizedRunner$5.evaluate(RandomizedRunner.java:693)
      [mvn] 		at com.carrotsearch.randomizedtesting.rules.StatementAdapter.evaluate(StatementAdapter.java:36)
      [mvn] 		at com.carrotsearch.randomizedtesting.rules.SystemPropertiesRestoreRule$1.evaluate(SystemPropertiesRestoreRule.java:53)
      [mvn] 		at org.apache.lucene.util.AbstractBeforeAfterRule$1.evaluate(AbstractBeforeAfterRule.java:45)
      [mvn] 		at org.apache.lucene.util.TestRuleStoreClassName$1.evaluate(TestRuleStoreClassName.java:42)
      [mvn] 		at com.carrotsearch.randomizedtesting.rules.SystemPropertiesInvariantRule$1.evaluate(SystemPropertiesInvariantRule.java:55)
      [mvn] 		at com.carrotsearch.randomizedtesting.rules.NoShadowingOrOverridesOnMethodsRule$1.evaluate(NoShadowingOrOverridesOnMethodsRule.java:39)
      [mvn] 		at com.carrotsearch.randomizedtesting.rules.NoShadowingOrOverridesOnMethodsRule$1.evaluate(NoShadowingOrOverridesOnMethodsRule.java:39)
      [mvn] 		at com.carrotsearch.randomizedtesting.rules.StatementAdapter.evaluate(StatementAdapter.java:36)
      [mvn] 		at org.apache.lucene.util.TestRuleAssertionsRequired$1.evaluate(TestRuleAssertionsRequired.java:43)
      [mvn] 		at org.apache.lucene.util.TestRuleMarkFailure$1.evaluate(TestRuleMarkFailure.java:48)
      [mvn] 		at org.apache.lucene.util.TestRuleIgnoreAfterMaxFailures$1.evaluate(TestRuleIgnoreAfterMaxFailures.java:70)
      [mvn] 		at org.apache.lucene.util.TestRuleIgnoreTestSuites$1.evaluate(TestRuleIgnoreTestSuites.java:55)
      [mvn] 		at com.carrotsearch.randomizedtesting.rules.StatementAdapter.evaluate(StatementAdapter.java:36)
      [mvn] 		at com.carrotsearch.randomizedtesting.ThreadLeakControl$StatementRunner.run(ThreadLeakControl.java:358)
      [mvn] 		at java.lang.Thread.run(Thread.java:679)
      [mvn] 	
      [mvn] Tests run: 32, Failures: 0, Errors: 0, Skipped: 0, Time elapsed: 3.137 sec
      [mvn] Running org.apache.solr.TestDocumentBuilder
      [mvn] doc1: SolrInputDocument[field1=value1, field2=value1, field3=value2, field4=15, field5=[45, 33, 20]]
      [mvn] clone: SolrInputDocument[field1=value1, field2=value1, field3=value2, field4=15, field5=[45, 33, 20]]
      [mvn] Tests run: 1, Failures: 0, Errors: 0, Skipped: 0, Time elapsed: 0.016 sec
      [mvn] Running org.apache.solr.request.TestWriterPerf
      [mvn] Tests run: 1, Failures: 0, Errors: 0, Skipped: 0, Time elapsed: 0.762 sec
      [mvn] Running org.apache.solr.request.TestBinaryResponseWriter
      [mvn] Tests run: 2, Failures: 0, Errors: 0, Skipped: 0, Time elapsed: 0.887 sec
      [mvn] Running org.apache.solr.core.TestQuerySenderNoQuery
      [mvn] Creating dataDir: /usr/home/hudson/hudson-slave/workspace/Lucene-Solr-Maven-trunk/maven-build/solr/core/src/test/target/test/./solrtest-TestQuerySenderNoQuery-1348161551231
      [mvn] Tests run: 3, Failures: 0, Errors: 0, Skipped: 0, Time elapsed: 0.393 sec
      [mvn] Running org.apache.solr.update.DirectUpdateHandlerOptimizeTest
      [mvn] Tests run: 1, Failures: 0, Errors: 0, Skipped: 0, Time elapsed: 0.55 sec
      [mvn] Running org.apache.solr.core.TestMergePolicyConfig
      [mvn] Creating dataDir: /usr/home/hudson/hudson-slave/workspace/Lucene-Solr-Maven-trunk/maven-build/solr/core/src/test/target/test/./solrtest-TestMergePolicyConfig-1348161552176
      [mvn] Tests run: 1, Failures: 0, Errors: 0, Skipped: 0, Time elapsed: 0.394 sec
      [mvn] Running org.apache.solr.cloud.TestMultiCoreConfBootstrap
      [mvn] Creating dataDir: /usr/home/hudson/hudson-slave/workspace/Lucene-Solr-Maven-trunk/maven-build/solr/core/src/test/target/test/./solrtest-TestMultiCoreConfBootstrap-1348161552573
      [mvn] !!!! WARNING: best effort to remove /usr/home/hudson/hudson-slave/workspace/Lucene-Solr-Maven-trunk/maven-build/solr/core/src/test/target/test/./solrtest-TestMultiCoreConfBootstrap-1348161552573 FAILED !!!!!
      [mvn] Tests run: 1, Failures: 0, Errors: 0, Skipped: 0, Time elapsed: 3.494 sec
      [mvn] Running org.apache.solr.TestPluginEnable
      [mvn] Creating dataDir: /usr/home/hudson/hudson-slave/workspace/Lucene-Solr-Maven-trunk/maven-build/solr/core/src/test/target/test/./solrtest-TestPluginEnable-1348161556066
      [mvn] Tests run: 1, Failures: 0, Errors: 0, Skipped: 0, Time elapsed: 0.09 sec
      [mvn] Running org.apache.solr.cloud.LeaderElectionIntegrationTest
      [mvn] Creating dataDir: /usr/home/hudson/hudson-slave/workspace/Lucene-Solr-Maven-trunk/maven-build/solr/core/src/test/target/test/./solrtest-LeaderElectionIntegrationTest-1348161556161
      [mvn] Creating dataDir: /usr/home/hudson/hudson-slave/workspace/Lucene-Solr-Maven-trunk/maven-build/solr/core/src/test/target/test/./solrtest-LeaderElectionIntegrationTest-1348161565124
      [mvn] 22210 T947 oasc.Overseer.createOverseerNode SEVERE Could not create Overseer node org.apache.zookeeper.KeeperException$SessionExpiredException: KeeperErrorCode = Session expired for /overseer
      [mvn] 	at org.apache.zookeeper.KeeperException.create(KeeperException.java:118)
      [mvn] 	at org.apache.zookeeper.KeeperException.create(KeeperException.java:42)
      [mvn] 	at org.apache.zookeeper.ZooKeeper.create(ZooKeeper.java:643)
      [mvn] 	at org.apache.solr.common.cloud.SolrZkClient$9.execute(SolrZkClient.java:340)
      [mvn] 	at org.apache.solr.common.cloud.SolrZkClient$9.execute(SolrZkClient.java:337)
      [mvn] 	at org.apache.solr.common.cloud.ZkCmdExecutor.retryOperation(ZkCmdExecutor.java:67)
      [mvn] 	at org.apache.solr.common.cloud.SolrZkClient.create(SolrZkClient.java:337)
      [mvn] 	at org.apache.solr.cloud.Overseer.createOverseerNode(Overseer.java:541)
      [mvn] 	at org.apache.solr.cloud.Overseer.getInQueue(Overseer.java:523)
      [mvn] 	at org.apache.solr.cloud.ShardLeaderElectionContext.runLeaderProcess(ElectionContext.java:138)
      [mvn] 	at org.apache.solr.cloud.LeaderElector.runIamLeaderProcess(LeaderElector.java:158)
      [mvn] 	at org.apache.solr.cloud.LeaderElector.checkIfIamLeader(LeaderElector.java:102)
      [mvn] 	at org.apache.solr.cloud.LeaderElector.access$000(LeaderElector.java:56)
      [mvn] 	at org.apache.solr.cloud.LeaderElector$1.process(LeaderElector.java:131)
      [mvn] 	at org.apache.zookeeper.ClientCnxn$EventThread.processEvent(ClientCnxn.java:526)
      [mvn] 	at org.apache.zookeeper.ClientCnxn$EventThread.run(ClientCnxn.java:502)
      [mvn] 
      [mvn] Tests run: 2, Failures: 0, Errors: 0, Skipped: 0, Time elapsed: 23.491 sec
      [mvn] Running org.apache.solr.core.TestXIncludeConfig
      [mvn] Tests run: 1, Failures: 0, Errors: 0, Skipped: 0, Time elapsed: 0.1 sec
      [mvn] Running org.apache.solr.core.PluginInfoTest
      [mvn] Tests run: 9, Failures: 0, Errors: 0, Skipped: 0, Time elapsed: 0.049 sec
      [mvn] Running org.apache.solr.util.DOMUtilTest
      [mvn] Tests run: 1, Failures: 0, Errors: 0, Skipped: 0, Time elapsed: 0.02 sec
      [mvn] Running org.apache.solr.handler.admin.CoreAdminHandlerTest
      [mvn] Creating dataDir: /usr/home/hudson/hudson-slave/workspace/Lucene-Solr-Maven-trunk/maven-build/solr/core/src/test/target/test/./solrtest-CoreAdminHandlerTest-1348161579820
      [mvn] 1073 T969 oasc.CoreContainer.create SEVERE Unable to create core: bogus_dir_core java.io.IOException: Can't find resource 'solrconfig.xml' in classpath or '/usr/home/hudson/hudson-slave/workspace/Lucene-Solr-Maven-trunk/maven-build/solr/core/src/test/target/test-classes/solr/dir_does_not_exist_127896/conf/', cwd=/usr/home/hudson/hudson-slave/workspace/Lucene-Solr-Maven-trunk/maven-build/solr/core/src/test/target/test
      [mvn] 	at org.apache.solr.core.SolrResourceLoader.openResource(SolrResourceLoader.java:314)
      [mvn] 	at org.apache.solr.core.SolrResourceLoader.openConfig(SolrResourceLoader.java:280)
      [mvn] 	at org.apache.solr.core.Config.<init>(Config.java:111)
      [mvn] 	at org.apache.solr.core.Config.<init>(Config.java:78)
      [mvn] 	at org.apache.solr.core.SolrConfig.<init>(SolrConfig.java:117)
      [mvn] 	at org.apache.solr.core.CoreContainer.create(CoreContainer.java:791)
      [mvn] 	at org.apache.solr.handler.admin.CoreAdminHandler.handleCreateAction(CoreAdminHandler.java:519)
      [mvn] 	at org.apache.solr.handler.admin.CoreAdminHandler.handleRequestBody(CoreAdminHandler.java:142)
      [mvn] 	at org.apache.solr.handler.admin.CoreAdminHandlerTest.testCoreAdminHandler(CoreAdminHandlerTest.java:105)
      [mvn] 	at sun.reflect.NativeMethodAccessorImpl.invoke0(Native Method)
      [mvn] 	at sun.reflect.NativeMethodAccessorImpl.invoke(NativeMethodAccessorImpl.java:57)
      [mvn] 	at sun.reflect.DelegatingMethodAccessorImpl.invoke(DelegatingMethodAccessorImpl.java:43)
      [mvn] 	at java.lang.reflect.Method.invoke(Method.java:616)
      [mvn] 	at com.carrotsearch.randomizedtesting.RandomizedRunner.invoke(RandomizedRunner.java:1559)
      [mvn] 	at com.carrotsearch.randomizedtesting.RandomizedRunner.access$600(RandomizedRunner.java:79)
      [mvn] 	at com.carrotsearch.randomizedtesting.RandomizedRunner$6.evaluate(RandomizedRunner.java:737)
      [mvn] 	at com.carrotsearch.randomizedtesting.RandomizedRunner$7.evaluate(RandomizedRunner.java:773)
      [mvn] 	at com.carrotsearch.randomizedtesting.RandomizedRunner$8.evaluate(RandomizedRunner.java:787)
      [mvn] 	at com.carrotsearch.randomizedtesting.rules.SystemPropertiesRestoreRule$1.evaluate(SystemPropertiesRestoreRule.java:53)
      [mvn] 	at org.apache.lucene.util.TestRuleSetupTeardownChained$1.evaluate(TestRuleSetupTeardownChained.java:50)
      [mvn] 	at org.apache.lucene.util.TestRuleFieldCacheSanity$1.evaluate(TestRuleFieldCacheSanity.java:51)
      [mvn] 	at org.apache.lucene.util.AbstractBeforeAfterRule$1.evaluate(AbstractBeforeAfterRule.java:45)
      [mvn] 	at com.carrotsearch.randomizedtesting.rules.SystemPropertiesInvariantRule$1.evaluate(SystemPropertiesInvariantRule.java:55)
      [mvn] 	at org.apache.lucene.util.TestRuleThreadAndTestName$1.evaluate(TestRuleThreadAndTestName.java:48)
      [mvn] 	at org.apache.lucene.util.TestRuleIgnoreAfterMaxFailures$1.evaluate(TestRuleIgnoreAfterMaxFailures.java:70)
      [mvn] 	at org.apache.lucene.util.TestRuleMarkFailure$1.evaluate(TestRuleMarkFailure.java:48)
      [mvn] 	at com.carrotsearch.randomizedtesting.rules.StatementAdapter.evaluate(StatementAdapter.java:36)
      [mvn] 	at com.carrotsearch.randomizedtesting.ThreadLeakControl$StatementRunner.run(ThreadLeakControl.java:358)
      [mvn] 	at com.carrotsearch.randomizedtesting.ThreadLeakControl.forkTimeoutingTask(ThreadLeakControl.java:782)
      [mvn] 	at com.carrotsearch.randomizedtesting.ThreadLeakControl$3.evaluate(ThreadLeakControl.java:442)
      [mvn] 	at com.carrotsearch.randomizedtesting.RandomizedRunner.runSingleTest(RandomizedRunner.java:746)
      [mvn] 	at com.carrotsearch.randomizedtesting.RandomizedRunner$3.evaluate(RandomizedRunner.java:648)
      [mvn] 	at com.carrotsearch.randomizedtesting.RandomizedRunner$4.evaluate(RandomizedRunner.java:682)
      [mvn] 	at com.carrotsearch.randomizedtesting.RandomizedRunner$5.evaluate(RandomizedRunner.java:693)
      [mvn] 	at com.carrotsearch.randomizedtesting.rules.StatementAdapter.evaluate(StatementAdapter.java:36)
      [mvn] 	at com.carrotsearch.randomizedtesting.rules.SystemPropertiesRestoreRule$1.evaluate(SystemPropertiesRestoreRule.java:53)
      [mvn] 	at org.apache.lucene.util.AbstractBeforeAfterRule$1.evaluate(AbstractBeforeAfterRule.java:45)
      [mvn] 	at org.apache.lucene.util.TestRuleStoreClassName$1.evaluate(TestRuleStoreClassName.java:42)
      [mvn] 	at com.carrotsearch.randomizedtesting.rules.SystemPropertiesInvariantRule$1.evaluate(SystemPropertiesInvariantRule.java:55)
      [mvn] 	at com.carrotsearch.randomizedtesting.rules.NoShadowingOrOverridesOnMethodsRule$1.evaluate(NoShadowingOrOverridesOnMethodsRule.java:39)
      [mvn] 	at com.carrotsearch.randomizedtesting.rules.NoShadowingOrOverridesOnMethodsRule$1.evaluate(NoShadowingOrOverridesOnMethodsRule.java:39)
      [mvn] 	at com.carrotsearch.randomizedtesting.rules.StatementAdapter.evaluate(StatementAdapter.java:36)
      [mvn] 	at org.apache.lucene.util.TestRuleAssertionsRequired$1.evaluate(TestRuleAssertionsRequired.java:43)
      [mvn] 	at org.apache.lucene.util.TestRuleMarkFailure$1.evaluate(TestRuleMarkFailure.java:48)
      [mvn] 	at org.apache.lucene.util.TestRuleIgnoreAfterMaxFailures$1.evaluate(TestRuleIgnoreAfterMaxFailures.java:70)
      [mvn] 	at org.apache.lucene.util.TestRuleIgnoreTestSuites$1.evaluate(TestRuleIgnoreTestSuites.java:55)
      [mvn] 	at com.carrotsearch.randomizedtesting.rules.StatementAdapter.evaluate(StatementAdapter.java:36)
      [mvn] 	at com.carrotsearch.randomizedtesting.ThreadLeakControl$StatementRunner.run(ThreadLeakControl.java:358)
      [mvn] 	at java.lang.Thread.run(Thread.java:679)
      [mvn] 
      [mvn] Tests run: 1, Failures: 0, Errors: 0, Skipped: 0, Time elapsed: 1.098 sec
      [mvn] Running org.apache.solr.core.TestConfig
      [mvn] Creating dataDir: /usr/home/hudson/hudson-slave/workspace/Lucene-Solr-Maven-trunk/maven-build/solr/core/src/test/target/test/./solrtest-TestConfig-1348161580923
      [mvn] Tests run: 7, Failures: 0, Errors: 0, Skipped: 0, Time elapsed: 0.188 sec
      [mvn] Running org.apache.solr.cloud.BasicZkTest
      [mvn] azt beforeclass
      [mvn] Creating dataDir: /usr/home/hudson/hudson-slave/workspace/Lucene-Solr-Maven-trunk/maven-build/solr/core/src/test/target/test/./solrtest-BasicZkTest-1348161581109
      [mvn] 4190 T976 oasc.CoreContainer.reload SEVERE Unable to reload core: collection1 Ignoring exception matching SAXParseException
      [mvn] Tests run: 1, Failures: 0, Errors: 0, Skipped: 0, Time elapsed: 14.571 sec
      [mvn] Running org.apache.solr.util.CircularListTest
      [mvn] Tests run: 1, Failures: 0, Errors: 0, Skipped: 0, Time elapsed: 0.02 sec
      [mvn] Running org.apache.solr.handler.JsonLoaderTest
      [mvn] Creating dataDir: /usr/home/hudson/hudson-slave/workspace/Lucene-Solr-Maven-trunk/maven-build/solr/core/src/test/target/test/./solrtest-JsonLoaderTest-1348161595712
      [mvn] Tests run: 6, Failures: 0, Errors: 0, Skipped: 0, Time elapsed: 0.568 sec
      [mvn] Running org.apache.solr.schema.BadIndexSchemaTest
      [mvn] Creating dataDir: /usr/home/hudson/hudson-slave/workspace/Lucene-Solr-Maven-trunk/maven-build/solr/core/src/test/target/test/./solrtest-BadIndexSchemaTest-1348161596274
      [mvn] 84 T1002 oass.IndexSchema.readSchema SEVERE uniqueKey field (id) can not be the dest of a copyField (src=XXX)
      [mvn] Creating dataDir: /usr/home/hudson/hudson-slave/workspace/Lucene-Solr-Maven-trunk/maven-build/solr/core/src/test/target/test/./solrtest-BadIndexSchemaTest-1348161596358
      [mvn] 167 T1002 oass.IndexSchema.readSchema SEVERE uniqueKey field (null) can not be configured with a default value (XXX)
      [mvn] Creating dataDir: /usr/home/hudson/hudson-slave/workspace/Lucene-Solr-Maven-trunk/maven-build/solr/core/src/test/target/test/./solrtest-BadIndexSchemaTest-1348161596440
      [mvn] 252 T1002 oass.IndexSchema.readSchema SEVERE uniqueKey field (null) can not be configured to be multivalued
      [mvn] Creating dataDir: /usr/home/hudson/hudson-slave/workspace/Lucene-Solr-Maven-trunk/maven-build/solr/core/src/test/target/test/./solrtest-BadIndexSchemaTest-1348161596529
      [mvn] Creating dataDir: /usr/home/hudson/hudson-slave/workspace/Lucene-Solr-Maven-trunk/maven-build/solr/core/src/test/target/test/./solrtest-BadIndexSchemaTest-1348161596606
      [mvn] Creating dataDir: /usr/home/hudson/hudson-slave/workspace/Lucene-Solr-Maven-trunk/maven-build/solr/core/src/test/target/test/./solrtest-BadIndexSchemaTest-1348161596685
      [mvn] 496 T1002 oass.IndexSchema.readSchema SEVERE FieldType 'sim1' is configured with a similarity, but the global similarity does not support it: class org.apache.solr.search.similarities.DefaultSimilarityFactory
      [mvn] Creating dataDir: /usr/home/hudson/hudson-slave/workspace/Lucene-Solr-Maven-trunk/maven-build/solr/core/src/test/target/test/./solrtest-BadIndexSchemaTest-1348161596771
      [mvn] 587 T1002 oasc.SolrCore.initCodec SEVERE FieldType 'pulsing1' is configured with a postings format, but the codec does not support it: class org.apache.solr.core.SolrCore$3
      [mvn] Creating dataDir: /usr/home/hudson/hudson-slave/workspace/Lucene-Solr-Maven-trunk/maven-build/solr/core/src/test/target/test/./solrtest-BadIndexSchemaTest-1348161596863
      [mvn] 647 T3 oasc.SolrCore.finalize SEVERE REFCOUNT ERROR: unreferenced org.apache.solr.core.SolrCore@5006ba2d (collection1) has a reference count of 1
      [mvn] 648 T3 oasc.CoreContainer.finalize SEVERE CoreContainer was not shutdown prior to finalize(), indicates a bug -- POSSIBLE RESOURCE LEAK!!!  instance=1255962360
      [mvn] Creating dataDir: /usr/home/hudson/hudson-slave/workspace/Lucene-Solr-Maven-trunk/maven-build/solr/core/src/test/target/test/./solrtest-BadIndexSchemaTest-1348161596936
      [mvn] Creating dataDir: /usr/home/hudson/hudson-slave/workspace/Lucene-Solr-Maven-trunk/maven-build/solr/core/src/test/target/test/./solrtest-BadIndexSchemaTest-1348161596987
      [mvn] Creating dataDir: /usr/home/hudson/hudson-slave/workspace/Lucene-Solr-Maven-trunk/maven-build/solr/core/src/test/target/test/./solrtest-BadIndexSchemaTest-1348161597038
      [mvn] Creating dataDir: /usr/home/hudson/hudson-slave/workspace/Lucene-Solr-Maven-trunk/maven-build/solr/core/src/test/target/test/./solrtest-BadIndexSchemaTest-1348161597090
      [mvn] Creating dataDir: /usr/home/hudson/hudson-slave/workspace/Lucene-Solr-Maven-trunk/maven-build/solr/core/src/test/target/test/./solrtest-BadIndexSchemaTest-1348161597143
      [mvn] Creating dataDir: /usr/home/hudson/hudson-slave/workspace/Lucene-Solr-Maven-trunk/maven-build/solr/core/src/test/target/test/./solrtest-BadIndexSchemaTest-1348161597196
      [mvn] Creating dataDir: /usr/home/hudson/hudson-slave/workspace/Lucene-Solr-Maven-trunk/maven-build/solr/core/src/test/target/test/./solrtest-BadIndexSchemaTest-1348161597248
      [mvn] Creating dataDir: /usr/home/hudson/hudson-slave/workspace/Lucene-Solr-Maven-trunk/maven-build/solr/core/src/test/target/test/./solrtest-BadIndexSchemaTest-1348161597303
      [mvn] Creating dataDir: /usr/home/hudson/hudson-slave/workspace/Lucene-Solr-Maven-trunk/maven-build/solr/core/src/test/target/test/./solrtest-BadIndexSchemaTest-1348161597359
      [mvn] Creating dataDir: /usr/home/hudson/hudson-slave/workspace/Lucene-Solr-Maven-trunk/maven-build/solr/core/src/test/target/test/./solrtest-BadIndexSchemaTest-1348161597417
      [mvn] Tests run: 10, Failures: 0, Errors: 0, Skipped: 0, Time elapsed: 1.212 sec
      [mvn] Running org.apache.solr.search.similarities.TestIBSimilarityFactory
      [mvn] Creating dataDir: /usr/home/hudson/hudson-slave/workspace/Lucene-Solr-Maven-trunk/maven-build/solr/core/src/test/target/test/./solrtest-TestIBSimilarityFactory-1348161597480
      [mvn] Tests run: 2, Failures: 0, Errors: 0, Skipped: 0, Time elapsed: 0.071 sec
      [mvn] Running org.apache.solr.handler.component.StatsComponentTest
      [mvn] ASYNC  NEW_CORE C4 name=collection1 org.apache.solr.core.SolrCore@1dbb7db
      [mvn] 293 T1007 C4 oasc.SolrException.log SEVERE org.apache.solr.common.SolrException: Stats can only facet on single-valued fields, not: foo_ss
      [mvn] 		at org.apache.solr.handler.component.SimpleStats.getFieldCacheStats(StatsComponent.java:261)
      [mvn] 		at org.apache.solr.handler.component.SimpleStats.getStatsFields(StatsComponent.java:227)
      [mvn] 		at org.apache.solr.handler.component.SimpleStats.getStatsCounts(StatsComponent.java:201)
      [mvn] 		at org.apache.solr.handler.component.StatsComponent.process(StatsComponent.java:70)
      [mvn] 		at org.apache.solr.handler.component.SearchHandler.handleRequestBody(SearchHandler.java:206)
      [mvn] 		at org.apache.solr.handler.RequestHandlerBase.handleRequest(RequestHandlerBase.java:129)
      [mvn] 		at org.apache.solr.core.SolrCore.execute(SolrCore.java:1701)
      [mvn] 		at org.apache.solr.util.TestHarness.query(TestHarness.java:364)
      [mvn] 		at org.apache.solr.util.TestHarness.query(TestHarness.java:346)
      [mvn] 		at org.apache.solr.util.AbstractSolrTestCase.assertQEx(AbstractSolrTestCase.java:290)
      [mvn] 		at org.apache.solr.handler.component.StatsComponentTest.testStatsFacetMultivaluedErrorHandling(StatsComponentTest.java:363)
      [mvn] 		at sun.reflect.NativeMethodAccessorImpl.invoke0(Native Method)
      [mvn] 		at sun.reflect.NativeMethodAccessorImpl.invoke(NativeMethodAccessorImpl.java:57)
      [mvn] 		at sun.reflect.DelegatingMethodAccessorImpl.invoke(DelegatingMethodAccessorImpl.java:43)
      [mvn] 		at java.lang.reflect.Method.invoke(Method.java:616)
      [mvn] 		at com.carrotsearch.randomizedtesting.RandomizedRunner.invoke(RandomizedRunner.java:1559)
      [mvn] 		at com.carrotsearch.randomizedtesting.RandomizedRunner.access$600(RandomizedRunner.java:79)
      [mvn] 		at com.carrotsearch.randomizedtesting.RandomizedRunner$6.evaluate(RandomizedRunner.java:737)
      [mvn] 		at com.carrotsearch.randomizedtesting.RandomizedRunner$7.evaluate(RandomizedRunner.java:773)
      [mvn] 		at com.carrotsearch.randomizedtesting.RandomizedRunner$8.evaluate(RandomizedRunner.java:787)
      [mvn] 		at com.carrotsearch.randomizedtesting.rules.SystemPropertiesRestoreRule$1.evaluate(SystemPropertiesRestoreRule.java:53)
      [mvn] 		at org.apache.lucene.util.TestRuleSetupTeardownChained$1.evaluate(TestRuleSetupTeardownChained.java:50)
      [mvn] 		at org.apache.lucene.util.TestRuleFieldCacheSanity$1.evaluate(TestRuleFieldCacheSanity.java:51)
      [mvn] 		at org.apache.lucene.util.AbstractBeforeAfterRule$1.evaluate(AbstractBeforeAfterRule.java:45)
      [mvn] 		at com.carrotsearch.randomizedtesting.rules.SystemPropertiesInvariantRule$1.evaluate(SystemPropertiesInvariantRule.java:55)
      [mvn] 		at org.apache.lucene.util.TestRuleThreadAndTestName$1.evaluate(TestRuleThreadAndTestName.java:48)
      [mvn] 		at org.apache.lucene.util.TestRuleIgnoreAfterMaxFailures$1.evaluate(TestRuleIgnoreAfterMaxFailures.java:70)
      [mvn] 		at org.apache.lucene.util.TestRuleMarkFailure$1.evaluate(TestRuleMarkFailure.java:48)
      [mvn] 		at com.carrotsearch.randomizedtesting.rules.StatementAdapter.evaluate(StatementAdapter.java:36)
      [mvn] 		at com.carrotsearch.randomizedtesting.ThreadLeakControl$StatementRunner.run(ThreadLeakControl.java:358)
      [mvn] 		at com.carrotsearch.randomizedtesting.ThreadLeakControl.forkTimeoutingTask(ThreadLeakControl.java:782)
      [mvn] 		at com.carrotsearch.randomizedtesting.ThreadLeakControl$3.evaluate(ThreadLeakControl.java:442)
      [mvn] 		at com.carrotsearch.randomizedtesting.RandomizedRunner.runSingleTest(RandomizedRunner.java:746)
      [mvn] 		at com.carrotsearch.randomizedtesting.RandomizedRunner$3.evaluate(RandomizedRunner.java:648)
      [mvn] 		at com.carrotsearch.randomizedtesting.RandomizedRunner$4.evaluate(RandomizedRunner.java:682)
      [mvn] 		at com.carrotsearch.randomizedtesting.RandomizedRunner$5.evaluate(RandomizedRunner.java:693)
      [mvn] 		at com.carrotsearch.randomizedtesting.rules.StatementAdapter.evaluate(StatementAdapter.java:36)
      [mvn] 		at com.carrotsearch.randomizedtesting.rules.SystemPropertiesRestoreRule$1.evaluate(SystemPropertiesRestoreRule.java:53)
      [mvn] 		at org.apache.lucene.util.AbstractBeforeAfterRule$1.evaluate(AbstractBeforeAfterRule.java:45)
      [mvn] 		at org.apache.lucene.util.TestRuleStoreClassName$1.evaluate(TestRuleStoreClassName.java:42)
      [mvn] 		at com.carrotsearch.randomizedtesting.rules.SystemPropertiesInvariantRule$1.evaluate(SystemPropertiesInvariantRule.java:55)
      [mvn] 		at com.carrotsearch.randomizedtesting.rules.NoShadowingOrOverridesOnMethodsRule$1.evaluate(NoShadowingOrOverridesOnMethodsRule.java:39)
      [mvn] 		at com.carrotsearch.randomizedtesting.rules.NoShadowingOrOverridesOnMethodsRule$1.evaluate(NoShadowingOrOverridesOnMethodsRule.java:39)
      [mvn] 		at com.carrotsearch.randomizedtesting.rules.StatementAdapter.evaluate(StatementAdapter.java:36)
      [mvn] 		at org.apache.lucene.util.TestRuleAssertionsRequired$1.evaluate(TestRuleAssertionsRequired.java:43)
      [mvn] 		at org.apache.lucene.util.TestRuleMarkFailure$1.evaluate(TestRuleMarkFailure.java:48)
      [mvn] 		at org.apache.lucene.util.TestRuleIgnoreAfterMaxFailures$1.evaluate(TestRuleIgnoreAfterMaxFailures.java:70)
      [mvn] 		at org.apache.lucene.util.TestRuleIgnoreTestSuites$1.evaluate(TestRuleIgnoreTestSuites.java:55)
      [mvn] 		at com.carrotsearch.randomizedtesting.rules.StatementAdapter.evaluate(StatementAdapter.java:36)
      [mvn] 		at com.carrotsearch.randomizedtesting.ThreadLeakControl$StatementRunner.run(ThreadLeakControl.java:358)
      [mvn] 		at java.lang.Thread.run(Thread.java:679)
      [mvn] 	
      [mvn] Tests run: 7, Failures: 0, Errors: 0, Skipped: 0, Time elapsed: 3.007 sec
      [mvn] Running org.apache.solr.search.TestLFUCache
      [mvn] Creating dataDir: /usr/home/hudson/hudson-slave/workspace/Lucene-Solr-Maven-trunk/maven-build/solr/core/src/test/target/test/./solrtest-TestLFUCache-1348161600567
      [mvn] {39=39, 38=38, 37=37, 36=36, 35=35, 34=34, 33=33, 32=32, 31=31, 30=30}
      [mvn] Tests run: 5, Failures: 0, Errors: 0, Skipped: 0, Time elapsed: 0.454 sec
      [mvn] Running org.apache.solr.internal.csv.writer.CSVConfigGuesserTest
      [mvn] Tests run: 3, Failures: 0, Errors: 0, Skipped: 0, Time elapsed: 0.002 sec
      [mvn] Running org.apache.solr.response.TestPHPSerializedResponseWriter
      [mvn] Creating dataDir: /usr/home/hudson/hudson-slave/workspace/Lucene-Solr-Maven-trunk/maven-build/solr/core/src/test/target/test/./solrtest-TestPHPSerializedResponseWriter-1348161601023
      [mvn] Tests run: 2, Failures: 0, Errors: 0, Skipped: 0, Time elapsed: 0.552 sec
      [mvn] Running org.apache.solr.core.ResourceLoaderTest
      [mvn] Tests run: 4, Failures: 0, Errors: 0, Skipped: 0, Time elapsed: 0.054 sec
      [mvn] Running org.apache.solr.schema.PrimitiveFieldTypeTest
      [mvn] Tests run: 1, Failures: 0, Errors: 0, Skipped: 0, Time elapsed: 0.627 sec
      [mvn] Running org.apache.solr.cloud.BasicDistributedZkTest
      [mvn] Creating dataDir: /usr/home/hudson/hudson-slave/workspace/Lucene-Solr-Maven-trunk/maven-build/solr/core/src/test/target/test/./solrtest-BasicDistributedZkTest-1348161602272
      [mvn] / (2)
      [mvn] DATA:
      [mvn]     
      [mvn]  /solr (6)
      [mvn]   /solr/configs (1)
      [mvn]    /solr/configs/conf1 (9)
      [mvn]     /solr/configs/conf1/mapping-ISOLatin1Accent.txt (0)
      [mvn]     DATA: ...supressed...
      [mvn]     /solr/configs/conf1/currency.xml (0)
      [mvn]     DATA: ...supressed...
      [mvn]     /solr/configs/conf1/protwords.txt (0)
      [mvn]     DATA: ...supressed...
      [mvn]     /solr/configs/conf1/synonyms.txt (0)
      [mvn]     DATA: ...supressed...
      [mvn]     /solr/configs/conf1/old_synonyms.txt (0)
      [mvn]     DATA: ...supressed...
      [mvn]     /solr/configs/conf1/solrconfig.xml (0)
      [mvn]     DATA: ...supressed...
      [mvn]     /solr/configs/conf1/stopwords.txt (0)
      [mvn]     DATA: ...supressed...
      [mvn]     /solr/configs/conf1/open-exchange-rates.json (0)
      [mvn]     DATA:
      [mvn]         {
      [mvn]           "disclaimer": "This data is collected from various providers and provided free of charge for informational purposes only, with no guarantee whatsoever of accuracy, validity, availability or fitness for any purpose; use at your own risk. Other than that - have fun, and please share/watch/fork if you think data like this should be free!",
      [mvn]           "license": "Data collected from various providers with public-facing APIs; copyright may apply; not for resale; no warranties given.",
      [mvn]           "timestamp": 1332070464,
      [mvn]           "base": "USD",
      [mvn]           "rates": {
      [mvn]             "AED": 3.6732,
      [mvn]             "AFN": 48.299999,
      [mvn]             "ALL": 105.919998,
      [mvn]             "AMD": 388.890015,
      [mvn]             "ANG": 1.79,
      [mvn]             "AOA": 94.769997,
      [mvn]             "ARS": 4.35,
      [mvn]             "AUD": 0.943931,
      [mvn]             "AWG": 1.7899,
      [mvn]             "AZN": 0.7863,
      [mvn]             "BAM": 1.48775,
      [mvn]             "BBD": 2,
      [mvn]             "BDT": 82,
      [mvn]             "BGN": 1.4962,
      [mvn]             "BHD": 0.37703,
      [mvn]             "BIF": 1304.170044,
      [mvn]             "BMD": 1,
      [mvn]             "BND": 1.2575,
      [mvn]             "BOB": 6.91,
      [mvn]             "BRL": 1.8003,
      [mvn]             "BSD": 1,
      [mvn]             "BTN": 50.185001,
      [mvn]             "BWP": 7.2307,
      [mvn]             "BYR": 8150,
      [mvn]             "BZD": 1.9135,
      [mvn]             "CAD": 0.9921,
      [mvn]             "CDF": 917.276917,
      [mvn]             "CHF": 0.9164,
      [mvn]             "CLF": 0.02146,
      [mvn]             "CLP": 482.75,
      [mvn]             "CNY": 6.3239,
      [mvn]             "COP": 1760,
      [mvn]             "CRC": 507.600006,
      [mvn]             "CUP": 1,
      [mvn]             "CVE": 84.190002,
      [mvn]             "CZK": 18.606001,
      [mvn]             "DJF": 179.490005,
      [mvn]             "DKK": 5.64424,
      [mvn]             "DOP": 39.025002,
      [mvn]             "DZD": 74.544998,
      [mvn]             "EGP": 6.0385,
      [mvn]             "ETB": 17.720449,
      [mvn]             "EUR": 0.758956,
      [mvn]             "FJD": 1.7734,
      [mvn]             "FKP": 0.6316,
      [mvn]             "GBP": 0.631373,
      [mvn]             "GEL": 1.6469,
      [mvn]             "GHS": 1.7455,
      [mvn]             "GIP": 0.63165,
      [mvn]             "GMD": 31.5,
      [mvn]             "GNF": 7100,
      [mvn]             "GTQ": 7.6975,
      [mvn]             "GYD": 203.699997,
      [mvn]             "HKD": 7.76306,
      [mvn]             "HNL": 19.055,
      [mvn]             "HRK": 5.7333,
      [mvn]             "HTG": 41,
      [mvn]             "HUF": 219.850006,
      [mvn]             "IDR": 9118,
      [mvn]             "IEP": 0.5978,
      [mvn]             "ILS": 3.7542,
      [mvn]             "INR": 50.165001,
      [mvn]             "IQD": 1165.5,
      [mvn]             "IRR": 12308,
      [mvn]             "ISK": 127.440002,
      [mvn]             "JMD": 86.699997,
      [mvn]             "JOD": 0.7095,
      [mvn]             "JPY": 83.445,
      [mvn]             "KES": 83.18,
      [mvn]             "KGS": 46.699402,
      [mvn]             "KHR": 4010.300049,
      [mvn]             "KMF": 373.424255,
      [mvn]             "KPW": 900,
      [mvn]             "KRW": 1125.849976,
      [mvn]             "KWD": 0.27925,
      [mvn]             "KZT": 147.690002,
      [mvn]             "LAK": 7993.799805,
      [mvn]             "LBP": 1504,
      [mvn]             "LKR": 125.224998,
      [mvn]             "LRD": 73.459999,
      [mvn]             "LSL": 7.5768,
      [mvn]             "LTL": 2.6219,
      [mvn]             "LVL": 0.5291,
      [mvn]             "LYD": 1.2572,
      [mvn]             "MAD": 8.4611,
      [mvn]             "MDL": 11.89,
      [mvn]             "MGA": 2155,
      [mvn]             "MKD": 46.705002,
      [mvn]             "MMK": 6.51,
      [mvn]             "MNT": 1322.5,
      [mvn]             "MOP": 7.9958,
      [mvn]             "MRO": 293,
      [mvn]             "MUR": 29.110001,
      [mvn]             "MVR": 15.36,
      [mvn]             "MWK": 165.206207,
      [mvn]             "MXN": 12.6745,
      [mvn]             "MYR": 3.0575,
      [mvn]             "MZN": 27.200001,
      [mvn]             "NAD": 7.58,
      [mvn]             "NGN": 157.600006,
      [mvn]             "NIO": 23.215,
      [mvn]             "NOK": 5.73163,
      [mvn]             "NPR": 80.620003,
      [mvn]             "NZD": 1.212269,
      [mvn]             "OMR": 0.38485,
      [mvn]             "PAB": 1,
      [mvn]             "PEN": 2.674,
      [mvn]             "PGK": 2.0627,
      [mvn]             "PHP": 43.02,
      [mvn]             "PKR": 90.800003,
      [mvn]             "PLN": 3.1285,
      [mvn]             "PYG": 4245,
      [mvn]             "QAR": 3.6415,
      [mvn]             "RON": 3.3256,
      [mvn]             "RSD": 84.100502,
      [mvn]             "RUB": 29.2342,
      [mvn]             "RWF": 606.717468,
      [mvn]             "SAR": 3.7505,
      [mvn]             "SBD": 7.075973,
      [mvn]             "SCR": 14.0447,
      [mvn]             "SDG": 2.6765,
      [mvn]             "SEK": 6.74525,
      [mvn]             "SGD": 1.258,
      [mvn]             "SHP": 0.63165,
      [mvn]             "SLL": 4364.5,
      [mvn]             "SOS": 1629,
      [mvn]             "SRD": 3.2875,
      [mvn]             "STD": 18650,
      [mvn]             "SVC": 8.7475,
      [mvn]             "SYP": 57.450001,
      [mvn]             "SZL": 7.5752,
      [mvn]             "THB": 30.700001,
      [mvn]             "TJS": 4.7588,
      [mvn]             "TMT": 2.85,
      [mvn]             "TND": 1.5178,
      [mvn]             "TOP": 1.693601,
      [mvn]             "TRY": 1.796,
      [mvn]             "TTD": 6.40015,
      [mvn]             "TWD": 29.532,
      [mvn]             "TZS": 1595,
      [mvn]             "UAH": 8.029,
      [mvn]             "UGX": 2481.699951,
      [mvn]             "USD": 1,
      [mvn]             "UYU": 19.469999,
      [mvn]             "UZS": 1835.75,
      [mvn]             "VEF": 4.295,
      [mvn]             "VND": 20820,
      [mvn]             "VUV": 90.199997,
      [mvn]             "WST": 2.247475,
      [mvn]             "XAF": 497.898987,
      [mvn]             "XCD": 2.7,
      [mvn]             "XDR": 0.652794,
      [mvn]             "XOF": 498.399994,
      [mvn]             "XPF": 90.639999,
      [mvn]             "YER": 216.005005,
      [mvn]             "ZAR": 7.5688,
      [mvn]             "ZMK": 5271.5,
      [mvn]             "ZWD": 378.700012,
      [mvn]             "ZWL": 322.355011
      [mvn]           }
      [mvn]         }
      [mvn]     /solr/configs/conf1/schema.xml (0)
      [mvn]     DATA: ...supressed...
      [mvn]   /solr/live_nodes (4)
      [mvn]    /solr/live_nodes/127.0.0.1:38457_solr (0)
      [mvn]    /solr/live_nodes/127.0.0.1:32689_solr (0)
      [mvn]    /solr/live_nodes/127.0.0.1:11854_solr (0)
      [mvn]    /solr/live_nodes/127.0.0.1:62864_solr (0)
      [mvn]   /solr/overseer (3)
      [mvn]   DATA:
      [mvn]       
      [mvn]    /solr/overseer/queue (0)
      [mvn]    DATA:
      [mvn]        
      [mvn]    /solr/overseer/queue-work (0)
      [mvn]    DATA:
      [mvn]        
      [mvn]    /solr/overseer/collection-queue-work (0)
      [mvn]    DATA:
      [mvn]        
      [mvn]   /solr/overseer_elect (2)
      [mvn]    /solr/overseer_elect/election (4)
      [mvn]     /solr/overseer_elect/election/88353118767087619-127.0.0.1:62864_solr-n_0000000001 (0)
      [mvn]     /solr/overseer_elect/election/88353118767087621-127.0.0.1:11854_solr-n_0000000003 (0)
      [mvn]     /solr/overseer_elect/election/88353118767087620-127.0.0.1:32689_solr-n_0000000002 (0)
      [mvn]     /solr/overseer_elect/election/88353118767087618-127.0.0.1:38457_solr-n_0000000000 (0)
      [mvn]    /solr/overseer_elect/leader (0)
      [mvn]    DATA:
      [mvn]        {"id":"88353118767087618-127.0.0.1:38457_solr-n_0000000000"}
      [mvn]   /solr/collections (2)
      [mvn]    /solr/collections/collection1 (3)
      [mvn]    DATA:
      [mvn]        {"configName":"conf1"}
      [mvn]     /solr/collections/collection1/shards (0)
      [mvn]     /solr/collections/collection1/leader_elect (2)
      [mvn]      /solr/collections/collection1/leader_elect/shard1 (1)
      [mvn]       /solr/collections/collection1/leader_elect/shard1/election (2)
      [mvn]        /solr/collections/collection1/leader_elect/shard1/election/88353118767087621-127.0.0.1:11854_solr_collection1-n_0000000001 (0)
      [mvn]        /solr/collections/collection1/leader_elect/shard1/election/88353118767087619-127.0.0.1:62864_solr_collection1-n_0000000000 (0)
      [mvn]      /solr/collections/collection1/leader_elect/shard2 (1)
      [mvn]       /solr/collections/collection1/leader_elect/shard2/election (1)
      [mvn]        /solr/collections/collection1/leader_elect/shard2/election/88353118767087620-127.0.0.1:32689_solr_collection1-n_0000000000 (0)
      [mvn]     /solr/collections/collection1/leaders (2)
      [mvn]      /solr/collections/collection1/leaders/shard1 (0)
      [mvn]      DATA:
      [mvn]          {
      [mvn]            "core":"collection1",
      [mvn]            "node_name":"127.0.0.1:62864_solr",
      [mvn]            "base_url":"http://127.0.0.1:62864/solr"}
      [mvn]      /solr/collections/collection1/leaders/shard2 (0)
      [mvn]      DATA:
      [mvn]          {
      [mvn]            "core":"collection1",
      [mvn]            "node_name":"127.0.0.1:32689_solr",
      [mvn]            "base_url":"http://127.0.0.1:32689/solr"}
      [mvn]    /solr/collections/control_collection (3)
      [mvn]    DATA:
      [mvn]        {"configName":"conf1"}
      [mvn]     /solr/collections/control_collection/shards (0)
      [mvn]     /solr/collections/control_collection/leader_elect (1)
      [mvn]      /solr/collections/control_collection/leader_elect/control_shard (1)
      [mvn]       /solr/collections/control_collection/leader_elect/control_shard/election (1)
      [mvn]        /solr/collections/control_collection/leader_elect/control_shard/election/88353118767087618-127.0.0.1:38457_solr_collection1-n_0000000000 (0)
      [mvn]     /solr/collections/control_collection/leaders (1)
      [mvn]      /solr/collections/control_collection/leaders/control_shard (0)
      [mvn]      DATA:
      [mvn]          {
      [mvn]            "core":"collection1",
      [mvn]            "node_name":"127.0.0.1:38457_solr",
      [mvn]            "base_url":"http://127.0.0.1:38457/solr"}
      [mvn]   /solr/clusterstate.json (0)
      [mvn]   DATA:
      [mvn]       {
      [mvn]         "collection1":{
      [mvn]           "shard1":{
      [mvn]             "range":"80000000-ffffffff",
      [mvn]             "replicas":{
      [mvn]               "127.0.0.1:62864_solr_collection1":{
      [mvn]                 "shard":"shard1",
      [mvn]                 "roles":null,
      [mvn]                 "state":"active",
      [mvn]                 "core":"collection1",
      [mvn]                 "collection":"collection1",
      [mvn]                 "node_name":"127.0.0.1:62864_solr",
      [mvn]                 "base_url":"http://127.0.0.1:62864/solr",
      [mvn]                 "leader":"true"},
      [mvn]               "127.0.0.1:11854_solr_collection1":{
      [mvn]                 "shard":"shard1",
      [mvn]                 "roles":null,
      [mvn]                 "state":"active",
      [mvn]                 "core":"collection1",
      [mvn]                 "collection":"collection1",
      [mvn]                 "node_name":"127.0.0.1:11854_solr",
      [mvn]                 "base_url":"http://127.0.0.1:11854/solr"}}},
      [mvn]           "shard2":{
      [mvn]             "range":"0-7fffffff",
      [mvn]             "replicas":{"127.0.0.1:32689_solr_collection1":{
      [mvn]                 "shard":"shard2",
      [mvn]                 "roles":null,
      [mvn]                 "state":"active",
      [mvn]                 "core":"collection1",
      [mvn]                 "collection":"collection1",
      [mvn]                 "node_name":"127.0.0.1:32689_solr",
      [mvn]                 "base_url":"http://127.0.0.1:32689/solr",
      [mvn]                 "leader":"true"}}}},
      [mvn]         "control_collection":{"control_shard":{"replicas":{"127.0.0.1:38457_solr_collection1":{
      [mvn]                 "shard":"control_shard",
      [mvn]                 "roles":null,
      [mvn]                 "state":"active",
      [mvn]                 "core":"collection1",
      [mvn]                 "collection":"control_collection",
      [mvn]                 "node_name":"127.0.0.1:38457_solr",
      [mvn]                 "base_url":"http://127.0.0.1:38457/solr",
      [mvn]                 "leader":"true"}}}}}
      [mvn]  /zookeeper (1)
      [mvn]  DATA:
      [mvn]      
      [mvn] 
      [mvn] 29514 T1185 oasc.SolrException.log SEVERE Sync Failed
      [mvn] 29538 T1186 oasc.SolrException.log SEVERE Sync Failed
      [mvn] / (2)
      [mvn] DATA:
      [mvn]     
      [mvn]  /solr (6)
      [mvn]   /solr/configs (1)
      [mvn]    /solr/configs/conf1 (9)
      [mvn]     /solr/configs/conf1/mapping-ISOLatin1Accent.txt (0)
      [mvn]     DATA: ...supressed...
      [mvn]     /solr/configs/conf1/currency.xml (0)
      [mvn]     DATA: ...supressed...
      [mvn]     /solr/configs/conf1/protwords.txt (0)
      [mvn]     DATA: ...supressed...
      [mvn]     /solr/configs/conf1/synonyms.txt (0)
      [mvn]     DATA: ...supressed...
      [mvn]     /solr/configs/conf1/old_synonyms.txt (0)
      [mvn]     DATA: ...supressed...
      [mvn]     /solr/configs/conf1/solrconfig.xml (0)
      [mvn]     DATA: ...supressed...
      [mvn]     /solr/configs/conf1/stopwords.txt (0)
      [mvn]     DATA: ...supressed...
      [mvn]     /solr/configs/conf1/open-exchange-rates.json (0)
      [mvn]     DATA:
      [mvn]         {
      [mvn]           "disclaimer": "This data is collected from various providers and provided free of charge for informational purposes only, with no guarantee whatsoever of accuracy, validity, availability or fitness for any purpose; use at your own risk. Other than that - have fun, and please share/watch/fork if you think data like this should be free!",
      [mvn]           "license": "Data collected from various providers with public-facing APIs; copyright may apply; not for resale; no warranties given.",
      [mvn]           "timestamp": 1332070464,
      [mvn]           "base": "USD",
      [mvn]           "rates": {
      [mvn]             "AED": 3.6732,
      [mvn]             "AFN": 48.299999,
      [mvn]             "ALL": 105.919998,
      [mvn]             "AMD": 388.890015,
      [mvn]             "ANG": 1.79,
      [mvn]             "AOA": 94.769997,
      [mvn]             "ARS": 4.35,
      [mvn]             "AUD": 0.943931,
      [mvn]             "AWG": 1.7899,
      [mvn]             "AZN": 0.7863,
      [mvn]             "BAM": 1.48775,
      [mvn]             "BBD": 2,
      [mvn]             "BDT": 82,
      [mvn]             "BGN": 1.4962,
      [mvn]             "BHD": 0.37703,
      [mvn]             "BIF": 1304.170044,
      [mvn]             "BMD": 1,
      [mvn]             "BND": 1.2575,
      [mvn]             "BOB": 6.91,
      [mvn]             "BRL": 1.8003,
      [mvn]             "BSD": 1,
      [mvn]             "BTN": 50.185001,
      [mvn]             "BWP": 7.2307,
      [mvn]             "BYR": 8150,
      [mvn]             "BZD": 1.9135,
      [mvn]             "CAD": 0.9921,
      [mvn]             "CDF": 917.276917,
      [mvn]             "CHF": 0.9164,
      [mvn]             "CLF": 0.02146,
      [mvn]             "CLP": 482.75,
      [mvn]             "CNY": 6.3239,
      [mvn]             "COP": 1760,
      [mvn]             "CRC": 507.600006,
      [mvn]             "CUP": 1,
      [mvn]             "CVE": 84.190002,
      [mvn]             "CZK": 18.606001,
      [mvn]             "DJF": 179.490005,
      [mvn]             "DKK": 5.64424,
      [mvn]             "DOP": 39.025002,
      [mvn]             "DZD": 74.544998,
      [mvn]             "EGP": 6.0385,
      [mvn]             "ETB": 17.720449,
      [mvn]             "EUR": 0.758956,
      [mvn]             "FJD": 1.7734,
      [mvn]             "FKP": 0.6316,
      [mvn]             "GBP": 0.631373,
      [mvn]             "GEL": 1.6469,
      [mvn]             "GHS": 1.7455,
      [mvn]             "GIP": 0.63165,
      [mvn]             "GMD": 31.5,
      [mvn]             "GNF": 7100,
      [mvn]             "GTQ": 7.6975,
      [mvn]             "GYD": 203.699997,
      [mvn]             "HKD": 7.76306,
      [mvn]             "HNL": 19.055,
      [mvn]             "HRK": 5.7333,
      [mvn]             "HTG": 41,
      [mvn]             "HUF": 219.850006,
      [mvn]             "IDR": 9118,
      [mvn]             "IEP": 0.5978,
      [mvn]             "ILS": 3.7542,
      [mvn]             "INR": 50.165001,
      [mvn]             "IQD": 1165.5,
      [mvn]             "IRR": 12308,
      [mvn]             "ISK": 127.440002,
      [mvn]             "JMD": 86.699997,
      [mvn]             "JOD": 0.7095,
      [mvn]             "JPY": 83.445,
      [mvn]             "KES": 83.18,
      [mvn]             "KGS": 46.699402,
      [mvn]             "KHR": 4010.300049,
      [mvn]             "KMF": 373.424255,
      [mvn]             "KPW": 900,
      [mvn]             "KRW": 1125.849976,
      [mvn]             "KWD": 0.27925,
      [mvn]             "KZT": 147.690002,
      [mvn]             "LAK": 7993.799805,
      [mvn]             "LBP": 1504,
      [mvn]             "LKR": 125.224998,
      [mvn]             "LRD": 73.459999,
      [mvn]             "LSL": 7.5768,
      [mvn]             "LTL": 2.6219,
      [mvn]             "LVL": 0.5291,
      [mvn]             "LYD": 1.2572,
      [mvn]             "MAD": 8.4611,
      [mvn]             "MDL": 11.89,
      [mvn]             "MGA": 2155,
      [mvn]             "MKD": 46.705002,
      [mvn]             "MMK": 6.51,
      [mvn]             "MNT": 1322.5,
      [mvn]             "MOP": 7.9958,
      [mvn]             "MRO": 293,
      [mvn]             "MUR": 29.110001,
      [mvn]             "MVR": 15.36,
      [mvn]             "MWK": 165.206207,
      [mvn]             "MXN": 12.6745,
      [mvn]             "MYR": 3.0575,
      [mvn]             "MZN": 27.200001,
      [mvn]             "NAD": 7.58,
      [mvn]             "NGN": 157.600006,
      [mvn]             "NIO": 23.215,
      [mvn]             "NOK": 5.73163,
      [mvn]             "NPR": 80.620003,
      [mvn]             "NZD": 1.212269,
      [mvn]             "OMR": 0.38485,
      [mvn]             "PAB": 1,
      [mvn]             "PEN": 2.674,
      [mvn]             "PGK": 2.0627,
      [mvn]             "PHP": 43.02,
      [mvn]             "PKR": 90.800003,
      [mvn]             "PLN": 3.1285,
      [mvn]             "PYG": 4245,
      [mvn]             "QAR": 3.6415,
      [mvn]             "RON": 3.3256,
      [mvn]             "RSD": 84.100502,
      [mvn]             "RUB": 29.2342,
      [mvn]             "RWF": 606.717468,
      [mvn]             "SAR": 3.7505,
      [mvn]             "SBD": 7.075973,
      [mvn]             "SCR": 14.0447,
      [mvn]             "SDG": 2.6765,
      [mvn]             "SEK": 6.74525,
      [mvn]             "SGD": 1.258,
      [mvn]             "SHP": 0.63165,
      [mvn]             "SLL": 4364.5,
      [mvn]             "SOS": 1629,
      [mvn]             "SRD": 3.2875,
      [mvn]             "STD": 18650,
      [mvn]             "SVC": 8.7475,
      [mvn]             "SYP": 57.450001,
      [mvn]             "SZL": 7.5752,
      [mvn]             "THB": 30.700001,
      [mvn]             "TJS": 4.7588,
      [mvn]             "TMT": 2.85,
      [mvn]             "TND": 1.5178,
      [mvn]             "TOP": 1.693601,
      [mvn]             "TRY": 1.796,
      [mvn]             "TTD": 6.40015,
      [mvn]             "TWD": 29.532,
      [mvn]             "TZS": 1595,
      [mvn]             "UAH": 8.029,
      [mvn]             "UGX": 2481.699951,
      [mvn]             "USD": 1,
      [mvn]             "UYU": 19.469999,
      [mvn]             "UZS": 1835.75,
      [mvn]             "VEF": 4.295,
      [mvn]             "VND": 20820,
      [mvn]             "VUV": 90.199997,
      [mvn]             "WST": 2.247475,
      [mvn]             "XAF": 497.898987,
      [mvn]             "XCD": 2.7,
      [mvn]             "XDR": 0.652794,
      [mvn]             "XOF": 498.399994,
      [mvn]             "XPF": 90.639999,
      [mvn]             "YER": 216.005005,
      [mvn]             "ZAR": 7.5688,
      [mvn]             "ZMK": 5271.5,
      [mvn]             "ZWD": 378.700012,
      [mvn]             "ZWL": 322.355011
      [mvn]           }
      [mvn]         }
      [mvn]     /solr/configs/conf1/schema.xml (0)
      [mvn]     DATA: ...supressed...
      [mvn]   /solr/live_nodes (4)
      [mvn]    /solr/live_nodes/127.0.0.1:38457_solr (0)
      [mvn]    /solr/live_nodes/127.0.0.1:32689_solr (0)
      [mvn]    /solr/live_nodes/127.0.0.1:11854_solr (0)
      [mvn]    /solr/live_nodes/127.0.0.1:62864_solr (0)
      [mvn]   /solr/overseer (3)
      [mvn]   DATA:
      [mvn]       
      [mvn]    /solr/overseer/queue (0)
      [mvn]    DATA:
      [mvn]        
      [mvn]    /solr/overseer/queue-work (0)
      [mvn]    DATA:
      [mvn]        
      [mvn]    /solr/overseer/collection-queue-work (0)
      [mvn]    DATA:
      [mvn]        
      [mvn]   /solr/overseer_elect (2)
      [mvn]    /solr/overseer_elect/election (4)
      [mvn]     /solr/overseer_elect/election/88353118767087619-127.0.0.1:62864_solr-n_0000000001 (0)
      [mvn]     /solr/overseer_elect/election/88353118767087621-127.0.0.1:11854_solr-n_0000000003 (0)
      [mvn]     /solr/overseer_elect/election/88353118767087620-127.0.0.1:32689_solr-n_0000000002 (0)
      [mvn]     /solr/overseer_elect/election/88353118767087618-127.0.0.1:38457_solr-n_0000000000 (0)
      [mvn]    /solr/overseer_elect/leader (0)
      [mvn]    DATA:
      [mvn]        {"id":"88353118767087618-127.0.0.1:38457_solr-n_0000000000"}
      [mvn]   /solr/collections (6)
      [mvn]    /solr/collections/collection2 (2)
      [mvn]    DATA:
      [mvn]        {"configName":"conf1"}
      [mvn]     /solr/collections/collection2/leader_elect (2)
      [mvn]      /solr/collections/collection2/leader_elect/shard1 (1)
      [mvn]       /solr/collections/collection2/leader_elect/shard1/election (2)
      [mvn]        /solr/collections/collection2/leader_elect/shard1/election/88353118767087619-127.0.0.1:62864_solr_collection2-n_0000000000 (0)
      [mvn]        /solr/collections/collection2/leader_elect/shard1/election/88353118767087621-127.0.0.1:11854_solr_collection2-n_0000000001 (0)
      [mvn]      /solr/collections/collection2/leader_elect/shard2 (1)
      [mvn]       /solr/collections/collection2/leader_elect/shard2/election (1)
      [mvn]        /solr/collections/collection2/leader_elect/shard2/election/88353118767087620-127.0.0.1:32689_solr_collection2-n_0000000000 (0)
      [mvn]     /solr/collections/collection2/leaders (2)
      [mvn]      /solr/collections/collection2/leaders/shard1 (0)
      [mvn]      DATA:
      [mvn]          {
      [mvn]            "core":"collection2",
      [mvn]            "node_name":"127.0.0.1:62864_solr",
      [mvn]            "base_url":"http://127.0.0.1:62864/solr"}
      [mvn]      /solr/collections/collection2/leaders/shard2 (0)
      [mvn]      DATA:
      [mvn]          {
      [mvn]            "core":"collection2",
      [mvn]            "node_name":"127.0.0.1:32689_solr",
      [mvn]            "base_url":"http://127.0.0.1:32689/solr"}
      [mvn]    /solr/collections/collection3 (2)
      [mvn]    DATA:
      [mvn]        {"configName":"conf1"}
      [mvn]     /solr/collections/collection3/leader_elect (2)
      [mvn]      /solr/collections/collection3/leader_elect/shard1 (1)
      [mvn]       /solr/collections/collection3/leader_elect/shard1/election (2)
      [mvn]        /solr/collections/collection3/leader_elect/shard1/election/88353118767087619-127.0.0.1:62864_solr_collection3-n_0000000000 (0)
      [mvn]        /solr/collections/collection3/leader_elect/shard1/election/88353118767087621-127.0.0.1:11854_solr_collection3-n_0000000001 (0)
      [mvn]      /solr/collections/collection3/leader_elect/shard2 (1)
      [mvn]       /solr/collections/collection3/leader_elect/shard2/election (1)
      [mvn]        /solr/collections/collection3/leader_elect/shard2/election/88353118767087620-127.0.0.1:32689_solr_collection3-n_0000000000 (0)
      [mvn]     /solr/collections/collection3/leaders (2)
      [mvn]      /solr/collections/collection3/leaders/shard1 (0)
      [mvn]      DATA:
      [mvn]          {
      [mvn]            "core":"collection3",
      [mvn]            "node_name":"127.0.0.1:62864_solr",
      [mvn]            "base_url":"http://127.0.0.1:62864/solr"}
      [mvn]      /solr/collections/collection3/leaders/shard2 (0)
      [mvn]      DATA:
      [mvn]          {
      [mvn]            "core":"collection3",
      [mvn]            "node_name":"127.0.0.1:32689_solr",
      [mvn]            "base_url":"http://127.0.0.1:32689/solr"}
      [mvn]    /solr/collections/collection1 (3)
      [mvn]    DATA:
      [mvn]        {"configName":"conf1"}
      [mvn]     /solr/collections/collection1/shards (0)
      [mvn]     /solr/collections/collection1/leader_elect (2)
      [mvn]      /solr/collections/collection1/leader_elect/shard1 (1)
      [mvn]       /solr/collections/collection1/leader_elect/shard1/election (2)
      [mvn]        /solr/collections/collection1/leader_elect/shard1/election/88353118767087621-127.0.0.1:11854_solr_collection1-n_0000000001 (0)
      [mvn]        /solr/collections/collection1/leader_elect/shard1/election/88353118767087619-127.0.0.1:62864_solr_collection1-n_0000000000 (0)
      [mvn]      /solr/collections/collection1/leader_elect/shard2 (1)
      [mvn]       /solr/collections/collection1/leader_elect/shard2/election (1)
      [mvn]        /solr/collections/collection1/leader_elect/shard2/election/88353118767087620-127.0.0.1:32689_solr_collection1-n_0000000000 (0)
      [mvn]     /solr/collections/collection1/leaders (2)
      [mvn]      /solr/collections/collection1/leaders/shard1 (0)
      [mvn]      DATA:
      [mvn]          {
      [mvn]            "core":"collection1",
      [mvn]            "node_name":"127.0.0.1:62864_solr",
      [mvn]            "base_url":"http://127.0.0.1:62864/solr"}
      [mvn]      /solr/collections/collection1/leaders/shard2 (0)
      [mvn]      DATA:
      [mvn]          {
      [mvn]            "core":"collection1",
      [mvn]            "node_name":"127.0.0.1:32689_solr",
      [mvn]            "base_url":"http://127.0.0.1:32689/solr"}
      [mvn]    /solr/collections/oneInstanceCollection2 (2)
      [mvn]    DATA:
      [mvn]        {"configName":"conf1"}
      [mvn]     /solr/collections/oneInstanceCollection2/leader_elect (2)
      [mvn]      /solr/collections/oneInstanceCollection2/leader_elect/slice2 (1)
      [mvn]       /solr/collections/oneInstanceCollection2/leader_elect/slice2/election (2)
      [mvn]        /solr/collections/oneInstanceCollection2/leader_elect/slice2/election/88353118767087619-127.0.0.1:62864_solr_oneInstanceCollection23-n_0000000001 (0)
      [mvn]        /solr/collections/oneInstanceCollection2/leader_elect/slice2/election/88353118767087619-127.0.0.1:62864_solr_oneInstanceCollection22-n_0000000000 (0)
      [mvn]      /solr/collections/oneInstanceCollection2/leader_elect/slice1 (1)
      [mvn]       /solr/collections/oneInstanceCollection2/leader_elect/slice1/election (2)
      [mvn]        /solr/collections/oneInstanceCollection2/leader_elect/slice1/election/88353118767087619-127.0.0.1:62864_solr_oneInstanceCollection21-n_0000000000 (0)
      [mvn]        /solr/collections/oneInstanceCollection2/leader_elect/slice1/election/88353118767087619-127.0.0.1:62864_solr_oneInstanceCollection24-n_0000000001 (0)
      [mvn]     /solr/collections/oneInstanceCollection2/leaders (2)
      [mvn]      /solr/collections/oneInstanceCollection2/leaders/slice2 (0)
      [mvn]      DATA:
      [mvn]          {
      [mvn]            "core":"oneInstanceCollection22",
      [mvn]            "node_name":"127.0.0.1:62864_solr",
      [mvn]            "base_url":"http://127.0.0.1:62864/solr"}
      [mvn]      /solr/collections/oneInstanceCollection2/leaders/slice1 (0)
      [mvn]      DATA:
      [mvn]          {
      [mvn]            "core":"oneInstanceCollection21",
      [mvn]            "node_name":"127.0.0.1:62864_solr",
      [mvn]            "base_url":"http://127.0.0.1:62864/solr"}
      [mvn]    /solr/collections/oneInstanceCollection (2)
      [mvn]    DATA:
      [mvn]        {"configName":"conf1"}
      [mvn]     /solr/collections/oneInstanceCollection/leader_elect (2)
      [mvn]      /solr/collections/oneInstanceCollection/leader_elect/shard1 (1)
      [mvn]       /solr/collections/oneInstanceCollection/leader_elect/shard1/election (2)
      [mvn]        /solr/collections/oneInstanceCollection/leader_elect/shard1/election/88353118767087619-127.0.0.1:62864_solr_oneInstanceCollection3-n_0000000001 (0)
      [mvn]        /solr/collections/oneInstanceCollection/leader_elect/shard1/election/88353118767087619-127.0.0.1:62864_solr_oneInstanceCollection4-n_0000000000 (0)
      [mvn]      /solr/collections/oneInstanceCollection/leader_elect/shard2 (1)
      [mvn]       /solr/collections/oneInstanceCollection/leader_elect/shard2/election (2)
      [mvn]        /solr/collections/oneInstanceCollection/leader_elect/shard2/election/88353118767087619-127.0.0.1:62864_solr_oneInstanceCollection2-n_0000000001 (0)
      [mvn]        /solr/collections/oneInstanceCollection/leader_elect/shard2/election/88353118767087619-127.0.0.1:62864_solr_oneInstanceCollection1-n_0000000000 (0)
      [mvn]     /solr/collections/oneInstanceCollection/leaders (2)
      [mvn]      /solr/collections/oneInstanceCollection/leaders/shard1 (0)
      [mvn]      DATA:
      [mvn]          {
      [mvn]            "core":"oneInstanceCollection4",
      [mvn]            "node_name":"127.0.0.1:62864_solr",
      [mvn]            "base_url":"http://127.0.0.1:62864/solr"}
      [mvn]      /solr/collections/oneInstanceCollection/leaders/shard2 (0)
      [mvn]      DATA:
      [mvn]          {
      [mvn]            "core":"oneInstanceCollection1",
      [mvn]            "node_name":"127.0.0.1:62864_solr",
      [mvn]            "base_url":"http://127.0.0.1:62864/solr"}
      [mvn]    /solr/collections/control_collection (3)
      [mvn]    DATA:
      [mvn]        {"configName":"conf1"}
      [mvn]     /solr/collections/control_collection/shards (0)
      [mvn]     /solr/collections/control_collection/leader_elect (1)
      [mvn]      /solr/collections/control_collection/leader_elect/control_shard (1)
      [mvn]       /solr/collections/control_collection/leader_elect/control_shard/election (1)
      [mvn]        /solr/collections/control_collection/leader_elect/control_shard/election/88353118767087618-127.0.0.1:38457_solr_collection1-n_0000000000 (0)
      [mvn]     /solr/collections/control_collection/leaders (1)
      [mvn]      /solr/collections/control_collection/leaders/control_shard (0)
      [mvn]      DATA:
      [mvn]          {
      [mvn]            "core":"collection1",
      [mvn]            "node_name":"127.0.0.1:38457_solr",
      [mvn]            "base_url":"http://127.0.0.1:38457/solr"}
      [mvn]   /solr/clusterstate.json (0)
      [mvn]   DATA:
      [mvn]       {
      [mvn]         "collection2":{
      [mvn]           "shard1":{
      [mvn]             "range":"80000000-ffffffff",
      [mvn]             "replicas":{
      [mvn]               "127.0.0.1:62864_solr_collection2":{
      [mvn]                 "shard":"shard1",
      [mvn]                 "roles":null,
      [mvn]                 "state":"active",
      [mvn]                 "core":"collection2",
      [mvn]                 "collection":"collection2",
      [mvn]                 "node_name":"127.0.0.1:62864_solr",
      [mvn]                 "base_url":"http://127.0.0.1:62864/solr",
      [mvn]                 "leader":"true"},
      [mvn]               "127.0.0.1:11854_solr_collection2":{
      [mvn]                 "shard":"shard1",
      [mvn]                 "roles":null,
      [mvn]                 "state":"active",
      [mvn]                 "core":"collection2",
      [mvn]                 "collection":"collection2",
      [mvn]                 "node_name":"127.0.0.1:11854_solr",
      [mvn]                 "base_url":"http://127.0.0.1:11854/solr"}}},
      [mvn]           "shard2":{
      [mvn]             "range":"0-7fffffff",
      [mvn]             "replicas":{"127.0.0.1:32689_solr_collection2":{
      [mvn]                 "shard":"shard2",
      [mvn]                 "roles":null,
      [mvn]                 "state":"active",
      [mvn]                 "core":"collection2",
      [mvn]                 "collection":"collection2",
      [mvn]                 "node_name":"127.0.0.1:32689_solr",
      [mvn]                 "base_url":"http://127.0.0.1:32689/solr",
      [mvn]                 "leader":"true"}}}},
      [mvn]         "collection3":{
      [mvn]           "shard1":{
      [mvn]             "range":"80000000-ffffffff",
      [mvn]             "replicas":{
      [mvn]               "127.0.0.1:62864_solr_collection3":{
      [mvn]                 "shard":"shard1",
      [mvn]                 "roles":null,
      [mvn]                 "state":"active",
      [mvn]                 "core":"collection3",
      [mvn]                 "collection":"collection3",
      [mvn]                 "node_name":"127.0.0.1:62864_solr",
      [mvn]                 "base_url":"http://127.0.0.1:62864/solr",
      [mvn]                 "leader":"true"},
      [mvn]               "127.0.0.1:11854_solr_collection3":{
      [mvn]                 "shard":"shard1",
      [mvn]                 "roles":null,
      [mvn]                 "state":"active",
      [mvn]                 "core":"collection3",
      [mvn]                 "collection":"collection3",
      [mvn]                 "node_name":"127.0.0.1:11854_solr",
      [mvn]                 "base_url":"http://127.0.0.1:11854/solr"}}},
      [mvn]           "shard2":{
      [mvn]             "range":"0-7fffffff",
      [mvn]             "replicas":{"127.0.0.1:32689_solr_collection3":{
      [mvn]                 "shard":"shard2",
      [mvn]                 "roles":null,
      [mvn]                 "state":"active",
      [mvn]                 "core":"collection3",
      [mvn]                 "collection":"collection3",
      [mvn]                 "node_name":"127.0.0.1:32689_solr",
      [mvn]                 "base_url":"http://127.0.0.1:32689/solr",
      [mvn]                 "leader":"true"}}}},
      [mvn]         "collection1":{
      [mvn]           "shard1":{
      [mvn]             "range":"80000000-ffffffff",
      [mvn]             "replicas":{
      [mvn]               "127.0.0.1:62864_solr_collection1":{
      [mvn]                 "shard":"shard1",
      [mvn]                 "roles":null,
      [mvn]                 "state":"active",
      [mvn]                 "core":"collection1",
      [mvn]                 "collection":"collection1",
      [mvn]                 "node_name":"127.0.0.1:62864_solr",
      [mvn]                 "base_url":"http://127.0.0.1:62864/solr",
      [mvn]                 "leader":"true"},
      [mvn]               "127.0.0.1:11854_solr_collection1":{
      [mvn]                 "shard":"shard1",
      [mvn]                 "roles":null,
      [mvn]                 "state":"active",
      [mvn]                 "core":"collection1",
      [mvn]                 "collection":"collection1",
      [mvn]                 "node_name":"127.0.0.1:11854_solr",
      [mvn]                 "base_url":"http://127.0.0.1:11854/solr"}}},
      [mvn]           "shard2":{
      [mvn]             "range":"0-7fffffff",
      [mvn]             "replicas":{"127.0.0.1:32689_solr_collection1":{
      [mvn]                 "shard":"shard2",
      [mvn]                 "roles":null,
      [mvn]                 "state":"active",
      [mvn]                 "core":"collection1",
      [mvn]                 "collection":"collection1",
      [mvn]                 "node_name":"127.0.0.1:32689_solr",
      [mvn]                 "base_url":"http://127.0.0.1:32689/solr",
      [mvn]                 "leader":"true"}}}},
      [mvn]         "oneInstanceCollection":{
      [mvn]           "shard1":{
      [mvn]             "range":"80000000-ffffffff",
      [mvn]             "replicas":{
      [mvn]               "127.0.0.1:62864_solr_oneInstanceCollection4":{
      [mvn]                 "shard":"shard1",
      [mvn]                 "roles":"none",
      [mvn]                 "state":"active",
      [mvn]                 "core":"oneInstanceCollection4",
      [mvn]                 "collection":"oneInstanceCollection",
      [mvn]                 "node_name":"127.0.0.1:62864_solr",
      [mvn]                 "base_url":"http://127.0.0.1:62864/solr",
      [mvn]                 "leader":"true"},
      [mvn]               "127.0.0.1:62864_solr_oneInstanceCollection3":{
      [mvn]                 "shard":"shard1",
      [mvn]                 "roles":"none",
      [mvn]                 "state":"active",
      [mvn]                 "core":"oneInstanceCollection3",
      [mvn]                 "collection":"oneInstanceCollection",
      [mvn]                 "node_name":"127.0.0.1:62864_solr",
      [mvn]                 "base_url":"http://127.0.0.1:62864/solr"}}},
      [mvn]           "shard2":{
      [mvn]             "range":"0-7fffffff",
      [mvn]             "replicas":{
      [mvn]               "127.0.0.1:62864_solr_oneInstanceCollection1":{
      [mvn]                 "shard":"shard2",
      [mvn]                 "roles":"none",
      [mvn]                 "state":"active",
      [mvn]                 "core":"oneInstanceCollection1",
      [mvn]                 "collection":"oneInstanceCollection",
      [mvn]                 "node_name":"127.0.0.1:62864_solr",
      [mvn]                 "base_url":"http://127.0.0.1:62864/solr",
      [mvn]                 "leader":"true"},
      [mvn]               "127.0.0.1:62864_solr_oneInstanceCollection2":{
      [mvn]                 "shard":"shard2",
      [mvn]                 "roles":"none",
      [mvn]                 "state":"active",
      [mvn]                 "core":"oneInstanceCollection2",
      [mvn]                 "collection":"oneInstanceCollection",
      [mvn]                 "node_name":"127.0.0.1:62864_solr",
      [mvn]                 "base_url":"http://127.0.0.1:62864/solr"}}}},
      [mvn]         "control_collection":{"control_shard":{"replicas":{"127.0.0.1:38457_solr_collection1":{
      [mvn]                 "shard":"control_shard",
      [mvn]                 "roles":null,
      [mvn]                 "state":"active",
      [mvn]                 "core":"collection1",
      [mvn]                 "collection":"control_collection",
      [mvn]                 "node_name":"127.0.0.1:38457_solr",
      [mvn]                 "base_url":"http://127.0.0.1:38457/solr",
      [mvn]                 "leader":"true"}}}},
      [mvn]         "oneInstanceCollection2":{
      [mvn]           "slice1":{"replicas":{
      [mvn]               "127.0.0.1:62864_solr_oneInstanceCollection21":{
      [mvn]                 "shard":"slice1",
      [mvn]                 "roles":"none",
      [mvn]                 "state":"active",
      [mvn]                 "core":"oneInstanceCollection21",
      [mvn]                 "collection":"oneInstanceCollection2",
      [mvn]                 "node_name":"127.0.0.1:62864_solr",
      [mvn]                 "base_url":"http://127.0.0.1:62864/solr",
      [mvn]                 "leader":"true"},
      [mvn]               "127.0.0.1:62864_solr_oneInstanceCollection24":{
      [mvn]                 "shard":"slice1",
      [mvn]                 "roles":"none",
      [mvn]                 "state":"active",


[...truncated too long message...]

udson-slave/workspace/Lucene-Solr-Maven-trunk/maven-build/solr/contrib/velocity/src/main/resources
      [mvn] [INFO] Copying 3 resources
      [mvn] [INFO] [compiler:compile {execution: default-compile}]
      [mvn] [INFO] Compiling 4 source files to /usr/home/hudson/hudson-slave/workspace/Lucene-Solr-Maven-trunk/maven-build/solr/contrib/velocity/target/classes
      [mvn] [INFO] [bundle:manifest {execution: bundle-manifest}]
      [mvn] [debug] execute contextualize
      [mvn] [INFO] [resources:testResources {execution: default-testResources}]
      [mvn] [INFO] Using 'UTF-8' encoding to copy filtered resources.
      [mvn] [INFO] Copying 3 resources
      [mvn] [INFO] Copying 1 resource
      [mvn] [INFO] Copying 3 resources
      [mvn] [INFO] [compiler:testCompile {execution: default-testCompile}]
      [mvn] [INFO] Compiling 1 source file to /usr/home/hudson/hudson-slave/workspace/Lucene-Solr-Maven-trunk/maven-build/solr/contrib/velocity/target/test-classes
      [mvn] [INFO] [surefire:test {execution: default-test}]
      [mvn] [INFO] Surefire report directory: /usr/home/hudson/hudson-slave/workspace/Lucene-Solr-Maven-trunk/maven-build/solr/contrib/velocity/target/surefire-reports
      [mvn] 
      [mvn] -------------------------------------------------------
      [mvn]  T E S T S
      [mvn] -------------------------------------------------------
      [mvn] Running org.apache.solr.velocity.VelocityResponseWriterTest
      [mvn] Creating dataDir: /usr/home/hudson/hudson-slave/workspace/Lucene-Solr-Maven-trunk/maven-build/solr/contrib/velocity/target/test/./solrtest-VelocityResponseWriterTest-1348162888490
      [mvn] Tests run: 1, Failures: 0, Errors: 0, Skipped: 0, Time elapsed: 1.686 sec
      [mvn] 
      [mvn] Results :
      [mvn] 
      [mvn] Tests run: 1, Failures: 0, Errors: 0, Skipped: 0
      [mvn] 
      [mvn] [INFO] [jar:jar {execution: default-jar}]
      [mvn] [INFO] Building jar: /usr/home/hudson/hudson-slave/workspace/Lucene-Solr-Maven-trunk/maven-build/solr/contrib/velocity/target/solr-velocity-5.0-SNAPSHOT.jar
      [mvn] [INFO] [install:install {execution: default-install}]
      [mvn] [INFO] Installing /usr/home/hudson/hudson-slave/workspace/Lucene-Solr-Maven-trunk/maven-build/solr/contrib/velocity/target/solr-velocity-5.0-SNAPSHOT.jar to /home/hudson/.m2/repository/org/apache/solr/solr-velocity/5.0-SNAPSHOT/solr-velocity-5.0-SNAPSHOT.jar
      [mvn] [INFO] ------------------------------------------------------------------------
      [mvn] [INFO] Building Apache Solr Contrib aggregator POM
      [mvn] [INFO]    task-segment: [install]
      [mvn] [INFO] ------------------------------------------------------------------------
      [mvn] [INFO] [groovy:execute {execution: generate-timestamps}]
      [mvn] [INFO] [buildnumber:create {execution: default}]
      [mvn] [INFO] [enforcer:enforce {execution: enforce-java-compat-version-and-maven-2.2.1}]
      [mvn] [INFO] [remote-resources:process {execution: default}]
      [mvn] [INFO] [bundle:manifest {execution: bundle-manifest}]
      [mvn] [WARNING] Ignoring project type pom - supportedProjectTypes = [jar, bundle]
      [mvn] [INFO] [site:attach-descriptor {execution: default-attach-descriptor}]
      [mvn] [INFO] [install:install {execution: default-install}]
      [mvn] [INFO] Installing /usr/home/hudson/hudson-slave/workspace/Lucene-Solr-Maven-trunk/maven-build/solr/contrib/pom.xml to /home/hudson/.m2/repository/org/apache/solr/solr-contrib-aggregator/5.0-SNAPSHOT/solr-contrib-aggregator-5.0-SNAPSHOT.pom
      [mvn] [INFO] 
      [mvn] [INFO] 
      [mvn] [INFO] ------------------------------------------------------------------------
      [mvn] [INFO] Reactor Summary:
      [mvn] [INFO] ------------------------------------------------------------------------
      [mvn] [INFO] Grandparent POM for Apache Lucene Core and Apache Solr  SUCCESS [7.016s]
      [mvn] [INFO] Lucene parent POM ..................................... SUCCESS [0.064s]
      [mvn] [INFO] Lucene Core ........................................... SUCCESS [13.985s]
      [mvn] [INFO] Lucene codecs ......................................... SUCCESS [3.677s]
      [mvn] [INFO] Lucene Test Framework ................................. SUCCESS [4.901s]
      [mvn] [INFO] Lucene Core tests ..................................... SUCCESS [3:54.127s]
      [mvn] [INFO] Lucene Core aggregator POM ............................ SUCCESS [0.072s]
      [mvn] [INFO] Lucene codecs tests ................................... SUCCESS [3.452s]
      [mvn] [INFO] Lucene codecs aggregator POM .......................... SUCCESS [0.072s]
      [mvn] [INFO] Lucene Common Analyzers ............................... SUCCESS [2:03.451s]
      [mvn] [INFO] Lucene ICU Analysis Components ........................ SUCCESS [11.774s]
      [mvn] [INFO] Lucene Kuromoji Japanese Morphological Analyzer ....... SUCCESS [25.854s]
      [mvn] [INFO] Lucene Morfologik Polish Lemmatizer ................... SUCCESS [4.007s]
      [mvn] [INFO] Lucene Phonetic Filters ............................... SUCCESS [18.832s]
      [mvn] [INFO] Lucene Smart Chinese Analyzer ......................... SUCCESS [11.799s]
      [mvn] [INFO] Lucene Stempel Analyzer ............................... SUCCESS [7.030s]
      [mvn] [INFO] Lucene UIMA Analysis Components ....................... SUCCESS [20.700s]
      [mvn] [INFO] Lucene Analysis Modules aggregator POM ................ SUCCESS [0.082s]
      [mvn] [INFO] Lucene Queries ........................................ SUCCESS [10.436s]
      [mvn] [INFO] Lucene Sandbox ........................................ SUCCESS [8.992s]
      [mvn] [INFO] Lucene QueryParsers ................................... SUCCESS [14.689s]
      [mvn] [INFO] Lucene Memory ......................................... SUCCESS [8.808s]
      [mvn] [INFO] Lucene Highlighter .................................... SUCCESS [10.435s]
      [mvn] [INFO] Lucene Facets ......................................... SUCCESS [49.635s]
      [mvn] [INFO] Lucene Benchmark ...................................... SUCCESS [28.780s]
      [mvn] [INFO] Lucene Classification ................................. SUCCESS [3.483s]
      [mvn] [INFO] Lucene Demo ........................................... SUCCESS [3.974s]
      [mvn] [INFO] Lucene Grouping ....................................... SUCCESS [20.640s]
      [mvn] [INFO] Lucene Join ........................................... SUCCESS [15.970s]
      [mvn] [INFO] Lucene Miscellaneous .................................. SUCCESS [6.594s]
      [mvn] [INFO] Lucene Spatial ........................................ SUCCESS [14.298s]
      [mvn] [INFO] Lucene Suggest ........................................ SUCCESS [18.588s]
      [mvn] [INFO] Apache Solr parent POM ................................ SUCCESS [0.072s]
      [mvn] [INFO] Apache Solr Solrj ..................................... SUCCESS [4.952s]
      [mvn] [INFO] Apache Solr Core ...................................... SUCCESS [12.314s]
      [mvn] [INFO] Apache Solr Test Framework ............................ SUCCESS [3.949s]
      [mvn] [INFO] Apache Solr Core tests ................................ FAILED [21:15.659s]
      [mvn] [INFO] Apache Solr Core aggregator POM ....................... SUCCESS [0.080s]
      [mvn] [INFO] Apache Solr Solrj tests ............................... SUCCESS [3:16.133s]
      [mvn] [INFO] Apache Solr Solrj aggregator POM ...................... SUCCESS [0.079s]
      [mvn] [INFO] Apache Solr Search Server ............................. SUCCESS [4.828s]
      [mvn] [INFO] Apache Solr Analysis Extras ........................... SUCCESS [7.900s]
      [mvn] [INFO] Apache Solr Clustering ................................ SUCCESS [16.007s]
      [mvn] [INFO] Apache Solr DataImportHandler ......................... SUCCESS [1:32.926s]
      [mvn] [INFO] Apache Solr DataImportHandler Extras .................. SUCCESS [6.841s]
      [mvn] [INFO] Apache Solr Content Extraction Library ................ SUCCESS [10.318s]
      [mvn] [INFO] Apache Solr Language Identifier ....................... SUCCESS [7.239s]
      [mvn] [INFO] Apache Solr UIMA integration .......................... SUCCESS [31.505s]
      [mvn] [INFO] Apache Solr Velocity .................................. SUCCESS [4.687s]
      [mvn] [INFO] Apache Solr Contrib aggregator POM .................... SUCCESS [0.078s]
      [mvn] [INFO] ------------------------------------------------------------------------
      [mvn] [INFO] Error for project: Apache Solr Core tests (during install)
      [mvn] [INFO] ------------------------------------------------------------------------
      [mvn] [INFO] There are test failures.
      [mvn] 
      [mvn] Please refer to /usr/home/hudson/hudson-slave/workspace/Lucene-Solr-Maven-trunk/maven-build/solr/core/src/test/target/surefire-reports for the individual test results.
      [mvn] [INFO] ------------------------------------------------------------------------
      [mvn] [INFO] For more information, run Maven with the -e switch
      [mvn] [INFO] ------------------------------------------------------------------------
      [mvn] [INFO] BUILD ERRORS
      [mvn] [INFO] ------------------------------------------------------------------------
      [mvn] [INFO] Total time: 39 minutes 43 seconds
      [mvn] [INFO] Finished at: Thu Sep 20 17:41:30 UTC 2012
      [mvn] [INFO] Final Memory: 301M/2266M
      [mvn] [INFO] ------------------------------------------------------------------------

BUILD FAILED
/usr/home/hudson/hudson-slave/workspace/Lucene-Solr-Maven-trunk/build.xml:160: The following error occurred while executing this line:
/usr/home/hudson/hudson-slave/workspace/Lucene-Solr-Maven-trunk/extra-targets.xml:56: Java returned: 1

Total time: 39 minutes 48 seconds
Build step 'Invoke Ant' marked build as failure
Recording test results
Email was triggered for: Failure
Sending email for trigger: Failure




Mime
View raw message