lucene-dev mailing list archives

Site index · List index
Message view « Date » · « Thread »
Top « Date » · « Thread »
From Policeman Jenkins Server <jenk...@sd-datasolutions.de>
Subject [JENKINS] Lucene-Solr-4.x-Linux (64bit/jdk1.7.0_07) - Build # 1156 - Failure!
Date Mon, 17 Sep 2012 04:50:12 GMT
Build: http://jenkins.sd-datasolutions.de/job/Lucene-Solr-4.x-Linux/1156/
Java: 64bit/jdk1.7.0_07 -XX:+UseSerialGC

4 tests failed.
FAILED:  org.apache.solr.search.TestSolr4Spatial.checkQueryEmptyIndex {p0=srpt_geohash}

Error Message:
Exception during query

Stack Trace:
java.lang.RuntimeException: Exception during query
	at __randomizedtesting.SeedInfo.seed([863139162B144AAB:86FBB2FBE076CDEB]:0)
	at org.apache.solr.SolrTestCaseJ4.assertQ(SolrTestCaseJ4.java:503)
	at org.apache.solr.SolrTestCaseJ4.assertQ(SolrTestCaseJ4.java:470)
	at org.apache.solr.search.TestSolr4Spatial.checkHits(TestSolr4Spatial.java:170)
	at org.apache.solr.search.TestSolr4Spatial.checkHits(TestSolr4Spatial.java:139)
	at org.apache.solr.search.TestSolr4Spatial.checkQueryEmptyIndex(TestSolr4Spatial.java:135)
	at sun.reflect.NativeMethodAccessorImpl.invoke0(Native Method)
	at sun.reflect.NativeMethodAccessorImpl.invoke(NativeMethodAccessorImpl.java:57)
	at sun.reflect.DelegatingMethodAccessorImpl.invoke(DelegatingMethodAccessorImpl.java:43)
	at java.lang.reflect.Method.invoke(Method.java:601)
	at com.carrotsearch.randomizedtesting.RandomizedRunner.invoke(RandomizedRunner.java:1559)
	at com.carrotsearch.randomizedtesting.RandomizedRunner.access$600(RandomizedRunner.java:79)
	at com.carrotsearch.randomizedtesting.RandomizedRunner$6.evaluate(RandomizedRunner.java:737)
	at com.carrotsearch.randomizedtesting.RandomizedRunner$7.evaluate(RandomizedRunner.java:773)
	at com.carrotsearch.randomizedtesting.RandomizedRunner$8.evaluate(RandomizedRunner.java:787)
	at com.carrotsearch.randomizedtesting.rules.SystemPropertiesRestoreRule$1.evaluate(SystemPropertiesRestoreRule.java:53)
	at org.apache.lucene.util.TestRuleSetupTeardownChained$1.evaluate(TestRuleSetupTeardownChained.java:50)
	at org.apache.lucene.util.TestRuleFieldCacheSanity$1.evaluate(TestRuleFieldCacheSanity.java:51)
	at org.apache.lucene.util.AbstractBeforeAfterRule$1.evaluate(AbstractBeforeAfterRule.java:45)
	at com.carrotsearch.randomizedtesting.rules.SystemPropertiesInvariantRule$1.evaluate(SystemPropertiesInvariantRule.java:55)
	at org.apache.lucene.util.TestRuleThreadAndTestName$1.evaluate(TestRuleThreadAndTestName.java:48)
	at org.apache.lucene.util.TestRuleIgnoreAfterMaxFailures$1.evaluate(TestRuleIgnoreAfterMaxFailures.java:70)
	at org.apache.lucene.util.TestRuleMarkFailure$1.evaluate(TestRuleMarkFailure.java:48)
	at com.carrotsearch.randomizedtesting.rules.StatementAdapter.evaluate(StatementAdapter.java:36)
	at com.carrotsearch.randomizedtesting.ThreadLeakControl$StatementRunner.run(ThreadLeakControl.java:358)
	at com.carrotsearch.randomizedtesting.ThreadLeakControl.forkTimeoutingTask(ThreadLeakControl.java:782)
	at com.carrotsearch.randomizedtesting.ThreadLeakControl$3.evaluate(ThreadLeakControl.java:442)
	at com.carrotsearch.randomizedtesting.RandomizedRunner.runSingleTest(RandomizedRunner.java:746)
	at com.carrotsearch.randomizedtesting.RandomizedRunner$3.evaluate(RandomizedRunner.java:648)
	at com.carrotsearch.randomizedtesting.RandomizedRunner$4.evaluate(RandomizedRunner.java:682)
	at com.carrotsearch.randomizedtesting.RandomizedRunner$5.evaluate(RandomizedRunner.java:693)
	at com.carrotsearch.randomizedtesting.rules.StatementAdapter.evaluate(StatementAdapter.java:36)
	at com.carrotsearch.randomizedtesting.rules.SystemPropertiesRestoreRule$1.evaluate(SystemPropertiesRestoreRule.java:53)
	at org.apache.lucene.util.AbstractBeforeAfterRule$1.evaluate(AbstractBeforeAfterRule.java:45)
	at org.apache.lucene.util.TestRuleStoreClassName$1.evaluate(TestRuleStoreClassName.java:42)
	at com.carrotsearch.randomizedtesting.rules.SystemPropertiesInvariantRule$1.evaluate(SystemPropertiesInvariantRule.java:55)
	at com.carrotsearch.randomizedtesting.rules.NoShadowingOrOverridesOnMethodsRule$1.evaluate(NoShadowingOrOverridesOnMethodsRule.java:39)
	at com.carrotsearch.randomizedtesting.rules.NoShadowingOrOverridesOnMethodsRule$1.evaluate(NoShadowingOrOverridesOnMethodsRule.java:39)
	at com.carrotsearch.randomizedtesting.rules.StatementAdapter.evaluate(StatementAdapter.java:36)
	at org.apache.lucene.util.TestRuleAssertionsRequired$1.evaluate(TestRuleAssertionsRequired.java:43)
	at org.apache.lucene.util.TestRuleMarkFailure$1.evaluate(TestRuleMarkFailure.java:48)
	at org.apache.lucene.util.TestRuleIgnoreAfterMaxFailures$1.evaluate(TestRuleIgnoreAfterMaxFailures.java:70)
	at org.apache.lucene.util.TestRuleIgnoreTestSuites$1.evaluate(TestRuleIgnoreTestSuites.java:55)
	at com.carrotsearch.randomizedtesting.rules.StatementAdapter.evaluate(StatementAdapter.java:36)
	at com.carrotsearch.randomizedtesting.ThreadLeakControl$StatementRunner.run(ThreadLeakControl.java:358)
	at java.lang.Thread.run(Thread.java:722)
Caused by: java.lang.RuntimeException: REQUEST FAILED: xpath=*[count(//doc)=0]
	xml response was: <?xml version="1.0" encoding="UTF-8"?>
<response>
<lst name="responseHeader"><int name="status">0</int><int name="QTime">8</int></lst><result name="response" numFound="3" start="0"><doc><str name="id">5</str></doc><doc><str name="id">6</str></doc><doc><str name="id">7</str></doc></result>
</response>

	request was:fl=id&q=*:*&fq={!field+f%3Dsrpt_geohash+score%3DrecipDistance}Intersects(Circle(0,0+d%3D0.8993203677616635))&rows=1000
	at org.apache.solr.SolrTestCaseJ4.assertQ(SolrTestCaseJ4.java:496)
	... 44 more


FAILED:  org.apache.solr.search.TestSolr4Spatial.checkQueryEmptyIndex {p0=srpt_quad}

Error Message:
Exception during query

Stack Trace:
java.lang.RuntimeException: Exception during query
	at __randomizedtesting.SeedInfo.seed([863139162B144AAB:86FBB2FBE076CDEB]:0)
	at org.apache.solr.SolrTestCaseJ4.assertQ(SolrTestCaseJ4.java:503)
	at org.apache.solr.SolrTestCaseJ4.assertQ(SolrTestCaseJ4.java:470)
	at org.apache.solr.search.TestSolr4Spatial.checkHits(TestSolr4Spatial.java:170)
	at org.apache.solr.search.TestSolr4Spatial.checkHits(TestSolr4Spatial.java:139)
	at org.apache.solr.search.TestSolr4Spatial.checkQueryEmptyIndex(TestSolr4Spatial.java:135)
	at sun.reflect.NativeMethodAccessorImpl.invoke0(Native Method)
	at sun.reflect.NativeMethodAccessorImpl.invoke(NativeMethodAccessorImpl.java:57)
	at sun.reflect.DelegatingMethodAccessorImpl.invoke(DelegatingMethodAccessorImpl.java:43)
	at java.lang.reflect.Method.invoke(Method.java:601)
	at com.carrotsearch.randomizedtesting.RandomizedRunner.invoke(RandomizedRunner.java:1559)
	at com.carrotsearch.randomizedtesting.RandomizedRunner.access$600(RandomizedRunner.java:79)
	at com.carrotsearch.randomizedtesting.RandomizedRunner$6.evaluate(RandomizedRunner.java:737)
	at com.carrotsearch.randomizedtesting.RandomizedRunner$7.evaluate(RandomizedRunner.java:773)
	at com.carrotsearch.randomizedtesting.RandomizedRunner$8.evaluate(RandomizedRunner.java:787)
	at com.carrotsearch.randomizedtesting.rules.SystemPropertiesRestoreRule$1.evaluate(SystemPropertiesRestoreRule.java:53)
	at org.apache.lucene.util.TestRuleSetupTeardownChained$1.evaluate(TestRuleSetupTeardownChained.java:50)
	at org.apache.lucene.util.TestRuleFieldCacheSanity$1.evaluate(TestRuleFieldCacheSanity.java:51)
	at org.apache.lucene.util.AbstractBeforeAfterRule$1.evaluate(AbstractBeforeAfterRule.java:45)
	at com.carrotsearch.randomizedtesting.rules.SystemPropertiesInvariantRule$1.evaluate(SystemPropertiesInvariantRule.java:55)
	at org.apache.lucene.util.TestRuleThreadAndTestName$1.evaluate(TestRuleThreadAndTestName.java:48)
	at org.apache.lucene.util.TestRuleIgnoreAfterMaxFailures$1.evaluate(TestRuleIgnoreAfterMaxFailures.java:70)
	at org.apache.lucene.util.TestRuleMarkFailure$1.evaluate(TestRuleMarkFailure.java:48)
	at com.carrotsearch.randomizedtesting.rules.StatementAdapter.evaluate(StatementAdapter.java:36)
	at com.carrotsearch.randomizedtesting.ThreadLeakControl$StatementRunner.run(ThreadLeakControl.java:358)
	at com.carrotsearch.randomizedtesting.ThreadLeakControl.forkTimeoutingTask(ThreadLeakControl.java:782)
	at com.carrotsearch.randomizedtesting.ThreadLeakControl$3.evaluate(ThreadLeakControl.java:442)
	at com.carrotsearch.randomizedtesting.RandomizedRunner.runSingleTest(RandomizedRunner.java:746)
	at com.carrotsearch.randomizedtesting.RandomizedRunner$3.evaluate(RandomizedRunner.java:648)
	at com.carrotsearch.randomizedtesting.RandomizedRunner$4.evaluate(RandomizedRunner.java:682)
	at com.carrotsearch.randomizedtesting.RandomizedRunner$5.evaluate(RandomizedRunner.java:693)
	at com.carrotsearch.randomizedtesting.rules.StatementAdapter.evaluate(StatementAdapter.java:36)
	at com.carrotsearch.randomizedtesting.rules.SystemPropertiesRestoreRule$1.evaluate(SystemPropertiesRestoreRule.java:53)
	at org.apache.lucene.util.AbstractBeforeAfterRule$1.evaluate(AbstractBeforeAfterRule.java:45)
	at org.apache.lucene.util.TestRuleStoreClassName$1.evaluate(TestRuleStoreClassName.java:42)
	at com.carrotsearch.randomizedtesting.rules.SystemPropertiesInvariantRule$1.evaluate(SystemPropertiesInvariantRule.java:55)
	at com.carrotsearch.randomizedtesting.rules.NoShadowingOrOverridesOnMethodsRule$1.evaluate(NoShadowingOrOverridesOnMethodsRule.java:39)
	at com.carrotsearch.randomizedtesting.rules.NoShadowingOrOverridesOnMethodsRule$1.evaluate(NoShadowingOrOverridesOnMethodsRule.java:39)
	at com.carrotsearch.randomizedtesting.rules.StatementAdapter.evaluate(StatementAdapter.java:36)
	at org.apache.lucene.util.TestRuleAssertionsRequired$1.evaluate(TestRuleAssertionsRequired.java:43)
	at org.apache.lucene.util.TestRuleMarkFailure$1.evaluate(TestRuleMarkFailure.java:48)
	at org.apache.lucene.util.TestRuleIgnoreAfterMaxFailures$1.evaluate(TestRuleIgnoreAfterMaxFailures.java:70)
	at org.apache.lucene.util.TestRuleIgnoreTestSuites$1.evaluate(TestRuleIgnoreTestSuites.java:55)
	at com.carrotsearch.randomizedtesting.rules.StatementAdapter.evaluate(StatementAdapter.java:36)
	at com.carrotsearch.randomizedtesting.ThreadLeakControl$StatementRunner.run(ThreadLeakControl.java:358)
	at java.lang.Thread.run(Thread.java:722)
Caused by: java.lang.RuntimeException: REQUEST FAILED: xpath=*[count(//doc)=0]
	xml response was: <?xml version="1.0" encoding="UTF-8"?>
<response>
<lst name="responseHeader"><int name="status">0</int><int name="QTime">2</int></lst><result name="response" numFound="3" start="0"><doc><str name="id">5</str></doc><doc><str name="id">6</str></doc><doc><str name="id">7</str></doc></result>
</response>

	request was:fl=id&q=*:*&fq={!field+f%3Dsrpt_quad+score%3DrecipDistance}Intersects(Circle(0,0+d%3D0.8993203677616635))&rows=1000
	at org.apache.solr.SolrTestCaseJ4.assertQ(SolrTestCaseJ4.java:496)
	... 44 more


FAILED:  org.apache.solr.search.TestSolr4Spatial.checkQueryEmptyIndex {p0=stqpt_geohash}

Error Message:
Exception during query

Stack Trace:
java.lang.RuntimeException: Exception during query
	at __randomizedtesting.SeedInfo.seed([863139162B144AAB:86FBB2FBE076CDEB]:0)
	at org.apache.solr.SolrTestCaseJ4.assertQ(SolrTestCaseJ4.java:503)
	at org.apache.solr.SolrTestCaseJ4.assertQ(SolrTestCaseJ4.java:470)
	at org.apache.solr.search.TestSolr4Spatial.checkHits(TestSolr4Spatial.java:170)
	at org.apache.solr.search.TestSolr4Spatial.checkHits(TestSolr4Spatial.java:139)
	at org.apache.solr.search.TestSolr4Spatial.checkQueryEmptyIndex(TestSolr4Spatial.java:135)
	at sun.reflect.NativeMethodAccessorImpl.invoke0(Native Method)
	at sun.reflect.NativeMethodAccessorImpl.invoke(NativeMethodAccessorImpl.java:57)
	at sun.reflect.DelegatingMethodAccessorImpl.invoke(DelegatingMethodAccessorImpl.java:43)
	at java.lang.reflect.Method.invoke(Method.java:601)
	at com.carrotsearch.randomizedtesting.RandomizedRunner.invoke(RandomizedRunner.java:1559)
	at com.carrotsearch.randomizedtesting.RandomizedRunner.access$600(RandomizedRunner.java:79)
	at com.carrotsearch.randomizedtesting.RandomizedRunner$6.evaluate(RandomizedRunner.java:737)
	at com.carrotsearch.randomizedtesting.RandomizedRunner$7.evaluate(RandomizedRunner.java:773)
	at com.carrotsearch.randomizedtesting.RandomizedRunner$8.evaluate(RandomizedRunner.java:787)
	at com.carrotsearch.randomizedtesting.rules.SystemPropertiesRestoreRule$1.evaluate(SystemPropertiesRestoreRule.java:53)
	at org.apache.lucene.util.TestRuleSetupTeardownChained$1.evaluate(TestRuleSetupTeardownChained.java:50)
	at org.apache.lucene.util.TestRuleFieldCacheSanity$1.evaluate(TestRuleFieldCacheSanity.java:51)
	at org.apache.lucene.util.AbstractBeforeAfterRule$1.evaluate(AbstractBeforeAfterRule.java:45)
	at com.carrotsearch.randomizedtesting.rules.SystemPropertiesInvariantRule$1.evaluate(SystemPropertiesInvariantRule.java:55)
	at org.apache.lucene.util.TestRuleThreadAndTestName$1.evaluate(TestRuleThreadAndTestName.java:48)
	at org.apache.lucene.util.TestRuleIgnoreAfterMaxFailures$1.evaluate(TestRuleIgnoreAfterMaxFailures.java:70)
	at org.apache.lucene.util.TestRuleMarkFailure$1.evaluate(TestRuleMarkFailure.java:48)
	at com.carrotsearch.randomizedtesting.rules.StatementAdapter.evaluate(StatementAdapter.java:36)
	at com.carrotsearch.randomizedtesting.ThreadLeakControl$StatementRunner.run(ThreadLeakControl.java:358)
	at com.carrotsearch.randomizedtesting.ThreadLeakControl.forkTimeoutingTask(ThreadLeakControl.java:782)
	at com.carrotsearch.randomizedtesting.ThreadLeakControl$3.evaluate(ThreadLeakControl.java:442)
	at com.carrotsearch.randomizedtesting.RandomizedRunner.runSingleTest(RandomizedRunner.java:746)
	at com.carrotsearch.randomizedtesting.RandomizedRunner$3.evaluate(RandomizedRunner.java:648)
	at com.carrotsearch.randomizedtesting.RandomizedRunner$4.evaluate(RandomizedRunner.java:682)
	at com.carrotsearch.randomizedtesting.RandomizedRunner$5.evaluate(RandomizedRunner.java:693)
	at com.carrotsearch.randomizedtesting.rules.StatementAdapter.evaluate(StatementAdapter.java:36)
	at com.carrotsearch.randomizedtesting.rules.SystemPropertiesRestoreRule$1.evaluate(SystemPropertiesRestoreRule.java:53)
	at org.apache.lucene.util.AbstractBeforeAfterRule$1.evaluate(AbstractBeforeAfterRule.java:45)
	at org.apache.lucene.util.TestRuleStoreClassName$1.evaluate(TestRuleStoreClassName.java:42)
	at com.carrotsearch.randomizedtesting.rules.SystemPropertiesInvariantRule$1.evaluate(SystemPropertiesInvariantRule.java:55)
	at com.carrotsearch.randomizedtesting.rules.NoShadowingOrOverridesOnMethodsRule$1.evaluate(NoShadowingOrOverridesOnMethodsRule.java:39)
	at com.carrotsearch.randomizedtesting.rules.NoShadowingOrOverridesOnMethodsRule$1.evaluate(NoShadowingOrOverridesOnMethodsRule.java:39)
	at com.carrotsearch.randomizedtesting.rules.StatementAdapter.evaluate(StatementAdapter.java:36)
	at org.apache.lucene.util.TestRuleAssertionsRequired$1.evaluate(TestRuleAssertionsRequired.java:43)
	at org.apache.lucene.util.TestRuleMarkFailure$1.evaluate(TestRuleMarkFailure.java:48)
	at org.apache.lucene.util.TestRuleIgnoreAfterMaxFailures$1.evaluate(TestRuleIgnoreAfterMaxFailures.java:70)
	at org.apache.lucene.util.TestRuleIgnoreTestSuites$1.evaluate(TestRuleIgnoreTestSuites.java:55)
	at com.carrotsearch.randomizedtesting.rules.StatementAdapter.evaluate(StatementAdapter.java:36)
	at com.carrotsearch.randomizedtesting.ThreadLeakControl$StatementRunner.run(ThreadLeakControl.java:358)
	at java.lang.Thread.run(Thread.java:722)
Caused by: java.lang.RuntimeException: REQUEST FAILED: xpath=*[count(//doc)=0]
	xml response was: <?xml version="1.0" encoding="UTF-8"?>
<response>
<lst name="responseHeader"><int name="status">0</int><int name="QTime">47</int></lst><result name="response" numFound="3" start="0"><doc><str name="id">5</str></doc><doc><str name="id">6</str></doc><doc><str name="id">7</str></doc></result>
</response>

	request was:fl=id&q=*:*&fq={!field+f%3Dstqpt_geohash+score%3DrecipDistance}Intersects(Circle(0,0+d%3D0.8993203677616635))&rows=1000
	at org.apache.solr.SolrTestCaseJ4.assertQ(SolrTestCaseJ4.java:496)
	... 44 more


FAILED:  org.apache.solr.search.TestSolr4Spatial.checkQueryEmptyIndex {p0=twodoubles}

Error Message:
Exception during query

Stack Trace:
java.lang.RuntimeException: Exception during query
	at __randomizedtesting.SeedInfo.seed([863139162B144AAB:86FBB2FBE076CDEB]:0)
	at org.apache.solr.SolrTestCaseJ4.assertQ(SolrTestCaseJ4.java:503)
	at org.apache.solr.SolrTestCaseJ4.assertQ(SolrTestCaseJ4.java:470)
	at org.apache.solr.search.TestSolr4Spatial.checkHits(TestSolr4Spatial.java:170)
	at org.apache.solr.search.TestSolr4Spatial.checkHits(TestSolr4Spatial.java:139)
	at org.apache.solr.search.TestSolr4Spatial.checkQueryEmptyIndex(TestSolr4Spatial.java:135)
	at sun.reflect.NativeMethodAccessorImpl.invoke0(Native Method)
	at sun.reflect.NativeMethodAccessorImpl.invoke(NativeMethodAccessorImpl.java:57)
	at sun.reflect.DelegatingMethodAccessorImpl.invoke(DelegatingMethodAccessorImpl.java:43)
	at java.lang.reflect.Method.invoke(Method.java:601)
	at com.carrotsearch.randomizedtesting.RandomizedRunner.invoke(RandomizedRunner.java:1559)
	at com.carrotsearch.randomizedtesting.RandomizedRunner.access$600(RandomizedRunner.java:79)
	at com.carrotsearch.randomizedtesting.RandomizedRunner$6.evaluate(RandomizedRunner.java:737)
	at com.carrotsearch.randomizedtesting.RandomizedRunner$7.evaluate(RandomizedRunner.java:773)
	at com.carrotsearch.randomizedtesting.RandomizedRunner$8.evaluate(RandomizedRunner.java:787)
	at com.carrotsearch.randomizedtesting.rules.SystemPropertiesRestoreRule$1.evaluate(SystemPropertiesRestoreRule.java:53)
	at org.apache.lucene.util.TestRuleSetupTeardownChained$1.evaluate(TestRuleSetupTeardownChained.java:50)
	at org.apache.lucene.util.TestRuleFieldCacheSanity$1.evaluate(TestRuleFieldCacheSanity.java:51)
	at org.apache.lucene.util.AbstractBeforeAfterRule$1.evaluate(AbstractBeforeAfterRule.java:45)
	at com.carrotsearch.randomizedtesting.rules.SystemPropertiesInvariantRule$1.evaluate(SystemPropertiesInvariantRule.java:55)
	at org.apache.lucene.util.TestRuleThreadAndTestName$1.evaluate(TestRuleThreadAndTestName.java:48)
	at org.apache.lucene.util.TestRuleIgnoreAfterMaxFailures$1.evaluate(TestRuleIgnoreAfterMaxFailures.java:70)
	at org.apache.lucene.util.TestRuleMarkFailure$1.evaluate(TestRuleMarkFailure.java:48)
	at com.carrotsearch.randomizedtesting.rules.StatementAdapter.evaluate(StatementAdapter.java:36)
	at com.carrotsearch.randomizedtesting.ThreadLeakControl$StatementRunner.run(ThreadLeakControl.java:358)
	at com.carrotsearch.randomizedtesting.ThreadLeakControl.forkTimeoutingTask(ThreadLeakControl.java:782)
	at com.carrotsearch.randomizedtesting.ThreadLeakControl$3.evaluate(ThreadLeakControl.java:442)
	at com.carrotsearch.randomizedtesting.RandomizedRunner.runSingleTest(RandomizedRunner.java:746)
	at com.carrotsearch.randomizedtesting.RandomizedRunner$3.evaluate(RandomizedRunner.java:648)
	at com.carrotsearch.randomizedtesting.RandomizedRunner$4.evaluate(RandomizedRunner.java:682)
	at com.carrotsearch.randomizedtesting.RandomizedRunner$5.evaluate(RandomizedRunner.java:693)
	at com.carrotsearch.randomizedtesting.rules.StatementAdapter.evaluate(StatementAdapter.java:36)
	at com.carrotsearch.randomizedtesting.rules.SystemPropertiesRestoreRule$1.evaluate(SystemPropertiesRestoreRule.java:53)
	at org.apache.lucene.util.AbstractBeforeAfterRule$1.evaluate(AbstractBeforeAfterRule.java:45)
	at org.apache.lucene.util.TestRuleStoreClassName$1.evaluate(TestRuleStoreClassName.java:42)
	at com.carrotsearch.randomizedtesting.rules.SystemPropertiesInvariantRule$1.evaluate(SystemPropertiesInvariantRule.java:55)
	at com.carrotsearch.randomizedtesting.rules.NoShadowingOrOverridesOnMethodsRule$1.evaluate(NoShadowingOrOverridesOnMethodsRule.java:39)
	at com.carrotsearch.randomizedtesting.rules.NoShadowingOrOverridesOnMethodsRule$1.evaluate(NoShadowingOrOverridesOnMethodsRule.java:39)
	at com.carrotsearch.randomizedtesting.rules.StatementAdapter.evaluate(StatementAdapter.java:36)
	at org.apache.lucene.util.TestRuleAssertionsRequired$1.evaluate(TestRuleAssertionsRequired.java:43)
	at org.apache.lucene.util.TestRuleMarkFailure$1.evaluate(TestRuleMarkFailure.java:48)
	at org.apache.lucene.util.TestRuleIgnoreAfterMaxFailures$1.evaluate(TestRuleIgnoreAfterMaxFailures.java:70)
	at org.apache.lucene.util.TestRuleIgnoreTestSuites$1.evaluate(TestRuleIgnoreTestSuites.java:55)
	at com.carrotsearch.randomizedtesting.rules.StatementAdapter.evaluate(StatementAdapter.java:36)
	at com.carrotsearch.randomizedtesting.ThreadLeakControl$StatementRunner.run(ThreadLeakControl.java:358)
	at java.lang.Thread.run(Thread.java:722)
Caused by: java.lang.RuntimeException: REQUEST FAILED: xpath=*[count(//doc)=0]
	xml response was: <?xml version="1.0" encoding="UTF-8"?>
<response>
<lst name="responseHeader"><int name="status">0</int><int name="QTime">5</int></lst><result name="response" numFound="3" start="0"><doc><str name="id">5</str></doc><doc><str name="id">6</str></doc><doc><str name="id">7</str></doc></result>
</response>

	request was:fl=id&q=*:*&fq={!field+f%3Dtwodoubles+score%3DrecipDistance}Intersects(Circle(0,0+d%3D0.8993203677616635))&rows=1000
	at org.apache.solr.SolrTestCaseJ4.assertQ(SolrTestCaseJ4.java:496)
	... 44 more




Build Log:
[...truncated 8260 lines...]
[junit4:junit4] Suite: org.apache.solr.search.TestSolr4Spatial
[junit4:junit4]   2> 0 T2709 oas.SolrTestCaseJ4.initCore ####initCore
[junit4:junit4]   2> Creating dataDir: /mnt/ssd/jenkins/workspace/Lucene-Solr-4.x-Linux/solr/build/solr-core/test/J1/./solrtest-TestSolr4Spatial-1347857234324
[junit4:junit4]   2> 1 T2709 oasc.SolrResourceLoader.<init> new SolrResourceLoader for directory: '/mnt/ssd/jenkins/workspace/Lucene-Solr-4.x-Linux/solr/build/solr-core/test-files/solr/collection1/'
[junit4:junit4]   2> 1 T2709 oasc.SolrResourceLoader.replaceClassLoader Adding 'file:/mnt/ssd/jenkins/workspace/Lucene-Solr-4.x-Linux/solr/build/solr-core/test-files/solr/collection1/lib/README' to classloader
[junit4:junit4]   2> 1 T2709 oasc.SolrResourceLoader.replaceClassLoader Adding 'file:/mnt/ssd/jenkins/workspace/Lucene-Solr-4.x-Linux/solr/build/solr-core/test-files/solr/collection1/lib/classes/' to classloader
[junit4:junit4]   2> 21 T2709 oasc.SolrConfig.<init> Using Lucene MatchVersion: LUCENE_40
[junit4:junit4]   2> 47 T2709 oasc.SolrConfig.<init> Loaded SolrConfig: solrconfig-basic.xml
[junit4:junit4]   2> 48 T2709 oass.IndexSchema.readSchema Reading Solr Schema
[junit4:junit4]   2> 50 T2709 oass.IndexSchema.readSchema Schema name=test
[junit4:junit4]   2> 86 T2709 oass.IndexSchema.readSchema unique key field: id
[junit4:junit4]   2> 87 T2709 oasc.SolrResourceLoader.locateSolrHome JNDI not configured for solr (NoInitialContextEx)
[junit4:junit4]   2> 88 T2709 oasc.SolrResourceLoader.locateSolrHome using system property solr.solr.home: /mnt/ssd/jenkins/workspace/Lucene-Solr-4.x-Linux/solr/build/solr-core/test-files/solr
[junit4:junit4]   2> 88 T2709 oasc.SolrResourceLoader.<init> new SolrResourceLoader for directory: '/mnt/ssd/jenkins/workspace/Lucene-Solr-4.x-Linux/solr/build/solr-core/test-files/solr/'
[junit4:junit4]   2> 93 T2709 oasc.CoreContainer.<init> New CoreContainer 1574961511
[junit4:junit4]   2> 93 T2709 oasc.SolrCore.<init> [collection1] Opening new SolrCore at /mnt/ssd/jenkins/workspace/Lucene-Solr-4.x-Linux/solr/build/solr-core/test-files/solr/collection1/, dataDir=/mnt/ssd/jenkins/workspace/Lucene-Solr-4.x-Linux/solr/build/solr-core/test/J1/./solrtest-TestSolr4Spatial-1347857234324/
[junit4:junit4]   2> 93 T2709 oasc.SolrCore.<init> JMX monitoring not detected for core: collection1
[junit4:junit4]   2> 94 T2709 oasc.SolrCore.getNewIndexDir WARNING New index directory detected: old=null new=/mnt/ssd/jenkins/workspace/Lucene-Solr-4.x-Linux/solr/build/solr-core/test/J1/./solrtest-TestSolr4Spatial-1347857234324/index/
[junit4:junit4]   2> 94 T2709 oasc.SolrCore.initIndex WARNING [collection1] Solr index directory '/mnt/ssd/jenkins/workspace/Lucene-Solr-4.x-Linux/solr/build/solr-core/test/J1/./solrtest-TestSolr4Spatial-1347857234324/index' doesn't exist. Creating new index...
[junit4:junit4]   2> 94 T2709 oasc.CachingDirectoryFactory.get return new directory for /mnt/ssd/jenkins/workspace/Lucene-Solr-4.x-Linux/solr/build/solr-core/test/J1/./solrtest-TestSolr4Spatial-1347857234324/index forceNew:false
[junit4:junit4]   2> 95 T2709 oasc.SolrDeletionPolicy.onCommit SolrDeletionPolicy.onCommit: commits:num=1
[junit4:junit4]   2> 		commit{dir=MockDirWrapper(NRTCachingDirectory(org.apache.lucene.store.RAMDirectory@1d7c4157 lockFactory=org.apache.lucene.store.NativeFSLockFactory@1f7bce63; maxCacheMB=0.82421875 maxMergeSizeMB=0.04296875)),segFN=segments_1,generation=1,filenames=[segments_1]
[junit4:junit4]   2> 96 T2709 oasc.SolrDeletionPolicy.updateCommits newest commit = 1
[junit4:junit4]   2> 96 T2709 oasc.RequestHandlers.initHandlersFromConfig created standard: solr.StandardRequestHandler
[junit4:junit4]   2> 98 T2709 oass.SolrIndexSearcher.<init> Opening Searcher@41501156 main
[junit4:junit4]   2> 98 T2709 oass.SolrIndexSearcher.getIndexDir WARNING WARNING: Directory impl does not support setting indexDir: org.apache.lucene.store.MockDirectoryWrapper
[junit4:junit4]   2> 99 T2709 oasu.CommitTracker.<init> Hard AutoCommit: disabled
[junit4:junit4]   2> 99 T2709 oasu.CommitTracker.<init> Soft AutoCommit: disabled
[junit4:junit4]   2> 99 T2709 oashc.HttpShardHandlerFactory.getParameter Setting socketTimeout to: 0
[junit4:junit4]   2> 100 T2709 oashc.HttpShardHandlerFactory.getParameter Setting urlScheme to: http://
[junit4:junit4]   2> 100 T2709 oashc.HttpShardHandlerFactory.getParameter Setting connTimeout to: 0
[junit4:junit4]   2> 100 T2709 oashc.HttpShardHandlerFactory.getParameter Setting maxConnectionsPerHost to: 20
[junit4:junit4]   2> 100 T2709 oashc.HttpShardHandlerFactory.getParameter Setting corePoolSize to: 0
[junit4:junit4]   2> 101 T2709 oashc.HttpShardHandlerFactory.getParameter Setting maximumPoolSize to: 2147483647
[junit4:junit4]   2> 101 T2709 oashc.HttpShardHandlerFactory.getParameter Setting maxThreadIdleTime to: 5
[junit4:junit4]   2> 101 T2709 oashc.HttpShardHandlerFactory.getParameter Setting sizeOfQueue to: -1
[junit4:junit4]   2> 101 T2709 oashc.HttpShardHandlerFactory.getParameter Setting fairnessPolicy to: false
[junit4:junit4]   2> 102 T2709 oascsi.HttpClientUtil.createClient Creating new http client, config:maxConnectionsPerHost=20&maxConnections=10000&socketTimeout=0&connTimeout=0&retry=false
[junit4:junit4]   2> 104 T2710 oasc.SolrCore.registerSearcher [collection1] Registered new searcher Searcher@41501156 main{StandardDirectoryReader(segments_1:1)}
[junit4:junit4]   2> 104 T2709 oasc.CoreContainer.register registering core: collection1
[junit4:junit4]   2> 111 T2709 oas.SolrTestCaseJ4.initCore ####initCore end
[junit4:junit4]   2> 114 T2709 oas.SolrTestCaseJ4.setUp ###Starting testRangeSyntax {p0=srpt_geohash}
[junit4:junit4]   2> ASYNC  NEW_CORE C211 name=collection1 org.apache.solr.core.SolrCore@5764e85d
[junit4:junit4]   2> 116 T2709 C211 oasu.DirectUpdateHandler2.deleteAll [collection1] REMOVING ALL DOCUMENTS FROM INDEX
[junit4:junit4]   2> 117 T2709 C211 oasc.SolrDeletionPolicy.onInit SolrDeletionPolicy.onInit: commits:num=1
[junit4:junit4]   2> 		commit{dir=MockDirWrapper(NRTCachingDirectory(org.apache.lucene.store.RAMDirectory@1d7c4157 lockFactory=org.apache.lucene.store.NativeFSLockFactory@1f7bce63; maxCacheMB=0.82421875 maxMergeSizeMB=0.04296875)),segFN=segments_1,generation=1,filenames=[segments_1]
[junit4:junit4]   2> 117 T2709 C211 oasc.SolrDeletionPolicy.updateCommits newest commit = 1
[junit4:junit4]   2> 117 T2709 C211 UPDATE [collection1] webapp=null path=null params={} {deleteByQuery=*:*} 0 2
[junit4:junit4]   2> 130 T2709 C211 oass.AbstractSpatialPrefixTreeFieldType.newSpatialStrategy srpt_geohash{class=org.apache.solr.schema.SpatialRecursivePrefixTreeFieldType,analyzer=org.apache.solr.schema.FieldType$DefaultAnalyzer,args={prefixTree=geohash}} strat: RecursivePrefixTreeStrategy(prefixGridScanLevel:7,SPG:(GeohashPrefixTree(maxLevels:11,ctx:SpatialContext{geo=true, calculator=Haversine, worldBounds=Rect(minX=-180.0,maxX=180.0,minY=-90.0,maxY=90.0)}))) maxLevels: 11
[junit4:junit4]   2> 133 T2709 C211 UPDATE [collection1] webapp=null path=null params={} {add=[1]} 0 11
[junit4:junit4]   2> 136 T2709 C211 UPDATE [collection1] webapp=null path=null params={} {add=[2]} 0 1
[junit4:junit4]   2> 138 T2709 C211 UPDATE [collection1] webapp=null path=null params={} {add=[3]} 0 0
[junit4:junit4]   2> 141 T2709 C211 UPDATE [collection1] webapp=null path=null params={} {add=[4]} 0 1
[junit4:junit4]   2> 143 T2709 C211 UPDATE [collection1] webapp=null path=null params={} {add=[5]} 0 0
[junit4:junit4]   2> 146 T2709 C211 UPDATE [collection1] webapp=null path=null params={} {add=[6]} 0 0
[junit4:junit4]   2> 148 T2709 C211 UPDATE [collection1] webapp=null path=null params={} {add=[7]} 0 0
[junit4:junit4]   2> 151 T2709 C211 UPDATE [collection1] webapp=null path=null params={} {add=[8]} 0 0
[junit4:junit4]   2> 154 T2709 C211 UPDATE [collection1] webapp=null path=null params={} {add=[9]} 0 0
[junit4:junit4]   2> 156 T2709 C211 UPDATE [collection1] webapp=null path=null params={} {add=[10]} 0 0
[junit4:junit4]   2> 159 T2709 C211 UPDATE [collection1] webapp=null path=null params={} {add=[11]} 0 0
[junit4:junit4]   2> 161 T2709 C211 UPDATE [collection1] webapp=null path=null params={} {add=[12]} 0 0
[junit4:junit4]   2> 164 T2709 C211 UPDATE [collection1] webapp=null path=null params={} {add=[13]} 0 0
[junit4:junit4]   2> 166 T2709 C211 oasu.DirectUpdateHandler2.commit start commit{flags=0,_version_=0,optimize=false,openSearcher=true,waitSearcher=true,expungeDeletes=false,softCommit=false}
[junit4:junit4]   2> 168 T2709 C211 oasc.SolrDeletionPolicy.onCommit SolrDeletionPolicy.onCommit: commits:num=2
[junit4:junit4]   2> 		commit{dir=MockDirWrapper(NRTCachingDirectory(org.apache.lucene.store.RAMDirectory@1d7c4157 lockFactory=org.apache.lucene.store.NativeFSLockFactory@1f7bce63; maxCacheMB=0.82421875 maxMergeSizeMB=0.04296875)),segFN=segments_1,generation=1,filenames=[segments_1]
[junit4:junit4]   2> 		commit{dir=MockDirWrapper(NRTCachingDirectory(org.apache.lucene.store.RAMDirectory@1d7c4157 lockFactory=org.apache.lucene.store.NativeFSLockFactory@1f7bce63; maxCacheMB=0.82421875 maxMergeSizeMB=0.04296875)),segFN=segments_2,generation=2,filenames=[_0.fnm, _0_Memory_0.ram, _0_nrm.cfe, segments_2, _0.fdx, _0_nrm.cfs, _0.si, _0.fdt]
[junit4:junit4]   2> 168 T2709 C211 oasc.SolrDeletionPolicy.updateCommits newest commit = 2
[junit4:junit4]   2> 169 T2709 C211 oass.SolrIndexSearcher.<init> Opening Searcher@451eba6d main
[junit4:junit4]   2> 169 T2709 C211 oass.SolrIndexSearcher.getIndexDir WARNING WARNING: Directory impl does not support setting indexDir: org.apache.lucene.store.MockDirectoryWrapper
[junit4:junit4]   2> 170 T2710 oasc.SolrCore.registerSearcher [collection1] Registered new searcher Searcher@451eba6d main{StandardDirectoryReader(segments_2:4 _0(4.0.0.2):C13)}
[junit4:junit4]   2> 170 T2709 C211 oasu.DirectUpdateHandler2.commit end_commit_flush
[junit4:junit4]   2> 170 T2709 C211 UPDATE [collection1] webapp=null path=null params={} {commit=} 0 4
[junit4:junit4]   2> 175 T2709 C211 REQ [collection1] webapp=null path=null params={fl=id&q=*:*&fq={!+needScore%3Dfalse+df%3Dsrpt_geohash}[32,-80+TO+33,-79]&rows=1000} hits=1 status=0 QTime=3 
[junit4:junit4]   2> 176 T2709 oas.SolrTestCaseJ4.tearDown ###Ending testRangeSyntax {p0=srpt_geohash}
[junit4:junit4]   2> 180 T2709 oas.SolrTestCaseJ4.setUp ###Starting checkQueryEmptyIndex {p0=srpt_geohash}
[junit4:junit4]   2> 182 T2709 C211 oasu.DirectUpdateHandler2.deleteAll [collection1] REMOVING ALL DOCUMENTS FROM INDEX
[junit4:junit4]   2> 182 T2709 C211 UPDATE [collection1] webapp=null path=null params={} {deleteByQuery=*:*} 0 1
[junit4:junit4]   2> 191 T2709 C211 REQ [collection1] webapp=null path=null params={fl=id&q=*:*&fq={!field+f%3Dsrpt_geohash+score%3DrecipDistance}Intersects(Circle(0,0+d%3D0.8993203677616635))&rows=1000} hits=3 status=0 QTime=8 
[junit4:junit4]   2> 193 T2709 oas.SolrTestCaseJ4.assertQ SEVERE REQUEST FAILED: xpath=*[count(//doc)=0]
[junit4:junit4]   2> 		xml response was: <?xml version="1.0" encoding="UTF-8"?>
[junit4:junit4]   2> 	<response>
[junit4:junit4]   2> 	<lst name="responseHeader"><int name="status">0</int><int name="QTime">8</int></lst><result name="response" numFound="3" start="0"><doc><str name="id">5</str></doc><doc><str name="id">6</str></doc><doc><str name="id">7</str></doc></result>
[junit4:junit4]   2> 	</response>
[junit4:junit4]   2> 	
[junit4:junit4]   2> 		request was:fl=id&q=*:*&fq={!field+f%3Dsrpt_geohash+score%3DrecipDistance}Intersects(Circle(0,0+d%3D0.8993203677616635))&rows=1000
[junit4:junit4]   2> 193 T2709 oasc.SolrException.log SEVERE REQUEST FAILED: fl=id&q=*:*&fq={!field+f%3Dsrpt_geohash+score%3DrecipDistance}Intersects(Circle(0,0+d%3D0.8993203677616635))&rows=1000:java.lang.RuntimeException: REQUEST FAILED: xpath=*[count(//doc)=0]
[junit4:junit4]   2> 		xml response was: <?xml version="1.0" encoding="UTF-8"?>
[junit4:junit4]   2> 	<response>
[junit4:junit4]   2> 	<lst name="responseHeader"><int name="status">0</int><int name="QTime">8</int></lst><result name="response" numFound="3" start="0"><doc><str name="id">5</str></doc><doc><str name="id">6</str></doc><doc><str name="id">7</str></doc></result>
[junit4:junit4]   2> 	</response>
[junit4:junit4]   2> 	
[junit4:junit4]   2> 		request was:fl=id&q=*:*&fq={!field+f%3Dsrpt_geohash+score%3DrecipDistance}Intersects(Circle(0,0+d%3D0.8993203677616635))&rows=1000
[junit4:junit4]   2> 		at org.apache.solr.SolrTestCaseJ4.assertQ(SolrTestCaseJ4.java:496)
[junit4:junit4]   2> 		at org.apache.solr.SolrTestCaseJ4.assertQ(SolrTestCaseJ4.java:470)
[junit4:junit4]   2> 		at org.apache.solr.search.TestSolr4Spatial.checkHits(TestSolr4Spatial.java:170)
[junit4:junit4]   2> 		at org.apache.solr.search.TestSolr4Spatial.checkHits(TestSolr4Spatial.java:139)
[junit4:junit4]   2> 		at org.apache.solr.search.TestSolr4Spatial.checkQueryEmptyIndex(TestSolr4Spatial.java:135)
[junit4:junit4]   2> 		at sun.reflect.NativeMethodAccessorImpl.invoke0(Native Method)
[junit4:junit4]   2> 		at sun.reflect.NativeMethodAccessorImpl.invoke(NativeMethodAccessorImpl.java:57)
[junit4:junit4]   2> 		at sun.reflect.DelegatingMethodAccessorImpl.invoke(DelegatingMethodAccessorImpl.java:43)
[junit4:junit4]   2> 		at java.lang.reflect.Method.invoke(Method.java:601)
[junit4:junit4]   2> 		at com.carrotsearch.randomizedtesting.RandomizedRunner.invoke(RandomizedRunner.java:1559)
[junit4:junit4]   2> 		at com.carrotsearch.randomizedtesting.RandomizedRunner.access$600(RandomizedRunner.java:79)
[junit4:junit4]   2> 		at com.carrotsearch.randomizedtesting.RandomizedRunner$6.evaluate(RandomizedRunner.java:737)
[junit4:junit4]   2> 		at com.carrotsearch.randomizedtesting.RandomizedRunner$7.evaluate(RandomizedRunner.java:773)
[junit4:junit4]   2> 		at com.carrotsearch.randomizedtesting.RandomizedRunner$8.evaluate(RandomizedRunner.java:787)
[junit4:junit4]   2> 		at com.carrotsearch.randomizedtesting.rules.SystemPropertiesRestoreRule$1.evaluate(SystemPropertiesRestoreRule.java:53)
[junit4:junit4]   2> 		at org.apache.lucene.util.TestRuleSetupTeardownChained$1.evaluate(TestRuleSetupTeardownChained.java:50)
[junit4:junit4]   2> 		at org.apache.lucene.util.TestRuleFieldCacheSanity$1.evaluate(TestRuleFieldCacheSanity.java:51)
[junit4:junit4]   2> 		at org.apache.lucene.util.AbstractBeforeAfterRule$1.evaluate(AbstractBeforeAfterRule.java:45)
[junit4:junit4]   2> 		at com.carrotsearch.randomizedtesting.rules.SystemPropertiesInvariantRule$1.evaluate(SystemPropertiesInvariantRule.java:55)
[junit4:junit4]   2> 		at org.apache.lucene.util.TestRuleThreadAndTestName$1.evaluate(TestRuleThreadAndTestName.java:48)
[junit4:junit4]   2> 		at org.apache.lucene.util.TestRuleIgnoreAfterMaxFailures$1.evaluate(TestRuleIgnoreAfterMaxFailures.java:70)
[junit4:junit4]   2> 		at org.apache.lucene.util.TestRuleMarkFailure$1.evaluate(TestRuleMarkFailure.java:48)
[junit4:junit4]   2> 		at com.carrotsearch.randomizedtesting.rules.StatementAdapter.evaluate(StatementAdapter.java:36)
[junit4:junit4]   2> 		at com.carrotsearch.randomizedtesting.ThreadLeakControl$StatementRunner.run(ThreadLeakControl.java:358)
[junit4:junit4]   2> 		at com.carrotsearch.randomizedtesting.ThreadLeakControl.forkTimeoutingTask(ThreadLeakControl.java:782)
[junit4:junit4]   2> 		at com.carrotsearch.randomizedtesting.ThreadLeakControl$3.evaluate(ThreadLeakControl.java:442)
[junit4:junit4]   2> 		at com.carrotsearch.randomizedtesting.RandomizedRunner.runSingleTest(RandomizedRunner.java:746)
[junit4:junit4]   2> 		at com.carrotsearch.randomizedtesting.RandomizedRunner$3.evaluate(RandomizedRunner.java:648)
[junit4:junit4]   2> 		at com.carrotsearch.randomizedtesting.RandomizedRunner$4.evaluate(RandomizedRunner.java:682)
[junit4:junit4]   2> 		at com.carrotsearch.randomizedtesting.RandomizedRunner$5.evaluate(RandomizedRunner.java:693)
[junit4:junit4]   2> 		at com.carrotsearch.randomizedtesting.rules.StatementAdapter.evaluate(StatementAdapter.java:36)
[junit4:junit4]   2> 		at com.carrotsearch.randomizedtesting.rules.SystemPropertiesRestoreRule$1.evaluate(SystemPropertiesRestoreRule.java:53)
[junit4:junit4]   2> 		at org.apache.lucene.util.AbstractBeforeAfterRule$1.evaluate(AbstractBeforeAfterRule.java:45)
[junit4:junit4]   2> 		at org.apache.lucene.util.TestRuleStoreClassName$1.evaluate(TestRuleStoreClassName.java:42)
[junit4:junit4]   2> 		at com.carrotsearch.randomizedtesting.rules.SystemPropertiesInvariantRule$1.evaluate(SystemPropertiesInvariantRule.java:55)
[junit4:junit4]   2> 		at com.carrotsearch.randomizedtesting.rules.NoShadowingOrOverridesOnMethodsRule$1.evaluate(NoShadowingOrOverridesOnMethodsRule.java:39)
[junit4:junit4]   2> 		at com.carrotsearch.randomizedtesting.rules.NoShadowingOrOverridesOnMethodsRule$1.evaluate(NoShadowingOrOverridesOnMethodsRule.java:39)
[junit4:junit4]   2> 		at com.carrotsearch.randomizedtesting.rules.StatementAdapter.evaluate(StatementAdapter.java:36)
[junit4:junit4]   2> 		at org.apache.lucene.util.TestRuleAssertionsRequired$1.evaluate(TestRuleAssertionsRequired.java:43)
[junit4:junit4]   2> 		at org.apache.lucene.util.TestRuleMarkFailure$1.evaluate(TestRuleMarkFailure.java:48)
[junit4:junit4]   2> 		at org.apache.lucene.util.TestRuleIgnoreAfterMaxFailures$1.evaluate(TestRuleIgnoreAfterMaxFailures.java:70)
[junit4:junit4]   2> 		at org.apache.lucene.util.TestRuleIgnoreTestSuites$1.evaluate(TestRuleIgnoreTestSuites.java:55)
[junit4:junit4]   2> 		at com.carrotsearch.randomizedtesting.rules.StatementAdapter.evaluate(StatementAdapter.java:36)
[junit4:junit4]   2> 		at com.carrotsearch.randomizedtesting.ThreadLeakControl$StatementRunner.run(ThreadLeakControl.java:358)
[junit4:junit4]   2> 		at java.lang.Thread.run(Thread.java:722)
[junit4:junit4]   2> 	
[junit4:junit4]   2> 194 T2709 oas.SolrTestCaseJ4.tearDown ###Ending checkQueryEmptyIndex {p0=srpt_geohash}
[junit4:junit4]   2> NOTE: reproduce with: ant test  -Dtestcase=TestSolr4Spatial -Dtests.method="checkQueryEmptyIndex {p0=srpt_geohash}" -Dtests.seed=863139162B144AAB -Dtests.multiplier=3 -Dtests.slow=true -Dtests.locale=en_SG -Dtests.timezone=ART -Dtests.file.encoding=US-ASCII
[junit4:junit4] ERROR   0.03s J1 | TestSolr4Spatial.checkQueryEmptyIndex {p0=srpt_geohash} <<<
[junit4:junit4]    > Throwable #1: java.lang.RuntimeException: Exception during query
[junit4:junit4]    > 	at __randomizedtesting.SeedInfo.seed([863139162B144AAB:86FBB2FBE076CDEB]:0)
[junit4:junit4]    > 	at org.apache.solr.SolrTestCaseJ4.assertQ(SolrTestCaseJ4.java:503)
[junit4:junit4]    > 	at org.apache.solr.SolrTestCaseJ4.assertQ(SolrTestCaseJ4.java:470)
[junit4:junit4]    > 	at org.apache.solr.search.TestSolr4Spatial.checkHits(TestSolr4Spatial.java:170)
[junit4:junit4]    > 	at org.apache.solr.search.TestSolr4Spatial.checkHits(TestSolr4Spatial.java:139)
[junit4:junit4]    > 	at org.apache.solr.search.TestSolr4Spatial.checkQueryEmptyIndex(TestSolr4Spatial.java:135)
[junit4:junit4]    > 	at sun.reflect.NativeMethodAccessorImpl.invoke0(Native Method)
[junit4:junit4]    > 	at sun.reflect.NativeMethodAccessorImpl.invoke(NativeMethodAccessorImpl.java:57)
[junit4:junit4]    > 	at sun.reflect.DelegatingMethodAccessorImpl.invoke(DelegatingMethodAccessorImpl.java:43)
[junit4:junit4]    > 	at java.lang.reflect.Method.invoke(Method.java:601)
[junit4:junit4]    > 	at com.carrotsearch.randomizedtesting.RandomizedRunner.invoke(RandomizedRunner.java:1559)
[junit4:junit4]    > 	at com.carrotsearch.randomizedtesting.RandomizedRunner.access$600(RandomizedRunner.java:79)
[junit4:junit4]    > 	at com.carrotsearch.randomizedtesting.RandomizedRunner$6.evaluate(RandomizedRunner.java:737)
[junit4:junit4]    > 	at com.carrotsearch.randomizedtesting.RandomizedRunner$7.evaluate(RandomizedRunner.java:773)
[junit4:junit4]    > 	at com.carrotsearch.randomizedtesting.RandomizedRunner$8.evaluate(RandomizedRunner.java:787)
[junit4:junit4]    > 	at com.carrotsearch.randomizedtesting.rules.SystemPropertiesRestoreRule$1.evaluate(SystemPropertiesRestoreRule.java:53)
[junit4:junit4]    > 	at org.apache.lucene.util.TestRuleSetupTeardownChained$1.evaluate(TestRuleSetupTeardownChained.java:50)
[junit4:junit4]    > 	at org.apache.lucene.util.TestRuleFieldCacheSanity$1.evaluate(TestRuleFieldCacheSanity.java:51)
[junit4:junit4]    > 	at org.apache.lucene.util.AbstractBeforeAfterRule$1.evaluate(AbstractBeforeAfterRule.java:45)
[junit4:junit4]    > 	at com.carrotsearch.randomizedtesting.rules.SystemPropertiesInvariantRule$1.evaluate(SystemPropertiesInvariantRule.java:55)
[junit4:junit4]    > 	at org.apache.lucene.util.TestRuleThreadAndTestName$1.evaluate(TestRuleThreadAndTestName.java:48)
[junit4:junit4]    > 	at org.apache.lucene.util.TestRuleIgnoreAfterMaxFailures$1.evaluate(TestRuleIgnoreAfterMaxFailures.java:70)
[junit4:junit4]    > 	at org.apache.lucene.util.TestRuleMarkFailure$1.evaluate(TestRuleMarkFailure.java:48)
[junit4:junit4]    > 	at com.carrotsearch.randomizedtesting.rules.StatementAdapter.evaluate(StatementAdapter.java:36)
[junit4:junit4]    > 	at com.carrotsearch.randomizedtesting.ThreadLeakControl$StatementRunner.run(ThreadLeakControl.java:358)
[junit4:junit4]    > 	at com.carrotsearch.randomizedtesting.ThreadLeakControl.forkTimeoutingTask(ThreadLeakControl.java:782)
[junit4:junit4]    > 	at com.carrotsearch.randomizedtesting.ThreadLeakControl$3.evaluate(ThreadLeakControl.java:442)
[junit4:junit4]    > 	at com.carrotsearch.randomizedtesting.RandomizedRunner.runSingleTest(RandomizedRunner.java:746)
[junit4:junit4]    > 	at com.carrotsearch.randomizedtesting.RandomizedRunner$3.evaluate(RandomizedRunner.java:648)
[junit4:junit4]    > 	at com.carrotsearch.randomizedtesting.RandomizedRunner$4.evaluate(RandomizedRunner.java:682)
[junit4:junit4]    > 	at com.carrotsearch.randomizedtesting.RandomizedRunner$5.evaluate(RandomizedRunner.java:693)
[junit4:junit4]    > 	at com.carrotsearch.randomizedtesting.rules.StatementAdapter.evaluate(StatementAdapter.java:36)
[junit4:junit4]    > 	at com.carrotsearch.randomizedtesting.rules.SystemPropertiesRestoreRule$1.evaluate(SystemPropertiesRestoreRule.java:53)
[junit4:junit4]    > 	at org.apache.lucene.util.AbstractBeforeAfterRule$1.evaluate(AbstractBeforeAfterRule.java:45)
[junit4:junit4]    > 	at org.apache.lucene.util.TestRuleStoreClassName$1.evaluate(TestRuleStoreClassName.java:42)
[junit4:junit4]    > 	at com.carrotsearch.randomizedtesting.rules.SystemPropertiesInvariantRule$1.evaluate(SystemPropertiesInvariantRule.java:55)
[junit4:junit4]    > 	at com.carrotsearch.randomizedtesting.rules.NoShadowingOrOverridesOnMethodsRule$1.evaluate(NoShadowingOrOverridesOnMethodsRule.java:39)
[junit4:junit4]    > 	at com.carrotsearch.randomizedtesting.rules.NoShadowingOrOverridesOnMethodsRule$1.evaluate(NoShadowingOrOverridesOnMethodsRule.java:39)
[junit4:junit4]    > 	at com.carrotsearch.randomizedtesting.rules.StatementAdapter.evaluate(StatementAdapter.java:36)
[junit4:junit4]    > 	at org.apache.lucene.util.TestRuleAssertionsRequired$1.evaluate(TestRuleAssertionsRequired.java:43)
[junit4:junit4]    > 	at org.apache.lucene.util.TestRuleMarkFailure$1.evaluate(TestRuleMarkFailure.java:48)
[junit4:junit4]    > 	at org.apache.lucene.util.TestRuleIgnoreAfterMaxFailures$1.evaluate(TestRuleIgnoreAfterMaxFailures.java:70)
[junit4:junit4]    > 	at org.apache.lucene.util.TestRuleIgnoreTestSuites$1.evaluate(TestRuleIgnoreTestSuites.java:55)
[junit4:junit4]    > 	at com.carrotsearch.randomizedtesting.rules.StatementAdapter.evaluate(StatementAdapter.java:36)
[junit4:junit4]    > 	at com.carrotsearch.randomizedtesting.ThreadLeakControl$StatementRunner.run(ThreadLeakControl.java:358)
[junit4:junit4]    > 	at java.lang.Thread.run(Thread.java:722)
[junit4:junit4]    > Caused by: java.lang.RuntimeException: REQUEST FAILED: xpath=*[count(//doc)=0]
[junit4:junit4]    > 	xml response was: <?xml version="1.0" encoding="UTF-8"?>
[junit4:junit4]    > <response>
[junit4:junit4]    > <lst name="responseHeader"><int name="status">0</int><int name="QTime">8</int></lst><result name="response" numFound="3" start="0"><doc><str name="id">5</str></doc><doc><str name="id">6</str></doc><doc><str name="id">7</str></doc></result>
[junit4:junit4]    > </response>
[junit4:junit4]    > 
[junit4:junit4]    > 	request was:fl=id&q=*:*&fq={!field+f%3Dsrpt_geohash+score%3DrecipDistance}Intersects(Circle(0,0+d%3D0.8993203677616635))&rows=1000
[junit4:junit4]    > 	at org.apache.solr.SolrTestCaseJ4.assertQ(SolrTestCaseJ4.java:496)
[junit4:junit4]    > 	... 44 more
[junit4:junit4]   2> 214 T2709 oas.SolrTestCaseJ4.setUp ###Starting testIntersectFilter {p0=srpt_geohash}
[junit4:junit4]   2> 216 T2709 C211 oasu.DirectUpdateHandler2.deleteAll [collection1] REMOVING ALL DOCUMENTS FROM INDEX
[junit4:junit4]   2> 217 T2709 C211 UPDATE [collection1] webapp=null path=null params={} {deleteByQuery=*:*} 0 1
[junit4:junit4]   2> 219 T2709 C211 UPDATE [collection1] webapp=null path=null params={} {add=[1]} 0 0
[junit4:junit4]   2> 222 T2709 C211 UPDATE [collection1] webapp=null path=null params={} {add=[2]} 0 0
[junit4:junit4]   2> 225 T2709 C211 UPDATE [collection1] webapp=null path=null params={} {add=[3]} 0 0
[junit4:junit4]   2> 229 T2709 C211 UPDATE [collection1] webapp=null path=null params={} {add=[4]} 0 0
[junit4:junit4]   2> 234 T2709 C211 UPDATE [collection1] webapp=null path=null params={} {add=[5]} 0 1
[junit4:junit4]   2> 236 T2709 C211 UPDATE [collection1] webapp=null path=null params={} {add=[6]} 0 0
[junit4:junit4]   2> 239 T2709 C211 UPDATE [collection1] webapp=null path=null params={} {add=[7]} 0 0
[junit4:junit4]   2> 242 T2709 C211 UPDATE [collection1] webapp=null path=null params={} {add=[8]} 0 1
[junit4:junit4]   2> 244 T2709 C211 UPDATE [collection1] webapp=null path=null params={} {add=[9]} 0 0
[junit4:junit4]   2> 247 T2709 C211 UPDATE [collection1] webapp=null path=null params={} {add=[10]} 0 1
[junit4:junit4]   2> 249 T2709 C211 UPDATE [collection1] webapp=null path=null params={} {add=[11]} 0 0
[junit4:junit4]   2> 252 T2709 C211 UPDATE [collection1] webapp=null path=null params={} {add=[12]} 0 1
[junit4:junit4]   2> 254 T2709 C211 UPDATE [collection1] webapp=null path=null params={} {add=[13]} 0 0
[junit4:junit4]   2> 257 T2709 C211 oasu.DirectUpdateHandler2.commit start commit{flags=0,_version_=0,optimize=false,openSearcher=true,waitSearcher=true,expungeDeletes=false,softCommit=false}
[junit4:junit4]   2> 258 T2709 C211 oasc.SolrDeletionPolicy.onCommit SolrDeletionPolicy.onCommit: commits:num=2
[junit4:junit4]   2> 		commit{dir=MockDirWrapper(NRTCachingDirectory(org.apache.lucene.store.RAMDirectory@1d7c4157 lockFactory=org.apache.lucene.store.NativeFSLockFactory@1f7bce63; maxCacheMB=0.82421875 maxMergeSizeMB=0.04296875)),segFN=segments_2,generation=2,filenames=[_0.fnm, _0_Memory_0.ram, _0_nrm.cfe, segments_2, _0.fdx, _0_nrm.cfs, _0.si, _0.fdt]
[junit4:junit4]   2> 		commit{dir=MockDirWrapper(NRTCachingDirectory(org.apache.lucene.store.RAMDirectory@1d7c4157 lockFactory=org.apache.lucene.store.NativeFSLockFactory@1f7bce63; maxCacheMB=0.82421875 maxMergeSizeMB=0.04296875)),segFN=segments_3,generation=3,filenames=[_1.fdx, _1_nrm.cfs, _1_Memory_0.ram, _1.fdt, _1.si, _1.fnm, segments_3, _1_nrm.cfe]
[junit4:junit4]   2> 259 T2709 C211 oasc.SolrDeletionPolicy.updateCommits newest commit = 3
[junit4:junit4]   2> 259 T2709 C211 oass.SolrIndexSearcher.<init> Opening Searcher@535387ac main
[junit4:junit4]   2> 260 T2709 C211 oass.SolrIndexSearcher.getIndexDir WARNING WARNING: Directory impl does not support setting indexDir: org.apache.lucene.store.MockDirectoryWrapper
[junit4:junit4]   2> 260 T2710 oasc.SolrCore.registerSearcher [collection1] Registered new searcher Searcher@535387ac main{StandardDirectoryReader(segments_3:8 _1(4.0.0.2):C13)}
[junit4:junit4]   2> 260 T2709 C211 oasu.DirectUpdateHandler2.commit end_commit_flush
[junit4:junit4]   2> 261 T2709 C211 UPDATE [collection1] webapp=null path=null params={} {commit=} 0 4
[junit4:junit4]   2> 265 T2709 C211 REQ [collection1] webapp=null path=null params={fl=id&q=*:*&fq={!field+f%3Dsrpt_geohash}Intersects(Circle(1,1+d%3D1.5738106435829113))&rows=1000} hits=3 status=0 QTime=3 
[junit4:junit4]   2> 274 T2709 C211 REQ [collection1] webapp=null path=null params={fl=id&q=*:*&fq={!field+f%3Dsrpt_geohash+score%3Ddistance}Intersects(Circle(0,179.8+d%3D1.798640735523327))&rows=1000} hits=2 status=0 QTime=5 
[junit4:junit4]   2> 280 T2709 C211 REQ [collection1] webapp=null path=null params={fl=id&q=*:*&fq={!field+f%3Dsrpt_geohash+score%3Dnone}Intersects(Circle(89.8,50+d%3D1.798640735523327))&rows=1000} hits=2 status=0 QTime=3 
[junit4:junit4]   2> 285 T2709 C211 REQ [collection1] webapp=null path=null params={fl=id&q=*:*&fq={!field+f%3Dsrpt_geohash}Intersects(Circle(-89.8,50+d%3D1.798640735523327))&rows=1000} hits=2 status=0 QTime=3 
[junit4:junit4]   2> 288 T2709 C211 REQ [collection1] webapp=null path=null params={fl=id&q=*:*&fq={!field+f%3Dsrpt_geohash+score%3Dnone}Intersects(Circle(33.0,-80.0+d%3D2.6979611032849906))&rows=1000} hits=2 status=0 QTime=1 
[junit4:junit4]   2> 290 T2709 C211 REQ [collection1] webapp=null path=null params={fl=id&q=*:*&fq={!field+f%3Dsrpt_geohash+score%3Ddistance}Intersects(Circle(1,1+d%3D44.96601838808318))&rows=1000} hits=3 status=0 QTime=1 
[junit4:junit4]   2> 301 T2709 C211 REQ [collection1] webapp=null path=null params={fl=id&q=*:*&fq={!field+f%3Dsrpt_geohash}Intersects(-0.034898+-0.034898+0.234898+0.234898)&rows=1000} hits=2 status=0 QTime=1 
[junit4:junit4]   2> 305 T2709 C211 oasu.DirectUpdateHandler2.deleteAll [collection1] REMOVING ALL DOCUMENTS FROM INDEX
[junit4:junit4]   2> 305 T2709 C211 UPDATE [collection1] webapp=null path=null params={} {deleteByQuery=*:*} 0 0
[junit4:junit4]   2> 308 T2709 C211 UPDATE [collection1] webapp=null path=null params={} {add=[14]} 0 0
[junit4:junit4]   2> 311 T2709 C211 UPDATE [collection1] webapp=null path=null params={} {add=[15]} 0 0
[junit4:junit4]   2> 313 T2709 C211 UPDATE [collection1] webapp=null path=null params={} {add=[16]} 0 0
[junit4:junit4]   2> 316 T2709 C211 UPDATE [collection1] webapp=null path=null params={} {add=[17]} 0 0
[junit4:junit4]   2> 318 T2709 C211 oasu.DirectUpdateHandler2.commit start commit{flags=0,_version_=0,optimize=false,openSearcher=true,waitSearcher=true,expungeDeletes=false,softCommit=false}
[junit4:junit4]   2> 320 T2709 C211 oasc.SolrDeletionPolicy.onCommit SolrDeletionPolicy.onCommit: commits:num=2
[junit4:junit4]   2> 		commit{dir=MockDirWrapper(NRTCachingDirectory(org.apache.lucene.store.RAMDirectory@1d7c4157 lockFactory=org.apache.lucene.store.NativeFSLockFactory@1f7bce63; maxCacheMB=0.82421875 maxMergeSizeMB=0.04296875)),segFN=segments_3,generation=3,filenames=[_1.fdx, _1_nrm.cfs, _1_Memory_0.ram, _1.fdt, _1.si, _1.fnm, segments_3, _1_nrm.cfe]
[junit4:junit4]   2> 		commit{dir=MockDirWrapper(NRTCachingDirectory(org.apache.lucene.store.RAMDirectory@1d7c4157 lockFactory=org.apache.lucene.store.NativeFSLockFactory@1f7bce63; maxCacheMB=0.82421875 maxMergeSizeMB=0.04296875)),segFN=segments_4,generation=4,filenames=[_2.si, _2_nrm.cfe, _2.fdt, _2_Memory_0.ram, _2_nrm.cfs, _2.fdx, _2.fnm, segments_4]
[junit4:junit4]   2> 320 T2709 C211 oasc.SolrDeletionPolicy.updateCommits newest commit = 4
[junit4:junit4]   2> 321 T2709 C211 oass.SolrIndexSearcher.<init> Opening Searcher@1965988e main
[junit4:junit4]   2> 321 T2709 C211 oass.SolrIndexSearcher.getIndexDir WARNING WARNING: Directory impl does not support setting indexDir: org.apache.lucene.store.MockDirectoryWrapper
[junit4:junit4]   2> 322 T2710 oasc.SolrCore.registerSearcher [collection1] Registered new searcher Searcher@1965988e main{StandardDirectoryReader(segments_4:11 _2(4.0.0.2):C4)}
[junit4:junit4]   2> 322 T2709 C211 oasu.DirectUpdateHandler2.commit end_commit_flush
[junit4:junit4]   2> 322 T2709 C211 UPDATE [collection1] webapp=null path=null params={} {commit=} 0 4
[junit4:junit4]   2> 324 T2709 C211 REQ [collection1] webapp=null path=null params={fl=id&q=*:*&fq={!field+f%3Dsrpt_geohash+score%3DrecipDistance}Intersects(Circle(0,0+d%3D8.993203677616636))&rows=1000} hits=1 status=0 QTime=1 
[junit4:junit4]   2> 327 T2709 C211 REQ [collection1] webapp=null path=null params={fl=id&q=*:*&fq={!field+f%3Dsrpt_geohash+score%3DrecipDistance}Intersects(Circle(0,0+d%3D17.986407355233272))&rows=1000} hits=2 status=0 QTime=1 
[junit4:junit4]   2> 329 T2709 C211 REQ [collection1] webapp=null path=null params={fl=id&q=*:*&fq={!field+f%3Dsrpt_geohash+score%3Ddistance}Intersects(-26.979611+-26.979611+26.979611+26.979611)&rows=1000} hits=3 status=0 QTime=0 
[junit4:junit4]   2> 334 T2709 C211 REQ [collection1] webapp=null path=null params={fl=id&q=*:*&fq={!field+f%3Dsrpt_geohash+score%3Dnone}Intersects(Circle(0,0+d%3D26.98860423652752))&rows=1000} hits=3 status=0 QTime=2 
[junit4:junit4]   2> 338 T2709 C211 REQ [collection1] webapp=null path=null params={fl=id&q=*:*&fq={!field+f%3Dsrpt_geohash+score%3Dnone}Intersects(Circle(0,0+d%3D26.980510353217664))&rows=1000} hits=3 status=0 QTime=2 
[junit4:junit4]   2> 342 T2709 C211 REQ [collection1] webapp=null path=null params={fl=id&q=*:*&fq={!field+f%3Dsrpt_geohash+score%3Dnone}Intersects(Circle(43.517030,-96.789603+d%3D0.9802592008602133))&rows=1000} hits=0 status=0 QTime=1 
[junit4:junit4]   2> 344 T2709 C211 REQ [collection1] webapp=null path=null params={fl=id&q=*:*&fq={!field+f%3Dsrpt_geohash+score%3DrecipDistance}Intersects(Circle(43.517030,-96.789603+d%3D0.9892524045378299))&rows=1000} hits=0 status=0 QTime=1 
[junit4:junit4]   2> 346 T2709 C211 REQ [collection1] webapp=null path=null params={fl=id&q=*:*&fq={!field+f%3Dsrpt_geohash+score%3DrecipDistance}Intersects(-98.153831+42.527778+-95.425375+44.506282)&rows=1000} hits=1 status=0 QTime=1 
[junit4:junit4]   2> 348 T2709 oas.SolrTestCaseJ4.tearDown ###Ending testIntersectFilter {p0=srpt_geohash}
[junit4:junit4]   2> 351 T2709 oas.SolrTestCaseJ4.setUp ###Starting checkResultFormat {p0=srpt_geohash}
[junit4:junit4]   2> 353 T2709 C211 oasu.DirectUpdateHandler2.deleteAll [collection1] REMOVING ALL DOCUMENTS FROM INDEX
[junit4:junit4]   2> 354 T2709 C211 UPDATE [collection1] webapp=null path=null params={} {deleteByQuery=*:*} 0 1
[junit4:junit4]   2> 357 T2709 C211 UPDATE [collection1] webapp=null path=null params={} {add=[11]} 0 1
[junit4:junit4]   2> 359 T2709 C211 oasu.DirectUpdateHandler2.commit start commit{flags=0,_version_=0,optimize=false,openSearcher=true,waitSearcher=true,expungeDeletes=false,softCommit=false}
[junit4:junit4]   2> 360 T2709 C211 oasc.SolrDeletionPolicy.onCommit SolrDeletionPolicy.onCommit: commits:num=2
[junit4:junit4]   2> 		commit{dir=MockDirWrapper(NRTCachingDirectory(org.apache.lucene.store.RAMDirectory@1d7c4157 lockFactory=org.apache.lucene.store.NativeFSLockFactory@1f7bce63; maxCacheMB=0.82421875 maxMergeSizeMB=0.04296875)),segFN=segments_4,generation=4,filenames=[_2.si, _2_nrm.cfe, _2.fdt, _2_Memory_0.ram, _2_nrm.cfs, _2.fdx, _2.fnm, segments_4]
[junit4:junit4]   2> 		commit{dir=MockDirWrapper(NRTCachingDirectory(org.apache.lucene.store.RAMDirectory@1d7c4157 lockFactory=org.apache.lucene.store.NativeFSLockFactory@1f7bce63; maxCacheMB=0.82421875 maxMergeSizeMB=0.04296875)),segFN=segments_5,generation=5,filenames=[_3.fdx, _3_nrm.cfe, _3_nrm.cfs, _3.si, _3.fdt, _3.fnm, _3_Memory_0.ram, segments_5]
[junit4:junit4]   2> 361 T2709 C211 oasc.SolrDeletionPolicy.updateCommits newest commit = 5
[junit4:junit4]   2> 362 T2709 C211 oass.SolrIndexSearcher.<init> Opening Searcher@5c40eaa1 main
[junit4:junit4]   2> 362 T2709 C211 oass.SolrIndexSearcher.getIndexDir WARNING WARNING: Directory impl does not support setting indexDir: org.apache.lucene.store.MockDirectoryWrapper
[junit4:junit4]   2> 362 T2710 oasc.SolrCore.registerSearcher [collection1] Registered new searcher Searcher@5c40eaa1 main{StandardDirectoryReader(segments_5:14 _3(4.0.0.2):C1)}
[junit4:junit4]   2> 362 T2709 C211 oasu.DirectUpdateHandler2.commit end_commit_flush
[junit4:junit4]   2> 363 T2709 C211 UPDATE [collection1] webapp=null path=null params={} {commit=} 0 4
[junit4:junit4]   2> 365 T2709 C211 REQ [collection1] webapp=null path=null params={fl=id,srpt_geohash&q=*:*&fq={!field+needScore%3Dfalse+f%3Dsrpt_geohash}Intersects(Circle(89.9,-130+d%3D9))&rows=1000} hits=1 status=0 QTime=1 
[junit4:junit4]   2> 366 T2709 oas.SolrTestCaseJ4.tearDown ###Ending checkResultFormat {p0=srpt_geohash}
[junit4:junit4]   2> 369 T2709 oas.SolrTestCaseJ4.setUp ###Starting testSort {p0=srpt_geohash}
[junit4:junit4]   2> 371 T2709 C211 oasu.DirectUpdateHandler2.deleteAll [collection1] REMOVING ALL DOCUMENTS FROM INDEX
[junit4:junit4]   2> 372 T2709 C211 UPDATE [collection1] webapp=null path=null params={} {deleteByQuery=*:*} 0 1
[junit4:junit4]   2> 375 T2709 C211 UPDATE [collection1] webapp=null path=null params={} {add=[100]} 0 1
[junit4:junit4]   2> 384 T2709 C211 UPDATE [collection1] webapp=null path=null params={} {add=[101]} 0 1
[junit4:junit4]   2> 386 T2709 C211 UPDATE [collection1] webapp=null path=null params={} {add=[999]} 0 0
[junit4:junit4]   2> 389 T2709 C211 oasu.DirectUpdateHandler2.commit start commit{flags=0,_version_=0,optimize=false,openSearcher=true,waitSearcher=true,expungeDeletes=false,softCommit=false}
[junit4:junit4]   2> 390 T2709 C211 oasc.SolrDeletionPolicy.onCommit SolrDeletionPolicy.onCommit: commits:num=2
[junit4:junit4]   2> 		commit{dir=MockDirWrapper(NRTCachingDirectory(org.apache.lucene.store.RAMDirectory@1d7c4157 lockFactory=org.apache.lucene.store.NativeFSLockFactory@1f7bce63; maxCacheMB=0.82421875 maxMergeSizeMB=0.04296875)),segFN=segments_5,generation=5,filenames=[_3.fdx, _3_nrm.cfe, _3_nrm.cfs, _3.si, _3.fdt, _3.fnm, _3_Memory_0.ram, segments_5]
[junit4:junit4]   2> 		commit{dir=MockDirWrapper(NRTCachingDirectory(org.apache.lucene.store.RAMDirectory@1d7c4157 lockFactory=org.apache.lucene.store.NativeFSLockFactory@1f7bce63; maxCacheMB=0.82421875 maxMergeSizeMB=0.04296875)),segFN=segments_6,generation=6,filenames=[_4.fdx, _4_Memory_0.ram, _4_nrm.cfs, _4_nrm.cfe, _4.fnm, _4.si, _4.fdt, segments_6]
[junit4:junit4]   2> 390 T2709 C211 oasc.SolrDeletionPolicy.updateCommits newest commit = 6
[junit4:junit4]   2> 391 T2709 C211 oass.SolrIndexSearcher.<init> Opening Searcher@1f7fa63b main
[junit4:junit4]   2> 391 T2709 C211 oass.SolrIndexSearcher.getIndexDir WARNING WARNING: Directory impl does not support setting indexDir: org.apache.lucene.store.MockDirectoryWrapper
[junit4:junit4]   2> 392 T2710 oasc.SolrCore.registerSearcher [collection1] Registered new searcher Searcher@1f7fa63b main{StandardDirectoryReader(segments_6:17 _4(4.0.0.2):C3)}
[junit4:junit4]   2> 392 T2709 C211 oasu.DirectUpdateHandler2.commit end_commit_flush
[junit4:junit4]   2> 392 T2709 C211 UPDATE [collection1] webapp=null path=null params={} {commit=} 0 3
[junit4:junit4]   2> 394 T2709 C211 REQ [collection1] webapp=null path=null params={fl=id,score&q=srpt_geohash:"Intersects(Circle(3,4+d%3D9))"} hits=2 status=0 QTime=1 
[junit4:junit4]   2> 398 T2709 C211 REQ [collection1] webapp=null path=null params={sort=score+asc&fl=id,score&q={!+score%3Ddistance}srpt_geohash:"Intersects(Circle(3,4+d%3D9))"} hits=2 status=0 QTime=1 
[junit4:junit4]   2> 400 T2709 C211 REQ [collection1] webapp=null path=null params={sort=score+desc&fl=id,score&q={!+score%3DrecipDistance}srpt_geohash:"Intersects(Circle(3,4+d%3D9))"} hits=2 status=0 QTime=1 
[junit4:junit4]   2> 402 T2709 C211 REQ [collection1] webapp=null path=null params={sort=score+asc&fl=id,score&q={!+score%3Ddistance}srpt_geohash:"Intersects(Circle(4,0+d%3D9))"} hits=2 status=0 QTime=1 
[junit4:junit4]   2> 405 T2709 C211 REQ [collection1] webapp=null path=null params={sortQuery={!+score%3Ddistance}srpt_geohash:"Intersects(Circle(3,4+d%3D9))"&sort=query($sortQuery)+asc&fl=id,score&q=-id:999} hits=2 status=0 QTime=3 
[junit4:junit4]   2> 407 T2709 C211 REQ [collection1] webapp=null path=null params={sortQuery={!+score%3Ddistance}srpt_geohash:"Intersects(Circle(4,0+d%3D9))"&sort=query($sortQuery)+asc&fl=id,score&q=-id:999} hits=2 status=0 QTime=1 
[junit4:junit4]   2> 408 T2709 oas.SolrTestCaseJ4.tearDown ###Ending testSort {p0=srpt_geohash}
[junit4:junit4]   2> 411 T2709 oas.SolrTestCaseJ4.setUp ###Starting testSortMultiVal {p0=srpt_geohash}
[junit4:junit4]   2> 415 T2709 C211 oasu.DirectUpdateHandler2.deleteAll [collection1] REMOVING ALL DOCUMENTS FROM INDEX
[junit4:junit4]   2> 415 T2709 C211 UPDATE [collection1] webapp=null path=null params={} {deleteByQuery=*:*} 0 0
[junit4:junit4]   2> 418 T2709 C211 UPDATE [collection1] webapp=null path=null params={} {add=[100]} 0 0
[junit4:junit4]   2> 421 T2709 C211 UPDATE [collection1] webapp=null path=null params={} {add=[101]} 0 0
[junit4:junit4]   2> 423 T2709 C211 oasu.DirectUpdateHandler2.commit start commit{flags=0,_version_=0,optimize=false,openSearcher=true,waitSearcher=true,expungeDeletes=false,softCommit=false}
[junit4:junit4]   2> 424 T2709 C211 oasc.SolrDeletionPolicy.onCommit SolrDeletionPolicy.onCommit: commits:num=2
[junit4:junit4]   2> 		commit{dir=MockDirWrapper(NRTCachingDirectory(org.apache.lucene.store.RAMDirectory@1d7c4157 lockFactory=org.apache.lucene.store.NativeFSLockFactory@1f7bce63; maxCacheMB=0.82421875 maxMergeSizeMB=0.04296875)),segFN=segments_6,generation=6,filenames=[_4.fdx, _4_Memory_0.ram, _4_nrm.cfs, _4_nrm.cfe, _4.fnm, _4.si, _4.fdt, segments_6]
[junit4:junit4]   2> 		commit{dir=MockDirWrapper(NRTCachingDirectory(org.apache.lucene.store.RAMDirectory@1d7c4157 lockFactory=org.apache.lucene.store.NativeFSLockFactory@1f7bce63; maxCacheMB=0.82421875 maxMergeSizeMB=0.04296875)),segFN=segments_7,generation=7,filenames=[_5.si, _5_nrm.cfe, _5_Memory_0.ram, _5.fdt, _5.fnm, segments_7, _5_nrm.cfs, _5.fdx]
[junit4:junit4]   2> 425 T2709 C211 oasc.SolrDeletionPolicy.updateCommits newest commit = 7
[junit4:junit4]   2> 426 T2709 C211 oass.SolrIndexSearcher.<init> Opening Searcher@87852f3 main
[junit4:junit4]   2> 426 T2709 C211 oass.SolrIndexSearcher.getIndexDir WARNING WARNING: Directory impl does not support setting indexDir: org.apache.lucene.store.MockDirectoryWrapper
[junit4:junit4]   2> 427 T2709 C211 oasu.DirectUpdateHandler2.commit end_commit_flush
[junit4:junit4]   2> 427 T2710 oasc.SolrCore.registerSearcher [collection1] Registered new searcher Searcher@87852f3 main{StandardDirectoryReader(segments_7:20 _5(4.0.0.2):C2)}
[junit4:junit4]   2> 427 T2709 C211 UPDATE [collection1] webapp=null path=null params={} {commit=} 0 4
[junit4:junit4]   2> 429 T2709 C211 REQ [collection1] webapp=null path=null params={sort=score+asc&fl=id,score&q={!+score%3Ddistance}srpt_geohash:"Intersects(Circle(3,4+d%3D9))"} hits=2 status=0 QTime=1 
[junit4:junit4]   2> 430 T2709 oas.SolrTestCaseJ4.tearDown ###Ending testSortMultiVal {p0=srpt_geohash}
[junit4:junit4]   2> 433 T2709 oas.SolrTestCaseJ4.setUp ###Starting testRangeSyntax {p0=srpt_quad}
[junit4:junit4]   2> 435 T2709 C211 oasu.DirectUpdateHandler2.deleteAll [collection1] REMOVING ALL DOCUMENTS FROM INDEX
[junit4:junit4]   2> 436 T2709 C211 UPDATE [collection1] webapp=null path=null params={} {deleteByQuery=*:*} 0 1
[junit4:junit4]   2> 438 T2709 C211 oass.AbstractSpatialPrefixTreeFieldType.newSpatialStrategy srpt_quad{class=org.apache.solr.schema.SpatialRecursivePrefixTreeFieldType,analyzer=org.apache.solr.schema.FieldType$DefaultAnalyzer,args={prefixTree=quad}} strat: RecursivePrefixTreeStrategy(prefixGridScanLevel:22,SPG:(QuadPrefixTree(maxLevels:26,ctx:SpatialContext{geo=true, calculator=Haversine, worldBounds=Rect(minX=-180.0,maxX=180.0,minY=-90.0,maxY=90.0)}))) maxLevels: 26
[junit4:junit4]   2> 440 T2709 C211 UPDATE [collection1] webapp=null path=null params={} {add=[1]} 0 2
[junit4:junit4]   2> 443 T2709 C211 UPDATE [collection1] webapp=null path=null params={} {add=[2]} 0 1
[junit4:junit4]   2> 446 T2709 C211 UPDATE [collection1] webapp=null path=null params={} {add=[3]} 0 1
[junit4:junit4]   2> 449 T2709 C211 UPDATE [collection1] webapp=null path=null params={} {add=[4]} 0 1
[junit4:junit4]   2> 452 T2709 C211 UPDATE [collection1] webapp=null path=null params={} {add=[5]} 0 1
[junit4:junit4]   2> 456 T2709 C211 UPDATE [collection1] webapp=null path=null params={} {add=[6]} 0 1
[junit4:junit4]   2> 458 T2709 C211 UPDATE [collection1] webapp=null path=null params={} {add=[7]} 0 0
[junit4:junit4]   2> 462 T2709 C211 UPDATE [collection1] webapp=null path=null params={} {add=[8]} 0 1
[junit4:junit4]   2> 465 T2709 C211 UPDATE [collection1] webapp=null path=null params={} {add=[9]} 0 1
[junit4:junit4]   2> 476 T2709 C211 UPDATE [collection1] webapp=null path=null params={} {add=[10]} 0 1
[junit4:junit4]   2> 479 T2709 C211 UPDATE [collection1] webapp=null path=null params={} {add=[11]} 0 1
[junit4:junit4]   2> 482 T2709 C211 UPDATE [collection1] webapp=null path=null params={} {add=[12]} 0 1
[junit4:junit4]   2> 485 T2709 C211 UPDATE [collection1] webapp=null path=null params={} {add=[13]} 0 1
[junit4:junit4]   2> 489 T2709 C211 oasu.DirectUpdateHandler2.commit start commit{flags=0,_version_=0,optimize=false,openSearcher=true,waitSearcher=true,expungeDeletes=false,softCommit=false}
[junit4:junit4]   2> 493 T2709 C211 oasc.SolrDeletionPolicy.onCommit SolrDeletionPolicy.onCommit: commits:num=2
[junit4:junit4]   2> 		commit{dir=MockDirWrapper(NRTCachingDirectory(org.apache.lucene.store.RAMDirectory@1d7c4157 lockFactory=org.apache.lucene.store.NativeFSLockFactory@1f7bce63; maxCacheMB=0.82421875 maxMergeSizeMB=0.04296875)),segFN=segments_7,generation=7,filenames=[_5.si, _5_nrm.cfe, _5_Memory_0.ram, _5.fdt, _5.fnm, segments_7, _5_nrm.cfs, _5.fdx]
[junit4:junit4]   2> 		commit{dir=MockDirWrapper(NRTCachingDirectory(org.apache.lucene.store.RAMDirectory@1d7c4157 lockFactory=org.apache.lucene.store.NativeFSLockFactory@1f7bce63; maxCacheMB=0.82421875 maxMergeSizeMB=0.04296875)),segFN=segments_8,generation=8,filenames=[_6_Memory_0.ram, _6_nrm.cfs, segments_8, _6_Pulsing40_0.frq, _6_nrm.cfe, _6.fdx, _6_Pulsing40_0.tim, _6.si, _6_Pulsing40_0.tip, _6.fnm, _6.fdt]
[junit4:junit4]   2> 494 T2709 C211 oasc.SolrDeletionPolicy.updateCommits newest commit = 8
[junit4:junit4]   2> 495 T2709 C211 oass.SolrIndexSearcher.<init> Opening Searcher@311a5955 main
[junit4:junit4]   2> 495 T2709 C211 oass.SolrIndexSearcher.getIndexDir WARNING WARNING: Directory impl does not support setting indexDir: org.apache.lucene.store.MockDirectoryWrapper
[junit4:junit4]   2> 496 T2709 C211 oasu.DirectUpdateHandler2.commit end_commit_flush
[junit4:junit4]   2> 496 T2710 oasc.SolrCore.registerSearcher [collection1] Registered new searcher Searcher@311a5955 main{StandardDirectoryReader(segments_8:23 _6(4.0.0.2):C13)}
[junit4:junit4]   2> 497 T2709 C211 UPDATE [collection1] webapp=null path=null params={} {commit=} 0 8
[junit4:junit4]   2> 499 T2709 C211 REQ [collection1] webapp=null path=null params={fl=id&q=*:*&fq={!+needScore%3Dfalse+df%3Dsrpt_quad}[32,-80+TO+33,-79]&rows=1000} hits=1 status=0 QTime=1 
[junit4:junit4]   2> 501 T2709 oas.SolrTestCaseJ4.tearDown ###Ending testRangeSyntax {p0=srpt_quad}
[junit4:junit4]   2> 504 T2709 oas.SolrTestCaseJ4.setUp ###Starting checkQueryEmptyIndex {p0=srpt_quad}
[junit4:junit4]   2> 506 T2709 C211 oasu.DirectUpdateHandler2.deleteAll [collection1] REMOVING ALL DOCUMENTS FROM INDEX
[junit4:junit4]   2> 507 T2709 C211 UPDATE [collection1] webapp=null path=null params={} {deleteByQuery=*:*} 0 1
[junit4:junit4]   2> 510 T2709 C211 REQ [collection1] webapp=null path=null params={fl=id&q=*:*&fq={!field+f%3Dsrpt_quad+score%3DrecipDistance}Intersects(Circle(0,0+d%3D0.8993203677616635))&rows=1000} hits=3 status=0 QTime=2 
[junit4:junit4]   2> 511 T2709 oas.SolrTestCaseJ4.assertQ SEVERE REQUEST FAILED: xpath=*[count(//doc)=0]
[junit4:junit4]   2> 		xml response was: <?xml version="1.0" encoding="UTF-8"?>
[junit4:junit4]   2> 	<response>
[junit4:junit4]   2> 	<lst name="responseHeader"><int name="status">0</int><int name="QTime">2</int></lst><result name="response" numFound="3" start="0"><doc><str name="id">5</str></doc><doc><str name="id">6</str></doc><doc><str name="id">7</str></doc></result>
[junit4:junit4]   2> 	</response>
[junit4:junit4]   2> 	
[junit4:junit4]   2> 		request was:fl=id&q=*:*&fq={!field+f%3Dsrpt_quad+score%3DrecipDistance}Intersects(Circle(0,0+d%3D0.8993203677616635))&rows=1000
[junit4:junit4]   2> 511 T2709 oasc.SolrException.log SEVERE REQUEST FAILED: fl=id&q=*:*&fq={!field+f%3Dsrpt_quad+score%3DrecipDistance}Intersects(Circle(0,0+d%3D0.8993203677616635))&rows=1000:java.lang.RuntimeException: REQUEST FAILED: xpath=*[count(//doc)=0]
[junit4:junit4]   2> 		xml response was: <?xml version="1.0" encoding="UTF-8"?>
[junit4:junit4]   2> 	<response>
[junit4:junit4]   2> 	<lst name="responseHeader"><int name="status">0</int><int name="QTime">2</int></lst><result name="response" numFound="3" start="0"><doc><str name="id">5</str></doc><doc><str name="id">6</str></doc><doc><str name="id">7</str></doc></result>
[junit4:junit4]   2> 	</response>
[junit4:junit4]   2> 	
[junit4:junit4]   2> 		request was:fl=id&q=*:*&fq={!field+f%3Dsrpt_quad+score%3DrecipDistance}Intersects(Circle(0,0+d%3D0.8993203677616635))&rows=1000
[junit4:junit4]   2> 		at org.apache.solr.SolrTestCaseJ4.assertQ(SolrTestCaseJ4.java:496)
[junit4:junit4]   2> 		at org.apache.solr.SolrTestCaseJ4.assertQ(SolrTestCaseJ4.java:470)
[junit4:junit4]   2> 		at org.apache.solr.search.TestSolr4Spatial.checkHits(TestSolr4Spatial.java:170)
[junit4:junit4]   2> 		at org.apache.solr.search.TestSolr4Spatial.checkHits(TestSolr4Spatial.java:139)
[junit4:junit4]   2> 		at org.apache.solr.search.TestSolr4Spatial.checkQueryEmptyIndex(TestSolr4Spatial.java:135)
[junit4:junit4]   2> 		at sun.reflect.NativeMethodAccessorImpl.invoke0(Native Method)
[junit4:junit4]   2> 		at sun.reflect.NativeMethodAccessorImpl.invoke(NativeMethodAccessorImpl.java:57)
[junit4:junit4]   2> 		at sun.reflect.DelegatingMethodAccessorImpl.invoke(DelegatingMethodAccessorImpl.java:43)
[junit4:junit4]   2> 		at java.lang.reflect.Method.invoke(Method.java:601)
[junit4:junit4]   2> 		at com.carrotsearch.randomizedtesting.RandomizedRunner.invoke(RandomizedRunner.java:1559)
[junit4:junit4]   2> 		at com.carrotsearch.randomizedtesting.RandomizedRunner.access$600(RandomizedRunner.java:79)
[junit4:junit4]   2> 		at com.carrotsearch.randomizedtesting.RandomizedRunner$6.evaluate(RandomizedRunner.java:737)
[junit4:junit4]   2> 		at com.carrotsearch.randomizedtesting.RandomizedRunner$7.evaluate(RandomizedRunner.java:773)
[junit4:junit4]   2> 		at com.carrotsearch.randomizedtesting.RandomizedRunner$8.evaluate(RandomizedRunner.java:787)
[junit4:junit4]   2> 		at com.carrotsearch.randomizedtesting.rules.SystemPropertiesRestoreRule$1.evaluate(SystemPropertiesRestoreRule.java:53)
[junit4:junit4]   2> 		at org.apache.lucene.util.TestRuleSetupTeardownChained$1.evaluate(TestRuleSetupTeardownChained.java:50)
[junit4:junit4]   2> 		at org.apache.lucene.util.TestRuleFieldCacheSanity$1.evaluate(TestRuleFieldCacheSanity.java:51)
[junit4:junit4]   2> 		at org.apache.lucene.util.AbstractBeforeAfterRule$1.evaluate(AbstractBeforeAfterRule.java:45)
[junit4:junit4]   2> 		at com.carrotsearch.randomizedtesting.rules.SystemPropertiesInvariantRule$1.evaluate(SystemPropertiesInvariantRule.java:55)
[junit4:junit4]   2> 		at org.apache.lucene.util.TestRuleThreadAndTestName$1.evaluate(TestRuleThreadAndTestName.java:48)
[junit4:junit4]   2> 		at org.apache.lucene.util.TestRuleIgnoreAfterMaxFailures$1.evaluate(TestRuleIgnoreAfterMaxFailures.java:70)
[junit4:junit4]   2> 		at org.apache.lucene.util.TestRuleMarkFailure$1.evaluate(TestRuleMarkFailure.java:48)
[junit4:junit4]   2> 		at com.carrotsearch.randomizedtesting.rules.StatementAdapter.evaluate(StatementAdapter.java:36)
[junit4:junit4]   2> 		at com.carrotsearch.randomizedtesting.ThreadLeakControl$StatementRunner.run(ThreadLeakControl.java:358)
[junit4:junit4]   2> 		at com.carrotsearch.randomizedtesting.ThreadLeakControl.forkTimeoutingTask(ThreadLeakControl.java:782)
[junit4:junit4]   2> 		at com.carrotsearch.randomizedtesting.ThreadLeakControl$3.evaluate(ThreadLeakControl.java:442)
[junit4:junit4]   2> 		at com.carrotsearch.randomizedtesting.RandomizedRunner.runSingleTest(RandomizedRunner.java:746)
[junit4:junit4]   2> 		at com.carrotsearch.randomizedtesting.RandomizedRunner$3.evaluate(RandomizedRunner.java:648)
[junit4:junit4]   2> 		at com.carrotsearch.randomizedtesting.RandomizedRunner$4.evaluate(RandomizedRunner.java:682)
[junit4:junit4]   2> 		at com.carrotsearch.randomizedtesting.RandomizedRunner$5.evaluate(RandomizedRunner.java:693)
[junit4:junit4]   2> 		at com.carrotsearch.randomizedtesting.rules.StatementAdapter.evaluate(StatementAdapter.java:36)
[junit4:junit4]   2> 		at com.carrotsearch.randomizedtesting.rules.SystemPropertiesRestoreRule$1.evaluate(SystemPropertiesRestoreRule.java:53)
[junit4:junit4]   2> 		at org.apache.lucene.util.AbstractBeforeAfterRule$1.evaluate(AbstractBeforeAfterRule.java:45)
[junit4:junit4]   2> 		at org.apache.lucene.util.TestRuleStoreClassName$1.evaluate(TestRuleStoreClassName.java:42)
[junit4:junit4]   2> 		at com.carrotsearch.randomizedtesting.rules.SystemPropertiesInvariantRule$1.evaluate(SystemPropertiesInvariantRule.java:55)
[junit4:junit4]   2> 		at com.carrotsearch.randomizedtesting.rules.NoShadowingOrOverridesOnMethodsRule$1.evaluate(NoShadowingOrOverridesOnMethodsRule.java:39)
[junit4:junit4]   2> 		at com.carrotsearch.randomizedtesting.rules.NoShadowingOrOverridesOnMethodsRule$1.evaluate(NoShadowingOrOverridesOnMethodsRule.java:39)
[junit4:junit4]   2> 		at com.carrotsearch.randomizedtesting.rules.StatementAdapter.evaluate(StatementAdapter.java:36)
[junit4:junit4]   2> 		at org.apache.lucene.util.TestRuleAssertionsRequired$1.evaluate(TestRuleAssertionsRequired.java:43)
[junit4:junit4]   2> 		at org.apache.lucene.util.TestRuleMarkFailure$1.evaluate(TestRuleMarkFailure.java:48)
[junit4:junit4]   2> 		at org.apache.lucene.util.TestRuleIgnoreAfterMaxFailures$1.evaluate(TestRuleIgnoreAfterMaxFailures.java:70)
[junit4:junit4]   2> 		at org.apache.lucene.util.TestRuleIgnoreTestSuites$1.evaluate(TestRuleIgnoreTestSuites.java:55)
[junit4:junit4]   2> 		at com.carrotsearch.randomizedtesting.rules.StatementAdapter.evaluate(StatementAdapter.java:36)
[junit4:junit4]   2> 		at com.carrotsearch.randomizedtesting.ThreadLeakControl$StatementRunner.run(ThreadLeakControl.java:358)
[junit4:junit4]   2> 		at java.lang.Thread.run(Thread.java:722)
[junit4:junit4]   2> 	
[junit4:junit4]   2> 512 T2709 oas.SolrTestCaseJ4.tearDown ###Ending checkQueryEmptyIndex {p0=srpt_quad}
[junit4:junit4]   2> NOTE: reproduce with: ant test  -Dtestcase=TestSolr4Spatial -Dtests.method="checkQueryEmptyIndex {p0=srpt_quad}" -Dtests.seed=863139162B144AAB -Dtests.multiplier=3 -Dtests.slow=true -Dtests.locale=en_SG -Dtests.timezone=ART -Dtests.file.encoding=US-ASCII
[junit4:junit4] ERROR   0.02s J1 | TestSolr4Spatial.checkQueryEmptyIndex {p0=srpt_quad} <<<
[junit4:junit4]    > Throwable #1: java.lang.RuntimeException: Exception during query
[junit4:junit4]    > 	at __randomizedtesting.SeedInfo.seed([863139162B144AAB:86FBB2FBE076CDEB]:0)
[junit4:junit4]    > 	at org.apache.solr.SolrTestCaseJ4.assertQ(SolrTestCaseJ4.java:503)
[junit4:junit4]    > 	at org.apache.solr.SolrTestCaseJ4.assertQ(SolrTestCaseJ4.java:470)
[junit4:junit4]    > 	at org.apache.solr.search.TestSolr4Spatial.checkHits(TestSolr4Spatial.java:170)
[junit4:junit4]    > 	at org.apache.solr.search.TestSolr4Spatial.checkHits(TestSolr4Spatial.java:139)
[junit4:junit4]    > 	at org.apache.solr.search.TestSolr4Spatial.checkQueryEmptyIndex(TestSolr4Spatial.java:135)
[junit4:junit4]    > 	at sun.reflect.NativeMethodAccessorImpl.invoke0(Native Method)
[junit4:junit4]    > 	at sun.reflect.NativeMethodAccessorImpl.invoke(NativeMethodAccessorImpl.java:57)
[junit4:junit4]    > 	at sun.reflect.DelegatingMethodAccessorImpl.invoke(DelegatingMethodAccessorImpl.java:43)
[junit4:junit4]    > 	at java.lang.reflect.Method.invoke(Method.java:601)
[junit4:junit4]    > 	at com.carrotsearch.randomizedtesting.RandomizedRunner.invoke(RandomizedRunner.java:1559)
[junit4:junit4]    > 	at com.carrotsearch.randomizedtesting.RandomizedRunner.access$600(RandomizedRunner.java:79)
[junit4:junit4]    > 	at com.carrotsearch.randomizedtesting.RandomizedRunner$6.evaluate(RandomizedRunner.java:737)
[junit4:junit4]    > 	at com.carrotsearch.randomizedtesting.RandomizedRunner$7.evaluate(RandomizedRunner.java:773)
[junit4:junit4]    > 	at com.carrotsearch.randomizedtesting.RandomizedRunner$8.evaluate(RandomizedRunner.java:787)
[junit4:junit4]    > 	at com.carrotsearch.randomizedtesting.rules.SystemPropertiesRestoreRule$1.evaluate(SystemPropertiesRestoreRule.java:53)
[junit4:junit4]    > 	at org.apache.lucene.util.TestRuleSetupTeardownChained$1.evaluate(TestRuleSetupTeardownChained.java:50)
[junit4:junit4]    > 	at org.apache.lucene.util.TestRuleFieldCacheSanity$1.evaluate(TestRuleFieldCacheSanity.java:51)
[junit4:junit4]    > 	at org.apache.lucene.util.AbstractBeforeAfterRule$1.evaluate(AbstractBeforeAfterRule.java:45)
[junit4:junit4]    > 	at com.carrotsearch.randomizedtesting.rules.SystemPropertiesInvariantRule$1.evaluate(SystemPropertiesInvariantRule.java:55)
[junit4:junit4]    > 	at org.apache.lucene.util.TestRuleThreadAndTestName$1.evaluate(TestRuleThreadAndTestName.java:48)
[junit4:junit4]    > 	at org.apache.lucene.util.TestRuleIgnoreAfterMaxFailures$1.evaluate(TestRuleIgnoreAfterMaxFailures.java:70)
[junit4:junit4]    > 	at org.apache.lucene.util.TestRuleMarkFailure$1.evaluate(TestRuleMarkFailure.java:48)
[junit4:junit4]    > 	at com.carrotsearch.randomizedtesting.rules.StatementAdapter.evaluate(StatementAdapter.java:36)
[junit4:junit4]    > 	at com.carrotsearch.randomizedtesting.ThreadLeakControl$StatementRunner.run(ThreadLeakControl.java:358)
[junit4:junit4]    > 	at com.carrotsearch.randomizedtesting.ThreadLeakControl.forkTimeoutingTask(ThreadLeakControl.java:782)
[junit4:junit4]    > 	at com.carrotsearch.randomizedtesting.ThreadLeakControl$3.evaluate(ThreadLeakControl.java:442)
[junit4:junit4]    > 	at com.carrotsearch.randomizedtesting.RandomizedRunner.runSingleTest(RandomizedRunner.java:746)
[junit4:junit4]    > 	at com.carrotsearch.randomizedtesting.RandomizedRunner$3.evaluate(RandomizedRunner.java:648)
[junit4:junit4]    > 	at com.carrotsearch.randomizedtesting.RandomizedRunner$4.evaluate(RandomizedRunner.java:682)
[junit4:junit4]    > 	at com.carrotsearch.randomizedtesting.RandomizedRunner$5.evaluate(RandomizedRunner.java:693)
[junit4:junit4]    > 	at com.carrotsearch.randomizedtesting.rules.StatementAdapter.evaluate(StatementAdapter.java:36)
[junit4:junit4]    > 	at com.carrotsearch.randomizedtesting.rules.SystemPropertiesRestoreRule$1.evaluate(SystemPropertiesRestoreRule.java:53)
[junit4:junit4]    > 	at org.apache.lucene.util.AbstractBeforeAfterRule$1.evaluate(AbstractBeforeAfterRule.java:45)
[junit4:junit4]    > 	at org.apache.lucene.util.TestRuleStoreClassName$1.evaluate(TestRuleStoreClassName.java:42)
[junit4:junit4]    > 	at com.carrotsearch.randomizedtesting.rules.SystemPropertiesInvariantRule$1.evaluate(SystemPropertiesInvariantRule.java:55)
[junit4:junit4]    > 	at com.carrotsearch.randomizedtesting.rules.NoShadowingOrOverridesOnMethodsRule$1.evaluate(NoShadowingOrOverridesOnMethodsRule.java:39)
[junit4:junit4]    > 	at com.carrotsearch.randomizedtesting.rules.NoShadowingOrOverridesOnMethodsRule$1.evaluate(NoShadowingOrOverridesOnMethodsRule.java:39)
[junit4:junit4]    > 	at com.carrotsearch.randomizedtesting.rules.StatementAdapter.evaluate(StatementAdapter.java:36)
[junit4:junit4]    > 	at org.apache.lucene.util.TestRuleAssertionsRequired$1.evaluate(TestRuleAssertionsRequired.java:43)
[junit4:junit4]    > 	at org.apache.lucene.util.TestRuleMarkFailure$1.evaluate(TestRuleMarkFailure.java:48)
[junit4:junit4]    > 	at org.apache.lucene.util.TestRuleIgnoreAfterMaxFailures$1.evaluate(TestRuleIgnoreAfterMaxFailures.java:70)
[junit4:junit4]    > 	at org.apache.lucene.util.TestRuleIgnoreTestSuites$1.evaluate(TestRuleIgnoreTestSuites.java:55)
[junit4:junit4]    > 	at com.carrotsearch.randomizedtesting.rules.StatementAdapter.evaluate(StatementAdapter.java:36)
[junit4:junit4]    > 	at com.carrotsearch.randomizedtesting.ThreadLeakControl$StatementRunner.run(ThreadLeakControl.java:358)
[junit4:junit4]    > 	at java.lang.Thread.run(Thread.java:722)
[junit4:junit4]    > Caused by: java.lang.RuntimeException: REQUEST FAILED: xpath=*[count(//doc)=0]
[junit4:junit4]    > 	xml response was: <?xml version="1.0" encoding="UTF-8"?>
[junit4:junit4]    > <response>
[junit4:junit4]    > <lst name="responseHeader"><int name="status">0</int><int name="QTime">2</int></lst><result name="response" numFound="3" start="0"><doc><str name="id">5</str></doc><doc><str name="id">6</str></doc><doc><str name="id">7</str></doc></result>
[junit4:junit4]    > </response>
[junit4:junit4]    > 
[junit4:junit4]    > 	request was:fl=id&q=*:*&fq={!field+f%3Dsrpt_quad+score%3DrecipDistance}Intersects(Circle(0,0+d%3D0.8993203677616635))&rows=1000
[junit4:junit4]    > 	at org.apache.solr.SolrTestCaseJ4.assertQ(SolrTestCaseJ4.java:496)
[junit4:junit4]    > 	... 44 more
[junit4:junit4]   2> 521 T2709 oas.SolrTestCaseJ4.setUp ###Starting testIntersectFilter {p0=srpt_quad}
[junit4:junit4]   2> 523 T2709 C211 oasu.DirectUpdateHandler2.deleteAll [collection1] REMOVING ALL DOCUMENTS FROM INDEX
[junit4:junit4]   2> 523 T2709 C211 UPDATE [collection1] webapp=null path=null params={} {deleteByQuery=*:*} 0 1
[junit4:junit4]   2> 526 T2709 C211 UPDATE [collection1] webapp=null path=null params={} {add=[1]} 0 1
[junit4:junit4]   2> 529 T2709 C211 UPDATE [collection1] webapp=null path=null params={} {add=[2]} 0 0
[junit4:junit4]   2> 532 T2709 C211 UPDATE [collection1] webapp=null path=null params={} {add=[3]} 0 1
[junit4:junit4]   2> 535 T2709 C211 UPDATE [collection1] webapp=null path=null params={} {add=[4]} 0 1
[junit4:junit4]   2> 538 T2709 C211 UPDATE [collection1] webapp=null path=null params={} {add=[5]} 0 1
[junit4:junit4]   2> 541 T2709 C211 UPDATE [collection1] webapp=null path=null params={} {add=[6]} 0 0
[junit4:junit4]   2> 544 T2709 C211 UPDATE [collection1] webapp=null path=null params={} {add=[7]} 0 1
[junit4:junit4]   2> 547 T2709 C211 UPDATE [collection1] webapp=null path=null params={} {add=[8]} 0 0
[junit4:junit4]   2> 550 T2709 C211 UPDATE [collection1] webapp=null path=null params={} {add=[9]} 0 0
[junit4:junit4]   2> 553 T2709 C211 UPDATE [collection1] webapp=null path=null params={} {add=[10]} 0 0
[junit4:junit4]   2> 564 T2709 C211 UPDATE [collection1] webapp=null path=null params={} {add=[11]} 0 1
[junit4:junit4]   2> 567 T2709 C211 UPDATE [collection1] webapp=null path=null params={} {add=[12]} 0 1
[junit4:junit4]   2> 569 T2709 C211 UPDATE [collection1] webapp=null path=null params={} {add=[13]} 0 0
[junit4:junit4]   2> 572 T2709 C211 oasu.DirectUpdateHandler2.commit start commit{flags=0,_version_=0,optimize=false,openSearcher=true,waitSearcher=true,expungeDeletes=false,softCommit=false}
[junit4:junit4]   2> 575 T2709 C211 oasc.SolrDeletionPolicy.onCommit SolrDeletionPolicy.onCommit: commits:num=2
[junit4:junit4]   2> 		commit{dir=MockDirWrapper(NRTCachingDirectory(org.apache.lucene.store.RAMDirectory@1d7c4157 lockFactory=org.apache.lucene.store.NativeFSLockFactory@1f7bce63; maxCacheMB=0.82421875 maxMergeSizeMB=0.04296875)),segFN=segments_8,generation=8,filenames=[_6_Memory_0.ram, _6_nrm.cfs, segments_8, _6_Pulsing40_0.frq, _6_nrm.cfe, _6.fdx, _6_Pulsing40_0.tim, _6.si, _6_Pulsing40_0.tip, _6.fnm, _6.fdt]
[junit4:junit4]   2> 		commit{dir=MockDirWrapper(NRTCachingDirectory(org.apache.lucene.store.RAMDirectory@1d7c4157 lockFactory=org.apache.lucene.store.NativeFSLockFactory@1f7bce63; maxCacheMB=0.82421875 maxMergeSizeMB=0.04296875)),segFN=segments_9,generation=9,filenames=[_7_Pulsing40_0.tim, segments_9, _7.fnm, _7_Pulsing40_0.frq, _7_nrm.cfe, _7_nrm.cfs, _7.si, _7.fdx, _7.fdt, _7_Memory_0.ram, _7_Pulsing40_0.tip]
[junit4:junit4]   2> 575 T2709 C211 oasc.SolrDeletionPolicy.updateCommits newest commit = 9
[junit4:junit4]   2> 576 T2709 C211 oass.SolrIndexSearcher.<init> Opening Searcher@a863731 main
[junit4:junit4]   2> 576 T2709 C211 oass.SolrIndexSearcher.getIndexDir WARNING WARNING: Directory impl does not support setting indexDir: org.apache.lucene.store.MockDirectoryWrapper
[junit4:junit4]   2> 577 T2710 oasc.SolrCore.registerSearcher [collection1] Registered new searcher Searcher@a863731 main{StandardDirectoryReader(segments_9:27 _7(4.0.0.2):C13)}
[junit4:junit4]   2> 577 T2709 C211 oasu.DirectUpdateHandler2.commit end_commit_flush
[junit4:junit4]   2> 577 T2709 C211 UPDATE [collection1] webapp=null path=null params={} {commit=} 0 5
[junit4:junit4]   2> 580 T2709 C211 REQ [collection1] webapp=null path=null params={fl=id&q=*:*&fq={!field+f%3Dsrpt_quad}Intersects(Circle(1,1+d%3D1.5738106435829113))&rows=1000} hits=3 status=0 QTime=2 
[junit4:junit4]   2> 584 T2709 C211 REQ [collection1] webapp=null path=null params={fl=id&q=*:*&fq={!field+f%3Dsrpt_quad+score%3Ddistance}Intersects(Circle(0,179.8+d%3D1.798640735523327))&rows=1000} hits=2 status=0 QTime=1 
[junit4:junit4]   2> 587 T2709 C211 REQ [collection1] webapp=null path=null params={fl=id&q=*:*&fq={!field+f%3Dsrpt_quad+score%3Dnone}Intersects(Circle(89.8,50+d%3D1.798640735523327))&rows=1000} hits=2 status=0 QTime=1 
[junit4:junit4]   2> 590 T2709 C211 REQ [collection1] webapp=null path=null params={fl=id&q=*:*&fq={!field+f%3Dsrpt_quad}Intersects(Circle(-89.8,50+d%3D1.798640735523327))&rows=1000} hits=2 status=0 QTime=1 
[junit4:junit4]   2> 592 T2709 C211 REQ [collection1] webapp=null path=null params={fl=id&q=*:*&fq={!field+f%3Dsrpt_quad+score%3Dnone}Intersects(Circle(33.0,-80.0+d%3D2.6979611032849906))&rows=1000} hits=2 status=0 QTime=0 
[junit4:junit4]   2> 594 T2709 C211 REQ [collection1] webapp=null path=null params={fl=id&q=*:*&fq={!field+f%3Dsrpt_quad+score%3Ddistance}Intersects(Circle(1,1+d%3D44.96601838808318))&rows=1000} hits=3 status=0 QTime=1 
[junit4:junit4]   2> 598 T2709 C211 REQ [collection1] webapp=null path=null params={fl=id&q=*:*&fq={!field+f%3Dsrpt_quad}Intersects(-0.034898+-0.034898+0.234898+0.234898)&rows=1000} hits=2 status=0 QTime=1 
[junit4:junit4]   2> 602 T2709 C211 oasu.DirectUpdateHandler2.deleteAll [collection1] REMOVING ALL DOCUMENTS FROM INDEX
[junit4:junit4]   2> 602 T2709 C211 UPDATE [collection1] webapp=null path=null params={} {deleteByQuery=*:*} 0 1
[junit4:junit4]   2> 605 T2709 C211 UPDATE [collection1] webapp=null path=null params={} {add=[14]} 0 1
[junit4:junit4]   2> 608 T2709 C211 UPDATE [collection1] webapp=null path=null params={} {add=[15]} 0 0
[junit4:junit4]   2> 611 T2709 C211 UPDATE [collection1] webapp=null path=null params={} {add=[16]} 0 0
[junit4:junit4]   2> 614 T2709 C211 UPDATE [collection1] webapp=null path=null params={} {add=[17]} 0 1
[junit4:junit4]   2> 616 T2709 C211 oasu.DirectUpdateHandler2.commit start commit{flags=0,_version_=0,optimize=false,openSearcher=true,waitSearcher=true,expungeDeletes=false,softCommit=false}
[junit4:junit4]   2> 618 T2709 C211 oasc.SolrDeletionPolicy.onCommit SolrDeletionPolicy.onCommit: commits:num=2
[junit4:junit4]   2> 		commit{dir=MockDirWrapper(NRTCachingDirectory(org.apache.lucene.store.RAMDirectory@1d7c4157 lockFactory=org.apache.lucene.store.NativeFSLockFactory@1f7bce63; maxCacheMB=0.82421875 maxMergeSizeMB=0.04296875)),segFN=segments_9,generation=9,filenames=[_7_Pulsing40_0.tim, segments_9, _7.fnm, _7_Pulsing40_0.frq, _7_nrm.cfe, _7_nrm.cfs, _7.si, _7.fdx, _7.fdt, _7_Memory_0.ram, _7_Pulsing40_0.tip]
[junit4:junit4]   2> 		commit{dir=MockDirWrapper(NRTCachingDirectory(org.apache.lucene.store.RAMDirectory@1d7c4157 lockFactory=org.apache.lucene.store.NativeFSLockFactory@1f7bce63; maxCacheMB=0.82421875 maxMergeSizeMB=0.04296875)),segFN=segments_a,generation=10,filenames=[_8.si, _8_nrm.cfs, _8_Pulsing40_0.tip, _8_nrm.cfe, _8.fnm, segments_a, _8_Memory_0.ram, _8_Pulsing40_0.frq, _8.fdx, _8_Pulsing40_0.tim, _8.fdt]
[junit4:junit4]   2> 618 T2709 C211 oasc.SolrDeletionPolicy.updateCommits newest commit = 10
[junit4:junit4]   2> 619 T2709 C211 oass.SolrIndexSearcher.<init> Opening Searcher@9c0ed34 main
[junit4:junit4]   2> 620 T2709 C211 oass.SolrIndexSearcher.getIndexDir WARNING WARNING: Directory impl does not support setting indexDir: org.apache.lucene.store.MockDirectoryWrapper
[junit4:junit4]   2> 620 T2710 oasc.SolrCore.registerSearcher [collection1] Registered new searcher Searcher@9c0ed34 main{StandardDirectoryReader(segments_a:30 _8(4.0.0.2):C4)}
[junit4:junit4]   2> 620 T2709 C211 oasu.DirectUpdateHandler2.commit end_commit_flush
[junit4:junit4]   2> 621 T2709 C211 UPDATE [collection1] webapp=null path=null params={} {commit=} 0 5
[junit4:junit4]   2> 622 T2709 C211 REQ [collection1] webapp=null path=null params={fl=id&q=*:*&fq={!field+f%3Dsrpt_quad+score%3DrecipDistance}Intersects(Circle(0,0+d%3D8.993203677616636))&rows=1000} hits=1 status=0 QTime=0 
[junit4:junit4]   2> 624 T2709 C211 REQ [collection1] webapp=null path=null params={fl=id&q=*:*&fq={!field+f%3Dsrpt_quad+score%3DrecipDistance}Intersects(Circle(0,0+d%3D17.986407355233272))&rows=1000} hits=2 status=0 QTime=0 
[junit4:junit4]   2> 627 T2709 C211 REQ [collection1] webapp=null path=null params={fl=id&q=*:*&fq={!field+f%3Dsrpt_quad+score%3Ddistance}Intersects(-26.979611+-26.979611+26.979611+26.979611)&rows=1000} hits=3 status=0 QTime=0 
[junit4:junit4]   2> 630 T2709 C211 REQ [collection1] webapp=null path=null params={fl=id&q=*:*&fq={!field+f%3Dsrpt_quad+score%3Dnone}Intersects(Circle(0,0+d%3D26.98860423652752))&rows=1000} hits=3 status=0 QTime=1 
[junit4:junit4]   2> 641 T2709 C211 REQ [collection1] webapp=null path=null params={fl=id&q=*:*&fq={!field+f%3Dsrpt_quad+score%3Dnone}Intersects(Circle(0,0+d%3D26.980510353217664))&rows=1000} hits=3 status=0 QTime=1 
[junit4:junit4]   2> 645 T2709 C211 REQ [collection1] webapp=null path=null params={fl=id&q=*:*&fq={!field+f%3Dsrpt_quad+score%3Dnone}Intersects(Circle(43.517030,-96.789603+d%3D0.9802592008602133))&rows=1000} hits=0 status=0 QTime=1 
[junit4:junit4]   2> 647 T2709 C211 REQ [collection1] webapp=null path=null params={fl=id&q=*:*&fq={!field+f%3Dsrpt_quad+score%3DrecipDistance}Intersects(Circle(43.517030,-96.789603+d%3D0.9892524045378299))&rows=1000} hits=0 status=0 QTime=1 
[junit4:junit4]   2> 649 T2709 C211 REQ [collection1] webapp=null path=null params={fl=id&q=*:*&fq={!field+f%3Dsrpt_quad+score%3DrecipDistance}Intersects(-98.153831+42.527778+-95.425375+44.506282)&rows=1000} hits=1 status=0 QTime=1 
[junit4:junit4]   2> 650 T2709 oas.SolrTestCaseJ4.tearDown ###Ending testIntersectFilter {p0=srpt_quad}
[junit4:junit4]   2> 654 T2709 oas.SolrTestCaseJ4.setUp ###Starting checkResultFormat {p0=srpt_quad}
[junit4:junit4]   2> 656 T2709 C211 oasu.DirectUpdateHandler2.deleteAll [collection1] REMOVING ALL DOCUMENTS FROM INDEX
[junit4:junit4]   2> 657 T2709 C211 UPDATE [collection1] webapp=null path=null params={} {deleteByQuery=*:*} 0 1
[junit4:junit4]   2> 660 T2709 C211 UPDATE [collection1] webapp=null path=null params={} {add=[11]} 0 1
[junit4:junit4]   2> 663 T2709 C211 oasu.DirectUpdateHandler2.commit start commit{flags=0,_version_=0,optimize=false,openSearcher=true,waitSearcher=true,expungeDeletes=false,softCommit=false}
[junit4:junit4]   2> 664 T2709 C211 oasc.SolrDeletionPolicy.onCommit SolrDeletionPolicy.onCommit: commits:num=2
[junit4:junit4]   2> 		commit{dir=MockDirWrapper(NRTCachingDirectory(org.apache.lucene.store.RAMDirectory@1d7c4157 lockFactory=org.apache.lucene.store.NativeFSLockFactory@1f7bce63; maxCacheMB=0.82421875 maxMergeSizeMB=0.04296875)),segFN=segments_a,generation=10,filenames=[_8.si, _8_nrm.cfs, _8_Pulsing40_0.tip, _8_nrm.cfe, _8.fnm, segments_a, _8_Memory_0.ram, _8_Pulsing40_0.frq, _8.fdx, _8_Pulsing40_0.tim, _8.fdt]
[junit4:junit4]   2> 		commit{dir=MockDirWrapper(NRTCachingDirectory(org.apache.lucene.store.RAMDirectory@1d7c4157 lockFactory=org.apache.lucene.store.NativeFSLockFactory@1f7bce63; maxCacheMB=0.82421875 maxMergeSizeMB=0.04296875)),segFN=segments_b,generation=11,filenames=[_9_Pulsing40_0.frq, _9_Pulsing40_0.tip, _9_nrm.cfe, segments_b, _9_Pulsing40_0.tim, _9_Memory_0.ram, _9.fnm, _9_nrm.cfs, _9.fdt, _9.si, _9.fdx]
[junit4:junit4]   2> 664 T2709 C211 oasc.SolrDeletionPolicy.updateCommits newest commit = 11
[junit4:junit4]   2> 665 T2709 C211 oass.SolrIndexSearcher.<init> Opening Searcher@4ead98dd main
[junit4:junit4]   2> 666 T2709 C211 oass.SolrIndexSearcher.getIndexDir WARNING WARNING: Directory impl does not support setting indexDir: org.apache.lucene.store.MockDirectoryWrapper
[junit4:junit4]   2> 666 T2710 oasc.SolrCore.registerSearcher [collection1] Registered new searcher Searcher@4ead98dd main{StandardDirectoryReader(segments_b:33 _9(4.0.0.2):C1)}
[junit4:junit4]   2> 666 T2709 C211 oasu.DirectUpdateHandler2.commit end_commit_flush
[junit4:junit4]   2> 667 T2709 C211 UPDATE [collection1] webapp=null path=null params={} {commit=} 0 4
[junit4:junit4]   2> 668 T2709 C211 REQ [collection1] webapp=null path=null params={fl=id,srpt_quad&q=*:*&fq={!field+needScore%3Dfalse+f%3Dsrpt_quad}Intersects(Circle(89.9,-130+d%3D9))&rows=1000} hits=1 status=0 QTime=0 
[junit4:junit4]   2> 670 T2709 oas.SolrTestCaseJ4.tearDown ###Ending checkResultFormat {p0=srpt_quad}
[junit4:junit4]   2> 673 T2709 oas.SolrTestCaseJ4.setUp ###Starting testSort {p0=srpt_quad}
[junit4:junit4]   2> 675 T2709 C211 oasu.DirectUpdateHandler2.deleteAll [collection1] REMOVING ALL DOCUMENTS FROM INDEX
[junit4:junit4]   2> 676 T2709 C211 UPDATE [collection1] webapp=null path=null params={} {deleteByQuery=*:*} 0 1
[junit4:junit4]   2> 679 T2709 C211 UPDATE [collection1] webapp=null path=null params={} {add=[100]} 0 1
[junit4:junit4]   2> 682 T2709 C211 UPDATE [collection1] webapp=null path=null params={} {add=[101]} 0 0
[junit4:junit4]   2> 685 T2709 C211 UPDATE [collection1] webapp=null path=null params={} {add=[999]} 0 0
[junit4:junit4]   2> 688 T2709 C211 oasu.DirectUpdateHandler2.commit start commit{flags=0,_version_=0,optimize=false,openSearcher=true,waitSearcher=true,expungeDeletes=false,softCommit=false}
[junit4:junit4]   2> 689 T2709 C211 oasc.SolrDeletionPolicy.onCommit SolrDeletionPolicy.onCommit: commits:num=2
[junit4:junit4]   2> 		commit{dir=MockDirWrapper(NRTCachingDirectory(org.apache.lucene.store.RAMDirectory@1d7c4157 lockFactory=org.apache.lucene.store.NativeFSLockFactory@1f7bce63; maxCacheMB=0.82421875 maxMergeSizeMB=0.04296875)),segFN=segments_b,generation=11,filenames=[_9_Pulsing40_0.frq, _9_Pulsing40_0.tip, _9_nrm.cfe, segments_b, _9_Pulsing40_0.tim, _9_Memory_0.ram, _9.fnm, _9_nrm.cfs, _9.fdt, _9.si, _9.fdx]
[junit4:junit4]   2> 		commit{dir=MockDirWrapper(NRTCachingDirectory(org.apache.lucene.store.RAMDirectory@1d7c4157 lockFactory=org.apache.lucene.store.NativeFSLockFactory@1f7bce63; maxCacheMB=0.82421875 maxMergeSizeMB=0.04296875)),segFN=segments_c,generation=12,filenames=[_a_nrm.cfe, segments_c, _a_Pulsing40_0.tip, _a_Pulsing40_0.tim, _a_Pulsing40_0.frq, _a_Memory_0.ram, _a.fdt, _a.si, _a_nrm.cfs, _a.fdx, _a.fnm]
[junit4:junit4]   2> 690 T2709 C211 oasc.SolrDeletionPolicy.updateCommits newest commit = 12
[junit4:junit4]   2> 691 T2709 C211 oass.SolrIndexSearcher.<init> Opening Searcher@41ac099b main
[junit4:junit4]   2> 691 T2709 C211 oass.SolrIndexSearcher.getIndexDir WARNING WARNING: Directory impl does not support setting indexDir: org.apache.lucene.store.MockDirectoryWrapper
[junit4:junit4]   2> 692 T2710 oasc.SolrCore.registerSearcher [collection1] Registered new searcher Searcher@41ac099b main{StandardDirectoryReader(segments_c:36 _a(4.0.0.2):C3)}
[junit4:junit4]   2> 692 T2709 C211 oasu.DirectUpdateHandler2.commit end_commit_flush
[junit4:junit4]   2> 692 T2709 C211 UPDATE [collection1] webapp=null path=null params={} {commit=} 0 4
[junit4:junit4]   2> 694 T2709 C211 REQ [collection1] webapp=null path=null params={fl=id,score&q=srpt_quad:"Intersects(Circle(3,4+d%3D9))"} hits=2 status=0 QTime=1 
[junit4:junit4]   2> 695 T2709 C211 REQ [collection1] webapp=null path=null params={sort=score+asc&fl=id,score&q={!+score%3Ddistance}srpt_quad:"Intersects(Circle(3,4+d%3D9))"} hits=2 status=0 QTime=1 
[junit4:junit4]   2> 696 T2709 C211 REQ [collection1] webapp=null path=null params={sort=score+desc&fl=id,score&q={!+score%3DrecipDistance}srpt_quad:"Intersects(Circle(3,4+d%3D9))"} hits=2 status=0 QTime=0 
[junit4:junit4]   2> 698 T2709 C211 REQ [collection1] webapp=null path=null params={sort=score+asc&fl=id,score&q={!+score%3Ddistance}srpt_quad:"Intersects(Circle(4,0+d%3D9))"} hits=2 status=0 QTime=1 
[junit4:junit4]   2> 699 T2709 C211 REQ [collection1] webapp=null path=null params={sortQuery={!+score%3Ddistance}srpt_quad:"Intersects(Circle(3,4+d%3D9))"&sort=query($sortQuery)+asc&fl=id,score&q=-id:999} hits=2 status=0 QTime=1 
[junit4:junit4]   2> 700 T2709 C211 REQ [collection1] webapp=null path=null params={sortQuery={!+score%3Ddistance}srpt_quad:"Intersects(Circle(4,0+d%3D9))"&sort=query($sortQuery)+asc&fl=id,score&q=-id:999} hits=2 status=0 QTime=1 
[junit4:junit4]   2> 701 T2709 oas.SolrTestCaseJ4.tearDown ###Ending testSort {p0=srpt_quad}
[junit4:junit4]   2> 704 T2709 oas.SolrTestCaseJ4.setUp ###Starting testSortMultiVal {p0=srpt_quad}
[junit4:junit4]   2> 707 T2709 C211 oasu.DirectUpdateHandler2.deleteAll [collection1] REMOVING ALL DOCUMENTS FROM INDEX
[junit4:junit4]   2> 707 T2709 C211 UPDATE [collection1] webapp=null path=null params={} {deleteByQuery=*:*} 0 1
[junit4:junit4]   2> 710 T2709 C211 UPDATE [collection1] webapp=null path=null params={} {add=[100]} 0 0
[junit4:junit4]   2> 714 T2709 C211 UPDATE [collection1] webapp=null path=null params={} {add=[101]} 0 1
[junit4:junit4]   2> 717 T2709 C211 oasu.DirectUpdateHandler2.commit start commit{flags=0,_version_=0,optimize=false,openSearcher=true,waitSearcher=true,expungeDeletes=false,softCommit=false}
[junit4:junit4]   2> 719 T2709 C211 oasc.SolrDeletionPolicy.onCommit SolrDeletionPolicy.onCommit: commits:num=2
[junit4:junit4]   2> 		commit{dir=MockDirWrapper(NRTCachingDirectory(org.apache.lucene.store.RAMDirectory@1d7c4157 lockFactory=org.apache.lucene.store.NativeFSLockFactory@1f7bce63; maxCacheMB=0.82421875 maxMergeSizeMB=0.04296875)),segFN=segments_c,generation=12,filenames=[_a_nrm.cfe, segments_c, _a_Pulsing40_0.tip, _a_Pulsing40_0.tim, _a_Pulsing40_0.frq, _a_Memory_0.ram, _a.fdt, _a.si, _a_nrm.cfs, _a.fdx, _a.fnm]
[junit4:junit4]   2> 		commit{dir=MockDirWrapper(NRTCachingDirectory(org.apache.lucene.store.RAMDirectory@1d7c4157 lockFactory=org.apache.lucene.store.NativeFSLockFactory@1f7bce63; maxCacheMB=0.82421875 maxMergeSizeMB=0.04296875)),segFN=segments_d,generation=13,filenames=[_b_Pulsing40_0.frq, _b.si, segments_d, _b_Memory_0.ram, _b_nrm.cfe, _b.fnm, _b.fdt, _b_Pulsing40_0.tip, _b_nrm.cfs, _b.fdx, _b_Pulsing40_0.tim]
[junit4:junit4]   2> 719 T2709 C211 oasc.SolrDeletionPolicy.updateCommits newest commit = 13
[junit4:junit4]   2> 720 T2709 C211 oass.SolrIndexSearcher.<init> Opening Searcher@81ae56a main
[junit4:junit4]   2> 720 T2709 C211 oass.SolrIndexSearcher.getIndexDir WARNING WARNING: Directory impl does not support setting indexDir: org.apache.lucene.store.MockDirectoryWrapper
[junit4:junit4]   2> 721 T2710 oasc.SolrCore.registerSearcher [collection1] Registered new searcher Searcher@81ae56a main{StandardDirectoryReader(segments_d:39 _b(4.0.0.2):C2)}
[junit4:junit4]   2> 721 T2709 C211 oasu.DirectUpdateHandler2.commit end_commit_flush
[junit4:junit4]   2> 721 T2709 C211 UPDATE [collection1] webapp=null path=null params={} {commit=} 0 4
[junit4:junit4]   2> 724 T2709 C211 REQ [collection1] webapp=null path=null params={sort=score+asc&fl=id,score&q={!+score%3Ddistance}srpt_quad:"Intersects(Circle(3,4+d%3D9))"} hits=2 status=0 QTime=1 
[junit4:junit4]   2> 724 T2709 oas.SolrTestCaseJ4.tearDown ###Ending testSortMultiVal {p0=srpt_quad}
[junit4:junit4]   2> 728 T2709 oas.SolrTestCaseJ4.setUp ###Starting testRangeSyntax {p0=stqpt_geohash}
[junit4:junit4]   2> 730 T2709 C211 oasu.DirectUpdateHandler2.deleteAll [collection1] REMOVING ALL DOCUMENTS FROM INDEX
[junit4:junit4]   2> 730 T2709 C211 UPDATE [collection1] webapp=null path=null params={} {deleteByQuery=*:*} 0 0
[junit4:junit4]   2> 734 T2709 C211 oass.AbstractSpatialPrefixTreeFieldType.newSpatialStrategy stqpt_geohash{class=org.apache.solr.schema.SpatialTermQueryPrefixTreeFieldType,analyzer=org.apache.solr.schema.FieldType$DefaultAnalyzer,args={prefixTree=geohash}} strat: TermQueryPrefixTreeStrategy field:stqpt_geohash ctx=SpatialContext{geo=true, calculator=Haversine, worldBounds=Rect(minX=-180.0,maxX=180.0,minY=-90.0,maxY=90.0)} maxLevels: 11
[junit4:junit4]   2> 735 T2709 C211 UPDATE [collection1] webapp=null path=null params={} {add=[1]} 0 2
[junit4:junit4]   2> 749 T2709 C211 UPDATE [collection1] webapp=null path=null params={} {add=[2]} 0 1
[junit4:junit4]   2> 753 T2709 C211 UPDATE [collection1] webapp=null path=null params={} {add=[3]} 0 0
[junit4:junit4]   2> 756 T2709 C211 UPDATE [collection1] webapp=null path=null params={} {add=[4]} 0 0
[junit4:junit4]   2> 759 T2709 C211 UPDATE [collection1] webapp=null path=null params={} {add=[5]} 0 0
[junit4:junit4]   2> 762 T2709 C211 UPDATE [collection1] webapp=null path=null params={} {add=[6]} 0 1
[junit4:junit4]   2> 765 T2709 C211 UPDATE [collection1] webapp=null path=null params={} {add=[7]} 0 1
[junit4:junit4]   2> 768 T2709 C211 UPDATE [collection1] webapp=null path=null params={} {add=[8]} 0 1
[junit4:junit4]   2> 770 T2709 C211 UPDATE [collection1] webapp=null path=null params={} {add=[9]} 0 0
[junit4:junit4]   2> 773 T2709 C211 UPDATE [collection1] webapp=null path=null params={} {add=[10]} 0 0
[junit4:junit4]   2> 776 T2709 C211 UPDATE [collection1] webapp=null path=null params={} {add=[11]} 0 0
[junit4:junit4]   2> 780 T2709 C211 UPDATE [collection1] webapp=null path=null params={} {add=[12]} 0 1
[junit4:junit4]   2> 782 T2709 C211 UPDATE [collection1] webapp=null path=null params={} {add=[13]} 0 0
[junit4:junit4]   2> 785 T2709 C211 oasu.DirectUpdateHandler2.commit start commit{flags=0,_version_=0,optimize=false,openSearcher=true,waitSearcher=true,expungeDeletes=false,softCommit=false}
[junit4:junit4]   2> 787 T2709 C211 oasc.SolrDeletionPolicy.onCommit SolrDeletionPolicy.onCommit: commits:num=2
[junit4:junit4]   2> 		commit{dir=MockDirWrapper(NRTCachingDirectory(org.apache.lucene.store.RAMDirectory@1d7c4157 lockFactory=org.apache.lucene.store.NativeFSLockFactory@1f7bce63; maxCacheMB=0.82421875 maxMergeSizeMB=0.04296875)),segFN=segments_d,generation=13,filenames=[_b_Pulsing40_0.frq, _b.si, segments_d, _b_Memory_0.ram, _b_nrm.cfe, _b.fnm, _b.fdt, _b_Pulsing40_0.tip, _b_nrm.cfs, _b.fdx, _b_Pulsing40_0.tim]
[junit4:junit4]   2> 		commit{dir=MockDirWrapper(NRTCachingDirectory(org.apache.lucene.store.RAMDirectory@1d7c4157 lockFactory=org.apache.lucene.store.NativeFSLockFactory@1f7bce63; maxCacheMB=0.82421875 maxMergeSizeMB=0.04296875)),segFN=segments_e,generation=14,filenames=[_c.fdt, segments_e, _c.si, _c_Direct_0.frq, _c_Direct_0.tim, _c_nrm.cfe, _c_nrm.cfs, _c_Direct_0.tip, _c.fnm, _c.fdx, _c_Memory_0.ram]
[junit4:junit4]   2> 787 T2709 C211 oasc.SolrDeletionPolicy.updateCommits newest commit = 14
[junit4:junit4]   2> 789 T2709 C211 oass.SolrIndexSearcher.<init> Opening Searcher@758a94f5 main
[junit4:junit4]   2> 789 T2709 C211 oass.SolrIndexSearcher.getIndexDir WARNING WARNING: Directory impl does not support setting indexDir: org.apache.lucene.store.MockDirectoryWrapper
[junit4:junit4]   2> 789 T2709 C211 oasu.DirectUpdateHandler2.commit end_commit_flush
[junit4:junit4]   2> 789 T2710 oasc.SolrCore.registerSearcher [collection1] Registered new searcher Searcher@758a94f5 main{StandardDirectoryReader(segments_e:42 _c(4.0.0.2):C13)}
[junit4:junit4]   2> 790 T2709 C211 UPDATE [collection1] webapp=null path=null params={} {commit=} 0 5
[junit4:junit4]   2> 808 T2709 C211 REQ [collection1] webapp=null path=null params={fl=id&q=*:*&fq={!+needScore%3Dfalse+df%3Dstqpt_geohash}[32,-80+TO+33,-79]&rows=1000} hits=1 status=0 QTime=17 
[junit4:junit4]   2> 810 T2709 oas.SolrTestCaseJ4.tearDown ###Ending testRangeSyntax {p0=stqpt_geohash}
[junit4:junit4]   2> 813 T2709 oas.SolrTestCaseJ4.setUp ###Starting checkQueryEmptyIndex {p0=stqpt_geohash}
[junit4:junit4]   2> 815 T2709 C211 oasu.DirectUpdateHandler2.deleteAll [collection1] REMOVING ALL DOCUMENTS FROM INDEX
[junit4:junit4]   2> 816 T2709 C211 UPDATE [collection1] webapp=null path=null params={} {deleteByQuery=*:*} 0 1
[junit4:junit4]   2> 864 T2709 C211 REQ [collection1] webapp=null path=null params={fl=id&q=*:*&fq={!field+f%3Dstqpt_geohash+score%3DrecipDistance}Intersects(Circle(0,0+d%3D0.8993203677616635))&rows=1000} hits=3 status=0 QTime=47 
[junit4:junit4]   2> 865 T2709 oas.SolrTestCaseJ4.assertQ SEVERE REQUEST FAILED: xpath=*[count(//doc)=0]
[junit4:junit4]   2> 		xml response was: <?xml version="1.0" encoding="UTF-8"?>
[junit4:junit4]   2> 	<response>
[junit4:junit4]   2> 	<lst name="responseHeader"><int name="status">0</int><int name="QTime">47</int></lst><result name="response" numFound="3" start="0"><doc><str name="id">5</str></doc><doc><str name="id">6</str></doc><doc><str name="id">7</str></doc></result>
[junit4:junit4]   2> 	</response>
[junit4:junit4]   2> 	
[junit4:junit4]   2> 		request was:fl=id&q=*:*&fq={!field+f%3Dstqpt_geohash+score%3DrecipDistance}Intersects(Circle(0,0+d%3D0.8993203677616635))&rows=1000
[junit4:junit4]   2> 866 T2709 oasc.SolrException.log SEVERE REQUEST FAILED: fl=id&q=*:*&fq={!field+f%3Dstqpt_geohash+score%3DrecipDistance}Intersects(Circle(0,0+d%3D0.8993203677616635))&rows=1000:java.lang.RuntimeException: REQUEST FAILED: xpath=*[count(//doc)=0]
[junit4:junit4]   2> 		xml response was: <?xml version="1.0" encoding="UTF-8"?>
[junit4:junit4]   2> 	<response>
[junit4:junit4]   2> 	<lst name="responseHeader"><int name="status">0</int><int name="QTime">47</int></lst><result name="response" numFound="3" start="0"><doc><str name="id">5</str></doc><doc><str name="id">6</str></doc><doc><str name="id">7</str></doc></result>
[junit4:junit4]   2> 	</response>
[junit4:junit4]   2> 	
[junit4:junit4]   2> 		request was:fl=id&q=*:*&fq={!field+f%3Dstqpt_geohash+score%3DrecipDistance}Intersects(Circle(0,0+d%3D0.8993203677616635))&rows=1000
[junit4:junit4]   2> 		at org.apache.solr.SolrTestCaseJ4.assertQ(SolrTestCaseJ4.java:496)
[junit4:junit4]   2> 		at org.apache.solr.SolrTestCaseJ4.assertQ(SolrTestCaseJ4.java:470)
[junit4:junit4]   2> 		at org.apache.solr.search.TestSolr4Spatial.checkHits(TestSolr4Spatial.java:170)
[junit4:junit4]   2> 		at org.apache.solr.search.TestSolr4Spatial.checkHits(TestSolr4Spatial.java:139)
[junit4:junit4]   2> 		at org.apache.solr.search.TestSolr4Spatial.checkQueryEmptyIndex(TestSolr4Spatial.java:135)
[junit4:junit4]   2> 		at sun.reflect.NativeMethodAccessorImpl.invoke0(Native Method)
[junit4:junit4]   2> 		at sun.reflect.NativeMethodAccessorImpl.invoke(NativeMethodAccessorImpl.java:57)
[junit4:junit4]   2> 		at sun.reflect.DelegatingMethodAccessorImpl.invoke(DelegatingMethodAccessorImpl.java:43)
[junit4:junit4]   2> 		at java.lang.reflect.Method.invoke(Method.java:601)
[junit4:junit4]   2> 		at com.carrotsearch.randomizedtesting.RandomizedRunner.invoke(RandomizedRunner.java:1559)
[junit4:junit4]   2> 		at com.carrotsearch.randomizedtesting.RandomizedRunner.access$600(RandomizedRunner.java:79)
[junit4:junit4]   2> 		at com.carrotsearch.randomizedtesting.RandomizedRunner$6.evaluate(RandomizedRunner.java:737)
[junit4:junit4]   2> 		at com.carrotsearch.randomizedtesting.RandomizedRunner$7.evaluate(RandomizedRunner.java:773)
[junit4:junit4]   2> 		at com.carrotsearch.randomizedtesting.RandomizedRunner$8.evaluate(RandomizedRunner.java:787)
[junit4:junit4]   2> 		at com.carrotsearch.randomizedtesting.rules.SystemPropertiesRestoreRule$1.evaluate(SystemPropertiesRestoreRule.java:53)
[junit4:junit4]   2> 		at org.apache.lucene.util.TestRuleSetupTeardownChained$1.evaluate(TestRuleSetupTeardownChained.java:50)
[junit4:junit4]   2> 		at org.apache.lucene.util.TestRuleFieldCacheSanity$1.evaluate(TestRuleFieldCacheSanity.java:51)
[junit4:junit4]   2> 		at org.apache.lucene.util.AbstractBeforeAfterRule$1.evaluate(AbstractBeforeAfterRule.java:45)
[junit4:junit4]   2> 		at com.carrotsearch.randomizedtesting.rules.SystemPropertiesInvariantRule$1.evaluate(SystemPropertiesInvariantRule.java:55)
[junit4:junit4]   2> 		at org.apache.lucene.util.TestRuleThreadAndTestName$1.evaluate(TestRuleThreadAndTestName.java:48)
[junit4:junit4]   2> 		at org.apache.lucene.util.TestRuleIgnoreAfterMaxFailures$1.evaluate(TestRuleIgnoreAfterMaxFailures.java:70)
[junit4:junit4]   2> 		at org.apache.lucene.util.TestRuleMarkFailure$1.evaluate(TestRuleMarkFailure.java:48)
[junit4:junit4]   2> 		at com.carrotsearch.randomizedtesting.rules.StatementAdapter.evaluate(StatementAdapter.java:36)
[junit4:junit4]   2> 		at com.carrotsearch.randomizedtesting.ThreadLeakControl$StatementRunner.run(ThreadLeakControl.java:358)
[junit4:junit4]   2> 		at com.carrotsearch.randomizedtesting.ThreadLeakControl.forkTimeoutingTask(ThreadLeakControl.java:782)
[junit4:junit4]   2> 		at com.carrotsearch.randomizedtesting.ThreadLeakControl$3.evaluate(ThreadLeakControl.java:442)
[junit4:junit4]   2> 		at com.carrotsearch.randomizedtesting.RandomizedRunner.runSingleTest(RandomizedRunner.java:746)
[junit4:junit4]   2> 		at com.carrotsearch.randomizedtesting.RandomizedRunner$3.evaluate(RandomizedRunner.java:648)
[junit4:junit4]   2> 		at com.carrotsearch.randomizedtesting.RandomizedRunner$4.evaluate(RandomizedRunner.java:682)
[junit4:junit4]   2> 		at com.carrotsearch.randomizedtesting.RandomizedRunner$5.evaluate(RandomizedRunner.java:693)
[junit4:junit4]   2> 		at com.carrotsearch.randomizedtesting.rules.StatementAdapter.evaluate(StatementAdapter.java:36)
[junit4:junit4]   2> 		at com.carrotsearch.randomizedtesting.rules.SystemPropertiesRestoreRule$1.evaluate(SystemPropertiesRestoreRule.java:53)
[junit4:junit4]   2> 		at org.apache.lucene.util.AbstractBeforeAfterRule$1.evaluate(AbstractBeforeAfterRule.java:45)
[junit4:junit4]   2> 		at org.apache.lucene.util.TestRuleStoreClassName$1.evaluate(TestRuleStoreClassName.java:42)
[junit4:junit4]   2> 		at com.carrotsearch.randomizedtesting.rules.SystemPropertiesInvariantRule$1.evaluate(SystemPropertiesInvariantRule.java:55)
[junit4:junit4]   2> 		at com.carrotsearch.randomizedtesting.rules.NoShadowingOrOverridesOnMethodsRule$1.evaluate(NoShadowingOrOverridesOnMethodsRule.java:39)
[junit4:junit4]   2> 		at com.carrotsearch.randomizedtesting.rules.NoShadowingOrOverridesOnMethodsRule$1.evaluate(NoShadowingOrOverridesOnMethodsRule.java:39)
[junit4:junit4]   2> 		at com.carrotsearch.randomizedtesting.rules.StatementAdapter.evaluate(StatementAdapter.java:36)
[junit4:junit4]   2> 		at org.apache.lucene.util.TestRuleAssertionsRequired$1.evaluate(TestRuleAssertionsRequired.java:43)
[junit4:junit4]   2> 		at org.apache.lucene.util.TestRuleMarkFailure$1.evaluate(TestRuleMarkFailure.java:48)
[junit4:junit4]   2> 		at org.apache.lucene.util.TestRuleIgnoreAfterMaxFailures$1.evaluate(TestRuleIgnoreAfterMaxFailures.java:70)
[junit4:junit4]   2> 		at org.apache.lucene.util.TestRuleIgnoreTestSuites$1.evaluate(TestRuleIgnoreTestSuites.java:55)
[junit4:junit4]   2> 		at com.carrotsearch.randomizedtesting.rules.StatementAdapter.evaluate(StatementAdapter.java:36)
[junit4:junit4]   2> 		at com.carrotsearch.randomizedtesting.ThreadLeakControl$StatementRunner.run(ThreadLeakControl.java:358)
[junit4:junit4]   2> 		at java.lang.Thread.run(Thread.java:722)
[junit4:junit4]   2> 	
[junit4:junit4]   2> 867 T2709 oas.SolrTestCaseJ4.tearDown ###Ending checkQueryEmptyIndex {p0=stqpt_geohash}
[junit4:junit4]   2> NOTE: reproduce with: ant test  -Dtestcase=TestSolr4Spatial -Dtests.method="checkQueryEmptyIndex {p0=stqpt_geohash}" -Dtests.seed=863139162B144AAB -Dtests.multiplier=3 -Dtests.slow=true -Dtests.locale=en_SG -Dtests.timezone=ART -Dtests.file.encoding=US-ASCII
[junit4:junit4] ERROR   0.06s J1 | TestSolr4Spatial.checkQueryEmptyIndex {p0=stqpt_geohash} <<<
[junit4:junit4]    > Throwable #1: java.lang.RuntimeException: Exception during query
[junit4:junit4]    > 	at __randomizedtesting.SeedInfo.seed([863139162B144AAB:86FBB2FBE076CDEB]:0)
[junit4:junit4]    > 	at org.apache.solr.SolrTestCaseJ4.assertQ(SolrTestCaseJ4.java:503)
[junit4:junit4]    > 	at org.apache.solr.SolrTestCaseJ4.assertQ(SolrTestCaseJ4.java:470)
[junit4:junit4]    > 	at org.apache.solr.search.TestSolr4Spatial.checkHits(TestSolr4Spatial.java:170)
[junit4:junit4]    > 	at org.apache.solr.search.TestSolr4Spatial.checkHits(TestSolr4Spatial.java:139)
[junit4:junit4]    > 	at org.apache.solr.search.TestSolr4Spatial.checkQueryEmptyIndex(TestSolr4Spatial.java:135)
[junit4:junit4]    > 	at sun.reflect.NativeMethodAccessorImpl.invoke0(Native Method)
[junit4:junit4]    > 	at sun.reflect.NativeMethodAccessorImpl.invoke(NativeMethodAccessorImpl.java:57)
[junit4:junit4]    > 	at sun.reflect.DelegatingMethodAccessorImpl.invoke(DelegatingMethodAccessorImpl.java:43)
[junit4:junit4]    > 	at java.lang.reflect.Method.invoke(Method.java:601)
[junit4:junit4]    > 	at com.carrotsearch.randomizedtesting.RandomizedRunner.invoke(RandomizedRunner.java:1559)
[junit4:junit4]    > 	at com.carrotsearch.randomizedtesting.RandomizedRunner.access$600(RandomizedRunner.java:79)
[junit4:junit4]    > 	at com.carrotsearch.randomizedtesting.RandomizedRunner$6.evaluate(RandomizedRunner.java:737)
[junit4:junit4]    > 	at com.carrotsearch.randomizedtesting.RandomizedRunner$7.evaluate(RandomizedRunner.java:773)
[junit4:junit4]    > 	at com.carrotsearch.randomizedtesting.RandomizedRunner$8.evaluate(RandomizedRunner.java:787)
[junit4:junit4]    > 	at com.carrotsearch.randomizedtesting.rules.SystemPropertiesRestoreRule$1.evaluate(SystemPropertiesRestoreRule.java:53)
[junit4:junit4]    > 	at org.apache.lucene.util.TestRuleSetupTeardownChained$1.evaluate(TestRuleSetupTeardownChained.java:50)
[junit4:junit4]    > 	at org.apache.lucene.util.TestRuleFieldCacheSanity$1.evaluate(TestRuleFieldCacheSanity.java:51)
[junit4:junit4]    > 	at org.apache.lucene.util.AbstractBeforeAfterRule$1.evaluate(AbstractBeforeAfterRule.java:45)
[junit4:junit4]    > 	at com.carrotsearch.randomizedtesting.rules.SystemPropertiesInvariantRule$1.evaluate(SystemPropertiesInvariantRule.java:55)
[junit4:junit4]    > 	at org.apache.lucene.util.TestRuleThreadAndTestName$1.evaluate(TestRuleThreadAndTestName.java:48)
[junit4:junit4]    > 	at org.apache.lucene.util.TestRuleIgnoreAfterMaxFailures$1.evaluate(TestRuleIgnoreAfterMaxFailures.java:70)
[junit4:junit4]    > 	at org.apache.lucene.util.TestRuleMarkFailure$1.evaluate(TestRuleMarkFailure.java:48)
[junit4:junit4]    > 	at com.carrotsearch.randomizedtesting.rules.StatementAdapter.evaluate(StatementAdapter.java:36)
[junit4:junit4]    > 	at com.carrotsearch.randomizedtesting.ThreadLeakControl$StatementRunner.run(ThreadLeakControl.java:358)
[junit4:junit4]    > 	at com.carrotsearch.randomizedtesting.ThreadLeakControl.forkTimeoutingTask(ThreadLeakControl.java:782)
[junit4:junit4]    > 	at com.carrotsearch.randomizedtesting.ThreadLeakControl$3.evaluate(ThreadLeakControl.java:442)
[junit4:junit4]    > 	at com.carrotsearch.randomizedtesting.RandomizedRunner.runSingleTest(RandomizedRunner.java:746)
[junit4:junit4]    > 	at com.carrotsearch.randomizedtesting.RandomizedRunner$3.evaluate(RandomizedRunner.java:648)
[junit4:junit4]    > 	at com.carrotsearch.randomizedtesting.RandomizedRunner$4.evaluate(RandomizedRunner.java:682)
[junit4:junit4]    > 	at com.carrotsearch.randomizedtesting.RandomizedRunner$5.evaluate(RandomizedRunner.java:693)
[junit4:junit4]    > 	at com.carrotsearch.randomizedtesting.rules.StatementAdapter.evaluate(StatementAdapter.java:36)
[junit4:junit4]    > 	at com.carrotsearch.randomizedtesting.rules.SystemPropertiesRestoreRule$1.evaluate(SystemPropertiesRestoreRule.java:53)
[junit4:junit4]    > 	at org.apache.lucene.util.AbstractBeforeAfterRule$1.evaluate(AbstractBeforeAfterRule.java:45)
[junit4:junit4]    > 	at org.apache.lucene.util.TestRuleStoreClassName$1.evaluate(TestRuleStoreClassName.java:42)
[junit4:junit4]    > 	at com.carrotsearch.randomizedtesting.rules.SystemPropertiesInvariantRule$1.evaluate(SystemPropertiesInvariantRule.java:55)
[junit4:junit4]    > 	at com.carrotsearch.randomizedtesting.rules.NoShadowingOrOverridesOnMethodsRule$1.evaluate(NoShadowingOrOverridesOnMethodsRule.java:39)
[junit4:junit4]    > 	at com.carrotsearch.randomizedtesting.rules.NoShadowingOrOverridesOnMethodsRule$1.evaluate(NoShadowingOrOverridesOnMethodsRule.java:39)
[junit4:junit4]    > 	at com.carrotsearch.randomizedtesting.rules.StatementAdapter.evaluate(StatementAdapter.java:36)
[junit4:junit4]    > 	at org.apache.lucene.util.TestRuleAssertionsRequired$1.evaluate(TestRuleAssertionsRequired.java:43)
[junit4:junit4]    > 	at org.apache.lucene.util.TestRuleMarkFailure$1.evaluate(TestRuleMarkFailure.java:48)
[junit4:junit4]    > 	at org.apache.lucene.util.TestRuleIgnoreAfterMaxFailures$1.evaluate(TestRuleIgnoreAfterMaxFailures.java:70)
[junit4:junit4]    > 	at org.apache.lucene.util.TestRuleIgnoreTestSuites$1.evaluate(TestRuleIgnoreTestSuites.java:55)
[junit4:junit4]    > 	at com.carrotsearch.randomizedtesting.rules.StatementAdapter.evaluate(StatementAdapter.java:36)
[junit4:junit4]    > 	at com.carrotsearch.randomizedtesting.ThreadLeakControl$StatementRunner.run(ThreadLeakControl.java:358)
[junit4:junit4]    > 	at java.lang.Thread.run(Thread.java:722)
[junit4:junit4]    > Caused by: java.lang.RuntimeException: REQUEST FAILED: xpath=*[count(//doc)=0]
[junit4:junit4]    > 	xml response was: <?xml version="1.0" encoding="UTF-8"?>
[junit4:junit4]    > <response>
[junit4:junit4]    > <lst name="responseHeader"><int name="status">0</int><int name="QTime">47</int></lst><result name="response" numFound="3" start="0"><doc><str name="id">5</str></doc><doc><str name="id">6</str></doc><doc><str name="id">7</str></doc></result>
[junit4:junit4]    > </response>
[junit4:junit4]    > 
[junit4:junit4]    > 	request was:fl=id&q=*:*&fq={!field+f%3Dstqpt_geohash+score%3DrecipDistance}Intersects(Circle(0,0+d%3D0.8993203677616635))&rows=1000
[junit4:junit4]    > 	at org.apache.solr.SolrTestCaseJ4.assertQ(SolrTestCaseJ4.java:496)
[junit4:junit4]    > 	... 44 more
[junit4:junit4]   2> 876 T2709 oas.SolrTestCaseJ4.setUp ###Starting testIntersectFilter {p0=stqpt_geohash}
[junit4:junit4]   2> 878 T2709 C211 oasu.DirectUpdateHandler2.deleteAll [collection1] REMOVING ALL DOCUMENTS FROM INDEX
[junit4:junit4]   2> 879 T2709 C211 UPDATE [collection1] webapp=null path=null params={} {deleteByQuery=*:*} 0 1
[junit4:junit4]   2> 887 T2709 C211 UPDATE [collection1] webapp=null path=null params={} {add=[1]} 0 6
[junit4:junit4]   2> 891 T2709 C211 UPDATE [collection1] webapp=null path=null params={} {add=[2]} 0 1
[junit4:junit4]   2> 894 T2709 C211 UPDATE [collection1] webapp=null path=null params={} {add=[3]} 0 1
[junit4:junit4]   2> 897 T2709 C211 UPDATE [collection1] webapp=null path=null params={} {add=[4]} 0 1
[junit4:junit4]   2> 900 T2709 C211 UPDATE [collection1] webapp=null path=null params={} {add=[5]} 0 1
[junit4:junit4]   2> 903 T2709 C211 UPDATE [collection1] webapp=null path=null params={} {add=[6]} 0 1
[junit4:junit4]   2> 906 T2709 C211 UPDATE [collection1] webapp=null path=null params={} {add=[7]} 0 0
[junit4:junit4]   2> 908 T2709 C211 UPDATE [collection1] webapp=null path=null params={} {add=[8]} 0 0
[junit4:junit4]   2> 911 T2709 C211 UPDATE [collection1] webapp=null path=null params={} {add=[9]} 0 0
[junit4:junit4]   2> 914 T2709 C211 UPDATE [collection1] webapp=null path=null params={} {add=[10]} 0 0
[junit4:junit4]   2> 917 T2709 C211 UPDATE [collection1] webapp=null path=null params={} {add=[11]} 0 0
[junit4:junit4]   2> 920 T2709 C211 UPDATE [collection1] webapp=null path=null params={} {add=[12]} 0 0
[junit4:junit4]   2> 923 T2709 C211 UPDATE [collection1] webapp=null path=null params={} {add=[13]} 0 1
[junit4:junit4]   2> 925 T2709 C211 oasu.DirectUpdateHandler2.commit start commit{flags=0,_version_=0,optimize=false,openSearcher=true,waitSearcher=true,expungeDeletes=false,softCommit=false}
[junit4:junit4]   2> 927 T2709 C211 oasc.SolrDeletionPolicy.onCommit SolrDeletionPolicy.onCommit: commits:num=2
[junit4:junit4]   2> 		commit{dir=MockDirWrapper(NRTCachingDirectory(org.apache.lucene.store.RAMDirectory@1d7c4157 lockFactory=org.apache.lucene.store.NativeFSLockFactory@1f7bce63; maxCacheMB=0.82421875 maxMergeSizeMB=0.04296875)),segFN=segments_e,generation=14,filenames=[_c.fdt, segments_e, _c.si, _c_Direct_0.frq, _c_Direct_0.tim, _c_nrm.cfe, _c_nrm.cfs, _c_Direct_0.tip, _c.fnm, _c.fdx, _c_Memory_0.ram]
[junit4:junit4]   2> 		commit{dir=MockDirWrapper(NRTCachingDirectory(org.apache.lucene.store.RAMDirectory@1d7c4157 lockFactory=org.apache.lucene.store.NativeFSLockFactory@1f7bce63; maxCacheMB=0.82421875 maxMergeSizeMB=0.04296875)),segFN=segments_f,generation=15,filenames=[_d_Direct_0.tim, segments_f, _d.fdt, _d_Memory_0.ram, _d_Direct_0.tip, _d.si, _d.fnm, _d_nrm.cfe, _d_Direct_0.frq, _d_nrm.cfs, _d.fdx]
[junit4:junit4]   2> 927 T2709 C211 oasc.SolrDeletionPolicy.updateCommits newest commit = 15
[junit4:junit4]   2> 929 T2709 C211 oass.SolrIndexSearcher.<init> Opening Searcher@48a289fa main
[junit4:junit4]   2> 929 T2709 C211 oass.SolrIndexSearcher.getIndexDir WARNING WARNING: Directory impl does not support setting indexDir: org.apache.lucene.store.MockDirectoryWrapper
[junit4:junit4]   2> 930 T2710 oasc.SolrCore.registerSearcher [collection1] Registered new searcher Searcher@48a289fa main{StandardDirectoryReader(segments_f:46 _d(4.0.0.2):C13)}
[junit4:junit4]   2> 929 T2709 C211 oasu.DirectUpdateHandler2.commit end_commit_flush
[junit4:junit4]   2> 930 T2709 C211 UPDATE [collection1] webapp=null path=null params={} {commit=} 0 5
[junit4:junit4]   2> 937 T2709 C211 REQ [collection1] webapp=null path=null params={fl=id&q=*:*&fq={!field+f%3Dstqpt_geohash}Intersects(Circle(1,1+d%3D1.5738106435829113))&rows=1000} hits=3 status=0 QTime=6 
[junit4:junit4]   2> 947 T2709 C211 REQ [collection1] webapp=null path=null params={fl=id&q=*:*&fq={!field+f%3Dstqpt_geohash+score%3Ddistance}Intersects(Circle(0,179.8+d%3D1.798640735523327))&rows=1000} hits=2 status=0 QTime=7 
[junit4:junit4]   2> 1597 T2709 C211 REQ [collection1] webapp=null path=null params={fl=id&q=*:*&fq={!field+f%3Dstqpt_geohash+score%3Dnone}Intersects(Circle(89.8,50+d%3D1.798640735523327))&rows=1000} hits=2 status=0 QTime=647 
[junit4:junit4]   2> 2140 T3 oasc.CoreContainer.finalize SEVERE CoreContainer was not shutdown prior to finalize(), indicates a bug -- POSSIBLE RESOURCE LEAK!!!  instance=1598312728
[junit4:junit4]   2> 2383 T2709 C211 REQ [collection1] webapp=null path=null params={fl=id&q=*:*&fq={!field+f%3Dstqpt_geohash}Intersects(Circle(-89.8,50+d%3D1.798640735523327))&rows=1000} hits=2 status=0 QTime=783 
[junit4:junit4]   2> 2392 T2709 C211 REQ [collection1] webapp=null path=null params={fl=id&q=*:*&fq={!field+f%3Dstqpt_geohash+score%3Dnone}Intersects(Circle(33.0,-80.0+d%3D2.6979611032849906))&rows=1000} hits=2 status=0 QTime=6 
[junit4:junit4]   2> 2396 T2709 C211 REQ [collection1] webapp=null path=null params={fl=id&q=*:*&fq={!field+f%3Dstqpt_geohash+score%3Ddistance}Intersects(Circle(1,1+d%3D44.96601838808318))&rows=1000} hits=3 status=0 QTime=3 
[junit4:junit4]   2> 2403 T2709 C211 REQ [collection1] webapp=null path=null params={fl=id&q=*:*&fq={!field+f%3Dstqpt_geohash}Intersects(-0.034898+-0.034898+0.234898+0.234898)&rows=1000} hits=2 status=0 QTime=4 
[junit4:junit4]   2> 2464 T2709 C211 oasu.DirectUpdateHandler2.deleteAll [collection1] REMOVING ALL DOCUMENTS FROM INDEX
[junit4:junit4]   2> 2464 T2709 C211 UPDATE [collection1] webapp=null path=null params={} {deleteByQuery=*:*} 0 1
[junit4:junit4]   2> 2469 T2709 C211 UPDATE [collection1] webapp=null path=null params={} {add=[14]} 0 0
[junit4:junit4]   2> 2474 T2709 C211 UPDATE [collection1] webapp=null path=null params={} {add=[15]} 0 0
[junit4:junit4]   2> 2480 T2709 C211 UPDATE [collection1] webapp=null path=null params={} {add=[16]} 0 1
[junit4:junit4]   2> 2483 T2709 C211 UPDATE [collection1] webapp=null path=null params={} {add=[17]} 0 0
[junit4:junit4]   2> 2485 T2709 C211 oasu.DirectUpdateHandler2.commit start commit{flags=0,_version_=0,optimize=false,openSearcher=true,waitSearcher=true,expungeDeletes=false,softCommit=false}
[junit4:junit4]   2> 2486 T2709 C211 oasc.SolrDeletionPolicy.onCommit SolrDeletionPolicy.onCommit: commits:num=2
[junit4:junit4]   2> 		commit{dir=MockDirWrapper(NRTCachingDirectory(org.apache.lucene.store.RAMDirectory@1d7c4157 lockFactory=org.apache.lucene.store.NativeFSLockFactory@1f7bce63; maxCacheMB=0.82421875 maxMergeSizeMB=0.04296875)),segFN=segments_f,generation=15,filenames=[_d_Direct_0.tim, segments_f, _d.fdt, _d_Memory_0.ram, _d_Direct_0.tip, _d.si, _d.fnm, _d_nrm.cfe, _d_Direct_0.frq, _d_nrm.cfs, _d.fdx]
[junit4:junit4]   2> 		commit{dir=MockDirWrapper(NRTCachingDirectory(org.apache.lucene.store.RAMDirectory@1d7c4157 lockFactory=org.apache.lucene.store.NativeFSLockFactory@1f7bce63; maxCacheMB=0.82421875 maxMergeSizeMB=0.04296875)),segFN=segments_g,generation=16,filenames=[_e.si, _e.fdt, _e_Direct_0.tip, _e_Memory_0.ram, _e_nrm.cfs, _e_Direct_0.frq, _e_Direct_0.tim, _e.fdx, _e.fnm, segments_g, _e_nrm.cfe]
[junit4:junit4]   2> 2487 T2709 C211 oasc.SolrDeletionPolicy.updateCommits newest commit = 16
[junit4:junit4]   2> 2488 T2709 C211 oass.SolrIndexSearcher.<init> Opening Searcher@21bea6dd main
[junit4:junit4]   2> 2488 T2709 C211 oass.SolrIndexSearcher.getIndexDir WARNING WARNING: Directory impl does not support setting indexDir: org.apache.lucene.store.MockDirectoryWrapper
[junit4:junit4]   2> 2488 T2709 C211 oasu.DirectUpdateHandler2.commit end_commit_flush
[junit4:junit4]   2> 2488 T2710 oasc.SolrCore.registerSearcher [collection1] Registered new searcher Searcher@21bea6dd main{StandardDirectoryReader(segments_g:49 _e(4.0.0.2):C4)}
[junit4:junit4]   2> 2489 T2709 C211 UPDATE [collection1] webapp=null path=null params={} {commit=} 0 4
[junit4:junit4]   2> 2508 T2709 C211 REQ [collection1] webapp=null path=null params={fl=id&q=*:*&fq={!field+f%3Dstqpt_geohash+score%3DrecipDistance}Intersects(Circle(0,0+d%3D8.993203677616636))&rows=1000} hits=1 status=0 QTime=18 
[junit4:junit4]   2> 2514 T2709 C211 REQ [collection1] webapp=null path=null params={fl=id&q=*:*&fq={!field+f%3Dstqpt_geohash+score%3DrecipDistance}Intersects(Circle(0,0+d%3D17.986407355233272))&rows=1000} hits=2 status=0 QTime=4 
[junit4:junit4]   2> 2519 T2709 C211 REQ [collection1] webapp=null path=null params={fl=id&q=*:*&fq={!field+f%3Dstqpt_geohash+score%3Ddistance}Intersects(-26.979611+-26.979611+26.979611+26.979611)&rows=1000} hits=3 status=0 QTime=3 
[junit4:junit4]   2> 2527 T2709 C211 REQ [collection1] webapp=null path=null params={fl=id&q=*:*&fq={!field+f%3Dstqpt_geohash+score%3Dnone}Intersects(Circle(0,0+d%3D26.98860423652752))&rows=1000} hits=3 status=0 QTime=6 
[junit4:junit4]   2> 2535 T2709 C211 REQ [collection1] webapp=null path=null params={fl=id&q=*:*&fq={!field+f%3Dstqpt_geohash+score%3Dnone}Intersects(Circle(0,0+d%3D26.980510353217664))&rows=1000} hits=3 status=0 QTime=5 
[junit4:junit4]   2> 2545 T2709 C211 REQ [collection1] webapp=null path=null params={fl=id&q=*:*&fq={!field+f%3Dstqpt_geohash+score%3Dnone}Intersects(Circle(43.517030,-96.789603+d%3D0.9802592008602133))&rows=1000} hits=0 status=0 QTime=7 
[junit4:junit4]   2> 2553 T2709 C211 REQ [collection1] webapp=null path=null params={fl=id&q=*:*&fq={!field+f%3Dstqpt_geohash+score%3DrecipDistance}Intersects(Circle(43.517030,-96.789603+d%3D0.9892524045378299))&rows=1000} hits=0 status=0 QTime=7 
[junit4:junit4]   2> 2559 T2709 C211 REQ [collection1] webapp=null path=null params={fl=id&q=*:*&fq={!field+f%3Dstqpt_geohash+score%3DrecipDistance}Intersects(-98.153831+42.527778+-95.425375+44.506282)&rows=1000} hits=1 status=0 QTime=5 
[junit4:junit4]   2> 2561 T2709 oas.SolrTestCaseJ4.tearDown ###Ending testIntersectFilter {p0=stqpt_geohash}
[junit4:junit4]   2> 2565 T2709 oas.SolrTestCaseJ4.setUp ###Starting checkResultFormat {p0=stqpt_geohash}
[junit4:junit4]   2> 2584 T2709 C211 oasu.DirectUpdateHandler2.deleteAll [collection1] REMOVING ALL DOCUMENTS FROM INDEX
[junit4:junit4]   2> 2585 T2709 C211 UPDATE [collection1] webapp=null path=null params={} {deleteByQuery=*:*} 0 2
[junit4:junit4]   2> 2590 T2709 C211 UPDATE [collection1] webapp=null path=null params={} {add=[11]} 0 1
[junit4:junit4]   2> 2595 T2709 C211 oasu.DirectUpdateHandler2.commit start commit{flags=0,_version_=0,optimize=false,openSearcher=true,waitSearcher=true,expungeDeletes=false,softCommit=false}
[junit4:junit4]   2> 2597 T2709 C211 oasc.SolrDeletionPolicy.onCommit SolrDeletionPolicy.onCommit: commits:num=2
[junit4:junit4]   2> 		commit{dir=MockDirWrapper(NRTCachingDirectory(org.apache.lucene.store.RAMDirectory@1d7c4157 lockFactory=org.apache.lucene.store.NativeFSLockFactory@1f7bce63; maxCacheMB=0.82421875 maxMergeSizeMB=0.04296875)),segFN=segments_g,generation=16,filenames=[_e.si, _e.fdt, _e_Direct_0.tip, _e_Memory_0.ram, _e_nrm.cfs, _e_Direct_0.frq, _e_Direct_0.tim, _e.fdx, _e.fnm, segments_g, _e_nrm.cfe]
[junit4:junit4]   2> 		commit{dir=MockDirWrapper(NRTCachingDirectory(org.apache.lucene.store.RAMDirectory@1d7c4157 lockFactory=org.apache.lucene.store.NativeFSLockFactory@1f7bce63; maxCacheMB=0.82421875 maxMergeSizeMB=0.04296875)),segFN=segments_h,generation=17,filenames=[_f_nrm.cfe, _f.fdx, _f_Direct_0.frq, _f.fnm, _f_Direct_0.tim, _f_Direct_0.tip, _f_nrm.cfs, _f.si, _f.fdt, _f_Memory_0.ram, segments_h]
[junit4:junit4]   2> 2598 T2709 C211 oasc.SolrDeletionPolicy.updateCommits newest commit = 17
[junit4:junit4]   2> 2600 T2709 C211 oass.SolrIndexSearcher.<init> Opening Searcher@1e823994 main
[junit4:junit4]   2> 2601 T2709 C211 oass.SolrIndexSearcher.getIndexDir WARNING WARNING: Directory impl does not support setting indexDir: org.apache.lucene.store.MockDirectoryWrapper
[junit4:junit4]   2> 2601 T2709 C211 oasu.DirectUpdateHandler2.commit end_commit_flush
[junit4:junit4]   2> 2601 T2710 oasc.SolrCore.registerSearcher [collection1] Registered new searcher Searcher@1e823994 main{StandardDirectoryReader(segments_h:52 _f(4.0.0.2):C1)}
[junit4:junit4]   2> 2602 T2709 C211 UPDATE [collection1] webapp=null path=null params={} {commit=} 0 7
[junit4:junit4]   2> 2654 T2709 C211 REQ [collection1] webapp=null path=null params={fl=id,stqpt_geohash&q=*:*&fq={!field+needScore%3Dfalse+f%3Dstqpt_geohash}Intersects(Circle(89.9,-130+d%3D9))&rows=1000} hits=1 status=0 QTime=51 
[junit4:junit4]   2> 2655 T2709 oas.SolrTestCaseJ4.tearDown ###Ending checkResultFormat {p0=stqpt_geohash}
[junit4:junit4]   2> 2658 T2709 oas.SolrTestCaseJ4.setUp ###Starting testSort {p0=stqpt_geohash}
[junit4:junit4]   2> 2660 T2709 C211 oasu.DirectUpdateHandler2.deleteAll [collection1] REMOVING ALL DOCUMENTS FROM INDEX
[junit4:junit4]   2> 2660 T2709 C211 UPDATE [collection1] webapp=null path=null params={} {deleteByQuery=*:*} 0 0
[junit4:junit4]   2> 2663 T2709 C211 UPDATE [collection1] webapp=null path=null params={} {add=[100]} 0 0
[junit4:junit4]   2> 2666 T2709 C211 UPDATE [collection1] webapp=null path=null params={} {add=[101]} 0 0
[junit4:junit4]   2> 2668 T2709 C211 UPDATE [collection1] webapp=null path=null params={} {add=[999]} 0 0
[junit4:junit4]   2> 2670 T2709 C211 oasu.DirectUpdateHandler2.commit start commit{flags=0,_version_=0,optimize=false,openSearcher=true,waitSearcher=true,expungeDeletes=false,softCommit=false}
[junit4:junit4]   2> 2672 T2709 C211 oasc.SolrDeletionPolicy.onCommit SolrDeletionPolicy.onCommit: commits:num=2
[junit4:junit4]   2> 		commit{dir=MockDirWrapper(NRTCachingDirectory(org.apache.lucene.store.RAMDirectory@1d7c4157 lockFactory=org.apache.lucene.store.NativeFSLockFactory@1f7bce63; maxCacheMB=0.82421875 maxMergeSizeMB=0.04296875)),segFN=segments_h,generation=17,filenames=[_f_nrm.cfe, _f.fdx, _f_Direct_0.frq, _f.fnm, _f_Direct_0.tim, _f_Direct_0.tip, _f_nrm.cfs, _f.si, _f.fdt, _f_Memory_0.ram, segments_h]
[junit4:junit4]   2> 		commit{dir=MockDirWrapper(NRTCachingDirectory(org.apache.lucene.store.RAMDirectory@1d7c4157 lockFactory=org.apache.lucene.store.NativeFSLockFactory@1f7bce63; maxCacheMB=0.82421875 maxMergeSizeMB=0.04296875)),segFN=segments_i,generation=18,filenames=[_g.fdt, _g_Direct_0.tim, _g.si, _g_Direct_0.frq, _g.fnm, _g.fdx, _g_Memory_0.ram, _g_nrm.cfs, _g_Direct_0.tip, _g_nrm.cfe, segments_i]
[junit4:junit4]   2> 2672 T2709 C211 oasc.SolrDeletionPolicy.updateCommits newest commit = 18
[junit4:junit4]   2> 2673 T2709 C211 oass.SolrIndexSearcher.<init> Opening Searcher@7854f0 main
[junit4:junit4]   2> 2673 T2709 C211 oass.SolrIndexSearcher.getIndexDir WARNING WARNING: Directory impl does not support setting indexDir: org.apache.lucene.store.MockDirectoryWrapper
[junit4:junit4]   2> 2674 T2710 oasc.SolrCore.registerSearcher [collection1] Registered new searcher Searcher@7854f0 main{StandardDirectoryReader(segments_i:55 _g(4.0.0.2):C3)}
[junit4:junit4]   2> 2674 T2709 C211 oasu.DirectUpdateHandler2.commit end_commit_flush
[junit4:junit4]   2> 2674 T2709 C211 UPDATE [collection1] webapp=null path=null params={} {commit=} 0 4
[junit4:junit4]   2> 2685 T2709 C211 REQ [collection1] webapp=null path=null params={fl=id,score&q=stqpt_geohash:"Intersects(Circle(3,4+d%3D9))"} hits=2 status=0 QTime=10 
[junit4:junit4]   2> 2696 T2709 C211 REQ [collection1] webapp=null path=null params={sort=score+asc&fl=id,score&q={!+score%3Ddistance}stqpt_geohash:"Intersects(Circle(3,4+d%3D9))"} hits=2 status=0 QTime=10 
[junit4:junit4]   2> 2707 T2709 C211 REQ [collection1] webapp=null path=null params={sort=score+desc&fl=id,score&q={!+score%3DrecipDistance}stqpt_geohash:"Intersects(Circle(3,4+d%3D9))"} hits=2 status=0 QTime=10 
[junit4:junit4]   2> 2726 T2709 C211 REQ [collection1] webapp=null path=null params={sort=score+asc&fl=id,score&q={!+score%3Ddistance}stqpt_geohash:"Intersects(Circle(4,0+d%3D9))"} hits=2 status=0 QTime=19 
[junit4:junit4]   2> 2742 T2709 C211 REQ [collection1] webapp=null path=null params={sortQuery={!+score%3Ddistance}stqpt_geohash:"Intersects(Circle(3,4+d%3D9))"&sort=query($sortQuery)+asc&fl=id,score&q=-id:999} hits=2 status=0 QTime=15 
[junit4:junit4]   2> 2753 T2709 C211 REQ [collection1] webapp=null path=null params={sortQuery={!+score%3Ddistance}stqpt_geohash:"Intersects(Circle(4,0+d%3D9))"&sort=query($sortQuery)+asc&fl=id,score&q=-id:999} hits=2 status=0 QTime=11 
[junit4:junit4]   2> 2754 T2709 oas.SolrTestCaseJ4.tearDown ###Ending testSort {p0=stqpt_geohash}
[junit4:junit4]   2> 2760 T2709 oas.SolrTestCaseJ4.setUp ###Starting testSortMultiVal {p0=stqpt_geohash}
[junit4:junit4]   2> 2762 T2709 C211 oasu.DirectUpdateHandler2.deleteAll [collection1] REMOVING ALL DOCUMENTS FROM INDEX
[junit4:junit4]   2> 2762 T2709 C211 UPDATE [collection1] webapp=null path=null params={} {deleteByQuery=*:*} 0 0
[junit4:junit4]   2> 2765 T2709 C211 UPDATE [collection1] webapp=null path=null params={} {add=[100]} 0 0
[junit4:junit4]   2> 2767 T2709 C211 UPDATE [collection1] webapp=null path=null params={} {add=[101]} 0 0
[junit4:junit4]   2> 2770 T2709 C211 oasu.DirectUpdateHandler2.commit start commit{flags=0,_version_=0,optimize=false,openSearcher=true,waitSearcher=true,expungeDeletes=false,softCommit=false}
[junit4:junit4]   2> 2771 T2709 C211 oasc.SolrDeletionPolicy.onCommit SolrDeletionPolicy.onCommit: commits:num=2
[junit4:junit4]   2> 		commit{dir=MockDirWrapper(NRTCachingDirectory(org.apache.lucene.store.RAMDirectory@1d7c4157 lockFactory=org.apache.lucene.store.NativeFSLockFactory@1f7bce63; maxCacheMB=0.82421875 maxMergeSizeMB=0.04296875)),segFN=segments_i,generation=18,filenames=[_g.fdt, _g_Direct_0.tim, _g.si, _g_Direct_0.frq, _g.fnm, _g.fdx, _g_Memory_0.ram, _g_nrm.cfs, _g_Direct_0.tip, _g_nrm.cfe, segments_i]
[junit4:junit4]   2> 		commit{dir=MockDirWrapper(NRTCachingDirectory(org.apache.lucene.store.RAMDirectory@1d7c4157 lockFactory=org.apache.lucene.store.NativeFSLockFactory@1f7bce63; maxCacheMB=0.82421875 maxMergeSizeMB=0.04296875)),segFN=segments_j,generation=19,filenames=[_h_Direct_0.frq, _h.fnm, _h.fdt, _h.si, _h.fdx, _h_Memory_0.ram, _h_nrm.cfe, _h_Direct_0.tip, _h_nrm.cfs, _h_Direct_0.tim, segments_j]
[junit4:junit4]   2> 2771 T2709 C211 oasc.SolrDeletionPolicy.updateCommits newest commit = 19
[junit4:junit4]   2> 2772 T2709 C211 oass.SolrIndexSearcher.<init> Opening Searcher@2a2ba294 main
[junit4:junit4]   2> 2773 T2709 C211 oass.SolrIndexSearcher.getIndexDir WARNING WARNING: Directory impl does not support setting indexDir: org.apache.lucene.store.MockDirectoryWrapper
[junit4:junit4]   2> 2773 T2710 oasc.SolrCore.registerSearcher [collection1] Registered new searcher Searcher@2a2ba294 main{StandardDirectoryReader(segments_j:58 _h(4.0.0.2):C2)}
[junit4:junit4]   2> 2773 T2709 C211 oasu.DirectUpdateHandler2.commit end_commit_flush
[junit4:junit4]   2> 2774 T2709 C211 UPDATE [collection1] webapp=null path=null params={} {commit=} 0 4
[junit4:junit4]   2> 2785 T2709 C211 REQ [collection1] webapp=null path=null params={sort=score+asc&fl=id,score&q={!+score%3Ddistance}stqpt_geohash:"Intersects(Circle(3,4+d%3D9))"} hits=2 status=0 QTime=10 
[junit4:junit4]   2> 2785 T2709 oas.SolrTestCaseJ4.tearDown ###Ending testSortMultiVal {p0=stqpt_geohash}
[junit4:junit4]   2> 2789 T2709 oas.SolrTestCaseJ4.setUp ###Starting testRangeSyntax {p0=twodoubles}
[junit4:junit4]   2> 2791 T2709 C211 oasu.DirectUpdateHandler2.deleteAll [collection1] REMOVING ALL DOCUMENTS FROM INDEX
[junit4:junit4]   2> 2791 T2709 C211 UPDATE [collection1] webapp=null path=null params={} {deleteByQuery=*:*} 0 1
[junit4:junit4]   2> 2797 T2709 C211 UPDATE [collection1] webapp=null path=null params={} {add=[1]} 0 4
[junit4:junit4]   2> 2799 T2709 C211 UPDATE [collection1] webapp=null path=null params={} {add=[2]} 0 0
[junit4:junit4]   2> 2801 T2709 C211 UPDATE [collection1] webapp=null path=null params={} {add=[3]} 0 0
[junit4:junit4]   2> 2804 T2709 C211 UPDATE [collection1] webapp=null path=null params={} {add=[4]} 0 0
[junit4:junit4]   2> 2807 T2709 C211 UPDATE [collection1] webapp=null path=null params={} {add=[5]} 0 1
[junit4:junit4]   2> 2809 T2709 C211 UPDATE [collection1] webapp=null path=null params={} {add=[6]} 0 0
[junit4:junit4]   2> 2811 T2709 C211 UPDATE [collection1] webapp=null path=null params={} {add=[7]} 0 0
[junit4:junit4]   2> 2814 T2709 C211 UPDATE [collection1] webapp=null path=null params={} {add=[8]} 0 1
[junit4:junit4]   2> 2822 T2709 C211 UPDATE [collection1] webapp=null path=null params={} {add=[9]} 0 0
[junit4:junit4]   2> 2825 T2709 C211 UPDATE [collection1] webapp=null path=null params={} {add=[10]} 0 0
[junit4:junit4]   2> 2828 T2709 C211 UPDATE [collection1] webapp=null path=null params={} {add=[11]} 0 1
[junit4:junit4]   2> 2830 T2709 C211 UPDATE [collection1] webapp=null path=null params={} {add=[12]} 0 0
[junit4:junit4]   2> 2833 T2709 C211 UPDATE [collection1] webapp=null path=null params={} {add=[13]} 0 0
[junit4:junit4]   2> 2836 T2709 C211 oasu.DirectUpdateHandler2.commit start commit{flags=0,_version_=0,optimize=false,openSearcher=true,waitSearcher=true,expungeDeletes=false,softCommit=false}
[junit4:junit4]   2> 2838 T2709 C211 oasc.SolrDeletionPolicy.onCommit SolrDeletionPolicy.onCommit: commits:num=2
[junit4:junit4]   2> 		commit{dir=MockDirWrapper(NRTCachingDirectory(org.apache.lucene.store.RAMDirectory@1d7c4157 lockFactory=org.apache.lucene.store.NativeFSLockFactory@1f7bce63; maxCacheMB=0.82421875 maxMergeSizeMB=0.04296875)),segFN=segments_j,generation=19,filenames=[_h_Direct_0.frq, _h.fnm, _h.fdt, _h.si, _h.fdx, _h_Memory_0.ram, _h_nrm.cfe, _h_Direct_0.tip, _h_nrm.cfs, _h_Direct_0.tim, segments_j]
[junit4:junit4]   2> 		commit{dir=MockDirWrapper(NRTCachingDirectory(org.apache.lucene.store.RAMDirectory@1d7c4157 lockFactory=org.apache.lucene.store.NativeFSLockFactory@1f7bce63; maxCacheMB=0.82421875 maxMergeSizeMB=0.04296875)),segFN=segments_k,generation=20,filenames=[_i_nrm.cfs, _i_TestBloomFilteredLucene40Postings_0.tip, _i_TestBloomFilteredLucene40Postings_0.frq, _i.fdx, _i_TestBloomFilteredLucene40Postings_0.tim, _i_TestBloomFilteredLucene40Postings_0.blm, segments_k, _i_Memory_0.ram, _i.fnm, _i.si, _i.fdt, _i_nrm.cfe]
[junit4:junit4]   2> 2838 T2709 C211 oasc.SolrDeletionPolicy.updateCommits newest commit = 20
[junit4:junit4]   2> 2839 T2709 C211 oass.SolrIndexSearcher.<init> Opening Searcher@45fce498 main
[junit4:junit4]   2> 2840 T2709 C211 oass.SolrIndexSearcher.getIndexDir WARNING WARNING: Directory impl does not support setting indexDir: org.apache.lucene.store.MockDirectoryWrapper
[junit4:junit4]   2> 2840 T2709 C211 oasu.DirectUpdateHandler2.commit end_commit_flush
[junit4:junit4]   2> 2840 T2710 oasc.SolrCore.registerSearcher [collection1] Registered new searcher Searcher@45fce498 main{StandardDirectoryReader(segments_k:61 _i(4.0.0.2):C13)}
[junit4:junit4]   2> 2841 T2709 C211 UPDATE [collection1] webapp=null path=null params={} {commit=} 0 6
[junit4:junit4]   2> 2843 T2709 C211 REQ [collection1] webapp=null path=null params={fl=id&q=*:*&fq={!+needScore%3Dfalse+df%3Dtwodoubles}[32,-80+TO+33,-79]&rows=1000} hits=1 status=0 QTime=1 
[junit4:junit4]   2> 2845 T2709 oas.SolrTestCaseJ4.tearDown ###Ending testRangeSyntax {p0=twodoubles}
[junit4:junit4]   2> 2848 T2709 oas.SolrTestCaseJ4.setUp ###Starting checkQueryEmptyIndex {p0=twodoubles}
[junit4:junit4]   2> 2850 T2709 C211 oasu.DirectUpdateHandler2.deleteAll [collection1] REMOVING ALL DOCUMENTS FROM INDEX
[junit4:junit4]   2> 2850 T2709 C211 UPDATE [collection1] webapp=null path=null params={} {deleteByQuery=*:*} 0 0
[junit4:junit4]   2> 2856 T2709 C211 REQ [collection1] webapp=null path=null params={fl=id&q=*:*&fq={!field+f%3Dtwodoubles+score%3DrecipDistance}Intersects(Circle(0,0+d%3D0.8993203677616635))&rows=1000} hits=3 status=0 QTime=5 
[junit4:junit4]   2> 2857 T2709 oas.SolrTestCaseJ4.assertQ SEVERE REQUEST FAILED: xpath=*[count(//doc)=0]
[junit4:junit4]   2> 		xml response was: <?xml version="1.0" encoding="UTF-8"?>
[junit4:junit4]   2> 	<response>
[junit4:junit4]   2> 	<lst name="responseHeader"><int name="status">0</int><int name="QTime">5</int></lst><result name="response" numFound="3" start="0"><doc><str name="id">5</str></doc><doc><str name="id">6</str></doc><doc><str name="id">7</str></doc></result>
[junit4:junit4]   2> 	</response>
[junit4:junit4]   2> 	
[junit4:junit4]   2> 		request was:fl=id&q=*:*&fq={!field+f%3Dtwodoubles+score%3DrecipDistance}Intersects(Circle(0,0+d%3D0.8993203677616635))&rows=1000
[junit4:junit4]   2> 2857 T2709 oasc.SolrException.log SEVERE REQUEST FAILED: fl=id&q=*:*&fq={!field+f%3Dtwodoubles+score%3DrecipDistance}Intersects(Circle(0,0+d%3D0.8993203677616635))&rows=1000:java.lang.RuntimeException: REQUEST FAILED: xpath=*[count(//doc)=0]
[junit4:junit4]   2> 		xml response was: <?xml version="1.0" encoding="UTF-8"?>
[junit4:junit4]   2> 	<response>
[junit4:junit4]   2> 	<lst name="responseHeader"><int name="status">0</int><int name="QTime">5</int></lst><result name="response" numFound="3" start="0"><doc><str name="id">5</str></doc><doc><str name="id">6</str></doc><doc><str name="id">7</str></doc></result>
[junit4:junit4]   2> 	</response>
[junit4:junit4]   2> 	
[junit4:junit4]   2> 		request was:fl=id&q=*:*&fq={!field+f%3Dtwodoubles+score%3DrecipDistance}Intersects(Circle(0,0+d%3D0.8993203677616635))&rows=1000
[junit4:junit4]   2> 		at org.apache.solr.SolrTestCaseJ4.assertQ(SolrTestCaseJ4.java:496)
[junit4:junit4]   2> 		at org.apache.solr.SolrTestCaseJ4.assertQ(SolrTestCaseJ4.java:470)
[junit4:junit4]   2> 		at org.apache.solr.search.TestSolr4Spatial.checkHits(TestSolr4Spatial.java:170)
[junit4:junit4]   2> 		at org.apache.solr.search.TestSolr4Spatial.checkHits(TestSolr4Spatial.java:139)
[junit4:junit4]   2> 		at org.apache.solr.search.TestSolr4Spatial.checkQueryEmptyIndex(TestSolr4Spatial.java:135)
[junit4:junit4]   2> 		at sun.reflect.NativeMethodAccessorImpl.invoke0(Native Method)
[junit4:junit4]   2> 		at sun.reflect.NativeMethodAccessorImpl.invoke(NativeMethodAccessorImpl.java:57)
[junit4:junit4]   2> 		at sun.reflect.DelegatingMethodAccessorImpl.invoke(DelegatingMethodAccessorImpl.java:43)
[junit4:junit4]   2> 		at java.lang.reflect.Method.invoke(Method.java:601)
[junit4:junit4]   2> 		at com.carrotsearch.randomizedtesting.RandomizedRunner.invoke(RandomizedRunner.java:1559)
[junit4:junit4]   2> 		at com.carrotsearch.randomizedtesting.RandomizedRunner.access$600(RandomizedRunner.java:79)
[junit4:junit4]   2> 		at com.carrotsearch.randomizedtesting.RandomizedRunner$6.evaluate(RandomizedRunner.java:737)
[junit4:junit4]   2> 		at com.carrotsearch.randomizedtesting.RandomizedRunner$7.evaluate(RandomizedRunner.java:773)
[junit4:junit4]   2> 		at com.carrotsearch.randomizedtesting.RandomizedRunner$8.evaluate(RandomizedRunner.java:787)
[junit4:junit4]   2> 		at com.carrotsearch.randomizedtesting.rules.SystemPropertiesRestoreRule$1.evaluate(SystemPropertiesRestoreRule.java:53)
[junit4:junit4]   2> 		at org.apache.lucene.util.TestRuleSetupTeardownChained$1.evaluate(TestRuleSetupTeardownChained.java:50)
[junit4:junit4]   2> 		at org.apache.lucene.util.TestRuleFieldCacheSanity$1.evaluate(TestRuleFieldCacheSanity.java:51)
[junit4:junit4]   2> 		at org.apache.lucene.util.AbstractBeforeAfterRule$1.evaluate(AbstractBeforeAfterRule.java:45)
[junit4:junit4]   2> 		at com.carrotsearch.randomizedtesting.rules.SystemPropertiesInvariantRule$1.evaluate(SystemPropertiesInvariantRule.java:55)
[junit4:junit4]   2> 		at org.apache.lucene.util.TestRuleThreadAndTestName$1.evaluate(TestRuleThreadAndTestName.java:48)
[junit4:junit4]   2> 		at org.apache.lucene.util.TestRuleIgnoreAfterMaxFailures$1.evaluate(TestRuleIgnoreAfterMaxFailures.java:70)
[junit4:junit4]   2> 		at org.apache.lucene.util.TestRuleMarkFailure$1.evaluate(TestRuleMarkFailure.java:48)
[junit4:junit4]   2> 		at com.carrotsearch.randomizedtesting.rules.StatementAdapter.evaluate(StatementAdapter.java:36)
[junit4:junit4]   2> 		at com.carrotsearch.randomizedtesting.ThreadLeakControl$StatementRunner.run(ThreadLeakControl.java:358)
[junit4:junit4]   2> 		at com.carrotsearch.randomizedtesting.ThreadLeakControl.forkTimeoutingTask(ThreadLeakControl.java:782)
[junit4:junit4]   2> 		at com.carrotsearch.randomizedtesting.ThreadLeakControl$3.evaluate(ThreadLeakControl.java:442)
[junit4:junit4]   2> 		at com.carrotsearch.randomizedtesting.RandomizedRunner.runSingleTest(RandomizedRunner.java:746)
[junit4:junit4]   2> 		at com.carrotsearch.randomizedtesting.RandomizedRunner$3.evaluate(RandomizedRunner.java:648)
[junit4:junit4]   2> 		at com.carrotsearch.randomizedtesting.RandomizedRunner$4.evaluate(RandomizedRunner.java:682)
[junit4:junit4]   2> 		at com.carrotsearch.randomizedtesting.RandomizedRunner$5.evaluate(RandomizedRunner.java:693)
[junit4:junit4]   2> 		at com.carrotsearch.randomizedtesting.rules.StatementAdapter.evaluate(StatementAdapter.java:36)
[junit4:junit4]   2> 		at com.carrotsearch.randomizedtesting.rules.SystemPropertiesRestoreRule$1.evaluate(SystemPropertiesRestoreRule.java:53)
[junit4:junit4]   2> 		at org.apache.lucene.util.AbstractBeforeAfterRule$1.evaluate(AbstractBeforeAfterRule.java:45)
[junit4:junit4]   2> 		at org.apache.lucene.util.TestRuleStoreClassName$1.evaluate(TestRuleStoreClassName.java:42)
[junit4:junit4]   2> 		at com.carrotsearch.randomizedtesting.rules.SystemPropertiesInvariantRule$1.evaluate(SystemPropertiesInvariantRule.java:55)
[junit4:junit4]   2> 		at com.carrotsearch.randomizedtesting.rules.NoShadowingOrOverridesOnMethodsRule$1.evaluate(NoShadowingOrOverridesOnMethodsRule.java:39)
[junit4:junit4]   2> 		at com.carrotsearch.randomizedtesting.rules.NoShadowingOrOverridesOnMethodsRule$1.evaluate(NoShadowingOrOverridesOnMethodsRule.java:39)
[junit4:junit4]   2> 		at com.carrotsearch.randomizedtesting.rules.StatementAdapter.evaluate(StatementAdapter.java:36)
[junit4:junit4]   2> 		at org.apache.lucene.util.TestRuleAssertionsRequired$1.evaluate(TestRuleAssertionsRequired.java:43)
[junit4:junit4]   2> 		at org.apache.lucene.util.TestRuleMarkFailure$1.evaluate(TestRuleMarkFailure.java:48)
[junit4:junit4]   2> 		at org.apache.lucene.util.TestRuleIgnoreAfterMaxFailures$1.evaluate(TestRuleIgnoreAfterMaxFailures.java:70)
[junit4:junit4]   2> 		at org.apache.lucene.util.TestRuleIgnoreTestSuites$1.evaluate(TestRuleIgnoreTestSuites.java:55)
[junit4:junit4]   2> 		at com.carrotsearch.randomizedtesting.rules.StatementAdapter.evaluate(StatementAdapter.java:36)
[junit4:junit4]   2> 		at com.carrotsearch.randomizedtesting.ThreadLeakControl$StatementRunner.run(ThreadLeakControl.java:358)
[junit4:junit4]   2> 		at java.lang.Thread.run(Thread.java:722)
[junit4:junit4]   2> 	
[junit4:junit4]   2> 2858 T2709 oas.SolrTestCaseJ4.tearDown ###Ending checkQueryEmptyIndex {p0=twodoubles}
[junit4:junit4]   2> NOTE: reproduce with: ant test  -Dtestcase=TestSolr4Spatial -Dtests.method="checkQueryEmptyIndex {p0=twodoubles}" -Dtests.seed=863139162B144AAB -Dtests.multiplier=3 -Dtests.slow=true -Dtests.locale=en_SG -Dtests.timezone=ART -Dtests.file.encoding=US-ASCII
[junit4:junit4] ERROR   0.02s J1 | TestSolr4Spatial.checkQueryEmptyIndex {p0=twodoubles} <<<
[junit4:junit4]    > Throwable #1: java.lang.RuntimeException: Exception during query
[junit4:junit4]    > 	at __randomizedtesting.SeedInfo.seed([863139162B144AAB:86FBB2FBE076CDEB]:0)
[junit4:junit4]    > 	at org.apache.solr.SolrTestCaseJ4.assertQ(SolrTestCaseJ4.java:503)
[junit4:junit4]    > 	at org.apache.solr.SolrTestCaseJ4.assertQ(SolrTestCaseJ4.java:470)
[junit4:junit4]    > 	at org.apache.solr.search.TestSolr4Spatial.checkHits(TestSolr4Spatial.java:170)
[junit4:junit4]    > 	at org.apache.solr.search.TestSolr4Spatial.checkHits(TestSolr4Spatial.java:139)
[junit4:junit4]    > 	at org.apache.solr.search.TestSolr4Spatial.checkQueryEmptyIndex(TestSolr4Spatial.java:135)
[junit4:junit4]    > 	at sun.reflect.NativeMethodAccessorImpl.invoke0(Native Method)
[junit4:junit4]    > 	at sun.reflect.NativeMethodAccessorImpl.invoke(NativeMethodAccessorImpl.java:57)
[junit4:junit4]    > 	at sun.reflect.DelegatingMethodAccessorImpl.invoke(DelegatingMethodAccessorImpl.java:43)
[junit4:junit4]    > 	at java.lang.reflect.Method.invoke(Method.java:601)
[junit4:junit4]    > 	at com.carrotsearch.randomizedtesting.RandomizedRunner.invoke(RandomizedRunner.java:1559)
[junit4:junit4]    > 	at com.carrotsearch.randomizedtesting.RandomizedRunner.access$600(RandomizedRunner.java:79)
[junit4:junit4]    > 	at com.carrotsearch.randomizedtesting.RandomizedRunner$6.evaluate(RandomizedRunner.java:737)
[junit4:junit4]    > 	at com.carrotsearch.randomizedtesting.RandomizedRunner$7.evaluate(RandomizedRunner.java:773)
[junit4:junit4]    > 	at com.carrotsearch.randomizedtesting.RandomizedRunner$8.evaluate(RandomizedRunner.java:787)
[junit4:junit4]    > 	at com.carrotsearch.randomizedtesting.rules.SystemPropertiesRestoreRule$1.evaluate(SystemPropertiesRestoreRule.java:53)
[junit4:junit4]    > 	at org.apache.lucene.util.TestRuleSetupTeardownChained$1.evaluate(TestRuleSetupTeardownChained.java:50)
[junit4:junit4]    > 	at org.apache.lucene.util.TestRuleFieldCacheSanity$1.evaluate(TestRuleFieldCacheSanity.java:51)
[junit4:junit4]    > 	at org.apache.lucene.util.AbstractBeforeAfterRule$1.evaluate(AbstractBeforeAfterRule.java:45)
[junit4:junit4]    > 	at com.carrotsearch.randomizedtesting.rules.SystemPropertiesInvariantRule$1.evaluate(SystemPropertiesInvariantRule.java:55)
[junit4:junit4]    > 	at org.apache.lucene.util.TestRuleThreadAndTestName$1.evaluate(TestRuleThreadAndTestName.java:48)
[junit4:junit4]    > 	at org.apache.lucene.util.TestRuleIgnoreAfterMaxFailures$1.evaluate(TestRuleIgnoreAfterMaxFailures.java:70)
[junit4:junit4]    > 	at org.apache.lucene.util.TestRuleMarkFailure$1.evaluate(TestRuleMarkFailure.java:48)
[junit4:junit4]    > 	at com.carrotsearch.randomizedtesting.rules.StatementAdapter.evaluate(StatementAdapter.java:36)
[junit4:junit4]    > 	at com.carrotsearch.randomizedtesting.ThreadLeakControl$StatementRunner.run(ThreadLeakControl.java:358)
[junit4:junit4]    > 	at com.carrotsearch.randomizedtesting.ThreadLeakControl.forkTimeoutingTask(ThreadLeakControl.java:782)
[junit4:junit4]    > 	at com.carrotsearch.randomizedtesting.ThreadLeakControl$3.evaluate(ThreadLeakControl.java:442)
[junit4:junit4]    > 	at com.carrotsearch.randomizedtesting.RandomizedRunner.runSingleTest(RandomizedRunner.java:746)
[junit4:junit4]    > 	at com.carrotsearch.randomizedtesting.RandomizedRunner$3.evaluate(RandomizedRunner.java:648)
[junit4:junit4]    > 	at com.carrotsearch.randomizedtesting.RandomizedRunner$4.evaluate(RandomizedRunner.java:682)
[junit4:junit4]    > 	at com.carrotsearch.randomizedtesting.RandomizedRunner$5.evaluate(RandomizedRunner.java:693)
[junit4:junit4]    > 	at com.carrotsearch.randomizedtesting.rules.StatementAdapter.evaluate(StatementAdapter.java:36)
[junit4:junit4]    > 	at com.carrotsearch.randomizedtesting.rules.SystemPropertiesRestoreRule$1.evaluate(SystemPropertiesRestoreRule.java:53)
[junit4:junit4]    > 	at org.apache.lucene.util.AbstractBeforeAfterRule$1.evaluate(AbstractBeforeAfterRule.java:45)
[junit4:junit4]    > 	at org.apache.lucene.util.TestRuleStoreClassName$1.evaluate(TestRuleStoreClassName.java:42)
[junit4:junit4]    > 	at com.carrotsearch.randomizedtesting.rules.SystemPropertiesInvariantRule$1.evaluate(SystemPropertiesInvariantRule.java:55)
[junit4:junit4]    > 	at com.carrotsearch.randomizedtesting.rules.NoShadowingOrOverridesOnMethodsRule$1.evaluate(NoShadowingOrOverridesOnMethodsRule.java:39)
[junit4:junit4]    > 	at com.carrotsearch.randomizedtesting.rules.NoShadowingOrOverridesOnMethodsRule$1.evaluate(NoShadowingOrOverridesOnMethodsRule.java:39)
[junit4:junit4]    > 	at com.carrotsearch.randomizedtesting.rules.StatementAdapter.evaluate(StatementAdapter.java:36)
[junit4:junit4]    > 	at org.apache.lucene.util.TestRuleAssertionsRequired$1.evaluate(TestRuleAssertionsRequired.java:43)
[junit4:junit4]    > 	at org.apache.lucene.util.TestRuleMarkFailure$1.evaluate(TestRuleMarkFailure.java:48)
[junit4:junit4]    > 	at org.apache.lucene.util.TestRuleIgnoreAfterMaxFailures$1.evaluate(TestRuleIgnoreAfterMaxFailures.java:70)
[junit4:junit4]    > 	at org.apache.lucene.util.TestRuleIgnoreTestSuites$1.evaluate(TestRuleIgnoreTestSuites.java:55)
[junit4:junit4]    > 	at com.carrotsearch.randomizedtesting.rules.StatementAdapter.evaluate(StatementAdapter.java:36)
[junit4:junit4]    > 	at com.carrotsearch.randomizedtesting.ThreadLeakControl$StatementRunner.run(ThreadLeakControl.java:358)
[junit4:junit4]    > 	at java.lang.Thread.run(Thread.java:722)
[junit4:junit4]    > Caused by: java.lang.RuntimeException: REQUEST FAILED: xpath=*[count(//doc)=0]
[junit4:junit4]    > 	xml response was: <?xml version="1.0" encoding="UTF-8"?>
[junit4:junit4]    > <response>
[junit4:junit4]    > <lst name="responseHeader"><int name="status">0</int><int name="QTime">5</int></lst><result name="response" numFound="3" start="0"><doc><str name="id">5</str></doc><doc><str name="id">6</str></doc><doc><str name="id">7</str></doc></result>
[junit4:junit4]    > </response>
[junit4:junit4]    > 
[junit4:junit4]    > 	request was:fl=id&q=*:*&fq={!field+f%3Dtwodoubles+score%3DrecipDistance}Intersects(Circle(0,0+d%3D0.8993203677616635))&rows=1000
[junit4:junit4]    > 	at org.apache.solr.SolrTestCaseJ4.assertQ(SolrTestCaseJ4.java:496)
[junit4:junit4]    > 	... 44 more
[junit4:junit4]   2> 2866 T2709 oas.SolrTestCaseJ4.setUp ###Starting testIntersectFilter {p0=twodoubles}
[junit4:junit4]   2> 2868 T2709 C211 oasu.DirectUpdateHandler2.deleteAll [collection1] REMOVING ALL DOCUMENTS FROM INDEX
[junit4:junit4]   2> 2868 T2709 C211 UPDATE [collection1] webapp=null path=null params={} {deleteByQuery=*:*} 0 0
[junit4:junit4]   2> 2871 T2709 C211 UPDATE [collection1] webapp=null path=null params={} {add=[1]} 0 0
[junit4:junit4]   2> 2873 T2709 C211 UPDATE [collection1] webapp=null path=null params={} {add=[2]} 0 0
[junit4:junit4]   2> 2876 T2709 C211 UPDATE [collection1] webapp=null path=null params={} {add=[3]} 0 0
[junit4:junit4]   2> 2878 T2709 C211 UPDATE [collection1] webapp=null path=null params={} {add=[4]} 0 0
[junit4:junit4]   2> 2880 T2709 C211 UPDATE [collection1] webapp=null path=null params={} {add=[5]} 0 0
[junit4:junit4]   2> 2883 T2709 C211 UPDATE [collection1] webapp=null path=null params={} {add=[6]} 0 0
[junit4:junit4]   2> 2886 T2709 C211 UPDATE [collection1] webapp=null path=null params={} {add=[7]} 0 1
[junit4:junit4]   2> 2888 T2709 C211 UPDATE [collection1] webapp=null path=null params={} {add=[8]} 0 0
[junit4:junit4]   2> 2891 T2709 C211 UPDATE [collection1] webapp=null path=null params={} {add=[9]} 0 0
[junit4:junit4]   2> 2899 T2709 C211 UPDATE [collection1] webapp=null path=null params={} {add=[10]} 0 0
[junit4:junit4]   2> 2902 T2709 C211 UPDATE [collection1] webapp=null path=null params={} {add=[11]} 0 0
[junit4:junit4]   2> 2905 T2709 C211 UPDATE [collection1] webapp=null path=null params={} {add=[12]} 0 0
[junit4:junit4]   2> 2908 T2709 C211 UPDATE [collection1] webapp=null path=null params={} {add=[13]} 0 0
[junit4:junit4]   2> 2911 T2709 C211 oasu.DirectUpdateHandler2.commit start commit{flags=0,_version_=0,optimize=false,openSearcher=true,waitSearcher=true,expungeDeletes=false,softCommit=false}
[junit4:junit4]   2> 2913 T2709 C211 oasc.SolrDeletionPolicy.onCommit SolrDeletionPolicy.onCommit: commits:num=2
[junit4:junit4]   2> 		commit{dir=MockDirWrapper(NRTCachingDirectory(org.apache.lucene.store.RAMDirectory@1d7c4157 lockFactory=org.apache.lucene.store.NativeFSLockFactory@1f7bce63; maxCacheMB=0.82421875 maxMergeSizeMB=0.04296875)),segFN=segments_k,generation=20,filenames=[_i_nrm.cfs, _i_TestBloomFilteredLucene40Postings_0.tip, _i_TestBloomFilteredLucene40Postings_0.frq, _i.fdx, _i_TestBloomFilteredLucene40Postings_0.tim, _i_TestBloomFilteredLucene40Postings_0.blm, segments_k, _i_Memory_0.ram, _i.fnm, _i.si, _i.fdt, _i_nrm.cfe]
[junit4:junit4]   2> 		commit{dir=MockDirWrapper(NRTCachingDirectory(org.apache.lucene.store.RAMDirectory@1d7c4157 lockFactory=org.apache.lucene.store.NativeFSLockFactory@1f7bce63; maxCacheMB=0.82421875 maxMergeSizeMB=0.04296875)),segFN=segments_l,generation=21,filenames=[_j.fdx, _j_Memory_0.ram, _j.si, _j_TestBloomFilteredLucene40Postings_0.frq, _j_nrm.cfe, _j.fdt, _j.fnm, _j_TestBloomFilteredLucene40Postings_0.tim, _j_TestBloomFilteredLucene40Postings_0.blm, segments_l, _j_nrm.cfs, _j_TestBloomFilteredLucene40Postings_0.tip]
[junit4:junit4]   2> 2914 T2709 C211 oasc.SolrDeletionPolicy.updateCommits newest commit = 21
[junit4:junit4]   2> 2915 T2709 C211 oass.SolrIndexSearcher.<init> Opening Searcher@3e909a58 main
[junit4:junit4]   2> 2915 T2709 C211 oass.SolrIndexSearcher.getIndexDir WARNING WARNING: Directory impl does not support setting indexDir: org.apache.lucene.store.MockDirectoryWrapper
[junit4:junit4]   2> 2916 T2710 oasc.SolrCore.registerSearcher [collection1] Registered new searcher Searcher@3e909a58 main{StandardDirectoryReader(segments_l:65 _j(4.0.0.2):C13)}
[junit4:junit4]   2> 2916 T2709 C211 oasu.DirectUpdateHandler2.commit end_commit_flush
[junit4:junit4]   2> 2916 T2709 C211 UPDATE [collection1] webapp=null path=null params={} {commit=} 0 5
[junit4:junit4]   2> 2918 T2709 C211 REQ [collection1] webapp=null path=null params={fl=id&q=*:*&fq={!field+f%3Dtwodoubles}Intersects(Circle(1,1+d%3D1.5738106435829113))&rows=1000} hits=3 status=0 QTime=1 
[junit4:junit4]   2> 2922 T2709 C211 REQ [collection1] webapp=null path=null params={fl=id&q=*:*&fq={!field+f%3Dtwodoubles+score%3Ddistance}Intersects(Circle(0,179.8+d%3D1.798640735523327))&rows=1000} hits=2 status=0 QTime=1 
[junit4:junit4]   2> 2924 T2709 C211 REQ [collection1] webapp=null path=null params={fl=id&q=*:*&fq={!field+f%3Dtwodoubles+score%3Dnone}Intersects(Circle(89.8,50+d%3D1.798640735523327))&rows=1000} hits=2 status=0 QTime=0 
[junit4:junit4]   2> 2927 T2709 C211 REQ [collection1] webapp=null path=null params={fl=id&q=*:*&fq={!field+f%3Dtwodoubles}Intersects(Circle(-89.8,50+d%3D1.798640735523327))&rows=1000} hits=2 status=0 QTime=1 
[junit4:junit4]   2> 2930 T2709 C211 REQ [collection1] webapp=null path=null params={fl=id&q=*:*&fq={!field+f%3Dtwodoubles+score%3Dnone}Intersects(Circle(33.0,-80.0+d%3D2.6979611032849906))&rows=1000} hits=2 status=0 QTime=1 
[junit4:junit4]   2> 2931 T2709 C211 REQ [collection1] webapp=null path=null params={fl=id&q=*:*&fq={!field+f%3Dtwodoubles+score%3Ddistance}Intersects(Circle(1,1+d%3D44.96601838808318))&rows=1000} hits=3 status=0 QTime=0 
[junit4:junit4]   2> 2934 T2709 C211 REQ [collection1] webapp=null path=null params={fl=id&q=*:*&fq={!field+f%3Dtwodoubles}Intersects(-0.034898+-0.034898+0.234898+0.234898)&rows=1000} hits=2 status=0 QTime=0 
[junit4:junit4]   2> 2938 T2709 C211 oasu.DirectUpdateHandler2.deleteAll [collection1] REMOVING ALL DOCUMENTS FROM INDEX
[junit4:junit4]   2> 2938 T2709 C211 UPDATE [collection1] webapp=null path=null params={} {deleteByQuery=*:*} 0 0
[junit4:junit4]   2> 2941 T2709 C211 UPDATE [collection1] webapp=null path=null params={} {add=[14]} 0 0
[junit4:junit4]   2> 2944 T2709 C211 UPDATE [collection1] webapp=null path=null params={} {add=[15]} 0 1
[junit4:junit4]   2> 2946 T2709 C211 UPDATE [collection1] webapp=null path=null params={} {add=[16]} 0 0
[junit4:junit4]   2> 2949 T2709 C211 UPDATE [collection1] webapp=null path=null params={} {add=[17]} 0 0
[junit4:junit4]   2> 2951 T2709 C211 oasu.DirectUpdateHandler2.commit start commit{flags=0,_version_=0,optimize=false,openSearcher=true,waitSearcher=true,expungeDeletes=false,softCommit=false}
[junit4:junit4]   2> 2953 T2709 C211 oasc.SolrDeletionPolicy.onCommit SolrDeletionPolicy.onCommit: commits:num=2
[junit4:junit4]   2> 		commit{dir=MockDirWrapper(NRTCachingDirectory(org.apache.lucene.store.RAMDirectory@1d7c4157 lockFactory=org.apache.lucene.store.NativeFSLockFactory@1f7bce63; maxCacheMB=0.82421875 maxMergeSizeMB=0.04296875)),segFN=segments_l,generation=21,filenames=[_j.fdx, _j_Memory_0.ram, _j.si, _j_TestBloomFilteredLucene40Postings_0.frq, _j_nrm.cfe, _j.fdt, _j.fnm, _j_TestBloomFilteredLucene40Postings_0.tim, _j_TestBloomFilteredLucene40Postings_0.blm, segments_l, _j_nrm.cfs, _j_TestBloomFilteredLucene40Postings_0.tip]
[junit4:junit4]   2> 		commit{dir=MockDirWrapper(NRTCachingDirectory(org.apache.lucene.store.RAMDirectory@1d7c4157 lockFactory=org.apache.lucene.store.NativeFSLockFactory@1f7bce63; maxCacheMB=0.82421875 maxMergeSizeMB=0.04296875)),segFN=segments_m,generation=22,filenames=[_k_TestBloomFilteredLucene40Postings_0.tim, _k_TestBloomFilteredLucene40Postings_0.blm, _k_nrm.cfs, _k_nrm.cfe, _k.fdt, segments_m, _k.fdx, _k_Memory_0.ram, _k_TestBloomFilteredLucene40Postings_0.frq, _k_TestBloomFilteredLucene40Postings_0.tip, _k.fnm, _k.si]
[junit4:junit4]   2> 2953 T2709 C211 oasc.SolrDeletionPolicy.updateCommits newest commit = 22
[junit4:junit4]   2> 2954 T2709 C211 oass.SolrIndexSearcher.<init> Opening Searcher@bea46a6 main
[junit4:junit4]   2> 2955 T2709 C211 oass.SolrIndexSearcher.getIndexDir WARNING WARNING: Directory impl does not support setting indexDir: org.apache.lucene.store.MockDirectoryWrapper
[junit4:junit4]   2> 2955 T2710 oasc.SolrCore.registerSearcher [collection1] Registered new searcher Searcher@bea46a6 main{StandardDirectoryReader(segments_m:68 _k(4.0.0.2):C4)}
[junit4:junit4]   2> 2955 T2709 C211 oasu.DirectUpdateHandler2.commit end_commit_flush
[junit4:junit4]   2> 2956 T2709 C211 UPDATE [collection1] webapp=null path=null params={} {commit=} 0 5
[junit4:junit4]   2> 2958 T2709 C211 REQ [collection1] webapp=null path=null params={fl=id&q=*:*&fq={!field+f%3Dtwodoubles+score%3DrecipDistance}Intersects(Circle(0,0+d%3D8.993203677616636))&rows=1000} hits=1 status=0 QTime=1 
[junit4:junit4]   2> 2960 T2709 C211 REQ [collection1] webapp=null path=null params={fl=id&q=*:*&fq={!field+f%3Dtwodoubles+score%3DrecipDistance}Intersects(Circle(0,0+d%3D17.986407355233272))&rows=1000} hits=2 status=0 QTime=1 
[junit4:junit4]   2> 2963 T2709 C211 REQ [collection1] webapp=null path=null params={fl=id&q=*:*&fq={!field+f%3Dtwodoubles+score%3Ddistance}Intersects(-26.979611+-26.979611+26.979611+26.979611)&rows=1000} hits=3 status=0 QTime=1 
[junit4:junit4]   2> 2974 T2709 C211 REQ [collection1] webapp=null path=null params={fl=id&q=*:*&fq={!field+f%3Dtwodoubles+score%3Dnone}Intersects(Circle(0,0+d%3D26.98860423652752))&rows=1000} hits=3 status=0 QTime=1 
[junit4:junit4]   2> 2977 T2709 C211 REQ [collection1] webapp=null path=null params={fl=id&q=*:*&fq={!field+f%3Dtwodoubles+score%3Dnone}Intersects(Circle(0,0+d%3D26.980510353217664))&rows=1000} hits=3 status=0 QTime=1 
[junit4:junit4]   2> 2980 T2709 C211 REQ [collection1] webapp=null path=null params={fl=id&q=*:*&fq={!field+f%3Dtwodoubles+score%3Dnone}Intersects(Circle(43.517030,-96.789603+d%3D0.9802592008602133))&rows=1000} hits=0 status=0 QTime=0 
[junit4:junit4]   2> 2982 T2709 C211 REQ [collection1] webapp=null path=null params={fl=id&q=*:*&fq={!field+f%3Dtwodoubles+score%3DrecipDistance}Intersects(Circle(43.517030,-96.789603+d%3D0.9892524045378299))&rows=1000} hits=0 status=0 QTime=1 
[junit4:junit4]   2> 2984 T2709 C211 REQ [collection1] webapp=null path=null params={fl=id&q=*:*&fq={!field+f%3Dtwodoubles+score%3DrecipDistance}Intersects(-98.153831+42.527778+-95.425375+44.506282)&rows=1000} hits=1 status=0 QTime=1 
[junit4:junit4]   2> 2985 T2709 oas.SolrTestCaseJ4.tearDown ###Ending testIntersectFilter {p0=twodoubles}
[junit4:junit4]   2> 2989 T2709 oas.SolrTestCaseJ4.setUp ###Starting checkResultFormat {p0=twodoubles}
[junit4:junit4]   2> 2991 T2709 C211 oasu.DirectUpdateHandler2.deleteAll [collection1] REMOVING ALL DOCUMENTS FROM INDEX
[junit4:junit4]   2> 2991 T2709 C211 UPDATE [collection1] webapp=null path=null params={} {deleteByQuery=*:*} 0 0
[junit4:junit4]   2> 2994 T2709 C211 UPDATE [collection1] webapp=null path=null params={} {add=[11]} 0 0
[junit4:junit4]   2> 2997 T2709 C211 oasu.DirectUpdateHandler2.commit start commit{flags=0,_version_=0,optimize=false,openSearcher=true,waitSearcher=true,expungeDeletes=false,softCommit=false}
[junit4:junit4]   2> 2998 T2709 C211 oasc.SolrDeletionPolicy.onCommit SolrDeletionPolicy.onCommit: commits:num=2
[junit4:junit4]   2> 		commit{dir=MockDirWrapper(NRTCachingDirectory(org.apache.lucene.store.RAMDirectory@1d7c4157 lockFactory=org.apache.lucene.store.NativeFSLockFactory@1f7bce63; maxCacheMB=0.82421875 maxMergeSizeMB=0.04296875)),segFN=segments_m,generation=22,filenames=[_k_TestBloomFilteredLucene40Postings_0.tim, _k_TestBloomFilteredLucene40Postings_0.blm, _k_nrm.cfs, _k_nrm.cfe, _k.fdt, segments_m, _k.fdx, _k_Memory_0.ram, _k_TestBloomFilteredLucene40Postings_0.frq, _k_TestBloomFilteredLucene40Postings_0.tip, _k.fnm, _k.si]
[junit4:junit4]   2> 		commit{dir=MockDirWrapper(NRTCachingDirectory(org.apache.lucene.store.RAMDirectory@1d7c4157 lockFactory=org.apache.lucene.store.NativeFSLockFactory@1f7bce63; maxCacheMB=0.82421875 maxMergeSizeMB=0.04296875)),segFN=segments_n,generation=23,filenames=[_l_nrm.cfs, _l_TestBloomFilteredLucene40Postings_0.blm, _l_nrm.cfe, _l.fnm, _l.si, _l_TestBloomFilteredLucene40Postings_0.frq, _l_TestBloomFilteredLucene40Postings_0.tim, _l.fdx, _l_TestBloomFilteredLucene40Postings_0.tip, segments_n, _l.fdt, _l_Memory_0.ram]
[junit4:junit4]   2> 2999 T2709 C211 oasc.SolrDeletionPolicy.updateCommits newest commit = 23
[junit4:junit4]   2> 3000 T2709 C211 oass.SolrIndexSearcher.<init> Opening Searcher@19dcde72 main
[junit4:junit4]   2> 3000 T2709 C211 oass.SolrIndexSearcher.getIndexDir WARNING WARNING: Directory impl does not support setting indexDir: org.apache.lucene.store.MockDirectoryWrapper
[junit4:junit4]   2> 3000 T2709 C211 oasu.DirectUpdateHandler2.commit end_commit_flush
[junit4:junit4]   2> 3001 T2710 oasc.SolrCore.registerSearcher [collection1] Registered new searcher Searcher@19dcde72 main{StandardDirectoryReader(segments_n:71 _l(4.0.0.2):C1)}
[junit4:junit4]   2> 3001 T2709 C211 UPDATE [collection1] webapp=null path=null params={} {commit=} 0 4
[junit4:junit4]   2> 3003 T2709 C211 REQ [collection1] webapp=null path=null params={fl=id,twodoubles&q=*:*&fq={!field+needScore%3Dfalse+f%3Dtwodoubles}Intersects(Circle(89.9,-130+d%3D9))&rows=1000} hits=1 status=0 QTime=1 
[junit4:junit4]   2> 3004 T2709 oas.SolrTestCaseJ4.tearDown ###Ending checkResultFormat {p0=twodoubles}
[junit4:junit4]   2> 3008 T2709 oas.SolrTestCaseJ4.setUp ###Starting testSort {p0=twodoubles}
[junit4:junit4]   2> 3010 T2709 C211 oasu.DirectUpdateHandler2.deleteAll [collection1] REMOVING ALL DOCUMENTS FROM INDEX
[junit4:junit4]   2> 3010 T2709 C211 UPDATE [collection1] webapp=null path=null params={} {deleteByQuery=*:*} 0 1
[junit4:junit4]   2> 3015 T2709 C211 UPDATE [collection1] webapp=null path=null params={} {add=[100]} 0 1
[junit4:junit4]   2> 3018 T2709 C211 UPDATE [collection1] webapp=null path=null params={} {add=[101]} 0 0
[junit4:junit4]   2> 3021 T2709 C211 UPDATE [collection1] webapp=null path=null params={} {add=[999]} 0 1
[junit4:junit4]   2> 3023 T2709 C211 oasu.DirectUpdateHandler2.commit start commit{flags=0,_version_=0,optimize=false,openSearcher=true,waitSearcher=true,expungeDeletes=false,softCommit=false}
[junit4:junit4]   2> 3025 T2709 C211 oasc.SolrDeletionPolicy.onCommit SolrDeletionPolicy.onCommit: commits:num=2
[junit4:junit4]   2> 		commit{dir=MockDirWrapper(NRTCachingDirectory(org.apache.lucene.store.RAMDirectory@1d7c4157 lockFactory=org.apache.lucene.store.NativeFSLockFactory@1f7bce63; maxCacheMB=0.82421875 maxMergeSizeMB=0.04296875)),segFN=segments_n,generation=23,filenames=[_l_nrm.cfs, _l_TestBloomFilteredLucene40Postings_0.blm, _l_nrm.cfe, _l.fnm, _l.si, _l_TestBloomFilteredLucene40Postings_0.frq, _l_TestBloomFilteredLucene40Postings_0.tim, _l.fdx, _l_TestBloomFilteredLucene40Postings_0.tip, segments_n, _l.fdt, _l_Memory_0.ram]
[junit4:junit4]   2> 		commit{dir=MockDirWrapper(NRTCachingDirectory(org.apache.lucene.store.RAMDirectory@1d7c4157 lockFactory=org.apache.lucene.store.NativeFSLockFactory@1f7bce63; maxCacheMB=0.82421875 maxMergeSizeMB=0.04296875)),segFN=segments_o,generation=24,filenames=[_m.si, _m_TestBloomFilteredLucene40Postings_0.frq, _m_nrm.cfe, _m.fdt, _m_nrm.cfs, segments_o, _m.fdx, _m_TestBloomFilteredLucene40Postings_0.tim, _m_Memory_0.ram, _m_TestBloomFilteredLucene40Postings_0.tip, _m.fnm, _m_TestBloomFilteredLucene40Postings_0.blm]
[junit4:junit4]   2> 3025 T2709 C211 oasc.SolrDeletionPolicy.updateCommits newest commit = 24
[junit4:junit4]   2> 3026 T2709 C211 oass.SolrIndexSearcher.<init> Opening Searcher@55627b35 main
[junit4:junit4]   2> 3026 T2709 C211 oass.SolrIndexSearcher.getIndexDir WARNING WARNING: Directory impl does not support setting indexDir: org.apache.lucene.store.MockDirectoryWrapper
[junit4:junit4]   2> 3027 T2710 oasc.SolrCore.registerSearcher [collection1] Registered new searcher Searcher@55627b35 main{StandardDirectoryReader(segments_o:74 _m(4.0.0.2):C3)}
[junit4:junit4]   2> 3027 T2709 C211 oasu.DirectUpdateHandler2.commit end_commit_flush
[junit4:junit4]   2> 3027 T2709 C211 UPDATE [collection1] webapp=null path=null params={} {commit=} 0 4
[junit4:junit4]   2> 3029 T2709 C211 REQ [collection1] webapp=null path=null params={fl=id,score&q=twodoubles:"Intersects(Circle(3,4+d%3D9))"} hits=2 status=0 QTime=1 
[junit4:junit4]   2> 3030 T2709 C211 REQ [collection1] webapp=null path=null params={sort=score+asc&fl=id,score&q={!+score%3Ddistance}twodoubles:"Intersects(Circle(3,4+d%3D9))"} hits=2 status=0 QTime=1 
[junit4:junit4]   2> 3031 T2709 C211 REQ [collection1] webapp=null path=null params={sort=score+desc&fl=id,score&q={!+score%3DrecipDistance}twodoubles:"Intersects(Circle(3,4+d%3D9))"} hits=2 status=0 QTime=1 
[junit4:junit4]   2> 3032 T2709 C211 REQ [collection1] webapp=null path=null params={sort=score+asc&fl=id,score&q={!+score%3Ddistance}twodoubles:"Intersects(Circle(4,0+d%3D9))"} hits=2 status=0 QTime=0 
[junit4:junit4]   2> 3033 T2709 C211 REQ [collection1] webapp=null path=null params={sortQuery={!+score%3Ddistance}twodoubles:"Intersects(Circle(3,4+d%3D9))"&sort=query($sortQuery)+asc&fl=id,score&q=-id:999} hits=2 status=0 QTime=1 
[junit4:junit4]   2> 3034 T2709 C211 REQ [collection1] webapp=null path=null params={sortQuery={!+score%3Ddistance}twodoubles:"Intersects(Circle(4,0+d%3D9))"&sort=query($sortQuery)+asc&fl=id,score&q=-id:999} hits=2 status=0 QTime=1 
[junit4:junit4]   2> 3034 T2709 oas.SolrTestCaseJ4.tearDown ###Ending testSort {p0=twodoubles}
[junit4:junit4]   2> 3038 T2709 oas.SolrTestCaseJ4.setUp ###Starting testSortMultiVal {p0=twodoubles}
[junit4:junit4]   2> 3040 T2709 C211 oasu.DirectUpdateHandler2.deleteAll [collection1] REMOVING ALL DOCUMENTS FROM INDEX
[junit4:junit4]   2> 3040 T2709 C211 UPDATE [collection1] webapp=null path=null params={} {deleteByQuery=*:*} 0 1
[junit4:junit4]   2> 3041 T2709 oas.SolrTestCaseJ4.tearDown ###Ending testSortMultiVal {p0=twodoubles}
[junit4:junit4] IGNOR/A 0.01s J1 | TestSolr4Spatial.testSortMultiVal {p0=twodoubles}
[junit4:junit4]    > Assumption #1: Multivalue not supported for this field
[junit4:junit4]   2> 3046 T2709 oas.SolrTestCaseJ4.deleteCore ###deleteCore
[junit4:junit4]   2> 3047 T2709 oasc.CoreContainer.shutdown Shutting down CoreContainer instance=1574961511
[junit4:junit4]   2> 3047 T2709 oasc.SolrCore.close [collection1]  CLOSING SolrCore org.apache.solr.core.SolrCore@5764e85d
[junit4:junit4]   2> 3047 T2709 oasc.SolrCore.closeSearcher [collection1] Closing main searcher on request.
[junit4:junit4]   2> 3047 T2709 oasu.DirectUpdateHandler2.close closing DirectUpdateHandler2{commits=23,autocommits=0,soft autocommits=0,optimizes=0,rollbacks=0,expungeDeletes=0,docsPending=0,adds=0,deletesById=0,deletesByQuery=1,errors=0,cumulative_adds=142,cumulative_deletesById=0,cumulative_deletesByQuery=28,cumulative_errors=0}
[junit4:junit4]   2> 3048 T2709 oasu.DefaultSolrCoreState.decref SolrCoreState ref count has reached 0 - closing IndexWriter
[junit4:junit4]   2> 3048 T2709 C211 oasc.SolrDeletionPolicy.onCommit SolrDeletionPolicy.onCommit: commits:num=2
[junit4:junit4]   2> 		commit{dir=MockDirWrapper(NRTCachingDirectory(org.apache.lucene.store.RAMDirectory@1d7c4157 lockFactory=org.apache.lucene.store.NativeFSLockFactory@1f7bce63; maxCacheMB=0.82421875 maxMergeSizeMB=0.04296875)),segFN=segments_o,generation=24,filenames=[_m.si, _m_TestBloomFilteredLucene40Postings_0.frq, _m_nrm.cfe, _m.fdt, _m_nrm.cfs, segments_o, _m.fdx, _m_TestBloomFilteredLucene40Postings_0.tim, _m_Memory_0.ram, _m_TestBloomFilteredLucene40Postings_0.tip, _m.fnm, _m_TestBloomFilteredLucene40Postings_0.blm]
[junit4:junit4]   2> 		commit{dir=MockDirWrapper(NRTCachingDirectory(org.apache.lucene.store.RAMDirectory@1d7c4157 lockFactory=org.apache.lucene.store.NativeFSLockFactory@1f7bce63; maxCacheMB=0.82421875 maxMergeSizeMB=0.04296875)),segFN=segments_p,generation=25,filenames=[segments_p]
[junit4:junit4]   2> 3049 T2709 C211 oasc.SolrDeletionPolicy.updateCommits newest commit = 25
[junit4:junit4]   2> 3049 T2709 oasu.DefaultSolrCoreState.decref Closing SolrCoreState - canceling any ongoing recovery
[junit4:junit4]   2> NOTE: test params are: codec=Lucene40: {stqpt_geohash=PostingsFormat(name=Direct), id=PostingsFormat(name=Memory doPackFST= false), twodoubles__x=PostingsFormat(name=TestBloomFilteredLucene40Postings), twodoubles__y=PostingsFormat(name=Memory doPackFST= false), srpt_geohash=PostingsFormat(name=Memory doPackFST= false), srpt_quad=Pulsing40(freqCutoff=20 minBlockSize=11 maxBlockSize=86)}, sim=RandomSimilarityProvider(queryNorm=true,coord=yes): {}, locale=en_SG, timezone=ART
[junit4:junit4]   2> NOTE: Linux 3.2.0-30-generic amd64/Oracle Corporation 1.7.0_07 (64-bit)/cpus=8,threads=1,free=25829208,total=128630784
[junit4:junit4]   2> NOTE: All tests run in this JVM: [URLClassifyProcessorTest, MultiTermTest, SuggesterTSTTest, UUIDFieldTest, BasicDistributedZk2Test, RAMDirectoryFactoryTest, TestMultiCoreConfBootstrap, BasicFunctionalityTest, TestReplicationHandler, TestValueSourceCache, StatelessScriptUpdateProcessorFactoryTest, TimeZoneUtilsTest, LukeRequestHandlerTest, EchoParamsTest, FieldMutatingUpdateProcessorTest, PathHierarchyTokenizerFactoryTest, FileUtilsTest, TestPropInjectDefaults, TestQueryUtils, ReturnFieldsTest, TestArbitraryIndexDir, SyncSliceTest, TestLRUCache, TestTrie, TestReload, TestSort, ZkNodePropsTest, TestUtils, TestSolrXMLSerializer, DOMUtilTest, StatsComponentTest, SolrInfoMBeanTest, RecoveryZkTest, RequiredFieldsTest, TestCSVLoader, PrimitiveFieldTypeTest, QueryParsingTest, TestRTGBase, StandardRequestHandlerTest, TestSolrCoreProperties, OpenExchangeRatesOrgProviderTest, TestHashPartitioner, TestBM25SimilarityFactory, FullSolrCloudDistribCmdsTest, LeaderElectionTest, QueryEqualityTest, TermVectorComponentDistributedTest, TestStressRecovery, TestPropInject, XmlUpdateRequestHandlerTest, TestJmxIntegration, ScriptEngineTest, UpdateParamsTest, TestUpdate, TestWriterPerf, TestRemoteStreaming, ClusterStateUpdateTest, OverseerTest, TestRealTimeGet, TestDistributedGrouping, SpellCheckCollatorTest, TestExtendedDismaxParser, SoftAutoCommitTest, AutoCommitTest, BasicZkTest, ZkSolrClientTest, WordBreakSolrSpellCheckerTest, TestRecovery, TestJoin, DirectSolrSpellCheckerTest, ConvertedLegacyTest, PeerSyncTest, SortByFunctionTest, SignatureUpdateProcessorFactoryTest, SampleTest, HighlighterTest, DirectSolrConnectionTest, PolyFieldTest, MoreLikeThisHandlerTest, MBeansHandlerTest, CurrencyFieldTest, DisMaxRequestHandlerTest, IndexSchemaTest, TermsComponentTest, DistanceFunctionTest, XsltUpdateRequestHandlerTest, TestPHPSerializedResponseWriter, PingRequestHandlerTest, TermVectorComponentTest, SuggesterWFSTTest, JsonLoaderTest, TestSurroundQueryParser, DocumentAnalysisRequestHandlerTest, IndexSchemaRuntimeFieldTest, FastVectorHighlighterTest, DebugComponentTest, TestOmitPositions, CopyFieldTest, LoggingHandlerTest, SuggesterTest, ShowFileRequestHandlerTest, BadIndexSchemaTest, TestFoldingMultitermQuery, TestSolrDeletionPolicy1, NoCacheHeaderTest, AlternateDirectoryTest, TestBinaryField, HighlighterConfigTest, TestSolrDeletionPolicy2, SOLR749Test, TestMergePolicyConfig, TestXIncludeConfig, TestDocSet, TestQuerySenderListener, SolrIndexConfigTest, TestQuerySenderNoQuery, IndexReaderFactoryTest, NumericFieldsTest, OutputWriterTest, TestNumberUtils, TestJmxMonitoredMap, TestConfig, SpellPossibilityIteratorTest, TestPhraseSuggestions, TestPerFieldSimilarity, TestPluginEnable, LegacyHTMLStripCharFilterTest, TestDFRSimilarityFactory, TestIBSimilarityFactory, TestCodecSupport, PrimUtilsTest, TestSystemIdResolver, SpellingQueryConverterTest, TestBadConfig, AnalysisAfterCoreReloadTest, TestDocumentBuilder, TestCharFilters, TestCollationKeyRangeQueries, TestElisionMultitermQuery, TestSolr4Spatial]
[junit4:junit4] Completed on J1 in 3.07s, 24 tests, 4 errors, 1 skipped <<< FAILURES!

[...truncated 17 lines...]
BUILD FAILED
/mnt/ssd/jenkins/workspace/Lucene-Solr-4.x-Linux/build.xml:32: The following error occurred while executing this line:
/mnt/ssd/jenkins/workspace/Lucene-Solr-4.x-Linux/solr/build.xml:146: The following error occurred while executing this line:
/mnt/ssd/jenkins/workspace/Lucene-Solr-4.x-Linux/lucene/module-build.xml:63: The following error occurred while executing this line:
/mnt/ssd/jenkins/workspace/Lucene-Solr-4.x-Linux/lucene/common-build.xml:1133: The following error occurred while executing this line:
/mnt/ssd/jenkins/workspace/Lucene-Solr-4.x-Linux/lucene/common-build.xml:810: There were test failures: 230 suites, 951 tests, 4 errors, 7 ignored (2 assumptions)

Total time: 27 minutes 52 seconds
Build step 'Invoke Ant' marked build as failure
Recording test results
Description set: Java: 64bit/jdk1.7.0_07 -XX:+UseSerialGC
Email was triggered for: Failure
Sending email for trigger: Failure



Mime
View raw message