lucene-dev mailing list archives

Site index · List index
Message view « Date » · « Thread »
Top « Date » · « Thread »
From Policeman Jenkins Server <jenk...@sd-datasolutions.de>
Subject [JENKINS] Lucene-Solr-trunk-Linux (32bit/ibm-j9-jdk7) - Build # 1184 - Failure!
Date Mon, 17 Sep 2012 21:54:20 GMT
Build: http://jenkins.sd-datasolutions.de/job/Lucene-Solr-trunk-Linux/1184/
Java: 32bit/ibm-j9-jdk7 -Xjit:exclude={org/apache/lucene/util/fst/FST.pack(IIF)Lorg/apache/lucene/util/fst/FST;}

1 tests failed.
REGRESSION:  org.apache.solr.update.AutoCommitTest.testMaxTime

Error Message:
shouldn't find any query failed XPath: //result[@numFound=0]  xml response was: <?xml version="1.0" encoding="UTF-8"?> <response> <lst name="responseHeader"><int name="status">0</int><int name="QTime">1156</int></lst><result name="response" numFound="1" start="0"><doc><int name="id">529</int><int name="range_facet_si">529</int><arr name="range_facet_l"><long>529</long></arr><arr name="range_facet_sl"><long>529</long></arr><arr name="field_t"><str>what's inside?</str></arr><arr name="subject"><str>info</str></arr><int name="intDefault">42</int><date name="timestamp">2012-09-17T21:51:44.78Z</date><arr name="multiDefault"><str>muLti-Default</str></arr></doc></result> </response>   request was: q=id:529&start=0&qt=standard&version=2.2&rows=20

Stack Trace:
java.lang.AssertionError: shouldn't find any query failed XPath: //result[@numFound=0]
 xml response was: <?xml version="1.0" encoding="UTF-8"?>
<response>
<lst name="responseHeader"><int name="status">0</int><int name="QTime">1156</int></lst><result name="response" numFound="1" start="0"><doc><int name="id">529</int><int name="range_facet_si">529</int><arr name="range_facet_l"><long>529</long></arr><arr name="range_facet_sl"><long>529</long></arr><arr name="field_t"><str>what's inside?</str></arr><arr name="subject"><str>info</str></arr><int name="intDefault">42</int><date name="timestamp">2012-09-17T21:51:44.78Z</date><arr name="multiDefault"><str>muLti-Default</str></arr></doc></result>
</response>

 request was: q=id:529&start=0&qt=standard&version=2.2&rows=20
	at __randomizedtesting.SeedInfo.seed([A7875CB818AC1E:9A53FABE26823022]:0)
	at org.junit.Assert.fail(Assert.java:93)
	at org.apache.solr.util.AbstractSolrTestCase.assertQ(AbstractSolrTestCase.java:276)
	at org.apache.solr.update.AutoCommitTest.testMaxTime(AutoCommitTest.java:217)
	at sun.reflect.NativeMethodAccessorImpl.invoke0(Native Method)
	at sun.reflect.NativeMethodAccessorImpl.invoke(NativeMethodAccessorImpl.java:88)
	at sun.reflect.DelegatingMethodAccessorImpl.invoke(DelegatingMethodAccessorImpl.java:55)
	at java.lang.reflect.Method.invoke(Method.java:613)
	at com.carrotsearch.randomizedtesting.RandomizedRunner.invoke(RandomizedRunner.java:1559)
	at com.carrotsearch.randomizedtesting.RandomizedRunner.access$600(RandomizedRunner.java:79)
	at com.carrotsearch.randomizedtesting.RandomizedRunner$6.evaluate(RandomizedRunner.java:737)
	at com.carrotsearch.randomizedtesting.RandomizedRunner$7.evaluate(RandomizedRunner.java:773)
	at com.carrotsearch.randomizedtesting.RandomizedRunner$8.evaluate(RandomizedRunner.java:787)
	at com.carrotsearch.randomizedtesting.rules.SystemPropertiesRestoreRule$1.evaluate(SystemPropertiesRestoreRule.java:53)
	at org.apache.lucene.util.TestRuleSetupTeardownChained$1.evaluate(TestRuleSetupTeardownChained.java:50)
	at org.apache.lucene.util.TestRuleFieldCacheSanity$1.evaluate(TestRuleFieldCacheSanity.java:51)
	at org.apache.lucene.util.AbstractBeforeAfterRule$1.evaluate(AbstractBeforeAfterRule.java:45)
	at com.carrotsearch.randomizedtesting.rules.SystemPropertiesInvariantRule$1.evaluate(SystemPropertiesInvariantRule.java:55)
	at org.apache.lucene.util.TestRuleThreadAndTestName$1.evaluate(TestRuleThreadAndTestName.java:48)
	at org.apache.lucene.util.TestRuleIgnoreAfterMaxFailures$1.evaluate(TestRuleIgnoreAfterMaxFailures.java:70)
	at org.apache.lucene.util.TestRuleMarkFailure$1.evaluate(TestRuleMarkFailure.java:48)
	at com.carrotsearch.randomizedtesting.rules.StatementAdapter.evaluate(StatementAdapter.java:36)
	at com.carrotsearch.randomizedtesting.ThreadLeakControl$StatementRunner.run(ThreadLeakControl.java:358)
	at com.carrotsearch.randomizedtesting.ThreadLeakControl.forkTimeoutingTask(ThreadLeakControl.java:782)
	at com.carrotsearch.randomizedtesting.ThreadLeakControl$3.evaluate(ThreadLeakControl.java:442)
	at com.carrotsearch.randomizedtesting.RandomizedRunner.runSingleTest(RandomizedRunner.java:746)
	at com.carrotsearch.randomizedtesting.RandomizedRunner$3.evaluate(RandomizedRunner.java:648)
	at com.carrotsearch.randomizedtesting.RandomizedRunner$4.evaluate(RandomizedRunner.java:682)
	at com.carrotsearch.randomizedtesting.RandomizedRunner$5.evaluate(RandomizedRunner.java:693)
	at com.carrotsearch.randomizedtesting.rules.StatementAdapter.evaluate(StatementAdapter.java:36)
	at com.carrotsearch.randomizedtesting.rules.SystemPropertiesRestoreRule$1.evaluate(SystemPropertiesRestoreRule.java:53)
	at org.apache.lucene.util.AbstractBeforeAfterRule$1.evaluate(AbstractBeforeAfterRule.java:45)
	at org.apache.lucene.util.TestRuleStoreClassName$1.evaluate(TestRuleStoreClassName.java:42)
	at com.carrotsearch.randomizedtesting.rules.SystemPropertiesInvariantRule$1.evaluate(SystemPropertiesInvariantRule.java:55)
	at com.carrotsearch.randomizedtesting.rules.NoShadowingOrOverridesOnMethodsRule$1.evaluate(NoShadowingOrOverridesOnMethodsRule.java:39)
	at com.carrotsearch.randomizedtesting.rules.NoShadowingOrOverridesOnMethodsRule$1.evaluate(NoShadowingOrOverridesOnMethodsRule.java:39)
	at com.carrotsearch.randomizedtesting.rules.StatementAdapter.evaluate(StatementAdapter.java:36)
	at org.apache.lucene.util.TestRuleAssertionsRequired$1.evaluate(TestRuleAssertionsRequired.java:43)
	at org.apache.lucene.util.TestRuleMarkFailure$1.evaluate(TestRuleMarkFailure.java:48)
	at org.apache.lucene.util.TestRuleIgnoreAfterMaxFailures$1.evaluate(TestRuleIgnoreAfterMaxFailures.java:70)
	at org.apache.lucene.util.TestRuleIgnoreTestSuites$1.evaluate(TestRuleIgnoreTestSuites.java:55)
	at com.carrotsearch.randomizedtesting.rules.StatementAdapter.evaluate(StatementAdapter.java:36)
	at com.carrotsearch.randomizedtesting.ThreadLeakControl$StatementRunner.run(ThreadLeakControl.java:358)
	at java.lang.Thread.run(Thread.java:777)




Build Log:
[...truncated 8019 lines...]
[junit4:junit4] Suite: org.apache.solr.update.AutoCommitTest
[junit4:junit4]   2> 31232 T2540 oasu.AbstractSolrTestCase.setUp ####SETUP_START testMaxTime
[junit4:junit4]   2> 31233 T2540 oasc.SolrResourceLoader.<init> new SolrResourceLoader for directory: '/mnt/ssd/jenkins/workspace/Lucene-Solr-trunk-Linux/solr/build/solr-core/test-files/solr/collection1/'
[junit4:junit4]   2> 31234 T2540 oasc.SolrResourceLoader.replaceClassLoader Adding 'file:/mnt/ssd/jenkins/workspace/Lucene-Solr-trunk-Linux/solr/build/solr-core/test-files/solr/collection1/lib/README' to classloader
[junit4:junit4]   2> 31234 T2540 oasc.SolrResourceLoader.replaceClassLoader Adding 'file:/mnt/ssd/jenkins/workspace/Lucene-Solr-trunk-Linux/solr/build/solr-core/test-files/solr/collection1/lib/classes/' to classloader
[junit4:junit4]   2> 31258 T2540 oasc.SolrConfig.<init> Using Lucene MatchVersion: LUCENE_50
[junit4:junit4]   2> 31292 T2540 oasc.SolrConfig.<init> Loaded SolrConfig: solrconfig.xml
[junit4:junit4]   2> 31293 T2540 oass.IndexSchema.readSchema Reading Solr Schema
[junit4:junit4]   2> 31298 T2540 oass.IndexSchema.readSchema Schema name=test
[junit4:junit4]   2> 31590 T2540 oass.OpenExchangeRatesOrgProvider.init Initialized with rates=open-exchange-rates.json, refreshInterval=1440.
[junit4:junit4]   2> 31595 T2540 oass.IndexSchema.readSchema default search field in schema is text
[junit4:junit4]   2> 31597 T2540 oass.IndexSchema.readSchema unique key field: id
[junit4:junit4]   2> 31602 T2540 oass.FileExchangeRateProvider.reload Reloading exchange rates from file currency.xml
[junit4:junit4]   2> 31605 T2540 oass.FileExchangeRateProvider.reload Reloading exchange rates from file currency.xml
[junit4:junit4]   2> 31608 T2540 oass.OpenExchangeRatesOrgProvider.reload Reloading exchange rates from open-exchange-rates.json
[junit4:junit4]   2> 31609 T2540 oass.OpenExchangeRatesOrgProvider.reload Reloading exchange rates from open-exchange-rates.json
[junit4:junit4]   2> 31610 T2540 oasc.SolrResourceLoader.locateSolrHome JNDI not configured for solr (NoInitialContextEx)
[junit4:junit4]   2> 31611 T2540 oasc.SolrResourceLoader.locateSolrHome using system property solr.solr.home: /mnt/ssd/jenkins/workspace/Lucene-Solr-trunk-Linux/solr/build/solr-core/test-files/solr
[junit4:junit4]   2> 31611 T2540 oasc.SolrResourceLoader.<init> new SolrResourceLoader for directory: '/mnt/ssd/jenkins/workspace/Lucene-Solr-trunk-Linux/solr/build/solr-core/test-files/solr/'
[junit4:junit4]   2> 31616 T2540 oasc.CoreContainer.<init> New CoreContainer -1107132806
[junit4:junit4]   2> 31617 T2540 oasc.SolrCore.<init> [collection1] Opening new SolrCore at /mnt/ssd/jenkins/workspace/Lucene-Solr-trunk-Linux/solr/build/solr-core/test-files/solr/collection1/, dataDir=/mnt/ssd/jenkins/workspace/Lucene-Solr-trunk-Linux/solr/build/solr-core/test/J1/./org.apache.solr.update.AutoCommitTest-1347918704321/
[junit4:junit4]   2> 31618 T2540 oasc.JmxMonitoredMap.<init> JMX monitoring is enabled. Adding Solr mbeans to JMX Server: com.sun.jmx.mbeanserver.JmxMBeanServer@a5dc1215
[junit4:junit4]   2> 31618 T2540 oasc.SolrCore.getNewIndexDir WARNING New index directory detected: old=null new=/mnt/ssd/jenkins/workspace/Lucene-Solr-trunk-Linux/solr/build/solr-core/test/J1/./org.apache.solr.update.AutoCommitTest-1347918704321/index/
[junit4:junit4]   2> 31619 T2540 oasc.SolrCore.initIndex WARNING [collection1] Solr index directory '/mnt/ssd/jenkins/workspace/Lucene-Solr-trunk-Linux/solr/build/solr-core/test/J1/./org.apache.solr.update.AutoCommitTest-1347918704321/index' doesn't exist. Creating new index...
[junit4:junit4]   2> 31620 T2540 oasc.CachingDirectoryFactory.get return new directory for /mnt/ssd/jenkins/workspace/Lucene-Solr-trunk-Linux/solr/build/solr-core/test/J1/./org.apache.solr.update.AutoCommitTest-1347918704321/index forceNew:false
[junit4:junit4]   2> 31621 T2540 oasc.SolrDeletionPolicy.onCommit SolrDeletionPolicy.onCommit: commits:num=1
[junit4:junit4]   2> 		commit{dir=MockDirWrapper(org.apache.lucene.store.RAMDirectory@cadf1256 lockFactory=org.apache.lucene.store.NativeFSLockFactory@89227a10),segFN=segments_1,generation=1,filenames=[segments_1]
[junit4:junit4]   2> 31622 T2540 oasc.SolrDeletionPolicy.updateCommits newest commit = 1
[junit4:junit4]   2> 31622 T2540 oasc.SolrCore.initWriters created xml: solr.XMLResponseWriter
[junit4:junit4]   2> 31624 T2540 oasup.UpdateRequestProcessorChain.init inserting DistributedUpdateProcessorFactory into updateRequestProcessorChain "dedupe"
[junit4:junit4]   2> 31624 T2540 oasup.UpdateRequestProcessorChain.init inserting DistributedUpdateProcessorFactory into updateRequestProcessorChain "dedupe-allfields"
[junit4:junit4]   2> 31625 T2540 oasup.UpdateRequestProcessorChain.init inserting DistributedUpdateProcessorFactory into updateRequestProcessorChain "stored_sig"
[junit4:junit4]   2> 31626 T2540 oasup.UpdateRequestProcessorChain.init inserting DistributedUpdateProcessorFactory into updateRequestProcessorChain "uniq-fields"
[junit4:junit4]   2> 31626 T2540 oasup.UpdateRequestProcessorChain.init inserting DistributedUpdateProcessorFactory into updateRequestProcessorChain "distrib-dup-test-chain-implicit"
[junit4:junit4]   2> 31627 T2540 oasc.RequestHandlers.initHandlersFromConfig adding lazy requestHandler: solr.ReplicationHandler
[junit4:junit4]   2> 31627 T2540 oasc.RequestHandlers.initHandlersFromConfig created /replication: solr.ReplicationHandler
[junit4:junit4]   2> 31628 T2540 oasc.RequestHandlers.initHandlersFromConfig created standard: solr.StandardRequestHandler
[junit4:junit4]   2> 31629 T2540 oasc.RequestHandlers.initHandlersFromConfig created /get: solr.RealTimeGetHandler
[junit4:junit4]   2> 31629 T2540 oasc.RequestHandlers.initHandlersFromConfig created dismax: solr.SearchHandler
[junit4:junit4]   2> 31630 T2540 oasc.RequestHandlers.initHandlersFromConfig created mock: org.apache.solr.core.MockQuerySenderListenerReqHandler
[junit4:junit4]   2> 31630 T2540 oasc.RequestHandlers.initHandlersFromConfig created /admin/: org.apache.solr.handler.admin.AdminHandlers
[junit4:junit4]   2> 31631 T2540 oasc.RequestHandlers.initHandlersFromConfig created defaults: solr.StandardRequestHandler
[junit4:junit4]   2> 31632 T2540 oasc.RequestHandlers.initHandlersFromConfig adding lazy requestHandler: solr.StandardRequestHandler
[junit4:junit4]   2> 31632 T2540 oasc.RequestHandlers.initHandlersFromConfig created lazy: solr.StandardRequestHandler
[junit4:junit4]   2> 31633 T2540 oasc.RequestHandlers.initHandlersFromConfig created /update: solr.UpdateRequestHandler
[junit4:junit4]   2> 31633 T2540 oasc.RequestHandlers.initHandlersFromConfig created /terms: org.apache.solr.handler.component.SearchHandler
[junit4:junit4]   2> 31634 T2540 oasc.RequestHandlers.initHandlersFromConfig created spellCheckCompRH: org.apache.solr.handler.component.SearchHandler
[junit4:junit4]   2> 31634 T2540 oasc.RequestHandlers.initHandlersFromConfig created spellCheckCompRH_Direct: org.apache.solr.handler.component.SearchHandler
[junit4:junit4]   2> 31635 T2540 oasc.RequestHandlers.initHandlersFromConfig created spellCheckWithWordbreak: org.apache.solr.handler.component.SearchHandler
[junit4:junit4]   2> 31636 T2540 oasc.RequestHandlers.initHandlersFromConfig created spellCheckWithWordbreak_Direct: org.apache.solr.handler.component.SearchHandler
[junit4:junit4]   2> 31636 T2540 oasc.RequestHandlers.initHandlersFromConfig created spellCheckCompRH1: org.apache.solr.handler.component.SearchHandler
[junit4:junit4]   2> 31637 T2540 oasc.RequestHandlers.initHandlersFromConfig created tvrh: org.apache.solr.handler.component.SearchHandler
[junit4:junit4]   2> 31637 T2540 oasc.RequestHandlers.initHandlersFromConfig created /mlt: solr.MoreLikeThisHandler
[junit4:junit4]   2> 31638 T2540 oasc.RequestHandlers.initHandlersFromConfig created /debug/dump: solr.DumpRequestHandler
[junit4:junit4]   2> 31639 T2540 oashl.XMLLoader.init xsltCacheLifetimeSeconds=60
[junit4:junit4]   2> 31640 T2540 oasc.SolrCore.initDeprecatedSupport WARNING solrconfig.xml uses deprecated <admin/gettableFiles>, Please update your config to use the ShowFileRequestHandler.
[junit4:junit4]   2> 31641 T2540 oasc.SolrCore.initDeprecatedSupport WARNING adding ShowFileRequestHandler with hidden files: [BAD-SCHEMA-NOT-INDEXED-BUT-TF.XML, SCHEMA-REQUIRED-FIELDS.XML, SOLRCONFIG-MASTER1-KEEPONEBACKUP.XML, BAD-SCHEMA-NONTEXT-ANALYZER.XML, SOLRCONFIG-PROPINJECT.XML, SOLRCONFIG-PROPINJECT-INDEXDEFAULT.XML, STOP-2.TXT, SCHEMA11.XML, BAD-SCHEMA-UNIQUEKEY-USES-DEFAULT.XML, SCHEMA15.XML, SOLRCONFIG-NATIVELOCK.XML, SCHEMA-SIM.XML, CONDITIONAL.UPDATEPROCESSOR.JS, BAD-SOLRCONFIG-MISSING-SCRIPTFILE.XML, SOLRCONFIG-SCRIPT-UPDATEPROCESSOR.XML, SOLRCONFIG-REPEATER.XML, SOLRCONFIG-SPELLCHECKER.XML, SOLRCONFIG-NOCACHE.XML, SCHEMA-CHARFILTERS.XML, SOLRCONFIG-SOLCOREPROPERTIES.XML, SOLRCONFIG_CODEC.XML, BAD-SCHEMA-EXTERNAL-FILEFIELD.XML, HYPHENATION.DTD, SCHEMA.XML, SOLRCONFIG-MERGEPOLICY.XML, TRIVIAL.UPDATEPROCESSOR1.JS, SOLRCONFIG-PHRASESUGGEST.XML, SOLRCONFIG-SLAVE1.XML, SOLRCONFIG-BASIC.XML, SCHEMA-LMJELINEKMERCER.XML, BAD-MP-SOLRCONFIG.XML, BAD-SCHEMA-DUP-FIELD.XML, BAD-SCHEMA-UNIQUEKEY-MULTIVALUED.XML, SOLRCONFIG-MASTER.XML, SOLRCONFIG-HIGHLIGHT.XML, SCHEMA-TFIDF.XML, SCHEMA-REPLICATION1.XML, SYNONYMS.TXT, SOLRCONFIG-ELEVATE.XML, STOPWITHBOM.TXT, SOLRCONFIG-QUERYSENDER.XML, WDFTYPES.TXT, SOLRCONFIG-DELPOLICY1.XML, BAD_SOLRCONFIG.XML, HUNSPELL-TEST.DIC, SCHEMA-NUMERIC.XML, SCHEMA-LUCENEMATCHVERSION.XML, KEEP-2.TXT, SCHEMA-STOP-KEEP.XML, SCHEMA-IB.XML, STOP-SNOWBALL.TXT, SOLRCONFIG-SLAVE.XML, BAD-SCHEMA-NOT-INDEXED-BUT-NORMS.XML, STOPWORDSWRONGENCODING.TXT, THROW.ERROR.ON.ADD.UPDATEPROCESSOR.JS, SOLRCONFIG-SPELLCHECKCOMPONENT.XML, STOPTYPES-1.TXT, SOLRCONFIG-TLOG.XML, COMPOUNDDICTIONARY.TXT, DA_COMPOUNDDICTIONARY.TXT, SOLRCONFIG-TERMINDEX.XML, BAD-SOLRCONFIG-INVALID-SCRIPTFILE.XML, SCHEMASURROUND.XML, OPEN-EXCHANGE-RATES.JSON, BAD-SCHEMA-DUP-FIELDTYPE.XML, PHRASESUGGEST.TXT, BAD-SCHEMA-CURRENCY-FT-MULTIVALUED.XML, SOLRCONFIG-MASTER2.XML, OLD_SYNONYMS.TXT, BAD-SCHEMA-UNIQUEKEY-IS-COPYFIELD-DEST.XML, SCHEMA-NOT-REQUIRED-UNIQUE-KEY.XML, BAD-SCHEMA-CODEC-GLOBAL-VS-FT-MISMATCH.XML, SCHEMA-LMDIRICHLET.XML, SCHEMA-REVERSED.XML, BAD-SCHEMA-NOT-INDEXED-BUT-POS.XML, BAD-SCHEMA-CURRENCY-MULTIVALUED.XML, SCHEMA-FOLDING.XML, SOLRCONFIG-CACHING.XML, MAPPING-ISOLATIN1ACCENT.TXT, ADDFIELDS.UPDATEPROCESSOR.JS, SCHEMA-BM25.XML, STOP-1.TXT, SOLRCONFIG-ENABLEPLUGIN.XML, MISSING.FUNCTIONS.UPDATEPROCESSOR.JS, SCHEMA12.XML, SOLRCONFIG-TRANSFORMERS.XML, SCHEMA-COPYFIELD-TEST.XML, BAD-SCHEMA-DUP-DYNAMICFIELD.XML, CURRENCY.XML, DA_UTF8.XML, MISSLEADING.EXTENSION.UPDATEPROCESSOR.JS.TXT, SOLRCONFIG-SOLR-749.XML, STOPWORDS.TXT, HUNSPELL-TEST.AFF, SOLRCONFIG_PERF.XML, SOLRCONFIG-SIMPLELOCK.XML, FRENCHARTICLES.TXT, SOLRCONFIG-LAZYWRITER.XML, SOLRCONFIG-RESPONSE-LOG-COMPONENT.XML, SCHEMA-REPLICATION2.XML, SCHEMA-SPATIAL.XML, SOLRCONFIG-XINCLUDE.XML, SCHEMA-SPELLCHECKER.XML, XSLT, SOLRCONFIG-DELPOLICY2.XML, TRIVIAL.UPDATEPROCESSOR0.JS, KEEP-1.TXT, BAD-SCHEMA-CURRENCY-DYNAMIC-MULTIVALUED.XML, SCHEMA-TRIE.XML, SCHEMA-BINARYFIELD.XML, BAD-SCHEMA-OMIT-TF-BUT-NOT-POS.XML, SCHEMA-MINIMAL.XML, STOPTYPES-2.TXT, SCHEMA_CODEC.XML, STEMDICT.TXT, ELEVATE.XML, SCHEMA-COLLATE.XML, PROTWORDS.TXT, SOLRCONFIG-REQHANDLER.INCL, SCHEMA-PHRASESUGGEST.XML, SCHEMA-DFR.XML, BAD-SCHEMA-ANALYZER-CLASS-AND-NESTED.XML, SOLRCONFIG-MASTER1.XML, SOLRCONFIG-FUNCTIONQUERY.XML, SOLRCONFIG-MASTER3.XML, SOLRCONFIG-UPDATE-PROCESSOR-CHAINS.XML, SOLRCONFIG-ALTDIRECTORY.XML, BAD-SCHEMA-SIM-GLOBAL-VS-FT-MISMATCH.XML, SOLRCONFIG-QUERYSENDER-NOQUERY.XML, BAD-SOLRCONFIG-BOGUS-SCRIPTENGINE-NAME.XML]
[junit4:junit4]   2> 31643 T2540 oass.SolrIndexSearcher.<init> Opening Searcher@50ec66fb main
[junit4:junit4]   2> 31643 T2540 oass.SolrIndexSearcher.getIndexDir WARNING WARNING: Directory impl does not support setting indexDir: org.apache.lucene.store.MockDirectoryWrapper
[junit4:junit4]   2> 31644 T2540 oasu.CommitTracker.<init> Hard AutoCommit: disabled
[junit4:junit4]   2> 31645 T2540 oasu.CommitTracker.<init> Soft AutoCommit: disabled
[junit4:junit4]   2> 31645 T2540 oashc.SpellCheckComponent.inform Initializing spell checkers
[junit4:junit4]   2> 31649 T2540 oass.DirectSolrSpellChecker.init init: {name=direct,classname=DirectSolrSpellChecker,field=lowerfilt,minQueryLength=3}
[junit4:junit4]   2> 31667 T2540 oashc.HttpShardHandlerFactory.getParameter Setting socketTimeout to: 0
[junit4:junit4]   2> 31668 T2540 oashc.HttpShardHandlerFactory.getParameter Setting urlScheme to: http://
[junit4:junit4]   2> 31668 T2540 oashc.HttpShardHandlerFactory.getParameter Setting connTimeout to: 0
[junit4:junit4]   2> 31669 T2540 oashc.HttpShardHandlerFactory.getParameter Setting maxConnectionsPerHost to: 20
[junit4:junit4]   2> 31670 T2540 oashc.HttpShardHandlerFactory.getParameter Setting corePoolSize to: 0
[junit4:junit4]   2> 31670 T2540 oashc.HttpShardHandlerFactory.getParameter Setting maximumPoolSize to: 2147483647
[junit4:junit4]   2> 31670 T2540 oashc.HttpShardHandlerFactory.getParameter Setting maxThreadIdleTime to: 5
[junit4:junit4]   2> 31671 T2540 oashc.HttpShardHandlerFactory.getParameter Setting sizeOfQueue to: -1
[junit4:junit4]   2> 31672 T2540 oashc.HttpShardHandlerFactory.getParameter Setting fairnessPolicy to: false
[junit4:junit4]   2> 31672 T2540 oascsi.HttpClientUtil.createClient Creating new http client, config:maxConnectionsPerHost=20&maxConnections=10000&socketTimeout=0&connTimeout=0&retry=false
[junit4:junit4]   2> 31679 T2541 oasc.SolrCore.registerSearcher [collection1] Registered new searcher Searcher@50ec66fb main{StandardDirectoryReader(segments_1:1)}
[junit4:junit4]   2> 31683 T2540 oasc.CoreContainer.register registering core: collection1
[junit4:junit4]   2> 31685 T2540 oasu.AbstractSolrTestCase.setUp ####SETUP_END testMaxTime
[junit4:junit4]   2> 31689 T2540 oasc.SolrDeletionPolicy.onInit SolrDeletionPolicy.onInit: commits:num=1
[junit4:junit4]   2> 		commit{dir=MockDirWrapper(org.apache.lucene.store.RAMDirectory@cadf1256 lockFactory=org.apache.lucene.store.NativeFSLockFactory@89227a10),segFN=segments_1,generation=1,filenames=[segments_1]
[junit4:junit4]   2> 31690 T2540 oasc.SolrDeletionPolicy.updateCommits newest commit = 1
[junit4:junit4]   2> 31692 T2540 UPDATE [collection1] {add=[529]} 0 5
[junit4:junit4]   2> 32692 T2542 oasu.DirectUpdateHandler2.commit start commit{flags=0,_version_=0,optimize=false,openSearcher=true,waitSearcher=true,expungeDeletes=false,softCommit=true}
[junit4:junit4]   2> 32695 T2542 oass.SolrIndexSearcher.<init> Opening Searcher@e04776d0 main
[junit4:junit4]   2> 32696 T2542 oass.SolrIndexSearcher.getIndexDir WARNING WARNING: Directory impl does not support setting indexDir: org.apache.lucene.store.MockDirectoryWrapper
[junit4:junit4]   2> 32696 T2542 oasu.DirectUpdateHandler2.commit end_commit_flush
[junit4:junit4]   2> 32697 T2541 oasc.SolrCore.registerSearcher [collection1] Registered new searcher Searcher@e04776d0 main{StandardDirectoryReader(segments_1:3:nrt _0(5.0):C1)}
[junit4:junit4]   2> ASYNC  NEW_CORE C166 name=collection1 org.apache.solr.core.SolrCore@c67de969
[junit4:junit4]   2> 32849 T2540 C166 REQ [collection1] webapp=null path=null params={q=id:529&start=0&qt=standard&version=2.2&rows=20} hits=1 status=0 QTime=1156 
[junit4:junit4]   2> 32882 T2540 oasu.AbstractSolrTestCase.tearDown ####TEARDOWN_START testMaxTime
[junit4:junit4]   2> 32883 T2540 oasc.CoreContainer.shutdown Shutting down CoreContainer instance=-1107132806
[junit4:junit4]   2> 32883 T2540 oasc.SolrCore.close [collection1]  CLOSING SolrCore org.apache.solr.core.SolrCore@c67de969
[junit4:junit4]   2> 32889 T2540 oasc.SolrCore.closeSearcher [collection1] Closing main searcher on request.
[junit4:junit4]   2> 32890 T2540 oasu.DirectUpdateHandler2.close closing DirectUpdateHandler2{commits=1,autocommits=0,soft autocommit maxTime=1000ms,soft autocommits=1,optimizes=0,rollbacks=0,expungeDeletes=0,docsPending=1,adds=0,deletesById=0,deletesByQuery=0,errors=0,cumulative_adds=1,cumulative_deletesById=0,cumulative_deletesByQuery=0,cumulative_errors=0}
[junit4:junit4]   2> 32890 T2540 oasu.DefaultSolrCoreState.decref SolrCoreState ref count has reached 0 - closing IndexWriter
[junit4:junit4]   2> 32891 T2540 C166 oasc.SolrDeletionPolicy.onCommit SolrDeletionPolicy.onCommit: commits:num=2
[junit4:junit4]   2> 		commit{dir=MockDirWrapper(org.apache.lucene.store.RAMDirectory@cadf1256 lockFactory=org.apache.lucene.store.NativeFSLockFactory@89227a10),segFN=segments_1,generation=1,filenames=[segments_1]
[junit4:junit4]   2> 		commit{dir=MockDirWrapper(org.apache.lucene.store.RAMDirectory@cadf1256 lockFactory=org.apache.lucene.store.NativeFSLockFactory@89227a10),segFN=segments_2,generation=2,filenames=[_0_8.len, _0.fld, _0_9.len, _0.si, segments_2, _0.pst, _0.inf, _0_1.len, _0_3.len, _0_4.len, _0_5.len, _0_6.len]
[junit4:junit4]   2> 32891 T2540 C166 oasc.SolrDeletionPolicy.updateCommits newest commit = 2
[junit4:junit4]   2> 32894 T2540 oasu.DefaultSolrCoreState.decref Closing SolrCoreState - canceling any ongoing recovery
[junit4:junit4]   2> NOTE: reproduce with: ant test  -Dtestcase=AutoCommitTest -Dtests.method=testMaxTime -Dtests.seed=A7875CB818AC1E -Dtests.multiplier=3 -Dtests.slow=true -Dtests.locale=en_ZA -Dtests.timezone=Pacific/Guadalcanal -Dtests.file.encoding=ISO-8859-1
[junit4:junit4] FAILURE 1.68s J1 | AutoCommitTest.testMaxTime <<<
[junit4:junit4]    > Throwable #1: java.lang.AssertionError: shouldn't find any query failed XPath: //result[@numFound=0]
[junit4:junit4]    >  xml response was: <?xml version="1.0" encoding="UTF-8"?>
[junit4:junit4]    > <response>
[junit4:junit4]    > <lst name="responseHeader"><int name="status">0</int><int name="QTime">1156</int></lst><result name="response" numFound="1" start="0"><doc><int name="id">529</int><int name="range_facet_si">529</int><arr name="range_facet_l"><long>529</long></arr><arr name="range_facet_sl"><long>529</long></arr><arr name="field_t"><str>what's inside?</str></arr><arr name="subject"><str>info</str></arr><int name="intDefault">42</int><date name="timestamp">2012-09-17T21:51:44.78Z</date><arr name="multiDefault"><str>muLti-Default</str></arr></doc></result>
[junit4:junit4]    > </response>
[junit4:junit4]    > 
[junit4:junit4]    >  request was: q=id:529&start=0&qt=standard&version=2.2&rows=20
[junit4:junit4]    > 	at __randomizedtesting.SeedInfo.seed([A7875CB818AC1E:9A53FABE26823022]:0)
[junit4:junit4]    > 	at org.junit.Assert.fail(Assert.java:93)
[junit4:junit4]    > 	at org.apache.solr.util.AbstractSolrTestCase.assertQ(AbstractSolrTestCase.java:276)
[junit4:junit4]    > 	at org.apache.solr.update.AutoCommitTest.testMaxTime(AutoCommitTest.java:217)
[junit4:junit4]    > 	at sun.reflect.NativeMethodAccessorImpl.invoke0(Native Method)
[junit4:junit4]    > 	at sun.reflect.NativeMethodAccessorImpl.invoke(NativeMethodAccessorImpl.java:88)
[junit4:junit4]    > 	at sun.reflect.DelegatingMethodAccessorImpl.invoke(DelegatingMethodAccessorImpl.java:55)
[junit4:junit4]    > 	at java.lang.reflect.Method.invoke(Method.java:613)
[junit4:junit4]    > 	at com.carrotsearch.randomizedtesting.RandomizedRunner.invoke(RandomizedRunner.java:1559)
[junit4:junit4]    > 	at com.carrotsearch.randomizedtesting.RandomizedRunner.access$600(RandomizedRunner.java:79)
[junit4:junit4]    > 	at com.carrotsearch.randomizedtesting.RandomizedRunner$6.evaluate(RandomizedRunner.java:737)
[junit4:junit4]    > 	at com.carrotsearch.randomizedtesting.RandomizedRunner$7.evaluate(RandomizedRunner.java:773)
[junit4:junit4]    > 	at com.carrotsearch.randomizedtesting.RandomizedRunner$8.evaluate(RandomizedRunner.java:787)
[junit4:junit4]    > 	at com.carrotsearch.randomizedtesting.rules.SystemPropertiesRestoreRule$1.evaluate(SystemPropertiesRestoreRule.java:53)
[junit4:junit4]    > 	at org.apache.lucene.util.TestRuleSetupTeardownChained$1.evaluate(TestRuleSetupTeardownChained.java:50)
[junit4:junit4]    > 	at org.apache.lucene.util.TestRuleFieldCacheSanity$1.evaluate(TestRuleFieldCacheSanity.java:51)
[junit4:junit4]    > 	at org.apache.lucene.util.AbstractBeforeAfterRule$1.evaluate(AbstractBeforeAfterRule.java:45)
[junit4:junit4]    > 	at com.carrotsearch.randomizedtesting.rules.SystemPropertiesInvariantRule$1.evaluate(SystemPropertiesInvariantRule.java:55)
[junit4:junit4]    > 	at org.apache.lucene.util.TestRuleThreadAndTestName$1.evaluate(TestRuleThreadAndTestName.java:48)
[junit4:junit4]    > 	at org.apache.lucene.util.TestRuleIgnoreAfterMaxFailures$1.evaluate(TestRuleIgnoreAfterMaxFailures.java:70)
[junit4:junit4]    > 	at org.apache.lucene.util.TestRuleMarkFailure$1.evaluate(TestRuleMarkFailure.java:48)
[junit4:junit4]    > 	at com.carrotsearch.randomizedtesting.rules.StatementAdapter.evaluate(StatementAdapter.java:36)
[junit4:junit4]    > 	at com.carrotsearch.randomizedtesting.ThreadLeakControl$StatementRunner.run(ThreadLeakControl.java:358)
[junit4:junit4]    > 	at com.carrotsearch.randomizedtesting.ThreadLeakControl.forkTimeoutingTask(ThreadLeakControl.java:782)
[junit4:junit4]    > 	at com.carrotsearch.randomizedtesting.ThreadLeakControl$3.evaluate(ThreadLeakControl.java:442)
[junit4:junit4]    > 	at com.carrotsearch.randomizedtesting.RandomizedRunner.runSingleTest(RandomizedRunner.java:746)
[junit4:junit4]    > 	at com.carrotsearch.randomizedtesting.RandomizedRunner$3.evaluate(RandomizedRunner.java:648)
[junit4:junit4]    > 	at com.carrotsearch.randomizedtesting.RandomizedRunner$4.evaluate(RandomizedRunner.java:682)
[junit4:junit4]    > 	at com.carrotsearch.randomizedtesting.RandomizedRunner$5.evaluate(RandomizedRunner.java:693)
[junit4:junit4]    > 	at com.carrotsearch.randomizedtesting.rules.StatementAdapter.evaluate(StatementAdapter.java:36)
[junit4:junit4]    > 	at com.carrotsearch.randomizedtesting.rules.SystemPropertiesRestoreRule$1.evaluate(SystemPropertiesRestoreRule.java:53)
[junit4:junit4]    > 	at org.apache.lucene.util.AbstractBeforeAfterRule$1.evaluate(AbstractBeforeAfterRule.java:45)
[junit4:junit4]    > 	at org.apache.lucene.util.TestRuleStoreClassName$1.evaluate(TestRuleStoreClassName.java:42)
[junit4:junit4]    > 	at com.carrotsearch.randomizedtesting.rules.SystemPropertiesInvariantRule$1.evaluate(SystemPropertiesInvariantRule.java:55)
[junit4:junit4]    > 	at com.carrotsearch.randomizedtesting.rules.NoShadowingOrOverridesOnMethodsRule$1.evaluate(NoShadowingOrOverridesOnMethodsRule.java:39)
[junit4:junit4]    > 	at com.carrotsearch.randomizedtesting.rules.NoShadowingOrOverridesOnMethodsRule$1.evaluate(NoShadowingOrOverridesOnMethodsRule.java:39)
[junit4:junit4]    > 	at com.carrotsearch.randomizedtesting.rules.StatementAdapter.evaluate(StatementAdapter.java:36)
[junit4:junit4]    > 	at org.apache.lucene.util.TestRuleAssertionsRequired$1.evaluate(TestRuleAssertionsRequired.java:43)
[junit4:junit4]    > 	at org.apache.lucene.util.TestRuleMarkFailure$1.evaluate(TestRuleMarkFailure.java:48)
[junit4:junit4]    > 	at org.apache.lucene.util.TestRuleIgnoreAfterMaxFailures$1.evaluate(TestRuleIgnoreAfterMaxFailures.java:70)
[junit4:junit4]    > 	at org.apache.lucene.util.TestRuleIgnoreTestSuites$1.evaluate(TestRuleIgnoreTestSuites.java:55)
[junit4:junit4]    > 	at com.carrotsearch.randomizedtesting.rules.StatementAdapter.evaluate(StatementAdapter.java:36)
[junit4:junit4]    > 	at com.carrotsearch.randomizedtesting.ThreadLeakControl$StatementRunner.run(ThreadLeakControl.java:358)
[junit4:junit4]    > 	at java.lang.Thread.run(Thread.java:777)
[junit4:junit4]   2> 32910 T2540 oasu.AbstractSolrTestCase.setUp ####SETUP_START testMaxDocs
[junit4:junit4]   2> 32911 T2540 oasc.SolrResourceLoader.<init> new SolrResourceLoader for directory: '/mnt/ssd/jenkins/workspace/Lucene-Solr-trunk-Linux/solr/build/solr-core/test-files/solr/collection1/'
[junit4:junit4]   2> 32912 T2540 oasc.SolrResourceLoader.replaceClassLoader Adding 'file:/mnt/ssd/jenkins/workspace/Lucene-Solr-trunk-Linux/solr/build/solr-core/test-files/solr/collection1/lib/README' to classloader
[junit4:junit4]   2> 32912 T2540 oasc.SolrResourceLoader.replaceClassLoader Adding 'file:/mnt/ssd/jenkins/workspace/Lucene-Solr-trunk-Linux/solr/build/solr-core/test-files/solr/collection1/lib/classes/' to classloader
[junit4:junit4]   2> 32939 T2540 oasc.SolrConfig.<init> Using Lucene MatchVersion: LUCENE_50
[junit4:junit4]   2> 32975 T2540 oasc.SolrConfig.<init> Loaded SolrConfig: solrconfig.xml
[junit4:junit4]   2> 32976 T2540 oass.IndexSchema.readSchema Reading Solr Schema
[junit4:junit4]   2> 32980 T2540 oass.IndexSchema.readSchema Schema name=test
[junit4:junit4]   2> 33278 T2540 oass.OpenExchangeRatesOrgProvider.init Initialized with rates=open-exchange-rates.json, refreshInterval=1440.
[junit4:junit4]   2> 33282 T2540 oass.IndexSchema.readSchema default search field in schema is text
[junit4:junit4]   2> 33285 T2540 oass.IndexSchema.readSchema unique key field: id
[junit4:junit4]   2> 33289 T2540 oass.FileExchangeRateProvider.reload Reloading exchange rates from file currency.xml
[junit4:junit4]   2> 33292 T2540 oass.FileExchangeRateProvider.reload Reloading exchange rates from file currency.xml
[junit4:junit4]   2> 33295 T2540 oass.OpenExchangeRatesOrgProvider.reload Reloading exchange rates from open-exchange-rates.json
[junit4:junit4]   2> 33296 T2540 oass.OpenExchangeRatesOrgProvider.reload Reloading exchange rates from open-exchange-rates.json
[junit4:junit4]   2> 33297 T2540 oasc.SolrResourceLoader.locateSolrHome JNDI not configured for solr (NoInitialContextEx)
[junit4:junit4]   2> 33297 T2540 oasc.SolrResourceLoader.locateSolrHome using system property solr.solr.home: /mnt/ssd/jenkins/workspace/Lucene-Solr-trunk-Linux/solr/build/solr-core/test-files/solr
[junit4:junit4]   2> 33298 T2540 oasc.SolrResourceLoader.<init> new SolrResourceLoader for directory: '/mnt/ssd/jenkins/workspace/Lucene-Solr-trunk-Linux/solr/build/solr-core/test-files/solr/'
[junit4:junit4]   2> 33303 T2540 oasc.CoreContainer.<init> New CoreContainer 29977691
[junit4:junit4]   2> 33303 T2540 oasc.SolrCore.<init> [collection1] Opening new SolrCore at /mnt/ssd/jenkins/workspace/Lucene-Solr-trunk-Linux/solr/build/solr-core/test-files/solr/collection1/, dataDir=/mnt/ssd/jenkins/workspace/Lucene-Solr-trunk-Linux/solr/build/solr-core/test/J1/./org.apache.solr.update.AutoCommitTest-1347918705999/
[junit4:junit4]   2> 33304 T2540 oasc.JmxMonitoredMap.<init> JMX monitoring is enabled. Adding Solr mbeans to JMX Server: com.sun.jmx.mbeanserver.JmxMBeanServer@a5dc1215
[junit4:junit4]   2> 33305 T2540 oasc.SolrCore.getNewIndexDir WARNING New index directory detected: old=null new=/mnt/ssd/jenkins/workspace/Lucene-Solr-trunk-Linux/solr/build/solr-core/test/J1/./org.apache.solr.update.AutoCommitTest-1347918705999/index/
[junit4:junit4]   2> 33305 T2540 oasc.SolrCore.initIndex WARNING [collection1] Solr index directory '/mnt/ssd/jenkins/workspace/Lucene-Solr-trunk-Linux/solr/build/solr-core/test/J1/./org.apache.solr.update.AutoCommitTest-1347918705999/index' doesn't exist. Creating new index...
[junit4:junit4]   2> 33306 T2540 oasc.CachingDirectoryFactory.get return new directory for /mnt/ssd/jenkins/workspace/Lucene-Solr-trunk-Linux/solr/build/solr-core/test/J1/./org.apache.solr.update.AutoCommitTest-1347918705999/index forceNew:false
[junit4:junit4]   2> 33307 T2540 oasc.SolrDeletionPolicy.onCommit SolrDeletionPolicy.onCommit: commits:num=1
[junit4:junit4]   2> 		commit{dir=MockDirWrapper(org.apache.lucene.store.RAMDirectory@16565129 lockFactory=org.apache.lucene.store.NativeFSLockFactory@6066f5e7),segFN=segments_1,generation=1,filenames=[segments_1]
[junit4:junit4]   2> 33308 T2540 oasc.SolrDeletionPolicy.updateCommits newest commit = 1
[junit4:junit4]   2> 33308 T2540 oasc.SolrCore.initWriters created xml: solr.XMLResponseWriter
[junit4:junit4]   2> 33310 T2540 oasup.UpdateRequestProcessorChain.init inserting DistributedUpdateProcessorFactory into updateRequestProcessorChain "dedupe"
[junit4:junit4]   2> 33310 T2540 oasup.UpdateRequestProcessorChain.init inserting DistributedUpdateProcessorFactory into updateRequestProcessorChain "dedupe-allfields"
[junit4:junit4]   2> 33311 T2540 oasup.UpdateRequestProcessorChain.init inserting DistributedUpdateProcessorFactory into updateRequestProcessorChain "stored_sig"
[junit4:junit4]   2> 33311 T2540 oasup.UpdateRequestProcessorChain.init inserting DistributedUpdateProcessorFactory into updateRequestProcessorChain "uniq-fields"
[junit4:junit4]   2> 33312 T2540 oasup.UpdateRequestProcessorChain.init inserting DistributedUpdateProcessorFactory into updateRequestProcessorChain "distrib-dup-test-chain-implicit"
[junit4:junit4]   2> 33312 T2540 oasc.RequestHandlers.initHandlersFromConfig adding lazy requestHandler: solr.ReplicationHandler
[junit4:junit4]   2> 33313 T2540 oasc.RequestHandlers.initHandlersFromConfig created /replication: solr.ReplicationHandler
[junit4:junit4]   2> 33313 T2540 oasc.RequestHandlers.initHandlersFromConfig created standard: solr.StandardRequestHandler
[junit4:junit4]   2> 33314 T2540 oasc.RequestHandlers.initHandlersFromConfig created /get: solr.RealTimeGetHandler
[junit4:junit4]   2> 33315 T2540 oasc.RequestHandlers.initHandlersFromConfig created dismax: solr.SearchHandler
[junit4:junit4]   2> 33315 T2540 oasc.RequestHandlers.initHandlersFromConfig created mock: org.apache.solr.core.MockQuerySenderListenerReqHandler
[junit4:junit4]   2> 33316 T2540 oasc.RequestHandlers.initHandlersFromConfig created /admin/: org.apache.solr.handler.admin.AdminHandlers
[junit4:junit4]   2> 33316 T2540 oasc.RequestHandlers.initHandlersFromConfig created defaults: solr.StandardRequestHandler
[junit4:junit4]   2> 33317 T2540 oasc.RequestHandlers.initHandlersFromConfig adding lazy requestHandler: solr.StandardRequestHandler
[junit4:junit4]   2> 33317 T2540 oasc.RequestHandlers.initHandlersFromConfig created lazy: solr.StandardRequestHandler
[junit4:junit4]   2> 33318 T2540 oasc.RequestHandlers.initHandlersFromConfig created /update: solr.UpdateRequestHandler
[junit4:junit4]   2> 33318 T2540 oasc.RequestHandlers.initHandlersFromConfig created /terms: org.apache.solr.handler.component.SearchHandler
[junit4:junit4]   2> 33319 T2540 oasc.RequestHandlers.initHandlersFromConfig created spellCheckCompRH: org.apache.solr.handler.component.SearchHandler
[junit4:junit4]   2> 33319 T2540 oasc.RequestHandlers.initHandlersFromConfig created spellCheckCompRH_Direct: org.apache.solr.handler.component.SearchHandler
[junit4:junit4]   2> 33320 T2540 oasc.RequestHandlers.initHandlersFromConfig created spellCheckWithWordbreak: org.apache.solr.handler.component.SearchHandler
[junit4:junit4]   2> 33321 T2540 oasc.RequestHandlers.initHandlersFromConfig created spellCheckWithWordbreak_Direct: org.apache.solr.handler.component.SearchHandler
[junit4:junit4]   2> 33321 T2540 oasc.RequestHandlers.initHandlersFromConfig created spellCheckCompRH1: org.apache.solr.handler.component.SearchHandler
[junit4:junit4]   2> 33322 T2540 oasc.RequestHandlers.initHandlersFromConfig created tvrh: org.apache.solr.handler.component.SearchHandler
[junit4:junit4]   2> 33322 T2540 oasc.RequestHandlers.initHandlersFromConfig created /mlt: solr.MoreLikeThisHandler
[junit4:junit4]   2> 33323 T2540 oasc.RequestHandlers.initHandlersFromConfig created /debug/dump: solr.DumpRequestHandler
[junit4:junit4]   2> 33324 T2540 oashl.XMLLoader.init xsltCacheLifetimeSeconds=60
[junit4:junit4]   2> 33325 T2540 oasc.SolrCore.initDeprecatedSupport WARNING solrconfig.xml uses deprecated <admin/gettableFiles>, Please update your config to use the ShowFileRequestHandler.
[junit4:junit4]   2> 33326 T2540 oasc.SolrCore.initDeprecatedSupport WARNING adding ShowFileRequestHandler with hidden files: [BAD-SCHEMA-NOT-INDEXED-BUT-TF.XML, SCHEMA-REQUIRED-FIELDS.XML, SOLRCONFIG-MASTER1-KEEPONEBACKUP.XML, BAD-SCHEMA-NONTEXT-ANALYZER.XML, SOLRCONFIG-PROPINJECT.XML, SOLRCONFIG-PROPINJECT-INDEXDEFAULT.XML, STOP-2.TXT, SCHEMA11.XML, BAD-SCHEMA-UNIQUEKEY-USES-DEFAULT.XML, SCHEMA15.XML, SOLRCONFIG-NATIVELOCK.XML, SCHEMA-SIM.XML, CONDITIONAL.UPDATEPROCESSOR.JS, BAD-SOLRCONFIG-MISSING-SCRIPTFILE.XML, SOLRCONFIG-SCRIPT-UPDATEPROCESSOR.XML, SOLRCONFIG-REPEATER.XML, SOLRCONFIG-SPELLCHECKER.XML, SOLRCONFIG-NOCACHE.XML, SCHEMA-CHARFILTERS.XML, SOLRCONFIG-SOLCOREPROPERTIES.XML, SOLRCONFIG_CODEC.XML, BAD-SCHEMA-EXTERNAL-FILEFIELD.XML, HYPHENATION.DTD, SCHEMA.XML, SOLRCONFIG-MERGEPOLICY.XML, TRIVIAL.UPDATEPROCESSOR1.JS, SOLRCONFIG-PHRASESUGGEST.XML, SOLRCONFIG-SLAVE1.XML, SOLRCONFIG-BASIC.XML, SCHEMA-LMJELINEKMERCER.XML, BAD-MP-SOLRCONFIG.XML, BAD-SCHEMA-DUP-FIELD.XML, BAD-SCHEMA-UNIQUEKEY-MULTIVALUED.XML, SOLRCONFIG-MASTER.XML, SOLRCONFIG-HIGHLIGHT.XML, SCHEMA-TFIDF.XML, SCHEMA-REPLICATION1.XML, SYNONYMS.TXT, SOLRCONFIG-ELEVATE.XML, STOPWITHBOM.TXT, SOLRCONFIG-QUERYSENDER.XML, WDFTYPES.TXT, SOLRCONFIG-DELPOLICY1.XML, BAD_SOLRCONFIG.XML, HUNSPELL-TEST.DIC, SCHEMA-NUMERIC.XML, SCHEMA-LUCENEMATCHVERSION.XML, KEEP-2.TXT, SCHEMA-STOP-KEEP.XML, SCHEMA-IB.XML, STOP-SNOWBALL.TXT, SOLRCONFIG-SLAVE.XML, BAD-SCHEMA-NOT-INDEXED-BUT-NORMS.XML, STOPWORDSWRONGENCODING.TXT, THROW.ERROR.ON.ADD.UPDATEPROCESSOR.JS, SOLRCONFIG-SPELLCHECKCOMPONENT.XML, STOPTYPES-1.TXT, SOLRCONFIG-TLOG.XML, COMPOUNDDICTIONARY.TXT, DA_COMPOUNDDICTIONARY.TXT, SOLRCONFIG-TERMINDEX.XML, BAD-SOLRCONFIG-INVALID-SCRIPTFILE.XML, SCHEMASURROUND.XML, OPEN-EXCHANGE-RATES.JSON, BAD-SCHEMA-DUP-FIELDTYPE.XML, PHRASESUGGEST.TXT, BAD-SCHEMA-CURRENCY-FT-MULTIVALUED.XML, SOLRCONFIG-MASTER2.XML, OLD_SYNONYMS.TXT, BAD-SCHEMA-UNIQUEKEY-IS-COPYFIELD-DEST.XML, SCHEMA-NOT-REQUIRED-UNIQUE-KEY.XML, BAD-SCHEMA-CODEC-GLOBAL-VS-FT-MISMATCH.XML, SCHEMA-LMDIRICHLET.XML, SCHEMA-REVERSED.XML, BAD-SCHEMA-NOT-INDEXED-BUT-POS.XML, BAD-SCHEMA-CURRENCY-MULTIVALUED.XML, SCHEMA-FOLDING.XML, SOLRCONFIG-CACHING.XML, MAPPING-ISOLATIN1ACCENT.TXT, ADDFIELDS.UPDATEPROCESSOR.JS, SCHEMA-BM25.XML, STOP-1.TXT, SOLRCONFIG-ENABLEPLUGIN.XML, MISSING.FUNCTIONS.UPDATEPROCESSOR.JS, SCHEMA12.XML, SOLRCONFIG-TRANSFORMERS.XML, SCHEMA-COPYFIELD-TEST.XML, BAD-SCHEMA-DUP-DYNAMICFIELD.XML, CURRENCY.XML, DA_UTF8.XML, MISSLEADING.EXTENSION.UPDATEPROCESSOR.JS.TXT, SOLRCONFIG-SOLR-749.XML, STOPWORDS.TXT, HUNSPELL-TEST.AFF, SOLRCONFIG_PERF.XML, SOLRCONFIG-SIMPLELOCK.XML, FRENCHARTICLES.TXT, SOLRCONFIG-LAZYWRITER.XML, SOLRCONFIG-RESPONSE-LOG-COMPONENT.XML, SCHEMA-REPLICATION2.XML, SCHEMA-SPATIAL.XML, SOLRCONFIG-XINCLUDE.XML, SCHEMA-SPELLCHECKER.XML, XSLT, SOLRCONFIG-DELPOLICY2.XML, TRIVIAL.UPDATEPROCESSOR0.JS, KEEP-1.TXT, BAD-SCHEMA-CURRENCY-DYNAMIC-MULTIVALUED.XML, SCHEMA-TRIE.XML, SCHEMA-BINARYFIELD.XML, BAD-SCHEMA-OMIT-TF-BUT-NOT-POS.XML, SCHEMA-MINIMAL.XML, STOPTYPES-2.TXT, SCHEMA_CODEC.XML, STEMDICT.TXT, ELEVATE.XML, SCHEMA-COLLATE.XML, PROTWORDS.TXT, SOLRCONFIG-REQHANDLER.INCL, SCHEMA-PHRASESUGGEST.XML, SCHEMA-DFR.XML, BAD-SCHEMA-ANALYZER-CLASS-AND-NESTED.XML, SOLRCONFIG-MASTER1.XML, SOLRCONFIG-FUNCTIONQUERY.XML, SOLRCONFIG-MASTER3.XML, SOLRCONFIG-UPDATE-PROCESSOR-CHAINS.XML, SOLRCONFIG-ALTDIRECTORY.XML, BAD-SCHEMA-SIM-GLOBAL-VS-FT-MISMATCH.XML, SOLRCONFIG-QUERYSENDER-NOQUERY.XML, BAD-SOLRCONFIG-BOGUS-SCRIPTENGINE-NAME.XML]
[junit4:junit4]   2> 33328 T2540 oass.SolrIndexSearcher.<init> Opening Searcher@a4d23623 main
[junit4:junit4]   2> 33328 T2540 oass.SolrIndexSearcher.getIndexDir WARNING WARNING: Directory impl does not support setting indexDir: org.apache.lucene.store.MockDirectoryWrapper
[junit4:junit4]   2> 33329 T2540 oasu.CommitTracker.<init> Hard AutoCommit: disabled
[junit4:junit4]   2> 33329 T2540 oasu.CommitTracker.<init> Soft AutoCommit: disabled
[junit4:junit4]   2> 33330 T2540 oashc.SpellCheckComponent.inform Initializing spell checkers
[junit4:junit4]   2> 33618 T2540 oass.DirectSolrSpellChecker.init init: {name=direct,classname=DirectSolrSpellChecker,field=lowerfilt,minQueryLength=3}
[junit4:junit4]   2> 33632 T2540 oashc.HttpShardHandlerFactory.getParameter Setting socketTimeout to: 0
[junit4:junit4]   2> 33633 T2540 oashc.HttpShardHandlerFactory.getParameter Setting urlScheme to: http://
[junit4:junit4]   2> 33633 T2540 oashc.HttpShardHandlerFactory.getParameter Setting connTimeout to: 0
[junit4:junit4]   2> 33634 T2540 oashc.HttpShardHandlerFactory.getParameter Setting maxConnectionsPerHost to: 20
[junit4:junit4]   2> 33634 T2540 oashc.HttpShardHandlerFactory.getParameter Setting corePoolSize to: 0
[junit4:junit4]   2> 33635 T2540 oashc.HttpShardHandlerFactory.getParameter Setting maximumPoolSize to: 2147483647
[junit4:junit4]   2> 33635 T2540 oashc.HttpShardHandlerFactory.getParameter Setting maxThreadIdleTime to: 5
[junit4:junit4]   2> 33636 T2540 oashc.HttpShardHandlerFactory.getParameter Setting sizeOfQueue to: -1
[junit4:junit4]   2> 33636 T2540 oashc.HttpShardHandlerFactory.getParameter Setting fairnessPolicy to: false
[junit4:junit4]   2> 33637 T2540 oascsi.HttpClientUtil.createClient Creating new http client, config:maxConnectionsPerHost=20&maxConnections=10000&socketTimeout=0&connTimeout=0&retry=false
[junit4:junit4]   2> 33643 T2543 oasc.SolrCore.registerSearcher [collection1] Registered new searcher Searcher@a4d23623 main{StandardDirectoryReader(segments_1:1)}
[junit4:junit4]   2> 33645 T2540 oasc.CoreContainer.register registering core: collection1
[junit4:junit4]   2> 33646 T2540 oasu.AbstractSolrTestCase.setUp ####SETUP_END testMaxDocs
[junit4:junit4]   2> 33647 T2540 oasc.SolrDeletionPolicy.onInit SolrDeletionPolicy.onInit: commits:num=1
[junit4:junit4]   2> 		commit{dir=MockDirWrapper(org.apache.lucene.store.RAMDirectory@16565129 lockFactory=org.apache.lucene.store.NativeFSLockFactory@6066f5e7),segFN=segments_1,generation=1,filenames=[segments_1]
[junit4:junit4]   2> 33648 T2540 oasc.SolrDeletionPolicy.updateCommits newest commit = 1
[junit4:junit4]   2> 33649 T2540 UPDATE [collection1] {add=[0]} 0 2
[junit4:junit4]   2> 33650 T2540 UPDATE [collection1] {add=[1]} 0 2
[junit4:junit4]   2> 33651 T2540 UPDATE [collection1] {add=[2]} 0 2
[junit4:junit4]   2> 33651 T2540 UPDATE [collection1] {add=[3]} 0 2
[junit4:junit4]   2> 33652 T2540 UPDATE [collection1] {add=[4]} 0 2
[junit4:junit4]   2> 33653 T2540 UPDATE [collection1] {add=[5]} 0 2
[junit4:junit4]   2> 33654 T2540 UPDATE [collection1] {add=[6]} 0 2
[junit4:junit4]   2> 33654 T2540 UPDATE [collection1] {add=[7]} 0 2
[junit4:junit4]   2> 33655 T2540 UPDATE [collection1] {add=[8]} 0 2
[junit4:junit4]   2> 33657 T2540 UPDATE [collection1] {add=[9]} 0 2
[junit4:junit4]   2> 33658 T2540 UPDATE [collection1] {add=[10]} 0 2
[junit4:junit4]   2> 33659 T2540 UPDATE [collection1] {add=[11]} 0 2
[junit4:junit4]   2> 33660 T2540 UPDATE [collection1] {add=[12]} 0 2
[junit4:junit4]   2> 33660 T2540 UPDATE [collection1] {add=[13]} 0 2
[junit4:junit4]   2> ASYNC  NEW_CORE C167 name=collection1 org.apache.solr.core.SolrCore@152b8ea4
[junit4:junit4]   2> 33661 T2540 C167 REQ [collection1] webapp=null path=null params={q=id:1&start=0&qt=standard&version=2.2&rows=20} hits=0 status=0 QTime=0 
[junit4:junit4]   2> 33665 T2540 UPDATE [collection1] {add=[14]} 0 2
[junit4:junit4]   2> 33666 T2544 oasu.DirectUpdateHandler2.commit start commit{flags=0,_version_=0,optimize=false,openSearcher=true,waitSearcher=true,expungeDeletes=false,softCommit=true}
[junit4:junit4]   2> 33668 T2544 oass.SolrIndexSearcher.<init> Opening Searcher@93d214b2 main
[junit4:junit4]   2> 33669 T2544 oass.SolrIndexSearcher.getIndexDir WARNING WARNING: Directory impl does not support setting indexDir: org.apache.lucene.store.MockDirectoryWrapper
[junit4:junit4]   2> 33669 T2544 oasu.DirectUpdateHandler2.commit end_commit_flush
[junit4:junit4]   2> 33670 T2543 oasc.SolrCore.registerSearcher [collection1] Registered new searcher Searcher@93d214b2 main{StandardDirectoryReader(segments_1:5:nrt _0(5.0):C10 _1(5.0):C5)}
[junit4:junit4]   2> 33916 T2540 UPDATE [collection1] {add=[15]} 0 2
[junit4:junit4]   2> 33917 T2540 C167 REQ [collection1] webapp=null path=null params={q=id:14&start=0&qt=standard&version=2.2&rows=20} hits=1 status=0 QTime=0 
[junit4:junit4]   2> 33918 T2540 C167 REQ [collection1] webapp=null path=null params={q=id:15&start=0&qt=standard&version=2.2&rows=20} hits=0 status=0 QTime=0 
[junit4:junit4]   2> 33920 T2540 oasu.AbstractSolrTestCase.tearDown ####TEARDOWN_START testMaxDocs
[junit4:junit4]   2> 33920 T2540 oasc.CoreContainer.shutdown Shutting down CoreContainer instance=29977691
[junit4:junit4]   2> 33920 T2540 oasc.SolrCore.close [collection1]  CLOSING SolrCore org.apache.solr.core.SolrCore@152b8ea4
[junit4:junit4]   2> 33926 T2540 oasc.SolrCore.closeSearcher [collection1] Closing main searcher on request.
[junit4:junit4]   2> 33927 T2540 oasu.DirectUpdateHandler2.close closing DirectUpdateHandler2{commits=1,autocommits=0,soft autocommit maxDocs=14,soft autocommits=1,optimizes=0,rollbacks=0,expungeDeletes=0,docsPending=16,adds=1,deletesById=0,deletesByQuery=0,errors=0,cumulative_adds=16,cumulative_deletesById=0,cumulative_deletesByQuery=0,cumulative_errors=0}
[junit4:junit4]   2> 33927 T2540 oasu.DefaultSolrCoreState.decref SolrCoreState ref count has reached 0 - closing IndexWriter
[junit4:junit4]   2> 33929 T2540 C167 oasc.SolrDeletionPolicy.onCommit SolrDeletionPolicy.onCommit: commits:num=2
[junit4:junit4]   2> 		commit{dir=MockDirWrapper(org.apache.lucene.store.RAMDirectory@16565129 lockFactory=org.apache.lucene.store.NativeFSLockFactory@6066f5e7),segFN=segments_1,generation=1,filenames=[segments_1]
[junit4:junit4]   2> 		commit{dir=MockDirWrapper(org.apache.lucene.store.RAMDirectory@16565129 lockFactory=org.apache.lucene.store.NativeFSLockFactory@6066f5e7),segFN=segments_2,generation=2,filenames=[_0_1.len, _1_1.len, _0_3.len, _2_1.len, _0_4.len, _1_3.len, _0_5.len, _1_4.len, _2_3.len, _2_4.len, _1_5.len, _2_5.len, _0_7.len, _0_8.len, _1_7.len, _2_7.len, _1_8.len, _1.si, _2_8.len, segments_2, _0.pst, _1.pst, _2.pst, _0.fld, _1.fld, _2.fld, _0.inf, _1.inf, _2.inf, _2.si, _0.si]
[junit4:junit4]   2> 33929 T2540 C167 oasc.SolrDeletionPolicy.updateCommits newest commit = 2
[junit4:junit4]   2> 33935 T2540 oasu.DefaultSolrCoreState.decref Closing SolrCoreState - canceling any ongoing recovery
[junit4:junit4]   2> 33943 T2540 oasu.AbstractSolrTestCase.setUp ####SETUP_START testCommitWithin
[junit4:junit4]   2> 33944 T2540 oasc.SolrResourceLoader.<init> new SolrResourceLoader for directory: '/mnt/ssd/jenkins/workspace/Lucene-Solr-trunk-Linux/solr/build/solr-core/test-files/solr/collection1/'
[junit4:junit4]   2> 33945 T2540 oasc.SolrResourceLoader.replaceClassLoader Adding 'file:/mnt/ssd/jenkins/workspace/Lucene-Solr-trunk-Linux/solr/build/solr-core/test-files/solr/collection1/lib/README' to classloader
[junit4:junit4]   2> 33945 T2540 oasc.SolrResourceLoader.replaceClassLoader Adding 'file:/mnt/ssd/jenkins/workspace/Lucene-Solr-trunk-Linux/solr/build/solr-core/test-files/solr/collection1/lib/classes/' to classloader
[junit4:junit4]   2> 33970 T2540 oasc.SolrConfig.<init> Using Lucene MatchVersion: LUCENE_50
[junit4:junit4]   2> 34006 T2540 oasc.SolrConfig.<init> Loaded SolrConfig: solrconfig.xml
[junit4:junit4]   2> 34006 T2540 oass.IndexSchema.readSchema Reading Solr Schema
[junit4:junit4]   2> 34011 T2540 oass.IndexSchema.readSchema Schema name=test
[junit4:junit4]   2> 34339 T2540 oass.OpenExchangeRatesOrgProvider.init Initialized with rates=open-exchange-rates.json, refreshInterval=1440.
[junit4:junit4]   2> 34344 T2540 oass.IndexSchema.readSchema default search field in schema is text
[junit4:junit4]   2> 34346 T2540 oass.IndexSchema.readSchema unique key field: id
[junit4:junit4]   2> 34350 T2540 oass.FileExchangeRateProvider.reload Reloading exchange rates from file currency.xml
[junit4:junit4]   2> 34354 T2540 oass.FileExchangeRateProvider.reload Reloading exchange rates from file currency.xml
[junit4:junit4]   2> 34357 T2540 oass.OpenExchangeRatesOrgProvider.reload Reloading exchange rates from open-exchange-rates.json
[junit4:junit4]   2> 34358 T2540 oass.OpenExchangeRatesOrgProvider.reload Reloading exchange rates from open-exchange-rates.json
[junit4:junit4]   2> 34358 T2540 oasc.SolrResourceLoader.locateSolrHome JNDI not configured for solr (NoInitialContextEx)
[junit4:junit4]   2> 34359 T2540 oasc.SolrResourceLoader.locateSolrHome using system property solr.solr.home: /mnt/ssd/jenkins/workspace/Lucene-Solr-trunk-Linux/solr/build/solr-core/test-files/solr
[junit4:junit4]   2> 34359 T2540 oasc.SolrResourceLoader.<init> new SolrResourceLoader for directory: '/mnt/ssd/jenkins/workspace/Lucene-Solr-trunk-Linux/solr/build/solr-core/test-files/solr/'
[junit4:junit4]   2> 34364 T2540 oasc.CoreContainer.<init> New CoreContainer -1658227868
[junit4:junit4]   2> 34365 T2540 oasc.SolrCore.<init> [collection1] Opening new SolrCore at /mnt/ssd/jenkins/workspace/Lucene-Solr-trunk-Linux/solr/build/solr-core/test-files/solr/collection1/, dataDir=/mnt/ssd/jenkins/workspace/Lucene-Solr-trunk-Linux/solr/build/solr-core/test/J1/./org.apache.solr.update.AutoCommitTest-1347918707033/
[junit4:junit4]   2> 34366 T2540 oasc.JmxMonitoredMap.<init> JMX monitoring is enabled. Adding Solr mbeans to JMX Server: com.sun.jmx.mbeanserver.JmxMBeanServer@a5dc1215
[junit4:junit4]   2> 34366 T2540 oasc.SolrCore.getNewIndexDir WARNING New index directory detected: old=null new=/mnt/ssd/jenkins/workspace/Lucene-Solr-trunk-Linux/solr/build/solr-core/test/J1/./org.apache.solr.update.AutoCommitTest-1347918707033/index/
[junit4:junit4]   2> 34367 T2540 oasc.SolrCore.initIndex WARNING [collection1] Solr index directory '/mnt/ssd/jenkins/workspace/Lucene-Solr-trunk-Linux/solr/build/solr-core/test/J1/./org.apache.solr.update.AutoCommitTest-1347918707033/index' doesn't exist. Creating new index...
[junit4:junit4]   2> 34368 T2540 oasc.CachingDirectoryFactory.get return new directory for /mnt/ssd/jenkins/workspace/Lucene-Solr-trunk-Linux/solr/build/solr-core/test/J1/./org.apache.solr.update.AutoCommitTest-1347918707033/index forceNew:false
[junit4:junit4]   2> 34369 T2540 oasc.SolrDeletionPolicy.onCommit SolrDeletionPolicy.onCommit: commits:num=1
[junit4:junit4]   2> 		commit{dir=MockDirWrapper(NRTCachingDirectory(org.apache.lucene.store.RAMDirectory@ea13a5b2 lockFactory=org.apache.lucene.store.NativeFSLockFactory@edc537aa; maxCacheMB=0.068359375 maxMergeSizeMB=0.1455078125)),segFN=segments_1,generation=1,filenames=[segments_1]
[junit4:junit4]   2> 34369 T2540 oasc.SolrDeletionPolicy.updateCommits newest commit = 1
[junit4:junit4]   2> 34370 T2540 oasc.SolrCore.initWriters created xml: solr.XMLResponseWriter
[junit4:junit4]   2> 34371 T2540 oasup.UpdateRequestProcessorChain.init inserting DistributedUpdateProcessorFactory into updateRequestProcessorChain "dedupe"
[junit4:junit4]   2> 34372 T2540 oasup.UpdateRequestProcessorChain.init inserting DistributedUpdateProcessorFactory into updateRequestProcessorChain "dedupe-allfields"
[junit4:junit4]   2> 34372 T2540 oasup.UpdateRequestProcessorChain.init inserting DistributedUpdateProcessorFactory into updateRequestProcessorChain "stored_sig"
[junit4:junit4]   2> 34373 T2540 oasup.UpdateRequestProcessorChain.init inserting DistributedUpdateProcessorFactory into updateRequestProcessorChain "uniq-fields"
[junit4:junit4]   2> 34374 T2540 oasup.UpdateRequestProcessorChain.init inserting DistributedUpdateProcessorFactory into updateRequestProcessorChain "distrib-dup-test-chain-implicit"
[junit4:junit4]   2> 34374 T2540 oasc.RequestHandlers.initHandlersFromConfig adding lazy requestHandler: solr.ReplicationHandler
[junit4:junit4]   2> 34375 T2540 oasc.RequestHandlers.initHandlersFromConfig created /replication: solr.ReplicationHandler
[junit4:junit4]   2> 34375 T2540 oasc.RequestHandlers.initHandlersFromConfig created standard: solr.StandardRequestHandler
[junit4:junit4]   2> 34376 T2540 oasc.RequestHandlers.initHandlersFromConfig created /get: solr.RealTimeGetHandler
[junit4:junit4]   2> 34376 T2540 oasc.RequestHandlers.initHandlersFromConfig created dismax: solr.SearchHandler
[junit4:junit4]   2> 34377 T2540 oasc.RequestHandlers.initHandlersFromConfig created mock: org.apache.solr.core.MockQuerySenderListenerReqHandler
[junit4:junit4]   2> 34378 T2540 oasc.RequestHandlers.initHandlersFromConfig created /admin/: org.apache.solr.handler.admin.AdminHandlers
[junit4:junit4]   2> 34378 T2540 oasc.RequestHandlers.initHandlersFromConfig created defaults: solr.StandardRequestHandler
[junit4:junit4]   2> 34379 T2540 oasc.RequestHandlers.initHandlersFromConfig adding lazy requestHandler: solr.StandardRequestHandler
[junit4:junit4]   2> 34379 T2540 oasc.RequestHandlers.initHandlersFromConfig created lazy: solr.StandardRequestHandler
[junit4:junit4]   2> 34380 T2540 oasc.RequestHandlers.initHandlersFromConfig created /update: solr.UpdateRequestHandler
[junit4:junit4]   2> 34380 T2540 oasc.RequestHandlers.initHandlersFromConfig created /terms: org.apache.solr.handler.component.SearchHandler
[junit4:junit4]   2> 34381 T2540 oasc.RequestHandlers.initHandlersFromConfig created spellCheckCompRH: org.apache.solr.handler.component.SearchHandler
[junit4:junit4]   2> 34381 T2540 oasc.RequestHandlers.initHandlersFromConfig created spellCheckCompRH_Direct: org.apache.solr.handler.component.SearchHandler
[junit4:junit4]   2> 34382 T2540 oasc.RequestHandlers.initHandlersFromConfig created spellCheckWithWordbreak: org.apache.solr.handler.component.SearchHandler
[junit4:junit4]   2> 34382 T2540 oasc.RequestHandlers.initHandlersFromConfig created spellCheckWithWordbreak_Direct: org.apache.solr.handler.component.SearchHandler
[junit4:junit4]   2> 34383 T2540 oasc.RequestHandlers.initHandlersFromConfig created spellCheckCompRH1: org.apache.solr.handler.component.SearchHandler
[junit4:junit4]   2> 34383 T2540 oasc.RequestHandlers.initHandlersFromConfig created tvrh: org.apache.solr.handler.component.SearchHandler
[junit4:junit4]   2> 34384 T2540 oasc.RequestHandlers.initHandlersFromConfig created /mlt: solr.MoreLikeThisHandler
[junit4:junit4]   2> 34385 T2540 oasc.RequestHandlers.initHandlersFromConfig created /debug/dump: solr.DumpRequestHandler
[junit4:junit4]   2> 34385 T2540 oashl.XMLLoader.init xsltCacheLifetimeSeconds=60
[junit4:junit4]   2> 34387 T2540 oasc.SolrCore.initDeprecatedSupport WARNING solrconfig.xml uses deprecated <admin/gettableFiles>, Please update your config to use the ShowFileRequestHandler.
[junit4:junit4]   2> 34388 T2540 oasc.SolrCore.initDeprecatedSupport WARNING adding ShowFileRequestHandler with hidden files: [BAD-SCHEMA-NOT-INDEXED-BUT-TF.XML, SCHEMA-REQUIRED-FIELDS.XML, SOLRCONFIG-MASTER1-KEEPONEBACKUP.XML, BAD-SCHEMA-NONTEXT-ANALYZER.XML, SOLRCONFIG-PROPINJECT.XML, SOLRCONFIG-PROPINJECT-INDEXDEFAULT.XML, STOP-2.TXT, SCHEMA11.XML, BAD-SCHEMA-UNIQUEKEY-USES-DEFAULT.XML, SCHEMA15.XML, SOLRCONFIG-NATIVELOCK.XML, SCHEMA-SIM.XML, CONDITIONAL.UPDATEPROCESSOR.JS, BAD-SOLRCONFIG-MISSING-SCRIPTFILE.XML, SOLRCONFIG-SCRIPT-UPDATEPROCESSOR.XML, SOLRCONFIG-REPEATER.XML, SOLRCONFIG-SPELLCHECKER.XML, SOLRCONFIG-NOCACHE.XML, SCHEMA-CHARFILTERS.XML, SOLRCONFIG-SOLCOREPROPERTIES.XML, SOLRCONFIG_CODEC.XML, BAD-SCHEMA-EXTERNAL-FILEFIELD.XML, HYPHENATION.DTD, SCHEMA.XML, SOLRCONFIG-MERGEPOLICY.XML, TRIVIAL.UPDATEPROCESSOR1.JS, SOLRCONFIG-PHRASESUGGEST.XML, SOLRCONFIG-SLAVE1.XML, SOLRCONFIG-BASIC.XML, SCHEMA-LMJELINEKMERCER.XML, BAD-MP-SOLRCONFIG.XML, BAD-SCHEMA-DUP-FIELD.XML, BAD-SCHEMA-UNIQUEKEY-MULTIVALUED.XML, SOLRCONFIG-MASTER.XML, SOLRCONFIG-HIGHLIGHT.XML, SCHEMA-TFIDF.XML, SCHEMA-REPLICATION1.XML, SYNONYMS.TXT, SOLRCONFIG-ELEVATE.XML, STOPWITHBOM.TXT, SOLRCONFIG-QUERYSENDER.XML, WDFTYPES.TXT, SOLRCONFIG-DELPOLICY1.XML, BAD_SOLRCONFIG.XML, HUNSPELL-TEST.DIC, SCHEMA-NUMERIC.XML, SCHEMA-LUCENEMATCHVERSION.XML, KEEP-2.TXT, SCHEMA-STOP-KEEP.XML, SCHEMA-IB.XML, STOP-SNOWBALL.TXT, SOLRCONFIG-SLAVE.XML, BAD-SCHEMA-NOT-INDEXED-BUT-NORMS.XML, STOPWORDSWRONGENCODING.TXT, THROW.ERROR.ON.ADD.UPDATEPROCESSOR.JS, SOLRCONFIG-SPELLCHECKCOMPONENT.XML, STOPTYPES-1.TXT, SOLRCONFIG-TLOG.XML, COMPOUNDDICTIONARY.TXT, DA_COMPOUNDDICTIONARY.TXT, SOLRCONFIG-TERMINDEX.XML, BAD-SOLRCONFIG-INVALID-SCRIPTFILE.XML, SCHEMASURROUND.XML, OPEN-EXCHANGE-RATES.JSON, BAD-SCHEMA-DUP-FIELDTYPE.XML, PHRASESUGGEST.TXT, BAD-SCHEMA-CURRENCY-FT-MULTIVALUED.XML, SOLRCONFIG-MASTER2.XML, OLD_SYNONYMS.TXT, BAD-SCHEMA-UNIQUEKEY-IS-COPYFIELD-DEST.XML, SCHEMA-NOT-REQUIRED-UNIQUE-KEY.XML, BAD-SCHEMA-CODEC-GLOBAL-VS-FT-MISMATCH.XML, SCHEMA-LMDIRICHLET.XML, SCHEMA-REVERSED.XML, BAD-SCHEMA-NOT-INDEXED-BUT-POS.XML, BAD-SCHEMA-CURRENCY-MULTIVALUED.XML, SCHEMA-FOLDING.XML, SOLRCONFIG-CACHING.XML, MAPPING-ISOLATIN1ACCENT.TXT, ADDFIELDS.UPDATEPROCESSOR.JS, SCHEMA-BM25.XML, STOP-1.TXT, SOLRCONFIG-ENABLEPLUGIN.XML, MISSING.FUNCTIONS.UPDATEPROCESSOR.JS, SCHEMA12.XML, SOLRCONFIG-TRANSFORMERS.XML, SCHEMA-COPYFIELD-TEST.XML, BAD-SCHEMA-DUP-DYNAMICFIELD.XML, CURRENCY.XML, DA_UTF8.XML, MISSLEADING.EXTENSION.UPDATEPROCESSOR.JS.TXT, SOLRCONFIG-SOLR-749.XML, STOPWORDS.TXT, HUNSPELL-TEST.AFF, SOLRCONFIG_PERF.XML, SOLRCONFIG-SIMPLELOCK.XML, FRENCHARTICLES.TXT, SOLRCONFIG-LAZYWRITER.XML, SOLRCONFIG-RESPONSE-LOG-COMPONENT.XML, SCHEMA-REPLICATION2.XML, SCHEMA-SPATIAL.XML, SOLRCONFIG-XINCLUDE.XML, SCHEMA-SPELLCHECKER.XML, XSLT, SOLRCONFIG-DELPOLICY2.XML, TRIVIAL.UPDATEPROCESSOR0.JS, KEEP-1.TXT, BAD-SCHEMA-CURRENCY-DYNAMIC-MULTIVALUED.XML, SCHEMA-TRIE.XML, SCHEMA-BINARYFIELD.XML, BAD-SCHEMA-OMIT-TF-BUT-NOT-POS.XML, SCHEMA-MINIMAL.XML, STOPTYPES-2.TXT, SCHEMA_CODEC.XML, STEMDICT.TXT, ELEVATE.XML, SCHEMA-COLLATE.XML, PROTWORDS.TXT, SOLRCONFIG-REQHANDLER.INCL, SCHEMA-PHRASESUGGEST.XML, SCHEMA-DFR.XML, BAD-SCHEMA-ANALYZER-CLASS-AND-NESTED.XML, SOLRCONFIG-MASTER1.XML, SOLRCONFIG-FUNCTIONQUERY.XML, SOLRCONFIG-MASTER3.XML, SOLRCONFIG-UPDATE-PROCESSOR-CHAINS.XML, SOLRCONFIG-ALTDIRECTORY.XML, BAD-SCHEMA-SIM-GLOBAL-VS-FT-MISMATCH.XML, SOLRCONFIG-QUERYSENDER-NOQUERY.XML, BAD-SOLRCONFIG-BOGUS-SCRIPTENGINE-NAME.XML]
[junit4:junit4]   2> 34390 T2540 oass.SolrIndexSearcher.<init> Opening Searcher@ca2b8e11 main
[junit4:junit4]   2> 34390 T2540 oass.SolrIndexSearcher.getIndexDir WARNING WARNING: Directory impl does not support setting indexDir: org.apache.lucene.store.MockDirectoryWrapper
[junit4:junit4]   2> 34391 T2540 oasu.CommitTracker.<init> Hard AutoCommit: disabled
[junit4:junit4]   2> 34391 T2540 oasu.CommitTracker.<init> Soft AutoCommit: disabled
[junit4:junit4]   2> 34392 T2540 oashc.SpellCheckComponent.inform Initializing spell checkers
[junit4:junit4]   2> 34525 T2540 oass.DirectSolrSpellChecker.init init: {name=direct,classname=DirectSolrSpellChecker,field=lowerfilt,minQueryLength=3}
[junit4:junit4]   2> 34541 T2540 oashc.HttpShardHandlerFactory.getParameter Setting socketTimeout to: 0
[junit4:junit4]   2> 34542 T2540 oashc.HttpShardHandlerFactory.getParameter Setting urlScheme to: http://
[junit4:junit4]   2> 34542 T2540 oashc.HttpShardHandlerFactory.getParameter Setting connTimeout to: 0
[junit4:junit4]   2> 34543 T2540 oashc.HttpShardHandlerFactory.getParameter Setting maxConnectionsPerHost to: 20
[junit4:junit4]   2> 34543 T2540 oashc.HttpShardHandlerFactory.getParameter Setting corePoolSize to: 0
[junit4:junit4]   2> 34544 T2540 oashc.HttpShardHandlerFactory.getParameter Setting maximumPoolSize to: 2147483647
[junit4:junit4]   2> 34545 T2540 oashc.HttpShardHandlerFactory.getParameter Setting maxThreadIdleTime to: 5
[junit4:junit4]   2> 34545 T2540 oashc.HttpShardHandlerFactory.getParameter Setting sizeOfQueue to: -1
[junit4:junit4]   2> 34546 T2540 oashc.HttpShardHandlerFactory.getParameter Setting fairnessPolicy to: false
[junit4:junit4]   2> 34546 T2540 oascsi.HttpClientUtil.createClient Creating new http client, config:maxConnectionsPerHost=20&maxConnections=10000&socketTimeout=0&connTimeout=0&retry=false
[junit4:junit4]   2> 34552 T2545 oasc.SolrCore.registerSearcher [collection1] Registered new searcher Searcher@ca2b8e11 main{StandardDirectoryReader(segments_1:1)}
[junit4:junit4]   2> 34553 T2540 oasc.CoreContainer.register registering core: collection1
[junit4:junit4]   2> 34554 T2540 oasu.AbstractSolrTestCase.setUp ####SETUP_END testCommitWithin
[junit4:junit4]   2> 34556 T2540 oasc.SolrDeletionPolicy.onInit SolrDeletionPolicy.onInit: commits:num=1
[junit4:junit4]   2> 		commit{dir=MockDirWrapper(NRTCachingDirectory(org.apache.lucene.store.RAMDirectory@ea13a5b2 lockFactory=org.apache.lucene.store.NativeFSLockFactory@edc537aa; maxCacheMB=0.068359375 maxMergeSizeMB=0.1455078125)),segFN=segments_1,generation=1,filenames=[segments_1]
[junit4:junit4]   2> 34556 T2540 oasc.SolrDeletionPolicy.updateCommits newest commit = 1
[junit4:junit4]   2> 34558 T2540 UPDATE [collection1] {add=[529]} 0 3
[junit4:junit4]   2> ASYNC  NEW_CORE C168 name=collection1 org.apache.solr.core.SolrCore@d7e5b2ff
[junit4:junit4]   2> 34558 T2540 C168 REQ [collection1] webapp=null path=null params={q=id:529&start=0&qt=standard&version=2.2&rows=20} hits=0 status=0 QTime=0 
[junit4:junit4]   2> 35558 T2546 oasu.DirectUpdateHandler2.commit start commit{flags=0,_version_=0,optimize=false,openSearcher=true,waitSearcher=true,expungeDeletes=false,softCommit=true}
[junit4:junit4]   2> 35560 T2546 oass.SolrIndexSearcher.<init> Opening Searcher@758a5376 main
[junit4:junit4]   2> 35560 T2546 oass.SolrIndexSearcher.getIndexDir WARNING WARNING: Directory impl does not support setting indexDir: org.apache.lucene.store.MockDirectoryWrapper
[junit4:junit4]   2> 35561 T2546 oasu.DirectUpdateHandler2.commit end_commit_flush
[junit4:junit4]   2> 35562 T2545 oasc.SolrCore.registerSearcher [collection1] Registered new searcher Searcher@758a5376 main{StandardDirectoryReader(segments_1:3:nrt _0(5.0):C1)}
[junit4:junit4]   2> 35563 T2540 UPDATE [collection1] {add=[530]} 0 3
[junit4:junit4]   2> 35564 T2540 C168 REQ [collection1] webapp=null path=null params={q=id:530&start=0&qt=standard&version=2.2&rows=20} hits=0 status=0 QTime=0 
[junit4:junit4]   2> 35881 T2540 UPDATE [collection1] {delete=[529]} 0 3
[junit4:junit4]   2> 35882 T2540 C168 REQ [collection1] webapp=null path=null params={q=id:529&start=0&qt=standard&version=2.2&rows=20} hits=1 status=0 QTime=0 
[junit4:junit4]   2> 36881 T2546 oasu.DirectUpdateHandler2.commit start commit{flags=0,_version_=0,optimize=false,openSearcher=true,waitSearcher=true,expungeDeletes=false,softCommit=true}
[junit4:junit4]   2> 36883 T2546 oass.SolrIndexSearcher.<init> Opening Searcher@8f81723a main
[junit4:junit4]   2> 36884 T2546 oass.SolrIndexSearcher.getIndexDir WARNING WARNING: Directory impl does not support setting indexDir: org.apache.lucene.store.MockDirectoryWrapper
[junit4:junit4]   2> 36884 T2546 oasu.DirectUpdateHandler2.commit end_commit_flush
[junit4:junit4]   2> 36885 T2545 oasc.SolrCore.registerSearcher [collection1] Registered new searcher Searcher@8f81723a main{StandardDirectoryReader(segments_1:7:nrt _1(5.0):C1)}
[junit4:junit4]   2> 37134 T2540 C168 REQ [collection1] webapp=null path=null params={q=id:529&start=0&qt=standard&version=2.2&rows=20} hits=0 status=0 QTime=0 
[junit4:junit4]   2> 37135 T2540 C168 REQ [collection1] webapp=null path=null params={q=id:530&start=0&qt=standard&version=2.2&rows=20} hits=1 status=0 QTime=0 
[junit4:junit4]   2> 37137 T2540 UPDATE [collection1] {add=[500]} 0 3
[junit4:junit4]   2> 37138 T2540 UPDATE [collection1] {add=[500]} 0 3
[junit4:junit4]   2> 37139 T2540 UPDATE [collection1] {add=[500]} 0 3
[junit4:junit4]   2> 37139 T2540 UPDATE [collection1] {add=[500]} 0 3
[junit4:junit4]   2> 37140 T2540 UPDATE [collection1] {add=[500]} 0 3
[junit4:junit4]   2> 37141 T2540 UPDATE [collection1] {add=[500]} 0 3
[junit4:junit4]   2> 37142 T2540 UPDATE [collection1] {add=[500]} 0 3
[junit4:junit4]   2> 37142 T2540 UPDATE [collection1] {add=[500]} 0 3
[junit4:junit4]   2> 37143 T2540 UPDATE [collection1] {add=[500]} 0 3
[junit4:junit4]   2> 37145 T2540 UPDATE [collection1] {add=[500]} 0 3
[junit4:junit4]   2> 37146 T2540 C168 REQ [collection1] webapp=null path=null params={q=id:500&start=0&qt=standard&version=2.2&rows=20} hits=0 status=0 QTime=0 
[junit4:junit4]   2> 37147 T2540 UPDATE [collection1] {delete=[530]} 0 3
[junit4:junit4]   2> 37147 T2540 UPDATE [collection1] {delete=[530]} 0 3
[junit4:junit4]   2> 37148 T2540 UPDATE [collection1] {delete=[530]} 0 3
[junit4:junit4]   2> 37148 T2540 UPDATE [collection1] {delete=[530]} 0 3
[junit4:junit4]   2> 37149 T2540 UPDATE [collection1] {delete=[530]} 0 3
[junit4:junit4]   2> 37149 T2540 UPDATE [collection1] {delete=[530]} 0 3
[junit4:junit4]   2> 37150 T2540 UPDATE [collection1] {delete=[530]} 0 3
[junit4:junit4]   2> 37150 T2540 UPDATE [collection1] {delete=[530]} 0 3
[junit4:junit4]   2> 37151 T2540 UPDATE [collection1] {delete=[530]} 0 3
[junit4:junit4]   2> 37152 T2540 UPDATE [collection1] {delete=[530]} 0 3
[junit4:junit4]   2> 37152 T2540 C168 REQ [collection1] webapp=null path=null params={q=id:530&start=0&qt=standard&version=2.2&rows=20} hits=1 status=0 QTime=0 
[junit4:junit4]   2> 38137 T2546 oasu.DirectUpdateHandler2.commit start commit{flags=0,_version_=0,optimize=false,openSearcher=true,waitSearcher=true,expungeDeletes=false,softCommit=true}
[junit4:junit4]   2> 38140 T2546 oass.SolrIndexSearcher.<init> Opening Searcher@df6863ca main
[junit4:junit4]   2> 38140 T2546 oass.SolrIndexSearcher.getIndexDir WARNING WARNING: Directory impl does not support setting indexDir: org.apache.lucene.store.MockDirectoryWrapper
[junit4:junit4]   2> 38141 T2546 oasu.DirectUpdateHandler2.commit end_commit_flush
[junit4:junit4]   2> 38142 T2545 oasc.SolrCore.registerSearcher [collection1] Registered new searcher Searcher@df6863ca main{StandardDirectoryReader(segments_1:11:nrt _2(5.0):C10/9)}
[junit4:junit4]   2> 38154 T2540 C168 REQ [collection1] webapp=null path=null params={q=id:500&start=0&qt=standard&version=2.2&rows=20} hits=1 status=0 QTime=0 
[junit4:junit4]   2> 38156 T2540 C168 REQ [collection1] webapp=null path=null params={q=id:530&start=0&qt=standard&version=2.2&rows=20} hits=0 status=0 QTime=0 
[junit4:junit4]   2> 38157 T2540 oasu.AbstractSolrTestCase.tearDown ####TEARDOWN_START testCommitWithin
[junit4:junit4]   2> 38157 T2540 oasc.CoreContainer.shutdown Shutting down CoreContainer instance=-1658227868
[junit4:junit4]   2> 38158 T2540 oasc.SolrCore.close [collection1]  CLOSING SolrCore org.apache.solr.core.SolrCore@d7e5b2ff
[junit4:junit4]   2> 38164 T2540 oasc.SolrCore.closeSearcher [collection1] Closing main searcher on request.
[junit4:junit4]   2> 38165 T2540 oasu.DirectUpdateHandler2.close closing DirectUpdateHandler2{commits=3,autocommits=0,soft autocommits=3,optimizes=0,rollbacks=0,expungeDeletes=0,docsPending=12,adds=0,deletesById=0,deletesByQuery=0,errors=0,cumulative_adds=12,cumulative_deletesById=11,cumulative_deletesByQuery=0,cumulative_errors=0}
[junit4:junit4]   2> 38165 T2540 oasu.DefaultSolrCoreState.decref SolrCoreState ref count has reached 0 - closing IndexWriter
[junit4:junit4]   2> 38166 T2540 C168 oasc.SolrDeletionPolicy.onCommit SolrDeletionPolicy.onCommit: commits:num=2
[junit4:junit4]   2> 		commit{dir=MockDirWrapper(NRTCachingDirectory(org.apache.lucene.store.RAMDirectory@ea13a5b2 lockFactory=org.apache.lucene.store.NativeFSLockFactory@edc537aa; maxCacheMB=0.068359375 maxMergeSizeMB=0.1455078125)),segFN=segments_1,generation=1,filenames=[segments_1]
[junit4:junit4]   2> 		commit{dir=MockDirWrapper(NRTCachingDirectory(org.apache.lucene.store.RAMDirectory@ea13a5b2 lockFactory=org.apache.lucene.store.NativeFSLockFactory@edc537aa; maxCacheMB=0.068359375 maxMergeSizeMB=0.1455078125)),segFN=segments_2,generation=2,filenames=[_2_1.liv, _2.si, _2.fld, _2_8.len, segments_2, _2_9.len, _2.pst, _2.inf, _2_1.len, _2_3.len]
[junit4:junit4]   2> 38167 T2540 C168 oasc.SolrDeletionPolicy.updateCommits newest commit = 2
[junit4:junit4]   2> 38171 T2540 oasu.DefaultSolrCoreState.decref Closing SolrCoreState - canceling any ongoing recovery
[junit4:junit4]   2> NOTE: test params are: codec=SimpleText, sim=RandomSimilarityProvider(queryNorm=true,coord=yes): {}, locale=en_ZA, timezone=Pacific/Guadalcanal
[junit4:junit4]   2> NOTE: Linux 3.2.0-30-generic x86/IBM Corporation 1.7.0 (32-bit)/cpus=8,threads=1,free=71739752,total=217448448
[junit4:junit4]   2> NOTE: All tests run in this JVM: [PrimitiveFieldTypeTest, TestFoldingMultitermQuery, TermVectorComponentTest, RecoveryZkTest, TestMergePolicyConfig, TestUpdate, SpellingQueryConverterTest, TestFunctionQuery, SuggesterTSTTest, EchoParamsTest, SuggesterTest, HighlighterTest, BasicDistributedZk2Test, PeerSyncTest, DebugComponentTest, TestReload, SolrIndexConfigTest, TestRTGBase, TestWriterPerf, TestTrie, TestFastWriter, LeaderElectionTest, TestSolrXMLSerializer, FileUtilsTest, TestDFRSimilarityFactory, ZkNodePropsTest, TestRemoteStreaming, TestMultiCoreConfBootstrap, TestRecovery, LukeRequestHandlerTest, SolrCoreTest, RAMDirectoryFactoryTest, TestCSVLoader, RequiredFieldsTest, TestReplicationHandler, TestOmitPositions, URLClassifyProcessorTest, TestArbitraryIndexDir, ConvertedLegacyTest, TestJmxIntegration, TestSolrDeletionPolicy1, UpdateParamsTest, TestSolr4Spatial, TimeZoneUtilsTest, TestSurroundQueryParser, TestStressLucene, TestValueSourceCache, FieldMutatingUpdateProcessorTest, DOMUtilTest, QueryParsingTest, TestBM25SimilarityFactory, DocumentAnalysisRequestHandlerTest, UUIDFieldTest, SimplePostToolTest, TestDistributedGrouping, TestSolrCoreProperties, TestSort, OverseerTest, FullSolrCloudDistribCmdsTest, LeaderElectionIntegrationTest, DistributedSpellCheckComponentTest, TestRealTimeGet, TestRandomFaceting, TestDistributedSearch, TestExtendedDismaxParser, SoftAutoCommitTest, AutoCommitTest]
[junit4:junit4] Completed on J1 in 6.97s, 3 tests, 1 failure <<< FAILURES!

[...truncated 328 lines...]
BUILD FAILED
/mnt/ssd/jenkins/workspace/Lucene-Solr-trunk-Linux/build.xml:32: The following error occurred while executing this line:
/mnt/ssd/jenkins/workspace/Lucene-Solr-trunk-Linux/solr/build.xml:146: The following error occurred while executing this line:
/mnt/ssd/jenkins/workspace/Lucene-Solr-trunk-Linux/lucene/module-build.xml:63: The following error occurred while executing this line:
/mnt/ssd/jenkins/workspace/Lucene-Solr-trunk-Linux/lucene/common-build.xml:1133: The following error occurred while executing this line:
/mnt/ssd/jenkins/workspace/Lucene-Solr-trunk-Linux/lucene/common-build.xml:810: There were test failures: 230 suites, 950 tests, 1 failure, 7 ignored (2 assumptions)

Total time: 25 minutes 29 seconds
Build step 'Invoke Ant' marked build as failure
Recording test results
Description set: Java: 32bit/ibm-j9-jdk7 -Xjit:exclude={org/apache/lucene/util/fst/FST.pack(IIF)Lorg/apache/lucene/util/fst/FST;}
Email was triggered for: Failure
Sending email for trigger: Failure



Mime
View raw message