lucene-dev mailing list archives

Site index · List index
Message view « Date » · « Thread »
Top « Date » · « Thread »
From Apache Jenkins Server <jenk...@builds.apache.org>
Subject [JENKINS] Lucene-Solr-Tests-trunk-java7 - Build # 3236 - Still Failing
Date Fri, 21 Sep 2012 01:32:39 GMT
Build: https://builds.apache.org/job/Lucene-Solr-Tests-trunk-java7/3236/

3 tests failed.
REGRESSION:  org.apache.solr.cloud.BasicDistributedZkTest.testDistribSearch

Error Message:
some core start times did not change on reload

Stack Trace:
java.lang.AssertionError: some core start times did not change on reload
	at __randomizedtesting.SeedInfo.seed([14E1828DB8B45C70:95070C95CFEB3C4C]:0)
	at org.junit.Assert.fail(Assert.java:93)
	at org.junit.Assert.assertTrue(Assert.java:43)
	at org.apache.solr.cloud.BasicDistributedZkTest.testCollectionsAPI(BasicDistributedZkTest.java:442)
	at org.apache.solr.cloud.BasicDistributedZkTest.doTest(BasicDistributedZkTest.java:331)
	at org.apache.solr.BaseDistributedSearchTestCase.testDistribSearch(BaseDistributedSearchTestCase.java:695)
	at sun.reflect.NativeMethodAccessorImpl.invoke0(Native Method)
	at sun.reflect.NativeMethodAccessorImpl.invoke(NativeMethodAccessorImpl.java:57)
	at sun.reflect.DelegatingMethodAccessorImpl.invoke(DelegatingMethodAccessorImpl.java:43)
	at java.lang.reflect.Method.invoke(Method.java:601)
	at com.carrotsearch.randomizedtesting.RandomizedRunner.invoke(RandomizedRunner.java:1559)
	at com.carrotsearch.randomizedtesting.RandomizedRunner.access$600(RandomizedRunner.java:79)
	at com.carrotsearch.randomizedtesting.RandomizedRunner$6.evaluate(RandomizedRunner.java:737)
	at com.carrotsearch.randomizedtesting.RandomizedRunner$7.evaluate(RandomizedRunner.java:773)
	at com.carrotsearch.randomizedtesting.RandomizedRunner$8.evaluate(RandomizedRunner.java:787)
	at com.carrotsearch.randomizedtesting.rules.SystemPropertiesRestoreRule$1.evaluate(SystemPropertiesRestoreRule.java:53)
	at org.apache.lucene.util.TestRuleSetupTeardownChained$1.evaluate(TestRuleSetupTeardownChained.java:50)
	at org.apache.lucene.util.TestRuleFieldCacheSanity$1.evaluate(TestRuleFieldCacheSanity.java:51)
	at org.apache.lucene.util.AbstractBeforeAfterRule$1.evaluate(AbstractBeforeAfterRule.java:45)
	at com.carrotsearch.randomizedtesting.rules.SystemPropertiesInvariantRule$1.evaluate(SystemPropertiesInvariantRule.java:55)
	at org.apache.lucene.util.TestRuleThreadAndTestName$1.evaluate(TestRuleThreadAndTestName.java:48)
	at org.apache.lucene.util.TestRuleIgnoreAfterMaxFailures$1.evaluate(TestRuleIgnoreAfterMaxFailures.java:70)
	at org.apache.lucene.util.TestRuleMarkFailure$1.evaluate(TestRuleMarkFailure.java:48)
	at com.carrotsearch.randomizedtesting.rules.StatementAdapter.evaluate(StatementAdapter.java:36)
	at com.carrotsearch.randomizedtesting.ThreadLeakControl$StatementRunner.run(ThreadLeakControl.java:358)
	at com.carrotsearch.randomizedtesting.ThreadLeakControl.forkTimeoutingTask(ThreadLeakControl.java:782)
	at com.carrotsearch.randomizedtesting.ThreadLeakControl$3.evaluate(ThreadLeakControl.java:442)
	at com.carrotsearch.randomizedtesting.RandomizedRunner.runSingleTest(RandomizedRunner.java:746)
	at com.carrotsearch.randomizedtesting.RandomizedRunner$3.evaluate(RandomizedRunner.java:648)
	at com.carrotsearch.randomizedtesting.RandomizedRunner$4.evaluate(RandomizedRunner.java:682)
	at com.carrotsearch.randomizedtesting.RandomizedRunner$5.evaluate(RandomizedRunner.java:693)
	at com.carrotsearch.randomizedtesting.rules.StatementAdapter.evaluate(StatementAdapter.java:36)
	at com.carrotsearch.randomizedtesting.rules.SystemPropertiesRestoreRule$1.evaluate(SystemPropertiesRestoreRule.java:53)
	at org.apache.lucene.util.AbstractBeforeAfterRule$1.evaluate(AbstractBeforeAfterRule.java:45)
	at org.apache.lucene.util.TestRuleStoreClassName$1.evaluate(TestRuleStoreClassName.java:42)
	at com.carrotsearch.randomizedtesting.rules.SystemPropertiesInvariantRule$1.evaluate(SystemPropertiesInvariantRule.java:55)
	at com.carrotsearch.randomizedtesting.rules.NoShadowingOrOverridesOnMethodsRule$1.evaluate(NoShadowingOrOverridesOnMethodsRule.java:39)
	at com.carrotsearch.randomizedtesting.rules.NoShadowingOrOverridesOnMethodsRule$1.evaluate(NoShadowingOrOverridesOnMethodsRule.java:39)
	at com.carrotsearch.randomizedtesting.rules.StatementAdapter.evaluate(StatementAdapter.java:36)
	at org.apache.lucene.util.TestRuleAssertionsRequired$1.evaluate(TestRuleAssertionsRequired.java:43)
	at org.apache.lucene.util.TestRuleMarkFailure$1.evaluate(TestRuleMarkFailure.java:48)
	at org.apache.lucene.util.TestRuleIgnoreAfterMaxFailures$1.evaluate(TestRuleIgnoreAfterMaxFailures.java:70)
	at org.apache.lucene.util.TestRuleIgnoreTestSuites$1.evaluate(TestRuleIgnoreTestSuites.java:55)
	at com.carrotsearch.randomizedtesting.rules.StatementAdapter.evaluate(StatementAdapter.java:36)
	at com.carrotsearch.randomizedtesting.ThreadLeakControl$StatementRunner.run(ThreadLeakControl.java:358)
	at java.lang.Thread.run(Thread.java:722)


REGRESSION:  org.apache.solr.cloud.SyncSliceTest.testDistribSearch

Error Message:
There are still nodes recoverying

Stack Trace:
java.lang.AssertionError: There are still nodes recoverying
	at __randomizedtesting.SeedInfo.seed([14E1828DB8B45C70:95070C95CFEB3C4C]:0)
	at org.junit.Assert.fail(Assert.java:93)
	at org.apache.solr.cloud.AbstractDistribZkTestBase.waitForRecoveriesToFinish(AbstractDistribZkTestBase.java:154)
	at org.apache.solr.cloud.AbstractFullDistribZkTestBase.waitForRecoveriesToFinish(AbstractFullDistribZkTestBase.java:560)
	at org.apache.solr.cloud.AbstractFullDistribZkTestBase.waitForThingsToLevelOut(AbstractFullDistribZkTestBase.java:1135)
	at org.apache.solr.cloud.SyncSliceTest.doTest(SyncSliceTest.java:162)
	at org.apache.solr.BaseDistributedSearchTestCase.testDistribSearch(BaseDistributedSearchTestCase.java:695)
	at sun.reflect.NativeMethodAccessorImpl.invoke0(Native Method)
	at sun.reflect.NativeMethodAccessorImpl.invoke(NativeMethodAccessorImpl.java:57)
	at sun.reflect.DelegatingMethodAccessorImpl.invoke(DelegatingMethodAccessorImpl.java:43)
	at java.lang.reflect.Method.invoke(Method.java:601)
	at com.carrotsearch.randomizedtesting.RandomizedRunner.invoke(RandomizedRunner.java:1559)
	at com.carrotsearch.randomizedtesting.RandomizedRunner.access$600(RandomizedRunner.java:79)
	at com.carrotsearch.randomizedtesting.RandomizedRunner$6.evaluate(RandomizedRunner.java:737)
	at com.carrotsearch.randomizedtesting.RandomizedRunner$7.evaluate(RandomizedRunner.java:773)
	at com.carrotsearch.randomizedtesting.RandomizedRunner$8.evaluate(RandomizedRunner.java:787)
	at com.carrotsearch.randomizedtesting.rules.SystemPropertiesRestoreRule$1.evaluate(SystemPropertiesRestoreRule.java:53)
	at org.apache.lucene.util.TestRuleSetupTeardownChained$1.evaluate(TestRuleSetupTeardownChained.java:50)
	at org.apache.lucene.util.TestRuleFieldCacheSanity$1.evaluate(TestRuleFieldCacheSanity.java:51)
	at org.apache.lucene.util.AbstractBeforeAfterRule$1.evaluate(AbstractBeforeAfterRule.java:45)
	at com.carrotsearch.randomizedtesting.rules.SystemPropertiesInvariantRule$1.evaluate(SystemPropertiesInvariantRule.java:55)
	at org.apache.lucene.util.TestRuleThreadAndTestName$1.evaluate(TestRuleThreadAndTestName.java:48)
	at org.apache.lucene.util.TestRuleIgnoreAfterMaxFailures$1.evaluate(TestRuleIgnoreAfterMaxFailures.java:70)
	at org.apache.lucene.util.TestRuleMarkFailure$1.evaluate(TestRuleMarkFailure.java:48)
	at com.carrotsearch.randomizedtesting.rules.StatementAdapter.evaluate(StatementAdapter.java:36)
	at com.carrotsearch.randomizedtesting.ThreadLeakControl$StatementRunner.run(ThreadLeakControl.java:358)
	at com.carrotsearch.randomizedtesting.ThreadLeakControl.forkTimeoutingTask(ThreadLeakControl.java:782)
	at com.carrotsearch.randomizedtesting.ThreadLeakControl$3.evaluate(ThreadLeakControl.java:442)
	at com.carrotsearch.randomizedtesting.RandomizedRunner.runSingleTest(RandomizedRunner.java:746)
	at com.carrotsearch.randomizedtesting.RandomizedRunner$3.evaluate(RandomizedRunner.java:648)
	at com.carrotsearch.randomizedtesting.RandomizedRunner$4.evaluate(RandomizedRunner.java:682)
	at com.carrotsearch.randomizedtesting.RandomizedRunner$5.evaluate(RandomizedRunner.java:693)
	at com.carrotsearch.randomizedtesting.rules.StatementAdapter.evaluate(StatementAdapter.java:36)
	at com.carrotsearch.randomizedtesting.rules.SystemPropertiesRestoreRule$1.evaluate(SystemPropertiesRestoreRule.java:53)
	at org.apache.lucene.util.AbstractBeforeAfterRule$1.evaluate(AbstractBeforeAfterRule.java:45)
	at org.apache.lucene.util.TestRuleStoreClassName$1.evaluate(TestRuleStoreClassName.java:42)
	at com.carrotsearch.randomizedtesting.rules.SystemPropertiesInvariantRule$1.evaluate(SystemPropertiesInvariantRule.java:55)
	at com.carrotsearch.randomizedtesting.rules.NoShadowingOrOverridesOnMethodsRule$1.evaluate(NoShadowingOrOverridesOnMethodsRule.java:39)
	at com.carrotsearch.randomizedtesting.rules.NoShadowingOrOverridesOnMethodsRule$1.evaluate(NoShadowingOrOverridesOnMethodsRule.java:39)
	at com.carrotsearch.randomizedtesting.rules.StatementAdapter.evaluate(StatementAdapter.java:36)
	at org.apache.lucene.util.TestRuleAssertionsRequired$1.evaluate(TestRuleAssertionsRequired.java:43)
	at org.apache.lucene.util.TestRuleMarkFailure$1.evaluate(TestRuleMarkFailure.java:48)
	at org.apache.lucene.util.TestRuleIgnoreAfterMaxFailures$1.evaluate(TestRuleIgnoreAfterMaxFailures.java:70)
	at org.apache.lucene.util.TestRuleIgnoreTestSuites$1.evaluate(TestRuleIgnoreTestSuites.java:55)
	at com.carrotsearch.randomizedtesting.rules.StatementAdapter.evaluate(StatementAdapter.java:36)
	at com.carrotsearch.randomizedtesting.ThreadLeakControl$StatementRunner.run(ThreadLeakControl.java:358)
	at java.lang.Thread.run(Thread.java:722)


FAILED:  org.apache.solr.cloud.BasicDistributedZk2Test.testDistribSearch

Error Message:
Shard still reported as live in zk

Stack Trace:
java.lang.AssertionError: Shard still reported as live in zk
	at __randomizedtesting.SeedInfo.seed([14E1828DB8B45C70:95070C95CFEB3C4C]:0)
	at org.junit.Assert.fail(Assert.java:93)
	at org.apache.solr.cloud.AbstractFullDistribZkTestBase.waitToSeeNotLive(AbstractFullDistribZkTestBase.java:1220)
	at org.apache.solr.cloud.BasicDistributedZk2Test.brindDownShardIndexSomeDocsAndRecover(BasicDistributedZk2Test.java:190)
	at org.apache.solr.cloud.BasicDistributedZk2Test.doTest(BasicDistributedZk2Test.java:83)
	at org.apache.solr.BaseDistributedSearchTestCase.testDistribSearch(BaseDistributedSearchTestCase.java:695)
	at sun.reflect.NativeMethodAccessorImpl.invoke0(Native Method)
	at sun.reflect.NativeMethodAccessorImpl.invoke(NativeMethodAccessorImpl.java:57)
	at sun.reflect.DelegatingMethodAccessorImpl.invoke(DelegatingMethodAccessorImpl.java:43)
	at java.lang.reflect.Method.invoke(Method.java:601)
	at com.carrotsearch.randomizedtesting.RandomizedRunner.invoke(RandomizedRunner.java:1559)
	at com.carrotsearch.randomizedtesting.RandomizedRunner.access$600(RandomizedRunner.java:79)
	at com.carrotsearch.randomizedtesting.RandomizedRunner$6.evaluate(RandomizedRunner.java:737)
	at com.carrotsearch.randomizedtesting.RandomizedRunner$7.evaluate(RandomizedRunner.java:773)
	at com.carrotsearch.randomizedtesting.RandomizedRunner$8.evaluate(RandomizedRunner.java:787)
	at com.carrotsearch.randomizedtesting.rules.SystemPropertiesRestoreRule$1.evaluate(SystemPropertiesRestoreRule.java:53)
	at org.apache.lucene.util.TestRuleSetupTeardownChained$1.evaluate(TestRuleSetupTeardownChained.java:50)
	at org.apache.lucene.util.TestRuleFieldCacheSanity$1.evaluate(TestRuleFieldCacheSanity.java:51)
	at org.apache.lucene.util.AbstractBeforeAfterRule$1.evaluate(AbstractBeforeAfterRule.java:45)
	at com.carrotsearch.randomizedtesting.rules.SystemPropertiesInvariantRule$1.evaluate(SystemPropertiesInvariantRule.java:55)
	at org.apache.lucene.util.TestRuleThreadAndTestName$1.evaluate(TestRuleThreadAndTestName.java:48)
	at org.apache.lucene.util.TestRuleIgnoreAfterMaxFailures$1.evaluate(TestRuleIgnoreAfterMaxFailures.java:70)
	at org.apache.lucene.util.TestRuleMarkFailure$1.evaluate(TestRuleMarkFailure.java:48)
	at com.carrotsearch.randomizedtesting.rules.StatementAdapter.evaluate(StatementAdapter.java:36)
	at com.carrotsearch.randomizedtesting.ThreadLeakControl$StatementRunner.run(ThreadLeakControl.java:358)
	at com.carrotsearch.randomizedtesting.ThreadLeakControl.forkTimeoutingTask(ThreadLeakControl.java:782)
	at com.carrotsearch.randomizedtesting.ThreadLeakControl$3.evaluate(ThreadLeakControl.java:442)
	at com.carrotsearch.randomizedtesting.RandomizedRunner.runSingleTest(RandomizedRunner.java:746)
	at com.carrotsearch.randomizedtesting.RandomizedRunner$3.evaluate(RandomizedRunner.java:648)
	at com.carrotsearch.randomizedtesting.RandomizedRunner$4.evaluate(RandomizedRunner.java:682)
	at com.carrotsearch.randomizedtesting.RandomizedRunner$5.evaluate(RandomizedRunner.java:693)
	at com.carrotsearch.randomizedtesting.rules.StatementAdapter.evaluate(StatementAdapter.java:36)
	at com.carrotsearch.randomizedtesting.rules.SystemPropertiesRestoreRule$1.evaluate(SystemPropertiesRestoreRule.java:53)
	at org.apache.lucene.util.AbstractBeforeAfterRule$1.evaluate(AbstractBeforeAfterRule.java:45)
	at org.apache.lucene.util.TestRuleStoreClassName$1.evaluate(TestRuleStoreClassName.java:42)
	at com.carrotsearch.randomizedtesting.rules.SystemPropertiesInvariantRule$1.evaluate(SystemPropertiesInvariantRule.java:55)
	at com.carrotsearch.randomizedtesting.rules.NoShadowingOrOverridesOnMethodsRule$1.evaluate(NoShadowingOrOverridesOnMethodsRule.java:39)
	at com.carrotsearch.randomizedtesting.rules.NoShadowingOrOverridesOnMethodsRule$1.evaluate(NoShadowingOrOverridesOnMethodsRule.java:39)
	at com.carrotsearch.randomizedtesting.rules.StatementAdapter.evaluate(StatementAdapter.java:36)
	at org.apache.lucene.util.TestRuleAssertionsRequired$1.evaluate(TestRuleAssertionsRequired.java:43)
	at org.apache.lucene.util.TestRuleMarkFailure$1.evaluate(TestRuleMarkFailure.java:48)
	at org.apache.lucene.util.TestRuleIgnoreAfterMaxFailures$1.evaluate(TestRuleIgnoreAfterMaxFailures.java:70)
	at org.apache.lucene.util.TestRuleIgnoreTestSuites$1.evaluate(TestRuleIgnoreTestSuites.java:55)
	at com.carrotsearch.randomizedtesting.rules.StatementAdapter.evaluate(StatementAdapter.java:36)
	at com.carrotsearch.randomizedtesting.ThreadLeakControl$StatementRunner.run(ThreadLeakControl.java:358)
	at java.lang.Thread.run(Thread.java:722)




Build Log:
[...truncated 7772 lines...]
[junit4:junit4] Suite: org.apache.solr.cloud.BasicDistributedZk2Test
[junit4:junit4]   2> 14 T14 oas.SolrTestCaseJ4.setUp ###Starting testDistribSearch
[junit4:junit4]   2> Creating dataDir: /usr/home/hudson/hudson-slave/workspace/Lucene-Solr-Tests-trunk-java7/solr/build/solr-core/test/J1/./solrtest-BasicDistributedZk2Test-1348190255652
[junit4:junit4]   2> 25 T14 oasc.ZkTestServer.run STARTING ZK TEST SERVER
[junit4:junit4]   2> 122 T15 oaz.Environment.logEnv Server environment:zookeeper.version=3.3.6-1366786, built on 07/29/2012 06:22 GMT
[junit4:junit4]   2> 123 T15 oaz.Environment.logEnv Server environment:host.name=lucene.zones.apache.org
[junit4:junit4]   2> 123 T15 oaz.Environment.logEnv Server environment:java.version=1.7.0_06
[junit4:junit4]   2> 123 T15 oaz.Environment.logEnv Server environment:java.vendor=Oracle Corporation
[junit4:junit4]   2> 124 T15 oaz.Environment.logEnv Server environment:java.home=/usr/local/openjdk7/jre
[junit4:junit4]   2> 124 T15 oaz.Environment.logEnv Server environment:java.class.path=/usr/home/hudson/hudson-slave/workspace/Lucene-Solr-Tests-trunk-java7/solr/build/solr-core/classes/test:/usr/home/hudson/hudson-slave/workspace/Lucene-Solr-Tests-trunk-java7/solr/build/solr-test-framework/classes/java:/usr/home/hudson/hudson-slave/workspace/Lucene-Solr-Tests-trunk-java7/solr/build/solr-core/test-files:/usr/home/hudson/hudson-slave/workspace/Lucene-Solr-Tests-trunk-java7/lucene/build/codecs/classes/java:/usr/home/hudson/hudson-slave/workspace/Lucene-Solr-Tests-trunk-java7/lucene/build/test-framework/classes/java:/usr/home/hudson/hudson-slave/workspace/Lucene-Solr-Tests-trunk-java7/solr/build/solr-solrj/classes/java:/usr/home/hudson/hudson-slave/workspace/Lucene-Solr-Tests-trunk-java7/solr/build/solr-core/classes/java:/usr/home/hudson/hudson-slave/workspace/Lucene-Solr-Tests-trunk-java7/lucene/build/analysis/common/lucene-analyzers-common-5.0-SNAPSHOT.jar:/usr/home/hudson/hudson-slave/workspace/Lucene-Solr-Tests-trunk-java7/lucene/build/analysis/kuromoji/lucene-analyzers-kuromoji-5.0-SNAPSHOT.jar:/usr/home/hudson/hudson-slave/workspace/Lucene-Solr-Tests-trunk-java7/lucene/build/analysis/phonetic/lucene-analyzers-phonetic-5.0-SNAPSHOT.jar:/usr/home/hudson/hudson-slave/workspace/Lucene-Solr-Tests-trunk-java7/lucene/build/highlighter/lucene-highlighter-5.0-SNAPSHOT.jar:/usr/home/hudson/hudson-slave/workspace/Lucene-Solr-Tests-trunk-java7/lucene/build/memory/lucene-memory-5.0-SNAPSHOT.jar:/usr/home/hudson/hudson-slave/workspace/Lucene-Solr-Tests-trunk-java7/lucene/build/misc/lucene-misc-5.0-SNAPSHOT.jar:/usr/home/hudson/hudson-slave/workspace/Lucene-Solr-Tests-trunk-java7/lucene/build/spatial/lucene-spatial-5.0-SNAPSHOT.jar:/usr/home/hudson/hudson-slave/workspace/Lucene-Solr-Tests-trunk-java7/lucene/build/suggest/lucene-suggest-5.0-SNAPSHOT.jar:/usr/home/hudson/hudson-slave/workspace/Lucene-Solr-Tests-trunk-java7/lucene/build/grouping/lucene-grouping-5.0-SNAPSHOT.jar:/usr/home/hudson/hudson-slave/workspace/Lucene-Solr-Tests-trunk-java7/lucene/build/queries/lucene-queries-5.0-SNAPSHOT.jar:/usr/home/hudson/hudson-slave/workspace/Lucene-Solr-Tests-trunk-java7/lucene/build/queryparser/lucene-queryparser-5.0-SNAPSHOT.jar:/usr/home/hudson/hudson-slave/workspace/Lucene-Solr-Tests-trunk-java7/solr/core/lib/commons-cli-1.2.jar:/usr/home/hudson/hudson-slave/workspace/Lucene-Solr-Tests-trunk-java7/solr/core/lib/commons-codec-1.7.jar:/usr/home/hudson/hudson-slave/workspace/Lucene-Solr-Tests-trunk-java7/solr/core/lib/commons-fileupload-1.2.1.jar:/usr/home/hudson/hudson-slave/workspace/Lucene-Solr-Tests-trunk-java7/solr/core/lib/commons-lang-2.6.jar:/usr/home/hudson/hudson-slave/workspace/Lucene-Solr-Tests-trunk-java7/solr/core/lib/easymock-2.2.jar:/usr/home/hudson/hudson-slave/workspace/Lucene-Solr-Tests-trunk-java7/solr/core/lib/guava-r05.jar:/usr/home/hudson/hudson-slave/workspace/Lucene-Solr-Tests-trunk-java7/solr/core/lib/javax.servlet-api-3.0.1.jar:/usr/home/hudson/hudson-slave/workspace/Lucene-Solr-Tests-trunk-java7/solr/core/lib/spatial4j-0.3.jar:/usr/home/hudson/hudson-slave/workspace/Lucene-Solr-Tests-trunk-java7/solr/solrj/lib/commons-io-2.1.jar:/usr/home/hudson/hudson-slave/workspace/Lucene-Solr-Tests-trunk-java7/solr/solrj/lib/httpclient-4.1.3.jar:/usr/home/hudson/hudson-slave/workspace/Lucene-Solr-Tests-trunk-java7/solr/solrj/lib/httpcore-4.1.4.jar:/usr/home/hudson/hudson-slave/workspace/Lucene-Solr-Tests-trunk-java7/solr/solrj/lib/httpmime-4.1.3.jar:/usr/home/hudson/hudson-slave/workspace/Lucene-Solr-Tests-trunk-java7/solr/solrj/lib/jcl-over-slf4j-1.6.4.jar:/usr/home/hudson/hudson-slave/workspace/Lucene-Solr-Tests-trunk-java7/solr/solrj/lib/log4j-over-slf4j-1.6.4.jar:/usr/home/hudson/hudson-slave/workspace/Lucene-Solr-Tests-trunk-java7/solr/solrj/lib/slf4j-api-1.6.4.jar:/usr/home/hudson/hudson-slave/workspace/Lucene-Solr-Tests-trunk-java7/solr/solrj/lib/slf4j-jdk14-1.6.4.jar:/usr/home/hudson/hudson-slave/workspace/Lucene-Solr-Tests-trunk-java7/solr/solrj/lib/wstx-asl-3.2.7.jar:/usr/home/hudson/hudson-slave/workspace/Lucene-Solr-Tests-trunk-java7/solr/solrj/lib/zookeeper-3.3.6.jar:/usr/home/hudson/hudson-slave/workspace/Lucene-Solr-Tests-trunk-java7/solr/example/lib/jetty-continuation-8.1.2.v20120308.jar:/usr/home/hudson/hudson-slave/workspace/Lucene-Solr-Tests-trunk-java7/solr/example/lib/jetty-deploy-8.1.2.v20120308.jar:/usr/home/hudson/hudson-slave/workspace/Lucene-Solr-Tests-trunk-java7/solr/example/lib/jetty-http-8.1.2.v20120308.jar:/usr/home/hudson/hudson-slave/workspace/Lucene-Solr-Tests-trunk-java7/solr/example/lib/jetty-io-8.1.2.v20120308.jar:/usr/home/hudson/hudson-slave/workspace/Lucene-Solr-Tests-trunk-java7/solr/example/lib/jetty-jmx-8.1.2.v20120308.jar:/usr/home/hudson/hudson-slave/workspace/Lucene-Solr-Tests-trunk-java7/solr/example/lib/jetty-security-8.1.2.v20120308.jar:/usr/home/hudson/hudson-slave/workspace/Lucene-Solr-Tests-trunk-java7/solr/example/lib/jetty-server-8.1.2.v20120308.jar:/usr/home/hudson/hudson-slave/workspace/Lucene-Solr-Tests-trunk-java7/solr/example/lib/jetty-servlet-8.1.2.v20120308.jar:/usr/home/hudson/hudson-slave/workspace/Lucene-Solr-Tests-trunk-java7/solr/example/lib/jetty-util-8.1.2.v20120308.jar:/usr/home/hudson/hudson-slave/workspace/Lucene-Solr-Tests-trunk-java7/solr/example/lib/jetty-webapp-8.1.2.v20120308.jar:/usr/home/hudson/hudson-slave/workspace/Lucene-Solr-Tests-trunk-java7/solr/example/lib/jetty-xml-8.1.2.v20120308.jar:/usr/home/hudson/hudson-slave/workspace/Lucene-Solr-Tests-trunk-java7/solr/example/lib/servlet-api-3.0.jar:/usr/home/hudson/hudson-slave/workspace/Lucene-Solr-Tests-trunk-java7/solr/example/example-DIH/solr/db/lib/hsqldb-1.8.0.10.jar:/usr/home/hudson/hudson-slave/workspace/Lucene-Solr-Tests-trunk-java7/lucene/build/core/classes/java:/usr/home/hudson/hudson-slave/workspace/Lucene-Solr-Tests-trunk-java7/lucene/test-framework/lib/junit-4.10.jar:/usr/home/hudson/hudson-slave/workspace/Lucene-Solr-Tests-trunk-java7/lucene/test-framework/lib/randomizedtesting-runner-2.0.1.jar:/home/hudson/hudson-slave/tools/Ant/ant-1.8.2/lib/ant-launcher.jar:/home/hudson/.ant/lib/ivy-2.2.0.jar:/home/hudson/hudson-slave/tools/Ant/ant-1.8.2/lib/ant-apache-regexp.jar:/home/hudson/hudson-slave/tools/Ant/ant-1.8.2/lib/ant-junit.jar:/home/hudson/hudson-slave/tools/Ant/ant-1.8.2/lib/ant-apache-bsf.jar:/home/hudson/hudson-slave/tools/Ant/ant-1.8.2/lib/ant-commons-net.jar:/home/hudson/hudson-slave/tools/Ant/ant-1.8.2/lib/ant-antlr.jar:/home/hudson/hudson-slave/tools/Ant/ant-1.8.2/lib/ant-apache-log4j.jar:/home/hudson/hudson-slave/tools/Ant/ant-1.8.2/lib/ant-commons-logging.jar:/home/hudson/hudson-slave/tools/Ant/ant-1.8.2/lib/ant-apache-xalan2.jar:/home/hudson/hudson-slave/tools/Ant/ant-1.8.2/lib/ant-apache-oro.jar:/home/hudson/hudson-slave/tools/Ant/ant-1.8.2/lib/ant-junit4.jar:/home/hudson/hudson-slave/tools/Ant/ant-1.8.2/lib/ant-netrexx.jar:/home/hudson/hudson-slave/tools/Ant/ant-1.8.2/lib/ant-swing.jar:/home/hudson/hudson-slave/tools/Ant/ant-1.8.2/lib/ant-javamail.jar:/home/hudson/hudson-slave/tools/Ant/ant-1.8.2/lib/ant-jsch.jar:/home/hudson/hudson-slave/tools/Ant/ant-1.8.2/lib/ant-jmf.jar:/home/hudson/hudson-slave/tools/Ant/ant-1.8.2/lib/ant.jar:/home/hudson/hudson-slave/tools/Ant/ant-1.8.2/lib/ant-apache-bcel.jar:/home/hudson/hudson-slave/tools/Ant/ant-1.8.2/lib/ant-jai.jar:/home/hudson/hudson-slave/tools/Ant/ant-1.8.2/lib/ant-testutil.jar:/home/hudson/hudson-slave/tools/Ant/ant-1.8.2/lib/ant-apache-resolver.jar:/home/hudson/hudson-slave/tools/Ant/ant-1.8.2/lib/ant-jdepend.jar:/usr/local/openjdk7/lib/tools.jar:/home/hudson/.ivy2/cache/com.carrotsearch.randomizedtesting/junit4-ant/jars/junit4-ant-2.0.1.jar
[junit4:junit4]   2> 125 T15 oaz.Environment.logEnv Server environment:java.library.path=/usr/local/openjdk7/jre/lib/amd64/server:/usr/local/openjdk7/jre/lib/amd64:/usr/local/openjdk7/jre/../lib/amd64:/usr/local/openjdk6/jre/lib/amd64/server:/usr/local/openjdk6/jre/lib/amd64:/usr/local/openjdk6/jre/../lib/amd64:/usr/java/packages/lib/amd64:/lib:/usr/lib:/usr/local/lib
[junit4:junit4]   2> 125 T15 oaz.Environment.logEnv Server environment:java.io.tmpdir=.
[junit4:junit4]   2> 126 T15 oaz.Environment.logEnv Server environment:java.compiler=<NA>
[junit4:junit4]   2> 126 T15 oaz.Environment.logEnv Server environment:os.name=FreeBSD
[junit4:junit4]   2> 126 T15 oaz.Environment.logEnv Server environment:os.arch=amd64
[junit4:junit4]   2> 127 T15 oaz.Environment.logEnv Server environment:os.version=9.0-RELEASE
[junit4:junit4]   2> 127 T15 oaz.Environment.logEnv Server environment:user.name=hudson
[junit4:junit4]   2> 127 T15 oaz.Environment.logEnv Server environment:user.home=/home/hudson
[junit4:junit4]   2> 128 T15 oaz.Environment.logEnv Server environment:user.dir=/usr/home/hudson/hudson-slave/workspace/Lucene-Solr-Tests-trunk-java7/solr/build/solr-core/test/J1
[junit4:junit4]   2> 162 T15 oazs.ZooKeeperServer.setTickTime tickTime set to 1000
[junit4:junit4]   2> 191 T15 oazs.NIOServerCnxn$Factory.<init> binding to port 0.0.0.0/0.0.0.0:0
[junit4:junit4]   2> 236 T14 oasc.ZkTestServer.run start zk server on port:34039
[junit4:junit4]   2> 262 T15 oazsp.FileTxnSnapLog.save Snapshotting: 0
[junit4:junit4]   2> 341 T14 oaz.Environment.logEnv Client environment:zookeeper.version=3.3.6-1366786, built on 07/29/2012 06:22 GMT
[junit4:junit4]   2> 342 T14 oaz.Environment.logEnv Client environment:host.name=lucene.zones.apache.org
[junit4:junit4]   2> 343 T14 oaz.Environment.logEnv Client environment:java.version=1.7.0_06
[junit4:junit4]   2> 344 T14 oaz.Environment.logEnv Client environment:java.vendor=Oracle Corporation
[junit4:junit4]   2> 345 T14 oaz.Environment.logEnv Client environment:java.home=/usr/local/openjdk7/jre
[junit4:junit4]   2> 345 T14 oaz.Environment.logEnv Client environment:java.class.path=/usr/home/hudson/hudson-slave/workspace/Lucene-Solr-Tests-trunk-java7/solr/build/solr-core/classes/test:/usr/home/hudson/hudson-slave/workspace/Lucene-Solr-Tests-trunk-java7/solr/build/solr-test-framework/classes/java:/usr/home/hudson/hudson-slave/workspace/Lucene-Solr-Tests-trunk-java7/solr/build/solr-core/test-files:/usr/home/hudson/hudson-slave/workspace/Lucene-Solr-Tests-trunk-java7/lucene/build/codecs/classes/java:/usr/home/hudson/hudson-slave/workspace/Lucene-Solr-Tests-trunk-java7/lucene/build/test-framework/classes/java:/usr/home/hudson/hudson-slave/workspace/Lucene-Solr-Tests-trunk-java7/solr/build/solr-solrj/classes/java:/usr/home/hudson/hudson-slave/workspace/Lucene-Solr-Tests-trunk-java7/solr/build/solr-core/classes/java:/usr/home/hudson/hudson-slave/workspace/Lucene-Solr-Tests-trunk-java7/lucene/build/analysis/common/lucene-analyzers-common-5.0-SNAPSHOT.jar:/usr/home/hudson/hudson-slave/workspace/Lucene-Solr-Tests-trunk-java7/lucene/build/analysis/kuromoji/lucene-analyzers-kuromoji-5.0-SNAPSHOT.jar:/usr/home/hudson/hudson-slave/workspace/Lucene-Solr-Tests-trunk-java7/lucene/build/analysis/phonetic/lucene-analyzers-phonetic-5.0-SNAPSHOT.jar:/usr/home/hudson/hudson-slave/workspace/Lucene-Solr-Tests-trunk-java7/lucene/build/highlighter/lucene-highlighter-5.0-SNAPSHOT.jar:/usr/home/hudson/hudson-slave/workspace/Lucene-Solr-Tests-trunk-java7/lucene/build/memory/lucene-memory-5.0-SNAPSHOT.jar:/usr/home/hudson/hudson-slave/workspace/Lucene-Solr-Tests-trunk-java7/lucene/build/misc/lucene-misc-5.0-SNAPSHOT.jar:/usr/home/hudson/hudson-slave/workspace/Lucene-Solr-Tests-trunk-java7/lucene/build/spatial/lucene-spatial-5.0-SNAPSHOT.jar:/usr/home/hudson/hudson-slave/workspace/Lucene-Solr-Tests-trunk-java7/lucene/build/suggest/lucene-suggest-5.0-SNAPSHOT.jar:/usr/home/hudson/hudson-slave/workspace/Lucene-Solr-Tests-trunk-java7/lucene/build/grouping/lucene-grouping-5.0-SNAPSHOT.jar:/usr/home/hudson/hudson-slave/workspace/Lucene-Solr-Tests-trunk-java7/lucene/build/queries/lucene-queries-5.0-SNAPSHOT.jar:/usr/home/hudson/hudson-slave/workspace/Lucene-Solr-Tests-trunk-java7/lucene/build/queryparser/lucene-queryparser-5.0-SNAPSHOT.jar:/usr/home/hudson/hudson-slave/workspace/Lucene-Solr-Tests-trunk-java7/solr/core/lib/commons-cli-1.2.jar:/usr/home/hudson/hudson-slave/workspace/Lucene-Solr-Tests-trunk-java7/solr/core/lib/commons-codec-1.7.jar:/usr/home/hudson/hudson-slave/workspace/Lucene-Solr-Tests-trunk-java7/solr/core/lib/commons-fileupload-1.2.1.jar:/usr/home/hudson/hudson-slave/workspace/Lucene-Solr-Tests-trunk-java7/solr/core/lib/commons-lang-2.6.jar:/usr/home/hudson/hudson-slave/workspace/Lucene-Solr-Tests-trunk-java7/solr/core/lib/easymock-2.2.jar:/usr/home/hudson/hudson-slave/workspace/Lucene-Solr-Tests-trunk-java7/solr/core/lib/guava-r05.jar:/usr/home/hudson/hudson-slave/workspace/Lucene-Solr-Tests-trunk-java7/solr/core/lib/javax.servlet-api-3.0.1.jar:/usr/home/hudson/hudson-slave/workspace/Lucene-Solr-Tests-trunk-java7/solr/core/lib/spatial4j-0.3.jar:/usr/home/hudson/hudson-slave/workspace/Lucene-Solr-Tests-trunk-java7/solr/solrj/lib/commons-io-2.1.jar:/usr/home/hudson/hudson-slave/workspace/Lucene-Solr-Tests-trunk-java7/solr/solrj/lib/httpclient-4.1.3.jar:/usr/home/hudson/hudson-slave/workspace/Lucene-Solr-Tests-trunk-java7/solr/solrj/lib/httpcore-4.1.4.jar:/usr/home/hudson/hudson-slave/workspace/Lucene-Solr-Tests-trunk-java7/solr/solrj/lib/httpmime-4.1.3.jar:/usr/home/hudson/hudson-slave/workspace/Lucene-Solr-Tests-trunk-java7/solr/solrj/lib/jcl-over-slf4j-1.6.4.jar:/usr/home/hudson/hudson-slave/workspace/Lucene-Solr-Tests-trunk-java7/solr/solrj/lib/log4j-over-slf4j-1.6.4.jar:/usr/home/hudson/hudson-slave/workspace/Lucene-Solr-Tests-trunk-java7/solr/solrj/lib/slf4j-api-1.6.4.jar:/usr/home/hudson/hudson-slave/workspace/Lucene-Solr-Tests-trunk-java7/solr/solrj/lib/slf4j-jdk14-1.6.4.jar:/usr/home/hudson/hudson-slave/workspace/Lucene-Solr-Tests-trunk-java7/solr/solrj/lib/wstx-asl-3.2.7.jar:/usr/home/hudson/hudson-slave/workspace/Lucene-Solr-Tests-trunk-java7/solr/solrj/lib/zookeeper-3.3.6.jar:/usr/home/hudson/hudson-slave/workspace/Lucene-Solr-Tests-trunk-java7/solr/example/lib/jetty-continuation-8.1.2.v20120308.jar:/usr/home/hudson/hudson-slave/workspace/Lucene-Solr-Tests-trunk-java7/solr/example/lib/jetty-deploy-8.1.2.v20120308.jar:/usr/home/hudson/hudson-slave/workspace/Lucene-Solr-Tests-trunk-java7/solr/example/lib/jetty-http-8.1.2.v20120308.jar:/usr/home/hudson/hudson-slave/workspace/Lucene-Solr-Tests-trunk-java7/solr/example/lib/jetty-io-8.1.2.v20120308.jar:/usr/home/hudson/hudson-slave/workspace/Lucene-Solr-Tests-trunk-java7/solr/example/lib/jetty-jmx-8.1.2.v20120308.jar:/usr/home/hudson/hudson-slave/workspace/Lucene-Solr-Tests-trunk-java7/solr/example/lib/jetty-security-8.1.2.v20120308.jar:/usr/home/hudson/hudson-slave/workspace/Lucene-Solr-Tests-trunk-java7/solr/example/lib/jetty-server-8.1.2.v20120308.jar:/usr/home/hudson/hudson-slave/workspace/Lucene-Solr-Tests-trunk-java7/solr/example/lib/jetty-servlet-8.1.2.v20120308.jar:/usr/home/hudson/hudson-slave/workspace/Lucene-Solr-Tests-trunk-java7/solr/example/lib/jetty-util-8.1.2.v20120308.jar:/usr/home/hudson/hudson-slave/workspace/Lucene-Solr-Tests-trunk-java7/solr/example/lib/jetty-webapp-8.1.2.v20120308.jar:/usr/home/hudson/hudson-slave/workspace/Lucene-Solr-Tests-trunk-java7/solr/example/lib/jetty-xml-8.1.2.v20120308.jar:/usr/home/hudson/hudson-slave/workspace/Lucene-Solr-Tests-trunk-java7/solr/example/lib/servlet-api-3.0.jar:/usr/home/hudson/hudson-slave/workspace/Lucene-Solr-Tests-trunk-java7/solr/example/example-DIH/solr/db/lib/hsqldb-1.8.0.10.jar:/usr/home/hudson/hudson-slave/workspace/Lucene-Solr-Tests-trunk-java7/lucene/build/core/classes/java:/usr/home/hudson/hudson-slave/workspace/Lucene-Solr-Tests-trunk-java7/lucene/test-framework/lib/junit-4.10.jar:/usr/home/hudson/hudson-slave/workspace/Lucene-Solr-Tests-trunk-java7/lucene/test-framework/lib/randomizedtesting-runner-2.0.1.jar:/home/hudson/hudson-slave/tools/Ant/ant-1.8.2/lib/ant-launcher.jar:/home/hudson/.ant/lib/ivy-2.2.0.jar:/home/hudson/hudson-slave/tools/Ant/ant-1.8.2/lib/ant-apache-regexp.jar:/home/hudson/hudson-slave/tools/Ant/ant-1.8.2/lib/ant-junit.jar:/home/hudson/hudson-slave/tools/Ant/ant-1.8.2/lib/ant-apache-bsf.jar:/home/hudson/hudson-slave/tools/Ant/ant-1.8.2/lib/ant-commons-net.jar:/home/hudson/hudson-slave/tools/Ant/ant-1.8.2/lib/ant-antlr.jar:/home/hudson/hudson-slave/tools/Ant/ant-1.8.2/lib/ant-apache-log4j.jar:/home/hudson/hudson-slave/tools/Ant/ant-1.8.2/lib/ant-commons-logging.jar:/home/hudson/hudson-slave/tools/Ant/ant-1.8.2/lib/ant-apache-xalan2.jar:/home/hudson/hudson-slave/tools/Ant/ant-1.8.2/lib/ant-apache-oro.jar:/home/hudson/hudson-slave/tools/Ant/ant-1.8.2/lib/ant-junit4.jar:/home/hudson/hudson-slave/tools/Ant/ant-1.8.2/lib/ant-netrexx.jar:/home/hudson/hudson-slave/tools/Ant/ant-1.8.2/lib/ant-swing.jar:/home/hudson/hudson-slave/tools/Ant/ant-1.8.2/lib/ant-javamail.jar:/home/hudson/hudson-slave/tools/Ant/ant-1.8.2/lib/ant-jsch.jar:/home/hudson/hudson-slave/tools/Ant/ant-1.8.2/lib/ant-jmf.jar:/home/hudson/hudson-slave/tools/Ant/ant-1.8.2/lib/ant.jar:/home/hudson/hudson-slave/tools/Ant/ant-1.8.2/lib/ant-apache-bcel.jar:/home/hudson/hudson-slave/tools/Ant/ant-1.8.2/lib/ant-jai.jar:/home/hudson/hudson-slave/tools/Ant/ant-1.8.2/lib/ant-testutil.jar:/home/hudson/hudson-slave/tools/Ant/ant-1.8.2/lib/ant-apache-resolver.jar:/home/hudson/hudson-slave/tools/Ant/ant-1.8.2/lib/ant-jdepend.jar:/usr/local/openjdk7/lib/tools.jar:/home/hudson/.ivy2/cache/com.carrotsearch.randomizedtesting/junit4-ant/jars/junit4-ant-2.0.1.jar
[junit4:junit4]   2> 360 T14 oaz.Environment.logEnv Client environment:java.library.path=/usr/local/openjdk7/jre/lib/amd64/server:/usr/local/openjdk7/jre/lib/amd64:/usr/local/openjdk7/jre/../lib/amd64:/usr/local/openjdk6/jre/lib/amd64/server:/usr/local/openjdk6/jre/lib/amd64:/usr/local/openjdk6/jre/../lib/amd64:/usr/java/packages/lib/amd64:/lib:/usr/lib:/usr/local/lib
[junit4:junit4]   2> 361 T14 oaz.Environment.logEnv Client environment:java.io.tmpdir=.
[junit4:junit4]   2> 362 T14 oaz.Environment.logEnv Client environment:java.compiler=<NA>
[junit4:junit4]   2> 363 T14 oaz.Environment.logEnv Client environment:os.name=FreeBSD
[junit4:junit4]   2> 363 T14 oaz.Environment.logEnv Client environment:os.arch=amd64
[junit4:junit4]   2> 364 T14 oaz.Environment.logEnv Client environment:os.version=9.0-RELEASE
[junit4:junit4]   2> 365 T14 oaz.Environment.logEnv Client environment:user.name=hudson
[junit4:junit4]   2> 365 T14 oaz.Environment.logEnv Client environment:user.home=/home/hudson
[junit4:junit4]   2> 366 T14 oaz.Environment.logEnv Client environment:user.dir=/usr/home/hudson/hudson-slave/workspace/Lucene-Solr-Tests-trunk-java7/solr/build/solr-core/test/J1
[junit4:junit4]   2> 373 T14 oaz.ZooKeeper.<init> Initiating client connection, connectString=127.0.0.1:34039 sessionTimeout=10000 watcher=org.apache.solr.common.cloud.ConnectionManager@f5a07b6
[junit4:junit4]   2> 443 T20 oaz.ClientCnxn$SendThread.startConnect Opening socket connection to server /127.0.0.1:34039
[junit4:junit4]   2> 443 T14 oascc.ConnectionManager.waitForConnected Waiting for client to connect to ZooKeeper
[junit4:junit4]   2> 446 T20 oaz.ClientCnxn$SendThread.primeConnection Socket connection established to localhost/127.0.0.1:34039, initiating session
[junit4:junit4]   2> 447 T16 oazs.NIOServerCnxn$Factory.run Accepted socket connection from /140.211.11.196:40830
[junit4:junit4]   2> 462 T16 oazs.NIOServerCnxn.readConnectRequest Client attempting to establish new session at /140.211.11.196:40830
[junit4:junit4]   2> 479 T18 oazsp.FileTxnLog.append Creating new log file: log.1
[junit4:junit4]   2> 521 T18 oazs.NIOServerCnxn.finishSessionInit Established session 0x139e666bb4b0000 with negotiated timeout 10000 for client /140.211.11.196:40830
[junit4:junit4]   2> 522 T20 oaz.ClientCnxn$SendThread.readConnectResult Session establishment complete on server localhost/127.0.0.1:34039, sessionid = 0x139e666bb4b0000, negotiated timeout = 10000
[junit4:junit4]   2> 530 T21 oascc.ConnectionManager.process Watcher org.apache.solr.common.cloud.ConnectionManager@f5a07b6 name:ZooKeeperConnection Watcher:127.0.0.1:34039 got event WatchedEvent state:SyncConnected type:None path:null path:null type:None
[junit4:junit4]   2> 530 T14 oascc.ConnectionManager.waitForConnected Client is connected to ZooKeeper
[junit4:junit4]   2> 536 T14 oascc.SolrZkClient.makePath makePath: /solr
[junit4:junit4]   2> 615 T19 oazs.PrepRequestProcessor.pRequest Processed session termination for sessionid: 0x139e666bb4b0000
[junit4:junit4]   2> 616 T21 oaz.ClientCnxn$EventThread.run EventThread shut down
[junit4:junit4]   2> 616 T14 oaz.ZooKeeper.close Session: 0x139e666bb4b0000 closed
[junit4:junit4]   2> 617 T14 oaz.ZooKeeper.<init> Initiating client connection, connectString=127.0.0.1:34039/solr sessionTimeout=10000 watcher=org.apache.solr.common.cloud.ConnectionManager@4c898c2d
[junit4:junit4]   2> 617 T16 oazs.NIOServerCnxn.closeSock Closed socket connection for client /140.211.11.196:40830 which had sessionid 0x139e666bb4b0000
[junit4:junit4]   2> 618 T14 oascc.ConnectionManager.waitForConnected Waiting for client to connect to ZooKeeper
[junit4:junit4]   2> 618 T22 oaz.ClientCnxn$SendThread.startConnect Opening socket connection to server /127.0.0.1:34039
[junit4:junit4]   2> 620 T22 oaz.ClientCnxn$SendThread.primeConnection Socket connection established to localhost/127.0.0.1:34039, initiating session
[junit4:junit4]   2> 620 T16 oazs.NIOServerCnxn$Factory.run Accepted socket connection from /140.211.11.196:33578
[junit4:junit4]   2> 621 T16 oazs.NIOServerCnxn.readConnectRequest Client attempting to establish new session at /140.211.11.196:33578
[junit4:junit4]   2> 623 T18 oazs.NIOServerCnxn.finishSessionInit Established session 0x139e666bb4b0001 with negotiated timeout 10000 for client /140.211.11.196:33578
[junit4:junit4]   2> 623 T22 oaz.ClientCnxn$SendThread.readConnectResult Session establishment complete on server localhost/127.0.0.1:34039, sessionid = 0x139e666bb4b0001, negotiated timeout = 10000
[junit4:junit4]   2> 624 T23 oascc.ConnectionManager.process Watcher org.apache.solr.common.cloud.ConnectionManager@4c898c2d name:ZooKeeperConnection Watcher:127.0.0.1:34039/solr got event WatchedEvent state:SyncConnected type:None path:null path:null type:None
[junit4:junit4]   2> 624 T14 oascc.ConnectionManager.waitForConnected Client is connected to ZooKeeper
[junit4:junit4]   2> 650 T14 oascc.SolrZkClient.makePath makePath: /collections/collection1
[junit4:junit4]   2> 656 T14 oascc.SolrZkClient.makePath makePath: /collections/collection1/shards
[junit4:junit4]   2> 666 T14 oascc.SolrZkClient.makePath makePath: /collections/control_collection
[junit4:junit4]   2> 669 T14 oascc.SolrZkClient.makePath makePath: /collections/control_collection/shards
[junit4:junit4]   2> 674 T14 oasc.AbstractZkTestCase.putConfig put /usr/home/hudson/hudson-slave/workspace/Lucene-Solr-Tests-trunk-java7/solr/build/solr-core/test-files/solr/collection1/conf/solrconfig.xml to /configs/conf1/solrconfig.xml
[junit4:junit4]   2> 712 T14 oascc.SolrZkClient.makePath makePath: /configs/conf1/solrconfig.xml
[junit4:junit4]   2> 728 T14 oasc.AbstractZkTestCase.putConfig put /usr/home/hudson/hudson-slave/workspace/Lucene-Solr-Tests-trunk-java7/solr/build/solr-core/test-files/solr/collection1/conf/schema.xml to /configs/conf1/schema.xml
[junit4:junit4]   2> 729 T14 oascc.SolrZkClient.makePath makePath: /configs/conf1/schema.xml
[junit4:junit4]   2> 834 T14 oasc.AbstractZkTestCase.putConfig put /usr/home/hudson/hudson-slave/workspace/Lucene-Solr-Tests-trunk-java7/solr/build/solr-core/test-files/solr/collection1/conf/solrconfig.xml to /configs/conf1/solrconfig.xml
[junit4:junit4]   2> 835 T14 oascc.SolrZkClient.makePath makePath: /configs/conf1/solrconfig.xml
[junit4:junit4]   2> 852 T14 oasc.AbstractZkTestCase.putConfig put /usr/home/hudson/hudson-slave/workspace/Lucene-Solr-Tests-trunk-java7/solr/build/solr-core/test-files/solr/collection1/conf/stopwords.txt to /configs/conf1/stopwords.txt
[junit4:junit4]   2> 853 T14 oascc.SolrZkClient.makePath makePath: /configs/conf1/stopwords.txt
[junit4:junit4]   2> 857 T14 oasc.AbstractZkTestCase.putConfig put /usr/home/hudson/hudson-slave/workspace/Lucene-Solr-Tests-trunk-java7/solr/build/solr-core/test-files/solr/collection1/conf/protwords.txt to /configs/conf1/protwords.txt
[junit4:junit4]   2> 858 T14 oascc.SolrZkClient.makePath makePath: /configs/conf1/protwords.txt
[junit4:junit4]   2> 863 T14 oasc.AbstractZkTestCase.putConfig put /usr/home/hudson/hudson-slave/workspace/Lucene-Solr-Tests-trunk-java7/solr/build/solr-core/test-files/solr/collection1/conf/currency.xml to /configs/conf1/currency.xml
[junit4:junit4]   2> 863 T14 oascc.SolrZkClient.makePath makePath: /configs/conf1/currency.xml
[junit4:junit4]   2> 868 T14 oasc.AbstractZkTestCase.putConfig put /usr/home/hudson/hudson-slave/workspace/Lucene-Solr-Tests-trunk-java7/solr/build/solr-core/test-files/solr/collection1/conf/open-exchange-rates.json to /configs/conf1/open-exchange-rates.json
[junit4:junit4]   2> 869 T14 oascc.SolrZkClient.makePath makePath: /configs/conf1/open-exchange-rates.json
[junit4:junit4]   2> 873 T14 oasc.AbstractZkTestCase.putConfig put /usr/home/hudson/hudson-slave/workspace/Lucene-Solr-Tests-trunk-java7/solr/build/solr-core/test-files/solr/collection1/conf/mapping-ISOLatin1Accent.txt to /configs/conf1/mapping-ISOLatin1Accent.txt
[junit4:junit4]   2> 874 T14 oascc.SolrZkClient.makePath makePath: /configs/conf1/mapping-ISOLatin1Accent.txt
[junit4:junit4]   2> 878 T14 oasc.AbstractZkTestCase.putConfig put /usr/home/hudson/hudson-slave/workspace/Lucene-Solr-Tests-trunk-java7/solr/build/solr-core/test-files/solr/collection1/conf/old_synonyms.txt to /configs/conf1/old_synonyms.txt
[junit4:junit4]   2> 879 T14 oascc.SolrZkClient.makePath makePath: /configs/conf1/old_synonyms.txt
[junit4:junit4]   2> 883 T14 oasc.AbstractZkTestCase.putConfig put /usr/home/hudson/hudson-slave/workspace/Lucene-Solr-Tests-trunk-java7/solr/build/solr-core/test-files/solr/collection1/conf/synonyms.txt to /configs/conf1/synonyms.txt
[junit4:junit4]   2> 884 T14 oascc.SolrZkClient.makePath makePath: /configs/conf1/synonyms.txt
[junit4:junit4]   2> 888 T19 oazs.PrepRequestProcessor.pRequest Processed session termination for sessionid: 0x139e666bb4b0001
[junit4:junit4]   2> 889 T23 oaz.ClientCnxn$EventThread.run EventThread shut down
[junit4:junit4]   2> 889 T14 oaz.ZooKeeper.close Session: 0x139e666bb4b0001 closed
[junit4:junit4]   2> 889 T16 oazs.NIOServerCnxn.closeSock Closed socket connection for client /140.211.11.196:33578 which had sessionid 0x139e666bb4b0001
[junit4:junit4]   2> 1570 T14 oejs.Server.doStart jetty-8.1.2.v20120308
[junit4:junit4]   2> 1818 T14 oejs.AbstractConnector.doStart Started SocketConnector@0.0.0.0:32945
[junit4:junit4]   2> 1871 T14 oasc.SolrResourceLoader.locateSolrHome JNDI not configured for solr (NoInitialContextEx)
[junit4:junit4]   2> 1871 T14 oasc.SolrResourceLoader.locateSolrHome using system property solr.solr.home: /usr/home/hudson/hudson-slave/workspace/Lucene-Solr-Tests-trunk-java7/solr/build/solr-core/test-files/solr
[junit4:junit4]   2> 1872 T14 oasc.SolrResourceLoader.<init> new SolrResourceLoader for deduced Solr Home: '/usr/home/hudson/hudson-slave/workspace/Lucene-Solr-Tests-trunk-java7/solr/build/solr-core/test-files/solr/'
[junit4:junit4]   2> 1937 T14 oass.SolrDispatchFilter.init SolrDispatchFilter.init()
[junit4:junit4]   2> 1937 T14 oasc.SolrResourceLoader.locateSolrHome JNDI not configured for solr (NoInitialContextEx)
[junit4:junit4]   2> 1938 T14 oasc.SolrResourceLoader.locateSolrHome using system property solr.solr.home: /usr/home/hudson/hudson-slave/workspace/Lucene-Solr-Tests-trunk-java7/solr/build/solr-core/test-files/solr
[junit4:junit4]   2> 1938 T14 oasc.CoreContainer$Initializer.initialize looking for solr.xml: /usr/home/hudson/hudson-slave/workspace/Lucene-Solr-Tests-trunk-java7/solr/build/solr-core/test-files/solr/solr.xml
[junit4:junit4]   2> 1939 T14 oasc.CoreContainer.<init> New CoreContainer 1256135975
[junit4:junit4]   2> 1940 T14 oasc.CoreContainer.load Loading CoreContainer using Solr Home: '/usr/home/hudson/hudson-slave/workspace/Lucene-Solr-Tests-trunk-java7/solr/build/solr-core/test-files/solr/'
[junit4:junit4]   2> 1940 T14 oasc.SolrResourceLoader.<init> new SolrResourceLoader for directory: '/usr/home/hudson/hudson-slave/workspace/Lucene-Solr-Tests-trunk-java7/solr/build/solr-core/test-files/solr/'
[junit4:junit4]   2> 1988 T14 oasc.CoreContainer.load Registering Log Listener
[junit4:junit4]   2> 2009 T14 oasc.CoreContainer.initZooKeeper Zookeeper client=127.0.0.1:34039/solr
[junit4:junit4]   2> 2043 T14 oaz.ZooKeeper.<init> Initiating client connection, connectString=127.0.0.1:34039/solr sessionTimeout=5000 watcher=org.apache.solr.common.cloud.ConnectionManager@6e25ea87
[junit4:junit4]   2> 2044 T34 oaz.ClientCnxn$SendThread.startConnect Opening socket connection to server /127.0.0.1:34039
[junit4:junit4]   2> 2044 T14 oascc.ConnectionManager.waitForConnected Waiting for client to connect to ZooKeeper
[junit4:junit4]   2> 2046 T34 oaz.ClientCnxn$SendThread.primeConnection Socket connection established to localhost/127.0.0.1:34039, initiating session
[junit4:junit4]   2> 2047 T16 oazs.NIOServerCnxn$Factory.run Accepted socket connection from /140.211.11.196:42650
[junit4:junit4]   2> 2047 T16 oazs.NIOServerCnxn.readConnectRequest Client attempting to establish new session at /140.211.11.196:42650
[junit4:junit4]   2> 2049 T18 oazs.NIOServerCnxn.finishSessionInit Established session 0x139e666bb4b0002 with negotiated timeout 5000 for client /140.211.11.196:42650
[junit4:junit4]   2> 2049 T34 oaz.ClientCnxn$SendThread.readConnectResult Session establishment complete on server localhost/127.0.0.1:34039, sessionid = 0x139e666bb4b0002, negotiated timeout = 5000
[junit4:junit4]   2> 2050 T35 oascc.ConnectionManager.process Watcher org.apache.solr.common.cloud.ConnectionManager@6e25ea87 name:ZooKeeperConnection Watcher:127.0.0.1:34039/solr got event WatchedEvent state:SyncConnected type:None path:null path:null type:None
[junit4:junit4]   2> 2051 T14 oascc.ConnectionManager.waitForConnected Client is connected to ZooKeeper
[junit4:junit4]   2> 2069 T19 oazs.PrepRequestProcessor.pRequest Got user-level KeeperException when processing sessionid:0x139e666bb4b0002 type:create cxid:0x2 zxid:0xfffffffffffffffe txntype:unknown reqpath:n/a Error Path:/solr/overseer Error:KeeperErrorCode = NodeExists for /solr/overseer
[junit4:junit4]   2> 2079 T14 oascc.SolrZkClient.makePath makePath: /live_nodes
[junit4:junit4]   2> 2082 T14 oasc.ZkController.createEphemeralLiveNode Register node as live in ZooKeeper:/live_nodes/127.0.0.1:32945_solr
[junit4:junit4]   2> 2088 T19 oazs.PrepRequestProcessor.pRequest Got user-level KeeperException when processing sessionid:0x139e666bb4b0002 type:delete cxid:0x7 zxid:0xfffffffffffffffe txntype:unknown reqpath:n/a Error Path:/solr/live_nodes/127.0.0.1:32945_solr Error:KeeperErrorCode = NoNode for /solr/live_nodes/127.0.0.1:32945_solr
[junit4:junit4]   2> 2089 T14 oascc.SolrZkClient.makePath makePath: /live_nodes/127.0.0.1:32945_solr
[junit4:junit4]   2> 2093 T14 oashc.HttpShardHandlerFactory.getParameter Setting socketTimeout to: 0
[junit4:junit4]   2> 2094 T14 oashc.HttpShardHandlerFactory.getParameter Setting urlScheme to: http://
[junit4:junit4]   2> 2094 T14 oashc.HttpShardHandlerFactory.getParameter Setting connTimeout to: 0
[junit4:junit4]   2> 2095 T14 oashc.HttpShardHandlerFactory.getParameter Setting maxConnectionsPerHost to: 20
[junit4:junit4]   2> 2095 T14 oashc.HttpShardHandlerFactory.getParameter Setting corePoolSize to: 0
[junit4:junit4]   2> 2096 T14 oashc.HttpShardHandlerFactory.getParameter Setting maximumPoolSize to: 2147483647
[junit4:junit4]   2> 2096 T14 oashc.HttpShardHandlerFactory.getParameter Setting maxThreadIdleTime to: 5
[junit4:junit4]   2> 2097 T14 oashc.HttpShardHandlerFactory.getParameter Setting sizeOfQueue to: -1
[junit4:junit4]   2> 2097 T14 oashc.HttpShardHandlerFactory.getParameter Setting fairnessPolicy to: false
[junit4:junit4]   2> 2098 T14 oascsi.HttpClientUtil.createClient Creating new http client, config:maxConnectionsPerHost=20&maxConnections=10000&socketTimeout=0&connTimeout=0&retry=false
[junit4:junit4]   2> 2117 T14 oascc.SolrZkClient.makePath makePath: /overseer_elect/election
[junit4:junit4]   2> 2143 T19 oazs.PrepRequestProcessor.pRequest Got user-level KeeperException when processing sessionid:0x139e666bb4b0002 type:delete cxid:0x15 zxid:0xfffffffffffffffe txntype:unknown reqpath:n/a Error Path:/solr/overseer_elect/leader Error:KeeperErrorCode = NoNode for /solr/overseer_elect/leader
[junit4:junit4]   2> 2144 T14 oascc.SolrZkClient.makePath makePath: /overseer_elect/leader
[junit4:junit4]   2> 2147 T14 oasc.Overseer.start Overseer (id=88354996613742594-127.0.0.1:32945_solr-n_0000000000) starting
[junit4:junit4]   2> 2148 T19 oazs.PrepRequestProcessor.pRequest Got user-level KeeperException when processing sessionid:0x139e666bb4b0002 type:create cxid:0x1a zxid:0xfffffffffffffffe txntype:unknown reqpath:n/a Error Path:/solr/overseer Error:KeeperErrorCode = NodeExists for /solr/overseer
[junit4:junit4]   2> 2166 T19 oazs.PrepRequestProcessor.pRequest Got user-level KeeperException when processing sessionid:0x139e666bb4b0002 type:create cxid:0x1b zxid:0xfffffffffffffffe txntype:unknown reqpath:n/a Error Path:/solr/overseer Error:KeeperErrorCode = NodeExists for /solr/overseer
[junit4:junit4]   2> 2168 T19 oazs.PrepRequestProcessor.pRequest Got user-level KeeperException when processing sessionid:0x139e666bb4b0002 type:create cxid:0x1c zxid:0xfffffffffffffffe txntype:unknown reqpath:n/a Error Path:/solr/overseer Error:KeeperErrorCode = NodeExists for /solr/overseer
[junit4:junit4]   2> 2173 T19 oazs.PrepRequestProcessor.pRequest Got user-level KeeperException when processing sessionid:0x139e666bb4b0002 type:create cxid:0x1d zxid:0xfffffffffffffffe txntype:unknown reqpath:n/a Error Path:/solr/overseer Error:KeeperErrorCode = NodeExists for /solr/overseer
[junit4:junit4]   2> 2175 T37 oasc.OverseerCollectionProcessor.run Process current queue of collection creations
[junit4:junit4]   2> 2178 T14 oascc.SolrZkClient.makePath makePath: /clusterstate.json
[junit4:junit4]   2> 2181 T14 oascc.ZkStateReader.createClusterStateWatchersAndUpdate Updating cluster state from ZooKeeper... 
[junit4:junit4]   2> 2204 T36 oasc.Overseer$ClusterStateUpdater.run Starting to work on the main queue
[junit4:junit4]   2> 2255 T14 oasc.CoreContainer.create Creating SolrCore 'collection1' using instanceDir: /usr/home/hudson/hudson-slave/workspace/Lucene-Solr-Tests-trunk-java7/solr/build/solr-core/test-files/solr/collection1
[junit4:junit4]   2> 2256 T14 oasc.ZkController.createCollectionZkNode Check for collection zkNode:control_collection
[junit4:junit4]   2> 2257 T14 oasc.ZkController.createCollectionZkNode Collection zkNode exists
[junit4:junit4]   2> 2258 T14 oasc.ZkController.readConfigName Load collection config from:/collections/control_collection
[junit4:junit4]   2> 2260 T14 oasc.SolrResourceLoader.<init> new SolrResourceLoader for directory: '/usr/home/hudson/hudson-slave/workspace/Lucene-Solr-Tests-trunk-java7/solr/build/solr-core/test-files/solr/collection1/'
[junit4:junit4]   2> 2261 T14 oasc.SolrResourceLoader.replaceClassLoader Adding 'file:/usr/home/hudson/hudson-slave/workspace/Lucene-Solr-Tests-trunk-java7/solr/build/solr-core/test-files/solr/collection1/lib/README' to classloader
[junit4:junit4]   2> 2262 T14 oasc.SolrResourceLoader.replaceClassLoader Adding 'file:/usr/home/hudson/hudson-slave/workspace/Lucene-Solr-Tests-trunk-java7/solr/build/solr-core/test-files/solr/collection1/lib/classes/' to classloader
[junit4:junit4]   2> 2392 T14 oasc.SolrConfig.<init> Using Lucene MatchVersion: LUCENE_50
[junit4:junit4]   2> 2467 T14 oasc.SolrConfig.<init> Loaded SolrConfig: solrconfig.xml
[junit4:junit4]   2> 2568 T14 oass.IndexSchema.readSchema Reading Solr Schema
[junit4:junit4]   2> 2628 T14 oass.IndexSchema.readSchema Schema name=test
[junit4:junit4]   2> 3252 T14 oass.OpenExchangeRatesOrgProvider.init Initialized with rates=open-exchange-rates.json, refreshInterval=1440.
[junit4:junit4]   2> 3266 T14 oass.IndexSchema.readSchema default search field in schema is text
[junit4:junit4]   2> 3270 T14 oass.IndexSchema.readSchema unique key field: id
[junit4:junit4]   2> 3297 T14 oass.FileExchangeRateProvider.reload Reloading exchange rates from file currency.xml
[junit4:junit4]   2> 3304 T14 oass.FileExchangeRateProvider.reload Reloading exchange rates from file currency.xml
[junit4:junit4]   2> 3309 T14 oass.OpenExchangeRatesOrgProvider.reload Reloading exchange rates from open-exchange-rates.json
[junit4:junit4]   2> 3313 T14 oass.OpenExchangeRatesOrgProvider.reload Reloading exchange rates from open-exchange-rates.json
[junit4:junit4]   2> 3317 T14 oasc.SolrCore.<init> [collection1] Opening new SolrCore at /usr/home/hudson/hudson-slave/workspace/Lucene-Solr-Tests-trunk-java7/solr/build/solr-core/test-files/solr/collection1/, dataDir=./org.apache.solr.cloud.BasicDistributedZk2Test-1348190255652/control/data/
[junit4:junit4]   2> 3321 T14 oasc.JmxMonitoredMap.<init> JMX monitoring is enabled. Adding Solr mbeans to JMX Server: com.sun.jmx.mbeanserver.JmxMBeanServer@1c342c15
[junit4:junit4]   2> 3345 T14 oasc.SolrCore.getNewIndexDir WARNING New index directory detected: old=null new=./org.apache.solr.cloud.BasicDistributedZk2Test-1348190255652/control/data/index/
[junit4:junit4]   2> 3347 T14 oasc.SolrCore.initIndex WARNING [collection1] Solr index directory './org.apache.solr.cloud.BasicDistributedZk2Test-1348190255652/control/data/index' doesn't exist. Creating new index...
[junit4:junit4]   2> 3348 T14 oasc.CachingDirectoryFactory.get return new directory for /usr/home/hudson/hudson-slave/workspace/Lucene-Solr-Tests-trunk-java7/solr/build/solr-core/test/J1/./org.apache.solr.cloud.BasicDistributedZk2Test-1348190255652/control/data/index forceNew:false
[junit4:junit4]   2> 3362 T14 oasc.SolrDeletionPolicy.onCommit SolrDeletionPolicy.onCommit: commits:num=1
[junit4:junit4]   2> 		commit{dir=NRTCachingDirectory(org.apache.lucene.store.NIOFSDirectory@/usr/home/hudson/hudson-slave/workspace/Lucene-Solr-Tests-trunk-java7/solr/build/solr-core/test/J1/org.apache.solr.cloud.BasicDistributedZk2Test-1348190255652/control/data/index lockFactory=org.apache.lucene.store.NativeFSLockFactory@213e02ee; maxCacheMB=48.0 maxMergeSizeMB=4.0),segFN=segments_1,generation=1,filenames=[segments_1]
[junit4:junit4]   2> 3362 T14 oasc.SolrDeletionPolicy.updateCommits newest commit = 1
[junit4:junit4]   2> 3363 T14 oasc.SolrCore.initWriters created xml: solr.XMLResponseWriter
[junit4:junit4]   2> 3366 T14 oasup.UpdateRequestProcessorChain.init inserting DistributedUpdateProcessorFactory into updateRequestProcessorChain "dedupe"
[junit4:junit4]   2> 3367 T14 oasup.UpdateRequestProcessorChain.init inserting DistributedUpdateProcessorFactory into updateRequestProcessorChain "dedupe-allfields"
[junit4:junit4]   2> 3367 T14 oasup.UpdateRequestProcessorChain.init inserting DistributedUpdateProcessorFactory into updateRequestProcessorChain "stored_sig"
[junit4:junit4]   2> 3368 T14 oasup.UpdateRequestProcessorChain.init inserting DistributedUpdateProcessorFactory into updateRequestProcessorChain "uniq-fields"
[junit4:junit4]   2> 3369 T14 oasup.UpdateRequestProcessorChain.init inserting DistributedUpdateProcessorFactory into updateRequestProcessorChain "distrib-dup-test-chain-implicit"
[junit4:junit4]   2> 3370 T14 oasc.RequestHandlers.initHandlersFromConfig adding lazy requestHandler: solr.ReplicationHandler
[junit4:junit4]   2> 3370 T14 oasc.RequestHandlers.initHandlersFromConfig created /replication: solr.ReplicationHandler
[junit4:junit4]   2> 3372 T14 oasc.RequestHandlers.initHandlersFromConfig created standard: solr.StandardRequestHandler
[junit4:junit4]   2> 3373 T14 oasc.RequestHandlers.initHandlersFromConfig created /get: solr.RealTimeGetHandler
[junit4:junit4]   2> 3374 T14 oasc.RequestHandlers.initHandlersFromConfig created dismax: solr.SearchHandler
[junit4:junit4]   2> 3375 T14 oasc.RequestHandlers.initHandlersFromConfig created mock: org.apache.solr.core.MockQuerySenderListenerReqHandler
[junit4:junit4]   2> 3375 T14 oasc.RequestHandlers.initHandlersFromConfig created /admin/: org.apache.solr.handler.admin.AdminHandlers
[junit4:junit4]   2> 3376 T14 oasc.RequestHandlers.initHandlersFromConfig created defaults: solr.StandardRequestHandler
[junit4:junit4]   2> 3377 T14 oasc.RequestHandlers.initHandlersFromConfig adding lazy requestHandler: solr.StandardRequestHandler
[junit4:junit4]   2> 3378 T14 oasc.RequestHandlers.initHandlersFromConfig created lazy: solr.StandardRequestHandler
[junit4:junit4]   2> 3379 T14 oasc.RequestHandlers.initHandlersFromConfig created /update: solr.UpdateRequestHandler
[junit4:junit4]   2> 3380 T14 oasc.RequestHandlers.initHandlersFromConfig created /terms: org.apache.solr.handler.component.SearchHandler
[junit4:junit4]   2> 3380 T14 oasc.RequestHandlers.initHandlersFromConfig created spellCheckCompRH: org.apache.solr.handler.component.SearchHandler
[junit4:junit4]   2> 3381 T14 oasc.RequestHandlers.initHandlersFromConfig created spellCheckCompRH_Direct: org.apache.solr.handler.component.SearchHandler
[junit4:junit4]   2> 3382 T14 oasc.RequestHandlers.initHandlersFromConfig created spellCheckWithWordbreak: org.apache.solr.handler.component.SearchHandler
[junit4:junit4]   2> 3383 T14 oasc.RequestHandlers.initHandlersFromConfig created spellCheckWithWordbreak_Direct: org.apache.solr.handler.component.SearchHandler
[junit4:junit4]   2> 3384 T14 oasc.RequestHandlers.initHandlersFromConfig created spellCheckCompRH1: org.apache.solr.handler.component.SearchHandler
[junit4:junit4]   2> 3386 T14 oasc.RequestHandlers.initHandlersFromConfig created tvrh: org.apache.solr.handler.component.SearchHandler
[junit4:junit4]   2> 3387 T14 oasc.RequestHandlers.initHandlersFromConfig created /mlt: solr.MoreLikeThisHandler
[junit4:junit4]   2> 3388 T14 oasc.RequestHandlers.initHandlersFromConfig created /debug/dump: solr.DumpRequestHandler
[junit4:junit4]   2> 3392 T14 oashl.XMLLoader.init xsltCacheLifetimeSeconds=60
[junit4:junit4]   2> 3396 T14 oasc.SolrCore.initDeprecatedSupport WARNING solrconfig.xml uses deprecated <admin/gettableFiles>, Please update your config to use the ShowFileRequestHandler.
[junit4:junit4]   2> 3398 T14 oasc.SolrCore.initDeprecatedSupport WARNING adding ShowFileRequestHandler with hidden files: [SCHEMA.XML, OLD_SYNONYMS.TXT, STOPWORDS.TXT, PROTWORDS.TXT, OPEN-EXCHANGE-RATES.JSON, SYNONYMS.TXT, CURRENCY.XML, MAPPING-ISOLATIN1ACCENT.TXT]
[junit4:junit4]   2> 3403 T14 oass.SolrIndexSearcher.<init> Opening Searcher@131d8f75 main
[junit4:junit4]   2> 3427 T14 oasu.CommitTracker.<init> Hard AutoCommit: disabled
[junit4:junit4]   2> 3427 T14 oasu.CommitTracker.<init> Soft AutoCommit: disabled
[junit4:junit4]   2> 3429 T14 oashc.SpellCheckComponent.inform Initializing spell checkers
[junit4:junit4]   2> 3436 T14 oass.DirectSolrSpellChecker.init init: {name=direct,classname=DirectSolrSpellChecker,field=lowerfilt,minQueryLength=3}
[junit4:junit4]   2> 3489 T38 oasc.SolrCore.registerSearcher [collection1] Registered new searcher Searcher@131d8f75 main{StandardDirectoryReader(segments_1:1)}
[junit4:junit4]   2> 3500 T19 oazs.PrepRequestProcessor.pRequest Got user-level KeeperException when processing sessionid:0x139e666bb4b0002 type:create cxid:0x56 zxid:0xfffffffffffffffe txntype:unknown reqpath:n/a Error Path:/solr/overseer/queue Error:KeeperErrorCode = NoNode for /solr/overseer/queue
[junit4:junit4]   2> 3512 T14 oasc.CoreContainer.register registering core: collection1
[junit4:junit4]   2> 3513 T14 oasc.ZkController.register Register shard - core:collection1 address:http://127.0.0.1:32945/solr shardId:control_shard
[junit4:junit4]   2> 3524 T14 oascsi.HttpClientUtil.createClient Creating new http client, config:maxConnections=10000&maxConnectionsPerHost=20&connTimeout=30000&socketTimeout=30000&retry=false
[junit4:junit4]   2> 3537 T14 oascc.SolrZkClient.makePath makePath: /collections/control_collection/leader_elect/control_shard/election
[junit4:junit4]   2> 3552 T19 oazs.PrepRequestProcessor.pRequest Got user-level KeeperException when processing sessionid:0x139e666bb4b0002 type:delete cxid:0x65 zxid:0xfffffffffffffffe txntype:unknown reqpath:n/a Error Path:/solr/collections/control_collection/leaders Error:KeeperErrorCode = NoNode for /solr/collections/control_collection/leaders
[junit4:junit4]   2> 3560 T14 oasc.ShardLeaderElectionContext.runLeaderProcess Running the leader process.
[junit4:junit4]   2> 3561 T19 oazs.PrepRequestProcessor.pRequest Got user-level KeeperException when processing sessionid:0x139e666bb4b0002 type:create cxid:0x66 zxid:0xfffffffffffffffe txntype:unknown reqpath:n/a Error Path:/solr/overseer Error:KeeperErrorCode = NodeExists for /solr/overseer
[junit4:junit4]   2> 3713 T36 oascc.ZkStateReader.updateClusterState Updating cloud state from ZooKeeper... 
[junit4:junit4]   2> 3726 T19 oazs.PrepRequestProcessor.pRequest Got user-level KeeperException when processing sessionid:0x139e666bb4b0002 type:create cxid:0x6d zxid:0xfffffffffffffffe txntype:unknown reqpath:n/a Error Path:/solr/overseer/queue-work Error:KeeperErrorCode = NoNode for /solr/overseer/queue-work
[junit4:junit4]   2> 3799 T35 oascc.ZkStateReader$2.process A cluster state change has occurred - updating...
[junit4:junit4]   2> 4065 T14 oasc.ShardLeaderElectionContext.waitForReplicasToComeUp Enough replicas found to continue.
[junit4:junit4]   2> 4065 T14 oasc.ShardLeaderElectionContext.runLeaderProcess I may be the new leader - try and sync
[junit4:junit4]   2> 4066 T14 oasc.SyncStrategy.sync Sync replicas to http://127.0.0.1:32945/solr/collection1/
[junit4:junit4]   2> 4067 T14 oasc.SyncStrategy.syncReplicas Sync Success - now sync replicas to me
[junit4:junit4]   2> 4067 T14 oasc.SyncStrategy.syncToMe http://127.0.0.1:32945/solr/collection1/ has no replicas
[junit4:junit4]   2> 4068 T14 oasc.ShardLeaderElectionContext.runLeaderProcess I am the new leader: http://127.0.0.1:32945/solr/collection1/
[junit4:junit4]   2> 4068 T14 oascc.SolrZkClient.makePath makePath: /collections/control_collection/leaders/control_shard
[junit4:junit4]   2> 4100 T19 oazs.PrepRequestProcessor.pRequest Got user-level KeeperException when processing sessionid:0x139e666bb4b0002 type:create cxid:0x8b zxid:0xfffffffffffffffe txntype:unknown reqpath:n/a Error Path:/solr/overseer Error:KeeperErrorCode = NodeExists for /solr/overseer
[junit4:junit4]   2> 4349 T36 oascc.ZkStateReader.updateClusterState Updating cloud state from ZooKeeper... 
[junit4:junit4]   2> 4363 T35 oascc.ZkStateReader$2.process A cluster state change has occurred - updating...
[junit4:junit4]   2> 4416 T14 oasc.ZkController.register We are http://127.0.0.1:32945/solr/collection1/ and leader is http://127.0.0.1:32945/solr/collection1/
[junit4:junit4]   2> 4420 T14 oasc.ZkController.register No LogReplay needed for core=collection1 baseURL=http://127.0.0.1:32945/solr
[junit4:junit4]   2> 4421 T14 oasc.ZkController.checkRecovery I am the leader, no recovery necessary
[junit4:junit4]   2> 4424 T14 oascc.ZkStateReader.updateClusterState Updating cloud state from ZooKeeper... 
[junit4:junit4]   2> 4426 T14 oass.SolrDispatchFilter.init user.dir=/usr/home/hudson/hudson-slave/workspace/Lucene-Solr-Tests-trunk-java7/solr/build/solr-core/test/J1
[junit4:junit4]   2> 4427 T14 oass.SolrDispatchFilter.init SolrDispatchFilter.init() done
[junit4:junit4]   2> 4499 T14 oascsi.HttpClientUtil.createClient Creating new http client, config:maxConnections=128&maxConnectionsPerHost=32&followRedirects=false
[junit4:junit4]   2> 4694 T14 oejs.Server.doStart jetty-8.1.2.v20120308
[junit4:junit4]   2> 4698 T14 oejs.AbstractConnector.doStart Started SocketConnector@0.0.0.0:23873
[junit4:junit4]   2> 4699 T14 oasc.SolrResourceLoader.locateSolrHome JNDI not configured for solr (NoInitialContextEx)
[junit4:junit4]   2> 4699 T14 oasc.SolrResourceLoader.locateSolrHome using system property solr.solr.home: /usr/home/hudson/hudson-slave/workspace/Lucene-Solr-Tests-trunk-java7/solr/build/solr-core/test/J1/./solrtest-jetty1-1348190260161
[junit4:junit4]   2> 4700 T14 oasc.SolrResourceLoader.<init> new SolrResourceLoader for deduced Solr Home: '/usr/home/hudson/hudson-slave/workspace/Lucene-Solr-Tests-trunk-java7/solr/build/solr-core/test/J1/./solrtest-jetty1-1348190260161/'
[junit4:junit4]   2> 4746 T14 oass.SolrDispatchFilter.init SolrDispatchFilter.init()
[junit4:junit4]   2> 4746 T14 oasc.SolrResourceLoader.locateSolrHome JNDI not configured for solr (NoInitialContextEx)
[junit4:junit4]   2> 4747 T14 oasc.SolrResourceLoader.locateSolrHome using system property solr.solr.home: /usr/home/hudson/hudson-slave/workspace/Lucene-Solr-Tests-trunk-java7/solr/build/solr-core/test/J1/./solrtest-jetty1-1348190260161
[junit4:junit4]   2> 4748 T14 oasc.CoreContainer$Initializer.initialize looking for solr.xml: /usr/home/hudson/hudson-slave/workspace/Lucene-Solr-Tests-trunk-java7/solr/build/solr-core/test/J1/./solrtest-jetty1-1348190260161/solr.xml
[junit4:junit4]   2> 4749 T14 oasc.CoreContainer.<init> New CoreContainer 706873057
[junit4:junit4]   2> 4750 T14 oasc.CoreContainer.load Loading CoreContainer using Solr Home: '/usr/home/hudson/hudson-slave/workspace/Lucene-Solr-Tests-trunk-java7/solr/build/solr-core/test/J1/./solrtest-jetty1-1348190260161/'
[junit4:junit4]   2> 4751 T14 oasc.SolrResourceLoader.<init> new SolrResourceLoader for directory: '/usr/home/hudson/hudson-slave/workspace/Lucene-Solr-Tests-trunk-java7/solr/build/solr-core/test/J1/./solrtest-jetty1-1348190260161/'
[junit4:junit4]   2> 4791 T14 oasc.CoreContainer.load Registering Log Listener
[junit4:junit4]   2> 4813 T14 oasc.CoreContainer.initZooKeeper Zookeeper client=127.0.0.1:34039/solr
[junit4:junit4]   2> 4814 T14 oaz.ZooKeeper.<init> Initiating client connection, connectString=127.0.0.1:34039/solr sessionTimeout=5000 watcher=org.apache.solr.common.cloud.ConnectionManager@7a689bb1
[junit4:junit4]   2> 4816 T48 oaz.ClientCnxn$SendThread.startConnect Opening socket connection to server /127.0.0.1:34039
[junit4:junit4]   2> 4816 T14 oascc.ConnectionManager.waitForConnected Waiting for client to connect to ZooKeeper
[junit4:junit4]   2> 4818 T48 oaz.ClientCnxn$SendThread.primeConnection Socket connection established to localhost/127.0.0.1:34039, initiating session
[junit4:junit4]   2> 4818 T16 oazs.NIOServerCnxn$Factory.run Accepted socket connection from /140.211.11.196:41252
[junit4:junit4]   2> 4819 T16 oazs.NIOServerCnxn.readConnectRequest Client attempting to establish new session at /140.211.11.196:41252
[junit4:junit4]   2> 4849 T18 oazs.NIOServerCnxn.finishSessionInit Established session 0x139e666bb4b0003 with negotiated timeout 5000 for client /140.211.11.196:41252
[junit4:junit4]   2> 4849 T48 oaz.ClientCnxn$SendThread.readConnectResult Session establishment complete on server localhost/127.0.0.1:34039, sessionid = 0x139e666bb4b0003, negotiated timeout = 5000
[junit4:junit4]   2> 4851 T49 oascc.ConnectionManager.process Watcher org.apache.solr.common.cloud.ConnectionManager@7a689bb1 name:ZooKeeperConnection Watcher:127.0.0.1:34039/solr got event WatchedEvent state:SyncConnected type:None path:null path:null type:None
[junit4:junit4]   2> 4851 T14 oascc.ConnectionManager.waitForConnected Client is connected to ZooKeeper
[junit4:junit4]   2> 4853 T19 oazs.PrepRequestProcessor.pRequest Got user-level KeeperException when processing sessionid:0x139e666bb4b0003 type:create cxid:0x1 zxid:0xfffffffffffffffe txntype:unknown reqpath:n/a Error Path:/solr/overseer Error:KeeperErrorCode = NodeExists for /solr/overseer
[junit4:junit4]   2> 4860 T19 oazs.PrepRequestProcessor.pRequest Got user-level KeeperException when processing sessionid:0x139e666bb4b0003 type:create cxid:0x2 zxid:0xfffffffffffffffe txntype:unknown reqpath:n/a Error Path:/solr/overseer Error:KeeperErrorCode = NodeExists for /solr/overseer
[junit4:junit4]   2> 4862 T14 oasc.ZkController.createEphemeralLiveNode Register node as live in ZooKeeper:/live_nodes/127.0.0.1:23873_solr
[junit4:junit4]   2> 4871 T19 oazs.PrepRequestProcessor.pRequest Got user-level KeeperException when processing sessionid:0x139e666bb4b0003 type:delete cxid:0x4 zxid:0xfffffffffffffffe txntype:unknown reqpath:n/a Error Path:/solr/live_nodes/127.0.0.1:23873_solr Error:KeeperErrorCode = NoNode for /solr/live_nodes/127.0.0.1:23873_solr
[junit4:junit4]   2> 4873 T14 oascc.SolrZkClient.makePath makePath: /live_nodes/127.0.0.1:23873_solr
[junit4:junit4]   2> 4877 T35 oascc.ZkStateReader$3.process Updating live nodes
[junit4:junit4]   2> 4878 T36 oascc.ZkStateReader.updateClusterState Updating cloud state from ZooKeeper... 
[junit4:junit4]   2> 4878 T14 oashc.HttpShardHandlerFactory.getParameter Setting socketTimeout to: 0
[junit4:junit4]   2> 4879 T14 oashc.HttpShardHandlerFactory.getParameter Setting urlScheme to: http://
[junit4:junit4]   2> 4880 T14 oashc.HttpShardHandlerFactory.getParameter Setting connTimeout to: 0
[junit4:junit4]   2> 4881 T14 oashc.HttpShardHandlerFactory.getParameter Setting maxConnectionsPerHost to: 20
[junit4:junit4]   2> 4881 T14 oashc.HttpShardHandlerFactory.getParameter Setting corePoolSize to: 0
[junit4:junit4]   2> 4882 T14 oashc.HttpShardHandlerFactory.getParameter Setting maximumPoolSize to: 2147483647
[junit4:junit4]   2> 4882 T14 oashc.HttpShardHandlerFactory.getParameter Setting maxThreadIdleTime to: 5
[junit4:junit4]   2> 4883 T14 oashc.HttpShardHandlerFactory.getParameter Setting sizeOfQueue to: -1
[junit4:junit4]   2> 4883 T14 oashc.HttpShardHandlerFactory.getParameter Setting fairnessPolicy to: false
[junit4:junit4]   2> 4884 T14 oascsi.HttpClientUtil.createClient Creating new http client, config:maxConnectionsPerHost=20&maxConnections=10000&socketTimeout=0&connTimeout=0&retry=false
[junit4:junit4]   2> 4896 T35 oascc.ZkStateReader$2.process A cluster state change has occurred - updating...
[junit4:junit4]   2> 4904 T14 oascc.ZkStateReader.createClusterStateWatchersAndUpdate Updating cluster state from ZooKeeper... 
[junit4:junit4]   2> 4912 T14 oasc.CoreContainer.create Creating SolrCore 'collection1' using instanceDir: /usr/home/hudson/hudson-slave/workspace/Lucene-Solr-Tests-trunk-java7/solr/build/solr-core/test/J1/./solrtest-jetty1-1348190260161/collection1
[junit4:junit4]   2> 4912 T14 oasc.ZkController.createCollectionZkNode Check for collection zkNode:collection1
[junit4:junit4]   2> 4913 T14 oasc.ZkController.createCollectionZkNode Collection zkNode exists
[junit4:junit4]   2> 4914 T14 oasc.ZkController.readConfigName Load collection config from:/collections/collection1
[junit4:junit4]   2> 4916 T14 oasc.SolrResourceLoader.<init> new SolrResourceLoader for directory: '/usr/home/hudson/hudson-slave/workspace/Lucene-Solr-Tests-trunk-java7/solr/build/solr-core/test/J1/./solrtest-jetty1-1348190260161/collection1/'
[junit4:junit4]   2> 4917 T14 oasc.SolrResourceLoader.replaceClassLoader Adding 'file:/usr/home/hudson/hudson-slave/workspace/Lucene-Solr-Tests-trunk-java7/solr/build/solr-core/test/J1/solrtest-jetty1-1348190260161/collection1/lib/classes/' to classloader
[junit4:junit4]   2> 4918 T14 oasc.SolrResourceLoader.replaceClassLoader Adding 'file:/usr/home/hudson/hudson-slave/workspace/Lucene-Solr-Tests-trunk-java7/solr/build/solr-core/test/J1/solrtest-jetty1-1348190260161/collection1/lib/README' to classloader
[junit4:junit4]   2> 4977 T14 oasc.SolrConfig.<init> Using Lucene MatchVersion: LUCENE_50
[junit4:junit4]   2> 5040 T14 oasc.SolrConfig.<init> Loaded SolrConfig: solrconfig.xml
[junit4:junit4]   2> 5141 T14 oass.IndexSchema.readSchema Reading Solr Schema
[junit4:junit4]   2> 5182 T14 oass.IndexSchema.readSchema Schema name=test
[junit4:junit4]   2> 5779 T14 oass.OpenExchangeRatesOrgProvider.init Initialized with rates=open-exchange-rates.json, refreshInterval=1440.
[junit4:junit4]   2> 5800 T14 oass.IndexSchema.readSchema default search field in schema is text
[junit4:junit4]   2> 5805 T14 oass.IndexSchema.readSchema unique key field: id
[junit4:junit4]   2> 5877 T14 oass.FileExchangeRateProvider.reload Reloading exchange rates from file currency.xml
[junit4:junit4]   2> 5886 T14 oass.FileExchangeRateProvider.reload Reloading exchange rates from file currency.xml
[junit4:junit4]   2> 5891 T14 oass.OpenExchangeRatesOrgProvider.reload Reloading exchange rates from open-exchange-rates.json
[junit4:junit4]   2> 5895 T14 oass.OpenExchangeRatesOrgProvider.reload Reloading exchange rates from open-exchange-rates.json
[junit4:junit4]   2> 5898 T14 oasc.SolrCore.<init> [collection1] Opening new SolrCore at /usr/home/hudson/hudson-slave/workspace/Lucene-Solr-Tests-trunk-java7/solr/build/solr-core/test/J1/./solrtest-jetty1-1348190260161/collection1/, dataDir=./org.apache.solr.cloud.BasicDistributedZk2Test-1348190255652/jetty1/
[junit4:junit4]   2> 5899 T14 oasc.JmxMonitoredMap.<init> JMX monitoring is enabled. Adding Solr mbeans to JMX Server: com.sun.jmx.mbeanserver.JmxMBeanServer@1c342c15
[junit4:junit4]   2> 5900 T14 oasc.SolrCore.getNewIndexDir WARNING New index directory detected: old=null new=./org.apache.solr.cloud.BasicDistributedZk2Test-1348190255652/jetty1/index/
[junit4:junit4]   2> 5901 T14 oasc.SolrCore.initIndex WARNING [collection1] Solr index directory './org.apache.solr.cloud.BasicDistributedZk2Test-1348190255652/jetty1/index' doesn't exist. Creating new index...
[junit4:junit4]   2> 5902 T14 oasc.CachingDirectoryFactory.get return new directory for /usr/home/hudson/hudson-slave/workspace/Lucene-Solr-Tests-trunk-java7/solr/build/solr-core/test/J1/./org.apache.solr.cloud.BasicDistributedZk2Test-1348190255652/jetty1/index forceNew:false
[junit4:junit4]   2> 5911 T14 oasc.SolrDeletionPolicy.onCommit SolrDeletionPolicy.onCommit: commits:num=1
[junit4:junit4]   2> 		commit{dir=NRTCachingDirectory(org.apache.lucene.store.NIOFSDirectory@/usr/home/hudson/hudson-slave/workspace/Lucene-Solr-Tests-trunk-java7/solr/build/solr-core/test/J1/org.apache.solr.cloud.BasicDistributedZk2Test-1348190255652/jetty1/index lockFactory=org.apache.lucene.store.NativeFSLockFactory@14ee1613; maxCacheMB=48.0 maxMergeSizeMB=4.0),segFN=segments_1,generation=1,filenames=[segments_1]
[junit4:junit4]   2> 5911 T14 oasc.SolrDeletionPolicy.updateCommits newest commit = 1
[junit4:junit4]   2> 5912 T14 oasc.SolrCore.initWriters created xml: solr.XMLResponseWriter
[junit4:junit4]   2> 5916 T14 oasup.UpdateRequestProcessorChain.init inserting DistributedUpdateProcessorFactory into updateRequestProcessorChain "dedupe"
[junit4:junit4]   2> 5917 T14 oasup.UpdateRequestProcessorChain.init inserting DistributedUpdateProcessorFactory into updateRequestProcessorChain "dedupe-allfields"
[junit4:junit4]   2> 5918 T14 oasup.UpdateRequestProcessorChain.init inserting DistributedUpdateProcessorFactory into updateRequestProcessorChain "stored_sig"
[junit4:junit4]   2> 5920 T14 oasup.UpdateRequestProcessorChain.init inserting DistributedUpdateProcessorFactory into updateRequestProcessorChain "uniq-fields"
[junit4:junit4]   2> 5921 T14 oasup.UpdateRequestProcessorChain.init inserting DistributedUpdateProcessorFactory into updateRequestProcessorChain "distrib-dup-test-chain-implicit"
[junit4:junit4]   2> 5921 T14 oasc.RequestHandlers.initHandlersFromConfig adding lazy requestHandler: solr.ReplicationHandler
[junit4:junit4]   2> 5922 T14 oasc.RequestHandlers.initHandlersFromConfig created /replication: solr.ReplicationHandler
[junit4:junit4]   2> 5923 T14 oasc.RequestHandlers.initHandlersFromConfig created standard: solr.StandardRequestHandler
[junit4:junit4]   2> 5924 T14 oasc.RequestHandlers.initHandlersFromConfig created /get: solr.RealTimeGetHandler
[junit4:junit4]   2> 5926 T14 oasc.RequestHandlers.initHandlersFromConfig created dismax: solr.SearchHandler
[junit4:junit4]   2> 5927 T14 oasc.RequestHandlers.initHandlersFromConfig created mock: org.apache.solr.core.MockQuerySenderListenerReqHandler
[junit4:junit4]   2> 5928 T14 oasc.RequestHandlers.initHandlersFromConfig created /admin/: org.apache.solr.handler.admin.AdminHandlers
[junit4:junit4]   2> 5929 T14 oasc.RequestHandlers.initHandlersFromConfig created defaults: solr.StandardRequestHandler
[junit4:junit4]   2> 5930 T14 oasc.RequestHandlers.initHandlersFromConfig adding lazy requestHandler: solr.StandardRequestHandler
[junit4:junit4]   2> 5931 T14 oasc.RequestHandlers.initHandlersFromConfig created lazy: solr.StandardRequestHandler
[junit4:junit4]   2> 5932 T14 oasc.RequestHandlers.initHandlersFromConfig created /update: solr.UpdateRequestHandler
[junit4:junit4]   2> 5933 T14 oasc.RequestHandlers.initHandlersFromConfig created /terms: org.apache.solr.handler.component.SearchHandler
[junit4:junit4]   2> 5934 T14 oasc.RequestHandlers.initHandlersFromConfig created spellCheckCompRH: org.apache.solr.handler.component.SearchHandler
[junit4:junit4]   2> 5935 T14 oasc.RequestHandlers.initHandlersFromConfig created spellCheckCompRH_Direct: org.apache.solr.handler.component.SearchHandler
[junit4:junit4]   2> 5936 T14 oasc.RequestHandlers.initHandlersFromConfig created spellCheckWithWordbreak: org.apache.solr.handler.component.SearchHandler
[junit4:junit4]   2> 5937 T14 oasc.RequestHandlers.initHandlersFromConfig created spellCheckWithWordbreak_Direct: org.apache.solr.handler.component.SearchHandler
[junit4:junit4]   2> 5938 T14 oasc.RequestHandlers.initHandlersFromConfig created spellCheckCompRH1: org.apache.solr.handler.component.SearchHandler
[junit4:junit4]   2> 5939 T14 oasc.RequestHandlers.initHandlersFromConfig created tvrh: org.apache.solr.handler.component.SearchHandler
[junit4:junit4]   2> 5940 T14 oasc.RequestHandlers.initHandlersFromConfig created /mlt: solr.MoreLikeThisHandler
[junit4:junit4]   2> 5941 T14 oasc.RequestHandlers.initHandlersFromConfig created /debug/dump: solr.DumpRequestHandler
[junit4:junit4]   2> 5944 T14 oashl.XMLLoader.init xsltCacheLifetimeSeconds=60
[junit4:junit4]   2> 5948 T14 oasc.SolrCore.initDeprecatedSupport WARNING solrconfig.xml uses deprecated <admin/gettableFiles>, Please update your config to use the ShowFileRequestHandler.
[junit4:junit4]   2> 5949 T14 oasc.SolrCore.initDeprecatedSupport WARNING adding ShowFileRequestHandler with hidden files: [SCHEMA.XML, OLD_SYNONYMS.TXT, STOPWORDS.TXT, PROTWORDS.TXT, OPEN-EXCHANGE-RATES.JSON, SYNONYMS.TXT, CURRENCY.XML, MAPPING-ISOLATIN1ACCENT.TXT]
[junit4:junit4]   2> 5954 T14 oass.SolrIndexSearcher.<init> Opening Searcher@4df94bac main
[junit4:junit4]   2> 5955 T14 oasu.CommitTracker.<init> Hard AutoCommit: disabled
[junit4:junit4]   2> 5955 T14 oasu.CommitTracker.<init> Soft AutoCommit: disabled
[junit4:junit4]   2> 5957 T14 oashc.SpellCheckComponent.inform Initializing spell checkers
[junit4:junit4]   2> 5964 T14 oass.DirectSolrSpellChecker.init init: {name=direct,classname=DirectSolrSpellChecker,field=lowerfilt,minQueryLength=3}
[junit4:junit4]   2> 6050 T50 oasc.SolrCore.registerSearcher [collection1] Registered new searcher Searcher@4df94bac main{StandardDirectoryReader(segments_1:1)}
[junit4:junit4]   2> 6451 T36 oascc.ZkStateReader.updateClusterState Updating cloud state from ZooKeeper... 
[junit4:junit4]   2> 6476 T35 oascc.ZkStateReader$2.process A cluster state change has occurred - updating...
[junit4:junit4]   2> 6476 T49 oascc.ZkStateReader$2.process A cluster state change has occurred - updating...
[junit4:junit4]   2> 6568 T14 oasc.CoreContainer.register registering core: collection1
[junit4:junit4]   2> 6569 T14 oasc.ZkController.register Register shard - core:collection1 address:http://127.0.0.1:23873/solr shardId:shard1
[junit4:junit4]   2> 6570 T14 oascc.SolrZkClient.makePath makePath: /collections/collection1/leader_elect/shard1/election
[junit4:junit4]   2> 6590 T19 oazs.PrepRequestProcessor.pRequest Got user-level KeeperException when processing sessionid:0x139e666bb4b0003 type:delete cxid:0x42 zxid:0xfffffffffffffffe txntype:unknown reqpath:n/a Error Path:/solr/collections/collection1/leaders Error:KeeperErrorCode = NoNode for /solr/collections/collection1/leaders
[junit4:junit4]   2> 6591 T14 oasc.ShardLeaderElectionContext.runLeaderProcess Running the leader process.
[junit4:junit4]   2> 6592 T19 oazs.PrepRequestProcessor.pRequest Got user-level KeeperException when processing sessionid:0x139e666bb4b0003 type:create cxid:0x43 zxid:0xfffffffffffffffe txntype:unknown reqpath:n/a Error Path:/solr/overseer Error:KeeperErrorCode = NodeExists for /solr/overseer
[junit4:junit4]   2> 6603 T14 oasc.ShardLeaderElectionContext.waitForReplicasToComeUp Enough replicas found to continue.
[junit4:junit4]   2> 6603 T14 oasc.ShardLeaderElectionContext.runLeaderProcess I may be the new leader - try and sync
[junit4:junit4]   2> 6604 T14 oasc.SyncStrategy.sync Sync replicas to http://127.0.0.1:23873/solr/collection1/
[junit4:junit4]   2> 6605 T14 oasc.SyncStrategy.syncReplicas Sync Success - now sync replicas to me
[junit4:junit4]   2> 6606 T14 oasc.SyncStrategy.syncToMe http://127.0.0.1:23873/solr/collection1/ has no replicas
[junit4:junit4]   2> 6606 T14 oasc.ShardLeaderElectionContext.runLeaderProcess I am the new leader: http://127.0.0.1:23873/solr/collection1/
[junit4:junit4]   2> 6607 T14 oascc.SolrZkClient.makePath makePath: /collections/collection1/leaders/shard1
[junit4:junit4]   2> 6614 T19 oazs.PrepRequestProcessor.pRequest Got user-level KeeperException when processing sessionid:0x139e666bb4b0003 type:create cxid:0x4d zxid:0xfffffffffffffffe txntype:unknown reqpath:n/a Error Path:/solr/overseer Error:KeeperErrorCode = NodeExists for /solr/overseer
[junit4:junit4]   2> 6982 T36 oascc.ZkStateReader.updateClusterState Updating cloud state from ZooKeeper... 
[junit4:junit4]   2> 6999 T35 oascc.ZkStateReader$2.process A cluster state change has occurred - updating...
[junit4:junit4]   2> 6999 T49 oascc.ZkStateReader$2.process A cluster state change has occurred - updating...
[junit4:junit4]   2> 7031 T14 oasc.ZkController.register We are http://127.0.0.1:23873/solr/collection1/ and leader is http://127.0.0.1:23873/solr/collection1/
[junit4:junit4]   2> 7031 T14 oasc.ZkController.register No LogReplay needed for core=collection1 baseURL=http://127.0.0.1:23873/solr
[junit4:junit4]   2> 7032 T14 oasc.ZkController.checkRecovery I am the leader, no recovery necessary
[junit4:junit4]   2> 7035 T14 oascc.ZkStateReader.updateClusterState Updating cloud state from ZooKeeper... 
[junit4:junit4]   2> 7037 T14 oass.SolrDispatchFilter.init user.dir=/usr/home/hudson/hudson-slave/workspace/Lucene-Solr-Tests-trunk-java7/solr/build/solr-core/test/J1
[junit4:junit4]   2> 7038 T14 oass.SolrDispatchFilter.init SolrDispatchFilter.init() done
[junit4:junit4]   2> 7038 T14 oascsi.HttpClientUtil.createClient Creating new http client, config:maxConnections=128&maxConnectionsPerHost=32&followRedirects=false
[junit4:junit4]   2> 7234 T14 oejs.Server.doStart jetty-8.1.2.v20120308
[junit4:junit4]   2> 7238 T14 oejs.AbstractConnector.doStart Started SocketConnector@0.0.0.0:10323
[junit4:junit4]   2> 7239 T14 oasc.SolrResourceLoader.locateSolrHome JNDI not configured for solr (NoInitialContextEx)
[junit4:junit4]   2> 7239 T14 oasc.SolrResourceLoader.locateSolrHome using system property solr.solr.home: /usr/home/hudson/hudson-slave/workspace/Lucene-Solr-Tests-trunk-java7/solr/build/solr-core/test/J1/./solrtest-jetty2-1348190262695
[junit4:junit4]   2> 7240 T14 oasc.SolrResourceLoader.<init> new SolrResourceLoader for deduced Solr Home: '/usr/home/hudson/hudson-slave/workspace/Lucene-Solr-Tests-trunk-java7/solr/build/solr-core/test/J1/./solrtest-jetty2-1348190262695/'
[junit4:junit4]   2> 7291 T14 oass.SolrDispatchFilter.init SolrDispatchFilter.init()
[junit4:junit4]   2> 7292 T14 oasc.SolrResourceLoader.locateSolrHome JNDI not configured for solr (NoInitialContextEx)
[junit4:junit4]   2> 7293 T14 oasc.SolrResourceLoader.locateSolrHome using system property solr.solr.home: /usr/home/hudson/hudson-slave/workspace/Lucene-Solr-Tests-trunk-java7/solr/build/solr-core/test/J1/./solrtest-jetty2-1348190262695
[junit4:junit4]   2> 7293 T14 oasc.CoreContainer$Initializer.initialize looking for solr.xml: /usr/home/hudson/hudson-slave/workspace/Lucene-Solr-Tests-trunk-java7/solr/build/solr-core/test/J1/./solrtest-jetty2-1348190262695/solr.xml
[junit4:junit4]   2> 7294 T14 oasc.CoreContainer.<init> New CoreContainer 680584391
[junit4:junit4]   2> 7295 T14 oasc.CoreContainer.load Loading CoreContainer using Solr Home: '/usr/home/hudson/hudson-slave/workspace/Lucene-Solr-Tests-trunk-java7/solr/build/solr-core/test/J1/./solrtest-jetty2-1348190262695/'
[junit4:junit4]   2> 7296 T14 oasc.SolrResourceLoader.<init> new SolrResourceLoader for directory: '/usr/home/hudson/hudson-slave/workspace/Lucene-Solr-Tests-trunk-java7/solr/build/solr-core/test/J1/./solrtest-jetty2-1348190262695/'
[junit4:junit4]   2> 7336 T14 oasc.CoreContainer.load Registering Log Listener
[junit4:junit4]   2> 7358 T14 oasc.CoreContainer.initZooKeeper Zookeeper client=127.0.0.1:34039/solr
[junit4:junit4]   2> 7359 T14 oaz.ZooKeeper.<init> Initiating client connection, connectString=127.0.0.1:34039/solr sessionTimeout=5000 watcher=org.apache.solr.common.cloud.ConnectionManager@3f2e1584
[junit4:junit4]   2> 7360 T60 oaz.ClientCnxn$SendThread.startConnect Opening socket connection to server /127.0.0.1:34039
[junit4:junit4]   2> 7360 T14 oascc.ConnectionManager.waitForConnected Waiting for client to connect to ZooKeeper
[junit4:junit4]   2> 7362 T60 oaz.ClientCnxn$SendThread.primeConnection Socket connection established to localhost/127.0.0.1:34039, initiating session
[junit4:junit4]   2> 7362 T16 oazs.NIOServerCnxn$Factory.run Accepted socket connection from /140.211.11.196:37822
[junit4:junit4]   2> 7363 T16 oazs.NIOServerCnxn.readConnectRequest Client attempting to establish new session at /140.211.11.196:37822
[junit4:junit4]   2> 7365 T18 oazs.NIOServerCnxn.finishSessionInit Established session 0x139e666bb4b0004 with negotiated timeout 5000 for client /140.211.11.196:37822
[junit4:junit4]   2> 7365 T60 oaz.ClientCnxn$SendThread.readConnectResult Session establishment complete on server localhost/127.0.0.1:34039, sessionid = 0x139e666bb4b0004, negotiated timeout = 5000
[junit4:junit4]   2> 7366 T61 oascc.ConnectionManager.process Watcher org.apache.solr.common.cloud.ConnectionManager@3f2e1584 name:ZooKeeperConnection Watcher:127.0.0.1:34039/solr got event WatchedEvent state:SyncConnected type:None path:null path:null type:None
[junit4:junit4]   2> 7367 T14 oascc.ConnectionManager.waitForConnected Client is connected to ZooKeeper
[junit4:junit4]   2> 7368 T19 oazs.PrepRequestProcessor.pRequest Got user-level KeeperException when processing sessionid:0x139e666bb4b0004 type:create cxid:0x1 zxid:0xfffffffffffffffe txntype:unknown reqpath:n/a Error Path:/solr/overseer Error:KeeperErrorCode = NodeExists for /solr/overseer
[junit4:junit4]   2> 7370 T19 oazs.PrepRequestProcessor.pRequest Got user-level KeeperException when processing sessionid:0x139e666bb4b0004 type:create cxid:0x2 zxid:0xfffffffffffffffe txntype:unknown reqpath:n/a Error Path:/solr/overseer Error:KeeperErrorCode = NodeExists for /solr/overseer
[junit4:junit4]   2> 7379 T14 oasc.ZkController.createEphemeralLiveNode Register node as live in ZooKeeper:/live_nodes/127.0.0.1:10323_solr
[junit4:junit4]   2> 7380 T19 oazs.PrepRequestProcessor.pRequest Got user-level KeeperException when processing sessionid:0x139e666bb4b0004 type:delete cxid:0x4 zxid:0xfffffffffffffffe txntype:unknown reqpath:n/a Error Path:/solr/live_nodes/127.0.0.1:10323_solr Error:KeeperErrorCode = NoNode for /solr/live_nodes/127.0.0.1:10323_solr
[junit4:junit4]   2> 7381 T14 oascc.SolrZkClient.makePath makePath: /live_nodes/127.0.0.1:10323_solr
[junit4:junit4]   2> 7384 T35 oascc.ZkStateReader$3.process Updating live nodes
[junit4:junit4]   2> 7384 T49 oascc.ZkStateReader$3.process Updating live nodes
[junit4:junit4]   2> 7385 T14 oashc.HttpShardHandlerFactory.getParameter Setting socketTimeout to: 0
[junit4:junit4]   2> 7386 T14 oashc.HttpShardHandlerFactory.getParameter Setting urlScheme to: http://
[junit4:junit4]   2> 7387 T14 oashc.HttpShardHandlerFactory.getParameter Setting connTimeout to: 0
[junit4:junit4]   2> 7387 T14 oashc.HttpShardHandlerFactory.getParameter Setting maxConnectionsPerHost to: 20
[junit4:junit4]   2> 7388 T14 oashc.HttpShardHandlerFactory.getParameter Setting corePoolSize to: 0
[junit4:junit4]   2> 7389 T14 oashc.HttpShardHandlerFactory.getParameter Setting maximumPoolSize to: 2147483647
[junit4:junit4]   2> 7390 T14 oashc.HttpShardHandlerFactory.getParameter Setting maxThreadIdleTime to: 5
[junit4:junit4]   2> 7390 T14 oashc.HttpShardHandlerFactory.getParameter Setting sizeOfQueue to: -1
[junit4:junit4]   2> 7391 T14 oashc.HttpShardHandlerFactory.getParameter Setting fairnessPolicy to: false
[junit4:junit4]   2> 7392 T14 oascsi.HttpClientUtil.createClient Creating new http client, config:maxConnectionsPerHost=20&maxConnections=10000&socketTimeout=0&connTimeout=0&retry=false
[junit4:junit4]   2> 7415 T14 oascc.ZkStateReader.createClusterStateWatchersAndUpdate Updating cluster state from ZooKeeper... 
[junit4:junit4]   2> 7424 T14 oasc.CoreContainer.create Creating SolrCore 'collection1' using instanceDir: /usr/home/hudson/hudson-slave/workspace/Lucene-Solr-Tests-trunk-java7/solr/build/solr-core/test/J1/./solrtest-jetty2-1348190262695/collection1
[junit4:junit4]   2> 7425 T14 oasc.ZkController.createCollectionZkNode Check for collection zkNode:collection1
[junit4:junit4]   2> 7426 T14 oasc.ZkController.createCollectionZkNode Collection zkNode exists
[junit4:junit4]   2> 7427 T14 oasc.ZkController.readConfigName Load collection config from:/collections/collection1
[junit4:junit4]   2> 7429 T14 oasc.SolrResourceLoader.<init> new SolrResourceLoader for directory: '/usr/home/hudson/hudson-slave/workspace/Lucene-Solr-Tests-trunk-java7/solr/build/solr-core/test/J1/./solrtest-jetty2-1348190262695/collection1/'
[junit4:junit4]   2> 7431 T14 oasc.SolrResourceLoader.replaceClassLoader Adding 'file:/usr/home/hudson/hudson-slave/workspace/Lucene-Solr-Tests-trunk-java7/solr/build/solr-core/test/J1/solrtest-jetty2-1348190262695/collection1/lib/classes/' to classloader
[junit4:junit4]   2> 7432 T14 oasc.SolrResourceLoader.replaceClassLoader Adding 'file:/usr/home/hudson/hudson-slave/workspace/Lucene-Solr-Tests-trunk-java7/solr/build/solr-core/test/J1/solrtest-jetty2-1348190262695/collection1/lib/README' to classloader
[junit4:junit4]   2> 7518 T14 oasc.SolrConfig.<init> Using Lucene MatchVersion: LUCENE_50
[junit4:junit4]   2> 7532 T36 oascc.ZkStateReader.updateClusterState Updating cloud state from ZooKeeper... 
[junit4:junit4]   2> 7548 T61 oascc.ZkStateReader$2.process A cluster state change has occurred - updating...
[junit4:junit4]   2> 7548 T35 oascc.ZkStateReader$2.process A cluster state change has occurred - updating...
[junit4:junit4]   2> 7548 T49 oascc.ZkStateReader$2.process A cluster state change has occurred - updating...
[junit4:junit4]   2> 7615 T14 oasc.SolrConfig.<init> Loaded SolrConfig: solrconfig.xml
[junit4:junit4]   2> 7716 T14 oass.IndexSchema.readSchema Reading Solr Schema
[junit4:junit4]   2> 7761 T14 oass.IndexSchema.readSchema Schema name=test
[junit4:junit4]   2> 8525 T14 oass.OpenExchangeRatesOrgProvider.init Initialized with rates=open-exchange-rates.json, refreshInterval=1440.
[junit4:junit4]   2> 8538 T14 oass.IndexSchema.readSchema default search field in schema is text
[junit4:junit4]   2> 8542 T14 oass.IndexSchema.readSchema unique key field: id
[junit4:junit4]   2> 8569 T14 oass.FileExchangeRateProvider.reload Reloading exchange rates from file currency.xml
[junit4:junit4]   2> 8575 T14 oass.FileExchangeRateProvider.reload Reloading exchange rates from file currency.xml
[junit4:junit4]   2> 8580 T14 oass.OpenExchangeRatesOrgProvider.reload Reloading exchange rates from open-exchange-rates.json
[junit4:junit4]   2> 8583 T14 oass.OpenExchangeRatesOrgProvider.reload Reloading exchange rates from open-exchange-rates.json
[junit4:junit4]   2> 8586 T14 oasc.SolrCore.<init> [collection1] Opening new SolrCore at /usr/home/hudson/hudson-slave/workspace/Lucene-Solr-Tests-trunk-java7/solr/build/solr-core/test/J1/./solrtest-jetty2-1348190262695/collection1/, dataDir=./org.apache.solr.cloud.BasicDistributedZk2Test-1348190255652/jetty2/
[junit4:junit4]   2> 8587 T14 oasc.JmxMonitoredMap.<init> JMX monitoring is enabled. Adding Solr mbeans to JMX Server: com.sun.jmx.mbeanserver.JmxMBeanServer@1c342c15
[junit4:junit4]   2> 8588 T14 oasc.SolrCore.getNewIndexDir WARNING New index directory detected: old=null new=./org.apache.solr.cloud.BasicDistributedZk2Test-1348190255652/jetty2/index/
[junit4:junit4]   2> 8589 T14 oasc.SolrCore.initIndex WARNING [collection1] Solr index directory './org.apache.solr.cloud.BasicDistributedZk2Test-1348190255652/jetty2/index' doesn't exist. Creating new index...
[junit4:junit4]   2> 8590 T14 oasc.CachingDirectoryFactory.get return new directory for /usr/home/hudson/hudson-slave/workspace/Lucene-Solr-Tests-trunk-java7/solr/build/solr-core/test/J1/./org.apache.solr.cloud.BasicDistributedZk2Test-1348190255652/jetty2/index forceNew:false
[junit4:junit4]   2> 8596 T14 oasc.SolrDeletionPolicy.onCommit SolrDeletionPolicy.onCommit: commits:num=1
[junit4:junit4]   2> 		commit{dir=NRTCachingDirectory(org.apache.lucene.store.NIOFSDirectory@/usr/home/hudson/hudson-slave/workspace/Lucene-Solr-Tests-trunk-java7/solr/build/solr-core/test/J1/org.apache.solr.cloud.BasicDistributedZk2Test-1348190255652/jetty2/index lockFactory=org.apache.lucene.store.NativeFSLockFactory@1ece5b86; maxCacheMB=48.0 maxMergeSizeMB=4.0),segFN=segments_1,generation=1,filenames=[segments_1]
[junit4:junit4]   2> 8596 T14 oasc.SolrDeletionPolicy.updateCommits newest commit = 1
[junit4:junit4]   2> 8597 T14 oasc.SolrCore.initWriters created xml: solr.XMLResponseWriter
[junit4:junit4]   2> 8601 T14 oasup.UpdateRequestProcessorChain.init inserting DistributedUpdateProcessorFactory into updateRequestProcessorChain "dedupe"
[junit4:junit4]   2> 8601 T14 oasup.UpdateRequestProcessorChain.init inserting DistributedUpdateProcessorFactory into updateRequestProcessorChain "dedupe-allfields"
[junit4:junit4]   2> 8602 T14 oasup.UpdateRequestProcessorChain.init inserting DistributedUpdateProcessorFactory into updateRequestProcessorChain "stored_sig"
[junit4:junit4]   2> 8602 T14 oasup.UpdateRequestProcessorChain.init inserting DistributedUpdateProcessorFactory into updateRequestProcessorChain "uniq-fields"
[junit4:junit4]   2> 8604 T14 oasup.UpdateRequestProcessorChain.init inserting DistributedUpdateProcessorFactory into updateRequestProcessorChain "distrib-dup-test-chain-implicit"
[junit4:junit4]   2> 8604 T14 oasc.RequestHandlers.initHandlersFromConfig adding lazy requestHandler: solr.ReplicationHandler
[junit4:junit4]   2> 8605 T14 oasc.RequestHandlers.initHandlersFromConfig created /replication: solr.ReplicationHandler
[junit4:junit4]   2> 8606 T14 oasc.RequestHandlers.initHandlersFromConfig created standard: solr.StandardRequestHandler
[junit4:junit4]   2> 8607 T14 oasc.RequestHandlers.initHandlersFromConfig created /get: solr.RealTimeGetHandler
[junit4:junit4]   2> 8608 T14 oasc.RequestHandlers.initHandlersFromConfig created dismax: solr.SearchHandler
[junit4:junit4]   2> 8609 T14 oasc.RequestHandlers.initHandlersFromConfig created mock: org.apache.solr.core.MockQuerySenderListenerReqHandler
[junit4:junit4]   2> 8610 T14 oasc.RequestHandlers.initHandlersFromConfig created /admin/: org.apache.solr.handler.admin.AdminHandlers
[junit4:junit4]   2> 8611 T14 oasc.RequestHandlers.initHandlersFromConfig created defaults: solr.StandardRequestHandler
[junit4:junit4]   2> 8611 T14 oasc.RequestHandlers.initHandlersFromConfig adding lazy requestHandler: solr.StandardRequestHandler
[junit4:junit4]   2> 8612 T14 oasc.RequestHandlers.initHandlersFromConfig created lazy: solr.StandardRequestHandler
[junit4:junit4]   2> 8613 T14 oasc.RequestHandlers.initHandlersFromConfig created /update: solr.UpdateRequestHandler
[junit4:junit4]   2> 8614 T14 oasc.RequestHandlers.initHandlersFromConfig created /terms: org.apache.solr.handler.component.SearchHandler
[junit4:junit4]   2> 8615 T14 oasc.RequestHandlers.initHandlersFromConfig created spellCheckCompRH: org.apache.solr.handler.component.SearchHandler
[junit4:junit4]   2> 8616 T14 oasc.RequestHandlers.initHandlersFromConfig created spellCheckCompRH_Direct: org.apache.solr.handler.component.SearchHandler
[junit4:junit4]   2> 8617 T14 oasc.RequestHandlers.initHandlersFromConfig created spellCheckWithWordbreak: org.apache.solr.handler.component.SearchHandler
[junit4:junit4]   2> 8618 T14 oasc.RequestHandlers.initHandlersFromConfig created spellCheckWithWordbreak_Direct: org.apache.solr.handler.component.SearchHandler
[junit4:junit4]   2> 8619 T14 oasc.RequestHandlers.initHandlersFromConfig created spellCheckCompRH1: org.apache.solr.handler.component.SearchHandler
[junit4:junit4]   2> 8620 T14 oasc.RequestHandlers.initHandlersFromConfig created tvrh: org.apache.solr.handler.component.SearchHandler
[junit4:junit4]   2> 8621 T14 oasc.RequestHandlers.initHandlersFromConfig created /mlt: solr.MoreLikeThisHandler
[junit4:junit4]   2> 8622 T14 oasc.RequestHandlers.initHandlersFromConfig created /debug/dump: solr.DumpRequestHandler
[junit4:junit4]   2> 8625 T14 oashl.XMLLoader.init xsltCacheLifetimeSeconds=60
[junit4:junit4]   2> 8629 T14 oasc.SolrCore.initDeprecatedSupport WARNING solrconfig.xml uses deprecated <admin/gettableFiles>, Please update your config to use the ShowFileRequestHandler.
[junit4:junit4]   2> 8631 T14 oasc.SolrCore.initDeprecatedSupport WARNING adding ShowFileRequestHandler with hidden files: [SCHEMA.XML, OLD_SYNONYMS.TXT, STOPWORDS.TXT, PROTWORDS.TXT, OPEN-EXCHANGE-RATES.JSON, SYNONYMS.TXT, CURRENCY.XML, MAPPING-ISOLATIN1ACCENT.TXT]
[junit4:junit4]   2> 8635 T14 oass.SolrIndexSearcher.<init> Opening Searcher@5378b9ed main
[junit4:junit4]   2> 8636 T14 oasu.CommitTracker.<init> Hard AutoCommit: disabled
[junit4:junit4]   2> 8637 T14 oasu.CommitTracker.<init> Soft AutoCommit: disabled
[junit4:junit4]   2> 8638 T14 oashc.SpellCheckComponent.inform Initializing spell checkers
[junit4:junit4]   2> 8697 T14 oass.DirectSolrSpellChecker.init init: {name=direct,classname=DirectSolrSpellChecker,field=lowerfilt,minQueryLength=3}
[junit4:junit4]   2> 8840 T62 oasc.SolrCore.registerSearcher [collection1] Registered new searcher Searcher@5378b9ed main{StandardDirectoryReader(segments_1:1)}
[junit4:junit4]   2> 9060 T36 oascc.ZkStateReader.updateClusterState Updating cloud state from ZooKeeper... 
[junit4:junit4]   2> 9076 T49 oascc.ZkStateReader$2.process A cluster state change has occurred - updating...
[junit4:junit4]   2> 9076 T35 oascc.ZkStateReader$2.process A cluster state change has occurred - updating...
[junit4:junit4]   2> 9076 T61 oascc.ZkStateReader$2.process A cluster state change has occurred - updating...
[junit4:junit4]   2> 9380 T14 oasc.CoreContainer.register registering core: collection1
[junit4:junit4]   2> 9380 T14 oasc.ZkController.register Register shard - core:collection1 address:http://127.0.0.1:10323/solr shardId:shard2
[junit4:junit4]   2> 9382 T14 oascc.SolrZkClient.makePath makePath: /collections/collection1/leader_elect/shard2/election
[junit4:junit4]   2> 9401 T19 oazs.PrepRequestProcessor.pRequest Got user-level KeeperException when processing sessionid:0x139e666bb4b0004 type:delete cxid:0x42 zxid:0xfffffffffffffffe txntype:unknown reqpath:n/a Error Path:/solr/collections/collection1/leaders/shard2 Error:KeeperErrorCode = NoNode for /solr/collections/collection1/leaders/shard2
[junit4:junit4]   2> 9402 T14 oasc.ShardLeaderElectionContext.runLeaderProcess Running the leader process.
[junit4:junit4]   2> 9403 T19 oazs.PrepRequestProcessor.pRequest Got user-level KeeperException when processing sessionid:0x139e666bb4b0004 type:create cxid:0x43 zxid:0xfffffffffffffffe txntype:unknown reqpath:n/a Error Path:/solr/overseer Error:KeeperErrorCode = NodeExists for /solr/overseer
[junit4:junit4]   2> 9406 T14 oasc.ShardLeaderElectionContext.waitForReplicasToComeUp Enough replicas found to continue.
[junit4:junit4]   2> 9407 T14 oasc.ShardLeaderElectionContext.runLeaderProcess I may be the new leader - try and sync
[junit4:junit4]   2> 9407 T14 oasc.SyncStrategy.sync Sync replicas to http://127.0.0.1:10323/solr/collection1/
[junit4:junit4]   2> 9408 T14 oasc.SyncStrategy.syncReplicas Sync Success - now sync replicas to me
[junit4:junit4]   2> 9409 T14 oasc.SyncStrategy.syncToMe http://127.0.0.1:10323/solr/collection1/ has no replicas
[junit4:junit4]   2> 9409 T14 oasc.ShardLeaderElectionContext.runLeaderProcess I am the new leader: http://127.0.0.1:10323/solr/collection1/
[junit4:junit4]   2> 9410 T14 oascc.SolrZkClient.makePath makePath: /collections/collection1/leaders/shard2
[junit4:junit4]   2> 9415 T19 oazs.PrepRequestProcessor.pRequest Got user-level KeeperException when processing sessionid:0x139e666bb4b0004 type:create cxid:0x4c zxid:0xfffffffffffffffe txntype:unknown reqpath:n/a Error Path:/solr/overseer Error:KeeperErrorCode = NodeExists for /solr/overseer
[junit4:junit4]   2> 9590 T36 oascc.ZkStateReader.updateClusterState Updating cloud state from ZooKeeper... 
[junit4:junit4]   2> 9608 T35 oascc.ZkStateReader$2.process A cluster state change has occurred - updating...
[junit4:junit4]   2> 9608 T61 oascc.ZkStateReader$2.process A cluster state change has occurred - updating...
[junit4:junit4]   2> 9608 T49 oascc.ZkStateReader$2.process A cluster state change has occurred - updating...
[junit4:junit4]   2> 9621 T14 oasc.ZkController.register We are http://127.0.0.1:10323/solr/collection1/ and leader is http://127.0.0.1:10323/solr/collection1/
[junit4:junit4]   2> 9621 T14 oasc.ZkController.register No LogReplay needed for core=collection1 baseURL=http://127.0.0.1:10323/solr
[junit4:junit4]   2> 9622 T14 oasc.ZkController.checkRecovery I am the leader, no recovery necessary
[junit4:junit4]   2> 9656 T14 oascc.ZkStateReader.updateClusterState Updating cloud state from ZooKeeper... 
[junit4:junit4]   2> 9658 T14 oass.SolrDispatchFilter.init user.dir=/usr/home/hudson/hudson-slave/workspace/Lucene-Solr-Tests-trunk-java7/solr/build/solr-core/test/J1
[junit4:junit4]   2> 9658 T14 oass.SolrDispatchFilter.init SolrDispatchFilter.init() done
[junit4:junit4]   2> 9659 T14 oascsi.HttpClientUtil.createClient Creating new http client, config:maxConnections=128&maxConnectionsPerHost=32&followRedirects=false
[junit4:junit4]   2> 9793 T14 oejs.Server.doStart jetty-8.1.2.v20120308
[junit4:junit4]   2> 9796 T14 oejs.AbstractConnector.doStart Started SocketConnector@0.0.0.0:47711
[junit4:junit4]   2> 9797 T14 oasc.SolrResourceLoader.locateSolrHome JNDI not configured for solr (NoInitialContextEx)
[junit4:junit4]   2> 9797 T14 oasc.SolrResourceLoader.locateSolrHome using system property solr.solr.home: /usr/home/hudson/hudson-slave/workspace/Lucene-Solr-Tests-trunk-java7/solr/build/solr-core/test/J1/./solrtest-jetty3-1348190265308
[junit4:junit4]   2> 9798 T14 oasc.SolrResourceLoader.<init> new SolrResourceLoader for deduced Solr Home: '/usr/home/hudson/hudson-slave/workspace/Lucene-Solr-Tests-trunk-java7/solr/build/solr-core/test/J1/./solrtest-jetty3-1348190265308/'
[junit4:junit4]   2> 9831 T14 oass.SolrDispatchFilter.init SolrDispatchFilter.init()
[junit4:junit4]   2> 9832 T14 oasc.SolrResourceLoader.locateSolrHome JNDI not configured for solr (NoInitialContextEx)
[junit4:junit4]   2> 9832 T14 oasc.SolrResourceLoader.locateSolrHome using system property solr.solr.home: /usr/home/hudson/hudson-slave/workspace/Lucene-Solr-Tests-trunk-java7/solr/build/solr-core/test/J1/./solrtest-jetty3-1348190265308
[junit4:junit4]   2> 9833 T14 oasc.CoreContainer$Initializer.initialize looking for solr.xml: /usr/home/hudson/hudson-slave/workspace/Lucene-Solr-Tests-trunk-java7/solr/build/solr-core/test/J1/./solrtest-jetty3-1348190265308/solr.xml
[junit4:junit4]   2> 9833 T14 oasc.CoreContainer.<init> New CoreContainer 1275546637
[junit4:junit4]   2> 9834 T14 oasc.CoreContainer.load Loading CoreContainer using Solr Home: '/usr/home/hudson/hudson-slave/workspace/Lucene-Solr-Tests-trunk-java7/solr/build/solr-core/test/J1/./solrtest-jetty3-1348190265308/'
[junit4:junit4]   2> 9834 T14 oasc.SolrResourceLoader.<init> new SolrResourceLoader for directory: '/usr/home/hudson/hudson-slave/workspace/Lucene-Solr-Tests-trunk-java7/solr/build/solr-core/test/J1/./solrtest-jetty3-1348190265308/'
[junit4:junit4]   2> 9862 T14 oasc.CoreContainer.load Registering Log Listener
[junit4:junit4]   2> 9876 T14 oasc.CoreContainer.initZooKeeper Zookeeper client=127.0.0.1:34039/solr
[junit4:junit4]   2> 9877 T14 oaz.ZooKeeper.<init> Initiating client connection, connectString=127.0.0.1:34039/solr sessionTimeout=5000 watcher=org.apache.solr.common.cloud.ConnectionManager@1d0b98ef
[junit4:junit4]   2> 9878 T72 oaz.ClientCnxn$SendThread.startConnect Opening socket connection to server /127.0.0.1:34039
[junit4:junit4]   2> 9878 T14 oascc.ConnectionManager.waitForConnected Waiting for client to connect to ZooKeeper
[junit4:junit4]   2> 9879 T72 oaz.ClientCnxn$SendThread.primeConnection Socket connection established to localhost/127.0.0.1:34039, initiating session
[junit4:junit4]   2> 9879 T16 oazs.NIOServerCnxn$Factory.run Accepted socket connection from /140.211.11.196:12851
[junit4:junit4]   2> 9880 T16 oazs.NIOServerCnxn.readConnectRequest Client attempting to establish new session at /140.211.11.196:12851
[junit4:junit4]   2> 9883 T18 oazs.NIOServerCnxn.finishSessionInit Established session 0x139e666bb4b0005 with negotiated timeout 5000 for client /140.211.11.196:12851
[junit4:junit4]   2> 9883 T72 oaz.ClientCnxn$SendThread.readConnectResult Session establishment complete on server localhost/127.0.0.1:34039, sessionid = 0x139e666bb4b0005, negotiated timeout = 5000
[junit4:junit4]   2> 9884 T73 oascc.ConnectionManager.process Watcher org.apache.solr.common.cloud.ConnectionManager@1d0b98ef name:ZooKeeperConnection Watcher:127.0.0.1:34039/solr got event WatchedEvent state:SyncConnected type:None path:null path:null type:None
[junit4:junit4]   2> 9884 T14 oascc.ConnectionManager.waitForConnected Client is connected to ZooKeeper
[junit4:junit4]   2> 9885 T19 oazs.PrepRequestProcessor.pRequest Got user-level KeeperException when processing sessionid:0x139e666bb4b0005 type:create cxid:0x1 zxid:0xfffffffffffffffe txntype:unknown reqpath:n/a Error Path:/solr/overseer Error:KeeperErrorCode = NodeExists for /solr/overseer
[junit4:junit4]   2> 9898 T19 oazs.PrepRequestProcessor.pRequest Got user-level KeeperException when processing sessionid:0x139e666bb4b0005 type:create cxid:0x2 zxid:0xfffffffffffffffe txntype:unknown reqpath:n/a Error Path:/solr/overseer Error:KeeperErrorCode = NodeExists for /solr/overseer
[junit4:junit4]   2> 9900 T14 oasc.ZkController.createEphemeralLiveNode Register node as live in ZooKeeper:/live_nodes/127.0.0.1:47711_solr
[junit4:junit4]   2> 9901 T19 oazs.PrepRequestProcessor.pRequest Got user-level KeeperException when processing sessionid:0x139e666bb4b0005 type:delete cxid:0x4 zxid:0xfffffffffffffffe txntype:unknown reqpath:n/a Error Path:/solr/live_nodes/127.0.0.1:47711_solr Error:KeeperErrorCode = NoNode for /solr/live_nodes/127.0.0.1:47711_solr
[junit4:junit4]   2> 9902 T14 oascc.SolrZkClient.makePath makePath: /live_nodes/127.0.0.1:47711_solr
[junit4:junit4]   2> 9911 T61 oascc.ZkStateReader$3.process Updating live nodes
[junit4:junit4]   2> 9911 T49 oascc.ZkStateReader$3.process Updating live nodes
[junit4:junit4]   2> 9911 T35 oascc.ZkStateReader$3.process Updating live nodes
[junit4:junit4]   2> 9913 T14 oashc.HttpShardHandlerFactory.getParameter Setting socketTimeout to: 0
[junit4:junit4]   2> 9913 T14 oashc.HttpShardHandlerFactory.getParameter Setting urlScheme to: http://
[junit4:junit4]   2> 9914 T14 oashc.HttpShardHandlerFactory.getParameter Setting connTimeout to: 0
[junit4:junit4]   2> 9914 T14 oashc.HttpShardHandlerFactory.getParameter Setting maxConnectionsPerHost to: 20
[junit4:junit4]   2> 9915 T14 oashc.HttpShardHandlerFactory.getParameter Setting corePoolSize to: 0
[junit4:junit4]   2> 9915 T14 oashc.HttpShardHandlerFactory.getParameter Setting maximumPoolSize to: 2147483647
[junit4:junit4]   2> 9916 T14 oashc.HttpShardHandlerFactory.getParameter Setting maxThreadIdleTime to: 5
[junit4:junit4]   2> 9916 T14 oashc.HttpShardHandlerFactory.getParameter Setting sizeOfQueue to: -1
[junit4:junit4]   2> 9917 T14 oashc.HttpShardHandlerFactory.getParameter Setting fairnessPolicy to: false
[junit4:junit4]   2> 9917 T14 oascsi.HttpClientUtil.createClient Creating new http client, config:maxConnectionsPerHost=20&maxConnections=10000&socketTimeout=0&connTimeout=0&retry=false
[junit4:junit4]   2> 9941 T14 oascc.ZkStateReader.createClusterStateWatchersAndUpdate Updating cluster state from ZooKeeper... 
[junit4:junit4]   2> 9948 T14 oasc.CoreContainer.create Creating SolrCore 'collection1' using instanceDir: /usr/home/hudson/hudson-slave/workspace/Lucene-Solr-Tests-trunk-java7/solr/build/solr-core/test/J1/./solrtest-jetty3-1348190265308/collection1
[junit4:junit4]   2> 9949 T14 oasc.ZkController.createCollectionZkNode Check for collection zkNode:collection1
[junit4:junit4]   2> 9950 T14 oasc.ZkController.createCollectionZkNode Collection zkNode exists
[junit4:junit4]   2> 9950 T14 oasc.ZkController.readConfigName Load collection config from:/collections/collection1
[junit4:junit4]   2> 9952 T14 oasc.SolrResourceLoader.<init> new SolrResourceLoader for directory: '/usr/home/hudson/hudson-slave/workspace/Lucene-Solr-Tests-trunk-java7/solr/build/solr-core/test/J1/./solrtest-jetty3-1348190265308/collection1/'
[junit4:junit4]   2> 9953 T14 oasc.SolrResourceLoader.replaceClassLoader Adding 'file:/usr/home/hudson/hudson-slave/workspace/Lucene-Solr-Tests-trunk-java7/solr/build/solr-core/test/J1/solrtest-jetty3-1348190265308/collection1/lib/classes/' to classloader
[junit4:junit4]   2> 9954 T14 oasc.SolrResourceLoader.replaceClassLoader Adding 'file:/usr/home/hudson/hudson-slave/workspace/Lucene-Solr-Tests-trunk-java7/solr/build/solr-core/test/J1/solrtest-jetty3-1348190265308/collection1/lib/README' to classloader
[junit4:junit4]   2> 10012 T14 oasc.SolrConfig.<init> Using Lucene MatchVersion: LUCENE_50
[junit4:junit4]   2> 10074 T14 oasc.SolrConfig.<init> Loaded SolrConfig: solrconfig.xml
[junit4:junit4]   2> 10123 T36 oascc.ZkStateReader.updateClusterState Updating cloud state from ZooKeeper... 
[junit4:junit4]   2> 10137 T35 oascc.ZkStateReader$2.process A cluster state change has occurred - updating...
[junit4:junit4]   2> 10137 T49 oascc.ZkStateReader$2.process A cluster state change has occurred - updating...
[junit4:junit4]   2> 10137 T61 oascc.ZkStateReader$2.process A cluster state change has occurred - updating...
[junit4:junit4]   2> 10175 T73 oascc.ZkStateReader$2.process A cluster state change has occurred - updating...
[junit4:junit4]   2> 10175 T14 oass.IndexSchema.readSchema Reading Solr Schema
[junit4:junit4]   2> 10199 T14 oass.IndexSchema.readSchema Schema name=test
[junit4:junit4]   2> 10738 T14 oass.OpenExchangeRatesOrgProvider.init Initialized with rates=open-exchange-rates.json, refreshInterval=1440.
[junit4:junit4]   2> 10752 T14 oass.IndexSchema.readSchema default search field in schema is text
[junit4:junit4]   2> 10755 T14 oass.IndexSchema.readSchema unique key field: id
[junit4:junit4]   2> 10779 T14 oass.FileExchangeRateProvider.reload Reloading exchange rates from file currency.xml
[junit4:junit4]   2> 10785 T14 oass.FileExchangeRateProvider.reload Reloading exchange rates from file currency.xml
[junit4:junit4]   2> 10792 T14 oass.OpenExchangeRatesOrgProvider.reload Reloading exchange rates from open-exchange-rates.json
[junit4:junit4]   2> 10797 T14 oass.OpenExchangeRatesOrgProvider.reload Reloading exchange rates from open-exchange-rates.json
[junit4:junit4]   2> 10799 T14 oasc.SolrCore.<init> [collection1] Opening new SolrCore at /usr/home/hudson/hudson-slave/workspace/Lucene-Solr-Tests-trunk-java7/solr/build/solr-core/test/J1/./solrtest-jetty3-1348190265308/collection1/, dataDir=./org.apache.solr.cloud.BasicDistributedZk2Test-1348190255652/jetty3/
[junit4:junit4]   2> 10800 T14 oasc.JmxMonitoredMap.<init> JMX monitoring is enabled. Adding Solr mbeans to JMX Server: com.sun.jmx.mbeanserver.JmxMBeanServer@1c342c15
[junit4:junit4]   2> 10801 T14 oasc.SolrCore.getNewIndexDir WARNING New index directory detected: old=null new=./org.apache.solr.cloud.BasicDistributedZk2Test-1348190255652/jetty3/index/
[junit4:junit4]   2> 10802 T14 oasc.SolrCore.initIndex WARNING [collection1] Solr index directory './org.apache.solr.cloud.BasicDistributedZk2Test-1348190255652/jetty3/index' doesn't exist. Creating new index...
[junit4:junit4]   2> 10803 T14 oasc.CachingDirectoryFactory.get return new directory for /usr/home/hudson/hudson-slave/workspace/Lucene-Solr-Tests-trunk-java7/solr/build/solr-core/test/J1/./org.apache.solr.cloud.BasicDistributedZk2Test-1348190255652/jetty3/index forceNew:false
[junit4:junit4]   2> 10819 T14 oasc.SolrDeletionPolicy.onCommit SolrDeletionPolicy.onCommit: commits:num=1
[junit4:junit4]   2> 		commit{dir=NRTCachingDirectory(org.apache.lucene.store.NIOFSDirectory@/usr/home/hudson/hudson-slave/workspace/Lucene-Solr-Tests-trunk-java7/solr/build/solr-core/test/J1/org.apache.solr.cloud.BasicDistributedZk2Test-1348190255652/jetty3/index lockFactory=org.apache.lucene.store.NativeFSLockFactory@20a852a7; maxCacheMB=48.0 maxMergeSizeMB=4.0),segFN=segments_1,generation=1,filenames=[segments_1]
[junit4:junit4]   2> 10820 T14 oasc.SolrDeletionPolicy.updateCommits newest commit = 1
[junit4:junit4]   2> 10821 T14 oasc.SolrCore.initWriters created xml: solr.XMLResponseWriter
[junit4:junit4]   2> 10826 T14 oasup.UpdateRequestProcessorChain.init inserting DistributedUpdateProcessorFactory into updateRequestProcessorChain "dedupe"
[junit4:junit4]   2> 10827 T14 oasup.UpdateRequestProcessorChain.init inserting DistributedUpdateProcessorFactory into updateRequestProcessorChain "dedupe-allfields"
[junit4:junit4]   2> 10828 T14 oasup.UpdateRequestProcessorChain.init inserting DistributedUpdateProcessorFactory into updateRequestProcessorChain "stored_sig"
[junit4:junit4]   2> 10829 T14 oasup.UpdateRequestProcessorChain.init inserting DistributedUpdateProcessorFactory into updateRequestProcessorChain "uniq-fields"
[junit4:junit4]   2> 10830 T14 oasup.UpdateRequestProcessorChain.init inserting DistributedUpdateProcessorFactory into updateRequestProcessorChain "distrib-dup-test-chain-implicit"
[junit4:junit4]   2> 10831 T14 oasc.RequestHandlers.initHandlersFromConfig adding lazy requestHandler: solr.ReplicationHandler
[junit4:junit4]   2> 10832 T14 oasc.RequestHandlers.initHandlersFromConfig created /replication: solr.ReplicationHandler
[junit4:junit4]   2> 10833 T14 oasc.RequestHandlers.initHandlersFromConfig created standard: solr.StandardRequestHandler
[junit4:junit4]   2> 10835 T14 oasc.RequestHandlers.initHandlersFromConfig created /get: solr.RealTimeGetHandler
[junit4:junit4]   2> 10836 T14 oasc.RequestHandlers.initHandlersFromConfig created dismax: solr.SearchHandler
[junit4:junit4]   2> 10837 T14 oasc.RequestHandlers.initHandlersFromConfig created mock: org.apache.solr.core.MockQuerySenderListenerReqHandler
[junit4:junit4]   2> 10839 T14 oasc.RequestHandlers.initHandlersFromConfig created /admin/: org.apache.solr.handler.admin.AdminHandlers
[junit4:junit4]   2> 10840 T14 oasc.RequestHandlers.initHandlersFromConfig created defaults: solr.StandardRequestHandler
[junit4:junit4]   2> 10841 T14 oasc.RequestHandlers.initHandlersFromConfig adding lazy requestHandler: solr.StandardRequestHandler
[junit4:junit4]   2> 10842 T14 oasc.RequestHandlers.initHandlersFromConfig created lazy: solr.StandardRequestHandler
[junit4:junit4]   2> 10843 T14 oasc.RequestHandlers.initHandlersFromConfig created /update: solr.UpdateRequestHandler
[junit4:junit4]   2> 10844 T14 oasc.RequestHandlers.initHandlersFromConfig created /terms: org.apache.solr.handler.component.SearchHandler
[junit4:junit4]   2> 10846 T14 oasc.RequestHandlers.initHandlersFromConfig created spellCheckCompRH: org.apache.solr.handler.component.SearchHandler
[junit4:junit4]   2> 10847 T14 oasc.RequestHandlers.initHandlersFromConfig created spellCheckCompRH_Direct: org.apache.solr.handler.component.SearchHandler
[junit4:junit4]   2> 10849 T14 oasc.RequestHandlers.initHandlersFromConfig created spellCheckWithWordbreak: org.apache.solr.handler.component.SearchHandler
[junit4:junit4]   2> 10850 T14 oasc.RequestHandlers.initHandlersFromConfig created spellCheckWithWordbreak_Direct: org.apache.solr.handler.component.SearchHandler
[junit4:junit4]   2> 10851 T14 oasc.RequestHandlers.initHandlersFromConfig created spellCheckCompRH1: org.apache.solr.handler.component.SearchHandler
[junit4:junit4]   2> 10853 T14 oasc.RequestHandlers.initHandlersFromConfig created tvrh: org.apache.solr.handler.component.SearchHandler
[junit4:junit4]   2> 10854 T14 oasc.RequestHandlers.initHandlersFromConfig created /mlt: solr.MoreLikeThisHandler
[junit4:junit4]   2> 10855 T14 oasc.RequestHandlers.initHandlersFromConfig created /debug/dump: solr.DumpRequestHandler
[junit4:junit4]   2> 10860 T14 oashl.XMLLoader.init xsltCacheLifetimeSeconds=60
[junit4:junit4]   2> 10866 T14 oasc.SolrCore.initDeprecatedSupport WARNING solrconfig.xml uses deprecated <admin/gettableFiles>, Please update your config to use the ShowFileRequestHandler.
[junit4:junit4]   2> 10869 T14 oasc.SolrCore.initDeprecatedSupport WARNING adding ShowFileRequestHandler with hidden files: [SCHEMA.XML, OLD_SYNONYMS.TXT, STOPWORDS.TXT, PROTWORDS.TXT, OPEN-EXCHANGE-RATES.JSON, SYNONYMS.TXT, CURRENCY.XML, MAPPING-ISOLATIN1ACCENT.TXT]
[junit4:junit4]   2> 10874 T14 oass.SolrIndexSearcher.<init> Opening Searcher@6698ef44 main
[junit4:junit4]   2> 10876 T14 oasu.CommitTracker.<init> Hard AutoCommit: disabled
[junit4:junit4]   2> 10877 T14 oasu.CommitTracker.<init> Soft AutoCommit: disabled
[junit4:junit4]   2> 10878 T14 oashc.SpellCheckComponent.inform Initializing spell checkers
[junit4:junit4]   2> 10888 T14 oass.DirectSolrSpellChecker.init init: {name=direct,classname=DirectSolrSpellChecker,field=lowerfilt,minQueryLength=3}
[junit4:junit4]   2> 10947 T74 oasc.SolrCore.registerSearcher [collection1] Registered new searcher Searcher@6698ef44 main{StandardDirectoryReader(segments_1:1)}
[junit4:junit4]   2> 11145 T36 oascc.ZkStateReader.updateClusterState Updating cloud state from ZooKeeper... 
[junit4:junit4]   2> 11160 T73 oascc.ZkStateReader$2.process A cluster state change has occurred - updating...
[junit4:junit4]   2> 11160 T61 oascc.ZkStateReader$2.process A cluster state change has occurred - updating...
[junit4:junit4]   2> 11160 T49 oascc.ZkStateReader$2.process A cluster state change has occurred - updating...
[junit4:junit4]   2> 11160 T35 oascc.ZkStateReader$2.process A cluster state change has occurred - updating...
[junit4:junit4]   2> 11465 T14 oasc.CoreContainer.register registering core: collection1
[junit4:junit4]   2> 11466 T14 oasc.ZkController.register Register shard - core:collection1 address:http://127.0.0.1:47711/solr shardId:shard1
[junit4:junit4]   2> 11496 T14 oasc.ZkController.register We are http://127.0.0.1:47711/solr/collection1/ and leader is http://127.0.0.1:23873/solr/collection1/
[junit4:junit4]   2> 11497 T14 oasc.ZkController.register No LogReplay needed for core=collection1 baseURL=http://127.0.0.1:47711/solr
[junit4:junit4]   2> 11497 T14 oasc.ZkController.checkRecovery Core needs to recover:collection1
[junit4:junit4]   2> 11498 T14 oasu.DefaultSolrCoreState.doRecovery Running recovery - first canceling any ongoing recovery
[junit4:junit4]   2> ASYNC  NEW_CORE C0 name=collection1 org.apache.solr.core.SolrCore@51985384 url=http://127.0.0.1:47711/solr/collection1 node=127.0.0.1:47711_solr
[junit4:junit4]   2> 11507 T75 C0 P47711 oasc.RecoveryStrategy.run Starting recovery process.  core=collection1 recoveringAfterStartup=true
[junit4:junit4]   2> 11507 T14 oascc.ZkStateReader.updateClusterState Updating cloud state from ZooKeeper... 
[junit4:junit4]   2> 11510 T75 C0 P47711 oasc.RecoveryStrategy.doRecovery ###### startupVersions=[]
[junit4:junit4]   2> 11511 T14 oass.SolrDispatchFilter.init user.dir=/usr/home/hudson/hudson-slave/workspace/Lucene-Solr-Tests-trunk-java7/solr/build/solr-core/test/J1
[junit4:junit4]   2> 11512 T14 oass.SolrDispatchFilter.init SolrDispatchFilter.init() done
[junit4:junit4]   2> 11512 T14 oascsi.HttpClientUtil.createClient Creating new http client, config:maxConnections=128&maxConnectionsPerHost=32&followRedirects=false
[junit4:junit4]   2> 11513 T75 C0 P47711 oasc.RecoveryStrategy.doRecovery Attempting to PeerSync from http://127.0.0.1:23873/solr/collection1/ core=collection1 - recoveringAfterStartup=true
[junit4:junit4]   2> 11520 T75 C0 P47711 oascsi.HttpClientUtil.createClient Creating new http client, config:maxConnectionsPerHost=20&maxConnections=10000&connTimeout=30000&socketTimeout=30000&retry=false
[junit4:junit4]   2> 11534 T75 C0 P47711 oasu.PeerSync.sync PeerSync: core=collection1 url=http://127.0.0.1:47711/solr START replicas=[http://127.0.0.1:23873/solr/collection1/] nUpdates=100
[junit4:junit4]   2> 11548 T75 C0 P47711 oasu.PeerSync.sync WARNING no frame of reference to tell of we've missed updates
[junit4:junit4]   2> 11549 T75 C0 P47711 oasc.RecoveryStrategy.doRecovery PeerSync Recovery was not successful - trying replication. core=collection1
[junit4:junit4]   2> 11549 T75 C0 P47711 oasc.RecoveryStrategy.doRecovery Starting Replication Recovery. core=collection1
[junit4:junit4]   2> 11549 T75 C0 P47711 oascsi.HttpClientUtil.createClient Creating new http client, config:maxConnections=128&maxConnectionsPerHost=32&followRedirects=false
[junit4:junit4]   2> 11666 T36 oascc.ZkStateReader.updateClusterState Updating cloud state from ZooKeeper... 
[junit4:junit4]   2> 11679 T14 oejs.Server.doStart jetty-8.1.2.v20120308
[junit4:junit4]   2> 11681 T14 oejs.AbstractConnector.doStart Started SocketConnector@0.0.0.0:63529
[junit4:junit4]   2> 11682 T14 oasc.SolrResourceLoader.locateSolrHome JNDI not configured for solr (NoInitialContextEx)
[junit4:junit4]   2> 11682 T14 oasc.SolrResourceLoader.locateSolrHome using system property solr.solr.home: /usr/home/hudson/hudson-slave/workspace/Lucene-Solr-Tests-trunk-java7/solr/build/solr-core/test/J1/./solrtest-jetty4-1348190267160
[junit4:junit4]   2> 11683 T14 oasc.SolrResourceLoader.<init> new SolrResourceLoader for deduced Solr Home: '/usr/home/hudson/hudson-slave/workspace/Lucene-Solr-Tests-trunk-java7/solr/build/solr-core/test/J1/./solrtest-jetty4-1348190267160/'
[junit4:junit4]   2> 11687 T61 oascc.ZkStateReader$2.process A cluster state change has occurred - updating...
[junit4:junit4]   2> 11687 T35 oascc.ZkStateReader$2.process A cluster state change has occurred - updating...
[junit4:junit4]   2> 11687 T49 oascc.ZkStateReader$2.process A cluster state change has occurred - updating...
[junit4:junit4]   2> 11687 T73 oascc.ZkStateReader$2.process A cluster state change has occurred - updating...
[junit4:junit4]   2> 11725 T14 oass.SolrDispatchFilter.init SolrDispatchFilter.init()
[junit4:junit4]   2> 11726 T14 oasc.SolrResourceLoader.locateSolrHome JNDI not configured for solr (NoInitialContextEx)
[junit4:junit4]   2> 11726 T14 oasc.SolrResourceLoader.locateSolrHome using system property solr.solr.home: /usr/home/hudson/hudson-slave/workspace/Lucene-Solr-Tests-trunk-java7/solr/build/solr-core/test/J1/./solrtest-jetty4-1348190267160
[junit4:junit4]   2> 11727 T14 oasc.CoreContainer$Initializer.initialize looking for solr.xml: /usr/home/hudson/hudson-slave/workspace/Lucene-Solr-Tests-trunk-java7/solr/build/solr-core/test/J1/./solrtest-jetty4-1348190267160/solr.xml
[junit4:junit4]   2> 11727 T14 oasc.CoreContainer.<init> New CoreContainer 1985511938
[junit4:junit4]   2> 11728 T14 oasc.CoreContainer.load Loading CoreContainer using Solr Home: '/usr/home/hudson/hudson-slave/workspace/Lucene-Solr-Tests-trunk-java7/solr/build/solr-core/test/J1/./solrtest-jetty4-1348190267160/'
[junit4:junit4]   2> 11728 T14 oasc.SolrResourceLoader.<init> new SolrResourceLoader for directory: '/usr/home/hudson/hudson-slave/workspace/Lucene-Solr-Tests-trunk-java7/solr/build/solr-core/test/J1/./solrtest-jetty4-1348190267160/'
[junit4:junit4]   2> 11757 T14 oasc.CoreContainer.load Registering Log Listener
[junit4:junit4]   2> 11772 T14 oasc.CoreContainer.initZooKeeper Zookeeper client=127.0.0.1:34039/solr
[junit4:junit4]   2> 11772 T14 oaz.ZooKeeper.<init> Initiating client connection, connectString=127.0.0.1:34039/solr sessionTimeout=5000 watcher=org.apache.solr.common.cloud.ConnectionManager@afb3f98
[junit4:junit4]   2> 11773 T14 oascc.ConnectionManager.waitForConnected Waiting for client to connect to ZooKeeper
[junit4:junit4]   2> 11773 T86 oaz.ClientCnxn$SendThread.startConnect Opening socket connection to server /127.0.0.1:34039
[junit4:junit4]   2> 11775 T86 oaz.ClientCnxn$SendThread.primeConnection Socket connection established to localhost/127.0.0.1:34039, initiating session
[junit4:junit4]   2> 11775 T16 oazs.NIOServerCnxn$Factory.run Accepted socket connection from /140.211.11.196:45950
[junit4:junit4]   2> 11776 T16 oazs.NIOServerCnxn.readConnectRequest Client attempting to establish new session at /140.211.11.196:45950
[junit4:junit4]   2> 11779 T18 oazs.NIOServerCnxn.finishSessionInit Established session 0x139e666bb4b0006 with negotiated timeout 5000 for client /140.211.11.196:45950
[junit4:junit4]   2> 11780 T86 oaz.ClientCnxn$SendThread.readConnectResult Session establishment complete on server localhost/127.0.0.1:34039, sessionid = 0x139e666bb4b0006, negotiated timeout = 5000
[junit4:junit4]   2> 11780 T87 oascc.ConnectionManager.process Watcher org.apache.solr.common.cloud.ConnectionManager@afb3f98 name:ZooKeeperConnection Watcher:127.0.0.1:34039/solr got event WatchedEvent state:SyncConnected type:None path:null path:null type:None
[junit4:junit4]   2> 11781 T14 oascc.ConnectionManager.waitForConnected Client is connected to ZooKeeper
[junit4:junit4]   2> 11782 T19 oazs.PrepRequestProcessor.pRequest Got user-level KeeperException when processing sessionid:0x139e666bb4b0006 type:create cxid:0x1 zxid:0xfffffffffffffffe txntype:unknown reqpath:n/a Error Path:/solr/overseer Error:KeeperErrorCode = NodeExists for /solr/overseer
[junit4:junit4]   2> 11783 T19 oazs.PrepRequestProcessor.pRequest Got user-level KeeperException when processing sessionid:0x139e666bb4b0006 type:create cxid:0x2 zxid:0xfffffffffffffffe txntype:unknown reqpath:n/a Error Path:/solr/overseer Error:KeeperErrorCode = NodeExists for /solr/overseer
[junit4:junit4]   2> 11785 T14 oasc.ZkController.createEphemeralLiveNode Register node as live in ZooKeeper:/live_nodes/127.0.0.1:63529_solr
[junit4:junit4]   2> 11786 T19 oazs.PrepRequestProcessor.pRequest Got user-level KeeperException when processing sessionid:0x139e666bb4b0006 type:delete cxid:0x4 zxid:0xfffffffffffffffe txntype:unknown reqpath:n/a Error Path:/solr/live_nodes/127.0.0.1:63529_solr Error:KeeperErrorCode = NoNode for /solr/live_nodes/127.0.0.1:63529_solr
[junit4:junit4]   2> 11794 T14 oascc.SolrZkClient.makePath makePath: /live_nodes/127.0.0.1:63529_solr
[junit4:junit4]   2> 11797 T49 oascc.ZkStateReader$3.process Updating live nodes
[junit4:junit4]   2> 11797 T73 oascc.ZkStateReader$3.process Updating live nodes
[junit4:junit4]   2> 11797 T61 oascc.ZkStateReader$3.process Updating live nodes
[junit4:junit4]   2> 11797 T35 oascc.ZkStateReader$3.process Updating live nodes
[junit4:junit4]   2> 11798 T14 oashc.HttpShardHandlerFactory.getParameter Setting socketTimeout to: 0
[junit4:junit4]   2> 11799 T14 oashc.HttpShardHandlerFactory.getParameter Setting urlScheme to: http://
[junit4:junit4]   2> 11799 T14 oashc.HttpShardHandlerFactory.getParameter Setting connTimeout to: 0
[junit4:junit4]   2> 11800 T14 oashc.HttpShardHandlerFactory.getParameter Setting maxConnectionsPerHost to: 20
[junit4:junit4]   2> 11800 T14 oashc.HttpShardHandlerFactory.getParameter Setting corePoolSize to: 0
[junit4:junit4]   2> 11801 T14 oashc.HttpShardHandlerFactory.getParameter Setting maximumPoolSize to: 2147483647
[junit4:junit4]   2> 11801 T14 oashc.HttpShardHandlerFactory.getParameter Setting maxThreadIdleTime to: 5
[junit4:junit4]   2> 11801 T14 oashc.HttpShardHandlerFactory.getParameter Setting sizeOfQueue to: -1
[junit4:junit4]   2> 11802 T14 oashc.HttpShardHandlerFactory.getParameter Setting fairnessPolicy to: false
[junit4:junit4]   2> 11802 T14 oascsi.HttpClientUtil.createClient Creating new http client, config:maxConnectionsPerHost=20&maxConnections=10000&socketTimeout=0&connTimeout=0&retry=false
[junit4:junit4]   2> 11819 T14 oascc.ZkStateReader.createClusterStateWatchersAndUpdate Updating cluster state from ZooKeeper... 
[junit4:junit4]   2> 11828 T14 oasc.CoreContainer.create Creating SolrCore 'collection1' using instanceDir: /usr/home/hudson/hudson-slave/workspace/Lucene-Solr-Tests-trunk-java7/solr/build/solr-core/test/J1/./solrtest-jetty4-1348190267160/collection1
[junit4:junit4]   2> 11829 T14 oasc.ZkController.createCollectionZkNode Check for collection zkNode:collection1
[junit4:junit4]   2> 11830 T14 oasc.ZkController.createCollectionZkNode Collection zkNode exists
[junit4:junit4]   2> 11830 T14 oasc.ZkController.readConfigName Load collection config from:/collections/collection1
[junit4:junit4]   2> 11832 T14 oasc.SolrResourceLoader.<init> new SolrResourceLoader for directory: '/usr/home/hudson/hudson-slave/workspace/Lucene-Solr-Tests-trunk-java7/solr/build/solr-core/test/J1/./solrtest-jetty4-1348190267160/collection1/'
[junit4:junit4]   2> 11833 T14 oasc.SolrResourceLoader.replaceClassLoader Adding 'file:/usr/home/hudson/hudson-slave/workspace/Lucene-Solr-Tests-trunk-java7/solr/build/solr-core/test/J1/solrtest-jetty4-1348190267160/collection1/lib/README' to classloader
[junit4:junit4]   2> 11834 T14 oasc.SolrResourceLoader.replaceClassLoader Adding 'file:/usr/home/hudson/hudson-slave/workspace/Lucene-Solr-Tests-trunk-java7/solr/build/solr-core/test/J1/solrtest-jetty4-1348190267160/collection1/lib/classes/' to classloader
[junit4:junit4]   2> 11903 T14 oasc.SolrConfig.<init> Using Lucene MatchVersion: LUCENE_50
[junit4:junit4]   2> 11971 T14 oasc.SolrConfig.<init> Loaded SolrConfig: solrconfig.xml
[junit4:junit4]   2> 12072 T14 oass.IndexSchema.readSchema Reading Solr Schema
[junit4:junit4]   2> 12108 T14 oass.IndexSchema.readSchema Schema name=test
[junit4:junit4]   2> ASYNC  NEW_CORE C1 name=collection1 org.apache.solr.core.SolrCore@15d7811d url=http://127.0.0.1:23873/solr/collection1 node=127.0.0.1:23873_solr
[junit4:junit4]   2> 12657 T41 C1 P23873 REQ /get {distrib=false&qt=/get&wt=javabin&version=2&getVersions=100} status=0 QTime=50 
[junit4:junit4]   2> 12860 T14 oass.OpenExchangeRatesOrgProvider.init Initialized with rates=open-exchange-rates.json, refreshInterval=1440.
[junit4:junit4]   2> 12874 T14 oass.IndexSchema.readSchema default search field in schema is text
[junit4:junit4]   2> 12878 T14 oass.IndexSchema.readSchema unique key field: id
[junit4:junit4]   2> 12907 T14 oass.FileExchangeRateProvider.reload Reloading exchange rates from file currency.xml
[junit4:junit4]   2> 12923 T14 oass.FileExchangeRateProvider.reload Reloading exchange rates from file currency.xml
[junit4:junit4]   2> 12928 T14 oass.OpenExchangeRatesOrgProvider.reload Reloading exchange rates from open-exchange-rates.json
[junit4:junit4]   2> 12931 T14 oass.OpenExchangeRatesOrgProvider.reload Reloading exchange rates from open-exchange-rates.json
[junit4:junit4]   2> 12934 T14 oasc.SolrCore.<init> [collection1] Opening new SolrCore at /usr/home/hudson/hudson-slave/workspace/Lucene-Solr-Tests-trunk-java7/solr/build/solr-core/test/J1/./solrtest-jetty4-1348190267160/collection1/, dataDir=./org.apache.solr.cloud.BasicDistributedZk2Test-1348190255652/jetty4/
[junit4:junit4]   2> 12935 T14 oasc.JmxMonitoredMap.<init> JMX monitoring is enabled. Adding Solr mbeans to JMX Server: com.sun.jmx.mbeanserver.JmxMBeanServer@1c342c15
[junit4:junit4]   2> 12936 T14 oasc.SolrCore.getNewIndexDir WARNING New index directory detected: old=null new=./org.apache.solr.cloud.BasicDistributedZk2Test-1348190255652/jetty4/index/
[junit4:junit4]   2> 12937 T14 oasc.SolrCore.initIndex WARNING [collection1] Solr index directory './org.apache.solr.cloud.BasicDistributedZk2Test-1348190255652/jetty4/index' doesn't exist. Creating new index...
[junit4:junit4]   2> 12938 T14 oasc.CachingDirectoryFactory.get return new directory for /usr/home/hudson/hudson-slave/workspace/Lucene-Solr-Tests-trunk-java7/solr/build/solr-core/test/J1/./org.apache.solr.cloud.BasicDistributedZk2Test-1348190255652/jetty4/index forceNew:false
[junit4:junit4]   2> 12970 T14 oasc.SolrDeletionPolicy.onCommit SolrDeletionPolicy.onCommit: commits:num=1
[junit4:junit4]   2> 		commit{dir=NRTCachingDirectory(org.apache.lucene.store.NIOFSDirectory@/usr/home/hudson/hudson-slave/workspace/Lucene-Solr-Tests-trunk-java7/solr/build/solr-core/test/J1/org.apache.solr.cloud.BasicDistributedZk2Test-1348190255652/jetty4/index lockFactory=org.apache.lucene.store.NativeFSLockFactory@1ab5bb12; maxCacheMB=48.0 maxMergeSizeMB=4.0),segFN=segments_1,generation=1,filenames=[segments_1]
[junit4:junit4]   2> 12971 T14 oasc.SolrDeletionPolicy.updateCommits newest commit = 1
[junit4:junit4]   2> 12972 T14 oasc.SolrCore.initWriters created xml: solr.XMLResponseWriter
[junit4:junit4]   2> 12976 T14 oasup.UpdateRequestProcessorChain.init inserting DistributedUpdateProcessorFactory into updateRequestProcessorChain "dedupe"
[junit4:junit4]   2> 12977 T14 oasup.UpdateRequestProcessorChain.init inserting DistributedUpdateProcessorFactory into updateRequestProcessorChain "dedupe-allfields"
[junit4:junit4]   2> 12977 T14 oasup.UpdateRequestProcessorChain.init inserting DistributedUpdateProcessorFactory into updateRequestProcessorChain "stored_sig"
[junit4:junit4]   2> 12978 T14 oasup.UpdateRequestProcessorChain.init inserting DistributedUpdateProcessorFactory into updateRequestProcessorChain "uniq-fields"
[junit4:junit4]   2> 12979 T14 oasup.UpdateRequestProcessorChain.init inserting DistributedUpdateProcessorFactory into updateRequestProcessorChain "distrib-dup-test-chain-implicit"
[junit4:junit4]   2> 12980 T14 oasc.RequestHandlers.initHandlersFromConfig adding lazy requestHandler: solr.ReplicationHandler
[junit4:junit4]   2> 12980 T14 oasc.RequestHandlers.initHandlersFromConfig created /replication: solr.ReplicationHandler
[junit4:junit4]   2> 12981 T14 oasc.RequestHandlers.initHandlersFromConfig created standard: solr.StandardRequestHandler
[junit4:junit4]   2> 12982 T14 oasc.RequestHandlers.initHandlersFromConfig created /get: solr.RealTimeGetHandler
[junit4:junit4]   2> 12983 T14 oasc.RequestHandlers.initHandlersFromConfig created dismax: solr.SearchHandler
[junit4:junit4]   2> 12984 T14 oasc.RequestHandlers.initHandlersFromConfig created mock: org.apache.solr.core.MockQuerySenderListenerReqHandler
[junit4:junit4]   2> 12985 T14 oasc.RequestHandlers.initHandlersFromConfig created /admin/: org.apache.solr.handler.admin.AdminHandlers
[junit4:junit4]   2> 12986 T14 oasc.RequestHandlers.initHandlersFromConfig created defaults: solr.StandardRequestHandler
[junit4:junit4]   2> 12987 T14 oasc.RequestHandlers.initHandlersFromConfig adding lazy requestHandler: solr.StandardRequestHandler
[junit4:junit4]   2> 12987 T14 oasc.RequestHandlers.initHandlersFromConfig created lazy: solr.StandardRequestHandler
[junit4:junit4]   2> 12988 T14 oasc.RequestHandlers.initHandlersFromConfig created /update: solr.UpdateRequestHandler
[junit4:junit4]   2> 12989 T14 oasc.RequestHandlers.initHandlersFromConfig created /terms: org.apache.solr.handler.component.SearchHandler
[junit4:junit4]   2> 12990 T14 oasc.RequestHandlers.initHandlersFromConfig created spellCheckCompRH: org.apache.solr.handler.component.SearchHandler
[junit4:junit4]   2> 12991 T14 oasc.RequestHandlers.initHandlersFromConfig created spellCheckCompRH_Direct: org.apache.solr.handler.component.SearchHandler
[junit4:junit4]   2> 12992 T14 oasc.RequestHandlers.initHandlersFromConfig created spellCheckWithWordbreak: org.apache.solr.handler.component.SearchHandler
[junit4:junit4]   2> 12993 T14 oasc.RequestHandlers.initHandlersFromConfig created spellCheckWithWordbreak_Direct: org.apache.solr.handler.component.SearchHandler
[junit4:junit4]   2> 12994 T14 oasc.RequestHandlers.initHandlersFromConfig created spellCheckCompRH1: org.apache.solr.handler.component.SearchHandler
[junit4:junit4]   2> 12995 T14 oasc.RequestHandlers.initHandlersFromConfig created tvrh: org.apache.solr.handler.component.SearchHandler
[junit4:junit4]   2> 12996 T14 oasc.RequestHandlers.initHandlersFromConfig created /mlt: solr.MoreLikeThisHandler
[junit4:junit4]   2> 12997 T14 oasc.RequestHandlers.initHandlersFromConfig created /debug/dump: solr.DumpRequestHandler
[junit4:junit4]   2> 13000 T14 oashl.XMLLoader.init xsltCacheLifetimeSeconds=60
[junit4:junit4]   2> 13005 T14 oasc.SolrCore.initDeprecatedSupport WARNING solrconfig.xml uses deprecated <admin/gettableFiles>, Please update your config to use the ShowFileRequestHandler.
[junit4:junit4]   2> 13007 T14 oasc.SolrCore.initDeprecatedSupport WARNING adding ShowFileRequestHandler with hidden files: [SCHEMA.XML, OLD_SYNONYMS.TXT, STOPWORDS.TXT, PROTWORDS.TXT, OPEN-EXCHANGE-RATES.JSON, SYNONYMS.TXT, CURRENCY.XML, MAPPING-ISOLATIN1ACCENT.TXT]
[junit4:junit4]   2> 13011 T14 oass.SolrIndexSearcher.<init> Opening Searcher@7cb1bd6c main
[junit4:junit4]   2> 13012 T14 oasu.CommitTracker.<init> Hard AutoCommit: disabled
[junit4:junit4]   2> 13013 T14 oasu.CommitTracker.<init> Soft AutoCommit: disabled
[junit4:junit4]   2> 13014 T14 oashc.SpellCheckComponent.inform Initializing spell checkers
[junit4:junit4]   2> 13021 T14 oass.DirectSolrSpellChecker.init init: {name=direct,classname=DirectSolrSpellChecker,field=lowerfilt,minQueryLength=3}
[junit4:junit4]   2> 13089 T88 oasc.SolrCore.registerSearcher [collection1] Registered new searcher Searcher@7cb1bd6c main{StandardDirectoryReader(segments_1:1)}
[junit4:junit4]   2> 13202 T36 oascc.ZkStateReader.updateClusterState Updating cloud state from ZooKeeper... 
[junit4:junit4]   2> 13217 T87 oascc.ZkStateReader$2.process A cluster state change has occurred - updating...
[junit4:junit4]   2> 13217 T73 oascc.ZkStateReader$2.process A cluster state change has occurred - updating...
[junit4:junit4]   2> 13217 T49 oascc.ZkStateReader$2.process A cluster state change has occurred - updating...
[junit4:junit4]   2> 13217 T35 oascc.ZkStateReader$2.process A cluster state change has occurred - updating...
[junit4:junit4]   2> 13217 T61 oascc.ZkStateReader$2.process A cluster state change has occurred - updating...
[junit4:junit4]   2> 13601 T14 oasc.CoreContainer.register registering core: collection1
[junit4:junit4]   2> 13601 T14 oasc.ZkController.register Register shard - core:collection1 address:http://127.0.0.1:63529/solr shardId:shard2
[junit4:junit4]   2> 13607 T14 oasc.ZkController.register We are http://127.0.0.1:63529/solr/collection1/ and leader is http://127.0.0.1:10323/solr/collection1/
[junit4:junit4]   2> 13607 T14 oasc.ZkController.register No LogReplay needed for core=collection1 baseURL=http://127.0.0.1:63529/solr
[junit4:junit4]   2> 13608 T14 oasc.ZkController.checkRecovery Core needs to recover:collection1
[junit4:junit4]   2> 13608 T14 oasu.DefaultSolrCoreState.doRecovery Running recovery - first canceling any ongoing recovery
[junit4:junit4]   2> ASYNC  NEW_CORE C2 name=collection1 org.apache.solr.core.SolrCore@4d217168 url=http://127.0.0.1:63529/solr/collection1 node=127.0.0.1:63529_solr
[junit4:junit4]   2> 13609 T89 C2 P63529 oasc.RecoveryStrategy.run Starting recovery process.  core=collection1 recoveringAfterStartup=true
[junit4:junit4]   2> 13610 T89 C2 P63529 oasc.RecoveryStrategy.doRecovery ###### startupVersions=[]
[junit4:junit4]   2> 13610 T14 oascc.ZkStateReader.updateClusterState Updating cloud state from ZooKeeper... 
[junit4:junit4]   2> 13612 T14 oass.SolrDispatchFilter.init user.dir=/usr/home/hudson/hudson-slave/workspace/Lucene-Solr-Tests-trunk-java7/solr/build/solr-core/test/J1
[junit4:junit4]   2> 13612 T89 C2 P63529 oasc.RecoveryStrategy.doRecovery Attempting to PeerSync from http://127.0.0.1:10323/solr/collection1/ core=collection1 - recoveringAfterStartup=true
[junit4:junit4]   2> 13612 T14 oass.SolrDispatchFilter.init SolrDispatchFilter.init() done
[junit4:junit4]   2> 13613 T89 C2 P63529 oasu.PeerSync.sync PeerSync: core=collection1 url=http://127.0.0.1:63529/solr START replicas=[http://127.0.0.1:10323/solr/collection1/] nUpdates=100
[junit4:junit4]   2> 13613 T14 oascsi.HttpClientUtil.createClient Creating new http client, config:maxConnections=128&maxConnectionsPerHost=32&followRedirects=false
[junit4:junit4]   2> 13614 T89 C2 P63529 oasu.PeerSync.sync WARNING no frame of reference to tell of we've missed updates
[junit4:junit4]   2> 13614 T89 C2 P63529 oasc.RecoveryStrategy.doRecovery PeerSync Recovery was not successful - trying replication. core=collection1
[junit4:junit4]   2> 13615 T89 C2 P63529 oasc.RecoveryStrategy.doRecovery Starting Replication Recovery. core=collection1
[junit4:junit4]   2> 13616 T89 C2 P63529 oascsi.HttpClientUtil.createClient Creating new http client, config:maxConnections=128&maxConnectionsPerHost=32&followRedirects=false
[junit4:junit4]   2> ASYNC  NEW_CORE C3 name=collection1 org.apache.solr.core.SolrCore@387f194f url=http://127.0.0.1:10323/solr/collection1 node=127.0.0.1:10323_solr
[junit4:junit4]   2> 13628 T53 C3 P10323 REQ /get {distrib=false&qt=/get&wt=javabin&version=2&getVersions=100} status=0 QTime=0 
[junit4:junit4]   2> 13640 T14 oaz.ZooKeeper.<init> Initiating client connection, connectString=127.0.0.1:34039/solr sessionTimeout=10000 watcher=org.apache.solr.common.cloud.ConnectionManager@77b6ba00
[junit4:junit4]   2> 13643 T91 oaz.ClientCnxn$SendThread.startConnect Opening socket connection to server /127.0.0.1:34039
[junit4:junit4]   2> 13643 T14 oascc.ConnectionManager.waitForConnected Waiting for client to connect to ZooKeeper
[junit4:junit4]   2> 13648 T91 oaz.ClientCnxn$SendThread.primeConnection Socket connection established to localhost/127.0.0.1:34039, initiating session
[junit4:junit4]   2> 13648 T16 oazs.NIOServerCnxn$Factory.run Accepted socket connection from /140.211.11.196:19788
[junit4:junit4]   2> 13650 T16 oazs.NIOServerCnxn.readConnectRequest Client attempting to establish new session at /140.211.11.196:19788
[junit4:junit4]   2> 13697 T18 oazs.NIOServerCnxn.finishSessionInit Established session 0x139e666bb4b0007 with negotiated timeout 10000 for client /140.211.11.196:19788
[junit4:junit4]   2> 13697 T91 oaz.ClientCnxn$SendThread.readConnectResult Session establishment complete on server localhost/127.0.0.1:34039, sessionid = 0x139e666bb4b0007, negotiated timeout = 10000
[junit4:junit4]   2> 13697 T92 oascc.ConnectionManager.process Watcher org.apache.solr.common.cloud.ConnectionManager@77b6ba00 name:ZooKeeperConnection Watcher:127.0.0.1:34039/solr got event WatchedEvent state:SyncConnected type:None path:null path:null type:None
[junit4:junit4]   2> 13698 T14 oascc.ConnectionManager.waitForConnected Client is connected to ZooKeeper
[junit4:junit4]   2> 13699 T14 oascc.ZkStateReader.createClusterStateWatchersAndUpdate Updating cluster state from ZooKeeper... 
[junit4:junit4]   2> 13705 T14 oasc.ChaosMonkey.monkeyLog monkey: init - expire sessions:true cause connection loss:true
[junit4:junit4]   2> 13706 T14 oascsi.HttpClientUtil.createClient Creating new http client, config:
[junit4:junit4]   2> 13721 T14 oascc.ZkStateReader.updateClusterState Updating cloud state from ZooKeeper... 
[junit4:junit4]   2> 13723 T36 oascc.ZkStateReader.updateClusterState Updating cloud state from ZooKeeper... 
[junit4:junit4]   2> ASYNC  NEW_CORE C4 name=collection1 org.apache.solr.core.SolrCore@155b7aee url=http://127.0.0.1:32945/solr/collection1 node=127.0.0.1:32945_solr
[junit4:junit4]   2> 13832 T27 C4 P32945 oascsi.HttpClientUtil.createClient Creating new http client, config:maxConnections=500&maxConnectionsPerHost=16
[junit4:junit4]   2> 13842 T92 oascc.ZkStateReader$2.process A cluster state change has occurred - updating...
[junit4:junit4]   2> 13842 T61 oascc.ZkStateReader$2.process A cluster state change has occurred - updating...
[junit4:junit4]   2> 13842 T35 oascc.ZkStateReader$2.process A cluster state change has occurred - updating...
[junit4:junit4]   2> 13842 T73 oascc.ZkStateReader$2.process A cluster state change has occurred - updating...
[junit4:junit4]   2> 13842 T49 oascc.ZkStateReader$2.process A cluster state change has occurred - updating...
[junit4:junit4]   2> 13842 T87 oascc.ZkStateReader$2.process A cluster state change has occurred - updating...
[junit4:junit4]   2> 13891 T27 C4 P32945 oasc.SolrDeletionPolicy.onInit SolrDeletionPolicy.onInit: commits:num=1
[junit4:junit4]   2> 		commit{dir=NRTCachingDirectory(org.apache.lucene.store.NIOFSDirectory@/usr/home/hudson/hudson-slave/workspace/Lucene-Solr-Tests-trunk-java7/solr/build/solr-core/test/J1/org.apache.solr.cloud.BasicDistributedZk2Test-1348190255652/control/data/index lockFactory=org.apache.lucene.store.NativeFSLockFactory@213e02ee; maxCacheMB=48.0 maxMergeSizeMB=4.0),segFN=segments_1,generation=1,filenames=[segments_1]
[junit4:junit4]   2> 13892 T27 C4 P32945 oasc.SolrDeletionPolicy.updateCommits newest commit = 1
[junit4:junit4]   2> 14361 T27 C4 P32945 /update {wt=javabin&version=2} {add=[1 (1413679960055349248)]} 0 549
[junit4:junit4]   2> 14363 T14 oaz.ZooKeeper.<init> Initiating client connection, connectString=127.0.0.1:34039/solr sessionTimeout=10000 watcher=org.apache.solr.common.cloud.ConnectionManager@2da6852a
[junit4:junit4]   2> 14364 T93 oaz.ClientCnxn$SendThread.startConnect Opening socket connection to server /127.0.0.1:34039
[junit4:junit4]   2> 14364 T14 oascc.ConnectionManager.waitForConnected Waiting for client to connect to ZooKeeper
[junit4:junit4]   2> 14366 T93 oaz.ClientCnxn$SendThread.primeConnection Socket connection established to localhost/127.0.0.1:34039, initiating session
[junit4:junit4]   2> 14366 T16 oazs.NIOServerCnxn$Factory.run Accepted socket connection from /140.211.11.196:45398
[junit4:junit4]   2> 14367 T16 oazs.NIOServerCnxn.readConnectRequest Client attempting to establish new session at /140.211.11.196:45398
[junit4:junit4]   2> 14369 T18 oazs.NIOServerCnxn.finishSessionInit Established session 0x139e666bb4b0008 with negotiated timeout 10000 for client /140.211.11.196:45398
[junit4:junit4]   2> 14369 T93 oaz.ClientCnxn$SendThread.readConnectResult Session establishment complete on server localhost/127.0.0.1:34039, sessionid = 0x139e666bb4b0008, negotiated timeout = 10000
[junit4:junit4]   2> 14370 T94 oascc.ConnectionManager.process Watcher org.apache.solr.common.cloud.ConnectionManager@2da6852a name:ZooKeeperConnection Watcher:127.0.0.1:34039/solr got event WatchedEvent state:SyncConnected type:None path:null path:null type:None
[junit4:junit4]   2> 14371 T14 oascc.ConnectionManager.waitForConnected Client is connected to ZooKeeper
[junit4:junit4]   2> 14372 T14 oascc.ZkStateReader.createClusterStateWatchersAndUpdate Updating cluster state from ZooKeeper... 
[junit4:junit4]   2> 14414 T43 C1 P23873 oasc.SolrDeletionPolicy.onInit SolrDeletionPolicy.onInit: commits:num=1
[junit4:junit4]   2> 		commit{dir=NRTCachingDirectory(org.apache.lucene.store.NIOFSDirectory@/usr/home/hudson/hudson-slave/workspace/Lucene-Solr-Tests-trunk-java7/solr/build/solr-core/test/J1/org.apache.solr.cloud.BasicDistributedZk2Test-1348190255652/jetty1/index lockFactory=org.apache.lucene.store.NativeFSLockFactory@14ee1613; maxCacheMB=48.0 maxMergeSizeMB=4.0),segFN=segments_1,generation=1,filenames=[segments_1]
[junit4:junit4]   2> 14415 T43 C1 P23873 oasc.SolrDeletionPolicy.updateCommits newest commit = 1
[junit4:junit4]   2>  C0_STATE=coll:collection1 core:collection1 props:{shard=shard1, roles=null, state=recovering, core=collection1, collection=collection1, node_name=127.0.0.1:47711_solr, base_url=http://127.0.0.1:47711/solr}
[junit4:junit4]   2> 14496 T65 C0 P47711 oasc.SolrDeletionPolicy.onInit SolrDeletionPolicy.onInit: commits:num=1
[junit4:junit4]   2> 		commit{dir=NRTCachingDirectory(org.apache.lucene.store.NIOFSDirectory@/usr/home/hudson/hudson-slave/workspace/Lucene-Solr-Tests-trunk-java7/solr/build/solr-core/test/J1/org.apache.solr.cloud.BasicDistributedZk2Test-1348190255652/jetty3/index lockFactory=org.apache.lucene.store.NativeFSLockFactory@20a852a7; maxCacheMB=48.0 maxMergeSizeMB=4.0),segFN=segments_1,generation=1,filenames=[segments_1]
[junit4:junit4]   2> 14497 T65 C0 P47711 oasc.SolrDeletionPolicy.updateCommits newest commit = 1
[junit4:junit4]   2> 14508 T65 C0 P47711 REQ /update {distrib.from=http://127.0.0.1:23873/solr/collection1/&update.distrib=FROMLEADER&wt=javabin&version=2} status=0 QTime=18 
[junit4:junit4]   2> 14510 T43 C1 P23873 /update {wt=javabin&version=2} {add=[1 (1413679960600608768)]} 0 119
[junit4:junit4]   2> 14511 T14 oasc.AbstractDistribZkTestBase.waitForRecoveriesToFinish Wait for recoveries to finish - collection: collection1 failOnTimeout:true timeout (sec):1800
[junit4:junit4]   2> 14513 T14 oascc.ZkStateReader.updateClusterState Updating cloud state from ZooKeeper... 
[junit4:junit4]   2> 14748 T75 C0 P47711 oasc.RecoveryStrategy.doRecovery Begin buffering updates. core=collection1
[junit4:junit4]   2> 14748 T75 C0 P47711 oasu.UpdateLog.bufferUpdates Starting to buffer updates. FSUpdateLog{state=ACTIVE, tlog=tlog{file=./org.apache.solr.cloud.BasicDistributedZk2Test-1348190255652/jetty3/tlog/tlog.0000000000000000000 refcount=1}}
[junit4:junit4]   2> 14749 T75 C0 P47711 oasc.RecoveryStrategy.replicate Attempting to replicate from http://127.0.0.1:23873/solr/collection1/. core=collection1
[junit4:junit4]   2> 14749 T75 C0 P47711 oascsi.HttpClientUtil.createClient Creating new http client, config:maxConnections=128&maxConnectionsPerHost=32&followRedirects=false
[junit4:junit4]   2> 14781 T44 C1 P23873 oasu.DirectUpdateHandler2.commit start commit{flags=0,_version_=0,optimize=false,openSearcher=true,waitSearcher=true,expungeDeletes=false,softCommit=false}
[junit4:junit4]   2> 15485 T44 C1 P23873 oasc.SolrDeletionPolicy.onCommit SolrDeletionPolicy.onCommit: commits:num=2
[junit4:junit4]   2> 		commit{dir=NRTCachingDirectory(org.apache.lucene.store.NIOFSDirectory@/usr/home/hudson/hudson-slave/workspace/Lucene-Solr-Tests-trunk-java7/solr/build/solr-core/test/J1/org.apache.solr.cloud.BasicDistributedZk2Test-1348190255652/jetty1/index lockFactory=org.apache.lucene.store.NativeFSLockFactory@14ee1613; maxCacheMB=48.0 maxMergeSizeMB=4.0),segFN=segments_1,generation=1,filenames=[segments_1]
[junit4:junit4]   2> 		commit{dir=NRTCachingDirectory(org.apache.lucene.store.NIOFSDirectory@/usr/home/hudson/hudson-slave/workspace/Lucene-Solr-Tests-trunk-java7/solr/build/solr-core/test/J1/org.apache.solr.cloud.BasicDistributedZk2Test-1348190255652/jetty1/index lockFactory=org.apache.lucene.store.NativeFSLockFactory@14ee1613; maxCacheMB=48.0 maxMergeSizeMB=4.0),segFN=segments_2,generation=2,filenames=[_0_Lucene40_0.tim, _0.fnm, _0_Pulsing40_0.tim, _0_Memory_0.ram, _0_nrm.cfs, _0_Pulsing40_0.prx, _0_Lucene40_0.prx, _0_Pulsing40_0.frq, _0_Memory_1.ram, _0_Lucene40_0.tip, _0_Lucene40_0.frq, _0_nrm.cfe, _0_Pulsing40_0.tip, segments_2, _0.fdx, _0.si, _0.fdt]
[junit4:junit4]   2> 15486 T44 C1 P23873 oasc.SolrDeletionPolicy.updateCommits newest commit = 2
[junit4:junit4]   2> 15515 T14 oascc.ZkStateReader.updateClusterState Updating cloud state from ZooKeeper... 
[junit4:junit4]   2> 15656 T44 C1 P23873 oass.SolrIndexSearcher.<init> Opening Searcher@49b639f7 main
[junit4:junit4]   2> 15661 T44 C1 P23873 oasu.DirectUpdateHandler2.commit end_commit_flush
[junit4:junit4]   2> 15667 T50 oasc.SolrCore.registerSearcher [collection1] Registered new searcher Searcher@49b639f7 main{StandardDirectoryReader(segments_2:3 _0(5.0):C1)}
[junit4:junit4]   2> 15668 T44 C1 P23873 /update {waitSearcher=true&commit=true&commit_end_point=true&wt=javabin&softCommit=false&version=2} {commit=} 0 892
[junit4:junit4]   2> 15706 T75 C0 P47711 oash.ReplicationHandler.inform Commits will be reserved for  10000
[junit4:junit4]   2> 15707 T75 C0 P47711 oascsi.HttpClientUtil.createClient Creating new http client, config:connTimeout=5000&socketTimeout=20000&allowCompression=false&maxConnections=10000&maxConnectionsPerHost=10000
[junit4:junit4]   2> 15727 T75 C0 P47711 oash.SnapPuller.<init>  No value set for 'pollInterval'. Timer Task not started.
[junit4:junit4]   2> 15774 T45 C1 P23873 oash.ReplicationHandler.inform Commits will be reserved for  10000
[junit4:junit4]   2> 15775 T45 C1 P23873 REQ /replication {command=indexversion&wt=javabin&qt=/replication&version=2} status=0 QTime=46 
[junit4:junit4]   2> 15776 T75 C0 P47711 oash.SnapPuller.fetchLatestIndex Master's generation: 2
[junit4:junit4]   2> 15777 T75 C0 P47711 oash.SnapPuller.fetchLatestIndex Slave's generation: 1
[junit4:junit4]   2> 15777 T75 C0 P47711 oash.SnapPuller.fetchLatestIndex Starting replication process
[junit4:junit4]   2> 15785 T45 C1 P23873 REQ /replication {command=filelist&generation=2&wt=javabin&qt=/replication&version=2} status=0 QTime=4 
[junit4:junit4]   2> 15787 T75 C0 P47711 oash.SnapPuller.fetchLatestIndex Number of files in latest index in master: 17
[junit4:junit4]   2> 15791 T75 C0 P47711 oash.SnapPuller.fetchLatestIndex Starting download to ./org.apache.solr.cloud.BasicDistributedZk2Test-1348190255652/jetty3/index.20120920221751424 fullCopy=true
[junit4:junit4]   2> 15803 T45 C1 P23873 REQ /replication {file=_0_Lucene40_0.tim&command=filecontent&checksum=true&generation=2&qt=/replication&wt=filestream} status=0 QTime=4 
[junit4:junit4]   2> 15819 T45 C1 P23873 REQ /replication {file=_0_Pulsing40_0.tim&command=filecontent&checksum=true&generation=2&qt=/replication&wt=filestream} status=0 QTime=1 
[junit4:junit4]   2> 15824 T45 C1 P23873 REQ /replication {file=_0.fnm&command=filecontent&checksum=true&generation=2&qt=/replication&wt=filestream} status=0 QTime=0 
[junit4:junit4]   2> 15829 T45 C1 P23873 REQ /replication {file=_0_Memory_0.ram&command=filecontent&checksum=true&generation=2&qt=/replication&wt=filestream} status=0 QTime=0 
[junit4:junit4]   2> 15837 T45 C1 P23873 REQ /replication {file=_0_nrm.cfs&command=filecontent&checksum=true&generation=2&qt=/replication&wt=filestream} status=0 QTime=0 
[junit4:junit4]   2> 15843 T45 C1 P23873 REQ /replication {file=_0_Lucene40_0.prx&command=filecontent&checksum=true&generation=2&qt=/replication&wt=filestream} status=0 QTime=0 
[junit4:junit4]   2> 15847 T45 C1 P23873 REQ /replication {file=_0_Pulsing40_0.prx&command=filecontent&checksum=true&generation=2&qt=/replication&wt=filestream} status=0 QTime=0 
[junit4:junit4]   2> 15852 T45 C1 P23873 REQ /replication {file=_0_Memory_1.ram&command=filecontent&checksum=true&generation=2&qt=/replication&wt=filestream} status=0 QTime=0 
[junit4:junit4]   2> 15857 T45 C1 P23873 REQ /replication {file=_0_Pulsing40_0.frq&command=filecontent&checksum=true&generation=2&qt=/replication&wt=filestream} status=0 QTime=0 
[junit4:junit4]   2> 15872 T45 C1 P23873 REQ /replication {file=_0_Lucene40_0.tip&command=filecontent&checksum=true&generation=2&qt=/replication&wt=filestream} status=0 QTime=1 
[junit4:junit4]   2> 15879 T45 C1 P23873 REQ /replication {file=_0_Lucene40_0.frq&command=filecontent&checksum=true&generation=2&qt=/replication&wt=filestream} status=0 QTime=1 
[junit4:junit4]   2> 15889 T45 C1 P23873 REQ /replication {file=_0_nrm.cfe&command=filecontent&checksum=true&generation=2&qt=/replication&wt=filestream} status=0 QTime=0 
[junit4:junit4]   2> 15895 T45 C1 P23873 REQ /replication {file=segments_2&command=filecontent&checksum=true&generation=2&qt=/replication&wt=filestream} status=0 QTime=0 
[junit4:junit4]   2> 15901 T45 C1 P23873 REQ /replication {file=_0_Pulsing40_0.tip&command=filecontent&checksum=true&generation=2&qt=/replication&wt=filestream} status=0 QTime=0 
[junit4:junit4]   2> 15905 T45 C1 P23873 REQ /replication {file=_0.fdx&command=filecontent&checksum=true&generation=2&qt=/replication&wt=filestream} status=0 QTime=0 
[junit4:junit4]   2> 15910 T45 C1 P23873 REQ /replication {file=_0.si&command=filecontent&checksum=true&generation=2&qt=/replication&wt=filestream} status=0 QTime=0 
[junit4:junit4]   2> 15915 T45 C1 P23873 REQ /replication {file=_0.fdt&command=filecontent&checksum=true&generation=2&qt=/replication&wt=filestream} status=0 QTime=0 
[junit4:junit4]   2> 15917 T75 C0 P47711 oash.SnapPuller.fetchLatestIndex Total time taken for download : 0 secs
[junit4:junit4]   2> 15918 T75 C0 P47711 oash.SnapPuller.modifyIndexProps New index installed. Updating index properties... index=index.20120920221751424
[junit4:junit4]   2> 15926 T75 C0 P47711 oasu.DefaultSolrCoreState.newIndexWriter Creating new IndexWriter...
[junit4:junit4]   2> 15927 T75 C0 P47711 oasu.DefaultSolrCoreState.newIndexWriter Waiting until IndexWriter is unused... core=collection1
[junit4:junit4]   2> 15927 T75 C0 P47711 oasu.DefaultSolrCoreState.newIndexWriter Rollback old IndexWriter... core=collection1
[junit4:junit4]   2> 15931 T75 C0 P47711 oasc.SolrCore.getNewIndexDir WARNING New index directory detected: old=./org.apache.solr.cloud.BasicDistributedZk2Test-1348190255652/jetty3/index/ new=./org.apache.solr.cloud.BasicDistributedZk2Test-1348190255652/jetty3/index.20120920221751424
[junit4:junit4]   2> 15932 T75 C0 P47711 oasc.CachingDirectoryFactory.get return new directory for /usr/home/hudson/hudson-slave/workspace/Lucene-Solr-Tests-trunk-java7/solr/build/solr-core/test/J1/./org.apache.solr.cloud.BasicDistributedZk2Test-1348190255652/jetty3/index.20120920221751424 forceNew:true
[junit4:junit4]   2> 15940 T75 C0 P47711 oasc.SolrDeletionPolicy.onInit SolrDeletionPolicy.onInit: commits:num=1
[junit4:junit4]   2> 		commit{dir=NRTCachingDirectory(org.apache.lucene.store.NIOFSDirectory@/usr/home/hudson/hudson-slave/workspace/Lucene-Solr-Tests-trunk-java7/solr/build/solr-core/test/J1/org.apache.solr.cloud.BasicDistributedZk2Test-1348190255652/jetty3/index.20120920221751424 lockFactory=org.apache.lucene.store.NativeFSLockFactory@43af264b; maxCacheMB=48.0 maxMergeSizeMB=4.0),segFN=segments_2,generation=2,filenames=[_0_Lucene40_0.tim, _0.fnm, _0_Pulsing40_0.tim, _0_Memory_0.ram, _0_nrm.cfs, _0_Pulsing40_0.prx, _0_Lucene40_0.prx, _0_Pulsing40_0.frq, _0_Memory_1.ram, _0_Lucene40_0.tip, _0_Lucene40_0.frq, _0_nrm.cfe, _0_Pulsing40_0.tip, segments_2, _0.fdx, _0.si, _0.fdt]
[junit4:junit4]   2> 15940 T75 C0 P47711 oasc.SolrDeletionPolicy.updateCommits newest commit = 2
[junit4:junit4]   2> 15941 T75 C0 P47711 oasu.DefaultSolrCoreState.newIndexWriter New IndexWriter is ready to be used.
[junit4:junit4]   2> 15950 T75 C0 P47711 oass.SolrIndexSearcher.<init> Opening Searcher@4dc938e7 main
[junit4:junit4]   2> 15953 T74 oasc.SolrCore.registerSearcher [collection1] Registered new searcher Searcher@4dc938e7 main{StandardDirectoryReader(segments_2:3:nrt _0(5.0):C1)}
[junit4:junit4]   2> 15954 T74 oasc.CachingDirectoryFactory.close Closing directory:/usr/home/hudson/hudson-slave/workspace/Lucene-Solr-Tests-trunk-java7/solr/build/solr-core/test/J1/./org.apache.solr.cloud.BasicDistributedZk2Test-1348190255652/jetty3/index
[junit4:junit4]   2> 15955 T74 oash.SnapPuller$2.onClose removing old index directory ./org.apache.solr.cloud.BasicDistributedZk2Test-1348190255652/jetty3/index
[junit4:junit4]   2> 15956 T75 C0 P47711 oasu.DirectUpdateHandler2.commit start commit{flags=0,_version_=0,optimize=false,openSearcher=false,waitSearcher=false,expungeDeletes=false,softCommit=false}
[junit4:junit4]   2> 15957 T75 C0 P47711 oasu.DirectUpdateHandler2.commit end_commit_flush
[junit4:junit4]   2> 15961 T75 C0 P47711 oasc.RecoveryStrategy.replay Replaying buffered documents. core=collection1
[junit4:junit4]   2> 15962 T97 C0 P47711 oasu.UpdateLog$LogReplayer.doReplay WARNING Starting log replay tlog{file=./org.apache.solr.cloud.BasicDistributedZk2Test-1348190255652/jetty3/tlog/tlog.0000000000000000000 refcount=2} active=true starting pos=429
[junit4:junit4]   2> 15965 T97 C0 P47711 oasu.DirectUpdateHandler2.commit start commit{flags=2,_version_=0,optimize=false,openSearcher=true,waitSearcher=true,expungeDeletes=false,softCommit=false}
[junit4:junit4]   2> 15967 T97 C0 P47711 oass.SolrIndexSearcher.<init> Opening Searcher@36d72c78 main
[junit4:junit4]   2> 15968 T97 C0 P47711 oasu.DirectUpdateHandler2.commit end_commit_flush
[junit4:junit4]   2> 15971 T74 oasc.SolrCore.registerSearcher [collection1] Registered new searcher Searcher@36d72c78 main{StandardDirectoryReader(segments_2:3:nrt _0(5.0):C1)}
[junit4:junit4]   2> 15972 T97 C0 P47711 oasu.UpdateLog$LogReplayer.run WARNING Log replay finished. recoveryInfo=RecoveryInfo{adds=0 deletes=0 deleteByQuery=0 errors=0 positionOfStart=429}
[junit4:junit4]   2> 15972 T75 C0 P47711 oasc.RecoveryStrategy.doRecovery Replication Recovery was successful - registering as Active. core=collection1
[junit4:junit4]   2> 15974 T75 C0 P47711 oasc.RecoveryStrategy.doRecovery Finished recovery process. core=collection1
[junit4:junit4]   2> 16407 T36 oascc.ZkStateReader.updateClusterState Updating cloud state from ZooKeeper... 
[junit4:junit4]   2> 16425 T94 oascc.ZkStateReader$2.process A cluster state change has occurred - updating...
[junit4:junit4]   2> 16425 T87 oascc.ZkStateReader$2.process A cluster state change has occurred - updating...
[junit4:junit4]   2> 16425 T92 oascc.ZkStateReader$2.process A cluster state change has occurred - updating...
[junit4:junit4]   2> 16425 T35 oascc.ZkStateReader$2.process A cluster state change has occurred - updating...
[junit4:junit4]   2> 16425 T49 oascc.ZkStateReader$2.process A cluster state change has occurred - updating...
[junit4:junit4]   2> 16425 T73 oascc.ZkStateReader$2.process A cluster state change has occurred - updating...
[junit4:junit4]   2> 16425 T61 oascc.ZkStateReader$2.process A cluster state change has occurred - updating...
[junit4:junit4]   2> 16518 T14 oascc.ZkStateReader.updateClusterState Updating cloud state from ZooKeeper... 
[junit4:junit4]   2>  C2_STATE=coll:collection1 core:collection1 props:{shard=shard2, roles=null, state=recovering, core=collection1, collection=collection1, node_name=127.0.0.1:63529_solr, base_url=http://127.0.0.1:63529/solr}
[junit4:junit4]   2> 16640 T89 C2 P63529 oasc.RecoveryStrategy.doRecovery Begin buffering updates. core=collection1
[junit4:junit4]   2> 16640 T89 C2 P63529 oasu.UpdateLog.bufferUpdates Starting to buffer updates. FSUpdateLog{state=ACTIVE, tlog=null}
[junit4:junit4]   2> 16640 T89 C2 P63529 oasc.RecoveryStrategy.replicate Attempting to replicate from http://127.0.0.1:10323/solr/collection1/. core=collection1
[junit4:junit4]   2> 16641 T89 C2 P63529 oascsi.HttpClientUtil.createClient Creating new http client, config:maxConnections=128&maxConnectionsPerHost=32&followRedirects=false
[junit4:junit4]   2> 16656 T55 C3 P10323 oasu.DirectUpdateHandler2.commit start commit{flags=0,_version_=0,optimize=false,openSearcher=true,waitSearcher=true,expungeDeletes=false,softCommit=false}
[junit4:junit4]   2> 16660 T55 C3 P10323 oasc.SolrDeletionPolicy.onInit SolrDeletionPolicy.onInit: commits:num=1
[junit4:junit4]   2> 		commit{dir=NRTCachingDirectory(org.apache.lucene.store.NIOFSDirectory@/usr/home/hudson/hudson-slave/workspace/Lucene-Solr-Tests-trunk-java7/solr/build/solr-core/test/J1/org.apache.solr.cloud.BasicDistributedZk2Test-1348190255652/jetty2/index lockFactory=org.apache.lucene.store.NativeFSLockFactory@1ece5b86; maxCacheMB=48.0 maxMergeSizeMB=4.0),segFN=segments_1,generation=1,filenames=[segments_1]
[junit4:junit4]   2> 16661 T55 C3 P10323 oasc.SolrDeletionPolicy.updateCommits newest commit = 1
[junit4:junit4]   2> 16662 T55 C3 P10323 oass.SolrIndexSearcher.<init> Opening Searcher@3295dfea main
[junit4:junit4]   2> 16663 T55 C3 P10323 oasu.DirectUpdateHandler2.commit end_commit_flush
[junit4:junit4]   2> 16665 T62 oasc.SolrCore.registerSearcher [collection1] Registered new searcher Searcher@3295dfea main{StandardDirectoryReader(segments_1:1)}
[junit4:junit4]   2> 16666 T55 C3 P10323 /update {waitSearcher=true&commit=true&commit_end_point=true&wt=javabin&softCommit=false&version=2} {commit=} 0 10
[junit4:junit4]   2> 16667 T89 C2 P63529 oash.ReplicationHandler.inform Commits will be reserved for  10000
[junit4:junit4]   2> 16668 T89 C2 P63529 oash.SnapPuller.<init>  No value set for 'pollInterval'. Timer Task not started.
[junit4:junit4]   2> 16670 T56 C3 P10323 oash.ReplicationHandler.inform Commits will be reserved for  10000
[junit4:junit4]   2> 16671 T56 C3 P10323 REQ /replication {command=indexversion&wt=javabin&qt=/replication&version=2} status=0 QTime=1 
[junit4:junit4]   2> 16677 T89 C2 P63529 oasc.SolrDeletionPolicy.onInit SolrDeletionPolicy.onInit: commits:num=1
[junit4:junit4]   2> 		commit{dir=NRTCachingDirectory(org.apache.lucene.store.NIOFSDirectory@/usr/home/hudson/hudson-slave/workspace/Lucene-Solr-Tests-trunk-java7/solr/build/solr-core/test/J1/org.apache.solr.cloud.BasicDistributedZk2Test-1348190255652/jetty4/index lockFactory=org.apache.lucene.store.NativeFSLockFactory@1ab5bb12; maxCacheMB=48.0 maxMergeSizeMB=4.0),segFN=segments_1,generation=1,filenames=[segments_1]
[junit4:junit4]   2> 16677 T89 C2 P63529 oasc.SolrDeletionPolicy.updateCommits newest commit = 1
[junit4:junit4]   2> 16678 T89 C2 P63529 oasu.DirectUpdateHandler2.commit start commit{flags=0,_version_=0,optimize=false,openSearcher=true,waitSearcher=true,expungeDeletes=false,softCommit=false}
[junit4:junit4]   2> 16681 T89 C2 P63529 oasc.SolrDeletionPolicy.onCommit SolrDeletionPolicy.onCommit: commits:num=2
[junit4:junit4]   2> 		commit{dir=NRTCachingDirectory(org.apache.lucene.store.NIOFSDirectory@/usr/home/hudson/hudson-slave/workspace/Lucene-Solr-Tests-trunk-java7/solr/build/solr-core/test/J1/org.apache.solr.cloud.BasicDistributedZk2Test-1348190255652/jetty4/index lockFactory=org.apache.lucene.store.NativeFSLockFactory@1ab5bb12; maxCacheMB=48.0 maxMergeSizeMB=4.0),segFN=segments_1,generation=1,filenames=[segments_1]
[junit4:junit4]   2> 		commit{dir=NRTCachingDirectory(org.apache.lucene.store.NIOFSDirectory@/usr/home/hudson/hudson-slave/workspace/Lucene-Solr-Tests-trunk-java7/solr/build/solr-core/test/J1/org.apache.solr.cloud.BasicDistributedZk2Test-1348190255652/jetty4/index lockFactory=org.apache.lucene.store.NativeFSLockFactory@1ab5bb12; maxCacheMB=48.0 maxMergeSizeMB=4.0),segFN=segments_2,generation=2,filenames=[segments_2]
[junit4:junit4]   2> 16682 T89 C2 P63529 oasc.SolrDeletionPolicy.updateCommits newest commit = 2
[junit4:junit4]   2> 16685 T89 C2 P63529 oass.SolrIndexSearcher.<init> Opening Searcher@2e4f6033 main
[junit4:junit4]   2> 16686 T89 C2 P63529 oasu.DirectUpdateHandler2.commit end_commit_flush
[junit4:junit4]   2> 16689 T88 oasc.SolrCore.registerSearcher [collection1] Registered new searcher Searcher@2e4f6033 main{StandardDirectoryReader(segments_2:2)}
[junit4:junit4]   2> 16691 T89 C2 P63529 oasc.RecoveryStrategy.replay No replay needed. core=collection1
[junit4:junit4]   2> 16691 T89 C2 P63529 oasc.RecoveryStrategy.doRecovery Replication Recovery was successful - registering as Active. core=collection1
[junit4:junit4]   2> 16693 T89 C2 P63529 oasc.RecoveryStrategy.doRecovery Finished recovery process. core=collection1
[junit4:junit4]   2> 16936 T36 oascc.ZkStateReader.updateClusterState Updating cloud state from ZooKeeper... 
[junit4:junit4]   2> 16950 T35 oascc.ZkStateReader$2.process A cluster state change has occurred - updating...
[junit4:junit4]   2> 16950 T92 oascc.ZkStateReader$2.process A cluster state change has occurred - updating...
[junit4:junit4]   2> 16950 T61 oascc.ZkStateReader$2.process A cluster state change has occurred - updating...
[junit4:junit4]   2> 16950 T49 oascc.ZkStateReader$2.process A cluster state change has occurred - updating...
[junit4:junit4]   2> 16950 T87 oascc.ZkStateReader$2.process A cluster state change has occurred - updating...
[junit4:junit4]   2> 16950 T73 oascc.ZkStateReader$2.process A cluster state change has occurred - updating...
[junit4:junit4]   2> 16950 T94 oascc.ZkStateReader$2.process A cluster state change has occurred - updating...
[junit4:junit4]   2> 17521 T14 oascc.ZkStateReader.updateClusterState Updating cloud state from ZooKeeper... 
[junit4:junit4]   2> 17527 T27 C4 P32945 oasu.DirectUpdateHandler2.commit start commit{flags=0,_version_=0,optimize=false,openSearcher=true,waitSearcher=true,expungeDeletes=false,softCommit=false}
[junit4:junit4]   2> 17652 T27 C4 P32945 oasc.SolrDeletionPolicy.onCommit SolrDeletionPolicy.onCommit: commits:num=2
[junit4:junit4]   2> 		commit{dir=NRTCachingDirectory(org.apache.lucene.store.NIOFSDirectory@/usr/home/hudson/hudson-slave/workspace/Lucene-Solr-Tests-trunk-java7/solr/build/solr-core/test/J1/org.apache.solr.cloud.BasicDistributedZk2Test-1348190255652/control/data/index lockFactory=org.apache.lucene.store.NativeFSLockFactory@213e02ee; maxCacheMB=48.0 maxMergeSizeMB=4.0),segFN=segments_1,generation=1,filenames=[segments_1]
[junit4:junit4]   2> 		commit{dir=NRTCachingDirectory(org.apache.lucene.store.NIOFSDirectory@/usr/home/hudson/hudson-slave/workspace/Lucene-Solr-Tests-trunk-java7/solr/build/solr-core/test/J1/org.apache.solr.cloud.BasicDistributedZk2Test-1348190255652/control/data/index lockFactory=org.apache.lucene.store.NativeFSLockFactory@213e02ee; maxCacheMB=48.0 maxMergeSizeMB=4.0),segFN=segments_2,generation=2,filenames=[_0_Lucene40_0.tim, _0.fnm, _0_Pulsing40_0.tim, _0_Memory_0.ram, _0_nrm.cfs, _0_Pulsing40_0.prx, _0_Lucene40_0.prx, _0_Pulsing40_0.frq, _0_Memory_1.ram, _0_Lucene40_0.tip, _0_Lucene40_0.frq, _0_nrm.cfe, _0_Pulsing40_0.tip, segments_2, _0.fdx, _0.si, _0.fdt]
[junit4:junit4]   2> 17653 T27 C4 P32945 oasc.SolrDeletionPolicy.updateCommits newest commit = 2
[junit4:junit4]   2> 17672 T27 C4 P32945 oass.SolrIndexSearcher.<init> Opening Searcher@5019f68 main
[junit4:junit4]   2> 17674 T27 C4 P32945 oasu.DirectUpdateHandler2.commit end_commit_flush
[junit4:junit4]   2> 17676 T38 oasc.SolrCore.registerSearcher [collection1] Registered new searcher Searcher@5019f68 main{StandardDirectoryReader(segments_2:3 _0(5.0):C1)}
[junit4:junit4]   2> 17678 T27 C4 P32945 /update {waitSearcher=true&wt=javabin&commit=true&softCommit=false&version=2} {commit=} 0 151
[junit4:junit4]   2> 17681 T57 C3 P10323 oasu.DirectUpdateHandler2.commit start commit{flags=0,_version_=0,optimize=false,openSearcher=true,waitSearcher=true,expungeDeletes=false,softCommit=false}
[junit4:junit4]   2> 17686 T57 C3 P10323 oass.SolrIndexSearcher.<init> Opening Searcher@28c11a3c main
[junit4:junit4]   2> 17686 T57 C3 P10323 oasu.DirectUpdateHandler2.commit end_commit_flush
[junit4:junit4]   2> 17690 T62 oasc.SolrCore.registerSearcher [collection1] Registered new searcher Searcher@28c11a3c main{StandardDirectoryReader(segments_1:1)}
[junit4:junit4]   2> 17691 T57 C3 P10323 oasu.SolrCmdDistributor.distribCommit Distrib commit to:[StdNode: http://127.0.0.1:23873/solr/collection1/, StdNode: http://127.0.0.1:47711/solr/collection1/, StdNode: http://127.0.0.1:63529/solr/collection1/]
[junit4:junit4]   2> 17694 T46 C1 P23873 oasu.DirectUpdateHandler2.commit start commit{flags=0,_version_=0,optimize=false,openSearcher=true,waitSearcher=true,expungeDeletes=false,softCommit=false}
[junit4:junit4]   2>  C0_STATE=coll:collection1 core:collection1 props:{shard=shard1, roles=null, state=active, core=collection1, collection=collection1, node_name=127.0.0.1:47711_solr, base_url=http://127.0.0.1:47711/solr}
[junit4:junit4]   2> 17695 T65 C0 P47711 oasu.DirectUpdateHandler2.commit start commit{flags=0,_version_=0,optimize=false,openSearcher=true,waitSearcher=true,expungeDeletes=false,softCommit=false}
[junit4:junit4]   2> 17698 T65 C0 P47711 oass.SolrIndexSearcher.<init> Opening Searcher@574c2605 main
[junit4:junit4]   2> 17699 T65 C0 P47711 oasu.DirectUpdateHandler2.commit end_commit_flush
[junit4:junit4]   2> 17702 T74 oasc.SolrCore.registerSearcher [collection1] Registered new searcher Searcher@574c2605 main{StandardDirectoryReader(segments_2:3:nrt _0(5.0):C1)}
[junit4:junit4]   2> 17703 T65 C0 P47711 /update {waitSearcher=true&commit=true&wt=javabin&commit_end_point=true&expungeDeletes=false&softCommit=false&version=2} {commit=} 0 8
[junit4:junit4]   2> 17704 T46 C1 P23873 oass.SolrIndexSearcher.<init> Opening Searcher@36a0448e main
[junit4:junit4]   2> 17705 T46 C1 P23873 oasu.DirectUpdateHandler2.commit end_commit_flush
[junit4:junit4]   2>  C2_STATE=coll:collection1 core:collection1 props:{shard=shard2, roles=null, state=active, core=collection1, collection=collection1, node_name=127.0.0.1:63529_solr, base_url=http://127.0.0.1:63529/solr}
[junit4:junit4]   2> 17708 T79 C2 P63529 oasu.DirectUpdateHandler2.commit start commit{flags=0,_version_=0,optimize=false,openSearcher=true,waitSearcher=true,expungeDeletes=false,softCommit=false}
[junit4:junit4]   2> 17709 T50 oasc.SolrCore.registerSearcher [collection1] Registered new searcher Searcher@36a0448e main{StandardDirectoryReader(segments_2:3 _0(5.0):C1)}
[junit4:junit4]   2> 17710 T46 C1 P23873 /update {waitSearcher=true&commit=true&wt=javabin&commit_end_point=true&expungeDeletes=false&softCommit=false&version=2} {commit=} 0 16
[junit4:junit4]   2> 17714 T79 C2 P63529 oass.SolrIndexSearcher.<init> Opening Searcher@41d2fd89 main
[junit4:junit4]   2> 17714 T79 C2 P63529 oasu.DirectUpdateHandler2.commit end_commit_flush
[junit4:junit4]   2> 17717 T88 oasc.SolrCore.registerSearcher [collection1] Registered new searcher Searcher@41d2fd89 main{StandardDirectoryReader(segments_2:2)}
[junit4:junit4]   2> 17717 T79 C2 P63529 /update {waitSearcher=true&commit=true&wt=javabin&commit_end_point=true&expungeDeletes=false&softCommit=false&version=2} {commit=} 0 9
[junit4:junit4]   2> 17719 T57 C3 P10323 /update {waitSearcher=true&wt=javabin&commit=true&softCommit=false&version=2} {commit=} 0 38
[junit4:junit4]   2> 18100 T28 C4 P32945 REQ /select {fl=id,score&shard.url=127.0.0.1:32945/solr/collection1/&NOW=1348190273370&start=0&q=*:*&distrib=false&isShard=true&wt=javabin&fsv=true&rows=10&version=2} hits=1 status=0 QTime=131 
[junit4:junit4]   2> 18186 T28 C4 P32945 REQ /select {shard.url=127.0.0.1:32945/solr/collection1/&NOW=1348190273370&q=*:*&ids=1&distrib=false&isShard=true&wt=javabin&version=2} status=0 QTime=23 
[junit4:junit4]   2> 18188 T27 C4 P32945 REQ /select {wt=javabin&q=*:*&version=2} hits=1 status=0 QTime=455 
[junit4:junit4]   2> 18190 T14 oaz.ZooKeeper.<init> Initiating client connection, connectString=127.0.0.1:34039/solr sessionTimeout=10000 watcher=org.apache.solr.common.cloud.ConnectionManager@1fb1aeaa
[junit4:junit4]   2> 18191 T102 oaz.ClientCnxn$SendThread.startConnect Opening socket connection to server /127.0.0.1:34039
[junit4:junit4]   2> 18191 T14 oascc.ConnectionManager.waitForConnected Waiting for client to connect to ZooKeeper
[junit4:junit4]   2> 18193 T102 oaz.ClientCnxn$SendThread.primeConnection Socket connection established to localhost/127.0.0.1:34039, initiating session
[junit4:junit4]   2> 18193 T16 oazs.NIOServerCnxn$Factory.run Accepted socket connection from /140.211.11.196:44016
[junit4:junit4]   2> 18194 T16 oazs.NIOServerCnxn.readConnectRequest Client attempting to establish new session at /140.211.11.196:44016
[junit4:junit4]   2> 18195 T18 oazs.NIOServerCnxn.finishSessionInit Established session 0x139e666bb4b0009 with negotiated timeout 10000 for client /140.211.11.196:44016
[junit4:junit4]   2> 18196 T102 oaz.ClientCnxn$SendThread.readConnectResult Session establishment complete on server localhost/127.0.0.1:34039, sessionid = 0x139e666bb4b0009, negotiated timeout = 10000
[junit4:junit4]   2> 18196 T103 oascc.ConnectionManager.process Watcher org.apache.solr.common.cloud.ConnectionManager@1fb1aeaa name:ZooKeeperConnection Watcher:127.0.0.1:34039/solr got event WatchedEvent state:SyncConnected type:None path:null path:null type:None
[junit4:junit4]   2> 18196 T14 oascc.ConnectionManager.waitForConnected Client is connected to ZooKeeper
[junit4:junit4]   2> 18198 T14 oascc.ZkStateReader.createClusterStateWatchersAndUpdate Updating cluster state from ZooKeeper... 
[junit4:junit4]   2> 18200 T19 oazs.PrepRequestProcessor.pRequest Processed session termination for sessionid: 0x139e666bb4b0009
[junit4:junit4]   2> 18202 T103 oaz.ClientCnxn$EventThread.run EventThread shut down
[junit4:junit4]   2> 18202 T14 oaz.ZooKeeper.close Session: 0x139e666bb4b0009 closed
[junit4:junit4]   2> 18202 T16 oazs.NIOServerCnxn.closeSock Closed socket connection for client /140.211.11.196:44016 which had sessionid 0x139e666bb4b0009
[junit4:junit4]   2> 18205 T47 C1 P23873 REQ /select {distrib=false&wt=javabin&q=*:*&version=2} hits=1 status=0 QTime=0 
[junit4:junit4]   2> 18210 T58 C3 P10323 REQ /select {distrib=false&wt=javabin&q=*:*&version=2} hits=0 status=0 QTime=1 
[junit4:junit4]   2> 18219 T66 C0 P47711 REQ /select {fl=id,score&shard.url=127.0.0.1:23873/solr/collection1/|127.0.0.1:47711/solr/collection1/&NOW=1348190273851&start=0&q=*:*&distrib=false&isShard=true&wt=javabin&fsv=true&rows=10&version=2} hits=1 status=0 QTime=0 
[junit4:junit4]   2> 18221 T80 C2 P63529 REQ /select {fl=id,score&shard.url=127.0.0.1:10323/solr/collection1/|127.0.0.1:63529/solr/collection1/&NOW=1348190273851&start=0&q=*:*&distrib=false&isShard=true&wt=javabin&fsv=true&rows=10&version=2} hits=0 status=0 QTime=1 
[junit4:junit4]   2> 18227 T66 C0 P47711 REQ /select {shard.url=127.0.0.1:23873/solr/collection1/|127.0.0.1:47711/solr/collection1/&NOW=1348190273851&q=*:*&ids=1&distrib=false&isShard=true&wt=javabin&version=2} status=0 QTime=0 
[junit4:junit4]   2> 18229 T57 C3 P10323 REQ /select {wt=javabin&q=*:*&version=2} hits=1 status=0 QTime=15 
[junit4:junit4]   2> 18249 T27 C4 P32945 /update {wt=javabin&version=2} {add=[2 (1413679964616654848)]} 0 14
[junit4:junit4]   2> 18279 T79 C2 P63529 REQ /update {distrib.from=http://127.0.0.1:10323/solr/collection1/&update.distrib=FROMLEADER&wt=javabin&version=2} status=0 QTime=11 
[junit4:junit4]   2> 18281 T57 C3 P10323 /update {wt=javabin&version=2} {add=[2 (1413679964636577792)]} 0 27
[junit4:junit4]   2> 18297 T27 C4 P32945 /update {wt=javabin&version=2} {add=[3 (1413679964670132224)]} 0 11
[junit4:junit4]   2> 18333 T79 C2 P63529 REQ /update {update.distrib=FROMLEADER&distrib.from=http://127.0.0.1:10323/solr/collection1/&wt=javabin&version=2} status=0 QTime=7 
[junit4:junit4]   2> 18334 T59 C3 P10323 REQ /update {distrib.from=http://127.0.0.1:23873/solr/collection1/&update.distrib=TOLEADER&wt=javabin&version=2} status=0 QTime=20 
[junit4:junit4]   2> 18335 T43 C1 P23873 /update {wt=javabin&version=2} {add=[3]} 0 33
[junit4:junit4]   2> 18348 T27 C4 P32945 /update {wt=javabin&version=2} {add=[4 (1413679964726755328)]} 0 8
[junit4:junit4]   2> 18383 T65 C0 P47711 REQ /update {update.distrib=FROMLEADER&distrib.from=http://127.0.0.1:23873/solr/collection1/&wt=javabin&version=2} status=0 QTime=11 
[junit4:junit4]   2> 18384 T46 C1 P23873 REQ /update {distrib.from=http://127.0.0.1:10323/solr/collection1/&update.distrib=TOLEADER&wt=javabin&version=2} status=0 QTime=27 
[junit4:junit4]   2> 18385 T57 C3 P10323 /update {wt=javabin&version=2} {add=[4]} 0 32
[junit4:junit4]   2> 18397 T27 C4 P32945 /update {wt=javabin&version=2} {add=[5 (1413679964779184128)]} 0 7
[junit4:junit4]   2> 18418 T79 C2 P63529 REQ /update {distrib.from=http://127.0.0.1:10323/solr/collection1/&update.distrib=FROMLEADER&wt=javabin&version=2} status=0 QTime=7 
[junit4:junit4]   2> 18419 T57 C3 P10323 /update {wt=javabin&version=2} {add=[5 (1413679964790718464)]} 0 18
[junit4:junit4]   2> 18430 T27 C4 P32945 /update {wt=javabin&version=2} {add=[6 (1413679964813787136)]} 0 7
[junit4:junit4]   2> 18451 T79 C2 P63529 REQ /update {distrib.from=http://127.0.0.1:10323/solr/collection1/&update.distrib=FROMLEADER&wt=javabin&version=2} status=0 QTime=7 
[junit4:junit4]   2> 18452 T57 C3 P10323 /update {wt=javabin&version=2} {add=[6 (1413679964825321472)]} 0 18
[junit4:junit4]   2> 18463 T27 C4 P32945 /update {wt=javabin&version=2} {add=[7 (1413679964849438720)]} 0 6
[junit4:junit4]   2> 18485 T79 C2 P63529 REQ /update {distrib.from=http://127.0.0.1:10323/solr/collection1/&update.distrib=FROMLEADER&wt=javabin&version=2} status=0 QTime=7 
[junit4:junit4]   2> 18486 T57 C3 P10323 /update {wt=javabin&version=2} {add=[7 (1413679964860973056)]} 0 18
[junit4:junit4]   2> 18497 T27 C4 P32945 /update {wt=javabin&version=2} {add=[8 (1413679964885090304)]} 0 6
[junit4:junit4]   2> 18526 T65 C0 P47711 REQ /update {update.distrib=FROMLEADER&distrib.from=http://127.0.0.1:23873/solr/collection1/&wt=javabin&version=2} status=0 QTime=7 
[junit4:junit4]   2> 18528 T46 C1 P23873 REQ /update {distrib.from=http://127.0.0.1:10323/solr/collection1/&update.distrib=TOLEADER&wt=javabin&version=2} status=0 QTime=21 
[junit4:junit4]   2> 18529 T57 C3 P10323 /update {wt=javabin&version=2} {add=[8]} 0 27
[junit4:junit4]   2> 18540 T27 C4 P32945 /update {wt=javabin&version=2} {add=[9 (1413679964930179072)]} 0 6
[junit4:junit4]   2> 18565 T79 C2 P63529 REQ /update {update.distrib=FROMLEADER&distrib.from=http://127.0.0.1:10323/solr/collection1/&wt=javabin&version=2} status=0 QTime=6 
[junit4:junit4]   2> 18566 T59 C3 P10323 REQ /update {distrib.from=http://127.0.0.1:23873/solr/collection1/&update.distrib=TOLEADER&wt=javabin&version=2} status=0 QTime=17 
[junit4:junit4]   2> 18567 T43 C1 P23873 /update {wt=javabin&version=2} {add=[9]} 0 22
[junit4:junit4]   2> 18578 T27 C4 P32945 /update {wt=javabin&version=2} {add=[10 (1413679964970024960)]} 0 6
[junit4:junit4]   2> 18601 T65 C0 P47711 REQ /update {distrib.from=http://127.0.0.1:23873/solr/collection1/&update.distrib=FROMLEADER&wt=javabin&version=2} status=0 QTime=7 
[junit4:junit4]   2> 18602 T43 C1 P23873 /update {wt=javabin&version=2} {add=[10 (1413679964981559296)]} 0 19
[junit4:junit4]   2> 18723 T27 C4 P32945 /update {wt=javabin&version=2} {add=[11 (1413679965006725120)]} 0 116
[junit4:junit4]   2> 18745 T65 C0 P47711 REQ /update {distrib.from=http://127.0.0.1:23873/solr/collection1/&update.distrib=FROMLEADER&wt=javabin&version=2} status=0 QTime=7 
[junit4:junit4]   2> 18746 T43 C1 P23873 /update {wt=javabin&version=2} {add=[11 (1413679965133602816)]} 0 18
[junit4:junit4]   2> 18759 T27 C4 P32945 /update {wt=javabin&version=2} {add=[12 (1413679965157720064)]} 0 8
[junit4:junit4]   2> 18786 T65 C0 P47711 REQ /update {update.distrib=FROMLEADER&distrib.from=http://127.0.0.1:23873/solr/collection1/&wt=javabin&version=2} status=0 QTime=6 
[junit4:junit4]   2> 18787 T46 C1 P23873 REQ /update {distrib.from=http://127.0.0.1:10323/solr/collection1/&update.distrib=TOLEADER&wt=javabin&version=2} status=0 QTime=18 
[junit4:junit4]   2> 18789 T57 C3 P10323 /update {wt=javabin&version=2} {add=[12]} 0 25
[junit4:junit4]   2> 18799 T27 C4 P32945 /update {wt=javabin&version=2} {add=[13 (1413679965201760256)]} 0 6
[junit4:junit4]   2> 18827 T65 C0 P47711 REQ /update {update.distrib=FROMLEADER&distrib.from=http://127.0.0.1:23873/solr/collection1/&wt=javabin&version=2} status=0 QTime=6 
[junit4:junit4]   2> 18829 T46 C1 P23873 REQ /update {distrib.from=http://127.0.0.1:10323/solr/collection1/&update.distrib=TOLEADER&wt=javabin&version=2} status=0 QTime=21 
[junit4:junit4]   2> 18830 T57 C3 P10323 /update {wt=javabin&version=2} {add=[13]} 0 26
[junit4:junit4]   2> 18840 T27 C4 P32945 /update {wt=javabin&version=2} {add=[14 (1413679965244751872)]} 0 6
[junit4:junit4]   2> 18863 T65 C0 P47711 REQ /update {update.distrib=FROMLEADER&distrib.from=http://127.0.0.1:23873/solr/collection1/&wt=javabin&version=2} status=0 QTime=5 
[junit4:junit4]   2> 18865 T46 C1 P23873 REQ /update {distrib.from=http://127.0.0.1:10323/solr/collection1/&update.distrib=TOLEADER&wt=javabin&version=2} status=0 QTime=17 
[junit4:junit4]   2> 18866 T57 C3 P10323 /update {wt=javabin&version=2} {add=[14]} 0 23
[junit4:junit4]   2> 18876 T27 C4 P32945 /update {wt=javabin&version=2} {add=[15 (1413679965283549184)]} 0 5
[junit4:junit4]   2> 18901 T65 C0 P47711 REQ /update {update.distrib=FROMLEADER&distrib.from=http://127.0.0.1:23873/solr/collection1/&wt=javabin&version=2} status=0 QTime=5 
[junit4:junit4]   2> 18903 T46 C1 P23873 REQ /update {distrib.from=http://127.0.0.1:10323/solr/collection1/&update.distrib=TOLEADER&wt=javabin&version=2} status=0 QTime=17 
[junit4:junit4]   2> 18904 T57 C3 P10323 /update {wt=javabin&version=2} {add=[15]} 0 23
[junit4:junit4]   2> 18914 T27 C4 P32945 /update {wt=javabin&version=2} {add=[16 (1413679965322346496)]} 0 5
[junit4:junit4]   2> 18945 T65 C0 P47711 REQ /update {distrib.from=http://127.0.0.1:23873/solr/collection1/&update.distrib=FROMLEADER&wt=javabin&version=2} status=0 QTime=5 
[junit4:junit4]   2> 18947 T43 C1 P23873 /update {wt=javabin&version=2} {add=[16 (1413679965332832256)]} 0 29
[junit4:junit4]   2> 18972 T27 C4 P32945 /update {wt=javabin&version=2} {add=[17 (1413679965372678144)]} 0 21
[junit4:junit4]   2> 19031 T79 C2 P63529 REQ /update {distrib.from=http://127.0.0.1:10323/solr/collection1/&update.distrib=FROMLEADER&wt=javabin&version=2} status=0 QTime=29 
[junit4:junit4]   2> 19033 T57 C3 P10323 /update {wt=javabin&version=2} {add=[17 (1413679965399941120)]} 0 55
[junit4:junit4]   2> 19042 T27 C4 P32945 /update {wt=javabin&version=2} {add=[100 (1413679965457612800)]} 0 4
[junit4:junit4]   2> 19251 T65 C0 P47711 REQ /update {update.distrib=FROMLEADER&distrib.from=http://127.0.0.1:23873/solr/collection1/&wt=javabin&version=2} status=0 QTime=81 
[junit4:junit4]   2> 19252 T46 C1 P23873 REQ /update {distrib.from=http://127.0.0.1:10323/solr/collection1/&update.distrib=TOLEADER&wt=javabin&version=2} status=0 QTime=201 
[junit4:junit4]   2> 19253 T57 C3 P10323 /update {wt=javabin&version=2} {add=[100]} 0 206
[junit4:junit4]   2> 19262 T27 C4 P32945 /update {wt=javabin&version=2} {add=[101 (1413679965688299520)]} 0 4
[junit4:junit4]   2> 19286 T65 C0 P47711 REQ /update {update.distrib=FROMLEADER&distrib.from=http://127.0.0.1:23873/solr/collection1/&wt=javabin&version=2} status=0 QTime=6 
[junit4:junit4]   2> 19288 T46 C1 P23873 REQ /update {distrib.from=http://127.0.0.1:10323/solr/collection1/&update.distrib=TOLEADER&wt=javabin&version=2} status=0 QTime=18 
[junit4:junit4]   2> 19289 T57 C3 P10323 /update {wt=javabin&version=2} {add=[101]} 0 24
[junit4:junit4]   2> 19298 T27 C4 P32945 /update {wt=javabin&version=2} {add=[102 (1413679965726048256)]} 0 4
[junit4:junit4]   2> 19340 T65 C0 P47711 REQ /update {distrib.from=http://127.0.0.1:23873/solr/collection1/&update.distrib=FROMLEADER&wt=javabin&version=2} status=0 QTime=4 
[junit4:junit4]   2> 19341 T43 C1 P23873 /update {wt=javabin&version=2} {add=[102 (1413679965734436864)]} 0 39
[junit4:junit4]   2> 19393 T27 C4 P32945 /update {wt=javabin&version=2} {add=[103 (1413679965780574208)]} 0 48
[junit4:junit4]   2> 19405 T79 C2 P63529 REQ /update {distrib.from=http://127.0.0.1:10323/solr/collection1/&update.distrib=FROMLEADER&wt=javabin&version=2} status=0 QTime=3 
[junit4:junit4]   2> 19406 T57 C3 P10323 /update {wt=javabin&version=2} {add=[103 (1413679965834051584)]} 0 10
[junit4:junit4]   2> 19416 T27 C4 P32945 /update {wt=javabin&version=2} {add=[104 (1413679965848731648)]} 0 6
[junit4:junit4]   2> 19429 T79 C2 P63529 REQ /update {update.distrib=FROMLEADER&distrib.from=http://127.0.0.1:10323/solr/collection1/&wt=javabin&version=2} status=0 QTime=2 
[junit4:junit4]   2> 19430 T59 C3 P10323 REQ /update {distrib.from=http://127.0.0.1:23873/solr/collection1/&update.distrib=TOLEADER&wt=javabin&version=2} status=0 QTime=8 
[junit4:junit4]   2> 19431 T43 C1 P23873 /update {wt=javabin&version=2} {add=[104]} 0 12
[junit4:junit4]   2> 19438 T27 C4 P32945 /update {wt=javabin&version=2} {add=[105 (1413679965873897472)]} 0 4
[junit4:junit4]   2> 19527 T79 C2 P63529 REQ /update {update.distrib=FROMLEADER&distrib.from=http://127.0.0.1:10323/solr/collection1/&wt=javabin&version=2} status=0 QTime=40 
[junit4:junit4]   2> 19528 T59 C3 P10323 REQ /update {distrib.from=http://127.0.0.1:23873/solr/collection1/&update.distrib=TOLEADER&wt=javabin&version=2} status=0 QTime=84 
[junit4:junit4]   2> 19529 T43 C1 P23873 /update {wt=javabin&version=2} {add=[105]} 0 88
[junit4:junit4]   2> 19537 T27 C4 P32945 /update {wt=javabin&version=2} {add=[106 (1413679965977706496)]} 0 4
[junit4:junit4]   2> 19557 T79 C2 P63529 REQ /update {update.distrib=FROMLEADER&distrib.from=http://127.0.0.1:10323/solr/collection1/&wt=javabin&version=2} status=0 QTime=6 
[junit4:junit4]   2> 19558 T59 C3 P10323 REQ /update {distrib.from=http://127.0.0.1:23873/solr/collection1/&update.distrib=TOLEADER&wt=javabin&version=2} status=0 QTime=14 
[junit4:junit4]   2> 19559 T43 C1 P23873 /update {wt=javabin&version=2} {add=[106]} 0 18
[junit4:junit4]   2> 19566 T27 C4 P32945 /update {wt=javabin&version=2} {add=[107 (1413679966008115200)]} 0 4
[junit4:junit4]   2> 19584 T65 C0 P47711 REQ /update {update.distrib=FROMLEADER&distrib.from=http://127.0.0.1:23873/solr/collection1/&wt=javabin&version=2} status=0 QTime=3 
[junit4:junit4]   2> 19585 T46 C1 P23873 REQ /update {distrib.from=http://127.0.0.1:10323/solr/collection1/&update.distrib=TOLEADER&wt=javabin&version=2} status=0 QTime=12 
[junit4:junit4]   2> 19587 T57 C3 P10323 /update {wt=javabin&version=2} {add=[107]} 0 18
[junit4:junit4]   2> 19594 T27 C4 P32945 /update {wt=javabin&version=2} {add=[108 (1413679966037475328)]} 0 4
[junit4:junit4]   2> 19612 T65 C0 P47711 REQ /update {update.distrib=FROMLEADER&distrib.from=http://127.0.0.1:23873/solr/collection1/&wt=javabin&version=2} status=0 QTime=3 
[junit4:junit4]   2> 19613 T46 C1 P23873 REQ /update {distrib.from=http://127.0.0.1:10323/solr/collection1/&update.distrib=TOLEADER&wt=javabin&version=2} status=0 QTime=12 
[junit4:junit4]   2> 19614 T57 C3 P10323 /update {wt=javabin&version=2} {add=[108]} 0 17
[junit4:junit4]   2> 19621 T27 C4 P32945 /update {wt=javabin&version=2} {add=[109 (1413679966066835456)]} 0 3
[junit4:junit4]   2> 19636 T65 C0 P47711 REQ /update {update.distrib=FROMLEADER&distrib.from=http://127.0.0.1:23873/solr/collection1/&wt=javabin&version=2} status=0 QTime=3 
[junit4:junit4]   2> 19637 T46 C1 P23873 REQ /update {distrib.from=http://127.0.0.1:10323/solr/collection1/&update.distrib=TOLEADER&wt=javabin&version=2} status=0 QTime=10 
[junit4:junit4]   2> 19638 T57 C3 P10323 /update {wt=javabin&version=2} {add=[109]} 0 14
[junit4:junit4]   2> 19645 T27 C4 P32945 /update {wt=javabin&version=2} {a

[...truncated too long message...]

4047 T1339 oejsh.ContextHandler.doStop stopped o.e.j.s.ServletContextHandler{/solr,null}
[junit4:junit4]   2> 134099 T1339 oasc.ChaosMonkey.monkeyLog monkey: stop shard! 55531
[junit4:junit4]   2> 134099 T1339 oasc.CoreContainer.shutdown Shutting down CoreContainer instance=8282570
[junit4:junit4]   2> 134100 T1339 oasc.SolrCore.close [collection1]  CLOSING SolrCore org.apache.solr.core.SolrCore@7d958b86
[junit4:junit4]   2> 134122 T1339 oasc.SolrCore.closeSearcher [collection1] Closing main searcher on request.
[junit4:junit4]   2> 134123 T1339 oasu.DirectUpdateHandler2.close closing DirectUpdateHandler2{commits=5,autocommits=0,soft autocommits=0,optimizes=0,rollbacks=0,expungeDeletes=0,docsPending=0,adds=0,deletesById=0,deletesByQuery=0,errors=0,cumulative_adds=5,cumulative_deletesById=0,cumulative_deletesByQuery=1,cumulative_errors=0}
[junit4:junit4]   2> 134123 T1339 oasu.DefaultSolrCoreState.decref SolrCoreState ref count has reached 0 - closing IndexWriter
[junit4:junit4]   2> 134126 T1339 oasu.DefaultSolrCoreState.decref Closing SolrCoreState - canceling any ongoing recovery
[junit4:junit4]   2> 134233 T1413 oaz.ClientCnxn$EventThread.run EventThread shut down
[junit4:junit4]   2> 134233 T1339 oaz.ZooKeeper.close Session: 0x139e66e88990006 closed
[junit4:junit4]   2> 134234 T1339 oejsh.ContextHandler.doStop stopped o.e.j.s.ServletContextHandler{/solr,null}
[junit4:junit4]   2> 134402 T1339 oas.SolrTestCaseJ4.tearDown ###Ending testDistribSearch
[junit4:junit4]   2> NOTE: reproduce with: ant test  -Dtestcase=SyncSliceTest -Dtests.method=testDistribSearch -Dtests.seed=14E1828DB8B45C70 -Dtests.multiplier=3 -Dtests.slow=true -Dtests.locale=sr_RS -Dtests.timezone=Canada/Eastern -Dtests.file.encoding=ISO-8859-1
[junit4:junit4] FAILURE  134s J1 | SyncSliceTest.testDistribSearch <<<
[junit4:junit4]    > Throwable #1: java.lang.AssertionError: There are still nodes recoverying
[junit4:junit4]    > 	at __randomizedtesting.SeedInfo.seed([14E1828DB8B45C70:95070C95CFEB3C4C]:0)
[junit4:junit4]    > 	at org.junit.Assert.fail(Assert.java:93)
[junit4:junit4]    > 	at org.apache.solr.cloud.AbstractDistribZkTestBase.waitForRecoveriesToFinish(AbstractDistribZkTestBase.java:154)
[junit4:junit4]    > 	at org.apache.solr.cloud.AbstractFullDistribZkTestBase.waitForRecoveriesToFinish(AbstractFullDistribZkTestBase.java:560)
[junit4:junit4]    > 	at org.apache.solr.cloud.AbstractFullDistribZkTestBase.waitForThingsToLevelOut(AbstractFullDistribZkTestBase.java:1135)
[junit4:junit4]    > 	at org.apache.solr.cloud.SyncSliceTest.doTest(SyncSliceTest.java:162)
[junit4:junit4]    > 	at org.apache.solr.BaseDistributedSearchTestCase.testDistribSearch(BaseDistributedSearchTestCase.java:695)
[junit4:junit4]    > 	at sun.reflect.NativeMethodAccessorImpl.invoke0(Native Method)
[junit4:junit4]    > 	at sun.reflect.NativeMethodAccessorImpl.invoke(NativeMethodAccessorImpl.java:57)
[junit4:junit4]    > 	at sun.reflect.DelegatingMethodAccessorImpl.invoke(DelegatingMethodAccessorImpl.java:43)
[junit4:junit4]    > 	at java.lang.reflect.Method.invoke(Method.java:601)
[junit4:junit4]    > 	at com.carrotsearch.randomizedtesting.RandomizedRunner.invoke(RandomizedRunner.java:1559)
[junit4:junit4]    > 	at com.carrotsearch.randomizedtesting.RandomizedRunner.access$600(RandomizedRunner.java:79)
[junit4:junit4]    > 	at com.carrotsearch.randomizedtesting.RandomizedRunner$6.evaluate(RandomizedRunner.java:737)
[junit4:junit4]    > 	at com.carrotsearch.randomizedtesting.RandomizedRunner$7.evaluate(RandomizedRunner.java:773)
[junit4:junit4]    > 	at com.carrotsearch.randomizedtesting.RandomizedRunner$8.evaluate(RandomizedRunner.java:787)
[junit4:junit4]    > 	at com.carrotsearch.randomizedtesting.rules.SystemPropertiesRestoreRule$1.evaluate(SystemPropertiesRestoreRule.java:53)
[junit4:junit4]    > 	at org.apache.lucene.util.TestRuleSetupTeardownChained$1.evaluate(TestRuleSetupTeardownChained.java:50)
[junit4:junit4]    > 	at org.apache.lucene.util.TestRuleFieldCacheSanity$1.evaluate(TestRuleFieldCacheSanity.java:51)
[junit4:junit4]    > 	at org.apache.lucene.util.AbstractBeforeAfterRule$1.evaluate(AbstractBeforeAfterRule.java:45)
[junit4:junit4]    > 	at com.carrotsearch.randomizedtesting.rules.SystemPropertiesInvariantRule$1.evaluate(SystemPropertiesInvariantRule.java:55)
[junit4:junit4]    > 	at org.apache.lucene.util.TestRuleThreadAndTestName$1.evaluate(TestRuleThreadAndTestName.java:48)
[junit4:junit4]    > 	at org.apache.lucene.util.TestRuleIgnoreAfterMaxFailures$1.evaluate(TestRuleIgnoreAfterMaxFailures.java:70)
[junit4:junit4]    > 	at org.apache.lucene.util.TestRuleMarkFailure$1.evaluate(TestRuleMarkFailure.java:48)
[junit4:junit4]    > 	at com.carrotsearch.randomizedtesting.rules.StatementAdapter.evaluate(StatementAdapter.java:36)
[junit4:junit4]    > 	at com.carrotsearch.randomizedtesting.ThreadLeakControl$StatementRunner.run(ThreadLeakControl.java:358)
[junit4:junit4]    > 	at com.carrotsearch.randomizedtesting.ThreadLeakControl.forkTimeoutingTask(ThreadLeakControl.java:782)
[junit4:junit4]    > 	at com.carrotsearch.randomizedtesting.ThreadLeakControl$3.evaluate(ThreadLeakControl.java:442)
[junit4:junit4]    > 	at com.carrotsearch.randomizedtesting.RandomizedRunner.runSingleTest(RandomizedRunner.java:746)
[junit4:junit4]    > 	at com.carrotsearch.randomizedtesting.RandomizedRunner$3.evaluate(RandomizedRunner.java:648)
[junit4:junit4]    > 	at com.carrotsearch.randomizedtesting.RandomizedRunner$4.evaluate(RandomizedRunner.java:682)
[junit4:junit4]    > 	at com.carrotsearch.randomizedtesting.RandomizedRunner$5.evaluate(RandomizedRunner.java:693)
[junit4:junit4]    > 	at com.carrotsearch.randomizedtesting.rules.StatementAdapter.evaluate(StatementAdapter.java:36)
[junit4:junit4]    > 	at com.carrotsearch.randomizedtesting.rules.SystemPropertiesRestoreRule$1.evaluate(SystemPropertiesRestoreRule.java:53)
[junit4:junit4]    > 	at org.apache.lucene.util.AbstractBeforeAfterRule$1.evaluate(AbstractBeforeAfterRule.java:45)
[junit4:junit4]    > 	at org.apache.lucene.util.TestRuleStoreClassName$1.evaluate(TestRuleStoreClassName.java:42)
[junit4:junit4]    > 	at com.carrotsearch.randomizedtesting.rules.SystemPropertiesInvariantRule$1.evaluate(SystemPropertiesInvariantRule.java:55)
[junit4:junit4]    > 	at com.carrotsearch.randomizedtesting.rules.NoShadowingOrOverridesOnMethodsRule$1.evaluate(NoShadowingOrOverridesOnMethodsRule.java:39)
[junit4:junit4]    > 	at com.carrotsearch.randomizedtesting.rules.NoShadowingOrOverridesOnMethodsRule$1.evaluate(NoShadowingOrOverridesOnMethodsRule.java:39)
[junit4:junit4]    > 	at com.carrotsearch.randomizedtesting.rules.StatementAdapter.evaluate(StatementAdapter.java:36)
[junit4:junit4]    > 	at org.apache.lucene.util.TestRuleAssertionsRequired$1.evaluate(TestRuleAssertionsRequired.java:43)
[junit4:junit4]    > 	at org.apache.lucene.util.TestRuleMarkFailure$1.evaluate(TestRuleMarkFailure.java:48)
[junit4:junit4]    > 	at org.apache.lucene.util.TestRuleIgnoreAfterMaxFailures$1.evaluate(TestRuleIgnoreAfterMaxFailures.java:70)
[junit4:junit4]    > 	at org.apache.lucene.util.TestRuleIgnoreTestSuites$1.evaluate(TestRuleIgnoreTestSuites.java:55)
[junit4:junit4]    > 	at com.carrotsearch.randomizedtesting.rules.StatementAdapter.evaluate(StatementAdapter.java:36)
[junit4:junit4]    > 	at com.carrotsearch.randomizedtesting.ThreadLeakControl$StatementRunner.run(ThreadLeakControl.java:358)
[junit4:junit4]    > 	at java.lang.Thread.run(Thread.java:722)
[junit4:junit4]   2> 134421 T1339 oas.SolrTestCaseJ4.deleteCore ###deleteCore
[junit4:junit4]   2> NOTE: test params are: codec=Asserting, sim=DefaultSimilarity, locale=sr_RS, timezone=Canada/Eastern
[junit4:junit4]   2> NOTE: FreeBSD 9.0-RELEASE amd64/Oracle Corporation 1.7.0_06 (64-bit)/cpus=16,threads=1,free=363581008,total=432013312
[junit4:junit4]   2> NOTE: All tests run in this JVM: [XmlUpdateRequestHandlerTest, BasicDistributedZk2Test, TestHashPartitioner, BasicZkTest, TestArbitraryIndexDir, PolyFieldTest, EchoParamsTest, OpenExchangeRatesOrgProviderTest, TestPluginEnable, OverseerTest, TestSolrCoreProperties, FileUtilsTest, TermVectorComponentDistributedTest, IndexSchemaRuntimeFieldTest, DirectSolrSpellCheckerTest, XsltUpdateRequestHandlerTest, QueryParsingTest, TestCSVLoader, ScriptEngineTest, TestCharFilters, TestLRUCache, TestPhraseSuggestions, TestCSVResponseWriter, QueryEqualityTest, ShowFileRequestHandlerTest, TestDistributedGrouping, SolrIndexConfigTest, TestPropInjectDefaults, TestPropInject, RAMDirectoryFactoryTest, StandardRequestHandlerTest, TestRealTimeGet, DOMUtilTest, IndexReaderFactoryTest, RecoveryZkTest, TestStressLucene, PingRequestHandlerTest, TimeZoneUtilsTest, BadIndexSchemaTest, TestJmxIntegration, StatelessScriptUpdateProcessorFactoryTest, TestSort, TermVectorComponentTest, LukeRequestHandlerTest, HighlighterTest, ClusterStateUpdateTest, TestBM25SimilarityFactory, TestMultiCoreConfBootstrap, SyncSliceTest]
[junit4:junit4] Completed on J1 in 134.45s, 1 test, 1 failure <<< FAILURES!

[...truncated 376 lines...]
BUILD FAILED
/usr/home/hudson/hudson-slave/workspace/Lucene-Solr-Tests-trunk-java7/build.xml:32: The following error occurred while executing this line:
/usr/home/hudson/hudson-slave/workspace/Lucene-Solr-Tests-trunk-java7/solr/build.xml:179: The following error occurred while executing this line:
/usr/home/hudson/hudson-slave/workspace/Lucene-Solr-Tests-trunk-java7/lucene/module-build.xml:63: The following error occurred while executing this line:
/usr/home/hudson/hudson-slave/workspace/Lucene-Solr-Tests-trunk-java7/lucene/common-build.xml:1140: The following error occurred while executing this line:
/usr/home/hudson/hudson-slave/workspace/Lucene-Solr-Tests-trunk-java7/lucene/common-build.xml:813: There were test failures: 230 suites, 950 tests, 3 failures, 7 ignored (2 assumptions)

Total time: 30 minutes 2 seconds
Build step 'Invoke Ant' marked build as failure
Recording test results
Email was triggered for: Failure
Sending email for trigger: Failure



Mime
View raw message