lucene-dev mailing list archives

Site index · List index
Message view « Date » · « Thread »
Top « Date » · « Thread »
From Policeman Jenkins Server <jenk...@sd-datasolutions.de>
Subject [JENKINS] Lucene-Solr-4.x-Linux (64bit/ibm-j9-jdk7) - Build # 835 - Failure!
Date Mon, 03 Sep 2012 18:32:05 GMT
Build: http://jenkins.sd-datasolutions.de/job/Lucene-Solr-4.x-Linux/835/
Java: 64bit/ibm-j9-jdk7 -Xjit:exclude={org/apache/lucene/util/fst/FST.pack(IIF)Lorg/apache/lucene/util/fst/FST;}

4 tests failed.
REGRESSION:  org.apache.solr.TestDistributedSearch.testDistribSearch

Error Message:
Server at http://localhost:49277/solr returned non ok status:500, message:Server Error

Stack Trace:
org.apache.solr.common.SolrException: Server at http://localhost:49277/solr returned non ok status:500, message:Server Error
	at __randomizedtesting.SeedInfo.seed([7637BA634E60401C:F7D1347B393F2020]:0)
	at org.apache.solr.client.solrj.impl.HttpSolrServer.request(HttpSolrServer.java:373)
	at org.apache.solr.client.solrj.impl.HttpSolrServer.request(HttpSolrServer.java:182)
	at org.apache.solr.client.solrj.request.QueryRequest.process(QueryRequest.java:90)
	at org.apache.solr.client.solrj.SolrServer.query(SolrServer.java:324)
	at org.apache.solr.BaseDistributedSearchTestCase.queryServer(BaseDistributedSearchTestCase.java:371)
	at org.apache.solr.BaseDistributedSearchTestCase.query(BaseDistributedSearchTestCase.java:390)
	at org.apache.solr.TestDistributedSearch.doTest(TestDistributedSearch.java:134)
	at org.apache.solr.BaseDistributedSearchTestCase.testDistribSearch(BaseDistributedSearchTestCase.java:697)
	at sun.reflect.NativeMethodAccessorImpl.invoke0(Native Method)
	at sun.reflect.NativeMethodAccessorImpl.invoke(NativeMethodAccessorImpl.java:88)
	at sun.reflect.DelegatingMethodAccessorImpl.invoke(DelegatingMethodAccessorImpl.java:55)
	at java.lang.reflect.Method.invoke(Method.java:613)
	at com.carrotsearch.randomizedtesting.RandomizedRunner.invoke(RandomizedRunner.java:1559)
	at com.carrotsearch.randomizedtesting.RandomizedRunner.access$600(RandomizedRunner.java:79)
	at com.carrotsearch.randomizedtesting.RandomizedRunner$6.evaluate(RandomizedRunner.java:737)
	at com.carrotsearch.randomizedtesting.RandomizedRunner$7.evaluate(RandomizedRunner.java:773)
	at com.carrotsearch.randomizedtesting.RandomizedRunner$8.evaluate(RandomizedRunner.java:787)
	at com.carrotsearch.randomizedtesting.rules.SystemPropertiesRestoreRule$1.evaluate(SystemPropertiesRestoreRule.java:53)
	at org.apache.lucene.util.TestRuleSetupTeardownChained$1.evaluate(TestRuleSetupTeardownChained.java:50)
	at org.apache.lucene.util.TestRuleFieldCacheSanity$1.evaluate(TestRuleFieldCacheSanity.java:51)
	at org.apache.lucene.util.AbstractBeforeAfterRule$1.evaluate(AbstractBeforeAfterRule.java:45)
	at com.carrotsearch.randomizedtesting.rules.SystemPropertiesInvariantRule$1.evaluate(SystemPropertiesInvariantRule.java:55)
	at org.apache.lucene.util.TestRuleThreadAndTestName$1.evaluate(TestRuleThreadAndTestName.java:48)
	at org.apache.lucene.util.TestRuleIgnoreAfterMaxFailures$1.evaluate(TestRuleIgnoreAfterMaxFailures.java:70)
	at org.apache.lucene.util.TestRuleMarkFailure$1.evaluate(TestRuleMarkFailure.java:48)
	at com.carrotsearch.randomizedtesting.rules.StatementAdapter.evaluate(StatementAdapter.java:36)
	at com.carrotsearch.randomizedtesting.ThreadLeakControl$StatementRunner.run(ThreadLeakControl.java:345)
	at com.carrotsearch.randomizedtesting.ThreadLeakControl.forkTimeoutingTask(ThreadLeakControl.java:769)
	at com.carrotsearch.randomizedtesting.ThreadLeakControl$3.evaluate(ThreadLeakControl.java:429)
	at com.carrotsearch.randomizedtesting.RandomizedRunner.runSingleTest(RandomizedRunner.java:746)
	at com.carrotsearch.randomizedtesting.RandomizedRunner$3.evaluate(RandomizedRunner.java:648)
	at com.carrotsearch.randomizedtesting.RandomizedRunner$4.evaluate(RandomizedRunner.java:682)
	at com.carrotsearch.randomizedtesting.RandomizedRunner$5.evaluate(RandomizedRunner.java:693)
	at com.carrotsearch.randomizedtesting.rules.StatementAdapter.evaluate(StatementAdapter.java:36)
	at com.carrotsearch.randomizedtesting.rules.SystemPropertiesRestoreRule$1.evaluate(SystemPropertiesRestoreRule.java:53)
	at org.apache.lucene.util.AbstractBeforeAfterRule$1.evaluate(AbstractBeforeAfterRule.java:45)
	at org.apache.lucene.util.TestRuleStoreClassName$1.evaluate(TestRuleStoreClassName.java:42)
	at com.carrotsearch.randomizedtesting.rules.SystemPropertiesInvariantRule$1.evaluate(SystemPropertiesInvariantRule.java:55)
	at com.carrotsearch.randomizedtesting.rules.NoShadowingOrOverridesOnMethodsRule$1.evaluate(NoShadowingOrOverridesOnMethodsRule.java:39)
	at com.carrotsearch.randomizedtesting.rules.NoShadowingOrOverridesOnMethodsRule$1.evaluate(NoShadowingOrOverridesOnMethodsRule.java:39)
	at org.apache.lucene.util.TestRuleAssertionsRequired$1.evaluate(TestRuleAssertionsRequired.java:40)
	at org.apache.lucene.util.TestRuleMarkFailure$1.evaluate(TestRuleMarkFailure.java:48)
	at org.apache.lucene.util.TestRuleIgnoreAfterMaxFailures$1.evaluate(TestRuleIgnoreAfterMaxFailures.java:70)
	at org.apache.lucene.util.TestRuleIgnoreTestSuites$1.evaluate(TestRuleIgnoreTestSuites.java:55)
	at com.carrotsearch.randomizedtesting.rules.StatementAdapter.evaluate(StatementAdapter.java:36)
	at com.carrotsearch.randomizedtesting.ThreadLeakControl$StatementRunner.run(ThreadLeakControl.java:345)
	at java.lang.Thread.run(Thread.java:777)


REGRESSION:  org.apache.solr.cloud.BasicDistributedZkTest.testDistribSearch

Error Message:
Server at http://localhost:36393/solr returned non ok status:500, message:Server Error

Stack Trace:
org.apache.solr.common.SolrException: Server at http://localhost:36393/solr returned non ok status:500, message:Server Error
	at __randomizedtesting.SeedInfo.seed([7637BA634E60401C:F7D1347B393F2020]:0)
	at org.apache.solr.client.solrj.impl.HttpSolrServer.request(HttpSolrServer.java:373)
	at org.apache.solr.client.solrj.impl.HttpSolrServer.request(HttpSolrServer.java:182)
	at org.apache.solr.client.solrj.request.QueryRequest.process(QueryRequest.java:90)
	at org.apache.solr.client.solrj.SolrServer.query(SolrServer.java:324)
	at org.apache.solr.BaseDistributedSearchTestCase.queryServer(BaseDistributedSearchTestCase.java:371)
	at org.apache.solr.cloud.BasicDistributedZkTest.queryServer(BasicDistributedZkTest.java:1020)
	at org.apache.solr.BaseDistributedSearchTestCase.query(BaseDistributedSearchTestCase.java:390)
	at org.apache.solr.cloud.BasicDistributedZkTest.doTest(BasicDistributedZkTest.java:190)
	at org.apache.solr.BaseDistributedSearchTestCase.testDistribSearch(BaseDistributedSearchTestCase.java:691)
	at sun.reflect.NativeMethodAccessorImpl.invoke0(Native Method)
	at sun.reflect.NativeMethodAccessorImpl.invoke(NativeMethodAccessorImpl.java:88)
	at sun.reflect.DelegatingMethodAccessorImpl.invoke(DelegatingMethodAccessorImpl.java:55)
	at java.lang.reflect.Method.invoke(Method.java:613)
	at com.carrotsearch.randomizedtesting.RandomizedRunner.invoke(RandomizedRunner.java:1559)
	at com.carrotsearch.randomizedtesting.RandomizedRunner.access$600(RandomizedRunner.java:79)
	at com.carrotsearch.randomizedtesting.RandomizedRunner$6.evaluate(RandomizedRunner.java:737)
	at com.carrotsearch.randomizedtesting.RandomizedRunner$7.evaluate(RandomizedRunner.java:773)
	at com.carrotsearch.randomizedtesting.RandomizedRunner$8.evaluate(RandomizedRunner.java:787)
	at com.carrotsearch.randomizedtesting.rules.SystemPropertiesRestoreRule$1.evaluate(SystemPropertiesRestoreRule.java:53)
	at org.apache.lucene.util.TestRuleSetupTeardownChained$1.evaluate(TestRuleSetupTeardownChained.java:50)
	at org.apache.lucene.util.TestRuleFieldCacheSanity$1.evaluate(TestRuleFieldCacheSanity.java:51)
	at org.apache.lucene.util.AbstractBeforeAfterRule$1.evaluate(AbstractBeforeAfterRule.java:45)
	at com.carrotsearch.randomizedtesting.rules.SystemPropertiesInvariantRule$1.evaluate(SystemPropertiesInvariantRule.java:55)
	at org.apache.lucene.util.TestRuleThreadAndTestName$1.evaluate(TestRuleThreadAndTestName.java:48)
	at org.apache.lucene.util.TestRuleIgnoreAfterMaxFailures$1.evaluate(TestRuleIgnoreAfterMaxFailures.java:70)
	at org.apache.lucene.util.TestRuleMarkFailure$1.evaluate(TestRuleMarkFailure.java:48)
	at com.carrotsearch.randomizedtesting.rules.StatementAdapter.evaluate(StatementAdapter.java:36)
	at com.carrotsearch.randomizedtesting.ThreadLeakControl$StatementRunner.run(ThreadLeakControl.java:345)
	at com.carrotsearch.randomizedtesting.ThreadLeakControl.forkTimeoutingTask(ThreadLeakControl.java:769)
	at com.carrotsearch.randomizedtesting.ThreadLeakControl$3.evaluate(ThreadLeakControl.java:429)
	at com.carrotsearch.randomizedtesting.RandomizedRunner.runSingleTest(RandomizedRunner.java:746)
	at com.carrotsearch.randomizedtesting.RandomizedRunner$3.evaluate(RandomizedRunner.java:648)
	at com.carrotsearch.randomizedtesting.RandomizedRunner$4.evaluate(RandomizedRunner.java:682)
	at com.carrotsearch.randomizedtesting.RandomizedRunner$5.evaluate(RandomizedRunner.java:693)
	at com.carrotsearch.randomizedtesting.rules.StatementAdapter.evaluate(StatementAdapter.java:36)
	at com.carrotsearch.randomizedtesting.rules.SystemPropertiesRestoreRule$1.evaluate(SystemPropertiesRestoreRule.java:53)
	at org.apache.lucene.util.AbstractBeforeAfterRule$1.evaluate(AbstractBeforeAfterRule.java:45)
	at org.apache.lucene.util.TestRuleStoreClassName$1.evaluate(TestRuleStoreClassName.java:42)
	at com.carrotsearch.randomizedtesting.rules.SystemPropertiesInvariantRule$1.evaluate(SystemPropertiesInvariantRule.java:55)
	at com.carrotsearch.randomizedtesting.rules.NoShadowingOrOverridesOnMethodsRule$1.evaluate(NoShadowingOrOverridesOnMethodsRule.java:39)
	at com.carrotsearch.randomizedtesting.rules.NoShadowingOrOverridesOnMethodsRule$1.evaluate(NoShadowingOrOverridesOnMethodsRule.java:39)
	at org.apache.lucene.util.TestRuleAssertionsRequired$1.evaluate(TestRuleAssertionsRequired.java:40)
	at org.apache.lucene.util.TestRuleMarkFailure$1.evaluate(TestRuleMarkFailure.java:48)
	at org.apache.lucene.util.TestRuleIgnoreAfterMaxFailures$1.evaluate(TestRuleIgnoreAfterMaxFailures.java:70)
	at org.apache.lucene.util.TestRuleIgnoreTestSuites$1.evaluate(TestRuleIgnoreTestSuites.java:55)
	at com.carrotsearch.randomizedtesting.rules.StatementAdapter.evaluate(StatementAdapter.java:36)
	at com.carrotsearch.randomizedtesting.ThreadLeakControl$StatementRunner.run(ThreadLeakControl.java:345)
	at java.lang.Thread.run(Thread.java:777)


REGRESSION:  org.apache.solr.handler.component.DistributedQueryElevationComponentTest.testDistribSearch

Error Message:
Server at http://localhost:58448/solr returned non ok status:500, message:Server Error

Stack Trace:
org.apache.solr.common.SolrException: Server at http://localhost:58448/solr returned non ok status:500, message:Server Error
	at __randomizedtesting.SeedInfo.seed([7637BA634E60401C:F7D1347B393F2020]:0)
	at org.apache.solr.client.solrj.impl.HttpSolrServer.request(HttpSolrServer.java:373)
	at org.apache.solr.client.solrj.impl.HttpSolrServer.request(HttpSolrServer.java:182)
	at org.apache.solr.client.solrj.request.QueryRequest.process(QueryRequest.java:90)
	at org.apache.solr.client.solrj.SolrServer.query(SolrServer.java:324)
	at org.apache.solr.BaseDistributedSearchTestCase.queryServer(BaseDistributedSearchTestCase.java:371)
	at org.apache.solr.BaseDistributedSearchTestCase.query(BaseDistributedSearchTestCase.java:390)
	at org.apache.solr.handler.component.DistributedQueryElevationComponentTest.doTest(DistributedQueryElevationComponentTest.java:83)
	at org.apache.solr.BaseDistributedSearchTestCase.testDistribSearch(BaseDistributedSearchTestCase.java:691)
	at sun.reflect.NativeMethodAccessorImpl.invoke0(Native Method)
	at sun.reflect.NativeMethodAccessorImpl.invoke(NativeMethodAccessorImpl.java:88)
	at sun.reflect.DelegatingMethodAccessorImpl.invoke(DelegatingMethodAccessorImpl.java:55)
	at java.lang.reflect.Method.invoke(Method.java:613)
	at com.carrotsearch.randomizedtesting.RandomizedRunner.invoke(RandomizedRunner.java:1559)
	at com.carrotsearch.randomizedtesting.RandomizedRunner.access$600(RandomizedRunner.java:79)
	at com.carrotsearch.randomizedtesting.RandomizedRunner$6.evaluate(RandomizedRunner.java:737)
	at com.carrotsearch.randomizedtesting.RandomizedRunner$7.evaluate(RandomizedRunner.java:773)
	at com.carrotsearch.randomizedtesting.RandomizedRunner$8.evaluate(RandomizedRunner.java:787)
	at com.carrotsearch.randomizedtesting.rules.SystemPropertiesRestoreRule$1.evaluate(SystemPropertiesRestoreRule.java:53)
	at org.apache.lucene.util.TestRuleSetupTeardownChained$1.evaluate(TestRuleSetupTeardownChained.java:50)
	at org.apache.lucene.util.TestRuleFieldCacheSanity$1.evaluate(TestRuleFieldCacheSanity.java:51)
	at org.apache.lucene.util.AbstractBeforeAfterRule$1.evaluate(AbstractBeforeAfterRule.java:45)
	at com.carrotsearch.randomizedtesting.rules.SystemPropertiesInvariantRule$1.evaluate(SystemPropertiesInvariantRule.java:55)
	at org.apache.lucene.util.TestRuleThreadAndTestName$1.evaluate(TestRuleThreadAndTestName.java:48)
	at org.apache.lucene.util.TestRuleIgnoreAfterMaxFailures$1.evaluate(TestRuleIgnoreAfterMaxFailures.java:70)
	at org.apache.lucene.util.TestRuleMarkFailure$1.evaluate(TestRuleMarkFailure.java:48)
	at com.carrotsearch.randomizedtesting.rules.StatementAdapter.evaluate(StatementAdapter.java:36)
	at com.carrotsearch.randomizedtesting.ThreadLeakControl$StatementRunner.run(ThreadLeakControl.java:345)
	at com.carrotsearch.randomizedtesting.ThreadLeakControl.forkTimeoutingTask(ThreadLeakControl.java:769)
	at com.carrotsearch.randomizedtesting.ThreadLeakControl$3.evaluate(ThreadLeakControl.java:429)
	at com.carrotsearch.randomizedtesting.RandomizedRunner.runSingleTest(RandomizedRunner.java:746)
	at com.carrotsearch.randomizedtesting.RandomizedRunner$3.evaluate(RandomizedRunner.java:648)
	at com.carrotsearch.randomizedtesting.RandomizedRunner$4.evaluate(RandomizedRunner.java:682)
	at com.carrotsearch.randomizedtesting.RandomizedRunner$5.evaluate(RandomizedRunner.java:693)
	at com.carrotsearch.randomizedtesting.rules.StatementAdapter.evaluate(StatementAdapter.java:36)
	at com.carrotsearch.randomizedtesting.rules.SystemPropertiesRestoreRule$1.evaluate(SystemPropertiesRestoreRule.java:53)
	at org.apache.lucene.util.AbstractBeforeAfterRule$1.evaluate(AbstractBeforeAfterRule.java:45)
	at org.apache.lucene.util.TestRuleStoreClassName$1.evaluate(TestRuleStoreClassName.java:42)
	at com.carrotsearch.randomizedtesting.rules.SystemPropertiesInvariantRule$1.evaluate(SystemPropertiesInvariantRule.java:55)
	at com.carrotsearch.randomizedtesting.rules.NoShadowingOrOverridesOnMethodsRule$1.evaluate(NoShadowingOrOverridesOnMethodsRule.java:39)
	at com.carrotsearch.randomizedtesting.rules.NoShadowingOrOverridesOnMethodsRule$1.evaluate(NoShadowingOrOverridesOnMethodsRule.java:39)
	at org.apache.lucene.util.TestRuleAssertionsRequired$1.evaluate(TestRuleAssertionsRequired.java:40)
	at org.apache.lucene.util.TestRuleMarkFailure$1.evaluate(TestRuleMarkFailure.java:48)
	at org.apache.lucene.util.TestRuleIgnoreAfterMaxFailures$1.evaluate(TestRuleIgnoreAfterMaxFailures.java:70)
	at org.apache.lucene.util.TestRuleIgnoreTestSuites$1.evaluate(TestRuleIgnoreTestSuites.java:55)
	at com.carrotsearch.randomizedtesting.rules.StatementAdapter.evaluate(StatementAdapter.java:36)
	at com.carrotsearch.randomizedtesting.ThreadLeakControl$StatementRunner.run(ThreadLeakControl.java:345)
	at java.lang.Thread.run(Thread.java:777)


REGRESSION:  org.apache.solr.handler.component.StatsComponentTest.testStats

Error Message:
Exception during query

Stack Trace:
java.lang.RuntimeException: Exception during query
	at __randomizedtesting.SeedInfo.seed([7637BA634E60401C:ECB6E3DC26BC8E3F]:0)
	at org.apache.solr.util.AbstractSolrTestCase.assertQ(AbstractSolrTestCase.java:283)
	at org.apache.solr.handler.component.StatsComponentTest.doTestFacetStatisticsResult(StatsComponentTest.java:239)
	at org.apache.solr.handler.component.StatsComponentTest.testStats(StatsComponentTest.java:68)
	at sun.reflect.NativeMethodAccessorImpl.invoke0(Native Method)
	at sun.reflect.NativeMethodAccessorImpl.invoke(NativeMethodAccessorImpl.java:88)
	at sun.reflect.DelegatingMethodAccessorImpl.invoke(DelegatingMethodAccessorImpl.java:55)
	at java.lang.reflect.Method.invoke(Method.java:613)
	at com.carrotsearch.randomizedtesting.RandomizedRunner.invoke(RandomizedRunner.java:1559)
	at com.carrotsearch.randomizedtesting.RandomizedRunner.access$600(RandomizedRunner.java:79)
	at com.carrotsearch.randomizedtesting.RandomizedRunner$6.evaluate(RandomizedRunner.java:737)
	at com.carrotsearch.randomizedtesting.RandomizedRunner$7.evaluate(RandomizedRunner.java:773)
	at com.carrotsearch.randomizedtesting.RandomizedRunner$8.evaluate(RandomizedRunner.java:787)
	at com.carrotsearch.randomizedtesting.rules.SystemPropertiesRestoreRule$1.evaluate(SystemPropertiesRestoreRule.java:53)
	at org.apache.lucene.util.TestRuleSetupTeardownChained$1.evaluate(TestRuleSetupTeardownChained.java:50)
	at org.apache.lucene.util.TestRuleFieldCacheSanity$1.evaluate(TestRuleFieldCacheSanity.java:51)
	at org.apache.lucene.util.AbstractBeforeAfterRule$1.evaluate(AbstractBeforeAfterRule.java:45)
	at com.carrotsearch.randomizedtesting.rules.SystemPropertiesInvariantRule$1.evaluate(SystemPropertiesInvariantRule.java:55)
	at org.apache.lucene.util.TestRuleThreadAndTestName$1.evaluate(TestRuleThreadAndTestName.java:48)
	at org.apache.lucene.util.TestRuleIgnoreAfterMaxFailures$1.evaluate(TestRuleIgnoreAfterMaxFailures.java:70)
	at org.apache.lucene.util.TestRuleMarkFailure$1.evaluate(TestRuleMarkFailure.java:48)
	at com.carrotsearch.randomizedtesting.rules.StatementAdapter.evaluate(StatementAdapter.java:36)
	at com.carrotsearch.randomizedtesting.ThreadLeakControl$StatementRunner.run(ThreadLeakControl.java:345)
	at com.carrotsearch.randomizedtesting.ThreadLeakControl.forkTimeoutingTask(ThreadLeakControl.java:769)
	at com.carrotsearch.randomizedtesting.ThreadLeakControl$3.evaluate(ThreadLeakControl.java:429)
	at com.carrotsearch.randomizedtesting.RandomizedRunner.runSingleTest(RandomizedRunner.java:746)
	at com.carrotsearch.randomizedtesting.RandomizedRunner$3.evaluate(RandomizedRunner.java:648)
	at com.carrotsearch.randomizedtesting.RandomizedRunner$4.evaluate(RandomizedRunner.java:682)
	at com.carrotsearch.randomizedtesting.RandomizedRunner$5.evaluate(RandomizedRunner.java:693)
	at com.carrotsearch.randomizedtesting.rules.StatementAdapter.evaluate(StatementAdapter.java:36)
	at com.carrotsearch.randomizedtesting.rules.SystemPropertiesRestoreRule$1.evaluate(SystemPropertiesRestoreRule.java:53)
	at org.apache.lucene.util.AbstractBeforeAfterRule$1.evaluate(AbstractBeforeAfterRule.java:45)
	at org.apache.lucene.util.TestRuleStoreClassName$1.evaluate(TestRuleStoreClassName.java:42)
	at com.carrotsearch.randomizedtesting.rules.SystemPropertiesInvariantRule$1.evaluate(SystemPropertiesInvariantRule.java:55)
	at com.carrotsearch.randomizedtesting.rules.NoShadowingOrOverridesOnMethodsRule$1.evaluate(NoShadowingOrOverridesOnMethodsRule.java:39)
	at com.carrotsearch.randomizedtesting.rules.NoShadowingOrOverridesOnMethodsRule$1.evaluate(NoShadowingOrOverridesOnMethodsRule.java:39)
	at org.apache.lucene.util.TestRuleAssertionsRequired$1.evaluate(TestRuleAssertionsRequired.java:40)
	at org.apache.lucene.util.TestRuleMarkFailure$1.evaluate(TestRuleMarkFailure.java:48)
	at org.apache.lucene.util.TestRuleIgnoreAfterMaxFailures$1.evaluate(TestRuleIgnoreAfterMaxFailures.java:70)
	at org.apache.lucene.util.TestRuleIgnoreTestSuites$1.evaluate(TestRuleIgnoreTestSuites.java:55)
	at com.carrotsearch.randomizedtesting.rules.StatementAdapter.evaluate(StatementAdapter.java:36)
	at com.carrotsearch.randomizedtesting.ThreadLeakControl$StatementRunner.run(ThreadLeakControl.java:345)
	at java.lang.Thread.run(Thread.java:777)
Caused by: java.lang.NullPointerException
	at org.apache.solr.util.NumberUtils.SortableStr2int(NumberUtils.java:162)
	at org.apache.solr.schema.SortableIntField.toObject(SortableIntField.java:96)
	at org.apache.solr.schema.SortableIntField.toObject(SortableIntField.java:55)
	at org.apache.solr.schema.FieldType.toObject(FieldType.java:342)
	at org.apache.solr.handler.component.AbstractStatsValues.accumulate(StatsValuesFactory.java:129)
	at org.apache.solr.handler.component.SimpleStats.getFieldCacheStats(StatsComponent.java:281)
	at org.apache.solr.handler.component.SimpleStats.getStatsFields(StatsComponent.java:227)
	at org.apache.solr.handler.component.SimpleStats.getStatsCounts(StatsComponent.java:201)
	at org.apache.solr.handler.component.StatsComponent.process(StatsComponent.java:70)
	at org.apache.solr.handler.component.SearchHandler.handleRequestBody(SearchHandler.java:206)
	at org.apache.solr.handler.RequestHandlerBase.handleRequest(RequestHandlerBase.java:129)
	at org.apache.solr.core.SolrCore.execute(SolrCore.java:1693)
	at org.apache.solr.util.TestHarness.query(TestHarness.java:351)
	at org.apache.solr.util.TestHarness.query(TestHarness.java:333)
	at org.apache.solr.util.AbstractSolrTestCase.assertQ(AbstractSolrTestCase.java:273)
	... 41 more




Build Log:
[...truncated 6964 lines...]
[junit4:junit4] Suite: org.apache.solr.cloud.BasicDistributedZkTest
[junit4:junit4]   2> 4 T435 oas.SolrTestCaseJ4.setUp ###Starting testDistribSearch
[junit4:junit4]   2> Creating dataDir: /mnt/ssd/jenkins/workspace/Lucene-Solr-4.x-Linux/solr/build/solr-core/test/J0/./solrtest-BasicDistributedZkTest-1346696684488
[junit4:junit4]   2> 4 T435 oasc.ZkTestServer.run STARTING ZK TEST SERVER
[junit4:junit4]   2> 6 T436 oazs.ZooKeeperServer.setTickTime tickTime set to 3000
[junit4:junit4]   2> 6 T436 oazs.NIOServerCnxn$Factory.<init> binding to port 0.0.0.0/0.0.0.0:0
[junit4:junit4]   2> 7 T436 oazsp.FileTxnSnapLog.save Snapshotting: 0
[junit4:junit4]   2> 105 T435 oasc.ZkTestServer.run start zk server on port:45424
[junit4:junit4]   2> 106 T435 oaz.ZooKeeper.<init> Initiating client connection, connectString=127.0.0.1:45424 sessionTimeout=10000 watcher=org.apache.solr.common.cloud.ConnectionManager@8af1fedb
[junit4:junit4]   2> 106 T441 oaz.ClientCnxn$SendThread.startConnect Opening socket connection to server /127.0.0.1:45424
[junit4:junit4]   2> 106 T435 oascc.ConnectionManager.waitForConnected Waiting for client to connect to ZooKeeper
[junit4:junit4]   2> 107 T441 oaz.ClientCnxn$SendThread.primeConnection Socket connection established to localhost.localdomain/127.0.0.1:45424, initiating session
[junit4:junit4]   2> 107 T437 oazs.NIOServerCnxn$Factory.run Accepted socket connection from /127.0.0.1:33113
[junit4:junit4]   2> 108 T437 oazs.NIOServerCnxn.readConnectRequest Client attempting to establish new session at /127.0.0.1:33113
[junit4:junit4]   2> 108 T439 oazsp.FileTxnLog.append Creating new log file: log.1
[junit4:junit4]   2> 111 T439 oazs.NIOServerCnxn.finishSessionInit Established session 0x1398d60a3cc0000 with negotiated timeout 10000 for client /127.0.0.1:33113
[junit4:junit4]   2> 111 T441 oaz.ClientCnxn$SendThread.readConnectResult Session establishment complete on server localhost.localdomain/127.0.0.1:45424, sessionid = 0x1398d60a3cc0000, negotiated timeout = 10000
[junit4:junit4]   2> 111 T442 oascc.ConnectionManager.process Watcher org.apache.solr.common.cloud.ConnectionManager@8af1fedb name:ZooKeeperConnection Watcher:127.0.0.1:45424 got event WatchedEvent state:SyncConnected type:None path:null path:null type:None
[junit4:junit4]   2> 118 T435 oascc.ConnectionManager.waitForConnected Client is connected to ZooKeeper
[junit4:junit4]   2> 118 T435 oascc.SolrZkClient.makePath makePath: /solr
[junit4:junit4]   2> 122 T440 oazs.PrepRequestProcessor.pRequest Processed session termination for sessionid: 0x1398d60a3cc0000
[junit4:junit4]   2> 123 T437 oazs.NIOServerCnxn.closeSock Closed socket connection for client /127.0.0.1:33113 which had sessionid 0x1398d60a3cc0000
[junit4:junit4]   2> 123 T435 oaz.ZooKeeper.close Session: 0x1398d60a3cc0000 closed
[junit4:junit4]   2> 124 T442 oaz.ClientCnxn$EventThread.run EventThread shut down
[junit4:junit4]   2> 124 T435 oaz.ZooKeeper.<init> Initiating client connection, connectString=127.0.0.1:45424/solr sessionTimeout=10000 watcher=org.apache.solr.common.cloud.ConnectionManager@b4764ec1
[junit4:junit4]   2> 125 T443 oaz.ClientCnxn$SendThread.startConnect Opening socket connection to server /127.0.0.1:45424
[junit4:junit4]   2> 125 T435 oascc.ConnectionManager.waitForConnected Waiting for client to connect to ZooKeeper
[junit4:junit4]   2> 125 T443 oaz.ClientCnxn$SendThread.primeConnection Socket connection established to localhost.localdomain/127.0.0.1:45424, initiating session
[junit4:junit4]   2> 125 T437 oazs.NIOServerCnxn$Factory.run Accepted socket connection from /127.0.0.1:33114
[junit4:junit4]   2> 126 T437 oazs.NIOServerCnxn.readConnectRequest Client attempting to establish new session at /127.0.0.1:33114
[junit4:junit4]   2> 127 T439 oazs.NIOServerCnxn.finishSessionInit Established session 0x1398d60a3cc0001 with negotiated timeout 10000 for client /127.0.0.1:33114
[junit4:junit4]   2> 128 T443 oaz.ClientCnxn$SendThread.readConnectResult Session establishment complete on server localhost.localdomain/127.0.0.1:45424, sessionid = 0x1398d60a3cc0001, negotiated timeout = 10000
[junit4:junit4]   2> 128 T444 oascc.ConnectionManager.process Watcher org.apache.solr.common.cloud.ConnectionManager@b4764ec1 name:ZooKeeperConnection Watcher:127.0.0.1:45424/solr got event WatchedEvent state:SyncConnected type:None path:null path:null type:None
[junit4:junit4]   2> 128 T435 oascc.ConnectionManager.waitForConnected Client is connected to ZooKeeper
[junit4:junit4]   2> 129 T435 oascc.SolrZkClient.makePath makePath: /collections/collection1
[junit4:junit4]   2> 131 T435 oascc.SolrZkClient.makePath makePath: /collections/collection1/shards
[junit4:junit4]   2> 133 T435 oascc.SolrZkClient.makePath makePath: /collections/control_collection
[junit4:junit4]   2> 134 T435 oascc.SolrZkClient.makePath makePath: /collections/control_collection/shards
[junit4:junit4]   2> 136 T435 oasc.AbstractZkTestCase.putConfig put /mnt/ssd/jenkins/workspace/Lucene-Solr-4.x-Linux/solr/build/solr-core/test-files/solr/collection1/conf/solrconfig.xml to /configs/conf1/solrconfig.xml
[junit4:junit4]   2> 137 T435 oascc.SolrZkClient.makePath makePath: /configs/conf1/solrconfig.xml
[junit4:junit4]   2> 140 T435 oasc.AbstractZkTestCase.putConfig put /mnt/ssd/jenkins/workspace/Lucene-Solr-4.x-Linux/solr/build/solr-core/test-files/solr/collection1/conf/schema.xml to /configs/conf1/schema.xml
[junit4:junit4]   2> 141 T435 oascc.SolrZkClient.makePath makePath: /configs/conf1/schema.xml
[junit4:junit4]   2> 144 T435 oasc.AbstractZkTestCase.putConfig put /mnt/ssd/jenkins/workspace/Lucene-Solr-4.x-Linux/solr/build/solr-core/test-files/solr/collection1/conf/solrconfig.xml to /configs/conf1/solrconfig.xml
[junit4:junit4]   2> 145 T435 oascc.SolrZkClient.makePath makePath: /configs/conf1/solrconfig.xml
[junit4:junit4]   2> 147 T435 oasc.AbstractZkTestCase.putConfig put /mnt/ssd/jenkins/workspace/Lucene-Solr-4.x-Linux/solr/build/solr-core/test-files/solr/collection1/conf/stopwords.txt to /configs/conf1/stopwords.txt
[junit4:junit4]   2> 148 T435 oascc.SolrZkClient.makePath makePath: /configs/conf1/stopwords.txt
[junit4:junit4]   2> 150 T435 oasc.AbstractZkTestCase.putConfig put /mnt/ssd/jenkins/workspace/Lucene-Solr-4.x-Linux/solr/build/solr-core/test-files/solr/collection1/conf/protwords.txt to /configs/conf1/protwords.txt
[junit4:junit4]   2> 150 T435 oascc.SolrZkClient.makePath makePath: /configs/conf1/protwords.txt
[junit4:junit4]   2> 152 T435 oasc.AbstractZkTestCase.putConfig put /mnt/ssd/jenkins/workspace/Lucene-Solr-4.x-Linux/solr/build/solr-core/test-files/solr/collection1/conf/currency.xml to /configs/conf1/currency.xml
[junit4:junit4]   2> 152 T435 oascc.SolrZkClient.makePath makePath: /configs/conf1/currency.xml
[junit4:junit4]   2> 154 T435 oasc.AbstractZkTestCase.putConfig put /mnt/ssd/jenkins/workspace/Lucene-Solr-4.x-Linux/solr/build/solr-core/test-files/solr/collection1/conf/open-exchange-rates.json to /configs/conf1/open-exchange-rates.json
[junit4:junit4]   2> 154 T435 oascc.SolrZkClient.makePath makePath: /configs/conf1/open-exchange-rates.json
[junit4:junit4]   2> 242 T435 oasc.AbstractZkTestCase.putConfig put /mnt/ssd/jenkins/workspace/Lucene-Solr-4.x-Linux/solr/build/solr-core/test-files/solr/collection1/conf/mapping-ISOLatin1Accent.txt to /configs/conf1/mapping-ISOLatin1Accent.txt
[junit4:junit4]   2> 242 T435 oascc.SolrZkClient.makePath makePath: /configs/conf1/mapping-ISOLatin1Accent.txt
[junit4:junit4]   2> 452 T435 oasc.AbstractZkTestCase.putConfig put /mnt/ssd/jenkins/workspace/Lucene-Solr-4.x-Linux/solr/build/solr-core/test-files/solr/collection1/conf/old_synonyms.txt to /configs/conf1/old_synonyms.txt
[junit4:junit4]   2> 453 T435 oascc.SolrZkClient.makePath makePath: /configs/conf1/old_synonyms.txt
[junit4:junit4]   2> 456 T435 oasc.AbstractZkTestCase.putConfig put /mnt/ssd/jenkins/workspace/Lucene-Solr-4.x-Linux/solr/build/solr-core/test-files/solr/collection1/conf/synonyms.txt to /configs/conf1/synonyms.txt
[junit4:junit4]   2> 456 T435 oascc.SolrZkClient.makePath makePath: /configs/conf1/synonyms.txt
[junit4:junit4]   2> 458 T440 oazs.PrepRequestProcessor.pRequest Processed session termination for sessionid: 0x1398d60a3cc0001
[junit4:junit4]   2> 459 T444 oaz.ClientCnxn$EventThread.run EventThread shut down
[junit4:junit4]   2> 459 T437 oazs.NIOServerCnxn.closeSock Closed socket connection for client /127.0.0.1:33114 which had sessionid 0x1398d60a3cc0001
[junit4:junit4]   2> 459 T435 oaz.ZooKeeper.close Session: 0x1398d60a3cc0001 closed
[junit4:junit4]   2> 501 T435 oejs.Server.doStart jetty-8.1.2.v20120308
[junit4:junit4]   2> 504 T435 oejs.AbstractConnector.doStart Started SocketConnector@0.0.0.0:57407
[junit4:junit4]   2> 504 T435 oasc.SolrResourceLoader.locateSolrHome JNDI not configured for solr (NoInitialContextEx)
[junit4:junit4]   2> 505 T435 oasc.SolrResourceLoader.locateSolrHome using system property solr.solr.home: /mnt/ssd/jenkins/workspace/Lucene-Solr-4.x-Linux/solr/build/solr-core/test-files/control1
[junit4:junit4]   2> 505 T435 oasc.SolrResourceLoader.<init> new SolrResourceLoader for deduced Solr Home: '/mnt/ssd/jenkins/workspace/Lucene-Solr-4.x-Linux/solr/build/solr-core/test-files/control1/'
[junit4:junit4]   2> 514 T435 oass.SolrDispatchFilter.init SolrDispatchFilter.init()
[junit4:junit4]   2> 515 T435 oasc.SolrResourceLoader.locateSolrHome JNDI not configured for solr (NoInitialContextEx)
[junit4:junit4]   2> 515 T435 oasc.SolrResourceLoader.locateSolrHome using system property solr.solr.home: /mnt/ssd/jenkins/workspace/Lucene-Solr-4.x-Linux/solr/build/solr-core/test-files/control1
[junit4:junit4]   2> 516 T435 oasc.CoreContainer$Initializer.initialize looking for solr.xml: /mnt/ssd/jenkins/workspace/Lucene-Solr-4.x-Linux/solr/build/solr-core/test-files/control1/solr.xml
[junit4:junit4]   2> 516 T435 oasc.CoreContainer.<init> New CoreContainer -1698442035
[junit4:junit4]   2> 517 T435 oasc.CoreContainer.load Loading CoreContainer using Solr Home: '/mnt/ssd/jenkins/workspace/Lucene-Solr-4.x-Linux/solr/build/solr-core/test-files/control1/'
[junit4:junit4]   2> 517 T435 oasc.SolrResourceLoader.<init> new SolrResourceLoader for directory: '/mnt/ssd/jenkins/workspace/Lucene-Solr-4.x-Linux/solr/build/solr-core/test-files/control1/'
[junit4:junit4]   2> 529 T435 oasc.CoreContainer.load Registering Log Listener
[junit4:junit4]   2> 537 T435 oasc.CoreContainer.initZooKeeper Zookeeper client=127.0.0.1:45424/solr
[junit4:junit4]   2> 538 T435 oaz.ZooKeeper.<init> Initiating client connection, connectString=127.0.0.1:45424/solr sessionTimeout=8000 watcher=org.apache.solr.common.cloud.ConnectionManager@68bb8c3
[junit4:junit4]   2> 539 T454 oaz.ClientCnxn$SendThread.startConnect Opening socket connection to server /127.0.0.1:45424
[junit4:junit4]   2> 539 T435 oascc.ConnectionManager.waitForConnected Waiting for client to connect to ZooKeeper
[junit4:junit4]   2> 540 T454 oaz.ClientCnxn$SendThread.primeConnection Socket connection established to localhost.localdomain/127.0.0.1:45424, initiating session
[junit4:junit4]   2> 540 T437 oazs.NIOServerCnxn$Factory.run Accepted socket connection from /127.0.0.1:33115
[junit4:junit4]   2> 540 T437 oazs.NIOServerCnxn.readConnectRequest Client attempting to establish new session at /127.0.0.1:33115
[junit4:junit4]   2> 541 T439 oazs.NIOServerCnxn.finishSessionInit Established session 0x1398d60a3cc0002 with negotiated timeout 8000 for client /127.0.0.1:33115
[junit4:junit4]   2> 541 T454 oaz.ClientCnxn$SendThread.readConnectResult Session establishment complete on server localhost.localdomain/127.0.0.1:45424, sessionid = 0x1398d60a3cc0002, negotiated timeout = 8000
[junit4:junit4]   2> 541 T455 oascc.ConnectionManager.process Watcher org.apache.solr.common.cloud.ConnectionManager@68bb8c3 name:ZooKeeperConnection Watcher:127.0.0.1:45424/solr got event WatchedEvent state:SyncConnected type:None path:null path:null type:None
[junit4:junit4]   2> 542 T435 oascc.ConnectionManager.waitForConnected Client is connected to ZooKeeper
[junit4:junit4]   2> 543 T440 oazs.PrepRequestProcessor.pRequest Got user-level KeeperException when processing sessionid:0x1398d60a3cc0002 type:create cxid:0x2 zxid:0xfffffffffffffffe txntype:unknown reqpath:n/a Error Path:/solr/overseer Error:KeeperErrorCode = NodeExists for /solr/overseer
[junit4:junit4]   2> 543 T435 oascc.SolrZkClient.makePath makePath: /live_nodes
[junit4:junit4]   2> 544 T435 oasc.ZkController.createEphemeralLiveNode Register node as live in ZooKeeper:/live_nodes/127.0.0.1:57407_solr
[junit4:junit4]   2> 545 T440 oazs.PrepRequestProcessor.pRequest Got user-level KeeperException when processing sessionid:0x1398d60a3cc0002 type:delete cxid:0x7 zxid:0xfffffffffffffffe txntype:unknown reqpath:n/a Error Path:/solr/live_nodes/127.0.0.1:57407_solr Error:KeeperErrorCode = NoNode for /solr/live_nodes/127.0.0.1:57407_solr
[junit4:junit4]   2> 545 T435 oascc.SolrZkClient.makePath makePath: /live_nodes/127.0.0.1:57407_solr
[junit4:junit4]   2> 547 T435 oashc.HttpShardHandlerFactory.getParameter Setting socketTimeout to: 0
[junit4:junit4]   2> 547 T435 oashc.HttpShardHandlerFactory.getParameter Setting urlScheme to: http://
[junit4:junit4]   2> 548 T435 oashc.HttpShardHandlerFactory.getParameter Setting connTimeout to: 0
[junit4:junit4]   2> 548 T435 oashc.HttpShardHandlerFactory.getParameter Setting maxConnectionsPerHost to: 20
[junit4:junit4]   2> 548 T435 oashc.HttpShardHandlerFactory.getParameter Setting corePoolSize to: 0
[junit4:junit4]   2> 549 T435 oashc.HttpShardHandlerFactory.getParameter Setting maximumPoolSize to: 2147483647
[junit4:junit4]   2> 549 T435 oashc.HttpShardHandlerFactory.getParameter Setting maxThreadIdleTime to: 5
[junit4:junit4]   2> 550 T435 oashc.HttpShardHandlerFactory.getParameter Setting sizeOfQueue to: -1
[junit4:junit4]   2> 550 T435 oashc.HttpShardHandlerFactory.getParameter Setting fairnessPolicy to: false
[junit4:junit4]   2> 551 T435 oascsi.HttpClientUtil.createClient Creating new http client, config:maxConnectionsPerHost=20&maxConnections=10000&socketTimeout=0&connTimeout=0&retry=false
[junit4:junit4]   2> 554 T435 oascc.SolrZkClient.makePath makePath: /overseer_elect/election
[junit4:junit4]   2> 557 T440 oazs.PrepRequestProcessor.pRequest Got user-level KeeperException when processing sessionid:0x1398d60a3cc0002 type:delete cxid:0x15 zxid:0xfffffffffffffffe txntype:unknown reqpath:n/a Error Path:/solr/overseer_elect/leader Error:KeeperErrorCode = NoNode for /solr/overseer_elect/leader
[junit4:junit4]   2> 557 T435 oascc.SolrZkClient.makePath makePath: /overseer_elect/leader
[junit4:junit4]   2> 558 T435 oasc.Overseer.start Overseer (id=88257113914867714-127.0.0.1:57407_solr-n_0000000000) starting
[junit4:junit4]   2> 559 T440 oazs.PrepRequestProcessor.pRequest Got user-level KeeperException when processing sessionid:0x1398d60a3cc0002 type:create cxid:0x1a zxid:0xfffffffffffffffe txntype:unknown reqpath:n/a Error Path:/solr/overseer Error:KeeperErrorCode = NodeExists for /solr/overseer
[junit4:junit4]   2> 560 T440 oazs.PrepRequestProcessor.pRequest Got user-level KeeperException when processing sessionid:0x1398d60a3cc0002 type:create cxid:0x1b zxid:0xfffffffffffffffe txntype:unknown reqpath:n/a Error Path:/solr/overseer Error:KeeperErrorCode = NodeExists for /solr/overseer
[junit4:junit4]   2> 560 T440 oazs.PrepRequestProcessor.pRequest Got user-level KeeperException when processing sessionid:0x1398d60a3cc0002 type:create cxid:0x1c zxid:0xfffffffffffffffe txntype:unknown reqpath:n/a Error Path:/solr/overseer Error:KeeperErrorCode = NodeExists for /solr/overseer
[junit4:junit4]   2> 561 T440 oazs.PrepRequestProcessor.pRequest Got user-level KeeperException when processing sessionid:0x1398d60a3cc0002 type:create cxid:0x1d zxid:0xfffffffffffffffe txntype:unknown reqpath:n/a Error Path:/solr/overseer Error:KeeperErrorCode = NodeExists for /solr/overseer
[junit4:junit4]   2> 561 T457 oasc.OverseerCollectionProcessor.run Process current queue of collection creations
[junit4:junit4]   2> 561 T435 oascc.SolrZkClient.makePath makePath: /clusterstate.json
[junit4:junit4]   2> 563 T435 oascc.ZkStateReader.createClusterStateWatchersAndUpdate Updating cluster state from ZooKeeper... 
[junit4:junit4]   2> 565 T456 oasc.Overseer$ClusterStateUpdater.run Starting to work on the main queue
[junit4:junit4]   2> 567 T435 oasc.CoreContainer.create Creating SolrCore 'collection1' using instanceDir: /mnt/ssd/jenkins/workspace/Lucene-Solr-4.x-Linux/solr/build/solr-core/test-files/control1/collection1
[junit4:junit4]   2> 567 T435 oasc.ZkController.createCollectionZkNode Check for collection zkNode:control_collection
[junit4:junit4]   2> 568 T435 oasc.ZkController.createCollectionZkNode Collection zkNode exists
[junit4:junit4]   2> 568 T435 oasc.ZkController.readConfigName Load collection config from:/collections/control_collection
[junit4:junit4]   2> 569 T435 oasc.SolrResourceLoader.<init> new SolrResourceLoader for directory: '/mnt/ssd/jenkins/workspace/Lucene-Solr-4.x-Linux/solr/build/solr-core/test-files/control1/collection1/'
[junit4:junit4]   2> 570 T435 oasc.SolrResourceLoader.replaceClassLoader Adding 'file:/mnt/ssd/jenkins/workspace/Lucene-Solr-4.x-Linux/solr/build/solr-core/test-files/control1/collection1/lib/README' to classloader
[junit4:junit4]   2> 570 T435 oasc.SolrResourceLoader.replaceClassLoader Adding 'file:/mnt/ssd/jenkins/workspace/Lucene-Solr-4.x-Linux/solr/build/solr-core/test-files/control1/collection1/lib/classes/' to classloader
[junit4:junit4]   2> 605 T435 oasc.SolrConfig.<init> Using Lucene MatchVersion: LUCENE_40
[junit4:junit4]   2> 654 T435 oasc.SolrConfig.<init> Loaded SolrConfig: solrconfig.xml
[junit4:junit4]   2> 656 T435 oass.IndexSchema.readSchema Reading Solr Schema
[junit4:junit4]   2> 661 T435 oass.IndexSchema.readSchema Schema name=test
[junit4:junit4]   2> 1045 T435 oass.OpenExchangeRatesOrgProvider.init Initialized with rates=open-exchange-rates.json, refreshInterval=1440.
[junit4:junit4]   2> 1051 T435 oass.IndexSchema.readSchema default search field in schema is text
[junit4:junit4]   2> 1054 T435 oass.IndexSchema.readSchema unique key field: id
[junit4:junit4]   2> 1066 T435 oass.FileExchangeRateProvider.reload Reloading exchange rates from file currency.xml
[junit4:junit4]   2> 1070 T435 oass.FileExchangeRateProvider.reload Reloading exchange rates from file currency.xml
[junit4:junit4]   2> 1074 T435 oass.OpenExchangeRatesOrgProvider.reload Reloading exchange rates from open-exchange-rates.json
[junit4:junit4]   2> 1075 T435 oass.OpenExchangeRatesOrgProvider.reload Reloading exchange rates from open-exchange-rates.json
[junit4:junit4]   2> 1076 T435 oasc.SolrCore.<init> [collection1] Opening new SolrCore at /mnt/ssd/jenkins/workspace/Lucene-Solr-4.x-Linux/solr/build/solr-core/test-files/control1/collection1/, dataDir=/mnt/ssd/jenkins/workspace/Lucene-Solr-4.x-Linux/solr/build/solr-core/test-files/control1/collection1/data/
[junit4:junit4]   2> 1076 T435 oasc.JmxMonitoredMap.<init> JMX monitoring is enabled. Adding Solr mbeans to JMX Server: com.sun.jmx.mbeanserver.JmxMBeanServer@d7fae4e9
[junit4:junit4]   2> 1077 T435 oasc.SolrCore.getNewIndexDir WARNING New index directory detected: old=null new=/mnt/ssd/jenkins/workspace/Lucene-Solr-4.x-Linux/solr/build/solr-core/test-files/control1/collection1/data/index/
[junit4:junit4]   2> 1077 T435 oasc.SolrCore.initIndex WARNING [collection1] Solr index directory '/mnt/ssd/jenkins/workspace/Lucene-Solr-4.x-Linux/solr/build/solr-core/test-files/control1/collection1/data/index' doesn't exist. Creating new index...
[junit4:junit4]   2> 1078 T435 oasc.CachingDirectoryFactory.get return new directory for /mnt/ssd/jenkins/workspace/Lucene-Solr-4.x-Linux/solr/build/solr-core/test-files/control1/collection1/data/index forceNew:false
[junit4:junit4]   2> 1081 T435 oasc.SolrDeletionPolicy.onCommit SolrDeletionPolicy.onCommit: commits:num=1
[junit4:junit4]   2> 		commit{dir=NRTCachingDirectory(org.apache.lucene.store.MMapDirectory@/mnt/ssd/jenkins/workspace/Lucene-Solr-4.x-Linux/solr/build/solr-core/test-files/control1/collection1/data/index lockFactory=org.apache.lucene.store.NativeFSLockFactory@b09fcbe8; maxCacheMB=48.0 maxMergeSizeMB=4.0),segFN=segments_1,generation=1,filenames=[segments_1]
[junit4:junit4]   2> 1082 T435 oasc.SolrDeletionPolicy.updateCommits newest commit = 1
[junit4:junit4]   2> 1082 T435 oasc.SolrCore.initWriters created xml: solr.XMLResponseWriter
[junit4:junit4]   2> 1084 T435 oasup.UpdateRequestProcessorChain.init inserting DistributedUpdateProcessorFactory into updateRequestProcessorChain "dedupe"
[junit4:junit4]   2> 1084 T435 oasup.UpdateRequestProcessorChain.init inserting DistributedUpdateProcessorFactory into updateRequestProcessorChain "dedupe-allfields"
[junit4:junit4]   2> 1085 T435 oasup.UpdateRequestProcessorChain.init inserting DistributedUpdateProcessorFactory into updateRequestProcessorChain "stored_sig"
[junit4:junit4]   2> 1085 T435 oasup.UpdateRequestProcessorChain.init inserting DistributedUpdateProcessorFactory into updateRequestProcessorChain "uniq-fields"
[junit4:junit4]   2> 1086 T435 oasup.UpdateRequestProcessorChain.init inserting DistributedUpdateProcessorFactory into updateRequestProcessorChain "distrib-dup-test-chain-implicit"
[junit4:junit4]   2> 1086 T435 oasc.RequestHandlers.initHandlersFromConfig adding lazy requestHandler: solr.ReplicationHandler
[junit4:junit4]   2> 1087 T435 oasc.RequestHandlers.initHandlersFromConfig created /replication: solr.ReplicationHandler
[junit4:junit4]   2> 1087 T435 oasc.RequestHandlers.initHandlersFromConfig created standard: solr.StandardRequestHandler
[junit4:junit4]   2> 1088 T435 oasc.RequestHandlers.initHandlersFromConfig created /get: solr.RealTimeGetHandler
[junit4:junit4]   2> 1088 T435 oasc.RequestHandlers.initHandlersFromConfig created dismax: solr.SearchHandler
[junit4:junit4]   2> 1089 T435 oasc.RequestHandlers.initHandlersFromConfig created mock: org.apache.solr.core.MockQuerySenderListenerReqHandler
[junit4:junit4]   2> 1089 T435 oasc.RequestHandlers.initHandlersFromConfig created /admin/: org.apache.solr.handler.admin.AdminHandlers
[junit4:junit4]   2> 1090 T435 oasc.RequestHandlers.initHandlersFromConfig created defaults: solr.StandardRequestHandler
[junit4:junit4]   2> 1090 T435 oasc.RequestHandlers.initHandlersFromConfig adding lazy requestHandler: solr.StandardRequestHandler
[junit4:junit4]   2> 1091 T435 oasc.RequestHandlers.initHandlersFromConfig created lazy: solr.StandardRequestHandler
[junit4:junit4]   2> 1091 T435 oasc.RequestHandlers.initHandlersFromConfig created /update: solr.UpdateRequestHandler
[junit4:junit4]   2> 1092 T435 oasc.RequestHandlers.initHandlersFromConfig created /terms: org.apache.solr.handler.component.SearchHandler
[junit4:junit4]   2> 1093 T435 oasc.RequestHandlers.initHandlersFromConfig created spellCheckCompRH: org.apache.solr.handler.component.SearchHandler
[junit4:junit4]   2> 1093 T435 oasc.RequestHandlers.initHandlersFromConfig created spellCheckCompRH_Direct: org.apache.solr.handler.component.SearchHandler
[junit4:junit4]   2> 1094 T435 oasc.RequestHandlers.initHandlersFromConfig created spellCheckWithWordbreak: org.apache.solr.handler.component.SearchHandler
[junit4:junit4]   2> 1094 T435 oasc.RequestHandlers.initHandlersFromConfig created spellCheckWithWordbreak_Direct: org.apache.solr.handler.component.SearchHandler
[junit4:junit4]   2> 1095 T435 oasc.RequestHandlers.initHandlersFromConfig created spellCheckCompRH1: org.apache.solr.handler.component.SearchHandler
[junit4:junit4]   2> 1095 T435 oasc.RequestHandlers.initHandlersFromConfig created tvrh: org.apache.solr.handler.component.SearchHandler
[junit4:junit4]   2> 1096 T435 oasc.RequestHandlers.initHandlersFromConfig created /mlt: solr.MoreLikeThisHandler
[junit4:junit4]   2> 1096 T435 oasc.RequestHandlers.initHandlersFromConfig created /debug/dump: solr.DumpRequestHandler
[junit4:junit4]   2> 1097 T435 oashl.XMLLoader.init xsltCacheLifetimeSeconds=60
[junit4:junit4]   2> 1099 T435 oasc.SolrCore.initDeprecatedSupport WARNING solrconfig.xml uses deprecated <admin/gettableFiles>, Please update your config to use the ShowFileRequestHandler.
[junit4:junit4]   2> 1100 T435 oasc.SolrCore.initDeprecatedSupport WARNING adding ShowFileRequestHandler with hidden files: [OLD_SYNONYMS.TXT, PROTWORDS.TXT, STOPWORDS.TXT, OPEN-EXCHANGE-RATES.JSON, CURRENCY.XML, SCHEMA.XML, SYNONYMS.TXT, MAPPING-ISOLATIN1ACCENT.TXT]
[junit4:junit4]   2> 1102 T435 oass.SolrIndexSearcher.<init> Opening Searcher@fa3ba4f5 main
[junit4:junit4]   2> 1103 T435 oasu.CommitTracker.<init> Hard AutoCommit: disabled
[junit4:junit4]   2> 1103 T435 oasu.CommitTracker.<init> Soft AutoCommit: disabled
[junit4:junit4]   2> 1104 T435 oashc.SpellCheckComponent.inform Initializing spell checkers
[junit4:junit4]   2> 1107 T435 oass.DirectSolrSpellChecker.init init: {name=direct,classname=DirectSolrSpellChecker,field=lowerfilt,minQueryLength=3}
[junit4:junit4]   2> 1131 T458 oasc.SolrCore.registerSearcher [collection1] Registered new searcher Searcher@fa3ba4f5 main{StandardDirectoryReader(segments_1:1)}
[junit4:junit4]   2> 1134 T440 oazs.PrepRequestProcessor.pRequest Got user-level KeeperException when processing sessionid:0x1398d60a3cc0002 type:create cxid:0x53 zxid:0xfffffffffffffffe txntype:unknown reqpath:n/a Error Path:/solr/overseer/queue Error:KeeperErrorCode = NoNode for /solr/overseer/queue
[junit4:junit4]   2> 1136 T435 oasc.CoreContainer.register registering core: collection1
[junit4:junit4]   2> 1137 T435 oasc.ZkController.register Register shard - core:collection1 address:http://127.0.0.1:57407/solr shardId:control_shard
[junit4:junit4]   2> 1138 T435 oascc.SolrZkClient.makePath makePath: /collections/control_collection/leader_elect/control_shard/election
[junit4:junit4]   2> 1142 T440 oazs.PrepRequestProcessor.pRequest Got user-level KeeperException when processing sessionid:0x1398d60a3cc0002 type:delete cxid:0x62 zxid:0xfffffffffffffffe txntype:unknown reqpath:n/a Error Path:/solr/collections/control_collection/leaders Error:KeeperErrorCode = NoNode for /solr/collections/control_collection/leaders
[junit4:junit4]   2> 1142 T440 oazs.PrepRequestProcessor.pRequest Got user-level KeeperException when processing sessionid:0x1398d60a3cc0002 type:create cxid:0x63 zxid:0xfffffffffffffffe txntype:unknown reqpath:n/a Error Path:/solr/overseer Error:KeeperErrorCode = NodeExists for /solr/overseer
[junit4:junit4]   2> 1143 T435 oasc.ShardLeaderElectionContext.waitForReplicasToComeUp Running the leader process. afterExperiation=false
[junit4:junit4]   2> 1567 T456 oascc.ZkStateReader.updateClusterState Updating cloud state from ZooKeeper... 
[junit4:junit4]   2> 1568 T440 oazs.PrepRequestProcessor.pRequest Got user-level KeeperException when processing sessionid:0x1398d60a3cc0002 type:create cxid:0x6a zxid:0xfffffffffffffffe txntype:unknown reqpath:n/a Error Path:/solr/overseer/queue-work Error:KeeperErrorCode = NoNode for /solr/overseer/queue-work
[junit4:junit4]   2> 1573 T455 oascc.ZkStateReader$2.process A cluster state change has occurred - updating...
[junit4:junit4]   2> 2144 T435 oasc.ShardLeaderElectionContext.waitForReplicasToComeUp Enough replicas found to continue.
[junit4:junit4]   2> 2145 T435 oasc.ShardLeaderElectionContext.runLeaderProcess I am the new leader: http://127.0.0.1:57407/solr/collection1/
[junit4:junit4]   2> 2245 T435 oascc.SolrZkClient.makePath makePath: /collections/control_collection/leaders/control_shard
[junit4:junit4]   2> 2249 T440 oazs.PrepRequestProcessor.pRequest Got user-level KeeperException when processing sessionid:0x1398d60a3cc0002 type:create cxid:0x8a zxid:0xfffffffffffffffe txntype:unknown reqpath:n/a Error Path:/solr/overseer Error:KeeperErrorCode = NodeExists for /solr/overseer
[junit4:junit4]   2> 2578 T456 oascc.ZkStateReader.updateClusterState Updating cloud state from ZooKeeper... 
[junit4:junit4]   2> 3173 T455 oascc.ZkStateReader$2.process A cluster state change has occurred - updating...
[junit4:junit4]   2> 3202 T435 oasc.ZkController.register We are http://127.0.0.1:57407/solr/collection1/ and leader is http://127.0.0.1:57407/solr/collection1/
[junit4:junit4]   2> 3202 T435 oasc.ZkController.register No LogReplay needed for core=collection1 baseURL=http://127.0.0.1:57407/solr
[junit4:junit4]   2> 3203 T435 oasc.ZkController.checkRecovery I am the leader, no recovery necessary
[junit4:junit4]   2> 3204 T435 oascc.ZkStateReader.updateClusterState Updating cloud state from ZooKeeper... 
[junit4:junit4]   2> 3205 T435 oass.SolrDispatchFilter.init user.dir=/mnt/ssd/jenkins/workspace/Lucene-Solr-4.x-Linux/solr/build/solr-core/test/J0
[junit4:junit4]   2> 3205 T435 oass.SolrDispatchFilter.init SolrDispatchFilter.init() done
[junit4:junit4]   2> 3206 T435 oascsi.HttpClientUtil.createClient Creating new http client, config:maxConnections=128&maxConnectionsPerHost=32&followRedirects=false
[junit4:junit4]   2> 3248 T435 oejs.Server.doStart jetty-8.1.2.v20120308
[junit4:junit4]   2> 3249 T435 oejs.AbstractConnector.doStart Started SocketConnector@0.0.0.0:47102
[junit4:junit4]   2> 3250 T435 oasc.SolrResourceLoader.locateSolrHome JNDI not configured for solr (NoInitialContextEx)
[junit4:junit4]   2> 3250 T435 oasc.SolrResourceLoader.locateSolrHome using system property solr.solr.home: /mnt/ssd/jenkins/workspace/Lucene-Solr-4.x-Linux/solr/build/solr-core/test-files/jetty2
[junit4:junit4]   2> 3251 T435 oasc.SolrResourceLoader.<init> new SolrResourceLoader for deduced Solr Home: '/mnt/ssd/jenkins/workspace/Lucene-Solr-4.x-Linux/solr/build/solr-core/test-files/jetty2/'
[junit4:junit4]   2> 3259 T435 oass.SolrDispatchFilter.init SolrDispatchFilter.init()
[junit4:junit4]   2> 3260 T435 oasc.SolrResourceLoader.locateSolrHome JNDI not configured for solr (NoInitialContextEx)
[junit4:junit4]   2> 3260 T435 oasc.SolrResourceLoader.locateSolrHome using system property solr.solr.home: /mnt/ssd/jenkins/workspace/Lucene-Solr-4.x-Linux/solr/build/solr-core/test-files/jetty2
[junit4:junit4]   2> 3261 T435 oasc.CoreContainer$Initializer.initialize looking for solr.xml: /mnt/ssd/jenkins/workspace/Lucene-Solr-4.x-Linux/solr/build/solr-core/test-files/jetty2/solr.xml
[junit4:junit4]   2> 3261 T435 oasc.CoreContainer.<init> New CoreContainer -1104938166
[junit4:junit4]   2> 3261 T435 oasc.CoreContainer.load Loading CoreContainer using Solr Home: '/mnt/ssd/jenkins/workspace/Lucene-Solr-4.x-Linux/solr/build/solr-core/test-files/jetty2/'
[junit4:junit4]   2> 3262 T435 oasc.SolrResourceLoader.<init> new SolrResourceLoader for directory: '/mnt/ssd/jenkins/workspace/Lucene-Solr-4.x-Linux/solr/build/solr-core/test-files/jetty2/'
[junit4:junit4]   2> 3274 T435 oasc.CoreContainer.load Registering Log Listener
[junit4:junit4]   2> 3282 T435 oasc.CoreContainer.initZooKeeper Zookeeper client=127.0.0.1:45424/solr
[junit4:junit4]   2> 3283 T435 oaz.ZooKeeper.<init> Initiating client connection, connectString=127.0.0.1:45424/solr sessionTimeout=8000 watcher=org.apache.solr.common.cloud.ConnectionManager@bd17cab4
[junit4:junit4]   2> 3284 T468 oaz.ClientCnxn$SendThread.startConnect Opening socket connection to server /127.0.0.1:45424
[junit4:junit4]   2> 3284 T435 oascc.ConnectionManager.waitForConnected Waiting for client to connect to ZooKeeper
[junit4:junit4]   2> 3284 T468 oaz.ClientCnxn$SendThread.primeConnection Socket connection established to localhost.localdomain/127.0.0.1:45424, initiating session
[junit4:junit4]   2> 3285 T437 oazs.NIOServerCnxn$Factory.run Accepted socket connection from /127.0.0.1:33123
[junit4:junit4]   2> 3285 T437 oazs.NIOServerCnxn.readConnectRequest Client attempting to establish new session at /127.0.0.1:33123
[junit4:junit4]   2> 3286 T439 oazs.NIOServerCnxn.finishSessionInit Established session 0x1398d60a3cc0003 with negotiated timeout 8000 for client /127.0.0.1:33123
[junit4:junit4]   2> 3286 T468 oaz.ClientCnxn$SendThread.readConnectResult Session establishment complete on server localhost.localdomain/127.0.0.1:45424, sessionid = 0x1398d60a3cc0003, negotiated timeout = 8000
[junit4:junit4]   2> 3286 T469 oascc.ConnectionManager.process Watcher org.apache.solr.common.cloud.ConnectionManager@bd17cab4 name:ZooKeeperConnection Watcher:127.0.0.1:45424/solr got event WatchedEvent state:SyncConnected type:None path:null path:null type:None
[junit4:junit4]   2> 3287 T435 oascc.ConnectionManager.waitForConnected Client is connected to ZooKeeper
[junit4:junit4]   2> 3287 T440 oazs.PrepRequestProcessor.pRequest Got user-level KeeperException when processing sessionid:0x1398d60a3cc0003 type:create cxid:0x1 zxid:0xfffffffffffffffe txntype:unknown reqpath:n/a Error Path:/solr/overseer Error:KeeperErrorCode = NodeExists for /solr/overseer
[junit4:junit4]   2> 3288 T440 oazs.PrepRequestProcessor.pRequest Got user-level KeeperException when processing sessionid:0x1398d60a3cc0003 type:create cxid:0x2 zxid:0xfffffffffffffffe txntype:unknown reqpath:n/a Error Path:/solr/overseer Error:KeeperErrorCode = NodeExists for /solr/overseer
[junit4:junit4]   2> 3289 T435 oasc.ZkController.createEphemeralLiveNode Register node as live in ZooKeeper:/live_nodes/127.0.0.1:47102_solr
[junit4:junit4]   2> 3290 T440 oazs.PrepRequestProcessor.pRequest Got user-level KeeperException when processing sessionid:0x1398d60a3cc0003 type:delete cxid:0x4 zxid:0xfffffffffffffffe txntype:unknown reqpath:n/a Error Path:/solr/live_nodes/127.0.0.1:47102_solr Error:KeeperErrorCode = NoNode for /solr/live_nodes/127.0.0.1:47102_solr
[junit4:junit4]   2> 3290 T435 oascc.SolrZkClient.makePath makePath: /live_nodes/127.0.0.1:47102_solr
[junit4:junit4]   2> 3292 T455 oascc.ZkStateReader$3.process Updating live nodes
[junit4:junit4]   2> 3292 T435 oashc.HttpShardHandlerFactory.getParameter Setting socketTimeout to: 0
[junit4:junit4]   2> 3293 T435 oashc.HttpShardHandlerFactory.getParameter Setting urlScheme to: http://
[junit4:junit4]   2> 3293 T435 oashc.HttpShardHandlerFactory.getParameter Setting connTimeout to: 0
[junit4:junit4]   2> 3293 T435 oashc.HttpShardHandlerFactory.getParameter Setting maxConnectionsPerHost to: 20
[junit4:junit4]   2> 3294 T435 oashc.HttpShardHandlerFactory.getParameter Setting corePoolSize to: 0
[junit4:junit4]   2> 3294 T435 oashc.HttpShardHandlerFactory.getParameter Setting maximumPoolSize to: 2147483647
[junit4:junit4]   2> 3295 T435 oashc.HttpShardHandlerFactory.getParameter Setting maxThreadIdleTime to: 5
[junit4:junit4]   2> 3295 T435 oashc.HttpShardHandlerFactory.getParameter Setting sizeOfQueue to: -1
[junit4:junit4]   2> 3296 T435 oashc.HttpShardHandlerFactory.getParameter Setting fairnessPolicy to: false
[junit4:junit4]   2> 3296 T435 oascsi.HttpClientUtil.createClient Creating new http client, config:maxConnectionsPerHost=20&maxConnections=10000&socketTimeout=0&connTimeout=0&retry=false
[junit4:junit4]   2> 3301 T435 oascc.ZkStateReader.createClusterStateWatchersAndUpdate Updating cluster state from ZooKeeper... 
[junit4:junit4]   2> 3304 T435 oasc.CoreContainer.create Creating SolrCore 'collection1' using instanceDir: /mnt/ssd/jenkins/workspace/Lucene-Solr-4.x-Linux/solr/build/solr-core/test-files/jetty2/collection1
[junit4:junit4]   2> 3304 T435 oasc.ZkController.createCollectionZkNode Check for collection zkNode:collection1
[junit4:junit4]   2> 3305 T435 oasc.ZkController.createCollectionZkNode Collection zkNode exists
[junit4:junit4]   2> 3305 T435 oasc.ZkController.readConfigName Load collection config from:/collections/collection1
[junit4:junit4]   2> 3306 T435 oasc.SolrResourceLoader.<init> new SolrResourceLoader for directory: '/mnt/ssd/jenkins/workspace/Lucene-Solr-4.x-Linux/solr/build/solr-core/test-files/jetty2/collection1/'
[junit4:junit4]   2> 3307 T435 oasc.SolrResourceLoader.replaceClassLoader Adding 'file:/mnt/ssd/jenkins/workspace/Lucene-Solr-4.x-Linux/solr/build/solr-core/test-files/jetty2/collection1/lib/README' to classloader
[junit4:junit4]   2> 3308 T435 oasc.SolrResourceLoader.replaceClassLoader Adding 'file:/mnt/ssd/jenkins/workspace/Lucene-Solr-4.x-Linux/solr/build/solr-core/test-files/jetty2/collection1/lib/classes/' to classloader
[junit4:junit4]   2> 3334 T435 oasc.SolrConfig.<init> Using Lucene MatchVersion: LUCENE_40
[junit4:junit4]   2> 3380 T435 oasc.SolrConfig.<init> Loaded SolrConfig: solrconfig.xml
[junit4:junit4]   2> 3381 T435 oass.IndexSchema.readSchema Reading Solr Schema
[junit4:junit4]   2> 3386 T435 oass.IndexSchema.readSchema Schema name=test
[junit4:junit4]   2> 3676 T456 oascc.ZkStateReader.updateClusterState Updating cloud state from ZooKeeper... 
[junit4:junit4]   2> 3679 T455 oascc.ZkStateReader$2.process A cluster state change has occurred - updating...
[junit4:junit4]   2> 3679 T469 oascc.ZkStateReader$2.process A cluster state change has occurred - updating...
[junit4:junit4]   2> 3841 T435 oass.OpenExchangeRatesOrgProvider.init Initialized with rates=open-exchange-rates.json, refreshInterval=1440.
[junit4:junit4]   2> 3848 T435 oass.IndexSchema.readSchema default search field in schema is text
[junit4:junit4]   2> 3854 T435 oass.IndexSchema.readSchema unique key field: id
[junit4:junit4]   2> 3893 T435 oass.FileExchangeRateProvider.reload Reloading exchange rates from file currency.xml
[junit4:junit4]   2> 3897 T435 oass.FileExchangeRateProvider.reload Reloading exchange rates from file currency.xml
[junit4:junit4]   2> 3903 T435 oass.OpenExchangeRatesOrgProvider.reload Reloading exchange rates from open-exchange-rates.json
[junit4:junit4]   2> 3923 T435 oass.OpenExchangeRatesOrgProvider.reload Reloading exchange rates from open-exchange-rates.json
[junit4:junit4]   2> 3944 T435 oasc.SolrCore.<init> [collection1] Opening new SolrCore at /mnt/ssd/jenkins/workspace/Lucene-Solr-4.x-Linux/solr/build/solr-core/test-files/jetty2/collection1/, dataDir=/mnt/ssd/jenkins/workspace/Lucene-Solr-4.x-Linux/solr/build/solr-core/test-files/jetty2/collection1/data/
[junit4:junit4]   2> 3945 T435 oasc.JmxMonitoredMap.<init> JMX monitoring is enabled. Adding Solr mbeans to JMX Server: com.sun.jmx.mbeanserver.JmxMBeanServer@d7fae4e9
[junit4:junit4]   2> 3947 T435 oasc.SolrCore.getNewIndexDir WARNING New index directory detected: old=null new=/mnt/ssd/jenkins/workspace/Lucene-Solr-4.x-Linux/solr/build/solr-core/test-files/jetty2/collection1/data/index/
[junit4:junit4]   2> 3948 T435 oasc.SolrCore.initIndex WARNING [collection1] Solr index directory '/mnt/ssd/jenkins/workspace/Lucene-Solr-4.x-Linux/solr/build/solr-core/test-files/jetty2/collection1/data/index' doesn't exist. Creating new index...
[junit4:junit4]   2> 3948 T435 oasc.CachingDirectoryFactory.get return new directory for /mnt/ssd/jenkins/workspace/Lucene-Solr-4.x-Linux/solr/build/solr-core/test-files/jetty2/collection1/data/index forceNew:false
[junit4:junit4]   2> 3973 T435 oasc.SolrDeletionPolicy.onCommit SolrDeletionPolicy.onCommit: commits:num=1
[junit4:junit4]   2> 		commit{dir=NRTCachingDirectory(org.apache.lucene.store.MMapDirectory@/mnt/ssd/jenkins/workspace/Lucene-Solr-4.x-Linux/solr/build/solr-core/test-files/jetty2/collection1/data/index lockFactory=org.apache.lucene.store.NativeFSLockFactory@7820e5ce; maxCacheMB=48.0 maxMergeSizeMB=4.0),segFN=segments_1,generation=1,filenames=[segments_1]
[junit4:junit4]   2> 3976 T435 oasc.SolrDeletionPolicy.updateCommits newest commit = 1
[junit4:junit4]   2> 3993 T435 oasc.SolrCore.initWriters created xml: solr.XMLResponseWriter
[junit4:junit4]   2> 3997 T435 oasup.UpdateRequestProcessorChain.init inserting DistributedUpdateProcessorFactory into updateRequestProcessorChain "dedupe"
[junit4:junit4]   2> 3998 T435 oasup.UpdateRequestProcessorChain.init inserting DistributedUpdateProcessorFactory into updateRequestProcessorChain "dedupe-allfields"
[junit4:junit4]   2> 3999 T435 oasup.UpdateRequestProcessorChain.init inserting DistributedUpdateProcessorFactory into updateRequestProcessorChain "stored_sig"
[junit4:junit4]   2> 4000 T435 oasup.UpdateRequestProcessorChain.init inserting DistributedUpdateProcessorFactory into updateRequestProcessorChain "uniq-fields"
[junit4:junit4]   2> 4002 T435 oasup.UpdateRequestProcessorChain.init inserting DistributedUpdateProcessorFactory into updateRequestProcessorChain "distrib-dup-test-chain-implicit"
[junit4:junit4]   2> 4002 T435 oasc.RequestHandlers.initHandlersFromConfig adding lazy requestHandler: solr.ReplicationHandler
[junit4:junit4]   2> 4003 T435 oasc.RequestHandlers.initHandlersFromConfig created /replication: solr.ReplicationHandler
[junit4:junit4]   2> 4005 T435 oasc.RequestHandlers.initHandlersFromConfig created standard: solr.StandardRequestHandler
[junit4:junit4]   2> 4007 T435 oasc.RequestHandlers.initHandlersFromConfig created /get: solr.RealTimeGetHandler
[junit4:junit4]   2> 4009 T435 oasc.RequestHandlers.initHandlersFromConfig created dismax: solr.SearchHandler
[junit4:junit4]   2> 4011 T435 oasc.RequestHandlers.initHandlersFromConfig created mock: org.apache.solr.core.MockQuerySenderListenerReqHandler
[junit4:junit4]   2> 4013 T435 oasc.RequestHandlers.initHandlersFromConfig created /admin/: org.apache.solr.handler.admin.AdminHandlers
[junit4:junit4]   2> 4015 T435 oasc.RequestHandlers.initHandlersFromConfig created defaults: solr.StandardRequestHandler
[junit4:junit4]   2> 4016 T435 oasc.RequestHandlers.initHandlersFromConfig adding lazy requestHandler: solr.StandardRequestHandler
[junit4:junit4]   2> 4019 T435 oasc.RequestHandlers.initHandlersFromConfig created lazy: solr.StandardRequestHandler
[junit4:junit4]   2> 4022 T435 oasc.RequestHandlers.initHandlersFromConfig created /update: solr.UpdateRequestHandler
[junit4:junit4]   2> 4024 T435 oasc.RequestHandlers.initHandlersFromConfig created /terms: org.apache.solr.handler.component.SearchHandler
[junit4:junit4]   2> 4026 T435 oasc.RequestHandlers.initHandlersFromConfig created spellCheckCompRH: org.apache.solr.handler.component.SearchHandler
[junit4:junit4]   2> 4028 T435 oasc.RequestHandlers.initHandlersFromConfig created spellCheckCompRH_Direct: org.apache.solr.handler.component.SearchHandler
[junit4:junit4]   2> 4030 T435 oasc.RequestHandlers.initHandlersFromConfig created spellCheckWithWordbreak: org.apache.solr.handler.component.SearchHandler
[junit4:junit4]   2> 4032 T435 oasc.RequestHandlers.initHandlersFromConfig created spellCheckWithWordbreak_Direct: org.apache.solr.handler.component.SearchHandler
[junit4:junit4]   2> 4033 T435 oasc.RequestHandlers.initHandlersFromConfig created spellCheckCompRH1: org.apache.solr.handler.component.SearchHandler
[junit4:junit4]   2> 4034 T435 oasc.RequestHandlers.initHandlersFromConfig created tvrh: org.apache.solr.handler.component.SearchHandler
[junit4:junit4]   2> 4035 T435 oasc.RequestHandlers.initHandlersFromConfig created /mlt: solr.MoreLikeThisHandler
[junit4:junit4]   2> 4036 T435 oasc.RequestHandlers.initHandlersFromConfig created /debug/dump: solr.DumpRequestHandler
[junit4:junit4]   2> 4041 T435 oashl.XMLLoader.init xsltCacheLifetimeSeconds=60
[junit4:junit4]   2> 4046 T435 oasc.SolrCore.initDeprecatedSupport WARNING solrconfig.xml uses deprecated <admin/gettableFiles>, Please update your config to use the ShowFileRequestHandler.
[junit4:junit4]   2> 4047 T435 oasc.SolrCore.initDeprecatedSupport WARNING adding ShowFileRequestHandler with hidden files: [OLD_SYNONYMS.TXT, PROTWORDS.TXT, STOPWORDS.TXT, OPEN-EXCHANGE-RATES.JSON, CURRENCY.XML, SCHEMA.XML, SYNONYMS.TXT, MAPPING-ISOLATIN1ACCENT.TXT]
[junit4:junit4]   2> 4054 T435 oass.SolrIndexSearcher.<init> Opening Searcher@b9fc68c0 main
[junit4:junit4]   2> 4060 T435 oasu.CommitTracker.<init> Hard AutoCommit: disabled
[junit4:junit4]   2> 4061 T435 oasu.CommitTracker.<init> Soft AutoCommit: disabled
[junit4:junit4]   2> 4063 T435 oashc.SpellCheckComponent.inform Initializing spell checkers
[junit4:junit4]   2> 4095 T435 oass.DirectSolrSpellChecker.init init: {name=direct,classname=DirectSolrSpellChecker,field=lowerfilt,minQueryLength=3}
[junit4:junit4]   2> 4250 T470 oasc.SolrCore.registerSearcher [collection1] Registered new searcher Searcher@b9fc68c0 main{StandardDirectoryReader(segments_1:1)}
[junit4:junit4]   2> 4295 T435 oasc.CoreContainer.register registering core: collection1
[junit4:junit4]   2> 4296 T435 oasc.ZkController.register Register shard - core:collection1 address:http://127.0.0.1:47102/solr shardId:shard3
[junit4:junit4]   2> 4300 T435 oascc.SolrZkClient.makePath makePath: /collections/collection1/leader_elect/shard3/election
[junit4:junit4]   2> 4331 T440 oazs.PrepRequestProcessor.pRequest Got user-level KeeperException when processing sessionid:0x1398d60a3cc0003 type:delete cxid:0x42 zxid:0xfffffffffffffffe txntype:unknown reqpath:n/a Error Path:/solr/collections/collection1/leaders Error:KeeperErrorCode = NoNode for /solr/collections/collection1/leaders
[junit4:junit4]   2> 4335 T440 oazs.PrepRequestProcessor.pRequest Got user-level KeeperException when processing sessionid:0x1398d60a3cc0003 type:create cxid:0x43 zxid:0xfffffffffffffffe txntype:unknown reqpath:n/a Error Path:/solr/overseer Error:KeeperErrorCode = NodeExists for /solr/overseer
[junit4:junit4]   2> 4338 T435 oasc.ShardLeaderElectionContext.waitForReplicasToComeUp Running the leader process. afterExperiation=false
[junit4:junit4]   2> 4689 T456 oascc.ZkStateReader.updateClusterState Updating cloud state from ZooKeeper... 
[junit4:junit4]   2> 4704 T455 oascc.ZkStateReader$2.process A cluster state change has occurred - updating...
[junit4:junit4]   2> 4704 T469 oascc.ZkStateReader$2.process A cluster state change has occurred - updating...
[junit4:junit4]   2> 5340 T435 oasc.ShardLeaderElectionContext.waitForReplicasToComeUp Enough replicas found to continue.
[junit4:junit4]   2> 5341 T435 oasc.ShardLeaderElectionContext.runLeaderProcess I am the new leader: http://127.0.0.1:47102/solr/collection1/
[junit4:junit4]   2> 5442 T435 oascc.SolrZkClient.makePath makePath: /collections/collection1/leaders/shard3
[junit4:junit4]   2> 5448 T440 oazs.PrepRequestProcessor.pRequest Got user-level KeeperException when processing sessionid:0x1398d60a3cc0003 type:create cxid:0x4d zxid:0xfffffffffffffffe txntype:unknown reqpath:n/a Error Path:/solr/overseer Error:KeeperErrorCode = NodeExists for /solr/overseer
[junit4:junit4]   2> 5710 T456 oascc.ZkStateReader.updateClusterState Updating cloud state from ZooKeeper... 
[junit4:junit4]   2> 5715 T469 oascc.ZkStateReader$2.process A cluster state change has occurred - updating...
[junit4:junit4]   2> 5715 T455 oascc.ZkStateReader$2.process A cluster state change has occurred - updating...
[junit4:junit4]   2> 5765 T435 oasc.ZkController.register We are http://127.0.0.1:47102/solr/collection1/ and leader is http://127.0.0.1:47102/solr/collection1/
[junit4:junit4]   2> 5766 T435 oasc.ZkController.register No LogReplay needed for core=collection1 baseURL=http://127.0.0.1:47102/solr
[junit4:junit4]   2> 5766 T435 oasc.ZkController.checkRecovery I am the leader, no recovery necessary
[junit4:junit4]   2> 5771 T435 oascc.ZkStateReader.updateClusterState Updating cloud state from ZooKeeper... 
[junit4:junit4]   2> 5772 T435 oass.SolrDispatchFilter.init user.dir=/mnt/ssd/jenkins/workspace/Lucene-Solr-4.x-Linux/solr/build/solr-core/test/J0
[junit4:junit4]   2> 5773 T435 oass.SolrDispatchFilter.init SolrDispatchFilter.init() done
[junit4:junit4]   2> 5774 T435 oascsi.HttpClientUtil.createClient Creating new http client, config:maxConnections=128&maxConnectionsPerHost=32&followRedirects=false
[junit4:junit4]   2> 5916 T435 oejs.Server.doStart jetty-8.1.2.v20120308
[junit4:junit4]   2> 5919 T435 oejs.AbstractConnector.doStart Started SocketConnector@0.0.0.0:36393
[junit4:junit4]   2> 5923 T435 oasc.SolrResourceLoader.locateSolrHome JNDI not configured for solr (NoInitialContextEx)
[junit4:junit4]   2> 5924 T435 oasc.SolrResourceLoader.locateSolrHome using system property solr.solr.home: /mnt/ssd/jenkins/workspace/Lucene-Solr-4.x-Linux/solr/build/solr-core/test-files/jetty3
[junit4:junit4]   2> 5925 T435 oasc.SolrResourceLoader.<init> new SolrResourceLoader for deduced Solr Home: '/mnt/ssd/jenkins/workspace/Lucene-Solr-4.x-Linux/solr/build/solr-core/test-files/jetty3/'
[junit4:junit4]   2> 5981 T435 oass.SolrDispatchFilter.init SolrDispatchFilter.init()
[junit4:junit4]   2> 5982 T435 oasc.SolrResourceLoader.locateSolrHome JNDI not configured for solr (NoInitialContextEx)
[junit4:junit4]   2> 5986 T435 oasc.SolrResourceLoader.locateSolrHome using system property solr.solr.home: /mnt/ssd/jenkins/workspace/Lucene-Solr-4.x-Linux/solr/build/solr-core/test-files/jetty3
[junit4:junit4]   2> 5988 T435 oasc.CoreContainer$Initializer.initialize looking for solr.xml: /mnt/ssd/jenkins/workspace/Lucene-Solr-4.x-Linux/solr/build/solr-core/test-files/jetty3/solr.xml
[junit4:junit4]   2> 5989 T435 oasc.CoreContainer.<init> New CoreContainer 1400114301
[junit4:junit4]   2> 5990 T435 oasc.CoreContainer.load Loading CoreContainer using Solr Home: '/mnt/ssd/jenkins/workspace/Lucene-Solr-4.x-Linux/solr/build/solr-core/test-files/jetty3/'
[junit4:junit4]   2> 5991 T435 oasc.SolrResourceLoader.<init> new SolrResourceLoader for directory: '/mnt/ssd/jenkins/workspace/Lucene-Solr-4.x-Linux/solr/build/solr-core/test-files/jetty3/'
[junit4:junit4]   2> 6036 T435 oasc.CoreContainer.load Registering Log Listener
[junit4:junit4]   2> 6057 T435 oasc.CoreContainer.initZooKeeper Zookeeper client=127.0.0.1:45424/solr
[junit4:junit4]   2> 6058 T435 oaz.ZooKeeper.<init> Initiating client connection, connectString=127.0.0.1:45424/solr sessionTimeout=8000 watcher=org.apache.solr.common.cloud.ConnectionManager@b1189567
[junit4:junit4]   2> 6061 T435 oascc.ConnectionManager.waitForConnected Waiting for client to connect to ZooKeeper
[junit4:junit4]   2> 6062 T480 oaz.ClientCnxn$SendThread.startConnect Opening socket connection to server /127.0.0.1:45424
[junit4:junit4]   2> 6067 T437 oazs.NIOServerCnxn$Factory.run Accepted socket connection from /127.0.0.1:33125
[junit4:junit4]   2> 6067 T480 oaz.ClientCnxn$SendThread.primeConnection Socket connection established to localhost.localdomain/127.0.0.1:45424, initiating session
[junit4:junit4]   2> 6068 T437 oazs.NIOServerCnxn.readConnectRequest Client attempting to establish new session at /127.0.0.1:33125
[junit4:junit4]   2> 6070 T439 oazs.NIOServerCnxn.finishSessionInit Established session 0x1398d60a3cc0004 with negotiated timeout 8000 for client /127.0.0.1:33125
[junit4:junit4]   2> 6071 T480 oaz.ClientCnxn$SendThread.readConnectResult Session establishment complete on server localhost.localdomain/127.0.0.1:45424, sessionid = 0x1398d60a3cc0004, negotiated timeout = 8000
[junit4:junit4]   2> 6072 T481 oascc.ConnectionManager.process Watcher org.apache.solr.common.cloud.ConnectionManager@b1189567 name:ZooKeeperConnection Watcher:127.0.0.1:45424/solr got event WatchedEvent state:SyncConnected type:None path:null path:null type:None
[junit4:junit4]   2> 6073 T435 oascc.ConnectionManager.waitForConnected Client is connected to ZooKeeper
[junit4:junit4]   2> 6074 T440 oazs.PrepRequestProcessor.pRequest Got user-level KeeperException when processing sessionid:0x1398d60a3cc0004 type:create cxid:0x1 zxid:0xfffffffffffffffe txntype:unknown reqpath:n/a Error Path:/solr/overseer Error:KeeperErrorCode = NodeExists for /solr/overseer
[junit4:junit4]   2> 6088 T440 oazs.PrepRequestProcessor.pRequest Got user-level KeeperException when processing sessionid:0x1398d60a3cc0004 type:create cxid:0x2 zxid:0xfffffffffffffffe txntype:unknown reqpath:n/a Error Path:/solr/overseer Error:KeeperErrorCode = NodeExists for /solr/overseer
[junit4:junit4]   2> 6094 T435 oasc.ZkController.createEphemeralLiveNode Register node as live in ZooKeeper:/live_nodes/127.0.0.1:36393_solr
[junit4:junit4]   2> 6095 T440 oazs.PrepRequestProcessor.pRequest Got user-level KeeperException when processing sessionid:0x1398d60a3cc0004 type:delete cxid:0x4 zxid:0xfffffffffffffffe txntype:unknown reqpath:n/a Error Path:/solr/live_nodes/127.0.0.1:36393_solr Error:KeeperErrorCode = NoNode for /solr/live_nodes/127.0.0.1:36393_solr
[junit4:junit4]   2> 6095 T435 oascc.SolrZkClient.makePath makePath: /live_nodes/127.0.0.1:36393_solr
[junit4:junit4]   2> 6108 T455 oascc.ZkStateReader$3.process Updating live nodes
[junit4:junit4]   2> 6108 T469 oascc.ZkStateReader$3.process Updating live nodes
[junit4:junit4]   2> 6109 T435 oashc.HttpShardHandlerFactory.getParameter Setting socketTimeout to: 0
[junit4:junit4]   2> 6109 T435 oashc.HttpShardHandlerFactory.getParameter Setting urlScheme to: http://
[junit4:junit4]   2> 6110 T435 oashc.HttpShardHandlerFactory.getParameter Setting connTimeout to: 0
[junit4:junit4]   2> 6110 T435 oashc.HttpShardHandlerFactory.getParameter Setting maxConnectionsPerHost to: 20
[junit4:junit4]   2> 6115 T435 oashc.HttpShardHandlerFactory.getParameter Setting corePoolSize to: 0
[junit4:junit4]   2> 6116 T435 oashc.HttpShardHandlerFactory.getParameter Setting maximumPoolSize to: 2147483647
[junit4:junit4]   2> 6117 T435 oashc.HttpShardHandlerFactory.getParameter Setting maxThreadIdleTime to: 5
[junit4:junit4]   2> 6118 T435 oashc.HttpShardHandlerFactory.getParameter Setting sizeOfQueue to: -1
[junit4:junit4]   2> 6119 T435 oashc.HttpShardHandlerFactory.getParameter Setting fairnessPolicy to: false
[junit4:junit4]   2> 6122 T435 oascsi.HttpClientUtil.createClient Creating new http client, config:maxConnectionsPerHost=20&maxConnections=10000&socketTimeout=0&connTimeout=0&retry=false
[junit4:junit4]   2> 6158 T435 oascc.ZkStateReader.createClusterStateWatchersAndUpdate Updating cluster state from ZooKeeper... 
[junit4:junit4]   2> 6183 T435 oasc.CoreContainer.create Creating SolrCore 'collection1' using instanceDir: /mnt/ssd/jenkins/workspace/Lucene-Solr-4.x-Linux/solr/build/solr-core/test-files/jetty3/collection1
[junit4:junit4]   2> 6184 T435 oasc.ZkController.createCollectionZkNode Check for collection zkNode:collection1
[junit4:junit4]   2> 6185 T435 oasc.ZkController.createCollectionZkNode Collection zkNode exists
[junit4:junit4]   2> 6185 T435 oasc.ZkController.readConfigName Load collection config from:/collections/collection1
[junit4:junit4]   2> 6186 T435 oasc.SolrResourceLoader.<init> new SolrResourceLoader for directory: '/mnt/ssd/jenkins/workspace/Lucene-Solr-4.x-Linux/solr/build/solr-core/test-files/jetty3/collection1/'
[junit4:junit4]   2> 6187 T435 oasc.SolrResourceLoader.replaceClassLoader Adding 'file:/mnt/ssd/jenkins/workspace/Lucene-Solr-4.x-Linux/solr/build/solr-core/test-files/jetty3/collection1/lib/README' to classloader
[junit4:junit4]   2> 6188 T435 oasc.SolrResourceLoader.replaceClassLoader Adding 'file:/mnt/ssd/jenkins/workspace/Lucene-Solr-4.x-Linux/solr/build/solr-core/test-files/jetty3/collection1/lib/classes/' to classloader
[junit4:junit4]   2> 6218 T456 oascc.ZkStateReader.updateClusterState Updating cloud state from ZooKeeper... 
[junit4:junit4]   2> 6244 T481 oascc.ZkStateReader$2.process A cluster state change has occurred - updating...
[junit4:junit4]   2> 6244 T469 oascc.ZkStateReader$2.process A cluster state change has occurred - updating...
[junit4:junit4]   2> 6244 T455 oascc.ZkStateReader$2.process A cluster state change has occurred - updating...
[junit4:junit4]   2> 6252 T435 oasc.SolrConfig.<init> Using Lucene MatchVersion: LUCENE_40
[junit4:junit4]   2> 6355 T435 oasc.SolrConfig.<init> Loaded SolrConfig: solrconfig.xml
[junit4:junit4]   2> 6356 T435 oass.IndexSchema.readSchema Reading Solr Schema
[junit4:junit4]   2> 6373 T435 oass.IndexSchema.readSchema Schema name=test
[junit4:junit4]   2> 7362 T435 oass.OpenExchangeRatesOrgProvider.init Initialized with rates=open-exchange-rates.json, refreshInterval=1440.
[junit4:junit4]   2> 7391 T435 oass.IndexSchema.readSchema default search field in schema is text
[junit4:junit4]   2> 7397 T435 oass.IndexSchema.readSchema unique key field: id
[junit4:junit4]   2> 7423 T435 oass.FileExchangeRateProvider.reload Reloading exchange rates from file currency.xml
[junit4:junit4]   2> 7428 T435 oass.FileExchangeRateProvider.reload Reloading exchange rates from file currency.xml
[junit4:junit4]   2> 7439 T435 oass.OpenExchangeRatesOrgProvider.reload Reloading exchange rates from open-exchange-rates.json
[junit4:junit4]   2> 7449 T435 oass.OpenExchangeRatesOrgProvider.reload Reloading exchange rates from open-exchange-rates.json
[junit4:junit4]   2> 7456 T435 oasc.SolrCore.<init> [collection1] Opening new SolrCore at /mnt/ssd/jenkins/workspace/Lucene-Solr-4.x-Linux/solr/build/solr-core/test-files/jetty3/collection1/, dataDir=/mnt/ssd/jenkins/workspace/Lucene-Solr-4.x-Linux/solr/build/solr-core/test-files/jetty3/collection1/data/
[junit4:junit4]   2> 7456 T435 oasc.JmxMonitoredMap.<init> JMX monitoring is enabled. Adding Solr mbeans to JMX Server: com.sun.jmx.mbeanserver.JmxMBeanServer@d7fae4e9
[junit4:junit4]   2> 7457 T435 oasc.SolrCore.getNewIndexDir WARNING New index directory detected: old=null new=/mnt/ssd/jenkins/workspace/Lucene-Solr-4.x-Linux/solr/build/solr-core/test-files/jetty3/collection1/data/index/
[junit4:junit4]   2> 7458 T435 oasc.SolrCore.initIndex WARNING [collection1] Solr index directory '/mnt/ssd/jenkins/workspace/Lucene-Solr-4.x-Linux/solr/build/solr-core/test-files/jetty3/collection1/data/index' doesn't exist. Creating new index...
[junit4:junit4]   2> 7459 T435 oasc.CachingDirectoryFactory.get return new directory for /mnt/ssd/jenkins/workspace/Lucene-Solr-4.x-Linux/solr/build/solr-core/test-files/jetty3/collection1/data/index forceNew:false
[junit4:junit4]   2> 7470 T435 oasc.SolrDeletionPolicy.onCommit SolrDeletionPolicy.onCommit: commits:num=1
[junit4:junit4]   2> 		commit{dir=NRTCachingDirectory(org.apache.lucene.store.MMapDirectory@/mnt/ssd/jenkins/workspace/Lucene-Solr-4.x-Linux/solr/build/solr-core/test-files/jetty3/collection1/data/index lockFactory=org.apache.lucene.store.NativeFSLockFactory@51e83c5e; maxCacheMB=48.0 maxMergeSizeMB=4.0),segFN=segments_1,generation=1,filenames=[segments_1]
[junit4:junit4]   2> 7472 T435 oasc.SolrDeletionPolicy.updateCommits newest commit = 1
[junit4:junit4]   2> 7475 T435 oasc.SolrCore.initWriters created xml: solr.XMLResponseWriter
[junit4:junit4]   2> 7483 T435 oasup.UpdateRequestProcessorChain.init inserting DistributedUpdateProcessorFactory into updateRequestProcessorChain "dedupe"
[junit4:junit4]   2> 7484 T435 oasup.UpdateRequestProcessorChain.init inserting DistributedUpdateProcessorFactory into updateRequestProcessorChain "dedupe-allfields"
[junit4:junit4]   2> 7485 T435 oasup.UpdateRequestProcessorChain.init inserting DistributedUpdateProcessorFactory into updateRequestProcessorChain "stored_sig"
[junit4:junit4]   2> 7485 T435 oasup.UpdateRequestProcessorChain.init inserting DistributedUpdateProcessorFactory into updateRequestProcessorChain "uniq-fields"
[junit4:junit4]   2> 7486 T435 oasup.UpdateRequestProcessorChain.init inserting DistributedUpdateProcessorFactory into updateRequestProcessorChain "distrib-dup-test-chain-implicit"
[junit4:junit4]   2> 7486 T435 oasc.RequestHandlers.initHandlersFromConfig adding lazy requestHandler: solr.ReplicationHandler
[junit4:junit4]   2> 7487 T435 oasc.RequestHandlers.initHandlersFromConfig created /replication: solr.ReplicationHandler
[junit4:junit4]   2> 7488 T435 oasc.RequestHandlers.initHandlersFromConfig created standard: solr.StandardRequestHandler
[junit4:junit4]   2> 7488 T435 oasc.RequestHandlers.initHandlersFromConfig created /get: solr.RealTimeGetHandler
[junit4:junit4]   2> 7489 T435 oasc.RequestHandlers.initHandlersFromConfig created dismax: solr.SearchHandler
[junit4:junit4]   2> 7489 T435 oasc.RequestHandlers.initHandlersFromConfig created mock: org.apache.solr.core.MockQuerySenderListenerReqHandler
[junit4:junit4]   2> 7490 T435 oasc.RequestHandlers.initHandlersFromConfig created /admin/: org.apache.solr.handler.admin.AdminHandlers
[junit4:junit4]   2> 7491 T435 oasc.RequestHandlers.initHandlersFromConfig created defaults: solr.StandardRequestHandler
[junit4:junit4]   2> 7491 T435 oasc.RequestHandlers.initHandlersFromConfig adding lazy requestHandler: solr.StandardRequestHandler
[junit4:junit4]   2> 7492 T435 oasc.RequestHandlers.initHandlersFromConfig created lazy: solr.StandardRequestHandler
[junit4:junit4]   2> 7492 T435 oasc.RequestHandlers.initHandlersFromConfig created /update: solr.UpdateRequestHandler
[junit4:junit4]   2> 7494 T435 oasc.RequestHandlers.initHandlersFromConfig created /terms: org.apache.solr.handler.component.SearchHandler
[junit4:junit4]   2> 7496 T435 oasc.RequestHandlers.initHandlersFromConfig created spellCheckCompRH: org.apache.solr.handler.component.SearchHandler
[junit4:junit4]   2> 7496 T435 oasc.RequestHandlers.initHandlersFromConfig created spellCheckCompRH_Direct: org.apache.solr.handler.component.SearchHandler
[junit4:junit4]   2> 7498 T435 oasc.RequestHandlers.initHandlersFromConfig created spellCheckWithWordbreak: org.apache.solr.handler.component.SearchHandler
[junit4:junit4]   2> 7500 T435 oasc.RequestHandlers.initHandlersFromConfig created spellCheckWithWordbreak_Direct: org.apache.solr.handler.component.SearchHandler
[junit4:junit4]   2> 7503 T435 oasc.RequestHandlers.initHandlersFromConfig created spellCheckCompRH1: org.apache.solr.handler.component.SearchHandler
[junit4:junit4]   2> 7506 T435 oasc.RequestHandlers.initHandlersFromConfig created tvrh: org.apache.solr.handler.component.SearchHandler
[junit4:junit4]   2> 7509 T435 oasc.RequestHandlers.initHandlersFromConfig created /mlt: solr.MoreLikeThisHandler
[junit4:junit4]   2> 7511 T435 oasc.RequestHandlers.initHandlersFromConfig created /debug/dump: solr.DumpRequestHandler
[junit4:junit4]   2> 7517 T435 oashl.XMLLoader.init xsltCacheLifetimeSeconds=60
[junit4:junit4]   2> 7524 T435 oasc.SolrCore.initDeprecatedSupport WARNING solrconfig.xml uses deprecated <admin/gettableFiles>, Please update your config to use the ShowFileRequestHandler.
[junit4:junit4]   2> 7525 T435 oasc.SolrCore.initDeprecatedSupport WARNING adding ShowFileRequestHandler with hidden files: [OLD_SYNONYMS.TXT, PROTWORDS.TXT, STOPWORDS.TXT, OPEN-EXCHANGE-RATES.JSON, CURRENCY.XML, SCHEMA.XML, SYNONYMS.TXT, MAPPING-ISOLATIN1ACCENT.TXT]
[junit4:junit4]   2> 7530 T435 oass.SolrIndexSearcher.<init> Opening Searcher@f9b11fa5 main
[junit4:junit4]   2> 7536 T435 oasu.CommitTracker.<init> Hard AutoCommit: disabled
[junit4:junit4]   2> 7538 T435 oasu.CommitTracker.<init> Soft AutoCommit: disabled
[junit4:junit4]   2> 7540 T435 oashc.SpellCheckComponent.inform Initializing spell checkers
[junit4:junit4]   2> 7564 T435 oass.DirectSolrSpellChecker.init init: {name=direct,classname=DirectSolrSpellChecker,field=lowerfilt,minQueryLength=3}
[junit4:junit4]   2> 7658 T482 oasc.SolrCore.registerSearcher [collection1] Registered new searcher Searcher@f9b11fa5 main{StandardDirectoryReader(segments_1:1)}
[junit4:junit4]   2> 7675 T435 oasc.CoreContainer.register registering core: collection1
[junit4:junit4]   2> 7678 T435 oasc.ZkController.register Register shard - core:collection1 address:http://127.0.0.1:36393/solr shardId:shard4
[junit4:junit4]   2> 7680 T435 oascc.SolrZkClient.makePath makePath: /collections/collection1/leader_elect/shard4/election
[junit4:junit4]   2> 7693 T440 oazs.PrepRequestProcessor.pRequest Got user-level KeeperException when processing sessionid:0x1398d60a3cc0004 type:delete cxid:0x41 zxid:0xfffffffffffffffe txntype:unknown reqpath:n/a Error Path:/solr/collections/collection1/leaders/shard4 Error:KeeperErrorCode = NoNode for /solr/collections/collection1/leaders/shard4
[junit4:junit4]   2> 7695 T440 oazs.PrepRequestProcessor.pRequest Got user-level KeeperException when processing sessionid:0x1398d60a3cc0004 type:create cxid:0x42 zxid:0xfffffffffffffffe txntype:unknown reqpath:n/a Error Path:/solr/overseer Error:KeeperErrorCode = NodeExists for /solr/overseer
[junit4:junit4]   2> 7696 T435 oasc.ShardLeaderElectionContext.waitForReplicasToComeUp Running the leader process. afterExperiation=false
[junit4:junit4]   2> 7757 T456 oascc.ZkStateReader.updateClusterState Updating cloud state from ZooKeeper... 
[junit4:junit4]   2> 7766 T469 oascc.ZkStateReader$2.process A cluster state change has occurred - updating...
[junit4:junit4]   2> 7766 T481 oascc.ZkStateReader$2.process A cluster state change has occurred - updating...
[junit4:junit4]   2> 7766 T455 oascc.ZkStateReader$2.process A cluster state change has occurred - updating...
[junit4:junit4]   2> 8697 T435 oasc.ShardLeaderElectionContext.waitForReplicasToComeUp Enough replicas found to continue.
[junit4:junit4]   2> 8698 T435 oasc.ShardLeaderElectionContext.runLeaderProcess I am the new leader: http://127.0.0.1:36393/solr/collection1/
[junit4:junit4]   2> 8799 T435 oascc.SolrZkClient.makePath makePath: /collections/collection1/leaders/shard4
[junit4:junit4]   2> 8803 T440 oazs.PrepRequestProcessor.pRequest Got user-level KeeperException when processing sessionid:0x1398d60a3cc0004 type:create cxid:0x4b zxid:0xfffffffffffffffe txntype:unknown reqpath:n/a Error Path:/solr/overseer Error:KeeperErrorCode = NodeExists for /solr/overseer
[junit4:junit4]   2> 9274 T456 oascc.ZkStateReader.updateClusterState Updating cloud state from ZooKeeper... 
[junit4:junit4]   2> 9277 T455 oascc.ZkStateReader$2.process A cluster state change has occurred - updating...
[junit4:junit4]   2> 9277 T469 oascc.ZkStateReader$2.process A cluster state change has occurred - updating...
[junit4:junit4]   2> 9277 T481 oascc.ZkStateReader$2.process A cluster state change has occurred - updating...
[junit4:junit4]   2> 9305 T435 oasc.ZkController.register We are http://127.0.0.1:36393/solr/collection1/ and leader is http://127.0.0.1:36393/solr/collection1/
[junit4:junit4]   2> 9306 T435 oasc.ZkController.register No LogReplay needed for core=collection1 baseURL=http://127.0.0.1:36393/solr
[junit4:junit4]   2> 9307 T435 oasc.ZkController.checkRecovery I am the leader, no recovery necessary
[junit4:junit4]   2> 9308 T435 oascc.ZkStateReader.updateClusterState Updating cloud state from ZooKeeper... 
[junit4:junit4]   2> 9309 T435 oass.SolrDispatchFilter.init user.dir=/mnt/ssd/jenkins/workspace/Lucene-Solr-4.x-Linux/solr/build/solr-core/test/J0
[junit4:junit4]   2> 9310 T435 oass.SolrDispatchFilter.init SolrDispatchFilter.init() done
[junit4:junit4]   2> 9310 T435 oascsi.HttpClientUtil.createClient Creating new http client, config:maxConnections=128&maxConnectionsPerHost=32&followRedirects=false
[junit4:junit4]   2> 9376 T435 oejs.Server.doStart jetty-8.1.2.v20120308
[junit4:junit4]   2> 9379 T435 oejs.AbstractConnector.doStart Started SocketConnector@0.0.0.0:44469
[junit4:junit4]   2> 9380 T435 oasc.SolrResourceLoader.locateSolrHome JNDI not configured for solr (NoInitialContextEx)
[junit4:junit4]   2> 9380 T435 oasc.SolrResourceLoader.locateSolrHome using system property solr.solr.home: /mnt/ssd/jenkins/workspace/Lucene-Solr-4.x-Linux/solr/build/solr-core/test-files/jetty4
[junit4:junit4]   2> 9381 T435 oasc.SolrResourceLoader.<init> new SolrResourceLoader for deduced Solr Home: '/mnt/ssd/jenkins/workspace/Lucene-Solr-4.x-Linux/solr/build/solr-core/test-files/jetty4/'
[junit4:junit4]   2> 9396 T435 oass.SolrDispatchFilter.init SolrDispatchFilter.init()
[junit4:junit4]   2> 9397 T435 oasc.SolrResourceLoader.locateSolrHome JNDI not configured for solr (NoInitialContextEx)
[junit4:junit4]   2> 9397 T435 oasc.SolrResourceLoader.locateSolrHome using system property solr.solr.home: /mnt/ssd/jenkins/workspace/Lucene-Solr-4.x-Linux/solr/build/solr-core/test-files/jetty4
[junit4:junit4]   2> 9398 T435 oasc.CoreContainer$Initializer.initialize looking for solr.xml: /mnt/ssd/jenkins/workspace/Lucene-Solr-4.x-Linux/solr/build/solr-core/test-files/jetty4/solr.xml
[junit4:junit4]   2> 9399 T435 oasc.CoreContainer.<init> New CoreContainer -920936777
[junit4:junit4]   2> 9400 T435 oasc.CoreContainer.load Loading CoreContainer using Solr Home: '/mnt/ssd/jenkins/workspace/Lucene-Solr-4.x-Linux/solr/build/solr-core/test-files/jetty4/'
[junit4:junit4]   2> 9400 T435 oasc.SolrResourceLoader.<init> new SolrResourceLoader for directory: '/mnt/ssd/jenkins/workspace/Lucene-Solr-4.x-Linux/solr/build/solr-core/test-files/jetty4/'
[junit4:junit4]   2> 9421 T435 oasc.CoreContainer.load Registering Log Listener
[junit4:junit4]   2> 9436 T435 oasc.CoreContainer.initZooKeeper Zookeeper client=127.0.0.1:45424/solr
[junit4:junit4]   2> 9436 T435 oaz.ZooKeeper.<init> Initiating client connection, connectString=127.0.0.1:45424/solr sessionTimeout=8000 watcher=org.apache.solr.common.cloud.ConnectionManager@780b602e
[junit4:junit4]   2> 9438 T492 oaz.ClientCnxn$SendThread.startConnect Opening socket connection to server /127.0.0.1:45424
[junit4:junit4]   2> 9438 T435 oascc.ConnectionManager.waitForConnected Waiting for client to connect to ZooKeeper
[junit4:junit4]   2> 9438 T492 oaz.ClientCnxn$SendThread.primeConnection Socket connection established to localhost.localdomain/127.0.0.1:45424, initiating session
[junit4:junit4]   2> 9439 T437 oazs.NIOServerCnxn$Factory.run Accepted socket connection from /127.0.0.1:33127
[junit4:junit4]   2> 9439 T437 oazs.NIOServerCnxn.readConnectRequest Client attempting to establish new session at /127.0.0.1:33127
[junit4:junit4]   2> 9440 T439 oazs.NIOServerCnxn.finishSessionInit Established session 0x1398d60a3cc0005 with negotiated timeout 8000 for client /127.0.0.1:33127
[junit4:junit4]   2> 9440 T492 oaz.ClientCnxn$SendThread.readConnectResult Session establishment complete on server localhost.localdomain/127.0.0.1:45424, sessionid = 0x1398d60a3cc0005, negotiated timeout = 8000
[junit4:junit4]   2> 9441 T493 oascc.ConnectionManager.process Watcher org.apache.solr.common.cloud.ConnectionManager@780b602e name:ZooKeeperConnection Watcher:127.0.0.1:45424/solr got event WatchedEvent state:SyncConnected type:None path:null path:null type:None
[junit4:junit4]   2> 9441 T435 oascc.ConnectionManager.waitForConnected Client is connected to ZooKeeper
[junit4:junit4]   2> 9442 T440 oazs.PrepRequestProcessor.pRequest Got user-level KeeperException when processing sessionid:0x1398d60a3cc0005 type:create cxid:0x1 zxid:0xfffffffffffffffe txntype:unknown reqpath:n/a Error Path:/solr/overseer Error:KeeperErrorCode = NodeExists for /solr/overseer
[junit4:junit4]   2> 9443 T440 oazs.PrepRequestProcessor.pRequest Got user-level KeeperException when processing sessionid:0x1398d60a3cc0005 type:create cxid:0x2 zxid:0xfffffffffffffffe txntype:unknown reqpath:n/a Error Path:/solr/overseer Error:KeeperErrorCode = NodeExists for /solr/overseer
[junit4:junit4]   2> 9444 T435 oasc.ZkController.createEphemeralLiveNode Register node as live in ZooKeeper:/live_nodes/127.0.0.1:44469_solr
[junit4:junit4]   2> 9445 T440 oazs.PrepRequestProcessor.pRequest Got user-level KeeperException when processing sessionid:0x1398d60a3cc0005 type:delete cxid:0x4 zxid:0xfffffffffffffffe txntype:unknown reqpath:n/a Error Path:/solr/live_nodes/127.0.0.1:44469_solr Error:KeeperErrorCode = NoNode for /solr/live_nodes/127.0.0.1:44469_solr
[junit4:junit4]   2> 9446 T435 oascc.SolrZkClient.makePath makePath: /live_nodes/127.0.0.1:44469_solr
[junit4:junit4]   2> 9448 T469 oascc.ZkStateReader$3.process Updating live nodes
[junit4:junit4]   2> 9449 T435 oashc.HttpShardHandlerFactory.getParameter Setting socketTimeout to: 0
[junit4:junit4]   2> 9450 T435 oashc.HttpShardHandlerFactory.getParameter Setting urlScheme to: http://
[junit4:junit4]   2> 9451 T455 oascc.ZkStateReader$3.process Updating live nodes
[junit4:junit4]   2> 9451 T435 oashc.HttpShardHandlerFactory.getParameter Setting connTimeout to: 0
[junit4:junit4]   2> 9452 T435 oashc.HttpShardHandlerFactory.getParameter Setting maxConnectionsPerHost to: 20
[junit4:junit4]   2> 9452 T435 oashc.HttpShardHandlerFactory.getParameter Setting corePoolSize to: 0
[junit4:junit4]   2> 9453 T435 oashc.HttpShardHandlerFactory.getParameter Setting maximumPoolSize to: 2147483647
[junit4:junit4]   2> 9454 T435 oashc.HttpShardHandlerFactory.getParameter Setting maxThreadIdleTime to: 5
[junit4:junit4]   2> 9455 T481 oascc.ZkStateReader$3.process Updating live nodes
[junit4:junit4]   2> 9454 T435 oashc.HttpShardHandlerFactory.getParameter Setting sizeOfQueue to: -1
[junit4:junit4]   2> 9455 T435 oashc.HttpShardHandlerFactory.getParameter Setting fairnessPolicy to: false
[junit4:junit4]   2> 9456 T435 oascsi.HttpClientUtil.createClient Creating new http client, config:maxConnectionsPerHost=20&maxConnections=10000&socketTimeout=0&connTimeout=0&retry=false
[junit4:junit4]   2> 9464 T435 oascc.ZkStateReader.createClusterStateWatchersAndUpdate Updating cluster state from ZooKeeper... 
[junit4:junit4]   2> 9469 T435 oasc.CoreContainer.create Creating SolrCore 'collection1' using instanceDir: /mnt/ssd/jenkins/workspace/Lucene-Solr-4.x-Linux/solr/build/solr-core/test-files/jetty4/collection1
[junit4:junit4]   2> 9470 T435 oasc.ZkController.createCollectionZkNode Check for collection zkNode:collection1
[junit4:junit4]   2> 9471 T435 oasc.ZkController.createCollectionZkNode Collection zkNode exists
[junit4:junit4]   2> 9471 T435 oasc.ZkController.readConfigName Load collection config from:/collections/collection1
[junit4:junit4]   2> 9473 T435 oasc.SolrResourceLoader.<init> new SolrResourceLoader for directory: '/mnt/ssd/jenkins/workspace/Lucene-Solr-4.x-Linux/solr/build/solr-core/test-files/jetty4/collection1/'
[junit4:junit4]   2> 9474 T435 oasc.SolrResourceLoader.replaceClassLoader Adding 'file:/mnt/ssd/jenkins/workspace/Lucene-Solr-4.x-Linux/solr/build/solr-core/test-files/jetty4/collection1/lib/README' to classloader
[junit4:junit4]   2> 9475 T435 oasc.SolrResourceLoader.replaceClassLoader Adding 'file:/mnt/ssd/jenkins/workspace/Lucene-Solr-4.x-Linux/solr/build/solr-core/test-files/jetty4/collection1/lib/classes/' to classloader
[junit4:junit4]   2> 9505 T435 oasc.SolrConfig.<init> Using Lucene MatchVersion: LUCENE_40
[junit4:junit4]   2> 9566 T435 oasc.SolrConfig.<init> Loaded SolrConfig: solrconfig.xml
[junit4:junit4]   2> 9567 T435 oass.IndexSchema.readSchema Reading Solr Schema
[junit4:junit4]   2> 9572 T435 oass.IndexSchema.readSchema Schema name=test
[junit4:junit4]   2> 9780 T456 oascc.ZkStateReader.updateClusterState Updating cloud state from ZooKeeper... 
[junit4:junit4]   2> 9785 T493 oascc.ZkStateReader$2.process A cluster state change has occurred - updating...
[junit4:junit4]   2> 9785 T469 oascc.ZkStateReader$2.process A cluster state change has occurred - updating...
[junit4:junit4]   2> 9785 T481 oascc.ZkStateReader$2.process A cluster state change has occurred - updating...
[junit4:junit4]   2> 9785 T455 oascc.ZkStateReader$2.process A cluster state change has occurred - updating...
[junit4:junit4]   2> 9963 T435 oass.OpenExchangeRatesOrgProvider.init Initialized with rates=open-exchange-rates.json, refreshInterval=1440.
[junit4:junit4]   2> 9969 T435 oass.IndexSchema.readSchema default search field in schema is text
[junit4:junit4]   2> 9971 T435 oass.IndexSchema.readSchema unique key field: id
[junit4:junit4]   2> 9980 T435 oass.FileExchangeRateProvider.reload Reloading exchange rates from file currency.xml
[junit4:junit4]   2> 9985 T435 oass.FileExchangeRateProvider.reload Reloading exchange rates from file currency.xml
[junit4:junit4]   2> 9988 T435 oass.OpenExchangeRatesOrgProvider.reload Reloading exchange rates from open-exchange-rates.json
[junit4:junit4]   2> 9990 T435 oass.OpenExchangeRatesOrgProvider.reload Reloading exchange rates from open-exchange-rates.json
[junit4:junit4]   2> 9991 T435 oasc.SolrCore.<init> [collection1] Opening new SolrCore at /mnt/ssd/jenkins/workspace/Lucene-Solr-4.x-Linux/solr/build/solr-core/test-files/jetty4/collection1/, dataDir=/mnt/ssd/jenkins/workspace/Lucene-Solr-4.x-Linux/solr/build/solr-core/test-files/jetty4/collection1/data/
[junit4:junit4]   2> 9991 T435 oasc.JmxMonitoredMap.<init> JMX monitoring is enabled. Adding Solr mbeans to JMX Server: com.sun.jmx.mbeanserver.JmxMBeanServer@d7fae4e9
[junit4:junit4]   2> 9992 T435 oasc.SolrCore.getNewIndexDir WARNING New index directory detected: old=null new=/mnt/ssd/jenkins/workspace/Lucene-Solr-4.x-Linux/solr/build/solr-core/test-files/jetty4/collection1/data/index/
[junit4:junit4]   2> 9993 T435 oasc.SolrCore.initIndex WARNING [collection1] Solr index directory '/mnt/ssd/jenkins/workspace/Lucene-Solr-4.x-Linux/solr/build/solr-core/test-files/jetty4/collection1/data/index' doesn't exist. Creating new index...
[junit4:junit4]   2> 9993 T435 oasc.CachingDirectoryFactory.get return new directory for /mnt/ssd/jenkins/workspace/Lucene-Solr-4.x-Linux/solr/build/solr-core/test-files/jetty4/collection1/data/index forceNew:false
[junit4:junit4]   2> 9997 T435 oasc.SolrDeletionPolicy.onCommit SolrDeletionPolicy.onCommit: commits:num=1
[junit4:junit4]   2> 		commit{dir=NRTCachingDirectory(org.apache.lucene.store.MMapDirectory@/mnt/ssd/jenkins/workspace/Lucene-Solr-4.x-Linux/solr/build/solr-core/test-files/jetty4/collection1/data/index lockFactory=org.apache.lucene.store.NativeFSLockFactory@ee19f507; maxCacheMB=48.0 maxMergeSizeMB=4.0),segFN=segments_1,generation=1,filenames=[segments_1]
[junit4:junit4]   2> 9997 T435 oasc.SolrDeletionPolicy.updateCommits newest commit = 1
[junit4:junit4]   2> 9998 T435 oasc.SolrCore.initWriters created xml: solr.XMLResponseWriter
[junit4:junit4]   2> 9999 T435 oasup.UpdateRequestProcessorChain.init inserting DistributedUpdateProcessorFactory into updateRequestProcessorChain "dedupe"
[junit4:junit4]   2> 10000 T435 oasup.UpdateRequestProcessorChain.init inserting DistributedUpdateProcessorFactory into updateRequestProcessorChain "dedupe-allfields"
[junit4:junit4]   2> 10000 T435 oasup.UpdateRequestProcessorChain.init inserting DistributedUpdateProcessorFactory into updateRequestProcessorChain "stored_sig"
[junit4:junit4]   2> 10001 T435 oasup.UpdateRequestProcessorChain.init inserting DistributedUpdateProcessorFactory into updateRequestProcessorChain "uniq-fields"
[junit4:junit4]   2> 10002 T435 oasup.UpdateRequestProcessorChain.init inserting DistributedUpdateProcessorFactory into updateRequestProcessorChain "distrib-dup-test-chain-implicit"
[junit4:junit4]   2> 10002 T435 oasc.RequestHandlers.initHandlersFromConfig adding lazy requestHandler: solr.ReplicationHandler
[junit4:junit4]   2> 10003 T435 oasc.RequestHandlers.initHandlersFromConfig created /replication: solr.ReplicationHandler
[junit4:junit4]   2> 10003 T435 oasc.RequestHandlers.initHandlersFromConfig created standard: solr.StandardRequestHandler
[junit4:junit4]   2> 10004 T435 oasc.RequestHandlers.initHandlersFromConfig created /get: solr.RealTimeGetHandler
[junit4:junit4]   2> 10004 T435 oasc.RequestHandlers.initHandlersFromConfig created dismax: solr.SearchHandler
[junit4:junit4]   2> 10005 T435 oasc.RequestHandlers.initHandlersFromConfig created mock: org.apache.solr.core.MockQuerySenderListenerReqHandler
[junit4:junit4]   2> 10005 T435 oasc.RequestHandlers.initHandlersFromConfig created /admin/: org.apache.solr.handler.admin.AdminHandlers
[junit4:junit4]   2> 10006 T435 oasc.RequestHandlers.initHandlersFromConfig created defaults: solr.StandardRequestHandler
[junit4:junit4]   2> 10006 T435 oasc.RequestHandlers.initHandlersFromConfig adding lazy requestHandler: solr.StandardRequestHandler
[junit4:junit4]   2> 10007 T435 oasc.RequestHandlers.initHandlersFromConfig created lazy: solr.StandardRequestHandler
[junit4:junit4]   2> 10007 T435 oasc.RequestHandlers.initHandlersFromConfig created /update: solr.UpdateRequestHandler
[junit4:junit4]   2> 10008 T435 oasc.RequestHandlers.initHandlersFromConfig created /terms: org.apache.solr.handler.component.SearchHandler
[junit4:junit4]   2> 10009 T435 oasc.RequestHandlers.initHandlersFromConfig created spellCheckCompRH: org.apache.solr.handler.component.SearchHandler
[junit4:junit4]   2> 10009 T435 oasc.RequestHandlers.initHandlersFromConfig created spellCheckCompRH_Direct: org.apache.solr.handler.component.SearchHandler
[junit4:junit4]   2> 10010 T435 oasc.RequestHandlers.initHandlersFromConfig created spellCheckWithWordbreak: org.apache.solr.handler.component.SearchHandler
[junit4:junit4]   2> 10010 T435 oasc.RequestHandlers.initHandlersFromConfig created spellCheckWithWordbreak_Direct: org.apache.solr.handler.component.SearchHandler
[junit4:junit4]   2> 10011 T435 oasc.RequestHandlers.initHandlersFromConfig created spellCheckCompRH1: org.apache.solr.handler.component.SearchHandler
[junit4:junit4]   2> 10012 T435 oasc.RequestHandlers.initHandlersFromConfig created tvrh: org.apache.solr.handler.component.SearchHandler
[junit4:junit4]   2> 10012 T435 oasc.RequestHandlers.initHandlersFromConfig created /mlt: solr.MoreLikeThisHandler
[junit4:junit4]   2> 10013 T435 oasc.RequestHandlers.initHandlersFromConfig created /debug/dump: solr.DumpRequestHandler
[junit4:junit4]   2> 10014 T435 oashl.XMLLoader.init xsltCacheLifetimeSeconds=60
[junit4:junit4]   2> 10015 T435 oasc.SolrCore.initDeprecatedSupport WARNING solrconfig.xml uses deprecated <admin/gettableFiles>, Please update your config to use the ShowFileRequestHandler.
[junit4:junit4]   2> 10016 T435 oasc.SolrCore.initDeprecatedSupport WARNING adding ShowFileRequestHandler with hidden files: [OLD_SYNONYMS.TXT, PROTWORDS.TXT, STOPWORDS.TXT, OPEN-EXCHANGE-RATES.JSON, CURRENCY.XML, SCHEMA.XML, SYNONYMS.TXT, MAPPING-ISOLATIN1ACCENT.TXT]
[junit4:junit4]   2> 10018 T435 oass.SolrIndexSearcher.<init> Opening Searcher@8d102dd0 main
[junit4:junit4]   2> 10019 T435 oasu.CommitTracker.<init> Hard AutoCommit: disabled
[junit4:junit4]   2> 10020 T435 oasu.CommitTracker.<init> Soft AutoCommit: disabled
[junit4:junit4]   2> 10020 T435 oashc.SpellCheckComponent.inform Initializing spell checkers
[junit4:junit4]   2> 10024 T435 oass.DirectSolrSpellChecker.init init: {name=direct,classname=DirectSolrSpellChecker,field=lowerfilt,minQueryLength=3}
[junit4:junit4]   2> 10045 T494 oasc.SolrCore.registerSearcher [collection1] Registered new searcher Searcher@8d102dd0 main{StandardDirectoryReader(segments_1:1)}
[junit4:junit4]   2> 10052 T435 oasc.CoreContainer.register registering core: collection1
[junit4:junit4]   2> 10053 T435 oasc.ZkController.register Register shard - core:collection1 address:http://127.0.0.1:44469/solr shardId:shard5
[junit4:junit4]   2> 10054 T435 oascc.SolrZkClient.makePath makePath: /collections/collection1/leader_elect/shard5/election
[junit4:junit4]   2> 10058 T440 oazs.PrepRequestProcessor.pRequest Got user-level KeeperException when processing sessionid:0x1398d60a3cc0005 type:delete cxid:0x41 zxid:0xfffffffffffffffe txntype:unknown reqpath:n/a Error Path:/solr/collections/collection1/leaders/shard5 Error:KeeperErrorCode = NoNode for /solr/collections/collection1/leaders/shard5
[junit4:junit4]   2> 10058 T440 oazs.PrepRequestProcessor.pRequest Got user-level KeeperException when processing sessionid:0x1398d60a3cc0005 type:create cxid:0x42 zxid:0xfffffffffffffffe txntype:unknown reqpath:n/a Error Path:/solr/overseer Error:KeeperErrorCode = NodeExists for /solr/overseer
[junit4:junit4]   2> 10060 T435 oasc.ShardLeaderElectionContext.waitForReplicasToComeUp Running the leader process. afterExperiation=false
[junit4:junit4]   2> 10288 T456 oascc.ZkStateReader.updateClusterState Updating cloud state from ZooKeeper... 
[junit4:junit4]   2> 10294 T493 oascc.ZkStateReader$2.process A cluster state change has occurred - updating...
[junit4:junit4]   2> 10294 T481 oascc.ZkStateReader$2.process A cluster state change has occurred - updating...
[junit4:junit4]   2> 10294 T469 oascc.ZkStateReader$2.process A cluster state change has occurred - updating...
[junit4:junit4]   2> 10294 T455 oascc.ZkStateReader$2.process A cluster state change has occurred - updating...
[junit4:junit4]   2> 11061 T435 oasc.ShardLeaderElectionContext.waitForReplicasToComeUp Enough replicas found to continue.
[junit4:junit4]   2> 11061 T435 oasc.ShardLeaderElectionContext.runLeaderProcess I am the new leader: http://127.0.0.1:44469/solr/collection1/
[junit4:junit4]   2> 11162 T435 oascc.SolrZkClient.makePath makePath: /collections/collection1/leaders/shard5
[junit4:junit4]   2> 11165 T440 oazs.PrepRequestProcessor.pRequest Got user-level KeeperException when processing sessionid:0x1398d60a3cc0005 type:create cxid:0x4b zxid:0xfffffffffffffffe txntype:unknown reqpath:n/a Error Path:/solr/overseer Error:KeeperErrorCode = NodeExists for /solr/overseer
[junit4:junit4]   2> 11299 T456 oascc.ZkStateReader.updateClusterState Updating cloud state from ZooKeeper... 
[junit4:junit4]   2> 11301 T493 oascc.ZkStateReader$2.process A cluster state change has occurred - updating...
[junit4:junit4]   2> 11301 T481 oascc.ZkStateReader$2.process A cluster state change has occurred - updating...
[junit4:junit4]   2> 11301 T469 oascc.ZkStateReader$2.process A cluster state change has occurred - updating...
[junit4:junit4]   2> 11301 T455 oascc.ZkStateReader$2.process A cluster state change has occurred - updating...
[junit4:junit4]   2> 11317 T435 oasc.ZkController.register We are http://127.0.0.1:44469/solr/collection1/ and leader is http://127.0.0.1:44469/solr/collection1/
[junit4:junit4]   2> 11318 T435 oasc.ZkController.register No LogReplay needed for core=collection1 baseURL=http://127.0.0.1:44469/solr
[junit4:junit4]   2> 11318 T435 oasc.ZkController.checkRecovery I am the leader, no recovery necessary
[junit4:junit4]   2> 11320 T435 oascc.ZkStateReader.updateClusterState Updating cloud state from ZooKeeper... 
[junit4:junit4]   2> 11321 T435 oass.SolrDispatchFilter.init user.dir=/mnt/ssd/jenkins/workspace/Lucene-Solr-4.x-Linux/solr/build/solr-core/test/J0
[junit4:junit4]   2> 11321 T435 oass.SolrDispatchFilter.init SolrDispatchFilter.init() done
[junit4:junit4]   2> 11321 T435 oascsi.HttpClientUtil.createClient Creating new http client, config:maxConnections=128&maxConnectionsPerHost=32&followRedirects=false
[junit4:junit4]   2> ASYNC  NEW_CORE C29 name=collection1 org.apache.solr.core.SolrCore@2afe0ff0 url=http://127.0.0.1:57407/solr/collection1 node=127.0.0.1:57407_solr
[junit4:junit4]   2> 11331 T447 C29 P57407 oasc.SolrDeletionPolicy.onInit SolrDeletionPolicy.onInit: commits:num=1
[junit4:junit4]   2> 		commit{dir=NRTCachingDirectory(org.apache.lucene.store.MMapDirectory@/mnt/ssd/jenkins/workspace/Lucene-Solr-4.x-Linux/solr/build/solr-core/test-files/control1/collection1/data/index lockFactory=org.apache.lucene.store.NativeFSLockFactory@b09fcbe8; maxCacheMB=48.0 maxMergeSizeMB=4.0),segFN=segments_1,generation=1,filenames=[segments_1]
[junit4:junit4]   2> 11332 T447 C29 P57407 oasc.SolrDeletionPolicy.updateCommits newest commit = 1
[junit4:junit4]   2> 11333 T447 C29 P57407 oass.SolrIndexSearcher.<init> Opening Searcher@b893c3d7 realtime
[junit4:junit4]   2> 11334 T447 C29 P57407 UPDATE [collection1] webapp=/solr path=/update params={version=2&wt=javabin} {deleteByQuery=*:* (-1412113834507763712)} 0 6
[junit4:junit4]   2> ASYNC  NEW_CORE C30 name=collection1 org.apache.solr.core.SolrCore@19fa2296 url=http://127.0.0.1:47102/solr/collection1 node=127.0.0.1:47102_solr
[junit4:junit4]   2> 11340 T461 C30 P47102 oasc.SolrDeletionPolicy.onInit SolrDeletionPolicy.onInit: commits:num=1
[junit4:junit4]   2> 		commit{dir=NRTCachingDirectory(org.apache.lucene.store.MMapDirectory@/mnt/ssd/jenkins/workspace/Lucene-Solr-4.x-Linux/solr/build/solr-core/test-files/jetty2/collection1/data/index lockFactory=org.apache.lucene.store.NativeFSLockFactory@7820e5ce; maxCacheMB=48.0 maxMergeSizeMB=4.0),segFN=segments_1,generation=1,filenames=[segments_1]
[junit4:junit4]   2> 11340 T461 C30 P47102 oasc.SolrDeletionPolicy.updateCommits newest commit = 1
[junit4:junit4]   2> 11341 T461 C30 P47102 oass.SolrIndexSearcher.<init> Opening Searcher@a20faa61 realtime
[junit4:junit4]   2> ASYNC  NEW_CORE C31 name=collection1 org.apache.solr.core.SolrCore@15c1c1e2 url=http://127.0.0.1:44469/solr/collection1 node=127.0.0.1:44469_solr
[junit4:junit4]   2> 11348 T485 C31 P44469 oasc.SolrDeletionPolicy.onInit SolrDeletionPolicy.onInit: commits:num=1
[junit4:junit4]   2> 		commit{dir=NRTCachingDirectory(org.apache.lucene.store.MMapDirectory@/mnt/ssd/jenkins/workspace/Lucene-Solr-4.x-Linux/solr/build/solr-core/test-files/jetty4/collection1/data/index lockFactory=org.apache.lucene.store.NativeFSLockFactory@ee19f507; maxCacheMB=48.0 maxMergeSizeMB=4.0),segFN=segments_1,generation=1,filenames=[segments_1]
[junit4:junit4]   2> 11348 T485 C31 P44469 oasc.SolrDeletionPolicy.updateCommits newest commit = 1
[junit4:junit4]   2> 11349 T485 C31 P44469 oass.SolrIndexSearcher.<init> Opening Searcher@f1d138cd realtime
[junit4:junit4]   2> ASYNC  NEW_CORE C32 name=collection1 org.apache.solr.core.SolrCore@9f6e32d0 url=http://127.0.0.1:36393/solr/collection1 node=127.0.0.1:36393_solr
[junit4:junit4]   2> 11349 T473 C32 P36393 oasc.SolrDeletionPolicy.onInit SolrDeletionPolicy.onInit: commits:num=1
[junit4:junit4]   2> 		commit{dir=NRTCachingDirectory(org.apache.lucene.store.MMapDirectory@/mnt/ssd/jenkins/workspace/Lucene-Solr-4.x-Linux/solr/build/solr-core/test-files/jetty3/collection1/data/index lockFactory=org.apache.lucene.store.NativeFSLockFactory@51e83c5e; maxCacheMB=48.0 maxMergeSizeMB=4.0),segFN=segments_1,generation=1,filenames=[segments_1]
[junit4:junit4]   2> 11350 T485 C31 P44469 REQ [collection1] webapp=/solr path=/update params={update.distrib=TOLEADER&version=2&wt=javabin} status=0 QTime=4 
[junit4:junit4]   2> 11350 T473 C32 P36393 oasc.SolrDeletionPolicy.updateCommits newest commit = 1
[junit4:junit4]   2> 11357 T473 C32 P36393 oass.SolrIndexSearcher.<init> Opening Searcher@a44f90b6 realtime
[junit4:junit4]   2> 11357 T473 C32 P36393 REQ [collection1] webapp=/solr path=/update params={update.distrib=TOLEADER&version=2&wt=javabin} status=0 QTime=10 
[junit4:junit4]   2> 11358 T461 C30 P47102 UPDATE [collection1] webapp=/solr path=/update params={version=2&wt=javabin} {deleteByQuery=*:* (-1412113834518249472)} 0 20
[junit4:junit4]   2> 11362 T462 C30 P47102 REQ [collection1] webapp=/solr path=/update params={update.distrib=TOLEADER&version=2&wt=javabin} status=0 QTime=1 
[junit4:junit4]   2> 11362 T485 C31 P44469 REQ [collection1] webapp=/solr path=/update params={update.distrib=TOLEADER&version=2&wt=javabin} status=0 QTime=0 
[junit4:junit4]   2> 11363 T474 C32 P36393 UPDATE [collection1] webapp=/solr path=/update params={version=2&wt=javabin} {deleteByQuery=*:* (-1412113834541318144)} 0 4
[junit4:junit4]   2> 11366 T462 C30 P47102 REQ [collection1] webapp=/solr path=/update params={update.distrib=TOLEADER&version=2&wt=javabin} status=0 QTime=0 
[junit4:junit4]   2> 11366 T473 C32 P36393 REQ [collection1] webapp=/solr path=/update params={update.distrib=TOLEADER&version=2&wt=javabin} status=0 QTime=0 
[junit4:junit4]   2> 11367 T486 C31 P44469 UPDATE [collection1] webapp=/solr path=/update params={version=2&wt=javabin} {deleteByQuery=*:* (-1412113834545512448)} 0 3
[junit4:junit4]   2> 11372 T447 C29 P57407 UPDATE [collection1] webapp=/solr path=/update params={version=2&wt=javabin} {add=[1 (1412113834551803904)]} 0 2
[junit4:junit4]   2> 11376 T461 C30 P47102 UPDATE [collection1] webapp=/solr path=/update params={version=2&wt=javabin} {add=[1 (1412113834555998208)]} 0 2
[junit4:junit4]   2> 11380 T447 C29 P57407 UPDATE [collection1] webapp=/solr path=/update params={version=2&wt=javabin} {add=[2 (1412113834561241088)]} 0 1
[junit4:junit4]   2> 11384 T474 C32 P36393 UPDATE [collection1] webapp=/solr path=/update params={version=2&wt=javabin} {add=[2 (1412113834564386816)]} 0 2
[junit4:junit4]   2> 11388 T447 C29 P57407 UPDATE [collection1] webapp=/solr path=/update params={version=2&wt=javabin} {add=[3 (1412113834569629696)]} 0 1
[junit4:junit4]   2> 11394 T473 C32 P36393 REQ [collection1] webapp=/solr path=/update params={update.distrib=TOLEADER&distrib.from=http://127.0.0.1:44469/solr/collection1/&version=2&wt=javabin} status=0 QTime=2 
[junit4:junit4]   2> 11394 T486 C31 P44469 UPDATE [collection1] webapp=/solr path=/update params={version=2&wt=javabin} {add=[3]} 0 4
[junit4:junit4]   2> 11398 T447 C29 P57407 UPDATE [collection1] webapp=/solr path=/update params={version=2&wt=javabin} {add=[4 (1412113834580115456)]} 0 1
[junit4:junit4]   2> 11402 T473 C32 P36393 REQ [collection1] webapp=/solr path=/update params={update.distrib=TOLEADER&distrib.from=http://127.0.0.1:47102/solr/collection1/&version=2&wt=javabin} status=0 QTime=1 
[junit4:junit4]   2> 11403 T461 C30 P47102 UPDATE [collection1] webapp=/solr path=/update params={version=2&wt=javabin} {add=[4]} 0 3
[junit4:junit4]   2> 11406 T447 C29 P57407 UPDATE [collection1] webapp=/solr path=/update params={version=2&wt=javabin} {add=[5 (1412113834588504064)]} 0 1
[junit4:junit4]   2> 11411 T485 C31 P44469 REQ [collection1] webapp=/solr path=/update params={update.distrib=TOLEADER&distrib.from=http://127.0.0.1:36393/solr/collection1/&version=2&wt=javabin} status=0 QTime=1 
[junit4:junit4]   2> 11412 T474 C32 P36393 UPDATE [collection1] webapp=/solr path=/update params={version=2&wt=javabin} {add=[5]} 0 4
[junit4:junit4]   2> 11416 T447 C29 P57407 UPDATE [collection1] webapp=/solr path=/update params={version=2&wt=javabin} {add=[6 (1412113834598989824)]} 0 2
[junit4:junit4]   2> 11420 T473 C32 P36393 REQ [collection1] webapp=/solr path=/update params={update.distrib=TOLEADER&distrib.from=http://127.0.0.1:44469/solr/collection1/&version=2&wt=javabin} status=0 QTime=1 
[junit4:junit4]   2> 11420 T486 C31 P44469 UPDATE [collection1] webapp=/solr path=/update params={version=2&wt=javabin} {add=[6]} 0 3
[junit4:junit4]   2> 11424 T447 C29 P57407 UPDATE [collection1] webapp=/solr path=/update params={version=2&wt=javabin} {add=[7 (1412113834607378432)]} 0 1
[junit4:junit4]   2> 11428 T473 C32 P36393 REQ [collection1] webapp=/solr path=/update params={update.distrib=TOLEADER&distrib.from=http://127.0.0.1:47102/solr/collection1/&version=2&wt=javabin} status=0 QTime=1 
[junit4:junit4]   2> 11429 T461 C30 P47102 UPDATE [collection1] webapp=/solr path=/update params={version=2&wt=javabin} {add=[7]} 0 3
[junit4:junit4]   2> 11433 T447 C29 P57407 UPDATE [collection1] webapp=/solr path=/update params={version=2&wt=javabin} {add=[8 (1412113834616815616)]} 0 2
[junit4:junit4]   2> 11438 T462 C30 P47102 REQ [collection1] webapp=/solr path=/update params={update.distrib=TOLEADER&distrib.from=http://127.0.0.1:36393/solr/collection1/&version=2&wt=javabin} status=0 QTime=1 
[junit4:junit4]   2> 11439 T474 C32 P36393 UPDATE [collection1] webapp=/solr path=/update params={version=2&wt=javabin} {add=[8]} 0 4
[junit4:junit4]   2> 11443 T447 C29 P57407 UPDATE [collection1] webapp=/solr path=/update params={version=2&wt=javabin} {add=[9 (1412113834626252800)]} 0 2
[junit4:junit4]   2> 11448 T473 C32 P36393 REQ [collection1] webapp=/solr path=/update params={update.distrib=TOLEADER&distrib.from=http://127.0.0.1:44469/solr/collection1/&version=2&wt=javabin} status=0 QTime=1 
[junit4:junit4]   2> 11448 T486 C31 P44469 UPDATE [collection1] webapp=/solr path=/update params={version=2&wt=javabin} {add=[9]} 0 3
[junit4:junit4]   2> 11561 T447 C29 P57407 UPDATE [collection1] webapp=/solr path=/update params={version=2&wt=javabin} {add=[10 (1412113834636738560)]} 0 110
[junit4:junit4]   2> 11565 T461 C30 P47102 UPDATE [collection1] webapp=/solr path=/update params={version=2&wt=javabin} {add=[10 (1412113834755227648)]} 0 1
[junit4:junit4]   2> 11569 T447 C29 P57407 UPDATE [collection1] webapp=/solr path=/update params={version=2&wt=javabin} {add=[11 (1412113834758373376)]} 0 2
[junit4:junit4]   2> 11575 T462 C30 P47102 REQ [collection1] webapp=/solr path=/update params={update.distrib=TOLEADER&distrib.from=http://127.0.0.1:36393/solr/collection1/&version=2&wt=javabin} status=0 QTime=1 
[junit4:junit4]   2> 11576 T474 C32 P36393 UPDATE [collection1] webapp=/solr path=/update params={version=2&wt=javabin} {add=[11]} 0 4
[junit4:junit4]   2> 11580 T447 C29 P57407 UPDATE [collection1] webapp=/solr path=/update params={version=2&wt=javabin} {add=[12 (1412113834770956288)]} 0 2
[junit4:junit4]   2> 11585 T473 C32 P36393 REQ [collection1] webapp=/solr path=/update params={update.distrib=TOLEADER&distrib.from=http://127.0.0.1:44469/solr/collection1/&version=2&wt=javabin} status=0 QTime=1 
[junit4:junit4]   2> 11586 T486 C31 P44469 UPDATE [collection1] webapp=/solr path=/update params={version=2&wt=javabin} {add=[12]} 0 4
[junit4:junit4]   2> 11590 T447 C29 P57407 UPDATE [collection1] webapp=/solr path=/update params={version=2&wt=javabin} {add=[13 (1412113834780393472)]} 0 2
[junit4:junit4]   2> 11594 T461 C30 P47102 UPDATE [collection1] webapp=/solr path=/update params={version=2&wt=javabin} {add=[13 (1412113834784587776)]} 0 2
[junit4:junit4]   2> 11598 T447 C29 P57407 UPDATE [collection1] webapp=/solr path=/update params={version=2&wt=javabin} {add=[14 (1412113834788782080)]} 0 2
[junit4:junit4]   2> 11602 T462 C30 P47102 REQ [collection1] webapp=/solr path=/update params={update.distrib=TOLEADER&distrib.from=http://127.0.0.1:36393/solr/collection1/&version=2&wt=javabin} status=0 QTime=1 
[junit4:junit4]   2> 11603 T474 C32 P36393 UPDATE [collection1] webapp=/solr path=/update params={version=2&wt=javabin} {add=[14]} 0 3
[junit4:junit4]   2> 11606 T447 C29 P57407 UPDATE [collection1] webapp=/solr path=/update params={version=2&wt=javabin} {add=[15 (1412113834798219264)]} 0 1
[junit4:junit4]   2> 11611 T473 C32 P36393 REQ [collection1] webapp=/solr path=/update params={update.distrib=TOLEADER&distrib.from=http://127.0.0.1:44469/solr/collection1/&version=2&wt=javabin} status=0 QTime=1 
[junit4:junit4]   2> 11612 T486 C31 P44469 UPDATE [collection1] webapp=/solr path=/update params={version=2&wt=javabin} {add=[15]} 0 3
[junit4:junit4]   2> 11615 T447 C29 P57407 UPDATE [collection1] webapp=/solr path=/update params={version=2&wt=javabin} {add=[16 (1412113834808705024)]} 0 1
[junit4:junit4]   2> 11618 T461 C30 P47102 UPDATE [collection1] webapp=/solr path=/update params={version=2&wt=javabin} {add=[16 (1412113834811850752)]} 0 0
[junit4:junit4]   2> 11623 T447 C29 P57407 UPDATE [collection1] webapp=/solr path=/update params={version=2&wt=javabin} {add=[17 (1412113834814996480)]} 0 2
[junit4:junit4]   2> 11629 T485 C31 P44469 REQ [collection1] webapp=/solr path=/update params={update.distrib=TOLEADER&distrib.from=http://127.0.0.1:36393/solr/collection1/&version=2&wt=javabin} status=0 QTime=2 
[junit4:junit4]   2> 11630 T474 C32 P36393 UPDATE [collection1] webapp=/solr path=/update params={version=2&wt=javabin} {add=[17]} 0 5
[junit4:junit4]   2> 11633 T447 C29 P57407 UPDATE [collection1] webapp=/solr path=/update params={version=2&wt=javabin} {add=[100 (1412113834826530816)]} 0 1
[junit4:junit4]   2> 11637 T462 C30 P47102 REQ [collection1] webapp=/solr path=/update params={update.distrib=TOLEADER&distrib.from=http://127.0.0.1:36393/solr/collection1/&version=2&wt=javabin} status=0 QTime=1 
[junit4:junit4]   2> 11638 T474 C32 P36393 UPDATE [collection1] webapp=/solr path=/update params={version=2&wt=javabin} {add=[100]} 0 3
[junit4:junit4]   2> 11640 T447 C29 P57407 UPDATE [collection1] webapp=/solr path=/update params={version=2&wt=javabin} {add=[101 (1412113834834919424)]} 0 0
[junit4:junit4]   2> 11645 T473 C32 P36393 REQ [collection1] webapp=/solr path=/update params={update.distrib=TOLEADER&distrib.from=http://127.0.0.1:44469/solr/collection1/&version=2&wt=javabin} status=0 QTime=1 
[junit4:junit4]   2> 11646 T486 C31 P44469 UPDATE [collection1] webapp=/solr path=/update params={version=2&wt=javabin} {add=[101]} 0 4
[junit4:junit4]   2> 11666 T447 C29 P57407 UPDATE [collection1] webapp=/solr path=/update params={version=2&wt=javabin} {add=[102 (1412113834843308032)]} 0 18
[junit4:junit4]   2> 11687 T473 C32 P36393 REQ [collection1] webapp=/solr path=/update params={update.distrib=TOLEADER&distrib.from=http://127.0.0.1:47102/solr/collection1/&version=2&wt=javabin} status=0 QTime=17 
[junit4:junit4]   2> 11688 T461 C30 P47102 UPDATE [collection1] webapp=/solr path=/update params={version=2&wt=javabin} {add=[102]} 0 20
[junit4:junit4]   2> 11692 T447 C29 P57407 UPDATE [collection1] webapp=/solr path=/update params={version=2&wt=javabin} {add=[103 (1412113834888396800)]} 0 1
[junit4:junit4]   2> 11697 T485 C31 P44469 REQ [collection1] webapp=/solr path=/update params={update.distrib=TOLEADER&distrib.from=http://127.0.0.1:36393/solr/collection1/&version=2&wt=javabin} status=0 QTime=1 
[junit4:junit4]   2> 11698 T474 C32 P36393 UPDATE [collection1] webapp=/solr path=/update params={version=2&wt=javabin} {add=[103]} 0 3
[junit4:junit4]   2> 11701 T447 C29 P57407 UPDATE [collection1] webapp=/solr path=/update params={version=2&wt=javabin} {add=[104 (1412113834897833984)]} 0 1
[junit4:junit4]   2> 11704 T486 C31 P44469 UPDATE [collection1] webapp=/solr path=/update params={version=2&wt=javabin} {add=[104 (1412113834900979712)]} 0 1
[junit4:junit4]   2> 11708 T447 C29 P57407 UPDATE [collection1] webapp=/solr path=/update params={version=2&wt=javabin} {add=[105 (1412113834905174016)]} 0 2
[junit4:junit4]   2> 11713 T473 C32 P36393 REQ [collection1] webapp=/solr path=/update params={update.distrib=TOLEADER&distrib.from=http://127.0.0.1:47102/solr/collection1/&version=2&wt=javabin} status=0 QTime=2 
[junit4:junit4]   2> 11713 T461 C30 P47102 UPDATE [collection1] webapp=/solr path=/update params={version=2&wt=javabin} {add=[105]} 0 3
[junit4:junit4]   2> 11717 T447 C29 P57407 UPDATE [collection1] webapp=/solr path=/update params={version=2&wt=javabin} {add=[106 (1412113834914611200)]} 0 1
[junit4:junit4]   2> 11722 T485 C31 P44469 REQ [collection1] webapp=/solr path=/update params={update.distrib=TOLEADER&distrib.from=http://127.0.0.1:36393/solr/collection1/&version=2&wt=javabin} status=0 QTime=1 
[junit4:junit4]   2> 11723 T474 C32 P36393 UPDATE [collection1] webapp=/solr path=/update params={version=2&wt=javabin} {add=[106]} 0 4
[junit4:junit4]   2> 11726 T447 C29 P57407 UPDATE [collection1] webapp=/solr path=/update params={version=2&wt=javabin} {add=[107 (1412113834924048384)]} 0 1
[junit4:junit4]   2> 11731 T473 C32 P36393 REQ [collection1] webapp=/solr path=/update params={update.distrib=TOLEADER&distrib.from=http://127.0.0.1:44469/solr/collection1/&version=2&wt=javabin} status=0 QTime=1 
[junit4:junit4]   2> 11732 T486 C31 P44469 UPDATE [collection1] webapp=/solr path=/update params={version=2&wt=javabin} {add=[107]} 0 3
[junit4:junit4]   2> 11736 T447 C29 P57407 UPDATE [collection1] webapp=/solr path=/update params={version=2&wt=javabin} {add=[108 (1412113834934534144)]} 0 2
[junit4:junit4]   2> 11739 T461 C30 P47102 UPDATE [collection1] webapp=/solr path=/update params={version=2&wt=javabin} {add=[108 (1412113834937679872)]} 0 1
[junit4:junit4]   2> 11743 T447 C29 P57407 UPDATE [collection1] webapp=/solr path=/update params={version=2&wt=javabin} {add=[109 (1412113834941874176)]} 0 2
[junit4:junit4]   2> 11775 T462 C30 P47102 REQ [collection1] webapp=/solr path=/update params={update.distrib=TOLEADER&distrib.from=http://127.0.0.1:36393/solr/collection1/&version=2&wt=javabin} status=0 QTime=29 
[junit4:junit4]   2> 11776 T474 C32 P36393 UPDATE [collection1] webapp=/solr path=/update params={version=2&wt=javabin} {add=[109]} 0 31
[junit4:junit4]   2> 11780 T447 C29 P57407 UPDATE [collection1] webapp=/solr path=/update params={version=2&wt=javabin} {add=[110 (1412113834980671488)]} 0 1
[junit4:junit4]   2> 11786 T462 C30 P47102 REQ [collection1] webapp=/solr path=/update params={update.distrib=TOLEADER&distrib.from=http://127.0.0.1:44469/solr/collection1/&version=2&wt=javabin} status=0 QTime=2 
[junit4:junit4]   2> 11787 T486 C31 P44469 UPDATE [collection1] webapp=/solr path=/update params={version=2&wt=javabin} {add=[110]} 0 5
[junit4:junit4]   2> 11790 T447 C29 P57407 UPDATE [collection1] webapp=/solr path=/update params={version=2&wt=javabin} {add=[111 (1412113834991157248)]} 0 1
[junit4:junit4]   2> 11794 T473 C32 P36393 REQ [collection1] webapp=/solr path=/update params={update.distrib=TOLEADER&distrib.from=http://127.0.0.1:47102/solr/collection1/&version=2&wt=javabin} status=0 QTime=1 
[junit4:junit4]   2> 11795 T461 C30 P47102 UPDATE [collection1] webapp=/solr path=/update params={version=2&wt=javabin} {add=[111]} 0 3
[junit4:junit4]   2> 11804 T456 oascc.ZkStateReader.updateClusterState Updating cloud state from ZooKeeper... 
[junit4:junit4]   2> 11807 T493 oascc.ZkStateReader$2.process A cluster state change has occurred - updating...
[junit4:junit4]   2> 11807 T469 oascc.ZkStateReader$2.process A cluster state change has occurred - updating...
[junit4:junit4]   2> 11807 T481 oascc.ZkStateReader$2.process A cluster state change has occurred - updating...
[junit4:junit4]   2> 11807 T455 oascc.ZkStateReader$2.process A cluster state change has occurred - updating...
[junit4:junit4]   2> 11816 T447 C29 P57407 UPDATE [collection1] webapp=/solr path=/update params={version=2&wt=javabin} {add=[112 (1412113835000594432)]} 0 19
[junit4:junit4]   2>  C31_STATE=coll:collection1 core:collection1 props:{state=active, base_url=http://127.0.0.1:44469/solr, node_name=127.0.0.1:44469_solr, leader=true, roles=null, shard=shard5, collection=collection1, core=collection1}
[junit4:junit4]   2> 11821 T485 C31 P44469 REQ [collection1] webapp=/solr path=/update params={update.distrib=TOLEADER&distrib.from=http://127.0.0.1:36393/solr/collection1/&version=2&wt=javabin} status=0 QTime=1 
[junit4:junit4]   2> 11822 T474 C32 P36393 UPDATE [collection1] webapp=/solr path=/update params={version=2&wt=javabin} {add=[112]} 0 4
[junit4:junit4]   2> 11825 T447 C29 P57407 UPDATE [collection1] webapp=/solr path=/update params={version=2&wt=javabin} {add=[113 (1412113835027857408)]} 0 1
[junit4:junit4]   2> 11830 T473 C32 P36393 REQ [collection1] webapp=/solr path=/update params={update.distrib=TOLEADER&distrib.from=http://127.0.0.1:44469/solr/collection1/&version=2&wt=javabin} status=0 QTime=1 
[junit4:junit4]   2> 11830 T486 C31 P44469 UPDATE [collection1] webapp=/solr path=/update params={version=2&wt=javabin} {add=[113]} 0 3
[junit4:junit4]   2> 11834 T447 C29 P57407 UPDATE [collection1] webapp=/solr path=/update params={version=2&wt=javabin} {add=[114 (1412113835037294592)]} 0 1
[junit4:junit4]   2> 11839 T473 C32 P36393 REQ [collection1] webapp=/solr path=/update params={update.distrib=TOLEADER&distrib.from=http://127.0.0.1:47102/solr/collection1/&version=2&wt=javabin} status=0 QTime=1 
[junit4:junit4]   2> 11839 T461 C30 P47102 UPDATE [collection1] webapp=/solr path=/update params={version=2&wt=javabin} {add=[114]} 0 3
[junit4:junit4]   2> 11842 T447 C29 P57407 UPDATE [collection1] webapp=/solr path=/update params={version=2&wt=javabin} {add=[115 (1412113835046731776)]} 0 1
[junit4:junit4]   2> 11846 T474 C32 P36393 UPDATE [collection1] webapp=/solr path=/update params={version=2&wt=javabin} {add=[115 (1412113835049877504)]} 0 2
[junit4:junit4]   2> 11849 T447 C29 P57407 UPDATE [collection1] webapp=/solr path=/update params={version=2&wt=javabin} {add=[116 (1412113835053023232)]} 0 1
[junit4:junit4]   2> 11852 T486 C31 P44469 UPDATE [collection1] webapp=/solr path=/update params={version=2&wt=javabin} {add=[116 (1412113835056168960)]} 0 1
[junit4:junit4]   2> 11855 T447 C29 P57407 UPDATE [collection1] webapp=/solr path=/update params={version=2&wt=javabin} {add=[117 (1412113835059314688)]} 0 1
[junit4:junit4]   2> 11860 T473 C32 P36393 REQ [collection1] webapp=/solr path=/update params={update.distrib=TOLEADER&distrib.from=http://127.0.0.1:47102/solr/collection1/&version=2&wt=javabin} status=0 QTime=1 
[junit4:junit4]   2> 11860 T461 C30 P47102 UPDATE [collection1] webapp=/solr path=/update params={version=2&wt=javabin} {add=[117]} 0 3
[junit4:junit4]   2> 11863 T447 C29 P57407 UPDATE [collection1] webapp=/solr path=/update params={version=2&wt=javabin} {add=[118 (1412113835067703296)]} 0 1
[junit4:junit4]   2> 11867 T462 C30 P47102 REQ [collection1] webapp=/solr path=/update params={update.distrib=TOLEADER&distrib.from=http://127.0.0.1:36393/solr/collection1/&version=2&wt=javabin} status=0 QTime=0 
[junit4:junit4]   2> 11868 T474 C32 P36393 UPDATE [collection1] webapp=/solr path=/update params={version=2&wt=javabin} {add=[118]} 0 3
[junit4:junit4]   2> 11871 T447 C29 P57407 UPDATE [collection1] webapp=/solr path=/update params={version=2&wt=javabin} {add=[119 (1412113835076091904)]} 0 1
[junit4:junit4]   2> 11875 T473 C32 P36393 REQ [collection1] webapp=/solr path=/update params={update.distrib=TOLEADER&distrib.from=http://127.0.0.1:44469/solr/collection1/&version=2&wt=javabin} status=0 QTime=0 
[junit4:junit4]   2> 11876 T486 C31 P44469 UPDATE [collection1] webapp=/solr path=/update params={version=2&wt=javabin} {add=[119]} 0 3
[junit4:junit4]   2> 11879 T447 C29 P57407 UPDATE [collection1] webapp=/solr path=/update params={version=2&wt=javabin} {add=[120 (1412113835084480512)]} 0 1
[junit4:junit4]   2> 11884 T473 C32 P36393 REQ [collection1] webapp=/solr path=/update params={update.distrib=TOLEADER&distrib.from=http://127.0.0.1:47102/solr/collection1/&version=2&wt=javabin} status=0 QTime=2 
[junit4:junit4]   2> 11884 T461 C30 P47102 UPDATE [collection1] webapp=/solr path=/update params={version=2&wt=javabin} {add=[120]} 0 3
[junit4:junit4]   2> 11888 T447 C29 P57407 UPDATE [collection1] webapp=/solr path=/update params={version=2&wt=javabin} {add=[121 (1412113835093917696)]} 0 1
[junit4:junit4]   2> 11892 T485 C31 P44469 REQ [collection1] webapp=/solr path=/update params={update.distrib=TOLEADER&distrib.from=http://127.0.0.1:36393/solr/collection1/&version=2&wt=javabin} status=0 QTime=1 
[junit4:junit4]   2> 11893 T474 C32 P36393 UPDATE [collection1] webapp=/solr path=/update params={version=2&wt=javabin} {add=[121]} 0 3
[junit4:junit4]   2> 11908 T447 C29 P57407 UPDATE [collection1] webapp=/solr path=/update params={version=2&wt=javabin} {add=[122 (1412113835102306304)]} 0 13
[junit4:junit4]   2> 11934 T473 C32 P36393 REQ [collection1] webapp=/solr path=/update params={update.distrib=TOLEADER&distrib.from=http://127.0.0.1:44469/solr/collection1/&version=2&wt=javabin} status=0 QTime=22 
[junit4:junit4]   2> 11935 T486 C31 P44469 UPDATE [collection1] webapp=/solr path=/update params={version=2&wt=javabin} {add=[122]} 0 24
[junit4:junit4]   2> 11939 T447 C29 P57407 UPDATE [collection1] webapp=/solr path=/update params={version=2&wt=javabin} {add=[123 (1412113835147395072)]} 0 2
[junit4:junit4]   2> 11942 T461 C30 P47102 UPDATE [collection1] webapp=/solr path=/update params={version=2&wt=javabin} {add=[123 (1412113835150540800)]} 0 1
[junit4:junit4]   2> 11946 T447 C29 P57407 UPDATE [collection1] webapp=/solr path=/update params={version=2&wt=javabin} {add=[124 (1412113835154735104)]} 0 1
[junit4:junit4]   2> 11950 T462 C30 P47102 REQ [collection1] webapp=/solr path=/update params={update.distrib=TOLEADER&distrib.from=http://127.0.0.1:36393/solr/collection1/&version=2&wt=javabin} status=0 QTime=1 
[junit4:junit4]   2> 11951 T474 C32 P36393 UPDATE [collection1] webapp=/solr path=/update params={version=2&wt=javabin} {add=[124]} 0 4
[junit4:junit4]   2> 11954 T447 C29 P57407 UPDATE [collection1] webapp=/solr path=/update params={version=2&wt=javabin} {add=[125 (1412113835163123712)]} 0 1
[junit4:junit4]   2> 11960 T473 C32 P36393 REQ [collection1] webapp=/solr path=/update params={update.distrib=TOLEADER&distrib.from=http://127.0.0.1:44469/solr/collection1/&version=2&wt=javabin} status=0 QTime=2 
[junit4:junit4]   2> 11961 T486 C31 P44469 UPDATE [collection1] webapp=/solr path=/update params={version=2&wt=javabin} {add=[125]} 0 5
[junit4:junit4]   2> 11964 T447 C29 P57407 UPDATE [collection1] webapp=/solr path=/update params={version=2&wt=javabin} {add=[126 (1412113835173609472)]} 0 1
[junit4:junit4]   2> 11968 T485 C31 P44469 REQ [collection1] webapp=/solr path=/update params={update.distrib=TOLEADER&distrib.from=http://127.0.0.1:47102/solr/collection1/&version=2&wt=javabin} status=0 QTime=0 
[junit4:junit4]   2> 11969 T461 C30 P47102 UPDATE [collection1] webapp=/solr path=/update params={version=2&wt=javabin} {add=[126]} 0 3
[junit4:junit4]   2> 11972 T447 C29 P57407 UPDATE [collection1] webapp=/solr path=/update params={version=2&wt=javabin} {add=[127 (1412113835183046656)]} 0 1
[junit4:junit4]   2> 11991 T485 C31 P44469 REQ [collection1] webapp=/solr path=/update params={update.distrib=TOLEADER&distrib.from=http://127.0.0.1:36393/solr/collection1/&version=2&wt=javabin} status=0 QTime=15 
[junit4:junit4]   2> 11992 T474 C32 P36393 UPDATE [collection1] webapp=/solr path=/update params={version=2&wt=javabin} {add=[127]} 0 18
[junit4:junit4]   2> 11995 T447 C29 P57407 UPDATE [collection1] webapp=/solr path=/update params={version=2&wt=javabin} {add=[128 (1412113835206115328)]} 0 1
[junit4:junit4]   2> 11998 T486 C31 P44469 UPDATE [collection1] webapp=/solr path=/update params={version=2&wt=javabin} {add=[128 (1412113835209261056)]} 0 1
[junit4:junit4]   2> 12001 T447 C29 P57407 UPDATE [collection1] webapp=/solr path=/update params={version=2&wt=javabin} {add=[129 (1412113835212406784)]} 0 1
[junit4:junit4]   2> 12006 T473 C32 P36393 REQ [collection1] webapp=/solr path=/update params={update.distrib=TOLEADER&distrib.from=http://127.0.0.1:47102/solr/collection1/&version=2&wt=javabin} status=0 QTime=1 
[junit4:junit4]   2> 12007 T461 C30 P47102 UPDATE [collection1] webapp=/solr path=/update params={version=2&wt=javabin} {add=[129]} 0 4
[junit4:junit4]   2> 12010 T447 C29 P57407 UPDATE [collection1] webapp=/solr path=/update params={version=2&wt=javabin} {add=[130 (1412113835221843968)]} 0 1
[junit4:junit4]   2> 12013 T474 C32 P36393 UPDATE [collection1] webapp=/solr path=/update params={version=2&wt=javabin} {add=[130 (1412113835224989696)]} 0 1
[junit4:junit4]   2> 12016 T447 C29 P57407 UPDATE [collection1] webapp=/solr path=/update params={version=2&wt=javabin} {add=[131 (1412113835228135424)]} 0 1
[junit4:junit4]   2> 12019 T486 C31 P44469 UPDATE [collection1] webapp=/solr path=/update params={version=2&wt=javabin} {add=[131 (1412113835231281152)]} 0 1
[junit4:junit4]   2> 12035 T447 C29 P57407 UPDATE [collection1] webapp=/solr path=/update params={version=2&wt=javabin} {add=[132 (1412113835235475456)]} 0 13
[junit4:junit4]   2> 12038 T461 C30 P47102 UPDATE [collection1] webapp=/solr path=/update params={version=2&wt=javabin} {add=[132 (1412113835251204096)]} 0 1
[junit4:junit4]   2> 12042 T447 C29 P57407 UPDATE [collection1] webapp=/solr path=/update params={version=2&wt=javabin} {add=[133 (1412113835255398400)]} 0 1
[junit4:junit4]   2> 12045 T474 C32 P36393 UPDATE [collection1] webapp=/solr path=/update params={version=2&wt=javabin} {add=[133 (1412113835259592704)]} 0 1
[junit4:junit4]   2> 12049 T447 C29 P57407 UPDATE [collection1] webapp=/solr path=/update params={version=2&wt=javabin} {add=[134 (1412113835262738432)]} 0 0
[junit4:junit4]   2> 12053 T473 C32 P36393 REQ [collection1] webapp=/solr path=/update params={update.distrib=TOLEADER&distrib.from=http://127.0.0.1:44469/solr/collection1/&version=2&wt=javabin} status=0 QTime=1 
[junit4:junit4]   2> 12054 T486 C31 P44469 UPDATE [collection1] webapp=/solr path=/update params={version=2&wt=javabin} {add=[134]} 0 3
[junit4:junit4]   2> 12057 T447 C29 P57407 UPDATE [collection1] webapp=/solr path=/update params={version=2&wt=javabin} {add=[135 (1412113835272175616)]} 0 0
[junit4:junit4]   2> 12061 T461 C30 P47102 UPDATE [collection1] webapp=/solr path=/update params={version=2&wt=javabin} {add=[135 (1412113835275321344)]} 0 2
[junit4:junit4]   2> 12064 T447 C29 P57407 UPDATE [collection1] webapp=/solr path=/update params={version=2&wt=javabin} {add=[136 (1412113835278467072)]} 0 1
[junit4:junit4]   2> 12068 T485 C31 P44469 REQ [collection1] webapp=/solr path=/update params={update.distrib=TOLEADER&distrib.from=http://127.0.0.1:36393/solr/collection1/&version=2&wt=javabin} status=0 QTime=0 
[junit4:junit4]   2> 12069 T474 C32 P36393 UPDATE [collection1] webapp=/solr path=/update params={version=2&wt=javabin} {add=[136]} 0 3
[junit4:junit4]   2> 12072 T447 C29 P57407 UPDATE [collection1] webapp=/solr path=/update params={version=2&wt=javabin} {add=[137 (1412113835286855680)]} 0 1
[junit4:junit4]   2> 12076 T486 C31 P44469 UPDATE [collection1] webapp=/solr path=/update params={version=2&wt=javabin} {add=[137 (1412113835291049984)]} 0 1
[junit4:junit4]   2> 12079 T447 C29 P57407 UPDATE [collection1] webapp=/solr path=/update params={version=2&wt=javabin} {add=[138 (1412113835295244288)]} 0 1
[junit4:junit4]   2> 12083 T461 C30 P47102 UPDATE [collection1] webapp=/solr path=/update params={version=2&wt=javabin} {add=[138 (1412113835298390016)]} 0 1
[junit4:junit4]   2> 12093 T447 C29 P57407 UPDATE [collection1] webapp=/solr path=/update params={version=2&wt=javabin} {add=[139 (1412113835308875776)]} 0 1
[junit4:junit4]   2> 12098 T485 C31 P44469 REQ [collection1] webapp=/solr path=/update params={update.distrib=TOLEADER&distrib.from=http://127.0.0.1:36393/solr/collection1/&version=2&wt=javabin} status=0 QTime=1 
[junit4:junit4]   2> 12099 T474 C32 P36393 UPDATE [collection1] webapp=/solr path=/update params={version=2&wt=javabin} {add=[139]} 0 4
[junit4:junit4]   2> 12102 T447 C29 P57407 UPDATE [collection1] webapp=/solr path=/update params={version=2&wt=javabin} {add=[140 (1412113835318312960)]} 0 1
[junit4:junit4]   2> 12107 T473 C32 P36393 REQ [collection1] webapp=/solr path=/update params={update.distrib=TOLEADER&distrib.from=http://127.0.0.1:44469/solr/collection1/&version=2&wt=javabin} status=0 QTime=2 
[junit4:junit4]   2> 12107 T486 C31 P44469 UPDATE [collection1] webapp=/solr path=/update params={version=2&wt=javabin} {add=[140]} 0 3
[junit4:junit4]   2> 12110 T447 C29 P57407 UPDATE [collection1] webapp=/solr path=/update params={version=2&wt=javabin} {add=[141 (1412113835327750144)]} 0 1
[junit4:junit4]   2> 12115 T473 C32 P36393 REQ [collection1] webapp=/solr path=/update params={update.distrib=TOLEADER&distrib.from=http://127.0.0.1:47102/solr/collection1/&version=2&wt=javabin} status=0 QTime=1 
[junit4:junit4]   2> 12116 T461 C30 P47102 UPDATE [collection1] webapp=/solr path=/update params={version=2&wt=javabin} {add=[141]} 0 4
[junit4:junit4]   2> 12132 T447 C29 P57407 UPDATE [collection1] webapp=/solr path=/update params={version=2&wt=javabin} {add=[142 (1412113835336138752)]} 0 14
[junit4:junit4]   2> 12138 T485 C31 P44469 REQ [collection1] webapp=/solr path=/update params={update.distrib=TOLEADER&distrib.from=http://127.0.0.1:36393/solr/collection1/&version=2&wt=javabin} status=0 QTime=1 
[junit4:junit4]   2> 12139 T474 C32 P36393 UPDATE [collection1] webapp=/solr path=/update params={version=2&wt=javabin} {add=[142]} 0 4
[junit4:junit4]   2> 12143 T447 C29 P57407 UPDATE [collection1] webapp=/solr path=/update params={version=2&wt=javabin} {add=[143 (1412113835360256000)]} 0 2
[junit4:junit4]   2> 12148 T473 C32 P36393 REQ [collection1] webapp=/solr path=/update params={update.distrib=TOLEADER&distrib.from=http://127.0.0.1:44469/solr/collection1/&version=2&wt=javabin} status=0 QTime=1 
[junit4:junit4]   2> 12149 T486 C31 P44469 UPDATE [collection1] webapp=/solr path=/update params={version=2&wt=javabin} {add=[143]} 0 4
[junit4:junit4]   2> 12153 T447 C29 P57407 UPDATE [collection1] webapp=/solr path=/update params={version=2&wt=javabin} {add=[144 (1412113835371790336)]} 0 1
[junit4:junit4]   2> 12158 T473 C32 P36393 REQ [collection1] webapp=/solr path=/update params={update.distrib=TOLEADER&distrib.from=http://127.0.0.1:47102/solr/collection1/&version=2&wt=javabin} status=0 QTime=1 
[junit4:junit4]   2> 12159 T461 C30 P47102 UPDATE [collection1] webapp=/solr path=/update params={version=2&wt=javabin} {add=[144]} 0 4
[junit4:junit4]   2> 12163 T447 C29 P57407 UPDATE [collection1] webapp=/solr path=/update params={version=2&wt=javabin} {add=[145 (1412113835382276096)]} 0 1
[junit4:junit4]   2> 12167 T485 C31 P44469 REQ [collection1] webapp=/solr path=/update params={update.distrib=TOLEADER&distrib.from=http://127.0.0.1:36393/solr/collection1/&version=2&wt=javabin} status=0 QTime=1 
[junit4:junit4]   2> 12168 T474 C32 P36393 UPDATE [collection1] webapp=/solr path=/update params={version=2&wt=javabin} {add=[145]} 0 3
[junit4:junit4]   2> 12171 T447 C29 P57407 UPDATE [collection1] webapp=/solr path=/update params={version=2&wt=javabin} {add=[146 (1412113835390664704)]} 0 1
[junit4:junit4]   2> 12192 T473 C32 P36393 REQ [collection1] webapp=/solr path=/update params={update.distrib=TOLEADER&distrib.from=http://127.0.0.1:44469/solr/collection1/&version=2&wt=javabin} status=0 QTime=17 
[junit4:junit4]   2> 12193 T486 C31 P44469 UPDATE [collection1] webapp=/solr path=/update params={version=2&wt=javabin} {add=[146]} 0 20
[junit4:junit4]   2> 12197 T447 C29 P57407 UPDATE [collection1] webapp=/solr path=/update params={version=2&wt=javabin} {add=[147 (1412113835417927680)]} 0 1
[junit4:junit4]   2> 12203 T485 C31 P44469 REQ [collection1] webapp=/solr path=/update params={update.distrib=TOLEADER&distrib.from=http://127.0.0.1:47102/solr/collection1/&version=2&wt=javabin} status=0 QTime=1 
[junit4:junit4]   2> 12204 T461 C30 P47102 UPDATE [collection1] webapp=/solr path=/update params={version=2&wt=javabin} {add=[147]} 0 4
[junit4:junit4]   2> 12208 T447 C29 P57407 UPDATE [collection1] webapp=/solr path=/update params={version=2&wt=javabin} {add=[148 (1412113835429462016)]} 0 1
[junit4:junit4]   2> 12214 T462 C30 P47102 REQ [collection1] webapp=/solr path=/update params={update.distrib=TOLEADER&distrib.from=http://127.0.0.1:36393/solr/collection1/&version=2&wt=javabin} status=0 QTime=1 
[junit4:junit4]   2> 12215 T474 C32 P36393 UPDATE [collection1] webapp=/solr path=/update params={version=2&wt=javabin} {add=[148]} 0 4
[junit4:junit4]   2> 12219 T447 C29 P57407 UPDATE [collection1] webapp=/solr path=/update params={version=2&wt=javabin} {add=[149 (1412113835440996352)]} 0 1
[junit4:junit4]   2> 12223 T486 C31 P44469 UPDATE [collection1] webapp=/solr path=/update params={version=2&wt=javabin} {add=[149 (1412113835445190656)]} 0 1
[junit4:junit4]   2> 12226 T447 C29 P57407 oasu.DirectUpdateHandler2.commit start commit{flags=0,_version_=0,optimize=false,openSearcher=true,waitSearcher=true,expungeDeletes=false,softCommit=false}
[junit4:junit4]   2> 12381 T447 C29 P57407 oasc.SolrDeletionPolicy.onCommit SolrDeletionPolicy.onCommit: commits:num=2
[junit4:junit4]   2> 		commit{dir=NRTCachingDirectory(org.apache.lucene.store.MMapDirectory@/mnt/ssd/jenkins/workspace/Lucene-Solr-4.x-Linux/solr/build/solr-core/test-files/control1/collection1/data/index lockFactory=org.apache.lucene.store.NativeFSLockFactory@b09fcbe8; maxCacheMB=48.0 maxMergeSizeMB=4.0),segFN=segments_1,generation=1,filenames=[segments_1]
[junit4:junit4]   2> 		commit{dir=NRTCachingDirectory(org.apache.lucene.store.MMapDirectory@/mnt/ssd/jenkins/workspace/Lucene-Solr-4.x-Linux/solr/build/solr-core/test-files/control1/collection1/data/index lockFactory=org.apache.lucene.store.NativeFSLockFactory@b09fcbe8; maxCacheMB=48.0 maxMergeSizeMB=4.0),segFN=segments_2,generation=2,filenames=[_0_TestBloomFilteredLucene40Postings_0.tim, _1_TestBloomFilteredLucene40Postings_0.tim, _2_TestBloomFilteredLucene40Postings_0.tim, _0_TestBloomFilteredLucene40Postings_0.tip, _3_TestBloomFilteredLucene40Postings_0.tim, _1_TestBloomFilteredLucene40Postings_0.tip, _4_TestBloomFilteredLucene40Postings_0.tim, _2_TestBloomFilteredLucene40Postings_0.tip, _5_TestBloomFilteredLucene40Postings_0.tim, _6_TestBloomFilteredLucene40Postings_0.tim, _3_TestBloomFilteredLucene40Postings_0.tip, _4_TestBloomFilteredLucene40Postings_0.tip, _4_Memory_0.ram, _5_TestBloomFilteredLucene40Postings_0.tip, _6_TestBloomFilteredLucene40Postings_0.tip, _5_MockRandom_0.skp, _1.si, _0_Lucene40WithOrds_0.tib, _0_MockRandom_0.prx, _1_MockRandom_0.tim, _1_MockRandom_0.tip, _0_Lucene40WithOrds_0.tii, _1_Lucene40WithOrds_0.prx, _5_MockRandom_0.frq, _0_TestBloomFilteredLucene40Postings_0.prx, _1_TestBloomFilteredLucene40Postings_0.prx, _2_TestBloomFilteredLucene40Postings_0.prx, _3_TestBloomFilteredLucene40Postings_0.prx, _4_TestBloomFilteredLucene40Postings_0.prx, _5_TestBloomFilteredLucene40Postings_0.prx, _6_TestBloomFilteredLucene40Postings_0.prx, _1_Memory_0.ram, _4.si, _6_MockRandom_0.skp, _5_MockRandom_0.doc, _1_MockRandom_0.prx, _0_MockRandom_0.sd, _1_MockRandom_0.sd, _2_MockRandom_0.tim, _2_MockRandom_0.sd, _3_MockRandom_0.sd, _2_MockRandom_0.tip, _4_MockRandom_0.sd, _5_MockRandom_0.sd, _6_MockRandom_0.sd, _1.fdt, _3.fdt, _6_MockRandom_0.frq, _0_Lucene40WithOrds_0.prx, _5.fdt, _1.fdx, _3.fdx, _5.fdx, _6_Memory_0.ram, _5_MockRandom_0.pos, _6_MockRandom_0.doc, _2_MockRandom_0.prx, segments_2, _3_MockRandom_0.tim, _3_MockRandom_0.tip, _1.fnm, _3.fnm, _6_MockRandom_0.pos, _5.fnm, _3_Memory_0.ram, _2.si, _3_MockRandom_0.prx, _4_MockRandom_0.tim, _4_MockRandom_0.tip, _5_MockRandom_0.pyl, _0_MockRandom_0.frq, _1_Lucene40WithOrds_0.frq, _5.si, _0_nrm.cfe, _1_nrm.cfe, _0_Memory_0.ram, _4_MockRandom_0.prx, _5_MockRandom_0.tim, _2_nrm.cfe, _0_TestBloomFilteredLucene40Postings_0.frq, _1_TestBloomFilteredLucene40Postings_0.frq, _3_nrm.cfe, _2_TestBloomFilteredLucene40Postings_0.frq, _4_nrm.cfe, _5_MockRandom_0.tip, _5_nrm.cfe, _3_TestBloomFilteredLucene40Postings_0.frq, _6_nrm.cfe, _4_TestBloomFilteredLucene40Postings_0.frq, _5_TestBloomFilteredLucene40Postings_0.frq, _6_TestBloomFilteredLucene40Postings_0.frq, _6_MockRandom_0.pyl, _0_nrm.cfs, _1_nrm.cfs, _2_nrm.cfs, _3_nrm.cfs, _4_nrm.cfs, _5_nrm.cfs, _1_MockRandom_0.frq, _6_nrm.cfs, _6_MockRandom_0.tib, _5_Memory_0.ram, _6_MockRandom_0.tii, _0_Lucene40WithOrds_0.frq, _0.si, _0.fdt, _2.fdt, _0.fdx, _4.fdt, _6.fdt, _2.fdx, _2_MockRandom_0.frq, _4.fdx, _6.fdx, _2_Memory_0.ram, _0_TestBloomFilteredLucene40Postings_0.blm, _1_TestBloomFilteredLucene40Postings_0.blm, _3.si, _2_TestBloomFilteredLucene40Postings_0.blm, _3_TestBloomFilteredLucene40Postings_0.blm, _4_TestBloomFilteredLucene40Postings_0.blm, _5_TestBloomFilteredLucene40Postings_0.blm, _6_TestBloomFilteredLucene40Postings_0.blm, _3_MockRandom_0.frq, _0.fnm, _2.fnm, _0_MockRandom_0.tib, _4.fnm, _6.si, _6.fnm, _1_Lucene40WithOrds_0.tib, _1_Lucene40WithOrds_0.tii, _0_MockRandom_0.tiv, _4_MockRandom_0.frq]
[junit4:junit4]   2> 12382 T447 C29 P57407 oasc.SolrDeletionPolicy.updateCommits newest commit = 2
[junit4:junit4]   2> 12387 T447 C29 P57407 oass.SolrIndexSearcher.<init> Opening Searcher@e2ee265c main
[junit4:junit4]   2> 12388 T447 C29 P57407 oasu.DirectUpdateHandler2.commit end_commit_flush
[junit4:junit4]   2> 12389 T458 oasc.SolrCore.registerSearcher [collection1] Registered new searcher Searcher@e2ee265c main{StandardDirectoryReader(segments_2:15:nrt _0(4.0.0.2):C10 _1(4.0.0.2):C10 _2(4.0.0.2):C10 _3(4.0.0.2):C10 _4(4.0.0.2):C10 _5(4.0.0.2):C10 _6(4.0.0.2):C7)}
[junit4:junit4]   2> 12389 T447 C29 P57407 UPDATE [collection1] webapp=/solr path=/update params={version=2&softCommit=false&waitSearcher=true&wt=javabin&commit=true} {commit=} 0 164
[junit4:junit4]   2> 12392 T461 C30 P47102 oasu.DirectUpdateHandler2.commit start commit{flags=0,_version_=0,optimize=false,openSearcher=true,waitSearcher=true,expungeDeletes=false,softCommit=false}
[junit4:junit4]   2> 12441 T461 C30 P47102 oasc.SolrDeletionPolicy.onCommit SolrDeletionPolicy.onCommit: commits:num=2
[junit4:junit4]   2> 		commit{dir=NRTCachingDirectory(org.apache.lucene.store.MMapDirectory@/mnt/ssd/jenkins/workspace/Lucene-Solr-4.x-Linux/solr/build/solr-core/test-files/jetty2/collection1/data/index lockFactory=org.apache.lucene.store.NativeFSLockFactory@7820e5ce; maxCacheMB=48.0 maxMergeSizeMB=4.0),segFN=segments_1,generation=1,filenames=[segments_1]
[junit4:junit4]   2> 		commit{dir=NRTCachingDirectory(org.apache.lucene.store.MMapDirectory@/mnt/ssd/jenkins/workspace/Lucene-Solr-4.x-Linux/solr/build/solr-core/test-files/jetty2/collection1/data/index lockFactory=org.apache.lucene.store.NativeFSLockFactory@7820e5ce; maxCacheMB=48.0 maxMergeSizeMB=4.0),segFN=segments_2,generation=2,filenames=[_1_MockRandom_0.pyl, _0_MockRandom_0.frq, _0_TestBloomFilteredLucene40Postings_0.tim, _1_TestBloomFilteredLucene40Postings_0.tim, _0_TestBloomFilteredLucene40Postings_0.tip, _1_TestBloomFilteredLucene40Postings_0.tip, _1_MockRandom_0.tib, _0_TestBloomFilteredLucene40Postings_0.blm, _0_nrm.cfe, _1_TestBloomFilteredLucene40Postings_0.blm, _1_nrm.cfe, _0_Memory_0.ram, _1_MockRandom_0.tii, _1_MockRandom_0.pos, _0_TestBloomFilteredLucene40Postings_0.frq, _1.si, _1_TestBloomFilteredLucene40Postings_0.frq, segments_2, _0_Lucene40WithOrds_0.tib, _1_MockRandom_0.skp, _0_MockRandom_0.doc, _0_Lucene40WithOrds_0.tii, _0_nrm.cfs, _1_nrm.cfs, _0_MockRandom_0.pyl, _1_MockRandom_0.frq, _0_TestBloomFilteredLucene40Postings_0.prx, _1_TestBloomFilteredLucene40Postings_0.prx, _0.fnm, _1.fnm, _0_Lucene40WithOrds_0.frq, _1_Memory_0.ram, _0_MockRandom_0.pos, _0_MockRandom_0.sd, _0.si, _1_MockRandom_0.sd, _1_MockRandom_0.doc, _0_MockRandom_0.tim, _0_MockRandom_0.skp, _0_MockRandom_0.tip, _0.fdt, _1.fdt, _0.fdx, _0_Lucene40WithOrds_0.prx, _1.fdx]
[junit4:junit4]   2> 12442 T461 C30 P47102 oasc.SolrDeletionPolicy.updateCommits newest commit = 2
[junit4:junit4]   2> 12445 T461 C30 P47102 oass.SolrIndexSearcher.<init> Opening Searcher@e8379569 main
[junit4:junit4]   2> 12446 T461 C30 P47102 oasu.DirectUpdateHandler2.commit end_commit_flush
[junit4:junit4]   2> 12448 T470 oasc.SolrCore.registerSearcher [collection1] Registered new searcher Searcher@e8379569 main{StandardDirectoryReader(segments_2:5:nrt _0(4.0.0.2):C10 _1(4.0.0.2):C8)}
[junit4:junit4]   2> 12448 T461 C30 P47102 oasu.SolrCmdDistributor.distribCommit Distrib commit to:[StdNode: http://127.0.0.1:36393/solr/collection1/, StdNode: http://127.0.0.1:44469/solr/collection1/]
[junit4:junit4]   2> 12450 T485 C31 P44469 oasu.DirectUpdateHandler2.commit start commit{flags=0,_version_=0,optimize=false,openSearcher=true,waitSearcher=true,expungeDeletes=false,softCommit=false}
[junit4:junit4]   2> 12450 T473 C32 P36393 oasu.DirectUpdateHandler2.commit start commit{flags=0,_version_=0,optimize=false,openSearcher=true,waitSearcher=true,expungeDeletes=false,softCommit=false}
[junit4:junit4]   2> 12511 T485 C31 P44469 oasc.SolrDeletionPolicy.onCommit SolrDeletionPolicy.onCommit: commits:num=2
[junit4:junit4]   2> 		commit{dir=NRTCachingDirectory(org.apache.lucene.store.MMapDirectory@/mnt/ssd/jenkins/workspace/Lucene-Solr-4.x-Linux/solr/build/solr-core/test-files/jetty4/collection1/data/index lockFactory=org.apache.lucene.store.NativeFSLockFactory@ee19f507; maxCacheMB=48.0 maxMergeSizeMB=4.0),segFN=segments_1,generation=1,filenames=[segments_1]
[junit4:junit4]   2> 		commit{dir=NRTCachingDirectory(org.apache.lucene.store.MMapDirectory@/mnt/ssd/jenkins/workspace/Lucene-Solr-4.x-Linux/solr/build/solr-core/test-files/jetty4/collection1/data/index lockFactory=org.apache.lucene.store.NativeFSLockFactory@ee19f507; maxCacheMB=48.0 maxMergeSizeMB=4.0),segFN=segments_2,generation=2,filenames=[_1_MockRandom_0.pyl, _0_MockRandom_0.frq, _0_TestBloomFilteredLucene40Postings_0.tim, _1_TestBloomFilteredLucene40Postings_0.tim, _0_TestBloomFilteredLucene40Postings_0.tip, _1_TestBloomFilteredLucene40Postings_0.tip, _0_TestBloomFilteredLucene40Postings_0.blm, _0_nrm.cfe, _1_TestBloomFilteredLucene40Postings_0.blm, _1_nrm.cfe, _0_Memory_0.ram, _1_MockRandom_0.pos, _0_TestBloomFilteredLucene40Postings_0.frq, _1.si, _1_TestBloomFilteredLucene40Postings_0.frq, segments_2, _0_MockRandom_0.prx, _0_Lucene40WithOrds_0.tib, _1_MockRandom_0.tim, _1_MockRandom_0.skp, _1_MockRandom_0.tip, _0_Lucene40WithOrds_0.tii, _0_nrm.cfs, _1_nrm.cfs, _1_MockRandom_0.frq, _0_TestBloomFilteredLucene40Postings_0.prx, _1_TestBloomFilteredLucene40Postings_0.prx, _0.fnm, _1.fnm, _0_MockRandom_0.tib, _0_Lucene40WithOrds_0.frq, _1_Memory_0.ram, _0_MockRandom_0.tii, _0_MockRandom_0.sd, _0.si, _1_MockRandom_0.sd, _1_MockRandom_0.doc, _0.fdt, _1.fdt, _0_Lucene40WithOrds_0.prx, _0.fdx, _1.fdx]
[junit4:junit4]   2> 12512 T485 C31 P44469 oasc.SolrDeletionPolicy.updateCommits newest commit = 2
[junit4:junit4]   2> 12515 T485 C31 P44469 oass.SolrIndexSearcher.<init> Opening Searcher@993a58c0 main
[junit4:junit4]   2> 12516 T485 C31 P44469 oasu.DirectUpdateHandler2.commit end_commit_flush
[junit4:junit4]   2> 12517 T494 oasc.SolrCore.registerSearcher [collection1] Registered new searcher Searcher@993a58c0 main{StandardDirectoryReader(segments_2:5:nrt _0(4.0.0.2):C10 _1(4.0.0.2):C9)}
[junit4:junit4]   2> 12517 T485 C31 P44469 UPDATE [collection1] webapp=/solr path=/update params={softCommit=false&commit_end_point=true&commit=true&version=2&waitSearcher=true&wt=javabin} {commit=} 0 67
[junit4:junit4]   2> 12531 T473 C32 P36393 oasc.SolrDeletionPolicy.onCommit SolrDeletionPolicy.onCommit: commits:num=2
[junit4:junit4]   2> 		commit{dir=NRTCachingDirectory(org.apache.lucene.store.MMapDirectory@/mnt/ssd/jenkins/workspace/Lucene-Solr-4.x-Linux/solr/build/solr-core/test-files/jetty3/collection1/data/index lockFactory=org.apache.lucene.store.NativeFSLockFactory@51e83c5e; maxCacheMB=48.0 maxMergeSizeMB=4.0),segFN=segments_1,generation=1,filenames=[segments_1]
[junit4:junit4]   2> 		commit{dir=NRTCachingDirectory(org.apache.lucene.store.MMapDirectory@/mnt/ssd/jenkins/workspace/Lucene-Solr-4.x-Linux/solr/build/solr-core/test-files/jetty3/collection1/data/index lockFactory=org.apache.lucene.store.NativeFSLockFactory@51e83c5e; maxCacheMB=48.0 maxMergeSizeMB=4.0),segFN=segments_2,generation=2,filenames=[_1_MockRandom_0.pyl, _0_MockRandom_0.frq, _0_TestBloomFilteredLucene40Postings_0.tim, _1_TestBloomFilteredLucene40Postings_0.tim, _2_TestBloomFilteredLucene40Postings_0.tim, _0_TestBloomFilteredLucene40Postings_0.tip, _1_TestBloomFilteredLucene40Postings_0.tip, _2_TestBloomFilteredLucene40Postings_0.tip, _1_MockRandom_0.tib, _0_nrm.cfe, _0_Memory_0.ram, _1_nrm.cfe, _0_TestBloomFilteredLucene40Postings_0.frq, _2_nrm.cfe, _1_TestBloomFilteredLucene40Postings_0.frq, _1.si, _2_TestBloomFilteredLucene40Postings_0.frq, _0_Lucene40WithOrds_0.tib, _0_MockRandom_0.prx, _1_MockRandom_0.skp, _0_Lucene40WithOrds_0.tii, _0_nrm.cfs, _1_nrm.cfs, _1_MockRandom_0.tiv, _2_nrm.cfs, _0_TestBloomFilteredLucene40Postings_0.prx, _1_MockRandom_0.frq, _1_TestBloomFilteredLucene40Postings_0.prx, _2_TestBloomFilteredLucene40Postings_0.prx, _0_Lucene40WithOrds_0.frq, _1_Memory_0.ram, _0.si, _0_MockRandom_0.sd, _2_MockRandom_0.tim, _1_MockRandom_0.sd, _2_MockRandom_0.sd, _1_MockRandom_0.doc, _2_MockRandom_0.tip, _0.fdt, _1.fdt, _2.fdt, _0.fdx, _0_Lucene40WithOrds_0.prx, _1.fdx, _2.fdx, _2_MockRandom_0.frq, _2_Memory_0.ram, _0_TestBloomFilteredLucene40Postings_0.blm, _1_TestBloomFilteredLucene40Postings_0.blm, _1_MockRandom_0.pos, _2_TestBloomFilteredLucene40Postings_0.blm, _2_MockRandom_0.prx, segments_2, _0.fnm, _1.fnm, _2.fnm, _0_MockRandom_0.tib, _2.si, _0_MockRandom_0.tiv]
[junit4:junit4]   2> 12532 T473 C32 P36393 oasc.SolrDeletionPolicy.updateCommits newest commit = 2
[junit4:junit4]   2> 12534 T473 C32 P36393 oass.SolrIndexSearcher.<init> Opening Searcher@3a4532de main
[junit4:junit4]   2> 12535 T473 C32 P36393 oasu.DirectUpdateHandler2.commit end_commit_flush
[junit4:junit4]   2> 12537 T482 oasc.SolrCore.registerSearcher [collection1] Registered new searcher Searcher@3a4532de main{StandardDirectoryReader(segments_2:7:nrt _0(4.0.0.2):C10 _1(4.0.0.2):C10 _2(4.0.0.2):C10)}
[junit4:junit4]   2> 12537 T473 C32 P36393 UPDATE [collection1] webapp=/solr path=/update params={softCommit=false&commit_end_point=true&commit=true&version=2&waitSearcher=true&wt=javabin} {commit=} 0 87
[junit4:junit4]   2> 12538 T461 C30 P47102 UPDATE [collection1] webapp=/solr path=/update params={version=2&softCommit=false&waitSearcher=true&wt=javabin&commit=true} {commit=} 0 147
[junit4:junit4]   2> 12540 T474 C32 P36393 oasu.DirectUpdateHandler2.commit start commit{flags=0,_version_=0,optimize=false,openSearcher=true,waitSearcher=true,expungeDeletes=false,softCommit=false}
[junit4:junit4]   2> 12541 T474 C32 P36393 oass.SolrIndexSearcher.<init> Opening Searcher@f3bb08e main
[junit4:junit4]   2> 12541 T474 C32 P36393 oasu.DirectUpdateHandler2.commit end_commit_flush
[junit4:junit4]   2> 12543 T482 oasc.SolrCore.registerSearcher [collection1] Registered new searcher Searcher@f3bb08e main{StandardDirectoryReader(segments_2:7:nrt _0(4.0.0.2):C10 _1(4.0.0.2):C10 _2(4.0.0.2):C10)}
[junit4:junit4]   2> 12544 T474 C32 P36393 oasu.SolrCmdDistributor.distribCommit Distrib commit to:[StdNode: http://127.0.0.1:47102/solr/collection1/, StdNode: http://127.0.0.1:44469/solr/collection1/]
[junit4:junit4]   2> 12546 T485 C31 P44469 oasu.DirectUpdateHandler2.commit start commit{flags=0,_version_=0,optimize=false,openSearcher=true,waitSearcher=true,expungeDeletes=false,softCommit=false}
[junit4:junit4]   2> 12546 T462 C30 P47102 oasu.DirectUpdateHandler2.commit start commit{flags=0,_version_=0,optimize=false,openSearcher=true,waitSearcher=true,expungeDeletes=false,softCommit=false}
[junit4:junit4]   2> 12546 T485 C31 P44469 oass.SolrIndexSearcher.<init> Opening Searcher@8488187c main
[junit4:junit4]   2> 12547 T462 C30 P47102 oass.SolrIndexSearcher.<init> Opening Searcher@c50748e9 main
[junit4:junit4]   2> 12547 T485 C31 P44469 oasu.DirectUpdateHandler2.commit end_commit_flush
[junit4:junit4]   2> 12548 T462 C30 P47102 oasu.DirectUpdateHandler2.commit end_commit_flush
[junit4:junit4]   2> 12549 T494 oasc.SolrCore.registerSearcher [collection1] Registered new searcher Searcher@8488187c main{StandardDirectoryReader(segments_2:5:nrt _0(4.0.0.2):C10 _1(4.0.0.2):C9)}
[junit4:junit4]   2> 12549 T485 C31 P44469 UPDATE [collection1] webapp=/solr path=/update params={softCommit=false&commit_end_point=true&commit=true&version=2&waitSearcher=true&wt=javabin} {commit=} 0 3
[junit4:junit4]   2> 12549 T470 oasc.SolrCore.registerSearcher [collection1] Registered new searcher Searcher@c50748e9 main{StandardDirectoryReader(segments_2:5:nrt _0(4.0.0.2):C10 _1(4.0.0.2):C8)}
[junit4:junit4]   2> 12550 T462 C30 P47102 UPDATE [collection1] webapp=/solr path=/update params={softCommit=false&commit_end_point=true&commit=true&version=2&waitSearcher=true&wt=javabin} {commit=} 0 4
[junit4:junit4]   2> 12551 T474 C32 P36393 UPDATE [collection1] webapp=/solr path=/update params={version=2&softCommit=false&waitSearcher=true&wt=javabin&commit=true} {commit=} 0 11
[junit4:junit4]   2> 12553 T486 C31 P44469 oasu.DirectUpdateHandler2.commit start commit{flags=0,_version_=0,optimize=false,openSearcher=true,waitSearcher=true,expungeDeletes=false,softCommit=false}
[junit4:junit4]   2> 12554 T486 C31 P44469 oass.SolrIndexSearcher.<init> Opening Searcher@7cf7838e main
[junit4:junit4]   2> 12554 T486 C31 P44469 oasu.DirectUpdateHandler2.commit end_commit_flush
[junit4:junit4]   2> 12555 T494 oasc.SolrCore.registerSearcher [collection1] Registered new searcher Searcher@7cf7838e main{StandardDirectoryReader(segments_2:5:nrt _0(4.0.0.2):C10 _1(4.0.0.2):C9)}
[junit4:junit4]   2> 12556 T486 C31 P44469 oasu.SolrCmdDistributor.distribCommit Distrib commit to:[StdNode: http://127.0.0.1:47102/solr/collection1/, StdNode: http://127.0.0.1:36393/solr/collection1/]
[junit4:junit4]   2> 12558 T473 C32 P36393 oasu.DirectUpdateHandler2.commit start commit{flags=0,_version_=0,optimize=false,openSearcher=true,waitSearcher=true,expungeDeletes=false,softCommit=false}
[junit4:junit4]   2> 12558 T462 C30 P47102 oasu.DirectUpdateHandler2.commit start commit{flags=0,_version_=0,optimize=false,openSearcher=true,waitSearcher=true,expungeDeletes=false,softCommit=false}
[junit4:junit4]   2> 12559 T473 C32 P36393 oass.SolrIndexSearcher.<init> Opening Searcher@27200b26 main
[junit4:junit4]   2> 12559 T462 C30 P47102 oass.SolrIndexSearcher.<init> Opening Searcher@dcccbec1 main
[junit4:junit4]   2> 12559 T473 C32 P36393 oasu.DirectUpdateHandler2.commit end_commit_flush
[junit4:junit4]   2> 12560 T462 C30 P47102 oasu.DirectUpdateHandler2.commit end_commit_flush
[junit4:junit4]   2> 12561 T482 oasc.SolrCore.registerSearcher [collection1] Registered new searcher Searcher@27200b26 main{StandardDirectoryReader(segments_2:7:nrt _0(4.0.0.2):C10 _1(4.0.0.2):C10 _2(4.0.0.2):C10)}
[junit4:junit4]   2> 12561 T473 C32 P36393 UPDATE [collection1] webapp=/solr path=/update params={softCommit=false&commit_end_point=true&commit=true&version=2&waitSearcher=true&wt=javabin} {commit=} 0 3
[junit4:junit4]   2> 12562 T470 oasc.SolrCore.registerSearcher [collection1] Registered new searcher Searcher@dcccbec1 main{StandardDirectoryReader(segments_2:5:nrt _0(4.0.0.2):C10 _1(4.0.0.2):C8)}
[junit4:junit4]   2> 12562 T462 C30 P47102 UPDATE [collection1] webapp=/solr path=/update params={softCommit=false&commit_end_point=true&commit=true&version=2&waitSearcher=true&wt=javabin} {commit=} 0 4
[junit4:junit4]   2> 12563 T486 C31 P44469 UPDATE [collection1] webapp=/solr path=/update params={version=2&softCommit=false&waitSearcher=true&wt=javabin&commit=true} {commit=} 0 10
[junit4:junit4]   2> 12568 T447 C29 P57407 REQ [collection1] webapp=/solr path=/select params={version=2&q=*:*&wt=javabin&distrib=false&sort=n_ti1+desc} hits=67 status=0 QTime=3 
[junit4:junit4]   2> 12569 T447 C29 P57407 oasr.BinaryResponseWriter$Resolver.getDoc WARNING Error reading a field from document : SolrDocument{id=15} java.lang.NullPointerException
[junit4:junit4]   2> 	at org.apache.solr.util.NumberUtils.SortableStr2int(NumberUtils.java:162)
[junit4:junit4]   2> 	at org.apache.solr.schema.SortableIntField.toObject(SortableIntField.java:96)
[junit4:junit4]   2> 	at org.apache.solr.schema.SortableIntField.toObject(SortableIntField.java:55)
[junit4:junit4]   2> 	at org.apache.solr.response.BinaryResponseWriter$Resolver.getValue(BinaryResponseWriter.java:218)
[junit4:junit4]   2> 	at org.apache.solr.response.BinaryResponseWriter$Resolver.getDoc(BinaryResponseWriter.java:181)
[junit4:junit4]   2> 	at org.apache.solr.response.BinaryResponseWriter$Resolver.writeResultsBody(BinaryResponseWriter.java:142)
[junit4:junit4]   2> 	at org.apache.solr.response.BinaryResponseWriter$Resolver.writeResults(BinaryResponseWriter.java:168)
[junit4:junit4]   2> 	at org.apache.solr.response.BinaryResponseWriter$Resolver.resolve(BinaryResponseWriter.java:81)
[junit4:junit4]   2> 	at org.apache.solr.common.util.JavaBinCodec.writeVal(JavaBinCodec.java:154)
[junit4:junit4]   2> 	at org.apache.solr.common.util.JavaBinCodec.writeNamedList(JavaBinCodec.java:144)
[junit4:junit4]   2> 	at org.apache.solr.common.util.JavaBinCodec.writeKnownType(JavaBinCodec.java:234)
[junit4:junit4]   2> 	at org.apache.solr.common.util.JavaBinCodec.writeVal(JavaBinCodec.java:149)
[junit4:junit4]   2> 	at org.apache.solr.common.util.JavaBinCodec.marshal(JavaBinCodec.java:92)
[junit4:junit4]   2> 	at org.apache.solr.response.BinaryResponseWriter.write(BinaryResponseWriter.java:49)
[junit4:junit4]   2> 	at org.apache.solr.servlet.SolrDispatchFilter.writeResponse(SolrDispatchFilter.java:403)
[junit4:junit4]   2> 	at org.apache.solr.servlet.SolrDispatchFilter.doFilter(SolrDispatchFilter.java:288)
[junit4:junit4]   2> 	at org.eclipse.jetty.servlet.ServletHandler$CachedChain.doFilter(ServletHandler.java:1337)
[junit4:junit4]   2> 	at org.eclipse.jetty.servlet.ServletHandler.doHandle(ServletHandler.java:484)
[junit4:junit4]   2> 	at org.eclipse.jetty.server.session.SessionHandler.doHandle(SessionHandler.java:231)
[junit4:junit4]   2> 	at org.eclipse.jetty.server.handler.ScopedHandler.handle(ScopedHandler.java:119)
[junit4:junit4]   2> 	at org.eclipse.jetty.server.handler.GzipHandler.handle(GzipHandler.java:267)
[junit4:junit4]   2> 	at org.eclipse.jetty.server.handler.ContextHandler.doHandle(ContextHandler.java:1067)
[junit4:junit4]   2> 	at org.eclipse.jetty.servlet.ServletHandler.doScope(ServletHandler.java:413)
[junit4:junit4]   2> 	at org.eclipse.jetty.server.session.SessionHandler.doScope(SessionHandler.java:192)
[junit4:junit4]   2> 	at org.eclipse.jetty.server.handler.ContextHandler.doScope(ContextHandler.java:999)
[junit4:junit4]   2> 	at org.eclipse.jetty.server.handler.ScopedHandler.handle(ScopedHandler.java:117)
[junit4:junit4]   2> 	at org.eclipse.jetty.server.handler.HandlerWrapper.handle(HandlerWrapper.java:111)
[junit4:junit4]   2> 	at org.eclipse.jetty.server.Server.handle(Server.java:351)
[junit4:junit4]   2> 	at org.eclipse.jetty.server.AbstractHttpConnection.handleRequest(AbstractHttpConnection.java:454)
[junit4:junit4]   2> 	at org.eclipse.jetty.server.BlockingHttpConnection.handleRequest(BlockingHttpConnection.java:47)
[junit4:junit4]   2> 	at org.eclipse.jetty.server.AbstractHttpConnection.headerComplete(AbstractHttpConnection.java:890)
[junit4:junit4]   2> 	at org.eclipse.jetty.server.AbstractHttpConnection$RequestHandler.headerComplete(AbstractHttpConnection.java:944)
[junit4:junit4]   2> 	at org.eclipse.jetty.http.HttpParser.parseNext(HttpParser.java:634)
[junit4:junit4]   2> 	at org.eclipse.jetty.http.HttpParser.parseAvailable(HttpParser.java:230)
[junit4:junit4]   2> 	at org.eclipse.jetty.server.BlockingHttpConnection.handle(BlockingHttpConnection.java:66)
[junit4:junit4]   2> 	at org.eclipse.jetty.server.bio.SocketConnector$ConnectorEndPoint.run(SocketConnector.java:254)
[junit4:junit4]   2> 	at org.eclipse.jetty.util.thread.QueuedThreadPool.runJob(QueuedThreadPool.java:599)
[junit4:junit4]   2> 	at org.eclipse.jetty.util.thread.QueuedThreadPool$3.run(QueuedThreadPool.java:534)
[junit4:junit4]   2> 	at java.lang.Thread.run(Thread.java:777)
[junit4:junit4]   2> 
[junit4:junit4]   2> 12569 T447 C29 P57407 oasr.BinaryResponseWriter$Resolver.getDoc WARNING Error reading a field from document : SolrDocument{id=1} java.lang.NullPointerException
[junit4:junit4]   2> 	at org.apache.solr.util.NumberUtils.SortableStr2int(NumberUtils.java:162)
[junit4:junit4]   2> 	at org.apache.solr.schema.SortableIntField.toObject(SortableIntField.java:96)
[junit4:junit4]   2> 	at org.apache.solr.schema.SortableIntField.toObject(SortableIntField.java:55)
[junit4:junit4]   2> 	at org.apache.solr.response.BinaryResponseWriter$Resolver.getValue(BinaryResponseWriter.java:218)
[junit4:junit4]   2> 	at org.apache.solr.response.BinaryResponseWriter$Resolver.getDoc(BinaryResponseWriter.java:181)
[junit4:junit4]   2> 	at org.apache.solr.response.BinaryResponseWriter$Resolver.writeResultsBody(BinaryResponseWriter.java:142)
[junit4:junit4]   2> 	at org.apache.solr.response.BinaryResponseWriter$Resolver.writeResults(BinaryResponseWriter.java:168)
[junit4:junit4]   2> 	at org.apache.solr.response.BinaryResponseWriter$Resolver.resolve(BinaryResponseWriter.java:81)
[junit4:junit4]   2> 	at org.apache.solr.common.util.JavaBinCodec.writeVal(JavaBinCodec.java:154)
[junit4:junit4]   2> 	at org.apache.solr.common.util.JavaBinCodec.writeNamedList(JavaBinCodec.java:144)
[junit4:junit4]   2> 	at org.apache.solr.common.util.JavaBinCodec.writeKnownType(JavaBinCodec.java:234)
[junit4:junit4]   2> 	at org.apache.solr.common.util.JavaBinCodec.writeVal(JavaBinCodec.java:149)
[junit4:junit4]   2> 	at org.apache.solr.common.util.JavaBinCodec.marshal(JavaBinCodec.java:92)
[junit4:junit4]   2> 	at org.apache.solr.response.BinaryResponseWriter.write(BinaryResponseWriter.java:49)
[junit4:junit4]   2> 	at org.apache.solr.servlet.SolrDispatchFilter.writeResponse(SolrDispatchFilter.java:403)
[junit4:junit4]   2> 	at org.apache.solr.servlet.SolrDispatchFilter.doFilter(SolrDispatchFilter.java:288)
[junit4:junit4]   2> 	at org.eclipse.jetty.servlet.ServletHandler$CachedChain.doFilter(ServletHandler.java:1337)
[junit4:junit4]   2> 	at org.eclipse.jetty.servlet.ServletHandler.doHandle(ServletHandler.java:484)
[junit4:junit4]   2> 	at org.eclipse.jetty.server.session.SessionHandler.doHandle(SessionHandler.java:231)
[junit4:junit4]   2> 	at org.eclipse.jetty.server.handler.ScopedHandler.handle(ScopedHandler.java:119)
[junit4:junit4]   2> 	at org.eclipse.jetty.server.handler.GzipHandler.handle(GzipHandler.java:267)
[junit4:junit4]   2> 	at org.eclipse.jetty.server.handler.ContextHandler.doHandle(ContextHandler.java:1067)
[junit4:junit4]   2> 	at org.eclipse.jetty.servlet.ServletHandler.doScope(ServletHandler.java:413)
[junit4:junit4]   2> 	at org.eclipse.jetty.server.session.SessionHandler.doScope(SessionHandler.java:192)
[junit4:junit4]   2> 	at org.eclipse.jetty.server.handler.ContextHandler.doScope(ContextHandler.java:999)
[junit4:junit4]   2> 	at org.eclipse.jetty.server.handler.ScopedHandler.handle(ScopedHandler.java:117)
[junit4:junit4]   2> 	at org.eclipse.jetty.server.handler.HandlerWrapper.handle(HandlerWrapper.java:111)
[junit4:junit4]   2> 	at org.eclipse.jetty.server.Server.handle(Server.java:351)
[junit4:junit4]   2> 	at org.eclipse.jetty.server.AbstractHttpConnection.handleRequest(AbstractHttpConnection.java:454)
[junit4:junit4]   2> 	at org.eclipse.jetty.server.BlockingHttpConnection.handleRequest(BlockingHttpConnection.java:47)
[junit4:junit4]   2> 	at org.eclipse.jetty.server.AbstractHttpConnection.headerComplete(AbstractHttpConnection.java:890)
[junit4:junit4]   2> 	at org.eclipse.jetty.server.AbstractHttpConnection$RequestHandler.headerComplete(AbstractHttpConnection.java:944)
[junit4:junit4]   2> 	at org.eclipse.jetty.http.HttpParser.parseNext(HttpParser.java:634)
[junit4:junit4]   2> 	at org.eclipse.jetty.http.HttpParser.parseAvailable(HttpParser.java:230)
[junit4:junit4]   2> 	at org.eclipse.jetty.server.BlockingHttpConnection.handle(BlockingHttpConnection.java:66)
[junit4:junit4]   2> 	at org.eclipse.jetty.server.bio.SocketConnector$ConnectorEndPoint.run(SocketConnector.java:254)
[junit4:junit4]   2> 	at org.eclipse.jetty.util.thread.QueuedThreadPool.runJob(QueuedThreadPool.java:599)
[junit4:junit4]   2> 	at org.eclipse.jetty.util.thread.QueuedThreadPool$3.run(QueuedThreadPool.java:534)
[junit4:junit4]   2> 	at java.lang.Thread.run(Thread.java:777)
[junit4:junit4]   2> 
[junit4:junit4]   2> 12570 T447 C29 P57407 oasr.BinaryResponseWriter$Resolver.getDoc WARNING Error reading a field from document : SolrDocument{id=1, range_facet_l=[1], range_facet_sl=[1]} java.lang.NullPointerException
[junit4:junit4]   2> 	at org.apache.solr.util.NumberUtils.SortableStr2int(NumberUtils.java:162)
[junit4:junit4]   2> 	at org.apache.solr.schema.SortableIntField.toObject(SortableIntField.java:96)
[junit4:junit4]   2> 	at org.apache.solr.schema.SortableIntField.toObject(SortableIntField.java:55)
[junit4:junit4]   2> 	at org.apache.solr.response.BinaryResponseWriter$Resolver.getValue(BinaryResponseWriter.java:218)
[junit4:junit4]   2> 	at org.apache.solr.response.BinaryResponseWriter$Resolver.getDoc(BinaryResponseWriter.java:181)
[junit4:junit4]   2> 	at org.apache.solr.response.BinaryResponseWriter$Resolver.writeResultsBody(BinaryResponseWriter.java:142)
[junit4:junit4]   2> 	at org.apache.solr.response.BinaryResponseWriter$Resolver.writeResults(BinaryResponseWriter.java:168)
[junit4:junit4]   2> 	at org.apache.solr.response.BinaryResponseWriter$Resolver.resolve(BinaryResponseWriter.java:81)
[junit4:junit4]   2> 	at org.apache.solr.common.util.JavaBinCodec.writeVal(JavaBinCodec.java:154)
[junit4:junit4]   2> 	at org.apache.solr.common.util.JavaBinCodec.writeNamedList(JavaBinCodec.java:144)
[junit4:junit4]   2> 	at org.apache.solr.common.util.JavaBinCodec.writeKnownType(JavaBinCodec.java:234)
[junit4:junit4]   2> 	at org.apache.solr.common.util.JavaBinCodec.writeVal(JavaBinCodec.java:149)
[junit4:junit4]   2> 	at org.apache.solr.common.util.JavaBinCodec.marshal(JavaBinCodec.java:92)
[junit4:junit4]   2> 	at org.apache.solr.response.BinaryResponseWriter.write(BinaryResponseWriter.java:49)
[junit4:junit4]   2> 	at org.apache.solr.servlet.SolrDispatchFilter.writeResponse(SolrDispatchFilter.java:403)
[junit4:junit4]   2> 	at org.apache.solr.servlet.SolrDispatchFilter.doFilter(SolrDispatchFilter.java:288)
[junit4:junit4]   2> 	at org.eclipse.jetty.servlet.ServletHandler$CachedChain.doFilter(ServletHandler.java:1337)
[junit4:junit4]   2> 	at org.eclipse.jetty.servlet.ServletHandler.doHandle(ServletHandler.java:484)
[junit4:junit4]   2> 	at org.eclipse.jetty.server.session.SessionHandler.doHandle(SessionHandler.java:231)
[junit4:junit4]   2> 	at org.eclipse.jetty.server.handler.ScopedHandler.handle(ScopedHandler.java:119)
[junit4:junit4]   2> 	at org.eclipse.jetty.server.handler.GzipHandler.handle(GzipHandler.java:267)
[junit4:junit4]   2> 	at org.eclipse.jetty.server.handler.ContextHandler.doHandle(ContextHandler.java:1067)
[junit4:junit4]   2> 	at org.eclipse.jetty.servlet.ServletHandler.doScope(ServletHandler.java:413)
[junit4:junit4]   2> 	at org.eclipse.jetty.server.session.SessionHandler.doScope(SessionHandler.java:192)
[junit4:junit4]   2> 	at org.eclipse.jetty.server.handler.ContextHandler.doScope(ContextHandler.java:999)
[junit4:junit4]   2> 	at org.eclipse.jetty.server.handler.ScopedHandler.handle(ScopedHandler.java:117)
[junit4:junit4]   2> 	at org.eclipse.jetty.server.handler.HandlerWrapper.handle(HandlerWrapper.java:111)
[junit4:junit4]   2> 	at org.eclipse.jetty.server.Server.handle(Server.java:351)
[junit4:junit4]   2> 	at org.eclipse.jetty.server.AbstractHttpConnection.handleRequest(AbstractHttpConnection.java:454)
[junit4:junit4]   2> 	at org.eclipse.jetty.server.BlockingHttpConnection.handleRequest(BlockingHttpConnection.java:47)
[junit4:junit4]   2> 	at org.eclipse.jetty.server.AbstractHttpConnection.headerComplete(AbstractHttpConnection.java:890)
[junit4:junit4]   2> 	at org.eclipse.jetty.server.AbstractHttpConnection$RequestHandler.headerComplete(AbstractHttpConnection.java:944)
[junit4:junit4]   2> 	at org.eclipse.jetty.http.HttpParser.parseNext(HttpParser.java:634)
[junit4:junit4]   2> 	at org.eclipse.jetty.http.HttpParser.parseAvailable(HttpParser.java:230)
[junit4:junit4]   2> 	at org.eclipse.jetty.server.BlockingHttpConnection.handle(BlockingHttpConnection.java:66)
[junit4:junit4]   2> 	at org.eclipse.jetty.server.bio.SocketConnector$ConnectorEndPoint.run(SocketConnector.java:254)
[junit4:junit4]   2> 	at org.eclipse.jetty.util.thread.QueuedThreadPool.runJob(QueuedThreadPool.java:599)
[junit4:junit4]   2> 	at org.eclipse.jetty.util.thread.QueuedThreadPool$3.run(QueuedThreadPool.java:534)
[junit4:junit4]   2> 	at java.lang.Thread.run(Thread.java:777)
[junit4:junit4]   2> 
[junit4:junit4]   2> 12571 T447 C29 P57407 oasr.BinaryResponseWriter$Resolver.getDoc WARNING Error reading a field from document : SolrDocument{id=8} java.lang.NullPointerException
[junit4:junit4]   2> 	at org.apache.solr.util.NumberUtils.SortableStr2int(NumberUtils.java:162)
[junit4:junit4]   2> 	at org.apache.solr.schema.SortableIntField.toObject(SortableIntField.java:96)
[junit4:junit4]   2> 	at org.apache.solr.schema.SortableIntField.toObject(SortableIntField.java:55)
[junit4:junit4]   2> 	at org.apache.solr.response.BinaryResponseWriter$Resolver.getValue(BinaryResponseWriter.java:218)
[junit4:junit4]   2> 	at org.apache.solr.response.BinaryResponseWriter$Resolver.getDoc(BinaryResponseWriter.java:181)
[junit4:junit4]   2> 	at org.apache.solr.response.BinaryResponseWriter$Resolver.writeResultsBody(BinaryResponseWriter.java:142)
[junit4:junit4]   2> 	at org.apache.solr.response.BinaryResponseWriter$Resolver.writeResults(BinaryResponseWriter.java:168)
[junit4:junit4]   2> 	at org.apache.solr.response.BinaryResponseWriter$Resolver.resolve(BinaryResponseWriter.java:81)
[junit4:junit4]   2> 	at org.apache.solr.common.util.JavaBinCodec.writeVal(JavaBinCodec.java:154)
[junit4:junit4]   2> 	at org.apache.solr.common.util.JavaBinCodec.writeNamedList(JavaBinCodec.java:144)
[junit4:junit4]   2> 	at org.apache.solr.common.util.JavaBinCodec.writeKnownType(JavaBinCodec.java:234)
[junit4:junit4]   2> 	at org.apache.solr.common.util.JavaBinCodec.writeVal(JavaBinCodec.java:149)
[junit4:junit4]   2> 	at org.apache.solr.common.util.JavaBinCodec.marshal(JavaBinCodec.java:92)
[junit4:junit4]   2> 	at org.apache.solr.response.BinaryResponseWriter.write(BinaryResponseWriter.java:49)
[junit4:junit4]   2> 	at org.apache.solr.servlet.SolrDispatchFilter.writeResponse(SolrDispatchFilter.java:403)
[junit4:junit4]   2> 	at org.apache.solr.servlet.SolrDispatchFilter.doFilter(SolrDispatchFilter.java:288)
[junit4:junit4]   2> 	at org.eclipse.jetty.servlet.ServletHandler$CachedChain.doFilter(ServletHandler.java:1337)
[junit4:junit4]   2> 	at org.eclipse.jetty.servlet.ServletHandler.doHandle(ServletHandler.java:484)
[junit4:junit4]   2> 	at org.eclipse.jetty.server.session.SessionHandler.doHandle(SessionHandler.java:231)
[junit4:junit4]   2> 	at org.eclipse.jetty.server.handler.ScopedHandler.handle(ScopedHandler.java:119)
[junit4:junit4]   2> 	at org.eclipse.jetty.server.handler.GzipHandler.handle(GzipHandler.java:267)
[junit4:junit4]   2> 	at org.eclipse.jetty.server.handler.ContextHandler.doHandle(ContextHandler.java:1067)
[junit4:junit4]   2> 	at org.eclipse.jetty.servlet.ServletHandler.doScope(ServletHandler.java:413)
[junit4:junit4]   2> 	at org.eclipse.jetty.server.session.SessionHandler.doScope(SessionHandler.java:192)
[junit4:junit4]   2> 	at org.eclipse.jetty.server.handler.ContextHandler.doScope(ContextHandler.java:999)
[junit4:junit4]   2> 	at org.eclipse.jetty.server.handler.ScopedHandler.handle(ScopedHandler.java:117)
[junit4:junit4]   2> 	at org.eclipse.jetty.server.handler.HandlerWrapper.handle(HandlerWrapper.java:111)
[junit4:junit4]   2> 	at org.eclipse.jetty.server.Server.handle(Server.java:351)
[junit4:junit4]   2> 	at org.eclipse.jetty.server.AbstractHttpConnection.handleRequest(AbstractHttpConnection.java:454)
[junit4:junit4]   2> 	at org.eclipse.jetty.server.BlockingHttpConnection.handleRequest(BlockingHttpConnection.java:47)
[junit4:junit4]   2> 	at org.eclipse.jetty.server.AbstractHttpConnection.headerComplete(AbstractHttpConnection.java:890)
[junit4:junit4]   2> 	at org.eclipse.jetty.server.AbstractHttpConnection$RequestHandler.headerComplete(AbstractHttpConnection.java:944)
[junit4:junit4]   2> 	at org.eclipse.jetty.http.HttpParser.parseNext(HttpParser.java:634)
[junit4:junit4]   2> 	at org.eclipse.jetty.http.HttpParser.parseAvailable(HttpParser.java:230)
[junit4:junit4]   2> 	at org.eclipse.jetty.server.BlockingHttpConnection.handle(BlockingHttpConnection.java:66)
[junit4:junit4]   2> 	at org.eclipse.jetty.server.bio.SocketConnector$ConnectorEndPoint.run(SocketConnector.java:254)
[junit4:junit4]   2> 	at org.eclipse.jetty.util.thread.QueuedThreadPool.runJob(QueuedThreadPool.java:599)
[junit4:junit4]   2> 	at org.eclipse.jetty.util.thread.QueuedThreadPool$3.run(QueuedThreadPool.java:534)
[junit4:junit4]   2> 	at java.lang.Thread.run(Thread.java:777)
[junit4:junit4]   2> 
[junit4:junit4]   2> 12572 T447 C29 P57407 oasr.BinaryResponseWriter$Resolver.getDoc WARNING Error reading a field from document : SolrDocument{id=3} java.lang.NullPointerException
[junit4:junit4]   2> 	at org.apache.solr.util.NumberUtils.SortableStr2int(NumberUtils.java:162)
[junit4:junit4]   2> 	at org.apache.solr.schema.SortableIntField.toObject(SortableIntField.java:96)
[junit4:junit4]   2> 	at org.apache.solr.schema.SortableIntField.toObject(SortableIntField.java:55)
[junit4:junit4]   2> 	at org.apache.solr.response.BinaryResponseWriter$Resolver.getValue(BinaryResponseWriter.java:218)
[junit4:junit4]   2> 	at org.apache.solr.response.BinaryResponseWriter$Resolver.getDoc(BinaryResponseWriter.java:181)
[junit4:junit4]   2> 	at org.apache.solr.response.BinaryResponseWriter$Resolver.writeResultsBody(BinaryResponseWriter.java:142)
[junit4:junit4]   2> 	at org.apache.solr.response.BinaryResponseWriter$Resolver.writeResults(BinaryResponseWriter.java:168)
[junit4:junit4]   2> 	at org.apache.solr.response.BinaryResponseWriter$Resolver.resolve(BinaryResponseWriter.java:81)
[junit4:junit4]   2> 	at org.apache.solr.common.util.JavaBinCodec.writeVal(JavaBinCodec.java:154)
[junit4:junit4]   2> 	at org.apache.solr.common.util.JavaBinCodec.writeNamedList(JavaBinCodec.java:144)
[junit4:junit4]   2> 	at org.apache.solr.common.util.JavaBinCodec.writeKnownType(JavaBinCodec.java:234)
[junit4:junit4]   2> 	at org.apache.solr.common.util.JavaBinCodec.writeVal(JavaBinCodec.java:149)
[junit4:junit4]   2> 	at org.apache.solr.common.util.JavaBinCodec.marshal(JavaBinCodec.java:92)
[junit4:junit4]   2> 	at org.apache.solr.response.BinaryResponseWriter.write(BinaryResponseWriter.java:49)
[junit4:junit4]   2> 	at org.apache.solr.servlet.SolrDispatchFilter.writeResponse(SolrDispatchFilter.java:403)
[junit4:junit4]   2> 	at org.apache.solr.servlet.SolrDispatchFilter.doFilter(SolrDispatchFilter.java:288)
[junit4:junit4]   2> 	at org.eclipse.jetty.servlet.ServletHandler$CachedChain.doFilter(ServletHandler.java:1337)
[junit4:junit4]   2> 	at org.eclipse.jetty.servlet.ServletHandler.doHandle(ServletHandler.java:484)
[junit4:junit4]   2> 	at org.eclipse.jetty.server.session.SessionHandler.doHandle(SessionHandler.java:231)
[junit4:junit4]   2> 	at org.eclipse.jetty.server.handler.ScopedHandler.handle(ScopedHandler.java:119)
[junit4:junit4]   2> 	at org.eclipse.jetty.server.handler.GzipHandler.handle(GzipHandler.java:267)
[junit4:junit4]   2> 	at org.eclipse.jetty.server.handler.ContextHandler.doHandle(ContextHandler.java:1067)
[junit4:junit4]   2> 	at org.eclipse.jetty.servlet.ServletHandler.doScope(ServletHandler.java:413)
[junit4:junit4]   2> 	at org.eclipse.jetty.server.session.SessionHandler.doScope(SessionHandler.java:192)
[junit4:junit4]   2> 	at org.eclipse.jetty.server.handler.ContextHandler.doScope(ContextHandler.java:999)
[junit4:junit4]   2> 	at org.eclipse.jetty.server.handler.ScopedHandler.handle(ScopedHandler.java:117)
[junit4:junit4]   2> 	at org.eclipse.jetty.server.handler.HandlerWrapper.handle(HandlerWrapper.java:111)
[junit4:junit4]   2> 	at org.eclipse.jetty.server.Server.handle(Server.java:351)
[junit4:junit4]   2> 	at org.eclipse.jetty.server.AbstractHttpConnection.handleRequest(AbstractHttpConnection.java:454)
[junit4:junit4]   2> 	at org.eclipse.jetty.server.BlockingHttpConnection.handleRequest(BlockingHttpConnection.java:47)
[junit4:junit4]   2> 	at org.eclipse.jetty.server.AbstractHttpConnection.headerComplete(AbstractHttpConnection.java:890)
[junit4:junit4]   2> 	at org.eclipse.jetty.server.AbstractHttpConnection$RequestHandler.headerComplete(AbstractHttpConnection.java:944)
[junit4:junit4]   2> 	at org.eclipse.jetty.http.HttpParser.parseNext(HttpParser.java:634)
[junit4:junit4]   2> 	at org.eclipse.jetty.http.HttpParser.parseAvailable(HttpParser.java:230)
[junit4:junit4]   2> 	at org.eclipse.jetty.server.BlockingHttpConnection.handle(BlockingHttpConnection.java:66)
[junit4:junit4]   2> 	at org.eclipse.jetty.server.bio.SocketConnector$ConnectorEndPoint.run(SocketConnector.java:254)
[junit4:junit4]   2> 	at org.eclipse.jetty.util.thread.QueuedThreadPool.runJob(QueuedThreadPool.java:599)
[junit4:junit4]   2> 	at org.eclipse.jetty.util.thread.QueuedThreadPool$3.run(QueuedThreadPool.java:534)
[junit4:junit4]   2> 	at java.lang.Thread.run(Thread.java:777)
[junit4:junit4]   2> 
[junit4:junit4]   2> 12573 T447 C29 P57407 oasr.BinaryResponseWriter$Resolver.getDoc WARNING Error reading a field from document : SolrDocument{id=3, range_facet_l=[3], range_facet_sl=[3]} java.lang.NullPointerException
[junit4:junit4]   2> 	at org.apache.solr.util.NumberUtils.SortableStr2int(NumberUtils.java:162)
[junit4:junit4]   2> 	at org.apache.solr.schema.SortableIntField.toObject(SortableIntField.java:96)
[junit4:junit4]   2> 	at org.apache.solr.schema.SortableIntField.toObject(SortableIntField.java:55)
[junit4:junit4]   2> 	at org.apache.solr.response.BinaryResponseWriter$Resolver.getValue(BinaryResponseWriter.java:218)
[junit4:junit4]   2> 	at org.apache.solr.response.BinaryResponseWriter$Resolver.getDoc(BinaryResponseWriter.java:181)
[junit4:junit4]   2> 	at org.apache.solr.response.BinaryResponseWriter$Resolver.writeResultsBody(BinaryResponseWriter.java:142)
[junit4:junit4]   2> 	at org.apache.solr.response.BinaryResponseWriter$Resolver.writeResults(BinaryResponseWriter.java:168)
[junit4:junit4]   2> 	at org.apache.solr.response.BinaryResponseWriter$Resolver.resolve(BinaryResponseWriter.java:81)
[junit4:junit4]   2> 	at org.apache.solr.common.util.JavaBinCodec.writeVal(JavaBinCodec.java:154)
[junit4:junit4]   2> 	at org.apache.solr.common.util.JavaBinCodec.writeNamedList(JavaBinCodec.java:144)
[junit4:junit4]   2> 	at org.apache.solr.common.util.JavaBinCodec.writeKnownType(JavaBinCodec.java:234)
[junit4:junit4]   2> 	at org.apache.solr.common.util.JavaBinCodec.writeVal(JavaBinCodec.java:149)
[junit4:junit4]   2> 	at org.apache.solr.common.util.JavaBinCodec.marshal(JavaBinCodec.java:92)
[junit4:junit4]   2> 	at org.apache.solr.response.BinaryResponseWriter.write(BinaryResponseWriter.java:49)
[junit4:junit4]   2> 	at org.apache.solr.servlet.SolrDispatchFilter.writeResponse(SolrDispatchFilter.java:403)
[junit4:junit4]   2> 	at org.apache.solr.servlet.SolrDispatchFilter.doFilter(SolrDispatchFilter.java:288)
[junit4:junit4]   2> 	at org.eclipse.jetty.servlet.ServletHandler$CachedChain.doFilter(ServletHandler.java:1337)
[junit4:junit4]   2> 	at org.eclipse.jetty.servlet.ServletHandler.doHandle(ServletHandler.java:484)
[junit4:junit4]   2> 	at org.eclipse.jetty.server.session.SessionHandler.doHandle(SessionHandler.java:231)
[junit4:junit4]   2> 	at org.eclipse.jetty.server.handler.ScopedHandler.handle(ScopedHandler.java:119)
[junit4:junit4]   2> 	at org.eclipse.jetty.server.handler.GzipHandler.handle(GzipHandler.java:267)
[junit4:junit4]   2> 	at org.eclipse.jetty.server.handler.ContextHandler.doHandle(ContextHandler.java:1067)
[junit4:junit4]   2> 	at org.eclipse.jetty.servlet.ServletHandler.doScope(ServletHandler.java:413)
[junit4:junit4]   2> 	at org.eclipse.jetty.server.session.SessionHandler.doScope(SessionHandler.java:192)
[junit4:junit4]   2> 	at org.eclipse.jetty.server.handler.ContextHandler.doScope(ContextHandler.java:999)
[junit4:junit4]   2> 	at org.eclipse.jetty.server.handler.ScopedHandler.handle(ScopedHandler.java:117)
[junit4:junit4]   2> 	at org.eclipse.jetty.server.handler.HandlerWrapper.handle(HandlerWrapper.java:111)
[junit4:junit4]   2> 	at org.eclipse.jetty.server.Server.handle(Server.java:351)
[junit4:junit4]   2> 	at org.eclipse.jetty.server.AbstractHttpConnection.handleRequest(AbstractHttpConnection.java:454)
[junit4:junit4]   2> 	at org.eclipse.jetty.server.BlockingHttpConnection.handleRequest(BlockingHttpConnection.java:47)
[junit4:junit4]   2> 	at org.eclipse.jetty.server.AbstractHttpConnection.headerComplete(AbstractHttpConnection.java:890)
[junit4:junit4]   2> 	at org.eclipse.jetty.server.AbstractHttpConnection$RequestHandler.headerComplete(AbstractHttpConnection.java:944)
[junit4:junit4]   2> 	at org.eclipse.jetty.http.HttpParser.parseNext(HttpParser.java:634)
[junit4:junit4]   2> 	at org.eclipse.jetty.http.HttpParser.parseAvailable(HttpParser.java:230)
[junit4:junit4]   2> 	at org.eclipse.jetty.server.BlockingHttpConnection.handle(BlockingHttpConnection.java:66)
[junit4:junit4]   2> 	at org.eclipse.jetty.server.bio.SocketConnector$ConnectorEndPoint.run(SocketConnector.java:254)
[junit4:junit4]   2> 	at org.eclipse.jetty.util.thread.QueuedThreadPool.runJob(QueuedThreadPool.java:599)
[junit4:junit4]   2> 	at org.eclipse.jetty.util.thread.QueuedThreadPool$3.run(QueuedThreadPool.java:534)
[junit4:junit4]   2> 	at java.lang.Thread.run(Thread.java:777)
[junit4:junit4]   2> 
[junit4:junit4]   2> 12573 T447 C29 P57407 oasr.BinaryResponseWriter$Resolver.getDoc WARNING Error reading a field from document : SolrDocument{id=116} java.lang.NullPointerException
[junit4:junit4]   2> 	at org.apache.solr.util.NumberUtils.SortableStr2int(NumberUtils.java:162)
[junit4:junit4]   2> 	at org.apache.solr.schema.SortableIntField.toObject(SortableIntField.java:96)
[junit4:junit4]   2> 	at org.apache.solr.schema.SortableIntField.toObject(SortableIntField.java:55)
[junit4:junit4]   2> 	at org.apache.solr.response.BinaryResponseWriter$Resolver.getValue(BinaryResponseWriter.java:218)
[junit4:junit4]   2> 	at org.apache.solr.response.BinaryResponseWriter$Resolver.getDoc(BinaryResponseWriter.java:181)
[junit4:junit4]   2> 	at org.apache.solr.response.BinaryResponseWriter$Resolver.writeResultsBody(BinaryResponseWriter.java:142)
[junit4:junit4]   2> 	at org.apache.solr.response.BinaryResponseWriter$Resolver.writeResults(BinaryResponseWriter.java:168)
[junit4:junit4]   2> 	at org.apache.solr.response.BinaryResponseWriter$Resolver.resolve(BinaryResponseWriter.java:81)
[junit4:junit4]   2> 	at org.apache.solr.common.util.JavaBinCodec.writeVal(JavaBinCodec.java:154)
[junit4:junit4]   2> 	at org.apache.solr.common.util.JavaBinCodec.writeNamedList(JavaBinCodec.java:144)
[junit4:junit4]   2> 	at org.apache.solr.common.util.JavaBinCodec.writeKnownType(JavaBinCodec.java:234)
[junit4:junit4]   2> 	at org.apache.solr.common.util.JavaBinCodec.writeVal(JavaBinCodec.java:149)
[junit4:junit4]   2> 	at org.apache.solr.common.util.JavaBinCodec.marshal(JavaBinCodec.java:92)
[junit4:junit4]   2> 	at org.apache.solr.response.BinaryResponseWriter.write(BinaryResponseWriter.java:49)
[junit4:junit4]   2> 	at org.apache.solr.servlet.SolrDispatchFilter.writeResponse(SolrDispatchFilter.java:403)
[junit4:junit4]   2> 	at org.apache.solr.servlet.SolrDispatchFilter.doFilter(SolrDispatchFilter.java:288)
[junit4:junit4]   2> 	at org.eclipse.jetty.servlet.ServletHandler$CachedChain.doFilter(ServletHandler.java:1337)
[junit4:junit4]   2> 	at org.eclipse.jetty.servlet

[...truncated too long message...]

lative_deletesByQuery=1,cumulative_errors=0}
[junit4:junit4]   2> 11652 T1360 oasu.DefaultSolrCoreState.decref SolrCoreState ref count has reached 0 - closing IndexWriter
[junit4:junit4]   2> 11653 T1360 oejsh.ContextHandler.doStop stopped o.e.j.s.ServletContextHandler{/solr,null}
[junit4:junit4]   2> 11706 T1360 oas.SolrTestCaseJ4.tearDown ###Ending testDistribSearch
[junit4:junit4]   2> NOTE: reproduce with: ant test  -Dtestcase=DistributedQueryElevationComponentTest -Dtests.method=testDistribSearch -Dtests.seed=7637BA634E60401C -Dtests.multiplier=3 -Dtests.slow=true -Dtests.locale=kk_KZ -Dtests.timezone=Pacific/Fakaofo -Dtests.file.encoding=UTF-8
[junit4:junit4] ERROR   11.7s J0 | DistributedQueryElevationComponentTest.testDistribSearch <<<
[junit4:junit4]    > Throwable #1: org.apache.solr.common.SolrException: Server at http://localhost:58448/solr returned non ok status:500, message:Server Error
[junit4:junit4]    > 	at __randomizedtesting.SeedInfo.seed([7637BA634E60401C:F7D1347B393F2020]:0)
[junit4:junit4]    > 	at org.apache.solr.client.solrj.impl.HttpSolrServer.request(HttpSolrServer.java:373)
[junit4:junit4]    > 	at org.apache.solr.client.solrj.impl.HttpSolrServer.request(HttpSolrServer.java:182)
[junit4:junit4]    > 	at org.apache.solr.client.solrj.request.QueryRequest.process(QueryRequest.java:90)
[junit4:junit4]    > 	at org.apache.solr.client.solrj.SolrServer.query(SolrServer.java:324)
[junit4:junit4]    > 	at org.apache.solr.BaseDistributedSearchTestCase.queryServer(BaseDistributedSearchTestCase.java:371)
[junit4:junit4]    > 	at org.apache.solr.BaseDistributedSearchTestCase.query(BaseDistributedSearchTestCase.java:390)
[junit4:junit4]    > 	at org.apache.solr.handler.component.DistributedQueryElevationComponentTest.doTest(DistributedQueryElevationComponentTest.java:83)
[junit4:junit4]    > 	at org.apache.solr.BaseDistributedSearchTestCase.testDistribSearch(BaseDistributedSearchTestCase.java:691)
[junit4:junit4]    > 	at sun.reflect.NativeMethodAccessorImpl.invoke0(Native Method)
[junit4:junit4]    > 	at sun.reflect.NativeMethodAccessorImpl.invoke(NativeMethodAccessorImpl.java:88)
[junit4:junit4]    > 	at sun.reflect.DelegatingMethodAccessorImpl.invoke(DelegatingMethodAccessorImpl.java:55)
[junit4:junit4]    > 	at java.lang.reflect.Method.invoke(Method.java:613)
[junit4:junit4]    > 	at com.carrotsearch.randomizedtesting.RandomizedRunner.invoke(RandomizedRunner.java:1559)
[junit4:junit4]    > 	at com.carrotsearch.randomizedtesting.RandomizedRunner.access$600(RandomizedRunner.java:79)
[junit4:junit4]    > 	at com.carrotsearch.randomizedtesting.RandomizedRunner$6.evaluate(RandomizedRunner.java:737)
[junit4:junit4]    > 	at com.carrotsearch.randomizedtesting.RandomizedRunner$7.evaluate(RandomizedRunner.java:773)
[junit4:junit4]    > 	at com.carrotsearch.randomizedtesting.RandomizedRunner$8.evaluate(RandomizedRunner.java:787)
[junit4:junit4]    > 	at com.carrotsearch.randomizedtesting.rules.SystemPropertiesRestoreRule$1.evaluate(SystemPropertiesRestoreRule.java:53)
[junit4:junit4]    > 	at org.apache.lucene.util.TestRuleSetupTeardownChained$1.evaluate(TestRuleSetupTeardownChained.java:50)
[junit4:junit4]    > 	at org.apache.lucene.util.TestRuleFieldCacheSanity$1.evaluate(TestRuleFieldCacheSanity.java:51)
[junit4:junit4]    > 	at org.apache.lucene.util.AbstractBeforeAfterRule$1.evaluate(AbstractBeforeAfterRule.java:45)
[junit4:junit4]    > 	at com.carrotsearch.randomizedtesting.rules.SystemPropertiesInvariantRule$1.evaluate(SystemPropertiesInvariantRule.java:55)
[junit4:junit4]    > 	at org.apache.lucene.util.TestRuleThreadAndTestName$1.evaluate(TestRuleThreadAndTestName.java:48)
[junit4:junit4]    > 	at org.apache.lucene.util.TestRuleIgnoreAfterMaxFailures$1.evaluate(TestRuleIgnoreAfterMaxFailures.java:70)
[junit4:junit4]    > 	at org.apache.lucene.util.TestRuleMarkFailure$1.evaluate(TestRuleMarkFailure.java:48)
[junit4:junit4]    > 	at com.carrotsearch.randomizedtesting.rules.StatementAdapter.evaluate(StatementAdapter.java:36)
[junit4:junit4]    > 	at com.carrotsearch.randomizedtesting.ThreadLeakControl$StatementRunner.run(ThreadLeakControl.java:345)
[junit4:junit4]    > 	at com.carrotsearch.randomizedtesting.ThreadLeakControl.forkTimeoutingTask(ThreadLeakControl.java:769)
[junit4:junit4]    > 	at com.carrotsearch.randomizedtesting.ThreadLeakControl$3.evaluate(ThreadLeakControl.java:429)
[junit4:junit4]    > 	at com.carrotsearch.randomizedtesting.RandomizedRunner.runSingleTest(RandomizedRunner.java:746)
[junit4:junit4]    > 	at com.carrotsearch.randomizedtesting.RandomizedRunner$3.evaluate(RandomizedRunner.java:648)
[junit4:junit4]    > 	at com.carrotsearch.randomizedtesting.RandomizedRunner$4.evaluate(RandomizedRunner.java:682)
[junit4:junit4]    > 	at com.carrotsearch.randomizedtesting.RandomizedRunner$5.evaluate(RandomizedRunner.java:693)
[junit4:junit4]    > 	at com.carrotsearch.randomizedtesting.rules.StatementAdapter.evaluate(StatementAdapter.java:36)
[junit4:junit4]    > 	at com.carrotsearch.randomizedtesting.rules.SystemPropertiesRestoreRule$1.evaluate(SystemPropertiesRestoreRule.java:53)
[junit4:junit4]    > 	at org.apache.lucene.util.AbstractBeforeAfterRule$1.evaluate(AbstractBeforeAfterRule.java:45)
[junit4:junit4]    > 	at org.apache.lucene.util.TestRuleStoreClassName$1.evaluate(TestRuleStoreClassName.java:42)
[junit4:junit4]    > 	at com.carrotsearch.randomizedtesting.rules.SystemPropertiesInvariantRule$1.evaluate(SystemPropertiesInvariantRule.java:55)
[junit4:junit4]    > 	at com.carrotsearch.randomizedtesting.rules.NoShadowingOrOverridesOnMethodsRule$1.evaluate(NoShadowingOrOverridesOnMethodsRule.java:39)
[junit4:junit4]    > 	at com.carrotsearch.randomizedtesting.rules.NoShadowingOrOverridesOnMethodsRule$1.evaluate(NoShadowingOrOverridesOnMethodsRule.java:39)
[junit4:junit4]    > 	at org.apache.lucene.util.TestRuleAssertionsRequired$1.evaluate(TestRuleAssertionsRequired.java:40)
[junit4:junit4]    > 	at org.apache.lucene.util.TestRuleMarkFailure$1.evaluate(TestRuleMarkFailure.java:48)
[junit4:junit4]    > 	at org.apache.lucene.util.TestRuleIgnoreAfterMaxFailures$1.evaluate(TestRuleIgnoreAfterMaxFailures.java:70)
[junit4:junit4]    > 	at org.apache.lucene.util.TestRuleIgnoreTestSuites$1.evaluate(TestRuleIgnoreTestSuites.java:55)
[junit4:junit4]    > 	at com.carrotsearch.randomizedtesting.rules.StatementAdapter.evaluate(StatementAdapter.java:36)
[junit4:junit4]    > 	at com.carrotsearch.randomizedtesting.ThreadLeakControl$StatementRunner.run(ThreadLeakControl.java:345)
[junit4:junit4]    > 	at java.lang.Thread.run(Thread.java:777)
[junit4:junit4]   2> 11712 T1360 oas.SolrTestCaseJ4.deleteCore ###deleteCore
[junit4:junit4]   2> NOTE: test params are: codec=Lucene40: {plow_t=PostingsFormat(name=MockRandom), int_i=PostingsFormat(name=NestedPulsing), id=PostingsFormat(name=MockRandom), text=PostingsFormat(name=NestedPulsing), field_t=PostingsFormat(name=NestedPulsing)}, sim=RandomSimilarityProvider(queryNorm=false,coord=yes): {}, locale=kk_KZ, timezone=Pacific/Fakaofo
[junit4:junit4]   2> NOTE: Linux 3.2.0-29-generic amd64/IBM Corporation 1.7.0 (64-bit)/cpus=8,threads=2,free=96982832,total=172556288
[junit4:junit4]   2> NOTE: All tests run in this JVM: [CoreAdminHandlerTest, SOLR749Test, PathHierarchyTokenizerFactoryTest, BasicDistributedZk2Test, TestIndexingPerformance, TermVectorComponentDistributedTest, TestLuceneMatchVersion, TestLMDirichletSimilarityFactory, PluginInfoTest, SpellPossibilityIteratorTest, UpdateRequestProcessorFactoryTest, AlternateDirectoryTest, SolrCoreCheckLockOnStartupTest, TermsComponentTest, BadComponentTest, QueryElevationComponentTest, NoCacheHeaderTest, JSONWriterTest, IndexBasedSpellCheckerTest, BasicDistributedZkTest, ClusterStateTest, MoreLikeThisHandlerTest, LeaderElectionIntegrationTest, CacheHeaderTest, TestLFUCache, SearchHandlerTest, JsonLoaderTest, SolrPluginUtilsTest, MBeansHandlerTest, DistributedSpellCheckComponentTest, ClusterStateUpdateTest, TestSearchPerf, FieldAnalysisRequestHandlerTest, PreAnalyzedFieldTest, DistributedTermsComponentTest, SuggesterFSTTest, CurrencyFieldTest, ZkControllerTest, TestStressVersions, TestCollationKeyRangeQueries, CSVRequestHandlerTest, DistanceFunctionTest, LoggingHandlerTest, BinaryUpdateRequestHandlerTest, NotRequiredUniqueKeyTest, TestGroupingSearch, CopyFieldTest, TestIBSimilarityFactory, TestCharFilters, TestFaceting, SuggesterWFSTTest, TestBadConfig, TestCollationField, DefaultValueUpdateProcessorTest, SpatialFilterTest, TestDistributedSearch, SpellCheckCollatorTest, TestExtendedDismaxParser, AutoCommitTest, WordBreakSolrSpellCheckerTest, StatsComponentTest, SolrCoreTest, TestRangeQuery, DirectUpdateHandlerTest, TestMultiCoreConfBootstrap, SimpleFacetsTest, TestCoreContainer, LukeRequestHandlerTest, TestSort, TestFiltering, SampleTest, TestIndexSearcher, QueryEqualityTest, TestCSVResponseWriter, DistributedQueryElevationComponentTest]
[junit4:junit4] Completed on J0 in 11.73s, 1 test, 1 error <<< FAILURES!

[...truncated 197 lines...]
BUILD FAILED
/mnt/ssd/jenkins/workspace/Lucene-Solr-4.x-Linux/build.xml:29: The following error occurred while executing this line:
/mnt/ssd/jenkins/workspace/Lucene-Solr-4.x-Linux/solr/build.xml:144: The following error occurred while executing this line:
/mnt/ssd/jenkins/workspace/Lucene-Solr-4.x-Linux/lucene/module-build.xml:62: The following error occurred while executing this line:
/mnt/ssd/jenkins/workspace/Lucene-Solr-4.x-Linux/lucene/common-build.xml:1056: The following error occurred while executing this line:
/mnt/ssd/jenkins/workspace/Lucene-Solr-4.x-Linux/lucene/common-build.xml:741: There were test failures: 228 suites, 910 tests, 4 errors, 6 ignored (1 assumption)

Total time: 31 minutes 17 seconds
Build step 'Invoke Ant' marked build as failure
Recording test results
Description set: Java: 64bit/ibm-j9-jdk7 -Xjit:exclude={org/apache/lucene/util/fst/FST.pack(IIF)Lorg/apache/lucene/util/fst/FST;}
Email was triggered for: Failure
Sending email for trigger: Failure



Mime
View raw message