lucene-dev mailing list archives

Site index · List index
Message view « Date » · « Thread »
Top « Date » · « Thread »
From Apache Jenkins Server <jenk...@builds.apache.org>
Subject [JENKINS] Lucene-Solr-NightlyTests-trunk - Build # 34 - Failure
Date Sat, 15 Sep 2012 03:56:44 GMT
Build: https://builds.apache.org/job/Lucene-Solr-NightlyTests-trunk/34/

2 tests failed.
REGRESSION:  org.apache.solr.cloud.SyncSliceTest.testDistribSearch

Error Message:
There are still nodes recoverying

Stack Trace:
java.lang.AssertionError: There are still nodes recoverying
	at __randomizedtesting.SeedInfo.seed([6B70A5B1C3F2093F:EA962BA9B4AD6903]:0)
	at org.junit.Assert.fail(Assert.java:93)
	at org.apache.solr.cloud.AbstractDistribZkTestBase.waitForRecoveriesToFinish(AbstractDistribZkTestBase.java:153)
	at org.apache.solr.cloud.AbstractFullDistribZkTestBase.waitForRecoveriesToFinish(AbstractFullDistribZkTestBase.java:555)
	at org.apache.solr.cloud.AbstractFullDistribZkTestBase.waitForThingsToLevelOut(AbstractFullDistribZkTestBase.java:1130)
	at org.apache.solr.cloud.SyncSliceTest.doTest(SyncSliceTest.java:162)
	at org.apache.solr.BaseDistributedSearchTestCase.testDistribSearch(BaseDistributedSearchTestCase.java:691)
	at sun.reflect.NativeMethodAccessorImpl.invoke0(Native Method)
	at sun.reflect.NativeMethodAccessorImpl.invoke(NativeMethodAccessorImpl.java:57)
	at sun.reflect.DelegatingMethodAccessorImpl.invoke(DelegatingMethodAccessorImpl.java:43)
	at java.lang.reflect.Method.invoke(Method.java:616)
	at com.carrotsearch.randomizedtesting.RandomizedRunner.invoke(RandomizedRunner.java:1559)
	at com.carrotsearch.randomizedtesting.RandomizedRunner.access$600(RandomizedRunner.java:79)
	at com.carrotsearch.randomizedtesting.RandomizedRunner$6.evaluate(RandomizedRunner.java:737)
	at com.carrotsearch.randomizedtesting.RandomizedRunner$7.evaluate(RandomizedRunner.java:773)
	at com.carrotsearch.randomizedtesting.RandomizedRunner$8.evaluate(RandomizedRunner.java:787)
	at com.carrotsearch.randomizedtesting.rules.SystemPropertiesRestoreRule$1.evaluate(SystemPropertiesRestoreRule.java:53)
	at org.apache.lucene.util.TestRuleSetupTeardownChained$1.evaluate(TestRuleSetupTeardownChained.java:50)
	at org.apache.lucene.util.TestRuleFieldCacheSanity$1.evaluate(TestRuleFieldCacheSanity.java:51)
	at org.apache.lucene.util.AbstractBeforeAfterRule$1.evaluate(AbstractBeforeAfterRule.java:45)
	at com.carrotsearch.randomizedtesting.rules.SystemPropertiesInvariantRule$1.evaluate(SystemPropertiesInvariantRule.java:55)
	at org.apache.lucene.util.TestRuleThreadAndTestName$1.evaluate(TestRuleThreadAndTestName.java:48)
	at org.apache.lucene.util.TestRuleIgnoreAfterMaxFailures$1.evaluate(TestRuleIgnoreAfterMaxFailures.java:70)
	at org.apache.lucene.util.TestRuleMarkFailure$1.evaluate(TestRuleMarkFailure.java:48)
	at com.carrotsearch.randomizedtesting.rules.StatementAdapter.evaluate(StatementAdapter.java:36)
	at com.carrotsearch.randomizedtesting.ThreadLeakControl$StatementRunner.run(ThreadLeakControl.java:358)
	at com.carrotsearch.randomizedtesting.ThreadLeakControl.forkTimeoutingTask(ThreadLeakControl.java:782)
	at com.carrotsearch.randomizedtesting.ThreadLeakControl$3.evaluate(ThreadLeakControl.java:442)
	at com.carrotsearch.randomizedtesting.RandomizedRunner.runSingleTest(RandomizedRunner.java:746)
	at com.carrotsearch.randomizedtesting.RandomizedRunner$3.evaluate(RandomizedRunner.java:648)
	at com.carrotsearch.randomizedtesting.RandomizedRunner$4.evaluate(RandomizedRunner.java:682)
	at com.carrotsearch.randomizedtesting.RandomizedRunner$5.evaluate(RandomizedRunner.java:693)
	at com.carrotsearch.randomizedtesting.rules.StatementAdapter.evaluate(StatementAdapter.java:36)
	at com.carrotsearch.randomizedtesting.rules.SystemPropertiesRestoreRule$1.evaluate(SystemPropertiesRestoreRule.java:53)
	at org.apache.lucene.util.AbstractBeforeAfterRule$1.evaluate(AbstractBeforeAfterRule.java:45)
	at org.apache.lucene.util.TestRuleStoreClassName$1.evaluate(TestRuleStoreClassName.java:42)
	at com.carrotsearch.randomizedtesting.rules.SystemPropertiesInvariantRule$1.evaluate(SystemPropertiesInvariantRule.java:55)
	at com.carrotsearch.randomizedtesting.rules.NoShadowingOrOverridesOnMethodsRule$1.evaluate(NoShadowingOrOverridesOnMethodsRule.java:39)
	at com.carrotsearch.randomizedtesting.rules.NoShadowingOrOverridesOnMethodsRule$1.evaluate(NoShadowingOrOverridesOnMethodsRule.java:39)
	at com.carrotsearch.randomizedtesting.rules.StatementAdapter.evaluate(StatementAdapter.java:36)
	at org.apache.lucene.util.TestRuleAssertionsRequired$1.evaluate(TestRuleAssertionsRequired.java:43)
	at org.apache.lucene.util.TestRuleMarkFailure$1.evaluate(TestRuleMarkFailure.java:48)
	at org.apache.lucene.util.TestRuleIgnoreAfterMaxFailures$1.evaluate(TestRuleIgnoreAfterMaxFailures.java:70)
	at org.apache.lucene.util.TestRuleIgnoreTestSuites$1.evaluate(TestRuleIgnoreTestSuites.java:55)
	at com.carrotsearch.randomizedtesting.rules.StatementAdapter.evaluate(StatementAdapter.java:36)
	at com.carrotsearch.randomizedtesting.ThreadLeakControl$StatementRunner.run(ThreadLeakControl.java:358)
	at java.lang.Thread.run(Thread.java:679)


REGRESSION:  org.apache.solr.update.SolrCmdDistributorTest.testDistribSearch

Error Message:


Stack Trace:
java.util.concurrent.RejectedExecutionException
	at __randomizedtesting.SeedInfo.seed([6B70A5B1C3F2093F:EA962BA9B4AD6903]:0)
	at java.util.concurrent.ThreadPoolExecutor$AbortPolicy.rejectedExecution(ThreadPoolExecutor.java:1956)
	at java.util.concurrent.ThreadPoolExecutor.reject(ThreadPoolExecutor.java:816)
	at java.util.concurrent.ThreadPoolExecutor.execute(ThreadPoolExecutor.java:1337)
	at java.util.concurrent.ExecutorCompletionService.submit(ExecutorCompletionService.java:181)
	at org.apache.solr.update.SolrCmdDistributor.submit(SolrCmdDistributor.java:356)
	at org.apache.solr.update.SolrCmdDistributor.submit(SolrCmdDistributor.java:301)
	at org.apache.solr.update.SolrCmdDistributor.flushAdds(SolrCmdDistributor.java:233)
	at org.apache.solr.update.SolrCmdDistributor.distribAdd(SolrCmdDistributor.java:147)
	at org.apache.solr.update.SolrCmdDistributorTest.doTest(SolrCmdDistributorTest.java:204)
	at org.apache.solr.BaseDistributedSearchTestCase.testDistribSearch(BaseDistributedSearchTestCase.java:691)
	at sun.reflect.NativeMethodAccessorImpl.invoke0(Native Method)
	at sun.reflect.NativeMethodAccessorImpl.invoke(NativeMethodAccessorImpl.java:57)
	at sun.reflect.DelegatingMethodAccessorImpl.invoke(DelegatingMethodAccessorImpl.java:43)
	at java.lang.reflect.Method.invoke(Method.java:616)
	at com.carrotsearch.randomizedtesting.RandomizedRunner.invoke(RandomizedRunner.java:1559)
	at com.carrotsearch.randomizedtesting.RandomizedRunner.access$600(RandomizedRunner.java:79)
	at com.carrotsearch.randomizedtesting.RandomizedRunner$6.evaluate(RandomizedRunner.java:737)
	at com.carrotsearch.randomizedtesting.RandomizedRunner$7.evaluate(RandomizedRunner.java:773)
	at com.carrotsearch.randomizedtesting.RandomizedRunner$8.evaluate(RandomizedRunner.java:787)
	at com.carrotsearch.randomizedtesting.rules.SystemPropertiesRestoreRule$1.evaluate(SystemPropertiesRestoreRule.java:53)
	at org.apache.lucene.util.TestRuleSetupTeardownChained$1.evaluate(TestRuleSetupTeardownChained.java:50)
	at org.apache.lucene.util.TestRuleFieldCacheSanity$1.evaluate(TestRuleFieldCacheSanity.java:51)
	at org.apache.lucene.util.AbstractBeforeAfterRule$1.evaluate(AbstractBeforeAfterRule.java:45)
	at com.carrotsearch.randomizedtesting.rules.SystemPropertiesInvariantRule$1.evaluate(SystemPropertiesInvariantRule.java:55)
	at org.apache.lucene.util.TestRuleThreadAndTestName$1.evaluate(TestRuleThreadAndTestName.java:48)
	at org.apache.lucene.util.TestRuleIgnoreAfterMaxFailures$1.evaluate(TestRuleIgnoreAfterMaxFailures.java:70)
	at org.apache.lucene.util.TestRuleMarkFailure$1.evaluate(TestRuleMarkFailure.java:48)
	at com.carrotsearch.randomizedtesting.rules.StatementAdapter.evaluate(StatementAdapter.java:36)
	at com.carrotsearch.randomizedtesting.ThreadLeakControl$StatementRunner.run(ThreadLeakControl.java:358)
	at com.carrotsearch.randomizedtesting.ThreadLeakControl.forkTimeoutingTask(ThreadLeakControl.java:782)
	at com.carrotsearch.randomizedtesting.ThreadLeakControl$3.evaluate(ThreadLeakControl.java:442)
	at com.carrotsearch.randomizedtesting.RandomizedRunner.runSingleTest(RandomizedRunner.java:746)
	at com.carrotsearch.randomizedtesting.RandomizedRunner$3.evaluate(RandomizedRunner.java:648)
	at com.carrotsearch.randomizedtesting.RandomizedRunner$4.evaluate(RandomizedRunner.java:682)
	at com.carrotsearch.randomizedtesting.RandomizedRunner$5.evaluate(RandomizedRunner.java:693)
	at com.carrotsearch.randomizedtesting.rules.StatementAdapter.evaluate(StatementAdapter.java:36)
	at com.carrotsearch.randomizedtesting.rules.SystemPropertiesRestoreRule$1.evaluate(SystemPropertiesRestoreRule.java:53)
	at org.apache.lucene.util.AbstractBeforeAfterRule$1.evaluate(AbstractBeforeAfterRule.java:45)
	at org.apache.lucene.util.TestRuleStoreClassName$1.evaluate(TestRuleStoreClassName.java:42)
	at com.carrotsearch.randomizedtesting.rules.SystemPropertiesInvariantRule$1.evaluate(SystemPropertiesInvariantRule.java:55)
	at com.carrotsearch.randomizedtesting.rules.NoShadowingOrOverridesOnMethodsRule$1.evaluate(NoShadowingOrOverridesOnMethodsRule.java:39)
	at com.carrotsearch.randomizedtesting.rules.NoShadowingOrOverridesOnMethodsRule$1.evaluate(NoShadowingOrOverridesOnMethodsRule.java:39)
	at com.carrotsearch.randomizedtesting.rules.StatementAdapter.evaluate(StatementAdapter.java:36)
	at org.apache.lucene.util.TestRuleAssertionsRequired$1.evaluate(TestRuleAssertionsRequired.java:43)
	at org.apache.lucene.util.TestRuleMarkFailure$1.evaluate(TestRuleMarkFailure.java:48)
	at org.apache.lucene.util.TestRuleIgnoreAfterMaxFailures$1.evaluate(TestRuleIgnoreAfterMaxFailures.java:70)
	at org.apache.lucene.util.TestRuleIgnoreTestSuites$1.evaluate(TestRuleIgnoreTestSuites.java:55)
	at com.carrotsearch.randomizedtesting.rules.StatementAdapter.evaluate(StatementAdapter.java:36)
	at com.carrotsearch.randomizedtesting.ThreadLeakControl$StatementRunner.run(ThreadLeakControl.java:358)
	at java.lang.Thread.run(Thread.java:679)




Build Log:
[...truncated 7348 lines...]
[junit4:junit4] Suite: org.apache.solr.update.SolrCmdDistributorTest
[junit4:junit4]   2> 2 T1721 oas.SolrTestCaseJ4.setUp ###Starting testDistribSearch
[junit4:junit4]   2> 6 T1721 oejs.Server.doStart jetty-8.1.2.v20120308
[junit4:junit4]   2> 10 T1721 oejs.AbstractConnector.doStart Started SocketConnector@0.0.0.0:62780
[junit4:junit4]   2> 11 T1721 oasc.SolrResourceLoader.locateSolrHome JNDI not configured for solr (NoInitialContextEx)
[junit4:junit4]   2> 11 T1721 oasc.SolrResourceLoader.locateSolrHome using system property solr.solr.home: /usr/home/hudson/hudson-slave/workspace/Lucene-Solr-NightlyTests-trunk/solr/build/solr-core/test-files/solr
[junit4:junit4]   2> 12 T1721 oasc.SolrResourceLoader.<init> new SolrResourceLoader for deduced Solr Home: '/usr/home/hudson/hudson-slave/workspace/Lucene-Solr-NightlyTests-trunk/solr/build/solr-core/test-files/solr/'
[junit4:junit4]   2> 48 T1721 oass.SolrDispatchFilter.init SolrDispatchFilter.init()
[junit4:junit4]   2> 48 T1721 oasc.SolrResourceLoader.locateSolrHome JNDI not configured for solr (NoInitialContextEx)
[junit4:junit4]   2> 49 T1721 oasc.SolrResourceLoader.locateSolrHome using system property solr.solr.home: /usr/home/hudson/hudson-slave/workspace/Lucene-Solr-NightlyTests-trunk/solr/build/solr-core/test-files/solr
[junit4:junit4]   2> 49 T1721 oasc.CoreContainer$Initializer.initialize looking for solr.xml: /usr/home/hudson/hudson-slave/workspace/Lucene-Solr-NightlyTests-trunk/solr/build/solr-core/test-files/solr/solr.xml
[junit4:junit4]   2> 50 T1721 oasc.CoreContainer.<init> New CoreContainer 698137163
[junit4:junit4]   2> 50 T1721 oasc.CoreContainer.load Loading CoreContainer using Solr Home: '/usr/home/hudson/hudson-slave/workspace/Lucene-Solr-NightlyTests-trunk/solr/build/solr-core/test-files/solr/'
[junit4:junit4]   2> 51 T1721 oasc.SolrResourceLoader.<init> new SolrResourceLoader for directory: '/usr/home/hudson/hudson-slave/workspace/Lucene-Solr-NightlyTests-trunk/solr/build/solr-core/test-files/solr/'
[junit4:junit4]   2> 76 T1721 oasc.CoreContainer.load Registering Log Listener
[junit4:junit4]   2> 97 T1721 oasc.CoreContainer.create Creating SolrCore 'collection1' using instanceDir: /usr/home/hudson/hudson-slave/workspace/Lucene-Solr-NightlyTests-trunk/solr/build/solr-core/test-files/solr/collection1
[junit4:junit4]   2> 98 T1721 oasc.SolrResourceLoader.<init> new SolrResourceLoader for directory: '/usr/home/hudson/hudson-slave/workspace/Lucene-Solr-NightlyTests-trunk/solr/build/solr-core/test-files/solr/collection1/'
[junit4:junit4]   2> 99 T1721 oasc.SolrResourceLoader.replaceClassLoader Adding 'file:/usr/home/hudson/hudson-slave/workspace/Lucene-Solr-NightlyTests-trunk/solr/build/solr-core/test-files/solr/collection1/lib/classes/' to classloader
[junit4:junit4]   2> 100 T1721 oasc.SolrResourceLoader.replaceClassLoader Adding 'file:/usr/home/hudson/hudson-slave/workspace/Lucene-Solr-NightlyTests-trunk/solr/build/solr-core/test-files/solr/collection1/lib/README' to classloader
[junit4:junit4]   2> 141 T1721 oasc.SolrConfig.<init> Using Lucene MatchVersion: LUCENE_50
[junit4:junit4]   2> 203 T1721 oasc.SolrConfig.<init> Loaded SolrConfig: solrconfig-tlog.xml
[junit4:junit4]   2> 204 T1721 oass.IndexSchema.readSchema Reading Solr Schema
[junit4:junit4]   2> 211 T1721 oass.IndexSchema.readSchema Schema name=test
[junit4:junit4]   2> 809 T1721 oass.OpenExchangeRatesOrgProvider.init Initialized with rates=open-exchange-rates.json, refreshInterval=1440.
[junit4:junit4]   2> 817 T1721 oass.IndexSchema.readSchema default search field in schema is text
[junit4:junit4]   2> 820 T1721 oass.IndexSchema.readSchema unique key field: id
[junit4:junit4]   2> 827 T1721 oass.FileExchangeRateProvider.reload Reloading exchange rates from file currency.xml
[junit4:junit4]   2> 831 T1721 oass.FileExchangeRateProvider.reload Reloading exchange rates from file currency.xml
[junit4:junit4]   2> 833 T1721 oass.OpenExchangeRatesOrgProvider.reload Reloading exchange rates from open-exchange-rates.json
[junit4:junit4]   2> 834 T1721 oass.OpenExchangeRatesOrgProvider.reload Reloading exchange rates from open-exchange-rates.json
[junit4:junit4]   2> 835 T1721 oasc.SolrCore.<init> [collection1] Opening new SolrCore at /usr/home/hudson/hudson-slave/workspace/Lucene-Solr-NightlyTests-trunk/solr/build/solr-core/test-files/solr/collection1/, dataDir=./org.apache.solr.update.SolrCmdDistributorTest-1347680741211/control/data/
[junit4:junit4]   2> 835 T1721 oasc.SolrCore.<init> JMX monitoring not detected for core: collection1
[junit4:junit4]   2> 836 T1721 oasc.SolrCore.getNewIndexDir WARNING New index directory detected: old=null new=./org.apache.solr.update.SolrCmdDistributorTest-1347680741211/control/data/index/
[junit4:junit4]   2> 837 T1721 oasc.SolrCore.initIndex WARNING [collection1] Solr index directory './org.apache.solr.update.SolrCmdDistributorTest-1347680741211/control/data/index' doesn't exist. Creating new index...
[junit4:junit4]   2> 838 T1721 oasc.CachingDirectoryFactory.get return new directory for /usr/home/hudson/hudson-slave/workspace/Lucene-Solr-NightlyTests-trunk/solr/build/solr-core/test/J0/./org.apache.solr.update.SolrCmdDistributorTest-1347680741211/control/data/index forceNew:false
[junit4:junit4]   2> 840 T1721 oasc.SolrDeletionPolicy.onCommit SolrDeletionPolicy.onCommit: commits:num=1
[junit4:junit4]   2> 		commit{dir=MockDirWrapper(NRTCachingDirectory(org.apache.lucene.store.RAMDirectory@8fb77bf lockFactory=org.apache.lucene.store.NativeFSLockFactory@3708400a; maxCacheMB=0.076171875 maxMergeSizeMB=0.234375)),segFN=segments_1,generation=1,filenames=[segments_1]
[junit4:junit4]   2> 841 T1721 oasc.SolrDeletionPolicy.updateCommits newest commit = 1
[junit4:junit4]   2> 842 T1721 oasc.RequestHandlers.initHandlersFromConfig created standard: solr.StandardRequestHandler
[junit4:junit4]   2> 842 T1721 oasc.RequestHandlers.initHandlersFromConfig created /get: solr.RealTimeGetHandler
[junit4:junit4]   2> 842 T1721 oasc.RequestHandlers.initHandlersFromConfig created /update: solr.UpdateRequestHandler
[junit4:junit4]   2> 843 T1721 oasc.RequestHandlers.initHandlersFromConfig created /admin/: org.apache.solr.handler.admin.AdminHandlers
[junit4:junit4]   2> 845 T1721 oashl.XMLLoader.init xsltCacheLifetimeSeconds=60
[junit4:junit4]   2> 849 T1721 oass.SolrIndexSearcher.<init> Opening Searcher@52302653 main
[junit4:junit4]   2> 849 T1721 oass.SolrIndexSearcher.getIndexDir WARNING WARNING: Directory impl does not support setting indexDir: org.apache.lucene.store.MockDirectoryWrapper
[junit4:junit4]   2> 850 T1721 oasu.CommitTracker.<init> Hard AutoCommit: disabled
[junit4:junit4]   2> 851 T1721 oasu.CommitTracker.<init> Soft AutoCommit: disabled
[junit4:junit4]   2> 851 T1721 oashc.HttpShardHandlerFactory.getParameter Setting socketTimeout to: 0
[junit4:junit4]   2> 851 T1721 oashc.HttpShardHandlerFactory.getParameter Setting urlScheme to: http://
[junit4:junit4]   2> 852 T1721 oashc.HttpShardHandlerFactory.getParameter Setting connTimeout to: 0
[junit4:junit4]   2> 852 T1721 oashc.HttpShardHandlerFactory.getParameter Setting maxConnectionsPerHost to: 20
[junit4:junit4]   2> 852 T1721 oashc.HttpShardHandlerFactory.getParameter Setting corePoolSize to: 0
[junit4:junit4]   2> 852 T1721 oashc.HttpShardHandlerFactory.getParameter Setting maximumPoolSize to: 2147483647
[junit4:junit4]   2> 853 T1721 oashc.HttpShardHandlerFactory.getParameter Setting maxThreadIdleTime to: 5
[junit4:junit4]   2> 853 T1721 oashc.HttpShardHandlerFactory.getParameter Setting sizeOfQueue to: -1
[junit4:junit4]   2> 853 T1721 oashc.HttpShardHandlerFactory.getParameter Setting fairnessPolicy to: false
[junit4:junit4]   2> 854 T1721 oascsi.HttpClientUtil.createClient Creating new http client, config:maxConnectionsPerHost=20&maxConnections=10000&socketTimeout=0&connTimeout=0&retry=false
[junit4:junit4]   2> 865 T1731 oasc.SolrCore.registerSearcher [collection1] Registered new searcher Searcher@52302653 main{StandardDirectoryReader(segments_1:1)}
[junit4:junit4]   2> 865 T1721 oasc.CoreContainer.register registering core: collection1
[junit4:junit4]   2> 865 T1721 oass.SolrDispatchFilter.init user.dir=/usr/home/hudson/hudson-slave/workspace/Lucene-Solr-NightlyTests-trunk/solr/build/solr-core/test/J0
[junit4:junit4]   2> 866 T1721 oass.SolrDispatchFilter.init SolrDispatchFilter.init() done
[junit4:junit4]   2> 866 T1721 oascsi.HttpClientUtil.createClient Creating new http client, config:maxConnections=128&maxConnectionsPerHost=32&followRedirects=false
[junit4:junit4]   2> 874 T1721 oejs.Server.doStart jetty-8.1.2.v20120308
[junit4:junit4]   2> 876 T1721 oejs.AbstractConnector.doStart Started SocketConnector@0.0.0.0:62787
[junit4:junit4]   2> 876 T1721 oasc.SolrResourceLoader.locateSolrHome JNDI not configured for solr (NoInitialContextEx)
[junit4:junit4]   2> 877 T1721 oasc.SolrResourceLoader.locateSolrHome using system property solr.solr.home: /usr/home/hudson/hudson-slave/workspace/Lucene-Solr-NightlyTests-trunk/solr/build/solr-core/test-files/solr
[junit4:junit4]   2> 877 T1721 oasc.SolrResourceLoader.<init> new SolrResourceLoader for deduced Solr Home: '/usr/home/hudson/hudson-slave/workspace/Lucene-Solr-NightlyTests-trunk/solr/build/solr-core/test-files/solr/'
[junit4:junit4]   2> 898 T1721 oass.SolrDispatchFilter.init SolrDispatchFilter.init()
[junit4:junit4]   2> 898 T1721 oasc.SolrResourceLoader.locateSolrHome JNDI not configured for solr (NoInitialContextEx)
[junit4:junit4]   2> 899 T1721 oasc.SolrResourceLoader.locateSolrHome using system property solr.solr.home: /usr/home/hudson/hudson-slave/workspace/Lucene-Solr-NightlyTests-trunk/solr/build/solr-core/test-files/solr
[junit4:junit4]   2> 899 T1721 oasc.CoreContainer$Initializer.initialize looking for solr.xml: /usr/home/hudson/hudson-slave/workspace/Lucene-Solr-NightlyTests-trunk/solr/build/solr-core/test-files/solr/solr.xml
[junit4:junit4]   2> 899 T1721 oasc.CoreContainer.<init> New CoreContainer 956323467
[junit4:junit4]   2> 900 T1721 oasc.CoreContainer.load Loading CoreContainer using Solr Home: '/usr/home/hudson/hudson-slave/workspace/Lucene-Solr-NightlyTests-trunk/solr/build/solr-core/test-files/solr/'
[junit4:junit4]   2> 900 T1721 oasc.SolrResourceLoader.<init> new SolrResourceLoader for directory: '/usr/home/hudson/hudson-slave/workspace/Lucene-Solr-NightlyTests-trunk/solr/build/solr-core/test-files/solr/'
[junit4:junit4]   2> 916 T1721 oasc.CoreContainer.load Registering Log Listener
[junit4:junit4]   2> 929 T1721 oasc.CoreContainer.create Creating SolrCore 'collection1' using instanceDir: /usr/home/hudson/hudson-slave/workspace/Lucene-Solr-NightlyTests-trunk/solr/build/solr-core/test-files/solr/collection1
[junit4:junit4]   2> 930 T1721 oasc.SolrResourceLoader.<init> new SolrResourceLoader for directory: '/usr/home/hudson/hudson-slave/workspace/Lucene-Solr-NightlyTests-trunk/solr/build/solr-core/test-files/solr/collection1/'
[junit4:junit4]   2> 931 T1721 oasc.SolrResourceLoader.replaceClassLoader Adding 'file:/usr/home/hudson/hudson-slave/workspace/Lucene-Solr-NightlyTests-trunk/solr/build/solr-core/test-files/solr/collection1/lib/classes/' to classloader
[junit4:junit4]   2> 931 T1721 oasc.SolrResourceLoader.replaceClassLoader Adding 'file:/usr/home/hudson/hudson-slave/workspace/Lucene-Solr-NightlyTests-trunk/solr/build/solr-core/test-files/solr/collection1/lib/README' to classloader
[junit4:junit4]   2> 958 T1721 oasc.SolrConfig.<init> Using Lucene MatchVersion: LUCENE_50
[junit4:junit4]   2> 991 T1721 oasc.SolrConfig.<init> Loaded SolrConfig: solrconfig-tlog.xml
[junit4:junit4]   2> 992 T1721 oass.IndexSchema.readSchema Reading Solr Schema
[junit4:junit4]   2> 997 T1721 oass.IndexSchema.readSchema Schema name=test
[junit4:junit4]   2> 1412 T1721 oass.OpenExchangeRatesOrgProvider.init Initialized with rates=open-exchange-rates.json, refreshInterval=1440.
[junit4:junit4]   2> 1421 T1721 oass.IndexSchema.readSchema default search field in schema is text
[junit4:junit4]   2> 1424 T1721 oass.IndexSchema.readSchema unique key field: id
[junit4:junit4]   2> 1431 T1721 oass.FileExchangeRateProvider.reload Reloading exchange rates from file currency.xml
[junit4:junit4]   2> 1434 T1721 oass.FileExchangeRateProvider.reload Reloading exchange rates from file currency.xml
[junit4:junit4]   2> 1437 T1721 oass.OpenExchangeRatesOrgProvider.reload Reloading exchange rates from open-exchange-rates.json
[junit4:junit4]   2> 1437 T1721 oass.OpenExchangeRatesOrgProvider.reload Reloading exchange rates from open-exchange-rates.json
[junit4:junit4]   2> 1438 T1721 oasc.SolrCore.<init> [collection1] Opening new SolrCore at /usr/home/hudson/hudson-slave/workspace/Lucene-Solr-NightlyTests-trunk/solr/build/solr-core/test-files/solr/collection1/, dataDir=./org.apache.solr.update.SolrCmdDistributorTest-1347680741211/shard0/data/
[junit4:junit4]   2> 1438 T1721 oasc.SolrCore.<init> JMX monitoring not detected for core: collection1
[junit4:junit4]   2> 1439 T1721 oasc.SolrCore.getNewIndexDir WARNING New index directory detected: old=null new=./org.apache.solr.update.SolrCmdDistributorTest-1347680741211/shard0/data/index/
[junit4:junit4]   2> 1440 T1721 oasc.SolrCore.initIndex WARNING [collection1] Solr index directory './org.apache.solr.update.SolrCmdDistributorTest-1347680741211/shard0/data/index' doesn't exist. Creating new index...
[junit4:junit4]   2> 1440 T1721 oasc.CachingDirectoryFactory.get return new directory for /usr/home/hudson/hudson-slave/workspace/Lucene-Solr-NightlyTests-trunk/solr/build/solr-core/test/J0/./org.apache.solr.update.SolrCmdDistributorTest-1347680741211/shard0/data/index forceNew:false
[junit4:junit4]   2> 1443 T1721 oasc.SolrDeletionPolicy.onCommit SolrDeletionPolicy.onCommit: commits:num=1
[junit4:junit4]   2> 		commit{dir=MockDirWrapper(NRTCachingDirectory(org.apache.lucene.store.RAMDirectory@6d865cfe lockFactory=org.apache.lucene.store.NativeFSLockFactory@4238f637; maxCacheMB=0.40625 maxMergeSizeMB=0.255859375)),segFN=segments_1,generation=1,filenames=[segments_1]
[junit4:junit4]   2> 1443 T1721 oasc.SolrDeletionPolicy.updateCommits newest commit = 1
[junit4:junit4]   2> 1444 T1721 oasc.RequestHandlers.initHandlersFromConfig created standard: solr.StandardRequestHandler
[junit4:junit4]   2> 1444 T1721 oasc.RequestHandlers.initHandlersFromConfig created /get: solr.RealTimeGetHandler
[junit4:junit4]   2> 1445 T1721 oasc.RequestHandlers.initHandlersFromConfig created /update: solr.UpdateRequestHandler
[junit4:junit4]   2> 1445 T1721 oasc.RequestHandlers.initHandlersFromConfig created /admin/: org.apache.solr.handler.admin.AdminHandlers
[junit4:junit4]   2> 1447 T1721 oashl.XMLLoader.init xsltCacheLifetimeSeconds=60
[junit4:junit4]   2> 1451 T1721 oass.SolrIndexSearcher.<init> Opening Searcher@6e688311 main
[junit4:junit4]   2> 1452 T1721 oass.SolrIndexSearcher.getIndexDir WARNING WARNING: Directory impl does not support setting indexDir: org.apache.lucene.store.MockDirectoryWrapper
[junit4:junit4]   2> 1452 T1721 oasu.CommitTracker.<init> Hard AutoCommit: disabled
[junit4:junit4]   2> 1453 T1721 oasu.CommitTracker.<init> Soft AutoCommit: disabled
[junit4:junit4]   2> 1453 T1721 oashc.HttpShardHandlerFactory.getParameter Setting socketTimeout to: 0
[junit4:junit4]   2> 1453 T1721 oashc.HttpShardHandlerFactory.getParameter Setting urlScheme to: http://
[junit4:junit4]   2> 1454 T1721 oashc.HttpShardHandlerFactory.getParameter Setting connTimeout to: 0
[junit4:junit4]   2> 1454 T1721 oashc.HttpShardHandlerFactory.getParameter Setting maxConnectionsPerHost to: 20
[junit4:junit4]   2> 1454 T1721 oashc.HttpShardHandlerFactory.getParameter Setting corePoolSize to: 0
[junit4:junit4]   2> 1455 T1721 oashc.HttpShardHandlerFactory.getParameter Setting maximumPoolSize to: 2147483647
[junit4:junit4]   2> 1455 T1721 oashc.HttpShardHandlerFactory.getParameter Setting maxThreadIdleTime to: 5
[junit4:junit4]   2> 1455 T1721 oashc.HttpShardHandlerFactory.getParameter Setting sizeOfQueue to: -1
[junit4:junit4]   2> 1455 T1721 oashc.HttpShardHandlerFactory.getParameter Setting fairnessPolicy to: false
[junit4:junit4]   2> 1456 T1721 oascsi.HttpClientUtil.createClient Creating new http client, config:maxConnectionsPerHost=20&maxConnections=10000&socketTimeout=0&connTimeout=0&retry=false
[junit4:junit4]   2> 1467 T1721 oasc.CoreContainer.register registering core: collection1
[junit4:junit4]   2> 1467 T1741 oasc.SolrCore.registerSearcher [collection1] Registered new searcher Searcher@6e688311 main{StandardDirectoryReader(segments_1:1)}
[junit4:junit4]   2> 1467 T1721 oass.SolrDispatchFilter.init user.dir=/usr/home/hudson/hudson-slave/workspace/Lucene-Solr-NightlyTests-trunk/solr/build/solr-core/test/J0
[junit4:junit4]   2> 1468 T1721 oass.SolrDispatchFilter.init SolrDispatchFilter.init() done
[junit4:junit4]   2> 1468 T1721 oascsi.HttpClientUtil.createClient Creating new http client, config:maxConnections=128&maxConnectionsPerHost=32&followRedirects=false
[junit4:junit4]   2> 1477 T1721 oejs.Server.doStart jetty-8.1.2.v20120308
[junit4:junit4]   2> 1478 T1721 oejs.AbstractConnector.doStart Started SocketConnector@0.0.0.0:62789
[junit4:junit4]   2> 1479 T1721 oasc.SolrResourceLoader.locateSolrHome JNDI not configured for solr (NoInitialContextEx)
[junit4:junit4]   2> 1479 T1721 oasc.SolrResourceLoader.locateSolrHome using system property solr.solr.home: /usr/home/hudson/hudson-slave/workspace/Lucene-Solr-NightlyTests-trunk/solr/build/solr-core/test-files/solr
[junit4:junit4]   2> 1479 T1721 oasc.SolrResourceLoader.<init> new SolrResourceLoader for deduced Solr Home: '/usr/home/hudson/hudson-slave/workspace/Lucene-Solr-NightlyTests-trunk/solr/build/solr-core/test-files/solr/'
[junit4:junit4]   2> 1502 T1721 oass.SolrDispatchFilter.init SolrDispatchFilter.init()
[junit4:junit4]   2> 1502 T1721 oasc.SolrResourceLoader.locateSolrHome JNDI not configured for solr (NoInitialContextEx)
[junit4:junit4]   2> 1503 T1721 oasc.SolrResourceLoader.locateSolrHome using system property solr.solr.home: /usr/home/hudson/hudson-slave/workspace/Lucene-Solr-NightlyTests-trunk/solr/build/solr-core/test-files/solr
[junit4:junit4]   2> 1503 T1721 oasc.CoreContainer$Initializer.initialize looking for solr.xml: /usr/home/hudson/hudson-slave/workspace/Lucene-Solr-NightlyTests-trunk/solr/build/solr-core/test-files/solr/solr.xml
[junit4:junit4]   2> 1503 T1721 oasc.CoreContainer.<init> New CoreContainer 2122784689
[junit4:junit4]   2> 1504 T1721 oasc.CoreContainer.load Loading CoreContainer using Solr Home: '/usr/home/hudson/hudson-slave/workspace/Lucene-Solr-NightlyTests-trunk/solr/build/solr-core/test-files/solr/'
[junit4:junit4]   2> 1504 T1721 oasc.SolrResourceLoader.<init> new SolrResourceLoader for directory: '/usr/home/hudson/hudson-slave/workspace/Lucene-Solr-NightlyTests-trunk/solr/build/solr-core/test-files/solr/'
[junit4:junit4]   2> 1520 T1721 oasc.CoreContainer.load Registering Log Listener
[junit4:junit4]   2> 1534 T1721 oasc.CoreContainer.create Creating SolrCore 'collection1' using instanceDir: /usr/home/hudson/hudson-slave/workspace/Lucene-Solr-NightlyTests-trunk/solr/build/solr-core/test-files/solr/collection1
[junit4:junit4]   2> 1534 T1721 oasc.SolrResourceLoader.<init> new SolrResourceLoader for directory: '/usr/home/hudson/hudson-slave/workspace/Lucene-Solr-NightlyTests-trunk/solr/build/solr-core/test-files/solr/collection1/'
[junit4:junit4]   2> 1535 T1721 oasc.SolrResourceLoader.replaceClassLoader Adding 'file:/usr/home/hudson/hudson-slave/workspace/Lucene-Solr-NightlyTests-trunk/solr/build/solr-core/test-files/solr/collection1/lib/classes/' to classloader
[junit4:junit4]   2> 1536 T1721 oasc.SolrResourceLoader.replaceClassLoader Adding 'file:/usr/home/hudson/hudson-slave/workspace/Lucene-Solr-NightlyTests-trunk/solr/build/solr-core/test-files/solr/collection1/lib/README' to classloader
[junit4:junit4]   2> 1563 T1721 oasc.SolrConfig.<init> Using Lucene MatchVersion: LUCENE_50
[junit4:junit4]   2> 1596 T1721 oasc.SolrConfig.<init> Loaded SolrConfig: solrconfig-tlog.xml
[junit4:junit4]   2> 1597 T1721 oass.IndexSchema.readSchema Reading Solr Schema
[junit4:junit4]   2> 1602 T1721 oass.IndexSchema.readSchema Schema name=test
[junit4:junit4]   2> 2017 T1721 oass.OpenExchangeRatesOrgProvider.init Initialized with rates=open-exchange-rates.json, refreshInterval=1440.
[junit4:junit4]   2> 2025 T1721 oass.IndexSchema.readSchema default search field in schema is text
[junit4:junit4]   2> 2028 T1721 oass.IndexSchema.readSchema unique key field: id
[junit4:junit4]   2> 2035 T1721 oass.FileExchangeRateProvider.reload Reloading exchange rates from file currency.xml
[junit4:junit4]   2> 2038 T1721 oass.FileExchangeRateProvider.reload Reloading exchange rates from file currency.xml
[junit4:junit4]   2> 2041 T1721 oass.OpenExchangeRatesOrgProvider.reload Reloading exchange rates from open-exchange-rates.json
[junit4:junit4]   2> 2041 T1721 oass.OpenExchangeRatesOrgProvider.reload Reloading exchange rates from open-exchange-rates.json
[junit4:junit4]   2> 2042 T1721 oasc.SolrCore.<init> [collection1] Opening new SolrCore at /usr/home/hudson/hudson-slave/workspace/Lucene-Solr-NightlyTests-trunk/solr/build/solr-core/test-files/solr/collection1/, dataDir=./org.apache.solr.update.SolrCmdDistributorTest-1347680741211/shard1/data/
[junit4:junit4]   2> 2042 T1721 oasc.SolrCore.<init> JMX monitoring not detected for core: collection1
[junit4:junit4]   2> 2043 T1721 oasc.SolrCore.getNewIndexDir WARNING New index directory detected: old=null new=./org.apache.solr.update.SolrCmdDistributorTest-1347680741211/shard1/data/index/
[junit4:junit4]   2> 2044 T1721 oasc.SolrCore.initIndex WARNING [collection1] Solr index directory './org.apache.solr.update.SolrCmdDistributorTest-1347680741211/shard1/data/index' doesn't exist. Creating new index...
[junit4:junit4]   2> 2048 T1721 oasc.CachingDirectoryFactory.get return new directory for /usr/home/hudson/hudson-slave/workspace/Lucene-Solr-NightlyTests-trunk/solr/build/solr-core/test/J0/./org.apache.solr.update.SolrCmdDistributorTest-1347680741211/shard1/data/index forceNew:false
[junit4:junit4]   2> 2050 T1721 oasc.SolrDeletionPolicy.onCommit SolrDeletionPolicy.onCommit: commits:num=1
[junit4:junit4]   2> 		commit{dir=MockDirWrapper(org.apache.lucene.store.RAMDirectory@44296e84 lockFactory=org.apache.lucene.store.NativeFSLockFactory@2ec04de9),segFN=segments_1,generation=1,filenames=[segments_1]
[junit4:junit4]   2> 2051 T1721 oasc.SolrDeletionPolicy.updateCommits newest commit = 1
[junit4:junit4]   2> 2052 T1721 oasc.RequestHandlers.initHandlersFromConfig created standard: solr.StandardRequestHandler
[junit4:junit4]   2> 2053 T1721 oasc.RequestHandlers.initHandlersFromConfig created /get: solr.RealTimeGetHandler
[junit4:junit4]   2> 2053 T1721 oasc.RequestHandlers.initHandlersFromConfig created /update: solr.UpdateRequestHandler
[junit4:junit4]   2> 2053 T1721 oasc.RequestHandlers.initHandlersFromConfig created /admin/: org.apache.solr.handler.admin.AdminHandlers
[junit4:junit4]   2> 2057 T1721 oashl.XMLLoader.init xsltCacheLifetimeSeconds=60
[junit4:junit4]   2> 2062 T1721 oass.SolrIndexSearcher.<init> Opening Searcher@4c54dfb2 main
[junit4:junit4]   2> 2062 T1721 oass.SolrIndexSearcher.getIndexDir WARNING WARNING: Directory impl does not support setting indexDir: org.apache.lucene.store.MockDirectoryWrapper
[junit4:junit4]   2> 2063 T1721 oasu.CommitTracker.<init> Hard AutoCommit: disabled
[junit4:junit4]   2> 2064 T1721 oasu.CommitTracker.<init> Soft AutoCommit: disabled
[junit4:junit4]   2> 2064 T1721 oashc.HttpShardHandlerFactory.getParameter Setting socketTimeout to: 0
[junit4:junit4]   2> 2064 T1721 oashc.HttpShardHandlerFactory.getParameter Setting urlScheme to: http://
[junit4:junit4]   2> 2064 T1721 oashc.HttpShardHandlerFactory.getParameter Setting connTimeout to: 0
[junit4:junit4]   2> 2065 T1721 oashc.HttpShardHandlerFactory.getParameter Setting maxConnectionsPerHost to: 20
[junit4:junit4]   2> 2065 T1721 oashc.HttpShardHandlerFactory.getParameter Setting corePoolSize to: 0
[junit4:junit4]   2> 2065 T1721 oashc.HttpShardHandlerFactory.getParameter Setting maximumPoolSize to: 2147483647
[junit4:junit4]   2> 2066 T1721 oashc.HttpShardHandlerFactory.getParameter Setting maxThreadIdleTime to: 5
[junit4:junit4]   2> 2066 T1721 oashc.HttpShardHandlerFactory.getParameter Setting sizeOfQueue to: -1
[junit4:junit4]   2> 2066 T1721 oashc.HttpShardHandlerFactory.getParameter Setting fairnessPolicy to: false
[junit4:junit4]   2> 2066 T1721 oascsi.HttpClientUtil.createClient Creating new http client, config:maxConnectionsPerHost=20&maxConnections=10000&socketTimeout=0&connTimeout=0&retry=false
[junit4:junit4]   2> 2079 T1751 oasc.SolrCore.registerSearcher [collection1] Registered new searcher Searcher@4c54dfb2 main{StandardDirectoryReader(segments_1:1)}
[junit4:junit4]   2> 2079 T1721 oasc.CoreContainer.register registering core: collection1
[junit4:junit4]   2> 2080 T1721 oass.SolrDispatchFilter.init user.dir=/usr/home/hudson/hudson-slave/workspace/Lucene-Solr-NightlyTests-trunk/solr/build/solr-core/test/J0
[junit4:junit4]   2> 2080 T1721 oass.SolrDispatchFilter.init SolrDispatchFilter.init() done
[junit4:junit4]   2> 2080 T1721 oascsi.HttpClientUtil.createClient Creating new http client, config:maxConnections=128&maxConnectionsPerHost=32&followRedirects=false
[junit4:junit4]   2> 2089 T1721 oejs.Server.doStart jetty-8.1.2.v20120308
[junit4:junit4]   2> 2091 T1721 oejs.AbstractConnector.doStart Started SocketConnector@0.0.0.0:62791
[junit4:junit4]   2> 2091 T1721 oasc.SolrResourceLoader.locateSolrHome JNDI not configured for solr (NoInitialContextEx)
[junit4:junit4]   2> 2092 T1721 oasc.SolrResourceLoader.locateSolrHome using system property solr.solr.home: /usr/home/hudson/hudson-slave/workspace/Lucene-Solr-NightlyTests-trunk/solr/build/solr-core/test-files/solr
[junit4:junit4]   2> 2092 T1721 oasc.SolrResourceLoader.<init> new SolrResourceLoader for deduced Solr Home: '/usr/home/hudson/hudson-slave/workspace/Lucene-Solr-NightlyTests-trunk/solr/build/solr-core/test-files/solr/'
[junit4:junit4]   2> 2118 T1721 oass.SolrDispatchFilter.init SolrDispatchFilter.init()
[junit4:junit4]   2> 2119 T1721 oasc.SolrResourceLoader.locateSolrHome JNDI not configured for solr (NoInitialContextEx)
[junit4:junit4]   2> 2119 T1721 oasc.SolrResourceLoader.locateSolrHome using system property solr.solr.home: /usr/home/hudson/hudson-slave/workspace/Lucene-Solr-NightlyTests-trunk/solr/build/solr-core/test-files/solr
[junit4:junit4]   2> 2119 T1721 oasc.CoreContainer$Initializer.initialize looking for solr.xml: /usr/home/hudson/hudson-slave/workspace/Lucene-Solr-NightlyTests-trunk/solr/build/solr-core/test-files/solr/solr.xml
[junit4:junit4]   2> 2120 T1721 oasc.CoreContainer.<init> New CoreContainer 828538966
[junit4:junit4]   2> 2120 T1721 oasc.CoreContainer.load Loading CoreContainer using Solr Home: '/usr/home/hudson/hudson-slave/workspace/Lucene-Solr-NightlyTests-trunk/solr/build/solr-core/test-files/solr/'
[junit4:junit4]   2> 2120 T1721 oasc.SolrResourceLoader.<init> new SolrResourceLoader for directory: '/usr/home/hudson/hudson-slave/workspace/Lucene-Solr-NightlyTests-trunk/solr/build/solr-core/test-files/solr/'
[junit4:junit4]   2> 2141 T1721 oasc.CoreContainer.load Registering Log Listener
[junit4:junit4]   2> 2158 T1721 oasc.CoreContainer.create Creating SolrCore 'collection1' using instanceDir: /usr/home/hudson/hudson-slave/workspace/Lucene-Solr-NightlyTests-trunk/solr/build/solr-core/test-files/solr/collection1
[junit4:junit4]   2> 2159 T1721 oasc.SolrResourceLoader.<init> new SolrResourceLoader for directory: '/usr/home/hudson/hudson-slave/workspace/Lucene-Solr-NightlyTests-trunk/solr/build/solr-core/test-files/solr/collection1/'
[junit4:junit4]   2> 2160 T1721 oasc.SolrResourceLoader.replaceClassLoader Adding 'file:/usr/home/hudson/hudson-slave/workspace/Lucene-Solr-NightlyTests-trunk/solr/build/solr-core/test-files/solr/collection1/lib/classes/' to classloader
[junit4:junit4]   2> 2161 T1721 oasc.SolrResourceLoader.replaceClassLoader Adding 'file:/usr/home/hudson/hudson-slave/workspace/Lucene-Solr-NightlyTests-trunk/solr/build/solr-core/test-files/solr/collection1/lib/README' to classloader
[junit4:junit4]   2> 2190 T1721 oasc.SolrConfig.<init> Using Lucene MatchVersion: LUCENE_50
[junit4:junit4]   2> 2226 T1721 oasc.SolrConfig.<init> Loaded SolrConfig: solrconfig-tlog.xml
[junit4:junit4]   2> 2227 T1721 oass.IndexSchema.readSchema Reading Solr Schema
[junit4:junit4]   2> 2233 T1721 oass.IndexSchema.readSchema Schema name=test
[junit4:junit4]   2> 2682 T1721 oass.OpenExchangeRatesOrgProvider.init Initialized with rates=open-exchange-rates.json, refreshInterval=1440.
[junit4:junit4]   2> 2690 T1721 oass.IndexSchema.readSchema default search field in schema is text
[junit4:junit4]   2> 2693 T1721 oass.IndexSchema.readSchema unique key field: id
[junit4:junit4]   2> 2700 T1721 oass.FileExchangeRateProvider.reload Reloading exchange rates from file currency.xml
[junit4:junit4]   2> 2703 T1721 oass.FileExchangeRateProvider.reload Reloading exchange rates from file currency.xml
[junit4:junit4]   2> 2706 T1721 oass.OpenExchangeRatesOrgProvider.reload Reloading exchange rates from open-exchange-rates.json
[junit4:junit4]   2> 2707 T1721 oass.OpenExchangeRatesOrgProvider.reload Reloading exchange rates from open-exchange-rates.json
[junit4:junit4]   2> 2707 T1721 oasc.SolrCore.<init> [collection1] Opening new SolrCore at /usr/home/hudson/hudson-slave/workspace/Lucene-Solr-NightlyTests-trunk/solr/build/solr-core/test-files/solr/collection1/, dataDir=./org.apache.solr.update.SolrCmdDistributorTest-1347680741211/shard2/data/
[junit4:junit4]   2> 2707 T1721 oasc.SolrCore.<init> JMX monitoring not detected for core: collection1
[junit4:junit4]   2> 2708 T1721 oasc.SolrCore.getNewIndexDir WARNING New index directory detected: old=null new=./org.apache.solr.update.SolrCmdDistributorTest-1347680741211/shard2/data/index/
[junit4:junit4]   2> 2709 T1721 oasc.SolrCore.initIndex WARNING [collection1] Solr index directory './org.apache.solr.update.SolrCmdDistributorTest-1347680741211/shard2/data/index' doesn't exist. Creating new index...
[junit4:junit4]   2> 2709 T1721 oasc.CachingDirectoryFactory.get return new directory for /usr/home/hudson/hudson-slave/workspace/Lucene-Solr-NightlyTests-trunk/solr/build/solr-core/test/J0/./org.apache.solr.update.SolrCmdDistributorTest-1347680741211/shard2/data/index forceNew:false
[junit4:junit4]   2> 2712 T1721 oasc.SolrDeletionPolicy.onCommit SolrDeletionPolicy.onCommit: commits:num=1
[junit4:junit4]   2> 		commit{dir=MockDirWrapper(NRTCachingDirectory(org.apache.lucene.store.RAMDirectory@4c6314ef lockFactory=org.apache.lucene.store.NativeFSLockFactory@43409410; maxCacheMB=0.3125 maxMergeSizeMB=0.6728515625)),segFN=segments_1,generation=1,filenames=[segments_1]
[junit4:junit4]   2> 2712 T1721 oasc.SolrDeletionPolicy.updateCommits newest commit = 1
[junit4:junit4]   2> 2713 T1721 oasc.RequestHandlers.initHandlersFromConfig created standard: solr.StandardRequestHandler
[junit4:junit4]   2> 2713 T1721 oasc.RequestHandlers.initHandlersFromConfig created /get: solr.RealTimeGetHandler
[junit4:junit4]   2> 2714 T1721 oasc.RequestHandlers.initHandlersFromConfig created /update: solr.UpdateRequestHandler
[junit4:junit4]   2> 2714 T1721 oasc.RequestHandlers.initHandlersFromConfig created /admin/: org.apache.solr.handler.admin.AdminHandlers
[junit4:junit4]   2> 2716 T1721 oashl.XMLLoader.init xsltCacheLifetimeSeconds=60
[junit4:junit4]   2> 2721 T1721 oass.SolrIndexSearcher.<init> Opening Searcher@56bf9cc4 main
[junit4:junit4]   2> 2721 T1721 oass.SolrIndexSearcher.getIndexDir WARNING WARNING: Directory impl does not support setting indexDir: org.apache.lucene.store.MockDirectoryWrapper
[junit4:junit4]   2> 2722 T1721 oasu.CommitTracker.<init> Hard AutoCommit: disabled
[junit4:junit4]   2> 2722 T1721 oasu.CommitTracker.<init> Soft AutoCommit: disabled
[junit4:junit4]   2> 2722 T1721 oashc.HttpShardHandlerFactory.getParameter Setting socketTimeout to: 0
[junit4:junit4]   2> 2723 T1721 oashc.HttpShardHandlerFactory.getParameter Setting urlScheme to: http://
[junit4:junit4]   2> 2723 T1721 oashc.HttpShardHandlerFactory.getParameter Setting connTimeout to: 0
[junit4:junit4]   2> 2723 T1721 oashc.HttpShardHandlerFactory.getParameter Setting maxConnectionsPerHost to: 20
[junit4:junit4]   2> 2724 T1721 oashc.HttpShardHandlerFactory.getParameter Setting corePoolSize to: 0
[junit4:junit4]   2> 2724 T1721 oashc.HttpShardHandlerFactory.getParameter Setting maximumPoolSize to: 2147483647
[junit4:junit4]   2> 2724 T1721 oashc.HttpShardHandlerFactory.getParameter Setting maxThreadIdleTime to: 5
[junit4:junit4]   2> 2724 T1721 oashc.HttpShardHandlerFactory.getParameter Setting sizeOfQueue to: -1
[junit4:junit4]   2> 2725 T1721 oashc.HttpShardHandlerFactory.getParameter Setting fairnessPolicy to: false
[junit4:junit4]   2> 2725 T1721 oascsi.HttpClientUtil.createClient Creating new http client, config:maxConnectionsPerHost=20&maxConnections=10000&socketTimeout=0&connTimeout=0&retry=false
[junit4:junit4]   2> 2735 T1721 oasc.CoreContainer.register registering core: collection1
[junit4:junit4]   2> 2735 T1761 oasc.SolrCore.registerSearcher [collection1] Registered new searcher Searcher@56bf9cc4 main{StandardDirectoryReader(segments_1:1)}
[junit4:junit4]   2> 2735 T1721 oass.SolrDispatchFilter.init user.dir=/usr/home/hudson/hudson-slave/workspace/Lucene-Solr-NightlyTests-trunk/solr/build/solr-core/test/J0
[junit4:junit4]   2> 2736 T1721 oass.SolrDispatchFilter.init SolrDispatchFilter.init() done
[junit4:junit4]   2> 2736 T1721 oascsi.HttpClientUtil.createClient Creating new http client, config:maxConnections=128&maxConnectionsPerHost=32&followRedirects=false
[junit4:junit4]   2> 2743 T1721 oejs.Server.doStart jetty-8.1.2.v20120308
[junit4:junit4]   2> 2745 T1721 oejs.AbstractConnector.doStart Started SocketConnector@0.0.0.0:62793
[junit4:junit4]   2> 2746 T1721 oasc.SolrResourceLoader.locateSolrHome JNDI not configured for solr (NoInitialContextEx)
[junit4:junit4]   2> 2746 T1721 oasc.SolrResourceLoader.locateSolrHome using system property solr.solr.home: /usr/home/hudson/hudson-slave/workspace/Lucene-Solr-NightlyTests-trunk/solr/build/solr-core/test-files/solr
[junit4:junit4]   2> 2746 T1721 oasc.SolrResourceLoader.<init> new SolrResourceLoader for deduced Solr Home: '/usr/home/hudson/hudson-slave/workspace/Lucene-Solr-NightlyTests-trunk/solr/build/solr-core/test-files/solr/'
[junit4:junit4]   2> 2767 T1721 oass.SolrDispatchFilter.init SolrDispatchFilter.init()
[junit4:junit4]   2> 2768 T1721 oasc.SolrResourceLoader.locateSolrHome JNDI not configured for solr (NoInitialContextEx)
[junit4:junit4]   2> 2768 T1721 oasc.SolrResourceLoader.locateSolrHome using system property solr.solr.home: /usr/home/hudson/hudson-slave/workspace/Lucene-Solr-NightlyTests-trunk/solr/build/solr-core/test-files/solr
[junit4:junit4]   2> 2768 T1721 oasc.CoreContainer$Initializer.initialize looking for solr.xml: /usr/home/hudson/hudson-slave/workspace/Lucene-Solr-NightlyTests-trunk/solr/build/solr-core/test-files/solr/solr.xml
[junit4:junit4]   2> 2768 T1721 oasc.CoreContainer.<init> New CoreContainer 1525891511
[junit4:junit4]   2> 2769 T1721 oasc.CoreContainer.load Loading CoreContainer using Solr Home: '/usr/home/hudson/hudson-slave/workspace/Lucene-Solr-NightlyTests-trunk/solr/build/solr-core/test-files/solr/'
[junit4:junit4]   2> 2769 T1721 oasc.SolrResourceLoader.<init> new SolrResourceLoader for directory: '/usr/home/hudson/hudson-slave/workspace/Lucene-Solr-NightlyTests-trunk/solr/build/solr-core/test-files/solr/'
[junit4:junit4]   2> 2792 T1721 oasc.CoreContainer.load Registering Log Listener
[junit4:junit4]   2> 2812 T1721 oasc.CoreContainer.create Creating SolrCore 'collection1' using instanceDir: /usr/home/hudson/hudson-slave/workspace/Lucene-Solr-NightlyTests-trunk/solr/build/solr-core/test-files/solr/collection1
[junit4:junit4]   2> 2813 T1721 oasc.SolrResourceLoader.<init> new SolrResourceLoader for directory: '/usr/home/hudson/hudson-slave/workspace/Lucene-Solr-NightlyTests-trunk/solr/build/solr-core/test-files/solr/collection1/'
[junit4:junit4]   2> 2814 T1721 oasc.SolrResourceLoader.replaceClassLoader Adding 'file:/usr/home/hudson/hudson-slave/workspace/Lucene-Solr-NightlyTests-trunk/solr/build/solr-core/test-files/solr/collection1/lib/classes/' to classloader
[junit4:junit4]   2> 2815 T1721 oasc.SolrResourceLoader.replaceClassLoader Adding 'file:/usr/home/hudson/hudson-slave/workspace/Lucene-Solr-NightlyTests-trunk/solr/build/solr-core/test-files/solr/collection1/lib/README' to classloader
[junit4:junit4]   2> 2856 T1721 oasc.SolrConfig.<init> Using Lucene MatchVersion: LUCENE_50
[junit4:junit4]   2> 2905 T1721 oasc.SolrConfig.<init> Loaded SolrConfig: solrconfig-tlog.xml
[junit4:junit4]   2> 2907 T1721 oass.IndexSchema.readSchema Reading Solr Schema
[junit4:junit4]   2> 2913 T1721 oass.IndexSchema.readSchema Schema name=test
[junit4:junit4]   2> 3536 T1721 oass.OpenExchangeRatesOrgProvider.init Initialized with rates=open-exchange-rates.json, refreshInterval=1440.
[junit4:junit4]   2> 3549 T1721 oass.IndexSchema.readSchema default search field in schema is text
[junit4:junit4]   2> 3554 T1721 oass.IndexSchema.readSchema unique key field: id
[junit4:junit4]   2> 3564 T1721 oass.FileExchangeRateProvider.reload Reloading exchange rates from file currency.xml
[junit4:junit4]   2> 3568 T1721 oass.FileExchangeRateProvider.reload Reloading exchange rates from file currency.xml
[junit4:junit4]   2> 3573 T1721 oass.OpenExchangeRatesOrgProvider.reload Reloading exchange rates from open-exchange-rates.json
[junit4:junit4]   2> 3574 T1721 oass.OpenExchangeRatesOrgProvider.reload Reloading exchange rates from open-exchange-rates.json
[junit4:junit4]   2> 3574 T1721 oasc.SolrCore.<init> [collection1] Opening new SolrCore at /usr/home/hudson/hudson-slave/workspace/Lucene-Solr-NightlyTests-trunk/solr/build/solr-core/test-files/solr/collection1/, dataDir=./org.apache.solr.update.SolrCmdDistributorTest-1347680741211/shard3/data/
[junit4:junit4]   2> 3575 T1721 oasc.SolrCore.<init> JMX monitoring not detected for core: collection1
[junit4:junit4]   2> 3576 T1721 oasc.SolrCore.getNewIndexDir WARNING New index directory detected: old=null new=./org.apache.solr.update.SolrCmdDistributorTest-1347680741211/shard3/data/index/
[junit4:junit4]   2> 3577 T1721 oasc.SolrCore.initIndex WARNING [collection1] Solr index directory './org.apache.solr.update.SolrCmdDistributorTest-1347680741211/shard3/data/index' doesn't exist. Creating new index...
[junit4:junit4]   2> 3578 T1721 oasc.CachingDirectoryFactory.get return new directory for /usr/home/hudson/hudson-slave/workspace/Lucene-Solr-NightlyTests-trunk/solr/build/solr-core/test/J0/./org.apache.solr.update.SolrCmdDistributorTest-1347680741211/shard3/data/index forceNew:false
[junit4:junit4]   2> 3581 T1721 oasc.SolrDeletionPolicy.onCommit SolrDeletionPolicy.onCommit: commits:num=1
[junit4:junit4]   2> 		commit{dir=BaseDirectoryWrapper(org.apache.lucene.store.RAMDirectory@314db005 lockFactory=org.apache.lucene.store.NativeFSLockFactory@7eae114b),segFN=segments_1,generation=1,filenames=[segments_1]
[junit4:junit4]   2> 3582 T1721 oasc.SolrDeletionPolicy.updateCommits newest commit = 1
[junit4:junit4]   2> 3583 T1721 oasc.RequestHandlers.initHandlersFromConfig created standard: solr.StandardRequestHandler
[junit4:junit4]   2> 3583 T1721 oasc.RequestHandlers.initHandlersFromConfig created /get: solr.RealTimeGetHandler
[junit4:junit4]   2> 3584 T1721 oasc.RequestHandlers.initHandlersFromConfig created /update: solr.UpdateRequestHandler
[junit4:junit4]   2> 3584 T1721 oasc.RequestHandlers.initHandlersFromConfig created /admin/: org.apache.solr.handler.admin.AdminHandlers
[junit4:junit4]   2> 3588 T1721 oashl.XMLLoader.init xsltCacheLifetimeSeconds=60
[junit4:junit4]   2> 3594 T1721 oass.SolrIndexSearcher.<init> Opening Searcher@3a1486eb main
[junit4:junit4]   2> 3595 T1721 oass.SolrIndexSearcher.getIndexDir WARNING WARNING: Directory impl does not support setting indexDir: org.apache.lucene.store.BaseDirectoryWrapper
[junit4:junit4]   2> 3596 T1721 oasu.CommitTracker.<init> Hard AutoCommit: disabled
[junit4:junit4]   2> 3597 T1721 oasu.CommitTracker.<init> Soft AutoCommit: disabled
[junit4:junit4]   2> 3597 T1721 oashc.HttpShardHandlerFactory.getParameter Setting socketTimeout to: 0
[junit4:junit4]   2> 3598 T1721 oashc.HttpShardHandlerFactory.getParameter Setting urlScheme to: http://
[junit4:junit4]   2> 3598 T1721 oashc.HttpShardHandlerFactory.getParameter Setting connTimeout to: 0
[junit4:junit4]   2> 3598 T1721 oashc.HttpShardHandlerFactory.getParameter Setting maxConnectionsPerHost to: 20
[junit4:junit4]   2> 3599 T1721 oashc.HttpShardHandlerFactory.getParameter Setting corePoolSize to: 0
[junit4:junit4]   2> 3599 T1721 oashc.HttpShardHandlerFactory.getParameter Setting maximumPoolSize to: 2147483647
[junit4:junit4]   2> 3600 T1721 oashc.HttpShardHandlerFactory.getParameter Setting maxThreadIdleTime to: 5
[junit4:junit4]   2> 3600 T1721 oashc.HttpShardHandlerFactory.getParameter Setting sizeOfQueue to: -1
[junit4:junit4]   2> 3601 T1721 oashc.HttpShardHandlerFactory.getParameter Setting fairnessPolicy to: false
[junit4:junit4]   2> 3601 T1721 oascsi.HttpClientUtil.createClient Creating new http client, config:maxConnectionsPerHost=20&maxConnections=10000&socketTimeout=0&connTimeout=0&retry=false
[junit4:junit4]   2> 3616 T1771 oasc.SolrCore.registerSearcher [collection1] Registered new searcher Searcher@3a1486eb main{StandardDirectoryReader(segments_1:1)}
[junit4:junit4]   2> 3616 T1721 oasc.CoreContainer.register registering core: collection1
[junit4:junit4]   2> 3617 T1721 oass.SolrDispatchFilter.init user.dir=/usr/home/hudson/hudson-slave/workspace/Lucene-Solr-NightlyTests-trunk/solr/build/solr-core/test/J0
[junit4:junit4]   2> 3617 T1721 oass.SolrDispatchFilter.init SolrDispatchFilter.init() done
[junit4:junit4]   2> 3618 T1721 oascsi.HttpClientUtil.createClient Creating new http client, config:maxConnections=128&maxConnectionsPerHost=32&followRedirects=false
[junit4:junit4]   2> ASYNC  NEW_CORE C63 name=collection1 org.apache.solr.core.SolrCore@1f295ba9
[junit4:junit4]   2> 3636 T1724 C63 oasc.SolrDeletionPolicy.onInit SolrDeletionPolicy.onInit: commits:num=1
[junit4:junit4]   2> 		commit{dir=MockDirWrapper(NRTCachingDirectory(org.apache.lucene.store.RAMDirectory@8fb77bf lockFactory=org.apache.lucene.store.NativeFSLockFactory@3708400a; maxCacheMB=0.076171875 maxMergeSizeMB=0.234375)),segFN=segments_1,generation=1,filenames=[segments_1]
[junit4:junit4]   2> 3636 T1724 C63 oasc.SolrDeletionPolicy.updateCommits newest commit = 1
[junit4:junit4]   2> 3638 T1724 C63 oass.SolrIndexSearcher.<init> Opening Searcher@64bfa061 realtime
[junit4:junit4]   2> 3638 T1724 C63 oass.SolrIndexSearcher.getIndexDir WARNING WARNING: Directory impl does not support setting indexDir: org.apache.lucene.store.MockDirectoryWrapper
[junit4:junit4]   2> 3639 T1724 C63 UPDATE [collection1] webapp=/solr path=/update params={wt=javabin&version=2} {deleteByQuery=*:* (-1413145684702396416)} 0 6
[junit4:junit4]   2> ASYNC  NEW_CORE C64 name=collection1 org.apache.solr.core.SolrCore@77766b86
[junit4:junit4]   2> 3648 T1734 C64 oasc.SolrDeletionPolicy.onInit SolrDeletionPolicy.onInit: commits:num=1
[junit4:junit4]   2> 		commit{dir=MockDirWrapper(NRTCachingDirectory(org.apache.lucene.store.RAMDirectory@6d865cfe lockFactory=org.apache.lucene.store.NativeFSLockFactory@4238f637; maxCacheMB=0.40625 maxMergeSizeMB=0.255859375)),segFN=segments_1,generation=1,filenames=[segments_1]
[junit4:junit4]   2> 3649 T1734 C64 oasc.SolrDeletionPolicy.updateCommits newest commit = 1
[junit4:junit4]   2> 3650 T1734 C64 oass.SolrIndexSearcher.<init> Opening Searcher@67c50662 realtime
[junit4:junit4]   2> 3651 T1734 C64 oass.SolrIndexSearcher.getIndexDir WARNING WARNING: Directory impl does not support setting indexDir: org.apache.lucene.store.MockDirectoryWrapper
[junit4:junit4]   2> 3651 T1734 C64 UPDATE [collection1] webapp=/solr path=/update params={wt=javabin&version=2} {deleteByQuery=*:* (-1413145684716027904)} 0 6
[junit4:junit4]   2> ASYNC  NEW_CORE C65 name=collection1 org.apache.solr.core.SolrCore@65184531
[junit4:junit4]   2> 3661 T1744 C65 oasc.SolrDeletionPolicy.onInit SolrDeletionPolicy.onInit: commits:num=1
[junit4:junit4]   2> 		commit{dir=MockDirWrapper(org.apache.lucene.store.RAMDirectory@44296e84 lockFactory=org.apache.lucene.store.NativeFSLockFactory@2ec04de9),segFN=segments_1,generation=1,filenames=[segments_1]
[junit4:junit4]   2> 3661 T1744 C65 oasc.SolrDeletionPolicy.updateCommits newest commit = 1
[junit4:junit4]   2> 3663 T1744 C65 oass.SolrIndexSearcher.<init> Opening Searcher@5606ff11 realtime
[junit4:junit4]   2> 3664 T1744 C65 oass.SolrIndexSearcher.getIndexDir WARNING WARNING: Directory impl does not support setting indexDir: org.apache.lucene.store.MockDirectoryWrapper
[junit4:junit4]   2> 3664 T1744 C65 UPDATE [collection1] webapp=/solr path=/update params={wt=javabin&version=2} {deleteByQuery=*:* (-1413145684728610816)} 0 6
[junit4:junit4]   2> ASYNC  NEW_CORE C66 name=collection1 org.apache.solr.core.SolrCore@1cd86560
[junit4:junit4]   2> 3672 T1754 C66 oasc.SolrDeletionPolicy.onInit SolrDeletionPolicy.onInit: commits:num=1
[junit4:junit4]   2> 		commit{dir=MockDirWrapper(NRTCachingDirectory(org.apache.lucene.store.RAMDirectory@4c6314ef lockFactory=org.apache.lucene.store.NativeFSLockFactory@43409410; maxCacheMB=0.3125 maxMergeSizeMB=0.6728515625)),segFN=segments_1,generation=1,filenames=[segments_1]
[junit4:junit4]   2> 3672 T1754 C66 oasc.SolrDeletionPolicy.updateCommits newest commit = 1
[junit4:junit4]   2> 3674 T1754 C66 oass.SolrIndexSearcher.<init> Opening Searcher@46c0813 realtime
[junit4:junit4]   2> 3674 T1754 C66 oass.SolrIndexSearcher.getIndexDir WARNING WARNING: Directory impl does not support setting indexDir: org.apache.lucene.store.MockDirectoryWrapper
[junit4:junit4]   2> 3675 T1754 C66 UPDATE [collection1] webapp=/solr path=/update params={wt=javabin&version=2} {deleteByQuery=*:* (-1413145684741193728)} 0 5
[junit4:junit4]   2> ASYNC  NEW_CORE C67 name=collection1 org.apache.solr.core.SolrCore@22a99791
[junit4:junit4]   2> 3682 T1764 C67 oasc.SolrDeletionPolicy.onInit SolrDeletionPolicy.onInit: commits:num=1
[junit4:junit4]   2> 		commit{dir=BaseDirectoryWrapper(org.apache.lucene.store.RAMDirectory@314db005 lockFactory=org.apache.lucene.store.NativeFSLockFactory@7eae114b),segFN=segments_1,generation=1,filenames=[segments_1]
[junit4:junit4]   2> 3682 T1764 C67 oasc.SolrDeletionPolicy.updateCommits newest commit = 1
[junit4:junit4]   2> 3683 T1764 C67 oass.SolrIndexSearcher.<init> Opening Searcher@ccb961f realtime
[junit4:junit4]   2> 3684 T1764 C67 oass.SolrIndexSearcher.getIndexDir WARNING WARNING: Directory impl does not support setting indexDir: org.apache.lucene.store.BaseDirectoryWrapper
[junit4:junit4]   2> 3684 T1764 C67 UPDATE [collection1] webapp=/solr path=/update params={wt=javabin&version=2} {deleteByQuery=*:* (-1413145684751679488)} 0 4
[junit4:junit4]   2> 3698 T1721 oascsi.HttpClientUtil.createClient Creating new http client, config:maxConnections=500&maxConnectionsPerHost=16
[junit4:junit4]   2> 3736 T1721 oasu.SolrCmdDistributor.distribCommit Distrib commit to:[StdNode: http://localhost:62780/solr/]
[junit4:junit4]   2> 3747 T1725 C63 oasu.DirectUpdateHandler2.commit start commit{flags=0,_version_=0,optimize=false,openSearcher=true,waitSearcher=true,expungeDeletes=false,softCommit=false}
[junit4:junit4]   2> 3748 T1725 C63 oass.SolrIndexSearcher.<init> Opening Searcher@5a3305db main
[junit4:junit4]   2> 3749 T1725 C63 oass.SolrIndexSearcher.getIndexDir WARNING WARNING: Directory impl does not support setting indexDir: org.apache.lucene.store.MockDirectoryWrapper
[junit4:junit4]   2> 3749 T1731 oasc.SolrCore.registerSearcher [collection1] Registered new searcher Searcher@5a3305db main{StandardDirectoryReader(segments_1:1:nrt)}
[junit4:junit4]   2> 3749 T1725 C63 oasu.DirectUpdateHandler2.commit end_commit_flush
[junit4:junit4]   2> 3750 T1725 C63 UPDATE [collection1] webapp=/solr path=/update params={waitSearcher=true&commit=true&expungeDeletes=false&wt=javabin&softCommit=false&version=2} {commit=} 0 3
[junit4:junit4]   2> 3766 T1725 C63 oasu.DirectUpdateHandler2.commit start commit{flags=0,_version_=0,optimize=false,openSearcher=true,waitSearcher=true,expungeDeletes=false,softCommit=false}
[junit4:junit4]   2> 3769 T1725 C63 oasc.SolrDeletionPolicy.onCommit SolrDeletionPolicy.onCommit: commits:num=2
[junit4:junit4]   2> 		commit{dir=MockDirWrapper(NRTCachingDirectory(org.apache.lucene.store.RAMDirectory@8fb77bf lockFactory=org.apache.lucene.store.NativeFSLockFactory@3708400a; maxCacheMB=0.076171875 maxMergeSizeMB=0.234375)),segFN=segments_1,generation=1,filenames=[segments_1]
[junit4:junit4]   2> 		commit{dir=MockDirWrapper(NRTCachingDirectory(org.apache.lucene.store.RAMDirectory@8fb77bf lockFactory=org.apache.lucene.store.NativeFSLockFactory@3708400a; maxCacheMB=0.076171875 maxMergeSizeMB=0.234375)),segFN=segments_2,generation=2,filenames=[_0_Asserting_0.tim, _0_Asserting_0.tip, _0_MockVariableIntBlock_0.doc, _0_MockVariableIntBlock_0.skp, _0_Pulsing40_0.prx, _0_Pulsing40_0.frq, _0_Asserting_0.prx, _0_MockVariableIntBlock_0.pyl, _0_Lucene40WithOrds_0.tii, _0_Lucene40WithOrds_0.frq, _0_MockVariableIntBlock_0.tib, _0_MockVariableIntBlock_0.pos, _0_Pulsing40_0.tip, _0.si, _0_Lucene40WithOrds_0.tib, _0_MockVariableIntBlock_0.tii, _0.fnm, _0_Pulsing40_0.tim, _0_nrm.cfs, _0_Asserting_0.frq, _0_nrm.cfe, _0_MockVariableIntBlock_0.frq, segments_2, _0.fdx, _0_Lucene40WithOrds_0.prx, _0.fdt]
[junit4:junit4]   2> 3770 T1725 C63 oasc.SolrDeletionPolicy.updateCommits newest commit = 2
[junit4:junit4]   2> 3771 T1725 C63 oass.SolrIndexSearcher.<init> Opening Searcher@7d279cd7 main
[junit4:junit4]   2> 3772 T1725 C63 oass.SolrIndexSearcher.getIndexDir WARNING WARNING: Directory impl does not support setting indexDir: org.apache.lucene.store.MockDirectoryWrapper
[junit4:junit4]   2> 3772 T1731 oasc.SolrCore.registerSearcher [collection1] Registered new searcher Searcher@7d279cd7 main{StandardDirectoryReader(segments_2:3:nrt _0(5.0):C1)}
[junit4:junit4]   2> 3772 T1725 C63 oasu.DirectUpdateHandler2.commit end_commit_flush
[junit4:junit4]   2> 3773 T1725 C63 UPDATE [collection1] webapp=/solr path=/update params={waitSearcher=true&commit=true&wt=javabin&expungeDeletes=false&version=2&softCommit=false} {add=[1 (1413145684839759872)],commit=} 0 9
[junit4:junit4]   2> 3776 T1724 C63 REQ [collection1] webapp=/solr path=/select params={wt=javabin&q=*:*&version=2} hits=1 status=0 QTime=1 
[junit4:junit4]   2> 3777 T1721 oasu.SolrCmdDistributor.distribCommit Distrib commit to:[StdNode: http://localhost:62780/solr/, StdNode: http://localhost:62787/solr/]
[junit4:junit4]   2> 3779 T1735 C64 oasu.DirectUpdateHandler2.commit start commit{flags=0,_version_=0,optimize=false,openSearcher=true,waitSearcher=true,expungeDeletes=false,softCommit=false}
[junit4:junit4]   2> 3779 T1725 C63 oasu.DirectUpdateHandler2.commit start commit{flags=0,_version_=0,optimize=false,openSearcher=true,waitSearcher=true,expungeDeletes=false,softCommit=false}
[junit4:junit4]   2> 3780 T1735 C64 oass.SolrIndexSearcher.<init> Opening Searcher@76ee61d2 main
[junit4:junit4]   2> 3780 T1725 C63 oass.SolrIndexSearcher.<init> Opening Searcher@6dc4843b main
[junit4:junit4]   2> 3780 T1735 C64 oass.SolrIndexSearcher.getIndexDir WARNING WARNING: Directory impl does not support setting indexDir: org.apache.lucene.store.MockDirectoryWrapper
[junit4:junit4]   2> 3781 T1725 C63 oass.SolrIndexSearcher.getIndexDir WARNING WARNING: Directory impl does not support setting indexDir: org.apache.lucene.store.MockDirectoryWrapper
[junit4:junit4]   2> 3781 T1741 oasc.SolrCore.registerSearcher [collection1] Registered new searcher Searcher@76ee61d2 main{StandardDirectoryReader(segments_1:1:nrt)}
[junit4:junit4]   2> 3781 T1735 C64 oasu.DirectUpdateHandler2.commit end_commit_flush
[junit4:junit4]   2> 3781 T1725 C63 oasu.DirectUpdateHandler2.commit end_commit_flush
[junit4:junit4]   2> 3781 T1735 C64 UPDATE [collection1] webapp=/solr path=/update params={waitSearcher=true&commit=true&expungeDeletes=false&wt=javabin&softCommit=false&version=2} {commit=} 0 2
[junit4:junit4]   2> 3781 T1731 oasc.SolrCore.registerSearcher [collection1] Registered new searcher Searcher@6dc4843b main{StandardDirectoryReader(segments_2:3:nrt _0(5.0):C1)}
[junit4:junit4]   2> 3782 T1725 C63 UPDATE [collection1] webapp=/solr path=/update params={waitSearcher=true&commit=true&expungeDeletes=false&wt=javabin&softCommit=false&version=2} {commit=} 0 3
[junit4:junit4]   2> 3786 T1735 C64 oasu.DirectUpdateHandler2.commit start commit{flags=0,_version_=0,optimize=false,openSearcher=true,waitSearcher=true,expungeDeletes=false,softCommit=false}
[junit4:junit4]   2> 3787 T1725 C63 oasu.DirectUpdateHandler2.commit start commit{flags=0,_version_=0,optimize=false,openSearcher=true,waitSearcher=true,expungeDeletes=false,softCommit=false}
[junit4:junit4]   2> 3790 T1735 C64 oasc.SolrDeletionPolicy.onCommit SolrDeletionPolicy.onCommit: commits:num=2
[junit4:junit4]   2> 		commit{dir=MockDirWrapper(NRTCachingDirectory(org.apache.lucene.store.RAMDirectory@6d865cfe lockFactory=org.apache.lucene.store.NativeFSLockFactory@4238f637; maxCacheMB=0.40625 maxMergeSizeMB=0.255859375)),segFN=segments_1,generation=1,filenames=[segments_1]
[junit4:junit4]   2> 		commit{dir=MockDirWrapper(NRTCachingDirectory(org.apache.lucene.store.RAMDirectory@6d865cfe lockFactory=org.apache.lucene.store.NativeFSLockFactory@4238f637; maxCacheMB=0.40625 maxMergeSizeMB=0.255859375)),segFN=segments_2,generation=2,filenames=[_0_Asserting_0.tim, _0_Asserting_0.tip, _0_MockVariableIntBlock_0.doc, _0_MockVariableIntBlock_0.skp, _0_Pulsing40_0.prx, _0_Pulsing40_0.frq, _0_Asserting_0.prx, _0_MockVariableIntBlock_0.pyl, _0_Lucene40WithOrds_0.tii, _0_Lucene40WithOrds_0.frq, _0_MockVariableIntBlock_0.tib, _0_MockVariableIntBlock_0.pos, _0_Pulsing40_0.tip, _0.si, _0_Lucene40WithOrds_0.tib, _0_MockVariableIntBlock_0.tii, _0.fnm, _0_Pulsing40_0.tim, _0_nrm.cfs, _0_Asserting_0.frq, _0_nrm.cfe, _0_MockVariableIntBlock_0.frq, segments_2, _0.fdx, _0_Lucene40WithOrds_0.prx, _0.fdt]
[junit4:junit4]   2> 3791 T1725 C63 oasc.SolrDeletionPolicy.onCommit SolrDeletionPolicy.onCommit: commits:num=2
[junit4:junit4]   2> 		commit{dir=MockDirWrapper(NRTCachingDirectory(org.apache.lucene.store.RAMDirectory@8fb77bf lockFactory=org.apache.lucene.store.NativeFSLockFactory@3708400a; maxCacheMB=0.076171875 maxMergeSizeMB=0.234375)),segFN=segments_2,generation=2,filenames=[_0_Asserting_0.tim, _0_Asserting_0.tip, _0_MockVariableIntBlock_0.doc, _0_MockVariableIntBlock_0.skp, _0_Pulsing40_0.prx, _0_Pulsing40_0.frq, _0_Asserting_0.prx, _0_MockVariableIntBlock_0.pyl, _0_Lucene40WithOrds_0.tii, _0_Lucene40WithOrds_0.frq, _0_MockVariableIntBlock_0.tib, _0_MockVariableIntBlock_0.pos, _0_Pulsing40_0.tip, _0.si, _0_Lucene40WithOrds_0.tib, _0_MockVariableIntBlock_0.tii, _0.fnm, _0_Pulsing40_0.tim, _0_nrm.cfs, _0_Asserting_0.frq, _0_nrm.cfe, _0_MockVariableIntBlock_0.frq, segments_2, _0.fdx, _0_Lucene40WithOrds_0.prx, _0.fdt]
[junit4:junit4]   2> 		commit{dir=MockDirWrapper(NRTCachingDirectory(org.apache.lucene.store.RAMDirectory@8fb77bf lockFactory=org.apache.lucene.store.NativeFSLockFactory@3708400a; maxCacheMB=0.076171875 maxMergeSizeMB=0.234375)),segFN=segments_3,generation=3,filenames=[_1_Pulsing40_0.tip, _1_Pulsing40_0.tim, _0_MockVariableIntBlock_0.skp, _0_Pulsing40_0.prx, _0_Pulsing40_0.frq, _1.fnm, _0_Asserting_0.prx, _1_Pulsing40_0.frq, _1_Asserting_0.tim, _0_Lucene40WithOrds_0.tii, _0_Lucene40WithOrds_0.frq, _1_Lucene40WithOrds_0.tib, _1_Asserting_0.tip, _1_Pulsing40_0.prx, _1_Lucene40WithOrds_0.tii, _0_Lucene40WithOrds_0.tib, _1_Lucene40WithOrds_0.frq, _0_Pulsing40_0.tim, _0.fnm, _1_MockVariableIntBlock_0.tii, _1_MockVariableIntBlock_0.tib, _1.fdx, _0_Asserting_0.frq, _1.fdt, _0_MockVariableIntBlock_0.frq, _0_Asserting_0.tim, _1_MockVariableIntBlock_0.skp, _0_Asserting_0.tip, _0_MockVariableIntBlock_0.doc, _1_Lucene40WithOrds_0.prx, _1_MockVariableIntBlock_0.pyl, _0_MockVariableIntBlock_0.pyl, _0_MockVariableIntBlock_0.tib, _1_MockVariableIntBlock_0.doc, _0_Pulsing40_0.tip, _0_MockVariableIntBlock_0.pos, _0.si, _0_MockVariableIntBlock_0.tii, _1_nrm.cfs, _1_MockVariableIntBlock_0.pos, _1_Asserting_0.frq, _0_nrm.cfs, _1_nrm.cfe, _1_MockVariableIntBlock_0.frq, _1_Asserting_0.prx, _1.si, _0_nrm.cfe, _0.fdx, _0_Lucene40WithOrds_0.prx, segments_3, _0.fdt]
[junit4:junit4]   2> 3791 T1735 C64 oasc.SolrDeletionPolicy.updateCommits newest commit = 2
[junit4:junit4]   2> 3792 T1725 C63 oasc.SolrDeletionPolicy.updateCommits newest commit = 3
[junit4:junit4]   2> 3793 T1735 C64 oass.SolrIndexSearcher.<init> Opening Searcher@5142d069 main
[junit4:junit4]   2> 3793 T1725 C63 oass.SolrIndexSearcher.<init> Opening Searcher@64b5c515 main
[junit4:junit4]   2> 3793 T1735 C64 oass.SolrIndexSearcher.getIndexDir WARNING WARNING: Directory impl does not support setting indexDir: org.apache.lucene.store.MockDirectoryWrapper
[junit4:junit4]   2> 3794 T1725 C63 oass.SolrIndexSearcher.getIndexDir WARNING WARNING: Directory impl does not support setting indexDir: org.apache.lucene.store.MockDirectoryWrapper
[junit4:junit4]   2> 3794 T1741 oasc.SolrCore.registerSearcher [collection1] Registered new searcher Searcher@5142d069 main{StandardDirectoryReader(segments_2:3:nrt _0(5.0):C3)}
[junit4:junit4]   2> 3794 T1735 C64 oasu.DirectUpdateHandler2.commit end_commit_flush
[junit4:junit4]   2> 3794 T1725 C63 oasu.DirectUpdateHandler2.commit end_commit_flush
[junit4:junit4]   2> 3794 T1731 oasc.SolrCore.registerSearcher [collection1] Registered new searcher Searcher@64b5c515 main{StandardDirectoryReader(segments_3:5:nrt _0(5.0):C1 _1(5.0):C2)}
[junit4:junit4]   2> 3794 T1735 C64 UPDATE [collection1] webapp=/solr path=/update params={waitSearcher=true&commit=true&wt=javabin&expungeDeletes=false&version=2&softCommit=false} {add=[2 (1413145684860731392), 3 (1413145684862828544), 4 (1413145684862828545)],commit=} 0 10
[junit4:junit4]   2> 3795 T1725 C63 UPDATE [collection1] webapp=/solr path=/update params={waitSearcher=true&commit=true&wt=javabin&expungeDeletes=false&version=2&softCommit=false} {add=[2 (1413145684861779968), 3 (1413145684863877120)],commit=} 0 10
[junit4:junit4]   2> 3798 T1724 C63 REQ [collection1] webapp=/solr path=/select params={wt=javabin&q=*:*&version=2} hits=3 status=0 QTime=0 
[junit4:junit4]   2> 3801 T1734 C64 REQ [collection1] webapp=/solr path=/select params={wt=javabin&q=*:*&version=2} hits=3 status=0 QTime=0 
[junit4:junit4]   2> 3806 T1721 oasu.SolrCmdDistributor.distribCommit Distrib commit to:[StdNode: http://localhost:62780/solr/, StdNode: http://localhost:62787/solr/]
[junit4:junit4]   2> 3809 T1735 C64 oasu.DirectUpdateHandler2.commit start commit{flags=0,_version_=0,optimize=false,openSearcher=true,waitSearcher=true,expungeDeletes=false,softCommit=false}
[junit4:junit4]   2> 3809 T1725 C63 oasu.DirectUpdateHandler2.commit start commit{flags=0,_version_=0,optimize=false,openSearcher=true,waitSearcher=true,expungeDeletes=false,softCommit=false}
[junit4:junit4]   2> 3810 T1725 C63 oass.SolrIndexSearcher.<init> Opening Searcher@7861022c main
[junit4:junit4]   2> 3810 T1735 C64 oass.SolrIndexSearcher.<init> Opening Searcher@6e6e9d4f main
[junit4:junit4]   2> 3810 T1725 C63 oass.SolrIndexSearcher.getIndexDir WARNING WARNING: Directory impl does not support setting indexDir: org.apache.lucene.store.MockDirectoryWrapper
[junit4:junit4]   2> 3810 T1735 C64 oass.SolrIndexSearcher.getIndexDir WARNING WARNING: Directory impl does not support setting indexDir: org.apache.lucene.store.MockDirectoryWrapper
[junit4:junit4]   2> 3811 T1731 oasc.SolrCore.registerSearcher [collection1] Registered new searcher Searcher@7861022c main{StandardDirectoryReader(segments_3:5:nrt _0(5.0):C1 _1(5.0):C2)}
[junit4:junit4]   2> 3811 T1725 C63 oasu.DirectUpdateHandler2.commit end_commit_flush
[junit4:junit4]   2> 3811 T1735 C64 oasu.DirectUpdateHandler2.commit end_commit_flush
[junit4:junit4]   2> 3811 T1725 C63 UPDATE [collection1] webapp=/solr path=/update params={waitSearcher=true&commit=true&expungeDeletes=false&wt=javabin&softCommit=false&version=2} {commit=} 0 2
[junit4:junit4]   2> 3811 T1741 oasc.SolrCore.registerSearcher [collection1] Registered new searcher Searcher@6e6e9d4f main{StandardDirectoryReader(segments_2:3:nrt _0(5.0):C3)}
[junit4:junit4]   2> 3812 T1735 C64 UPDATE [collection1] webapp=/solr path=/update params={waitSearcher=true&commit=true&expungeDeletes=false&wt=javabin&softCommit=false&version=2} {commit=} 0 3
[junit4:junit4]   2> 3816 T1725 C63 oasu.DirectUpdateHandler2.commit start commit{flags=0,_version_=0,optimize=false,openSearcher=true,waitSearcher=true,expungeDeletes=false,softCommit=false}
[junit4:junit4]   2> 3816 T1735 C64 oasu.DirectUpdateHandler2.commit start commit{flags=0,_version_=0,optimize=false,openSearcher=true,waitSearcher=true,expungeDeletes=false,softCommit=false}
[junit4:junit4]   2> 3817 T1735 C64 oasc.SolrDeletionPolicy.onCommit SolrDeletionPolicy.onCommit: commits:num=2
[junit4:junit4]   2> 		commit{dir=MockDirWrapper(NRTCachingDirectory(org.apache.lucene.store.RAMDirectory@6d865cfe lockFactory=org.apache.lucene.store.NativeFSLockFactory@4238f637; maxCacheMB=0.40625 maxMergeSizeMB=0.255859375)),segFN=segments_2,generation=2,filenames=[_0_Asserting_0.tim, _0_Asserting_0.tip, _0_MockVariableIntBlock_0.doc, _0_MockVariableIntBlock_0.skp, _0_Pulsing40_0.prx, _0_Pulsing40_0.frq, _0_Asserting_0.prx, _0_MockVariableIntBlock_0.pyl, _0_Lucene40WithOrds_0.tii, _0_Lucene40WithOrds_0.frq, _0_MockVariableIntBlock_0.tib, _0_MockVariableIntBlock_0.pos, _0_Pulsing40_0.tip, _0.si, _0_Lucene40WithOrds_0.tib, _0_MockVariableIntBlock_0.tii, _0.fnm, _0_Pulsing40_0.tim, _0_nrm.cfs, _0_Asserting_0.frq, _0_nrm.cfe, _0_MockVariableIntBlock_0.frq, segments_2, _0.fdx, _0_Lucene40WithOrds_0.prx, _0.fdt]
[junit4:junit4]   2> 		commit{dir=MockDirWrapper(NRTCachingDirectory(org.apache.lucene.store.RAMDirectory@6d865cfe lockFactory=org.apache.lucene.store.NativeFSLockFactory@4238f637; maxCacheMB=0.40625 maxMergeSizeMB=0.255859375)),segFN=segments_3,generation=3,filenames=[_0_Asserting_0.tim, _0_Asserting_0.tip, _0_MockVariableIntBlock_0.doc, _0_MockVariableIntBlock_0.skp, _0_Pulsing40_0.prx, _0_Pulsing40_0.frq, _0_Asserting_0.prx, _0_MockVariableIntBlock_0.pyl, _0_Lucene40WithOrds_0.tii, _0_Lucene40WithOrds_0.frq, _0_MockVariableIntBlock_0.tib, _0_MockVariableIntBlock_0.pos, _0_Pulsing40_0.tip, _0.si, _0_Lucene40WithOrds_0.tib, _0_MockVariableIntBlock_0.tii, _0.fnm, _0_Pulsing40_0.tim, _0_1.del, _0_nrm.cfs, _0_Asserting_0.frq, _0_nrm.cfe, _0_MockVariableIntBlock_0.frq, _0.fdx, _0_Lucene40WithOrds_0.prx, _0.fdt, segments_3]
[junit4:junit4]   2> 3818 T1725 C63 oasc.SolrDeletionPolicy.onCommit SolrDeletionPolicy.onCommit: commits:num=2
[junit4:junit4]   2> 		commit{dir=MockDirWrapper(NRTCachingDirectory(org.apache.lucene.store.RAMDirectory@8fb77bf lockFactory=org.apache.lucene.store.NativeFSLockFactory@3708400a; maxCacheMB=0.076171875 maxMergeSizeMB=0.234375)),segFN=segments_3,generation=3,filenames=[_1_Pulsing40_0.tip, _1_Pulsing40_0.tim, _0_MockVariableIntBlock_0.skp, _0_Pulsing40_0.prx, _0_Pulsing40_0.frq, _1.fnm, _0_Asserting_0.prx, _1_Pulsing40_0.frq, _1_Asserting_0.tim, _0_Lucene40WithOrds_0.tii, _0_Lucene40WithOrds_0.frq, _1_Lucene40WithOrds_0.tib, _1_Asserting_0.tip, _1_Pulsing40_0.prx, _1_Lucene40WithOrds_0.tii, _0_Lucene40WithOrds_0.tib, _1_Lucene40WithOrds_0.frq, _0_Pulsing40_0.tim, _0.fnm, _1_MockVariableIntBlock_0.tii, _1_MockVariableIntBlock_0.tib, _1.fdx, _0_Asserting_0.frq, _1.fdt, _0_MockVariableIntBlock_0.frq, _0_Asserting_0.tim, _1_MockVariableIntBlock_0.skp, _0_Asserting_0.tip, _0_MockVariableIntBlock_0.doc, _1_Lucene40WithOrds_0.prx, _1_MockVariableIntBlock_0.pyl, _0_MockVariableIntBlock_0.pyl, _0_MockVariableIntBlock_0.tib, _1_MockVariableIntBlock_0.doc, _0_Pulsing40_0.tip, _0_MockVariableIntBlock_0.pos, _0.si, _0_MockVariableIntBlock_0.tii, _1_nrm.cfs, _1_MockVariableIntBlock_0.pos, _1_Asserting_0.frq, _0_nrm.cfs, _1_nrm.cfe, _1_MockVariableIntBlock_0.frq, _1_Asserting_0.prx, _1.si, _0_nrm.cfe, _0.fdx, _0_Lucene40WithOrds_0.prx, segments_3, _0.fdt]
[junit4:junit4]   2> 		commit{dir=MockDirWrapper(NRTCachingDirectory(org.apache.lucene.store.RAMDirectory@8fb77bf lockFactory=org.apache.lucene.store.NativeFSLockFactory@3708400a; maxCacheMB=0.076171875 maxMergeSizeMB=0.234375)),segFN=segments_4,generation=4,filenames=[_1_Pulsing40_0.tip, _1_Pulsing40_0.tim, _0_MockVariableIntBlock_0.skp, _0_Pulsing40_0.prx, _0_Pulsing40_0.frq, _1.fnm, _0_Asserting_0.prx, _1_Pulsing40_0.frq, _1_Asserting_0.tim, _0_Lucene40WithOrds_0.tii, _0_Lucene40WithOrds_0.frq, _1_Lucene40WithOrds_0.tib, _1_Asserting_0.tip, _1_Pulsing40_0.prx, _1_Lucene40WithOrds_0.tii, _0_Lucene40WithOrds_0.tib, _1_Lucene40WithOrds_0.frq, _0_Pulsing40_0.tim, _0.fnm, _1_MockVariableIntBlock_0.tii, _1_MockVariableIntBlock_0.tib, _1.fdx, _0_Asserting_0.frq, _1.fdt, _0_MockVariableIntBlock_0.frq, _0_Asserting_0.tim, _1_MockVariableIntBlock_0.skp, _0_Asserting_0.tip, _0_MockVariableIntBlock_0.doc, _1_Lucene40WithOrds_0.prx, _1_MockVariableIntBlock_0.pyl, _0_MockVariableIntBlock_0.pyl, _0_MockVariableIntBlock_0.tib, _1_MockVariableIntBlock_0.doc, _0_Pulsing40_0.tip, _0_MockVariableIntBlock_0.pos, _0.si, _0_MockVariableIntBlock_0.tii, _1_nrm.cfs, _1_MockVariableIntBlock_0.pos, _1_Asserting_0.frq, _0_nrm.cfs, _1_1.del, _1_nrm.cfe, _1_MockVariableIntBlock_0.frq, _1_Asserting_0.prx, _1.si, _0_nrm.cfe, _0.fdx, _0_Lucene40WithOrds_0.prx, _0.fdt, segments_4]
[junit4:junit4]   2> 3818 T1735 C64 oasc.SolrDeletionPolicy.updateCommits newest commit = 3
[junit4:junit4]   2> 3819 T1725 C63 oasc.SolrDeletionPolicy.updateCommits newest commit = 4
[junit4:junit4]   2> 3819 T1735 C64 oass.SolrIndexSearcher.<init> Opening Searcher@3b5ed4b1 main
[junit4:junit4]   2> 3819 T1725 C63 oass.SolrIndexSearcher.<init> Opening Searcher@21ac874e main
[junit4:junit4]   2> 3820 T1735 C64 oass.SolrIndexSearcher.getIndexDir WARNING WARNING: Directory impl does not support setting indexDir: org.apache.lucene.store.MockDirectoryWrapper
[junit4:junit4]   2> 3820 T1725 C63 oass.SolrIndexSearcher.getIndexDir WARNING WARNING: Directory impl does not support setting indexDir: org.apache.lucene.store.MockDirectoryWrapper
[junit4:junit4]   2> 3820 T1741 oasc.SolrCore.registerSearcher [collection1] Registered new searcher Searcher@3b5ed4b1 main{StandardDirectoryReader(segments_3:4:nrt _0(5.0):C3/1)}
[junit4:junit4]   2> 3820 T1725 C63 oasu.DirectUpdateHandler2.commit end_commit_flush
[junit4:junit4]   2> 3820 T1731 oasc.SolrCore.registerSearcher [collection1] Registered new searcher Searcher@21ac874e main{StandardDirectoryReader(segments_4:6:nrt _0(5.0):C1 _1(5.0):C2/1)}
[junit4:junit4]   2> 3820 T1735 C64 oasu.DirectUpdateHandler2.commit end_commit_flush
[junit4:junit4]   2> 3821 T1725 C63 UPDATE [collection1] webapp=/solr path=/update params={waitSearcher=true&commit=true&wt=javabin&expungeDeletes=false&version=2&softCommit=false} {delete=[2 (-1413145684894285824)],commit=} 0 6
[junit4:junit4]   2> 3821 T1735 C64 UPDATE [collection1] webapp=/solr path=/update params={waitSearcher=true&commit=true&wt=javabin&expungeDeletes=false&version=2&softCommit=false} {delete=[2 (-1413145684893237248)],commit=} 0 6
[junit4:junit4]   2> 3824 T1724 C63 REQ [collection1] webapp=/solr path=/select params={wt=javabin&q=*:*&version=2} hits=2 status=0 QTime=0 
[junit4:junit4]   2> 3827 T1734 C64 REQ [collection1] webapp=/solr path=/select params={wt=javabin&q=*:*&version=2} hits=2 status=0 QTime=0 
[junit4:junit4]   2> 3830 T1734 C64 oasu.DirectUpdateHandler2.commit start commit{flags=0,_version_=0,optimize=true,openSearcher=true,waitSearcher=true,expungeDeletes=false,softCommit=false}
[junit4:junit4]   2> 3879 T1734 C64 oasc.SolrDeletionPolicy.onCommit SolrDeletionPolicy.onCommit: commits:num=2
[junit4:junit4]   2> 		commit{dir=MockDirWrapper(NRTCachingDirectory(org.apache.lucene.store.RAMDirectory@6d865cfe lockFactory=org.apache.lucene.store.NativeFSLockFactory@4238f637; maxCacheMB=0.40625 maxMergeSizeMB=0.255859375)),segFN=segments_3,generation=3,filenames=[_0_Asserting_0.tim, _0_Asserting_0.tip, _0_MockVariableIntBlock_0.doc, _0_MockVariableIntBlock_0.skp, _0_Pulsing40_0.prx, _0_Pulsing40_0.frq, _0_Asserting_0.prx, _0_MockVariableIntBlock_0.pyl, _0_Lucene40WithOrds_0.tii, _0_Lucene40WithOrds_0.frq, _0_MockVariableIntBlock_0.tib, _0_MockVariableIntBlock_0.pos, _0_Pulsing40_0.tip, _0.si, _0_Lucene40WithOrds_0.tib, _0_MockVariableIntBlock_0.tii, _0.fnm, _0_Pulsing40_0.tim, _0_1.del, _0_nrm.cfs, _0_Asserting_0.frq, _0_nrm.cfe, _0_MockVariableIntBlock_0.frq, _0.fdx, _0_Lucene40WithOrds_0.prx, _0.fdt, segments_3]
[junit4:junit4]   2> 		commit{dir=MockDirWrapper(NRTCachingDirectory(org.apache.lucene.store.RAMDirectory@6d865cfe lockFactory=org.apache.lucene.store.NativeFSLockFactory@4238f637; maxCacheMB=0.40625 maxMergeSizeMB=0.255859375)),segFN=segments_4,generation=4,filenames=[_1_MockVariableIntBlock_0.skp, _1_Pulsing40_0.tip, _1_Pulsing40_0.tim, _1_Lucene40WithOrds_0.prx, _1_MockVariableIntBlock_0.pyl, _1.fnm, _1_Pulsing40_0.frq, _1_Asserting_0.tim, _1_Lucene40WithOrds_0.tib, _1_Asserting_0.tip, _1_Pulsing40_0.prx, _1_MockVariableIntBlock_0.doc, _1_Lucene40WithOrds_0.tii, _1_nrm.cfs, _1_Lucene40WithOrds_0.frq, _1_MockVariableIntBlock_0.tii, _1_MockVariableIntBlock_0.pos, _1_Asserting_0.frq, _1_nrm.cfe, _1_MockVariableIntBlock_0.tib, _1_MockVariableIntBlock_0.frq, _1.fdx, _1.fdt, _1_Asserting_0.prx, _1.si, segments_4]
[junit4:junit4]   2> 3880 T1734 C64 oasc.SolrDeletionPolicy.updateCommits newest commit = 4
[junit4:junit4]   2> 3882 T1734 C64 oass.SolrIndexSearcher.<init> Opening Searcher@25956cdc main
[junit4:junit4]   2> 3882 T1734 C64 oass.SolrIndexSearcher.getIndexDir WARNING WARNING: Directory impl does not support setting indexDir: org.apache.lucene.store.MockDirectoryWrapper
[junit4:junit4]   2> 3883 T1734 C64 oasu.DirectUpdateHandler2.commit end_commit_flush
[junit4:junit4]   2> 3883 T1741 oasc.SolrCore.registerSearcher [collection1] Registered new searcher Searcher@25956cdc main{StandardDirectoryReader(segments_4:6:nrt _1(5.0):C2)}
[junit4:junit4]   2> 3883 T1734 C64 UPDATE [collection1] webapp=/solr path=/update params={optimize=true&maxSegments=1&waitSearcher=true&wt=javabin&version=2} {optimize=} 0 53
[junit4:junit4]   2> 3886 T1744 C65 oasu.DirectUpdateHandler2.commit start commit{flags=0,_version_=0,optimize=true,openSearcher=true,waitSearcher=true,expungeDeletes=false,softCommit=false}
[junit4:junit4]   2> 3887 T1744 C65 oass.SolrIndexSearcher.<init> Opening Searcher@12ee7d8 main
[junit4:junit4]   2> 3887 T1744 C65 oass.SolrIndexSearcher.getIndexDir WARNING WARNING: Directory impl does not support setting indexDir: org.apache.lucene.store.MockDirectoryWrapper
[junit4:junit4]   2> 3888 T1751 oasc.SolrCore.registerSearcher [collection1] Registered new searcher Searcher@12ee7d8 main{StandardDirectoryReader(segments_1:1:nrt)}
[junit4:junit4]   2> 3888 T1744 C65 oasu.DirectUpdateHandler2.commit end_commit_flush
[junit4:junit4]   2> 3888 T1744 C65 UPDATE [collection1] webapp=/solr path=/update params={optimize=true&maxSegments=1&waitSearcher=true&wt=javabin&version=2} {optimize=} 0 2
[junit4:junit4]   2> 3891 T1754 C66 oasu.DirectUpdateHandler2.commit start commit{flags=0,_version_=0,optimize=true,openSearcher=true,waitSearcher=true,expungeDeletes=false,softCommit=false}
[junit4:junit4]   2> 3892 T1754 C66 oass.SolrIndexSearcher.<init> Opening Searcher@c670a4a main
[junit4:junit4]   2> 3892 T1754 C66 oass.SolrIndexSearcher.getIndexDir WARNING WARNING: Directory impl does not support setting indexDir: org.apache.lucene.store.MockDirectoryWrapper
[junit4:junit4]   2> 3893 T1761 oasc.SolrCore.registerSearcher [collection1] Registered new searcher Searcher@c670a4a main{StandardDirectoryReader(segments_1:1:nrt)}
[junit4:junit4]   2> 3893 T1754 C66 oasu.DirectUpdateHandler2.commit end_commit_flush
[junit4:junit4]   2> 3893 T1754 C66 UPDATE [collection1] webapp=/solr path=/update params={optimize=true&maxSegments=1&waitSearcher=true&wt=javabin&version=2} {optimize=} 0 2
[junit4:junit4]   2> 3896 T1764 C67 oasu.DirectUpdateHandler2.commit start commit{flags=0,_version_=0,optimize=true,openSearcher=true,waitSearcher=true,expungeDeletes=false,softCommit=false}
[junit4:junit4]   2> 3897 T1764 C67 oass.SolrIndexSearcher.<init> Opening Searcher@40d316ee main
[junit4:junit4]   2> 3897 T1764 C67 oass.SolrIndexSearcher.getIndexDir WARNING WARNING: Directory impl does not support setting indexDir: org.apache.lucene.store.BaseDirectoryWrapper
[junit4:junit4]   2> 3897 T1771 oasc.SolrCore.registerSearcher [collection1] Registered new searcher Searcher@40d316ee main{StandardDirectoryReader(segments_1:1:nrt)}
[junit4:junit4]   2> 3898 T1764 C67 oasu.DirectUpdateHandler2.commit end_commit_flush
[junit4:junit4]   2> 3898 T1764 C67 UPDATE [collection1] webapp=/solr path=/update params={optimize=true&maxSegments=1&waitSearcher=true&wt=javabin&version=2} {optimize=} 0 2
[junit4:junit4]   2> 3917 T1765 C67 oasu.DirectUpdateHandler2.commit start commit{flags=0,_version_=0,optimize=false,openSearcher=true,waitSearcher=true,expungeDeletes=false,softCommit=false}
[junit4:junit4]   2> 3917 T1735 C64 oasu.DirectUpdateHandler2.commit start commit{flags=0,_version_=0,optimize=false,openSearcher=true,waitSearcher=true,expungeDeletes=false,softCommit=false}
[junit4:junit4]   2> 3918 T1745 C65 oasu.DirectUpdateHandler2.commit start commit{flags=0,_version_=0,optimize=false,openSearcher=true,waitSearcher=true,expungeDeletes=false,softCommit=false}
[junit4:junit4]   2> 3919 T1755 C66 oasu.DirectUpdateHandler2.commit start commit{flags=0,_version_=0,optimize=false,openSearcher=true,waitSearcher=true,expungeDeletes=false,softCommit=false}
[junit4:junit4]   2> 3926 T1765 C67 oasc.SolrDeletionPolicy.onCommit SolrDeletionPolicy.onCommit: commits:num=2
[junit4:junit4]   2> 		commit{dir=BaseDirectoryWrapper(org.apache.lucene.store.RAMDirectory@314db005 lockFactory=org.apache.lucene.store.NativeFSLockFactory@7eae114b),segFN=segments_1,generation=1,filenames=[segments_1]
[junit4:junit4]   2> 		commit{dir=BaseDirectoryWrapper(org.apache.lucene.store.RAMDirectory@314db005 lockFactory=org.apache.lucene.store.NativeFSLockFactory@7eae114b),segFN=segments_2,generation=2,filenames=[_1_Pulsing40_0.tip, _1_Pulsing40_0.tim, _0_MockVariableIntBlock_0.skp, _0_Pulsing40_0.prx, _0_Pulsing40_0.frq, _1.fnm, _0_Asserting_0.prx, _1_Pulsing40_0.frq, _1_Asserting_0.tim, _0_Lucene40WithOrds_0.tii, _0_Lucene40WithOrds_0.frq, _1_Lucene40WithOrds_0.tib, _1_Asserting_0.tip, _1_Pulsing40_0.prx, _1_Lucene40WithOrds_0.tii, _0_Lucene40WithOrds_0.tib, _1_Lucene40WithOrds_0.frq, _0_Pulsing40_0.tim, _0.fnm, _1_MockVariableIntBlock_0.tii, _1_MockVariableIntBlock_0.tib, _1.fdx, _0_Asserting_0.frq, _1.fdt, _0_MockVariableIntBlock_0.frq, _0_Asserting_0.tim, _1_MockVariableIntBlock_0.skp, _0_Asserting_0.tip, _0_MockVariableIntBlock_0.doc, _1_Lucene40WithOrds_0.prx, _1_MockVariableIntBlock_0.pyl, _0_MockVariableIntBlock_0.pyl, _0_MockVariableIntBlock_0.tib, _1_MockVariableIntBlock_0.doc, _0_Pulsing40_0.tip, _0_MockVariableIntBlock_0.pos, _0.si, _0_MockVariableIntBlock_0.tii, _1_nrm.cfs, _1_MockVariableIntBlock_0.pos, _1_Asserting_0.frq, _0_nrm.cfs, _1_nrm.cfe, _1_MockVariableIntBlock_0.frq, _1_Asserting_0.prx, _1.si, _0_nrm.cfe, segments_2, _0.fdx, _0_Lucene40WithOrds_0.prx, _0.fdt]
[junit4:junit4]   2> 3927 T1765 C67 oasc.SolrDeletionPolicy.updateCommits newest commit = 2
[junit4:junit4]   2> 3933 T1765 C67 oass.SolrIndexSearcher.<init> Opening Searcher@536e4d57 main
[junit4:junit4]   2> 3934 T1765 C67 oass.SolrIndexSearcher.getIndexDir WARNING WARNING: Directory impl does not support setting indexDir: org.apache.lucene.store.BaseDirectoryWrapper
[junit4:junit4]   2> 3934 T1771 oasc.SolrCore.registerSearcher [collection1] Registered new searcher Searcher@536e4d57 main{StandardDirectoryReader(segments_2:9:nrt _0(5.0):C22 _1(5.0):C6 _2(5.0):C10)}
[junit4:junit4]   2> 3934 T1765 C67 oasu.DirectUpdateHandler2.commit end_commit_flush
[junit4:junit4]   2> 3935 T1765 C67 UPDATE [collection1] webapp=/solr path=/update params={waitSearcher=true&commit=true&wt=javabin&expungeDeletes=false&version=2&softCommit=false} {add=[5 (1413145684984463360), 7 (1413145684992851968), 11 (1413145684993900545), 12 (1413145684994949120), 13 (1413145684995997697), 14 (1413145684997046273), 18 (1413145684998094848), 19 (1413145684999143424), 23 (1413145684999143427), 25 (1413145684999143429)],commit=} 0 33
[junit4:junit4]   2> 3935 T1766 C67 oasu.DirectUpdateHandler2.commit start commit{flags=0,_version_=0,optimize=false,openSearcher=true,waitSearcher=true,expungeDeletes=false,softCommit=false}
[junit4:junit4]   2> 3941 T1735 C64 oasc.SolrDeletionPolicy.onCommit SolrDeletionPolicy.onCommit: commits:num=2
[junit4:junit4]   2> 		commit{dir=MockDirWrapper(NRTCachingDirectory(org.apache.lucene.store.RAMDirectory@6d865cfe lockFactory=org.apache.lucene.store.NativeFSLockFactory@4238f637; maxCacheMB=0.40625 maxMergeSizeMB=0.255859375)),segFN=segments_4,generation=4,filenames=[_1_MockVariableIntBlock_0.skp, _1_Pulsing40_0.tip, _1_Pulsing40_0.tim, _1_Lucene40WithOrds_0.prx, _1_MockVariableIntBlock_0.pyl, _1.fnm, _1_Pulsing40_0.frq, _1_Asserting_0.tim, _1_Lucene40WithOrds_0.tib, _1_Asserting_0.tip, _1_Pulsing40_0.prx, _1_MockVariableIntBlock_0.doc, _1_Lucene40WithOrds_0.tii, _1_nrm.cfs, _1_Lucene40WithOrds_0.frq, _1_MockVariableIntBlock_0.tii, _1_MockVariableIntBlock_0.pos, _1_Asserting_0.frq, _1_nrm.cfe, _1_MockVariableIntBlock_0.tib, _1_MockVariableIntBlock_0.frq, _1.fdx, _1.fdt, _1_Asserting_0.prx, _1.si, segments_4]
[junit4:junit4]   2> 		commit{dir=MockDirWrapper(NRTCachingDirectory(org.apache.lucene.store.RAMDirectory@6d865cfe lockFactory=org.apache.lucene.store.NativeFSLockFactory@4238f637; maxCacheMB=0.40625 maxMergeSizeMB=0.255859375)),segFN=segments_5,generation=5,filenames=[_3_nrm.cfe, _1_Pulsing40_0.tip, _3_MockVariableIntBlock_0.frq, _3_Lucene40WithOrds_0.tii, _1_Pulsing40_0.tim, _3.fdt, _1.fnm, _3_Lucene40WithOrds_0.tib, _1_Pulsing40_0.frq, _1_Asserting_0.tim, _1_Lucene40WithOrds_0.tib, _3_Asserting_0.prx, _1_Asserting_0.tip, _1_Pulsing40_0.prx, _2_Asserting_0.prx, _1_Lucene40WithOrds_0.tii, _2_Pulsing40_0.prx, _2_MockVariableIntBlock_0.pos, _1_Lucene40WithOrds_0.frq, _1_MockVariableIntBlock_0.tii, _3_MockVariableIntBlock_0.doc, _3_Pulsing40_0.tip, _2.fdt, _2.fdx, _3_Pulsing40_0.tim, _2_Pulsing40_0.frq, _1_MockVariableIntBlock_0.tib, _3_nrm.cfs, _1.fdx, _2_Asserting_0.tim, _2_Asserting_0.tip, _1.fdt, _3_MockVariableIntBlock_0.tib, _3.si, _2_MockVariableIntBlock_0.skp, _3_Pulsing40_0.frq, _1_MockVariableIntBlock_0.skp, _2.si, _2_Pulsing40_0.tim, _2_MockVariableIntBlock_0.pyl, _2_Pulsing40_0.tip, _1_Lucene40WithOrds_0.prx, _1_MockVariableIntBlock_0.pyl, _2_MockVariableIntBlock_0.frq, _3.fnm, _3_MockVariableIntBlock_0.tii, _2_MockVariableIntBlock_0.doc, _2_nrm.cfe, _2_Lucene40WithOrds_0.prx, _1_MockVariableIntBlock_0.doc, _2_Asserting_0.frq, _2_nrm.cfs, _1_nrm.cfs, _2_MockVariableIntBlock_0.tii, _2_Lucene40WithOrds_0.frq, _2_MockVariableIntBlock_0.tib, _1_MockVariableIntBlock_0.pos, _1_Asserting_0.frq, _3_Lucene40WithOrds_0.frq, _1_nrm.cfe, _2.fnm, _3_Asserting_0.frq, _3.fdx, _1_MockVariableIntBlock_0.frq, _2_Lucene40WithOrds_0.tii, _3_Pulsing40_0.prx, _3_Asserting_0.tim, _3_Asserting_0.tip, _1_Asserting_0.prx, _1.si, _3_MockVariableIntBlock_0.pyl, _2_Lucene40WithOrds_0.tib, _3_Lucene40WithOrds_0.prx, segments_5, _3_MockVariableIntBlock_0.skp, _3_MockVariableIntBlock_0.pos]
[junit4:junit4]   2> 3943 T1755 C66 oasc.SolrDeletionPolicy.onCommit SolrDeletionPolicy.onCommit: commits:num=2
[junit4:junit4]   2> 		commit{dir=MockDirWrapper(NRTCachingDirectory(org.apache.lucene.store.RAMDirectory@4c6314ef lockFactory=org.apache.lucene.store.NativeFSLockFactory@43409410; maxCacheMB=0.3125 maxMergeSizeMB=0.6728515625)),segFN=segments_1,generation=1,filenames=[segments_1]
[junit4:junit4]   2> 		commit{dir=MockDirWrapper(NRTCachingDirectory(org.apache.lucene.store.RAMDirectory@4c6314ef lockFactory=org.apache.lucene.store.NativeFSLockFactory@43409410; maxCacheMB=0.3125 maxMergeSizeMB=0.6728515625)),segFN=segments_2,generation=2,filenames=[_1_Pulsing40_0.tip, _1_Pulsing40_0.tim, _0_MockVariableIntBlock_0.skp, _0_Pulsing40_0.prx, _0_Pulsing40_0.frq, _1.fnm, _0_Asserting_0.prx, _1_Pulsing40_0.frq, _1_Asserting_0.tim, _0_Lucene40WithOrds_0.tii, _0_Lucene40WithOrds_0.frq, _1_Lucene40WithOrds_0.tib, _1_Asserting_0.tip, _1_Pulsing40_0.prx, _1_Lucene40WithOrds_0.tii, _0_Lucene40WithOrds_0.tib, _1_Lucene40WithOrds_0.frq, _0_Pulsing40_0.tim, _0.fnm, _1_MockVariableIntBlock_0.tii, _1_MockVariableIntBlock_0.tib, _1.fdx, _0_Asserting_0.frq, _1.fdt, _0_MockVariableIntBlock_0.frq, _0_Asserting_0.tim, _1_MockVariableIntBlock_0.skp, _0_Asserting_0.tip, _0_MockVariableIntBlock_0.doc, _1_Lucene40WithOrds_0.prx, _1_MockVariableIntBlock_0.pyl, _0_MockVariableIntBlock_0.pyl, _0_MockVariableIntBlock_0.tib, _1_MockVariableIntBlock_0.doc, _0_Pulsing40_0.tip, _0_MockVariableIntBlock_0.pos, _0.si, _0_MockVariableIntBlock_0.tii, _1_nrm.cfs, _1_MockVariableIntBlock_0.pos, _1_Asserting_0.frq, _0_nrm.cfs, _1_nrm.cfe, _1_MockVariableIntBlock_0.frq, _1_Asserting_0.prx, _1.si, _0_nrm.cfe, segments_2, _0.fdx, _0_Lucene40WithOrds_0.prx, _0.fdt]
[junit4:junit4]   2> 3943 T1745 C65 oasc.SolrDeletionPolicy.onCommit SolrDeletionPolicy.onCommit: commits:num=2
[junit4:junit4]   2> 		commit{dir=MockDirWrapper(org.apache.lucene.store.RAMDirectory@44296e84 lockFactory=org.apache.lucene.store.NativeFSLockFactory@2ec04de9),segFN=segments_1,generation=1,filenames=[segments_1]
[junit4:junit4]   2> 		commit{dir=MockDirWrapper(org.apache.lucene.store.RAMDirectory@44296e84 lockFactory=org.apache.lucene.store.NativeFSLockFactory@2ec04de9),segFN=segments_2,generation=2,filenames=[_1_Pulsing40_0.tip, _1_Pulsing40_0.tim, _0_MockVariableIntBlock_0.skp, _0_Pulsing40_0.prx, _0_Pulsing40_0.frq, _1.fnm, _0_Asserting_0.prx, _1_Pulsing40_0.frq, _1_Asserting_0.tim, _0_Lucene40WithOrds_0.tii, _0_Lucene40WithOrds_0.frq, _1_Lucene40WithOrds_0.tib, _1_Asserting_0.tip, _1_Pulsing40_0.prx, _1_Lucene40WithOrds_0.tii, _0_Lucene40WithOrds_0.tib, _1_Lucene40WithOrds_0.frq, _0_Pulsing40_0.tim, _0.fnm, _1_MockVariableIntBlock_0.tii, _1_MockVariableIntBlock_0.tib, _1.fdx, _0_Asserting_0.frq, _1.fdt, _0_MockVariableIntBlock_0.frq, _0_Asserting_0.tim, _1_MockVariableIntBlock_0.skp, _0_Asserting_0.tip, _0_MockVariableIntBlock_0.doc, _1_Lucene40WithOrds_0.prx, _1_MockVariableIntBlock_0.pyl, _0_MockVariableIntBlock_0.pyl, _0_MockVariableIntBlock_0.tib, _1_MockVariableIntBlock_0.doc, _0_Pulsing40_0.tip, _0_MockVariableIntBlock_0.pos, _0.si, _0_MockVariableIntBlock_0.tii, _1_nrm.cfs, _1_MockVariableIntBlock_0.pos, _1_Asserting_0.frq, _0_nrm.cfs, _1_nrm.cfe, _1_MockVariableIntBlock_0.frq, _1_Asserting_0.prx, _1.si, _0_nrm.cfe, segments_2, _0.fdx, _0_Lucene40WithOrds_0.prx, _0.fdt]
[junit4:junit4]   2> 3944 T1735 C64 oasc.SolrDeletionPolicy.updateCommits newest commit = 5
[junit4:junit4]   2> 3946 T1745 C65 oasc.SolrDeletionPolicy.updateCommits newest commit = 2
[junit4:junit4]   2> 3946 T1755 C66 oasc.SolrDeletionPolicy.updateCommits newest commit = 2
[junit4:junit4]   2> 3946 T1766 C67 oasc.SolrDeletionPolicy.onCommit SolrDeletionPolicy.onCommit: commits:num=2
[junit4:junit4]   2> 		commit{dir=BaseDirectoryWrapper(org.apache.lucene.store.RAMDirectory@314db005 lockFactory=org.apache.lucene.store.NativeFSLockFactory@7eae114b),segFN=segments_2,generation=2,filenames=[_1_Pulsing40_0.tip, _1_Pulsing40_0.tim, _0_MockVariableIntBlock_0.skp, _0_Pulsing40_0.prx, _0_Pulsing40_0.frq, _1.fnm, _0_Asserting_0.prx, _1_Pulsing40_0.frq, _1_Asserting_0.tim, _0_Lucene40WithOrds_0.tii, _0_Lucene40WithOrds_0.frq, _1_Lucene40WithOrds_0.tib, _1_Asserting_0.tip, _1_Pulsing40_0.prx, _1_Lucene40WithOrds_0.tii, _0_Lucene40WithOrds_0.tib, _1_Lucene40WithOrds_0.frq, _0_Pulsing40_0.tim, _0.fnm, _1_MockVariableIntBlock_0.tii, _1_MockVariableIntBlock_0.tib, _1.fdx, _0_Asserting_0.frq, _1.fdt, _0_MockVariableIntBlock_0.frq, _0_Asserting_0.tim, _1_MockVariableIntBlock_0.skp, _0_Asserting_0.tip, _0_MockVariableIntBlock_0.doc, _1_Lucene40WithOrds_0.prx, _1_MockVariableIntBlock_0.pyl, _0_MockVariableIntBlock_0.pyl, _0_MockVariableIntBlock_0.tib, _1_MockVariableIntBlock_0.doc, _0_Pulsing40_0.tip, _0_MockVariableIntBlock_0.pos, _0.si, _0_MockVariableIntBlock_0.tii, _1_nrm.cfs, _1_MockVariableIntBlock_0.pos, _1_Asserting_0.frq, _0_nrm.cfs, _1_nrm.cfe, _1_MockVariableIntBlock_0.frq, _1_Asserting_0.prx, _1.si, _0_nrm.cfe, segments_2, _0.fdx, _0_Lucene40WithOrds_0.prx, _0.fdt]
[junit4:junit4]   2> 		commit{dir=BaseDirectoryWrapper(org.apache.lucene.store.RAMDirectory@314db005 lockFactory=org.apache.lucene.store.NativeFSLockFactory@7eae114b),segFN=segments_3,generation=3,filenames=[_3_MockVariableIntBlock_0.frq, _3.fdt, _4_MockVariableIntBlock_0.tii, _0_Pulsing40_0.frq, _1_Asserting_0.tim, _0_Lucene40WithOrds_0.tii, _0_Lucene40WithOrds_0.frq, _1_Lucene40WithOrds_0.tib, _1_Asserting_0.tip, _1_Lucene40WithOrds_0.tii, _0_Lucene40WithOrds_0.tib, _4_Asserting_0.frq, _1_Lucene40WithOrds_0.frq, _0_Pulsing40_0.tim, _1_MockVariableIntBlock_0.tii, _4_MockVariableIntBlock_0.doc, _2.fdt, _3_Pulsing40_0.tip, _2.fdx, _3_Pulsing40_0.tim, _1_MockVariableIntBlock_0.tib, _1.fdx, _2_Asserting_0.tim, _0_Asserting_0.frq, _4_MockVariableIntBlock_0.tib, _2_Asserting_0.tip, _1.fdt, _0_MockVariableIntBlock_0.frq, _3.si, _2_MockVariableIntBlock_0.skp, _1_MockVariableIntBlock_0.skp, _0_Asserting_0.tim, _2.si, _3_Pulsing40_0.frq, _2_Pulsing40_0.tim, _4_Lucene40WithOrds_0.tib, _4_Lucene40WithOrds_0.tii, _2_MockVariableIntBlock_0.pyl, _0_Asserting_0.tip, _0_MockVariableIntBlock_0.doc, _2_Pulsing40_0.tip, _1_Lucene40WithOrds_0.prx, _1_MockVariableIntBlock_0.pyl, _4_Asserting_0.tip, _3.fnm, _2_MockVariableIntBlock_0.doc, _3_MockVariableIntBlock_0.tii, _4_Pulsing40_0.prx, _0_MockVariableIntBlock_0.pyl, _4_Asserting_0.prx, _2_nrm.cfe, _4_Asserting_0.tim, _1_MockVariableIntBlock_0.doc, _0_MockVariableIntBlock_0.pos, _0_Pulsing40_0.tip, _2_nrm.cfs, _2_MockVariableIntBlock_0.tii, _2_Lucene40WithOrds_0.frq, _2_MockVariableIntBlock_0.tib, _1_MockVariableIntBlock_0.pos, _4_MockVariableIntBlock_0.frq, _1_Asserting_0.frq, _2.fnm, _3.fdx, _4_Pulsing40_0.tip, _4_Pulsing40_0.tim, _1_Asserting_0.prx, _1.si, _3_MockVariableIntBlock_0.pyl, _0_Lucene40WithOrds_0.prx, _3_Lucene40WithOrds_0.prx, _3_MockVariableIntBlock_0.pos, _3_nrm.cfe, _1_Pulsing40_0.tip, _1_Pulsing40_0.tim, _3_Lucene40WithOrds_0.tii, _4_nrm.cfe, _4.fnm, _0_MockVariableIntBlock_0.skp, _0_Pulsing40_0.prx, _1.fnm, _3_Lucene40WithOrds_0.tib, _4.fdx, _1_Pulsing40_0.frq, _0_Asserting_0.prx, _3_Asserting_0.prx, _1_Pulsing40_0.prx, _2_Asserting_0.prx, _2_Pulsing40_0.prx, _2_MockVariableIntBlock_0.pos, _0.fnm, _3_MockVariableIntBlock_0.doc, _2_Pulsing40_0.frq, _3_nrm.cfs, _4_MockVariableIntBlock_0.pyl, _4_Lucene40WithOrds_0.prx, _4_nrm.cfs, _3_MockVariableIntBlock_0.tib, _4_Lucene40WithOrds_0.frq, _2_MockVariableIntBlock_0.frq, _4_MockVariableIntBlock_0.skp, _2_Lucene40WithOrds_0.prx, _0_MockVariableIntBlock_0.tib, _4_MockVariableIntBlock_0.pos, _2_Asserting_0.frq, _0.si, _0_MockVariableIntBlock_0.tii, _1_nrm.cfs, _4.si, _4.fdt, _0_nrm.cfs, _3_Lucene40WithOrds_0.frq, _1_nrm.cfe, _3_Asserting_0.frq, _1_MockVariableIntBlock_0.frq, _2_Lucene40WithOrds_0.tii, _4_Pulsing40_0.frq, _3_Pulsing40_0.prx, _3_Asserting_0.tim, _3_Asserting_0.tip, _0_nrm.cfe, _0.fdx, _2_Lucene40WithOrds_0.tib, _3_MockVariableIntBlock_0.skp, _0.fdt, segments_3]
[junit4:junit4]   2> 3948 T1766 C67 oasc.SolrDeletionPolicy.updateCommits newest commit = 3
[junit4:junit4]   2> 3954 T1766 C67 oass.SolrIndexSearcher.<init> Opening Searcher@3111e2c5 main
[junit4:junit4]   2> 3955 T1766 C67 oass.SolrIndexSearcher.getIndexDir WARNING WARNING: Directory impl does not support setting indexDir: org.apache.lucene.store.BaseDirectoryWrapper
[junit4:junit4]   2> 3956 T1771 oasc.SolrCore.registerSearcher [collection1] Registered new searcher Searcher@3111e2c5 main{StandardDirectoryReader(segments_3:17:nrt _0(5.0):C22 _1(5.0):C6 _2(5.0):C10 _3(5.0):C3 _4(5.0):C23 _6(5.0):C14 _5(5.0):C10)}
[junit4:junit4]   2> 3956 T1766 C67 oasu.DirectUpdateHandler2.commit end_commit_flush
[junit4:junit4]   2> 3957 T1766 C67 UPDATE [collection1] webapp=/solr path=/update params={waitSearcher=true&commit=true&wt=javabin&expungeDeletes=false&version=2&softCommit=false} {add=[29 (1413145684987609088), 30 (1413145684993900544), 31 (1413145684993900546), 32 (1413145684994949121), 33 (1413145684995997698), 36 (1413145684997046274), 38 (1413145684998094849), 40 (1413145684999143426), 42 (1413145685000192000), 48 (1413145685000192002)],commit=} 0 51
[junit4:junit4]   2> 3956 T1767 C67 oasu.DirectUpdateHandler2.commit start commit{flags=0,_version_=0,optimize=false,openSearcher=true,waitSearcher=true,expungeDeletes=false,softCommit=false}
[junit4:junit4]   2> 3963 T1767 C67 oasc.SolrDeletionPolicy.onCommit SolrDeletionPolicy.onCommit: commits:num=2
[junit4:junit4]   2> 		commit{dir=BaseDirectoryWrapper(org.apache.lucene.store.RAMDirectory@314db005 lockFactory=org.apache.lucene.store.NativeFSLockFactory@7eae114b),segFN=segments_3,generation=3,filenames=[_3_MockVariableIntBlock_0.frq, _3.fdt, _4_MockVariableIntBlock_0.tii, _0_Pulsing40_0.frq, _1_Asserting_0.tim, _0_Lucene40WithOrds_0.tii, _0_Lucene40WithOrds_0.frq, _1_Lucene40WithOrds_0.tib, _1_Asserting_0.tip, _1_Lucene40WithOrds_0.tii, _0_Lucene40WithOrds_0.tib, _4_Asserting_0.frq, _1_Lucene40WithOrds_0.frq, _0_Pulsing40_0.tim, _1_MockVariableIntBlock_0.tii, _4_MockVariableIntBlock_0.doc, _2.fdt, _3_Pulsing40_0.tip, _2.fdx, _3_Pulsing40_0.tim, _1_MockVariableIntBlock_0.tib, _1.fdx, _2_Asserting_0.tim, _0_Asserting_0.frq, _4_MockVariableIntBlock_0.tib, _2_Asserting_0.tip, _1.fdt, _0_MockVariableIntBlock_0.frq, _3.si, _2_MockVariableIntBlock_0.skp, _1_MockVariableIntBlock_0.skp, _0_Asserting_0.tim, _2.si, _3_Pulsing40_0.frq, _2_Pulsing40_0.tim, _4_Lucene40WithOrds_0.tib, _4_Lucene40WithOrds_0.tii, _2_MockVariableIntBlock_0.pyl, _0_Asserting_0.tip, _0_MockVariableIntBlock_0.doc, _2_Pulsing40_0.tip, _1_Lucene40WithOrds_0.prx, _1_MockVariableIntBlock_0.pyl, _4_Asserting_0.tip, _3.fnm, _2_MockVariableIntBlock_0.doc, _3_MockVariableIntBlock_0.tii, _4_Pulsing40_0.prx, _0_MockVariableIntBlock_0.pyl, _4_Asserting_0.prx, _2_nrm.cfe, _4_Asserting_0.tim, _1_MockVariableIntBlock_0.doc, _0_MockVariableIntBlock_0.pos, _0_Pulsing40_0.tip, _2_nrm.cfs, _2_MockVariableIntBlock_0.tii, _2_Lucene40WithOrds_0.frq, _2_MockVariableIntBlock_0.tib, _1_MockVariableIntBlock_0.pos, _4_MockVariableIntBlock_0.frq, _1_Asserting_0.frq, _2.fnm, _3.fdx, _4_Pulsing40_0.tip, _4_Pulsing40_0.tim, _1_Asserting_0.prx, _1.si, _3_MockVariableIntBlock_0.pyl, _0_Lucene40WithOrds_0.prx, _3_Lucene40WithOrds_0.prx, _3_MockVariableIntBlock_0.pos, _3_nrm.cfe, _1_Pulsing40_0.tip, _1_Pulsing40_0.tim, _3_Lucene40WithOrds_0.tii, _4_nrm.cfe, _4.fnm, _0_MockVariableIntBlock_0.skp, _0_Pulsing40_0.prx, _1.fnm, _3_Lucene40WithOrds_0.tib, _4.fdx, _1_Pulsing40_0.frq, _0_Asserting_0.prx, _3_Asserting_0.prx, _1_Pulsing40_0.prx, _2_Asserting_0.prx, _2_Pulsing40_0.prx, _2_MockVariableIntBlock_0.pos, _0.fnm, _3_MockVariableIntBlock_0.doc, _2_Pulsing40_0.frq, _3_nrm.cfs, _4_MockVariableIntBlock_0.pyl, _4_Lucene40WithOrds_0.prx, _4_nrm.cfs, _3_MockVariableIntBlock_0.tib, _4_Lucene40WithOrds_0.frq, _2_MockVariableIntBlock_0.frq, _4_MockVariableIntBlock_0.skp, _2_Lucene40WithOrds_0.prx, _0_MockVariableIntBlock_0.tib, _4_MockVariableIntBlock_0.pos, _2_Asserting_0.frq, _0.si, _0_MockVariableIntBlock_0.tii, _1_nrm.cfs, _4.si, _4.fdt, _0_nrm.cfs, _3_Lucene40WithOrds_0.frq, _1_nrm.cfe, _3_Asserting_0.frq, _1_MockVariableIntBlock_0.frq, _2_Lucene40WithOrds_0.tii, _4_Pulsing40_0.frq, _3_Pulsing40_0.prx, _3_Asserting_0.tim, _3_Asserting_0.tip, _0_nrm.cfe, _0.fdx, _2_Lucene40WithOrds_0.tib, _3_MockVariableIntBlock_0.skp, _0.fdt, segments_3]
[junit4:junit4]   2> 		commit{dir=BaseDirectoryWrapper(org.apache.lucene.store.RAMDirectory@314db005 lockFactory=org.apache.lucene.store.NativeFSLockFactory@7eae114b),segFN=segments_4,generation=4,filenames=[_5_nrm.cfe, _3_MockVariableIntBlock_0.frq, _6_Asserting_0.frq, _3.fdt, _4_MockVariableIntBlock_0.tii, _5_Lucene40WithOrds_0.tib, _1_Asserting_0.tim, _7.fnm, _0_Lucene40WithOrds_0.frq, _5_Lucene40WithOrds_0.tii, _1_Lucene40WithOrds_0.tib, _1_Asserting_0.tip, _1_Lucene40WithOrds_0.tii, _5_Pulsing40_0.tip, _6_MockVariableIntBlock_0.tii, _5_Pulsing40_0.tim, _1_Lucene40WithOrds_0.frq, _0_Pulsing40_0.tim, _6_MockVariableIntBlock_0.tib, _1_MockVariableIntBlock_0.tii, _8_Asserting_0.tim, _8_Asserting_0.tip, _1_MockVariableIntBlock_0.tib, _1.fdx, _4_MockVariableIntBlock_0.tib, _1.fdt, _5_nrm.cfs, _0_MockVariableIntBlock_0.frq, _8_Pulsing40_0.frq, _8_MockVariableIntBlock_0.skp, _6.fdt, _5_Lucene40WithOrds_0.prx, _3_Pulsing40_0.frq, _2.si, _1_MockVariableIntBlock_0.skp, _2_Pulsing40_0.tim, _7_MockVariableIntBlock_0.pos, _0_MockVariableIntBlock_0.doc, _2_Pulsing40_0.tip, _6.fdx, _1_Lucene40WithOrds_0.prx, _1_MockVariableIntBlock_0.pyl, _3_MockVariableIntBlock_0.tii, _7_Asserting_0.frq, _2_nrm.cfe, _5_Pulsing40_0.frq, _0_Pulsing40_0.tip, _0_MockVariableIntBlock_0.pos, _2_nrm.cfs, _7_MockVariableIntBlock_0.skp, _4_MockVariableIntBlock_0.frq, _2.fnm, _5_MockVariableIntBlock_0.frq, _7_Pulsing40_0.tim, _3.fdx, _8_MockVariableIntBlock_0.pos, _4_Pulsing40_0.tip, _4_Pulsing40_0.tim, _1.si, _0_Lucene40WithOrds_0.prx, _7_Pulsing40_0.tip, _3_MockVariableIntBlock_0.pos, _8_MockVariableIntBlock_0.frq, _3_nrm.cfe, _8_nrm.cfe, _5_MockVariableIntBlock_0.pyl, _3_Lucene40WithOrds_0.tii, _4_nrm.cfe, _6_Lucene40WithOrds_0.prx, _8_Lucene40WithOrds_0.tib, _0_Pulsing40_0.prx, _3_Lucene40WithOrds_0.tib, _8_Lucene40WithOrds_0.frq, _4.fdx, _8_Lucene40WithOrds_0.tii, _3_Asserting_0.prx, _1_Pulsing40_0.prx, _7_MockVariableIntBlock_0.tii, _2_Asserting_0.prx, _6_MockVariableIntBlock_0.frq, _3_MockVariableIntBlock_0.doc, _7_Lucene40WithOrds_0.tib, _8_nrm.cfs, _5.si, _8_Pulsing40_0.tip, _3_nrm.cfs, _7_Lucene40WithOrds_0.tii, _4_MockVariableIntBlock_0.pyl, _4_Lucene40WithOrds_0.prx, _6_Pulsing40_0.prx, _4_nrm.cfs, _3_MockVariableIntBlock_0.tib, _8_Pulsing40_0.tim, _5_Asserting_0.prx, _5_MockVariableIntBlock_0.doc, _8_MockVariableIntBlock_0.tib, _6_MockVariableIntBlock_0.pyl, _2_MockVariableIntBlock_0.frq, _6_Asserting_0.tim, _6_nrm.cfs, _6_Asserting_0.tip, _2_Lucene40WithOrds_0.prx, _7_nrm.cfs, _2_Asserting_0.frq, _5_Asserting_0.frq, _8_MockVariableIntBlock_0.doc, _1_nrm.cfs, _5.fnm, _7_nrm.cfe, _7_Asserting_0.prx, _6_nrm.cfe, _8_Asserting_0.prx, _3_Lucene40WithOrds_0.frq, _4.fdt, _4.si, _1_nrm.cfe, _3_Asserting_0.frq, _4_Pulsing40_0.frq, _8.fdx, _8_MockVariableIntBlock_0.tii, _8.fdt, _7.si, _0_Pulsing40_0.frq, _8.si, _0_Lucene40WithOrds_0.tii, _8_MockVariableIntBlock_0.pyl, _7_Lucene40WithOrds_0.frq, _5_MockVariableIntBlock_0.tii, _0_Lucene40WithOrds_0.tib, _4_Asserting_0.frq, _4_MockVariableIntBlock_0.doc, _3_Pulsing40_0.tip, _2.fdt, _7.fdx, _7_MockVariableIntBlock_0.frq, _2.fdx, _7.fdt, _3_Pulsing40_0.tim, _2_Asserting_0.tim, _0_Asserting_0.frq, _7_Pulsing40_0.frq, _2_Asserting_0.tip, _3.si, _2_MockVariableIntBlock_0.skp, _0_Asserting_0.tim, _4_Lucene40WithOrds_0.tib, _2_MockVariableIntBlock_0.pyl, _4_Lucene40WithOrds_0.tii, _0_Asserting_0.tip, _4_Asserting_0.tip, _3.fnm, _2_MockVariableIntBlock_0.doc, _0_MockVariableIntBlock_0.pyl, _4_Pulsing40_0.prx, _4_Asserting_0.prx, _4_Asserting_0.tim, _1_MockVariableIntBlock_0.doc, _2_MockVariableIntBlock_0.tii, _7_MockVariableIntBlock_0.pyl, _6_Asserting_0.prx, _2_Lucene40WithOrds_0.frq, _5_MockVariableIntBlock_0.tib, _2_MockVariableIntBlock_0.tib, _1_MockVariableIntBlock_0.pos, _1_Asserting_0.frq, _1_Asserting_0.prx, _5_Pulsing40_0.prx, _3_MockVariableIntBlock_0.pyl, _6.fnm, _6.si, _7_MockVariableIntBlock_0.tib, _3_Lucene40WithOrds_0.prx, _5.fdt, _8_Asserting_0.frq, _1_Pulsing40_0.tip, _6_Pulsing40_0.frq, _1_Pulsing40_0.tim, _4.fnm, _0_MockVariableIntBlock_0.skp, _1.fnm, _7_MockVariableIntBlock_0.doc, _7_Pulsing40_0.prx, _0_Asserting_0.prx, _1_Pulsing40_0.frq, _6_Pulsing40_0.tim, _8_Pulsing40_0.prx, _6_Pulsing40_0.tip, _7_Asserting_0.tip, _2_Pulsing40_0.prx, _6_MockVariableIntBlock_0.doc, _2_MockVariableIntBlock_0.pos, _7_Asserting_0.tim, _0.fnm, _6_Lucene40WithOrds_0.frq, _5_MockVariableIntBlock_0.pos, _5_Asserting_0.tim, _6_Lucene40WithOrds_0.tii, _2_Pulsing40_0.frq, _5_Lucene40WithOrds_0.frq, _8.fnm, _6_Lucene40WithOrds_0.tib, _5_Asserting_0.tip, _4_Lucene40WithOrds_0.frq, _4_MockVariableIntBlock_0.skp, _0_MockVariableIntBlock_0.tib, _5_MockVariableIntBlock_0.skp, _4_MockVariableIntBlock_0.pos, _6_MockVariableIntBlock_0.pos, _7_Lucene40WithOrds_0.prx, _0.si, _0_MockVariableIntBlock_0.tii, _0_nrm.cfs, _6_MockVariableIntBlock_0.skp, _2_Lucene40WithOrds_0.tii, _1_MockVariableIntBlock_0.frq, _3_Pulsing40_0.prx, _3_Asserting_0.tim, _3_Asserting_0.tip, _0_nrm.cfe, _5.fdx, _2_Lucene40WithOrds_0.tib, _0.fdx, _8_Lucene40WithOrds_0.prx, _3_MockVariableIntBlock_0.skp, _0.fdt, segments_4]
[junit4:junit4]   2> 3966 T1767 C67 oasc.SolrDeletionPolicy.updateCommits newest commit = 4
[junit4:junit4]   2> 3970 T1735 C64 oass.SolrIndexSearcher.<init> Opening Searcher@3eb906b4 main
[junit4:junit4]   2> 3970 T1735 C64 oass.SolrIndexSearcher.getIndexDir WARNING WARNING: Directory impl does not support setting indexDir: org.apache.lucene.store.MockDirectoryWrapper
[junit4:junit4]   2> 3971 T1741 oasc.SolrCore.registerSearcher [collection1] Registered new searcher Searcher@3eb906b4 main{StandardDirectoryReader(segments_5:18:nrt _1(5.0):C2 _2(5.0):C22 _3(5.0):C13 _4(5.0):C44 _5(5.0):C7 _6(5.0):C3)}
[junit4:junit4]   2> 3971 T1745 C65 oass.SolrIndexSearcher.<init> Opening Searcher@2518a69c main
[junit4:junit4]   2> 3972 T1745 C65 oass.SolrIndexSearcher.getIndexDir WARNING WARNING: Directory impl does not support setting indexDir: org.apache.lucene.store.MockDirectoryWrapper
[junit4:junit4]   2> 3972 T1751 oasc.SolrCore.registerSearcher [collection1] Registered new searcher Searcher@2518a69c main{StandardDirectoryReader(segments_2:11:nrt _0(5.0):C22 _1(5.0):C8 _2(5.0):C30 _3(5.0):C5)}
[junit4:junit4]   2> 3973 T1735 C64 oasu.DirectUpdateHandler2.commit end_commit_flush
[junit4:junit4]   2> 3973 T1745 C65 oasu.DirectUpdateHandler2.commit end_commit_flush
[junit4:junit4]   2> 3974 T1735 C64 UPDATE [collection1] webapp=/solr path=/update params={waitSearcher=true&commit=true&wt=javabin&expungeDeletes=false&version=2&softCommit=false} {add=[6 (1413145684985511936), 8 (1413145684987609088), 9 (1413145684992851968), 11 (1413145684993900546), 16 (1413145684995997696), 17 (1413145684997046272), 20 (1413145684997046274), 21 (1413145684998094850), 23 (1413145684999143425), 24 (1413145685000192000)],commit=} 0 71
[junit4:junit4]   2> 3973 T1737 C64 oasu.DirectUpdateHandler2.commit start commit{flags=0,_version_=0,optimize=false,openSearcher=true,waitSearcher=true,expungeDeletes=false,softCommit=false}
[junit4:junit4]   2> 3974 T1755 C66 oass.SolrIndexSearcher.<init> Opening Searcher@2bf40bd1 main
[junit4:junit4]   2> 3974 T1745 C65 UPDATE [collection1] webapp=/solr path=/update params={waitSearcher=true&commit=true&wt=javabin&expungeDeletes=false&version=2&softCommit=false} {add=[7 (1413145684985511936), 9 (1413145684993900544), 10 (1413145684993900546), 11 (1413145684995997696), 12 (1413145684997046273), 13 (1413145684997046276), 16 (1413145684999143424), 17 (1413145684999143427), 24 (1413145685000192000), 27 (1413145685000192003)],commit=} 0 72
[junit4:junit4]   2> 3975 T1755 C66 oass.SolrIndexSearcher.getIndexDir WARNING WARNING: Directory impl does not support setting indexDir: org.apache.lucene.store.MockDirectoryWrapper
[junit4:junit4]   2> 3974 T1767 C67 oass.SolrIndexSearcher.<init> Opening Searcher@396e5390 main
[junit4:junit4]   2> 3974 T1746 C65 oasu.DirectUpdateHandler2.commit start commit{flags=0,_version_=0,optimize=false,openSearcher=true,waitSearcher=true,expungeDeletes=false,softCommit=false}
[junit4:junit4]   2> 3976 T1761 oasc.SolrCore.registerSearcher [collection1] Registered new searcher Searcher@2bf40bd1 main{StandardDirectoryReader(segments_2:11:nrt _0(5.0):C22 _1(5.0):C8 _3(5.0):C4 _2(5.0):C41)}
[junit4:junit4]   2> 3976 T1767 C67 oass.SolrIndexSearcher.getIndexDir WARNING WARNING: Directory impl does not support setting indexDir: org.apache.lucene.store.BaseDirectoryWrapper
[junit4:junit4]   2> 3977 T1755 C66 oasu.DirectUpdateHandler2.commit end_commit_flush
[junit4:junit4]   2> 3979 T1767 C67 oasu.DirectUpdateHandler2.commit end_commit_flush
[junit4:junit4]   2> 3979 T1755 C66 UPDATE [collection1] webapp=/solr path=/update params={waitSearcher=true&commit=true&wt=javabin&expungeDeletes=false&version=2&softCommit=false} {add=[5 (1413145684985511936), 6 (1413145684993900544), 7 (1413145684993900546), 11 (1413145684995997696), 17 (1413145684997046273), 22 (1413145684998094848), 24 (1413145684999143424), 26 (1413145684999143428), 29 (1413145685000192002), 31 (1413145685001240576)],commit=} 0 76
[junit4:junit4]   2> 3980 T1768 C67 oasu.DirectUpdateHandler2.commit start commit{flags=0,_version_=0,optimize=false,openSearcher=true,waitSearcher=true,expungeDeletes=false,softCommit=false}
[junit4:junit4]   2> 3978 T1771 oasc.SolrCore.registerSearcher [collection1] Registered new searcher Searcher@396e5390 main{StandardDirectoryReader(segments_4:24:nrt _0(5.0):C22 _1(5.0):C6 _2(5.0):C10 _3(5.0):C3 _4(5.0):C23 _6(5.0):C14 _5(5.0):C10 _7(5.0):C1 _8(5.0):C1 _9(5.0):C17 _a(5.0):C1)}
[junit4:junit4]   2> 3980 T1756 C66 oasu.DirectUpdateHandler2.commit start commit{flags=0,_version_=0,optimize=false,openSearcher=true,waitSearcher=true,expungeDeletes=false,softCommit=false}
[junit4:junit4]   2> 3981 T1767 C67 UPDATE [collection1] webapp=/solr path=/update params={waitSearcher=true&commit=true&wt=javabin&expungeDeletes=false&version=2&softCommit=false} {add=[51 (1413145684995997696), 53 (1413145684997046272), 56 (1413145684997046275), 57 (1413145684999143425), 58 (1413145684999143428), 59 (1413145685000192001), 64 (1413145685000192003), 66 (1413145685001240576), 67 (1413145685003337728), 68 (1413145685009629184)],commit=} 0 69
[junit4:junit4]   2> 3991 T1737 C64 oasc.SolrDeletionPolicy.onCommit SolrDeletionPolicy.onCommit: commits:num=2
[junit4:junit4]   2> 		commit{dir=MockDirWrapper(NRTCachingDirectory(org.apache.lucene.store.RAMDirectory@6d865cfe lockFactory=org.apache.lucene.store.NativeFSLockFactory@4238f637; maxCacheMB=0.40625 maxMergeSizeMB=0.255859375)),segFN=segments_5,generation=5,filenames=[_3_nrm.cfe, _1_Pulsing40_0.tip, _3_MockVariableIntBlock_0.frq, _3_Lucene40WithOrds_0.tii, _1_Pulsing40_0.tim, _3.fdt, _1.fnm, _3_Lucene40WithOrds_0.tib, _1_Pulsing40_0.frq, _1_Asserting_0.tim, _1_Lucene40WithOrds_0.tib, _3_Asserting_0.prx, _1_Asserting_0.tip, _1_Pulsing40_0.prx, _2_Asserting_0.prx, _1_Lucene40WithOrds_0.tii, _2_Pulsing40_0.prx, _2_MockVariableIntBlock_0.pos, _1_Lucene40WithOrds_0.frq, _1_MockVariableIntBlock_0.tii, _3_MockVariableIntBlock_0.doc, _3_Pulsing40_0.tip, _2.fdt, _2.fdx, _3_Pulsing40_0.tim, _2_Pulsing40_0.frq, _1_MockVariableIntBlock_0.tib, _3_nrm.cfs, _1.fdx, _2_Asserting_0.tim, _2_Asserting_0.tip, _1.fdt, _3_MockVariableIntBlock_0.tib, _3.si, _2_MockVariableIntBlock_0.skp, _3_Pulsing40_0.frq, _1_MockVariableIntBlock_0.skp, _2.si, _2_Pulsing40_0.tim, _2_MockVariableIntBlock_0.pyl, _2_Pulsing40_0.tip, _1_Lucene40WithOrds_0.prx, _1_MockVariableIntBlock_0.pyl, _2_MockVariableIntBlock_0.frq, _3.fnm, _3_MockVariableIntBlock_0.tii, _2_MockVariableIntBlock_0.doc, _2_nrm.cfe, _2_Lucene40WithOrds_0.prx, _1_MockVariableIntBlock_0.doc, _2_Asserting_0.frq, _2_nrm.cfs, _1_nrm.cfs, _2_MockVariableIntBlock_0.tii, _2_Lucene40WithOrds_0.frq, _2_MockVariableIntBlock_0.tib, _1_MockVariableIntBlock_0.pos, _1_Asserting_0.frq, _3_Lucene40WithOrds_0.frq, _1_nrm.cfe, _2.fnm, _3_Asserting_0.frq, _3.fdx, _1_MockVariableIntBlock_0.frq, _2_Lucene40WithOrds_0.tii, _3_Pulsing40_0.prx, _3_Asserting_0.tim, _3_Asserting_0.tip, _1_Asserting_0.prx, _1.si, _3_MockVariableIntBlock_0.pyl, _2_Lucene40WithOrds_0.tib, _3_Lucene40WithOrds_0.prx, segments_5, _3_MockVariableIntBlock_0.skp, _3_MockVariableIntBlock_0.pos]
[junit4:junit4]   2> 		commit{dir=MockDirWrapper(NRTCachingDirectory(org.apache.lucene.store.RAMDirectory@6d865cfe lockFactory=org.apache.lucene.store.NativeFSLockFactory@4238f637; maxCacheMB=0.40625 maxMergeSizeMB=0.255859375)),segFN=segments_6,generation=6,filenames=[_5_nrm.cfe, _3_MockVariableIntBlock_0.frq, _6_Asserting_0.frq, _3.fdt, _4_MockVariableIntBlock_0.tii, _5_Lucene40WithOrds_0.tib, _1_Asserting_0.tim, _7.fnm, _5_Lucene40WithOrds_0.tii, _1_Lucene40WithOrds_0.tib, _1_Asserting_0.tip, _1_Lucene40WithOrds_0.tii, _5_Pulsing40_0.tip, _5_Pulsing40_0.tim, _6_MockVariableIntBlock_0.tii, _1_Lucene40WithOrds_0.frq, _6_MockVariableIntBlock_0.tib, _1_MockVariableIntBlock_0.tii, _8_Asserting_0.tim, _8_Asserting_0.tip, _1_MockVariableIntBlock_0.tib, _1.fdx, _4_MockVariableIntBlock_0.tib, _1.fdt, _5_nrm.cfs, _8_Pulsing40_0.frq, _8_MockVariableIntBlock_0.skp, _6.fdt, _5_Lucene40WithOrds_0.prx, _3_Pulsing40_0.frq, _1_MockVariableIntBlock_0.skp, _2.si, _2_Pulsing40_0.tim, _7_MockVariableIntBlock_0.pos, _2_Pulsing40_0.tip, _6.fdx, _1_Lucene40WithOrds_0.prx, _1_MockVariableIntBlock_0.pyl, _3_MockVariableIntBlock_0.tii, _7_Asserting_0.frq, _2_nrm.cfe, _5_Pulsing40_0.frq, _2_nrm.cfs, _7_MockVariableIntBlock_0.skp, _4_MockVariableIntBlock_0.frq, _2.fnm, _5_MockVariableIntBlock_0.frq, _3.fdx, _7_Pulsing40_0.tim, _4_Pulsing40_0.tip, _8_MockVariableIntBlock_0.pos, _4_Pulsing40_0.tim, _1.si, _3_MockVariableIntBlock_0.pos, _7_Pulsing40_0.tip, _3_nrm.cfe, _8_MockVariableIntBlock_0.frq, _8_nrm.cfe, _5_MockVariableIntBlock_0.pyl, _3_Lucene40WithOrds_0.tii, _4_nrm.cfe, _6_Lucene40WithOrds_0.prx, _8_Lucene40WithOrds_0.tib, _3_Lucene40WithOrds_0.tib, _4.fdx, _8_Lucene40WithOrds_0.frq, _8_Lucene40WithOrds_0.tii, _3_Asserting_0.prx, _1_Pulsing40_0.prx, _7_MockVariableIntBlock_0.tii, _2_Asserting_0.prx, _6_MockVariableIntBlock_0.frq, _3_MockVariableIntBlock_0.doc, _7_Lucene40WithOrds_0.tib, _5.si, _8_nrm.cfs, _3_nrm.cfs, _8_Pulsing40_0.tip, _7_Lucene40WithOrds_0.tii, _4_MockVariableIntBlock_0.pyl, _4_Lucene40WithOrds_0.prx, _6_Pulsing40_0.prx, _4_nrm.cfs, _3_MockVariableIntBlock_0.tib, _8_Pulsing40_0.tim, _5_Asserting_0.prx, _5_MockVariableIntBlock_0.doc, _6_MockVariableIntBlock_0.pyl, _8_MockVariableIntBlock_0.tib, _2_MockVariableIntBlock_0.frq, _6_Asserting_0.tim, _6_nrm.cfs, _6_Asserting_0.tip, _2_Lucene40WithOrds_0.prx, _7_nrm.cfs, _2_Asserting_0.frq, _5_Asserting_0.frq, _8_MockVariableIntBlock_0.doc, _1_nrm.cfs, _5.fnm, _7_nrm.cfe, _7_Asserting_0.prx, _6_nrm.cfe, _8_Asserting_0.prx, _4.si, _4.fdt, _3_Lucene40WithOrds_0.frq, _1_nrm.cfe, _3_Asserting_0.frq, _4_Pulsing40_0.frq, _8.fdx, _8_MockVariableIntBlock_0.tii, _8.fdt, _7.si, _8.si, _8_MockVariableIntBlock_0.pyl, _7_Lucene40WithOrds_0.frq, _5_MockVariableIntBlock_0.tii, _4_Asserting_0.frq, _4_MockVariableIntBlock_0.doc, _3_Pulsing40_0.tip, _2.fdt, _7.fdx, _7_MockVariableIntBlock_0.frq, _2.fdx, _3_Pulsing40_0.tim, _7.fdt, _2_Asserting_0.tim, _2_Asserting_0.tip, _7_Pulsing40_0.frq, _3.si, _2_MockVariableIntBlock_0.skp, _4_Lucene40WithOrds_0.tib, _4_Lucene40WithOrds_0.tii, _2_MockVariableIntBlock_0.pyl, _4_Asserting_0.tip, _3.fnm, _2_MockVariableIntBlock_0.doc, _4_Pulsing40_0.prx, _4_Asserting_0.prx, _4_Asserting_0.tim, _1_MockVariableIntBlock_0.doc, _2_MockVariableIntBlock_0.tii, _7_MockVariableIntBlock_0.pyl, _6_Asserting_0.prx, _2_Lucene40WithOrds_0.frq, _5_MockVariableIntBlock_0.tib, _2_MockVariableIntBlock_0.tib, _1_MockVariableIntBlock_0.pos, _1_Asserting_0.frq, _1_Asserting_0.prx, _5_Pulsing40_0.prx, _3_MockVariableIntBlock_0.pyl, _6.fnm, _6.si, _3_Lucene40WithOrds_0.prx, _7_MockVariableIntBlock_0.tib, _5.fdt, _1_Pulsing40_0.tip, _8_Asserting_0.frq, _6_Pulsing40_0.frq, _1_Pulsing40_0.tim, _4.fnm, _1.fnm, _7_MockVariableIntBlock_0.doc, _7_Pulsing40_0.prx, _1_Pulsing40_0.frq, _6_Pulsing40_0.tim, _8_Pulsing40_0.prx, _6_Pulsing40_0.tip, _7_Asserting_0.tip, _2_Pulsing40_0.prx, _6_MockVariableIntBlock_0.doc, _2_MockVariableIntBlock_0.pos, _7_Asserting_0.tim, _5_MockVariableIntBlock_0.pos, _6_Lucene40WithOrds_0.frq, _5_Asserting_0.tim, _6_Lucene40WithOrds_0.tii, _2_Pulsing40_0.frq, _5_Lucene40WithOrds_0.frq, _8.fnm, _6_Lucene40WithOrds_0.tib, _5_Asserting_0.tip, _4_Lucene40WithOrds_0.frq, _4_MockVariableIntBlock_0.skp, _5_MockVariableIntBlock_0.skp, _4_MockVariableIntBlock_0.pos, _6_MockVariableIntBlock_0.pos, _7_Lucene40WithOrds_0.prx, _6_MockVariableIntBlock_0.skp, _1_MockVariableIntBlock_0.frq, _2_Lucene40WithOrds_0.tii, _3_Pulsing40_0.prx, _3_Asserting_0.tim, _3_Asserting_0.tip, _5.fdx, _2_Lucene40WithOrds_0.tib, _8_Lucene40WithOrds_0.prx, _3_MockVariableIntBlock_0.skp, segments_6]
[junit4:junit4]   2> 3991 T1768 C67 oasc.SolrDeletionPolicy.onCommit SolrDeletionPolicy.onCommit: commits:num=2
[junit4:junit4]   2> 		commit{dir=BaseDirectoryWrapper(org.apache.lucene.store.RAMDirectory@314db005 lockFactory=org.apache.lucene.store.NativeFSLockFactory@7eae114b),segFN=segments_4,generation=4,filenames=[_5_nrm.cfe, _3_MockVariableIntBlock_0.frq, _6_Asserting_0.frq, _3.fdt, _4_MockVariableIntBlock_0.tii, _5_Lucene40WithOrds_0.tib, _1_Asserting_0.tim, _7.fnm, _0_Lucene40WithOrds_0.frq, _5_Lucene40WithOrds_0.tii, _1_Lucene40WithOrds_0.tib, _1_Asserting_0.tip, _1_Lucene40WithOrds_0.tii, _5_Pulsing40_0.tip, _6_MockVariableIntBlock_0.tii, _5_Pulsing40_0.tim, _1_Lucene40WithOrds_0.frq, _0_Pulsing40_0.tim, _6_MockVariableIntBlock_0.tib, _1_MockVariableIntBlock_0.tii, _8_Asserting_0.tim, _8_Asserting_0.tip, _1_MockVariableIntBlock_0.tib, _1.fdx, _4_MockVariableIntBlock_0.tib, _1.fdt, _5_nrm.cfs, _0_MockVariableIntBlock_0.frq, _8_Pulsing40_0.frq, _8_MockVariableIntBlock_0.skp, _6.fdt, _5_Lucene40WithOrds_0.prx, _3_Pulsing40_0.frq, _2.si, _1_MockVariableIntBlock_0.skp, _2_Pulsing40_0.tim, _7_MockVariableIntBlock_0.pos, _0_MockVariableIntBlock_0.doc, _2_Pulsing40_0.tip, _6.fdx, _1_Lucene40WithOrds_0.prx, _1_MockVariableIntBlock_0.pyl, _3_MockVariableIntBlock_0.tii, _7_Asserting_0.frq, _2_nrm.cfe, _5_Pulsing40_0.frq, _0_Pulsing40_0.tip, _0_MockVariableIntBlock_0.pos, _2_nrm.cfs, _7_MockVariableIntBlock_0.skp, _4_MockVariableIntBlock_0.frq, _2.fnm, _5_MockVariableIntBlock_0.frq, _7_Pulsing40_0.tim, _3.fdx, _8_MockVariableIntBlock_0.pos, _4_Pulsing40_0.tip, _4_Pulsing40_0.tim, _1.si, _0_Lucene40WithOrds_0.prx, _7_Pulsing40_0.tip, _3_MockVariableIntBlock_0.pos, _8_MockVariableIntBlock_0.frq, _3_nrm.cfe, _8_nrm.cfe, _5_MockVariableIntBlock_0.pyl, _3_Lucene40WithOrds_0.tii, _4_nrm.cfe, _6_Lucene40WithOrds_0.prx, _8_Lucene40WithOrds_0.tib, _0_Pulsing40_0.prx, _3_Lucene40WithOrds_0.tib, _8_Lucene40WithOrds_0.frq, _4.fdx, _8_Lucene40WithOrds_0.tii, _3_Asserting_0.prx, _1_Pulsing40_0.prx, _7_MockVariableIntBlock_0.tii, _2_Asserting_0.prx, _6_MockVariableIntBlock_0.frq, _3_MockVariableIntBlock_0.doc, _7_Lucene40WithOrds_0.tib, _8_nrm.cfs, _5.si, _8_Pulsing40_0.tip, _3_nrm.cfs, _7_Lucene40WithOrds_0.tii, _4_MockVariableIntBlock_0.pyl, _4_Lucene40WithOrds_0.prx, _6_Pulsing40_0.prx, _4_nrm.cfs, _3_MockVariableIntBlock_0.tib, _8_Pulsing40_0.tim, _5_Asserting_0.prx, _5_MockVariableIntBlock_0.doc, _8_MockVariableIntBlock_0.tib, _6_MockVariableIntBlock_0.pyl, _2_MockVariableIntBlock_0.frq, _6_Asserting_0.tim, _6_nrm.cfs, _6_Asserting_0.tip, _2_Lucene40WithOrds_0.prx, _7_nrm.cfs, _2_Asserting_0.frq, _5_Asserting_0.frq, _8_MockVariableIntBlock_0.doc, _1_nrm.cfs, _5.fnm, _7_nrm.cfe, _7_Asserting_0.prx, _6_nrm.cfe, _8_Asserting_0.prx, _3_Lucene40WithOrds_0.frq, _4.fdt, _4.si, _1_nrm.cfe, _3_Asserting_0.frq, _4_Pulsing40_0.frq, _8.fdx, _8_MockVariableIntBlock_0.tii, _8.fdt, _7.si, _0_Pulsing40_0.frq, _8.si, _0_Lucene40WithOrds_0.tii, _8_MockVariableIntBlock_0.pyl, _7_Lucene40WithOrds_0.frq, _5_MockVariableIntBlock_0.tii, _0_Lucene40WithOrds_0.tib, _4_Asserting_0.frq, _4_MockVariableIntBlock_0.doc, _3_Pulsing40_0.tip, _2.fdt, _7.fdx, _7_MockVariableIntBlock_0.frq, _2.fdx, _7.fdt, _3_Pulsing40_0.tim, _2_Asserting_0.tim, _0_Asserting_0.frq, _7_Pulsing40_0.frq, _2_Asserting_0.tip, _3.si, _2_MockVariableIntBlock_0.skp, _0_Asserting_0.tim, _4_Lucene40WithOrds_0.tib, _2_MockVariableIntBlock_0.pyl, _4_Lucene40WithOrds_0.tii, _0_Asserting_0.tip, _4_Asserting_0.tip, _3.fnm, _2_MockVariableIntBlock_0.doc, _0_MockVariableIntBlock_0.pyl, _4_Pulsing40_0.prx, _4_Asserting_0.prx, _4_Asserting_0.tim, _1_MockVariableIntBlock_0.doc, _2_MockVariableIntBlock_0.tii, _7_MockVariableIntBlock_0.pyl, _6_Asserting_0.prx, _2_Lucene40WithOrds_0.frq, _5_MockVariableIntBlock_0.tib, _2_MockVariableIntBlock_0.tib, _1_MockVariableIntBlock_0.pos, _1_Asserting_0.frq, _1_Asserting_0.prx, _5_Pulsing40_0.prx, _3_MockVariableIntBlock_0.pyl, _6.fnm, _6.si, _7_MockVariableIntBlock_0.tib, _3_Lucene40WithOrds_0.prx, _5.fdt, _8_Asserting_0.frq, _1_Pulsing40_0.tip, _6_Pulsing40_0.frq, _1_Pulsing40_0.tim, _4.fnm, _0_MockVariableIntBlock_0.skp, _1.fnm, _7_MockVariableIntBlock_0.doc, _7_Pulsing40_0.prx, _0_Asserting_0.prx, _1_Pulsing40_0.frq, _6_Pulsing40_0.tim, _8_Pulsing40_0.prx, _6_Pulsing40_0.tip, _7_Asserting_0.tip, _2_Pulsing40_0.prx, _6_MockVariableIntBlock_0.doc, _2_MockVariableIntBlock_0.pos, _7_Asserting_0.tim, _0.fnm, _6_Lucene40WithOrds_0.frq, _5_MockVariableIntBlock_0.pos, _5_Asserting_0.tim, _6_Lucene40WithOrds_0.tii, _2_Pulsing40_0.frq, _5_Lucene40WithOrds_0.frq, _8.fnm, _6_Lucene40WithOrds_0.tib, _5_Asserting_0.tip, _4_Lucene40WithOrds_0.frq, _4_MockVariableIntBlock_0.skp, _0_MockVariableIntBlock_0.tib, _5_MockVariableIntBlock_0.skp, _4_MockVariableIntBlock_0.pos, _6_MockVariableIntBlock_0.pos, _7_Lucene40WithOrds_0.prx, _0.si, _0_MockVariableIntBlock_0.tii, _0_nrm.cfs, _6_MockVariableIntBlock_0.skp, _2_Lucene40WithOrds_0.tii, _1_MockVariableIntBlock_0.frq, _3_Pulsing40_0.prx, _3_Asserting_0.tim, _3_Asserting_0.tip, _0_nrm.cfe, _5.fdx, _2_Lucene40WithOrds_0.tib, _0.fdx, _8_Lucene40WithOrds_0.prx, _3_MockVariableIntBlock_0.skp, _0.fdt, segments_4]
[junit4:junit4]   2> 		commit{dir=BaseDirectoryWrapper(org.apache.lucene.store.RAMDirectory@314db005 lockFactory=org.apache.lucene.store.NativeFSLockFactory@7eae114b),segFN=segments_5,generation=5,filenames=[_d_MockVariableIntBlock_0.frq, _4_MockVariableIntBlock_0.tii, _c.si, _4_Asserting_0.frq, _b_Asserting_0.prx, _c_MockVariableIntBlock_0.doc, _b_Lucene40WithOrds_0.tib, _4_MockVariableIntBlock_0.doc, _b_Lucene40WithOrds_0.tii, _d_Lucene40WithOrds_0.frq, _b_MockVariableIntBlock_0.tii, _4_MockVariableIntBlock_0.tib, _b_MockVariableIntBlock_0.tib, _c_Lucene40WithOrds_0.tib, _4_Lucene40WithOrds_0.tib, _4_Lucene40WithOrds_0.tii, _b_Lucene40WithOrds_0.prx, _c_Lucene40WithOrds_0.tii, _4_Asserting_0.tip, _b_Asserting_0.tim, _d_Asserting_0.prx, _c_Asserting_0.frq, _c_Pulsing40_0.prx, _d_Pulsing40_0.prx, _c_MockVariableIntBlock_0.tii, _b_Asserting_0.tip, _4_Pulsing40_0.prx, _d_MockVariableIntBlock_0.pyl, _4_Asserting_0.prx, _b.si, _c_MockVariableIntBlock_0.tib, _4_Asserting_0.tim, _b_MockVariableIntBlock_0.skp, _b_MockVariableIntBlock_0.pyl, _4_MockVariableIntBlock_0.frq, _d_Pulsing40_0.tip, _c_Pulsing40_0.tip, _b_Pulsing40_0.tip, _c_Pulsing40_0.tim, _d_Pulsing40_0.tim, _c_Lucene40WithOrds_0.prx, _c_Asserting_0.prx, _b_Pulsing40_0.tim, _d_nrm.cfs, _d.fdx, _b_MockVariableIntBlock_0.pos, _4_Pulsing40_0.tip, _d.fdt, _4_Pulsing40_0.tim, _c.fnm, _d_nrm.cfe, _b_Pulsing40_0.frq, _4_nrm.cfe, _4.fnm, _d_Pulsing40_0.frq, _d_MockVariableIntBlock_0.tib, _c.fdx, _4.fdx, _c.fdt, _d_MockVariableIntBlock_0.tii, _d_MockVariableIntBlock_0.pos, _c_Lucene40WithOrds_0.frq, _b_Pulsing40_0.prx, _b_MockVariableIntBlock_0.doc, _d.fnm, _d_Asserting_0.frq, _c_MockVariableIntBlock_0.frq, _d_MockVariableIntBlock_0.doc, _4_MockVariableIntBlock_0.pyl, _d_Asserting_0.tim, _4_Lucene40WithOrds_0.prx, _4_nrm.cfs, _d.si, _c_Pulsing40_0.frq, _b_MockVariableIntBlock_0.frq, _d_Lucene40WithOrds_0.prx, _4_Lucene40WithOrds_0.frq, _c_MockVariableIntBlock_0.pos, _b_Asserting_0.frq, _c_Asserting_0.tim, _c_Asserting_0.tip, _d_Asserting_0.tip, _4_MockVariableIntBlock_0.skp, _4_MockVariableIntBlock_0.pos, _d_MockVariableIntBlock_0.skp, _d_Lucene40WithOrds_0.tib, _c_MockVariableIntBlock_0.pyl, _c_nrm.cfe, _d_Lucene40WithOrds_0.tii, _4.si, _4.fdt, _b_Lucene40WithOrds_0.frq, _4_Pulsing40_0.frq, _b_nrm.cfe, _c_nrm.cfs, _c_MockVariableIntBlock_0.skp, _b.fnm, _b.fdt, _b_nrm.cfs, segments_5, _b.fdx]
[junit4:junit4]   2> 3992 T1737 C64 oasc.SolrDeletionPolicy.updateCommits newest commit = 6
[junit4:junit4]   2> 3994 T1768 C67 oasc.SolrDeletionPolicy.updateCommits newest commit = 5
[junit4:junit4]   2> 4003 T1768 C67 oass.SolrIndexSearcher.<init> Opening Searcher@28bf8761 main
[junit4:junit4]   2> 4003 T1768 C67 oass.SolrIndexSearcher.getIndexDir WARNING WARNING: Directory impl does not support setting indexDir: org.apache.lucene.store.BaseDirectoryWrapper
[junit4:junit4]   2> 4004 T1746 C65 oasc.SolrDeletionPolicy.onCommit SolrDeletionPolicy.onCommit: commits:num=2
[junit4:junit4]   2> 		commit{dir=MockDirWrapper(org.apache.lucene.store.RAMDirectory@44296e84 lockFactory=org.apache.lucene.store.NativeFSLockFactory@2ec04de9),segFN=segments_2,generation=2,filenames=[_1_Pulsing40_0.tip, _1_Pulsing40_0.tim, _0_MockVariableIntBlock_0.skp, _0_Pulsing40_0.prx, _0_Pulsing40_0.frq, _1.fnm, _0_Asserting_0.prx, _1_Pulsing40_0.frq, _1_Asserting_0.tim, _0_Lucene40WithOrds_0.tii, _0_Lucene40WithOrds_0.frq, _1_Lucene40WithOrds_0.tib, _1_Asserting_0.tip, _1_Pulsing40_0.prx, _1_Lucene40WithOrds_0.tii, _0_Lucene40WithOrds_0.tib, _1_Lucene40WithOrds_0.frq, _0_Pulsing40_0.tim, _0.fnm, _1_MockVariableIntBlock_0.tii, _1_MockVariableIntBlock_0.tib, _1.fdx, _0_Asserting_0.frq, _1.fdt, _0_MockVariableIntBlock_0.frq, _0_Asserting_0.tim, _1_MockVariableIntBlock_0.skp, _0_Asserting_0.tip, _0_MockVariableIntBlock_0.doc, _1_Lucene40WithOrds_0.prx, _1_MockVariableIntBlock_0.pyl, _0_MockVariableIntBlock_0.pyl, _0_MockVariableIntBlock_0.tib, _1_MockVariableIntBlock_0.doc, _0_Pulsing40_0.tip, _0_MockVariableIntBlock_0.pos, _0.si, _0_MockVariableIntBlock_0.tii, _1_nrm.cfs, _1_MockVariableIntBlock_0.pos, _1_Asserting_0.frq, _0_nrm.cfs, _1_nrm.cfe, _1_MockVariableIntBlock_0.frq, _1_Asserting_0.prx, _1.si, _0_nrm.cfe, segments_2, _0.fdx, _0_Lucene40WithOrds_0.prx, _0.fdt]
[junit4:junit4]   2> 		commit{dir=MockDirWrapper(org.apache.lucene.store.RAMDirectory@44296e84 lockFactory=org.apache.lucene.store.NativeFSLockFactory@2ec04de9),segFN=segments_3,generation=3,filenames=[_5_nrm.cfe, _3_MockVariableIntBlock_0.frq, _3.fdt, _5_Lucene40WithOrds_0.tib, _4_MockVariableIntBlock_0.tii, _0_Pulsing40_0.frq, _1_Asserting_0.tim, _0_Lucene40WithOrds_0.tii, _5_Lucene40WithOrds_0.tii, _0_Lucene40WithOrds_0.frq, _1_Lucene40WithOrds_0.tib, _1_Asserting_0.tip, _5_MockVariableIntBlock_0.tii, _5_Pulsing40_0.tip, _1_Lucene40WithOrds_0.tii, _0_Lucene40WithOrds_0.tib, _5_Pulsing40_0.tim, _4_Asserting_0.frq, _1_Lucene40WithOrds_0.frq, _0_Pulsing40_0.tim, _1_MockVariableIntBlock_0.tii, _4_MockVariableIntBlock_0.doc, _2.fdt, _3_Pulsing40_0.tip, _2.fdx, _3_Pulsing40_0.tim, _1_MockVariableIntBlock_0.tib, _1.fdx, _2_Asserting_0.tim, _0_Asserting_0.frq, _4_MockVariableIntBlock_0.tib, _2_Asserting_0.tip, _5_nrm.cfs, _1.fdt, _0_MockVariableIntBlock_0.frq, _3.si, _2_MockVariableIntBlock_0.skp, _5_Lucene40WithOrds_0.prx, _1_MockVariableIntBlock_0.skp, _0_Asserting_0.tim, _2.si, _3_Pulsing40_0.frq, _2_Pulsing40_0.tim, _4_Lucene40WithOrds_0.tib, _4_Lucene40WithOrds_0.tii, _2_MockVariableIntBlock_0.pyl, _0_Asserting_0.tip, _0_MockVariableIntBlock_0.doc, _2_Pulsing40_0.tip, _1_Lucene40WithOrds_0.prx, _1_MockVariableIntBlock_0.pyl, _4_Asserting_0.tip, _3.fnm, _2_MockVariableIntBlock_0.doc, _3_MockVariableIntBlock_0.tii, _4_Pulsing40_0.prx, _0_MockVariableIntBlock_0.pyl, _4_Asserting_0.prx, _2_nrm.cfe, _5_Pulsing40_0.frq, _4_Asserting_0.tim, _1_MockVariableIntBlock_0.doc, _0_MockVariableIntBlock_0.pos, _0_Pulsing40_0.tip, _2_nrm.cfs, _2_MockVariableIntBlock_0.tii, _5_MockVariableIntBlock_0.tib, _2_Lucene40WithOrds_0.frq, _2_MockVariableIntBlock_0.tib, _1_MockVariableIntBlock_0.pos, _4_MockVariableIntBlock_0.frq, _1_Asserting_0.frq, _5_MockVariableIntBlock_0.frq, _2.fnm, _3.fdx, _4_Pulsing40_0.tip, _4_Pulsing40_0.tim, _5_Pulsing40_0.prx, _1_Asserting_0.prx, _1.si, _3_MockVariableIntBlock_0.pyl, _0_Lucene40WithOrds_0.prx, _3_Lucene40WithOrds_0.prx, _3_MockVariableIntBlock_0.pos, _3_nrm.cfe, _5.fdt, _1_Pulsing40_0.tip, _5_MockVariableIntBlock_0.pyl, _1_Pulsing40_0.tim, _3_Lucene40WithOrds_0.tii, _4_nrm.cfe, _4.fnm, _0_MockVariableIntBlock_0.skp, _0_Pulsing40_0.prx, _1.fnm, _3_Lucene40WithOrds_0.tib, _4.fdx, _1_Pulsing40_0.frq, _0_Asserting_0.prx, _3_Asserting_0.prx, _1_Pulsing40_0.prx, _2_Asserting_0.prx, _2_Pulsing40_0.prx, _2_MockVariableIntBlock_0.pos, _5_MockVariableIntBlock_0.pos, _0.fnm, _5_Asserting_0.tim, _3_MockVariableIntBlock_0.doc, _2_Pulsing40_0.frq, _5.si, _5_Lucene40WithOrds_0.frq, _3_nrm.cfs, _4_MockVariableIntBlock_0.pyl, _4_Lucene40WithOrds_0.prx, _4_nrm.cfs, _5_Asserting_0.tip, _3_MockVariableIntBlock_0.tib, _5_Asserting_0.prx, _5_MockVariableIntBlock_0.doc, _4_Lucene40WithOrds_0.frq, _2_MockVariableIntBlock_0.frq, _4_MockVariableIntBlock_0.skp, _2_Lucene40WithOrds_0.prx, _0_MockVariableIntBlock_0.tib, _5_MockVariableIntBlock_0.skp, _5_Asserting_0.frq, _4_MockVariableIntBlock_0.pos, _2_Asserting_0.frq, _0.si, _0_MockVariableIntBlock_0.tii, _1_nrm.cfs, _5.fnm, _4.si, _4.fdt, _0_nrm.cfs, _3_Lucene40WithOrds_0.frq, _1_nrm.cfe, _3_Asserting_0.frq, _1_MockVariableIntBlock_0.frq, _2_Lucene40WithOrds_0.tii, _4_Pulsing40_0.frq, _3_Pulsing40_0.prx, _3_Asserting_0.tim, _3_Asserting_0.tip, _0_nrm.cfe, _5.fdx, _0.fdx, _2_Lucene40WithOrds_0.tib, _3_MockVariableIntBlock_0.skp, _0.fdt, segments_3]
[junit4:junit4]   2> 4004 T1771 oasc.SolrCore.registerSearcher [collection1] Registered new searcher Searcher@28bf8761 main{StandardDirectoryReader(segments_5:39:nrt _c(5.0):C85 _4(5.0):C23 _b(5.0):C24 _d(5.0):C4 _e(5.0):C7 _f(5.0):C6 _g(5.0):C2 _h(5.0):C1)}
[junit4:junit4]   2> 4005 T1768 C67 oasu.DirectUpdateHandler2.commit end_commit_flush
[junit4:junit4]   2> 4006 T1746 C65 oasc.SolrDeletionPolicy.updateCommits newest commit = 3
[junit4:junit4]   2> 4007 T1770 C67 oasu.DirectUpdateHandler2.commit start commit{flags=0,_version_=0,optimize=false,openSearcher=true,waitSearcher=true,expungeDeletes=false,softCommit=false}
[junit4:junit4]   2> 4007 T1768 C67 UPDATE [collection1] webapp=/solr path=/update params={waitSearcher=true&commit=true&wt=javabin&expungeDeletes=false&version=2&softCommit=false} {add=[69 (1413145685006483456), 70 (1413145685008580608), 71 (1413145685009629185), 72 (1413145685009629186), 75 (1413145685010677760), 76 (1413145685010677762), 77 (1413145685011726337), 81 (1413145685012774912), 82 (1413145685013823488), 92 (1413145685013823490)],commit=} 0 84
[junit4:junit4]   2> 4014 T1770 C67 oasc.SolrDeletionPolicy.onCommit SolrDeletionPolicy.onCommit: commits:num=2
[junit4:junit4]   2> 		commit{dir=BaseDirectoryWrapper(org.apache.lucene.store.RAMDirectory@314db005 lockFactory=org.apache.lucene.store.NativeFSLockFactory@7eae114b),segFN=segments_5,generation=5,filenames=[_d_MockVariableIntBlock_0.frq, _4_MockVariableIntBlock_0.tii, _c.si, _4_Asserting_0.frq, _b_Asserting_0.prx, _c_MockVariableIntBlock_0.doc, _b_Lucene40WithOrds_0.tib, _4_MockVariableIntBlock_0.doc, _b_Lucene40WithOrds_0.tii, _d_Lucene40WithOrds_0.frq, _b_MockVariableIntBlock_0.tii, _4_MockVariableIntBlock_0.tib, _b_MockVariableIntBlock_0.tib, _c_Lucene40WithOrds_0.tib, _4_Lucene40WithOrds_0.tib, _4_Lucene40WithOrds_0.tii, _b_Lucene40WithOrds_0.prx, _c_Lucene40WithOrds_0.tii, _4_Asserting_0.tip, _b_Asserting_0.tim, _d_Asserting_0.prx, _c_Asserting_0.frq, _c_Pulsing40_0.prx, _d_Pulsing40_0.prx, _c_MockVariableIntBlock_0.tii, _b_Asserting_0.tip, _4_Pulsing40_0.prx, _d_MockVariableIntBlock_0.pyl, _4_Asserting_0.prx, _b.si, _c_MockVariableIntBlock_0.tib, _4_Asserting_0.tim, _b_MockVariableIntBlock_0.skp, _b_MockVariableIntBlock_0.pyl, _4_MockVariableIntBlock_0.frq, _d_Pulsing40_0.tip, _c_Pulsing40_0.tip, _b_Pulsing40_0.tip, _c_Pulsing40_0.tim, _d_Pulsing40_0.tim, _c_Lucene40WithOrds_0.prx, _c_Asserting_0.prx, _b_Pulsing40_0.tim, _d_nrm.cfs, _d.fdx, _b_MockVariableIntBlock_0.pos, _4_Pulsing40_0.tip, _d.fdt, _4_Pulsing40_0.tim, _c.fnm, _d_nrm.cfe, _b_Pulsing40_0.frq, _4_nrm.cfe, _4.fnm, _d_Pulsing40_0.frq, _d_MockVariableIntBlock_0.tib, _c.fdx, _4.fdx, _c.fdt, _d_MockVariableIntBlock_0.tii, _d_MockVariableIntBlock_0.pos, _c_Lucene40WithOrds_0.frq, _b_Pulsing40_0.prx, _b_MockVariableIntBlock_0.doc, _d.fnm, _d_Asserting_0.frq, _c_MockVariableIntBlock_0.frq, _d_MockVariableIntBlock_0.doc, _4_MockVariableIntBlock_0.pyl, _d_Asserting_0.tim, _4_Lucene40WithOrds_0.prx, _4_nrm.cfs, _d.si, _c_Pulsing40_0.frq, _b_MockVariableIntBlock_0.frq, _d_Lucene40WithOrds_0.prx, _4_Lucene40WithOrds_0.frq, _c_MockVariableIntBlock_0.pos, _b_Asserting_0.frq, _c_Asserting_0.tim, _c_Asserting_0.tip, _d_Asserting_0.tip, _4_MockVariableIntBlock_0.skp, _4_MockVariableIntBlock_0.pos, _d_MockVariableIntBlock_0.skp, _d_Lucene40WithOrds_0.tib, _c_MockVariableIntBlock_0.pyl, _c_nrm.cfe, _d_Lucene40WithOrds_0.tii, _4.si, _4.fdt, _b_Lucene40WithOrds_0.frq, _4_Pulsing40_0.frq, _b_nrm.cfe, _c_nrm.cfs, _c_MockVariableIntBlock_0.skp, _b.fnm, _b.fdt, _b_nrm.cfs, segments_5, _b.fdx]
[junit4:junit4]   2> 		commit{dir=BaseDirectoryWrapper(org.apache.lucene.store.RAMDirectory@314db005 lockFactory=org.apache.lucene.store.NativeFSLockFactory@7eae114b),segFN=segments_6,generation=6,filenames=[_e_MockVariableIntBlock_0.doc, _g_Lucene40WithOrds_0.tii, _j_Lucene40WithOrds_0.tib, _4_MockVariableIntBlock_0.tii, _g_MockVariableIntBlock_0.tib, _f.si, _c.si, _g_MockVariableIntBlock_0.frq, _h.fdt, _j_Pulsing40_0.frq, _g_MockVariableIntBlock_0.tii, _e_Pulsing40_0.tip, _e_Pulsing40_0.tim, _h.fdx, _j_MockVariableIntBlock_0.pyl, _g.fdt, _g.fdx, _h_MockVariableIntBlock_0.skp, _f_MockVariableIntBlock_0.tib, _i_MockVariableIntBlock_0.doc, _h_Pulsing40_0.tim, _e_Pulsing40_0.frq, _j_Lucene40WithOrds_0.tii, _e_Lucene40WithOrds_0.tib, _4_MockVariableIntBlock_0.tib, _h_Pulsing40_0.prx, _i_Asserting_0.tim, _j_MockVariableIntBlock_0.tii, _f_MockVariableIntBlock_0.tii, _j_MockVariableIntBlock_0.tib, _h_Pulsing40_0.tip, _i_Asserting_0.tip, _c_Lucene40WithOrds_0.tib, _f_Pulsing40_0.prx, _b_Lucene40WithOrds_0.prx, _c_Lucene40WithOrds_0.tii, _b_Asserting_0.tim, _c_Pulsing40_0.prx, _c_Asserting_0.frq, _e_Lucene40WithOrds_0.tii, _i_nrm.cfe, _b_Asserting_0.tip, _i_Lucene40WithOrds_0.frq, _i_nrm.cfs, _h_Lucene40WithOrds_0.tii, _i_Pulsing40_0.tip, _h_MockVariableIntBlock_0.doc, _i_Pulsing40_0.tim, _i.fdx, _b_MockVariableIntBlock_0.skp, _i.fdt, _h_MockVariableIntBlock_0.pos, _g_Asserting_0.tim, _j_Asserting_0.tim, _g_Asserting_0.tip, _j_Asserting_0.tip, _4_MockVariableIntBlock_0.frq, _e_MockVariableIntBlock_0.pyl, _h_Asserting_0.prx, _d_Pulsing40_0.tip, _e_MockVariableIntBlock_0.tii, _j_MockVariableIntBlock_0.frq, _b_Pulsing40_0.tip, _d_Pulsing40_0.tim, _b_Pulsing40_0.tim, _c_Asserting_0.prx, _h_Lucene40WithOrds_0.tib, _b_MockVariableIntBlock_0.pos, _4_Pulsing40_0.tip, _e_MockVariableIntBlock_0.tib, _4_Pulsing40_0.tim, _i_Pulsing40_0.frq, _h_MockVariableIntBlock_0.pyl, _e_Pulsing40_0.prx, _4_nrm.cfe, _h_Asserting_0.tim, _c.fdx, _e_MockVariableIntBlock_0.frq, _h_Asserting_0.tip, _c.fdt, _4.fdx, _g_MockVariableIntBlock_0.doc, _e_MockVariableIntBlock_0.pos, _h_Lucene40WithOrds_0.frq, _f_MockVariableIntBlock_0.frq, _e_Lucene40WithOrds_0.prx, _e.fnm, _d_MockVariableIntBlock_0.pos, _c_Lucene40WithOrds_0.frq, _h.fnm, _j_nrm.cfe, _b_Pulsing40_0.prx, _d_Asserting_0.frq, _i_MockVariableIntBlock_0.frq, _g_MockVariableIntBlock_0.pos, _d_MockVariableIntBlock_0.doc, _f_Pulsing40_0.frq, _4_MockVariableIntBlock_0.pyl, _4_Lucene40WithOrds_0.prx, _d_Asserting_0.tim, _4_nrm.cfs, _g_Asserting_0.frq, _d.si, _h_Asserting_0.frq, _j_nrm.cfs, _f_MockVariableIntBlock_0.pyl, _h_Lucene40WithOrds_0.prx, _d_Lucene40WithOrds_0.prx, _h_nrm.cfe, _i_MockVariableIntBlock_0.tii, _c_MockVariableIntBlock_0.pos, _i_Pulsing40_0.prx, _d_Asserting_0.tip, _i_MockVariableIntBlock_0.tib, _f_Pulsing40_0.tim, _h_nrm.cfs, _f_Pulsing40_0.tip, _d_MockVariableIntBlock_0.skp, _f_Asserting_0.prx, _h_MockVariableIntBlock_0.tii, _c_nrm.cfe, _4.fdt, _4.si, _4_Pulsing40_0.frq, _f_Lucene40WithOrds_0.frq, _c_nrm.cfs, _c_MockVariableIntBlock_0.skp, _b.fnm, _b.fdt, _h_MockVariableIntBlock_0.tib, _b.fdx, _f_MockVariableIntBlock_0.skp, _f_nrm.cfe, _d_MockVariableIntBlock_0.frq, _j_Pulsing40_0.tip, _j_Pulsing40_0.tim, _i_Lucene40WithOrds_0.prx, _j_Asserting_0.prx, _j_MockVariableIntBlock_0.doc, _e_nrm.cfe, _e_MockVariableIntBlock_0.skp, _f_nrm.cfs, _e_nrm.cfs, _i_Asserting_0.prx, _4_Asserting_0.frq, _b_Asserting_0.prx, _b_Lucene40WithOrds_0.tib, _c_MockVariableIntBlock_0.doc, _e_Asserting_0.tim, _4_MockVariableIntBlock_0.doc, _f_Asserting_0.frq, _d_Lucene40WithOrds_0.frq, _b_Lucene40WithOrds_0.tii, _f.fdt, _b_MockVariableIntBlock_0.tii, _f.fdx, _e.si, _b_MockVariableIntBlock_0.tib, _e_Lucene40WithOrds_0.frq, _i_MockVariableIntBlock_0.skp, _e_Asserting_0.frq, _j.fdx, _i_MockVariableIntBlock_0.pos, _4_Lucene40WithOrds_0.tib, _j.fdt, _4_Lucene40WithOrds_0.tii, _d_Asserting_0.prx, _4_Asserting_0.tip, _d_Pulsing40_0.prx, _e.fdx, _i.si, _c_MockVariableIntBlock_0.tii, _d_MockVariableIntBlock_0.pyl, _4_Pulsing40_0.prx, _4_Asserting_0.prx, _j_Lucene40WithOrds_0.prx, _b.si, _c_MockVariableIntBlock_0.tib, _4_Asserting_0.tim, _e.fdt, _b_MockVariableIntBlock_0.pyl, _e_Asserting_0.tip, _f_Lucene40WithOrds_0.prx, _j.si, _g_nrm.cfs, _c_Pulsing40_0.tip, _c_Pulsing40_0.tim, _c_Lucene40WithOrds_0.prx, _d_nrm.cfs, _g_Lucene40WithOrds_0.prx, _d.fdx, _d.fdt, _g_nrm.cfe, _j_MockVariableIntBlock_0.pos, _c.fnm, _f_MockVariableIntBlock_0.doc, _d_nrm.cfe, _g_Lucene40WithOrds_0.frq, _b_Pulsing40_0.frq, _e_Asserting_0.prx, _d_Pulsing40_0.frq, _4.fnm, _d_MockVariableIntBlock_0.tib, _f_Asserting_0.tim, _d_MockVariableIntBlock_0.tii, _i_Asserting_0.frq, _h.si, _j_Lucene40WithOrds_0.frq, _j_Pulsing40_0.prx, _f_MockVariableIntBlock_0.pos, _d.fnm, _b_MockVariableIntBlock_0.doc, _c_MockVariableIntBlock_0.frq, _i_Lucene40WithOrds_0.tii, _g_Asserting_0.prx, _c_Pulsing40_0.frq, _g.si, _g_MockVariableIntBlock_0.skp, _b_MockVariableIntBlock_0.frq, _h_Pulsing40_0.frq, _j_Asserting_0.frq, _f_Lucene40WithOrds_0.tii, _4_Lucene40WithOrds_0.frq, _b_Asserting_0.frq, _c_Asserting_0.tim, _c_Asserting_0.tip, _g_Pulsing40_0.frq, _i_Lucene40WithOrds_0.tib, _g.fnm, _4_MockVariableIntBlock_0.skp, _4_MockVariableIntBlock_0.pos, _i_MockVariableIntBlock_0.pyl, _d_Lucene40WithOrds_0.tib, _c_MockVariableIntBlock_0.pyl, _d_Lucene40WithOrds_0.tii, _g_Pulsing40_0.tip, _g_MockVariableIntBlock_0.pyl, _g_Pulsing40_0.tim, _g_Lucene40WithOrds_0.tib, _g_Pulsing40_0.prx, _b_Lucene40WithOrds_0.frq, _h_MockVariableIntBlock_0.frq, _f_Asserting_0.tip, _j_MockVariableIntBlock_0.skp, _f.fnm, _j.fnm, _b_nrm.cfe, _b_nrm.cfs, _i.fnm, segments_6, _f_Lucene40WithOrds_0.tib]
[junit4:junit4]   2> 4016 T1770 C67 oasc.SolrDeletionPolicy.updateCommits newest commit = 6
[junit4:junit4]   2> 4018 T1770 C67 oass.SolrIndexSearcher.<init> Opening Searcher@1ba9d893 main
[junit4:junit4]   2> 4018 T1770 C67 oass.SolrIndexSearcher.getIndexDir WARNING WARNING: Directory impl does not support setting indexDir: org.apache.lucene.store.BaseDirectoryWrapper
[junit4:junit4]   2> 4019 T1771 oasc.SolrCore.registerSearcher [collection1] Registered new searcher Searcher@1ba9d893 main{StandardDirectoryReader(segments_6:42:nrt _c(5.0):C85 _4(5.0):C23 _b(5.0):C24 _d(5.0):C4 _e(5.0):C7 _f(5.0):C6 _g(5.0):C2 _h(5.0):C1 _i(5.0):C22 _j(5.0):C16)}
[junit4:junit4]   2> 4019 T1770 C67 oasu.DirectUpdateHandler2.commit end_commit_flush
[junit4:junit4]   2> 4020 T1770 C67 UPDATE [collection1] webapp=/solr path=/update params={waitSearcher=true&commit=true&wt=javabin&expungeDeletes=false&version=2&softCommit=false} {add=[115 (1413145685011726339), 116 (1413145685012774913), 120 (1413145685013823489), 121 (1413145685014872064), 122 (1413145685014872065), 123 (1413145685015920640), 124 (1413145685015920641), 129 (1413145685016969216), 131 (1413145685016969218), 132 (1413145685016969219)],commit=} 0 92
[junit4:junit4]   2> 4020 T1804 C67 oasu.DirectUpdateHandler2.commit start commit{flags=0,_version_=0,optimize=false,openSearcher=true,waitSearcher=true,expungeDeletes=false,softCommit=false}
[junit4:junit4]   2> 4022 T1804 C67 oasc.SolrDeletionPolicy.onCommit SolrDeletionPolicy.onCommit: commits:num=2
[junit4:junit4]   2> 		commit{dir=BaseDirectoryWrapper(org.apache.lucene.store.RAMDirectory@314db005 lockFactory=org.apache.lucene.store.NativeFSLockFactory@7eae114b),segFN=segments_6,generation=6,filenames=[_e_MockVariableIntBlock_0.doc, _g_Lucene40WithOrds_0.tii, _j_Lucene40WithOrds_0.tib, _4_MockVariableIntBlock_0.tii, _g_MockVariableIntBlock_0.tib, _f.si, _c.si, _g_MockVariableIntBlock_0.frq, _h.fdt, _j_Pulsing40_0.frq, _g_MockVariableIntBlock_0.tii, _e_Pulsing40_0.tip, _e_Pulsing40_0.tim, _h.fdx, _j_MockVariableIntBlock_0.pyl, _g.fdt, _g.fdx, _h_MockVariableIntBlock_0.skp, _f_MockVariableIntBlock_0.tib, _i_MockVariableIntBlock_0.doc, _h_Pulsing40_0.tim, _e_Pulsing40_0.frq, _j_Lucene40WithOrds_0.tii, _e_Lucene40WithOrds_0.tib, _4_MockVariableIntBlock_0.tib, _h_Pulsing40_0.prx, _i_Asserting_0.tim, _j_MockVariableIntBlock_0.tii, _f_MockVariableIntBlock_0.tii, _j_MockVariableIntBlock_0.tib, _h_Pulsing40_0.tip, _i_Asserting_0.tip, _c_Lucene40WithOrds_0.tib, _f_Pulsing40_0.prx, _b_Lucene40WithOrds_0.prx, _c_Lucene40WithOrds_0.tii, _b_Asserting_0.tim, _c_Pulsing40_0.prx, _c_Asserting_0.frq, _e_Lucene40WithOrds_0.tii, _i_nrm.cfe, _b_Asserting_0.tip, _i_Lucene40WithOrds_0.frq, _i_nrm.cfs, _h_Lucene40WithOrds_0.tii, _i_Pulsing40_0.tip, _h_MockVariableIntBlock_0.doc, _i_Pulsing40_0.tim, _i.fdx, _b_MockVariableIntBlock_0.skp, _i.fdt, _h_MockVariableIntBlock_0.pos, _g_Asserting_0.tim, _j_Asserting_0.tim, _g_Asserting_0.tip, _j_Asserting_0.tip, _4_MockVariableIntBlock_0.frq, _e_MockVariableIntBlock_0.pyl, _h_Asserting_0.prx, _d_Pulsing40_0.tip, _e_MockVariableIntBlock_0.tii, _j_MockVariableIntBlock_0.frq, _b_Pulsing40_0.tip, _d_Pulsing40_0.tim, _b_Pulsing40_0.tim, _c_Asserting_0.prx, _h_Lucene40WithOrds_0.tib, _b_MockVariableIntBlock_0.pos, _4_Pulsing40_0.tip, _e_MockVariableIntBlock_0.tib, _4_Pulsing40_0.tim, _i_Pulsing40_0.frq, _h_MockVariableIntBlock_0.pyl, _e_Pulsing40_0.prx, _4_nrm.cfe, _h_Asserting_0.tim, _c.fdx, _e_MockVariableIntBlock_0.frq, _h_Asserting_0.tip, _c.fdt, _4.fdx, _g_MockVariableIntBlock_0.doc, _e_MockVariableIntBlock_0.pos, _h_Lucene40WithOrds_0.frq, _f_MockVariableIntBlock_0.frq, _e_Lucene40WithOrds_0.prx, _e.fnm, _d_MockVariableIntBlock_0.pos, _c_Lucene40WithOrds_0.frq, _h.fnm, _j_nrm.cfe, _b_Pulsing40_0.prx, _d_Asserting_0.frq, _i_MockVariableIntBlock_0.frq, _g_MockVariableIntBlock_0.pos, _d_MockVariableIntBlock_0.doc, _f_Pulsing40_0.frq, _4_MockVariableIntBlock_0.pyl, _4_Lucene40WithOrds_0.prx, _d_Asserting_0.tim, _4_nrm.cfs, _g_Asserting_0.frq, _d.si, _h_Asserting_0.frq, _j_nrm.cfs, _f_MockVariableIntBlock_0.pyl, _h_Lucene40WithOrds_0.prx, _d_Lucene40WithOrds_0.prx, _h_nrm.cfe, _i_MockVariableIntBlock_0.tii, _c_MockVariableIntBlock_0.pos, _i_Pulsing40_0.prx, _d_Asserting_0.tip, _i_MockVariableIntBlock_0.tib, _f_Pulsing40_0.tim, _h_nrm.cfs, _f_Pulsing40_0.tip, _d_MockVariableIntBlock_0.skp, _f_Asserting_0.prx, _h_MockVariableIntBlock_0.tii, _c_nrm.cfe, _4.fdt, _4.si, _4_Pulsing40_0.frq, _f_Lucene40WithOrds_0.frq, _c_nrm.cfs, _c_MockVariableIntBlock_0.skp, _b.fnm, _b.fdt, _h_MockVariableIntBlock_0.tib, _b.fdx, _f_MockVariableIntBlock_0.skp, _f_nrm.cfe, _d_MockVariableIntBlock_0.frq, _j_Pulsing40_0.tip, _j_Pulsing40_0.tim, _i_Lucene40WithOrds_0.prx, _j_Asserting_0.prx, _j_MockVariableIntBlock_0.doc, _e_nrm.cfe, _e_MockVariableIntBlock_0.skp, _f_nrm.cfs, _e_nrm.cfs, _i_Asserting_0.prx, _4_Asserting_0.frq, _b_Asserting_0.prx, _b_Lucene40WithOrds_0.tib, _c_MockVariableIntBlock_0.doc, _e_Asserting_0.tim, _4_MockVariableIntBlock_0.doc, _f_Asserting_0.frq, _d_Lucene40WithOrds_0.frq, _b_Lucene40WithOrds_0.tii, _f.fdt, _b_MockVariableIntBlock_0.tii, _f.fdx, _e.si, _b_MockVariableIntBlock_0.tib, _e_Lucene40WithOrds_0.frq, _i_MockVariableIntBlock_0.skp, _e_Asserting_0.frq, _j.fdx, _i_MockVariableIntBlock_0.pos, _4_Lucene40WithOrds_0.tib, _j.fdt, _4_Lucene40WithOrds_0.tii, _d_Asserting_0.prx, _4_Asserting_0.tip, _d_Pulsing40_0.prx, _e.fdx, _i.si, _c_MockVariableIntBlock_0.tii, _d_MockVariableIntBlock_0.pyl, _4_Pulsing40_0.prx, _4_Asserting_0.prx, _j_Lucene40WithOrds_0.prx, _b.si, _c_MockVariableIntBlock_0.tib, _4_Asserting_0.tim, _e.fdt, _b_MockVariableIntBlock_0.pyl, _e_Asserting_0.tip, _f_Lucene40WithOrds_0.prx, _j.si, _g_nrm.cfs, _c_Pulsing40_0.tip, _c_Pulsing40_0.tim, _c_Lucene40WithOrds_0.prx, _d_nrm.cfs, _g_Lucene40WithOrds_0.prx, _d.fdx, _d.fdt, _g_nrm.cfe, _j_MockVariableIntBlock_0.pos, _c.fnm, _f_MockVariableIntBlock_0.doc, _d_nrm.cfe, _g_Lucene40WithOrds_0.frq, _b_Pulsing40_0.frq, _e_Asserting_0.prx, _d_Pulsing40_0.frq, _4.fnm, _d_MockVariableIntBlock_0.tib, _f_Asserting_0.tim, _d_MockVariableIntBlock_0.tii, _i_Asserting_0.frq, _h.si, _j_Lucene40WithOrds_0.frq, _j_Pulsing40_0.prx, _f_MockVariableIntBlock_0.pos, _d.fnm, _b_MockVariableIntBlock_0.doc, _c_MockVariableIntBlock_0.frq, _i_Lucene40WithOrds_0.tii, _g_Asserting_0.prx, _c_Pulsing40_0.frq, _g.si, _g_MockVariableIntBlock_0.skp, _b_MockVariableIntBlock_0.frq, _h_Pulsing40_0.frq, _j_Asserting_0.frq, _f_Lucene40WithOrds_0.tii, _4_Lucene40WithOrds_0.frq, _b_Asserting_0.frq, _c_Asserting_0.tim, _c_Asserting_0.tip, _g_Pulsing40_0.frq, _i_Lucene40WithOrds_0.tib, _g.fnm, _4_MockVariableIntBlock_0.skp, _4_MockVariableIntBlock_0.pos, _i_MockVariableIntBlock_0.pyl, _d_Lucene40WithOrds_0.tib, _c_MockVariableIntBlock_0.pyl, _d_Lucene40WithOrds_0.tii, _g_Pulsing40_0.tip, _g_MockVariableIntBlock_0.pyl, _g_Pulsing40_0.tim, _g_Lucene40WithOrds_0.tib, _g_Pulsing40_0.prx, _b_Lucene40WithOrds_0.frq, _h_MockVariableIntBlock_0.frq, _f_Asserting_0.tip, _j_MockVariableIntBlock_0.skp, _f.fnm, _j.fnm, _b_nrm.cfe, _b_nrm.cfs, _i.fnm, segments_6, _f_Lucene40WithOrds_0.tib]
[junit4:junit4]   2> 		commit{dir=BaseDirectoryWrapper(org.apache.lucene.store.RAMDirectory@314db005 lockFactory=org.apache.lucene.store.NativeFSLockFactory@7eae114b),segFN=segments_7,generation=7,filenames=[_e_MockVariableIntBlock_0.doc, _g_Lucene40WithOrds_0.tii, _j_Lucene40WithOrds_0.tib, _4_MockVariableIntBlock_0.tii, _g_MockVariableIntBlock_0.tib, _f.si, _c.si, _g_MockVariableIntBlock_0.frq, _h.fdt, _j_Pulsing40_0.frq, _g_MockVariableIntBlock_0.tii, _e_Pulsing40_0.tip, _e_Pulsing40_0.tim, _h.fdx, _j_MockVariableIntBlock_0.pyl, _g.fdt, _g.fdx, _h_MockVariableIntBlock_0.skp, _f_MockVariableIntBlock_0.tib, _i_MockVariableIntBlock_0.doc, _h_Pulsing40_0.tim, _e_Pulsing40_0.frq, _j_Lucene40WithOrds_0.tii, _e_Lucene40WithOrds_0.tib, _4_MockVariableIntBlock_0.tib, _h_Pulsing40_0.prx, _i_Asserting_0.tim, _j_MockVariableIntBlock_0.tii, _f_MockVariableIntBlock_0.tii, _j_MockVariableIntBlock_0.tib, _h_Pulsing40_0.tip, _i_Asserting_0.tip, _c_Lucene40WithOrds_0.tib, _f_Pulsing40_0.prx, _b_Lucene40WithOrds_0.prx, _c_Lucene40WithOrds_0.tii, _b_Asserting_0.tim, _c_Pulsing40_0.prx, _c_Asserting_0.frq, _e_Lucene40WithOrds_0.tii, _i_nrm.cfe, _b_Asserting_0.tip, _i_Lucene40WithOrds_0.frq, _i_nrm.cfs, _h_Lucene40WithOrds_0.tii, _i_Pulsing40_0.tip, _h_MockVariableIntBlock_0.doc, _i_Pulsing40_0.tim, _i.fdx, _b_MockVariableIntBlock_0.skp, _i.fdt, _h_MockVariableIntBlock_0.pos, _g_Asserting_0.tim, _j_Asserting_0.tim, _g_Asserting_0.tip, _j_Asserting_0.tip, _4_MockVariableIntBlock_0.frq, _e_MockVariableIntBlock_0.pyl, _h_Asserting_0.prx, _d_Pulsing40_0.tip, _e_MockVariableIntBlock_0.tii, _j_MockVariableIntBlock_0.frq, _b_Pulsing40_0.tip, _d_Pulsing40_0.tim, _b_Pulsing40_0.tim, _c_Asserting_0.prx, _h_Lucene40WithOrds_0.tib, _b_MockVariableIntBlock_0.pos, _4_Pulsing40_0.tip, _e_MockVariableIntBlock_0.tib, _4_Pulsing40_0.tim, _i_Pulsing40_0.frq, _h_MockVariableIntBlock_0.pyl, _e_Pulsing40_0.prx, _4_nrm.cfe, _h_Asserting_0.tim, _c.fdx, _e_MockVariableIntBlock_0.frq, _h_Asserting_0.tip, _c.fdt, _4.fdx, _g_MockVariableIntBlock_0.doc, _e_MockVariableIntBlock_0.pos, _h_Lucene40WithOrds_0.frq, _f_MockVariableIntBlock_0.frq, _e_Lucene40WithOrds_0.prx, _e.fnm, _d_MockVariableIntBlock_0.pos, _c_Lucene40WithOrds_0.frq, _h.fnm, _j_nrm.cfe, _b_Pulsing40_0.prx, _d_Asserting_0.frq, _i_MockVariableIntBlock_0.frq, _g_MockVariableIntBlock_0.pos, _d_MockVariableIntBlock_0.doc, _f_Pulsing40_0.frq, _4_MockVariableIntBlock_0.pyl, _4_Lucene40WithOrds_0.prx, _d_Asserting_0.tim, _4_nrm.cfs, _g_Asserting_0.frq, _d.si, _h_Asserting_0.frq, _j_nrm.cfs, _f_MockVariableIntBlock_0.pyl, _h_Lucene40WithOrds_0.prx, _d_Lucene40WithOrds_0.prx, _h_nrm.cfe, _i_MockVariableIntBlock_0.tii, _c_MockVariableIntBlock_0.pos, _i_Pulsing40_0.prx, _d_Asserting_0.tip, _i_MockVariableIntBlock_0.tib, _f_Pulsing40_0.tim, _h_nrm.cfs, _f_Pulsing40_0.tip, _d_MockVariableIntBlock_0.skp, _f_Asserting_0.prx, _h_MockVariableIntBlock_0.tii, _c_nrm.cfe, _4.fdt, _4.si, _4_Pulsing40_0.frq, _f_Lucene40WithOrds_0.frq, _c_nrm.cfs, _c_MockVariableIntBlock_0.skp, _b.fnm, _b.fdt, _h_MockVariableIntBlock_0.tib, _b.fdx, _f_MockVariableIntBlock_0.skp, _f_nrm.cfe, _d_MockVariableIntBlock_0.frq, _j_Pulsing40_0.tip, _j_Pulsing40_0.tim, _i_Lucene40WithOrds_0.prx, _j_Asserting_0.prx, _j_MockVariableIntBlock_0.doc, _e_nrm.cfe, _e_MockVariableIntBlock_0.skp, _f_nrm.cfs, _e_nrm.cfs, _i_Asserting_0.prx, _4_Asserting_0.frq, _b_Asserting_0.prx, _b_Lucene40WithOrds_0.tib, _c_MockVariableIntBlock_0.doc, _e_Asserting_0.tim, _4_MockVariableIntBlock_0.doc, _f_Asserting_0.frq, _d_Lucene40WithOrds_0.frq, _b_Lucene40WithOrds_0.tii, _f.fdt, _b_MockVariableIntBlock_0.tii, _f.fdx, _e.si, _b_MockVariableIntBlock_0.tib, _e_Lucene40WithOrds_0.frq, _i_MockVariableIntBlock_0.skp, _e_Asserting_0.frq, _j.fdx, _i_MockVariableIntBlock_0.pos, _4_Lucene40WithOrds_0.tib, _j.fdt, _4_Lucene40WithOrds_0.tii, _d_Asserting_0.prx, _4_Asserting_0.tip, _d_Pulsing40_0.prx, _e.fdx, _i.si, _c_MockVariableIntBlock_0.tii, _d_MockVariableIntBlock_0.pyl, _4_Pulsing40_0.prx, _4_Asserting_0.prx, _j_Lucene40WithOrds_0.prx, _b.si, _c_MockVariableIntBlock_0.tib, _4_Asserting_0.tim, _e.fdt, _b_MockVariableIntBlock_0.pyl, _e_Asserting_0.tip, _f_Lucene40WithOrds_0.prx, _j.si, _g_nrm.cfs, _c_Pulsing40_0.tip, _c_Pulsing40_0.tim, _c_Lucene40WithOrds_0.prx, _d_nrm.cfs, _g_Lucene40WithOrds_0.prx, _d.fdx, _d.fdt, _g_nrm.cfe, _j_MockVariableIntBlock_0.pos, _c.fnm, _f_MockVariableIntBlock_0.doc, _d_nrm.cfe, _g_Lucene40WithOrds_0.frq, _b_Pulsing40_0.frq, _e_Asserting_0.prx, _d_Pulsing40_0.frq, _4.fnm, _d_MockVariableIntBlock_0.tib, _f_Asserting_0.tim, _d_MockVariableIntBlock_0.tii, _i_Asserting_0.frq, _h.si, _j_Lucene40WithOrds_0.frq, _j_Pulsing40_0.prx, _f_MockVariableIntBlock_0.pos, _d.fnm, _b_MockVariableIntBlock_0.doc, _c_MockVariableIntBlock_0.frq, _i_Lucene40WithOrds_0.tii, _g_Asserting_0.prx, _c_Pulsing40_0.frq, _g.si, _g_MockVariableIntBlock_0.skp, _b_MockVariableIntBlock_0.frq, _h_Pulsing40_0.frq, _j_Asserting_0.frq, _f_Lucene40WithOrds_0.tii, _4_Lucene40WithOrds_0.frq, _b_Asserting_0.frq, _c_Asserting_0.tim, _c_Asserting_0.tip, _g_Pulsing40_0.frq, _i_Lucene40WithOrds_0.tib, _g.fnm, _4_MockVariableIntBlock_0.skp, _4_MockVariableIntBlock_0.pos, _i_MockVariableIntBlock_0.pyl, _d_Lucene40WithOrds_0.tib, _c_MockVariableIntBlock_0.pyl, _d_Lucene40WithOrds_0.tii, _g_Pulsing40_0.tip, _g_MockVariableIntBlock_0.pyl, _g_Pulsing40_0.tim, _g_Lucene40WithOrds_0.tib, _g_Pulsing40_0.prx, _b_Lucene40WithOrds_0.frq, _h_MockVariableIntBlock_0.frq, _f_Asserting_0.tip, segments_7, _j_MockVariableIntBlock_0.skp, _f.fnm, _j.fnm, _b_nrm.cfe, _b_nrm.cfs, _i.fnm, _f_Lucene40WithOrds_0.tib]
[junit4:junit4]   2> 4023 T1746 C65 oass.SolrIndexSearcher.<init> Opening Searcher@288baff1 main
[junit4:junit4]   2> 4027 T1804 C67 oasc.SolrDeletionPolicy.updateCommits newest commit = 7
[junit4:junit4]   2> 4027 T1737 C64 oass.SolrIndexSearcher.<init> Opening Searcher@546b4ba8 main
[junit4:junit4]   2> 4027 T1746 C65 oass.SolrIndexSearcher.getIndexDir WARNING WARNING: Directory impl does not support setting indexDir: org.apache.lucene.store.MockDirectoryWrapper
[junit4:junit4]   2> 4028 T1737 C64 oass.SolrIndexSearcher.getIndexDir WARNING WARNING: Directory impl does not support setting indexDir: org.apache.lucene.store.MockDirectoryWrapper
[junit4:junit4]   2> 4028 T1751 oasc.SolrCore.registerSearcher [collection1] Registered new searcher Searcher@288baff1 main{StandardDirectoryReader(segments_3:17:nrt _0(5.0):C22 _1(5.0):C8 _2(5.0):C30 _3(5.0):C5 _4(5.0):C59 _5(5.0):C8 _6(5.0):C31 _7(5.0):C7)}
[junit4:junit4]   2> 4028 T1741 oasc.SolrCore.registerSearcher [collection1] Registered new searcher Searcher@546b4ba8 main{StandardDirectoryReader(segments_6:26:nrt _1(5.0):C2 _2(5.0):C22 _3(5.0):C13 _4(5.0):C44 _5(5.0):C7 _6(5.0):C3 _7(5.0):C38 _8(5.0):C1 _9(5.0):C15 _a(5.0):C11)}
[junit4:junit4]   2> 4029 T1804 C67 oass.SolrIndexSearcher.<init> Opening Searcher@60486684 main
[junit4:junit4]   2> 4029 T1737 C64 oasu.DirectUpdateHandler2.commit end_commit_flush
[junit4:junit4]   2> 4029 T1746 C65 oasu.DirectUpdateHandler2.commit end_commit_flush
[junit4:junit4]   2> 4030 T1737 C64 UPDATE [collection1] webapp=/solr path=/update params={waitSearcher=true&commit=true&wt=javabin&expungeDeletes=false&version=2&softCommit=false} {add=[43 (1413145684993900545), 45 (1413145684995997697), 47 (1413145684995997699), 48 (1413145684997046273), 49 (1413145684998094848), 52 (1413145684998094851), 53 (1413145684999143426), 54 (1413145685000192001), 55 (1413145685000192004), 58 (1413145685001240577)],commit=} 0 119
[junit4:junit4]   2> 4030 T1747 C65 oasu.DirectUpdateHandler2.commit start commit{flags=0,_version_=0,optimize=false,openSearcher=true,waitSearcher=true,expungeDeletes=false,softCommit=false}
[junit4:junit4]   2> 4029 T1736 C64 oasu.DirectUpdateHandler2.commit start commit{flags=0,_version_=0,optimize=false,openSearcher=true,waitSearcher=true,expungeDeletes=false,softCommit=false}
[junit4:junit4]   2> 4029 T1804 C67 oass.SolrIndexSearcher.getIndexDir WARNING WARNING: Directory impl does not support setting indexDir: org.apache.lucene.store.BaseDirectoryWrapper
[junit4:junit4]   2> 4030 T1746 C65 UPDATE [collection1] webapp=/solr path=/update params={waitSearcher=true&commit=true&wt=javabin&expungeDeletes=false&version=2&softCommit=false} {add=[28 (1413145684987609088), 29 (1413145684993900545), 30 (1413145684994949121), 31 (1413145684997046272), 32 (1413145684997046275), 33 (1413145684998094849), 37 (1413145684999143426), 43 (1413145684999143429), 44 (1413145685000192002), 47 (1413145685000192005)],commit=} 0 126
[junit4:junit4]   2> 4031 T1771 oasc.SolrCore.registerSearcher [collection1] Registered new searcher Searcher@60486684 main{StandardDirectoryReader(segments_6:42:nrt _c(5.0):C85 _4(5.0):C23 _b(5.0):C24 _d(5.0):C4 _e(5.0):C7 _f(5.0):C6 _g(5.0):C2 _h(5.0):C1 _i(5.0):C22 _j(5.0):C16)}
[junit4:junit4]   2> 4031 T1804 C67 oasu.DirectUpdateHandler2.commit end_commit_flush
[junit4:junit4]   2> 4032 T1747 C65 oasc.SolrDeletionPolicy.onCommit SolrDeletionPolicy.onCommit: commits:num=2
[junit4:junit4]   2> 		commit{dir=MockDirWrapper(org.apache.lucene.store.RAMDirectory@44296e84 lockFactory=org.apache.lucene.store.NativeFSLockFactory@2ec04de9),segFN=segments_3,generation=3,filenames=[_5_nrm.cfe, _3_MockVariableIntBlock_0.frq, _3.fdt, _5_Lucene40WithOrds_0.tib, _4_MockVariableIntBlock_0.tii, _0_Pulsing40_0.frq, _1_Asserting_0.tim, _0_Lucene40WithOrds_0.tii, _5_Lucene40WithOrds_0.tii, _0_Lucene40WithOrds_0.frq, _1_Lucene40WithOrds_0.tib, _1_Asserting_0.tip, _5_MockVariableIntBlock_0.tii, _5_Pulsing40_0.tip, _1_Lucene40WithOrds_0.tii, _0_Lucene40WithOrds_0.tib, _5_Pulsing40_0.tim, _4_Asserting_0.frq, _1_Lucene40WithOrds_0.frq, _0_Pulsing40_0.tim, _1_MockVariableIntBlock_0.tii, _4_MockVariableIntBlock_0.doc, _2.fdt, _3_Pulsing40_0.tip, _2.fdx, _3_Pulsing40_0.tim, _1_MockVariableIntBlock_0.tib, _1.fdx, _2_Asserting_0.tim, _0_Asserting_0.frq, _4_MockVariableIntBlock_0.tib, _2_Asserting_0.tip, _5_nrm.cfs, _1.fdt, _0_MockVariableIntBlock_0.frq, _3.si, _2_MockVariableIntBlock_0.skp, _5_Lucene40WithOrds_0.prx, _1_MockVariableIntBlock_0.skp, _0_Asserting_0.tim, _2.si, _3_Pulsing40_0.frq, _2_Pulsing40_0.tim, _4_Lucene40WithOrds_0.tib, _4_Lucene40WithOrds_0.tii, _2_MockVariableIntBlock_0.pyl, _0_Asserting_0.tip, _0_MockVariableIntBlock_0.doc, _2_Pulsing40_0.tip, _1_Lucene40WithOrds_0.prx, _1_MockVariableIntBlock_0.pyl, _4_Asserting_0.tip, _3.fnm, _2_MockVariableIntBlock_0.doc, _3_MockVariableIntBlock_0.tii, _4_Pulsing40_0.prx, _0_MockVariableIntBlock_0.pyl, _4_Asserting_0.prx, _2_nrm.cfe, _5_Pulsing40_0.frq, _4_Asserting_0.tim, _1_MockVariableIntBlock_0.doc, _0_MockVariableIntBlock_0.pos, _0_Pulsing40_0.tip, _2_nrm.cfs, _2_MockVariableIntBlock_0.tii, _5_MockVariableIntBlock_0.tib, _2_Lucene40WithOrds_0.frq, _2_MockVariableIntBlock_0.tib, _1_MockVariableIntBlock_0.pos, _4_MockVariableIntBlock_0.frq, _1_Asserting_0.frq, _5_MockVariableIntBlock_0.frq, _2.fnm, _3.fdx, _4_Pulsing40_0.tip, _4_Pulsing40_0.tim, _5_Pulsing40_0.prx, _1_Asserting_0.prx, _1.si, _3_MockVariableIntBlock_0.pyl, _0_Lucene40WithOrds_0.prx, _3_Lucene40WithOrds_0.prx, _3_MockVariableIntBlock_0.pos, _3_nrm.cfe, _5.fdt, _1_Pulsing40_0.tip, _5_MockVariableIntBlock_0.pyl, _1_Pulsing40_0.tim, _3_Lucene40WithOrds_0.tii, _4_nrm.cfe, _4.fnm, _0_MockVariableIntBlock_0.skp, _0_Pulsing40_0.prx, _1.fnm, _3_Lucene40WithOrds_0.tib, _4.fdx, _1_Pulsing40_0.frq, _0_Asserting_0.prx, _3_Asserting_0.prx, _1_Pulsing40_0.prx, _2_Asserting_0.prx, _2_Pulsing40_0.prx, _2_MockVariableIntBlock_0.pos, _5_MockVariableIntBlock_0.pos, _0.fnm, _5_Asserting_0.tim, _3_MockVariableIntBlock_0.doc, _2_Pulsing40_0.frq, _5.si, _5_Lucene40WithOrds_0.frq, _3_nrm.cfs, _4_MockVariableIntBlock_0.pyl, _4_Lucene40WithOrds_0.prx, _4_nrm.cfs, _5_Asserting_0.tip, _3_MockVariableIntBlock_0.tib, _5_Asserting_0.prx, _5_MockVariableIntBlock_0.doc, _4_Lucene40WithOrds_0.frq, _2_MockVariableIntBlock_0.frq, _4_MockVariableIntBlock_0.skp, _2_Lucene40WithOrds_0.prx, _0_MockVariableIntBlock_0.tib, _5_MockVariableIntBlock_0.skp, _5_Asserting_0.frq, _4_MockVariableIntBlock_0.pos, _2_Asserting_0.frq, _0.si, _0_MockVariableIntBlock_0.tii, _1_nrm.cfs, _5.fnm, _4.si, _4.fdt, _0_nrm.cfs, _3_Lucene40WithOrds_0.frq, _1_nrm.cfe, _3_Asserting_0.frq, _1_MockVariableIntBlock_0.frq, _2_Lucene40WithOrds_0.tii, _4_Pulsing40_0.frq, _3_Pulsing40_0.prx, _3_Asserting_0.tim, _3_Asserting_0.tip, _0_nrm.cfe, _5.fdx, _0.fdx, _2_Lucene40WithOrds_0.tib, _3_MockVariableIntBlock_0.skp, _0.fdt, segments_3]
[junit4:junit4]   2> 		commit{dir=MockDirWrapper(org.apache.lucene.store.RAMDirectory@44296e84 lockFactory=org.apache.lucene.store.NativeFSLockFactory@2ec04de9),segFN=segments_4,generation=4,filenames=[_5_nrm.cfe, _3_MockVariableIntBlock_0.frq, _6_Asserting_0.frq, _3.fdt, _4_MockVariableIntBlock_0.tii, _5_Lucene40WithOrds_0.tib, _1_Asserting_0.tim, _7.fnm, _0_Lucene40WithOrds_0.frq, _5_Lucene40WithOrds_0.tii, _1_Lucene40WithOrds_0.tib, _1_Asserting_0.tip, _1_Lucene40WithOrds_0.tii, _5_Pulsing40_0.tip, _5_Pulsing40_0.tim, _6_MockVariableIntBlock_0.tii, _1_Lucene40WithOrds_0.frq, _0_Pulsing40_0.tim, _6_MockVariableIntBlock_0.tib, _1_MockVariableIntBlock_0.tii, _1_MockVariableIntBlock_0.tib, _1.fdx, _4_MockVariableIntBlock_0.tib, _1.fdt, _5_nrm.cfs, _0_MockVariableIntBlock_0.frq, _6.fdt, _5_Lucene40WithOrds_0.prx, _3_Pulsing40_0.frq, _2.si, _1_MockVariableIntBlock_0.skp, _2_Pulsing40_0.tim, _7_MockVariableIntBlock_0.pos, _0_MockVariableIntBlock_0.doc, _2_Pulsing40_0.tip, _6.fdx, _1_Lucene40WithOrds_0.prx, _1_MockVariableIntBlock_0.pyl, _3_MockVariableIntBlock_0.tii, _7_Asserting_0.frq, _2_nrm.cfe, _5_Pulsing40_0.frq, _0_Pulsing40_0.tip, _0_MockVariableIntBlock_0.pos, _2_nrm.cfs, _7_MockVariableIntBlock_0.skp, _4_MockVariableIntBlock_0.frq, _2.fnm, _5_MockVariableIntBlock_0.frq, _7_Pulsing40_0.tim, _3.fdx, _4_Pulsing40_0.tip, _4_Pulsing40_0.tim, _1.si, _0_Lucene40WithOrds_0.prx, _7_Pulsing40_0.tip, _3_MockVariableIntBlock_0.pos, _3_nrm.cfe, _5_MockVariableIntBlock_0.pyl, _3_Lucene40WithOrds_0.tii, _4_nrm.cfe, _6_Lucene40WithOrds_0.prx, _0_Pulsing40_0.prx, _3_Lucene40WithOrds_0.tib, _4.fdx, _3_Asserting_0.prx, _1_Pulsing40_0.prx, _7_MockVariableIntBlock_0.tii, _2_Asserting_0.prx, _6_MockVariableIntBlock_0.frq, _3_MockVariableIntBlock_0.doc, _7_Lucene40WithOrds_0.tib, _5.si, _3_nrm.cfs, _7_Lucene40WithOrds_0.tii, _4_MockVariableIntBlock_0.pyl, _4_Lucene40WithOrds_0.prx, _6_Pulsing40_0.prx, _4_nrm.cfs, _3_MockVariableIntBlock_0.tib, _5_Asserting_0.prx, _5_MockVariableIntBlock_0.doc, _6_MockVariableIntBlock_0.pyl, _2_MockVariableIntBlock_0.frq, _6_Asserting_0.tim, _6_nrm.cfs, _6_Asserting_0.tip, _2_Lucene40WithOrds_0.prx, _7_nrm.cfs, _2_Asserting_0.frq, _5_Asserting_0.frq, _1_nrm.cfs, _5.fnm, _7_nrm.cfe, _7_Asserting_0.prx, _6_nrm.cfe, _3_Lucene40WithOrds_0.frq, _4.fdt, _4.si, _1_nrm.cfe, _3_Asserting_0.frq, _4_Pulsing40_0.frq, _7.si, _0_Pulsing40_0.frq, _0_Lucene40WithOrds_0.tii, _7_Lucene40WithOrds_0.frq, _5_MockVariableIntBlock_0.tii, _0_Lucene40WithOrds_0.tib, _4_Asserting_0.frq, _4_MockVariableIntBlock_0.doc, _3_Pulsing40_0.tip, _2.fdt, _7.fdx, _7_MockVariableIntBlock_0.frq, _2.fdx, _7.fdt, _3_Pulsing40_0.tim, _2_Asserting_0.tim, _0_Asserting_0.frq, _7_Pulsing40_0.frq, _2_Asserting_0.tip, _3.si, _2_MockVariableIntBlock_0.skp, _0_Asserting_0.tim, _4_Lucene40WithOrds_0.tib, _2_MockVariableIntBlock_0.pyl, _4_Lucene40WithOrds_0.tii, _0_Asserting_0.tip, _4_Asserting_0.tip, _3.fnm, _2_MockVariableIntBlock_0.doc, _0_MockVariableIntBlock_0.pyl, _4_Pulsing40_0.prx, _4_Asserting_0.prx, _4_Asserting_0.tim, _1_MockVariableIntBlock_0.doc, _2_MockVariableIntBlock_0.tii, _7_MockVariableIntBlock_0.pyl, _6_Asserting_0.prx, _2_Lucene40WithOrds_0.frq, _5_MockVariableIntBlock_0.tib, _2_MockVariableIntBlock_0.tib, _1_MockVariableIntBlock_0.pos, _1_Asserting_0.frq, _1_Asserting_0.prx, _5_Pulsing40_0.prx, _3_MockVariableIntBlock_0.pyl, _6.fnm, _6.si, _7_MockVariableIntBlock_0.tib, _3_Lucene40WithOrds_0.prx, _5.fdt, _1_Pulsing40_0.tip, _6_Pulsing40_0.frq, _1_Pulsing40_0.tim, _4.fnm, _0_MockVariableIntBlock_0.skp, _1.fnm, _7_MockVariableIntBlock_0.doc, _7_Pulsing40_0.prx, _0_Asserting_0.prx, _1_Pulsing40_0.frq, _6_Pulsing40_0.tim, _6_Pulsing40_0.tip, _7_Asserting_0.tip, _2_Pulsing40_0.prx, _6_MockVariableIntBlock_0.doc, _2_MockVariableIntBlock_0.pos, _7_Asserting_0.tim, _0.fnm, _5_MockVariableIntBlock_0.pos, _6_Lucene40WithOrds_0.frq, _5_Asserting_0.tim, _6_Lucene40WithOrds_0.tii, _2_Pulsing40_0.frq, _5_Lucene40WithOrds_0.frq, _6_Lucene40WithOrds_0.tib, _5_Asserting_0.tip, _4_Lucene40WithOrds_0.frq, _4_MockVariableIntBlock_0.skp, _0_MockVariableIntBlock_0.tib, _5_MockVariableIntBlock_0.skp, _4_MockVariableIntBlock_0.pos, _6_MockVariableIntBlock_0.pos, _7_Lucene40WithOrds_0.prx, _0.si, _0_MockVariableIntBlock_0.tii, _0_nrm.cfs, _6_MockVariableIntBlock_0.skp, _2_Lucene40WithOrds_0.tii, _1_MockVariableIntBlock_0.frq, _3_Pulsing40_0.prx, _3_Asserting_0.tim, _3_Asserting_0.tip, _0_nrm.cfe, _5.fdx, _2_Lucene40WithOrds_0.tib, _0.fdx, _3_MockVariableIntBlock_0.skp, _0.fdt, segments_4]
[junit4:junit4]   2> 4032 T1804 C67 UPDATE [collection1] webapp=/solr path=/update params={waitSearcher=true&commit=true&wt=javabin&expungeDeletes=false&version=2&softCommit=false} {add=[133 (1413145685016969220), 135 (1413145685018017793), 137 (1413145685018017795), 138 (1413145685019066369), 140 (1413145685019066371), 141 (1413145685020114945), 143 (1413145685025357825), 144 (1413145685027454976), 145 (1413145685028503552), 148 (1413145685028503553)],commit=} 0 99
[junit4:junit4]   2> 4032 T1769 C67 oasu.DirectUpdateHandler2.commit start commit{flags=0,_version_=0,optimize=false,openSearcher=true,waitSearcher=true,expungeDeletes=false,softCommit=false}
[junit4:junit4]   2> 4034 T1747 C65 oasc.SolrDeletionPolicy.updateCommits newest commit = 4
[junit4:junit4]   2> 4035 T1769 C67 oasc.SolrDeletionPolicy.onCommit SolrDeletionPolicy.onCommit: commits:num=2
[junit4:junit4]   2> 		commit{dir=BaseDirectoryWrapper(org.apache.lucene.store.RAMDirectory@314db005 lockFactory=org.apache.lucene.store.NativeFSLockFactory@7eae114b),segFN=segments_7,generation=7,filenames=[_e_MockVariableIntBlock_0.doc, _g_Lucene40WithOrds_0.tii, _j_Lucene40WithOrds_0.tib, _4_MockVariableIntBlock_0.tii, _g_MockVariableIntBlock_0.tib, _f.si, _c.si, _g_MockVariableIntBlock_0.frq, _h.fdt, _j_Pulsing40_0.frq, _g_MockVariableIntBlock_0.tii, _e_Pulsing40_0.tip, _e_Pulsing40_0.tim, _h.fdx, _j_MockVariableIntBlock_0.pyl, _g.fdt, _g.fdx, _h_MockVariableIntBlock_0.skp, _f_MockVariableIntBlock_0.tib, _i_MockVariableIntBlock_0.doc, _h_Pulsing40_0.tim, _e_Pulsing40_0.frq, _j_Lucene40WithOrds_0.tii, _e_Lucene40WithOrds_0.tib, _4_MockVariableIntBlock_0.tib, _h_Pulsing40_0.prx, _i_Asserting_0.tim, _j_MockVariableIntBlock_0.tii, _f_MockVariableIntBlock_0.tii, _j_MockVariableIntBlock_0.tib, _h_Pulsing40_0.tip, _i_Asserting_0.tip, _c_Lucene40WithOrds_0.tib, _f_Pulsing40_0.prx, _b_Lucene40WithOrds_0.prx, _c_Lucene40WithOrds_0.tii, _b_Asserting_0.tim, _c_Pulsing40_0.prx, _c_Asserting_0.frq, _e_Lucene40WithOrds_0.tii, _i_nrm.cfe, _b_Asserting_0.tip, _i_Lucene40WithOrds_0.frq, _i_nrm.cfs, _h_Lucene40WithOrds_0.tii, _i_Pulsing40_0.tip, _h_MockVariableIntBlock_0.doc, _i_Pulsing40_0.tim, _i.fdx, _b_MockVariableIntBlock_0.skp, _i.fdt, _h_MockVariableIntBlock_0.pos, _g_Asserting_0.tim, _j_Asserting_0.tim, _g_Asserting_0.tip, _j_Asserting_0.tip, _4_MockVariableIntBlock_0.frq, _e_MockVariableIntBlock_0.pyl, _h_Asserting_0.prx, _d_Pulsing40_0.tip, _e_MockVariableIntBlock_0.tii, _j_MockVariableIntBlock_0.frq, _b_Pulsing40_0.tip, _d_Pulsing40_0.tim, _b_Pulsing40_0.tim, _c_Asserting_0.prx, _h_Lucene40WithOrds_0.tib, _b_MockVariableIntBlock_0.pos, _4_Pulsing40_0.tip, _e_MockVariableIntBlock_0.tib, _4_Pulsing40_0.tim, _i_Pulsing40_0.frq, _h_MockVariableIntBlock_0.pyl, _e_Pulsing40_0.prx, _4_nrm.cfe, _h_Asserting_0.tim, _c.fdx, _e_MockVariableIntBlock_0.frq, _h_Asserting_0.tip, _c.fdt, _4.fdx, _g_MockVariableIntBlock_0.doc, _e_MockVariableIntBlock_0.pos, _h_Lucene40WithOrds_0.frq, _f_MockVariableIntBlock_0.frq, _e_Lucene40WithOrds_0.prx, _e.fnm, _d_MockVariableIntBlock_0.pos, _c_Lucene40WithOrds_0.frq, _h.fnm, _j_nrm.cfe, _b_Pulsing40_0.prx, _d_Asserting_0.frq, _i_MockVariableIntBlock_0.frq, _g_MockVariableIntBlock_0.pos, _d_MockVariableIntBlock_0.doc, _f_Pulsing40_0.frq, _4_MockVariableIntBlock_0.pyl, _4_Lucene40WithOrds_0.prx, _d_Asserting_0.tim, _4_nrm.cfs, _g_Asserting_0.frq, _d.si, _h_Asserting_0.frq, _j_nrm.cfs, _f_MockVariableIntBlock_0.pyl, _h_Lucene40WithOrds_0.prx, _d_Lucene40WithOrds_0.prx, _h_nrm.cfe, _i_MockVariableIntBlock_0.tii, _c_MockVariableIntBlock_0.pos, _i_Pulsing40_0.prx, _d_Asserting_0.tip, _i_MockVariableIntBlock_0.tib, _f_Pulsing40_0.tim, _h_nrm.cfs, _f_Pulsing40_0.tip, _d_MockVariableIntBlock_0.skp, _f_Asserting_0.prx, _h_MockVariableIntBlock_0.tii, _c_nrm.cfe, _4.fdt, _4.si, _4_Pulsing40_0.frq, _f_Lucene40WithOrds_0.frq, _c_nrm.cfs, _c_MockVariableIntBlock_0.skp, _b.fnm, _b.fdt, _h_MockVariableIntBlock_0.tib, _b.fdx, _f_MockVariableIntBlock_0.skp, _f_nrm.cfe, _d_MockVariableIntBlock_0.frq, _j_Pulsing40_0.tip, _j_Pulsing40_0.tim, _i_Lucene40WithOrds_0.prx, _j_Asserting_0.prx, _j_MockVariableIntBlock_0.doc, _e_nrm.cfe, _e_MockVariableIntBlock_0.skp, _f_nrm.cfs, _e_nrm.cfs, _i_Asserting_0.prx, _4_Asserting_0.frq, _b_Asserting_0.prx, _b_Lucene40WithOrds_0.tib, _c_MockVariableIntBlock_0.doc, _e_Asserting_0.tim, _4_MockVariableIntBlock_0.doc, _f_Asserting_0.frq, _d_Lucene40WithOrds_0.frq, _b_Lucene40WithOrds_0.tii, _f.fdt, _b_MockVariableIntBlock_0.tii, _f.fdx, _e.si, _b_MockVariableIntBlock_0.tib, _e_Lucene40WithOrds_0.frq, _i_MockVariableIntBlock_0.skp, _e_Asserting_0.frq, _j.fdx, _i_MockVariableIntBlock_0.pos, _4_Lucene40WithOrds_0.tib, _j.fdt, _4_Lucene40WithOrds_0.tii, _d_Asserting_0.prx, _4_Asserting_0.tip, _d_Pulsing40_0.prx, _e.fdx, _i.si, _c_MockVariableIntBlock_0.tii, _d_MockVariableIntBlock_0.pyl, _4_Pulsing40_0.prx, _4_Asserting_0.prx, _j_Lucene40WithOrds_0.prx, _b.si, _c_MockVariableIntBlock_0.tib, _4_Asserting_0.tim, _e.fdt, _b_MockVariableIntBlock_0.pyl, _e_Asserting_0.tip, _f_Lucene40WithOrds_0.prx, _j.si, _g_nrm.cfs, _c_Pulsing40_0.tip, _c_Pulsing40_0.tim, _c_Lucene40WithOrds_0.prx, _d_nrm.cfs, _g_Lucene40WithOrds_0.prx, _d.fdx, _d.fdt, _g_nrm.cfe, _j_MockVariableIntBlock_0.pos, _c.fnm, _f_MockVariableIntBlock_0.doc, _d_nrm.cfe, _g_Lucene40WithOrds_0.frq, _b_Pulsing40_0.frq, _e_Asserting_0.prx, _d_Pulsing40_0.frq, _4.fnm, _d_MockVariableIntBlock_0.tib, _f_Asserting_0.tim, _d_MockVariableIntBlock_0.tii, _i_Asserting_0.frq, _h.si, _j_Lucene40WithOrds_0.frq, _j_Pulsing40_0.prx, _f_MockVariableIntBlock_0.pos, _d.fnm, _b_MockVariableIntBlock_0.doc, _c_MockVariableIntBlock_0.frq, _i_Lucene40WithOrds_0.tii, _g_Asserting_0.prx, _c_Pulsing40_0.frq, _g.si, _g_MockVariableIntBlock_0.skp, _b_MockVariableIntBlock_0.frq, _h_Pulsing40_0.frq, _j_Asserting_0.frq, _f_Lucene40WithOrds_0.tii, _4_Lucene40WithOrds_0.frq, _b_Asserting_0.frq, _c_Asserting_0.tim, _c_Asserting_0.tip, _g_Pulsing40_0.frq, _i_Lucene40WithOrds_0.tib, _g.fnm, _4_MockVariableIntBlock_0.skp, _4_MockVariableIntBlock_0.pos, _i_MockVariableIntBlock_0.pyl, _d_Lucene40WithOrds_0.tib, _c_MockVariableIntBlock_0.pyl, _d_Lucene40WithOrds_0.tii, _g_Pulsing40_0.tip, _g_MockVariableIntBlock_0.pyl, _g_Pulsing40_0.tim, _g_Lucene40WithOrds_0.tib, _g_Pulsing40_0.prx, _b_Lucene40WithOrds_0.frq, _h_MockVariableIntBlock_0.frq, _f_Asserting_0.tip, segments_7, _j_MockVariableIntBlock_0.skp, _f.fnm, _j.fnm, _b_nrm.cfe, _b_nrm.cfs, _i.fnm, _f_Lucene40WithOrds_0.tib]
[junit4:junit4]   2> 		commit{dir=BaseDirectoryWrapper(org.apache.lucene.store.RAMDirectory@314db005 lockFactory=org.apache.lucene.store.NativeFSLockFactory@7eae114b),segFN=segments_8,generation=8,filenames=[_k_MockVariableIntBlock_0.pos, _k_Pulsing40_0.tim, _k_MockVariableIntBlock_0.tii, _k_Asserting_0.tip, _k.fdt, _k_Pulsing40_0.tip, _k_Asserting_0.tim, _k_MockVariableIntBlock_0.tib, _k.fdx, _k_Lucene40WithOrds_0.tii, _k_MockVariableIntBlock_0.doc, _k.fnm, _k_MockVariableIntBlock_0.skp, _k.si, _k_Pulsing40_0.frq, _k_Asserting_0.frq, _k_nrm.cfe, _k_MockVariableIntBlock_0.pyl, _k_Pulsing40_0.prx, _k_Asserting_0.prx, _k_Lucene40WithOrds_0.prx, _k_nrm.cfs, segments_8, _k_MockVariableIntBlock_0.frq, _k_Lucene40WithOrds_0.frq, _k_Lucene40WithOrds_0.tib]
[junit4:junit4]   2> 4036 T1747 C65 oass.SolrIndexSearcher.<init> Opening Searcher@412abc64 main
[junit4:junit4]   2> 4038 T1769 C67 oasc.SolrDeletionPolicy.updateCommits newest commit = 8
[junit4:junit4]   2> 4038 T1747 C65 oass.SolrIndexSearcher.getIndexDir WARNING WARNING: Directory impl does not support setting indexDir: org.apache.lucene.store.MockDirectoryWrapper
[junit4:junit4]   2> 4038 T1736 C64 oasc.SolrDeletionPolicy.onCommit SolrDeletionPolicy.onCommit: commits:num=2
[junit4:junit4]   2> 		commit{dir=MockDirWrapper(NRTCachingDirectory(org.apache.lucene.store.RAMDirectory@6d865cfe lockFactory=org.apache.lucene.store.NativeFSLockFactory@4238f637; maxCacheMB=0.40625 maxMergeSizeMB=0.255859375)),segFN=segments_6,generation=6,filenames=[_5_nrm.cfe, _3_MockVariableIntBlock_0.frq, _6_Asserting_0.frq, _3.fdt, _4_MockVariableIntBlock_0.tii, _5_Lucene40WithOrds_0.tib, _1_Asserting_0.tim, _7.fnm, _5_Lucene40WithOrds_0.tii, _1_Lucene40WithOrds_0.tib, _1_Asserting_0.tip, _1_Lucene40WithOrds_0.tii, _5_Pulsing40_0.tip, _5_Pulsing40_0.tim, _6_MockVariableIntBlock_0.tii, _1_Lucene40WithOrds_0.frq, _6_MockVariableIntBlock_0.tib, _1_MockVariableIntBlock_0.tii, _8_Asserting_0.tim, _8_Asserting_0.tip, _1_MockVariableIntBlock_0.tib, _1.fdx, _4_MockVariableIntBlock_0.tib, _1.fdt, _5_nrm.cfs, _8_Pulsing40_0.frq, _8_MockVariableIntBlock_0.skp, _6.fdt, _5_Lucene40WithOrds_0.prx, _3_Pulsing40_0.frq, _1_MockVariableIntBlock_0.skp, _2.si, _2_Pulsing40_0.tim, _7_MockVariableIntBlock_0.pos, _2_Pulsing40_0.tip, _6.fdx, _1_Lucene40WithOrds_0.prx, _1_MockVariableIntBlock_0.pyl, _3_MockVariableIntBlock_0.tii, _7_Asserting_0.frq, _2_nrm.cfe, _5_Pulsing40_0.frq, _2_nrm.cfs, _7_MockVariableIntBlock_0.skp, _4_MockVariableIntBlock_0.frq, _2.fnm, _5_MockVariableIntBlock_0.frq, _3.fdx, _7_Pulsing40_0.tim, _4_Pulsing40_0.tip, _8_MockVariableIntBlock_0.pos, _4_Pulsing40_0.tim, _1.si, _3_MockVariableIntBlock_0.pos, _7_Pulsing40_0.tip, _3_nrm.cfe, _8_MockVariableIntBlock_0.frq, _8_nrm.cfe, _5_MockVariableIntBlock_0.pyl, _3_Lucene40WithOrds_0.tii, _4_nrm.cfe, _6_Lucene40WithOrds_0.prx, _8_Lucene40WithOrds_0.tib, _3_Lucene40WithOrds_0.tib, _4.fdx, _8_Lucene40WithOrds_0.frq, _8_Lucene40WithOrds_0.tii, _3_Asserting_0.prx, _1_Pulsing40_0.prx, _7_MockVariableIntBlock_0.tii, _2_Asserting_0.prx, _6_MockVariableIntBlock_0.frq, _3_MockVariableIntBlock_0.doc, _7_Lucene40WithOrds_0.tib, _5.si, _8_nrm.cfs, _3_nrm.cfs, _8_Pulsing40_0.tip, _7_Lucene40WithOrds_0.tii, _4_MockVariableIntBlock_0.pyl, _4_Lucene40WithOrds_0.prx, _6_Pulsing40_0.prx, _4_nrm.cfs, _3_MockVariableIntBlock_0.tib, _8_Pulsing40_0.tim, _5_Asserting_0.prx, _5_MockVariableIntBlock_0.doc, _6_MockVariableIntBlock_0.pyl, _8_MockVariableIntBlock_0.tib, _2_MockVariableIntBlock_0.frq, _6_Asserting_0.tim, _6_nrm.cfs, _6_Asserting_0.tip, _2_Lucene40WithOrds_0.prx, _7_nrm.cfs, _2_Asserting_0.frq, _5_Asserting_0.frq, _8_MockVariableIntBlock_0.doc, _1_nrm.cfs, _5.fnm, _7_nrm.cfe, _7_Asserting_0.prx, _6_nrm.cfe, _8_Asserting_0.prx, _4.si, _4.fdt, _3_Lucene40WithOrds_0.frq, _1_nrm.cfe, _3_Asserting_0.frq, _4_Pulsing40_0.frq, _8.fdx, _8_MockVariableIntBlock_0.tii, _8.fdt, _7.si, _8.si, _8_MockVariableIntBlock_0.pyl, _7_Lucene40WithOrds_0.frq, _5_MockVariableIntBlock_0.tii, _4_Asserting_0.frq, _4_MockVariableIntBlock_0.doc, _3_Pulsing40_0.tip, _2.fdt, _7.fdx, _7_MockVariableIntBlock_0.frq, _2.fdx, _3_Pulsing40_0.tim, _7.fdt, _2_Asserting_0.tim, _2_Asserting_0.tip, _7_Pulsing40_0.frq, _3.si, _2_MockVariableIntBlock_0.skp, _4_Lucene40WithOrds_0.tib, _4_Lucene40WithOrds_0.tii, _2_MockVariableIntBlock_0.pyl, _4_Asserting_0.tip, _3.fnm, _2_MockVariableIntBlock_0.doc, _4_Pulsing40_0.prx, _4_Asserting_0.prx, _4_Asserting_0.tim, _1_MockVariableIntBlock_0.doc, _2_MockVariableIntBlock_0.tii, _7_MockVariableIntBlock_0.pyl, _6_Asserting_0.prx, _2_Lucene40WithOrds_0.frq, _5_MockVariableIntBlock_0.tib, _2_MockVariableIntBlock_0.tib, _1_MockVariableIntBlock_0.pos, _1_Asserting_0.frq, _1_Asserting_0.prx, _5_Pulsing40_0.prx, _3_MockVariableIntBlock_0.pyl, _6.fnm, _6.si, _3_Lucene40WithOrds_0.prx, _7_MockVariableIntBlock_0.tib, _5.fdt, _1_Pulsing40_0.tip, _8_Asserting_0.frq, _6_Pulsing40_0.frq, _1_Pulsing40_0.tim, _4.fnm, _1.fnm, _7_MockVariableIntBlock_0.doc, _7_Pulsing40_0.prx, _1_Pulsing40_0.frq, _6_Pulsing40_0.tim, _8_Pulsing40_0.prx, _6_Pulsing40_0.tip, _7_Asserting_0.tip, _2_Pulsing40_0.prx, _6_MockVariableIntBlock_0.doc, _2_MockVariableIntBlock_0.pos, _7_Asserting_0.tim, _5_MockVariableIntBlock_0.pos, _6_Lucene40WithOrds_0.frq, _5_Asserting_0.tim, _6_Lucene40WithOrds_0.tii, _2_Pulsing40_0.frq, _5_Lucene40WithOrds_0.frq, _8.fnm, _6_Lucene40WithOrds_0.tib, _5_Asserting_0.tip, _4_Lucene40WithOrds_0.frq, _4_MockVariableIntBlock_0.skp, _5_MockVariableIntBlock_0.skp, _4_MockVariableIntBlock_0.pos, _6_MockVariableIntBlock_0.pos, _7_Lucene40WithOrds_0.prx, _6_MockVariableIntBlock_0.skp, _1_MockVariableIntBlock_0.frq, _2_Lucene40WithOrds_0.tii, _3_Pulsing40_0.prx, _3_Asserting_0.tim, _3_Asserting_0.tip, _5.fdx, _2_Lucene40WithOrds_0.tib, _8_Lucene40WithOrds_0.prx, _3_MockVariableIntBlock_0.skp, segments_6]
[junit4:junit4]   2> 		commit{dir=MockDirWrapper(NRTCachingDirectory(org.apache.lucene.store.RAMDirectory@6d865cfe lockFactory=org.apache.lucene.store.NativeFSLockFactory@4238f637; maxCacheMB=0.40625 maxMergeSizeMB=0.255859375)),segFN=segments_7,generation=7,filenames=[_5_nrm.cfe, _3_MockVariableIntBlock_0.frq, _a_MockVariableIntBlock_0.frq, _6_Asserting_0.frq, _a_Asserting_0.prx, _3.fdt, _4_MockVariableIntBlock_0.tii, _5_Lucene40WithOrds_0.tib, _1_Asserting_0.tim, _7.fnm, _c.si, _5_Lucene40WithOrds_0.tii, _1_Lucene40WithOrds_0.tib, _1_Asserting_0.tip, _1_Lucene40WithOrds_0.tii, _5_Pulsing40_0.tip, _5_Pulsing40_0.tim, _6_MockVariableIntBlock_0.tii, _1_Lucene40WithOrds_0.frq, _6_MockVariableIntBlock_0.tib, _1_MockVariableIntBlock_0.tii, _9.fdt, _8_Asserting_0.tim, _8_Asserting_0.tip, _9.fdx, _1_MockVariableIntBlock_0.tib, _1.fdx, _4_MockVariableIntBlock_0.tib, _1.fdt, _5_nrm.cfs, _8_Pulsing40_0.frq, _8_MockVariableIntBlock_0.skp, _6.fdt, _a.fnm, _5_Lucene40WithOrds_0.prx, _3_Pulsing40_0.frq, _1_MockVariableIntBlock_0.skp, _2.si, _c_Lucene40WithOrds_0.tib, _2_Pulsing40_0.tim, _7_MockVariableIntBlock_0.pos, _b_Lucene40WithOrds_0.prx, _2_Pulsing40_0.tip, _6.fdx, _c_Lucene40WithOrds_0.tii, _1_Lucene40WithOrds_0.prx, _a_Lucene40WithOrds_0.frq, _1_MockVariableIntBlock_0.pyl, _b_Asserting_0.tim, _c_Asserting_0.frq, _c_Pulsing40_0.prx, _3_MockVariableIntBlock_0.tii, _b_Asserting_0.tip, _7_Asserting_0.frq, _2_nrm.cfe, _5_Pulsing40_0.frq, _b_MockVariableIntBlock_0.skp, _2_nrm.cfs, _7_MockVariableIntBlock_0.skp, _9_MockVariableIntBlock_0.frq, _9_Asserting_0.frq, _4_MockVariableIntBlock_0.frq, _9_Asserting_0.prx, _b_Pulsing40_0.tip, _c_Asserting_0.prx, _b_Pulsing40_0.tim, _2.fnm, _5_MockVariableIntBlock_0.frq, _b_MockVariableIntBlock_0.pos, _3.fdx, _7_Pulsing40_0.tim, _4_Pulsing40_0.tip, _8_MockVariableIntBlock_0.pos, _4_Pulsing40_0.tim, _1.si, _3_MockVariableIntBlock_0.pos, _7_Pulsing40_0.tip, _9_MockVariableIntBlock_0.pyl, _3_nrm.cfe, _8_MockVariableIntBlock_0.frq, _8_nrm.cfe, _5_MockVariableIntBlock_0.pyl, _3_Lucene40WithOrds_0.tii, _4_nrm.cfe, _6_Lucene40WithOrds_0.prx, _8_Lucene40WithOrds_0.tib, _a_MockVariableIntBlock_0.doc, _c.fdx, _3_Lucene40WithOrds_0.tib, _c.fdt, _4.fdx, _8_Lucene40WithOrds_0.frq, _a_Asserting_0.tip, _a_MockVariableIntBlock_0.skp, _8_Lucene40WithOrds_0.tii, _a_Asserting_0.tim, _3_Asserting_0.prx, _1_Pulsing40_0.prx, _7_MockVariableIntBlock_0.tii, _9.si, _2_Asserting_0.prx, _6_MockVariableIntBlock_0.frq, _c_Lucene40WithOrds_0.frq, _b_Pulsing40_0.prx, _3_MockVariableIntBlock_0.doc, _7_Lucene40WithOrds_0.tib, _a_Pulsing40_0.prx, _a_Asserting_0.frq, _5.si, _8_nrm.cfs, _3_nrm.cfs, _8_Pulsing40_0.tip, _7_Lucene40WithOrds_0.tii, _4_MockVariableIntBlock_0.pyl, _a_MockVariableIntBlock_0.pyl, _4_Lucene40WithOrds_0.prx, _6_Pulsing40_0.prx, _4_nrm.cfs, _3_MockVariableIntBlock_0.tib, _8_Pulsing40_0.tim, _5_Asserting_0.prx, _5_MockVariableIntBlock_0.doc, _6_MockVariableIntBlock_0.pyl, _8_MockVariableIntBlock_0.tib, _2_MockVariableIntBlock_0.frq, _c_MockVariableIntBlock_0.pos, _a.fdt, _a.fdx, _6_Asserting_0.tim, _6_nrm.cfs, _6_Asserting_0.tip, _2_Lucene40WithOrds_0.prx, _9_Lucene40WithOrds_0.frq, _7_nrm.cfs, _2_Asserting_0.frq, _5_Asserting_0.frq, _8_MockVariableIntBlock_0.doc, _1_nrm.cfs, _5.fnm, _a_Lucene40WithOrds_0.tii, _7_nrm.cfe, _c_nrm.cfe, _7_Asserting_0.prx, _6_nrm.cfe, _9_MockVariableIntBlock_0.skp, _8_Asserting_0.prx, _4.si, _4.fdt, _3_Lucene40WithOrds_0.frq, _a_Lucene40WithOrds_0.tib, _1_nrm.cfe, _3_Asserting_0.frq, _4_Pulsing40_0.frq, _a_MockVariableIntBlock_0.tii, _c_nrm.cfs, _c_MockVariableIntBlock_0.skp, _a_Pulsing40_0.frq, _9_Pulsing40_0.prx, _9_MockVariableIntBlock_0.doc, _b.fnm, _b.fdt, _8.fdx, _a_MockVariableIntBlock_0.tib, _b.fdx, _8_MockVariableIntBlock_0.tii, _8.fdt, _7.si, _8.si, _a_Pulsing40_0.tip, _8_MockVariableIntBlock_0.pyl, _a_Pulsing40_0.tim, _7_Lucene40WithOrds_0.frq, _5_MockVariableIntBlock_0.tii, _4_Asserting_0.frq, _b_Asserting_0.prx, _9_MockVariableIntBlock_0.tib, _c_MockVariableIntBlock_0.doc, _b_Lucene40WithOrds_0.tib, _4_MockVariableIntBlock_0.doc, _3_Pulsing40_0.tip, _2.fdt, _7.fdx, _7_MockVariableIntBlock_0.frq, _b_Lucene40WithOrds_0.tii, _2.fdx, _3_Pulsing40_0.tim, _7.fdt, _b_MockVariableIntBlock_0.tii, _2_Asserting_0.tim, _2_Asserting_0.tip, _7_Pulsing40_0.frq, _b_MockVariableIntBlock_0.tib, _3.si, _2_MockVariableIntBlock_0.skp, _4_Lucene40WithOrds_0.tib, _4_Lucene40WithOrds_0.tii, _2_MockVariableIntBlock_0.pyl, _9_Asserting_0.tip, _4_Asserting_0.tip, _3.fnm, _c_MockVariableIntBlock_0.tii, _2_MockVariableIntBlock_0.doc, _9_Asserting_0.tim, _4_Pulsing40_0.prx, _4_Asserting_0.prx, _b.si, _c_MockVariableIntBlock_0.tib, _4_Asserting_0.tim, _1_MockVariableIntBlock_0.doc, _b_MockVariableIntBlock_0.pyl, _9_MockVariableIntBlock_0.tii, _2_MockVariableIntBlock_0.tii, _7_MockVariableIntBlock_0.pyl, _6_Asserting_0.prx, _2_Lucene40WithOrds_0.frq, _5_MockVariableIntBlock_0.tib, _2_MockVariableIntBlock_0.tib, _9.fnm, _1_MockVariableIntBlock_0.pos, _1_Asserting_0.frq, _c_Pulsing40_0.tip, _c_Pulsing40_0.tim, _c_Lucene40WithOrds_0.prx, _a_MockVariableIntBlock_0.pos, _1_Asserting_0.prx, _5_Pulsing40_0.prx, _3_MockVariableIntBlock_0.pyl, _6.fnm, _6.si, _c.fnm, _3_Lucene40WithOrds_0.prx, _7_MockVariableIntBlock_0.tib, _b_Pulsing40_0.frq, _5.fdt, _1_Pulsing40_0.tip, _8_Asserting_0.frq, _6_Pulsing40_0.frq, _1_Pulsing40_0.tim, _4.fnm, _a_Lucene40WithOrds_0.prx, _1.fnm, _7_MockVariableIntBlock_0.doc, _7_Pulsing40_0.prx, _1_Pulsing40_0.frq, _9_Pulsing40_0.tip, _9_Pulsing40_0.tim, _6_Pulsing40_0.tim, _9_nrm.cfs, _8_Pulsing40_0.prx, _6_Pulsing40_0.tip, _9_MockVariableIntBlock_0.pos, _7_Asserting_0.tip, _2_Pulsing40_0.prx, _6_MockVariableIntBlock_0.doc, _2_MockVariableIntBlock_0.pos, _7_Asserting_0.tim, _a_nrm.cfe, _5_MockVariableIntBlock_0.pos, _6_Lucene40WithOrds_0.frq, _9_nrm.cfe, _5_Asserting_0.tim, _b_MockVariableIntBlock_0.doc, _c_MockVariableIntBlock_0.frq, _a.si, _a_nrm.cfs, _6_Lucene40WithOrds_0.tii, _2_Pulsing40_0.frq, _5_Lucene40WithOrds_0.frq, _8.fnm, _6_Lucene40WithOrds_0.tib, _5_Asserting_0.tip, _c_Pulsing40_0.frq, _b_MockVariableIntBlock_0.frq, _4_Lucene40WithOrds_0.frq, _b_Asserting_0.frq, _c_Asserting_0.tim, _c_Asserting_0.tip, _9_Pulsing40_0.frq, _4_MockVariableIntBlock_0.skp, _9_Lucene40WithOrds_0.prx, _5_MockVariableIntBlock_0.skp, _4_MockVariableIntBlock_0.pos, _6_MockVariableIntBlock_0.pos, _7_Lucene40WithOrds_0.prx, _c_MockVariableIntBlock_0.pyl, _6_MockVariableIntBlock_0.skp, _9_Lucene40WithOrds_0.tii, _b_Lucene40WithOrds_0.frq, _1_MockVariableIntBlock_0.frq, _2_Lucene40WithOrds_0.tii, _3_Pulsing40_0.prx, segments_7, _b_nrm.cfe, _9_Lucene40WithOrds_0.tib, _3_Asserting_0.tim, _3_Asserting_0.tip, _5.fdx, _2_Lucene40WithOrds_0.tib, _b_nrm.cfs, _8_Lucene40WithOrds_0.prx, _3_MockVariableIntBlock_0.skp]
[junit4:junit4]   2> 4041 T1769 C67 oass.SolrIndexSearcher.<init> Opening Searcher@7748736a main
[junit4:junit4]   2> 4039 T1747 C65 oasu.DirectUpdateHandler2.commit end_commit_flush
[junit4:junit4]   2> 4042 T1736 C64 oasc.SolrDeletionPolicy.updateCommits newest commit = 7
[junit4:junit4]   2> 4039 T1751 oasc.SolrCore.registerSearcher [collection1] Registered new searcher Searcher@412abc64 main{StandardDirectoryReader(segments_3:17:nrt _0(5.0):C22 _1(5.0):C8 _2(5.0):C30 _3(5.0):C5 _4(5.0):C59 _5(5.0):C8 _6(5.0):C31 _7(5.0):C7)}
[junit4:junit4]   2> 4042 T1749 C65 oasu.DirectUpdateHandler2.commit start commit{flags=0,_version_=0,optimize=false,openSearcher=true,waitSearcher=true,expungeDeletes=false,softCommit=false}
[junit4:junit4]   2> 4042 T1769 C67 oass.SolrIndexSearcher.getIndexDir WARNING WARNING: Directory impl does not support setting indexDir: org.apache.lucene.store.BaseDirectoryWrapper
[junit4:junit4]   2> 4043 T1747 C65 UPDATE [collection1] webapp=/solr path=/update params={waitSearcher=true&commit=true&wt=javabin&expungeDeletes=false&version=2&softCommit=false} {add=[50 (1413145684994949120), 51 (1413145684995997697), 53 (1413145684997046274), 54 (1413145684998094848), 56 (1413145684999143425), 57 (1413145684999143428), 58 (1413145685000192001), 60 (1413145685000192004), 61 (1413145685001240576), 65 (1413145685002289152)],commit=} 0 130
[junit4:junit4]   2> 4043 T1749 C65 oass.SolrIndexSearcher.<init> Opening Searcher@5fa75d45 main
[junit4:junit4]   2> 4043 T1769 C67 oasu.DirectUpdateHandler2.commit end_commit_flush
[junit4:junit4]   2> 4043 T1771 oasc.SolrCore.registerSearcher [collection1] Registered new searcher Searcher@7748736a main{StandardDirectoryReader(segments_8:43:nrt _k(5.0):C190)}
[junit4:junit4]   2> 4044 T1817 C67 oasu.DirectUpdateHandler2.commit start commit{flags=0,_version_=0,optimize=false,openSearcher=true,waitSearcher=true,expungeDeletes=false,softCommit=false}
[junit4:junit4]   2> 4043 T1749 C65 oass.SolrIndexSearcher.getIndexDir WARNING WARNING: Directory impl does not support setting indexDir: org.apache.lucene.store.MockDirectoryWrapper
[junit4:junit4]   2> 4044 T1751 oasc.SolrCore.registerSearcher [collection1] Registered new searcher Searcher@5fa75d45 main{StandardDirectoryReader(segments_3:17:nrt _0(5.0):C22 _1(5.0):C8 _2(5.0):C30 _3(5.0):C5 _4(5.0):C59 _5(5.0):C8 _6(5.0):C31 _7(5.0):C7)}
[junit4:junit4]   2> 4044 T1749 C65 oasu.DirectUpdateHandler2.commit end_commit_flush
[junit4:junit4]   2> 4044 T1817 C67 oass.SolrIndexSearcher.<init> Opening Searcher@55a47904 main
[junit4:junit4]   2> 4045 T1750 C65 oasu.DirectUpdateHandler2.commit start commit{flags=0,_version_=0,optimize=false,openSearcher=true,waitSearcher=true,expungeDeletes=false,softCommit=false}
[junit4:junit4]   2> 4045 T1749 C65 UPDATE [collection1] webapp=/solr path=/update params={waitSearcher=true&commit=true&wt=javabin&expungeDeletes=false&version=2&softCommit=false} {add=[84 (1413145685009629184), 85 (1413145685010677760), 90 (1413145685011726336), 93 (1413145685011726337), 95 (1413145685012774912), 100 (1413145685013823489), 102 (1413145685014872064), 103 (1413145685014872066), 109 (1413145685015920641), 112 (1413145685016969217)],commit=} 0 120
[junit4:junit4]   2> 4045 T1817 C67 oass.SolrIndexSearcher.getIndexDir WARNING WARNING: Directory impl does not support setting indexDir: org.apache.lucene.store.BaseDirectoryWrapper
[junit4:junit4]   2> 4044 T1769 C67 UPDATE [collection1] webapp=/solr path=/update params={waitSearcher=true&commit=true&wt=javabin&expungeDeletes=false&version=2&softCommit=false} {add=[94 (1413145685010677761), 97 (1413145685011726336), 101 (1413145685011726338), 103 (1413145685016969217), 105 (1413145685018017792), 108 (1413145685018017794), 109 (1413145685019066368), 110 (1413145685019066370), 112 (1413145685020114944), 113 (1413145685025357824)],commit=} 0 117
[junit4:junit4]   2> 4046 T1817 C67 oasu.DirectUpdateHandler2.commit end_commit_flush
[junit4:junit4]   2> 4045 T1736 C64 oass.SolrIndexSearcher.<init> Opening Searcher@1781716d main
[junit4:junit4]   2> 4047 T1765 C67 oasu.DirectUpdateHandler2.commit start commit{flags=0,_version_=0,optimize=false,openSearcher=true,waitSearcher=true,expungeDeletes=false,softCommit=false}
[junit4:junit4]   2> 4047 T1736 C64 oass.SolrIndexSearcher.getIndexDir WARNING WARNING: Directory impl does not support setting indexDir: org.apache.lucene.store.MockDirectoryWrapper
[junit4:junit4]   2> 4046 T1750 C65 oass.SolrIndexSearcher.<init> Opening Searcher@685e4092 main
[junit4:junit4]   2> 4046 T1771 oasc.SolrCore.registerSearcher [collection1] Registered new searcher Searcher@55a47904 main{StandardDirectoryReader(segments_8:43:nrt _k(5.0):C190)}
[junit4:junit4]   2> 4048 T1741 oasc.SolrCore.registerSearcher [collection1] Registered new searcher Searcher@1781716d main{StandardDirectoryReader(segments_7:29:nrt _1(5.0):C2 _2(5.0):C22 _3(5.0):C13 _4(5.0):C44 _5(5.0):C7 _6(5.0):C3 _7(5.0):C38 _8(5.0):C1 _9(5.0):C15 _a(5.0):C11 _b(5.0):C14 _c(5.0):C2)}
[junit4:junit4]   2> 4048 T1736 C64 oasu.DirectUpdateHandler2.commit end_commit_flush
[junit4:junit4]   2> 4048 T1817 C67 UPDATE [collection1] webapp=/solr path=/update params={waitSearcher=true&commit=true&wt=javabin&expungeDeletes=false&version=2&softCommit=false} {add=[173 (1413145685029552129), 176 (1413145685030600705), 177 (1413145685030600707), 178 (1413145685031649281), 179 (1413145685031649282), 180 (1413145685031649284), 181 (1413145685032697856), 185 (1413145685032697858), 186 (1413145685033746432), 189 (1413145685033746434)],commit=} 0 103
[junit4:junit4]   2> 4048 T1750 C65 oass.SolrIndexSearcher.getIndexDir WARNING WARNING: Directory impl does not

[...truncated too long message...]

e.decref SolrCoreState ref count has reached 0 - closing IndexWriter
[junit4:junit4]   2> 159546 T1152 oasu.DefaultSolrCoreState.decref Closing SolrCoreState - canceling any ongoing recovery
[junit4:junit4]   2> 161187 T1267 oaz.ClientCnxn$SendThread.startConnect Opening socket connection to server localhost/127.0.0.1:45189
[junit4:junit4]   2> 164560 T1268 oaz.ClientCnxn$EventThread.run EventThread shut down
[junit4:junit4]   2> 164560 T1152 oaz.ZooKeeper.close Session: 0x139c8067bdd0009 closed
[junit4:junit4]   2> 164561 T1152 oejsh.ContextHandler.doStop stopped o.e.j.s.ServletContextHandler{/solr,null}
[junit4:junit4]   2> 164931 T1152 oas.SolrTestCaseJ4.tearDown ###Ending testDistribSearch
[junit4:junit4]   2> NOTE: download the large Jenkins line-docs file by running 'ant get-jenkins-line-docs' in the lucene directory.
[junit4:junit4]   2> NOTE: reproduce with: ant test  -Dtestcase=SyncSliceTest -Dtests.method=testDistribSearch -Dtests.seed=6B70A5B1C3F2093F -Dtests.multiplier=3 -Dtests.nightly=true -Dtests.slow=true -Dtests.linedocsfile=/home/hudson/lucene-data/enwiki.random.lines.txt -Dtests.locale=es_AR -Dtests.timezone=NZ-CHAT -Dtests.file.encoding=UTF-8
[junit4:junit4] FAILURE  165s J1 | SyncSliceTest.testDistribSearch <<<
[junit4:junit4]    > Throwable #1: java.lang.AssertionError: There are still nodes recoverying
[junit4:junit4]    > 	at __randomizedtesting.SeedInfo.seed([6B70A5B1C3F2093F:EA962BA9B4AD6903]:0)
[junit4:junit4]    > 	at org.junit.Assert.fail(Assert.java:93)
[junit4:junit4]    > 	at org.apache.solr.cloud.AbstractDistribZkTestBase.waitForRecoveriesToFinish(AbstractDistribZkTestBase.java:153)
[junit4:junit4]    > 	at org.apache.solr.cloud.AbstractFullDistribZkTestBase.waitForRecoveriesToFinish(AbstractFullDistribZkTestBase.java:555)
[junit4:junit4]    > 	at org.apache.solr.cloud.AbstractFullDistribZkTestBase.waitForThingsToLevelOut(AbstractFullDistribZkTestBase.java:1130)
[junit4:junit4]    > 	at org.apache.solr.cloud.SyncSliceTest.doTest(SyncSliceTest.java:162)
[junit4:junit4]    > 	at org.apache.solr.BaseDistributedSearchTestCase.testDistribSearch(BaseDistributedSearchTestCase.java:691)
[junit4:junit4]    > 	at sun.reflect.NativeMethodAccessorImpl.invoke0(Native Method)
[junit4:junit4]    > 	at sun.reflect.NativeMethodAccessorImpl.invoke(NativeMethodAccessorImpl.java:57)
[junit4:junit4]    > 	at sun.reflect.DelegatingMethodAccessorImpl.invoke(DelegatingMethodAccessorImpl.java:43)
[junit4:junit4]    > 	at java.lang.reflect.Method.invoke(Method.java:616)
[junit4:junit4]    > 	at com.carrotsearch.randomizedtesting.RandomizedRunner.invoke(RandomizedRunner.java:1559)
[junit4:junit4]    > 	at com.carrotsearch.randomizedtesting.RandomizedRunner.access$600(RandomizedRunner.java:79)
[junit4:junit4]    > 	at com.carrotsearch.randomizedtesting.RandomizedRunner$6.evaluate(RandomizedRunner.java:737)
[junit4:junit4]    > 	at com.carrotsearch.randomizedtesting.RandomizedRunner$7.evaluate(RandomizedRunner.java:773)
[junit4:junit4]    > 	at com.carrotsearch.randomizedtesting.RandomizedRunner$8.evaluate(RandomizedRunner.java:787)
[junit4:junit4]    > 	at com.carrotsearch.randomizedtesting.rules.SystemPropertiesRestoreRule$1.evaluate(SystemPropertiesRestoreRule.java:53)
[junit4:junit4]    > 	at org.apache.lucene.util.TestRuleSetupTeardownChained$1.evaluate(TestRuleSetupTeardownChained.java:50)
[junit4:junit4]    > 	at org.apache.lucene.util.TestRuleFieldCacheSanity$1.evaluate(TestRuleFieldCacheSanity.java:51)
[junit4:junit4]    > 	at org.apache.lucene.util.AbstractBeforeAfterRule$1.evaluate(AbstractBeforeAfterRule.java:45)
[junit4:junit4]    > 	at com.carrotsearch.randomizedtesting.rules.SystemPropertiesInvariantRule$1.evaluate(SystemPropertiesInvariantRule.java:55)
[junit4:junit4]    > 	at org.apache.lucene.util.TestRuleThreadAndTestName$1.evaluate(TestRuleThreadAndTestName.java:48)
[junit4:junit4]    > 	at org.apache.lucene.util.TestRuleIgnoreAfterMaxFailures$1.evaluate(TestRuleIgnoreAfterMaxFailures.java:70)
[junit4:junit4]    > 	at org.apache.lucene.util.TestRuleMarkFailure$1.evaluate(TestRuleMarkFailure.java:48)
[junit4:junit4]    > 	at com.carrotsearch.randomizedtesting.rules.StatementAdapter.evaluate(StatementAdapter.java:36)
[junit4:junit4]    > 	at com.carrotsearch.randomizedtesting.ThreadLeakControl$StatementRunner.run(ThreadLeakControl.java:358)
[junit4:junit4]    > 	at com.carrotsearch.randomizedtesting.ThreadLeakControl.forkTimeoutingTask(ThreadLeakControl.java:782)
[junit4:junit4]    > 	at com.carrotsearch.randomizedtesting.ThreadLeakControl$3.evaluate(ThreadLeakControl.java:442)
[junit4:junit4]    > 	at com.carrotsearch.randomizedtesting.RandomizedRunner.runSingleTest(RandomizedRunner.java:746)
[junit4:junit4]    > 	at com.carrotsearch.randomizedtesting.RandomizedRunner$3.evaluate(RandomizedRunner.java:648)
[junit4:junit4]    > 	at com.carrotsearch.randomizedtesting.RandomizedRunner$4.evaluate(RandomizedRunner.java:682)
[junit4:junit4]    > 	at com.carrotsearch.randomizedtesting.RandomizedRunner$5.evaluate(RandomizedRunner.java:693)
[junit4:junit4]    > 	at com.carrotsearch.randomizedtesting.rules.StatementAdapter.evaluate(StatementAdapter.java:36)
[junit4:junit4]    > 	at com.carrotsearch.randomizedtesting.rules.SystemPropertiesRestoreRule$1.evaluate(SystemPropertiesRestoreRule.java:53)
[junit4:junit4]    > 	at org.apache.lucene.util.AbstractBeforeAfterRule$1.evaluate(AbstractBeforeAfterRule.java:45)
[junit4:junit4]    > 	at org.apache.lucene.util.TestRuleStoreClassName$1.evaluate(TestRuleStoreClassName.java:42)
[junit4:junit4]    > 	at com.carrotsearch.randomizedtesting.rules.SystemPropertiesInvariantRule$1.evaluate(SystemPropertiesInvariantRule.java:55)
[junit4:junit4]    > 	at com.carrotsearch.randomizedtesting.rules.NoShadowingOrOverridesOnMethodsRule$1.evaluate(NoShadowingOrOverridesOnMethodsRule.java:39)
[junit4:junit4]    > 	at com.carrotsearch.randomizedtesting.rules.NoShadowingOrOverridesOnMethodsRule$1.evaluate(NoShadowingOrOverridesOnMethodsRule.java:39)
[junit4:junit4]    > 	at com.carrotsearch.randomizedtesting.rules.StatementAdapter.evaluate(StatementAdapter.java:36)
[junit4:junit4]    > 	at org.apache.lucene.util.TestRuleAssertionsRequired$1.evaluate(TestRuleAssertionsRequired.java:43)
[junit4:junit4]    > 	at org.apache.lucene.util.TestRuleMarkFailure$1.evaluate(TestRuleMarkFailure.java:48)
[junit4:junit4]    > 	at org.apache.lucene.util.TestRuleIgnoreAfterMaxFailures$1.evaluate(TestRuleIgnoreAfterMaxFailures.java:70)
[junit4:junit4]    > 	at org.apache.lucene.util.TestRuleIgnoreTestSuites$1.evaluate(TestRuleIgnoreTestSuites.java:55)
[junit4:junit4]    > 	at com.carrotsearch.randomizedtesting.rules.StatementAdapter.evaluate(StatementAdapter.java:36)
[junit4:junit4]    > 	at com.carrotsearch.randomizedtesting.ThreadLeakControl$StatementRunner.run(ThreadLeakControl.java:358)
[junit4:junit4]    > 	at java.lang.Thread.run(Thread.java:679)
[junit4:junit4]   2> 164958 T1152 oas.SolrTestCaseJ4.deleteCore ###deleteCore
[junit4:junit4]   2> NOTE: test params are: codec=Lucene40: {range_facet_l=PostingsFormat(name=Lucene40WithOrds), text=Pulsing40(freqCutoff=10 minBlockSize=50 maxBlockSize=169), _version_=PostingsFormat(name=Lucene40WithOrds), rnd_b=PostingsFormat(name=NestedPulsing), intDefault=PostingsFormat(name=Lucene40WithOrds), id=PostingsFormat(name=NestedPulsing), timestamp=PostingsFormat(name=Lucene40WithOrds), a_t=PostingsFormat(name=Lucene40WithOrds), range_facet_sl=Pulsing40(freqCutoff=10 minBlockSize=50 maxBlockSize=169), range_facet_si=Block(blocksize=128), other_tl1=PostingsFormat(name=Lucene40WithOrds), multiDefault=Block(blocksize=128), a_si=Block(blocksize=128)}, sim=RandomSimilarityProvider(queryNorm=true,coord=yes): {}, locale=es_AR, timezone=NZ-CHAT
[junit4:junit4]   2> NOTE: FreeBSD 9.0-RELEASE amd64/Sun Microsystems Inc. 1.6.0_32 (64-bit)/cpus=16,threads=1,free=49871320,total=350552064
[junit4:junit4]   2> NOTE: All tests run in this JVM: [TestQuerySenderListener, DistributedQueryElevationComponentTest, TestDistributedGrouping, TestSurroundQueryParser, TestSort, TestPropInject, StandardRequestHandlerTest, TestCodecSupport, RecoveryZkTest, DocumentAnalysisRequestHandlerTest, ClusterStateUpdateTest, PolyFieldTest, XsltUpdateRequestHandlerTest, TestRemoteStreaming, TestSolrDeletionPolicy2, SolrIndexConfigTest, TimeZoneUtilsTest, TestSolrXMLSerializer, XmlUpdateRequestHandlerTest, TermVectorComponentTest, TestJmxIntegration, LukeRequestHandlerTest, TestUtils, PeerSyncTest, ZkNodePropsTest, DocumentBuilderTest, TestRealTimeGet, TestQueryUtils, TestLRUCache, BasicDistributedZk2Test, OutputWriterTest, DebugComponentTest, IndexReaderFactoryTest, SuggesterTSTTest, TestFunctionQuery, TestArbitraryIndexDir, UpdateParamsTest, TestPhraseSuggestions, EchoParamsTest, ScriptEngineTest, TestReversedWildcardFilterFactory, SoftAutoCommitTest, TestHashPartitioner, FieldMutatingUpdateProcessorTest, SyncSliceTest]
[junit4:junit4] Completed on J1 in 165.00s, 1 test, 1 failure <<< FAILURES!

[...truncated 387 lines...]
BUILD FAILED
/usr/home/hudson/hudson-slave/workspace/Lucene-Solr-NightlyTests-trunk/build.xml:29: The following error occurred while executing this line:
/usr/home/hudson/hudson-slave/workspace/Lucene-Solr-NightlyTests-trunk/solr/build.xml:146: The following error occurred while executing this line:
/usr/home/hudson/hudson-slave/workspace/Lucene-Solr-NightlyTests-trunk/lucene/module-build.xml:63: The following error occurred while executing this line:
/usr/home/hudson/hudson-slave/workspace/Lucene-Solr-NightlyTests-trunk/lucene/common-build.xml:1133: The following error occurred while executing this line:
/usr/home/hudson/hudson-slave/workspace/Lucene-Solr-NightlyTests-trunk/lucene/common-build.xml:810: There were test failures: 228 suites, 923 tests, 1 error, 1 failure, 6 ignored (1 assumption)

Total time: 78 minutes 33 seconds
Build step 'Invoke Ant' marked build as failure
Recording test results
Email was triggered for: Failure
Sending email for trigger: Failure



Mime
View raw message