lucene-dev mailing list archives

Site index · List index
Message view « Date » · « Thread »
Top « Date » · « Thread »
From Policeman Jenkins Server <jenk...@sd-datasolutions.de>
Subject [JENKINS] Lucene-Solr-trunk-Linux (64bit/jdk1.8.0-ea-b51) - Build # 1120 - Still Failing!
Date Sat, 15 Sep 2012 00:07:07 GMT
Build: http://jenkins.sd-datasolutions.de/job/Lucene-Solr-trunk-Linux/1120/
Java: 64bit/jdk1.8.0-ea-b51 -XX:+UseG1GC

1 tests failed.
FAILED:  org.apache.solr.update.SolrCmdDistributorTest.testDistribSearch

Error Message:
Task java.util.concurrent.ExecutorCompletionService$QueueingFuture@1856cce5 rejected from java.util.concurrent.ThreadPoolExecutor@6aa5dade[Running, pool size = 80, active threads = 80, queued tasks = 0, completed tasks = 13]

Stack Trace:
java.util.concurrent.RejectedExecutionException: Task java.util.concurrent.ExecutorCompletionService$QueueingFuture@1856cce5 rejected from java.util.concurrent.ThreadPoolExecutor@6aa5dade[Running, pool size = 80, active threads = 80, queued tasks = 0, completed tasks = 13]
	at __randomizedtesting.SeedInfo.seed([8796F267651BB78C:6707C7F1244D7B0]:0)
	at java.util.concurrent.ThreadPoolExecutor$AbortPolicy.rejectedExecution(ThreadPoolExecutor.java:2015)
	at java.util.concurrent.ThreadPoolExecutor.reject(ThreadPoolExecutor.java:816)
	at java.util.concurrent.ThreadPoolExecutor.execute(ThreadPoolExecutor.java:1337)
	at java.util.concurrent.ExecutorCompletionService.submit(ExecutorCompletionService.java:181)
	at org.apache.solr.update.SolrCmdDistributor.submit(SolrCmdDistributor.java:356)
	at org.apache.solr.update.SolrCmdDistributor.submit(SolrCmdDistributor.java:301)
	at org.apache.solr.update.SolrCmdDistributor.flushAdds(SolrCmdDistributor.java:233)
	at org.apache.solr.update.SolrCmdDistributor.distribAdd(SolrCmdDistributor.java:147)
	at org.apache.solr.update.SolrCmdDistributorTest.doTest(SolrCmdDistributorTest.java:204)
	at org.apache.solr.BaseDistributedSearchTestCase.testDistribSearch(BaseDistributedSearchTestCase.java:691)
	at sun.reflect.NativeMethodAccessorImpl.invoke0(Native Method)
	at sun.reflect.NativeMethodAccessorImpl.invoke(NativeMethodAccessorImpl.java:57)
	at sun.reflect.DelegatingMethodAccessorImpl.invoke(DelegatingMethodAccessorImpl.java:43)
	at java.lang.reflect.Method.invoke(Method.java:474)
	at com.carrotsearch.randomizedtesting.RandomizedRunner.invoke(RandomizedRunner.java:1559)
	at com.carrotsearch.randomizedtesting.RandomizedRunner.access$600(RandomizedRunner.java:79)
	at com.carrotsearch.randomizedtesting.RandomizedRunner$6.evaluate(RandomizedRunner.java:737)
	at com.carrotsearch.randomizedtesting.RandomizedRunner$7.evaluate(RandomizedRunner.java:773)
	at com.carrotsearch.randomizedtesting.RandomizedRunner$8.evaluate(RandomizedRunner.java:787)
	at com.carrotsearch.randomizedtesting.rules.SystemPropertiesRestoreRule$1.evaluate(SystemPropertiesRestoreRule.java:53)
	at org.apache.lucene.util.TestRuleSetupTeardownChained$1.evaluate(TestRuleSetupTeardownChained.java:50)
	at org.apache.lucene.util.TestRuleFieldCacheSanity$1.evaluate(TestRuleFieldCacheSanity.java:51)
	at org.apache.lucene.util.AbstractBeforeAfterRule$1.evaluate(AbstractBeforeAfterRule.java:45)
	at com.carrotsearch.randomizedtesting.rules.SystemPropertiesInvariantRule$1.evaluate(SystemPropertiesInvariantRule.java:55)
	at org.apache.lucene.util.TestRuleThreadAndTestName$1.evaluate(TestRuleThreadAndTestName.java:48)
	at org.apache.lucene.util.TestRuleIgnoreAfterMaxFailures$1.evaluate(TestRuleIgnoreAfterMaxFailures.java:70)
	at org.apache.lucene.util.TestRuleMarkFailure$1.evaluate(TestRuleMarkFailure.java:48)
	at com.carrotsearch.randomizedtesting.rules.StatementAdapter.evaluate(StatementAdapter.java:36)
	at com.carrotsearch.randomizedtesting.ThreadLeakControl$StatementRunner.run(ThreadLeakControl.java:358)
	at com.carrotsearch.randomizedtesting.ThreadLeakControl.forkTimeoutingTask(ThreadLeakControl.java:782)
	at com.carrotsearch.randomizedtesting.ThreadLeakControl$3.evaluate(ThreadLeakControl.java:442)
	at com.carrotsearch.randomizedtesting.RandomizedRunner.runSingleTest(RandomizedRunner.java:746)
	at com.carrotsearch.randomizedtesting.RandomizedRunner$3.evaluate(RandomizedRunner.java:648)
	at com.carrotsearch.randomizedtesting.RandomizedRunner$4.evaluate(RandomizedRunner.java:682)
	at com.carrotsearch.randomizedtesting.RandomizedRunner$5.evaluate(RandomizedRunner.java:693)
	at com.carrotsearch.randomizedtesting.rules.StatementAdapter.evaluate(StatementAdapter.java:36)
	at com.carrotsearch.randomizedtesting.rules.SystemPropertiesRestoreRule$1.evaluate(SystemPropertiesRestoreRule.java:53)
	at org.apache.lucene.util.AbstractBeforeAfterRule$1.evaluate(AbstractBeforeAfterRule.java:45)
	at org.apache.lucene.util.TestRuleStoreClassName$1.evaluate(TestRuleStoreClassName.java:42)
	at com.carrotsearch.randomizedtesting.rules.SystemPropertiesInvariantRule$1.evaluate(SystemPropertiesInvariantRule.java:55)
	at com.carrotsearch.randomizedtesting.rules.NoShadowingOrOverridesOnMethodsRule$1.evaluate(NoShadowingOrOverridesOnMethodsRule.java:39)
	at com.carrotsearch.randomizedtesting.rules.NoShadowingOrOverridesOnMethodsRule$1.evaluate(NoShadowingOrOverridesOnMethodsRule.java:39)
	at com.carrotsearch.randomizedtesting.rules.StatementAdapter.evaluate(StatementAdapter.java:36)
	at org.apache.lucene.util.TestRuleAssertionsRequired$1.evaluate(TestRuleAssertionsRequired.java:43)
	at org.apache.lucene.util.TestRuleMarkFailure$1.evaluate(TestRuleMarkFailure.java:48)
	at org.apache.lucene.util.TestRuleIgnoreAfterMaxFailures$1.evaluate(TestRuleIgnoreAfterMaxFailures.java:70)
	at org.apache.lucene.util.TestRuleIgnoreTestSuites$1.evaluate(TestRuleIgnoreTestSuites.java:55)
	at com.carrotsearch.randomizedtesting.rules.StatementAdapter.evaluate(StatementAdapter.java:36)
	at com.carrotsearch.randomizedtesting.ThreadLeakControl$StatementRunner.run(ThreadLeakControl.java:358)
	at java.lang.Thread.run(Thread.java:722)




Build Log:
[...truncated 8253 lines...]
[junit4:junit4] Suite: org.apache.solr.update.SolrCmdDistributorTest
[junit4:junit4]   2> 2 T2079 oas.SolrTestCaseJ4.setUp ###Starting testDistribSearch
[junit4:junit4]   2> 3 T2079 oejs.Server.doStart jetty-8.1.2.v20120308
[junit4:junit4]   2> 5 T2079 oejs.AbstractConnector.doStart Started SocketConnector@0.0.0.0:58862
[junit4:junit4]   2> 6 T2079 oasc.SolrResourceLoader.locateSolrHome JNDI not configured for solr (NoInitialContextEx)
[junit4:junit4]   2> 7 T2079 oasc.SolrResourceLoader.locateSolrHome using system property solr.solr.home: /mnt/ssd/jenkins/workspace/Lucene-Solr-trunk-Linux/solr/build/solr-core/test-files/solr
[junit4:junit4]   2> 7 T2079 oasc.SolrResourceLoader.<init> new SolrResourceLoader for deduced Solr Home: '/mnt/ssd/jenkins/workspace/Lucene-Solr-trunk-Linux/solr/build/solr-core/test-files/solr/'
[junit4:junit4]   2> 20 T2079 oass.SolrDispatchFilter.init SolrDispatchFilter.init()
[junit4:junit4]   2> 20 T2079 oasc.SolrResourceLoader.locateSolrHome JNDI not configured for solr (NoInitialContextEx)
[junit4:junit4]   2> 21 T2079 oasc.SolrResourceLoader.locateSolrHome using system property solr.solr.home: /mnt/ssd/jenkins/workspace/Lucene-Solr-trunk-Linux/solr/build/solr-core/test-files/solr
[junit4:junit4]   2> 21 T2079 oasc.CoreContainer$Initializer.initialize looking for solr.xml: /mnt/ssd/jenkins/workspace/Lucene-Solr-trunk-Linux/solr/build/solr-core/test-files/solr/solr.xml
[junit4:junit4]   2> 21 T2079 oasc.CoreContainer.<init> New CoreContainer 291601915
[junit4:junit4]   2> 22 T2079 oasc.CoreContainer.load Loading CoreContainer using Solr Home: '/mnt/ssd/jenkins/workspace/Lucene-Solr-trunk-Linux/solr/build/solr-core/test-files/solr/'
[junit4:junit4]   2> 22 T2079 oasc.SolrResourceLoader.<init> new SolrResourceLoader for directory: '/mnt/ssd/jenkins/workspace/Lucene-Solr-trunk-Linux/solr/build/solr-core/test-files/solr/'
[junit4:junit4]   2> 46 T2079 oasc.CoreContainer.load Registering Log Listener
[junit4:junit4]   2> 56 T2079 oasc.CoreContainer.create Creating SolrCore 'collection1' using instanceDir: /mnt/ssd/jenkins/workspace/Lucene-Solr-trunk-Linux/solr/build/solr-core/test-files/solr/collection1
[junit4:junit4]   2> 57 T2079 oasc.SolrResourceLoader.<init> new SolrResourceLoader for directory: '/mnt/ssd/jenkins/workspace/Lucene-Solr-trunk-Linux/solr/build/solr-core/test-files/solr/collection1/'
[junit4:junit4]   2> 57 T2079 oasc.SolrResourceLoader.replaceClassLoader Adding 'file:/mnt/ssd/jenkins/workspace/Lucene-Solr-trunk-Linux/solr/build/solr-core/test-files/solr/collection1/lib/README' to classloader
[junit4:junit4]   2> 58 T2079 oasc.SolrResourceLoader.replaceClassLoader Adding 'file:/mnt/ssd/jenkins/workspace/Lucene-Solr-trunk-Linux/solr/build/solr-core/test-files/solr/collection1/lib/classes/' to classloader
[junit4:junit4]   2> 77 T2079 oasc.SolrConfig.<init> Using Lucene MatchVersion: LUCENE_50
[junit4:junit4]   2> 101 T2079 oasc.SolrConfig.<init> Loaded SolrConfig: solrconfig-tlog.xml
[junit4:junit4]   2> 102 T2079 oass.IndexSchema.readSchema Reading Solr Schema
[junit4:junit4]   2> 106 T2079 oass.IndexSchema.readSchema Schema name=test
[junit4:junit4]   2> 402 T2079 oass.OpenExchangeRatesOrgProvider.init Initialized with rates=open-exchange-rates.json, refreshInterval=1440.
[junit4:junit4]   2> 406 T2079 oass.IndexSchema.readSchema default search field in schema is text
[junit4:junit4]   2> 436 T2079 oass.IndexSchema.readSchema unique key field: id
[junit4:junit4]   2> 440 T2079 oass.FileExchangeRateProvider.reload Reloading exchange rates from file currency.xml
[junit4:junit4]   2> 442 T2079 oass.FileExchangeRateProvider.reload Reloading exchange rates from file currency.xml
[junit4:junit4]   2> 444 T2079 oass.OpenExchangeRatesOrgProvider.reload Reloading exchange rates from open-exchange-rates.json
[junit4:junit4]   2> 445 T2079 oass.OpenExchangeRatesOrgProvider.reload Reloading exchange rates from open-exchange-rates.json
[junit4:junit4]   2> 445 T2079 oasc.SolrCore.<init> [collection1] Opening new SolrCore at /mnt/ssd/jenkins/workspace/Lucene-Solr-trunk-Linux/solr/build/solr-core/test-files/solr/collection1/, dataDir=./org.apache.solr.update.SolrCmdDistributorTest-1347667407985/control/data/
[junit4:junit4]   2> 446 T2079 oasc.SolrCore.<init> JMX monitoring not detected for core: collection1
[junit4:junit4]   2> 446 T2079 oasc.SolrCore.getNewIndexDir WARNING New index directory detected: old=null new=./org.apache.solr.update.SolrCmdDistributorTest-1347667407985/control/data/index/
[junit4:junit4]   2> 447 T2079 oasc.SolrCore.initIndex WARNING [collection1] Solr index directory './org.apache.solr.update.SolrCmdDistributorTest-1347667407985/control/data/index' doesn't exist. Creating new index...
[junit4:junit4]   2> 447 T2079 oasc.CachingDirectoryFactory.get return new directory for /mnt/ssd/jenkins/workspace/Lucene-Solr-trunk-Linux/solr/build/solr-core/test/J1/./org.apache.solr.update.SolrCmdDistributorTest-1347667407985/control/data/index forceNew:false
[junit4:junit4]   2> 449 T2079 oasc.SolrDeletionPolicy.onCommit SolrDeletionPolicy.onCommit: commits:num=1
[junit4:junit4]   2> 		commit{dir=MockDirWrapper(org.apache.lucene.store.RAMDirectory@730e04da lockFactory=org.apache.lucene.store.NativeFSLockFactory@3aaa4640),segFN=segments_1,generation=1,filenames=[segments_1]
[junit4:junit4]   2> 449 T2079 oasc.SolrDeletionPolicy.updateCommits newest commit = 1
[junit4:junit4]   2> 450 T2079 oasc.RequestHandlers.initHandlersFromConfig created standard: solr.StandardRequestHandler
[junit4:junit4]   2> 450 T2079 oasc.RequestHandlers.initHandlersFromConfig created /get: solr.RealTimeGetHandler
[junit4:junit4]   2> 450 T2079 oasc.RequestHandlers.initHandlersFromConfig created /update: solr.UpdateRequestHandler
[junit4:junit4]   2> 451 T2079 oasc.RequestHandlers.initHandlersFromConfig created /admin/: org.apache.solr.handler.admin.AdminHandlers
[junit4:junit4]   2> 452 T2079 oashl.XMLLoader.init xsltCacheLifetimeSeconds=60
[junit4:junit4]   2> 454 T2079 oass.SolrIndexSearcher.<init> Opening Searcher@7aa46a8f main
[junit4:junit4]   2> 454 T2079 oass.SolrIndexSearcher.getIndexDir WARNING WARNING: Directory impl does not support setting indexDir: org.apache.lucene.store.MockDirectoryWrapper
[junit4:junit4]   2> 455 T2079 oasu.CommitTracker.<init> Hard AutoCommit: disabled
[junit4:junit4]   2> 455 T2079 oasu.CommitTracker.<init> Soft AutoCommit: disabled
[junit4:junit4]   2> 456 T2079 oashc.HttpShardHandlerFactory.getParameter Setting socketTimeout to: 0
[junit4:junit4]   2> 456 T2079 oashc.HttpShardHandlerFactory.getParameter Setting urlScheme to: http://
[junit4:junit4]   2> 456 T2079 oashc.HttpShardHandlerFactory.getParameter Setting connTimeout to: 0
[junit4:junit4]   2> 457 T2079 oashc.HttpShardHandlerFactory.getParameter Setting maxConnectionsPerHost to: 20
[junit4:junit4]   2> 457 T2079 oashc.HttpShardHandlerFactory.getParameter Setting corePoolSize to: 0
[junit4:junit4]   2> 457 T2079 oashc.HttpShardHandlerFactory.getParameter Setting maximumPoolSize to: 2147483647
[junit4:junit4]   2> 458 T2079 oashc.HttpShardHandlerFactory.getParameter Setting maxThreadIdleTime to: 5
[junit4:junit4]   2> 458 T2079 oashc.HttpShardHandlerFactory.getParameter Setting sizeOfQueue to: -1
[junit4:junit4]   2> 458 T2079 oashc.HttpShardHandlerFactory.getParameter Setting fairnessPolicy to: false
[junit4:junit4]   2> 459 T2079 oascsi.HttpClientUtil.createClient Creating new http client, config:maxConnectionsPerHost=20&maxConnections=10000&socketTimeout=0&connTimeout=0&retry=false
[junit4:junit4]   2> 462 T2089 oasc.SolrCore.registerSearcher [collection1] Registered new searcher Searcher@7aa46a8f main{StandardDirectoryReader(segments_1:1)}
[junit4:junit4]   2> 462 T2079 oasc.CoreContainer.register registering core: collection1
[junit4:junit4]   2> 463 T2079 oass.SolrDispatchFilter.init user.dir=/mnt/ssd/jenkins/workspace/Lucene-Solr-trunk-Linux/solr/build/solr-core/test/J1
[junit4:junit4]   2> 463 T2079 oass.SolrDispatchFilter.init SolrDispatchFilter.init() done
[junit4:junit4]   2> 463 T2079 oascsi.HttpClientUtil.createClient Creating new http client, config:maxConnections=128&maxConnectionsPerHost=32&followRedirects=false
[junit4:junit4]   2> 466 T2079 oejs.Server.doStart jetty-8.1.2.v20120308
[junit4:junit4]   2> 467 T2079 oejs.AbstractConnector.doStart Started SocketConnector@0.0.0.0:41914
[junit4:junit4]   2> 468 T2079 oasc.SolrResourceLoader.locateSolrHome JNDI not configured for solr (NoInitialContextEx)
[junit4:junit4]   2> 468 T2079 oasc.SolrResourceLoader.locateSolrHome using system property solr.solr.home: /mnt/ssd/jenkins/workspace/Lucene-Solr-trunk-Linux/solr/build/solr-core/test-files/solr
[junit4:junit4]   2> 469 T2079 oasc.SolrResourceLoader.<init> new SolrResourceLoader for deduced Solr Home: '/mnt/ssd/jenkins/workspace/Lucene-Solr-trunk-Linux/solr/build/solr-core/test-files/solr/'
[junit4:junit4]   2> 479 T2079 oass.SolrDispatchFilter.init SolrDispatchFilter.init()
[junit4:junit4]   2> 480 T2079 oasc.SolrResourceLoader.locateSolrHome JNDI not configured for solr (NoInitialContextEx)
[junit4:junit4]   2> 480 T2079 oasc.SolrResourceLoader.locateSolrHome using system property solr.solr.home: /mnt/ssd/jenkins/workspace/Lucene-Solr-trunk-Linux/solr/build/solr-core/test-files/solr
[junit4:junit4]   2> 480 T2079 oasc.CoreContainer$Initializer.initialize looking for solr.xml: /mnt/ssd/jenkins/workspace/Lucene-Solr-trunk-Linux/solr/build/solr-core/test-files/solr/solr.xml
[junit4:junit4]   2> 481 T2079 oasc.CoreContainer.<init> New CoreContainer 2110535116
[junit4:junit4]   2> 481 T2079 oasc.CoreContainer.load Loading CoreContainer using Solr Home: '/mnt/ssd/jenkins/workspace/Lucene-Solr-trunk-Linux/solr/build/solr-core/test-files/solr/'
[junit4:junit4]   2> 481 T2079 oasc.SolrResourceLoader.<init> new SolrResourceLoader for directory: '/mnt/ssd/jenkins/workspace/Lucene-Solr-trunk-Linux/solr/build/solr-core/test-files/solr/'
[junit4:junit4]   2> 492 T2079 oasc.CoreContainer.load Registering Log Listener
[junit4:junit4]   2> 502 T2079 oasc.CoreContainer.create Creating SolrCore 'collection1' using instanceDir: /mnt/ssd/jenkins/workspace/Lucene-Solr-trunk-Linux/solr/build/solr-core/test-files/solr/collection1
[junit4:junit4]   2> 502 T2079 oasc.SolrResourceLoader.<init> new SolrResourceLoader for directory: '/mnt/ssd/jenkins/workspace/Lucene-Solr-trunk-Linux/solr/build/solr-core/test-files/solr/collection1/'
[junit4:junit4]   2> 503 T2079 oasc.SolrResourceLoader.replaceClassLoader Adding 'file:/mnt/ssd/jenkins/workspace/Lucene-Solr-trunk-Linux/solr/build/solr-core/test-files/solr/collection1/lib/README' to classloader
[junit4:junit4]   2> 503 T2079 oasc.SolrResourceLoader.replaceClassLoader Adding 'file:/mnt/ssd/jenkins/workspace/Lucene-Solr-trunk-Linux/solr/build/solr-core/test-files/solr/collection1/lib/classes/' to classloader
[junit4:junit4]   2> 530 T2079 oasc.SolrConfig.<init> Using Lucene MatchVersion: LUCENE_50
[junit4:junit4]   2> 554 T2079 oasc.SolrConfig.<init> Loaded SolrConfig: solrconfig-tlog.xml
[junit4:junit4]   2> 555 T2079 oass.IndexSchema.readSchema Reading Solr Schema
[junit4:junit4]   2> 558 T2079 oass.IndexSchema.readSchema Schema name=test
[junit4:junit4]   2> 840 T2079 oass.OpenExchangeRatesOrgProvider.init Initialized with rates=open-exchange-rates.json, refreshInterval=1440.
[junit4:junit4]   2> 845 T2079 oass.IndexSchema.readSchema default search field in schema is text
[junit4:junit4]   2> 847 T2079 oass.IndexSchema.readSchema unique key field: id
[junit4:junit4]   2> 851 T2079 oass.FileExchangeRateProvider.reload Reloading exchange rates from file currency.xml
[junit4:junit4]   2> 854 T2079 oass.FileExchangeRateProvider.reload Reloading exchange rates from file currency.xml
[junit4:junit4]   2> 856 T2079 oass.OpenExchangeRatesOrgProvider.reload Reloading exchange rates from open-exchange-rates.json
[junit4:junit4]   2> 856 T2079 oass.OpenExchangeRatesOrgProvider.reload Reloading exchange rates from open-exchange-rates.json
[junit4:junit4]   2> 857 T2079 oasc.SolrCore.<init> [collection1] Opening new SolrCore at /mnt/ssd/jenkins/workspace/Lucene-Solr-trunk-Linux/solr/build/solr-core/test-files/solr/collection1/, dataDir=./org.apache.solr.update.SolrCmdDistributorTest-1347667407985/shard0/data/
[junit4:junit4]   2> 857 T2079 oasc.SolrCore.<init> JMX monitoring not detected for core: collection1
[junit4:junit4]   2> 858 T2079 oasc.SolrCore.getNewIndexDir WARNING New index directory detected: old=null new=./org.apache.solr.update.SolrCmdDistributorTest-1347667407985/shard0/data/index/
[junit4:junit4]   2> 858 T2079 oasc.SolrCore.initIndex WARNING [collection1] Solr index directory './org.apache.solr.update.SolrCmdDistributorTest-1347667407985/shard0/data/index' doesn't exist. Creating new index...
[junit4:junit4]   2> 859 T2079 oasc.CachingDirectoryFactory.get return new directory for /mnt/ssd/jenkins/workspace/Lucene-Solr-trunk-Linux/solr/build/solr-core/test/J1/./org.apache.solr.update.SolrCmdDistributorTest-1347667407985/shard0/data/index forceNew:false
[junit4:junit4]   2> 860 T2079 oasc.SolrDeletionPolicy.onCommit SolrDeletionPolicy.onCommit: commits:num=1
[junit4:junit4]   2> 		commit{dir=MockDirWrapper(org.apache.lucene.store.RAMDirectory@499000bb lockFactory=org.apache.lucene.store.NativeFSLockFactory@36ba2cc3),segFN=segments_1,generation=1,filenames=[segments_1]
[junit4:junit4]   2> 860 T2079 oasc.SolrDeletionPolicy.updateCommits newest commit = 1
[junit4:junit4]   2> 861 T2079 oasc.RequestHandlers.initHandlersFromConfig created standard: solr.StandardRequestHandler
[junit4:junit4]   2> 862 T2079 oasc.RequestHandlers.initHandlersFromConfig created /get: solr.RealTimeGetHandler
[junit4:junit4]   2> 862 T2079 oasc.RequestHandlers.initHandlersFromConfig created /update: solr.UpdateRequestHandler
[junit4:junit4]   2> 862 T2079 oasc.RequestHandlers.initHandlersFromConfig created /admin/: org.apache.solr.handler.admin.AdminHandlers
[junit4:junit4]   2> 863 T2079 oashl.XMLLoader.init xsltCacheLifetimeSeconds=60
[junit4:junit4]   2> 865 T2079 oass.SolrIndexSearcher.<init> Opening Searcher@2b648051 main
[junit4:junit4]   2> 866 T2079 oass.SolrIndexSearcher.getIndexDir WARNING WARNING: Directory impl does not support setting indexDir: org.apache.lucene.store.MockDirectoryWrapper
[junit4:junit4]   2> 866 T2079 oasu.CommitTracker.<init> Hard AutoCommit: disabled
[junit4:junit4]   2> 867 T2079 oasu.CommitTracker.<init> Soft AutoCommit: disabled
[junit4:junit4]   2> 867 T2079 oashc.HttpShardHandlerFactory.getParameter Setting socketTimeout to: 0
[junit4:junit4]   2> 867 T2079 oashc.HttpShardHandlerFactory.getParameter Setting urlScheme to: http://
[junit4:junit4]   2> 868 T2079 oashc.HttpShardHandlerFactory.getParameter Setting connTimeout to: 0
[junit4:junit4]   2> 868 T2079 oashc.HttpShardHandlerFactory.getParameter Setting maxConnectionsPerHost to: 20
[junit4:junit4]   2> 868 T2079 oashc.HttpShardHandlerFactory.getParameter Setting corePoolSize to: 0
[junit4:junit4]   2> 869 T2079 oashc.HttpShardHandlerFactory.getParameter Setting maximumPoolSize to: 2147483647
[junit4:junit4]   2> 869 T2079 oashc.HttpShardHandlerFactory.getParameter Setting maxThreadIdleTime to: 5
[junit4:junit4]   2> 869 T2079 oashc.HttpShardHandlerFactory.getParameter Setting sizeOfQueue to: -1
[junit4:junit4]   2> 870 T2079 oashc.HttpShardHandlerFactory.getParameter Setting fairnessPolicy to: false
[junit4:junit4]   2> 870 T2079 oascsi.HttpClientUtil.createClient Creating new http client, config:maxConnectionsPerHost=20&maxConnections=10000&socketTimeout=0&connTimeout=0&retry=false
[junit4:junit4]   2> 873 T2099 oasc.SolrCore.registerSearcher [collection1] Registered new searcher Searcher@2b648051 main{StandardDirectoryReader(segments_1:1)}
[junit4:junit4]   2> 873 T2079 oasc.CoreContainer.register registering core: collection1
[junit4:junit4]   2> 874 T2079 oass.SolrDispatchFilter.init user.dir=/mnt/ssd/jenkins/workspace/Lucene-Solr-trunk-Linux/solr/build/solr-core/test/J1
[junit4:junit4]   2> 874 T2079 oass.SolrDispatchFilter.init SolrDispatchFilter.init() done
[junit4:junit4]   2> 874 T2079 oascsi.HttpClientUtil.createClient Creating new http client, config:maxConnections=128&maxConnectionsPerHost=32&followRedirects=false
[junit4:junit4]   2> 877 T2079 oejs.Server.doStart jetty-8.1.2.v20120308
[junit4:junit4]   2> 878 T2079 oejs.AbstractConnector.doStart Started SocketConnector@0.0.0.0:38981
[junit4:junit4]   2> 879 T2079 oasc.SolrResourceLoader.locateSolrHome JNDI not configured for solr (NoInitialContextEx)
[junit4:junit4]   2> 880 T2079 oasc.SolrResourceLoader.locateSolrHome using system property solr.solr.home: /mnt/ssd/jenkins/workspace/Lucene-Solr-trunk-Linux/solr/build/solr-core/test-files/solr
[junit4:junit4]   2> 880 T2079 oasc.SolrResourceLoader.<init> new SolrResourceLoader for deduced Solr Home: '/mnt/ssd/jenkins/workspace/Lucene-Solr-trunk-Linux/solr/build/solr-core/test-files/solr/'
[junit4:junit4]   2> 890 T2079 oass.SolrDispatchFilter.init SolrDispatchFilter.init()
[junit4:junit4]   2> 891 T2079 oasc.SolrResourceLoader.locateSolrHome JNDI not configured for solr (NoInitialContextEx)
[junit4:junit4]   2> 891 T2079 oasc.SolrResourceLoader.locateSolrHome using system property solr.solr.home: /mnt/ssd/jenkins/workspace/Lucene-Solr-trunk-Linux/solr/build/solr-core/test-files/solr
[junit4:junit4]   2> 891 T2079 oasc.CoreContainer$Initializer.initialize looking for solr.xml: /mnt/ssd/jenkins/workspace/Lucene-Solr-trunk-Linux/solr/build/solr-core/test-files/solr/solr.xml
[junit4:junit4]   2> 892 T2079 oasc.CoreContainer.<init> New CoreContainer 38818148
[junit4:junit4]   2> 892 T2079 oasc.CoreContainer.load Loading CoreContainer using Solr Home: '/mnt/ssd/jenkins/workspace/Lucene-Solr-trunk-Linux/solr/build/solr-core/test-files/solr/'
[junit4:junit4]   2> 892 T2079 oasc.SolrResourceLoader.<init> new SolrResourceLoader for directory: '/mnt/ssd/jenkins/workspace/Lucene-Solr-trunk-Linux/solr/build/solr-core/test-files/solr/'
[junit4:junit4]   2> 904 T2079 oasc.CoreContainer.load Registering Log Listener
[junit4:junit4]   2> 913 T2079 oasc.CoreContainer.create Creating SolrCore 'collection1' using instanceDir: /mnt/ssd/jenkins/workspace/Lucene-Solr-trunk-Linux/solr/build/solr-core/test-files/solr/collection1
[junit4:junit4]   2> 914 T2079 oasc.SolrResourceLoader.<init> new SolrResourceLoader for directory: '/mnt/ssd/jenkins/workspace/Lucene-Solr-trunk-Linux/solr/build/solr-core/test-files/solr/collection1/'
[junit4:junit4]   2> 914 T2079 oasc.SolrResourceLoader.replaceClassLoader Adding 'file:/mnt/ssd/jenkins/workspace/Lucene-Solr-trunk-Linux/solr/build/solr-core/test-files/solr/collection1/lib/README' to classloader
[junit4:junit4]   2> 915 T2079 oasc.SolrResourceLoader.replaceClassLoader Adding 'file:/mnt/ssd/jenkins/workspace/Lucene-Solr-trunk-Linux/solr/build/solr-core/test-files/solr/collection1/lib/classes/' to classloader
[junit4:junit4]   2> 933 T2079 oasc.SolrConfig.<init> Using Lucene MatchVersion: LUCENE_50
[junit4:junit4]   2> 957 T2079 oasc.SolrConfig.<init> Loaded SolrConfig: solrconfig-tlog.xml
[junit4:junit4]   2> 958 T2079 oass.IndexSchema.readSchema Reading Solr Schema
[junit4:junit4]   2> 961 T2079 oass.IndexSchema.readSchema Schema name=test
[junit4:junit4]   2> 1283 T2079 oass.OpenExchangeRatesOrgProvider.init Initialized with rates=open-exchange-rates.json, refreshInterval=1440.
[junit4:junit4]   2> 1287 T2079 oass.IndexSchema.readSchema default search field in schema is text
[junit4:junit4]   2> 1290 T2079 oass.IndexSchema.readSchema unique key field: id
[junit4:junit4]   2> 1293 T2079 oass.FileExchangeRateProvider.reload Reloading exchange rates from file currency.xml
[junit4:junit4]   2> 1295 T2079 oass.FileExchangeRateProvider.reload Reloading exchange rates from file currency.xml
[junit4:junit4]   2> 1298 T2079 oass.OpenExchangeRatesOrgProvider.reload Reloading exchange rates from open-exchange-rates.json
[junit4:junit4]   2> 1298 T2079 oass.OpenExchangeRatesOrgProvider.reload Reloading exchange rates from open-exchange-rates.json
[junit4:junit4]   2> 1299 T2079 oasc.SolrCore.<init> [collection1] Opening new SolrCore at /mnt/ssd/jenkins/workspace/Lucene-Solr-trunk-Linux/solr/build/solr-core/test-files/solr/collection1/, dataDir=./org.apache.solr.update.SolrCmdDistributorTest-1347667407985/shard1/data/
[junit4:junit4]   2> 1299 T2079 oasc.SolrCore.<init> JMX monitoring not detected for core: collection1
[junit4:junit4]   2> 1299 T2079 oasc.SolrCore.getNewIndexDir WARNING New index directory detected: old=null new=./org.apache.solr.update.SolrCmdDistributorTest-1347667407985/shard1/data/index/
[junit4:junit4]   2> 1300 T2079 oasc.SolrCore.initIndex WARNING [collection1] Solr index directory './org.apache.solr.update.SolrCmdDistributorTest-1347667407985/shard1/data/index' doesn't exist. Creating new index...
[junit4:junit4]   2> 1301 T2079 oasc.CachingDirectoryFactory.get return new directory for /mnt/ssd/jenkins/workspace/Lucene-Solr-trunk-Linux/solr/build/solr-core/test/J1/./org.apache.solr.update.SolrCmdDistributorTest-1347667407985/shard1/data/index forceNew:false
[junit4:junit4]   2> 1302 T2079 oasc.SolrDeletionPolicy.onCommit SolrDeletionPolicy.onCommit: commits:num=1
[junit4:junit4]   2> 		commit{dir=MockDirWrapper(org.apache.lucene.store.RAMDirectory@4785ab0d lockFactory=org.apache.lucene.store.NativeFSLockFactory@73dd6307),segFN=segments_1,generation=1,filenames=[segments_1]
[junit4:junit4]   2> 1302 T2079 oasc.SolrDeletionPolicy.updateCommits newest commit = 1
[junit4:junit4]   2> 1303 T2079 oasc.RequestHandlers.initHandlersFromConfig created standard: solr.StandardRequestHandler
[junit4:junit4]   2> 1303 T2079 oasc.RequestHandlers.initHandlersFromConfig created /get: solr.RealTimeGetHandler
[junit4:junit4]   2> 1304 T2079 oasc.RequestHandlers.initHandlersFromConfig created /update: solr.UpdateRequestHandler
[junit4:junit4]   2> 1304 T2079 oasc.RequestHandlers.initHandlersFromConfig created /admin/: org.apache.solr.handler.admin.AdminHandlers
[junit4:junit4]   2> 1305 T2079 oashl.XMLLoader.init xsltCacheLifetimeSeconds=60
[junit4:junit4]   2> 1307 T2079 oass.SolrIndexSearcher.<init> Opening Searcher@11a79c61 main
[junit4:junit4]   2> 1307 T2079 oass.SolrIndexSearcher.getIndexDir WARNING WARNING: Directory impl does not support setting indexDir: org.apache.lucene.store.MockDirectoryWrapper
[junit4:junit4]   2> 1308 T2079 oasu.CommitTracker.<init> Hard AutoCommit: disabled
[junit4:junit4]   2> 1308 T2079 oasu.CommitTracker.<init> Soft AutoCommit: disabled
[junit4:junit4]   2> 1309 T2079 oashc.HttpShardHandlerFactory.getParameter Setting socketTimeout to: 0
[junit4:junit4]   2> 1309 T2079 oashc.HttpShardHandlerFactory.getParameter Setting urlScheme to: http://
[junit4:junit4]   2> 1310 T2079 oashc.HttpShardHandlerFactory.getParameter Setting connTimeout to: 0
[junit4:junit4]   2> 1310 T2079 oashc.HttpShardHandlerFactory.getParameter Setting maxConnectionsPerHost to: 20
[junit4:junit4]   2> 1310 T2079 oashc.HttpShardHandlerFactory.getParameter Setting corePoolSize to: 0
[junit4:junit4]   2> 1310 T2079 oashc.HttpShardHandlerFactory.getParameter Setting maximumPoolSize to: 2147483647
[junit4:junit4]   2> 1311 T2079 oashc.HttpShardHandlerFactory.getParameter Setting maxThreadIdleTime to: 5
[junit4:junit4]   2> 1311 T2079 oashc.HttpShardHandlerFactory.getParameter Setting sizeOfQueue to: -1
[junit4:junit4]   2> 1311 T2079 oashc.HttpShardHandlerFactory.getParameter Setting fairnessPolicy to: false
[junit4:junit4]   2> 1312 T2079 oascsi.HttpClientUtil.createClient Creating new http client, config:maxConnectionsPerHost=20&maxConnections=10000&socketTimeout=0&connTimeout=0&retry=false
[junit4:junit4]   2> 1315 T2109 oasc.SolrCore.registerSearcher [collection1] Registered new searcher Searcher@11a79c61 main{StandardDirectoryReader(segments_1:1)}
[junit4:junit4]   2> 1315 T2079 oasc.CoreContainer.register registering core: collection1
[junit4:junit4]   2> 1315 T2079 oass.SolrDispatchFilter.init user.dir=/mnt/ssd/jenkins/workspace/Lucene-Solr-trunk-Linux/solr/build/solr-core/test/J1
[junit4:junit4]   2> 1315 T2079 oass.SolrDispatchFilter.init SolrDispatchFilter.init() done
[junit4:junit4]   2> 1316 T2079 oascsi.HttpClientUtil.createClient Creating new http client, config:maxConnections=128&maxConnectionsPerHost=32&followRedirects=false
[junit4:junit4]   2> 1318 T2079 oejs.Server.doStart jetty-8.1.2.v20120308
[junit4:junit4]   2> 1319 T2079 oejs.AbstractConnector.doStart Started SocketConnector@0.0.0.0:35996
[junit4:junit4]   2> 1320 T2079 oasc.SolrResourceLoader.locateSolrHome JNDI not configured for solr (NoInitialContextEx)
[junit4:junit4]   2> 1321 T2079 oasc.SolrResourceLoader.locateSolrHome using system property solr.solr.home: /mnt/ssd/jenkins/workspace/Lucene-Solr-trunk-Linux/solr/build/solr-core/test-files/solr
[junit4:junit4]   2> 1321 T2079 oasc.SolrResourceLoader.<init> new SolrResourceLoader for deduced Solr Home: '/mnt/ssd/jenkins/workspace/Lucene-Solr-trunk-Linux/solr/build/solr-core/test-files/solr/'
[junit4:junit4]   2> 1331 T2079 oass.SolrDispatchFilter.init SolrDispatchFilter.init()
[junit4:junit4]   2> 1332 T2079 oasc.SolrResourceLoader.locateSolrHome JNDI not configured for solr (NoInitialContextEx)
[junit4:junit4]   2> 1332 T2079 oasc.SolrResourceLoader.locateSolrHome using system property solr.solr.home: /mnt/ssd/jenkins/workspace/Lucene-Solr-trunk-Linux/solr/build/solr-core/test-files/solr
[junit4:junit4]   2> 1332 T2079 oasc.CoreContainer$Initializer.initialize looking for solr.xml: /mnt/ssd/jenkins/workspace/Lucene-Solr-trunk-Linux/solr/build/solr-core/test-files/solr/solr.xml
[junit4:junit4]   2> 1333 T2079 oasc.CoreContainer.<init> New CoreContainer 871073029
[junit4:junit4]   2> 1333 T2079 oasc.CoreContainer.load Loading CoreContainer using Solr Home: '/mnt/ssd/jenkins/workspace/Lucene-Solr-trunk-Linux/solr/build/solr-core/test-files/solr/'
[junit4:junit4]   2> 1333 T2079 oasc.SolrResourceLoader.<init> new SolrResourceLoader for directory: '/mnt/ssd/jenkins/workspace/Lucene-Solr-trunk-Linux/solr/build/solr-core/test-files/solr/'
[junit4:junit4]   2> 1344 T2079 oasc.CoreContainer.load Registering Log Listener
[junit4:junit4]   2> 1353 T2079 oasc.CoreContainer.create Creating SolrCore 'collection1' using instanceDir: /mnt/ssd/jenkins/workspace/Lucene-Solr-trunk-Linux/solr/build/solr-core/test-files/solr/collection1
[junit4:junit4]   2> 1354 T2079 oasc.SolrResourceLoader.<init> new SolrResourceLoader for directory: '/mnt/ssd/jenkins/workspace/Lucene-Solr-trunk-Linux/solr/build/solr-core/test-files/solr/collection1/'
[junit4:junit4]   2> 1355 T2079 oasc.SolrResourceLoader.replaceClassLoader Adding 'file:/mnt/ssd/jenkins/workspace/Lucene-Solr-trunk-Linux/solr/build/solr-core/test-files/solr/collection1/lib/README' to classloader
[junit4:junit4]   2> 1355 T2079 oasc.SolrResourceLoader.replaceClassLoader Adding 'file:/mnt/ssd/jenkins/workspace/Lucene-Solr-trunk-Linux/solr/build/solr-core/test-files/solr/collection1/lib/classes/' to classloader
[junit4:junit4]   2> 1373 T2079 oasc.SolrConfig.<init> Using Lucene MatchVersion: LUCENE_50
[junit4:junit4]   2> 1397 T2079 oasc.SolrConfig.<init> Loaded SolrConfig: solrconfig-tlog.xml
[junit4:junit4]   2> 1398 T2079 oass.IndexSchema.readSchema Reading Solr Schema
[junit4:junit4]   2> 1401 T2079 oass.IndexSchema.readSchema Schema name=test
[junit4:junit4]   2> 1703 T2079 oass.OpenExchangeRatesOrgProvider.init Initialized with rates=open-exchange-rates.json, refreshInterval=1440.
[junit4:junit4]   2> 1708 T2079 oass.IndexSchema.readSchema default search field in schema is text
[junit4:junit4]   2> 1710 T2079 oass.IndexSchema.readSchema unique key field: id
[junit4:junit4]   2> 1713 T2079 oass.FileExchangeRateProvider.reload Reloading exchange rates from file currency.xml
[junit4:junit4]   2> 1716 T2079 oass.FileExchangeRateProvider.reload Reloading exchange rates from file currency.xml
[junit4:junit4]   2> 1718 T2079 oass.OpenExchangeRatesOrgProvider.reload Reloading exchange rates from open-exchange-rates.json
[junit4:junit4]   2> 1718 T2079 oass.OpenExchangeRatesOrgProvider.reload Reloading exchange rates from open-exchange-rates.json
[junit4:junit4]   2> 1719 T2079 oasc.SolrCore.<init> [collection1] Opening new SolrCore at /mnt/ssd/jenkins/workspace/Lucene-Solr-trunk-Linux/solr/build/solr-core/test-files/solr/collection1/, dataDir=./org.apache.solr.update.SolrCmdDistributorTest-1347667407985/shard2/data/
[junit4:junit4]   2> 1719 T2079 oasc.SolrCore.<init> JMX monitoring not detected for core: collection1
[junit4:junit4]   2> 1720 T2079 oasc.SolrCore.getNewIndexDir WARNING New index directory detected: old=null new=./org.apache.solr.update.SolrCmdDistributorTest-1347667407985/shard2/data/index/
[junit4:junit4]   2> 1720 T2079 oasc.SolrCore.initIndex WARNING [collection1] Solr index directory './org.apache.solr.update.SolrCmdDistributorTest-1347667407985/shard2/data/index' doesn't exist. Creating new index...
[junit4:junit4]   2> 1721 T2079 oasc.CachingDirectoryFactory.get return new directory for /mnt/ssd/jenkins/workspace/Lucene-Solr-trunk-Linux/solr/build/solr-core/test/J1/./org.apache.solr.update.SolrCmdDistributorTest-1347667407985/shard2/data/index forceNew:false
[junit4:junit4]   2> 1723 T2079 oasc.SolrDeletionPolicy.onCommit SolrDeletionPolicy.onCommit: commits:num=1
[junit4:junit4]   2> 		commit{dir=MockDirWrapper(org.apache.lucene.store.MMapDirectory@/mnt/ssd/jenkins/workspace/Lucene-Solr-trunk-Linux/solr/build/solr-core/test/J1/index3155431564tmp lockFactory=org.apache.lucene.store.NativeFSLockFactory@4288f76f),segFN=segments_1,generation=1,filenames=[segments_1]
[junit4:junit4]   2> 1723 T2079 oasc.SolrDeletionPolicy.updateCommits newest commit = 1
[junit4:junit4]   2> 1724 T2079 oasc.RequestHandlers.initHandlersFromConfig created standard: solr.StandardRequestHandler
[junit4:junit4]   2> 1725 T2079 oasc.RequestHandlers.initHandlersFromConfig created /get: solr.RealTimeGetHandler
[junit4:junit4]   2> 1725 T2079 oasc.RequestHandlers.initHandlersFromConfig created /update: solr.UpdateRequestHandler
[junit4:junit4]   2> 1725 T2079 oasc.RequestHandlers.initHandlersFromConfig created /admin/: org.apache.solr.handler.admin.AdminHandlers
[junit4:junit4]   2> 1726 T2079 oashl.XMLLoader.init xsltCacheLifetimeSeconds=60
[junit4:junit4]   2> 1729 T2079 oass.SolrIndexSearcher.<init> Opening Searcher@5e748ad5 main
[junit4:junit4]   2> 1729 T2079 oass.SolrIndexSearcher.getIndexDir WARNING WARNING: Directory impl does not support setting indexDir: org.apache.lucene.store.MockDirectoryWrapper
[junit4:junit4]   2> 1730 T2079 oasu.CommitTracker.<init> Hard AutoCommit: disabled
[junit4:junit4]   2> 1730 T2079 oasu.CommitTracker.<init> Soft AutoCommit: disabled
[junit4:junit4]   2> 1731 T2079 oashc.HttpShardHandlerFactory.getParameter Setting socketTimeout to: 0
[junit4:junit4]   2> 1731 T2079 oashc.HttpShardHandlerFactory.getParameter Setting urlScheme to: http://
[junit4:junit4]   2> 1731 T2079 oashc.HttpShardHandlerFactory.getParameter Setting connTimeout to: 0
[junit4:junit4]   2> 1732 T2079 oashc.HttpShardHandlerFactory.getParameter Setting maxConnectionsPerHost to: 20
[junit4:junit4]   2> 1732 T2079 oashc.HttpShardHandlerFactory.getParameter Setting corePoolSize to: 0
[junit4:junit4]   2> 1732 T2079 oashc.HttpShardHandlerFactory.getParameter Setting maximumPoolSize to: 2147483647
[junit4:junit4]   2> 1733 T2079 oashc.HttpShardHandlerFactory.getParameter Setting maxThreadIdleTime to: 5
[junit4:junit4]   2> 1733 T2079 oashc.HttpShardHandlerFactory.getParameter Setting sizeOfQueue to: -1
[junit4:junit4]   2> 1733 T2079 oashc.HttpShardHandlerFactory.getParameter Setting fairnessPolicy to: false
[junit4:junit4]   2> 1734 T2079 oascsi.HttpClientUtil.createClient Creating new http client, config:maxConnectionsPerHost=20&maxConnections=10000&socketTimeout=0&connTimeout=0&retry=false
[junit4:junit4]   2> 1737 T2119 oasc.SolrCore.registerSearcher [collection1] Registered new searcher Searcher@5e748ad5 main{StandardDirectoryReader(segments_1:1)}
[junit4:junit4]   2> 1737 T2079 oasc.CoreContainer.register registering core: collection1
[junit4:junit4]   2> 1737 T2079 oass.SolrDispatchFilter.init user.dir=/mnt/ssd/jenkins/workspace/Lucene-Solr-trunk-Linux/solr/build/solr-core/test/J1
[junit4:junit4]   2> 1738 T2079 oass.SolrDispatchFilter.init SolrDispatchFilter.init() done
[junit4:junit4]   2> 1738 T2079 oascsi.HttpClientUtil.createClient Creating new http client, config:maxConnections=128&maxConnectionsPerHost=32&followRedirects=false
[junit4:junit4]   2> 1740 T2079 oejs.Server.doStart jetty-8.1.2.v20120308
[junit4:junit4]   2> 1743 T2079 oejs.AbstractConnector.doStart Started SocketConnector@0.0.0.0:47349
[junit4:junit4]   2> 1744 T2079 oasc.SolrResourceLoader.locateSolrHome JNDI not configured for solr (NoInitialContextEx)
[junit4:junit4]   2> 1744 T2079 oasc.SolrResourceLoader.locateSolrHome using system property solr.solr.home: /mnt/ssd/jenkins/workspace/Lucene-Solr-trunk-Linux/solr/build/solr-core/test-files/solr
[junit4:junit4]   2> 1745 T2079 oasc.SolrResourceLoader.<init> new SolrResourceLoader for deduced Solr Home: '/mnt/ssd/jenkins/workspace/Lucene-Solr-trunk-Linux/solr/build/solr-core/test-files/solr/'
[junit4:junit4]   2> 1757 T2079 oass.SolrDispatchFilter.init SolrDispatchFilter.init()
[junit4:junit4]   2> 1758 T2079 oasc.SolrResourceLoader.locateSolrHome JNDI not configured for solr (NoInitialContextEx)
[junit4:junit4]   2> 1758 T2079 oasc.SolrResourceLoader.locateSolrHome using system property solr.solr.home: /mnt/ssd/jenkins/workspace/Lucene-Solr-trunk-Linux/solr/build/solr-core/test-files/solr
[junit4:junit4]   2> 1758 T2079 oasc.CoreContainer$Initializer.initialize looking for solr.xml: /mnt/ssd/jenkins/workspace/Lucene-Solr-trunk-Linux/solr/build/solr-core/test-files/solr/solr.xml
[junit4:junit4]   2> 1759 T2079 oasc.CoreContainer.<init> New CoreContainer 2138749496
[junit4:junit4]   2> 1759 T2079 oasc.CoreContainer.load Loading CoreContainer using Solr Home: '/mnt/ssd/jenkins/workspace/Lucene-Solr-trunk-Linux/solr/build/solr-core/test-files/solr/'
[junit4:junit4]   2> 1759 T2079 oasc.SolrResourceLoader.<init> new SolrResourceLoader for directory: '/mnt/ssd/jenkins/workspace/Lucene-Solr-trunk-Linux/solr/build/solr-core/test-files/solr/'
[junit4:junit4]   2> 1771 T2079 oasc.CoreContainer.load Registering Log Listener
[junit4:junit4]   2> 1780 T2079 oasc.CoreContainer.create Creating SolrCore 'collection1' using instanceDir: /mnt/ssd/jenkins/workspace/Lucene-Solr-trunk-Linux/solr/build/solr-core/test-files/solr/collection1
[junit4:junit4]   2> 1781 T2079 oasc.SolrResourceLoader.<init> new SolrResourceLoader for directory: '/mnt/ssd/jenkins/workspace/Lucene-Solr-trunk-Linux/solr/build/solr-core/test-files/solr/collection1/'
[junit4:junit4]   2> 1781 T2079 oasc.SolrResourceLoader.replaceClassLoader Adding 'file:/mnt/ssd/jenkins/workspace/Lucene-Solr-trunk-Linux/solr/build/solr-core/test-files/solr/collection1/lib/README' to classloader
[junit4:junit4]   2> 1782 T2079 oasc.SolrResourceLoader.replaceClassLoader Adding 'file:/mnt/ssd/jenkins/workspace/Lucene-Solr-trunk-Linux/solr/build/solr-core/test-files/solr/collection1/lib/classes/' to classloader
[junit4:junit4]   2> 1799 T2079 oasc.SolrConfig.<init> Using Lucene MatchVersion: LUCENE_50
[junit4:junit4]   2> 1823 T2079 oasc.SolrConfig.<init> Loaded SolrConfig: solrconfig-tlog.xml
[junit4:junit4]   2> 1823 T2079 oass.IndexSchema.readSchema Reading Solr Schema
[junit4:junit4]   2> 1827 T2079 oass.IndexSchema.readSchema Schema name=test
[junit4:junit4]   2> 2117 T2079 oass.OpenExchangeRatesOrgProvider.init Initialized with rates=open-exchange-rates.json, refreshInterval=1440.
[junit4:junit4]   2> 2122 T2079 oass.IndexSchema.readSchema default search field in schema is text
[junit4:junit4]   2> 2124 T2079 oass.IndexSchema.readSchema unique key field: id
[junit4:junit4]   2> 2128 T2079 oass.FileExchangeRateProvider.reload Reloading exchange rates from file currency.xml
[junit4:junit4]   2> 2130 T2079 oass.FileExchangeRateProvider.reload Reloading exchange rates from file currency.xml
[junit4:junit4]   2> 2132 T2079 oass.OpenExchangeRatesOrgProvider.reload Reloading exchange rates from open-exchange-rates.json
[junit4:junit4]   2> 2133 T2079 oass.OpenExchangeRatesOrgProvider.reload Reloading exchange rates from open-exchange-rates.json
[junit4:junit4]   2> 2133 T2079 oasc.SolrCore.<init> [collection1] Opening new SolrCore at /mnt/ssd/jenkins/workspace/Lucene-Solr-trunk-Linux/solr/build/solr-core/test-files/solr/collection1/, dataDir=./org.apache.solr.update.SolrCmdDistributorTest-1347667407985/shard3/data/
[junit4:junit4]   2> 2134 T2079 oasc.SolrCore.<init> JMX monitoring not detected for core: collection1
[junit4:junit4]   2> 2134 T2079 oasc.SolrCore.getNewIndexDir WARNING New index directory detected: old=null new=./org.apache.solr.update.SolrCmdDistributorTest-1347667407985/shard3/data/index/
[junit4:junit4]   2> 2135 T2079 oasc.SolrCore.initIndex WARNING [collection1] Solr index directory './org.apache.solr.update.SolrCmdDistributorTest-1347667407985/shard3/data/index' doesn't exist. Creating new index...
[junit4:junit4]   2> 2135 T2079 oasc.CachingDirectoryFactory.get return new directory for /mnt/ssd/jenkins/workspace/Lucene-Solr-trunk-Linux/solr/build/solr-core/test/J1/./org.apache.solr.update.SolrCmdDistributorTest-1347667407985/shard3/data/index forceNew:false
[junit4:junit4]   2> 2136 T2079 oasc.SolrDeletionPolicy.onCommit SolrDeletionPolicy.onCommit: commits:num=1
[junit4:junit4]   2> 		commit{dir=MockDirWrapper(org.apache.lucene.store.RAMDirectory@343b3df1 lockFactory=org.apache.lucene.store.NativeFSLockFactory@7622bcb7),segFN=segments_1,generation=1,filenames=[segments_1]
[junit4:junit4]   2> 2137 T2079 oasc.SolrDeletionPolicy.updateCommits newest commit = 1
[junit4:junit4]   2> 2138 T2079 oasc.RequestHandlers.initHandlersFromConfig created standard: solr.StandardRequestHandler
[junit4:junit4]   2> 2138 T2079 oasc.RequestHandlers.initHandlersFromConfig created /get: solr.RealTimeGetHandler
[junit4:junit4]   2> 2138 T2079 oasc.RequestHandlers.initHandlersFromConfig created /update: solr.UpdateRequestHandler
[junit4:junit4]   2> 2139 T2079 oasc.RequestHandlers.initHandlersFromConfig created /admin/: org.apache.solr.handler.admin.AdminHandlers
[junit4:junit4]   2> 2140 T2079 oashl.XMLLoader.init xsltCacheLifetimeSeconds=60
[junit4:junit4]   2> 2142 T2079 oass.SolrIndexSearcher.<init> Opening Searcher@7c4c3d2f main
[junit4:junit4]   2> 2142 T2079 oass.SolrIndexSearcher.getIndexDir WARNING WARNING: Directory impl does not support setting indexDir: org.apache.lucene.store.MockDirectoryWrapper
[junit4:junit4]   2> 2143 T2079 oasu.CommitTracker.<init> Hard AutoCommit: disabled
[junit4:junit4]   2> 2143 T2079 oasu.CommitTracker.<init> Soft AutoCommit: disabled
[junit4:junit4]   2> 2144 T2079 oashc.HttpShardHandlerFactory.getParameter Setting socketTimeout to: 0
[junit4:junit4]   2> 2144 T2079 oashc.HttpShardHandlerFactory.getParameter Setting urlScheme to: http://
[junit4:junit4]   2> 2144 T2079 oashc.HttpShardHandlerFactory.getParameter Setting connTimeout to: 0
[junit4:junit4]   2> 2145 T2079 oashc.HttpShardHandlerFactory.getParameter Setting maxConnectionsPerHost to: 20
[junit4:junit4]   2> 2145 T2079 oashc.HttpShardHandlerFactory.getParameter Setting corePoolSize to: 0
[junit4:junit4]   2> 2145 T2079 oashc.HttpShardHandlerFactory.getParameter Setting maximumPoolSize to: 2147483647
[junit4:junit4]   2> 2146 T2079 oashc.HttpShardHandlerFactory.getParameter Setting maxThreadIdleTime to: 5
[junit4:junit4]   2> 2146 T2079 oashc.HttpShardHandlerFactory.getParameter Setting sizeOfQueue to: -1
[junit4:junit4]   2> 2147 T2079 oashc.HttpShardHandlerFactory.getParameter Setting fairnessPolicy to: false
[junit4:junit4]   2> 2147 T2079 oascsi.HttpClientUtil.createClient Creating new http client, config:maxConnectionsPerHost=20&maxConnections=10000&socketTimeout=0&connTimeout=0&retry=false
[junit4:junit4]   2> 2152 T2129 oasc.SolrCore.registerSearcher [collection1] Registered new searcher Searcher@7c4c3d2f main{StandardDirectoryReader(segments_1:1)}
[junit4:junit4]   2> 2152 T2079 oasc.CoreContainer.register registering core: collection1
[junit4:junit4]   2> 2152 T2079 oass.SolrDispatchFilter.init user.dir=/mnt/ssd/jenkins/workspace/Lucene-Solr-trunk-Linux/solr/build/solr-core/test/J1
[junit4:junit4]   2> 2153 T2079 oass.SolrDispatchFilter.init SolrDispatchFilter.init() done
[junit4:junit4]   2> 2153 T2079 oascsi.HttpClientUtil.createClient Creating new http client, config:maxConnections=128&maxConnectionsPerHost=32&followRedirects=false
[junit4:junit4]   2> ASYNC  NEW_CORE C136 name=collection1 org.apache.solr.core.SolrCore@245c4adc
[junit4:junit4]   2> 2161 T2082 C136 oasc.SolrDeletionPolicy.onInit SolrDeletionPolicy.onInit: commits:num=1
[junit4:junit4]   2> 		commit{dir=MockDirWrapper(org.apache.lucene.store.RAMDirectory@730e04da lockFactory=org.apache.lucene.store.NativeFSLockFactory@3aaa4640),segFN=segments_1,generation=1,filenames=[segments_1]
[junit4:junit4]   2> 2162 T2082 C136 oasc.SolrDeletionPolicy.updateCommits newest commit = 1
[junit4:junit4]   2> 2163 T2082 C136 oass.SolrIndexSearcher.<init> Opening Searcher@3cd671b9 realtime
[junit4:junit4]   2> 2164 T2082 C136 oass.SolrIndexSearcher.getIndexDir WARNING WARNING: Directory impl does not support setting indexDir: org.apache.lucene.store.MockDirectoryWrapper
[junit4:junit4]   2> 2168 T2082 C136 UPDATE [collection1] webapp=/solr path=/update params={version=2&wt=javabin} {deleteByQuery=*:* (-1413131702258106368)} 0 8
[junit4:junit4]   2> ASYNC  NEW_CORE C137 name=collection1 org.apache.solr.core.SolrCore@22aee5e2
[junit4:junit4]   2> 2173 T2092 C137 oasc.SolrDeletionPolicy.onInit SolrDeletionPolicy.onInit: commits:num=1
[junit4:junit4]   2> 		commit{dir=MockDirWrapper(org.apache.lucene.store.RAMDirectory@499000bb lockFactory=org.apache.lucene.store.NativeFSLockFactory@36ba2cc3),segFN=segments_1,generation=1,filenames=[segments_1]
[junit4:junit4]   2> 2174 T2092 C137 oasc.SolrDeletionPolicy.updateCommits newest commit = 1
[junit4:junit4]   2> 2175 T2092 C137 oass.SolrIndexSearcher.<init> Opening Searcher@1bc96244 realtime
[junit4:junit4]   2> 2175 T2092 C137 oass.SolrIndexSearcher.getIndexDir WARNING WARNING: Directory impl does not support setting indexDir: org.apache.lucene.store.MockDirectoryWrapper
[junit4:junit4]   2> 2178 T2092 C137 UPDATE [collection1] webapp=/solr path=/update params={version=2&wt=javabin} {deleteByQuery=*:* (-1413131702270689280)} 0 6
[junit4:junit4]   2> ASYNC  NEW_CORE C138 name=collection1 org.apache.solr.core.SolrCore@437fffe7
[junit4:junit4]   2> 2183 T2102 C138 oasc.SolrDeletionPolicy.onInit SolrDeletionPolicy.onInit: commits:num=1
[junit4:junit4]   2> 		commit{dir=MockDirWrapper(org.apache.lucene.store.RAMDirectory@4785ab0d lockFactory=org.apache.lucene.store.NativeFSLockFactory@73dd6307),segFN=segments_1,generation=1,filenames=[segments_1]
[junit4:junit4]   2> 2184 T2102 C138 oasc.SolrDeletionPolicy.updateCommits newest commit = 1
[junit4:junit4]   2> 2185 T2102 C138 oass.SolrIndexSearcher.<init> Opening Searcher@41108ceb realtime
[junit4:junit4]   2> 2185 T2102 C138 oass.SolrIndexSearcher.getIndexDir WARNING WARNING: Directory impl does not support setting indexDir: org.apache.lucene.store.MockDirectoryWrapper
[junit4:junit4]   2> 2186 T2102 C138 UPDATE [collection1] webapp=/solr path=/update params={version=2&wt=javabin} {deleteByQuery=*:* (-1413131702281175040)} 0 4
[junit4:junit4]   2> ASYNC  NEW_CORE C139 name=collection1 org.apache.solr.core.SolrCore@6f677a2
[junit4:junit4]   2> 2191 T2112 C139 oasc.SolrDeletionPolicy.onInit SolrDeletionPolicy.onInit: commits:num=1
[junit4:junit4]   2> 		commit{dir=MockDirWrapper(org.apache.lucene.store.MMapDirectory@/mnt/ssd/jenkins/workspace/Lucene-Solr-trunk-Linux/solr/build/solr-core/test/J1/index3155431564tmp lockFactory=org.apache.lucene.store.NativeFSLockFactory@4288f76f),segFN=segments_1,generation=1,filenames=[segments_1]
[junit4:junit4]   2> 2191 T2112 C139 oasc.SolrDeletionPolicy.updateCommits newest commit = 1
[junit4:junit4]   2> 2192 T2112 C139 oass.SolrIndexSearcher.<init> Opening Searcher@75258d63 realtime
[junit4:junit4]   2> 2192 T2112 C139 oass.SolrIndexSearcher.getIndexDir WARNING WARNING: Directory impl does not support setting indexDir: org.apache.lucene.store.MockDirectoryWrapper
[junit4:junit4]   2> 2193 T2112 C139 UPDATE [collection1] webapp=/solr path=/update params={version=2&wt=javabin} {deleteByQuery=*:* (-1413131702288515072)} 0 4
[junit4:junit4]   2> ASYNC  NEW_CORE C140 name=collection1 org.apache.solr.core.SolrCore@132d49e1
[junit4:junit4]   2> 2198 T2122 C140 oasc.SolrDeletionPolicy.onInit SolrDeletionPolicy.onInit: commits:num=1
[junit4:junit4]   2> 		commit{dir=MockDirWrapper(org.apache.lucene.store.RAMDirectory@343b3df1 lockFactory=org.apache.lucene.store.NativeFSLockFactory@7622bcb7),segFN=segments_1,generation=1,filenames=[segments_1]
[junit4:junit4]   2> 2199 T2122 C140 oasc.SolrDeletionPolicy.updateCommits newest commit = 1
[junit4:junit4]   2> 2200 T2122 C140 oass.SolrIndexSearcher.<init> Opening Searcher@7168365e realtime
[junit4:junit4]   2> 2200 T2122 C140 oass.SolrIndexSearcher.getIndexDir WARNING WARNING: Directory impl does not support setting indexDir: org.apache.lucene.store.MockDirectoryWrapper
[junit4:junit4]   2> 2200 T2122 C140 UPDATE [collection1] webapp=/solr path=/update params={version=2&wt=javabin} {deleteByQuery=*:* (-1413131702296903680)} 0 3
[junit4:junit4]   2> 2202 T2079 oasu.SolrCmdDistributor.distribCommit Distrib commit to:[StdNode: http://localhost:58862/solr/]
[junit4:junit4]   2> 2203 T2083 C136 oasu.DirectUpdateHandler2.commit start commit{flags=0,_version_=0,optimize=false,openSearcher=true,waitSearcher=true,expungeDeletes=false,softCommit=false}
[junit4:junit4]   2> 2204 T2083 C136 oass.SolrIndexSearcher.<init> Opening Searcher@2d6a0627 main
[junit4:junit4]   2> 2205 T2083 C136 oass.SolrIndexSearcher.getIndexDir WARNING WARNING: Directory impl does not support setting indexDir: org.apache.lucene.store.MockDirectoryWrapper
[junit4:junit4]   2> 2205 T2089 oasc.SolrCore.registerSearcher [collection1] Registered new searcher Searcher@2d6a0627 main{StandardDirectoryReader(segments_1:1:nrt)}
[junit4:junit4]   2> 2205 T2083 C136 oasu.DirectUpdateHandler2.commit end_commit_flush
[junit4:junit4]   2> 2205 T2083 C136 UPDATE [collection1] webapp=/solr path=/update params={waitSearcher=true&softCommit=false&expungeDeletes=false&version=2&commit=true&wt=javabin} {commit=} 0 2
[junit4:junit4]   2> 2209 T2083 C136 oasu.DirectUpdateHandler2.commit start commit{flags=0,_version_=0,optimize=false,openSearcher=true,waitSearcher=true,expungeDeletes=false,softCommit=false}
[junit4:junit4]   2> 2210 T2083 C136 oasc.SolrDeletionPolicy.onCommit SolrDeletionPolicy.onCommit: commits:num=2
[junit4:junit4]   2> 		commit{dir=MockDirWrapper(org.apache.lucene.store.RAMDirectory@730e04da lockFactory=org.apache.lucene.store.NativeFSLockFactory@3aaa4640),segFN=segments_1,generation=1,filenames=[segments_1]
[junit4:junit4]   2> 		commit{dir=MockDirWrapper(org.apache.lucene.store.RAMDirectory@730e04da lockFactory=org.apache.lucene.store.NativeFSLockFactory@3aaa4640),segFN=segments_2,generation=2,filenames=[_0.si, _0.fdx, _0_MockSep_0.tii, _0_MockSep_0.tib, _0_MockSep_0.frq, _0_MockSep_0.doc, _0_TestBloomFilteredLucene40Postings_0.tim, segments_2, _0_SimpleText_0.pst, _0_MockSep_0.skp, _0_TestBloomFilteredLucene40Postings_0.prx, _0_MockSep_0.pyl, _0.fnm, _0_TestBloomFilteredLucene40Postings_0.tip, _0_nrm.cfe, _0_TestBloomFilteredLucene40Postings_0.frq, _0_MockSep_0.pos, _0.fdt, _0_TestBloomFilteredLucene40Postings_0.blm, _0_nrm.cfs]
[junit4:junit4]   2> 2211 T2083 C136 oasc.SolrDeletionPolicy.updateCommits newest commit = 2
[junit4:junit4]   2> 2212 T2083 C136 oass.SolrIndexSearcher.<init> Opening Searcher@44bf45b1 main
[junit4:junit4]   2> 2212 T2083 C136 oass.SolrIndexSearcher.getIndexDir WARNING WARNING: Directory impl does not support setting indexDir: org.apache.lucene.store.MockDirectoryWrapper
[junit4:junit4]   2> 2213 T2089 oasc.SolrCore.registerSearcher [collection1] Registered new searcher Searcher@44bf45b1 main{StandardDirectoryReader(segments_2:3:nrt _0(5.0):C1)}
[junit4:junit4]   2> 2213 T2083 C136 oasu.DirectUpdateHandler2.commit end_commit_flush
[junit4:junit4]   2> 2213 T2083 C136 UPDATE [collection1] webapp=/solr path=/update params={waitSearcher=true&softCommit=false&expungeDeletes=false&version=2&wt=javabin&commit=true} {add=[1 (1413131702308438016)],commit=} 0 5
[junit4:junit4]   2> 2215 T2082 C136 REQ [collection1] webapp=/solr path=/select params={wt=javabin&version=2&q=*:*} hits=1 status=0 QTime=0 
[junit4:junit4]   2> 2216 T2079 oasu.SolrCmdDistributor.distribCommit Distrib commit to:[StdNode: http://localhost:58862/solr/, StdNode: http://localhost:41914/solr/]
[junit4:junit4]   2> 2217 T2094 C137 oasu.DirectUpdateHandler2.commit start commit{flags=0,_version_=0,optimize=false,openSearcher=true,waitSearcher=true,expungeDeletes=false,softCommit=false}
[junit4:junit4]   2> 2218 T2083 C136 oasu.DirectUpdateHandler2.commit start commit{flags=0,_version_=0,optimize=false,openSearcher=true,waitSearcher=true,expungeDeletes=false,softCommit=false}
[junit4:junit4]   2> 2219 T2094 C137 oass.SolrIndexSearcher.<init> Opening Searcher@2f48f967 main
[junit4:junit4]   2> 2219 T2083 C136 oass.SolrIndexSearcher.<init> Opening Searcher@7e8662ea main
[junit4:junit4]   2> 2219 T2094 C137 oass.SolrIndexSearcher.getIndexDir WARNING WARNING: Directory impl does not support setting indexDir: org.apache.lucene.store.MockDirectoryWrapper
[junit4:junit4]   2> 2219 T2083 C136 oass.SolrIndexSearcher.getIndexDir WARNING WARNING: Directory impl does not support setting indexDir: org.apache.lucene.store.MockDirectoryWrapper
[junit4:junit4]   2> 2219 T2099 oasc.SolrCore.registerSearcher [collection1] Registered new searcher Searcher@2f48f967 main{StandardDirectoryReader(segments_1:1:nrt)}
[junit4:junit4]   2> 2220 T2083 C136 oasu.DirectUpdateHandler2.commit end_commit_flush
[junit4:junit4]   2> 2219 T2094 C137 oasu.DirectUpdateHandler2.commit end_commit_flush
[junit4:junit4]   2> 2220 T2089 oasc.SolrCore.registerSearcher [collection1] Registered new searcher Searcher@7e8662ea main{StandardDirectoryReader(segments_2:3:nrt _0(5.0):C1)}
[junit4:junit4]   2> 2220 T2094 C137 UPDATE [collection1] webapp=/solr path=/update params={waitSearcher=true&softCommit=false&expungeDeletes=false&version=2&commit=true&wt=javabin} {commit=} 0 3
[junit4:junit4]   2> 2220 T2083 C136 UPDATE [collection1] webapp=/solr path=/update params={waitSearcher=true&softCommit=false&expungeDeletes=false&version=2&commit=true&wt=javabin} {commit=} 0 2
[junit4:junit4]   2> 2223 T2083 C136 oasu.DirectUpdateHandler2.commit start commit{flags=0,_version_=0,optimize=false,openSearcher=true,waitSearcher=true,expungeDeletes=false,softCommit=false}
[junit4:junit4]   2> 2223 T2094 C137 oasu.DirectUpdateHandler2.commit start commit{flags=0,_version_=0,optimize=false,openSearcher=true,waitSearcher=true,expungeDeletes=false,softCommit=false}
[junit4:junit4]   2> 2224 T2094 C137 oasc.SolrDeletionPolicy.onCommit SolrDeletionPolicy.onCommit: commits:num=2
[junit4:junit4]   2> 		commit{dir=MockDirWrapper(org.apache.lucene.store.RAMDirectory@499000bb lockFactory=org.apache.lucene.store.NativeFSLockFactory@36ba2cc3),segFN=segments_1,generation=1,filenames=[segments_1]
[junit4:junit4]   2> 		commit{dir=MockDirWrapper(org.apache.lucene.store.RAMDirectory@499000bb lockFactory=org.apache.lucene.store.NativeFSLockFactory@36ba2cc3),segFN=segments_2,generation=2,filenames=[_0.si, _0.fdx, _0_MockSep_0.tii, _0_MockSep_0.tib, _0_MockSep_0.frq, _0_MockSep_0.doc, _0_TestBloomFilteredLucene40Postings_0.tim, segments_2, _0_SimpleText_0.pst, _0_MockSep_0.skp, _0_TestBloomFilteredLucene40Postings_0.prx, _0_MockSep_0.pyl, _0.fnm, _0_TestBloomFilteredLucene40Postings_0.tip, _0_nrm.cfe, _0_TestBloomFilteredLucene40Postings_0.frq, _0_MockSep_0.pos, _0.fdt, _0_TestBloomFilteredLucene40Postings_0.blm, _0_nrm.cfs]
[junit4:junit4]   2> 2224 T2083 C136 oasc.SolrDeletionPolicy.onCommit SolrDeletionPolicy.onCommit: commits:num=2
[junit4:junit4]   2> 		commit{dir=MockDirWrapper(org.apache.lucene.store.RAMDirectory@730e04da lockFactory=org.apache.lucene.store.NativeFSLockFactory@3aaa4640),segFN=segments_2,generation=2,filenames=[_0.si, _0.fdx, _0_MockSep_0.tii, _0_MockSep_0.tib, _0_MockSep_0.frq, _0_MockSep_0.doc, _0_TestBloomFilteredLucene40Postings_0.tim, segments_2, _0_SimpleText_0.pst, _0_MockSep_0.skp, _0_TestBloomFilteredLucene40Postings_0.prx, _0_MockSep_0.pyl, _0.fnm, _0_TestBloomFilteredLucene40Postings_0.tip, _0_nrm.cfe, _0_TestBloomFilteredLucene40Postings_0.frq, _0_MockSep_0.pos, _0.fdt, _0_TestBloomFilteredLucene40Postings_0.blm, _0_nrm.cfs]
[junit4:junit4]   2> 		commit{dir=MockDirWrapper(org.apache.lucene.store.RAMDirectory@730e04da lockFactory=org.apache.lucene.store.NativeFSLockFactory@3aaa4640),segFN=segments_3,generation=3,filenames=[_0.si, _1_TestBloomFilteredLucene40Postings_0.tim, _0_MockSep_0.tii, _1_MockSep_0.skp, _1_MockSep_0.doc, _0_MockSep_0.doc, _0_TestBloomFilteredLucene40Postings_0.tim, _0_MockSep_0.skp, _1_MockSep_0.pyl, _0_MockSep_0.pyl, _1_TestBloomFilteredLucene40Postings_0.tip, _1.si, _0_TestBloomFilteredLucene40Postings_0.tip, _1_TestBloomFilteredLucene40Postings_0.frq, _0_nrm.cfe, _1_TestBloomFilteredLucene40Postings_0.prx, _1_nrm.cfs, segments_3, _0_MockSep_0.pos, _0.fdt, _0_nrm.cfs, _0.fdx, _1_TestBloomFilteredLucene40Postings_0.blm, _1_SimpleText_0.pst, _0_MockSep_0.tib, _1.fdx, _0_MockSep_0.frq, _0_SimpleText_0.pst, _1_MockSep_0.tib, _0_TestBloomFilteredLucene40Postings_0.prx, _1_nrm.cfe, _1.fdt, _0.fnm, _1_MockSep_0.pos, _1_MockSep_0.frq, _0_TestBloomFilteredLucene40Postings_0.frq, _1.fnm, _0_TestBloomFilteredLucene40Postings_0.blm, _1_MockSep_0.tii]
[junit4:junit4]   2> 2225 T2094 C137 oasc.SolrDeletionPolicy.updateCommits newest commit = 2
[junit4:junit4]   2> 2225 T2083 C136 oasc.SolrDeletionPolicy.updateCommits newest commit = 3
[junit4:junit4]   2> 2226 T2094 C137 oass.SolrIndexSearcher.<init> Opening Searcher@7843e670 main
[junit4:junit4]   2> 2226 T2083 C136 oass.SolrIndexSearcher.<init> Opening Searcher@4b931524 main
[junit4:junit4]   2> 2226 T2094 C137 oass.SolrIndexSearcher.getIndexDir WARNING WARNING: Directory impl does not support setting indexDir: org.apache.lucene.store.MockDirectoryWrapper
[junit4:junit4]   2> 2226 T2083 C136 oass.SolrIndexSearcher.getIndexDir WARNING WARNING: Directory impl does not support setting indexDir: org.apache.lucene.store.MockDirectoryWrapper
[junit4:junit4]   2> 2227 T2099 oasc.SolrCore.registerSearcher [collection1] Registered new searcher Searcher@7843e670 main{StandardDirectoryReader(segments_2:3:nrt _0(5.0):C3)}
[junit4:junit4]   2> 2227 T2089 oasc.SolrCore.registerSearcher [collection1] Registered new searcher Searcher@4b931524 main{StandardDirectoryReader(segments_3:5:nrt _0(5.0):C1 _1(5.0):C2)}
[junit4:junit4]   2> 2226 T2094 C137 oasu.DirectUpdateHandler2.commit end_commit_flush
[junit4:junit4]   2> 2227 T2083 C136 oasu.DirectUpdateHandler2.commit end_commit_flush
[junit4:junit4]   2> 2227 T2094 C137 UPDATE [collection1] webapp=/solr path=/update params={waitSearcher=true&softCommit=false&expungeDeletes=false&version=2&wt=javabin&commit=true} {add=[2 (1413131702323118080), 3 (1413131702324166656), 4 (1413131702324166657)],commit=} 0 5
[junit4:junit4]   2> 2227 T2083 C136 UPDATE [collection1] webapp=/solr path=/update params={waitSearcher=true&softCommit=false&expungeDeletes=false&version=2&wt=javabin&commit=true} {add=[2 (1413131702323118080), 3 (1413131702324166656)],commit=} 0 5
[junit4:junit4]   2> 2229 T2082 C136 REQ [collection1] webapp=/solr path=/select params={wt=javabin&version=2&q=*:*} hits=3 status=0 QTime=0 
[junit4:junit4]   2> 2231 T2092 C137 REQ [collection1] webapp=/solr path=/select params={wt=javabin&version=2&q=*:*} hits=3 status=0 QTime=0 
[junit4:junit4]   2> 2232 T2079 oasu.SolrCmdDistributor.distribCommit Distrib commit to:[StdNode: http://localhost:58862/solr/, StdNode: http://localhost:41914/solr/]
[junit4:junit4]   2> 2233 T2094 C137 oasu.DirectUpdateHandler2.commit start commit{flags=0,_version_=0,optimize=false,openSearcher=true,waitSearcher=true,expungeDeletes=false,softCommit=false}
[junit4:junit4]   2> 2233 T2083 C136 oasu.DirectUpdateHandler2.commit start commit{flags=0,_version_=0,optimize=false,openSearcher=true,waitSearcher=true,expungeDeletes=false,softCommit=false}
[junit4:junit4]   2> 2234 T2094 C137 oass.SolrIndexSearcher.<init> Opening Searcher@48f4f62a main
[junit4:junit4]   2> 2234 T2083 C136 oass.SolrIndexSearcher.<init> Opening Searcher@1f15fb73 main
[junit4:junit4]   2> 2234 T2094 C137 oass.SolrIndexSearcher.getIndexDir WARNING WARNING: Directory impl does not support setting indexDir: org.apache.lucene.store.MockDirectoryWrapper
[junit4:junit4]   2> 2234 T2083 C136 oass.SolrIndexSearcher.getIndexDir WARNING WARNING: Directory impl does not support setting indexDir: org.apache.lucene.store.MockDirectoryWrapper
[junit4:junit4]   2> 2234 T2099 oasc.SolrCore.registerSearcher [collection1] Registered new searcher Searcher@48f4f62a main{StandardDirectoryReader(segments_2:3:nrt _0(5.0):C3)}
[junit4:junit4]   2> 2234 T2089 oasc.SolrCore.registerSearcher [collection1] Registered new searcher Searcher@1f15fb73 main{StandardDirectoryReader(segments_3:5:nrt _0(5.0):C1 _1(5.0):C2)}
[junit4:junit4]   2> 2234 T2094 C137 oasu.DirectUpdateHandler2.commit end_commit_flush
[junit4:junit4]   2> 2234 T2083 C136 oasu.DirectUpdateHandler2.commit end_commit_flush
[junit4:junit4]   2> 2235 T2094 C137 UPDATE [collection1] webapp=/solr path=/update params={waitSearcher=true&softCommit=false&expungeDeletes=false&version=2&commit=true&wt=javabin} {commit=} 0 2
[junit4:junit4]   2> 2235 T2083 C136 UPDATE [collection1] webapp=/solr path=/update params={waitSearcher=true&softCommit=false&expungeDeletes=false&version=2&commit=true&wt=javabin} {commit=} 0 2
[junit4:junit4]   2> 2239 T2094 C137 oasu.DirectUpdateHandler2.commit start commit{flags=0,_version_=0,optimize=false,openSearcher=true,waitSearcher=true,expungeDeletes=false,softCommit=false}
[junit4:junit4]   2> 2239 T2083 C136 oasu.DirectUpdateHandler2.commit start commit{flags=0,_version_=0,optimize=false,openSearcher=true,waitSearcher=true,expungeDeletes=false,softCommit=false}
[junit4:junit4]   2> 2239 T2094 C137 oasc.SolrDeletionPolicy.onCommit SolrDeletionPolicy.onCommit: commits:num=2
[junit4:junit4]   2> 		commit{dir=MockDirWrapper(org.apache.lucene.store.RAMDirectory@499000bb lockFactory=org.apache.lucene.store.NativeFSLockFactory@36ba2cc3),segFN=segments_2,generation=2,filenames=[_0.si, _0.fdx, _0_MockSep_0.tii, _0_MockSep_0.tib, _0_MockSep_0.frq, _0_MockSep_0.doc, _0_TestBloomFilteredLucene40Postings_0.tim, segments_2, _0_SimpleText_0.pst, _0_MockSep_0.skp, _0_TestBloomFilteredLucene40Postings_0.prx, _0_MockSep_0.pyl, _0.fnm, _0_TestBloomFilteredLucene40Postings_0.tip, _0_nrm.cfe, _0_TestBloomFilteredLucene40Postings_0.frq, _0_MockSep_0.pos, _0.fdt, _0_TestBloomFilteredLucene40Postings_0.blm, _0_nrm.cfs]
[junit4:junit4]   2> 		commit{dir=MockDirWrapper(org.apache.lucene.store.RAMDirectory@499000bb lockFactory=org.apache.lucene.store.NativeFSLockFactory@36ba2cc3),segFN=segments_3,generation=3,filenames=[_0.si, _0.fdx, _0_MockSep_0.tii, _0_MockSep_0.tib, _0_MockSep_0.frq, _0_MockSep_0.doc, _0_1.del, _0_TestBloomFilteredLucene40Postings_0.tim, _0_SimpleText_0.pst, _0_MockSep_0.skp, _0_TestBloomFilteredLucene40Postings_0.prx, _0_MockSep_0.pyl, _0.fnm, _0_TestBloomFilteredLucene40Postings_0.tip, _0_nrm.cfe, segments_3, _0_TestBloomFilteredLucene40Postings_0.frq, _0_MockSep_0.pos, _0.fdt, _0_TestBloomFilteredLucene40Postings_0.blm, _0_nrm.cfs]
[junit4:junit4]   2> 2240 T2083 C136 oasc.SolrDeletionPolicy.onCommit SolrDeletionPolicy.onCommit: commits:num=2
[junit4:junit4]   2> 		commit{dir=MockDirWrapper(org.apache.lucene.store.RAMDirectory@730e04da lockFactory=org.apache.lucene.store.NativeFSLockFactory@3aaa4640),segFN=segments_3,generation=3,filenames=[_0.si, _1_TestBloomFilteredLucene40Postings_0.tim, _0_MockSep_0.tii, _1_MockSep_0.skp, _1_MockSep_0.doc, _0_MockSep_0.doc, _0_TestBloomFilteredLucene40Postings_0.tim, _0_MockSep_0.skp, _1_MockSep_0.pyl, _0_MockSep_0.pyl, _1_TestBloomFilteredLucene40Postings_0.tip, _1.si, _0_TestBloomFilteredLucene40Postings_0.tip, _1_TestBloomFilteredLucene40Postings_0.frq, _0_nrm.cfe, _1_TestBloomFilteredLucene40Postings_0.prx, _1_nrm.cfs, segments_3, _0_MockSep_0.pos, _0.fdt, _0_nrm.cfs, _0.fdx, _1_TestBloomFilteredLucene40Postings_0.blm, _1_SimpleText_0.pst, _0_MockSep_0.tib, _1.fdx, _0_MockSep_0.frq, _0_SimpleText_0.pst, _1_MockSep_0.tib, _0_TestBloomFilteredLucene40Postings_0.prx, _1_nrm.cfe, _1.fdt, _0.fnm, _1_MockSep_0.pos, _1_MockSep_0.frq, _0_TestBloomFilteredLucene40Postings_0.frq, _1.fnm, _0_TestBloomFilteredLucene40Postings_0.blm, _1_MockSep_0.tii]
[junit4:junit4]   2> 		commit{dir=MockDirWrapper(org.apache.lucene.store.RAMDirectory@730e04da lockFactory=org.apache.lucene.store.NativeFSLockFactory@3aaa4640),segFN=segments_4,generation=4,filenames=[_0.si, _1_TestBloomFilteredLucene40Postings_0.tim, _0_MockSep_0.tii, _1_MockSep_0.skp, _1_MockSep_0.doc, _0_MockSep_0.doc, _0_TestBloomFilteredLucene40Postings_0.tim, _0_MockSep_0.skp, _1_MockSep_0.pyl, _0_MockSep_0.pyl, _1_TestBloomFilteredLucene40Postings_0.tip, _1.si, _0_TestBloomFilteredLucene40Postings_0.tip, _1_TestBloomFilteredLucene40Postings_0.frq, _0_nrm.cfe, _1_TestBloomFilteredLucene40Postings_0.prx, _1_nrm.cfs, _0_MockSep_0.pos, _0.fdt, _0_nrm.cfs, _0.fdx, _1_TestBloomFilteredLucene40Postings_0.blm, _1_SimpleText_0.pst, _0_MockSep_0.tib, _1.fdx, _0_MockSep_0.frq, _0_SimpleText_0.pst, _1_MockSep_0.tib, _0_TestBloomFilteredLucene40Postings_0.prx, _1_nrm.cfe, _1.fdt, _0.fnm, _1_MockSep_0.pos, _1_1.del, _1_MockSep_0.frq, _0_TestBloomFilteredLucene40Postings_0.frq, _1.fnm, segments_4, _0_TestBloomFilteredLucene40Postings_0.blm, _1_MockSep_0.tii]
[junit4:junit4]   2> 2240 T2094 C137 oasc.SolrDeletionPolicy.updateCommits newest commit = 3
[junit4:junit4]   2> 2240 T2083 C136 oasc.SolrDeletionPolicy.updateCommits newest commit = 4
[junit4:junit4]   2> 2241 T2094 C137 oass.SolrIndexSearcher.<init> Opening Searcher@2d277b60 main
[junit4:junit4]   2> 2241 T2083 C136 oass.SolrIndexSearcher.<init> Opening Searcher@211a7c54 main
[junit4:junit4]   2> 2241 T2094 C137 oass.SolrIndexSearcher.getIndexDir WARNING WARNING: Directory impl does not support setting indexDir: org.apache.lucene.store.MockDirectoryWrapper
[junit4:junit4]   2> 2241 T2083 C136 oass.SolrIndexSearcher.getIndexDir WARNING WARNING: Directory impl does not support setting indexDir: org.apache.lucene.store.MockDirectoryWrapper
[junit4:junit4]   2> 2242 T2099 oasc.SolrCore.registerSearcher [collection1] Registered new searcher Searcher@2d277b60 main{StandardDirectoryReader(segments_3:4:nrt _0(5.0):C3/1)}
[junit4:junit4]   2> 2242 T2089 oasc.SolrCore.registerSearcher [collection1] Registered new searcher Searcher@211a7c54 main{StandardDirectoryReader(segments_4:6:nrt _0(5.0):C1 _1(5.0):C2/1)}
[junit4:junit4]   2> 2242 T2094 C137 oasu.DirectUpdateHandler2.commit end_commit_flush
[junit4:junit4]   2> 2242 T2083 C136 oasu.DirectUpdateHandler2.commit end_commit_flush
[junit4:junit4]   2> 2242 T2094 C137 UPDATE [collection1] webapp=/solr path=/update params={waitSearcher=true&softCommit=false&expungeDeletes=false&version=2&wt=javabin&commit=true} {delete=[2 (-1413131702339895296)],commit=} 0 4
[junit4:junit4]   2> 2242 T2083 C136 UPDATE [collection1] webapp=/solr path=/update params={waitSearcher=true&softCommit=false&expungeDeletes=false&version=2&wt=javabin&commit=true} {delete=[2 (-1413131702339895296)],commit=} 0 4
[junit4:junit4]   2> 2244 T2082 C136 REQ [collection1] webapp=/solr path=/select params={wt=javabin&version=2&q=*:*} hits=2 status=0 QTime=0 
[junit4:junit4]   2> 2247 T2092 C137 REQ [collection1] webapp=/solr path=/select params={wt=javabin&version=2&q=*:*} hits=2 status=0 QTime=0 
[junit4:junit4]   2> 2250 T2092 C137 oasu.DirectUpdateHandler2.commit start commit{flags=0,_version_=0,optimize=true,openSearcher=true,waitSearcher=true,expungeDeletes=false,softCommit=false}
[junit4:junit4]   2> 2255 T2092 C137 oasc.SolrDeletionPolicy.onCommit SolrDeletionPolicy.onCommit: commits:num=2
[junit4:junit4]   2> 		commit{dir=MockDirWrapper(org.apache.lucene.store.RAMDirectory@499000bb lockFactory=org.apache.lucene.store.NativeFSLockFactory@36ba2cc3),segFN=segments_3,generation=3,filenames=[_0.si, _0.fdx, _0_MockSep_0.tii, _0_MockSep_0.tib, _0_MockSep_0.frq, _0_MockSep_0.doc, _0_1.del, _0_TestBloomFilteredLucene40Postings_0.tim, _0_SimpleText_0.pst, _0_MockSep_0.skp, _0_TestBloomFilteredLucene40Postings_0.prx, _0_MockSep_0.pyl, _0.fnm, _0_TestBloomFilteredLucene40Postings_0.tip, _0_nrm.cfe, segments_3, _0_TestBloomFilteredLucene40Postings_0.frq, _0_MockSep_0.pos, _0.fdt, _0_TestBloomFilteredLucene40Postings_0.blm, _0_nrm.cfs]
[junit4:junit4]   2> 		commit{dir=MockDirWrapper(org.apache.lucene.store.RAMDirectory@499000bb lockFactory=org.apache.lucene.store.NativeFSLockFactory@36ba2cc3),segFN=segments_4,generation=4,filenames=[_1_TestBloomFilteredLucene40Postings_0.tim, _1_TestBloomFilteredLucene40Postings_0.blm, _1_MockSep_0.skp, _1_SimpleText_0.pst, _1_MockSep_0.doc, _1.fdx, _1_MockSep_0.pyl, _1_MockSep_0.tib, _1_nrm.cfe, _1_TestBloomFilteredLucene40Postings_0.tip, _1.fdt, _1.si, _1_MockSep_0.pos, _1_TestBloomFilteredLucene40Postings_0.frq, _1_TestBloomFilteredLucene40Postings_0.prx, _1_nrm.cfs, _1_MockSep_0.frq, _1.fnm, segments_4, _1_MockSep_0.tii]
[junit4:junit4]   2> 2256 T2092 C137 oasc.SolrDeletionPolicy.updateCommits newest commit = 4
[junit4:junit4]   2> 2257 T2092 C137 oass.SolrIndexSearcher.<init> Opening Searcher@6e785f69 main
[junit4:junit4]   2> 2258 T2092 C137 oass.SolrIndexSearcher.getIndexDir WARNING WARNING: Directory impl does not support setting indexDir: org.apache.lucene.store.MockDirectoryWrapper
[junit4:junit4]   2> 2258 T2099 oasc.SolrCore.registerSearcher [collection1] Registered new searcher Searcher@6e785f69 main{StandardDirectoryReader(segments_4:6:nrt _1(5.0):C2)}
[junit4:junit4]   2> 2258 T2092 C137 oasu.DirectUpdateHandler2.commit end_commit_flush
[junit4:junit4]   2> 2258 T2092 C137 UPDATE [collection1] webapp=/solr path=/update params={waitSearcher=true&optimize=true&maxSegments=1&wt=javabin&version=2} {optimize=} 0 8
[junit4:junit4]   2> 2260 T2102 C138 oasu.DirectUpdateHandler2.commit start commit{flags=0,_version_=0,optimize=true,openSearcher=true,waitSearcher=true,expungeDeletes=false,softCommit=false}
[junit4:junit4]   2> 2261 T2102 C138 oass.SolrIndexSearcher.<init> Opening Searcher@253d8be4 main
[junit4:junit4]   2> 2261 T2102 C138 oass.SolrIndexSearcher.getIndexDir WARNING WARNING: Directory impl does not support setting indexDir: org.apache.lucene.store.MockDirectoryWrapper
[junit4:junit4]   2> 2262 T2109 oasc.SolrCore.registerSearcher [collection1] Registered new searcher Searcher@253d8be4 main{StandardDirectoryReader(segments_1:1:nrt)}
[junit4:junit4]   2> 2262 T2102 C138 oasu.DirectUpdateHandler2.commit end_commit_flush
[junit4:junit4]   2> 2262 T2102 C138 UPDATE [collection1] webapp=/solr path=/update params={waitSearcher=true&optimize=true&maxSegments=1&wt=javabin&version=2} {optimize=} 0 2
[junit4:junit4]   2> 2264 T2112 C139 oasu.DirectUpdateHandler2.commit start commit{flags=0,_version_=0,optimize=true,openSearcher=true,waitSearcher=true,expungeDeletes=false,softCommit=false}
[junit4:junit4]   2> 2264 T2112 C139 oass.SolrIndexSearcher.<init> Opening Searcher@36205f2c main
[junit4:junit4]   2> 2265 T2112 C139 oass.SolrIndexSearcher.getIndexDir WARNING WARNING: Directory impl does not support setting indexDir: org.apache.lucene.store.MockDirectoryWrapper
[junit4:junit4]   2> 2265 T2119 oasc.SolrCore.registerSearcher [collection1] Registered new searcher Searcher@36205f2c main{StandardDirectoryReader(segments_1:1:nrt)}
[junit4:junit4]   2> 2265 T2112 C139 oasu.DirectUpdateHandler2.commit end_commit_flush
[junit4:junit4]   2> 2266 T2112 C139 UPDATE [collection1] webapp=/solr path=/update params={waitSearcher=true&optimize=true&maxSegments=1&wt=javabin&version=2} {optimize=} 0 2
[junit4:junit4]   2> 2268 T2122 C140 oasu.DirectUpdateHandler2.commit start commit{flags=0,_version_=0,optimize=true,openSearcher=true,waitSearcher=true,expungeDeletes=false,softCommit=false}
[junit4:junit4]   2> 2268 T2122 C140 oass.SolrIndexSearcher.<init> Opening Searcher@1ff0335d main
[junit4:junit4]   2> 2268 T2122 C140 oass.SolrIndexSearcher.getIndexDir WARNING WARNING: Directory impl does not support setting indexDir: org.apache.lucene.store.MockDirectoryWrapper
[junit4:junit4]   2> 2269 T2129 oasc.SolrCore.registerSearcher [collection1] Registered new searcher Searcher@1ff0335d main{StandardDirectoryReader(segments_1:1:nrt)}
[junit4:junit4]   2> 2269 T2122 C140 oasu.DirectUpdateHandler2.commit end_commit_flush
[junit4:junit4]   2> 2269 T2122 C140 UPDATE [collection1] webapp=/solr path=/update params={waitSearcher=true&optimize=true&maxSegments=1&wt=javabin&version=2} {optimize=} 0 2
[junit4:junit4]   2> 2274 T2123 C140 oasu.DirectUpdateHandler2.commit start commit{flags=0,_version_=0,optimize=false,openSearcher=true,waitSearcher=true,expungeDeletes=false,softCommit=false}
[junit4:junit4]   2> 2274 T2094 C137 oasu.DirectUpdateHandler2.commit start commit{flags=0,_version_=0,optimize=false,openSearcher=true,waitSearcher=true,expungeDeletes=false,softCommit=false}
[junit4:junit4]   2> 2274 T2113 C139 oasu.DirectUpdateHandler2.commit start commit{flags=0,_version_=0,optimize=false,openSearcher=true,waitSearcher=true,expungeDeletes=false,softCommit=false}
[junit4:junit4]   2> 2286 T2105 C138 oasu.DirectUpdateHandler2.commit start commit{flags=0,_version_=0,optimize=false,openSearcher=true,waitSearcher=true,expungeDeletes=false,softCommit=false}
[junit4:junit4]   2> 2288 T2094 C137 oasc.SolrDeletionPolicy.onCommit SolrDeletionPolicy.onCommit: commits:num=2
[junit4:junit4]   2> 		commit{dir=MockDirWrapper(org.apache.lucene.store.RAMDirectory@499000bb lockFactory=org.apache.lucene.store.NativeFSLockFactory@36ba2cc3),segFN=segments_4,generation=4,filenames=[_1_TestBloomFilteredLucene40Postings_0.tim, _1_TestBloomFilteredLucene40Postings_0.blm, _1_MockSep_0.skp, _1_SimpleText_0.pst, _1_MockSep_0.doc, _1.fdx, _1_MockSep_0.pyl, _1_MockSep_0.tib, _1_nrm.cfe, _1_TestBloomFilteredLucene40Postings_0.tip, _1.fdt, _1.si, _1_MockSep_0.pos, _1_TestBloomFilteredLucene40Postings_0.frq, _1_TestBloomFilteredLucene40Postings_0.prx, _1_nrm.cfs, _1_MockSep_0.frq, _1.fnm, segments_4, _1_MockSep_0.tii]
[junit4:junit4]   2> 		commit{dir=MockDirWrapper(org.apache.lucene.store.RAMDirectory@499000bb lockFactory=org.apache.lucene.store.NativeFSLockFactory@36ba2cc3),segFN=segments_5,generation=5,filenames=[_1_TestBloomFilteredLucene40Postings_0.tim, _2_TestBloomFilteredLucene40Postings_0.prx, _1_MockSep_0.skp, _2_nrm.cfe, _1_MockSep_0.doc, _2_MockSep_0.frq, _2_MockSep_0.tib, _2_TestBloomFilteredLucene40Postings_0.blm, _2.si, _1_MockSep_0.pyl, _1_TestBloomFilteredLucene40Postings_0.tip, _1.si, _2_nrm.cfs, _1_TestBloomFilteredLucene40Postings_0.frq, _1_nrm.cfs, _1_TestBloomFilteredLucene40Postings_0.prx, _2.fdt, _2_MockSep_0.doc, _2_SimpleText_0.pst, _2_MockSep_0.tii, segments_5, _2_MockSep_0.pos, _1_TestBloomFilteredLucene40Postings_0.blm, _1_SimpleText_0.pst, _1.fdx, _2_TestBloomFilteredLucene40Postings_0.tim, _2_MockSep_0.skp, _2.fnm, _1_MockSep_0.tib, _1_nrm.cfe, _1.fdt, _1_MockSep_0.pos, _2_TestBloomFilteredLucene40Postings_0.tip, _2_TestBloomFilteredLucene40Postings_0.frq, _1_MockSep_0.frq, _1.fnm, _2_MockSep_0.pyl, _2.fdx, _1_MockSep_0.tii]
[junit4:junit4]   2> 2291 T2094 C137 oasc.SolrDeletionPolicy.updateCommits newest commit = 5
[junit4:junit4]   2> 2299 T2094 C137 oass.SolrIndexSearcher.<init> Opening Searcher@43f6b598 main
[junit4:junit4]   2> 2307 T2094 C137 oass.SolrIndexSearcher.getIndexDir WARNING WARNING: Directory impl does not support setting indexDir: org.apache.lucene.store.MockDirectoryWrapper
[junit4:junit4]   2> 2309 T2099 oasc.SolrCore.registerSearcher [collection1] Registered new searcher Searcher@43f6b598 main{StandardDirectoryReader(segments_5:11:nrt _1(5.0):C2 _2(5.0):C12 _3(5.0):C38)}
[junit4:junit4]   2> 2309 T2094 C137 oasu.DirectUpdateHandler2.commit end_commit_flush
[junit4:junit4]   2> 2309 T2094 C137 UPDATE [collection1] webapp=/solr path=/update params={waitSearcher=true&softCommit=false&expungeDeletes=false&version=2&wt=javabin&commit=true} {add=[5 (1413131702375546880), 7 (1413131702376595456), 8 (1413131702376595457), 9 (1413131702376595458), 11 (1413131702376595459), 12 (1413131702376595460), 14 (1413131702376595461), 15 (1413131702377644032), 16 (1413131702377644034), 21 (1413131702377644035)],commit=} 0 37
[junit4:junit4]   2> 2309 T2093 C137 oasu.DirectUpdateHandler2.commit start commit{flags=0,_version_=0,optimize=false,openSearcher=true,waitSearcher=true,expungeDeletes=false,softCommit=false}
[junit4:junit4]   2> 2312 T2093 C137 oasc.SolrDeletionPolicy.onCommit SolrDeletionPolicy.onCommit: commits:num=2
[junit4:junit4]   2> 		commit{dir=MockDirWrapper(org.apache.lucene.store.RAMDirectory@499000bb lockFactory=org.apache.lucene.store.NativeFSLockFactory@36ba2cc3),segFN=segments_5,generation=5,filenames=[_1_TestBloomFilteredLucene40Postings_0.tim, _2_TestBloomFilteredLucene40Postings_0.prx, _1_MockSep_0.skp, _2_nrm.cfe, _1_MockSep_0.doc, _2_MockSep_0.frq, _2_MockSep_0.tib, _2_TestBloomFilteredLucene40Postings_0.blm, _2.si, _1_MockSep_0.pyl, _1_TestBloomFilteredLucene40Postings_0.tip, _1.si, _2_nrm.cfs, _1_TestBloomFilteredLucene40Postings_0.frq, _1_nrm.cfs, _1_TestBloomFilteredLucene40Postings_0.prx, _2.fdt, _2_MockSep_0.doc, _2_SimpleText_0.pst, _2_MockSep_0.tii, segments_5, _2_MockSep_0.pos, _1_TestBloomFilteredLucene40Postings_0.blm, _1_SimpleText_0.pst, _1.fdx, _2_TestBloomFilteredLucene40Postings_0.tim, _2_MockSep_0.skp, _2.fnm, _1_MockSep_0.tib, _1_nrm.cfe, _1.fdt, _1_MockSep_0.pos, _2_TestBloomFilteredLucene40Postings_0.tip, _2_TestBloomFilteredLucene40Postings_0.frq, _1_MockSep_0.frq, _1.fnm, _2_MockSep_0.pyl, _2.fdx, _1_MockSep_0.tii]
[junit4:junit4]   2> 		commit{dir=MockDirWrapper(org.apache.lucene.store.RAMDirectory@499000bb lockFactory=org.apache.lucene.store.NativeFSLockFactory@36ba2cc3),segFN=segments_6,generation=6,filenames=[_3_MockSep_0.tii, _4_MockSep_0.doc, _4_MockSep_0.frq, _2_nrm.cfe, _3_MockSep_0.doc, _4_MockSep_0.skp, _2_MockSep_0.frq, _2_MockSep_0.tib, _2_TestBloomFilteredLucene40Postings_0.blm, _3_MockSep_0.skp, _2.si, _1.si, _2_nrm.cfs, _4.fdx, _3.fdt, _2.fdt, _4_MockSep_0.tii, _3.fnm, _2_MockSep_0.doc, _4_nrm.cfe, _2_MockSep_0.tii, _3_TestBloomFilteredLucene40Postings_0.blm, _3_MockSep_0.frq, _3_nrm.cfe, _4_MockSep_0.pos, _1_MockSep_0.tib, _1_MockSep_0.pos, _4_TestBloomFilteredLucene40Postings_0.prx, _3_TestBloomFilteredLucene40Postings_0.frq, _4.fnm, _3_MockSep_0.tib, _1_MockSep_0.frq, _1.fnm, _2.fdx, _3.si, _1_MockSep_0.tii, _3_TestBloomFilteredLucene40Postings_0.tim, _4_TestBloomFilteredLucene40Postings_0.tim, _1_TestBloomFilteredLucene40Postings_0.tim, _4_TestBloomFilteredLucene40Postings_0.blm, _2_TestBloomFilteredLucene40Postings_0.prx, _1_MockSep_0.skp, _3_MockSep_0.pos, _1_MockSep_0.doc, _4.fdt, _4_TestBloomFilteredLucene40Postings_0.tip, _4_SimpleText_0.pst, _3_MockSep_0.pyl, _1_MockSep_0.pyl, _1_TestBloomFilteredLucene40Postings_0.tip, _1_TestBloomFilteredLucene40Postings_0.frq, _3_TestBloomFilteredLucene40Postings_0.prx, _1_TestBloomFilteredLucene40Postings_0.prx, _1_nrm.cfs, _3_TestBloomFilteredLucene40Postings_0.tip, _4_MockSep_0.pyl, _2_SimpleText_0.pst, _3_SimpleText_0.pst, _4_TestBloomFilteredLucene40Postings_0.frq, _2_MockSep_0.pos, _1_TestBloomFilteredLucene40Postings_0.blm, _1_SimpleText_0.pst, segments_6, _3.fdx, _4_nrm.cfs, _2_TestBloomFilteredLucene40Postings_0.tim, _1.fdx, _2_MockSep_0.skp, _2.fnm, _1_nrm.cfe, _4.si, _1.fdt, _2_TestBloomFilteredLucene40Postings_0.tip, _2_TestBloomFilteredLucene40Postings_0.frq, _2_MockSep_0.pyl, _3_nrm.cfs, _4_MockSep_0.tib]
[junit4:junit4]   2> 2312 T2093 C137 oasc.SolrDeletionPolicy.updateCommits newest commit = 6
[junit4:junit4]   2> 2313 T2093 C137 oass.SolrIndexSearcher.<init> Opening Searcher@507882ff main
[junit4:junit4]   2> 2314 T2093 C137 oass.SolrIndexSearcher.getIndexDir WARNING WARNING: Directory impl does not support setting indexDir: org.apache.lucene.store.MockDirectoryWrapper
[junit4:junit4]   2> 2314 T2099 oasc.SolrCore.registerSearcher [collection1] Registered new searcher Searcher@507882ff main{StandardDirectoryReader(segments_6:12:nrt _1(5.0):C2 _2(5.0):C12 _3(5.0):C38 _4(5.0):C16)}
[junit4:junit4]   2> 2314 T2093 C137 oasu.DirectUpdateHandler2.commit end_commit_flush
[junit4:junit4]   2> 2314 T2123 C140 oasc.SolrDeletionPolicy.onCommit SolrDeletionPolicy.onCommit: commits:num=2
[junit4:junit4]   2> 		commit{dir=MockDirWrapper(org.apache.lucene.store.RAMDirectory@343b3df1 lockFactory=org.apache.lucene.store.NativeFSLockFactory@7622bcb7),segFN=segments_1,generation=1,filenames=[segments_1]
[junit4:junit4]   2> 		commit{dir=MockDirWrapper(org.apache.lucene.store.RAMDirectory@343b3df1 lockFactory=org.apache.lucene.store.NativeFSLockFactory@7622bcb7),segFN=segments_2,generation=2,filenames=[_0.si, _0.fdx, _0_MockSep_0.tii, _0_MockSep_0.tib, _0_MockSep_0.frq, _0_MockSep_0.doc, _0_TestBloomFilteredLucene40Postings_0.tim, segments_2, _0_SimpleText_0.pst, _0_MockSep_0.skp, _0_TestBloomFilteredLucene40Postings_0.prx, _0_MockSep_0.pyl, _0.fnm, _0_TestBloomFilteredLucene40Postings_0.tip, _0_nrm.cfe, _0_TestBloomFilteredLucene40Postings_0.frq, _0_MockSep_0.pos, _0.fdt, _0_TestBloomFilteredLucene40Postings_0.blm, _0_nrm.cfs]
[junit4:junit4]   2> 2314 T2095 C137 oasu.DirectUpdateHandler2.commit start commit{flags=0,_version_=0,optimize=false,openSearcher=true,waitSearcher=true,expungeDeletes=false,softCommit=false}
[junit4:junit4]   2> 2314 T2093 C137 UPDATE [collection1] webapp=/solr path=/update params={waitSearcher=true&softCommit=false&expungeDeletes=false&version=2&wt=javabin&commit=true} {add=[22 (1413131702377644033), 24 (1413131702378692608), 26 (1413131702378692609), 30 (1413131702379741184), 31 (1413131702379741185), 33 (1413131702379741186), 36 (1413131702379741187), 37 (1413131702380789760), 38 (1413131702380789761), 39 (1413131702380789762)],commit=} 0 40
[junit4:junit4]   2> 2318 T2095 C137 oasc.SolrDeletionPolicy.onCommit SolrDeletionPolicy.onCommit: commits:num=2
[junit4:junit4]   2> 		commit{dir=MockDirWrapper(org.apache.lucene.store.RAMDirectory@499000bb lockFactory=org.apache.lucene.store.NativeFSLockFactory@36ba2cc3),segFN=segments_6,generation=6,filenames=[_3_MockSep_0.tii, _4_MockSep_0.doc, _4_MockSep_0.frq, _2_nrm.cfe, _3_MockSep_0.doc, _4_MockSep_0.skp, _2_MockSep_0.frq, _2_MockSep_0.tib, _2_TestBloomFilteredLucene40Postings_0.blm, _3_MockSep_0.skp, _2.si, _1.si, _2_nrm.cfs, _4.fdx, _3.fdt, _2.fdt, _4_MockSep_0.tii, _3.fnm, _2_MockSep_0.doc, _4_nrm.cfe, _2_MockSep_0.tii, _3_TestBloomFilteredLucene40Postings_0.blm, _3_MockSep_0.frq, _3_nrm.cfe, _4_MockSep_0.pos, _1_MockSep_0.tib, _1_MockSep_0.pos, _4_TestBloomFilteredLucene40Postings_0.prx, _3_TestBloomFilteredLucene40Postings_0.frq, _4.fnm, _3_MockSep_0.tib, _1_MockSep_0.frq, _1.fnm, _2.fdx, _3.si, _1_MockSep_0.tii, _3_TestBloomFilteredLucene40Postings_0.tim, _4_TestBloomFilteredLucene40Postings_0.tim, _1_TestBloomFilteredLucene40Postings_0.tim, _4_TestBloomFilteredLucene40Postings_0.blm, _2_TestBloomFilteredLucene40Postings_0.prx, _1_MockSep_0.skp, _3_MockSep_0.pos, _1_MockSep_0.doc, _4.fdt, _4_TestBloomFilteredLucene40Postings_0.tip, _4_SimpleText_0.pst, _3_MockSep_0.pyl, _1_MockSep_0.pyl, _1_TestBloomFilteredLucene40Postings_0.tip, _1_TestBloomFilteredLucene40Postings_0.frq, _3_TestBloomFilteredLucene40Postings_0.prx, _1_TestBloomFilteredLucene40Postings_0.prx, _1_nrm.cfs, _3_TestBloomFilteredLucene40Postings_0.tip, _4_MockSep_0.pyl, _2_SimpleText_0.pst, _3_SimpleText_0.pst, _4_TestBloomFilteredLucene40Postings_0.frq, _2_MockSep_0.pos, _1_TestBloomFilteredLucene40Postings_0.blm, _1_SimpleText_0.pst, segments_6, _3.fdx, _4_nrm.cfs, _2_TestBloomFilteredLucene40Postings_0.tim, _1.fdx, _2_MockSep_0.skp, _2.fnm, _1_nrm.cfe, _4.si, _1.fdt, _2_TestBloomFilteredLucene40Postings_0.tip, _2_TestBloomFilteredLucene40Postings_0.frq, _2_MockSep_0.pyl, _3_nrm.cfs, _4_MockSep_0.tib]
[junit4:junit4]   2> 		commit{dir=MockDirWrapper(org.apache.lucene.store.RAMDirectory@499000bb lockFactory=org.apache.lucene.store.NativeFSLockFactory@36ba2cc3),segFN=segments_7,generation=7,filenames=[_5_MockSep_0.tii, _5.fnm, _3_MockSep_0.tii, _4_MockSep_0.doc, _4_MockSep_0.frq, _2_nrm.cfe, _3_MockSep_0.doc, _5_TestBloomFilteredLucene40Postings_0.tim, _4_MockSep_0.skp, _5_MockSep_0.skp, _2_MockSep_0.frq, _2_MockSep_0.tib, _2_TestBloomFilteredLucene40Postings_0.blm, _3_MockSep_0.skp, _2.si, _1.si, _2_nrm.cfs, _4.fdx, _3.fdt, _5_SimpleText_0.pst, _2.fdt, _5_TestBloomFilteredLucene40Postings_0.frq, _4_MockSep_0.tii, _3.fnm, _2_MockSep_0.doc, _4_nrm.cfe, _2_MockSep_0.tii, _5_MockSep_0.pos, _3_TestBloomFilteredLucene40Postings_0.blm, _3_MockSep_0.frq, _5_nrm.cfs, _5_MockSep_0.tib, _3_nrm.cfe, _4_MockSep_0.pos, _1_MockSep_0.tib, _1_MockSep_0.pos, _5_MockSep_0.doc, _4_TestBloomFilteredLucene40Postings_0.prx, _3_TestBloomFilteredLucene40Postings_0.frq, _4.fnm, _3_MockSep_0.tib, _5.fdt, _1_MockSep_0.frq, _1.fnm, _2.fdx, _5_TestBloomFilteredLucene40Postings_0.tip, _3.si, _1_MockSep_0.tii, _3_TestBloomFilteredLucene40Postings_0.tim, _5_TestBloomFilteredLucene40Postings_0.prx, _4_TestBloomFilteredLucene40Postings_0.tim, segments_7, _1_TestBloomFilteredLucene40Postings_0.tim, _4_TestBloomFilteredLucene40Postings_0.blm, _2_TestBloomFilteredLucene40Postings_0.prx, _1_MockSep_0.skp, _3_MockSep_0.pos, _5.fdx, _1_MockSep_0.doc, _5_MockSep_0.pyl, _4.fdt, _4_TestBloomFilteredLucene40Postings_0.tip, _4_SimpleText_0.pst, _3_MockSep_0.pyl, _1_MockSep_0.pyl, _5.si, _1_TestBloomFilteredLucene40Postings_0.tip, _1_TestBloomFilteredLucene40Postings_0.frq, _3_TestBloomFilteredLucene40Postings_0.prx, _1_TestBloomFilteredLucene40Postings_0.prx, _1_nrm.cfs, _3_TestBloomFilteredLucene40Postings_0.tip, _4_MockSep_0.pyl, _2_SimpleText_0.pst, _3_SimpleText_0.pst, _4_TestBloomFilteredLucene40Postings_0.frq, _2_MockSep_0.pos, _1_TestBloomFilteredLucene40Postings_0.blm, _1_SimpleText_0.pst, _3.fdx, _4_nrm.cfs, _2_TestBloomFilteredLucene40Postings_0.tim, _1.fdx, _5_nrm.cfe, _2_MockSep_0.skp, _2.fnm, _1_nrm.cfe, _4.si, _1.fdt, _5_TestBloomFilteredLucene40Postings_0.blm, _2_TestBloomFilteredLucene40Postings_0.tip, _2_TestBloomFilteredLucene40Postings_0.frq, _5_MockSep_0.frq, _2_MockSep_0.pyl, _3_nrm.cfs, _4_MockSep_0.tib]
[junit4:junit4]   2> 2319 T2095 C137 oasc.SolrDeletionPolicy.updateCommits newest commit = 7
[junit4:junit4]   2> 2326 T2123 C140 oasc.SolrDeletionPolicy.updateCommits newest commit = 2
[junit4:junit4]   2> 2328 T2113 C139 oasc.SolrDeletionPolicy.onCommit SolrDeletionPolicy.onCommit: commits:num=2
[junit4:junit4]   2> 		commit{dir=MockDirWrapper(org.apache.lucene.store.MMapDirectory@/mnt/ssd/jenkins/workspace/Lucene-Solr-trunk-Linux/solr/build/solr-core/test/J1/index3155431564tmp lockFactory=org.apache.lucene.store.NativeFSLockFactory@4288f76f),segFN=segments_1,generation=1,filenames=[segments_1]
[junit4:junit4]   2> 		commit{dir=MockDirWrapper(org.apache.lucene.store.MMapDirectory@/mnt/ssd/jenkins/workspace/Lucene-Solr-trunk-Linux/solr/build/solr-core/test/J1/index3155431564tmp lockFactory=org.apache.lucene.store.NativeFSLockFactory@4288f76f),segFN=segments_2,generation=2,filenames=[_0.si, _0.fdx, _0_MockSep_0.tii, _0_MockSep_0.tib, _0_MockSep_0.frq, _0_MockSep_0.doc, _0_TestBloomFilteredLucene40Postings_0.tim, segments_2, _0_SimpleText_0.pst, _0_MockSep_0.skp, _0_TestBloomFilteredLucene40Postings_0.prx, _0_MockSep_0.pyl, _0.fnm, _0_TestBloomFilteredLucene40Postings_0.tip, _0_nrm.cfe, _0_TestBloomFilteredLucene40Postings_0.frq, _0_MockSep_0.pos, _0.fdt, _0_TestBloomFilteredLucene40Postings_0.blm, _0_nrm.cfs]
[junit4:junit4]   2> 2332 T2095 C137 oass.SolrIndexSearcher.<init> Opening Searcher@72a6c913 main
[junit4:junit4]   2> 2333 T2095 C137 oass.SolrIndexSearcher.getIndexDir WARNING WARNING: Directory impl does not support setting indexDir: org.apache.lucene.store.MockDirectoryWrapper
[junit4:junit4]   2> 2333 T2099 oasc.SolrCore.registerSearcher [collection1] Registered new searcher Searcher@72a6c913 main{StandardDirectoryReader(segments_7:24:nrt _1(5.0):C2 _2(5.0):C12 _3(5.0):C38 _4(5.0):C16 _5(5.0):C7 _6(5.0):C1)}
[junit4:junit4]   2> 2334 T2113 C139 oasc.SolrDeletionPolicy.updateCommits newest commit = 2
[junit4:junit4]   2> 2335 T2095 C137 oasu.DirectUpdateHandler2.commit end_commit_flush
[junit4:junit4]   2> 2335 T2095 C137 UPDATE [collection1] webapp=/solr path=/update params={waitSearcher=true&softCommit=false&expungeDeletes=false&version=2&wt=javabin&commit=true} {add=[41 (1413131702386032640), 42 (1413131702386032641), 44 (1413131702386032642), 45 (1413131702387081216), 49 (1413131702387081217), 54 (1413131702387081218), 55 (1413131702387081219), 59 (1413131702387081220), 60 (1413131702388129792), 61 (1413131702388129793)],commit=} 0 53
[junit4:junit4]   2> 2335 T2096 C137 oasu.DirectUpdateHandler2.commit start commit{flags=0,_version_=0,optimize=false,openSearcher=true,waitSearcher=true,expungeDeletes=false,softCommit=false}
[junit4:junit4]   2> 2344 T2123 C140 oass.SolrIndexSearcher.<init> Opening Searcher@7a741626 main
[junit4:junit4]   2> 2354 T2123 C140 oass.SolrIndexSearcher.getIndexDir WARNING WARNING: Directory impl does not support setting indexDir: org.apache.lucene.store.MockDirectoryWrapper
[junit4:junit4]   2> 2354 T2105 C138 oasc.SolrDeletionPolicy.onCommit SolrDeletionPolicy.onCommit: commits:num=2
[junit4:junit4]   2> 		commit{dir=MockDirWrapper(org.apache.lucene.store.RAMDirectory@4785ab0d lockFactory=org.apache.lucene.store.NativeFSLockFactory@73dd6307),segFN=segments_1,generation=1,filenames=[segments_1]
[junit4:junit4]   2> 		commit{dir=MockDirWrapper(org.apache.lucene.store.RAMDirectory@4785ab0d lockFactory=org.apache.lucene.store.NativeFSLockFactory@73dd6307),segFN=segments_2,generation=2,filenames=[_3_MockSep_0.tii, _3_MockSep_0.doc, _2_nrm.cfe, _2_MockSep_0.frq, _2_MockSep_0.tib, _2_TestBloomFilteredLucene40Postings_0.blm, _3_MockSep_0.skp, _0_MockSep_0.skp, _2.si, _0_MockSep_0.pyl, _1.si, _2_nrm.cfs, _3.fdt, _2.fdt, _3.fnm, _2_MockSep_0.doc, _2_MockSep_0.tii, _0.fdt, _0_nrm.cfs, _3_TestBloomFilteredLucene40Postings_0.blm, _3_MockSep_0.frq, _0_MockSep_0.tib, _0_MockSep_0.frq, _3_nrm.cfe, segments_2, _0_SimpleText_0.pst, _0_TestBloomFilteredLucene40Postings_0.prx, _1_MockSep_0.tib, _0.fnm, _1_MockSep_0.pos, _3_TestBloomFilteredLucene40Postings_0.frq, _3_MockSep_0.tib, _1_MockSep_0.frq, _1.fnm, _2.fdx, _0_TestBloomFilteredLucene40Postings_0.blm, _3.si, _1_MockSep_0.tii, _3_TestBloomFilteredLucene40Postings_0.tim, _1_TestBloomFilteredLucene40Postings_0.tim, _0.si, _2_TestBloomFilteredLucene40Postings_0.prx, _3_MockSep_0.pos, _1_MockSep_0.skp, _0_MockSep_0.tii, _1_MockSep_0.doc, _0_MockSep_0.doc, _0_TestBloomFilteredLucene40Postings_0.tim, _3_MockSep_0.pyl, _1_MockSep_0.pyl, _1_TestBloomFilteredLucene40Postings_0.tip, _0_TestBloomFilteredLucene40Postings_0.tip, _3_TestBloomFilteredLucene40Postings_0.prx, _0_nrm.cfe, _1_TestBloomFilteredLucene40Postings_0.frq, _1_nrm.cfs, _1_TestBloomFilteredLucene40Postings_0.prx, _0_MockSep_0.pos, _3_TestBloomFilteredLucene40Postings_0.tip, _2_SimpleText_0.pst, _3_SimpleText_0.pst, _2_MockSep_0.pos, _1_TestBloomFilteredLucene40Postings_0.blm, _0.fdx, _1_SimpleText_0.pst, _3.fdx, _1.fdx, _2_TestBloomFilteredLucene40Postings_0.tim, _2_MockSep_0.skp, _2.fnm, _1_nrm.cfe, _1.fdt, _2_TestBloomFilteredLucene40Postings_0.tip, _2_TestBloomFilteredLucene40Postings_0.frq, _0_TestBloomFilteredLucene40Postings_0.frq, _2_MockSep_0.pyl, _3_nrm.cfs]
[junit4:junit4]   2> 2355 T2129 oasc.SolrCore.registerSearcher [collection1] Registered new searcher Searcher@7a741626 main{StandardDirectoryReader(segments_2:13:nrt _0(5.0):C10 _1(5.0):C34 _2(5.0):C11 _3(5.0):C5)}
[junit4:junit4]   2> 2355 T2123 C140 oasu.DirectUpdateHandler2.commit end_commit_flush
[junit4:junit4]   2> 2356 T2125 C140 oasu.DirectUpdateHandler2.commit start commit{flags=0,_version_=0,optimize=false,openSearcher=true,waitSearcher=true,expungeDeletes=false,softCommit=false}
[junit4:junit4]   2> 2356 T2123 C140 UPDATE [collection1] webapp=/solr path=/update params={waitSearcher=true&softCommit=false&expungeDeletes=false&version=2&wt=javabin&commit=true} {add=[5 (1413131702374498304), 6 (1413131702375546880), 7 (1413131702376595456), 8 (1413131702376595457), 9 (1413131702376595458), 12 (1413131702376595459), 13 (1413131702376595460), 14 (1413131702377644032), 17 (1413131702377644033), 18 (1413131702377644034)],commit=} 0 85
[junit4:junit4]   2> 2363 T2105 C138 oasc.SolrDeletionPolicy.updateCommits newest commit = 2
[junit4:junit4]   2> 2367 T2096 C137 oasc.SolrDeletionPolicy.onCommit SolrDeletionPolicy.onCommit: commits:num=2
[junit4:junit4]   2> 		commit{dir=MockDirWrapper(org.apache.lucene.store.RAMDirectory@499000bb lockFactory=org.apache.lucene.store.NativeFSLockFactory@36ba2cc3),segFN=segments_7,generation=7,filenames=[_5_MockSep_0.tii, _5.fnm, _3_MockSep_0.tii, _4_MockSep_0.doc, _4_MockSep_0.frq, _2_nrm.cfe, _3_MockSep_0.doc, _5_TestBloomFilteredLucene40Postings_0.tim, _4_MockSep_0.skp, _5_MockSep_0.skp, _2_MockSep_0.frq, _2_MockSep_0.tib, _2_TestBloomFilteredLucene40Postings_0.blm, _3_MockSep_0.skp, _2.si, _1.si, _2_nrm.cfs, _4.fdx, _3.fdt, _5_SimpleText_0.pst, _2.fdt, _5_TestBloomFilteredLucene40Postings_0.frq, _4_MockSep_0.tii, _3.fnm, _2_MockSep_0.doc, _4_nrm.cfe, _2_MockSep_0.tii, _5_MockSep_0.pos, _3_TestBloomFilteredLucene40Postings_0.blm, _3_MockSep_0.frq, _5_nrm.cfs, _5_MockSep_0.tib, _3_nrm.cfe, _4_MockSep_0.pos, _1_MockSep_0.tib, _1_MockSep_0.pos, _5_MockSep_0.doc, _4_TestBloomFilteredLucene40Postings_0.prx, _3_TestBloomFilteredLucene40Postings_0.frq, _4.fnm, _3_MockSep_0.tib, _5.fdt, _1_MockSep_0.frq, _1.fnm, _2.fdx, _5_TestBloomFilteredLucene40Postings_0.tip, _3.si, _1_MockSep_0.tii, _3_TestBloomFilteredLucene40Postings_0.tim, _5_TestBloomFilteredLucene40Postings_0.prx, _4_TestBloomFilteredLucene40Postings_0.tim, segments_7, _1_TestBloomFilteredLucene40Postings_0.tim, _4_TestBloomFilteredLucene40Postings_0.blm, _2_TestBloomFilteredLucene40Postings_0.prx, _1_MockSep_0.skp, _3_MockSep_0.pos, _5.fdx, _1_MockSep_0.doc, _5_MockSep_0.pyl, _4.fdt, _4_TestBloomFilteredLucene40Postings_0.tip, _4_SimpleText_0.pst, _3_MockSep_0.pyl, _1_MockSep_0.pyl, _5.si, _1_TestBloomFilteredLucene40Postings_0.tip, _1_TestBloomFilteredLucene40Postings_0.frq, _3_TestBloomFilteredLucene40Postings_0.prx, _1_TestBloomFilteredLucene40Postings_0.prx, _1_nrm.cfs, _3_TestBloomFilteredLucene40Postings_0.tip, _4_MockSep_0.pyl, _2_SimpleText_0.pst, _3_SimpleText_0.pst, _4_TestBloomFilteredLucene40Postings_0.frq, _2_MockSep_0.pos, _1_TestBloomFilteredLucene40Postings_0.blm, _1_SimpleText_0.pst, _3.fdx, _4_nrm.cfs, _2_TestBloomFilteredLucene40Postings_0.tim, _1.fdx, _5_nrm.cfe, _2_MockSep_0.skp, _2.fnm, _1_nrm.cfe, _4.si, _1.fdt, _5_TestBloomFilteredLucene40Postings_0.blm, _2_TestBloomFilteredLucene40Postings_0.tip, _2_TestBloomFilteredLucene40Postings_0.frq, _5_MockSep_0.frq, _2_MockSep_0.pyl, _3_nrm.cfs, _4_MockSep_0.tib]
[junit4:junit4]   2> 		commit{dir=MockDirWrapper(org.apache.lucene.store.RAMDirectory@499000bb lockFactory=org.apache.lucene.store.NativeFSLockFactory@36ba2cc3),segFN=segments_8,generation=8,filenames=[_c_nrm.cfe, _5_MockSep_0.tii, _6_TestBloomFilteredLucene40Postings_0.frq, _a.fnm, _9_TestBloomFilteredLucene40Postings_0.tim, _7_TestBloomFilteredLucene40Postings_0.prx, _b_TestBloomFilteredLucene40Postings_0.frq, _5_TestBloomFilteredLucene40Postings_0.tim, _4_MockSep_0.skp, _2_MockSep_0.frq, _e_MockSep_0.doc, _b_nrm.cfe, _3.fdt, _9_MockSep_0.tii, _9_TestBloomFilteredLucene40Postings_0.blm, _2.fdt, _2_MockSep_0.tii, _8_MockSep_0.pyl, _7_TestBloomFilteredLucene40Postings_0.tip, _9_MockSep_0.frq, _e_MockSep_0.tii, _3_nrm.cfe, _5_MockSep_0.doc, _9_TestBloomFilteredLucene40Postings_0.prx, _a_nrm.cfs, _4.fnm, _b.fnm, _1.fnm, _9_MockSep_0.skp, _b_MockSep_0.frq, _d_nrm.cfs, _5_TestBloomFilteredLucene40Postings_0.prx, _4_TestBloomFilteredLucene40Postings_0.tim, _d.si, _4_TestBloomFilteredLucene40Postings_0.blm, _9.fdx, _5_MockSep_0.pyl, _e_nrm.cfe, _b_TestBloomFilteredLucene40Postings_0.tip, _c_TestBloomFilteredLucene40Postings_0.tim, _7_nrm.cfe, _1_TestBloomFilteredLucene40Postings_0.tip, _1_TestBloomFilteredLucene40Postings_0.frq, _a_TestBloomFilteredLucene40Postings_0.tim, _a_MockSep_0.tii, _b_SimpleText_0.pst, _3_TestBloomFilteredLucene40Postings_0.tip, _3_SimpleText_0.pst, _7_TestBloomFilteredLucene40Postings_0.blm, _a.fdx, _c.si, _c_TestBloomFilteredLucene40Postings_0.frq, _6_SimpleText_0.pst, _a_MockSep_0.pyl, _e.fnm, _2.fnm, _1_nrm.cfe, _d_MockSep_0.frq, _9_TestBloomFilteredLucene40Postings_0.tip, _5_MockSep_0.frq, _c.fdt, _a_TestBloomFilteredLucene40Postings_0.tip, _3_nrm.cfs, _4_MockSep_0.tib, _8_TestBloomFilteredLucene40Postings_0.tip, _d.fdt, _d_MockSep_0.doc, _e_TestBloomFilteredLucene40Postings_0.tim, _7_MockSep_0.pos, _b_MockSep_0.pyl, _a_MockSep_0.frq, _2.si, _b_MockSep_0.skp, _8.si, _4.fdx, _e_SimpleText_0.pst, _5_SimpleText_0.pst, _6_nrm.cfs, _3.fnm, _e_TestBloomFilteredLucene40Postings_0.prx, _5_MockSep_0.pos, _3_TestBloomFilteredLucene40Postings_0.blm, _e_TestBloomFilteredLucene40Postings_0.blm, _b_nrm.cfs, _6_MockSep_0.frq, segments_8, _4_MockSep_0.pos, _6.fdt, _6_TestBloomFilteredLucene40Postings_0.tip, _d_MockSep_0.tii, _1_MockSep_0.pos, _4_TestBloomFilteredLucene40Postings_0.prx, _e.si, _a_MockSep_0.tib, _5.fdt, _e_MockSep_0.skp, _e_TestBloomFilteredLucene40Postings_0.frq, _d_MockSep_0.pos, _9_nrm.cfs, _8.fdt, _e_MockSep_0.pyl, _d_TestBloomFilteredLucene40Postings_0.blm, _6_MockSep_0.tii, _2_TestBloomFilteredLucene40Postings_0.prx, _8_TestBloomFilteredLucene40Postings_0.blm, _8_MockSep_0.skp, _a_MockSep_0.doc, _5.fdx, _7_TestBloomFilteredLucene40Postings_0.frq, _c_TestBloomFilteredLucene40Postings_0.blm, _4_TestBloomFilteredLucene40Postings_0.tip, _4_SimpleText_0.pst, _6_TestBloomFilteredLucene40Postings_0.blm, _d_TestBloomFilteredLucene40Postings_0.prx, _1_MockSep_0.pyl, _3_TestBloomFilteredLucene40Postings_0.prx, _8_nrm.cfe, _e_MockSep_0.tib, _c.fnm, _2_MockSep_0.pos, _b_TestBloomFilteredLucene40Postings_0.prx, _b_MockSep_0.doc, _6_MockSep_0.doc, _e_nrm.cfs, _8.fnm, _c_MockSep_0.tib, _c_MockSep_0.pyl, _4.si, _1.fdt, _5_TestBloomFilteredLucene40Postings_0.blm, _a_nrm.cfe, _7_SimpleText_0.pst, _2_TestBloomFilteredLucene40Postings_0.frq, _6.fnm, _d_MockSep_0.skp, _4_MockSep_0.doc, _4_MockSep_0.frq, _2_nrm.cfe, _5_MockSep_0.skp, _c_TestBloomFilteredLucene40Postings_0.prx, _7_MockSep_0.tib, _3_MockSep_0.skp, _9.fnm, _2_nrm.cfs, _7.si, _8_TestBloomFilteredLucene40Postings_0.frq, _a_TestBloomFilteredLucene40Postings_0.prx, _5_TestBloomFilteredLucene40Postings_0.frq, _a_MockSep_0.skp, _2_MockSep_0.doc, _8_MockSep_0.tii, _4_nrm.cfe, _8_TestBloomFilteredLucene40Postings_0.prx, _7_MockSep_0.pyl, _c_SimpleText_0.pst, _d_TestBloomFilteredLucene40Postings_0.tim, _7.fdt, _6_TestBloomFilteredLucene40Postings_0.prx, _6_nrm.cfe, _5_nrm.cfs, _e_MockSep_0.pos, _b.fdx, _b_MockSep_0.tii, _a_SimpleText_0.pst, _b_TestBloomFilteredLucene40Postings_0.blm, _3_TestBloomFilteredLucene40Postings_0.frq, _b.fdt, _3_MockSep_0.tib, _b_MockSep_0.pos, _8_TestBloomFilteredLucene40Postings_0.tim, _1_MockSep_0.skp, _7_MockSep_0.tii, _c_MockSep_0.tii, _7.fdx, _8_SimpleText_0.pst, _e.fdx, _7.fnm, _5.si, _c_MockSep_0.frq, _d_nrm.cfe, _2_SimpleText_0.pst, _e.fdt, _4_TestBloomFilteredLucene40Postings_0.frq, _6_MockSep_0.tib, _3.fdx, _2_TestBloomFilteredLucene40Postings_0.tim, _1.fdx, _5_nrm.cfe, _7_TestBloomFilteredLucene40Postings_0.tim, _7_MockSep_0.frq, _d_MockSep_0.pyl, _7_MockSep_0.skp, _b_MockSep_0.tib, _6.fdx, _6_TestBloomFilteredLucene40Postings_0.tim, _2_TestBloomFilteredLucene40Postings_0.tip, _c_MockSep_0.skp, _c_MockSep_0.pos, _9.si, _7_MockSep_0.doc, _5.fnm, _3_MockSep_0.tii, _a_MockSep_0.pos, _3_MockSep_0.doc, _2_MockSep_0.tib, _2_TestBloomFilteredLucene40Postings_0.blm, _1.si, _e_MockSep_0.frq, _4_MockSep_0.tii, _6_MockSep_0.pyl, _d_TestBloomFilteredLucene40Postings_0.tip, _3_MockSep_0.frq, _9_SimpleText_0.pst, _9_MockSep_0.doc, _5_MockSep_0.tib, _9_TestBloomFilteredLucene40Postings_0.frq, _1_MockSep_0.tib, _1_MockSep_0.frq, _6.si, _c_MockSep_0.doc, _2.fdx, _7_nrm.cfs, _5_TestBloomFilteredLucene40Postings_0.tip, _c.fdx, _9.fdt, _3.si, _1_MockSep_0.tii, _9_MockSep_0.pos, _b.si, _3_TestBloomFilteredLucene40Postings_0.tim, _1_TestBloomFilteredLucene40Postings_0.tim, _3_MockSep_0.pos, _1_MockSep_0.doc, _4.fdt, _d_MockSep_0.tib, _b_TestBloomFilteredLucene40Postings_0.tim, _3_MockSep_0.pyl, _9_nrm.cfe, _c_nrm.cfs, _8_nrm.cfs, _a_TestBloomFilteredLucene40Postings_0.frq, _1_TestBloomFilteredLucene40Postings_0.prx, _1_nrm.cfs, _a.si, _8_MockSep_0.frq, _d.fdx, _d.fnm, _4_MockSep_0.pyl, _9_MockSep_0.pyl, _8_MockSep_0.tib, _9_MockSep_0.tib, _a_TestBloomFilteredLucene40Postings_0.blm, _d_SimpleText_0.pst, _1_TestBloomFilteredLucene40Postings_0.blm, _8_MockSep_0.doc, _1_SimpleText_0.pst, _8.fdx, _4_nrm.cfs, _d_TestBloomFilteredLucene40Postings_0.frq, _2_MockSep_0.skp, _e_TestBloomFilteredLucene40Postings_0.tip, _6_MockSep_0.skp, _6_MockSep_0.pos, _a.fdt, _c_TestBloomFilteredLucene40Postings_0.tip, _8_MockSep_0.pos, _2_MockSep_0.pyl]
[junit4:junit4]   2> 2369 T2096 C137 oasc.SolrDeletionPolicy.updateCommits newest commit = 8
[junit4:junit4]   2> 2389 T2105 C138 oass.SolrIndexSearcher.<init> Opening Searcher@66e23f1c main
[junit4:junit4]   2> 2389 T2105 C138 oass.SolrIndexSearcher.getIndexDir WARNING WARNING: Directory impl does not support setting indexDir: org.apache.lucene.store.MockDirectoryWrapper
[junit4:junit4]   2> 2390 T2109 oasc.SolrCore.registerSearcher [collection1] Registered new searcher Searcher@66e23f1c main{StandardDirectoryReader(segments_2:17:nrt _0(5.0):C45 _1(5.0):C3 _2(5.0):C9 _3(5.0):C3 _4(5.0):C31 _5(5.0):C49 _6(5.0):C7 _7(5.0):C3)}
[junit4:junit4]   2> 2390 T2105 C138 oasu.DirectUpdateHandler2.commit end_commit_flush
[junit4:junit4]   2> 2390 T2105 C138 UPDATE [collection1] webapp=/solr path=/update params={waitSearcher=true&softCommit=false&expungeDeletes=false&version=2&wt=javabin&commit=true} {add=[45 (1413131702387081216), 47 (1413131702388129793), 48 (1413131702389178368), 50 (1413131702389178370), 56 (1413131702389178372), 59 (1413131702389178374), 61 (1413131702390226944), 62 (1413131702390226946), 66 (1413131702390226948), 67 (1413131702390226949)],commit=} 0 107
[junit4:junit4]   2> 2390 T2107 C138 oasu.DirectUpdateHandler2.commit start commit{flags=0,_version_=0,optimize=false,openSearcher=true,waitSearcher=true,expungeDeletes=false,softCommit=false}
[junit4:junit4]   2> 2392 T2125 C140 oasc.SolrDeletionPolicy.onCommit SolrDeletionPolicy.onCommit: commits:num=2
[junit4:junit4]   2> 		commit{dir=MockDirWrapper(org.apache.lucene.store.RAMDirectory@343b3df1 lockFactory=org.apache.lucene.store.NativeFSLockFactory@7622bcb7),segFN=segments_2,generation=2,filenames=[_0.si, _0.fdx, _0_MockSep_0.tii, _0_MockSep_0.tib, _0_MockSep_0.frq, _0_MockSep_0.doc, _0_TestBloomFilteredLucene40Postings_0.tim, segments_2, _0_SimpleText_0.pst, _0_MockSep_0.skp, _0_TestBloomFilteredLucene40Postings_0.prx, _0_MockSep_0.pyl, _0.fnm, _0_TestBloomFilteredLucene40Postings_0.tip, _0_nrm.cfe, _0_TestBloomFilteredLucene40Postings_0.frq, _0_MockSep_0.pos, _0.fdt, _0_TestBloomFilteredLucene40Postings_0.blm, _0_nrm.cfs]
[junit4:junit4]   2> 		commit{dir=MockDirWrapper(org.apache.lucene.store.RAMDirectory@343b3df1 lockFactory=org.apache.lucene.store.NativeFSLockFactory@7622bcb7),segFN=segments_3,generation=3,filenames=[_6_TestBloomFilteredLucene40Postings_0.frq, _5_MockSep_0.tii, _4_MockSep_0.doc, _4_MockSep_0.frq, _7_TestBloomFilteredLucene40Postings_0.prx, _9_TestBloomFilteredLucene40Postings_0.tim, _2_nrm.cfe, _4_MockSep_0.skp, _5_TestBloomFilteredLucene40Postings_0.tim, _2_MockSep_0.frq, _5_MockSep_0.skp, _7_MockSep_0.tib, _9.fnm, _3_MockSep_0.skp, _2_nrm.cfs, _8_TestBloomFilteredLucene40Postings_0.frq, _7.si, _9_MockSep_0.tii, segments_3, _3.fdt, _9_TestBloomFilteredLucene40Postings_0.blm, _2.fdt, _5_TestBloomFilteredLucene40Postings_0.frq, _8_MockSep_0.tii, _2_MockSep_0.doc, _8_TestBloomFilteredLucene40Postings_0.prx, _4_nrm.cfe, _0.fdt, _2_MockSep_0.tii, _7_MockSep_0.pyl, _8_MockSep_0.pyl, _7_TestBloomFilteredLucene40Postings_0.tip, _7.fdt, _6_TestBloomFilteredLucene40Postings_0.prx, _6_nrm.cfe, _9_MockSep_0.frq, _5_nrm.cfs, _0_MockSep_0.tib, _3_nrm.cfe, _9_TestBloomFilteredLucene40Postings_0.prx, _3_TestBloomFilteredLucene40Postings_0.frq, _5_MockSep_0.doc, _4.fnm, _3_MockSep_0.tib, _1.fnm, _9_MockSep_0.skp, _4_TestBloomFilteredLucene40Postings_0.tim, _5_TestBloomFilteredLucene40Postings_0.prx, _8_TestBloomFilteredLucene40Postings_0.tim, _4_TestBloomFilteredLucene40Postings_0.blm, _0_MockSep_0.tii, _1_MockSep_0.skp, _7_MockSep_0.tii, _9.fdx, _7.fdx, _0_MockSep_0.doc, _8_SimpleText_0.pst, _5_MockSep_0.pyl, _7_nrm.cfe, _7.fnm, _5.si, _1_TestBloomFilteredLucene40Postings_0.tip, _0_TestBloomFilteredLucene40Postings_0.tip, _1_TestBloomFilteredLucene40Postings_0.frq, _3_TestBloomFilteredLucene40Postings_0.tip, _2_SimpleText_0.pst, _7_TestBloomFilteredLucene40Postings_0.blm, _3_SimpleText_0.pst, _4_TestBloomFilteredLucene40Postings_0.frq, _6_SimpleText_0.pst, _6_MockSep_0.tib, _3.fdx, _2_TestBloomFilteredLucene40Postings_0.tim, _1.fdx, _7_TestBloomFilteredLucene40Postings_0.tim, _5_nrm.cfe, _7_MockSep_0.frq, _2.fnm, _7_MockSep_0.skp, _6.fdx, _1_nrm.cfe, _6_TestBloomFilteredLucene40Postings_0.tim, _9_TestBloomFilteredLucene40Postings_0.tip, _2_TestBloomFilteredLucene40Postings_0.tip, _5_MockSep_0.frq, _3_nrm.cfs, _4_MockSep_0.tib, _9.si, _8_TestBloomFilteredLucene40Postings_0.tip, _7_MockSep_0.doc, _3_MockSep_0.tii, _5.fnm, _3_MockSep_0.doc, _7_MockSep_0.pos, _2_MockSep_0.tib, _2_TestBloomFilteredLucene40Postings_0.blm, _0_MockSep_0.skp, _2.si, _0_MockSep_0.pyl, _8.si, _1.si, _4.fdx, _5_SimpleText_0.pst, _6_nrm.cfs, _4_MockSep_0.tii, _3.fnm, _6_MockSep_0.pyl, _0_nrm.cfs, _5_MockSep_0.pos, _3_TestBloomFilteredLucene40Postings_0.blm, _3_MockSep_0.frq, _9_SimpleText_0.pst, _9_MockSep_0.doc, _6_MockSep_0.frq, _0_MockSep_0.frq, _5_MockSep_0.tib, _9_TestBloomFilteredLucene40Postings_0.frq, _0_SimpleText_0.pst, _4_MockSep_0.pos, _6.fdt, _6_TestBloomFilteredLucene40Postings_0.tip, _1_MockSep_0.tib, _0_TestBloomFilteredLucene40Postings_0.prx, _0.fnm, _1_MockSep_0.pos, _4_TestBloomFilteredLucene40Postings_0.prx, _6.si, _1_MockSep_0.frq, _5.fdt, _7_nrm.cfs, _2.fdx, _5_TestBloomFilteredLucene40Postings_0.tip, _9_nrm.cfs, _9.fdt, _0_TestBloomFilteredLucene40Postings_0.blm, _8.fdt, _9_MockSep_0.pos, _1_MockSep_0.tii, _3.si, _3_TestBloomFilteredLucene40Postings_0.tim, _6_MockSep_0.tii, _0.si, _1_TestBloomFilteredLucene40Postings_0.tim, _2_TestBloomFilteredLucene40Postings_0.prx, _8_TestBloomFilteredLucene40Postings_0.blm, _3_MockSep_0.pos, _8_MockSep_0.skp, _1_MockSep_0.doc, _5.fdx, _7_TestBloomFilteredLucene40Postings_0.frq, _4.fdt, _4_TestBloomFilteredLucene40Postings_0.tip, _4_SimpleText_0.pst, _6_TestBloomFilteredLucene40Postings_0.blm, _0_TestBloomFilteredLucene40Postings_0.tim, _3_MockSep_0.pyl, _1_MockSep_0.pyl, _9_nrm.cfe, _8_nrm.cfs, _0_nrm.cfe, _3_TestBloomFilteredLucene40Postings_0.prx, _8_nrm.cfe, _1_TestBloomFilteredLucene40Postings_0.prx, _1_nrm.cfs, _8_MockSep_0.frq, _0_MockSep_0.pos, _4_MockSep_0.pyl, _8_MockSep_0.tib, _9_MockSep_0.pyl, _2_MockSep_0.pos, _9_MockSep_0.tib, _8_MockSep_0.doc, _0.fdx, _1_TestBloomFilteredLucene40Postings_0.blm, _8.fdx, _6_MockSep_0.doc, _1_SimpleText_0.pst, _8.fnm, _4_nrm.cfs, _2_MockSep_0.skp, _6_MockSep_0.skp, _6_MockSep_0.pos, _4.si, _1.fdt, _5_TestBloomFilteredLucene40Postings_0.blm, _7_SimpleText_0.pst, _0_TestBloomFilteredLucene40Postings_0.frq, _2_TestBloomFilteredLucene40Postings_0.frq, _8_MockSep_0.pos, _2_MockSep_0.pyl, _6.fnm]
[junit4:junit4]   2> 2392 T2096 C137 oass.SolrIndexSearcher.<init> Opening Searcher@79ee69cd main
[junit4:junit4]   2> 2393 T2125 C140 oasc.SolrDeletionPolicy.updateCommits newest commit = 3
[junit4:junit4]   2> 2393 T2096 C137 oass.SolrIndexSearcher.getIndexDir WARNING WARNING: Directory impl does not support setting indexDir: org.apache.lucene.store.MockDirectoryWrapper
[junit4:junit4]   2> 2393 T2099 oasc.SolrCore.registerSearcher [collection1] Registered new searcher Searcher@79ee69cd main{StandardDirectoryReader(segments_8:43:nrt _1(5.0):C2 _2(5.0):C12 _3(5.0):C38 _4(5.0):C16 _5(5.0):C7 _6(5.0):C1 _e(5.0):C14 _9(5.0):C10 _7(5.0):C5 _8(5.0):C10 _a(5.0):C10 _b(5.0):C10 _c(5.0):C10 _d(5.0):C10 _i(5.0):C4 _g(5.0):C21 _h(5.0):C2 _f(5.0):C1)}
[junit4:junit4]   2> 2394 T2096 C137 oasu.DirectUpdateHandler2.commit end_commit_flush
[junit4:junit4]   2> 2394 T2096 C137 UPDATE [collection1] webapp=/solr path=/update params={waitSearcher=true&softCommit=false&expungeDeletes=false&version=2&wt=javabin&commit=true} {add=[62 (1413131702388129794), 63 (1413131702388129795), 64 (1413131702388129796), 65 (1413131702389178368), 66 (1413131702389178369), 67 (1413131702389178370), 72 (1413131702389178371), 73 (1413131702389178372), 75 (1413131702389178373), 76 (1413131702390226944)],commit=} 0 110
[junit4:junit4]   2> 2394 T2097 C137 oasu.DirectUpdateHandler2.commit start commit{flags=0,_version_=0,optimize=false,openSearcher=true,waitSearcher=true,expungeDeletes=false,softCommit=false}
[junit4:junit4]   2> 2407 T2107 C138 oasc.SolrDeletionPolicy.onCommit SolrDeletionPolicy.onCommit: commits:num=2
[junit4:junit4]   2> 		commit{dir=MockDirWrapper(org.apache.lucene.store.RAMDirectory@4785ab0d lockFactory=org.apache.lucene.store.NativeFSLockFactory@73dd6307),segFN=segments_2,generation=2,filenames=[_3_MockSep_0.tii, _3_MockSep_0.doc, _2_nrm.cfe, _2_MockSep_0.frq, _2_MockSep_0.tib, _2_TestBloomFilteredLucene40Postings_0.blm, _3_MockSep_0.skp, _0_MockSep_0.skp, _2.si, _0_MockSep_0.pyl, _1.si, _2_nrm.cfs, _3.fdt, _2.fdt, _3.fnm, _2_MockSep_0.doc, _2_MockSep_0.tii, _0.fdt, _0_nrm.cfs, _3_TestBloomFilteredLucene40Postings_0.blm, _3_MockSep_0.frq, _0_MockSep_0.tib, _0_MockSep_0.frq, _3_nrm.cfe, segments_2, _0_SimpleText_0.pst, _0_TestBloomFilteredLucene40Postings_0.prx, _1_MockSep_0.tib, _0.fnm, _1_MockSep_0.pos, _3_TestBloomFilteredLucene40Postings_0.frq, _3_MockSep_0.tib, _1_MockSep_0.frq, _1.fnm, _2.fdx, _0_TestBloomFilteredLucene40Postings_0.blm, _3.si, _1_MockSep_0.tii, _3_TestBloomFilteredLucene40Postings_0.tim, _1_TestBloomFilteredLucene40Postings_0.tim, _0.si, _2_TestBloomFilteredLucene40Postings_0.prx, _3_MockSep_0.pos, _1_MockSep_0.skp, _0_MockSep_0.tii, _1_MockSep_0.doc, _0_MockSep_0.doc, _0_TestBloomFilteredLucene40Postings_0.tim, _3_MockSep_0.pyl, _1_MockSep_0.pyl, _1_TestBloomFilteredLucene40Postings_0.tip, _0_TestBloomFilteredLucene40Postings_0.tip, _3_TestBloomFilteredLucene40Postings_0.prx, _0_nrm.cfe, _1_TestBloomFilteredLucene40Postings_0.frq, _1_nrm.cfs, _1_TestBloomFilteredLucene40Postings_0.prx, _0_MockSep_0.pos, _3_TestBloomFilteredLucene40Postings_0.tip, _2_SimpleText_0.pst, _3_SimpleText_0.pst, _2_MockSep_0.pos, _1_TestBloomFilteredLucene40Postings_0.blm, _0.fdx, _1_SimpleText_0.pst, _3.fdx, _1.fdx, _2_TestBloomFilteredLucene40Postings_0.tim, _2_MockSep_0.skp, _2.fnm, _1_nrm.cfe, _1.fdt, _2_TestBloomFilteredLucene40Postings_0.tip, _2_TestBloomFilteredLucene40Postings_0.frq, _0_TestBloomFilteredLucene40Postings_0.frq, _2_MockSep_0.pyl, _3_nrm.cfs]
[junit4:junit4]   2> 		commit{dir=MockDirWrapper(org.apache.lucene.store.RAMDirectory@4785ab0d lockFactory=org.apache.lucene.store.NativeFSLockFactory@73dd6307),segFN=segments_3,generation=3,filenames=[_6_TestBloomFilteredLucene40Postings_0.frq, _5_MockSep_0.tii, _4_MockSep_0.doc, _7_TestBloomFilteredLucene40Postings_0.prx, _2_nrm.cfe, _4_MockSep_0.frq, _5_TestBloomFilteredLucene40Postings_0.tim, _4_MockSep_0.skp, _5_MockSep_0.skp, _2_MockSep_0.frq, _7_MockSep_0.tib, _3_MockSep_0.skp, _2_nrm.cfs, _8_TestBloomFilteredLucene40Postings_0.frq, _7.si, segments_3, _3.fdt, _2.fdt, _5_TestBloomFilteredLucene40Postings_0.frq, _8_MockSep_0.tii, _2_MockSep_0.doc, _8_TestBloomFilteredLucene40Postings_0.prx, _0.fdt, _2_MockSep_0.tii, _4_nrm.cfe, _7_MockSep_0.pyl, _8_MockSep_0.pyl, _7_TestBloomFilteredLucene40Postings_0.tip, _7.fdt, _6_TestBloomFilteredLucene40Postings_0.prx, _6_nrm.cfe, _5_nrm.cfs, _0_MockSep_0.tib, _3_nrm.cfe, _5_MockSep_0.doc, _3_TestBloomFilteredLucene40Postings_0.frq, _3_MockSep_0.tib, _4.fnm, _1.fnm, _5_TestBloomFilteredLucene40Postings_0.prx, _4_TestBloomFilteredLucene40Postings_0.tim, _8_TestBloomFilteredLucene40Postings_0.tim, _4_TestBloomFilteredLucene40Postings_0.blm, _0_MockSep_0.tii, _1_MockSep_0.skp, _7_MockSep_0.tii, _7.fdx, _0_MockSep_0.doc, _8_SimpleText_0.pst, _5_MockSep_0.pyl, _7_nrm.cfe, _7.fnm, _5.si, _1_TestBloomFilteredLucene40Postings_0.tip, _0_TestBloomFilteredLucene40Postings_0.tip, _1_TestBloomFilteredLucene40Postings_0.frq, _3_TestBloomFilteredLucene40Postings_0.tip, _2_SimpleText_0.pst, _7_TestBloomFilteredLucene40Postings_0.blm, _3_SimpleText_0.pst, _6_SimpleText_0.pst, _4_TestBloomFilteredLucene40Postings_0.frq, _6_MockSep_0.tib, _3.fdx, _2_TestBloomFilteredLucene40Postings_0.tim, _1.fdx, _7_TestBloomFilteredLucene40Postings_0.tim, _5_nrm.cfe, _7_MockSep_0.frq, _2.fnm, _7_MockSep_0.skp, _6.fdx, _1_nrm.cfe, _6_TestBloomFilteredLucene40Postings_0.tim, _2_TestBloomFilteredLucene40Postings_0.tip, _5_MockSep_0.frq, _3_nrm.cfs, _4_MockSep_0.tib, _8_TestBloomFilteredLucene40Postings_0.tip, _7_MockSep_0.doc, _5.fnm, _3_MockSep_0.tii, _3_MockSep_0.doc, _7_MockSep_0.pos, _2_MockSep_0.tib, _2_TestBloomFilteredLucene40Postings_0.blm, _0_MockSep_0.skp, _2.si, _0_MockSep_0.pyl, _8.si, _1.si, _4.fdx, _5_SimpleText_0.pst, _6_nrm.cfs, _4_MockSep_0.tii, _3.fnm, _6_MockSep_0.pyl, _5_MockSep_0.pos, _0_nrm.cfs, _3_TestBloomFilteredLucene40Postings_0.blm, _3_MockSep_0.frq, _6_MockSep_0.frq, _5_MockSep_0.tib, _0_MockSep_0.frq, _0_SimpleText_0.pst, _6.fdt, _4_MockSep_0.pos, _6_TestBloomFilteredLucene40Postings_0.tip, _1_MockSep_0.tib, _0_TestBloomFilteredLucene40Postings_0.prx, _0.fnm, _1_MockSep_0.pos, _4_TestBloomFilteredLucene40Postings_0.prx, _6.si, _5.fdt, _1_MockSep_0.frq, _7_nrm.cfs, _2.fdx, _5_TestBloomFilteredLucene40Postings_0.tip, _0_TestBloomFilteredLucene40Postings_0.blm, _8.fdt, _1_MockSep_0.tii, _3.si, _3_TestBloomFilteredLucene40Postings_0.tim, _6_MockSep_0.tii, _0.si, _1_TestBloomFilteredLucene40Postings_0.tim, _2_TestBloomFilteredLucene40Postings_0.prx, _8_TestBloomFilteredLucene40Postings_0.blm, _3_MockSep_0.pos, _8_MockSep_0.skp, _5.fdx, _1_MockSep_0.doc, _7_TestBloomFilteredLucene40Postings_0.frq, _4_TestBloomFilteredLucene40Postings_0.tip, _4.fdt, _6_TestBloomFilteredLucene40Postings_0.blm, _0_TestBloomFilteredLucene40Postings_0.tim, _4_SimpleText_0.pst, _3_MockSep_0.pyl, _1_MockSep_0.pyl, _8_nrm.cfs, _0_nrm.cfe, _3_TestBloomFilteredLucene40Postings_0.prx, _8_nrm.cfe, _1_TestBloomFilteredLucene40Postings_0.prx, _1_nrm.cfs, _8_MockSep_0.frq, _0_MockSep_0.pos, _4_MockSep_0.pyl, _8_MockSep_0.tib, _2_MockSep_0.pos, _8_MockSep_0.doc, _0.fdx, _1_TestBloomFilteredLucene40Postings_0.blm, _8.fdx, _6_MockSep_0.doc, _1_SimpleText_0.pst, _8.fnm, _4_nrm.cfs, _2_MockSep_0.skp, _6_MockSep_0.skp, _6_MockSep_0.pos, _1.fdt, _4.si, _5_TestBloomFilteredLucene40Postings_0.blm, _7_SimpleText_0.pst, _0_TestBloomFilteredLucene40Postings_0.frq, _2_TestBloomFilteredLucene40Postings_0.frq, _8_MockSep_0.pos, _2_MockSep_0.pyl, _6.fnm]
[junit4:junit4]   2> 2408 T2107 C138 oasc.SolrDeletionPolicy.updateCommits newest commit = 3
[junit4:junit4]   2> 2409 T2113 C139 oass.SolrIndexSearcher.<init> Opening Searcher@65483b2b main
[junit4:junit4]   2> 2410 T2113 C139 oass.SolrIndexSearcher.getIndexDir WARNING WARNING: Directory impl does not support setting indexDir: org.apache.lucene.store.MockDirectoryWrapper
[junit4:junit4]   2> 2411 T2119 oasc.SolrCore.registerSearcher [collection1] Registered new searcher Searcher@65483b2b main{StandardDirectoryReader(segments_2:13:nrt _0(5.0):C10 _1(5.0):C48 _2(5.0):C21)}
[junit4:junit4]   2> 2411 T2113 C139 oasu.DirectUpdateHandler2.commit end_commit_flush
[junit4:junit4]   2> 2411 T2097 C137 oasc.SolrDeletionPolicy.onCommit SolrDeletionPolicy.onCommit: commits:num=2
[junit4:junit4]   2> 		commit{dir=MockDirWrapper(org.apache.lucene.store.RAMDirectory@499000bb lockFactory=org.apache.lucene.store.NativeFSLockFactory@36ba2cc3),segFN=segments_8,generation=8,filenames=[_c_nrm.cfe, _5_MockSep_0.tii, _6_TestBloomFilteredLucene40Postings_0.frq, _a.fnm, _9_TestBloomFilteredLucene40Postings_0.tim, _7_TestBloomFilteredLucene40Postings_0.prx, _b_TestBloomFilteredLucene40Postings_0.frq, _5_TestBloomFilteredLucene40Postings_0.tim, _4_MockSep_0.skp, _2_MockSep_0.frq, _e_MockSep_0.doc, _b_nrm.cfe, _3.fdt, _9_MockSep_0.tii, _9_TestBloomFilteredLucene40Postings_0.blm, _2.fdt, _2_MockSep_0.tii, _8_MockSep_0.pyl, _7_TestBloomFilteredLucene40Postings_0.tip, _9_MockSep_0.frq, _e_MockSep_0.tii, _3_nrm.cfe, _5_MockSep_0.doc, _9_TestBloomFilteredLucene40Postings_0.prx, _a_nrm.cfs, _4.fnm, _b.fnm, _1.fnm, _9_MockSep_0.skp, _b_MockSep_0.frq, _d_nrm.cfs, _5_TestBloomFilteredLucene40Postings_0.prx, _4_TestBloomFilteredLucene40Postings_0.tim, _d.si, _4_TestBloomFilteredLucene40Postings_0.blm, _9.fdx, _5_MockSep_0.pyl, _e_nrm.cfe, _b_TestBloomFilteredLucene40Postings_0.tip, _c_TestBloomFilteredLucene40Postings_0.tim, _7_nrm.cfe, _1_TestBloomFilteredLucene40Postings_0.tip, _1_TestBloomFilteredLucene40Postings_0.frq, _a_TestBloomFilteredLucene40Postings_0.tim, _a_MockSep_0.tii, _b_SimpleText_0.pst, _3_TestBloomFilteredLucene40Postings_0.tip, _3_SimpleText_0.pst, _7_TestBloomFilteredLucene40Postings_0.blm, _a.fdx, _c.si, _c_TestBloomFilteredLucene40Postings_0.frq, _6_SimpleText_0.pst, _a_MockSep_0.pyl, _e.fnm, _2.fnm, _1_nrm.cfe, _d_MockSep_0.frq, _9_TestBloomFilteredLucene40Postings_0.tip, _5_MockSep_0.frq, _c.fdt, _a_TestBloomFilteredLucene40Postings_0.tip, _3_nrm.cfs, _4_MockSep_0.tib, _8_TestBloomFilteredLucene40Postings_0.tip, _d.fdt, _d_MockSep_0.doc, _e_TestBloomFilteredLucene40Postings_0.tim, _7_MockSep_0.pos, _b_MockSep_0.pyl, _a_MockSep_0.frq, _2.si, _b_MockSep_0.skp, _8.si, _4.fdx, _e_SimpleText_0.pst, _5_SimpleText_0.pst, _6_nrm.cfs, _3.fnm, _e_TestBloomFilteredLucene40Postings_0.prx, _5_MockSep_0.pos, _3_TestBloomFilteredLucene40Postings_0.blm, _e_TestBloomFilteredLucene40Postings_0.blm, _b_nrm.cfs, _6_MockSep_0.frq, segments_8, _4_MockSep_0.pos, _6.fdt, _6_TestBloomFilteredLucene40Postings_0.tip, _d_MockSep_0.tii, _1_MockSep_0.pos, _4_TestBloomFilteredLucene40Postings_0.prx, _e.si, _a_MockSep_0.tib, _5.fdt, _e_MockSep_0.skp, _e_TestBloomFilteredLucene40Postings_0.frq, _d_MockSep_0.pos, _9_nrm.cfs, _8.fdt, _e_MockSep_0.pyl, _d_TestBloomFilteredLucene40Postings_0.blm, _6_MockSep_0.tii, _2_TestBloomFilteredLucene40Postings_0.prx, _8_TestBloomFilteredLucene40Postings_0.blm, _8_MockSep_0.skp, _a_MockSep_0.doc, _5.fdx, _7_TestBloomFilteredLucene40Postings_0.frq, _c_TestBloomFilteredLucene40Postings_0.blm, _4_TestBloomFilteredLucene40Postings_0.tip, _4_SimpleText_0.pst, _6_TestBloomFilteredLucene40Postings_0.blm, _d_TestBloomFilteredLucene40Postings_0.prx, _1_MockSep_0.pyl, _3_TestBloomFilteredLucene40Postings_0.prx, _8_nrm.cfe, _e_MockSep_0.tib, _c.fnm, _2_MockSep_0.pos, _b_TestBloomFilteredLucene40Postings_0.prx, _b_MockSep_0.doc, _6_MockSep_0.doc, _e_nrm.cfs, _8.fnm, _c_MockSep_0.tib, _c_MockSep_0.pyl, _4.si, _1.fdt, _5_TestBloomFilteredLucene40Postings_0.blm, _a_nrm.cfe, _7_SimpleText_0.pst, _2_TestBloomFilteredLucene40Postings_0.frq, _6.fnm, _d_MockSep_0.skp, _4_MockSep_0.doc, _4_MockSep_0.frq, _2_nrm.cfe, _5_MockSep_0.skp, _c_TestBloomFilteredLucene40Postings_0.prx, _7_MockSep_0.tib, _3_MockSep_0.skp, _9.fnm, _2_nrm.cfs, _7.si, _8_TestBloomFilteredLucene40Postings_0.frq, _a_TestBloomFilteredLucene40Postings_0.prx, _5_TestBloomFilteredLucene40Postings_0.frq, _a_MockSep_0.skp, _2_MockSep_0.doc, _8_MockSep_0.tii, _4_nrm.cfe, _8_TestBloomFilteredLucene40Postings_0.prx, _7_MockSep_0.pyl, _c_SimpleText_0.pst, _d_TestBloomFilteredLucene40Postings_0.tim, _7.fdt, _6_TestBloomFilteredLucene40Postings_0.prx, _6_nrm.cfe, _5_nrm.cfs, _e_MockSep_0.pos, _b.fdx, _b_MockSep_0.tii, _a_SimpleText_0.pst, _b_TestBloomFilteredLucene40Postings_0.blm, _3_TestBloomFilteredLucene40Postings_0.frq, _b.fdt, _3_MockSep_0.tib, _b_MockSep_0.pos, _8_TestBloomFilteredLucene40Postings_0.tim, _1_MockSep_0.skp, _7_MockSep_0.tii, _c_MockSep_0.tii, _7.fdx, _8_SimpleText_0.pst, _e.fdx, _7.fnm, _5.si, _c_MockSep_0.frq, _d_nrm.cfe, _2_SimpleText_0.pst, _e.fdt, _4_TestBloomFilteredLucene40Postings_0.frq, _6_MockSep_0.tib, _3.fdx, _2_TestBloomFilteredLucene40Postings_0.tim, _1.fdx, _5_nrm.cfe, _7_TestBloomFilteredLucene40Postings_0.tim, _7_MockSep_0.frq, _d_MockSep_0.pyl, _7_MockSep_0.skp, _b_MockSep_0.tib, _6.fdx, _6_TestBloomFilteredLucene40Postings_0.tim, _2_TestBloomFilteredLucene40Postings_0.tip, _c_MockSep_0.skp, _c_MockSep_0.pos, _9.si, _7_MockSep_0.doc, _5.fnm, _3_MockSep_0.tii, _a_MockSep_0.pos, _3_MockSep_0.doc, _2_MockSep_0.tib, _2_TestBloomFilteredLucene40Postings_0.blm, _1.si, _e_MockSep_0.frq, _4_MockSep_0.tii, _6_MockSep_0.pyl, _d_TestBloomFilteredLucene40Postings_0.tip, _3_MockSep_0.frq, _9_SimpleText_0.pst, _9_MockSep_0.doc, _5_MockSep_0.tib, _9_TestBloomFilteredLucene40Postings_0.frq, _1_MockSep_0.tib, _1_MockSep_0.frq, _6.si, _c_MockSep_0.doc, _2.fdx, _7_nrm.cfs, _5_TestBloomFilteredLucene40Postings_0.tip, _c.fdx, _9.fdt, _3.si, _1_MockSep_0.tii, _9_MockSep_0.pos, _b.si, _3_TestBloomFilteredLucene40Postings_0.tim, _1_TestBloomFilteredLucene40Postings_0.tim, _3_MockSep_0.pos, _1_MockSep_0.doc, _4.fdt, _d_MockSep_0.tib, _b_TestBloomFilteredLucene40Postings_0.tim, _3_MockSep_0.pyl, _9_nrm.cfe, _c_nrm.cfs, _8_nrm.cfs, _a_TestBloomFilteredLucene40Postings_0.frq, _1_TestBloomFilteredLucene40Postings_0.prx, _1_nrm.cfs, _a.si, _8_MockSep_0.frq, _d.fdx, _d.fnm, _4_MockSep_0.pyl, _9_MockSep_0.pyl, _8_MockSep_0.tib, _9_MockSep_0.tib, _a_TestBloomFilteredLucene40Postings_0.blm, _d_SimpleText_0.pst, _1_TestBloomFilteredLucene40Postings_0.blm, _8_MockSep_0.doc, _1_SimpleText_0.pst, _8.fdx, _4_nrm.cfs, _d_TestBloomFilteredLucene40Postings_0.frq, _2_MockSep_0.skp, _e_TestBloomFilteredLucene40Postings_0.tip, _6_MockSep_0.skp, _6_MockSep_0.pos, _a.fdt, _c_TestBloomFilteredLucene40Postings_0.tip, _8_MockSep_0.pos, _2_MockSep_0.pyl]
[junit4:junit4]   2> 		commit{dir=MockDirWrapper(org.apache.lucene.store.RAMDirectory@499000bb lockFactory=org.apache.lucene.store.NativeFSLockFactory@36ba2cc3),segFN=segments_9,generation=9,filenames=[_c_nrm.cfe, _5_MockSep_0.tii, _6_TestBloomFilteredLucene40Postings_0.frq, _a.fnm, _9_TestBloomFilteredLucene40Postings_0.tim, _7_TestBloomFilteredLucene40Postings_0.prx, _b_TestBloomFilteredLucene40Postings_0.frq, _5_TestBloomFilteredLucene40Postings_0.tim, _4_MockSep_0.skp, _2_MockSep_0.frq, _g_nrm.cfe, _k_TestBloomFilteredLucene40Postings_0.tip, _e_MockSep_0.doc, _b_nrm.cfe, _3.fdt, _9_MockSep_0.tii, _9_TestBloomFilteredLucene40Postings_0.blm, _g.fnm, _2.fdt, _i_TestBloomFilteredLucene40Postings_0.tip, _2_MockSep_0.tii, _8_MockSep_0.pyl, _7_TestBloomFilteredLucene40Postings_0.tip, _h.fdt, _g_MockSep_0.pyl, _i_MockSep_0.tii, _9_MockSep_0.frq, _e_MockSep_0.tii, _3_nrm.cfe, _g_MockSep_0.tii, _l_SimpleText_0.pst, _5_MockSep_0.doc, _9_TestBloomFilteredLucene40Postings_0.prx, _a_nrm.cfs, _4.fnm, _b.fnm, _1.fnm, _h_TestBloomFilteredLucene40Postings_0.tip, _9_MockSep_0.skp, _b_MockSep_0.frq, _d_nrm.cfs, _5_TestBloomFilteredLucene40Postings_0.prx, _4_TestBloomFilteredLucene40Postings_0.tim, _d.si, _i_TestBloomFilteredLucene40Postings_0.frq, _4_TestBloomFilteredLucene40Postings_0.blm, _g_TestBloomFilteredLucene40Postings_0.prx, _9.fdx, _f_MockSep_0.frq, _5_MockSep_0.pyl, _e_nrm.cfe, _b_TestBloomFilteredLucene40Postings_0.tip, _c_TestBloomFilteredLucene40Postings_0.tim, _f_TestBloomFilteredLucene40Postings_0.tip, _h_TestBloomFilteredLucene40Postings_0.frq, _7_nrm.cfe, _g_nrm.cfs, _i_MockSep_0.pos, _1_TestBloomFilteredLucene40Postings_0.tip, _h.si, _1_TestBloomFilteredLucene40Postings_0.frq, _l_MockSep_0.tii, _a_TestBloomFilteredLucene40Postings_0.tim, _a_MockSep_0.tii, _b_SimpleText_0.pst, _3_TestBloomFilteredLucene40Postings_0.tip, _3_SimpleText_0.pst, _7_TestBloomFilteredLucene40Postings_0.blm, _a.fdx, _c.si, _h_MockSep_0.frq, _c_TestBloomFilteredLucene40Postings_0.frq, _6_SimpleText_0.pst, _a_MockSep_0.pyl, _h_TestBloomFilteredLucene40Postings_0.prx, _i_TestBloomFilteredLucene40Postings_0.blm, _e.fnm, _2.fnm, _h_nrm.cfe, _1_nrm.cfe, _d_MockSep_0.frq, _9_TestBloomFilteredLucene40Postings_0.tip, _5_MockSep_0.frq, _c.fdt, _a_TestBloomFilteredLucene40Postings_0.tip, _3_nrm.cfs, _4_MockSep_0.tib, _8_TestBloomFilteredLucene40Postings_0.tip, _d.fdt, _h_SimpleText_0.pst, _d_MockSep_0.doc, _e_TestBloomFilteredLucene40Postings_0.tim, _7_MockSep_0.pos, _h_MockSep_0.tib, _f_SimpleText_0.pst, _i_TestBloomFilteredLucene40Postings_0.tim, _b_MockSep_0.pyl, _h_nrm.cfs, _a_MockSep_0.frq, _2.si, _b_MockSep_0.skp, _8.si, _4.fdx, _e_SimpleText_0.pst, _5_SimpleText_0.pst, _k_TestBloomFilteredLucene40Postings_0.blm, _k_nrm.cfs, _6_nrm.cfs, _f_MockSep_0.skp, _3.fnm, _k_MockSep_0.skp, _g_MockSep_0.skp, _l_MockSep_0.frq, _e_TestBloomFilteredLucene40Postings_0.prx, _5_MockSep_0.pos, _3_TestBloomFilteredLucene40Postings_0.blm, _g.fdx, _k_MockSep_0.tib, _e_TestBloomFilteredLucene40Postings_0.blm, _b_nrm.cfs, _6_MockSep_0.frq, segments_9, _4_MockSep_0.pos, _6.fdt, _6_TestBloomFilteredLucene40Postings_0.tip, _g_TestBloomFilteredLucene40Postings_0.tim, _d_MockSep_0.tii, _1_MockSep_0.pos, _4_TestBloomFilteredLucene40Postings_0.prx, _e.si, _a_MockSep_0.tib, _5.fdt, _e_MockSep_0.skp, _e_TestBloomFilteredLucene40Postings_0.frq, _l.si, _d_MockSep_0.pos, _f_MockSep_0.tii, _9_nrm.cfs, _i_SimpleText_0.pst, _8.fdt, _l.fdt, _e_MockSep_0.pyl, _d_TestBloomFilteredLucene40Postings_0.blm, _6_MockSep_0.tii, _2_TestBloomFilteredLucene40Postings_0.prx, _i.fnm, _8_TestBloomFilteredLucene40Postings_0.blm, _8_MockSep_0.skp, _a_MockSep_0.doc, _5.fdx, _7_TestBloomFilteredLucene40Postings_0.frq, _c_TestBloomFilteredLucene40Postings_0.blm, _4_TestBloomFilteredLucene40Postings_0.tip, _4_SimpleText_0.pst, _6_TestBloomFilteredLucene40Postings_0.blm, _d_TestBloomFilteredLucene40Postings_0.prx, _1_MockSep_0.pyl, _l_MockSep_0.doc, _f_TestBloomFilteredLucene40Postings_0.blm, _3_TestBloomFilteredLucene40Postings_0.prx, _l_nrm.cfe, _8_nrm.cfe, _i.fdx, _l_MockSep_0.tib, _g.fdt, _l_MockSep_0.skp, _e_MockSep_0.tib, _c.fnm, _2_MockSep_0.pos, _i_MockSep_0.tib, _b_TestBloomFilteredLucene40Postings_0.prx, _b_MockSep_0.doc, _6_MockSep_0.doc, _k.fdt, _e_nrm.cfs, _8.fnm, _k_MockSep_0.pyl, _f_nrm.cfe, _c_MockSep_0.tib, _c_MockSep_0.pyl, _4.si, _1.fdt, _5_TestBloomFilteredLucene40Postings_0.blm, _a_nrm.cfe, _k.fnm, _7_SimpleText_0.pst, _2_TestBloomFilteredLucene40Postings_0.frq, _f_MockSep_0.pos, _h.fnm, _k_TestBloomFilteredLucene40Postings_0.frq, _6.fnm, _d_MockSep_0.skp, _4_MockSep_0.doc, _4_MockSep_0.frq, _2_nrm.cfe, _i_MockSep_0.pyl, _5_MockSep_0.skp, _c_TestBloomFilteredLucene40Postings_0.prx, _k.si, _7_MockSep_0.tib, _i_MockSep_0.skp, _3_MockSep_0.skp, _9.fnm, _2_nrm.cfs, _7.si, _8_TestBloomFilteredLucene40Postings_0.frq, _g.si, _a_TestBloomFilteredLucene40Postings_0.prx, _k_MockSep_0.pos, _5_TestBloomFilteredLucene40Postings_0.frq, _a_MockSep_0.skp, _2_MockSep_0.doc, _8_MockSep_0.tii, _4_nrm.cfe, _8_TestBloomFilteredLucene40Postings_0.prx, _7_MockSep_0.pyl, _i.fdt, _c_SimpleText_0.pst, _f.fdt, _d_TestBloomFilteredLucene40Postings_0.tim, _l_MockSep_0.pos, _7.fdt, _6_TestBloomFilteredLucene40Postings_0.prx, _6_nrm.cfe, _l_nrm.cfs, _k.fdx, _5_nrm.cfs, _e_MockSep_0.pos, _b.fdx, _h_MockSep_0.pos, _b_MockSep_0.tii, _a_SimpleText_0.pst, _b_TestBloomFilteredLucene40Postings_0.blm, _3_TestBloomFilteredLucene40Postings_0.frq, _b.fdt, _3_MockSep_0.tib, _g_MockSep_0.tib, _g_MockSep_0.doc, _l_MockSep_0.pyl, _i_nrm.cfs, _f_TestBloomFilteredLucene40Postings_0.tim, _b_MockSep_0.pos, _8_TestBloomFilteredLucene40Postings_0.tim, _1_MockSep_0.skp, _7_MockSep_0.tii, _c_MockSep_0.tii, _7.fdx, _8_SimpleText_0.pst, _e.fdx, _7.fnm, _i_nrm.cfe, _5.si, _h_MockSep_0.doc, _i_MockSep_0.doc, _k_MockSep_0.doc, _c_MockSep_0.frq, _g_TestBloomFilteredLucene40Postings_0.frq, _i_MockSep_0.frq, _h.fdx, _g_TestBloomFilteredLucene40Postings_0.blm, _h_MockSep_0.skp, _d_nrm.cfe, _2_SimpleText_0.pst, _e.fdt, _i.si, _4_TestBloomFilteredLucene40Postings_0.frq, _6_MockSep_0.tib, _3.fdx, _2_TestBloomFilteredLucene40Postings_0.tim, _1.fdx, _5_nrm.cfe, _7_TestBloomFilteredLucene40Postings_0.tim, _7_MockSep_0.frq, _l.fnm, _d_MockSep_0.pyl, _7_MockSep_0.skp, _b_MockSep_0.tib, _6.fdx, _f_nrm.cfs, _f_TestBloomFilteredLucene40Postings_0.frq, _6_TestBloomFilteredLucene40Postings_0.tim, _2_TestBloomFilteredLucene40Postings_0.tip, _c_MockSep_0.skp, _c_MockSep_0.pos, _9.si, _7_MockSep_0.doc, _g_SimpleText_0.pst, _f.fdx, _5.fnm, _3_MockSep_0.tii, _h_MockSep_0.pyl, _a_MockSep_0.pos, _3_MockSep_0.doc, _2_MockSep_0.tib, _2_TestBloomFilteredLucene40Postings_0.blm, _f.fnm, _h_MockSep_0.tii, _h_TestBloomFilteredLucene40Postings_0.blm, _1.si, _f_MockSep_0.doc, _e_MockSep_0.frq, _4_MockSep_0.tii, _f_MockSep_0.tib, _i_TestBloomFilteredLucene40Postings_0.prx, _k_MockSep_0.tii, _l_TestBloomFilteredLucene40Postings_0.prx, _6_MockSep_0.pyl, _d_TestBloomFilteredLucene40Postings_0.tip, _l_TestBloomFilteredLucene40Postings_0.tip, _3_MockSep_0.frq, _l_TestBloomFilteredLucene40Postings_0.tim, _9_SimpleText_0.pst, _k_TestBloomFilteredLucene40Postings_0.tim, _9_MockSep_0.doc, _5_MockSep_0.tib, _9_TestBloomFilteredLucene40Postings_0.frq, _f.si, _f_TestBloomFilteredLucene40Postings_0.prx, _1_MockSep_0.tib, _1_MockSep_0.frq, _6.si, _c_MockSep_0.doc, _2.fdx, _7_nrm.cfs, _5_TestBloomFilteredLucene40Postings_0.tip, _c.fdx, _9.fdt, _3.si, _1_MockSep_0.tii, _9_MockSep_0.pos, _b.si, _3_TestBloomFilteredLucene40Postings_0.tim, _k_MockSep_0.frq, _1_TestBloomFilteredLucene40Postings_0.tim, _3_MockSep_0.pos, _1_MockSep_0.doc, _k_SimpleText_0.pst, _4.fdt, _d_MockSep_0.tib, _f_MockSep_0.pyl, _b_TestBloomFilteredLucene40Postings_0.tim, _3_MockSep_0.pyl, _9_nrm.cfe, _c_nrm.cfs, _8_nrm.cfs, _a_TestBloomFilteredLucene40Postings_0.frq, _1_TestBloomFilteredLucene40Postings_0.prx, _1_nrm.cfs, _a.si, _8_MockSep_0.frq, _d.fdx, _d.fnm, _4_MockSep_0.pyl, _9_MockSep_0.pyl, _8_MockSep_0.tib, _9_MockSep_0.tib, _a_TestBloomFilteredLucene40Postings_0.blm, _g_TestBloomFilteredLucene40Postings_0.tip, _d_SimpleText_0.pst, _1_TestBloomFilteredLucene40Postings_0.blm, _8_MockSep_0.doc, _k_TestBloomFilteredLucene40Postings_0.prx, _1_SimpleText_0.pst, _8.fdx, _l.fdx, _g_MockSep_0.pos, _4_nrm.cfs, _d_TestBloomFilteredLucene40Postings_0.frq, _2_MockSep_0.skp, _l_TestBloomFilteredLucene40Postings_0.blm, _e_TestBloomFilteredLucene40Postings_0.tip, _6_MockSep_0.skp, _6_MockSep_0.pos, _l_TestBloomFilteredLucene40Postings_0.frq, _a.fdt, _c_TestBloomFilteredLucene40Postings_0.tip, _8_MockSep_0.pos, _2_MockSep_0.pyl, _k_nrm.cfe, _h_TestBloomFilteredLucene40Postings_0.tim, _g_MockSep_0.frq]
[junit4:junit4]   2> 2412 T2113 C139 UPDATE [collection1] webapp=/solr path=/update params={waitSearcher=true&softCommit=false&expungeDeletes=false&version=2&wt=javabin&commit=true} {add=[5 (1413131702374498304), 7 (1413131702376595456), 8 (1413131702376595457), 9 (1413131702376595458), 10 (1413131702376595459), 12 (1413131702376595460), 13 (1413131702377644032), 14 (1413131702377644033), 16 (1413131702377644034), 17 (1413131702377644035)],commit=} 0 141
[junit4:junit4]   2> 2414 T2097 C137 oasc.SolrDeletionPolicy.updateCommits newest commit = 9
[junit4:junit4]   2> 2412 T2114 C139 oasu.DirectUpdateHandler2.commit start commit{flags=0,_version_=0,optimize=false,openSearcher=true,waitSearcher=true,expungeDeletes=false,softCommit=false}
[junit4:junit4]   2> 2416 T2097 C137 oass.SolrIndexSearcher.<init> Opening Searcher@f22bd6b main
[junit4:junit4]   2> 2417 T2097 C137 oass.SolrIndexSearcher.getIndexDir WARNING WARNING: Directory impl does not support setting indexDir: org.apache.lucene.store.MockDirectoryWrapper
[junit4:junit4]   2> 2418 T2099 oasc.SolrCore.registerSearcher [collection1] Registered new searcher Searcher@f22bd6b main{StandardDirectoryReader(segments_9:46:nrt _1(5.0):C2 _2(5.0):C12 _3(5.0):C38 _4(5.0):C16 _5(5.0):C7 _6(5.0):C1 _e(5.0):C14 _9(5.0):C10 _7(5.0):C5 _8(5.0):C10 _a(5.0):C10 _b(5.0):C10 _c(5.0):C10 _d(5.0):C10 _i(5.0):C4 _g(5.0):C21 _h(5.0):C2 _f(5.0):C1 _l(5.0):C8 _k(5.0):C1)}
[junit4:junit4]   2> 2418 T2097 C137 oasu.DirectUpdateHandler2.commit end_commit_flush
[junit4:junit4]   2> 2421 T2098 C137 oasu.DirectUpdateHandler2.commit start commit{flags=0,_version_=0,optimize=false,openSearcher=true,waitSearcher=true,expungeDeletes=false,softCommit=false}
[junit4:junit4]   2> 2421 T2107 C138 oass.SolrIndexSearcher.<init> Opening Searcher@4abc30c7 main
[junit4:junit4]   2> 2422 T2107 C138 oass.SolrIndexSearcher.getIndexDir WARNING WARNING: Directory impl does not support setting indexDir: org.apache.lucene.store.MockDirectoryWrapper
[junit4:junit4]   2> 2422 T2109 oasc.SolrCore.registerSearcher [collection1] Registered new searcher Searcher@4abc30c7 main{StandardDirectoryReader(segments_3:21:nrt _0(5.0):C45 _1(5.0):C3 _2(5.0):C9 _3(5.0):C3 _4(5.0):C31 _5(5.0):C49 _6(5.0):C7 _7(5.0):C3 _8(5.0):C1 _9(5.0):C9)}
[junit4:junit4]   2> 2423 T2107 C138 oasu.DirectUpdateHandler2.commit end_commit_flush
[junit4:junit4]   2> 2423 T2098 C137 oasc.SolrDeletionPolicy.onCommit SolrDeletionPolicy.onCommit: commits:num=2
[junit4:junit4]   2> 		commit{dir=MockDirWrapper(org.apache.lucene.store.RAMDirectory@499000bb lockFactory=org.apache.lucene.store.NativeFSLockFactory@36ba2cc3),segFN=segments_9,generation=9,filenames=[_c_nrm.cfe, _5_MockSep_0.tii, _6_TestBloomFilteredLucene40Postings_0.frq, _a.fnm, _9_TestBloomFilteredLucene40Postings_0.tim, _7_TestBloomFilteredLucene40Postings_0.prx, _b_TestBloomFilteredLucene40Postings_0.frq, _5_TestBloomFilteredLucene40Postings_0.tim, _4_MockSep_0.skp, _2_MockSep_0.frq, _g_nrm.cfe, _k_TestBloomFilteredLucene40Postings_0.tip, _e_MockSep_0.doc, _b_nrm.cfe, _3.fdt, _9_MockSep_0.tii, _9_TestBloomFilteredLucene40Postings_0.blm, _g.fnm, _2.fdt, _i_TestBloomFilteredLucene40Postings_0.tip, _2_MockSep_0.tii, _8_MockSep_0.pyl, _7_TestBloomFilteredLucene40Postings_0.tip, _h.fdt, _g_MockSep_0.pyl, _i_MockSep_0.tii, _9_MockSep_0.frq, _e_MockSep_0.tii, _3_nrm.cfe, _g_MockSep_0.tii, _l_SimpleText_0.pst, _5_MockSep_0.doc, _9_TestBloomFilteredLucene40Postings_0.prx, _a_nrm.cfs, _4.fnm, _b.fnm, _1.fnm, _h_TestBloomFilteredLucene40Postings_0.tip, _9_MockSep_0.skp, _b_MockSep_0.frq, _d_nrm.cfs, _5_TestBloomFilteredLucene40Postings_0.prx, _4_TestBloomFilteredLucene40Postings_0.tim, _d.si, _i_TestBloomFilteredLucene40Postings_0.frq, _4_TestBloomFilteredLucene40Postings_0.blm, _g_TestBloomFilteredLucene40Postings_0.prx, _9.fdx, _f_MockSep_0.frq, _5_MockSep_0.pyl, _e_nrm.cfe, _b_TestBloomFilteredLucene40Postings_0.tip, _c_TestBloomFilteredLucene40Postings_0.tim, _f_TestBloomFilteredLucene40Postings_0.tip, _h_TestBloomFilteredLucene40Postings_0.frq, _7_nrm.cfe, _g_nrm.cfs, _i_MockSep_0.pos, _1_TestBloomFilteredLucene40Postings_0.tip, _h.si, _1_TestBloomFilteredLucene40Postings_0.frq, _l_MockSep_0.tii, _a_TestBloomFilteredLucene40Postings_0.tim, _a_MockSep_0.tii, _b_SimpleText_0.pst, _3_TestBloomFilteredLucene40Postings_0.tip, _3_SimpleText_0.pst, _7_TestBloomFilteredLucene40Postings_0.blm, _a.fdx, _c.si, _h_MockSep_0.frq, _c_TestBloomFilteredLucene40Postings_0.frq, _6_SimpleText_0.pst, _a_MockSep_0.pyl, _h_TestBloomFilteredLucene40Postings_0.prx, _i_TestBloomFilteredLucene40Postings_0.blm, _e.fnm, _2.fnm, _h_nrm.cfe, _1_nrm.cfe, _d_MockSep_0.frq, _9_TestBloomFilteredLucene40Postings_0.tip, _5_MockSep_0.frq, _c.fdt, _a_TestBloomFilteredLucene40Postings_0.tip, _3_nrm.cfs, _4_MockSep_0.tib, _8_TestBloomFilteredLucene40Postings_0.tip, _d.fdt, _h_SimpleText_0.pst, _d_MockSep_0.doc, _e_TestBloomFilteredLucene40Postings_0.tim, _7_MockSep_0.pos, _h_MockSep_0.tib, _f_SimpleText_0.pst, _i_TestBloomFilteredLucene40Postings_0.tim, _b_MockSep_0.pyl, _h_nrm.cfs, _a_MockSep_0.frq, _2.si, _b_MockSep_0.skp, _8.si, _4.fdx, _e_SimpleText_0.pst, _5_SimpleText_0.pst, _k_TestBloomFilteredLucene40Postings_0.blm, _k_nrm.cfs, _6_nrm.cfs, _f_MockSep_0.skp, _3.fnm, _k_MockSep_0.skp, _g_MockSep_0.skp, _l_MockSep_0.frq, _e_TestBloomFilteredLucene40Postings_0.prx, _5_MockSep_0.pos, _3_TestBloomFilteredLucene40Postings_0.blm, _g.fdx, _k_MockSep_0.tib, _e_TestBloomFilteredLucene40Postings_0.blm, _b_nrm.cfs, _6_MockSep_0.frq, segments_9, _4_MockSep_0.pos, _6.fdt, _6_TestBloomFilteredLucene40Postings_0.tip, _g_TestBloomFilteredLucene40Postings_0.tim, _d_MockSep_0.tii, _1_MockSep_0.pos, _4_TestBloomFilteredLucene40Postings_0.prx, _e.si, _a_MockSep_0.tib, _5.fdt, _e_MockSep_0.skp, _e_TestBloomFilteredLucene40Postings_0.frq, _l.si, _d_MockSep_0.pos, _f_MockSep_0.tii, _9_nrm.cfs, _i_SimpleText_0.pst, _8.fdt, _l.fdt, _e_MockSep_0.pyl, _d_TestBloomFilteredLucene40Postings_0.blm, _6_MockSep_0.tii, _2_TestBloomFilteredLucene40Postings_0.prx, _i.fnm, _8_TestBloomFilteredLucene40Postings_0.blm, _8_MockSep_0.skp, _a_MockSep_0.doc, _5.fdx, _7_TestBloomFilteredLucene40Postings_0.frq, _c_TestBloomFilteredLucene40Postings_0.blm, _4_TestBloomFilteredLucene40Postings_0.tip, _4_SimpleText_0.pst, _6_TestBloomFilteredLucene40Postings_0.blm, _d_TestBloomFilteredLucene40Postings_0.prx, _1_MockSep_0.pyl, _l_MockSep_0.doc, _f_TestBloomFilteredLucene40Postings_0.blm, _3_TestBloomFilteredLucene40Postings_0.prx, _l_nrm.cfe, _8_nrm.cfe, _i.fdx, _l_MockSep_0.tib, _g.fdt, _l_MockSep_0.skp, _e_MockSep_0.tib, _c.fnm, _2_MockSep_0.pos, _i_MockSep_0.tib, _b_TestBloomFilteredLucene40Postings_0.prx, _b_MockSep_0.doc, _6_MockSep_0.doc, _k.fdt, _e_nrm.cfs, _8.fnm, _k_MockSep_0.pyl, _f_nrm.cfe, _c_MockSep_0.tib, _c_MockSep_0.pyl, _4.si, _1.fdt, _5_TestBloomFilteredLucene40Postings_0.blm, _a_nrm.cfe, _k.fnm, _7_SimpleText_0.pst, _2_TestBloomFilteredLucene40Postings_0.frq, _f_MockSep_0.pos, _h.fnm, _k_TestBloomFilteredLucene40Postings_0.frq, _6.fnm, _d_MockSep_0.skp, _4_MockSep_0.doc, _4_MockSep_0.frq, _2_nrm.cfe, _i_MockSep_0.pyl, _5_MockSep_0.skp, _c_TestBloomFilteredLucene40Postings_0.prx, _k.si, _7_MockSep_0.tib, _i_MockSep_0.skp, _3_MockSep_0.skp, _9.fnm, _2_nrm.cfs, _7.si, _8_TestBloomFilteredLucene40Postings_0.frq, _g.si, _a_TestBloomFilteredLucene40Postings_0.prx, _k_MockSep_0.pos, _5_TestBloomFilteredLucene40Postings_0.frq, _a_MockSep_0.skp, _2_MockSep_0.doc, _8_MockSep_0.tii, _4_nrm.cfe, _8_TestBloomFilteredLucene40Postings_0.prx, _7_MockSep_0.pyl, _i.fdt, _c_SimpleText_0.pst, _f.fdt, _d_TestBloomFilteredLucene40Postings_0.tim, _l_MockSep_0.pos, _7.fdt, _6_TestBloomFilteredLucene40Postings_0.prx, _6_nrm.cfe, _l_nrm.cfs, _k.fdx, _5_nrm.cfs, _e_MockSep_0.pos, _b.fdx, _h_MockSep_0.pos, _b_MockSep_0.tii, _a_SimpleText_0.pst, _b_TestBloomFilteredLucene40Postings_0.blm, _3_TestBloomFilteredLucene40Postings_0.frq, _b.fdt, _3_MockSep_0.tib, _g_MockSep_0.tib, _g_MockSep_0.doc, _l_MockSep_0.pyl, _i_nrm.cfs, _f_TestBloomFilteredLucene40Postings_0.tim, _b_MockSep_0.pos, _8_TestBloomFilteredLucene40Postings_0.tim, _1_MockSep_0.skp, _7_MockSep_0.tii, _c_MockSep_0.tii, _7.fdx, _8_SimpleText_0.pst, _e.fdx, _7.fnm, _i_nrm.cfe, _5.si, _h_MockSep_0.doc, _i_MockSep_0.doc, _k_MockSep_0.doc, _c_MockSep_0.frq, _g_TestBloomFilteredLucene40Postings_0.frq, _i_MockSep_0.frq, _h.fdx, _g_TestBloomFilteredLucene40Postings_0.blm, _h_MockSep_0.skp, _d_nrm.cfe, _2_SimpleText_0.pst, _e.fdt, _i.si, _4_TestBloomFilteredLucene40Postings_0.frq, _6_MockSep_0.tib, _3.fdx, _2_TestBloomFilteredLucene40Postings_0.tim, _1.fdx, _5_nrm.cfe, _7_TestBloomFilteredLucene40Postings_0.tim, _7_MockSep_0.frq, _l.fnm, _d_MockSep_0.pyl, _7_MockSep_0.skp, _b_MockSep_0.tib, _6.fdx, _f_nrm.cfs, _f_TestBloomFilteredLucene40Postings_0.frq, _6_TestBloomFilteredLucene40Postings_0.tim, _2_TestBloomFilteredLucene40Postings_0.tip, _c_MockSep_0.skp, _c_MockSep_0.pos, _9.si, _7_MockSep_0.doc, _g_SimpleText_0.pst, _f.fdx, _5.fnm, _3_MockSep_0.tii, _h_MockSep_0.pyl, _a_MockSep_0.pos, _3_MockSep_0.doc, _2_MockSep_0.tib, _2_TestBloomFilteredLucene40Postings_0.blm, _f.fnm, _h_MockSep_0.tii, _h_TestBloomFilteredLucene40Postings_0.blm, _1.si, _f_MockSep_0.doc, _e_MockSep_0.frq, _4_MockSep_0.tii, _f_MockSep_0.tib, _i_TestBloomFilteredLucene40Postings_0.prx, _k_MockSep_0.tii, _l_TestBloomFilteredLucene40Postings_0.prx, _6_MockSep_0.pyl, _d_TestBloomFilteredLucene40Postings_0.tip, _l_TestBloomFilteredLucene40Postings_0.tip, _3_MockSep_0.frq, _l_TestBloomFilteredLucene40Postings_0.tim, _9_SimpleText_0.pst, _k_TestBloomFilteredLucene40Postings_0.tim, _9_MockSep_0.doc, _5_MockSep_0.tib, _9_TestBloomFilteredLucene40Postings_0.frq, _f.si, _f_TestBloomFilteredLucene40Postings_0.prx, _1_MockSep_0.tib, _1_MockSep_0.frq, _6.si, _c_MockSep_0.doc, _2.fdx, _7_nrm.cfs, _5_TestBloomFilteredLucene40Postings_0.tip, _c.fdx, _9.fdt, _3.si, _1_MockSep_0.tii, _9_MockSep_0.pos, _b.si, _3_TestBloomFilteredLucene40Postings_0.tim, _k_MockSep_0.frq, _1_TestBloomFilteredLucene40Postings_0.tim, _3_MockSep_0.pos, _1_MockSep_0.doc, _k_SimpleText_0.pst, _4.fdt, _d_MockSep_0.tib, _f_MockSep_0.pyl, _b_TestBloomFilteredLucene40Postings_0.tim, _3_MockSep_0.pyl, _9_nrm.cfe, _c_nrm.cfs, _8_nrm.cfs, _a_TestBloomFilteredLucene40Postings_0.frq, _1_TestBloomFilteredLucene40Postings_0.prx, _1_nrm.cfs, _a.si, _8_MockSep_0.frq, _d.fdx, _d.fnm, _4_MockSep_0.pyl, _9_MockSep_0.pyl, _8_MockSep_0.tib, _9_MockSep_0.tib, _a_TestBloomFilteredLucene40Postings_0.blm, _g_TestBloomFilteredLucene40Postings_0.tip, _d_SimpleText_0.pst, _1_TestBloomFilteredLucene40Postings_0.blm, _8_MockSep_0.doc, _k_TestBloomFilteredLucene40Postings_0.prx, _1_SimpleText_0.pst, _8.fdx, _l.fdx, _g_MockSep_0.pos, _4_nrm.cfs, _d_TestBloomFilteredLucene40Postings_0.frq, _2_MockSep_0.skp, _l_TestBloomFilteredLucene40Postings_0.blm, _e_TestBloomFilteredLucene40Postings_0.tip, _6_MockSep_0.skp, _6_MockSep_0.pos, _l_TestBloomFilteredLucene40Postings_0.frq, _a.fdt, _c_TestBloomFilteredLucene40Postings_0.tip, _8_MockSep_0.pos, _2_MockSep_0.pyl, _k_nrm.cfe, _h_TestBloomFilteredLucene40Postings_0.tim, _g_MockSep_0.frq]
[junit4:junit4]   2> 		commit{dir=MockDirWrapper(org.apache.lucene.store.RAMDirectory@499000bb lockFactory=org.apache.lucene.store.NativeFSLockFactory@36ba2cc3),segFN=segments_a,generation=10,filenames=[_c_nrm.cfe, _4_MockSep_0.skp, _g_nrm.cfe, _k_TestBloomFilteredLucene40Postings_0.tip, segments_a, _j.fnm, _3.fdt, _g.fnm, _i_TestBloomFilteredLucene40Postings_0.tip, _j.fdx, _h.fdt, _g_MockSep_0.pyl, _i_MockSep_0.tii, _3_nrm.cfe, _g_MockSep_0.tii, _j_MockSep_0.pos, _l_SimpleText_0.pst, _4.fnm, _h_TestBloomFilteredLucene40Postings_0.tip, _d_nrm.cfs, _4_TestBloomFilteredLucene40Postings_0.tim, _d.si, _i_TestBloomFilteredLucene40Postings_0.frq, _j_nrm.cfs, _4_TestBloomFilteredLucene40Postings_0.blm, _g_TestBloomFilteredLucene40Postings_0.prx, _f_MockSep_0.frq, _c_TestBloomFilteredLucene40Postings_0.tim, _h_TestBloomFilteredLucene40Postings_0.frq, _f_TestBloomFilteredLucene40Postings_0.tip, _g_nrm.cfs, _i_MockSep_0.pos, _h.si, _l_MockSep_0.tii, _3_TestBloomFilteredLucene40Postings_0.tip, _3_SimpleText_0.pst, _j_MockSep_0.pyl, _c.si, _h_MockSep_0.frq, _c_TestBloomFilteredLucene40Postings_0.frq, _h_TestBloomFilteredLucene40Postings_0.prx, _i_TestBloomFilteredLucene40Postings_0.blm, _h_nrm.cfe, _d_MockSep_0.frq, _c.fdt, _3_nrm.cfs, _4_MockSep_0.tib, _d.fdt, _h_SimpleText_0.pst, _d_MockSep_0.doc, _h_MockSep_0.tib, _i_TestBloomFilteredLucene40Postings_0.tim, _f_SimpleText_0.pst, _h_nrm.cfs, _4.fdx, _k_TestBloomFilteredLucene40Postings_0.blm, _k_nrm.cfs, _f_MockSep_0.skp, _3.fnm, _k_MockSep_0.skp, _g_MockSep_0.skp, _l_MockSep_0.frq, _3_TestBloomFilteredLucene40Postings_0.blm, _g.fdx, _k_MockSep_0.tib, _j_TestBloomFilteredLucene40Postings_0.tip, _4_MockSep_0.pos, _g_TestBloomFilteredLucene40Postings_0.tim, _d_MockSep_0.tii, _4_TestBloomFilteredLucene40Postings_0.prx, _d_MockSep_0.pos, _l.si, _f_MockSep_0.tii, _j_TestBloomFilteredLucene40Postings_0.frq, _i_SimpleText_0.pst, _l.fdt, _d_TestBloomFilteredLucene40Postings_0.blm, _i.fnm, _j.si, _c_TestBloomFilteredLucene40Postings_0.blm, _4_TestBloomFilteredLucene40Postings_0.tip, _4_SimpleText_0.pst, _d_TestBloomFilteredLucene40Postings_0.prx, _3_TestBloomFilteredLucene40Postings_0.prx, _f_TestBloomFilteredLucene40Postings_0.blm, _l_MockSep_0.doc, _l_nrm.cfe, _i.fdx, _l_MockSep_0.tib, _g.fdt, _l_MockSep_0.skp, _c.fnm, _i_MockSep_0.tib, _k.fdt, _k_MockSep_0.pyl, _c_MockSep_0.tib, _c_MockSep_0.pyl, _f_nrm.cfe, _4.si, _k.fnm, _j_MockSep_0.doc, _f_MockSep_0.pos, _h.fnm, _k_TestBloomFilteredLucene40Postings_0.frq, _d_MockSep_0.skp, _4_MockSep_0.doc, _4_MockSep_0.frq, _i_MockSep_0.pyl, _c_TestBloomFilteredLucene40Postings_0.prx, _k.si, _3_MockSep_0.skp, _i_MockSep_0.skp, _j_MockSep_0.frq, _g.si, _j.fdt, _k_MockSep_0.pos, _4_nrm.cfe, _c_SimpleText_0.pst, _i.fdt, _d_TestBloomFilteredLucene40Postings_0.tim, _f.fdt, _l_MockSep_0.pos, _l_nrm.cfs, _k.fdx, _h_MockSep_0.pos, _3_TestBloomFilteredLucene40Postings_0.frq, _3_MockSep_0.tib, _g_MockSep_0.doc, _g_MockSep_0.tib, _j_MockSep_0.skp, _l_MockSep_0.pyl, _i_nrm.cfs, _f_TestBloomFilteredLucene40Postings_0.tim, _c_MockSep_0.tii, _i_nrm.cfe, _h_MockSep_0.doc, _i_MockSep_0.doc, _k_MockSep_0.doc, _c_MockSep_0.frq, _g_TestBloomFilteredLucene40Postings_0.frq, _i_MockSep_0.frq, _g_TestBloomFilteredLucene40Postings_0.blm, _h.fdx, _h_MockSep_0.skp, _d_nrm.cfe, _j_MockSep_0.tib, _4_TestBloomFilteredLucene40Postings_0.frq, _i.si, _3.fdx, _j_TestBloomFilteredLucene40Postings_0.prx, _l.fnm, _d_MockSep_0.pyl, _f_nrm.cfs, _f_TestBloomFilteredLucene40Postings_0.frq, _j_TestBloomFilteredLucene40Postings_0.tim, _c_MockSep_0.skp, _c_MockSep_0.pos, _g_SimpleText_0.pst, _3_MockSep_0.tii, _f.fdx, _h_MockSep_0.pyl, _3_MockSep_0.doc, _f.fnm, _h_TestBloomFilteredLucene40Postings_0.blm, _h_MockSep_0.tii, _f_MockSep_0.doc, _4_MockSep_0.tii, _i_TestBloomFilteredLucene40Postings_0.prx, _f_MockSep_0.tib, _k_MockSep_0.tii, _l_TestBloomFilteredLucene40Postings_0.prx, _d_TestBloomFilteredLucene40Postings_0.tip, _l_TestBloomFilteredLucene40Postings_0.tip, _3_MockSep_0.frq, _l_TestBloomFilteredLucene40Postings_0.tim, _k_TestBloomFilteredLucene40Postings_0.tim, _j_nrm.cfe, _f.si, _f_TestBloomFilteredLucene40Postings_0.prx, _j_TestBloomFilteredLucene40Postings_0.blm, _c_MockSep_0.doc, _c.fdx, _3.si, _3_TestBloomFilteredLucene40Postings_0.tim, _k_MockSep_0.frq, _j_MockSep_0.tii, _3_MockSep_0.pos, _k_SimpleText_0.pst, _4.fdt, _d_MockSep_0.tib, _f_MockSep_0.pyl, _3_MockSep_0.pyl, _c_nrm.cfs, _d.fdx, _d.fnm, _4_MockSep_0.pyl, _d_SimpleText_0.pst, _g_TestBloomFilteredLucene40Postings_0.tip, _k_TestBloomFilteredLucene40Postings_0.prx, _l.fdx, _4_nrm.cfs, _g_MockSep_0.pos, _d_TestBloomFilteredLucene40Postings_0.frq, _l_TestBloomFilteredLucene40Postings_0.blm, _l_TestBloomFilteredLucene40Postings_0.frq, _c_TestBloomFilteredLucene40Postings_0.tip, _j_SimpleText_0.pst, _k_nrm.cfe, _g_MockSep_0.frq, _h_TestBloomFilteredLucene40Postings_0.tim]
[junit4:junit4]   2> 2424 T2106 C138 oasu.DirectUpdateHandler2.commit start commit{flags=0,_version_=0,optimize=false,openSearcher=true,waitSearcher=true,expungeDeletes=false,softCommit=false}
[junit4:junit4]   2> 2423 T2097 C137 UPDATE [collection1] webapp=/solr path=/update params={waitSearcher=true&softCommit=false&expungeDeletes=false&version=2&wt=javabin&commit=true} {add=[77 (1413131702394421248), 79 (1413131702394421249), 80 (1413131702394421250), 82 (1413131702394421251), 84 (1413131702394421252), 88 (1413131702395469824), 89 (1413131702395469825), 90 (1413131702395469826), 91 (1413131702395469827), 92 (1413131702395469828)],commit=} 0 133
[junit4:junit4]   2> 2423 T2107 C138 UPDATE [collection1] webapp=/solr path=/update params={waitSearcher=true&softCommit=false&expungeDeletes=false&version=2&wt=javabin&commit=true} {add=[91 (1413131702391275521), 92 (1413131702391275523), 94 (1413131702392324096), 95 (1413131702392324097), 99 (1413131702392324098), 101 (1413131702392324099), 102 (1413131702392324100), 105 (1413131702393372672), 107 (1413131702400712705), 110 (1413131702400712707)],commit=} 0 136
[junit4:junit4]   2> 2425 T2098 C137 oasc.SolrDeletionPolicy.updateCommits newest commit = 10
[junit4:junit4]   2> 2431 T2106 C138 oasc.SolrDeletionPolicy.onCommit SolrDeletionPolicy.onCommit: commits:num=2
[junit4:junit4]   2> 		commit{dir=MockDirWrapper(org.apache.lucene.store.RAMDirectory@4785ab0d lockFactory=org.apache.lucene.store.NativeFSLockFactory@73dd6307),segFN=segments_3,generation=3,filenames=[_6_TestBloomFilteredLucene40Postings_0.frq, _5_MockSep_0.tii, _4_MockSep_0.doc, _7_TestBloomFilteredLucene40Postings_0.prx, _2_nrm.cfe, _4_MockSep_0.frq, _5_TestBloomFilteredLucene40Postings_0.tim, _4_MockSep_0.skp, _5_MockSep_0.skp, _2_MockSep_0.frq, _7_MockSep_0.tib, _3_MockSep_0.skp, _2_nrm.cfs, _8_TestBloomFilteredLucene40Postings_0.frq, _7.si, segments_3, _3.fdt, _2.fdt, _5_TestBloomFilteredLucene40Postings_0.frq, _8_MockSep_0.tii, _2_MockSep_0.doc, _8_TestBloomFilteredLucene40Postings_0.prx, _0.fdt, _2_MockSep_0.tii, _4_nrm.cfe, _7_MockSep_0.pyl, _8_MockSep_0.pyl, _7_TestBloomFilteredLucene40Postings_0.tip, _7.fdt, _6_TestBloomFilteredLucene40Postings_0.prx, _6_nrm.cfe, _5_nrm.cfs, _0_MockSep_0.tib, _3_nrm.cfe, _5_MockSep_0.doc, _3_TestBloomFilteredLucene40Postings_0.frq, _3_MockSep_0.tib, _4.fnm, _1.fnm, _5_TestBloomFilteredLucene40Postings_0.prx, _4_TestBloomFilteredLucene40Postings_0.tim, _8_TestBloomFilteredLucene40Postings_0.tim, _4_TestBloomFilteredLucene40Postings_0.blm, _0_MockSep_0.tii, _1_MockSep_0.skp, _7_MockSep_0.tii, _7.fdx, _0_MockSep_0.doc, _8_SimpleText_0.pst, _5_MockSep_0.pyl, _7_nrm.cfe, _7.fnm, _5.si, _1_TestBloomFilteredLucene40Postings_0.tip, _0_TestBloomFilteredLucene40Postings_0.tip, _1_TestBloomFilteredLucene40Postings_0.frq, _3_TestBloomFilteredLucene40Postings_0.tip, _2_SimpleText_0.pst, _7_TestBloomFilteredLucene40Postings_0.blm, _3_SimpleText_0.pst, _6_SimpleText_0.pst, _4_TestBloomFilteredLucene40Postings_0.frq, _6_MockSep_0.tib, _3.fdx, _2_TestBloomFilteredLucene40Postings_0.tim, _1.fdx, _7_TestBloomFilteredLucene40Postings_0.tim, _5_nrm.cfe, _7_MockSep_0.frq, _2.fnm, _7_MockSep_0.skp, _6.fdx, _1_nrm.cfe, _6_TestBloomFilteredLucene40Postings_0.tim, _2_TestBloomFilteredLucene40Postings_0.tip, _5_MockSep_0.frq, _3_nrm.cfs, _4_MockSep_0.tib, _8_TestBloomFilteredLucene40Postings_0.tip, _7_MockSep_0.doc, _5.fnm, _3_MockSep_0.tii, _3_MockSep_0.doc, _7_MockSep_0.pos, _2_MockSep_0.tib, _2_TestBloomFilteredLucene40Postings_0.blm, _0_MockSep_0.skp, _2.si, _0_MockSep_0.pyl, _8.si, _1.si, _4.fdx, _5_SimpleText_0.pst, _6_nrm.cfs, _4_MockSep_0.tii, _3.fnm, _6_MockSep_0.pyl, _5_MockSep_0.pos, _0_nrm.cfs, _3_TestBloomFilteredLucene40Postings_0.blm, _3_MockSep_0.frq, _6_MockSep_0.frq, _5_MockSep_0.tib, _0_MockSep_0.frq, _0_SimpleText_0.pst, _6.fdt, _4_MockSep_0.pos, _6_TestBloomFilteredLucene40Postings_0.tip, _1_MockSep_0.tib, _0_TestBloomFilteredLucene40Postings_0.prx, _0.fnm, _1_MockSep_0.pos, _4_TestBloomFilteredLucene40Postings_0.prx, _6.si, _5.fdt, _1_MockSep_0.frq, _7_nrm.cfs, _2.fdx, _5_TestBloomFilteredLucene40Postings_0.tip, _0_TestBloomFilteredLucene40Postings_0.blm, _8.fdt, _1_MockSep_0.tii, _3.si, _3_TestBloomFilteredLucene40Postings_0.tim, _6_MockSep_0.tii, _0.si, _1_TestBloomFilteredLucene40Postings_0.tim, _2_TestBloomFilteredLucene40Postings_0.prx, _8_TestBloomFilteredLucene40Postings_0.blm, _3_MockSep_0.pos, _8_MockSep_0.skp, _5.fdx, _1_MockSep_0.doc, _7_TestBloomFilteredLucene40Postings_0.frq, _4_TestBloomFilteredLucene40Postings_0.tip, _4.fdt, _6_TestBloomFilteredLucene40Postings_0.blm, _0_TestBloomFilteredLucene40Postings_0.tim, _4_SimpleText_0.pst, _3_MockSep_0.pyl, _1_MockSep_0.pyl, _8_nrm.cfs, _0_nrm.cfe, _3_TestBloomFilteredLucene40Postings_0.prx, _8_nrm.cfe, _1_TestBloomFilteredLucene40Postings_0.prx, _1_nrm.cfs, _8_MockSep_0.frq, _0_MockSep_0.pos, _4_MockSep_0.pyl, _8_MockSep_0.tib, _2_MockSep_0.pos, _8_MockSep_0.doc, _0.fdx, _1_TestBloomFilteredLucene40Postings_0.blm, _8.fdx, _6_MockSep_0.doc, _1_SimpleText_0.pst, _8.fnm, _4_nrm.cfs, _2_MockSep_0.skp, _6_MockSep_0.skp, _6_MockSep_0.pos, _1.fdt, _4.si, _5_TestBloomFilteredLucene40Postings_0.blm, _7_SimpleText_0.pst, _0_TestBloomFilteredLucene40Postings_0.frq, _2_TestBloomFilteredLucene40Postings_0.frq, _8_MockSep_0.pos, _2_MockSep_0.pyl, _6.fnm]
[junit4:junit4]   2> 		commit{dir=MockDirWrapper(org.apache.lucene.store.RAMDirectory@4785ab0d lockFactory=org.apache.lucene.store.NativeFSLockFactory@73dd6307),segFN=segments_4,generation=4,filenames=[_6_TestBloomFilteredLucene40Postings_0.frq, _5_MockSep_0.tii, _4_MockSep_0.doc, _9_TestBloomFilteredLucene40Postings_0.tim, _7_TestBloomFilteredLucene40Postings_0.prx, _2_nrm.cfe, _4_MockSep_0.frq, _5_TestBloomFilteredLucene40Postings_0.tim, _4_MockSep_0.skp, _5_MockSep_0.skp, _2_MockSep_0.frq, _7_MockSep_0.tib, _9.fnm, _3_MockSep_0.skp, _2_nrm.cfs, _9_MockSep_0.tii, _8_TestBloomFilteredLucene40Postings_0.frq, _7.si, _3.fdt, _9_TestBloomFilteredLucene40Postings_0.blm, _2.fdt, _5_TestBloomFilteredLucene40Postings_0.frq, _8_MockSep_0.tii, _2_MockSep_0.doc, _8_TestBloomFilteredLucene40Postings_0.prx, _0.fdt, _2_MockSep_0.tii, _4_nrm.cfe, _7_MockSep_0.pyl, _8_MockSep_0.pyl, _7_TestBloomFilteredLucene40Postings_0.tip, _7.fdt, _6_TestBloomFilteredLucene40Postings_0.prx, _6_nrm.cfe, _9_MockSep_0.frq, _5_nrm.cfs, _0_MockSep_0.tib, _3_nrm.cfe, _9_TestBloomFilteredLucene40Postings_0.prx, _5_MockSep_0.doc, _3_TestBloomFilteredLucene40Postings_0.frq, _3_MockSep_0.tib, _4.fnm, _1.fnm, _9_MockSep_0.skp, _5_TestBloomFilteredLucene40Postings_0.prx, _4_TestBloomFilteredLucene40Postings_0.tim, _8_TestBloomFilteredLucene40Postings_0.tim, _4_TestBloomFilteredLucene40Postings_0.blm, _0_MockSep_0.tii, _1_MockSep_0.skp, _9.fdx, _7_MockSep_0.tii, _7.fdx, _0_MockSep_0.doc, _8_SimpleText_0.pst, _5_MockSep_0.pyl, _7_nrm.cfe, _7.fnm, _5.si, _1_TestBloomFilteredLucene40Postings_0.tip, _0_TestBloomFilteredLucene40Postings_0.tip, _1_TestBloomFilteredLucene40Postings_0.frq, _3_TestBloomFilteredLucene40Postings_0.tip, _2_SimpleText_0.pst, _7_TestBloomFilteredLucene40Postings_0.blm, _3_SimpleText_0.pst, _6_SimpleText_0.pst, _4_TestBloomFilteredLucene40Postings_0.frq, _6_MockSep_0.tib, _3.fdx, _2_TestBloomFilteredLucene40Postings_0.tim, _1.fdx, _7_TestBloomFilteredLucene40Postings_0.tim, _5_nrm.cfe, _7_MockSep_0.frq, _2.fnm, _7_MockSep_0.skp, _6.fdx, _1_nrm.cfe, _6_TestBloomFilteredLucene40Postings_0.tim, _9_TestBloomFilteredLucene40Postings_0.tip, _2_TestBloomFilteredLucene40Postings_0.tip, _5_MockSep_0.frq, _3_nrm.cfs, _9.si, _4_MockSep_0.tib, _8_TestBloomFilteredLucene40Postings_0.tip, _7_MockSep_0.doc, _5.fnm, _3_MockSep_0.tii, _3_MockSep_0.doc, _7_MockSep_0.pos, _2_MockSep_0.tib, _2_TestBloomFilteredLucene40Postings_0.blm, _0_MockSep_0.skp, _2.si, _0_MockSep_0.pyl, _8.si, _1.si, _4.fdx, _5_SimpleText_0.pst, _6_nrm.cfs, _4_MockSep_0.tii, _3.fnm, _6_MockSep_0.pyl, _5_MockSep_0.pos, _0_nrm.cfs, _3_TestBloomFilteredLucene40Postings_0.blm, _3_MockSep_0.frq, _9_SimpleText_0.pst, _9_MockSep_0.doc, _6_MockSep_0.frq, _5_MockSep_0.tib, _0_MockSep_0.frq, _9_TestBloomFilteredLucene40Postings_0.frq, _0_SimpleText_0.pst, _6.fdt, _4_MockSep_0.pos, _6_TestBloomFilteredLucene40Postings_0.tip, _1_MockSep_0.tib, _0_TestBloomFilteredLucene40Postings_0.prx, _0.fnm, _1_MockSep_0.pos, _4_TestBloomFilteredLucene40Postings_0.prx, _6.si, _5.fdt, _1_MockSep_0.frq, _7_nrm.cfs, _2.fdx, _5_TestBloomFilteredLucene40Postings_0.tip, _9_nrm.cfs, _9.fdt, _0_TestBloomFilteredLucene40Postings_0.blm, _9_MockSep_0.pos, _8.fdt, _1_MockSep_0.tii, _3.si, _3_TestBloomFilteredLucene40Postings_0.tim, _6_MockSep_0.tii, _0.si, _1_TestBloomFilteredLucene40Postings_0.tim, _2_TestBloomFilteredLucene40Postings_0.prx, _8_TestBloomFilteredLucene40Postings_0.blm, _3_MockSep_0.pos, _8_MockSep_0.skp, _5.fdx, _1_MockSep_0.doc, _7_TestBloomFilteredLucene40Postings_0.frq, _4_TestBloomFilteredLucene40Postings_0.tip, _4.fdt, _6_TestBloomFilteredLucene40Postings_0.blm, _0_TestBloomFilteredLucene40Postings_0.tim, _4_SimpleText_0.pst, _3_MockSep_0.pyl, _1_MockSep_0.pyl, _9_nrm.cfe, _8_nrm.cfs, _0_nrm.cfe, _3_TestBloomFilteredLucene40Postings_0.prx, _8_nrm.cfe, _1_TestBloomFilteredLucene40Postings_0.prx, _1_nrm.cfs, _8_MockSep_0.frq, _0_MockSep_0.pos, _4_MockSep_0.pyl, _9_MockSep_0.pyl, _8_MockSep_0.tib, _2_MockSep_0.pos, _9_MockSep_0.tib, _8_MockSep_0.doc, _0.fdx, _1_TestBloomFilteredLucene40Postings_0.blm, _8.fdx, _6_MockSep_0.doc, _1_SimpleText_0.pst, _8.fnm, _4_nrm.cfs, _2_MockSep_0.skp, _6_MockSep_0.skp, _6_MockSep_0.pos, _1.fdt, _4.si, _5_TestBloomFilteredLucene40Postings_0.blm, _7_SimpleText_0.pst, _0_TestBloomFilteredLucene40Postings_0.frq, _2_TestBloomFilteredLucene40Postings_0.frq, _8_MockSep_0.pos, _2_MockSep_0.pyl, segments_4, _6.fnm]
[junit4:junit4]   2> 2433 T2106 C138 oasc.SolrDeletionPolicy.updateCommits newest commit = 4
[junit4:junit4]   2> 2436 T2125 C140 oass.SolrIndexSearcher.<init> Opening Searcher@38d7610b main
[junit4:junit4]   2> 2436 T2125 C140 oass.SolrIndexSearcher.getIndexDir WARNING WARNING: Directory impl does not support setting indexDir: org.apache.lucene.store.MockDirectoryWrapper
[junit4:junit4]   2> 2432 T2098 C137 oass.SolrIndexSearcher.<init> Opening Searcher@50760eee main
[junit4:junit4]   2> 2437 T2129 oasc.SolrCore.registerSearcher [collection1] Registered new searcher Searcher@38d7610b main{StandardDirectoryReader(segments_3:33:nrt _0(5.0):C10 _1(5.0):C34 _2(5.0):C11 _3(5.0):C5 _5(5.0):C1 _6(5.0):C3 _9(5.0):C1 _7(5.0):C2 _4(5.0):C4 _8(5.0):C13 _e(5.0):C19 _a(5.0):C12 _b(5.0):C16 _d(5.0):C10 _c(5.0):C8)}
[junit4:junit4]   2> 2437 T2098 C137 oass.SolrIndexSearcher.getIndexDir WARNING WARNING: Directory impl does not support setting indexDir: org.apache.lucene.store.MockDirectoryWrapper
[junit4:junit4]   2> 2437 T2125 C140 oasu.DirectUpdateHandler2.commit end_commit_flush
[junit4:junit4]   2> 2438 T2099 oasc.SolrCore.registerSearcher [collection1] Registered new searcher Searcher@50760eee main{StandardDirectoryReader(segments_a:47:nrt _j(5.0):C81 _3(5.0):C38 _4(5.0):C16 _c(5.0):C10 _d(5.0):C10 _i(5.0):C4 _g(5.0):C21 _h(5.0):C2 _f(5.0):C1 _l(5.0):C8 _k(5.0):C1)}
[junit4:junit4]   2> 2438 T2124 C140 oasu.DirectUpdateHandler2.commit start commit{flags=0,_version_=0,optimize=false,openSearcher=true,waitSearcher=true,expungeDeletes=false,softCommit=false}
[junit4:junit4]   2> 2438 T2106 C138 oass.SolrIndexSearcher.<init> Opening Searcher@6ca3cbdd main
[junit4:junit4]   2> 2438 T2106 C138 oass.SolrIndexSearcher.getIndexDir WARNING WARNING: Directory impl does not support setting indexDir: org.apache.lucene.store.MockDirectoryWrapper
[junit4:junit4]   2> 2439 T2109 oasc.SolrCore.registerSearcher [collection1] Registered new searcher Searcher@6ca3cbdd main{StandardDirectoryReader(segments_4:22:nrt _0(5.0):C45 _1(5.0):C3 _2(5.0):C9 _3(5.0):C3 _4(5.0):C31 _5(5.0):C49 _6(5.0):C7 _7(5.0):C3 _8(5.0):C1 _9(5.0):C9)}
[junit4:junit4]   2> 2438 T2125 C140 UPDATE [collection1] webapp=/solr path=/update params={waitSearcher=true&softCommit=false&expungeDeletes=false&version=2&wt=javabin&commit=true} {add=[39 (1413131702404907008), 41 (1413131702419587072), 44 (1413131702419587074), 45 (1413131702420635648), 46 (1413131702420635650), 49 (1413131702420635652), 53 (1413131702420635653), 54 (1413131702421684224), 57 (1413131702421684225), 58 (1413131702421684226)],commit=} 0 138
[junit4:junit4]   2> 2438 T2098 C137 oasu.DirectUpdateHandler2.commit end_commit_flush
[junit4:junit4]   2> 2439 T2106 C138 oasu.DirectUpdateHandler2.commit end_commit_flush
[junit4:junit4]   2> 2440 T2098 C137 UPDATE [collection1] webapp=/solr path=/update params={waitSearcher=true&softCommit=false&expungeDeletes=false&version=2&wt=javabin&commit=true} {add=[94 (1413131702398615552), 95 (1413131702400712704), 99 (1413131702400712705), 100 (1413131702401761280), 101 (1413131702401761281), 102 (1413131702401761282), 103 (1413131702401761283), 104 (1413131702401761284), 107 (1413131702401761285), 108 (1413131702402809856)],commit=} 0 146
[junit4:junit4]   2> 2440 T2104 C138 oasu.DirectUpdateHandler2.commit start commit{flags=0,_version_=0,optimize=false,openSearcher=true,waitSearcher=true,expungeDeletes=false,softCommit=false}
[junit4:junit4]   2> 2440 T2213 C137 oasu.DirectUpdateHandler2.commit start commit{flags=0,_version_=0,optimize=false,openSearcher=true,waitSearcher=true,expungeDeletes=false,softCommit=false}
[junit4:junit4]   2> 2441 T2104 C138 oass.SolrIndexSearcher.<init> Opening Searcher@1124f539 main
[junit4:junit4]   2> 2441 T2213 C137 oasc.SolrDeletionPolicy.onCommit SolrDeletionPolicy.onCommit: commits:num=2
[junit4:junit4]   2> 		commit{dir=MockDirWrapper(org.apache.lucene.store.RAMDirectory@499000bb lockFactory=org.apache.lucene.store.NativeFSLockFactory@36ba2cc3),segFN=segments_a,generation=10,filenames=[_c_nrm.cfe, _4_MockSep_0.skp, _g_nrm.cfe, _k_TestBloomFilteredLucene40Postings_0.tip, segments_a, _j.fnm, _3.fdt, _g.fnm, _i_TestBloomFilteredLucene40Postings_0.tip, _j.fdx, _h.fdt, _g_MockSep_0.pyl, _i_MockSep_0.tii, _3_nrm.cfe, _g_MockSep_0.tii, _j_MockSep_0.pos, _l_SimpleText_0.pst, _4.fnm, _h_TestBloomFilteredLucene40Postings_0.tip, _d_nrm.cfs, _4_TestBloomFilteredLucene40Postings_0.tim, _d.si, _i_TestBloomFilteredLucene40Postings_0.frq, _j_nrm.cfs, _4_TestBloomFilteredLucene40Postings_0.blm, _g_TestBloomFilteredLucene40Postings_0.prx, _f_MockSep_0.frq, _c_TestBloomFilteredLucene40Postings_0.tim, _h_TestBloomFilteredLucene40Postings_0.frq, _f_TestBloomFilteredLucene40Postings_0.tip, _g_nrm.cfs, _i_MockSep_0.pos, _h.si, _l_MockSep_0.tii, _3_TestBloomFilteredLucene40Postings_0.tip, _3_SimpleText_0.pst, _j_MockSep_0.pyl, _c.si, _h_MockSep_0.frq, _c_TestBloomFilteredLucene40Postings_0.frq, _h_TestBloomFilteredLucene40Postings_0.prx, _i_TestBloomFilteredLucene40Postings_0.blm, _h_nrm.cfe, _d_MockSep_0.frq, _c.fdt, _3_nrm.cfs, _4_MockSep_0.tib, _d.fdt, _h_SimpleText_0.pst, _d_MockSep_0.doc, _h_MockSep_0.tib, _i_TestBloomFilteredLucene40Postings_0.tim, _f_SimpleText_0.pst, _h_nrm.cfs, _4.fdx, _k_TestBloomFilteredLucene40Postings_0.blm, _k_nrm.cfs, _f_MockSep_0.skp, _3.fnm, _k_MockSep_0.skp, _g_MockSep_0.skp, _l_MockSep_0.frq, _3_TestBloomFilteredLucene40Postings_0.blm, _g.fdx, _k_MockSep_0.tib, _j_TestBloomFilteredLucene40Postings_0.tip, _4_MockSep_0.pos, _g_TestBloomFilteredLucene40Postings_0.tim, _d_MockSep_0.tii, _4_TestBloomFilteredLucene40Postings_0.prx, _d_MockSep_0.pos, _l.si, _f_MockSep_0.tii, _j_TestBloomFilteredLucene40Postings_0.frq, _i_SimpleText_0.pst, _l.fdt, _d_TestBloomFilteredLucene40Postings_0.blm, _i.fnm, _j.si, _c_TestBloomFilteredLucene40Postings_0.blm, _4_TestBloomFilteredLucene40Postings_0.tip, _4_SimpleText_0.pst, _d_TestBloomFilteredLucene40Postings_0.prx, _3_TestBloomFilteredLucene40Postings_0.prx, _f_TestBloomFilteredLucene40Postings_0.blm, _l_MockSep_0.doc, _l_nrm.cfe, _i.fdx, _l_MockSep_0.tib, _g.fdt, _l_MockSep_0.skp, _c.fnm, _i_MockSep_0.tib, _k.fdt, _k_MockSep_0.pyl, _c_MockSep_0.tib, _c_MockSep_0.pyl, _f_nrm.cfe, _4.si, _k.fnm, _j_MockSep_0.doc, _f_MockSep_0.pos, _h.fnm, _k_TestBloomFilteredLucene40Postings_0.frq, _d_MockSep_0.skp, _4_MockSep_0.doc, _4_MockSep_0.frq, _i_MockSep_0.pyl, _c_TestBloomFilteredLucene40Postings_0.prx, _k.si, _3_MockSep_0.skp, _i_MockSep_0.skp, _j_MockSep_0.frq, _g.si, _j.fdt, _k_MockSep_0.pos, _4_nrm.cfe, _c_SimpleText_0.pst, _i.fdt, _d_TestBloomFilteredLucene40Postings_0.tim, _f.fdt, _l_MockSep_0.pos, _l_nrm.cfs, _k.fdx, _h_MockSep_0.pos, _3_TestBloomFilteredLucene40Postings_0.frq, _3_MockSep_0.tib, _g_MockSep_0.doc, _g_MockSep_0.tib, _j_MockSep_0.skp, _l_MockSep_0.pyl, _i_nrm.cfs, _f_TestBloomFilteredLucene40Postings_0.tim, _c_MockSep_0.tii, _i_nrm.cfe, _h_MockSep_0.doc, _i_MockSep_0.doc, _k_MockSep_0.doc, _c_MockSep_0.frq, _g_TestBloomFilteredLucene40Postings_0.frq, _i_MockSep_0.frq, _g_TestBloomFilteredLucene40Postings_0.blm, _h.fdx, _h_MockSep_0.skp, _d_nrm.cfe, _j_MockSep_0.tib, _4_TestBloomFilteredLucene40Postings_0.frq, _i.si, _3.fdx, _j_TestBloomFilteredLucene40Postings_0.prx, _l.fnm, _d_MockSep_0.pyl, _f_nrm.cfs, _f_TestBloomFilteredLucene40Postings_0.frq, _j_TestBloomFilteredLucene40Postings_0.tim, _c_MockSep_0.skp, _c_MockSep_0.pos, _g_SimpleText_0.pst, _3_MockSep_0.tii, _f.fdx, _h_MockSep_0.pyl, _3_MockSep_0.doc, _f.fnm, _h_TestBloomFilteredLucene40Postings_0.blm, _h_MockSep_0.tii, _f_MockSep_0.doc, _4_MockSep_0.tii, _i_TestBloomFilteredLucene40Postings_0.prx, _f_MockSep_0.tib, _k_MockSep_0.tii, _l_TestBloomFilteredLucene40Postings_0.prx, _d_TestBloomFilteredLucene40Postings_0.tip, _l_TestBloomFilteredLucene40Postings_0.tip, _3_MockSep_0.frq, _l_TestBloomFilteredLucene40Postings_0.tim, _k_TestBloomFilteredLucene40Postings_0.tim, _j_nrm.cfe, _f.si, _f_TestBloomFilteredLucene40Postings_0.prx, _j_TestBloomFilteredLucene40Postings_0.blm, _c_MockSep_0.doc, _c.fdx, _3.si, _3_TestBloomFilteredLucene40Postings_0.tim, _k_MockSep_0.frq, _j_MockSep_0.tii, _3_MockSep_0.pos, _k_SimpleText_0.pst, _4.fdt, _d_MockSep_0.tib, _f_MockSep_0.pyl, _3_MockSep_0.pyl, _c_nrm.cfs, _d.fdx, _d.fnm, _4_MockSep_0.pyl, _d_SimpleText_0.pst, _g_TestBloomFilteredLucene40Postings_0.tip, _k_TestBloomFilteredLucene40Postings_0.prx, _l.fdx, _4_nrm.cfs, _g_MockSep_0.pos, _d_TestBloomFilteredLucene40Postings_0.frq, _l_TestBloomFilteredLucene40Postings_0.blm, _l_TestBloomFilteredLucene40Postings_0.frq, _c_TestBloomFilteredLucene40Postings_0.tip, _j_SimpleText_0.pst, _k_nrm.cfe, _g_MockSep_0.frq, _h_TestBloomFilteredLucene40Postings_0.tim]
[junit4:junit4]   2> 		commit{dir=MockDirWrapper(org.apache.lucene.store.RAMDirectory@499000bb lockFactory=org.apache.lucene.store.NativeFSLockFactory@36ba2cc3),segFN=segments_b,generation=11,filenames=[_j_MockSep_0.tii, _m.si, _j_nrm.cfs, segments_b, _j.si, _m.fnm, _m.fdt, _j_MockSep_0.frq, _m.fdx, _j.fnm, _m_SimpleText_0.pst, _m_MockSep_0.frq, _m_nrm.cfe, _m_TestBloomFilteredLucene40Postings_0.tip, _j.fdt, _m_MockSep_0.doc, _j_MockSep_0.tib, _j_MockSep_0.pyl, _m_TestBloomFilteredLucene40Postings_0.tim, _j.fdx, _m_MockSep_0.pyl, _j_nrm.cfe, _j_TestBloomFilteredLucene40Postings_0.tip, _j_TestBloomFilteredLucene40Postings_0.prx, _m_TestBloomFilteredLucene40Postings_0.frq, _m_MockSep_0.skp, _j_MockSep_0.pos, _j_TestBloomFilteredLucene40Postings_0.blm, _m_MockSep_0.pos, _j_MockSep_0.doc, _m_MockSep_0.tib, _m_MockSep_0.tii, _m_TestBloomFilteredLucene40Postings_0.blm, _j_SimpleText_0.pst, _j_MockSep_0.skp, _j_TestBloomFilteredLucene40Postings_0.tim, _j_TestBloomFilteredLucene40Postings_0.frq, _m_nrm.cfs, _m_TestBloomFilteredLucene40Postings_0.prx]
[junit4:junit4]   2> 2440 T2106 C138 UPDATE [collection1] webapp=/solr path=/update params={waitSearcher=true&softCommit=false&expungeDeletes=false&version=2&wt=javabin&commit=true} {add=[68 (1413131702391275520), 72 (1413131702391275522), 73 (1413131702400712704), 76 (1413131702400712706), 81 (1413131702400712708), 82 (1413131702401761280), 83 (1413131702401761281), 84 (1413131702401761282), 87 (1413131702401761283), 89 (1413131702402809856)],commit=} 0 153
[junit4:junit4]   2> 2442 T2213 C137 oasc.SolrDeletionPolicy.updateCommits newest commit = 11
[junit4:junit4]   2> 2441 T2104 C138 oass.SolrIndexSearcher.getIndexDir WARNING WARNING: Directory impl does not support setting indexDir: org.apache.lucene.store.MockDirectoryWrapper
[junit4:junit4]   2> 2441 T2124 C140 oasc.SolrDeletionPolicy.onCommit SolrDeletionPolicy.onCommit: commits:num=2
[junit4:junit4]   2> 		commit{dir=MockDirWrapper(org.apache.lucene.store.RAMDirectory@343b3df1 lockFactory=org.apache.lucene.store.NativeFSLockFactory@7622bcb7),segFN=segments_3,generation=3,filenames=[_6_TestBloomFilteredLucene40Postings_0.frq, _5_MockSep_0.tii, _4_MockSep_0.doc, _4_MockSep_0.frq, _7_TestBloomFilteredLucene40Postings_0.prx, _9_TestBloomFilteredLucene40Postings_0.tim, _2_nrm.cfe, _4_MockSep_0.skp, _5_TestBloomFilteredLucene40Postings_0.tim, _2_MockSep_0.frq, _5_MockSep_0.skp, _7_MockSep_0.tib, _9.fnm, _3_MockSep_0.skp, _2_nrm.cfs, _8_TestBloomFilteredLucene40Postings_0.frq, _7.si, _9_MockSep_0.tii, segments_3, _3.fdt, _9_TestBloomFilteredLucene40Postings_0.blm, _2.fdt, _5_TestBloomFilteredLucene40Postings_0.frq, _8_MockSep_0.tii, _2_MockSep_0.doc, _8_TestBloomFilteredLucene40Postings_0.prx, _4_nrm.cfe, _0.fdt, _2_MockSep_0.tii, _7_MockSep_0.pyl, _8_MockSep_0.pyl, _7_TestBloomFilteredLucene40Postings_0.tip, _7.fdt, _6_TestBloomFilteredLucene40Postings_0.prx, _6_nrm.cfe, _9_MockSep_0.frq, _5_nrm.cfs, _0_MockSep_0.tib, _3_nrm.cfe, _9_TestBloomFilteredLucene40Postings_0.prx, _3_TestBloomFilteredLucene40Postings_0.frq, _5_MockSep_0.doc, _4.fnm, _3_MockSep_0.tib, _1.fnm, _9_MockSep_0.skp, _4_TestBloomFilteredLucene40Postings_0.tim, _5_TestBloomFilteredLucene40Postings_0.prx, _8_TestBloomFilteredLucene40Postings_0.tim, _4_TestBloomFilteredLucene40Postings_0.blm, _0_MockSep_0.tii, _1_MockSep_0.skp, _7_MockSep_0.tii, _9.fdx, _7.fdx, _0_MockSep_0.doc, _8_SimpleText_0.pst, _5_MockSep_0.pyl, _7_nrm.cfe, _7.fnm, _5.si, _1_TestBloomFilteredLucene40Postings_0.tip, _0_TestBloomFilteredLucene40Postings_0.tip, _1_TestBloomFilteredLucene40Postings_0.frq, _3_TestBloomFilteredLucene40Postings_0.tip, _2_SimpleText_0.pst, _7_TestBloomFilteredLucene40Postings_0.blm, _3_SimpleText_0.pst, _4_TestBloomFilteredLucene40Postings_0.frq, _6_SimpleText_0.pst, _6_MockSep_0.tib, _3.fdx, _2_TestBloomFilteredLucene40Postings_0.tim, _1.fdx, _7_TestBloomFilteredLucene40Postings_0.tim, _5_nrm.cfe, _7_MockSep_0.frq, _2.fnm, _7_MockSep_0.skp, _6.fdx, _1_nrm.cfe, _6_TestBloomFilteredLucene40Postings_0.tim, _9_TestBloomFilteredLucene40Postings_0.tip, _2_TestBloomFilteredLucene40Postings_0.tip, _5_MockSep_0.frq, _3_nrm.cfs, _4_MockSep_0.tib, _9.si, _8_TestBloomFilteredLucene40Postings_0.tip, _7_MockSep_0.doc, _3_MockSep_0.tii, _5.fnm, _3_MockSep_0.doc, _7_MockSep_0.pos, _2_MockSep_0.tib, _2_TestBloomFilteredLucene40Postings_0.blm, _0_MockSep_0.skp, _2.si, _0_MockSep_0.pyl, _8.si, _1.si, _4.fdx, _5_SimpleText_0.pst, _6_nrm.cfs, _4_MockSep_0.tii, _3.fnm, _6_MockSep_0.pyl, _0_nrm.cfs, _5_MockSep_0.pos, _3_TestBloomFilteredLucene40Postings_0.blm, _3_MockSep_0.frq, _9_SimpleText_0.pst, _9_MockSep_0.doc, _6_MockSep_0.frq, _0_MockSep_0.frq, _5_MockSep_0.tib, _9_TestBloomFilteredLucene40Postings_0.frq, _0_SimpleText_0.pst, _4_MockSep_0.pos, _6.fdt, _6_TestBloomFilteredLucene40Postings_0.tip, _1_MockSep_0.tib, _0_TestBloomFilteredLucene40Postings_0.prx, _0.fnm, _1_MockSep_0.pos, _4_TestBloomFilteredLucene40Postings_0.prx, _6.si, _1_MockSep_0.frq, _5.fdt, _7_nrm.cfs, _2.fdx, _5_TestBloomFilteredLucene40Postings_0.tip, _9_nrm.cfs, _9.fdt, _0_TestBloomFilteredLucene40Postings_0.blm, _8.fdt, _9_MockSep_0.pos, _1_MockSep_0.tii, _3.si, _3_TestBloomFilteredLucene40Postings_0.tim, _6_MockSep_0.tii, _0.si, _1_TestBloomFilteredLucene40Postings_0.tim, _2_TestBloomFilteredLucene40Postings_0.prx, _8_TestBloomFilteredLucene40Postings_0.blm, _3_MockSep_0.pos, _8_MockSep_0.skp, _1_MockSep_0.doc, _5.fdx, _7_TestBloomFilteredLucene40Postings_0.frq, _4.fdt, _4_TestBloomFilteredLucene40Postings_0.tip, _4_SimpleText_0.pst, _6_TestBloomFilteredLucene40Postings_0.blm, _0_TestBloomFilteredLucene40Postings_0.tim, _3_MockSep_0.pyl, _1_MockSep_0.pyl, _9_nrm.cfe, _8_nrm.cfs, _0_nrm.cfe, _3_TestBloomFilteredLucene40Postings_0.prx, _8_nrm.cfe, _1_TestBloomFilteredLucene40Postings_0.prx, _1_nrm.cfs, _8_MockSep_0.frq, _0_MockSep_0.pos, _4_MockSep_0.pyl, _8_MockSep_0.tib, _9_MockSep_0.pyl, _2_MockSep_0.pos, _9_MockSep_0.tib, _8_MockSep_0.doc, _0.fdx, _1_TestBloomFilteredLucene40Postings_0.blm, _8.fdx, _6_MockSep_0.doc, _1_SimpleText_0.pst, _8.fnm, _4_nrm.cfs, _2_MockSep_0.skp, _6_MockSep_0.skp, _6_MockSep_0.pos, _4.si, _1.fdt, _5_TestBloomFilteredLucene40Postings_0.blm, _7_SimpleText_0.pst, _0_TestBloomFilteredLucene40Postings_0.frq, _2_TestBloomFilteredLucene40Postings_0.frq, _8_MockSep_0.pos, _2_MockSep_0.pyl, _6.fnm]
[junit4:junit4]   2> 		commit{dir=MockDirWrapper(org.apache.lucene.store.RAMDirectory@343b3df1 lockFactory=org.apache.lucene.store.NativeFSLockFactory@7622bcb7),segFN=segments_4,generation=4,filenames=[_d_MockSep_0.skp, _c_nrm.cfe, _a.fnm, _b_TestBloomFilteredLucene40Postings_0.frq, _c_TestBloomFilteredLucene40Postings_0.prx, _g_nrm.cfe, _e_MockSep_0.doc, _b_nrm.cfe, _g.si, _a_TestBloomFilteredLucene40Postings_0.prx, _g.fnm, _a_MockSep_0.skp, _c_SimpleText_0.pst, _f.fdt, _d_TestBloomFilteredLucene40Postings_0.tim, _g_MockSep_0.pyl, _e_MockSep_0.tii, _e_MockSep_0.pos, _g_MockSep_0.tii, _b.fdx, _a_SimpleText_0.pst, _b_MockSep_0.tii, _b_TestBloomFilteredLucene40Postings_0.blm, _a_nrm.cfs, _b.fdt, _b.fnm, _g_MockSep_0.tib, _g_MockSep_0.doc, _b_MockSep_0.frq, _f_TestBloomFilteredLucene40Postings_0.tim, _d_nrm.cfs, _b_MockSep_0.pos, _d.si, _g_TestBloomFilteredLucene40Postings_0.prx, _c_MockSep_0.tii, _f_MockSep_0.frq, _e_nrm.cfe, _b_TestBloomFilteredLucene40Postings_0.tip, _c_TestBloomFilteredLucene40Postings_0.tim, _e.fdx, _f_TestBloomFilteredLucene40Postings_0.tip, _g_nrm.cfs, _c_MockSep_0.frq, _g_TestBloomFilteredLucene40Postings_0.frq, _a_MockSep_0.tii, _a_TestBloomFilteredLucene40Postings_0.tim, _b_SimpleText_0.pst, _g_TestBloomFilteredLucene40Postings_0.blm, _e.fdt, _d_nrm.cfe, _a.fdx, _c.si, _c_TestBloomFilteredLucene40Postings_0.frq, _a_MockSep_0.pyl, _e.fnm, _d_MockSep_0.pyl, _b_MockSep_0.tib, _f_nrm.cfs, _f_TestBloomFilteredLucene40Postings_0.frq, _d_MockSep_0.frq, _c_MockSep_0.skp, _c.fdt, _c_MockSep_0.pos, _a_TestBloomFilteredLucene40Postings_0.tip, _g_SimpleText_0.pst, _d.fdt, _f.fdx, _a_MockSep_0.pos, _d_MockSep_0.doc, _e_TestBloomFilteredLucene40Postings_0.tim, _f_SimpleText_0.pst, _b_MockSep_0.pyl, _a_MockSep_0.frq, _f.fnm, _b_MockSep_0.skp, _e_SimpleText_0.pst, _f_MockSep_0.doc, _e_MockSep_0.frq, _f_MockSep_0.skp, _f_MockSep_0.tib, _g_MockSep_0.skp, _e_TestBloomFilteredLucene40Postings_0.prx, _d_TestBloomFilteredLucene40Postings_0.tip, _g.fdx, _e_TestBloomFilteredLucene40Postings_0.blm, _b_nrm.cfs, _f.si, _f_TestBloomFilteredLucene40Postings_0.prx, _g_TestBloomFilteredLucene40Postings_0.tim, _d_MockSep_0.tii, _e.si, _a_MockSep_0.tib, _e_TestBloomFilteredLucene40Postings_0.frq, _e_MockSep_0.skp, _d_MockSep_0.pos, _c_MockSep_0.doc, _f_MockSep_0.tii, _c.fdx, _e_MockSep_0.pyl, _b.si, _d_TestBloomFilteredLucene40Postings_0.blm, _a_MockSep_0.doc, _c_TestBloomFilteredLucene40Postings_0.blm, _d_MockSep_0.tib, _f_MockSep_0.pyl, _b_TestBloomFilteredLucene40Postings_0.tim, _d_TestBloomFilteredLucene40Postings_0.prx, _c_nrm.cfs, _a_TestBloomFilteredLucene40Postings_0.frq, _f_TestBloomFilteredLucene40Postings_0.blm, _a.si, _d.fdx, _d.fnm, _g.fdt, _e_MockSep_0.tib, _c.fnm, _a_TestBloomFilteredLucene40Postings_0.blm, _g_TestBloomFilteredLucene40Postings_0.tip, _b_TestBloomFilteredLucene40Postings_0.prx, _d_SimpleText_0.pst, _b_MockSep_0.doc, _e_nrm.cfs, _g_MockSep_0.pos, _d_TestBloomFilteredLucene40Postings_0.frq, _e_TestBloomFilteredLucene40Postings_0.tip, _c_MockSep_0.tib, _c_MockSep_0.pyl, _f_nrm.cfe, _a_nrm.cfe, _a.fdt, _c_TestBloomFilteredLucene40Postings_0.tip, _f_MockSep_0.pos, segments_4, _g_MockSep_0.frq]
[junit4:junit4]   2> 2443 T2104 C138 oasu.DirectUpdateHandler2.commit end_commit_flush
[junit4:junit4]   2> 2444 T2124 C140 oasc.SolrDeletionPolicy.updateCommits newest commit = 4
[junit4:junit4]   2> 2443 T2109 oasc.SolrCore.registerSearcher [collection1] Registered new searcher Searcher@1124f539 main{StandardDirectoryReader(segments_4:22:nrt _0(5.0):C45 _1(5.0):C3 _2(5.0):C9 _3(5.0):C3 _4(5.0):C31 _5(5.0):C49 _6(5.0):C7 _7(5.0):C3 _8(5.0):C1 _9(5.0):C9)}
[junit4:junit4]   2> 2444 T2103 C138 oasu.DirectUpdateHandler2.commit start commit{flags=0,_version_=0,optimize=false,openSearcher=true,waitSearcher=true,expungeDeletes=false,softCommit=false}
[junit4:junit4]   2> 2444 T2104 C138 UPDATE [collection1] webapp=/solr path=/update params={waitSearcher=true&softCommit=false&expungeDeletes=false&version=2&wt=javabin&commit=true} {add=[27 (1413131702388129792), 33 (1413131702388129794), 34 (1413131702389178369), 36 (1413131702389178371), 37 (1413131702389178373), 38 (1413131702389178375), 40 (1413131702390226945), 41 (1413131702390226947), 43 (1413131702403858432), 44 (1413131702403858434)],commit=} 0 160
[junit4:junit4]   2> 2445 T2103 C138 oass.SolrIndexSearcher.<init> Opening Searcher@190bfb9e main
[junit4:junit4]   2> 2445 T2103 C138 oass.SolrIndexSearcher.getIndexDir WARNING WARNING: Directory impl does not support setting indexDir: org.apache.lucene.store.MockDirectoryWrapper
[junit4:junit4]   2> 2446 T2109 oasc.SolrCore.registerSearcher [collection1] Registered new searcher Searcher@190bfb9e main{StandardDirectoryReader(segments_4:22:nrt _0(5.0):C45 _1(5.0):C3 _2(5.0):C9 _3(5.0):C3 _4(5.0):C31 _5(5.0):C49 _6(5.0):C7 _7(5.0):C3 _8(5.0):C1 _9(5.0):C9)}
[junit4:junit4]   2> 2446 T2103 C138 oasu.DirectUpdateHandler2.commit end_commit_flush
[junit4:junit4]   2> 2446 T2103 C138 UPDATE [collection1] webapp=/solr path=/update params={waitSearcher=true&softCommit=false&expungeDeletes=false&version=2&wt=javabin&commit=true} {add=[8 (1413131702375546880), 9 (1413131702392324101), 10 (1413131702393372673), 13 (1413131702393372674), 15 (1413131702393372675), 16 (1413131702393372676), 18 (1413131702393372677), 20 (1413131702394421248), 23 (1413131702404907008), 25 (1413131702404907010)],commit=} 0 174
[junit4:junit4]   2> 2446 T2108 C138 oasu.DirectUpdateHandler2.commit start commit{flags=0,_version_=0,optimize=false,openSearcher=true,waitSearcher=true,expungeDeletes=false,softCommit=false}
[junit4:junit4]   2> 2447 T2213 C137 oass.SolrIndexSearcher.<init> Opening Searcher@a4ae8a5 main
[junit4:junit4]   2> 2447 T2108 C138 oass.SolrIndexSearcher.<init> Opening Searcher@43880357 main
[junit4:junit4]   2> 2448 T2213 C137 oass.SolrIndexSearcher.getIndexDir WARNING WARNING: Directory impl does not support setting indexDir: org.apache.lucene.store.MockDirectoryWrapper
[junit4:junit4]   2> 2448 T2108 C138 oass.SolrIndexSearcher.getIndexDir WARNING WARNING: Directory impl does not support setting indexDir: org.apache.lucene.store.MockDirectoryWrapper
[junit4:junit4]   2> 2448 T2099 oasc.SolrCore.registerSearcher [collection1] Registered new searcher Searcher@a4ae8a5 main{StandardDirectoryReader(segments_b:48:nrt _j(5.0):C81 _m(5.0):C111)}
[junit4:junit4]   2> 2448 T2213 C137 oasu.DirectUpdateHandler2.commit end_commit_flush
[junit4:junit4]   2> 2449 T2109 oasc.SolrCore.registerSearcher [collection1] Registered new searcher Searcher@43880357 main{StandardDirectoryReader(segments_4:22:nrt _0(5.0):C45 _1(5.0):C3 _2(5.0):C9 _3(5.0):C3 _4(5.0):C31 _5(5.0):C49 _6(5.0):C7 _7(5.0):C3 _8(5.0):C1 _9(5.0):C9)}
[junit4:junit4]   2> 2449 T2210 C137 oasu.DirectUpdateHandler2.commit start commit{flags=0,_version_=0,optimize=false,openSearcher=true,waitSearcher=true,expungeDeletes=false,softCommit=false}
[junit4:junit4]   2> 2448 T2108 C138 oasu.DirectUpdateHandler2.commit end_commit_flush
[junit4:junit4]   2> 2449 T2108 C138 UPDATE [collection1] webapp=/solr path=/update params={waitSearcher=true&softCommit=false&expungeDeletes=false&version=2&wt=javabin&commit=true} {add=[126 (1413131702398615552), 130 (1413131702399664128), 131 (1413131702399664129), 133 (1413131702399664130), 134 (1413131702403858433), 136 (1413131702404907009), 138 (1413131702404907011), 141 (1413131702404907012), 143 (1413131702404907013), 145 (1413131702405955584)],commit=} 0 155
[junit4:junit4]   2> 2449 T2210 C137 oass.SolrIndexSearcher.<init> Opening Searcher@37d36977 main
[junit4:junit4]   2> 2450 T2215 C138 oasu.DirectUpdateHandler2.commit start commit{flags=0,_version_=0,optimize=false,openSearcher=true,waitSearcher=true,expungeDeletes=false,softCommit=false}
[junit4:junit4]   2> 2450 T2210 C137 oass.SolrIndexSearcher.getIndexDir WARNING WARNING: Directory impl does not support setting indexDir: org.apache.lucene.store.MockDirectoryWrapper
[junit4:junit4]   2> 2450 T2099 oasc.SolrCore.registerSearcher [collection1] Registered new searcher Searcher@37d36977 main{StandardDirectoryReader(segments_b:48:nrt _j(5.0):C81 _m(5.0):C111)}
[junit4:junit4]   2> 2451 T2215 C138 oass.SolrIndexSearcher.<init> Opening Searcher@2dfcf75e main
[junit4:junit4]   2> 2450 T2210 C137 oasu.DirectUpdateHandler2.commit end_commit_flush
[junit4:junit4]   2> 2451 T2215 C138 oass.SolrIndexSearcher.getIndexDir WARNING WARNING: Directory impl does not support setting indexDir: org.apache.lucene.store.MockDirectoryWrapper
[junit4:junit4]   2> 2451 T2209 C137 oasu.DirectUpdateHandler2.commit start commit{flags=0,_version_=0,optimize=false,openSearcher=true,waitSearcher=true,expungeDeletes=false,softCommit=false}
[junit4:junit4]   2> 2451 T2210 C137 UPDATE [collection1] webapp=/solr path=/update params={waitSearcher=true&softCommit=false&expungeDeletes=false&version=2&wt=javabin&commit=true} {add=[272 (1413131702415392768), 276 (1413131702434267136), 278 (1413131702434267141), 279 (1413131702434267143), 281 (1413131702434267147), 283 (1413131702435315713), 284 (1413131702435315717), 287 (1413131702435315719), 288 (1413131702437412865), 292 (1413131702437412866)],commit=} 0 141
[junit4:junit4]   2> 2452 T2109 oasc.SolrCore.registerSearcher [collection1] Registered new searcher Searcher@2dfcf75e main{StandardDirectoryReader(segments_4:22:nrt _0(5.0):C45 _1(5.0):C3 _2(5.0):C9 _3(5.0):C3 _4(5.0):C31 _5(5.0):C49 _6(5.0):C7 _7(5.0):C3 _8(5.0):C1 _9(5.0):C9)}
[junit4:junit4]   2> 2452 T2209 C137 oass.SolrIndexSearcher.<init> Opening Searcher@2da6a997 main
[junit4:junit4]   2> 2451 T2215 C138 oasu.DirectUpdateHandler2.commit end_commit_flush
[junit4:junit4]   2> 2452 T2209 C137 oass.SolrIndexSearcher.getIndexDir WARNING WARNING: Directory impl does not support setting indexDir: org.apache.lucene.store.MockDirectoryWrapper
[junit4:junit4]   2> 2452 T2215 C138 UPDATE [collection1] webapp=/solr path=/update params={waitSearcher=true&softCommit=false&expungeDeletes=false&version=2&wt=javabin&commit=true} {add=[314 (1413131702423781379), 315 (1413131702423781380), 318 (1413131702424829952), 322 (1413131702424829953), 323 (1413131702424829954), 326 (1413131702424829955), 328 (1413131702424829956), 329 (1413131702424829957), 331 (1413131702424829958), 333 (1413131702425878528)],commit=} 0 134
[junit4:junit4]   2> 2453 T2099 oasc.SolrCore.registerSearcher [collection1] Registered new searcher Searcher@2da6a997 main{StandardDirectoryReader(segments_b:48:nrt _j(5.0):C81 _m(5.0):C111)}
[junit4:junit4]   2> 2453 T2209 C137 oasu.DirectUpdateHandler2.commit end_commit_flush
[junit4:junit4]   2> 2452 T2213 C137 UPDATE [collection1] webapp=/solr path=/update params={waitSearcher=true&softCommit=false&expungeDeletes=false&version=2&wt=javabin&commit=true} {add=[220 (1413131702416441345), 221 (1413131702433218560), 225 (1413131702433218562), 227 (1413131702433218563), 229 (1413131702433218564), 232 (1413131702434267137), 234 (1413131702434267139), 236 (1413131702434267145), 237 (1413131702434267149), 238 (1413131702435315714)],commit=} 0 141
[junit4:junit4]   2> 2453 T2209 C137 UPDATE [collection1] webapp=/solr path=/update params={waitSearcher=true&softCommit=false&expungeDeletes=false&version=2&wt=javabin&commit=true} {add=[257 (1413131702415392769), 258 (1413131702434267142), 259 (1413131702434267146), 261 (1413131702434267150), 262 (1413131702435315715), 263 (1413131702435315721), 264 (1413131702437412869), 265 (1413131702437412872), 267 (1413131702437412875), 271 (1413131702437412878)],commit=} 0 143
[junit4:junit4]   2> 2452 T2202 C138 oasu.DirectUpdateHandler2.commit start commit{flags=0,_version_=0,optimize=false,openSearcher=true,waitSearcher=true,expungeDeletes=false,softCommit=false}
[junit4:junit4]   2> 2453 T2212 C137 oasu.DirectUpdateHandler2.commit start commit{flags=0,_version_=0,optimize=false,openSearcher=true,waitSearcher=true,expungeDeletes=false,softCommit=false}
[junit4:junit4]   2> 2454 T2124 C140 oass.SolrIndexSearcher.<init> Opening Searcher@23f7ff72 main
[junit4:junit4]   2> 2454 T2212 C137 oass.SolrIndexSearcher.<init> Opening Searcher@6c2808e main
[junit4:junit4]   2> 2454 T2124 C140 oass.SolrIndexSearcher.getIndexDir WARNING WARNING: Directory impl does not support setting indexDir: org.apache.lucene.store.MockDirectoryWrapper
[junit4:junit4]   2> 2454 T2212 C137 oass.SolrIndexSearcher.getIndexDir WARNING WARNING: Directory impl does not support setting indexDir: org.apache.lucene.store.MockDirectoryWrapper
[junit4:junit4]   2> 2455 T2129 oasc.SolrCore.registerSearcher [collection1] Registered new searcher Searcher@23f7ff72 main{StandardDirectoryReader(segments_4:35:nrt _f(5.0):C84 _e(5.0):C19 _a(5.0):C12 _b(5.0):C16 _d(5.0):C10 _c(5.0):C8 _g(5.0):C1)}
[junit4:junit4]   2> 2455 T2212 C137 oasu.DirectUpdateHandler2.commit end_commit_flush
[junit4:junit4]   2> 2454 T2202 C138 oass.SolrIndexSearcher.<init> Opening Searcher@4b85ee19 main
[junit4:junit4]   2> 2455 T2211 C137 oasu.DirectUpdateHandler2.commit start commit{flags=0,_version_=0,optimize=false,openSearcher=true,waitSearcher=true,expungeDeletes=false,softCommit=false}
[junit4:junit4]   2> 2455 T2202 C138 oass.SolrIndexSearcher.getIndexDir WARNING WARNING: Directory impl does not support setting indexDir: org.apache.lucene.store.MockDirectoryWrapper
[junit4:junit4]   2> 2455 T2099 oasc.SolrCore.registerSearcher [collection1] Registered new searcher Searcher@6c2808e main{StandardDirectoryReader(segments_b:48:nrt _j(5.0):C81 _m(5.0):C111)}
[junit4:junit4]   2> 2455 T2124 C140 oasu.DirectUpdateHandler2.commit end_commit_flush
[junit4:junit4]   2> 2456 T2109 oasc.SolrCore.registerSearcher [collection1] Registered new searcher Searcher@4b85ee19 main{StandardDirectoryReader(segments_4:22:nrt _0(5.0):C45 _1(5.0):C3 _2(5.0):C9 _3(5.0):C3 _4(5.0):C31 _5(5.0):C49 _6(5.0):C7 _7(5.0):C3 _8(5.0):C1 _9(5.0):C9)}
[junit4:junit4]   2> 2456 T2127 C140 oasu.DirectUpdateHandler2.commit start commit{flags=0,_version_=0,optimize=false,openSearcher=true,waitSearcher=true,expungeDeletes=false,softCommit=false}
[junit4:junit4]   2> 2456 T2202 C138 oasu.DirectUpdateHandler2.commit end_commit_flush
[junit4:junit4]   2> 2456 T2212 C137 UPDATE [collection1] webapp=/solr path=/update params={waitSearcher=true&softCommit=false&expungeDeletes=false&version=2&wt=javabin&commit=true} {add=[175 (1413131702416441344), 176 (1413131702436364288), 184 (1413131702436364289), 187 (1413131702437412864), 188 (1413131702437412868), 190 (1413131702437412870), 193 (1413131702437412873), 196 (1413131702437412876), 198 (1413131702437412880), 199 (1413131702437412882)],commit=} 0 145
[junit4:junit4]   2> 2457 T2124 C140 UPDATE [collection1] webapp=/solr path=/update params={waitSearcher=true&softCommit=false&expungeDeletes=false&version=2&wt=javabin&commit=true} {add=[25 (1413131702387081216), 26 (1413131702418538496), 29 (1413131702419587073), 30 (1413131702419587075), 31 (1413131702420635649), 33 (1413131702420635651), 35 (1413131702433218561), 36 (1413131702433218563), 37 (1413131702433218566), 38 (1413131702433218569)],commit=} 0 174
[junit4:junit4]   2> 2457 T2202 C138 UPDATE [collection1] webapp=/solr path=/update params={waitSearcher=true&softCommit=false&expungeDeletes=false&version=2&wt=javabin&commit=true} {add=[167 (1413131702422732801), 168 (1413131702423781376), 170 (1413131702423781378), 171 (1413131702436364289), 173 (1413131702436364291), 178 (1413131702437412865), 181 (1413131702437412867), 184 (1413131702437412868), 186 (1413131702437412869), 187 (1413131702437412870)],commit=} 0 140
[junit4:junit4]   2> 2456 T2211 C137 oass.SolrIndexSearcher.<init> Opening Searcher@3c9c4b03 main
[junit4:junit4]   2> 2457 T2127 C140 oass.SolrIndexSearcher.<init> Opening Searcher@48dacf19 main
[junit4:junit4]   2> 2458 T2211 C137 oass.SolrIndexSearcher.getIndexDir WARNING WARNING: Directory impl does not support setting indexDir: org.apache.lucene.store.MockDirectoryWrapper
[junit4:junit4]   2> 2458 T2127 C140 oass.SolrIndexSearcher.getIndexDir WARNING WARNING: Directory impl does not support setting indexDir: org.apache.lucene.store.MockDirectoryWrapper
[junit4:junit4]   2> 2458 T2099 oasc.SolrCore.registerSearcher [collection1] Registered new searcher Searche

[...truncated too long message...]

util.concurrent.ExecutorCompletionService$QueueingFuture@1856cce5 rejected from java.util.concurrent.ThreadPoolExecutor@6aa5dade[Running, pool size = 80, active threads = 80, queued tasks = 0, completed tasks = 13]
[junit4:junit4]    > 	at __randomizedtesting.SeedInfo.seed([8796F267651BB78C:6707C7F1244D7B0]:0)
[junit4:junit4]    > 	at java.util.concurrent.ThreadPoolExecutor$AbortPolicy.rejectedExecution(ThreadPoolExecutor.java:2015)
[junit4:junit4]    > 	at java.util.concurrent.ThreadPoolExecutor.reject(ThreadPoolExecutor.java:816)
[junit4:junit4]    > 	at java.util.concurrent.ThreadPoolExecutor.execute(ThreadPoolExecutor.java:1337)
[junit4:junit4]    > 	at java.util.concurrent.ExecutorCompletionService.submit(ExecutorCompletionService.java:181)
[junit4:junit4]    > 	at org.apache.solr.update.SolrCmdDistributor.submit(SolrCmdDistributor.java:356)
[junit4:junit4]    > 	at org.apache.solr.update.SolrCmdDistributor.submit(SolrCmdDistributor.java:301)
[junit4:junit4]    > 	at org.apache.solr.update.SolrCmdDistributor.flushAdds(SolrCmdDistributor.java:233)
[junit4:junit4]    > 	at org.apache.solr.update.SolrCmdDistributor.distribAdd(SolrCmdDistributor.java:147)
[junit4:junit4]    > 	at org.apache.solr.update.SolrCmdDistributorTest.doTest(SolrCmdDistributorTest.java:204)
[junit4:junit4]    > 	at org.apache.solr.BaseDistributedSearchTestCase.testDistribSearch(BaseDistributedSearchTestCase.java:691)
[junit4:junit4]    > 	at sun.reflect.NativeMethodAccessorImpl.invoke0(Native Method)
[junit4:junit4]    > 	at sun.reflect.NativeMethodAccessorImpl.invoke(NativeMethodAccessorImpl.java:57)
[junit4:junit4]    > 	at sun.reflect.DelegatingMethodAccessorImpl.invoke(DelegatingMethodAccessorImpl.java:43)
[junit4:junit4]    > 	at java.lang.reflect.Method.invoke(Method.java:474)
[junit4:junit4]    > 	at com.carrotsearch.randomizedtesting.RandomizedRunner.invoke(RandomizedRunner.java:1559)
[junit4:junit4]    > 	at com.carrotsearch.randomizedtesting.RandomizedRunner.access$600(RandomizedRunner.java:79)
[junit4:junit4]    > 	at com.carrotsearch.randomizedtesting.RandomizedRunner$6.evaluate(RandomizedRunner.java:737)
[junit4:junit4]    > 	at com.carrotsearch.randomizedtesting.RandomizedRunner$7.evaluate(RandomizedRunner.java:773)
[junit4:junit4]    > 	at com.carrotsearch.randomizedtesting.RandomizedRunner$8.evaluate(RandomizedRunner.java:787)
[junit4:junit4]    > 	at com.carrotsearch.randomizedtesting.rules.SystemPropertiesRestoreRule$1.evaluate(SystemPropertiesRestoreRule.java:53)
[junit4:junit4]    > 	at org.apache.lucene.util.TestRuleSetupTeardownChained$1.evaluate(TestRuleSetupTeardownChained.java:50)
[junit4:junit4]    > 	at org.apache.lucene.util.TestRuleFieldCacheSanity$1.evaluate(TestRuleFieldCacheSanity.java:51)
[junit4:junit4]    > 	at org.apache.lucene.util.AbstractBeforeAfterRule$1.evaluate(AbstractBeforeAfterRule.java:45)
[junit4:junit4]    > 	at com.carrotsearch.randomizedtesting.rules.SystemPropertiesInvariantRule$1.evaluate(SystemPropertiesInvariantRule.java:55)
[junit4:junit4]    > 	at org.apache.lucene.util.TestRuleThreadAndTestName$1.evaluate(TestRuleThreadAndTestName.java:48)
[junit4:junit4]    > 	at org.apache.lucene.util.TestRuleIgnoreAfterMaxFailures$1.evaluate(TestRuleIgnoreAfterMaxFailures.java:70)
[junit4:junit4]    > 	at org.apache.lucene.util.TestRuleMarkFailure$1.evaluate(TestRuleMarkFailure.java:48)
[junit4:junit4]    > 	at com.carrotsearch.randomizedtesting.rules.StatementAdapter.evaluate(StatementAdapter.java:36)
[junit4:junit4]    > 	at com.carrotsearch.randomizedtesting.ThreadLeakControl$StatementRunner.run(ThreadLeakControl.java:358)
[junit4:junit4]    > 	at com.carrotsearch.randomizedtesting.ThreadLeakControl.forkTimeoutingTask(ThreadLeakControl.java:782)
[junit4:junit4]    > 	at com.carrotsearch.randomizedtesting.ThreadLeakControl$3.evaluate(ThreadLeakControl.java:442)
[junit4:junit4]    > 	at com.carrotsearch.randomizedtesting.RandomizedRunner.runSingleTest(RandomizedRunner.java:746)
[junit4:junit4]    > 	at com.carrotsearch.randomizedtesting.RandomizedRunner$3.evaluate(RandomizedRunner.java:648)
[junit4:junit4]    > 	at com.carrotsearch.randomizedtesting.RandomizedRunner$4.evaluate(RandomizedRunner.java:682)
[junit4:junit4]    > 	at com.carrotsearch.randomizedtesting.RandomizedRunner$5.evaluate(RandomizedRunner.java:693)
[junit4:junit4]    > 	at com.carrotsearch.randomizedtesting.rules.StatementAdapter.evaluate(StatementAdapter.java:36)
[junit4:junit4]    > 	at com.carrotsearch.randomizedtesting.rules.SystemPropertiesRestoreRule$1.evaluate(SystemPropertiesRestoreRule.java:53)
[junit4:junit4]    > 	at org.apache.lucene.util.AbstractBeforeAfterRule$1.evaluate(AbstractBeforeAfterRule.java:45)
[junit4:junit4]    > 	at org.apache.lucene.util.TestRuleStoreClassName$1.evaluate(TestRuleStoreClassName.java:42)
[junit4:junit4]    > 	at com.carrotsearch.randomizedtesting.rules.SystemPropertiesInvariantRule$1.evaluate(SystemPropertiesInvariantRule.java:55)
[junit4:junit4]    > 	at com.carrotsearch.randomizedtesting.rules.NoShadowingOrOverridesOnMethodsRule$1.evaluate(NoShadowingOrOverridesOnMethodsRule.java:39)
[junit4:junit4]    > 	at com.carrotsearch.randomizedtesting.rules.NoShadowingOrOverridesOnMethodsRule$1.evaluate(NoShadowingOrOverridesOnMethodsRule.java:39)
[junit4:junit4]    > 	at com.carrotsearch.randomizedtesting.rules.StatementAdapter.evaluate(StatementAdapter.java:36)
[junit4:junit4]    > 	at org.apache.lucene.util.TestRuleAssertionsRequired$1.evaluate(TestRuleAssertionsRequired.java:43)
[junit4:junit4]    > 	at org.apache.lucene.util.TestRuleMarkFailure$1.evaluate(TestRuleMarkFailure.java:48)
[junit4:junit4]    > 	at org.apache.lucene.util.TestRuleIgnoreAfterMaxFailures$1.evaluate(TestRuleIgnoreAfterMaxFailures.java:70)
[junit4:junit4]    > 	at org.apache.lucene.util.TestRuleIgnoreTestSuites$1.evaluate(TestRuleIgnoreTestSuites.java:55)
[junit4:junit4]    > 	at com.carrotsearch.randomizedtesting.rules.StatementAdapter.evaluate(StatementAdapter.java:36)
[junit4:junit4]    > 	at com.carrotsearch.randomizedtesting.ThreadLeakControl$StatementRunner.run(ThreadLeakControl.java:358)
[junit4:junit4]    > 	at java.lang.Thread.run(Thread.java:722)
[junit4:junit4]   2> 202984 T2079 oas.SolrTestCaseJ4.deleteCore ###deleteCore
[junit4:junit4]   2> NOTE: test params are: codec=Lucene40: {range_facet_sl=PostingsFormat(name=TestBloomFilteredLucene40Postings), timestamp=PostingsFormat(name=MockSep), id=PostingsFormat(name=TestBloomFilteredLucene40Postings), multiDefault=PostingsFormat(name=MockSep), range_facet_l=PostingsFormat(name=MockSep), _version_=PostingsFormat(name=MockSep), range_facet_si=PostingsFormat(name=SimpleText), intDefault=PostingsFormat(name=MockSep)}, sim=RandomSimilarityProvider(queryNorm=false,coord=no): {}, locale=en_AU, timezone=America/Mendoza
[junit4:junit4]   2> NOTE: Linux 3.2.0-30-generic amd64/Oracle Corporation 1.8.0-ea (64-bit)/cpus=8,threads=1,free=414728688,total=520093696
[junit4:junit4]   2> NOTE: All tests run in this JVM: [TestUtils, TermVectorComponentTest, ZkSolrClientTest, TestReplicationHandler, OpenExchangeRatesOrgProviderTest, TestPropInjectDefaults, TestBM25SimilarityFactory, SuggesterTSTTest, TestSolrJ, DirectUpdateHandlerTest, TestPhraseSuggestions, SolrCoreTest, TestCodecSupport, DistributedQueryElevationComponentTest, IndexSchemaTest, StatelessScriptUpdateProcessorFactoryTest, TestDFRSimilarityFactory, SpellingQueryConverterTest, TestPluginEnable, TestBinaryField, UUIDFieldTest, TestDistributedSearch, SolrIndexConfigTest, DOMUtilTest, TestSolrDeletionPolicy1, HighlighterTest, TestArbitraryIndexDir, TestOmitPositions, TestRealTimeGet, ShowFileRequestHandlerTest, PeerSyncTest, TestQuerySenderListener, TestPropInject, TestSurroundQueryParser, StatsComponentTest, LukeRequestHandlerTest, LegacyHTMLStripCharFilterTest, ClusterStateTest, TestCSVLoader, TestValueSourceCache, QueryParsingTest, TestHashPartitioner, MultiTermTest, BasicFunctionalityTest, TestReversedWildcardFilterFactory, TestWriterPerf, TestLRUCache, ScriptEngineTest, PolyFieldTest, DebugComponentTest, TestQueryUtils, TestRemoteStreaming, FullSolrCloudDistribCmdsTest, TimeZoneUtilsTest, TestJmxIntegration, SignatureUpdateProcessorFactoryTest, OverseerTest, RecoveryZkTest, LeaderElectionTest, DistributedSpellCheckComponentTest, TestExtendedDismaxParser, SoftAutoCommitTest, BasicZkTest, IndexBasedSpellCheckerTest, TestRangeQuery, TestSort, FileBasedSpellCheckerTest, ConvertedLegacyTest, QueryElevationComponentTest, SortByFunctionTest, TestBinaryResponseWriter, TestIndexSearcher, TestFunctionQuery, TestTrie, DirectSolrConnectionTest, QueryEqualityTest, TestWordDelimiterFilterFactory, SpatialFilterTest, TestCSVResponseWriter, DocumentBuilderTest, DisMaxRequestHandlerTest, BinaryUpdateRequestHandlerTest, XsltUpdateRequestHandlerTest, TestQueryTypes, XmlUpdateRequestHandlerTest, SuggesterWFSTTest, IndexSchemaRuntimeFieldTest, ReturnFieldsTest, RequiredFieldsTest, CopyFieldTest, SolrCmdDistributorTest]
[junit4:junit4] Completed on J1 in 203.22s, 1 test, 1 error <<< FAILURES!

[...truncated 17 lines...]
BUILD FAILED
/mnt/ssd/jenkins/workspace/Lucene-Solr-trunk-Linux/build.xml:29: The following error occurred while executing this line:
/mnt/ssd/jenkins/workspace/Lucene-Solr-trunk-Linux/solr/build.xml:146: The following error occurred while executing this line:
/mnt/ssd/jenkins/workspace/Lucene-Solr-trunk-Linux/lucene/module-build.xml:63: The following error occurred while executing this line:
/mnt/ssd/jenkins/workspace/Lucene-Solr-trunk-Linux/lucene/common-build.xml:1133: The following error occurred while executing this line:
/mnt/ssd/jenkins/workspace/Lucene-Solr-trunk-Linux/lucene/common-build.xml:810: There were test failures: 228 suites, 923 tests, 1 error, 6 ignored (1 assumption)

Total time: 25 minutes 46 seconds
Build step 'Invoke Ant' marked build as failure
Recording test results
Description set: Java: 64bit/jdk1.8.0-ea-b51 -XX:+UseG1GC
Email was triggered for: Failure
Sending email for trigger: Failure



Mime
View raw message