lucene-dev mailing list archives

Site index · List index
Message view « Date » · « Thread »
Top « Date » · « Thread »
From Apache Jenkins Server <jenk...@builds.apache.org>
Subject [JENKINS] Lucene-Solr-Tests-trunk-Java6 - Build # 15277 - Failure
Date Fri, 21 Sep 2012 08:20:38 GMT
Build: https://builds.apache.org/job/Lucene-Solr-Tests-trunk-Java6/15277/

2 tests failed.
REGRESSION:  org.apache.solr.cloud.BasicDistributedZk2Test.testDistribSearch

Error Message:
Shard still reported as live in zk

Stack Trace:
java.lang.AssertionError: Shard still reported as live in zk
	at __randomizedtesting.SeedInfo.seed([CD0D470BF05B7732:4CEBC9138704170E]:0)
	at org.junit.Assert.fail(Assert.java:93)
	at org.apache.solr.cloud.AbstractFullDistribZkTestBase.waitToSeeNotLive(AbstractFullDistribZkTestBase.java:1220)
	at org.apache.solr.cloud.BasicDistributedZk2Test.brindDownShardIndexSomeDocsAndRecover(BasicDistributedZk2Test.java:190)
	at org.apache.solr.cloud.BasicDistributedZk2Test.doTest(BasicDistributedZk2Test.java:83)
	at org.apache.solr.BaseDistributedSearchTestCase.testDistribSearch(BaseDistributedSearchTestCase.java:695)
	at sun.reflect.NativeMethodAccessorImpl.invoke0(Native Method)
	at sun.reflect.NativeMethodAccessorImpl.invoke(NativeMethodAccessorImpl.java:57)
	at sun.reflect.DelegatingMethodAccessorImpl.invoke(DelegatingMethodAccessorImpl.java:43)
	at java.lang.reflect.Method.invoke(Method.java:616)
	at com.carrotsearch.randomizedtesting.RandomizedRunner.invoke(RandomizedRunner.java:1559)
	at com.carrotsearch.randomizedtesting.RandomizedRunner.access$600(RandomizedRunner.java:79)
	at com.carrotsearch.randomizedtesting.RandomizedRunner$6.evaluate(RandomizedRunner.java:737)
	at com.carrotsearch.randomizedtesting.RandomizedRunner$7.evaluate(RandomizedRunner.java:773)
	at com.carrotsearch.randomizedtesting.RandomizedRunner$8.evaluate(RandomizedRunner.java:787)
	at com.carrotsearch.randomizedtesting.rules.SystemPropertiesRestoreRule$1.evaluate(SystemPropertiesRestoreRule.java:53)
	at org.apache.lucene.util.TestRuleSetupTeardownChained$1.evaluate(TestRuleSetupTeardownChained.java:50)
	at org.apache.lucene.util.TestRuleFieldCacheSanity$1.evaluate(TestRuleFieldCacheSanity.java:51)
	at org.apache.lucene.util.AbstractBeforeAfterRule$1.evaluate(AbstractBeforeAfterRule.java:45)
	at com.carrotsearch.randomizedtesting.rules.SystemPropertiesInvariantRule$1.evaluate(SystemPropertiesInvariantRule.java:55)
	at org.apache.lucene.util.TestRuleThreadAndTestName$1.evaluate(TestRuleThreadAndTestName.java:48)
	at org.apache.lucene.util.TestRuleIgnoreAfterMaxFailures$1.evaluate(TestRuleIgnoreAfterMaxFailures.java:70)
	at org.apache.lucene.util.TestRuleMarkFailure$1.evaluate(TestRuleMarkFailure.java:48)
	at com.carrotsearch.randomizedtesting.rules.StatementAdapter.evaluate(StatementAdapter.java:36)
	at com.carrotsearch.randomizedtesting.ThreadLeakControl$StatementRunner.run(ThreadLeakControl.java:358)
	at com.carrotsearch.randomizedtesting.ThreadLeakControl.forkTimeoutingTask(ThreadLeakControl.java:782)
	at com.carrotsearch.randomizedtesting.ThreadLeakControl$3.evaluate(ThreadLeakControl.java:442)
	at com.carrotsearch.randomizedtesting.RandomizedRunner.runSingleTest(RandomizedRunner.java:746)
	at com.carrotsearch.randomizedtesting.RandomizedRunner$3.evaluate(RandomizedRunner.java:648)
	at com.carrotsearch.randomizedtesting.RandomizedRunner$4.evaluate(RandomizedRunner.java:682)
	at com.carrotsearch.randomizedtesting.RandomizedRunner$5.evaluate(RandomizedRunner.java:693)
	at com.carrotsearch.randomizedtesting.rules.StatementAdapter.evaluate(StatementAdapter.java:36)
	at com.carrotsearch.randomizedtesting.rules.SystemPropertiesRestoreRule$1.evaluate(SystemPropertiesRestoreRule.java:53)
	at org.apache.lucene.util.AbstractBeforeAfterRule$1.evaluate(AbstractBeforeAfterRule.java:45)
	at org.apache.lucene.util.TestRuleStoreClassName$1.evaluate(TestRuleStoreClassName.java:42)
	at com.carrotsearch.randomizedtesting.rules.SystemPropertiesInvariantRule$1.evaluate(SystemPropertiesInvariantRule.java:55)
	at com.carrotsearch.randomizedtesting.rules.NoShadowingOrOverridesOnMethodsRule$1.evaluate(NoShadowingOrOverridesOnMethodsRule.java:39)
	at com.carrotsearch.randomizedtesting.rules.NoShadowingOrOverridesOnMethodsRule$1.evaluate(NoShadowingOrOverridesOnMethodsRule.java:39)
	at com.carrotsearch.randomizedtesting.rules.StatementAdapter.evaluate(StatementAdapter.java:36)
	at org.apache.lucene.util.TestRuleAssertionsRequired$1.evaluate(TestRuleAssertionsRequired.java:43)
	at org.apache.lucene.util.TestRuleMarkFailure$1.evaluate(TestRuleMarkFailure.java:48)
	at org.apache.lucene.util.TestRuleIgnoreAfterMaxFailures$1.evaluate(TestRuleIgnoreAfterMaxFailures.java:70)
	at org.apache.lucene.util.TestRuleIgnoreTestSuites$1.evaluate(TestRuleIgnoreTestSuites.java:55)
	at com.carrotsearch.randomizedtesting.rules.StatementAdapter.evaluate(StatementAdapter.java:36)
	at com.carrotsearch.randomizedtesting.ThreadLeakControl$StatementRunner.run(ThreadLeakControl.java:358)
	at java.lang.Thread.run(Thread.java:679)


REGRESSION:  org.apache.solr.cloud.SyncSliceTest.testDistribSearch

Error Message:
There are still nodes recoverying

Stack Trace:
java.lang.AssertionError: There are still nodes recoverying
	at __randomizedtesting.SeedInfo.seed([CD0D470BF05B7732:4CEBC9138704170E]:0)
	at org.junit.Assert.fail(Assert.java:93)
	at org.apache.solr.cloud.AbstractDistribZkTestBase.waitForRecoveriesToFinish(AbstractDistribZkTestBase.java:154)
	at org.apache.solr.cloud.AbstractFullDistribZkTestBase.waitForRecoveriesToFinish(AbstractFullDistribZkTestBase.java:560)
	at org.apache.solr.cloud.AbstractFullDistribZkTestBase.waitForThingsToLevelOut(AbstractFullDistribZkTestBase.java:1135)
	at org.apache.solr.cloud.SyncSliceTest.doTest(SyncSliceTest.java:162)
	at org.apache.solr.BaseDistributedSearchTestCase.testDistribSearch(BaseDistributedSearchTestCase.java:695)
	at sun.reflect.NativeMethodAccessorImpl.invoke0(Native Method)
	at sun.reflect.NativeMethodAccessorImpl.invoke(NativeMethodAccessorImpl.java:57)
	at sun.reflect.DelegatingMethodAccessorImpl.invoke(DelegatingMethodAccessorImpl.java:43)
	at java.lang.reflect.Method.invoke(Method.java:616)
	at com.carrotsearch.randomizedtesting.RandomizedRunner.invoke(RandomizedRunner.java:1559)
	at com.carrotsearch.randomizedtesting.RandomizedRunner.access$600(RandomizedRunner.java:79)
	at com.carrotsearch.randomizedtesting.RandomizedRunner$6.evaluate(RandomizedRunner.java:737)
	at com.carrotsearch.randomizedtesting.RandomizedRunner$7.evaluate(RandomizedRunner.java:773)
	at com.carrotsearch.randomizedtesting.RandomizedRunner$8.evaluate(RandomizedRunner.java:787)
	at com.carrotsearch.randomizedtesting.rules.SystemPropertiesRestoreRule$1.evaluate(SystemPropertiesRestoreRule.java:53)
	at org.apache.lucene.util.TestRuleSetupTeardownChained$1.evaluate(TestRuleSetupTeardownChained.java:50)
	at org.apache.lucene.util.TestRuleFieldCacheSanity$1.evaluate(TestRuleFieldCacheSanity.java:51)
	at org.apache.lucene.util.AbstractBeforeAfterRule$1.evaluate(AbstractBeforeAfterRule.java:45)
	at com.carrotsearch.randomizedtesting.rules.SystemPropertiesInvariantRule$1.evaluate(SystemPropertiesInvariantRule.java:55)
	at org.apache.lucene.util.TestRuleThreadAndTestName$1.evaluate(TestRuleThreadAndTestName.java:48)
	at org.apache.lucene.util.TestRuleIgnoreAfterMaxFailures$1.evaluate(TestRuleIgnoreAfterMaxFailures.java:70)
	at org.apache.lucene.util.TestRuleMarkFailure$1.evaluate(TestRuleMarkFailure.java:48)
	at com.carrotsearch.randomizedtesting.rules.StatementAdapter.evaluate(StatementAdapter.java:36)
	at com.carrotsearch.randomizedtesting.ThreadLeakControl$StatementRunner.run(ThreadLeakControl.java:358)
	at com.carrotsearch.randomizedtesting.ThreadLeakControl.forkTimeoutingTask(ThreadLeakControl.java:782)
	at com.carrotsearch.randomizedtesting.ThreadLeakControl$3.evaluate(ThreadLeakControl.java:442)
	at com.carrotsearch.randomizedtesting.RandomizedRunner.runSingleTest(RandomizedRunner.java:746)
	at com.carrotsearch.randomizedtesting.RandomizedRunner$3.evaluate(RandomizedRunner.java:648)
	at com.carrotsearch.randomizedtesting.RandomizedRunner$4.evaluate(RandomizedRunner.java:682)
	at com.carrotsearch.randomizedtesting.RandomizedRunner$5.evaluate(RandomizedRunner.java:693)
	at com.carrotsearch.randomizedtesting.rules.StatementAdapter.evaluate(StatementAdapter.java:36)
	at com.carrotsearch.randomizedtesting.rules.SystemPropertiesRestoreRule$1.evaluate(SystemPropertiesRestoreRule.java:53)
	at org.apache.lucene.util.AbstractBeforeAfterRule$1.evaluate(AbstractBeforeAfterRule.java:45)
	at org.apache.lucene.util.TestRuleStoreClassName$1.evaluate(TestRuleStoreClassName.java:42)
	at com.carrotsearch.randomizedtesting.rules.SystemPropertiesInvariantRule$1.evaluate(SystemPropertiesInvariantRule.java:55)
	at com.carrotsearch.randomizedtesting.rules.NoShadowingOrOverridesOnMethodsRule$1.evaluate(NoShadowingOrOverridesOnMethodsRule.java:39)
	at com.carrotsearch.randomizedtesting.rules.NoShadowingOrOverridesOnMethodsRule$1.evaluate(NoShadowingOrOverridesOnMethodsRule.java:39)
	at com.carrotsearch.randomizedtesting.rules.StatementAdapter.evaluate(StatementAdapter.java:36)
	at org.apache.lucene.util.TestRuleAssertionsRequired$1.evaluate(TestRuleAssertionsRequired.java:43)
	at org.apache.lucene.util.TestRuleMarkFailure$1.evaluate(TestRuleMarkFailure.java:48)
	at org.apache.lucene.util.TestRuleIgnoreAfterMaxFailures$1.evaluate(TestRuleIgnoreAfterMaxFailures.java:70)
	at org.apache.lucene.util.TestRuleIgnoreTestSuites$1.evaluate(TestRuleIgnoreTestSuites.java:55)
	at com.carrotsearch.randomizedtesting.rules.StatementAdapter.evaluate(StatementAdapter.java:36)
	at com.carrotsearch.randomizedtesting.ThreadLeakControl$StatementRunner.run(ThreadLeakControl.java:358)
	at java.lang.Thread.run(Thread.java:679)




Build Log:
[...truncated 7313 lines...]
[junit4:junit4] Suite: org.apache.solr.cloud.BasicDistributedZk2Test
[junit4:junit4]   2> 3 T1261 oas.SolrTestCaseJ4.setUp ###Starting testDistribSearch
[junit4:junit4]   2> Creating dataDir: /usr/home/hudson/hudson-slave/workspace/Lucene-Solr-Tests-trunk-Java6/solr/build/solr-core/test/J1/./solrtest-BasicDistributedZk2Test-1348215067072
[junit4:junit4]   2> 4 T1261 oasc.ZkTestServer.run STARTING ZK TEST SERVER
[junit4:junit4]   2> 8 T1262 oazs.ZooKeeperServer.setTickTime tickTime set to 1000
[junit4:junit4]   2> 8 T1262 oazs.NIOServerCnxn$Factory.<init> binding to port 0.0.0.0/0.0.0.0:0
[junit4:junit4]   2> 9 T1262 oazsp.FileTxnSnapLog.save Snapshotting: 0
[junit4:junit4]   2> 106 T1261 oasc.ZkTestServer.run start zk server on port:31585
[junit4:junit4]   2> 106 T1261 oaz.ZooKeeper.<init> Initiating client connection, connectString=127.0.0.1:31585 sessionTimeout=10000 watcher=org.apache.solr.common.cloud.ConnectionManager@3f5fc55e
[junit4:junit4]   2> 107 T1267 oaz.ClientCnxn$SendThread.startConnect Opening socket connection to server /127.0.0.1:31585
[junit4:junit4]   2> 107 T1261 oascc.ConnectionManager.waitForConnected Waiting for client to connect to ZooKeeper
[junit4:junit4]   2> 108 T1267 oaz.ClientCnxn$SendThread.primeConnection Socket connection established to localhost/127.0.0.1:31585, initiating session
[junit4:junit4]   2> 108 T1263 oazs.NIOServerCnxn$Factory.run Accepted socket connection from /140.211.11.196:58223
[junit4:junit4]   2> 109 T1263 oazs.NIOServerCnxn.readConnectRequest Client attempting to establish new session at /140.211.11.196:58223
[junit4:junit4]   2> 109 T1265 oazsp.FileTxnLog.append Creating new log file: log.1
[junit4:junit4]   2> 112 T1265 oazs.NIOServerCnxn.finishSessionInit Established session 0x139e7e151c60000 with negotiated timeout 10000 for client /140.211.11.196:58223
[junit4:junit4]   2> 112 T1267 oaz.ClientCnxn$SendThread.readConnectResult Session establishment complete on server localhost/127.0.0.1:31585, sessionid = 0x139e7e151c60000, negotiated timeout = 10000
[junit4:junit4]   2> 112 T1268 oascc.ConnectionManager.process Watcher org.apache.solr.common.cloud.ConnectionManager@3f5fc55e name:ZooKeeperConnection Watcher:127.0.0.1:31585 got event WatchedEvent state:SyncConnected type:None path:null path:null type:None
[junit4:junit4]   2> 113 T1261 oascc.ConnectionManager.waitForConnected Client is connected to ZooKeeper
[junit4:junit4]   2> 113 T1261 oascc.SolrZkClient.makePath makePath: /solr
[junit4:junit4]   2> 115 T1266 oazs.PrepRequestProcessor.pRequest Processed session termination for sessionid: 0x139e7e151c60000
[junit4:junit4]   2> 116 T1268 oaz.ClientCnxn$EventThread.run EventThread shut down
[junit4:junit4]   2> 116 T1261 oaz.ZooKeeper.close Session: 0x139e7e151c60000 closed
[junit4:junit4]   2> 117 T1263 oazs.NIOServerCnxn.closeSock Closed socket connection for client /140.211.11.196:58223 which had sessionid 0x139e7e151c60000
[junit4:junit4]   2> 117 T1261 oaz.ZooKeeper.<init> Initiating client connection, connectString=127.0.0.1:31585/solr sessionTimeout=10000 watcher=org.apache.solr.common.cloud.ConnectionManager@6eceab21
[junit4:junit4]   2> 117 T1269 oaz.ClientCnxn$SendThread.startConnect Opening socket connection to server /127.0.0.1:31585
[junit4:junit4]   2> 117 T1261 oascc.ConnectionManager.waitForConnected Waiting for client to connect to ZooKeeper
[junit4:junit4]   2> 118 T1269 oaz.ClientCnxn$SendThread.primeConnection Socket connection established to localhost/127.0.0.1:31585, initiating session
[junit4:junit4]   2> 118 T1263 oazs.NIOServerCnxn$Factory.run Accepted socket connection from /140.211.11.196:28739
[junit4:junit4]   2> 118 T1263 oazs.NIOServerCnxn.readConnectRequest Client attempting to establish new session at /140.211.11.196:28739
[junit4:junit4]   2> 125 T1265 oazs.NIOServerCnxn.finishSessionInit Established session 0x139e7e151c60001 with negotiated timeout 10000 for client /140.211.11.196:28739
[junit4:junit4]   2> 125 T1269 oaz.ClientCnxn$SendThread.readConnectResult Session establishment complete on server localhost/127.0.0.1:31585, sessionid = 0x139e7e151c60001, negotiated timeout = 10000
[junit4:junit4]   2> 125 T1270 oascc.ConnectionManager.process Watcher org.apache.solr.common.cloud.ConnectionManager@6eceab21 name:ZooKeeperConnection Watcher:127.0.0.1:31585/solr got event WatchedEvent state:SyncConnected type:None path:null path:null type:None
[junit4:junit4]   2> 125 T1261 oascc.ConnectionManager.waitForConnected Client is connected to ZooKeeper
[junit4:junit4]   2> 126 T1261 oascc.SolrZkClient.makePath makePath: /collections/collection1
[junit4:junit4]   2> 129 T1261 oascc.SolrZkClient.makePath makePath: /collections/collection1/shards
[junit4:junit4]   2> 136 T1261 oascc.SolrZkClient.makePath makePath: /collections/control_collection
[junit4:junit4]   2> 144 T1261 oascc.SolrZkClient.makePath makePath: /collections/control_collection/shards
[junit4:junit4]   2> 156 T1261 oasc.AbstractZkTestCase.putConfig put /usr/home/hudson/hudson-slave/workspace/Lucene-Solr-Tests-trunk-Java6/solr/build/solr-core/test-files/solr/collection1/conf/solrconfig.xml to /configs/conf1/solrconfig.xml
[junit4:junit4]   2> 157 T1261 oascc.SolrZkClient.makePath makePath: /configs/conf1/solrconfig.xml
[junit4:junit4]   2> 181 T1261 oasc.AbstractZkTestCase.putConfig put /usr/home/hudson/hudson-slave/workspace/Lucene-Solr-Tests-trunk-Java6/solr/build/solr-core/test-files/solr/collection1/conf/schema.xml to /configs/conf1/schema.xml
[junit4:junit4]   2> 182 T1261 oascc.SolrZkClient.makePath makePath: /configs/conf1/schema.xml
[junit4:junit4]   2> 291 T1261 oasc.AbstractZkTestCase.putConfig put /usr/home/hudson/hudson-slave/workspace/Lucene-Solr-Tests-trunk-Java6/solr/build/solr-core/test-files/solr/collection1/conf/solrconfig.xml to /configs/conf1/solrconfig.xml
[junit4:junit4]   2> 292 T1261 oascc.SolrZkClient.makePath makePath: /configs/conf1/solrconfig.xml
[junit4:junit4]   2> 305 T1261 oasc.AbstractZkTestCase.putConfig put /usr/home/hudson/hudson-slave/workspace/Lucene-Solr-Tests-trunk-Java6/solr/build/solr-core/test-files/solr/collection1/conf/stopwords.txt to /configs/conf1/stopwords.txt
[junit4:junit4]   2> 305 T1261 oascc.SolrZkClient.makePath makePath: /configs/conf1/stopwords.txt
[junit4:junit4]   2> 312 T1261 oasc.AbstractZkTestCase.putConfig put /usr/home/hudson/hudson-slave/workspace/Lucene-Solr-Tests-trunk-Java6/solr/build/solr-core/test-files/solr/collection1/conf/protwords.txt to /configs/conf1/protwords.txt
[junit4:junit4]   2> 312 T1261 oascc.SolrZkClient.makePath makePath: /configs/conf1/protwords.txt
[junit4:junit4]   2> 319 T1261 oasc.AbstractZkTestCase.putConfig put /usr/home/hudson/hudson-slave/workspace/Lucene-Solr-Tests-trunk-Java6/solr/build/solr-core/test-files/solr/collection1/conf/currency.xml to /configs/conf1/currency.xml
[junit4:junit4]   2> 320 T1261 oascc.SolrZkClient.makePath makePath: /configs/conf1/currency.xml
[junit4:junit4]   2> 327 T1261 oasc.AbstractZkTestCase.putConfig put /usr/home/hudson/hudson-slave/workspace/Lucene-Solr-Tests-trunk-Java6/solr/build/solr-core/test-files/solr/collection1/conf/open-exchange-rates.json to /configs/conf1/open-exchange-rates.json
[junit4:junit4]   2> 328 T1261 oascc.SolrZkClient.makePath makePath: /configs/conf1/open-exchange-rates.json
[junit4:junit4]   2> 338 T1261 oasc.AbstractZkTestCase.putConfig put /usr/home/hudson/hudson-slave/workspace/Lucene-Solr-Tests-trunk-Java6/solr/build/solr-core/test-files/solr/collection1/conf/mapping-ISOLatin1Accent.txt to /configs/conf1/mapping-ISOLatin1Accent.txt
[junit4:junit4]   2> 338 T1261 oascc.SolrZkClient.makePath makePath: /configs/conf1/mapping-ISOLatin1Accent.txt
[junit4:junit4]   2> 349 T1261 oasc.AbstractZkTestCase.putConfig put /usr/home/hudson/hudson-slave/workspace/Lucene-Solr-Tests-trunk-Java6/solr/build/solr-core/test-files/solr/collection1/conf/old_synonyms.txt to /configs/conf1/old_synonyms.txt
[junit4:junit4]   2> 349 T1261 oascc.SolrZkClient.makePath makePath: /configs/conf1/old_synonyms.txt
[junit4:junit4]   2> 357 T1261 oasc.AbstractZkTestCase.putConfig put /usr/home/hudson/hudson-slave/workspace/Lucene-Solr-Tests-trunk-Java6/solr/build/solr-core/test-files/solr/collection1/conf/synonyms.txt to /configs/conf1/synonyms.txt
[junit4:junit4]   2> 358 T1261 oascc.SolrZkClient.makePath makePath: /configs/conf1/synonyms.txt
[junit4:junit4]   2> 361 T1266 oazs.PrepRequestProcessor.pRequest Processed session termination for sessionid: 0x139e7e151c60001
[junit4:junit4]   2> 362 T1270 oaz.ClientCnxn$EventThread.run EventThread shut down
[junit4:junit4]   2> 362 T1261 oaz.ZooKeeper.close Session: 0x139e7e151c60001 closed
[junit4:junit4]   2> 362 T1263 oazs.NIOServerCnxn.closeSock Closed socket connection for client /140.211.11.196:28739 which had sessionid 0x139e7e151c60001
[junit4:junit4]   2> 365 T1261 oejs.Server.doStart jetty-8.1.2.v20120308
[junit4:junit4]   2> 367 T1261 oejs.AbstractConnector.doStart Started SocketConnector@0.0.0.0:29988
[junit4:junit4]   2> 368 T1261 oasc.SolrResourceLoader.locateSolrHome JNDI not configured for solr (NoInitialContextEx)
[junit4:junit4]   2> 368 T1261 oasc.SolrResourceLoader.locateSolrHome using system property solr.solr.home: /usr/home/hudson/hudson-slave/workspace/Lucene-Solr-Tests-trunk-Java6/solr/build/solr-core/test-files/solr
[junit4:junit4]   2> 369 T1261 oasc.SolrResourceLoader.<init> new SolrResourceLoader for deduced Solr Home: '/usr/home/hudson/hudson-slave/workspace/Lucene-Solr-Tests-trunk-Java6/solr/build/solr-core/test-files/solr/'
[junit4:junit4]   2> 412 T1261 oass.SolrDispatchFilter.init SolrDispatchFilter.init()
[junit4:junit4]   2> 413 T1261 oasc.SolrResourceLoader.locateSolrHome JNDI not configured for solr (NoInitialContextEx)
[junit4:junit4]   2> 413 T1261 oasc.SolrResourceLoader.locateSolrHome using system property solr.solr.home: /usr/home/hudson/hudson-slave/workspace/Lucene-Solr-Tests-trunk-Java6/solr/build/solr-core/test-files/solr
[junit4:junit4]   2> 413 T1261 oasc.CoreContainer$Initializer.initialize looking for solr.xml: /usr/home/hudson/hudson-slave/workspace/Lucene-Solr-Tests-trunk-Java6/solr/build/solr-core/test-files/solr/solr.xml
[junit4:junit4]   2> 414 T1261 oasc.CoreContainer.<init> New CoreContainer 54446900
[junit4:junit4]   2> 414 T1261 oasc.CoreContainer.load Loading CoreContainer using Solr Home: '/usr/home/hudson/hudson-slave/workspace/Lucene-Solr-Tests-trunk-Java6/solr/build/solr-core/test-files/solr/'
[junit4:junit4]   2> 415 T1261 oasc.SolrResourceLoader.<init> new SolrResourceLoader for directory: '/usr/home/hudson/hudson-slave/workspace/Lucene-Solr-Tests-trunk-Java6/solr/build/solr-core/test-files/solr/'
[junit4:junit4]   2> 439 T1261 oasc.CoreContainer.load Registering Log Listener
[junit4:junit4]   2> 454 T1261 oasc.CoreContainer.initZooKeeper Zookeeper client=127.0.0.1:31585/solr
[junit4:junit4]   2> 454 T1261 oaz.ZooKeeper.<init> Initiating client connection, connectString=127.0.0.1:31585/solr sessionTimeout=5000 watcher=org.apache.solr.common.cloud.ConnectionManager@660c5bd4
[junit4:junit4]   2> 455 T1280 oaz.ClientCnxn$SendThread.startConnect Opening socket connection to server /127.0.0.1:31585
[junit4:junit4]   2> 455 T1261 oascc.ConnectionManager.waitForConnected Waiting for client to connect to ZooKeeper
[junit4:junit4]   2> 456 T1280 oaz.ClientCnxn$SendThread.primeConnection Socket connection established to localhost/127.0.0.1:31585, initiating session
[junit4:junit4]   2> 456 T1263 oazs.NIOServerCnxn$Factory.run Accepted socket connection from /140.211.11.196:12343
[junit4:junit4]   2> 457 T1263 oazs.NIOServerCnxn.readConnectRequest Client attempting to establish new session at /140.211.11.196:12343
[junit4:junit4]   2> 460 T1265 oazs.NIOServerCnxn.finishSessionInit Established session 0x139e7e151c60002 with negotiated timeout 5000 for client /140.211.11.196:12343
[junit4:junit4]   2> 460 T1280 oaz.ClientCnxn$SendThread.readConnectResult Session establishment complete on server localhost/127.0.0.1:31585, sessionid = 0x139e7e151c60002, negotiated timeout = 5000
[junit4:junit4]   2> 461 T1281 oascc.ConnectionManager.process Watcher org.apache.solr.common.cloud.ConnectionManager@660c5bd4 name:ZooKeeperConnection Watcher:127.0.0.1:31585/solr got event WatchedEvent state:SyncConnected type:None path:null path:null type:None
[junit4:junit4]   2> 461 T1261 oascc.ConnectionManager.waitForConnected Client is connected to ZooKeeper
[junit4:junit4]   2> 471 T1266 oazs.PrepRequestProcessor.pRequest Got user-level KeeperException when processing sessionid:0x139e7e151c60002 type:create cxid:0x2 zxid:0xfffffffffffffffe txntype:unknown reqpath:n/a Error Path:/solr/overseer Error:KeeperErrorCode = NodeExists for /solr/overseer
[junit4:junit4]   2> 479 T1261 oascc.SolrZkClient.makePath makePath: /live_nodes
[junit4:junit4]   2> 490 T1261 oasc.ZkController.createEphemeralLiveNode Register node as live in ZooKeeper:/live_nodes/127.0.0.1:29988_solr
[junit4:junit4]   2> 491 T1266 oazs.PrepRequestProcessor.pRequest Got user-level KeeperException when processing sessionid:0x139e7e151c60002 type:delete cxid:0x7 zxid:0xfffffffffffffffe txntype:unknown reqpath:n/a Error Path:/solr/live_nodes/127.0.0.1:29988_solr Error:KeeperErrorCode = NoNode for /solr/live_nodes/127.0.0.1:29988_solr
[junit4:junit4]   2> 497 T1261 oascc.SolrZkClient.makePath makePath: /live_nodes/127.0.0.1:29988_solr
[junit4:junit4]   2> 506 T1261 oashc.HttpShardHandlerFactory.getParameter Setting socketTimeout to: 0
[junit4:junit4]   2> 506 T1261 oashc.HttpShardHandlerFactory.getParameter Setting urlScheme to: http://
[junit4:junit4]   2> 507 T1261 oashc.HttpShardHandlerFactory.getParameter Setting connTimeout to: 0
[junit4:junit4]   2> 507 T1261 oashc.HttpShardHandlerFactory.getParameter Setting maxConnectionsPerHost to: 20
[junit4:junit4]   2> 507 T1261 oashc.HttpShardHandlerFactory.getParameter Setting corePoolSize to: 0
[junit4:junit4]   2> 508 T1261 oashc.HttpShardHandlerFactory.getParameter Setting maximumPoolSize to: 2147483647
[junit4:junit4]   2> 508 T1261 oashc.HttpShardHandlerFactory.getParameter Setting maxThreadIdleTime to: 5
[junit4:junit4]   2> 509 T1261 oashc.HttpShardHandlerFactory.getParameter Setting sizeOfQueue to: -1
[junit4:junit4]   2> 509 T1261 oashc.HttpShardHandlerFactory.getParameter Setting fairnessPolicy to: false
[junit4:junit4]   2> 510 T1261 oascsi.HttpClientUtil.createClient Creating new http client, config:maxConnectionsPerHost=20&maxConnections=10000&socketTimeout=0&connTimeout=0&retry=false
[junit4:junit4]   2> 523 T1261 oascc.SolrZkClient.makePath makePath: /overseer_elect/election
[junit4:junit4]   2> 528 T1266 oazs.PrepRequestProcessor.pRequest Got user-level KeeperException when processing sessionid:0x139e7e151c60002 type:delete cxid:0x15 zxid:0xfffffffffffffffe txntype:unknown reqpath:n/a Error Path:/solr/overseer_elect/leader Error:KeeperErrorCode = NoNode for /solr/overseer_elect/leader
[junit4:junit4]   2> 529 T1261 oascc.SolrZkClient.makePath makePath: /overseer_elect/leader
[junit4:junit4]   2> 531 T1261 oasc.Overseer.start Overseer (id=88356622636023810-127.0.0.1:29988_solr-n_0000000000) starting
[junit4:junit4]   2> 532 T1266 oazs.PrepRequestProcessor.pRequest Got user-level KeeperException when processing sessionid:0x139e7e151c60002 type:create cxid:0x1a zxid:0xfffffffffffffffe txntype:unknown reqpath:n/a Error Path:/solr/overseer Error:KeeperErrorCode = NodeExists for /solr/overseer
[junit4:junit4]   2> 533 T1266 oazs.PrepRequestProcessor.pRequest Got user-level KeeperException when processing sessionid:0x139e7e151c60002 type:create cxid:0x1b zxid:0xfffffffffffffffe txntype:unknown reqpath:n/a Error Path:/solr/overseer Error:KeeperErrorCode = NodeExists for /solr/overseer
[junit4:junit4]   2> 534 T1266 oazs.PrepRequestProcessor.pRequest Got user-level KeeperException when processing sessionid:0x139e7e151c60002 type:create cxid:0x1c zxid:0xfffffffffffffffe txntype:unknown reqpath:n/a Error Path:/solr/overseer Error:KeeperErrorCode = NodeExists for /solr/overseer
[junit4:junit4]   2> 535 T1266 oazs.PrepRequestProcessor.pRequest Got user-level KeeperException when processing sessionid:0x139e7e151c60002 type:create cxid:0x1d zxid:0xfffffffffffffffe txntype:unknown reqpath:n/a Error Path:/solr/overseer Error:KeeperErrorCode = NodeExists for /solr/overseer
[junit4:junit4]   2> 536 T1283 oasc.OverseerCollectionProcessor.run Process current queue of collection creations
[junit4:junit4]   2> 537 T1261 oascc.SolrZkClient.makePath makePath: /clusterstate.json
[junit4:junit4]   2> 539 T1261 oascc.ZkStateReader.createClusterStateWatchersAndUpdate Updating cluster state from ZooKeeper... 
[junit4:junit4]   2> 546 T1261 oasc.CoreContainer.create Creating SolrCore 'collection1' using instanceDir: /usr/home/hudson/hudson-slave/workspace/Lucene-Solr-Tests-trunk-Java6/solr/build/solr-core/test-files/solr/collection1
[junit4:junit4]   2> 547 T1261 oasc.ZkController.createCollectionZkNode Check for collection zkNode:control_collection
[junit4:junit4]   2> 548 T1282 oasc.Overseer$ClusterStateUpdater.run Starting to work on the main queue
[junit4:junit4]   2> 548 T1261 oasc.ZkController.createCollectionZkNode Collection zkNode exists
[junit4:junit4]   2> 548 T1261 oasc.ZkController.readConfigName Load collection config from:/collections/control_collection
[junit4:junit4]   2> 550 T1261 oasc.SolrResourceLoader.<init> new SolrResourceLoader for directory: '/usr/home/hudson/hudson-slave/workspace/Lucene-Solr-Tests-trunk-Java6/solr/build/solr-core/test-files/solr/collection1/'
[junit4:junit4]   2> 552 T1261 oasc.SolrResourceLoader.replaceClassLoader Adding 'file:/usr/home/hudson/hudson-slave/workspace/Lucene-Solr-Tests-trunk-Java6/solr/build/solr-core/test-files/solr/collection1/lib/README' to classloader
[junit4:junit4]   2> 553 T1261 oasc.SolrResourceLoader.replaceClassLoader Adding 'file:/usr/home/hudson/hudson-slave/workspace/Lucene-Solr-Tests-trunk-Java6/solr/build/solr-core/test-files/solr/collection1/lib/classes/' to classloader
[junit4:junit4]   2> 605 T1261 oasc.SolrConfig.<init> Using Lucene MatchVersion: LUCENE_50
[junit4:junit4]   2> 683 T1261 oasc.SolrConfig.<init> Loaded SolrConfig: solrconfig.xml
[junit4:junit4]   2> 784 T1261 oass.IndexSchema.readSchema Reading Solr Schema
[junit4:junit4]   2> 791 T1261 oass.IndexSchema.readSchema Schema name=test
[junit4:junit4]   2> 1409 T1261 oass.OpenExchangeRatesOrgProvider.init Initialized with rates=open-exchange-rates.json, refreshInterval=1440.
[junit4:junit4]   2> 1420 T1261 oass.IndexSchema.readSchema default search field in schema is text
[junit4:junit4]   2> 1425 T1261 oass.IndexSchema.readSchema unique key field: id
[junit4:junit4]   2> 1446 T1261 oass.FileExchangeRateProvider.reload Reloading exchange rates from file currency.xml
[junit4:junit4]   2> 1451 T1261 oass.FileExchangeRateProvider.reload Reloading exchange rates from file currency.xml
[junit4:junit4]   2> 1456 T1261 oass.OpenExchangeRatesOrgProvider.reload Reloading exchange rates from open-exchange-rates.json
[junit4:junit4]   2> 1458 T1261 oass.OpenExchangeRatesOrgProvider.reload Reloading exchange rates from open-exchange-rates.json
[junit4:junit4]   2> 1459 T1261 oasc.SolrCore.<init> [collection1] Opening new SolrCore at /usr/home/hudson/hudson-slave/workspace/Lucene-Solr-Tests-trunk-Java6/solr/build/solr-core/test-files/solr/collection1/, dataDir=./org.apache.solr.cloud.BasicDistributedZk2Test-1348215067072/control/data/
[junit4:junit4]   2> 1460 T1261 oasc.JmxMonitoredMap.<init> JMX monitoring is enabled. Adding Solr mbeans to JMX Server: com.sun.jmx.mbeanserver.JmxMBeanServer@561777b1
[junit4:junit4]   2> 1461 T1261 oasc.SolrCore.getNewIndexDir WARNING New index directory detected: old=null new=./org.apache.solr.cloud.BasicDistributedZk2Test-1348215067072/control/data/index/
[junit4:junit4]   2> 1462 T1261 oasc.SolrCore.initIndex WARNING [collection1] Solr index directory './org.apache.solr.cloud.BasicDistributedZk2Test-1348215067072/control/data/index' doesn't exist. Creating new index...
[junit4:junit4]   2> 1463 T1261 oasc.CachingDirectoryFactory.get return new directory for /usr/home/hudson/hudson-slave/workspace/Lucene-Solr-Tests-trunk-Java6/solr/build/solr-core/test/J1/./org.apache.solr.cloud.BasicDistributedZk2Test-1348215067072/control/data/index forceNew:false
[junit4:junit4]   2> 1482 T1261 oasc.SolrDeletionPolicy.onCommit SolrDeletionPolicy.onCommit: commits:num=1
[junit4:junit4]   2> 		commit{dir=NRTCachingDirectory(org.apache.lucene.store.NIOFSDirectory@/usr/home/hudson/hudson-slave/workspace/Lucene-Solr-Tests-trunk-Java6/solr/build/solr-core/test/J1/org.apache.solr.cloud.BasicDistributedZk2Test-1348215067072/control/data/index lockFactory=org.apache.lucene.store.NativeFSLockFactory@5273db92; maxCacheMB=48.0 maxMergeSizeMB=4.0),segFN=segments_1,generation=1,filenames=[segments_1]
[junit4:junit4]   2> 1483 T1261 oasc.SolrDeletionPolicy.updateCommits newest commit = 1
[junit4:junit4]   2> 1484 T1261 oasc.SolrCore.initWriters created xml: solr.XMLResponseWriter
[junit4:junit4]   2> 1486 T1261 oasup.UpdateRequestProcessorChain.init inserting DistributedUpdateProcessorFactory into updateRequestProcessorChain "dedupe"
[junit4:junit4]   2> 1486 T1261 oasup.UpdateRequestProcessorChain.init inserting DistributedUpdateProcessorFactory into updateRequestProcessorChain "dedupe-allfields"
[junit4:junit4]   2> 1487 T1261 oasup.UpdateRequestProcessorChain.init inserting DistributedUpdateProcessorFactory into updateRequestProcessorChain "stored_sig"
[junit4:junit4]   2> 1487 T1261 oasup.UpdateRequestProcessorChain.init inserting DistributedUpdateProcessorFactory into updateRequestProcessorChain "uniq-fields"
[junit4:junit4]   2> 1488 T1261 oasup.UpdateRequestProcessorChain.init inserting DistributedUpdateProcessorFactory into updateRequestProcessorChain "distrib-dup-test-chain-implicit"
[junit4:junit4]   2> 1489 T1261 oasc.RequestHandlers.initHandlersFromConfig adding lazy requestHandler: solr.ReplicationHandler
[junit4:junit4]   2> 1489 T1261 oasc.RequestHandlers.initHandlersFromConfig created /replication: solr.ReplicationHandler
[junit4:junit4]   2> 1490 T1261 oasc.RequestHandlers.initHandlersFromConfig created standard: solr.StandardRequestHandler
[junit4:junit4]   2> 1490 T1261 oasc.RequestHandlers.initHandlersFromConfig created /get: solr.RealTimeGetHandler
[junit4:junit4]   2> 1491 T1261 oasc.RequestHandlers.initHandlersFromConfig created dismax: solr.SearchHandler
[junit4:junit4]   2> 1491 T1261 oasc.RequestHandlers.initHandlersFromConfig created mock: org.apache.solr.core.MockQuerySenderListenerReqHandler
[junit4:junit4]   2> 1492 T1261 oasc.RequestHandlers.initHandlersFromConfig created /admin/: org.apache.solr.handler.admin.AdminHandlers
[junit4:junit4]   2> 1493 T1261 oasc.RequestHandlers.initHandlersFromConfig created defaults: solr.StandardRequestHandler
[junit4:junit4]   2> 1493 T1261 oasc.RequestHandlers.initHandlersFromConfig adding lazy requestHandler: solr.StandardRequestHandler
[junit4:junit4]   2> 1494 T1261 oasc.RequestHandlers.initHandlersFromConfig created lazy: solr.StandardRequestHandler
[junit4:junit4]   2> 1494 T1261 oasc.RequestHandlers.initHandlersFromConfig created /update: solr.UpdateRequestHandler
[junit4:junit4]   2> 1495 T1261 oasc.RequestHandlers.initHandlersFromConfig created /terms: org.apache.solr.handler.component.SearchHandler
[junit4:junit4]   2> 1495 T1261 oasc.RequestHandlers.initHandlersFromConfig created spellCheckCompRH: org.apache.solr.handler.component.SearchHandler
[junit4:junit4]   2> 1496 T1261 oasc.RequestHandlers.initHandlersFromConfig created spellCheckCompRH_Direct: org.apache.solr.handler.component.SearchHandler
[junit4:junit4]   2> 1497 T1261 oasc.RequestHandlers.initHandlersFromConfig created spellCheckWithWordbreak: org.apache.solr.handler.component.SearchHandler
[junit4:junit4]   2> 1497 T1261 oasc.RequestHandlers.initHandlersFromConfig created spellCheckWithWordbreak_Direct: org.apache.solr.handler.component.SearchHandler
[junit4:junit4]   2> 1498 T1261 oasc.RequestHandlers.initHandlersFromConfig created spellCheckCompRH1: org.apache.solr.handler.component.SearchHandler
[junit4:junit4]   2> 1498 T1261 oasc.RequestHandlers.initHandlersFromConfig created tvrh: org.apache.solr.handler.component.SearchHandler
[junit4:junit4]   2> 1499 T1261 oasc.RequestHandlers.initHandlersFromConfig created /mlt: solr.MoreLikeThisHandler
[junit4:junit4]   2> 1499 T1261 oasc.RequestHandlers.initHandlersFromConfig created /debug/dump: solr.DumpRequestHandler
[junit4:junit4]   2> 1503 T1261 oashl.XMLLoader.init xsltCacheLifetimeSeconds=60
[junit4:junit4]   2> 1508 T1261 oasc.SolrCore.initDeprecatedSupport WARNING solrconfig.xml uses deprecated <admin/gettableFiles>, Please update your config to use the ShowFileRequestHandler.
[junit4:junit4]   2> 1509 T1261 oasc.SolrCore.initDeprecatedSupport WARNING adding ShowFileRequestHandler with hidden files: [SCHEMA.XML, OLD_SYNONYMS.TXT, STOPWORDS.TXT, PROTWORDS.TXT, OPEN-EXCHANGE-RATES.JSON, SYNONYMS.TXT, CURRENCY.XML, MAPPING-ISOLATIN1ACCENT.TXT]
[junit4:junit4]   2> 1513 T1261 oass.SolrIndexSearcher.<init> Opening Searcher@44e31542 main
[junit4:junit4]   2> 1515 T1261 oasu.CommitTracker.<init> Hard AutoCommit: disabled
[junit4:junit4]   2> 1515 T1261 oasu.CommitTracker.<init> Soft AutoCommit: disabled
[junit4:junit4]   2> 1516 T1261 oashc.SpellCheckComponent.inform Initializing spell checkers
[junit4:junit4]   2> 1523 T1261 oass.DirectSolrSpellChecker.init init: {name=direct,classname=DirectSolrSpellChecker,field=lowerfilt,minQueryLength=3}
[junit4:junit4]   2> 1580 T1284 oasc.SolrCore.registerSearcher [collection1] Registered new searcher Searcher@44e31542 main{StandardDirectoryReader(segments_1:1)}
[junit4:junit4]   2> 1584 T1266 oazs.PrepRequestProcessor.pRequest Got user-level KeeperException when processing sessionid:0x139e7e151c60002 type:create cxid:0x56 zxid:0xfffffffffffffffe txntype:unknown reqpath:n/a Error Path:/solr/overseer/queue Error:KeeperErrorCode = NoNode for /solr/overseer/queue
[junit4:junit4]   2> 1596 T1261 oasc.CoreContainer.register registering core: collection1
[junit4:junit4]   2> 1597 T1261 oasc.ZkController.register Register shard - core:collection1 address:http://127.0.0.1:29988/solr shardId:control_shard
[junit4:junit4]   2> 1598 T1261 oascc.SolrZkClient.makePath makePath: /collections/control_collection/leader_elect/control_shard/election
[junit4:junit4]   2> 1612 T1266 oazs.PrepRequestProcessor.pRequest Got user-level KeeperException when processing sessionid:0x139e7e151c60002 type:delete cxid:0x65 zxid:0xfffffffffffffffe txntype:unknown reqpath:n/a Error Path:/solr/collections/control_collection/leaders Error:KeeperErrorCode = NoNode for /solr/collections/control_collection/leaders
[junit4:junit4]   2> 1620 T1261 oasc.ShardLeaderElectionContext.runLeaderProcess Running the leader process.
[junit4:junit4]   2> 1621 T1266 oazs.PrepRequestProcessor.pRequest Got user-level KeeperException when processing sessionid:0x139e7e151c60002 type:create cxid:0x66 zxid:0xfffffffffffffffe txntype:unknown reqpath:n/a Error Path:/solr/overseer Error:KeeperErrorCode = NodeExists for /solr/overseer
[junit4:junit4]   2> 2056 T1282 oascc.ZkStateReader.updateClusterState Updating cloud state from ZooKeeper... 
[junit4:junit4]   2> 2058 T1266 oazs.PrepRequestProcessor.pRequest Got user-level KeeperException when processing sessionid:0x139e7e151c60002 type:create cxid:0x6d zxid:0xfffffffffffffffe txntype:unknown reqpath:n/a Error Path:/solr/overseer/queue-work Error:KeeperErrorCode = NoNode for /solr/overseer/queue-work
[junit4:junit4]   2> 2113 T1281 oascc.ZkStateReader$2.process A cluster state change has occurred - updating...
[junit4:junit4]   2> 2135 T1261 oasc.ShardLeaderElectionContext.waitForReplicasToComeUp Enough replicas found to continue.
[junit4:junit4]   2> 2136 T1261 oasc.ShardLeaderElectionContext.runLeaderProcess I may be the new leader - try and sync
[junit4:junit4]   2> 2136 T1261 oasc.SyncStrategy.sync Sync replicas to http://127.0.0.1:29988/solr/collection1/
[junit4:junit4]   2> 2136 T1261 oasc.SyncStrategy.syncReplicas Sync Success - now sync replicas to me
[junit4:junit4]   2> 2137 T1261 oasc.SyncStrategy.syncToMe http://127.0.0.1:29988/solr/collection1/ has no replicas
[junit4:junit4]   2> 2137 T1261 oasc.ShardLeaderElectionContext.runLeaderProcess I am the new leader: http://127.0.0.1:29988/solr/collection1/
[junit4:junit4]   2> 2138 T1261 oascc.SolrZkClient.makePath makePath: /collections/control_collection/leaders/control_shard
[junit4:junit4]   2> 2153 T1266 oazs.PrepRequestProcessor.pRequest Got user-level KeeperException when processing sessionid:0x139e7e151c60002 type:create cxid:0x8b zxid:0xfffffffffffffffe txntype:unknown reqpath:n/a Error Path:/solr/overseer Error:KeeperErrorCode = NodeExists for /solr/overseer
[junit4:junit4]   2> 2628 T1282 oascc.ZkStateReader.updateClusterState Updating cloud state from ZooKeeper... 
[junit4:junit4]   2> 2696 T1281 oascc.ZkStateReader$2.process A cluster state change has occurred - updating...
[junit4:junit4]   2> 2768 T1261 oasc.ZkController.register We are http://127.0.0.1:29988/solr/collection1/ and leader is http://127.0.0.1:29988/solr/collection1/
[junit4:junit4]   2> 2768 T1261 oasc.ZkController.register No LogReplay needed for core=collection1 baseURL=http://127.0.0.1:29988/solr
[junit4:junit4]   2> 2769 T1261 oasc.ZkController.checkRecovery I am the leader, no recovery necessary
[junit4:junit4]   2> 2792 T1261 oascc.ZkStateReader.updateClusterState Updating cloud state from ZooKeeper... 
[junit4:junit4]   2> 2793 T1261 oass.SolrDispatchFilter.init user.dir=/usr/home/hudson/hudson-slave/workspace/Lucene-Solr-Tests-trunk-Java6/solr/build/solr-core/test/J1
[junit4:junit4]   2> 2794 T1261 oass.SolrDispatchFilter.init SolrDispatchFilter.init() done
[junit4:junit4]   2> 2794 T1261 oascsi.HttpClientUtil.createClient Creating new http client, config:maxConnections=128&maxConnectionsPerHost=32&followRedirects=false
[junit4:junit4]   2> 3001 T1261 oejs.Server.doStart jetty-8.1.2.v20120308
[junit4:junit4]   2> 3004 T1261 oejs.AbstractConnector.doStart Started SocketConnector@0.0.0.0:40601
[junit4:junit4]   2> 3004 T1261 oasc.SolrResourceLoader.locateSolrHome JNDI not configured for solr (NoInitialContextEx)
[junit4:junit4]   2> 3005 T1261 oasc.SolrResourceLoader.locateSolrHome using system property solr.solr.home: /usr/home/hudson/hudson-slave/workspace/Lucene-Solr-Tests-trunk-Java6/solr/build/solr-core/test/J1/./solrtest-jetty1-1348215069875
[junit4:junit4]   2> 3005 T1261 oasc.SolrResourceLoader.<init> new SolrResourceLoader for deduced Solr Home: '/usr/home/hudson/hudson-slave/workspace/Lucene-Solr-Tests-trunk-Java6/solr/build/solr-core/test/J1/./solrtest-jetty1-1348215069875/'
[junit4:junit4]   2> 3040 T1261 oass.SolrDispatchFilter.init SolrDispatchFilter.init()
[junit4:junit4]   2> 3040 T1261 oasc.SolrResourceLoader.locateSolrHome JNDI not configured for solr (NoInitialContextEx)
[junit4:junit4]   2> 3041 T1261 oasc.SolrResourceLoader.locateSolrHome using system property solr.solr.home: /usr/home/hudson/hudson-slave/workspace/Lucene-Solr-Tests-trunk-Java6/solr/build/solr-core/test/J1/./solrtest-jetty1-1348215069875
[junit4:junit4]   2> 3041 T1261 oasc.CoreContainer$Initializer.initialize looking for solr.xml: /usr/home/hudson/hudson-slave/workspace/Lucene-Solr-Tests-trunk-Java6/solr/build/solr-core/test/J1/./solrtest-jetty1-1348215069875/solr.xml
[junit4:junit4]   2> 3042 T1261 oasc.CoreContainer.<init> New CoreContainer 908208269
[junit4:junit4]   2> 3042 T1261 oasc.CoreContainer.load Loading CoreContainer using Solr Home: '/usr/home/hudson/hudson-slave/workspace/Lucene-Solr-Tests-trunk-Java6/solr/build/solr-core/test/J1/./solrtest-jetty1-1348215069875/'
[junit4:junit4]   2> 3043 T1261 oasc.SolrResourceLoader.<init> new SolrResourceLoader for directory: '/usr/home/hudson/hudson-slave/workspace/Lucene-Solr-Tests-trunk-Java6/solr/build/solr-core/test/J1/./solrtest-jetty1-1348215069875/'
[junit4:junit4]   2> 3067 T1261 oasc.CoreContainer.load Registering Log Listener
[junit4:junit4]   2> 3083 T1261 oasc.CoreContainer.initZooKeeper Zookeeper client=127.0.0.1:31585/solr
[junit4:junit4]   2> 3083 T1261 oaz.ZooKeeper.<init> Initiating client connection, connectString=127.0.0.1:31585/solr sessionTimeout=5000 watcher=org.apache.solr.common.cloud.ConnectionManager@7054fdd7
[junit4:junit4]   2> 3084 T1294 oaz.ClientCnxn$SendThread.startConnect Opening socket connection to server /127.0.0.1:31585
[junit4:junit4]   2> 3084 T1261 oascc.ConnectionManager.waitForConnected Waiting for client to connect to ZooKeeper
[junit4:junit4]   2> 3085 T1294 oaz.ClientCnxn$SendThread.primeConnection Socket connection established to localhost/127.0.0.1:31585, initiating session
[junit4:junit4]   2> 3086 T1263 oazs.NIOServerCnxn$Factory.run Accepted socket connection from /140.211.11.196:14931
[junit4:junit4]   2> 3086 T1263 oazs.NIOServerCnxn.readConnectRequest Client attempting to establish new session at /140.211.11.196:14931
[junit4:junit4]   2> 3088 T1265 oazs.NIOServerCnxn.finishSessionInit Established session 0x139e7e151c60003 with negotiated timeout 5000 for client /140.211.11.196:14931
[junit4:junit4]   2> 3088 T1294 oaz.ClientCnxn$SendThread.readConnectResult Session establishment complete on server localhost/127.0.0.1:31585, sessionid = 0x139e7e151c60003, negotiated timeout = 5000
[junit4:junit4]   2> 3088 T1295 oascc.ConnectionManager.process Watcher org.apache.solr.common.cloud.ConnectionManager@7054fdd7 name:ZooKeeperConnection Watcher:127.0.0.1:31585/solr got event WatchedEvent state:SyncConnected type:None path:null path:null type:None
[junit4:junit4]   2> 3089 T1261 oascc.ConnectionManager.waitForConnected Client is connected to ZooKeeper
[junit4:junit4]   2> 3089 T1266 oazs.PrepRequestProcessor.pRequest Got user-level KeeperException when processing sessionid:0x139e7e151c60003 type:create cxid:0x1 zxid:0xfffffffffffffffe txntype:unknown reqpath:n/a Error Path:/solr/overseer Error:KeeperErrorCode = NodeExists for /solr/overseer
[junit4:junit4]   2> 3096 T1266 oazs.PrepRequestProcessor.pRequest Got user-level KeeperException when processing sessionid:0x139e7e151c60003 type:create cxid:0x2 zxid:0xfffffffffffffffe txntype:unknown reqpath:n/a Error Path:/solr/overseer Error:KeeperErrorCode = NodeExists for /solr/overseer
[junit4:junit4]   2> 3097 T1261 oasc.ZkController.createEphemeralLiveNode Register node as live in ZooKeeper:/live_nodes/127.0.0.1:40601_solr
[junit4:junit4]   2> 3098 T1266 oazs.PrepRequestProcessor.pRequest Got user-level KeeperException when processing sessionid:0x139e7e151c60003 type:delete cxid:0x4 zxid:0xfffffffffffffffe txntype:unknown reqpath:n/a Error Path:/solr/live_nodes/127.0.0.1:40601_solr Error:KeeperErrorCode = NoNode for /solr/live_nodes/127.0.0.1:40601_solr
[junit4:junit4]   2> 3099 T1261 oascc.SolrZkClient.makePath makePath: /live_nodes/127.0.0.1:40601_solr
[junit4:junit4]   2> 3107 T1281 oascc.ZkStateReader$3.process Updating live nodes
[junit4:junit4]   2> 3108 T1261 oashc.HttpShardHandlerFactory.getParameter Setting socketTimeout to: 0
[junit4:junit4]   2> 3109 T1261 oashc.HttpShardHandlerFactory.getParameter Setting urlScheme to: http://
[junit4:junit4]   2> 3109 T1261 oashc.HttpShardHandlerFactory.getParameter Setting connTimeout to: 0
[junit4:junit4]   2> 3110 T1261 oashc.HttpShardHandlerFactory.getParameter Setting maxConnectionsPerHost to: 20
[junit4:junit4]   2> 3110 T1261 oashc.HttpShardHandlerFactory.getParameter Setting corePoolSize to: 0
[junit4:junit4]   2> 3110 T1261 oashc.HttpShardHandlerFactory.getParameter Setting maximumPoolSize to: 2147483647
[junit4:junit4]   2> 3111 T1261 oashc.HttpShardHandlerFactory.getParameter Setting maxThreadIdleTime to: 5
[junit4:junit4]   2> 3111 T1261 oashc.HttpShardHandlerFactory.getParameter Setting sizeOfQueue to: -1
[junit4:junit4]   2> 3112 T1261 oashc.HttpShardHandlerFactory.getParameter Setting fairnessPolicy to: false
[junit4:junit4]   2> 3112 T1261 oascsi.HttpClientUtil.createClient Creating new http client, config:maxConnectionsPerHost=20&maxConnections=10000&socketTimeout=0&connTimeout=0&retry=false
[junit4:junit4]   2> 3129 T1261 oascc.ZkStateReader.createClusterStateWatchersAndUpdate Updating cluster state from ZooKeeper... 
[junit4:junit4]   2> 3135 T1261 oasc.CoreContainer.create Creating SolrCore 'collection1' using instanceDir: /usr/home/hudson/hudson-slave/workspace/Lucene-Solr-Tests-trunk-Java6/solr/build/solr-core/test/J1/./solrtest-jetty1-1348215069875/collection1
[junit4:junit4]   2> 3135 T1261 oasc.ZkController.createCollectionZkNode Check for collection zkNode:collection1
[junit4:junit4]   2> 3136 T1261 oasc.ZkController.createCollectionZkNode Collection zkNode exists
[junit4:junit4]   2> 3137 T1261 oasc.ZkController.readConfigName Load collection config from:/collections/collection1
[junit4:junit4]   2> 3138 T1261 oasc.SolrResourceLoader.<init> new SolrResourceLoader for directory: '/usr/home/hudson/hudson-slave/workspace/Lucene-Solr-Tests-trunk-Java6/solr/build/solr-core/test/J1/./solrtest-jetty1-1348215069875/collection1/'
[junit4:junit4]   2> 3139 T1261 oasc.SolrResourceLoader.replaceClassLoader Adding 'file:/usr/home/hudson/hudson-slave/workspace/Lucene-Solr-Tests-trunk-Java6/solr/build/solr-core/test/J1/solrtest-jetty1-1348215069875/collection1/lib/classes/' to classloader
[junit4:junit4]   2> 3140 T1261 oasc.SolrResourceLoader.replaceClassLoader Adding 'file:/usr/home/hudson/hudson-slave/workspace/Lucene-Solr-Tests-trunk-Java6/solr/build/solr-core/test/J1/solrtest-jetty1-1348215069875/collection1/lib/README' to classloader
[junit4:junit4]   2> 3188 T1261 oasc.SolrConfig.<init> Using Lucene MatchVersion: LUCENE_50
[junit4:junit4]   2> 3235 T1282 oascc.ZkStateReader.updateClusterState Updating cloud state from ZooKeeper... 
[junit4:junit4]   2> 3249 T1281 oascc.ZkStateReader$2.process A cluster state change has occurred - updating...
[junit4:junit4]   2> 3249 T1295 oascc.ZkStateReader$2.process A cluster state change has occurred - updating...
[junit4:junit4]   2> 3268 T1261 oasc.SolrConfig.<init> Loaded SolrConfig: solrconfig.xml
[junit4:junit4]   2> 3369 T1261 oass.IndexSchema.readSchema Reading Solr Schema
[junit4:junit4]   2> 3377 T1261 oass.IndexSchema.readSchema Schema name=test
[junit4:junit4]   2> 4024 T1261 oass.OpenExchangeRatesOrgProvider.init Initialized with rates=open-exchange-rates.json, refreshInterval=1440.
[junit4:junit4]   2> 4035 T1261 oass.IndexSchema.readSchema default search field in schema is text
[junit4:junit4]   2> 4039 T1261 oass.IndexSchema.readSchema unique key field: id
[junit4:junit4]   2> 4054 T1261 oass.FileExchangeRateProvider.reload Reloading exchange rates from file currency.xml
[junit4:junit4]   2> 4059 T1261 oass.FileExchangeRateProvider.reload Reloading exchange rates from file currency.xml
[junit4:junit4]   2> 4064 T1261 oass.OpenExchangeRatesOrgProvider.reload Reloading exchange rates from open-exchange-rates.json
[junit4:junit4]   2> 4065 T1261 oass.OpenExchangeRatesOrgProvider.reload Reloading exchange rates from open-exchange-rates.json
[junit4:junit4]   2> 4067 T1261 oasc.SolrCore.<init> [collection1] Opening new SolrCore at /usr/home/hudson/hudson-slave/workspace/Lucene-Solr-Tests-trunk-Java6/solr/build/solr-core/test/J1/./solrtest-jetty1-1348215069875/collection1/, dataDir=./org.apache.solr.cloud.BasicDistributedZk2Test-1348215067072/jetty1/
[junit4:junit4]   2> 4067 T1261 oasc.JmxMonitoredMap.<init> JMX monitoring is enabled. Adding Solr mbeans to JMX Server: com.sun.jmx.mbeanserver.JmxMBeanServer@561777b1
[junit4:junit4]   2> 4068 T1261 oasc.SolrCore.getNewIndexDir WARNING New index directory detected: old=null new=./org.apache.solr.cloud.BasicDistributedZk2Test-1348215067072/jetty1/index/
[junit4:junit4]   2> 4069 T1261 oasc.SolrCore.initIndex WARNING [collection1] Solr index directory './org.apache.solr.cloud.BasicDistributedZk2Test-1348215067072/jetty1/index' doesn't exist. Creating new index...
[junit4:junit4]   2> 4070 T1261 oasc.CachingDirectoryFactory.get return new directory for /usr/home/hudson/hudson-slave/workspace/Lucene-Solr-Tests-trunk-Java6/solr/build/solr-core/test/J1/./org.apache.solr.cloud.BasicDistributedZk2Test-1348215067072/jetty1/index forceNew:false
[junit4:junit4]   2> 4113 T1261 oasc.SolrDeletionPolicy.onCommit SolrDeletionPolicy.onCommit: commits:num=1
[junit4:junit4]   2> 		commit{dir=NRTCachingDirectory(org.apache.lucene.store.NIOFSDirectory@/usr/home/hudson/hudson-slave/workspace/Lucene-Solr-Tests-trunk-Java6/solr/build/solr-core/test/J1/org.apache.solr.cloud.BasicDistributedZk2Test-1348215067072/jetty1/index lockFactory=org.apache.lucene.store.NativeFSLockFactory@5e8693f2; maxCacheMB=48.0 maxMergeSizeMB=4.0),segFN=segments_1,generation=1,filenames=[segments_1]
[junit4:junit4]   2> 4114 T1261 oasc.SolrDeletionPolicy.updateCommits newest commit = 1
[junit4:junit4]   2> 4115 T1261 oasc.SolrCore.initWriters created xml: solr.XMLResponseWriter
[junit4:junit4]   2> 4117 T1261 oasup.UpdateRequestProcessorChain.init inserting DistributedUpdateProcessorFactory into updateRequestProcessorChain "dedupe"
[junit4:junit4]   2> 4117 T1261 oasup.UpdateRequestProcessorChain.init inserting DistributedUpdateProcessorFactory into updateRequestProcessorChain "dedupe-allfields"
[junit4:junit4]   2> 4118 T1261 oasup.UpdateRequestProcessorChain.init inserting DistributedUpdateProcessorFactory into updateRequestProcessorChain "stored_sig"
[junit4:junit4]   2> 4118 T1261 oasup.UpdateRequestProcessorChain.init inserting DistributedUpdateProcessorFactory into updateRequestProcessorChain "uniq-fields"
[junit4:junit4]   2> 4119 T1261 oasup.UpdateRequestProcessorChain.init inserting DistributedUpdateProcessorFactory into updateRequestProcessorChain "distrib-dup-test-chain-implicit"
[junit4:junit4]   2> 4119 T1261 oasc.RequestHandlers.initHandlersFromConfig adding lazy requestHandler: solr.ReplicationHandler
[junit4:junit4]   2> 4120 T1261 oasc.RequestHandlers.initHandlersFromConfig created /replication: solr.ReplicationHandler
[junit4:junit4]   2> 4121 T1261 oasc.RequestHandlers.initHandlersFromConfig created standard: solr.StandardRequestHandler
[junit4:junit4]   2> 4121 T1261 oasc.RequestHandlers.initHandlersFromConfig created /get: solr.RealTimeGetHandler
[junit4:junit4]   2> 4122 T1261 oasc.RequestHandlers.initHandlersFromConfig created dismax: solr.SearchHandler
[junit4:junit4]   2> 4123 T1261 oasc.RequestHandlers.initHandlersFromConfig created mock: org.apache.solr.core.MockQuerySenderListenerReqHandler
[junit4:junit4]   2> 4123 T1261 oasc.RequestHandlers.initHandlersFromConfig created /admin/: org.apache.solr.handler.admin.AdminHandlers
[junit4:junit4]   2> 4124 T1261 oasc.RequestHandlers.initHandlersFromConfig created defaults: solr.StandardRequestHandler
[junit4:junit4]   2> 4124 T1261 oasc.RequestHandlers.initHandlersFromConfig adding lazy requestHandler: solr.StandardRequestHandler
[junit4:junit4]   2> 4125 T1261 oasc.RequestHandlers.initHandlersFromConfig created lazy: solr.StandardRequestHandler
[junit4:junit4]   2> 4125 T1261 oasc.RequestHandlers.initHandlersFromConfig created /update: solr.UpdateRequestHandler
[junit4:junit4]   2> 4126 T1261 oasc.RequestHandlers.initHandlersFromConfig created /terms: org.apache.solr.handler.component.SearchHandler
[junit4:junit4]   2> 4126 T1261 oasc.RequestHandlers.initHandlersFromConfig created spellCheckCompRH: org.apache.solr.handler.component.SearchHandler
[junit4:junit4]   2> 4127 T1261 oasc.RequestHandlers.initHandlersFromConfig created spellCheckCompRH_Direct: org.apache.solr.handler.component.SearchHandler
[junit4:junit4]   2> 4128 T1261 oasc.RequestHandlers.initHandlersFromConfig created spellCheckWithWordbreak: org.apache.solr.handler.component.SearchHandler
[junit4:junit4]   2> 4128 T1261 oasc.RequestHandlers.initHandlersFromConfig created spellCheckWithWordbreak_Direct: org.apache.solr.handler.component.SearchHandler
[junit4:junit4]   2> 4129 T1261 oasc.RequestHandlers.initHandlersFromConfig created spellCheckCompRH1: org.apache.solr.handler.component.SearchHandler
[junit4:junit4]   2> 4130 T1261 oasc.RequestHandlers.initHandlersFromConfig created tvrh: org.apache.solr.handler.component.SearchHandler
[junit4:junit4]   2> 4130 T1261 oasc.RequestHandlers.initHandlersFromConfig created /mlt: solr.MoreLikeThisHandler
[junit4:junit4]   2> 4131 T1261 oasc.RequestHandlers.initHandlersFromConfig created /debug/dump: solr.DumpRequestHandler
[junit4:junit4]   2> 4136 T1261 oashl.XMLLoader.init xsltCacheLifetimeSeconds=60
[junit4:junit4]   2> 4141 T1261 oasc.SolrCore.initDeprecatedSupport WARNING solrconfig.xml uses deprecated <admin/gettableFiles>, Please update your config to use the ShowFileRequestHandler.
[junit4:junit4]   2> 4143 T1261 oasc.SolrCore.initDeprecatedSupport WARNING adding ShowFileRequestHandler with hidden files: [SCHEMA.XML, OLD_SYNONYMS.TXT, STOPWORDS.TXT, PROTWORDS.TXT, OPEN-EXCHANGE-RATES.JSON, SYNONYMS.TXT, CURRENCY.XML, MAPPING-ISOLATIN1ACCENT.TXT]
[junit4:junit4]   2> 4147 T1261 oass.SolrIndexSearcher.<init> Opening Searcher@1f98872b main
[junit4:junit4]   2> 4149 T1261 oasu.CommitTracker.<init> Hard AutoCommit: disabled
[junit4:junit4]   2> 4149 T1261 oasu.CommitTracker.<init> Soft AutoCommit: disabled
[junit4:junit4]   2> 4150 T1261 oashc.SpellCheckComponent.inform Initializing spell checkers
[junit4:junit4]   2> 4166 T1261 oass.DirectSolrSpellChecker.init init: {name=direct,classname=DirectSolrSpellChecker,field=lowerfilt,minQueryLength=3}
[junit4:junit4]   2> 4238 T1296 oasc.SolrCore.registerSearcher [collection1] Registered new searcher Searcher@1f98872b main{StandardDirectoryReader(segments_1:1)}
[junit4:junit4]   2> 4255 T1282 oascc.ZkStateReader.updateClusterState Updating cloud state from ZooKeeper... 
[junit4:junit4]   2> 4260 T1281 oascc.ZkStateReader$2.process A cluster state change has occurred - updating...
[junit4:junit4]   2> 4260 T1295 oascc.ZkStateReader$2.process A cluster state change has occurred - updating...
[junit4:junit4]   2> 4753 T1261 oasc.CoreContainer.register registering core: collection1
[junit4:junit4]   2> 4753 T1261 oasc.ZkController.register Register shard - core:collection1 address:http://127.0.0.1:40601/solr shardId:shard1
[junit4:junit4]   2> 4754 T1261 oascc.SolrZkClient.makePath makePath: /collections/collection1/leader_elect/shard1/election
[junit4:junit4]   2> 4776 T1266 oazs.PrepRequestProcessor.pRequest Got user-level KeeperException when processing sessionid:0x139e7e151c60003 type:delete cxid:0x43 zxid:0xfffffffffffffffe txntype:unknown reqpath:n/a Error Path:/solr/collections/collection1/leaders Error:KeeperErrorCode = NoNode for /solr/collections/collection1/leaders
[junit4:junit4]   2> 4777 T1261 oasc.ShardLeaderElectionContext.runLeaderProcess Running the leader process.
[junit4:junit4]   2> 4777 T1266 oazs.PrepRequestProcessor.pRequest Got user-level KeeperException when processing sessionid:0x139e7e151c60003 type:create cxid:0x44 zxid:0xfffffffffffffffe txntype:unknown reqpath:n/a Error Path:/solr/overseer Error:KeeperErrorCode = NodeExists for /solr/overseer
[junit4:junit4]   2> 4785 T1261 oasc.ShardLeaderElectionContext.waitForReplicasToComeUp Enough replicas found to continue.
[junit4:junit4]   2> 4786 T1261 oasc.ShardLeaderElectionContext.runLeaderProcess I may be the new leader - try and sync
[junit4:junit4]   2> 4786 T1261 oasc.SyncStrategy.sync Sync replicas to http://127.0.0.1:40601/solr/collection1/
[junit4:junit4]   2> 4787 T1261 oasc.SyncStrategy.syncReplicas Sync Success - now sync replicas to me
[junit4:junit4]   2> 4787 T1261 oasc.SyncStrategy.syncToMe http://127.0.0.1:40601/solr/collection1/ has no replicas
[junit4:junit4]   2> 4788 T1261 oasc.ShardLeaderElectionContext.runLeaderProcess I am the new leader: http://127.0.0.1:40601/solr/collection1/
[junit4:junit4]   2> 4788 T1261 oascc.SolrZkClient.makePath makePath: /collections/collection1/leaders/shard1
[junit4:junit4]   2> 4802 T1266 oazs.PrepRequestProcessor.pRequest Got user-level KeeperException when processing sessionid:0x139e7e151c60003 type:create cxid:0x4e zxid:0xfffffffffffffffe txntype:unknown reqpath:n/a Error Path:/solr/overseer Error:KeeperErrorCode = NodeExists for /solr/overseer
[junit4:junit4]   2> 5272 T1282 oascc.ZkStateReader.updateClusterState Updating cloud state from ZooKeeper... 
[junit4:junit4]   2> 5332 T1281 oascc.ZkStateReader$2.process A cluster state change has occurred - updating...
[junit4:junit4]   2> 5332 T1295 oascc.ZkStateReader$2.process A cluster state change has occurred - updating...
[junit4:junit4]   2> 5335 T1261 oasc.ZkController.register We are http://127.0.0.1:40601/solr/collection1/ and leader is http://127.0.0.1:40601/solr/collection1/
[junit4:junit4]   2> 5335 T1261 oasc.ZkController.register No LogReplay needed for core=collection1 baseURL=http://127.0.0.1:40601/solr
[junit4:junit4]   2> 5336 T1261 oasc.ZkController.checkRecovery I am the leader, no recovery necessary
[junit4:junit4]   2> 5344 T1261 oascc.ZkStateReader.updateClusterState Updating cloud state from ZooKeeper... 
[junit4:junit4]   2> 5352 T1261 oass.SolrDispatchFilter.init user.dir=/usr/home/hudson/hudson-slave/workspace/Lucene-Solr-Tests-trunk-Java6/solr/build/solr-core/test/J1
[junit4:junit4]   2> 5352 T1261 oass.SolrDispatchFilter.init SolrDispatchFilter.init() done
[junit4:junit4]   2> 5353 T1261 oascsi.HttpClientUtil.createClient Creating new http client, config:maxConnections=128&maxConnectionsPerHost=32&followRedirects=false
[junit4:junit4]   2> 5525 T1261 oejs.Server.doStart jetty-8.1.2.v20120308
[junit4:junit4]   2> 5528 T1261 oejs.AbstractConnector.doStart Started SocketConnector@0.0.0.0:41761
[junit4:junit4]   2> 5528 T1261 oasc.SolrResourceLoader.locateSolrHome JNDI not configured for solr (NoInitialContextEx)
[junit4:junit4]   2> 5529 T1261 oasc.SolrResourceLoader.locateSolrHome using system property solr.solr.home: /usr/home/hudson/hudson-slave/workspace/Lucene-Solr-Tests-trunk-Java6/solr/build/solr-core/test/J1/./solrtest-jetty2-1348215072435
[junit4:junit4]   2> 5529 T1261 oasc.SolrResourceLoader.<init> new SolrResourceLoader for deduced Solr Home: '/usr/home/hudson/hudson-slave/workspace/Lucene-Solr-Tests-trunk-Java6/solr/build/solr-core/test/J1/./solrtest-jetty2-1348215072435/'
[junit4:junit4]   2> 5563 T1261 oass.SolrDispatchFilter.init SolrDispatchFilter.init()
[junit4:junit4]   2> 5563 T1261 oasc.SolrResourceLoader.locateSolrHome JNDI not configured for solr (NoInitialContextEx)
[junit4:junit4]   2> 5564 T1261 oasc.SolrResourceLoader.locateSolrHome using system property solr.solr.home: /usr/home/hudson/hudson-slave/workspace/Lucene-Solr-Tests-trunk-Java6/solr/build/solr-core/test/J1/./solrtest-jetty2-1348215072435
[junit4:junit4]   2> 5564 T1261 oasc.CoreContainer$Initializer.initialize looking for solr.xml: /usr/home/hudson/hudson-slave/workspace/Lucene-Solr-Tests-trunk-Java6/solr/build/solr-core/test/J1/./solrtest-jetty2-1348215072435/solr.xml
[junit4:junit4]   2> 5565 T1261 oasc.CoreContainer.<init> New CoreContainer 1368164891
[junit4:junit4]   2> 5565 T1261 oasc.CoreContainer.load Loading CoreContainer using Solr Home: '/usr/home/hudson/hudson-slave/workspace/Lucene-Solr-Tests-trunk-Java6/solr/build/solr-core/test/J1/./solrtest-jetty2-1348215072435/'
[junit4:junit4]   2> 5565 T1261 oasc.SolrResourceLoader.<init> new SolrResourceLoader for directory: '/usr/home/hudson/hudson-slave/workspace/Lucene-Solr-Tests-trunk-Java6/solr/build/solr-core/test/J1/./solrtest-jetty2-1348215072435/'
[junit4:junit4]   2> 5589 T1261 oasc.CoreContainer.load Registering Log Listener
[junit4:junit4]   2> 5604 T1261 oasc.CoreContainer.initZooKeeper Zookeeper client=127.0.0.1:31585/solr
[junit4:junit4]   2> 5604 T1261 oaz.ZooKeeper.<init> Initiating client connection, connectString=127.0.0.1:31585/solr sessionTimeout=5000 watcher=org.apache.solr.common.cloud.ConnectionManager@49e42f32
[junit4:junit4]   2> 5605 T1306 oaz.ClientCnxn$SendThread.startConnect Opening socket connection to server /127.0.0.1:31585
[junit4:junit4]   2> 5605 T1261 oascc.ConnectionManager.waitForConnected Waiting for client to connect to ZooKeeper
[junit4:junit4]   2> 5606 T1306 oaz.ClientCnxn$SendThread.primeConnection Socket connection established to localhost/127.0.0.1:31585, initiating session
[junit4:junit4]   2> 5607 T1263 oazs.NIOServerCnxn$Factory.run Accepted socket connection from /140.211.11.196:62323
[junit4:junit4]   2> 5607 T1263 oazs.NIOServerCnxn.readConnectRequest Client attempting to establish new session at /140.211.11.196:62323
[junit4:junit4]   2> 5608 T1265 oazs.NIOServerCnxn.finishSessionInit Established session 0x139e7e151c60004 with negotiated timeout 5000 for client /140.211.11.196:62323
[junit4:junit4]   2> 5608 T1306 oaz.ClientCnxn$SendThread.readConnectResult Session establishment complete on server localhost/127.0.0.1:31585, sessionid = 0x139e7e151c60004, negotiated timeout = 5000
[junit4:junit4]   2> 5609 T1307 oascc.ConnectionManager.process Watcher org.apache.solr.common.cloud.ConnectionManager@49e42f32 name:ZooKeeperConnection Watcher:127.0.0.1:31585/solr got event WatchedEvent state:SyncConnected type:None path:null path:null type:None
[junit4:junit4]   2> 5609 T1261 oascc.ConnectionManager.waitForConnected Client is connected to ZooKeeper
[junit4:junit4]   2> 5610 T1266 oazs.PrepRequestProcessor.pRequest Got user-level KeeperException when processing sessionid:0x139e7e151c60004 type:create cxid:0x1 zxid:0xfffffffffffffffe txntype:unknown reqpath:n/a Error Path:/solr/overseer Error:KeeperErrorCode = NodeExists for /solr/overseer
[junit4:junit4]   2> 5616 T1266 oazs.PrepRequestProcessor.pRequest Got user-level KeeperException when processing sessionid:0x139e7e151c60004 type:create cxid:0x2 zxid:0xfffffffffffffffe txntype:unknown reqpath:n/a Error Path:/solr/overseer Error:KeeperErrorCode = NodeExists for /solr/overseer
[junit4:junit4]   2> 5617 T1261 oasc.ZkController.createEphemeralLiveNode Register node as live in ZooKeeper:/live_nodes/127.0.0.1:41761_solr
[junit4:junit4]   2> 5618 T1266 oazs.PrepRequestProcessor.pRequest Got user-level KeeperException when processing sessionid:0x139e7e151c60004 type:delete cxid:0x4 zxid:0xfffffffffffffffe txntype:unknown reqpath:n/a Error Path:/solr/live_nodes/127.0.0.1:41761_solr Error:KeeperErrorCode = NoNode for /solr/live_nodes/127.0.0.1:41761_solr
[junit4:junit4]   2> 5626 T1261 oascc.SolrZkClient.makePath makePath: /live_nodes/127.0.0.1:41761_solr
[junit4:junit4]   2> 5635 T1281 oascc.ZkStateReader$3.process Updating live nodes
[junit4:junit4]   2> 5635 T1295 oascc.ZkStateReader$3.process Updating live nodes
[junit4:junit4]   2> 5636 T1261 oashc.HttpShardHandlerFactory.getParameter Setting socketTimeout to: 0
[junit4:junit4]   2> 5636 T1261 oashc.HttpShardHandlerFactory.getParameter Setting urlScheme to: http://
[junit4:junit4]   2> 5637 T1261 oashc.HttpShardHandlerFactory.getParameter Setting connTimeout to: 0
[junit4:junit4]   2> 5637 T1261 oashc.HttpShardHandlerFactory.getParameter Setting maxConnectionsPerHost to: 20
[junit4:junit4]   2> 5638 T1261 oashc.HttpShardHandlerFactory.getParameter Setting corePoolSize to: 0
[junit4:junit4]   2> 5638 T1261 oashc.HttpShardHandlerFactory.getParameter Setting maximumPoolSize to: 2147483647
[junit4:junit4]   2> 5638 T1261 oashc.HttpShardHandlerFactory.getParameter Setting maxThreadIdleTime to: 5
[junit4:junit4]   2> 5639 T1261 oashc.HttpShardHandlerFactory.getParameter Setting sizeOfQueue to: -1
[junit4:junit4]   2> 5639 T1261 oashc.HttpShardHandlerFactory.getParameter Setting fairnessPolicy to: false
[junit4:junit4]   2> 5640 T1261 oascsi.HttpClientUtil.createClient Creating new http client, config:maxConnectionsPerHost=20&maxConnections=10000&socketTimeout=0&connTimeout=0&retry=false
[junit4:junit4]   2> 5658 T1261 oascc.ZkStateReader.createClusterStateWatchersAndUpdate Updating cluster state from ZooKeeper... 
[junit4:junit4]   2> 5665 T1261 oasc.CoreContainer.create Creating SolrCore 'collection1' using instanceDir: /usr/home/hudson/hudson-slave/workspace/Lucene-Solr-Tests-trunk-Java6/solr/build/solr-core/test/J1/./solrtest-jetty2-1348215072435/collection1
[junit4:junit4]   2> 5666 T1261 oasc.ZkController.createCollectionZkNode Check for collection zkNode:collection1
[junit4:junit4]   2> 5666 T1261 oasc.ZkController.createCollectionZkNode Collection zkNode exists
[junit4:junit4]   2> 5667 T1261 oasc.ZkController.readConfigName Load collection config from:/collections/collection1
[junit4:junit4]   2> 5668 T1261 oasc.SolrResourceLoader.<init> new SolrResourceLoader for directory: '/usr/home/hudson/hudson-slave/workspace/Lucene-Solr-Tests-trunk-Java6/solr/build/solr-core/test/J1/./solrtest-jetty2-1348215072435/collection1/'
[junit4:junit4]   2> 5670 T1261 oasc.SolrResourceLoader.replaceClassLoader Adding 'file:/usr/home/hudson/hudson-slave/workspace/Lucene-Solr-Tests-trunk-Java6/solr/build/solr-core/test/J1/solrtest-jetty2-1348215072435/collection1/lib/classes/' to classloader
[junit4:junit4]   2> 5670 T1261 oasc.SolrResourceLoader.replaceClassLoader Adding 'file:/usr/home/hudson/hudson-slave/workspace/Lucene-Solr-Tests-trunk-Java6/solr/build/solr-core/test/J1/solrtest-jetty2-1348215072435/collection1/lib/README' to classloader
[junit4:junit4]   2> 5720 T1261 oasc.SolrConfig.<init> Using Lucene MatchVersion: LUCENE_50
[junit4:junit4]   2> 5791 T1261 oasc.SolrConfig.<init> Loaded SolrConfig: solrconfig.xml
[junit4:junit4]   2> 5854 T1282 oascc.ZkStateReader.updateClusterState Updating cloud state from ZooKeeper... 
[junit4:junit4]   2> 5859 T1281 oascc.ZkStateReader$2.process A cluster state change has occurred - updating...
[junit4:junit4]   2> 5860 T1295 oascc.ZkStateReader$2.process A cluster state change has occurred - updating...
[junit4:junit4]   2> 5893 T1307 oascc.ZkStateReader$2.process A cluster state change has occurred - updating...
[junit4:junit4]   2> 5893 T1261 oass.IndexSchema.readSchema Reading Solr Schema
[junit4:junit4]   2> 5899 T1261 oass.IndexSchema.readSchema Schema name=test
[junit4:junit4]   2> 6537 T1261 oass.OpenExchangeRatesOrgProvider.init Initialized with rates=open-exchange-rates.json, refreshInterval=1440.
[junit4:junit4]   2> 6548 T1261 oass.IndexSchema.readSchema default search field in schema is text
[junit4:junit4]   2> 6552 T1261 oass.IndexSchema.readSchema unique key field: id
[junit4:junit4]   2> 6567 T1261 oass.FileExchangeRateProvider.reload Reloading exchange rates from file currency.xml
[junit4:junit4]   2> 6572 T1261 oass.FileExchangeRateProvider.reload Reloading exchange rates from file currency.xml
[junit4:junit4]   2> 6576 T1261 oass.OpenExchangeRatesOrgProvider.reload Reloading exchange rates from open-exchange-rates.json
[junit4:junit4]   2> 6578 T1261 oass.OpenExchangeRatesOrgProvider.reload Reloading exchange rates from open-exchange-rates.json
[junit4:junit4]   2> 6579 T1261 oasc.SolrCore.<init> [collection1] Opening new SolrCore at /usr/home/hudson/hudson-slave/workspace/Lucene-Solr-Tests-trunk-Java6/solr/build/solr-core/test/J1/./solrtest-jetty2-1348215072435/collection1/, dataDir=./org.apache.solr.cloud.BasicDistributedZk2Test-1348215067072/jetty2/
[junit4:junit4]   2> 6580 T1261 oasc.JmxMonitoredMap.<init> JMX monitoring is enabled. Adding Solr mbeans to JMX Server: com.sun.jmx.mbeanserver.JmxMBeanServer@561777b1
[junit4:junit4]   2> 6581 T1261 oasc.SolrCore.getNewIndexDir WARNING New index directory detected: old=null new=./org.apache.solr.cloud.BasicDistributedZk2Test-1348215067072/jetty2/index/
[junit4:junit4]   2> 6582 T1261 oasc.SolrCore.initIndex WARNING [collection1] Solr index directory './org.apache.solr.cloud.BasicDistributedZk2Test-1348215067072/jetty2/index' doesn't exist. Creating new index...
[junit4:junit4]   2> 6582 T1261 oasc.CachingDirectoryFactory.get return new directory for /usr/home/hudson/hudson-slave/workspace/Lucene-Solr-Tests-trunk-Java6/solr/build/solr-core/test/J1/./org.apache.solr.cloud.BasicDistributedZk2Test-1348215067072/jetty2/index forceNew:false
[junit4:junit4]   2> 6599 T1261 oasc.SolrDeletionPolicy.onCommit SolrDeletionPolicy.onCommit: commits:num=1
[junit4:junit4]   2> 		commit{dir=NRTCachingDirectory(org.apache.lucene.store.NIOFSDirectory@/usr/home/hudson/hudson-slave/workspace/Lucene-Solr-Tests-trunk-Java6/solr/build/solr-core/test/J1/org.apache.solr.cloud.BasicDistributedZk2Test-1348215067072/jetty2/index lockFactory=org.apache.lucene.store.NativeFSLockFactory@2eddacdc; maxCacheMB=48.0 maxMergeSizeMB=4.0),segFN=segments_1,generation=1,filenames=[segments_1]
[junit4:junit4]   2> 6600 T1261 oasc.SolrDeletionPolicy.updateCommits newest commit = 1
[junit4:junit4]   2> 6601 T1261 oasc.SolrCore.initWriters created xml: solr.XMLResponseWriter
[junit4:junit4]   2> 6603 T1261 oasup.UpdateRequestProcessorChain.init inserting DistributedUpdateProcessorFactory into updateRequestProcessorChain "dedupe"
[junit4:junit4]   2> 6604 T1261 oasup.UpdateRequestProcessorChain.init inserting DistributedUpdateProcessorFactory into updateRequestProcessorChain "dedupe-allfields"
[junit4:junit4]   2> 6604 T1261 oasup.UpdateRequestProcessorChain.init inserting DistributedUpdateProcessorFactory into updateRequestProcessorChain "stored_sig"
[junit4:junit4]   2> 6605 T1261 oasup.UpdateRequestProcessorChain.init inserting DistributedUpdateProcessorFactory into updateRequestProcessorChain "uniq-fields"
[junit4:junit4]   2> 6605 T1261 oasup.UpdateRequestProcessorChain.init inserting DistributedUpdateProcessorFactory into updateRequestProcessorChain "distrib-dup-test-chain-implicit"
[junit4:junit4]   2> 6606 T1261 oasc.RequestHandlers.initHandlersFromConfig adding lazy requestHandler: solr.ReplicationHandler
[junit4:junit4]   2> 6606 T1261 oasc.RequestHandlers.initHandlersFromConfig created /replication: solr.ReplicationHandler
[junit4:junit4]   2> 6607 T1261 oasc.RequestHandlers.initHandlersFromConfig created standard: solr.StandardRequestHandler
[junit4:junit4]   2> 6608 T1261 oasc.RequestHandlers.initHandlersFromConfig created /get: solr.RealTimeGetHandler
[junit4:junit4]   2> 6608 T1261 oasc.RequestHandlers.initHandlersFromConfig created dismax: solr.SearchHandler
[junit4:junit4]   2> 6609 T1261 oasc.RequestHandlers.initHandlersFromConfig created mock: org.apache.solr.core.MockQuerySenderListenerReqHandler
[junit4:junit4]   2> 6610 T1261 oasc.RequestHandlers.initHandlersFromConfig created /admin/: org.apache.solr.handler.admin.AdminHandlers
[junit4:junit4]   2> 6610 T1261 oasc.RequestHandlers.initHandlersFromConfig created defaults: solr.StandardRequestHandler
[junit4:junit4]   2> 6610 T1261 oasc.RequestHandlers.initHandlersFromConfig adding lazy requestHandler: solr.StandardRequestHandler
[junit4:junit4]   2> 6611 T1261 oasc.RequestHandlers.initHandlersFromConfig created lazy: solr.StandardRequestHandler
[junit4:junit4]   2> 6612 T1261 oasc.RequestHandlers.initHandlersFromConfig created /update: solr.UpdateRequestHandler
[junit4:junit4]   2> 6612 T1261 oasc.RequestHandlers.initHandlersFromConfig created /terms: org.apache.solr.handler.component.SearchHandler
[junit4:junit4]   2> 6613 T1261 oasc.RequestHandlers.initHandlersFromConfig created spellCheckCompRH: org.apache.solr.handler.component.SearchHandler
[junit4:junit4]   2> 6614 T1261 oasc.RequestHandlers.initHandlersFromConfig created spellCheckCompRH_Direct: org.apache.solr.handler.component.SearchHandler
[junit4:junit4]   2> 6614 T1261 oasc.RequestHandlers.initHandlersFromConfig created spellCheckWithWordbreak: org.apache.solr.handler.component.SearchHandler
[junit4:junit4]   2> 6615 T1261 oasc.RequestHandlers.initHandlersFromConfig created spellCheckWithWordbreak_Direct: org.apache.solr.handler.component.SearchHandler
[junit4:junit4]   2> 6615 T1261 oasc.RequestHandlers.initHandlersFromConfig created spellCheckCompRH1: org.apache.solr.handler.component.SearchHandler
[junit4:junit4]   2> 6616 T1261 oasc.RequestHandlers.initHandlersFromConfig created tvrh: org.apache.solr.handler.component.SearchHandler
[junit4:junit4]   2> 6617 T1261 oasc.RequestHandlers.initHandlersFromConfig created /mlt: solr.MoreLikeThisHandler
[junit4:junit4]   2> 6617 T1261 oasc.RequestHandlers.initHandlersFromConfig created /debug/dump: solr.DumpRequestHandler
[junit4:junit4]   2> 6622 T1261 oashl.XMLLoader.init xsltCacheLifetimeSeconds=60
[junit4:junit4]   2> 6628 T1261 oasc.SolrCore.initDeprecatedSupport WARNING solrconfig.xml uses deprecated <admin/gettableFiles>, Please update your config to use the ShowFileRequestHandler.
[junit4:junit4]   2> 6629 T1261 oasc.SolrCore.initDeprecatedSupport WARNING adding ShowFileRequestHandler with hidden files: [SCHEMA.XML, OLD_SYNONYMS.TXT, STOPWORDS.TXT, PROTWORDS.TXT, OPEN-EXCHANGE-RATES.JSON, SYNONYMS.TXT, CURRENCY.XML, MAPPING-ISOLATIN1ACCENT.TXT]
[junit4:junit4]   2> 6633 T1261 oass.SolrIndexSearcher.<init> Opening Searcher@6b6ae777 main
[junit4:junit4]   2> 6634 T1261 oasu.CommitTracker.<init> Hard AutoCommit: disabled
[junit4:junit4]   2> 6635 T1261 oasu.CommitTracker.<init> Soft AutoCommit: disabled
[junit4:junit4]   2> 6635 T1261 oashc.SpellCheckComponent.inform Initializing spell checkers
[junit4:junit4]   2> 6655 T1261 oass.DirectSolrSpellChecker.init init: {name=direct,classname=DirectSolrSpellChecker,field=lowerfilt,minQueryLength=3}
[junit4:junit4]   2> 6730 T1308 oasc.SolrCore.registerSearcher [collection1] Registered new searcher Searcher@6b6ae777 main{StandardDirectoryReader(segments_1:1)}
[junit4:junit4]   2> 6866 T1282 oascc.ZkStateReader.updateClusterState Updating cloud state from ZooKeeper... 
[junit4:junit4]   2> 6883 T1281 oascc.ZkStateReader$2.process A cluster state change has occurred - updating...
[junit4:junit4]   2> 6883 T1295 oascc.ZkStateReader$2.process A cluster state change has occurred - updating...
[junit4:junit4]   2> 6884 T1307 oascc.ZkStateReader$2.process A cluster state change has occurred - updating...
[junit4:junit4]   2> 7237 T1261 oasc.CoreContainer.register registering core: collection1
[junit4:junit4]   2> 7237 T1261 oasc.ZkController.register Register shard - core:collection1 address:http://127.0.0.1:41761/solr shardId:shard2
[junit4:junit4]   2> 7239 T1261 oascc.SolrZkClient.makePath makePath: /collections/collection1/leader_elect/shard2/election
[junit4:junit4]   2> 7272 T1266 oazs.PrepRequestProcessor.pRequest Got user-level KeeperException when processing sessionid:0x139e7e151c60004 type:delete cxid:0x42 zxid:0xfffffffffffffffe txntype:unknown reqpath:n/a Error Path:/solr/collections/collection1/leaders/shard2 Error:KeeperErrorCode = NoNode for /solr/collections/collection1/leaders/shard2
[junit4:junit4]   2> 7288 T1261 oasc.ShardLeaderElectionContext.runLeaderProcess Running the leader process.
[junit4:junit4]   2> 7289 T1266 oazs.PrepRequestProcessor.pRequest Got user-level KeeperException when processing sessionid:0x139e7e151c60004 type:create cxid:0x43 zxid:0xfffffffffffffffe txntype:unknown reqpath:n/a Error Path:/solr/overseer Error:KeeperErrorCode = NodeExists for /solr/overseer
[junit4:junit4]   2> 7301 T1261 oasc.ShardLeaderElectionContext.waitForReplicasToComeUp Enough replicas found to continue.
[junit4:junit4]   2> 7302 T1261 oasc.ShardLeaderElectionContext.runLeaderProcess I may be the new leader - try and sync
[junit4:junit4]   2> 7302 T1261 oasc.SyncStrategy.sync Sync replicas to http://127.0.0.1:41761/solr/collection1/
[junit4:junit4]   2> 7303 T1261 oasc.SyncStrategy.syncReplicas Sync Success - now sync replicas to me
[junit4:junit4]   2> 7304 T1261 oasc.SyncStrategy.syncToMe http://127.0.0.1:41761/solr/collection1/ has no replicas
[junit4:junit4]   2> 7304 T1261 oasc.ShardLeaderElectionContext.runLeaderProcess I am the new leader: http://127.0.0.1:41761/solr/collection1/
[junit4:junit4]   2> 7305 T1261 oascc.SolrZkClient.makePath makePath: /collections/collection1/leaders/shard2
[junit4:junit4]   2> 7310 T1266 oazs.PrepRequestProcessor.pRequest Got user-level KeeperException when processing sessionid:0x139e7e151c60004 type:create cxid:0x4c zxid:0xfffffffffffffffe txntype:unknown reqpath:n/a Error Path:/solr/overseer Error:KeeperErrorCode = NodeExists for /solr/overseer
[junit4:junit4]   2> 7389 T1282 oascc.ZkStateReader.updateClusterState Updating cloud state from ZooKeeper... 
[junit4:junit4]   2> 7434 T1281 oascc.ZkStateReader$2.process A cluster state change has occurred - updating...
[junit4:junit4]   2> 7434 T1307 oascc.ZkStateReader$2.process A cluster state change has occurred - updating...
[junit4:junit4]   2> 7434 T1295 oascc.ZkStateReader$2.process A cluster state change has occurred - updating...
[junit4:junit4]   2> 7473 T1261 oasc.ZkController.register We are http://127.0.0.1:41761/solr/collection1/ and leader is http://127.0.0.1:41761/solr/collection1/
[junit4:junit4]   2> 7473 T1261 oasc.ZkController.register No LogReplay needed for core=collection1 baseURL=http://127.0.0.1:41761/solr
[junit4:junit4]   2> 7474 T1261 oasc.ZkController.checkRecovery I am the leader, no recovery necessary
[junit4:junit4]   2> 7477 T1261 oascc.ZkStateReader.updateClusterState Updating cloud state from ZooKeeper... 
[junit4:junit4]   2> 7478 T1261 oass.SolrDispatchFilter.init user.dir=/usr/home/hudson/hudson-slave/workspace/Lucene-Solr-Tests-trunk-Java6/solr/build/solr-core/test/J1
[junit4:junit4]   2> 7478 T1261 oass.SolrDispatchFilter.init SolrDispatchFilter.init() done
[junit4:junit4]   2> 7479 T1261 oascsi.HttpClientUtil.createClient Creating new http client, config:maxConnections=128&maxConnectionsPerHost=32&followRedirects=false
[junit4:junit4]   2> 7645 T1261 oejs.Server.doStart jetty-8.1.2.v20120308
[junit4:junit4]   2> 7648 T1261 oejs.AbstractConnector.doStart Started SocketConnector@0.0.0.0:64269
[junit4:junit4]   2> 7648 T1261 oasc.SolrResourceLoader.locateSolrHome JNDI not configured for solr (NoInitialContextEx)
[junit4:junit4]   2> 7649 T1261 oasc.SolrResourceLoader.locateSolrHome using system property solr.solr.home: /usr/home/hudson/hudson-slave/workspace/Lucene-Solr-Tests-trunk-Java6/solr/build/solr-core/test/J1/./solrtest-jetty3-1348215074561
[junit4:junit4]   2> 7649 T1261 oasc.SolrResourceLoader.<init> new SolrResourceLoader for deduced Solr Home: '/usr/home/hudson/hudson-slave/workspace/Lucene-Solr-Tests-trunk-Java6/solr/build/solr-core/test/J1/./solrtest-jetty3-1348215074561/'
[junit4:junit4]   2> 7683 T1261 oass.SolrDispatchFilter.init SolrDispatchFilter.init()
[junit4:junit4]   2> 7683 T1261 oasc.SolrResourceLoader.locateSolrHome JNDI not configured for solr (NoInitialContextEx)
[junit4:junit4]   2> 7684 T1261 oasc.SolrResourceLoader.locateSolrHome using system property solr.solr.home: /usr/home/hudson/hudson-slave/workspace/Lucene-Solr-Tests-trunk-Java6/solr/build/solr-core/test/J1/./solrtest-jetty3-1348215074561
[junit4:junit4]   2> 7684 T1261 oasc.CoreContainer$Initializer.initialize looking for solr.xml: /usr/home/hudson/hudson-slave/workspace/Lucene-Solr-Tests-trunk-Java6/solr/build/solr-core/test/J1/./solrtest-jetty3-1348215074561/solr.xml
[junit4:junit4]   2> 7684 T1261 oasc.CoreContainer.<init> New CoreContainer 1534737898
[junit4:junit4]   2> 7685 T1261 oasc.CoreContainer.load Loading CoreContainer using Solr Home: '/usr/home/hudson/hudson-slave/workspace/Lucene-Solr-Tests-trunk-Java6/solr/build/solr-core/test/J1/./solrtest-jetty3-1348215074561/'
[junit4:junit4]   2> 7686 T1261 oasc.SolrResourceLoader.<init> new SolrResourceLoader for directory: '/usr/home/hudson/hudson-slave/workspace/Lucene-Solr-Tests-trunk-Java6/solr/build/solr-core/test/J1/./solrtest-jetty3-1348215074561/'
[junit4:junit4]   2> 7709 T1261 oasc.CoreContainer.load Registering Log Listener
[junit4:junit4]   2> 7724 T1261 oasc.CoreContainer.initZooKeeper Zookeeper client=127.0.0.1:31585/solr
[junit4:junit4]   2> 7724 T1261 oaz.ZooKeeper.<init> Initiating client connection, connectString=127.0.0.1:31585/solr sessionTimeout=5000 watcher=org.apache.solr.common.cloud.ConnectionManager@3dbfaf86
[junit4:junit4]   2> 7725 T1318 oaz.ClientCnxn$SendThread.startConnect Opening socket connection to server /127.0.0.1:31585
[junit4:junit4]   2> 7725 T1261 oascc.ConnectionManager.waitForConnected Waiting for client to connect to ZooKeeper
[junit4:junit4]   2> 7726 T1318 oaz.ClientCnxn$SendThread.primeConnection Socket connection established to localhost/127.0.0.1:31585, initiating session
[junit4:junit4]   2> 7727 T1263 oazs.NIOServerCnxn$Factory.run Accepted socket connection from /140.211.11.196:61452
[junit4:junit4]   2> 7727 T1263 oazs.NIOServerCnxn.readConnectRequest Client attempting to establish new session at /140.211.11.196:61452
[junit4:junit4]   2> 7735 T1265 oazs.NIOServerCnxn.finishSessionInit Established session 0x139e7e151c60005 with negotiated timeout 5000 for client /140.211.11.196:61452
[junit4:junit4]   2> 7735 T1318 oaz.ClientCnxn$SendThread.readConnectResult Session establishment complete on server localhost/127.0.0.1:31585, sessionid = 0x139e7e151c60005, negotiated timeout = 5000
[junit4:junit4]   2> 7736 T1319 oascc.ConnectionManager.process Watcher org.apache.solr.common.cloud.ConnectionManager@3dbfaf86 name:ZooKeeperConnection Watcher:127.0.0.1:31585/solr got event WatchedEvent state:SyncConnected type:None path:null path:null type:None
[junit4:junit4]   2> 7736 T1261 oascc.ConnectionManager.waitForConnected Client is connected to ZooKeeper
[junit4:junit4]   2> 7737 T1266 oazs.PrepRequestProcessor.pRequest Got user-level KeeperException when processing sessionid:0x139e7e151c60005 type:create cxid:0x1 zxid:0xfffffffffffffffe txntype:unknown reqpath:n/a Error Path:/solr/overseer Error:KeeperErrorCode = NodeExists for /solr/overseer
[junit4:junit4]   2> 7743 T1266 oazs.PrepRequestProcessor.pRequest Got user-level KeeperException when processing sessionid:0x139e7e151c60005 type:create cxid:0x2 zxid:0xfffffffffffffffe txntype:unknown reqpath:n/a Error Path:/solr/overseer Error:KeeperErrorCode = NodeExists for /solr/overseer
[junit4:junit4]   2> 7811 T1261 oasc.ZkController.createEphemeralLiveNode Register node as live in ZooKeeper:/live_nodes/127.0.0.1:64269_solr
[junit4:junit4]   2> 7812 T1266 oazs.PrepRequestProcessor.pRequest Got user-level KeeperException when processing sessionid:0x139e7e151c60005 type:delete cxid:0x4 zxid:0xfffffffffffffffe txntype:unknown reqpath:n/a Error Path:/solr/live_nodes/127.0.0.1:64269_solr Error:KeeperErrorCode = NoNode for /solr/live_nodes/127.0.0.1:64269_solr
[junit4:junit4]   2> 7835 T1261 oascc.SolrZkClient.makePath makePath: /live_nodes/127.0.0.1:64269_solr
[junit4:junit4]   2> 7850 T1307 oascc.ZkStateReader$3.process Updating live nodes
[junit4:junit4]   2> 7850 T1295 oascc.ZkStateReader$3.process Updating live nodes
[junit4:junit4]   2> 7850 T1281 oascc.ZkStateReader$3.process Updating live nodes
[junit4:junit4]   2> 7851 T1261 oashc.HttpShardHandlerFactory.getParameter Setting socketTimeout to: 0
[junit4:junit4]   2> 7852 T1261 oashc.HttpShardHandlerFactory.getParameter Setting urlScheme to: http://
[junit4:junit4]   2> 7852 T1261 oashc.HttpShardHandlerFactory.getParameter Setting connTimeout to: 0
[junit4:junit4]   2> 7852 T1261 oashc.HttpShardHandlerFactory.getParameter Setting maxConnectionsPerHost to: 20
[junit4:junit4]   2> 7853 T1261 oashc.HttpShardHandlerFactory.getParameter Setting corePoolSize to: 0
[junit4:junit4]   2> 7853 T1261 oashc.HttpShardHandlerFactory.getParameter Setting maximumPoolSize to: 2147483647
[junit4:junit4]   2> 7854 T1261 oashc.HttpShardHandlerFactory.getParameter Setting maxThreadIdleTime to: 5
[junit4:junit4]   2> 7854 T1261 oashc.HttpShardHandlerFactory.getParameter Setting sizeOfQueue to: -1
[junit4:junit4]   2> 7854 T1261 oashc.HttpShardHandlerFactory.getParameter Setting fairnessPolicy to: false
[junit4:junit4]   2> 7855 T1261 oascsi.HttpClientUtil.createClient Creating new http client, config:maxConnectionsPerHost=20&maxConnections=10000&socketTimeout=0&connTimeout=0&retry=false
[junit4:junit4]   2> 7883 T1261 oascc.ZkStateReader.createClusterStateWatchersAndUpdate Updating cluster state from ZooKeeper... 
[junit4:junit4]   2> 7932 T1261 oasc.CoreContainer.create Creating SolrCore 'collection1' using instanceDir: /usr/home/hudson/hudson-slave/workspace/Lucene-Solr-Tests-trunk-Java6/solr/build/solr-core/test/J1/./solrtest-jetty3-1348215074561/collection1
[junit4:junit4]   2> 7932 T1261 oasc.ZkController.createCollectionZkNode Check for collection zkNode:collection1
[junit4:junit4]   2> 7933 T1261 oasc.ZkController.createCollectionZkNode Collection zkNode exists
[junit4:junit4]   2> 7934 T1261 oasc.ZkController.readConfigName Load collection config from:/collections/collection1
[junit4:junit4]   2> 7936 T1261 oasc.SolrResourceLoader.<init> new SolrResourceLoader for directory: '/usr/home/hudson/hudson-slave/workspace/Lucene-Solr-Tests-trunk-Java6/solr/build/solr-core/test/J1/./solrtest-jetty3-1348215074561/collection1/'
[junit4:junit4]   2> 7937 T1261 oasc.SolrResourceLoader.replaceClassLoader Adding 'file:/usr/home/hudson/hudson-slave/workspace/Lucene-Solr-Tests-trunk-Java6/solr/build/solr-core/test/J1/solrtest-jetty3-1348215074561/collection1/lib/classes/' to classloader
[junit4:junit4]   2> 7938 T1261 oasc.SolrResourceLoader.replaceClassLoader Adding 'file:/usr/home/hudson/hudson-slave/workspace/Lucene-Solr-Tests-trunk-Java6/solr/build/solr-core/test/J1/solrtest-jetty3-1348215074561/collection1/lib/README' to classloader
[junit4:junit4]   2> 7951 T1282 oascc.ZkStateReader.updateClusterState Updating cloud state from ZooKeeper... 
[junit4:junit4]   2> 7980 T1281 oascc.ZkStateReader$2.process A cluster state change has occurred - updating...
[junit4:junit4]   2> 7980 T1295 oascc.ZkStateReader$2.process A cluster state change has occurred - updating...
[junit4:junit4]   2> 7980 T1307 oascc.ZkStateReader$2.process A cluster state change has occurred - updating...
[junit4:junit4]   2> 7980 T1319 oascc.ZkStateReader$2.process A cluster state change has occurred - updating...
[junit4:junit4]   2> 7998 T1261 oasc.SolrConfig.<init> Using Lucene MatchVersion: LUCENE_50
[junit4:junit4]   2> 8067 T1261 oasc.SolrConfig.<init> Loaded SolrConfig: solrconfig.xml
[junit4:junit4]   2> 8168 T1261 oass.IndexSchema.readSchema Reading Solr Schema
[junit4:junit4]   2> 8174 T1261 oass.IndexSchema.readSchema Schema name=test
[junit4:junit4]   2> 8791 T1261 oass.OpenExchangeRatesOrgProvider.init Initialized with rates=open-exchange-rates.json, refreshInterval=1440.
[junit4:junit4]   2> 8804 T1261 oass.IndexSchema.readSchema default search field in schema is text
[junit4:junit4]   2> 8810 T1261 oass.IndexSchema.readSchema unique key field: id
[junit4:junit4]   2> 8824 T1261 oass.FileExchangeRateProvider.reload Reloading exchange rates from file currency.xml
[junit4:junit4]   2> 8829 T1261 oass.FileExchangeRateProvider.reload Reloading exchange rates from file currency.xml
[junit4:junit4]   2> 8834 T1261 oass.OpenExchangeRatesOrgProvider.reload Reloading exchange rates from open-exchange-rates.json
[junit4:junit4]   2> 8836 T1261 oass.OpenExchangeRatesOrgProvider.reload Reloading exchange rates from open-exchange-rates.json
[junit4:junit4]   2> 8837 T1261 oasc.SolrCore.<init> [collection1] Opening new SolrCore at /usr/home/hudson/hudson-slave/workspace/Lucene-Solr-Tests-trunk-Java6/solr/build/solr-core/test/J1/./solrtest-jetty3-1348215074561/collection1/, dataDir=./org.apache.solr.cloud.BasicDistributedZk2Test-1348215067072/jetty3/
[junit4:junit4]   2> 8837 T1261 oasc.JmxMonitoredMap.<init> JMX monitoring is enabled. Adding Solr mbeans to JMX Server: com.sun.jmx.mbeanserver.JmxMBeanServer@561777b1
[junit4:junit4]   2> 8839 T1261 oasc.SolrCore.getNewIndexDir WARNING New index directory detected: old=null new=./org.apache.solr.cloud.BasicDistributedZk2Test-1348215067072/jetty3/index/
[junit4:junit4]   2> 8840 T1261 oasc.SolrCore.initIndex WARNING [collection1] Solr index directory './org.apache.solr.cloud.BasicDistributedZk2Test-1348215067072/jetty3/index' doesn't exist. Creating new index...
[junit4:junit4]   2> 8840 T1261 oasc.CachingDirectoryFactory.get return new directory for /usr/home/hudson/hudson-slave/workspace/Lucene-Solr-Tests-trunk-Java6/solr/build/solr-core/test/J1/./org.apache.solr.cloud.BasicDistributedZk2Test-1348215067072/jetty3/index forceNew:false
[junit4:junit4]   2> 8858 T1261 oasc.SolrDeletionPolicy.onCommit SolrDeletionPolicy.onCommit: commits:num=1
[junit4:junit4]   2> 		commit{dir=NRTCachingDirectory(org.apache.lucene.store.NIOFSDirectory@/usr/home/hudson/hudson-slave/workspace/Lucene-Solr-Tests-trunk-Java6/solr/build/solr-core/test/J1/org.apache.solr.cloud.BasicDistributedZk2Test-1348215067072/jetty3/index lockFactory=org.apache.lucene.store.NativeFSLockFactory@13e15925; maxCacheMB=48.0 maxMergeSizeMB=4.0),segFN=segments_1,generation=1,filenames=[segments_1]
[junit4:junit4]   2> 8858 T1261 oasc.SolrDeletionPolicy.updateCommits newest commit = 1
[junit4:junit4]   2> 8859 T1261 oasc.SolrCore.initWriters created xml: solr.XMLResponseWriter
[junit4:junit4]   2> 8862 T1261 oasup.UpdateRequestProcessorChain.init inserting DistributedUpdateProcessorFactory into updateRequestProcessorChain "dedupe"
[junit4:junit4]   2> 8862 T1261 oasup.UpdateRequestProcessorChain.init inserting DistributedUpdateProcessorFactory into updateRequestProcessorChain "dedupe-allfields"
[junit4:junit4]   2> 8863 T1261 oasup.UpdateRequestProcessorChain.init inserting DistributedUpdateProcessorFactory into updateRequestProcessorChain "stored_sig"
[junit4:junit4]   2> 8863 T1261 oasup.UpdateRequestProcessorChain.init inserting DistributedUpdateProcessorFactory into updateRequestProcessorChain "uniq-fields"
[junit4:junit4]   2> 8864 T1261 oasup.UpdateRequestProcessorChain.init inserting DistributedUpdateProcessorFactory into updateRequestProcessorChain "distrib-dup-test-chain-implicit"
[junit4:junit4]   2> 8864 T1261 oasc.RequestHandlers.initHandlersFromConfig adding lazy requestHandler: solr.ReplicationHandler
[junit4:junit4]   2> 8865 T1261 oasc.RequestHandlers.initHandlersFromConfig created /replication: solr.ReplicationHandler
[junit4:junit4]   2> 8866 T1261 oasc.RequestHandlers.initHandlersFromConfig created standard: solr.StandardRequestHandler
[junit4:junit4]   2> 8866 T1261 oasc.RequestHandlers.initHandlersFromConfig created /get: solr.RealTimeGetHandler
[junit4:junit4]   2> 8867 T1261 oasc.RequestHandlers.initHandlersFromConfig created dismax: solr.SearchHandler
[junit4:junit4]   2> 8868 T1261 oasc.RequestHandlers.initHandlersFromConfig created mock: org.apache.solr.core.MockQuerySenderListenerReqHandler
[junit4:junit4]   2> 8868 T1261 oasc.RequestHandlers.initHandlersFromConfig created /admin/: org.apache.solr.handler.admin.AdminHandlers
[junit4:junit4]   2> 8869 T1261 oasc.RequestHandlers.initHandlersFromConfig created defaults: solr.StandardRequestHandler
[junit4:junit4]   2> 8870 T1261 oasc.RequestHandlers.initHandlersFromConfig adding lazy requestHandler: solr.StandardRequestHandler
[junit4:junit4]   2> 8870 T1261 oasc.RequestHandlers.initHandlersFromConfig created lazy: solr.StandardRequestHandler
[junit4:junit4]   2> 8871 T1261 oasc.RequestHandlers.initHandlersFromConfig created /update: solr.UpdateRequestHandler
[junit4:junit4]   2> 8871 T1261 oasc.RequestHandlers.initHandlersFromConfig created /terms: org.apache.solr.handler.component.SearchHandler
[junit4:junit4]   2> 8872 T1261 oasc.RequestHandlers.initHandlersFromConfig created spellCheckCompRH: org.apache.solr.handler.component.SearchHandler
[junit4:junit4]   2> 8873 T1261 oasc.RequestHandlers.initHandlersFromConfig created spellCheckCompRH_Direct: org.apache.solr.handler.component.SearchHandler
[junit4:junit4]   2> 8874 T1261 oasc.RequestHandlers.initHandlersFromConfig created spellCheckWithWordbreak: org.apache.solr.handler.component.SearchHandler
[junit4:junit4]   2> 8874 T1261 oasc.RequestHandlers.initHandlersFromConfig created spellCheckWithWordbreak_Direct: org.apache.solr.handler.component.SearchHandler
[junit4:junit4]   2> 8875 T1261 oasc.RequestHandlers.initHandlersFromConfig created spellCheckCompRH1: org.apache.solr.handler.component.SearchHandler
[junit4:junit4]   2> 8875 T1261 oasc.RequestHandlers.initHandlersFromConfig created tvrh: org.apache.solr.handler.component.SearchHandler
[junit4:junit4]   2> 8876 T1261 oasc.RequestHandlers.initHandlersFromConfig created /mlt: solr.MoreLikeThisHandler
[junit4:junit4]   2> 8877 T1261 oasc.RequestHandlers.initHandlersFromConfig created /debug/dump: solr.DumpRequestHandler
[junit4:junit4]   2> 8881 T1261 oashl.XMLLoader.init xsltCacheLifetimeSeconds=60
[junit4:junit4]   2> 8885 T1261 oasc.SolrCore.initDeprecatedSupport WARNING solrconfig.xml uses deprecated <admin/gettableFiles>, Please update your config to use the ShowFileRequestHandler.
[junit4:junit4]   2> 8886 T1261 oasc.SolrCore.initDeprecatedSupport WARNING adding ShowFileRequestHandler with hidden files: [SCHEMA.XML, OLD_SYNONYMS.TXT, STOPWORDS.TXT, PROTWORDS.TXT, OPEN-EXCHANGE-RATES.JSON, SYNONYMS.TXT, CURRENCY.XML, MAPPING-ISOLATIN1ACCENT.TXT]
[junit4:junit4]   2> 8890 T1261 oass.SolrIndexSearcher.<init> Opening Searcher@5fc52571 main
[junit4:junit4]   2> 8892 T1261 oasu.CommitTracker.<init> Hard AutoCommit: disabled
[junit4:junit4]   2> 8892 T1261 oasu.CommitTracker.<init> Soft AutoCommit: disabled
[junit4:junit4]   2> 8893 T1261 oashc.SpellCheckComponent.inform Initializing spell checkers
[junit4:junit4]   2> 8913 T1261 oass.DirectSolrSpellChecker.init init: {name=direct,classname=DirectSolrSpellChecker,field=lowerfilt,minQueryLength=3}
[junit4:junit4]   2> 8990 T1320 oasc.SolrCore.registerSearcher [collection1] Registered new searcher Searcher@5fc52571 main{StandardDirectoryReader(segments_1:1)}
[junit4:junit4]   2> 9497 T1282 oascc.ZkStateReader.updateClusterState Updating cloud state from ZooKeeper... 
[junit4:junit4]   2> 9511 T1281 oascc.ZkStateReader$2.process A cluster state change has occurred - updating...
[junit4:junit4]   2> 9511 T1319 oascc.ZkStateReader$2.process A cluster state change has occurred - updating...
[junit4:junit4]   2> 9511 T1307 oascc.ZkStateReader$2.process A cluster state change has occurred - updating...
[junit4:junit4]   2> 9511 T1295 oascc.ZkStateReader$2.process A cluster state change has occurred - updating...
[junit4:junit4]   2> 9999 T1261 oasc.CoreContainer.register registering core: collection1
[junit4:junit4]   2> 9999 T1261 oasc.ZkController.register Register shard - core:collection1 address:http://127.0.0.1:64269/solr shardId:shard1
[junit4:junit4]   2> 10013 T1261 oasc.ZkController.register We are http://127.0.0.1:64269/solr/collection1/ and leader is http://127.0.0.1:40601/solr/collection1/
[junit4:junit4]   2> 10013 T1261 oasc.ZkController.register No LogReplay needed for core=collection1 baseURL=http://127.0.0.1:64269/solr
[junit4:junit4]   2> 10014 T1261 oasc.ZkController.checkRecovery Core needs to recover:collection1
[junit4:junit4]   2> 10014 T1261 oasu.DefaultSolrCoreState.doRecovery Running recovery - first canceling any ongoing recovery
[junit4:junit4]   2> ASYNC  NEW_CORE C117 name=collection1 org.apache.solr.core.SolrCore@766daf09 url=http://127.0.0.1:64269/solr/collection1 node=127.0.0.1:64269_solr
[junit4:junit4]   2> 10015 T1321 C117 P64269 oasc.RecoveryStrategy.run Starting recovery process.  core=collection1 recoveringAfterStartup=true
[junit4:junit4]   2> 10016 T1321 C117 P64269 oasc.RecoveryStrategy.doRecovery ###### startupVersions=[]
[junit4:junit4]   2> 10016 T1261 oascc.ZkStateReader.updateClusterState Updating cloud state from ZooKeeper... 
[junit4:junit4]   2> 10023 T1321 C117 P64269 oasc.RecoveryStrategy.doRecovery Attempting to PeerSync from http://127.0.0.1:40601/solr/collection1/ core=collection1 - recoveringAfterStartup=true
[junit4:junit4]   2> 10023 T1321 C117 P64269 oasu.PeerSync.sync PeerSync: core=collection1 url=http://127.0.0.1:64269/solr START replicas=[http://127.0.0.1:40601/solr/collection1/] nUpdates=100
[junit4:junit4]   2> 10023 T1321 C117 P64269 oasu.PeerSync.sync WARNING no frame of reference to tell of we've missed updates
[junit4:junit4]   2> 10023 T1261 oass.SolrDispatchFilter.init user.dir=/usr/home/hudson/hudson-slave/workspace/Lucene-Solr-Tests-trunk-Java6/solr/build/solr-core/test/J1
[junit4:junit4]   2> 10024 T1321 C117 P64269 oasc.RecoveryStrategy.doRecovery PeerSync Recovery was not successful - trying replication. core=collection1
[junit4:junit4]   2> 10024 T1321 C117 P64269 oasc.RecoveryStrategy.doRecovery Starting Replication Recovery. core=collection1
[junit4:junit4]   2> 10024 T1261 oass.SolrDispatchFilter.init SolrDispatchFilter.init() done
[junit4:junit4]   2> 10025 T1321 C117 P64269 oascsi.HttpClientUtil.createClient Creating new http client, config:maxConnections=128&maxConnectionsPerHost=32&followRedirects=false
[junit4:junit4]   2> 10025 T1261 oascsi.HttpClientUtil.createClient Creating new http client, config:maxConnections=128&maxConnectionsPerHost=32&followRedirects=false
[junit4:junit4]   2> ASYNC  NEW_CORE C118 name=collection1 org.apache.solr.core.SolrCore@2b89889b url=http://127.0.0.1:40601/solr/collection1 node=127.0.0.1:40601_solr
[junit4:junit4]   2> 10038 T1287 C118 P40601 REQ /get {distrib=false&qt=/get&wt=javabin&version=2&getVersions=100} status=0 QTime=0 
[junit4:junit4]   2> 10226 T1261 oejs.Server.doStart jetty-8.1.2.v20120308
[junit4:junit4]   2> 10229 T1261 oejs.AbstractConnector.doStart Started SocketConnector@0.0.0.0:24981
[junit4:junit4]   2> 10229 T1261 oasc.SolrResourceLoader.locateSolrHome JNDI not configured for solr (NoInitialContextEx)
[junit4:junit4]   2> 10230 T1261 oasc.SolrResourceLoader.locateSolrHome using system property solr.solr.home: /usr/home/hudson/hudson-slave/workspace/Lucene-Solr-Tests-trunk-Java6/solr/build/solr-core/test/J1/./solrtest-jetty4-1348215077112
[junit4:junit4]   2> 10230 T1261 oasc.SolrResourceLoader.<init> new SolrResourceLoader for deduced Solr Home: '/usr/home/hudson/hudson-slave/workspace/Lucene-Solr-Tests-trunk-Java6/solr/build/solr-core/test/J1/./solrtest-jetty4-1348215077112/'
[junit4:junit4]   2> 10270 T1261 oass.SolrDispatchFilter.init SolrDispatchFilter.init()
[junit4:junit4]   2> 10270 T1261 oasc.SolrResourceLoader.locateSolrHome JNDI not configured for solr (NoInitialContextEx)
[junit4:junit4]   2> 10270 T1261 oasc.SolrResourceLoader.locateSolrHome using system property solr.solr.home: /usr/home/hudson/hudson-slave/workspace/Lucene-Solr-Tests-trunk-Java6/solr/build/solr-core/test/J1/./solrtest-jetty4-1348215077112
[junit4:junit4]   2> 10271 T1261 oasc.CoreContainer$Initializer.initialize looking for solr.xml: /usr/home/hudson/hudson-slave/workspace/Lucene-Solr-Tests-trunk-Java6/solr/build/solr-core/test/J1/./solrtest-jetty4-1348215077112/solr.xml
[junit4:junit4]   2> 10271 T1261 oasc.CoreContainer.<init> New CoreContainer 160524251
[junit4:junit4]   2> 10272 T1261 oasc.CoreContainer.load Loading CoreContainer using Solr Home: '/usr/home/hudson/hudson-slave/workspace/Lucene-Solr-Tests-trunk-Java6/solr/build/solr-core/test/J1/./solrtest-jetty4-1348215077112/'
[junit4:junit4]   2> 10272 T1261 oasc.SolrResourceLoader.<init> new SolrResourceLoader for directory: '/usr/home/hudson/hudson-slave/workspace/Lucene-Solr-Tests-trunk-Java6/solr/build/solr-core/test/J1/./solrtest-jetty4-1348215077112/'
[junit4:junit4]   2> 10302 T1261 oasc.CoreContainer.load Registering Log Listener
[junit4:junit4]   2> 10316 T1261 oasc.CoreContainer.initZooKeeper Zookeeper client=127.0.0.1:31585/solr
[junit4:junit4]   2> 10317 T1261 oaz.ZooKeeper.<init> Initiating client connection, connectString=127.0.0.1:31585/solr sessionTimeout=5000 watcher=org.apache.solr.common.cloud.ConnectionManager@75be93a7
[junit4:junit4]   2> 10318 T1332 oaz.ClientCnxn$SendThread.startConnect Opening socket connection to server /127.0.0.1:31585
[junit4:junit4]   2> 10318 T1261 oascc.ConnectionManager.waitForConnected Waiting for client to connect to ZooKeeper
[junit4:junit4]   2> 10319 T1332 oaz.ClientCnxn$SendThread.primeConnection Socket connection established to localhost/127.0.0.1:31585, initiating session
[junit4:junit4]   2> 10319 T1263 oazs.NIOServerCnxn$Factory.run Accepted socket connection from /140.211.11.196:28741
[junit4:junit4]   2> 10320 T1263 oazs.NIOServerCnxn.readConnectRequest Client attempting to establish new session at /140.211.11.196:28741
[junit4:junit4]   2> 10328 T1265 oazs.NIOServerCnxn.finishSessionInit Established session 0x139e7e151c60006 with negotiated timeout 5000 for client /140.211.11.196:28741
[junit4:junit4]   2> 10328 T1332 oaz.ClientCnxn$SendThread.readConnectResult Session establishment complete on server localhost/127.0.0.1:31585, sessionid = 0x139e7e151c60006, negotiated timeout = 5000
[junit4:junit4]   2> 10328 T1333 oascc.ConnectionManager.process Watcher org.apache.solr.common.cloud.ConnectionManager@75be93a7 name:ZooKeeperConnection Watcher:127.0.0.1:31585/solr got event WatchedEvent state:SyncConnected type:None path:null path:null type:None
[junit4:junit4]   2> 10328 T1261 oascc.ConnectionManager.waitForConnected Client is connected to ZooKeeper
[junit4:junit4]   2> 10329 T1266 oazs.PrepRequestProcessor.pRequest Got user-level KeeperException when processing sessionid:0x139e7e151c60006 type:create cxid:0x1 zxid:0xfffffffffffffffe txntype:unknown reqpath:n/a Error Path:/solr/overseer Error:KeeperErrorCode = NodeExists for /solr/overseer
[junit4:junit4]   2> 10331 T1266 oazs.PrepRequestProcessor.pRequest Got user-level KeeperException when processing sessionid:0x139e7e151c60006 type:create cxid:0x2 zxid:0xfffffffffffffffe txntype:unknown reqpath:n/a Error Path:/solr/overseer Error:KeeperErrorCode = NodeExists for /solr/overseer
[junit4:junit4]   2> 10344 T1261 oasc.ZkController.createEphemeralLiveNode Register node as live in ZooKeeper:/live_nodes/127.0.0.1:24981_solr
[junit4:junit4]   2> 10345 T1266 oazs.PrepRequestProcessor.pRequest Got user-level KeeperException when processing sessionid:0x139e7e151c60006 type:delete cxid:0x4 zxid:0xfffffffffffffffe txntype:unknown reqpath:n/a Error Path:/solr/live_nodes/127.0.0.1:24981_solr Error:KeeperErrorCode = NoNode for /solr/live_nodes/127.0.0.1:24981_solr
[junit4:junit4]   2> 10355 T1261 oascc.SolrZkClient.makePath makePath: /live_nodes/127.0.0.1:24981_solr
[junit4:junit4]   2> 10366 T1281 oascc.ZkStateReader$3.process Updating live nodes
[junit4:junit4]   2> 10366 T1319 oascc.ZkStateReader$3.process Updating live nodes
[junit4:junit4]   2> 10366 T1307 oascc.ZkStateReader$3.process Updating live nodes
[junit4:junit4]   2> 10366 T1295 oascc.ZkStateReader$3.process Updating live nodes
[junit4:junit4]   2> 10368 T1261 oashc.HttpShardHandlerFactory.getParameter Setting socketTimeout to: 0
[junit4:junit4]   2> 10369 T1261 oashc.HttpShardHandlerFactory.getParameter Setting urlScheme to: http://
[junit4:junit4]   2> 10370 T1261 oashc.HttpShardHandlerFactory.getParameter Setting connTimeout to: 0
[junit4:junit4]   2> 10370 T1261 oashc.HttpShardHandlerFactory.getParameter Setting maxConnectionsPerHost to: 20
[junit4:junit4]   2> 10371 T1261 oashc.HttpShardHandlerFactory.getParameter Setting corePoolSize to: 0
[junit4:junit4]   2> 10371 T1261 oashc.HttpShardHandlerFactory.getParameter Setting maximumPoolSize to: 2147483647
[junit4:junit4]   2> 10372 T1261 oashc.HttpShardHandlerFactory.getParameter Setting maxThreadIdleTime to: 5
[junit4:junit4]   2> 10372 T1261 oashc.HttpShardHandlerFactory.getParameter Setting sizeOfQueue to: -1
[junit4:junit4]   2> 10373 T1261 oashc.HttpShardHandlerFactory.getParameter Setting fairnessPolicy to: false
[junit4:junit4]   2> 10373 T1261 oascsi.HttpClientUtil.createClient Creating new http client, config:maxConnectionsPerHost=20&maxConnections=10000&socketTimeout=0&connTimeout=0&retry=false
[junit4:junit4]   2> 10392 T1261 oascc.ZkStateReader.createClusterStateWatchersAndUpdate Updating cluster state from ZooKeeper... 
[junit4:junit4]   2> 10402 T1261 oasc.CoreContainer.create Creating SolrCore 'collection1' using instanceDir: /usr/home/hudson/hudson-slave/workspace/Lucene-Solr-Tests-trunk-Java6/solr/build/solr-core/test/J1/./solrtest-jetty4-1348215077112/collection1
[junit4:junit4]   2> 10403 T1261 oasc.ZkController.createCollectionZkNode Check for collection zkNode:collection1
[junit4:junit4]   2> 10404 T1261 oasc.ZkController.createCollectionZkNode Collection zkNode exists
[junit4:junit4]   2> 10404 T1261 oasc.ZkController.readConfigName Load collection config from:/collections/collection1
[junit4:junit4]   2> 10406 T1261 oasc.SolrResourceLoader.<init> new SolrResourceLoader for directory: '/usr/home/hudson/hudson-slave/workspace/Lucene-Solr-Tests-trunk-Java6/solr/build/solr-core/test/J1/./solrtest-jetty4-1348215077112/collection1/'
[junit4:junit4]   2> 10408 T1261 oasc.SolrResourceLoader.replaceClassLoader Adding 'file:/usr/home/hudson/hudson-slave/workspace/Lucene-Solr-Tests-trunk-Java6/solr/build/solr-core/test/J1/solrtest-jetty4-1348215077112/collection1/lib/classes/' to classloader
[junit4:junit4]   2> 10409 T1261 oasc.SolrResourceLoader.replaceClassLoader Adding 'file:/usr/home/hudson/hudson-slave/workspace/Lucene-Solr-Tests-trunk-Java6/solr/build/solr-core/test/J1/solrtest-jetty4-1348215077112/collection1/lib/README' to classloader
[junit4:junit4]   2> 10463 T1261 oasc.SolrConfig.<init> Using Lucene MatchVersion: LUCENE_50
[junit4:junit4]   2> 10519 T1282 oascc.ZkStateReader.updateClusterState Updating cloud state from ZooKeeper... 
[junit4:junit4]   2> 10535 T1261 oasc.SolrConfig.<init> Loaded SolrConfig: solrconfig.xml
[junit4:junit4]   2> 10539 T1281 oascc.ZkStateReader$2.process A cluster state change has occurred - updating...
[junit4:junit4]   2> 10539 T1307 oascc.ZkStateReader$2.process A cluster state change has occurred - updating...
[junit4:junit4]   2> 10539 T1295 oascc.ZkStateReader$2.process A cluster state change has occurred - updating...
[junit4:junit4]   2> 10539 T1333 oascc.ZkStateReader$2.process A cluster state change has occurred - updating...
[junit4:junit4]   2> 10539 T1319 oascc.ZkStateReader$2.process A cluster state change has occurred - updating...
[junit4:junit4]   2> 10539 T1261 oass.IndexSchema.readSchema Reading Solr Schema
[junit4:junit4]   2> 10546 T1261 oass.IndexSchema.readSchema Schema name=test
[junit4:junit4]   2> 11126 T1261 oass.OpenExchangeRatesOrgProvider.init Initialized with rates=open-exchange-rates.json, refreshInterval=1440.
[junit4:junit4]   2> 11134 T1261 oass.IndexSchema.readSchema default search field in schema is text
[junit4:junit4]   2> 11136 T1261 oass.IndexSchema.readSchema unique key field: id
[junit4:junit4]   2> 11148 T1261 oass.FileExchangeRateProvider.reload Reloading exchange rates from file currency.xml
[junit4:junit4]   2> 11152 T1261 oass.FileExchangeRateProvider.reload Reloading exchange rates from file currency.xml
[junit4:junit4]   2> 11155 T1261 oass.OpenExchangeRatesOrgProvider.reload Reloading exchange rates from open-exchange-rates.json
[junit4:junit4]   2> 11156 T1261 oass.OpenExchangeRatesOrgProvider.reload Reloading exchange rates from open-exchange-rates.json
[junit4:junit4]   2> 11157 T1261 oasc.SolrCore.<init> [collection1] Opening new SolrCore at /usr/home/hudson/hudson-slave/workspace/Lucene-Solr-Tests-trunk-Java6/solr/build/solr-core/test/J1/./solrtest-jetty4-1348215077112/collection1/, dataDir=./org.apache.solr.cloud.BasicDistributedZk2Test-1348215067072/jetty4/
[junit4:junit4]   2> 11158 T1261 oasc.JmxMonitoredMap.<init> JMX monitoring is enabled. Adding Solr mbeans to JMX Server: com.sun.jmx.mbeanserver.JmxMBeanServer@561777b1
[junit4:junit4]   2> 11158 T1261 oasc.SolrCore.getNewIndexDir WARNING New index directory detected: old=null new=./org.apache.solr.cloud.BasicDistributedZk2Test-1348215067072/jetty4/index/
[junit4:junit4]   2> 11159 T1261 oasc.SolrCore.initIndex WARNING [collection1] Solr index directory './org.apache.solr.cloud.BasicDistributedZk2Test-1348215067072/jetty4/index' doesn't exist. Creating new index...
[junit4:junit4]   2> 11160 T1261 oasc.CachingDirectoryFactory.get return new directory for /usr/home/hudson/hudson-slave/workspace/Lucene-Solr-Tests-trunk-Java6/solr/build/solr-core/test/J1/./org.apache.solr.cloud.BasicDistributedZk2Test-1348215067072/jetty4/index forceNew:false
[junit4:junit4]   2> 11169 T1261 oasc.SolrDeletionPolicy.onCommit SolrDeletionPolicy.onCommit: commits:num=1
[junit4:junit4]   2> 		commit{dir=NRTCachingDirectory(org.apache.lucene.store.NIOFSDirectory@/usr/home/hudson/hudson-slave/workspace/Lucene-Solr-Tests-trunk-Java6/solr/build/solr-core/test/J1/org.apache.solr.cloud.BasicDistributedZk2Test-1348215067072/jetty4/index lockFactory=org.apache.lucene.store.NativeFSLockFactory@7eefba6d; maxCacheMB=48.0 maxMergeSizeMB=4.0),segFN=segments_1,generation=1,filenames=[segments_1]
[junit4:junit4]   2> 11169 T1261 oasc.SolrDeletionPolicy.updateCommits newest commit = 1
[junit4:junit4]   2> 11170 T1261 oasc.SolrCore.initWriters created xml: solr.XMLResponseWriter
[junit4:junit4]   2> 11171 T1261 oasup.UpdateRequestProcessorChain.init inserting DistributedUpdateProcessorFactory into updateRequestProcessorChain "dedupe"
[junit4:junit4]   2> 11172 T1261 oasup.UpdateRequestProcessorChain.init inserting DistributedUpdateProcessorFactory into updateRequestProcessorChain "dedupe-allfields"
[junit4:junit4]   2> 11172 T1261 oasup.UpdateRequestProcessorChain.init inserting DistributedUpdateProcessorFactory into updateRequestProcessorChain "stored_sig"
[junit4:junit4]   2> 11172 T1261 oasup.UpdateRequestProcessorChain.init inserting DistributedUpdateProcessorFactory into updateRequestProcessorChain "uniq-fields"
[junit4:junit4]   2> 11173 T1261 oasup.UpdateRequestProcessorChain.init inserting DistributedUpdateProcessorFactory into updateRequestProcessorChain "distrib-dup-test-chain-implicit"
[junit4:junit4]   2> 11173 T1261 oasc.RequestHandlers.initHandlersFromConfig adding lazy requestHandler: solr.ReplicationHandler
[junit4:junit4]   2> 11174 T1261 oasc.RequestHandlers.initHandlersFromConfig created /replication: solr.ReplicationHandler
[junit4:junit4]   2> 11174 T1261 oasc.RequestHandlers.initHandlersFromConfig created standard: solr.StandardRequestHandler
[junit4:junit4]   2> 11175 T1261 oasc.RequestHandlers.initHandlersFromConfig created /get: solr.RealTimeGetHandler
[junit4:junit4]   2> 11175 T1261 oasc.RequestHandlers.initHandlersFromConfig created dismax: solr.SearchHandler
[junit4:junit4]   2> 11175 T1261 oasc.RequestHandlers.initHandlersFromConfig created mock: org.apache.solr.core.MockQuerySenderListenerReqHandler
[junit4:junit4]   2> 11176 T1261 oasc.RequestHandlers.initHandlersFromConfig created /admin/: org.apache.solr.handler.admin.AdminHandlers
[junit4:junit4]   2> 11176 T1261 oasc.RequestHandlers.initHandlersFromConfig created defaults: solr.StandardRequestHandler
[junit4:junit4]   2> 11177 T1261 oasc.RequestHandlers.initHandlersFromConfig adding lazy requestHandler: solr.StandardRequestHandler
[junit4:junit4]   2> 11177 T1261 oasc.RequestHandlers.initHandlersFromConfig created lazy: solr.StandardRequestHandler
[junit4:junit4]   2> 11177 T1261 oasc.RequestHandlers.initHandlersFromConfig created /update: solr.UpdateRequestHandler
[junit4:junit4]   2> 11178 T1261 oasc.RequestHandlers.initHandlersFromConfig created /terms: org.apache.solr.handler.component.SearchHandler
[junit4:junit4]   2> 11178 T1261 oasc.RequestHandlers.initHandlersFromConfig created spellCheckCompRH: org.apache.solr.handler.component.SearchHandler
[junit4:junit4]   2> 11179 T1261 oasc.RequestHandlers.initHandlersFromConfig created spellCheckCompRH_Direct: org.apache.solr.handler.component.SearchHandler
[junit4:junit4]   2> 11179 T1261 oasc.RequestHandlers.initHandlersFromConfig created spellCheckWithWordbreak: org.apache.solr.handler.component.SearchHandler
[junit4:junit4]   2> 11180 T1261 oasc.RequestHandlers.initHandlersFromConfig created spellCheckWithWordbreak_Direct: org.apache.solr.handler.component.SearchHandler
[junit4:junit4]   2> 11180 T1261 oasc.RequestHandlers.initHandlersFromConfig created spellCheckCompRH1: org.apache.solr.handler.component.SearchHandler
[junit4:junit4]   2> 11181 T1261 oasc.RequestHandlers.initHandlersFromConfig created tvrh: org.apache.solr.handler.component.SearchHandler
[junit4:junit4]   2> 11181 T1261 oasc.RequestHandlers.initHandlersFromConfig created /mlt: solr.MoreLikeThisHandler
[junit4:junit4]   2> 11181 T1261 oasc.RequestHandlers.initHandlersFromConfig created /debug/dump: solr.DumpRequestHandler
[junit4:junit4]   2> 11184 T1261 oashl.XMLLoader.init xsltCacheLifetimeSeconds=60
[junit4:junit4]   2> 11187 T1261 oasc.SolrCore.initDeprecatedSupport WARNING solrconfig.xml uses deprecated <admin/gettableFiles>, Please update your config to use the ShowFileRequestHandler.
[junit4:junit4]   2> 11188 T1261 oasc.SolrCore.initDeprecatedSupport WARNING adding ShowFileRequestHandler with hidden files: [SCHEMA.XML, OLD_SYNONYMS.TXT, STOPWORDS.TXT, PROTWORDS.TXT, OPEN-EXCHANGE-RATES.JSON, SYNONYMS.TXT, CURRENCY.XML, MAPPING-ISOLATIN1ACCENT.TXT]
[junit4:junit4]   2> 11191 T1261 oass.SolrIndexSearcher.<init> Opening Searcher@403b0943 main
[junit4:junit4]   2> 11192 T1261 oasu.CommitTracker.<init> Hard AutoCommit: disabled
[junit4:junit4]   2> 11192 T1261 oasu.CommitTracker.<init> Soft AutoCommit: disabled
[junit4:junit4]   2> 11192 T1261 oashc.SpellCheckComponent.inform Initializing spell checkers
[junit4:junit4]   2> 11211 T1261 oass.DirectSolrSpellChecker.init init: {name=direct,classname=DirectSolrSpellChecker,field=lowerfilt,minQueryLength=3}
[junit4:junit4]   2> 11275 T1334 oasc.SolrCore.registerSearcher [collection1] Registered new searcher Searcher@403b0943 main{StandardDirectoryReader(segments_1:1)}
[junit4:junit4]   2> 11551 T1282 oascc.ZkStateReader.updateClusterState Updating cloud state from ZooKeeper... 
[junit4:junit4]   2> 11573 T1281 oascc.ZkStateReader$2.process A cluster state change has occurred - updating...
[junit4:junit4]   2> 11573 T1333 oascc.ZkStateReader$2.process A cluster state change has occurred - updating...
[junit4:junit4]   2> 11573 T1295 oascc.ZkStateReader$2.process A cluster state change has occurred - updating...
[junit4:junit4]   2> 11573 T1319 oascc.ZkStateReader$2.process A cluster state change has occurred - updating...
[junit4:junit4]   2> 11573 T1307 oascc.ZkStateReader$2.process A cluster state change has occurred - updating...
[junit4:junit4]   2> 11781 T1261 oasc.CoreContainer.register registering core: collection1
[junit4:junit4]   2> 11781 T1261 oasc.ZkController.register Register shard - core:collection1 address:http://127.0.0.1:24981/solr shardId:shard2
[junit4:junit4]   2> 11788 T1261 oasc.ZkController.register We are http://127.0.0.1:24981/solr/collection1/ and leader is http://127.0.0.1:41761/solr/collection1/
[junit4:junit4]   2> 11789 T1261 oasc.ZkController.register No LogReplay needed for core=collection1 baseURL=http://127.0.0.1:24981/solr
[junit4:junit4]   2> 11789 T1261 oasc.ZkController.checkRecovery Core needs to recover:collection1
[junit4:junit4]   2> 11789 T1261 oasu.DefaultSolrCoreState.doRecovery Running recovery - first canceling any ongoing recovery
[junit4:junit4]   2> ASYNC  NEW_CORE C119 name=collection1 org.apache.solr.core.SolrCore@76520c83 url=http://127.0.0.1:24981/solr/collection1 node=127.0.0.1:24981_solr
[junit4:junit4]   2> 11790 T1335 C119 P24981 oasc.RecoveryStrategy.run Starting recovery process.  core=collection1 recoveringAfterStartup=true
[junit4:junit4]   2> 11791 T1335 C119 P24981 oasc.RecoveryStrategy.doRecovery ###### startupVersions=[]
[junit4:junit4]   2> 11791 T1261 oascc.ZkStateReader.updateClusterState Updating cloud state from ZooKeeper... 
[junit4:junit4]   2> 11792 T1261 oass.SolrDispatchFilter.init user.dir=/usr/home/hudson/hudson-slave/workspace/Lucene-Solr-Tests-trunk-Java6/solr/build/solr-core/test/J1
[junit4:junit4]   2> 11792 T1261 oass.SolrDispatchFilter.init SolrDispatchFilter.init() done
[junit4:junit4]   2> 11793 T1261 oascsi.HttpClientUtil.createClient Creating new http client, config:maxConnections=128&maxConnectionsPerHost=32&followRedirects=false
[junit4:junit4]   2> 11796 T1335 C119 P24981 oasc.RecoveryStrategy.doRecovery Attempting to PeerSync from http://127.0.0.1:41761/solr/collection1/ core=collection1 - recoveringAfterStartup=true
[junit4:junit4]   2> 11796 T1335 C119 P24981 oasu.PeerSync.sync PeerSync: core=collection1 url=http://127.0.0.1:24981/solr START replicas=[http://127.0.0.1:41761/solr/collection1/] nUpdates=100
[junit4:junit4]   2> 11796 T1335 C119 P24981 oasu.PeerSync.sync WARNING no frame of reference to tell of we've missed updates
[junit4:junit4]   2> 11797 T1335 C119 P24981 oasc.RecoveryStrategy.doRecovery PeerSync Recovery was not successful - trying replication. core=collection1
[junit4:junit4]   2> 11797 T1335 C119 P24981 oasc.RecoveryStrategy.doRecovery Starting Replication Recovery. core=collection1
[junit4:junit4]   2> 11797 T1335 C119 P24981 oascsi.HttpClientUtil.createClient Creating new http client, config:maxConnections=128&maxConnectionsPerHost=32&followRedirects=false
[junit4:junit4]   2> ASYNC  NEW_CORE C120 name=collection1 org.apache.solr.core.SolrCore@25b3267d url=http://127.0.0.1:41761/solr/collection1 node=127.0.0.1:41761_solr
[junit4:junit4]   2> 11806 T1299 C120 P41761 REQ /get {distrib=false&qt=/get&wt=javabin&version=2&getVersions=100} status=0 QTime=0 
[junit4:junit4]   2> 11812 T1261 oaz.ZooKeeper.<init> Initiating client connection, connectString=127.0.0.1:31585/solr sessionTimeout=10000 watcher=org.apache.solr.common.cloud.ConnectionManager@3eb6814a
[junit4:junit4]   2> 11813 T1337 oaz.ClientCnxn$SendThread.startConnect Opening socket connection to server /127.0.0.1:31585
[junit4:junit4]   2> 11813 T1261 oascc.ConnectionManager.waitForConnected Waiting for client to connect to ZooKeeper
[junit4:junit4]   2> 11813 T1337 oaz.ClientCnxn$SendThread.primeConnection Socket connection established to localhost/127.0.0.1:31585, initiating session
[junit4:junit4]   2> 11813 T1263 oazs.NIOServerCnxn$Factory.run Accepted socket connection from /140.211.11.196:25223
[junit4:junit4]   2> 11814 T1263 oazs.NIOServerCnxn.readConnectRequest Client attempting to establish new session at /140.211.11.196:25223
[junit4:junit4]   2> 11819 T1265 oazs.NIOServerCnxn.finishSessionInit Established session 0x139e7e151c60007 with negotiated timeout 10000 for client /140.211.11.196:25223
[junit4:junit4]   2> 11819 T1337 oaz.ClientCnxn$SendThread.readConnectResult Session establishment complete on server localhost/127.0.0.1:31585, sessionid = 0x139e7e151c60007, negotiated timeout = 10000
[junit4:junit4]   2> 11819 T1338 oascc.ConnectionManager.process Watcher org.apache.solr.common.cloud.ConnectionManager@3eb6814a name:ZooKeeperConnection Watcher:127.0.0.1:31585/solr got event WatchedEvent state:SyncConnected type:None path:null path:null type:None
[junit4:junit4]   2> 11819 T1261 oascc.ConnectionManager.waitForConnected Client is connected to ZooKeeper
[junit4:junit4]   2> 11820 T1261 oascc.ZkStateReader.createClusterStateWatchersAndUpdate Updating cluster state from ZooKeeper... 
[junit4:junit4]   2> 11822 T1261 oasc.ChaosMonkey.monkeyLog monkey: init - expire sessions:true cause connection loss:true
[junit4:junit4]   2> 11822 T1261 oascsi.HttpClientUtil.createClient Creating new http client, config:
[junit4:junit4]   2> 11833 T1261 oascc.ZkStateReader.updateClusterState Updating cloud state from ZooKeeper... 
[junit4:junit4]   2> ASYNC  NEW_CORE C121 name=collection1 org.apache.solr.core.SolrCore@8bf5cfa url=http://127.0.0.1:29988/solr/collection1 node=127.0.0.1:29988_solr
[junit4:junit4]   2> 11846 T1273 C121 P29988 oasc.SolrDeletionPolicy.onInit SolrDeletionPolicy.onInit: commits:num=1
[junit4:junit4]   2> 		commit{dir=NRTCachingDirectory(org.apache.lucene.store.NIOFSDirectory@/usr/home/hudson/hudson-slave/workspace/Lucene-Solr-Tests-trunk-Java6/solr/build/solr-core/test/J1/org.apache.solr.cloud.BasicDistributedZk2Test-1348215067072/control/data/index lockFactory=org.apache.lucene.store.NativeFSLockFactory@5273db92; maxCacheMB=48.0 maxMergeSizeMB=4.0),segFN=segments_1,generation=1,filenames=[segments_1]
[junit4:junit4]   2> 11847 T1273 C121 P29988 oasc.SolrDeletionPolicy.updateCommits newest commit = 1
[junit4:junit4]   2> 11850 T1273 C121 P29988 /update {wt=javabin&version=2} {add=[1 (1413705974582083584)]} 0 10
[junit4:junit4]   2> 11851 T1261 oaz.ZooKeeper.<init> Initiating client connection, connectString=127.0.0.1:31585/solr sessionTimeout=10000 watcher=org.apache.solr.common.cloud.ConnectionManager@1b61ae5a
[junit4:junit4]   2> 11852 T1339 oaz.ClientCnxn$SendThread.startConnect Opening socket connection to server /127.0.0.1:31585
[junit4:junit4]   2> 11852 T1261 oascc.ConnectionManager.waitForConnected Waiting for client to connect to ZooKeeper
[junit4:junit4]   2> 11852 T1339 oaz.ClientCnxn$SendThread.primeConnection Socket connection established to localhost/127.0.0.1:31585, initiating session
[junit4:junit4]   2> 11853 T1263 oazs.NIOServerCnxn$Factory.run Accepted socket connection from /140.211.11.196:61404
[junit4:junit4]   2> 11853 T1263 oazs.NIOServerCnxn.readConnectRequest Client attempting to establish new session at /140.211.11.196:61404
[junit4:junit4]   2> 11854 T1265 oazs.NIOServerCnxn.finishSessionInit Established session 0x139e7e151c60008 with negotiated timeout 10000 for client /140.211.11.196:61404
[junit4:junit4]   2> 11854 T1339 oaz.ClientCnxn$SendThread.readConnectResult Session establishment complete on server localhost/127.0.0.1:31585, sessionid = 0x139e7e151c60008, negotiated timeout = 10000
[junit4:junit4]   2> 11854 T1340 oascc.ConnectionManager.process Watcher org.apache.solr.common.cloud.ConnectionManager@1b61ae5a name:ZooKeeperConnection Watcher:127.0.0.1:31585/solr got event WatchedEvent state:SyncConnected type:None path:null path:null type:None
[junit4:junit4]   2> 11855 T1261 oascc.ConnectionManager.waitForConnected Client is connected to ZooKeeper
[junit4:junit4]   2> 11856 T1261 oascc.ZkStateReader.createClusterStateWatchersAndUpdate Updating cluster state from ZooKeeper... 
[junit4:junit4]   2> 11863 T1289 C118 P40601 oasc.SolrDeletionPolicy.onInit SolrDeletionPolicy.onInit: commits:num=1
[junit4:junit4]   2> 		commit{dir=NRTCachingDirectory(org.apache.lucene.store.NIOFSDirectory@/usr/home/hudson/hudson-slave/workspace/Lucene-Solr-Tests-trunk-Java6/solr/build/solr-core/test/J1/org.apache.solr.cloud.BasicDistributedZk2Test-1348215067072/jetty1/index lockFactory=org.apache.lucene.store.NativeFSLockFactory@5e8693f2; maxCacheMB=48.0 maxMergeSizeMB=4.0),segFN=segments_1,generation=1,filenames=[segments_1]
[junit4:junit4]   2> 11864 T1289 C118 P40601 oasc.SolrDeletionPolicy.updateCommits newest commit = 1
[junit4:junit4]   2>  C117_STATE=coll:collection1 core:collection1 props:{shard=shard1, roles=null, state=recovering, core=collection1, collection=collection1, node_name=127.0.0.1:64269_solr, base_url=http://127.0.0.1:64269/solr}
[junit4:junit4]   2> 11880 T1311 C117 P64269 oasc.SolrDeletionPolicy.onInit SolrDeletionPolicy.onInit: commits:num=1
[junit4:junit4]   2> 		commit{dir=NRTCachingDirectory(org.apache.lucene.store.NIOFSDirectory@/usr/home/hudson/hudson-slave/workspace/Lucene-Solr-Tests-trunk-Java6/solr/build/solr-core/test/J1/org.apache.solr.cloud.BasicDistributedZk2Test-1348215067072/jetty3/index lockFactory=org.apache.lucene.store.NativeFSLockFactory@13e15925; maxCacheMB=48.0 maxMergeSizeMB=4.0),segFN=segments_1,generation=1,filenames=[segments_1]
[junit4:junit4]   2> 11881 T1311 C117 P64269 oasc.SolrDeletionPolicy.updateCommits newest commit = 1
[junit4:junit4]   2> 11884 T1311 C117 P64269 REQ /update {update.distrib=FROMLEADER&distrib.from=http://127.0.0.1:40601/solr/collection1/&wt=javabin&version=2} status=0 QTime=9 
[junit4:junit4]   2> 11885 T1289 C118 P40601 REQ /update {distrib.from=http://127.0.0.1:41761/solr/collection1/&update.distrib=TOLEADER&wt=javabin&version=2} status=0 QTime=25 
[junit4:junit4]   2> 11885 T1301 C120 P41761 /update {wt=javabin&version=2} {add=[1]} 0 26
[junit4:junit4]   2> 11886 T1261 oasc.AbstractDistribZkTestBase.waitForRecoveriesToFinish Wait for recoveries to finish - collection: collection1 failOnTimeout:true timeout (sec):1800
[junit4:junit4]   2> 11887 T1261 oascc.ZkStateReader.updateClusterState Updating cloud state from ZooKeeper... 
[junit4:junit4]   2> 12088 T1282 oascc.ZkStateReader.updateClusterState Updating cloud state from ZooKeeper... 
[junit4:junit4]   2> 12112 T1281 oascc.ZkStateReader$2.process A cluster state change has occurred - updating...
[junit4:junit4]   2> 12113 T1319 oascc.ZkStateReader$2.process A cluster state change has occurred - updating...
[junit4:junit4]   2> 12113 T1333 oascc.ZkStateReader$2.process A cluster state change has occurred - updating...
[junit4:junit4]   2> 12113 T1295 oascc.ZkStateReader$2.process A cluster state change has occurred - updating...
[junit4:junit4]   2> 12113 T1307 oascc.ZkStateReader$2.process A cluster state change has occurred - updating...
[junit4:junit4]   2> 12113 T1340 oascc.ZkStateReader$2.process A cluster state change has occurred - updating...
[junit4:junit4]   2> 12113 T1338 oascc.ZkStateReader$2.process A cluster state change has occurred - updating...
[junit4:junit4]   2> 12889 T1261 oascc.ZkStateReader.updateClusterState Updating cloud state from ZooKeeper... 
[junit4:junit4]   2> 13047 T1321 C117 P64269 oasc.RecoveryStrategy.doRecovery Begin buffering updates. core=collection1
[junit4:junit4]   2> 13047 T1321 C117 P64269 oasu.UpdateLog.bufferUpdates Starting to buffer updates. FSUpdateLog{state=ACTIVE, tlog=tlog{file=./org.apache.solr.cloud.BasicDistributedZk2Test-1348215067072/jetty3/tlog/tlog.0000000000000000000 refcount=1}}
[junit4:junit4]   2> 13048 T1321 C117 P64269 oasc.RecoveryStrategy.replicate Attempting to replicate from http://127.0.0.1:40601/solr/collection1/. core=collection1
[junit4:junit4]   2> 13048 T1321 C117 P64269 oascsi.HttpClientUtil.createClient Creating new http client, config:maxConnections=128&maxConnectionsPerHost=32&followRedirects=false
[junit4:junit4]   2> 13062 T1290 C118 P40601 oasu.DirectUpdateHandler2.commit start commit{flags=0,_version_=0,optimize=false,openSearcher=true,waitSearcher=true,expungeDeletes=false,softCommit=false}
[junit4:junit4]   2> 13110 T1290 C118 P40601 oasc.SolrDeletionPolicy.onCommit SolrDeletionPolicy.onCommit: commits:num=2
[junit4:junit4]   2> 		commit{dir=NRTCachingDirectory(org.apache.lucene.store.NIOFSDirectory@/usr/home/hudson/hudson-slave/workspace/Lucene-Solr-Tests-trunk-Java6/solr/build/solr-core/test/J1/org.apache.solr.cloud.BasicDistributedZk2Test-1348215067072/jetty1/index lockFactory=org.apache.lucene.store.NativeFSLockFactory@5e8693f2; maxCacheMB=48.0 maxMergeSizeMB=4.0),segFN=segments_1,generation=1,filenames=[segments_1]
[junit4:junit4]   2> 		commit{dir=NRTCachingDirectory(org.apache.lucene.store.NIOFSDirectory@/usr/home/hudson/hudson-slave/workspace/Lucene-Solr-Tests-trunk-Java6/solr/build/solr-core/test/J1/org.apache.solr.cloud.BasicDistributedZk2Test-1348215067072/jetty1/index lockFactory=org.apache.lucene.store.NativeFSLockFactory@5e8693f2; maxCacheMB=48.0 maxMergeSizeMB=4.0),segFN=segments_2,generation=2,filenames=[_0.fnm, _0.frq, _0.tim, _0_nrm.cfe, segments_2, _0.fdx, _0_nrm.cfs, _0.si, _0.prx, _0.tip, _0.fdt]
[junit4:junit4]   2> 13111 T1290 C118 P40601 oasc.SolrDeletionPolicy.updateCommits newest commit = 2
[junit4:junit4]   2> 13121 T1290 C118 P40601 oass.SolrIndexSearcher.<init> Opening Searcher@697bbc44 main
[junit4:junit4]   2> 13122 T1290 C118 P40601 oasu.DirectUpdateHandler2.commit end_commit_flush
[junit4:junit4]   2> 13123 T1296 oasc.SolrCore.registerSearcher [collection1] Registered new searcher Searcher@697bbc44 main{StandardDirectoryReader(segments_2:3 _0(5.0):C1)}
[junit4:junit4]   2> 13123 T1290 C118 P40601 /update {waitSearcher=true&commit=true&commit_end_point=true&wt=javabin&softCommit=false&version=2} {commit=} 0 61
[junit4:junit4]   2> 13124 T1321 C117 P64269 oash.ReplicationHandler.inform Commits will be reserved for  10000
[junit4:junit4]   2> 13124 T1321 C117 P64269 oash.SnapPuller.<init>  No value set for 'pollInterval'. Timer Task not started.
[junit4:junit4]   2> 13126 T1291 C118 P40601 oash.ReplicationHandler.inform Commits will be reserved for  10000
[junit4:junit4]   2> 13126 T1291 C118 P40601 REQ /replication {command=indexversion&wt=javabin&qt=/replication&version=2} status=0 QTime=0 
[junit4:junit4]   2> 13127 T1321 C117 P64269 oash.SnapPuller.fetchLatestIndex Master's generation: 2
[junit4:junit4]   2> 13127 T1321 C117 P64269 oash.SnapPuller.fetchLatestIndex Slave's generation: 1
[junit4:junit4]   2> 13127 T1321 C117 P64269 oash.SnapPuller.fetchLatestIndex Starting replication process
[junit4:junit4]   2> 13130 T1291 C118 P40601 REQ /replication {command=filelist&generation=2&wt=javabin&qt=/replication&version=2} status=0 QTime=1 
[junit4:junit4]   2> 13131 T1321 C117 P64269 oash.SnapPuller.fetchLatestIndex Number of files in latest index in master: 11
[junit4:junit4]   2> 13137 T1321 C117 P64269 oash.SnapPuller.fetchLatestIndex Starting download to ./org.apache.solr.cloud.BasicDistributedZk2Test-1348215067072/jetty3/index.20120921021120199 fullCopy=true
[junit4:junit4]   2> 13140 T1291 C118 P40601 REQ /replication {file=_0.fnm&command=filecontent&checksum=true&generation=2&qt=/replication&wt=filestream} status=0 QTime=0 
[junit4:junit4]   2> 13145 T1291 C118 P40601 REQ /replication {file=_0_nrm.cfe&command=filecontent&checksum=true&generation=2&qt=/replication&wt=filestream} status=0 QTime=0 
[junit4:junit4]   2> 13149 T1291 C118 P40601 REQ /replication {file=_0.tim&command=filecontent&checksum=true&generation=2&qt=/replication&wt=filestream} status=0 QTime=0 
[junit4:junit4]   2> 13153 T1291 C118 P40601 REQ /replication {file=_0.frq&command=filecontent&checksum=true&generation=2&qt=/replication&wt=filestream} status=0 QTime=0 
[junit4:junit4]   2> 13157 T1291 C118 P40601 REQ /replication {file=segments_2&command=filecontent&checksum=true&generation=2&qt=/replication&wt=filestream} status=0 QTime=0 
[junit4:junit4]   2> 13161 T1291 C118 P40601 REQ /replication {file=_0.fdx&command=filecontent&checksum=true&generation=2&qt=/replication&wt=filestream} status=0 QTime=0 
[junit4:junit4]   2> 13165 T1291 C118 P40601 REQ /replication {file=_0_nrm.cfs&command=filecontent&checksum=true&generation=2&qt=/replication&wt=filestream} status=0 QTime=0 
[junit4:junit4]   2> 13169 T1291 C118 P40601 REQ /replication {file=_0.si&command=filecontent&checksum=true&generation=2&qt=/replication&wt=filestream} status=0 QTime=0 
[junit4:junit4]   2> 13173 T1291 C118 P40601 REQ /replication {file=_0.tip&command=filecontent&checksum=true&generation=2&qt=/replication&wt=filestream} status=0 QTime=0 
[junit4:junit4]   2> 13177 T1291 C118 P40601 REQ /replication {file=_0.prx&command=filecontent&checksum=true&generation=2&qt=/replication&wt=filestream} status=0 QTime=0 
[junit4:junit4]   2> 13181 T1291 C118 P40601 REQ /replication {file=_0.fdt&command=filecontent&checksum=true&generation=2&qt=/replication&wt=filestream} status=0 QTime=0 
[junit4:junit4]   2> 13182 T1321 C117 P64269 oash.SnapPuller.fetchLatestIndex Total time taken for download : 0 secs
[junit4:junit4]   2> 13183 T1321 C117 P64269 oash.SnapPuller.modifyIndexProps New index installed. Updating index properties... index=index.20120921021120199
[junit4:junit4]   2> 13185 T1321 C117 P64269 oasu.DefaultSolrCoreState.newIndexWriter Creating new IndexWriter...
[junit4:junit4]   2> 13185 T1321 C117 P64269 oasu.DefaultSolrCoreState.newIndexWriter Waiting until IndexWriter is unused... core=collection1
[junit4:junit4]   2> 13185 T1321 C117 P64269 oasu.DefaultSolrCoreState.newIndexWriter Rollback old IndexWriter... core=collection1
[junit4:junit4]   2> 13191 T1321 C117 P64269 oasc.SolrCore.getNewIndexDir WARNING New index directory detected: old=./org.apache.solr.cloud.BasicDistributedZk2Test-1348215067072/jetty3/index/ new=./org.apache.solr.cloud.BasicDistributedZk2Test-1348215067072/jetty3/index.20120921021120199
[junit4:junit4]   2> 13191 T1321 C117 P64269 oasc.CachingDirectoryFactory.get return new directory for /usr/home/hudson/hudson-slave/workspace/Lucene-Solr-Tests-trunk-Java6/solr/build/solr-core/test/J1/./org.apache.solr.cloud.BasicDistributedZk2Test-1348215067072/jetty3/index.20120921021120199 forceNew:true
[junit4:junit4]   2> 13197 T1321 C117 P64269 oasc.SolrDeletionPolicy.onInit SolrDeletionPolicy.onInit: commits:num=1
[junit4:junit4]   2> 		commit{dir=NRTCachingDirectory(org.apache.lucene.store.NIOFSDirectory@/usr/home/hudson/hudson-slave/workspace/Lucene-Solr-Tests-trunk-Java6/solr/build/solr-core/test/J1/org.apache.solr.cloud.BasicDistributedZk2Test-1348215067072/jetty3/index.20120921021120199 lockFactory=org.apache.lucene.store.NativeFSLockFactory@1d17b521; maxCacheMB=48.0 maxMergeSizeMB=4.0),segFN=segments_2,generation=2,filenames=[_0.fnm, _0_nrm.cfe, _0.tim, _0.frq, segments_2, _0.fdx, _0_nrm.cfs, _0.si, _0.tip, _0.prx, _0.fdt]
[junit4:junit4]   2> 13198 T1321 C117 P64269 oasc.SolrDeletionPolicy.updateCommits newest commit = 2
[junit4:junit4]   2> 13198 T1321 C117 P64269 oasu.DefaultSolrCoreState.newIndexWriter New IndexWriter is ready to be used.
[junit4:junit4]   2> 13200 T1321 C117 P64269 oass.SolrIndexSearcher.<init> Opening Searcher@7a0e27c6 main
[junit4:junit4]   2> 13202 T1320 oasc.SolrCore.registerSearcher [collection1] Registered new searcher Searcher@7a0e27c6 main{StandardDirectoryReader(segments_2:3:nrt _0(5.0):C1)}
[junit4:junit4]   2> 13202 T1320 oasc.CachingDirectoryFactory.close Closing directory:/usr/home/hudson/hudson-slave/workspace/Lucene-Solr-Tests-trunk-Java6/solr/build/solr-core/test/J1/./org.apache.solr.cloud.BasicDistributedZk2Test-1348215067072/jetty3/index
[junit4:junit4]   2> 13203 T1320 oash.SnapPuller$2.onClose removing old index directory ./org.apache.solr.cloud.BasicDistributedZk2Test-1348215067072/jetty3/index
[junit4:junit4]   2> 13205 T1321 C117 P64269 oasu.DirectUpdateHandler2.commit start commit{flags=0,_version_=0,optimize=false,openSearcher=false,waitSearcher=false,expungeDeletes=false,softCommit=false}
[junit4:junit4]   2> 13206 T1321 C117 P64269 oasu.DirectUpdateHandler2.commit end_commit_flush
[junit4:junit4]   2> 13206 T1321 C117 P64269 oasc.RecoveryStrategy.replay Replaying buffered documents. core=collection1
[junit4:junit4]   2> 13206 T1344 C117 P64269 oasu.UpdateLog$LogReplayer.doReplay WARNING Starting log replay tlog{file=./org.apache.solr.cloud.BasicDistributedZk2Test-1348215067072/jetty3/tlog/tlog.0000000000000000000 refcount=2} active=true starting pos=431
[junit4:junit4]   2> 13206 T1344 C117 P64269 oasu.DirectUpdateHandler2.commit start commit{flags=2,_version_=0,optimize=false,openSearcher=true,waitSearcher=true,expungeDeletes=false,softCommit=false}
[junit4:junit4]   2> 13208 T1344 C117 P64269 oass.SolrIndexSearcher.<init> Opening Searcher@46b5608 main
[junit4:junit4]   2> 13210 T1320 oasc.SolrCore.registerSearcher [collection1] Registered new searcher Searcher@46b5608 main{StandardDirectoryReader(segments_2:3:nrt _0(5.0):C1)}
[junit4:junit4]   2> 13210 T1344 C117 P64269 oasu.DirectUpdateHandler2.commit end_commit_flush
[junit4:junit4]   2> 13210 T1344 C117 P64269 oasu.UpdateLog$LogReplayer.run WARNING Log replay finished. recoveryInfo=RecoveryInfo{adds=0 deletes=0 deleteByQuery=0 errors=0 positionOfStart=431}
[junit4:junit4]   2> 13211 T1321 C117 P64269 oasc.RecoveryStrategy.doRecovery Replication Recovery was successful - registering as Active. core=collection1
[junit4:junit4]   2> 13213 T1321 C117 P64269 oasc.RecoveryStrategy.doRecovery Finished recovery process. core=collection1
[junit4:junit4]   2> 13631 T1282 oascc.ZkStateReader.updateClusterState Updating cloud state from ZooKeeper... 
[junit4:junit4]   2> 13645 T1281 oascc.ZkStateReader$2.process A cluster state change has occurred - updating...
[junit4:junit4]   2> 13645 T1319 oascc.ZkStateReader$2.process A cluster state change has occurred - updating...
[junit4:junit4]   2> 13645 T1307 oascc.ZkStateReader$2.process A cluster state change has occurred - updating...
[junit4:junit4]   2> 13645 T1295 oascc.ZkStateReader$2.process A cluster state change has occurred - updating...
[junit4:junit4]   2> 13645 T1333 oascc.ZkStateReader$2.process A cluster state change has occurred - updating...
[junit4:junit4]   2> 13645 T1338 oascc.ZkStateReader$2.process A cluster state change has occurred - updating...
[junit4:junit4]   2> 13645 T1340 oascc.ZkStateReader$2.process A cluster state change has occurred - updating...
[junit4:junit4]   2> 13891 T1261 oascc.ZkStateReader.updateClusterState Updating cloud state from ZooKeeper... 
[junit4:junit4]   2>  C119_STATE=coll:collection1 core:collection1 props:{shard=shard2, roles=null, state=recovering, core=collection1, collection=collection1, node_name=127.0.0.1:24981_solr, base_url=http://127.0.0.1:24981/solr}
[junit4:junit4]   2> 14814 T1335 C119 P24981 oasc.RecoveryStrategy.doRecovery Begin buffering updates. core=collection1
[junit4:junit4]   2> 14814 T1335 C119 P24981 oasu.UpdateLog.bufferUpdates Starting to buffer updates. FSUpdateLog{state=ACTIVE, tlog=null}
[junit4:junit4]   2> 14814 T1335 C119 P24981 oasc.RecoveryStrategy.replicate Attempting to replicate from http://127.0.0.1:41761/solr/collection1/. core=collection1
[junit4:junit4]   2> 14814 T1335 C119 P24981 oascsi.HttpClientUtil.createClient Creating new http client, config:maxConnections=128&maxConnectionsPerHost=32&followRedirects=false
[junit4:junit4]   2> 14829 T1302 C120 P41761 oasu.DirectUpdateHandler2.commit start commit{flags=0,_version_=0,optimize=false,openSearcher=true,waitSearcher=true,expungeDeletes=false,softCommit=false}
[junit4:junit4]   2> 14834 T1302 C120 P41761 oasc.SolrDeletionPolicy.onInit SolrDeletionPolicy.onInit: commits:num=1
[junit4:junit4]   2> 		commit{dir=NRTCachingDirectory(org.apache.lucene.store.NIOFSDirectory@/usr/home/hudson/hudson-slave/workspace/Lucene-Solr-Tests-trunk-Java6/solr/build/solr-core/test/J1/org.apache.solr.cloud.BasicDistributedZk2Test-1348215067072/jetty2/index lockFactory=org.apache.lucene.store.NativeFSLockFactory@2eddacdc; maxCacheMB=48.0 maxMergeSizeMB=4.0),segFN=segments_1,generation=1,filenames=[segments_1]
[junit4:junit4]   2> 14834 T1302 C120 P41761 oasc.SolrDeletionPolicy.updateCommits newest commit = 1
[junit4:junit4]   2> 14836 T1302 C120 P41761 oass.SolrIndexSearcher.<init> Opening Searcher@50adaa1d main
[junit4:junit4]   2> 14836 T1302 C120 P41761 oasu.DirectUpdateHandler2.commit end_commit_flush
[junit4:junit4]   2> 14837 T1308 oasc.SolrCore.registerSearcher [collection1] Registered new searcher Searcher@50adaa1d main{StandardDirectoryReader(segments_1:1)}
[junit4:junit4]   2> 14838 T1302 C120 P41761 /update {waitSearcher=true&commit=true&commit_end_point=true&wt=javabin&softCommit=false&version=2} {commit=} 0 9
[junit4:junit4]   2> 14839 T1335 C119 P24981 oash.ReplicationHandler.inform Commits will be reserved for  10000
[junit4:junit4]   2> 14839 T1335 C119 P24981 oash.SnapPuller.<init>  No value set for 'pollInterval'. Timer Task not started.
[junit4:junit4]   2> 14840 T1303 C120 P41761 oash.ReplicationHandler.inform Commits will be reserved for  10000
[junit4:junit4]   2> 14841 T1303 C120 P41761 REQ /replication {command=indexversion&wt=javabin&qt=/replication&version=2} status=0 QTime=1 
[junit4:junit4]   2> 14845 T1335 C119 P24981 oasc.SolrDeletionPolicy.onInit SolrDeletionPolicy.onInit: commits:num=1
[junit4:junit4]   2> 		commit{dir=NRTCachingDirectory(org.apache.lucene.store.NIOFSDirectory@/usr/home/hudson/hudson-slave/workspace/Lucene-Solr-Tests-trunk-Java6/solr/build/solr-core/test/J1/org.apache.solr.cloud.BasicDistributedZk2Test-1348215067072/jetty4/index lockFactory=org.apache.lucene.store.NativeFSLockFactory@7eefba6d; maxCacheMB=48.0 maxMergeSizeMB=4.0),segFN=segments_1,generation=1,filenames=[segments_1]
[junit4:junit4]   2> 14845 T1335 C119 P24981 oasc.SolrDeletionPolicy.updateCommits newest commit = 1
[junit4:junit4]   2> 14846 T1335 C119 P24981 oasu.DirectUpdateHandler2.commit start commit{flags=0,_version_=0,optimize=false,openSearcher=true,waitSearcher=true,expungeDeletes=false,softCommit=false}
[junit4:junit4]   2> 14863 T1335 C119 P24981 oasc.SolrDeletionPolicy.onCommit SolrDeletionPolicy.onCommit: commits:num=2
[junit4:junit4]   2> 		commit{dir=NRTCachingDirectory(org.apache.lucene.store.NIOFSDirectory@/usr/home/hudson/hudson-slave/workspace/Lucene-Solr-Tests-trunk-Java6/solr/build/solr-core/test/J1/org.apache.solr.cloud.BasicDistributedZk2Test-1348215067072/jetty4/index lockFactory=org.apache.lucene.store.NativeFSLockFactory@7eefba6d; maxCacheMB=48.0 maxMergeSizeMB=4.0),segFN=segments_1,generation=1,filenames=[segments_1]
[junit4:junit4]   2> 		commit{dir=NRTCachingDirectory(org.apache.lucene.store.NIOFSDirectory@/usr/home/hudson/hudson-slave/workspace/Lucene-Solr-Tests-trunk-Java6/solr/build/solr-core/test/J1/org.apache.solr.cloud.BasicDistributedZk2Test-1348215067072/jetty4/index lockFactory=org.apache.lucene.store.NativeFSLockFactory@7eefba6d; maxCacheMB=48.0 maxMergeSizeMB=4.0),segFN=segments_2,generation=2,filenames=[segments_2]
[junit4:junit4]   2> 14863 T1335 C119 P24981 oasc.SolrDeletionPolicy.updateCommits newest commit = 2
[junit4:junit4]   2> 14866 T1335 C119 P24981 oass.SolrIndexSearcher.<init> Opening Searcher@24e1e7e8 main
[junit4:junit4]   2> 14867 T1335 C119 P24981 oasu.DirectUpdateHandler2.commit end_commit_flush
[junit4:junit4]   2> 14868 T1334 oasc.SolrCore.registerSearcher [collection1] Registered new searcher Searcher@24e1e7e8 main{StandardDirectoryReader(segments_2:2)}
[junit4:junit4]   2> 14869 T1335 C119 P24981 oasc.RecoveryStrategy.replay No replay needed. core=collection1
[junit4:junit4]   2> 14869 T1335 C119 P24981 oasc.RecoveryStrategy.doRecovery Replication Recovery was successful - registering as Active. core=collection1
[junit4:junit4]   2> 14871 T1335 C119 P24981 oasc.RecoveryStrategy.doRecovery Finished recovery process. core=collection1
[junit4:junit4]   2> 14894 T1261 oascc.ZkStateReader.updateClusterState Updating cloud state from ZooKeeper... 
[junit4:junit4]   2> 15154 T1282 oascc.ZkStateReader.updateClusterState Updating cloud state from ZooKeeper... 
[junit4:junit4]   2> 15167 T1281 oascc.ZkStateReader$2.process A cluster state change has occurred - updating...
[junit4:junit4]   2> 15167 T1340 oascc.ZkStateReader$2.process A cluster state change has occurred - updating...
[junit4:junit4]   2> 15167 T1307 oascc.ZkStateReader$2.process A cluster state change has occurred - updating...
[junit4:junit4]   2> 15168 T1333 oascc.ZkStateReader$2.process A cluster state change has occurred - updating...
[junit4:junit4]   2> 15168 T1295 oascc.ZkStateReader$2.process A cluster state change has occurred - updating...
[junit4:junit4]   2> 15167 T1338 oascc.ZkStateReader$2.process A cluster state change has occurred - updating...
[junit4:junit4]   2> 15167 T1319 oascc.ZkStateReader$2.process A cluster state change has occurred - updating...
[junit4:junit4]   2> 15897 T1261 oascc.ZkStateReader.updateClusterState Updating cloud state from ZooKeeper... 
[junit4:junit4]   2> 15901 T1273 C121 P29988 oasu.DirectUpdateHandler2.commit start commit{flags=0,_version_=0,optimize=false,openSearcher=true,waitSearcher=true,expungeDeletes=false,softCommit=false}
[junit4:junit4]   2> 15978 T1273 C121 P29988 oasc.SolrDeletionPolicy.onCommit SolrDeletionPolicy.onCommit: commits:num=2
[junit4:junit4]   2> 		commit{dir=NRTCachingDirectory(org.apache.lucene.store.NIOFSDirectory@/usr/home/hudson/hudson-slave/workspace/Lucene-Solr-Tests-trunk-Java6/solr/build/solr-core/test/J1/org.apache.solr.cloud.BasicDistributedZk2Test-1348215067072/control/data/index lockFactory=org.apache.lucene.store.NativeFSLockFactory@5273db92; maxCacheMB=48.0 maxMergeSizeMB=4.0),segFN=segments_1,generation=1,filenames=[segments_1]
[junit4:junit4]   2> 		commit{dir=NRTCachingDirectory(org.apache.lucene.store.NIOFSDirectory@/usr/home/hudson/hudson-slave/workspace/Lucene-Solr-Tests-trunk-Java6/solr/build/solr-core/test/J1/org.apache.solr.cloud.BasicDistributedZk2Test-1348215067072/control/data/index lockFactory=org.apache.lucene.store.NativeFSLockFactory@5273db92; maxCacheMB=48.0 maxMergeSizeMB=4.0),segFN=segments_2,generation=2,filenames=[_0.fnm, _0.frq, _0.tim, _0_nrm.cfe, segments_2, _0.fdx, _0_nrm.cfs, _0.si, _0.prx, _0.tip, _0.fdt]
[junit4:junit4]   2> 15979 T1273 C121 P29988 oasc.SolrDeletionPolicy.updateCommits newest commit = 2
[junit4:junit4]   2> 15996 T1273 C121 P29988 oass.SolrIndexSearcher.<init> Opening Searcher@6b5638a main
[junit4:junit4]   2> 15997 T1273 C121 P29988 oasu.DirectUpdateHandler2.commit end_commit_flush
[junit4:junit4]   2> 15998 T1284 oasc.SolrCore.registerSearcher [collection1] Registered new searcher Searcher@6b5638a main{StandardDirectoryReader(segments_2:3 _0(5.0):C1)}
[junit4:junit4]   2> 15999 T1273 C121 P29988 /update {waitSearcher=true&wt=javabin&commit=true&softCommit=false&version=2} {commit=} 0 98
[junit4:junit4]   2> 16001 T1292 C118 P40601 oasu.DirectUpdateHandler2.commit start commit{flags=0,_version_=0,optimize=false,openSearcher=true,waitSearcher=true,expungeDeletes=false,softCommit=false}
[junit4:junit4]   2> 16009 T1292 C118 P40601 oass.SolrIndexSearcher.<init> Opening Searcher@6b4c00d3 main
[junit4:junit4]   2> 16010 T1292 C118 P40601 oasu.DirectUpdateHandler2.commit end_commit_flush
[junit4:junit4]   2> 16012 T1296 oasc.SolrCore.registerSearcher [collection1] Registered new searcher Searcher@6b4c00d3 main{StandardDirectoryReader(segments_2:3 _0(5.0):C1)}
[junit4:junit4]   2> 16013 T1292 C118 P40601 oasu.SolrCmdDistributor.distribCommit Distrib commit to:[StdNode: http://127.0.0.1:64269/solr/collection1/, StdNode: http://127.0.0.1:41761/solr/collection1/, StdNode: http://127.0.0.1:24981/solr/collection1/]
[junit4:junit4]   2> 16015 T1304 C120 P41761 oasu.DirectUpdateHandler2.commit start commit{flags=0,_version_=0,optimize=false,openSearcher=true,waitSearcher=true,expungeDeletes=false,softCommit=false}
[junit4:junit4]   2>  C117_STATE=coll:collection1 core:collection1 props:{shard=shard1, roles=null, state=active, core=collection1, collection=collection1, node_name=127.0.0.1:64269_solr, base_url=http://127.0.0.1:64269/solr}
[junit4:junit4]   2> 16015 T1311 C117 P64269 oasu.DirectUpdateHandler2.commit start commit{flags=0,_version_=0,optimize=false,openSearcher=true,waitSearcher=true,expungeDeletes=false,softCommit=false}
[junit4:junit4]   2> 16019 T1311 C117 P64269 oass.SolrIndexSearcher.<init> Opening Searcher@727721e6 main
[junit4:junit4]   2> 16020 T1311 C117 P64269 oasu.DirectUpdateHandler2.commit end_commit_flush
[junit4:junit4]   2> 16021 T1304 C120 P41761 oass.SolrIndexSearcher.<init> Opening Searcher@5277da5 main
[junit4:junit4]   2> 16021 T1320 oasc.SolrCore.registerSearcher [collection1] Registered new searcher Searcher@727721e6 main{StandardDirectoryReader(segments_2:3:nrt _0(5.0):C1)}
[junit4:junit4]   2> 16021 T1304 C120 P41761 oasu.DirectUpdateHandler2.commit end_commit_flush
[junit4:junit4]   2> 16022 T1311 C117 P64269 /update {waitSearcher=true&commit=true&wt=javabin&commit_end_point=true&expungeDeletes=false&softCommit=false&version=2} {commit=} 0 7
[junit4:junit4]   2> 16023 T1308 oasc.SolrCore.registerSearcher [collection1] Registered new searcher Searcher@5277da5 main{StandardDirectoryReader(segments_1:1)}
[junit4:junit4]   2> 16023 T1304 C120 P41761 /update {waitSearcher=true&commit=true&wt=javabin&commit_end_point=true&expungeDeletes=false&softCommit=false&version=2} {commit=} 0 8
[junit4:junit4]   2>  C119_STATE=coll:collection1 core:collection1 props:{shard=shard2, roles=null, state=active, core=collection1, collection=collection1, node_name=127.0.0.1:24981_solr, base_url=http://127.0.0.1:24981/solr}
[junit4:junit4]   2> 16026 T1325 C119 P24981 oasu.DirectUpdateHandler2.commit start commit{flags=0,_version_=0,optimize=false,openSearcher=true,waitSearcher=true,expungeDeletes=false,softCommit=false}
[junit4:junit4]   2> 16030 T1325 C119 P24981 oass.SolrIndexSearcher.<init> Opening Searcher@56b2382e main
[junit4:junit4]   2> 16031 T1325 C119 P24981 oasu.DirectUpdateHandler2.commit end_commit_flush
[junit4:junit4]   2> 16032 T1334 oasc.SolrCore.registerSearcher [collection1] Registered new searcher Searcher@56b2382e main{StandardDirectoryReader(segments_2:2)}
[junit4:junit4]   2> 16032 T1325 C119 P24981 /update {waitSearcher=true&commit=true&wt=javabin&commit_end_point=true&expungeDeletes=false&softCommit=false&version=2} {commit=} 0 6
[junit4:junit4]   2> 16033 T1292 C118 P40601 /update {waitSearcher=true&wt=javabin&commit=true&softCommit=false&version=2} {commit=} 0 32
[junit4:junit4]   2> 16040 T1274 C121 P29988 REQ /select {fl=id,score&shard.url=127.0.0.1:29988/solr/collection1/&NOW=1348215083104&start=0&q=*:*&distrib=false&isShard=true&wt=javabin&fsv=true&rows=10&version=2} hits=1 status=0 QTime=0 
[junit4:junit4]   2> 16043 T1274 C121 P29988 REQ /select {shard.url=127.0.0.1:29988/solr/collection1/&NOW=1348215083104&q=*:*&ids=1&distrib=false&isShard=true&wt=javabin&version=2} status=0 QTime=0 
[junit4:junit4]   2> 16044 T1273 C121 P29988 REQ /select {wt=javabin&q=*:*&version=2} hits=1 status=0 QTime=8 
[junit4:junit4]   2> 16045 T1261 oaz.ZooKeeper.<init> Initiating client connection, connectString=127.0.0.1:31585/solr sessionTimeout=10000 watcher=org.apache.solr.common.cloud.ConnectionManager@cfc6553
[junit4:junit4]   2> 16046 T1348 oaz.ClientCnxn$SendThread.startConnect Opening socket connection to server /127.0.0.1:31585
[junit4:junit4]   2> 16046 T1261 oascc.ConnectionManager.waitForConnected Waiting for client to connect to ZooKeeper
[junit4:junit4]   2> 16047 T1348 oaz.ClientCnxn$SendThread.primeConnection Socket connection established to localhost/127.0.0.1:31585, initiating session
[junit4:junit4]   2> 16047 T1263 oazs.NIOServerCnxn$Factory.run Accepted socket connection from /140.211.11.196:64775
[junit4:junit4]   2> 16047 T1263 oazs.NIOServerCnxn.readConnectRequest Client attempting to establish new session at /140.211.11.196:64775
[junit4:junit4]   2> 16049 T1265 oazs.NIOServerCnxn.finishSessionInit Established session 0x139e7e151c60009 with negotiated timeout 10000 for client /140.211.11.196:64775
[junit4:junit4]   2> 16049 T1348 oaz.ClientCnxn$SendThread.readConnectResult Session establishment complete on server localhost/127.0.0.1:31585, sessionid = 0x139e7e151c60009, negotiated timeout = 10000
[junit4:junit4]   2> 16049 T1349 oascc.ConnectionManager.process Watcher org.apache.solr.common.cloud.ConnectionManager@cfc6553 name:ZooKeeperConnection Watcher:127.0.0.1:31585/solr got event WatchedEvent state:SyncConnected type:None path:null path:null type:None
[junit4:junit4]   2> 16049 T1261 oascc.ConnectionManager.waitForConnected Client is connected to ZooKeeper
[junit4:junit4]   2> 16050 T1261 oascc.ZkStateReader.createClusterStateWatchersAndUpdate Updating cluster state from ZooKeeper... 
[junit4:junit4]   2> 16052 T1266 oazs.PrepRequestProcessor.pRequest Processed session termination for sessionid: 0x139e7e151c60009
[junit4:junit4]   2> 16053 T1349 oaz.ClientCnxn$EventThread.run EventThread shut down
[junit4:junit4]   2> 16053 T1261 oaz.ZooKeeper.close Session: 0x139e7e151c60009 closed
[junit4:junit4]   2> 16053 T1263 oazs.NIOServerCnxn.closeSock Closed socket connection for client /140.211.11.196:64775 which had sessionid 0x139e7e151c60009
[junit4:junit4]   2> 16055 T1293 C118 P40601 REQ /select {distrib=false&wt=javabin&q=*:*&version=2} hits=1 status=0 QTime=0 
[junit4:junit4]   2> 16058 T1305 C120 P41761 REQ /select {distrib=false&wt=javabin&q=*:*&version=2} hits=0 status=0 QTime=0 
[junit4:junit4]   2> 16062 T1312 C117 P64269 REQ /select {fl=id,score&shard.url=127.0.0.1:40601/solr/collection1/|127.0.0.1:64269/solr/collection1/&NOW=1348215083127&start=0&q=*:*&distrib=false&isShard=true&wt=javabin&fsv=true&rows=10&version=2} hits=1 status=0 QTime=0 
[junit4:junit4]   2> 16062 T1300 C120 P41761 REQ /select {fl=id,score&shard.url=127.0.0.1:41761/solr/collection1/|127.0.0.1:24981/solr/collection1/&NOW=1348215083127&start=0&q=*:*&distrib=false&isShard=true&wt=javabin&fsv=true&rows=10&version=2} hits=0 status=0 QTime=0 
[junit4:junit4]   2> 16066 T1312 C117 P64269 REQ /select {shard.url=127.0.0.1:40601/solr/collection1/|127.0.0.1:64269/solr/collection1/&NOW=1348215083127&q=*:*&ids=1&distrib=false&isShard=true&wt=javabin&version=2} status=0 QTime=0 
[junit4:junit4]   2> 16067 T1326 C119 P24981 REQ /select {wt=javabin&q=*:*&version=2} hits=1 status=0 QTime=8 
[junit4:junit4]   2> 16073 T1273 C121 P29988 /update {wt=javabin&version=2} {add=[2 (1413705979016511488)]} 0 3
[junit4:junit4]   2> 16089 T1325 C119 P24981 REQ /update {distrib.from=http://127.0.0.1:41761/solr/collection1/&update.distrib=FROMLEADER&wt=javabin&version=2} status=0 QTime=3 
[junit4:junit4]   2> 16090 T1301 C120 P41761 /update {wt=javabin&version=2} {add=[2 (1413705979026997248)]} 0 10
[junit4:junit4]   2> 16094 T1273 C121 P29988 /update {wt=javabin&version=2} {add=[3 (1413705979040628736)]} 0 1
[junit4:junit4]   2> 16101 T1325 C119 P24981 REQ /update {distrib.from=http://127.0.0.1:41761/solr/collection1/&update.distrib=FROMLEADER&wt=javabin&version=2} status=0 QTime=1 
[junit4:junit4]   2> 16102 T1301 C120 P41761 /update {wt=javabin&version=2} {add=[3 (1413705979044823040)]} 0 5
[junit4:junit4]   2> 16105 T1273 C121 P29988 /update {wt=javabin&version=2} {add=[4 (1413705979052163072)]} 0 1
[junit4:junit4]   2> 16114 T1311 C117 P64269 REQ /update {distrib.from=http://127.0.0.1:40601/solr/collection1/&update.distrib=FROMLEADER&wt=javabin&version=2} status=0 QTime=2 
[junit4:junit4]   2> 16115 T1292 C118 P40601 /update {wt=javabin&version=2} {add=[4 (1413705979055308800)]} 0 8
[junit4:junit4]   2> 16118 T1273 C121 P29988 /update {wt=javabin&version=2} {add=[5 (1413705979065794560)]} 0 1
[junit4:junit4]   2> 16126 T1325 C119 P24981 REQ /update {update.distrib=FROMLEADER&distrib.from=http://127.0.0.1:41761/solr/collection1/&wt=javabin&version=2} status=0 QTime=1 
[junit4:junit4]   2> 16126 T1304 C120 P41761 REQ /update {distrib.from=http://127.0.0.1:40601/solr/collection1/&update.distrib=TOLEADER&wt=javabin&version=2} status=0 QTime=4 
[junit4:junit4]   2> 16127 T1292 C118 P40601 /update {wt=javabin&version=2} {add=[5]} 0 7
[junit4:junit4]   2> 16130 T1273 C121 P29988 /update {wt=javabin&version=2} {add=[6 (1413705979078377472)]} 0 1
[junit4:junit4]   2> 16138 T1325 C119 P24981 REQ /update {update.distrib=FROMLEADER&distrib.from=http://127.0.0.1:41761/solr/collection1/&wt=javabin&version=2} status=0 QTime=1 
[junit4:junit4]   2> 16138 T1304 C120 P41761 REQ /update {distrib.from=http://127.0.0.1:40601/solr/collection1/&update.distrib=TOLEADER&wt=javabin&version=2} status=0 QTime=4 
[junit4:junit4]   2> 16138 T1292 C118 P40601 /update {wt=javabin&version=2} {add=[6]} 0 6
[junit4:junit4]   2> 16142 T1273 C121 P29988 /update {wt=javabin&version=2} {add=[7 (1413705979090960384)]} 0 1
[junit4:junit4]   2> 16150 T1325 C119 P24981 REQ /update {update.distrib=FROMLEADER&distrib.from=http://127.0.0.1:41761/solr/collection1/&wt=javabin&version=2} status=0 QTime=1 
[junit4:junit4]   2> 16150 T1304 C120 P41761 REQ /update {distrib.from=http://127.0.0.1:40601/solr/collection1/&update.distrib=TOLEADER&wt=javabin&version=2} status=0 QTime=4 
[junit4:junit4]   2> 16151 T1292 C118 P40601 /update {wt=javabin&version=2} {add=[7]} 0 7
[junit4:junit4]   2> 16154 T1273 C121 P29988 /update {wt=javabin&version=2} {add=[8 (1413705979103543296)]} 0 1
[junit4:junit4]   2> 16162 T1311 C117 P64269 REQ /update {update.distrib=FROMLEADER&distrib.from=http://127.0.0.1:40601/solr/collection1/&wt=javabin&version=2} status=0 QTime=1 
[junit4:junit4]   2> 16162 T1289 C118 P40601 REQ /update {distrib.from=http://127.0.0.1:41761/solr/collection1/&update.distrib=TOLEADER&wt=javabin&version=2} status=0 QTime=4 
[junit4:junit4]   2> 16163 T1301 C120 P41761 /update {wt=javabin&version=2} {add=[8]} 0 7
[junit4:junit4]   2> 16166 T1273 C121 P29988 /update {wt=javabin&version=2} {add=[9 (1413705979116126208)]} 0 1
[junit4:junit4]   2> 16174 T1325 C119 P24981 REQ /update {update.distrib=FROMLEADER&distrib.from=http://127.0.0.1:41761/solr/collection1/&wt=javabin&version=2} status=0 QTime=1 
[junit4:junit4]   2> 16174 T1304 C120 P41761 REQ /update {distrib.from=http://127.0.0.1:40601/solr/collection1/&update.distrib=TOLEADER&wt=javabin&version=2} status=0 QTime=4 
[junit4:junit4]   2> 16175 T1292 C118 P40601 /update {wt=javabin&version=2} {add=[9]} 0 7
[junit4:junit4]   2> 16178 T1273 C121 P29988 /update {wt=javabin&version=2} {add=[10 (1413705979128709120)]} 0 1
[junit4:junit4]   2> 16184 T1311 C117 P64269 REQ /update {distrib.from=http://127.0.0.1:40601/solr/collection1/&update.distrib=FROMLEADER&wt=javabin&version=2} status=0 QTime=1 
[junit4:junit4]   2> 16184 T1292 C118 P40601 /update {wt=javabin&version=2} {add=[10 (1413705979131854848)]} 0 4
[junit4:junit4]   2> 16192 T1273 C121 P29988 /update {wt=javabin&version=2} {add=[11 (1413705979139194880)]} 0 5
[junit4:junit4]   2> 16200 T1311 C117 P64269 REQ /update {update.distrib=FROMLEADER&distrib.from=http://127.0.0.1:40601/solr/collection1/&wt=javabin&version=2} status=0 QTime=1 
[junit4:junit4]   2> 16200 T1289 C118 P40601 REQ /update {distrib.from=http://127.0.0.1:41761/solr/collection1/&update.distrib=TOLEADER&wt=javabin&version=2} status=0 QTime=4 
[junit4:junit4]   2> 16201 T1301 C120 P41761 /update {wt=javabin&version=2} {add=[11]} 0 7
[junit4:junit4]   2> 16205 T1273 C121 P29988 /update {wt=javabin&version=2} {add=[12 (1413705979155972096)]} 0 2
[junit4:junit4]   2> 16210 T1311 C117 P64269 REQ /update {distrib.from=http://127.0.0.1:40601/solr/collection1/&update.distrib=FROMLEADER&wt=javabin&version=2} status=0 QTime=0 
[junit4:junit4]   2> 16210 T1292 C118 P40601 /update {wt=javabin&version=2} {add=[12 (1413705979160166400)]} 0 3
[junit4:junit4]   2> 16213 T1273 C121 P29988 /update {wt=javabin&version=2} {add=[13 (1413705979165409280)]} 0 1
[junit4:junit4]   2> 16220 T1311 C117 P64269 REQ /update {update.distrib=FROMLEADER&distrib.from=http://127.0.0.1:40601/solr/collection1/&wt=javabin&version=2} status=0 QTime=1 
[junit4:junit4]   2> 16220 T1289 C118 P40601 REQ /update {distrib.from=http://127.0.0.1:41761/solr/collection1/&update.distrib=TOLEADER&wt=javabin&version=2} status=0 QTime=3 
[junit4:junit4]   2> 16220 T1301 C120 P41761 /update {wt=javabin&version=2} {add=[13]} 0 5
[junit4:junit4]   2> 16223 T1273 C121 P29988 /update {wt=javabin&version=2} {add=[14 (1413705979176943616)]} 0 0
[junit4:junit4]   2> 16239 T1311 C117 P64269 REQ /update {update.distrib=FROMLEADER&distrib.from=http://127.0.0.1:40601/solr/collection1/&wt=javabin&version=2} status=0 QTime=1 
[junit4:junit4]   2> 16239 T1289 C118 P40601 REQ /update {distrib.from=http://127.0.0.1:41761/solr/collection1/&update.distrib=TOLEADER&wt=javabin&version=2} status=0 QTime=11 
[junit4:junit4]   2> 16240 T1301 C120 P41761 /update {wt=javabin&version=2} {add=[14]} 0 14
[junit4:junit4]   2> 16242 T1273 C121 P29988 /update {wt=javabin&version=2} {add=[15 (1413705979196866560)]} 0 0
[junit4:junit4]   2> 16249 T1311 C117 P64269 REQ /update {update.distrib=FROMLEADER&distrib.from=http://127.0.0.1:40601/solr/collection1/&wt=javabin&version=2} status=0 QTime=0 
[junit4:junit4]   2> 16250 T1289 C118 P40601 REQ /update {distrib.from=http://127.0.0.1:41761/solr/collection1/&update.distrib=TOLEADER&wt=javabin&version=2} status=0 QTime=3 
[junit4:junit4]   2> 16250 T1301 C120 P41761 /update {wt=javabin&version=2} {add=[15]} 0 5
[junit4:junit4]   2> 16252 T1273 C121 P29988 /update {wt=javabin&version=2} {add=[16 (1413705979207352320)]} 0 0
[junit4:junit4]   2> 16257 T1311 C117 P64269 REQ /update {distrib.from=http://127.0.0.1:40601/solr/collection1/&update.distrib=FROMLEADER&wt=javabin&version=2} status=0 QTime=0 
[junit4:junit4]   2> 16258 T1292 C118 P40601 /update {wt=javabin&version=2} {add=[16 (1413705979210498048)]} 0 3
[junit4:junit4]   2> 16261 T1273 C121 P29988 /update {wt=javabin&version=2} {add=[17 (1413705979215740928)]} 0 1
[junit4:junit4]   2> 16272 T1325 C119 P24981 REQ /update {update.distrib=FROMLEADER&distrib.from=http://127.0.0.1:41761/solr/collection1/&wt=javabin&version=2} status=0 QTime=1 
[junit4:junit4]   2> 16273 T1304 C120 P41761 REQ /update {distrib.from=http://127.0.0.1:40601/solr/collection1/&update.distrib=TOLEADER&wt=javabin&version=2} status=0 QTime=7 
[junit4:junit4]   2> 16274 T1292 C118 P40601 /update {wt=javabin&version=2} {add=[17]} 0 10
[junit4:junit4]   2> 16277 T1273 C121 P29988 /update {wt=javabin&version=2} {add=[100 (1413705979232518144)]} 0 1
[junit4:junit4]   2> 16295 T1311 C117 P64269 REQ /update {distrib.from=http://127.0.0.1:40601/solr/collection1/&update.distrib=FROMLEADER&wt=javabin&version=2} status=0 QTime=5 
[junit4:junit4]   2> 16296 T1292 C118 P40601 /update {wt=javabin&version=2} {add=[100 (1413705979236712448)]} 0 16
[junit4:junit4]   2> 16299 T1273 C121 P29988 /update {wt=javabin&version=2} {add=[101 (1413705979255586816)]} 0 1
[junit4:junit4]   2> 16306 T1311 C117 P64269 REQ /update {distrib.from=http://127.0.0.1:40601/solr/collection1/&update.distrib=FROMLEADER&wt=javabin&version=2} status=0 QTime=1 
[junit4:junit4]   2> 16307 T1292 C118 P40601 /update {wt=javabin&version=2} {add=[101 (1413705979258732544)]} 0 6
[junit4:junit4]   2> 16309 T1273 C121 P29988 /update {wt=javabin&version=2} {add=[102 (1413705979267121152)]} 0 0
[junit4:junit4]   2> 16318 T1311 C117 P64269 REQ /update {update.distrib=FROMLEADER&distrib.from=http://127.0.0.1:40601/solr/collection1/&wt=javabin&version=2} status=0 QTime=1 
[junit4:junit4]   2> 16318 T1289 C118 P40601 REQ /update {distrib.from=http://127.0.0.1:41761/solr/collection1/&update.distrib=TOLEADER&wt=javabin&version=2} status=0 QTime=4 
[junit4:junit4]   2> 16319 T1301 C120 P41761 /update {wt=javabin&version=2} {add=[102]} 0 7
[junit4:junit4]   2> 16325 T1273 C121 P29988 /update {wt=javabin&version=2} {add=[103 (1413705979279704064)]} 0 4
[junit4:junit4]   2> 16333 T1325 C119 P24981 REQ /update {update.distrib=FROMLEADER&distrib.from=http://127.0.0.1:41761/solr/collection1/&wt=javabin&version=2} status=0 QTime=0 
[junit4:junit4]   2> 16334 T1304 C120 P41761 REQ /update {distrib.from=http://127.0.0.1:40601/solr/collection1/&update.distrib=TOLEADER&wt=javabin&version=2} status=0 QTime=4 
[junit4:junit4]   2> 16334 T1292 C118 P40601 /update {wt=javabin&version=2} {add=[103]} 0 6
[junit4:junit4]   2> 16338 T1273 C121 P29988 /update {wt=javabin&version=2} {add=[104 (1413705979296481280)]} 0 1
[junit4:junit4]   2> 16346 T1325 C119 P24981 REQ /update {update.distrib=FROMLEADER&distrib.from=http://127.0.0.1:41761/solr/collection1/&wt=javabin&version=2} status=0 QTime=0 
[junit4:junit4]   2> 16347 T1304 C120 P41761 REQ /update {distrib.from=http://127.0.0.1:40601/solr/collection1/&update.distrib=TOLEADER&wt=javabin&version=2} status=0 QTime=4 
[junit4:junit4]   2> 16347 T1292 C118 P40601 /update {wt=javabin&version=2} {add=[104]} 0 6
[junit4:junit4]   2> 16350 T1273 C121 P29988 /update {wt=javabin&version=2} {add=[105 (1413705979310112768)]} 0 0
[junit4:junit4]   2> 16368 T1325 C119 P24981 REQ /update {update.distrib=FROMLEADER&distrib.from=http://127.0.0.1:41761/solr/collection1/&wt=javabin&version=2} status=0 QTime=5 
[junit4:junit4]   2> 16368 T1304 C120 P41761 REQ /update {distrib.from=http://127.0.0.1:40601/solr/collection1/&update.distrib=TOLEADER&wt=javabin&version=2} status=0 QTime=13 
[junit4:junit4]   2> 16369 T1292 C118 P40601 /update {wt=javabin&version=2} {add=[105]} 0 16
[junit4:junit4]   2> 16373 T1273 C121 P29988 /update {wt=javabin&version=2} {add=[106 (1413705979333181440)]} 0 1
[junit4:junit4]   2> 16384 T1325 C119 P24981 REQ /update {update.distrib=FROMLEADER&distrib.from=http://127.0.0.1:41761/solr/collection1/&wt=javabin&version=2} status=0 QTime=2 
[junit4:junit4]   2> 16384 T1304 C120 P41761 REQ /update {distrib.from=http://127.0.0.1:40601/solr/collection1/&update.distrib=TOLEADER&wt=javabin&version=2} status=0 QTime=6 
[junit4:junit4]   2> 16385 T1292 C118 P40601 /update {wt=javabin&version=2} {add=[106]} 0 9
[junit4:junit4]   2> 16388 T1273 C121 P29988 /update {wt=javabin&version=2} {add=[107 (1413705979348910080)]} 0 1
[junit4:junit4]   2> 16394 T1311 C117 P64269 REQ /update {distrib.from=http://127.0.0.1:40601/solr/collection1/&update.distrib=FROMLEADER&wt=javabin&version=2} status=0 QTime=1 
[junit4:junit4]   2> 16394 T1292 C118 P40601 /update {wt=javabin&version=2} {add=[107 (1413705979352055808)]} 0 4
[junit4:junit4]   2> 16397 T1273 C121 P29988 /update {wt=javabin&version=2} {add=[108 (1413705979359395840)]} 0 0
[junit4:junit4]   2> 16403 T1311 C117 P64269 REQ /update {distrib.from=http://127.0.0.1:40601/solr/collection1/&update.distrib=FROMLEADER&wt=javabin&version=2} status=0 QTime=0 
[junit4:junit4]   2> 16404 T1292 C118 P40601 /update {wt=javabin&version=2} {add=[108 (1413705979362541568)]} 0 4
[junit4:junit4]   2> 16406 T1273 C121 P29988 /update {wt=javabin&version=2} {add=[109 (1413705979368833024)]} 0 0
[junit4:junit4]   2> 16414 T1311 C117 P64269 REQ /update {update.distrib=FROMLEADER&distrib.from=http://127.0.0.1:40601/solr/collection1/&wt=javabin&version=2} status=0 QTime=0 
[junit4:junit4]   2> 16415 T1289 C118 P40601 REQ /update {distrib.from=http://127.0.0.1:41761/solr/collection1/&update.distrib=TOLEADER&wt=javabin&version=2} status=0 QTime=4 
[junit4:junit4]   2> 16415 T1301 C120 P41761 /update {wt=javabin&version=2} {add=[109]} 0 6
[junit4:junit4]   2> 16418 T1273 C121 P29988 /update {wt=javabin&version=2} {add=[110 (1413705979381415936)]} 0 0
[junit4:junit4]   2> 16424 T1311 C117 P64269 REQ /update {distrib.from=http://127.0.0.1:40601/solr/collection1/&update.distrib=FROMLEADER&wt=javabin&version=2} status=0 QTime=0 
[junit4:junit4]   2> 16425 T1292 C118 P40601 /update {wt=javabin&version=2} {add=[110 (1413705979384561664)]} 0 4
[junit4:junit4]   2> 16427 T1273 C121 P29988 /update {wt=javabin&version=2} {add=[111 (1413705979390853120)]} 0 0
[junit4:junit4]   2> 16435 T1311 C117 P64269 REQ /update {update.distrib=FROMLEADER&distrib.from=http://127.0.0.1:40601/solr/collection1/&wt=javabin&version=2} status=0 QTime=0 
[junit4:junit4]   2> 16436 T1289 C118 P40601 REQ /update {distrib.from=http://127.0.0.1:41761/solr/collection1/&update.distrib=TOLEADER&wt=javabin&version=2} status=0 QTime=4 
[junit4:junit4]   2> 16436 T1301 C120 P41761 /update {wt=javabin&version=2} {add=[111]} 0 6
[junit4:junit4]   2> 16439 T1273 C121 P29988 /update {wt=javabin&version=2} {add=[112 (1413705979403436032)]} 0 0
[junit4:junit4]   2> 16447 T1325 C119 P24981 REQ /update {update.distrib=FROMLEADER&distrib.from=http://127.0.0.1:41761/solr/collection1/&wt=javabin&version=2} status=0 QTime=0 
[junit4:junit4]   2> 16448 T1304 C120 P41761 REQ /update {distrib.from=http://127.0.0.1:40601/solr/collection1/&update.distrib=TOLEADER&wt=javabin&version=2} status=0 QTime=4 
[junit4:junit4]   2> 16448 T1292 C118 P40601 /update {wt=javabin&version=2} {add=[112]} 0 6
[junit4:junit4]   2> 16455 T1273 C121 P29988 /update {wt=javabin&version=2} {add=[113 (1413705979416018944)]} 0 4
[junit4:junit4]   2> 16461 T1311 C117 P64269 REQ /update {distrib.from=http://127.0.0.1:40601/solr/collection1/&update.distrib=FROMLEADER&wt=javabin&version=2} status=0 QTime=0 
[junit4:junit4]   2> 16462 T1292 C118 P40601 /update {wt=javabin&version=2} {add=[113 (1413705979423358976)]} 0 4
[junit4:junit4]   2> 16465 T1273 C121 P29988 /update {wt=javabin&version=2} {add=[114 (1413705979429650432)]} 0 1
[junit4:junit4]   2> 16473 T1311 C117 P64269 REQ /update {update.distrib=FROMLEADER&distrib.from=http://127.0.0.1:40601/solr/collection1/&wt=javabin&version=2} status=0 QTime=0 
[junit4:junit4]   2> 16474 T1289 C118 P40601 REQ /update {distrib.from=http://127.0.0.1:41761/solr/collection1/&update.distrib=TOLEADER&wt=javabin&version=2} status=0 QTime=4 
[junit4:junit4]   2> 16474 T1301 C120 P41761 /update {wt=javabin&version=2} {add=[114]} 0 6
[junit4:junit4]   2> 16477 T1273 C121 P29988 /update {wt=javabin&version=2} {add=[115 (1413705979443281920)]} 0 0
[junit4:junit4]   2> 16483 T1325 C119 P24981 REQ /update {distrib.from=http://127.0.0.1:41761/solr/collection1/&update.distrib=FROMLEADER&wt=javabin&version=2} status=0 QTime=0 
[junit4:junit4]   2> 16484 T1301 C120 P41761 /update {wt=javabin&version=2} {add=[115 (1413705979446427648)]} 0 4
[junit4:junit4]   2> 16486 T1273 C121 P29988 /update {wt=javabin&version=2} {add=[116 (1413705979452719104)]} 0 0
[junit4:junit4]   2> 16492 T1325 C119 P24981 REQ /update {distrib.from=http://127.0.0.1:41761/solr/collection1/&update.distrib=FROMLEADER&wt=javabin&version=2} status=0 QTime=0 
[junit4:junit4]   2> 16493 T1301 C120 P41761 /update {wt=javabin&version=2} {add=[116 (1413705979455864832)]} 0 4
[junit4:junit4]   2> 16495 T1273 C121 P29988 /update {wt=javabin&version=2} {add=[117 (1413705979462156288)]} 0 0
[junit4:junit4]   2> 16501 T1325 C119 P24981 REQ /update {distrib.from=http://127.0.0.1:41761/solr/collection1/&update.distrib=FROMLEADER&wt=javabin&version=2} status=0 QTime=0 
[junit4:junit4]   2> 16502 T1301 C120 P41761 /update {wt=javabin&version=2} {add=[117 (1413705979465302016)]} 0 4
[junit4:junit4]   2> 16504 T1273 C121 P29988 /update {wt=javabin&version=2} {add=[118 (1413705979471593472)]} 0 0
[junit4:junit4]   2> 16515 T1311 C117 P64269 REQ /update {distrib.from=http://127.0.0.1:40601/solr/collection1/&update.distrib=FROMLEADER&wt=javabin&version=2} status=0 QTime=3 
[junit4:junit4]   2> 16516 T1292 C118 P40601 /update {wt=javabin&version=2} {add=[118 (1413705979474739200)]} 0 8
[junit4:junit4]   2> 16518 T1273 C121 P29988 /update {wt=javabin&version=2} {add=[119 (1413705979486273536)]} 0 0
[junit4:junit4]   2> 16524 T1325 C119 P24981 REQ /update {distrib.from=http://127.0.0.1:41761/solr/collection1/&update.distrib=FROMLEADER&wt=javabin&version=2} status=0 QTime=0 
[junit4:junit4]   2> 16525 T1301 C120 P41761 /update {wt=javabin&version=2} {add=[119 (1413705979489419264)]} 0 4
[junit4:junit4]   2> 16527 T1273 C121 P29988 /update {wt=javabin&version=2} {add=[120 (1413705979495710720)]} 0 0
[junit4:junit4]   2> 16533 T1325 C119 P24981 REQ /update {distrib.from=http://127.0.0.1:41761/solr/collection1/&update.distrib=FROMLEADER&wt=javabin&version=2} status=0 QTime=0 
[junit4:junit4]   2> 16534 T1301 C120 P41761 /update {wt=javabin&version=2} {add=[120 (1413705979498856448)]} 0 4
[junit4:junit4]   2> 16536 T1273 C121 P29988 /update {wt=javabin&version=2} {add=[121 (1413705979505147904)]} 0 0
[junit4:junit4]   2> 16542 T1325 C119 P24981 REQ /update {distrib.from=http://127.0.0.1:41761/solr/collection1/&update.distrib=FROMLEADER&wt=javabin&version=2} status=0 QTime=0 
[junit4:junit4]   2> 16543 T1301 C120 P41761 /update {wt=javabin&version=2} {add=[121 (1413705979508293632)]} 0 4
[junit4:junit4]   2> 16545 T1273 C121 P29988 /update {wt=javabin&version=2} {add=[122 (1413705979514585088)]} 0 0
[junit4:junit4]   2> 16555 T1311 C117 P64269 REQ /update {update.distrib=FROMLEADER&distrib.from=http://127.0.0.1:40601/solr/collection1/&wt=javabin&version=2} status=0 QTime=1 
[junit4:junit4]   2> 16555 T1289 C118 P40601 REQ /update {distrib.from=http://127.0.0.1:41761/solr/collection1/&update.distrib=TOLEADER&wt=javabin&version=2} status=0 QTime=5 
[junit4:junit4]   2> 16556 T1301 C120 P41761 /update {wt=javabin&version=2} {add=[122]} 0 8
[junit4:junit4]   2> 16561 T1273 C121 P29988 /update {wt=javabin&version=2} {add=[123 (1413705979528216576)]} 0 3
[junit4:junit4]   2> 16566 T1311 C117 P64269 REQ /update {distrib.from=http://127.0.0.1:40601/solr/collection1/&update.distrib=FROMLEADER&wt=javabin&version=2} status=0 QTime=0 
[junit4:junit4]   2> 16567 T1292 C118 P40601 /update {wt=javabin&version=2} {add=[123 (1413705979534508032)]} 0 3
[junit4:junit4]   2> 16570 T1273 C121 P29988 /update {wt=javabin&version=2} {add=[124 (1413705979539750912)]} 0 1
[junit4:junit4]   2> 16575 T1311 C117 P64269 REQ /update {distrib.from=http://127.0.0.1:40601/solr/collection1/&update.distrib=FROMLEADER&wt=javabin&version=2} status=0 QTime=0 
[junit4:junit4]   2> 16576 T1292 C118 P40601 /update {wt=javabin&version=2} {add=[124 (1413705979542896640)]} 0 4
[junit4:junit4]   2> 16578 T1273 C121 P29988 /update {wt=javabin&version=2} {add=[125 (1413705979549188096)]} 0 0
[junit4:junit4]   2> 16586 T1311 C117 P64269 REQ /update {update.distrib=FROMLEADER&distrib.from=http://127.0.0.1:40601/solr/collection1/&wt=javabin&version=2} status=0 QTime=0 
[junit4:junit4]   2> 16587 T1289 C118 P40601 REQ /update {distrib.from=http://127.0.0.1:41761/solr/collection1/&update.distrib=TOLEADER&wt=javabin&version=2} status=0 QTime=4 
[junit4:junit4]   2> 16587 T1301 C120 P41761 /update {wt=javabin&version=2} {add=[125]} 0 6
[junit4:junit4]   2> 16590 T1273 C121 P29988 /update {wt=javabin&version=2} {add=[126 (1413705979561771008)]} 0 0
[junit4:junit4]   2> 16598 T1325 C119 P24981 REQ /update {update.distrib=FROMLEADER&distrib.from=http://127.0.0.1:41761/solr/collection1/&wt=javabin&version=2} status=0 QTime=0 
[junit4:junit4]   2> 16599 T1304 C120 P41761 REQ /update {distrib.from=http://127.0.0.1:40601/solr/collection1/&update.distrib=TOLEADER&wt=javabin&version=2} status=0 QTime=4 
[junit4:junit4]   2> 16599 T1292 C118 P40601 /update {wt=javabin&version=2} {add=[126]} 0 6
[junit4:junit4]   2> 16602 T1273 C121 P29988 /update {wt=javabin&version=2} {add=[127 (1413705979574353920)]} 0 0
[junit4:junit4]   2> 16615 T1325 C119 P24981 REQ /update {distrib.from=http://127.0.0.1:41761/solr/collection1/&update.distrib=FROMLEADER&wt=javabin&version=2} status=0 QTime=3 
[junit4:junit4]   2> 16615 T1301 C120 P41761 /update {wt=javabin&version=2} {add=[127 (1413705979577499648)]} 0 10
[junit4:junit4]   2> 16618 T1273 C121 P29988 /update {wt=javabin&version=2} {add=[128 (1413705979591131136)]} 0 0
[junit4:junit4]   2> 16625 T1325 C119 P24981 REQ /update {distrib.from=http://127.0.0.1:41761/solr/collection1/&update.distrib=FROMLEADER&wt=javabin&version=2} status=0 QTime=1 
[junit4:junit4]   2> 16625 T1301 C120 P41761 /update {wt=javabin&version=2} {add=[128 (1413705979594276864)]} 0 4
[junit4:junit4]   2> 16628 T1273 C121 P29988 /update {wt=javabin&version=2} {add=[129 (1413705979601616896)]} 0 0
[junit4:junit4]   2> 16636 T1311 C117 P64269 REQ /update {update.distrib=FROMLEADER&distrib.from=http://127.0.0.1:40601/solr/collection1/&wt=javabin&version=2} status=0 QTime=0 
[junit4:junit4]   2> 16637 T1289 C118 P40601 REQ /update {distrib.from=http://127.0.0.1:41761/solr/collection1/&update.distrib=TOLEADER&wt=javabin&version=2} status=0 QTime=4 
[junit4:junit4]   2> 16637 T1301 C120 P41761 /update {wt=javabin&version=2} {add=[129]} 0 6
[junit4:junit4]   2> 16640 T1273 C121 P29988 /update {wt=javabin&version=2} {add=[130 (1413705979614199808)]} 0 0
[junit4:junit4]   2> 16646 T1325 C119 P24981 REQ /update {distrib.from=http://127.0.0.1:41761/solr/collection1/&update.distrib=FROMLEADER&wt=javabin&version=2} status=0 QTime=0 
[junit4:junit4]   2> 16647 T1301 C120 P41761 /update {wt=javabin&version=2} {add=[130 (1413705979617345536)]} 0 4
[junit4:junit4]   2> 16649 T1273 C121 P29988 /update {wt=javabin&version=2} {add=[131 (1413705979623636992)]} 0 0
[junit4:junit4]   2> 16655 T1325 C119 P24981 REQ /update {distrib.from=http://127.0.0.1:41761/solr/collection1/&update.distrib=FROMLEADER&wt=javabin&version=2} status=0 QTime=0 
[junit4:junit4]   2> 16656 T1301 C120 P41761 /update {wt=javabin&version=2} {add=[131 (1413705979626782720)]} 0 4
[junit4:junit4]   2> 16658 T1273 C121 P29988 /update {wt=javabin&version=2} {add=[132 (1413705979633074176)]} 0 0
[junit4:junit4]   2> 16664 T1311 C117 P64269 REQ /update {distrib.from=http://127.0.0.1:40601/solr/collection1/&update.distrib=FROMLEADER&wt=javabin&version=2} status=0 QTime=0 
[junit4:junit4]   2> 16665 T1292 C118 P40601 /update {wt=javabin&version=2} {add=[132 (1413705979636219904)]} 0 4
[junit4:junit4]   2> 16670 T1273 C121 P29988 /update {wt=javabin&version=2} {add=[133 (1413705979642511360)]} 0 3
[junit4:junit4]   2> 16675 T1311 C117 P64269 REQ /update {distrib.from=http://127.0.0.1:40601/solr/collection1/&update.distrib=FROMLEADER&wt=javabin&version=2} status=0 QTime=0 
[junit4:junit4]   2> 16676 T1292 C118 P40601 /update {wt=javabin&version=2} {add=[133 (1413705979647754240)]} 0 4
[junit4:junit4]   2> 16679 T1273 C121 P29988 /update {wt=javabin&version=2} {add=[134 (1413705979654045696)]} 0 1
[junit4:junit4]   2> 16686 T1325 C119 P24981 REQ /update {update.distrib=FROMLEADER&distrib.from=http://127.0.0.1:41761/solr/collection1/&wt=javabin&version=2} status=0 QTime=0 
[junit4:junit4]   2> 16687 T1304 C120 P41761 REQ /update {distrib.from=http://127.0.0.1:40601/solr/collection1/&update.distrib=TOLEADER&wt=javabin&version=2} status=0 QTime=4 
[junit4:junit4]   2> 16687 T1292 C118 P40601 /update {wt=javabin&version=2} {add=[134]} 0 6
[junit4:junit4]   2> 16690 T1273 C121 P29988 /update {wt=javabin&version=2} {add=[135 (1413705979666628608)]} 0 0
[junit4:junit4]   2> 16695 T1311 C117 P64269 REQ /update {distrib.from=http://127.0.0.1:40601/solr/collection1/&update.distrib=FROMLEADER&wt=javabin&version=2} status=0 QTime=0 
[junit4:junit4]   2> 16696 T1292 C118 P40601 /update {wt=javabin&version=2} {add=[135 (1413705979669774336)]} 0 3
[junit4:junit4]   2> 16698 T1273 C121 P29988 /update {wt=javabin&version=2} {add=[136 (1413705979675017216)]} 0 0
[junit4:junit4]   2> 16706 T1325 C119 P24981 REQ /update {update.distrib=FROMLEADER&distrib.from=http://127.0.0.1:41761/solr/collection1/&wt=javabin&version=2} status=0 QTime=0 
[junit4:junit4]   2> 16707 T1304 C120 P41761 REQ /update {distrib.from=http://127.0.0.1:40601/solr/collection1/&update.distrib=TOLEADER&wt=javabin&version=2} status=0 QTime=4 
[junit4:junit4]   2> 16707 T1292 C118 P40601 /update {wt=javabin&version=2} {add=[136]} 0 6
[junit4:junit4]   2> 16710 T1273 C121 P29988 /update {wt=javabin&version=2} {add=[137 (1413705979687600128)]} 0 0
[junit4:junit4]   2> 16718 T1325 C119 P24981 REQ /update {update.distrib=FROMLEADER&distrib.from=http://127.0.0.1:41761/solr/collection1/&wt=javabin&version=2} status=0 QTime=0 
[junit4:junit4]   2> 16719 T1304 C120 P41761 REQ /update {distrib.from=http://127.0.0.1:40601/solr/collection1/&update.distrib=TOLEADER&wt=javabin&version=2} status=0 QTime=4 
[junit4:junit4]   2> 16719 T1292 C118 P40601 /update {wt=javabin&version=2} {add=[137]} 0 6
[junit4:junit4]   2> 16722 T1273 C121 P29988 /update {wt=javabin&version=2} {add=[138 (1413705979700183040)]} 0 0
[junit4:junit4]   2> 16727 T1311 C117 P64269 REQ /update {distrib.from=http://127.0.0.1:40601/solr/collection1/&update.distrib=FROMLEADER&wt=javabin&version=2} status=0 QTime=0 
[junit4:junit4]   2> 16728 T1292 C118 P40601 /update {wt=javabin&version=2} {add=[138 (1413705979703328768)]} 0 3
[junit4:junit4]   2> 16730 T1273 C121 P29988 /update {wt=javabin&version=2} {add=[139 (1413705979708571648)]} 0 0
[junit4:junit4]   2> 16736 T1325 C119 P24981 REQ /update {distrib.from=http://127.0.0.1:41761/solr/collection1/&update.distrib=FROMLEADER&wt=javabin&version=2} status=0 QTime=0 
[junit4:junit4]   2> 16737 T1301 C120 P41761 /update {wt=javabin&version=2} {add=[139 (1413705979711717376)]} 0 4
[junit4:junit4]   2> 16739 T1273 C121 P29988 /update {wt=javabin&version=2} {add=[140 (1413705979718008832)]} 0 0
[junit4:junit4]   2> 16745 T1325 C119 P24981 REQ /update {distrib.from=http://127.0.0.1:41761/solr/collection1/&update.distrib=FROMLEADER&wt=javabin&version=2} status=0 QTime=0 
[junit4:junit4]   2> 16746 T1301 C120 P41761 /update {wt=javabin&version=2} {add=[140 (1413705979721154560)]} 0 4
[junit4:junit4]   2> 16748 T1273 C121 P29988 /update {wt=javabin&version=2} {add=[141 (1413705979727446016)]} 0 0
[junit4:junit4]   2> 16756 T1325 C119 P24981 REQ /update {update.distrib=FROMLEADER&distrib.from=http://127.0.0.1:41761/solr/collection1/&wt=javabin&version=2} status=0 QTime=0 
[junit4:junit4]   2> 16757 T1304 C120 P41761 REQ /update {distrib.from=http://127.0.0.1:40601/solr/collection1/&update.distrib=TOLEADER&wt=javabin&version=2} status=0 QTime=4 
[junit4:junit4]   2> 16757 T1292 C118 P40601 /update {wt=javabin&version=2} {add=[141]} 0 6
[junit4:junit4]   2> 16760 T1273 C121 P29988 /update {wt=javabin&version=2} {add=[142 (1413705979740028928)]} 0 0
[junit4:junit4]   2> 16775 T1325 C119 P24981 REQ /update {update.distrib=FROMLEADER&distrib.from=http://127.0.0.1:41761/solr/collection1/&wt=javabin&version=2} status=0 QTime=3 
[junit4:junit4]   2> 16775 T1304 C120 P41761 REQ /update {distrib.from=http://127.0.0.1:40601/solr/collection1/&update.distrib=TOLEADER&wt=javabin&version=2} status=0 QTime=10 
[junit4:junit4]   2> 16776 T1292 C118 P40601 /update {wt=javabin&version=2} {add=[142]} 0 13
[junit4:junit4]   2> 16782 T1273 C121 P29988 /update {wt=javabin&version=2} {add=[143 (1413705979759951872)]} 0 3
[junit4:junit4]   2> 16791 T1325 C119 P24981 REQ /update {update.distrib=FROMLEADER&distrib.from=http://127.0.0.1:41761/solr/collection1/&wt=javabin&version=2} status=0 QTime=1 
[junit4:junit4]   2> 16791 T1304 C120 P41761 REQ /update {distrib.from=http://127.0.0.1:40601/solr/collection1/&update.distrib=TOLEADER&wt=javabin&version=2} status=0 QTime=4 
[junit4:junit4]   2> 16792 T1292 C118 P40601 /update {wt=javabin&version=2} {add=[143]} 0 7
[junit4:junit4]   2> 16795 T1273 C121 P29988 /update {wt=javabin&version=2} {add=[144 (1413705979775680512)]} 0 1
[junit4:junit4]   2> 16802 T1325 C119 P24981 REQ /update {update.distrib=FROMLEADER&distrib.from=http://127.0.0.1:41761/solr/collection1/&wt=javabin&version=2} status=0 QTime=0 
[junit4:junit4]   2> 16803 T1304 C120 P41761 REQ /update {distrib.from=http://127.0.0.1:40601/solr/collection1/&update.distrib=TOLEADER&wt=javabin&version=2} status=0 QTime=4 
[junit4:junit4]   2> 16803 T1292 C118 P40601 /update {wt=javabin&version=2} {add=[144]} 0 6
[junit4:junit4]   2> 16806 T1273 C121 P29988 /update {wt=javabin&version=2} {add=[145 (1413705979788263424)]} 0 0
[junit4:junit4]   2> 16814 T1325 C119 P24981 REQ /update {update.distrib=FROMLEADER&distrib.from=http://127.0.0.1:41761/solr/collection1/&wt=javabin&version=2} status=0 QTime=0 
[junit4:junit4]   2> 16815 T1304 C120 P41761 REQ /update {distrib.from=http://127.0.0.1:40601/solr/collection1/&update.distrib=TOLEADER&wt=javabin&version=2} status=0 QTime=4 
[junit4:junit4]   2> 16815 T1292 C118 P40601 /update {wt=javabin&version=2} {add=[145]} 0 6
[junit4:junit4]   2> 16818 T1273 C121 P29988 /update {wt=javabin&version=2} {add=[146 (1413705979800846336)]} 0 0
[junit4:junit4]   2> 16833 T1311 C117 P64269 REQ /update {update.distrib=FROMLEADER&distrib.from=http://127.0.0.1:40601/solr/collection1/&wt=javabin&version=2} status=0 QTime=3 
[junit4:junit4]   2> 16834 T1289 C118 P40601 REQ /update {distrib.from=http://127.0.0.1:41761/solr/collection1/&update.distrib=TOLEADER&wt=javabin&version=2} status=0 QTime=11 
[junit4:junit4]   2> 16834 T1301 C120 P41761 /update {wt=javabin&version=2} {add=[146]} 0 13
[junit4:junit4]   2> 16837 T1273 C121 P29988 /update {wt=javabin&version=2} {add=[147 (1413705979820769280)]} 0 0
[junit4:junit4]   2> 16843 T1325 C119 P24981 REQ /update {distrib.from=http://127.0.0.1:41761/solr/collection1/&update.distrib=FROMLEADER&wt=javabin&version=2} status=0 QTime=0 
[junit4:junit4]   2> 16844 T1301 C120 P41761 /update {wt=javabin&version=2} {add=[147 (1413705979823915008)]} 0 4
[junit4:junit4]   2> 16846 T1273 C121 P29988 /update {wt=javabin&version=2} {add=[148 (1413705979830206464)]} 0 0
[junit4:junit4]   2> 16853 T1311 C117 P64269 REQ /update {distrib.from=http://127.0.0.1:40601/solr/collection1/&update.distrib=FROMLEADER&wt=javabin&version=2} status=0 QTime=1 
[junit4:junit4]   2> 16853 T1292 C118 P40601 /update {wt=javabin&version=2} {add=[148 (1413705979833352192)]} 0 4
[junit4:junit4]   2> 16856 T1273 C121 P29988 /update {wt=javabin&version=2} {add=[149 (1413705979840692224)]} 0 0
[junit4:junit4]   2> 16864 T1325 C119 P24981 REQ /update {update.distrib=FROMLEADER&distrib.from=http://127.0.0.1:41761/solr/collection1/&wt=javabin&version=2} status=0 QTime=0 
[junit4:junit4]   2> 16865 T1304 C120 P41761 REQ /update {distrib.from=http://127.0.0.1:40601/solr/collection1/&update.distrib=TOLEADER&wt=javabin&version=2} status=0 QTime=4 
[junit4:junit4]   2> 16865 T1292 C118 P40601 /update {wt=javabin&version=2} {add=[149]} 0 6
[junit4:junit4]   2> 16866 T1261 oasc.AbstractDistribZkTestBase.waitForRecoveriesToFinish Wait for recoveries to finish - collection: collection1 failOnTimeout:true timeout (sec):1800
[junit4:junit4]   2> 16867 T1261 oascc.ZkStateReader.updateClusterState Updating cloud state from ZooKeeper... 
[junit4:junit4]   2> 16870 T1273 C121 P29988 oasu.DirectUpdateHandler2.commit start commit{flags=0,_version_=0,optimize=false,openSearcher=true,waitSearcher=true,expungeDeletes=false,softCommit=false}
[junit4:junit4]   2> 17163 T1273 C121 P29988 oasc.SolrDeletionPolicy.onCommit SolrDeletionPolicy.onCommit: commits:num=2
[junit4:junit4]   2> 		commit{dir=NRTCachingDirectory(org.apache.lucene.store.NIOFSDirectory@/usr/home/hudson/hudson-slave/workspace/Lucene-Solr-Tests-trunk-Java6/solr/build/solr-core/test/J1/org.apache.solr.cloud.BasicDistributedZk2Test-1348215067072/control/data/index lockFactory=org.apache.lucene.store.NativeFSLockFactory@5273db92; maxCacheMB=48.0 maxMergeSizeMB=4.0),segFN=segments_2,generation=2,filenames=[_0.fnm, _0.frq, _0.tim, _0_nrm.cfe, segments_2, _0.fdx, _0_nrm.cfs, _0.si, _0.prx, _0.tip, _0.fdt]
[junit4:junit4]   2> 		commit{dir=NRTCachingDirectory(org.apache.lucene.store.NIOFSDirectory@/usr/home/hudson/hudson-slave/workspace/Lucene-Solr-Tests-trunk-Java6/solr/build/solr-core/test/J1/org.apache.solr.cloud.BasicDistributedZk2Test-1348215067072/control/data/index lockFactory=org.apache.lucene.store.NativeFSLockFactory@5273db92; maxCacheMB=48.0 maxMergeSizeMB=4.0),segFN=segments_3,generation=3,filenames=[_5_nrm.cfe, _3_nrm.cfe, _5.fdt, _5.prx, _1.frq, _4.prx, _7.si, _4.fnm, _4_nrm.cfe, _3.fdt, _1.fnm, _2.tim, _4.fdx, _7.fnm, _5.tip, _5.tim, _4.frq, _7.frq, _7.tim, _0.prx, _7.tip, _0.fnm, _2.prx, _2.frq, _2.fdt, _7.fdx, _3.prx, _2.fdx, _7.fdt, _5.si, _2.tip, _1.fdx, _1.prx, _3_nrm.cfs, _5_nrm.cfs, _1.fdt, _0.tim, _0.frq, _4_nrm.cfs, _3.si, _6.fdt, _0.tip, _2.si, _3.frq, _6.frq, _3.tim, _6.fdx, _3.fnm, _2_nrm.cfe, _6.tip, _6_nrm.cfs, _7_nrm.cfs, _6.tim, _4.tip, _0.si, _2_nrm.cfs, _1.tip, _1.tim, _1_nrm.cfs, _5.fnm, _7_nrm.cfe, _4.tim, _6_nrm.cfe, _5.frq, _4.si, _4.fdt, _0_nrm.cfs, _1_nrm.cfe, _2.fnm, _7.prx, _3.fdx, _6.prx, _1.si, _0_nrm.cfe, _5.fdx, _6.si, _6.fnm, _0.fdx, _3.tip, segments_3, _0.fdt]
[junit4:junit4]   2> 17164 T1273 C121 P29988 oasc.SolrDeletionPolicy.updateCommits newest commit = 3
[junit4:junit4]   2> 17207 T1273 C121 P29988 oass.SolrIndexSearcher.<init> Opening Searcher@3248fc6b main
[junit4:junit4]   2> 17208 T1273 C121 P29988 oasu.DirectUpdateHandler2.commit end_commit_flush
[junit4:junit4]   2> 17209 T1284 oasc.SolrCore.registerSearcher [collection1] Registered new searcher Searcher@3248fc6b main{StandardDirectoryReader(segments_3:17 _0(5.0):C1 _1(5.0):C10 _2(5.0):C10 _3(5.0):C10 _4(5.0):C10 _5(5.0):C10 _6(5.0):C10 _7(5.0):C6)}
[junit4:junit4]   2> 17210 T1273 C121 P29988 /update {waitSearcher=true&wt=javabin&commit=true&softCommit=false&version=2} {commit=} 0 340
[junit4:junit4]   2> 17212 T1301 C120 P41761 oasu.DirectUpdateHandler2.commit start commit{flags=0,_version_=0,optimize=false,openSearcher=true,waitSearcher=true,expungeDeletes=false,softCommit=false}
[junit4:junit4]   2> 17418 T1301 C120 P41761 oasc.SolrDeletionPolicy.onCommit SolrDeletionPolicy.onCommit: commits:num=2
[junit4:junit4]   2> 		commit{dir=NRTCachingDirectory(org.apache.lucene.store.NIOFSDirectory@/usr/home/hudson/hudson-slave/workspace/Lucene-Solr-Tests-trunk-Java6/solr/build/solr-core/test/J1/org.apache.solr.cloud.BasicDistributedZk2Test-1348215067072/jetty2/index lockFactory=org.apache.lucene.store.NativeFSLockFactory@2eddacdc; maxCacheMB=48.0 maxMergeSizeMB=4.0),segFN=segments_1,generation=1,filenames=[segments_1]
[junit4:junit4]   2> 		commit{dir=NRTCachingDirectory(org.apache.lucene.store.NIOFSDirectory@/usr/home/hudson/hudson-slave/workspace/Lucene-Solr-Tests-trunk-Java6/solr/build/solr-core/test/J1/org.apache.solr.cloud.BasicDistributedZk2Test-1348215067072/jetty2/index lockFactory=org.apache.lucene.store.NativeFSLockFactory@2eddacdc; maxCacheMB=48.0 maxMergeSizeMB=4.0),s

[...truncated too long message...]

D0D470BF05B7732:4CEBC9138704170E]:0)
[junit4:junit4]    > 	at org.junit.Assert.fail(Assert.java:93)
[junit4:junit4]    > 	at org.apache.solr.cloud.AbstractDistribZkTestBase.waitForRecoveriesToFinish(AbstractDistribZkTestBase.java:154)
[junit4:junit4]    > 	at org.apache.solr.cloud.AbstractFullDistribZkTestBase.waitForRecoveriesToFinish(AbstractFullDistribZkTestBase.java:560)
[junit4:junit4]    > 	at org.apache.solr.cloud.AbstractFullDistribZkTestBase.waitForThingsToLevelOut(AbstractFullDistribZkTestBase.java:1135)
[junit4:junit4]    > 	at org.apache.solr.cloud.SyncSliceTest.doTest(SyncSliceTest.java:162)
[junit4:junit4]    > 	at org.apache.solr.BaseDistributedSearchTestCase.testDistribSearch(BaseDistributedSearchTestCase.java:695)
[junit4:junit4]    > 	at sun.reflect.NativeMethodAccessorImpl.invoke0(Native Method)
[junit4:junit4]    > 	at sun.reflect.NativeMethodAccessorImpl.invoke(NativeMethodAccessorImpl.java:57)
[junit4:junit4]    > 	at sun.reflect.DelegatingMethodAccessorImpl.invoke(DelegatingMethodAccessorImpl.java:43)
[junit4:junit4]    > 	at java.lang.reflect.Method.invoke(Method.java:616)
[junit4:junit4]    > 	at com.carrotsearch.randomizedtesting.RandomizedRunner.invoke(RandomizedRunner.java:1559)
[junit4:junit4]    > 	at com.carrotsearch.randomizedtesting.RandomizedRunner.access$600(RandomizedRunner.java:79)
[junit4:junit4]    > 	at com.carrotsearch.randomizedtesting.RandomizedRunner$6.evaluate(RandomizedRunner.java:737)
[junit4:junit4]    > 	at com.carrotsearch.randomizedtesting.RandomizedRunner$7.evaluate(RandomizedRunner.java:773)
[junit4:junit4]    > 	at com.carrotsearch.randomizedtesting.RandomizedRunner$8.evaluate(RandomizedRunner.java:787)
[junit4:junit4]    > 	at com.carrotsearch.randomizedtesting.rules.SystemPropertiesRestoreRule$1.evaluate(SystemPropertiesRestoreRule.java:53)
[junit4:junit4]    > 	at org.apache.lucene.util.TestRuleSetupTeardownChained$1.evaluate(TestRuleSetupTeardownChained.java:50)
[junit4:junit4]    > 	at org.apache.lucene.util.TestRuleFieldCacheSanity$1.evaluate(TestRuleFieldCacheSanity.java:51)
[junit4:junit4]    > 	at org.apache.lucene.util.AbstractBeforeAfterRule$1.evaluate(AbstractBeforeAfterRule.java:45)
[junit4:junit4]    > 	at com.carrotsearch.randomizedtesting.rules.SystemPropertiesInvariantRule$1.evaluate(SystemPropertiesInvariantRule.java:55)
[junit4:junit4]    > 	at org.apache.lucene.util.TestRuleThreadAndTestName$1.evaluate(TestRuleThreadAndTestName.java:48)
[junit4:junit4]    > 	at org.apache.lucene.util.TestRuleIgnoreAfterMaxFailures$1.evaluate(TestRuleIgnoreAfterMaxFailures.java:70)
[junit4:junit4]    > 	at org.apache.lucene.util.TestRuleMarkFailure$1.evaluate(TestRuleMarkFailure.java:48)
[junit4:junit4]    > 	at com.carrotsearch.randomizedtesting.rules.StatementAdapter.evaluate(StatementAdapter.java:36)
[junit4:junit4]    > 	at com.carrotsearch.randomizedtesting.ThreadLeakControl$StatementRunner.run(ThreadLeakControl.java:358)
[junit4:junit4]    > 	at com.carrotsearch.randomizedtesting.ThreadLeakControl.forkTimeoutingTask(ThreadLeakControl.java:782)
[junit4:junit4]    > 	at com.carrotsearch.randomizedtesting.ThreadLeakControl$3.evaluate(ThreadLeakControl.java:442)
[junit4:junit4]    > 	at com.carrotsearch.randomizedtesting.RandomizedRunner.runSingleTest(RandomizedRunner.java:746)
[junit4:junit4]    > 	at com.carrotsearch.randomizedtesting.RandomizedRunner$3.evaluate(RandomizedRunner.java:648)
[junit4:junit4]    > 	at com.carrotsearch.randomizedtesting.RandomizedRunner$4.evaluate(RandomizedRunner.java:682)
[junit4:junit4]    > 	at com.carrotsearch.randomizedtesting.RandomizedRunner$5.evaluate(RandomizedRunner.java:693)
[junit4:junit4]    > 	at com.carrotsearch.randomizedtesting.rules.StatementAdapter.evaluate(StatementAdapter.java:36)
[junit4:junit4]    > 	at com.carrotsearch.randomizedtesting.rules.SystemPropertiesRestoreRule$1.evaluate(SystemPropertiesRestoreRule.java:53)
[junit4:junit4]    > 	at org.apache.lucene.util.AbstractBeforeAfterRule$1.evaluate(AbstractBeforeAfterRule.java:45)
[junit4:junit4]    > 	at org.apache.lucene.util.TestRuleStoreClassName$1.evaluate(TestRuleStoreClassName.java:42)
[junit4:junit4]    > 	at com.carrotsearch.randomizedtesting.rules.SystemPropertiesInvariantRule$1.evaluate(SystemPropertiesInvariantRule.java:55)
[junit4:junit4]    > 	at com.carrotsearch.randomizedtesting.rules.NoShadowingOrOverridesOnMethodsRule$1.evaluate(NoShadowingOrOverridesOnMethodsRule.java:39)
[junit4:junit4]    > 	at com.carrotsearch.randomizedtesting.rules.NoShadowingOrOverridesOnMethodsRule$1.evaluate(NoShadowingOrOverridesOnMethodsRule.java:39)
[junit4:junit4]    > 	at com.carrotsearch.randomizedtesting.rules.StatementAdapter.evaluate(StatementAdapter.java:36)
[junit4:junit4]    > 	at org.apache.lucene.util.TestRuleAssertionsRequired$1.evaluate(TestRuleAssertionsRequired.java:43)
[junit4:junit4]    > 	at org.apache.lucene.util.TestRuleMarkFailure$1.evaluate(TestRuleMarkFailure.java:48)
[junit4:junit4]    > 	at org.apache.lucene.util.TestRuleIgnoreAfterMaxFailures$1.evaluate(TestRuleIgnoreAfterMaxFailures.java:70)
[junit4:junit4]    > 	at org.apache.lucene.util.TestRuleIgnoreTestSuites$1.evaluate(TestRuleIgnoreTestSuites.java:55)
[junit4:junit4]    > 	at com.carrotsearch.randomizedtesting.rules.StatementAdapter.evaluate(StatementAdapter.java:36)
[junit4:junit4]    > 	at com.carrotsearch.randomizedtesting.ThreadLeakControl$StatementRunner.run(ThreadLeakControl.java:358)
[junit4:junit4]    > 	at java.lang.Thread.run(Thread.java:679)
[junit4:junit4]   2> 146674 T2623 oas.SolrTestCaseJ4.deleteCore ###deleteCore
[junit4:junit4]   2> NOTE: test params are: codec=Lucene40: {range_facet_l=PostingsFormat(name=SimpleText), text=PostingsFormat(name=NestedPulsing), _version_=PostingsFormat(name=SimpleText), rnd_b=MockFixedIntBlock(blockSize=1782), intDefault=PostingsFormat(name=SimpleText), id=MockFixedIntBlock(blockSize=1782), timestamp=PostingsFormat(name=SimpleText), a_t=PostingsFormat(name=SimpleText), range_facet_sl=PostingsFormat(name=NestedPulsing), range_facet_si=PostingsFormat(name=TestBloomFilteredLucene40Postings), other_tl1=PostingsFormat(name=SimpleText), multiDefault=PostingsFormat(name=TestBloomFilteredLucene40Postings), a_si=PostingsFormat(name=TestBloomFilteredLucene40Postings)}, sim=RandomSimilarityProvider(queryNorm=true,coord=yes): {}, locale=ga, timezone=Pacific/Palau
[junit4:junit4]   2> NOTE: FreeBSD 9.0-RELEASE amd64/Sun Microsystems Inc. 1.6.0_32 (64-bit)/cpus=16,threads=1,free=38347728,total=257818624
[junit4:junit4]   2> NOTE: All tests run in this JVM: [CacheHeaderTest, TestElisionMultitermQuery, TestQueryTypes, SuggesterWFSTTest, HighlighterConfigTest, NumericFieldsTest, CopyFieldTest, TestSolr4Spatial, TestSystemIdResolver, TestStressReorder, TestExtendedDismaxParser, SimpleFacetsTest, SortByFunctionTest, TestFastLRUCache, FileBasedSpellCheckerTest, CoreContainerCoreInitFailuresTest, LoggingHandlerTest, SpellPossibilityIteratorTest, JSONWriterTest, TestNumberUtils, UpdateRequestProcessorFactoryTest, TestRandomFaceting, DateFieldTest, SystemInfoHandlerTest, NotRequiredUniqueKeyTest, TestSearchPerf, AlternateDirectoryTest, TestPHPSerializedResponseWriter, TestGroupingSearch, JsonLoaderTest, MBeansHandlerTest, SearchHandlerTest, TestRangeQuery, PluginInfoTest, DistributedTermsComponentTest, SuggesterFSTTest, TestSolrJ, TestConfig, SolrCoreCheckLockOnStartupTest, PreAnalyzedFieldTest, RequestHandlersTest, UniqFieldsUpdateProcessorFactoryTest, TestStressVersions, TestJoin, DirectSolrConnectionTest, TestIndexSearcher, TestDefaultSimilarityFactory, MinimalSchemaTest, TestLFUCache, AutoCommitTest, TestIBSimilarityFactory, TestBinaryResponseWriter, TestFastOutputStream, BasicDistributedZkTest, MoreLikeThisHandlerTest, OverseerTest, SpellCheckComponentTest, FullSolrCloudDistribCmdsTest, LeaderElectionIntegrationTest, DistributedSpellCheckComponentTest, TestRealTimeGet, ZkControllerTest, BasicZkTest, TestFaceting, IndexBasedSpellCheckerTest, TestCoreContainer, TestSort, QueryElevationComponentTest, BasicFunctionalityTest, SignatureUpdateProcessorFactoryTest, TestJmxIntegration, SampleTest, CoreAdminHandlerTest, TestTrie, SolrRequestParserTest, TestRemoteStreaming, QueryEqualityTest, TestCSVLoader, DocumentBuilderTest, CurrencyFieldTest, TestPseudoReturnFields, DistanceFunctionTest, XsltUpdateRequestHandlerTest, FieldAnalysisRequestHandlerTest, TestSurroundQueryParser, TestSolrQueryParser, TestValueSourceCache, RequiredFieldsTest, SolrCmdDistributorTest, TestIndexingPerformance, PrimitiveFieldTypeTest, BadComponentTest, TestUpdate, TestBinaryField, SOLR749Test, DefaultValueUpdateProcessorTest, TestXIncludeConfig, TestCollationField, MultiTermTest, EchoParamsTest, TestLMDirichletSimilarityFactory, TestPluginEnable, TestLMJelinekMercerSimilarityFactory, TestCodecSupport, URLClassifyProcessorTest, SpellingQueryConverterTest, TestBadConfig, TestDocumentBuilder, ClusterStateTest, SyncSliceTest]
[junit4:junit4] Completed on J0 in 146.69s, 1 test, 1 failure <<< FAILURES!

[...truncated 11 lines...]
BUILD FAILED
/usr/home/hudson/hudson-slave/workspace/Lucene-Solr-Tests-trunk-Java6/build.xml:32: The following error occurred while executing this line:
/usr/home/hudson/hudson-slave/workspace/Lucene-Solr-Tests-trunk-Java6/solr/build.xml:179: The following error occurred while executing this line:
/usr/home/hudson/hudson-slave/workspace/Lucene-Solr-Tests-trunk-Java6/lucene/module-build.xml:63: The following error occurred while executing this line:
/usr/home/hudson/hudson-slave/workspace/Lucene-Solr-Tests-trunk-Java6/lucene/common-build.xml:1140: The following error occurred while executing this line:
/usr/home/hudson/hudson-slave/workspace/Lucene-Solr-Tests-trunk-Java6/lucene/common-build.xml:813: There were test failures: 230 suites, 950 tests, 2 failures, 7 ignored (2 assumptions)

Total time: 31 minutes 2 seconds
Build step 'Invoke Ant' marked build as failure
Recording test results
Email was triggered for: Failure
Sending email for trigger: Failure



Mime
View raw message