lucene-dev mailing list archives

Site index · List index
Message view « Date » · « Thread »
Top « Date » · « Thread »
From Policeman Jenkins Server <jenk...@sd-datasolutions.de>
Subject [JENKINS] Lucene-Solr-trunk-Windows (32bit/jdk1.7.0_07) - Build # 758 - Still Failing!
Date Thu, 13 Sep 2012 20:59:00 GMT
Build: http://jenkins.sd-datasolutions.de/job/Lucene-Solr-trunk-Windows/758/
Java: 32bit/jdk1.7.0_07 -client -XX:+UseConcMarkSweepGC

10 tests failed.
REGRESSION:  org.apache.solr.cloud.SyncSliceTest.testDistribSearch

Error Message:
adding up the # of docs on each shard does not match the control - cloud client returns:304 expected:<305> but was:<304>

Stack Trace:
java.lang.AssertionError: adding up the # of docs on each shard does not match the control - cloud client returns:304 expected:<305> but was:<304>
	at __randomizedtesting.SeedInfo.seed([B1AB8B0A619B39FF:304D051216C459C3]:0)
	at org.junit.Assert.fail(Assert.java:93)
	at org.junit.Assert.failNotEquals(Assert.java:647)
	at org.junit.Assert.assertEquals(Assert.java:128)
	at org.junit.Assert.assertEquals(Assert.java:472)
	at org.apache.solr.cloud.AbstractFullDistribZkTestBase.checkShardConsistency(AbstractFullDistribZkTestBase.java:905)
	at org.apache.solr.cloud.SyncSliceTest.doTest(SyncSliceTest.java:226)
	at org.apache.solr.BaseDistributedSearchTestCase.testDistribSearch(BaseDistributedSearchTestCase.java:691)
	at sun.reflect.NativeMethodAccessorImpl.invoke0(Native Method)
	at sun.reflect.NativeMethodAccessorImpl.invoke(NativeMethodAccessorImpl.java:57)
	at sun.reflect.DelegatingMethodAccessorImpl.invoke(DelegatingMethodAccessorImpl.java:43)
	at java.lang.reflect.Method.invoke(Method.java:601)
	at com.carrotsearch.randomizedtesting.RandomizedRunner.invoke(RandomizedRunner.java:1559)
	at com.carrotsearch.randomizedtesting.RandomizedRunner.access$600(RandomizedRunner.java:79)
	at com.carrotsearch.randomizedtesting.RandomizedRunner$6.evaluate(RandomizedRunner.java:737)
	at com.carrotsearch.randomizedtesting.RandomizedRunner$7.evaluate(RandomizedRunner.java:773)
	at com.carrotsearch.randomizedtesting.RandomizedRunner$8.evaluate(RandomizedRunner.java:787)
	at com.carrotsearch.randomizedtesting.rules.SystemPropertiesRestoreRule$1.evaluate(SystemPropertiesRestoreRule.java:53)
	at org.apache.lucene.util.TestRuleSetupTeardownChained$1.evaluate(TestRuleSetupTeardownChained.java:50)
	at org.apache.lucene.util.TestRuleFieldCacheSanity$1.evaluate(TestRuleFieldCacheSanity.java:51)
	at org.apache.lucene.util.AbstractBeforeAfterRule$1.evaluate(AbstractBeforeAfterRule.java:45)
	at com.carrotsearch.randomizedtesting.rules.SystemPropertiesInvariantRule$1.evaluate(SystemPropertiesInvariantRule.java:55)
	at org.apache.lucene.util.TestRuleThreadAndTestName$1.evaluate(TestRuleThreadAndTestName.java:48)
	at org.apache.lucene.util.TestRuleIgnoreAfterMaxFailures$1.evaluate(TestRuleIgnoreAfterMaxFailures.java:70)
	at org.apache.lucene.util.TestRuleMarkFailure$1.evaluate(TestRuleMarkFailure.java:48)
	at com.carrotsearch.randomizedtesting.rules.StatementAdapter.evaluate(StatementAdapter.java:36)
	at com.carrotsearch.randomizedtesting.ThreadLeakControl$StatementRunner.run(ThreadLeakControl.java:358)
	at com.carrotsearch.randomizedtesting.ThreadLeakControl.forkTimeoutingTask(ThreadLeakControl.java:782)
	at com.carrotsearch.randomizedtesting.ThreadLeakControl$3.evaluate(ThreadLeakControl.java:442)
	at com.carrotsearch.randomizedtesting.RandomizedRunner.runSingleTest(RandomizedRunner.java:746)
	at com.carrotsearch.randomizedtesting.RandomizedRunner$3.evaluate(RandomizedRunner.java:648)
	at com.carrotsearch.randomizedtesting.RandomizedRunner$4.evaluate(RandomizedRunner.java:682)
	at com.carrotsearch.randomizedtesting.RandomizedRunner$5.evaluate(RandomizedRunner.java:693)
	at com.carrotsearch.randomizedtesting.rules.StatementAdapter.evaluate(StatementAdapter.java:36)
	at com.carrotsearch.randomizedtesting.rules.SystemPropertiesRestoreRule$1.evaluate(SystemPropertiesRestoreRule.java:53)
	at org.apache.lucene.util.AbstractBeforeAfterRule$1.evaluate(AbstractBeforeAfterRule.java:45)
	at org.apache.lucene.util.TestRuleStoreClassName$1.evaluate(TestRuleStoreClassName.java:42)
	at com.carrotsearch.randomizedtesting.rules.SystemPropertiesInvariantRule$1.evaluate(SystemPropertiesInvariantRule.java:55)
	at com.carrotsearch.randomizedtesting.rules.NoShadowingOrOverridesOnMethodsRule$1.evaluate(NoShadowingOrOverridesOnMethodsRule.java:39)
	at com.carrotsearch.randomizedtesting.rules.NoShadowingOrOverridesOnMethodsRule$1.evaluate(NoShadowingOrOverridesOnMethodsRule.java:39)
	at com.carrotsearch.randomizedtesting.rules.StatementAdapter.evaluate(StatementAdapter.java:36)
	at org.apache.lucene.util.TestRuleAssertionsRequired$1.evaluate(TestRuleAssertionsRequired.java:43)
	at org.apache.lucene.util.TestRuleMarkFailure$1.evaluate(TestRuleMarkFailure.java:48)
	at org.apache.lucene.util.TestRuleIgnoreAfterMaxFailures$1.evaluate(TestRuleIgnoreAfterMaxFailures.java:70)
	at org.apache.lucene.util.TestRuleIgnoreTestSuites$1.evaluate(TestRuleIgnoreTestSuites.java:55)
	at com.carrotsearch.randomizedtesting.rules.StatementAdapter.evaluate(StatementAdapter.java:36)
	at com.carrotsearch.randomizedtesting.ThreadLeakControl$StatementRunner.run(ThreadLeakControl.java:358)
	at java.lang.Thread.run(Thread.java:722)


REGRESSION:  org.apache.solr.search.TestRecovery.testLogReplay

Error Message:
java.lang.NullPointerException

Stack Trace:
java.lang.RuntimeException: java.lang.NullPointerException
	at __randomizedtesting.SeedInfo.seed([B1AB8B0A619B39FF:2FCAA128FC302773]:0)
	at org.apache.solr.search.TestRecovery.clearIndex(TestRecovery.java:80)
	at org.apache.solr.search.TestRecovery.testLogReplay(TestRecovery.java:112)
	at sun.reflect.NativeMethodAccessorImpl.invoke0(Native Method)
	at sun.reflect.NativeMethodAccessorImpl.invoke(NativeMethodAccessorImpl.java:57)
	at sun.reflect.DelegatingMethodAccessorImpl.invoke(DelegatingMethodAccessorImpl.java:43)
	at java.lang.reflect.Method.invoke(Method.java:601)
	at com.carrotsearch.randomizedtesting.RandomizedRunner.invoke(RandomizedRunner.java:1559)
	at com.carrotsearch.randomizedtesting.RandomizedRunner.access$600(RandomizedRunner.java:79)
	at com.carrotsearch.randomizedtesting.RandomizedRunner$6.evaluate(RandomizedRunner.java:737)
	at com.carrotsearch.randomizedtesting.RandomizedRunner$7.evaluate(RandomizedRunner.java:773)
	at com.carrotsearch.randomizedtesting.RandomizedRunner$8.evaluate(RandomizedRunner.java:787)
	at com.carrotsearch.randomizedtesting.rules.SystemPropertiesRestoreRule$1.evaluate(SystemPropertiesRestoreRule.java:53)
	at org.apache.lucene.util.TestRuleSetupTeardownChained$1.evaluate(TestRuleSetupTeardownChained.java:50)
	at org.apache.lucene.util.TestRuleFieldCacheSanity$1.evaluate(TestRuleFieldCacheSanity.java:51)
	at org.apache.lucene.util.AbstractBeforeAfterRule$1.evaluate(AbstractBeforeAfterRule.java:45)
	at com.carrotsearch.randomizedtesting.rules.SystemPropertiesInvariantRule$1.evaluate(SystemPropertiesInvariantRule.java:55)
	at org.apache.lucene.util.TestRuleThreadAndTestName$1.evaluate(TestRuleThreadAndTestName.java:48)
	at org.apache.lucene.util.TestRuleIgnoreAfterMaxFailures$1.evaluate(TestRuleIgnoreAfterMaxFailures.java:70)
	at org.apache.lucene.util.TestRuleMarkFailure$1.evaluate(TestRuleMarkFailure.java:48)
	at com.carrotsearch.randomizedtesting.rules.StatementAdapter.evaluate(StatementAdapter.java:36)
	at com.carrotsearch.randomizedtesting.ThreadLeakControl$StatementRunner.run(ThreadLeakControl.java:358)
	at com.carrotsearch.randomizedtesting.ThreadLeakControl.forkTimeoutingTask(ThreadLeakControl.java:782)
	at com.carrotsearch.randomizedtesting.ThreadLeakControl$3.evaluate(ThreadLeakControl.java:442)
	at com.carrotsearch.randomizedtesting.RandomizedRunner.runSingleTest(RandomizedRunner.java:746)
	at com.carrotsearch.randomizedtesting.RandomizedRunner$3.evaluate(RandomizedRunner.java:648)
	at com.carrotsearch.randomizedtesting.RandomizedRunner$4.evaluate(RandomizedRunner.java:682)
	at com.carrotsearch.randomizedtesting.RandomizedRunner$5.evaluate(RandomizedRunner.java:693)
	at com.carrotsearch.randomizedtesting.rules.StatementAdapter.evaluate(StatementAdapter.java:36)
	at com.carrotsearch.randomizedtesting.rules.SystemPropertiesRestoreRule$1.evaluate(SystemPropertiesRestoreRule.java:53)
	at org.apache.lucene.util.AbstractBeforeAfterRule$1.evaluate(AbstractBeforeAfterRule.java:45)
	at org.apache.lucene.util.TestRuleStoreClassName$1.evaluate(TestRuleStoreClassName.java:42)
	at com.carrotsearch.randomizedtesting.rules.SystemPropertiesInvariantRule$1.evaluate(SystemPropertiesInvariantRule.java:55)
	at com.carrotsearch.randomizedtesting.rules.NoShadowingOrOverridesOnMethodsRule$1.evaluate(NoShadowingOrOverridesOnMethodsRule.java:39)
	at com.carrotsearch.randomizedtesting.rules.NoShadowingOrOverridesOnMethodsRule$1.evaluate(NoShadowingOrOverridesOnMethodsRule.java:39)
	at com.carrotsearch.randomizedtesting.rules.StatementAdapter.evaluate(StatementAdapter.java:36)
	at org.apache.lucene.util.TestRuleAssertionsRequired$1.evaluate(TestRuleAssertionsRequired.java:43)
	at org.apache.lucene.util.TestRuleMarkFailure$1.evaluate(TestRuleMarkFailure.java:48)
	at org.apache.lucene.util.TestRuleIgnoreAfterMaxFailures$1.evaluate(TestRuleIgnoreAfterMaxFailures.java:70)
	at org.apache.lucene.util.TestRuleIgnoreTestSuites$1.evaluate(TestRuleIgnoreTestSuites.java:55)
	at com.carrotsearch.randomizedtesting.rules.StatementAdapter.evaluate(StatementAdapter.java:36)
	at com.carrotsearch.randomizedtesting.ThreadLeakControl$StatementRunner.run(ThreadLeakControl.java:358)
	at java.lang.Thread.run(Thread.java:722)
Caused by: java.lang.NullPointerException
	at org.apache.solr.util.TestHarness.getCore(TestHarness.java:212)
	at org.apache.solr.SolrTestCaseJ4.updateJ(SolrTestCaseJ4.java:797)
	at org.apache.solr.SolrTestCaseJ4.deleteByQueryAndGetVersion(SolrTestCaseJ4.java:947)
	at org.apache.solr.search.TestRecovery.clearIndex(TestRecovery.java:78)
	... 41 more


REGRESSION:  org.apache.solr.search.TestRecovery.testCleanShutdown

Error Message:


Stack Trace:
java.lang.NullPointerException
	at __randomizedtesting.SeedInfo.seed([B1AB8B0A619B39FF:2FE433CD040261BA]:0)
	at org.apache.solr.util.TestHarness.getCore(TestHarness.java:212)
	at org.apache.solr.util.TestHarness$LocalRequestFactory.makeRequest(TestHarness.java:625)
	at org.apache.solr.SolrTestCaseJ4.req(SolrTestCaseJ4.java:742)
	at org.apache.solr.search.TestRecovery.testCleanShutdown(TestRecovery.java:644)
	at sun.reflect.NativeMethodAccessorImpl.invoke0(Native Method)
	at sun.reflect.NativeMethodAccessorImpl.invoke(NativeMethodAccessorImpl.java:57)
	at sun.reflect.DelegatingMethodAccessorImpl.invoke(DelegatingMethodAccessorImpl.java:43)
	at java.lang.reflect.Method.invoke(Method.java:601)
	at com.carrotsearch.randomizedtesting.RandomizedRunner.invoke(RandomizedRunner.java:1559)
	at com.carrotsearch.randomizedtesting.RandomizedRunner.access$600(RandomizedRunner.java:79)
	at com.carrotsearch.randomizedtesting.RandomizedRunner$6.evaluate(RandomizedRunner.java:737)
	at com.carrotsearch.randomizedtesting.RandomizedRunner$7.evaluate(RandomizedRunner.java:773)
	at com.carrotsearch.randomizedtesting.RandomizedRunner$8.evaluate(RandomizedRunner.java:787)
	at com.carrotsearch.randomizedtesting.rules.SystemPropertiesRestoreRule$1.evaluate(SystemPropertiesRestoreRule.java:53)
	at org.apache.lucene.util.TestRuleSetupTeardownChained$1.evaluate(TestRuleSetupTeardownChained.java:50)
	at org.apache.lucene.util.TestRuleFieldCacheSanity$1.evaluate(TestRuleFieldCacheSanity.java:51)
	at org.apache.lucene.util.AbstractBeforeAfterRule$1.evaluate(AbstractBeforeAfterRule.java:45)
	at com.carrotsearch.randomizedtesting.rules.SystemPropertiesInvariantRule$1.evaluate(SystemPropertiesInvariantRule.java:55)
	at org.apache.lucene.util.TestRuleThreadAndTestName$1.evaluate(TestRuleThreadAndTestName.java:48)
	at org.apache.lucene.util.TestRuleIgnoreAfterMaxFailures$1.evaluate(TestRuleIgnoreAfterMaxFailures.java:70)
	at org.apache.lucene.util.TestRuleMarkFailure$1.evaluate(TestRuleMarkFailure.java:48)
	at com.carrotsearch.randomizedtesting.rules.StatementAdapter.evaluate(StatementAdapter.java:36)
	at com.carrotsearch.randomizedtesting.ThreadLeakControl$StatementRunner.run(ThreadLeakControl.java:358)
	at com.carrotsearch.randomizedtesting.ThreadLeakControl.forkTimeoutingTask(ThreadLeakControl.java:782)
	at com.carrotsearch.randomizedtesting.ThreadLeakControl$3.evaluate(ThreadLeakControl.java:442)
	at com.carrotsearch.randomizedtesting.RandomizedRunner.runSingleTest(RandomizedRunner.java:746)
	at com.carrotsearch.randomizedtesting.RandomizedRunner$3.evaluate(RandomizedRunner.java:648)
	at com.carrotsearch.randomizedtesting.RandomizedRunner$4.evaluate(RandomizedRunner.java:682)
	at com.carrotsearch.randomizedtesting.RandomizedRunner$5.evaluate(RandomizedRunner.java:693)
	at com.carrotsearch.randomizedtesting.rules.StatementAdapter.evaluate(StatementAdapter.java:36)
	at com.carrotsearch.randomizedtesting.rules.SystemPropertiesRestoreRule$1.evaluate(SystemPropertiesRestoreRule.java:53)
	at org.apache.lucene.util.AbstractBeforeAfterRule$1.evaluate(AbstractBeforeAfterRule.java:45)
	at org.apache.lucene.util.TestRuleStoreClassName$1.evaluate(TestRuleStoreClassName.java:42)
	at com.carrotsearch.randomizedtesting.rules.SystemPropertiesInvariantRule$1.evaluate(SystemPropertiesInvariantRule.java:55)
	at com.carrotsearch.randomizedtesting.rules.NoShadowingOrOverridesOnMethodsRule$1.evaluate(NoShadowingOrOverridesOnMethodsRule.java:39)
	at com.carrotsearch.randomizedtesting.rules.NoShadowingOrOverridesOnMethodsRule$1.evaluate(NoShadowingOrOverridesOnMethodsRule.java:39)
	at com.carrotsearch.randomizedtesting.rules.StatementAdapter.evaluate(StatementAdapter.java:36)
	at org.apache.lucene.util.TestRuleAssertionsRequired$1.evaluate(TestRuleAssertionsRequired.java:43)
	at org.apache.lucene.util.TestRuleMarkFailure$1.evaluate(TestRuleMarkFailure.java:48)
	at org.apache.lucene.util.TestRuleIgnoreAfterMaxFailures$1.evaluate(TestRuleIgnoreAfterMaxFailures.java:70)
	at org.apache.lucene.util.TestRuleIgnoreTestSuites$1.evaluate(TestRuleIgnoreTestSuites.java:55)
	at com.carrotsearch.randomizedtesting.rules.StatementAdapter.evaluate(StatementAdapter.java:36)
	at com.carrotsearch.randomizedtesting.ThreadLeakControl$StatementRunner.run(ThreadLeakControl.java:358)
	at java.lang.Thread.run(Thread.java:722)


REGRESSION:  org.apache.solr.search.TestRecovery.testRecoveryMultipleLogs

Error Message:


Stack Trace:
java.lang.NullPointerException
	at __randomizedtesting.SeedInfo.seed([B1AB8B0A619B39FF:83E133BE6E07E16]:0)
	at org.apache.solr.util.TestHarness.getCore(TestHarness.java:212)
	at org.apache.solr.search.TestRecovery.testRecoveryMultipleLogs(TestRecovery.java:957)
	at sun.reflect.NativeMethodAccessorImpl.invoke0(Native Method)
	at sun.reflect.NativeMethodAccessorImpl.invoke(NativeMethodAccessorImpl.java:57)
	at sun.reflect.DelegatingMethodAccessorImpl.invoke(DelegatingMethodAccessorImpl.java:43)
	at java.lang.reflect.Method.invoke(Method.java:601)
	at com.carrotsearch.randomizedtesting.RandomizedRunner.invoke(RandomizedRunner.java:1559)
	at com.carrotsearch.randomizedtesting.RandomizedRunner.access$600(RandomizedRunner.java:79)
	at com.carrotsearch.randomizedtesting.RandomizedRunner$6.evaluate(RandomizedRunner.java:737)
	at com.carrotsearch.randomizedtesting.RandomizedRunner$7.evaluate(RandomizedRunner.java:773)
	at com.carrotsearch.randomizedtesting.RandomizedRunner$8.evaluate(RandomizedRunner.java:787)
	at com.carrotsearch.randomizedtesting.rules.SystemPropertiesRestoreRule$1.evaluate(SystemPropertiesRestoreRule.java:53)
	at org.apache.lucene.util.TestRuleSetupTeardownChained$1.evaluate(TestRuleSetupTeardownChained.java:50)
	at org.apache.lucene.util.TestRuleFieldCacheSanity$1.evaluate(TestRuleFieldCacheSanity.java:51)
	at org.apache.lucene.util.AbstractBeforeAfterRule$1.evaluate(AbstractBeforeAfterRule.java:45)
	at com.carrotsearch.randomizedtesting.rules.SystemPropertiesInvariantRule$1.evaluate(SystemPropertiesInvariantRule.java:55)
	at org.apache.lucene.util.TestRuleThreadAndTestName$1.evaluate(TestRuleThreadAndTestName.java:48)
	at org.apache.lucene.util.TestRuleIgnoreAfterMaxFailures$1.evaluate(TestRuleIgnoreAfterMaxFailures.java:70)
	at org.apache.lucene.util.TestRuleMarkFailure$1.evaluate(TestRuleMarkFailure.java:48)
	at com.carrotsearch.randomizedtesting.rules.StatementAdapter.evaluate(StatementAdapter.java:36)
	at com.carrotsearch.randomizedtesting.ThreadLeakControl$StatementRunner.run(ThreadLeakControl.java:358)
	at com.carrotsearch.randomizedtesting.ThreadLeakControl.forkTimeoutingTask(ThreadLeakControl.java:782)
	at com.carrotsearch.randomizedtesting.ThreadLeakControl$3.evaluate(ThreadLeakControl.java:442)
	at com.carrotsearch.randomizedtesting.RandomizedRunner.runSingleTest(RandomizedRunner.java:746)
	at com.carrotsearch.randomizedtesting.RandomizedRunner$3.evaluate(RandomizedRunner.java:648)
	at com.carrotsearch.randomizedtesting.RandomizedRunner$4.evaluate(RandomizedRunner.java:682)
	at com.carrotsearch.randomizedtesting.RandomizedRunner$5.evaluate(RandomizedRunner.java:693)
	at com.carrotsearch.randomizedtesting.rules.StatementAdapter.evaluate(StatementAdapter.java:36)
	at com.carrotsearch.randomizedtesting.rules.SystemPropertiesRestoreRule$1.evaluate(SystemPropertiesRestoreRule.java:53)
	at org.apache.lucene.util.AbstractBeforeAfterRule$1.evaluate(AbstractBeforeAfterRule.java:45)
	at org.apache.lucene.util.TestRuleStoreClassName$1.evaluate(TestRuleStoreClassName.java:42)
	at com.carrotsearch.randomizedtesting.rules.SystemPropertiesInvariantRule$1.evaluate(SystemPropertiesInvariantRule.java:55)
	at com.carrotsearch.randomizedtesting.rules.NoShadowingOrOverridesOnMethodsRule$1.evaluate(NoShadowingOrOverridesOnMethodsRule.java:39)
	at com.carrotsearch.randomizedtesting.rules.NoShadowingOrOverridesOnMethodsRule$1.evaluate(NoShadowingOrOverridesOnMethodsRule.java:39)
	at com.carrotsearch.randomizedtesting.rules.StatementAdapter.evaluate(StatementAdapter.java:36)
	at org.apache.lucene.util.TestRuleAssertionsRequired$1.evaluate(TestRuleAssertionsRequired.java:43)
	at org.apache.lucene.util.TestRuleMarkFailure$1.evaluate(TestRuleMarkFailure.java:48)
	at org.apache.lucene.util.TestRuleIgnoreAfterMaxFailures$1.evaluate(TestRuleIgnoreAfterMaxFailures.java:70)
	at org.apache.lucene.util.TestRuleIgnoreTestSuites$1.evaluate(TestRuleIgnoreTestSuites.java:55)
	at com.carrotsearch.randomizedtesting.rules.StatementAdapter.evaluate(StatementAdapter.java:36)
	at com.carrotsearch.randomizedtesting.ThreadLeakControl$StatementRunner.run(ThreadLeakControl.java:358)
	at java.lang.Thread.run(Thread.java:722)


REGRESSION:  org.apache.solr.search.TestRecovery.testBuffering

Error Message:


Stack Trace:
java.lang.NullPointerException
	at __randomizedtesting.SeedInfo.seed([B1AB8B0A619B39FF:AC452521C0C298D4]:0)
	at org.apache.solr.util.TestHarness.getCore(TestHarness.java:212)
	at org.apache.solr.util.TestHarness$LocalRequestFactory.makeRequest(TestHarness.java:625)
	at org.apache.solr.SolrTestCaseJ4.req(SolrTestCaseJ4.java:742)
	at org.apache.solr.search.TestRecovery.testBuffering(TestRecovery.java:216)
	at sun.reflect.NativeMethodAccessorImpl.invoke0(Native Method)
	at sun.reflect.NativeMethodAccessorImpl.invoke(NativeMethodAccessorImpl.java:57)
	at sun.reflect.DelegatingMethodAccessorImpl.invoke(DelegatingMethodAccessorImpl.java:43)
	at java.lang.reflect.Method.invoke(Method.java:601)
	at com.carrotsearch.randomizedtesting.RandomizedRunner.invoke(RandomizedRunner.java:1559)
	at com.carrotsearch.randomizedtesting.RandomizedRunner.access$600(RandomizedRunner.java:79)
	at com.carrotsearch.randomizedtesting.RandomizedRunner$6.evaluate(RandomizedRunner.java:737)
	at com.carrotsearch.randomizedtesting.RandomizedRunner$7.evaluate(RandomizedRunner.java:773)
	at com.carrotsearch.randomizedtesting.RandomizedRunner$8.evaluate(RandomizedRunner.java:787)
	at com.carrotsearch.randomizedtesting.rules.SystemPropertiesRestoreRule$1.evaluate(SystemPropertiesRestoreRule.java:53)
	at org.apache.lucene.util.TestRuleSetupTeardownChained$1.evaluate(TestRuleSetupTeardownChained.java:50)
	at org.apache.lucene.util.TestRuleFieldCacheSanity$1.evaluate(TestRuleFieldCacheSanity.java:51)
	at org.apache.lucene.util.AbstractBeforeAfterRule$1.evaluate(AbstractBeforeAfterRule.java:45)
	at com.carrotsearch.randomizedtesting.rules.SystemPropertiesInvariantRule$1.evaluate(SystemPropertiesInvariantRule.java:55)
	at org.apache.lucene.util.TestRuleThreadAndTestName$1.evaluate(TestRuleThreadAndTestName.java:48)
	at org.apache.lucene.util.TestRuleIgnoreAfterMaxFailures$1.evaluate(TestRuleIgnoreAfterMaxFailures.java:70)
	at org.apache.lucene.util.TestRuleMarkFailure$1.evaluate(TestRuleMarkFailure.java:48)
	at com.carrotsearch.randomizedtesting.rules.StatementAdapter.evaluate(StatementAdapter.java:36)
	at com.carrotsearch.randomizedtesting.ThreadLeakControl$StatementRunner.run(ThreadLeakControl.java:358)
	at com.carrotsearch.randomizedtesting.ThreadLeakControl.forkTimeoutingTask(ThreadLeakControl.java:782)
	at com.carrotsearch.randomizedtesting.ThreadLeakControl$3.evaluate(ThreadLeakControl.java:442)
	at com.carrotsearch.randomizedtesting.RandomizedRunner.runSingleTest(RandomizedRunner.java:746)
	at com.carrotsearch.randomizedtesting.RandomizedRunner$3.evaluate(RandomizedRunner.java:648)
	at com.carrotsearch.randomizedtesting.RandomizedRunner$4.evaluate(RandomizedRunner.java:682)
	at com.carrotsearch.randomizedtesting.RandomizedRunner$5.evaluate(RandomizedRunner.java:693)
	at com.carrotsearch.randomizedtesting.rules.StatementAdapter.evaluate(StatementAdapter.java:36)
	at com.carrotsearch.randomizedtesting.rules.SystemPropertiesRestoreRule$1.evaluate(SystemPropertiesRestoreRule.java:53)
	at org.apache.lucene.util.AbstractBeforeAfterRule$1.evaluate(AbstractBeforeAfterRule.java:45)
	at org.apache.lucene.util.TestRuleStoreClassName$1.evaluate(TestRuleStoreClassName.java:42)
	at com.carrotsearch.randomizedtesting.rules.SystemPropertiesInvariantRule$1.evaluate(SystemPropertiesInvariantRule.java:55)
	at com.carrotsearch.randomizedtesting.rules.NoShadowingOrOverridesOnMethodsRule$1.evaluate(NoShadowingOrOverridesOnMethodsRule.java:39)
	at com.carrotsearch.randomizedtesting.rules.NoShadowingOrOverridesOnMethodsRule$1.evaluate(NoShadowingOrOverridesOnMethodsRule.java:39)
	at com.carrotsearch.randomizedtesting.rules.StatementAdapter.evaluate(StatementAdapter.java:36)
	at org.apache.lucene.util.TestRuleAssertionsRequired$1.evaluate(TestRuleAssertionsRequired.java:43)
	at org.apache.lucene.util.TestRuleMarkFailure$1.evaluate(TestRuleMarkFailure.java:48)
	at org.apache.lucene.util.TestRuleIgnoreAfterMaxFailures$1.evaluate(TestRuleIgnoreAfterMaxFailures.java:70)
	at org.apache.lucene.util.TestRuleIgnoreTestSuites$1.evaluate(TestRuleIgnoreTestSuites.java:55)
	at com.carrotsearch.randomizedtesting.rules.StatementAdapter.evaluate(StatementAdapter.java:36)
	at com.carrotsearch.randomizedtesting.ThreadLeakControl$StatementRunner.run(ThreadLeakControl.java:358)
	at java.lang.Thread.run(Thread.java:722)


REGRESSION:  org.apache.solr.search.TestRecovery.testDropBuffered

Error Message:


Stack Trace:
java.lang.NullPointerException
	at __randomizedtesting.SeedInfo.seed([B1AB8B0A619B39FF:9557A058B4D54CE3]:0)
	at org.apache.solr.util.TestHarness.getCore(TestHarness.java:212)
	at org.apache.solr.util.TestHarness$LocalRequestFactory.makeRequest(TestHarness.java:625)
	at org.apache.solr.SolrTestCaseJ4.req(SolrTestCaseJ4.java:742)
	at org.apache.solr.search.TestRecovery.testDropBuffered(TestRecovery.java:378)
	at sun.reflect.NativeMethodAccessorImpl.invoke0(Native Method)
	at sun.reflect.NativeMethodAccessorImpl.invoke(NativeMethodAccessorImpl.java:57)
	at sun.reflect.DelegatingMethodAccessorImpl.invoke(DelegatingMethodAccessorImpl.java:43)
	at java.lang.reflect.Method.invoke(Method.java:601)
	at com.carrotsearch.randomizedtesting.RandomizedRunner.invoke(RandomizedRunner.java:1559)
	at com.carrotsearch.randomizedtesting.RandomizedRunner.access$600(RandomizedRunner.java:79)
	at com.carrotsearch.randomizedtesting.RandomizedRunner$6.evaluate(RandomizedRunner.java:737)
	at com.carrotsearch.randomizedtesting.RandomizedRunner$7.evaluate(RandomizedRunner.java:773)
	at com.carrotsearch.randomizedtesting.RandomizedRunner$8.evaluate(RandomizedRunner.java:787)
	at com.carrotsearch.randomizedtesting.rules.SystemPropertiesRestoreRule$1.evaluate(SystemPropertiesRestoreRule.java:53)
	at org.apache.lucene.util.TestRuleSetupTeardownChained$1.evaluate(TestRuleSetupTeardownChained.java:50)
	at org.apache.lucene.util.TestRuleFieldCacheSanity$1.evaluate(TestRuleFieldCacheSanity.java:51)
	at org.apache.lucene.util.AbstractBeforeAfterRule$1.evaluate(AbstractBeforeAfterRule.java:45)
	at com.carrotsearch.randomizedtesting.rules.SystemPropertiesInvariantRule$1.evaluate(SystemPropertiesInvariantRule.java:55)
	at org.apache.lucene.util.TestRuleThreadAndTestName$1.evaluate(TestRuleThreadAndTestName.java:48)
	at org.apache.lucene.util.TestRuleIgnoreAfterMaxFailures$1.evaluate(TestRuleIgnoreAfterMaxFailures.java:70)
	at org.apache.lucene.util.TestRuleMarkFailure$1.evaluate(TestRuleMarkFailure.java:48)
	at com.carrotsearch.randomizedtesting.rules.StatementAdapter.evaluate(StatementAdapter.java:36)
	at com.carrotsearch.randomizedtesting.ThreadLeakControl$StatementRunner.run(ThreadLeakControl.java:358)
	at com.carrotsearch.randomizedtesting.ThreadLeakControl.forkTimeoutingTask(ThreadLeakControl.java:782)
	at com.carrotsearch.randomizedtesting.ThreadLeakControl$3.evaluate(ThreadLeakControl.java:442)
	at com.carrotsearch.randomizedtesting.RandomizedRunner.runSingleTest(RandomizedRunner.java:746)
	at com.carrotsearch.randomizedtesting.RandomizedRunner$3.evaluate(RandomizedRunner.java:648)
	at com.carrotsearch.randomizedtesting.RandomizedRunner$4.evaluate(RandomizedRunner.java:682)
	at com.carrotsearch.randomizedtesting.RandomizedRunner$5.evaluate(RandomizedRunner.java:693)
	at com.carrotsearch.randomizedtesting.rules.StatementAdapter.evaluate(StatementAdapter.java:36)
	at com.carrotsearch.randomizedtesting.rules.SystemPropertiesRestoreRule$1.evaluate(SystemPropertiesRestoreRule.java:53)
	at org.apache.lucene.util.AbstractBeforeAfterRule$1.evaluate(AbstractBeforeAfterRule.java:45)
	at org.apache.lucene.util.TestRuleStoreClassName$1.evaluate(TestRuleStoreClassName.java:42)
	at com.carrotsearch.randomizedtesting.rules.SystemPropertiesInvariantRule$1.evaluate(SystemPropertiesInvariantRule.java:55)
	at com.carrotsearch.randomizedtesting.rules.NoShadowingOrOverridesOnMethodsRule$1.evaluate(NoShadowingOrOverridesOnMethodsRule.java:39)
	at com.carrotsearch.randomizedtesting.rules.NoShadowingOrOverridesOnMethodsRule$1.evaluate(NoShadowingOrOverridesOnMethodsRule.java:39)
	at com.carrotsearch.randomizedtesting.rules.StatementAdapter.evaluate(StatementAdapter.java:36)
	at org.apache.lucene.util.TestRuleAssertionsRequired$1.evaluate(TestRuleAssertionsRequired.java:43)
	at org.apache.lucene.util.TestRuleMarkFailure$1.evaluate(TestRuleMarkFailure.java:48)
	at org.apache.lucene.util.TestRuleIgnoreAfterMaxFailures$1.evaluate(TestRuleIgnoreAfterMaxFailures.java:70)
	at org.apache.lucene.util.TestRuleIgnoreTestSuites$1.evaluate(TestRuleIgnoreTestSuites.java:55)
	at com.carrotsearch.randomizedtesting.rules.StatementAdapter.evaluate(StatementAdapter.java:36)
	at com.carrotsearch.randomizedtesting.ThreadLeakControl$StatementRunner.run(ThreadLeakControl.java:358)
	at java.lang.Thread.run(Thread.java:722)


FAILED:  org.apache.solr.search.TestRecovery.testCorruptLog

Error Message:
expected:<0> but was:<1>

Stack Trace:
java.lang.AssertionError: expected:<0> but was:<1>
	at __randomizedtesting.SeedInfo.seed([B1AB8B0A619B39FF:43763FD99BA36823]:0)
	at org.junit.Assert.fail(Assert.java:93)
	at org.junit.Assert.failNotEquals(Assert.java:647)
	at org.junit.Assert.assertEquals(Assert.java:128)
	at org.junit.Assert.assertEquals(Assert.java:472)
	at org.junit.Assert.assertEquals(Assert.java:456)
	at org.apache.solr.search.TestRecovery.deleteLogs(TestRecovery.java:1046)
	at org.apache.solr.search.TestRecovery.testCorruptLog(TestRecovery.java:920)
	at sun.reflect.NativeMethodAccessorImpl.invoke0(Native Method)
	at sun.reflect.NativeMethodAccessorImpl.invoke(NativeMethodAccessorImpl.java:57)
	at sun.reflect.DelegatingMethodAccessorImpl.invoke(DelegatingMethodAccessorImpl.java:43)
	at java.lang.reflect.Method.invoke(Method.java:601)
	at com.carrotsearch.randomizedtesting.RandomizedRunner.invoke(RandomizedRunner.java:1559)
	at com.carrotsearch.randomizedtesting.RandomizedRunner.access$600(RandomizedRunner.java:79)
	at com.carrotsearch.randomizedtesting.RandomizedRunner$6.evaluate(RandomizedRunner.java:737)
	at com.carrotsearch.randomizedtesting.RandomizedRunner$7.evaluate(RandomizedRunner.java:773)
	at com.carrotsearch.randomizedtesting.RandomizedRunner$8.evaluate(RandomizedRunner.java:787)
	at com.carrotsearch.randomizedtesting.rules.SystemPropertiesRestoreRule$1.evaluate(SystemPropertiesRestoreRule.java:53)
	at org.apache.lucene.util.TestRuleSetupTeardownChained$1.evaluate(TestRuleSetupTeardownChained.java:50)
	at org.apache.lucene.util.TestRuleFieldCacheSanity$1.evaluate(TestRuleFieldCacheSanity.java:51)
	at org.apache.lucene.util.AbstractBeforeAfterRule$1.evaluate(AbstractBeforeAfterRule.java:45)
	at com.carrotsearch.randomizedtesting.rules.SystemPropertiesInvariantRule$1.evaluate(SystemPropertiesInvariantRule.java:55)
	at org.apache.lucene.util.TestRuleThreadAndTestName$1.evaluate(TestRuleThreadAndTestName.java:48)
	at org.apache.lucene.util.TestRuleIgnoreAfterMaxFailures$1.evaluate(TestRuleIgnoreAfterMaxFailures.java:70)
	at org.apache.lucene.util.TestRuleMarkFailure$1.evaluate(TestRuleMarkFailure.java:48)
	at com.carrotsearch.randomizedtesting.rules.StatementAdapter.evaluate(StatementAdapter.java:36)
	at com.carrotsearch.randomizedtesting.ThreadLeakControl$StatementRunner.run(ThreadLeakControl.java:358)
	at com.carrotsearch.randomizedtesting.ThreadLeakControl.forkTimeoutingTask(ThreadLeakControl.java:782)
	at com.carrotsearch.randomizedtesting.ThreadLeakControl$3.evaluate(ThreadLeakControl.java:442)
	at com.carrotsearch.randomizedtesting.RandomizedRunner.runSingleTest(RandomizedRunner.java:746)
	at com.carrotsearch.randomizedtesting.RandomizedRunner$3.evaluate(RandomizedRunner.java:648)
	at com.carrotsearch.randomizedtesting.RandomizedRunner$4.evaluate(RandomizedRunner.java:682)
	at com.carrotsearch.randomizedtesting.RandomizedRunner$5.evaluate(RandomizedRunner.java:693)
	at com.carrotsearch.randomizedtesting.rules.StatementAdapter.evaluate(StatementAdapter.java:36)
	at com.carrotsearch.randomizedtesting.rules.SystemPropertiesRestoreRule$1.evaluate(SystemPropertiesRestoreRule.java:53)
	at org.apache.lucene.util.AbstractBeforeAfterRule$1.evaluate(AbstractBeforeAfterRule.java:45)
	at org.apache.lucene.util.TestRuleStoreClassName$1.evaluate(TestRuleStoreClassName.java:42)
	at com.carrotsearch.randomizedtesting.rules.SystemPropertiesInvariantRule$1.evaluate(SystemPropertiesInvariantRule.java:55)
	at com.carrotsearch.randomizedtesting.rules.NoShadowingOrOverridesOnMethodsRule$1.evaluate(NoShadowingOrOverridesOnMethodsRule.java:39)
	at com.carrotsearch.randomizedtesting.rules.NoShadowingOrOverridesOnMethodsRule$1.evaluate(NoShadowingOrOverridesOnMethodsRule.java:39)
	at com.carrotsearch.randomizedtesting.rules.StatementAdapter.evaluate(StatementAdapter.java:36)
	at org.apache.lucene.util.TestRuleAssertionsRequired$1.evaluate(TestRuleAssertionsRequired.java:43)
	at org.apache.lucene.util.TestRuleMarkFailure$1.evaluate(TestRuleMarkFailure.java:48)
	at org.apache.lucene.util.TestRuleIgnoreAfterMaxFailures$1.evaluate(TestRuleIgnoreAfterMaxFailures.java:70)
	at org.apache.lucene.util.TestRuleIgnoreTestSuites$1.evaluate(TestRuleIgnoreTestSuites.java:55)
	at com.carrotsearch.randomizedtesting.rules.StatementAdapter.evaluate(StatementAdapter.java:36)
	at com.carrotsearch.randomizedtesting.ThreadLeakControl$StatementRunner.run(ThreadLeakControl.java:358)
	at java.lang.Thread.run(Thread.java:722)


FAILED:  org.apache.solr.search.TestRecovery.testRemoveOldLogs

Error Message:
java.lang.NullPointerException

Stack Trace:
java.lang.RuntimeException: java.lang.NullPointerException
	at __randomizedtesting.SeedInfo.seed([B1AB8B0A619B39FF:90374AA1A9A1B007]:0)
	at org.apache.solr.search.TestRecovery.clearIndex(TestRecovery.java:80)
	at org.apache.solr.search.TestRecovery.testRemoveOldLogs(TestRecovery.java:709)
	at sun.reflect.NativeMethodAccessorImpl.invoke0(Native Method)
	at sun.reflect.NativeMethodAccessorImpl.invoke(NativeMethodAccessorImpl.java:57)
	at sun.reflect.DelegatingMethodAccessorImpl.invoke(DelegatingMethodAccessorImpl.java:43)
	at java.lang.reflect.Method.invoke(Method.java:601)
	at com.carrotsearch.randomizedtesting.RandomizedRunner.invoke(RandomizedRunner.java:1559)
	at com.carrotsearch.randomizedtesting.RandomizedRunner.access$600(RandomizedRunner.java:79)
	at com.carrotsearch.randomizedtesting.RandomizedRunner$6.evaluate(RandomizedRunner.java:737)
	at com.carrotsearch.randomizedtesting.RandomizedRunner$7.evaluate(RandomizedRunner.java:773)
	at com.carrotsearch.randomizedtesting.RandomizedRunner$8.evaluate(RandomizedRunner.java:787)
	at com.carrotsearch.randomizedtesting.rules.SystemPropertiesRestoreRule$1.evaluate(SystemPropertiesRestoreRule.java:53)
	at org.apache.lucene.util.TestRuleSetupTeardownChained$1.evaluate(TestRuleSetupTeardownChained.java:50)
	at org.apache.lucene.util.TestRuleFieldCacheSanity$1.evaluate(TestRuleFieldCacheSanity.java:51)
	at org.apache.lucene.util.AbstractBeforeAfterRule$1.evaluate(AbstractBeforeAfterRule.java:45)
	at com.carrotsearch.randomizedtesting.rules.SystemPropertiesInvariantRule$1.evaluate(SystemPropertiesInvariantRule.java:55)
	at org.apache.lucene.util.TestRuleThreadAndTestName$1.evaluate(TestRuleThreadAndTestName.java:48)
	at org.apache.lucene.util.TestRuleIgnoreAfterMaxFailures$1.evaluate(TestRuleIgnoreAfterMaxFailures.java:70)
	at org.apache.lucene.util.TestRuleMarkFailure$1.evaluate(TestRuleMarkFailure.java:48)
	at com.carrotsearch.randomizedtesting.rules.StatementAdapter.evaluate(StatementAdapter.java:36)
	at com.carrotsearch.randomizedtesting.ThreadLeakControl$StatementRunner.run(ThreadLeakControl.java:358)
	at com.carrotsearch.randomizedtesting.ThreadLeakControl.forkTimeoutingTask(ThreadLeakControl.java:782)
	at com.carrotsearch.randomizedtesting.ThreadLeakControl$3.evaluate(ThreadLeakControl.java:442)
	at com.carrotsearch.randomizedtesting.RandomizedRunner.runSingleTest(RandomizedRunner.java:746)
	at com.carrotsearch.randomizedtesting.RandomizedRunner$3.evaluate(RandomizedRunner.java:648)
	at com.carrotsearch.randomizedtesting.RandomizedRunner$4.evaluate(RandomizedRunner.java:682)
	at com.carrotsearch.randomizedtesting.RandomizedRunner$5.evaluate(RandomizedRunner.java:693)
	at com.carrotsearch.randomizedtesting.rules.StatementAdapter.evaluate(StatementAdapter.java:36)
	at com.carrotsearch.randomizedtesting.rules.SystemPropertiesRestoreRule$1.evaluate(SystemPropertiesRestoreRule.java:53)
	at org.apache.lucene.util.AbstractBeforeAfterRule$1.evaluate(AbstractBeforeAfterRule.java:45)
	at org.apache.lucene.util.TestRuleStoreClassName$1.evaluate(TestRuleStoreClassName.java:42)
	at com.carrotsearch.randomizedtesting.rules.SystemPropertiesInvariantRule$1.evaluate(SystemPropertiesInvariantRule.java:55)
	at com.carrotsearch.randomizedtesting.rules.NoShadowingOrOverridesOnMethodsRule$1.evaluate(NoShadowingOrOverridesOnMethodsRule.java:39)
	at com.carrotsearch.randomizedtesting.rules.NoShadowingOrOverridesOnMethodsRule$1.evaluate(NoShadowingOrOverridesOnMethodsRule.java:39)
	at com.carrotsearch.randomizedtesting.rules.StatementAdapter.evaluate(StatementAdapter.java:36)
	at org.apache.lucene.util.TestRuleAssertionsRequired$1.evaluate(TestRuleAssertionsRequired.java:43)
	at org.apache.lucene.util.TestRuleMarkFailure$1.evaluate(TestRuleMarkFailure.java:48)
	at org.apache.lucene.util.TestRuleIgnoreAfterMaxFailures$1.evaluate(TestRuleIgnoreAfterMaxFailures.java:70)
	at org.apache.lucene.util.TestRuleIgnoreTestSuites$1.evaluate(TestRuleIgnoreTestSuites.java:55)
	at com.carrotsearch.randomizedtesting.rules.StatementAdapter.evaluate(StatementAdapter.java:36)
	at com.carrotsearch.randomizedtesting.ThreadLeakControl$StatementRunner.run(ThreadLeakControl.java:358)
	at java.lang.Thread.run(Thread.java:722)
Caused by: java.lang.NullPointerException
	at org.apache.solr.util.TestHarness.getCore(TestHarness.java:212)
	at org.apache.solr.SolrTestCaseJ4.updateJ(SolrTestCaseJ4.java:797)
	at org.apache.solr.SolrTestCaseJ4.deleteByQueryAndGetVersion(SolrTestCaseJ4.java:947)
	at org.apache.solr.search.TestRecovery.clearIndex(TestRecovery.java:78)
	... 41 more


FAILED:  org.apache.solr.search.TestRecovery.testTruncatedLog

Error Message:


Stack Trace:
java.lang.NullPointerException
	at __randomizedtesting.SeedInfo.seed([B1AB8B0A619B39FF:D591737268A2448C]:0)
	at org.apache.solr.util.TestHarness.getCore(TestHarness.java:212)
	at org.apache.solr.search.TestRecovery.testTruncatedLog(TestRecovery.java:822)
	at sun.reflect.NativeMethodAccessorImpl.invoke0(Native Method)
	at sun.reflect.NativeMethodAccessorImpl.invoke(NativeMethodAccessorImpl.java:57)
	at sun.reflect.DelegatingMethodAccessorImpl.invoke(DelegatingMethodAccessorImpl.java:43)
	at java.lang.reflect.Method.invoke(Method.java:601)
	at com.carrotsearch.randomizedtesting.RandomizedRunner.invoke(RandomizedRunner.java:1559)
	at com.carrotsearch.randomizedtesting.RandomizedRunner.access$600(RandomizedRunner.java:79)
	at com.carrotsearch.randomizedtesting.RandomizedRunner$6.evaluate(RandomizedRunner.java:737)
	at com.carrotsearch.randomizedtesting.RandomizedRunner$7.evaluate(RandomizedRunner.java:773)
	at com.carrotsearch.randomizedtesting.RandomizedRunner$8.evaluate(RandomizedRunner.java:787)
	at com.carrotsearch.randomizedtesting.rules.SystemPropertiesRestoreRule$1.evaluate(SystemPropertiesRestoreRule.java:53)
	at org.apache.lucene.util.TestRuleSetupTeardownChained$1.evaluate(TestRuleSetupTeardownChained.java:50)
	at org.apache.lucene.util.TestRuleFieldCacheSanity$1.evaluate(TestRuleFieldCacheSanity.java:51)
	at org.apache.lucene.util.AbstractBeforeAfterRule$1.evaluate(AbstractBeforeAfterRule.java:45)
	at com.carrotsearch.randomizedtesting.rules.SystemPropertiesInvariantRule$1.evaluate(SystemPropertiesInvariantRule.java:55)
	at org.apache.lucene.util.TestRuleThreadAndTestName$1.evaluate(TestRuleThreadAndTestName.java:48)
	at org.apache.lucene.util.TestRuleIgnoreAfterMaxFailures$1.evaluate(TestRuleIgnoreAfterMaxFailures.java:70)
	at org.apache.lucene.util.TestRuleMarkFailure$1.evaluate(TestRuleMarkFailure.java:48)
	at com.carrotsearch.randomizedtesting.rules.StatementAdapter.evaluate(StatementAdapter.java:36)
	at com.carrotsearch.randomizedtesting.ThreadLeakControl$StatementRunner.run(ThreadLeakControl.java:358)
	at com.carrotsearch.randomizedtesting.ThreadLeakControl.forkTimeoutingTask(ThreadLeakControl.java:782)
	at com.carrotsearch.randomizedtesting.ThreadLeakControl$3.evaluate(ThreadLeakControl.java:442)
	at com.carrotsearch.randomizedtesting.RandomizedRunner.runSingleTest(RandomizedRunner.java:746)
	at com.carrotsearch.randomizedtesting.RandomizedRunner$3.evaluate(RandomizedRunner.java:648)
	at com.carrotsearch.randomizedtesting.RandomizedRunner$4.evaluate(RandomizedRunner.java:682)
	at com.carrotsearch.randomizedtesting.RandomizedRunner$5.evaluate(RandomizedRunner.java:693)
	at com.carrotsearch.randomizedtesting.rules.StatementAdapter.evaluate(StatementAdapter.java:36)
	at com.carrotsearch.randomizedtesting.rules.SystemPropertiesRestoreRule$1.evaluate(SystemPropertiesRestoreRule.java:53)
	at org.apache.lucene.util.AbstractBeforeAfterRule$1.evaluate(AbstractBeforeAfterRule.java:45)
	at org.apache.lucene.util.TestRuleStoreClassName$1.evaluate(TestRuleStoreClassName.java:42)
	at com.carrotsearch.randomizedtesting.rules.SystemPropertiesInvariantRule$1.evaluate(SystemPropertiesInvariantRule.java:55)
	at com.carrotsearch.randomizedtesting.rules.NoShadowingOrOverridesOnMethodsRule$1.evaluate(NoShadowingOrOverridesOnMethodsRule.java:39)
	at com.carrotsearch.randomizedtesting.rules.NoShadowingOrOverridesOnMethodsRule$1.evaluate(NoShadowingOrOverridesOnMethodsRule.java:39)
	at com.carrotsearch.randomizedtesting.rules.StatementAdapter.evaluate(StatementAdapter.java:36)
	at org.apache.lucene.util.TestRuleAssertionsRequired$1.evaluate(TestRuleAssertionsRequired.java:43)
	at org.apache.lucene.util.TestRuleMarkFailure$1.evaluate(TestRuleMarkFailure.java:48)
	at org.apache.lucene.util.TestRuleIgnoreAfterMaxFailures$1.evaluate(TestRuleIgnoreAfterMaxFailures.java:70)
	at org.apache.lucene.util.TestRuleIgnoreTestSuites$1.evaluate(TestRuleIgnoreTestSuites.java:55)
	at com.carrotsearch.randomizedtesting.rules.StatementAdapter.evaluate(StatementAdapter.java:36)
	at com.carrotsearch.randomizedtesting.ThreadLeakControl$StatementRunner.run(ThreadLeakControl.java:358)
	at java.lang.Thread.run(Thread.java:722)


FAILED:  org.apache.solr.search.TestRecovery.testVersionsOnRestart

Error Message:
java.lang.NullPointerException

Stack Trace:
java.lang.RuntimeException: java.lang.NullPointerException
	at __randomizedtesting.SeedInfo.seed([B1AB8B0A619B39FF:D105AB741EC5E970]:0)
	at org.apache.solr.search.TestRecovery.clearIndex(TestRecovery.java:80)
	at org.apache.solr.search.TestRecovery.testVersionsOnRestart(TestRecovery.java:594)
	at sun.reflect.NativeMethodAccessorImpl.invoke0(Native Method)
	at sun.reflect.NativeMethodAccessorImpl.invoke(NativeMethodAccessorImpl.java:57)
	at sun.reflect.DelegatingMethodAccessorImpl.invoke(DelegatingMethodAccessorImpl.java:43)
	at java.lang.reflect.Method.invoke(Method.java:601)
	at com.carrotsearch.randomizedtesting.RandomizedRunner.invoke(RandomizedRunner.java:1559)
	at com.carrotsearch.randomizedtesting.RandomizedRunner.access$600(RandomizedRunner.java:79)
	at com.carrotsearch.randomizedtesting.RandomizedRunner$6.evaluate(RandomizedRunner.java:737)
	at com.carrotsearch.randomizedtesting.RandomizedRunner$7.evaluate(RandomizedRunner.java:773)
	at com.carrotsearch.randomizedtesting.RandomizedRunner$8.evaluate(RandomizedRunner.java:787)
	at com.carrotsearch.randomizedtesting.rules.SystemPropertiesRestoreRule$1.evaluate(SystemPropertiesRestoreRule.java:53)
	at org.apache.lucene.util.TestRuleSetupTeardownChained$1.evaluate(TestRuleSetupTeardownChained.java:50)
	at org.apache.lucene.util.TestRuleFieldCacheSanity$1.evaluate(TestRuleFieldCacheSanity.java:51)
	at org.apache.lucene.util.AbstractBeforeAfterRule$1.evaluate(AbstractBeforeAfterRule.java:45)
	at com.carrotsearch.randomizedtesting.rules.SystemPropertiesInvariantRule$1.evaluate(SystemPropertiesInvariantRule.java:55)
	at org.apache.lucene.util.TestRuleThreadAndTestName$1.evaluate(TestRuleThreadAndTestName.java:48)
	at org.apache.lucene.util.TestRuleIgnoreAfterMaxFailures$1.evaluate(TestRuleIgnoreAfterMaxFailures.java:70)
	at org.apache.lucene.util.TestRuleMarkFailure$1.evaluate(TestRuleMarkFailure.java:48)
	at com.carrotsearch.randomizedtesting.rules.StatementAdapter.evaluate(StatementAdapter.java:36)
	at com.carrotsearch.randomizedtesting.ThreadLeakControl$StatementRunner.run(ThreadLeakControl.java:358)
	at com.carrotsearch.randomizedtesting.ThreadLeakControl.forkTimeoutingTask(ThreadLeakControl.java:782)
	at com.carrotsearch.randomizedtesting.ThreadLeakControl$3.evaluate(ThreadLeakControl.java:442)
	at com.carrotsearch.randomizedtesting.RandomizedRunner.runSingleTest(RandomizedRunner.java:746)
	at com.carrotsearch.randomizedtesting.RandomizedRunner$3.evaluate(RandomizedRunner.java:648)
	at com.carrotsearch.randomizedtesting.RandomizedRunner$4.evaluate(RandomizedRunner.java:682)
	at com.carrotsearch.randomizedtesting.RandomizedRunner$5.evaluate(RandomizedRunner.java:693)
	at com.carrotsearch.randomizedtesting.rules.StatementAdapter.evaluate(StatementAdapter.java:36)
	at com.carrotsearch.randomizedtesting.rules.SystemPropertiesRestoreRule$1.evaluate(SystemPropertiesRestoreRule.java:53)
	at org.apache.lucene.util.AbstractBeforeAfterRule$1.evaluate(AbstractBeforeAfterRule.java:45)
	at org.apache.lucene.util.TestRuleStoreClassName$1.evaluate(TestRuleStoreClassName.java:42)
	at com.carrotsearch.randomizedtesting.rules.SystemPropertiesInvariantRule$1.evaluate(SystemPropertiesInvariantRule.java:55)
	at com.carrotsearch.randomizedtesting.rules.NoShadowingOrOverridesOnMethodsRule$1.evaluate(NoShadowingOrOverridesOnMethodsRule.java:39)
	at com.carrotsearch.randomizedtesting.rules.NoShadowingOrOverridesOnMethodsRule$1.evaluate(NoShadowingOrOverridesOnMethodsRule.java:39)
	at com.carrotsearch.randomizedtesting.rules.StatementAdapter.evaluate(StatementAdapter.java:36)
	at org.apache.lucene.util.TestRuleAssertionsRequired$1.evaluate(TestRuleAssertionsRequired.java:43)
	at org.apache.lucene.util.TestRuleMarkFailure$1.evaluate(TestRuleMarkFailure.java:48)
	at org.apache.lucene.util.TestRuleIgnoreAfterMaxFailures$1.evaluate(TestRuleIgnoreAfterMaxFailures.java:70)
	at org.apache.lucene.util.TestRuleIgnoreTestSuites$1.evaluate(TestRuleIgnoreTestSuites.java:55)
	at com.carrotsearch.randomizedtesting.rules.StatementAdapter.evaluate(StatementAdapter.java:36)
	at com.carrotsearch.randomizedtesting.ThreadLeakControl$StatementRunner.run(ThreadLeakControl.java:358)
	at java.lang.Thread.run(Thread.java:722)
Caused by: java.lang.NullPointerException
	at org.apache.solr.util.TestHarness.getCore(TestHarness.java:212)
	at org.apache.solr.SolrTestCaseJ4.updateJ(SolrTestCaseJ4.java:797)
	at org.apache.solr.SolrTestCaseJ4.deleteByQueryAndGetVersion(SolrTestCaseJ4.java:947)
	at org.apache.solr.search.TestRecovery.clearIndex(TestRecovery.java:78)
	... 41 more




Build Log:
[...truncated 7996 lines...]
[junit4:junit4] Suite: org.apache.solr.search.TestRecovery
[junit4:junit4]   2> 2 T3273 oas.SolrTestCaseJ4.initCore ####initCore
[junit4:junit4]   2> Creating dataDir: C:\Jenkins\workspace\Lucene-Solr-trunk-Windows\solr\build\solr-core\test\J0\.\solrtest-TestRecovery-1347569571334
[junit4:junit4]   2> 4 T3273 oasc.SolrResourceLoader.<init> new SolrResourceLoader for directory: 'C:\Jenkins\workspace\Lucene-Solr-trunk-Windows\solr\build\solr-core\test-files\solr\collection1\'
[junit4:junit4]   2> 7 T3273 oasc.SolrResourceLoader.replaceClassLoader Adding 'file:/C:/Jenkins/workspace/Lucene-Solr-trunk-Windows/solr/build/solr-core/test-files/solr/collection1/lib/classes/' to classloader
[junit4:junit4]   2> 9 T3273 oasc.SolrResourceLoader.replaceClassLoader Adding 'file:/C:/Jenkins/workspace/Lucene-Solr-trunk-Windows/solr/build/solr-core/test-files/solr/collection1/lib/README' to classloader
[junit4:junit4]   2> 114 T3273 oasc.SolrConfig.<init> Using Lucene MatchVersion: LUCENE_50
[junit4:junit4]   2> 199 T3273 oasc.SolrConfig.<init> Loaded SolrConfig: solrconfig-tlog.xml
[junit4:junit4]   2> 200 T3273 oass.IndexSchema.readSchema Reading Solr Schema
[junit4:junit4]   2> 207 T3273 oass.IndexSchema.readSchema Schema name=test
[junit4:junit4]   2> 1135 T3273 oass.IndexSchema.readSchema default search field in schema is text
[junit4:junit4]   2> 1141 T3273 oass.IndexSchema.readSchema unique key field: id
[junit4:junit4]   2> 1153 T3273 oasc.SolrResourceLoader.locateSolrHome JNDI not configured for solr (NoInitialContextEx)
[junit4:junit4]   2> 1154 T3273 oasc.SolrResourceLoader.locateSolrHome using system property solr.solr.home: C:\Jenkins\workspace\Lucene-Solr-trunk-Windows\solr\build\solr-core\test-files\solr
[junit4:junit4]   2> 1154 T3273 oasc.SolrResourceLoader.<init> new SolrResourceLoader for directory: 'C:\Jenkins\workspace\Lucene-Solr-trunk-Windows\solr\build\solr-core\test-files\solr\'
[junit4:junit4]   2> 1179 T3273 oasc.CoreContainer.<init> New CoreContainer 25197759
[junit4:junit4]   2> 1180 T3273 oasc.SolrCore.<init> [collection1] Opening new SolrCore at C:\Jenkins\workspace\Lucene-Solr-trunk-Windows\solr\build\solr-core\test-files\solr\collection1\, dataDir=C:\Jenkins\workspace\Lucene-Solr-trunk-Windows\solr\build\solr-core\test\J0\.\solrtest-TestRecovery-1347569571334\
[junit4:junit4]   2> 1180 T3273 oasc.SolrCore.<init> JMX monitoring not detected for core: collection1
[junit4:junit4]   2> 1183 T3273 oasc.SolrCore.getNewIndexDir WARNING New index directory detected: old=null new=C:\Jenkins\workspace\Lucene-Solr-trunk-Windows\solr\build\solr-core\test\J0\.\solrtest-TestRecovery-1347569571334\index/
[junit4:junit4]   2> 1185 T3273 oasc.SolrCore.initIndex WARNING [collection1] Solr index directory 'C:\Jenkins\workspace\Lucene-Solr-trunk-Windows\solr\build\solr-core\test\J0\.\solrtest-TestRecovery-1347569571334\index' doesn't exist. Creating new index...
[junit4:junit4]   2> 1187 T3273 oasc.CachingDirectoryFactory.get return new directory for C:\Jenkins\workspace\Lucene-Solr-trunk-Windows\solr\build\solr-core\test\J0\.\solrtest-TestRecovery-1347569571334\index forceNew:false
[junit4:junit4]   2> 1194 T3273 oasc.SolrDeletionPolicy.onCommit SolrDeletionPolicy.onCommit: commits:num=1
[junit4:junit4]   2> 		commit{dir=MockDirWrapper(org.apache.lucene.store.NIOFSDirectory@C:\Jenkins\workspace\Lucene-Solr-trunk-Windows\solr\build\solr-core\test\J0\solrtest-TestRecovery-1347569571334\index lockFactory=org.apache.lucene.store.NativeFSLockFactory@1071838),segFN=segments_1,generation=1,filenames=[segments_1]
[junit4:junit4]   2> 1194 T3273 oasc.SolrDeletionPolicy.updateCommits newest commit = 1
[junit4:junit4]   2> 1197 T3273 oasc.RequestHandlers.initHandlersFromConfig created standard: solr.StandardRequestHandler
[junit4:junit4]   2> 1198 T3273 oasc.RequestHandlers.initHandlersFromConfig created /get: solr.RealTimeGetHandler
[junit4:junit4]   2> 1198 T3273 oasc.RequestHandlers.initHandlersFromConfig created /update: solr.UpdateRequestHandler
[junit4:junit4]   2> 1198 T3273 oasc.RequestHandlers.initHandlersFromConfig created /admin/: org.apache.solr.handler.admin.AdminHandlers
[junit4:junit4]   2> 1203 T3273 oashl.XMLLoader.init xsltCacheLifetimeSeconds=60
[junit4:junit4]   2> 1213 T3273 oass.SolrIndexSearcher.<init> Opening Searcher@10f26e2 main
[junit4:junit4]   2> 1215 T3273 oass.SolrIndexSearcher.getIndexDir WARNING WARNING: Directory impl does not support setting indexDir: org.apache.lucene.store.MockDirectoryWrapper
[junit4:junit4]   2> 1218 T3273 oasu.CommitTracker.<init> Hard AutoCommit: disabled
[junit4:junit4]   2> 1219 T3273 oasu.CommitTracker.<init> Soft AutoCommit: disabled
[junit4:junit4]   2> 1219 T3273 oashc.HttpShardHandlerFactory.getParameter Setting socketTimeout to: 0
[junit4:junit4]   2> 1219 T3273 oashc.HttpShardHandlerFactory.getParameter Setting urlScheme to: http://
[junit4:junit4]   2> 1221 T3273 oashc.HttpShardHandlerFactory.getParameter Setting connTimeout to: 0
[junit4:junit4]   2> 1221 T3273 oashc.HttpShardHandlerFactory.getParameter Setting maxConnectionsPerHost to: 20
[junit4:junit4]   2> 1222 T3273 oashc.HttpShardHandlerFactory.getParameter Setting corePoolSize to: 0
[junit4:junit4]   2> 1222 T3273 oashc.HttpShardHandlerFactory.getParameter Setting maximumPoolSize to: 2147483647
[junit4:junit4]   2> 1223 T3273 oashc.HttpShardHandlerFactory.getParameter Setting maxThreadIdleTime to: 5
[junit4:junit4]   2> 1224 T3273 oashc.HttpShardHandlerFactory.getParameter Setting sizeOfQueue to: -1
[junit4:junit4]   2> 1224 T3273 oashc.HttpShardHandlerFactory.getParameter Setting fairnessPolicy to: false
[junit4:junit4]   2> 1224 T3273 oascsi.HttpClientUtil.createClient Creating new http client, config:maxConnectionsPerHost=20&maxConnections=10000&socketTimeout=0&connTimeout=0&retry=false
[junit4:junit4]   2> 1238 T3274 oasc.SolrCore.registerSearcher [collection1] Registered new searcher Searcher@10f26e2 main{StandardDirectoryReader(segments_1:1)}
[junit4:junit4]   2> 1238 T3273 oasc.CoreContainer.register registering core: collection1
[junit4:junit4]   2> 1240 T3273 oas.SolrTestCaseJ4.initCore ####initCore end
[junit4:junit4]   2> 1248 T3273 oas.SolrTestCaseJ4.setUp ###Starting testBufferingFlags
[junit4:junit4]   2> ASYNC  NEW_CORE C194 name=collection1 org.apache.solr.core.SolrCore@113c341
[junit4:junit4]   2> 1255 T3273 C194 oasu.DirectUpdateHandler2.deleteAll [collection1] REMOVING ALL DOCUMENTS FROM INDEX
[junit4:junit4]   2> 1259 T3273 C194 oasc.SolrDeletionPolicy.onInit SolrDeletionPolicy.onInit: commits:num=1
[junit4:junit4]   2> 		commit{dir=MockDirWrapper(org.apache.lucene.store.NIOFSDirectory@C:\Jenkins\workspace\Lucene-Solr-trunk-Windows\solr\build\solr-core\test\J0\solrtest-TestRecovery-1347569571334\index lockFactory=org.apache.lucene.store.NativeFSLockFactory@1071838),segFN=segments_1,generation=1,filenames=[segments_1]
[junit4:junit4]   2> 1259 T3273 C194 oasc.SolrDeletionPolicy.updateCommits newest commit = 1
[junit4:junit4]   2> 1261 T3273 C194 oass.SolrIndexSearcher.<init> Opening Searcher@1f01231 realtime
[junit4:junit4]   2> 1261 T3273 C194 oass.SolrIndexSearcher.getIndexDir WARNING WARNING: Directory impl does not support setting indexDir: org.apache.lucene.store.MockDirectoryWrapper
[junit4:junit4]   2> 1261 T3273 C194 REQ [collection1] webapp=null path=null params={_version_=-9223372036854775807&update.distrib=FROMLEADER&versions=true&wt=json&indent=true} status=0 QTime=6 
[junit4:junit4]   2> 1263 T3273 C194 oasu.DirectUpdateHandler2.commit start commit{flags=0,_version_=0,optimize=false,openSearcher=true,waitSearcher=true,expungeDeletes=false,softCommit=false}
[junit4:junit4]   2> 1270 T3273 C194 oasc.SolrDeletionPolicy.onCommit SolrDeletionPolicy.onCommit: commits:num=2
[junit4:junit4]   2> 		commit{dir=MockDirWrapper(org.apache.lucene.store.NIOFSDirectory@C:\Jenkins\workspace\Lucene-Solr-trunk-Windows\solr\build\solr-core\test\J0\solrtest-TestRecovery-1347569571334\index lockFactory=org.apache.lucene.store.NativeFSLockFactory@1071838),segFN=segments_1,generation=1,filenames=[segments_1]
[junit4:junit4]   2> 		commit{dir=MockDirWrapper(org.apache.lucene.store.NIOFSDirectory@C:\Jenkins\workspace\Lucene-Solr-trunk-Windows\solr\build\solr-core\test\J0\solrtest-TestRecovery-1347569571334\index lockFactory=org.apache.lucene.store.NativeFSLockFactory@1071838),segFN=segments_2,generation=2,filenames=[segments_2]
[junit4:junit4]   2> 1272 T3273 C194 oasc.SolrDeletionPolicy.updateCommits newest commit = 2
[junit4:junit4]   2> 1277 T3273 C194 oass.SolrIndexSearcher.<init> Opening Searcher@19f5ae2 main
[junit4:junit4]   2> 1279 T3273 C194 oass.SolrIndexSearcher.getIndexDir WARNING WARNING: Directory impl does not support setting indexDir: org.apache.lucene.store.MockDirectoryWrapper
[junit4:junit4]   2> 1280 T3274 oasc.SolrCore.registerSearcher [collection1] Registered new searcher Searcher@19f5ae2 main{StandardDirectoryReader(segments_1:2:nrt)}
[junit4:junit4]   2> 1280 T3273 C194 oasu.DirectUpdateHandler2.commit end_commit_flush
[junit4:junit4]   2> 1281 T3273 C194 UPDATE [collection1] webapp=null path=null params={} {commit=} 0 18
[junit4:junit4]   2> 1314 T3273 oasu.UpdateLog.bufferUpdates Starting to buffer updates. FSUpdateLog{state=ACTIVE, tlog=null}
[junit4:junit4]   2> 1338 T3273 C194 REQ [collection1] webapp=null path=null params={update.distrib=FROMLEADER&wt=json&indent=true} status=0 QTime=2 
[junit4:junit4]   2> 1345 T3273 C194 REQ [collection1] webapp=null path=null params={update.distrib=FROMLEADER&wt=json&indent=true} status=0 QTime=0 
[junit4:junit4]   2> 1353 T3273 C194 REQ [collection1] webapp=null path=null params={update.distrib=FROMLEADER&wt=json&indent=true} status=0 QTime=0 
[junit4:junit4]   2> 1353 T3273 oasc.CoreContainer.shutdown Shutting down CoreContainer instance=25197759
[junit4:junit4]   2> 1353 T3273 oasc.SolrCore.close [collection1]  CLOSING SolrCore org.apache.solr.core.SolrCore@113c341
[junit4:junit4]   2> 1355 T3273 oasc.SolrCore.closeSearcher [collection1] Closing main searcher on request.
[junit4:junit4]   2> 1355 T3273 oasu.DirectUpdateHandler2.close closing DirectUpdateHandler2{commits=1,autocommits=0,soft autocommits=0,optimizes=0,rollbacks=0,expungeDeletes=0,docsPending=0,adds=0,deletesById=0,deletesByQuery=0,errors=1,cumulative_adds=0,cumulative_deletesById=0,cumulative_deletesByQuery=1,cumulative_errors=1}
[junit4:junit4]   2> 1355 T3273 oasu.DefaultSolrCoreState.decref SolrCoreState ref count has reached 0 - closing IndexWriter
[junit4:junit4]   2> 1362 T3273 oasu.DefaultSolrCoreState.decref Closing SolrCoreState - canceling any ongoing recovery
[junit4:junit4]   2> 1362 T3273 oasc.SolrResourceLoader.<init> new SolrResourceLoader for directory: 'C:\Jenkins\workspace\Lucene-Solr-trunk-Windows\solr\build\solr-core\test-files\solr\collection1\'
[junit4:junit4]   2> 1365 T3273 oasc.SolrResourceLoader.replaceClassLoader Adding 'file:/C:/Jenkins/workspace/Lucene-Solr-trunk-Windows/solr/build/solr-core/test-files/solr/collection1/lib/classes/' to classloader
[junit4:junit4]   2> 1366 T3273 oasc.SolrResourceLoader.replaceClassLoader Adding 'file:/C:/Jenkins/workspace/Lucene-Solr-trunk-Windows/solr/build/solr-core/test-files/solr/collection1/lib/README' to classloader
[junit4:junit4]   2> 1454 T3273 oasc.SolrConfig.<init> Using Lucene MatchVersion: LUCENE_50
[junit4:junit4]   2> 1550 T3273 oasc.SolrConfig.<init> Loaded SolrConfig: solrconfig-tlog.xml
[junit4:junit4]   2> 1552 T3273 oass.IndexSchema.readSchema Reading Solr Schema
[junit4:junit4]   2> 1559 T3273 oass.IndexSchema.readSchema Schema name=test
[junit4:junit4]   2> 2426 T3273 oass.IndexSchema.readSchema default search field in schema is text
[junit4:junit4]   2> 2431 T3273 oass.IndexSchema.readSchema unique key field: id
[junit4:junit4]   2> 2450 T3273 oasc.SolrResourceLoader.locateSolrHome JNDI not configured for solr (NoInitialContextEx)
[junit4:junit4]   2> 2451 T3273 oasc.SolrResourceLoader.locateSolrHome using system property solr.solr.home: C:\Jenkins\workspace\Lucene-Solr-trunk-Windows\solr\build\solr-core\test-files\solr
[junit4:junit4]   2> 2452 T3273 oasc.SolrResourceLoader.<init> new SolrResourceLoader for directory: 'C:\Jenkins\workspace\Lucene-Solr-trunk-Windows\solr\build\solr-core\test-files\solr\'
[junit4:junit4]   2> 2470 T3273 oasc.CoreContainer.<init> New CoreContainer 11193238
[junit4:junit4]   2> 2471 T3273 oasc.SolrCore.<init> [collection1] Opening new SolrCore at C:\Jenkins\workspace\Lucene-Solr-trunk-Windows\solr\build\solr-core\test-files\solr\collection1\, dataDir=C:\Jenkins\workspace\Lucene-Solr-trunk-Windows\solr\build\solr-core\test\J0\.\solrtest-TestRecovery-1347569571334\
[junit4:junit4]   2> 2471 T3273 oasc.SolrCore.<init> JMX monitoring not detected for core: collection1
[junit4:junit4]   2> 2472 T3273 oasc.SolrCore.getNewIndexDir WARNING New index directory detected: old=null new=C:\Jenkins\workspace\Lucene-Solr-trunk-Windows\solr\build\solr-core\test\J0\.\solrtest-TestRecovery-1347569571334\index/
[junit4:junit4]   2> 2476 T3273 oasc.RequestHandlers.initHandlersFromConfig created standard: solr.StandardRequestHandler
[junit4:junit4]   2> 2477 T3273 oasc.RequestHandlers.initHandlersFromConfig created /get: solr.RealTimeGetHandler
[junit4:junit4]   2> 2478 T3273 oasc.RequestHandlers.initHandlersFromConfig created /update: solr.UpdateRequestHandler
[junit4:junit4]   2> 2478 T3273 oasc.RequestHandlers.initHandlersFromConfig created /admin/: org.apache.solr.handler.admin.AdminHandlers
[junit4:junit4]   2> 2482 T3273 oashl.XMLLoader.init xsltCacheLifetimeSeconds=60
[junit4:junit4]   2> 2489 T3273 oasc.CachingDirectoryFactory.get return new directory for C:\Jenkins\workspace\Lucene-Solr-trunk-Windows\solr\build\solr-core\test\J0\.\solrtest-TestRecovery-1347569571334\index forceNew:false
[junit4:junit4]   2> 2491 T3273 oass.SolrIndexSearcher.<init> Opening Searcher@1f979ee main
[junit4:junit4]   2> 2491 T3273 oass.SolrIndexSearcher.getIndexDir WARNING WARNING: Directory impl does not support setting indexDir: org.apache.lucene.store.MockDirectoryWrapper
[junit4:junit4]   2> 2495 T3273 oasu.CommitTracker.<init> Hard AutoCommit: disabled
[junit4:junit4]   2> 2495 T3273 oasu.CommitTracker.<init> Soft AutoCommit: disabled
[junit4:junit4]   2> 2495 T3273 oashc.HttpShardHandlerFactory.getParameter Setting socketTimeout to: 0
[junit4:junit4]   2> 2496 T3273 oashc.HttpShardHandlerFactory.getParameter Setting urlScheme to: http://
[junit4:junit4]   2> 2496 T3273 oashc.HttpShardHandlerFactory.getParameter Setting connTimeout to: 0
[junit4:junit4]   2> 2496 T3273 oashc.HttpShardHandlerFactory.getParameter Setting maxConnectionsPerHost to: 20
[junit4:junit4]   2> 2497 T3273 oashc.HttpShardHandlerFactory.getParameter Setting corePoolSize to: 0
[junit4:junit4]   2> 2497 T3273 oashc.HttpShardHandlerFactory.getParameter Setting maximumPoolSize to: 2147483647
[junit4:junit4]   2> 2498 T3273 oashc.HttpShardHandlerFactory.getParameter Setting maxThreadIdleTime to: 5
[junit4:junit4]   2> 2498 T3273 oashc.HttpShardHandlerFactory.getParameter Setting sizeOfQueue to: -1
[junit4:junit4]   2> 2498 T3273 oashc.HttpShardHandlerFactory.getParameter Setting fairnessPolicy to: false
[junit4:junit4]   2> 2500 T3273 oascsi.HttpClientUtil.createClient Creating new http client, config:maxConnectionsPerHost=20&maxConnections=10000&socketTimeout=0&connTimeout=0&retry=false
[junit4:junit4]   2> 2511 T3275 oasc.SolrCore.registerSearcher [collection1] Registered new searcher Searcher@1f979ee main{StandardDirectoryReader(segments_2:2)}
[junit4:junit4]   2> 2511 T3273 oasc.CoreContainer.register registering core: collection1
[junit4:junit4]   2> ASYNC  NEW_CORE C195 name=collection1 org.apache.solr.core.SolrCore@1108948
[junit4:junit4]   2> 2514 T3276 C195 oasu.UpdateLog$LogReplayer.doReplay WARNING Starting log replay tlog{file=C:\Jenkins\workspace\Lucene-Solr-trunk-Windows\solr\build\solr-core\test\J0\.\solrtest-TestRecovery-1347569571334\tlog\tlog.0000000000000000001 refcount=2} active=false starting pos=0
[junit4:junit4]   2> 2521 T3276 C195 oasc.SolrDeletionPolicy.onInit SolrDeletionPolicy.onInit: commits:num=1
[junit4:junit4]   2> 		commit{dir=MockDirWrapper(org.apache.lucene.store.NIOFSDirectory@C:\Jenkins\workspace\Lucene-Solr-trunk-Windows\solr\build\solr-core\test\J0\solrtest-TestRecovery-1347569571334\index lockFactory=org.apache.lucene.store.NativeFSLockFactory@12e5d06),segFN=segments_2,generation=2,filenames=[segments_2]
[junit4:junit4]   2> 2522 T3276 C195 oasc.SolrDeletionPolicy.updateCommits newest commit = 2
[junit4:junit4]   2> 2523 T3276 C195 oasu.DirectUpdateHandler2.commit start commit{flags=2,_version_=0,optimize=false,openSearcher=true,waitSearcher=true,expungeDeletes=false,softCommit=false}
[junit4:junit4]   2> 2529 T3276 C195 oasc.SolrDeletionPolicy.onCommit SolrDeletionPolicy.onCommit: commits:num=2
[junit4:junit4]   2> 		commit{dir=MockDirWrapper(org.apache.lucene.store.NIOFSDirectory@C:\Jenkins\workspace\Lucene-Solr-trunk-Windows\solr\build\solr-core\test\J0\solrtest-TestRecovery-1347569571334\index lockFactory=org.apache.lucene.store.NativeFSLockFactory@12e5d06),segFN=segments_2,generation=2,filenames=[segments_2]
[junit4:junit4]   2> 		commit{dir=MockDirWrapper(org.apache.lucene.store.NIOFSDirectory@C:\Jenkins\workspace\Lucene-Solr-trunk-Windows\solr\build\solr-core\test\J0\solrtest-TestRecovery-1347569571334\index lockFactory=org.apache.lucene.store.NativeFSLockFactory@12e5d06),segFN=segments_3,generation=3,filenames=[_0.inf, _0.si, _0.pst, _0.fld, segments_3]
[junit4:junit4]   2> 2529 T3276 C195 oasc.SolrDeletionPolicy.updateCommits newest commit = 3
[junit4:junit4]   2> 2538 T3276 C195 oass.SolrIndexSearcher.<init> Opening Searcher@d8463 main
[junit4:junit4]   2> 2538 T3276 C195 oass.SolrIndexSearcher.getIndexDir WARNING WARNING: Directory impl does not support setting indexDir: org.apache.lucene.store.MockDirectoryWrapper
[junit4:junit4]   2> 2538 T3276 C195 oasu.DirectUpdateHandler2.commit end_commit_flush
[junit4:junit4]   2> 2539 T3275 oasc.SolrCore.registerSearcher [collection1] Registered new searcher Searcher@d8463 main{StandardDirectoryReader(segments_3:4 _0(5.0):C3)}
[junit4:junit4]   2> 2539 T3276 C195 oasu.UpdateLog$LogReplayer.run WARNING Log replay finished. recoveryInfo=RecoveryInfo{adds=3 deletes=0 deleteByQuery=0 errors=0 positionOfStart=0}
[junit4:junit4]   2> 2540 T3273 oasc.CoreContainer.shutdown Shutting down CoreContainer instance=11193238
[junit4:junit4]   2> 2540 T3273 oasc.SolrCore.close [collection1]  CLOSING SolrCore org.apache.solr.core.SolrCore@1108948
[junit4:junit4]   2> 2541 T3273 oasc.SolrCore.closeSearcher [collection1] Closing main searcher on request.
[junit4:junit4]   2> 2541 T3273 oasu.DirectUpdateHandler2.close closing DirectUpdateHandler2{commits=1,autocommits=0,soft autocommits=0,optimizes=0,rollbacks=0,expungeDeletes=0,docsPending=0,adds=0,deletesById=0,deletesByQuery=0,errors=0,cumulative_adds=3,cumulative_deletesById=0,cumulative_deletesByQuery=0,cumulative_errors=0}
[junit4:junit4]   2> 2542 T3273 oasu.DefaultSolrCoreState.decref SolrCoreState ref count has reached 0 - closing IndexWriter
[junit4:junit4]   2> 2552 T3273 oasu.DefaultSolrCoreState.decref Closing SolrCoreState - canceling any ongoing recovery
[junit4:junit4]   2> 2552 T3273 oasc.SolrResourceLoader.<init> new SolrResourceLoader for directory: 'C:\Jenkins\workspace\Lucene-Solr-trunk-Windows\solr\build\solr-core\test-files\solr\collection1\'
[junit4:junit4]   2> 2553 T3273 oasc.SolrResourceLoader.replaceClassLoader Adding 'file:/C:/Jenkins/workspace/Lucene-Solr-trunk-Windows/solr/build/solr-core/test-files/solr/collection1/lib/classes/' to classloader
[junit4:junit4]   2> 2554 T3273 oasc.SolrResourceLoader.replaceClassLoader Adding 'file:/C:/Jenkins/workspace/Lucene-Solr-trunk-Windows/solr/build/solr-core/test-files/solr/collection1/lib/README' to classloader
[junit4:junit4]   2> 2642 T3273 oasc.SolrConfig.<init> Using Lucene MatchVersion: LUCENE_50
[junit4:junit4]   2> 2759 T3273 oasc.SolrConfig.<init> Loaded SolrConfig: solrconfig-tlog.xml
[junit4:junit4]   2> 2761 T3273 oass.IndexSchema.readSchema Reading Solr Schema
[junit4:junit4]   2> 2772 T3273 oass.IndexSchema.readSchema Schema name=test
[junit4:junit4]   2> 3773 T3273 oass.IndexSchema.readSchema default search field in schema is text
[junit4:junit4]   2> 3787 T3273 oass.IndexSchema.readSchema unique key field: id
[junit4:junit4]   2> 3799 T3273 oasc.SolrResourceLoader.locateSolrHome JNDI not configured for solr (NoInitialContextEx)
[junit4:junit4]   2> 3800 T3273 oasc.SolrResourceLoader.locateSolrHome using system property solr.solr.home: C:\Jenkins\workspace\Lucene-Solr-trunk-Windows\solr\build\solr-core\test-files\solr
[junit4:junit4]   2> 3800 T3273 oasc.SolrResourceLoader.<init> new SolrResourceLoader for directory: 'C:\Jenkins\workspace\Lucene-Solr-trunk-Windows\solr\build\solr-core\test-files\solr\'
[junit4:junit4]   2> 3823 T3273 oasc.CoreContainer.<init> New CoreContainer 25371561
[junit4:junit4]   2> 3824 T3273 oasc.SolrCore.<init> [collection1] Opening new SolrCore at C:\Jenkins\workspace\Lucene-Solr-trunk-Windows\solr\build\solr-core\test-files\solr\collection1\, dataDir=C:\Jenkins\workspace\Lucene-Solr-trunk-Windows\solr\build\solr-core\test\J0\.\solrtest-TestRecovery-1347569571334\
[junit4:junit4]   2> 3824 T3273 oasc.SolrCore.<init> JMX monitoring not detected for core: collection1
[junit4:junit4]   2> 3826 T3273 oasc.SolrCore.getNewIndexDir WARNING New index directory detected: old=null new=C:\Jenkins\workspace\Lucene-Solr-trunk-Windows\solr\build\solr-core\test\J0\.\solrtest-TestRecovery-1347569571334\index/
[junit4:junit4]   2> 3831 T3273 oasc.RequestHandlers.initHandlersFromConfig created standard: solr.StandardRequestHandler
[junit4:junit4]   2> 3831 T3273 oasc.RequestHandlers.initHandlersFromConfig created /get: solr.RealTimeGetHandler
[junit4:junit4]   2> 3832 T3273 oasc.RequestHandlers.initHandlersFromConfig created /update: solr.UpdateRequestHandler
[junit4:junit4]   2> 3833 T3273 oasc.RequestHandlers.initHandlersFromConfig created /admin/: org.apache.solr.handler.admin.AdminHandlers
[junit4:junit4]   2> 3839 T3273 oashl.XMLLoader.init xsltCacheLifetimeSeconds=60
[junit4:junit4]   2> 3847 T3273 oasc.CachingDirectoryFactory.get return new directory for C:\Jenkins\workspace\Lucene-Solr-trunk-Windows\solr\build\solr-core\test\J0\.\solrtest-TestRecovery-1347569571334\index forceNew:false
[junit4:junit4]   2> 3851 T3273 oass.SolrIndexSearcher.<init> Opening Searcher@1f52977 main
[junit4:junit4]   2> 3852 T3273 oass.SolrIndexSearcher.getIndexDir WARNING WARNING: Directory impl does not support setting indexDir: org.apache.lucene.store.MockDirectoryWrapper
[junit4:junit4]   2> 3857 T3273 oasu.CommitTracker.<init> Hard AutoCommit: disabled
[junit4:junit4]   2> 3858 T3273 oasu.CommitTracker.<init> Soft AutoCommit: disabled
[junit4:junit4]   2> 3859 T3273 oashc.HttpShardHandlerFactory.getParameter Setting socketTimeout to: 0
[junit4:junit4]   2> 3859 T3273 oashc.HttpShardHandlerFactory.getParameter Setting urlScheme to: http://
[junit4:junit4]   2> 3860 T3273 oashc.HttpShardHandlerFactory.getParameter Setting connTimeout to: 0
[junit4:junit4]   2> 3860 T3273 oashc.HttpShardHandlerFactory.getParameter Setting maxConnectionsPerHost to: 20
[junit4:junit4]   2> 3862 T3273 oashc.HttpShardHandlerFactory.getParameter Setting corePoolSize to: 0
[junit4:junit4]   2> 3862 T3273 oashc.HttpShardHandlerFactory.getParameter Setting maximumPoolSize to: 2147483647
[junit4:junit4]   2> 3863 T3273 oashc.HttpShardHandlerFactory.getParameter Setting maxThreadIdleTime to: 5
[junit4:junit4]   2> 3863 T3273 oashc.HttpShardHandlerFactory.getParameter Setting sizeOfQueue to: -1
[junit4:junit4]   2> 3864 T3273 oashc.HttpShardHandlerFactory.getParameter Setting fairnessPolicy to: false
[junit4:junit4]   2> 3864 T3273 oascsi.HttpClientUtil.createClient Creating new http client, config:maxConnectionsPerHost=20&maxConnections=10000&socketTimeout=0&connTimeout=0&retry=false
[junit4:junit4]   2> 3878 T3277 oasc.SolrCore.registerSearcher [collection1] Registered new searcher Searcher@1f52977 main{StandardDirectoryReader(segments_3:4 _0(5.0):C3)}
[junit4:junit4]   2> 3878 T3273 oasc.CoreContainer.register registering core: collection1
[junit4:junit4]   2> ASYNC  NEW_CORE C196 name=collection1 org.apache.solr.core.SolrCore@1c46e44
[junit4:junit4]   2> 3891 T3273 C196 oasc.SolrDeletionPolicy.onInit SolrDeletionPolicy.onInit: commits:num=1
[junit4:junit4]   2> 		commit{dir=MockDirWrapper(org.apache.lucene.store.SimpleFSDirectory@C:\Jenkins\workspace\Lucene-Solr-trunk-Windows\solr\build\solr-core\test\J0\solrtest-TestRecovery-1347569571334\index lockFactory=org.apache.lucene.store.NativeFSLockFactory@12c36d7),segFN=segments_3,generation=3,filenames=[_0.inf, _0.si, _0.pst, _0.fld, segments_3]
[junit4:junit4]   2> 3891 T3273 C196 oasc.SolrDeletionPolicy.updateCommits newest commit = 3
[junit4:junit4]   2> 3894 T3273 C196 REQ [collection1] webapp=null path=null params={update.distrib=FROMLEADER&wt=json&indent=true} status=0 QTime=7 
[junit4:junit4]   2> 3901 T3273 C196 REQ [collection1] webapp=null path=null params={update.distrib=FROMLEADER&wt=json&indent=true} status=0 QTime=1 
[junit4:junit4]   2> 3907 T3273 C196 REQ [collection1] webapp=null path=null params={update.distrib=FROMLEADER&wt=json&indent=true} status=0 QTime=0 
[junit4:junit4]   2> 3913 T3273 C196 oasu.DirectUpdateHandler2.commit start commit{flags=0,_version_=0,optimize=false,openSearcher=true,waitSearcher=true,expungeDeletes=false,softCommit=false}
[junit4:junit4]   2> 3920 T3273 C196 oasc.SolrDeletionPolicy.onCommit SolrDeletionPolicy.onCommit: commits:num=2
[junit4:junit4]   2> 		commit{dir=MockDirWrapper(org.apache.lucene.store.SimpleFSDirectory@C:\Jenkins\workspace\Lucene-Solr-trunk-Windows\solr\build\solr-core\test\J0\solrtest-TestRecovery-1347569571334\index lockFactory=org.apache.lucene.store.NativeFSLockFactory@12c36d7),segFN=segments_3,generation=3,filenames=[_0.inf, _0.si, _0.pst, _0.fld, segments_3]
[junit4:junit4]   2> 		commit{dir=MockDirWrapper(org.apache.lucene.store.SimpleFSDirectory@C:\Jenkins\workspace\Lucene-Solr-trunk-Windows\solr\build\solr-core\test\J0\solrtest-TestRecovery-1347569571334\index lockFactory=org.apache.lucene.store.NativeFSLockFactory@12c36d7),segFN=segments_4,generation=4,filenames=[_1.pst, _1.fld, _1.si, _1.inf, _0.inf, _0.si, _0.pst, _0.fld, segments_4]
[junit4:junit4]   2> 3921 T3273 C196 oasc.SolrDeletionPolicy.updateCommits newest commit = 4
[junit4:junit4]   2> 3933 T3273 C196 oass.SolrIndexSearcher.<init> Opening Searcher@84d75b main
[junit4:junit4]   2> 3933 T3273 C196 oass.SolrIndexSearcher.getIndexDir WARNING WARNING: Directory impl does not support setting indexDir: org.apache.lucene.store.MockDirectoryWrapper
[junit4:junit4]   2> 3934 T3277 oasc.SolrCore.registerSearcher [collection1] Registered new searcher Searcher@84d75b main{StandardDirectoryReader(segments_4:6 _0(5.0):C3 _1(5.0):C3)}
[junit4:junit4]   2> 3934 T3273 C196 oasu.DirectUpdateHandler2.commit end_commit_flush
[junit4:junit4]   2> 3936 T3273 C196 UPDATE [collection1] webapp=null path=null params={} {commit=} 0 23
[junit4:junit4]   2> 3957 T3273 oasc.CoreContainer.shutdown Shutting down CoreContainer instance=25371561
[junit4:junit4]   2> 3958 T3273 oasc.SolrCore.close [collection1]  CLOSING SolrCore org.apache.solr.core.SolrCore@1c46e44
[junit4:junit4]   2> 3958 T3273 oasc.SolrCore.closeSearcher [collection1] Closing main searcher on request.
[junit4:junit4]   2> 3958 T3273 oasu.DirectUpdateHandler2.close closing DirectUpdateHandler2{commits=1,autocommits=0,soft autocommits=0,optimizes=0,rollbacks=0,expungeDeletes=0,docsPending=0,adds=0,deletesById=0,deletesByQuery=0,errors=0,cumulative_adds=3,cumulative_deletesById=0,cumulative_deletesByQuery=0,cumulative_errors=0}
[junit4:junit4]   2> 3959 T3273 oasu.DefaultSolrCoreState.decref SolrCoreState ref count has reached 0 - closing IndexWriter
[junit4:junit4]   2> 3977 T3273 oasu.DefaultSolrCoreState.decref Closing SolrCoreState - canceling any ongoing recovery
[junit4:junit4]   2> 3978 T3273 oasc.SolrResourceLoader.<init> new SolrResourceLoader for directory: 'C:\Jenkins\workspace\Lucene-Solr-trunk-Windows\solr\build\solr-core\test-files\solr\collection1\'
[junit4:junit4]   2> 3985 T3273 oasc.SolrResourceLoader.replaceClassLoader Adding 'file:/C:/Jenkins/workspace/Lucene-Solr-trunk-Windows/solr/build/solr-core/test-files/solr/collection1/lib/classes/' to classloader
[junit4:junit4]   2> 3990 T3273 oasc.SolrResourceLoader.replaceClassLoader Adding 'file:/C:/Jenkins/workspace/Lucene-Solr-trunk-Windows/solr/build/solr-core/test-files/solr/collection1/lib/README' to classloader
[junit4:junit4]   2> 4080 T3273 oasc.SolrConfig.<init> Using Lucene MatchVersion: LUCENE_50
[junit4:junit4]   2> 4157 T3273 oasc.SolrConfig.<init> Loaded SolrConfig: solrconfig-tlog.xml
[junit4:junit4]   2> 4159 T3273 oass.IndexSchema.readSchema Reading Solr Schema
[junit4:junit4]   2> 4169 T3273 oass.IndexSchema.readSchema Schema name=test
[junit4:junit4]   2> 5098 T3273 oass.IndexSchema.readSchema default search field in schema is text
[junit4:junit4]   2> 5103 T3273 oass.IndexSchema.readSchema unique key field: id
[junit4:junit4]   2> 5116 T3273 oasc.SolrResourceLoader.locateSolrHome JNDI not configured for solr (NoInitialContextEx)
[junit4:junit4]   2> 5116 T3273 oasc.SolrResourceLoader.locateSolrHome using system property solr.solr.home: C:\Jenkins\workspace\Lucene-Solr-trunk-Windows\solr\build\solr-core\test-files\solr
[junit4:junit4]   2> 5116 T3273 oasc.SolrResourceLoader.<init> new SolrResourceLoader for directory: 'C:\Jenkins\workspace\Lucene-Solr-trunk-Windows\solr\build\solr-core\test-files\solr\'
[junit4:junit4]   2> 5135 T3273 oasc.CoreContainer.<init> New CoreContainer 10179416
[junit4:junit4]   2> 5136 T3273 oasc.SolrCore.<init> [collection1] Opening new SolrCore at C:\Jenkins\workspace\Lucene-Solr-trunk-Windows\solr\build\solr-core\test-files\solr\collection1\, dataDir=C:\Jenkins\workspace\Lucene-Solr-trunk-Windows\solr\build\solr-core\test\J0\.\solrtest-TestRecovery-1347569571334\
[junit4:junit4]   2> 5136 T3273 oasc.SolrCore.<init> JMX monitoring not detected for core: collection1
[junit4:junit4]   2> 5138 T3273 oasc.SolrCore.getNewIndexDir WARNING New index directory detected: old=null new=C:\Jenkins\workspace\Lucene-Solr-trunk-Windows\solr\build\solr-core\test\J0\.\solrtest-TestRecovery-1347569571334\index/
[junit4:junit4]   2> 5140 T3273 oasc.RequestHandlers.initHandlersFromConfig created standard: solr.StandardRequestHandler
[junit4:junit4]   2> 5141 T3273 oasc.RequestHandlers.initHandlersFromConfig created /get: solr.RealTimeGetHandler
[junit4:junit4]   2> 5141 T3273 oasc.RequestHandlers.initHandlersFromConfig created /update: solr.UpdateRequestHandler
[junit4:junit4]   2> 5141 T3273 oasc.RequestHandlers.initHandlersFromConfig created /admin/: org.apache.solr.handler.admin.AdminHandlers
[junit4:junit4]   2> 5145 T3273 oashl.XMLLoader.init xsltCacheLifetimeSeconds=60
[junit4:junit4]   2> 5150 T3273 oasc.CachingDirectoryFactory.get return new directory for C:\Jenkins\workspace\Lucene-Solr-trunk-Windows\solr\build\solr-core\test\J0\.\solrtest-TestRecovery-1347569571334\index forceNew:false
[junit4:junit4]   2> 5153 T3273 oass.SolrIndexSearcher.<init> Opening Searcher@167d8d8 main
[junit4:junit4]   2> 5155 T3273 oass.SolrIndexSearcher.getIndexDir WARNING WARNING: Directory impl does not support setting indexDir: org.apache.lucene.store.MockDirectoryWrapper
[junit4:junit4]   2> 5157 T3273 oasu.CommitTracker.<init> Hard AutoCommit: disabled
[junit4:junit4]   2> 5159 T3273 oasu.CommitTracker.<init> Soft AutoCommit: disabled
[junit4:junit4]   2> 5159 T3273 oashc.HttpShardHandlerFactory.getParameter Setting socketTimeout to: 0
[junit4:junit4]   2> 5160 T3273 oashc.HttpShardHandlerFactory.getParameter Setting urlScheme to: http://
[junit4:junit4]   2> 5160 T3273 oashc.HttpShardHandlerFactory.getParameter Setting connTimeout to: 0
[junit4:junit4]   2> 5161 T3273 oashc.HttpShardHandlerFactory.getParameter Setting maxConnectionsPerHost to: 20
[junit4:junit4]   2> 5161 T3273 oashc.HttpShardHandlerFactory.getParameter Setting corePoolSize to: 0
[junit4:junit4]   2> 5161 T3273 oashc.HttpShardHandlerFactory.getParameter Setting maximumPoolSize to: 2147483647
[junit4:junit4]   2> 5162 T3273 oashc.HttpShardHandlerFactory.getParameter Setting maxThreadIdleTime to: 5
[junit4:junit4]   2> 5162 T3273 oashc.HttpShardHandlerFactory.getParameter Setting sizeOfQueue to: -1
[junit4:junit4]   2> 5162 T3273 oashc.HttpShardHandlerFactory.getParameter Setting fairnessPolicy to: false
[junit4:junit4]   2> 5162 T3273 oascsi.HttpClientUtil.createClient Creating new http client, config:maxConnectionsPerHost=20&maxConnections=10000&socketTimeout=0&connTimeout=0&retry=false
[junit4:junit4]   2> 5180 T3278 oasc.SolrCore.registerSearcher [collection1] Registered new searcher Searcher@167d8d8 main{StandardDirectoryReader(segments_4:6 _0(5.0):C3 _1(5.0):C3)}
[junit4:junit4]   2> 5179 T3273 oasc.CoreContainer.register registering core: collection1
[junit4:junit4]   2> 5182 T3273 oasu.UpdateLog.bufferUpdates Starting to buffer updates. FSUpdateLog{state=ACTIVE, tlog=null}
[junit4:junit4]   2> ASYNC  NEW_CORE C197 name=collection1 org.apache.solr.core.SolrCore@2d701
[junit4:junit4]   2> 5200 T3273 C197 oasc.SolrDeletionPolicy.onInit SolrDeletionPolicy.onInit: commits:num=1
[junit4:junit4]   2> 		commit{dir=MockDirWrapper(org.apache.lucene.store.SimpleFSDirectory@C:\Jenkins\workspace\Lucene-Solr-trunk-Windows\solr\build\solr-core\test\J0\solrtest-TestRecovery-1347569571334\index lockFactory=org.apache.lucene.store.NativeFSLockFactory@1c220f9),segFN=segments_4,generation=4,filenames=[_1.pst, _1.fld, _1.si, _1.inf, _0.inf, _0.si, _0.pst, _0.fld, segments_4]
[junit4:junit4]   2> 5202 T3273 C197 oasc.SolrDeletionPolicy.updateCommits newest commit = 4
[junit4:junit4]   2> 5206 T3273 C197 REQ [collection1] webapp=null path=null params={update.distrib=FROMLEADER&wt=json&indent=true} status=0 QTime=14 
[junit4:junit4]   2> 5206 T3273 oasc.CoreContainer.shutdown Shutting down CoreContainer instance=10179416
[junit4:junit4]   2> 5207 T3273 oasc.SolrCore.close [collection1]  CLOSING SolrCore org.apache.solr.core.SolrCore@2d701
[junit4:junit4]   2> 5208 T3273 oasc.SolrCore.closeSearcher [collection1] Closing main searcher on request.
[junit4:junit4]   2> 5208 T3273 oasu.DirectUpdateHandler2.close closing DirectUpdateHandler2{commits=0,autocommits=0,soft autocommits=0,optimizes=0,rollbacks=0,expungeDeletes=0,docsPending=1,adds=1,deletesById=0,deletesByQuery=0,errors=0,cumulative_adds=1,cumulative_deletesById=0,cumulative_deletesByQuery=0,cumulative_errors=0}
[junit4:junit4]   2> 5210 T3273 oasu.DefaultSolrCoreState.decref SolrCoreState ref count has reached 0 - closing IndexWriter
[junit4:junit4]   2> 5239 T3273 oasu.DefaultSolrCoreState.decref Closing SolrCoreState - canceling any ongoing recovery
[junit4:junit4]   2> 5240 T3273 oasc.SolrResourceLoader.<init> new SolrResourceLoader for directory: 'C:\Jenkins\workspace\Lucene-Solr-trunk-Windows\solr\build\solr-core\test-files\solr\collection1\'
[junit4:junit4]   2> 5245 T3273 oasc.SolrResourceLoader.replaceClassLoader Adding 'file:/C:/Jenkins/workspace/Lucene-Solr-trunk-Windows/solr/build/solr-core/test-files/solr/collection1/lib/classes/' to classloader
[junit4:junit4]   2> 5248 T3273 oasc.SolrResourceLoader.replaceClassLoader Adding 'file:/C:/Jenkins/workspace/Lucene-Solr-trunk-Windows/solr/build/solr-core/test-files/solr/collection1/lib/README' to classloader
[junit4:junit4]   2> 5344 T3273 oasc.SolrConfig.<init> Using Lucene MatchVersion: LUCENE_50
[junit4:junit4]   2> 5439 T3273 oasc.SolrConfig.<init> Loaded SolrConfig: solrconfig-tlog.xml
[junit4:junit4]   2> 5440 T3273 oass.IndexSchema.readSchema Reading Solr Schema
[junit4:junit4]   2> 5446 T3273 oass.IndexSchema.readSchema Schema name=test
[junit4:junit4]   2> 6242 T3273 oass.IndexSchema.readSchema default search field in schema is text
[junit4:junit4]   2> 6247 T3273 oass.IndexSchema.readSchema unique key field: id
[junit4:junit4]   2> 6261 T3273 oasc.SolrResourceLoader.locateSolrHome JNDI not configured for solr (NoInitialContextEx)
[junit4:junit4]   2> 6262 T3273 oasc.SolrResourceLoader.locateSolrHome using system property solr.solr.home: C:\Jenkins\workspace\Lucene-Solr-trunk-Windows\solr\build\solr-core\test-files\solr
[junit4:junit4]   2> 6262 T3273 oasc.SolrResourceLoader.<init> new SolrResourceLoader for directory: 'C:\Jenkins\workspace\Lucene-Solr-trunk-Windows\solr\build\solr-core\test-files\solr\'
[junit4:junit4]   2> 6281 T3273 oasc.CoreContainer.<init> New CoreContainer 18196648
[junit4:junit4]   2> 6281 T3273 oasc.SolrCore.<init> [collection1] Opening new SolrCore at C:\Jenkins\workspace\Lucene-Solr-trunk-Windows\solr\build\solr-core\test-files\solr\collection1\, dataDir=C:\Jenkins\workspace\Lucene-Solr-trunk-Windows\solr\build\solr-core\test\J0\.\solrtest-TestRecovery-1347569571334\
[junit4:junit4]   2> 6282 T3273 oasc.SolrCore.<init> JMX monitoring not detected for core: collection1
[junit4:junit4]   2> 6283 T3273 oasc.SolrCore.getNewIndexDir WARNING New index directory detected: old=null new=C:\Jenkins\workspace\Lucene-Solr-trunk-Windows\solr\build\solr-core\test\J0\.\solrtest-TestRecovery-1347569571334\index/
[junit4:junit4]   2> 6284 T3273 oasc.RequestHandlers.initHandlersFromConfig created standard: solr.StandardRequestHandler
[junit4:junit4]   2> 6285 T3273 oasc.RequestHandlers.initHandlersFromConfig created /get: solr.RealTimeGetHandler
[junit4:junit4]   2> 6285 T3273 oasc.RequestHandlers.initHandlersFromConfig created /update: solr.UpdateRequestHandler
[junit4:junit4]   2> 6286 T3273 oasc.RequestHandlers.initHandlersFromConfig created /admin/: org.apache.solr.handler.admin.AdminHandlers
[junit4:junit4]   2> 6288 T3273 oashl.XMLLoader.init xsltCacheLifetimeSeconds=60
[junit4:junit4]   2> 6293 T3273 oasc.CachingDirectoryFactory.get return new directory for C:\Jenkins\workspace\Lucene-Solr-trunk-Windows\solr\build\solr-core\test\J0\.\solrtest-TestRecovery-1347569571334\index forceNew:false
[junit4:junit4]   2> 6297 T3273 oass.SolrIndexSearcher.<init> Opening Searcher@133c1c8 main
[junit4:junit4]   2> 6298 T3273 oass.SolrIndexSearcher.getIndexDir WARNING WARNING: Directory impl does not support setting indexDir: org.apache.lucene.store.MockDirectoryWrapper
[junit4:junit4]   2> 6301 T3273 oasu.CommitTracker.<init> Hard AutoCommit: disabled
[junit4:junit4]   2> 6301 T3273 oasu.CommitTracker.<init> Soft AutoCommit: disabled
[junit4:junit4]   2> 6302 T3273 oashc.HttpShardHandlerFactory.getParameter Setting socketTimeout to: 0
[junit4:junit4]   2> 6302 T3273 oashc.HttpShardHandlerFactory.getParameter Setting urlScheme to: http://
[junit4:junit4]   2> 6303 T3273 oashc.HttpShardHandlerFactory.getParameter Setting connTimeout to: 0
[junit4:junit4]   2> 6303 T3273 oashc.HttpShardHandlerFactory.getParameter Setting maxConnectionsPerHost to: 20
[junit4:junit4]   2> 6303 T3273 oashc.HttpShardHandlerFactory.getParameter Setting corePoolSize to: 0
[junit4:junit4]   2> 6303 T3273 oashc.HttpShardHandlerFactory.getParameter Setting maximumPoolSize to: 2147483647
[junit4:junit4]   2> 6304 T3273 oashc.HttpShardHandlerFactory.getParameter Setting maxThreadIdleTime to: 5
[junit4:junit4]   2> 6304 T3273 oashc.HttpShardHandlerFactory.getParameter Setting sizeOfQueue to: -1
[junit4:junit4]   2> 6305 T3273 oashc.HttpShardHandlerFactory.getParameter Setting fairnessPolicy to: false
[junit4:junit4]   2> 6305 T3273 oascsi.HttpClientUtil.createClient Creating new http client, config:maxConnectionsPerHost=20&maxConnections=10000&socketTimeout=0&connTimeout=0&retry=false
[junit4:junit4]   2> 6327 T3279 oasc.SolrCore.registerSearcher [collection1] Registered new searcher Searcher@133c1c8 main{StandardDirectoryReader(segments_4:6 _0(5.0):C3 _1(5.0):C3)}
[junit4:junit4]   2> 6327 T3273 oasc.CoreContainer.register registering core: collection1
[junit4:junit4]   2> ASYNC  NEW_CORE C198 name=collection1 org.apache.solr.core.SolrCore@13ba32a
[junit4:junit4]   2> 6330 T3280 C198 oasu.UpdateLog$LogReplayer.doReplay WARNING Starting log replay tlog{file=C:\Jenkins\workspace\Lucene-Solr-trunk-Windows\solr\build\solr-core\test\J0\.\solrtest-TestRecovery-1347569571334\tlog\tlog.0000000000000000003 refcount=2} active=false starting pos=0
[junit4:junit4]   2> 6336 T3280 C198 oasc.SolrDeletionPolicy.onInit SolrDeletionPolicy.onInit: commits:num=1
[junit4:junit4]   2> 		commit{dir=MockDirWrapper(org.apache.lucene.store.SimpleFSDirectory@C:\Jenkins\workspace\Lucene-Solr-trunk-Windows\solr\build\solr-core\test\J0\solrtest-TestRecovery-1347569571334\index lockFactory=org.apache.lucene.store.NativeFSLockFactory@187f650),segFN=segments_4,generation=4,filenames=[_1.pst, _1.fld, _1.si, _1.inf, _0.inf, _0.si, _0.pst, _0.fld, segments_4]
[junit4:junit4]   2> 6336 T3280 C198 oasc.SolrDeletionPolicy.updateCommits newest commit = 4
[junit4:junit4]   2> 6338 T3280 C198 oasu.DirectUpdateHandler2.commit start commit{flags=2,_version_=0,optimize=false,openSearcher=true,waitSearcher=true,expungeDeletes=false,softCommit=false}
[junit4:junit4]   2> 6348 T3280 C198 oasc.SolrDeletionPolicy.onCommit SolrDeletionPolicy.onCommit: commits:num=2
[junit4:junit4]   2> 		commit{dir=MockDirWrapper(org.apache.lucene.store.SimpleFSDirectory@C:\Jenkins\workspace\Lucene-Solr-trunk-Windows\solr\build\solr-core\test\J0\solrtest-TestRecovery-1347569571334\index lockFactory=org.apache.lucene.store.NativeFSLockFactory@187f650),segFN=segments_4,generation=4,filenames=[_1.pst, _1.fld, _1.si, _1.inf, _0.inf, _0.si, _0.pst, _0.fld, segments_4]
[junit4:junit4]   2> 		commit{dir=MockDirWrapper(org.apache.lucene.store.SimpleFSDirectory@C:\Jenkins\workspace\Lucene-Solr-trunk-Windows\solr\build\solr-core\test\J0\solrtest-TestRecovery-1347569571334\index lockFactory=org.apache.lucene.store.NativeFSLockFactory@187f650),segFN=segments_5,generation=5,filenames=[_2.si, _1.fld, _2.fld, _2.inf, _1.inf, _0.pst, _0.fld, _2.pst, _1.pst, _1.si, _0.inf, segments_5, _0.si]
[junit4:junit4]   2> 6348 T3280 C198 oasc.SolrDeletionPolicy.updateCommits newest commit = 5
[junit4:junit4]   2> 6357 T3280 C198 oass.SolrIndexSearcher.<init> Opening Searcher@1704aa7 main
[junit4:junit4]   2> 6357 T3280 C198 oass.SolrIndexSearcher.getIndexDir WARNING WARNING: Directory impl does not support setting indexDir: org.apache.lucene.store.MockDirectoryWrapper
[junit4:junit4]   2> 6358 T3280 C198 oasu.DirectUpdateHandler2.commit end_commit_flush
[junit4:junit4]   2> 6358 T3279 oasc.SolrCore.registerSearcher [collection1] Registered new searcher Searcher@1704aa7 main{StandardDirectoryReader(segments_5:8 _0(5.0):C3 _1(5.0):C3 _2(5.0):C1)}
[junit4:junit4]   2> 6358 T3280 C198 oasu.UpdateLog$LogReplayer.run WARNING Log replay finished. recoveryInfo=RecoveryInfo{adds=1 deletes=0 deleteByQuery=0 errors=0 positionOfStart=0}
[junit4:junit4]   2> 6360 T3273 oas.SolrTestCaseJ4.tearDown ###Ending testBufferingFlags
[junit4:junit4]   2> 6366 T3273 oas.SolrTestCaseJ4.setUp ###Starting testCorruptLog
[junit4:junit4]   2> 6379 T3273 C198 oasu.DirectUpdateHandler2.deleteAll [collection1] REMOVING ALL DOCUMENTS FROM INDEX
[junit4:junit4]   2> 6383 T3273 C198 oass.SolrIndexSearcher.<init> Opening Searcher@14f0bfc realtime
[junit4:junit4]   2> 6383 T3273 C198 oass.SolrIndexSearcher.getIndexDir WARNING WARNING: Directory impl does not support setting indexDir: org.apache.lucene.store.MockDirectoryWrapper
[junit4:junit4]   2> 6385 T3273 C198 REQ [collection1] webapp=null path=null params={_version_=-9223372036854775807&update.distrib=FROMLEADER&versions=true&wt=json&indent=true} status=0 QTime=6 
[junit4:junit4]   2> 6393 T3273 C198 oasu.DirectUpdateHandler2.commit start commit{flags=0,_version_=0,optimize=false,openSearcher=true,waitSearcher=true,expungeDeletes=false,softCommit=false}
[junit4:junit4]   2> 6396 T3273 C198 oasc.SolrDeletionPolicy.onCommit SolrDeletionPolicy.onCommit: commits:num=2
[junit4:junit4]   2> 		commit{dir=MockDirWrapper(org.apache.lucene.store.SimpleFSDirectory@C:\Jenkins\workspace\Lucene-Solr-trunk-Windows\solr\build\solr-core\test\J0\solrtest-TestRecovery-1347569571334\index lockFactory=org.apache.lucene.store.NativeFSLockFactory@187f650),segFN=segments_5,generation=5,filenames=[_2.si, _1.fld, _2.fld, _2.inf, _1.inf, _0.pst, _0.fld, _2.pst, _1.pst, _1.si, _0.inf, segments_5, _0.si]
[junit4:junit4]   2> 		commit{dir=MockDirWrapper(org.apache.lucene.store.SimpleFSDirectory@C:\Jenkins\workspace\Lucene-Solr-trunk-Windows\solr\build\solr-core\test\J0\solrtest-TestRecovery-1347569571334\index lockFactory=org.apache.lucene.store.NativeFSLockFactory@187f650),segFN=segments_6,generation=6,filenames=[segments_6]
[junit4:junit4]   2> 6398 T3273 C198 oasc.SolrDeletionPolicy.updateCommits newest commit = 6
[junit4:junit4]   2> 6409 T3273 C198 oass.SolrIndexSearcher.<init> Opening Searcher@1eae93a main
[junit4:junit4]   2> 6410 T3273 C198 oass.SolrIndexSearcher.getIndexDir WARNING WARNING: Directory impl does not support setting indexDir: org.apache.lucene.store.MockDirectoryWrapper
[junit4:junit4]   2> 6411 T3279 oasc.SolrCore.registerSearcher [collection1] Registered new searcher Searcher@1eae93a main{StandardDirectoryReader(segments_5:9:nrt)}
[junit4:junit4]   2> 6411 T3273 C198 oasu.DirectUpdateHandler2.commit end_commit_flush
[junit4:junit4]   2> 6411 T3273 C198 UPDATE [collection1] webapp=null path=null params={} {commit=} 0 18
[junit4:junit4]   2> 6443 T3273 C198 UPDATE [collection1] webapp=null path=null params={} {add=[G1 (1413029117579755520)]} 0 4
[junit4:junit4]   2> 6450 T3273 C198 UPDATE [collection1] webapp=null path=null params={} {add=[G2 (1413029117591289856)]} 0 1
[junit4:junit4]   2> 6458 T3273 C198 UPDATE [collection1] webapp=null path=null params={} {add=[G3 (1413029117599678464)]} 0 0
[junit4:junit4]   2> 6460 T3273 oasc.CoreContainer.shutdown Shutting down CoreContainer instance=18196648
[junit4:junit4]   2> 6461 T3273 oasc.SolrCore.close [collection1]  CLOSING SolrCore org.apache.solr.core.SolrCore@13ba32a
[junit4:junit4]   2> 6461 T3273 oasc.SolrCore.closeSearcher [collection1] Closing main searcher on request.
[junit4:junit4]   2> 6466 T3273 oasu.DirectUpdateHandler2.close closing DirectUpdateHandler2{commits=2,autocommits=0,soft autocommits=0,optimizes=0,rollbacks=0,expungeDeletes=0,docsPending=3,adds=3,deletesById=0,deletesByQuery=0,errors=1,cumulative_adds=4,cumulative_deletesById=0,cumulative_deletesByQuery=1,cumulative_errors=1}
[junit4:junit4]   2> 6467 T3273 oasu.DefaultSolrCoreState.decref SolrCoreState ref count has reached 0 - closing IndexWriter
[junit4:junit4]   2> 6479 T3273 oasu.DefaultSolrCoreState.decref Closing SolrCoreState - canceling any ongoing recovery
[junit4:junit4]   2> 6483 T3273 oasc.SolrResourceLoader.<init> new SolrResourceLoader for directory: 'C:\Jenkins\workspace\Lucene-Solr-trunk-Windows\solr\build\solr-core\test-files\solr\collection1\'
[junit4:junit4]   2> 6488 T3273 oasc.SolrResourceLoader.replaceClassLoader Adding 'file:/C:/Jenkins/workspace/Lucene-Solr-trunk-Windows/solr/build/solr-core/test-files/solr/collection1/lib/classes/' to classloader
[junit4:junit4]   2> 6491 T3273 oasc.SolrResourceLoader.replaceClassLoader Adding 'file:/C:/Jenkins/workspace/Lucene-Solr-trunk-Windows/solr/build/solr-core/test-files/solr/collection1/lib/README' to classloader
[junit4:junit4]   2> 6605 T3273 oasc.SolrConfig.<init> Using Lucene MatchVersion: LUCENE_50
[junit4:junit4]   2> 6691 T3273 oasc.SolrConfig.<init> Loaded SolrConfig: solrconfig-tlog.xml
[junit4:junit4]   2> 6691 T3273 oass.IndexSchema.readSchema Reading Solr Schema
[junit4:junit4]   2> 6698 T3273 oass.IndexSchema.readSchema Schema name=test
[junit4:junit4]   2> 7516 T3273 oass.IndexSchema.readSchema default search field in schema is text
[junit4:junit4]   2> 7520 T3273 oass.IndexSchema.readSchema unique key field: id
[junit4:junit4]   2> 7531 T3273 oasc.SolrResourceLoader.locateSolrHome JNDI not configured for solr (NoInitialContextEx)
[junit4:junit4]   2> 7531 T3273 oasc.SolrResourceLoader.locateSolrHome using system property solr.solr.home: C:\Jenkins\workspace\Lucene-Solr-trunk-Windows\solr\build\solr-core\test-files\solr
[junit4:junit4]   2> 7532 T3273 oasc.SolrResourceLoader.<init> new SolrResourceLoader for directory: 'C:\Jenkins\workspace\Lucene-Solr-trunk-Windows\solr\build\solr-core\test-files\solr\'
[junit4:junit4]   2> 7547 T3273 oasc.CoreContainer.<init> New CoreContainer 16836767
[junit4:junit4]   2> 7548 T3273 oasc.SolrCore.<init> [collection1] Opening new SolrCore at C:\Jenkins\workspace\Lucene-Solr-trunk-Windows\solr\build\solr-core\test-files\solr\collection1\, dataDir=C:\Jenkins\workspace\Lucene-Solr-trunk-Windows\solr\build\solr-core\test\J0\.\solrtest-TestRecovery-1347569571334\
[junit4:junit4]   2> 7548 T3273 oasc.SolrCore.<init> JMX monitoring not detected for core: collection1
[junit4:junit4]   2> 7549 T3273 oasc.SolrCore.getNewIndexDir WARNING New index directory detected: old=null new=C:\Jenkins\workspace\Lucene-Solr-trunk-Windows\solr\build\solr-core\test\J0\.\solrtest-TestRecovery-1347569571334\index/
[junit4:junit4]   2> 7552 T3273 oasc.RequestHandlers.initHandlersFromConfig created standard: solr.StandardRequestHandler
[junit4:junit4]   2> 7552 T3273 oasc.RequestHandlers.initHandlersFromConfig created /get: solr.RealTimeGetHandler
[junit4:junit4]   2> 7553 T3273 oasc.RequestHandlers.initHandlersFromConfig created /update: solr.UpdateRequestHandler
[junit4:junit4]   2> 7553 T3273 oasc.RequestHandlers.initHandlersFromConfig created /admin/: org.apache.solr.handler.admin.AdminHandlers
[junit4:junit4]   2> 7557 T3273 oashl.XMLLoader.init xsltCacheLifetimeSeconds=60
[junit4:junit4]   2> 7561 T3273 oasc.CachingDirectoryFactory.get return new directory for C:\Jenkins\workspace\Lucene-Solr-trunk-Windows\solr\build\solr-core\test\J0\.\solrtest-TestRecovery-1347569571334\index forceNew:false
[junit4:junit4]   2> 7562 T3273 oass.SolrIndexSearcher.<init> Opening Searcher@710258 main
[junit4:junit4]   2> 7563 T3273 oass.SolrIndexSearcher.getIndexDir WARNING WARNING: Directory impl does not support setting indexDir: org.apache.lucene.store.MockDirectoryWrapper
[junit4:junit4]   2> 7565 T3273 oasc.SolrException.log Ignoring exception matching Failure to open existing log file
[junit4:junit4]   2> 7565 T3273 oasu.CommitTracker.<init> Hard AutoCommit: disabled
[junit4:junit4]   2> 7566 T3273 oasu.CommitTracker.<init> Soft AutoCommit: disabled
[junit4:junit4]   2> 7566 T3273 oashc.HttpShardHandlerFactory.getParameter Setting socketTimeout to: 0
[junit4:junit4]   2> 7566 T3273 oashc.HttpShardHandlerFactory.getParameter Setting urlScheme to: http://
[junit4:junit4]   2> 7567 T3273 oashc.HttpShardHandlerFactory.getParameter Setting connTimeout to: 0
[junit4:junit4]   2> 7567 T3273 oashc.HttpShardHandlerFactory.getParameter Setting maxConnectionsPerHost to: 20
[junit4:junit4]   2> 7567 T3273 oashc.HttpShardHandlerFactory.getParameter Setting corePoolSize to: 0
[junit4:junit4]   2> 7568 T3273 oashc.HttpShardHandlerFactory.getParameter Setting maximumPoolSize to: 2147483647
[junit4:junit4]   2> 7568 T3273 oashc.HttpShardHandlerFactory.getParameter Setting maxThreadIdleTime to: 5
[junit4:junit4]   2> 7568 T3273 oashc.HttpShardHandlerFactory.getParameter Setting sizeOfQueue to: -1
[junit4:junit4]   2> 7569 T3273 oashc.HttpShardHandlerFactory.getParameter Setting fairnessPolicy to: false
[junit4:junit4]   2> 7569 T3273 oascsi.HttpClientUtil.createClient Creating new http client, config:maxConnectionsPerHost=20&maxConnections=10000&socketTimeout=0&connTimeout=0&retry=false
[junit4:junit4]   2> 7579 T3281 oasc.SolrCore.registerSearcher [collection1] Registered new searcher Searcher@710258 main{StandardDirectoryReader(segments_6:9)}
[junit4:junit4]   2> 7579 T3273 oasc.CoreContainer.register registering core: collection1
[junit4:junit4]   2> ASYNC  NEW_CORE C199 name=collection1 org.apache.solr.core.SolrCore@197f06c
[junit4:junit4]   2> 7582 T3273 C199 REQ [collection1] webapp=null path=null params={q=*:*} hits=0 status=0 QTime=0 
[junit4:junit4]   2> 7603 T3273 C199 oasc.SolrDeletionPolicy.onInit SolrDeletionPolicy.onInit: commits:num=1
[junit4:junit4]   2> 		commit{dir=MockDirWrapper(org.apache.lucene.store.MMapDirectory@C:\Jenkins\workspace\Lucene-Solr-trunk-Windows\solr\build\solr-core\test\J0\solrtest-TestRecovery-1347569571334\index lockFactory=org.apache.lucene.store.NativeFSLockFactory@1632a06),segFN=segments_6,generation=6,filenames=[segments_6]
[junit4:junit4]   2> 7604 T3273 C199 oasc.SolrDeletionPolicy.updateCommits newest commit = 6
[junit4:junit4]   2> 7605 T3273 C199 REQ [collection1] webapp=null path=null params={update.distrib=FROMLEADER&wt=json&indent=true} status=0 QTime=11 
[junit4:junit4]   2> 7612 T3273 C199 REQ [collection1] webapp=null path=null params={update.distrib=FROMLEADER&wt=json&indent=true} status=0 QTime=1 
[junit4:junit4]   2> 7627 T3273 C199 REQ [collection1] webapp=null path=null params={update.distrib=FROMLEADER&wt=json&indent=true} status=0 QTime=0 
[junit4:junit4]   2> 7628 T3273 C199 REQ [collection1] webapp=null path=null params={getVersions=3&qt=/get} status=0 QTime=1 
[junit4:junit4]   2> 7632 T3273 C199 oasu.DirectUpdateHandler2.commit start commit{flags=0,_version_=0,optimize=false,openSearcher=true,waitSearcher=true,expungeDeletes=false,softCommit=false}
[junit4:junit4]   2> 7639 T3273 C199 oasc.SolrDeletionPolicy.onCommit SolrDeletionPolicy.onCommit: commits:num=2
[junit4:junit4]   2> 		commit{dir=MockDirWrapper(org.apache.lucene.store.MMapDirectory@C:\Jenkins\workspace\Lucene-Solr-trunk-Windows\solr\build\solr-core\test\J0\solrtest-TestRecovery-1347569571334\index lockFactory=org.apache.lucene.store.NativeFSLockFactory@1632a06),segFN=segments_6,generation=6,filenames=[segments_6]
[junit4:junit4]   2> 		commit{dir=MockDirWrapper(org.apache.lucene.store.MMapDirectory@C:\Jenkins\workspace\Lucene-Solr-trunk-Windows\solr\build\solr-core\test\J0\solrtest-TestRecovery-1347569571334\index lockFactory=org.apache.lucene.store.NativeFSLockFactory@1632a06),segFN=segments_7,generation=7,filenames=[_3.fld, _3.inf, segments_7, _3.si, _3.pst]
[junit4:junit4]   2> 7639 T3273 C199 oasc.SolrDeletionPolicy.updateCommits newest commit = 7
[junit4:junit4]   2> 7647 T3273 C199 oass.SolrIndexSearcher.<init> Opening Searcher@5f0960 main
[junit4:junit4]   2> 7647 T3273 C199 oass.SolrIndexSearcher.getIndexDir WARNING WARNING: Directory impl does not support setting indexDir: org.apache.lucene.store.MockDirectoryWrapper
[junit4:junit4]   2> 7648 T3281 oasc.SolrCore.registerSearcher [collection1] Registered new searcher Searcher@5f0960 main{StandardDirectoryReader(segments_7:11 _3(5.0):C3)}
[junit4:junit4]   2> 7648 T3273 C199 oasu.DirectUpdateHandler2.commit end_commit_flush
[junit4:junit4]   2> 7650 T3273 C199 UPDATE [collection1] webapp=null path=null params={} {commit=} 0 18
[junit4:junit4]   2> 7669 T3273 C199 REQ [collection1] webapp=null path=null params={q=*:*} hits=3 status=0 QTime=0 
[junit4:junit4]   2> 7670 T3273 oasc.CoreContainer.shutdown Shutting down CoreContainer instance=16836767
[junit4:junit4]   2> 7670 T3273 oasc.SolrCore.close [collection1]  CLOSING SolrCore org.apache.solr.core.SolrCore@197f06c
[junit4:junit4]   2> 7670 T3273 oasc.SolrCore.closeSearcher [collection1] Closing main searcher on request.
[junit4:junit4]   2> 7671 T3273 oasu.DirectUpdateHandler2.close closing DirectUpdateHandler2{commits=1,autocommits=0,soft autocommits=0,optimizes=0,rollbacks=0,expungeDeletes=0,docsPending=0,adds=0,deletesById=0,deletesByQuery=0,errors=0,cumulative_adds=3,cumulative_deletesById=0,cumulative_deletesByQuery=0,cumulative_errors=0}
[junit4:junit4]   2> 7671 T3273 oasu.DefaultSolrCoreState.decref SolrCoreState ref count has reached 0 - closing IndexWriter
[junit4:junit4]   2> 7679 T3273 oasu.DefaultSolrCoreState.decref Closing SolrCoreState - canceling any ongoing recovery
[junit4:junit4]   2> 7689 T3273 oas.SolrTestCaseJ4.tearDown ###Ending testCorruptLog
[junit4:junit4]   2> NOTE: reproduce with: ant test  -Dtestcase=TestRecovery -Dtests.method=testCorruptLog -Dtests.seed=B1AB8B0A619B39FF -Dtests.slow=true -Dtests.locale=sr_ME_#Latn -Dtests.timezone=Europe/Copenhagen -Dtests.file.encoding=US-ASCII
[junit4:junit4] FAILURE 1.35s | TestRecovery.testCorruptLog <<<
[junit4:junit4]    > Throwable #1: java.lang.AssertionError: expected:<0> but was:<1>
[junit4:junit4]    > 	at __randomizedtesting.SeedInfo.seed([B1AB8B0A619B39FF:43763FD99BA36823]:0)
[junit4:junit4]    > 	at org.junit.Assert.fail(Assert.java:93)
[junit4:junit4]    > 	at org.junit.Assert.failNotEquals(Assert.java:647)
[junit4:junit4]    > 	at org.junit.Assert.assertEquals(Assert.java:128)
[junit4:junit4]    > 	at org.junit.Assert.assertEquals(Assert.java:472)
[junit4:junit4]    > 	at org.junit.Assert.assertEquals(Assert.java:456)
[junit4:junit4]    > 	at org.apache.solr.search.TestRecovery.deleteLogs(TestRecovery.java:1046)
[junit4:junit4]    > 	at org.apache.solr.search.TestRecovery.testCorruptLog(TestRecovery.java:920)
[junit4:junit4]    > 	at sun.reflect.NativeMethodAccessorImpl.invoke0(Native Method)
[junit4:junit4]    > 	at sun.reflect.NativeMethodAccessorImpl.invoke(NativeMethodAccessorImpl.java:57)
[junit4:junit4]    > 	at sun.reflect.DelegatingMethodAccessorImpl.invoke(DelegatingMethodAccessorImpl.java:43)
[junit4:junit4]    > 	at java.lang.reflect.Method.invoke(Method.java:601)
[junit4:junit4]    > 	at com.carrotsearch.randomizedtesting.RandomizedRunner.invoke(RandomizedRunner.java:1559)
[junit4:junit4]    > 	at com.carrotsearch.randomizedtesting.RandomizedRunner.access$600(RandomizedRunner.java:79)
[junit4:junit4]    > 	at com.carrotsearch.randomizedtesting.RandomizedRunner$6.evaluate(RandomizedRunner.java:737)
[junit4:junit4]    > 	at com.carrotsearch.randomizedtesting.RandomizedRunner$7.evaluate(RandomizedRunner.java:773)
[junit4:junit4]    > 	at com.carrotsearch.randomizedtesting.RandomizedRunner$8.evaluate(RandomizedRunner.java:787)
[junit4:junit4]    > 	at com.carrotsearch.randomizedtesting.rules.SystemPropertiesRestoreRule$1.evaluate(SystemPropertiesRestoreRule.java:53)
[junit4:junit4]    > 	at org.apache.lucene.util.TestRuleSetupTeardownChained$1.evaluate(TestRuleSetupTeardownChained.java:50)
[junit4:junit4]    > 	at org.apache.lucene.util.TestRuleFieldCacheSanity$1.evaluate(TestRuleFieldCacheSanity.java:51)
[junit4:junit4]    > 	at org.apache.lucene.util.AbstractBeforeAfterRule$1.evaluate(AbstractBeforeAfterRule.java:45)
[junit4:junit4]    > 	at com.carrotsearch.randomizedtesting.rules.SystemPropertiesInvariantRule$1.evaluate(SystemPropertiesInvariantRule.java:55)
[junit4:junit4]    > 	at org.apache.lucene.util.TestRuleThreadAndTestName$1.evaluate(TestRuleThreadAndTestName.java:48)
[junit4:junit4]    > 	at org.apache.lucene.util.TestRuleIgnoreAfterMaxFailures$1.evaluate(TestRuleIgnoreAfterMaxFailures.java:70)
[junit4:junit4]    > 	at org.apache.lucene.util.TestRuleMarkFailure$1.evaluate(TestRuleMarkFailure.java:48)
[junit4:junit4]    > 	at com.carrotsearch.randomizedtesting.rules.StatementAdapter.evaluate(StatementAdapter.java:36)
[junit4:junit4]    > 	at com.carrotsearch.randomizedtesting.ThreadLeakControl$StatementRunner.run(ThreadLeakControl.java:358)
[junit4:junit4]    > 	at com.carrotsearch.randomizedtesting.ThreadLeakControl.forkTimeoutingTask(ThreadLeakControl.java:782)
[junit4:junit4]    > 	at com.carrotsearch.randomizedtesting.ThreadLeakControl$3.evaluate(ThreadLeakControl.java:442)
[junit4:junit4]    > 	at com.carrotsearch.randomizedtesting.RandomizedRunner.runSingleTest(RandomizedRunner.java:746)
[junit4:junit4]    > 	at com.carrotsearch.randomizedtesting.RandomizedRunner$3.evaluate(RandomizedRunner.java:648)
[junit4:junit4]    > 	at com.carrotsearch.randomizedtesting.RandomizedRunner$4.evaluate(RandomizedRunner.java:682)
[junit4:junit4]    > 	at com.carrotsearch.randomizedtesting.RandomizedRunner$5.evaluate(RandomizedRunner.java:693)
[junit4:junit4]    > 	at com.carrotsearch.randomizedtesting.rules.StatementAdapter.evaluate(StatementAdapter.java:36)
[junit4:junit4]    > 	at com.carrotsearch.randomizedtesting.rules.SystemPropertiesRestoreRule$1.evaluate(SystemPropertiesRestoreRule.java:53)
[junit4:junit4]    > 	at org.apache.lucene.util.AbstractBeforeAfterRule$1.evaluate(AbstractBeforeAfterRule.java:45)
[junit4:junit4]    > 	at org.apache.lucene.util.TestRuleStoreClassName$1.evaluate(TestRuleStoreClassName.java:42)
[junit4:junit4]    > 	at com.carrotsearch.randomizedtesting.rules.SystemPropertiesInvariantRule$1.evaluate(SystemPropertiesInvariantRule.java:55)
[junit4:junit4]    > 	at com.carrotsearch.randomizedtesting.rules.NoShadowingOrOverridesOnMethodsRule$1.evaluate(NoShadowingOrOverridesOnMethodsRule.java:39)
[junit4:junit4]    > 	at com.carrotsearch.randomizedtesting.rules.NoShadowingOrOverridesOnMethodsRule$1.evaluate(NoShadowingOrOverridesOnMethodsRule.java:39)
[junit4:junit4]    > 	at com.carrotsearch.randomizedtesting.rules.StatementAdapter.evaluate(StatementAdapter.java:36)
[junit4:junit4]    > 	at org.apache.lucene.util.TestRuleAssertionsRequired$1.evaluate(TestRuleAssertionsRequired.java:43)
[junit4:junit4]    > 	at org.apache.lucene.util.TestRuleMarkFailure$1.evaluate(TestRuleMarkFailure.java:48)
[junit4:junit4]    > 	at org.apache.lucene.util.TestRuleIgnoreAfterMaxFailures$1.evaluate(TestRuleIgnoreAfterMaxFailures.java:70)
[junit4:junit4]    > 	at org.apache.lucene.util.TestRuleIgnoreTestSuites$1.evaluate(TestRuleIgnoreTestSuites.java:55)
[junit4:junit4]    > 	at com.carrotsearch.randomizedtesting.rules.StatementAdapter.evaluate(StatementAdapter.java:36)
[junit4:junit4]    > 	at com.carrotsearch.randomizedtesting.ThreadLeakControl$StatementRunner.run(ThreadLeakControl.java:358)
[junit4:junit4]    > 	at java.lang.Thread.run(Thread.java:722)
[junit4:junit4]   2> 7715 T3273 oas.SolrTestCaseJ4.setUp ###Starting testLogReplay
[junit4:junit4]   2> 7719 T3273 oas.SolrTestCaseJ4.tearDown ###Ending testLogReplay
[junit4:junit4]   2> NOTE: reproduce with: ant test  -Dtestcase=TestRecovery -Dtests.method=testLogReplay -Dtests.seed=B1AB8B0A619B39FF -Dtests.slow=true -Dtests.locale=sr_ME_#Latn -Dtests.timezone=Europe/Copenhagen -Dtests.file.encoding=US-ASCII
[junit4:junit4] ERROR   0.02s | TestRecovery.testLogReplay <<<
[junit4:junit4]    > Throwable #1: java.lang.RuntimeException: java.lang.NullPointerException
[junit4:junit4]    > 	at __randomizedtesting.SeedInfo.seed([B1AB8B0A619B39FF:2FCAA128FC302773]:0)
[junit4:junit4]    > 	at org.apache.solr.search.TestRecovery.clearIndex(TestRecovery.java:80)
[junit4:junit4]    > 	at org.apache.solr.search.TestRecovery.testLogReplay(TestRecovery.java:112)
[junit4:junit4]    > 	at sun.reflect.NativeMethodAccessorImpl.invoke0(Native Method)
[junit4:junit4]    > 	at sun.reflect.NativeMethodAccessorImpl.invoke(NativeMethodAccessorImpl.java:57)
[junit4:junit4]    > 	at sun.reflect.DelegatingMethodAccessorImpl.invoke(DelegatingMethodAccessorImpl.java:43)
[junit4:junit4]    > 	at java.lang.reflect.Method.invoke(Method.java:601)
[junit4:junit4]    > 	at com.carrotsearch.randomizedtesting.RandomizedRunner.invoke(RandomizedRunner.java:1559)
[junit4:junit4]    > 	at com.carrotsearch.randomizedtesting.RandomizedRunner.access$600(RandomizedRunner.java:79)
[junit4:junit4]    > 	at com.carrotsearch.randomizedtesting.RandomizedRunner$6.evaluate(RandomizedRunner.java:737)
[junit4:junit4]    > 	at com.carrotsearch.randomizedtesting.RandomizedRunner$7.evaluate(RandomizedRunner.java:773)
[junit4:junit4]    > 	at com.carrotsearch.randomizedtesting.RandomizedRunner$8.evaluate(RandomizedRunner.java:787)
[junit4:junit4]    > 	at com.carrotsearch.randomizedtesting.rules.SystemPropertiesRestoreRule$1.evaluate(SystemPropertiesRestoreRule.java:53)
[junit4:junit4]    > 	at org.apache.lucene.util.TestRuleSetupTeardownChained$1.evaluate(TestRuleSetupTeardownChained.java:50)
[junit4:junit4]    > 	at org.apache.lucene.util.TestRuleFieldCacheSanity$1.evaluate(TestRuleFieldCacheSanity.java:51)
[junit4:junit4]    > 	at org.apache.lucene.util.AbstractBeforeAfterRule$1.evaluate(AbstractBeforeAfterRule.java:45)
[junit4:junit4]    > 	at com.carrotsearch.randomizedtesting.rules.SystemPropertiesInvariantRule$1.evaluate(SystemPropertiesInvariantRule.java:55)
[junit4:junit4]    > 	at org.apache.lucene.util.TestRuleThreadAndTestName$1.evaluate(TestRuleThreadAndTestName.java:48)
[junit4:junit4]    > 	at org.apache.lucene.util.TestRuleIgnoreAfterMaxFailures$1.evaluate(TestRuleIgnoreAfterMaxFailures.java:70)
[junit4:junit4]    > 	at org.apache.lucene.util.TestRuleMarkFailure$1.evaluate(TestRuleMarkFailure.java:48)
[junit4:junit4]    > 	at com.carrotsearch.randomizedtesting.rules.StatementAdapter.evaluate(StatementAdapter.java:36)
[junit4:junit4]    > 	at com.carrotsearch.randomizedtesting.ThreadLeakControl$StatementRunner.run(ThreadLeakControl.java:358)
[junit4:junit4]    > 	at com.carrotsearch.randomizedtesting.ThreadLeakControl.forkTimeoutingTask(ThreadLeakControl.java:782)
[junit4:junit4]    > 	at com.carrotsearch.randomizedtesting.ThreadLeakControl$3.evaluate(ThreadLeakControl.java:442)
[junit4:junit4]    > 	at com.carrotsearch.randomizedtesting.RandomizedRunner.runSingleTest(RandomizedRunner.java:746)
[junit4:junit4]    > 	at com.carrotsearch.randomizedtesting.RandomizedRunner$3.evaluate(RandomizedRunner.java:648)
[junit4:junit4]    > 	at com.carrotsearch.randomizedtesting.RandomizedRunner$4.evaluate(RandomizedRunner.java:682)
[junit4:junit4]    > 	at com.carrotsearch.randomizedtesting.RandomizedRunner$5.evaluate(RandomizedRunner.java:693)
[junit4:junit4]    > 	at com.carrotsearch.randomizedtesting.rules.StatementAdapter.evaluate(StatementAdapter.java:36)
[junit4:junit4]    > 	at com.carrotsearch.randomizedtesting.rules.SystemPropertiesRestoreRule$1.evaluate(SystemPropertiesRestoreRule.java:53)
[junit4:junit4]    > 	at org.apache.lucene.util.AbstractBeforeAfterRule$1.evaluate(AbstractBeforeAfterRule.java:45)
[junit4:junit4]    > 	at org.apache.lucene.util.TestRuleStoreClassName$1.evaluate(TestRuleStoreClassName.java:42)
[junit4:junit4]    > 	at com.carrotsearch.randomizedtesting.rules.SystemPropertiesInvariantRule$1.evaluate(SystemPropertiesInvariantRule.java:55)
[junit4:junit4]    > 	at com.carrotsearch.randomizedtesting.rules.NoShadowingOrOverridesOnMethodsRule$1.evaluate(NoShadowingOrOverridesOnMethodsRule.java:39)
[junit4:junit4]    > 	at com.carrotsearch.randomizedtesting.rules.NoShadowingOrOverridesOnMethodsRule$1.evaluate(NoShadowingOrOverridesOnMethodsRule.java:39)
[junit4:junit4]    > 	at com.carrotsearch.randomizedtesting.rules.StatementAdapter.evaluate(StatementAdapter.java:36)
[junit4:junit4]    > 	at org.apache.lucene.util.TestRuleAssertionsRequired$1.evaluate(TestRuleAssertionsRequired.java:43)
[junit4:junit4]    > 	at org.apache.lucene.util.TestRuleMarkFailure$1.evaluate(TestRuleMarkFailure.java:48)
[junit4:junit4]    > 	at org.apache.lucene.util.TestRuleIgnoreAfterMaxFailures$1.evaluate(TestRuleIgnoreAfterMaxFailures.java:70)
[junit4:junit4]    > 	at org.apache.lucene.util.TestRuleIgnoreTestSuites$1.evaluate(TestRuleIgnoreTestSuites.java:55)
[junit4:junit4]    > 	at com.carrotsearch.randomizedtesting.rules.StatementAdapter.evaluate(StatementAdapter.java:36)
[junit4:junit4]    > 	at com.carrotsearch.randomizedtesting.ThreadLeakControl$StatementRunner.run(ThreadLeakControl.java:358)
[junit4:junit4]    > 	at java.lang.Thread.run(Thread.java:722)
[junit4:junit4]    > Caused by: java.lang.NullPointerException
[junit4:junit4]    > 	at org.apache.solr.util.TestHarness.getCore(TestHarness.java:212)
[junit4:junit4]    > 	at org.apache.solr.SolrTestCaseJ4.updateJ(SolrTestCaseJ4.java:797)
[junit4:junit4]    > 	at org.apache.solr.SolrTestCaseJ4.deleteByQueryAndGetVersion(SolrTestCaseJ4.java:947)
[junit4:junit4]    > 	at org.apache.solr.search.TestRecovery.clearIndex(TestRecovery.java:78)
[junit4:junit4]    > 	... 41 more
[junit4:junit4]   2> 7730 T3273 oas.SolrTestCaseJ4.setUp ###Starting testRemoveOldLogs
[junit4:junit4]   2> 7732 T3273 oas.SolrTestCaseJ4.tearDown ###Ending testRemoveOldLogs
[junit4:junit4]   2> NOTE: reproduce with: ant test  -Dtestcase=TestRecovery -Dtests.method=testRemoveOldLogs -Dtests.seed=B1AB8B0A619B39FF -Dtests.slow=true -Dtests.locale=sr_ME_#Latn -Dtests.timezone=Europe/Copenhagen -Dtests.file.encoding=US-ASCII
[junit4:junit4] ERROR   0.01s | TestRecovery.testRemoveOldLogs <<<
[junit4:junit4]    > Throwable #1: java.lang.RuntimeException: java.lang.NullPointerException
[junit4:junit4]    > 	at __randomizedtesting.SeedInfo.seed([B1AB8B0A619B39FF:90374AA1A9A1B007]:0)
[junit4:junit4]    > 	at org.apache.solr.search.TestRecovery.clearIndex(TestRecovery.java:80)
[junit4:junit4]    > 	at org.apache.solr.search.TestRecovery.testRemoveOldLogs(TestRecovery.java:709)
[junit4:junit4]    > 	at sun.reflect.NativeMethodAccessorImpl.invoke0(Native Method)
[junit4:junit4]    > 	at sun.reflect.NativeMethodAccessorImpl.invoke(NativeMethodAccessorImpl.java:57)
[junit4:junit4]    > 	at sun.reflect.DelegatingMethodAccessorImpl.invoke(DelegatingMethodAccessorImpl.java:43)
[junit4:junit4]    > 	at java.lang.reflect.Method.invoke(Method.java:601)
[junit4:junit4]    > 	at com.carrotsearch.randomizedtesting.RandomizedRunner.invoke(RandomizedRunner.java:1559)
[junit4:junit4]    > 	at com.carrotsearch.randomizedtesting.RandomizedRunner.access$600(RandomizedRunner.java:79)
[junit4:junit4]    > 	at com.carrotsearch.randomizedtesting.RandomizedRunner$6.evaluate(RandomizedRunner.java:737)
[junit4:junit4]    > 	at com.carrotsearch.randomizedtesting.RandomizedRunner$7.evaluate(RandomizedRunner.java:773)
[junit4:junit4]    > 	at com.carrotsearch.randomizedtesting.RandomizedRunner$8.evaluate(RandomizedRunner.java:787)
[junit4:junit4]    > 	at com.carrotsearch.randomizedtesting.rules.SystemPropertiesRestoreRule$1.evaluate(SystemPropertiesRestoreRule.java:53)
[junit4:junit4]    > 	at org.apache.lucene.util.TestRuleSetupTeardownChained$1.evaluate(TestRuleSetupTeardownChained.java:50)
[junit4:junit4]    > 	at org.apache.lucene.util.TestRuleFieldCacheSanity$1.evaluate(TestRuleFieldCacheSanity.java:51)
[junit4:junit4]    > 	at org.apache.lucene.util.AbstractBeforeAfterRule$1.evaluate(AbstractBeforeAfterRule.java:45)
[junit4:junit4]    > 	at com.carrotsearch.randomizedtesting.rules.SystemPropertiesInvariantRule$1.evaluate(SystemPropertiesInvariantRule.java:55)
[junit4:junit4]    > 	at org.apache.lucene.util.TestRuleThreadAndTestName$1.evaluate(TestRuleThreadAndTestName.java:48)
[junit4:junit4]    > 	at org.apache.lucene.util.TestRuleIgnoreAfterMaxFailures$1.evaluate(TestRuleIgnoreAfterMaxFailures.java:70)
[junit4:junit4]    > 	at org.apache.lucene.util.TestRuleMarkFailure$1.evaluate(TestRuleMarkFailure.java:48)
[junit4:junit4]    > 	at com.carrotsearch.randomizedtesting.rules.StatementAdapter.evaluate(StatementAdapter.java:36)
[junit4:junit4]    > 	at com.carrotsearch.randomizedtesting.ThreadLeakControl$StatementRunner.run(ThreadLeakControl.java:358)
[junit4:junit4]    > 	at com.carrotsearch.randomizedtesting.ThreadLeakControl.forkTimeoutingTask(ThreadLeakControl.java:782)
[junit4:junit4]    > 	at com.carrotsearch.randomizedtesting.ThreadLeakControl$3.evaluate(ThreadLeakControl.java:442)
[junit4:junit4]    > 	at com.carrotsearch.randomizedtesting.RandomizedRunner.runSingleTest(RandomizedRunner.java:746)
[junit4:junit4]    > 	at com.carrotsearch.randomizedtesting.RandomizedRunner$3.evaluate(RandomizedRunner.java:648)
[junit4:junit4]    > 	at com.carrotsearch.randomizedtesting.RandomizedRunner$4.evaluate(RandomizedRunner.java:682)
[junit4:junit4]    > 	at com.carrotsearch.randomizedtesting.RandomizedRunner$5.evaluate(RandomizedRunner.java:693)
[junit4:junit4]    > 	at com.carrotsearch.randomizedtesting.rules.StatementAdapter.evaluate(StatementAdapter.java:36)
[junit4:junit4]    > 	at com.carrotsearch.randomizedtesting.rules.SystemPropertiesRestoreRule$1.evaluate(SystemPropertiesRestoreRule.java:53)
[junit4:junit4]    > 	at org.apache.lucene.util.AbstractBeforeAfterRule$1.evaluate(AbstractBeforeAfterRule.java:45)
[junit4:junit4]    > 	at org.apache.lucene.util.TestRuleStoreClassName$1.evaluate(TestRuleStoreClassName.java:42)
[junit4:junit4]    > 	at com.carrotsearch.randomizedtesting.rules.SystemPropertiesInvariantRule$1.evaluate(SystemPropertiesInvariantRule.java:55)
[junit4:junit4]    > 	at com.carrotsearch.randomizedtesting.rules.NoShadowingOrOverridesOnMethodsRule$1.evaluate(NoShadowingOrOverridesOnMethodsRule.java:39)
[junit4:junit4]    > 	at com.carrotsearch.randomizedtesting.rules.NoShadowingOrOverridesOnMethodsRule$1.evaluate(NoShadowingOrOverridesOnMethodsRule.java:39)
[junit4:junit4]    > 	at com.carrotsearch.randomizedtesting.rules.StatementAdapter.evaluate(StatementAdapter.java:36)
[junit4:junit4]    > 	at org.apache.lucene.util.TestRuleAssertionsRequired$1.evaluate(TestRuleAssertionsRequired.java:43)
[junit4:junit4]    > 	at org.apache.lucene.util.TestRuleMarkFailure$1.evaluate(TestRuleMarkFailure.java:48)
[junit4:junit4]    > 	at org.apache.lucene.util.TestRuleIgnoreAfterMaxFailures$1.evaluate(TestRuleIgnoreAfterMaxFailures.java:70)
[junit4:junit4]    > 	at org.apache.lucene.util.TestRuleIgnoreTestSuites$1.evaluate(TestRuleIgnoreTestSuites.java:55)
[junit4:junit4]    > 	at com.carrotsearch.randomizedtesting.rules.StatementAdapter.evaluate(StatementAdapter.java:36)
[junit4:junit4]    > 	at com.carrotsearch.randomizedtesting.ThreadLeakControl$StatementRunner.run(ThreadLeakControl.java:358)
[junit4:junit4]    > 	at java.lang.Thread.run(Thread.java:722)
[junit4:junit4]    > Caused by: java.lang.NullPointerException
[junit4:junit4]    > 	at org.apache.solr.util.TestHarness.getCore(TestHarness.java:212)
[junit4:junit4]    > 	at org.apache.solr.SolrTestCaseJ4.updateJ(SolrTestCaseJ4.java:797)
[junit4:junit4]    > 	at org.apache.solr.SolrTestCaseJ4.deleteByQueryAndGetVersion(SolrTestCaseJ4.java:947)
[junit4:junit4]    > 	at org.apache.solr.search.TestRecovery.clearIndex(TestRecovery.java:78)
[junit4:junit4]    > 	... 41 more
[junit4:junit4]   2> 7742 T3273 oas.SolrTestCaseJ4.setUp ###Starting testCleanShutdown
[junit4:junit4]   2> 7745 T3273 oas.SolrTestCaseJ4.tearDown ###Ending testCleanShutdown
[junit4:junit4]   2> NOTE: reproduce with: ant test  -Dtestcase=TestRecovery -Dtests.method=testCleanShutdown -Dtests.seed=B1AB8B0A619B39FF -Dtests.slow=true -Dtests.locale=sr_ME_#Latn -Dtests.timezone=Europe/Copenhagen -Dtests.file.encoding=US-ASCII
[junit4:junit4] ERROR   0.01s | TestRecovery.testCleanShutdown <<<
[junit4:junit4]    > Throwable #1: java.lang.NullPointerException
[junit4:junit4]    > 	at __randomizedtesting.SeedInfo.seed([B1AB8B0A619B39FF:2FE433CD040261BA]:0)
[junit4:junit4]    > 	at org.apache.solr.util.TestHarness.getCore(TestHarness.java:212)
[junit4:junit4]    > 	at org.apache.solr.util.TestHarness$LocalRequestFactory.makeRequest(TestHarness.java:625)
[junit4:junit4]    > 	at org.apache.solr.SolrTestCaseJ4.req(SolrTestCaseJ4.java:742)
[junit4:junit4]    > 	at org.apache.solr.search.TestRecovery.testCleanShutdown(TestRecovery.java:644)
[junit4:junit4]    > 	at sun.reflect.NativeMethodAccessorImpl.invoke0(Native Method)
[junit4:junit4]    > 	at sun.reflect.NativeMethodAccessorImpl.invoke(NativeMethodAccessorImpl.java:57)
[junit4:junit4]    > 	at sun.reflect.DelegatingMethodAccessorImpl.invoke(DelegatingMethodAccessorImpl.java:43)
[junit4:junit4]    > 	at java.lang.reflect.Method.invoke(Method.java:601)
[junit4:junit4]    > 	at com.carrotsearch.randomizedtesting.RandomizedRunner.invoke(RandomizedRunner.java:1559)
[junit4:junit4]    > 	at com.carrotsearch.randomizedtesting.RandomizedRunner.access$600(RandomizedRunner.java:79)
[junit4:junit4]    > 	at com.carrotsearch.randomizedtesting.RandomizedRunner$6.evaluate(RandomizedRunner.java:737)
[junit4:junit4]    > 	at com.carrotsearch.randomizedtesting.RandomizedRunner$7.evaluate(RandomizedRunner.java:773)
[junit4:junit4]    > 	at com.carrotsearch.randomizedtesting.RandomizedRunner$8.evaluate(RandomizedRunner.java:787)
[junit4:junit4]    > 	at com.carrotsearch.randomizedtesting.rules.SystemPropertiesRestoreRule$1.evaluate(SystemPropertiesRestoreRule.java:53)
[junit4:junit4]    > 	at org.apache.lucene.util.TestRuleSetupTeardownChained$1.evaluate(TestRuleSetupTeardownChained.java:50)
[junit4:junit4]    > 	at org.apache.lucene.util.TestRuleFieldCacheSanity$1.evaluate(TestRuleFieldCacheSanity.java:51)
[junit4:junit4]    > 	at org.apache.lucene.util.AbstractBeforeAfterRule$1.evaluate(AbstractBeforeAfterRule.java:45)
[junit4:junit4]    > 	at com.carrotsearch.randomizedtesting.rules.SystemPropertiesInvariantRule$1.evaluate(SystemPropertiesInvariantRule.java:55)
[junit4:junit4]    > 	at org.apache.lucene.util.TestRuleThreadAndTestName$1.evaluate(TestRuleThreadAndTestName.java:48)
[junit4:junit4]    > 	at org.apache.lucene.util.TestRuleIgnoreAfterMaxFailures$1.evaluate(TestRuleIgnoreAfterMaxFailures.java:70)
[junit4:junit4]    > 	at org.apache.lucene.util.TestRuleMarkFailure$1.evaluate(TestRuleMarkFailure.java:48)
[junit4:junit4]    > 	at com.carrotsearch.randomizedtesting.rules.StatementAdapter.evaluate(StatementAdapter.java:36)
[junit4:junit4]    > 	at com.carrotsearch.randomizedtesting.ThreadLeakControl$StatementRunner.run(ThreadLeakControl.java:358)
[junit4:junit4]    > 	at com.carrotsearch.randomizedtesting.ThreadLeakControl.forkTimeoutingTask(ThreadLeakControl.java:782)
[junit4:junit4]    > 	at com.carrotsearch.randomizedtesting.ThreadLeakControl$3.evaluate(ThreadLeakControl.java:442)
[junit4:junit4]    > 	at com.carrotsearch.randomizedtesting.RandomizedRunner.runSingleTest(RandomizedRunner.java:746)
[junit4:junit4]    > 	at com.carrotsearch.randomizedtesting.RandomizedRunner$3.evaluate(RandomizedRunner.java:648)
[junit4:junit4]    > 	at com.carrotsearch.randomizedtesting.RandomizedRunner$4.evaluate(RandomizedRunner.java:682)
[junit4:junit4]    > 	at com.carrotsearch.randomizedtesting.RandomizedRunner$5.evaluate(RandomizedRunner.java:693)
[junit4:junit4]    > 	at com.carrotsearch.randomizedtesting.rules.StatementAdapter.evaluate(StatementAdapter.java:36)
[junit4:junit4]    > 	at com.carrotsearch.randomizedtesting.rules.SystemPropertiesRestoreRule$1.evaluate(SystemPropertiesRestoreRule.java:53)
[junit4:junit4]    > 	at org.apache.lucene.util.AbstractBeforeAfterRule$1.evaluate(AbstractBeforeAfterRule.java:45)
[junit4:junit4]    > 	at org.apache.lucene.util.TestRuleStoreClassName$1.evaluate(TestRuleStoreClassName.java:42)
[junit4:junit4]    > 	at com.carrotsearch.randomizedtesting.rules.SystemPropertiesInvariantRule$1.evaluate(SystemPropertiesInvariantRule.java:55)
[junit4:junit4]    > 	at com.carrotsearch.randomizedtesting.rules.NoShadowingOrOverridesOnMethodsRule$1.evaluate(NoShadowingOrOverridesOnMethodsRule.java:39)
[junit4:junit4]    > 	at com.carrotsearch.randomizedtesting.rules.NoShadowingOrOverridesOnMethodsRule$1.evaluate(NoShadowingOrOverridesOnMethodsRule.java:39)
[junit4:junit4]    > 	at com.carrotsearch.randomizedtesting.rules.StatementAdapter.evaluate(StatementAdapter.java:36)
[junit4:junit4]    > 	at org.apache.lucene.util.TestRuleAssertionsRequired$1.evaluate(TestRuleAssertionsRequired.java:43)
[junit4:junit4]    > 	at org.apache.lucene.util.TestRuleMarkFailure$1.evaluate(TestRuleMarkFailure.java:48)
[junit4:junit4]    > 	at org.apache.lucene.util.TestRuleIgnoreAfterMaxFailures$1.evaluate(TestRuleIgnoreAfterMaxFailures.java:70)
[junit4:junit4]    > 	at org.apache.lucene.util.TestRuleIgnoreTestSuites$1.evaluate(TestRuleIgnoreTestSuites.java:55)
[junit4:junit4]    > 	at com.carrotsearch.randomizedtesting.rules.StatementAdapter.evaluate(StatementAdapter.java:36)
[junit4:junit4]    > 	at com.carrotsearch.randomizedtesting.ThreadLeakControl$StatementRunner.run(ThreadLeakControl.java:358)
[junit4:junit4]    > 	at java.lang.Thread.run(Thread.java:722)
[junit4:junit4]   2> 7753 T3273 oas.SolrTestCaseJ4.setUp ###Starting testTruncatedLog
[junit4:junit4]   2> 7756 T3273 oas.SolrTestCaseJ4.tearDown ###Ending testTruncatedLog
[junit4:junit4]   2> NOTE: reproduce with: ant test  -Dtestcase=TestRecovery -Dtests.method=testTruncatedLog -Dtests.seed=B1AB8B0A619B39FF -Dtests.slow=true -Dtests.locale=sr_ME_#Latn -Dtests.timezone=Europe/Copenhagen -Dtests.file.encoding=US-ASCII
[junit4:junit4] ERROR   0.01s | TestRecovery.testTruncatedLog <<<
[junit4:junit4]    > Throwable #1: java.lang.NullPointerException
[junit4:junit4]    > 	at __randomizedtesting.SeedInfo.seed([B1AB8B0A619B39FF:D591737268A2448C]:0)
[junit4:junit4]    > 	at org.apache.solr.util.TestHarness.getCore(TestHarness.java:212)
[junit4:junit4]    > 	at org.apache.solr.search.TestRecovery.testTruncatedLog(TestRecovery.java:822)
[junit4:junit4]    > 	at sun.reflect.NativeMethodAccessorImpl.invoke0(Native Method)
[junit4:junit4]    > 	at sun.reflect.NativeMethodAccessorImpl.invoke(NativeMethodAccessorImpl.java:57)
[junit4:junit4]    > 	at sun.reflect.DelegatingMethodAccessorImpl.invoke(DelegatingMethodAccessorImpl.java:43)
[junit4:junit4]    > 	at java.lang.reflect.Method.invoke(Method.java:601)
[junit4:junit4]    > 	at com.carrotsearch.randomizedtesting.RandomizedRunner.invoke(RandomizedRunner.java:1559)
[junit4:junit4]    > 	at com.carrotsearch.randomizedtesting.RandomizedRunner.access$600(RandomizedRunner.java:79)
[junit4:junit4]    > 	at com.carrotsearch.randomizedtesting.RandomizedRunner$6.evaluate(RandomizedRunner.java:737)
[junit4:junit4]    > 	at com.carrotsearch.randomizedtesting.RandomizedRunner$7.evaluate(RandomizedRunner.java:773)
[junit4:junit4]    > 	at com.carrotsearch.randomizedtesting.RandomizedRunner$8.evaluate(RandomizedRunner.java:787)
[junit4:junit4]    > 	at com.carrotsearch.randomizedtesting.rules.SystemPropertiesRestoreRule$1.evaluate(SystemPropertiesRestoreRule.java:53)
[junit4:junit4]    > 	at org.apache.lucene.util.TestRuleSetupTeardownChained$1.evaluate(TestRuleSetupTeardownChained.java:50)
[junit4:junit4]    > 	at org.apache.lucene.util.TestRuleFieldCacheSanity$1.evaluate(TestRuleFieldCacheSanity.java:51)
[junit4:junit4]    > 	at org.apache.lucene.util.AbstractBeforeAfterRule$1.evaluate(AbstractBeforeAfterRule.java:45)
[junit4:junit4]    > 	at com.carrotsearch.randomizedtesting.rules.SystemPropertiesInvariantRule$1.evaluate(SystemPropertiesInvariantRule.java:55)
[junit4:junit4]    > 	at org.apache.lucene.util.TestRuleThreadAndTestName$1.evaluate(TestRuleThreadAndTestName.java:48)
[junit4:junit4]    > 	at org.apache.lucene.util.TestRuleIgnoreAfterMaxFailures$1.evaluate(TestRuleIgnoreAfterMaxFailures.java:70)
[junit4:junit4]    > 	at org.apache.lucene.util.TestRuleMarkFailure$1.evaluate(TestRuleMarkFailure.java:48)
[junit4:junit4]    > 	at com.carrotsearch.randomizedtesting.rules.StatementAdapter.evaluate(StatementAdapter.java:36)
[junit4:junit4]    > 	at com.carrotsearch.randomizedtesting.ThreadLeakControl$StatementRunner.run(ThreadLeakControl.java:358)
[junit4:junit4]    > 	at com.carrotsearch.randomizedtesting.ThreadLeakControl.forkTimeoutingTask(ThreadLeakControl.java:782)
[junit4:junit4]    > 	at com.carrotsearch.randomizedtesting.ThreadLeakControl$3.evaluate(ThreadLeakControl.java:442)
[junit4:junit4]    > 	at com.carrotsearch.randomizedtesting.RandomizedRunner.runSingleTest(RandomizedRunner.java:746)
[junit4:junit4]    > 	at com.carrotsearch.randomizedtesting.RandomizedRunner$3.evaluate(RandomizedRunner.java:648)
[junit4:junit4]    > 	at com.carrotsearch.randomizedtesting.RandomizedRunner$4.evaluate(RandomizedRunner.java:682)
[junit4:junit4]    > 	at com.carrotsearch.randomizedtesting.RandomizedRunner$5.evaluate(RandomizedRunner.java:693)
[junit4:junit4]    > 	at com.carrotsearch.randomizedtesting.rules.StatementAdapter.evaluate(StatementAdapter.java:36)
[junit4:junit4]    > 	at com.carrotsearch.randomizedtesting.rules.SystemPropertiesRestoreRule$1.evaluate(SystemPropertiesRestoreRule.java:53)
[junit4:junit4]    > 	at org.apache.lucene.util.AbstractBeforeAfterRule$1.evaluate(AbstractBeforeAfterRule.java:45)
[junit4:junit4]    > 	at org.apache.lucene.util.TestRuleStoreClassName$1.evaluate(TestRuleStoreClassName.java:42)
[junit4:junit4]    > 	at com.carrotsearch.randomizedtesting.rules.SystemPropertiesInvariantRule$1.evaluate(SystemPropertiesInvariantRule.java:55)
[junit4:junit4]    > 	at com.carrotsearch.randomizedtesting.rules.NoShadowingOrOverridesOnMethodsRule$1.evaluate(NoShadowingOrOverridesOnMethodsRule.java:39)
[junit4:junit4]    > 	at com.carrotsearch.randomizedtesting.rules.NoShadowingOrOverridesOnMethodsRule$1.evaluate(NoShadowingOrOverridesOnMethodsRule.java:39)
[junit4:junit4]    > 	at com.carrotsearch.randomizedtesting.rules.StatementAdapter.evaluate(StatementAdapter.java:36)
[junit4:junit4]    > 	at org.apache.lucene.util.TestRuleAssertionsRequired$1.evaluate(TestRuleAssertionsRequired.java:43)
[junit4:junit4]    > 	at org.apache.lucene.util.TestRuleMarkFailure$1.evaluate(TestRuleMarkFailure.java:48)
[junit4:junit4]    > 	at org.apache.lucene.util.TestRuleIgnoreAfterMaxFailures$1.evaluate(TestRuleIgnoreAfterMaxFailures.java:70)
[junit4:junit4]    > 	at org.apache.lucene.util.TestRuleIgnoreTestSuites$1.evaluate(TestRuleIgnoreTestSuites.java:55)
[junit4:junit4]    > 	at com.carrotsearch.randomizedtesting.rules.StatementAdapter.evaluate(StatementAdapter.java:36)
[junit4:junit4]    > 	at com.carrotsearch.randomizedtesting.ThreadLeakControl$StatementRunner.run(ThreadLeakControl.java:358)
[junit4:junit4]    > 	at java.lang.Thread.run(Thread.java:722)
[junit4:junit4]   2> 7768 T3273 oas.SolrTestCaseJ4.setUp ###Starting testRecoveryMultipleLogs
[junit4:junit4]   2> 7771 T3273 oas.SolrTestCaseJ4.tearDown ###Ending testRecoveryMultipleLogs
[junit4:junit4]   2> NOTE: reproduce with: ant test  -Dtestcase=TestRecovery -Dtests.method=testRecoveryMultipleLogs -Dtests.seed=B1AB8B0A619B39FF -Dtests.slow=true -Dtests.locale=sr_ME_#Latn -Dtests.timezone=Europe/Copenhagen -Dtests.file.encoding=US-ASCII
[junit4:junit4] ERROR   0.01s | TestRecovery.testRecoveryMultipleLogs <<<
[junit4:junit4]    > Throwable #1: java.lang.NullPointerException
[junit4:junit4]    > 	at __randomizedtesting.SeedInfo.seed([B1AB8B0A619B39FF:83E133BE6E07E16]:0)
[junit4:junit4]    > 	at org.apache.solr.util.TestHarness.getCore(TestHarness.java:212)
[junit4:junit4]    > 	at org.apache.solr.search.TestRecovery.testRecoveryMultipleLogs(TestRecovery.java:957)
[junit4:junit4]    > 	at sun.reflect.NativeMethodAccessorImpl.invoke0(Native Method)
[junit4:junit4]    > 	at sun.reflect.NativeMethodAccessorImpl.invoke(NativeMethodAccessorImpl.java:57)
[junit4:junit4]    > 	at sun.reflect.DelegatingMethodAccessorImpl.invoke(DelegatingMethodAccessorImpl.java:43)
[junit4:junit4]    > 	at java.lang.reflect.Method.invoke(Method.java:601)
[junit4:junit4]    > 	at com.carrotsearch.randomizedtesting.RandomizedRunner.invoke(RandomizedRunner.java:1559)
[junit4:junit4]    > 	at com.carrotsearch.randomizedtesting.RandomizedRunner.access$600(RandomizedRunner.java:79)
[junit4:junit4]    > 	at com.carrotsearch.randomizedtesting.RandomizedRunner$6.evaluate(RandomizedRunner.java:737)
[junit4:junit4]    > 	at com.carrotsearch.randomizedtesting.RandomizedRunner$7.evaluate(RandomizedRunner.java:773)
[junit4:junit4]    > 	at com.carrotsearch.randomizedtesting.RandomizedRunner$8.evaluate(RandomizedRunner.java:787)
[junit4:junit4]    > 	at com.carrotsearch.randomizedtesting.rules.SystemPropertiesRestoreRule$1.evaluate(SystemPropertiesRestoreRule.java:53)
[junit4:junit4]    > 	at org.apache.lucene.util.TestRuleSetupTeardownChained$1.evaluate(TestRuleSetupTeardownChained.java:50)
[junit4:junit4]    > 	at org.apache.lucene.util.TestRuleFieldCacheSanity$1.evaluate(TestRuleFieldCacheSanity.java:51)
[junit4:junit4]    > 	at org.apache.lucene.util.AbstractBeforeAfterRule$1.evaluate(AbstractBeforeAfterRule.java:45)
[junit4:junit4]    > 	at com.carrotsearch.randomizedtesting.rules.SystemPropertiesInvariantRule$1.evaluate(SystemPropertiesInvariantRule.java:55)
[junit4:junit4]    > 	at org.apache.lucene.util.TestRuleThreadAndTestName$1.evaluate(TestRuleThreadAndTestName.java:48)
[junit4:junit4]    > 	at org.apache.lucene.util.TestRuleIgnoreAfterMaxFailures$1.evaluate(TestRuleIgnoreAfterMaxFailures.java:70)
[junit4:junit4]    > 	at org.apache.lucene.util.TestRuleMarkFailure$1.evaluate(TestRuleMarkFailure.java:48)
[junit4:junit4]    > 	at com.carrotsearch.randomizedtesting.rules.StatementAdapter.evaluate(StatementAdapter.java:36)
[junit4:junit4]    > 	at com.carrotsearch.randomizedtesting.ThreadLeakControl$StatementRunner.run(ThreadLeakControl.java:358)
[junit4:junit4]    > 	at com.carrotsearch.randomizedtesting.ThreadLeakControl.forkTimeoutingTask(ThreadLeakControl.java:782)
[junit4:junit4]    > 	at com.carrotsearch.randomizedtesting.ThreadLeakControl$3.evaluate(ThreadLeakControl.java:442)
[junit4:junit4]    > 	at com.carrotsearch.randomizedtesting.RandomizedRunner.runSingleTest(RandomizedRunner.java:746)
[junit4:junit4]    > 	at com.carrotsearch.randomizedtesting.RandomizedRunner$3.evaluate(RandomizedRunner.java:648)
[junit4:junit4]    > 	at com.carrotsearch.randomizedtesting.RandomizedRunner$4.evaluate(RandomizedRunner.java:682)
[junit4:junit4]    > 	at com.carrotsearch.randomizedtesting.RandomizedRunner$5.evaluate(RandomizedRunner.java:693)
[junit4:junit4]    > 	at com.carrotsearch.randomizedtesting.rules.StatementAdapter.evaluate(StatementAdapter.java:36)
[junit4:junit4]    > 	at com.carrotsearch.randomizedtesting.rules.SystemPropertiesRestoreRule$1.evaluate(SystemPropertiesRestoreRule.java:53)
[junit4:junit4]    > 	at org.apache.lucene.util.AbstractBeforeAfterRule$1.evaluate(AbstractBeforeAfterRule.java:45)
[junit4:junit4]    > 	at org.apache.lucene.util.TestRuleStoreClassName$1.evaluate(TestRuleStoreClassName.java:42)
[junit4:junit4]    > 	at com.carrotsearch.randomizedtesting.rules.SystemPropertiesInvariantRule$1.evaluate(SystemPropertiesInvariantRule.java:55)
[junit4:junit4]    > 	at com.carrotsearch.randomizedtesting.rules.NoShadowingOrOverridesOnMethodsRule$1.evaluate(NoShadowingOrOverridesOnMethodsRule.java:39)
[junit4:junit4]    > 	at com.carrotsearch.randomizedtesting.rules.NoShadowingOrOverridesOnMethodsRule$1.evaluate(NoShadowingOrOverridesOnMethodsRule.java:39)
[junit4:junit4]    > 	at com.carrotsearch.randomizedtesting.rules.StatementAdapter.evaluate(StatementAdapter.java:36)
[junit4:junit4]    > 	at org.apache.lucene.util.TestRuleAssertionsRequired$1.evaluate(TestRuleAssertionsRequired.java:43)
[junit4:junit4]    > 	at org.apache.lucene.util.TestRuleMarkFailure$1.evaluate(TestRuleMarkFailure.java:48)
[junit4:junit4]    > 	at org.apache.lucene.util.TestRuleIgnoreAfterMaxFailures$1.evaluate(TestRuleIgnoreAfterMaxFailures.java:70)
[junit4:junit4]    > 	at org.apache.lucene.util.TestRuleIgnoreTestSuites$1.evaluate(TestRuleIgnoreTestSuites.java:55)
[junit4:junit4]    > 	at com.carrotsearch.randomizedtesting.rules.StatementAdapter.evaluate(StatementAdapter.java:36)
[junit4:junit4]    > 	at com.carrotsearch.randomizedtesting.ThreadLeakControl$StatementRunner.run(ThreadLeakControl.java:358)
[junit4:junit4]    > 	at java.lang.Thread.run(Thread.java:722)
[junit4:junit4]   2> 7780 T3273 oas.SolrTestCaseJ4.setUp ###Starting testBuffering
[junit4:junit4]   2> 7781 T3273 oas.SolrTestCaseJ4.tearDown ###Ending testBuffering
[junit4:junit4]   2> NOTE: reproduce with: ant test  -Dtestcase=TestRecovery -Dtests.method=testBuffering -Dtests.seed=B1AB8B0A619B39FF -Dtests.slow=true -Dtests.locale=sr_ME_#Latn -Dtests.timezone=Europe/Copenhagen -Dtests.file.encoding=US-ASCII
[junit4:junit4] ERROR   0.01s | TestRecovery.testBuffering <<<
[junit4:junit4]    > Throwable #1: java.lang.NullPointerException
[junit4:junit4]    > 	at __randomizedtesting.SeedInfo.seed([B1AB8B0A619B39FF:AC452521C0C298D4]:0)
[junit4:junit4]    > 	at org.apache.solr.util.TestHarness.getCore(TestHarness.java:212)
[junit4:junit4]    > 	at org.apache.solr.util.TestHarness$LocalRequestFactory.makeRequest(TestHarness.java:625)
[junit4:junit4]    > 	at org.apache.solr.SolrTestCaseJ4.req(SolrTestCaseJ4.java:742)
[junit4:junit4]    > 	at org.apache.solr.search.TestRecovery.testBuffering(TestRecovery.java:216)
[junit4:junit4]    > 	at sun.reflect.NativeMethodAccessorImpl.invoke0(Native Method)
[junit4:junit4]    > 	at sun.reflect.NativeMethodAccessorImpl.invoke(NativeMethodAccessorImpl.java:57)
[junit4:junit4]    > 	at sun.reflect.DelegatingMethodAccessorImpl.invoke(DelegatingMethodAccessorImpl.java:43)
[junit4:junit4]    > 	at java.lang.reflect.Method.invoke(Method.java:601)
[junit4:junit4]    > 	at com.carrotsearch.randomizedtesting.RandomizedRunner.invoke(RandomizedRunner.java:1559)
[junit4:junit4]    > 	at com.carrotsearch.randomizedtesting.RandomizedRunner.access$600(RandomizedRunner.java:79)
[junit4:junit4]    > 	at com.carrotsearch.randomizedtesting.RandomizedRunner$6.evaluate(RandomizedRunner.java:737)
[junit4:junit4]    > 	at com.carrotsearch.randomizedtesting.RandomizedRunner$7.evaluate(RandomizedRunner.java:773)
[junit4:junit4]    > 	at com.carrotsearch.randomizedtesting.RandomizedRunner$8.evaluate(RandomizedRunner.java:787)
[junit4:junit4]    > 	at com.carrotsearch.randomizedtesting.rules.SystemPropertiesRestoreRule$1.evaluate(SystemPropertiesRestoreRule.java:53)
[junit4:junit4]    > 	at org.apache.lucene.util.TestRuleSetupTeardownChained$1.evaluate(TestRuleSetupTeardownChained.java:50)
[junit4:junit4]    > 	at org.apache.lucene.util.TestRuleFieldCacheSanity$1.evaluate(TestRuleFieldCacheSanity.java:51)
[junit4:junit4]    > 	at org.apache.lucene.util.AbstractBeforeAfterRule$1.evaluate(AbstractBeforeAfterRule.java:45)
[junit4:junit4]    > 	at com.carrotsearch.randomizedtesting.rules.SystemPropertiesInvariantRule$1.evaluate(SystemPropertiesInvariantRule.java:55)
[junit4:junit4]    > 	at org.apache.lucene.util.TestRuleThreadAndTestName$1.evaluate(TestRuleThreadAndTestName.java:48)
[junit4:junit4]    > 	at org.apache.lucene.util.TestRuleIgnoreAfterMaxFailures$1.evaluate(TestRuleIgnoreAfterMaxFailures.java:70)
[junit4:junit4]    > 	at org.apache.lucene.util.TestRuleMarkFailure$1.evaluate(TestRuleMarkFailure.java:48)
[junit4:junit4]    > 	at com.carrotsearch.randomizedtesting.rules.StatementAdapter.evaluate(StatementAdapter.java:36)
[junit4:junit4]    > 	at com.carrotsearch.randomizedtesting.ThreadLeakControl$StatementRunner.run(ThreadLeakControl.java:358)
[junit4:junit4]    > 	at com.carrotsearch.randomizedtesting.ThreadLeakControl.forkTimeoutingTask(ThreadLeakControl.java:782)
[junit4:junit4]    > 	at com.carrotsearch.randomizedtesting.ThreadLeakControl$3.evaluate(ThreadLeakControl.java:442)
[junit4:junit4]    > 	at com.carrotsearch.randomizedtesting.RandomizedRunner.runSingleTest(RandomizedRunner.java:746)
[junit4:junit4]    > 	at com.carrotsearch.randomizedtesting.RandomizedRunner$3.evaluate(RandomizedRunner.java:648)
[junit4:junit4]    > 	at com.carrotsearch.randomizedtesting.RandomizedRunner$4.evaluate(RandomizedRunner.java:682)
[junit4:junit4]    > 	at com.carrotsearch.randomizedtesting.RandomizedRunner$5.evaluate(RandomizedRunner.java:693)
[junit4:junit4]    > 	at com.carrotsearch.randomizedtesting.rules.StatementAdapter.evaluate(StatementAdapter.java:36)
[junit4:junit4]    > 	at com.carrotsearch.randomizedtesting.rules.SystemPropertiesRestoreRule$1.evaluate(SystemPropertiesRestoreRule.java:53)
[junit4:junit4]    > 	at org.apache.lucene.util.AbstractBeforeAfterRule$1.evaluate(AbstractBeforeAfterRule.java:45)
[junit4:junit4]    > 	at org.apache.lucene.util.TestRuleStoreClassName$1.evaluate(TestRuleStoreClassName.java:42)
[junit4:junit4]    > 	at com.carrotsearch.randomizedtesting.rules.SystemPropertiesInvariantRule$1.evaluate(SystemPropertiesInvariantRule.java:55)
[junit4:junit4]    > 	at com.carrotsearch.randomizedtesting.rules.NoShadowingOrOverridesOnMethodsRule$1.evaluate(NoShadowingOrOverridesOnMethodsRule.java:39)
[junit4:junit4]    > 	at com.carrotsearch.randomizedtesting.rules.NoShadowingOrOverridesOnMethodsRule$1.evaluate(NoShadowingOrOverridesOnMethodsRule.java:39)
[junit4:junit4]    > 	at com.carrotsearch.randomizedtesting.rules.StatementAdapter.evaluate(StatementAdapter.java:36)
[junit4:junit4]    > 	at org.apache.lucene.util.TestRuleAssertionsRequired$1.evaluate(TestRuleAssertionsRequired.java:43)
[junit4:junit4]    > 	at org.apache.lucene.util.TestRuleMarkFailure$1.evaluate(TestRuleMarkFailure.java:48)
[junit4:junit4]    > 	at org.apache.lucene.util.TestRuleIgnoreAfterMaxFailures$1.evaluate(TestRuleIgnoreAfterMaxFailures.java:70)
[junit4:junit4]    > 	at org.apache.lucene.util.TestRuleIgnoreTestSuites$1.evaluate(TestRuleIgnoreTestSuites.java:55)
[junit4:junit4]    > 	at com.carrotsearch.randomizedtesting.rules.StatementAdapter.evaluate(StatementAdapter.java:36)
[junit4:junit4]    > 	at com.carrotsearch.randomizedtesting.ThreadLeakControl$StatementRunner.run(ThreadLeakControl.java:358)
[junit4:junit4]    > 	at java.lang.Thread.run(Thread.java:722)
[junit4:junit4]   2> 7787 T3273 oas.SolrTestCaseJ4.setUp ###Starting testDropBuffered
[junit4:junit4]   2> 7789 T3273 oas.SolrTestCaseJ4.tearDown ###Ending testDropBuffered
[junit4:junit4]   2> NOTE: reproduce with: ant test  -Dtestcase=TestRecovery -Dtests.method=testDropBuffered -Dtests.seed=B1AB8B0A619B39FF -Dtests.slow=true -Dtests.locale=sr_ME_#Latn -Dtests.timezone=Europe/Copenhagen -Dtests.file.encoding=US-ASCII
[junit4:junit4] ERROR   0.01s | TestRecovery.testDropBuffered <<<
[junit4:junit4]    > Throwable #1: java.lang.NullPointerException
[junit4:junit4]    > 	at __randomizedtesting.SeedInfo.seed([B1AB8B0A619B39FF:9557A058B4D54CE3]:0)
[junit4:junit4]    > 	at org.apache.solr.util.TestHarness.getCore(TestHarness.java:212)
[junit4:junit4]    > 	at org.apache.solr.util.TestHarness$LocalRequestFactory.makeRequest(TestHarness.java:625)
[junit4:junit4]    > 	at org.apache.solr.SolrTestCaseJ4.req(SolrTestCaseJ4.java:742)
[junit4:junit4]    > 	at org.apache.solr.search.TestRecovery.testDropBuffered(TestRecovery.java:378)
[junit4:junit4]    > 	at sun.reflect.NativeMethodAccessorImpl.invoke0(Native Method)
[junit4:junit4]    > 	at sun.reflect.NativeMethodAccessorImpl.invoke(NativeMethodAccessorImpl.java:57)
[junit4:junit4]    > 	at sun.reflect.DelegatingMethodAccessorImpl.invoke(DelegatingMethodAccessorImpl.java:43)
[junit4:junit4]    > 	at java.lang.reflect.Method.invoke(Method.java:601)
[junit4:junit4]    > 	at com.carrotsearch.randomizedtesting.RandomizedRunner.invoke(RandomizedRunner.java:1559)
[junit4:junit4]    > 	at com.carrotsearch.randomizedtesting.RandomizedRunner.access$600(RandomizedRunner.java:79)
[junit4:junit4]    > 	at com.carrotsearch.randomizedtesting.RandomizedRunner$6.evaluate(RandomizedRunner.java:737)
[junit4:junit4]    > 	at com.carrotsearch.randomizedtesting.RandomizedRunner$7.evaluate(RandomizedRunner.java:773)
[junit4:junit4]    > 	at com.carrotsearch.randomizedtesting.RandomizedRunner$8.evaluate(RandomizedRunner.java:787)
[junit4:junit4]    > 	at com.carrotsearch.randomizedtesting.rules.SystemPropertiesRestoreRule$1.evaluate(SystemPropertiesRestoreRule.java:53)
[junit4:junit4]    > 	at org.apache.lucene.util.TestRuleSetupTeardownChained$1.evaluate(TestRuleSetupTeardownChained.java:50)
[junit4:junit4]    > 	at org.apache.lucene.util.TestRuleFieldCacheSanity$1.evaluate(TestRuleFieldCacheSanity.java:51)
[junit4:junit4]    > 	at org.apache.lucene.util.AbstractBeforeAfterRule$1.evaluate(AbstractBeforeAfterRule.java:45)
[junit4:junit4]    > 	at com.carrotsearch.randomizedtesting.rules.SystemPropertiesInvariantRule$1.evaluate(SystemPropertiesInvariantRule.java:55)
[junit4:junit4]    > 	at org.apache.lucene.util.TestRuleThreadAndTestName$1.evaluate(TestRuleThreadAndTestName.java:48)
[junit4:junit4]    > 	at org.apache.lucene.util.TestRuleIgnoreAfterMaxFailures$1.evaluate(TestRuleIgnoreAfterMaxFailures.java:70)
[junit4:junit4]    > 	at org.apache.lucene.util.TestRuleMarkFailure$1.evaluate(TestRuleMarkFailure.java:48)
[junit4:junit4]    > 	at com.carrotsearch.randomizedtesting.rules.StatementAdapter.evaluate(StatementAdapter.java:36)
[junit4:junit4]    > 	at com.carrotsearch.randomizedtesting.ThreadLeakControl$StatementRunner.run(ThreadLeakControl.java:358)
[junit4:junit4]    > 	at com.carrotsearch.randomizedtesting.ThreadLeakControl.forkTimeoutingTask(ThreadLeakControl.java:782)
[junit4:junit4]    > 	at com.carrotsearch.randomizedtesting.ThreadLeakControl$3.evaluate(ThreadLeakControl.java:442)
[junit4:junit4]    > 	at com.carrotsearch.randomizedtesting.RandomizedRunner.runSingleTest(RandomizedRunner.java:746)
[junit4:junit4]    > 	at com.carrotsearch.randomizedtesting.RandomizedRunner$3.evaluate(RandomizedRunner.java:648)
[junit4:junit4]    > 	at com.carrotsearch.randomizedtesting.RandomizedRunner$4.evaluate(RandomizedRunner.java:682)
[junit4:junit4]    > 	at com.carrotsearch.randomizedtesting.RandomizedRunner$5.evaluate(RandomizedRunner.java:693)
[junit4:junit4]    > 	at com.carrotsearch.randomizedtesting.rules.StatementAdapter.evaluate(StatementAdapter.java:36)
[junit4:junit4]    > 	at com.carrotsearch.randomizedtesting.rules.SystemPropertiesRestoreRule$1.evaluate(SystemPropertiesRestoreRule.java:53)
[junit4:junit4]    > 	at org.apache.lucene.util.AbstractBeforeAfterRule$1.evaluate(AbstractBeforeAfterRule.java:45)
[junit4:junit4]    > 	at org.apache.lucene.util.TestRuleStoreClassName$1.evaluate(TestRuleStoreClassName.java:42)
[junit4:junit4]    > 	at com.carrotsearch.randomizedtesting.rules.SystemPropertiesInvariantRule$1.evaluate(SystemPropertiesInvariantRule.java:55)
[junit4:junit4]    > 	at com.carrotsearch.randomizedtesting.rules.NoShadowingOrOverridesOnMethodsRule$1.evaluate(NoShadowingOrOverridesOnMethodsRule.java:39)
[junit4:junit4]    > 	at com.carrotsearch.randomizedtesting.rules.NoShadowingOrOverridesOnMethodsRule$1.evaluate(NoShadowingOrOverridesOnMethodsRule.java:39)
[junit4:junit4]    > 	at com.carrotsearch.randomizedtesting.rules.StatementAdapter.evaluate(StatementAdapter.java:36)
[junit4:junit4]    > 	at org.apache.lucene.util.TestRuleAssertionsRequired$1.evaluate(TestRuleAssertionsRequired.java:43)
[junit4:junit4]    > 	at org.apache.lucene.util.TestRuleMarkFailure$1.evaluate(TestRuleMarkFailure.java:48)
[junit4:junit4]    > 	at org.apache.lucene.util.TestRuleIgnoreAfterMaxFailures$1.evaluate(TestRuleIgnoreAfterMaxFailures.java:70)
[junit4:junit4]    > 	at org.apache.lucene.util.TestRuleIgnoreTestSuites$1.evaluate(TestRuleIgnoreTestSuites.java:55)
[junit4:junit4]    > 	at com.carrotsearch.randomizedtesting.rules.StatementAdapter.evaluate(StatementAdapter.java:36)
[junit4:junit4]    > 	at com.carrotsearch.randomizedtesting.ThreadLeakControl$StatementRunner.run(ThreadLeakControl.java:358)
[junit4:junit4]    > 	at java.lang.Thread.run(Thread.java:722)
[junit4:junit4]   2> 7797 T3273 oas.SolrTestCaseJ4.setUp ###Starting testVersionsOnRestart
[junit4:junit4]   2> 7797 T3273 oas.SolrTestCaseJ4.tearDown ###Ending testVersionsOnRestart
[junit4:junit4]   2> NOTE: reproduce with: ant test  -Dtestcase=TestRecovery -Dtests.method=testVersionsOnRestart -Dtests.seed=B1AB8B0A619B39FF -Dtests.slow=true -Dtests.locale=sr_ME_#Latn -Dtests.timezone=Europe/Copenhagen -Dtests.file.encoding=US-ASCII
[junit4:junit4] ERROR   0.01s | TestRecovery.testVersionsOnRestart <<<
[junit4:junit4]    > Throwable #1: java.lang.RuntimeException: java.lang.NullPointerException
[junit4:junit4]    > 	at __randomizedtesting.SeedInfo.seed([B1AB8B0A619B39FF:D105AB741EC5E970]:0)
[junit4:junit4]    > 	at org.apache.solr.search.TestRecovery.clearIndex(TestRecovery.java:80)
[junit4:junit4]    > 	at org.apache.solr.search.TestRecovery.testVersionsOnRestart(TestRecovery.java:594)
[junit4:junit4]    > 	at sun.reflect.NativeMethodAccessorImpl.invoke0(Native Method)
[junit4:junit4]    > 	at sun.reflect.NativeMethodAccessorImpl.invoke(NativeMethodAccessorImpl.java:57)
[junit4:junit4]    > 	at sun.reflect.DelegatingMethodAccessorImpl.invoke(DelegatingMethodAccessorImpl.java:43)
[junit4:junit4]    > 	at java.lang.reflect.Method.invoke(Method.java:601)
[junit4:junit4]    > 	at com.carrotsearch.randomizedtesting.RandomizedRunner.invoke(RandomizedRunner.java:1559)
[junit4:junit4]    > 	at com.carrotsearch.randomizedtesting.RandomizedRunner.access$600(RandomizedRunner.java:79)
[junit4:junit4]    > 	at com.carrotsearch.randomizedtesting.RandomizedRunner$6.evaluate(RandomizedRunner.java:737)
[junit4:junit4]    > 	at com.carrotsearch.randomizedtesting.RandomizedRunner$7.evaluate(RandomizedRunner.java:773)
[junit4:junit4]    > 	at com.carrotsearch.randomizedtesting.RandomizedRunner$8.evaluate(RandomizedRunner.java:787)
[junit4:junit4]    > 	at com.carrotsearch.randomizedtesting.rules.SystemPropertiesRestoreRule$1.evaluate(SystemPropertiesRestoreRule.java:53)
[junit4:junit4]    > 	at org.apache.lucene.util.TestRuleSetupTeardownChained$1.evaluate(TestRuleSetupTeardownChained.java:50)
[junit4:junit4]    > 	at org.apache.lucene.util.TestRuleFieldCacheSanity$1.evaluate(TestRuleFieldCacheSanity.java:51)
[junit4:junit4]    > 	at org.apache.lucene.util.AbstractBeforeAfterRule$1.evaluate(AbstractBeforeAfterRule.java:45)
[junit4:junit4]    > 	at com.carrotsearch.randomizedtesting.rules.SystemPropertiesInvariantRule$1.evaluate(SystemPropertiesInvariantRule.java:55)
[junit4:junit4]    > 	at org.apache.lucene.util.TestRuleThreadAndTestName$1.evaluate(TestRuleThreadAndTestName.java:48)
[junit4:junit4]    > 	at org.apache.lucene.util.TestRuleIgnoreAfterMaxFailures$1.evaluate(TestRuleIgnoreAfterMaxFailures.java:70)
[junit4:junit4]    > 	at org.apache.lucene.util.TestRuleMarkFailure$1.evaluate(TestRuleMarkFailure.java:48)
[junit4:junit4]    > 	at com.carrotsearch.randomizedtesting.rules.StatementAdapter.evaluate(StatementAdapter.java:36)
[junit4:junit4]    > 	at com.carrotsearch.randomizedtesting.ThreadLeakControl$StatementRunner.run(ThreadLeakControl.java:358)
[junit4:junit4]    > 	at com.carrotsearch.randomizedtesting.ThreadLeakControl.forkTimeoutingTask(ThreadLeakControl.java:782)
[junit4:junit4]    > 	at com.carrotsearch.randomizedtesting.ThreadLeakControl$3.evaluate(ThreadLeakControl.java:442)
[junit4:junit4]    > 	at com.carrotsearch.randomizedtesting.RandomizedRunner.runSingleTest(RandomizedRunner.java:746)
[junit4:junit4]    > 	at com.carrotsearch.randomizedtesting.RandomizedRunner$3.evaluate(RandomizedRunner.java:648)
[junit4:junit4]    > 	at com.carrotsearch.randomizedtesting.RandomizedRunner$4.evaluate(RandomizedRunner.java:682)
[junit4:junit4]    > 	at com.carrotsearch.randomizedtesting.RandomizedRunner$5.evaluate(RandomizedRunner.java:693)
[junit4:junit4]    > 	at com.carrotsearch.randomizedtesting.rules.StatementAdapter.evaluate(StatementAdapter.java:36)
[junit4:junit4]    > 	at com.carrotsearch.randomizedtesting.rules.SystemPropertiesRestoreRule$1.evaluate(SystemPropertiesRestoreRule.java:53)
[junit4:junit4]    > 	at org.apache.lucene.util.AbstractBeforeAfterRule$1.evaluate(AbstractBeforeAfterRule.java:45)
[junit4:junit4]    > 	at org.apache.lucene.util.TestRuleStoreClassName$1.evaluate(TestRuleStoreClassName.java:42)
[junit4:junit4]    > 	at com.carrotsearch.randomizedtesting.rules.SystemPropertiesInvariantRule$1.evaluate(SystemPropertiesInvariantRule.java:55)
[junit4:junit4]    > 	at com.carrotsearch.randomizedtesting.rules.NoShadowingOrOverridesOnMethodsRule$1.evaluate(NoShadowingOrOverridesOnMethodsRule.java:39)
[junit4:junit4]    > 	at com.carrotsearch.randomizedtesting.rules.NoShadowingOrOverridesOnMethodsRule$1.evaluate(NoShadowingOrOverridesOnMethodsRule.java:39)
[junit4:junit4]    > 	at com.carrotsearch.randomizedtesting.rules.StatementAdapter.evaluate(StatementAdapter.java:36)
[junit4:junit4]    > 	at org.apache.lucene.util.TestRuleAssertionsRequired$1.evaluate(TestRuleAssertionsRequired.java:43)
[junit4:junit4]    > 	at org.apache.lucene.util.TestRuleMarkFailure$1.evaluate(TestRuleMarkFailure.java:48)
[junit4:junit4]    > 	at org.apache.lucene.util.TestRuleIgnoreAfterMaxFailures$1.evaluate(TestRuleIgnoreAfterMaxFailures.java:70)
[junit4:junit4]    > 	at org.apache.lucene.util.TestRuleIgnoreTestSuites$1.evaluate(TestRuleIgnoreTestSuites.java:55)
[junit4:junit4]    > 	at com.carrotsearch.randomizedtesting.rules.StatementAdapter.evaluate(StatementAdapter.java:36)
[junit4:junit4]    > 	at com.carrotsearch.randomizedtesting.ThreadLeakControl$StatementRunner.run(ThreadLeakControl.java:358)
[junit4:junit4]    > 	at java.lang.Thread.run(Thread.java:722)
[junit4:junit4]    > Caused by: java.lang.NullPointerException
[junit4:junit4]    > 	at org.apache.solr.util.TestHarness.getCore(TestHarness.java:212)
[junit4:junit4]    > 	at org.apache.solr.SolrTestCaseJ4.updateJ(SolrTestCaseJ4.java:797)
[junit4:junit4]    > 	at org.apache.solr.SolrTestCaseJ4.deleteByQueryAndGetVersion(SolrTestCaseJ4.java:947)
[junit4:junit4]    > 	at org.apache.solr.search.TestRecovery.clearIndex(TestRecovery.java:78)
[junit4:junit4]    > 	... 41 more
[junit4:junit4]   2> 7803 T3273 oas.SolrTestCaseJ4.deleteCore ###deleteCore
[junit4:junit4]   2> !!!! WARNING: best effort to remove C:\Jenkins\workspace\Lucene-Solr-trunk-Windows\solr\build\solr-core\test\J0\.\solrtest-TestRecovery-1347569571334\tlog\tlog.0000000000000000006 FAILED !!!!!
[junit4:junit4]   2> !!!! WARNING: best effort to remove C:\Jenkins\workspace\Lucene-Solr-trunk-Windows\solr\build\solr-core\test\J0\.\solrtest-TestRecovery-1347569571334\tlog FAILED !!!!!
[junit4:junit4]   2> !!!! WARNING: best effort to remove C:\Jenkins\workspace\Lucene-Solr-trunk-Windows\solr\build\solr-core\test\J0\.\solrtest-TestRecovery-1347569571334 FAILED !!!!!
[junit4:junit4]   2> NOTE: test params are: codec=SimpleText, sim=DefaultSimilarity, locale=sr_ME_#Latn, timezone=Europe/Copenhagen
[junit4:junit4]   2> NOTE: Windows 7 6.1 x86/Oracle Corporation 1.7.0_07 (32-bit)/cpus=2,threads=1,free=121550944,total=248369152
[junit4:junit4]   2> NOTE: All tests run in this JVM: [ResourceLoaderTest, PeerSyncTest, TestSolrJ, UpdateParamsTest, LeaderElectionIntegrationTest, TestDistributedGrouping, PolyFieldTest, FieldAnalysisRequestHandlerTest, TestBinaryResponseWriter, UUIDFieldTest, SolrCoreTest, TestJoin, PreAnalyzedFieldTest, TestWriterPerf, TestFiltering, TestPseudoReturnFields, TestSolrDeletionPolicy2, StandardRequestHandlerTest, MoreLikeThisHandlerTest, TestNumberUtils, SuggesterFSTTest, TestSolrCoreProperties, BasicZkTest, TermVectorComponentDistributedTest, URLClassifyProcessorTest, OverseerTest, TestDefaultSimilarityFactory, DocumentAnalysisRequestHandlerTest, PrimitiveFieldTypeTest, TestFaceting, UpdateRequestProcessorFactoryTest, FieldMutatingUpdateProcessorTest, TestLMJelinekMercerSimilarityFactory, TestRealTimeGet, DistributedQueryElevationComponentTest, TestFastLRUCache, TestWordDelimiterFilterFactory, FastVectorHighlighterTest, TestSolrQueryParser, IndexReaderFactoryTest, IndexSchemaRuntimeFieldTest, SignatureUpdateProcessorFactoryTest, ZkCLITest, TestIndexingPerformance, CSVRequestHandlerTest, SystemInfoHandlerTest, QueryEqualityTest, BasicDistributedZk2Test, TestSearchPerf, XsltUpdateRequestHandlerTest, DirectSolrSpellCheckerTest, TestQuerySenderListener, AlternateDirectoryTest, TestJmxMonitoredMap, PingRequestHandlerTest, UniqFieldsUpdateProcessorFactoryTest, TestValueSourceCache, TestElisionMultitermQuery, WordBreakSolrSpellCheckerTest, TestCodecSupport, TestPropInjectDefaults, TestCharFilters, PrimUtilsTest, TestReversedWildcardFilterFactory, BadComponentTest, NoCacheHeaderTest, TermVectorComponentTest, SpellCheckCollatorTest, TestQueryTypes, TestLMDirichletSimilarityFactory, TestArbitraryIndexDir, ClusterStateUpdateTest, TestGroupingSearch, TestRemoteStreaming, SolrRequestParserTest, CoreContainerCoreInitFailuresTest, SolrInfoMBeanTest, TestSolrXMLSerializer, IndexSchemaTest, DocumentBuilderTest, TestRandomFaceting, TestFunctionQuery, TestSolrDeletionPolicy1, CoreAdminHandlerTest, SampleTest, HighlighterTest, SuggesterWFSTTest, TestPropInject, ZkNodePropsTest, SolrCmdDistributorTest, TestCSVResponseWriter, DisMaxRequestHandlerTest, ScriptEngineTest, LegacyHTMLStripCharFilterTest, TestStressVersions, ShowFileRequestHandlerTest, TermsComponentTest, DistributedSpellCheckComponentTest, TestCollationField, JSONWriterTest, RAMDirectoryFactoryTest, TestIBSimilarityFactory, TestPluginEnable, SpellPossibilityIteratorTest, SpellingQueryConverterTest, BasicDistributedZkTest, RecoveryZkTest, SpellCheckComponentTest, FullSolrCloudDistribCmdsTest, TestReplicationHandler, LeaderElectionTest, ZkControllerTest, TestDistributedSearch, TestExtendedDismaxParser, SoftAutoCommitTest, AutoCommitTest, ZkSolrClientTest, TestHashPartitioner, DistributedTermsComponentTest, StatsComponentTest, TestRecovery]
[junit4:junit4] Completed in 7.85s, 10 tests, 1 failure, 8 errors <<< FAILURES!

[...truncated 267 lines...]
[junit4:junit4] Suite: org.apache.solr.cloud.SyncSliceTest
[junit4:junit4]   2> 3 T3616 oas.SolrTestCaseJ4.setUp ###Starting testDistribSearch
[junit4:junit4]   2> Creating dataDir: C:\Jenkins\workspace\Lucene-Solr-trunk-Windows\solr\build\solr-core\test\J0\.\solrtest-SyncSliceTest-1347569745577
[junit4:junit4]   2> 8 T3616 oasc.ZkTestServer.run STARTING ZK TEST SERVER
[junit4:junit4]   2> 13 T3617 oazs.ZooKeeperServer.setTickTime tickTime set to 3000
[junit4:junit4]   2> 14 T3617 oazs.NIOServerCnxn$Factory.<init> binding to port 0.0.0.0/0.0.0.0:0
[junit4:junit4]   2> 15 T3617 oazsp.FileTxnSnapLog.save Snapshotting: 0
[junit4:junit4]   2> 130 T3616 oasc.ZkTestServer.run start zk server on port:59637
[junit4:junit4]   2> 130 T3616 oaz.ZooKeeper.<init> Initiating client connection, connectString=127.0.0.1:59637 sessionTimeout=10000 watcher=org.apache.solr.common.cloud.ConnectionManager@14bdb
[junit4:junit4]   2> 133 T3622 oaz.ClientCnxn$SendThread.startConnect Opening socket connection to server /127.0.0.1:59637
[junit4:junit4]   2> 131 T3616 oascc.ConnectionManager.waitForConnected Waiting for client to connect to ZooKeeper
[junit4:junit4]   2> 134 T3622 oaz.ClientCnxn$SendThread.primeConnection Socket connection established to 127.0.0.1/127.0.0.1:59637, initiating session
[junit4:junit4]   2> 134 T3618 oazs.NIOServerCnxn$Factory.run Accepted socket connection from /127.0.0.1:59640
[junit4:junit4]   2> 135 T3618 oazs.NIOServerCnxn.readConnectRequest Client attempting to establish new session at /127.0.0.1:59640
[junit4:junit4]   2> 135 T3620 oazsp.FileTxnLog.append Creating new log file: log.1
[junit4:junit4]   2> 142 T3620 oazs.NIOServerCnxn.finishSessionInit Established session 0x139c16a7eb40000 with negotiated timeout 10000 for client /127.0.0.1:59640
[junit4:junit4]   2> 142 T3622 oaz.ClientCnxn$SendThread.readConnectResult Session establishment complete on server 127.0.0.1/127.0.0.1:59637, sessionid = 0x139c16a7eb40000, negotiated timeout = 10000
[junit4:junit4]   2> 143 T3623 oascc.ConnectionManager.process Watcher org.apache.solr.common.cloud.ConnectionManager@14bdb name:ZooKeeperConnection Watcher:127.0.0.1:59637 got event WatchedEvent state:SyncConnected type:None path:null path:null type:None
[junit4:junit4]   2> 143 T3616 oascc.ConnectionManager.waitForConnected Client is connected to ZooKeeper
[junit4:junit4]   2> 143 T3616 oascc.SolrZkClient.makePath makePath: /solr
[junit4:junit4]   2> 149 T3621 oazs.PrepRequestProcessor.pRequest Processed session termination for sessionid: 0x139c16a7eb40000
[junit4:junit4]   2> 152 T3618 oazs.NIOServerCnxn.closeSock Closed socket connection for client /127.0.0.1:59640 which had sessionid 0x139c16a7eb40000
[junit4:junit4]   2> 152 T3623 oaz.ClientCnxn$EventThread.run EventThread shut down
[junit4:junit4]   2> 150 T3616 oaz.ZooKeeper.close Session: 0x139c16a7eb40000 closed
[junit4:junit4]   2> 153 T3616 oaz.ZooKeeper.<init> Initiating client connection, connectString=127.0.0.1:59637/solr sessionTimeout=10000 watcher=org.apache.solr.common.cloud.ConnectionManager@dbae74
[junit4:junit4]   2> 154 T3624 oaz.ClientCnxn$SendThread.startConnect Opening socket connection to server /127.0.0.1:59637
[junit4:junit4]   2> 154 T3616 oascc.ConnectionManager.waitForConnected Waiting for client to connect to ZooKeeper
[junit4:junit4]   2> 155 T3624 oaz.ClientCnxn$SendThread.primeConnection Socket connection established to 127.0.0.1/127.0.0.1:59637, initiating session
[junit4:junit4]   2> 155 T3618 oazs.NIOServerCnxn$Factory.run Accepted socket connection from /127.0.0.1:59643
[junit4:junit4]   2> 156 T3618 oazs.NIOServerCnxn.readConnectRequest Client attempting to establish new session at /127.0.0.1:59643
[junit4:junit4]   2> 159 T3620 oazs.NIOServerCnxn.finishSessionInit Established session 0x139c16a7eb40001 with negotiated timeout 10000 for client /127.0.0.1:59643
[junit4:junit4]   2> 159 T3624 oaz.ClientCnxn$SendThread.readConnectResult Session establishment complete on server 127.0.0.1/127.0.0.1:59637, sessionid = 0x139c16a7eb40001, negotiated timeout = 10000
[junit4:junit4]   2> 159 T3625 oascc.ConnectionManager.process Watcher org.apache.solr.common.cloud.ConnectionManager@dbae74 name:ZooKeeperConnection Watcher:127.0.0.1:59637/solr got event WatchedEvent state:SyncConnected type:None path:null path:null type:None
[junit4:junit4]   2> 159 T3616 oascc.ConnectionManager.waitForConnected Client is connected to ZooKeeper
[junit4:junit4]   2> 160 T3616 oascc.SolrZkClient.makePath makePath: /collections/collection1
[junit4:junit4]   2> 165 T3616 oascc.SolrZkClient.makePath makePath: /collections/collection1/shards
[junit4:junit4]   2> 170 T3616 oascc.SolrZkClient.makePath makePath: /collections/control_collection
[junit4:junit4]   2> 174 T3616 oascc.SolrZkClient.makePath makePath: /collections/control_collection/shards
[junit4:junit4]   2> 179 T3616 oasc.AbstractZkTestCase.putConfig put C:\Jenkins\workspace\Lucene-Solr-trunk-Windows\solr\build\solr-core\test-files\solr\collection1\conf\solrconfig.xml to /configs/conf1/solrconfig.xml
[junit4:junit4]   2> 180 T3616 oascc.SolrZkClient.makePath makePath: /configs/conf1/solrconfig.xml
[junit4:junit4]   2> 189 T3616 oasc.AbstractZkTestCase.putConfig put C:\Jenkins\workspace\Lucene-Solr-trunk-Windows\solr\build\solr-core\test-files\solr\collection1\conf\schema.xml to /configs/conf1/schema.xml
[junit4:junit4]   2> 189 T3616 oascc.SolrZkClient.makePath makePath: /configs/conf1/schema.xml
[junit4:junit4]   2> 195 T3616 oasc.AbstractZkTestCase.putConfig put C:\Jenkins\workspace\Lucene-Solr-trunk-Windows\solr\build\solr-core\test-files\solr\collection1\conf\solrconfig.xml to /configs/conf1/solrconfig.xml
[junit4:junit4]   2> 197 T3616 oascc.SolrZkClient.makePath makePath: /configs/conf1/solrconfig.xml
[junit4:junit4]   2> 201 T3616 oasc.AbstractZkTestCase.putConfig put C:\Jenkins\workspace\Lucene-Solr-trunk-Windows\solr\build\solr-core\test-files\solr\collection1\conf\stopwords.txt to /configs/conf1/stopwords.txt
[junit4:junit4]   2> 203 T3616 oascc.SolrZkClient.makePath makePath: /configs/conf1/stopwords.txt
[junit4:junit4]   2> 207 T3616 oasc.AbstractZkTestCase.putConfig put C:\Jenkins\workspace\Lucene-Solr-trunk-Windows\solr\build\solr-core\test-files\solr\collection1\conf\protwords.txt to /configs/conf1/protwords.txt
[junit4:junit4]   2> 208 T3616 oascc.SolrZkClient.makePath makePath: /configs/conf1/protwords.txt
[junit4:junit4]   2> 213 T3616 oasc.AbstractZkTestCase.putConfig put C:\Jenkins\workspace\Lucene-Solr-trunk-Windows\solr\build\solr-core\test-files\solr\collection1\conf\currency.xml to /configs/conf1/currency.xml
[junit4:junit4]   2> 214 T3616 oascc.SolrZkClient.makePath makePath: /configs/conf1/currency.xml
[junit4:junit4]   2> 220 T3616 oasc.AbstractZkTestCase.putConfig put C:\Jenkins\workspace\Lucene-Solr-trunk-Windows\solr\build\solr-core\test-files\solr\collection1\conf\open-exchange-rates.json to /configs/conf1/open-exchange-rates.json
[junit4:junit4]   2> 220 T3616 oascc.SolrZkClient.makePath makePath: /configs/conf1/open-exchange-rates.json
[junit4:junit4]   2> 225 T3616 oasc.AbstractZkTestCase.putConfig put C:\Jenkins\workspace\Lucene-Solr-trunk-Windows\solr\build\solr-core\test-files\solr\collection1\conf\mapping-ISOLatin1Accent.txt to /configs/conf1/mapping-ISOLatin1Accent.txt
[junit4:junit4]   2> 226 T3616 oascc.SolrZkClient.makePath makePath: /configs/conf1/mapping-ISOLatin1Accent.txt
[junit4:junit4]   2> 231 T3616 oasc.AbstractZkTestCase.putConfig put C:\Jenkins\workspace\Lucene-Solr-trunk-Windows\solr\build\solr-core\test-files\solr\collection1\conf\old_synonyms.txt to /configs/conf1/old_synonyms.txt
[junit4:junit4]   2> 232 T3616 oascc.SolrZkClient.makePath makePath: /configs/conf1/old_synonyms.txt
[junit4:junit4]   2> 237 T3616 oasc.AbstractZkTestCase.putConfig put C:\Jenkins\workspace\Lucene-Solr-trunk-Windows\solr\build\solr-core\test-files\solr\collection1\conf\synonyms.txt to /configs/conf1/synonyms.txt
[junit4:junit4]   2> 237 T3616 oascc.SolrZkClient.makePath makePath: /configs/conf1/synonyms.txt
[junit4:junit4]   2> 242 T3621 oazs.PrepRequestProcessor.pRequest Processed session termination for sessionid: 0x139c16a7eb40001
[junit4:junit4]   2> 244 T3616 oaz.ZooKeeper.close Session: 0x139c16a7eb40001 closed
[junit4:junit4]   2> 244 T3618 oazs.NIOServerCnxn.doIO WARNING EndOfStreamException: Unable to read additional data from client sessionid 0x139c16a7eb40001, likely client has closed socket
[junit4:junit4]   2> 244 T3618 oazs.NIOServerCnxn.closeSock Closed socket connection for client /127.0.0.1:59643 which had sessionid 0x139c16a7eb40001
[junit4:junit4]   2> 245 T3625 oaz.ClientCnxn$EventThread.run EventThread shut down
[junit4:junit4]   2> 246 T3616 oejs.Server.doStart jetty-8.1.2.v20120308
[junit4:junit4]   2> 264 T3616 oejs.AbstractConnector.doStart Started SocketConnector@0.0.0.0:59644
[junit4:junit4]   2> 267 T3616 oasc.SolrResourceLoader.locateSolrHome JNDI not configured for solr (NoInitialContextEx)
[junit4:junit4]   2> 268 T3616 oasc.SolrResourceLoader.locateSolrHome using system property solr.solr.home: C:\Jenkins\workspace\Lucene-Solr-trunk-Windows\solr\build\solr-core\test-files\solr
[junit4:junit4]   2> 268 T3616 oasc.SolrResourceLoader.<init> new SolrResourceLoader for deduced Solr Home: 'C:\Jenkins\workspace\Lucene-Solr-trunk-Windows\solr\build\solr-core\test-files\solr\'
[junit4:junit4]   2> 316 T3616 oass.SolrDispatchFilter.init SolrDispatchFilter.init()
[junit4:junit4]   2> 318 T3616 oasc.SolrResourceLoader.locateSolrHome JNDI not configured for solr (NoInitialContextEx)
[junit4:junit4]   2> 318 T3616 oasc.SolrResourceLoader.locateSolrHome using system property solr.solr.home: C:\Jenkins\workspace\Lucene-Solr-trunk-Windows\solr\build\solr-core\test-files\solr
[junit4:junit4]   2> 318 T3616 oasc.CoreContainer$Initializer.initialize looking for solr.xml: C:\Jenkins\workspace\Lucene-Solr-trunk-Windows\solr\build\solr-core\test-files\solr\solr.xml
[junit4:junit4]   2> 318 T3616 oasc.CoreContainer.<init> New CoreContainer 1865031
[junit4:junit4]   2> 319 T3616 oasc.CoreContainer.load Loading CoreContainer using Solr Home: 'C:\Jenkins\workspace\Lucene-Solr-trunk-Windows\solr\build\solr-core\test-files\solr\'
[junit4:junit4]   2> 320 T3616 oasc.SolrResourceLoader.<init> new SolrResourceLoader for directory: 'C:\Jenkins\workspace\Lucene-Solr-trunk-Windows\solr\build\solr-core\test-files\solr\'
[junit4:junit4]   2> 360 T3616 oasc.CoreContainer.load Registering Log Listener
[junit4:junit4]   2> 382 T3616 oasc.CoreContainer.initZooKeeper Zookeeper client=127.0.0.1:59637/solr
[junit4:junit4]   2> 383 T3616 oaz.ZooKeeper.<init> Initiating client connection, connectString=127.0.0.1:59637/solr sessionTimeout=8000 watcher=org.apache.solr.common.cloud.ConnectionManager@5c17e2
[junit4:junit4]   2> 385 T3635 oaz.ClientCnxn$SendThread.startConnect Opening socket connection to server /127.0.0.1:59637
[junit4:junit4]   2> 385 T3616 oascc.ConnectionManager.waitForConnected Waiting for client to connect to ZooKeeper
[junit4:junit4]   2> 388 T3635 oaz.ClientCnxn$SendThread.primeConnection Socket connection established to 127.0.0.1/127.0.0.1:59637, initiating session
[junit4:junit4]   2> 388 T3618 oazs.NIOServerCnxn$Factory.run Accepted socket connection from /127.0.0.1:59647
[junit4:junit4]   2> 389 T3618 oazs.NIOServerCnxn.readConnectRequest Client attempting to establish new session at /127.0.0.1:59647
[junit4:junit4]   2> 391 T3620 oazs.NIOServerCnxn.finishSessionInit Established session 0x139c16a7eb40002 with negotiated timeout 8000 for client /127.0.0.1:59647
[junit4:junit4]   2> 392 T3635 oaz.ClientCnxn$SendThread.readConnectResult Session establishment complete on server 127.0.0.1/127.0.0.1:59637, sessionid = 0x139c16a7eb40002, negotiated timeout = 8000
[junit4:junit4]   2> 392 T3636 oascc.ConnectionManager.process Watcher org.apache.solr.common.cloud.ConnectionManager@5c17e2 name:ZooKeeperConnection Watcher:127.0.0.1:59637/solr got event WatchedEvent state:SyncConnected type:None path:null path:null type:None
[junit4:junit4]   2> 392 T3616 oascc.ConnectionManager.waitForConnected Client is connected to ZooKeeper
[junit4:junit4]   2> 396 T3621 oazs.PrepRequestProcessor.pRequest Got user-level KeeperException when processing sessionid:0x139c16a7eb40002 type:create cxid:0x2 zxid:0xfffffffffffffffe txntype:unknown reqpath:n/a Error Path:/solr/overseer Error:KeeperErrorCode = NodeExists for /solr/overseer
[junit4:junit4]   2> 399 T3616 oascc.SolrZkClient.makePath makePath: /live_nodes
[junit4:junit4]   2> 403 T3616 oasc.ZkController.createEphemeralLiveNode Register node as live in ZooKeeper:/live_nodes/127.0.0.1:59644_solr
[junit4:junit4]   2> 404 T3621 oazs.PrepRequestProcessor.pRequest Got user-level KeeperException when processing sessionid:0x139c16a7eb40002 type:delete cxid:0x7 zxid:0xfffffffffffffffe txntype:unknown reqpath:n/a Error Path:/solr/live_nodes/127.0.0.1:59644_solr Error:KeeperErrorCode = NoNode for /solr/live_nodes/127.0.0.1:59644_solr
[junit4:junit4]   2> 407 T3616 oascc.SolrZkClient.makePath makePath: /live_nodes/127.0.0.1:59644_solr
[junit4:junit4]   2> 411 T3616 oashc.HttpShardHandlerFactory.getParameter Setting socketTimeout to: 0
[junit4:junit4]   2> 411 T3616 oashc.HttpShardHandlerFactory.getParameter Setting urlScheme to: http://
[junit4:junit4]   2> 411 T3616 oashc.HttpShardHandlerFactory.getParameter Setting connTimeout to: 0
[junit4:junit4]   2> 413 T3616 oashc.HttpShardHandlerFactory.getParameter Setting maxConnectionsPerHost to: 20
[junit4:junit4]   2> 413 T3616 oashc.HttpShardHandlerFactory.getParameter Setting corePoolSize to: 0
[junit4:junit4]   2> 414 T3616 oashc.HttpShardHandlerFactory.getParameter Setting maximumPoolSize to: 2147483647
[junit4:junit4]   2> 414 T3616 oashc.HttpShardHandlerFactory.getParameter Setting maxThreadIdleTime to: 5
[junit4:junit4]   2> 414 T3616 oashc.HttpShardHandlerFactory.getParameter Setting sizeOfQueue to: -1
[junit4:junit4]   2> 415 T3616 oashc.HttpShardHandlerFactory.getParameter Setting fairnessPolicy to: false
[junit4:junit4]   2> 415 T3616 oascsi.HttpClientUtil.createClient Creating new http client, config:maxConnectionsPerHost=20&maxConnections=10000&socketTimeout=0&connTimeout=0&retry=false
[junit4:junit4]   2> 426 T3616 oascc.SolrZkClient.makePath makePath: /overseer_elect/election
[junit4:junit4]   2> 437 T3621 oazs.PrepRequestProcessor.pRequest Got user-level KeeperException when processing sessionid:0x139c16a7eb40002 type:delete cxid:0x15 zxid:0xfffffffffffffffe txntype:unknown reqpath:n/a Error Path:/solr/overseer_elect/leader Error:KeeperErrorCode = NoNode for /solr/overseer_elect/leader
[junit4:junit4]   2> 439 T3616 oascc.SolrZkClient.makePath makePath: /overseer_elect/leader
[junit4:junit4]   2> 443 T3616 oasc.Overseer.start Overseer (id=88314330846855170-127.0.0.1:59644_solr-n_0000000000) starting
[junit4:junit4]   2> 445 T3621 oazs.PrepRequestProcessor.pRequest Got user-level KeeperException when processing sessionid:0x139c16a7eb40002 type:create cxid:0x1a zxid:0xfffffffffffffffe txntype:unknown reqpath:n/a Error Path:/solr/overseer Error:KeeperErrorCode = NodeExists for /solr/overseer
[junit4:junit4]   2> 447 T3621 oazs.PrepRequestProcessor.pRequest Got user-level KeeperException when processing sessionid:0x139c16a7eb40002 type:create cxid:0x1b zxid:0xfffffffffffffffe txntype:unknown reqpath:n/a Error Path:/solr/overseer Error:KeeperErrorCode = NodeExists for /solr/overseer
[junit4:junit4]   2> 449 T3621 oazs.PrepRequestProcessor.pRequest Got user-level KeeperException when processing sessionid:0x139c16a7eb40002 type:create cxid:0x1c zxid:0xfffffffffffffffe txntype:unknown reqpath:n/a Error Path:/solr/overseer Error:KeeperErrorCode = NodeExists for /solr/overseer
[junit4:junit4]   2> 452 T3621 oazs.PrepRequestProcessor.pRequest Got user-level KeeperException when processing sessionid:0x139c16a7eb40002 type:create cxid:0x1d zxid:0xfffffffffffffffe txntype:unknown reqpath:n/a Error Path:/solr/overseer Error:KeeperErrorCode = NodeExists for /solr/overseer
[junit4:junit4]   2> 454 T3638 oasc.OverseerCollectionProcessor.run Process current queue of collection creations
[junit4:junit4]   2> 455 T3616 oascc.SolrZkClient.makePath makePath: /clusterstate.json
[junit4:junit4]   2> 461 T3616 oascc.ZkStateReader.createClusterStateWatchersAndUpdate Updating cluster state from ZooKeeper... 
[junit4:junit4]   2> 464 T3637 oasc.Overseer$ClusterStateUpdater.run Starting to work on the main queue
[junit4:junit4]   2> 484 T3616 oasc.CoreContainer.create Creating SolrCore 'collection1' using instanceDir: C:\Jenkins\workspace\Lucene-Solr-trunk-Windows\solr\build\solr-core\test-files\solr\collection1
[junit4:junit4]   2> 485 T3616 oasc.ZkController.createCollectionZkNode Check for collection zkNode:control_collection
[junit4:junit4]   2> 486 T3616 oasc.ZkController.createCollectionZkNode Collection zkNode exists
[junit4:junit4]   2> 486 T3616 oasc.ZkController.readConfigName Load collection config from:/collections/control_collection
[junit4:junit4]   2> 488 T3616 oasc.SolrResourceLoader.<init> new SolrResourceLoader for directory: 'C:\Jenkins\workspace\Lucene-Solr-trunk-Windows\solr\build\solr-core\test-files\solr\collection1\'
[junit4:junit4]   2> 491 T3616 oasc.SolrResourceLoader.replaceClassLoader Adding 'file:/C:/Jenkins/workspace/Lucene-Solr-trunk-Windows/solr/build/solr-core/test-files/solr/collection1/lib/classes/' to classloader
[junit4:junit4]   2> 493 T3616 oasc.SolrResourceLoader.replaceClassLoader Adding 'file:/C:/Jenkins/workspace/Lucene-Solr-trunk-Windows/solr/build/solr-core/test-files/solr/collection1/lib/README' to classloader
[junit4:junit4]   2> 567 T3616 oasc.SolrConfig.<init> Using Lucene MatchVersion: LUCENE_50
[junit4:junit4]   2> 684 T3616 oasc.SolrConfig.<init> Loaded SolrConfig: solrconfig.xml
[junit4:junit4]   2> 687 T3616 oass.IndexSchema.readSchema Reading Solr Schema
[junit4:junit4]   2> 694 T3616 oass.IndexSchema.readSchema Schema name=test
[junit4:junit4]   2> 1683 T3616 oass.OpenExchangeRatesOrgProvider.init Initialized with rates=open-exchange-rates.json, refreshInterval=1440.
[junit4:junit4]   2> 1698 T3616 oass.IndexSchema.readSchema default search field in schema is text
[junit4:junit4]   2> 1703 T3616 oass.IndexSchema.readSchema unique key field: id
[junit4:junit4]   2> 1721 T3616 oass.FileExchangeRateProvider.reload Reloading exchange rates from file currency.xml
[junit4:junit4]   2> 1726 T3616 oass.FileExchangeRateProvider.reload Reloading exchange rates from file currency.xml
[junit4:junit4]   2> 1733 T3616 oass.OpenExchangeRatesOrgProvider.reload Reloading exchange rates from open-exchange-rates.json
[junit4:junit4]   2> 1734 T3616 oass.OpenExchangeRatesOrgProvider.reload Reloading exchange rates from open-exchange-rates.json
[junit4:junit4]   2> 1737 T3616 oasc.SolrCore.<init> [collection1] Opening new SolrCore at C:\Jenkins\workspace\Lucene-Solr-trunk-Windows\solr\build\solr-core\test-files\solr\collection1\, dataDir=.\org.apache.solr.cloud.SyncSliceTest-1347569745575/control/data\
[junit4:junit4]   2> 1737 T3616 oasc.JmxMonitoredMap.<init> JMX monitoring is enabled. Adding Solr mbeans to JMX Server: com.sun.jmx.mbeanserver.JmxMBeanServer@661664
[junit4:junit4]   2> 1738 T3616 oasc.SolrCore.getNewIndexDir WARNING New index directory detected: old=null new=.\org.apache.solr.cloud.SyncSliceTest-1347569745575/control/data\index/
[junit4:junit4]   2> 1739 T3616 oasc.SolrCore.initIndex WARNING [collection1] Solr index directory '.\org.apache.solr.cloud.SyncSliceTest-1347569745575\control\data\index' doesn't exist. Creating new index...
[junit4:junit4]   2> 1740 T3616 oasc.CachingDirectoryFactory.get return new directory for C:\Jenkins\workspace\Lucene-Solr-trunk-Windows\solr\build\solr-core\test\J0\.\org.apache.solr.cloud.SyncSliceTest-1347569745575\control\data\index forceNew:false
[junit4:junit4]   2> 1752 T3616 oasc.SolrDeletionPolicy.onCommit SolrDeletionPolicy.onCommit: commits:num=1
[junit4:junit4]   2> 		commit{dir=C:\Jenkins\workspace\Lucene-Solr-trunk-Windows\solr\build\solr-core\test\J0\org.apache.solr.cloud.SyncSliceTest-1347569745575\control\data\index,segFN=segments_1,generation=1,filenames=[segments_1]
[junit4:junit4]   2> 1752 T3616 oasc.SolrDeletionPolicy.updateCommits newest commit = 1
[junit4:junit4]   2> 1753 T3616 oasc.SolrCore.initWriters created xml: solr.XMLResponseWriter
[junit4:junit4]   2> 1756 T3616 oasup.UpdateRequestProcessorChain.init inserting DistributedUpdateProcessorFactory into updateRequestProcessorChain "dedupe"
[junit4:junit4]   2> 1757 T3616 oasup.UpdateRequestProcessorChain.init inserting DistributedUpdateProcessorFactory into updateRequestProcessorChain "dedupe-allfields"
[junit4:junit4]   2> 1757 T3616 oasup.UpdateRequestProcessorChain.init inserting DistributedUpdateProcessorFactory into updateRequestProcessorChain "stored_sig"
[junit4:junit4]   2> 1758 T3616 oasup.UpdateRequestProcessorChain.init inserting DistributedUpdateProcessorFactory into updateRequestProcessorChain "uniq-fields"
[junit4:junit4]   2> 1758 T3616 oasup.UpdateRequestProcessorChain.init inserting DistributedUpdateProcessorFactory into updateRequestProcessorChain "distrib-dup-test-chain-implicit"
[junit4:junit4]   2> 1759 T3616 oasc.RequestHandlers.initHandlersFromConfig adding lazy requestHandler: solr.ReplicationHandler
[junit4:junit4]   2> 1759 T3616 oasc.RequestHandlers.initHandlersFromConfig created /replication: solr.ReplicationHandler
[junit4:junit4]   2> 1760 T3616 oasc.RequestHandlers.initHandlersFromConfig created standard: solr.StandardRequestHandler
[junit4:junit4]   2> 1762 T3616 oasc.RequestHandlers.initHandlersFromConfig created /get: solr.RealTimeGetHandler
[junit4:junit4]   2> 1762 T3616 oasc.RequestHandlers.initHandlersFromConfig created dismax: solr.SearchHandler
[junit4:junit4]   2> 1763 T3616 oasc.RequestHandlers.initHandlersFromConfig created mock: org.apache.solr.core.MockQuerySenderListenerReqHandler
[junit4:junit4]   2> 1763 T3616 oasc.RequestHandlers.initHandlersFromConfig created /admin/: org.apache.solr.handler.admin.AdminHandlers
[junit4:junit4]   2> 1764 T3616 oasc.RequestHandlers.initHandlersFromConfig created defaults: solr.StandardRequestHandler
[junit4:junit4]   2> 1764 T3616 oasc.RequestHandlers.initHandlersFromConfig adding lazy requestHandler: solr.StandardRequestHandler
[junit4:junit4]   2> 1765 T3616 oasc.RequestHandlers.initHandlersFromConfig created lazy: solr.StandardRequestHandler
[junit4:junit4]   2> 1765 T3616 oasc.RequestHandlers.initHandlersFromConfig created /update: solr.UpdateRequestHandler
[junit4:junit4]   2> 1766 T3616 oasc.RequestHandlers.initHandlersFromConfig created /terms: org.apache.solr.handler.component.SearchHandler
[junit4:junit4]   2> 1766 T3616 oasc.RequestHandlers.initHandlersFromConfig created spellCheckCompRH: org.apache.solr.handler.component.SearchHandler
[junit4:junit4]   2> 1766 T3616 oasc.RequestHandlers.initHandlersFromConfig created spellCheckCompRH_Direct: org.apache.solr.handler.component.SearchHandler
[junit4:junit4]   2> 1768 T3616 oasc.RequestHandlers.initHandlersFromConfig created spellCheckWithWordbreak: org.apache.solr.handler.component.SearchHandler
[junit4:junit4]   2> 1769 T3616 oasc.RequestHandlers.initHandlersFromConfig created spellCheckWithWordbreak_Direct: org.apache.solr.handler.component.SearchHandler
[junit4:junit4]   2> 1769 T3616 oasc.RequestHandlers.initHandlersFromConfig created spellCheckCompRH1: org.apache.solr.handler.component.SearchHandler
[junit4:junit4]   2> 1770 T3616 oasc.RequestHandlers.initHandlersFromConfig created tvrh: org.apache.solr.handler.component.SearchHandler
[junit4:junit4]   2> 1771 T3616 oasc.RequestHandlers.initHandlersFromConfig created /mlt: solr.MoreLikeThisHandler
[junit4:junit4]   2> 1771 T3616 oasc.RequestHandlers.initHandlersFromConfig created /debug/dump: solr.DumpRequestHandler
[junit4:junit4]   2> 1775 T3616 oashl.XMLLoader.init xsltCacheLifetimeSeconds=60
[junit4:junit4]   2> 1790 T3616 oasc.SolrCore.initDeprecatedSupport WARNING solrconfig.xml uses deprecated <admin/gettableFiles>, Please update your config to use the ShowFileRequestHandler.
[junit4:junit4]   2> 1792 T3616 oasc.SolrCore.initDeprecatedSupport WARNING adding ShowFileRequestHandler with hidden files: [SCHEMA.XML, OLD_SYNONYMS.TXT, STOPWORDS.TXT, PROTWORDS.TXT, OPEN-EXCHANGE-RATES.JSON, SYNONYMS.TXT, CURRENCY.XML, MAPPING-ISOLATIN1ACCENT.TXT]
[junit4:junit4]   2> 1798 T3616 oass.SolrIndexSearcher.<init> Opening Searcher@1a092f4 main
[junit4:junit4]   2> 1801 T3616 oasu.CommitTracker.<init> Hard AutoCommit: disabled
[junit4:junit4]   2> 1802 T3616 oasu.CommitTracker.<init> Soft AutoCommit: disabled
[junit4:junit4]   2> 1802 T3616 oashc.SpellCheckComponent.inform Initializing spell checkers
[junit4:junit4]   2> 1817 T3616 oass.DirectSolrSpellChecker.init init: {name=direct,classname=DirectSolrSpellChecker,field=lowerfilt,minQueryLength=3}
[junit4:junit4]   2> 1885 T3639 oasc.SolrCore.registerSearcher [collection1] Registered new searcher Searcher@1a092f4 main{StandardDirectoryReader(segments_1:1)}
[junit4:junit4]   2> 1890 T3621 oazs.PrepRequestProcessor.pRequest Got user-level KeeperException when processing sessionid:0x139c16a7eb40002 type:create cxid:0x56 zxid:0xfffffffffffffffe txntype:unknown reqpath:n/a Error Path:/solr/overseer/queue Error:KeeperErrorCode = NoNode for /solr/overseer/queue
[junit4:junit4]   2> 1896 T3616 oasc.CoreContainer.register registering core: collection1
[junit4:junit4]   2> 1897 T3616 oasc.ZkController.register Register shard - core:collection1 address:http://127.0.0.1:59644/solr shardId:control_shard
[junit4:junit4]   2> 1898 T3616 oascc.SolrZkClient.makePath makePath: /collections/control_collection/leader_elect/control_shard/election
[junit4:junit4]   2> 1910 T3621 oazs.PrepRequestProcessor.pRequest Got user-level KeeperException when processing sessionid:0x139c16a7eb40002 type:delete cxid:0x65 zxid:0xfffffffffffffffe txntype:unknown reqpath:n/a Error Path:/solr/collections/control_collection/leaders Error:KeeperErrorCode = NoNode for /solr/collections/control_collection/leaders
[junit4:junit4]   2> 1911 T3616 oasc.ShardLeaderElectionContext.runLeaderProcess Running the leader process. afterExpiration=false
[junit4:junit4]   2> 1912 T3621 oazs.PrepRequestProcessor.pRequest Got user-level KeeperException when processing sessionid:0x139c16a7eb40002 type:create cxid:0x66 zxid:0xfffffffffffffffe txntype:unknown reqpath:n/a Error Path:/solr/overseer Error:KeeperErrorCode = NodeExists for /solr/overseer
[junit4:junit4]   2> 1915 T3616 oasc.ShardLeaderElectionContext.runLeaderProcess I am the new leader: http://127.0.0.1:59644/solr/collection1/
[junit4:junit4]   2> 1916 T3616 oascc.SolrZkClient.makePath makePath: /collections/control_collection/leaders/control_shard
[junit4:junit4]   2> 1922 T3621 oazs.PrepRequestProcessor.pRequest Got user-level KeeperException when processing sessionid:0x139c16a7eb40002 type:create cxid:0x6f zxid:0xfffffffffffffffe txntype:unknown reqpath:n/a Error Path:/solr/overseer Error:KeeperErrorCode = NodeExists for /solr/overseer
[junit4:junit4]   2> 2309 T3637 oascc.ZkStateReader.updateClusterState Updating cloud state from ZooKeeper... 
[junit4:junit4]   2> 2310 T3621 oazs.PrepRequestProcessor.pRequest Got user-level KeeperException when processing sessionid:0x139c16a7eb40002 type:create cxid:0x77 zxid:0xfffffffffffffffe txntype:unknown reqpath:n/a Error Path:/solr/overseer/queue-work Error:KeeperErrorCode = NoNode for /solr/overseer/queue-work
[junit4:junit4]   2> 2333 T3636 oascc.ZkStateReader$2.process A cluster state change has occurred - updating...
[junit4:junit4]   2> 2358 T3616 oasc.ZkController.register We are http://127.0.0.1:59644/solr/collection1/ and leader is http://127.0.0.1:59644/solr/collection1/
[junit4:junit4]   2> 2358 T3616 oasc.ZkController.register No LogReplay needed for core=collection1 baseURL=http://127.0.0.1:59644/solr
[junit4:junit4]   2> 2358 T3616 oasc.ZkController.checkRecovery I am the leader, no recovery necessary
[junit4:junit4]   2> 2362 T3616 oascc.ZkStateReader.updateClusterState Updating cloud state from ZooKeeper... 
[junit4:junit4]   2> 2363 T3616 oass.SolrDispatchFilter.init user.dir=C:\Jenkins\workspace\Lucene-Solr-trunk-Windows\solr\build\solr-core\test\J0
[junit4:junit4]   2> 2363 T3616 oass.SolrDispatchFilter.init SolrDispatchFilter.init() done
[junit4:junit4]   2> 2364 T3616 oascsi.HttpClientUtil.createClient Creating new http client, config:maxConnections=128&maxConnectionsPerHost=32&followRedirects=false
[junit4:junit4]   2> 2376 T3616 oejs.Server.doStart jetty-8.1.2.v20120308
[junit4:junit4]   2> 2380 T3616 oejs.AbstractConnector.doStart Started SocketConnector@0.0.0.0:59648
[junit4:junit4]   2> 2382 T3616 oasc.SolrResourceLoader.locateSolrHome JNDI not configured for solr (NoInitialContextEx)
[junit4:junit4]   2> 2382 T3616 oasc.SolrResourceLoader.locateSolrHome using system property solr.solr.home: C:\Jenkins\workspace\Lucene-Solr-trunk-Windows\solr\build\solr-core\test-files\solr
[junit4:junit4]   2> 2382 T3616 oasc.SolrResourceLoader.<init> new SolrResourceLoader for deduced Solr Home: 'C:\Jenkins\workspace\Lucene-Solr-trunk-Windows\solr\build\solr-core\test-files\solr\'
[junit4:junit4]   2> 2427 T3616 oass.SolrDispatchFilter.init SolrDispatchFilter.init()
[junit4:junit4]   2> 2428 T3616 oasc.SolrResourceLoader.locateSolrHome JNDI not configured for solr (NoInitialContextEx)
[junit4:junit4]   2> 2428 T3616 oasc.SolrResourceLoader.locateSolrHome using system property solr.solr.home: C:\Jenkins\workspace\Lucene-Solr-trunk-Windows\solr\build\solr-core\test-files\solr
[junit4:junit4]   2> 2428 T3616 oasc.CoreContainer$Initializer.initialize looking for solr.xml: C:\Jenkins\workspace\Lucene-Solr-trunk-Windows\solr\build\solr-core\test-files\solr\solr.xml
[junit4:junit4]   2> 2430 T3616 oasc.CoreContainer.<init> New CoreContainer 4732949
[junit4:junit4]   2> 2431 T3616 oasc.CoreContainer.load Loading CoreContainer using Solr Home: 'C:\Jenkins\workspace\Lucene-Solr-trunk-Windows\solr\build\solr-core\test-files\solr\'
[junit4:junit4]   2> 2432 T3616 oasc.SolrResourceLoader.<init> new SolrResourceLoader for directory: 'C:\Jenkins\workspace\Lucene-Solr-trunk-Windows\solr\build\solr-core\test-files\solr\'
[junit4:junit4]   2> 2468 T3616 oasc.CoreContainer.load Registering Log Listener
[junit4:junit4]   2> 2500 T3616 oasc.CoreContainer.initZooKeeper Zookeeper client=127.0.0.1:59637/solr
[junit4:junit4]   2> 2500 T3616 oaz.ZooKeeper.<init> Initiating client connection, connectString=127.0.0.1:59637/solr sessionTimeout=8000 watcher=org.apache.solr.common.cloud.ConnectionManager@d58d7b
[junit4:junit4]   2> 2502 T3649 oaz.ClientCnxn$SendThread.startCo

[...truncated too long message...]

r.java:773)
[junit4:junit4]    > 	at com.carrotsearch.randomizedtesting.RandomizedRunner$8.evaluate(RandomizedRunner.java:787)
[junit4:junit4]    > 	at com.carrotsearch.randomizedtesting.rules.SystemPropertiesRestoreRule$1.evaluate(SystemPropertiesRestoreRule.java:53)
[junit4:junit4]    > 	at org.apache.lucene.util.TestRuleSetupTeardownChained$1.evaluate(TestRuleSetupTeardownChained.java:50)
[junit4:junit4]    > 	at org.apache.lucene.util.TestRuleFieldCacheSanity$1.evaluate(TestRuleFieldCacheSanity.java:51)
[junit4:junit4]    > 	at org.apache.lucene.util.AbstractBeforeAfterRule$1.evaluate(AbstractBeforeAfterRule.java:45)
[junit4:junit4]    > 	at com.carrotsearch.randomizedtesting.rules.SystemPropertiesInvariantRule$1.evaluate(SystemPropertiesInvariantRule.java:55)
[junit4:junit4]    > 	at org.apache.lucene.util.TestRuleThreadAndTestName$1.evaluate(TestRuleThreadAndTestName.java:48)
[junit4:junit4]    > 	at org.apache.lucene.util.TestRuleIgnoreAfterMaxFailures$1.evaluate(TestRuleIgnoreAfterMaxFailures.java:70)
[junit4:junit4]    > 	at org.apache.lucene.util.TestRuleMarkFailure$1.evaluate(TestRuleMarkFailure.java:48)
[junit4:junit4]    > 	at com.carrotsearch.randomizedtesting.rules.StatementAdapter.evaluate(StatementAdapter.java:36)
[junit4:junit4]    > 	at com.carrotsearch.randomizedtesting.ThreadLeakControl$StatementRunner.run(ThreadLeakControl.java:358)
[junit4:junit4]    > 	at com.carrotsearch.randomizedtesting.ThreadLeakControl.forkTimeoutingTask(ThreadLeakControl.java:782)
[junit4:junit4]    > 	at com.carrotsearch.randomizedtesting.ThreadLeakControl$3.evaluate(ThreadLeakControl.java:442)
[junit4:junit4]    > 	at com.carrotsearch.randomizedtesting.RandomizedRunner.runSingleTest(RandomizedRunner.java:746)
[junit4:junit4]    > 	at com.carrotsearch.randomizedtesting.RandomizedRunner$3.evaluate(RandomizedRunner.java:648)
[junit4:junit4]    > 	at com.carrotsearch.randomizedtesting.RandomizedRunner$4.evaluate(RandomizedRunner.java:682)
[junit4:junit4]    > 	at com.carrotsearch.randomizedtesting.RandomizedRunner$5.evaluate(RandomizedRunner.java:693)
[junit4:junit4]    > 	at com.carrotsearch.randomizedtesting.rules.StatementAdapter.evaluate(StatementAdapter.java:36)
[junit4:junit4]    > 	at com.carrotsearch.randomizedtesting.rules.SystemPropertiesRestoreRule$1.evaluate(SystemPropertiesRestoreRule.java:53)
[junit4:junit4]    > 	at org.apache.lucene.util.AbstractBeforeAfterRule$1.evaluate(AbstractBeforeAfterRule.java:45)
[junit4:junit4]    > 	at org.apache.lucene.util.TestRuleStoreClassName$1.evaluate(TestRuleStoreClassName.java:42)
[junit4:junit4]    > 	at com.carrotsearch.randomizedtesting.rules.SystemPropertiesInvariantRule$1.evaluate(SystemPropertiesInvariantRule.java:55)
[junit4:junit4]    > 	at com.carrotsearch.randomizedtesting.rules.NoShadowingOrOverridesOnMethodsRule$1.evaluate(NoShadowingOrOverridesOnMethodsRule.java:39)
[junit4:junit4]    > 	at com.carrotsearch.randomizedtesting.rules.NoShadowingOrOverridesOnMethodsRule$1.evaluate(NoShadowingOrOverridesOnMethodsRule.java:39)
[junit4:junit4]    > 	at com.carrotsearch.randomizedtesting.rules.StatementAdapter.evaluate(StatementAdapter.java:36)
[junit4:junit4]    > 	at org.apache.lucene.util.TestRuleAssertionsRequired$1.evaluate(TestRuleAssertionsRequired.java:43)
[junit4:junit4]    > 	at org.apache.lucene.util.TestRuleMarkFailure$1.evaluate(TestRuleMarkFailure.java:48)
[junit4:junit4]    > 	at org.apache.lucene.util.TestRuleIgnoreAfterMaxFailures$1.evaluate(TestRuleIgnoreAfterMaxFailures.java:70)
[junit4:junit4]    > 	at org.apache.lucene.util.TestRuleIgnoreTestSuites$1.evaluate(TestRuleIgnoreTestSuites.java:55)
[junit4:junit4]    > 	at com.carrotsearch.randomizedtesting.rules.StatementAdapter.evaluate(StatementAdapter.java:36)
[junit4:junit4]    > 	at com.carrotsearch.randomizedtesting.ThreadLeakControl$StatementRunner.run(ThreadLeakControl.java:358)
[junit4:junit4]    > 	at java.lang.Thread.run(Thread.java:722)
[junit4:junit4]   2> 129521 T3616 oas.SolrTestCaseJ4.deleteCore ###deleteCore
[junit4:junit4]   2> NOTE: test params are: codec=SimpleText, sim=RandomSimilarityProvider(queryNorm=false,coord=yes): {}, locale=es_AR, timezone=Africa/Maputo
[junit4:junit4]   2> NOTE: Windows 7 6.1 x86/Oracle Corporation 1.7.0_07 (32-bit)/cpus=2,threads=1,free=97450136,total=248369152
[junit4:junit4]   2> NOTE: All tests run in this JVM: [ResourceLoaderTest, PeerSyncTest, TestSolrJ, UpdateParamsTest, LeaderElectionIntegrationTest, TestDistributedGrouping, PolyFieldTest, FieldAnalysisRequestHandlerTest, TestBinaryResponseWriter, UUIDFieldTest, SolrCoreTest, TestJoin, PreAnalyzedFieldTest, TestWriterPerf, TestFiltering, TestPseudoReturnFields, TestSolrDeletionPolicy2, StandardRequestHandlerTest, MoreLikeThisHandlerTest, TestNumberUtils, SuggesterFSTTest, TestSolrCoreProperties, BasicZkTest, TermVectorComponentDistributedTest, URLClassifyProcessorTest, OverseerTest, TestDefaultSimilarityFactory, DocumentAnalysisRequestHandlerTest, PrimitiveFieldTypeTest, TestFaceting, UpdateRequestProcessorFactoryTest, FieldMutatingUpdateProcessorTest, TestLMJelinekMercerSimilarityFactory, TestRealTimeGet, DistributedQueryElevationComponentTest, TestFastLRUCache, TestWordDelimiterFilterFactory, FastVectorHighlighterTest, TestSolrQueryParser, IndexReaderFactoryTest, IndexSchemaRuntimeFieldTest, SignatureUpdateProcessorFactoryTest, ZkCLITest, TestIndexingPerformance, CSVRequestHandlerTest, SystemInfoHandlerTest, QueryEqualityTest, BasicDistributedZk2Test, TestSearchPerf, XsltUpdateRequestHandlerTest, DirectSolrSpellCheckerTest, TestQuerySenderListener, AlternateDirectoryTest, TestJmxMonitoredMap, PingRequestHandlerTest, UniqFieldsUpdateProcessorFactoryTest, TestValueSourceCache, TestElisionMultitermQuery, WordBreakSolrSpellCheckerTest, TestCodecSupport, TestPropInjectDefaults, TestCharFilters, PrimUtilsTest, TestReversedWildcardFilterFactory, BadComponentTest, NoCacheHeaderTest, TermVectorComponentTest, SpellCheckCollatorTest, TestQueryTypes, TestLMDirichletSimilarityFactory, TestArbitraryIndexDir, ClusterStateUpdateTest, TestGroupingSearch, TestRemoteStreaming, SolrRequestParserTest, CoreContainerCoreInitFailuresTest, SolrInfoMBeanTest, TestSolrXMLSerializer, IndexSchemaTest, DocumentBuilderTest, TestRandomFaceting, TestFunctionQuery, TestSolrDeletionPolicy1, CoreAdminHandlerTest, SampleTest, HighlighterTest, SuggesterWFSTTest, TestPropInject, ZkNodePropsTest, SolrCmdDistributorTest, TestCSVResponseWriter, DisMaxRequestHandlerTest, ScriptEngineTest, LegacyHTMLStripCharFilterTest, TestStressVersions, ShowFileRequestHandlerTest, TermsComponentTest, DistributedSpellCheckComponentTest, TestCollationField, JSONWriterTest, RAMDirectoryFactoryTest, TestIBSimilarityFactory, TestPluginEnable, SpellPossibilityIteratorTest, SpellingQueryConverterTest, BasicDistributedZkTest, RecoveryZkTest, SpellCheckComponentTest, FullSolrCloudDistribCmdsTest, TestReplicationHandler, LeaderElectionTest, ZkControllerTest, TestDistributedSearch, TestExtendedDismaxParser, SoftAutoCommitTest, AutoCommitTest, ZkSolrClientTest, TestHashPartitioner, DistributedTermsComponentTest, StatsComponentTest, TestRecovery, IndexBasedSpellCheckerTest, TestRangeQuery, DirectUpdateHandlerTest, TestMultiCoreConfBootstrap, SimpleFacetsTest, TestCoreContainer, LukeRequestHandlerTest, TestSort, FileBasedSpellCheckerTest, ConvertedLegacyTest, QueryElevationComponentTest, SortByFunctionTest, BasicFunctionalityTest, TestJmxIntegration, TestIndexSearcher, TestTrie, DirectSolrConnectionTest, CacheHeaderTest, TestCSVLoader, SpatialFilterTest, MBeansHandlerTest, CurrencyFieldTest, BinaryUpdateRequestHandlerTest, QueryParsingTest, DistanceFunctionTest, MinimalSchemaTest, TestPHPSerializedResponseWriter, XmlUpdateRequestHandlerTest, JsonLoaderTest, TestSurroundQueryParser, DirectUpdateHandlerOptimizeTest, SolrPluginUtilsTest, DebugComponentTest, ReturnFieldsTest, RequestHandlersTest, SearchHandlerTest, RequiredFieldsTest, TestOmitPositions, CopyFieldTest, TestQueryUtils, LoggingHandlerTest, SuggesterTSTTest, SuggesterTest, NotRequiredUniqueKeyTest, BadIndexSchemaTest, TestFoldingMultitermQuery, SolrCoreCheckLockOnStartupTest, TestLuceneMatchVersion, TestUpdate, TestBinaryField, HighlighterConfigTest, SOLR749Test, DefaultValueUpdateProcessorTest, TestMergePolicyConfig, TestXIncludeConfig, TestDocSet, TestLFUCache, SolrIndexConfigTest, TestQuerySenderNoQuery, NumericFieldsTest, OutputWriterTest, MultiTermTest, TestConfig, EchoParamsTest, TestBM25SimilarityFactory, TestPhraseSuggestions, TestPerFieldSimilarity, TestDFRSimilarityFactory, TimeZoneUtilsTest, DateMathParserTest, PluginInfoTest, OpenExchangeRatesOrgProviderTest, FileUtilsTest, TestSystemIdResolver, DateFieldTest, TestSuggestSpellingConverter, TestBadConfig, DOMUtilTest, TestLRUCache, TestUtils, CircularListTest, AnalysisAfterCoreReloadTest, TestDocumentBuilder, PathHierarchyTokenizerFactoryTest, ClusterStateTest, SyncSliceTest]
[junit4:junit4] Completed in 129.56s, 1 test, 1 failure <<< FAILURES!

[...truncated 33 lines...]
BUILD FAILED
C:\Jenkins\workspace\Lucene-Solr-trunk-Windows\build.xml:29: The following error occurred while executing this line:
C:\Jenkins\workspace\Lucene-Solr-trunk-Windows\solr\build.xml:146: The following error occurred while executing this line:
C:\Jenkins\workspace\Lucene-Solr-trunk-Windows\lucene\module-build.xml:63: The following error occurred while executing this line:
C:\Jenkins\workspace\Lucene-Solr-trunk-Windows\lucene\common-build.xml:1133: The following error occurred while executing this line:
C:\Jenkins\workspace\Lucene-Solr-trunk-Windows\lucene\common-build.xml:810: There were test failures: 228 suites, 923 tests, 8 errors, 2 failures, 11 ignored (6 assumptions)

Total time: 45 minutes 22 seconds
Build step 'Invoke Ant' marked build as failure
Recording test results
Description set: Java: 32bit/jdk1.7.0_07 -client -XX:+UseConcMarkSweepGC
Email was triggered for: Failure
Sending email for trigger: Failure



Mime
View raw message