lucene-dev mailing list archives

Site index · List index
Message view « Date » · « Thread »
Top « Date » · « Thread »
From Policeman Jenkins Server <jenk...@sd-datasolutions.de>
Subject [JENKINS] Lucene-Solr-4.x-Windows (32bit/jdk1.7.0_07) - Build # 784 - Failure!
Date Sat, 15 Sep 2012 13:51:35 GMT
Build: http://jenkins.sd-datasolutions.de/job/Lucene-Solr-4.x-Windows/784/
Java: 32bit/jdk1.7.0_07 -server -XX:+UseConcMarkSweepGC

2 tests failed.
REGRESSION:  org.apache.solr.cloud.LeaderElectionIntegrationTest.testLeaderElectionAfterClientTimeout

Error Message:
expected:<7000> but was:<7001>

Stack Trace:
java.lang.AssertionError: expected:<7000> but was:<7001>
	at __randomizedtesting.SeedInfo.seed([945474DAE7684ED5:3D63D179C04DC63E]:0)
	at org.junit.Assert.fail(Assert.java:93)
	at org.junit.Assert.failNotEquals(Assert.java:647)
	at org.junit.Assert.assertEquals(Assert.java:128)
	at org.junit.Assert.assertEquals(Assert.java:472)
	at org.junit.Assert.assertEquals(Assert.java:456)
	at org.apache.solr.cloud.LeaderElectionIntegrationTest.testLeaderElectionAfterClientTimeout(LeaderElectionIntegrationTest.java:252)
	at sun.reflect.NativeMethodAccessorImpl.invoke0(Native Method)
	at sun.reflect.NativeMethodAccessorImpl.invoke(NativeMethodAccessorImpl.java:57)
	at sun.reflect.DelegatingMethodAccessorImpl.invoke(DelegatingMethodAccessorImpl.java:43)
	at java.lang.reflect.Method.invoke(Method.java:601)
	at com.carrotsearch.randomizedtesting.RandomizedRunner.invoke(RandomizedRunner.java:1559)
	at com.carrotsearch.randomizedtesting.RandomizedRunner.access$600(RandomizedRunner.java:79)
	at com.carrotsearch.randomizedtesting.RandomizedRunner$6.evaluate(RandomizedRunner.java:737)
	at com.carrotsearch.randomizedtesting.RandomizedRunner$7.evaluate(RandomizedRunner.java:773)
	at com.carrotsearch.randomizedtesting.RandomizedRunner$8.evaluate(RandomizedRunner.java:787)
	at com.carrotsearch.randomizedtesting.rules.SystemPropertiesRestoreRule$1.evaluate(SystemPropertiesRestoreRule.java:53)
	at org.apache.lucene.util.TestRuleSetupTeardownChained$1.evaluate(TestRuleSetupTeardownChained.java:50)
	at org.apache.lucene.util.TestRuleFieldCacheSanity$1.evaluate(TestRuleFieldCacheSanity.java:51)
	at org.apache.lucene.util.AbstractBeforeAfterRule$1.evaluate(AbstractBeforeAfterRule.java:45)
	at com.carrotsearch.randomizedtesting.rules.SystemPropertiesInvariantRule$1.evaluate(SystemPropertiesInvariantRule.java:55)
	at org.apache.lucene.util.TestRuleThreadAndTestName$1.evaluate(TestRuleThreadAndTestName.java:48)
	at org.apache.lucene.util.TestRuleIgnoreAfterMaxFailures$1.evaluate(TestRuleIgnoreAfterMaxFailures.java:70)
	at org.apache.lucene.util.TestRuleMarkFailure$1.evaluate(TestRuleMarkFailure.java:48)
	at com.carrotsearch.randomizedtesting.rules.StatementAdapter.evaluate(StatementAdapter.java:36)
	at com.carrotsearch.randomizedtesting.ThreadLeakControl$StatementRunner.run(ThreadLeakControl.java:358)
	at com.carrotsearch.randomizedtesting.ThreadLeakControl.forkTimeoutingTask(ThreadLeakControl.java:782)
	at com.carrotsearch.randomizedtesting.ThreadLeakControl$3.evaluate(ThreadLeakControl.java:442)
	at com.carrotsearch.randomizedtesting.RandomizedRunner.runSingleTest(RandomizedRunner.java:746)
	at com.carrotsearch.randomizedtesting.RandomizedRunner$3.evaluate(RandomizedRunner.java:648)
	at com.carrotsearch.randomizedtesting.RandomizedRunner$4.evaluate(RandomizedRunner.java:682)
	at com.carrotsearch.randomizedtesting.RandomizedRunner$5.evaluate(RandomizedRunner.java:693)
	at com.carrotsearch.randomizedtesting.rules.StatementAdapter.evaluate(StatementAdapter.java:36)
	at com.carrotsearch.randomizedtesting.rules.SystemPropertiesRestoreRule$1.evaluate(SystemPropertiesRestoreRule.java:53)
	at org.apache.lucene.util.AbstractBeforeAfterRule$1.evaluate(AbstractBeforeAfterRule.java:45)
	at org.apache.lucene.util.TestRuleStoreClassName$1.evaluate(TestRuleStoreClassName.java:42)
	at com.carrotsearch.randomizedtesting.rules.SystemPropertiesInvariantRule$1.evaluate(SystemPropertiesInvariantRule.java:55)
	at com.carrotsearch.randomizedtesting.rules.NoShadowingOrOverridesOnMethodsRule$1.evaluate(NoShadowingOrOverridesOnMethodsRule.java:39)
	at com.carrotsearch.randomizedtesting.rules.NoShadowingOrOverridesOnMethodsRule$1.evaluate(NoShadowingOrOverridesOnMethodsRule.java:39)
	at com.carrotsearch.randomizedtesting.rules.StatementAdapter.evaluate(StatementAdapter.java:36)
	at org.apache.lucene.util.TestRuleAssertionsRequired$1.evaluate(TestRuleAssertionsRequired.java:43)
	at org.apache.lucene.util.TestRuleMarkFailure$1.evaluate(TestRuleMarkFailure.java:48)
	at org.apache.lucene.util.TestRuleIgnoreAfterMaxFailures$1.evaluate(TestRuleIgnoreAfterMaxFailures.java:70)
	at org.apache.lucene.util.TestRuleIgnoreTestSuites$1.evaluate(TestRuleIgnoreTestSuites.java:55)
	at com.carrotsearch.randomizedtesting.rules.StatementAdapter.evaluate(StatementAdapter.java:36)
	at com.carrotsearch.randomizedtesting.ThreadLeakControl$StatementRunner.run(ThreadLeakControl.java:358)
	at java.lang.Thread.run(Thread.java:722)


REGRESSION:  org.apache.solr.spelling.suggest.SuggesterFSTTest.testRebuild

Error Message:
Exception during query

Stack Trace:
java.lang.RuntimeException: Exception during query
	at __randomizedtesting.SeedInfo.seed([945474DAE7684ED5:CF71D699D368344F]:0)
	at org.apache.solr.SolrTestCaseJ4.assertQ(SolrTestCaseJ4.java:503)
	at org.apache.solr.SolrTestCaseJ4.assertQ(SolrTestCaseJ4.java:470)
	at org.apache.solr.spelling.suggest.SuggesterTest.testRebuild(SuggesterTest.java:105)
	at sun.reflect.NativeMethodAccessorImpl.invoke0(Native Method)
	at sun.reflect.NativeMethodAccessorImpl.invoke(NativeMethodAccessorImpl.java:57)
	at sun.reflect.DelegatingMethodAccessorImpl.invoke(DelegatingMethodAccessorImpl.java:43)
	at java.lang.reflect.Method.invoke(Method.java:601)
	at com.carrotsearch.randomizedtesting.RandomizedRunner.invoke(RandomizedRunner.java:1559)
	at com.carrotsearch.randomizedtesting.RandomizedRunner.access$600(RandomizedRunner.java:79)
	at com.carrotsearch.randomizedtesting.RandomizedRunner$6.evaluate(RandomizedRunner.java:737)
	at com.carrotsearch.randomizedtesting.RandomizedRunner$7.evaluate(RandomizedRunner.java:773)
	at com.carrotsearch.randomizedtesting.RandomizedRunner$8.evaluate(RandomizedRunner.java:787)
	at com.carrotsearch.randomizedtesting.rules.SystemPropertiesRestoreRule$1.evaluate(SystemPropertiesRestoreRule.java:53)
	at org.apache.lucene.util.TestRuleSetupTeardownChained$1.evaluate(TestRuleSetupTeardownChained.java:50)
	at org.apache.lucene.util.TestRuleFieldCacheSanity$1.evaluate(TestRuleFieldCacheSanity.java:51)
	at org.apache.lucene.util.AbstractBeforeAfterRule$1.evaluate(AbstractBeforeAfterRule.java:45)
	at com.carrotsearch.randomizedtesting.rules.SystemPropertiesInvariantRule$1.evaluate(SystemPropertiesInvariantRule.java:55)
	at org.apache.lucene.util.TestRuleThreadAndTestName$1.evaluate(TestRuleThreadAndTestName.java:48)
	at org.apache.lucene.util.TestRuleIgnoreAfterMaxFailures$1.evaluate(TestRuleIgnoreAfterMaxFailures.java:70)
	at org.apache.lucene.util.TestRuleMarkFailure$1.evaluate(TestRuleMarkFailure.java:48)
	at com.carrotsearch.randomizedtesting.rules.StatementAdapter.evaluate(StatementAdapter.java:36)
	at com.carrotsearch.randomizedtesting.ThreadLeakControl$StatementRunner.run(ThreadLeakControl.java:358)
	at com.carrotsearch.randomizedtesting.ThreadLeakControl.forkTimeoutingTask(ThreadLeakControl.java:782)
	at com.carrotsearch.randomizedtesting.ThreadLeakControl$3.evaluate(ThreadLeakControl.java:442)
	at com.carrotsearch.randomizedtesting.RandomizedRunner.runSingleTest(RandomizedRunner.java:746)
	at com.carrotsearch.randomizedtesting.RandomizedRunner$3.evaluate(RandomizedRunner.java:648)
	at com.carrotsearch.randomizedtesting.RandomizedRunner$4.evaluate(RandomizedRunner.java:682)
	at com.carrotsearch.randomizedtesting.RandomizedRunner$5.evaluate(RandomizedRunner.java:693)
	at com.carrotsearch.randomizedtesting.rules.StatementAdapter.evaluate(StatementAdapter.java:36)
	at com.carrotsearch.randomizedtesting.rules.SystemPropertiesRestoreRule$1.evaluate(SystemPropertiesRestoreRule.java:53)
	at org.apache.lucene.util.AbstractBeforeAfterRule$1.evaluate(AbstractBeforeAfterRule.java:45)
	at org.apache.lucene.util.TestRuleStoreClassName$1.evaluate(TestRuleStoreClassName.java:42)
	at com.carrotsearch.randomizedtesting.rules.SystemPropertiesInvariantRule$1.evaluate(SystemPropertiesInvariantRule.java:55)
	at com.carrotsearch.randomizedtesting.rules.NoShadowingOrOverridesOnMethodsRule$1.evaluate(NoShadowingOrOverridesOnMethodsRule.java:39)
	at com.carrotsearch.randomizedtesting.rules.NoShadowingOrOverridesOnMethodsRule$1.evaluate(NoShadowingOrOverridesOnMethodsRule.java:39)
	at com.carrotsearch.randomizedtesting.rules.StatementAdapter.evaluate(StatementAdapter.java:36)
	at org.apache.lucene.util.TestRuleAssertionsRequired$1.evaluate(TestRuleAssertionsRequired.java:43)
	at org.apache.lucene.util.TestRuleMarkFailure$1.evaluate(TestRuleMarkFailure.java:48)
	at org.apache.lucene.util.TestRuleIgnoreAfterMaxFailures$1.evaluate(TestRuleIgnoreAfterMaxFailures.java:70)
	at org.apache.lucene.util.TestRuleIgnoreTestSuites$1.evaluate(TestRuleIgnoreTestSuites.java:55)
	at com.carrotsearch.randomizedtesting.rules.StatementAdapter.evaluate(StatementAdapter.java:36)
	at com.carrotsearch.randomizedtesting.ThreadLeakControl$StatementRunner.run(ThreadLeakControl.java:358)
	at java.lang.Thread.run(Thread.java:722)
Caused by: java.lang.NullPointerException
	at org.apache.lucene.search.suggest.fst.FSTCompletionLookup.lookup(FSTCompletionLookup.java:237)
	at org.apache.solr.spelling.suggest.Suggester.getSuggestions(Suggester.java:190)
	at org.apache.solr.handler.component.SpellCheckComponent.process(SpellCheckComponent.java:172)
	at org.apache.solr.handler.component.SearchHandler.handleRequestBody(SearchHandler.java:206)
	at org.apache.solr.handler.RequestHandlerBase.handleRequest(RequestHandlerBase.java:129)
	at org.apache.solr.core.SolrCore.execute(SolrCore.java:1701)
	at org.apache.solr.util.TestHarness.query(TestHarness.java:364)
	at org.apache.solr.util.TestHarness.query(TestHarness.java:346)
	at org.apache.solr.SolrTestCaseJ4.assertQ(SolrTestCaseJ4.java:477)
	... 42 more




Build Log:
[...truncated 7676 lines...]
[junit4:junit4] Suite: org.apache.solr.spelling.suggest.SuggesterFSTTest
[junit4:junit4]   2> 1 T502 oas.SolrTestCaseJ4.initCore ####initCore
[junit4:junit4]   2> Creating dataDir: C:\Jenkins\workspace\Lucene-Solr-4.x-Windows\solr\build\solr-core\test\J0\.\solrtest-SuggesterFSTTest-1347715916822
[junit4:junit4]   2> 2 T502 oasc.SolrResourceLoader.<init> new SolrResourceLoader for directory: 'C:\Jenkins\workspace\Lucene-Solr-4.x-Windows\solr\build\solr-core\test-files\solr\collection1\'
[junit4:junit4]   2> 5 T502 oasc.SolrResourceLoader.replaceClassLoader Adding 'file:/C:/Jenkins/workspace/Lucene-Solr-4.x-Windows/solr/build/solr-core/test-files/solr/collection1/lib/classes/' to classloader
[junit4:junit4]   2> 6 T502 oasc.SolrResourceLoader.replaceClassLoader Adding 'file:/C:/Jenkins/workspace/Lucene-Solr-4.x-Windows/solr/build/solr-core/test-files/solr/collection1/lib/README' to classloader
[junit4:junit4]   2> 72 T502 oasc.SolrConfig.<init> Using Lucene MatchVersion: LUCENE_40
[junit4:junit4]   2> 137 T502 oasc.SolrConfig.<init> Loaded SolrConfig: solrconfig-spellchecker.xml
[junit4:junit4]   2> 137 T502 oass.IndexSchema.readSchema Reading Solr Schema
[junit4:junit4]   2> 141 T502 oass.IndexSchema.readSchema Schema name=Solr SpellCheck Test
[junit4:junit4]   2> 206 T502 oass.IndexSchema.readSchema default search field in schema is text
[junit4:junit4]   2> 208 T502 oass.IndexSchema.readSchema query parser default operator is OR
[junit4:junit4]   2> 209 T502 oass.IndexSchema.readSchema unique key field: id
[junit4:junit4]   2> 226 T502 oasc.SolrResourceLoader.locateSolrHome JNDI not configured for solr (NoInitialContextEx)
[junit4:junit4]   2> 226 T502 oasc.SolrResourceLoader.locateSolrHome using system property solr.solr.home: C:\Jenkins\workspace\Lucene-Solr-4.x-Windows\solr\build\solr-core\test-files\solr
[junit4:junit4]   2> 226 T502 oasc.SolrResourceLoader.<init> new SolrResourceLoader for directory: 'C:\Jenkins\workspace\Lucene-Solr-4.x-Windows\solr\build\solr-core\test-files\solr\'
[junit4:junit4]   2> 248 T502 oasc.CoreContainer.<init> New CoreContainer 29386128
[junit4:junit4]   2> 249 T502 oasc.SolrCore.<init> [collection1] Opening new SolrCore at C:\Jenkins\workspace\Lucene-Solr-4.x-Windows\solr\build\solr-core\test-files\solr\collection1\, dataDir=C:\Jenkins\workspace\Lucene-Solr-4.x-Windows\solr\build\solr-core\test\J0\.\solrtest-SuggesterFSTTest-1347715916822\
[junit4:junit4]   2> 249 T502 oasc.SolrCore.<init> JMX monitoring not detected for core: collection1
[junit4:junit4]   2> 249 T502 oasc.SolrCore.getNewIndexDir WARNING New index directory detected: old=null new=C:\Jenkins\workspace\Lucene-Solr-4.x-Windows\solr\build\solr-core\test\J0\.\solrtest-SuggesterFSTTest-1347715916822\index/
[junit4:junit4]   2> 250 T502 oasc.SolrCore.initIndex WARNING [collection1] Solr index directory 'C:\Jenkins\workspace\Lucene-Solr-4.x-Windows\solr\build\solr-core\test\J0\.\solrtest-SuggesterFSTTest-1347715916822\index' doesn't exist. Creating new index...
[junit4:junit4]   2> 263 T502 oasc.CachingDirectoryFactory.get return new directory for C:\Jenkins\workspace\Lucene-Solr-4.x-Windows\solr\build\solr-core\test\J0\.\solrtest-SuggesterFSTTest-1347715916822\index forceNew:false
[junit4:junit4]   2> 268 T502 oasc.SolrDeletionPolicy.onCommit SolrDeletionPolicy.onCommit: commits:num=1
[junit4:junit4]   2> 		commit{dir=MockDirWrapper(org.apache.lucene.store.NIOFSDirectory@C:\Jenkins\workspace\Lucene-Solr-4.x-Windows\solr\build\solr-core\test\J0\solrtest-SuggesterFSTTest-1347715916822\index lockFactory=org.apache.lucene.store.NativeFSLockFactory@39a0e),segFN=segments_1,generation=1,filenames=[segments_1]
[junit4:junit4]   2> 268 T502 oasc.SolrDeletionPolicy.updateCommits newest commit = 1
[junit4:junit4]   2> 269 T502 oasc.RequestHandlers.initHandlersFromConfig created standard: solr.StandardRequestHandler
[junit4:junit4]   2> 269 T502 oasc.RequestHandlers.initHandlersFromConfig created /suggest: org.apache.solr.handler.component.SearchHandler
[junit4:junit4]   2> 270 T502 oasc.RequestHandlers.initHandlersFromConfig created /suggest_tst: org.apache.solr.handler.component.SearchHandler
[junit4:junit4]   2> 270 T502 oasc.RequestHandlers.initHandlersFromConfig created /suggest_fst: org.apache.solr.handler.component.SearchHandler
[junit4:junit4]   2> 271 T502 oasc.RequestHandlers.initHandlersFromConfig created /suggest_wfst: org.apache.solr.handler.component.SearchHandler
[junit4:junit4]   2> 283 T502 oass.SolrIndexSearcher.<init> Opening Searcher@591f2f main
[junit4:junit4]   2> 283 T502 oass.SolrIndexSearcher.getIndexDir WARNING WARNING: Directory impl does not support setting indexDir: org.apache.lucene.store.MockDirectoryWrapper
[junit4:junit4]   2> 284 T502 oasu.CommitTracker.<init> Hard AutoCommit: disabled
[junit4:junit4]   2> 284 T502 oasu.CommitTracker.<init> Soft AutoCommit: disabled
[junit4:junit4]   2> 284 T502 oashc.SpellCheckComponent.inform Initializing spell checkers
[junit4:junit4]   2> 285 T502 oasss.Suggester.init init: {name=suggest,classname=org.apache.solr.spelling.suggest.Suggester,lookupImpl=org.apache.solr.spelling.suggest.jaspell.JaspellLookup,field=suggest,storeDir=suggest,buildOnCommit=true,threshold=0.0}
[junit4:junit4]   2> 285 T502 oasssj.JaspellLookupFactory.create init: {name=suggest,classname=org.apache.solr.spelling.suggest.Suggester,lookupImpl=org.apache.solr.spelling.suggest.jaspell.JaspellLookup,field=suggest,storeDir=suggest,buildOnCommit=true,threshold=0.0}
[junit4:junit4]   2> 286 T502 oashc.SpellCheckComponent.inform Registering newSearcher listener for spellchecker: suggest
[junit4:junit4]   2> 287 T502 oashc.SpellCheckComponent.inform No queryConverter defined, using default converter
[junit4:junit4]   2> 287 T502 oashc.SpellCheckComponent.inform Initializing spell checkers
[junit4:junit4]   2> 287 T502 oasss.Suggester.init init: {name=suggest_tst,classname=org.apache.solr.spelling.suggest.Suggester,lookupImpl=org.apache.solr.spelling.suggest.tst.TSTLookup,field=suggest,storeDir=suggest_tst,buildOnCommit=true,threshold=0.0}
[junit4:junit4]   2> 288 T502 oashc.SpellCheckComponent.inform Registering newSearcher listener for spellchecker: suggest_tst
[junit4:junit4]   2> 288 T502 oashc.SpellCheckComponent.inform No queryConverter defined, using default converter
[junit4:junit4]   2> 289 T502 oashc.SpellCheckComponent.inform Initializing spell checkers
[junit4:junit4]   2> 289 T502 oasss.Suggester.init init: {name=suggest_fst,classname=org.apache.solr.spelling.suggest.Suggester,lookupImpl=org.apache.solr.spelling.suggest.fst.FSTLookup,field=suggest,storeDir=suggest_fst,buildOnCommit=true,weightBuckets=5,exactMatchFirst=true}
[junit4:junit4]   2> 291 T502 oashc.SpellCheckComponent.inform Registering newSearcher listener for spellchecker: suggest_fst
[junit4:junit4]   2> 291 T502 oashc.SpellCheckComponent.inform No queryConverter defined, using default converter
[junit4:junit4]   2> 291 T502 oashc.SpellCheckComponent.inform Initializing spell checkers
[junit4:junit4]   2> 291 T502 oasss.Suggester.init init: {name=suggest_wfst,classname=org.apache.solr.spelling.suggest.Suggester,lookupImpl=org.apache.solr.spelling.suggest.fst.WFSTLookupFactory,field=suggest,storeDir=suggest_wfst,buildOnCommit=true,exactMatchFirst=true}
[junit4:junit4]   2> 293 T502 oashc.SpellCheckComponent.inform Registering newSearcher listener for spellchecker: suggest_wfst
[junit4:junit4]   2> 293 T502 oashc.SpellCheckComponent.inform No queryConverter defined, using default converter
[junit4:junit4]   2> 294 T502 oashc.HttpShardHandlerFactory.getParameter Setting socketTimeout to: 0
[junit4:junit4]   2> 294 T502 oashc.HttpShardHandlerFactory.getParameter Setting urlScheme to: http://
[junit4:junit4]   2> 294 T502 oashc.HttpShardHandlerFactory.getParameter Setting connTimeout to: 0
[junit4:junit4]   2> 294 T502 oashc.HttpShardHandlerFactory.getParameter Setting maxConnectionsPerHost to: 20
[junit4:junit4]   2> 295 T502 oashc.HttpShardHandlerFactory.getParameter Setting corePoolSize to: 0
[junit4:junit4]   2> 295 T502 oashc.HttpShardHandlerFactory.getParameter Setting maximumPoolSize to: 2147483647
[junit4:junit4]   2> 295 T502 oashc.HttpShardHandlerFactory.getParameter Setting maxThreadIdleTime to: 5
[junit4:junit4]   2> 295 T502 oashc.HttpShardHandlerFactory.getParameter Setting sizeOfQueue to: -1
[junit4:junit4]   2> 295 T502 oashc.HttpShardHandlerFactory.getParameter Setting fairnessPolicy to: false
[junit4:junit4]   2> 296 T502 oascsi.HttpClientUtil.createClient Creating new http client, config:maxConnectionsPerHost=20&maxConnections=10000&socketTimeout=0&connTimeout=0&retry=false
[junit4:junit4]   2> 306 T502 oasc.CoreContainer.register registering core: collection1
[junit4:junit4]   2> 309 T502 oas.SolrTestCaseJ4.initCore ####initCore end
[junit4:junit4]   2> 316 T502 oas.SolrTestCaseJ4.setUp ###Starting testRebuild
[junit4:junit4]   2> ASYNC  NEW_CORE C38 name=collection1 org.apache.solr.core.SolrCore@156d768
[junit4:junit4]   2> 323 T502 C38 oasc.SolrDeletionPolicy.onInit SolrDeletionPolicy.onInit: commits:num=1
[junit4:junit4]   2> 		commit{dir=MockDirWrapper(org.apache.lucene.store.NIOFSDirectory@C:\Jenkins\workspace\Lucene-Solr-4.x-Windows\solr\build\solr-core\test\J0\solrtest-SuggesterFSTTest-1347715916822\index lockFactory=org.apache.lucene.store.NativeFSLockFactory@39a0e),segFN=segments_1,generation=1,filenames=[segments_1]
[junit4:junit4]   2> 324 T502 C38 oasc.SolrDeletionPolicy.updateCommits newest commit = 1
[junit4:junit4]   2> 327 T502 C38 UPDATE [collection1] webapp=null path=null params={} {add=[1]} 0 7
[junit4:junit4]   2> 359 T502 C38 UPDATE [collection1] webapp=null path=null params={} {add=[2]} 0 2
[junit4:junit4]   2> 373 T502 C38 UPDATE [collection1] webapp=null path=null params={} {add=[3]} 0 4
[junit4:junit4]   2> 384 T502 C38 oasu.DirectUpdateHandler2.commit start commit{flags=0,_version_=0,optimize=false,openSearcher=true,waitSearcher=true,expungeDeletes=false,softCommit=false}
[junit4:junit4]   2> 395 T502 C38 oasc.SolrDeletionPolicy.onCommit SolrDeletionPolicy.onCommit: commits:num=2
[junit4:junit4]   2> 		commit{dir=MockDirWrapper(org.apache.lucene.store.NIOFSDirectory@C:\Jenkins\workspace\Lucene-Solr-4.x-Windows\solr\build\solr-core\test\J0\solrtest-SuggesterFSTTest-1347715916822\index lockFactory=org.apache.lucene.store.NativeFSLockFactory@39a0e),segFN=segments_1,generation=1,filenames=[segments_1]
[junit4:junit4]   2> 		commit{dir=MockDirWrapper(org.apache.lucene.store.NIOFSDirectory@C:\Jenkins\workspace\Lucene-Solr-4.x-Windows\solr\build\solr-core\test\J0\solrtest-SuggesterFSTTest-1347715916822\index lockFactory=org.apache.lucene.store.NativeFSLockFactory@39a0e),segFN=segments_2,generation=2,filenames=[_0.fnm, _0.frq, _0.tim, _0_nrm.cfe, segments_2, _0.fdx, _0_nrm.cfs, _0.si, _0.prx, _0.tip, _0.fdt]
[junit4:junit4]   2> 395 T502 C38 oasc.SolrDeletionPolicy.updateCommits newest commit = 2
[junit4:junit4]   2> 396 T502 C38 oasc.SolrCore.getSearcher WARNING [collection1] PERFORMANCE WARNING: Overlapping onDeckSearchers=2
[junit4:junit4]   2> 406 T502 C38 oass.SolrIndexSearcher.<init> Opening Searcher@ddbc7b main
[junit4:junit4]   2> 406 T502 C38 oass.SolrIndexSearcher.getIndexDir WARNING WARNING: Directory impl does not support setting indexDir: org.apache.lucene.store.MockDirectoryWrapper
[junit4:junit4]   2> 410 T502 C38 oasu.DirectUpdateHandler2.commit end_commit_flush
[junit4:junit4]   2> 411 T503 oasc.SolrCore.registerSearcher [collection1] Registered new searcher Searcher@591f2f main{StandardDirectoryReader(segments_1:1)}
[junit4:junit4]   2> 412 T503 oashc.SpellCheckComponent$SpellCheckerListener.newSearcher Loading spell index for spellchecker: suggest
[junit4:junit4]   2> 412 T503 oasss.Suggester.reload reload()
[junit4:junit4]   2> 414 T503 oashc.SpellCheckComponent$SpellCheckerListener.newSearcher SEVERE Exception in reloading spell check index for spellchecker: suggest java.io.FileNotFoundException: C:\Jenkins\workspace\Lucene-Solr-4.x-Windows\solr\build\solr-core\test\J0\.\solrtest-SuggesterFSTTest-1347715916822\suggest\jaspell.dat (The system cannot find the file specified)
[junit4:junit4]   2> 	at java.io.FileInputStream.open(Native Method)
[junit4:junit4]   2> 	at java.io.FileInputStream.<init>(FileInputStream.java:138)
[junit4:junit4]   2> 	at org.apache.solr.spelling.suggest.Suggester.reload(Suggester.java:161)
[junit4:junit4]   2> 	at org.apache.solr.handler.component.SpellCheckComponent$SpellCheckerListener.newSearcher(SpellCheckComponent.java:673)
[junit4:junit4]   2> 	at org.apache.solr.core.SolrCore$5.call(SolrCore.java:1481)
[junit4:junit4]   2> 	at java.util.concurrent.FutureTask$Sync.innerRun(FutureTask.java:334)
[junit4:junit4]   2> 	at java.util.concurrent.FutureTask.run(FutureTask.java:166)
[junit4:junit4]   2> 	at java.util.concurrent.ThreadPoolExecutor.runWorker(ThreadPoolExecutor.java:1110)
[junit4:junit4]   2> 	at java.util.concurrent.ThreadPoolExecutor$Worker.run(ThreadPoolExecutor.java:603)
[junit4:junit4]   2> 	at java.lang.Thread.run(Thread.java:722)
[junit4:junit4]   2> 
[junit4:junit4]   2> 416 T503 oashc.SpellCheckComponent$SpellCheckerListener.newSearcher Loading spell index for spellchecker: suggest_tst
[junit4:junit4]   2> 416 T503 oasss.Suggester.reload reload()
[junit4:junit4]   2> 417 T503 oashc.SpellCheckComponent$SpellCheckerListener.newSearcher SEVERE Exception in reloading spell check index for spellchecker: suggest_tst java.io.FileNotFoundException: C:\Jenkins\workspace\Lucene-Solr-4.x-Windows\solr\build\solr-core\test\J0\.\solrtest-SuggesterFSTTest-1347715916822\suggest_tst\tst.dat (The system cannot find the file specified)
[junit4:junit4]   2> 	at java.io.FileInputStream.open(Native Method)
[junit4:junit4]   2> 	at java.io.FileInputStream.<init>(FileInputStream.java:138)
[junit4:junit4]   2> 	at org.apache.solr.spelling.suggest.Suggester.reload(Suggester.java:161)
[junit4:junit4]   2> 	at org.apache.solr.handler.component.SpellCheckComponent$SpellCheckerListener.newSearcher(SpellCheckComponent.java:673)
[junit4:junit4]   2> 	at org.apache.solr.core.SolrCore$5.call(SolrCore.java:1481)
[junit4:junit4]   2> 	at java.util.concurrent.FutureTask$Sync.innerRun(FutureTask.java:334)
[junit4:junit4]   2> 	at java.util.concurrent.FutureTask.run(FutureTask.java:166)
[junit4:junit4]   2> 	at java.util.concurrent.ThreadPoolExecutor.runWorker(ThreadPoolExecutor.java:1110)
[junit4:junit4]   2> 	at java.util.concurrent.ThreadPoolExecutor$Worker.run(ThreadPoolExecutor.java:603)
[junit4:junit4]   2> 	at java.lang.Thread.run(Thread.java:722)
[junit4:junit4]   2> 
[junit4:junit4]   2> 417 T503 oashc.SpellCheckComponent$SpellCheckerListener.newSearcher Loading spell index for spellchecker: suggest_fst
[junit4:junit4]   2> 417 T503 oasss.Suggester.reload reload()
[junit4:junit4]   2> 418 T503 oashc.SpellCheckComponent$SpellCheckerListener.newSearcher SEVERE Exception in reloading spell check index for spellchecker: suggest_fst java.io.FileNotFoundException: C:\Jenkins\workspace\Lucene-Solr-4.x-Windows\solr\build\solr-core\test\J0\.\solrtest-SuggesterFSTTest-1347715916822\suggest_fst\fst.bin (The system cannot find the file specified)
[junit4:junit4]   2> 	at java.io.FileInputStream.open(Native Method)
[junit4:junit4]   2> 	at java.io.FileInputStream.<init>(FileInputStream.java:138)
[junit4:junit4]   2> 	at org.apache.solr.spelling.suggest.Suggester.reload(Suggester.java:161)
[junit4:junit4]   2> 	at org.apache.solr.handler.component.SpellCheckComponent$SpellCheckerListener.newSearcher(SpellCheckComponent.java:673)
[junit4:junit4]   2> 	at org.apache.solr.core.SolrCore$5.call(SolrCore.java:1481)
[junit4:junit4]   2> 	at java.util.concurrent.FutureTask$Sync.innerRun(FutureTask.java:334)
[junit4:junit4]   2> 	at java.util.concurrent.FutureTask.run(FutureTask.java:166)
[junit4:junit4]   2> 	at java.util.concurrent.ThreadPoolExecutor.runWorker(ThreadPoolExecutor.java:1110)
[junit4:junit4]   2> 	at java.util.concurrent.ThreadPoolExecutor$Worker.run(ThreadPoolExecutor.java:603)
[junit4:junit4]   2> 	at java.lang.Thread.run(Thread.java:722)
[junit4:junit4]   2> 
[junit4:junit4]   2> 418 T503 oashc.SpellCheckComponent$SpellCheckerListener.newSearcher Loading spell index for spellchecker: suggest_wfst
[junit4:junit4]   2> 418 T503 oasss.Suggester.reload reload()
[junit4:junit4]   2> 419 T503 oashc.SpellCheckComponent$SpellCheckerListener.newSearcher SEVERE Exception in reloading spell check index for spellchecker: suggest_wfst java.io.FileNotFoundException: C:\Jenkins\workspace\Lucene-Solr-4.x-Windows\solr\build\solr-core\test\J0\.\solrtest-SuggesterFSTTest-1347715916822\suggest_wfst\wfst.bin (The system cannot find the file specified)
[junit4:junit4]   2> 	at java.io.FileInputStream.open(Native Method)
[junit4:junit4]   2> 	at java.io.FileInputStream.<init>(FileInputStream.java:138)
[junit4:junit4]   2> 	at org.apache.solr.spelling.suggest.Suggester.reload(Suggester.java:161)
[junit4:junit4]   2> 	at org.apache.solr.handler.component.SpellCheckComponent$SpellCheckerListener.newSearcher(SpellCheckComponent.java:673)
[junit4:junit4]   2> 	at org.apache.solr.core.SolrCore$5.call(SolrCore.java:1481)
[junit4:junit4]   2> 	at java.util.concurrent.FutureTask$Sync.innerRun(FutureTask.java:334)
[junit4:junit4]   2> 	at java.util.concurrent.FutureTask.run(FutureTask.java:166)
[junit4:junit4]   2> 	at java.util.concurrent.ThreadPoolExecutor.runWorker(ThreadPoolExecutor.java:1110)
[junit4:junit4]   2> 	at java.util.concurrent.ThreadPoolExecutor$Worker.run(ThreadPoolExecutor.java:603)
[junit4:junit4]   2> 	at java.lang.Thread.run(Thread.java:722)
[junit4:junit4]   2> 
[junit4:junit4]   2> 420 T503 oasc.SolrCore.registerSearcher [collection1] Registered new searcher Searcher@ddbc7b main{StandardDirectoryReader(segments_2:3 _0(4.0.0.2):C3)}
[junit4:junit4]   2> 420 T502 C38 UPDATE [collection1] webapp=null path=null params={} {commit=} 0 37
[junit4:junit4]   2> 427 T502 C38 oasc.SolrException.log SEVERE java.lang.NullPointerException
[junit4:junit4]   2> 		at org.apache.lucene.search.suggest.fst.FSTCompletionLookup.lookup(FSTCompletionLookup.java:237)
[junit4:junit4]   2> 		at org.apache.solr.spelling.suggest.Suggester.getSuggestions(Suggester.java:190)
[junit4:junit4]   2> 		at org.apache.solr.handler.component.SpellCheckComponent.process(SpellCheckComponent.java:172)
[junit4:junit4]   2> 		at org.apache.solr.handler.component.SearchHandler.handleRequestBody(SearchHandler.java:206)
[junit4:junit4]   2> 		at org.apache.solr.handler.RequestHandlerBase.handleRequest(RequestHandlerBase.java:129)
[junit4:junit4]   2> 		at org.apache.solr.core.SolrCore.execute(SolrCore.java:1701)
[junit4:junit4]   2> 		at org.apache.solr.util.TestHarness.query(TestHarness.java:364)
[junit4:junit4]   2> 		at org.apache.solr.util.TestHarness.query(TestHarness.java:346)
[junit4:junit4]   2> 		at org.apache.solr.SolrTestCaseJ4.assertQ(SolrTestCaseJ4.java:477)
[junit4:junit4]   2> 		at org.apache.solr.SolrTestCaseJ4.assertQ(SolrTestCaseJ4.java:470)
[junit4:junit4]   2> 		at org.apache.solr.spelling.suggest.SuggesterTest.testRebuild(SuggesterTest.java:105)
[junit4:junit4]   2> 		at sun.reflect.NativeMethodAccessorImpl.invoke0(Native Method)
[junit4:junit4]   2> 		at sun.reflect.NativeMethodAccessorImpl.invoke(NativeMethodAccessorImpl.java:57)
[junit4:junit4]   2> 		at sun.reflect.DelegatingMethodAccessorImpl.invoke(DelegatingMethodAccessorImpl.java:43)
[junit4:junit4]   2> 		at java.lang.reflect.Method.invoke(Method.java:601)
[junit4:junit4]   2> 		at com.carrotsearch.randomizedtesting.RandomizedRunner.invoke(RandomizedRunner.java:1559)
[junit4:junit4]   2> 		at com.carrotsearch.randomizedtesting.RandomizedRunner.access$600(RandomizedRunner.java:79)
[junit4:junit4]   2> 		at com.carrotsearch.randomizedtesting.RandomizedRunner$6.evaluate(RandomizedRunner.java:737)
[junit4:junit4]   2> 		at com.carrotsearch.randomizedtesting.RandomizedRunner$7.evaluate(RandomizedRunner.java:773)
[junit4:junit4]   2> 		at com.carrotsearch.randomizedtesting.RandomizedRunner$8.evaluate(RandomizedRunner.java:787)
[junit4:junit4]   2> 		at com.carrotsearch.randomizedtesting.rules.SystemPropertiesRestoreRule$1.evaluate(SystemPropertiesRestoreRule.java:53)
[junit4:junit4]   2> 		at org.apache.lucene.util.TestRuleSetupTeardownChained$1.evaluate(TestRuleSetupTeardownChained.java:50)
[junit4:junit4]   2> 		at org.apache.lucene.util.TestRuleFieldCacheSanity$1.evaluate(TestRuleFieldCacheSanity.java:51)
[junit4:junit4]   2> 		at org.apache.lucene.util.AbstractBeforeAfterRule$1.evaluate(AbstractBeforeAfterRule.java:45)
[junit4:junit4]   2> 		at com.carrotsearch.randomizedtesting.rules.SystemPropertiesInvariantRule$1.evaluate(SystemPropertiesInvariantRule.java:55)
[junit4:junit4]   2> 		at org.apache.lucene.util.TestRuleThreadAndTestName$1.evaluate(TestRuleThreadAndTestName.java:48)
[junit4:junit4]   2> 		at org.apache.lucene.util.TestRuleIgnoreAfterMaxFailures$1.evaluate(TestRuleIgnoreAfterMaxFailures.java:70)
[junit4:junit4]   2> 		at org.apache.lucene.util.TestRuleMarkFailure$1.evaluate(TestRuleMarkFailure.java:48)
[junit4:junit4]   2> 		at com.carrotsearch.randomizedtesting.rules.StatementAdapter.evaluate(StatementAdapter.java:36)
[junit4:junit4]   2> 		at com.carrotsearch.randomizedtesting.ThreadLeakControl$StatementRunner.run(ThreadLeakControl.java:358)
[junit4:junit4]   2> 		at com.carrotsearch.randomizedtesting.ThreadLeakControl.forkTimeoutingTask(ThreadLeakControl.java:782)
[junit4:junit4]   2> 		at com.carrotsearch.randomizedtesting.ThreadLeakControl$3.evaluate(ThreadLeakControl.java:442)
[junit4:junit4]   2> 		at com.carrotsearch.randomizedtesting.RandomizedRunner.runSingleTest(RandomizedRunner.java:746)
[junit4:junit4]   2> 		at com.carrotsearch.randomizedtesting.RandomizedRunner$3.evaluate(RandomizedRunner.java:648)
[junit4:junit4]   2> 		at com.carrotsearch.randomizedtesting.RandomizedRunner$4.evaluate(RandomizedRunner.java:682)
[junit4:junit4]   2> 		at com.carrotsearch.randomizedtesting.RandomizedRunner$5.evaluate(RandomizedRunner.java:693)
[junit4:junit4]   2> 		at com.carrotsearch.randomizedtesting.rules.StatementAdapter.evaluate(StatementAdapter.java:36)
[junit4:junit4]   2> 		at com.carrotsearch.randomizedtesting.rules.SystemPropertiesRestoreRule$1.evaluate(SystemPropertiesRestoreRule.java:53)
[junit4:junit4]   2> 		at org.apache.lucene.util.AbstractBeforeAfterRule$1.evaluate(AbstractBeforeAfterRule.java:45)
[junit4:junit4]   2> 		at org.apache.lucene.util.TestRuleStoreClassName$1.evaluate(TestRuleStoreClassName.java:42)
[junit4:junit4]   2> 		at com.carrotsearch.randomizedtesting.rules.SystemPropertiesInvariantRule$1.evaluate(SystemPropertiesInvariantRule.java:55)
[junit4:junit4]   2> 		at com.carrotsearch.randomizedtesting.rules.NoShadowingOrOverridesOnMethodsRule$1.evaluate(NoShadowingOrOverridesOnMethodsRule.java:39)
[junit4:junit4]   2> 		at com.carrotsearch.randomizedtesting.rules.NoShadowingOrOverridesOnMethodsRule$1.evaluate(NoShadowingOrOverridesOnMethodsRule.java:39)
[junit4:junit4]   2> 		at com.carrotsearch.randomizedtesting.rules.StatementAdapter.evaluate(StatementAdapter.java:36)
[junit4:junit4]   2> 		at org.apache.lucene.util.TestRuleAssertionsRequired$1.evaluate(TestRuleAssertionsRequired.java:43)
[junit4:junit4]   2> 		at org.apache.lucene.util.TestRuleMarkFailure$1.evaluate(TestRuleMarkFailure.java:48)
[junit4:junit4]   2> 		at org.apache.lucene.util.TestRuleIgnoreAfterMaxFailures$1.evaluate(TestRuleIgnoreAfterMaxFailures.java:70)
[junit4:junit4]   2> 		at org.apache.lucene.util.TestRuleIgnoreTestSuites$1.evaluate(TestRuleIgnoreTestSuites.java:55)
[junit4:junit4]   2> 		at com.carrotsearch.randomizedtesting.rules.StatementAdapter.evaluate(StatementAdapter.java:36)
[junit4:junit4]   2> 		at com.carrotsearch.randomizedtesting.ThreadLeakControl$StatementRunner.run(ThreadLeakControl.java:358)
[junit4:junit4]   2> 		at java.lang.Thread.run(Thread.java:722)
[junit4:junit4]   2> 	
[junit4:junit4]   2> 427 T502 C38 REQ [collection1] webapp=null path=null params={q=ac&spellcheck.count=2&qt=/suggest_fst&spellcheck.onlyMorePopular=true} status=500 QTime=1 
[junit4:junit4]   2> 428 T502 oasc.SolrException.log SEVERE REQUEST FAILED: q=ac&spellcheck.count=2&qt=/suggest_fst&spellcheck.onlyMorePopular=true:java.lang.NullPointerException
[junit4:junit4]   2> 		at org.apache.lucene.search.suggest.fst.FSTCompletionLookup.lookup(FSTCompletionLookup.java:237)
[junit4:junit4]   2> 		at org.apache.solr.spelling.suggest.Suggester.getSuggestions(Suggester.java:190)
[junit4:junit4]   2> 		at org.apache.solr.handler.component.SpellCheckComponent.process(SpellCheckComponent.java:172)
[junit4:junit4]   2> 		at org.apache.solr.handler.component.SearchHandler.handleRequestBody(SearchHandler.java:206)
[junit4:junit4]   2> 		at org.apache.solr.handler.RequestHandlerBase.handleRequest(RequestHandlerBase.java:129)
[junit4:junit4]   2> 		at org.apache.solr.core.SolrCore.execute(SolrCore.java:1701)
[junit4:junit4]   2> 		at org.apache.solr.util.TestHarness.query(TestHarness.java:364)
[junit4:junit4]   2> 		at org.apache.solr.util.TestHarness.query(TestHarness.java:346)
[junit4:junit4]   2> 		at org.apache.solr.SolrTestCaseJ4.assertQ(SolrTestCaseJ4.java:477)
[junit4:junit4]   2> 		at org.apache.solr.SolrTestCaseJ4.assertQ(SolrTestCaseJ4.java:470)
[junit4:junit4]   2> 		at org.apache.solr.spelling.suggest.SuggesterTest.testRebuild(SuggesterTest.java:105)
[junit4:junit4]   2> 		at sun.reflect.NativeMethodAccessorImpl.invoke0(Native Method)
[junit4:junit4]   2> 		at sun.reflect.NativeMethodAccessorImpl.invoke(NativeMethodAccessorImpl.java:57)
[junit4:junit4]   2> 		at sun.reflect.DelegatingMethodAccessorImpl.invoke(DelegatingMethodAccessorImpl.java:43)
[junit4:junit4]   2> 		at java.lang.reflect.Method.invoke(Method.java:601)
[junit4:junit4]   2> 		at com.carrotsearch.randomizedtesting.RandomizedRunner.invoke(RandomizedRunner.java:1559)
[junit4:junit4]   2> 		at com.carrotsearch.randomizedtesting.RandomizedRunner.access$600(RandomizedRunner.java:79)
[junit4:junit4]   2> 		at com.carrotsearch.randomizedtesting.RandomizedRunner$6.evaluate(RandomizedRunner.java:737)
[junit4:junit4]   2> 		at com.carrotsearch.randomizedtesting.RandomizedRunner$7.evaluate(RandomizedRunner.java:773)
[junit4:junit4]   2> 		at com.carrotsearch.randomizedtesting.RandomizedRunner$8.evaluate(RandomizedRunner.java:787)
[junit4:junit4]   2> 		at com.carrotsearch.randomizedtesting.rules.SystemPropertiesRestoreRule$1.evaluate(SystemPropertiesRestoreRule.java:53)
[junit4:junit4]   2> 		at org.apache.lucene.util.TestRuleSetupTeardownChained$1.evaluate(TestRuleSetupTeardownChained.java:50)
[junit4:junit4]   2> 		at org.apache.lucene.util.TestRuleFieldCacheSanity$1.evaluate(TestRuleFieldCacheSanity.java:51)
[junit4:junit4]   2> 		at org.apache.lucene.util.AbstractBeforeAfterRule$1.evaluate(AbstractBeforeAfterRule.java:45)
[junit4:junit4]   2> 		at com.carrotsearch.randomizedtesting.rules.SystemPropertiesInvariantRule$1.evaluate(SystemPropertiesInvariantRule.java:55)
[junit4:junit4]   2> 		at org.apache.lucene.util.TestRuleThreadAndTestName$1.evaluate(TestRuleThreadAndTestName.java:48)
[junit4:junit4]   2> 		at org.apache.lucene.util.TestRuleIgnoreAfterMaxFailures$1.evaluate(TestRuleIgnoreAfterMaxFailures.java:70)
[junit4:junit4]   2> 		at org.apache.lucene.util.TestRuleMarkFailure$1.evaluate(TestRuleMarkFailure.java:48)
[junit4:junit4]   2> 		at com.carrotsearch.randomizedtesting.rules.StatementAdapter.evaluate(StatementAdapter.java:36)
[junit4:junit4]   2> 		at com.carrotsearch.randomizedtesting.ThreadLeakControl$StatementRunner.run(ThreadLeakControl.java:358)
[junit4:junit4]   2> 		at com.carrotsearch.randomizedtesting.ThreadLeakControl.forkTimeoutingTask(ThreadLeakControl.java:782)
[junit4:junit4]   2> 		at com.carrotsearch.randomizedtesting.ThreadLeakControl$3.evaluate(ThreadLeakControl.java:442)
[junit4:junit4]   2> 		at com.carrotsearch.randomizedtesting.RandomizedRunner.runSingleTest(RandomizedRunner.java:746)
[junit4:junit4]   2> 		at com.carrotsearch.randomizedtesting.RandomizedRunner$3.evaluate(RandomizedRunner.java:648)
[junit4:junit4]   2> 		at com.carrotsearch.randomizedtesting.RandomizedRunner$4.evaluate(RandomizedRunner.java:682)
[junit4:junit4]   2> 		at com.carrotsearch.randomizedtesting.RandomizedRunner$5.evaluate(RandomizedRunner.java:693)
[junit4:junit4]   2> 		at com.carrotsearch.randomizedtesting.rules.StatementAdapter.evaluate(StatementAdapter.java:36)
[junit4:junit4]   2> 		at com.carrotsearch.randomizedtesting.rules.SystemPropertiesRestoreRule$1.evaluate(SystemPropertiesRestoreRule.java:53)
[junit4:junit4]   2> 		at org.apache.lucene.util.AbstractBeforeAfterRule$1.evaluate(AbstractBeforeAfterRule.java:45)
[junit4:junit4]   2> 		at org.apache.lucene.util.TestRuleStoreClassName$1.evaluate(TestRuleStoreClassName.java:42)
[junit4:junit4]   2> 		at com.carrotsearch.randomizedtesting.rules.SystemPropertiesInvariantRule$1.evaluate(SystemPropertiesInvariantRule.java:55)
[junit4:junit4]   2> 		at com.carrotsearch.randomizedtesting.rules.NoShadowingOrOverridesOnMethodsRule$1.evaluate(NoShadowingOrOverridesOnMethodsRule.java:39)
[junit4:junit4]   2> 		at com.carrotsearch.randomizedtesting.rules.NoShadowingOrOverridesOnMethodsRule$1.evaluate(NoShadowingOrOverridesOnMethodsRule.java:39)
[junit4:junit4]   2> 		at com.carrotsearch.randomizedtesting.rules.StatementAdapter.evaluate(StatementAdapter.java:36)
[junit4:junit4]   2> 		at org.apache.lucene.util.TestRuleAssertionsRequired$1.evaluate(TestRuleAssertionsRequired.java:43)
[junit4:junit4]   2> 		at org.apache.lucene.util.TestRuleMarkFailure$1.evaluate(TestRuleMarkFailure.java:48)
[junit4:junit4]   2> 		at org.apache.lucene.util.TestRuleIgnoreAfterMaxFailures$1.evaluate(TestRuleIgnoreAfterMaxFailures.java:70)
[junit4:junit4]   2> 		at org.apache.lucene.util.TestRuleIgnoreTestSuites$1.evaluate(TestRuleIgnoreTestSuites.java:55)
[junit4:junit4]   2> 		at com.carrotsearch.randomizedtesting.rules.StatementAdapter.evaluate(StatementAdapter.java:36)
[junit4:junit4]   2> 		at com.carrotsearch.randomizedtesting.ThreadLeakControl$StatementRunner.run(ThreadLeakControl.java:358)
[junit4:junit4]   2> 		at java.lang.Thread.run(Thread.java:722)
[junit4:junit4]   2> 	
[junit4:junit4]   2> 429 T502 oas.SolrTestCaseJ4.tearDown ###Ending testRebuild
[junit4:junit4]   2> NOTE: reproduce with: ant test  -Dtestcase=SuggesterFSTTest -Dtests.method=testRebuild -Dtests.seed=945474DAE7684ED5 -Dtests.slow=true -Dtests.locale=nl_BE -Dtests.timezone=US/Aleutian -Dtests.file.encoding=ISO-8859-1
[junit4:junit4] ERROR   0.14s | SuggesterFSTTest.testRebuild <<<
[junit4:junit4]    > Throwable #1: java.lang.RuntimeException: Exception during query
[junit4:junit4]    > 	at __randomizedtesting.SeedInfo.seed([945474DAE7684ED5:CF71D699D368344F]:0)
[junit4:junit4]    > 	at org.apache.solr.SolrTestCaseJ4.assertQ(SolrTestCaseJ4.java:503)
[junit4:junit4]    > 	at org.apache.solr.SolrTestCaseJ4.assertQ(SolrTestCaseJ4.java:470)
[junit4:junit4]    > 	at org.apache.solr.spelling.suggest.SuggesterTest.testRebuild(SuggesterTest.java:105)
[junit4:junit4]    > 	at sun.reflect.NativeMethodAccessorImpl.invoke0(Native Method)
[junit4:junit4]    > 	at sun.reflect.NativeMethodAccessorImpl.invoke(NativeMethodAccessorImpl.java:57)
[junit4:junit4]    > 	at sun.reflect.DelegatingMethodAccessorImpl.invoke(DelegatingMethodAccessorImpl.java:43)
[junit4:junit4]    > 	at java.lang.reflect.Method.invoke(Method.java:601)
[junit4:junit4]    > 	at com.carrotsearch.randomizedtesting.RandomizedRunner.invoke(RandomizedRunner.java:1559)
[junit4:junit4]    > 	at com.carrotsearch.randomizedtesting.RandomizedRunner.access$600(RandomizedRunner.java:79)
[junit4:junit4]    > 	at com.carrotsearch.randomizedtesting.RandomizedRunner$6.evaluate(RandomizedRunner.java:737)
[junit4:junit4]    > 	at com.carrotsearch.randomizedtesting.RandomizedRunner$7.evaluate(RandomizedRunner.java:773)
[junit4:junit4]    > 	at com.carrotsearch.randomizedtesting.RandomizedRunner$8.evaluate(RandomizedRunner.java:787)
[junit4:junit4]    > 	at com.carrotsearch.randomizedtesting.rules.SystemPropertiesRestoreRule$1.evaluate(SystemPropertiesRestoreRule.java:53)
[junit4:junit4]    > 	at org.apache.lucene.util.TestRuleSetupTeardownChained$1.evaluate(TestRuleSetupTeardownChained.java:50)
[junit4:junit4]    > 	at org.apache.lucene.util.TestRuleFieldCacheSanity$1.evaluate(TestRuleFieldCacheSanity.java:51)
[junit4:junit4]    > 	at org.apache.lucene.util.AbstractBeforeAfterRule$1.evaluate(AbstractBeforeAfterRule.java:45)
[junit4:junit4]    > 	at com.carrotsearch.randomizedtesting.rules.SystemPropertiesInvariantRule$1.evaluate(SystemPropertiesInvariantRule.java:55)
[junit4:junit4]    > 	at org.apache.lucene.util.TestRuleThreadAndTestName$1.evaluate(TestRuleThreadAndTestName.java:48)
[junit4:junit4]    > 	at org.apache.lucene.util.TestRuleIgnoreAfterMaxFailures$1.evaluate(TestRuleIgnoreAfterMaxFailures.java:70)
[junit4:junit4]    > 	at org.apache.lucene.util.TestRuleMarkFailure$1.evaluate(TestRuleMarkFailure.java:48)
[junit4:junit4]    > 	at com.carrotsearch.randomizedtesting.rules.StatementAdapter.evaluate(StatementAdapter.java:36)
[junit4:junit4]    > 	at com.carrotsearch.randomizedtesting.ThreadLeakControl$StatementRunner.run(ThreadLeakControl.java:358)
[junit4:junit4]    > 	at com.carrotsearch.randomizedtesting.ThreadLeakControl.forkTimeoutingTask(ThreadLeakControl.java:782)
[junit4:junit4]    > 	at com.carrotsearch.randomizedtesting.ThreadLeakControl$3.evaluate(ThreadLeakControl.java:442)
[junit4:junit4]    > 	at com.carrotsearch.randomizedtesting.RandomizedRunner.runSingleTest(RandomizedRunner.java:746)
[junit4:junit4]    > 	at com.carrotsearch.randomizedtesting.RandomizedRunner$3.evaluate(RandomizedRunner.java:648)
[junit4:junit4]    > 	at com.carrotsearch.randomizedtesting.RandomizedRunner$4.evaluate(RandomizedRunner.java:682)
[junit4:junit4]    > 	at com.carrotsearch.randomizedtesting.RandomizedRunner$5.evaluate(RandomizedRunner.java:693)
[junit4:junit4]    > 	at com.carrotsearch.randomizedtesting.rules.StatementAdapter.evaluate(StatementAdapter.java:36)
[junit4:junit4]    > 	at com.carrotsearch.randomizedtesting.rules.SystemPropertiesRestoreRule$1.evaluate(SystemPropertiesRestoreRule.java:53)
[junit4:junit4]    > 	at org.apache.lucene.util.AbstractBeforeAfterRule$1.evaluate(AbstractBeforeAfterRule.java:45)
[junit4:junit4]    > 	at org.apache.lucene.util.TestRuleStoreClassName$1.evaluate(TestRuleStoreClassName.java:42)
[junit4:junit4]    > 	at com.carrotsearch.randomizedtesting.rules.SystemPropertiesInvariantRule$1.evaluate(SystemPropertiesInvariantRule.java:55)
[junit4:junit4]    > 	at com.carrotsearch.randomizedtesting.rules.NoShadowingOrOverridesOnMethodsRule$1.evaluate(NoShadowingOrOverridesOnMethodsRule.java:39)
[junit4:junit4]    > 	at com.carrotsearch.randomizedtesting.rules.NoShadowingOrOverridesOnMethodsRule$1.evaluate(NoShadowingOrOverridesOnMethodsRule.java:39)
[junit4:junit4]    > 	at com.carrotsearch.randomizedtesting.rules.StatementAdapter.evaluate(StatementAdapter.java:36)
[junit4:junit4]    > 	at org.apache.lucene.util.TestRuleAssertionsRequired$1.evaluate(TestRuleAssertionsRequired.java:43)
[junit4:junit4]    > 	at org.apache.lucene.util.TestRuleMarkFailure$1.evaluate(TestRuleMarkFailure.java:48)
[junit4:junit4]    > 	at org.apache.lucene.util.TestRuleIgnoreAfterMaxFailures$1.evaluate(TestRuleIgnoreAfterMaxFailures.java:70)
[junit4:junit4]    > 	at org.apache.lucene.util.TestRuleIgnoreTestSuites$1.evaluate(TestRuleIgnoreTestSuites.java:55)
[junit4:junit4]    > 	at com.carrotsearch.randomizedtesting.rules.StatementAdapter.evaluate(StatementAdapter.java:36)
[junit4:junit4]    > 	at com.carrotsearch.randomizedtesting.ThreadLeakControl$StatementRunner.run(ThreadLeakControl.java:358)
[junit4:junit4]    > 	at java.lang.Thread.run(Thread.java:722)
[junit4:junit4]    > Caused by: java.lang.NullPointerException
[junit4:junit4]    > 	at org.apache.lucene.search.suggest.fst.FSTCompletionLookup.lookup(FSTCompletionLookup.java:237)
[junit4:junit4]    > 	at org.apache.solr.spelling.suggest.Suggester.getSuggestions(Suggester.java:190)
[junit4:junit4]    > 	at org.apache.solr.handler.component.SpellCheckComponent.process(SpellCheckComponent.java:172)
[junit4:junit4]    > 	at org.apache.solr.handler.component.SearchHandler.handleRequestBody(SearchHandler.java:206)
[junit4:junit4]    > 	at org.apache.solr.handler.RequestHandlerBase.handleRequest(RequestHandlerBase.java:129)
[junit4:junit4]    > 	at org.apache.solr.core.SolrCore.execute(SolrCore.java:1701)
[junit4:junit4]    > 	at org.apache.solr.util.TestHarness.query(TestHarness.java:364)
[junit4:junit4]    > 	at org.apache.solr.util.TestHarness.query(TestHarness.java:346)
[junit4:junit4]    > 	at org.apache.solr.SolrTestCaseJ4.assertQ(SolrTestCaseJ4.java:477)
[junit4:junit4]    > 	... 42 more
[junit4:junit4]   2> 455 T502 oas.SolrTestCaseJ4.setUp ###Starting testSuggestions
[junit4:junit4]   2> 461 T502 C38 UPDATE [collection1] webapp=null path=null params={} {add=[1]} 0 2
[junit4:junit4]   2> 467 T502 C38 UPDATE [collection1] webapp=null path=null params={} {add=[2]} 0 1
[junit4:junit4]   2> 474 T502 C38 UPDATE [collection1] webapp=null path=null params={} {add=[3]} 0 1
[junit4:junit4]   2> 480 T502 C38 oasu.DirectUpdateHandler2.commit start commit{flags=0,_version_=0,optimize=false,openSearcher=true,waitSearcher=true,expungeDeletes=false,softCommit=false}
[junit4:junit4]   2> 503 T502 C38 oasc.SolrDeletionPolicy.onCommit SolrDeletionPolicy.onCommit: commits:num=2
[junit4:junit4]   2> 		commit{dir=MockDirWrapper(org.apache.lucene.store.NIOFSDirectory@C:\Jenkins\workspace\Lucene-Solr-4.x-Windows\solr\build\solr-core\test\J0\solrtest-SuggesterFSTTest-1347715916822\index lockFactory=org.apache.lucene.store.NativeFSLockFactory@39a0e),segFN=segments_2,generation=2,filenames=[_0.fnm, _0.frq, _0.tim, _0_nrm.cfe, segments_2, _0.fdx, _0_nrm.cfs, _0.si, _0.prx, _0.tip, _0.fdt]
[junit4:junit4]   2> 		commit{dir=MockDirWrapper(org.apache.lucene.store.NIOFSDirectory@C:\Jenkins\workspace\Lucene-Solr-4.x-Windows\solr\build\solr-core\test\J0\solrtest-SuggesterFSTTest-1347715916822\index lockFactory=org.apache.lucene.store.NativeFSLockFactory@39a0e),segFN=segments_3,generation=3,filenames=[_1.fdx, _1.prx, _1_nrm.cfs, _1.frq, _1.fdt, _1.si, _1.tip, _1.fnm, _1.tim, segments_3, _1_nrm.cfe]
[junit4:junit4]   2> 503 T502 C38 oasc.SolrDeletionPolicy.updateCommits newest commit = 3
[junit4:junit4]   2> 519 T502 C38 oass.SolrIndexSearcher.<init> Opening Searcher@c3a09a main
[junit4:junit4]   2> 519 T502 C38 oass.SolrIndexSearcher.getIndexDir WARNING WARNING: Directory impl does not support setting indexDir: org.apache.lucene.store.MockDirectoryWrapper
[junit4:junit4]   2> 520 T503 oashc.SpellCheckComponent$SpellCheckerListener.buildSpellIndex Building spell index for spell checker: suggest
[junit4:junit4]   2> 520 T502 C38 oasu.DirectUpdateHandler2.commit end_commit_flush
[junit4:junit4]   2> 520 T503 oasss.Suggester.build build()
[junit4:junit4]   2> 524 T503 oasss.Suggester.build Stored suggest data to: C:\Jenkins\workspace\Lucene-Solr-4.x-Windows\solr\build\solr-core\test\J0\.\solrtest-SuggesterFSTTest-1347715916822\suggest\jaspell.dat
[junit4:junit4]   2> 525 T503 oashc.SpellCheckComponent$SpellCheckerListener.buildSpellIndex Building spell index for spell checker: suggest_tst
[junit4:junit4]   2> 525 T503 oasss.Suggester.build build()
[junit4:junit4]   2> 538 T503 oasss.Suggester.build Stored suggest data to: C:\Jenkins\workspace\Lucene-Solr-4.x-Windows\solr\build\solr-core\test\J0\.\solrtest-SuggesterFSTTest-1347715916822\suggest_tst\tst.dat
[junit4:junit4]   2> 538 T503 oashc.SpellCheckComponent$SpellCheckerListener.buildSpellIndex Building spell index for spell checker: suggest_fst
[junit4:junit4]   2> 538 T503 oasss.Suggester.build build()
[junit4:junit4]   2> 566 T503 oasss.Suggester.build Stored suggest data to: C:\Jenkins\workspace\Lucene-Solr-4.x-Windows\solr\build\solr-core\test\J0\.\solrtest-SuggesterFSTTest-1347715916822\suggest_fst\fst.bin
[junit4:junit4]   2> 566 T503 oashc.SpellCheckComponent$SpellCheckerListener.buildSpellIndex Building spell index for spell checker: suggest_wfst
[junit4:junit4]   2> 566 T503 oasss.Suggester.build build()
[junit4:junit4]   2> 579 T503 oasss.Suggester.build Stored suggest data to: C:\Jenkins\workspace\Lucene-Solr-4.x-Windows\solr\build\solr-core\test\J0\.\solrtest-SuggesterFSTTest-1347715916822\suggest_wfst\wfst.bin
[junit4:junit4]   2> 579 T503 oasc.SolrCore.registerSearcher [collection1] Registered new searcher Searcher@c3a09a main{StandardDirectoryReader(segments_3:7 _1(4.0.0.2):C3)}
[junit4:junit4]   2> 580 T502 C38 UPDATE [collection1] webapp=null path=null params={} {commit=} 0 100
[junit4:junit4]   2> 589 T502 C38 REQ [collection1] webapp=null path=null params={q=ac&spellcheck.count=2&qt=/suggest_fst&spellcheck.onlyMorePopular=true} status=0 QTime=5 
[junit4:junit4]   2> 593 T502 oas.SolrTestCaseJ4.tearDown ###Ending testSuggestions
[junit4:junit4]   2> 597 T502 oas.SolrTestCaseJ4.setUp ###Starting testAnalyzer
[junit4:junit4]   2> 597 T502 oasss.Suggester.init init: {lookupImpl=org.apache.solr.spelling.suggest.tst.TSTLookupFactory}
[junit4:junit4]   2> 597 T502 oas.SolrTestCaseJ4.tearDown ###Ending testAnalyzer
[junit4:junit4]   2> 602 T502 oas.SolrTestCaseJ4.setUp ###Starting testReload
[junit4:junit4]   2> 608 T502 C38 UPDATE [collection1] webapp=null path=null params={} {add=[1]} 0 3
[junit4:junit4]   2> 615 T502 C38 UPDATE [collection1] webapp=null path=null params={} {add=[2]} 0 1
[junit4:junit4]   2> 621 T502 C38 UPDATE [collection1] webapp=null path=null params={} {add=[3]} 0 0
[junit4:junit4]   2> 631 T502 C38 oasu.DirectUpdateHandler2.commit start commit{flags=0,_version_=0,optimize=false,openSearcher=true,waitSearcher=true,expungeDeletes=false,softCommit=false}
[junit4:junit4]   2> 662 T502 C38 oasc.SolrDeletionPolicy.onCommit SolrDeletionPolicy.onCommit: commits:num=2
[junit4:junit4]   2> 		commit{dir=MockDirWrapper(org.apache.lucene.store.NIOFSDirectory@C:\Jenkins\workspace\Lucene-Solr-4.x-Windows\solr\build\solr-core\test\J0\solrtest-SuggesterFSTTest-1347715916822\index lockFactory=org.apache.lucene.store.NativeFSLockFactory@39a0e),segFN=segments_3,generation=3,filenames=[_1.fdx, _1.prx, _1_nrm.cfs, _1.frq, _1.fdt, _1.si, _1.tip, _1.fnm, _1.tim, segments_3, _1_nrm.cfe]
[junit4:junit4]   2> 		commit{dir=MockDirWrapper(org.apache.lucene.store.NIOFSDirectory@C:\Jenkins\workspace\Lucene-Solr-4.x-Windows\solr\build\solr-core\test\J0\solrtest-SuggesterFSTTest-1347715916822\index lockFactory=org.apache.lucene.store.NativeFSLockFactory@39a0e),segFN=segments_4,generation=4,filenames=[_2.si, _2.tip, _2_nrm.cfe, _2.prx, _2.fdt, _2.frq, _2_nrm.cfs, _2.fdx, _2.tim, _2.fnm, segments_4]
[junit4:junit4]   2> 662 T502 C38 oasc.SolrDeletionPolicy.updateCommits newest commit = 4
[junit4:junit4]   2> 679 T502 C38 oass.SolrIndexSearcher.<init> Opening Searcher@1b36d38 main
[junit4:junit4]   2> 679 T502 C38 oass.SolrIndexSearcher.getIndexDir WARNING WARNING: Directory impl does not support setting indexDir: org.apache.lucene.store.MockDirectoryWrapper
[junit4:junit4]   2> 680 T503 oashc.SpellCheckComponent$SpellCheckerListener.buildSpellIndex Building spell index for spell checker: suggest
[junit4:junit4]   2> 680 T502 C38 oasu.DirectUpdateHandler2.commit end_commit_flush
[junit4:junit4]   2> 680 T503 oasss.Suggester.build build()
[junit4:junit4]   2> 684 T503 oasss.Suggester.build Stored suggest data to: C:\Jenkins\workspace\Lucene-Solr-4.x-Windows\solr\build\solr-core\test\J0\.\solrtest-SuggesterFSTTest-1347715916822\suggest\jaspell.dat
[junit4:junit4]   2> 684 T503 oashc.SpellCheckComponent$SpellCheckerListener.buildSpellIndex Building spell index for spell checker: suggest_tst
[junit4:junit4]   2> 684 T503 oasss.Suggester.build build()
[junit4:junit4]   2> 697 T503 oasss.Suggester.build Stored suggest data to: C:\Jenkins\workspace\Lucene-Solr-4.x-Windows\solr\build\solr-core\test\J0\.\solrtest-SuggesterFSTTest-1347715916822\suggest_tst\tst.dat
[junit4:junit4]   2> 697 T503 oashc.SpellCheckComponent$SpellCheckerListener.buildSpellIndex Building spell index for spell checker: suggest_fst
[junit4:junit4]   2> 697 T503 oasss.Suggester.build build()
[junit4:junit4]   2> 715 T503 oasss.Suggester.build Stored suggest data to: C:\Jenkins\workspace\Lucene-Solr-4.x-Windows\solr\build\solr-core\test\J0\.\solrtest-SuggesterFSTTest-1347715916822\suggest_fst\fst.bin
[junit4:junit4]   2> 716 T503 oashc.SpellCheckComponent$SpellCheckerListener.buildSpellIndex Building spell index for spell checker: suggest_wfst
[junit4:junit4]   2> 716 T503 oasss.Suggester.build build()
[junit4:junit4]   2> 726 T503 oasss.Suggester.build Stored suggest data to: C:\Jenkins\workspace\Lucene-Solr-4.x-Windows\solr\build\solr-core\test\J0\.\solrtest-SuggesterFSTTest-1347715916822\suggest_wfst\wfst.bin
[junit4:junit4]   2> 726 T503 oasc.SolrCore.registerSearcher [collection1] Registered new searcher Searcher@1b36d38 main{StandardDirectoryReader(segments_4:11 _2(4.0.0.2):C3)}
[junit4:junit4]   2> 727 T502 C38 UPDATE [collection1] webapp=null path=null params={} {commit=} 0 97
[junit4:junit4]   2> 732 T502 oas.SolrTestCaseJ4.deleteCore ###deleteCore
[junit4:junit4]   2> 732 T502 oasc.CoreContainer.shutdown Shutting down CoreContainer instance=29386128
[junit4:junit4]   2> 732 T502 oasc.SolrCore.close [collection1]  CLOSING SolrCore org.apache.solr.core.SolrCore@156d768
[junit4:junit4]   2> 733 T502 oasc.SolrCore.closeSearcher [collection1] Closing main searcher on request.
[junit4:junit4]   2> 733 T502 oasu.DirectUpdateHandler2.close closing DirectUpdateHandler2{commits=3,autocommits=0,soft autocommits=0,optimizes=0,rollbacks=0,expungeDeletes=0,docsPending=0,adds=0,deletesById=0,deletesByQuery=0,errors=0,cumulative_adds=9,cumulative_deletesById=0,cumulative_deletesByQuery=0,cumulative_errors=0}
[junit4:junit4]   2> 734 T502 oasu.DefaultSolrCoreState.decref SolrCoreState ref count has reached 0 - closing IndexWriter
[junit4:junit4]   2> 748 T502 oasu.DefaultSolrCoreState.decref Closing SolrCoreState - canceling any ongoing recovery
[junit4:junit4]   2> NOTE: per solr.test.leavedatadir, dataDir will not be removed: C:\Jenkins\workspace\Lucene-Solr-4.x-Windows\solr\build\solr-core\test\J0\.\solrtest-SuggesterFSTTest-1347715916822
[junit4:junit4]   2> 749 T502 oas.SolrTestCaseJ4.initCore ####initCore
[junit4:junit4]   2> 749 T502 oasc.SolrResourceLoader.<init> new SolrResourceLoader for directory: 'C:\Jenkins\workspace\Lucene-Solr-4.x-Windows\solr\build\solr-core\test-files\solr\collection1\'
[junit4:junit4]   2> 751 T502 oasc.SolrResourceLoader.replaceClassLoader Adding 'file:/C:/Jenkins/workspace/Lucene-Solr-4.x-Windows/solr/build/solr-core/test-files/solr/collection1/lib/classes/' to classloader
[junit4:junit4]   2> 753 T502 oasc.SolrResourceLoader.replaceClassLoader Adding 'file:/C:/Jenkins/workspace/Lucene-Solr-4.x-Windows/solr/build/solr-core/test-files/solr/collection1/lib/README' to classloader
[junit4:junit4]   2> 822 T502 oasc.SolrConfig.<init> Using Lucene MatchVersion: LUCENE_40
[junit4:junit4]   2> 889 T502 oasc.SolrConfig.<init> Loaded SolrConfig: solrconfig-spellchecker.xml
[junit4:junit4]   2> 890 T502 oass.IndexSchema.readSchema Reading Solr Schema
[junit4:junit4]   2> 896 T502 oass.IndexSchema.readSchema Schema name=test
[junit4:junit4]   2> 1579 T502 oass.OpenExchangeRatesOrgProvider.init Initialized with rates=open-exchange-rates.json, refreshInterval=1440.
[junit4:junit4]   2> 1593 T502 oass.IndexSchema.readSchema default search field in schema is text
[junit4:junit4]   2> 1597 T502 oass.IndexSchema.readSchema unique key field: id
[junit4:junit4]   2> 1606 T502 oass.FileExchangeRateProvider.reload Reloading exchange rates from file currency.xml
[junit4:junit4]   2> 1613 T502 oass.FileExchangeRateProvider.reload Reloading exchange rates from file currency.xml
[junit4:junit4]   2> 1619 T502 oass.OpenExchangeRatesOrgProvider.reload Reloading exchange rates from open-exchange-rates.json
[junit4:junit4]   2> 1620 T502 oass.OpenExchangeRatesOrgProvider.reload Reloading exchange rates from open-exchange-rates.json
[junit4:junit4]   2> 1621 T502 oasc.SolrResourceLoader.locateSolrHome JNDI not configured for solr (NoInitialContextEx)
[junit4:junit4]   2> 1621 T502 oasc.SolrResourceLoader.locateSolrHome using system property solr.solr.home: C:\Jenkins\workspace\Lucene-Solr-4.x-Windows\solr\build\solr-core\test-files\solr
[junit4:junit4]   2> 1621 T502 oasc.SolrResourceLoader.<init> new SolrResourceLoader for directory: 'C:\Jenkins\workspace\Lucene-Solr-4.x-Windows\solr\build\solr-core\test-files\solr\'
[junit4:junit4]   2> 1635 T502 oasc.CoreContainer.<init> New CoreContainer 3588572
[junit4:junit4]   2> 1635 T502 oasc.SolrCore.<init> [collection1] Opening new SolrCore at C:\Jenkins\workspace\Lucene-Solr-4.x-Windows\solr\build\solr-core\test-files\solr\collection1\, dataDir=C:\Jenkins\workspace\Lucene-Solr-4.x-Windows\solr\build\solr-core\test\J0\.\solrtest-SuggesterFSTTest-1347715916822\
[junit4:junit4]   2> 1636 T502 oasc.SolrCore.<init> JMX monitoring not detected for core: collection1
[junit4:junit4]   2> 1637 T502 oasc.SolrCore.getNewIndexDir WARNING New index directory detected: old=null new=C:\Jenkins\workspace\Lucene-Solr-4.x-Windows\solr\build\solr-core\test\J0\.\solrtest-SuggesterFSTTest-1347715916822\index/
[junit4:junit4]   2> 1639 T502 oasc.RequestHandlers.initHandlersFromConfig created standard: solr.StandardRequestHandler
[junit4:junit4]   2> 1640 T502 oasc.RequestHandlers.initHandlersFromConfig created /suggest: org.apache.solr.handler.component.SearchHandler
[junit4:junit4]   2> 1640 T502 oasc.RequestHandlers.initHandlersFromConfig created /suggest_tst: org.apache.solr.handler.component.SearchHandler
[junit4:junit4]   2> 1640 T502 oasc.RequestHandlers.initHandlersFromConfig created /suggest_fst: org.apache.solr.handler.component.SearchHandler
[junit4:junit4]   2> 1641 T502 oasc.RequestHandlers.initHandlersFromConfig created /suggest_wfst: org.apache.solr.handler.component.SearchHandler
[junit4:junit4]   2> 1644 T502 oasc.CachingDirectoryFactory.get return new directory for C:\Jenkins\workspace\Lucene-Solr-4.x-Windows\solr\build\solr-core\test\J0\.\solrtest-SuggesterFSTTest-1347715916822\index forceNew:false
[junit4:junit4]   2> 1649 T502 oass.SolrIndexSearcher.<init> Opening Searcher@11c3da6 main
[junit4:junit4]   2> 1650 T502 oass.SolrIndexSearcher.getIndexDir WARNING WARNING: Directory impl does not support setting indexDir: org.apache.lucene.store.MockDirectoryWrapper
[junit4:junit4]   2> 1650 T502 oasu.CommitTracker.<init> Hard AutoCommit: disabled
[junit4:junit4]   2> 1650 T502 oasu.CommitTracker.<init> Soft AutoCommit: disabled
[junit4:junit4]   2> 1651 T502 oashc.SpellCheckComponent.inform Initializing spell checkers
[junit4:junit4]   2> 1651 T502 oasss.Suggester.init init: {name=suggest,classname=org.apache.solr.spelling.suggest.Suggester,lookupImpl=org.apache.solr.spelling.suggest.jaspell.JaspellLookup,field=suggest,storeDir=suggest,buildOnCommit=true,threshold=0.0}
[junit4:junit4]   2> 1652 T502 oasssj.JaspellLookupFactory.create init: {name=suggest,classname=org.apache.solr.spelling.suggest.Suggester,lookupImpl=org.apache.solr.spelling.suggest.jaspell.JaspellLookup,field=suggest,storeDir=suggest,buildOnCommit=true,threshold=0.0}
[junit4:junit4]   2> 1654 T502 oashc.SpellCheckComponent.inform Registering newSearcher listener for spellchecker: suggest
[junit4:junit4]   2> 1656 T502 oashc.SpellCheckComponent.inform No queryConverter defined, using default converter
[junit4:junit4]   2> 1656 T502 oashc.SpellCheckComponent.inform Initializing spell checkers
[junit4:junit4]   2> 1656 T502 oasss.Suggester.init init: {name=suggest_tst,classname=org.apache.solr.spelling.suggest.Suggester,lookupImpl=org.apache.solr.spelling.suggest.tst.TSTLookup,field=suggest,storeDir=suggest_tst,buildOnCommit=true,threshold=0.0}
[junit4:junit4]   2> 1659 T502 oashc.SpellCheckComponent.inform Registering newSearcher listener for spellchecker: suggest_tst
[junit4:junit4]   2> 1659 T502 oashc.SpellCheckComponent.inform No queryConverter defined, using default converter
[junit4:junit4]   2> 1660 T502 oashc.SpellCheckComponent.inform Initializing spell checkers
[junit4:junit4]   2> 1660 T502 oasss.Suggester.init init: {name=suggest_fst,classname=org.apache.solr.spelling.suggest.Suggester,lookupImpl=org.apache.solr.spelling.suggest.fst.FSTLookup,field=suggest,storeDir=suggest_fst,buildOnCommit=true,weightBuckets=5,exactMatchFirst=true}
[junit4:junit4]   2> 1662 T502 oashc.SpellCheckComponent.inform Registering newSearcher listener for spellchecker: suggest_fst
[junit4:junit4]   2> 1663 T502 oashc.SpellCheckComponent.inform No queryConverter defined, using default converter
[junit4:junit4]   2> 1663 T502 oashc.SpellCheckComponent.inform Initializing spell checkers
[junit4:junit4]   2> 1664 T502 oasss.Suggester.init init: {name=suggest_wfst,classname=org.apache.solr.spelling.suggest.Suggester,lookupImpl=org.apache.solr.spelling.suggest.fst.WFSTLookupFactory,field=suggest,storeDir=suggest_wfst,buildOnCommit=true,exactMatchFirst=true}
[junit4:junit4]   2> 1666 T502 oashc.SpellCheckComponent.inform Registering newSearcher listener for spellchecker: suggest_wfst
[junit4:junit4]   2> 1666 T502 oashc.SpellCheckComponent.inform No queryConverter defined, using default converter
[junit4:junit4]   2> 1667 T502 oashc.HttpShardHandlerFactory.getParameter Setting socketTimeout to: 0
[junit4:junit4]   2> 1667 T502 oashc.HttpShardHandlerFactory.getParameter Setting urlScheme to: http://
[junit4:junit4]   2> 1667 T502 oashc.HttpShardHandlerFactory.getParameter Setting connTimeout to: 0
[junit4:junit4]   2> 1668 T502 oashc.HttpShardHandlerFactory.getParameter Setting maxConnectionsPerHost to: 20
[junit4:junit4]   2> 1668 T502 oashc.HttpShardHandlerFactory.getParameter Setting corePoolSize to: 0
[junit4:junit4]   2> 1668 T502 oashc.HttpShardHandlerFactory.getParameter Setting maximumPoolSize to: 2147483647
[junit4:junit4]   2> 1669 T502 oashc.HttpShardHandlerFactory.getParameter Setting maxThreadIdleTime to: 5
[junit4:junit4]   2> 1669 T502 oashc.HttpShardHandlerFactory.getParameter Setting sizeOfQueue to: -1
[junit4:junit4]   2> 1669 T502 oashc.HttpShardHandlerFactory.getParameter Setting fairnessPolicy to: false
[junit4:junit4]   2> 1669 T502 oascsi.HttpClientUtil.createClient Creating new http client, config:maxConnectionsPerHost=20&maxConnections=10000&socketTimeout=0&connTimeout=0&retry=false
[junit4:junit4]   2> 1683 T504 oasc.SolrCore.registerSearcher [collection1] Registered new searcher Searcher@11c3da6 main{StandardDirectoryReader(segments_4:11 _2(4.0.0.2):C3)}
[junit4:junit4]   2> 1683 T502 oasc.CoreContainer.register registering core: collection1
[junit4:junit4]   2> 1686 T502 oas.SolrTestCaseJ4.initCore ####initCore end
[junit4:junit4]   2> ASYNC  NEW_CORE C39 name=collection1 org.apache.solr.core.SolrCore@339299
[junit4:junit4]   2> 1687 T502 C39 REQ [collection1] webapp=null path=null params={q=ac&spellcheck.count=2&qt=/suggest_fst&spellcheck.onlyMorePopular=true} status=0 QTime=0 
[junit4:junit4]   2> 1695 T502 oas.SolrTestCaseJ4.tearDown ###Ending testReload
[junit4:junit4]   2> 1697 T502 oas.SolrTestCaseJ4.deleteCore ###deleteCore
[junit4:junit4]   2> 1697 T502 oasc.CoreContainer.shutdown Shutting down CoreContainer instance=3588572
[junit4:junit4]   2> 1697 T502 oasc.SolrCore.close [collection1]  CLOSING SolrCore org.apache.solr.core.SolrCore@339299
[junit4:junit4]   2> 1698 T502 oasc.SolrCore.closeSearcher [collection1] Closing main searcher on request.
[junit4:junit4]   2> 1699 T502 oasu.DirectUpdateHandler2.close closing DirectUpdateHandler2{commits=0,autocommits=0,soft autocommits=0,optimizes=0,rollbacks=0,expungeDeletes=0,docsPending=0,adds=0,deletesById=0,deletesByQuery=0,errors=0,cumulative_adds=0,cumulative_deletesById=0,cumulative_deletesByQuery=0,cumulative_errors=0}
[junit4:junit4]   2> 1699 T502 oasu.DefaultSolrCoreState.decref SolrCoreState ref count has reached 0 - closing IndexWriter
[junit4:junit4]   2> 1708 T502 oasu.DefaultSolrCoreState.decref Closing SolrCoreState - canceling any ongoing recovery
[junit4:junit4]   2> NOTE: test params are: codec=Appending, sim=RandomSimilarityProvider(queryNorm=true,coord=crazy): {}, locale=nl_BE, timezone=US/Aleutian
[junit4:junit4]   2> NOTE: Windows 7 6.1 x86/Oracle Corporation 1.7.0_07 (32-bit)/cpus=2,threads=1,free=25501504,total=62504960
[junit4:junit4]   2> NOTE: All tests run in this JVM: [URLClassifyProcessorTest, TestBadConfig, TestSuggestSpellingConverter, OutputWriterTest, TestCollationKeyRangeQueries, XsltUpdateRequestHandlerTest, TestRemoteStreaming, JSONWriterTest, SolrPluginUtilsTest, QueryElevationComponentTest, HighlighterConfigTest, StatelessScriptUpdateProcessorFactoryTest, CurrencyFieldTest, IndexBasedSpellCheckerTest, TestDefaultSimilarityFactory, SuggesterTest, BasicZkTest, NoCacheHeaderTest, TestDocSet, TestSolrCoreProperties, ScriptEngineTest, DistributedQueryElevationComponentTest, MinimalSchemaTest, TestFaceting, SOLR749Test, SolrRequestParserTest, SpatialFilterTest, ZkCLITest, SolrIndexConfigTest, TestIBSimilarityFactory, TestFastOutputStream, TestElisionMultitermQuery, UUIDFieldTest, NumericFieldsTest, SyncSliceTest, TestStressVersions, RequestHandlersTest, SuggesterFSTTest]
[junit4:junit4] Completed in 1.78s, 4 tests, 1 error <<< FAILURES!

[...truncated 250 lines...]
[junit4:junit4] Suite: org.apache.solr.cloud.LeaderElectionIntegrationTest
[junit4:junit4]   2> 3 T2693 oas.SolrTestCaseJ4.setUp ###Starting testLeaderElectionAfterClientTimeout
[junit4:junit4]   2> Creating dataDir: C:\Jenkins\workspace\Lucene-Solr-4.x-Windows\solr\build\solr-core\test\J0\.\solrtest-LeaderElectionIntegrationTest-1347716675264
[junit4:junit4]   2> 8 T2693 oasc.ZkTestServer.run STARTING ZK TEST SERVER
[junit4:junit4]   2> 16 T2694 oazs.ZooKeeperServer.setTickTime tickTime set to 1000
[junit4:junit4]   2> 19 T2694 oazs.NIOServerCnxn$Factory.<init> binding to port 0.0.0.0/0.0.0.0:0
[junit4:junit4]   2> 20 T2694 oazsp.FileTxnSnapLog.save Snapshotting: 0
[junit4:junit4]   2> 148 T2693 oasc.ZkTestServer.run start zk server on port:63273
[junit4:junit4]   2> 148 T2693 oaz.ZooKeeper.<init> Initiating client connection, connectString=127.0.0.1:63273 sessionTimeout=10000 watcher=org.apache.solr.common.cloud.ConnectionManager@159b885
[junit4:junit4]   2> 149 T2693 oascc.ConnectionManager.waitForConnected Waiting for client to connect to ZooKeeper
[junit4:junit4]   2> 149 T2699 oaz.ClientCnxn$SendThread.startConnect Opening socket connection to server /127.0.0.1:63273
[junit4:junit4]   2> 152 T2699 oaz.ClientCnxn$SendThread.primeConnection Socket connection established to 127.0.0.1/127.0.0.1:63273, initiating session
[junit4:junit4]   2> 152 T2695 oazs.NIOServerCnxn$Factory.run Accepted socket connection from /127.0.0.1:63276
[junit4:junit4]   2> 152 T2695 oazs.NIOServerCnxn.readConnectRequest Client attempting to establish new session at /127.0.0.1:63276
[junit4:junit4]   2> 153 T2697 oazsp.FileTxnLog.append Creating new log file: log.1
[junit4:junit4]   2> 161 T2697 oazs.NIOServerCnxn.finishSessionInit Established session 0x139ca2c76d40000 with negotiated timeout 10000 for client /127.0.0.1:63276
[junit4:junit4]   2> 161 T2699 oaz.ClientCnxn$SendThread.readConnectResult Session establishment complete on server 127.0.0.1/127.0.0.1:63273, sessionid = 0x139ca2c76d40000, negotiated timeout = 10000
[junit4:junit4]   2> 161 T2700 oascc.ConnectionManager.process Watcher org.apache.solr.common.cloud.ConnectionManager@159b885 name:ZooKeeperConnection Watcher:127.0.0.1:63273 got event WatchedEvent state:SyncConnected type:None path:null path:null type:None
[junit4:junit4]   2> 163 T2693 oascc.ConnectionManager.waitForConnected Client is connected to ZooKeeper
[junit4:junit4]   2> 163 T2693 oascc.SolrZkClient.makePath makePath: /solr
[junit4:junit4]   2> 168 T2698 oazs.PrepRequestProcessor.pRequest Processed session termination for sessionid: 0x139ca2c76d40000
[junit4:junit4]   2> 172 T2693 oaz.ZooKeeper.close Session: 0x139ca2c76d40000 closed
[junit4:junit4]   2> 172 T2695 oazs.NIOServerCnxn.doIO WARNING EndOfStreamException: Unable to read additional data from client sessionid 0x139ca2c76d40000, likely client has closed socket
[junit4:junit4]   2> 172 T2693 oaz.ZooKeeper.<init> Initiating client connection, connectString=127.0.0.1:63273/solr sessionTimeout=10000 watcher=org.apache.solr.common.cloud.ConnectionManager@17f3c8a
[junit4:junit4]   2> 174 T2700 oaz.ClientCnxn$EventThread.run EventThread shut down
[junit4:junit4]   2> 175 T2695 oazs.NIOServerCnxn.closeSock Closed socket connection for client /127.0.0.1:63276 which had sessionid 0x139ca2c76d40000
[junit4:junit4]   2> 176 T2701 oaz.ClientCnxn$SendThread.startConnect Opening socket connection to server /127.0.0.1:63273
[junit4:junit4]   2> 178 T2693 oascc.ConnectionManager.waitForConnected Waiting for client to connect to ZooKeeper
[junit4:junit4]   2> 179 T2701 oaz.ClientCnxn$SendThread.primeConnection Socket connection established to 127.0.0.1/127.0.0.1:63273, initiating session
[junit4:junit4]   2> 180 T2695 oazs.NIOServerCnxn$Factory.run Accepted socket connection from /127.0.0.1:63279
[junit4:junit4]   2> 180 T2695 oazs.NIOServerCnxn.readConnectRequest Client attempting to establish new session at /127.0.0.1:63279
[junit4:junit4]   2> 184 T2697 oazs.NIOServerCnxn.finishSessionInit Established session 0x139ca2c76d40001 with negotiated timeout 10000 for client /127.0.0.1:63279
[junit4:junit4]   2> 184 T2701 oaz.ClientCnxn$SendThread.readConnectResult Session establishment complete on server 127.0.0.1/127.0.0.1:63273, sessionid = 0x139ca2c76d40001, negotiated timeout = 10000
[junit4:junit4]   2> 186 T2702 oascc.ConnectionManager.process Watcher org.apache.solr.common.cloud.ConnectionManager@17f3c8a name:ZooKeeperConnection Watcher:127.0.0.1:63273/solr got event WatchedEvent state:SyncConnected type:None path:null path:null type:None
[junit4:junit4]   2> 186 T2693 oascc.ConnectionManager.waitForConnected Client is connected to ZooKeeper
[junit4:junit4]   2> 186 T2693 oascc.SolrZkClient.makePath makePath: /collections/collection1
[junit4:junit4]   2> 192 T2693 oascc.SolrZkClient.makePath makePath: /collections/collection1/shards
[junit4:junit4]   2> 196 T2693 oascc.SolrZkClient.makePath makePath: /collections/control_collection
[junit4:junit4]   2> 201 T2693 oascc.SolrZkClient.makePath makePath: /collections/control_collection/shards
[junit4:junit4]   2> 206 T2693 oasc.AbstractZkTestCase.putConfig put C:\Jenkins\workspace\Lucene-Solr-4.x-Windows\solr\build\solr-core\test-files\solr\collection1\conf\solrconfig.xml to /configs/conf1/solrconfig.xml
[junit4:junit4]   2> 207 T2693 oascc.SolrZkClient.makePath makePath: /configs/conf1/solrconfig.xml
[junit4:junit4]   2> 217 T2693 oasc.AbstractZkTestCase.putConfig put C:\Jenkins\workspace\Lucene-Solr-4.x-Windows\solr\build\solr-core\test-files\solr\collection1\conf\schema.xml to /configs/conf1/schema.xml
[junit4:junit4]   2> 218 T2693 oascc.SolrZkClient.makePath makePath: /configs/conf1/schema.xml
[junit4:junit4]   2> 225 T2693 oasc.AbstractZkTestCase.putConfig put C:\Jenkins\workspace\Lucene-Solr-4.x-Windows\solr\build\solr-core\test-files\solr\collection1\conf\solrconfig.xml to /configs/conf1/solrconfig.xml
[junit4:junit4]   2> 225 T2693 oascc.SolrZkClient.makePath makePath: /configs/conf1/solrconfig.xml
[junit4:junit4]   2> 230 T2693 oasc.AbstractZkTestCase.putConfig put C:\Jenkins\workspace\Lucene-Solr-4.x-Windows\solr\build\solr-core\test-files\solr\collection1\conf\stopwords.txt to /configs/conf1/stopwords.txt
[junit4:junit4]   2> 231 T2693 oascc.SolrZkClient.makePath makePath: /configs/conf1/stopwords.txt
[junit4:junit4]   2> 236 T2693 oasc.AbstractZkTestCase.putConfig put C:\Jenkins\workspace\Lucene-Solr-4.x-Windows\solr\build\solr-core\test-files\solr\collection1\conf\protwords.txt to /configs/conf1/protwords.txt
[junit4:junit4]   2> 237 T2693 oascc.SolrZkClient.makePath makePath: /configs/conf1/protwords.txt
[junit4:junit4]   2> 241 T2693 oasc.AbstractZkTestCase.putConfig put C:\Jenkins\workspace\Lucene-Solr-4.x-Windows\solr\build\solr-core\test-files\solr\collection1\conf\currency.xml to /configs/conf1/currency.xml
[junit4:junit4]   2> 242 T2693 oascc.SolrZkClient.makePath makePath: /configs/conf1/currency.xml
[junit4:junit4]   2> 253 T2693 oasc.AbstractZkTestCase.putConfig put C:\Jenkins\workspace\Lucene-Solr-4.x-Windows\solr\build\solr-core\test-files\solr\collection1\conf\open-exchange-rates.json to /configs/conf1/open-exchange-rates.json
[junit4:junit4]   2> 253 T2693 oascc.SolrZkClient.makePath makePath: /configs/conf1/open-exchange-rates.json
[junit4:junit4]   2> 260 T2693 oasc.AbstractZkTestCase.putConfig put C:\Jenkins\workspace\Lucene-Solr-4.x-Windows\solr\build\solr-core\test-files\solr\collection1\conf\mapping-ISOLatin1Accent.txt to /configs/conf1/mapping-ISOLatin1Accent.txt
[junit4:junit4]   2> 260 T2693 oascc.SolrZkClient.makePath makePath: /configs/conf1/mapping-ISOLatin1Accent.txt
[junit4:junit4]   2> 265 T2693 oasc.AbstractZkTestCase.putConfig put C:\Jenkins\workspace\Lucene-Solr-4.x-Windows\solr\build\solr-core\test-files\solr\collection1\conf\old_synonyms.txt to /configs/conf1/old_synonyms.txt
[junit4:junit4]   2> 265 T2693 oascc.SolrZkClient.makePath makePath: /configs/conf1/old_synonyms.txt
[junit4:junit4]   2> 271 T2693 oasc.AbstractZkTestCase.putConfig put C:\Jenkins\workspace\Lucene-Solr-4.x-Windows\solr\build\solr-core\test-files\solr\collection1\conf\synonyms.txt to /configs/conf1/synonyms.txt
[junit4:junit4]   2> 271 T2693 oascc.SolrZkClient.makePath makePath: /configs/conf1/synonyms.txt
[junit4:junit4]   2> 277 T2698 oazs.PrepRequestProcessor.pRequest Processed session termination for sessionid: 0x139ca2c76d40001
[junit4:junit4]   2> 279 T2693 oaz.ZooKeeper.close Session: 0x139ca2c76d40001 closed
[junit4:junit4]   2> 279 T2695 oazs.NIOServerCnxn.doIO WARNING EndOfStreamException: Unable to read additional data from client sessionid 0x139ca2c76d40001, likely client has closed socket
[junit4:junit4]   2> 279 T2693 oasc.LeaderElectionIntegrationTest.setUp ####SETUP_START testLeaderElectionAfterClientTimeout
[junit4:junit4]   2> 279 T2695 oazs.NIOServerCnxn.closeSock Closed socket connection for client /127.0.0.1:63279 which had sessionid 0x139ca2c76d40001
[junit4:junit4]   2> 280 T2702 oaz.ClientCnxn$EventThread.run EventThread shut down
[junit4:junit4]   2> 284 T2693 oasc.SolrResourceLoader.locateSolrHome JNDI not configured for solr (NoInitialContextEx)
[junit4:junit4]   2> 284 T2693 oasc.SolrResourceLoader.locateSolrHome using system property solr.solr.home: C:\Jenkins\workspace\Lucene-Solr-4.x-Windows\solr\build\solr-core\test-files\solr
[junit4:junit4]   2> 284 T2693 oasc.CoreContainer$Initializer.initialize looking for solr.xml: C:\Jenkins\workspace\Lucene-Solr-4.x-Windows\solr\build\solr-core\test-files\solr\solr.xml
[junit4:junit4]   2> 285 T2693 oasc.CoreContainer.<init> New CoreContainer 28560557
[junit4:junit4]   2> 285 T2693 oasc.CoreContainer.load Loading CoreContainer using Solr Home: 'C:\Jenkins\workspace\Lucene-Solr-4.x-Windows\solr\build\solr-core\test-files\solr\'
[junit4:junit4]   2> 287 T2693 oasc.SolrResourceLoader.<init> new SolrResourceLoader for directory: 'C:\Jenkins\workspace\Lucene-Solr-4.x-Windows\solr\build\solr-core\test-files\solr\'
[junit4:junit4]   2> 354 T2693 oasc.CoreContainer.load Registering Log Listener
[junit4:junit4]   2> 382 T2693 oasc.CoreContainer.initZooKeeper Zookeeper client=127.0.0.1:63273/solr
[junit4:junit4]   2> 382 T2693 oaz.ZooKeeper.<init> Initiating client connection, connectString=127.0.0.1:63273/solr sessionTimeout=3000 watcher=org.apache.solr.common.cloud.ConnectionManager@1b8c0e8
[junit4:junit4]   2> 385 T2703 oaz.ClientCnxn$SendThread.startConnect Opening socket connection to server /127.0.0.1:63273
[junit4:junit4]   2> 385 T2693 oascc.ConnectionManager.waitForConnected Waiting for client to connect to ZooKeeper
[junit4:junit4]   2> 386 T2703 oaz.ClientCnxn$SendThread.primeConnection Socket connection established to 127.0.0.1/127.0.0.1:63273, initiating session
[junit4:junit4]   2> 386 T2695 oazs.NIOServerCnxn$Factory.run Accepted socket connection from /127.0.0.1:63282
[junit4:junit4]   2> 388 T2695 oazs.NIOServerCnxn.readConnectRequest Client attempting to establish new session at /127.0.0.1:63282
[junit4:junit4]   2> 390 T2697 oazs.NIOServerCnxn.finishSessionInit Established session 0x139ca2c76d40002 with negotiated timeout 3000 for client /127.0.0.1:63282
[junit4:junit4]   2> 390 T2703 oaz.ClientCnxn$SendThread.readConnectResult Session establishment complete on server 127.0.0.1/127.0.0.1:63273, sessionid = 0x139ca2c76d40002, negotiated timeout = 3000
[junit4:junit4]   2> 390 T2704 oascc.ConnectionManager.process Watcher org.apache.solr.common.cloud.ConnectionManager@1b8c0e8 name:ZooKeeperConnection Watcher:127.0.0.1:63273/solr got event WatchedEvent state:SyncConnected type:None path:null path:null type:None
[junit4:junit4]   2> 392 T2693 oascc.ConnectionManager.waitForConnected Client is connected to ZooKeeper
[junit4:junit4]   2> 394 T2698 oazs.PrepRequestProcessor.pRequest Got user-level KeeperException when processing sessionid:0x139ca2c76d40002 type:create cxid:0x2 zxid:0xfffffffffffffffe txntype:unknown reqpath:n/a Error Path:/solr/overseer Error:KeeperErrorCode = NodeExists for /solr/overseer
[junit4:junit4]   2> 397 T2693 oascc.SolrZkClient.makePath makePath: /live_nodes
[junit4:junit4]   2> 404 T2693 oasc.ZkController.createEphemeralLiveNode Register node as live in ZooKeeper:/live_nodes/127.0.0.1:7000_solr
[junit4:junit4]   2> 404 T2698 oazs.PrepRequestProcessor.pRequest Got user-level KeeperException when processing sessionid:0x139ca2c76d40002 type:delete cxid:0x7 zxid:0xfffffffffffffffe txntype:unknown reqpath:n/a Error Path:/solr/live_nodes/127.0.0.1:7000_solr Error:KeeperErrorCode = NoNode for /solr/live_nodes/127.0.0.1:7000_solr
[junit4:junit4]   2> 406 T2693 oascc.SolrZkClient.makePath makePath: /live_nodes/127.0.0.1:7000_solr
[junit4:junit4]   2> 413 T2693 oashc.HttpShardHandlerFactory.getParameter Setting socketTimeout to: 0
[junit4:junit4]   2> 413 T2693 oashc.HttpShardHandlerFactory.getParameter Setting urlScheme to: http://
[junit4:junit4]   2> 413 T2693 oashc.HttpShardHandlerFactory.getParameter Setting connTimeout to: 0
[junit4:junit4]   2> 413 T2693 oashc.HttpShardHandlerFactory.getParameter Setting maxConnectionsPerHost to: 20
[junit4:junit4]   2> 415 T2693 oashc.HttpShardHandlerFactory.getParameter Setting corePoolSize to: 0
[junit4:junit4]   2> 415 T2693 oashc.HttpShardHandlerFactory.getParameter Setting maximumPoolSize to: 2147483647
[junit4:junit4]   2> 415 T2693 oashc.HttpShardHandlerFactory.getParameter Setting maxThreadIdleTime to: 5
[junit4:junit4]   2> 417 T2693 oashc.HttpShardHandlerFactory.getParameter Setting sizeOfQueue to: -1
[junit4:junit4]   2> 417 T2693 oashc.HttpShardHandlerFactory.getParameter Setting fairnessPolicy to: false
[junit4:junit4]   2> 417 T2693 oascsi.HttpClientUtil.createClient Creating new http client, config:maxConnectionsPerHost=20&maxConnections=10000&socketTimeout=0&connTimeout=0&retry=false
[junit4:junit4]   2> 432 T2693 oascc.SolrZkClient.makePath makePath: /overseer_elect/election
[junit4:junit4]   2> 443 T2698 oazs.PrepRequestProcessor.pRequest Got user-level KeeperException when processing sessionid:0x139ca2c76d40002 type:delete cxid:0x15 zxid:0xfffffffffffffffe txntype:unknown reqpath:n/a Error Path:/solr/overseer_elect/leader Error:KeeperErrorCode = NoNode for /solr/overseer_elect/leader
[junit4:junit4]   2> 445 T2693 oascc.SolrZkClient.makePath makePath: /overseer_elect/leader
[junit4:junit4]   2> 450 T2693 oasc.Overseer.start Overseer (id=88323960031412226-127.0.0.1:7000_solr-n_0000000000) starting
[junit4:junit4]   2> 451 T2698 oazs.PrepRequestProcessor.pRequest Got user-level KeeperException when processing sessionid:0x139ca2c76d40002 type:create cxid:0x1a zxid:0xfffffffffffffffe txntype:unknown reqpath:n/a Error Path:/solr/overseer Error:KeeperErrorCode = NodeExists for /solr/overseer
[junit4:junit4]   2> 452 T2698 oazs.PrepRequestProcessor.pRequest Got user-level KeeperException when processing sessionid:0x139ca2c76d40002 type:create cxid:0x1b zxid:0xfffffffffffffffe txntype:unknown reqpath:n/a Error Path:/solr/overseer Error:KeeperErrorCode = NodeExists for /solr/overseer
[junit4:junit4]   2> 455 T2698 oazs.PrepRequestProcessor.pRequest Got user-level KeeperException when processing sessionid:0x139ca2c76d40002 type:create cxid:0x1c zxid:0xfffffffffffffffe txntype:unknown reqpath:n/a Error Path:/solr/overseer Error:KeeperErrorCode = NodeExists for /solr/overseer
[junit4:junit4]   2> 458 T2698 oazs.PrepRequestProcessor.pRequest Got user-level KeeperException when processing sessionid:0x139ca2c76d40002 type:create cxid:0x1d zxid:0xfffffffffffffffe txntype:unknown reqpath:n/a Error Path:/solr/overseer Error:KeeperErrorCode = NodeExists for /solr/overseer
[junit4:junit4]   2> 460 T2706 oasc.OverseerCollectionProcessor.run Process current queue of collection creations
[junit4:junit4]   2> 460 T2693 oascc.SolrZkClient.makePath makePath: /clusterstate.json
[junit4:junit4]   2> 466 T2693 oascc.ZkStateReader.createClusterStateWatchersAndUpdate Updating cluster state from ZooKeeper... 
[junit4:junit4]   2> 470 T2705 oasc.Overseer$ClusterStateUpdater.run Starting to work on the main queue
[junit4:junit4]   2> 475 T2693 oasc.CoreContainer.create Creating SolrCore 'collection1' using instanceDir: C:\Jenkins\workspace\Lucene-Solr-4.x-Windows\solr\build\solr-core\test-files\solr\collection1
[junit4:junit4]   2> 475 T2693 oasc.ZkController.createCollectionZkNode Check for collection zkNode:collection1
[junit4:junit4]   2> 476 T2693 oasc.ZkController.createCollectionZkNode Collection zkNode exists
[junit4:junit4]   2> 476 T2693 oasc.ZkController.readConfigName Load collection config from:/collections/collection1
[junit4:junit4]   2> 479 T2693 oasc.SolrResourceLoader.<init> new SolrResourceLoader for directory: 'C:\Jenkins\workspace\Lucene-Solr-4.x-Windows\solr\build\solr-core\test-files\solr\collection1\'
[junit4:junit4]   2> 482 T2693 oasc.SolrResourceLoader.replaceClassLoader Adding 'file:/C:/Jenkins/workspace/Lucene-Solr-4.x-Windows/solr/build/solr-core/test-files/solr/collection1/lib/classes/' to classloader
[junit4:junit4]   2> 483 T2693 oasc.SolrResourceLoader.replaceClassLoader Adding 'file:/C:/Jenkins/workspace/Lucene-Solr-4.x-Windows/solr/build/solr-core/test-files/solr/collection1/lib/README' to classloader
[junit4:junit4]   2> 559 T2693 oasc.SolrConfig.<init> Using Lucene MatchVersion: LUCENE_40
[junit4:junit4]   2> 664 T2693 oasc.SolrConfig.<init> Loaded SolrConfig: solrconfig.xml
[junit4:junit4]   2> 669 T2693 oass.IndexSchema.readSchema Reading Solr Schema
[junit4:junit4]   2> 677 T2693 oass.IndexSchema.readSchema Schema name=test
[junit4:junit4]   2> 1618 T2693 oass.OpenExchangeRatesOrgProvider.init Initialized with rates=open-exchange-rates.json, refreshInterval=1440.
[junit4:junit4]   2> 1631 T2693 oass.IndexSchema.readSchema default search field in schema is text
[junit4:junit4]   2> 1638 T2693 oass.IndexSchema.readSchema unique key field: id
[junit4:junit4]   2> 1658 T2693 oass.FileExchangeRateProvider.reload Reloading exchange rates from file currency.xml
[junit4:junit4]   2> 1664 T2693 oass.FileExchangeRateProvider.reload Reloading exchange rates from file currency.xml
[junit4:junit4]   2> 1670 T2693 oass.OpenExchangeRatesOrgProvider.reload Reloading exchange rates from open-exchange-rates.json
[junit4:junit4]   2> 1673 T2693 oass.OpenExchangeRatesOrgProvider.reload Reloading exchange rates from open-exchange-rates.json
[junit4:junit4]   2> 1674 T2693 oasc.SolrCore.<init> [collection1] Opening new SolrCore at C:\Jenkins\workspace\Lucene-Solr-4.x-Windows\solr\build\solr-core\test-files\solr\collection1\, dataDir=C:\Jenkins\workspace\Lucene-Solr-4.x-Windows\solr\build\solr-core\test\J0\.\solrtest-LeaderElectionIntegrationTest-1347716675264\data_7000\
[junit4:junit4]   2> 1674 T2693 oasc.JmxMonitoredMap.<init> JMX monitoring is enabled. Adding Solr mbeans to JMX Server: com.sun.jmx.mbeanserver.JmxMBeanServer@ecb7a4
[junit4:junit4]   2> 1677 T2693 oasc.SolrCore.getNewIndexDir WARNING New index directory detected: old=null new=C:\Jenkins\workspace\Lucene-Solr-4.x-Windows\solr\build\solr-core\test\J0\.\solrtest-LeaderElectionIntegrationTest-1347716675264\data_7000\index/
[junit4:junit4]   2> 1679 T2693 oasc.SolrCore.initIndex WARNING [collection1] Solr index directory 'C:\Jenkins\workspace\Lucene-Solr-4.x-Windows\solr\build\solr-core\test\J0\.\solrtest-LeaderElectionIntegrationTest-1347716675264\data_7000\index' doesn't exist. Creating new index...
[junit4:junit4]   2> 1680 T2693 oasc.CachingDirectoryFactory.get return new directory for C:\Jenkins\workspace\Lucene-Solr-4.x-Windows\solr\build\solr-core\test\J0\.\solrtest-LeaderElectionIntegrationTest-1347716675264\data_7000\index forceNew:false
[junit4:junit4]   2> 1683 T2693 oasc.SolrDeletionPolicy.onCommit SolrDeletionPolicy.onCommit: commits:num=1
[junit4:junit4]   2> 		commit{dir=MockDirWrapper(org.apache.lucene.store.RAMDirectory@92a2f5 lockFactory=org.apache.lucene.store.NativeFSLockFactory@1d7676e),segFN=segments_1,generation=1,filenames=[segments_1]
[junit4:junit4]   2> 1683 T2693 oasc.SolrDeletionPolicy.updateCommits newest commit = 1
[junit4:junit4]   2> 1685 T2693 oasc.SolrCore.initWriters created xml: solr.XMLResponseWriter
[junit4:junit4]   2> 1687 T2693 oasup.UpdateRequestProcessorChain.init inserting DistributedUpdateProcessorFactory into updateRequestProcessorChain "dedupe"
[junit4:junit4]   2> 1688 T2693 oasup.UpdateRequestProcessorChain.init inserting DistributedUpdateProcessorFactory into updateRequestProcessorChain "dedupe-allfields"
[junit4:junit4]   2> 1688 T2693 oasup.UpdateRequestProcessorChain.init inserting DistributedUpdateProcessorFactory into updateRequestProcessorChain "stored_sig"
[junit4:junit4]   2> 1689 T2693 oasup.UpdateRequestProcessorChain.init inserting DistributedUpdateProcessorFactory into updateRequestProcessorChain "uniq-fields"
[junit4:junit4]   2> 1689 T2693 oasup.UpdateRequestProcessorChain.init inserting DistributedUpdateProcessorFactory into updateRequestProcessorChain "distrib-dup-test-chain-implicit"
[junit4:junit4]   2> 1689 T2693 oasc.RequestHandlers.initHandlersFromConfig adding lazy requestHandler: solr.ReplicationHandler
[junit4:junit4]   2> 1691 T2693 oasc.RequestHandlers.initHandlersFromConfig created /replication: solr.ReplicationHandler
[junit4:junit4]   2> 1692 T2693 oasc.RequestHandlers.initHandlersFromConfig created standard: solr.StandardRequestHandler
[junit4:junit4]   2> 1692 T2693 oasc.RequestHandlers.initHandlersFromConfig created /get: solr.RealTimeGetHandler
[junit4:junit4]   2> 1693 T2693 oasc.RequestHandlers.initHandlersFromConfig created dismax: solr.SearchHandler
[junit4:junit4]   2> 1693 T2693 oasc.RequestHandlers.initHandlersFromConfig created mock: org.apache.solr.core.MockQuerySenderListenerReqHandler
[junit4:junit4]   2> 1693 T2693 oasc.RequestHandlers.initHandlersFromConfig created /admin/: org.apache.solr.handler.admin.AdminHandlers
[junit4:junit4]   2> 1695 T2693 oasc.RequestHandlers.initHandlersFromConfig created defaults: solr.StandardRequestHandler
[junit4:junit4]   2> 1695 T2693 oasc.RequestHandlers.initHandlersFromConfig adding lazy requestHandler: solr.StandardRequestHandler
[junit4:junit4]   2> 1695 T2693 oasc.RequestHandlers.initHandlersFromConfig created lazy: solr.StandardRequestHandler
[junit4:junit4]   2> 1696 T2693 oasc.RequestHandlers.initHandlersFromConfig created /update: solr.UpdateRequestHandler
[junit4:junit4]   2> 1696 T2693 oasc.RequestHandlers.initHandlersFromConfig created /terms: org.apache.solr.handler.component.SearchHandler
[junit4:junit4]   2> 1696 T2693 oasc.RequestHandlers.initHandlersFromConfig created spellCheckCompRH: org.apache.solr.handler.component.SearchHandler
[junit4:junit4]   2> 1696 T2693 oasc.RequestHandlers.initHandlersFromConfig created spellCheckCompRH_Direct: org.apache.solr.handler.component.SearchHandler
[junit4:junit4]   2> 1697 T2693 oasc.RequestHandlers.initHandlersFromConfig created spellCheckWithWordbreak: org.apache.solr.handler.component.SearchHandler
[junit4:junit4]   2> 1697 T2693 oasc.RequestHandlers.initHandlersFromConfig created spellCheckWithWordbreak_Direct: org.apache.solr.handler.component.SearchHandler
[junit4:junit4]   2> 1699 T2693 oasc.RequestHandlers.initHandlersFromConfig created spellCheckCompRH1: org.apache.solr.handler.component.SearchHandler
[junit4:junit4]   2> 1700 T2693 oasc.RequestHandlers.initHandlersFromConfig created tvrh: org.apache.solr.handler.component.SearchHandler
[junit4:junit4]   2> 1700 T2693 oasc.RequestHandlers.initHandlersFromConfig created /mlt: solr.MoreLikeThisHandler
[junit4:junit4]   2> 1701 T2693 oasc.RequestHandlers.initHandlersFromConfig created /debug/dump: solr.DumpRequestHandler
[junit4:junit4]   2> 1707 T2693 oashl.XMLLoader.init xsltCacheLifetimeSeconds=60
[junit4:junit4]   2> 1714 T2693 oasc.SolrCore.initDeprecatedSupport WARNING solrconfig.xml uses deprecated <admin/gettableFiles>, Please update your config to use the ShowFileRequestHandler.
[junit4:junit4]   2> 1715 T2693 oasc.SolrCore.initDeprecatedSupport WARNING adding ShowFileRequestHandler with hidden files: [SCHEMA.XML, OLD_SYNONYMS.TXT, STOPWORDS.TXT, PROTWORDS.TXT, OPEN-EXCHANGE-RATES.JSON, SYNONYMS.TXT, CURRENCY.XML, MAPPING-ISOLATIN1ACCENT.TXT]
[junit4:junit4]   2> 1719 T2693 oass.SolrIndexSearcher.<init> Opening Searcher@15af531 main
[junit4:junit4]   2> 1720 T2693 oass.SolrIndexSearcher.getIndexDir WARNING WARNING: Directory impl does not support setting indexDir: org.apache.lucene.store.MockDirectoryWrapper
[junit4:junit4]   2> 1720 T2693 oasu.CommitTracker.<init> Hard AutoCommit: disabled
[junit4:junit4]   2> 1722 T2693 oasu.CommitTracker.<init> Soft AutoCommit: disabled
[junit4:junit4]   2> 1722 T2693 oashc.SpellCheckComponent.inform Initializing spell checkers
[junit4:junit4]   2> 1736 T2693 oass.DirectSolrSpellChecker.init init: {name=direct,classname=DirectSolrSpellChecker,field=lowerfilt,minQueryLength=3}
[junit4:junit4]   2> 1821 T2707 oasc.SolrCore.registerSearcher [collection1] Registered new searcher Searcher@15af531 main{StandardDirectoryReader(segments_1:1)}
[junit4:junit4]   2> 1827 T2698 oazs.PrepRequestProcessor.pRequest Got user-level KeeperException when processing sessionid:0x139ca2c76d40002 type:create cxid:0x53 zxid:0xfffffffffffffffe txntype:unknown reqpath:n/a Error Path:/solr/overseer/queue Error:KeeperErrorCode = NoNode for /solr/overseer/queue
[junit4:junit4]   2> 1833 T2693 oasc.CoreContainer.register registering core: collection1
[junit4:junit4]   2> 1835 T2693 oasc.ZkController.register Register shard - core:collection1 address:http://127.0.0.1:7000/solr shardId:shard1
[junit4:junit4]   2> 1836 T2693 oascc.SolrZkClient.makePath makePath: /collections/collection1/leader_elect/shard1/election
[junit4:junit4]   2> 1851 T2698 oazs.PrepRequestProcessor.pRequest Got user-level KeeperException when processing sessionid:0x139ca2c76d40002 type:delete cxid:0x62 zxid:0xfffffffffffffffe txntype:unknown reqpath:n/a Error Path:/solr/collections/collection1/leaders Error:KeeperErrorCode = NoNode for /solr/collections/collection1/leaders
[junit4:junit4]   2> 1854 T2693 oasc.ShardLeaderElectionContext.runLeaderProcess Running the leader process.
[junit4:junit4]   2> 1855 T2698 oazs.PrepRequestProcessor.pRequest Got user-level KeeperException when processing sessionid:0x139ca2c76d40002 type:create cxid:0x64 zxid:0xfffffffffffffffe txntype:unknown reqpath:n/a Error Path:/solr/overseer Error:KeeperErrorCode = NodeExists for /solr/overseer
[junit4:junit4]   2> 1860 T2705 oascc.ZkStateReader.updateClusterState Updating cloud state from ZooKeeper... 
[junit4:junit4]   2> 1862 T2698 oazs.PrepRequestProcessor.pRequest Got user-level KeeperException when processing sessionid:0x139ca2c76d40002 type:create cxid:0x6a zxid:0xfffffffffffffffe txntype:unknown reqpath:n/a Error Path:/solr/overseer/queue-work Error:KeeperErrorCode = NoNode for /solr/overseer/queue-work
[junit4:junit4]   2> 1882 T2704 oascc.ZkStateReader$2.process A cluster state change has occurred - updating...
[junit4:junit4]   2> 2549 T2693 oasc.ShardLeaderElectionContext.waitForReplicasToComeUp Enough replicas found to continue.
[junit4:junit4]   2> 2551 T2693 oasc.ShardLeaderElectionContext.runLeaderProcess I may be the new leader - try and sync
[junit4:junit4]   2> 2552 T2693 oasc.ShardLeaderElectionContext.runLeaderProcess I am the new leader: http://127.0.0.1:7000/solr/collection1/
[junit4:junit4]   2> 2552 T2693 oascc.SolrZkClient.makePath makePath: /collections/collection1/leaders/shard1
[junit4:junit4]   2> 2570 T2698 oazs.PrepRequestProcessor.pRequest Got user-level KeeperException when processing sessionid:0x139ca2c76d40002 type:create cxid:0x88 zxid:0xfffffffffffffffe txntype:unknown reqpath:n/a Error Path:/solr/overseer Error:KeeperErrorCode = NodeExists for /solr/overseer
[junit4:junit4]   2> 2586 T2705 oascc.ZkStateReader.updateClusterState Updating cloud state from ZooKeeper... 
[junit4:junit4]   2> 2606 T2704 oascc.ZkStateReader$2.process A cluster state change has occurred - updating...
[junit4:junit4]   2> 2650 T2693 oasc.ZkController.register We are http://127.0.0.1:7000/solr/collection1/ and leader is http://127.0.0.1:7000/solr/collection1/
[junit4:junit4]   2> 2650 T2693 oasc.ZkController.checkRecovery WARNING Skipping recovery according to sys prop solrcloud.skip.autorecovery
[junit4:junit4]   2> 2658 T2693 oascc.ZkStateReader.updateClusterState Updating cloud state from ZooKeeper... 
[junit4:junit4]   2> 2671 T2693 oasc.SolrResourceLoader.locateSolrHome JNDI not configured for solr (NoInitialContextEx)
[junit4:junit4]   2> 2672 T2693 oasc.SolrResourceLoader.locateSolrHome using system property solr.solr.home: C:\Jenkins\workspace\Lucene-Solr-4.x-Windows\solr\build\solr-core\test-files\solr
[junit4:junit4]   2> 2673 T2693 oasc.CoreContainer$Initializer.initialize looking for solr.xml: C:\Jenkins\workspace\Lucene-Solr-4.x-Windows\solr\build\solr-core\test-files\solr\solr.xml
[junit4:junit4]   2> 2675 T2693 oasc.CoreContainer.<init> New CoreContainer 12810959
[junit4:junit4]   2> 2676 T2693 oasc.CoreContainer.load Loading CoreContainer using Solr Home: 'C:\Jenkins\workspace\Lucene-Solr-4.x-Windows\solr\build\solr-core\test-files\solr\'
[junit4:junit4]   2> 2676 T2693 oasc.SolrResourceLoader.<init> new SolrResourceLoader for directory: 'C:\Jenkins\workspace\Lucene-Solr-4.x-Windows\solr\build\solr-core\test-files\solr\'
[junit4:junit4]   2> 2759 T2693 oasc.CoreContainer.load Registering Log Listener
[junit4:junit4]   2> 2801 T2693 oasc.CoreContainer.initZooKeeper Zookeeper client=127.0.0.1:63273/solr
[junit4:junit4]   2> 2803 T2693 oaz.ZooKeeper.<init> Initiating client connection, connectString=127.0.0.1:63273/solr sessionTimeout=3000 watcher=org.apache.solr.common.cloud.ConnectionManager@125bf2d
[junit4:junit4]   2> 2808 T2708 oaz.ClientCnxn$SendThread.startConnect Opening socket connection to server /127.0.0.1:63273
[junit4:junit4]   2> 2808 T2693 oascc.ConnectionManager.waitForConnected Waiting for client to connect to ZooKeeper
[junit4:junit4]   2> 2811 T2708 oaz.ClientCnxn$SendThread.primeConnection Socket connection established to 127.0.0.1/127.0.0.1:63273, initiating session
[junit4:junit4]   2> 2811 T2695 oazs.NIOServerCnxn$Factory.run Accepted socket connection from /127.0.0.1:63285
[junit4:junit4]   2> 2811 T2695 oazs.NIOServerCnxn.readConnectRequest Client attempting to establish new session at /127.0.0.1:63285
[junit4:junit4]   2> 2816 T2697 oazs.NIOServerCnxn.finishSessionInit Established session 0x139ca2c76d40003 with negotiated timeout 3000 for client /127.0.0.1:63285
[junit4:junit4]   2> 2816 T2708 oaz.ClientCnxn$SendThread.readConnectResult Session establishment complete on server 127.0.0.1/127.0.0.1:63273, sessionid = 0x139ca2c76d40003, negotiated timeout = 3000
[junit4:junit4]   2> 2817 T2709 oascc.ConnectionManager.process Watcher org.apache.solr.common.cloud.ConnectionManager@125bf2d name:ZooKeeperConnection Watcher:127.0.0.1:63273/solr got event WatchedEvent state:SyncConnected type:None path:null path:null type:None
[junit4:junit4]   2> 2817 T2693 oascc.ConnectionManager.waitForConnected Client is connected to ZooKeeper
[junit4:junit4]   2> 2819 T2698 oazs.PrepRequestProcessor.pRequest Got user-level KeeperException when processing sessionid:0x139ca2c76d40003 type:create cxid:0x1 zxid:0xfffffffffffffffe txntype:unknown reqpath:n/a Error Path:/solr/overseer Error:KeeperErrorCode = NodeExists for /solr/overseer
[junit4:junit4]   2> 2821 T2698 oazs.PrepRequestProcessor.pRequest Got user-level KeeperException when processing sessionid:0x139ca2c76d40003 type:create cxid:0x2 zxid:0xfffffffffffffffe txntype:unknown reqpath:n/a Error Path:/solr/overseer Error:KeeperErrorCode = NodeExists for /solr/overseer
[junit4:junit4]   2> 2824 T2693 oasc.ZkController.createEphemeralLiveNode Register node as live in ZooKeeper:/live_nodes/127.0.0.1:7001_solr
[junit4:junit4]   2> 2824 T2698 oazs.PrepRequestProcessor.pRequest Got user-level KeeperException when processing sessionid:0x139ca2c76d40003 type:delete cxid:0x4 zxid:0xfffffffffffffffe txntype:unknown reqpath:n/a Error Path:/solr/live_nodes/127.0.0.1:7001_solr Error:KeeperErrorCode = NoNode for /solr/live_nodes/127.0.0.1:7001_solr
[junit4:junit4]   2> 2827 T2693 oascc.SolrZkClient.makePath makePath: /live_nodes/127.0.0.1:7001_solr
[junit4:junit4]   2> 2831 T2704 oascc.ZkStateReader$3.process Updating live nodes
[junit4:junit4]   2> 2833 T2693 oashc.HttpShardHandlerFactory.getParameter Setting socketTimeout to: 0
[junit4:junit4]   2> 2833 T2693 oashc.HttpShardHandlerFactory.getParameter Setting urlScheme to: http://
[junit4:junit4]   2> 2833 T2693 oashc.HttpShardHandlerFactory.getParameter Setting connTimeout to: 0
[junit4:junit4]   2> 2833 T2693 oashc.HttpShardHandlerFactory.getParameter Setting maxConnectionsPerHost to: 20
[junit4:junit4]   2> 2835 T2693 oashc.HttpShardHandlerFactory.getParameter Setting corePoolSize to: 0
[junit4:junit4]   2> 2835 T2693 oashc.HttpShardHandlerFactory.getParameter Setting maximumPoolSize to: 2147483647
[junit4:junit4]   2> 2835 T2693 oashc.HttpShardHandlerFactory.getParameter Setting maxThreadIdleTime to: 5
[junit4:junit4]   2> 2836 T2693 oashc.HttpShardHandlerFactory.getParameter Setting sizeOfQueue to: -1
[junit4:junit4]   2> 2836 T2693 oashc.HttpShardHandlerFactory.getParameter Setting fairnessPolicy to: false
[junit4:junit4]   2> 2838 T2693 oascsi.HttpClientUtil.createClient Creating new http client, config:maxConnectionsPerHost=20&maxConnections=10000&socketTimeout=0&connTimeout=0&retry=false
[junit4:junit4]   2> 2858 T2693 oascc.ZkStateReader.createClusterStateWatchersAndUpdate Updating cluster state from ZooKeeper... 
[junit4:junit4]   2> 2873 T2693 oasc.CoreContainer.create Creating SolrCore 'collection1' using instanceDir: C:\Jenkins\workspace\Lucene-Solr-4.x-Windows\solr\build\solr-core\test-files\solr\collection1
[junit4:junit4]   2> 2873 T2693 oasc.ZkController.createCollectionZkNode Check for collection zkNode:collection1
[junit4:junit4]   2> 2875 T2693 oasc.ZkController.createCollectionZkNode Collection zkNode exists
[junit4:junit4]   2> 2875 T2693 oasc.ZkController.readConfigName Load collection config from:/collections/collection1
[junit4:junit4]   2> 2878 T2693 oasc.SolrResourceLoader.<init> new SolrResourceLoader for directory: 'C:\Jenkins\workspace\Lucene-Solr-4.x-Windows\solr\build\solr-core\test-files\solr\collection1\'
[junit4:junit4]   2> 2882 T2693 oasc.SolrResourceLoader.replaceClassLoader Adding 'file:/C:/Jenkins/workspace/Lucene-Solr-4.x-Windows/solr/build/solr-core/test-files/solr/collection1/lib/classes/' to classloader
[junit4:junit4]   2> 2885 T2693 oasc.SolrResourceLoader.replaceClassLoader Adding 'file:/C:/Jenkins/workspace/Lucene-Solr-4.x-Windows/solr/build/solr-core/test-files/solr/collection1/lib/README' to classloader
[junit4:junit4]   2> 2971 T2693 oasc.SolrConfig.<init> Using Lucene MatchVersion: LUCENE_40
[junit4:junit4]   2> 3078 T2693 oasc.SolrConfig.<init> Loaded SolrConfig: solrconfig.xml
[junit4:junit4]   2> 3081 T2693 oass.IndexSchema.readSchema Reading Solr Schema
[junit4:junit4]   2> 3087 T2693 oass.IndexSchema.readSchema Schema name=test
[junit4:junit4]   2> 3307 T2705 oascc.ZkStateReader.updateClusterState Updating cloud state from ZooKeeper... 
[junit4:junit4]   2> 3329 T2709 oascc.ZkStateReader$2.process A cluster state change has occurred - updating...
[junit4:junit4]   2> 3330 T2704 oascc.ZkStateReader$2.process A cluster state change has occurred - updating...
[junit4:junit4]   2> 4022 T2693 oass.OpenExchangeRatesOrgProvider.init Initialized with rates=open-exchange-rates.json, refreshInterval=1440.
[junit4:junit4]   2> 4041 T2693 oass.IndexSchema.readSchema default search field in schema is text
[junit4:junit4]   2> 4048 T2693 oass.IndexSchema.readSchema unique key field: id
[junit4:junit4]   2> 4069 T2693 oass.FileExchangeRateProvider.reload Reloading exchange rates from file currency.xml
[junit4:junit4]   2> 4076 T2693 oass.FileExchangeRateProvider.reload Reloading exchange rates from file currency.xml
[junit4:junit4]   2> 4084 T2693 oass.OpenExchangeRatesOrgProvider.reload Reloading exchange rates from open-exchange-rates.json
[junit4:junit4]   2> 4085 T2693 oass.OpenExchangeRatesOrgProvider.reload Reloading exchange rates from open-exchange-rates.json
[junit4:junit4]   2> 4088 T2693 oasc.SolrCore.<init> [collection1] Opening new SolrCore at C:\Jenkins\workspace\Lucene-Solr-4.x-Windows\solr\build\solr-core\test-files\solr\collection1\, dataDir=C:\Jenkins\workspace\Lucene-Solr-4.x-Windows\solr\build\solr-core\test\J0\.\solrtest-LeaderElectionIntegrationTest-1347716675264\data_7001\
[junit4:junit4]   2> 4088 T2693 oasc.JmxMonitoredMap.<init> JMX monitoring is enabled. Adding Solr mbeans to JMX Server: com.sun.jmx.mbeanserver.JmxMBeanServer@ecb7a4
[junit4:junit4]   2> 4089 T2693 oasc.SolrCore.getNewIndexDir WARNING New index directory detected: old=null new=C:\Jenkins\workspace\Lucene-Solr-4.x-Windows\solr\build\solr-core\test\J0\.\solrtest-LeaderElectionIntegrationTest-1347716675264\data_7001\index/
[junit4:junit4]   2> 4092 T2693 oasc.SolrCore.initIndex WARNING [collection1] Solr index directory 'C:\Jenkins\workspace\Lucene-Solr-4.x-Windows\solr\build\solr-core\test\J0\.\solrtest-LeaderElectionIntegrationTest-1347716675264\data_7001\index' doesn't exist. Creating new index...
[junit4:junit4]   2> 4097 T2693 oasc.CachingDirectoryFactory.get return new directory for C:\Jenkins\workspace\Lucene-Solr-4.x-Windows\solr\build\solr-core\test\J0\.\solrtest-LeaderElectionIntegrationTest-1347716675264\data_7001\index forceNew:false
[junit4:junit4]   2> 4104 T2693 oasc.SolrDeletionPolicy.onCommit SolrDeletionPolicy.onCommit: commits:num=1
[junit4:junit4]   2> 		commit{dir=MockDirWrapper(org.apache.lucene.store.MMapDirectory@C:\Jenkins\workspace\Lucene-Solr-4.x-Windows\solr\build\solr-core\test\J0\index3013530141tmp lockFactory=org.apache.lucene.store.NativeFSLockFactory@1717cf8),segFN=segments_1,generation=1,filenames=[segments_1]
[junit4:junit4]   2> 4104 T2693 oasc.SolrDeletionPolicy.updateCommits newest commit = 1
[junit4:junit4]   2> 4106 T2693 oasc.SolrCore.initWriters created xml: solr.XMLResponseWriter
[junit4:junit4]   2> 4108 T2693 oasup.UpdateRequestProcessorChain.init inserting DistributedUpdateProcessorFactory into updateRequestProcessorChain "dedupe"
[junit4:junit4]   2> 4108 T2693 oasup.UpdateRequestProcessorChain.init inserting DistributedUpdateProcessorFactory into updateRequestProcessorChain "dedupe-allfields"
[junit4:junit4]   2> 4108 T2693 oasup.UpdateRequestProcessorChain.init inserting DistributedUpdateProcessorFactory into updateRequestProcessorChain "stored_sig"
[junit4:junit4]   2> 4110 T2693 oasup.UpdateRequestProcessorChain.init inserting DistributedUpdateProcessorFactory into updateRequestProcessorChain "uniq-fields"
[junit4:junit4]   2> 4111 T2693 oasup.UpdateRequestProcessorChain.init inserting DistributedUpdateProcessorFactory into updateRequestProcessorChain "distrib-dup-test-chain-implicit"
[junit4:junit4]   2> 4111 T2693 oasc.RequestHandlers.initHandlersFromConfig adding lazy requestHandler: solr.ReplicationHandler
[junit4:junit4]   2> 4112 T2693 oasc.RequestHandlers.initHandlersFromConfig created /replication: solr.ReplicationHandler
[junit4:junit4]   2> 4116 T2693 oasc.RequestHandlers.initHandlersFromConfig created standard: solr.StandardRequestHandler
[junit4:junit4]   2> 4118 T2693 oasc.RequestHandlers.initHandlersFromConfig created /get: solr.RealTimeGetHandler
[junit4:junit4]   2> 4118 T2693 oasc.RequestHandlers.initHandlersFromConfig created dismax: solr.SearchHandler
[junit4:junit4]   2> 4118 T2693 oasc.RequestHandlers.initHandlersFromConfig created mock: org.apache.solr.core.MockQuerySenderListenerReqHandler
[junit4:junit4]   2> 4119 T2693 oasc.RequestHandlers.initHandlersFromConfig created /admin/: org.apache.solr.handler.admin.AdminHandlers
[junit4:junit4]   2> 4119 T2693 oasc.RequestHandlers.initHandlersFromConfig created defaults: solr.StandardRequestHandler
[junit4:junit4]   2> 4119 T2693 oasc.RequestHandlers.initHandlersFromConfig adding lazy requestHandler: solr.StandardRequestHandler
[junit4:junit4]   2> 4120 T2693 oasc.RequestHandlers.initHandlersFromConfig created lazy: solr.StandardRequestHandler
[junit4:junit4]   2> 4120 T2693 oasc.RequestHandlers.initHandlersFromConfig created /update: solr.UpdateRequestHandler
[junit4:junit4]   2> 4120 T2693 oasc.RequestHandlers.initHandlersFromConfig created /terms: org.apache.solr.handler.component.SearchHandler
[junit4:junit4]   2> 4122 T2693 oasc.RequestHandlers.initHandlersFromConfig created spellCheckCompRH: org.apache.solr.handler.component.SearchHandler
[junit4:junit4]   2> 4122 T2693 oasc.RequestHandlers.initHandlersFromConfig created spellCheckCompRH_Direct: org.apache.solr.handler.component.SearchHandler
[junit4:junit4]   2> 4122 T2693 oasc.RequestHandlers.initHandlersFromConfig created spellCheckWithWordbreak: org.apache.solr.handler.component.SearchHandler
[junit4:junit4]   2> 4123 T2693 oasc.RequestHandlers.initHandlersFromConfig created spellCheckWithWordbreak_Direct: org.apache.solr.handler.component.SearchHandler
[junit4:junit4]   2> 4123 T2693 oasc.RequestHandlers.initHandlersFromConfig created spellCheckCompRH1: org.apache.solr.handler.component.SearchHandler
[junit4:junit4]   2> 4123 T2693 oasc.RequestHandlers.initHandlersFromConfig created tvrh: org.apache.solr.handler.component.SearchHandler
[junit4:junit4]   2> 4124 T2693 oasc.RequestHandlers.initHandlersFromConfig created /mlt: solr.MoreLikeThisHandler
[junit4:junit4]   2> 4124 T2693 oasc.RequestHandlers.initHandlersFromConfig created /debug/dump: solr.DumpRequestHandler
[junit4:junit4]   2> 4132 T2693 oashl.XMLLoader.init xsltCacheLifetimeSeconds=60
[junit4:junit4]   2> 4139 T2693 oasc.SolrCore.initDeprecatedSupport WARNING solrconfig.xml uses deprecated <admin/gettableFiles>, Please update your config to use the ShowFileRequestHandler.
[junit4:junit4]   2> 4141 T2693 oasc.SolrCore.initDeprecatedSupport WARNING adding ShowFileRequestHandler with hidden files: [SCHEMA.XML, OLD_SYNONYMS.TXT, STOPWORDS.TXT, PROTWORDS.TXT, OPEN-EXCHANGE-RATES.JSON, SYNONYMS.TXT, CURRENCY.XML, MAPPING-ISOLATIN1ACCENT.TXT]
[junit4:junit4]   2> 4147 T2693 oass.SolrIndexSearcher.<init> Opening Searcher@1a7feba main
[junit4:junit4]   2> 4147 T2693 oass.SolrIndexSearcher.getIndexDir WARNING WARNING: Directory impl does not support setting indexDir: org.apache.lucene.store.MockDirectoryWrapper
[junit4:junit4]   2> 4149 T2693 oasu.CommitTracker.<init> Hard AutoCommit: disabled
[junit4:junit4]   2> 4149 T2693 oasu.CommitTracker.<init> Soft AutoCommit: disabled
[junit4:junit4]   2> 4150 T2693 oashc.SpellCheckComponent.inform Initializing spell checkers
[junit4:junit4]   2> 4166 T2693 oass.DirectSolrSpellChecker.init init: {name=direct,classname=DirectSolrSpellChecker,field=lowerfilt,minQueryLength=3}
[junit4:junit4]   2> 4251 T2710 oasc.SolrCore.registerSearcher [collection1] Registered new searcher Searcher@1a7feba main{StandardDirectoryReader(segments_1:1)}
[junit4:junit4]   2> 4263 T2693 oasc.CoreContainer.register registering core: collection1
[junit4:junit4]   2> 4263 T2693 oasc.ZkController.register Register shard - core:collection1 address:http://127.0.0.1:7001/solr shardId:shard1
[junit4:junit4]   2> 4268 T2693 oasc.ZkController.register We are http://127.0.0.1:7001/solr/collection1/ and leader is http://127.0.0.1:7000/solr/collection1/
[junit4:junit4]   2> 4268 T2693 oasc.ZkController.checkRecovery WARNING Skipping recovery according to sys prop solrcloud.skip.autorecovery
[junit4:junit4]   2> 4275 T2693 oascc.ZkStateReader.updateClusterState Updating cloud state from ZooKeeper... 
[junit4:junit4]   2> 4282 T2693 oasc.SolrResourceLoader.locateSolrHome JNDI not configured for solr (NoInitialContextEx)
[junit4:junit4]   2> 4282 T2693 oasc.SolrResourceLoader.locateSolrHome using system property solr.solr.home: C:\Jenkins\workspace\Lucene-Solr-4.x-Windows\solr\build\solr-core\test-files\solr
[junit4:junit4]   2> 4283 T2693 oasc.CoreContainer$Initializer.initialize looking for solr.xml: C:\Jenkins\workspace\Lucene-Solr-4.x-Windows\solr\build\solr-core\test-files\solr\solr.xml
[junit4:junit4]   2> 4283 T2693 oasc.CoreContainer.<init> New CoreContainer 32118351
[junit4:junit4]   2> 4285 T2693 oasc.CoreContainer.load Loading CoreContainer using Solr Home: 'C:\Jenkins\workspace\Lucene-Solr-4.x-Windows\solr\build\solr-core\test-files\solr\'
[junit4:junit4]   2> 4286 T2693 oasc.SolrResourceLoader.<init> new SolrResourceLoader for directory: 'C:\Jenkins\workspace\Lucene-Solr-4.x-Windows\solr\build\solr-core\test-files\solr\'
[junit4:junit4]   2> 4351 T2693 oasc.CoreContainer.load Registering Log Listener
[junit4:junit4]   2> 4372 T2693 oasc.CoreContainer.initZooKeeper Zookeeper client=127.0.0.1:63273/solr
[junit4:junit4]   2> 4372 T2693 oaz.ZooKeeper.<init> Initiating client connection, connectString=127.0.0.1:63273/solr sessionTimeout=3000 watcher=org.apache.solr.common.cloud.ConnectionManager@d52918
[junit4:junit4]   2> 4375 T2711 oaz.ClientCnxn$SendThread.startConnect Opening socket connection to server /127.0.0.1:63273
[junit4:junit4]   2> 4375 T2693 oascc.ConnectionManager.waitForConnected Waiting for client to connect to ZooKeeper
[junit4:junit4]   2> 4376 T2711 oaz.ClientCnxn$SendThread.primeConnection Socket connection established to 127.0.0.1/127.0.0.1:63273, initiating session
[junit4:junit4]   2> 4384 T2695 oazs.NIOServerCnxn$Factory.run Accepted socket connection from /127.0.0.1:63288
[junit4:junit4]   2> 4384 T2695 oazs.NIOServerCnxn.readConnectRequest Client attempting to establish new session at /127.0.0.1:63288
[junit4:junit4]   2> 4387 T2697 oazs.NIOServerCnxn.finishSessionInit Established session 0x139ca2c76d40004 with negotiated timeout 3000 for client /127.0.0.1:63288
[junit4:junit4]   2> 4387 T2711 oaz.ClientCnxn$SendThread.readConnectResult Session establishment complete on server 127.0.0.1/127.0.0.1:63273, sessionid = 0x139ca2c76d40004, negotiated timeout = 3000
[junit4:junit4]   2> 4388 T2712 oascc.ConnectionManager.process Watcher org.apache.solr.common.cloud.ConnectionManager@d52918 name:ZooKeeperConnection Watcher:127.0.0.1:63273/solr got event WatchedEvent state:SyncConnected type:None path:null path:null type:None
[junit4:junit4]   2> 4388 T2693 oascc.ConnectionManager.waitForConnected Client is connected to ZooKeeper
[junit4:junit4]   2> 4390 T2698 oazs.PrepRequestProcessor.pRequest Got user-level KeeperException when processing sessionid:0x139ca2c76d40004 type:create cxid:0x1 zxid:0xfffffffffffffffe txntype:unknown reqpath:n/a Error Path:/solr/overseer Error:KeeperErrorCode = NodeExists for /solr/overseer
[junit4:junit4]   2> 4392 T2698 oazs.PrepRequestProcessor.pRequest Got user-level KeeperException when processing sessionid:0x139ca2c76d40004 type:create cxid:0x2 zxid:0xfffffffffffffffe txntype:unknown reqpath:n/a Error Path:/solr/overseer Error:KeeperErrorCode = NodeExists for /solr/overseer
[junit4:junit4]   2> 4395 T2693 oasc.ZkController.createEphemeralLiveNode Register node as live in ZooKeeper:/live_nodes/127.0.0.1:7002_solr
[junit4:junit4]   2> 4395 T2698 oazs.PrepRequestProcessor.pRequest Got user-level KeeperException when processing sessionid:0x139ca2c76d40004 type:delete cxid:0x4 zxid:0xfffffffffffffffe txntype:unknown reqpath:n/a Error Path:/solr/live_nodes/127.0.0.1:7002_solr Error:KeeperErrorCode = NoNode for /solr/live_nodes/127.0.0.1:7002_solr
[junit4:junit4]   2> 4398 T2693 oascc.SolrZkClient.makePath makePath: /live_nodes/127.0.0.1:7002_solr
[junit4:junit4]   2> 4400 T2704 oascc.ZkStateReader$3.process Updating live nodes
[junit4:junit4]   2> 4402 T2709 oascc.ZkStateReader$3.process Updating live nodes
[junit4:junit4]   2> 4403 T2693 oashc.HttpShardHandlerFactory.getParameter Setting socketTimeout to: 0
[junit4:junit4]   2> 4403 T2693 oashc.HttpShardHandlerFactory.getParameter Setting urlScheme to: http://
[junit4:junit4]   2> 4404 T2693 oashc.HttpShardHandlerFactory.getParameter Setting connTimeout to: 0
[junit4:junit4]   2> 4404 T2693 oashc.HttpShardHandlerFactory.getParameter Setting maxConnectionsPerHost to: 20
[junit4:junit4]   2> 4406 T2693 oashc.HttpShardHandlerFactory.getParameter Setting corePoolSize to: 0
[junit4:junit4]   2> 4406 T2693 oashc.HttpShardHandlerFactory.getParameter Setting maximumPoolSize to: 2147483647
[junit4:junit4]   2> 4406 T2693 oashc.HttpShardHandlerFactory.getParameter Setting maxThreadIdleTime to: 5
[junit4:junit4]   2> 4407 T2693 oashc.HttpShardHandlerFactory.getParameter Setting sizeOfQueue to: -1
[junit4:junit4]   2> 4407 T2693 oashc.HttpShardHandlerFactory.getParameter Setting fairnessPolicy to: false
[junit4:junit4]   2> 4407 T2693 oascsi.HttpClientUtil.createClient Creating new http client, config:maxConnectionsPerHost=20&maxConnections=10000&socketTimeout=0&connTimeout=0&retry=false
[junit4:junit4]   2> 4423 T2693 oascc.ZkStateReader.createClusterStateWatchersAndUpdate Updating cluster state from ZooKeeper... 
[junit4:junit4]   2> 4433 T2693 oasc.CoreContainer.create Creating SolrCore 'collection1' using instanceDir: C:\Jenkins\workspace\Lucene-Solr-4.x-Windows\solr\build\solr-core\test-files\solr\collection1
[junit4:junit4]   2> 4433 T2693 oasc.ZkController.createCollectionZkNode Check for collection zkNode:collection1
[junit4:junit4]   2> 4434 T2693 oasc.ZkController.createCollectionZkNode Collection zkNode exists
[junit4:junit4]   2> 4434 T2693 oasc.ZkController.readConfigName Load collection config from:/collections/collection1
[junit4:junit4]   2> 4437 T2693 oasc.SolrResourceLoader.<init> new SolrResourceLoader for directory: 'C:\Jenkins\workspace\Lucene-Solr-4.x-Windows\solr\build\solr-core\test-files\solr\collection1\'
[junit4:junit4]   2> 4439 T2693 oasc.SolrResourceLoader.replaceClassLoader Adding 'file:/C:/Jenkins/workspace/Lucene-Solr-4.x-Windows/solr/build/solr-core/test-files/solr/collection1/lib/classes/' to classloader
[junit4:junit4]   2> 4441 T2693 oasc.SolrResourceLoader.replaceClassLoader Adding 'file:/C:/Jenkins/workspace/Lucene-Solr-4.x-Windows/solr/build/solr-core/test-files/solr/collection1/lib/README' to classloader
[junit4:junit4]   2> 4512 T2693 oasc.SolrConfig.<init> Using Lucene MatchVersion: LUCENE_40
[junit4:junit4]   2> 4610 T2693 oasc.SolrConfig.<init> Loaded SolrConfig: solrconfig.xml
[junit4:junit4]   2> 4613 T2693 oass.IndexSchema.readSchema Reading Solr Schema
[junit4:junit4]   2> 4620 T2693 oass.IndexSchema.readSchema Schema name=test
[junit4:junit4]   2> 4729 T2705 oascc.ZkStateReader.updateClusterState Updating cloud state from ZooKeeper... 
[junit4:junit4]   2> 4750 T2709 oascc.ZkStateReader$2.process A cluster state change has occurred - updating...
[junit4:junit4]   2> 4752 T2712 oascc.ZkStateReader$2.process A cluster state change has occurred - updating...
[junit4:junit4]   2> 4752 T2704 oascc.ZkStateReader$2.process A cluster state change has occurred - updating...
[junit4:junit4]   2> 5515 T2693 oass.OpenExchangeRatesOrgProvider.init Initialized with rates=open-exchange-rates.json, refreshInterval=1440.
[junit4:junit4]   2> 5528 T2693 oass.IndexSchema.readSchema default search field in schema is text
[junit4:junit4]   2> 5534 T2693 oass.IndexSchema.readSchema unique key field: id
[junit4:junit4]   2> 5554 T2693 oass.FileExchangeRateProvider.reload Reloading exchange rates from file currency.xml
[junit4:junit4]   2> 5561 T2693 oass.FileExchangeRateProvider.reload Reloading exchange rates from file currency.xml
[junit4:junit4]   2> 5569 T2693 oass.OpenExchangeRatesOrgProvider.reload Reloading exchange rates from open-exchange-rates.json
[junit4:junit4]   2> 5570 T2693 oass.OpenExchangeRatesOrgProvider.reload Reloading exchange rates from open-exchange-rates.json
[junit4:junit4]   2> 5573 T2693 oasc.SolrCore.<init> [collection1] Opening new SolrCore at C:\Jenkins\workspace\Lucene-Solr-4.x-Windows\solr\build\solr-core\test-files\solr\collection1\, dataDir=C:\Jenkins\workspace\Lucene-Solr-4.x-Windows\solr\build\solr-core\test\J0\.\solrtest-LeaderElectionIntegrationTest-1347716675264\data_7002\
[junit4:junit4]   2> 5573 T2693 oasc.JmxMonitoredMap.<init> JMX monitoring is enabled. Adding Solr mbeans to JMX Server: com.sun.jmx.mbeanserver.JmxMBeanServer@ecb7a4
[junit4:junit4]   2> 5575 T2693 oasc.SolrCore.getNewIndexDir WARNING New index directory detected: old=null new=C:\Jenkins\workspace\Lucene-Solr-4.x-Windows\solr\build\solr-core\test\J0\.\solrtest-LeaderElectionIntegrationTest-1347716675264\data_7002\index/
[junit4:junit4]   2> 5577 T2693 oasc.SolrCore.initIndex WARNING [collection1] Solr index directory 'C:\Jenkins\workspace\Lucene-Solr-4.x-Windows\solr\build\solr-core\test\J0\.\solrtest-LeaderElectionIntegrationTest-1347716675264\data_7002\index' doesn't exist. Creating new index...
[junit4:junit4]   2> 5577 T2693 oasc.CachingDirectoryFactory.get return new directory for C:\Jenkins\workspace\Lucene-Solr-4.x-Windows\solr\build\solr-core\test\J0\.\solrtest-LeaderElectionIntegrationTest-1347716675264\data_7002\index forceNew:false
[junit4:junit4]   2> 5581 T2693 oasc.SolrDeletionPolicy.onCommit SolrDeletionPolicy.onCommit: commits:num=1
[junit4:junit4]   2> 		commit{dir=MockDirWrapper(org.apache.lucene.store.RAMDirectory@dfd7e0 lockFactory=org.apache.lucene.store.NativeFSLockFactory@505b1a),segFN=segments_1,generation=1,filenames=[segments_1]
[junit4:junit4]   2> 5581 T2693 oasc.SolrDeletionPolicy.updateCommits newest commit = 1
[junit4:junit4]   2> 5582 T2693 oasc.SolrCore.initWriters created xml: solr.XMLResponseWriter
[junit4:junit4]   2> 5585 T2693 oasup.UpdateRequestProcessorChain.init inserting DistributedUpdateProcessorFactory into updateRequestProcessorChain "dedupe"
[junit4:junit4]   2> 5586 T2693 oasup.UpdateRequestProcessorChain.init inserting DistributedUpdateProcessorFactory into updateRequestProcessorChain "dedupe-allfields"
[junit4:junit4]   2> 5586 T2693 oasup.UpdateRequestProcessorChain.init inserting DistributedUpdateProcessorFactory into updateRequestProcessorChain "stored_sig"
[junit4:junit4]   2> 5588 T2693 oasup.UpdateRequestProcessorChain.init inserting DistributedUpdateProcessorFactory into updateRequestProcessorChain "uniq-fields"
[junit4:junit4]   2> 5593 T2693 oasup.UpdateRequestProcessorChain.init inserting DistributedUpdateProcessorFactory into updateRequestProcessorChain "distrib-dup-test-chain-implicit"
[junit4:junit4]   2> 5594 T2693 oasc.RequestHandlers.initHandlersFromConfig adding lazy requestHandler: solr.ReplicationHandler
[junit4:junit4]   2> 5594 T2693 oasc.RequestHandlers.initHandlersFromConfig created /replication: solr.ReplicationHandler
[junit4:junit4]   2> 5594 T2693 oasc.RequestHandlers.initHandlersFromConfig created standard: solr.StandardRequestHandler
[junit4:junit4]   2> 5596 T2693 oasc.RequestHandlers.initHandlersFromConfig created /get: solr.RealTimeGetHandler
[junit4:junit4]   2> 5597 T2693 oasc.RequestHandlers.initHandlersFromConfig created dismax: solr.SearchHandler
[junit4:junit4]   2> 5598 T2693 oasc.RequestHandlers.initHandlersFromConfig created mock: org.apache.solr.core.MockQuerySenderListenerReqHandler
[junit4:junit4]   2> 5598 T2693 oasc.RequestHandlers.initHandlersFromConfig created /admin/: org.apache.solr.handler.admin.AdminHandlers
[junit4:junit4]   2> 5600 T2693 oasc.RequestHandlers.initHandlersFromConfig created defaults: solr.StandardRequestHandler
[junit4:junit4]   2> 5600 T2693 oasc.RequestHandlers.initHandlersFromConfig adding lazy requestHandler: solr.StandardRequestHandler
[junit4:junit4]   2> 5600 T2693 oasc.RequestHandlers.initHandlersFromConfig created lazy: solr.StandardRequestHandler
[junit4:junit4]   2> 5601 T2693 oasc.RequestHandlers.initHandlersFromConfig created /update: solr.UpdateRequestHandler
[junit4:junit4]   2> 5601 T2693 oasc.RequestHandlers.initHandlersFromConfig created /terms: org.apache.solr.handler.component.SearchHandler
[junit4:junit4]   2> 5602 T2693 oasc.RequestHandlers.initHandlersFromConfig created spellCheckCompRH: org.apache.solr.handler.component.SearchHandler
[junit4:junit4]   2> 5602 T2693 oasc.RequestHandlers.initHandlersFromConfig created spellCheckCompRH_Direct: org.apache.solr.handler.component.SearchHandler
[junit4:junit4]   2> 5604 T2693 oasc.RequestHandlers.initHandlersFromConfig created spellCheckWithWordbreak: org.apache.solr.handler.component.SearchHandler
[junit4:junit4]   2> 5604 T2693 oasc.RequestHandlers.initHandlersFromConfig created spellCheckWithWordbreak_Direct: org.apache.solr.handler.component.SearchHandler
[junit4:junit4]   2> 5605 T2693 oasc.RequestHandlers.initHandlersFromConfig created spellCheckCompRH1: org.apache.solr.handler.component.SearchHandler
[junit4:junit4]   2> 5605 T2693 oasc.RequestHandlers.initHandlersFromConfig created tvrh: org.apache.solr.handler.component.SearchHandler
[junit4:junit4]   2> 5606 T2693 oasc.RequestHandlers.initHandlersFromConfig created /mlt: solr.MoreLikeThisHandler
[junit4:junit4]   2> 5606 T2693 oasc.RequestHandlers.initHandlersFromConfig created /debug/dump: solr.DumpRequestHandler
[junit4:junit4]   2> 5612 T2693 oashl.XMLLoader.init xsltCacheLifetimeSeconds=60
[junit4:junit4]   2> 5617 T2693 oasc.SolrCore.initDeprecatedSupport WARNING solrconfig.xml uses deprecated <admin/gettableFiles>, Please update your config to use the ShowFileRequestHandler.
[junit4:junit4]   2> 5620 T2693 oasc.SolrCore.initDeprecatedSupport WARNING adding ShowFileRequestHandler with hidden files: [SCHEMA.XML, OLD_SYNONYMS.TXT, STOPWORDS.TXT, PROTWORDS.TXT, OPEN-EXCHANGE-RATES.JSON, SYNONYMS.TXT, CURRENCY.XML, MAPPING-ISOLATIN1ACCENT.TXT]
[junit4:junit4]   2> 5624 T2693 oass.SolrIndexSearcher.<init> Opening Searcher@1a57c14 main
[junit4:junit4]   2> 5625 T2693 oass.SolrIndexSearcher.getIndexDir WARNING WARNING: Directory impl does not support setting indexDir: org.apache.lucene.store.MockDirectoryWrapper
[junit4:junit4]   2> 5625 T2693 oasu.CommitTracker.<init> Hard AutoCommit: disabled
[junit4:junit4]   2> 5627 T2693 oasu.CommitTracker.<init> Soft AutoCommit: disabled
[junit4:junit4]   2> 5627 T2693 oashc.SpellCheckComponent.inform Initializing spell checkers
[junit4:junit4]   2> 5643 T2693 oass.DirectSolrSpellChecker.init init: {name=direct,classname=DirectSolrSpellChecker,field=lowerfilt,minQueryLength=3}
[junit4:junit4]   2> 5738 T2713 oasc.SolrCore.registerSearcher [collection1] Registered new searcher Searcher@1a57c14 main{StandardDirectoryReader(segments_1:1)}
[junit4:junit4]   2> 5746 T2693 oasc.CoreContainer.register registering core: collection1
[junit4:junit4]   2> 5746 T2693 oasc.ZkController.register Register shard - core:collection1 address:http://127.0.0.1:7002/solr shardId:shard1
[junit4:junit4]   2> 5753 T2693 oasc.ZkController.register We are http://127.0.0.1:7002/solr/collection1/ and leader is http://127.0.0.1:7000/solr/collection1/
[junit4:junit4]   2> 5753 T2693 oasc.ZkController.checkRecovery WARNING Skipping recovery according to sys prop solrcloud.skip.autorecovery
[junit4:junit4]   2> 5757 T2693 oascc.ZkStateReader.updateClusterState Updating cloud state from ZooKeeper... 
[junit4:junit4]   2> 5763 T2693 oasc.SolrResourceLoader.locateSolrHome JNDI not configured for solr (NoInitialContextEx)
[junit4:junit4]   2> 5764 T2693 oasc.SolrResourceLoader.locateSolrHome using system property solr.solr.home: C:\Jenkins\workspace\Lucene-Solr-4.x-Windows\solr\build\solr-core\test-files\solr
[junit4:junit4]   2> 5764 T2693 oasc.CoreContainer$Initializer.initialize looking for solr.xml: C:\Jenkins\workspace\Lucene-Solr-4.x-Windows\solr\build\solr-core\test-files\solr\solr.xml
[junit4:junit4]   2> 5764 T2693 oasc.CoreContainer.<init> New CoreContainer 16280465
[junit4:junit4]   2> 5765 T2693 oasc.CoreContainer.load Loading CoreContainer using Solr Home: 'C:\Jenkins\workspace\Lucene-Solr-4.x-Windows\solr\build\solr-core\test-files\solr\'
[junit4:junit4]   2> 5765 T2693 oasc.SolrResourceLoader.<init> new SolrResourceLoader for directory: 'C:\Jenkins\workspace\Lucene-Solr-4.x-Windows\solr\build\solr-core\test-files\solr\'
[junit4:junit4]   2> 5835 T2693 oasc.CoreContainer.load Registering Log Listener
[junit4:junit4]   2> 5860 T2693 oasc.CoreContainer.initZooKeeper Zookeeper client=127.0.0.1:63273/solr
[junit4:junit4]   2> 5861 T2693 oaz.ZooKeeper.<init> Initiating client connection, connectString=127.0.0.1:63273/solr sessionTimeout=3000 watcher=org.apache.solr.common.cloud.ConnectionManager@516059
[junit4:junit4]   2> 5864 T2714 oaz.ClientCnxn$SendThread.startConnect Opening socket connection to server /127.0.0.1:63273
[junit4:junit4]   2> 5864 T2693 oascc.ConnectionManager.waitForConnected Waiting for client to connect to ZooKeeper
[junit4:junit4]   2> 5866 T2714 oaz.ClientCnxn$SendThread.primeConnection Socket connection established to 127.0.0.1/127.0.0.1:63273, initiating session
[junit4:junit4]   2> 5866 T2695 oazs.NIOServerCnxn$Factory.run Accepted socket connection from /127.0.0.1:63291
[junit4:junit4]   2> 5866 T2695 oazs.NIOServerCnxn.readConnectRequest Client attempting to establish new session at /127.0.0.1:63291
[junit4:junit4]   2> 5869 T2697 oazs.NIOServerCnxn.finishSessionInit Established session 0x139ca2c76d40005 with negotiated timeout 3000 for client /127.0.0.1:63291
[junit4:junit4]   2> 5869 T2714 oaz.ClientCnxn$SendThread.readConnectResult Session establishment complete on server 127.0.0.1/127.0.0.1:63273, sessionid = 0x139ca2c76d40005, negotiated timeout = 3000
[junit4:junit4]   2> 5870 T2715 oascc.ConnectionManager.process Watcher org.apache.solr.common.cloud.ConnectionManager@516059 name:ZooKeeperConnection Watcher:127.0.0.1:63273/solr got event WatchedEvent state:SyncConnected type:None path:null path:null type:None
[junit4:junit4]   2> 5870 T2693 oascc.ConnectionManager.waitForConnected Client is connected to ZooKeeper
[junit4:junit4]   2> 5872 T2698 oazs.PrepRequestProcessor.pRequest Got user-level KeeperException when processing sessionid:0x139ca2c76d40005 type:create cxid:0x1 zxid:0xfffffffffffffffe txntype:unknown reqpath:n/a Error Path:/solr/overseer Error:KeeperErrorCode = NodeExists for /solr/overseer
[junit4:junit4]   2> 5874 T2698 oazs.PrepRequestProcessor.pRequest Got user-level KeeperException when processing sessionid:0x139ca2c76d40005 type:create cxid:0x2 zxid:0xfffffffffffffffe txntype:unknown reqpath:n/a Error Path:/solr/overseer Error:KeeperErrorCode = NodeExists for /solr/overseer
[junit4:junit4]   2> 5877 T2693 oasc.ZkController.createEphemeralLiveNode Register node as live in ZooKeeper:/live_nodes/127.0.0.1:7003_solr
[junit4:junit4]   2> 5877 T2698 oazs.PrepRequestProcessor.pRequest Got user-level KeeperException when processing sessionid:0x139ca2c76d40005 type:delete cxid:0x4 zxid:0xfffffffffffffffe txntype:unknown reqpath:n/a Error Path:/solr/live_nodes/127.0.0.1:7003_solr Error:KeeperErrorCode = NoNode for /solr/live_nodes/127.0.0.1:7003_solr
[junit4:junit4]   2> 5880 T2693 oascc.SolrZkClient.makePath makePath: /live_nodes/127.0.0.1:7003_solr
[junit4:junit4]   2> 5884 T2709 oascc.ZkStateReader$3.process Updating live nodes
[junit4:junit4]   2> 5884 T2712 oascc.ZkStateReader$3.process Updating live nodes
[junit4:junit4]   2> 5884 T2704 oascc.ZkStateReader$3.process Updating live nodes
[junit4:junit4]   2> 5886 T2693 oashc.HttpShardHandlerFactory.getParameter Setting socketTimeout to: 0
[junit4:junit4]   2> 5886 T2693 oashc.HttpShardHandlerFactory.getParameter Setting urlScheme to: http://
[junit4:junit4]   2> 5888 T2693 oashc.HttpShardHandlerFactory.getParameter Setting connTimeout to: 0
[junit4:junit4]   2> 5888 T2693 oashc.HttpShardHandlerFactory.getParameter Setting maxConnectionsPerHost to: 20
[junit4:junit4]   2> 5888 T2693 oashc.HttpShardHandlerFactory.getParameter Setting corePoolSize to: 0
[junit4:junit4]   2> 5888 T2693 oashc.HttpShardHandlerFactory.getParameter Setting maximumPoolSize to: 2147483647
[junit4:junit4]   2> 5889 T2693 oashc.HttpShardHandlerFactory.getParameter Setting maxThreadIdleTime to: 5
[junit4:junit4]   2> 5889 T2693 oashc.HttpShardHandlerFactory.getParameter Setting sizeOfQueue to: -1
[junit4:junit4]   2> 5889 T2693 oashc.HttpShardHandlerFactory.getParameter Setting fairnessPolicy to: false
[junit4:junit4]   2> 5890 T2693 oascsi.HttpClientUtil.createClient Creating new http client, config:maxConnectionsPerHost=20&maxConnections=10000&socketTimeout=0&connTimeout=0&retry=false
[junit4:junit4]   2> 5907 T2693 oascc.ZkStateReader.createClusterStateWatchersAndUpdate Updating cluster state from ZooKeeper... 
[junit4:junit4]   2> 5916 T2693 oasc.CoreContainer.create Creating SolrCore 'collection1' using instanceDir: C:\Jenkins\workspace\Lucene-Solr-4.x-Windows\solr\build\solr-core\test-files\solr\collection1
[junit4:junit4]   2> 5916 T2693 oasc.ZkController.createCollectionZkNode Check for collection zkNode:collection1
[junit4:junit4]   2> 5917 T2693 oasc.ZkController.createCollectionZkNode Collection zkNode exists
[junit4:junit4]   2> 5917 T2693 oasc.ZkController.readConfigName Load collection config from:/collections/collection1
[junit4:junit4]   2> 5920 T2693 oasc.SolrResourceLoader.<init> new SolrResourceLoader for directory: 'C:\Jenkins\workspace\Lucene-Solr-4.x-Windows\solr\build\solr-core\test-files\solr\collection1\'
[junit4:junit4]   2> 5923 T2693 oasc.SolrResourceLoader.replaceClassLoader Adding 'file:/C:/Jenkins/workspace/Lucene-Solr-4.x-Windows/solr/build/solr-core/test-files/solr/collection1/lib/classes/' to classloader
[junit4:junit4]   2> 5924 T2693 oasc.SolrResourceLoader.replaceClassLoader Adding 'file:/C:/Jenkins/workspace/Lucene-Solr-4.x-Windows/solr/build/solr-core/test-files/solr/collection1/lib/README' to classloader
[junit4:junit4]   2> 6001 T2693 oasc.SolrConfig.<init> Using Lucene MatchVersion: LUCENE_40
[junit4:junit4]   2> 6100 T2693 oasc.SolrConfig.<init> Loaded SolrConfig: solrconfig.xml
[junit4:junit4]   2> 6103 T2693 oass.IndexSchema.readSchema Reading Solr Schema
[junit4:junit4]   2> 6110 T2693 oass.IndexSchema.readSchema Schema name=test
[junit4:junit4]   2> 6154 T2705 oascc.ZkStateReader.updateClusterState Updating cloud state from ZooKeeper... 
[junit4:junit4]   2> 6175 T2704 oascc.ZkStateReader$2.process A cluster state change has occurred - updating...
[junit4:junit4]   2> 6176 T2712 oascc.ZkStateReader$2.process A cluster state change has occurred - updating...
[junit4:junit4]   2> 6176 T2715 oascc.ZkStateReader$2.process A cluster state change has occurred - updating...
[junit4:junit4]   2> 6176 T2709 oascc.ZkStateReader$2.process A cluster state change has occurred - updating...
[junit4:junit4]   2> 6906 T2693 oass.OpenExchangeRatesOrgProvider.init Initialized with rates=open-exchange-rates.json, refreshInterval=1440.
[junit4:junit4]   2> 6918 T2693 oass.IndexSchema.readSchema default search field in schema is text
[junit4:junit4]   2> 6924 T2693 oass.IndexSchema.readSchema unique key field: id
[junit4:junit4]   2> 6942 T2693 oass.FileExchangeRateProvider.reload Reloading exchange rates from file currency.xml
[junit4:junit4]   2> 6948 T2693 oass.FileExchangeRateProvider.reload Reloading exchange rates from file currency.xml
[junit4:junit4]   2> 6953 T2693 oass.OpenExchangeRatesOrgProvider.reload Reloading exchange rates from open-exchange-rates.json
[junit4:junit4]   2> 6955 T2693 oass.OpenExchangeRatesOrgProvider.reload Reloading exchange rates from open-exchange-rates.json
[junit4:junit4]   2> 6956 T2693 oasc.SolrCore.<init> [collection1] Opening new SolrCore at C:\Jenkins\workspace\Lucene-Solr-4.x-Windows\solr\build\solr-core\test-files\solr\collection1\, dataDir=C:\Jenkins\workspace\Lucene-Solr-4.x-Windows\solr\build\solr-core\test\J0\.\solrtest-LeaderElectionIntegrationTest-1347716675264\data_7003\
[junit4:junit4]   2> 6958 T2693 oasc.JmxMonitoredMap.<init> JMX monitoring is enabled. Adding Solr mbeans to JMX Server: com.sun.jmx.mbeanserver.JmxMBeanServer@ecb7a4
[junit4:junit4]   2> 6959 T2693 oasc.SolrCore.getNewIndexDir WARNING New index directory detected: old=null new=C:\Jenkins\workspace\Lucene-Solr-4.x-Windows\solr\build\solr-core\test\J0\.\solrtest-LeaderElectionIntegrationTest-1347716675264\data_7003\index/
[junit4:junit4]   2> 6960 T2693 oasc.SolrCore.initIndex WARNING [collection1] Solr index directory 'C:\Jenkins\workspace\Lucene-Solr-4.x-Windows\solr\build\solr-core\test\J0\.\solrtest-LeaderElectionIntegrationTest-1347716675264\data_7003\index' doesn't exist. Creating new index...
[junit4:junit4]   2> 6961 T2693 oasc.CachingDirectoryFactory.get return new directory for C:\Jenkins\workspace\Lucene-Solr-4.x-Windows\solr\build\solr-core\test\J0\.\solrtest-LeaderElectionIntegrationTest-1347716675264\data_7003\index forceNew:false
[junit4:junit4]   2> 6964 T2693 oasc.SolrDeletionPolicy.onCommit SolrDeletionPolicy.onCommit: commits:num=1
[junit4:junit4]   2> 		commit{dir=MockDirWrapper(org.apache.lucene.store.RAMDirectory@11656ad lockFactory=org.apache.lucene.store.NativeFSLockFactory@952c18),segFN=segments_1,generation=1,filenames=[segments_1]
[junit4:junit4]   2> 6965 T2693 oasc.SolrDeletionPolicy.updateCommits newest commit = 1
[junit4:junit4]   2> 6965 T2693 oasc.SolrCore.initWriters created xml: solr.XMLResponseWriter
[junit4:junit4]   2> 6967 T2693 oasup.UpdateRequestProcessorChain.init inserting DistributedUpdateProcessorFactory into updateRequestProcessorChain "dedupe"
[junit4:junit4]   2> 6969 T2693 oasup.UpdateRequestProcessorChain.init inserting DistributedUpdateProcessorFactory into updateRequestProcessorChain "dedupe-allfields"
[junit4:junit4]   2> 6969 T2693 oasup.UpdateRequestProcessorChain.init inserting DistributedUpdateProcessorFactory into updateRequestProcessorChain "stored_sig"
[junit4:junit4]   2> 6970 T2693 oasup.UpdateRequestProcessorChain.init inserting DistributedUpdateProcessorFactory into updateRequestProcessorChain "uniq-fields"
[junit4:junit4]   2> 6970 T2693 oasup.UpdateRequestProcessorChain.init inserting DistributedUpdateProcessorFactory into updateRequestProcessorChain "distrib-dup-test-chain-implicit"
[junit4:junit4]   2> 6970 T2693 oasc.RequestHandlers.initHandlersFromConfig adding lazy requestHandler: solr.ReplicationHandler
[junit4:junit4]   2> 6971 T2693 oasc.RequestHandlers.initHandlersFromConfig created /replication: solr.ReplicationHandler
[junit4:junit4]   2> 6971 T2693 oasc.RequestHandlers.initHandlersFromConfig created standard: solr.StandardRequestHandler
[junit4:junit4]   2> 6972 T2693 oasc.RequestHandlers.initHandlersFromConfig created /get: solr.RealTimeGetHandler
[junit4:junit4]   2> 6972 T2693 oasc.RequestHandlers.initHandlersFromConfig created dismax: solr.SearchHandler
[junit4:junit4]   2> 6973 T2693 oasc.RequestHandlers.initHandlersFromConfig created mock: org.apache.solr.core.MockQuerySenderListenerReqHandler
[junit4:junit4]   2> 6973 T2693 oasc.RequestHandlers.initHandlersFromConfig created /admin/: org.apache.solr.handler.admin.AdminHandlers
[junit4:junit4]   2> 6975 T2693 oasc.RequestHandlers.initHandlersFromConfig created defaults: solr.StandardRequestHandler
[junit4:junit4]   2> 6975 T2693 oasc.RequestHandlers.initHandlersFromConfig adding lazy requestHandler: solr.StandardRequestHandler
[junit4:junit4]   2> 6975 T2693 oasc.RequestHandlers.initHandlersFromConfig created lazy: solr.StandardRequestHandler
[junit4:junit4]   2> 6976 T2693 oasc.RequestHandlers.initHandlersFromConfig created /update: solr.UpdateRequestHandler
[junit4:junit4]   2> 6976 T2693 oasc.RequestHandlers.initHandlersFromConfig created /terms: org.apache.solr.handler.component.SearchHandler
[junit4:junit4]   2> 6977 T2693 oasc.RequestHandlers.initHandlersFromConfig created spellCheckCompRH: org.apache.solr.handler.component.SearchHandler
[junit4:junit4]   2> 6977 T2693 oasc.RequestHandlers.initHandlersFromConfig created spellCheckCompRH_Direct: org.apache.solr.handler.component.SearchHandler
[junit4:junit4]   2> 6978 T2693 oasc.RequestHandlers.initHandlersFromConfig created spellCheckWithWordbreak: org.apache.solr.handler.component.SearchHandler
[junit4:junit4]   2> 6978 T2693 oasc.RequestHandlers.initHandlersFromConfig created spellCheckWithWordbreak_Direct: org.apache.solr.handler.component.SearchHandler
[junit4:junit4]   2> 6979 T2693 oasc.RequestHandlers.initHandlersFromConfig created spellCheckCompRH1: org.apache.solr.handler.component.SearchHandler
[junit4:junit4]   2> 6979 T2693 oasc.RequestHandlers.initHandlersFromConfig created tvrh: org.apache.solr.handler.component.SearchHandler
[junit4:junit4]   2> 6981 T2693 oasc.RequestHandlers.initHandlersFromConfig created /mlt: solr.MoreLikeThisHandler
[junit4:junit4]   2> 6981 T2693 oasc.RequestHandlers.initHandlersFromConfig created /debug/dump: solr.DumpRequestHandler
[junit4:junit4]   2> 6984 T2693 oashl.XMLLoader.init xsltCacheLifetimeSeconds=60
[junit4:junit4]   2> 6990 T2693 oasc.SolrCore.initDeprecatedSupport WARNING solrconfig.xml uses deprecated <admin/gettableFiles>, Please update your config to use the ShowFileRequestHandler.
[junit4:junit4]   2> 6992 T2693 oasc.SolrCore.initDeprecatedSupport WARNING adding ShowFileRequestHandler with hidden files: [SCHEMA.XML, OLD_SYNONYMS.TXT, STOPWORDS.TXT, PROTWORDS.TXT, OPEN-EXCHANGE-RATES.JSON, SYNONYMS.TXT, CURRENCY.XML, MAPPING-ISOLATIN1ACCENT.TXT]
[junit4:junit4]   2> 6996 T2693 oass.SolrIndexSearcher.<init> Opening Searcher@1a3380f main
[junit4:junit4]   2> 6996 T2693 oass.SolrIndexSearcher.getIndexDir WARNING WARNING: Directory impl does not support setting indexDir: org.apache.lucene.store.MockDirectoryWrapper
[junit4:junit4]   2> 6998 T2693 oasu.CommitTracker.<init> Hard AutoCommit: disabled
[junit4:junit4]   2> 6998 T2693 oasu.CommitTracker.<init> Soft AutoCommit: disabled
[junit4:junit4]   2> 7000 T2693 oashc.SpellCheckComponent.inform Initializing spell checkers
[junit4:junit4]   2> 7021 T2693 oass.DirectSolrSpellChecker.init init: {name=direct,classname=DirectSolrSpellChecker,field=lowerfilt,minQueryLength=3}
[junit4:junit4]   2> 7112 T2716 oasc.SolrCore.registerSearcher [collection1] Registered new searcher Searcher@1a3380f main{StandardDirectoryReader(segments_1:1)}
[junit4:junit4]   2> 7119 T2693 oasc.CoreContainer.register registering core: collection1
[junit4:junit4]   2> 7119 T2693 oasc.ZkController.register Register shard - core:collection1 address:http://127.0.0.1:7003/solr shardId:shard1
[junit4:junit4]   2> 7124 T2693 oasc.ZkController.register We are http://127.0.0.1:7003/solr/collection1/ and leader is http://127.0.0.1:7000/solr/collection1/
[junit4:junit4]   2> 7124 T2693 oasc.ZkController.checkRecovery WARNING Skipping recovery according to sys prop solrcloud.skip.autorecovery
[junit4:junit4]   2> 7130 T2693 oascc.ZkStateReader.updateClusterState Updating cloud state from ZooKeeper... 
[junit4:junit4]   2> 7133 T2693 oasc.SolrResourceLoader.locateSolrHome JNDI not configured for solr (NoInitialContextEx)
[junit4:junit4]   2> 7133 T2693 oasc.SolrResourceLoader.locateSolrHome using system property solr.solr.home: C:\Jenkins\workspace\Lucene-Solr-4.x-Windows\solr\build\solr-core\test-files\solr
[junit4:junit4]   2> 7135 T2693 oasc.CoreContainer$Initializer.initialize looking for solr.xml: C:\Jenkins\workspace\Lucene-Solr-4.x-Windows\solr\build\solr-core\test-files\solr\solr.xml
[junit4:junit4]   2> 7135 T2693 oasc.CoreContainer.<init> New CoreContainer 23292014
[junit4:junit4]   2> 7136 T2693 oasc.CoreContainer.load Loading CoreContainer using Solr Home: 'C:\Jenkins\workspace\Lucene-Solr-4.x-Windows\solr\build\solr-core\test-files\solr\'
[junit4:junit4]   2> 7136 T2693 oasc.SolrResourceLoader.<init> new SolrResourceLoader for directory: 'C:\Jenkins\workspace\Lucene-Solr-4.x-Windows\solr\build\solr-core\test-files\solr\'
[junit4:junit4]   2> 7200 T2693 oasc.CoreContainer.load Registering Log Listener
[junit4:junit4]   2> 7218 T2693 oasc.CoreContainer.initZooKeeper Zookeeper client=127.0.0.1:63273/solr
[junit4:junit4]   2> 7218 T2693 oaz.ZooKeeper.<init> Initiating client connection, connectString=127.0.0.1:63273/solr sessionTimeout=3000 watcher=org.apache.solr.common.cloud.ConnectionManager@fd9ac2
[junit4:junit4]   2> 7221 T2717 oaz.ClientCnxn$SendThread.startConnect Opening socket connection to server /127.0.0.1:63273
[junit4:junit4]   2> 7221 T2693 oascc.ConnectionManager.waitForConnected Waiting for client to connect to ZooKeeper
[junit4:junit4]   2> 7222 T2717 oaz.ClientCnxn$SendThread.primeConnection Socket connection established to 127.0.0.1/127.0.0.1:63273, initiating session
[junit4:junit4]   2> 7223 T2695 oazs.NIOServerCnxn$Factory.run Accepted socket connection from /127.0.0.1:63294
[junit4:junit4]   2> 7223 T2695 oazs.NIOServerCnxn.readConnectRequest Client attempting to establish new session at /127.0.0.1:63294
[junit4:junit4]   2> 7225 T2697 oazs.NIOServerCnxn.finishSessionInit Established session 0x139ca2c76d40006 with negotiated timeout 3000 for client /127.0.0.1:63294
[junit4:junit4]   2> 7225 T2717 oaz.ClientCnxn$SendThread.readConnectResult Session establishment complete on server 127.0.0.1/127.0.0.1:63273, sessionid = 0x139ca2c76d40006, negotiated timeout = 3000
[junit4:junit4]   2> 7227 T2718 oascc.ConnectionManager.process Watcher org.apache.solr.common.cloud.ConnectionManager@fd9ac2 name:ZooKeeperConnection Watcher:127.0.0.1:63273/solr got event WatchedEvent state:SyncConnected type:None path:null path:null type:None
[junit4:junit4]   2> 7227 T2693 oascc.ConnectionManager.waitForConnected Client is connected to ZooKeeper
[junit4:junit4]   2> 7228 T2698 oazs.PrepRequestProcessor.pRequest Got user-level KeeperException when processing sessionid:0x139ca2c76d40006 type:create cxid:0x1 zxid:0xfffffffffffffffe txntype:unknown reqpath:n/a Error Path:/solr/overseer Error:KeeperErrorCode = NodeExists for /solr/overseer
[junit4:junit4]   2> 7230 T2698 oazs.PrepRequestProcessor.pRequest Got user-level KeeperException when processing sessionid:0x139ca2c76d40006 type:create cxid:0x2 zxid:0xfffffffffffffffe txntype:unknown reqpath:n/a Error Path:/solr/overseer Error:KeeperErrorCode = NodeExists for /solr/overseer
[junit4:junit4]   2> 7234 T2693 oasc.ZkController.createEphemeralLiveNode Register node as live in ZooKeeper:/live_nodes/127.0.0.1:7004_solr
[junit4:junit4]   2> 7234 T2698 oazs.PrepRequestProcessor.pRequest Got user-level KeeperException when processing sessionid:0x139ca2c76d40006 type:delete cxid:0x4 zxid:0xfffffffffffffffe txntype:unknown reqpath:n/a Error Path:/solr/live_nodes/127.0.0.1:7004_solr Error:KeeperErrorCode = NoNode for /solr/live_nodes/127.0.0.1:7004_solr
[junit4:junit4]   2> 7236 T2693 oascc.SolrZkClient.makePath makePath: /live_nodes/127.0.0.1:7004_solr
[junit4:junit4]   2> 7241 T2704 oascc.ZkStateReader$3.process Updating live nodes
[junit4:junit4]   2> 7241 T2712 oascc.ZkStateReader$3.process Updating live nodes
[junit4:junit4]   2> 7241 T2715 oascc.ZkStateReader$3.process Updating live nodes
[junit4:junit4]   2> 7242 T2709 oascc.ZkStateReader$3.process Updating live nodes
[junit4:junit4]   2> 7244 T2693 oashc.HttpShardHandlerFactory.getParameter Setting socketTimeout to: 0
[junit4:junit4]   2> 7245 T2693 oashc.HttpShardHandlerFactory.getParameter Setting urlScheme to: http://
[junit4:junit4]   2> 7245 T2693 oashc.HttpShardHandlerFactory.getParameter Setting connTimeout to: 0
[junit4:junit4]   2> 7245 T2693 oashc.HttpShardHandlerFactory.getParameter Setting maxConnectionsPerHost to: 20
[junit4:junit4]   2> 7245 T2693 oashc.HttpShardHandlerFactory.getParameter Setting corePoolSize to: 0
[junit4:junit4]   2> 7245 T2693 oashc.HttpShardHandlerFactory.getParameter Setting maximumPoolSize to: 2147483647
[junit4:junit4]   2> 7246 T2693 oashc.HttpShardHandlerFactory.getParameter Setting maxThreadIdleTime to: 5
[junit4:junit4]   2> 7246 T2693 oashc.HttpShardHandlerFactory.getParameter Setting sizeOfQueue to: -1
[junit4:junit4]   2> 7246 T2693 oashc.HttpShardHandlerFactory.getParameter Setting fairnessPolicy to: false
[junit4:junit4]   2> 7247 T2693 oascsi.HttpClientUtil.createClient Creating new http client, config:maxConnectionsPerHost=20&maxConnections=10000&socketTimeout=0&connTimeout=0&retry=false
[junit4:junit4]   2> 7261 T2693 oascc.ZkStateReader.createClusterStateWatchersAndUpdate Updating cluster state from ZooKeeper... 
[junit4:junit4]   2> 7270 T2693 oasc.CoreContainer.create Creating SolrCore 'collection1' using instanceDir: C:\Jenkins\workspace\Lucene-Solr-4.x-Windows\solr\build\solr-core\test-files\solr\collection1
[junit4:junit4]   2> 7271 T2693 oasc.ZkController.createCollectionZkNode Check for collection zkNode:collection1
[junit4:junit4]   2> 7273 T2693 oasc.ZkController.createCollectionZkNode Collection zkNode exists
[junit4:junit4]   2> 7273 T2693 oasc.ZkController.readConfigName Load collection config from:/collections/collection1
[junit4:junit4]   2> 7276 T2693 oasc.SolrResourceLoader.<init> new SolrResourceLoader for directory: 'C:\Jenkins\workspace\Lucene-Solr-4.x-Windows\solr\build\solr-core\test-files\solr\collection1\'
[junit4:junit4]   2> 7279 T2693 oasc.SolrResourceLoader.replaceClassLoader Adding 'file:/C:/Jenkins/workspace/Lucene-Solr-4.x-Windows/solr/build/solr-core/test-files/solr/collection1/lib/classes/' to classloader
[junit4:junit4]   2> 7281 T2693 oasc.SolrResourceLoader.replaceClassLoader Adding 'file:/C:/Jenkins/workspace/Lucene-Solr-4.x-Windows/solr/build/solr-core/test-files/solr/collection1/lib/README' to classloader
[junit4:junit4]   2> 7364 T2693 oasc.SolrConfig.<init> Using Lucene MatchVersion: LUCENE_40
[junit4:junit4]   2> 7433 T2705 oascc.ZkStateReader.updateClusterState Updating cloud state from ZooKeeper... 
[junit4:junit4]   2> 7453 T2718 oascc.ZkStateReader$2.process A cluster state change has occurred - updating...
[junit4:junit4]   2> 7453 T2704 oascc.ZkStateReader$2.process A cluster state change has occurred - updating...
[junit4:junit4]   2> 7453 T2712 oascc.ZkStateReader$2.process A cluster state change has occurred - updating...
[junit4:junit4]   2> 7453 T2709 oascc.ZkStateReader$2.process A cluster state change has occurred - updating...
[junit4:junit4]   2> 7453 T2715 oascc.ZkStateReader$2.process A cluster state change has occurred - updating...
[junit4:junit4]   2> 7454 T2693 oasc.SolrConfig.<init> Loaded SolrConfig: solrconfig.xml
[junit4:junit4]   2> 7457 T2693 oass.IndexSchema.readSchema Reading Solr Schema
[junit4:junit4]   2> 7465 T2693 oass.IndexSchema.readSchema Schema name=test
[junit4:junit4]   2> 8247 T2693 oass.OpenExchangeRatesOrgProvider.init Initialized with rates=open-exchange-rates.json, refreshInterval=1440.
[junit4:junit4]   2> 8260 T2693 oass.IndexSchema.readSchema default search field in schema is text
[junit4:junit4]   2> 8264 T2693 oass.IndexSchema.readSchema unique key field: id
[junit4:junit4]   2> 8282 T2693 oass.FileExchangeRateProvider.reload Reloading exchange rates from file currency.xml
[junit4:junit4]   2> 8288 T2693 oass.FileExchangeRateProvider.reload Reloading exchange rates from file currency.xml
[junit4:junit4]   2> 8293 T2693 oass.OpenExchangeRatesOrgProvider.reload Reloading exchange rates from open-exchange-rates.json
[junit4:junit4]   2> 8295 T2693 oass.OpenExchangeRatesOrgProvider.reload Reloading exchange rates from open-exchange-rates.json
[junit4:junit4]   2> 8296 T2693 oasc.SolrCore.<init> [collection1] Opening new SolrCore at C:\Jenkins\workspace\Lucene-Solr-4.x-Windows\solr\build\solr-core\test-files\solr\collection1\, dataDir=C:\Jenkins\workspace\Lucene-Solr-4.x-Windows\solr\build\solr-core\test\J0\.\solrtest-LeaderElectionIntegrationTest-1347716675264\data_7004\
[junit4:junit4]   2> 8296 T2693 oasc.JmxMonitoredMap.<init> JMX monitoring is enabled. Adding Solr mbeans to JMX Server: com.sun.jmx.mbeanserver.JmxMBeanServer@ecb7a4
[junit4:junit4]   2> 8299 T2693 oasc.SolrCore.getNewIndexDir WARNING New index directory detected: old=null new=C:\Jenkins\workspace\Lucene-Solr-4.x-Windows\solr\build\solr-core\test\J0\.\solrtest-LeaderElectionIntegrationTest-1347716675264\data_7004\index/
[junit4:junit4]   2> 8300 T2693 oasc.SolrCore.initIndex WARNING [collection1] Solr index directory 'C:\Jenkins\workspace\Lucene-Solr-4.x-Windows\solr\build\solr-core\test\J0\.\solrtest-LeaderElectionIntegrationTest-1347716675264\data_7004\index' doesn't exist. Creating new index...
[junit4:junit4]   2> 8301 T2693 oasc.CachingDirectoryFactory.get return new directory for C:\Jenkins\workspace\Lucene-Solr-4.x-Windows\solr\build\solr-core\test\J0\.\solrtest-LeaderElectionIntegrationTest-1347716675264\data_7004\index forceNew:false
[junit4:junit4]   2> 8305 T2693 oasc.SolrDeletionPolicy.onCommit SolrDeletionPolicy.onCommit: commits:num=1
[junit4:junit4]   2> 		commit{dir=MockDirWrapper(org.apache.lucene.store.RAMDirectory@dc7370 lockFactory=org.apache.lucene.store.NativeFSLockFactory@79a282),segFN=segments_1,generation=1,filenames=[segments_1]
[junit4:junit4]   2> 8305 T2693 oasc.SolrDeletionPolicy.updateCommits newest commit = 1
[junit4:junit4]   2> 8306 T2693 oasc.SolrCore.initWriters created xml: solr.XMLResponseWriter
[junit4:junit4]   2> 8308 T2693 oasup.UpdateRequestProcessorChain.init inserting DistributedUpdateProcessorFactory into updateRequestProcessorChain "dedupe"
[junit4:junit4]   2> 8308 T2693 oasup.UpdateRequestProcessorChain.init inserting DistributedUpdateProcessorFactory into updateRequestProcessorChain "dedupe-allfields"
[junit4:junit4]   2> 8310 T2693 oasup.UpdateRequestProcessorChain.init inserting DistributedUpdateProcessorFactory into updateRequestProcessorChain "stored_sig"
[junit4:junit4]   2> 8311 T2693 oasup.UpdateRequestProcessorChain.init inserting DistributedUpdateProcessorFactory into updateRequestProcessorChain "uniq-fields"
[junit4:junit4]   2> 8311 T2693 oasup.UpdateRequestProcessorChain.init inserting DistributedUpdateProcessorFactory into updateRequestProcessorChain "distrib-dup-test-chain-implicit"
[junit4:junit4]   2> 8311 T2693 oasc.RequestHandlers.initHandlersFromConfig adding lazy requestHandler: solr.ReplicationHandler
[junit4:junit4]   2> 8312 T2693 oasc.RequestHandlers.initHandlersFromConfig created /replication: solr.ReplicationHandler
[junit4:junit4]   2> 8312 T2693 oasc.RequestHandlers.initHandlersFromConfig created standard: solr.StandardRequestHandler
[junit4:junit4]   2> 8313 T2693 oasc.RequestHandlers.initHandlersFromConfig created /get: solr.RealTimeGetHandler
[junit4:junit4]   2> 8313 T2693 oasc.RequestHandlers.initHandlersFromConfig created dismax: solr.SearchHandler
[junit4:junit4]   2> 8315 T2693 oasc.RequestHandlers.initHandlersFromConfig created mock: org.apache.solr.core.MockQuerySenderListenerReqHandler
[junit4:junit4]   2> 8315 T2693 oasc.RequestHandlers.initHandlersFromConfig created /admin/: org.apache.solr.handler.admin.AdminHandlers
[junit4:junit4]   2> 8315 T2693 oasc.RequestHandlers.initHandlersFromConfig created defaults: solr.StandardRequestHandler
[junit4:junit4]   2> 8316 T2693 oasc.RequestHandlers.initHandlersFromConfig adding lazy requestHandler: solr.StandardRequestHandler
[junit4:junit4]   2> 8317 T2693 oasc.RequestHandlers.initHandlersFromConfig created lazy: solr.StandardRequestHandler
[junit4:junit4]   2> 8318 T2693 oasc.RequestHandlers.initHandlersFromConfig created /update: solr.UpdateRequestHandler
[junit4:junit4]   2> 8318 T2693 oasc.RequestHandlers.initHandlersFromConfig created /terms: org.apache.solr.handler.component.SearchHandler
[junit4:junit4]   2> 8318 T2693 oasc.RequestHandlers.initHandlersFromConfig created spellCheckCompRH: org.apache.solr.handler.component.SearchHandler
[junit4:junit4]   2> 8318 T2693 oasc.RequestHandlers.initHandlersFromConfig created spellCheckCompRH_Direct: org.apache.solr.handler.component.SearchHandler
[junit4:junit4]   2> 8319 T2693 oasc.RequestHandlers.initHandlersFromConfig created spellCheckWithWordbreak: org.apache.solr.handler.component.SearchHandler
[junit4:junit4]   2> 8319 T2693 oasc.RequestHandlers.initHandlersFromConfig created spellCheckWithWordbreak_Direct: org.apache.solr.handler.component.SearchHandler
[junit4:junit4]   2> 8321 T2693 oasc.RequestHandlers.initHandlersFromConfig created spellCheckCompRH1: org.apache.solr.handler.component.SearchHandler
[junit4:junit4]   2> 8322 T2693 oasc.RequestHandlers.initHandlersFromConfig created tvrh: org.apache.solr.handler.component.SearchHandler
[junit4:junit4]   2> 8322 T2693 oasc.RequestHandlers.initHandlersFromConfig created /mlt: solr.MoreLikeThisHandler
[junit4:junit4]   2> 8323 T2693 oasc.RequestHandlers.initHandlersFromConfig created /debug/dump: solr.DumpRequestHandler
[junit4:junit4]   2> 8327 T2693 oashl.XMLLoader.init xsltCacheLifetimeSeconds=60
[junit4:junit4]   2> 8333 T2693 oasc.SolrCore.initDeprecatedSupport WARNING solrconfig.xml uses deprecated <admin/gettableFiles>, Please update your config to use the ShowFileRequestHandler.
[junit4:junit4]   2> 8335 T2693 oasc.SolrCore.initDeprecatedSupport WARNING adding ShowFileRequestHandler with hidden files: [SCHEMA.XML, OLD_SYNONYMS.TXT, STOPWORDS.TXT, PROTWORDS.TXT, OPEN-EXCHANGE-RATES.JSON, SYNONYMS.TXT, CURRENCY.XML, MAPPING-ISOLATIN1ACCENT.TXT]
[junit4:junit4]   2> 8339 T2693 oass.SolrIndexSearcher.<init> Opening Searcher@189ad2d main
[junit4:junit4]   2> 8339 T2693 oass.SolrIndexSearcher.getIndexDir WARNING WARNING: Directory impl does not support setting indexDir: org.apache.lucene.store.MockDirectoryWrapper
[junit4:junit4]   2> 8340 T2693 oasu.CommitTracker.<init> Hard AutoCommit: disabled
[junit4:junit4]   2> 8340 T2693 oasu.CommitTracker.<init> Soft AutoCommit: disabled
[junit4:junit4]   2> 8341 T2693 oashc.SpellCheckComponent.inform Initializing spell checkers
[junit4:junit4]   2> 8355 T2693 oass.DirectSolrSpellChecker.init init: {name=direct,classname=DirectSolrSpellChecker,field=lowerfilt,minQueryLength=3}
[junit4:junit4]   2> 8432 T2719 oasc.SolrCore.registerSearcher [collection1] Registered new searcher Searcher@189ad2d main{StandardDirectoryReader(segments_1:1)}
[junit4:junit4]   2> 8438 T2693 oasc.CoreContainer.register registering core: collection1
[junit4:junit4]   2> 8438 T2693 oasc.ZkController.register Register shard - core:collection1 address:http://127.0.0.1:7004/solr shardId:shard1
[junit4:junit4]   2> 8444 T2693 oasc.ZkController.register We are http://127.0.0.1:7004/solr/collection1/ and leader is http://127.0.0.1:7000/solr/collection1/
[junit4:junit4]   2> 8444 T2693 oasc.ZkController.checkRecovery WARNING Skipping recovery according to sys prop solrcloud.skip.autorecovery
[junit4:junit4]   2> 8447 T2693 oascc.ZkStateReader.updateClusterState Updating cloud state from ZooKeeper... 
[junit4:junit4]   2> 8451 T2693 oasc.SolrResourceLoader.locateSolrHome JNDI not configured for solr (NoInitialContextEx)
[junit4:junit4]   2> 8451 T2693 oasc.SolrResourceLoader.locateSolrHome using system property solr.solr.home: C:\Jenkins\workspace\Lucene-Solr-4.x-Windows\solr\build\solr-core\test-files\solr
[junit4:junit4]   2> 8451 T2693 oasc.CoreContainer$Initializer.initialize looking for solr.xml: C:\Jenkins\workspace\Lucene-Solr-4.x-Windows\solr\build\solr-core\test-files\solr\solr.xml
[junit4:junit4]   2> 8453 T2693 oasc.CoreContainer.<init> New CoreContainer 8440478
[junit4:junit4]   2> 8453 T2693 oasc.CoreContainer.load Loading CoreContainer using Solr Home: 'C:\Jenkins\workspace\Lucene-Solr-4.x-Windows\solr\build\solr-core\test-files\solr\'
[junit4:junit4]   2> 8453 T2693 oasc.SolrResourceLoader.<init> new SolrResourceLoader for directory: 'C:\Jenkins\workspace\Lucene-Solr-4.x-Windows\solr\build\solr-core\test-files\solr\'
[junit4:junit4]   2> 8511 T2693 oasc.CoreContainer.load Registering Log Listener
[junit4:junit4]   2> 8537 T2693 oasc.CoreContainer.initZooKeeper Zookeeper client=127.0.0.1:63273/solr
[junit4:junit4]   2> 8539 T2693 oaz.ZooKeeper.<init> Initiating client connection, connectString=127.0.0.1:63273/solr sessionTimeout=3000 watcher=org.apache.solr.common.cloud.ConnectionManager@1afe0ad
[junit4:junit4]   2> 8540 T2720 oaz.ClientCnxn$SendThread.startConnect Opening socket connection to server /127.0.0.1:63273
[junit4:junit4]   2> 8540 T2693 oascc.ConnectionManager.waitForConnected Waiting for client to connect to ZooKeeper
[junit4:junit4]   2> 8542 T2720 oaz.ClientCnxn$SendThread.primeConnection Socket connection established to 127.0.0.1/127.0.0.1:63273, initiating session
[junit4:junit4]   2> 8542 T2695 oazs.NIOServerCnxn$Factory.run Accepted socket connection from /127.0.0.1:63297
[junit4:junit4]   2> 8544 T2695 oazs.NIOServerCnxn.readConnectRequest Client attempting to establish new session at /127.0.0.1:63297
[junit4:junit4]   2> 8547 T2697 oazs.NIOServerCnxn.finishSessionInit Established session 0x139ca2c76d40007 with negotiated timeout 3000 for client /127.0.0.1:63297
[junit4:junit4]   2> 8547 T2720 oaz.ClientCnxn$SendThread.readConnectResult Session establishment complete on server 127.0.0.1/127.0.0.1:63273, sessionid = 0x139ca2c76d40007, negotiated timeout = 3000
[junit4:junit4]   2> 8547 T2721 oascc.ConnectionManager.process Watcher org.apache.solr.common.cloud.ConnectionManager@1afe0ad name:ZooKeeperConnection Watcher:127.0.0.1:63273/solr got event WatchedEvent state:SyncConnected type:None path:null path:null type:None
[junit4:junit4]   2> 8547 T2693 oascc.ConnectionManager.waitForConnected Client is connected to ZooKeeper
[junit4:junit4]   2> 8548 T2698 oazs.PrepRequestProcessor.pRequest Got user-level KeeperException when processing sessionid:0x139ca2c76d40007 type:create cxid:0x1 zxid:0xfffffffffffffffe txntype:unknown reqpath:n/a Error Path:/solr/overseer Error:KeeperErrorCode = NodeExists for /solr/overseer
[junit4:junit4]   2> 8551 T2698 oazs.PrepRequestProcessor.pRequest Got user-level KeeperException when processing sessionid:0x139ca2c76d40007 type:create cxid:0x2 zxid:0xfffffffffffffffe txntype:unknown reqpath:n/a Error Path:/solr/overseer Error:KeeperErrorCode = NodeExists for /solr/overseer
[junit4:junit4]   2> 8553 T2693 oasc.ZkController.createEphemeralLiveNode Register node as live in ZooKeeper:/live_nodes/127.0.0.1:3333_solr
[junit4:junit4]   2> 8554 T2698 oazs.PrepRequestProcessor.pRequest Got user-level KeeperException when processing sessionid:0x139ca2c76d40007 type:delete cxid:0x4 zxid:0xfffffffffffffffe txntype:unknown reqpath:n/a Error Path:/solr/live_nodes/127.0.0.1:3333_solr Error:KeeperErrorCode = NoNode for /solr/live_nodes/127.0.0.1:3333_solr
[junit4:junit4]   2> 8557 T2693 oascc.SolrZkClient.makePath makePath: /live_nodes/127.0.0.1:3333_solr
[junit4:junit4]   2> 8560 T2718 oascc.ZkStateReader$3.process Updating live nodes
[junit4:junit4]   2> 8560 T2704 oascc.ZkStateReader$3.process Updating live nodes
[junit4:junit4]   2> 8560 T2709 oascc.ZkStateReader$3.process Updating live nodes
[junit4:junit4]   2> 8560 T2712 oascc.ZkStateReader$3.process Updating live nodes
[junit4:junit4]   2> 8562 T2715 oascc.ZkStateReader$3.process Updating live nodes
[junit4:junit4]   2> 8564 T2693 oashc.HttpShardHandlerFactory.getParameter Setting socketTimeout to: 0
[junit4:junit4]   2> 8564 T2693 oashc.HttpShardHandlerFactory.getParameter Setting urlScheme to: http://
[junit4:junit4]   2> 8564 T2693 oashc.HttpShardHandlerFactory.getParameter Setting connTimeout to: 0
[junit4:junit4]   2> 8565 T2693 oashc.HttpShardHandlerFactory.getParameter Setting maxConnectionsPerHost to: 20
[junit4:junit4]   2> 8565 T2693 oashc.HttpShardHandlerFactory.getParameter Setting corePoolSize to: 0
[junit4:junit4]   2> 8565 T2693 oashc.HttpShardHandlerFactory.getParameter Setting maximumPoolSize to: 2147483647
[junit4:junit4]   2> 8565 T2693 oashc.HttpShardHandlerFactory.getParameter Setting maxThreadIdleTime to: 5
[junit4:junit4]   2> 8565 T2693 oashc.HttpShardHandlerFactory.getParameter Setting sizeOfQueue to: -1
[junit4:junit4]   2> 8565 T2693 oashc.HttpShardHandlerFactory.getParameter Setting fairnessPolicy to: false
[junit4:junit4]   2> 8567 T2693 oascsi.HttpClientUtil.createClient Creating new http client, config:maxConnectionsPerHost=20&maxConnections=10000&socketTimeout=0&connTimeout=0&retry=false
[junit4:junit4]   2> 8581 T2693 oascc.ZkStateReader.createClusterStateWatchersAndUpdate Updating cluster state from ZooKeeper... 
[junit4:junit4]   2> 8588 T2693 oasc.CoreContainer.create Creating SolrCore 'collection1' using instanceDir: C:\Jenkins\workspace\Lucene-Solr-4.x-Windows\solr\build\solr-core\test-files\solr\collection1
[junit4:junit4]   2> 8590 T2693 oasc.ZkController.createCollectionZkNode Check for collection zkNode:collection1
[junit4:junit4]   2> 8590 T2693 oasc.ZkController.createCollectionZkNode Collection zkNode exists
[junit4:junit4]   2> 8591 T2693 oasc.ZkController.readConfigName Load collection config from:/collections/collection1
[junit4:junit4]   2> 8592 T2693 oasc.SolrResourceLoader.<init> new SolrResourceLoader for directory: 'C:\Jenkins\workspace\Lucene-Solr-4.x-Windows\solr\build\solr-core\test-files\solr\collection1\'
[junit4:junit4]   2> 8596 T2693 oasc.SolrResourceLoader.replaceClassLoader Adding 'file:/C:/Jenkins/workspace/Lucene-Solr-4.x-Windows/solr/build/solr-core/test-files/solr/collection1/lib/classes/' to classloader
[junit4:junit4]   2> 8596 T2693 oasc.SolrResourceLoader.replaceClassLoader Adding 'file:/C:/Jenkins/workspace/Lucene-Solr-4.x-Windows/solr/build/solr-core/test-files/solr/collection1/lib/README' to classloader
[junit4:junit4]   2> 8666 T2693 oasc.SolrConfig.<init> Using Lucene MatchVersion: LUCENE_40
[junit4:junit4]   2> 8713 T2705 oascc.ZkStateReader.updateClusterState Updating cloud state from ZooKeeper... 
[junit4:junit4]   2> 8735 T2721 oascc.ZkStateReader$2.process A cluster state change has occurred - updating...
[junit4:junit4]   2> 8735 T2718 oascc.ZkStateReader$2.process A cluster state change has occurred - updating...
[junit4:junit4]   2> 8736 T2704 oascc.ZkStateReader$2.process A cluster state change has occurred - updating...
[junit4:junit4]   2> 8736 T2709 oascc.ZkStateReader$2.process A cluster state change has occurred - updating...
[junit4:junit4]   2> 8736 T2712 oascc.ZkStateReader$2.process A cluster state change has occurred - updating...
[junit4:junit4]   2> 8735 T2715 oascc.ZkStateReader$2.process A cluster state change has occurred - updating...
[junit4:junit4]   2> 8781 T2693 oasc.SolrConfig.<init> Loaded SolrConfig: solrconfig.xml
[junit4:junit4]   2> 8785 T2693 oass.IndexSchema.readSchema Reading Solr Schema
[junit4:junit4]   2> 8789 T2693 oass.IndexSchema.readSchema Schema name=test
[junit4:junit4]   2> 9606 T2693 oass.OpenExchangeRatesOrgProvider.init Initialized with rates=open-exchange-rates.json, refreshInterval=1440.
[junit4:junit4]   2> 9619 T2693 oass.IndexSchema.readSchema default search field in schema is text
[junit4:junit4]   2> 9628 T2693 oass.IndexSchema.readSchema unique key field: id
[junit4:junit4]   2> 9647 T2693 oass.FileExchangeRateProvider.reload Reloading exchange rates from file currency.xml
[junit4:junit4]   2> 9654 T2693 oass.FileExchangeRateProvider.reload Reloading exchange rates from file currency.xml
[junit4:junit4]   2> 9661 T2693 oass.OpenExchangeRatesOrgProvider.reload Reloading exchange rates from open-exchange-rates.json
[junit4:junit4]   2> 9663 T2693 oass.OpenExchangeRatesOrgProvider.reload Reloading exchange rates from open-exchange-rates.json
[junit4:junit4]   2> 9665 T2693 oasc.SolrCore.<init> [collection1] Opening new SolrCore at C:\Jenkins\workspace\Lucene-Solr-4.x-Windows\solr\build\solr-core\test-files\solr\collection1\, dataDir=C:\Jenkins\workspace\Lucene-Solr-4.x-Windows\solr\build\solr-core\test\J0\.\solrtest-LeaderElectionIntegrationTest-1347716675264\data_3333\
[junit4:junit4]   2> 9665 T2693 oasc.JmxMonitoredMap.<init> JMX monitoring is enabled. Adding Solr mbeans to JMX Server: com.sun.jmx.mbeanserver.JmxMBeanServer@ecb7a4
[junit4:junit4]   2> 9667 T2693 oasc.SolrCore.getNewIndexDir WARNING New index directory detected: old=null new=C:\Jenkins\workspace\Lucene-Solr-4.x-Windows\solr\build\solr-core\test\J0\.\solrtest-LeaderElectionIntegrationTest-1347716675264\data_3333\index/
[junit4:junit4]   2> 9668 T2693 oasc.SolrCore.initIndex WARNING [collection1] Solr index directory 'C:\Jenkins\workspace\Lucene-Solr-4.x-Windows\solr\build\solr-core\test\J0\.\solrtest-LeaderElectionIntegrationTest-1347716675264\data_3333\index' doesn't exist. Creating new index...
[junit4:junit4]   2> 9669 T2693 oasc.CachingDirectoryFactory.get return new directory for C:\Jenkins\workspace\Lucene-Solr-4.x-Windows\solr\build\solr-core\test\J0\.\solrtest-LeaderElectionIntegrationTest-1347716675264\data_3333\index forceNew:false
[junit4:junit4]   2> 9673 T2693 oasc.SolrDeletionPolicy.onCommit SolrDeletionPolicy.onCommit: commits:num=1
[junit4:junit4]   2> 		commit{dir=MockDirWrapper(org.apache.lucene.store.RAMDirectory@585d2d lockFactory=org.apache.lucene.store.NativeFSLockFactory@da5b08),segFN=segments_1,generation=1,filenames=[segments_1]
[junit4:junit4]   2> 9673 T2693 oasc.SolrDeletionPolicy.updateCommits newest commit = 1
[junit4:junit4]   2> 9677 T2693 oasc.SolrCore.initWriters created xml: solr.XMLResponseWriter
[junit4:junit4]   2> 9680 T2693 oasup.UpdateRequestProcessorChain.init inserting DistributedUpdateProcessorFactory into updateRequestProcessorChain "dedupe"
[junit4:junit4]   2> 9680 T2693 oasup.UpdateRequestProcessorChain.init inserting DistributedUpdateProcessorFactory into updateRequestProcessorChain "dedupe-allfields"
[junit4:junit4]   2> 9680 T2693 oasup.UpdateRequestProcessorChain.init inserting DistributedUpdateProcessorFactory into updateRequestProcessorChain "stored_sig"
[junit4:junit4]   2> 9681 T2693 oasup.UpdateRequestProcessorChain.init inserting DistributedUpdateProcessorFactory into updateRequestProcessorChain "uniq-fields"
[junit4:junit4]   2> 9681 T2693 oasup.UpdateRequestProcessorChain.init inserting DistributedUpdateProcessorFactory into updateRequestProcessorChain "distrib-dup-test-chain-implicit"
[junit4:junit4]   2> 9681 T2693 oasc.RequestHandlers.initHandlersFromConfig adding lazy requestHandler: solr.ReplicationHandler
[junit4:junit4]   2> 9681 T2693 oasc.RequestHandlers.initHandlersFromConfig created /replication: solr.ReplicationHandler
[junit4:junit4]   2> 9682 T2693 oasc.RequestHandlers.initHandlersFromConfig created standard: solr.StandardRequestHandler
[junit4:junit4]   2> 9682 T2693 oasc.RequestHandlers.initHandlersFromConfig created /get: solr.RealTimeGetHandler
[junit4:junit4]   2> 9684 T2693 oasc.RequestHandlers.initHandlersFromConfig created dismax: solr.SearchHandler
[junit4:junit4]   2> 9684 T2693 oasc.RequestHandlers.initHandlersFromConfig created mock: org.apache.solr.core.MockQuerySenderListenerReqHandler
[junit4:junit4]   2> 9684 T2693 oasc.RequestHandlers.initHandlersFromConfig created /admin/: org.apache.solr.handler.admin.AdminHandlers
[junit4:junit4]   2> 9687 T2693 oasc.RequestHandlers.initHandlersFromConfig created defaults: solr.StandardRequestHandler
[junit4:junit4]   2> 9687 T2693 oasc.RequestHandlers.initHandlersFromConfig adding lazy requestHandler: solr.StandardRequestHandler
[junit4:junit4]   2> 9688 T2693 oasc.RequestHandlers.initHandlersFromConfig created lazy: solr.StandardRequestHandler
[junit4:junit4]   2> 9690 T2693 oasc.RequestHandlers.initHandlersFromConfig created /update: solr.UpdateRequestHandler
[junit4:junit4]   2> 9690 T2693 oasc.RequestHandlers.initHandlersFromConfig created /terms: org.apache.solr.handler.component.SearchHandler
[junit4:junit4]   2> 9691 T2693 oasc.RequestHandlers.initHandlersFromConfig created spellCheckCompRH: org.apache.solr.handler.component.SearchHandler
[junit4:junit4]   2> 9692 T2693 oasc.RequestHandlers.initHandlersFromConfig created spellCheckCompRH_Direct: org.apache.solr.handler.component.SearchHandler
[junit4:junit4]   2> 9692 T2693 oasc.RequestHandlers.initHandlersFromConfig created spellCheckWithWordbreak: org.apache.solr.handler.component.SearchHandler
[junit4:junit4]   2> 9693 T2693 oasc.RequestHandlers.initHandlersFromConfig created spellCheckWithWordbreak_Direct: org.apache.solr.handler.component.SearchHandler
[junit4:junit4]   2> 9694 T2693 oasc.RequestHandlers.initHandlersFromConfig created spellCheckCompRH1: org.apache.solr.handler.component.SearchHandler
[junit4:junit4]   2> 9696 T2693 oasc.RequestHandlers.initHandlersFromConfig created tvrh: org.apache.solr.handler.component.SearchHandler
[junit4:junit4]   2> 9697 T2693 oasc.RequestHandlers.initHandlersFromConfig created /mlt: solr.MoreLikeThisHandler
[junit4:junit4]   2> 9698 T2693 oasc.RequestHandlers.initHandlersFromConfig created /debug/dump: solr.DumpRequestHandler
[junit4:junit4]   2> 9703 T2693 oashl.XMLLoader.init xsltCacheLifetimeSeconds=60
[junit4:junit4]   2> 9711 T2693 oasc.SolrCore.initDeprecatedSupport WARNING solrconfig.xml uses deprecated <admin/gettableFiles>, Please update your config to use the ShowFileRequestHandler.
[junit4:junit4]   2> 9714 T2693 oasc.SolrCore.initDeprecatedSupport WARNING adding ShowFileRequestHandler with hidden files: [SCHEMA.XML, OLD_SYNONYMS.TXT, STOPWORDS.TXT, PROTWORDS.TXT, OPEN-EXCHANGE-RATES.JSON, SYNONYMS.TXT, CURRENCY.XML, MAPPING-ISOLATIN1ACCENT.TXT]
[junit4:junit4]   2> 9717 T2693 oass.SolrIndexSearcher.<init> Opening Searcher@1e52b47 main
[junit4:junit4]   2> 9719 T2693 oass.SolrIndexSearcher.getIndexDir WARNING WARNING: Directory impl does not support setting indexDir: org.apache.lucene.store.MockDirectoryWrapper
[junit4:junit4]   2> 9719 T2693 oasu.CommitTracker.<init> Hard AutoCommit: disabled
[junit4:junit4]   2> 9719 T2693 oasu.CommitTracker.<init> Soft AutoCommit: disabled
[junit4:junit4]   2> 9720 T2693 oashc.SpellCheckComponent.inform Initializing spell checkers
[junit4:junit4]   2> 9734 T2693 oass.DirectSolrSpellChecker.init init: {name=direct,classname=DirectSolrSpellChecker,field=lowerfilt,minQueryLength=3}
[junit4:junit4]   2> 9805 T2722 oasc.SolrCore.registerSearcher [collection1] Registered new searcher Searcher@1e52b47 main{StandardDirectoryReader(segments_1:1)}
[junit4:junit4]   2> 9812 T2693 oasc.CoreContainer.register registering core: collection1
[junit4:junit4]   2> 9812 T2693 oasc.ZkController.register Register shard - core:collection1 address:http://127.0.0.1:3333/solr shardId:shard2
[junit4:junit4]   2> 9813 T2693 oascc.SolrZkClient.makePath makePath: /collections/collection1/leader_elect/shard2/election
[junit4:junit4]   2> 9824 T2698 oazs.PrepRequestProcessor.pRequest Got user-level KeeperException when processing sessionid:0x139ca2c76d40007 type:delete cxid:0x41 zxid:0xfffffffffffffffe txntype:unknown reqpath:n/a Error Path:/solr/collections/collection1/leaders/shard2 Error:KeeperErrorCode = NoNode for /solr/collections/collection1/leaders/shard2
[junit4:junit4]   2> 9825 T2693 oasc.ShardLeaderElectionContext.runLeaderProcess Running the leader process.
[junit4:junit4]   2> 9826 T2698 oazs.PrepRequestProcessor.pRequest Got user-level KeeperException when processing sessionid:0x139ca2c76d40007 type:create cxid:0x42 zxid:0xfffffffffffffffe txntype:unknown reqpath:n/a Error Path:/solr/overseer Error:KeeperErrorCode = NodeExists for /solr/overseer
[junit4:junit4]   2> 9996 T2705 oascc.ZkStateReader.updateClusterState Updating cloud state from ZooKeeper... 
[junit4:junit4]   2> 10015 T2718 oascc.ZkStateReader$2.process A cluster state change has occurred - updating...
[junit4:junit4]   2> 10017 T2704 oascc.ZkStateReader$2.process A cluster state change has occurred - updating...
[junit4:junit4]   2> 10017 T2715 oascc.ZkStateReader$2.process A cluster state change has occurred - updating...
[junit4:junit4]   2> 10017 T2712 oascc.ZkStateReader$2.process A cluster state change has occurred - updating...
[junit4:junit4]   2> 10017 T2721 oascc.ZkStateReader$2.process A cluster state change has occurred - updating...
[junit4:junit4]   2> 10018 T2709 oascc.ZkStateReader$2.process A cluster state change has occurred - updating...
[junit4:junit4]   2> 10452 T2693 oasc.ShardLeaderElectionContext.waitForReplicasToComeUp Enough replicas found to continue.
[junit4:junit4]   2> 10452 T2693 oasc.ShardLeaderElectionContext.runLeaderProcess I may be the new leader - try and sync
[junit4:junit4]   2> 10452 T2693 oasc.ShardLeaderElectionContext.runLeaderProcess I am the new leader: http://127.0.0.1:3333/solr/collection1/
[junit4:junit4]   2> 10452 T2693 oascc.SolrZkClient.makePath makePath: /collections/collection1/leaders/shard2
[junit4:junit4]   2> 10459 T2698 oazs.PrepRequestProcessor.pRequest Got user-level KeeperException when processing sessionid:0x139ca2c76d40007 type:create cxid:0x4c zxid:0xfffffffffffffffe txntype:unknown reqpath:n/a Error Path:/solr/overseer Error:KeeperErrorCode = NodeExists for /solr/overseer
[junit4:junit4]   2> 10655 T2705 oascc.ZkStateReader.updateClusterState Updating cloud state from ZooKeeper... 
[junit4:junit4]   2> 10679 T2718 oascc.ZkStateReader$2.process A cluster state change has occurred - updating...
[junit4:junit4]   2> 10681 T2709 oascc.ZkStateReader$2.process A cluster state change has occurred - updating...
[junit4:junit4]   2> 10682 T2712 oascc.ZkStateReader$2.process A cluster state change has occurred - updating...
[junit4:junit4]   2> 10682 T2721 oascc.ZkStateReader$2.process A cluster state change has occurred - updating...
[junit4:junit4]   2> 10683 T2715 oascc.ZkStateReader$2.process A cluster state change has occurred - updating...
[junit4:junit4]   2> 10681 T2704 oascc.ZkStateReader$2.process A cluster state change has occurred - updating...
[junit4:junit4]   2> 10716 T2693 oasc.ZkController.register We are http://127.0.0.1:3333/solr/collection1/ and leader is http://127.0.0.1:3333/solr/collection1/
[junit4:junit4]   2> 10716 T2693 oasc.ZkController.checkRecovery WARNING Skipping recovery according to sys prop solrcloud.skip.autorecovery
[junit4:junit4]   2> 10724 T2693 oascc.ZkStateReader.updateClusterState Updating cloud state from ZooKeeper... 
[junit4:junit4]   2> 10725 T2693 oaz.ZooKeeper.<init> Initiating client connection, connectString=127.0.0.1:63273/solr sessionTimeout=10000 watcher=org.apache.solr.common.cloud.ConnectionManager@1ffd05d
[junit4:junit4]   2> 10729 T2723 oaz.ClientCnxn$SendThread.startConnect Opening socket connection to server /127.0.0.1:63273
[junit4:junit4]   2> 10729 T2693 oascc.ConnectionManager.waitForConnected Waiting for client to connect to ZooKeeper
[junit4:junit4]   2> 10731 T2723 oaz.ClientCnxn$SendThread.primeConnection Socket connection established to 127.0.0.1/127.0.0.1:63273, initiating session
[junit4:junit4]   2> 10733 T2695 oazs.NIOServerCnxn$Factory.run Accepted socket connection from /127.0.0.1:63300
[junit4:junit4]   2> 10734 T2695 oazs.NIOServerCnxn.readConnectRequest Client attempting to establish new session at /127.0.0.1:63300
[junit4:junit4]   2> 10736 T2697 oazs.NIOServerCnxn.finishSessionInit Established session 0x139ca2c76d40008 with negotiated timeout 10000 for client /127.0.0.1:63300
[junit4:junit4]   2> 10736 T2723 oaz.ClientCnxn$SendThread.readConnectResult Session establishment complete on server 127.0.0.1/127.0.0.1:63273, sessionid = 0x139ca2c76d40008, negotiated timeout = 10000
[junit4:junit4]   2> 10738 T2724 oascc.ConnectionManager.process Watcher org.apache.solr.common.cloud.ConnectionManager@1ffd05d name:ZooKeeperConnection Watcher:127.0.0.1:63273/solr got event WatchedEvent state:SyncConnected type:None path:null path:null type:None
[junit4:junit4]   2> 10738 T2693 oascc.ConnectionManager.waitForConnected Client is connected to ZooKeeper
[junit4:junit4]   2> 10739 T2693 oascc.ZkStateReader.createClusterStateWatchersAndUpdate Updating cluster state from ZooKeeper... 
[junit4:junit4]   2> 10741 T2693 oasc.LeaderElectionIntegrationTest.setUp ####SETUP_END testLeaderElectionAfterClientTimeout
[junit4:junit4]   2> 10742 T2695 oazs.NIOServerCnxn.doIO WARNING EndOfStreamException: Unable to read additional data from client sessionid 0x139ca2c76d40002, likely client has closed socket
[junit4:junit4]   2> 10745 T2695 oazs.NIOServerCnxn.closeSock Closed socket connection for client /127.0.0.1:63282 which had sessionid 0x139ca2c76d40002
[junit4:junit4]   2> 10746 T2703 oaz.ClientCnxn$SendThread.run WARNING Session 0x139ca2c76d40002 for server null, unexpected error, closing socket connection and attempting reconnect java.nio.channels.CancelledKeyException
[junit4:junit4]   2> 	at sun.nio.ch.SelectionKeyImpl.ensureValid(SelectionKeyImpl.java:73)
[junit4:junit4]   2> 	at sun.nio.ch.SelectionKeyImpl.interestOps(SelectionKeyImpl.java:77)
[junit4:junit4]   2> 	at org.apache.zookeeper.ClientCnxn$SendThread.disableWrite(ClientCnxn.java:919)
[junit4:junit4]   2> 	at org.apache.zookeeper.ClientCnxn$SendThread.run(ClientCnxn.java:1163)
[junit4:junit4]   2> 
[junit4:junit4]   2> 10871 T2704 oascc.ConnectionManager.process Watcher org.apache.solr.common.cloud.ConnectionManager@1b8c0e8 name:ZooKeeperConnection Watcher:127.0.0.1:63273/solr got event WatchedEvent state:Disconnected type:None path:null path:null type:None
[junit4:junit4]   2> 10871 T2704 oascc.ConnectionManager.process zkClient has disconnected
[junit4:junit4]   2> 12282 T2703 oaz.ClientCnxn$SendThread.startConnect Opening socket connection to server 127.0.0.1/127.0.0.1:63273
[junit4:junit4]   2> 12282 T2703 oaz.ClientCnxn$SendThread.primeConnection Socket connection established to 127.0.0.1/127.0.0.1:63273, initiating session
[junit4:junit4]   2> 12285 T2695 oazs.NIOServerCnxn$Factory.run Accepted socket connection from /127.0.0.1:63301
[junit4:junit4]   2> 13935 T2696 oazs.ZooKeeperServer.expire Expiring session 0x139ca2c76d40002, timeout of 3000ms exceeded
[junit4:junit4]   2> 13935 T2698 oazs.PrepRequestProcessor.pRequest Processed session termination for sessionid: 0x139ca2c76d40002
[junit4:junit4]   2> 13938 T2718 oascc.ZkStateReader$3.process Updating live nodes
[junit4:junit4]   2> 13940 T2712 oascc.ZkStateReader$3.process Updating live nodes
[junit4:junit4]   2> 13940 T2721 oascc.ZkStateReader$3.process Updating live nodes
[junit4:junit4]   2> 13940 T2715 oascc.ZkStateReader$3.process Updating live nodes
[junit4:junit4]   2> 13940 T2724 oascc.ZkStateReader$3.process Updating live nodes
[junit4:junit4]   2> 13942 T2698 oazs.PrepRequestProcessor.pRequest Got user-level KeeperException when processing sessionid:0x139ca2c76d40003 type:delete cxid:0x49 zxid:0xfffffffffffffffe txntype:unknown reqpath:n/a Error Path:/solr/overseer_elect/leader Error:KeeperErrorCode = NoNode for /solr/overseer_elect/leader
[junit4:junit4]   2> 13944 T2709 oascc.SolrZkClient.makePath makePath: /overseer_elect/leader
[junit4:junit4]   2> 13949 T2709 oasc.Overseer.start Overseer (id=88323960031412227-127.0.0.1:7001_solr-n_0000000001) starting
[junit4:junit4]   2> 13950 T2698 oazs.PrepRequestProcessor.pRequest Got user-level KeeperException when processing sessionid:0x139ca2c76d40003 type:create cxid:0x4e zxid:0xfffffffffffffffe txntype:unknown reqpath:n/a Error Path:/solr/overseer Error:KeeperErrorCode = NodeExists for /solr/overseer
[junit4:junit4]   2> 13954 T2698 oazs.PrepRequestProcessor.pRequest Got user-level KeeperException when processing sessionid:0x139ca2c76d40003 type:create cxid:0x4f zxid:0xfffffffffffffffe txntype:unknown reqpath:n/a Error Path:/solr/overseer Error:KeeperErrorCode = NodeExists for /solr/overseer
[junit4:junit4]   2> 13956 T2698 oazs.PrepRequestProcessor.pRequest Got user-level KeeperException when processing sessionid:0x139ca2c76d40003 type:create cxid:0x50 zxid:0xfffffffffffffffe txntype:unknown reqpath:n/a Error Path:/solr/overseer Error:KeeperErrorCode = NodeExists for /solr/overseer
[junit4:junit4]   2> 13959 T2698 oazs.PrepRequestProcessor.pRequest Got user-level KeeperException when processing sessionid:0x139ca2c76d40003 type:create cxid:0x51 zxid:0xfffffffffffffffe txntype:unknown reqpath:n/a Error Path:/solr/overseer Error:KeeperErrorCode = NodeExists for /solr/overseer
[junit4:junit4]   2> 13963 T2727 oasc.OverseerCollectionProcessor.run Process current queue of collection creations
[junit4:junit4]   2> 13965 T2698 oazs.PrepRequestProcessor.pRequest Got user-level KeeperException when processing sessionid:0x139ca2c76d40003 type:delete cxid:0x55 zxid:0xfffffffffffffffe txntype:unknown reqpath:n/a Error Path:/solr/collections/collection1/leaders/shard1 Error:KeeperErrorCode = NoNode for /solr/collections/collection1/leaders/shard1
[junit4:junit4]   2> 13969 T2709 oasc.ShardLeaderElectionContext.runLeaderProcess Running the leader process.
[junit4:junit4]   2> 13969 T2726 oasc.Overseer$ClusterStateUpdater.run Starting to work on the main queue
[junit4:junit4]   2> 13973 T2698 oazs.PrepRequestProcessor.pRequest Got user-level KeeperException when processing sessionid:0x139ca2c76d40003 type:create cxid:0x58 zxid:0xfffffffffffffffe txntype:unknown reqpath:n/a Error Path:/solr/overseer Error:KeeperErrorCode = NodeExists for /solr/overseer
[junit4:junit4]   2> 13978 T2709 oasc.ShardLeaderElectionContext.shouldIBeLeader Checking if I should try and be the leader.
[junit4:junit4]   2> 13978 T2709 oasc.ShardLeaderElectionContext.shouldIBeLeader My last published State was Active, it's okay to be the leader.
[junit4:junit4]   2> 13978 T2709 oasc.ShardLeaderElectionContext.runLeaderProcess I may be the new leader - try and sync
[junit4:junit4]   2> 13978 T2709 oasc.ShardLeaderElectionContext.runLeaderProcess I am the new leader: http://127.0.0.1:7001/solr/collection1/
[junit4:junit4]   2> 13978 T2709 oascc.SolrZkClient.makePath makePath: /collections/collection1/leaders/shard1
[junit4:junit4]   2> 13980 T2726 oascc.ZkStateReader.updateClusterState Updating cloud state from ZooKeeper... 
[junit4:junit4]   2> 13995 T2698 oazs.PrepRequestProcessor.pRequest Got user-level KeeperException when processing sessionid:0x139ca2c76d40003 type:create cxid:0x69 zxid:0xfffffffffffffffe txntype:unknown reqpath:n/a Error Path:/solr/overseer Error:KeeperErrorCode = NodeExists for /solr/overseer
[junit4:junit4]   2> 14003 T2709 oascc.ZkStateReader$3.process Updating live nodes
[junit4:junit4]   2> 14017 T2718 oascc.ZkStateReader$2.process A cluster state change has occurred - updating...
[junit4:junit4]   2> 14018 T2712 oascc.ZkStateReader$2.process A cluster state change has occurred - updating...
[junit4:junit4]   2> 14018 T2715 oascc.ZkStateReader$2.process A cluster state change has occurred - updating...
[junit4:junit4]   2> 14018 T2724 oascc.ZkStateReader$2.process A cluster state change has occurred - updating...
[junit4:junit4]   2> 14019 T2721 oascc.ZkStateReader$2.process A cluster state change has occurred - updating...
[junit4:junit4]   2> 14033 T2709 oascc.ZkStateReader$2.process A cluster state change has occurred - updating...
[junit4:junit4]   2> 14589 T2695 oazs.NIOServerCnxn.readConnectRequest Client attempting to renew session 0x139ca2c76d40002 at /127.0.0.1:63301
[junit4:junit4]   2> 14590 T2695 oazs.NIOServerCnxn.finishSessionInit Invalid session 0x139ca2c76d40002 for client /127.0.0.1:63301, probably expired
[junit4:junit4]   2> 14590 T2695 oazs.NIOServerCnxn.closeSock Closed socket connection for client /127.0.0.1:63301 which had sessionid 0x139ca2c76d40002
[junit4:junit4]   2> 14593 T2703 oaz.ClientCnxn$SendThread.run WARNING Session 0x139ca2c76d40002 for server 127.0.0.1/127.0.0.1:63273, unexpected error, closing socket connection and attempting reconnect java.io.IOException: An established connection was aborted by the software in your host machine
[junit4:junit4]   2> 	at sun.nio.ch.SocketDispatcher.read0(Native Method)
[junit4:junit4]   2> 	at sun.nio.ch.SocketDispatcher.read(SocketDispatcher.java:43)
[junit4:junit4]   2> 	at sun.nio.ch.IOUtil.readIntoNativeBuffer(IOUtil.java:218)
[junit4:junit4]   2> 	at sun.nio.ch.IOUtil.read(IOUtil.java:191)
[junit4:junit4]   2> 	at sun.nio.ch.SocketChannelImpl.read(SocketChannelImpl.java:359)
[junit4:junit4]   2> 	at org.apache.zookeeper.ClientCnxn$SendThread.doIO(ClientCnxn.java:856)
[junit4:junit4]   2> 	at org.apache.zookeeper.ClientCnxn$SendThread.run(ClientCnxn.java:1154)
[junit4:junit4]   2> 
[junit4:junit4]   2> 16718 T2693 oasc.CoreContainer.shutdown Shutting down CoreContainer instance=32118351
[junit4:junit4]   2> 16719 T2693 oasc.SolrCore.close [collection1]  CLOSING SolrCore org.apache.solr.core.SolrCore@128b283
[junit4:junit4]   2> 16730 T2693 oasc.SolrCore.closeSearcher [collection1] Closing main searcher on request.
[junit4:junit4]   2> 16730 T2693 oasu.DirectUpdateHandler2.close closing DirectUpdateHandler2{commits=0,autocommits=0,soft autocommits=0,optimizes=0,rollbacks=0,expungeDeletes=0,docsPending=0,adds=0,deletesById=0,deletesByQuery=0,errors=0,cumulative_adds=0,cumulative_deletesById=0,cumulative_deletesByQuery=0,cumulative_errors=0}
[junit4:junit4]   2> 16731 T2693 oasu.DefaultSolrCoreState.decref SolrCoreState ref count has reached 0 - closing IndexWriter
[junit4:junit4]   2> 16732 T2693 oasu.DefaultSolrCoreState.decref Closing SolrCoreState - canceling any ongoing recovery
[junit4:junit4]   2> 16733 T2698 oazs.PrepRequestProcessor.pRequest Processed session termination for sessionid: 0x139ca2c76d40004
[junit4:junit4]   2> 16736 T2718 oascc.ZkStateReader$3.process Updating live nodes
[junit4:junit4]   2> 16737 T2712 oascc.ZkStateReader$3.process Updating live nodes
[junit4:junit4]   2> 16737 T2724 oascc.ZkStateReader$3.process Updating live nodes
[junit4:junit4]   2> 16737 T2695 oazs.NIOServerCnxn.closeSock Closed socket connection for client /127.0.0.1:63288 which had sessionid 0x139ca2c76d40004
[junit4:junit4]   2> 16738 T2715 oascc.ZkStateReader$3.process Updating live nodes
[junit4:junit4]   2> 1

[...truncated too long message...]

apache.solr.cloud.Overseer.createOverseerNode(Overseer.java:524)
[junit4:junit4]   2> 	at org.apache.solr.cloud.Overseer.getInQueue(Overseer.java:497)
[junit4:junit4]   2> 	at org.apache.solr.cloud.Overseer$ClusterStateUpdater.<init>(Overseer.java:67)
[junit4:junit4]   2> 	at org.apache.solr.cloud.Overseer.start(Overseer.java:469)
[junit4:junit4]   2> 	at org.apache.solr.cloud.OverseerElectionContext.runLeaderProcess(ElectionContext.java:372)
[junit4:junit4]   2> 	at org.apache.solr.cloud.LeaderElector.runIamLeaderProcess(LeaderElector.java:158)
[junit4:junit4]   2> 	at org.apache.solr.cloud.LeaderElector.checkIfIamLeader(LeaderElector.java:102)
[junit4:junit4]   2> 	at org.apache.solr.cloud.LeaderElector.access$000(LeaderElector.java:56)
[junit4:junit4]   2> 	at org.apache.solr.cloud.LeaderElector$1.process(LeaderElector.java:131)
[junit4:junit4]   2> 	at org.apache.zookeeper.ClientCnxn$EventThread.processEvent(ClientCnxn.java:526)
[junit4:junit4]   2> 	at org.apache.zookeeper.ClientCnxn$EventThread.run(ClientCnxn.java:502)
[junit4:junit4]   2> Caused by: org.apache.zookeeper.KeeperException$SessionExpiredException: KeeperErrorCode = Session expired for /overseer
[junit4:junit4]   2> 	at org.apache.zookeeper.KeeperException.create(KeeperException.java:118)
[junit4:junit4]   2> 	at org.apache.zookeeper.KeeperException.create(KeeperException.java:42)
[junit4:junit4]   2> 	at org.apache.zookeeper.ZooKeeper.create(ZooKeeper.java:643)
[junit4:junit4]   2> 	at org.apache.solr.common.cloud.SolrZkClient$9.execute(SolrZkClient.java:349)
[junit4:junit4]   2> 	at org.apache.solr.common.cloud.SolrZkClient$9.execute(SolrZkClient.java:346)
[junit4:junit4]   2> 	at org.apache.solr.common.cloud.ZkCmdExecutor.retryOperation(ZkCmdExecutor.java:67)
[junit4:junit4]   2> 	at org.apache.solr.common.cloud.SolrZkClient.create(SolrZkClient.java:346)
[junit4:junit4]   2> 	at org.apache.solr.cloud.Overseer.createOverseerNode(Overseer.java:515)
[junit4:junit4]   2> 	... 10 more
[junit4:junit4]   2> 
[junit4:junit4]   2> 61032 T2754 oaz.ClientCnxn$EventThread.run EventThread shut down
[junit4:junit4]   2> 61037 T2693 oazs.FinalRequestProcessor.shutdown shutdown of request processor complete
[junit4:junit4]   2> 61037 T2757 oascc.ZkStateReader$3.process Updating live nodes
[junit4:junit4]   2> 61037 T2693 oas.SolrTestCaseJ4.tearDown ###Ending testSimpleSliceLeaderElection
[junit4:junit4]   2> 61038 T2757 oascc.ZkStateReader$3.process WARNING ZooKeeper watch triggered, but Solr cannot talk to ZK
[junit4:junit4]   2> 61038 T2757 oaz.ClientCnxn$EventThread.run EventThread shut down
[junit4:junit4]   2> 62505 T2693 oas.SolrTestCaseJ4.deleteCore ###deleteCore
[junit4:junit4]   2> 62666 T2692 ccr.ThreadLeakControl.checkThreadLeaks WARNING Will linger awaiting termination of 1 leaked thread(s).
[junit4:junit4]   2> 64653 T2704 oasc.SolrException.log SEVERE :org.apache.zookeeper.KeeperException$SessionExpiredException: KeeperErrorCode = Session expired for /overseer_elect/election/88323960031412233-127.0.0.1:7000_solr-n_
[junit4:junit4]   2> 		at org.apache.zookeeper.KeeperException.create(KeeperException.java:118)
[junit4:junit4]   2> 		at org.apache.zookeeper.KeeperException.create(KeeperException.java:42)
[junit4:junit4]   2> 		at org.apache.zookeeper.ZooKeeper.create(ZooKeeper.java:643)
[junit4:junit4]   2> 		at org.apache.solr.common.cloud.SolrZkClient.create(SolrZkClient.java:354)
[junit4:junit4]   2> 		at org.apache.solr.cloud.LeaderElector.joinElection(LeaderElector.java:229)
[junit4:junit4]   2> 		at org.apache.solr.cloud.ZkController$1.command(ZkController.java:221)
[junit4:junit4]   2> 		at org.apache.solr.common.cloud.ConnectionManager$1.update(ConnectionManager.java:117)
[junit4:junit4]   2> 		at org.apache.solr.common.cloud.DefaultConnectionStrategy.reconnect(DefaultConnectionStrategy.java:47)
[junit4:junit4]   2> 		at org.apache.solr.common.cloud.ConnectionManager.process(ConnectionManager.java:91)
[junit4:junit4]   2> 		at org.apache.zookeeper.ClientCnxn$EventThread.processEvent(ClientCnxn.java:526)
[junit4:junit4]   2> 		at org.apache.zookeeper.ClientCnxn$EventThread.run(ClientCnxn.java:502)
[junit4:junit4]   2> 	
[junit4:junit4]   2> 64654 T2704 oasc.SolrException.log SEVERE Reconnect to ZooKeeper failed:org.apache.solr.common.cloud.ZooKeeperException: 
[junit4:junit4]   2> 		at org.apache.solr.cloud.ZkController$1.command(ZkController.java:251)
[junit4:junit4]   2> 		at org.apache.solr.common.cloud.ConnectionManager$1.update(ConnectionManager.java:117)
[junit4:junit4]   2> 		at org.apache.solr.common.cloud.DefaultConnectionStrategy.reconnect(DefaultConnectionStrategy.java:47)
[junit4:junit4]   2> 		at org.apache.solr.common.cloud.ConnectionManager.process(ConnectionManager.java:91)
[junit4:junit4]   2> 		at org.apache.zookeeper.ClientCnxn$EventThread.processEvent(ClientCnxn.java:526)
[junit4:junit4]   2> 		at org.apache.zookeeper.ClientCnxn$EventThread.run(ClientCnxn.java:502)
[junit4:junit4]   2> 	Caused by: org.apache.zookeeper.KeeperException$SessionExpiredException: KeeperErrorCode = Session expired for /overseer_elect/election/88323960031412233-127.0.0.1:7000_solr-n_
[junit4:junit4]   2> 		at org.apache.zookeeper.KeeperException.create(KeeperException.java:118)
[junit4:junit4]   2> 		at org.apache.zookeeper.KeeperException.create(KeeperException.java:42)
[junit4:junit4]   2> 		at org.apache.zookeeper.ZooKeeper.create(ZooKeeper.java:643)
[junit4:junit4]   2> 		at org.apache.solr.common.cloud.SolrZkClient.create(SolrZkClient.java:354)
[junit4:junit4]   2> 		at org.apache.solr.cloud.LeaderElector.joinElection(LeaderElector.java:229)
[junit4:junit4]   2> 		at org.apache.solr.cloud.ZkController$1.command(ZkController.java:221)
[junit4:junit4]   2> 		... 5 more
[junit4:junit4]   2> 	
[junit4:junit4]   2> 64654 T2704 oascc.DefaultConnectionStrategy.reconnect Reconnect to ZooKeeper failed
[junit4:junit4]   2> 64654 T2704 oascc.ConnectionManager.process Connected:true
[junit4:junit4]   2> 64654 T2704 oaz.ClientCnxn$EventThread.run EventThread shut down
[junit4:junit4]   2> NOTE: test params are: codec=Lucene40: {}, sim=DefaultSimilarity, locale=ca, timezone=America/Jujuy
[junit4:junit4]   2> NOTE: Windows 7 6.1 x86/Oracle Corporation 1.7.0_07 (32-bit)/cpus=2,threads=1,free=58655888,total=152444928
[junit4:junit4]   2> NOTE: All tests run in this JVM: [URLClassifyProcessorTest, TestBadConfig, TestSuggestSpellingConverter, OutputWriterTest, TestCollationKeyRangeQueries, XsltUpdateRequestHandlerTest, TestRemoteStreaming, JSONWriterTest, SolrPluginUtilsTest, QueryElevationComponentTest, HighlighterConfigTest, StatelessScriptUpdateProcessorFactoryTest, CurrencyFieldTest, IndexBasedSpellCheckerTest, TestDefaultSimilarityFactory, SuggesterTest, BasicZkTest, NoCacheHeaderTest, TestDocSet, TestSolrCoreProperties, ScriptEngineTest, DistributedQueryElevationComponentTest, MinimalSchemaTest, TestFaceting, SOLR749Test, SolrRequestParserTest, SpatialFilterTest, ZkCLITest, SolrIndexConfigTest, TestIBSimilarityFactory, TestFastOutputStream, TestElisionMultitermQuery, UUIDFieldTest, NumericFieldsTest, SyncSliceTest, TestStressVersions, RequestHandlersTest, SuggesterFSTTest, TestStressRecovery, SpellPossibilityIteratorTest, DistributedTermsComponentTest, MBeansHandlerTest, TestJmxMonitoredMap, IndexReaderFactoryTest, SolrCoreTest, TimeZoneUtilsTest, TestRealTimeGet, SortByFunctionTest, LegacyHTMLStripCharFilterTest, TestBM25SimilarityFactory, TestMergePolicyConfig, TestPropInject, TestRTGBase, TestDFRSimilarityFactory, TestQuerySenderListener, TestCodecSupport, TestWordDelimiterFilterFactory, TestStressReorder, JsonLoaderTest, TestCSVResponseWriter, TestCoreContainer, TestDistributedSearch, BasicFunctionalityTest, TestXIncludeConfig, SearchHandlerTest, UniqFieldsUpdateProcessorFactoryTest, TestRangeQuery, QueryEqualityTest, TestArbitraryIndexDir, TestPseudoReturnFields, DirectUpdateHandlerTest, TermsComponentTest, PrimUtilsTest, TestRandomFaceting, TestLRUCache, TestCollationField, DebugComponentTest, UpdateRequestProcessorFactoryTest, TestBinaryField, TermVectorComponentDistributedTest, SolrCoreCheckLockOnStartupTest, ShowFileRequestHandlerTest, SolrCmdDistributorTest, TestFoldingMultitermQuery, FileUtilsTest, CacheHeaderTest, BasicDistributedZkTest, TestSolrJ, TestUtils, PrimitiveFieldTypeTest, TestFastLRUCache, BasicDistributedZk2Test, CoreContainerCoreInitFailuresTest, ConvertedLegacyTest, MoreLikeThisHandlerTest, TestNumberUtils, ResourceLoaderTest, TestQueryTypes, TestSolrQueryParser, TestQuerySenderNoQuery, TestRecovery, BadComponentTest, PingRequestHandlerTest, TestIndexingPerformance, StandardRequestHandlerTest, CoreAdminHandlerTest, LukeRequestHandlerTest, FieldMutatingUpdateProcessorTest, TestCharFilters, TestFastWriter, OverseerTest, RecoveryZkTest, SpellCheckComponentTest, FullSolrCloudDistribCmdsTest, TestReplicationHandler, LeaderElectionIntegrationTest]
[junit4:junit4] Completed in 64.84s, 2 tests, 1 failure <<< FAILURES!

[...truncated 336 lines...]
BUILD FAILED
C:\Jenkins\workspace\Lucene-Solr-4.x-Windows\build.xml:32: The following error occurred while executing this line:
C:\Jenkins\workspace\Lucene-Solr-4.x-Windows\solr\build.xml:146: The following error occurred while executing this line:
C:\Jenkins\workspace\Lucene-Solr-4.x-Windows\lucene\module-build.xml:63: The following error occurred while executing this line:
C:\Jenkins\workspace\Lucene-Solr-4.x-Windows\lucene\common-build.xml:1133: The following error occurred while executing this line:
C:\Jenkins\workspace\Lucene-Solr-4.x-Windows\lucene\common-build.xml:810: There were test failures: 229 suites, 927 tests, 1 error, 1 failure, 11 ignored (6 assumptions)

Total time: 38 minutes 53 seconds
Build step 'Invoke Ant' marked build as failure
Recording test results
Description set: Java: 32bit/jdk1.7.0_07 -server -XX:+UseConcMarkSweepGC
Email was triggered for: Failure
Sending email for trigger: Failure



Mime
View raw message