lucene-dev mailing list archives

Site index · List index
Message view « Date » · « Thread »
Top « Date » · « Thread »
From Apache Jenkins Server <jenk...@builds.apache.org>
Subject [JENKINS] Lucene-Solr-Tests-trunk-java7 - Build # 3245 - Still Failing
Date Sun, 23 Sep 2012 03:18:21 GMT
Build: https://builds.apache.org/job/Lucene-Solr-Tests-trunk-java7/3245/

1 tests failed.
FAILED:  org.apache.solr.cloud.SyncSliceTest.testDistribSearch

Error Message:
There are still nodes recoverying

Stack Trace:
java.lang.AssertionError: There are still nodes recoverying
	at __randomizedtesting.SeedInfo.seed([35A18BF99C233859:B44705E1EB7C5865]:0)
	at org.junit.Assert.fail(Assert.java:93)
	at org.apache.solr.cloud.AbstractDistribZkTestBase.waitForRecoveriesToFinish(AbstractDistribZkTestBase.java:154)
	at org.apache.solr.cloud.AbstractFullDistribZkTestBase.waitForRecoveriesToFinish(AbstractFullDistribZkTestBase.java:565)
	at org.apache.solr.cloud.AbstractFullDistribZkTestBase.waitForThingsToLevelOut(AbstractFullDistribZkTestBase.java:1140)
	at org.apache.solr.cloud.SyncSliceTest.doTest(SyncSliceTest.java:162)
	at org.apache.solr.BaseDistributedSearchTestCase.testDistribSearch(BaseDistributedSearchTestCase.java:695)
	at sun.reflect.NativeMethodAccessorImpl.invoke0(Native Method)
	at sun.reflect.NativeMethodAccessorImpl.invoke(NativeMethodAccessorImpl.java:57)
	at sun.reflect.DelegatingMethodAccessorImpl.invoke(DelegatingMethodAccessorImpl.java:43)
	at java.lang.reflect.Method.invoke(Method.java:601)
	at com.carrotsearch.randomizedtesting.RandomizedRunner.invoke(RandomizedRunner.java:1559)
	at com.carrotsearch.randomizedtesting.RandomizedRunner.access$600(RandomizedRunner.java:79)
	at com.carrotsearch.randomizedtesting.RandomizedRunner$6.evaluate(RandomizedRunner.java:737)
	at com.carrotsearch.randomizedtesting.RandomizedRunner$7.evaluate(RandomizedRunner.java:773)
	at com.carrotsearch.randomizedtesting.RandomizedRunner$8.evaluate(RandomizedRunner.java:787)
	at com.carrotsearch.randomizedtesting.rules.SystemPropertiesRestoreRule$1.evaluate(SystemPropertiesRestoreRule.java:53)
	at org.apache.lucene.util.TestRuleSetupTeardownChained$1.evaluate(TestRuleSetupTeardownChained.java:50)
	at org.apache.lucene.util.TestRuleFieldCacheSanity$1.evaluate(TestRuleFieldCacheSanity.java:51)
	at org.apache.lucene.util.AbstractBeforeAfterRule$1.evaluate(AbstractBeforeAfterRule.java:45)
	at com.carrotsearch.randomizedtesting.rules.SystemPropertiesInvariantRule$1.evaluate(SystemPropertiesInvariantRule.java:55)
	at org.apache.lucene.util.TestRuleThreadAndTestName$1.evaluate(TestRuleThreadAndTestName.java:48)
	at org.apache.lucene.util.TestRuleIgnoreAfterMaxFailures$1.evaluate(TestRuleIgnoreAfterMaxFailures.java:70)
	at org.apache.lucene.util.TestRuleMarkFailure$1.evaluate(TestRuleMarkFailure.java:48)
	at com.carrotsearch.randomizedtesting.rules.StatementAdapter.evaluate(StatementAdapter.java:36)
	at com.carrotsearch.randomizedtesting.ThreadLeakControl$StatementRunner.run(ThreadLeakControl.java:358)
	at com.carrotsearch.randomizedtesting.ThreadLeakControl.forkTimeoutingTask(ThreadLeakControl.java:782)
	at com.carrotsearch.randomizedtesting.ThreadLeakControl$3.evaluate(ThreadLeakControl.java:442)
	at com.carrotsearch.randomizedtesting.RandomizedRunner.runSingleTest(RandomizedRunner.java:746)
	at com.carrotsearch.randomizedtesting.RandomizedRunner$3.evaluate(RandomizedRunner.java:648)
	at com.carrotsearch.randomizedtesting.RandomizedRunner$4.evaluate(RandomizedRunner.java:682)
	at com.carrotsearch.randomizedtesting.RandomizedRunner$5.evaluate(RandomizedRunner.java:693)
	at com.carrotsearch.randomizedtesting.rules.StatementAdapter.evaluate(StatementAdapter.java:36)
	at com.carrotsearch.randomizedtesting.rules.SystemPropertiesRestoreRule$1.evaluate(SystemPropertiesRestoreRule.java:53)
	at org.apache.lucene.util.AbstractBeforeAfterRule$1.evaluate(AbstractBeforeAfterRule.java:45)
	at org.apache.lucene.util.TestRuleStoreClassName$1.evaluate(TestRuleStoreClassName.java:42)
	at com.carrotsearch.randomizedtesting.rules.SystemPropertiesInvariantRule$1.evaluate(SystemPropertiesInvariantRule.java:55)
	at com.carrotsearch.randomizedtesting.rules.NoShadowingOrOverridesOnMethodsRule$1.evaluate(NoShadowingOrOverridesOnMethodsRule.java:39)
	at com.carrotsearch.randomizedtesting.rules.NoShadowingOrOverridesOnMethodsRule$1.evaluate(NoShadowingOrOverridesOnMethodsRule.java:39)
	at com.carrotsearch.randomizedtesting.rules.StatementAdapter.evaluate(StatementAdapter.java:36)
	at org.apache.lucene.util.TestRuleAssertionsRequired$1.evaluate(TestRuleAssertionsRequired.java:43)
	at org.apache.lucene.util.TestRuleMarkFailure$1.evaluate(TestRuleMarkFailure.java:48)
	at org.apache.lucene.util.TestRuleIgnoreAfterMaxFailures$1.evaluate(TestRuleIgnoreAfterMaxFailures.java:70)
	at org.apache.lucene.util.TestRuleIgnoreTestSuites$1.evaluate(TestRuleIgnoreTestSuites.java:55)
	at com.carrotsearch.randomizedtesting.rules.StatementAdapter.evaluate(StatementAdapter.java:36)
	at com.carrotsearch.randomizedtesting.ThreadLeakControl$StatementRunner.run(ThreadLeakControl.java:358)
	at java.lang.Thread.run(Thread.java:722)




Build Log:
[...truncated 8328 lines...]
[junit4:junit4] Suite: org.apache.solr.cloud.SyncSliceTest
[junit4:junit4]   2> 5 T1620 oas.SolrTestCaseJ4.setUp ###Starting testDistribSearch
[junit4:junit4]   2> Creating dataDir: /usr/home/hudson/hudson-slave/workspace/Lucene-Solr-Tests-trunk-java7/solr/build/solr-core/test/J0/./solrtest-SyncSliceTest-1348370151366
[junit4:junit4]   2> 6 T1620 oasc.ZkTestServer.run STARTING ZK TEST SERVER
[junit4:junit4]   2> 10 T1621 oazs.ZooKeeperServer.setTickTime tickTime set to 1000
[junit4:junit4]   2> 10 T1621 oazs.NIOServerCnxn$Factory.<init> binding to port 0.0.0.0/0.0.0.0:0
[junit4:junit4]   2> 12 T1621 oazsp.FileTxnSnapLog.save Snapshotting: 0
[junit4:junit4]   2> 108 T1620 oasc.ZkTestServer.run start zk server on port:39054
[junit4:junit4]   2> 109 T1620 oaz.ZooKeeper.<init> Initiating client connection, connectString=127.0.0.1:39054 sessionTimeout=10000 watcher=org.apache.solr.common.cloud.ConnectionManager@369b0b1a
[junit4:junit4]   2> 109 T1626 oaz.ClientCnxn$SendThread.startConnect Opening socket connection to server /127.0.0.1:39054
[junit4:junit4]   2> 109 T1620 oascc.ConnectionManager.waitForConnected Waiting for client to connect to ZooKeeper
[junit4:junit4]   2> 111 T1626 oaz.ClientCnxn$SendThread.primeConnection Socket connection established to localhost/127.0.0.1:39054, initiating session
[junit4:junit4]   2> 111 T1622 oazs.NIOServerCnxn$Factory.run Accepted socket connection from /140.211.11.196:39055
[junit4:junit4]   2> 112 T1622 oazs.NIOServerCnxn.readConnectRequest Client attempting to establish new session at /140.211.11.196:39055
[junit4:junit4]   2> 112 T1624 oazsp.FileTxnLog.append Creating new log file: log.1
[junit4:junit4]   2> 117 T1624 oazs.NIOServerCnxn.finishSessionInit Established session 0x139f11fb7cd0000 with negotiated timeout 10000 for client /140.211.11.196:39055
[junit4:junit4]   2> 117 T1626 oaz.ClientCnxn$SendThread.readConnectResult Session establishment complete on server localhost/127.0.0.1:39054, sessionid = 0x139f11fb7cd0000, negotiated timeout = 10000
[junit4:junit4]   2> 117 T1627 oascc.ConnectionManager.process Watcher org.apache.solr.common.cloud.ConnectionManager@369b0b1a name:ZooKeeperConnection Watcher:127.0.0.1:39054 got event WatchedEvent state:SyncConnected type:None path:null path:null type:None
[junit4:junit4]   2> 118 T1620 oascc.ConnectionManager.waitForConnected Client is connected to ZooKeeper
[junit4:junit4]   2> 118 T1620 oascc.SolrZkClient.makePath makePath: /solr
[junit4:junit4]   2> 121 T1625 oazs.PrepRequestProcessor.pRequest Processed session termination for sessionid: 0x139f11fb7cd0000
[junit4:junit4]   2> 135 T1627 oaz.ClientCnxn$EventThread.run EventThread shut down
[junit4:junit4]   2> 135 T1620 oaz.ZooKeeper.close Session: 0x139f11fb7cd0000 closed
[junit4:junit4]   2> 135 T1622 oazs.NIOServerCnxn.closeSock Closed socket connection for client /140.211.11.196:39055 which had sessionid 0x139f11fb7cd0000
[junit4:junit4]   2> 136 T1620 oaz.ZooKeeper.<init> Initiating client connection, connectString=127.0.0.1:39054/solr sessionTimeout=10000 watcher=org.apache.solr.common.cloud.ConnectionManager@1d1c7282
[junit4:junit4]   2> 136 T1628 oaz.ClientCnxn$SendThread.startConnect Opening socket connection to server /127.0.0.1:39054
[junit4:junit4]   2> 136 T1620 oascc.ConnectionManager.waitForConnected Waiting for client to connect to ZooKeeper
[junit4:junit4]   2> 137 T1628 oaz.ClientCnxn$SendThread.primeConnection Socket connection established to localhost/127.0.0.1:39054, initiating session
[junit4:junit4]   2> 138 T1622 oazs.NIOServerCnxn$Factory.run Accepted socket connection from /140.211.11.196:39056
[junit4:junit4]   2> 138 T1622 oazs.NIOServerCnxn.readConnectRequest Client attempting to establish new session at /140.211.11.196:39056
[junit4:junit4]   2> 149 T1624 oazs.NIOServerCnxn.finishSessionInit Established session 0x139f11fb7cd0001 with negotiated timeout 10000 for client /140.211.11.196:39056
[junit4:junit4]   2> 149 T1628 oaz.ClientCnxn$SendThread.readConnectResult Session establishment complete on server localhost/127.0.0.1:39054, sessionid = 0x139f11fb7cd0001, negotiated timeout = 10000
[junit4:junit4]   2> 150 T1629 oascc.ConnectionManager.process Watcher org.apache.solr.common.cloud.ConnectionManager@1d1c7282 name:ZooKeeperConnection Watcher:127.0.0.1:39054/solr got event WatchedEvent state:SyncConnected type:None path:null path:null type:None
[junit4:junit4]   2> 150 T1620 oascc.ConnectionManager.waitForConnected Client is connected to ZooKeeper
[junit4:junit4]   2> 151 T1620 oascc.SolrZkClient.makePath makePath: /collections/collection1
[junit4:junit4]   2> 176 T1620 oascc.SolrZkClient.makePath makePath: /collections/collection1/shards
[junit4:junit4]   2> 179 T1620 oascc.SolrZkClient.makePath makePath: /collections/control_collection
[junit4:junit4]   2> 182 T1620 oascc.SolrZkClient.makePath makePath: /collections/control_collection/shards
[junit4:junit4]   2> 199 T1620 oasc.AbstractZkTestCase.putConfig put /usr/home/hudson/hudson-slave/workspace/Lucene-Solr-Tests-trunk-java7/solr/build/solr-core/test-files/solr/collection1/conf/solrconfig.xml to /configs/conf1/solrconfig.xml
[junit4:junit4]   2> 200 T1620 oascc.SolrZkClient.makePath makePath: /configs/conf1/solrconfig.xml
[junit4:junit4]   2> 230 T1620 oasc.AbstractZkTestCase.putConfig put /usr/home/hudson/hudson-slave/workspace/Lucene-Solr-Tests-trunk-java7/solr/build/solr-core/test-files/solr/collection1/conf/schema.xml to /configs/conf1/schema.xml
[junit4:junit4]   2> 231 T1620 oascc.SolrZkClient.makePath makePath: /configs/conf1/schema.xml
[junit4:junit4]   2> 340 T1620 oasc.AbstractZkTestCase.putConfig put /usr/home/hudson/hudson-slave/workspace/Lucene-Solr-Tests-trunk-java7/solr/build/solr-core/test-files/solr/collection1/conf/solrconfig.xml to /configs/conf1/solrconfig.xml
[junit4:junit4]   2> 341 T1620 oascc.SolrZkClient.makePath makePath: /configs/conf1/solrconfig.xml
[junit4:junit4]   2> 362 T1620 oasc.AbstractZkTestCase.putConfig put /usr/home/hudson/hudson-slave/workspace/Lucene-Solr-Tests-trunk-java7/solr/build/solr-core/test-files/solr/collection1/conf/stopwords.txt to /configs/conf1/stopwords.txt
[junit4:junit4]   2> 363 T1620 oascc.SolrZkClient.makePath makePath: /configs/conf1/stopwords.txt
[junit4:junit4]   2> 379 T1620 oasc.AbstractZkTestCase.putConfig put /usr/home/hudson/hudson-slave/workspace/Lucene-Solr-Tests-trunk-java7/solr/build/solr-core/test-files/solr/collection1/conf/protwords.txt to /configs/conf1/protwords.txt
[junit4:junit4]   2> 380 T1620 oascc.SolrZkClient.makePath makePath: /configs/conf1/protwords.txt
[junit4:junit4]   2> 394 T1620 oasc.AbstractZkTestCase.putConfig put /usr/home/hudson/hudson-slave/workspace/Lucene-Solr-Tests-trunk-java7/solr/build/solr-core/test-files/solr/collection1/conf/currency.xml to /configs/conf1/currency.xml
[junit4:junit4]   2> 395 T1620 oascc.SolrZkClient.makePath makePath: /configs/conf1/currency.xml
[junit4:junit4]   2> 413 T1620 oasc.AbstractZkTestCase.putConfig put /usr/home/hudson/hudson-slave/workspace/Lucene-Solr-Tests-trunk-java7/solr/build/solr-core/test-files/solr/collection1/conf/open-exchange-rates.json to /configs/conf1/open-exchange-rates.json
[junit4:junit4]   2> 414 T1620 oascc.SolrZkClient.makePath makePath: /configs/conf1/open-exchange-rates.json
[junit4:junit4]   2> 417 T1620 oasc.AbstractZkTestCase.putConfig put /usr/home/hudson/hudson-slave/workspace/Lucene-Solr-Tests-trunk-java7/solr/build/solr-core/test-files/solr/collection1/conf/mapping-ISOLatin1Accent.txt to /configs/conf1/mapping-ISOLatin1Accent.txt
[junit4:junit4]   2> 418 T1620 oascc.SolrZkClient.makePath makePath: /configs/conf1/mapping-ISOLatin1Accent.txt
[junit4:junit4]   2> 431 T1620 oasc.AbstractZkTestCase.putConfig put /usr/home/hudson/hudson-slave/workspace/Lucene-Solr-Tests-trunk-java7/solr/build/solr-core/test-files/solr/collection1/conf/old_synonyms.txt to /configs/conf1/old_synonyms.txt
[junit4:junit4]   2> 432 T1620 oascc.SolrZkClient.makePath makePath: /configs/conf1/old_synonyms.txt
[junit4:junit4]   2> 438 T1620 oasc.AbstractZkTestCase.putConfig put /usr/home/hudson/hudson-slave/workspace/Lucene-Solr-Tests-trunk-java7/solr/build/solr-core/test-files/solr/collection1/conf/synonyms.txt to /configs/conf1/synonyms.txt
[junit4:junit4]   2> 438 T1620 oascc.SolrZkClient.makePath makePath: /configs/conf1/synonyms.txt
[junit4:junit4]   2> 441 T1625 oazs.PrepRequestProcessor.pRequest Processed session termination for sessionid: 0x139f11fb7cd0001
[junit4:junit4]   2> 461 T1629 oaz.ClientCnxn$EventThread.run EventThread shut down
[junit4:junit4]   2> 461 T1622 oazs.NIOServerCnxn.closeSock Closed socket connection for client /140.211.11.196:39056 which had sessionid 0x139f11fb7cd0001
[junit4:junit4]   2> 461 T1620 oaz.ZooKeeper.close Session: 0x139f11fb7cd0001 closed
[junit4:junit4]   2> 614 T1620 oejs.Server.doStart jetty-8.1.2.v20120308
[junit4:junit4]   2> 619 T1620 oejs.AbstractConnector.doStart Started SocketConnector@0.0.0.0:39057
[junit4:junit4]   2> 620 T1620 oasc.SolrResourceLoader.locateSolrHome JNDI not configured for solr (NoInitialContextEx)
[junit4:junit4]   2> 620 T1620 oasc.SolrResourceLoader.locateSolrHome using system property solr.solr.home: /usr/home/hudson/hudson-slave/workspace/Lucene-Solr-Tests-trunk-java7/solr/build/solr-core/test/J0/./org.apache.solr.cloud.SyncSliceTest-controljetty-1348370151823
[junit4:junit4]   2> 621 T1620 oasc.SolrResourceLoader.<init> new SolrResourceLoader for deduced Solr Home: '/usr/home/hudson/hudson-slave/workspace/Lucene-Solr-Tests-trunk-java7/solr/build/solr-core/test/J0/./org.apache.solr.cloud.SyncSliceTest-controljetty-1348370151823/'
[junit4:junit4]   2> 662 T1620 oass.SolrDispatchFilter.init SolrDispatchFilter.init()
[junit4:junit4]   2> 663 T1620 oasc.SolrResourceLoader.locateSolrHome JNDI not configured for solr (NoInitialContextEx)
[junit4:junit4]   2> 663 T1620 oasc.SolrResourceLoader.locateSolrHome using system property solr.solr.home: /usr/home/hudson/hudson-slave/workspace/Lucene-Solr-Tests-trunk-java7/solr/build/solr-core/test/J0/./org.apache.solr.cloud.SyncSliceTest-controljetty-1348370151823
[junit4:junit4]   2> 664 T1620 oasc.CoreContainer$Initializer.initialize looking for solr.xml: /usr/home/hudson/hudson-slave/workspace/Lucene-Solr-Tests-trunk-java7/solr/build/solr-core/test/J0/./org.apache.solr.cloud.SyncSliceTest-controljetty-1348370151823/solr.xml
[junit4:junit4]   2> 664 T1620 oasc.CoreContainer.<init> New CoreContainer 635777608
[junit4:junit4]   2> 665 T1620 oasc.CoreContainer.load Loading CoreContainer using Solr Home: '/usr/home/hudson/hudson-slave/workspace/Lucene-Solr-Tests-trunk-java7/solr/build/solr-core/test/J0/./org.apache.solr.cloud.SyncSliceTest-controljetty-1348370151823/'
[junit4:junit4]   2> 665 T1620 oasc.SolrResourceLoader.<init> new SolrResourceLoader for directory: '/usr/home/hudson/hudson-slave/workspace/Lucene-Solr-Tests-trunk-java7/solr/build/solr-core/test/J0/./org.apache.solr.cloud.SyncSliceTest-controljetty-1348370151823/'
[junit4:junit4]   2> 697 T1620 oasc.CoreContainer.load Registering Log Listener
[junit4:junit4]   2> 712 T1620 oasc.CoreContainer.initZooKeeper Zookeeper client=127.0.0.1:39054/solr
[junit4:junit4]   2> 713 T1620 oaz.ZooKeeper.<init> Initiating client connection, connectString=127.0.0.1:39054/solr sessionTimeout=5000 watcher=org.apache.solr.common.cloud.ConnectionManager@701923b9
[junit4:junit4]   2> 714 T1639 oaz.ClientCnxn$SendThread.startConnect Opening socket connection to server /127.0.0.1:39054
[junit4:junit4]   2> 714 T1620 oascc.ConnectionManager.waitForConnected Waiting for client to connect to ZooKeeper
[junit4:junit4]   2> 716 T1639 oaz.ClientCnxn$SendThread.primeConnection Socket connection established to localhost/127.0.0.1:39054, initiating session
[junit4:junit4]   2> 716 T1622 oazs.NIOServerCnxn$Factory.run Accepted socket connection from /140.211.11.196:39058
[junit4:junit4]   2> 716 T1622 oazs.NIOServerCnxn.readConnectRequest Client attempting to establish new session at /140.211.11.196:39058
[junit4:junit4]   2> 718 T1624 oazs.NIOServerCnxn.finishSessionInit Established session 0x139f11fb7cd0002 with negotiated timeout 5000 for client /140.211.11.196:39058
[junit4:junit4]   2> 718 T1639 oaz.ClientCnxn$SendThread.readConnectResult Session establishment complete on server localhost/127.0.0.1:39054, sessionid = 0x139f11fb7cd0002, negotiated timeout = 5000
[junit4:junit4]   2> 718 T1640 oascc.ConnectionManager.process Watcher org.apache.solr.common.cloud.ConnectionManager@701923b9 name:ZooKeeperConnection Watcher:127.0.0.1:39054/solr got event WatchedEvent state:SyncConnected type:None path:null path:null type:None
[junit4:junit4]   2> 719 T1620 oascc.ConnectionManager.waitForConnected Client is connected to ZooKeeper
[junit4:junit4]   2> 721 T1625 oazs.PrepRequestProcessor.pRequest Got user-level KeeperException when processing sessionid:0x139f11fb7cd0002 type:create cxid:0x2 zxid:0xfffffffffffffffe txntype:unknown reqpath:n/a Error Path:/solr/overseer Error:KeeperErrorCode = NodeExists for /solr/overseer
[junit4:junit4]   2> 735 T1620 oascc.SolrZkClient.makePath makePath: /live_nodes
[junit4:junit4]   2> 738 T1620 oasc.ZkController.createEphemeralLiveNode Register node as live in ZooKeeper:/live_nodes/127.0.0.1:39057_solr
[junit4:junit4]   2> 738 T1625 oazs.PrepRequestProcessor.pRequest Got user-level KeeperException when processing sessionid:0x139f11fb7cd0002 type:delete cxid:0x7 zxid:0xfffffffffffffffe txntype:unknown reqpath:n/a Error Path:/solr/live_nodes/127.0.0.1:39057_solr Error:KeeperErrorCode = NoNode for /solr/live_nodes/127.0.0.1:39057_solr
[junit4:junit4]   2> 750 T1620 oascc.SolrZkClient.makePath makePath: /live_nodes/127.0.0.1:39057_solr
[junit4:junit4]   2> 752 T1620 oashc.HttpShardHandlerFactory.getParameter Setting socketTimeout to: 0
[junit4:junit4]   2> 753 T1620 oashc.HttpShardHandlerFactory.getParameter Setting urlScheme to: http://
[junit4:junit4]   2> 754 T1620 oashc.HttpShardHandlerFactory.getParameter Setting connTimeout to: 0
[junit4:junit4]   2> 754 T1620 oashc.HttpShardHandlerFactory.getParameter Setting maxConnectionsPerHost to: 20
[junit4:junit4]   2> 755 T1620 oashc.HttpShardHandlerFactory.getParameter Setting corePoolSize to: 0
[junit4:junit4]   2> 755 T1620 oashc.HttpShardHandlerFactory.getParameter Setting maximumPoolSize to: 2147483647
[junit4:junit4]   2> 756 T1620 oashc.HttpShardHandlerFactory.getParameter Setting maxThreadIdleTime to: 5
[junit4:junit4]   2> 756 T1620 oashc.HttpShardHandlerFactory.getParameter Setting sizeOfQueue to: -1
[junit4:junit4]   2> 756 T1620 oashc.HttpShardHandlerFactory.getParameter Setting fairnessPolicy to: false
[junit4:junit4]   2> 757 T1620 oascsi.HttpClientUtil.createClient Creating new http client, config:maxConnectionsPerHost=20&maxConnections=10000&socketTimeout=0&connTimeout=0&retry=false
[junit4:junit4]   2> 770 T1620 oascc.SolrZkClient.makePath makePath: /overseer_elect/election
[junit4:junit4]   2> 787 T1625 oazs.PrepRequestProcessor.pRequest Got user-level KeeperException when processing sessionid:0x139f11fb7cd0002 type:delete cxid:0x15 zxid:0xfffffffffffffffe txntype:unknown reqpath:n/a Error Path:/solr/overseer_elect/leader Error:KeeperErrorCode = NoNode for /solr/overseer_elect/leader
[junit4:junit4]   2> 794 T1620 oascc.SolrZkClient.makePath makePath: /overseer_elect/leader
[junit4:junit4]   2> 797 T1620 oasc.Overseer.start Overseer (id=88366786240380930-127.0.0.1:39057_solr-n_0000000000) starting
[junit4:junit4]   2> 797 T1625 oazs.PrepRequestProcessor.pRequest Got user-level KeeperException when processing sessionid:0x139f11fb7cd0002 type:create cxid:0x1a zxid:0xfffffffffffffffe txntype:unknown reqpath:n/a Error Path:/solr/overseer Error:KeeperErrorCode = NodeExists for /solr/overseer
[junit4:junit4]   2> 810 T1625 oazs.PrepRequestProcessor.pRequest Got user-level KeeperException when processing sessionid:0x139f11fb7cd0002 type:create cxid:0x1b zxid:0xfffffffffffffffe txntype:unknown reqpath:n/a Error Path:/solr/overseer Error:KeeperErrorCode = NodeExists for /solr/overseer
[junit4:junit4]   2> 812 T1625 oazs.PrepRequestProcessor.pRequest Got user-level KeeperException when processing sessionid:0x139f11fb7cd0002 type:create cxid:0x1c zxid:0xfffffffffffffffe txntype:unknown reqpath:n/a Error Path:/solr/overseer Error:KeeperErrorCode = NodeExists for /solr/overseer
[junit4:junit4]   2> 832 T1625 oazs.PrepRequestProcessor.pRequest Got user-level KeeperException when processing sessionid:0x139f11fb7cd0002 type:create cxid:0x1d zxid:0xfffffffffffffffe txntype:unknown reqpath:n/a Error Path:/solr/overseer Error:KeeperErrorCode = NodeExists for /solr/overseer
[junit4:junit4]   2> 834 T1642 oasc.OverseerCollectionProcessor.run Process current queue of collection creations
[junit4:junit4]   2> 834 T1620 oascc.SolrZkClient.makePath makePath: /clusterstate.json
[junit4:junit4]   2> 865 T1620 oascc.ZkStateReader.createClusterStateWatchersAndUpdate Updating cluster state from ZooKeeper... 
[junit4:junit4]   2> 871 T1620 oasc.CoreContainer.create Creating SolrCore 'collection1' using instanceDir: /usr/home/hudson/hudson-slave/workspace/Lucene-Solr-Tests-trunk-java7/solr/build/solr-core/test/J0/./org.apache.solr.cloud.SyncSliceTest-controljetty-1348370151823/collection1
[junit4:junit4]   2> 872 T1620 oasc.ZkController.createCollectionZkNode Check for collection zkNode:control_collection
[junit4:junit4]   2> 872 T1641 oasc.Overseer$ClusterStateUpdater.run Starting to work on the main queue
[junit4:junit4]   2> 872 T1620 oasc.ZkController.createCollectionZkNode Collection zkNode exists
[junit4:junit4]   2> 873 T1620 oasc.ZkController.readConfigName Load collection config from:/collections/control_collection
[junit4:junit4]   2> 874 T1620 oasc.SolrResourceLoader.<init> new SolrResourceLoader for directory: '/usr/home/hudson/hudson-slave/workspace/Lucene-Solr-Tests-trunk-java7/solr/build/solr-core/test/J0/./org.apache.solr.cloud.SyncSliceTest-controljetty-1348370151823/collection1/'
[junit4:junit4]   2> 876 T1620 oasc.SolrResourceLoader.replaceClassLoader Adding 'file:/usr/home/hudson/hudson-slave/workspace/Lucene-Solr-Tests-trunk-java7/solr/build/solr-core/test/J0/org.apache.solr.cloud.SyncSliceTest-controljetty-1348370151823/collection1/lib/README' to classloader
[junit4:junit4]   2> 876 T1620 oasc.SolrResourceLoader.replaceClassLoader Adding 'file:/usr/home/hudson/hudson-slave/workspace/Lucene-Solr-Tests-trunk-java7/solr/build/solr-core/test/J0/org.apache.solr.cloud.SyncSliceTest-controljetty-1348370151823/collection1/lib/classes/' to classloader
[junit4:junit4]   2> 928 T1620 oasc.SolrConfig.<init> Using Lucene MatchVersion: LUCENE_50
[junit4:junit4]   2> 999 T1620 oasc.SolrConfig.<init> Loaded SolrConfig: solrconfig.xml
[junit4:junit4]   2> 1100 T1620 oass.IndexSchema.readSchema Reading Solr Schema
[junit4:junit4]   2> 1112 T1620 oass.IndexSchema.readSchema Schema name=test
[junit4:junit4]   2> 1904 T1620 oass.OpenExchangeRatesOrgProvider.init Initialized with rates=open-exchange-rates.json, refreshInterval=1440.
[junit4:junit4]   2> 1927 T1620 oass.IndexSchema.readSchema default search field in schema is text
[junit4:junit4]   2> 1931 T1620 oass.IndexSchema.readSchema unique key field: id
[junit4:junit4]   2> 1945 T1620 oass.FileExchangeRateProvider.reload Reloading exchange rates from file currency.xml
[junit4:junit4]   2> 1951 T1620 oass.FileExchangeRateProvider.reload Reloading exchange rates from file currency.xml
[junit4:junit4]   2> 1956 T1620 oass.OpenExchangeRatesOrgProvider.reload Reloading exchange rates from open-exchange-rates.json
[junit4:junit4]   2> 1957 T1620 oass.OpenExchangeRatesOrgProvider.reload Reloading exchange rates from open-exchange-rates.json
[junit4:junit4]   2> 1959 T1620 oasc.SolrCore.<init> [collection1] Opening new SolrCore at /usr/home/hudson/hudson-slave/workspace/Lucene-Solr-Tests-trunk-java7/solr/build/solr-core/test/J0/./org.apache.solr.cloud.SyncSliceTest-controljetty-1348370151823/collection1/, dataDir=./org.apache.solr.cloud.SyncSliceTest-1348370151365/control/data/
[junit4:junit4]   2> 1959 T1620 oasc.JmxMonitoredMap.<init> JMX monitoring is enabled. Adding Solr mbeans to JMX Server: com.sun.jmx.mbeanserver.JmxMBeanServer@4b4603d6
[junit4:junit4]   2> 1961 T1620 oasc.SolrCore.getNewIndexDir WARNING New index directory detected: old=null new=./org.apache.solr.cloud.SyncSliceTest-1348370151365/control/data/index/
[junit4:junit4]   2> 1962 T1620 oasc.SolrCore.initIndex WARNING [collection1] Solr index directory './org.apache.solr.cloud.SyncSliceTest-1348370151365/control/data/index' doesn't exist. Creating new index...
[junit4:junit4]   2> 1963 T1620 oasc.CachingDirectoryFactory.get return new directory for /usr/home/hudson/hudson-slave/workspace/Lucene-Solr-Tests-trunk-java7/solr/build/solr-core/test/J0/./org.apache.solr.cloud.SyncSliceTest-1348370151365/control/data/index forceNew:false
[junit4:junit4]   2> 2028 T1620 oasc.SolrDeletionPolicy.onCommit SolrDeletionPolicy.onCommit: commits:num=1
[junit4:junit4]   2> 		commit{dir=/usr/home/hudson/hudson-slave/workspace/Lucene-Solr-Tests-trunk-java7/solr/build/solr-core/test/J0/org.apache.solr.cloud.SyncSliceTest-1348370151365/control/data/index,segFN=segments_1,generation=1,filenames=[segments_1]
[junit4:junit4]   2> 2029 T1620 oasc.SolrDeletionPolicy.updateCommits newest commit = 1
[junit4:junit4]   2> 2045 T1620 oasc.SolrCore.initWriters created xml: solr.XMLResponseWriter
[junit4:junit4]   2> 2048 T1620 oasup.UpdateRequestProcessorChain.init inserting DistributedUpdateProcessorFactory into updateRequestProcessorChain "dedupe"
[junit4:junit4]   2> 2049 T1620 oasup.UpdateRequestProcessorChain.init inserting DistributedUpdateProcessorFactory into updateRequestProcessorChain "dedupe-allfields"
[junit4:junit4]   2> 2050 T1620 oasup.UpdateRequestProcessorChain.init inserting DistributedUpdateProcessorFactory into updateRequestProcessorChain "stored_sig"
[junit4:junit4]   2> 2050 T1620 oasup.UpdateRequestProcessorChain.init inserting DistributedUpdateProcessorFactory into updateRequestProcessorChain "uniq-fields"
[junit4:junit4]   2> 2051 T1620 oasup.UpdateRequestProcessorChain.init inserting DistributedUpdateProcessorFactory into updateRequestProcessorChain "distrib-dup-test-chain-implicit"
[junit4:junit4]   2> 2052 T1620 oasc.RequestHandlers.initHandlersFromConfig adding lazy requestHandler: solr.ReplicationHandler
[junit4:junit4]   2> 2053 T1620 oasc.RequestHandlers.initHandlersFromConfig created /replication: solr.ReplicationHandler
[junit4:junit4]   2> 2054 T1620 oasc.RequestHandlers.initHandlersFromConfig created standard: solr.StandardRequestHandler
[junit4:junit4]   2> 2054 T1620 oasc.RequestHandlers.initHandlersFromConfig created /get: solr.RealTimeGetHandler
[junit4:junit4]   2> 2055 T1620 oasc.RequestHandlers.initHandlersFromConfig created dismax: solr.SearchHandler
[junit4:junit4]   2> 2056 T1620 oasc.RequestHandlers.initHandlersFromConfig created mock: org.apache.solr.core.MockQuerySenderListenerReqHandler
[junit4:junit4]   2> 2057 T1620 oasc.RequestHandlers.initHandlersFromConfig created /admin/: org.apache.solr.handler.admin.AdminHandlers
[junit4:junit4]   2> 2057 T1620 oasc.RequestHandlers.initHandlersFromConfig created defaults: solr.StandardRequestHandler
[junit4:junit4]   2> 2058 T1620 oasc.RequestHandlers.initHandlersFromConfig adding lazy requestHandler: solr.StandardRequestHandler
[junit4:junit4]   2> 2059 T1620 oasc.RequestHandlers.initHandlersFromConfig created lazy: solr.StandardRequestHandler
[junit4:junit4]   2> 2059 T1620 oasc.RequestHandlers.initHandlersFromConfig created /update: solr.UpdateRequestHandler
[junit4:junit4]   2> 2060 T1620 oasc.RequestHandlers.initHandlersFromConfig created /terms: org.apache.solr.handler.component.SearchHandler
[junit4:junit4]   2> 2061 T1620 oasc.RequestHandlers.initHandlersFromConfig created spellCheckCompRH: org.apache.solr.handler.component.SearchHandler
[junit4:junit4]   2> 2061 T1620 oasc.RequestHandlers.initHandlersFromConfig created spellCheckCompRH_Direct: org.apache.solr.handler.component.SearchHandler
[junit4:junit4]   2> 2062 T1620 oasc.RequestHandlers.initHandlersFromConfig created spellCheckWithWordbreak: org.apache.solr.handler.component.SearchHandler
[junit4:junit4]   2> 2063 T1620 oasc.RequestHandlers.initHandlersFromConfig created spellCheckWithWordbreak_Direct: org.apache.solr.handler.component.SearchHandler
[junit4:junit4]   2> 2064 T1620 oasc.RequestHandlers.initHandlersFromConfig created spellCheckCompRH1: org.apache.solr.handler.component.SearchHandler
[junit4:junit4]   2> 2064 T1620 oasc.RequestHandlers.initHandlersFromConfig created tvrh: org.apache.solr.handler.component.SearchHandler
[junit4:junit4]   2> 2065 T1620 oasc.RequestHandlers.initHandlersFromConfig created /mlt: solr.MoreLikeThisHandler
[junit4:junit4]   2> 2066 T1620 oasc.RequestHandlers.initHandlersFromConfig created /debug/dump: solr.DumpRequestHandler
[junit4:junit4]   2> 2070 T1620 oashl.XMLLoader.init xsltCacheLifetimeSeconds=60
[junit4:junit4]   2> 2076 T1620 oasc.SolrCore.initDeprecatedSupport WARNING solrconfig.xml uses deprecated <admin/gettableFiles>, Please update your config to use the ShowFileRequestHandler.
[junit4:junit4]   2> 2077 T1620 oasc.SolrCore.initDeprecatedSupport WARNING adding ShowFileRequestHandler with hidden files: [SCHEMA.XML, OLD_SYNONYMS.TXT, STOPWORDS.TXT, PROTWORDS.TXT, OPEN-EXCHANGE-RATES.JSON, SYNONYMS.TXT, CURRENCY.XML, MAPPING-ISOLATIN1ACCENT.TXT]
[junit4:junit4]   2> 2082 T1620 oass.SolrIndexSearcher.<init> Opening Searcher@2d7de674 main
[junit4:junit4]   2> 2083 T1620 oasu.CommitTracker.<init> Hard AutoCommit: disabled
[junit4:junit4]   2> 2084 T1620 oasu.CommitTracker.<init> Soft AutoCommit: disabled
[junit4:junit4]   2> 2085 T1620 oashc.SpellCheckComponent.inform Initializing spell checkers
[junit4:junit4]   2> 2116 T1620 oass.DirectSolrSpellChecker.init init: {name=direct,classname=DirectSolrSpellChecker,field=lowerfilt,minQueryLength=3}
[junit4:junit4]   2> 2456 T1643 oasc.SolrCore.registerSearcher [collection1] Registered new searcher Searcher@2d7de674 main{StandardDirectoryReader(segments_1:1)}
[junit4:junit4]   2> 2461 T1625 oazs.PrepRequestProcessor.pRequest Got user-level KeeperException when processing sessionid:0x139f11fb7cd0002 type:create cxid:0x59 zxid:0xfffffffffffffffe txntype:unknown reqpath:n/a Error Path:/solr/overseer/queue Error:KeeperErrorCode = NoNode for /solr/overseer/queue
[junit4:junit4]   2> 2502 T1620 oasc.CoreContainer.register registering core: collection1
[junit4:junit4]   2> 2503 T1620 oasc.ZkController.register Register shard - core:collection1 address:http://127.0.0.1:39057/solr shardId:control_shard
[junit4:junit4]   2> 2504 T1620 oascc.SolrZkClient.makePath makePath: /collections/control_collection/leader_elect/control_shard/election
[junit4:junit4]   2> 2542 T1625 oazs.PrepRequestProcessor.pRequest Got user-level KeeperException when processing sessionid:0x139f11fb7cd0002 type:delete cxid:0x68 zxid:0xfffffffffffffffe txntype:unknown reqpath:n/a Error Path:/solr/collections/control_collection/leaders Error:KeeperErrorCode = NoNode for /solr/collections/control_collection/leaders
[junit4:junit4]   2> 2575 T1620 oasc.ShardLeaderElectionContext.runLeaderProcess Running the leader process.
[junit4:junit4]   2> 2576 T1625 oazs.PrepRequestProcessor.pRequest Got user-level KeeperException when processing sessionid:0x139f11fb7cd0002 type:create cxid:0x69 zxid:0xfffffffffffffffe txntype:unknown reqpath:n/a Error Path:/solr/overseer Error:KeeperErrorCode = NodeExists for /solr/overseer
[junit4:junit4]   2> 2891 T1641 oascc.ZkStateReader.updateClusterState Updating cloud state from ZooKeeper... 
[junit4:junit4]   2> 2892 T1625 oazs.PrepRequestProcessor.pRequest Got user-level KeeperException when processing sessionid:0x139f11fb7cd0002 type:create cxid:0x70 zxid:0xfffffffffffffffe txntype:unknown reqpath:n/a Error Path:/solr/overseer/queue-work Error:KeeperErrorCode = NoNode for /solr/overseer/queue-work
[junit4:junit4]   2> 3000 T1640 oascc.ZkStateReader$2.process A cluster state change has occurred - updating...
[junit4:junit4]   2> 3091 T1620 oasc.ShardLeaderElectionContext.waitForReplicasToComeUp Enough replicas found to continue.
[junit4:junit4]   2> 3092 T1620 oasc.ShardLeaderElectionContext.runLeaderProcess I may be the new leader - try and sync
[junit4:junit4]   2> 3093 T1620 oasc.SyncStrategy.sync Sync replicas to http://127.0.0.1:39057/solr/collection1/
[junit4:junit4]   2> 3093 T1620 oasc.SyncStrategy.syncReplicas Sync Success - now sync replicas to me
[junit4:junit4]   2> 3094 T1620 oasc.SyncStrategy.syncToMe http://127.0.0.1:39057/solr/collection1/ has no replicas
[junit4:junit4]   2> 3094 T1620 oasc.ShardLeaderElectionContext.runLeaderProcess I am the new leader: http://127.0.0.1:39057/solr/collection1/
[junit4:junit4]   2> 3095 T1620 oascc.SolrZkClient.makePath makePath: /collections/control_collection/leaders/control_shard
[junit4:junit4]   2> 3101 T1625 oazs.PrepRequestProcessor.pRequest Got user-level KeeperException when processing sessionid:0x139f11fb7cd0002 type:create cxid:0x8e zxid:0xfffffffffffffffe txntype:unknown reqpath:n/a Error Path:/solr/overseer Error:KeeperErrorCode = NodeExists for /solr/overseer
[junit4:junit4]   2> 3520 T1641 oascc.ZkStateReader.updateClusterState Updating cloud state from ZooKeeper... 
[junit4:junit4]   2> 3538 T1640 oascc.ZkStateReader$2.process A cluster state change has occurred - updating...
[junit4:junit4]   2> 3585 T1620 oasc.ZkController.register We are http://127.0.0.1:39057/solr/collection1/ and leader is http://127.0.0.1:39057/solr/collection1/
[junit4:junit4]   2> 3585 T1620 oasc.ZkController.register No LogReplay needed for core=collection1 baseURL=http://127.0.0.1:39057/solr
[junit4:junit4]   2> 3586 T1620 oasc.ZkController.checkRecovery I am the leader, no recovery necessary
[junit4:junit4]   2> 3593 T1620 oascc.ZkStateReader.updateClusterState Updating cloud state from ZooKeeper... 
[junit4:junit4]   2> 3594 T1620 oass.SolrDispatchFilter.init user.dir=/usr/home/hudson/hudson-slave/workspace/Lucene-Solr-Tests-trunk-java7/solr/build/solr-core/test/J0
[junit4:junit4]   2> 3595 T1620 oass.SolrDispatchFilter.init SolrDispatchFilter.init() done
[junit4:junit4]   2> 3596 T1620 oascsi.HttpClientUtil.createClient Creating new http client, config:maxConnections=128&maxConnectionsPerHost=32&followRedirects=false
[junit4:junit4]   2> 3766 T1620 oejs.Server.doStart jetty-8.1.2.v20120308
[junit4:junit4]   2> 3770 T1620 oejs.AbstractConnector.doStart Started SocketConnector@0.0.0.0:39063
[junit4:junit4]   2> 3771 T1620 oasc.SolrResourceLoader.locateSolrHome JNDI not configured for solr (NoInitialContextEx)
[junit4:junit4]   2> 3771 T1620 oasc.SolrResourceLoader.locateSolrHome using system property solr.solr.home: /usr/home/hudson/hudson-slave/workspace/Lucene-Solr-Tests-trunk-java7/solr/build/solr-core/test/J0/./org.apache.solr.cloud.SyncSliceTest-jetty1-1348370154969
[junit4:junit4]   2> 3772 T1620 oasc.SolrResourceLoader.<init> new SolrResourceLoader for deduced Solr Home: '/usr/home/hudson/hudson-slave/workspace/Lucene-Solr-Tests-trunk-java7/solr/build/solr-core/test/J0/./org.apache.solr.cloud.SyncSliceTest-jetty1-1348370154969/'
[junit4:junit4]   2> 3816 T1620 oass.SolrDispatchFilter.init SolrDispatchFilter.init()
[junit4:junit4]   2> 3817 T1620 oasc.SolrResourceLoader.locateSolrHome JNDI not configured for solr (NoInitialContextEx)
[junit4:junit4]   2> 3818 T1620 oasc.SolrResourceLoader.locateSolrHome using system property solr.solr.home: /usr/home/hudson/hudson-slave/workspace/Lucene-Solr-Tests-trunk-java7/solr/build/solr-core/test/J0/./org.apache.solr.cloud.SyncSliceTest-jetty1-1348370154969
[junit4:junit4]   2> 3818 T1620 oasc.CoreContainer$Initializer.initialize looking for solr.xml: /usr/home/hudson/hudson-slave/workspace/Lucene-Solr-Tests-trunk-java7/solr/build/solr-core/test/J0/./org.apache.solr.cloud.SyncSliceTest-jetty1-1348370154969/solr.xml
[junit4:junit4]   2> 3819 T1620 oasc.CoreContainer.<init> New CoreContainer 892169775
[junit4:junit4]   2> 3819 T1620 oasc.CoreContainer.load Loading CoreContainer using Solr Home: '/usr/home/hudson/hudson-slave/workspace/Lucene-Solr-Tests-trunk-java7/solr/build/solr-core/test/J0/./org.apache.solr.cloud.SyncSliceTest-jetty1-1348370154969/'
[junit4:junit4]   2> 3820 T1620 oasc.SolrResourceLoader.<init> new SolrResourceLoader for directory: '/usr/home/hudson/hudson-slave/workspace/Lucene-Solr-Tests-trunk-java7/solr/build/solr-core/test/J0/./org.apache.solr.cloud.SyncSliceTest-jetty1-1348370154969/'
[junit4:junit4]   2> 3854 T1620 oasc.CoreContainer.load Registering Log Listener
[junit4:junit4]   2> 3870 T1620 oasc.CoreContainer.initZooKeeper Zookeeper client=127.0.0.1:39054/solr
[junit4:junit4]   2> 3872 T1620 oaz.ZooKeeper.<init> Initiating client connection, connectString=127.0.0.1:39054/solr sessionTimeout=5000 watcher=org.apache.solr.common.cloud.ConnectionManager@7de60273
[junit4:junit4]   2> 3873 T1653 oaz.ClientCnxn$SendThread.startConnect Opening socket connection to server /127.0.0.1:39054
[junit4:junit4]   2> 3873 T1620 oascc.ConnectionManager.waitForConnected Waiting for client to connect to ZooKeeper
[junit4:junit4]   2> 3874 T1653 oaz.ClientCnxn$SendThread.primeConnection Socket connection established to localhost/127.0.0.1:39054, initiating session
[junit4:junit4]   2> 3875 T1622 oazs.NIOServerCnxn$Factory.run Accepted socket connection from /140.211.11.196:39064
[junit4:junit4]   2> 3875 T1622 oazs.NIOServerCnxn.readConnectRequest Client attempting to establish new session at /140.211.11.196:39064
[junit4:junit4]   2> 3898 T1624 oazs.NIOServerCnxn.finishSessionInit Established session 0x139f11fb7cd0003 with negotiated timeout 5000 for client /140.211.11.196:39064
[junit4:junit4]   2> 3898 T1653 oaz.ClientCnxn$SendThread.readConnectResult Session establishment complete on server localhost/127.0.0.1:39054, sessionid = 0x139f11fb7cd0003, negotiated timeout = 5000
[junit4:junit4]   2> 3899 T1654 oascc.ConnectionManager.process Watcher org.apache.solr.common.cloud.ConnectionManager@7de60273 name:ZooKeeperConnection Watcher:127.0.0.1:39054/solr got event WatchedEvent state:SyncConnected type:None path:null path:null type:None
[junit4:junit4]   2> 3899 T1620 oascc.ConnectionManager.waitForConnected Client is connected to ZooKeeper
[junit4:junit4]   2> 3900 T1625 oazs.PrepRequestProcessor.pRequest Got user-level KeeperException when processing sessionid:0x139f11fb7cd0003 type:create cxid:0x1 zxid:0xfffffffffffffffe txntype:unknown reqpath:n/a Error Path:/solr/overseer Error:KeeperErrorCode = NodeExists for /solr/overseer
[junit4:junit4]   2> 3902 T1625 oazs.PrepRequestProcessor.pRequest Got user-level KeeperException when processing sessionid:0x139f11fb7cd0003 type:create cxid:0x2 zxid:0xfffffffffffffffe txntype:unknown reqpath:n/a Error Path:/solr/overseer Error:KeeperErrorCode = NodeExists for /solr/overseer
[junit4:junit4]   2> 3912 T1620 oasc.ZkController.createEphemeralLiveNode Register node as live in ZooKeeper:/live_nodes/127.0.0.1:39063_solr
[junit4:junit4]   2> 3913 T1625 oazs.PrepRequestProcessor.pRequest Got user-level KeeperException when processing sessionid:0x139f11fb7cd0003 type:delete cxid:0x4 zxid:0xfffffffffffffffe txntype:unknown reqpath:n/a Error Path:/solr/live_nodes/127.0.0.1:39063_solr Error:KeeperErrorCode = NoNode for /solr/live_nodes/127.0.0.1:39063_solr
[junit4:junit4]   2> 3914 T1620 oascc.SolrZkClient.makePath makePath: /live_nodes/127.0.0.1:39063_solr
[junit4:junit4]   2> 3917 T1640 oascc.ZkStateReader$3.process Updating live nodes
[junit4:junit4]   2> 3918 T1620 oashc.HttpShardHandlerFactory.getParameter Setting socketTimeout to: 0
[junit4:junit4]   2> 3918 T1620 oashc.HttpShardHandlerFactory.getParameter Setting urlScheme to: http://
[junit4:junit4]   2> 3919 T1620 oashc.HttpShardHandlerFactory.getParameter Setting connTimeout to: 0
[junit4:junit4]   2> 3919 T1620 oashc.HttpShardHandlerFactory.getParameter Setting maxConnectionsPerHost to: 20
[junit4:junit4]   2> 3920 T1620 oashc.HttpShardHandlerFactory.getParameter Setting corePoolSize to: 0
[junit4:junit4]   2> 3920 T1620 oashc.HttpShardHandlerFactory.getParameter Setting maximumPoolSize to: 2147483647
[junit4:junit4]   2> 3921 T1620 oashc.HttpShardHandlerFactory.getParameter Setting maxThreadIdleTime to: 5
[junit4:junit4]   2> 3922 T1620 oashc.HttpShardHandlerFactory.getParameter Setting sizeOfQueue to: -1
[junit4:junit4]   2> 3923 T1620 oashc.HttpShardHandlerFactory.getParameter Setting fairnessPolicy to: false
[junit4:junit4]   2> 3923 T1620 oascsi.HttpClientUtil.createClient Creating new http client, config:maxConnectionsPerHost=20&maxConnections=10000&socketTimeout=0&connTimeout=0&retry=false
[junit4:junit4]   2> 3949 T1620 oascc.ZkStateReader.createClusterStateWatchersAndUpdate Updating cluster state from ZooKeeper... 
[junit4:junit4]   2> 3958 T1620 oasc.CoreContainer.create Creating SolrCore 'collection1' using instanceDir: /usr/home/hudson/hudson-slave/workspace/Lucene-Solr-Tests-trunk-java7/solr/build/solr-core/test/J0/./org.apache.solr.cloud.SyncSliceTest-jetty1-1348370154969/collection1
[junit4:junit4]   2> 3958 T1620 oasc.ZkController.createCollectionZkNode Check for collection zkNode:collection1
[junit4:junit4]   2> 3959 T1620 oasc.ZkController.createCollectionZkNode Collection zkNode exists
[junit4:junit4]   2> 3960 T1620 oasc.ZkController.readConfigName Load collection config from:/collections/collection1
[junit4:junit4]   2> 3961 T1620 oasc.SolrResourceLoader.<init> new SolrResourceLoader for directory: '/usr/home/hudson/hudson-slave/workspace/Lucene-Solr-Tests-trunk-java7/solr/build/solr-core/test/J0/./org.apache.solr.cloud.SyncSliceTest-jetty1-1348370154969/collection1/'
[junit4:junit4]   2> 3963 T1620 oasc.SolrResourceLoader.replaceClassLoader Adding 'file:/usr/home/hudson/hudson-slave/workspace/Lucene-Solr-Tests-trunk-java7/solr/build/solr-core/test/J0/org.apache.solr.cloud.SyncSliceTest-jetty1-1348370154969/collection1/lib/README' to classloader
[junit4:junit4]   2> 3964 T1620 oasc.SolrResourceLoader.replaceClassLoader Adding 'file:/usr/home/hudson/hudson-slave/workspace/Lucene-Solr-Tests-trunk-java7/solr/build/solr-core/test/J0/org.apache.solr.cloud.SyncSliceTest-jetty1-1348370154969/collection1/lib/classes/' to classloader
[junit4:junit4]   2> 4027 T1620 oasc.SolrConfig.<init> Using Lucene MatchVersion: LUCENE_50
[junit4:junit4]   2> 4041 T1641 oascc.ZkStateReader.updateClusterState Updating cloud state from ZooKeeper... 
[junit4:junit4]   2> 4053 T1654 oascc.ZkStateReader$2.process A cluster state change has occurred - updating...
[junit4:junit4]   2> 4053 T1640 oascc.ZkStateReader$2.process A cluster state change has occurred - updating...
[junit4:junit4]   2> 4109 T1620 oasc.SolrConfig.<init> Loaded SolrConfig: solrconfig.xml
[junit4:junit4]   2> 4211 T1620 oass.IndexSchema.readSchema Reading Solr Schema
[junit4:junit4]   2> 4224 T1620 oass.IndexSchema.readSchema Schema name=test
[junit4:junit4]   2> 4969 T1620 oass.OpenExchangeRatesOrgProvider.init Initialized with rates=open-exchange-rates.json, refreshInterval=1440.
[junit4:junit4]   2> 4985 T1620 oass.IndexSchema.readSchema default search field in schema is text
[junit4:junit4]   2> 4990 T1620 oass.IndexSchema.readSchema unique key field: id
[junit4:junit4]   2> 5005 T1620 oass.FileExchangeRateProvider.reload Reloading exchange rates from file currency.xml
[junit4:junit4]   2> 5012 T1620 oass.FileExchangeRateProvider.reload Reloading exchange rates from file currency.xml
[junit4:junit4]   2> 5017 T1620 oass.OpenExchangeRatesOrgProvider.reload Reloading exchange rates from open-exchange-rates.json
[junit4:junit4]   2> 5018 T1620 oass.OpenExchangeRatesOrgProvider.reload Reloading exchange rates from open-exchange-rates.json
[junit4:junit4]   2> 5020 T1620 oasc.SolrCore.<init> [collection1] Opening new SolrCore at /usr/home/hudson/hudson-slave/workspace/Lucene-Solr-Tests-trunk-java7/solr/build/solr-core/test/J0/./org.apache.solr.cloud.SyncSliceTest-jetty1-1348370154969/collection1/, dataDir=./org.apache.solr.cloud.SyncSliceTest-1348370151365/jetty1/
[junit4:junit4]   2> 5021 T1620 oasc.JmxMonitoredMap.<init> JMX monitoring is enabled. Adding Solr mbeans to JMX Server: com.sun.jmx.mbeanserver.JmxMBeanServer@4b4603d6
[junit4:junit4]   2> 5022 T1620 oasc.SolrCore.getNewIndexDir WARNING New index directory detected: old=null new=./org.apache.solr.cloud.SyncSliceTest-1348370151365/jetty1/index/
[junit4:junit4]   2> 5023 T1620 oasc.SolrCore.initIndex WARNING [collection1] Solr index directory './org.apache.solr.cloud.SyncSliceTest-1348370151365/jetty1/index' doesn't exist. Creating new index...
[junit4:junit4]   2> 5024 T1620 oasc.CachingDirectoryFactory.get return new directory for /usr/home/hudson/hudson-slave/workspace/Lucene-Solr-Tests-trunk-java7/solr/build/solr-core/test/J0/./org.apache.solr.cloud.SyncSliceTest-1348370151365/jetty1/index forceNew:false
[junit4:junit4]   2> 5058 T1620 oasc.SolrDeletionPolicy.onCommit SolrDeletionPolicy.onCommit: commits:num=1
[junit4:junit4]   2> 		commit{dir=/usr/home/hudson/hudson-slave/workspace/Lucene-Solr-Tests-trunk-java7/solr/build/solr-core/test/J0/org.apache.solr.cloud.SyncSliceTest-1348370151365/jetty1/index,segFN=segments_1,generation=1,filenames=[segments_1]
[junit4:junit4]   2> 5059 T1620 oasc.SolrDeletionPolicy.updateCommits newest commit = 1
[junit4:junit4]   2> 5060 T1620 oasc.SolrCore.initWriters created xml: solr.XMLResponseWriter
[junit4:junit4]   2> 5064 T1620 oasup.UpdateRequestProcessorChain.init inserting DistributedUpdateProcessorFactory into updateRequestProcessorChain "dedupe"
[junit4:junit4]   2> 5064 T1620 oasup.UpdateRequestProcessorChain.init inserting DistributedUpdateProcessorFactory into updateRequestProcessorChain "dedupe-allfields"
[junit4:junit4]   2> 5065 T1620 oasup.UpdateRequestProcessorChain.init inserting DistributedUpdateProcessorFactory into updateRequestProcessorChain "stored_sig"
[junit4:junit4]   2> 5066 T1620 oasup.UpdateRequestProcessorChain.init inserting DistributedUpdateProcessorFactory into updateRequestProcessorChain "uniq-fields"
[junit4:junit4]   2> 5067 T1620 oasup.UpdateRequestProcessorChain.init inserting DistributedUpdateProcessorFactory into updateRequestProcessorChain "distrib-dup-test-chain-implicit"
[junit4:junit4]   2> 5067 T1620 oasc.RequestHandlers.initHandlersFromConfig adding lazy requestHandler: solr.ReplicationHandler
[junit4:junit4]   2> 5068 T1620 oasc.RequestHandlers.initHandlersFromConfig created /replication: solr.ReplicationHandler
[junit4:junit4]   2> 5069 T1620 oasc.RequestHandlers.initHandlersFromConfig created standard: solr.StandardRequestHandler
[junit4:junit4]   2> 5070 T1620 oasc.RequestHandlers.initHandlersFromConfig created /get: solr.RealTimeGetHandler
[junit4:junit4]   2> 5070 T1620 oasc.RequestHandlers.initHandlersFromConfig created dismax: solr.SearchHandler
[junit4:junit4]   2> 5071 T1620 oasc.RequestHandlers.initHandlersFromConfig created mock: org.apache.solr.core.MockQuerySenderListenerReqHandler
[junit4:junit4]   2> 5072 T1620 oasc.RequestHandlers.initHandlersFromConfig created /admin/: org.apache.solr.handler.admin.AdminHandlers
[junit4:junit4]   2> 5073 T1620 oasc.RequestHandlers.initHandlersFromConfig created defaults: solr.StandardRequestHandler
[junit4:junit4]   2> 5074 T1620 oasc.RequestHandlers.initHandlersFromConfig adding lazy requestHandler: solr.StandardRequestHandler
[junit4:junit4]   2> 5075 T1620 oasc.RequestHandlers.initHandlersFromConfig created lazy: solr.StandardRequestHandler
[junit4:junit4]   2> 5076 T1620 oasc.RequestHandlers.initHandlersFromConfig created /update: solr.UpdateRequestHandler
[junit4:junit4]   2> 5077 T1620 oasc.RequestHandlers.initHandlersFromConfig created /terms: org.apache.solr.handler.component.SearchHandler
[junit4:junit4]   2> 5078 T1620 oasc.RequestHandlers.initHandlersFromConfig created spellCheckCompRH: org.apache.solr.handler.component.SearchHandler
[junit4:junit4]   2> 5079 T1620 oasc.RequestHandlers.initHandlersFromConfig created spellCheckCompRH_Direct: org.apache.solr.handler.component.SearchHandler
[junit4:junit4]   2> 5080 T1620 oasc.RequestHandlers.initHandlersFromConfig created spellCheckWithWordbreak: org.apache.solr.handler.component.SearchHandler
[junit4:junit4]   2> 5081 T1620 oasc.RequestHandlers.initHandlersFromConfig created spellCheckWithWordbreak_Direct: org.apache.solr.handler.component.SearchHandler
[junit4:junit4]   2> 5082 T1620 oasc.RequestHandlers.initHandlersFromConfig created spellCheckCompRH1: org.apache.solr.handler.component.SearchHandler
[junit4:junit4]   2> 5083 T1620 oasc.RequestHandlers.initHandlersFromConfig created tvrh: org.apache.solr.handler.component.SearchHandler
[junit4:junit4]   2> 5084 T1620 oasc.RequestHandlers.initHandlersFromConfig created /mlt: solr.MoreLikeThisHandler
[junit4:junit4]   2> 5086 T1620 oasc.RequestHandlers.initHandlersFromConfig created /debug/dump: solr.DumpRequestHandler
[junit4:junit4]   2> 5092 T1620 oashl.XMLLoader.init xsltCacheLifetimeSeconds=60
[junit4:junit4]   2> 5098 T1620 oasc.SolrCore.initDeprecatedSupport WARNING solrconfig.xml uses deprecated <admin/gettableFiles>, Please update your config to use the ShowFileRequestHandler.
[junit4:junit4]   2> 5100 T1620 oasc.SolrCore.initDeprecatedSupport WARNING adding ShowFileRequestHandler with hidden files: [SCHEMA.XML, OLD_SYNONYMS.TXT, STOPWORDS.TXT, PROTWORDS.TXT, OPEN-EXCHANGE-RATES.JSON, SYNONYMS.TXT, CURRENCY.XML, MAPPING-ISOLATIN1ACCENT.TXT]
[junit4:junit4]   2> 5105 T1620 oass.SolrIndexSearcher.<init> Opening Searcher@dee9592 main
[junit4:junit4]   2> 5107 T1620 oasu.CommitTracker.<init> Hard AutoCommit: disabled
[junit4:junit4]   2> 5108 T1620 oasu.CommitTracker.<init> Soft AutoCommit: disabled
[junit4:junit4]   2> 5109 T1620 oashc.SpellCheckComponent.inform Initializing spell checkers
[junit4:junit4]   2> 5156 T1620 oass.DirectSolrSpellChecker.init init: {name=direct,classname=DirectSolrSpellChecker,field=lowerfilt,minQueryLength=3}
[junit4:junit4]   2> 5315 T1655 oasc.SolrCore.registerSearcher [collection1] Registered new searcher Searcher@dee9592 main{StandardDirectoryReader(segments_1:1)}
[junit4:junit4]   2> 5567 T1641 oascc.ZkStateReader.updateClusterState Updating cloud state from ZooKeeper... 
[junit4:junit4]   2> 5585 T1654 oascc.ZkStateReader$2.process A cluster state change has occurred - updating...
[junit4:junit4]   2> 5585 T1640 oascc.ZkStateReader$2.process A cluster state change has occurred - updating...
[junit4:junit4]   2> 5829 T1620 oasc.CoreContainer.register registering core: collection1
[junit4:junit4]   2> 5829 T1620 oasc.ZkController.register Register shard - core:collection1 address:http://127.0.0.1:39063/solr shardId:shard1
[junit4:junit4]   2> 5831 T1620 oascc.SolrZkClient.makePath makePath: /collections/collection1/leader_elect/shard1/election
[junit4:junit4]   2> 5869 T1625 oazs.PrepRequestProcessor.pRequest Got user-level KeeperException when processing sessionid:0x139f11fb7cd0003 type:delete cxid:0x43 zxid:0xfffffffffffffffe txntype:unknown reqpath:n/a Error Path:/solr/collections/collection1/leaders Error:KeeperErrorCode = NoNode for /solr/collections/collection1/leaders
[junit4:junit4]   2> 5870 T1620 oasc.ShardLeaderElectionContext.runLeaderProcess Running the leader process.
[junit4:junit4]   2> 5870 T1625 oazs.PrepRequestProcessor.pRequest Got user-level KeeperException when processing sessionid:0x139f11fb7cd0003 type:create cxid:0x44 zxid:0xfffffffffffffffe txntype:unknown reqpath:n/a Error Path:/solr/overseer Error:KeeperErrorCode = NodeExists for /solr/overseer
[junit4:junit4]   2> 5906 T1620 oasc.ShardLeaderElectionContext.waitForReplicasToComeUp Enough replicas found to continue.
[junit4:junit4]   2> 5906 T1620 oasc.ShardLeaderElectionContext.runLeaderProcess I may be the new leader - try and sync
[junit4:junit4]   2> 5907 T1620 oasc.SyncStrategy.sync Sync replicas to http://127.0.0.1:39063/solr/collection1/
[junit4:junit4]   2> 5907 T1620 oasc.SyncStrategy.syncReplicas Sync Success - now sync replicas to me
[junit4:junit4]   2> 5908 T1620 oasc.SyncStrategy.syncToMe http://127.0.0.1:39063/solr/collection1/ has no replicas
[junit4:junit4]   2> 5908 T1620 oasc.ShardLeaderElectionContext.runLeaderProcess I am the new leader: http://127.0.0.1:39063/solr/collection1/
[junit4:junit4]   2> 5909 T1620 oascc.SolrZkClient.makePath makePath: /collections/collection1/leaders/shard1
[junit4:junit4]   2> 5938 T1625 oazs.PrepRequestProcessor.pRequest Got user-level KeeperException when processing sessionid:0x139f11fb7cd0003 type:create cxid:0x4e zxid:0xfffffffffffffffe txntype:unknown reqpath:n/a Error Path:/solr/overseer Error:KeeperErrorCode = NodeExists for /solr/overseer
[junit4:junit4]   2> 6090 T1641 oascc.ZkStateReader.updateClusterState Updating cloud state from ZooKeeper... 
[junit4:junit4]   2> 6133 T1654 oascc.ZkStateReader$2.process A cluster state change has occurred - updating...
[junit4:junit4]   2> 6133 T1640 oascc.ZkStateReader$2.process A cluster state change has occurred - updating...
[junit4:junit4]   2> 6165 T1620 oasc.ZkController.register We are http://127.0.0.1:39063/solr/collection1/ and leader is http://127.0.0.1:39063/solr/collection1/
[junit4:junit4]   2> 6165 T1620 oasc.ZkController.register No LogReplay needed for core=collection1 baseURL=http://127.0.0.1:39063/solr
[junit4:junit4]   2> 6166 T1620 oasc.ZkController.checkRecovery I am the leader, no recovery necessary
[junit4:junit4]   2> 6168 T1620 oascc.ZkStateReader.updateClusterState Updating cloud state from ZooKeeper... 
[junit4:junit4]   2> 6169 T1620 oass.SolrDispatchFilter.init user.dir=/usr/home/hudson/hudson-slave/workspace/Lucene-Solr-Tests-trunk-java7/solr/build/solr-core/test/J0
[junit4:junit4]   2> 6169 T1620 oass.SolrDispatchFilter.init SolrDispatchFilter.init() done
[junit4:junit4]   2> 6170 T1620 oascsi.HttpClientUtil.createClient Creating new http client, config:maxConnections=128&maxConnectionsPerHost=32&followRedirects=false
[junit4:junit4]   2> 6370 T1620 oejs.Server.doStart jetty-8.1.2.v20120308
[junit4:junit4]   2> 6375 T1620 oejs.AbstractConnector.doStart Started SocketConnector@0.0.0.0:39067
[junit4:junit4]   2> 6376 T1620 oasc.SolrResourceLoader.locateSolrHome JNDI not configured for solr (NoInitialContextEx)
[junit4:junit4]   2> 6376 T1620 oasc.SolrResourceLoader.locateSolrHome using system property solr.solr.home: /usr/home/hudson/hudson-slave/workspace/Lucene-Solr-Tests-trunk-java7/solr/build/solr-core/test/J0/./org.apache.solr.cloud.SyncSliceTest-jetty2-1348370157545
[junit4:junit4]   2> 6377 T1620 oasc.SolrResourceLoader.<init> new SolrResourceLoader for deduced Solr Home: '/usr/home/hudson/hudson-slave/workspace/Lucene-Solr-Tests-trunk-java7/solr/build/solr-core/test/J0/./org.apache.solr.cloud.SyncSliceTest-jetty2-1348370157545/'
[junit4:junit4]   2> 6424 T1620 oass.SolrDispatchFilter.init SolrDispatchFilter.init()
[junit4:junit4]   2> 6425 T1620 oasc.SolrResourceLoader.locateSolrHome JNDI not configured for solr (NoInitialContextEx)
[junit4:junit4]   2> 6426 T1620 oasc.SolrResourceLoader.locateSolrHome using system property solr.solr.home: /usr/home/hudson/hudson-slave/workspace/Lucene-Solr-Tests-trunk-java7/solr/build/solr-core/test/J0/./org.apache.solr.cloud.SyncSliceTest-jetty2-1348370157545
[junit4:junit4]   2> 6426 T1620 oasc.CoreContainer$Initializer.initialize looking for solr.xml: /usr/home/hudson/hudson-slave/workspace/Lucene-Solr-Tests-trunk-java7/solr/build/solr-core/test/J0/./org.apache.solr.cloud.SyncSliceTest-jetty2-1348370157545/solr.xml
[junit4:junit4]   2> 6427 T1620 oasc.CoreContainer.<init> New CoreContainer 974995381
[junit4:junit4]   2> 6428 T1620 oasc.CoreContainer.load Loading CoreContainer using Solr Home: '/usr/home/hudson/hudson-slave/workspace/Lucene-Solr-Tests-trunk-java7/solr/build/solr-core/test/J0/./org.apache.solr.cloud.SyncSliceTest-jetty2-1348370157545/'
[junit4:junit4]   2> 6428 T1620 oasc.SolrResourceLoader.<init> new SolrResourceLoader for directory: '/usr/home/hudson/hudson-slave/workspace/Lucene-Solr-Tests-trunk-java7/solr/build/solr-core/test/J0/./org.apache.solr.cloud.SyncSliceTest-jetty2-1348370157545/'
[junit4:junit4]   2> 6472 T1620 oasc.CoreContainer.load Registering Log Listener
[junit4:junit4]   2> 6488 T1620 oasc.CoreContainer.initZooKeeper Zookeeper client=127.0.0.1:39054/solr
[junit4:junit4]   2> 6489 T1620 oaz.ZooKeeper.<init> Initiating client connection, connectString=127.0.0.1:39054/solr sessionTimeout=5000 watcher=org.apache.solr.common.cloud.ConnectionManager@6886097c
[junit4:junit4]   2> 6491 T1665 oaz.ClientCnxn$SendThread.startConnect Opening socket connection to server /127.0.0.1:39054
[junit4:junit4]   2> 6491 T1620 oascc.ConnectionManager.waitForConnected Waiting for client to connect to ZooKeeper
[junit4:junit4]   2> 6492 T1665 oaz.ClientCnxn$SendThread.primeConnection Socket connection established to localhost/127.0.0.1:39054, initiating session
[junit4:junit4]   2> 6492 T1622 oazs.NIOServerCnxn$Factory.run Accepted socket connection from /140.211.11.196:39068
[junit4:junit4]   2> 6493 T1622 oazs.NIOServerCnxn.readConnectRequest Client attempting to establish new session at /140.211.11.196:39068
[junit4:junit4]   2> 6508 T1624 oazs.NIOServerCnxn.finishSessionInit Established session 0x139f11fb7cd0004 with negotiated timeout 5000 for client /140.211.11.196:39068
[junit4:junit4]   2> 6508 T1665 oaz.ClientCnxn$SendThread.readConnectResult Session establishment complete on server localhost/127.0.0.1:39054, sessionid = 0x139f11fb7cd0004, negotiated timeout = 5000
[junit4:junit4]   2> 6509 T1666 oascc.ConnectionManager.process Watcher org.apache.solr.common.cloud.ConnectionManager@6886097c name:ZooKeeperConnection Watcher:127.0.0.1:39054/solr got event WatchedEvent state:SyncConnected type:None path:null path:null type:None
[junit4:junit4]   2> 6509 T1620 oascc.ConnectionManager.waitForConnected Client is connected to ZooKeeper
[junit4:junit4]   2> 6510 T1625 oazs.PrepRequestProcessor.pRequest Got user-level KeeperException when processing sessionid:0x139f11fb7cd0004 type:create cxid:0x1 zxid:0xfffffffffffffffe txntype:unknown reqpath:n/a Error Path:/solr/overseer Error:KeeperErrorCode = NodeExists for /solr/overseer
[junit4:junit4]   2> 6527 T1625 oazs.PrepRequestProcessor.pRequest Got user-level KeeperException when processing sessionid:0x139f11fb7cd0004 type:create cxid:0x2 zxid:0xfffffffffffffffe txntype:unknown reqpath:n/a Error Path:/solr/overseer Error:KeeperErrorCode = NodeExists for /solr/overseer
[junit4:junit4]   2> 6547 T1620 oasc.ZkController.createEphemeralLiveNode Register node as live in ZooKeeper:/live_nodes/127.0.0.1:39067_solr
[junit4:junit4]   2> 6548 T1625 oazs.PrepRequestProcessor.pRequest Got user-level KeeperException when processing sessionid:0x139f11fb7cd0004 type:delete cxid:0x4 zxid:0xfffffffffffffffe txntype:unknown reqpath:n/a Error Path:/solr/live_nodes/127.0.0.1:39067_solr Error:KeeperErrorCode = NoNode for /solr/live_nodes/127.0.0.1:39067_solr
[junit4:junit4]   2> 6567 T1620 oascc.SolrZkClient.makePath makePath: /live_nodes/127.0.0.1:39067_solr
[junit4:junit4]   2> 6643 T1654 oascc.ZkStateReader$3.process Updating live nodes
[junit4:junit4]   2> 6643 T1640 oascc.ZkStateReader$3.process Updating live nodes
[junit4:junit4]   2> 6644 T1620 oashc.HttpShardHandlerFactory.getParameter Setting socketTimeout to: 0
[junit4:junit4]   2> 6645 T1620 oashc.HttpShardHandlerFactory.getParameter Setting urlScheme to: http://
[junit4:junit4]   2> 6646 T1620 oashc.HttpShardHandlerFactory.getParameter Setting connTimeout to: 0
[junit4:junit4]   2> 6646 T1620 oashc.HttpShardHandlerFactory.getParameter Setting maxConnectionsPerHost to: 20
[junit4:junit4]   2> 6647 T1620 oashc.HttpShardHandlerFactory.getParameter Setting corePoolSize to: 0
[junit4:junit4]   2> 6647 T1620 oashc.HttpShardHandlerFactory.getParameter Setting maximumPoolSize to: 2147483647
[junit4:junit4]   2> 6648 T1620 oashc.HttpShardHandlerFactory.getParameter Setting maxThreadIdleTime to: 5
[junit4:junit4]   2> 6648 T1620 oashc.HttpShardHandlerFactory.getParameter Setting sizeOfQueue to: -1
[junit4:junit4]   2> 6649 T1620 oashc.HttpShardHandlerFactory.getParameter Setting fairnessPolicy to: false
[junit4:junit4]   2> 6649 T1620 oascsi.HttpClientUtil.createClient Creating new http client, config:maxConnectionsPerHost=20&maxConnections=10000&socketTimeout=0&connTimeout=0&retry=false
[junit4:junit4]   2> 6657 T1641 oascc.ZkStateReader.updateClusterState Updating cloud state from ZooKeeper... 
[junit4:junit4]   2> 6707 T1654 oascc.ZkStateReader$2.process A cluster state change has occurred - updating...
[junit4:junit4]   2> 6707 T1640 oascc.ZkStateReader$2.process A cluster state change has occurred - updating...
[junit4:junit4]   2> 6708 T1620 oascc.ZkStateReader.createClusterStateWatchersAndUpdate Updating cluster state from ZooKeeper... 
[junit4:junit4]   2> 6716 T1620 oasc.CoreContainer.create Creating SolrCore 'collection1' using instanceDir: /usr/home/hudson/hudson-slave/workspace/Lucene-Solr-Tests-trunk-java7/solr/build/solr-core/test/J0/./org.apache.solr.cloud.SyncSliceTest-jetty2-1348370157545/collection1
[junit4:junit4]   2> 6717 T1620 oasc.ZkController.createCollectionZkNode Check for collection zkNode:collection1
[junit4:junit4]   2> 6718 T1620 oasc.ZkController.createCollectionZkNode Collection zkNode exists
[junit4:junit4]   2> 6718 T1620 oasc.ZkController.readConfigName Load collection config from:/collections/collection1
[junit4:junit4]   2> 6720 T1620 oasc.SolrResourceLoader.<init> new SolrResourceLoader for directory: '/usr/home/hudson/hudson-slave/workspace/Lucene-Solr-Tests-trunk-java7/solr/build/solr-core/test/J0/./org.apache.solr.cloud.SyncSliceTest-jetty2-1348370157545/collection1/'
[junit4:junit4]   2> 6722 T1620 oasc.SolrResourceLoader.replaceClassLoader Adding 'file:/usr/home/hudson/hudson-slave/workspace/Lucene-Solr-Tests-trunk-java7/solr/build/solr-core/test/J0/org.apache.solr.cloud.SyncSliceTest-jetty2-1348370157545/collection1/lib/classes/' to classloader
[junit4:junit4]   2> 6723 T1620 oasc.SolrResourceLoader.replaceClassLoader Adding 'file:/usr/home/hudson/hudson-slave/workspace/Lucene-Solr-Tests-trunk-java7/solr/build/solr-core/test/J0/org.apache.solr.cloud.SyncSliceTest-jetty2-1348370157545/collection1/lib/README' to classloader
[junit4:junit4]   2> 6785 T1620 oasc.SolrConfig.<init> Using Lucene MatchVersion: LUCENE_50
[junit4:junit4]   2> 6864 T1620 oasc.SolrConfig.<init> Loaded SolrConfig: solrconfig.xml
[junit4:junit4]   2> 6965 T1620 oass.IndexSchema.readSchema Reading Solr Schema
[junit4:junit4]   2> 6976 T1620 oass.IndexSchema.readSchema Schema name=test
[junit4:junit4]   2> 7641 T1620 oass.OpenExchangeRatesOrgProvider.init Initialized with rates=open-exchange-rates.json, refreshInterval=1440.
[junit4:junit4]   2> 7654 T1620 oass.IndexSchema.readSchema default search field in schema is text
[junit4:junit4]   2> 7659 T1620 oass.IndexSchema.readSchema unique key field: id
[junit4:junit4]   2> 7673 T1620 oass.FileExchangeRateProvider.reload Reloading exchange rates from file currency.xml
[junit4:junit4]   2> 7680 T1620 oass.FileExchangeRateProvider.reload Reloading exchange rates from file currency.xml
[junit4:junit4]   2> 7685 T1620 oass.OpenExchangeRatesOrgProvider.reload Reloading exchange rates from open-exchange-rates.json
[junit4:junit4]   2> 7686 T1620 oass.OpenExchangeRatesOrgProvider.reload Reloading exchange rates from open-exchange-rates.json
[junit4:junit4]   2> 7688 T1620 oasc.SolrCore.<init> [collection1] Opening new SolrCore at /usr/home/hudson/hudson-slave/workspace/Lucene-Solr-Tests-trunk-java7/solr/build/solr-core/test/J0/./org.apache.solr.cloud.SyncSliceTest-jetty2-1348370157545/collection1/, dataDir=./org.apache.solr.cloud.SyncSliceTest-1348370151365/jetty2/
[junit4:junit4]   2> 7688 T1620 oasc.JmxMonitoredMap.<init> JMX monitoring is enabled. Adding Solr mbeans to JMX Server: com.sun.jmx.mbeanserver.JmxMBeanServer@4b4603d6
[junit4:junit4]   2> 7690 T1620 oasc.SolrCore.getNewIndexDir WARNING New index directory detected: old=null new=./org.apache.solr.cloud.SyncSliceTest-1348370151365/jetty2/index/
[junit4:junit4]   2> 7691 T1620 oasc.SolrCore.initIndex WARNING [collection1] Solr index directory './org.apache.solr.cloud.SyncSliceTest-1348370151365/jetty2/index' doesn't exist. Creating new index...
[junit4:junit4]   2> 7692 T1620 oasc.CachingDirectoryFactory.get return new directory for /usr/home/hudson/hudson-slave/workspace/Lucene-Solr-Tests-trunk-java7/solr/build/solr-core/test/J0/./org.apache.solr.cloud.SyncSliceTest-1348370151365/jetty2/index forceNew:false
[junit4:junit4]   2> 7701 T1620 oasc.SolrDeletionPolicy.onCommit SolrDeletionPolicy.onCommit: commits:num=1
[junit4:junit4]   2> 		commit{dir=/usr/home/hudson/hudson-slave/workspace/Lucene-Solr-Tests-trunk-java7/solr/build/solr-core/test/J0/org.apache.solr.cloud.SyncSliceTest-1348370151365/jetty2/index,segFN=segments_1,generation=1,filenames=[segments_1]
[junit4:junit4]   2> 7702 T1620 oasc.SolrDeletionPolicy.updateCommits newest commit = 1
[junit4:junit4]   2> 7721 T1620 oasc.SolrCore.initWriters created xml: solr.XMLResponseWriter
[junit4:junit4]   2> 7724 T1620 oasup.UpdateRequestProcessorChain.init inserting DistributedUpdateProcessorFactory into updateRequestProcessorChain "dedupe"
[junit4:junit4]   2> 7725 T1620 oasup.UpdateRequestProcessorChain.init inserting DistributedUpdateProcessorFactory into updateRequestProcessorChain "dedupe-allfields"
[junit4:junit4]   2> 7725 T1620 oasup.UpdateRequestProcessorChain.init inserting DistributedUpdateProcessorFactory into updateRequestProcessorChain "stored_sig"
[junit4:junit4]   2> 7726 T1620 oasup.UpdateRequestProcessorChain.init inserting DistributedUpdateProcessorFactory into updateRequestProcessorChain "uniq-fields"
[junit4:junit4]   2> 7727 T1620 oasup.UpdateRequestProcessorChain.init inserting DistributedUpdateProcessorFactory into updateRequestProcessorChain "distrib-dup-test-chain-implicit"
[junit4:junit4]   2> 7728 T1620 oasc.RequestHandlers.initHandlersFromConfig adding lazy requestHandler: solr.ReplicationHandler
[junit4:junit4]   2> 7728 T1620 oasc.RequestHandlers.initHandlersFromConfig created /replication: solr.ReplicationHandler
[junit4:junit4]   2> 7729 T1620 oasc.RequestHandlers.initHandlersFromConfig created standard: solr.StandardRequestHandler
[junit4:junit4]   2> 7730 T1620 oasc.RequestHandlers.initHandlersFromConfig created /get: solr.RealTimeGetHandler
[junit4:junit4]   2> 7731 T1620 oasc.RequestHandlers.initHandlersFromConfig created dismax: solr.SearchHandler
[junit4:junit4]   2> 7732 T1620 oasc.RequestHandlers.initHandlersFromConfig created mock: org.apache.solr.core.MockQuerySenderListenerReqHandler
[junit4:junit4]   2> 7733 T1620 oasc.RequestHandlers.initHandlersFromConfig created /admin/: org.apache.solr.handler.admin.AdminHandlers
[junit4:junit4]   2> 7733 T1620 oasc.RequestHandlers.initHandlersFromConfig created defaults: solr.StandardRequestHandler
[junit4:junit4]   2> 7734 T1620 oasc.RequestHandlers.initHandlersFromConfig adding lazy requestHandler: solr.StandardRequestHandler
[junit4:junit4]   2> 7735 T1620 oasc.RequestHandlers.initHandlersFromConfig created lazy: solr.StandardRequestHandler
[junit4:junit4]   2> 7735 T1620 oasc.RequestHandlers.initHandlersFromConfig created /update: solr.UpdateRequestHandler
[junit4:junit4]   2> 7736 T1620 oasc.RequestHandlers.initHandlersFromConfig created /terms: org.apache.solr.handler.component.SearchHandler
[junit4:junit4]   2> 7737 T1620 oasc.RequestHandlers.initHandlersFromConfig created spellCheckCompRH: org.apache.solr.handler.component.SearchHandler
[junit4:junit4]   2> 7738 T1620 oasc.RequestHandlers.initHandlersFromConfig created spellCheckCompRH_Direct: org.apache.solr.handler.component.SearchHandler
[junit4:junit4]   2> 7738 T1620 oasc.RequestHandlers.initHandlersFromConfig created spellCheckWithWordbreak: org.apache.solr.handler.component.SearchHandler
[junit4:junit4]   2> 7739 T1620 oasc.RequestHandlers.initHandlersFromConfig created spellCheckWithWordbreak_Direct: org.apache.solr.handler.component.SearchHandler
[junit4:junit4]   2> 7740 T1620 oasc.RequestHandlers.initHandlersFromConfig created spellCheckCompRH1: org.apache.solr.handler.component.SearchHandler
[junit4:junit4]   2> 7741 T1620 oasc.RequestHandlers.initHandlersFromConfig created tvrh: org.apache.solr.handler.component.SearchHandler
[junit4:junit4]   2> 7742 T1620 oasc.RequestHandlers.initHandlersFromConfig created /mlt: solr.MoreLikeThisHandler
[junit4:junit4]   2> 7742 T1620 oasc.RequestHandlers.initHandlersFromConfig created /debug/dump: solr.DumpRequestHandler
[junit4:junit4]   2> 7747 T1620 oashl.XMLLoader.init xsltCacheLifetimeSeconds=60
[junit4:junit4]   2> 7752 T1620 oasc.SolrCore.initDeprecatedSupport WARNING solrconfig.xml uses deprecated <admin/gettableFiles>, Please update your config to use the ShowFileRequestHandler.
[junit4:junit4]   2> 7754 T1620 oasc.SolrCore.initDeprecatedSupport WARNING adding ShowFileRequestHandler with hidden files: [SCHEMA.XML, OLD_SYNONYMS.TXT, STOPWORDS.TXT, PROTWORDS.TXT, OPEN-EXCHANGE-RATES.JSON, SYNONYMS.TXT, CURRENCY.XML, MAPPING-ISOLATIN1ACCENT.TXT]
[junit4:junit4]   2> 7758 T1620 oass.SolrIndexSearcher.<init> Opening Searcher@3576aac7 main
[junit4:junit4]   2> 7760 T1620 oasu.CommitTracker.<init> Hard AutoCommit: disabled
[junit4:junit4]   2> 7760 T1620 oasu.CommitTracker.<init> Soft AutoCommit: disabled
[junit4:junit4]   2> 7761 T1620 oashc.SpellCheckComponent.inform Initializing spell checkers
[junit4:junit4]   2> 7782 T1620 oass.DirectSolrSpellChecker.init init: {name=direct,classname=DirectSolrSpellChecker,field=lowerfilt,minQueryLength=3}
[junit4:junit4]   2> 7891 T1667 oasc.SolrCore.registerSearcher [collection1] Registered new searcher Searcher@3576aac7 main{StandardDirectoryReader(segments_1:1)}
[junit4:junit4]   2> 8220 T1641 oascc.ZkStateReader.updateClusterState Updating cloud state from ZooKeeper... 
[junit4:junit4]   2> 8251 T1666 oascc.ZkStateReader$2.process A cluster state change has occurred - updating...
[junit4:junit4]   2> 8251 T1640 oascc.ZkStateReader$2.process A cluster state change has occurred - updating...
[junit4:junit4]   2> 8251 T1654 oascc.ZkStateReader$2.process A cluster state change has occurred - updating...
[junit4:junit4]   2> 8398 T1620 oasc.CoreContainer.register registering core: collection1
[junit4:junit4]   2> 8399 T1620 oasc.ZkController.register Register shard - core:collection1 address:http://127.0.0.1:39067/solr shardId:shard1
[junit4:junit4]   2> 8402 T1620 oasc.ZkController.register We are http://127.0.0.1:39067/solr/collection1/ and leader is http://127.0.0.1:39063/solr/collection1/
[junit4:junit4]   2> 8403 T1620 oasc.ZkController.register No LogReplay needed for core=collection1 baseURL=http://127.0.0.1:39067/solr
[junit4:junit4]   2> 8403 T1620 oasc.ZkController.checkRecovery Core needs to recover:collection1
[junit4:junit4]   2> 8404 T1620 oasu.DefaultSolrCoreState.doRecovery Running recovery - first canceling any ongoing recovery
[junit4:junit4]   2> ASYNC  NEW_CORE C151 name=collection1 org.apache.solr.core.SolrCore@39f3a88 url=http://127.0.0.1:39067/solr/collection1 node=127.0.0.1:39067_solr
[junit4:junit4]   2> 8405 T1668 C151 P39067 oasc.RecoveryStrategy.run Starting recovery process.  core=collection1 recoveringAfterStartup=true
[junit4:junit4]   2> 8405 T1620 oascc.ZkStateReader.updateClusterState Updating cloud state from ZooKeeper... 
[junit4:junit4]   2> 8406 T1668 C151 P39067 oasc.RecoveryStrategy.doRecovery ###### startupVersions=[]
[junit4:junit4]   2> 8406 T1620 oass.SolrDispatchFilter.init user.dir=/usr/home/hudson/hudson-slave/workspace/Lucene-Solr-Tests-trunk-java7/solr/build/solr-core/test/J0
[junit4:junit4]   2> 8407 T1620 oass.SolrDispatchFilter.init SolrDispatchFilter.init() done
[junit4:junit4]   2> 8407 T1620 oascsi.HttpClientUtil.createClient Creating new http client, config:maxConnections=128&maxConnectionsPerHost=32&followRedirects=false
[junit4:junit4]   2> 8418 T1668 C151 P39067 oasc.RecoveryStrategy.doRecovery Attempting to PeerSync from http://127.0.0.1:39063/solr/collection1/ core=collection1 - recoveringAfterStartup=true
[junit4:junit4]   2> 8419 T1668 C151 P39067 oasu.PeerSync.sync PeerSync: core=collection1 url=http://127.0.0.1:39067/solr START replicas=[http://127.0.0.1:39063/solr/collection1/] nUpdates=100
[junit4:junit4]   2> 8419 T1668 C151 P39067 oasu.PeerSync.sync WARNING no frame of reference to tell of we've missed updates
[junit4:junit4]   2> 8420 T1668 C151 P39067 oasc.RecoveryStrategy.doRecovery PeerSync Recovery was not successful - trying replication. core=collection1
[junit4:junit4]   2> 8420 T1668 C151 P39067 oasc.RecoveryStrategy.doRecovery Starting Replication Recovery. core=collection1
[junit4:junit4]   2> 8420 T1668 C151 P39067 oascsi.HttpClientUtil.createClient Creating new http client, config:maxConnections=128&maxConnectionsPerHost=32&followRedirects=false
[junit4:junit4]   2> ASYNC  NEW_CORE C152 name=collection1 org.apache.solr.core.SolrCore@17684783 url=http://127.0.0.1:39063/solr/collection1 node=127.0.0.1:39063_solr
[junit4:junit4]   2> 8430 T1646 C152 P39063 REQ /get {distrib=false&qt=/get&wt=javabin&version=2&getVersions=100} status=0 QTime=1 
[junit4:junit4]   2> 8599 T1620 oejs.Server.doStart jetty-8.1.2.v20120308
[junit4:junit4]   2> 8602 T1620 oejs.AbstractConnector.doStart Started SocketConnector@0.0.0.0:39076
[junit4:junit4]   2> 8603 T1620 oasc.SolrResourceLoader.locateSolrHome JNDI not configured for solr (NoInitialContextEx)
[junit4:junit4]   2> 8604 T1620 oasc.SolrResourceLoader.locateSolrHome using system property solr.solr.home: /usr/home/hudson/hudson-slave/workspace/Lucene-Solr-Tests-trunk-java7/solr/build/solr-core/test/J0/./org.apache.solr.cloud.SyncSliceTest-jetty3-1348370159782
[junit4:junit4]   2> 8604 T1620 oasc.SolrResourceLoader.<init> new SolrResourceLoader for deduced Solr Home: '/usr/home/hudson/hudson-slave/workspace/Lucene-Solr-Tests-trunk-java7/solr/build/solr-core/test/J0/./org.apache.solr.cloud.SyncSliceTest-jetty3-1348370159782/'
[junit4:junit4]   2> 8649 T1620 oass.SolrDispatchFilter.init SolrDispatchFilter.init()
[junit4:junit4]   2> 8650 T1620 oasc.SolrResourceLoader.locateSolrHome JNDI not configured for solr (NoInitialContextEx)
[junit4:junit4]   2> 8651 T1620 oasc.SolrResourceLoader.locateSolrHome using system property solr.solr.home: /usr/home/hudson/hudson-slave/workspace/Lucene-Solr-Tests-trunk-java7/solr/build/solr-core/test/J0/./org.apache.solr.cloud.SyncSliceTest-jetty3-1348370159782
[junit4:junit4]   2> 8651 T1620 oasc.CoreContainer$Initializer.initialize looking for solr.xml: /usr/home/hudson/hudson-slave/workspace/Lucene-Solr-Tests-trunk-java7/solr/build/solr-core/test/J0/./org.apache.solr.cloud.SyncSliceTest-jetty3-1348370159782/solr.xml
[junit4:junit4]   2> 8652 T1620 oasc.CoreContainer.<init> New CoreContainer 1241229406
[junit4:junit4]   2> 8652 T1620 oasc.CoreContainer.load Loading CoreContainer using Solr Home: '/usr/home/hudson/hudson-slave/workspace/Lucene-Solr-Tests-trunk-java7/solr/build/solr-core/test/J0/./org.apache.solr.cloud.SyncSliceTest-jetty3-1348370159782/'
[junit4:junit4]   2> 8653 T1620 oasc.SolrResourceLoader.<init> new SolrResourceLoader for directory: '/usr/home/hudson/hudson-slave/workspace/Lucene-Solr-Tests-trunk-java7/solr/build/solr-core/test/J0/./org.apache.solr.cloud.SyncSliceTest-jetty3-1348370159782/'
[junit4:junit4]   2> 8688 T1620 oasc.CoreContainer.load Registering Log Listener
[junit4:junit4]   2> 8705 T1620 oasc.CoreContainer.initZooKeeper Zookeeper client=127.0.0.1:39054/solr
[junit4:junit4]   2> 8706 T1620 oaz.ZooKeeper.<init> Initiating client connection, connectString=127.0.0.1:39054/solr sessionTimeout=5000 watcher=org.apache.solr.common.cloud.ConnectionManager@2a6e3b32
[junit4:junit4]   2> 8707 T1679 oaz.ClientCnxn$SendThread.startConnect Opening socket connection to server /127.0.0.1:39054
[junit4:junit4]   2> 8707 T1620 oascc.ConnectionManager.waitForConnected Waiting for client to connect to ZooKeeper
[junit4:junit4]   2> 8708 T1679 oaz.ClientCnxn$SendThread.primeConnection Socket connection established to localhost/127.0.0.1:39054, initiating session
[junit4:junit4]   2> 8709 T1622 oazs.NIOServerCnxn$Factory.run Accepted socket connection from /140.211.11.196:39077
[junit4:junit4]   2> 8709 T1622 oazs.NIOServerCnxn.readConnectRequest Client attempting to establish new session at /140.211.11.196:39077
[junit4:junit4]   2> 8714 T1624 oazs.NIOServerCnxn.finishSessionInit Established session 0x139f11fb7cd0005 with negotiated timeout 5000 for client /140.211.11.196:39077
[junit4:junit4]   2> 8714 T1679 oaz.ClientCnxn$SendThread.readConnectResult Session establishment complete on server localhost/127.0.0.1:39054, sessionid = 0x139f11fb7cd0005, negotiated timeout = 5000
[junit4:junit4]   2> 8715 T1680 oascc.ConnectionManager.process Watcher org.apache.solr.common.cloud.ConnectionManager@2a6e3b32 name:ZooKeeperConnection Watcher:127.0.0.1:39054/solr got event WatchedEvent state:SyncConnected type:None path:null path:null type:None
[junit4:junit4]   2> 8715 T1620 oascc.ConnectionManager.waitForConnected Client is connected to ZooKeeper
[junit4:junit4]   2> 8716 T1625 oazs.PrepRequestProcessor.pRequest Got user-level KeeperException when processing sessionid:0x139f11fb7cd0005 type:create cxid:0x1 zxid:0xfffffffffffffffe txntype:unknown reqpath:n/a Error Path:/solr/overseer Error:KeeperErrorCode = NodeExists for /solr/overseer
[junit4:junit4]   2> 8717 T1625 oazs.PrepRequestProcessor.pRequest Got user-level KeeperException when processing sessionid:0x139f11fb7cd0005 type:create cxid:0x2 zxid:0xfffffffffffffffe txntype:unknown reqpath:n/a Error Path:/solr/overseer Error:KeeperErrorCode = NodeExists for /solr/overseer
[junit4:junit4]   2> 8738 T1620 oasc.ZkController.createEphemeralLiveNode Register node as live in ZooKeeper:/live_nodes/127.0.0.1:39076_solr
[junit4:junit4]   2> 8739 T1625 oazs.PrepRequestProcessor.pRequest Got user-level KeeperException when processing sessionid:0x139f11fb7cd0005 type:delete cxid:0x4 zxid:0xfffffffffffffffe txntype:unknown reqpath:n/a Error Path:/solr/live_nodes/127.0.0.1:39076_solr Error:KeeperErrorCode = NoNode for /solr/live_nodes/127.0.0.1:39076_solr
[junit4:junit4]   2> 8740 T1620 oascc.SolrZkClient.makePath makePath: /live_nodes/127.0.0.1:39076_solr
[junit4:junit4]   2> 8751 T1666 oascc.ZkStateReader$3.process Updating live nodes
[junit4:junit4]   2> 8751 T1654 oascc.ZkStateReader$3.process Updating live nodes
[junit4:junit4]   2> 8751 T1640 oascc.ZkStateReader$3.process Updating live nodes
[junit4:junit4]   2> 8751 T1620 oashc.HttpShardHandlerFactory.getParameter Setting socketTimeout to: 0
[junit4:junit4]   2> 8752 T1620 oashc.HttpShardHandlerFactory.getParameter Setting urlScheme to: http://
[junit4:junit4]   2> 8753 T1620 oashc.HttpShardHandlerFactory.getParameter Setting connTimeout to: 0
[junit4:junit4]   2> 8753 T1620 oashc.HttpShardHandlerFactory.getParameter Setting maxConnectionsPerHost to: 20
[junit4:junit4]   2> 8754 T1620 oashc.HttpShardHandlerFactory.getParameter Setting corePoolSize to: 0
[junit4:junit4]   2> 8754 T1620 oashc.HttpShardHandlerFactory.getParameter Setting maximumPoolSize to: 2147483647
[junit4:junit4]   2> 8755 T1620 oashc.HttpShardHandlerFactory.getParameter Setting maxThreadIdleTime to: 5
[junit4:junit4]   2> 8755 T1620 oashc.HttpShardHandlerFactory.getParameter Setting sizeOfQueue to: -1
[junit4:junit4]   2> 8756 T1620 oashc.HttpShardHandlerFactory.getParameter Setting fairnessPolicy to: false
[junit4:junit4]   2> 8756 T1620 oascsi.HttpClientUtil.createClient Creating new http client, config:maxConnectionsPerHost=20&maxConnections=10000&socketTimeout=0&connTimeout=0&retry=false
[junit4:junit4]   2> 8774 T1641 oascc.ZkStateReader.updateClusterState Updating cloud state from ZooKeeper... 
[junit4:junit4]   2> 8775 T1620 oascc.ZkStateReader.createClusterStateWatchersAndUpdate Updating cluster state from ZooKeeper... 
[junit4:junit4]   2> 8792 T1620 oasc.CoreContainer.create Creating SolrCore 'collection1' using instanceDir: /usr/home/hudson/hudson-slave/workspace/Lucene-Solr-Tests-trunk-java7/solr/build/solr-core/test/J0/./org.apache.solr.cloud.SyncSliceTest-jetty3-1348370159782/collection1
[junit4:junit4]   2> 8792 T1620 oasc.ZkController.createCollectionZkNode Check for collection zkNode:collection1
[junit4:junit4]   2> 8797 T1680 oascc.ZkStateReader$2.process A cluster state change has occurred - updating...
[junit4:junit4]   2> 8797 T1666 oascc.ZkStateReader$2.process A cluster state change has occurred - updating...
[junit4:junit4]   2> 8797 T1654 oascc.ZkStateReader$2.process A cluster state change has occurred - updating...
[junit4:junit4]   2> 8797 T1640 oascc.ZkStateReader$2.process A cluster state change has occurred - updating...
[junit4:junit4]   2> 8797 T1620 oasc.ZkController.createCollectionZkNode Collection zkNode exists
[junit4:junit4]   2> 8799 T1620 oasc.ZkController.readConfigName Load collection config from:/collections/collection1
[junit4:junit4]   2> 8810 T1620 oasc.SolrResourceLoader.<init> new SolrResourceLoader for directory: '/usr/home/hudson/hudson-slave/workspace/Lucene-Solr-Tests-trunk-java7/solr/build/solr-core/test/J0/./org.apache.solr.cloud.SyncSliceTest-jetty3-1348370159782/collection1/'
[junit4:junit4]   2> 8812 T1620 oasc.SolrResourceLoader.replaceClassLoader Adding 'file:/usr/home/hudson/hudson-slave/workspace/Lucene-Solr-Tests-trunk-java7/solr/build/solr-core/test/J0/org.apache.solr.cloud.SyncSliceTest-jetty3-1348370159782/collection1/lib/classes/' to classloader
[junit4:junit4]   2> 8813 T1620 oasc.SolrResourceLoader.replaceClassLoader Adding 'file:/usr/home/hudson/hudson-slave/workspace/Lucene-Solr-Tests-trunk-java7/solr/build/solr-core/test/J0/org.apache.solr.cloud.SyncSliceTest-jetty3-1348370159782/collection1/lib/README' to classloader
[junit4:junit4]   2> 8872 T1620 oasc.SolrConfig.<init> Using Lucene MatchVersion: LUCENE_50
[junit4:junit4]   2> 8952 T1620 oasc.SolrConfig.<init> Loaded SolrConfig: solrconfig.xml
[junit4:junit4]   2> 9053 T1620 oass.IndexSchema.readSchema Reading Solr Schema
[junit4:junit4]   2> 9062 T1620 oass.IndexSchema.readSchema Schema name=test
[junit4:junit4]   2> 9746 T1620 oass.OpenExchangeRatesOrgProvider.init Initialized with rates=open-exchange-rates.json, refreshInterval=1440.
[junit4:junit4]   2> 9760 T1620 oass.IndexSchema.readSchema default search field in schema is text
[junit4:junit4]   2> 9765 T1620 oass.IndexSchema.readSchema unique key field: id
[junit4:junit4]   2> 9779 T1620 oass.FileExchangeRateProvider.reload Reloading exchange rates from file currency.xml
[junit4:junit4]   2> 9785 T1620 oass.FileExchangeRateProvider.reload Reloading exchange rates from file currency.xml
[junit4:junit4]   2> 9790 T1620 oass.OpenExchangeRatesOrgProvider.reload Reloading exchange rates from open-exchange-rates.json
[junit4:junit4]   2> 9792 T1620 oass.OpenExchangeRatesOrgProvider.reload Reloading exchange rates from open-exchange-rates.json
[junit4:junit4]   2> 9793 T1620 oasc.SolrCore.<init> [collection1] Opening new SolrCore at /usr/home/hudson/hudson-slave/workspace/Lucene-Solr-Tests-trunk-java7/solr/build/solr-core/test/J0/./org.apache.solr.cloud.SyncSliceTest-jetty3-1348370159782/collection1/, dataDir=./org.apache.solr.cloud.SyncSliceTest-1348370151365/jetty3/
[junit4:junit4]   2> 9794 T1620 oasc.JmxMonitoredMap.<init> JMX monitoring is enabled. Adding Solr mbeans to JMX Server: com.sun.jmx.mbeanserver.JmxMBeanServer@4b4603d6
[junit4:junit4]   2> 9795 T1620 oasc.SolrCore.getNewIndexDir WARNING New index directory detected: old=null new=./org.apache.solr.cloud.SyncSliceTest-1348370151365/jetty3/index/
[junit4:junit4]   2> 9796 T1620 oasc.SolrCore.initIndex WARNING [collection1] Solr index directory './org.apache.solr.cloud.SyncSliceTest-1348370151365/jetty3/index' doesn't exist. Creating new index...
[junit4:junit4]   2> 9797 T1620 oasc.CachingDirectoryFactory.get return new directory for /usr/home/hudson/hudson-slave/workspace/Lucene-Solr-Tests-trunk-java7/solr/build/solr-core/test/J0/./org.apache.solr.cloud.SyncSliceTest-1348370151365/jetty3/index forceNew:false
[junit4:junit4]   2> 9820 T1620 oasc.SolrDeletionPolicy.onCommit SolrDeletionPolicy.onCommit: commits:num=1
[junit4:junit4]   2> 		commit{dir=/usr/home/hudson/hudson-slave/workspace/Lucene-Solr-Tests-trunk-java7/solr/build/solr-core/test/J0/org.apache.solr.cloud.SyncSliceTest-1348370151365/jetty3/index,segFN=segments_1,generation=1,filenames=[segments_1]
[junit4:junit4]   2> 9821 T1620 oasc.SolrDeletionPolicy.updateCommits newest commit = 1
[junit4:junit4]   2> 9832 T1620 oasc.SolrCore.initWriters created xml: solr.XMLResponseWriter
[junit4:junit4]   2> 9835 T1620 oasup.UpdateRequestProcessorChain.init inserting DistributedUpdateProcessorFactory into updateRequestProcessorChain "dedupe"
[junit4:junit4]   2> 9836 T1620 oasup.UpdateRequestProcessorChain.init inserting DistributedUpdateProcessorFactory into updateRequestProcessorChain "dedupe-allfields"
[junit4:junit4]   2> 9837 T1620 oasup.UpdateRequestProcessorChain.init inserting DistributedUpdateProcessorFactory into updateRequestProcessorChain "stored_sig"
[junit4:junit4]   2> 9837 T1620 oasup.UpdateRequestProcessorChain.init inserting DistributedUpdateProcessorFactory into updateRequestProcessorChain "uniq-fields"
[junit4:junit4]   2> 9838 T1620 oasup.UpdateRequestProcessorChain.init inserting DistributedUpdateProcessorFactory into updateRequestProcessorChain "distrib-dup-test-chain-implicit"
[junit4:junit4]   2> 9839 T1620 oasc.RequestHandlers.initHandlersFromConfig adding lazy requestHandler: solr.ReplicationHandler
[junit4:junit4]   2> 9840 T1620 oasc.RequestHandlers.initHandlersFromConfig created /replication: solr.ReplicationHandler
[junit4:junit4]   2> 9840 T1620 oasc.RequestHandlers.initHandlersFromConfig created standard: solr.StandardRequestHandler
[junit4:junit4]   2> 9841 T1620 oasc.RequestHandlers.initHandlersFromConfig created /get: solr.RealTimeGetHandler
[junit4:junit4]   2> 9842 T1620 oasc.RequestHandlers.initHandlersFromConfig created dismax: solr.SearchHandler
[junit4:junit4]   2> 9843 T1620 oasc.RequestHandlers.initHandlersFromConfig created mock: org.apache.solr.core.MockQuerySenderListenerReqHandler
[junit4:junit4]   2> 9844 T1620 oasc.RequestHandlers.initHandlersFromConfig created /admin/: org.apache.solr.handler.admin.AdminHandlers
[junit4:junit4]   2> 9844 T1620 oasc.RequestHandlers.initHandlersFromConfig created defaults: solr.StandardRequestHandler
[junit4:junit4]   2> 9845 T1620 oasc.RequestHandlers.initHandlersFromConfig adding lazy requestHandler: solr.StandardRequestHandler
[junit4:junit4]   2> 9846 T1620 oasc.RequestHandlers.initHandlersFromConfig created lazy: solr.StandardRequestHandler
[junit4:junit4]   2> 9847 T1620 oasc.RequestHandlers.initHandlersFromConfig created /update: solr.UpdateRequestHandler
[junit4:junit4]   2> 9847 T1620 oasc.RequestHandlers.initHandlersFromConfig created /terms: org.apache.solr.handler.component.SearchHandler
[junit4:junit4]   2> 9848 T1620 oasc.RequestHandlers.initHandlersFromConfig created spellCheckCompRH: org.apache.solr.handler.component.SearchHandler
[junit4:junit4]   2> 9849 T1620 oasc.RequestHandlers.initHandlersFromConfig created spellCheckCompRH_Direct: org.apache.solr.handler.component.SearchHandler
[junit4:junit4]   2> 9850 T1620 oasc.RequestHandlers.initHandlersFromConfig created spellCheckWithWordbreak: org.apache.solr.handler.component.SearchHandler
[junit4:junit4]   2> 9850 T1620 oasc.RequestHandlers.initHandlersFromConfig created spellCheckWithWordbreak_Direct: org.apache.solr.handler.component.SearchHandler
[junit4:junit4]   2> 9851 T1620 oasc.RequestHandlers.initHandlersFromConfig created spellCheckCompRH1: org.apache.solr.handler.component.SearchHandler
[junit4:junit4]   2> 9852 T1620 oasc.RequestHandlers.initHandlersFromConfig created tvrh: org.apache.solr.handler.component.SearchHandler
[junit4:junit4]   2> 9853 T1620 oasc.RequestHandlers.initHandlersFromConfig created /mlt: solr.MoreLikeThisHandler
[junit4:junit4]   2> 9854 T1620 oasc.RequestHandlers.initHandlersFromConfig created /debug/dump: solr.DumpRequestHandler
[junit4:junit4]   2> 9858 T1620 oashl.XMLLoader.init xsltCacheLifetimeSeconds=60
[junit4:junit4]   2> 9863 T1620 oasc.SolrCore.initDeprecatedSupport WARNING solrconfig.xml uses deprecated <admin/gettableFiles>, Please update your config to use the ShowFileRequestHandler.
[junit4:junit4]   2> 9865 T1620 oasc.SolrCore.initDeprecatedSupport WARNING adding ShowFileRequestHandler with hidden files: [SCHEMA.XML, OLD_SYNONYMS.TXT, STOPWORDS.TXT, PROTWORDS.TXT, OPEN-EXCHANGE-RATES.JSON, SYNONYMS.TXT, CURRENCY.XML, MAPPING-ISOLATIN1ACCENT.TXT]
[junit4:junit4]   2> 9869 T1620 oass.SolrIndexSearcher.<init> Opening Searcher@44a80432 main
[junit4:junit4]   2> 9870 T1620 oasu.CommitTracker.<init> Hard AutoCommit: disabled
[junit4:junit4]   2> 9871 T1620 oasu.CommitTracker.<init> Soft AutoCommit: disabled
[junit4:junit4]   2> 9872 T1620 oashc.SpellCheckComponent.inform Initializing spell checkers
[junit4:junit4]   2> 9897 T1620 oass.DirectSolrSpellChecker.init init: {name=direct,classname=DirectSolrSpellChecker,field=lowerfilt,minQueryLength=3}
[junit4:junit4]   2> 9990 T1681 oasc.SolrCore.registerSearcher [collection1] Registered new searcher Searcher@44a80432 main{StandardDirectoryReader(segments_1:1)}
[junit4:junit4]   2> 10323 T1641 oascc.ZkStateReader.updateClusterState Updating cloud state from ZooKeeper... 
[junit4:junit4]   2> 10349 T1680 oascc.ZkStateReader$2.process A cluster state change has occurred - updating...
[junit4:junit4]   2> 10349 T1654 oascc.ZkStateReader$2.process A cluster state change has occurred - updating...
[junit4:junit4]   2> 10350 T1640 oascc.ZkStateReader$2.process A cluster state change has occurred - updating...
[junit4:junit4]   2> 10350 T1666 oascc.ZkStateReader$2.process A cluster state change has occurred - updating...
[junit4:junit4]   2> 10497 T1620 oasc.CoreContainer.register registering core: collection1
[junit4:junit4]   2> 10498 T1620 oasc.ZkController.register Register shard - core:collection1 address:http://127.0.0.1:39076/solr shardId:shard1
[junit4:junit4]   2> 10502 T1620 oasc.ZkController.register We are http://127.0.0.1:39076/solr/collection1/ and leader is http://127.0.0.1:39063/solr/collection1/
[junit4:junit4]   2> 10502 T1620 oasc.ZkController.register No LogReplay needed for core=collection1 baseURL=http://127.0.0.1:39076/solr
[junit4:junit4]   2> 10503 T1620 oasc.ZkController.checkRecovery Core needs to recover:collection1
[junit4:junit4]   2> 10503 T1620 oasu.DefaultSolrCoreState.doRecovery Running recovery - first canceling any ongoing recovery
[junit4:junit4]   2> ASYNC  NEW_CORE C153 name=collection1 org.apache.solr.core.SolrCore@4e1ef3e5 url=http://127.0.0.1:39076/solr/collection1 node=127.0.0.1:39076_solr
[junit4:junit4]   2> 10504 T1682 C153 P39076 oasc.RecoveryStrategy.run Starting recovery process.  core=collection1 recoveringAfterStartup=true
[junit4:junit4]   2> 10505 T1682 C153 P39076 oasc.RecoveryStrategy.doRecovery ###### startupVersions=[]
[junit4:junit4]   2> 10504 T1620 oascc.ZkStateReader.updateClusterState Updating cloud state from ZooKeeper... 
[junit4:junit4]   2> 10507 T1682 C153 P39076 oasc.RecoveryStrategy.doRecovery Attempting to PeerSync from http://127.0.0.1:39063/solr/collection1/ core=collection1 - recoveringAfterStartup=true
[junit4:junit4]   2> 10507 T1682 C153 P39076 oasu.PeerSync.sync PeerSync: core=collection1 url=http://127.0.0.1:39076/solr START replicas=[http://127.0.0.1:39063/solr/collection1/] nUpdates=100
[junit4:junit4]   2> 10507 T1620 oass.SolrDispatchFilter.init user.dir=/usr/home/hudson/hudson-slave/workspace/Lucene-Solr-Tests-trunk-java7/solr/build/solr-core/test/J0
[junit4:junit4]   2> 10508 T1682 C153 P39076 oasu.PeerSync.sync WARNING no frame of reference to tell of we've missed updates
[junit4:junit4]   2> 10508 T1620 oass.SolrDispatchFilter.init SolrDispatchFilter.init() done
[junit4:junit4]   2> 10508 T1682 C153 P39076 oasc.RecoveryStrategy.doRecovery PeerSync Recovery was not successful - trying replication. core=collection1
[junit4:junit4]   2> 10508 T1682 C153 P39076 oasc.RecoveryStrategy.doRecovery Starting Replication Recovery. core=collection1
[junit4:junit4]   2> 10508 T1620 oascsi.HttpClientUtil.createClient Creating new http client, config:maxConnections=128&maxConnectionsPerHost=32&followRedirects=false
[junit4:junit4]   2> 10509 T1682 C153 P39076 oascsi.HttpClientUtil.createClient Creating new http client, config:maxConnections=128&maxConnectionsPerHost=32&followRedirects=false
[junit4:junit4]   2> 10510 T1646 C152 P39063 REQ /get {distrib=false&qt=/get&wt=javabin&version=2&getVersions=100} status=0 QTime=0 
[junit4:junit4]   2> 10691 T1620 oejs.Server.doStart jetty-8.1.2.v20120308
[junit4:junit4]   2> 10694 T1620 oejs.AbstractConnector.doStart Started SocketConnector@0.0.0.0:39084
[junit4:junit4]   2> 10695 T1620 oasc.SolrResourceLoader.locateSolrHome JNDI not configured for solr (NoInitialContextEx)
[junit4:junit4]   2> 10696 T1620 oasc.SolrResourceLoader.locateSolrHome using system property solr.solr.home: /usr/home/hudson/hudson-slave/workspace/Lucene-Solr-Tests-trunk-java7/solr/build/solr-core/test/J0/./org.apache.solr.cloud.SyncSliceTest-jetty4-1348370161891
[junit4:junit4]   2> 10696 T1620 oasc.SolrResourceLoader.<init> new SolrResourceLoader for deduced Solr Home: '/usr/home/hudson/hudson-slave/workspace/Lucene-Solr-Tests-trunk-java7/solr/build/solr-core/test/J0/./org.apache.solr.cloud.SyncSliceTest-jetty4-1348370161891/'
[junit4:junit4]   2> 10741 T1620 oass.SolrDispatchFilter.init SolrDispatchFilter.init()
[junit4:junit4]   2> 10742 T1620 oasc.SolrResourceLoader.locateSolrHome JNDI not configured for solr (NoInitialContextEx)
[junit4:junit4]   2> 10742 T1620 oasc.SolrResourceLoader.locateSolrHome using system property solr.solr.home: /usr/home/hudson/hudson-slave/workspace/Lucene-Solr-Tests-trunk-java7/solr/build/solr-core/test/J0/./org.apache.solr.cloud.SyncSliceTest-jetty4-1348370161891
[junit4:junit4]   2> 10743 T1620 oasc.CoreContainer$Initializer.initialize looking for solr.xml: /usr/home/hudson/hudson-slave/workspace/Lucene-Solr-Tests-trunk-java7/solr/build/solr-core/test/J0/./org.apache.solr.cloud.SyncSliceTest-jetty4-1348370161891/solr.xml
[junit4:junit4]   2> 10743 T1620 oasc.CoreContainer.<init> New CoreContainer 1104130743
[junit4:junit4]   2> 10744 T1620 oasc.CoreContainer.load Loading CoreContainer using Solr Home: '/usr/home/hudson/hudson-slave/workspace/Lucene-Solr-Tests-trunk-java7/solr/build/solr-core/test/J0/./org.apache.solr.cloud.SyncSliceTest-jetty4-1348370161891/'
[junit4:junit4]   2> 10744 T1620 oasc.SolrResourceLoader.<init> new SolrResourceLoader for directory: '/usr/home/hudson/hudson-slave/workspace/Lucene-Solr-Tests-trunk-java7/solr/build/solr-core/test/J0/./org.apache.solr.cloud.SyncSliceTest-jetty4-1348370161891/'
[junit4:junit4]   2> 10779 T1620 oasc.CoreContainer.load Registering Log Listener
[junit4:junit4]   2> 10796 T1620 oasc.CoreContainer.initZooKeeper Zookeeper client=127.0.0.1:39054/solr
[junit4:junit4]   2> 10797 T1620 oaz.ZooKeeper.<init> Initiating client connection, connectString=127.0.0.1:39054/solr sessionTimeout=5000 watcher=org.apache.solr.common.cloud.ConnectionManager@4671c5d
[junit4:junit4]   2> 10798 T1693 oaz.ClientCnxn$SendThread.startConnect Opening socket connection to server /127.0.0.1:39054
[junit4:junit4]   2> 10798 T1620 oascc.ConnectionManager.waitForConnected Waiting for client to connect to ZooKeeper
[junit4:junit4]   2> 10799 T1693 oaz.ClientCnxn$SendThread.primeConnection Socket connection established to localhost/127.0.0.1:39054, initiating session
[junit4:junit4]   2> 10799 T1622 oazs.NIOServerCnxn$Factory.run Accepted socket connection from /140.211.11.196:39085
[junit4:junit4]   2> 10800 T1622 oazs.NIOServerCnxn.readConnectRequest Client attempting to establish new session at /140.211.11.196:39085
[junit4:junit4]   2> 10804 T1624 oazs.NIOServerCnxn.finishSessionInit Established session 0x139f11fb7cd0006 with negotiated timeout 5000 for client /140.211.11.196:39085
[junit4:junit4]   2> 10804 T1693 oaz.ClientCnxn$SendThread.readConnectResult Session establishment complete on server localhost/127.0.0.1:39054, sessionid = 0x139f11fb7cd0006, negotiated timeout = 5000
[junit4:junit4]   2> 10805 T1694 oascc.ConnectionManager.process Watcher org.apache.solr.common.cloud.ConnectionManager@4671c5d name:ZooKeeperConnection Watcher:127.0.0.1:39054/solr got event WatchedEvent state:SyncConnected type:None path:null path:null type:None
[junit4:junit4]   2> 10805 T1620 oascc.ConnectionManager.waitForConnected Client is connected to ZooKeeper
[junit4:junit4]   2> 10807 T1625 oazs.PrepRequestProcessor.pRequest Got user-level KeeperException when processing sessionid:0x139f11fb7cd0006 type:create cxid:0x1 zxid:0xfffffffffffffffe txntype:unknown reqpath:n/a Error Path:/solr/overseer Error:KeeperErrorCode = NodeExists for /solr/overseer
[junit4:junit4]   2> 10808 T1625 oazs.PrepRequestProcessor.pRequest Got user-level KeeperException when processing sessionid:0x139f11fb7cd0006 type:create cxid:0x2 zxid:0xfffffffffffffffe txntype:unknown reqpath:n/a Error Path:/solr/overseer Error:KeeperErrorCode = NodeExists for /solr/overseer
[junit4:junit4]   2> 10824 T1620 oasc.ZkController.createEphemeralLiveNode Register node as live in ZooKeeper:/live_nodes/127.0.0.1:39084_solr
[junit4:junit4]   2> 10825 T1625 oazs.PrepRequestProcessor.pRequest Got user-level KeeperException when processing sessionid:0x139f11fb7cd0006 type:delete cxid:0x4 zxid:0xfffffffffffffffe txntype:unknown reqpath:n/a Error Path:/solr/live_nodes/127.0.0.1:39084_solr Error:KeeperErrorCode = NoNode for /solr/live_nodes/127.0.0.1:39084_solr
[junit4:junit4]   2> 10831 T1620 oascc.SolrZkClient.makePath makePath: /live_nodes/127.0.0.1:39084_solr
[junit4:junit4]   2> 10852 T1666 oascc.ZkStateReader$3.process Updating live nodes
[junit4:junit4]   2> 10852 T1654 oascc.ZkStateReader$3.process Updating live nodes
[junit4:junit4]   2> 10852 T1680 oascc.ZkStateReader$3.process Updating live nodes
[junit4:junit4]   2> 10852 T1640 oascc.ZkStateReader$3.process Updating live nodes
[junit4:junit4]   2> 10853 T1620 oashc.HttpShardHandlerFactory.getParameter Setting socketTimeout to: 0
[junit4:junit4]   2> 10853 T1620 oashc.HttpShardHandlerFactory.getParameter Setting urlScheme to: http://
[junit4:junit4]   2> 10854 T1620 oashc.HttpShardHandlerFactory.getParameter Setting connTimeout to: 0
[junit4:junit4]   2> 10854 T1620 oashc.HttpShardHandlerFactory.getParameter Setting maxConnectionsPerHost to: 20
[junit4:junit4]   2> 10855 T1620 oashc.HttpShardHandlerFactory.getParameter Setting corePoolSize to: 0
[junit4:junit4]   2> 10856 T1620 oashc.HttpShardHandlerFactory.getParameter Setting maximumPoolSize to: 2147483647
[junit4:junit4]   2> 10856 T1620 oashc.HttpShardHandlerFactory.getParameter Setting maxThreadIdleTime to: 5
[junit4:junit4]   2> 10857 T1620 oashc.HttpShardHandlerFactory.getParameter Setting sizeOfQueue to: -1
[junit4:junit4]   2> 10857 T1620 oashc.HttpShardHandlerFactory.getParameter Setting fairnessPolicy to: false
[junit4:junit4]   2> 10858 T1620 oascsi.HttpClientUtil.createClient Creating new http client, config:maxConnectionsPerHost=20&maxConnections=10000&socketTimeout=0&connTimeout=0&retry=false
[junit4:junit4]   2> 10869 T1641 oascc.ZkStateReader.updateClusterState Updating cloud state from ZooKeeper... 
[junit4:junit4]   2> 10888 T1680 oascc.ZkStateReader$2.process A cluster state change has occurred - updating...
[junit4:junit4]   2> 10888 T1640 oascc.ZkStateReader$2.process A cluster state change has occurred - updating...
[junit4:junit4]   2> 10888 T1666 oascc.ZkStateReader$2.process A cluster state change has occurred - updating...
[junit4:junit4]   2> 10888 T1654 oascc.ZkStateReader$2.process A cluster state change has occurred - updating...
[junit4:junit4]   2> 10889 T1620 oascc.ZkStateReader.createClusterStateWatchersAndUpdate Updating cluster state from ZooKeeper... 
[junit4:junit4]   2> 10899 T1620 oasc.CoreContainer.create Creating SolrCore 'collection1' using instanceDir: /usr/home/hudson/hudson-slave/workspace/Lucene-Solr-Tests-trunk-java7/solr/build/solr-core/test/J0/./org.apache.solr.cloud.SyncSliceTest-jetty4-1348370161891/collection1
[junit4:junit4]   2> 10900 T1620 oasc.ZkController.createCollectionZkNode Check for collection zkNode:collection1
[junit4:junit4]   2> 10900 T1620 oasc.ZkController.createCollectionZkNode Collection zkNode exists
[junit4:junit4]   2> 10901 T1620 oasc.ZkController.readConfigName Load collection config from:/collections/collection1
[junit4:junit4]   2> 10903 T1620 oasc.SolrResourceLoader.<init> new SolrResourceLoader for directory: '/usr/home/hudson/hudson-slave/workspace/Lucene-Solr-Tests-trunk-java7/solr/build/solr-core/test/J0/./org.apache.solr.cloud.SyncSliceTest-jetty4-1348370161891/collection1/'
[junit4:junit4]   2> 10904 T1620 oasc.SolrResourceLoader.replaceClassLoader Adding 'file:/usr/home/hudson/hudson-slave/workspace/Lucene-Solr-Tests-trunk-java7/solr/build/solr-core/test/J0/org.apache.solr.cloud.SyncSliceTest-jetty4-1348370161891/collection1/lib/classes/' to classloader
[junit4:junit4]   2> 10905 T1620 oasc.SolrResourceLoader.replaceClassLoader Adding 'file:/usr/home/hudson/hudson-slave/workspace/Lucene-Solr-Tests-trunk-java7/solr/build/solr-core/test/J0/org.apache.solr.cloud.SyncSliceTest-jetty4-1348370161891/collection1/lib/README' to classloader
[junit4:junit4]   2> 10966 T1620 oasc.SolrConfig.<init> Using Lucene MatchVersion: LUCENE_50
[junit4:junit4]   2> 11038 T1620 oasc.SolrConfig.<init> Loaded SolrConfig: solrconfig.xml
[junit4:junit4]   2> 11140 T1620 oass.IndexSchema.readSchema Reading Solr Schema
[junit4:junit4]   2> 11148 T1620 oass.IndexSchema.readSchema Schema name=test
[junit4:junit4]   2>  C151_STATE=coll:collection1 core:collection1 props:{shard=shard1, roles=null, state=recovering, core=collection1, collection=collection1, node_name=127.0.0.1:39067_solr, base_url=http://127.0.0.1:39067/solr}
[junit4:junit4]   2> 11433 T1668 C151 P39067 oasc.RecoveryStrategy.doRecovery Begin buffering updates. core=collection1
[junit4:junit4]   2> 11433 T1668 C151 P39067 oasu.UpdateLog.bufferUpdates Starting to buffer updates. FSUpdateLog{state=ACTIVE, tlog=null}
[junit4:junit4]   2> 11433 T1668 C151 P39067 oasc.RecoveryStrategy.replicate Attempting to replicate from http://127.0.0.1:39063/solr/collection1/. core=collection1
[junit4:junit4]   2> 11434 T1668 C151 P39067 oascsi.HttpClientUtil.createClient Creating new http client, config:maxConnections=128&maxConnectionsPerHost=32&followRedirects=false
[junit4:junit4]   2> 11446 T1649 C152 P39063 oasu.DirectUpdateHandler2.commit start commit{flags=0,_version_=0,optimize=false,openSearcher=true,waitSearcher=true,expungeDeletes=false,softCommit=false}
[junit4:junit4]   2> 11533 T1649 C152 P39063 oasc.SolrDeletionPolicy.onInit SolrDeletionPolicy.onInit: commits:num=1
[junit4:junit4]   2> 		commit{dir=/usr/home/hudson/hudson-slave/workspace/Lucene-Solr-Tests-trunk-java7/solr/build/solr-core/test/J0/org.apache.solr.cloud.SyncSliceTest-1348370151365/jetty1/index,segFN=segments_1,generation=1,filenames=[segments_1]
[junit4:junit4]   2> 11535 T1649 C152 P39063 oasc.SolrDeletionPolicy.updateCommits newest commit = 1
[junit4:junit4]   2> 11537 T1649 C152 P39063 oass.SolrIndexSearcher.<init> Opening Searcher@7bafbdbb main
[junit4:junit4]   2> 11538 T1649 C152 P39063 oasu.DirectUpdateHandler2.commit end_commit_flush
[junit4:junit4]   2> 11540 T1655 oasc.SolrCore.registerSearcher [collection1] Registered new searcher Searcher@7bafbdbb main{StandardDirectoryReader(segments_1:1)}
[junit4:junit4]   2> 11541 T1649 C152 P39063 /update {waitSearcher=true&commit=true&commit_end_point=true&wt=javabin&softCommit=false&version=2} {commit=} 0 95
[junit4:junit4]   2> 11542 T1668 C151 P39067 oash.ReplicationHandler.inform Commits will be reserved for  10000
[junit4:junit4]   2> 11542 T1668 C151 P39067 oash.SnapPuller.<init>  No value set for 'pollInterval'. Timer Task not started.
[junit4:junit4]   2> 11545 T1650 C152 P39063 oash.ReplicationHandler.inform Commits will be reserved for  10000
[junit4:junit4]   2> 11546 T1650 C152 P39063 REQ /replication {command=indexversion&wt=javabin&qt=/replication&version=2} status=0 QTime=2 
[junit4:junit4]   2> 11557 T1668 C151 P39067 oasc.SolrDeletionPolicy.onInit SolrDeletionPolicy.onInit: commits:num=1
[junit4:junit4]   2> 		commit{dir=/usr/home/hudson/hudson-slave/workspace/Lucene-Solr-Tests-trunk-java7/solr/build/solr-core/test/J0/org.apache.solr.cloud.SyncSliceTest-1348370151365/jetty2/index,segFN=segments_1,generation=1,filenames=[segments_1]
[junit4:junit4]   2> 11557 T1668 C151 P39067 oasc.SolrDeletionPolicy.updateCommits newest commit = 1
[junit4:junit4]   2> 11558 T1668 C151 P39067 oasu.DirectUpdateHandler2.commit start commit{flags=0,_version_=0,optimize=false,openSearcher=true,waitSearcher=true,expungeDeletes=false,softCommit=false}
[junit4:junit4]   2> 11570 T1668 C151 P39067 oasc.SolrDeletionPolicy.onCommit SolrDeletionPolicy.onCommit: commits:num=2
[junit4:junit4]   2> 		commit{dir=/usr/home/hudson/hudson-slave/workspace/Lucene-Solr-Tests-trunk-java7/solr/build/solr-core/test/J0/org.apache.solr.cloud.SyncSliceTest-1348370151365/jetty2/index,segFN=segments_1,generation=1,filenames=[segments_1]
[junit4:junit4]   2> 		commit{dir=/usr/home/hudson/hudson-slave/workspace/Lucene-Solr-Tests-trunk-java7/solr/build/solr-core/test/J0/org.apache.solr.cloud.SyncSliceTest-1348370151365/jetty2/index,segFN=segments_2,generation=2,filenames=[segments_2]
[junit4:junit4]   2> 11570 T1668 C151 P39067 oasc.SolrDeletionPolicy.updateCommits newest commit = 2
[junit4:junit4]   2> 11584 T1668 C151 P39067 oass.SolrIndexSearcher.<init> Opening Searcher@615a0db8 main
[junit4:junit4]   2> 11585 T1668 C151 P39067 oasu.DirectUpdateHandler2.commit end_commit_flush
[junit4:junit4]   2> 11586 T1667 oasc.SolrCore.registerSearcher [collection1] Registered new searcher Searcher@615a0db8 main{StandardDirectoryReader(segments_2:2)}
[junit4:junit4]   2> 11586 T1668 C151 P39067 oasc.RecoveryStrategy.replay No replay needed. core=collection1
[junit4:junit4]   2> 11586 T1668 C151 P39067 oasc.RecoveryStrategy.doRecovery Replication Recovery was successful - registering as Active. core=collection1
[junit4:junit4]   2> 11592 T1668 C151 P39067 oasc.RecoveryStrategy.doRecovery Finished recovery process. core=collection1
[junit4:junit4]   2> 11889 T1620 oass.OpenExchangeRatesOrgProvider.init Initialized with rates=open-exchange-rates.json, refreshInterval=1440.
[junit4:junit4]   2> 11897 T1641 oascc.ZkStateReader.updateClusterState Updating cloud state from ZooKeeper... 
[junit4:junit4]   2> 11906 T1620 oass.IndexSchema.readSchema default search field in schema is text
[junit4:junit4]   2> 11911 T1620 oass.IndexSchema.readSchema unique key field: id
[junit4:junit4]   2> 11929 T1654 oascc.ZkStateReader$2.process A cluster state change has occurred - updating...
[junit4:junit4]   2> 11929 T1640 oascc.ZkStateReader$2.process A cluster state change has occurred - updating...
[junit4:junit4]   2> 11929 T1666 oascc.ZkStateReader$2.process A cluster state change has occurred - updating...
[junit4:junit4]   2> 11929 T1694 oascc.ZkStateReader$2.process A cluster state change has occurred - updating...
[junit4:junit4]   2> 11929 T1680 oascc.ZkStateReader$2.process A cluster state change has occurred - updating...
[junit4:junit4]   2> 11945 T1620 oass.FileExchangeRateProvider.reload Reloading exchange rates from file currency.xml
[junit4:junit4]   2> 11961 T1620 oass.FileExchangeRateProvider.reload Reloading exchange rates from file currency.xml
[junit4:junit4]   2> 11966 T1620 oass.OpenExchangeRatesOrgProvider.reload Reloading exchange rates from open-exchange-rates.json
[junit4:junit4]   2> 11967 T1620 oass.OpenExchangeRatesOrgProvider.reload Reloading exchange rates from open-exchange-rates.json
[junit4:junit4]   2> 11969 T1620 oasc.SolrCore.<init> [collection1] Opening new SolrCore at /usr/home/hudson/hudson-slave/workspace/Lucene-Solr-Tests-trunk-java7/solr/build/solr-core/test/J0/./org.apache.solr.cloud.SyncSliceTest-jetty4-1348370161891/collection1/, dataDir=./org.apache.solr.cloud.SyncSliceTest-1348370151365/jetty4/
[junit4:junit4]   2> 11969 T1620 oasc.JmxMonitoredMap.<init> JMX monitoring is enabled. Adding Solr mbeans to JMX Server: com.sun.jmx.mbeanserver.JmxMBeanServer@4b4603d6
[junit4:junit4]   2> 11979 T1620 oasc.SolrCore.getNewIndexDir WARNING New index directory detected: old=null new=./org.apache.solr.cloud.SyncSliceTest-1348370151365/jetty4/index/
[junit4:junit4]   2> 11980 T1620 oasc.SolrCore.initIndex WARNING [collection1] Solr index directory './org.apache.solr.cloud.SyncSliceTest-1348370151365/jetty4/index' doesn't exist. Creating new index...
[junit4:junit4]   2> 11981 T1620 oasc.CachingDirectoryFactory.get return new directory for /usr/home/hudson/hudson-slave/workspace/Lucene-Solr-Tests-trunk-java7/solr/build/solr-core/test/J0/./org.apache.solr.cloud.SyncSliceTest-1348370151365/jetty4/index forceNew:false
[junit4:junit4]   2> 12016 T1620 oasc.SolrDeletionPolicy.onCommit SolrDeletionPolicy.onCommit: commits:num=1
[junit4:junit4]   2> 		commit{dir=/usr/home/hudson/hudson-slave/workspace/Lucene-Solr-Tests-trunk-java7/solr/build/solr-core/test/J0/org.apache.solr.cloud.SyncSliceTest-1348370151365/jetty4/index,segFN=segments_1,generation=1,filenames=[segments_1]
[junit4:junit4]   2> 12017 T1620 oasc.SolrDeletionPolicy.updateCommits newest commit = 1
[junit4:junit4]   2> 12029 T1620 oasc.SolrCore.initWriters created xml: solr.XMLResponseWriter
[junit4:junit4]   2> 12032 T1620 oasup.UpdateRequestProcessorChain.init inserting DistributedUpdateProcessorFactory into updateRequestProcessorChain "dedupe"
[junit4:junit4]   2> 12033 T1620 oasup.UpdateRequestProcessorChain.init inserting DistributedUpdateProcessorFactory into updateRequestProcessorChain "dedupe-allfields"
[junit4:junit4]   2> 12033 T1620 oasup.UpdateRequestProcessorChain.init inserting DistributedUpdateProcessorFactory into updateRequestProcessorChain "stored_sig"
[junit4:junit4]   2> 12034 T1620 oasup.UpdateRequestProcessorChain.init inserting DistributedUpdateProcessorFactory into updateRequestProcessorChain "uniq-fields"
[junit4:junit4]   2> 12035 T1620 oasup.UpdateRequestProcessorChain.init inserting DistributedUpdateProcessorFactory into updateRequestProcessorChain "distrib-dup-test-chain-implicit"
[junit4:junit4]   2> 12036 T1620 oasc.RequestHandlers.initHandlersFromConfig adding lazy requestHandler: solr.ReplicationHandler
[junit4:junit4]   2> 12036 T1620 oasc.RequestHandlers.initHandlersFromConfig created /replication: solr.ReplicationHandler
[junit4:junit4]   2> 12037 T1620 oasc.RequestHandlers.initHandlersFromConfig created standard: solr.StandardRequestHandler
[junit4:junit4]   2> 12038 T1620 oasc.RequestHandlers.initHandlersFromConfig created /get: solr.RealTimeGetHandler
[junit4:junit4]   2> 12039 T1620 oasc.RequestHandlers.initHandlersFromConfig created dismax: solr.SearchHandler
[junit4:junit4]   2> 12042 T1620 oasc.RequestHandlers.initHandlersFromConfig created mock: org.apache.solr.core.MockQuerySenderListenerReqHandler
[junit4:junit4]   2> 12044 T1620 oasc.RequestHandlers.initHandlersFromConfig created /admin/: org.apache.solr.handler.admin.AdminHandlers
[junit4:junit4]   2> 12044 T1620 oasc.RequestHandlers.initHandlersFromConfig created defaults: solr.StandardRequestHandler
[junit4:junit4]   2> 12045 T1620 oasc.RequestHandlers.initHandlersFromConfig adding lazy requestHandler: solr.StandardRequestHandler
[junit4:junit4]   2> 12046 T1620 oasc.RequestHandlers.initHandlersFromConfig created lazy: solr.StandardRequestHandler
[junit4:junit4]   2> 12047 T1620 oasc.RequestHandlers.initHandlersFromConfig created /update: solr.UpdateRequestHandler
[junit4:junit4]   2> 12048 T1620 oasc.RequestHandlers.initHandlersFromConfig created /terms: org.apache.solr.handler.component.SearchHandler
[junit4:junit4]   2> 12050 T1620 oasc.RequestHandlers.initHandlersFromConfig created spellCheckCompRH: org.apache.solr.handler.component.SearchHandler
[junit4:junit4]   2> 12051 T1620 oasc.RequestHandlers.initHandlersFromConfig created spellCheckCompRH_Direct: org.apache.solr.handler.component.SearchHandler
[junit4:junit4]   2> 12051 T1620 oasc.RequestHandlers.initHandlersFromConfig created spellCheckWithWordbreak: org.apache.solr.handler.component.SearchHandler
[junit4:junit4]   2> 12052 T1620 oasc.RequestHandlers.initHandlersFromConfig created spellCheckWithWordbreak_Direct: org.apache.solr.handler.component.SearchHandler
[junit4:junit4]   2> 12053 T1620 oasc.RequestHandlers.initHandlersFromConfig created spellCheckCompRH1: org.apache.solr.handler.component.SearchHandler
[junit4:junit4]   2> 12054 T1620 oasc.RequestHandlers.initHandlersFromConfig created tvrh: org.apache.solr.handler.component.SearchHandler
[junit4:junit4]   2> 12054 T1620 oasc.RequestHandlers.initHandlersFromConfig created /mlt: solr.MoreLikeThisHandler
[junit4:junit4]   2> 12055 T1620 oasc.RequestHandlers.initHandlersFromConfig created /debug/dump: solr.DumpRequestHandler
[junit4:junit4]   2> 12059 T1620 oashl.XMLLoader.init xsltCacheLifetimeSeconds=60
[junit4:junit4]   2> 12064 T1620 oasc.SolrCore.initDeprecatedSupport WARNING solrconfig.xml uses deprecated <admin/gettableFiles>, Please update your config to use the ShowFileRequestHandler.
[junit4:junit4]   2> 12065 T1620 oasc.SolrCore.initDeprecatedSupport WARNING adding ShowFileRequestHandler with hidden files: [SCHEMA.XML, OLD_SYNONYMS.TXT, STOPWORDS.TXT, PROTWORDS.TXT, OPEN-EXCHANGE-RATES.JSON, SYNONYMS.TXT, CURRENCY.XML, MAPPING-ISOLATIN1ACCENT.TXT]
[junit4:junit4]   2> 12069 T1620 oass.SolrIndexSearcher.<init> Opening Searcher@35520eaa main
[junit4:junit4]   2> 12071 T1620 oasu.CommitTracker.<init> Hard AutoCommit: disabled
[junit4:junit4]   2> 12071 T1620 oasu.CommitTracker.<init> Soft AutoCommit: disabled
[junit4:junit4]   2> 12072 T1620 oashc.SpellCheckComponent.inform Initializing spell checkers
[junit4:junit4]   2> 12172 T1620 oass.DirectSolrSpellChecker.init init: {name=direct,classname=DirectSolrSpellChecker,field=lowerfilt,minQueryLength=3}
[junit4:junit4]   2> 12470 T1695 oasc.SolrCore.registerSearcher [collection1] Registered new searcher Searcher@35520eaa main{StandardDirectoryReader(segments_1:1)}
[junit4:junit4]   2> 12942 T1641 oascc.ZkStateReader.updateClusterState Updating cloud state from ZooKeeper... 
[junit4:junit4]   2> 12962 T1680 oascc.ZkStateReader$2.process A cluster state change has occurred - updating...
[junit4:junit4]   2> 12962 T1654 oascc.ZkStateReader$2.process A cluster state change has occurred - updating...
[junit4:junit4]   2> 12962 T1694 oascc.ZkStateReader$2.process A cluster state change has occurred - updating...
[junit4:junit4]   2> 12962 T1666 oascc.ZkStateReader$2.process A cluster state change has occurred - updating...
[junit4:junit4]   2> 12962 T1640 oascc.ZkStateReader$2.process A cluster state change has occurred - updating...
[junit4:junit4]   2> 12977 T1620 oasc.CoreContainer.register registering core: collection1
[junit4:junit4]   2> 12977 T1620 oasc.ZkController.register Register shard - core:collection1 address:http://127.0.0.1:39084/solr shardId:shard1
[junit4:junit4]   2> 12983 T1620 oasc.ZkController.register We are http://127.0.0.1:39084/solr/collection1/ and leader is http://127.0.0.1:39063/solr/collection1/
[junit4:junit4]   2> 12984 T1620 oasc.ZkController.register No LogReplay needed for core=collection1 baseURL=http://127.0.0.1:39084/solr
[junit4:junit4]   2> 12984 T1620 oasc.ZkController.checkRecovery Core needs to recover:collection1
[junit4:junit4]   2> 12985 T1620 oasu.DefaultSolrCoreState.doRecovery Running recovery - first canceling any ongoing recovery
[junit4:junit4]   2> ASYNC  NEW_CORE C154 name=collection1 org.apache.solr.core.SolrCore@ef3cd86 url=http://127.0.0.1:39084/solr/collection1 node=127.0.0.1:39084_solr
[junit4:junit4]   2> 12986 T1696 C154 P39084 oasc.RecoveryStrategy.run Starting recovery process.  core=collection1 recoveringAfterStartup=true
[junit4:junit4]   2> 12987 T1696 C154 P39084 oasc.RecoveryStrategy.doRecovery ###### startupVersions=[]
[junit4:junit4]   2> 12986 T1620 oascc.ZkStateReader.updateClusterState Updating cloud state from ZooKeeper... 
[junit4:junit4]   2> 12996 T1696 C154 P39084 oasc.RecoveryStrategy.doRecovery Attempting to PeerSync from http://127.0.0.1:39063/solr/collection1/ core=collection1 - recoveringAfterStartup=true
[junit4:junit4]   2> 12996 T1696 C154 P39084 oasu.PeerSync.sync PeerSync: core=collection1 url=http://127.0.0.1:39084/solr START replicas=[http://127.0.0.1:39063/solr/collection1/] nUpdates=100
[junit4:junit4]   2> 12996 T1620 oass.SolrDispatchFilter.init user.dir=/usr/home/hudson/hudson-slave/workspace/Lucene-Solr-Tests-trunk-java7/solr/build/solr-core/test/J0
[junit4:junit4]   2> 12997 T1696 C154 P39084 oasu.PeerSync.sync WARNING no frame of reference to tell of we've missed updates
[junit4:junit4]   2> 12997 T1620 oass.SolrDispatchFilter.init SolrDispatchFilter.init() done
[junit4:junit4]   2> 12997 T1696 C154 P39084 oasc.RecoveryStrategy.doRecovery PeerSync Recovery was not successful - trying replication. core=collection1
[junit4:junit4]   2> 12998 T1696 C154 P39084 oasc.RecoveryStrategy.doRecovery Starting Replication Recovery. core=collection1
[junit4:junit4]   2> 12998 T1620 oascsi.HttpClientUtil.createClient Creating new http client, config:maxConnections=128&maxConnectionsPerHost=32&followRedirects=false
[junit4:junit4]   2> 12998 T1696 C154 P39084 oascsi.HttpClientUtil.createClient Creating new http client, config:maxConnections=128&maxConnectionsPerHost=32&followRedirects=false
[junit4:junit4]   2> 12999 T1646 C152 P39063 REQ /get {distrib=false&qt=/get&wt=javabin&version=2&getVersions=100} status=0 QTime=0 
[junit4:junit4]   2> 13019 T1620 oaz.ZooKeeper.<init> Initiating client connection, connectString=127.0.0.1:39054/solr sessionTimeout=10000 watcher=org.apache.solr.common.cloud.ConnectionManager@40231ad2
[junit4:junit4]   2> 13020 T1698 oaz.ClientCnxn$SendThread.startConnect Opening socket connection to server /127.0.0.1:39054
[junit4:junit4]   2> 13020 T1620 oascc.ConnectionManager.waitForConnected Waiting for client to connect to ZooKeeper
[junit4:junit4]   2> 13022 T1698 oaz.ClientCnxn$SendThread.primeConnection Socket connection established to localhost/127.0.0.1:39054, initiating session
[junit4:junit4]   2> 13022 T1622 oazs.NIOServerCnxn$Factory.run Accepted socket connection from /140.211.11.196:39099
[junit4:junit4]   2> 13022 T1622 oazs.NIOServerCnxn.readConnectRequest Client attempting to establish new session at /140.211.11.196:39099
[junit4:junit4]   2> 13028 T1624 oazs.NIOServerCnxn.finishSessionInit Established session 0x139f11fb7cd0007 with negotiated timeout 10000 for client /140.211.11.196:39099
[junit4:junit4]   2> 13028 T1698 oaz.ClientCnxn$SendThread.readConnectResult Session establishment complete on server localhost/127.0.0.1:39054, sessionid = 0x139f11fb7cd0007, negotiated timeout = 10000
[junit4:junit4]   2> 13029 T1699 oascc.ConnectionManager.process Watcher org.apache.solr.common.cloud.ConnectionManager@40231ad2 name:ZooKeeperConnection Watcher:127.0.0.1:39054/solr got event WatchedEvent state:SyncConnected type:None path:null path:null type:None
[junit4:junit4]   2> 13029 T1620 oascc.ConnectionManager.waitForConnected Client is connected to ZooKeeper
[junit4:junit4]   2> 13030 T1620 oascc.ZkStateReader.createClusterStateWatchersAndUpdate Updating cluster state from ZooKeeper... 
[junit4:junit4]   2> 13032 T1620 oasc.ChaosMonkey.monkeyLog monkey: init - expire sessions:true cause connection loss:true
[junit4:junit4]   2> 13033 T1620 oascsi.HttpClientUtil.createClient Creating new http client, config:
[junit4:junit4]   2> 13042 T1620 oascc.ZkStateReader.updateClusterState Updating cloud state from ZooKeeper... 
[junit4:junit4]   2> 13044 T1620 oasc.AbstractFullDistribZkTestBase.waitForThingsToLevelOut Wait for recoveries to finish - wait 15 for each attempt
[junit4:junit4]   2> 13044 T1620 oasc.AbstractDistribZkTestBase.waitForRecoveriesToFinish Wait for recoveries to finish - collection: collection1 failOnTimeout:true timeout (sec):15
[junit4:junit4]   2> 13045 T1620 oascc.ZkStateReader.updateClusterState Updating cloud state from ZooKeeper... 
[junit4:junit4]   2> 13477 T1641 oascc.ZkStateReader.updateClusterState Updating cloud state from ZooKeeper... 
[junit4:junit4]   2> 13500 T1666 oascc.ZkStateReader$2.process A cluster state change has occurred - updating...
[junit4:junit4]   2> 13500 T1680 oascc.ZkStateReader$2.process A cluster state change has occurred - updating...
[junit4:junit4]   2> 13500 T1699 oascc.ZkStateReader$2.process A cluster state change has occurred - updating...
[junit4:junit4]   2> 13500 T1640 oascc.ZkStateReader$2.process A cluster state change has occurred - updating...
[junit4:junit4]   2> 13500 T1654 oascc.ZkStateReader$2.process A cluster state change has occurred - updating...
[junit4:junit4]   2> 13500 T1694 oascc.ZkStateReader$2.process A cluster state change has occurred - updating...
[junit4:junit4]   2>  C153_STATE=coll:collection1 core:collection1 props:{shard=shard1, roles=null, state=recovering, core=collection1, collection=collection1, node_name=127.0.0.1:39076_solr, base_url=http://127.0.0.1:39076/solr}
[junit4:junit4]   2> 13534 T1682 C153 P39076 oasc.RecoveryStrategy.doRecovery Begin buffering updates. core=collection1
[junit4:junit4]   2> 13534 T1682 C153 P39076 oasu.UpdateLog.bufferUpdates Starting to buffer updates. FSUpdateLog{state=ACTIVE, tlog=null}
[junit4:junit4]   2> 13534 T1682 C153 P39076 oasc.RecoveryStrategy.replicate Attempting to replicate from http://127.0.0.1:39063/solr/collection1/. core=collection1
[junit4:junit4]   2> 13534 T1682 C153 P39076 oascsi.HttpClientUtil.createClient Creating new http client, config:maxConnections=128&maxConnectionsPerHost=32&followRedirects=false
[junit4:junit4]   2> 13545 T1652 C152 P39063 oasu.DirectUpdateHandler2.commit start commit{flags=0,_version_=0,optimize=false,openSearcher=true,waitSearcher=true,expungeDeletes=false,softCommit=false}
[junit4:junit4]   2> 13555 T1652 C152 P39063 oass.SolrIndexSearcher.<init> Opening Searcher@1cef19f9 main
[junit4:junit4]   2> 13556 T1652 C152 P39063 oasu.DirectUpdateHandler2.commit end_commit_flush
[junit4:junit4]   2> 13557 T1655 oasc.SolrCore.registerSearcher [collection1] Registered new searcher Searcher@1cef19f9 main{StandardDirectoryReader(segments_1:1)}
[junit4:junit4]   2> 13558 T1652 C152 P39063 /update {waitSearcher=true&commit=true&commit_end_point=true&wt=javabin&softCommit=false&version=2} {commit=} 0 13
[junit4:junit4]   2> 13559 T1682 C153 P39076 oash.ReplicationHandler.inform Commits will be reserved for  10000
[junit4:junit4]   2> 13559 T1682 C153 P39076 oash.SnapPuller.<init>  No value set for 'pollInterval'. Timer Task not started.
[junit4:junit4]   2> 13561 T1650 C152 P39063 REQ /replication {command=indexversion&wt=javabin&qt=/replication&version=2} status=0 QTime=0 
[junit4:junit4]   2> 13575 T1682 C153 P39076 oasc.SolrDeletionPolicy.onInit SolrDeletionPolicy.onInit: commits:num=1
[junit4:junit4]   2> 		commit{dir=/usr/home/hudson/hudson-slave/workspace/Lucene-Solr-Tests-trunk-java7/solr/build/solr-core/test/J0/org.apache.solr.cloud.SyncSliceTest-1348370151365/jetty3/index,segFN=segments_1,generation=1,filenames=[segments_1]
[junit4:junit4]   2> 13576 T1682 C153 P39076 oasc.SolrDeletionPolicy.updateCommits newest commit = 1
[junit4:junit4]   2> 13576 T1682 C153 P39076 oasu.DirectUpdateHandler2.commit start commit{flags=0,_version_=0,optimize=false,openSearcher=true,waitSearcher=true,expungeDeletes=false,softCommit=false}
[junit4:junit4]   2> 13593 T1682 C153 P39076 oasc.SolrDeletionPolicy.onCommit SolrDeletionPolicy.onCommit: commits:num=2
[junit4:junit4]   2> 		commit{dir=/usr/home/hudson/hudson-slave/workspace/Lucene-Solr-Tests-trunk-java7/solr/build/solr-core/test/J0/org.apache.solr.cloud.SyncSliceTest-1348370151365/jetty3/index,segFN=segments_1,generation=1,filenames=[segments_1]
[junit4:junit4]   2> 		commit{dir=/usr/home/hudson/hudson-slave/workspace/Lucene-Solr-Tests-trunk-java7/solr/build/solr-core/test/J0/org.apache.solr.cloud.SyncSliceTest-1348370151365/jetty3/index,segFN=segments_2,generation=2,filenames=[segments_2]
[junit4:junit4]   2> 13593 T1682 C153 P39076 oasc.SolrDeletionPolicy.updateCommits newest commit = 2
[junit4:junit4]   2> 13604 T1682 C153 P39076 oass.SolrIndexSearcher.<init> Opening Searcher@48c43379 main
[junit4:junit4]   2> 13605 T1682 C153 P39076 oasu.DirectUpdateHandler2.commit end_commit_flush
[junit4:junit4]   2> 13606 T1681 oasc.SolrCore.registerSearcher [collection1] Registered new searcher Searcher@48c43379 main{StandardDirectoryReader(segments_2:2)}
[junit4:junit4]   2> 13607 T1682 C153 P39076 oasc.RecoveryStrategy.replay No replay needed. core=collection1
[junit4:junit4]   2> 13607 T1682 C153 P39076 oasc.RecoveryStrategy.doRecovery Replication Recovery was successful - registering as Active. core=collection1
[junit4:junit4]   2> 13609 T1682 C153 P39076 oasc.RecoveryStrategy.doRecovery Finished recovery process. core=collection1
[junit4:junit4]   2> 14005 T1641 oascc.ZkStateReader.updateClusterState Updating cloud state from ZooKeeper... 
[junit4:junit4]   2> 14058 T1654 oascc.ZkStateReader$2.process A cluster state change has occurred - updating...
[junit4:junit4]   2> 14058 T1680 oascc.ZkStateReader$2.process A cluster state change has occurred - updating...
[junit4:junit4]   2> 14058 T1640 oascc.ZkStateReader$2.process A cluster state change has occurred - updating...
[junit4:junit4]   2> 14058 T1694 oascc.ZkStateReader$2.process A cluster state change has occurred - updating...
[junit4:junit4]   2> 14058 T1620 oascc.ZkStateReader.updateClusterState Updating cloud state from ZooKeeper... 
[junit4:junit4]   2> 14058 T1666 oascc.ZkStateReader$2.process A cluster state change has occurred - updating...
[junit4:junit4]   2> 14058 T1699 oascc.ZkStateReader$2.process A cluster state change has occurred - updating...
[junit4:junit4]   2> 15066 T1620 oascc.ZkStateReader.updateClusterState Updating cloud state from ZooKeeper... 
[junit4:junit4]   2>  C154_STATE=coll:collection1 core:collection1 props:{shard=shard1, roles=null, state=recovering, core=collection1, collection=collection1, node_name=127.0.0.1:39084_solr, base_url=http://127.0.0.1:39084/solr}
[junit4:junit4]   2> 16023 T1696 C154 P39084 oasc.RecoveryStrategy.doRecovery Begin buffering updates. core=collection1
[junit4:junit4]   2> 16023 T1696 C154 P39084 oasu.UpdateLog.bufferUpdates Starting to buffer updates. FSUpdateLog{state=ACTIVE, tlog=null}
[junit4:junit4]   2> 16023 T1696 C154 P39084 oasc.RecoveryStrategy.replicate Attempting to replicate from http://127.0.0.1:39063/solr/collection1/. core=collection1
[junit4:junit4]   2> 16024 T1696 C154 P39084 oascsi.HttpClientUtil.createClient Creating new http client, config:maxConnections=128&maxConnectionsPerHost=32&followRedirects=false
[junit4:junit4]   2> 16038 T1647 C152 P39063 oasu.DirectUpdateHandler2.commit start commit{flags=0,_version_=0,optimize=false,openSearcher=true,waitSearcher=true,expungeDeletes=false,softCommit=false}
[junit4:junit4]   2> 16047 T1647 C152 P39063 oass.SolrIndexSearcher.<init> Opening Searcher@14e1e760 main
[junit4:junit4]   2> 16048 T1647 C152 P39063 oasu.DirectUpdateHandler2.commit end_commit_flush
[junit4:junit4]   2> 16049 T1655 oasc.SolrCore.registerSearcher [collection1] Registered new searcher Searcher@14e1e760 main{StandardDirectoryReader(segments_1:1)}
[junit4:junit4]   2> 16050 T1647 C152 P39063 /update {waitSearcher=true&commit=true&commit_end_point=true&wt=javabin&softCommit=false&version=2} {commit=} 0 12
[junit4:junit4]   2> 16050 T1696 C154 P39084 oash.ReplicationHandler.inform Commits will be reserved for  10000
[junit4:junit4]   2> 16051 T1696 C154 P39084 oash.SnapPuller.<init>  No value set for 'pollInterval'. Timer Task not started.
[junit4:junit4]   2> 16053 T1650 C152 P39063 REQ /replication {command=indexversion&wt=javabin&qt=/replication&version=2} status=0 QTime=0 
[junit4:junit4]   2> 16059 T1696 C154 P39084 oasc.SolrDeletionPolicy.onInit SolrDeletionPolicy.onInit: commits:num=1
[junit4:junit4]   2> 		commit{dir=/usr/home/hudson/hudson-slave/workspace/Lucene-Solr-Tests-trunk-java7/solr/build/solr-core/test/J0/org.apache.solr.cloud.SyncSliceTest-1348370151365/jetty4/index,segFN=segments_1,generation=1,filenames=[segments_1]
[junit4:junit4]   2> 16060 T1696 C154 P39084 oasc.SolrDeletionPolicy.updateCommits newest commit = 1
[junit4:junit4]   2> 16061 T1696 C154 P39084 oasu.DirectUpdateHandler2.commit start commit{flags=0,_version_=0,optimize=false,openSearcher=true,waitSearcher=true,expungeDeletes=false,softCommit=false}
[junit4:junit4]   2> 16068 T1620 oascc.ZkStateReader.updateClusterState Updating cloud state from ZooKeeper... 
[junit4:junit4]   2> 16085 T1696 C154 P39084 oasc.SolrDeletionPolicy.onCommit SolrDeletionPolicy.onCommit: commits:num=2
[junit4:junit4]   2> 		commit{dir=/usr/home/hudson/hudson-slave/workspace/Lucene-Solr-Tests-trunk-java7/solr/build/solr-core/test/J0/org.apache.solr.cloud.SyncSliceTest-1348370151365/jetty4/index,segFN=segments_1,generation=1,filenames=[segments_1]
[junit4:junit4]   2> 		commit{dir=/usr/home/hudson/hudson-slave/workspace/Lucene-Solr-Tests-trunk-java7/solr/build/solr-core/test/J0/org.apache.solr.cloud.SyncSliceTest-1348370151365/jetty4/index,segFN=segments_2,generation=2,filenames=[segments_2]
[junit4:junit4]   2> 16085 T1696 C154 P39084 oasc.SolrDeletionPolicy.updateCommits newest commit = 2
[junit4:junit4]   2> 16097 T1696 C154 P39084 oass.SolrIndexSearcher.<init> Opening Searcher@645c5c04 main
[junit4:junit4]   2> 16098 T1696 C154 P39084 oasu.DirectUpdateHandler2.commit end_commit_flush
[junit4:junit4]   2> 16099 T1695 oasc.SolrCore.registerSearcher [collection1] Registered new searcher Searcher@645c5c04 main{StandardDirectoryReader(segments_2:2)}
[junit4:junit4]   2> 16099 T1696 C154 P39084 oasc.RecoveryStrategy.replay No replay needed. core=collection1
[junit4:junit4]   2> 16100 T1696 C154 P39084 oasc.RecoveryStrategy.doRecovery Replication Recovery was successful - registering as Active. core=collection1
[junit4:junit4]   2> 16101 T1696 C154 P39084 oasc.RecoveryStrategy.doRecovery Finished recovery process. core=collection1
[junit4:junit4]   2> 16575 T1641 oascc.ZkStateReader.updateClusterState Updating cloud state from ZooKeeper... 
[junit4:junit4]   2> 16597 T1666 oascc.ZkStateReader$2.process A cluster state change has occurred - updating...
[junit4:junit4]   2> 16597 T1680 oascc.ZkStateReader$2.process A cluster state change has occurred - updating...
[junit4:junit4]   2> 16597 T1654 oascc.ZkStateReader$2.process A cluster state change has occurred - updating...
[junit4:junit4]   2> 16597 T1640 oascc.ZkStateReader$2.process A cluster state change has occurred - updating...
[junit4:junit4]   2> 16597 T1694 oascc.ZkStateReader$2.process A cluster state change has occurred - updating...
[junit4:junit4]   2> 16597 T1699 oascc.ZkStateReader$2.process A cluster state change has occurred - updating...
[junit4:junit4]   2> 17071 T1620 oascc.ZkStateReader.updateClusterState Updating cloud state from ZooKeeper... 
[junit4:junit4]   2> ASYNC  NEW_CORE C155 name=collection1 org.apache.solr.core.SolrCore@1a8f47fc url=http://127.0.0.1:39057/solr/collection1 node=127.0.0.1:39057_solr
[junit4:junit4]   2> 17082 T1632 C155 P39057 oasu.DirectUpdateHandler2.commit start commit{flags=0,_version_=0,optimize=false,openSearcher=true,waitSearcher=true,expungeDeletes=false,softCommit=false}
[junit4:junit4]   2> 17094 T1632 C155 P39057 oasc.SolrDeletionPolicy.onInit SolrDeletionPolicy.onInit: commits:num=1
[junit4:junit4]   2> 		commit{dir=/usr/home/hudson/hudson-slave/workspace/Lucene-Solr-Tests-trunk-java7/solr/build/solr-core/test/J0/org.apache.solr.cloud.SyncSliceTest-1348370151365/control/data/index,segFN=segments_1,generation=1,filenames=[segments_1]
[junit4:junit4]   2> 17095 T1632 C155 P39057 oasc.SolrDeletionPolicy.updateCommits newest commit = 1
[junit4:junit4]   2> 17097 T1632 C155 P39057 oass.SolrIndexSearcher.<init> Opening Searcher@2d098b44 main
[junit4:junit4]   2> 17097 T1632 C155 P39057 oasu.DirectUpdateHandler2.commit end_commit_flush
[junit4:junit4]   2> 17099 T1643 oasc.SolrCore.registerSearcher [collection1] Registered new searcher Searcher@2d098b44 main{StandardDirectoryReader(segments_1:1)}
[junit4:junit4]   2> 17099 T1632 C155 P39057 /update {waitSearcher=true&wt=javabin&commit=true&softCommit=false&version=2} {commit=} 0 17
[junit4:junit4]   2> 17100 T1620 oaz.ZooKeeper.<init> Initiating client connection, connectString=127.0.0.1:39054/solr sessionTimeout=10000 watcher=org.apache.solr.common.cloud.ConnectionManager@4d963475
[junit4:junit4]   2> 17101 T1700 oaz.ClientCnxn$SendThread.startConnect Opening socket connection to server /127.0.0.1:39054
[junit4:junit4]   2> 17101 T1620 oascc.ConnectionManager.waitForConnected Waiting for client to connect to ZooKeeper
[junit4:junit4]   2> 17102 T1700 oaz.ClientCnxn$SendThread.primeConnection Socket connection established to localhost/127.0.0.1:39054, initiating session
[junit4:junit4]   2> 17102 T1622 oazs.NIOServerCnxn$Factory.run Accepted socket connection from /140.211.11.196:39115
[junit4:junit4]   2> 17103 T1622 oazs.NIOServerCnxn.readConnectRequest Client attempting to establish new session at /140.211.11.196:39115
[junit4:junit4]   2> 17144 T1624 oazs.NIOServerCnxn.finishSessionInit Established session 0x139f11fb7cd0008 with negotiated timeout 10000 for client /140.211.11.196:39115
[junit4:junit4]   2> 17144 T1700 oaz.ClientCnxn$SendThread.readConnectResult Session establishment complete on server localhost/127.0.0.1:39054, sessionid = 0x139f11fb7cd0008, negotiated timeout = 10000
[junit4:junit4]   2> 17144 T1701 oascc.ConnectionManager.process Watcher org.apache.solr.common.cloud.ConnectionManager@4d963475 name:ZooKeeperConnection Watcher:127.0.0.1:39054/solr got event WatchedEvent state:SyncConnected type:None path:null path:null type:None
[junit4:junit4]   2> 17145 T1620 oascc.ConnectionManager.waitForConnected Client is connected to ZooKeeper
[junit4:junit4]   2> 17146 T1620 oascc.ZkStateReader.createClusterStateWatchersAndUpdate Updating cluster state from ZooKeeper... 
[junit4:junit4]   2> 17149 T1648 C152 P39063 oasu.DirectUpdateHandler2.commit start commit{flags=0,_version_=0,optimize=false,openSearcher=true,waitSearcher=true,expungeDeletes=false,softCommit=false}
[junit4:junit4]   2> 17152 T1648 C152 P39063 oass.SolrIndexSearcher.<init> Opening Searcher@1474533 main
[junit4:junit4]   2> 17153 T1648 C152 P39063 oasu.DirectUpdateHandler2.commit end_commit_flush
[junit4:junit4]   2> 17154 T1655 oasc.SolrCore.registerSearcher [collection1] Registered new searcher Searcher@1474533 main{StandardDirectoryReader(segments_1:1)}
[junit4:junit4]   2> 17154 T1648 C152 P39063 oasu.SolrCmdDistributor.distribCommit Distrib commit to:[StdNode: http://127.0.0.1:39067/solr/collection1/, StdNode: http://127.0.0.1:39076/solr/collection1/, StdNode: http://127.0.0.1:39084/solr/collection1/]
[junit4:junit4]   2>  C151_STATE=coll:collection1 core:collection1 props:{shard=shard1, roles=null, state=active, core=collection1, collection=collection1, node_name=127.0.0.1:39067_solr, base_url=http://127.0.0.1:39067/solr}
[junit4:junit4]   2> 17166 T1658 C151 P39067 oasu.DirectUpdateHandler2.commit start commit{flags=0,_version_=0,optimize=false,openSearcher=true,waitSearcher=true,expungeDeletes=false,softCommit=false}
[junit4:junit4]   2>  C153_STATE=coll:collection1 core:collection1 props:{shard=shard1, roles=null, state=active, core=collection1, collection=collection1, node_name=127.0.0.1:39076_solr, base_url=http://127.0.0.1:39076/solr}
[junit4:junit4]   2> 17166 T1672 C153 P39076 oasu.DirectUpdateHandler2.commit start commit{flags=0,_version_=0,optimize=false,openSearcher=true,waitSearcher=true,expungeDeletes=false,softCommit=false}
[junit4:junit4]   2>  C154_STATE=coll:collection1 core:collection1 props:{shard=shard1, roles=null, state=active, core=collection1, collection=collection1, node_name=127.0.0.1:39084_solr, base_url=http://127.0.0.1:39084/solr}
[junit4:junit4]   2> 17167 T1686 C154 P39084 oasu.DirectUpdateHandler2.commit start commit{flags=0,_version_=0,optimize=false,openSearcher=true,waitSearcher=true,expungeDeletes=false,softCommit=false}
[junit4:junit4]   2> 17203 T1686 C154 P39084 oass.SolrIndexSearcher.<init> Opening Searcher@40c88d16 main
[junit4:junit4]   2> 17203 T1658 C151 P39067 oass.SolrIndexSearcher.<init> Opening Searcher@4d881aa2 main
[junit4:junit4]   2> 17204 T1672 C153 P39076 oass.SolrIndexSearcher.<init> Opening Searcher@45ad4c79 main
[junit4:junit4]   2> 17204 T1686 C154 P39084 oasu.DirectUpdateHandler2.commit end_commit_flush
[junit4:junit4]   2> 17205 T1667 oasc.JmxMonitoredMap.put WARNING Failed to register info bean: searcher javax.management.InstanceAlreadyExistsException: solr/collection1:type=searcher,id=org.apache.solr.search.SolrIndexSearcher
[junit4:junit4]   2> 	at com.sun.jmx.mbeanserver.Repository.addMBean(Repository.java:437)
[junit4:junit4]   2> 	at com.sun.jmx.interceptor.DefaultMBeanServerInterceptor.registerWithRepository(DefaultMBeanServerInterceptor.java:1898)
[junit4:junit4]   2> 	at com.sun.jmx.interceptor.DefaultMBeanServerInterceptor.registerDynamicMBean(DefaultMBeanServerInterceptor.java:966)
[junit4:junit4]   2> 	at com.sun.jmx.interceptor.DefaultMBeanServerInterceptor.registerObject(DefaultMBeanServerInterceptor.java:900)
[junit4:junit4]   2> 	at com.sun.jmx.interceptor.DefaultMBeanServerInterceptor.registerMBean(DefaultMBeanServerInterceptor.java:324)
[junit4:junit4]   2> 	at com.sun.jmx.mbeanserver.JmxMBeanServer.registerMBean(JmxMBeanServer.java:512)
[junit4:junit4]   2> 	at org.apache.solr.core.JmxMonitoredMap.put(JmxMonitoredMap.java:140)
[junit4:junit4]   2> 	at org.apache.solr.core.JmxMonitoredMap.put(JmxMonitoredMap.java:51)
[junit4:junit4]   2> 	at org.apache.solr.search.SolrIndexSearcher.register(SolrIndexSearcher.java:242)
[junit4:junit4]   2> 	at org.apache.solr.core.SolrCore.registerSearcher(SolrCore.java:1642)
[junit4:junit4]   2> 	at org.apache.solr.core.SolrCore.access$000(SolrCore.java:121)
[junit4:junit4]   2> 	at org.apache.solr.core.SolrCore$7.call(SolrCore.java:1519)
[junit4:junit4]   2> 	at java.util.concurrent.FutureTask$Sync.innerRun(FutureTask.java:334)
[junit4:junit4]   2> 	at java.util.concurrent.FutureTask.run(FutureTask.java:166)
[junit4:junit4]   2> 	at java.util.concurrent.ThreadPoolExecutor.runWorker(ThreadPoolExecutor.java:1110)
[junit4:junit4]   2> 	at java.util.concurrent.ThreadPoolExecutor$Worker.run(ThreadPoolExecutor.java:603)
[junit4:junit4]   2> 	at java.lang.Thread.run(Thread.java:722)
[junit4:junit4]   2> 
[junit4:junit4]   2> 17205 T1672 C153 P39076 oasu.DirectUpdateHandler2.commit end_commit_flush
[junit4:junit4]   2> 17205 T1658 C151 P39067 oasu.DirectUpdateHandler2.commit end_commit_flush
[junit4:junit4]   2> 17206 T1695 oasc.SolrCore.registerSearcher [collection1] Registered new searcher Searcher@40c88d16 main{StandardDirectoryReader(segments_2:2)}
[junit4:junit4]   2> 17206 T1681 oasc.SolrCore.registerSearcher [collection1] Registered new searcher Searcher@45ad4c79 main{StandardDirectoryReader(segments_2:2)}
[junit4:junit4]   2> 17207 T1667 oasc.SolrCore.registerSearcher [collection1] Registered new searcher Searcher@4d881aa2 main{StandardDirectoryReader(segments_2:2)}
[junit4:junit4]   2> 17207 T1686 C154 P39084 /update {waitSearcher=true&commit=true&wt=javabin&commit_end_point=true&expungeDeletes=false&softCommit=false&version=2} {commit=} 0 40
[junit4:junit4]   2> 17207 T1672 C153 P39076 /update {waitSearcher=true&commit=true&wt=javabin&commit_end_point=true&expungeDeletes=false&softCommit=false&version=2} {commit=} 0 41
[junit4:junit4]   2> 17207 T1658 C151 P39067 /update {waitSearcher=true&commit=true&wt=javabin&commit_end_point=true&expungeDeletes=false&softCommit=false&version=2} {commit=} 0 41
[junit4:junit4]   2> 17208 T1648 C152 P39063 /update {waitSearcher=true&wt=javabin&commit=true&softCommit=false&version=2} {commit=} 0 59
[junit4:junit4]   2> 17209 T1620 oascc.ZkStateReader.updateClusterState Updating cloud state from ZooKeeper... 
[junit4:junit4]   2> 17212 T1649 C152 P39063 REQ /select {distrib=false&wt=javabin&q=*:*&version=2} hits=0 status=0 QTime=0 
[junit4:junit4]   2> 17214 T1659 C151 P39067 REQ /select {distrib=false&wt=javabin&q=*:*&version=2} hits=0 status=0 QTime=0 
[junit4:junit4]   2> 17216 T1673 C153 P39076 REQ /select {distrib=false&wt=javabin&q=*:*&version=2} hits=0 status=0 QTime=0 
[junit4:junit4]   2> 17219 T1687 C154 P39084 REQ /select {distrib=false&wt=javabin&q=*:*&version=2} hits=0 status=0 QTime=1 
[junit4:junit4]   2> 19235 T1632 C155 P39057 oass.SolrIndexSearcher.<init> Opening Searcher@6cddb21f realtime
[junit4:junit4]   2> 19236 T1632 C155 P39057 /update {wt=javabin&version=2} {deleteByQuery=*:* (-1413868599989239808)} 0 13
[junit4:junit4]   2> 19255 T1648 C152 P39063 oass.SolrIndexSearcher.<init> Opening Searcher@1b4ba03a realtime
[junit4:junit4]   2> 19259 T1686 C154 P39084 oass.SolrIndexSearcher.<init> Opening Searcher@58dc928f realtime
[junit4:junit4]   2> 19260 T1686 C154 P39084 REQ /update {update.distrib=FROMLEADER&_version_=-1413868600006017024&update.from=http://127.0.0.1:39063/solr/collection1/&wt=javabin&version=2} status=0 QTime=2 
[junit4:junit4]   2> 19262 T1672 C153 P39076 oass.SolrIndexSearcher.<init> Opening Searcher@2014aaa1 realtime
[junit4:junit4]   2> 19263 T1672 C153 P39076 REQ /update {update.distrib=FROMLEADER&_version_=-1413868600006017024&update.from=http://127.0.0.1:39063/solr/collection1/&wt=javabin&version=2} status=0 QTime=5 
[junit4:junit4]   2> 19268 T1658 C151 P39067 oass.SolrIndexSearcher.<init> Opening Searcher@18eb6238 realtime
[junit4:junit4]   2> 19269 T1658 C151 P39067 REQ /update {update.distrib=FROMLEADER&_version_=-1413868600006017024&update.from=http://127.0.0.1:39063/solr/collection1/&wt=javabin&version=2} status=0 QTime=11 
[junit4:junit4]   2> 19269 T1648 C152 P39063 /update {wt=javabin&version=2} {deleteByQuery=*:* (-1413868600006017024)} 0 30
[junit4:junit4]   2> 19275 T1632 C155 P39057 /update {wt=javabin&version=2} {add=[0 (1413868600040620032)]} 0 3
[junit4:junit4]   2> 19286 T1672 C153 P39076 REQ /update {distrib.from=http://127.0.0.1:39063/solr/collection1/&update.distrib=FROMLEADER&wt=javabin&version=2} status=0 QTime=3 
[junit4:junit4]   2> 19286 T1686 C154 P39084 REQ /update {distrib.from=http://127.0.0.1:39063/solr/collection1/&update.distrib=FROMLEADER&wt=javabin&version=2} status=0 QTime=3 
[junit4:junit4]   2> 19286 T1658 C151 P39067 REQ /update {distrib.from=http://127.0.0.1:39063/solr/collection1/&update.distrib=FROMLEADER&wt=javabin&version=2} status=0 QTime=3 
[junit4:junit4]   2> 19287 T1648 C152 P39063 /update {wt=javabin&version=2} {add=[0 (1413868600046911488)]} 0 9
[junit4:junit4]   2> 19291 T1632 C155 P39057 /update {wt=javabin&version=2} {add=[1 (1413868600059494400)]} 0 1
[junit4:junit4]   2> 19298 T1672 C153 P39076 REQ /update {distrib.from=http://127.0.0.1:39063/solr/collection1/&update.distrib=FROMLEADER&wt=javabin&version=2} status=0 QTime=1 
[junit4:junit4]   2> 19298 T1658 C151 P39067 REQ /update {distrib.from=http://127.0.0.1:39063/solr/collection1/&update.distrib=FROMLEADER&wt=javabin&version=2} status=0 QTime=1 
[junit4:junit4]   2> 19298 T1686 C154 P39084 REQ /update {distrib.from=http://127.0.0.1:39063/solr/collection1/&update.distrib=FROMLEADER&wt=javabin&version=2} status=0 QTime=1 
[junit4:junit4]   2> 19299 T1648 C152 P39063 /update {wt=javabin&version=2} {add=[1 (1413868600063688704)]} 0 5
[junit4:junit4]   2> 19303 T1632 C155 P39057 /update {wt=javabin&version=2} {add=[2 (1413868600072077312)]} 0 1
[junit4:junit4]   2> 19311 T1686 C154 P39084 REQ /update {distrib.from=http://127.0.0.1:39063/solr/collection1/&update.distrib=FROMLEADER&test.distrib.skip.servers=http://127.0.0.1:39067/solr/collection1/&wt=javabin&version=2} status=0 QTime=1 
[junit4:junit4]   2> 19311 T1672 C153 P39076 REQ /update {distrib.from=http://127.0.0.1:39063/solr/collection1/&update.distrib=FROMLEADER&test.distrib.skip.servers=http://127.0.0.1:39067/solr/collection1/&wt=javabin&version=2} status=0 QTime=1 
[junit4:junit4]   2> 19312 T1648 C152 P39063 /update {test.distrib.skip.servers=http://127.0.0.1:39067/solr/collection1/&wt=javabin&version=2} {add=[2 (1413868600076271616)]} 0 6
[junit4:junit4]   2> 19316 T1632 C155 P39057 /update {wt=javabin&version=2} {add=[3 (1413868600085708800)]} 0 1
[junit4:junit4]   2> 19323 T1686 C154 P39084 REQ /update {distrib.from=http://127.0.0.1:39063/solr/collection1/&update.distrib=FROMLEADER&test.distrib.skip.servers=http://127.0.0.1:39067/solr/collection1/&test.distrib.skip.servers=http://127.0.0.1:39076/solr/collection1/&wt=javabin&version=2} status=0 QTime=1 
[junit4:junit4]   2> 19324 T1648 C152 P39063 /update {test.distrib.skip.servers=http://127.0.0.1:39067/solr/collection1/&test.distrib.skip.servers=http://127.0.0.1:39076/solr/collection1/&wt=javabin&version=2} {add=[3 (1413868600089903104)]} 0 5
[junit4:junit4]   2> 19326 T1632 C155 P39057 oasu.DirectUpdateHandler2.commit start commit{flags=0,_version_=0,optimize=false,openSearcher=true,waitSearcher=true,expungeDeletes=false,softCommit=false}
[junit4:junit4]   2> 19639 T1632 C155 P39057 oasc.SolrDeletionPolicy.onCommit SolrDeletionPolicy.onCommit: commits:num=2
[junit4:junit4]   2> 		commit{dir=/usr/home/hudson/hudson-slave/workspace/Lucene-Solr-Tests-trunk-java7/solr/build/solr-core/test/J0/org.apache.solr.cloud.SyncSliceTest-1348370151365/control/data/index,segFN=segments_1,generation=1,filenames=[segments_1]
[junit4:junit4]   2> 		commit{dir=/usr/home/hudson/hudson-slave/workspace/Lucene-Solr-Tests-trunk-java7/solr/build/solr-core/test/J0/org.apache.solr.cloud.SyncSliceTest-1348370151365/control/data/index,segFN=segments_2,generation=2,filenames=[_0_Asserting_0.tim, _0_Lucene40_0.tim, _0.fnm, _0_Asserting_0.tip, _0_Memory_0.ram, _0_MockRandom_0.prx, _0_nrm.cfs, _0_Lucene40_0.prx, _0_Lucene40_0.tip, _0_Asserting_0.prx, _0_MockRandom_0.tip, _0_MockRandom_0.frq, _0_MockRandom_0.sd, _0_Asserting_0.frq, _0_Lucene40_0.frq, _0_nrm.cfe, segments_2, _0.fdx, _0.si, _0_MockRandom_0.tim, _0.fdt]
[junit4:junit4]   2> 19640 T1632 C155 P39057 oasc.SolrDeletionPolicy.updateCommits newest commit = 2
[junit4:junit4]   2> 19653 T1632 C155 P39057 oass.SolrIndexSearcher.<init> Opening Searcher@337eb39d main
[junit4:junit4]   2> 19654 T1632 C155 P39057 oasu.DirectUpdateHandler2.commit end_commit_flush
[junit4:junit4]   2> 19655 T1643 oasc.SolrCore.registerSearcher [collection1] Registered new searcher Searcher@337eb39d main{StandardDirectoryReader(segments_2:3:nrt _0(5.0):C4)}
[junit4:junit4]   2> 19656 T1632 C155 P39057 /update {waitSearcher=true&wt=javabin&commit=true&softCommit=false&version=2} {commit=} 0 330
[junit4:junit4]   2> 19659 T1648 C152 P39063 oasu.DirectUpdateHandler2.commit start commit{flags=0,_version_=0,optimize=false,openSearcher=true,waitSearcher=true,expungeDeletes=false,softCommit=false}
[junit4:junit4]   2> 19840 T1648 C152 P39063 oasc.SolrDeletionPolicy.onCommit SolrDeletionPolicy.onCommit: commits:num=2
[junit4:junit4]   2> 		commit{dir=/usr/home/hudson/hudson-slave/workspace/Lucene-Solr-Tests-trunk-java7/solr/build/solr-core/test/J0/org.apache.solr.cloud.SyncSliceTest-1348370151365/jetty1/index,segFN=segments_1,generation=1,filenames=[segments_1]
[junit4:junit4]   2> 		commit{dir=/usr/home/hudson/hudson-slave/workspace/Lucene-Solr-Tests-trunk-java7/solr/build/solr-core/test/J0/org.apache.solr.cloud.SyncSliceTest-1348370151365/jetty1/index,segFN=segments_2,generation=2,filenames=[_0_Asserting_0.tim, _0_Lucene40_0.tim, _0.fnm, _0_Asserting_0.tip, _0_Memory_0.ram, _0_MockRandom_0.prx, _0_nrm.cfs, _0_Lucene40_0.prx, _0_Lucene40_0.tip, _0_Asserting_0.prx, _0_MockRandom_0.tip, _0_MockRandom_0.frq, _0_MockRandom_0.sd, _0_Asserting_0.frq, _0_Lucene40_0.frq, _0_nrm.cfe, segments_2, _0.fdx, _0.si, _0_MockRandom_0.tim, _0.fdt]
[junit4:junit4]   2> 19841 T1648 C152 P39063 oasc.SolrDeletionPolicy.updateCommits newest commit = 2
[junit4:junit4]   2> 19849 T1648 C152 P39063 oass.SolrIndexSearcher.<init> Opening Searcher@65f6460b main
[junit4:junit4]   2> 19850 T1648 C152 P39063 oasu.DirectUpdateHandler2.commit end_commit_flush
[junit4:junit4]   2> 19852 T1655 oasc.SolrCore.registerSearcher [collection1] Registered new searcher Searcher@65f6460b main{StandardDirectoryReader(segments_2:3:nrt _0(5.0):C4)}
[junit4:junit4]   2> 19852 T1648 C152 P39063 oasu.SolrCmdDistributor.distribCommit Distrib commit to:[StdNode: http://127.0.0.1:39067/solr/collection1/, StdNode: http://127.0.0.1:39076/solr/collection1/, StdNode: http://127.0.0.1:39084/solr/collection1/]
[junit4:junit4]   2> 19855 T1658 C151 P39067 oasu.DirectUpdateHandler2.commit start commit{flags=0,_version_=0,optimize=false,openSearcher=true,waitSearcher=true,expungeDeletes=false,softCommit=false}
[junit4:junit4]   2> 19855 T1686 C154 P39084 oasu.DirectUpdateHandler2.commit start commit{flags=0,_version_=0,optimize=false,openSearcher=true,waitSearcher=true,expungeDeletes=false,softCommit=false}
[junit4:junit4]   2> 19855 T1672 C153 P39076 oasu.DirectUpdateHandler2.commit start commit{flags=0,_version_=0,optimize=false,openSearcher=true,waitSearcher=true,expungeDeletes=false,softCommit=false}
[junit4:junit4]   2> 20194 T1672 C153 P39076 oasc.SolrDeletionPolicy.onCommit SolrDeletionPolicy.onCommit: commits:num=2
[junit4:junit4]   2> 		commit{dir=/usr/home/hudson/hudson-slave/workspace/Lucene-Solr-Tests-trunk-java7/solr/build/solr-core/test/J0/org.apache.solr.cloud.SyncSliceTest-1348370151365/jetty3/index,segFN=segments_2,generation=2,filenames=[segments_2]
[junit4:junit4]   2> 		commit{dir=/usr/home/hudson/hudson-slave/workspace/Lucene-Solr-Tests-trunk-java7/solr/build/solr-core/test/J0/org.apache.solr.cloud.SyncSliceTest-1348370151365/jetty3/index,segFN=segments_3,generation=3,filenames=[_0_Asserting_0.tim, _0_Lucene40_0.tim, _0.fnm, _0_Asserting_0.tip, _0_Memory_0.ram, _0_MockRandom_0.prx, _0_nrm.cfs, _0_Lucene40_0.prx, _0_Lucene40_0.tip, _0_Asserting_0.prx, _0_MockRandom_0.tip, _0_MockRandom_0.frq, _0_MockRandom_0.sd, _0_Asserting_0.frq, _0_Lucene40_0.frq, _0_nrm.cfe, _0.fdx, _0.si, _0_MockRandom_0.tim, _0.fdt, segments_3]
[junit4:junit4]   2> 20195 T1672 C153 P39076 oasc.SolrDeletionPolicy.updateCommits newest commit = 3
[junit4:junit4]   2> 20204 T1686 C154 P39084 oasc.SolrDeletionPolicy.onCommit SolrDeletionPolicy.onCommit: commits:num=2
[junit4:junit4]   2> 		commit{dir=/usr/home/hudson/hudson-slave/workspace/Lucene-Solr-Tests-trunk-java7/solr/build/solr-core/test/J0/org.apache.solr.cloud.SyncSliceTest-1348370151365/jetty4/index,segFN=segments_2,generation=2,filenames=[segments_2]
[junit4:junit4]   2> 		commit{dir=/usr/home/hudson/hudson-slave/workspace/Lucene-Solr-Tests-trunk-java7/solr/build/solr-core/test/J0/org.apache.solr.cloud.SyncSliceTest-1348370151365/jetty4/index,segFN=segments_3,generation=3,filenames=[_0_Asserting_0.tim, _0_MockRandom_0.tib, _0_Lucene40_0.tim, _0.fnm, _0_Asserting_0.tip, _0_Memory_0.ram, _0_MockRandom_0.prx, _0_nrm.cfs, _0_Lucene40_0.prx, _0_Lucene40_0.tip, _0_Asserting_0.prx, _0_MockRandom_0.frq, _0_MockRandom_0.sd, _0_Asserting_0.frq, _0_Lucene40_0.frq, _0_nrm.cfe, _0_MockRandom_0.tii, _0.fdx, _0.si, _0.fdt, segments_3]
[junit4:junit4]   2> 20205 T1686 C154 P39084 oasc.SolrDeletionPolicy.updateCommits newest commit = 3
[junit4:junit4]   2> 20212 T1672 C153 P39076 oass.SolrIndexSearcher.<init> Opening Searcher@75bddb9 main
[junit4:junit4]   2> 20213 T1672 C153 P39076 oasu.DirectUpdateHandler2.commit end_commit_flush
[junit4:junit4]   2> 20215 T1681 oasc.SolrCore.registerSearcher [collection1] Registered new searcher Searcher@75bddb9 main{StandardDirectoryReader(segments_3:4:nrt _0(5.0):C3)}
[junit4:junit4]   2> 20215 T1672 C153 P39076 /update {waitSearcher=true&commit=true&wt=javabin&commit_end_point=true&expungeDeletes=false&softCommit=false&version=2} {commit=} 0 360
[junit4:junit4]   2> 20217 T1686 C154 P39084 oass.SolrIndexSearcher.<init> Opening Searcher@5aa5b362 main
[junit4:junit4]   2> 20217 T1686 C154 P39084 oasu.DirectUpdateHandler2.commit end_commit_flush
[junit4:junit4]   2> 20219 T1695 oasc.SolrCore.registerSearcher [collection1] Registered new searcher Searcher@5aa5b362 main{StandardDirectoryReader(segments_3:4:nrt _0(5.0):C4)}
[junit4:junit4]   2> 20219 T1686 C154 P39084 /update {waitSearcher=true&commit=true&wt=javabin&commit_end_point=true&expungeDeletes=false&softCommit=false&version=2} {commit=} 0 364
[junit4:junit4]   2> 20222 T1658 C151 P39067 oasc.SolrDeletionPolicy.onCommit SolrDeletionPolicy.onCommit: commits:num=2
[junit4:junit4]   2> 		commit{dir=/usr/home/hudson/hudson-slave/workspace/Lucene-Solr-Tests-trunk-java7/solr/build/solr-core/test/J0/org.apache.solr.cloud.SyncSliceTest-1348370151365/jetty2/index,segFN=segments_2,generation=2,filenames=[segments_2]
[junit4:junit4]   2> 		commit{dir=/usr/home/hudson/hudson-slave/workspace/Lucene-Solr-Tests-trunk-java7/solr/build/solr-core/test/J0/org.apache.solr.cloud.SyncSliceTest-1348370151365/jetty2/index,segFN=segments_3,generation=3,filenames=[_0_Asserting_0.tim, _0_Lucene40_0.tim, _0.fnm, _0_Asserting_0.tip, _0_Memory_0.ram, _0_nrm.cfs, _0_Lucene40_0.prx, _0_MockRandom_0.skp, _0_Lucene40_0.tip, _0_Asserting_0.prx, _0_MockRandom_0.frq, _0_MockRandom_0.sd, _0_Asserting_0.frq, _0_MockRandom_0.tip, _0_Lucene40_0.frq, _0_MockRandom_0.doc, _0_MockRandom_0.pos, _0_nrm.cfe, _0.fdx, _0.si, _0_MockRandom_0.pyl, _0_MockRandom_0.tim, _0.fdt, segments_3]
[junit4:junit4]   2> 20223 T1658 C151 P39067 oasc.SolrDeletionPolicy.updateCommits newest commit = 3
[junit4:junit4]   2> 20237 T1658 C151 P39067 oass.SolrIndexSearcher.<init> Opening Searcher@6a873fea main
[junit4:junit4]   2> 20238 T1658 C151 P39067 oasu.DirectUpdateHandler2.commit end_commit_flush
[junit4:junit4]   2> 20240 T1667 oasc.SolrCore.registerSearcher [collection1] Registered new searcher Searcher@6a873fea main{StandardDirectoryReader(segments_3:4:nrt _0(5.0):C2)}
[junit4:junit4]   2> 20240 T1658 C151 P39067 /update {waitSearcher=true&commit=true&wt=javabin&commit_end_point=true&expungeDeletes=false&softCommit=false&version=2} {commit=} 0 385
[junit4:junit4]   2> 20241 T1648 C152 P39063 /update {waitSearcher=true&wt=javabin&commit=true&softCommit=false&version=2} {commit=} 0 582
[junit4:junit4]   2> 20242 T1620 oasc.AbstractDistribZkTestBase.waitForRecoveriesToFinish Wait for recoveries to finish - collection: collection1 failOnTimeout:true timeout (sec):1800
[junit4:junit4]   2> 20243 T1620 oascc.ZkStateReader.updateClusterState Updating cloud state from ZooKeeper... 
[junit4:junit4]   2> check const of shard1
[junit4:junit4]   2> client0
[junit4:junit4]   2> PROPS:127.0.0.1:39063_solr_collection1:{"shard":"shard1","roles":null,"state":"active","core":"collection1","collection":"collection1","node_name":"127.0.0.1:39063_solr","base_url":"http://127.0.0.1:39063/solr","leader":"true"}
[junit4:junit4]   2> 20246 T1649 C152 P39063 REQ /select {distrib=false&wt=javabin&q=*:*&version=2} hits=4 status=0 QTime=0 
[junit4:junit4]   2>  live:true
[junit4:junit4]   2>  num:4
[junit4:junit4]   2> 
[junit4:junit4]   2> client1
[junit4:junit4]   2> PROPS:127.0.0.1:39067_solr_collection1:{"shard":"shard1","roles":null,"state":"active","core":"collection1","collection":"collection1","node_name":"127.0.0.1:39067_solr","base_url":"http://127.0.0.1:39067/solr"}
[junit4:junit4]   2> 20250 T1659 C151 P39067 REQ /select {distrib=false&wt=javabin&q=*:*&version=2} hits=2 status=0 QTime=0 
[junit4:junit4]   2>  live:true
[junit4:junit4]   2>  num:2
[junit4:junit4]   2> 
[junit4:junit4]   2> ######shard1 is not consistent.  Got 4 from http://127.0.0.1:39063/solr/collection1lastClient and got 2 from http://127.0.0.1:39067/solr/collection1
[junit4:junit4]   2> 20253 T1649 C152 P39063 REQ /select {fl=id,_version_&sort=id+asc&q=*:*&distrib=false&wt=javabin&rows=1000&version=2} hits=4 status=0 QTime=0 
[junit4:junit4]   2> 20257 T1659 C151 P39067 REQ /select {fl=id,_version_&sort=id+asc&q=*:*&distrib=false&wt=javabin&rows=1000&version=2} hits=2 status=0 QTime=0 
[junit4:junit4]   2> ######http://127.0.0.1:39063/solr/collection1: {numFound=4,start=0,docs=[SolrDocument{id=0, _version_=1413868600046911488}, SolrDocument{id=1, _version_=1413868600063688704}, SolrDocument{id=2, _version_=1413868600076271616}, SolrDocument{id=3, _version_=1413868600089903104}]}
[junit4:junit4]   2> ######http://127.0.0.1:39067/solr/collection1: {numFound=2,start=0,docs=[SolrDocument{id=0, _version_=1413868600046911488}, SolrDocument{id=1, _version_=1413868600063688704}]}
[junit4:junit4]   2> ###### sizes=4,2
[junit4:junit4]   2> ###### Only in http://127.0.0.1:39063/solr/collection1: [{id=2, _version_=1413868600076271616}, {id=3, _version_=1413868600089903104}]
[junit4:junit4]   2> client2
[junit4:junit4]   2> PROPS:127.0.0.1:39076_solr_collection1:{"shard":"shard1","roles":null,"state":"active","core":"collection1","collection":"collection1","node_name":"127.0.0.1:39076_solr","base_url":"http://127.0.0.1:39076/solr"}
[junit4:junit4]   2> 20261 T1673 C153 P39076 REQ /select {distrib=false&wt=javabin&q=*:*&version=2} hits=3 status=0 QTime=0 
[junit4:junit4]   2>  live:true
[junit4:junit4]   2>  num:3
[junit4:junit4]   2> 
[junit4:junit4]   2> client3
[junit4:junit4]   2> PROPS:127.0.0.1:39084_solr_collection1:{"shard":"shard1","roles":null,"state":"active","core":"collection1","collection":"collection1","node_name":"127.0.0.1:39084_solr","base_url":"http://127.0.0.1:39084/solr"}
[junit4:junit4]   2> 20265 T1687 C154 P39084 REQ /select {distrib=false&wt=javabin&q=*:*&version=2} hits=4 status=0 QTime=0 
[junit4:junit4]   2>  live:true
[junit4:junit4]   2>  num:4
[junit4:junit4]   2> 
[junit4:junit4]   2> 20267 T1620 oascsi.HttpClientUtil.createClient Creating new http client, config:maxConnections=128&maxConnectionsPerHost=32&followRedirects=false
[junit4:junit4]   2> 20284 T1674 oasha.CollectionsHandler.handleSyncShardAction Syncing shard : action=SYNCSHARD&collection=collection1&shard=shard1&wt=javabin&version=2
[junit4:junit4]   2> 20285 T1674 oascsi.HttpClientUtil.createClient Creating new http client, config:maxConnections=128&maxConnectionsPerHost=32&followRedirects=false
[junit4:junit4]   2> 20297 T1652 oasha.CoreAdminHandler.handleRequestSyncAction I have been requested to sync up my shard
[junit4:junit4]   2> 20298 T1652 oasc.SyncStrategy.sync Sync replicas to http://127.0.0.1:39063/solr/collection1/
[junit4:junit4]   2> 20298 T1652 oasu.PeerSync.sync PeerSync: core=collection1 url=http://127.0.0.1:39063/solr START replicas=[http://127.0.0.1:39067/solr/collection1/, http://127.0.0.1:39076/solr/collection1/, http://127.0.0.1:39084/solr/collection1/] nUpdates=100
[junit4:junit4]   2> 20301 T1675 C153 P39076 REQ /get {distrib=false&qt=/get&wt=javabin&version=2&getVersions=100} status=0 QTime=1 
[junit4:junit4]   2> 20301 T1660 C151 P39067 REQ /get {distrib=false&qt=/get&wt=javabin&version=2&getVersions=100} status=0 QTime=1 
[junit4:junit4]   2> 20301 T1688 C154 P39084 REQ /get {distrib=false&qt=/get&wt=javabin&version=2&getVersions=100} status=0 QTime=0 
[junit4:junit4]   2> 20301 T1652 oasu.PeerSync.handleVersions PeerSync: core=collection1 url=http://127.0.0.1:39063/solr  Received 4 versions from 127.0.0.1:39076/solr/collection1/
[junit4:junit4]   2> 20302 T1652 oasu.PeerSync.handleVersions PeerSync: core=collection1 url=http://127.0.0.1:39063/solr  Our versions are newer. ourLowThreshold=1413868600006017024 otherHigh=1413868600076271616
[junit4:junit4]   2> 20302 T1652 oasu.PeerSync.handleVersions PeerSync: core=collection1 url=http://127.0.0.1:39063/solr  Received 5 versions from 127.0.0.1:39084/solr/collection1/
[junit4:junit4]   2> 20303 T1652 oasu.PeerSync.handleVersions PeerSync: core=collection1 url=http://127.0.0.1:39063/solr  Our versions are newer. ourLowThreshold=1413868600006017024 otherHigh=1413868600076271616
[junit4:junit4]   2> 20303 T1652 oasu.PeerSync.handleVersions PeerSync: core=collection1 url=http://127.0.0.1:39063/solr  Received 3 versions from 127.0.0.1:39067/solr/collection1/
[junit4:junit4]   2> 20303 T1652 oasu.PeerSync.handleVersions PeerSync: core=collection1 url=http://127.0.0.1:39063/solr  Our versions are newer. ourLowThreshold=1413868600006017024 otherHigh=1413868600063688704
[junit4:junit4]   2> 20304 T1652 oasu.PeerSync.sync PeerSync: core=collection1 url=http://127.0.0.1:39063/solr DONE. sync succeeded
[junit4:junit4]   2> 20304 T1652 oasc.SyncStrategy.syncReplicas Sync Success - now sync replicas to me
[junit4:junit4]   2> 20305 T1652 oasc.SyncStrategy.syncToMe http://127.0.0.1:39063/solr/collection1/: try and ask http://127.0.0.1:39067/solr/collection1/ to sync
[junit4:junit4]   2> 20305 T1652 oasc.SyncStrategy.syncToMe http://127.0.0.1:39063/solr/collection1/: try and ask http://127.0.0.1:39076/solr/collection1/ to sync
[junit4:junit4]   2> 20306 T1652 oasc.SyncStrategy.syncToMe http://127.0.0.1:39063/solr/collection1/: try and ask http://127.0.0.1:39084/solr/collection1/ to sync
[junit4:junit4]   2> 20308 T1661 C151 P39067 oasu.PeerSync.sync PeerSync: core=collection1 url=http://127.0.0.1:39067/solr START replicas=[http://127.0.0.1:39063/solr/collection1/] nUpdates=100
[junit4:junit4]   2> 20309 T1676 C153 P39076 oasu.PeerSync.sync PeerSync: core=collection1 url=http://127.0.0.1:39076/solr START replicas=[http://127.0.0.1:39063/solr/collection1/] nUpdates=100
[junit4:junit4]   2> 20309 T1689 C154 P39084 oasu.PeerSync.sync PeerSync: core=collection1 url=http://127.0.0.1:39084/solr START replicas=[http://127.0.0.1:39063/solr/collection1/] nUpdates=100
[junit4:junit4]   2> 20311 T1651 C152 P39063 REQ /get {distrib=false&qt=/get&wt=javabin&version=2&getVersions=100} status=0 QTime=1 
[junit4:junit4]   2> 20311 T1647 C152 P39063 REQ /get {distrib=false&qt=/get&wt=javabin&version=2&getVersions=100} status=0 QTime=0 
[junit4:junit4]   2> 20311 T1676 C153 P39076 oasu.PeerSync.handleVersions PeerSync: core=collection1 url=http://127.0.0.1:39076/solr  Received 5 versions from 127.0.0.1:39063/solr/collection1/
[junit4:junit4]   2> 20311 T1646 C152 P39063 REQ /get {distrib=false&qt=/get&wt=javabin&version=2&getVersions=100} status=0 QTime=0 
[junit4:junit4]   2> 20312 T1689 C154 P39084 oasu.PeerSync.handleVersions PeerSync: core=collection1 url=http://127.0.0.1:39084/solr  Received 5 versions from 127.0.0.1:39063/solr/collection1/
[junit4:junit4]   2> 20312 T1676 C153 P39076 oasu.PeerSync.requestUpdates PeerSync: core=collection1 url=http://127.0.0.1:39076/solr Requesting updates from 127.0.0.1:39063/solr/collection1/n=1 versions=[1413868600089903104]
[junit4:junit4]   2> 20312 T1661 C151 P39067 oasu.PeerSync.handleVersions PeerSync: core=collection1 url=http://127.0.0.1:39067/solr  Received 5 versions from 127.0.0.1:39063/solr/collection1/
[junit4:junit4]   2> 20312 T1689 C154 P39084 oasu.PeerSync.handleVersions PeerSync: core=collection1 url=http://127.0.0.1:39084/solr  Our versions are newer. ourLowThreshold=1413868600006017024 otherHigh=1413868600076271616
[junit4:junit4]   2> 20313 T1661 C151 P39067 oasu.PeerSync.requestUpdates PeerSync: core=collection1 url=http://127.0.0.1:39067/solr Requesting updates from 127.0.0.1:39063/solr/collection1/n=2 versions=[1413868600089903104, 1413868600076271616]
[junit4:junit4]   2> 20313 T1689 C154 P39084 oasu.PeerSync.sync PeerSync: core=collection1 url=http://127.0.0.1:39084/solr DONE. sync succeeded
[junit4:junit4]   2> 20313 T1689 C154 P39084 REQ /get {sync=http://127.0.0.1:39063/solr/collection1/&getVersions=100&distrib=false&qt=/get&wt=javabin&version=2} status=0 QTime=4 
[junit4:junit4]   2> 20314 T1652 oasc.SyncStrategy.syncToMe http://127.0.0.1:39063/solr/collection1/:  sync completed with http://127.0.0.1:39084/solr/collection1/
[junit4:junit4]   2> 20315 T1646 C152 P39063 REQ /get {distrib=false&getUpdates=1413868600089903104&qt=/get&wt=javabin&version=2} status=0 QTime=0 
[junit4:junit4]   2> 20315 T1647 C152 P39063 REQ /get {distrib=false&getUpdates=1413868600089903104,1413868600076271616&qt=/get&wt=javabin&version=2} status=0 QTime=0 
[junit4:junit4]   2> 20321 T1676 C153 P39076 oasu.PeerSync.sync PeerSync: core=collection1 url=http://127.0.0.1:39076/solr DONE. sync succeeded
[junit4:junit4]   2> 20321 T1676 C153 P39076 REQ /get {sync=http://127.0.0.1:39063/solr/collection1/&getVersions=100&distrib=false&qt=/get&wt=javabin&version=2} status=0 QTime=13 
[junit4:junit4]   2> 20321 T1661 C151 P39067 oasu.PeerSync.sync PeerSync: core=collection1 url=http://127.0.0.1:39067/solr DONE. sync succeeded
[junit4:junit4]   2> 20322 T1661 C151 P39067 REQ /get {sync=http://127.0.0.1:39063/solr/collection1/&getVersions=100&distrib=false&qt=/get&wt=javabin&version=2} status=0 QTime=14 
[junit4:junit4]   2> 20322 T1652 oasc.SyncStrategy.syncToMe http://127.0.0.1:39063/solr/collection1/:  sync completed with http://127.0.0.1:39076/solr/collection1/
[junit4:junit4]   2> 20322 T1652 oasc.SyncStrategy.syncToMe http://127.0.0.1:39063/solr/collection1/:  sync completed with http://127.0.0.1:39067/solr/collection1/
[junit4:junit4]   2> 20323 T1620 oasc.AbstractFullDistribZkTestBase.waitForThingsToLevelOut Wait for recoveries to finish - wait 15 for each attempt
[junit4:junit4]   2> 20324 T1620 oasc.AbstractDistribZkTestBase.waitForRecoveriesToFinish Wait for recoveries to finish - collection: collection1 failOnTimeout:true timeout (sec):15
[junit4:junit4]   2> 20325 T1620 oascc.ZkStateReader.updateClusterState Updating cloud state from ZooKeeper... 
[junit4:junit4]   2> 20328 T1632 C155 P39057 oasu.DirectUpdateHandler2.commit start commit{flags=0,_version_=0,optimize=false,openSearcher=true,waitSearcher=true,expungeDeletes=false,softCommit=false}
[junit4:junit4]   2> 20330 T1632 C155 P39057 oass.SolrIndexSearcher.<init> Opening Searcher@5e5db48f main
[junit4:junit4]   2> 20330 T1632 C155 P39057 oasu.DirectUpdateHandler2.commit end_commit_flush
[junit4:junit4]   2> 20332 T1643 oasc.SolrCore.registerSearcher [collection1] Registered new searcher Searcher@5e5db48f main{StandardDirectoryReader(segments_2:3:nrt _0(5.0):C4)}
[junit4:junit4]   2> 20332 T1632 C155 P39057 /update {waitSearcher=true&wt=javabin&commit=true&softCommit=false&version=2} {commit=} 0 4
[junit4:junit4]   2> 20335 T1648 C152 P39063 oasu.DirectUpdateHandler2.commit start commit{flags=0,_version_=0,optimize=false,openSearcher=true,waitSearcher=true,expungeDeletes=false,softCommit=false}
[junit4:junit4]   2> 20337 T1648 C152 P39063 oass.SolrIndexSearcher.<init> Opening Searcher@7d13074e main
[junit4:junit4]   2> 20337 T1648 C152 P39063 oasu.DirectUpdateHandler2.commit end_commit_flush
[junit4:junit4]   2> 20339 T1655 oasc.SolrCore.registerSearcher [collection1] Registered new searcher Searcher@7d13074e main{StandardDirectoryReader(segments_2:3:nrt _0(5.0):C4)}
[junit4:junit4]   2> 20339 T1648 C152 P39063 oasu.SolrCmdDistributor.distribCommit Distrib commit to:[StdNode: http://127.0.0.1:39067/solr/collection1/, StdNode: http://127.0.0.1:39076/solr/collection1/, StdNode: http://127.0.0.1:39084/solr/collection1/]
[junit4:junit4]   2> 20342 T1672 C153 P39076 oasu.DirectUpdateHandler2.commit start commit{flags=0,_version_=0,optimize=false,openSearcher=true,waitSearcher=true,expungeDeletes=false,softCommit=false}
[junit4:junit4]   2> 20342 T1686 C154 P39084 oasu.DirectUpdateHandler2.commit start commit{flags=0,_version_=0,optimize=false,openSearcher=true,waitSearcher=true,expungeDeletes=false,softCommit=false}
[junit4:junit4]   2> 20342 T1658 C151 P39067 oasu.DirectUpdateHandler2.commit start commit{flags=0,_version_=0,optimize=false,openSearcher=true,waitSearcher=true,expungeDeletes=false,softCommit=false}
[junit4:junit4]   2> 20344 T1686 C154 P39084 oass.SolrIndexSearcher.<init> Opening Searcher@4feb1d59 main
[junit4:junit4]   2> 20345 T1686 C154 P39084 oasu.DirectUpdateHandler2.commit end_commit_flush
[junit4:junit4]   2> 20346 T1695 oasc.SolrCore.registerSearcher [collection1] Registered new searcher Searcher@4feb1d59 main{StandardDirectoryReader(segments_3:4:nrt _0(5.0):C4)}
[junit4:junit4]   2> 20349 T1686 C154 P39084 /update {waitSearcher=true&commit=true&wt=javabin&commit_end_point=true&expungeDeletes=false&softCommit=false&version=2} {commit=} 0 7
[junit4:junit4]   2> 20599 T1658 C151 P39067 oasc.SolrDeletionPolicy.onCommit SolrDeletionPolicy.onCommit: commits:num=2
[junit4:junit4]   2> 		commit{dir=/usr/home/hudson/hudson-slave/workspace/Lucene-Solr-Tests-trunk-java7/solr/build/solr-core/test/J0/org.apache.solr.cloud.SyncSliceTest-1348370151365/jetty2/index,segFN=segments_3,generation=3,filenames=[_0_Asserting_0.tim, _0_Lucene40_0.tim, _0.fnm, _0_Asserting_0.tip, _0_Memory_0.ram, _0_nrm.cfs, _0_Lucene40_0.prx, _0_MockRandom_0.skp, _0_Lucene40_0.tip, _0_Asserting_0.prx, _0_MockRandom_0.frq, _0_MockRandom_0.sd, _0_Asserting_0.frq, _0_MockRandom_0.tip, _0_Lucene40_0.frq, _0_MockRandom_0.doc, _0_MockRandom_0.pos, _0_nrm.cfe, _0.fdx, _0.si, _0_MockRandom_0.pyl, _0_MockRandom_0.tim, _0.fdt, segments_3]
[junit4:junit4]   2> 		commit{dir=/usr/home/hudson/hudson-slave/workspace/Lucene-Solr-Tests-trunk-java7/solr/build/solr-core/test/J0/org.apache.solr.cloud.SyncSliceTest-1348370151365/jetty2/index,segFN=segments_4,generation=4,filenames=[_1_Lucene40_0.tim, _0_Asserting_0.tim, _0_Asserting_0.tip, _0_Lucene40_0.prx, _1.fnm, _1_Lucene40_0.tip, _0_Asserting_0.prx, _1_Asserting_0.tim, _1_Memory_0.ram, _0_Lucene40_0.frq, _1_Asserting_0.tip, _0.si, _1_MockRandom_0.tiv, _1_nrm.cfs, _0_Lucene40_0.tim, _0.fnm, _0_Memory_0.ram, _1_Lucene40_0.frq, _1_Asserting_0.frq, _1_MockRandom_0.sd, _0_nrm.cfs, _0_MockRandom_0.skp, _1_Lucene40_0.prx, _1_nrm.cfe, _0_Lucene40_0.tip, _1.fdx, _1_MockRandom_0.prx, _0_MockRandom_0.tip, _0_Asserting_0.frq, _0_MockRandom_0.sd, _0_MockRandom_0.frq, _1_MockRandom_0.tib, _1.fdt, _1_Asserting_0.prx, _0_MockRandom_0.doc, _1.si, _0_nrm.cfe, _0_MockRandom_0.pos, _0.fdx, _1_MockRandom_0.frq, _0_MockRandom_0.pyl, _0_MockRandom_0.tim, _0.fdt, segments_4]
[junit4:junit4]   2> 20600 T1658 C151 P39067 oasc.SolrDeletionPolicy.updateCommits newest commit = 4
[junit4:junit4]   2> 20613 T1672 C153 P39076 oasc.SolrDeletionPolicy.onCommit SolrDeletionPolicy.onCommit: commits:num=2
[junit4:junit4]   2> 		commit{dir=/usr/home/hudson/hudson-slave/workspace/Lucene-Solr-Tests-trunk-java7/solr/build/solr-core/test/J0/org.apache.solr.cloud.SyncSliceTest-1348370151365/jetty3/index,segFN=segments_3,generation=3,filenames=[_0_Asserting_0.tim, _0_Lucene40_0.tim, _0.fnm, _0_Asserting_0.tip, _0_Memory_0.ram, _0_MockRandom_0.prx, _0_nrm.cfs, _0_Lucene40_0.prx, _0_Lucene40_0.tip, _0_Asserting_0.prx, _0_MockRandom_0.tip, _0_MockRandom_0.frq, _0_MockRandom_0.sd, _0_Asserting_0.frq, _0_Lucene40_0.frq, _0_nrm.cfe, _0.fdx, _0.si, _0_MockRandom_0.tim, _0.fdt, segments_3]
[junit4:junit4]   2> 		commit{dir=/usr/home/hudson/hudson-slave/workspace/Lucene-Solr-Tests-trunk-java7/solr/build/solr-core/test/J0/org.apache.solr.cloud.SyncSliceTest-1348370151365/jetty3/index,segFN=segments_4,generation=4,filenames=[_0_Asserting_0.tim, _1_Lucene40_0.tim, _0_Asserting_0.tip, _0_MockRandom_0.prx, _0_Lucene40_0.prx, _1_MockRandom_0.pos, _1.fnm, _1_Lucene40_0.tip, _0_Asserting_0.prx, _1_Asserting_0.tim, _1_Memory_0.ram, _0_Lucene40_0.frq, _1_Asserting_0.tip, _0.si, _1_nrm.cfs, _0_Lucene40_0.tim, _0.fnm, _0_Memory_0.ram, _1_MockRandom_0.tip, _1_Lucene40_0.frq, _1_Asserting_0.frq, _1_MockRandom_0.sd, _1_MockRandom_0.tim, _1_MockRandom_0.skp, _0_nrm.cfs, _1_Lucene40_0.prx, _1_nrm.cfe, _0_Lucene40_0.tip, _1.fdx, _0_Asserting_0.frq, _0_MockRandom_0.sd, _0_MockRandom_0.frq, _0_MockRandom_0.tip, _1_MockRandom_0.pyl, _1.fdt, _1_Asserting_0.prx, _1.si, _0_nrm.cfe, _1_MockRandom_0.doc, _0.fdx, _1_MockRandom_0.frq, _0_MockRandom_0.tim, _0.fdt, segments_4]
[junit4:junit4]   2> 20613 T1658 C151 P39067 oass.SolrIndexSearcher.<init> Opening Searcher@24426d92 main
[junit4:junit4]   2> 20614 T1672 C153 P39076 oasc.SolrDeletionPolicy.updateCommits newest commit = 4
[junit4:junit4]   2> 20614 T1658 C151 P39067 oasu.DirectUpdateHandler2.commit end_commit_flush
[junit4:junit4]   2> 20616 T1667 oasc.SolrCore.registerSearcher [collection1] Registered new searcher Searcher@24426d92 main{StandardDirectoryReader(segments_4:6:nrt _0(5.0):C2 _1(5.0):C2)}
[junit4:junit4]   2> 20616 T1658 C151 P39067 /update {waitSearcher=true&commit=true&wt=javabin&commit_end_point=true&expungeDeletes=false&softCommit=false&version=2} {commit=} 0 274
[junit4:junit4]   2> 20624 T1672 C153 P39076 oass.SolrIndexSearcher.<init> Opening Searcher@3a5261c3 main
[junit4:junit4]   2> 20624 T1672 C153 P39076 oasu.DirectUpdateHandler2.commit end_commit_flush
[junit4:junit4]   2> 20626 T1681 oasc.SolrCore.registerSearcher [collection1] Registered new searcher Searcher@3a5261c3 main{StandardDirectoryReader(segments_4:6:nrt _0(5.0):C3 _1(5.0):C1)}
[junit4:junit4]   2> 20626 T1672 C153 P39076 /update {waitSearcher=true&commit=true&wt=javabin&commit_end_point=true&expungeDeletes=false&softCommit=false&version=2} {commit=} 0 284
[junit4:junit4]   2> 20627 T1648 C152 P39063 /update {waitSearcher=true&wt=javabin&commit=true&softCommit=false&version=2} {commit=} 0 292
[junit4:junit4]   2> 20629 T1620 oascc.ZkStateReader.updateClusterState Updating cloud state from ZooKeeper... 
[junit4:junit4]   2> 20632 T1649 C152 P39063 REQ /select {distrib=false&wt=javabin&q=*:*&version=2} hits=4 status=0 QTime=0 
[junit4:junit4]   2> 20636 T1659 C151 P39067 REQ /select {distrib=false&wt=javabin&q=*:*&version=2} hits=4 status=0 QTime=0 
[junit4:junit4]   2> 20640 T1673 C153 P39076 REQ /select {distrib=false&wt=javabin&q=*:*&version=2} hits=4 status=0 QTime=0 
[junit4:junit4]   2> 20643 T1687 C154 P39084 REQ /select {distrib=false&wt=javabin&q=*:*&version=2} hits=4 status=0 QTime=0 
[junit4:junit4]   2> 22651 T1633 C155 P39057 REQ /select {fl=id,score&shard.url=127.0.0.1:39057/solr/collection1/&NOW=1348370174007&start=0&q=*:*&distrib=false&isShard=true&wt=javabin&fsv=true&rows=10&version=2} hits=4 status=0 QTime=0 
[junit4:junit4]   2> 22672 T1633 C155 P39057 REQ /select {shard.url=127.0.0.1:39057/solr/collection1/&NOW=1348370174007&q=*:*&ids=3,2,1,0&distrib=false&isShard=true&wt=javabin&version=2} status=0 QTime=1 
[junit4:junit4]   2> 22673 T1632 C155 P39057 REQ /select {wt=javabin&q=*:*&version=2} hits=4 status=0 QTime=26 
[junit4:junit4]   2> Control Docs:4
[junit4:junit4]   2> 22674 T1620 oascc.ZkStateReader.updateClusterState Updating cloud state from ZooKeeper... 
[junit4:junit4]   2> check const of shard1
[junit4:junit4]   2> client0
[junit4:junit4]   2> PROPS:127.0.0.1:39063_solr_collection1:{"shard":"shard1","roles":null,"state":"active","core":"collection1","collection":"collection1","node_name":"127.0.0.1:39063_solr","base_url":"http://127.0.0.1:39063/solr","leader":"true"}
[junit4:junit4]   2> 22678 T1649 C152 P39063 REQ /select {distrib=false&wt=javabin&q=*:*&version=2} hits=4 status=0 QTime=0 
[junit4:junit4]   2>  live:true
[junit4:junit4]   2>  num:4
[junit4:junit4]   2> 
[junit4:junit4]   2> client1
[junit4:junit4]   2> PROPS:127.0.0.1:39067_solr_collection1:{"shard":"shard1","roles":null,"state":"active","core":"collection1","collection":"collection1","node_name":"127.0.0.1:39067_solr","base_url":"http://127.0.0.1:39067/solr"}
[junit4:junit4]   2> 22681 T1659 C151 P39067 REQ /select {distrib=false&wt=javabin&q=*:*&version=2} hits=4 status=0 QTime=0 
[junit4:junit4]   2>  live:true
[junit4:junit4]   2>  num:4
[junit4:junit4]   2> 
[junit4:junit4]   2> client2
[junit4:junit4]   2> PROPS:127.0.0.1:39076_solr_collection1:{"shard":"shard1","roles":null,"state":"active","core":"collection1","collection":"collection1","node_name":"127.0.0.1:39076_solr","base_url":"http://127.0.0.1:39076/solr"}
[junit4:junit4]   2> 22684 T1673 C153 P39076 REQ /select {distrib=false&wt=javabin&q=*:*&version=2} hits=4 status=0 QTime=0 
[junit4:junit4]   2>  live:true
[junit4:junit4]   2>  num:4
[junit4:junit4]   2> 
[junit4:junit4]   2> client3
[junit4:junit4]   2> PROPS:127.0.0.1:39084_solr_collection1:{"shard":"shard1","roles":null,"state":"active","core":"collection1","collection":"collection1","node_name":"127.0.0.1:39084_solr","base_url":"http://127.0.0.1:39084/solr"}
[junit4:junit4]   2> 22687 T1687 C154 P39084 REQ /select {distrib=false&wt=javabin&q=*:*&version=2} hits=4 status=0 QTime=0 
[junit4:junit4]   2>  live:true
[junit4:junit4]   2>  num:4
[junit4:junit4]   2> 
[junit4:junit4]   2> 22692 T1678 C153 P39076 REQ /select {fl=id,score&shard.url=127.0.0.1:39063/solr/collection1/|127.0.0.1:39067/solr/collection1/|127.0.0.1:39076/solr/collection1/|127.0.0.1:39084/solr/collection1/&NOW=1348370174049&start=0&q=*:*&distrib=false&isShard=true&wt=javabin&fsv=true&rows=10&version=2} hits=4 status=0 QTime=0 
[junit4:junit4]   2> 22697 T1678 C153 P39076 REQ /select {shard.url=127.0.0.1:39063/solr/collection1/|127.0.0.1:39067/solr/collection1/|127.0.0.1:39076/solr/collection1/|127.0.0.1:39084/solr/collection1/&NOW=1348370174049&q=*:*&ids=3,2,1,0&distrib=false&isShard=true&wt=javabin&version=2} status=0 QTime=2 
[junit4:junit4]   2> 22698 T1677 C153 P39076 REQ /select {wt=javabin&q=*:*&version=2} hits=4 status=0 QTime=9 
[junit4:junit4]   2> 22712 T1632 C155 P39057 /update {wt=javabin&version=2} {add=[4 (1413868603636187136)]} 0 11
[junit4:junit4]   2> 22738 T1672 C153 P39076 REQ /update {distrib.from=http://127.0.0.1:39063/solr/collection1/&update.distrib=FROMLEADER&test.distrib.skip.servers=http://127.0.0.1:39084/solr/collection1/&wt=javabin&version=2} status=0 QTime=17 
[junit4:junit4]   2> 22754 T1658 C151 P39067 REQ /update {distrib.from=http://127.0.0.1:39063/solr/collection1/&update.distrib=FROMLEADER&test.distrib.skip.servers=http://127.0.0.1:39084/solr/collection1/&wt=javabin&version=2} status=0 QTime=33 
[junit4:junit4]   2> 22754 T1648 C152 P39063 /update {test.distrib.skip.servers=http://127.0.0.1:39084/solr/collection1/&wt=javabin&version=2} {add=[4 (1413868603650867200)]} 0 39
[junit4:junit4]   2> 22756 T1620 oasc.ChaosMonkey.monkeyLog monkey: kill shard! 39063
[junit4:junit4]   2> 22757 T1620 oasc.CoreContainer.shutdown Shutting down CoreContainer instance=892169775
[junit4:junit4]   2> 22758 T1620 oasc.SolrCore.close [collection1]  CLOSING SolrCore org.apache.solr.core.SolrCore@17684783
[junit4:junit4]   2> 22773 T1620 oasc.SolrCore.closeSearcher [collection1] Closing main searcher on request.
[junit4:junit4]   2> 22774 T1620 oasu.DirectUpdateHandler2.close closing DirectUpdateHandler2{commits=6,autocommits=0,soft autocommits=0,optimizes=0,rollbacks=0,expungeDeletes=0,docsPending=1,adds=1,deletesById=0,deletesByQuery=0,errors=0,cumulative_adds=5,cumulative_deletesById=0,cumulative_deletesByQuery=1,cumulative_errors=0}
[junit4:junit4]   2> 22774 T1620 oasu.DefaultSolrCoreState.decref SolrCoreState ref count has reached 0 - closing IndexWriter
[junit4:junit4]   2> 22905 T1620 C152 P39063 oasc.SolrDeletionPolicy.onCommit SolrDeletionPolicy.onCommit: commits:num=3
[junit4:junit4]   2> 		commit{dir=/usr/home/hudson/hudson-slave/workspace/Lucene-Solr-Tests-trunk-java7/solr/build/solr-core/test/J0/org.apache.solr.cloud.SyncSliceTest-1348370151365/jetty1/index,segFN=segments_1,generation=1,filenames=[segments_1]
[junit4:junit4]   2> 		commit{dir=/usr/home/hudson/hudson-slave/workspace/Lucene-Solr-Tests-trunk-java7/solr/build/solr-core/test/J0/org.apache.solr.cloud.SyncSliceTest-1348370151365/jetty1/index,segFN=segments_2,generation=2,filenames=[_0_Asserting_0.tim, _0_Lucene40_0.tim, _0.fnm, _0_Asserting_0.tip, _0_Memory_0.ram, _0_MockRandom_0.prx, _0_nrm.cfs, _0_Lucene40_0.prx, _0_Lucene40_0.tip, _0_Asserting_0.prx, _0_MockRandom_0.tip, _0_MockRandom_0.frq, _0_MockRandom_0.sd, _0_Asserting_0.frq, _0_Lucene40_0.frq, _0_nrm.cfe, segments_2, _0.fdx, _0.si, _0_MockRandom_0.tim, _0.fdt]
[junit4:junit4]   2> 		commit{dir=/usr/home/hudson/hudson-slave/workspace/Lucene-Solr-Tests-trunk-java7/solr/build/solr-core/test/J0/org.apache.solr.cloud.SyncSliceTest-1348370151365/jetty1/index,segFN=segments_3,generation=3,filenames=[_0_Asserting_0.tim, _1_Lucene40_0.tim, _0_Asserting_0.tip, _0_MockRandom_0.prx, _0_Lucene40_0.prx, _1.fnm, _1_Lucene40_0.tip, _0_Asserting_0.prx, _1_Asserting_0.tim, _1_Memory_0.ram, _0_Lucene40_0.frq, _1_Asserting_0.tip, _0.si, _1_nrm.cfs, _0_Lucene40_0.tim, _0.fnm, _0_Memory_0.ram, _1_MockRandom_0.tip, _1_Lucene40_0.frq, _1_Asserting_0.frq, _1_MockRandom_0.tim, _1_MockRandom_0.sd, _0_nrm.cfs, _1_Lucene40_0.prx, _1_nrm.cfe, _0_Lucene40_0.tip, _1.fdx, _1_MockRandom_0.prx, _0_Asserting_0.frq, _0_MockRandom_0.sd, _0_MockRandom_0.frq, _0_MockRandom_0.tip, _1.fdt, _1_Asserting_0.prx, _1.si, _0_nrm.cfe, _0.fdx, _1_MockRandom_0.frq, _0_MockRandom_0.tim, segments_3, _0.fdt]
[junit4:junit4]   2> 22906 T1620 C152 P39063 oasc.SolrDeletionPolicy.updateCommits newest commit = 3
[junit4:junit4]   2> 22909 T1620 oasu.DefaultSolrCoreState.decref Closing SolrCoreState - canceling any ongoing recovery
[junit4:junit4]   2> 22910 T1625 oazs.PrepRequestProcessor.pRequest Processed session termination for sessionid: 0x139f11fb7cd0003
[junit4:junit4]   2> 22912 T1680 oascc.ZkStateReader$3.process Updating live nodes
[junit4:junit4]   2> 22912 T1640 oascc.ZkStateReader$3.process Updating live nodes
[junit4:junit4]   2> 22913 T1622 oazs.NIOServerCnxn.closeSock Closed socket connection for client /140.211.11.196:39064 which had sessionid 0x139f11fb7cd0003
[junit4:junit4]   2> 22912 T1654 oascc.ZkStateReader$3.process Updating live nodes
[junit4:junit4]   2> 22912 T1694 oascc.ZkStateReader$3.process Updating live nodes
[junit4:junit4]   2> 22912 T1701 oascc.ZkStateReader$3.process Updating live nodes
[junit4:junit4]   2> 22912 T1699 oascc.ZkStateReader$3.process Updating live nodes
[junit4:junit4]   2> 22913 T1654 oascc.ZkStateReader$3.process WARNING ZooKeeper watch triggered, but Solr cannot talk to ZK
[junit4:junit4]   2> 22912 T1620 oaz.ZooKeeper.close Session: 0x139f11fb7cd0003 closed
[junit4:junit4]   2> 22914 T1625 oazs.PrepRequestProcessor.pRequest Got user-level KeeperException when processing sessionid:0x139f11fb7cd0004 type:delete cxid:0x4a zxid:0xfffffffffffffffe txntype:unknown reqpath:n/a Error Path:/solr/collections/collection1/leaders/shard1 Error:KeeperErrorCode = NoNode for /solr/collections/collection1/leaders/shard1
[junit4:junit4]   2> 22914 T1654 oaz.ClientCnxn$EventThread.run EventThread shut down
[junit4:junit4]   2> 22915 T1620 oejsh.ContextHandler.doStop stopped o.e.j.s.ServletContextHandler{/solr,null}
[junit4:junit4]   2> 22927 T1666 oasc.ShardLeaderElectionContext.runLeaderProcess Running the leader process.
[junit4:junit4]   2> 22927 T1625 oazs.PrepRequestProcessor.pRequest Got user-level KeeperException when processing sessionid:0x139f11fb7cd0004 type:create cxid:0x4b zxid:0xfffffffffffffffe txntype:unknown reqpath:n/a Error Path:/solr/overseer Error:KeeperErrorCode = NodeExists for /solr/overseer
[junit4:junit4]   2> 22962 T1666 oasc.ShardLeaderElectionContext.shouldIBeLeader Checking if I should try and be the leader.
[junit4:junit4]   2> 22962 T1666 oasc.ShardLeaderElectionContext.shouldIBeLeader My last published State was Active, it's okay to be the leader.
[junit4:junit4]   2> 22962 T1666 oasc.ShardLeaderElectionContext.runLeaderProcess I may be the new leader - try and sync
[junit4:junit4]   2> 22962 T1666 oasc.SyncStrategy.sync Sync replicas to http://127.0.0.1:39067/solr/collection1/
[junit4:junit4]   2> 22963 T1666 oasu.PeerSync.sync PeerSync: core=collection1 url=http://127.0.0.1:39067/solr START replicas=[http://127.0.0.1:39063/solr/collection1/, http://127.0.0.1:39076/solr/collection1/, http://127.0.0.1:39084/solr/collection1/] nUpdates=100
[junit4:junit4]   2> 22967 T1675 C153 P39076 REQ /get {distrib=false&qt=/get&wt=javabin&version=2&getVersions=100} status=0 QTime=0 
[junit4:junit4]   2> 22968 T1620 oasc.ChaosMonkey.monkeyLog monkey: stop shard! 39063
[junit4:junit4]   2> 22968 T1666 oasu.PeerSync.handleVersions PeerSync: core=collection1 url=http://127.0.0.1:39067/solr  Received 6 versions from 127.0.0.1:39076/solr/collection1/
[junit4:junit4]   2> 22969 T1666 oasu.PeerSync.handleVersions PeerSync: core=collection1 url=http://127.0.0.1:39067/solr  Our versions are newer. ourLowThreshold=1413868600046911488 otherHigh=1413868600089903104
[junit4:junit4]   2> 22972 T1688 C154 P39084 REQ /get {distrib=false&qt=/get&wt=javabin&version=2&getVersions=100} status=0 QTime=6 
[junit4:junit4]   2> 22972 T1666 oasu.PeerSync.handleVersions PeerSync: core=collection1 url=http://127.0.0.1:39067/solr  Received 5 versions from 127.0.0.1:39084/solr/collection1/
[junit4:junit4]   2> 22973 T1666 oasu.PeerSync.handleVersions PeerSync: core=collection1 url=http://127.0.0.1:39067/solr  Our versions are newer. ourLowThreshold=1413868600046911488 otherHigh=1413868600076271616
[junit4:junit4]   2> 23126 T1641 oascc.ZkStateReader.updateClusterState Updating cloud state from ZooKeeper... 
[junit4:junit4]   2> 23178 T1680 oascc.ZkStateReader$2.process A cluster state change has occurred - updating...
[junit4:junit4]   2> 23178 T1694 oascc.ZkStateReader$2.process A cluster state change has occurred - updating...
[junit4:junit4]   2> 23178 T1640 oascc.ZkStateReader$2.process A cluster state change has occurred - updating...
[junit4:junit4]   2> 23178 T1699 oascc.ZkStateReader$2.process A cluster state change has occurred - updating...
[junit4:junit4]   2> 23178 T1701 oascc.ZkStateReader$2.process A cluster state change has occurred - updating...
[junit4:junit4]   2> 52966 T1666 oasu.PeerSync.handleResponse WARNING PeerSync: core=collection1 url=http://127.0.0.1:39067/solr  exception talking to http://127.0.0.1:39063/solr/collection1/, failed org.apache.solr.client.solrj.SolrServerException: IOException occured when talking to server at: http://127.0.0.1:39063/solr/collection1
[junit4:junit4]   2> 	at org.apache.solr.client.solrj.impl.HttpSolrServer.request(HttpSolrServer.java:414)
[junit4:junit4]   2> 	at org.apache.solr.client.solrj.impl.HttpSolrServer.request(HttpSolrServer.java:182)
[junit4:junit4]   2> 	at org.apache.solr.handler.component.HttpShardHandler$1.call(HttpShardHandler.java:166)
[junit4:junit4]   2> 	at org.apache.solr.handler.component.HttpShardHandler$1.call(HttpShardHandler.java:133)
[junit4:junit4]   2> 	at java.util.concurrent.FutureTask$Sync.innerRun(FutureTask.java:334)
[junit4:junit4]   2> 	at java.util.concurrent.FutureTask.run(FutureTask.java:166)
[junit4:junit4]   2> 	at java.util.concurrent.Executors$RunnableAdapter.call(Executors.java:471)
[junit4:junit4]   2> 	at java.util.concurrent.FutureTask$Sync.innerRun(FutureTask.java:334)
[junit4:junit4]   2> 	at java.util.concurrent.FutureTask.run(FutureTask.java:166)
[junit4:junit4]   2> 	at java.util.concurrent.ThreadPoolExecutor.runWorker(ThreadPoolExecutor.java:1110)
[junit4:junit4]   2> 	at java.util.concurrent.ThreadPoolExecutor$Worker.run(ThreadPoolExecutor.java:603)
[junit4:junit4]   2> 	at java.lang.Thread.run(Thread.java:722)
[junit4:junit4]   2> Caused by: org.apache.http.conn.ConnectTimeoutException: Connect to 127.0.0.1:39063 timed out
[junit4:junit4]   2> 	at org.apache.http.conn.scheme.PlainSocketFactory.connectSocket(PlainSocketFactory.java:125)
[junit4:junit4]   2> 	at org.apache.http.impl.conn.DefaultClientConnectionOperator.openConnection(DefaultClientConnectionOperator.java:148)
[junit4:junit4]   2> 	at org.apache.http.impl.conn.AbstractPoolEntry.open(AbstractPoolEntry.java:150)
[junit4:junit4]   2> 	at org.apache.http.impl.conn.AbstractPooledConnAdapter.open(AbstractPooledConnAdapter.java:121)
[junit4:junit4]   2> 	at org.apache.http.impl.client.DefaultRequestDirector.tryConnect(DefaultRequestDirector.java:575)
[junit4:junit4]   2> 	at org.apache.http.impl.client.DefaultRequestDirector.execute(DefaultRequestDirector.java:425)
[junit4:junit4]   2> 	at org.apache.http.impl.client.AbstractHttpClient.execute(AbstractHttpClient.java:820)
[junit4:junit4]   2> 	at org.apache.http.impl.client.AbstractHttpClient.execute(AbstractHttpClient.java:754)
[junit4:junit4]   2> 	at org.apache.http.impl.client.AbstractHttpClient.execute(AbstractHttpClient.java:732)
[junit4:junit4]   2> 	at org.apache.solr.client.solrj.impl.HttpSolrServer.request(HttpSolrServer.java:353)
[junit4:junit4]   2> 	... 11 more
[junit4:junit4]   2> 
[junit4:junit4]   2> 52980 T1666 oasu.PeerSync.sync PeerSync: core=collection1 url=http://127.0.0.1:39067/solr DONE. sync failed
[junit4:junit4]   2> 52980 T1666 oasc.SolrException.log SEVERE Sync Failed
[junit4:junit4]   2> 52981 T1666 oasc.ShardLeaderElectionContext.rej

[...truncated too long message...]

earch <<<
[junit4:junit4]    > Throwable #1: java.lang.AssertionError: There are still nodes recoverying
[junit4:junit4]    > 	at __randomizedtesting.SeedInfo.seed([35A18BF99C233859:B44705E1EB7C5865]:0)
[junit4:junit4]    > 	at org.junit.Assert.fail(Assert.java:93)
[junit4:junit4]    > 	at org.apache.solr.cloud.AbstractDistribZkTestBase.waitForRecoveriesToFinish(AbstractDistribZkTestBase.java:154)
[junit4:junit4]    > 	at org.apache.solr.cloud.AbstractFullDistribZkTestBase.waitForRecoveriesToFinish(AbstractFullDistribZkTestBase.java:565)
[junit4:junit4]    > 	at org.apache.solr.cloud.AbstractFullDistribZkTestBase.waitForThingsToLevelOut(AbstractFullDistribZkTestBase.java:1140)
[junit4:junit4]    > 	at org.apache.solr.cloud.SyncSliceTest.doTest(SyncSliceTest.java:162)
[junit4:junit4]    > 	at org.apache.solr.BaseDistributedSearchTestCase.testDistribSearch(BaseDistributedSearchTestCase.java:695)
[junit4:junit4]    > 	at sun.reflect.NativeMethodAccessorImpl.invoke0(Native Method)
[junit4:junit4]    > 	at sun.reflect.NativeMethodAccessorImpl.invoke(NativeMethodAccessorImpl.java:57)
[junit4:junit4]    > 	at sun.reflect.DelegatingMethodAccessorImpl.invoke(DelegatingMethodAccessorImpl.java:43)
[junit4:junit4]    > 	at java.lang.reflect.Method.invoke(Method.java:601)
[junit4:junit4]    > 	at com.carrotsearch.randomizedtesting.RandomizedRunner.invoke(RandomizedRunner.java:1559)
[junit4:junit4]    > 	at com.carrotsearch.randomizedtesting.RandomizedRunner.access$600(RandomizedRunner.java:79)
[junit4:junit4]    > 	at com.carrotsearch.randomizedtesting.RandomizedRunner$6.evaluate(RandomizedRunner.java:737)
[junit4:junit4]    > 	at com.carrotsearch.randomizedtesting.RandomizedRunner$7.evaluate(RandomizedRunner.java:773)
[junit4:junit4]    > 	at com.carrotsearch.randomizedtesting.RandomizedRunner$8.evaluate(RandomizedRunner.java:787)
[junit4:junit4]    > 	at com.carrotsearch.randomizedtesting.rules.SystemPropertiesRestoreRule$1.evaluate(SystemPropertiesRestoreRule.java:53)
[junit4:junit4]    > 	at org.apache.lucene.util.TestRuleSetupTeardownChained$1.evaluate(TestRuleSetupTeardownChained.java:50)
[junit4:junit4]    > 	at org.apache.lucene.util.TestRuleFieldCacheSanity$1.evaluate(TestRuleFieldCacheSanity.java:51)
[junit4:junit4]    > 	at org.apache.lucene.util.AbstractBeforeAfterRule$1.evaluate(AbstractBeforeAfterRule.java:45)
[junit4:junit4]    > 	at com.carrotsearch.randomizedtesting.rules.SystemPropertiesInvariantRule$1.evaluate(SystemPropertiesInvariantRule.java:55)
[junit4:junit4]    > 	at org.apache.lucene.util.TestRuleThreadAndTestName$1.evaluate(TestRuleThreadAndTestName.java:48)
[junit4:junit4]    > 	at org.apache.lucene.util.TestRuleIgnoreAfterMaxFailures$1.evaluate(TestRuleIgnoreAfterMaxFailures.java:70)
[junit4:junit4]    > 	at org.apache.lucene.util.TestRuleMarkFailure$1.evaluate(TestRuleMarkFailure.java:48)
[junit4:junit4]    > 	at com.carrotsearch.randomizedtesting.rules.StatementAdapter.evaluate(StatementAdapter.java:36)
[junit4:junit4]    > 	at com.carrotsearch.randomizedtesting.ThreadLeakControl$StatementRunner.run(ThreadLeakControl.java:358)
[junit4:junit4]    > 	at com.carrotsearch.randomizedtesting.ThreadLeakControl.forkTimeoutingTask(ThreadLeakControl.java:782)
[junit4:junit4]    > 	at com.carrotsearch.randomizedtesting.ThreadLeakControl$3.evaluate(ThreadLeakControl.java:442)
[junit4:junit4]    > 	at com.carrotsearch.randomizedtesting.RandomizedRunner.runSingleTest(RandomizedRunner.java:746)
[junit4:junit4]    > 	at com.carrotsearch.randomizedtesting.RandomizedRunner$3.evaluate(RandomizedRunner.java:648)
[junit4:junit4]    > 	at com.carrotsearch.randomizedtesting.RandomizedRunner$4.evaluate(RandomizedRunner.java:682)
[junit4:junit4]    > 	at com.carrotsearch.randomizedtesting.RandomizedRunner$5.evaluate(RandomizedRunner.java:693)
[junit4:junit4]    > 	at com.carrotsearch.randomizedtesting.rules.StatementAdapter.evaluate(StatementAdapter.java:36)
[junit4:junit4]    > 	at com.carrotsearch.randomizedtesting.rules.SystemPropertiesRestoreRule$1.evaluate(SystemPropertiesRestoreRule.java:53)
[junit4:junit4]    > 	at org.apache.lucene.util.AbstractBeforeAfterRule$1.evaluate(AbstractBeforeAfterRule.java:45)
[junit4:junit4]    > 	at org.apache.lucene.util.TestRuleStoreClassName$1.evaluate(TestRuleStoreClassName.java:42)
[junit4:junit4]    > 	at com.carrotsearch.randomizedtesting.rules.SystemPropertiesInvariantRule$1.evaluate(SystemPropertiesInvariantRule.java:55)
[junit4:junit4]    > 	at com.carrotsearch.randomizedtesting.rules.NoShadowingOrOverridesOnMethodsRule$1.evaluate(NoShadowingOrOverridesOnMethodsRule.java:39)
[junit4:junit4]    > 	at com.carrotsearch.randomizedtesting.rules.NoShadowingOrOverridesOnMethodsRule$1.evaluate(NoShadowingOrOverridesOnMethodsRule.java:39)
[junit4:junit4]    > 	at com.carrotsearch.randomizedtesting.rules.StatementAdapter.evaluate(StatementAdapter.java:36)
[junit4:junit4]    > 	at org.apache.lucene.util.TestRuleAssertionsRequired$1.evaluate(TestRuleAssertionsRequired.java:43)
[junit4:junit4]    > 	at org.apache.lucene.util.TestRuleMarkFailure$1.evaluate(TestRuleMarkFailure.java:48)
[junit4:junit4]    > 	at org.apache.lucene.util.TestRuleIgnoreAfterMaxFailures$1.evaluate(TestRuleIgnoreAfterMaxFailures.java:70)
[junit4:junit4]    > 	at org.apache.lucene.util.TestRuleIgnoreTestSuites$1.evaluate(TestRuleIgnoreTestSuites.java:55)
[junit4:junit4]    > 	at com.carrotsearch.randomizedtesting.rules.StatementAdapter.evaluate(StatementAdapter.java:36)
[junit4:junit4]    > 	at com.carrotsearch.randomizedtesting.ThreadLeakControl$StatementRunner.run(ThreadLeakControl.java:358)
[junit4:junit4]    > 	at java.lang.Thread.run(Thread.java:722)
[junit4:junit4]   2> 140042 T1620 oas.SolrTestCaseJ4.deleteCore ###deleteCore
[junit4:junit4]   2> NOTE: test params are: codec=Lucene40: {range_facet_l=PostingsFormat(name=Memory doPackFST= false), text=Lucene40(minBlockSize=11 maxBlockSize=77), _version_=PostingsFormat(name=Memory doPackFST= false), rnd_b=PostingsFormat(name=MockRandom), intDefault=PostingsFormat(name=Memory doPackFST= false), timestamp=PostingsFormat(name=Memory doPackFST= false), id=PostingsFormat(name=MockRandom), a_t=PostingsFormat(name=Memory doPackFST= false), range_facet_sl=Lucene40(minBlockSize=11 maxBlockSize=77), range_facet_si=PostingsFormat(name=Asserting), other_tl1=PostingsFormat(name=Memory doPackFST= false), multiDefault=PostingsFormat(name=Asserting), a_si=PostingsFormat(name=Asserting)}, sim=RandomSimilarityProvider(queryNorm=true,coord=no): {}, locale=it_CH, timezone=Australia/Lord_Howe
[junit4:junit4]   2> NOTE: FreeBSD 9.0-RELEASE amd64/Oracle Corporation 1.7.0_06 (64-bit)/cpus=16,threads=1,free=116874952,total=494927872
[junit4:junit4]   2> NOTE: All tests run in this JVM: [TestPHPSerializedResponseWriter, DistributedTermsComponentTest, SampleTest, SOLR749Test, DistanceFunctionTest, WordBreakSolrSpellCheckerTest, SuggesterFSTTest, RequestHandlersTest, TestCoreContainer, BadComponentTest, ResourceLoaderTest, TestFastWriter, TestQuerySenderNoQuery, CircularListTest, AlternateDirectoryTest, TestSolr4Spatial, TestJoin, SuggesterWFSTTest, ResponseLogComponentTest, BinaryUpdateRequestHandlerTest, TestFaceting, TestLMDirichletSimilarityFactory, HighlighterConfigTest, TestLFUCache, TestRangeQuery, UpdateRequestProcessorFactoryTest, AutoCommitTest, TestExtendedDismaxParser, SimplePostToolTest, DateFieldTest, TestSolrQueryParser, TestFastOutputStream, DirectSolrConnectionTest, DistributedSpellCheckComponentTest, TestCollationField, TestPseudoReturnFields, SearchHandlerTest, TestIBSimilarityFactory, FieldAnalysisRequestHandlerTest, JSONWriterTest, TestConfig, TestStressVersions, CoreContainerCoreInitFailuresTest, TestNumberUtils, TestSystemIdResolver, TestIndexingPerformance, DirectUpdateHandlerOptimizeTest, SpellCheckCollatorTest, TestSolrJ, TestSuggestSpellingConverter, TestRandomFaceting, LoggingHandlerTest, BasicDistributedZkTest, TestDistributedGrouping, BasicZkTest, IndexBasedSpellCheckerTest, TestMultiCoreConfBootstrap, SimpleFacetsTest, TestGroupingSearch, DirectSolrSpellCheckerTest, TestFiltering, TestCSVResponseWriter, DocumentBuilderTest, DistributedQueryElevationComponentTest, QueryParsingTest, SolrInfoMBeanTest, MinimalSchemaTest, StandardRequestHandlerTest, TermVectorComponentTest, TestSurroundQueryParser, SolrPluginUtilsTest, FastVectorHighlighterTest, ReturnFieldsTest, CopyFieldTest, SuggesterTSTTest, UniqFieldsUpdateProcessorFactoryTest, UpdateParamsTest, CSVRequestHandlerTest, TestSearchPerf, NotRequiredUniqueKeyTest, TestFoldingMultitermQuery, SolrCoreCheckLockOnStartupTest, NoCacheHeaderTest, FieldMutatingUpdateProcessorTest, TestXIncludeConfig, TestQuerySenderListener, TestSolrCoreProperties, SpellPossibilityIteratorTest, LegacyHTMLStripCharFilterTest, TestDFRSimilarityFactory, TestFastLRUCache, DateMathParserTest, PrimUtilsTest, TestBadConfig, AnalysisAfterCoreReloadTest, ClusterStateTest, SyncSliceTest]
[junit4:junit4] Completed on J0 in 140.09s, 1 test, 1 failure <<< FAILURES!

[...truncated 10 lines...]
BUILD FAILED
/usr/home/hudson/hudson-slave/workspace/Lucene-Solr-Tests-trunk-java7/build.xml:32: The following error occurred while executing this line:
/usr/home/hudson/hudson-slave/workspace/Lucene-Solr-Tests-trunk-java7/solr/build.xml:179: The following error occurred while executing this line:
/usr/home/hudson/hudson-slave/workspace/Lucene-Solr-Tests-trunk-java7/lucene/module-build.xml:63: The following error occurred while executing this line:
/usr/home/hudson/hudson-slave/workspace/Lucene-Solr-Tests-trunk-java7/lucene/common-build.xml:1141: The following error occurred while executing this line:
/usr/home/hudson/hudson-slave/workspace/Lucene-Solr-Tests-trunk-java7/lucene/common-build.xml:814: There were test failures: 230 suites, 950 tests, 1 failure, 21 ignored (3 assumptions)

Total time: 33 minutes 51 seconds
Build step 'Invoke Ant' marked build as failure
Recording test results
Email was triggered for: Failure
Sending email for trigger: Failure



Mime
View raw message