lucene-dev mailing list archives

Site index · List index
Message view « Date » · « Thread »
Top « Date » · « Thread »
From Apache Jenkins Server <jenk...@builds.apache.org>
Subject [JENKINS] Lucene-Solr-Tests-trunk-java7 - Build # 3227 - Still Failing
Date Wed, 19 Sep 2012 08:11:50 GMT
Build: https://builds.apache.org/job/Lucene-Solr-Tests-trunk-java7/3227/

1 tests failed.
FAILED:  org.apache.solr.cloud.SyncSliceTest.testDistribSearch

Error Message:
No live SolrServers available to handle this request

Stack Trace:
org.apache.solr.client.solrj.SolrServerException: No live SolrServers available to handle this request
	at __randomizedtesting.SeedInfo.seed([F8B539558E4C5C6D:7953B74DF9133C51]:0)
	at org.apache.solr.client.solrj.impl.LBHttpSolrServer.request(LBHttpSolrServer.java:323)
	at org.apache.solr.client.solrj.impl.CloudSolrServer.request(CloudSolrServer.java:257)
	at org.apache.solr.client.solrj.request.QueryRequest.process(QueryRequest.java:90)
	at org.apache.solr.client.solrj.SolrServer.query(SolrServer.java:324)
	at org.apache.solr.cloud.AbstractFullDistribZkTestBase.checkShardConsistency(AbstractFullDistribZkTestBase.java:909)
	at org.apache.solr.cloud.SyncSliceTest.doTest(SyncSliceTest.java:226)
	at org.apache.solr.BaseDistributedSearchTestCase.testDistribSearch(BaseDistributedSearchTestCase.java:695)
	at sun.reflect.NativeMethodAccessorImpl.invoke0(Native Method)
	at sun.reflect.NativeMethodAccessorImpl.invoke(NativeMethodAccessorImpl.java:57)
	at sun.reflect.DelegatingMethodAccessorImpl.invoke(DelegatingMethodAccessorImpl.java:43)
	at java.lang.reflect.Method.invoke(Method.java:601)
	at com.carrotsearch.randomizedtesting.RandomizedRunner.invoke(RandomizedRunner.java:1559)
	at com.carrotsearch.randomizedtesting.RandomizedRunner.access$600(RandomizedRunner.java:79)
	at com.carrotsearch.randomizedtesting.RandomizedRunner$6.evaluate(RandomizedRunner.java:737)
	at com.carrotsearch.randomizedtesting.RandomizedRunner$7.evaluate(RandomizedRunner.java:773)
	at com.carrotsearch.randomizedtesting.RandomizedRunner$8.evaluate(RandomizedRunner.java:787)
	at com.carrotsearch.randomizedtesting.rules.SystemPropertiesRestoreRule$1.evaluate(SystemPropertiesRestoreRule.java:53)
	at org.apache.lucene.util.TestRuleSetupTeardownChained$1.evaluate(TestRuleSetupTeardownChained.java:50)
	at org.apache.lucene.util.TestRuleFieldCacheSanity$1.evaluate(TestRuleFieldCacheSanity.java:51)
	at org.apache.lucene.util.AbstractBeforeAfterRule$1.evaluate(AbstractBeforeAfterRule.java:45)
	at com.carrotsearch.randomizedtesting.rules.SystemPropertiesInvariantRule$1.evaluate(SystemPropertiesInvariantRule.java:55)
	at org.apache.lucene.util.TestRuleThreadAndTestName$1.evaluate(TestRuleThreadAndTestName.java:48)
	at org.apache.lucene.util.TestRuleIgnoreAfterMaxFailures$1.evaluate(TestRuleIgnoreAfterMaxFailures.java:70)
	at org.apache.lucene.util.TestRuleMarkFailure$1.evaluate(TestRuleMarkFailure.java:48)
	at com.carrotsearch.randomizedtesting.rules.StatementAdapter.evaluate(StatementAdapter.java:36)
	at com.carrotsearch.randomizedtesting.ThreadLeakControl$StatementRunner.run(ThreadLeakControl.java:358)
	at com.carrotsearch.randomizedtesting.ThreadLeakControl.forkTimeoutingTask(ThreadLeakControl.java:782)
	at com.carrotsearch.randomizedtesting.ThreadLeakControl$3.evaluate(ThreadLeakControl.java:442)
	at com.carrotsearch.randomizedtesting.RandomizedRunner.runSingleTest(RandomizedRunner.java:746)
	at com.carrotsearch.randomizedtesting.RandomizedRunner$3.evaluate(RandomizedRunner.java:648)
	at com.carrotsearch.randomizedtesting.RandomizedRunner$4.evaluate(RandomizedRunner.java:682)
	at com.carrotsearch.randomizedtesting.RandomizedRunner$5.evaluate(RandomizedRunner.java:693)
	at com.carrotsearch.randomizedtesting.rules.StatementAdapter.evaluate(StatementAdapter.java:36)
	at com.carrotsearch.randomizedtesting.rules.SystemPropertiesRestoreRule$1.evaluate(SystemPropertiesRestoreRule.java:53)
	at org.apache.lucene.util.AbstractBeforeAfterRule$1.evaluate(AbstractBeforeAfterRule.java:45)
	at org.apache.lucene.util.TestRuleStoreClassName$1.evaluate(TestRuleStoreClassName.java:42)
	at com.carrotsearch.randomizedtesting.rules.SystemPropertiesInvariantRule$1.evaluate(SystemPropertiesInvariantRule.java:55)
	at com.carrotsearch.randomizedtesting.rules.NoShadowingOrOverridesOnMethodsRule$1.evaluate(NoShadowingOrOverridesOnMethodsRule.java:39)
	at com.carrotsearch.randomizedtesting.rules.NoShadowingOrOverridesOnMethodsRule$1.evaluate(NoShadowingOrOverridesOnMethodsRule.java:39)
	at com.carrotsearch.randomizedtesting.rules.StatementAdapter.evaluate(StatementAdapter.java:36)
	at org.apache.lucene.util.TestRuleAssertionsRequired$1.evaluate(TestRuleAssertionsRequired.java:43)
	at org.apache.lucene.util.TestRuleMarkFailure$1.evaluate(TestRuleMarkFailure.java:48)
	at org.apache.lucene.util.TestRuleIgnoreAfterMaxFailures$1.evaluate(TestRuleIgnoreAfterMaxFailures.java:70)
	at org.apache.lucene.util.TestRuleIgnoreTestSuites$1.evaluate(TestRuleIgnoreTestSuites.java:55)
	at com.carrotsearch.randomizedtesting.rules.StatementAdapter.evaluate(StatementAdapter.java:36)
	at com.carrotsearch.randomizedtesting.ThreadLeakControl$StatementRunner.run(ThreadLeakControl.java:358)
	at java.lang.Thread.run(Thread.java:722)




Build Log:
[...truncated 8295 lines...]
[junit4:junit4] Suite: org.apache.solr.cloud.SyncSliceTest
[junit4:junit4]   2> 4 T2465 oas.SolrTestCaseJ4.setUp ###Starting testDistribSearch
[junit4:junit4]   2> Creating dataDir: /usr/home/hudson/hudson-slave/workspace/Lucene-Solr-Tests-trunk-java7/solr/build/solr-core/test/J1/./solrtest-SyncSliceTest-1348042096286
[junit4:junit4]   2> 5 T2465 oasc.ZkTestServer.run STARTING ZK TEST SERVER
[junit4:junit4]   2> 7 T2466 oazs.ZooKeeperServer.setTickTime tickTime set to 1000
[junit4:junit4]   2> 8 T2466 oazs.NIOServerCnxn$Factory.<init> binding to port 0.0.0.0/0.0.0.0:0
[junit4:junit4]   2> 9 T2466 oazsp.FileTxnSnapLog.save Snapshotting: 0
[junit4:junit4]   2> 106 T2465 oasc.ZkTestServer.run start zk server on port:16380
[junit4:junit4]   2> 106 T2465 oaz.ZooKeeper.<init> Initiating client connection, connectString=127.0.0.1:16380 sessionTimeout=10000 watcher=org.apache.solr.common.cloud.ConnectionManager@6b00e4b2
[junit4:junit4]   2> 107 T2471 oaz.ClientCnxn$SendThread.startConnect Opening socket connection to server /127.0.0.1:16380
[junit4:junit4]   2> 107 T2465 oascc.ConnectionManager.waitForConnected Waiting for client to connect to ZooKeeper
[junit4:junit4]   2> 107 T2471 oaz.ClientCnxn$SendThread.primeConnection Socket connection established to localhost/127.0.0.1:16380, initiating session
[junit4:junit4]   2> 107 T2467 oazs.NIOServerCnxn$Factory.run Accepted socket connection from /140.211.11.196:16381
[junit4:junit4]   2> 108 T2467 oazs.NIOServerCnxn.readConnectRequest Client attempting to establish new session at /140.211.11.196:16381
[junit4:junit4]   2> 108 T2469 oazsp.FileTxnLog.append Creating new log file: log.1
[junit4:junit4]   2> 110 T2469 oazs.NIOServerCnxn.finishSessionInit Established session 0x139dd91fea30000 with negotiated timeout 10000 for client /140.211.11.196:16381
[junit4:junit4]   2> 110 T2471 oaz.ClientCnxn$SendThread.readConnectResult Session establishment complete on server localhost/127.0.0.1:16380, sessionid = 0x139dd91fea30000, negotiated timeout = 10000
[junit4:junit4]   2> 111 T2472 oascc.ConnectionManager.process Watcher org.apache.solr.common.cloud.ConnectionManager@6b00e4b2 name:ZooKeeperConnection Watcher:127.0.0.1:16380 got event WatchedEvent state:SyncConnected type:None path:null path:null type:None
[junit4:junit4]   2> 111 T2465 oascc.ConnectionManager.waitForConnected Client is connected to ZooKeeper
[junit4:junit4]   2> 111 T2465 oascc.SolrZkClient.makePath makePath: /solr
[junit4:junit4]   2> 113 T2470 oazs.PrepRequestProcessor.pRequest Processed session termination for sessionid: 0x139dd91fea30000
[junit4:junit4]   2> 122 T2472 oaz.ClientCnxn$EventThread.run EventThread shut down
[junit4:junit4]   2> 122 T2465 oaz.ZooKeeper.close Session: 0x139dd91fea30000 closed
[junit4:junit4]   2> 123 T2467 oazs.NIOServerCnxn.closeSock Closed socket connection for client /140.211.11.196:16381 which had sessionid 0x139dd91fea30000
[junit4:junit4]   2> 123 T2465 oaz.ZooKeeper.<init> Initiating client connection, connectString=127.0.0.1:16380/solr sessionTimeout=10000 watcher=org.apache.solr.common.cloud.ConnectionManager@7320e734
[junit4:junit4]   2> 123 T2473 oaz.ClientCnxn$SendThread.startConnect Opening socket connection to server /127.0.0.1:16380
[junit4:junit4]   2> 123 T2465 oascc.ConnectionManager.waitForConnected Waiting for client to connect to ZooKeeper
[junit4:junit4]   2> 124 T2473 oaz.ClientCnxn$SendThread.primeConnection Socket connection established to localhost/127.0.0.1:16380, initiating session
[junit4:junit4]   2> 124 T2467 oazs.NIOServerCnxn$Factory.run Accepted socket connection from /140.211.11.196:16382
[junit4:junit4]   2> 124 T2467 oazs.NIOServerCnxn.readConnectRequest Client attempting to establish new session at /140.211.11.196:16382
[junit4:junit4]   2> 125 T2469 oazs.NIOServerCnxn.finishSessionInit Established session 0x139dd91fea30001 with negotiated timeout 10000 for client /140.211.11.196:16382
[junit4:junit4]   2> 125 T2473 oaz.ClientCnxn$SendThread.readConnectResult Session establishment complete on server localhost/127.0.0.1:16380, sessionid = 0x139dd91fea30001, negotiated timeout = 10000
[junit4:junit4]   2> 126 T2474 oascc.ConnectionManager.process Watcher org.apache.solr.common.cloud.ConnectionManager@7320e734 name:ZooKeeperConnection Watcher:127.0.0.1:16380/solr got event WatchedEvent state:SyncConnected type:None path:null path:null type:None
[junit4:junit4]   2> 126 T2465 oascc.ConnectionManager.waitForConnected Client is connected to ZooKeeper
[junit4:junit4]   2> 126 T2465 oascc.SolrZkClient.makePath makePath: /collections/collection1
[junit4:junit4]   2> 130 T2465 oascc.SolrZkClient.makePath makePath: /collections/collection1/shards
[junit4:junit4]   2> 138 T2465 oascc.SolrZkClient.makePath makePath: /collections/control_collection
[junit4:junit4]   2> 140 T2465 oascc.SolrZkClient.makePath makePath: /collections/control_collection/shards
[junit4:junit4]   2> 147 T2465 oasc.AbstractZkTestCase.putConfig put /usr/home/hudson/hudson-slave/workspace/Lucene-Solr-Tests-trunk-java7/solr/build/solr-core/test-files/solr/collection1/conf/solrconfig.xml to /configs/conf1/solrconfig.xml
[junit4:junit4]   2> 147 T2465 oascc.SolrZkClient.makePath makePath: /configs/conf1/solrconfig.xml
[junit4:junit4]   2> 158 T2465 oasc.AbstractZkTestCase.putConfig put /usr/home/hudson/hudson-slave/workspace/Lucene-Solr-Tests-trunk-java7/solr/build/solr-core/test-files/solr/collection1/conf/schema.xml to /configs/conf1/schema.xml
[junit4:junit4]   2> 159 T2465 oascc.SolrZkClient.makePath makePath: /configs/conf1/schema.xml
[junit4:junit4]   2> 267 T2465 oasc.AbstractZkTestCase.putConfig put /usr/home/hudson/hudson-slave/workspace/Lucene-Solr-Tests-trunk-java7/solr/build/solr-core/test-files/solr/collection1/conf/solrconfig.xml to /configs/conf1/solrconfig.xml
[junit4:junit4]   2> 268 T2465 oascc.SolrZkClient.makePath makePath: /configs/conf1/solrconfig.xml
[junit4:junit4]   2> 299 T2465 oasc.AbstractZkTestCase.putConfig put /usr/home/hudson/hudson-slave/workspace/Lucene-Solr-Tests-trunk-java7/solr/build/solr-core/test-files/solr/collection1/conf/stopwords.txt to /configs/conf1/stopwords.txt
[junit4:junit4]   2> 300 T2465 oascc.SolrZkClient.makePath makePath: /configs/conf1/stopwords.txt
[junit4:junit4]   2> 324 T2465 oasc.AbstractZkTestCase.putConfig put /usr/home/hudson/hudson-slave/workspace/Lucene-Solr-Tests-trunk-java7/solr/build/solr-core/test-files/solr/collection1/conf/protwords.txt to /configs/conf1/protwords.txt
[junit4:junit4]   2> 325 T2465 oascc.SolrZkClient.makePath makePath: /configs/conf1/protwords.txt
[junit4:junit4]   2> 328 T2465 oasc.AbstractZkTestCase.putConfig put /usr/home/hudson/hudson-slave/workspace/Lucene-Solr-Tests-trunk-java7/solr/build/solr-core/test-files/solr/collection1/conf/currency.xml to /configs/conf1/currency.xml
[junit4:junit4]   2> 328 T2465 oascc.SolrZkClient.makePath makePath: /configs/conf1/currency.xml
[junit4:junit4]   2> 336 T2465 oasc.AbstractZkTestCase.putConfig put /usr/home/hudson/hudson-slave/workspace/Lucene-Solr-Tests-trunk-java7/solr/build/solr-core/test-files/solr/collection1/conf/open-exchange-rates.json to /configs/conf1/open-exchange-rates.json
[junit4:junit4]   2> 336 T2465 oascc.SolrZkClient.makePath makePath: /configs/conf1/open-exchange-rates.json
[junit4:junit4]   2> 347 T2465 oasc.AbstractZkTestCase.putConfig put /usr/home/hudson/hudson-slave/workspace/Lucene-Solr-Tests-trunk-java7/solr/build/solr-core/test-files/solr/collection1/conf/mapping-ISOLatin1Accent.txt to /configs/conf1/mapping-ISOLatin1Accent.txt
[junit4:junit4]   2> 347 T2465 oascc.SolrZkClient.makePath makePath: /configs/conf1/mapping-ISOLatin1Accent.txt
[junit4:junit4]   2> 355 T2465 oasc.AbstractZkTestCase.putConfig put /usr/home/hudson/hudson-slave/workspace/Lucene-Solr-Tests-trunk-java7/solr/build/solr-core/test-files/solr/collection1/conf/old_synonyms.txt to /configs/conf1/old_synonyms.txt
[junit4:junit4]   2> 355 T2465 oascc.SolrZkClient.makePath makePath: /configs/conf1/old_synonyms.txt
[junit4:junit4]   2> 358 T2465 oasc.AbstractZkTestCase.putConfig put /usr/home/hudson/hudson-slave/workspace/Lucene-Solr-Tests-trunk-java7/solr/build/solr-core/test-files/solr/collection1/conf/synonyms.txt to /configs/conf1/synonyms.txt
[junit4:junit4]   2> 359 T2465 oascc.SolrZkClient.makePath makePath: /configs/conf1/synonyms.txt
[junit4:junit4]   2> 362 T2470 oazs.PrepRequestProcessor.pRequest Processed session termination for sessionid: 0x139dd91fea30001
[junit4:junit4]   2> 362 T2474 oaz.ClientCnxn$EventThread.run EventThread shut down
[junit4:junit4]   2> 363 T2467 oazs.NIOServerCnxn.closeSock Closed socket connection for client /140.211.11.196:16382 which had sessionid 0x139dd91fea30001
[junit4:junit4]   2> 362 T2465 oaz.ZooKeeper.close Session: 0x139dd91fea30001 closed
[junit4:junit4]   2> 364 T2465 oejs.Server.doStart jetty-8.1.2.v20120308
[junit4:junit4]   2> 368 T2465 oejs.AbstractConnector.doStart Started SocketConnector@0.0.0.0:16383
[junit4:junit4]   2> 369 T2465 oasc.SolrResourceLoader.locateSolrHome JNDI not configured for solr (NoInitialContextEx)
[junit4:junit4]   2> 369 T2465 oasc.SolrResourceLoader.locateSolrHome using system property solr.solr.home: /usr/home/hudson/hudson-slave/workspace/Lucene-Solr-Tests-trunk-java7/solr/build/solr-core/test-files/solr
[junit4:junit4]   2> 369 T2465 oasc.SolrResourceLoader.<init> new SolrResourceLoader for deduced Solr Home: '/usr/home/hudson/hudson-slave/workspace/Lucene-Solr-Tests-trunk-java7/solr/build/solr-core/test-files/solr/'
[junit4:junit4]   2> 403 T2465 oass.SolrDispatchFilter.init SolrDispatchFilter.init()
[junit4:junit4]   2> 403 T2465 oasc.SolrResourceLoader.locateSolrHome JNDI not configured for solr (NoInitialContextEx)
[junit4:junit4]   2> 404 T2465 oasc.SolrResourceLoader.locateSolrHome using system property solr.solr.home: /usr/home/hudson/hudson-slave/workspace/Lucene-Solr-Tests-trunk-java7/solr/build/solr-core/test-files/solr
[junit4:junit4]   2> 404 T2465 oasc.CoreContainer$Initializer.initialize looking for solr.xml: /usr/home/hudson/hudson-slave/workspace/Lucene-Solr-Tests-trunk-java7/solr/build/solr-core/test-files/solr/solr.xml
[junit4:junit4]   2> 404 T2465 oasc.CoreContainer.<init> New CoreContainer 948757904
[junit4:junit4]   2> 405 T2465 oasc.CoreContainer.load Loading CoreContainer using Solr Home: '/usr/home/hudson/hudson-slave/workspace/Lucene-Solr-Tests-trunk-java7/solr/build/solr-core/test-files/solr/'
[junit4:junit4]   2> 405 T2465 oasc.SolrResourceLoader.<init> new SolrResourceLoader for directory: '/usr/home/hudson/hudson-slave/workspace/Lucene-Solr-Tests-trunk-java7/solr/build/solr-core/test-files/solr/'
[junit4:junit4]   2> 446 T2465 oasc.CoreContainer.load Registering Log Listener
[junit4:junit4]   2> 458 T2465 oasc.CoreContainer.initZooKeeper Zookeeper client=127.0.0.1:16380/solr
[junit4:junit4]   2> 459 T2465 oaz.ZooKeeper.<init> Initiating client connection, connectString=127.0.0.1:16380/solr sessionTimeout=5000 watcher=org.apache.solr.common.cloud.ConnectionManager@16aa052d
[junit4:junit4]   2> 482 T2484 oaz.ClientCnxn$SendThread.startConnect Opening socket connection to server /127.0.0.1:16380
[junit4:junit4]   2> 482 T2465 oascc.ConnectionManager.waitForConnected Waiting for client to connect to ZooKeeper
[junit4:junit4]   2> 483 T2484 oaz.ClientCnxn$SendThread.primeConnection Socket connection established to localhost/127.0.0.1:16380, initiating session
[junit4:junit4]   2> 483 T2467 oazs.NIOServerCnxn$Factory.run Accepted socket connection from /140.211.11.196:16384
[junit4:junit4]   2> 484 T2467 oazs.NIOServerCnxn.readConnectRequest Client attempting to establish new session at /140.211.11.196:16384
[junit4:junit4]   2> 485 T2469 oazs.NIOServerCnxn.finishSessionInit Established session 0x139dd91fea30002 with negotiated timeout 5000 for client /140.211.11.196:16384
[junit4:junit4]   2> 485 T2484 oaz.ClientCnxn$SendThread.readConnectResult Session establishment complete on server localhost/127.0.0.1:16380, sessionid = 0x139dd91fea30002, negotiated timeout = 5000
[junit4:junit4]   2> 485 T2485 oascc.ConnectionManager.process Watcher org.apache.solr.common.cloud.ConnectionManager@16aa052d name:ZooKeeperConnection Watcher:127.0.0.1:16380/solr got event WatchedEvent state:SyncConnected type:None path:null path:null type:None
[junit4:junit4]   2> 485 T2465 oascc.ConnectionManager.waitForConnected Client is connected to ZooKeeper
[junit4:junit4]   2> 494 T2470 oazs.PrepRequestProcessor.pRequest Got user-level KeeperException when processing sessionid:0x139dd91fea30002 type:create cxid:0x2 zxid:0xfffffffffffffffe txntype:unknown reqpath:n/a Error Path:/solr/overseer Error:KeeperErrorCode = NodeExists for /solr/overseer
[junit4:junit4]   2> 495 T2465 oascc.SolrZkClient.makePath makePath: /live_nodes
[junit4:junit4]   2> 505 T2465 oasc.ZkController.createEphemeralLiveNode Register node as live in ZooKeeper:/live_nodes/127.0.0.1:16383_solr
[junit4:junit4]   2> 506 T2470 oazs.PrepRequestProcessor.pRequest Got user-level KeeperException when processing sessionid:0x139dd91fea30002 type:delete cxid:0x7 zxid:0xfffffffffffffffe txntype:unknown reqpath:n/a Error Path:/solr/live_nodes/127.0.0.1:16383_solr Error:KeeperErrorCode = NoNode for /solr/live_nodes/127.0.0.1:16383_solr
[junit4:junit4]   2> 507 T2465 oascc.SolrZkClient.makePath makePath: /live_nodes/127.0.0.1:16383_solr
[junit4:junit4]   2> 510 T2465 oashc.HttpShardHandlerFactory.getParameter Setting socketTimeout to: 0
[junit4:junit4]   2> 510 T2465 oashc.HttpShardHandlerFactory.getParameter Setting urlScheme to: http://
[junit4:junit4]   2> 511 T2465 oashc.HttpShardHandlerFactory.getParameter Setting connTimeout to: 0
[junit4:junit4]   2> 511 T2465 oashc.HttpShardHandlerFactory.getParameter Setting maxConnectionsPerHost to: 20
[junit4:junit4]   2> 511 T2465 oashc.HttpShardHandlerFactory.getParameter Setting corePoolSize to: 0
[junit4:junit4]   2> 512 T2465 oashc.HttpShardHandlerFactory.getParameter Setting maximumPoolSize to: 2147483647
[junit4:junit4]   2> 512 T2465 oashc.HttpShardHandlerFactory.getParameter Setting maxThreadIdleTime to: 5
[junit4:junit4]   2> 512 T2465 oashc.HttpShardHandlerFactory.getParameter Setting sizeOfQueue to: -1
[junit4:junit4]   2> 513 T2465 oashc.HttpShardHandlerFactory.getParameter Setting fairnessPolicy to: false
[junit4:junit4]   2> 513 T2465 oascsi.HttpClientUtil.createClient Creating new http client, config:maxConnectionsPerHost=20&maxConnections=10000&socketTimeout=0&connTimeout=0&retry=false
[junit4:junit4]   2> 525 T2465 oascc.SolrZkClient.makePath makePath: /overseer_elect/election
[junit4:junit4]   2> 530 T2470 oazs.PrepRequestProcessor.pRequest Got user-level KeeperException when processing sessionid:0x139dd91fea30002 type:delete cxid:0x15 zxid:0xfffffffffffffffe txntype:unknown reqpath:n/a Error Path:/solr/overseer_elect/leader Error:KeeperErrorCode = NoNode for /solr/overseer_elect/leader
[junit4:junit4]   2> 531 T2465 oascc.SolrZkClient.makePath makePath: /overseer_elect/leader
[junit4:junit4]   2> 541 T2465 oasc.Overseer.start Overseer (id=88345286822526978-127.0.0.1:16383_solr-n_0000000000) starting
[junit4:junit4]   2> 543 T2470 oazs.PrepRequestProcessor.pRequest Got user-level KeeperException when processing sessionid:0x139dd91fea30002 type:create cxid:0x1a zxid:0xfffffffffffffffe txntype:unknown reqpath:n/a Error Path:/solr/overseer Error:KeeperErrorCode = NodeExists for /solr/overseer
[junit4:junit4]   2> 544 T2470 oazs.PrepRequestProcessor.pRequest Got user-level KeeperException when processing sessionid:0x139dd91fea30002 type:create cxid:0x1b zxid:0xfffffffffffffffe txntype:unknown reqpath:n/a Error Path:/solr/overseer Error:KeeperErrorCode = NodeExists for /solr/overseer
[junit4:junit4]   2> 545 T2470 oazs.PrepRequestProcessor.pRequest Got user-level KeeperException when processing sessionid:0x139dd91fea30002 type:create cxid:0x1c zxid:0xfffffffffffffffe txntype:unknown reqpath:n/a Error Path:/solr/overseer Error:KeeperErrorCode = NodeExists for /solr/overseer
[junit4:junit4]   2> 557 T2470 oazs.PrepRequestProcessor.pRequest Got user-level KeeperException when processing sessionid:0x139dd91fea30002 type:create cxid:0x1d zxid:0xfffffffffffffffe txntype:unknown reqpath:n/a Error Path:/solr/overseer Error:KeeperErrorCode = NodeExists for /solr/overseer
[junit4:junit4]   2> 568 T2487 oasc.OverseerCollectionProcessor.run Process current queue of collection creations
[junit4:junit4]   2> 568 T2465 oascc.SolrZkClient.makePath makePath: /clusterstate.json
[junit4:junit4]   2> 571 T2465 oascc.ZkStateReader.createClusterStateWatchersAndUpdate Updating cluster state from ZooKeeper... 
[junit4:junit4]   2> 572 T2486 oasc.Overseer$ClusterStateUpdater.run Starting to work on the main queue
[junit4:junit4]   2> 576 T2465 oasc.CoreContainer.create Creating SolrCore 'collection1' using instanceDir: /usr/home/hudson/hudson-slave/workspace/Lucene-Solr-Tests-trunk-java7/solr/build/solr-core/test-files/solr/collection1
[junit4:junit4]   2> 577 T2465 oasc.ZkController.createCollectionZkNode Check for collection zkNode:control_collection
[junit4:junit4]   2> 577 T2465 oasc.ZkController.createCollectionZkNode Collection zkNode exists
[junit4:junit4]   2> 578 T2465 oasc.ZkController.readConfigName Load collection config from:/collections/control_collection
[junit4:junit4]   2> 579 T2465 oasc.SolrResourceLoader.<init> new SolrResourceLoader for directory: '/usr/home/hudson/hudson-slave/workspace/Lucene-Solr-Tests-trunk-java7/solr/build/solr-core/test-files/solr/collection1/'
[junit4:junit4]   2> 590 T2465 oasc.SolrResourceLoader.replaceClassLoader Adding 'file:/usr/home/hudson/hudson-slave/workspace/Lucene-Solr-Tests-trunk-java7/solr/build/solr-core/test-files/solr/collection1/lib/classes/' to classloader
[junit4:junit4]   2> 591 T2465 oasc.SolrResourceLoader.replaceClassLoader Adding 'file:/usr/home/hudson/hudson-slave/workspace/Lucene-Solr-Tests-trunk-java7/solr/build/solr-core/test-files/solr/collection1/lib/README' to classloader
[junit4:junit4]   2> 634 T2465 oasc.SolrConfig.<init> Using Lucene MatchVersion: LUCENE_50
[junit4:junit4]   2> 698 T2465 oasc.SolrConfig.<init> Loaded SolrConfig: solrconfig.xml
[junit4:junit4]   2> 799 T2465 oass.IndexSchema.readSchema Reading Solr Schema
[junit4:junit4]   2> 806 T2465 oass.IndexSchema.readSchema Schema name=test
[junit4:junit4]   2> 1468 T2465 oass.OpenExchangeRatesOrgProvider.init Initialized with rates=open-exchange-rates.json, refreshInterval=1440.
[junit4:junit4]   2> 1482 T2465 oass.IndexSchema.readSchema default search field in schema is text
[junit4:junit4]   2> 1487 T2465 oass.IndexSchema.readSchema unique key field: id
[junit4:junit4]   2> 1499 T2465 oass.FileExchangeRateProvider.reload Reloading exchange rates from file currency.xml
[junit4:junit4]   2> 1505 T2465 oass.FileExchangeRateProvider.reload Reloading exchange rates from file currency.xml
[junit4:junit4]   2> 1510 T2465 oass.OpenExchangeRatesOrgProvider.reload Reloading exchange rates from open-exchange-rates.json
[junit4:junit4]   2> 1511 T2465 oass.OpenExchangeRatesOrgProvider.reload Reloading exchange rates from open-exchange-rates.json
[junit4:junit4]   2> 1513 T2465 oasc.SolrCore.<init> [collection1] Opening new SolrCore at /usr/home/hudson/hudson-slave/workspace/Lucene-Solr-Tests-trunk-java7/solr/build/solr-core/test-files/solr/collection1/, dataDir=./org.apache.solr.cloud.SyncSliceTest-1348042096286/control/data/
[junit4:junit4]   2> 1513 T2465 oasc.JmxMonitoredMap.<init> JMX monitoring is enabled. Adding Solr mbeans to JMX Server: com.sun.jmx.mbeanserver.JmxMBeanServer@25930632
[junit4:junit4]   2> 1515 T2465 oasc.SolrCore.getNewIndexDir WARNING New index directory detected: old=null new=./org.apache.solr.cloud.SyncSliceTest-1348042096286/control/data/index/
[junit4:junit4]   2> 1517 T2465 oasc.SolrCore.initIndex WARNING [collection1] Solr index directory './org.apache.solr.cloud.SyncSliceTest-1348042096286/control/data/index' doesn't exist. Creating new index...
[junit4:junit4]   2> 1518 T2465 oasc.CachingDirectoryFactory.get return new directory for /usr/home/hudson/hudson-slave/workspace/Lucene-Solr-Tests-trunk-java7/solr/build/solr-core/test/J1/./org.apache.solr.cloud.SyncSliceTest-1348042096286/control/data/index forceNew:false
[junit4:junit4]   2> 1534 T2465 oasc.SolrDeletionPolicy.onCommit SolrDeletionPolicy.onCommit: commits:num=1
[junit4:junit4]   2> 		commit{dir=NRTCachingDirectory(org.apache.lucene.store.NIOFSDirectory@/usr/home/hudson/hudson-slave/workspace/Lucene-Solr-Tests-trunk-java7/solr/build/solr-core/test/J1/org.apache.solr.cloud.SyncSliceTest-1348042096286/control/data/index lockFactory=org.apache.lucene.store.NativeFSLockFactory@20e37c93; maxCacheMB=48.0 maxMergeSizeMB=4.0),segFN=segments_1,generation=1,filenames=[segments_1]
[junit4:junit4]   2> 1534 T2465 oasc.SolrDeletionPolicy.updateCommits newest commit = 1
[junit4:junit4]   2> 1536 T2465 oasc.SolrCore.initWriters created xml: solr.XMLResponseWriter
[junit4:junit4]   2> 1539 T2465 oasup.UpdateRequestProcessorChain.init inserting DistributedUpdateProcessorFactory into updateRequestProcessorChain "dedupe"
[junit4:junit4]   2> 1539 T2465 oasup.UpdateRequestProcessorChain.init inserting DistributedUpdateProcessorFactory into updateRequestProcessorChain "dedupe-allfields"
[junit4:junit4]   2> 1540 T2465 oasup.UpdateRequestProcessorChain.init inserting DistributedUpdateProcessorFactory into updateRequestProcessorChain "stored_sig"
[junit4:junit4]   2> 1541 T2465 oasup.UpdateRequestProcessorChain.init inserting DistributedUpdateProcessorFactory into updateRequestProcessorChain "uniq-fields"
[junit4:junit4]   2> 1542 T2465 oasup.UpdateRequestProcessorChain.init inserting DistributedUpdateProcessorFactory into updateRequestProcessorChain "distrib-dup-test-chain-implicit"
[junit4:junit4]   2> 1542 T2465 oasc.RequestHandlers.initHandlersFromConfig adding lazy requestHandler: solr.ReplicationHandler
[junit4:junit4]   2> 1543 T2465 oasc.RequestHandlers.initHandlersFromConfig created /replication: solr.ReplicationHandler
[junit4:junit4]   2> 1543 T2465 oasc.RequestHandlers.initHandlersFromConfig created standard: solr.StandardRequestHandler
[junit4:junit4]   2> 1544 T2465 oasc.RequestHandlers.initHandlersFromConfig created /get: solr.RealTimeGetHandler
[junit4:junit4]   2> 1545 T2465 oasc.RequestHandlers.initHandlersFromConfig created dismax: solr.SearchHandler
[junit4:junit4]   2> 1546 T2465 oasc.RequestHandlers.initHandlersFromConfig created mock: org.apache.solr.core.MockQuerySenderListenerReqHandler
[junit4:junit4]   2> 1546 T2465 oasc.RequestHandlers.initHandlersFromConfig created /admin/: org.apache.solr.handler.admin.AdminHandlers
[junit4:junit4]   2> 1547 T2465 oasc.RequestHandlers.initHandlersFromConfig created defaults: solr.StandardRequestHandler
[junit4:junit4]   2> 1547 T2465 oasc.RequestHandlers.initHandlersFromConfig adding lazy requestHandler: solr.StandardRequestHandler
[junit4:junit4]   2> 1548 T2465 oasc.RequestHandlers.initHandlersFromConfig created lazy: solr.StandardRequestHandler
[junit4:junit4]   2> 1549 T2465 oasc.RequestHandlers.initHandlersFromConfig created /update: solr.UpdateRequestHandler
[junit4:junit4]   2> 1549 T2465 oasc.RequestHandlers.initHandlersFromConfig created /terms: org.apache.solr.handler.component.SearchHandler
[junit4:junit4]   2> 1550 T2465 oasc.RequestHandlers.initHandlersFromConfig created spellCheckCompRH: org.apache.solr.handler.component.SearchHandler
[junit4:junit4]   2> 1551 T2465 oasc.RequestHandlers.initHandlersFromConfig created spellCheckCompRH_Direct: org.apache.solr.handler.component.SearchHandler
[junit4:junit4]   2> 1551 T2465 oasc.RequestHandlers.initHandlersFromConfig created spellCheckWithWordbreak: org.apache.solr.handler.component.SearchHandler
[junit4:junit4]   2> 1552 T2465 oasc.RequestHandlers.initHandlersFromConfig created spellCheckWithWordbreak_Direct: org.apache.solr.handler.component.SearchHandler
[junit4:junit4]   2> 1553 T2465 oasc.RequestHandlers.initHandlersFromConfig created spellCheckCompRH1: org.apache.solr.handler.component.SearchHandler
[junit4:junit4]   2> 1553 T2465 oasc.RequestHandlers.initHandlersFromConfig created tvrh: org.apache.solr.handler.component.SearchHandler
[junit4:junit4]   2> 1554 T2465 oasc.RequestHandlers.initHandlersFromConfig created /mlt: solr.MoreLikeThisHandler
[junit4:junit4]   2> 1555 T2465 oasc.RequestHandlers.initHandlersFromConfig created /debug/dump: solr.DumpRequestHandler
[junit4:junit4]   2> 1559 T2465 oashl.XMLLoader.init xsltCacheLifetimeSeconds=60
[junit4:junit4]   2> 1564 T2465 oasc.SolrCore.initDeprecatedSupport WARNING solrconfig.xml uses deprecated <admin/gettableFiles>, Please update your config to use the ShowFileRequestHandler.
[junit4:junit4]   2> 1565 T2465 oasc.SolrCore.initDeprecatedSupport WARNING adding ShowFileRequestHandler with hidden files: [SCHEMA.XML, OLD_SYNONYMS.TXT, STOPWORDS.TXT, PROTWORDS.TXT, OPEN-EXCHANGE-RATES.JSON, SYNONYMS.TXT, CURRENCY.XML, MAPPING-ISOLATIN1ACCENT.TXT]
[junit4:junit4]   2> 1570 T2465 oass.SolrIndexSearcher.<init> Opening Searcher@212342f3 main
[junit4:junit4]   2> 1572 T2465 oasu.CommitTracker.<init> Hard AutoCommit: disabled
[junit4:junit4]   2> 1573 T2465 oasu.CommitTracker.<init> Soft AutoCommit: disabled
[junit4:junit4]   2> 1574 T2465 oashc.SpellCheckComponent.inform Initializing spell checkers
[junit4:junit4]   2> 1620 T2465 oass.DirectSolrSpellChecker.init init: {name=direct,classname=DirectSolrSpellChecker,field=lowerfilt,minQueryLength=3}
[junit4:junit4]   2> 1734 T2488 oasc.SolrCore.registerSearcher [collection1] Registered new searcher Searcher@212342f3 main{StandardDirectoryReader(segments_1:1)}
[junit4:junit4]   2> 1739 T2470 oazs.PrepRequestProcessor.pRequest Got user-level KeeperException when processing sessionid:0x139dd91fea30002 type:create cxid:0x56 zxid:0xfffffffffffffffe txntype:unknown reqpath:n/a Error Path:/solr/overseer/queue Error:KeeperErrorCode = NoNode for /solr/overseer/queue
[junit4:junit4]   2> 1750 T2465 oasc.CoreContainer.register registering core: collection1
[junit4:junit4]   2> 1751 T2465 oasc.ZkController.register Register shard - core:collection1 address:http://127.0.0.1:16383/solr shardId:control_shard
[junit4:junit4]   2> 1752 T2465 oascc.SolrZkClient.makePath makePath: /collections/control_collection/leader_elect/control_shard/election
[junit4:junit4]   2> 1765 T2470 oazs.PrepRequestProcessor.pRequest Got user-level KeeperException when processing sessionid:0x139dd91fea30002 type:delete cxid:0x65 zxid:0xfffffffffffffffe txntype:unknown reqpath:n/a Error Path:/solr/collections/control_collection/leaders Error:KeeperErrorCode = NoNode for /solr/collections/control_collection/leaders
[junit4:junit4]   2> 1766 T2465 oasc.ShardLeaderElectionContext.runLeaderProcess Running the leader process.
[junit4:junit4]   2> 1767 T2470 oazs.PrepRequestProcessor.pRequest Got user-level KeeperException when processing sessionid:0x139dd91fea30002 type:create cxid:0x66 zxid:0xfffffffffffffffe txntype:unknown reqpath:n/a Error Path:/solr/overseer Error:KeeperErrorCode = NodeExists for /solr/overseer
[junit4:junit4]   2> 2082 T2486 oascc.ZkStateReader.updateClusterState Updating cloud state from ZooKeeper... 
[junit4:junit4]   2> 2083 T2470 oazs.PrepRequestProcessor.pRequest Got user-level KeeperException when processing sessionid:0x139dd91fea30002 type:create cxid:0x6d zxid:0xfffffffffffffffe txntype:unknown reqpath:n/a Error Path:/solr/overseer/queue-work Error:KeeperErrorCode = NoNode for /solr/overseer/queue-work
[junit4:junit4]   2> 2108 T2485 oascc.ZkStateReader$2.process A cluster state change has occurred - updating...
[junit4:junit4]   2> 2270 T2465 oasc.ShardLeaderElectionContext.waitForReplicasToComeUp Enough replicas found to continue.
[junit4:junit4]   2> 2271 T2465 oasc.ShardLeaderElectionContext.runLeaderProcess I may be the new leader - try and sync
[junit4:junit4]   2> 2272 T2465 oasc.SyncStrategy.sync Sync replicas to http://127.0.0.1:16383/solr/collection1/
[junit4:junit4]   2> 2272 T2465 oasc.SyncStrategy.syncReplicas Sync Success - now sync replicas to me
[junit4:junit4]   2> 2273 T2465 oasc.SyncStrategy.syncToMe http://127.0.0.1:16383/solr/collection1/ has no replicas
[junit4:junit4]   2> 2273 T2465 oasc.ShardLeaderElectionContext.runLeaderProcess I am the new leader: http://127.0.0.1:16383/solr/collection1/
[junit4:junit4]   2> 2274 T2465 oascc.SolrZkClient.makePath makePath: /collections/control_collection/leaders/control_shard
[junit4:junit4]   2> 2313 T2470 oazs.PrepRequestProcessor.pRequest Got user-level KeeperException when processing sessionid:0x139dd91fea30002 type:create cxid:0x8b zxid:0xfffffffffffffffe txntype:unknown reqpath:n/a Error Path:/solr/overseer Error:KeeperErrorCode = NodeExists for /solr/overseer
[junit4:junit4]   2> 2612 T2486 oascc.ZkStateReader.updateClusterState Updating cloud state from ZooKeeper... 
[junit4:junit4]   2> 2627 T2485 oascc.ZkStateReader$2.process A cluster state change has occurred - updating...
[junit4:junit4]   2> 2659 T2465 oasc.ZkController.register We are http://127.0.0.1:16383/solr/collection1/ and leader is http://127.0.0.1:16383/solr/collection1/
[junit4:junit4]   2> 2660 T2465 oasc.ZkController.register No LogReplay needed for core=collection1 baseURL=http://127.0.0.1:16383/solr
[junit4:junit4]   2> 2660 T2465 oasc.ZkController.checkRecovery I am the leader, no recovery necessary
[junit4:junit4]   2> 2662 T2465 oascc.ZkStateReader.updateClusterState Updating cloud state from ZooKeeper... 
[junit4:junit4]   2> 2663 T2465 oass.SolrDispatchFilter.init user.dir=/usr/home/hudson/hudson-slave/workspace/Lucene-Solr-Tests-trunk-java7/solr/build/solr-core/test/J1
[junit4:junit4]   2> 2664 T2465 oass.SolrDispatchFilter.init SolrDispatchFilter.init() done
[junit4:junit4]   2> 2664 T2465 oascsi.HttpClientUtil.createClient Creating new http client, config:maxConnections=128&maxConnectionsPerHost=32&followRedirects=false
[junit4:junit4]   2> 3131 T2486 oascc.ZkStateReader.updateClusterState Updating cloud state from ZooKeeper... 
[junit4:junit4]   2> 3167 T2485 oascc.ZkStateReader$2.process A cluster state change has occurred - updating...
[junit4:junit4]   2> 3348 T2465 oejs.Server.doStart jetty-8.1.2.v20120308
[junit4:junit4]   2> 3352 T2465 oejs.AbstractConnector.doStart Started SocketConnector@0.0.0.0:16397
[junit4:junit4]   2> 3352 T2465 oasc.SolrResourceLoader.locateSolrHome JNDI not configured for solr (NoInitialContextEx)
[junit4:junit4]   2> 3353 T2465 oasc.SolrResourceLoader.locateSolrHome using system property solr.solr.home: /usr/home/hudson/hudson-slave/workspace/Lucene-Solr-Tests-trunk-java7/solr/build/solr-core/test/J1/./solrtest-jetty1-1348042098960
[junit4:junit4]   2> 3353 T2465 oasc.SolrResourceLoader.<init> new SolrResourceLoader for deduced Solr Home: '/usr/home/hudson/hudson-slave/workspace/Lucene-Solr-Tests-trunk-java7/solr/build/solr-core/test/J1/./solrtest-jetty1-1348042098960/'
[junit4:junit4]   2> 3395 T2465 oass.SolrDispatchFilter.init SolrDispatchFilter.init()
[junit4:junit4]   2> 3396 T2465 oasc.SolrResourceLoader.locateSolrHome JNDI not configured for solr (NoInitialContextEx)
[junit4:junit4]   2> 3396 T2465 oasc.SolrResourceLoader.locateSolrHome using system property solr.solr.home: /usr/home/hudson/hudson-slave/workspace/Lucene-Solr-Tests-trunk-java7/solr/build/solr-core/test/J1/./solrtest-jetty1-1348042098960
[junit4:junit4]   2> 3397 T2465 oasc.CoreContainer$Initializer.initialize looking for solr.xml: /usr/home/hudson/hudson-slave/workspace/Lucene-Solr-Tests-trunk-java7/solr/build/solr-core/test/J1/./solrtest-jetty1-1348042098960/solr.xml
[junit4:junit4]   2> 3397 T2465 oasc.CoreContainer.<init> New CoreContainer 1832427098
[junit4:junit4]   2> 3398 T2465 oasc.CoreContainer.load Loading CoreContainer using Solr Home: '/usr/home/hudson/hudson-slave/workspace/Lucene-Solr-Tests-trunk-java7/solr/build/solr-core/test/J1/./solrtest-jetty1-1348042098960/'
[junit4:junit4]   2> 3398 T2465 oasc.SolrResourceLoader.<init> new SolrResourceLoader for directory: '/usr/home/hudson/hudson-slave/workspace/Lucene-Solr-Tests-trunk-java7/solr/build/solr-core/test/J1/./solrtest-jetty1-1348042098960/'
[junit4:junit4]   2> 3432 T2465 oasc.CoreContainer.load Registering Log Listener
[junit4:junit4]   2> 3448 T2465 oasc.CoreContainer.initZooKeeper Zookeeper client=127.0.0.1:16380/solr
[junit4:junit4]   2> 3449 T2465 oaz.ZooKeeper.<init> Initiating client connection, connectString=127.0.0.1:16380/solr sessionTimeout=5000 watcher=org.apache.solr.common.cloud.ConnectionManager@aa5ffb2
[junit4:junit4]   2> 3450 T2498 oaz.ClientCnxn$SendThread.startConnect Opening socket connection to server /127.0.0.1:16380
[junit4:junit4]   2> 3450 T2465 oascc.ConnectionManager.waitForConnected Waiting for client to connect to ZooKeeper
[junit4:junit4]   2> 3451 T2498 oaz.ClientCnxn$SendThread.primeConnection Socket connection established to localhost/127.0.0.1:16380, initiating session
[junit4:junit4]   2> 3451 T2467 oazs.NIOServerCnxn$Factory.run Accepted socket connection from /140.211.11.196:16398
[junit4:junit4]   2> 3452 T2467 oazs.NIOServerCnxn.readConnectRequest Client attempting to establish new session at /140.211.11.196:16398
[junit4:junit4]   2> 3453 T2469 oazs.NIOServerCnxn.finishSessionInit Established session 0x139dd91fea30003 with negotiated timeout 5000 for client /140.211.11.196:16398
[junit4:junit4]   2> 3453 T2498 oaz.ClientCnxn$SendThread.readConnectResult Session establishment complete on server localhost/127.0.0.1:16380, sessionid = 0x139dd91fea30003, negotiated timeout = 5000
[junit4:junit4]   2> 3454 T2499 oascc.ConnectionManager.process Watcher org.apache.solr.common.cloud.ConnectionManager@aa5ffb2 name:ZooKeeperConnection Watcher:127.0.0.1:16380/solr got event WatchedEvent state:SyncConnected type:None path:null path:null type:None
[junit4:junit4]   2> 3454 T2465 oascc.ConnectionManager.waitForConnected Client is connected to ZooKeeper
[junit4:junit4]   2> 3455 T2470 oazs.PrepRequestProcessor.pRequest Got user-level KeeperException when processing sessionid:0x139dd91fea30003 type:create cxid:0x1 zxid:0xfffffffffffffffe txntype:unknown reqpath:n/a Error Path:/solr/overseer Error:KeeperErrorCode = NodeExists for /solr/overseer
[junit4:junit4]   2> 3456 T2470 oazs.PrepRequestProcessor.pRequest Got user-level KeeperException when processing sessionid:0x139dd91fea30003 type:create cxid:0x2 zxid:0xfffffffffffffffe txntype:unknown reqpath:n/a Error Path:/solr/overseer Error:KeeperErrorCode = NodeExists for /solr/overseer
[junit4:junit4]   2> 3466 T2465 oasc.ZkController.createEphemeralLiveNode Register node as live in ZooKeeper:/live_nodes/127.0.0.1:16397_solr
[junit4:junit4]   2> 3467 T2470 oazs.PrepRequestProcessor.pRequest Got user-level KeeperException when processing sessionid:0x139dd91fea30003 type:delete cxid:0x4 zxid:0xfffffffffffffffe txntype:unknown reqpath:n/a Error Path:/solr/live_nodes/127.0.0.1:16397_solr Error:KeeperErrorCode = NoNode for /solr/live_nodes/127.0.0.1:16397_solr
[junit4:junit4]   2> 3468 T2465 oascc.SolrZkClient.makePath makePath: /live_nodes/127.0.0.1:16397_solr
[junit4:junit4]   2> 3470 T2485 oascc.ZkStateReader$3.process Updating live nodes
[junit4:junit4]   2> 3470 T2465 oashc.HttpShardHandlerFactory.getParameter Setting socketTimeout to: 0
[junit4:junit4]   2> 3471 T2465 oashc.HttpShardHandlerFactory.getParameter Setting urlScheme to: http://
[junit4:junit4]   2> 3471 T2465 oashc.HttpShardHandlerFactory.getParameter Setting connTimeout to: 0
[junit4:junit4]   2> 3472 T2465 oashc.HttpShardHandlerFactory.getParameter Setting maxConnectionsPerHost to: 20
[junit4:junit4]   2> 3472 T2465 oashc.HttpShardHandlerFactory.getParameter Setting corePoolSize to: 0
[junit4:junit4]   2> 3473 T2465 oashc.HttpShardHandlerFactory.getParameter Setting maximumPoolSize to: 2147483647
[junit4:junit4]   2> 3473 T2465 oashc.HttpShardHandlerFactory.getParameter Setting maxThreadIdleTime to: 5
[junit4:junit4]   2> 3474 T2465 oashc.HttpShardHandlerFactory.getParameter Setting sizeOfQueue to: -1
[junit4:junit4]   2> 3474 T2465 oashc.HttpShardHandlerFactory.getParameter Setting fairnessPolicy to: false
[junit4:junit4]   2> 3475 T2465 oascsi.HttpClientUtil.createClient Creating new http client, config:maxConnectionsPerHost=20&maxConnections=10000&socketTimeout=0&connTimeout=0&retry=false
[junit4:junit4]   2> 3492 T2465 oascc.ZkStateReader.createClusterStateWatchersAndUpdate Updating cluster state from ZooKeeper... 
[junit4:junit4]   2> 3499 T2465 oasc.CoreContainer.create Creating SolrCore 'collection1' using instanceDir: /usr/home/hudson/hudson-slave/workspace/Lucene-Solr-Tests-trunk-java7/solr/build/solr-core/test/J1/./solrtest-jetty1-1348042098960/collection1
[junit4:junit4]   2> 3499 T2465 oasc.ZkController.createCollectionZkNode Check for collection zkNode:collection1
[junit4:junit4]   2> 3500 T2465 oasc.ZkController.createCollectionZkNode Collection zkNode exists
[junit4:junit4]   2> 3500 T2465 oasc.ZkController.readConfigName Load collection config from:/collections/collection1
[junit4:junit4]   2> 3502 T2465 oasc.SolrResourceLoader.<init> new SolrResourceLoader for directory: '/usr/home/hudson/hudson-slave/workspace/Lucene-Solr-Tests-trunk-java7/solr/build/solr-core/test/J1/./solrtest-jetty1-1348042098960/collection1/'
[junit4:junit4]   2> 3503 T2465 oasc.SolrResourceLoader.replaceClassLoader Adding 'file:/usr/home/hudson/hudson-slave/workspace/Lucene-Solr-Tests-trunk-java7/solr/build/solr-core/test/J1/solrtest-jetty1-1348042098960/collection1/lib/classes/' to classloader
[junit4:junit4]   2> 3504 T2465 oasc.SolrResourceLoader.replaceClassLoader Adding 'file:/usr/home/hudson/hudson-slave/workspace/Lucene-Solr-Tests-trunk-java7/solr/build/solr-core/test/J1/solrtest-jetty1-1348042098960/collection1/lib/README' to classloader
[junit4:junit4]   2> 3568 T2465 oasc.SolrConfig.<init> Using Lucene MatchVersion: LUCENE_50
[junit4:junit4]   2> 3641 T2465 oasc.SolrConfig.<init> Loaded SolrConfig: solrconfig.xml
[junit4:junit4]   2> 3743 T2465 oass.IndexSchema.readSchema Reading Solr Schema
[junit4:junit4]   2> 3750 T2465 oass.IndexSchema.readSchema Schema name=test
[junit4:junit4]   2> 4448 T2465 oass.OpenExchangeRatesOrgProvider.init Initialized with rates=open-exchange-rates.json, refreshInterval=1440.
[junit4:junit4]   2> 4461 T2465 oass.IndexSchema.readSchema default search field in schema is text
[junit4:junit4]   2> 4465 T2465 oass.IndexSchema.readSchema unique key field: id
[junit4:junit4]   2> 4477 T2465 oass.FileExchangeRateProvider.reload Reloading exchange rates from file currency.xml
[junit4:junit4]   2> 4482 T2465 oass.FileExchangeRateProvider.reload Reloading exchange rates from file currency.xml
[junit4:junit4]   2> 4487 T2465 oass.OpenExchangeRatesOrgProvider.reload Reloading exchange rates from open-exchange-rates.json
[junit4:junit4]   2> 4488 T2465 oass.OpenExchangeRatesOrgProvider.reload Reloading exchange rates from open-exchange-rates.json
[junit4:junit4]   2> 4489 T2465 oasc.SolrCore.<init> [collection1] Opening new SolrCore at /usr/home/hudson/hudson-slave/workspace/Lucene-Solr-Tests-trunk-java7/solr/build/solr-core/test/J1/./solrtest-jetty1-1348042098960/collection1/, dataDir=./org.apache.solr.cloud.SyncSliceTest-1348042096286/jetty1/
[junit4:junit4]   2> 4490 T2465 oasc.JmxMonitoredMap.<init> JMX monitoring is enabled. Adding Solr mbeans to JMX Server: com.sun.jmx.mbeanserver.JmxMBeanServer@25930632
[junit4:junit4]   2> 4491 T2465 oasc.SolrCore.getNewIndexDir WARNING New index directory detected: old=null new=./org.apache.solr.cloud.SyncSliceTest-1348042096286/jetty1/index/
[junit4:junit4]   2> 4492 T2465 oasc.SolrCore.initIndex WARNING [collection1] Solr index directory './org.apache.solr.cloud.SyncSliceTest-1348042096286/jetty1/index' doesn't exist. Creating new index...
[junit4:junit4]   2> 4493 T2465 oasc.CachingDirectoryFactory.get return new directory for /usr/home/hudson/hudson-slave/workspace/Lucene-Solr-Tests-trunk-java7/solr/build/solr-core/test/J1/./org.apache.solr.cloud.SyncSliceTest-1348042096286/jetty1/index forceNew:false
[junit4:junit4]   2> 4500 T2465 oasc.SolrDeletionPolicy.onCommit SolrDeletionPolicy.onCommit: commits:num=1
[junit4:junit4]   2> 		commit{dir=NRTCachingDirectory(org.apache.lucene.store.NIOFSDirectory@/usr/home/hudson/hudson-slave/workspace/Lucene-Solr-Tests-trunk-java7/solr/build/solr-core/test/J1/org.apache.solr.cloud.SyncSliceTest-1348042096286/jetty1/index lockFactory=org.apache.lucene.store.NativeFSLockFactory@1dc1a940; maxCacheMB=48.0 maxMergeSizeMB=4.0),segFN=segments_1,generation=1,filenames=[segments_1]
[junit4:junit4]   2> 4501 T2465 oasc.SolrDeletionPolicy.updateCommits newest commit = 1
[junit4:junit4]   2> 4502 T2465 oasc.SolrCore.initWriters created xml: solr.XMLResponseWriter
[junit4:junit4]   2> 4504 T2465 oasup.UpdateRequestProcessorChain.init inserting DistributedUpdateProcessorFactory into updateRequestProcessorChain "dedupe"
[junit4:junit4]   2> 4505 T2465 oasup.UpdateRequestProcessorChain.init inserting DistributedUpdateProcessorFactory into updateRequestProcessorChain "dedupe-allfields"
[junit4:junit4]   2> 4506 T2465 oasup.UpdateRequestProcessorChain.init inserting DistributedUpdateProcessorFactory into updateRequestProcessorChain "stored_sig"
[junit4:junit4]   2> 4506 T2465 oasup.UpdateRequestProcessorChain.init inserting DistributedUpdateProcessorFactory into updateRequestProcessorChain "uniq-fields"
[junit4:junit4]   2> 4507 T2465 oasup.UpdateRequestProcessorChain.init inserting DistributedUpdateProcessorFactory into updateRequestProcessorChain "distrib-dup-test-chain-implicit"
[junit4:junit4]   2> 4508 T2465 oasc.RequestHandlers.initHandlersFromConfig adding lazy requestHandler: solr.ReplicationHandler
[junit4:junit4]   2> 4508 T2465 oasc.RequestHandlers.initHandlersFromConfig created /replication: solr.ReplicationHandler
[junit4:junit4]   2> 4509 T2465 oasc.RequestHandlers.initHandlersFromConfig created standard: solr.StandardRequestHandler
[junit4:junit4]   2> 4510 T2465 oasc.RequestHandlers.initHandlersFromConfig created /get: solr.RealTimeGetHandler
[junit4:junit4]   2> 4511 T2465 oasc.RequestHandlers.initHandlersFromConfig created dismax: solr.SearchHandler
[junit4:junit4]   2> 4512 T2465 oasc.RequestHandlers.initHandlersFromConfig created mock: org.apache.solr.core.MockQuerySenderListenerReqHandler
[junit4:junit4]   2> 4512 T2465 oasc.RequestHandlers.initHandlersFromConfig created /admin/: org.apache.solr.handler.admin.AdminHandlers
[junit4:junit4]   2> 4513 T2465 oasc.RequestHandlers.initHandlersFromConfig created defaults: solr.StandardRequestHandler
[junit4:junit4]   2> 4514 T2465 oasc.RequestHandlers.initHandlersFromConfig adding lazy requestHandler: solr.StandardRequestHandler
[junit4:junit4]   2> 4514 T2465 oasc.RequestHandlers.initHandlersFromConfig created lazy: solr.StandardRequestHandler
[junit4:junit4]   2> 4515 T2465 oasc.RequestHandlers.initHandlersFromConfig created /update: solr.UpdateRequestHandler
[junit4:junit4]   2> 4516 T2465 oasc.RequestHandlers.initHandlersFromConfig created /terms: org.apache.solr.handler.component.SearchHandler
[junit4:junit4]   2> 4517 T2465 oasc.RequestHandlers.initHandlersFromConfig created spellCheckCompRH: org.apache.solr.handler.component.SearchHandler
[junit4:junit4]   2> 4517 T2465 oasc.RequestHandlers.initHandlersFromConfig created spellCheckCompRH_Direct: org.apache.solr.handler.component.SearchHandler
[junit4:junit4]   2> 4518 T2465 oasc.RequestHandlers.initHandlersFromConfig created spellCheckWithWordbreak: org.apache.solr.handler.component.SearchHandler
[junit4:junit4]   2> 4519 T2465 oasc.RequestHandlers.initHandlersFromConfig created spellCheckWithWordbreak_Direct: org.apache.solr.handler.component.SearchHandler
[junit4:junit4]   2> 4520 T2465 oasc.RequestHandlers.initHandlersFromConfig created spellCheckCompRH1: org.apache.solr.handler.component.SearchHandler
[junit4:junit4]   2> 4520 T2465 oasc.RequestHandlers.initHandlersFromConfig created tvrh: org.apache.solr.handler.component.SearchHandler
[junit4:junit4]   2> 4521 T2465 oasc.RequestHandlers.initHandlersFromConfig created /mlt: solr.MoreLikeThisHandler
[junit4:junit4]   2> 4522 T2465 oasc.RequestHandlers.initHandlersFromConfig created /debug/dump: solr.DumpRequestHandler
[junit4:junit4]   2> 4526 T2465 oashl.XMLLoader.init xsltCacheLifetimeSeconds=60
[junit4:junit4]   2> 4531 T2465 oasc.SolrCore.initDeprecatedSupport WARNING solrconfig.xml uses deprecated <admin/gettableFiles>, Please update your config to use the ShowFileRequestHandler.
[junit4:junit4]   2> 4532 T2465 oasc.SolrCore.initDeprecatedSupport WARNING adding ShowFileRequestHandler with hidden files: [SCHEMA.XML, OLD_SYNONYMS.TXT, STOPWORDS.TXT, PROTWORDS.TXT, OPEN-EXCHANGE-RATES.JSON, SYNONYMS.TXT, CURRENCY.XML, MAPPING-ISOLATIN1ACCENT.TXT]
[junit4:junit4]   2> 4537 T2465 oass.SolrIndexSearcher.<init> Opening Searcher@51f47141 main
[junit4:junit4]   2> 4538 T2465 oasu.CommitTracker.<init> Hard AutoCommit: disabled
[junit4:junit4]   2> 4539 T2465 oasu.CommitTracker.<init> Soft AutoCommit: disabled
[junit4:junit4]   2> 4539 T2465 oashc.SpellCheckComponent.inform Initializing spell checkers
[junit4:junit4]   2> 4548 T2465 oass.DirectSolrSpellChecker.init init: {name=direct,classname=DirectSolrSpellChecker,field=lowerfilt,minQueryLength=3}
[junit4:junit4]   2> 4600 T2500 oasc.SolrCore.registerSearcher [collection1] Registered new searcher Searcher@51f47141 main{StandardDirectoryReader(segments_1:1)}
[junit4:junit4]   2> 4684 T2486 oascc.ZkStateReader.updateClusterState Updating cloud state from ZooKeeper... 
[junit4:junit4]   2> 4698 T2499 oascc.ZkStateReader$2.process A cluster state change has occurred - updating...
[junit4:junit4]   2> 4698 T2485 oascc.ZkStateReader$2.process A cluster state change has occurred - updating...
[junit4:junit4]   2> 5119 T2465 oasc.CoreContainer.register registering core: collection1
[junit4:junit4]   2> 5120 T2465 oasc.ZkController.register Register shard - core:collection1 address:http://127.0.0.1:16397/solr shardId:shard1
[junit4:junit4]   2> 5121 T2465 oascc.SolrZkClient.makePath makePath: /collections/collection1/leader_elect/shard1/election
[junit4:junit4]   2> 5182 T2470 oazs.PrepRequestProcessor.pRequest Got user-level KeeperException when processing sessionid:0x139dd91fea30003 type:delete cxid:0x42 zxid:0xfffffffffffffffe txntype:unknown reqpath:n/a Error Path:/solr/collections/collection1/leaders Error:KeeperErrorCode = NoNode for /solr/collections/collection1/leaders
[junit4:junit4]   2> 5183 T2465 oasc.ShardLeaderElectionContext.runLeaderProcess Running the leader process.
[junit4:junit4]   2> 5184 T2470 oazs.PrepRequestProcessor.pRequest Got user-level KeeperException when processing sessionid:0x139dd91fea30003 type:create cxid:0x43 zxid:0xfffffffffffffffe txntype:unknown reqpath:n/a Error Path:/solr/overseer Error:KeeperErrorCode = NodeExists for /solr/overseer
[junit4:junit4]   2> 5186 T2465 oasc.ShardLeaderElectionContext.waitForReplicasToComeUp Enough replicas found to continue.
[junit4:junit4]   2> 5186 T2465 oasc.ShardLeaderElectionContext.runLeaderProcess I may be the new leader - try and sync
[junit4:junit4]   2> 5187 T2465 oasc.SyncStrategy.sync Sync replicas to http://127.0.0.1:16397/solr/collection1/
[junit4:junit4]   2> 5187 T2465 oasc.SyncStrategy.syncReplicas Sync Success - now sync replicas to me
[junit4:junit4]   2> 5188 T2465 oasc.SyncStrategy.syncToMe http://127.0.0.1:16397/solr/collection1/ has no replicas
[junit4:junit4]   2> 5188 T2465 oasc.ShardLeaderElectionContext.runLeaderProcess I am the new leader: http://127.0.0.1:16397/solr/collection1/
[junit4:junit4]   2> 5189 T2465 oascc.SolrZkClient.makePath makePath: /collections/collection1/leaders/shard1
[junit4:junit4]   2> 5193 T2470 oazs.PrepRequestProcessor.pRequest Got user-level KeeperException when processing sessionid:0x139dd91fea30003 type:create cxid:0x4d zxid:0xfffffffffffffffe txntype:unknown reqpath:n/a Error Path:/solr/overseer Error:KeeperErrorCode = NodeExists for /solr/overseer
[junit4:junit4]   2> 5202 T2486 oascc.ZkStateReader.updateClusterState Updating cloud state from ZooKeeper... 
[junit4:junit4]   2> 5209 T2499 oascc.ZkStateReader$2.process A cluster state change has occurred - updating...
[junit4:junit4]   2> 5209 T2485 oascc.ZkStateReader$2.process A cluster state change has occurred - updating...
[junit4:junit4]   2> 5245 T2465 oasc.ZkController.register We are http://127.0.0.1:16397/solr/collection1/ and leader is http://127.0.0.1:16397/solr/collection1/
[junit4:junit4]   2> 5245 T2465 oasc.ZkController.register No LogReplay needed for core=collection1 baseURL=http://127.0.0.1:16397/solr
[junit4:junit4]   2> 5246 T2465 oasc.ZkController.checkRecovery I am the leader, no recovery necessary
[junit4:junit4]   2> 5248 T2465 oascc.ZkStateReader.updateClusterState Updating cloud state from ZooKeeper... 
[junit4:junit4]   2> 5249 T2465 oass.SolrDispatchFilter.init user.dir=/usr/home/hudson/hudson-slave/workspace/Lucene-Solr-Tests-trunk-java7/solr/build/solr-core/test/J1
[junit4:junit4]   2> 5249 T2465 oass.SolrDispatchFilter.init SolrDispatchFilter.init() done
[junit4:junit4]   2> 5250 T2465 oascsi.HttpClientUtil.createClient Creating new http client, config:maxConnections=128&maxConnectionsPerHost=32&followRedirects=false
[junit4:junit4]   2> 5714 T2486 oascc.ZkStateReader.updateClusterState Updating cloud state from ZooKeeper... 
[junit4:junit4]   2> 5732 T2485 oascc.ZkStateReader$2.process A cluster state change has occurred - updating...
[junit4:junit4]   2> 5732 T2499 oascc.ZkStateReader$2.process A cluster state change has occurred - updating...
[junit4:junit4]   2> 5945 T2465 oejs.Server.doStart jetty-8.1.2.v20120308
[junit4:junit4]   2> 5949 T2465 oejs.AbstractConnector.doStart Started SocketConnector@0.0.0.0:16413
[junit4:junit4]   2> 5949 T2465 oasc.SolrResourceLoader.locateSolrHome JNDI not configured for solr (NoInitialContextEx)
[junit4:junit4]   2> 5950 T2465 oasc.SolrResourceLoader.locateSolrHome using system property solr.solr.home: /usr/home/hudson/hudson-slave/workspace/Lucene-Solr-Tests-trunk-java7/solr/build/solr-core/test/J1/./solrtest-jetty2-1348042101548
[junit4:junit4]   2> 5951 T2465 oasc.SolrResourceLoader.<init> new SolrResourceLoader for deduced Solr Home: '/usr/home/hudson/hudson-slave/workspace/Lucene-Solr-Tests-trunk-java7/solr/build/solr-core/test/J1/./solrtest-jetty2-1348042101548/'
[junit4:junit4]   2> 5993 T2465 oass.SolrDispatchFilter.init SolrDispatchFilter.init()
[junit4:junit4]   2> 5994 T2465 oasc.SolrResourceLoader.locateSolrHome JNDI not configured for solr (NoInitialContextEx)
[junit4:junit4]   2> 5994 T2465 oasc.SolrResourceLoader.locateSolrHome using system property solr.solr.home: /usr/home/hudson/hudson-slave/workspace/Lucene-Solr-Tests-trunk-java7/solr/build/solr-core/test/J1/./solrtest-jetty2-1348042101548
[junit4:junit4]   2> 5995 T2465 oasc.CoreContainer$Initializer.initialize looking for solr.xml: /usr/home/hudson/hudson-slave/workspace/Lucene-Solr-Tests-trunk-java7/solr/build/solr-core/test/J1/./solrtest-jetty2-1348042101548/solr.xml
[junit4:junit4]   2> 5995 T2465 oasc.CoreContainer.<init> New CoreContainer 1114247206
[junit4:junit4]   2> 5996 T2465 oasc.CoreContainer.load Loading CoreContainer using Solr Home: '/usr/home/hudson/hudson-slave/workspace/Lucene-Solr-Tests-trunk-java7/solr/build/solr-core/test/J1/./solrtest-jetty2-1348042101548/'
[junit4:junit4]   2> 5996 T2465 oasc.SolrResourceLoader.<init> new SolrResourceLoader for directory: '/usr/home/hudson/hudson-slave/workspace/Lucene-Solr-Tests-trunk-java7/solr/build/solr-core/test/J1/./solrtest-jetty2-1348042101548/'
[junit4:junit4]   2> 6034 T2465 oasc.CoreContainer.load Registering Log Listener
[junit4:junit4]   2> 6050 T2465 oasc.CoreContainer.initZooKeeper Zookeeper client=127.0.0.1:16380/solr
[junit4:junit4]   2> 6050 T2465 oaz.ZooKeeper.<init> Initiating client connection, connectString=127.0.0.1:16380/solr sessionTimeout=5000 watcher=org.apache.solr.common.cloud.ConnectionManager@387ea38a
[junit4:junit4]   2> 6057 T2510 oaz.ClientCnxn$SendThread.startConnect Opening socket connection to server /127.0.0.1:16380
[junit4:junit4]   2> 6057 T2465 oascc.ConnectionManager.waitForConnected Waiting for client to connect to ZooKeeper
[junit4:junit4]   2> 6058 T2510 oaz.ClientCnxn$SendThread.primeConnection Socket connection established to localhost/127.0.0.1:16380, initiating session
[junit4:junit4]   2> 6058 T2467 oazs.NIOServerCnxn$Factory.run Accepted socket connection from /140.211.11.196:16414
[junit4:junit4]   2> 6059 T2467 oazs.NIOServerCnxn.readConnectRequest Client attempting to establish new session at /140.211.11.196:16414
[junit4:junit4]   2> 6060 T2469 oazs.NIOServerCnxn.finishSessionInit Established session 0x139dd91fea30004 with negotiated timeout 5000 for client /140.211.11.196:16414
[junit4:junit4]   2> 6060 T2510 oaz.ClientCnxn$SendThread.readConnectResult Session establishment complete on server localhost/127.0.0.1:16380, sessionid = 0x139dd91fea30004, negotiated timeout = 5000
[junit4:junit4]   2> 6061 T2511 oascc.ConnectionManager.process Watcher org.apache.solr.common.cloud.ConnectionManager@387ea38a name:ZooKeeperConnection Watcher:127.0.0.1:16380/solr got event WatchedEvent state:SyncConnected type:None path:null path:null type:None
[junit4:junit4]   2> 6061 T2465 oascc.ConnectionManager.waitForConnected Client is connected to ZooKeeper
[junit4:junit4]   2> 6062 T2470 oazs.PrepRequestProcessor.pRequest Got user-level KeeperException when processing sessionid:0x139dd91fea30004 type:create cxid:0x1 zxid:0xfffffffffffffffe txntype:unknown reqpath:n/a Error Path:/solr/overseer Error:KeeperErrorCode = NodeExists for /solr/overseer
[junit4:junit4]   2> 6064 T2470 oazs.PrepRequestProcessor.pRequest Got user-level KeeperException when processing sessionid:0x139dd91fea30004 type:create cxid:0x2 zxid:0xfffffffffffffffe txntype:unknown reqpath:n/a Error Path:/solr/overseer Error:KeeperErrorCode = NodeExists for /solr/overseer
[junit4:junit4]   2> 6074 T2465 oasc.ZkController.createEphemeralLiveNode Register node as live in ZooKeeper:/live_nodes/127.0.0.1:16413_solr
[junit4:junit4]   2> 6075 T2470 oazs.PrepRequestProcessor.pRequest Got user-level KeeperException when processing sessionid:0x139dd91fea30004 type:delete cxid:0x4 zxid:0xfffffffffffffffe txntype:unknown reqpath:n/a Error Path:/solr/live_nodes/127.0.0.1:16413_solr Error:KeeperErrorCode = NoNode for /solr/live_nodes/127.0.0.1:16413_solr
[junit4:junit4]   2> 6076 T2465 oascc.SolrZkClient.makePath makePath: /live_nodes/127.0.0.1:16413_solr
[junit4:junit4]   2> 6083 T2499 oascc.ZkStateReader$3.process Updating live nodes
[junit4:junit4]   2> 6083 T2485 oascc.ZkStateReader$3.process Updating live nodes
[junit4:junit4]   2> 6084 T2465 oashc.HttpShardHandlerFactory.getParameter Setting socketTimeout to: 0
[junit4:junit4]   2> 6085 T2465 oashc.HttpShardHandlerFactory.getParameter Setting urlScheme to: http://
[junit4:junit4]   2> 6085 T2465 oashc.HttpShardHandlerFactory.getParameter Setting connTimeout to: 0
[junit4:junit4]   2> 6086 T2465 oashc.HttpShardHandlerFactory.getParameter Setting maxConnectionsPerHost to: 20
[junit4:junit4]   2> 6086 T2465 oashc.HttpShardHandlerFactory.getParameter Setting corePoolSize to: 0
[junit4:junit4]   2> 6087 T2465 oashc.HttpShardHandlerFactory.getParameter Setting maximumPoolSize to: 2147483647
[junit4:junit4]   2> 6087 T2465 oashc.HttpShardHandlerFactory.getParameter Setting maxThreadIdleTime to: 5
[junit4:junit4]   2> 6088 T2465 oashc.HttpShardHandlerFactory.getParameter Setting sizeOfQueue to: -1
[junit4:junit4]   2> 6088 T2465 oashc.HttpShardHandlerFactory.getParameter Setting fairnessPolicy to: false
[junit4:junit4]   2> 6089 T2465 oascsi.HttpClientUtil.createClient Creating new http client, config:maxConnectionsPerHost=20&maxConnections=10000&socketTimeout=0&connTimeout=0&retry=false
[junit4:junit4]   2> 6108 T2465 oascc.ZkStateReader.createClusterStateWatchersAndUpdate Updating cluster state from ZooKeeper... 
[junit4:junit4]   2> 6117 T2465 oasc.CoreContainer.create Creating SolrCore 'collection1' using instanceDir: /usr/home/hudson/hudson-slave/workspace/Lucene-Solr-Tests-trunk-java7/solr/build/solr-core/test/J1/./solrtest-jetty2-1348042101548/collection1
[junit4:junit4]   2> 6118 T2465 oasc.ZkController.createCollectionZkNode Check for collection zkNode:collection1
[junit4:junit4]   2> 6119 T2465 oasc.ZkController.createCollectionZkNode Collection zkNode exists
[junit4:junit4]   2> 6119 T2465 oasc.ZkController.readConfigName Load collection config from:/collections/collection1
[junit4:junit4]   2> 6120 T2465 oasc.SolrResourceLoader.<init> new SolrResourceLoader for directory: '/usr/home/hudson/hudson-slave/workspace/Lucene-Solr-Tests-trunk-java7/solr/build/solr-core/test/J1/./solrtest-jetty2-1348042101548/collection1/'
[junit4:junit4]   2> 6122 T2465 oasc.SolrResourceLoader.replaceClassLoader Adding 'file:/usr/home/hudson/hudson-slave/workspace/Lucene-Solr-Tests-trunk-java7/solr/build/solr-core/test/J1/solrtest-jetty2-1348042101548/collection1/lib/README' to classloader
[junit4:junit4]   2> 6123 T2465 oasc.SolrResourceLoader.replaceClassLoader Adding 'file:/usr/home/hudson/hudson-slave/workspace/Lucene-Solr-Tests-trunk-java7/solr/build/solr-core/test/J1/solrtest-jetty2-1348042101548/collection1/lib/classes/' to classloader
[junit4:junit4]   2> 6179 T2465 oasc.SolrConfig.<init> Using Lucene MatchVersion: LUCENE_50
[junit4:junit4]   2> 6254 T2465 oasc.SolrConfig.<init> Loaded SolrConfig: solrconfig.xml
[junit4:junit4]   2> 6356 T2465 oass.IndexSchema.readSchema Reading Solr Schema
[junit4:junit4]   2> 6363 T2465 oass.IndexSchema.readSchema Schema name=test
[junit4:junit4]   2> 7044 T2465 oass.OpenExchangeRatesOrgProvider.init Initialized with rates=open-exchange-rates.json, refreshInterval=1440.
[junit4:junit4]   2> 7057 T2465 oass.IndexSchema.readSchema default search field in schema is text
[junit4:junit4]   2> 7061 T2465 oass.IndexSchema.readSchema unique key field: id
[junit4:junit4]   2> 7073 T2465 oass.FileExchangeRateProvider.reload Reloading exchange rates from file currency.xml
[junit4:junit4]   2> 7079 T2465 oass.FileExchangeRateProvider.reload Reloading exchange rates from file currency.xml
[junit4:junit4]   2> 7084 T2465 oass.OpenExchangeRatesOrgProvider.reload Reloading exchange rates from open-exchange-rates.json
[junit4:junit4]   2> 7086 T2465 oass.OpenExchangeRatesOrgProvider.reload Reloading exchange rates from open-exchange-rates.json
[junit4:junit4]   2> 7087 T2465 oasc.SolrCore.<init> [collection1] Opening new SolrCore at /usr/home/hudson/hudson-slave/workspace/Lucene-Solr-Tests-trunk-java7/solr/build/solr-core/test/J1/./solrtest-jetty2-1348042101548/collection1/, dataDir=./org.apache.solr.cloud.SyncSliceTest-1348042096286/jetty2/
[junit4:junit4]   2> 7088 T2465 oasc.JmxMonitoredMap.<init> JMX monitoring is enabled. Adding Solr mbeans to JMX Server: com.sun.jmx.mbeanserver.JmxMBeanServer@25930632
[junit4:junit4]   2> 7089 T2465 oasc.SolrCore.getNewIndexDir WARNING New index directory detected: old=null new=./org.apache.solr.cloud.SyncSliceTest-1348042096286/jetty2/index/
[junit4:junit4]   2> 7090 T2465 oasc.SolrCore.initIndex WARNING [collection1] Solr index directory './org.apache.solr.cloud.SyncSliceTest-1348042096286/jetty2/index' doesn't exist. Creating new index...
[junit4:junit4]   2> 7091 T2465 oasc.CachingDirectoryFactory.get return new directory for /usr/home/hudson/hudson-slave/workspace/Lucene-Solr-Tests-trunk-java7/solr/build/solr-core/test/J1/./org.apache.solr.cloud.SyncSliceTest-1348042096286/jetty2/index forceNew:false
[junit4:junit4]   2> 7108 T2465 oasc.SolrDeletionPolicy.onCommit SolrDeletionPolicy.onCommit: commits:num=1
[junit4:junit4]   2> 		commit{dir=NRTCachingDirectory(org.apache.lucene.store.NIOFSDirectory@/usr/home/hudson/hudson-slave/workspace/Lucene-Solr-Tests-trunk-java7/solr/build/solr-core/test/J1/org.apache.solr.cloud.SyncSliceTest-1348042096286/jetty2/index lockFactory=org.apache.lucene.store.NativeFSLockFactory@57110261; maxCacheMB=48.0 maxMergeSizeMB=4.0),segFN=segments_1,generation=1,filenames=[segments_1]
[junit4:junit4]   2> 7109 T2465 oasc.SolrDeletionPolicy.updateCommits newest commit = 1
[junit4:junit4]   2> 7110 T2465 oasc.SolrCore.initWriters created xml: solr.XMLResponseWriter
[junit4:junit4]   2> 7113 T2465 oasup.UpdateRequestProcessorChain.init inserting DistributedUpdateProcessorFactory into updateRequestProcessorChain "dedupe"
[junit4:junit4]   2> 7114 T2465 oasup.UpdateRequestProcessorChain.init inserting DistributedUpdateProcessorFactory into updateRequestProcessorChain "dedupe-allfields"
[junit4:junit4]   2> 7114 T2465 oasup.UpdateRequestProcessorChain.init inserting DistributedUpdateProcessorFactory into updateRequestProcessorChain "stored_sig"
[junit4:junit4]   2> 7115 T2465 oasup.UpdateRequestProcessorChain.init inserting DistributedUpdateProcessorFactory into updateRequestProcessorChain "uniq-fields"
[junit4:junit4]   2> 7116 T2465 oasup.UpdateRequestProcessorChain.init inserting DistributedUpdateProcessorFactory into updateRequestProcessorChain "distrib-dup-test-chain-implicit"
[junit4:junit4]   2> 7116 T2465 oasc.RequestHandlers.initHandlersFromConfig adding lazy requestHandler: solr.ReplicationHandler
[junit4:junit4]   2> 7117 T2465 oasc.RequestHandlers.initHandlersFromConfig created /replication: solr.ReplicationHandler
[junit4:junit4]   2> 7118 T2465 oasc.RequestHandlers.initHandlersFromConfig created standard: solr.StandardRequestHandler
[junit4:junit4]   2> 7119 T2465 oasc.RequestHandlers.initHandlersFromConfig created /get: solr.RealTimeGetHandler
[junit4:junit4]   2> 7120 T2465 oasc.RequestHandlers.initHandlersFromConfig created dismax: solr.SearchHandler
[junit4:junit4]   2> 7120 T2465 oasc.RequestHandlers.initHandlersFromConfig created mock: org.apache.solr.core.MockQuerySenderListenerReqHandler
[junit4:junit4]   2> 7121 T2465 oasc.RequestHandlers.initHandlersFromConfig created /admin/: org.apache.solr.handler.admin.AdminHandlers
[junit4:junit4]   2> 7122 T2465 oasc.RequestHandlers.initHandlersFromConfig created defaults: solr.StandardRequestHandler
[junit4:junit4]   2> 7122 T2465 oasc.RequestHandlers.initHandlersFromConfig adding lazy requestHandler: solr.StandardRequestHandler
[junit4:junit4]   2> 7123 T2465 oasc.RequestHandlers.initHandlersFromConfig created lazy: solr.StandardRequestHandler
[junit4:junit4]   2> 7124 T2465 oasc.RequestHandlers.initHandlersFromConfig created /update: solr.UpdateRequestHandler
[junit4:junit4]   2> 7125 T2465 oasc.RequestHandlers.initHandlersFromConfig created /terms: org.apache.solr.handler.component.SearchHandler
[junit4:junit4]   2> 7125 T2465 oasc.RequestHandlers.initHandlersFromConfig created spellCheckCompRH: org.apache.solr.handler.component.SearchHandler
[junit4:junit4]   2> 7126 T2465 oasc.RequestHandlers.initHandlersFromConfig created spellCheckCompRH_Direct: org.apache.solr.handler.component.SearchHandler
[junit4:junit4]   2> 7127 T2465 oasc.RequestHandlers.initHandlersFromConfig created spellCheckWithWordbreak: org.apache.solr.handler.component.SearchHandler
[junit4:junit4]   2> 7128 T2465 oasc.RequestHandlers.initHandlersFromConfig created spellCheckWithWordbreak_Direct: org.apache.solr.handler.component.SearchHandler
[junit4:junit4]   2> 7129 T2465 oasc.RequestHandlers.initHandlersFromConfig created spellCheckCompRH1: org.apache.solr.handler.component.SearchHandler
[junit4:junit4]   2> 7129 T2465 oasc.RequestHandlers.initHandlersFromConfig created tvrh: org.apache.solr.handler.component.SearchHandler
[junit4:junit4]   2> 7130 T2465 oasc.RequestHandlers.initHandlersFromConfig created /mlt: solr.MoreLikeThisHandler
[junit4:junit4]   2> 7131 T2465 oasc.RequestHandlers.initHandlersFromConfig created /debug/dump: solr.DumpRequestHandler
[junit4:junit4]   2> 7135 T2465 oashl.XMLLoader.init xsltCacheLifetimeSeconds=60
[junit4:junit4]   2> 7140 T2465 oasc.SolrCore.initDeprecatedSupport WARNING solrconfig.xml uses deprecated <admin/gettableFiles>, Please update your config to use the ShowFileRequestHandler.
[junit4:junit4]   2> 7141 T2465 oasc.SolrCore.initDeprecatedSupport WARNING adding ShowFileRequestHandler with hidden files: [SCHEMA.XML, OLD_SYNONYMS.TXT, STOPWORDS.TXT, PROTWORDS.TXT, OPEN-EXCHANGE-RATES.JSON, SYNONYMS.TXT, CURRENCY.XML, MAPPING-ISOLATIN1ACCENT.TXT]
[junit4:junit4]   2> 7157 T2465 oass.SolrIndexSearcher.<init> Opening Searcher@3a4ca542 main
[junit4:junit4]   2> 7159 T2465 oasu.CommitTracker.<init> Hard AutoCommit: disabled
[junit4:junit4]   2> 7159 T2465 oasu.CommitTracker.<init> Soft AutoCommit: disabled
[junit4:junit4]   2> 7160 T2465 oashc.SpellCheckComponent.inform Initializing spell checkers
[junit4:junit4]   2> 7281 T2465 oass.DirectSolrSpellChecker.init init: {name=direct,classname=DirectSolrSpellChecker,field=lowerfilt,minQueryLength=3}
[junit4:junit4]   2> 7690 T2512 oasc.SolrCore.registerSearcher [collection1] Registered new searcher Searcher@3a4ca542 main{StandardDirectoryReader(segments_1:1)}
[junit4:junit4]   2> 7747 T2486 oascc.ZkStateReader.updateClusterState Updating cloud state from ZooKeeper... 
[junit4:junit4]   2> 7809 T2511 oascc.ZkStateReader$2.process A cluster state change has occurred - updating...
[junit4:junit4]   2> 7809 T2485 oascc.ZkStateReader$2.process A cluster state change has occurred - updating...
[junit4:junit4]   2> 7809 T2499 oascc.ZkStateReader$2.process A cluster state change has occurred - updating...
[junit4:junit4]   2> 8215 T2465 oasc.CoreContainer.register registering core: collection1
[junit4:junit4]   2> 8216 T2465 oasc.ZkController.register Register shard - core:collection1 address:http://127.0.0.1:16413/solr shardId:shard1
[junit4:junit4]   2> 8222 T2465 oasc.ZkController.register We are http://127.0.0.1:16413/solr/collection1/ and leader is http://127.0.0.1:16397/solr/collection1/
[junit4:junit4]   2> 8223 T2465 oasc.ZkController.register No LogReplay needed for core=collection1 baseURL=http://127.0.0.1:16413/solr
[junit4:junit4]   2> 8224 T2465 oasc.ZkController.checkRecovery Core needs to recover:collection1
[junit4:junit4]   2> 8224 T2465 oasu.DefaultSolrCoreState.doRecovery Running recovery - first canceling any ongoing recovery
[junit4:junit4]   2> ASYNC  NEW_CORE C164 name=collection1 org.apache.solr.core.SolrCore@37e55556 url=http://127.0.0.1:16413/solr/collection1 node=127.0.0.1:16413_solr
[junit4:junit4]   2> 8226 T2513 C164 P16413 oasc.RecoveryStrategy.run Starting recovery process.  core=collection1 recoveringAfterStartup=true
[junit4:junit4]   2> 8227 T2513 C164 P16413 oasc.RecoveryStrategy.doRecovery ###### startupVersions=[]
[junit4:junit4]   2> 8226 T2465 oascc.ZkStateReader.updateClusterState Updating cloud state from ZooKeeper... 
[junit4:junit4]   2> 8228 T2513 C164 P16413 oasc.RecoveryStrategy.doRecovery Attempting to PeerSync from http://127.0.0.1:16397/solr/collection1/ core=collection1 - recoveringAfterStartup=true
[junit4:junit4]   2> 8229 T2513 C164 P16413 oasu.PeerSync.sync PeerSync: core=collection1 url=http://127.0.0.1:16413/solr START replicas=[http://127.0.0.1:16397/solr/collection1/] nUpdates=100
[junit4:junit4]   2> 8229 T2465 oass.SolrDispatchFilter.init user.dir=/usr/home/hudson/hudson-slave/workspace/Lucene-Solr-Tests-trunk-java7/solr/build/solr-core/test/J1
[junit4:junit4]   2> 8229 T2513 C164 P16413 oasu.PeerSync.sync WARNING no frame of reference to tell of we've missed updates
[junit4:junit4]   2> 8229 T2513 C164 P16413 oasc.RecoveryStrategy.doRecovery PeerSync Recovery was not successful - trying replication. core=collection1
[junit4:junit4]   2> 8229 T2465 oass.SolrDispatchFilter.init SolrDispatchFilter.init() done
[junit4:junit4]   2> 8230 T2513 C164 P16413 oasc.RecoveryStrategy.doRecovery Starting Replication Recovery. core=collection1
[junit4:junit4]   2> 8230 T2513 C164 P16413 oascsi.HttpClientUtil.createClient Creating new http client, config:maxConnections=128&maxConnectionsPerHost=32&followRedirects=false
[junit4:junit4]   2> 8230 T2465 oascsi.HttpClientUtil.createClient Creating new http client, config:maxConnections=128&maxConnectionsPerHost=32&followRedirects=false
[junit4:junit4]   2> ASYNC  NEW_CORE C165 name=collection1 org.apache.solr.core.SolrCore@65ebb307 url=http://127.0.0.1:16397/solr/collection1 node=127.0.0.1:16397_solr
[junit4:junit4]   2> 8239 T2491 C165 P16397 REQ /get {distrib=false&qt=/get&wt=javabin&version=2&getVersions=100} status=0 QTime=0 
[junit4:junit4]   2> 8344 T2486 oascc.ZkStateReader.updateClusterState Updating cloud state from ZooKeeper... 
[junit4:junit4]   2> 8358 T2485 oascc.ZkStateReader$2.process A cluster state change has occurred - updating...
[junit4:junit4]   2> 8358 T2499 oascc.ZkStateReader$2.process A cluster state change has occurred - updating...
[junit4:junit4]   2> 8358 T2511 oascc.ZkStateReader$2.process A cluster state change has occurred - updating...
[junit4:junit4]   2> 9078 T2465 oejs.Server.doStart jetty-8.1.2.v20120308
[junit4:junit4]   2> 9082 T2465 oejs.AbstractConnector.doStart Started SocketConnector@0.0.0.0:16434
[junit4:junit4]   2> 9082 T2465 oasc.SolrResourceLoader.locateSolrHome JNDI not configured for solr (NoInitialContextEx)
[junit4:junit4]   2> 9083 T2465 oasc.SolrResourceLoader.locateSolrHome using system property solr.solr.home: /usr/home/hudson/hudson-slave/workspace/Lucene-Solr-Tests-trunk-java7/solr/build/solr-core/test/J1/./solrtest-jetty3-1348042104538
[junit4:junit4]   2> 9083 T2465 oasc.SolrResourceLoader.<init> new SolrResourceLoader for deduced Solr Home: '/usr/home/hudson/hudson-slave/workspace/Lucene-Solr-Tests-trunk-java7/solr/build/solr-core/test/J1/./solrtest-jetty3-1348042104538/'
[junit4:junit4]   2> 9124 T2465 oass.SolrDispatchFilter.init SolrDispatchFilter.init()
[junit4:junit4]   2> 9124 T2465 oasc.SolrResourceLoader.locateSolrHome JNDI not configured for solr (NoInitialContextEx)
[junit4:junit4]   2> 9125 T2465 oasc.SolrResourceLoader.locateSolrHome using system property solr.solr.home: /usr/home/hudson/hudson-slave/workspace/Lucene-Solr-Tests-trunk-java7/solr/build/solr-core/test/J1/./solrtest-jetty3-1348042104538
[junit4:junit4]   2> 9125 T2465 oasc.CoreContainer$Initializer.initialize looking for solr.xml: /usr/home/hudson/hudson-slave/workspace/Lucene-Solr-Tests-trunk-java7/solr/build/solr-core/test/J1/./solrtest-jetty3-1348042104538/solr.xml
[junit4:junit4]   2> 9126 T2465 oasc.CoreContainer.<init> New CoreContainer 1425574205
[junit4:junit4]   2> 9126 T2465 oasc.CoreContainer.load Loading CoreContainer using Solr Home: '/usr/home/hudson/hudson-slave/workspace/Lucene-Solr-Tests-trunk-java7/solr/build/solr-core/test/J1/./solrtest-jetty3-1348042104538/'
[junit4:junit4]   2> 9127 T2465 oasc.SolrResourceLoader.<init> new SolrResourceLoader for directory: '/usr/home/hudson/hudson-slave/workspace/Lucene-Solr-Tests-trunk-java7/solr/build/solr-core/test/J1/./solrtest-jetty3-1348042104538/'
[junit4:junit4]   2> 9159 T2465 oasc.CoreContainer.load Registering Log Listener
[junit4:junit4]   2> 9175 T2465 oasc.CoreContainer.initZooKeeper Zookeeper client=127.0.0.1:16380/solr
[junit4:junit4]   2> 9176 T2465 oaz.ZooKeeper.<init> Initiating client connection, connectString=127.0.0.1:16380/solr sessionTimeout=5000 watcher=org.apache.solr.common.cloud.ConnectionManager@457d7f
[junit4:junit4]   2> 9177 T2524 oaz.ClientCnxn$SendThread.startConnect Opening socket connection to server /127.0.0.1:16380
[junit4:junit4]   2> 9177 T2465 oascc.ConnectionManager.waitForConnected Waiting for client to connect to ZooKeeper
[junit4:junit4]   2> 9177 T2524 oaz.ClientCnxn$SendThread.primeConnection Socket connection established to localhost/127.0.0.1:16380, initiating session
[junit4:junit4]   2> 9178 T2467 oazs.NIOServerCnxn$Factory.run Accepted socket connection from /140.211.11.196:16435
[junit4:junit4]   2> 9178 T2467 oazs.NIOServerCnxn.readConnectRequest Client attempting to establish new session at /140.211.11.196:16435
[junit4:junit4]   2> 9209 T2469 oazs.NIOServerCnxn.finishSessionInit Established session 0x139dd91fea30005 with negotiated timeout 5000 for client /140.211.11.196:16435
[junit4:junit4]   2> 9215 T2524 oaz.ClientCnxn$SendThread.readConnectResult Session establishment complete on server localhost/127.0.0.1:16380, sessionid = 0x139dd91fea30005, negotiated timeout = 5000
[junit4:junit4]   2> 9215 T2525 oascc.ConnectionManager.process Watcher org.apache.solr.common.cloud.ConnectionManager@457d7f name:ZooKeeperConnection Watcher:127.0.0.1:16380/solr got event WatchedEvent state:SyncConnected type:None path:null path:null type:None
[junit4:junit4]   2> 9216 T2465 oascc.ConnectionManager.waitForConnected Client is connected to ZooKeeper
[junit4:junit4]   2> 9219 T2470 oazs.PrepRequestProcessor.pRequest Got user-level KeeperException when processing sessionid:0x139dd91fea30005 type:create cxid:0x1 zxid:0xfffffffffffffffe txntype:unknown reqpath:n/a Error Path:/solr/overseer Error:KeeperErrorCode = NodeExists for /solr/overseer
[junit4:junit4]   2> 9235 T2470 oazs.PrepRequestProcessor.pRequest Got user-level KeeperException when processing sessionid:0x139dd91fea30005 type:create cxid:0x2 zxid:0xfffffffffffffffe txntype:unknown reqpath:n/a Error Path:/solr/overseer Error:KeeperErrorCode = NodeExists for /solr/overseer
[junit4:junit4]   2> 9253 T2465 oasc.ZkController.createEphemeralLiveNode Register node as live in ZooKeeper:/live_nodes/127.0.0.1:16434_solr
[junit4:junit4]   2> 9270 T2470 oazs.PrepRequestProcessor.pRequest Got user-level KeeperException when processing sessionid:0x139dd91fea30005 type:delete cxid:0x4 zxid:0xfffffffffffffffe txntype:unknown reqpath:n/a Error Path:/solr/live_nodes/127.0.0.1:16434_solr Error:KeeperErrorCode = NoNode for /solr/live_nodes/127.0.0.1:16434_solr
[junit4:junit4]   2> 9278 T2465 oascc.SolrZkClient.makePath makePath: /live_nodes/127.0.0.1:16434_solr
[junit4:junit4]   2> 9281 T2511 oascc.ZkStateReader$3.process Updating live nodes
[junit4:junit4]   2> 9281 T2485 oascc.ZkStateReader$3.process Updating live nodes
[junit4:junit4]   2> 9281 T2499 oascc.ZkStateReader$3.process Updating live nodes
[junit4:junit4]   2> 9282 T2465 oashc.HttpShardHandlerFactory.getParameter Setting socketTimeout to: 0
[junit4:junit4]   2> 9282 T2465 oashc.HttpShardHandlerFactory.getParameter Setting urlScheme to: http://
[junit4:junit4]   2> 9283 T2465 oashc.HttpShardHandlerFactory.getParameter Setting connTimeout to: 0
[junit4:junit4]   2> 9283 T2465 oashc.HttpShardHandlerFactory.getParameter Setting maxConnectionsPerHost to: 20
[junit4:junit4]   2> 9284 T2465 oashc.HttpShardHandlerFactory.getParameter Setting corePoolSize to: 0
[junit4:junit4]   2> 9284 T2465 oashc.HttpShardHandlerFactory.getParameter Setting maximumPoolSize to: 2147483647
[junit4:junit4]   2> 9285 T2465 oashc.HttpShardHandlerFactory.getParameter Setting maxThreadIdleTime to: 5
[junit4:junit4]   2> 9285 T2465 oashc.HttpShardHandlerFactory.getParameter Setting sizeOfQueue to: -1
[junit4:junit4]   2> 9286 T2465 oashc.HttpShardHandlerFactory.getParameter Setting fairnessPolicy to: false
[junit4:junit4]   2> 9286 T2465 oascsi.HttpClientUtil.createClient Creating new http client, config:maxConnectionsPerHost=20&maxConnections=10000&socketTimeout=0&connTimeout=0&retry=false
[junit4:junit4]   2> 9303 T2465 oascc.ZkStateReader.createClusterStateWatchersAndUpdate Updating cluster state from ZooKeeper... 
[junit4:junit4]   2> 9310 T2465 oasc.CoreContainer.create Creating SolrCore 'collection1' using instanceDir: /usr/home/hudson/hudson-slave/workspace/Lucene-Solr-Tests-trunk-java7/solr/build/solr-core/test/J1/./solrtest-jetty3-1348042104538/collection1
[junit4:junit4]   2> 9311 T2465 oasc.ZkController.createCollectionZkNode Check for collection zkNode:collection1
[junit4:junit4]   2> 9312 T2465 oasc.ZkController.createCollectionZkNode Collection zkNode exists
[junit4:junit4]   2> 9312 T2465 oasc.ZkController.readConfigName Load collection config from:/collections/collection1
[junit4:junit4]   2> 9313 T2465 oasc.SolrResourceLoader.<init> new SolrResourceLoader for directory: '/usr/home/hudson/hudson-slave/workspace/Lucene-Solr-Tests-trunk-java7/solr/build/solr-core/test/J1/./solrtest-jetty3-1348042104538/collection1/'
[junit4:junit4]   2> 9315 T2465 oasc.SolrResourceLoader.replaceClassLoader Adding 'file:/usr/home/hudson/hudson-slave/workspace/Lucene-Solr-Tests-trunk-java7/solr/build/solr-core/test/J1/solrtest-jetty3-1348042104538/collection1/lib/classes/' to classloader
[junit4:junit4]   2> 9316 T2465 oasc.SolrResourceLoader.replaceClassLoader Adding 'file:/usr/home/hudson/hudson-slave/workspace/Lucene-Solr-Tests-trunk-java7/solr/build/solr-core/test/J1/solrtest-jetty3-1348042104538/collection1/lib/README' to classloader
[junit4:junit4]   2> 9372 T2465 oasc.SolrConfig.<init> Using Lucene MatchVersion: LUCENE_50
[junit4:junit4]   2> 9444 T2465 oasc.SolrConfig.<init> Loaded SolrConfig: solrconfig.xml
[junit4:junit4]   2> 9545 T2465 oass.IndexSchema.readSchema Reading Solr Schema
[junit4:junit4]   2> 9555 T2465 oass.IndexSchema.readSchema Schema name=test
[junit4:junit4]   2> 10192 T2465 oass.OpenExchangeRatesOrgProvider.init Initialized with rates=open-exchange-rates.json, refreshInterval=1440.
[junit4:junit4]   2> 10201 T2465 oass.IndexSchema.readSchema default search field in schema is text
[junit4:junit4]   2> 10204 T2465 oass.IndexSchema.readSchema unique key field: id
[junit4:junit4]   2> 10214 T2465 oass.FileExchangeRateProvider.reload Reloading exchange rates from file currency.xml
[junit4:junit4]   2> 10218 T2465 oass.FileExchangeRateProvider.reload Reloading exchange rates from file currency.xml
[junit4:junit4]   2> 10221 T2465 oass.OpenExchangeRatesOrgProvider.reload Reloading exchange rates from open-exchange-rates.json
[junit4:junit4]   2> 10223 T2465 oass.OpenExchangeRatesOrgProvider.reload Reloading exchange rates from open-exchange-rates.json
[junit4:junit4]   2> 10223 T2465 oasc.SolrCore.<init> [collection1] Opening new SolrCore at /usr/home/hudson/hudson-slave/workspace/Lucene-Solr-Tests-trunk-java7/solr/build/solr-core/test/J1/./solrtest-jetty3-1348042104538/collection1/, dataDir=./org.apache.solr.cloud.SyncSliceTest-1348042096286/jetty3/
[junit4:junit4]   2> 10224 T2465 oasc.JmxMonitoredMap.<init> JMX monitoring is enabled. Adding Solr mbeans to JMX Server: com.sun.jmx.mbeanserver.JmxMBeanServer@25930632
[junit4:junit4]   2> 10225 T2465 oasc.SolrCore.getNewIndexDir WARNING New index directory detected: old=null new=./org.apache.solr.cloud.SyncSliceTest-1348042096286/jetty3/index/
[junit4:junit4]   2> 10226 T2465 oasc.SolrCore.initIndex WARNING [collection1] Solr index directory './org.apache.solr.cloud.SyncSliceTest-1348042096286/jetty3/index' doesn't exist. Creating new index...
[junit4:junit4]   2> 10226 T2465 oasc.CachingDirectoryFactory.get return new directory for /usr/home/hudson/hudson-slave/workspace/Lucene-Solr-Tests-trunk-java7/solr/build/solr-core/test/J1/./org.apache.solr.cloud.SyncSliceTest-1348042096286/jetty3/index forceNew:false
[junit4:junit4]   2> 10250 T2465 oasc.SolrDeletionPolicy.onCommit SolrDeletionPolicy.onCommit: commits:num=1
[junit4:junit4]   2> 		commit{dir=NRTCachingDirectory(org.apache.lucene.store.NIOFSDirectory@/usr/home/hudson/hudson-slave/workspace/Lucene-Solr-Tests-trunk-java7/solr/build/solr-core/test/J1/org.apache.solr.cloud.SyncSliceTest-1348042096286/jetty3/index lockFactory=org.apache.lucene.store.NativeFSLockFactory@1534954a; maxCacheMB=48.0 maxMergeSizeMB=4.0),segFN=segments_1,generation=1,filenames=[segments_1]
[junit4:junit4]   2> 10251 T2465 oasc.SolrDeletionPolicy.updateCommits newest commit = 1
[junit4:junit4]   2> 10252 T2465 oasc.SolrCore.initWriters created xml: solr.XMLResponseWriter
[junit4:junit4]   2> 10254 T2465 oasup.UpdateRequestProcessorChain.init inserting DistributedUpdateProcessorFactory into updateRequestProcessorChain "dedupe"
[junit4:junit4]   2> 10254 T2465 oasup.UpdateRequestProcessorChain.init inserting DistributedUpdateProcessorFactory into updateRequestProcessorChain "dedupe-allfields"
[junit4:junit4]   2> 10254 T2465 oasup.UpdateRequestProcessorChain.init inserting DistributedUpdateProcessorFactory into updateRequestProcessorChain "stored_sig"
[junit4:junit4]   2> 10255 T2465 oasup.UpdateRequestProcessorChain.init inserting DistributedUpdateProcessorFactory into updateRequestProcessorChain "uniq-fields"
[junit4:junit4]   2> 10255 T2465 oasup.UpdateRequestProcessorChain.init inserting DistributedUpdateProcessorFactory into updateRequestProcessorChain "distrib-dup-test-chain-implicit"
[junit4:junit4]   2> 10256 T2465 oasc.RequestHandlers.initHandlersFromConfig adding lazy requestHandler: solr.ReplicationHandler
[junit4:junit4]   2> 10256 T2465 oasc.RequestHandlers.initHandlersFromConfig created /replication: solr.ReplicationHandler
[junit4:junit4]   2> 10257 T2465 oasc.RequestHandlers.initHandlersFromConfig created standard: solr.StandardRequestHandler
[junit4:junit4]   2> 10257 T2465 oasc.RequestHandlers.initHandlersFromConfig created /get: solr.RealTimeGetHandler
[junit4:junit4]   2> 10258 T2465 oasc.RequestHandlers.initHandlersFromConfig created dismax: solr.SearchHandler
[junit4:junit4]   2> 10258 T2465 oasc.RequestHandlers.initHandlersFromConfig created mock: org.apache.solr.core.MockQuerySenderListenerReqHandler
[junit4:junit4]   2> 10259 T2465 oasc.RequestHandlers.initHandlersFromConfig created /admin/: org.apache.solr.handler.admin.AdminHandlers
[junit4:junit4]   2> 10259 T2465 oasc.RequestHandlers.initHandlersFromConfig created defaults: solr.StandardRequestHandler
[junit4:junit4]   2> 10260 T2465 oasc.RequestHandlers.initHandlersFromConfig adding lazy requestHandler: solr.StandardRequestHandler
[junit4:junit4]   2> 10260 T2465 oasc.RequestHandlers.initHandlersFromConfig created lazy: solr.StandardRequestHandler
[junit4:junit4]   2> 10261 T2465 oasc.RequestHandlers.initHandlersFromConfig created /update: solr.UpdateRequestHandler
[junit4:junit4]   2> 10261 T2465 oasc.RequestHandlers.initHandlersFromConfig created /terms: org.apache.solr.handler.component.SearchHandler
[junit4:junit4]   2> 10262 T2465 oasc.RequestHandlers.initHandlersFromConfig created spellCheckCompRH: org.apache.solr.handler.component.SearchHandler
[junit4:junit4]   2> 10262 T2465 oasc.RequestHandlers.initHandlersFromConfig created spellCheckCompRH_Direct: org.apache.solr.handler.component.SearchHandler
[junit4:junit4]   2> 10263 T2465 oasc.RequestHandlers.initHandlersFromConfig created spellCheckWithWordbreak: org.apache.solr.handler.component.SearchHandler
[junit4:junit4]   2> 10263 T2465 oasc.RequestHandlers.initHandlersFromConfig created spellCheckWithWordbreak_Direct: org.apache.solr.handler.component.SearchHandler
[junit4:junit4]   2> 10264 T2465 oasc.RequestHandlers.initHandlersFromConfig created spellCheckCompRH1: org.apache.solr.handler.component.SearchHandler
[junit4:junit4]   2> 10264 T2465 oasc.RequestHandlers.initHandlersFromConfig created tvrh: org.apache.solr.handler.component.SearchHandler
[junit4:junit4]   2> 10265 T2465 oasc.RequestHandlers.initHandlersFromConfig created /mlt: solr.MoreLikeThisHandler
[junit4:junit4]   2> 10265 T2465 oasc.RequestHandlers.initHandlersFromConfig created /debug/dump: solr.DumpRequestHandler
[junit4:junit4]   2> 10268 T2465 oashl.XMLLoader.init xsltCacheLifetimeSeconds=60
[junit4:junit4]   2> 10271 T2465 oasc.SolrCore.initDeprecatedSupport WARNING solrconfig.xml uses deprecated <admin/gettableFiles>, Please update your config to use the ShowFileRequestHandler.
[junit4:junit4]   2> 10272 T2465 oasc.SolrCore.initDeprecatedSupport WARNING adding ShowFileRequestHandler with hidden files: [SCHEMA.XML, OLD_SYNONYMS.TXT, STOPWORDS.TXT, PROTWORDS.TXT, OPEN-EXCHANGE-RATES.JSON, SYNONYMS.TXT, CURRENCY.XML, MAPPING-ISOLATIN1ACCENT.TXT]
[junit4:junit4]   2> 10275 T2465 oass.SolrIndexSearcher.<init> Opening Searcher@22eed5da main
[junit4:junit4]   2> 10276 T2465 oasu.CommitTracker.<init> Hard AutoCommit: disabled
[junit4:junit4]   2> 10277 T2465 oasu.CommitTracker.<init> Soft AutoCommit: disabled
[junit4:junit4]   2> 10277 T2465 oashc.SpellCheckComponent.inform Initializing spell checkers
[junit4:junit4]   2> 10284 T2465 oass.DirectSolrSpellChecker.init init: {name=direct,classname=DirectSolrSpellChecker,field=lowerfilt,minQueryLength=3}
[junit4:junit4]   2> 10338 T2526 oasc.SolrCore.registerSearcher [collection1] Registered new searcher Searcher@22eed5da main{StandardDirectoryReader(segments_1:1)}
[junit4:junit4]   2> 10397 T2486 oascc.ZkStateReader.updateClusterState Updating cloud state from ZooKeeper... 
[junit4:junit4]   2> 10400 T2485 oascc.ZkStateReader$2.process A cluster state change has occurred - updating...
[junit4:junit4]   2> 10400 T2499 oascc.ZkStateReader$2.process A cluster state change has occurred - updating...
[junit4:junit4]   2> 10400 T2511 oascc.ZkStateReader$2.process A cluster state change has occurred - updating...
[junit4:junit4]   2> 10401 T2525 oascc.ZkStateReader$2.process A cluster state change has occurred - updating...
[junit4:junit4]   2> 10844 T2465 oasc.CoreContainer.register registering core: collection1
[junit4:junit4]   2> 10844 T2465 oasc.ZkController.register Register shard - core:collection1 address:http://127.0.0.1:16434/solr shardId:shard1
[junit4:junit4]   2> 10847 T2465 oasc.ZkController.register We are http://127.0.0.1:16434/solr/collection1/ and leader is http://127.0.0.1:16397/solr/collection1/
[junit4:junit4]   2> 10848 T2465 oasc.ZkController.register No LogReplay needed for core=collection1 baseURL=http://127.0.0.1:16434/solr
[junit4:junit4]   2> 10848 T2465 oasc.ZkController.checkRecovery Core needs to recover:collection1
[junit4:junit4]   2> 10848 T2465 oasu.DefaultSolrCoreState.doRecovery Running recovery - first canceling any ongoing recovery
[junit4:junit4]   2> ASYNC  NEW_CORE C166 name=collection1 org.apache.solr.core.SolrCore@14fbd75f url=http://127.0.0.1:16434/solr/collection1 node=127.0.0.1:16434_solr
[junit4:junit4]   2> 10850 T2527 C166 P16434 oasc.RecoveryStrategy.run Starting recovery process.  core=collection1 recoveringAfterStartup=true
[junit4:junit4]   2> 10850 T2527 C166 P16434 oasc.RecoveryStrategy.doRecovery ###### startupVersions=[]
[junit4:junit4]   2> 10850 T2465 oascc.ZkStateReader.updateClusterState Updating cloud state from ZooKeeper... 
[junit4:junit4]   2> 10851 T2527 C166 P16434 oasc.RecoveryStrategy.doRecovery Attempting to PeerSync from http://127.0.0.1:16397/solr/collection1/ core=collection1 - recoveringAfterStartup=true
[junit4:junit4]   2> 10852 T2527 C166 P16434 oasu.PeerSync.sync PeerSync: core=collection1 url=http://127.0.0.1:16434/solr START replicas=[http://127.0.0.1:16397/solr/collection1/] nUpdates=100
[junit4:junit4]   2> 10852 T2465 oass.SolrDispatchFilter.init user.dir=/usr/home/hudson/hudson-slave/workspace/Lucene-Solr-Tests-trunk-java7/solr/build/solr-core/test/J1
[junit4:junit4]   2> 10852 T2527 C166 P16434 oasu.PeerSync.sync WARNING no frame of reference to tell of we've missed updates
[junit4:junit4]   2> 10852 T2465 oass.SolrDispatchFilter.init SolrDispatchFilter.init() done
[junit4:junit4]   2> 10852 T2527 C166 P16434 oasc.RecoveryStrategy.doRecovery PeerSync Recovery was not successful - trying replication. core=collection1
[junit4:junit4]   2> 10852 T2527 C166 P16434 oasc.RecoveryStrategy.doRecovery Starting Replication Recovery. core=collection1
[junit4:junit4]   2> 10852 T2465 oascsi.HttpClientUtil.createClient Creating new http client, config:maxConnections=128&maxConnectionsPerHost=32&followRedirects=false
[junit4:junit4]   2> 10853 T2527 C166 P16434 oascsi.HttpClientUtil.createClient Creating new http client, config:maxConnections=128&maxConnectionsPerHost=32&followRedirects=false
[junit4:junit4]   2> 10854 T2491 C165 P16397 REQ /get {distrib=false&qt=/get&wt=javabin&version=2&getVersions=100} status=0 QTime=0 
[junit4:junit4]   2> 10904 T2486 oascc.ZkStateReader.updateClusterState Updating cloud state from ZooKeeper... 
[junit4:junit4]   2> 10916 T2499 oascc.ZkStateReader$2.process A cluster state change has occurred - updating...
[junit4:junit4]   2> 10916 T2525 oascc.ZkStateReader$2.process A cluster state change has occurred - updating...
[junit4:junit4]   2> 10916 T2511 oascc.ZkStateReader$2.process A cluster state change has occurred - updating...
[junit4:junit4]   2> 10916 T2485 oascc.ZkStateReader$2.process A cluster state change has occurred - updating...
[junit4:junit4]   2> 11152 T2465 oejs.Server.doStart jetty-8.1.2.v20120308
[junit4:junit4]   2> 11154 T2465 oejs.AbstractConnector.doStart Started SocketConnector@0.0.0.0:16442
[junit4:junit4]   2> 11155 T2465 oasc.SolrResourceLoader.locateSolrHome JNDI not configured for solr (NoInitialContextEx)
[junit4:junit4]   2> 11155 T2465 oasc.SolrResourceLoader.locateSolrHome using system property solr.solr.home: /usr/home/hudson/hudson-slave/workspace/Lucene-Solr-Tests-trunk-java7/solr/build/solr-core/test/J1/./solrtest-jetty4-1348042107145
[junit4:junit4]   2> 11156 T2465 oasc.SolrResourceLoader.<init> new SolrResourceLoader for deduced Solr Home: '/usr/home/hudson/hudson-slave/workspace/Lucene-Solr-Tests-trunk-java7/solr/build/solr-core/test/J1/./solrtest-jetty4-1348042107145/'
[junit4:junit4]   2> 11195 T2465 oass.SolrDispatchFilter.init SolrDispatchFilter.init()
[junit4:junit4]   2> 11195 T2465 oasc.SolrResourceLoader.locateSolrHome JNDI not configured for solr (NoInitialContextEx)
[junit4:junit4]   2> 11196 T2465 oasc.SolrResourceLoader.locateSolrHome using system property solr.solr.home: /usr/home/hudson/hudson-slave/workspace/Lucene-Solr-Tests-trunk-java7/solr/build/solr-core/test/J1/./solrtest-jetty4-1348042107145
[junit4:junit4]   2> 11196 T2465 oasc.CoreContainer$Initializer.initialize looking for solr.xml: /usr/home/hudson/hudson-slave/workspace/Lucene-Solr-Tests-trunk-java7/solr/build/solr-core/test/J1/./solrtest-jetty4-1348042107145/solr.xml
[junit4:junit4]   2> 11197 T2465 oasc.CoreContainer.<init> New CoreContainer 2124093754
[junit4:junit4]   2> 11198 T2465 oasc.CoreContainer.load Loading CoreContainer using Solr Home: '/usr/home/hudson/hudson-slave/workspace/Lucene-Solr-Tests-trunk-java7/solr/build/solr-core/test/J1/./solrtest-jetty4-1348042107145/'
[junit4:junit4]   2> 11198 T2465 oasc.SolrResourceLoader.<init> new SolrResourceLoader for directory: '/usr/home/hudson/hudson-slave/workspace/Lucene-Solr-Tests-trunk-java7/solr/build/solr-core/test/J1/./solrtest-jetty4-1348042107145/'
[junit4:junit4]   2> 11230 T2465 oasc.CoreContainer.load Registering Log Listener
[junit4:junit4]   2> 11246 T2465 oasc.CoreContainer.initZooKeeper Zookeeper client=127.0.0.1:16380/solr
[junit4:junit4]   2> 11247 T2465 oaz.ZooKeeper.<init> Initiating client connection, connectString=127.0.0.1:16380/solr sessionTimeout=5000 watcher=org.apache.solr.common.cloud.ConnectionManager@13f19f5e
[junit4:junit4]   2> 11248 T2538 oaz.ClientCnxn$SendThread.startConnect Opening socket connection to server /127.0.0.1:16380
[junit4:junit4]   2> 11248 T2465 oascc.ConnectionManager.waitForConnected Waiting for client to connect to ZooKeeper
[junit4:junit4]   2> 11249 T2538 oaz.ClientCnxn$SendThread.primeConnection Socket connection established to localhost/127.0.0.1:16380, initiating session
[junit4:junit4]   2> 11249 T2467 oazs.NIOServerCnxn$Factory.run Accepted socket connection from /140.211.11.196:16443
[junit4:junit4]   2> 11250 T2467 oazs.NIOServerCnxn.readConnectRequest Client attempting to establish new session at /140.211.11.196:16443
[junit4:junit4]   2> 11251 T2469 oazs.NIOServerCnxn.finishSessionInit Established session 0x139dd91fea30006 with negotiated timeout 5000 for client /140.211.11.196:16443
[junit4:junit4]   2> 11251 T2538 oaz.ClientCnxn$SendThread.readConnectResult Session establishment complete on server localhost/127.0.0.1:16380, sessionid = 0x139dd91fea30006, negotiated timeout = 5000
[junit4:junit4]   2> 11252 T2539 oascc.ConnectionManager.process Watcher org.apache.solr.common.cloud.ConnectionManager@13f19f5e name:ZooKeeperConnection Watcher:127.0.0.1:16380/solr got event WatchedEvent state:SyncConnected type:None path:null path:null type:None
[junit4:junit4]   2> 11252 T2465 oascc.ConnectionManager.waitForConnected Client is connected to ZooKeeper
[junit4:junit4]   2> 11253 T2470 oazs.PrepRequestProcessor.pRequest Got user-level KeeperException when processing sessionid:0x139dd91fea30006 type:create cxid:0x1 zxid:0xfffffffffffffffe txntype:unknown reqpath:n/a Error Path:/solr/overseer Error:KeeperErrorCode = NodeExists for /solr/overseer
[junit4:junit4]   2> 11254 T2470 oazs.PrepRequestProcessor.pRequest Got user-level KeeperException when processing sessionid:0x139dd91fea30006 type:create cxid:0x2 zxid:0xfffffffffffffffe txntype:unknown reqpath:n/a Error Path:/solr/overseer Error:KeeperErrorCode = NodeExists for /solr/overseer
[junit4:junit4]   2>  C164_STATE=coll:collection1 core:collection1 props:{shard=shard1, roles=null, state=recovering, core=collection1, collection=collection1, node_name=127.0.0.1:16413_solr, base_url=http://127.0.0.1:16413/solr}
[junit4:junit4]   2> 11260 T2513 C164 P16413 oasc.RecoveryStrategy.doRecovery Begin buffering updates. core=collection1
[junit4:junit4]   2> 11260 T2513 C164 P16413 oasu.UpdateLog.bufferUpdates Starting to buffer updates. FSUpdateLog{state=ACTIVE, tlog=null}
[junit4:junit4]   2> 11260 T2513 C164 P16413 oasc.RecoveryStrategy.replicate Attempting to replicate from http://127.0.0.1:16397/solr/collection1/. core=collection1
[junit4:junit4]   2> 11260 T2513 C164 P16413 oascsi.HttpClientUtil.createClient Creating new http client, config:maxConnections=128&maxConnectionsPerHost=32&followRedirects=false
[junit4:junit4]   2> 11262 T2465 oasc.ZkController.createEphemeralLiveNode Register node as live in ZooKeeper:/live_nodes/127.0.0.1:16442_solr
[junit4:junit4]   2> 11263 T2470 oazs.PrepRequestProcessor.pRequest Got user-level KeeperException when processing sessionid:0x139dd91fea30006 type:delete cxid:0x4 zxid:0xfffffffffffffffe txntype:unknown reqpath:n/a Error Path:/solr/live_nodes/127.0.0.1:16442_solr Error:KeeperErrorCode = NoNode for /solr/live_nodes/127.0.0.1:16442_solr
[junit4:junit4]   2> 11264 T2465 oascc.SolrZkClient.makePath makePath: /live_nodes/127.0.0.1:16442_solr
[junit4:junit4]   2> 11266 T2511 oascc.ZkStateReader$3.process Updating live nodes
[junit4:junit4]   2> 11266 T2485 oascc.ZkStateReader$3.process Updating live nodes
[junit4:junit4]   2> 11266 T2525 oascc.ZkStateReader$3.process Updating live nodes
[junit4:junit4]   2> 11266 T2499 oascc.ZkStateReader$3.process Updating live nodes
[junit4:junit4]   2> 11267 T2465 oashc.HttpShardHandlerFactory.getParameter Setting socketTimeout to: 0
[junit4:junit4]   2> 11267 T2465 oashc.HttpShardHandlerFactory.getParameter Setting urlScheme to: http://
[junit4:junit4]   2> 11268 T2465 oashc.HttpShardHandlerFactory.getParameter Setting connTimeout to: 0
[junit4:junit4]   2> 11268 T2465 oashc.HttpShardHandlerFactory.getParameter Setting maxConnectionsPerHost to: 20
[junit4:junit4]   2> 11269 T2465 oashc.HttpShardHandlerFactory.getParameter Setting corePoolSize to: 0
[junit4:junit4]   2> 11269 T2465 oashc.HttpShardHandlerFactory.getParameter Setting maximumPoolSize to: 2147483647
[junit4:junit4]   2> 11270 T2465 oashc.HttpShardHandlerFactory.getParameter Setting maxThreadIdleTime to: 5
[junit4:junit4]   2> 11270 T2465 oashc.HttpShardHandlerFactory.getParameter Setting sizeOfQueue to: -1
[junit4:junit4]   2> 11271 T2465 oashc.HttpShardHandlerFactory.getParameter Setting fairnessPolicy to: false
[junit4:junit4]   2> 11271 T2465 oascsi.HttpClientUtil.createClient Creating new http client, config:maxConnectionsPerHost=20&maxConnections=10000&socketTimeout=0&connTimeout=0&retry=false
[junit4:junit4]   2> 11275 T2494 C165 P16397 oasu.DirectUpdateHandler2.commit start commit{flags=0,_version_=0,optimize=false,openSearcher=true,waitSearcher=true,expungeDeletes=false,softCommit=false}
[junit4:junit4]   2> 11279 T2494 C165 P16397 oasc.SolrDeletionPolicy.onInit SolrDeletionPolicy.onInit: commits:num=1
[junit4:junit4]   2> 		commit{dir=NRTCachingDirectory(org.apache.lucene.store.NIOFSDirectory@/usr/home/hudson/hudson-slave/workspace/Lucene-Solr-Tests-trunk-java7/solr/build/solr-core/test/J1/org.apache.solr.cloud.SyncSliceTest-1348042096286/jetty1/index lockFactory=org.apache.lucene.store.NativeFSLockFactory@1dc1a940; maxCacheMB=48.0 maxMergeSizeMB=4.0),segFN=segments_1,generation=1,filenames=[segments_1]
[junit4:junit4]   2> 11280 T2494 C165 P16397 oasc.SolrDeletionPolicy.updateCommits newest commit = 1
[junit4:junit4]   2> 11281 T2494 C165 P16397 oass.SolrIndexSearcher.<init> Opening Searcher@16ef3b30 main
[junit4:junit4]   2> 11281 T2494 C165 P16397 oasu.DirectUpdateHandler2.commit end_commit_flush
[junit4:junit4]   2> 11283 T2500 oasc.SolrCore.registerSearcher [collection1] Registered new searcher Searcher@16ef3b30 main{StandardDirectoryReader(segments_1:1)}
[junit4:junit4]   2> 11283 T2494 C165 P16397 /update {waitSearcher=true&commit=true&commit_end_point=true&wt=javabin&softCommit=false&version=2} {commit=} 0 8
[junit4:junit4]   2> 11284 T2513 C164 P16413 oash.ReplicationHandler.inform Commits will be reserved for  10000
[junit4:junit4]   2> 11284 T2465 oascc.ZkStateReader.createClusterStateWatchersAndUpdate Updating cluster state from ZooKeeper... 
[junit4:junit4]   2> 11284 T2513 C164 P16413 oash.SnapPuller.<init>  No value set for 'pollInterval'. Timer Task not started.
[junit4:junit4]   2> 11286 T2495 C165 P16397 oash.ReplicationHandler.inform Commits will be reserved for  10000
[junit4:junit4]   2> 11286 T2495 C165 P16397 REQ /replication {command=indexversion&wt=javabin&qt=/replication&version=2} status=0 QTime=1 
[junit4:junit4]   2> 11290 T2513 C164 P16413 oasc.SolrDeletionPolicy.onInit SolrDeletionPolicy.onInit: commits:num=1
[junit4:junit4]   2> 		commit{dir=NRTCachingDirectory(org.apache.lucene.store.NIOFSDirectory@/usr/home/hudson/hudson-slave/workspace/Lucene-Solr-Tests-trunk-java7/solr/build/solr-core/test/J1/org.apache.solr.cloud.SyncSliceTest-1348042096286/jetty2/index lockFactory=org.apache.lucene.store.NativeFSLockFactory@57110261; maxCacheMB=48.0 maxMergeSizeMB=4.0),segFN=segments_1,generation=1,filenames=[segments_1]
[junit4:junit4]   2> 11291 T2513 C164 P16413 oasc.SolrDeletionPolicy.updateCommits newest commit = 1
[junit4:junit4]   2> 11291 T2465 oasc.CoreContainer.create Creating SolrCore 'collection1' using instanceDir: /usr/home/hudson/hudson-slave/workspace/Lucene-Solr-Tests-trunk-java7/solr/build/solr-core/test/J1/./solrtest-jetty4-1348042107145/collection1
[junit4:junit4]   2> 11292 T2513 C164 P16413 oasu.DirectUpdateHandler2.commit start commit{flags=0,_version_=0,optimize=false,openSearcher=true,waitSearcher=true,expungeDeletes=false,softCommit=false}
[junit4:junit4]   2> 11292 T2465 oasc.ZkController.createCollectionZkNode Check for collection zkNode:collection1
[junit4:junit4]   2> 11293 T2465 oasc.ZkController.createCollectionZkNode Collection zkNode exists
[junit4:junit4]   2> 11293 T2465 oasc.ZkController.readConfigName Load collection config from:/collections/collection1
[junit4:junit4]   2> 11294 T2465 oasc.SolrResourceLoader.<init> new SolrResourceLoader for directory: '/usr/home/hudson/hudson-slave/workspace/Lucene-Solr-Tests-trunk-java7/solr/build/solr-core/test/J1/./solrtest-jetty4-1348042107145/collection1/'
[junit4:junit4]   2> 11296 T2465 oasc.SolrResourceLoader.replaceClassLoader Adding 'file:/usr/home/hudson/hudson-slave/workspace/Lucene-Solr-Tests-trunk-java7/solr/build/solr-core/test/J1/solrtest-jetty4-1348042107145/collection1/lib/README' to classloader
[junit4:junit4]   2> 11296 T2513 C164 P16413 oasc.SolrDeletionPolicy.onCommit SolrDeletionPolicy.onCommit: commits:num=2
[junit4:junit4]   2> 		commit{dir=NRTCachingDirectory(org.apache.lucene.store.NIOFSDirectory@/usr/home/hudson/hudson-slave/workspace/Lucene-Solr-Tests-trunk-java7/solr/build/solr-core/test/J1/org.apache.solr.cloud.SyncSliceTest-1348042096286/jetty2/index lockFactory=org.apache.lucene.store.NativeFSLockFactory@57110261; maxCacheMB=48.0 maxMergeSizeMB=4.0),segFN=segments_1,generation=1,filenames=[segments_1]
[junit4:junit4]   2> 		commit{dir=NRTCachingDirectory(org.apache.lucene.store.NIOFSDirectory@/usr/home/hudson/hudson-slave/workspace/Lucene-Solr-Tests-trunk-java7/solr/build/solr-core/test/J1/org.apache.solr.cloud.SyncSliceTest-1348042096286/jetty2/index lockFactory=org.apache.lucene.store.NativeFSLockFactory@57110261; maxCacheMB=48.0 maxMergeSizeMB=4.0),segFN=segments_2,generation=2,filenames=[segments_2]
[junit4:junit4]   2> 11297 T2513 C164 P16413 oasc.SolrDeletionPolicy.updateCommits newest commit = 2
[junit4:junit4]   2> 11297 T2465 oasc.SolrResourceLoader.replaceClassLoader Adding 'file:/usr/home/hudson/hudson-slave/workspace/Lucene-Solr-Tests-trunk-java7/solr/build/solr-core/test/J1/solrtest-jetty4-1348042107145/collection1/lib/classes/' to classloader
[junit4:junit4]   2> 11301 T2513 C164 P16413 oass.SolrIndexSearcher.<init> Opening Searcher@507c8867 main
[junit4:junit4]   2> 11301 T2513 C164 P16413 oasu.DirectUpdateHandler2.commit end_commit_flush
[junit4:junit4]   2> 11302 T2512 oasc.SolrCore.registerSearcher [collection1] Registered new searcher Searcher@507c8867 main{StandardDirectoryReader(segments_2:2)}
[junit4:junit4]   2> 11303 T2513 C164 P16413 oasc.RecoveryStrategy.replay No replay needed. core=collection1
[junit4:junit4]   2> 11303 T2513 C164 P16413 oasc.RecoveryStrategy.doRecovery Replication Recovery was successful - registering as Active. core=collection1
[junit4:junit4]   2> 11304 T2513 C164 P16413 oasc.RecoveryStrategy.doRecovery Finished recovery process. core=collection1
[junit4:junit4]   2> 11374 T2465 oasc.SolrConfig.<init> Using Lucene MatchVersion: LUCENE_50
[junit4:junit4]   2> 11419 T2486 oascc.ZkStateReader.updateClusterState Updating cloud state from ZooKeeper... 
[junit4:junit4]   2> 11434 T2511 oascc.ZkStateReader$2.process A cluster state change has occurred - updating...
[junit4:junit4]   2> 11434 T2499 oascc.ZkStateReader$2.process A cluster state change has occurred - updating...
[junit4:junit4]   2> 11434 T2525 oascc.ZkStateReader$2.process A cluster state change has occurred - updating...
[junit4:junit4]   2> 11434 T2485 oascc.ZkStateReader$2.process A cluster state change has occurred - updating...
[junit4:junit4]   2> 11434 T2539 oascc.ZkStateReader$2.process A cluster state change has occurred - updating...
[junit4:junit4]   2> 11447 T2465 oasc.SolrConfig.<init> Loaded SolrConfig: solrconfig.xml
[junit4:junit4]   2> 11548 T2465 oass.IndexSchema.readSchema Reading Solr Schema
[junit4:junit4]   2> 11555 T2465 oass.IndexSchema.readSchema Schema name=test
[junit4:junit4]   2> 12287 T2465 oass.OpenExchangeRatesOrgProvider.init Initialized with rates=open-exchange-rates.json, refreshInterval=1440.
[junit4:junit4]   2> 12299 T2465 oass.IndexSchema.readSchema default search field in schema is text
[junit4:junit4]   2> 12303 T2465 oass.IndexSchema.readSchema unique key field: id
[junit4:junit4]   2> 12314 T2465 oass.FileExchangeRateProvider.reload Reloading exchange rates from file currency.xml
[junit4:junit4]   2> 12319 T2465 oass.FileExchangeRateProvider.reload Reloading exchange rates from file currency.xml
[junit4:junit4]   2> 12323 T2465 oass.OpenExchangeRatesOrgProvider.reload Reloading exchange rates from open-exchange-rates.json
[junit4:junit4]   2> 12324 T2465 oass.OpenExchangeRatesOrgProvider.reload Reloading exchange rates from open-exchange-rates.json
[junit4:junit4]   2> 12326 T2465 oasc.SolrCore.<init> [collection1] Opening new SolrCore at /usr/home/hudson/hudson-slave/workspace/Lucene-Solr-Tests-trunk-java7/solr/build/solr-core/test/J1/./solrtest-jetty4-1348042107145/collection1/, dataDir=./org.apache.solr.cloud.SyncSliceTest-1348042096286/jetty4/
[junit4:junit4]   2> 12326 T2465 oasc.JmxMonitoredMap.<init> JMX monitoring is enabled. Adding Solr mbeans to JMX Server: com.sun.jmx.mbeanserver.JmxMBeanServer@25930632
[junit4:junit4]   2> 12328 T2465 oasc.SolrCore.getNewIndexDir WARNING New index directory detected: old=null new=./org.apache.solr.cloud.SyncSliceTest-1348042096286/jetty4/index/
[junit4:junit4]   2> 12328 T2465 oasc.SolrCore.initIndex WARNING [collection1] Solr index directory './org.apache.solr.cloud.SyncSliceTest-1348042096286/jetty4/index' doesn't exist. Creating new index...
[junit4:junit4]   2> 12329 T2465 oasc.CachingDirectoryFactory.get return new directory for /usr/home/hudson/hudson-slave/workspace/Lucene-Solr-Tests-trunk-java7/solr/build/solr-core/test/J1/./org.apache.solr.cloud.SyncSliceTest-1348042096286/jetty4/index forceNew:false
[junit4:junit4]   2> 12359 T2465 oasc.SolrDeletionPolicy.onCommit SolrDeletionPolicy.onCommit: commits:num=1
[junit4:junit4]   2> 		commit{dir=NRTCachingDirectory(org.apache.lucene.store.NIOFSDirectory@/usr/home/hudson/hudson-slave/workspace/Lucene-Solr-Tests-trunk-java7/solr/build/solr-core/test/J1/org.apache.solr.cloud.SyncSliceTest-1348042096286/jetty4/index lockFactory=org.apache.lucene.store.NativeFSLockFactory@10a34632; maxCacheMB=48.0 maxMergeSizeMB=4.0),segFN=segments_1,generation=1,filenames=[segments_1]
[junit4:junit4]   2> 12360 T2465 oasc.SolrDeletionPolicy.updateCommits newest commit = 1
[junit4:junit4]   2> 12361 T2465 oasc.SolrCore.initWriters created xml: solr.XMLResponseWriter
[junit4:junit4]   2> 12364 T2465 oasup.UpdateRequestProcessorChain.init inserting DistributedUpdateProcessorFactory into updateRequestProcessorChain "dedupe"
[junit4:junit4]   2> 12364 T2465 oasup.UpdateRequestProcessorChain.init inserting DistributedUpdateProcessorFactory into updateRequestProcessorChain "dedupe-allfields"
[junit4:junit4]   2> 12365 T2465 oasup.UpdateRequestProcessorChain.init inserting DistributedUpdateProcessorFactory into updateRequestProcessorChain "stored_sig"
[junit4:junit4]   2> 12366 T2465 oasup.UpdateRequestProcessorChain.init inserting DistributedUpdateProcessorFactory into updateRequestProcessorChain "uniq-fields"
[junit4:junit4]   2> 12367 T2465 oasup.UpdateRequestProcessorChain.init inserting DistributedUpdateProcessorFactory into updateRequestProcessorChain "distrib-dup-test-chain-implicit"
[junit4:junit4]   2> 12367 T2465 oasc.RequestHandlers.initHandlersFromConfig adding lazy requestHandler: solr.ReplicationHandler
[junit4:junit4]   2> 12368 T2465 oasc.RequestHandlers.initHandlersFromConfig created /replication: solr.ReplicationHandler
[junit4:junit4]   2> 12369 T2465 oasc.RequestHandlers.initHandlersFromConfig created standard: solr.StandardRequestHandler
[junit4:junit4]   2> 12369 T2465 oasc.RequestHandlers.initHandlersFromConfig created /get: solr.RealTimeGetHandler
[junit4:junit4]   2> 12370 T2465 oasc.RequestHandlers.initHandlersFromConfig created dismax: solr.SearchHandler
[junit4:junit4]   2> 12371 T2465 oasc.RequestHandlers.initHandlersFromConfig created mock: org.apache.solr.core.MockQuerySenderListenerReqHandler
[junit4:junit4]   2> 12372 T2465 oasc.RequestHandlers.initHandlersFromConfig created /admin/: org.apache.solr.handler.admin.AdminHandlers
[junit4:junit4]   2> 12373 T2465 oasc.RequestHandlers.initHandlersFromConfig created defaults: solr.StandardRequestHandler
[junit4:junit4]   2> 12373 T2465 oasc.RequestHandlers.initHandlersFromConfig adding lazy requestHandler: solr.StandardRequestHandler
[junit4:junit4]   2> 12374 T2465 oasc.RequestHandlers.initHandlersFromConfig created lazy: solr.StandardRequestHandler
[junit4:junit4]   2> 12374 T2465 oasc.RequestHandlers.initHandlersFromConfig created /update: solr.UpdateRequestHandler
[junit4:junit4]   2> 12375 T2465 oasc.RequestHandlers.initHandlersFromConfig created /terms: org.apache.solr.handler.component.SearchHandler
[junit4:junit4]   2> 12376 T2465 oasc.RequestHandlers.initHandlersFromConfig created spellCheckCompRH: org.apache.solr.handler.component.SearchHandler
[junit4:junit4]   2> 12377 T2465 oasc.RequestHandlers.initHandlersFromConfig created spellCheckCompRH_Direct: org.apache.solr.handler.component.SearchHandler
[junit4:junit4]   2> 12377 T2465 oasc.RequestHandlers.initHandlersFromConfig created spellCheckWithWordbreak: org.apache.solr.handler.component.SearchHandler
[junit4:junit4]   2> 12378 T2465 oasc.RequestHandlers.initHandlersFromConfig created spellCheckWithWordbreak_Direct: org.apache.solr.handler.component.SearchHandler
[junit4:junit4]   2> 12379 T2465 oasc.RequestHandlers.initHandlersFromConfig created spellCheckCompRH1: org.apache.solr.handler.component.SearchHandler
[junit4:junit4]   2> 12380 T2465 oasc.RequestHandlers.initHandlersFromConfig created tvrh: org.apache.solr.handler.component.SearchHandler
[junit4:junit4]   2> 12381 T2465 oasc.RequestHandlers.initHandlersFromConfig created /mlt: solr.MoreLikeThisHandler
[junit4:junit4]   2> 12381 T2465 oasc.RequestHandlers.initHandlersFromConfig created /debug/dump: solr.DumpRequestHandler
[junit4:junit4]   2> 12385 T2465 oashl.XMLLoader.init xsltCacheLifetimeSeconds=60
[junit4:junit4]   2> 12390 T2465 oasc.SolrCore.initDeprecatedSupport WARNING solrconfig.xml uses deprecated <admin/gettableFiles>, Please update your config to use the ShowFileRequestHandler.
[junit4:junit4]   2> 12391 T2465 oasc.SolrCore.initDeprecatedSupport WARNING adding ShowFileRequestHandler with hidden files: [SCHEMA.XML, OLD_SYNONYMS.TXT, STOPWORDS.TXT, PROTWORDS.TXT, OPEN-EXCHANGE-RATES.JSON, SYNONYMS.TXT, CURRENCY.XML, MAPPING-ISOLATIN1ACCENT.TXT]
[junit4:junit4]   2> 12396 T2465 oass.SolrIndexSearcher.<init> Opening Searcher@5b426f64 main
[junit4:junit4]   2> 12397 T2465 oasu.CommitTracker.<init> Hard AutoCommit: disabled
[junit4:junit4]   2> 12398 T2465 oasu.CommitTracker.<init> Soft AutoCommit: disabled
[junit4:junit4]   2> 12398 T2465 oashc.SpellCheckComponent.inform Initializing spell checkers
[junit4:junit4]   2> 12406 T2465 oass.DirectSolrSpellChecker.init init: {name=direct,classname=DirectSolrSpellChecker,field=lowerfilt,minQueryLength=3}
[junit4:junit4]   2> 12546 T2540 oasc.SolrCore.registerSearcher [collection1] Registered new searcher Searcher@5b426f64 main{StandardDirectoryReader(segments_1:1)}
[junit4:junit4]   2> 12941 T2486 oascc.ZkStateReader.updateClusterState Updating cloud state from ZooKeeper... 
[junit4:junit4]   2> 12967 T2539 oascc.ZkStateReader$2.process A cluster state change has occurred - updating...
[junit4:junit4]   2> 12967 T2499 oascc.ZkStateReader$2.process A cluster state change has occurred - updating...
[junit4:junit4]   2> 12967 T2525 oascc.ZkStateReader$2.process A cluster state change has occurred - updating...
[junit4:junit4]   2> 12967 T2511 oascc.ZkStateReader$2.process A cluster state change has occurred - updating...
[junit4:junit4]   2> 12967 T2485 oascc.ZkStateReader$2.process A cluster state change has occurred - updating...
[junit4:junit4]   2> 13053 T2465 oasc.CoreContainer.register registering core: collection1
[junit4:junit4]   2> 13054 T2465 oasc.ZkController.register Register shard - core:collection1 address:http://127.0.0.1:16442/solr shardId:shard1
[junit4:junit4]   2> 13057 T2465 oasc.ZkController.register We are http://127.0.0.1:16442/solr/collection1/ and leader is http://127.0.0.1:16397/solr/collection1/
[junit4:junit4]   2> 13057 T2465 oasc.ZkController.register No LogReplay needed for core=collection1 baseURL=http://127.0.0.1:16442/solr
[junit4:junit4]   2> 13058 T2465 oasc.ZkController.checkRecovery Core needs to recover:collection1
[junit4:junit4]   2> 13058 T2465 oasu.DefaultSolrCoreState.doRecovery Running recovery - first canceling any ongoing recovery
[junit4:junit4]   2> ASYNC  NEW_CORE C167 name=collection1 org.apache.solr.core.SolrCore@336cd17d url=http://127.0.0.1:16442/solr/collection1 node=127.0.0.1:16442_solr
[junit4:junit4]   2> 13063 T2541 C167 P16442 oasc.RecoveryStrategy.run Starting recovery process.  core=collection1 recoveringAfterStartup=true
[junit4:junit4]   2> 13063 T2541 C167 P16442 oasc.RecoveryStrategy.doRecovery ###### startupVersions=[]
[junit4:junit4]   2> 13063 T2465 oascc.ZkStateReader.updateClusterState Updating cloud state from ZooKeeper... 
[junit4:junit4]   2> 13065 T2541 C167 P16442 oasc.RecoveryStrategy.doRecovery Attempting to PeerSync from http://127.0.0.1:16397/solr/collection1/ core=collection1 - recoveringAfterStartup=true
[junit4:junit4]   2> 13065 T2541 C167 P16442 oasu.PeerSync.sync PeerSync: core=collection1 url=http://127.0.0.1:16442/solr START replicas=[http://127.0.0.1:16397/solr/collection1/] nUpdates=100
[junit4:junit4]   2> 13065 T2465 oass.SolrDispatchFilter.init user.dir=/usr/home/hudson/hudson-slave/workspace/Lucene-Solr-Tests-trunk-java7/solr/build/solr-core/test/J1
[junit4:junit4]   2> 13065 T2541 C167 P16442 oasu.PeerSync.sync WARNING no frame of reference to tell of we've missed updates
[junit4:junit4]   2> 13065 T2465 oass.SolrDispatchFilter.init SolrDispatchFilter.init() done
[junit4:junit4]   2> 13066 T2541 C167 P16442 oasc.RecoveryStrategy.doRecovery PeerSync Recovery was not successful - trying replication. core=collection1
[junit4:junit4]   2> 13066 T2541 C167 P16442 oasc.RecoveryStrategy.doRecovery Starting Replication Recovery. core=collection1
[junit4:junit4]   2> 13066 T2465 oascsi.HttpClientUtil.createClient Creating new http client, config:maxConnections=128&maxConnectionsPerHost=32&followRedirects=false
[junit4:junit4]   2> 13066 T2541 C167 P16442 oascsi.HttpClientUtil.createClient Creating new http client, config:maxConnections=128&maxConnectionsPerHost=32&followRedirects=false
[junit4:junit4]   2> 13068 T2491 C165 P16397 REQ /get {distrib=false&qt=/get&wt=javabin&version=2&getVersions=100} status=0 QTime=0 
[junit4:junit4]   2> 13083 T2465 oaz.ZooKeeper.<init> Initiating client connection, connectString=127.0.0.1:16380/solr sessionTimeout=10000 watcher=org.apache.solr.common.cloud.ConnectionManager@59b00223
[junit4:junit4]   2> 13095 T2543 oaz.ClientCnxn$SendThread.startConnect Opening socket connection to server /127.0.0.1:16380
[junit4:junit4]   2> 13095 T2465 oascc.ConnectionManager.waitForConnected Waiting for client to connect to ZooKeeper
[junit4:junit4]   2> 13097 T2467 oazs.NIOServerCnxn$Factory.run Accepted socket connection from /140.211.11.196:16449
[junit4:junit4]   2> 13097 T2543 oaz.ClientCnxn$SendThread.primeConnection Socket connection established to localhost/127.0.0.1:16380, initiating session
[junit4:junit4]   2> 13098 T2467 oazs.NIOServerCnxn.readConnectRequest Client attempting to establish new session at /140.211.11.196:16449
[junit4:junit4]   2> 13099 T2469 oazs.NIOServerCnxn.finishSessionInit Established session 0x139dd91fea30007 with negotiated timeout 10000 for client /140.211.11.196:16449
[junit4:junit4]   2> 13099 T2543 oaz.ClientCnxn$SendThread.readConnectResult Session establishment complete on server localhost/127.0.0.1:16380, sessionid = 0x139dd91fea30007, negotiated timeout = 10000
[junit4:junit4]   2> 13099 T2544 oascc.ConnectionManager.process Watcher org.apache.solr.common.cloud.ConnectionManager@59b00223 name:ZooKeeperConnection Watcher:127.0.0.1:16380/solr got event WatchedEvent state:SyncConnected type:None path:null path:null type:None
[junit4:junit4]   2> 13100 T2465 oascc.ConnectionManager.waitForConnected Client is connected to ZooKeeper
[junit4:junit4]   2> 13101 T2465 oascc.ZkStateReader.createClusterStateWatchersAndUpdate Updating cluster state from ZooKeeper... 
[junit4:junit4]   2> 13130 T2465 oasc.ChaosMonkey.monkeyLog monkey: init - expire sessions:true cause connection loss:true
[junit4:junit4]   2> 13131 T2465 oascsi.HttpClientUtil.createClient Creating new http client, config:
[junit4:junit4]   2> 13142 T2465 oascc.ZkStateReader.updateClusterState Updating cloud state from ZooKeeper... 
[junit4:junit4]   2> 13143 T2465 oasc.AbstractFullDistribZkTestBase.waitForThingsToLevelOut Wait for recoveries to finish - wait 15 for each attempt
[junit4:junit4]   2> 13144 T2465 oasc.AbstractDistribZkTestBase.waitForRecoveriesToFinish Wait for recoveries to finish - collection: collection1 failOnTimeout:true timeout (sec):15
[junit4:junit4]   2> 13144 T2465 oascc.ZkStateReader.updateClusterState Updating cloud state from ZooKeeper... 
[junit4:junit4]   2> 13471 T2486 oascc.ZkStateReader.updateClusterState Updating cloud state from ZooKeeper... 
[junit4:junit4]   2> 13489 T2499 oascc.ZkStateReader$2.process A cluster state change has occurred - updating...
[junit4:junit4]   2> 13489 T2525 oascc.ZkStateReader$2.process A cluster state change has occurred - updating...
[junit4:junit4]   2> 13489 T2544 oascc.ZkStateReader$2.process A cluster state change has occurred - updating...
[junit4:junit4]   2> 13489 T2485 oascc.ZkStateReader$2.process A cluster state change has occurred - updating...
[junit4:junit4]   2> 13489 T2539 oascc.ZkStateReader$2.process A cluster state change has occurred - updating...
[junit4:junit4]   2> 13489 T2511 oascc.ZkStateReader$2.process A cluster state change has occurred - updating...
[junit4:junit4]   2>  C166_STATE=coll:collection1 core:collection1 props:{shard=shard1, roles=null, state=recovering, core=collection1, collection=collection1, node_name=127.0.0.1:16434_solr, base_url=http://127.0.0.1:16434/solr}
[junit4:junit4]   2> 13866 T2527 C166 P16434 oasc.RecoveryStrategy.doRecovery Begin buffering updates. core=collection1
[junit4:junit4]   2> 13866 T2527 C166 P16434 oasu.UpdateLog.bufferUpdates Starting to buffer updates. FSUpdateLog{state=ACTIVE, tlog=null}
[junit4:junit4]   2> 13866 T2527 C166 P16434 oasc.RecoveryStrategy.replicate Attempting to replicate from http://127.0.0.1:16397/solr/collection1/. core=collection1
[junit4:junit4]   2> 13867 T2527 C166 P16434 oascsi.HttpClientUtil.createClient Creating new http client, config:maxConnections=128&maxConnectionsPerHost=32&followRedirects=false
[junit4:junit4]   2> 13877 T2497 C165 P16397 oasu.DirectUpdateHandler2.commit start commit{flags=0,_version_=0,optimize=false,openSearcher=true,waitSearcher=true,expungeDeletes=false,softCommit=false}
[junit4:junit4]   2> 13884 T2497 C165 P16397 oass.SolrIndexSearcher.<init> Opening Searcher@6d9c91bd main
[junit4:junit4]   2> 13884 T2497 C165 P16397 oasu.DirectUpdateHandler2.commit end_commit_flush
[junit4:junit4]   2> 13886 T2500 oasc.SolrCore.registerSearcher [collection1] Registered new searcher Searcher@6d9c91bd main{StandardDirectoryReader(segments_1:1)}
[junit4:junit4]   2> 13886 T2497 C165 P16397 /update {waitSearcher=true&commit=true&commit_end_point=true&wt=javabin&softCommit=false&version=2} {commit=} 0 9
[junit4:junit4]   2> 13887 T2527 C166 P16434 oash.ReplicationHandler.inform Commits will be reserved for  10000
[junit4:junit4]   2> 13888 T2527 C166 P16434 oash.SnapPuller.<init>  No value set for 'pollInterval'. Timer Task not started.
[junit4:junit4]   2> 13890 T2495 C165 P16397 REQ /replication {command=indexversion&wt=javabin&qt=/replication&version=2} status=0 QTime=0 
[junit4:junit4]   2> 13895 T2527 C166 P16434 oasc.SolrDeletionPolicy.onInit SolrDeletionPolicy.onInit: commits:num=1
[junit4:junit4]   2> 		commit{dir=NRTCachingDirectory(org.apache.lucene.store.NIOFSDirectory@/usr/home/hudson/hudson-slave/workspace/Lucene-Solr-Tests-trunk-java7/solr/build/solr-core/test/J1/org.apache.solr.cloud.SyncSliceTest-1348042096286/jetty3/index lockFactory=org.apache.lucene.store.NativeFSLockFactory@1534954a; maxCacheMB=48.0 maxMergeSizeMB=4.0),segFN=segments_1,generation=1,filenames=[segments_1]
[junit4:junit4]   2> 13895 T2527 C166 P16434 oasc.SolrDeletionPolicy.updateCommits newest commit = 1
[junit4:junit4]   2> 13896 T2527 C166 P16434 oasu.DirectUpdateHandler2.commit start commit{flags=0,_version_=0,optimize=false,openSearcher=true,waitSearcher=true,expungeDeletes=false,softCommit=false}
[junit4:junit4]   2> 13899 T2527 C166 P16434 oasc.SolrDeletionPolicy.onCommit SolrDeletionPolicy.onCommit: commits:num=2
[junit4:junit4]   2> 		commit{dir=NRTCachingDirectory(org.apache.lucene.store.NIOFSDirectory@/usr/home/hudson/hudson-slave/workspace/Lucene-Solr-Tests-trunk-java7/solr/build/solr-core/test/J1/org.apache.solr.cloud.SyncSliceTest-1348042096286/jetty3/index lockFactory=org.apache.lucene.store.NativeFSLockFactory@1534954a; maxCacheMB=48.0 maxMergeSizeMB=4.0),segFN=segments_1,generation=1,filenames=[segments_1]
[junit4:junit4]   2> 		commit{dir=NRTCachingDirectory(org.apache.lucene.store.NIOFSDirectory@/usr/home/hudson/hudson-slave/workspace/Lucene-Solr-Tests-trunk-java7/solr/build/solr-core/test/J1/org.apache.solr.cloud.SyncSliceTest-1348042096286/jetty3/index lockFactory=org.apache.lucene.store.NativeFSLockFactory@1534954a; maxCacheMB=48.0 maxMergeSizeMB=4.0),segFN=segments_2,generation=2,filenames=[segments_2]
[junit4:junit4]   2> 13900 T2527 C166 P16434 oasc.SolrDeletionPolicy.updateCommits newest commit = 2
[junit4:junit4]   2> 13905 T2527 C166 P16434 oass.SolrIndexSearcher.<init> Opening Searcher@616bc0dc main
[junit4:junit4]   2> 13905 T2527 C166 P16434 oasu.DirectUpdateHandler2.commit end_commit_flush
[junit4:junit4]   2> 13907 T2526 oasc.SolrCore.registerSearcher [collection1] Registered new searcher Searcher@616bc0dc main{StandardDirectoryReader(segments_2:2)}
[junit4:junit4]   2> 13907 T2527 C166 P16434 oasc.RecoveryStrategy.replay No replay needed. core=collection1
[junit4:junit4]   2> 13907 T2527 C166 P16434 oasc.RecoveryStrategy.doRecovery Replication Recovery was successful - registering as Active. core=collection1
[junit4:junit4]   2> 13909 T2527 C166 P16434 oasc.RecoveryStrategy.doRecovery Finished recovery process. core=collection1
[junit4:junit4]   2> 13993 T2486 oascc.ZkStateReader.updateClusterState Updating cloud state from ZooKeeper... 
[junit4:junit4]   2> 14008 T2544 oascc.ZkStateReader$2.process A cluster state change has occurred - updating...
[junit4:junit4]   2> 14008 T2499 oascc.ZkStateReader$2.process A cluster state change has occurred - updating...
[junit4:junit4]   2> 14008 T2539 oascc.ZkStateReader$2.process A cluster state change has occurred - updating...
[junit4:junit4]   2> 14008 T2525 oascc.ZkStateReader$2.process A cluster state change has occurred - updating...
[junit4:junit4]   2> 14008 T2485 oascc.ZkStateReader$2.process A cluster state change has occurred - updating...
[junit4:junit4]   2> 14008 T2511 oascc.ZkStateReader$2.process A cluster state change has occurred - updating...
[junit4:junit4]   2> 14146 T2465 oascc.ZkStateReader.updateClusterState Updating cloud state from ZooKeeper... 
[junit4:junit4]   2> 15148 T2465 oascc.ZkStateReader.updateClusterState Updating cloud state from ZooKeeper... 
[junit4:junit4]   2>  C167_STATE=coll:collection1 core:collection1 props:{shard=shard1, roles=null, state=recovering, core=collection1, collection=collection1, node_name=127.0.0.1:16442_solr, base_url=http://127.0.0.1:16442/solr}
[junit4:junit4]   2> 16086 T2541 C167 P16442 oasc.RecoveryStrategy.doRecovery Begin buffering updates. core=collection1
[junit4:junit4]   2> 16086 T2541 C167 P16442 oasu.UpdateLog.bufferUpdates Starting to buffer updates. FSUpdateLog{state=ACTIVE, tlog=null}
[junit4:junit4]   2> 16086 T2541 C167 P16442 oasc.RecoveryStrategy.replicate Attempting to replicate from http://127.0.0.1:16397/solr/collection1/. core=collection1
[junit4:junit4]   2> 16086 T2541 C167 P16442 oascsi.HttpClientUtil.createClient Creating new http client, config:maxConnections=128&maxConnectionsPerHost=32&followRedirects=false
[junit4:junit4]   2> 16102 T2492 C165 P16397 oasu.DirectUpdateHandler2.commit start commit{flags=0,_version_=0,optimize=false,openSearcher=true,waitSearcher=true,expungeDeletes=false,softCommit=false}
[junit4:junit4]   2> 16105 T2492 C165 P16397 oass.SolrIndexSearcher.<init> Opening Searcher@68c60997 main
[junit4:junit4]   2> 16105 T2492 C165 P16397 oasu.DirectUpdateHandler2.commit end_commit_flush
[junit4:junit4]   2> 16107 T2500 oasc.SolrCore.registerSearcher [collection1] Registered new searcher Searcher@68c60997 main{StandardDirectoryReader(segments_1:1)}
[junit4:junit4]   2> 16107 T2492 C165 P16397 /update {waitSearcher=true&commit=true&commit_end_point=true&wt=javabin&softCommit=false&version=2} {commit=} 0 5
[junit4:junit4]   2> 16108 T2541 C167 P16442 oash.ReplicationHandler.inform Commits will be reserved for  10000
[junit4:junit4]   2> 16108 T2541 C167 P16442 oash.SnapPuller.<init>  No value set for 'pollInterval'. Timer Task not started.
[junit4:junit4]   2> 16110 T2495 C165 P16397 REQ /replication {command=indexversion&wt=javabin&qt=/replication&version=2} status=0 QTime=0 
[junit4:junit4]   2> 16115 T2541 C167 P16442 oasc.SolrDeletionPolicy.onInit SolrDeletionPolicy.onInit: commits:num=1
[junit4:junit4]   2> 		commit{dir=NRTCachingDirectory(org.apache.lucene.store.NIOFSDirectory@/usr/home/hudson/hudson-slave/workspace/Lucene-Solr-Tests-trunk-java7/solr/build/solr-core/test/J1/org.apache.solr.cloud.SyncSliceTest-1348042096286/jetty4/index lockFactory=org.apache.lucene.store.NativeFSLockFactory@10a34632; maxCacheMB=48.0 maxMergeSizeMB=4.0),segFN=segments_1,generation=1,filenames=[segments_1]
[junit4:junit4]   2> 16116 T2541 C167 P16442 oasc.SolrDeletionPolicy.updateCommits newest commit = 1
[junit4:junit4]   2> 16116 T2541 C167 P16442 oasu.DirectUpdateHandler2.commit start commit{flags=0,_version_=0,optimize=false,openSearcher=true,waitSearcher=true,expungeDeletes=false,softCommit=false}
[junit4:junit4]   2> 16146 T2541 C167 P16442 oasc.SolrDeletionPolicy.onCommit SolrDeletionPolicy.onCommit: commits:num=2
[junit4:junit4]   2> 		commit{dir=NRTCachingDirectory(org.apache.lucene.store.NIOFSDirectory@/usr/home/hudson/hudson-slave/workspace/Lucene-Solr-Tests-trunk-java7/solr/build/solr-core/test/J1/org.apache.solr.cloud.SyncSliceTest-1348042096286/jetty4/index lockFactory=org.apache.lucene.store.NativeFSLockFactory@10a34632; maxCacheMB=48.0 maxMergeSizeMB=4.0),segFN=segments_1,generation=1,filenames=[segments_1]
[junit4:junit4]   2> 		commit{dir=NRTCachingDirectory(org.apache.lucene.store.NIOFSDirectory@/usr/home/hudson/hudson-slave/workspace/Lucene-Solr-Tests-trunk-java7/solr/build/solr-core/test/J1/org.apache.solr.cloud.SyncSliceTest-1348042096286/jetty4/index lockFactory=org.apache.lucene.store.NativeFSLockFactory@10a34632; maxCacheMB=48.0 maxMergeSizeMB=4.0),segFN=segments_2,generation=2,filenames=[segments_2]
[junit4:junit4]   2> 16147 T2541 C167 P16442 oasc.SolrDeletionPolicy.updateCommits newest commit = 2
[junit4:junit4]   2> 16150 T2541 C167 P16442 oass.SolrIndexSearcher.<init> Opening Searcher@26c1951d main
[junit4:junit4]   2> 16150 T2541 C167 P16442 oasu.DirectUpdateHandler2.commit end_commit_flush
[junit4:junit4]   2> 16150 T2465 oascc.ZkStateReader.updateClusterState Updating cloud state from ZooKeeper... 
[junit4:junit4]   2> 16151 T2540 oasc.SolrCore.registerSearcher [collection1] Registered new searcher Searcher@26c1951d main{StandardDirectoryReader(segments_2:2)}
[junit4:junit4]   2> 16152 T2541 C167 P16442 oasc.RecoveryStrategy.replay No replay needed. core=collection1
[junit4:junit4]   2> 16152 T2541 C167 P16442 oasc.RecoveryStrategy.doRecovery Replication Recovery was successful - registering as Active. core=collection1
[junit4:junit4]   2> 16153 T2541 C167 P16442 oasc.RecoveryStrategy.doRecovery Finished recovery process. core=collection1
[junit4:junit4]   2> 16520 T2486 oascc.ZkStateReader.updateClusterState Updating cloud state from ZooKeeper... 
[junit4:junit4]   2> 16533 T2511 oascc.ZkStateReader$2.process A cluster state change has occurred - updating...
[junit4:junit4]   2> 16533 T2499 oascc.ZkStateReader$2.process A cluster state change has occurred - updating...
[junit4:junit4]   2> 16533 T2485 oascc.ZkStateReader$2.process A cluster state change has occurred - updating...
[junit4:junit4]   2> 16533 T2539 oascc.ZkStateReader$2.process A cluster state change has occurred - updating...
[junit4:junit4]   2> 16533 T2525 oascc.ZkStateReader$2.process A cluster state change has occurred - updating...
[junit4:junit4]   2> 16533 T2544 oascc.ZkStateReader$2.process A cluster state change has occurred - updating...
[junit4:junit4]   2> 17153 T2465 oascc.ZkStateReader.updateClusterState Updating cloud state from ZooKeeper... 
[junit4:junit4]   2> ASYNC  NEW_CORE C168 name=collection1 org.apache.solr.core.SolrCore@7210e63a url=http://127.0.0.1:16383/solr/collection1 node=127.0.0.1:16383_solr
[junit4:junit4]   2> 17164 T2477 C168 P16383 oasu.DirectUpdateHandler2.commit start commit{flags=0,_version_=0,optimize=false,openSearcher=true,waitSearcher=true,expungeDeletes=false,softCommit=false}
[junit4:junit4]   2> 17169 T2477 C168 P16383 oasc.SolrDeletionPolicy.onInit SolrDeletionPolicy.onInit: commits:num=1
[junit4:junit4]   2> 		commit{dir=NRTCachingDirectory(org.apache.lucene.store.NIOFSDirectory@/usr/home/hudson/hudson-slave/workspace/Lucene-Solr-Tests-trunk-java7/solr/build/solr-core/test/J1/org.apache.solr.cloud.SyncSliceTest-1348042096286/control/data/index lockFactory=org.apache.lucene.store.NativeFSLockFactory@20e37c93; maxCacheMB=48.0 maxMergeSizeMB=4.0),segFN=segments_1,generation=1,filenames=[segments_1]
[junit4:junit4]   2> 17170 T2477 C168 P16383 oasc.SolrDeletionPolicy.updateCommits newest commit = 1
[junit4:junit4]   2> 17172 T2477 C168 P16383 oass.SolrIndexSearcher.<init> Opening Searcher@545befae main
[junit4:junit4]   2> 17173 T2477 C168 P16383 oasu.DirectUpdateHandler2.commit end_commit_flush
[junit4:junit4]   2> 17174 T2488 oasc.SolrCore.registerSearcher [collection1] Registered new searcher Searcher@545befae main{StandardDirectoryReader(segments_1:1)}
[junit4:junit4]   2> 17175 T2477 C168 P16383 /update {waitSearcher=true&wt=javabin&commit=true&softCommit=false&version=2} {commit=} 0 11
[junit4:junit4]   2> 17175 T2465 oaz.ZooKeeper.<init> Initiating client connection, connectString=127.0.0.1:16380/solr sessionTimeout=10000 watcher=org.apache.solr.common.cloud.ConnectionManager@5fd4b3c6
[junit4:junit4]   2> 17176 T2545 oaz.ClientCnxn$SendThread.startConnect Opening socket connection to server /127.0.0.1:16380
[junit4:junit4]   2> 17177 T2465 oascc.ConnectionManager.waitForConnected Waiting for client to connect to ZooKeeper
[junit4:junit4]   2> 17177 T2545 oaz.ClientCnxn$SendThread.primeConnection Socket connection established to localhost/127.0.0.1:16380, initiating session
[junit4:junit4]   2> 17178 T2467 oazs.NIOServerCnxn$Factory.run Accepted socket connection from /140.211.11.196:16457
[junit4:junit4]   2> 17178 T2467 oazs.NIOServerCnxn.readConnectRequest Client attempting to establish new session at /140.211.11.196:16457
[junit4:junit4]   2> 17179 T2469 oazs.NIOServerCnxn.finishSessionInit Established session 0x139dd91fea30008 with negotiated timeout 10000 for client /140.211.11.196:16457
[junit4:junit4]   2> 17180 T2545 oaz.ClientCnxn$SendThread.readConnectResult Session establishment complete on server localhost/127.0.0.1:16380, sessionid = 0x139dd91fea30008, negotiated timeout = 10000
[junit4:junit4]   2> 17180 T2546 oascc.ConnectionManager.process Watcher org.apache.solr.common.cloud.ConnectionManager@5fd4b3c6 name:ZooKeeperConnection Watcher:127.0.0.1:16380/solr got event WatchedEvent state:SyncConnected type:None path:null path:null type:None
[junit4:junit4]   2> 17180 T2465 oascc.ConnectionManager.waitForConnected Client is connected to ZooKeeper
[junit4:junit4]   2> 17181 T2465 oascc.ZkStateReader.createClusterStateWatchersAndUpdate Updating cluster state from ZooKeeper... 
[junit4:junit4]   2> 17184 T2494 C165 P16397 oasu.DirectUpdateHandler2.commit start commit{flags=0,_version_=0,optimize=false,openSearcher=true,waitSearcher=true,expungeDeletes=false,softCommit=false}
[junit4:junit4]   2> 17187 T2494 C165 P16397 oass.SolrIndexSearcher.<init> Opening Searcher@77860f95 main
[junit4:junit4]   2> 17187 T2494 C165 P16397 oasu.DirectUpdateHandler2.commit end_commit_flush
[junit4:junit4]   2> 17189 T2500 oasc.SolrCore.registerSearcher [collection1] Registered new searcher Searcher@77860f95 main{StandardDirectoryReader(segments_1:1)}
[junit4:junit4]   2> 17189 T2494 C165 P16397 oasu.SolrCmdDistributor.distribCommit Distrib commit to:[StdNode: http://127.0.0.1:16413/solr/collection1/, StdNode: http://127.0.0.1:16434/solr/collection1/, StdNode: http://127.0.0.1:16442/solr/collection1/]
[junit4:junit4]   2>  C164_STATE=coll:collection1 core:collection1 props:{shard=shard1, roles=null, state=active, core=collection1, collection=collection1, node_name=127.0.0.1:16413_solr, base_url=http://127.0.0.1:16413/solr}
[junit4:junit4]   2> 17200 T2503 C164 P16413 oasu.DirectUpdateHandler2.commit start commit{flags=0,_version_=0,optimize=false,openSearcher=true,waitSearcher=true,expungeDeletes=false,softCommit=false}
[junit4:junit4]   2>  C166_STATE=coll:collection1 core:collection1 props:{shard=shard1, roles=null, state=active, core=collection1, collection=collection1, node_name=127.0.0.1:16434_solr, base_url=http://127.0.0.1:16434/solr}
[junit4:junit4]   2> 17204 T2517 C166 P16434 oasu.DirectUpdateHandler2.commit start commit{flags=0,_version_=0,optimize=false,openSearcher=true,waitSearcher=true,expungeDeletes=false,softCommit=false}
[junit4:junit4]   2> 17207 T2503 C164 P16413 oass.SolrIndexSearcher.<init> Opening Searcher@2561e4cd main
[junit4:junit4]   2> 17207 T2503 C164 P16413 oasu.DirectUpdateHandler2.commit end_commit_flush
[junit4:junit4]   2> 17208 T2517 C166 P16434 oass.SolrIndexSearcher.<init> Opening Searcher@7747a477 main
[junit4:junit4]   2> 17209 T2517 C166 P16434 oasu.DirectUpdateHandler2.commit end_commit_flush
[junit4:junit4]   2>  C167_STATE=coll:collection1 core:collection1 props:{shard=shard1, roles=null, state=active, core=collection1, collection=collection1, node_name=127.0.0.1:16442_solr, base_url=http://127.0.0.1:16442/solr}
[junit4:junit4]   2> 17209 T2531 C167 P16442 oasu.DirectUpdateHandler2.commit start commit{flags=0,_version_=0,optimize=false,openSearcher=true,waitSearcher=true,expungeDeletes=false,softCommit=false}
[junit4:junit4]   2> 17209 T2512 oasc.SolrCore.registerSearcher [collection1] Registered new searcher Searcher@2561e4cd main{StandardDirectoryReader(segments_2:2)}
[junit4:junit4]   2> 17233 T2503 C164 P16413 /update {waitSearcher=true&commit=true&wt=javabin&commit_end_point=true&expungeDeletes=false&softCommit=false&version=2} {commit=} 0 33
[junit4:junit4]   2> 17268 T2526 oasc.SolrCore.registerSearcher [collection1] Registered new searcher Searcher@7747a477 main{StandardDirectoryReader(segments_2:2)}
[junit4:junit4]   2> 17269 T2531 C167 P16442 oass.SolrIndexSearcher.<init> Opening Searcher@23b15343 main
[junit4:junit4]   2> 17269 T2517 C166 P16434 /update {waitSearcher=true&commit=true&wt=javabin&commit_end_point=true&expungeDeletes=false&softCommit=false&version=2} {commit=} 0 65
[junit4:junit4]   2> 17270 T2531 C167 P16442 oasu.DirectUpdateHandler2.commit end_commit_flush
[junit4:junit4]   2> 17271 T2540 oasc.SolrCore.registerSearcher [collection1] Registered new searcher Searcher@23b15343 main{StandardDirectoryReader(segments_2:2)}
[junit4:junit4]   2> 17272 T2531 C167 P16442 /update {waitSearcher=true&commit=true&wt=javabin&commit_end_point=true&expungeDeletes=false&softCommit=false&version=2} {commit=} 0 63
[junit4:junit4]   2> 17272 T2494 C165 P16397 /update {waitSearcher=true&wt=javabin&commit=true&softCommit=false&version=2} {commit=} 0 88
[junit4:junit4]   2> 17274 T2465 oascc.ZkStateReader.updateClusterState Updating cloud state from ZooKeeper... 
[junit4:junit4]   2> 17276 T2493 C165 P16397 REQ /select {distrib=false&wt=javabin&q=*:*&version=2} hits=0 status=0 QTime=0 
[junit4:junit4]   2> 17278 T2504 C164 P16413 REQ /select {distrib=false&wt=javabin&q=*:*&version=2} hits=0 status=0 QTime=0 
[junit4:junit4]   2> 17280 T2518 C166 P16434 REQ /select {distrib=false&wt=javabin&q=*:*&version=2} hits=0 status=0 QTime=0 
[junit4:junit4]   2> 17282 T2532 C167 P16442 REQ /select {distrib=false&wt=javabin&q=*:*&version=2} hits=0 status=0 QTime=1 
[junit4:junit4]   2> 19287 T2477 C168 P16383 oass.SolrIndexSearcher.<init> Opening Searcher@1eebaef5 realtime
[junit4:junit4]   2> 19287 T2477 C168 P16383 /update {wt=javabin&version=2} {deleteByQuery=*:* (-1413524609372782592)} 0 2
[junit4:junit4]   2> 19291 T2494 C165 P16397 oass.SolrIndexSearcher.<init> Opening Searcher@16626cc9 realtime
[junit4:junit4]   2> 19295 T2503 C164 P16413 oass.SolrIndexSearcher.<init> Opening Searcher@5b24e1b3 realtime
[junit4:junit4]   2> 19295 T2517 C166 P16434 oass.SolrIndexSearcher.<init> Opening Searcher@45bb07d0 realtime
[junit4:junit4]   2> 19295 T2531 C167 P16442 oass.SolrIndexSearcher.<init> Opening Searcher@525ddd84 realtime
[junit4:junit4]   2> 19296 T2503 C164 P16413 REQ /update {update.distrib=FROMLEADER&_version_=-1413524609378025472&update.from=http://127.0.0.1:16397/solr/collection1/&wt=javabin&version=2} status=0 QTime=2 
[junit4:junit4]   2> 19296 T2517 C166 P16434 REQ /update {update.distrib=FROMLEADER&_version_=-1413524609378025472&update.from=http://127.0.0.1:16397/solr/collection1/&wt=javabin&version=2} status=0 QTime=2 
[junit4:junit4]   2> 19296 T2531 C167 P16442 REQ /update {update.distrib=FROMLEADER&_version_=-1413524609378025472&update.from=http://127.0.0.1:16397/solr/collection1/&wt=javabin&version=2} status=0 QTime=2 
[junit4:junit4]   2> 19297 T2494 C165 P16397 /update {wt=javabin&version=2} {deleteByQuery=*:* (-1413524609378025472)} 0 7
[junit4:junit4]   2> 19302 T2477 C168 P16383 /update {wt=javabin&version=2} {add=[0 (1413524609388511232)]} 0 2
[junit4:junit4]   2> 19311 T2531 C167 P16442 REQ /update {distrib.from=http://127.0.0.1:16397/solr/collection1/&update.distrib=FROMLEADER&wt=javabin&version=2} status=0 QTime=2 
[junit4:junit4]   2> 19311 T2517 C166 P16434 REQ /update {distrib.from=http://127.0.0.1:16397/solr/collection1/&update.distrib=FROMLEADER&wt=javabin&version=2} status=0 QTime=2 
[junit4:junit4]   2> 19311 T2503 C164 P16413 REQ /update {distrib.from=http://127.0.0.1:16397/solr/collection1/&update.distrib=FROMLEADER&wt=javabin&version=2} status=0 QTime=2 
[junit4:junit4]   2> 19312 T2494 C165 P16397 /update {wt=javabin&version=2} {add=[0 (1413524609393754112)]} 0 7
[junit4:junit4]   2> 19315 T2477 C168 P16383 /update {wt=javabin&version=2} {add=[1 (1413524609404239872)]} 0 0
[junit4:junit4]   2> 19320 T2531 C167 P16442 REQ /update {distrib.from=http://127.0.0.1:16397/solr/collection1/&update.distrib=FROMLEADER&wt=javabin&version=2} status=0 QTime=0 
[junit4:junit4]   2> 19321 T2517 C166 P16434 REQ /update {distrib.from=http://127.0.0.1:16397/solr/collection1/&update.distrib=FROMLEADER&wt=javabin&version=2} status=0 QTime=1 
[junit4:junit4]   2> 19321 T2503 C164 P16413 REQ /update {distrib.from=http://127.0.0.1:16397/solr/collection1/&update.distrib=FROMLEADER&wt=javabin&version=2} status=0 QTime=1 
[junit4:junit4]   2> 19322 T2494 C165 P16397 /update {wt=javabin&version=2} {add=[1 (1413524609407385600)]} 0 4
[junit4:junit4]   2> 19324 T2477 C168 P16383 /update {wt=javabin&version=2} {add=[2 (1413524609413677056)]} 0 0
[junit4:junit4]   2> 19330 T2531 C167 P16442 REQ /update {distrib.from=http://127.0.0.1:16397/solr/collection1/&update.distrib=FROMLEADER&test.distrib.skip.servers=http://127.0.0.1:16413/solr/collection1/&wt=javabin&version=2} status=0 QTime=0 
[junit4:junit4]   2> 19330 T2517 C166 P16434 REQ /update {distrib.from=http://127.0.0.1:16397/solr/collection1/&update.distrib=FROMLEADER&test.distrib.skip.servers=http://127.0.0.1:16413/solr/collection1/&wt=javabin&version=2} status=0 QTime=0 
[junit4:junit4]   2> 19331 T2494 C165 P16397 /update {test.distrib.skip.servers=http://127.0.0.1:16413/solr/collection1/&wt=javabin&version=2} {add=[2 (1413524609416822784)]} 0 4
[junit4:junit4]   2> 19334 T2477 C168 P16383 /update {wt=javabin&version=2} {add=[3 (1413524609424162816)]} 0 0
[junit4:junit4]   2> 19340 T2531 C167 P16442 REQ /update {distrib.from=http://127.0.0.1:16397/solr/collection1/&update.distrib=FROMLEADER&test.distrib.skip.servers=http://127.0.0.1:16413/solr/collection1/&test.distrib.skip.servers=http://127.0.0.1:16434/solr/collection1/&wt=javabin&version=2} status=0 QTime=0 
[junit4:junit4]   2> 19341 T2494 C165 P16397 /update {test.distrib.skip.servers=http://127.0.0.1:16413/solr/collection1/&test.distrib.skip.servers=http://127.0.0.1:16434/solr/collection1/&wt=javabin&version=2} {add=[3 (1413524609427308544)]} 0 4
[junit4:junit4]   2> 19344 T2477 C168 P16383 oasu.DirectUpdateHandler2.commit start commit{flags=0,_version_=0,optimize=false,openSearcher=true,waitSearcher=true,expungeDeletes=false,softCommit=false}
[junit4:junit4]   2> 19545 T2477 C168 P16383 oasc.SolrDeletionPolicy.onCommit SolrDeletionPolicy.onCommit: commits:num=2
[junit4:junit4]   2> 		commit{dir=NRTCachingDirectory(org.apache.lucene.store.NIOFSDirectory@/usr/home/hudson/hudson-slave/workspace/Lucene-Solr-Tests-trunk-java7/solr/build/solr-core/test/J1/org.apache.solr.cloud.SyncSliceTest-1348042096286/control/data/index lockFactory=org.apache.lucene.store.NativeFSLockFactory@20e37c93; maxCacheMB=48.0 maxMergeSizeMB=4.0),segFN=segments_1,generation=1,filenames=[segments_1]
[junit4:junit4]   2> 		commit{dir=NRTCachingDirectory(org.apache.lucene.store.NIOFSDirectory@/usr/home/hudson/hudson-slave/workspace/Lucene-Solr-Tests-trunk-java7/solr/build/solr-core/test/J1/org.apache.solr.cloud.SyncSliceTest-1348042096286/control/data/index lockFactory=org.apache.lucene.store.NativeFSLockFactory@20e37c93; maxCacheMB=48.0 maxMergeSizeMB=4.0),segFN=segments_2,generation=2,filenames=[_0_MockVariableIntBlock_0.doc, _0_MockVariableIntBlock_0.skp, _0_Pulsing40_0.prx, _0_MockFixedIntBlock_0.tib, _0_Pulsing40_0.frq, _0_MockVariableIntBlock_0.pyl, _0_MockFixedIntBlock_0.skp, _0_MockFixedIntBlock_0.pyl, _0_MockVariableIntBlock_0.tib, _0_MockFixedIntBlock_0.tii, _0_MockVariableIntBlock_0.pos, _0_Pulsing40_0.tip, _0.si, _0_MockVariableIntBlock_0.tii, _0.fnm, _0_Pulsing40_0.tim, _0_Memory_0.ram, _0_MockFixedIntBlock_0.pos, _0_nrm.cfs, _0_MockFixedIntBlock_0.frq, _0_MockFixedIntBlock_0.doc, _0_nrm.cfe, _0_MockVariableIntBlock_0.frq, segments_2, _0.fdx, _0.fdt]
[junit4:junit4]   2> 19546 T2477 C168 P16383 oasc.SolrDeletionPolicy.updateCommits newest commit = 2
[junit4:junit4]   2> 19562 T2477 C168 P16383 oass.SolrIndexSearcher.<init> Opening Searcher@1f1f3c6d main
[junit4:junit4]   2> 19562 T2477 C168 P16383 oasu.DirectUpdateHandler2.commit end_commit_flush
[junit4:junit4]   2> 19564 T2488 oasc.SolrCore.registerSearcher [collection1] Registered new searcher Searcher@1f1f3c6d main{StandardDirectoryReader(segments_2:3:nrt _0(5.0):C4)}
[junit4:junit4]   2> 19565 T2477 C168 P16383 /update {waitSearcher=true&wt=javabin&commit=true&softCommit=false&version=2} {commit=} 0 221
[junit4:junit4]   2> 19567 T2494 C165 P16397 oasu.DirectUpdateHandler2.commit start commit{flags=0,_version_=0,optimize=false,openSearcher=true,waitSearcher=true,expungeDeletes=false,softCommit=false}
[junit4:junit4]   2> 19674 T2494 C165 P16397 oasc.SolrDeletionPolicy.onCommit SolrDeletionPolicy.onCommit: commits:num=2
[junit4:junit4]   2> 		commit{dir=NRTCachingDirectory(org.apache.lucene.store.NIOFSDirectory@/usr/home/hudson/hudson-slave/workspace/Lucene-Solr-Tests-trunk-java7/solr/build/solr-core/test/J1/org.apache.solr.cloud.SyncSliceTest-1348042096286/jetty1/index lockFactory=org.apache.lucene.store.NativeFSLockFactory@1dc1a940; maxCacheMB=48.0 maxMergeSizeMB=4.0),segFN=segments_1,generation=1,filenames=[segments_1]
[junit4:junit4]   2> 		commit{dir=NRTCachingDirectory(org.apache.lucene.store.NIOFSDirectory@/usr/home/hudson/hudson-slave/workspace/Lucene-Solr-Tests-trunk-java7/solr/build/solr-core/test/J1/org.apache.solr.cloud.SyncSliceTest-1348042096286/jetty1/index lockFactory=org.apache.lucene.store.NativeFSLockFactory@1dc1a940; maxCacheMB=48.0 maxMergeSizeMB=4.0),segFN=segments_2,generation=2,filenames=[_0_MockVariableIntBlock_0.doc, _0_MockVariableIntBlock_0.skp, _0_Pulsing40_0.prx, _0_MockFixedIntBlock_0.tib, _0_Pulsing40_0.frq, _0_MockVariableIntBlock_0.pyl, _0_MockFixedIntBlock_0.skp, _0_MockFixedIntBlock_0.pyl, _0_MockVariableIntBlock_0.tib, _0_MockFixedIntBlock_0.tii, _0_MockVariableIntBlock_0.pos, _0_Pulsing40_0.tip, _0.si, _0_MockVariableIntBlock_0.tii, _0.fnm, _0_Pulsing40_0.tim, _0_Memory_0.ram, _0_MockFixedIntBlock_0.pos, _0_nrm.cfs, _0_MockFixedIntBlock_0.frq, _0_MockFixedIntBlock_0.doc, _0_nrm.cfe, _0_MockVariableIntBlock_0.frq, segments_2, _0.fdx, _0.fdt]
[junit4:junit4]   2> 19675 T2494 C165 P16397 oasc.SolrDeletionPolicy.updateCommits newest commit = 2
[junit4:junit4]   2> 19687 T2494 C165 P16397 oass.SolrIndexSearcher.<init> Opening Searcher@33610065 main
[junit4:junit4]   2> 19688 T2494 C165 P16397 oasu.DirectUpdateHandler2.commit end_commit_flush
[junit4:junit4]   2> 19689 T2500 oasc.SolrCore.registerSearcher [collection1] Registered new searcher Searcher@33610065 main{StandardDirectoryReader(segments_2:3:nrt _0(5.0):C4)}
[junit4:junit4]   2> 19690 T2494 C165 P16397 oasu.SolrCmdDistributor.distribCommit Distrib commit to:[StdNode: http://127.0.0.1:16413/solr/collection1/, StdNode: http://127.0.0.1:16434/solr/collection1/, StdNode: http://127.0.0.1:16442/solr/collection1/]
[junit4:junit4]   2> 19692 T2517 C166 P16434 oasu.DirectUpdateHandler2.commit start commit{flags=0,_version_=0,optimize=false,openSearcher=true,waitSearcher=true,expungeDeletes=false,softCommit=false}
[junit4:junit4]   2> 19692 T2503 C164 P16413 oasu.DirectUpdateHandler2.commit start commit{flags=0,_version_=0,optimize=false,openSearcher=true,waitSearcher=true,expungeDeletes=false,softCommit=false}
[junit4:junit4]   2> 19693 T2531 C167 P16442 oasu.DirectUpdateHandler2.commit start commit{flags=0,_version_=0,optimize=false,openSearcher=true,waitSearcher=true,expungeDeletes=false,softCommit=false}
[junit4:junit4]   2> 19842 T2517 C166 P16434 oasc.SolrDeletionPolicy.onCommit SolrDeletionPolicy.onCommit: commits:num=2
[junit4:junit4]   2> 		commit{dir=NRTCachingDirectory(org.apache.lucene.store.NIOFSDirectory@/usr/home/hudson/hudson-slave/workspace/Lucene-Solr-Tests-trunk-java7/solr/build/solr-core/test/J1/org.apache.solr.cloud.SyncSliceTest-1348042096286/jetty3/index lockFactory=org.apache.lucene.store.NativeFSLockFactory@1534954a; maxCacheMB=48.0 maxMergeSizeMB=4.0),segFN=segments_2,generation=2,filenames=[segments_2]
[junit4:junit4]   2> 		commit{dir=NRTCachingDirectory(org.apache.lucene.store.NIOFSDirectory@/usr/home/hudson/hudson-slave/workspace/Lucene-Solr-Tests-trunk-java7/solr/build/solr-core/test/J1/org.apache.solr.cloud.SyncSliceTest-1348042096286/jetty3/index lockFactory=org.apache.lucene.store.NativeFSLockFactory@1534954a; maxCacheMB=48.0 maxMergeSizeMB=4.0),segFN=segments_3,generation=3,filenames=[_0_MockVariableIntBlock_0.doc, _0_MockVariableIntBlock_0.skp, _0_Pulsing40_0.prx, _0_MockFixedIntBlock_0.tib, _0_Pulsing40_0.frq, _0_MockVariableIntBlock_0.pyl, _0_MockFixedIntBlock_0.skp, _0_MockFixedIntBlock_0.pyl, _0_MockVariableIntBlock_0.tib, _0_MockFixedIntBlock_0.tii, _0_MockVariableIntBlock_0.pos, _0_Pulsing40_0.tip, _0.si, _0_MockVariableIntBlock_0.tii, _0.fnm, _0_Pulsing40_0.tim, _0_Memory_0.ram, _0_MockFixedIntBlock_0.pos, _0_nrm.cfs, _0_MockFixedIntBlock_0.frq, _0_MockFixedIntBlock_0.doc, _0_nrm.cfe, _0_MockVariableIntBlock_0.frq, _0.fdx, _0.fdt, segments_3]
[junit4:junit4]   2> 19842 T2503 C164 P16413 oasc.SolrDeletionPolicy.onCommit SolrDeletionPolicy.onCommit: commits:num=2
[junit4:junit4]   2> 		commit{dir=NRTCachingDirectory(org.apache.lucene.store.NIOFSDirectory@/usr/home/hudson/hudson-slave/workspace/Lucene-Solr-Tests-trunk-java7/solr/build/solr-core/test/J1/org.apache.solr.cloud.SyncSliceTest-1348042096286/jetty2/index lockFactory=org.apache.lucene.store.NativeFSLockFactory@57110261; maxCacheMB=48.0 maxMergeSizeMB=4.0),segFN=segments_2,generation=2,filenames=[segments_2]
[junit4:junit4]   2> 		commit{dir=NRTCachingDirectory(org.apache.lucene.store.NIOFSDirectory@/usr/home/hudson/hudson-slave/workspace/Lucene-Solr-Tests-trunk-java7/solr/build/solr-core/test/J1/org.apache.solr.cloud.SyncSliceTest-1348042096286/jetty2/index lockFactory=org.apache.lucene.store.NativeFSLockFactory@57110261; maxCacheMB=48.0 maxMergeSizeMB=4.0),segFN=segments_3,generation=3,filenames=[_0_MockVariableIntBlock_0.doc, _0_MockVariableIntBlock_0.skp, _0_Pulsing40_0.prx, _0_MockFixedIntBlock_0.tib, _0_Pulsing40_0.frq, _0_MockVariableIntBlock_0.pyl, _0_MockFixedIntBlock_0.skp, _0_MockFixedIntBlock_0.pyl, _0_MockVariableIntBlock_0.tib, _0_MockFixedIntBlock_0.tii, _0_MockVariableIntBlock_0.pos, _0_Pulsing40_0.tip, _0.si, _0_MockVariableIntBlock_0.tii, _0.fnm, _0_Pulsing40_0.tim, _0_Memory_0.ram, _0_MockFixedIntBlock_0.pos, _0_nrm.cfs, _0_MockFixedIntBlock_0.frq, _0_MockFixedIntBlock_0.doc, _0_nrm.cfe, _0_MockVariableIntBlock_0.frq, _0.fdx, _0.fdt, segments_3]
[junit4:junit4]   2> 19842 T2531 C167 P16442 oasc.SolrDeletionPolicy.onCommit SolrDeletionPolicy.onCommit: commits:num=2
[junit4:junit4]   2> 		commit{dir=NRTCachingDirectory(org.apache.lucene.store.NIOFSDirectory@/usr/home/hudson/hudson-slave/workspace/Lucene-Solr-Tests-trunk-java7/solr/build/solr-core/test/J1/org.apache.solr.cloud.SyncSliceTest-1348042096286/jetty4/index lockFactory=org.apache.lucene.store.NativeFSLockFactory@10a34632; maxCacheMB=48.0 maxMergeSizeMB=4.0),segFN=segments_2,generation=2,filenames=[segments_2]
[junit4:junit4]   2> 		commit{dir=NRTCachingDirectory(org.apache.lucene.store.NIOFSDirectory@/usr/home/hudson/hudson-slave/workspace/Lucene-Solr-Tests-trunk-java7/solr/build/solr-core/test/J1/org.apache.solr.cloud.SyncSliceTest-1348042096286/jetty4/index lockFactory=org.apache.lucene.store.NativeFSLockFactory@10a34632; maxCacheMB=48.0 maxMergeSizeMB=4.0),segFN=segments_3,generation=3,filenames=[_0_MockVariableIntBlock_0.doc, _0_MockVariableIntBlock_0.skp, _0_Pulsing40_0.prx, _0_MockFixedIntBlock_0.tib, _0_Pulsing40_0.frq, _0_MockVariableIntBlock_0.pyl, _0_MockFixedIntBlock_0.skp, _0_MockFixedIntBlock_0.pyl, _0_MockVariableIntBlock_0.tib, _0_MockFixedIntBlock_0.tii, _0_MockVariableIntBlock_0.pos, _0_Pulsing40_0.tip, _0.si, _0_MockVariableIntBlock_0.tii, _0.fnm, _0_Pulsing40_0.tim, _0_Memory_0.ram, _0_MockFixedIntBlock_0.pos, _0_nrm.cfs, _0_MockFixedIntBlock_0.frq, _0_MockFixedIntBlock_0.doc, _0_nrm.cfe, _0_MockVariableIntBlock_0.frq, _0.fdx, _0.fdt, segments_3]
[junit4:junit4]   2> 19843 T2517 C166 P16434 oasc.SolrDeletionPolicy.updateCommits newest commit = 3
[junit4:junit4]   2> 19844 T2531 C167 P16442 oasc.SolrDeletionPolicy.updateCommits newest commit = 3
[junit4:junit4]   2> 19843 T2503 C164 P16413 oasc.SolrDeletionPolicy.updateCommits newest commit = 3
[junit4:junit4]   2> 19860 T2517 C166 P16434 oass.SolrIndexSearcher.<init> Opening Searcher@77bfd3de main
[junit4:junit4]   2> 19860 T2531 C167 P16442 oass.SolrIndexSearcher.<init> Opening Searcher@3527b467 main
[junit4:junit4]   2> 19860 T2503 C164 P16413 oass.SolrIndexSearcher.<init> Opening Searcher@41b4f174 main
[junit4:junit4]   2> 19861 T2517 C166 P16434 oasu.DirectUpdateHandler2.commit end_commit_flush
[junit4:junit4]   2> 19861 T2531 C167 P16442 oasu.DirectUpdateHandler2.commit end_commit_flush
[junit4:junit4]   2> 19861 T2503 C164 P16413 oasu.DirectUpdateHandler2.commit end_commit_flush
[junit4:junit4]   2> 19861 T2540 oasc.JmxMonitoredMap.put WARNING Failed to register info bean: searcher javax.management.InstanceAlreadyExistsException: solr/collection1:type=searcher,id=org.apache.solr.search.SolrIndexSearcher
[junit4:junit4]   2> 	at com.sun.jmx.mbeanserver.Repository.addMBean(Repository.java:437)
[junit4:junit4]   2> 	at com.sun.jmx.interceptor.DefaultMBeanServerInterceptor.registerWithRepository(DefaultMBeanServerInterceptor.java:1898)
[junit4:junit4]   2> 	at com.sun.jmx.interceptor.DefaultMBeanServerInterceptor.registerDynamicMBean(DefaultMBeanServerInterceptor.java:966)
[junit4:junit4]   2> 	at com.sun.jmx.interceptor.DefaultMBeanServerInterceptor.registerObject(DefaultMBeanServerInterceptor.java:900)
[junit4:junit4]   2> 	at com.sun.jmx.interceptor.DefaultMBeanServerInterceptor.registerMBean(DefaultMBeanServerInterceptor.java:324)
[junit4:junit4]   2> 	at com.sun.jmx.mbeanserver.JmxMBeanServer.registerMBean(JmxMBeanServer.java:512)
[junit4:junit4]   2> 	at org.apache.solr.core.JmxMonitoredMap.put(JmxMonitoredMap.java:140)
[junit4:junit4]   2> 	at org.apache.solr.core.JmxMonitoredMap.put(JmxMonitoredMap.java:51)
[junit4:junit4]   2> 	at org.apache.solr.search.SolrIndexSearcher.register(SolrIndexSearcher.java:242)
[junit4:junit4]   2> 	at org.apache.solr.core.SolrCore.registerSearcher(SolrCore.java:1642)
[junit4:junit4]   2> 	at org.apache.solr.core.SolrCore.access$000(SolrCore.java:121)
[junit4:junit4]   2> 	at org.apache.solr.core.SolrCore$7.call(SolrCore.java:1519)
[junit4:junit4]   2> 	at java.util.concurrent.FutureTask$Sync.innerRun(FutureTask.java:334)
[junit4:junit4]   2> 	at java.util.concurrent.FutureTask.run(FutureTask.java:166)
[junit4:junit4]   2> 	at java.util.concurrent.ThreadPoolExecutor.runWorker(ThreadPoolExecutor.java:1110)
[junit4:junit4]   2> 	at java.util.concurrent.ThreadPoolExecutor$Worker.run(ThreadPoolExecutor.java:603)
[junit4:junit4]   2> 	at java.lang.Thread.run(Thread.java:722)
[junit4:junit4]   2> 
[junit4:junit4]   2> 19861 T2512 oasc.JmxMonitoredMap.put WARNING Failed to register info bean: searcher javax.management.InstanceAlreadyExistsException: solr/collection1:type=searcher,id=org.apache.solr.search.SolrIndexSearcher
[junit4:junit4]   2> 	at com.sun.jmx.mbeanserver.Repository.addMBean(Repository.java:437)
[junit4:junit4]   2> 	at com.sun.jmx.interceptor.DefaultMBeanServerInterceptor.registerWithRepository(DefaultMBeanServerInterceptor.java:1898)
[junit4:junit4]   2> 	at com.sun.jmx.interceptor.DefaultMBeanServerInterceptor.registerDynamicMBean(DefaultMBeanServerInterceptor.java:966)
[junit4:junit4]   2> 	at com.sun.jmx.interceptor.DefaultMBeanServerInterceptor.registerObject(DefaultMBeanServerInterceptor.java:900)
[junit4:junit4]   2> 	at com.sun.jmx.interceptor.DefaultMBeanServerInterceptor.registerMBean(DefaultMBeanServerInterceptor.java:324)
[junit4:junit4]   2> 	at com.sun.jmx.mbeanserver.JmxMBeanServer.registerMBean(JmxMBeanServer.java:512)
[junit4:junit4]   2> 	at org.apache.solr.core.JmxMonitoredMap.put(JmxMonitoredMap.java:140)
[junit4:junit4]   2> 	at org.apache.solr.core.JmxMonitoredMap.put(JmxMonitoredMap.java:51)
[junit4:junit4]   2> 	at org.apache.solr.search.SolrIndexSearcher.register(SolrIndexSearcher.java:242)
[junit4:junit4]   2> 	at org.apache.solr.core.SolrCore.registerSearcher(SolrCore.java:1642)
[junit4:junit4]   2> 	at org.apache.solr.core.SolrCore.access$000(SolrCore.java:121)
[junit4:junit4]   2> 	at org.apache.solr.core.SolrCore$7.call(SolrCore.java:1519)
[junit4:junit4]   2> 	at java.util.concurrent.FutureTask$Sync.innerRun(FutureTask.java:334)
[junit4:junit4]   2> 	at java.util.concurrent.FutureTask.run(FutureTask.java:166)
[junit4:junit4]   2> 	at java.util.concurrent.ThreadPoolExecutor.runWorker(ThreadPoolExecutor.java:1110)
[junit4:junit4]   2> 	at java.util.concurrent.ThreadPoolExecutor$Worker.run(ThreadPoolExecutor.java:603)
[junit4:junit4]   2> 	at java.lang.Thread.run(Thread.java:722)
[junit4:junit4]   2> 
[junit4:junit4]   2> 19863 T2526 oasc.SolrCore.registerSearcher [collection1] Registered new searcher Searcher@77bfd3de main{StandardDirectoryReader(segments_3:4:nrt _0(5.0):C3)}
[junit4:junit4]   2> 19865 T2540 oasc.SolrCore.registerSearcher [collection1] Registered new searcher Searcher@3527b467 main{StandardDirectoryReader(segments_3:4:nrt _0(5.0):C4)}
[junit4:junit4]   2> 19865 T2517 C166 P16434 /update {waitSearcher=true&commit=true&wt=javabin&commit_end_point=true&expungeDeletes=false&softCommit=false&version=2} {commit=} 0 173
[junit4:junit4]   2> 19865 T2531 C167 P16442 /update {waitSearcher=true&commit=true&wt=javabin&commit_end_point=true&expungeDeletes=false&softCommit=false&version=2} {commit=} 0 172
[junit4:junit4]   2> 19866 T2512 oasc.SolrCore.registerSearcher [collection1] Registered new searcher Searcher@41b4f174 main{StandardDirectoryReader(segments_3:4:nrt _0(5.0):C2)}
[junit4:junit4]   2> 19866 T2503 C164 P16413 /update {waitSearcher=true&commit=true&wt=javabin&commit_end_point=true&expungeDeletes=false&softCommit=false&version=2} {commit=} 0 174
[junit4:junit4]   2> 19867 T2494 C165 P16397 /update {waitSearcher=true&wt=javabin&commit=true&softCommit=false&version=2} {commit=} 0 300
[junit4:junit4]   2> 19868 T2465 oasc.AbstractDistribZkTestBase.waitForRecoveriesToFinish Wait for recoveries to finish - collection: collection1 failOnTimeout:true timeout (sec):1800
[junit4:junit4]   2> 19869 T2465 oascc.ZkStateReader.updateClusterState Updating cloud state from ZooKeeper... 
[junit4:junit4]   2> check const of shard1
[junit4:junit4]   2> client0
[junit4:junit4]   2> PROPS:127.0.0.1:16397_solr_collection1:{"shard":"shard1","roles":null,"state":"active","core":"collection1","collection":"collection1","node_name":"127.0.0.1:16397_solr","base_url":"http://127.0.0.1:16397/solr","leader":"true"}
[junit4:junit4]   2> 19872 T2493 C165 P16397 REQ /select {distrib=false&wt=javabin&q=*:*&version=2} hits=4 status=0 QTime=0 
[junit4:junit4]   2>  live:true
[junit4:junit4]   2>  num:4
[junit4:junit4]   2> 
[junit4:junit4]   2> client1
[junit4:junit4]   2> PROPS:127.0.0.1:16413_solr_collection1:{"shard":"shard1","roles":null,"state":"active","core":"collection1","collection":"collection1","node_name":"127.0.0.1:16413_solr","base_url":"http://127.0.0.1:16413/solr"}
[junit4:junit4]   2> 19876 T2504 C164 P16413 REQ /select {distrib=false&wt=javabin&q=*:*&version=2} hits=2 status=0 QTime=0 
[junit4:junit4]   2>  live:true
[junit4:junit4]   2>  num:2
[junit4:junit4]   2> 
[junit4:junit4]   2> ######shard1 is not consistent.  Got 4 from http://127.0.0.1:16397/solr/collection1lastClient and got 2 from http://127.0.0.1:16413/solr/collection1
[junit4:junit4]   2> 19879 T2493 C165 P16397 REQ /select {fl=id,_version_&sort=id+asc&q=*:*&distrib=false&wt=javabin&rows=1000&version=2} hits=4 status=0 QTime=0 
[junit4:junit4]   2> 19882 T2504 C164 P16413 REQ /select {fl=id,_version_&sort=id+asc&q=*:*&distrib=false&wt=javabin&rows=1000&version=2} hits=2 status=0 QTime=0 
[junit4:junit4]   2> ######http://127.0.0.1:16397/solr/collection1: {numFound=4,start=0,docs=[SolrDocument{id=0, _version_=1413524609393754112}, SolrDocument{id=1, _version_=1413524609407385600}, SolrDocument{id=2, _version_=1413524609416822784}, SolrDocument{id=3, _version_=1413524609427308544}]}
[junit4:junit4]   2> ######http://127.0.0.1:16413/solr/collection1: {numFound=2,start=0,docs=[SolrDocument{id=0, _version_=1413524609393754112}, SolrDocument{id=1, _version_=1413524609407385600}]}
[junit4:junit4]   2> ###### sizes=4,2
[junit4:junit4]   2> ###### Only in http://127.0.0.1:16397/solr/collection1: [{id=3, _version_=1413524609427308544}, {id=2, _version_=1413524609416822784}]
[junit4:junit4]   2> client2
[junit4:junit4]   2> PROPS:127.0.0.1:16434_solr_collection1:{"shard":"shard1","roles":null,"state":"active","core":"collection1","collection":"collection1","node_name":"127.0.0.1:16434_solr","base_url":"http://127.0.0.1:16434/solr"}
[junit4:junit4]   2> 19886 T2518 C166 P16434 REQ /select {distrib=false&wt=javabin&q=*:*&version=2} hits=3 status=0 QTime=0 
[junit4:junit4]   2>  live:true
[junit4:junit4]   2>  num:3
[junit4:junit4]   2> 
[junit4:junit4]   2> client3
[junit4:junit4]   2> PROPS:127.0.0.1:16442_solr_collection1:{"shard":"shard1","roles":null,"state":"active","core":"collection1","collection":"collection1","node_name":"127.0.0.1:16442_solr","base_url":"http://127.0.0.1:16442/solr"}
[junit4:junit4]   2> 19889 T2532 C167 P16442 REQ /select {distrib=false&wt=javabin&q=*:*&version=2} hits=4 status=0 QTime=0 
[junit4:junit4]   2>  live:true
[junit4:junit4]   2>  num:4
[junit4:junit4]   2> 
[junit4:junit4]   2> 19896 T2465 oascsi.HttpClientUtil.createClient Creating new http client, config:maxConnections=128&maxConnectionsPerHost=32&followRedirects=false
[junit4:junit4]   2> 19934 T2519 oasha.CollectionsHandler.handleSyncShardAction Syncing shard : action=SYNCSHARD&collection=collection1&shard=shard1&wt=javabin&version=2
[junit4:junit4]   2> 19935 T2519 oascsi.HttpClientUtil.createClient Creating new http client, config:maxConnections=128&maxConnectionsPerHost=32&followRedirects=false
[junit4:junit4]   2> 19955 T2497 oasha.CoreAdminHandler.handleRequestSyncAction I have been requested to sync up my shard
[junit4:junit4]   2> 19956 T2497 oasc.SyncStrategy.sync Sync replicas to http://127.0.0.1:16397/solr/collection1/
[junit4:junit4]   2> 19957 T2497 oasu.PeerSync.sync PeerSync: core=collection1 url=http://127.0.0.1:16397/solr START replicas=[http://127.0.0.1:16413/solr/collection1/, http://127.0.0.1:16434/solr/collection1/, http://127.0.0.1:16442/solr/collection1/] nUpdates=100
[junit4:junit4]   2> 19959 T2505 C164 P16413 REQ /get {distrib=false&qt=/get&wt=javabin&version=2&getVersions=100} status=0 QTime=0 
[junit4:junit4]   2> 19960 T2520 C166 P16434 REQ /get {distrib=false&qt=/get&wt=javabin&version=2&getVersions=100} status=0 QTime=0 
[junit4:junit4]   2> 19960 T2533 C167 P16442 REQ /get {distrib=false&qt=/get&wt=javabin&version=2&getVersions=100} status=0 QTime=0 
[junit4:junit4]   2> 19960 T2497 oasu.PeerSync.handleVersions PeerSync: core=collection1 url=http://127.0.0.1:16397/solr  Received 3 versions from 127.0.0.1:16413/solr/collection1/
[junit4:junit4]   2> 19961 T2497 oasu.PeerSync.handleVersions PeerSync: core=collection1 url=http://127.0.0.1:16397/solr  Our versions are newer. ourLowThreshold=1413524609378025472 otherHigh=1413524609407385600
[junit4:junit4]   2> 19961 T2497 oasu.PeerSync.handleVersions PeerSync: core=collection1 url=http://127.0.0.1:16397/solr  Received 4 versions from 127.0.0.1:16434/solr/collection1/
[junit4:junit4]   2> 19961 T2497 oasu.PeerSync.handleVersions PeerSync: core=collection1 url=http://127.0.0.1:16397/solr  Our versions are newer. ourLowThreshold=1413524609378025472 otherHigh=1413524609416822784
[junit4:junit4]   2> 19962 T2497 oasu.PeerSync.handleVersions PeerSync: core=collection1 url=http://127.0.0.1:16397/solr  Received 5 versions from 127.0.0.1:16442/solr/collection1/
[junit4:junit4]   2> 19962 T2497 oasu.PeerSync.handleVersions PeerSync: core=collection1 url=http://127.0.0.1:16397/solr  Our versions are newer. ourLowThreshold=1413524609378025472 otherHigh=1413524609416822784
[junit4:junit4]   2> 19962 T2497 oasu.PeerSync.sync PeerSync: core=collection1 url=http://127.0.0.1:16397/solr DONE. sync succeeded
[junit4:junit4]   2> 19963 T2497 oasc.SyncStrategy.syncReplicas Sync Success - now sync replicas to me
[junit4:junit4]   2> 19963 T2497 oasc.SyncStrategy.syncToMe http://127.0.0.1:16397/solr/collection1/: try and ask http://127.0.0.1:16413/solr/collection1/ to sync
[junit4:junit4]   2> 19964 T2497 oasc.SyncStrategy.syncToMe http://127.0.0.1:16397/solr/collection1/: try and ask http://127.0.0.1:16434/solr/collection1/ to sync
[junit4:junit4]   2> 19964 T2497 oasc.SyncStrategy.syncToMe http://127.0.0.1:16397/solr/collection1/: try and ask http://127.0.0.1:16442/solr/collection1/ to sync
[junit4:junit4]   2> 19967 T2506 C164 P16413 oasu.PeerSync.sync PeerSync: core=collection1 url=http://127.0.0.1:16413/solr START replicas=[http://127.0.0.1:16397/solr/collection1/] nUpdates=100
[junit4:junit4]   2> 19967 T2521 C166 P16434 oasu.PeerSync.sync PeerSync: core=collection1 url=http://127.0.0.1:16434/solr START replicas=[http://127.0.0.1:16397/solr/collection1/] nUpdates=100
[junit4:junit4]   2> 19967 T2534 C167 P16442 oasu.PeerSync.sync PeerSync: core=collection1 url=http://127.0.0.1:16442/solr START replicas=[http://127.0.0.1:16397/solr/collection1/] nUpdates=100
[junit4:junit4]   2> 19969 T2496 C165 P16397 REQ /get {distrib=false&qt=/get&wt=javabin&version=2&getVersions=100} status=0 QTime=0 
[junit4:junit4]   2> 19969 T2492 C165 P16397 REQ /get {distrib=false&qt=/get&wt=javabin&version=2&getVersions=100} status=0 QTime=0 
[junit4:junit4]   2> 19969 T2521 C166 P16434 oasu.PeerSync.handleVersions PeerSync: core=collection1 url=http://127.0.0.1:16434/solr  Received 5 versions from 127.0.0.1:16397/solr/collection1/
[junit4:junit4]   2> 19970 T2491 C165 P16397 REQ /get {distrib=false&qt=/get&wt=javabin&version=2&getVersions=100} status=0 QTime=0 
[junit4:junit4]   2> 19970 T2534 C167 P16442 oasu.PeerSync.handleVersions PeerSync: core=collection1 url=http://127.0.0.1:16442/solr  Received 5 versions from 127.0.0.1:16397/solr/collection1/
[junit4:junit4]   2> 19970 T2521 C166 P16434 oasu.PeerSync.requestUpdates PeerSync: core=collection1 url=http://127.0.0.1:16434/solr Requesting updates from 127.0.0.1:16397/solr/collection1/n=1 versions=[1413524609427308544]
[junit4:junit4]   2> 19971 T2534 C167 P16442 oasu.PeerSync.handleVersions PeerSync: core=collection1 url=http://127.0.0.1:16442/solr  Our versions are newer. ourLowThreshold=1413524609378025472 otherHigh=1413524609416822784
[junit4:junit4]   2> 19971 T2506 C164 P16413 oasu.PeerSync.handleVersions PeerSync: core=collection1 url=http://127.0.0.1:16413/solr  Received 5 versions from 127.0.0.1:16397/solr/collection1/
[junit4:junit4]   2> 19971 T2534 C167 P16442 oasu.PeerSync.sync PeerSync: core=collection1 url=http://127.0.0.1:16442/solr DONE. sync succeeded
[junit4:junit4]   2> 19971 T2506 C164 P16413 oasu.PeerSync.requestUpdates PeerSync: core=collection1 url=http://127.0.0.1:16413/solr Requesting updates from 127.0.0.1:16397/solr/collection1/n=2 versions=[1413524609427308544, 1413524609416822784]
[junit4:junit4]   2> 19972 T2534 C167 P16442 REQ /get {sync=http://127.0.0.1:16397/solr/collection1/&getVersions=100&distrib=false&qt=/get&wt=javabin&version=2} status=0 QTime=5 
[junit4:junit4]   2> 19973 T2497 oasc.SyncStrategy.syncToMe http://127.0.0.1:16397/solr/collection1/:  sync completed with http://127.0.0.1:16442/solr/collection1/
[junit4:junit4]   2> 19973 T2491 C165 P16397 REQ /get {distrib=false&getUpdates=1413524609427308544&qt=/get&wt=javabin&version=2} status=0 QTime=0 
[junit4:junit4]   2> 19975 T2492 C165 P16397 REQ /get {distrib=false&getUpdates=1413524609427308544,1413524609416822784&qt=/get&wt=javabin&version=2} status=0 QTime=1 
[junit4:junit4]   2> 19977 T2521 C166 P16434 oasu.PeerSync.sync PeerSync: core=collection1 url=http://127.0.0.1:16434/solr DONE. sync succeeded
[junit4:junit4]   2> 19978 T2521 C166 P16434 REQ /get {sync=http://127.0.0.1:16397/solr/collection1/&getVersions=100&distrib=false&qt=/get&wt=javabin&version=2} status=0 QTime=11 
[junit4:junit4]   2> 19978 T2497 oasc.SyncStrategy.syncToMe http://127.0.0.1:16397/solr/collection1/:  sync completed with http://127.0.0.1:16434/solr/collection1/
[junit4:junit4]   2> 19979 T2506 C164 P16413 oasu.PeerSync.sync PeerSync: core=collection1 url=http://127.0.0.1:16413/solr DONE. sync succeeded
[junit4:junit4]   2> 19979 T2506 C164 P16413 REQ /get {sync=http://127.0.0.1:16397/solr/collection1/&getVersions=100&distrib=false&qt=/get&wt=javabin&version=2} status=0 QTime=12 
[junit4:junit4]   2> 19980 T2497 oasc.SyncStrategy.syncToMe http://127.0.0.1:16397/solr/collection1/:  sync completed with http://127.0.0.1:16413/solr/collection1/
[junit4:junit4]   2> 19980 T2465 oasc.AbstractFullDistribZkTestBase.waitForThingsToLevelOut Wait for recoveries to finish - wait 15 for each attempt
[junit4:junit4]   2> 19981 T2465 oasc.AbstractDistribZkTestBase.waitForRecoveriesToFinish Wait for recoveries to finish - collection: collection1 failOnTimeout:true timeout (sec):15
[junit4:junit4]   2> 19982 T2465 oascc.ZkStateReader.updateClusterState Updating cloud state from ZooKeeper... 
[junit4:junit4]   2> 19986 T2477 C168 P16383 oasu.DirectUpdateHandler2.commit start commit{flags=0,_version_=0,optimize=false,openSearcher=true,waitSearcher=true,expungeDeletes=false,softCommit=false}
[junit4:junit4]   2> 19988 T2477 C168 P16383 oass.SolrIndexSearcher.<init> Opening Searcher@b6cd73a main
[junit4:junit4]   2> 19988 T2477 C168 P16383 oasu.DirectUpdateHandler2.commit end_commit_flush
[junit4:junit4]   2> 19990 T2488 oasc.SolrCore.registerSearcher [collection1] Registered new searcher Searcher@b6cd73a main{StandardDirectoryReader(segments_2:3:nrt _0(5.0):C4)}
[junit4:junit4]   2> 19990 T2477 C168 P16383 /update {waitSearcher=true&wt=javabin&commit=true&softCommit=false&version=2} {commit=} 0 4
[junit4:junit4]   2> 19993 T2494 C165 P16397 oasu.DirectUpdateHandler2.commit start commit{flags=0,_version_=0,optimize=false,openSearcher=true,waitSearcher=true,expungeDeletes=false,softCommit=false}
[junit4:junit4]   2> 19995 T2494 C165 P16397 oass.SolrIndexSearcher.<init> Opening Searcher@76367bbb main
[junit4:junit4]   2> 19996 T2494 C165 P16397 oasu.DirectUpdateHandler2.commit end_commit_flush
[junit4:junit4]   2> 19997 T2500 oasc.SolrCore.registerSearcher [collection1] Registered new searcher Searcher@76367bbb main{StandardDirectoryReader(segments_2:3:nrt _0(5.0):C4)}
[junit4:junit4]   2> 19998 T2494 C165 P16397 oasu.SolrCmdDistributor.distribCommit Distrib commit to:[StdNode: http://127.0.0.1:16413/solr/collection1/, StdNode: http://127.0.0.1:16434/solr/collection1/, StdNode: http://127.0.0.1:16442/solr/collection1/]
[junit4:junit4]   2> 20001 T2517 C166 P16434 oasu.DirectUpdateHandler2.commit start commit{flags=0,_version_=0,optimize=false,openSearcher=true,waitSearcher=true,expungeDeletes=false,softCommit=false}
[junit4:junit4]   2> 20001 T2503 C164 P16413 oasu.DirectUpdateHandler2.commit start commit{flags=0,_version_=0,optimize=false,openSearcher=true,waitSearcher=true,expungeDeletes=false,softCommit=false}
[junit4:junit4]   2> 20001 T2531 C167 P16442 oasu.DirectUpdateHandler2.commit start commit{flags=0,_version_=0,optimize=false,openSearcher=true,waitSearcher=true,expungeDeletes=false,softCommit=false}
[junit4:junit4]   2> 20003 T2531 C167 P16442 oass.SolrIndexSearcher.<init> Opening Searcher@21a13c4e main
[junit4:junit4]   2> 20004 T2531 C167 P16442 oasu.DirectUpdateHandler2.commit end_commit_flush
[junit4:junit4]   2> 20005 T2540 oasc.SolrCore.registerSearcher [collection1] Registered new searcher Searcher@21a13c4e main{StandardDirectoryReader(segments_3:4:nrt _0(5.0):C4)}
[junit4:junit4]   2> 20006 T2531 C167 P16442 /update {waitSearcher=true&commit=true&wt=javabin&commit_end_point=true&expungeDeletes=false&softCommit=false&version=2} {commit=} 0 5
[junit4:junit4]   2> 20169 T2503 C164 P16413 oasc.SolrDeletionPolicy.onCommit SolrDeletionPolicy.onCommit: commits:num=2
[junit4:junit4]   2> 		commit{dir=NRTCachingDirectory(org.apache.lucene.store.NIOFSDirectory@/usr/home/hudson/hudson-slave/workspace/Lucene-Solr-Tests-trunk-java7/solr/build/solr-core/test/J1/org.apache.solr.cloud.SyncSliceTest-1348042096286/jetty2/index lockFactory=org.apache.lucene.store.NativeFSLockFactory@57110261; maxCacheMB=48.0 maxMergeSizeMB=4.0),segFN=segments_3,generation=3,filenames=[_0_MockVariableIntBlock_0.doc, _0_MockVariableIntBlock_0.skp, _0_Pulsing40_0.prx, _0_MockFixedIntBlock_0.tib, _0_Pulsing40_0.frq, _0_MockVariableIntBlock_0.pyl, _0_MockFixedIntBlock_0.skp, _0_MockFixedIntBlock_0.pyl, _0_MockVariableIntBlock_0.tib, _0_MockFixedIntBlock_0.tii, _0_MockVariableIntBlock_0.pos, _0_Pulsing40_0.tip, _0.si, _0_MockVariableIntBlock_0.tii, _0.fnm, _0_Pulsing40_0.tim, _0_Memory_0.ram, _0_MockFixedIntBlock_0.pos, _0_nrm.cfs, _0_MockFixedIntBlock_0.frq, _0_MockFixedIntBlock_0.doc, _0_nrm.cfe, _0_MockVariableIntBlock_0.frq, _0.fdx, _0.fdt, segments_3]
[junit4:junit4]   2> 		commit{dir=NRTCachingDirectory(org.apache.lucene.store.NIOFSDirectory@/usr/home/hudson/hudson-slave/workspace/Lucene-Solr-Tests-trunk-java7/solr/build/solr-core/test/J1/org.apache.solr.cloud.SyncSliceTest-1348042096286/jetty2/index lockFactory=org.apache.lucene.store.NativeFSLockFactory@57110261; maxCacheMB=48.0 maxMergeSizeMB=4.0),segFN=segments_4,generation=4,filenames=[_1_MockVariableIntBlock_0.skp, _1_Pulsing40_0.tip, _1_MockFixedIntBlock_0.doc, _0_MockVariableIntBlock_0.doc, _1_Pulsing40_0.tim, _1_MockFixedIntBlock_0.pyl, _1_MockVariableIntBlock_0.pyl, _0_MockVariableIntBlock_0.skp, _0_Pulsing40_0.prx, _0_MockFixedIntBlock_0.tib, _1.fnm, _0_Pulsing40_0.frq, _1_Pulsing40_0.frq, _0_MockVariableIntBlock_0.pyl, _1_Memory_0.ram, _0_MockFixedIntBlock_0.skp, _0_MockFixedIntBlock_0.pyl, _0_MockVariableIntBlock_0.tib, _0_MockFixedIntBlock_0.tii, _1_Pulsing40_0.prx, _1_MockVariableIntBlock_0.doc, _0_MockVariableIntBlock_0.pos, _0_Pulsing40_0.tip, _0.si, _0_MockVariableIntBlock_0.tii, _1_MockFixedIntBlock_0.tii, _1_nrm.cfs, _0.fnm, _0_Pulsing40_0.tim, _1_MockFixedIntBlock_0.frq, _1_MockVariableIntBlock_0.tii, _0_Memory_0.ram, _1_MockVariableIntBlock_0.pos, _0_MockFixedIntBlock_0.pos, _0_nrm.cfs, _1_MockVariableIntBlock_0.tib, _1_nrm.cfe, _0_MockFixedIntBlock_0.frq, _1.fdx, _1_MockVariableIntBlock_0.frq, _1_MockFixedIntBlock_0.skp, _1.fdt, _0_MockFixedIntBlock_0.doc, _1.si, _0_nrm.cfe, _0_MockVariableIntBlock_0.frq, _1_MockFixedIntBlock_0.tib, _0.fdx, _1_MockFixedIntBlock_0.pos, _0.fdt, segments_4]
[junit4:junit4]   2> 20170 T2503 C164 P16413 oasc.SolrDeletionPolicy.updateCommits newest commit = 4
[junit4:junit4]   2> 20170 T2517 C166 P16434 oasc.SolrDeletionPolicy.onCommit SolrDeletionPolicy.onCommit: commits:num=2
[junit4:junit4]   2> 		commit{dir=NRTCachingDirectory(org.apache.lucene.store.NIOFSDirectory@/usr/home/hudson/hudson-slave/workspace/Lucene-Solr-Tests-trunk-java7/solr/build/solr-core/test/J1/org.apache.solr.cloud.SyncSliceTest-1348042096286/jetty3/index lockFactory=org.apache.lucene.store.NativeFSLockFactory@1534954a; maxCacheMB=48.0 maxMergeSizeMB=4.0),segFN=segments_3,generation=3,filenames=[_0_MockVariableIntBlock_0.doc, _0_MockVariableIntBlock_0.skp, _0_Pulsing40_0.prx, _0_MockFixedIntBlock_0.tib, _0_Pulsing40_0.frq, _0_MockVariableIntBlock_0.pyl, _0_MockFixedIntBlock_0.skp, _0_MockFixedIntBlock_0.pyl, _0_MockVariableIntBlock_0.tib, _0_MockFixedIntBlock_0.tii, _0_MockVariableIntBlock_0.pos, _0_Pulsing40_0.tip, _0.si, _0_MockVariableIntBlock_0.tii, _0.fnm, _0_Pulsing40_0.tim, _0_Memory_0.ram, _0_MockFixedIntBlock_0.pos, _0_nrm.cfs, _0_MockFixedIntBlock_0.frq, _0_MockFixedIntBlock_0.doc, _0_nrm.cfe, _0_MockVariableIntBlock_0.frq, _0.fdx, _0.fdt, segments_3]
[junit4:junit4]   2> 		commit{dir=NRTCachingDirectory(org.apache.lucene.store.NIOFSDirectory@/usr/home/hudson/hudson-slave/workspace/Lucene-Solr-Tests-trunk-java7/solr/build/solr-core/test/J1/org.apache.solr.cloud.SyncSliceTest-1348042096286/jetty3/index lockFactory=org.apache.lucene.store.NativeFSLockFactory@1534954a; maxCacheMB=48.0 maxMergeSizeMB=4.0),segFN=segments_4,generation=4,filenames=[_1_MockVariableIntBlock_0.skp, _1_Pulsing40_0.tip, _1_MockFixedIntBlock_0.doc, _0_MockVariableIntBlock_0.doc, _1_Pulsing40_0.tim, _1_MockFixedIntBlock_0.pyl, _1_MockVariableIntBlock_0.pyl, _0_MockVariableIntBlock_0.skp, _0_Pulsing40_0.prx, _0_MockFixedIntBlock_0.tib, _1.fnm, _0_Pulsing40_0.frq, _1_Pulsing40_0.frq, _0_MockVariableIntBlock_0.pyl, _1_Memory_0.ram, _0_MockFixedIntBlock_0.skp, _0_MockFixedIntBlock_0.pyl, _0_MockVariableIntBlock_0.tib, _0_MockFixedIntBlock_0.tii, _1_Pulsing40_0.prx, _1_MockVariableIntBlock_0.doc, _0_MockVariableIntBlock_0.pos, _0_Pulsing40_0.tip, _0.si, _0_MockVariableIntBlock_0.tii, _1_MockFixedIntBlock_0.tii, _1_nrm.cfs, _0.fnm, _0_Pulsing40_0.tim, _1_MockFixedIntBlock_0.frq, _1_MockVariableIntBlock_0.tii, _0_Memory_0.ram, _1_MockVariableIntBlock_0.pos, _0_MockFixedIntBlock_0.pos, _0_nrm.cfs, _1_MockVariableIntBlock_0.tib, _1_nrm.cfe, _0_MockFixedIntBlock_0.frq, _1.fdx, _1_MockVariableIntBlock_0.frq, _1_MockFixedIntBlock_0.skp, _1.fdt, _0_MockFixedIntBlock_0.doc, _1.si, _0_nrm.cfe, _0_MockVariableIntBlock_0.frq, _1_MockFixedIntBlock_0.tib, _0.fdx, _1_MockFixedIntBlock_0.pos, _0.fdt, segments_4]
[junit4:junit4]   2> 20171 T2517 C166 P16434 oasc.SolrDeletionPolicy.updateCommits newest commit = 4
[junit4:junit4]   2> 20183 T2503 C164 P16413 oass.SolrIndexSearcher.<init> Opening Searcher@ab2709e main
[junit4:junit4]   2> 20184 T2503 C164 P16413 oasu.DirectUpdateHandler2.commit end_commit_flush
[junit4:junit4]   2> 20186 T2512 oasc.SolrCore.registerSearcher [collection1] Registered new searcher Searcher@ab2709e main{StandardDirectoryReader(segments_4:6:nrt _0(5.0):C2 _1(5.0):C2)}
[junit4:junit4]   2> 20186 T2517 C166 P16434 oass.SolrIndexSearcher.<init> Opening Searcher@f2bde4b main
[junit4:junit4]   2> 20186 T2503 C164 P16413 /update {waitSearcher=true&commit=true&wt=javabin&commit_end_point=true&expungeDeletes=false&softCommit=false&version=2} {commit=} 0 185
[junit4:junit4]   2> 20187 T2517 C166 P16434 oasu.DirectUpdateHandler2.commit end_commit_flush
[junit4:junit4]   2> 20188 T2526 oasc.SolrCore.registerSearcher [collection1] Registered new searcher Searcher@f2bde4b main{StandardDirectoryReader(segments_4:6:nrt _0(5.0):C3 _1(5.0):C1)}
[junit4:junit4]   2> 20188 T2517 C166 P16434 /update {waitSearcher=true&commit=true&wt=javabin&commit_end_point=true&expungeDeletes=false&softCommit=false&version=2} {commit=} 0 187
[junit4:junit4]   2> 20189 T2494 C165 P16397 /update {waitSearcher=true&wt=javabin&commit=true&softCommit=false&version=2} {commit=} 0 196
[junit4:junit4]   2> 20190 T2465 oascc.ZkStateReader.updateClusterState Updating cloud state from ZooKeeper... 
[junit4:junit4]   2> 20193 T2493 C165 P16397 REQ /select {distrib=false&wt=javabin&q=*:*&version=2} hits=4 status=0 QTime=0 
[junit4:junit4]   2> 20196 T2504 C164 P16413 REQ /select {distrib=false&wt=javabin&q=*:*&version=2} hits=4 status=0 QTime=0 
[junit4:junit4]   2> 20200 T2518 C166 P16434 REQ /select {distrib=false&wt=javabin&q=*:*&version=2} hits=4 status=0 QTime=0 
[junit4:junit4]   2> 20203 T2532 C167 P16442 REQ /select {distrib=false&wt=javabin&q=*:*&version=2} hits=4 status=0 QTime=0 
[junit4:junit4]   2> 22211 T2478 C168 P16383 REQ /select {fl=id,score&shard.url=127.0.0.1:16383/solr/collection1/&NOW=1348042118489&start=0&q=*:*&distrib=false&isShard=true&wt=javabin&fsv=true&rows=10&version=2} hits=4 status=0 QTime=0 
[junit4:junit4]   2> 22214 T2478 C168 P16383 REQ /select {shard.url=127.0.0.1:16383/solr/collection1/&NOW=1348042118489&q=*:*&ids=3,2,1,0&distrib=false&isShard=true&wt=javabin&version=2} status=0 QTime=0 
[junit4:junit4]   2> 22215 T2477 C168 P16383 REQ /select {wt=javabin&q=*:*&version=2} hits=4 status=0 QTime=8 
[junit4:junit4]   2> Control Docs:4
[junit4:junit4]   2> 22216 T2465 oascc.ZkStateReader.updateClusterState Updating cloud state from ZooKeeper... 
[junit4:junit4]   2> check const of shard1
[junit4:junit4]   2> client0
[junit4:junit4]   2> PROPS:127.0.0.1:16397_solr_collection1:{"shard":"shard1","roles":null,"state":"active","core":"collection1","collection":"collection1","node_name":"127.0.0.1:16397_solr","base_url":"http://127.0.0.1:16397/solr","leader":"true"}
[junit4:junit4]   2> 22220 T2493 C165 P16397 REQ /select {distrib=false&wt=javabin&q=*:*&version=2} hits=4 status=0 QTime=0 
[junit4:junit4]   2>  live:true
[junit4:junit4]   2>  num:4
[junit4:junit4]   2> 
[junit4:junit4]   2> client1
[junit4:junit4]   2> PROPS:127.0.0.1:16413_solr_collection1:{"shard":"shard1","roles":null,"state":"active","core":"collection1","collection":"collection1","node_name":"127.0.0.1:16413_solr","base_url":"http://127.0.0.1:16413/solr"}
[junit4:junit4]   2> 22223 T2504 C164 P16413 REQ /select {distrib=false&wt=javabin&q=*:*&version=2} hits=4 status=0 QTime=0 
[junit4:junit4]   2>  live:true
[junit4:junit4]   2>  num:4
[junit4:junit4]   2> 
[junit4:junit4]   2> client2
[junit4:junit4]   2> PROPS:127.0.0.1:16434_solr_collection1:{"shard":"shard1","roles":null,"state":"active","core":"collection1","collection":"collection1","node_name":"127.0.0.1:16434_solr","base_url":"http://127.0.0.1:16434/solr"}
[junit4:junit4]   2> 22226 T2518 C166 P16434 REQ /select {distrib=false&wt=javabin&q=*:*&version=2} hits=4 status=0 QTime=0 
[junit4:junit4]   2>  live:true
[junit4:junit4]   2>  num:4
[junit4:junit4]   2> 
[junit4:junit4]   2> client3
[junit4:junit4]   2> PROPS:127.0.0.1:16442_solr_collection1:{"shard":"shard1","roles":null,"state":"active","core":"collection1","collection":"collection1","node_name":"127.0.0.1:16442_solr","base_url":"http://127.0.0.1:16442/solr"}
[junit4:junit4]   2> 22229 T2532 C167 P16442 REQ /select {distrib=false&wt=javabin&q=*:*&version=2} hits=4 status=0 QTime=0 
[junit4:junit4]   2>  live:true
[junit4:junit4]   2>  num:4
[junit4:junit4]   2> 
[junit4:junit4]   2> 22233 T2508 C164 P16413 REQ /select {fl=id,score&shard.url=127.0.0.1:16397/solr/collection1/|127.0.0.1:16413/solr/collection1/|127.0.0.1:16434/solr/collection1/|127.0.0.1:16442/solr/collection1/&NOW=1348042118512&start=0&q=*:*&distrib=false&isShard=true&wt=javabin&fsv=true&rows=10&version=2} hits=4 status=0 QTime=0 
[junit4:junit4]   2> 22236 T2508 C164 P16413 REQ /select {shard.url=127.0.0.1:16397/solr/collection1/|127.0.0.1:16413/solr/collection1/|127.0.0.1:16434/solr/collection1/|127.0.0.1:16442/solr/collection1/&NOW=1348042118512&q=*:*&ids=3,2,1,0&distrib=false&isShard=true&wt=javabin&version=2} status=0 QTime=0 
[junit4:junit4]   2> 22237 T2507 C164 P16413 REQ /select {wt=javabin&q=*:*&version=2} hits=4 status=0 QTime=7 
[junit4:junit4]   2> 22242 T2477 C168 P16383 /update {wt=javabin&version=2} {add=[4 (1413524612471324672)]} 0 2
[junit4:junit4]   2> 22251 T2517 C166 P16434 REQ /update {distrib.from=http://127.0.0.1:16397/solr/collection1/&update.distrib=FROMLEADER&test.distrib.skip.servers=http://127.0.0.1:16442/solr/collection1/&wt=javabin&version=2} status=0 QTime=2 
[junit4:junit4]   2> 22251 T2503 C164 P16413 REQ /update {distrib.from=http://127.0.0.1:16397/solr/collection1/&update.distrib=FROMLEADER&test.distrib.skip.servers=http://127.0.0.1:16442/solr/collection1/&wt=javabin&version=2} status=0 QTime=2 
[junit4:junit4]   2> 22252 T2494 C165 P16397 /update {test.distrib.skip.servers=http://127.0.0.1:16442/solr/collection1/&wt=javabin&version=2} {add=[4 (1413524612476567552)]} 0 7
[junit4:junit4]   2> 22252 T2465 oasc.ChaosMonkey.monkeyLog monkey: kill shard! 16397
[junit4:junit4]   2> 22253 T2465 oasc.CoreContainer.shutdown Shutting down CoreContainer instance=1832427098
[junit4:junit4]   2> 22254 T2465 oasc.SolrCore.close [collection1]  CLOSING SolrCore org.apache.solr.core.SolrCore@65ebb307
[junit4:junit4]   2> 22273 T2465 oasc.SolrCore.closeSearcher [collection1] Closing main searcher on request.
[junit4:junit4]   2> 22274 T2465 oasu.DirectUpdateHandler2.close closing DirectUpdateHandler2{commits=6,autocommits=0,soft autocommits=0,optimizes=0,rollbacks=0,expungeDeletes=0,docsPending=1,adds=1,deletesById=0,deletesByQuery=0,errors=0,cumulative_adds=5,cumulative_deletesById=0,cumulative_deletesByQuery=1,cumulative_errors=0}
[junit4:junit4]   2> 22274 T2465 oasu.DefaultSolrCoreState.decref SolrCoreState ref count has reached 0 - closing IndexWriter
[junit4:junit4]   2> 22540 T2465 C165 P16397 oasc.SolrDeletionPolicy.onCommit SolrDeletionPolicy.onCommit: commits:num=3
[junit4:junit4]   2> 		commit{dir=NRTCachingDirectory(org.apache.lucene.store.NIOFSDirectory@/usr/home/hudson/hudson-slave/workspace/Lucene-Solr-Tests-trunk-java7/solr/build/solr-core/test/J1/org.apache.solr.cloud.SyncSliceTest-1348042096286/jetty1/index lockFactory=org.apache.lucene.store.NativeFSLockFactory@1dc1a940; maxCacheMB=48.0 maxMergeSizeMB=4.0),segFN=segments_1,generation=1,filenames=[segments_1]
[junit4:junit4]   2> 		commit{dir=NRTCachingDirectory(org.apache.lucene.store.NIOFSDirectory@/usr/home/hudson/hudson-slave/workspace/Lucene-Solr-Tests-trunk-java7/solr/build/solr-core/test/J1/org.apache.solr.cloud.SyncSliceTest-1348042096286/jetty1/index lockFactory=org.apache.lucene.store.NativeFSLockFactory@1dc1a940; maxCacheMB=48.0 maxMergeSizeMB=4.0),segFN=segments_2,generation=2,filenames=[_0_MockVariableIntBlock_0.doc, _0_MockVariableIntBlock_0.skp, _0_Pulsing40_0.prx, _0_MockFixedIntBlock_0.tib, _0_Pulsing40_0.frq, _0_MockVariableIntBlock_0.pyl, _0_MockFixedIntBlock_0.skp, _0_MockFixedIntBlock_0.pyl, _0_MockVariableIntBlock_0.tib, _0_MockFixedIntBlock_0.tii, _0_MockVariableIntBlock_0.pos, _0_Pulsing40_0.tip, _0.si, _0_MockVariableIntBlock_0.tii, _0.fnm, _0_Pulsing40_0.tim, _0_Memory_0.ram, _0_MockFixedIntBlock_0.pos, _0_nrm.cfs, _0_MockFixedIntBlock_0.frq, _0_MockFixedIntBlock_0.doc, _0_nrm.cfe, _0_MockVariableIntBlock_0.frq, segments_2, _0.fdx, _0.fdt]
[junit4:junit4]   2> 		commit{dir=NRTCachingDirectory(org.apache.lucene.store.NIOFSDirectory@/usr/home/hudson/hudson-slave/workspace/Lucene-Solr-Tests-trunk-java7/solr/build/solr-core/test/J1/org.apache.solr.cloud.SyncSliceTest-1348042096286/jetty1/index lockFactory=org.apache.lucene.store.NativeFSLockFactory@1dc1a940; maxCacheMB=48.0 maxMergeSizeMB=4.0),segFN=segments_3,generation=3,filenames=[_1_MockVariableIntBlock_0.skp, _1_Pulsing40_0.tip, _1_MockFixedIntBlock_0.doc, _0_MockVariableIntBlock_0.doc, _1_Pulsing40_0.tim, _1_MockFixedIntBlock_0.pyl, _1_MockVariableIntBlock_0.pyl, _0_MockVariableIntBlock_0.skp, _0_Pulsing40_0.prx, _0_MockFixedIntBlock_0.tib, _1.fnm, _0_Pulsing40_0.frq, _1_Pulsing40_0.frq, _0_MockVariableIntBlock_0.pyl, _1_Memory_0.ram, _0_MockFixedIntBlock_0.skp, _0_MockFixedIntBlock_0.pyl, _0_MockVariableIntBlock_0.tib, _0_MockFixedIntBlock_0.tii, _1_Pulsing40_0.prx, _1_MockVariableIntBlock_0.doc, _0_MockVariableIntBlock_0.pos, _

[...truncated too long message...]

ting.SeedInfo.seed([F8B539558E4C5C6D:7953B74DF9133C51]:0)
[junit4:junit4]    > 	at org.apache.solr.client.solrj.impl.LBHttpSolrServer.request(LBHttpSolrServer.java:323)
[junit4:junit4]    > 	at org.apache.solr.client.solrj.impl.CloudSolrServer.request(CloudSolrServer.java:257)
[junit4:junit4]    > 	at org.apache.solr.client.solrj.request.QueryRequest.process(QueryRequest.java:90)
[junit4:junit4]    > 	at org.apache.solr.client.solrj.SolrServer.query(SolrServer.java:324)
[junit4:junit4]    > 	at org.apache.solr.cloud.AbstractFullDistribZkTestBase.checkShardConsistency(AbstractFullDistribZkTestBase.java:909)
[junit4:junit4]    > 	at org.apache.solr.cloud.SyncSliceTest.doTest(SyncSliceTest.java:226)
[junit4:junit4]    > 	at org.apache.solr.BaseDistributedSearchTestCase.testDistribSearch(BaseDistributedSearchTestCase.java:695)
[junit4:junit4]    > 	at sun.reflect.NativeMethodAccessorImpl.invoke0(Native Method)
[junit4:junit4]    > 	at sun.reflect.NativeMethodAccessorImpl.invoke(NativeMethodAccessorImpl.java:57)
[junit4:junit4]    > 	at sun.reflect.DelegatingMethodAccessorImpl.invoke(DelegatingMethodAccessorImpl.java:43)
[junit4:junit4]    > 	at java.lang.reflect.Method.invoke(Method.java:601)
[junit4:junit4]    > 	at com.carrotsearch.randomizedtesting.RandomizedRunner.invoke(RandomizedRunner.java:1559)
[junit4:junit4]    > 	at com.carrotsearch.randomizedtesting.RandomizedRunner.access$600(RandomizedRunner.java:79)
[junit4:junit4]    > 	at com.carrotsearch.randomizedtesting.RandomizedRunner$6.evaluate(RandomizedRunner.java:737)
[junit4:junit4]    > 	at com.carrotsearch.randomizedtesting.RandomizedRunner$7.evaluate(RandomizedRunner.java:773)
[junit4:junit4]    > 	at com.carrotsearch.randomizedtesting.RandomizedRunner$8.evaluate(RandomizedRunner.java:787)
[junit4:junit4]    > 	at com.carrotsearch.randomizedtesting.rules.SystemPropertiesRestoreRule$1.evaluate(SystemPropertiesRestoreRule.java:53)
[junit4:junit4]    > 	at org.apache.lucene.util.TestRuleSetupTeardownChained$1.evaluate(TestRuleSetupTeardownChained.java:50)
[junit4:junit4]    > 	at org.apache.lucene.util.TestRuleFieldCacheSanity$1.evaluate(TestRuleFieldCacheSanity.java:51)
[junit4:junit4]    > 	at org.apache.lucene.util.AbstractBeforeAfterRule$1.evaluate(AbstractBeforeAfterRule.java:45)
[junit4:junit4]    > 	at com.carrotsearch.randomizedtesting.rules.SystemPropertiesInvariantRule$1.evaluate(SystemPropertiesInvariantRule.java:55)
[junit4:junit4]    > 	at org.apache.lucene.util.TestRuleThreadAndTestName$1.evaluate(TestRuleThreadAndTestName.java:48)
[junit4:junit4]    > 	at org.apache.lucene.util.TestRuleIgnoreAfterMaxFailures$1.evaluate(TestRuleIgnoreAfterMaxFailures.java:70)
[junit4:junit4]    > 	at org.apache.lucene.util.TestRuleMarkFailure$1.evaluate(TestRuleMarkFailure.java:48)
[junit4:junit4]    > 	at com.carrotsearch.randomizedtesting.rules.StatementAdapter.evaluate(StatementAdapter.java:36)
[junit4:junit4]    > 	at com.carrotsearch.randomizedtesting.ThreadLeakControl$StatementRunner.run(ThreadLeakControl.java:358)
[junit4:junit4]    > 	at com.carrotsearch.randomizedtesting.ThreadLeakControl.forkTimeoutingTask(ThreadLeakControl.java:782)
[junit4:junit4]    > 	at com.carrotsearch.randomizedtesting.ThreadLeakControl$3.evaluate(ThreadLeakControl.java:442)
[junit4:junit4]    > 	at com.carrotsearch.randomizedtesting.RandomizedRunner.runSingleTest(RandomizedRunner.java:746)
[junit4:junit4]    > 	at com.carrotsearch.randomizedtesting.RandomizedRunner$3.evaluate(RandomizedRunner.java:648)
[junit4:junit4]    > 	at com.carrotsearch.randomizedtesting.RandomizedRunner$4.evaluate(RandomizedRunner.java:682)
[junit4:junit4]    > 	at com.carrotsearch.randomizedtesting.RandomizedRunner$5.evaluate(RandomizedRunner.java:693)
[junit4:junit4]    > 	at com.carrotsearch.randomizedtesting.rules.StatementAdapter.evaluate(StatementAdapter.java:36)
[junit4:junit4]    > 	at com.carrotsearch.randomizedtesting.rules.SystemPropertiesRestoreRule$1.evaluate(SystemPropertiesRestoreRule.java:53)
[junit4:junit4]    > 	at org.apache.lucene.util.AbstractBeforeAfterRule$1.evaluate(AbstractBeforeAfterRule.java:45)
[junit4:junit4]    > 	at org.apache.lucene.util.TestRuleStoreClassName$1.evaluate(TestRuleStoreClassName.java:42)
[junit4:junit4]    > 	at com.carrotsearch.randomizedtesting.rules.SystemPropertiesInvariantRule$1.evaluate(SystemPropertiesInvariantRule.java:55)
[junit4:junit4]    > 	at com.carrotsearch.randomizedtesting.rules.NoShadowingOrOverridesOnMethodsRule$1.evaluate(NoShadowingOrOverridesOnMethodsRule.java:39)
[junit4:junit4]    > 	at com.carrotsearch.randomizedtesting.rules.NoShadowingOrOverridesOnMethodsRule$1.evaluate(NoShadowingOrOverridesOnMethodsRule.java:39)
[junit4:junit4]    > 	at com.carrotsearch.randomizedtesting.rules.StatementAdapter.evaluate(StatementAdapter.java:36)
[junit4:junit4]    > 	at org.apache.lucene.util.TestRuleAssertionsRequired$1.evaluate(TestRuleAssertionsRequired.java:43)
[junit4:junit4]    > 	at org.apache.lucene.util.TestRuleMarkFailure$1.evaluate(TestRuleMarkFailure.java:48)
[junit4:junit4]    > 	at org.apache.lucene.util.TestRuleIgnoreAfterMaxFailures$1.evaluate(TestRuleIgnoreAfterMaxFailures.java:70)
[junit4:junit4]    > 	at org.apache.lucene.util.TestRuleIgnoreTestSuites$1.evaluate(TestRuleIgnoreTestSuites.java:55)
[junit4:junit4]    > 	at com.carrotsearch.randomizedtesting.rules.StatementAdapter.evaluate(StatementAdapter.java:36)
[junit4:junit4]    > 	at com.carrotsearch.randomizedtesting.ThreadLeakControl$StatementRunner.run(ThreadLeakControl.java:358)
[junit4:junit4]    > 	at java.lang.Thread.run(Thread.java:722)
[junit4:junit4]   2> 208016 T2465 oas.SolrTestCaseJ4.deleteCore ###deleteCore
[junit4:junit4]   2> NOTE: test params are: codec=Lucene40: {range_facet_l=PostingsFormat(name=Memory doPackFST= false), text=MockVariableIntBlock(baseBlockSize=119), _version_=Pulsing40(freqCutoff=12 minBlockSize=27 maxBlockSize=144), rnd_b=MockFixedIntBlock(blockSize=666), intDefault=Pulsing40(freqCutoff=12 minBlockSize=27 maxBlockSize=144), timestamp=PostingsFormat(name=Memory doPackFST= false), id=MockFixedIntBlock(blockSize=666), a_t=PostingsFormat(name=Memory doPackFST= false), range_facet_sl=MockFixedIntBlock(blockSize=666), range_facet_si=PostingsFormat(name=Memory doPackFST= false), other_tl1=Pulsing40(freqCutoff=12 minBlockSize=27 maxBlockSize=144), multiDefault=PostingsFormat(name=Memory doPackFST= false), a_si=Pulsing40(freqCutoff=12 minBlockSize=27 maxBlockSize=144)}, sim=DefaultSimilarity, locale=ca_ES, timezone=Europe/Volgograd
[junit4:junit4]   2> NOTE: FreeBSD 9.0-RELEASE amd64/Oracle Corporation 1.7.0_06 (64-bit)/cpus=16,threads=1,free=306996368,total=515899392
[junit4:junit4]   2> NOTE: All tests run in this JVM: [TestSolrDeletionPolicy2, TestStressRecovery, TestPropInject, UpdateParamsTest, IndexSchemaRuntimeFieldTest, ZkSolrClientTest, SolrIndexConfigTest, TestCSVLoader, TestJmxIntegration, DirectUpdateHandlerTest, DisMaxRequestHandlerTest, TestRTGBase, OverseerTest, URLClassifyProcessorTest, TestMergePolicyConfig, XsltUpdateRequestHandlerTest, TestQueryUtils, ShowFileRequestHandlerTest, StatelessScriptUpdateProcessorFactoryTest, BadIndexSchemaTest, PeerSyncTest, TestValueSourceCache, TermVectorComponentTest, OpenExchangeRatesOrgProviderTest, SpellingQueryConverterTest, ConvertedLegacyTest, TestDocumentBuilder, ZkNodePropsTest, TestDistributedSearch, FullSolrCloudDistribCmdsTest, LeaderElectionTest, TestPluginEnable, TestReversedWildcardFilterFactory, PathHierarchyTokenizerFactoryTest, FileUtilsTest, XmlUpdateRequestHandlerTest, DocumentAnalysisRequestHandlerTest, TestReload, TestSurroundQueryParser, RAMDirectoryFactoryTest, TestRemoteStreaming, DOMUtilTest, TestStressLucene, TestSort, HighlighterTest, SoftAutoCommitTest, TestUtils, TestBM25SimilarityFactory, TestSolrDeletionPolicy1, TestRealTimeGet, TestWriterPerf, PingRequestHandlerTest, DebugComponentTest, LukeRequestHandlerTest, TestDistributedGrouping, TestLRUCache, RecoveryZkTest, SpellCheckComponentTest, TestReplicationHandler, BasicZkTest, DistributedTermsComponentTest, StatsComponentTest, TestJoin, QueryElevationComponentTest, TestBinaryResponseWriter, TestTrie, QueryEqualityTest, PolyFieldTest, TestCSVResponseWriter, MBeansHandlerTest, TestPseudoReturnFields, IndexSchemaTest, QueryParsingTest, StandardRequestHandlerTest, ReturnFieldsTest, RequestHandlersTest, TestOmitPositions, TestArbitraryIndexDir, SolrCmdDistributorTest, UpdateRequestProcessorFactoryTest, PrimitiveFieldTypeTest, FieldMutatingUpdateProcessorTest, SOLR749Test, DefaultValueUpdateProcessorTest, TestQuerySenderListener, IndexReaderFactoryTest, MultiTermTest, EchoParamsTest, SpellPossibilityIteratorTest, TestLMDirichletSimilarityFactory, TestDFRSimilarityFactory, TestDefaultSimilarityFactory, TimeZoneUtilsTest, PrimUtilsTest, TestSystemIdResolver, DateFieldTest, UUIDFieldTest, CircularListTest, AnalysisAfterCoreReloadTest, ClusterStateUpdateTest, SyncSliceTest]
[junit4:junit4] Completed on J1 in 208.04s, 1 test, 1 error <<< FAILURES!

[...truncated 5 lines...]
BUILD FAILED
/usr/home/hudson/hudson-slave/workspace/Lucene-Solr-Tests-trunk-java7/build.xml:32: The following error occurred while executing this line:
/usr/home/hudson/hudson-slave/workspace/Lucene-Solr-Tests-trunk-java7/solr/build.xml:146: The following error occurred while executing this line:
/usr/home/hudson/hudson-slave/workspace/Lucene-Solr-Tests-trunk-java7/lucene/module-build.xml:63: The following error occurred while executing this line:
/usr/home/hudson/hudson-slave/workspace/Lucene-Solr-Tests-trunk-java7/lucene/common-build.xml:1136: The following error occurred while executing this line:
/usr/home/hudson/hudson-slave/workspace/Lucene-Solr-Tests-trunk-java7/lucene/common-build.xml:810: There were test failures: 230 suites, 950 tests, 1 error, 7 ignored (2 assumptions)

Total time: 30 minutes 18 seconds
Build step 'Invoke Ant' marked build as failure
Recording test results
Email was triggered for: Failure
Sending email for trigger: Failure



Mime
View raw message