lucene-dev mailing list archives

Site index · List index
Message view « Date » · « Thread »
Top « Date » · « Thread »
From Apache Jenkins Server <jenk...@builds.apache.org>
Subject [JENKINS] Lucene-Solr-Tests-4.x-java7 - Build # 469 - Failure
Date Wed, 19 Sep 2012 01:23:30 GMT
Build: https://builds.apache.org/job/Lucene-Solr-Tests-4.x-java7/469/

2 tests failed.
REGRESSION:  org.apache.solr.cloud.BasicDistributedZk2Test.testDistribSearch

Error Message:
Shard still reported as live in zk

Stack Trace:
java.lang.AssertionError: Shard still reported as live in zk
	at __randomizedtesting.SeedInfo.seed([C41C74D318FF6502:45FAFACB6FA0053E]:0)
	at org.junit.Assert.fail(Assert.java:93)
	at org.apache.solr.cloud.AbstractFullDistribZkTestBase.waitToSeeNotLive(AbstractFullDistribZkTestBase.java:1220)
	at org.apache.solr.cloud.BasicDistributedZk2Test.brindDownShardIndexSomeDocsAndRecover(BasicDistributedZk2Test.java:190)
	at org.apache.solr.cloud.BasicDistributedZk2Test.doTest(BasicDistributedZk2Test.java:83)
	at org.apache.solr.BaseDistributedSearchTestCase.testDistribSearch(BaseDistributedSearchTestCase.java:695)
	at sun.reflect.NativeMethodAccessorImpl.invoke0(Native Method)
	at sun.reflect.NativeMethodAccessorImpl.invoke(NativeMethodAccessorImpl.java:57)
	at sun.reflect.DelegatingMethodAccessorImpl.invoke(DelegatingMethodAccessorImpl.java:43)
	at java.lang.reflect.Method.invoke(Method.java:601)
	at com.carrotsearch.randomizedtesting.RandomizedRunner.invoke(RandomizedRunner.java:1559)
	at com.carrotsearch.randomizedtesting.RandomizedRunner.access$600(RandomizedRunner.java:79)
	at com.carrotsearch.randomizedtesting.RandomizedRunner$6.evaluate(RandomizedRunner.java:737)
	at com.carrotsearch.randomizedtesting.RandomizedRunner$7.evaluate(RandomizedRunner.java:773)
	at com.carrotsearch.randomizedtesting.RandomizedRunner$8.evaluate(RandomizedRunner.java:787)
	at com.carrotsearch.randomizedtesting.rules.SystemPropertiesRestoreRule$1.evaluate(SystemPropertiesRestoreRule.java:53)
	at org.apache.lucene.util.TestRuleSetupTeardownChained$1.evaluate(TestRuleSetupTeardownChained.java:50)
	at org.apache.lucene.util.TestRuleFieldCacheSanity$1.evaluate(TestRuleFieldCacheSanity.java:51)
	at org.apache.lucene.util.AbstractBeforeAfterRule$1.evaluate(AbstractBeforeAfterRule.java:45)
	at com.carrotsearch.randomizedtesting.rules.SystemPropertiesInvariantRule$1.evaluate(SystemPropertiesInvariantRule.java:55)
	at org.apache.lucene.util.TestRuleThreadAndTestName$1.evaluate(TestRuleThreadAndTestName.java:48)
	at org.apache.lucene.util.TestRuleIgnoreAfterMaxFailures$1.evaluate(TestRuleIgnoreAfterMaxFailures.java:70)
	at org.apache.lucene.util.TestRuleMarkFailure$1.evaluate(TestRuleMarkFailure.java:48)
	at com.carrotsearch.randomizedtesting.rules.StatementAdapter.evaluate(StatementAdapter.java:36)
	at com.carrotsearch.randomizedtesting.ThreadLeakControl$StatementRunner.run(ThreadLeakControl.java:358)
	at com.carrotsearch.randomizedtesting.ThreadLeakControl.forkTimeoutingTask(ThreadLeakControl.java:782)
	at com.carrotsearch.randomizedtesting.ThreadLeakControl$3.evaluate(ThreadLeakControl.java:442)
	at com.carrotsearch.randomizedtesting.RandomizedRunner.runSingleTest(RandomizedRunner.java:746)
	at com.carrotsearch.randomizedtesting.RandomizedRunner$3.evaluate(RandomizedRunner.java:648)
	at com.carrotsearch.randomizedtesting.RandomizedRunner$4.evaluate(RandomizedRunner.java:682)
	at com.carrotsearch.randomizedtesting.RandomizedRunner$5.evaluate(RandomizedRunner.java:693)
	at com.carrotsearch.randomizedtesting.rules.StatementAdapter.evaluate(StatementAdapter.java:36)
	at com.carrotsearch.randomizedtesting.rules.SystemPropertiesRestoreRule$1.evaluate(SystemPropertiesRestoreRule.java:53)
	at org.apache.lucene.util.AbstractBeforeAfterRule$1.evaluate(AbstractBeforeAfterRule.java:45)
	at org.apache.lucene.util.TestRuleStoreClassName$1.evaluate(TestRuleStoreClassName.java:42)
	at com.carrotsearch.randomizedtesting.rules.SystemPropertiesInvariantRule$1.evaluate(SystemPropertiesInvariantRule.java:55)
	at com.carrotsearch.randomizedtesting.rules.NoShadowingOrOverridesOnMethodsRule$1.evaluate(NoShadowingOrOverridesOnMethodsRule.java:39)
	at com.carrotsearch.randomizedtesting.rules.NoShadowingOrOverridesOnMethodsRule$1.evaluate(NoShadowingOrOverridesOnMethodsRule.java:39)
	at com.carrotsearch.randomizedtesting.rules.StatementAdapter.evaluate(StatementAdapter.java:36)
	at org.apache.lucene.util.TestRuleAssertionsRequired$1.evaluate(TestRuleAssertionsRequired.java:43)
	at org.apache.lucene.util.TestRuleMarkFailure$1.evaluate(TestRuleMarkFailure.java:48)
	at org.apache.lucene.util.TestRuleIgnoreAfterMaxFailures$1.evaluate(TestRuleIgnoreAfterMaxFailures.java:70)
	at org.apache.lucene.util.TestRuleIgnoreTestSuites$1.evaluate(TestRuleIgnoreTestSuites.java:55)
	at com.carrotsearch.randomizedtesting.rules.StatementAdapter.evaluate(StatementAdapter.java:36)
	at com.carrotsearch.randomizedtesting.ThreadLeakControl$StatementRunner.run(ThreadLeakControl.java:358)
	at java.lang.Thread.run(Thread.java:722)


REGRESSION:  org.apache.solr.cloud.SyncSliceTest.testDistribSearch

Error Message:
There are still nodes recoverying

Stack Trace:
java.lang.AssertionError: There are still nodes recoverying
	at __randomizedtesting.SeedInfo.seed([C41C74D318FF6502:45FAFACB6FA0053E]:0)
	at org.junit.Assert.fail(Assert.java:93)
	at org.apache.solr.cloud.AbstractDistribZkTestBase.waitForRecoveriesToFinish(AbstractDistribZkTestBase.java:154)
	at org.apache.solr.cloud.AbstractFullDistribZkTestBase.waitForRecoveriesToFinish(AbstractFullDistribZkTestBase.java:560)
	at org.apache.solr.cloud.AbstractFullDistribZkTestBase.waitForThingsToLevelOut(AbstractFullDistribZkTestBase.java:1135)
	at org.apache.solr.cloud.SyncSliceTest.doTest(SyncSliceTest.java:162)
	at org.apache.solr.BaseDistributedSearchTestCase.testDistribSearch(BaseDistributedSearchTestCase.java:695)
	at sun.reflect.NativeMethodAccessorImpl.invoke0(Native Method)
	at sun.reflect.NativeMethodAccessorImpl.invoke(NativeMethodAccessorImpl.java:57)
	at sun.reflect.DelegatingMethodAccessorImpl.invoke(DelegatingMethodAccessorImpl.java:43)
	at java.lang.reflect.Method.invoke(Method.java:601)
	at com.carrotsearch.randomizedtesting.RandomizedRunner.invoke(RandomizedRunner.java:1559)
	at com.carrotsearch.randomizedtesting.RandomizedRunner.access$600(RandomizedRunner.java:79)
	at com.carrotsearch.randomizedtesting.RandomizedRunner$6.evaluate(RandomizedRunner.java:737)
	at com.carrotsearch.randomizedtesting.RandomizedRunner$7.evaluate(RandomizedRunner.java:773)
	at com.carrotsearch.randomizedtesting.RandomizedRunner$8.evaluate(RandomizedRunner.java:787)
	at com.carrotsearch.randomizedtesting.rules.SystemPropertiesRestoreRule$1.evaluate(SystemPropertiesRestoreRule.java:53)
	at org.apache.lucene.util.TestRuleSetupTeardownChained$1.evaluate(TestRuleSetupTeardownChained.java:50)
	at org.apache.lucene.util.TestRuleFieldCacheSanity$1.evaluate(TestRuleFieldCacheSanity.java:51)
	at org.apache.lucene.util.AbstractBeforeAfterRule$1.evaluate(AbstractBeforeAfterRule.java:45)
	at com.carrotsearch.randomizedtesting.rules.SystemPropertiesInvariantRule$1.evaluate(SystemPropertiesInvariantRule.java:55)
	at org.apache.lucene.util.TestRuleThreadAndTestName$1.evaluate(TestRuleThreadAndTestName.java:48)
	at org.apache.lucene.util.TestRuleIgnoreAfterMaxFailures$1.evaluate(TestRuleIgnoreAfterMaxFailures.java:70)
	at org.apache.lucene.util.TestRuleMarkFailure$1.evaluate(TestRuleMarkFailure.java:48)
	at com.carrotsearch.randomizedtesting.rules.StatementAdapter.evaluate(StatementAdapter.java:36)
	at com.carrotsearch.randomizedtesting.ThreadLeakControl$StatementRunner.run(ThreadLeakControl.java:358)
	at com.carrotsearch.randomizedtesting.ThreadLeakControl.forkTimeoutingTask(ThreadLeakControl.java:782)
	at com.carrotsearch.randomizedtesting.ThreadLeakControl$3.evaluate(ThreadLeakControl.java:442)
	at com.carrotsearch.randomizedtesting.RandomizedRunner.runSingleTest(RandomizedRunner.java:746)
	at com.carrotsearch.randomizedtesting.RandomizedRunner$3.evaluate(RandomizedRunner.java:648)
	at com.carrotsearch.randomizedtesting.RandomizedRunner$4.evaluate(RandomizedRunner.java:682)
	at com.carrotsearch.randomizedtesting.RandomizedRunner$5.evaluate(RandomizedRunner.java:693)
	at com.carrotsearch.randomizedtesting.rules.StatementAdapter.evaluate(StatementAdapter.java:36)
	at com.carrotsearch.randomizedtesting.rules.SystemPropertiesRestoreRule$1.evaluate(SystemPropertiesRestoreRule.java:53)
	at org.apache.lucene.util.AbstractBeforeAfterRule$1.evaluate(AbstractBeforeAfterRule.java:45)
	at org.apache.lucene.util.TestRuleStoreClassName$1.evaluate(TestRuleStoreClassName.java:42)
	at com.carrotsearch.randomizedtesting.rules.SystemPropertiesInvariantRule$1.evaluate(SystemPropertiesInvariantRule.java:55)
	at com.carrotsearch.randomizedtesting.rules.NoShadowingOrOverridesOnMethodsRule$1.evaluate(NoShadowingOrOverridesOnMethodsRule.java:39)
	at com.carrotsearch.randomizedtesting.rules.NoShadowingOrOverridesOnMethodsRule$1.evaluate(NoShadowingOrOverridesOnMethodsRule.java:39)
	at com.carrotsearch.randomizedtesting.rules.StatementAdapter.evaluate(StatementAdapter.java:36)
	at org.apache.lucene.util.TestRuleAssertionsRequired$1.evaluate(TestRuleAssertionsRequired.java:43)
	at org.apache.lucene.util.TestRuleMarkFailure$1.evaluate(TestRuleMarkFailure.java:48)
	at org.apache.lucene.util.TestRuleIgnoreAfterMaxFailures$1.evaluate(TestRuleIgnoreAfterMaxFailures.java:70)
	at org.apache.lucene.util.TestRuleIgnoreTestSuites$1.evaluate(TestRuleIgnoreTestSuites.java:55)
	at com.carrotsearch.randomizedtesting.rules.StatementAdapter.evaluate(StatementAdapter.java:36)
	at com.carrotsearch.randomizedtesting.ThreadLeakControl$StatementRunner.run(ThreadLeakControl.java:358)
	at java.lang.Thread.run(Thread.java:722)




Build Log:
[...truncated 8292 lines...]
[junit4:junit4] Suite: org.apache.solr.cloud.SyncSliceTest
[junit4:junit4]   2> 4 T2477 oas.SolrTestCaseJ4.setUp ###Starting testDistribSearch
[junit4:junit4]   2> Creating dataDir: /usr/home/hudson/hudson-slave/workspace/Lucene-Solr-Tests-4.x-java7/solr/build/solr-core/test/J1/./solrtest-SyncSliceTest-1348017492892
[junit4:junit4]   2> 5 T2477 oasc.ZkTestServer.run STARTING ZK TEST SERVER
[junit4:junit4]   2> 8 T2478 oazs.ZooKeeperServer.setTickTime tickTime set to 1000
[junit4:junit4]   2> 9 T2478 oazs.NIOServerCnxn$Factory.<init> binding to port 0.0.0.0/0.0.0.0:0
[junit4:junit4]   2> 10 T2478 oazsp.FileTxnSnapLog.save Snapshotting: 0
[junit4:junit4]   2> 106 T2477 oasc.ZkTestServer.run start zk server on port:60263
[junit4:junit4]   2> 106 T2477 oaz.ZooKeeper.<init> Initiating client connection, connectString=127.0.0.1:60263 sessionTimeout=10000 watcher=org.apache.solr.common.cloud.ConnectionManager@7dcb924f
[junit4:junit4]   2> 107 T2483 oaz.ClientCnxn$SendThread.startConnect Opening socket connection to server /127.0.0.1:60263
[junit4:junit4]   2> 107 T2477 oascc.ConnectionManager.waitForConnected Waiting for client to connect to ZooKeeper
[junit4:junit4]   2> 108 T2483 oaz.ClientCnxn$SendThread.primeConnection Socket connection established to localhost/127.0.0.1:60263, initiating session
[junit4:junit4]   2> 108 T2479 oazs.NIOServerCnxn$Factory.run Accepted socket connection from /140.211.11.196:60266
[junit4:junit4]   2> 109 T2479 oazs.NIOServerCnxn.readConnectRequest Client attempting to establish new session at /140.211.11.196:60266
[junit4:junit4]   2> 109 T2481 oazsp.FileTxnLog.append Creating new log file: log.1
[junit4:junit4]   2> 111 T2481 oazs.NIOServerCnxn.finishSessionInit Established session 0x139dc1a93a20000 with negotiated timeout 10000 for client /140.211.11.196:60266
[junit4:junit4]   2> 111 T2483 oaz.ClientCnxn$SendThread.readConnectResult Session establishment complete on server localhost/127.0.0.1:60263, sessionid = 0x139dc1a93a20000, negotiated timeout = 10000
[junit4:junit4]   2> 112 T2484 oascc.ConnectionManager.process Watcher org.apache.solr.common.cloud.ConnectionManager@7dcb924f name:ZooKeeperConnection Watcher:127.0.0.1:60263 got event WatchedEvent state:SyncConnected type:None path:null path:null type:None
[junit4:junit4]   2> 112 T2477 oascc.ConnectionManager.waitForConnected Client is connected to ZooKeeper
[junit4:junit4]   2> 112 T2477 oascc.SolrZkClient.makePath makePath: /solr
[junit4:junit4]   2> 115 T2482 oazs.PrepRequestProcessor.pRequest Processed session termination for sessionid: 0x139dc1a93a20000
[junit4:junit4]   2> 115 T2484 oaz.ClientCnxn$EventThread.run EventThread shut down
[junit4:junit4]   2> 116 T2479 oazs.NIOServerCnxn.closeSock Closed socket connection for client /140.211.11.196:60266 which had sessionid 0x139dc1a93a20000
[junit4:junit4]   2> 115 T2477 oaz.ZooKeeper.close Session: 0x139dc1a93a20000 closed
[junit4:junit4]   2> 116 T2477 oaz.ZooKeeper.<init> Initiating client connection, connectString=127.0.0.1:60263/solr sessionTimeout=10000 watcher=org.apache.solr.common.cloud.ConnectionManager@38c9c9da
[junit4:junit4]   2> 117 T2485 oaz.ClientCnxn$SendThread.startConnect Opening socket connection to server /127.0.0.1:60263
[junit4:junit4]   2> 117 T2477 oascc.ConnectionManager.waitForConnected Waiting for client to connect to ZooKeeper
[junit4:junit4]   2> 118 T2485 oaz.ClientCnxn$SendThread.primeConnection Socket connection established to localhost/127.0.0.1:60263, initiating session
[junit4:junit4]   2> 118 T2479 oazs.NIOServerCnxn$Factory.run Accepted socket connection from /140.211.11.196:60267
[junit4:junit4]   2> 118 T2479 oazs.NIOServerCnxn.readConnectRequest Client attempting to establish new session at /140.211.11.196:60267
[junit4:junit4]   2> 125 T2481 oazs.NIOServerCnxn.finishSessionInit Established session 0x139dc1a93a20001 with negotiated timeout 10000 for client /140.211.11.196:60267
[junit4:junit4]   2> 125 T2485 oaz.ClientCnxn$SendThread.readConnectResult Session establishment complete on server localhost/127.0.0.1:60263, sessionid = 0x139dc1a93a20001, negotiated timeout = 10000
[junit4:junit4]   2> 126 T2486 oascc.ConnectionManager.process Watcher org.apache.solr.common.cloud.ConnectionManager@38c9c9da name:ZooKeeperConnection Watcher:127.0.0.1:60263/solr got event WatchedEvent state:SyncConnected type:None path:null path:null type:None
[junit4:junit4]   2> 126 T2477 oascc.ConnectionManager.waitForConnected Client is connected to ZooKeeper
[junit4:junit4]   2> 126 T2477 oascc.SolrZkClient.makePath makePath: /collections/collection1
[junit4:junit4]   2> 129 T2477 oascc.SolrZkClient.makePath makePath: /collections/collection1/shards
[junit4:junit4]   2> 139 T2477 oascc.SolrZkClient.makePath makePath: /collections/control_collection
[junit4:junit4]   2> 140 T2477 oascc.SolrZkClient.makePath makePath: /collections/control_collection/shards
[junit4:junit4]   2> 143 T2477 oasc.AbstractZkTestCase.putConfig put /usr/home/hudson/hudson-slave/workspace/Lucene-Solr-Tests-4.x-java7/solr/build/solr-core/test-files/solr/collection1/conf/solrconfig.xml to /configs/conf1/solrconfig.xml
[junit4:junit4]   2> 144 T2477 oascc.SolrZkClient.makePath makePath: /configs/conf1/solrconfig.xml
[junit4:junit4]   2> 155 T2477 oasc.AbstractZkTestCase.putConfig put /usr/home/hudson/hudson-slave/workspace/Lucene-Solr-Tests-4.x-java7/solr/build/solr-core/test-files/solr/collection1/conf/schema.xml to /configs/conf1/schema.xml
[junit4:junit4]   2> 156 T2477 oascc.SolrZkClient.makePath makePath: /configs/conf1/schema.xml
[junit4:junit4]   2> 259 T2477 oasc.AbstractZkTestCase.putConfig put /usr/home/hudson/hudson-slave/workspace/Lucene-Solr-Tests-4.x-java7/solr/build/solr-core/test-files/solr/collection1/conf/solrconfig.xml to /configs/conf1/solrconfig.xml
[junit4:junit4]   2> 261 T2477 oascc.SolrZkClient.makePath makePath: /configs/conf1/solrconfig.xml
[junit4:junit4]   2> 263 T2477 oasc.AbstractZkTestCase.putConfig put /usr/home/hudson/hudson-slave/workspace/Lucene-Solr-Tests-4.x-java7/solr/build/solr-core/test-files/solr/collection1/conf/stopwords.txt to /configs/conf1/stopwords.txt
[junit4:junit4]   2> 264 T2477 oascc.SolrZkClient.makePath makePath: /configs/conf1/stopwords.txt
[junit4:junit4]   2> 267 T2477 oasc.AbstractZkTestCase.putConfig put /usr/home/hudson/hudson-slave/workspace/Lucene-Solr-Tests-4.x-java7/solr/build/solr-core/test-files/solr/collection1/conf/protwords.txt to /configs/conf1/protwords.txt
[junit4:junit4]   2> 268 T2477 oascc.SolrZkClient.makePath makePath: /configs/conf1/protwords.txt
[junit4:junit4]   2> 277 T2477 oasc.AbstractZkTestCase.putConfig put /usr/home/hudson/hudson-slave/workspace/Lucene-Solr-Tests-4.x-java7/solr/build/solr-core/test-files/solr/collection1/conf/currency.xml to /configs/conf1/currency.xml
[junit4:junit4]   2> 278 T2477 oascc.SolrZkClient.makePath makePath: /configs/conf1/currency.xml
[junit4:junit4]   2> 280 T2477 oasc.AbstractZkTestCase.putConfig put /usr/home/hudson/hudson-slave/workspace/Lucene-Solr-Tests-4.x-java7/solr/build/solr-core/test-files/solr/collection1/conf/open-exchange-rates.json to /configs/conf1/open-exchange-rates.json
[junit4:junit4]   2> 282 T2477 oascc.SolrZkClient.makePath makePath: /configs/conf1/open-exchange-rates.json
[junit4:junit4]   2> 284 T2477 oasc.AbstractZkTestCase.putConfig put /usr/home/hudson/hudson-slave/workspace/Lucene-Solr-Tests-4.x-java7/solr/build/solr-core/test-files/solr/collection1/conf/mapping-ISOLatin1Accent.txt to /configs/conf1/mapping-ISOLatin1Accent.txt
[junit4:junit4]   2> 286 T2477 oascc.SolrZkClient.makePath makePath: /configs/conf1/mapping-ISOLatin1Accent.txt
[junit4:junit4]   2> 289 T2477 oasc.AbstractZkTestCase.putConfig put /usr/home/hudson/hudson-slave/workspace/Lucene-Solr-Tests-4.x-java7/solr/build/solr-core/test-files/solr/collection1/conf/old_synonyms.txt to /configs/conf1/old_synonyms.txt
[junit4:junit4]   2> 290 T2477 oascc.SolrZkClient.makePath makePath: /configs/conf1/old_synonyms.txt
[junit4:junit4]   2> 292 T2477 oasc.AbstractZkTestCase.putConfig put /usr/home/hudson/hudson-slave/workspace/Lucene-Solr-Tests-4.x-java7/solr/build/solr-core/test-files/solr/collection1/conf/synonyms.txt to /configs/conf1/synonyms.txt
[junit4:junit4]   2> 293 T2477 oascc.SolrZkClient.makePath makePath: /configs/conf1/synonyms.txt
[junit4:junit4]   2> 295 T2482 oazs.PrepRequestProcessor.pRequest Processed session termination for sessionid: 0x139dc1a93a20001
[junit4:junit4]   2> 296 T2486 oaz.ClientCnxn$EventThread.run EventThread shut down
[junit4:junit4]   2> 296 T2479 oazs.NIOServerCnxn.closeSock Closed socket connection for client /140.211.11.196:60267 which had sessionid 0x139dc1a93a20001
[junit4:junit4]   2> 296 T2477 oaz.ZooKeeper.close Session: 0x139dc1a93a20001 closed
[junit4:junit4]   2> 300 T2477 oejs.Server.doStart jetty-8.1.2.v20120308
[junit4:junit4]   2> 304 T2477 oejs.AbstractConnector.doStart Started SocketConnector@0.0.0.0:60270
[junit4:junit4]   2> 305 T2477 oasc.SolrResourceLoader.locateSolrHome JNDI not configured for solr (NoInitialContextEx)
[junit4:junit4]   2> 306 T2477 oasc.SolrResourceLoader.locateSolrHome using system property solr.solr.home: /usr/home/hudson/hudson-slave/workspace/Lucene-Solr-Tests-4.x-java7/solr/build/solr-core/test-files/solr
[junit4:junit4]   2> 307 T2477 oasc.SolrResourceLoader.<init> new SolrResourceLoader for deduced Solr Home: '/usr/home/hudson/hudson-slave/workspace/Lucene-Solr-Tests-4.x-java7/solr/build/solr-core/test-files/solr/'
[junit4:junit4]   2> 374 T2477 oass.SolrDispatchFilter.init SolrDispatchFilter.init()
[junit4:junit4]   2> 375 T2477 oasc.SolrResourceLoader.locateSolrHome JNDI not configured for solr (NoInitialContextEx)
[junit4:junit4]   2> 376 T2477 oasc.SolrResourceLoader.locateSolrHome using system property solr.solr.home: /usr/home/hudson/hudson-slave/workspace/Lucene-Solr-Tests-4.x-java7/solr/build/solr-core/test-files/solr
[junit4:junit4]   2> 376 T2477 oasc.CoreContainer$Initializer.initialize looking for solr.xml: /usr/home/hudson/hudson-slave/workspace/Lucene-Solr-Tests-4.x-java7/solr/build/solr-core/test-files/solr/solr.xml
[junit4:junit4]   2> 377 T2477 oasc.CoreContainer.<init> New CoreContainer 1085512196
[junit4:junit4]   2> 378 T2477 oasc.CoreContainer.load Loading CoreContainer using Solr Home: '/usr/home/hudson/hudson-slave/workspace/Lucene-Solr-Tests-4.x-java7/solr/build/solr-core/test-files/solr/'
[junit4:junit4]   2> 379 T2477 oasc.SolrResourceLoader.<init> new SolrResourceLoader for directory: '/usr/home/hudson/hudson-slave/workspace/Lucene-Solr-Tests-4.x-java7/solr/build/solr-core/test-files/solr/'
[junit4:junit4]   2> 426 T2477 oasc.CoreContainer.load Registering Log Listener
[junit4:junit4]   2> 445 T2477 oasc.CoreContainer.initZooKeeper Zookeeper client=127.0.0.1:60263/solr
[junit4:junit4]   2> 446 T2477 oaz.ZooKeeper.<init> Initiating client connection, connectString=127.0.0.1:60263/solr sessionTimeout=5000 watcher=org.apache.solr.common.cloud.ConnectionManager@b605150
[junit4:junit4]   2> 447 T2496 oaz.ClientCnxn$SendThread.startConnect Opening socket connection to server /127.0.0.1:60263
[junit4:junit4]   2> 447 T2477 oascc.ConnectionManager.waitForConnected Waiting for client to connect to ZooKeeper
[junit4:junit4]   2> 448 T2496 oaz.ClientCnxn$SendThread.primeConnection Socket connection established to localhost/127.0.0.1:60263, initiating session
[junit4:junit4]   2> 448 T2479 oazs.NIOServerCnxn$Factory.run Accepted socket connection from /140.211.11.196:60272
[junit4:junit4]   2> 448 T2479 oazs.NIOServerCnxn.readConnectRequest Client attempting to establish new session at /140.211.11.196:60272
[junit4:junit4]   2> 452 T2481 oazs.NIOServerCnxn.finishSessionInit Established session 0x139dc1a93a20002 with negotiated timeout 5000 for client /140.211.11.196:60272
[junit4:junit4]   2> 452 T2496 oaz.ClientCnxn$SendThread.readConnectResult Session establishment complete on server localhost/127.0.0.1:60263, sessionid = 0x139dc1a93a20002, negotiated timeout = 5000
[junit4:junit4]   2> 452 T2497 oascc.ConnectionManager.process Watcher org.apache.solr.common.cloud.ConnectionManager@b605150 name:ZooKeeperConnection Watcher:127.0.0.1:60263/solr got event WatchedEvent state:SyncConnected type:None path:null path:null type:None
[junit4:junit4]   2> 452 T2477 oascc.ConnectionManager.waitForConnected Client is connected to ZooKeeper
[junit4:junit4]   2> 459 T2482 oazs.PrepRequestProcessor.pRequest Got user-level KeeperException when processing sessionid:0x139dc1a93a20002 type:create cxid:0x2 zxid:0xfffffffffffffffe txntype:unknown reqpath:n/a Error Path:/solr/overseer Error:KeeperErrorCode = NodeExists for /solr/overseer
[junit4:junit4]   2> 461 T2477 oascc.SolrZkClient.makePath makePath: /live_nodes
[junit4:junit4]   2> 463 T2477 oasc.ZkController.createEphemeralLiveNode Register node as live in ZooKeeper:/live_nodes/127.0.0.1:60270_solr
[junit4:junit4]   2> 464 T2482 oazs.PrepRequestProcessor.pRequest Got user-level KeeperException when processing sessionid:0x139dc1a93a20002 type:delete cxid:0x7 zxid:0xfffffffffffffffe txntype:unknown reqpath:n/a Error Path:/solr/live_nodes/127.0.0.1:60270_solr Error:KeeperErrorCode = NoNode for /solr/live_nodes/127.0.0.1:60270_solr
[junit4:junit4]   2> 473 T2477 oascc.SolrZkClient.makePath makePath: /live_nodes/127.0.0.1:60270_solr
[junit4:junit4]   2> 475 T2477 oashc.HttpShardHandlerFactory.getParameter Setting socketTimeout to: 0
[junit4:junit4]   2> 476 T2477 oashc.HttpShardHandlerFactory.getParameter Setting urlScheme to: http://
[junit4:junit4]   2> 476 T2477 oashc.HttpShardHandlerFactory.getParameter Setting connTimeout to: 0
[junit4:junit4]   2> 477 T2477 oashc.HttpShardHandlerFactory.getParameter Setting maxConnectionsPerHost to: 20
[junit4:junit4]   2> 477 T2477 oashc.HttpShardHandlerFactory.getParameter Setting corePoolSize to: 0
[junit4:junit4]   2> 478 T2477 oashc.HttpShardHandlerFactory.getParameter Setting maximumPoolSize to: 2147483647
[junit4:junit4]   2> 479 T2477 oashc.HttpShardHandlerFactory.getParameter Setting maxThreadIdleTime to: 5
[junit4:junit4]   2> 479 T2477 oashc.HttpShardHandlerFactory.getParameter Setting sizeOfQueue to: -1
[junit4:junit4]   2> 480 T2477 oashc.HttpShardHandlerFactory.getParameter Setting fairnessPolicy to: false
[junit4:junit4]   2> 480 T2477 oascsi.HttpClientUtil.createClient Creating new http client, config:maxConnectionsPerHost=20&maxConnections=10000&socketTimeout=0&connTimeout=0&retry=false
[junit4:junit4]   2> 498 T2477 oascc.SolrZkClient.makePath makePath: /overseer_elect/election
[junit4:junit4]   2> 516 T2482 oazs.PrepRequestProcessor.pRequest Got user-level KeeperException when processing sessionid:0x139dc1a93a20002 type:delete cxid:0x15 zxid:0xfffffffffffffffe txntype:unknown reqpath:n/a Error Path:/solr/overseer_elect/leader Error:KeeperErrorCode = NoNode for /solr/overseer_elect/leader
[junit4:junit4]   2> 518 T2477 oascc.SolrZkClient.makePath makePath: /overseer_elect/leader
[junit4:junit4]   2> 525 T2477 oasc.Overseer.start Overseer (id=88343674414563330-127.0.0.1:60270_solr-n_0000000000) starting
[junit4:junit4]   2> 526 T2482 oazs.PrepRequestProcessor.pRequest Got user-level KeeperException when processing sessionid:0x139dc1a93a20002 type:create cxid:0x1a zxid:0xfffffffffffffffe txntype:unknown reqpath:n/a Error Path:/solr/overseer Error:KeeperErrorCode = NodeExists for /solr/overseer
[junit4:junit4]   2> 533 T2482 oazs.PrepRequestProcessor.pRequest Got user-level KeeperException when processing sessionid:0x139dc1a93a20002 type:create cxid:0x1b zxid:0xfffffffffffffffe txntype:unknown reqpath:n/a Error Path:/solr/overseer Error:KeeperErrorCode = NodeExists for /solr/overseer
[junit4:junit4]   2> 534 T2482 oazs.PrepRequestProcessor.pRequest Got user-level KeeperException when processing sessionid:0x139dc1a93a20002 type:create cxid:0x1c zxid:0xfffffffffffffffe txntype:unknown reqpath:n/a Error Path:/solr/overseer Error:KeeperErrorCode = NodeExists for /solr/overseer
[junit4:junit4]   2> 543 T2482 oazs.PrepRequestProcessor.pRequest Got user-level KeeperException when processing sessionid:0x139dc1a93a20002 type:create cxid:0x1d zxid:0xfffffffffffffffe txntype:unknown reqpath:n/a Error Path:/solr/overseer Error:KeeperErrorCode = NodeExists for /solr/overseer
[junit4:junit4]   2> 544 T2499 oasc.OverseerCollectionProcessor.run Process current queue of collection creations
[junit4:junit4]   2> 544 T2477 oascc.SolrZkClient.makePath makePath: /clusterstate.json
[junit4:junit4]   2> 546 T2477 oascc.ZkStateReader.createClusterStateWatchersAndUpdate Updating cluster state from ZooKeeper... 
[junit4:junit4]   2> 548 T2498 oasc.Overseer$ClusterStateUpdater.run Starting to work on the main queue
[junit4:junit4]   2> 553 T2477 oasc.CoreContainer.create Creating SolrCore 'collection1' using instanceDir: /usr/home/hudson/hudson-slave/workspace/Lucene-Solr-Tests-4.x-java7/solr/build/solr-core/test-files/solr/collection1
[junit4:junit4]   2> 554 T2477 oasc.ZkController.createCollectionZkNode Check for collection zkNode:control_collection
[junit4:junit4]   2> 555 T2477 oasc.ZkController.createCollectionZkNode Collection zkNode exists
[junit4:junit4]   2> 555 T2477 oasc.ZkController.readConfigName Load collection config from:/collections/control_collection
[junit4:junit4]   2> 556 T2477 oasc.SolrResourceLoader.<init> new SolrResourceLoader for directory: '/usr/home/hudson/hudson-slave/workspace/Lucene-Solr-Tests-4.x-java7/solr/build/solr-core/test-files/solr/collection1/'
[junit4:junit4]   2> 558 T2477 oasc.SolrResourceLoader.replaceClassLoader Adding 'file:/usr/home/hudson/hudson-slave/workspace/Lucene-Solr-Tests-4.x-java7/solr/build/solr-core/test-files/solr/collection1/lib/README' to classloader
[junit4:junit4]   2> 558 T2477 oasc.SolrResourceLoader.replaceClassLoader Adding 'file:/usr/home/hudson/hudson-slave/workspace/Lucene-Solr-Tests-4.x-java7/solr/build/solr-core/test-files/solr/collection1/lib/classes/' to classloader
[junit4:junit4]   2> 612 T2477 oasc.SolrConfig.<init> Using Lucene MatchVersion: LUCENE_40
[junit4:junit4]   2> 686 T2477 oasc.SolrConfig.<init> Loaded SolrConfig: solrconfig.xml
[junit4:junit4]   2> 787 T2477 oass.IndexSchema.readSchema Reading Solr Schema
[junit4:junit4]   2> 795 T2477 oass.IndexSchema.readSchema Schema name=test
[junit4:junit4]   2> 1147 T3 oasc.CoreContainer.finalize SEVERE CoreContainer was not shutdown prior to finalize(), indicates a bug -- POSSIBLE RESOURCE LEAK!!!  instance=894478463
[junit4:junit4]   2> 1147 T3 oasc.SolrCore.finalize SEVERE REFCOUNT ERROR: unreferenced org.apache.solr.core.SolrCore@15af3084 (collection1) has a reference count of 1
[junit4:junit4]   2> 1148 T3 oasc.CoreContainer.finalize SEVERE CoreContainer was not shutdown prior to finalize(), indicates a bug -- POSSIBLE RESOURCE LEAK!!!  instance=1614323777
[junit4:junit4]   2> 1481 T2477 oass.OpenExchangeRatesOrgProvider.init Initialized with rates=open-exchange-rates.json, refreshInterval=1440.
[junit4:junit4]   2> 1498 T2477 oass.IndexSchema.readSchema default search field in schema is text
[junit4:junit4]   2> 1503 T2477 oass.IndexSchema.readSchema unique key field: id
[junit4:junit4]   2> 1514 T2477 oass.FileExchangeRateProvider.reload Reloading exchange rates from file currency.xml
[junit4:junit4]   2> 1519 T2477 oass.FileExchangeRateProvider.reload Reloading exchange rates from file currency.xml
[junit4:junit4]   2> 1524 T2477 oass.OpenExchangeRatesOrgProvider.reload Reloading exchange rates from open-exchange-rates.json
[junit4:junit4]   2> 1525 T2477 oass.OpenExchangeRatesOrgProvider.reload Reloading exchange rates from open-exchange-rates.json
[junit4:junit4]   2> 1526 T2477 oasc.SolrCore.<init> [collection1] Opening new SolrCore at /usr/home/hudson/hudson-slave/workspace/Lucene-Solr-Tests-4.x-java7/solr/build/solr-core/test-files/solr/collection1/, dataDir=./org.apache.solr.cloud.SyncSliceTest-1348017492891/control/data/
[junit4:junit4]   2> 1527 T2477 oasc.JmxMonitoredMap.<init> JMX monitoring is enabled. Adding Solr mbeans to JMX Server: com.sun.jmx.mbeanserver.JmxMBeanServer@7b9f4f58
[junit4:junit4]   2> 1528 T2477 oasc.SolrCore.getNewIndexDir WARNING New index directory detected: old=null new=./org.apache.solr.cloud.SyncSliceTest-1348017492891/control/data/index/
[junit4:junit4]   2> 1529 T2477 oasc.SolrCore.initIndex WARNING [collection1] Solr index directory './org.apache.solr.cloud.SyncSliceTest-1348017492891/control/data/index' doesn't exist. Creating new index...
[junit4:junit4]   2> 1530 T2477 oasc.CachingDirectoryFactory.get return new directory for /usr/home/hudson/hudson-slave/workspace/Lucene-Solr-Tests-4.x-java7/solr/build/solr-core/test/J1/./org.apache.solr.cloud.SyncSliceTest-1348017492891/control/data/index forceNew:false
[junit4:junit4]   2> 1548 T2477 oasc.SolrDeletionPolicy.onCommit SolrDeletionPolicy.onCommit: commits:num=1
[junit4:junit4]   2> 		commit{dir=NRTCachingDirectory(org.apache.lucene.store.NIOFSDirectory@/usr/home/hudson/hudson-slave/workspace/Lucene-Solr-Tests-4.x-java7/solr/build/solr-core/test/J1/org.apache.solr.cloud.SyncSliceTest-1348017492891/control/data/index lockFactory=org.apache.lucene.store.NativeFSLockFactory@23767cf5; maxCacheMB=48.0 maxMergeSizeMB=4.0),segFN=segments_1,generation=1,filenames=[segments_1]
[junit4:junit4]   2> 1549 T2477 oasc.SolrDeletionPolicy.updateCommits newest commit = 1
[junit4:junit4]   2> 1550 T2477 oasc.SolrCore.initWriters created xml: solr.XMLResponseWriter
[junit4:junit4]   2> 1552 T2477 oasup.UpdateRequestProcessorChain.init inserting DistributedUpdateProcessorFactory into updateRequestProcessorChain "dedupe"
[junit4:junit4]   2> 1553 T2477 oasup.UpdateRequestProcessorChain.init inserting DistributedUpdateProcessorFactory into updateRequestProcessorChain "dedupe-allfields"
[junit4:junit4]   2> 1553 T2477 oasup.UpdateRequestProcessorChain.init inserting DistributedUpdateProcessorFactory into updateRequestProcessorChain "stored_sig"
[junit4:junit4]   2> 1554 T2477 oasup.UpdateRequestProcessorChain.init inserting DistributedUpdateProcessorFactory into updateRequestProcessorChain "uniq-fields"
[junit4:junit4]   2> 1555 T2477 oasup.UpdateRequestProcessorChain.init inserting DistributedUpdateProcessorFactory into updateRequestProcessorChain "distrib-dup-test-chain-implicit"
[junit4:junit4]   2> 1556 T2477 oasc.RequestHandlers.initHandlersFromConfig adding lazy requestHandler: solr.ReplicationHandler
[junit4:junit4]   2> 1556 T2477 oasc.RequestHandlers.initHandlersFromConfig created /replication: solr.ReplicationHandler
[junit4:junit4]   2> 1557 T2477 oasc.RequestHandlers.initHandlersFromConfig created standard: solr.StandardRequestHandler
[junit4:junit4]   2> 1558 T2477 oasc.RequestHandlers.initHandlersFromConfig created /get: solr.RealTimeGetHandler
[junit4:junit4]   2> 1558 T2477 oasc.RequestHandlers.initHandlersFromConfig created dismax: solr.SearchHandler
[junit4:junit4]   2> 1559 T2477 oasc.RequestHandlers.initHandlersFromConfig created mock: org.apache.solr.core.MockQuerySenderListenerReqHandler
[junit4:junit4]   2> 1560 T2477 oasc.RequestHandlers.initHandlersFromConfig created /admin/: org.apache.solr.handler.admin.AdminHandlers
[junit4:junit4]   2> 1561 T2477 oasc.RequestHandlers.initHandlersFromConfig created defaults: solr.StandardRequestHandler
[junit4:junit4]   2> 1561 T2477 oasc.RequestHandlers.initHandlersFromConfig adding lazy requestHandler: solr.StandardRequestHandler
[junit4:junit4]   2> 1562 T2477 oasc.RequestHandlers.initHandlersFromConfig created lazy: solr.StandardRequestHandler
[junit4:junit4]   2> 1562 T2477 oasc.RequestHandlers.initHandlersFromConfig created /update: solr.UpdateRequestHandler
[junit4:junit4]   2> 1563 T2477 oasc.RequestHandlers.initHandlersFromConfig created /terms: org.apache.solr.handler.component.SearchHandler
[junit4:junit4]   2> 1564 T2477 oasc.RequestHandlers.initHandlersFromConfig created spellCheckCompRH: org.apache.solr.handler.component.SearchHandler
[junit4:junit4]   2> 1564 T2477 oasc.RequestHandlers.initHandlersFromConfig created spellCheckCompRH_Direct: org.apache.solr.handler.component.SearchHandler
[junit4:junit4]   2> 1565 T2477 oasc.RequestHandlers.initHandlersFromConfig created spellCheckWithWordbreak: org.apache.solr.handler.component.SearchHandler
[junit4:junit4]   2> 1566 T2477 oasc.RequestHandlers.initHandlersFromConfig created spellCheckWithWordbreak_Direct: org.apache.solr.handler.component.SearchHandler
[junit4:junit4]   2> 1567 T2477 oasc.RequestHandlers.initHandlersFromConfig created spellCheckCompRH1: org.apache.solr.handler.component.SearchHandler
[junit4:junit4]   2> 1567 T2477 oasc.RequestHandlers.initHandlersFromConfig created tvrh: org.apache.solr.handler.component.SearchHandler
[junit4:junit4]   2> 1568 T2477 oasc.RequestHandlers.initHandlersFromConfig created /mlt: solr.MoreLikeThisHandler
[junit4:junit4]   2> 1569 T2477 oasc.RequestHandlers.initHandlersFromConfig created /debug/dump: solr.DumpRequestHandler
[junit4:junit4]   2> 1573 T2477 oashl.XMLLoader.init xsltCacheLifetimeSeconds=60
[junit4:junit4]   2> 1578 T2477 oasc.SolrCore.initDeprecatedSupport WARNING solrconfig.xml uses deprecated <admin/gettableFiles>, Please update your config to use the ShowFileRequestHandler.
[junit4:junit4]   2> 1579 T2477 oasc.SolrCore.initDeprecatedSupport WARNING adding ShowFileRequestHandler with hidden files: [SCHEMA.XML, OLD_SYNONYMS.TXT, STOPWORDS.TXT, PROTWORDS.TXT, OPEN-EXCHANGE-RATES.JSON, SYNONYMS.TXT, CURRENCY.XML, MAPPING-ISOLATIN1ACCENT.TXT]
[junit4:junit4]   2> 1584 T2477 oass.SolrIndexSearcher.<init> Opening Searcher@7cf8ebee main
[junit4:junit4]   2> 1586 T2477 oasu.CommitTracker.<init> Hard AutoCommit: disabled
[junit4:junit4]   2> 1586 T2477 oasu.CommitTracker.<init> Soft AutoCommit: disabled
[junit4:junit4]   2> 1587 T2477 oashc.SpellCheckComponent.inform Initializing spell checkers
[junit4:junit4]   2> 1604 T2477 oass.DirectSolrSpellChecker.init init: {name=direct,classname=DirectSolrSpellChecker,field=lowerfilt,minQueryLength=3}
[junit4:junit4]   2> 1679 T2500 oasc.SolrCore.registerSearcher [collection1] Registered new searcher Searcher@7cf8ebee main{StandardDirectoryReader(segments_1:1)}
[junit4:junit4]   2> 1684 T2482 oazs.PrepRequestProcessor.pRequest Got user-level KeeperException when processing sessionid:0x139dc1a93a20002 type:create cxid:0x56 zxid:0xfffffffffffffffe txntype:unknown reqpath:n/a Error Path:/solr/overseer/queue Error:KeeperErrorCode = NoNode for /solr/overseer/queue
[junit4:junit4]   2> 1695 T2477 oasc.CoreContainer.register registering core: collection1
[junit4:junit4]   2> 1696 T2477 oasc.ZkController.register Register shard - core:collection1 address:http://127.0.0.1:60270/solr shardId:control_shard
[junit4:junit4]   2> 1696 T2477 oascc.SolrZkClient.makePath makePath: /collections/control_collection/leader_elect/control_shard/election
[junit4:junit4]   2> 1701 T2482 oazs.PrepRequestProcessor.pRequest Got user-level KeeperException when processing sessionid:0x139dc1a93a20002 type:delete cxid:0x65 zxid:0xfffffffffffffffe txntype:unknown reqpath:n/a Error Path:/solr/collections/control_collection/leaders Error:KeeperErrorCode = NoNode for /solr/collections/control_collection/leaders
[junit4:junit4]   2> 1702 T2477 oasc.ShardLeaderElectionContext.runLeaderProcess Running the leader process.
[junit4:junit4]   2> 1703 T2482 oazs.PrepRequestProcessor.pRequest Got user-level KeeperException when processing sessionid:0x139dc1a93a20002 type:create cxid:0x66 zxid:0xfffffffffffffffe txntype:unknown reqpath:n/a Error Path:/solr/overseer Error:KeeperErrorCode = NodeExists for /solr/overseer
[junit4:junit4]   2> 2052 T2498 oascc.ZkStateReader.updateClusterState Updating cloud state from ZooKeeper... 
[junit4:junit4]   2> 2053 T2482 oazs.PrepRequestProcessor.pRequest Got user-level KeeperException when processing sessionid:0x139dc1a93a20002 type:create cxid:0x6d zxid:0xfffffffffffffffe txntype:unknown reqpath:n/a Error Path:/solr/overseer/queue-work Error:KeeperErrorCode = NoNode for /solr/overseer/queue-work
[junit4:junit4]   2> 2062 T2497 oascc.ZkStateReader$2.process A cluster state change has occurred - updating...
[junit4:junit4]   2> 2213 T2477 oasc.ShardLeaderElectionContext.waitForReplicasToComeUp Enough replicas found to continue.
[junit4:junit4]   2> 2214 T2477 oasc.ShardLeaderElectionContext.runLeaderProcess I may be the new leader - try and sync
[junit4:junit4]   2> 2214 T2477 oasc.SyncStrategy.sync Sync replicas to http://127.0.0.1:60270/solr/collection1/
[junit4:junit4]   2> 2215 T2477 oasc.SyncStrategy.syncReplicas Sync Success - now sync replicas to me
[junit4:junit4]   2> 2215 T2477 oasc.SyncStrategy.syncToMe http://127.0.0.1:60270/solr/collection1/ has no replicas
[junit4:junit4]   2> 2216 T2477 oasc.ShardLeaderElectionContext.runLeaderProcess I am the new leader: http://127.0.0.1:60270/solr/collection1/
[junit4:junit4]   2> 2216 T2477 oascc.SolrZkClient.makePath makePath: /collections/control_collection/leaders/control_shard
[junit4:junit4]   2> 2219 T2482 oazs.PrepRequestProcessor.pRequest Got user-level KeeperException when processing sessionid:0x139dc1a93a20002 type:create cxid:0x8b zxid:0xfffffffffffffffe txntype:unknown reqpath:n/a Error Path:/solr/overseer Error:KeeperErrorCode = NodeExists for /solr/overseer
[junit4:junit4]   2> 2566 T2498 oascc.ZkStateReader.updateClusterState Updating cloud state from ZooKeeper... 
[junit4:junit4]   2> 2581 T2497 oascc.ZkStateReader$2.process A cluster state change has occurred - updating...
[junit4:junit4]   2> 2587 T2477 oasc.ZkController.register We are http://127.0.0.1:60270/solr/collection1/ and leader is http://127.0.0.1:60270/solr/collection1/
[junit4:junit4]   2> 2587 T2477 oasc.ZkController.register No LogReplay needed for core=collection1 baseURL=http://127.0.0.1:60270/solr
[junit4:junit4]   2> 2588 T2477 oasc.ZkController.checkRecovery I am the leader, no recovery necessary
[junit4:junit4]   2> 2589 T2477 oascc.ZkStateReader.updateClusterState Updating cloud state from ZooKeeper... 
[junit4:junit4]   2> 2590 T2477 oass.SolrDispatchFilter.init user.dir=/usr/home/hudson/hudson-slave/workspace/Lucene-Solr-Tests-4.x-java7/solr/build/solr-core/test/J1
[junit4:junit4]   2> 2591 T2477 oass.SolrDispatchFilter.init SolrDispatchFilter.init() done
[junit4:junit4]   2> 2591 T2477 oascsi.HttpClientUtil.createClient Creating new http client, config:maxConnections=128&maxConnectionsPerHost=32&followRedirects=false
[junit4:junit4]   2> 3084 T2498 oascc.ZkStateReader.updateClusterState Updating cloud state from ZooKeeper... 
[junit4:junit4]   2> 3126 T2477 oejs.Server.doStart jetty-8.1.2.v20120308
[junit4:junit4]   2> 3129 T2477 oejs.AbstractConnector.doStart Started SocketConnector@0.0.0.0:60289
[junit4:junit4]   2> 3130 T2477 oasc.SolrResourceLoader.locateSolrHome JNDI not configured for solr (NoInitialContextEx)
[junit4:junit4]   2> 3131 T2477 oasc.SolrResourceLoader.locateSolrHome using system property solr.solr.home: /usr/home/hudson/hudson-slave/workspace/Lucene-Solr-Tests-4.x-java7/solr/build/solr-core/test/J1/./solrtest-jetty1-1348017495492
[junit4:junit4]   2> 3131 T2477 oasc.SolrResourceLoader.<init> new SolrResourceLoader for deduced Solr Home: '/usr/home/hudson/hudson-slave/workspace/Lucene-Solr-Tests-4.x-java7/solr/build/solr-core/test/J1/./solrtest-jetty1-1348017495492/'
[junit4:junit4]   2> 3147 T2497 oascc.ZkStateReader$2.process A cluster state change has occurred - updating...
[junit4:junit4]   2> 3177 T2477 oass.SolrDispatchFilter.init SolrDispatchFilter.init()
[junit4:junit4]   2> 3178 T2477 oasc.SolrResourceLoader.locateSolrHome JNDI not configured for solr (NoInitialContextEx)
[junit4:junit4]   2> 3178 T2477 oasc.SolrResourceLoader.locateSolrHome using system property solr.solr.home: /usr/home/hudson/hudson-slave/workspace/Lucene-Solr-Tests-4.x-java7/solr/build/solr-core/test/J1/./solrtest-jetty1-1348017495492
[junit4:junit4]   2> 3179 T2477 oasc.CoreContainer$Initializer.initialize looking for solr.xml: /usr/home/hudson/hudson-slave/workspace/Lucene-Solr-Tests-4.x-java7/solr/build/solr-core/test/J1/./solrtest-jetty1-1348017495492/solr.xml
[junit4:junit4]   2> 3179 T2477 oasc.CoreContainer.<init> New CoreContainer 675493675
[junit4:junit4]   2> 3180 T2477 oasc.CoreContainer.load Loading CoreContainer using Solr Home: '/usr/home/hudson/hudson-slave/workspace/Lucene-Solr-Tests-4.x-java7/solr/build/solr-core/test/J1/./solrtest-jetty1-1348017495492/'
[junit4:junit4]   2> 3181 T2477 oasc.SolrResourceLoader.<init> new SolrResourceLoader for directory: '/usr/home/hudson/hudson-slave/workspace/Lucene-Solr-Tests-4.x-java7/solr/build/solr-core/test/J1/./solrtest-jetty1-1348017495492/'
[junit4:junit4]   2> 3218 T2477 oasc.CoreContainer.load Registering Log Listener
[junit4:junit4]   2> 3236 T2477 oasc.CoreContainer.initZooKeeper Zookeeper client=127.0.0.1:60263/solr
[junit4:junit4]   2> 3236 T2477 oaz.ZooKeeper.<init> Initiating client connection, connectString=127.0.0.1:60263/solr sessionTimeout=5000 watcher=org.apache.solr.common.cloud.ConnectionManager@1f4145d7
[junit4:junit4]   2> 3238 T2510 oaz.ClientCnxn$SendThread.startConnect Opening socket connection to server /127.0.0.1:60263
[junit4:junit4]   2> 3237 T2477 oascc.ConnectionManager.waitForConnected Waiting for client to connect to ZooKeeper
[junit4:junit4]   2> 3239 T2510 oaz.ClientCnxn$SendThread.primeConnection Socket connection established to localhost/127.0.0.1:60263, initiating session
[junit4:junit4]   2> 3239 T2479 oazs.NIOServerCnxn$Factory.run Accepted socket connection from /140.211.11.196:60292
[junit4:junit4]   2> 3239 T2479 oazs.NIOServerCnxn.readConnectRequest Client attempting to establish new session at /140.211.11.196:60292
[junit4:junit4]   2> 3260 T2481 oazs.NIOServerCnxn.finishSessionInit Established session 0x139dc1a93a20003 with negotiated timeout 5000 for client /140.211.11.196:60292
[junit4:junit4]   2> 3260 T2510 oaz.ClientCnxn$SendThread.readConnectResult Session establishment complete on server localhost/127.0.0.1:60263, sessionid = 0x139dc1a93a20003, negotiated timeout = 5000
[junit4:junit4]   2> 3261 T2511 oascc.ConnectionManager.process Watcher org.apache.solr.common.cloud.ConnectionManager@1f4145d7 name:ZooKeeperConnection Watcher:127.0.0.1:60263/solr got event WatchedEvent state:SyncConnected type:None path:null path:null type:None
[junit4:junit4]   2> 3261 T2477 oascc.ConnectionManager.waitForConnected Client is connected to ZooKeeper
[junit4:junit4]   2> 3262 T2482 oazs.PrepRequestProcessor.pRequest Got user-level KeeperException when processing sessionid:0x139dc1a93a20003 type:create cxid:0x1 zxid:0xfffffffffffffffe txntype:unknown reqpath:n/a Error Path:/solr/overseer Error:KeeperErrorCode = NodeExists for /solr/overseer
[junit4:junit4]   2> 3263 T2482 oazs.PrepRequestProcessor.pRequest Got user-level KeeperException when processing sessionid:0x139dc1a93a20003 type:create cxid:0x2 zxid:0xfffffffffffffffe txntype:unknown reqpath:n/a Error Path:/solr/overseer Error:KeeperErrorCode = NodeExists for /solr/overseer
[junit4:junit4]   2> 3291 T2477 oasc.ZkController.createEphemeralLiveNode Register node as live in ZooKeeper:/live_nodes/127.0.0.1:60289_solr
[junit4:junit4]   2> 3292 T2482 oazs.PrepRequestProcessor.pRequest Got user-level KeeperException when processing sessionid:0x139dc1a93a20003 type:delete cxid:0x4 zxid:0xfffffffffffffffe txntype:unknown reqpath:n/a Error Path:/solr/live_nodes/127.0.0.1:60289_solr Error:KeeperErrorCode = NoNode for /solr/live_nodes/127.0.0.1:60289_solr
[junit4:junit4]   2> 3320 T2477 oascc.SolrZkClient.makePath makePath: /live_nodes/127.0.0.1:60289_solr
[junit4:junit4]   2> 3322 T2497 oascc.ZkStateReader$3.process Updating live nodes
[junit4:junit4]   2> 3323 T2477 oashc.HttpShardHandlerFactory.getParameter Setting socketTimeout to: 0
[junit4:junit4]   2> 3323 T2477 oashc.HttpShardHandlerFactory.getParameter Setting urlScheme to: http://
[junit4:junit4]   2> 3324 T2477 oashc.HttpShardHandlerFactory.getParameter Setting connTimeout to: 0
[junit4:junit4]   2> 3324 T2477 oashc.HttpShardHandlerFactory.getParameter Setting maxConnectionsPerHost to: 20
[junit4:junit4]   2> 3325 T2477 oashc.HttpShardHandlerFactory.getParameter Setting corePoolSize to: 0
[junit4:junit4]   2> 3325 T2477 oashc.HttpShardHandlerFactory.getParameter Setting maximumPoolSize to: 2147483647
[junit4:junit4]   2> 3326 T2477 oashc.HttpShardHandlerFactory.getParameter Setting maxThreadIdleTime to: 5
[junit4:junit4]   2> 3326 T2477 oashc.HttpShardHandlerFactory.getParameter Setting sizeOfQueue to: -1
[junit4:junit4]   2> 3327 T2477 oashc.HttpShardHandlerFactory.getParameter Setting fairnessPolicy to: false
[junit4:junit4]   2> 3327 T2477 oascsi.HttpClientUtil.createClient Creating new http client, config:maxConnectionsPerHost=20&maxConnections=10000&socketTimeout=0&connTimeout=0&retry=false
[junit4:junit4]   2> 3362 T2477 oascc.ZkStateReader.createClusterStateWatchersAndUpdate Updating cluster state from ZooKeeper... 
[junit4:junit4]   2> 3369 T2477 oasc.CoreContainer.create Creating SolrCore 'collection1' using instanceDir: /usr/home/hudson/hudson-slave/workspace/Lucene-Solr-Tests-4.x-java7/solr/build/solr-core/test/J1/./solrtest-jetty1-1348017495492/collection1
[junit4:junit4]   2> 3369 T2477 oasc.ZkController.createCollectionZkNode Check for collection zkNode:collection1
[junit4:junit4]   2> 3370 T2477 oasc.ZkController.createCollectionZkNode Collection zkNode exists
[junit4:junit4]   2> 3371 T2477 oasc.ZkController.readConfigName Load collection config from:/collections/collection1
[junit4:junit4]   2> 3372 T2477 oasc.SolrResourceLoader.<init> new SolrResourceLoader for directory: '/usr/home/hudson/hudson-slave/workspace/Lucene-Solr-Tests-4.x-java7/solr/build/solr-core/test/J1/./solrtest-jetty1-1348017495492/collection1/'
[junit4:junit4]   2> 3374 T2477 oasc.SolrResourceLoader.replaceClassLoader Adding 'file:/usr/home/hudson/hudson-slave/workspace/Lucene-Solr-Tests-4.x-java7/solr/build/solr-core/test/J1/solrtest-jetty1-1348017495492/collection1/lib/classes/' to classloader
[junit4:junit4]   2> 3375 T2477 oasc.SolrResourceLoader.replaceClassLoader Adding 'file:/usr/home/hudson/hudson-slave/workspace/Lucene-Solr-Tests-4.x-java7/solr/build/solr-core/test/J1/solrtest-jetty1-1348017495492/collection1/lib/README' to classloader
[junit4:junit4]   2> 3455 T2477 oasc.SolrConfig.<init> Using Lucene MatchVersion: LUCENE_40
[junit4:junit4]   2> 3569 T2477 oasc.SolrConfig.<init> Loaded SolrConfig: solrconfig.xml
[junit4:junit4]   2> 3670 T2477 oass.IndexSchema.readSchema Reading Solr Schema
[junit4:junit4]   2> 3678 T2477 oass.IndexSchema.readSchema Schema name=test
[junit4:junit4]   2> 4618 T2477 oass.OpenExchangeRatesOrgProvider.init Initialized with rates=open-exchange-rates.json, refreshInterval=1440.
[junit4:junit4]   2> 4631 T2477 oass.IndexSchema.readSchema default search field in schema is text
[junit4:junit4]   2> 4636 T2477 oass.IndexSchema.readSchema unique key field: id
[junit4:junit4]   2> 4648 T2477 oass.FileExchangeRateProvider.reload Reloading exchange rates from file currency.xml
[junit4:junit4]   2> 4653 T2477 oass.FileExchangeRateProvider.reload Reloading exchange rates from file currency.xml
[junit4:junit4]   2> 4659 T2477 oass.OpenExchangeRatesOrgProvider.reload Reloading exchange rates from open-exchange-rates.json
[junit4:junit4]   2> 4661 T2477 oass.OpenExchangeRatesOrgProvider.reload Reloading exchange rates from open-exchange-rates.json
[junit4:junit4]   2> 4662 T2477 oasc.SolrCore.<init> [collection1] Opening new SolrCore at /usr/home/hudson/hudson-slave/workspace/Lucene-Solr-Tests-4.x-java7/solr/build/solr-core/test/J1/./solrtest-jetty1-1348017495492/collection1/, dataDir=./org.apache.solr.cloud.SyncSliceTest-1348017492891/jetty1/
[junit4:junit4]   2> 4662 T2477 oasc.JmxMonitoredMap.<init> JMX monitoring is enabled. Adding Solr mbeans to JMX Server: com.sun.jmx.mbeanserver.JmxMBeanServer@7b9f4f58
[junit4:junit4]   2> 4664 T2477 oasc.SolrCore.getNewIndexDir WARNING New index directory detected: old=null new=./org.apache.solr.cloud.SyncSliceTest-1348017492891/jetty1/index/
[junit4:junit4]   2> 4665 T2477 oasc.SolrCore.initIndex WARNING [collection1] Solr index directory './org.apache.solr.cloud.SyncSliceTest-1348017492891/jetty1/index' doesn't exist. Creating new index...
[junit4:junit4]   2> 4666 T2477 oasc.CachingDirectoryFactory.get return new directory for /usr/home/hudson/hudson-slave/workspace/Lucene-Solr-Tests-4.x-java7/solr/build/solr-core/test/J1/./org.apache.solr.cloud.SyncSliceTest-1348017492891/jetty1/index forceNew:false
[junit4:junit4]   2> 4673 T2477 oasc.SolrDeletionPolicy.onCommit SolrDeletionPolicy.onCommit: commits:num=1
[junit4:junit4]   2> 		commit{dir=NRTCachingDirectory(org.apache.lucene.store.NIOFSDirectory@/usr/home/hudson/hudson-slave/workspace/Lucene-Solr-Tests-4.x-java7/solr/build/solr-core/test/J1/org.apache.solr.cloud.SyncSliceTest-1348017492891/jetty1/index lockFactory=org.apache.lucene.store.NativeFSLockFactory@43a28d7e; maxCacheMB=48.0 maxMergeSizeMB=4.0),segFN=segments_1,generation=1,filenames=[segments_1]
[junit4:junit4]   2> 4673 T2477 oasc.SolrDeletionPolicy.updateCommits newest commit = 1
[junit4:junit4]   2> 4674 T2477 oasc.SolrCore.initWriters created xml: solr.XMLResponseWriter
[junit4:junit4]   2> 4677 T2477 oasup.UpdateRequestProcessorChain.init inserting DistributedUpdateProcessorFactory into updateRequestProcessorChain "dedupe"
[junit4:junit4]   2> 4678 T2477 oasup.UpdateRequestProcessorChain.init inserting DistributedUpdateProcessorFactory into updateRequestProcessorChain "dedupe-allfields"
[junit4:junit4]   2> 4679 T2477 oasup.UpdateRequestProcessorChain.init inserting DistributedUpdateProcessorFactory into updateRequestProcessorChain "stored_sig"
[junit4:junit4]   2> 4679 T2477 oasup.UpdateRequestProcessorChain.init inserting DistributedUpdateProcessorFactory into updateRequestProcessorChain "uniq-fields"
[junit4:junit4]   2> 4680 T2477 oasup.UpdateRequestProcessorChain.init inserting DistributedUpdateProcessorFactory into updateRequestProcessorChain "distrib-dup-test-chain-implicit"
[junit4:junit4]   2> 4680 T2477 oasc.RequestHandlers.initHandlersFromConfig adding lazy requestHandler: solr.ReplicationHandler
[junit4:junit4]   2> 4681 T2477 oasc.RequestHandlers.initHandlersFromConfig created /replication: solr.ReplicationHandler
[junit4:junit4]   2> 4682 T2477 oasc.RequestHandlers.initHandlersFromConfig created standard: solr.StandardRequestHandler
[junit4:junit4]   2> 4682 T2477 oasc.RequestHandlers.initHandlersFromConfig created /get: solr.RealTimeGetHandler
[junit4:junit4]   2> 4683 T2477 oasc.RequestHandlers.initHandlersFromConfig created dismax: solr.SearchHandler
[junit4:junit4]   2> 4684 T2477 oasc.RequestHandlers.initHandlersFromConfig created mock: org.apache.solr.core.MockQuerySenderListenerReqHandler
[junit4:junit4]   2> 4685 T2477 oasc.RequestHandlers.initHandlersFromConfig created /admin/: org.apache.solr.handler.admin.AdminHandlers
[junit4:junit4]   2> 4685 T2477 oasc.RequestHandlers.initHandlersFromConfig created defaults: solr.StandardRequestHandler
[junit4:junit4]   2> 4686 T2477 oasc.RequestHandlers.initHandlersFromConfig adding lazy requestHandler: solr.StandardRequestHandler
[junit4:junit4]   2> 4686 T2477 oasc.RequestHandlers.initHandlersFromConfig created lazy: solr.StandardRequestHandler
[junit4:junit4]   2> 4687 T2477 oasc.RequestHandlers.initHandlersFromConfig created /update: solr.UpdateRequestHandler
[junit4:junit4]   2> 4688 T2477 oasc.RequestHandlers.initHandlersFromConfig created /terms: org.apache.solr.handler.component.SearchHandler
[junit4:junit4]   2> 4689 T2477 oasc.RequestHandlers.initHandlersFromConfig created spellCheckCompRH: org.apache.solr.handler.component.SearchHandler
[junit4:junit4]   2> 4689 T2477 oasc.RequestHandlers.initHandlersFromConfig created spellCheckCompRH_Direct: org.apache.solr.handler.component.SearchHandler
[junit4:junit4]   2> 4690 T2477 oasc.RequestHandlers.initHandlersFromConfig created spellCheckWithWordbreak: org.apache.solr.handler.component.SearchHandler
[junit4:junit4]   2> 4691 T2477 oasc.RequestHandlers.initHandlersFromConfig created spellCheckWithWordbreak_Direct: org.apache.solr.handler.component.SearchHandler
[junit4:junit4]   2> 4692 T2477 oasc.RequestHandlers.initHandlersFromConfig created spellCheckCompRH1: org.apache.solr.handler.component.SearchHandler
[junit4:junit4]   2> 4692 T2477 oasc.RequestHandlers.initHandlersFromConfig created tvrh: org.apache.solr.handler.component.SearchHandler
[junit4:junit4]   2> 4693 T2477 oasc.RequestHandlers.initHandlersFromConfig created /mlt: solr.MoreLikeThisHandler
[junit4:junit4]   2> 4694 T2477 oasc.RequestHandlers.initHandlersFromConfig created /debug/dump: solr.DumpRequestHandler
[junit4:junit4]   2> 4698 T2477 oashl.XMLLoader.init xsltCacheLifetimeSeconds=60
[junit4:junit4]   2> 4703 T2477 oasc.SolrCore.initDeprecatedSupport WARNING solrconfig.xml uses deprecated <admin/gettableFiles>, Please update your config to use the ShowFileRequestHandler.
[junit4:junit4]   2> 4704 T2477 oasc.SolrCore.initDeprecatedSupport WARNING adding ShowFileRequestHandler with hidden files: [SCHEMA.XML, OLD_SYNONYMS.TXT, STOPWORDS.TXT, PROTWORDS.TXT, OPEN-EXCHANGE-RATES.JSON, SYNONYMS.TXT, CURRENCY.XML, MAPPING-ISOLATIN1ACCENT.TXT]
[junit4:junit4]   2> 4708 T2477 oass.SolrIndexSearcher.<init> Opening Searcher@1eb126d3 main
[junit4:junit4]   2> 4710 T2477 oasu.CommitTracker.<init> Hard AutoCommit: disabled
[junit4:junit4]   2> 4710 T2477 oasu.CommitTracker.<init> Soft AutoCommit: disabled
[junit4:junit4]   2> 4711 T2477 oashc.SpellCheckComponent.inform Initializing spell checkers
[junit4:junit4]   2> 4728 T2477 oass.DirectSolrSpellChecker.init init: {name=direct,classname=DirectSolrSpellChecker,field=lowerfilt,minQueryLength=3}
[junit4:junit4]   2> 4787 T2512 oasc.SolrCore.registerSearcher [collection1] Registered new searcher Searcher@1eb126d3 main{StandardDirectoryReader(segments_1:1)}
[junit4:junit4]   2> 5180 T2498 oascc.ZkStateReader.updateClusterState Updating cloud state from ZooKeeper... 
[junit4:junit4]   2> 5195 T2497 oascc.ZkStateReader$2.process A cluster state change has occurred - updating...
[junit4:junit4]   2> 5195 T2511 oascc.ZkStateReader$2.process A cluster state change has occurred - updating...
[junit4:junit4]   2> 5292 T2477 oasc.CoreContainer.register registering core: collection1
[junit4:junit4]   2> 5292 T2477 oasc.ZkController.register Register shard - core:collection1 address:http://127.0.0.1:60289/solr shardId:shard1
[junit4:junit4]   2> 5293 T2477 oascc.SolrZkClient.makePath makePath: /collections/collection1/leader_elect/shard1/election
[junit4:junit4]   2> 5308 T2482 oazs.PrepRequestProcessor.pRequest Got user-level KeeperException when processing sessionid:0x139dc1a93a20003 type:delete cxid:0x42 zxid:0xfffffffffffffffe txntype:unknown reqpath:n/a Error Path:/solr/collections/collection1/leaders Error:KeeperErrorCode = NoNode for /solr/collections/collection1/leaders
[junit4:junit4]   2> 5308 T2477 oasc.ShardLeaderElectionContext.runLeaderProcess Running the leader process.
[junit4:junit4]   2> 5309 T2482 oazs.PrepRequestProcessor.pRequest Got user-level KeeperException when processing sessionid:0x139dc1a93a20003 type:create cxid:0x43 zxid:0xfffffffffffffffe txntype:unknown reqpath:n/a Error Path:/solr/overseer Error:KeeperErrorCode = NodeExists for /solr/overseer
[junit4:junit4]   2> 5319 T2477 oasc.ShardLeaderElectionContext.waitForReplicasToComeUp Enough replicas found to continue.
[junit4:junit4]   2> 5320 T2477 oasc.ShardLeaderElectionContext.runLeaderProcess I may be the new leader - try and sync
[junit4:junit4]   2> 5320 T2477 oasc.SyncStrategy.sync Sync replicas to http://127.0.0.1:60289/solr/collection1/
[junit4:junit4]   2> 5321 T2477 oasc.SyncStrategy.syncReplicas Sync Success - now sync replicas to me
[junit4:junit4]   2> 5321 T2477 oasc.SyncStrategy.syncToMe http://127.0.0.1:60289/solr/collection1/ has no replicas
[junit4:junit4]   2> 5322 T2477 oasc.ShardLeaderElectionContext.runLeaderProcess I am the new leader: http://127.0.0.1:60289/solr/collection1/
[junit4:junit4]   2> 5322 T2477 oascc.SolrZkClient.makePath makePath: /collections/collection1/leaders/shard1
[junit4:junit4]   2> 5335 T2482 oazs.PrepRequestProcessor.pRequest Got user-level KeeperException when processing sessionid:0x139dc1a93a20003 type:create cxid:0x4d zxid:0xfffffffffffffffe txntype:unknown reqpath:n/a Error Path:/solr/overseer Error:KeeperErrorCode = NodeExists for /solr/overseer
[junit4:junit4]   2> 5699 T2498 oascc.ZkStateReader.updateClusterState Updating cloud state from ZooKeeper... 
[junit4:junit4]   2> 5719 T2497 oascc.ZkStateReader$2.process A cluster state change has occurred - updating...
[junit4:junit4]   2> 5719 T2511 oascc.ZkStateReader$2.process A cluster state change has occurred - updating...
[junit4:junit4]   2> 5745 T2477 oasc.ZkController.register We are http://127.0.0.1:60289/solr/collection1/ and leader is http://127.0.0.1:60289/solr/collection1/
[junit4:junit4]   2> 5745 T2477 oasc.ZkController.register No LogReplay needed for core=collection1 baseURL=http://127.0.0.1:60289/solr
[junit4:junit4]   2> 5746 T2477 oasc.ZkController.checkRecovery I am the leader, no recovery necessary
[junit4:junit4]   2> 5748 T2477 oascc.ZkStateReader.updateClusterState Updating cloud state from ZooKeeper... 
[junit4:junit4]   2> 5748 T2477 oass.SolrDispatchFilter.init user.dir=/usr/home/hudson/hudson-slave/workspace/Lucene-Solr-Tests-4.x-java7/solr/build/solr-core/test/J1
[junit4:junit4]   2> 5749 T2477 oass.SolrDispatchFilter.init SolrDispatchFilter.init() done
[junit4:junit4]   2> 5749 T2477 oascsi.HttpClientUtil.createClient Creating new http client, config:maxConnections=128&maxConnectionsPerHost=32&followRedirects=false
[junit4:junit4]   2> 6223 T2498 oascc.ZkStateReader.updateClusterState Updating cloud state from ZooKeeper... 
[junit4:junit4]   2> 6245 T2511 oascc.ZkStateReader$2.process A cluster state change has occurred - updating...
[junit4:junit4]   2> 6245 T2497 oascc.ZkStateReader$2.process A cluster state change has occurred - updating...
[junit4:junit4]   2> 6284 T2477 oejs.Server.doStart jetty-8.1.2.v20120308
[junit4:junit4]   2> 6288 T2477 oejs.AbstractConnector.doStart Started SocketConnector@0.0.0.0:60367
[junit4:junit4]   2> 6288 T2477 oasc.SolrResourceLoader.locateSolrHome JNDI not configured for solr (NoInitialContextEx)
[junit4:junit4]   2> 6289 T2477 oasc.SolrResourceLoader.locateSolrHome using system property solr.solr.home: /usr/home/hudson/hudson-slave/workspace/Lucene-Solr-Tests-4.x-java7/solr/build/solr-core/test/J1/./solrtest-jetty2-1348017498654
[junit4:junit4]   2> 6289 T2477 oasc.SolrResourceLoader.<init> new SolrResourceLoader for deduced Solr Home: '/usr/home/hudson/hudson-slave/workspace/Lucene-Solr-Tests-4.x-java7/solr/build/solr-core/test/J1/./solrtest-jetty2-1348017498654/'
[junit4:junit4]   2> 6341 T2477 oass.SolrDispatchFilter.init SolrDispatchFilter.init()
[junit4:junit4]   2> 6342 T2477 oasc.SolrResourceLoader.locateSolrHome JNDI not configured for solr (NoInitialContextEx)
[junit4:junit4]   2> 6343 T2477 oasc.SolrResourceLoader.locateSolrHome using system property solr.solr.home: /usr/home/hudson/hudson-slave/workspace/Lucene-Solr-Tests-4.x-java7/solr/build/solr-core/test/J1/./solrtest-jetty2-1348017498654
[junit4:junit4]   2> 6343 T2477 oasc.CoreContainer$Initializer.initialize looking for solr.xml: /usr/home/hudson/hudson-slave/workspace/Lucene-Solr-Tests-4.x-java7/solr/build/solr-core/test/J1/./solrtest-jetty2-1348017498654/solr.xml
[junit4:junit4]   2> 6344 T2477 oasc.CoreContainer.<init> New CoreContainer 109450761
[junit4:junit4]   2> 6344 T2477 oasc.CoreContainer.load Loading CoreContainer using Solr Home: '/usr/home/hudson/hudson-slave/workspace/Lucene-Solr-Tests-4.x-java7/solr/build/solr-core/test/J1/./solrtest-jetty2-1348017498654/'
[junit4:junit4]   2> 6345 T2477 oasc.SolrResourceLoader.<init> new SolrResourceLoader for directory: '/usr/home/hudson/hudson-slave/workspace/Lucene-Solr-Tests-4.x-java7/solr/build/solr-core/test/J1/./solrtest-jetty2-1348017498654/'
[junit4:junit4]   2> 6384 T2477 oasc.CoreContainer.load Registering Log Listener
[junit4:junit4]   2> 6401 T2477 oasc.CoreContainer.initZooKeeper Zookeeper client=127.0.0.1:60263/solr
[junit4:junit4]   2> 6402 T2477 oaz.ZooKeeper.<init> Initiating client connection, connectString=127.0.0.1:60263/solr sessionTimeout=5000 watcher=org.apache.solr.common.cloud.ConnectionManager@2195b098
[junit4:junit4]   2> 6403 T2522 oaz.ClientCnxn$SendThread.startConnect Opening socket connection to server /127.0.0.1:60263
[junit4:junit4]   2> 6403 T2477 oascc.ConnectionManager.waitForConnected Waiting for client to connect to ZooKeeper
[junit4:junit4]   2> 6404 T2522 oaz.ClientCnxn$SendThread.primeConnection Socket connection established to localhost/127.0.0.1:60263, initiating session
[junit4:junit4]   2> 6405 T2479 oazs.NIOServerCnxn$Factory.run Accepted socket connection from /140.211.11.196:60375
[junit4:junit4]   2> 6405 T2479 oazs.NIOServerCnxn.readConnectRequest Client attempting to establish new session at /140.211.11.196:60375
[junit4:junit4]   2> 6411 T2481 oazs.NIOServerCnxn.finishSessionInit Established session 0x139dc1a93a20004 with negotiated timeout 5000 for client /140.211.11.196:60375
[junit4:junit4]   2> 6411 T2522 oaz.ClientCnxn$SendThread.readConnectResult Session establishment complete on server localhost/127.0.0.1:60263, sessionid = 0x139dc1a93a20004, negotiated timeout = 5000
[junit4:junit4]   2> 6411 T2523 oascc.ConnectionManager.process Watcher org.apache.solr.common.cloud.ConnectionManager@2195b098 name:ZooKeeperConnection Watcher:127.0.0.1:60263/solr got event WatchedEvent state:SyncConnected type:None path:null path:null type:None
[junit4:junit4]   2> 6411 T2477 oascc.ConnectionManager.waitForConnected Client is connected to ZooKeeper
[junit4:junit4]   2> 6412 T2482 oazs.PrepRequestProcessor.pRequest Got user-level KeeperException when processing sessionid:0x139dc1a93a20004 type:create cxid:0x1 zxid:0xfffffffffffffffe txntype:unknown reqpath:n/a Error Path:/solr/overseer Error:KeeperErrorCode = NodeExists for /solr/overseer
[junit4:junit4]   2> 6419 T2482 oazs.PrepRequestProcessor.pRequest Got user-level KeeperException when processing sessionid:0x139dc1a93a20004 type:create cxid:0x2 zxid:0xfffffffffffffffe txntype:unknown reqpath:n/a Error Path:/solr/overseer Error:KeeperErrorCode = NodeExists for /solr/overseer
[junit4:junit4]   2> 6420 T2477 oasc.ZkController.createEphemeralLiveNode Register node as live in ZooKeeper:/live_nodes/127.0.0.1:60367_solr
[junit4:junit4]   2> 6421 T2482 oazs.PrepRequestProcessor.pRequest Got user-level KeeperException when processing sessionid:0x139dc1a93a20004 type:delete cxid:0x4 zxid:0xfffffffffffffffe txntype:unknown reqpath:n/a Error Path:/solr/live_nodes/127.0.0.1:60367_solr Error:KeeperErrorCode = NoNode for /solr/live_nodes/127.0.0.1:60367_solr
[junit4:junit4]   2> 6430 T2477 oascc.SolrZkClient.makePath makePath: /live_nodes/127.0.0.1:60367_solr
[junit4:junit4]   2> 6433 T2497 oascc.ZkStateReader$3.process Updating live nodes
[junit4:junit4]   2> 6433 T2511 oascc.ZkStateReader$3.process Updating live nodes
[junit4:junit4]   2> 6434 T2477 oashc.HttpShardHandlerFactory.getParameter Setting socketTimeout to: 0
[junit4:junit4]   2> 6435 T2477 oashc.HttpShardHandlerFactory.getParameter Setting urlScheme to: http://
[junit4:junit4]   2> 6435 T2477 oashc.HttpShardHandlerFactory.getParameter Setting connTimeout to: 0
[junit4:junit4]   2> 6436 T2477 oashc.HttpShardHandlerFactory.getParameter Setting maxConnectionsPerHost to: 20
[junit4:junit4]   2> 6436 T2477 oashc.HttpShardHandlerFactory.getParameter Setting corePoolSize to: 0
[junit4:junit4]   2> 6437 T2477 oashc.HttpShardHandlerFactory.getParameter Setting maximumPoolSize to: 2147483647
[junit4:junit4]   2> 6437 T2477 oashc.HttpShardHandlerFactory.getParameter Setting maxThreadIdleTime to: 5
[junit4:junit4]   2> 6438 T2477 oashc.HttpShardHandlerFactory.getParameter Setting sizeOfQueue to: -1
[junit4:junit4]   2> 6438 T2477 oashc.HttpShardHandlerFactory.getParameter Setting fairnessPolicy to: false
[junit4:junit4]   2> 6439 T2477 oascsi.HttpClientUtil.createClient Creating new http client, config:maxConnectionsPerHost=20&maxConnections=10000&socketTimeout=0&connTimeout=0&retry=false
[junit4:junit4]   2> 6456 T2477 oascc.ZkStateReader.createClusterStateWatchersAndUpdate Updating cluster state from ZooKeeper... 
[junit4:junit4]   2> 6462 T2477 oasc.CoreContainer.create Creating SolrCore 'collection1' using instanceDir: /usr/home/hudson/hudson-slave/workspace/Lucene-Solr-Tests-4.x-java7/solr/build/solr-core/test/J1/./solrtest-jetty2-1348017498654/collection1
[junit4:junit4]   2> 6463 T2477 oasc.ZkController.createCollectionZkNode Check for collection zkNode:collection1
[junit4:junit4]   2> 6464 T2477 oasc.ZkController.createCollectionZkNode Collection zkNode exists
[junit4:junit4]   2> 6464 T2477 oasc.ZkController.readConfigName Load collection config from:/collections/collection1
[junit4:junit4]   2> 6465 T2477 oasc.SolrResourceLoader.<init> new SolrResourceLoader for directory: '/usr/home/hudson/hudson-slave/workspace/Lucene-Solr-Tests-4.x-java7/solr/build/solr-core/test/J1/./solrtest-jetty2-1348017498654/collection1/'
[junit4:junit4]   2> 6467 T2477 oasc.SolrResourceLoader.replaceClassLoader Adding 'file:/usr/home/hudson/hudson-slave/workspace/Lucene-Solr-Tests-4.x-java7/solr/build/solr-core/test/J1/solrtest-jetty2-1348017498654/collection1/lib/classes/' to classloader
[junit4:junit4]   2> 6468 T2477 oasc.SolrResourceLoader.replaceClassLoader Adding 'file:/usr/home/hudson/hudson-slave/workspace/Lucene-Solr-Tests-4.x-java7/solr/build/solr-core/test/J1/solrtest-jetty2-1348017498654/collection1/lib/README' to classloader
[junit4:junit4]   2> 6522 T2477 oasc.SolrConfig.<init> Using Lucene MatchVersion: LUCENE_40
[junit4:junit4]   2> 6598 T2477 oasc.SolrConfig.<init> Loaded SolrConfig: solrconfig.xml
[junit4:junit4]   2> 6699 T2477 oass.IndexSchema.readSchema Reading Solr Schema
[junit4:junit4]   2> 6707 T2477 oass.IndexSchema.readSchema Schema name=test
[junit4:junit4]   2> 7362 T2477 oass.OpenExchangeRatesOrgProvider.init Initialized with rates=open-exchange-rates.json, refreshInterval=1440.
[junit4:junit4]   2> 7375 T2477 oass.IndexSchema.readSchema default search field in schema is text
[junit4:junit4]   2> 7379 T2477 oass.IndexSchema.readSchema unique key field: id
[junit4:junit4]   2> 7391 T2477 oass.FileExchangeRateProvider.reload Reloading exchange rates from file currency.xml
[junit4:junit4]   2> 7396 T2477 oass.FileExchangeRateProvider.reload Reloading exchange rates from file currency.xml
[junit4:junit4]   2> 7401 T2477 oass.OpenExchangeRatesOrgProvider.reload Reloading exchange rates from open-exchange-rates.json
[junit4:junit4]   2> 7402 T2477 oass.OpenExchangeRatesOrgProvider.reload Reloading exchange rates from open-exchange-rates.json
[junit4:junit4]   2> 7403 T2477 oasc.SolrCore.<init> [collection1] Opening new SolrCore at /usr/home/hudson/hudson-slave/workspace/Lucene-Solr-Tests-4.x-java7/solr/build/solr-core/test/J1/./solrtest-jetty2-1348017498654/collection1/, dataDir=./org.apache.solr.cloud.SyncSliceTest-1348017492891/jetty2/
[junit4:junit4]   2> 7404 T2477 oasc.JmxMonitoredMap.<init> JMX monitoring is enabled. Adding Solr mbeans to JMX Server: com.sun.jmx.mbeanserver.JmxMBeanServer@7b9f4f58
[junit4:junit4]   2> 7405 T2477 oasc.SolrCore.getNewIndexDir WARNING New index directory detected: old=null new=./org.apache.solr.cloud.SyncSliceTest-1348017492891/jetty2/index/
[junit4:junit4]   2> 7406 T2477 oasc.SolrCore.initIndex WARNING [collection1] Solr index directory './org.apache.solr.cloud.SyncSliceTest-1348017492891/jetty2/index' doesn't exist. Creating new index...
[junit4:junit4]   2> 7408 T2477 oasc.CachingDirectoryFactory.get return new directory for /usr/home/hudson/hudson-slave/workspace/Lucene-Solr-Tests-4.x-java7/solr/build/solr-core/test/J1/./org.apache.solr.cloud.SyncSliceTest-1348017492891/jetty2/index forceNew:false
[junit4:junit4]   2> 7414 T2477 oasc.SolrDeletionPolicy.onCommit SolrDeletionPolicy.onCommit: commits:num=1
[junit4:junit4]   2> 		commit{dir=NRTCachingDirectory(org.apache.lucene.store.NIOFSDirectory@/usr/home/hudson/hudson-slave/workspace/Lucene-Solr-Tests-4.x-java7/solr/build/solr-core/test/J1/org.apache.solr.cloud.SyncSliceTest-1348017492891/jetty2/index lockFactory=org.apache.lucene.store.NativeFSLockFactory@3e0abb1f; maxCacheMB=48.0 maxMergeSizeMB=4.0),segFN=segments_1,generation=1,filenames=[segments_1]
[junit4:junit4]   2> 7415 T2477 oasc.SolrDeletionPolicy.updateCommits newest commit = 1
[junit4:junit4]   2> 7416 T2477 oasc.SolrCore.initWriters created xml: solr.XMLResponseWriter
[junit4:junit4]   2> 7419 T2477 oasup.UpdateRequestProcessorChain.init inserting DistributedUpdateProcessorFactory into updateRequestProcessorChain "dedupe"
[junit4:junit4]   2> 7420 T2477 oasup.UpdateRequestProcessorChain.init inserting DistributedUpdateProcessorFactory into updateRequestProcessorChain "dedupe-allfields"
[junit4:junit4]   2> 7420 T2477 oasup.UpdateRequestProcessorChain.init inserting DistributedUpdateProcessorFactory into updateRequestProcessorChain "stored_sig"
[junit4:junit4]   2> 7421 T2477 oasup.UpdateRequestProcessorChain.init inserting DistributedUpdateProcessorFactory into updateRequestProcessorChain "uniq-fields"
[junit4:junit4]   2> 7422 T2477 oasup.UpdateRequestProcessorChain.init inserting DistributedUpdateProcessorFactory into updateRequestProcessorChain "distrib-dup-test-chain-implicit"
[junit4:junit4]   2> 7422 T2477 oasc.RequestHandlers.initHandlersFromConfig adding lazy requestHandler: solr.ReplicationHandler
[junit4:junit4]   2> 7423 T2477 oasc.RequestHandlers.initHandlersFromConfig created /replication: solr.ReplicationHandler
[junit4:junit4]   2> 7424 T2477 oasc.RequestHandlers.initHandlersFromConfig created standard: solr.StandardRequestHandler
[junit4:junit4]   2> 7425 T2477 oasc.RequestHandlers.initHandlersFromConfig created /get: solr.RealTimeGetHandler
[junit4:junit4]   2> 7426 T2477 oasc.RequestHandlers.initHandlersFromConfig created dismax: solr.SearchHandler
[junit4:junit4]   2> 7427 T2477 oasc.RequestHandlers.initHandlersFromConfig created mock: org.apache.solr.core.MockQuerySenderListenerReqHandler
[junit4:junit4]   2> 7427 T2477 oasc.RequestHandlers.initHandlersFromConfig created /admin/: org.apache.solr.handler.admin.AdminHandlers
[junit4:junit4]   2> 7428 T2477 oasc.RequestHandlers.initHandlersFromConfig created defaults: solr.StandardRequestHandler
[junit4:junit4]   2> 7429 T2477 oasc.RequestHandlers.initHandlersFromConfig adding lazy requestHandler: solr.StandardRequestHandler
[junit4:junit4]   2> 7429 T2477 oasc.RequestHandlers.initHandlersFromConfig created lazy: solr.StandardRequestHandler
[junit4:junit4]   2> 7430 T2477 oasc.RequestHandlers.initHandlersFromConfig created /update: solr.UpdateRequestHandler
[junit4:junit4]   2> 7431 T2477 oasc.RequestHandlers.initHandlersFromConfig created /terms: org.apache.solr.handler.component.SearchHandler
[junit4:junit4]   2> 7432 T2477 oasc.RequestHandlers.initHandlersFromConfig created spellCheckCompRH: org.apache.solr.handler.component.SearchHandler
[junit4:junit4]   2> 7433 T2477 oasc.RequestHandlers.initHandlersFromConfig created spellCheckCompRH_Direct: org.apache.solr.handler.component.SearchHandler
[junit4:junit4]   2> 7433 T2477 oasc.RequestHandlers.initHandlersFromConfig created spellCheckWithWordbreak: org.apache.solr.handler.component.SearchHandler
[junit4:junit4]   2> 7434 T2477 oasc.RequestHandlers.initHandlersFromConfig created spellCheckWithWordbreak_Direct: org.apache.solr.handler.component.SearchHandler
[junit4:junit4]   2> 7435 T2477 oasc.RequestHandlers.initHandlersFromConfig created spellCheckCompRH1: org.apache.solr.handler.component.SearchHandler
[junit4:junit4]   2> 7436 T2477 oasc.RequestHandlers.initHandlersFromConfig created tvrh: org.apache.solr.handler.component.SearchHandler
[junit4:junit4]   2> 7436 T2477 oasc.RequestHandlers.initHandlersFromConfig created /mlt: solr.MoreLikeThisHandler
[junit4:junit4]   2> 7437 T2477 oasc.RequestHandlers.initHandlersFromConfig created /debug/dump: solr.DumpRequestHandler
[junit4:junit4]   2> 7441 T2477 oashl.XMLLoader.init xsltCacheLifetimeSeconds=60
[junit4:junit4]   2> 7446 T2477 oasc.SolrCore.initDeprecatedSupport WARNING solrconfig.xml uses deprecated <admin/gettableFiles>, Please update your config to use the ShowFileRequestHandler.
[junit4:junit4]   2> 7447 T2477 oasc.SolrCore.initDeprecatedSupport WARNING adding ShowFileRequestHandler with hidden files: [SCHEMA.XML, OLD_SYNONYMS.TXT, STOPWORDS.TXT, PROTWORDS.TXT, OPEN-EXCHANGE-RATES.JSON, SYNONYMS.TXT, CURRENCY.XML, MAPPING-ISOLATIN1ACCENT.TXT]
[junit4:junit4]   2> 7452 T2477 oass.SolrIndexSearcher.<init> Opening Searcher@38528013 main
[junit4:junit4]   2> 7453 T2477 oasu.CommitTracker.<init> Hard AutoCommit: disabled
[junit4:junit4]   2> 7454 T2477 oasu.CommitTracker.<init> Soft AutoCommit: disabled
[junit4:junit4]   2> 7454 T2477 oashc.SpellCheckComponent.inform Initializing spell checkers
[junit4:junit4]   2> 7462 T2477 oass.DirectSolrSpellChecker.init init: {name=direct,classname=DirectSolrSpellChecker,field=lowerfilt,minQueryLength=3}
[junit4:junit4]   2> 7521 T2524 oasc.SolrCore.registerSearcher [collection1] Registered new searcher Searcher@38528013 main{StandardDirectoryReader(segments_1:1)}
[junit4:junit4]   2> 7759 T2498 oascc.ZkStateReader.updateClusterState Updating cloud state from ZooKeeper... 
[junit4:junit4]   2> 7762 T2497 oascc.ZkStateReader$2.process A cluster state change has occurred - updating...
[junit4:junit4]   2> 7762 T2511 oascc.ZkStateReader$2.process A cluster state change has occurred - updating...
[junit4:junit4]   2> 7763 T2523 oascc.ZkStateReader$2.process A cluster state change has occurred - updating...
[junit4:junit4]   2> 8029 T2477 oasc.CoreContainer.register registering core: collection1
[junit4:junit4]   2> 8029 T2477 oasc.ZkController.register Register shard - core:collection1 address:http://127.0.0.1:60367/solr shardId:shard1
[junit4:junit4]   2> 8032 T2477 oasc.ZkController.register We are http://127.0.0.1:60367/solr/collection1/ and leader is http://127.0.0.1:60289/solr/collection1/
[junit4:junit4]   2> 8033 T2477 oasc.ZkController.register No LogReplay needed for core=collection1 baseURL=http://127.0.0.1:60367/solr
[junit4:junit4]   2> 8033 T2477 oasc.ZkController.checkRecovery Core needs to recover:collection1
[junit4:junit4]   2> 8033 T2477 oasu.DefaultSolrCoreState.doRecovery Running recovery - first canceling any ongoing recovery
[junit4:junit4]   2> ASYNC  NEW_CORE C129 name=collection1 org.apache.solr.core.SolrCore@38ad0851 url=http://127.0.0.1:60367/solr/collection1 node=127.0.0.1:60367_solr
[junit4:junit4]   2> 8035 T2525 C129 P60367 oasc.RecoveryStrategy.run Starting recovery process.  core=collection1 recoveringAfterStartup=true
[junit4:junit4]   2> 8036 T2525 C129 P60367 oasc.RecoveryStrategy.doRecovery ###### startupVersions=[]
[junit4:junit4]   2> 8035 T2477 oascc.ZkStateReader.updateClusterState Updating cloud state from ZooKeeper... 
[junit4:junit4]   2> 8037 T2525 C129 P60367 oasc.RecoveryStrategy.doRecovery Attempting to PeerSync from http://127.0.0.1:60289/solr/collection1/ core=collection1 - recoveringAfterStartup=true
[junit4:junit4]   2> 8037 T2525 C129 P60367 oasu.PeerSync.sync PeerSync: core=collection1 url=http://127.0.0.1:60367/solr START replicas=[http://127.0.0.1:60289/solr/collection1/] nUpdates=100
[junit4:junit4]   2> 8037 T2477 oass.SolrDispatchFilter.init user.dir=/usr/home/hudson/hudson-slave/workspace/Lucene-Solr-Tests-4.x-java7/solr/build/solr-core/test/J1
[junit4:junit4]   2> 8037 T2525 C129 P60367 oasu.PeerSync.sync WARNING no frame of reference to tell of we've missed updates
[junit4:junit4]   2> 8038 T2525 C129 P60367 oasc.RecoveryStrategy.doRecovery PeerSync Recovery was not successful - trying replication. core=collection1
[junit4:junit4]   2> 8037 T2477 oass.SolrDispatchFilter.init SolrDispatchFilter.init() done
[junit4:junit4]   2> 8038 T2525 C129 P60367 oasc.RecoveryStrategy.doRecovery Starting Replication Recovery. core=collection1
[junit4:junit4]   2> 8039 T2525 C129 P60367 oascsi.HttpClientUtil.createClient Creating new http client, config:maxConnections=128&maxConnectionsPerHost=32&followRedirects=false
[junit4:junit4]   2> 8038 T2477 oascsi.HttpClientUtil.createClient Creating new http client, config:maxConnections=128&maxConnectionsPerHost=32&followRedirects=false
[junit4:junit4]   2> ASYNC  NEW_CORE C130 name=collection1 org.apache.solr.core.SolrCore@64eb4208 url=http://127.0.0.1:60289/solr/collection1 node=127.0.0.1:60289_solr
[junit4:junit4]   2> 8047 T2503 C130 P60289 REQ /get {distrib=false&qt=/get&wt=javabin&version=2&getVersions=100} status=0 QTime=1 
[junit4:junit4]   2> 8275 T2498 oascc.ZkStateReader.updateClusterState Updating cloud state from ZooKeeper... 
[junit4:junit4]   2> 8363 T2497 oascc.ZkStateReader$2.process A cluster state change has occurred - updating...
[junit4:junit4]   2> 8363 T2511 oascc.ZkStateReader$2.process A cluster state change has occurred - updating...
[junit4:junit4]   2> 8363 T2523 oascc.ZkStateReader$2.process A cluster state change has occurred - updating...
[junit4:junit4]   2> 8514 T2477 oejs.Server.doStart jetty-8.1.2.v20120308
[junit4:junit4]   2> 8517 T2477 oejs.AbstractConnector.doStart Started SocketConnector@0.0.0.0:60388
[junit4:junit4]   2> 8518 T2477 oasc.SolrResourceLoader.locateSolrHome JNDI not configured for solr (NoInitialContextEx)
[junit4:junit4]   2> 8518 T2477 oasc.SolrResourceLoader.locateSolrHome using system property solr.solr.home: /usr/home/hudson/hudson-slave/workspace/Lucene-Solr-Tests-4.x-java7/solr/build/solr-core/test/J1/./solrtest-jetty3-1348017500957
[junit4:junit4]   2> 8519 T2477 oasc.SolrResourceLoader.<init> new SolrResourceLoader for deduced Solr Home: '/usr/home/hudson/hudson-slave/workspace/Lucene-Solr-Tests-4.x-java7/solr/build/solr-core/test/J1/./solrtest-jetty3-1348017500957/'
[junit4:junit4]   2> 8572 T2477 oass.SolrDispatchFilter.init SolrDispatchFilter.init()
[junit4:junit4]   2> 8572 T2477 oasc.SolrResourceLoader.locateSolrHome JNDI not configured for solr (NoInitialContextEx)
[junit4:junit4]   2> 8573 T2477 oasc.SolrResourceLoader.locateSolrHome using system property solr.solr.home: /usr/home/hudson/hudson-slave/workspace/Lucene-Solr-Tests-4.x-java7/solr/build/solr-core/test/J1/./solrtest-jetty3-1348017500957
[junit4:junit4]   2> 8573 T2477 oasc.CoreContainer$Initializer.initialize looking for solr.xml: /usr/home/hudson/hudson-slave/workspace/Lucene-Solr-Tests-4.x-java7/solr/build/solr-core/test/J1/./solrtest-jetty3-1348017500957/solr.xml
[junit4:junit4]   2> 8574 T2477 oasc.CoreContainer.<init> New CoreContainer 420582923
[junit4:junit4]   2> 8575 T2477 oasc.CoreContainer.load Loading CoreContainer using Solr Home: '/usr/home/hudson/hudson-slave/workspace/Lucene-Solr-Tests-4.x-java7/solr/build/solr-core/test/J1/./solrtest-jetty3-1348017500957/'
[junit4:junit4]   2> 8575 T2477 oasc.SolrResourceLoader.<init> new SolrResourceLoader for directory: '/usr/home/hudson/hudson-slave/workspace/Lucene-Solr-Tests-4.x-java7/solr/build/solr-core/test/J1/./solrtest-jetty3-1348017500957/'
[junit4:junit4]   2> 8614 T2477 oasc.CoreContainer.load Registering Log Listener
[junit4:junit4]   2> 8632 T2477 oasc.CoreContainer.initZooKeeper Zookeeper client=127.0.0.1:60263/solr
[junit4:junit4]   2> 8633 T2477 oaz.ZooKeeper.<init> Initiating client connection, connectString=127.0.0.1:60263/solr sessionTimeout=5000 watcher=org.apache.solr.common.cloud.ConnectionManager@50335f94
[junit4:junit4]   2> 8634 T2536 oaz.ClientCnxn$SendThread.startConnect Opening socket connection to server /127.0.0.1:60263
[junit4:junit4]   2> 8634 T2477 oascc.ConnectionManager.waitForConnected Waiting for client to connect to ZooKeeper
[junit4:junit4]   2> 8635 T2536 oaz.ClientCnxn$SendThread.primeConnection Socket connection established to localhost/127.0.0.1:60263, initiating session
[junit4:junit4]   2> 8635 T2479 oazs.NIOServerCnxn$Factory.run Accepted socket connection from /140.211.11.196:60390
[junit4:junit4]   2> 8635 T2479 oazs.NIOServerCnxn.readConnectRequest Client attempting to establish new session at /140.211.11.196:60390
[junit4:junit4]   2> 8642 T2481 oazs.NIOServerCnxn.finishSessionInit Established session 0x139dc1a93a20005 with negotiated timeout 5000 for client /140.211.11.196:60390
[junit4:junit4]   2> 8642 T2536 oaz.ClientCnxn$SendThread.readConnectResult Session establishment complete on server localhost/127.0.0.1:60263, sessionid = 0x139dc1a93a20005, negotiated timeout = 5000
[junit4:junit4]   2> 8643 T2537 oascc.ConnectionManager.process Watcher org.apache.solr.common.cloud.ConnectionManager@50335f94 name:ZooKeeperConnection Watcher:127.0.0.1:60263/solr got event WatchedEvent state:SyncConnected type:None path:null path:null type:None
[junit4:junit4]   2> 8643 T2477 oascc.ConnectionManager.waitForConnected Client is connected to ZooKeeper
[junit4:junit4]   2> 8644 T2482 oazs.PrepRequestProcessor.pRequest Got user-level KeeperException when processing sessionid:0x139dc1a93a20005 type:create cxid:0x1 zxid:0xfffffffffffffffe txntype:unknown reqpath:n/a Error Path:/solr/overseer Error:KeeperErrorCode = NodeExists for /solr/overseer
[junit4:junit4]   2> 8645 T2482 oazs.PrepRequestProcessor.pRequest Got user-level KeeperException when processing sessionid:0x139dc1a93a20005 type:create cxid:0x2 zxid:0xfffffffffffffffe txntype:unknown reqpath:n/a Error Path:/solr/overseer Error:KeeperErrorCode = NodeExists for /solr/overseer
[junit4:junit4]   2> 8663 T2477 oasc.ZkController.createEphemeralLiveNode Register node as live in ZooKeeper:/live_nodes/127.0.0.1:60388_solr
[junit4:junit4]   2> 8664 T2482 oazs.PrepRequestProcessor.pRequest Got user-level KeeperException when processing sessionid:0x139dc1a93a20005 type:delete cxid:0x4 zxid:0xfffffffffffffffe txntype:unknown reqpath:n/a Error Path:/solr/live_nodes/127.0.0.1:60388_solr Error:KeeperErrorCode = NoNode for /solr/live_nodes/127.0.0.1:60388_solr
[junit4:junit4]   2> 8665 T2477 oascc.SolrZkClient.makePath makePath: /live_nodes/127.0.0.1:60388_solr
[junit4:junit4]   2> 8667 T2497 oascc.ZkStateReader$3.process Updating live nodes
[junit4:junit4]   2> 8667 T2523 oascc.ZkStateReader$3.process Updating live nodes
[junit4:junit4]   2> 8667 T2511 oascc.ZkStateReader$3.process Updating live nodes
[junit4:junit4]   2> 8668 T2477 oashc.HttpShardHandlerFactory.getParameter Setting socketTimeout to: 0
[junit4:junit4]   2> 8669 T2477 oashc.HttpShardHandlerFactory.getParameter Setting urlScheme to: http://
[junit4:junit4]   2> 8669 T2477 oashc.HttpShardHandlerFactory.getParameter Setting connTimeout to: 0
[junit4:junit4]   2> 8670 T2477 oashc.HttpShardHandlerFactory.getParameter Setting maxConnectionsPerHost to: 20
[junit4:junit4]   2> 8670 T2477 oashc.HttpShardHandlerFactory.getParameter Setting corePoolSize to: 0
[junit4:junit4]   2> 8671 T2477 oashc.HttpShardHandlerFactory.getParameter Setting maximumPoolSize to: 2147483647
[junit4:junit4]   2> 8671 T2477 oashc.HttpShardHandlerFactory.getParameter Setting maxThreadIdleTime to: 5
[junit4:junit4]   2> 8672 T2477 oashc.HttpShardHandlerFactory.getParameter Setting sizeOfQueue to: -1
[junit4:junit4]   2> 8672 T2477 oashc.HttpShardHandlerFactory.getParameter Setting fairnessPolicy to: false
[junit4:junit4]   2> 8673 T2477 oascsi.HttpClientUtil.createClient Creating new http client, config:maxConnectionsPerHost=20&maxConnections=10000&socketTimeout=0&connTimeout=0&retry=false
[junit4:junit4]   2> 8690 T2477 oascc.ZkStateReader.createClusterStateWatchersAndUpdate Updating cluster state from ZooKeeper... 
[junit4:junit4]   2> 8698 T2477 oasc.CoreContainer.create Creating SolrCore 'collection1' using instanceDir: /usr/home/hudson/hudson-slave/workspace/Lucene-Solr-Tests-4.x-java7/solr/build/solr-core/test/J1/./solrtest-jetty3-1348017500957/collection1
[junit4:junit4]   2> 8698 T2477 oasc.ZkController.createCollectionZkNode Check for collection zkNode:collection1
[junit4:junit4]   2> 8699 T2477 oasc.ZkController.createCollectionZkNode Collection zkNode exists
[junit4:junit4]   2> 8699 T2477 oasc.ZkController.readConfigName Load collection config from:/collections/collection1
[junit4:junit4]   2> 8701 T2477 oasc.SolrResourceLoader.<init> new SolrResourceLoader for directory: '/usr/home/hudson/hudson-slave/workspace/Lucene-Solr-Tests-4.x-java7/solr/build/solr-core/test/J1/./solrtest-jetty3-1348017500957/collection1/'
[junit4:junit4]   2> 8702 T2477 oasc.SolrResourceLoader.replaceClassLoader Adding 'file:/usr/home/hudson/hudson-slave/workspace/Lucene-Solr-Tests-4.x-java7/solr/build/solr-core/test/J1/solrtest-jetty3-1348017500957/collection1/lib/classes/' to classloader
[junit4:junit4]   2> 8703 T2477 oasc.SolrResourceLoader.replaceClassLoader Adding 'file:/usr/home/hudson/hudson-slave/workspace/Lucene-Solr-Tests-4.x-java7/solr/build/solr-core/test/J1/solrtest-jetty3-1348017500957/collection1/lib/README' to classloader
[junit4:junit4]   2> 8761 T2477 oasc.SolrConfig.<init> Using Lucene MatchVersion: LUCENE_40
[junit4:junit4]   2> 8842 T2477 oasc.SolrConfig.<init> Loaded SolrConfig: solrconfig.xml
[junit4:junit4]   2> 8943 T2477 oass.IndexSchema.readSchema Reading Solr Schema
[junit4:junit4]   2> 9041 T2477 oass.IndexSchema.readSchema Schema name=test
[junit4:junit4]   2> 9730 T2477 oass.OpenExchangeRatesOrgProvider.init Initialized with rates=open-exchange-rates.json, refreshInterval=1440.
[junit4:junit4]   2> 9743 T2477 oass.IndexSchema.readSchema default search field in schema is text
[junit4:junit4]   2> 9748 T2477 oass.IndexSchema.readSchema unique key field: id
[junit4:junit4]   2> 9758 T2477 oass.FileExchangeRateProvider.reload Reloading exchange rates from file currency.xml
[junit4:junit4]   2> 9764 T2477 oass.FileExchangeRateProvider.reload Reloading exchange rates from file currency.xml
[junit4:junit4]   2> 9769 T2477 oass.OpenExchangeRatesOrgProvider.reload Reloading exchange rates from open-exchange-rates.json
[junit4:junit4]   2> 9770 T2477 oass.OpenExchangeRatesOrgProvider.reload Reloading exchange rates from open-exchange-rates.json
[junit4:junit4]   2> 9771 T2477 oasc.SolrCore.<init> [collection1] Opening new SolrCore at /usr/home/hudson/hudson-slave/workspace/Lucene-Solr-Tests-4.x-java7/solr/build/solr-core/test/J1/./solrtest-jetty3-1348017500957/collection1/, dataDir=./org.apache.solr.cloud.SyncSliceTest-1348017492891/jetty3/
[junit4:junit4]   2> 9772 T2477 oasc.JmxMonitoredMap.<init> JMX monitoring is enabled. Adding Solr mbeans to JMX Server: com.sun.jmx.mbeanserver.JmxMBeanServer@7b9f4f58
[junit4:junit4]   2> 9773 T2477 oasc.SolrCore.getNewIndexDir WARNING New index directory detected: old=null new=./org.apache.solr.cloud.SyncSliceTest-1348017492891/jetty3/index/
[junit4:junit4]   2> 9774 T2477 oasc.SolrCore.initIndex WARNING [collection1] Solr index directory './org.apache.solr.cloud.SyncSliceTest-1348017492891/jetty3/index' doesn't exist. Creating new index...
[junit4:junit4]   2> 9775 T2477 oasc.CachingDirectoryFactory.get return new directory for /usr/home/hudson/hudson-slave/workspace/Lucene-Solr-Tests-4.x-java7/solr/build/solr-core/test/J1/./org.apache.solr.cloud.SyncSliceTest-1348017492891/jetty3/index forceNew:false
[junit4:junit4]   2> 9811 T2477 oasc.SolrDeletionPolicy.onCommit SolrDeletionPolicy.onCommit: commits:num=1
[junit4:junit4]   2> 		commit{dir=NRTCachingDirectory(org.apache.lucene.store.NIOFSDirectory@/usr/home/hudson/hudson-slave/workspace/Lucene-Solr-Tests-4.x-java7/solr/build/solr-core/test/J1/org.apache.solr.cloud.SyncSliceTest-1348017492891/jetty3/index lockFactory=org.apache.lucene.store.NativeFSLockFactory@6b2a49d9; maxCacheMB=48.0 maxMergeSizeMB=4.0),segFN=segments_1,generation=1,filenames=[segments_1]
[junit4:junit4]   2> 9812 T2477 oasc.SolrDeletionPolicy.updateCommits newest commit = 1
[junit4:junit4]   2> 9813 T2477 oasc.SolrCore.initWriters created xml: solr.XMLResponseWriter
[junit4:junit4]   2> 9816 T2477 oasup.UpdateRequestProcessorChain.init inserting DistributedUpdateProcessorFactory into updateRequestProcessorChain "dedupe"
[junit4:junit4]   2> 9817 T2477 oasup.UpdateRequestProcessorChain.init inserting DistributedUpdateProcessorFactory into updateRequestProcessorChain "dedupe-allfields"
[junit4:junit4]   2> 9817 T2477 oasup.UpdateRequestProcessorChain.init inserting DistributedUpdateProcessorFactory into updateRequestProcessorChain "stored_sig"
[junit4:junit4]   2> 9818 T2477 oasup.UpdateRequestProcessorChain.init inserting DistributedUpdateProcessorFactory into updateRequestProcessorChain "uniq-fields"
[junit4:junit4]   2> 9819 T2477 oasup.UpdateRequestProcessorChain.init inserting DistributedUpdateProcessorFactory into updateRequestProcessorChain "distrib-dup-test-chain-implicit"
[junit4:junit4]   2> 9819 T2477 oasc.RequestHandlers.initHandlersFromConfig adding lazy requestHandler: solr.ReplicationHandler
[junit4:junit4]   2> 9820 T2477 oasc.RequestHandlers.initHandlersFromConfig created /replication: solr.ReplicationHandler
[junit4:junit4]   2> 9821 T2477 oasc.RequestHandlers.initHandlersFromConfig created standard: solr.StandardRequestHandler
[junit4:junit4]   2> 9822 T2477 oasc.RequestHandlers.initHandlersFromConfig created /get: solr.RealTimeGetHandler
[junit4:junit4]   2> 9822 T2477 oasc.RequestHandlers.initHandlersFromConfig created dismax: solr.SearchHandler
[junit4:junit4]   2> 9823 T2477 oasc.RequestHandlers.initHandlersFromConfig created mock: org.apache.solr.core.MockQuerySenderListenerReqHandler
[junit4:junit4]   2> 9824 T2477 oasc.RequestHandlers.initHandlersFromConfig created /admin/: org.apache.solr.handler.admin.AdminHandlers
[junit4:junit4]   2> 9825 T2477 oasc.RequestHandlers.initHandlersFromConfig created defaults: solr.StandardRequestHandler
[junit4:junit4]   2> 9825 T2477 oasc.RequestHandlers.initHandlersFromConfig adding lazy requestHandler: solr.StandardRequestHandler
[junit4:junit4]   2> 9826 T2477 oasc.RequestHandlers.initHandlersFromConfig created lazy: solr.StandardRequestHandler
[junit4:junit4]   2> 9827 T2477 oasc.RequestHandlers.initHandlersFromConfig created /update: solr.UpdateRequestHandler
[junit4:junit4]   2> 9828 T2477 oasc.RequestHandlers.initHandlersFromConfig created /terms: org.apache.solr.handler.component.SearchHandler
[junit4:junit4]   2> 9828 T2477 oasc.RequestHandlers.initHandlersFromConfig created spellCheckCompRH: org.apache.solr.handler.component.SearchHandler
[junit4:junit4]   2> 9829 T2477 oasc.RequestHandlers.initHandlersFromConfig created spellCheckCompRH_Direct: org.apache.solr.handler.component.SearchHandler
[junit4:junit4]   2> 9830 T2477 oasc.RequestHandlers.initHandlersFromConfig created spellCheckWithWordbreak: org.apache.solr.handler.component.SearchHandler
[junit4:junit4]   2> 9831 T2477 oasc.RequestHandlers.initHandlersFromConfig created spellCheckWithWordbreak_Direct: org.apache.solr.handler.component.SearchHandler
[junit4:junit4]   2> 9832 T2477 oasc.RequestHandlers.initHandlersFromConfig created spellCheckCompRH1: org.apache.solr.handler.component.SearchHandler
[junit4:junit4]   2> 9832 T2477 oasc.RequestHandlers.initHandlersFromConfig created tvrh: org.apache.solr.handler.component.SearchHandler
[junit4:junit4]   2> 9833 T2477 oasc.RequestHandlers.initHandlersFromConfig created /mlt: solr.MoreLikeThisHandler
[junit4:junit4]   2> 9834 T2477 oasc.RequestHandlers.initHandlersFromConfig created /debug/dump: solr.DumpRequestHandler
[junit4:junit4]   2> 9838 T2477 oashl.XMLLoader.init xsltCacheLifetimeSeconds=60
[junit4:junit4]   2> 9843 T2477 oasc.SolrCore.initDeprecatedSupport WARNING solrconfig.xml uses deprecated <admin/gettableFiles>, Please update your config to use the ShowFileRequestHandler.
[junit4:junit4]   2> 9844 T2477 oasc.SolrCore.initDeprecatedSupport WARNING adding ShowFileRequestHandler with hidden files: [SCHEMA.XML, OLD_SYNONYMS.TXT, STOPWORDS.TXT, PROTWORDS.TXT, OPEN-EXCHANGE-RATES.JSON, SYNONYMS.TXT, CURRENCY.XML, MAPPING-ISOLATIN1ACCENT.TXT]
[junit4:junit4]   2> 9849 T2477 oass.SolrIndexSearcher.<init> Opening Searcher@4eff0d31 main
[junit4:junit4]   2> 9850 T2477 oasu.CommitTracker.<init> Hard AutoCommit: disabled
[junit4:junit4]   2> 9851 T2477 oasu.CommitTracker.<init> Soft AutoCommit: disabled
[junit4:junit4]   2> 9852 T2477 oashc.SpellCheckComponent.inform Initializing spell checkers
[junit4:junit4]   2> 9860 T2477 oass.DirectSolrSpellChecker.init init: {name=direct,classname=DirectSolrSpellChecker,field=lowerfilt,minQueryLength=3}
[junit4:junit4]   2> 9909 T2538 oasc.SolrCore.registerSearcher [collection1] Registered new searcher Searcher@4eff0d31 main{StandardDirectoryReader(segments_1:1)}
[junit4:junit4]   2> 10371 T2498 oascc.ZkStateReader.updateClusterState Updating cloud state from ZooKeeper... 
[junit4:junit4]   2> 10384 T2523 oascc.ZkStateReader$2.process A cluster state change has occurred - updating...
[junit4:junit4]   2> 10384 T2497 oascc.ZkStateReader$2.process A cluster state change has occurred - updating...
[junit4:junit4]   2> 10384 T2511 oascc.ZkStateReader$2.process A cluster state change has occurred - updating...
[junit4:junit4]   2> 10384 T2537 oascc.ZkStateReader$2.process A cluster state change has occurred - updating...
[junit4:junit4]   2> 10417 T2477 oasc.CoreContainer.register registering core: collection1
[junit4:junit4]   2> 10417 T2477 oasc.ZkController.register Register shard - core:collection1 address:http://127.0.0.1:60388/solr shardId:shard1
[junit4:junit4]   2> 10420 T2477 oasc.ZkController.register We are http://127.0.0.1:60388/solr/collection1/ and leader is http://127.0.0.1:60289/solr/collection1/
[junit4:junit4]   2> 10420 T2477 oasc.ZkController.register No LogReplay needed for core=collection1 baseURL=http://127.0.0.1:60388/solr
[junit4:junit4]   2> 10420 T2477 oasc.ZkController.checkRecovery Core needs to recover:collection1
[junit4:junit4]   2> 10421 T2477 oasu.DefaultSolrCoreState.doRecovery Running recovery - first canceling any ongoing recovery
[junit4:junit4]   2> ASYNC  NEW_CORE C131 name=collection1 org.apache.solr.core.SolrCore@4f894d68 url=http://127.0.0.1:60388/solr/collection1 node=127.0.0.1:60388_solr
[junit4:junit4]   2> 10422 T2539 C131 P60388 oasc.RecoveryStrategy.run Starting recovery process.  core=collection1 recoveringAfterStartup=true
[junit4:junit4]   2> 10422 T2477 oascc.ZkStateReader.updateClusterState Updating cloud state from ZooKeeper... 
[junit4:junit4]   2> 10423 T2539 C131 P60388 oasc.RecoveryStrategy.doRecovery ###### startupVersions=[]
[junit4:junit4]   2> 10423 T2477 oass.SolrDispatchFilter.init user.dir=/usr/home/hudson/hudson-slave/workspace/Lucene-Solr-Tests-4.x-java7/solr/build/solr-core/test/J1
[junit4:junit4]   2> 10423 T2477 oass.SolrDispatchFilter.init SolrDispatchFilter.init() done
[junit4:junit4]   2> 10424 T2539 C131 P60388 oasc.RecoveryStrategy.doRecovery Attempting to PeerSync from http://127.0.0.1:60289/solr/collection1/ core=collection1 - recoveringAfterStartup=true
[junit4:junit4]   2> 10424 T2539 C131 P60388 oasu.PeerSync.sync PeerSync: core=collection1 url=http://127.0.0.1:60388/solr START replicas=[http://127.0.0.1:60289/solr/collection1/] nUpdates=100
[junit4:junit4]   2> 10424 T2477 oascsi.HttpClientUtil.createClient Creating new http client, config:maxConnections=128&maxConnectionsPerHost=32&followRedirects=false
[junit4:junit4]   2> 10424 T2539 C131 P60388 oasu.PeerSync.sync WARNING no frame of reference to tell of we've missed updates
[junit4:junit4]   2> 10425 T2539 C131 P60388 oasc.RecoveryStrategy.doRecovery PeerSync Recovery was not successful - trying replication. core=collection1
[junit4:junit4]   2> 10425 T2539 C131 P60388 oasc.RecoveryStrategy.doRecovery Starting Replication Recovery. core=collection1
[junit4:junit4]   2> 10425 T2539 C131 P60388 oascsi.HttpClientUtil.createClient Creating new http client, config:maxConnections=128&maxConnectionsPerHost=32&followRedirects=false
[junit4:junit4]   2> 10427 T2503 C130 P60289 REQ /get {distrib=false&qt=/get&wt=javabin&version=2&getVersions=100} status=0 QTime=0 
[junit4:junit4]   2> 10752 T2477 oejs.Server.doStart jetty-8.1.2.v20120308
[junit4:junit4]   2> 10755 T2477 oejs.AbstractConnector.doStart Started SocketConnector@0.0.0.0:60403
[junit4:junit4]   2> 10755 T2477 oasc.SolrResourceLoader.locateSolrHome JNDI not configured for solr (NoInitialContextEx)
[junit4:junit4]   2> 10756 T2477 oasc.SolrResourceLoader.locateSolrHome using system property solr.solr.home: /usr/home/hudson/hudson-slave/workspace/Lucene-Solr-Tests-4.x-java7/solr/build/solr-core/test/J1/./solrtest-jetty4-1348017503324
[junit4:junit4]   2> 10756 T2477 oasc.SolrResourceLoader.<init> new SolrResourceLoader for deduced Solr Home: '/usr/home/hudson/hudson-slave/workspace/Lucene-Solr-Tests-4.x-java7/solr/build/solr-core/test/J1/./solrtest-jetty4-1348017503324/'
[junit4:junit4]   2> 10794 T2477 oass.SolrDispatchFilter.init SolrDispatchFilter.init()
[junit4:junit4]   2> 10795 T2477 oasc.SolrResourceLoader.locateSolrHome JNDI not configured for solr (NoInitialContextEx)
[junit4:junit4]   2> 10795 T2477 oasc.SolrResourceLoader.locateSolrHome using system property solr.solr.home: /usr/home/hudson/hudson-slave/workspace/Lucene-Solr-Tests-4.x-java7/solr/build/solr-core/test/J1/./solrtest-jetty4-1348017503324
[junit4:junit4]   2> 10796 T2477 oasc.CoreContainer$Initializer.initialize looking for solr.xml: /usr/home/hudson/hudson-slave/workspace/Lucene-Solr-Tests-4.x-java7/solr/build/solr-core/test/J1/./solrtest-jetty4-1348017503324/solr.xml
[junit4:junit4]   2> 10796 T2477 oasc.CoreContainer.<init> New CoreContainer 1219291223
[junit4:junit4]   2> 10796 T2477 oasc.CoreContainer.load Loading CoreContainer using Solr Home: '/usr/home/hudson/hudson-slave/workspace/Lucene-Solr-Tests-4.x-java7/solr/build/solr-core/test/J1/./solrtest-jetty4-1348017503324/'
[junit4:junit4]   2> 10797 T2477 oasc.SolrResourceLoader.<init> new SolrResourceLoader for directory: '/usr/home/hudson/hudson-slave/workspace/Lucene-Solr-Tests-4.x-java7/solr/build/solr-core/test/J1/./solrtest-jetty4-1348017503324/'
[junit4:junit4]   2> 10824 T2477 oasc.CoreContainer.load Registering Log Listener
[junit4:junit4]   2> 10837 T2477 oasc.CoreContainer.initZooKeeper Zookeeper client=127.0.0.1:60263/solr
[junit4:junit4]   2> 10838 T2477 oaz.ZooKeeper.<init> Initiating client connection, connectString=127.0.0.1:60263/solr sessionTimeout=5000 watcher=org.apache.solr.common.cloud.ConnectionManager@4709270d
[junit4:junit4]   2> 10839 T2550 oaz.ClientCnxn$SendThread.startConnect Opening socket connection to server /127.0.0.1:60263
[junit4:junit4]   2> 10839 T2477 oascc.ConnectionManager.waitForConnected Waiting for client to connect to ZooKeeper
[junit4:junit4]   2> 10839 T2550 oaz.ClientCnxn$SendThread.primeConnection Socket connection established to localhost/127.0.0.1:60263, initiating session
[junit4:junit4]   2> 10840 T2479 oazs.NIOServerCnxn$Factory.run Accepted socket connection from /140.211.11.196:60404
[junit4:junit4]   2> 10840 T2479 oazs.NIOServerCnxn.readConnectRequest Client attempting to establish new session at /140.211.11.196:60404
[junit4:junit4]   2> 10842 T2550 oaz.ClientCnxn$SendThread.readConnectResult Session establishment complete on server localhost/127.0.0.1:60263, sessionid = 0x139dc1a93a20006, negotiated timeout = 5000
[junit4:junit4]   2> 10842 T2481 oazs.NIOServerCnxn.finishSessionInit Established session 0x139dc1a93a20006 with negotiated timeout 5000 for client /140.211.11.196:60404
[junit4:junit4]   2> 10842 T2551 oascc.ConnectionManager.process Watcher org.apache.solr.common.cloud.ConnectionManager@4709270d name:ZooKeeperConnection Watcher:127.0.0.1:60263/solr got event WatchedEvent state:SyncConnected type:None path:null path:null type:None
[junit4:junit4]   2> 10843 T2477 oascc.ConnectionManager.waitForConnected Client is connected to ZooKeeper
[junit4:junit4]   2> 10843 T2482 oazs.PrepRequestProcessor.pRequest Got user-level KeeperException when processing sessionid:0x139dc1a93a20006 type:create cxid:0x1 zxid:0xfffffffffffffffe txntype:unknown reqpath:n/a Error Path:/solr/overseer Error:KeeperErrorCode = NodeExists for /solr/overseer
[junit4:junit4]   2> 10852 T2482 oazs.PrepRequestProcessor.pRequest Got user-level KeeperException when processing sessionid:0x139dc1a93a20006 type:create cxid:0x2 zxid:0xfffffffffffffffe txntype:unknown reqpath:n/a Error Path:/solr/overseer Error:KeeperErrorCode = NodeExists for /solr/overseer
[junit4:junit4]   2> 10854 T2477 oasc.ZkController.createEphemeralLiveNode Register node as live in ZooKeeper:/live_nodes/127.0.0.1:60403_solr
[junit4:junit4]   2> 10854 T2482 oazs.PrepRequestProcessor.pRequest Got user-level KeeperException when processing sessionid:0x139dc1a93a20006 type:delete cxid:0x4 zxid:0xfffffffffffffffe txntype:unknown reqpath:n/a Error Path:/solr/live_nodes/127.0.0.1:60403_solr Error:KeeperErrorCode = NoNode for /solr/live_nodes/127.0.0.1:60403_solr
[junit4:junit4]   2> 10855 T2477 oascc.SolrZkClient.makePath makePath: /live_nodes/127.0.0.1:60403_solr
[junit4:junit4]   2> 10857 T2523 oascc.ZkStateReader$3.process Updating live nodes
[junit4:junit4]   2> 10857 T2537 oascc.ZkStateReader$3.process Updating live nodes
[junit4:junit4]   2> 10857 T2497 oascc.ZkStateReader$3.process Updating live nodes
[junit4:junit4]   2> 10857 T2511 oascc.ZkStateReader$3.process Updating live nodes
[junit4:junit4]   2> 10857 T2477 oashc.HttpShardHandlerFactory.getParameter Setting socketTimeout to: 0
[junit4:junit4]   2> 10858 T2477 oashc.HttpShardHandlerFactory.getParameter Setting urlScheme to: http://
[junit4:junit4]   2> 10858 T2477 oashc.HttpShardHandlerFactory.getParameter Setting connTimeout to: 0
[junit4:junit4]   2> 10858 T2477 oashc.HttpShardHandlerFactory.getParameter Setting maxConnectionsPerHost to: 20
[junit4:junit4]   2> 10859 T2477 oashc.HttpShardHandlerFactory.getParameter Setting corePoolSize to: 0
[junit4:junit4]   2> 10859 T2477 oashc.HttpShardHandlerFactory.getParameter Setting maximumPoolSize to: 2147483647
[junit4:junit4]   2> 10859 T2477 oashc.HttpShardHandlerFactory.getParameter Setting maxThreadIdleTime to: 5
[junit4:junit4]   2> 10860 T2477 oashc.HttpShardHandlerFactory.getParameter Setting sizeOfQueue to: -1
[junit4:junit4]   2> 10860 T2477 oashc.HttpShardHandlerFactory.getParameter Setting fairnessPolicy to: false
[junit4:junit4]   2> 10860 T2477 oascsi.HttpClientUtil.createClient Creating new http client, config:maxConnectionsPerHost=20&maxConnections=10000&socketTimeout=0&connTimeout=0&retry=false
[junit4:junit4]   2> 10873 T2477 oascc.ZkStateReader.createClusterStateWatchersAndUpdate Updating cluster state from ZooKeeper... 
[junit4:junit4]   2> 10878 T2477 oasc.CoreContainer.create Creating SolrCore 'collection1' using instanceDir: /usr/home/hudson/hudson-slave/workspace/Lucene-Solr-Tests-4.x-java7/solr/build/solr-core/test/J1/./solrtest-jetty4-1348017503324/collection1
[junit4:junit4]   2> 10878 T2477 oasc.ZkController.createCollectionZkNode Check for collection zkNode:collection1
[junit4:junit4]   2> 10879 T2477 oasc.ZkController.createCollectionZkNode Collection zkNode exists
[junit4:junit4]   2> 10879 T2477 oasc.ZkController.readConfigName Load collection config from:/collections/collection1
[junit4:junit4]   2> 10880 T2477 oasc.SolrResourceLoader.<init> new SolrResourceLoader for directory: '/usr/home/hudson/hudson-slave/workspace/Lucene-Solr-Tests-4.x-java7/solr/build/solr-core/test/J1/./solrtest-jetty4-1348017503324/collection1/'
[junit4:junit4]   2> 10881 T2477 oasc.SolrResourceLoader.replaceClassLoader Adding 'file:/usr/home/hudson/hudson-slave/workspace/Lucene-Solr-Tests-4.x-java7/solr/build/solr-core/test/J1/solrtest-jetty4-1348017503324/collection1/lib/classes/' to classloader
[junit4:junit4]   2> 10882 T2477 oasc.SolrResourceLoader.replaceClassLoader Adding 'file:/usr/home/hudson/hudson-slave/workspace/Lucene-Solr-Tests-4.x-java7/solr/build/solr-core/test/J1/solrtest-jetty4-1348017503324/collection1/lib/README' to classloader
[junit4:junit4]   2> 10886 T2498 oascc.ZkStateReader.updateClusterState Updating cloud state from ZooKeeper... 
[junit4:junit4]   2> 10890 T2497 oascc.ZkStateReader$2.process A cluster state change has occurred - updating...
[junit4:junit4]   2> 10890 T2523 oascc.ZkStateReader$2.process A cluster state change has occurred - updating...
[junit4:junit4]   2> 10890 T2511 oascc.ZkStateReader$2.process A cluster state change has occurred - updating...
[junit4:junit4]   2> 10890 T2551 oascc.ZkStateReader$2.process A cluster state change has occurred - updating...
[junit4:junit4]   2> 10890 T2537 oascc.ZkStateReader$2.process A cluster state change has occurred - updating...
[junit4:junit4]   2> 10924 T2477 oasc.SolrConfig.<init> Using Lucene MatchVersion: LUCENE_40
[junit4:junit4]   2> 10992 T2477 oasc.SolrConfig.<init> Loaded SolrConfig: solrconfig.xml
[junit4:junit4]   2>  C129_STATE=coll:collection1 core:collection1 props:{shard=shard1, roles=null, state=recovering, core=collection1, collection=collection1, node_name=127.0.0.1:60367_solr, base_url=http://127.0.0.1:60367/solr}
[junit4:junit4]   2> 11073 T2525 C129 P60367 oasc.RecoveryStrategy.doRecovery Begin buffering updates. core=collection1
[junit4:junit4]   2> 11073 T2525 C129 P60367 oasu.UpdateLog.bufferUpdates Starting to buffer updates. FSUpdateLog{state=ACTIVE, tlog=null}
[junit4:junit4]   2> 11073 T2525 C129 P60367 oasc.RecoveryStrategy.replicate Attempting to replicate from http://127.0.0.1:60289/solr/collection1/. core=collection1
[junit4:junit4]   2> 11073 T2525 C129 P60367 oascsi.HttpClientUtil.createClient Creating new http client, config:maxConnections=128&maxConnectionsPerHost=32&followRedirects=false
[junit4:junit4]   2> 11084 T2506 C130 P60289 oasu.DirectUpdateHandler2.commit start commit{flags=0,_version_=0,optimize=false,openSearcher=true,waitSearcher=true,expungeDeletes=false,softCommit=false}
[junit4:junit4]   2> 11090 T2506 C130 P60289 oasc.SolrDeletionPolicy.onInit SolrDeletionPolicy.onInit: commits:num=1
[junit4:junit4]   2> 		commit{dir=NRTCachingDirectory(org.apache.lucene.store.NIOFSDirectory@/usr/home/hudson/hudson-slave/workspace/Lucene-Solr-Tests-4.x-java7/solr/build/solr-core/test/J1/org.apache.solr.cloud.SyncSliceTest-1348017492891/jetty1/index lockFactory=org.apache.lucene.store.NativeFSLockFactory@43a28d7e; maxCacheMB=48.0 maxMergeSizeMB=4.0),segFN=segments_1,generation=1,filenames=[segments_1]
[junit4:junit4]   2> 11091 T2506 C130 P60289 oasc.SolrDeletionPolicy.updateCommits newest commit = 1
[junit4:junit4]   2> 11093 T2506 C130 P60289 oass.SolrIndexSearcher.<init> Opening Searcher@11e3cbe2 main
[junit4:junit4]   2> 11093 T2477 oass.IndexSchema.readSchema Reading Solr Schema
[junit4:junit4]   2> 11094 T2506 C130 P60289 oasu.DirectUpdateHandler2.commit end_commit_flush
[junit4:junit4]   2> 11095 T2512 oasc.SolrCore.registerSearcher [collection1] Registered new searcher Searcher@11e3cbe2 main{StandardDirectoryReader(segments_1:1)}
[junit4:junit4]   2> 11096 T2506 C130 P60289 /update {waitSearcher=true&commit=true&commit_end_point=true&wt=javabin&softCommit=false&version=2} {commit=} 0 12
[junit4:junit4]   2> 11097 T2525 C129 P60367 oash.ReplicationHandler.inform Commits will be reserved for  10000
[junit4:junit4]   2> 11097 T2525 C129 P60367 oash.SnapPuller.<init>  No value set for 'pollInterval'. Timer Task not started.
[junit4:junit4]   2> 11099 T2507 C130 P60289 oash.ReplicationHandler.inform Commits will be reserved for  10000
[junit4:junit4]   2> 11099 T2507 C130 P60289 REQ /replication {command=indexversion&wt=javabin&qt=/replication&version=2} status=0 QTime=1 
[junit4:junit4]   2> 11102 T2477 oass.IndexSchema.readSchema Schema name=test
[junit4:junit4]   2> 11105 T2525 C129 P60367 oasc.SolrDeletionPolicy.onInit SolrDeletionPolicy.onInit: commits:num=1
[junit4:junit4]   2> 		commit{dir=NRTCachingDirectory(org.apache.lucene.store.NIOFSDirectory@/usr/home/hudson/hudson-slave/workspace/Lucene-Solr-Tests-4.x-java7/solr/build/solr-core/test/J1/org.apache.solr.cloud.SyncSliceTest-1348017492891/jetty2/index lockFactory=org.apache.lucene.store.NativeFSLockFactory@3e0abb1f; maxCacheMB=48.0 maxMergeSizeMB=4.0),segFN=segments_1,generation=1,filenames=[segments_1]
[junit4:junit4]   2> 11106 T2525 C129 P60367 oasc.SolrDeletionPolicy.updateCommits newest commit = 1
[junit4:junit4]   2> 11106 T2525 C129 P60367 oasu.DirectUpdateHandler2.commit start commit{flags=0,_version_=0,optimize=false,openSearcher=true,waitSearcher=true,expungeDeletes=false,softCommit=false}
[junit4:junit4]   2> 11112 T2525 C129 P60367 oasc.SolrDeletionPolicy.onCommit SolrDeletionPolicy.onCommit: commits:num=2
[junit4:junit4]   2> 		commit{dir=NRTCachingDirectory(org.apache.lucene.store.NIOFSDirectory@/usr/home/hudson/hudson-slave/workspace/Lucene-Solr-Tests-4.x-java7/solr/build/solr-core/test/J1/org.apache.solr.cloud.SyncSliceTest-1348017492891/jetty2/index lockFactory=org.apache.lucene.store.NativeFSLockFactory@3e0abb1f; maxCacheMB=48.0 maxMergeSizeMB=4.0),segFN=segments_1,generation=1,filenames=[segments_1]
[junit4:junit4]   2> 		commit{dir=NRTCachingDirectory(org.apache.lucene.store.NIOFSDirectory@/usr/home/hudson/hudson-slave/workspace/Lucene-Solr-Tests-4.x-java7/solr/build/solr-core/test/J1/org.apache.solr.cloud.SyncSliceTest-1348017492891/jetty2/index lockFactory=org.apache.lucene.store.NativeFSLockFactory@3e0abb1f; maxCacheMB=48.0 maxMergeSizeMB=4.0),segFN=segments_2,generation=2,filenames=[segments_2]
[junit4:junit4]   2> 11112 T2525 C129 P60367 oasc.SolrDeletionPolicy.updateCommits newest commit = 2
[junit4:junit4]   2> 11117 T2525 C129 P60367 oass.SolrIndexSearcher.<init> Opening Searcher@78cc866a main
[junit4:junit4]   2> 11117 T2525 C129 P60367 oasu.DirectUpdateHandler2.commit end_commit_flush
[junit4:junit4]   2> 11119 T2524 oasc.SolrCore.registerSearcher [collection1] Registered new searcher Searcher@78cc866a main{StandardDirectoryReader(segments_2:2)}
[junit4:junit4]   2> 11120 T2525 C129 P60367 oasc.RecoveryStrategy.replay No replay needed. core=collection1
[junit4:junit4]   2> 11120 T2525 C129 P60367 oasc.RecoveryStrategy.doRecovery Replication Recovery was successful - registering as Active. core=collection1
[junit4:junit4]   2> 11122 T2525 C129 P60367 oasc.RecoveryStrategy.doRecovery Finished recovery process. core=collection1
[junit4:junit4]   2> 11394 T2498 oascc.ZkStateReader.updateClusterState Updating cloud state from ZooKeeper... 
[junit4:junit4]   2> 11408 T2511 oascc.ZkStateReader$2.process A cluster state change has occurred - updating...
[junit4:junit4]   2> 11408 T2523 oascc.ZkStateReader$2.process A cluster state change has occurred - updating...
[junit4:junit4]   2> 11408 T2497 oascc.ZkStateReader$2.process A cluster state change has occurred - updating...
[junit4:junit4]   2> 11408 T2537 oascc.ZkStateReader$2.process A cluster state change has occurred - updating...
[junit4:junit4]   2> 11408 T2551 oascc.ZkStateReader$2.process A cluster state change has occurred - updating...
[junit4:junit4]   2> 11840 T2477 oass.OpenExchangeRatesOrgProvider.init Initialized with rates=open-exchange-rates.json, refreshInterval=1440.
[junit4:junit4]   2> 11853 T2477 oass.IndexSchema.readSchema default search field in schema is text
[junit4:junit4]   2> 11858 T2477 oass.IndexSchema.readSchema unique key field: id
[junit4:junit4]   2> 11869 T2477 oass.FileExchangeRateProvider.reload Reloading exchange rates from file currency.xml
[junit4:junit4]   2> 11888 T2477 oass.FileExchangeRateProvider.reload Reloading exchange rates from file currency.xml
[junit4:junit4]   2> 11893 T2477 oass.OpenExchangeRatesOrgProvider.reload Reloading exchange rates from open-exchange-rates.json
[junit4:junit4]   2> 11894 T2477 oass.OpenExchangeRatesOrgProvider.reload Reloading exchange rates from open-exchange-rates.json
[junit4:junit4]   2> 11895 T2477 oasc.SolrCore.<init> [collection1] Opening new SolrCore at /usr/home/hudson/hudson-slave/workspace/Lucene-Solr-Tests-4.x-java7/solr/build/solr-core/test/J1/./solrtest-jetty4-1348017503324/collection1/, dataDir=./org.apache.solr.cloud.SyncSliceTest-1348017492891/jetty4/
[junit4:junit4]   2> 11895 T2477 oasc.JmxMonitoredMap.<init> JMX monitoring is enabled. Adding Solr mbeans to JMX Server: com.sun.jmx.mbeanserver.JmxMBeanServer@7b9f4f58
[junit4:junit4]   2> 11897 T2477 oasc.SolrCore.getNewIndexDir WARNING New index directory detected: old=null new=./org.apache.solr.cloud.SyncSliceTest-1348017492891/jetty4/index/
[junit4:junit4]   2> 11898 T2477 oasc.SolrCore.initIndex WARNING [collection1] Solr index directory './org.apache.solr.cloud.SyncSliceTest-1348017492891/jetty4/index' doesn't exist. Creating new index...
[junit4:junit4]   2> 11899 T2477 oasc.CachingDirectoryFactory.get return new directory for /usr/home/hudson/hudson-slave/workspace/Lucene-Solr-Tests-4.x-java7/solr/build/solr-core/test/J1/./org.apache.solr.cloud.SyncSliceTest-1348017492891/jetty4/index forceNew:false
[junit4:junit4]   2> 11922 T2477 oasc.SolrDeletionPolicy.onCommit SolrDeletionPolicy.onCommit: commits:num=1
[junit4:junit4]   2> 		commit{dir=NRTCachingDirectory(org.apache.lucene.store.NIOFSDirectory@/usr/home/hudson/hudson-slave/workspace/Lucene-Solr-Tests-4.x-java7/solr/build/solr-core/test/J1/org.apache.solr.cloud.SyncSliceTest-1348017492891/jetty4/index lockFactory=org.apache.lucene.store.NativeFSLockFactory@38827c2a; maxCacheMB=48.0 maxMergeSizeMB=4.0),segFN=segments_1,generation=1,filenames=[segments_1]
[junit4:junit4]   2> 11922 T2477 oasc.SolrDeletionPolicy.updateCommits newest commit = 1
[junit4:junit4]   2> 11924 T2477 oasc.SolrCore.initWriters created xml: solr.XMLResponseWriter
[junit4:junit4]   2> 11926 T2477 oasup.UpdateRequestProcessorChain.init inserting DistributedUpdateProcessorFactory into updateRequestProcessorChain "dedupe"
[junit4:junit4]   2> 11927 T2477 oasup.UpdateRequestProcessorChain.init inserting DistributedUpdateProcessorFactory into updateRequestProcessorChain "dedupe-allfields"
[junit4:junit4]   2> 11928 T2477 oasup.UpdateRequestProcessorChain.init inserting DistributedUpdateProcessorFactory into updateRequestProcessorChain "stored_sig"
[junit4:junit4]   2> 11928 T2477 oasup.UpdateRequestProcessorChain.init inserting DistributedUpdateProcessorFactory into updateRequestProcessorChain "uniq-fields"
[junit4:junit4]   2> 11929 T2477 oasup.UpdateRequestProcessorChain.init inserting DistributedUpdateProcessorFactory into updateRequestProcessorChain "distrib-dup-test-chain-implicit"
[junit4:junit4]   2> 11930 T2477 oasc.RequestHandlers.initHandlersFromConfig adding lazy requestHandler: solr.ReplicationHandler
[junit4:junit4]   2> 11931 T2477 oasc.RequestHandlers.initHandlersFromConfig created /replication: solr.ReplicationHandler
[junit4:junit4]   2> 11931 T2477 oasc.RequestHandlers.initHandlersFromConfig created standard: solr.StandardRequestHandler
[junit4:junit4]   2> 11932 T2477 oasc.RequestHandlers.initHandlersFromConfig created /get: solr.RealTimeGetHandler
[junit4:junit4]   2> 11933 T2477 oasc.RequestHandlers.initHandlersFromConfig created dismax: solr.SearchHandler
[junit4:junit4]   2> 11934 T2477 oasc.RequestHandlers.initHandlersFromConfig created mock: org.apache.solr.core.MockQuerySenderListenerReqHandler
[junit4:junit4]   2> 11935 T2477 oasc.RequestHandlers.initHandlersFromConfig created /admin/: org.apache.solr.handler.admin.AdminHandlers
[junit4:junit4]   2> 11935 T2477 oasc.RequestHandlers.initHandlersFromConfig created defaults: solr.StandardRequestHandler
[junit4:junit4]   2> 11936 T2477 oasc.RequestHandlers.initHandlersFromConfig adding lazy requestHandler: solr.StandardRequestHandler
[junit4:junit4]   2> 11936 T2477 oasc.RequestHandlers.initHandlersFromConfig created lazy: solr.StandardRequestHandler
[junit4:junit4]   2> 11937 T2477 oasc.RequestHandlers.initHandlersFromConfig created /update: solr.UpdateRequestHandler
[junit4:junit4]   2> 11938 T2477 oasc.RequestHandlers.initHandlersFromConfig created /terms: org.apache.solr.handler.component.SearchHandler
[junit4:junit4]   2> 11939 T2477 oasc.RequestHandlers.initHandlersFromConfig created spellCheckCompRH: org.apache.solr.handler.component.SearchHandler
[junit4:junit4]   2> 11940 T2477 oasc.RequestHandlers.initHandlersFromConfig created spellCheckCompRH_Direct: org.apache.solr.handler.component.SearchHandler
[junit4:junit4]   2> 11940 T2477 oasc.RequestHandlers.initHandlersFromConfig created spellCheckWithWordbreak: org.apache.solr.handler.component.SearchHandler
[junit4:junit4]   2> 11941 T2477 oasc.RequestHandlers.initHandlersFromConfig created spellCheckWithWordbreak_Direct: org.apache.solr.handler.component.SearchHandler
[junit4:junit4]   2> 11942 T2477 oasc.RequestHandlers.initHandlersFromConfig created spellCheckCompRH1: org.apache.solr.handler.component.SearchHandler
[junit4:junit4]   2> 11943 T2477 oasc.RequestHandlers.initHandlersFromConfig created tvrh: org.apache.solr.handler.component.SearchHandler
[junit4:junit4]   2> 11944 T2477 oasc.RequestHandlers.initHandlersFromConfig created /mlt: solr.MoreLikeThisHandler
[junit4:junit4]   2> 11944 T2477 oasc.RequestHandlers.initHandlersFromConfig created /debug/dump: solr.DumpRequestHandler
[junit4:junit4]   2> 11949 T2477 oashl.XMLLoader.init xsltCacheLifetimeSeconds=60
[junit4:junit4]   2> 11955 T2477 oasc.SolrCore.initDeprecatedSupport WARNING solrconfig.xml uses deprecated <admin/gettableFiles>, Please update your config to use the ShowFileRequestHandler.
[junit4:junit4]   2> 11956 T2477 oasc.SolrCore.initDeprecatedSupport WARNING adding ShowFileRequestHandler with hidden files: [SCHEMA.XML, OLD_SYNONYMS.TXT, STOPWORDS.TXT, PROTWORDS.TXT, OPEN-EXCHANGE-RATES.JSON, SYNONYMS.TXT, CURRENCY.XML, MAPPING-ISOLATIN1ACCENT.TXT]
[junit4:junit4]   2> 11961 T2477 oass.SolrIndexSearcher.<init> Opening Searcher@78d45eda main
[junit4:junit4]   2> 11962 T2477 oasu.CommitTracker.<init> Hard AutoCommit: disabled
[junit4:junit4]   2> 11963 T2477 oasu.CommitTracker.<init> Soft AutoCommit: disabled
[junit4:junit4]   2> 11964 T2477 oashc.SpellCheckComponent.inform Initializing spell checkers
[junit4:junit4]   2> 11972 T2477 oass.DirectSolrSpellChecker.init init: {name=direct,classname=DirectSolrSpellChecker,field=lowerfilt,minQueryLength=3}
[junit4:junit4]   2> 12032 T2552 oasc.SolrCore.registerSearcher [collection1] Registered new searcher Searcher@78d45eda main{StandardDirectoryReader(segments_1:1)}
[junit4:junit4]   2> 12413 T2498 oascc.ZkStateReader.updateClusterState Updating cloud state from ZooKeeper... 
[junit4:junit4]   2> 12425 T2537 oascc.ZkStateReader$2.process A cluster state change has occurred - updating...
[junit4:junit4]   2> 12425 T2497 oascc.ZkStateReader$2.process A cluster state change has occurred - updating...
[junit4:junit4]   2> 12425 T2511 oascc.ZkStateReader$2.process A cluster state change has occurred - updating...
[junit4:junit4]   2> 12425 T2523 oascc.ZkStateReader$2.process A cluster state change has occurred - updating...
[junit4:junit4]   2> 12425 T2551 oascc.ZkStateReader$2.process A cluster state change has occurred - updating...
[junit4:junit4]   2> 12539 T2477 oasc.CoreContainer.register registering core: collection1
[junit4:junit4]   2> 12539 T2477 oasc.ZkController.register Register shard - core:collection1 address:http://127.0.0.1:60403/solr shardId:shard1
[junit4:junit4]   2> 12542 T2477 oasc.ZkController.register We are http://127.0.0.1:60403/solr/collection1/ and leader is http://127.0.0.1:60289/solr/collection1/
[junit4:junit4]   2> 12543 T2477 oasc.ZkController.register No LogReplay needed for core=collection1 baseURL=http://127.0.0.1:60403/solr
[junit4:junit4]   2> 12543 T2477 oasc.ZkController.checkRecovery Core needs to recover:collection1
[junit4:junit4]   2> 12544 T2477 oasu.DefaultSolrCoreState.doRecovery Running recovery - first canceling any ongoing recovery
[junit4:junit4]   2> ASYNC  NEW_CORE C132 name=collection1 org.apache.solr.core.SolrCore@6d7d38e1 url=http://127.0.0.1:60403/solr/collection1 node=127.0.0.1:60403_solr
[junit4:junit4]   2> 12545 T2553 C132 P60403 oasc.RecoveryStrategy.run Starting recovery process.  core=collection1 recoveringAfterStartup=true
[junit4:junit4]   2> 12545 T2477 oascc.ZkStateReader.updateClusterState Updating cloud state from ZooKeeper... 
[junit4:junit4]   2> 12546 T2553 C132 P60403 oasc.RecoveryStrategy.doRecovery ###### startupVersions=[]
[junit4:junit4]   2> 12547 T2477 oass.SolrDispatchFilter.init user.dir=/usr/home/hudson/hudson-slave/workspace/Lucene-Solr-Tests-4.x-java7/solr/build/solr-core/test/J1
[junit4:junit4]   2> 12547 T2477 oass.SolrDispatchFilter.init SolrDispatchFilter.init() done
[junit4:junit4]   2> 12548 T2477 oascsi.HttpClientUtil.createClient Creating new http client, config:maxConnections=128&maxConnectionsPerHost=32&followRedirects=false
[junit4:junit4]   2> 12548 T2553 C132 P60403 oasc.RecoveryStrategy.doRecovery Attempting to PeerSync from http://127.0.0.1:60289/solr/collection1/ core=collection1 - recoveringAfterStartup=true
[junit4:junit4]   2> 12548 T2553 C132 P60403 oasu.PeerSync.sync PeerSync: core=collection1 url=http://127.0.0.1:60403/solr START replicas=[http://127.0.0.1:60289/solr/collection1/] nUpdates=100
[junit4:junit4]   2> 12549 T2553 C132 P60403 oasu.PeerSync.sync WARNING no frame of reference to tell of we've missed updates
[junit4:junit4]   2> 12549 T2553 C132 P60403 oasc.RecoveryStrategy.doRecovery PeerSync Recovery was not successful - trying replication. core=collection1
[junit4:junit4]   2> 12549 T2553 C132 P60403 oasc.RecoveryStrategy.doRecovery Starting Replication Recovery. core=collection1
[junit4:junit4]   2> 12549 T2553 C132 P60403 oascsi.HttpClientUtil.createClient Creating new http client, config:maxConnections=128&maxConnectionsPerHost=32&followRedirects=false
[junit4:junit4]   2> 12551 T2503 C130 P60289 REQ /get {distrib=false&qt=/get&wt=javabin&version=2&getVersions=100} status=0 QTime=0 
[junit4:junit4]   2> 12568 T2477 oaz.ZooKeeper.<init> Initiating client connection, connectString=127.0.0.1:60263/solr sessionTimeout=10000 watcher=org.apache.solr.common.cloud.ConnectionManager@160455e6
[junit4:junit4]   2> 12569 T2555 oaz.ClientCnxn$SendThread.startConnect Opening socket connection to server /127.0.0.1:60263
[junit4:junit4]   2> 12569 T2477 oascc.ConnectionManager.waitForConnected Waiting for client to connect to ZooKeeper
[junit4:junit4]   2> 12569 T2555 oaz.ClientCnxn$SendThread.primeConnection Socket connection established to localhost/127.0.0.1:60263, initiating session
[junit4:junit4]   2> 12570 T2479 oazs.NIOServerCnxn$Factory.run Accepted socket connection from /140.211.11.196:60418
[junit4:junit4]   2> 12570 T2479 oazs.NIOServerCnxn.readConnectRequest Client attempting to establish new session at /140.211.11.196:60418
[junit4:junit4]   2> 12571 T2481 oazs.NIOServerCnxn.finishSessionInit Established session 0x139dc1a93a20007 with negotiated timeout 10000 for client /140.211.11.196:60418
[junit4:junit4]   2> 12571 T2555 oaz.ClientCnxn$SendThread.readConnectResult Session establishment complete on server localhost/127.0.0.1:60263, sessionid = 0x139dc1a93a20007, negotiated timeout = 10000
[junit4:junit4]   2> 12572 T2556 oascc.ConnectionManager.process Watcher org.apache.solr.common.cloud.ConnectionManager@160455e6 name:ZooKeeperConnection Watcher:127.0.0.1:60263/solr got event WatchedEvent state:SyncConnected type:None path:null path:null type:None
[junit4:junit4]   2> 12572 T2477 oascc.ConnectionManager.waitForConnected Client is connected to ZooKeeper
[junit4:junit4]   2> 12573 T2477 oascc.ZkStateReader.createClusterStateWatchersAndUpdate Updating cluster state from ZooKeeper... 
[junit4:junit4]   2> 12574 T2477 oasc.ChaosMonkey.monkeyLog monkey: init - expire sessions:true cause connection loss:true
[junit4:junit4]   2> 12574 T2477 oascsi.HttpClientUtil.createClient Creating new http client, config:
[junit4:junit4]   2> 12584 T2477 oascc.ZkStateReader.updateClusterState Updating cloud state from ZooKeeper... 
[junit4:junit4]   2> 12585 T2477 oasc.AbstractFullDistribZkTestBase.waitForThingsToLevelOut Wait for recoveries to finish - wait 15 for each attempt
[junit4:junit4]   2> 12585 T2477 oasc.AbstractDistribZkTestBase.waitForRecoveriesToFinish Wait for recoveries to finish - collection: collection1 failOnTimeout:true timeout (sec):15
[junit4:junit4]   2> 12586 T2477 oascc.ZkStateReader.updateClusterState Updating cloud state from ZooKeeper... 
[junit4:junit4]   2> 12929 T2498 oascc.ZkStateReader.updateClusterState Updating cloud state from ZooKeeper... 
[junit4:junit4]   2> 12944 T2511 oascc.ZkStateReader$2.process A cluster state change has occurred - updating...
[junit4:junit4]   2> 12944 T2523 oascc.ZkStateReader$2.process A cluster state change has occurred - updating...
[junit4:junit4]   2> 12944 T2537 oascc.ZkStateReader$2.process A cluster state change has occurred - updating...
[junit4:junit4]   2> 12944 T2556 oascc.ZkStateReader$2.process A cluster state change has occurred - updating...
[junit4:junit4]   2> 12944 T2551 oascc.ZkStateReader$2.process A cluster state change has occurred - updating...
[junit4:junit4]   2> 12944 T2497 oascc.ZkStateReader$2.process A cluster state change has occurred - updating...
[junit4:junit4]   2>  C131_STATE=coll:collection1 core:collection1 props:{shard=shard1, roles=null, state=recovering, core=collection1, collection=collection1, node_name=127.0.0.1:60388_solr, base_url=http://127.0.0.1:60388/solr}
[junit4:junit4]   2> 13441 T2539 C131 P60388 oasc.RecoveryStrategy.doRecovery Begin buffering updates. core=collection1
[junit4:junit4]   2> 13441 T2539 C131 P60388 oasu.UpdateLog.bufferUpdates Starting to buffer updates. FSUpdateLog{state=ACTIVE, tlog=null}
[junit4:junit4]   2> 13441 T2539 C131 P60388 oasc.RecoveryStrategy.replicate Attempting to replicate from http://127.0.0.1:60289/solr/collection1/. core=collection1
[junit4:junit4]   2> 13441 T2539 C131 P60388 oascsi.HttpClientUtil.createClient Creating new http client, config:maxConnections=128&maxConnectionsPerHost=32&followRedirects=false
[junit4:junit4]   2> 13453 T2509 C130 P60289 oasu.DirectUpdateHandler2.commit start commit{flags=0,_version_=0,optimize=false,openSearcher=true,waitSearcher=true,expungeDeletes=false,softCommit=false}
[junit4:junit4]   2> 13458 T2509 C130 P60289 oass.SolrIndexSearcher.<init> Opening Searcher@611d2572 main
[junit4:junit4]   2> 13458 T2509 C130 P60289 oasu.DirectUpdateHandler2.commit end_commit_flush
[junit4:junit4]   2> 13460 T2512 oasc.SolrCore.registerSearcher [collection1] Registered new searcher Searcher@611d2572 main{StandardDirectoryReader(segments_1:1)}
[junit4:junit4]   2> 13460 T2509 C130 P60289 /update {waitSearcher=true&commit=true&commit_end_point=true&wt=javabin&softCommit=false&version=2} {commit=} 0 7
[junit4:junit4]   2> 13461 T2539 C131 P60388 oash.ReplicationHandler.inform Commits will be reserved for  10000
[junit4:junit4]   2> 13461 T2539 C131 P60388 oash.SnapPuller.<init>  No value set for 'pollInterval'. Timer Task not started.
[junit4:junit4]   2> 13464 T2507 C130 P60289 REQ /replication {command=indexversion&wt=javabin&qt=/replication&version=2} status=0 QTime=0 
[junit4:junit4]   2> 13468 T2539 C131 P60388 oasc.SolrDeletionPolicy.onInit SolrDeletionPolicy.onInit: commits:num=1
[junit4:junit4]   2> 		commit{dir=NRTCachingDirectory(org.apache.lucene.store.NIOFSDirectory@/usr/home/hudson/hudson-slave/workspace/Lucene-Solr-Tests-4.x-java7/solr/build/solr-core/test/J1/org.apache.solr.cloud.SyncSliceTest-1348017492891/jetty3/index lockFactory=org.apache.lucene.store.NativeFSLockFactory@6b2a49d9; maxCacheMB=48.0 maxMergeSizeMB=4.0),segFN=segments_1,generation=1,filenames=[segments_1]
[junit4:junit4]   2> 13469 T2539 C131 P60388 oasc.SolrDeletionPolicy.updateCommits newest commit = 1
[junit4:junit4]   2> 13469 T2539 C131 P60388 oasu.DirectUpdateHandler2.commit start commit{flags=0,_version_=0,optimize=false,openSearcher=true,waitSearcher=true,expungeDeletes=false,softCommit=false}
[junit4:junit4]   2> 13476 T2539 C131 P60388 oasc.SolrDeletionPolicy.onCommit SolrDeletionPolicy.onCommit: commits:num=2
[junit4:junit4]   2> 		commit{dir=NRTCachingDirectory(org.apache.lucene.store.NIOFSDirectory@/usr/home/hudson/hudson-slave/workspace/Lucene-Solr-Tests-4.x-java7/solr/build/solr-core/test/J1/org.apache.solr.cloud.SyncSliceTest-1348017492891/jetty3/index lockFactory=org.apache.lucene.store.NativeFSLockFactory@6b2a49d9; maxCacheMB=48.0 maxMergeSizeMB=4.0),segFN=segments_1,generation=1,filenames=[segments_1]
[junit4:junit4]   2> 		commit{dir=NRTCachingDirectory(org.apache.lucene.store.NIOFSDirectory@/usr/home/hudson/hudson-slave/workspace/Lucene-Solr-Tests-4.x-java7/solr/build/solr-core/test/J1/org.apache.solr.cloud.SyncSliceTest-1348017492891/jetty3/index lockFactory=org.apache.lucene.store.NativeFSLockFactory@6b2a49d9; maxCacheMB=48.0 maxMergeSizeMB=4.0),segFN=segments_2,generation=2,filenames=[segments_2]
[junit4:junit4]   2> 13477 T2539 C131 P60388 oasc.SolrDeletionPolicy.updateCommits newest commit = 2
[junit4:junit4]   2> 13480 T2539 C131 P60388 oass.SolrIndexSearcher.<init> Opening Searcher@fe4273 main
[junit4:junit4]   2> 13480 T2539 C131 P60388 oasu.DirectUpdateHandler2.commit end_commit_flush
[junit4:junit4]   2> 13481 T2538 oasc.SolrCore.registerSearcher [collection1] Registered new searcher Searcher@fe4273 main{StandardDirectoryReader(segments_2:2)}
[junit4:junit4]   2> 13482 T2539 C131 P60388 oasc.RecoveryStrategy.replay No replay needed. core=collection1
[junit4:junit4]   2> 13482 T2539 C131 P60388 oasc.RecoveryStrategy.doRecovery Replication Recovery was successful - registering as Active. core=collection1
[junit4:junit4]   2> 13484 T2539 C131 P60388 oasc.RecoveryStrategy.doRecovery Finished recovery process. core=collection1
[junit4:junit4]   2> 13588 T2477 oascc.ZkStateReader.updateClusterState Updating cloud state from ZooKeeper... 
[junit4:junit4]   2> 13956 T2498 oascc.ZkStateReader.updateClusterState Updating cloud state from ZooKeeper... 
[junit4:junit4]   2> 13968 T2537 oascc.ZkStateReader$2.process A cluster state change has occurred - updating...
[junit4:junit4]   2> 13968 T2523 oascc.ZkStateReader$2.process A cluster state change has occurred - updating...
[junit4:junit4]   2> 13968 T2551 oascc.ZkStateReader$2.process A cluster state change has occurred - updating...
[junit4:junit4]   2> 13968 T2497 oascc.ZkStateReader$2.process A cluster state change has occurred - updating...
[junit4:junit4]   2> 13968 T2511 oascc.ZkStateReader$2.process A cluster state change has occurred - updating...
[junit4:junit4]   2> 13968 T2556 oascc.ZkStateReader$2.process A cluster state change has occurred - updating...
[junit4:junit4]   2> 14590 T2477 oascc.ZkStateReader.updateClusterState Updating cloud state from ZooKeeper... 
[junit4:junit4]   2>  C132_STATE=coll:collection1 core:collection1 props:{shard=shard1, roles=null, state=recovering, core=collection1, collection=collection1, node_name=127.0.0.1:60403_solr, base_url=http://127.0.0.1:60403/solr}
[junit4:junit4]   2> 15571 T2553 C132 P60403 oasc.RecoveryStrategy.doRecovery Begin buffering updates. core=collection1
[junit4:junit4]   2> 15571 T2553 C132 P60403 oasu.UpdateLog.bufferUpdates Starting to buffer updates. FSUpdateLog{state=ACTIVE, tlog=null}
[junit4:junit4]   2> 15571 T2553 C132 P60403 oasc.RecoveryStrategy.replicate Attempting to replicate from http://127.0.0.1:60289/solr/collection1/. core=collection1
[junit4:junit4]   2> 15571 T2553 C132 P60403 oascsi.HttpClientUtil.createClient Creating new http client, config:maxConnections=128&maxConnectionsPerHost=32&followRedirects=false
[junit4:junit4]   2> 15581 T2504 C130 P60289 oasu.DirectUpdateHandler2.commit start commit{flags=0,_version_=0,optimize=false,openSearcher=true,waitSearcher=true,expungeDeletes=false,softCommit=false}
[junit4:junit4]   2> 15584 T2504 C130 P60289 oass.SolrIndexSearcher.<init> Opening Searcher@2794b6 main
[junit4:junit4]   2> 15585 T2504 C130 P60289 oasu.DirectUpdateHandler2.commit end_commit_flush
[junit4:junit4]   2> 15586 T2512 oasc.SolrCore.registerSearcher [collection1] Registered new searcher Searcher@2794b6 main{StandardDirectoryReader(segments_1:1)}
[junit4:junit4]   2> 15586 T2504 C130 P60289 /update {waitSearcher=true&commit=true&commit_end_point=true&wt=javabin&softCommit=false&version=2} {commit=} 0 5
[junit4:junit4]   2> 15587 T2553 C132 P60403 oash.ReplicationHandler.inform Commits will be reserved for  10000
[junit4:junit4]   2> 15587 T2553 C132 P60403 oash.SnapPuller.<init>  No value set for 'pollInterval'. Timer Task not started.
[junit4:junit4]   2> 15590 T2507 C130 P60289 REQ /replication {command=indexversion&wt=javabin&qt=/replication&version=2} status=0 QTime=0 
[junit4:junit4]   2> 15592 T2477 oascc.ZkStateReader.updateClusterState Updating cloud state from ZooKeeper... 
[junit4:junit4]   2> 15595 T2553 C132 P60403 oasc.SolrDeletionPolicy.onInit SolrDeletionPolicy.onInit: commits:num=1
[junit4:junit4]   2> 		commit{dir=NRTCachingDirectory(org.apache.lucene.store.NIOFSDirectory@/usr/home/hudson/hudson-slave/workspace/Lucene-Solr-Tests-4.x-java7/solr/build/solr-core/test/J1/org.apache.solr.cloud.SyncSliceTest-1348017492891/jetty4/index lockFactory=org.apache.lucene.store.NativeFSLockFactory@38827c2a; maxCacheMB=48.0 maxMergeSizeMB=4.0),segFN=segments_1,generation=1,filenames=[segments_1]
[junit4:junit4]   2> 15595 T2553 C132 P60403 oasc.SolrDeletionPolicy.updateCommits newest commit = 1
[junit4:junit4]   2> 15596 T2553 C132 P60403 oasu.DirectUpdateHandler2.commit start commit{flags=0,_version_=0,optimize=false,openSearcher=true,waitSearcher=true,expungeDeletes=false,softCommit=false}
[junit4:junit4]   2> 15625 T2553 C132 P60403 oasc.SolrDeletionPolicy.onCommit SolrDeletionPolicy.onCommit: commits:num=2
[junit4:junit4]   2> 		commit{dir=NRTCachingDirectory(org.apache.lucene.store.NIOFSDirectory@/usr/home/hudson/hudson-slave/workspace/Lucene-Solr-Tests-4.x-java7/solr/build/solr-core/test/J1/org.apache.solr.cloud.SyncSliceTest-1348017492891/jetty4/index lockFactory=org.apache.lucene.store.NativeFSLockFactory@38827c2a; maxCacheMB=48.0 maxMergeSizeMB=4.0),segFN=segments_1,generation=1,filenames=[segments_1]
[junit4:junit4]   2> 		commit{dir=NRTCachingDirectory(org.apache.lucene.store.NIOFSDirectory@/usr/home/hudson/hudson-slave/workspace/Lucene-Solr-Tests-4.x-java7/solr/build/solr-core/test/J1/org.apache.solr.cloud.SyncSliceTest-1348017492891/jetty4/index lockFactory=org.apache.lucene.store.NativeFSLockFactory@38827c2a; maxCacheMB=48.0 maxMergeSizeMB=4.0),segFN=segments_2,generation=2,filenames=[segments_2]
[junit4:junit4]   2> 15625 T2553 C132 P60403 oasc.SolrDeletionPolicy.updateCommits newest commit = 2
[junit4:junit4]   2> 15628 T2553 C132 P60403 oass.SolrIndexSearcher.<init> Opening Searcher@4237153a main
[junit4:junit4]   2> 15629 T2553 C132 P60403 oasu.DirectUpdateHandler2.commit end_commit_flush
[junit4:junit4]   2> 15629 T2552 oasc.SolrCore.registerSearcher [collection1] Registered new searcher Searcher@4237153a main{StandardDirectoryReader(segments_2:2)}
[junit4:junit4]   2> 15630 T2553 C132 P60403 oasc.RecoveryStrategy.replay No replay needed. core=collection1
[junit4:junit4]   2> 15630 T2553 C132 P60403 oasc.RecoveryStrategy.doRecovery Replication Recovery was successful - registering as Active. core=collection1
[junit4:junit4]   2> 15636 T2553 C132 P60403 oasc.RecoveryStrategy.doRecovery Finished recovery process. core=collection1
[junit4:junit4]   2> 15975 T2498 oascc.ZkStateReader.updateClusterState Updating cloud state from ZooKeeper... 
[junit4:junit4]   2> 15987 T2556 oascc.ZkStateReader$2.process A cluster state change has occurred - updating...
[junit4:junit4]   2> 15987 T2497 oascc.ZkStateReader$2.process A cluster state change has occurred - updating...
[junit4:junit4]   2> 15987 T2537 oascc.ZkStateReader$2.process A cluster state change has occurred - updating...
[junit4:junit4]   2> 15987 T2523 oascc.ZkStateReader$2.process A cluster state change has occurred - updating...
[junit4:junit4]   2> 15987 T2551 oascc.ZkStateReader$2.process A cluster state change has occurred - updating...
[junit4:junit4]   2> 15987 T2511 oascc.ZkStateReader$2.process A cluster state change has occurred - updating...
[junit4:junit4]   2> 16594 T2477 oascc.ZkStateReader.updateClusterState Updating cloud state from ZooKeeper... 
[junit4:junit4]   2> ASYNC  NEW_CORE C133 name=collection1 org.apache.solr.core.SolrCore@209a353b url=http://127.0.0.1:60270/solr/collection1 node=127.0.0.1:60270_solr
[junit4:junit4]   2> 16605 T2489 C133 P60270 oasu.DirectUpdateHandler2.commit start commit{flags=0,_version_=0,optimize=false,openSearcher=true,waitSearcher=true,expungeDeletes=false,softCommit=false}
[junit4:junit4]   2> 16610 T2489 C133 P60270 oasc.SolrDeletionPolicy.onInit SolrDeletionPolicy.onInit: commits:num=1
[junit4:junit4]   2> 		commit{dir=NRTCachingDirectory(org.apache.lucene.store.NIOFSDirectory@/usr/home/hudson/hudson-slave/workspace/Lucene-Solr-Tests-4.x-java7/solr/build/solr-core/test/J1/org.apache.solr.cloud.SyncSliceTest-1348017492891/control/data/index lockFactory=org.apache.lucene.store.NativeFSLockFactory@23767cf5; maxCacheMB=48.0 maxMergeSizeMB=4.0),segFN=segments_1,generation=1,filenames=[segments_1]
[junit4:junit4]   2> 16610 T2489 C133 P60270 oasc.SolrDeletionPolicy.updateCommits newest commit = 1
[junit4:junit4]   2> 16612 T2489 C133 P60270 oass.SolrIndexSearcher.<init> Opening Searcher@483b9786 main
[junit4:junit4]   2> 16612 T2489 C133 P60270 oasu.DirectUpdateHandler2.commit end_commit_flush
[junit4:junit4]   2> 16614 T2500 oasc.SolrCore.registerSearcher [collection1] Registered new searcher Searcher@483b9786 main{StandardDirectoryReader(segments_1:1)}
[junit4:junit4]   2> 16615 T2489 C133 P60270 /update {waitSearcher=true&wt=javabin&commit=true&softCommit=false&version=2} {commit=} 0 10
[junit4:junit4]   2> 16615 T2477 oaz.ZooKeeper.<init> Initiating client connection, connectString=127.0.0.1:60263/solr sessionTimeout=10000 watcher=org.apache.solr.common.cloud.ConnectionManager@13f258fb
[junit4:junit4]   2> 16617 T2557 oaz.ClientCnxn$SendThread.startConnect Opening socket connection to server /127.0.0.1:60263
[junit4:junit4]   2> 16617 T2477 oascc.ConnectionManager.waitForConnected Waiting for client to connect to ZooKeeper
[junit4:junit4]   2> 16617 T2557 oaz.ClientCnxn$SendThread.primeConnection Socket connection established to localhost/127.0.0.1:60263, initiating session
[junit4:junit4]   2> 16618 T2479 oazs.NIOServerCnxn$Factory.run Accepted socket connection from /140.211.11.196:60453
[junit4:junit4]   2> 16618 T2479 oazs.NIOServerCnxn.readConnectRequest Client attempting to establish new session at /140.211.11.196:60453
[junit4:junit4]   2> 16619 T2481 oazs.NIOServerCnxn.finishSessionInit Established session 0x139dc1a93a20008 with negotiated timeout 10000 for client /140.211.11.196:60453
[junit4:junit4]   2> 16619 T2557 oaz.ClientCnxn$SendThread.readConnectResult Session establishment complete on server localhost/127.0.0.1:60263, sessionid = 0x139dc1a93a20008, negotiated timeout = 10000
[junit4:junit4]   2> 16620 T2558 oascc.ConnectionManager.process Watcher org.apache.solr.common.cloud.ConnectionManager@13f258fb name:ZooKeeperConnection Watcher:127.0.0.1:60263/solr got event WatchedEvent state:SyncConnected type:None path:null path:null type:None
[junit4:junit4]   2> 16620 T2477 oascc.ConnectionManager.waitForConnected Client is connected to ZooKeeper
[junit4:junit4]   2> 16621 T2477 oascc.ZkStateReader.createClusterStateWatchersAndUpdate Updating cluster state from ZooKeeper... 
[junit4:junit4]   2> 16623 T2506 C130 P60289 oasu.DirectUpdateHandler2.commit start commit{flags=0,_version_=0,optimize=false,openSearcher=true,waitSearcher=true,expungeDeletes=false,softCommit=false}
[junit4:junit4]   2> 16626 T2506 C130 P60289 oass.SolrIndexSearcher.<init> Opening Searcher@448c81ec main
[junit4:junit4]   2> 16627 T2506 C130 P60289 oasu.DirectUpdateHandler2.commit end_commit_flush
[junit4:junit4]   2> 16628 T2512 oasc.SolrCore.registerSearcher [collection1] Registered new searcher Searcher@448c81ec main{StandardDirectoryReader(segments_1:1)}
[junit4:junit4]   2> 16629 T2506 C130 P60289 oasu.SolrCmdDistributor.distribCommit Distrib commit to:[StdNode: http://127.0.0.1:60367/solr/collection1/, StdNode: http://127.0.0.1:60388/solr/collection1/, StdNode: http://127.0.0.1:60403/solr/collection1/]
[junit4:junit4]   2>  C129_STATE=coll:collection1 core:collection1 props:{shard=shard1, roles=null, state=active, core=collection1, collection=collection1, node_name=127.0.0.1:60367_solr, base_url=http://127.0.0.1:60367/solr}
[junit4:junit4]   2> 16636 T2515 C129 P60367 oasu.DirectUpdateHandler2.commit start commit{flags=0,_version_=0,optimize=false,openSearcher=true,waitSearcher=true,expungeDeletes=false,softCommit=false}
[junit4:junit4]   2>  C131_STATE=coll:collection1 core:collection1 props:{shard=shard1, roles=null, state=active, core=collection1, collection=collection1, node_name=127.0.0.1:60388_solr, base_url=http://127.0.0.1:60388/solr}
[junit4:junit4]   2> 16636 T2529 C131 P60388 oasu.DirectUpdateHandler2.commit start commit{flags=0,_version_=0,optimize=false,openSearcher=true,waitSearcher=true,expungeDeletes=false,softCommit=false}
[junit4:junit4]   2>  C132_STATE=coll:collection1 core:collection1 props:{shard=shard1, roles=null, state=active, core=collection1, collection=collection1, node_name=127.0.0.1:60403_solr, base_url=http://127.0.0.1:60403/solr}
[junit4:junit4]   2> 16639 T2543 C132 P60403 oasu.DirectUpdateHandler2.commit start commit{flags=0,_version_=0,optimize=false,openSearcher=true,waitSearcher=true,expungeDeletes=false,softCommit=false}
[junit4:junit4]   2> 16644 T2543 C132 P60403 oass.SolrIndexSearcher.<init> Opening Searcher@210253bd main
[junit4:junit4]   2> 16645 T2515 C129 P60367 oass.SolrIndexSearcher.<init> Opening Searcher@6e7f307b main
[junit4:junit4]   2> 16645 T2543 C132 P60403 oasu.DirectUpdateHandler2.commit end_commit_flush
[junit4:junit4]   2> 16645 T2515 C129 P60367 oasu.DirectUpdateHandler2.commit end_commit_flush
[junit4:junit4]   2> 16646 T2552 oasc.SolrCore.registerSearcher [collection1] Registered new searcher Searcher@210253bd main{StandardDirectoryReader(segments_2:2)}
[junit4:junit4]   2> 16647 T2524 oasc.SolrCore.registerSearcher [collection1] Registered new searcher Searcher@6e7f307b main{StandardDirectoryReader(segments_2:2)}
[junit4:junit4]   2> 16647 T2543 C132 P60403 /update {waitSearcher=true&commit=true&wt=javabin&commit_end_point=true&expungeDeletes=false&softCommit=false&version=2} {commit=} 0 8
[junit4:junit4]   2> 16645 T2529 C131 P60388 oass.SolrIndexSearcher.<init> Opening Searcher@1c135761 main
[junit4:junit4]   2> 16647 T2515 C129 P60367 /update {waitSearcher=true&commit=true&wt=javabin&commit_end_point=true&expungeDeletes=false&softCommit=false&version=2} {commit=} 0 11
[junit4:junit4]   2> 16648 T2529 C131 P60388 oasu.DirectUpdateHandler2.commit end_commit_flush
[junit4:junit4]   2> 16649 T2538 oasc.SolrCore.registerSearcher [collection1] Registered new searcher Searcher@1c135761 main{StandardDirectoryReader(segments_2:2)}
[junit4:junit4]   2> 16649 T2529 C131 P60388 /update {waitSearcher=true&commit=true&wt=javabin&commit_end_point=true&expungeDeletes=false&softCommit=false&version=2} {commit=} 0 13
[junit4:junit4]   2> 16650 T2506 C130 P60289 /update {waitSearcher=true&wt=javabin&commit=true&softCommit=false&version=2} {commit=} 0 27
[junit4:junit4]   2> 16651 T2477 oascc.ZkStateReader.updateClusterState Updating cloud state from ZooKeeper... 
[junit4:junit4]   2> 16653 T2505 C130 P60289 REQ /select {distrib=false&wt=javabin&q=*:*&version=2} hits=0 status=0 QTime=0 
[junit4:junit4]   2> 16655 T2516 C129 P60367 REQ /select {distrib=false&wt=javabin&q=*:*&version=2} hits=0 status=0 QTime=0 
[junit4:junit4]   2> 16656 T2530 C131 P60388 REQ /select {distrib=false&wt=javabin&q=*:*&version=2} hits=0 status=0 QTime=0 
[junit4:junit4]   2> 16658 T2544 C132 P60403 REQ /select {distrib=false&wt=javabin&q=*:*&version=2} hits=0 status=0 QTime=0 
[junit4:junit4]   2> 18664 T2489 C133 P60270 oass.SolrIndexSearcher.<init> Opening Searcher@6a90c122 realtime
[junit4:junit4]   2> 18664 T2489 C133 P60270 /update {wt=javabin&version=2} {deleteByQuery=*:* (-1413498810190004224)} 0 2
[junit4:junit4]   2> 18668 T2506 C130 P60289 oass.SolrIndexSearcher.<init> Opening Searcher@3e77f83b realtime
[junit4:junit4]   2> 18672 T2543 C132 P60403 oass.SolrIndexSearcher.<init> Opening Searcher@3bf1bfd4 realtime
[junit4:junit4]   2> 18672 T2515 C129 P60367 oass.SolrIndexSearcher.<init> Opening Searcher@aa55f26 realtime
[junit4:junit4]   2> 18672 T2529 C131 P60388 oass.SolrIndexSearcher.<init> Opening Searcher@6f09bd3f realtime
[junit4:junit4]   2> 18672 T2543 C132 P60403 REQ /update {update.distrib=FROMLEADER&_version_=-1413498810195247104&update.from=http://127.0.0.1:60289/solr/collection1/&wt=javabin&version=2} status=0 QTime=1 
[junit4:junit4]   2> 18673 T2515 C129 P60367 REQ /update {update.distrib=FROMLEADER&_version_=-1413498810195247104&update.from=http://127.0.0.1:60289/solr/collection1/&wt=javabin&version=2} status=0 QTime=2 
[junit4:junit4]   2> 18673 T2529 C131 P60388 REQ /update {update.distrib=FROMLEADER&_version_=-1413498810195247104&update.from=http://127.0.0.1:60289/solr/collection1/&wt=javabin&version=2} status=0 QTime=2 
[junit4:junit4]   2> 18674 T2506 C130 P60289 /update {wt=javabin&version=2} {deleteByQuery=*:* (-1413498810195247104)} 0 7
[junit4:junit4]   2> 18678 T2489 C133 P60270 /update {wt=javabin&version=2} {add=[0 (1413498810204684288)]} 0 2
[junit4:junit4]   2> 18687 T2543 C132 P60403 REQ /update {distrib.from=http://127.0.0.1:60289/solr/collection1/&update.distrib=FROMLEADER&wt=javabin&version=2} status=0 QTime=2 
[junit4:junit4]   2> 18687 T2529 C131 P60388 REQ /update {distrib.from=http://127.0.0.1:60289/solr/collection1/&update.distrib=FROMLEADER&wt=javabin&version=2} status=0 QTime=2 
[junit4:junit4]   2> 18687 T2515 C129 P60367 REQ /update {distrib.from=http://127.0.0.1:60289/solr/collection1/&update.distrib=FROMLEADER&wt=javabin&version=2} status=0 QTime=2 
[junit4:junit4]   2> 18688 T2506 C130 P60289 /update {wt=javabin&version=2} {add=[0 (1413498810209927168)]} 0 7
[junit4:junit4]   2> 18691 T2489 C133 P60270 /update {wt=javabin&version=2} {add=[1 (1413498810219364352)]} 0 1
[junit4:junit4]   2> 18697 T2515 C129 P60367 REQ /update {distrib.from=http://127.0.0.1:60289/solr/collection1/&update.distrib=FROMLEADER&wt=javabin&version=2} status=0 QTime=0 
[junit4:junit4]   2> 18697 T2529 C131 P60388 REQ /update {distrib.from=http://127.0.0.1:60289/solr/collection1/&update.distrib=FROMLEADER&wt=javabin&version=2} status=0 QTime=0 
[junit4:junit4]   2> 18697 T2543 C132 P60403 REQ /update {distrib.from=http://127.0.0.1:60289/solr/collection1/&update.distrib=FROMLEADER&wt=javabin&version=2} status=0 QTime=1 
[junit4:junit4]   2> 18697 T2506 C130 P60289 /update {wt=javabin&version=2} {add=[1 (1413498810222510080)]} 0 4
[junit4:junit4]   2> 18701 T2489 C133 P60270 /update {wt=javabin&version=2} {add=[2 (1413498810229850112)]} 0 1
[junit4:junit4]   2> 18707 T2543 C132 P60403 REQ /update {distrib.from=http://127.0.0.1:60289/solr/collection1/&update.distrib=FROMLEADER&test.distrib.skip.servers=http://127.0.0.1:60367/solr/collection1/&wt=javabin&version=2} status=0 QTime=1 
[junit4:junit4]   2> 18707 T2529 C131 P60388 REQ /update {distrib.from=http://127.0.0.1:60289/solr/collection1/&update.distrib=FROMLEADER&test.distrib.skip.servers=http://127.0.0.1:60367/solr/collection1/&wt=javabin&version=2} status=0 QTime=1 
[junit4:junit4]   2> 18707 T2506 C130 P60289 /update {test.distrib.skip.servers=http://127.0.0.1:60367/solr/collection1/&wt=javabin&version=2} {add=[2 (1413498810232995840)]} 0 4
[junit4:junit4]   2> 18710 T2489 C133 P60270 /update {wt=javabin&version=2} {add=[3 (1413498810240335872)]} 0 0
[junit4:junit4]   2> 18716 T2543 C132 P60403 REQ /update {distrib.from=http://127.0.0.1:60289/solr/collection1/&update.distrib=FROMLEADER&test.distrib.skip.servers=http://127.0.0.1:60367/solr/collection1/&test.distrib.skip.servers=http://127.0.0.1:60388/solr/collection1/&wt=javabin&version=2} status=0 QTime=0 
[junit4:junit4]   2> 18717 T2506 C130 P60289 /update {test.distrib.skip.servers=http://127.0.0.1:60367/solr/collection1/&test.distrib.skip.servers=http://127.0.0.1:60388/solr/collection1/&wt=javabin&version=2} {add=[3 (1413498810243481600)]} 0 4
[junit4:junit4]   2> 18720 T2489 C133 P60270 oasu.DirectUpdateHandler2.commit start commit{flags=0,_version_=0,optimize=false,openSearcher=true,waitSearcher=true,expungeDeletes=false,softCommit=false}
[junit4:junit4]   2> 18859 T2489 C133 P60270 oasc.SolrDeletionPolicy.onCommit SolrDeletionPolicy.onCommit: commits:num=2
[junit4:junit4]   2> 		commit{dir=NRTCachingDirectory(org.apache.lucene.store.NIOFSDirectory@/usr/home/hudson/hudson-slave/workspace/Lucene-Solr-Tests-4.x-java7/solr/build/solr-core/test/J1/org.apache.solr.cloud.SyncSliceTest-1348017492891/control/data/index lockFactory=org.apache.lucene.store.NativeFSLockFactory@23767cf5; maxCacheMB=48.0 maxMergeSizeMB=4.0),segFN=segments_1,generation=1,filenames=[segments_1]
[junit4:junit4]   2> 		commit{dir=NRTCachingDirectory(org.apache.lucene.store.NIOFSDirectory@/usr/home/hudson/hudson-slave/workspace/Lucene-Solr-Tests-4.x-java7/solr/build/solr-core/test/J1/org.apache.solr.cloud.SyncSliceTest-1348017492891/control/data/index lockFactory=org.apache.lucene.store.NativeFSLockFactory@23767cf5; maxCacheMB=48.0 maxMergeSizeMB=4.0),segFN=segments_2,generation=2,filenames=[_0_TestBloomFilteredLucene40Postings_0.tim, _0_Block_0.pos, _0_Block_0.tip, _0_TestBloomFilteredLucene40Postings_0.blm, _0_TestBloomFilteredLucene40Postings_0.tip, _0.fnm, _0_Block_0.doc, _0_Pulsing40_0.tim, _0_Block_0.tim, _0_Memory_0.ram, _0_TestBloomFilteredLucene40Postings_0.prx, _0_nrm.cfs, _0_Pulsing40_0.prx, _0_Pulsing40_0.frq, _0_nrm.cfe, _0_Pulsing40_0.tip, segments_2, _0_TestBloomFilteredLucene40Postings_0.frq, _0.fdx, _0.si, _0.fdt]
[junit4:junit4]   2> 18860 T2489 C133 P60270 oasc.SolrDeletionPolicy.updateCommits newest commit = 2
[junit4:junit4]   2> 18870 T2489 C133 P60270 oass.SolrIndexSearcher.<init> Opening Searcher@2d4285b1 main
[junit4:junit4]   2> 18870 T2489 C133 P60270 oasu.DirectUpdateHandler2.commit end_commit_flush
[junit4:junit4]   2> 18872 T2500 oasc.SolrCore.registerSearcher [collection1] Registered new searcher Searcher@2d4285b1 main{StandardDirectoryReader(segments_2:3:nrt _0(4.0.0.2):C4)}
[junit4:junit4]   2> 18872 T2489 C133 P60270 /update {waitSearcher=true&wt=javabin&commit=true&softCommit=false&version=2} {commit=} 0 152
[junit4:junit4]   2> 18875 T2506 C130 P60289 oasu.DirectUpdateHandler2.commit start commit{flags=0,_version_=0,optimize=false,openSearcher=true,waitSearcher=true,expungeDeletes=false,softCommit=false}
[junit4:junit4]   2> 19010 T2506 C130 P60289 oasc.SolrDeletionPolicy.onCommit SolrDeletionPolicy.onCommit: commits:num=2
[junit4:junit4]   2> 		commit{dir=NRTCachingDirectory(org.apache.lucene.store.NIOFSDirectory@/usr/home/hudson/hudson-slave/workspace/Lucene-Solr-Tests-4.x-java7/solr/build/solr-core/test/J1/org.apache.solr.cloud.SyncSliceTest-1348017492891/jetty1/index lockFactory=org.apache.lucene.store.NativeFSLockFactory@43a28d7e; maxCacheMB=48.0 maxMergeSizeMB=4.0),segFN=segments_1,generation=1,filenames=[segments_1]
[junit4:junit4]   2> 		commit{dir=NRTCachingDirectory(org.apache.lucene.store.NIOFSDirectory@/usr/home/hudson/hudson-slave/workspace/Lucene-Solr-Tests-4.x-java7/solr/build/solr-core/test/J1/org.apache.solr.cloud.SyncSliceTest-1348017492891/jetty1/index lockFactory=org.apache.lucene.store.NativeFSLockFactory@43a28d7e; maxCacheMB=48.0 maxMergeSizeMB=4.0),segFN=segments_2,generation=2,filenames=[_0_TestBloomFilteredLucene40Postings_0.tim, _0_Block_0.pos, _0_Block_0.tip, _0_TestBloomFilteredLucene40Postings_0.blm, _0_TestBloomFilteredLucene40Postings_0.tip, _0.fnm, _0_Block_0.doc, _0_Pulsing40_0.tim, _0_Block_0.tim, _0_Memory_0.ram, _0_TestBloomFilteredLucene40Postings_0.prx, _0_nrm.cfs, _0_Pulsing40_0.prx, _0_Pulsing40_0.frq, _0_nrm.cfe, _0_Pulsing40_0.tip, segments_2, _0_TestBloomFilteredLucene40Postings_0.frq, _0.fdx, _0.si, _0.fdt]
[junit4:junit4]   2> 19011 T2506 C130 P60289 oasc.SolrDeletionPolicy.updateCommits newest commit = 2
[junit4:junit4]   2> 19016 T2506 C130 P60289 oass.SolrIndexSearcher.<init> Opening Searcher@527cf29 main
[junit4:junit4]   2> 19017 T2506 C130 P60289 oasu.DirectUpdateHandler2.commit end_commit_flush
[junit4:junit4]   2> 19018 T2512 oasc.SolrCore.registerSearcher [collection1] Registered new searcher Searcher@527cf29 main{StandardDirectoryReader(segments_2:3:nrt _0(4.0.0.2):C4)}
[junit4:junit4]   2> 19018 T2506 C130 P60289 oasu.SolrCmdDistributor.distribCommit Distrib commit to:[StdNode: http://127.0.0.1:60367/solr/collection1/, StdNode: http://127.0.0.1:60388/solr/collection1/, StdNode: http://127.0.0.1:60403/solr/collection1/]
[junit4:junit4]   2> 19021 T2543 C132 P60403 oasu.DirectUpdateHandler2.commit start commit{flags=0,_version_=0,optimize=false,openSearcher=true,waitSearcher=true,expungeDeletes=false,softCommit=false}
[junit4:junit4]   2> 19021 T2529 C131 P60388 oasu.DirectUpdateHandler2.commit start commit{flags=0,_version_=0,optimize=false,openSearcher=true,waitSearcher=true,expungeDeletes=false,softCommit=false}
[junit4:junit4]   2> 19021 T2515 C129 P60367 oasu.DirectUpdateHandler2.commit start commit{flags=0,_version_=0,optimize=false,openSearcher=true,waitSearcher=true,expungeDeletes=false,softCommit=false}
[junit4:junit4]   2> 19142 T2515 C129 P60367 oasc.SolrDeletionPolicy.onCommit SolrDeletionPolicy.onCommit: commits:num=2
[junit4:junit4]   2> 		commit{dir=NRTCachingDirectory(org.apache.lucene.store.NIOFSDirectory@/usr/home/hudson/hudson-slave/workspace/Lucene-Solr-Tests-4.x-java7/solr/build/solr-core/test/J1/org.apache.solr.cloud.SyncSliceTest-1348017492891/jetty2/index lockFactory=org.apache.lucene.store.NativeFSLockFactory@3e0abb1f; maxCacheMB=48.0 maxMergeSizeMB=4.0),segFN=segments_2,generation=2,filenames=[segments_2]
[junit4:junit4]   2> 		commit{dir=NRTCachingDirectory(org.apache.lucene.store.NIOFSDirectory@/usr/home/hudson/hudson-slave/workspace/Lucene-Solr-Tests-4.x-java7/solr/build/solr-core/test/J1/org.apache.solr.cloud.SyncSliceTest-1348017492891/jetty2/index lockFactory=org.apache.lucene.store.NativeFSLockFactory@3e0abb1f; maxCacheMB=48.0 maxMergeSizeMB=4.0),segFN=segments_3,generation=3,filenames=[_0_TestBloomFilteredLucene40Postings_0.tim, _0_Block_0.pos, _0_Block_0.tip, _0_TestBloomFilteredLucene40Postings_0.blm, _0_TestBloomFilteredLucene40Postings_0.tip, _0.fnm, _0_Block_0.doc, _0_Pulsing40_0.tim, _0_Block_0.tim, _0_Memory_0.ram, _0_TestBloomFilteredLucene40Postings_0.prx, _0_nrm.cfs, _0_Pulsing40_0.prx, _0_Pulsing40_0.frq, _0_nrm.cfe, _0_Pulsing40_0.tip, _0_TestBloomFilteredLucene40Postings_0.frq, _0.fdx, _0.si, _0.fdt, segments_3]
[junit4:junit4]   2> 19142 T2543 C132 P60403 oasc.SolrDeletionPolicy.onCommit SolrDeletionPolicy.onCommit: commits:num=2
[junit4:junit4]   2> 		commit{dir=NRTCachingDirectory(org.apache.lucene.store.NIOFSDirectory@/usr/home/hudson/hudson-slave/workspace/Lucene-Solr-Tests-4.x-java7/solr/build/solr-core/test/J1/org.apache.solr.cloud.SyncSliceTest-1348017492891/jetty4/index lockFactory=org.apache.lucene.store.NativeFSLockFactory@38827c2a; maxCacheMB=48.0 maxMergeSizeMB=4.0),segFN=segments_2,generation=2,filenames=[segments_2]
[junit4:junit4]   2> 		commit{dir=NRTCachingDirectory(org.apache.lucene.store.NIOFSDirectory@/usr/home/hudson/hudson-slave/workspace/Lucene-Solr-Tests-4.x-java7/solr/build/solr-core/test/J1/org.apache.solr.cloud.SyncSliceTest-1348017492891/jetty4/index lockFactory=org.apache.lucene.store.NativeFSLockFactory@38827c2a; maxCacheMB=48.0 maxMergeSizeMB=4.0),segFN=segments_3,generation=3,filenames=[_0_TestBloomFilteredLucene40Postings_0.tim, _0_Block_0.pos, _0_Block_0.tip, _0_TestBloomFilteredLucene40Postings_0.blm, _0_TestBloomFilteredLucene40Postings_0.tip, _0.fnm, _0_Block_0.doc, _0_Pulsing40_0.tim, _0_Block_0.tim, _0_Memory_0.ram, _0_TestBloomFilteredLucene40Postings_0.prx, _0_nrm.cfs, _0_Pulsing40_0.prx, _0_Pulsing40_0.frq, _0_nrm.cfe, _0_Pulsing40_0.tip, _0_TestBloomFilteredLucene40Postings_0.frq, _0.fdx, _0.si, _0.fdt, segments_3]
[junit4:junit4]   2> 19142 T2529 C131 P60388 oasc.SolrDeletionPolicy.onCommit SolrDeletionPolicy.onCommit: commits:num=2
[junit4:junit4]   2> 		commit{dir=NRTCachingDirectory(org.apache.lucene.store.NIOFSDirectory@/usr/home/hudson/hudson-slave/workspace/Lucene-Solr-Tests-4.x-java7/solr/build/solr-core/test/J1/org.apache.solr.cloud.SyncSliceTest-1348017492891/jetty3/index lockFactory=org.apache.lucene.store.NativeFSLockFactory@6b2a49d9; maxCacheMB=48.0 maxMergeSizeMB=4.0),segFN=segments_2,generation=2,filenames=[segments_2]
[junit4:junit4]   2> 		commit{dir=NRTCachingDirectory(org.apache.lucene.store.NIOFSDirectory@/usr/home/hudson/hudson-slave/workspace/Lucene-Solr-Tests-4.x-java7/solr/build/solr-core/test/J1/org.apache.solr.cloud.SyncSliceTest-1348017492891/jetty3/index lockFactory=org.apache.lucene.store.NativeFSLockFactory@6b2a49d9; maxCacheMB=48.0 maxMergeSizeMB=4.0),segFN=segments_3,generation=3,filenames=[_0_TestBloomFilteredLucene40Postings_0.tim, _0_Block_0.pos, _0_Block_0.tip, _0_TestBloomFilteredLucene40Postings_0.blm, _0_TestBloomFilteredLucene40Postings_0.tip, _0.fnm, _0_Block_0.doc, _0_Pulsing40_0.tim, _0_Block_0.tim, _0_Memory_0.ram, _0_TestBloomFilteredLucene40Postings_0.prx, _0_nrm.cfs, _0_Pulsing40_0.prx, _0_Pulsing40_0.frq, _0_nrm.cfe, _0_Pulsing40_0.tip, _0_TestBloomFilteredLucene40Postings_0.frq, _0.fdx, _0.si, _0.fdt, segments_3]
[junit4:junit4]   2> 19144 T2543 C132 P60403 oasc.SolrDeletionPolicy.updateCommits newest commit = 3
[junit4:junit4]   2> 19145 T2529 C131 P60388 oasc.SolrDeletionPolicy.updateCommits newest commit = 3
[junit4:junit4]   2> 19143 T2515 C129 P60367 oasc.SolrDeletionPolicy.updateCommits newest commit = 3
[junit4:junit4]   2> 19155 T2529 C131 P60388 oass.SolrIndexSearcher.<init> Opening Searcher@283f842d main
[junit4:junit4]   2> 19155 T2529 C131 P60388 oasu.DirectUpdateHandler2.commit end_commit_flush
[junit4:junit4]   2> 19156 T2538 oasc.SolrCore.registerSearcher [collection1] Registered new searcher Searcher@283f842d main{StandardDirectoryReader(segments_3:4:nrt _0(4.0.0.2):C3)}
[junit4:junit4]   2> 19157 T2529 C131 P60388 /update {waitSearcher=true&commit=true&wt=javabin&commit_end_point=true&expungeDeletes=false&softCommit=false&version=2} {commit=} 0 136
[junit4:junit4]   2> 19157 T2515 C129 P60367 oass.SolrIndexSearcher.<init> Opening Searcher@4539aa6f main
[junit4:junit4]   2> 19157 T2543 C132 P60403 oass.SolrIndexSearcher.<init> Opening Searcher@160ba1d7 main
[junit4:junit4]   2> 19158 T2515 C129 P60367 oasu.DirectUpdateHandler2.commit end_commit_flush
[junit4:junit4]   2> 19158 T2543 C132 P60403 oasu.DirectUpdateHandler2.commit end_commit_flush
[junit4:junit4]   2> 19158 T2524 oasc.JmxMonitoredMap.put WARNING Failed to register info bean: searcher javax.management.InstanceAlreadyExistsException: solr/collection1:type=searcher,id=org.apache.solr.search.SolrIndexSearcher
[junit4:junit4]   2> 	at com.sun.jmx.mbeanserver.Repository.addMBean(Repository.java:437)
[junit4:junit4]   2> 	at com.sun.jmx.interceptor.DefaultMBeanServerInterceptor.registerWithRepository(DefaultMBeanServerInterceptor.java:1898)
[junit4:junit4]   2> 	at com.sun.jmx.interceptor.DefaultMBeanServerInterceptor.registerDynamicMBean(DefaultMBeanServerInterceptor.java:966)
[junit4:junit4]   2> 	at com.sun.jmx.interceptor.DefaultMBeanServerInterceptor.registerObject(DefaultMBeanServerInterceptor.java:900)
[junit4:junit4]   2> 	at com.sun.jmx.interceptor.DefaultMBeanServerInterceptor.registerMBean(DefaultMBeanServerInterceptor.java:324)
[junit4:junit4]   2> 	at com.sun.jmx.mbeanserver.JmxMBeanServer.registerMBean(JmxMBeanServer.java:512)
[junit4:junit4]   2> 	at org.apache.solr.core.JmxMonitoredMap.put(JmxMonitoredMap.java:140)
[junit4:junit4]   2> 	at org.apache.solr.core.JmxMonitoredMap.put(JmxMonitoredMap.java:51)
[junit4:junit4]   2> 	at org.apache.solr.search.SolrIndexSearcher.register(SolrIndexSearcher.java:242)
[junit4:junit4]   2> 	at org.apache.solr.core.SolrCore.registerSearcher(SolrCore.java:1642)
[junit4:junit4]   2> 	at org.apache.solr.core.SolrCore.access$000(SolrCore.java:121)
[junit4:junit4]   2> 	at org.apache.solr.core.SolrCore$7.call(SolrCore.java:1519)
[junit4:junit4]   2> 	at java.util.concurrent.FutureTask$Sync.innerRun(FutureTask.java:334)
[junit4:junit4]   2> 	at java.util.concurrent.FutureTask.run(FutureTask.java:166)
[junit4:junit4]   2> 	at java.util.concurrent.ThreadPoolExecutor.runWorker(ThreadPoolExecutor.java:1110)
[junit4:junit4]   2> 	at java.util.concurrent.ThreadPoolExecutor$Worker.run(ThreadPoolExecutor.java:603)
[junit4:junit4]   2> 	at java.lang.Thread.run(Thread.java:722)
[junit4:junit4]   2> 
[junit4:junit4]   2> 19159 T2552 oasc.SolrCore.registerSearcher [collection1] Registered new searcher Searcher@160ba1d7 main{StandardDirectoryReader(segments_3:4:nrt _0(4.0.0.2):C4)}
[junit4:junit4]   2> 19160 T2543 C132 P60403 /update {waitSearcher=true&commit=true&wt=javabin&commit_end_point=true&expungeDeletes=false&softCommit=false&version=2} {commit=} 0 139
[junit4:junit4]   2> 19161 T2524 oasc.SolrCore.registerSearcher [collection1] Registered new searcher Searcher@4539aa6f main{StandardDirectoryReader(segments_3:4:nrt _0(4.0.0.2):C2)}
[junit4:junit4]   2> 19162 T2515 C129 P60367 /update {waitSearcher=true&commit=true&wt=javabin&commit_end_point=true&expungeDeletes=false&softCommit=false&version=2} {commit=} 0 141
[junit4:junit4]   2> 19163 T2506 C130 P60289 /update {waitSearcher=true&wt=javabin&commit=true&softCommit=false&version=2} {commit=} 0 288
[junit4:junit4]   2> 19163 T2477 oasc.AbstractDistribZkTestBase.waitForRecoveriesToFinish Wait for recoveries to finish - collection: collection1 failOnTimeout:true timeout (sec):1800
[junit4:junit4]   2> 19164 T2477 oascc.ZkStateReader.updateClusterState Updating cloud state from ZooKeeper... 
[junit4:junit4]   2> check const of shard1
[junit4:junit4]   2> client0
[junit4:junit4]   2> PROPS:127.0.0.1:60289_solr_collection1:{"shard":"shard1","roles":null,"state":"active","core":"collection1","collection":"collection1","node_name":"127.0.0.1:60289_solr","base_url":"http://127.0.0.1:60289/solr","leader":"true"}
[junit4:junit4]   2> 19167 T2505 C130 P60289 REQ /select {distrib=false&wt=javabin&q=*:*&version=2} hits=4 status=0 QTime=0 
[junit4:junit4]   2>  live:true
[junit4:junit4]   2>  num:4
[junit4:junit4]   2> 
[junit4:junit4]   2> client1
[junit4:junit4]   2> PROPS:127.0.0.1:60367_solr_collection1:{"shard":"shard1","roles":null,"state":"active","core":"collection1","collection":"collection1","node_name":"127.0.0.1:60367_solr","base_url":"http://127.0.0.1:60367/solr"}
[junit4:junit4]   2> 19171 T2516 C129 P60367 REQ /select {distrib=false&wt=javabin&q=*:*&version=2} hits=2 status=0 QTime=0 
[junit4:junit4]   2>  live:true
[junit4:junit4]   2>  num:2
[junit4:junit4]   2> 
[junit4:junit4]   2> ######shard1 is not consistent.  Got 4 from http://127.0.0.1:60289/solr/collection1lastClient and got 2 from http://127.0.0.1:60367/solr/collection1
[junit4:junit4]   2> 19175 T2505 C130 P60289 REQ /select {fl=id,_version_&sort=id+asc&q=*:*&distrib=false&wt=javabin&rows=1000&version=2} hits=4 status=0 QTime=0 
[junit4:junit4]   2> 19178 T2516 C129 P60367 REQ /select {fl=id,_version_&sort=id+asc&q=*:*&distrib=false&wt=javabin&rows=1000&version=2} hits=2 status=0 QTime=0 
[junit4:junit4]   2> ######http://127.0.0.1:60289/solr/collection1: {numFound=4,start=0,docs=[SolrDocument{id=0, _version_=1413498810209927168}, SolrDocument{id=1, _version_=1413498810222510080}, SolrDocument{id=2, _version_=1413498810232995840}, SolrDocument{id=3, _version_=1413498810243481600}]}
[junit4:junit4]   2> ######http://127.0.0.1:60367/solr/collection1: {numFound=2,start=0,docs=[SolrDocument{id=0, _version_=1413498810209927168}, SolrDocument{id=1, _version_=1413498810222510080}]}
[junit4:junit4]   2> ###### sizes=4,2
[junit4:junit4]   2> ###### Only in http://127.0.0.1:60289/solr/collection1: [{id=2, _version_=1413498810232995840}, {id=3, _version_=1413498810243481600}]
[junit4:junit4]   2> client2
[junit4:junit4]   2> PROPS:127.0.0.1:60388_solr_collection1:{"shard":"shard1","roles":null,"state":"active","core":"collection1","collection":"collection1","node_name":"127.0.0.1:60388_solr","base_url":"http://127.0.0.1:60388/solr"}
[junit4:junit4]   2> 19182 T2530 C131 P60388 REQ /select {distrib=false&wt=javabin&q=*:*&version=2} hits=3 status=0 QTime=0 
[junit4:junit4]   2>  live:true
[junit4:junit4]   2>  num:3
[junit4:junit4]   2> 
[junit4:junit4]   2> client3
[junit4:junit4]   2> PROPS:127.0.0.1:60403_solr_collection1:{"shard":"shard1","roles":null,"state":"active","core":"collection1","collection":"collection1","node_name":"127.0.0.1:60403_solr","base_url":"http://127.0.0.1:60403/solr"}
[junit4:junit4]   2> 19186 T2544 C132 P60403 REQ /select {distrib=false&wt=javabin&q=*:*&version=2} hits=4 status=0 QTime=0 
[junit4:junit4]   2>  live:true
[junit4:junit4]   2>  num:4
[junit4:junit4]   2> 
[junit4:junit4]   2> 19188 T2477 oascsi.HttpClientUtil.createClient Creating new http client, config:maxConnections=128&maxConnectionsPerHost=32&followRedirects=false
[junit4:junit4]   2> 19199 T2531 oasha.CollectionsHandler.handleSyncShardAction Syncing shard : action=SYNCSHARD&collection=collection1&shard=shard1&wt=javabin&version=2
[junit4:junit4]   2> 19199 T2531 oascsi.HttpClientUtil.createClient Creating new http client, config:maxConnections=128&maxConnectionsPerHost=32&followRedirects=false
[junit4:junit4]   2> 19206 T2509 oasha.CoreAdminHandler.handleRequestSyncAction I have been requested to sync up my shard
[junit4:junit4]   2> 19206 T2509 oasc.SyncStrategy.sync Sync replicas to http://127.0.0.1:60289/solr/collection1/
[junit4:junit4]   2> 19207 T2509 oasu.PeerSync.sync PeerSync: core=collection1 url=http://127.0.0.1:60289/solr START replicas=[http://127.0.0.1:60367/solr/collection1/, http://127.0.0.1:60388/solr/collection1/, http://127.0.0.1:60403/solr/collection1/] nUpdates=100
[junit4:junit4]   2> 19208 T2532 C131 P60388 REQ /get {distrib=false&qt=/get&wt=javabin&version=2&getVersions=100} status=0 QTime=0 
[junit4:junit4]   2> 19209 T2517 C129 P60367 REQ /get {distrib=false&qt=/get&wt=javabin&version=2&getVersions=100} status=0 QTime=1 
[junit4:junit4]   2> 19209 T2509 oasu.PeerSync.handleVersions PeerSync: core=collection1 url=http://127.0.0.1:60289/solr  Received 4 versions from 127.0.0.1:60388/solr/collection1/
[junit4:junit4]   2> 19209 T2545 C132 P60403 REQ /get {distrib=false&qt=/get&wt=javabin&version=2&getVersions=100} status=0 QTime=0 
[junit4:junit4]   2> 19209 T2509 oasu.PeerSync.handleVersions PeerSync: core=collection1 url=http://127.0.0.1:60289/solr  Our versions are newer. ourLowThreshold=1413498810195247104 otherHigh=1413498810232995840
[junit4:junit4]   2> 19210 T2509 oasu.PeerSync.handleVersions PeerSync: core=collection1 url=http://127.0.0.1:60289/solr  Received 3 versions from 127.0.0.1:60367/solr/collection1/
[junit4:junit4]   2> 19210 T2509 oasu.PeerSync.handleVersions PeerSync: core=collection1 url=http://127.0.0.1:60289/solr  Our versions are newer. ourLowThreshold=1413498810195247104 otherHigh=1413498810222510080
[junit4:junit4]   2> 19210 T2509 oasu.PeerSync.handleVersions PeerSync: core=collection1 url=http://127.0.0.1:60289/solr  Received 5 versions from 127.0.0.1:60403/solr/collection1/
[junit4:junit4]   2> 19211 T2509 oasu.PeerSync.handleVersions PeerSync: core=collection1 url=http://127.0.0.1:60289/solr  Our versions are newer. ourLowThreshold=1413498810195247104 otherHigh=1413498810232995840
[junit4:junit4]   2> 19211 T2509 oasu.PeerSync.sync PeerSync: core=collection1 url=http://127.0.0.1:60289/solr DONE. sync succeeded
[junit4:junit4]   2> 19211 T2509 oasc.SyncStrategy.syncReplicas Sync Success - now sync replicas to me
[junit4:junit4]   2> 19211 T2509 oasc.SyncStrategy.syncToMe http://127.0.0.1:60289/solr/collection1/: try and ask http://127.0.0.1:60367/solr/collection1/ to sync
[junit4:junit4]   2> 19212 T2509 oasc.SyncStrategy.syncToMe http://127.0.0.1:60289/solr/collection1/: try and ask http://127.0.0.1:60388/solr/collection1/ to sync
[junit4:junit4]   2> 19212 T2509 oasc.SyncStrategy.syncToMe http://127.0.0.1:60289/solr/collection1/: try and ask http://127.0.0.1:60403/solr/collection1/ to sync
[junit4:junit4]   2> 19215 T2518 C129 P60367 oasu.PeerSync.sync PeerSync: core=collection1 url=http://127.0.0.1:60367/solr START replicas=[http://127.0.0.1:60289/solr/collection1/] nUpdates=100
[junit4:junit4]   2> 19215 T2533 C131 P60388 oasu.PeerSync.sync PeerSync: core=collection1 url=http://127.0.0.1:60388/solr START replicas=[http://127.0.0.1:60289/solr/collection1/] nUpdates=100
[junit4:junit4]   2> 19216 T2546 C132 P60403 oasu.PeerSync.sync PeerSync: core=collection1 url=http://127.0.0.1:60403/solr START replicas=[http://127.0.0.1:60289/solr/collection1/] nUpdates=100
[junit4:junit4]   2> 19216 T2508 C130 P60289 REQ /get {distrib=false&qt=/get&wt=javabin&version=2&getVersions=100} status=0 QTime=0 
[junit4:junit4]   2> 19217 T2503 C130 P60289 REQ /get {distrib=false&qt=/get&wt=javabin&version=2&getVersions=100} status=0 QTime=0 
[junit4:junit4]   2> 19217 T2518 C129 P60367 oasu.PeerSync.handleVersions PeerSync: core=collection1 url=http://127.0.0.1:60367/solr  Received 5 versions from 127.0.0.1:60289/solr/collection1/
[junit4:junit4]   2> 19217 T2533 C131 P60388 oasu.PeerSync.handleVersions PeerSync: core=collection1 url=http://127.0.0.1:60388/solr  Received 5 versions from 127.0.0.1:60289/solr/collection1/
[junit4:junit4]   2> 19218 T2504 C130 P60289 REQ /get {distrib=false&qt=/get&wt=javabin&version=2&getVersions=100} status=0 QTime=0 
[junit4:junit4]   2> 19218 T2518 C129 P60367 oasu.PeerSync.requestUpdates PeerSync: core=collection1 url=http://127.0.0.1:60367/solr Requesting updates from 127.0.0.1:60289/solr/collection1/n=2 versions=[1413498810243481600, 1413498810232995840]
[junit4:junit4]   2> 19218 T2533 C131 P60388 oasu.PeerSync.requestUpdates PeerSync: core=collection1 url=http://127.0.0.1:60388/solr Requesting updates from 127.0.0.1:60289/solr/collection1/n=1 versions=[1413498810243481600]
[junit4:junit4]   2> 19219 T2546 C132 P60403 oasu.PeerSync.handleVersions PeerSync: core=collection1 url=http://127.0.0.1:60403/solr  Received 5 versions from 127.0.0.1:60289/solr/collection1/
[junit4:junit4]   2> 19219 T2546 C132 P60403 oasu.PeerSync.handleVersions PeerSync: core=collection1 url=http://127.0.0.1:60403/solr  Our versions are newer. ourLowThreshold=1413498810195247104 otherHigh=1413498810232995840
[junit4:junit4]   2> 19220 T2546 C132 P60403 oasu.PeerSync.sync PeerSync: core=collection1 url=http://127.0.0.1:60403/solr DONE. sync succeeded
[junit4:junit4]   2> 19220 T2546 C132 P60403 REQ /get {sync=http://127.0.0.1:60289/solr/collection1/&getVersions=100&distrib=false&qt=/get&wt=javabin&version=2} status=0 QTime=4 
[junit4:junit4]   2> 19221 T2504 C130 P60289 REQ /get {distrib=false&getUpdates=1413498810243481600,1413498810232995840&qt=/get&wt=javabin&version=2} status=0 QTime=0 
[junit4:junit4]   2> 19221 T2509 oasc.SyncStrategy.syncToMe http://127.0.0.1:60289/solr/collection1/:  sync completed with http://127.0.0.1:60403/solr/collection1/
[junit4:junit4]   2> 19221 T2508 C130 P60289 REQ /get {distrib=false&getUpdates=1413498810243481600&qt=/get&wt=javabin&version=2} status=0 QTime=0 
[junit4:junit4]   2> 19226 T2533 C131 P60388 oasu.PeerSync.sync PeerSync: core=collection1 url=http://127.0.0.1:60388/solr DONE. sync succeeded
[junit4:junit4]   2> 19227 T2533 C131 P60388 REQ /get {sync=http://127.0.0.1:60289/solr/collection1/&getVersions=100&distrib=false&qt=/get&wt=javabin&version=2} status=0 QTime=12 
[junit4:junit4]   2> 19227 T2509 oasc.SyncStrategy.syncToMe http://127.0.0.1:60289/solr/collection1/:  sync completed with http://127.0.0.1:60388/solr/collection1/
[junit4:junit4]   2> 19227 T2518 C129 P60367 oasu.PeerSync.sync PeerSync: core=collection1 url=http://127.0.0.1:60367/solr DONE. sync succeeded
[junit4:junit4]   2> 19228 T2518 C129 P60367 REQ /get {sync=http://127.0.0.1:60289/solr/collection1/&getVersions=100&distrib=false&qt=/get&wt=javabin&version=2} status=0 QTime=14 
[junit4:junit4]   2> 19228 T2509 oasc.SyncStrategy.syncToMe http://127.0.0.1:60289/solr/collection1/:  sync completed with http://127.0.0.1:60367/solr/collection1/
[junit4:junit4]   2> 19229 T2477 oasc.AbstractFullDistribZkTestBase.waitForThingsToLevelOut Wait for recoveries to finish - wait 15 for each attempt
[junit4:junit4]   2> 19230 T2477 oasc.AbstractDistribZkTestBase.waitForRecoveriesToFinish Wait for recoveries to finish - collection: collection1 failOnTimeout:true timeout (sec):15
[junit4:junit4]   2> 19230 T2477 oascc.ZkStateReader.updateClusterState Updating cloud state from ZooKeeper... 
[junit4:junit4]   2> 19233 T2489 C133 P60270 oasu.DirectUpdateHandler2.commit start commit{flags=0,_version_=0,optimize=false,openSearcher=true,waitSearcher=true,expungeDeletes=false,softCommit=false}
[junit4:junit4]   2> 19234 T2489 C133 P60270 oass.SolrIndexSearcher.<init> Opening Searcher@2ab2af2b main
[junit4:junit4]   2> 19235 T2489 C133 P60270 oasu.DirectUpdateHandler2.commit end_commit_flush
[junit4:junit4]   2> 19236 T2500 oasc.SolrCore.registerSearcher [collection1] Registered new searcher Searcher@2ab2af2b main{StandardDirectoryReader(segments_2:3:nrt _0(4.0.0.2):C4)}
[junit4:junit4]   2> 19237 T2489 C133 P60270 /update {waitSearcher=true&wt=javabin&commit=true&softCommit=false&version=2} {commit=} 0 4
[junit4:junit4]   2> 19240 T2506 C130 P60289 oasu.DirectUpdateHandler2.commit start commit{flags=0,_version_=0,optimize=false,openSearcher=true,waitSearcher=true,expungeDeletes=false,softCommit=false}
[junit4:junit4]   2> 19242 T2506 C130 P60289 oass.SolrIndexSearcher.<init> Opening Searcher@517671c6 main
[junit4:junit4]   2> 19242 T2506 C130 P60289 oasu.DirectUpdateHandler2.commit end_commit_flush
[junit4:junit4]   2> 19244 T2512 oasc.SolrCore.registerSearcher [collection1] Registered new searcher Searcher@517671c6 main{StandardDirectoryReader(segments_2:3:nrt _0(4.0.0.2):C4)}
[junit4:junit4]   2> 19244 T2506 C130 P60289 oasu.SolrCmdDistributor.distribCommit Distrib commit to:[StdNode: http://127.0.0.1:60367/solr/collection1/, StdNode: http://127.0.0.1:60388/solr/collection1/, StdNode: http://127.0.0.1:60403/solr/collection1/]
[junit4:junit4]   2> 19247 T2529 C131 P60388 oasu.DirectUpdateHandler2.commit start commit{flags=0,_version_=0,optimize=false,openSearcher=true,waitSearcher=true,expungeDeletes=false,softCommit=false}
[junit4:junit4]   2> 19247 T2515 C129 P60367 oasu.DirectUpdateHandler2.commit start commit{flags=0,_version_=0,optimize=false,openSearcher=true,waitSearcher=true,expungeDeletes=false,softCommit=false}
[junit4:junit4]   2> 19247 T2543 C132 P60403 oasu.DirectUpdateHandler2.commit start commit{flags=0,_version_=0,optimize=false,openSearcher=true,waitSearcher=true,expungeDeletes=false,softCommit=false}
[junit4:junit4]   2> 19249 T2543 C132 P60403 oass.SolrIndexSearcher.<init> Opening Searcher@2ebe966 main
[junit4:junit4]   2> 19250 T2543 C132 P60403 oasu.DirectUpdateHandler2.commit end_commit_flush
[junit4:junit4]   2> 19251 T2552 oasc.SolrCore.registerSearcher [collection1] Registered new searcher Searcher@2ebe966 main{StandardDirectoryReader(segments_3:4:nrt _0(4.0.0.2):C4)}
[junit4:junit4]   2> 19251 T2543 C132 P60403 /update {waitSearcher=true&commit=true&wt=javabin&commit_end_point=true&expungeDeletes=false&softCommit=false&version=2} {commit=} 0 4
[junit4:junit4]   2> 19429 T2529 C131 P60388 oasc.SolrDeletionPolicy.onCommit SolrDeletionPolicy.onCommit: commits:num=2
[junit4:junit4]   2> 		commit{dir=NRTCachingDirectory(org.apache.lucene.store.NIOFSDirectory@/usr/home/hudson/hudson-slave/workspace/Lucene-Solr-Tests-4.x-java7/solr/build/solr-core/test/J1/org.apache.solr.cloud.SyncSliceTest-1348017492891/jetty3/index lockFactory=org.apache.lucene.store.NativeFSLockFactory@6b2a49d9; maxCacheMB=48.0 maxMergeSizeMB=4.0),segFN=segments_3,generation=3,filenames=[_0_TestBloomFilteredLucene40Postings_0.tim, _0_Block_0.pos, _0_Block_0.tip, _0_TestBloomFilteredLucene40Postings_0.blm, _0_TestBloomFilteredLucene40Postings_0.tip, _0.fnm, _0_Block_0.doc, _0_Pulsing40_0.tim, _0_Block_0.tim, _0_Memory_0.ram, _0_TestBloomFilteredLucene40Postings_0.prx, _0_nrm.cfs, _0_Pulsing40_0.prx, _0_Pulsing40_0.frq, _0_nrm.cfe, _0_Pulsing40_0.tip, _0_TestBloomFilteredLucene40Postings_0.frq, _0.fdx, _0.si, _0.fdt, segments_3]
[junit4:junit4]   2> 		commit{dir=NRTCachingDirectory(org.apache.lucene.store.NIOFSDirectory@/usr/home/hudson/hudson-slave/workspace/Lucene-Solr-Tests-4.x-java7/solr/build/solr-core/test/J1/org.apache.solr.cloud.SyncSliceTest-1348017492891/jetty3/index lockFactory=org.apache.lucene.store.NativeFSLockFactory@6b2a49d9; maxCacheMB=48.0 maxMergeSizeMB=4.0),segFN=segments_4,generation=4,filenames=[_0_Block_0.tip, _0_Block_0.pos, _1_Pulsing40_0.tip, _0_Block_0.tim, _1_Pulsing40_0.tim, _0_TestBloomFilteredLucene40Postings_0.prx, _1_TestBloomFilteredLucene40Postings_0.blm, _0_Pulsing40_0.prx, _1.fnm, _0_Pulsing40_0.frq, _1_Pulsing40_0.frq, _1_TestBloomFilteredLucene40Postings_0.tip, _1_Memory_0.ram, _1_Pulsing40_0.prx, _0_Pulsing40_0.tip, _0_TestBloomFilteredLucene40Postings_0.frq, _1_TestBloomFilteredLucene40Postings_0.tim, _0.si, _1_Block_0.doc, _1_Block_0.pos, _1_Block_0.tip, _0_TestBloomFilteredLucene40Postings_0.tim, _1_nrm.cfs, _0_TestBloomFilteredLucene40Postings_0.tip, _0_TestBloomFilteredLucene40Postings_0.blm, _1_TestBloomFilteredLucene40Postings_0.prx, _0_Pulsing40_0.tim, _0_Block_0.doc, _0.fnm, _1_Block_0.tim, _0_Memory_0.ram, _0_nrm.cfs, _1_TestBloomFilteredLucene40Postings_0.frq, _1_nrm.cfe, _1.fdx, _1.fdt, _1.si, _0_nrm.cfe, _0.fdx, _0.fdt, segments_4]
[junit4:junit4]   2> 19430 T2529 C131 P60388 oasc.SolrDeletionPolicy.updateCommits newest commit = 4
[junit4:junit4]   2> 19436 T2529 C131 P60388 oass.SolrIndexSearcher.<init> Opening Searcher@6565dd73 main
[junit4:junit4]   2> 19436 T2529 C131 P60388 oasu.DirectUpdateHandler2.commit end_commit_flush
[junit4:junit4]   2> 19437 T2538 oasc.SolrCore.registerSearcher [collection1] Registered new searcher Searcher@6565dd73 main{StandardDirectoryReader(segments_4:6:nrt _0(4.0.0.2):C3 _1(4.0.0.2):C1)}
[junit4:junit4]   2> 19438 T2529 C131 P60388 /update {waitSearcher=true&commit=true&wt=javabin&commit_end_point=true&expungeDeletes=false&softCommit=false&version=2} {commit=} 0 191
[junit4:junit4]   2> 19439 T2515 C129 P60367 oasc.SolrDeletionPolicy.onCommit SolrDeletionPolicy.onCommit: commits:num=2
[junit4:junit4]   2> 		commit{dir=NRTCachingDirectory(org.apache.lucene.store.NIOFSDirectory@/usr/home/hudson/hudson-slave/workspace/Lucene-Solr-Tests-4.x-java7/solr/build/solr-core/test/J1/org.apache.solr.cloud.SyncSliceTest-1348017492891/jetty2/index lockFactory=org.apache.lucene.store.NativeFSLockFactory@3e0abb1f; maxCacheMB=48.0 maxMergeSizeMB=4.0),segFN=segments_3,generation=3,filenames=[_0_TestBloomFilteredLucene40Postings_0.tim, _0_Block_0.pos, _0_Block_0.tip, _0_TestBloomFilteredLucene40Postings_0.blm, _0_TestBloomFilteredLucene40Postings_0.tip, _0.fnm, _0_Block_0.doc, _0_Pulsing40_0.tim, _0_Block_0.tim, _0_Memory_0.ram, _0_TestBloomFilteredLucene40Postings_0.prx, _0_nrm.cfs, _0_Pulsing40_0.prx, _0_Pulsing40_0.frq, _0_nrm.cfe, _0_Pulsing40_0.tip, _0_TestBloomFilteredLucene40Postings_0.frq, _0.fdx, _0.si, _0.fdt, segments_3]
[junit4:junit4]   2> 		commit{dir=NRTCachingDirectory(org.apache.lucene.store.NIOFSDirectory@/usr/home/hudson/hudson-slave/workspace/Lucene-Solr-Tests-4.x-java7/solr/build/solr-core/test/J1/org.apache.solr.cloud.SyncSliceTest-1348017492891/jetty2/index lockFactory=org.apache.lucene.store.NativeFSLockFactory@3e0abb1f; maxCacheMB=48.0 maxMergeSizeMB=4.0),segFN=segments_4,generation=4,filenames=[_0_Block_0.tip, _0_Block_0.pos, _1_Pulsing40_0.tip, _0_Block_0.tim, _1_Pulsing40_0.tim, _0_TestBloomFilteredLucene40Postings_0.prx, _1_TestBloomFilteredLucene40Postings_0.blm, _0_Pulsing40_0.prx, _1.fnm, _0_Pulsing40_0.frq, _1_Pulsing40_0.frq, _1_TestBloomFilteredLucene40Postings_0.tip, _1_Memory_0.ram, _1_Pulsing40_0.prx, _0_Pulsing40_0.tip, _0_TestBloomFilteredLucene40Postings_0.frq, _1_TestBloomFilteredLucene40Postings_0.tim, _0.si, _1_Block_0.doc, _1_Block_0.pos, _1_Block_0.tip, _0_TestBloomFilteredLucene40Postings_0.tim, _1_nrm.cfs, _0_TestBloomFilteredLucene40Postings_0.tip, _0_TestBloomFilteredLucene40Postings_0.blm, _1_TestBloomFilteredLucene40Postings_0.prx, _0_Pulsing40_0.tim, _0_Block_0.doc, _0.fnm, _1_Block_0.tim, _0_Memory_0.ram, _0_nrm.cfs, _1_TestBloomFilteredLucene40Postings_0.frq, _1_nrm.cfe, _1.fdx, _1.fdt, _1.si, _0_nrm.cfe, _0.fdx, _0.fdt, segments_4]
[junit4:junit4]   2> 19440 T2515 C129 P60367 oasc.SolrDeletionPolicy.updateCommits newest commit = 4
[junit4:junit4]   2> 19450 T2515 C129 P60367 oass.SolrIndexSearcher.<init> Opening Searcher@1df4e121 main
[junit4:junit4]   2> 19451 T2515 C129 P60367 oasu.DirectUpdateHandler2.commit end_commit_flush
[junit4:junit4]   2> 19453 T2524 oasc.SolrCore.registerSearcher [collection1] Registered new searcher Searcher@1df4e121 main{StandardDirectoryReader(segments_4:6:nrt _0(4.0.0.2):C2 _1(4.0.0.2):C2)}
[junit4:junit4]   2> 19454 T2515 C129 P60367 /update {waitSearcher=true&commit=true&wt=javabin&commit_end_point=true&expungeDeletes=false&softCommit=false&version=2} {commit=} 0 207
[junit4:junit4]   2> 19455 T2506 C130 P60289 /update {waitSearcher=true&wt=javabin&commit=true&softCommit=false&version=2} {commit=} 0 215
[junit4:junit4]   2> 19455 T2477 oascc.ZkStateReader.updateClusterState Updating cloud state from ZooKeeper... 
[junit4:junit4]   2> 19458 T2505 C130 P60289 REQ /select {distrib=false&wt=javabin&q=*:*&version=2} hits=4 status=0 QTime=0 
[junit4:junit4]   2> 19462 T2516 C129 P60367 REQ /select {distrib=false&wt=javabin&q=*:*&version=2} hits=4 status=0 QTime=0 
[junit4:junit4]   2> 19465 T2530 C131 P60388 REQ /select {distrib=false&wt=javabin&q=*:*&version=2} hits=4 status=0 QTime=0 
[junit4:junit4]   2> 19467 T2544 C132 P60403 REQ /select {distrib=false&wt=javabin&q=*:*&version=2} hits=4 status=0 QTime=0 
[junit4:junit4]   2> 21475 T2490 C133 P60270 REQ /select {fl=id,score&shard.url=127.0.0.1:60270/solr/collection1/&NOW=1348017514358&start=0&q=*:*&distrib=false&isShard=true&wt=javabin&fsv=true&rows=10&version=2} hits=4 status=0 QTime=1 
[junit4:junit4]   2> 21478 T2490 C133 P60270 REQ /select {shard.url=127.0.0.1:60270/solr/collection1/&NOW=1348017514358&q=*:*&ids=3,2,1,0&distrib=false&isShard=true&wt=javabin&version=2} status=0 QTime=0 
[junit4:junit4]   2> 21479 T2489 C133 P60270 REQ /select {wt=javabin&q=*:*&version=2} hits=4 status=0 QTime=8 
[junit4:junit4]   2> Control Docs:4
[junit4:junit4]   2> 21480 T2477 oascc.ZkStateReader.updateClusterState Updating cloud state from ZooKeeper... 
[junit4:junit4]   2> check const of shard1
[junit4:junit4]   2> client0
[junit4:junit4]   2> PROPS:127.0.0.1:60289_solr_collection1:{"shard":"shard1","roles":null,"state":"active","core":"collection1","collection":"collection1","node_name":"127.0.0.1:60289_solr","base_url":"http://127.0.0.1:60289/solr","leader":"true"}
[junit4:junit4]   2> 21483 T2505 C130 P60289 REQ /select {distrib=false&wt=javabin&q=*:*&version=2} hits=4 status=0 QTime=0 
[junit4:junit4]   2>  live:true
[junit4:junit4]   2>  num:4
[junit4:junit4]   2> 
[junit4:junit4]   2> client1
[junit4:junit4]   2> PROPS:127.0.0.1:60367_solr_collection1:{"shard":"shard1","roles":null,"state":"active","core":"collection1","collection":"collection1","node_name":"127.0.0.1:60367_solr","base_url":"http://127.0.0.1:60367/solr"}
[junit4:junit4]   2> 21487 T2516 C129 P60367 REQ /select {distrib=false&wt=javabin&q=*:*&version=2} hits=4 status=0 QTime=0 
[junit4:junit4]   2>  live:true
[junit4:junit4]   2>  num:4
[junit4:junit4]   2> 
[junit4:junit4]   2> client2
[junit4:junit4]   2> PROPS:127.0.0.1:60388_solr_collection1:{"shard":"shard1","roles":null,"state":"active","core":"collection1","collection":"collection1","node_name":"127.0.0.1:60388_solr","base_url":"http://127.0.0.1:60388/solr"}
[junit4:junit4]   2> 21490 T2530 C131 P60388 REQ /select {distrib=false&wt=javabin&q=*:*&version=2} hits=4 status=0 QTime=0 
[junit4:junit4]   2>  live:true
[junit4:junit4]   2>  num:4
[junit4:junit4]   2> 
[junit4:junit4]   2> client3
[junit4:junit4]   2> PROPS:127.0.0.1:60403_solr_collection1:{"shard":"shard1","roles":null,"state":"active","core":"collection1","collection":"collection1","node_name":"127.0.0.1:60403_solr","base_url":"http://127.0.0.1:60403/solr"}
[junit4:junit4]   2> 21493 T2544 C132 P60403 REQ /select {distrib=false&wt=javabin&q=*:*&version=2} hits=4 status=0 QTime=0 
[junit4:junit4]   2>  live:true
[junit4:junit4]   2>  num:4
[junit4:junit4]   2> 
[junit4:junit4]   2> 21498 T2535 C131 P60388 REQ /select {fl=id,score&shard.url=127.0.0.1:60289/solr/collection1/|127.0.0.1:60367/solr/collection1/|127.0.0.1:60388/solr/collection1/|127.0.0.1:60403/solr/collection1/&NOW=1348017514383&start=0&q=*:*&distrib=false&isShard=true&wt=javabin&fsv=true&rows=10&version=2} hits=4 status=0 QTime=0 
[junit4:junit4]   2> 21501 T2535 C131 P60388 REQ /select {shard.url=127.0.0.1:60289/solr/collection1/|127.0.0.1:60367/solr/collection1/|127.0.0.1:60388/solr/collection1/|127.0.0.1:60403/solr/collection1/&NOW=1348017514383&q=*:*&ids=3,2,1,0&distrib=false&isShard=true&wt=javabin&version=2} status=0 QTime=0 
[junit4:junit4]   2> 21502 T2534 C131 P60388 REQ /select {wt=javabin&q=*:*&version=2} hits=4 status=0 QTime=6 
[junit4:junit4]   2> 21507 T2489 C133 P60270 /update {wt=javabin&version=2} {add=[4 (1413498813171105792)]} 0 2
[junit4:junit4]   2> 21516 T2543 C132 P60403 REQ /update {distrib.from=http://127.0.0.1:60289/solr/collection1/&update.distrib=FROMLEADER&test.distrib.skip.servers=http://127.0.0.1:60388/solr/collection1/&wt=javabin&version=2} status=0 QTime=2 
[junit4:junit4]   2> 21516 T2515 C129 P60367 REQ /update {distrib.from=http://127.0.0.1:60289/solr/collection1/&update.distrib=FROMLEADER&test.distrib.skip.servers=http://127.0.0.1:60388/solr/collection1/&wt=javabin&version=2} status=0 QTime=2 
[junit4:junit4]   2> 21517 T2506 C130 P60289 /update {test.distrib.skip.servers=http://127.0.0.1:60388/solr/collection1/&wt=javabin&version=2} {add=[4 (1413498813176348672)]} 0 7
[junit4:junit4]   2> 21517 T2477 oasc.ChaosMonkey.monkeyLog monkey: kill shard! 60289
[junit4:junit4]   2> 21518 T2477 oasc.CoreContainer.shutdown Shutting down CoreContainer instance=675493675
[junit4:junit4]   2> 21519 T2477 oasc.SolrCore.close [collection1]  CLOSING SolrCore org.apache.solr.core.SolrCore@64eb4208
[junit4:junit4]   2> 21530 T2477 oasc.SolrCore.closeSearcher [collection1] Closing main searcher on request.
[junit4:junit4]   2> 21531 T2477 oasu.DirectUpdateHandler2.close closing DirectUpdateHandler2{commits=6,autocommits=0,soft autocommits=0,optimizes=0,rollbacks=0,expungeDeletes=0,docsPending=1,adds=1,deletesById=0,deletesByQuery=0,errors=0,cumulative_adds=5,cumulative_deletesById=0,cumulative_deletesByQuery=1,cumulative_errors=0}
[junit4:junit4]   2> 21532 T2477 oasu.DefaultSolrCoreState.decref SolrCoreState ref count has reached 0 - closing IndexWriter
[junit4:junit4]   2> 21646 T2477 C130 P60289 oasc.SolrDeletionPolicy.onCommit SolrDeletionPolicy.onCommit: commits:num=3
[junit4:junit4]   2> 		commit{dir=NRTCachingDirectory(org.apache.lucene.store.NIOFSDirectory@/usr/home/hudson/hudson-slave/workspace/Lucene-Solr-Tests-4.x-java7/solr/build/solr-core/test/J1/org.apache.solr.cloud.SyncSliceTest-1348017492891/jetty1/index lockFactory=org.apache.lucene.store.NativeFSLockFactory@43a28d7e; maxCacheMB=48.0 maxMergeSizeMB=4.0),segFN=segments_1,generation=1,filenames=[segments_1]
[junit4:junit4]   2> 		commit{dir=NRTCachingDirectory(org.apache.lucene.store.NIOFSDirectory@/usr/home/hudson/hudson-slave/workspace/Lucene-Solr-Tests-4.x-java7/solr/build/solr-core/test/J1/org.apache.solr.cloud.SyncSliceTest-1348017492891/jetty1/index lockFactory=org.apache.lucene.store.NativeFSLockFactory@43a28d7e; maxCacheMB=48.0 maxMergeSizeMB=4.0),se

[...truncated too long message...]

redMap.java:116)
[junit4:junit4]   2> 	at org.apache.solr.core.SolrCore.close(SolrCore.java:864)
[junit4:junit4]   2> 	at org.apache.solr.cloud.ShardLeaderElectionContext.runLeaderProcess(ElectionContext.java:213)
[junit4:junit4]   2> 	at org.apache.solr.cloud.LeaderElector.runIamLeaderProcess(LeaderElector.java:158)
[junit4:junit4]   2> 	at org.apache.solr.cloud.LeaderElector.checkIfIamLeader(LeaderElector.java:102)
[junit4:junit4]   2> 	at org.apache.solr.cloud.LeaderElector.access$000(LeaderElector.java:56)
[junit4:junit4]   2> 	at org.apache.solr.cloud.LeaderElector$1.process(LeaderElector.java:131)
[junit4:junit4]   2> 	at org.apache.zookeeper.ClientCnxn$EventThread.processEvent(ClientCnxn.java:526)
[junit4:junit4]   2> 	at org.apache.zookeeper.ClientCnxn$EventThread.run(ClientCnxn.java:502)
[junit4:junit4]   2> 
[junit4:junit4]   2> 310603 T1530 oasc.JmxMonitoredMap$SolrDynamicMBean.getMBeanInfo WARNING Could not getStatistics on info bean Lazy[solr.ReplicationHandler] java.lang.IllegalArgumentException: /usr/home/hudson/hudson-slave/workspace/Lucene-Solr-Tests-4.x-java7/solr/build/solr-core/test/J0/org.apache.solr.cloud.BasicDistributedZk2Test-1348017492822/jetty4/index does not exist
[junit4:junit4]   2> 	at org.apache.commons.io.FileUtils.sizeOfDirectory(FileUtils.java:2074)
[junit4:junit4]   2> 	at org.apache.solr.handler.ReplicationHandler.getIndexSize(ReplicationHandler.java:477)
[junit4:junit4]   2> 	at org.apache.solr.handler.ReplicationHandler.getStatistics(ReplicationHandler.java:525)
[junit4:junit4]   2> 	at org.apache.solr.core.RequestHandlers$LazyRequestHandlerWrapper.getStatistics(RequestHandlers.java:310)
[junit4:junit4]   2> 	at org.apache.solr.core.JmxMonitoredMap$SolrDynamicMBean.getMBeanInfo(JmxMonitoredMap.java:231)
[junit4:junit4]   2> 	at com.sun.jmx.interceptor.DefaultMBeanServerInterceptor.getClassName(DefaultMBeanServerInterceptor.java:1804)
[junit4:junit4]   2> 	at com.sun.jmx.interceptor.DefaultMBeanServerInterceptor.safeGetClassName(DefaultMBeanServerInterceptor.java:1595)
[junit4:junit4]   2> 	at com.sun.jmx.interceptor.DefaultMBeanServerInterceptor.checkMBeanPermission(DefaultMBeanServerInterceptor.java:1813)
[junit4:junit4]   2> 	at com.sun.jmx.interceptor.DefaultMBeanServerInterceptor.exclusiveUnregisterMBean(DefaultMBeanServerInterceptor.java:430)
[junit4:junit4]   2> 	at com.sun.jmx.interceptor.DefaultMBeanServerInterceptor.unregisterMBean(DefaultMBeanServerInterceptor.java:415)
[junit4:junit4]   2> 	at com.sun.jmx.mbeanserver.JmxMBeanServer.unregisterMBean(JmxMBeanServer.java:536)
[junit4:junit4]   2> 	at org.apache.solr.core.JmxMonitoredMap.unregister(JmxMonitoredMap.java:175)
[junit4:junit4]   2> 	at org.apache.solr.core.JmxMonitoredMap.clear(JmxMonitoredMap.java:116)
[junit4:junit4]   2> 	at org.apache.solr.core.SolrCore.close(SolrCore.java:864)
[junit4:junit4]   2> 	at org.apache.solr.cloud.ShardLeaderElectionContext.runLeaderProcess(ElectionContext.java:213)
[junit4:junit4]   2> 	at org.apache.solr.cloud.LeaderElector.runIamLeaderProcess(LeaderElector.java:158)
[junit4:junit4]   2> 	at org.apache.solr.cloud.LeaderElector.checkIfIamLeader(LeaderElector.java:102)
[junit4:junit4]   2> 	at org.apache.solr.cloud.LeaderElector.access$000(LeaderElector.java:56)
[junit4:junit4]   2> 	at org.apache.solr.cloud.LeaderElector$1.process(LeaderElector.java:131)
[junit4:junit4]   2> 	at org.apache.zookeeper.ClientCnxn$EventThread.processEvent(ClientCnxn.java:526)
[junit4:junit4]   2> 	at org.apache.zookeeper.ClientCnxn$EventThread.run(ClientCnxn.java:502)
[junit4:junit4]   2> 
[junit4:junit4]   2> 310607 T1530 oasc.SolrCore.closeSearcher [collection1] Closing main searcher on request.
[junit4:junit4]   2> 310610 T1530 oasu.DirectUpdateHandler2.close closing DirectUpdateHandler2{commits=5,autocommits=0,soft autocommits=0,optimizes=0,rollbacks=0,expungeDeletes=0,docsPending=0,adds=0,deletesById=0,deletesByQuery=0,errors=0,cumulative_adds=35,cumulative_deletesById=0,cumulative_deletesByQuery=0,cumulative_errors=0}
[junit4:junit4]   2> 310610 T1530 oasu.DefaultSolrCoreState.decref SolrCoreState ref count has reached 0 - closing IndexWriter
[junit4:junit4]   2> 310612 T1530 oasu.DefaultSolrCoreState.decref Closing SolrCoreState - canceling any ongoing recovery
[junit4:junit4]   2> 310613 T1530 oascc.ZkStateReader$3.process Updating live nodes
[junit4:junit4]   2> 310613 T1530 oascc.ZkStateReader$3.process WARNING ZooKeeper watch triggered, but Solr cannot talk to ZK
[junit4:junit4]   2> 310613 T1530 oascc.ZkStateReader$2.process A cluster state change has occurred - updating...
[junit4:junit4]   2> 310613 T1530 oascc.ZkStateReader$2.process WARNING ZooKeeper watch triggered, but Solr cannot talk to ZK
[junit4:junit4]   2> 310613 T1530 oascc.ConnectionManager.process Watcher org.apache.solr.common.cloud.ConnectionManager@49467c2b name:ZooKeeperConnection Watcher:127.0.0.1:60262/solr got event WatchedEvent state:Disconnected type:None path:null path:null type:None
[junit4:junit4]   2> 310614 T1530 oascc.ConnectionManager.process Client->ZooKeeper status change trigger but we are already closed
[junit4:junit4]   2> 310614 T1530 oaz.ClientCnxn$EventThread.run EventThread shut down
[junit4:junit4]   2> NOTE: test params are: codec=Lucene40: {n_f1=PostingsFormat(name=SimpleText), foo_b=PostingsFormat(name=Memory doPackFST= true), foo_d=MockFixedIntBlock(blockSize=1159), foo_f=PostingsFormat(name=Memory doPackFST= true), n_tl1=PostingsFormat(name=SimpleText), n_d1=Block(blocksize=128), rnd_b=MockFixedIntBlock(blockSize=1159), intDefault=Block(blocksize=128), n_td1=PostingsFormat(name=SimpleText), timestamp=Block(blocksize=128), id=MockFixedIntBlock(blockSize=1159), range_facet_sl=PostingsFormat(name=Memory doPackFST= true), range_facet_si=PostingsFormat(name=SimpleText), oddField_s=PostingsFormat(name=Memory doPackFST= true), multiDefault=PostingsFormat(name=SimpleText), n_tf1=Block(blocksize=128), n_dt1=PostingsFormat(name=SimpleText), n_ti1=MockFixedIntBlock(blockSize=1159), range_facet_l=Block(blocksize=128), text=PostingsFormat(name=Memory doPackFST= true), _version_=Block(blocksize=128), SubjectTerms_mfacet=Block(blocksize=128), a_t=Block(blocksize=128), n_tdt1=Block(blocksize=128), other_tl1=Block(blocksize=128), n_l1=Block(blocksize=128), a_si=PostingsFormat(name=SimpleText)}, sim=DefaultSimilarity, locale=is_IS, timezone=Australia/Perth
[junit4:junit4]   2> NOTE: FreeBSD 9.0-RELEASE amd64/Oracle Corporation 1.7.0_06 (64-bit)/cpus=16,threads=2,free=145413264,total=386924544
[junit4:junit4]   2> NOTE: All tests run in this JVM: [CoreAdminHandlerTest, TestCollationField, TestIndexSearcher, AnalysisAfterCoreReloadTest, FileBasedSpellCheckerTest, SampleTest, DirectUpdateHandlerOptimizeTest, LoggingHandlerTest, DirectSolrConnectionTest, TestFastWriter, SOLR749Test, TestIndexingPerformance, TestNumberUtils, CSVRequestHandlerTest, TestGroupingSearch, JsonLoaderTest, TestPHPSerializedResponseWriter, HighlighterConfigTest, TestStressVersions, TestSuggestSpellingConverter, TestLMDirichletSimilarityFactory, ClusterStateTest, FieldAnalysisRequestHandlerTest, TestConfig, TestRangeQuery, TestDefaultSimilarityFactory, SimpleFacetsTest, SpellCheckComponentTest, DistanceFunctionTest, PluginInfoTest, TestExtendedDismaxParser, JSONWriterTest, DistributedTermsComponentTest, TestLFUCache, TestLMJelinekMercerSimilarityFactory, MinimalSchemaTest, SolrCoreCheckLockOnStartupTest, TestXIncludeConfig, TestFastOutputStream, ResourceLoaderTest, NumericFieldsTest, SystemInfoHandlerTest, SortByFunctionTest, ZkControllerTest, TestElisionMultitermQuery, SolrPluginUtilsTest, TestCoreContainer, TestSearchPerf, NotRequiredUniqueKeyTest, SpellPossibilityIteratorTest, TestIBSimilarityFactory, FastVectorHighlighterTest, DistributedSpellCheckComponentTest, BasicDistributedZkTest, LeaderElectionIntegrationTest, TestDistributedSearch, SolrCoreTest, IndexBasedSpellCheckerTest, DirectUpdateHandlerTest, TestSort, TestFiltering, ConvertedLegacyTest, PeerSyncTest, QueryElevationComponentTest, BasicFunctionalityTest, HighlighterTest, SolrRequestParserTest, TestCSVLoader, SpatialFilterTest, MBeansHandlerTest, TestPseudoReturnFields, QueryParsingTest, TestQueryTypes, TermVectorComponentTest, DocumentAnalysisRequestHandlerTest, TestReversedWildcardFilterFactory, ReturnFieldsTest, RequestHandlersTest, RequiredFieldsTest, CopyFieldTest, TestArbitraryIndexDir, SuggesterTSTTest, UniqFieldsUpdateProcessorFactoryTest, BadIndexSchemaTest, TestFoldingMultitermQuery, TestLuceneMatchVersion, UpdateRequestProcessorFactoryTest, NoCacheHeaderTest, BadComponentTest, TestSolrDeletionPolicy2, TestQuerySenderListener, IndexReaderFactoryTest, MultiTermTest, TestJmxMonitoredMap, TestPhraseSuggestions, TestDFRSimilarityFactory, URLClassifyProcessorTest, SpellingQueryConverterTest, DOMUtilTest, UUIDFieldTest, TestUtils, PreAnalyzedFieldTest, CircularListTest, TestCollationKeyRangeQueries, BasicDistributedZk2Test]
[junit4:junit4] Completed on J0 in 311.18s, 1 test, 1 failure <<< FAILURES!

[...truncated 5 lines...]
BUILD FAILED
/usr/home/hudson/hudson-slave/workspace/Lucene-Solr-Tests-4.x-java7/build.xml:32: The following error occurred while executing this line:
/usr/home/hudson/hudson-slave/workspace/Lucene-Solr-Tests-4.x-java7/solr/build.xml:146: The following error occurred while executing this line:
/usr/home/hudson/hudson-slave/workspace/Lucene-Solr-Tests-4.x-java7/lucene/module-build.xml:63: The following error occurred while executing this line:
/usr/home/hudson/hudson-slave/workspace/Lucene-Solr-Tests-4.x-java7/lucene/common-build.xml:1136: The following error occurred while executing this line:
/usr/home/hudson/hudson-slave/workspace/Lucene-Solr-Tests-4.x-java7/lucene/common-build.xml:810: There were test failures: 230 suites, 951 tests, 2 failures, 7 ignored (2 assumptions)

Total time: 34 minutes 1 second
Build step 'Invoke Ant' marked build as failure
Recording test results
Email was triggered for: Failure
Sending email for trigger: Failure



Mime
View raw message