lucene-dev mailing list archives

Site index · List index
Message view « Date » · « Thread »
Top « Date » · « Thread »
From Apache Jenkins Server <jenk...@builds.apache.org>
Subject [JENKINS] Lucene-Solr-Tests-4.x-java7 - Build # 462 - Still Failing
Date Mon, 17 Sep 2012 09:30:01 GMT
Build: https://builds.apache.org/job/Lucene-Solr-Tests-4.x-java7/462/

1 tests failed.
FAILED:  org.apache.solr.cloud.BasicDistributedZk2Test.testDistribSearch

Error Message:
Shard still reported as live in zk

Stack Trace:
java.lang.AssertionError: Shard still reported as live in zk
	at __randomizedtesting.SeedInfo.seed([3770BC5947E8618F:B696324130B701B3]:0)
	at org.junit.Assert.fail(Assert.java:93)
	at org.apache.solr.cloud.AbstractFullDistribZkTestBase.waitToSeeNotLive(AbstractFullDistribZkTestBase.java:1220)
	at org.apache.solr.cloud.BasicDistributedZk2Test.brindDownShardIndexSomeDocsAndRecover(BasicDistributedZk2Test.java:190)
	at org.apache.solr.cloud.BasicDistributedZk2Test.doTest(BasicDistributedZk2Test.java:83)
	at org.apache.solr.BaseDistributedSearchTestCase.testDistribSearch(BaseDistributedSearchTestCase.java:695)
	at sun.reflect.NativeMethodAccessorImpl.invoke0(Native Method)
	at sun.reflect.NativeMethodAccessorImpl.invoke(NativeMethodAccessorImpl.java:57)
	at sun.reflect.DelegatingMethodAccessorImpl.invoke(DelegatingMethodAccessorImpl.java:43)
	at java.lang.reflect.Method.invoke(Method.java:601)
	at com.carrotsearch.randomizedtesting.RandomizedRunner.invoke(RandomizedRunner.java:1559)
	at com.carrotsearch.randomizedtesting.RandomizedRunner.access$600(RandomizedRunner.java:79)
	at com.carrotsearch.randomizedtesting.RandomizedRunner$6.evaluate(RandomizedRunner.java:737)
	at com.carrotsearch.randomizedtesting.RandomizedRunner$7.evaluate(RandomizedRunner.java:773)
	at com.carrotsearch.randomizedtesting.RandomizedRunner$8.evaluate(RandomizedRunner.java:787)
	at com.carrotsearch.randomizedtesting.rules.SystemPropertiesRestoreRule$1.evaluate(SystemPropertiesRestoreRule.java:53)
	at org.apache.lucene.util.TestRuleSetupTeardownChained$1.evaluate(TestRuleSetupTeardownChained.java:50)
	at org.apache.lucene.util.TestRuleFieldCacheSanity$1.evaluate(TestRuleFieldCacheSanity.java:51)
	at org.apache.lucene.util.AbstractBeforeAfterRule$1.evaluate(AbstractBeforeAfterRule.java:45)
	at com.carrotsearch.randomizedtesting.rules.SystemPropertiesInvariantRule$1.evaluate(SystemPropertiesInvariantRule.java:55)
	at org.apache.lucene.util.TestRuleThreadAndTestName$1.evaluate(TestRuleThreadAndTestName.java:48)
	at org.apache.lucene.util.TestRuleIgnoreAfterMaxFailures$1.evaluate(TestRuleIgnoreAfterMaxFailures.java:70)
	at org.apache.lucene.util.TestRuleMarkFailure$1.evaluate(TestRuleMarkFailure.java:48)
	at com.carrotsearch.randomizedtesting.rules.StatementAdapter.evaluate(StatementAdapter.java:36)
	at com.carrotsearch.randomizedtesting.ThreadLeakControl$StatementRunner.run(ThreadLeakControl.java:358)
	at com.carrotsearch.randomizedtesting.ThreadLeakControl.forkTimeoutingTask(ThreadLeakControl.java:782)
	at com.carrotsearch.randomizedtesting.ThreadLeakControl$3.evaluate(ThreadLeakControl.java:442)
	at com.carrotsearch.randomizedtesting.RandomizedRunner.runSingleTest(RandomizedRunner.java:746)
	at com.carrotsearch.randomizedtesting.RandomizedRunner$3.evaluate(RandomizedRunner.java:648)
	at com.carrotsearch.randomizedtesting.RandomizedRunner$4.evaluate(RandomizedRunner.java:682)
	at com.carrotsearch.randomizedtesting.RandomizedRunner$5.evaluate(RandomizedRunner.java:693)
	at com.carrotsearch.randomizedtesting.rules.StatementAdapter.evaluate(StatementAdapter.java:36)
	at com.carrotsearch.randomizedtesting.rules.SystemPropertiesRestoreRule$1.evaluate(SystemPropertiesRestoreRule.java:53)
	at org.apache.lucene.util.AbstractBeforeAfterRule$1.evaluate(AbstractBeforeAfterRule.java:45)
	at org.apache.lucene.util.TestRuleStoreClassName$1.evaluate(TestRuleStoreClassName.java:42)
	at com.carrotsearch.randomizedtesting.rules.SystemPropertiesInvariantRule$1.evaluate(SystemPropertiesInvariantRule.java:55)
	at com.carrotsearch.randomizedtesting.rules.NoShadowingOrOverridesOnMethodsRule$1.evaluate(NoShadowingOrOverridesOnMethodsRule.java:39)
	at com.carrotsearch.randomizedtesting.rules.NoShadowingOrOverridesOnMethodsRule$1.evaluate(NoShadowingOrOverridesOnMethodsRule.java:39)
	at com.carrotsearch.randomizedtesting.rules.StatementAdapter.evaluate(StatementAdapter.java:36)
	at org.apache.lucene.util.TestRuleAssertionsRequired$1.evaluate(TestRuleAssertionsRequired.java:43)
	at org.apache.lucene.util.TestRuleMarkFailure$1.evaluate(TestRuleMarkFailure.java:48)
	at org.apache.lucene.util.TestRuleIgnoreAfterMaxFailures$1.evaluate(TestRuleIgnoreAfterMaxFailures.java:70)
	at org.apache.lucene.util.TestRuleIgnoreTestSuites$1.evaluate(TestRuleIgnoreTestSuites.java:55)
	at com.carrotsearch.randomizedtesting.rules.StatementAdapter.evaluate(StatementAdapter.java:36)
	at com.carrotsearch.randomizedtesting.ThreadLeakControl$StatementRunner.run(ThreadLeakControl.java:358)
	at java.lang.Thread.run(Thread.java:722)




Build Log:
[...truncated 8220 lines...]
[junit4:junit4] Suite: org.apache.solr.cloud.BasicDistributedZk2Test
[junit4:junit4]   2> 4 T2185 oas.SolrTestCaseJ4.setUp ###Starting testDistribSearch
[junit4:junit4]   2> Creating dataDir: /usr/home/hudson/hudson-slave/workspace/Lucene-Solr-Tests-4.x-java7/solr/build/solr-core/test/J1/./solrtest-BasicDistributedZk2Test-1347873884054
[junit4:junit4]   2> 5 T2185 oasc.ZkTestServer.run STARTING ZK TEST SERVER
[junit4:junit4]   2> 8 T2186 oazs.ZooKeeperServer.setTickTime tickTime set to 1000
[junit4:junit4]   2> 8 T2186 oazs.NIOServerCnxn$Factory.<init> binding to port 0.0.0.0/0.0.0.0:0
[junit4:junit4]   2> 9 T2186 oazsp.FileTxnSnapLog.save Snapshotting: 0
[junit4:junit4]   2> 107 T2185 oasc.ZkTestServer.run start zk server on port:39608
[junit4:junit4]   2> 107 T2185 oaz.ZooKeeper.<init> Initiating client connection, connectString=127.0.0.1:39608 sessionTimeout=10000 watcher=org.apache.solr.common.cloud.ConnectionManager@22a68a66
[junit4:junit4]   2> 108 T2191 oaz.ClientCnxn$SendThread.startConnect Opening socket connection to server /127.0.0.1:39608
[junit4:junit4]   2> 108 T2185 oascc.ConnectionManager.waitForConnected Waiting for client to connect to ZooKeeper
[junit4:junit4]   2> 109 T2191 oaz.ClientCnxn$SendThread.primeConnection Socket connection established to localhost/127.0.0.1:39608, initiating session
[junit4:junit4]   2> 109 T2187 oazs.NIOServerCnxn$Factory.run Accepted socket connection from /140.211.11.196:39609
[junit4:junit4]   2> 109 T2187 oazs.NIOServerCnxn.readConnectRequest Client attempting to establish new session at /140.211.11.196:39609
[junit4:junit4]   2> 110 T2189 oazsp.FileTxnLog.append Creating new log file: log.1
[junit4:junit4]   2> 112 T2189 oazs.NIOServerCnxn.finishSessionInit Established session 0x139d38b479a0000 with negotiated timeout 10000 for client /140.211.11.196:39609
[junit4:junit4]   2> 112 T2191 oaz.ClientCnxn$SendThread.readConnectResult Session establishment complete on server localhost/127.0.0.1:39608, sessionid = 0x139d38b479a0000, negotiated timeout = 10000
[junit4:junit4]   2> 112 T2192 oascc.ConnectionManager.process Watcher org.apache.solr.common.cloud.ConnectionManager@22a68a66 name:ZooKeeperConnection Watcher:127.0.0.1:39608 got event WatchedEvent state:SyncConnected type:None path:null path:null type:None
[junit4:junit4]   2> 112 T2185 oascc.ConnectionManager.waitForConnected Client is connected to ZooKeeper
[junit4:junit4]   2> 113 T2185 oascc.SolrZkClient.makePath makePath: /solr
[junit4:junit4]   2> 143 T2190 oazs.PrepRequestProcessor.pRequest Processed session termination for sessionid: 0x139d38b479a0000
[junit4:junit4]   2> 146 T2192 oaz.ClientCnxn$EventThread.run EventThread shut down
[junit4:junit4]   2> 146 T2185 oaz.ZooKeeper.close Session: 0x139d38b479a0000 closed
[junit4:junit4]   2> 147 T2187 oazs.NIOServerCnxn.closeSock Closed socket connection for client /140.211.11.196:39609 which had sessionid 0x139d38b479a0000
[junit4:junit4]   2> 147 T2185 oaz.ZooKeeper.<init> Initiating client connection, connectString=127.0.0.1:39608/solr sessionTimeout=10000 watcher=org.apache.solr.common.cloud.ConnectionManager@48a7f86a
[junit4:junit4]   2> 148 T2193 oaz.ClientCnxn$SendThread.startConnect Opening socket connection to server /127.0.0.1:39608
[junit4:junit4]   2> 148 T2185 oascc.ConnectionManager.waitForConnected Waiting for client to connect to ZooKeeper
[junit4:junit4]   2> 161 T2193 oaz.ClientCnxn$SendThread.primeConnection Socket connection established to localhost/127.0.0.1:39608, initiating session
[junit4:junit4]   2> 161 T2187 oazs.NIOServerCnxn$Factory.run Accepted socket connection from /140.211.11.196:39610
[junit4:junit4]   2> 162 T2187 oazs.NIOServerCnxn.readConnectRequest Client attempting to establish new session at /140.211.11.196:39610
[junit4:junit4]   2> 176 T2189 oazs.NIOServerCnxn.finishSessionInit Established session 0x139d38b479a0001 with negotiated timeout 10000 for client /140.211.11.196:39610
[junit4:junit4]   2> 176 T2193 oaz.ClientCnxn$SendThread.readConnectResult Session establishment complete on server localhost/127.0.0.1:39608, sessionid = 0x139d38b479a0001, negotiated timeout = 10000
[junit4:junit4]   2> 176 T2194 oascc.ConnectionManager.process Watcher org.apache.solr.common.cloud.ConnectionManager@48a7f86a name:ZooKeeperConnection Watcher:127.0.0.1:39608/solr got event WatchedEvent state:SyncConnected type:None path:null path:null type:None
[junit4:junit4]   2> 177 T2185 oascc.ConnectionManager.waitForConnected Client is connected to ZooKeeper
[junit4:junit4]   2> 177 T2185 oascc.SolrZkClient.makePath makePath: /collections/collection1
[junit4:junit4]   2> 180 T2185 oascc.SolrZkClient.makePath makePath: /collections/collection1/shards
[junit4:junit4]   2> 181 T2185 oascc.SolrZkClient.makePath makePath: /collections/control_collection
[junit4:junit4]   2> 183 T2185 oascc.SolrZkClient.makePath makePath: /collections/control_collection/shards
[junit4:junit4]   2> 186 T2185 oasc.AbstractZkTestCase.putConfig put /usr/home/hudson/hudson-slave/workspace/Lucene-Solr-Tests-4.x-java7/solr/build/solr-core/test-files/solr/collection1/conf/solrconfig.xml to /configs/conf1/solrconfig.xml
[junit4:junit4]   2> 187 T2185 oascc.SolrZkClient.makePath makePath: /configs/conf1/solrconfig.xml
[junit4:junit4]   2> 200 T2185 oasc.AbstractZkTestCase.putConfig put /usr/home/hudson/hudson-slave/workspace/Lucene-Solr-Tests-4.x-java7/solr/build/solr-core/test-files/solr/collection1/conf/schema.xml to /configs/conf1/schema.xml
[junit4:junit4]   2> 201 T2185 oascc.SolrZkClient.makePath makePath: /configs/conf1/schema.xml
[junit4:junit4]   2> 307 T2185 oasc.AbstractZkTestCase.putConfig put /usr/home/hudson/hudson-slave/workspace/Lucene-Solr-Tests-4.x-java7/solr/build/solr-core/test-files/solr/collection1/conf/solrconfig.xml to /configs/conf1/solrconfig.xml
[junit4:junit4]   2> 308 T2185 oascc.SolrZkClient.makePath makePath: /configs/conf1/solrconfig.xml
[junit4:junit4]   2> 310 T2185 oasc.AbstractZkTestCase.putConfig put /usr/home/hudson/hudson-slave/workspace/Lucene-Solr-Tests-4.x-java7/solr/build/solr-core/test-files/solr/collection1/conf/stopwords.txt to /configs/conf1/stopwords.txt
[junit4:junit4]   2> 310 T2185 oascc.SolrZkClient.makePath makePath: /configs/conf1/stopwords.txt
[junit4:junit4]   2> 312 T2185 oasc.AbstractZkTestCase.putConfig put /usr/home/hudson/hudson-slave/workspace/Lucene-Solr-Tests-4.x-java7/solr/build/solr-core/test-files/solr/collection1/conf/protwords.txt to /configs/conf1/protwords.txt
[junit4:junit4]   2> 313 T2185 oascc.SolrZkClient.makePath makePath: /configs/conf1/protwords.txt
[junit4:junit4]   2> 317 T2185 oasc.AbstractZkTestCase.putConfig put /usr/home/hudson/hudson-slave/workspace/Lucene-Solr-Tests-4.x-java7/solr/build/solr-core/test-files/solr/collection1/conf/currency.xml to /configs/conf1/currency.xml
[junit4:junit4]   2> 318 T2185 oascc.SolrZkClient.makePath makePath: /configs/conf1/currency.xml
[junit4:junit4]   2> 325 T2185 oasc.AbstractZkTestCase.putConfig put /usr/home/hudson/hudson-slave/workspace/Lucene-Solr-Tests-4.x-java7/solr/build/solr-core/test-files/solr/collection1/conf/open-exchange-rates.json to /configs/conf1/open-exchange-rates.json
[junit4:junit4]   2> 325 T2185 oascc.SolrZkClient.makePath makePath: /configs/conf1/open-exchange-rates.json
[junit4:junit4]   2> 327 T2185 oasc.AbstractZkTestCase.putConfig put /usr/home/hudson/hudson-slave/workspace/Lucene-Solr-Tests-4.x-java7/solr/build/solr-core/test-files/solr/collection1/conf/mapping-ISOLatin1Accent.txt to /configs/conf1/mapping-ISOLatin1Accent.txt
[junit4:junit4]   2> 328 T2185 oascc.SolrZkClient.makePath makePath: /configs/conf1/mapping-ISOLatin1Accent.txt
[junit4:junit4]   2> 338 T2185 oasc.AbstractZkTestCase.putConfig put /usr/home/hudson/hudson-slave/workspace/Lucene-Solr-Tests-4.x-java7/solr/build/solr-core/test-files/solr/collection1/conf/old_synonyms.txt to /configs/conf1/old_synonyms.txt
[junit4:junit4]   2> 339 T2185 oascc.SolrZkClient.makePath makePath: /configs/conf1/old_synonyms.txt
[junit4:junit4]   2> 342 T2185 oasc.AbstractZkTestCase.putConfig put /usr/home/hudson/hudson-slave/workspace/Lucene-Solr-Tests-4.x-java7/solr/build/solr-core/test-files/solr/collection1/conf/synonyms.txt to /configs/conf1/synonyms.txt
[junit4:junit4]   2> 343 T2185 oascc.SolrZkClient.makePath makePath: /configs/conf1/synonyms.txt
[junit4:junit4]   2> 345 T2190 oazs.PrepRequestProcessor.pRequest Processed session termination for sessionid: 0x139d38b479a0001
[junit4:junit4]   2> 353 T2194 oaz.ClientCnxn$EventThread.run EventThread shut down
[junit4:junit4]   2> 353 T2187 oazs.NIOServerCnxn.closeSock Closed socket connection for client /140.211.11.196:39610 which had sessionid 0x139d38b479a0001
[junit4:junit4]   2> 353 T2185 oaz.ZooKeeper.close Session: 0x139d38b479a0001 closed
[junit4:junit4]   2> 356 T2185 oejs.Server.doStart jetty-8.1.2.v20120308
[junit4:junit4]   2> 360 T2185 oejs.AbstractConnector.doStart Started SocketConnector@0.0.0.0:39612
[junit4:junit4]   2> 361 T2185 oasc.SolrResourceLoader.locateSolrHome JNDI not configured for solr (NoInitialContextEx)
[junit4:junit4]   2> 361 T2185 oasc.SolrResourceLoader.locateSolrHome using system property solr.solr.home: /usr/home/hudson/hudson-slave/workspace/Lucene-Solr-Tests-4.x-java7/solr/build/solr-core/test-files/solr
[junit4:junit4]   2> 361 T2185 oasc.SolrResourceLoader.<init> new SolrResourceLoader for deduced Solr Home: '/usr/home/hudson/hudson-slave/workspace/Lucene-Solr-Tests-4.x-java7/solr/build/solr-core/test-files/solr/'
[junit4:junit4]   2> 391 T2185 oass.SolrDispatchFilter.init SolrDispatchFilter.init()
[junit4:junit4]   2> 392 T2185 oasc.SolrResourceLoader.locateSolrHome JNDI not configured for solr (NoInitialContextEx)
[junit4:junit4]   2> 392 T2185 oasc.SolrResourceLoader.locateSolrHome using system property solr.solr.home: /usr/home/hudson/hudson-slave/workspace/Lucene-Solr-Tests-4.x-java7/solr/build/solr-core/test-files/solr
[junit4:junit4]   2> 393 T2185 oasc.CoreContainer$Initializer.initialize looking for solr.xml: /usr/home/hudson/hudson-slave/workspace/Lucene-Solr-Tests-4.x-java7/solr/build/solr-core/test-files/solr/solr.xml
[junit4:junit4]   2> 393 T2185 oasc.CoreContainer.<init> New CoreContainer 152466223
[junit4:junit4]   2> 393 T2185 oasc.CoreContainer.load Loading CoreContainer using Solr Home: '/usr/home/hudson/hudson-slave/workspace/Lucene-Solr-Tests-4.x-java7/solr/build/solr-core/test-files/solr/'
[junit4:junit4]   2> 394 T2185 oasc.SolrResourceLoader.<init> new SolrResourceLoader for directory: '/usr/home/hudson/hudson-slave/workspace/Lucene-Solr-Tests-4.x-java7/solr/build/solr-core/test-files/solr/'
[junit4:junit4]   2> 419 T2185 oasc.CoreContainer.load Registering Log Listener
[junit4:junit4]   2> 430 T2185 oasc.CoreContainer.initZooKeeper Zookeeper client=127.0.0.1:39608/solr
[junit4:junit4]   2> 431 T2185 oaz.ZooKeeper.<init> Initiating client connection, connectString=127.0.0.1:39608/solr sessionTimeout=5000 watcher=org.apache.solr.common.cloud.ConnectionManager@666c5d34
[junit4:junit4]   2> 432 T2204 oaz.ClientCnxn$SendThread.startConnect Opening socket connection to server /127.0.0.1:39608
[junit4:junit4]   2> 432 T2185 oascc.ConnectionManager.waitForConnected Waiting for client to connect to ZooKeeper
[junit4:junit4]   2> 433 T2204 oaz.ClientCnxn$SendThread.primeConnection Socket connection established to localhost/127.0.0.1:39608, initiating session
[junit4:junit4]   2> 433 T2187 oazs.NIOServerCnxn$Factory.run Accepted socket connection from /140.211.11.196:39613
[junit4:junit4]   2> 433 T2187 oazs.NIOServerCnxn.readConnectRequest Client attempting to establish new session at /140.211.11.196:39613
[junit4:junit4]   2> 437 T2189 oazs.NIOServerCnxn.finishSessionInit Established session 0x139d38b479a0002 with negotiated timeout 5000 for client /140.211.11.196:39613
[junit4:junit4]   2> 437 T2204 oaz.ClientCnxn$SendThread.readConnectResult Session establishment complete on server localhost/127.0.0.1:39608, sessionid = 0x139d38b479a0002, negotiated timeout = 5000
[junit4:junit4]   2> 437 T2205 oascc.ConnectionManager.process Watcher org.apache.solr.common.cloud.ConnectionManager@666c5d34 name:ZooKeeperConnection Watcher:127.0.0.1:39608/solr got event WatchedEvent state:SyncConnected type:None path:null path:null type:None
[junit4:junit4]   2> 437 T2185 oascc.ConnectionManager.waitForConnected Client is connected to ZooKeeper
[junit4:junit4]   2> 439 T2190 oazs.PrepRequestProcessor.pRequest Got user-level KeeperException when processing sessionid:0x139d38b479a0002 type:create cxid:0x2 zxid:0xfffffffffffffffe txntype:unknown reqpath:n/a Error Path:/solr/overseer Error:KeeperErrorCode = NodeExists for /solr/overseer
[junit4:junit4]   2> 449 T2185 oascc.SolrZkClient.makePath makePath: /live_nodes
[junit4:junit4]   2> 453 T2185 oasc.ZkController.createEphemeralLiveNode Register node as live in ZooKeeper:/live_nodes/127.0.0.1:39612_solr
[junit4:junit4]   2> 453 T2190 oazs.PrepRequestProcessor.pRequest Got user-level KeeperException when processing sessionid:0x139d38b479a0002 type:delete cxid:0x7 zxid:0xfffffffffffffffe txntype:unknown reqpath:n/a Error Path:/solr/live_nodes/127.0.0.1:39612_solr Error:KeeperErrorCode = NoNode for /solr/live_nodes/127.0.0.1:39612_solr
[junit4:junit4]   2> 460 T2185 oascc.SolrZkClient.makePath makePath: /live_nodes/127.0.0.1:39612_solr
[junit4:junit4]   2> 469 T2185 oashc.HttpShardHandlerFactory.getParameter Setting socketTimeout to: 0
[junit4:junit4]   2> 470 T2185 oashc.HttpShardHandlerFactory.getParameter Setting urlScheme to: http://
[junit4:junit4]   2> 470 T2185 oashc.HttpShardHandlerFactory.getParameter Setting connTimeout to: 0
[junit4:junit4]   2> 470 T2185 oashc.HttpShardHandlerFactory.getParameter Setting maxConnectionsPerHost to: 20
[junit4:junit4]   2> 471 T2185 oashc.HttpShardHandlerFactory.getParameter Setting corePoolSize to: 0
[junit4:junit4]   2> 471 T2185 oashc.HttpShardHandlerFactory.getParameter Setting maximumPoolSize to: 2147483647
[junit4:junit4]   2> 472 T2185 oashc.HttpShardHandlerFactory.getParameter Setting maxThreadIdleTime to: 5
[junit4:junit4]   2> 472 T2185 oashc.HttpShardHandlerFactory.getParameter Setting sizeOfQueue to: -1
[junit4:junit4]   2> 472 T2185 oashc.HttpShardHandlerFactory.getParameter Setting fairnessPolicy to: false
[junit4:junit4]   2> 473 T2185 oascsi.HttpClientUtil.createClient Creating new http client, config:maxConnectionsPerHost=20&maxConnections=10000&socketTimeout=0&connTimeout=0&retry=false
[junit4:junit4]   2> 484 T2185 oascc.SolrZkClient.makePath makePath: /overseer_elect/election
[junit4:junit4]   2> 501 T2190 oazs.PrepRequestProcessor.pRequest Got user-level KeeperException when processing sessionid:0x139d38b479a0002 type:delete cxid:0x15 zxid:0xfffffffffffffffe txntype:unknown reqpath:n/a Error Path:/solr/overseer_elect/leader Error:KeeperErrorCode = NoNode for /solr/overseer_elect/leader
[junit4:junit4]   2> 508 T2185 oascc.SolrZkClient.makePath makePath: /overseer_elect/leader
[junit4:junit4]   2> 518 T2185 oasc.Overseer.start Overseer (id=88334262865625090-127.0.0.1:39612_solr-n_0000000000) starting
[junit4:junit4]   2> 519 T2190 oazs.PrepRequestProcessor.pRequest Got user-level KeeperException when processing sessionid:0x139d38b479a0002 type:create cxid:0x1a zxid:0xfffffffffffffffe txntype:unknown reqpath:n/a Error Path:/solr/overseer Error:KeeperErrorCode = NodeExists for /solr/overseer
[junit4:junit4]   2> 529 T2190 oazs.PrepRequestProcessor.pRequest Got user-level KeeperException when processing sessionid:0x139d38b479a0002 type:create cxid:0x1b zxid:0xfffffffffffffffe txntype:unknown reqpath:n/a Error Path:/solr/overseer Error:KeeperErrorCode = NodeExists for /solr/overseer
[junit4:junit4]   2> 530 T2190 oazs.PrepRequestProcessor.pRequest Got user-level KeeperException when processing sessionid:0x139d38b479a0002 type:create cxid:0x1c zxid:0xfffffffffffffffe txntype:unknown reqpath:n/a Error Path:/solr/overseer Error:KeeperErrorCode = NodeExists for /solr/overseer
[junit4:junit4]   2> 537 T2190 oazs.PrepRequestProcessor.pRequest Got user-level KeeperException when processing sessionid:0x139d38b479a0002 type:create cxid:0x1d zxid:0xfffffffffffffffe txntype:unknown reqpath:n/a Error Path:/solr/overseer Error:KeeperErrorCode = NodeExists for /solr/overseer
[junit4:junit4]   2> 538 T2207 oasc.OverseerCollectionProcessor.run Process current queue of collection creations
[junit4:junit4]   2> 538 T2185 oascc.SolrZkClient.makePath makePath: /clusterstate.json
[junit4:junit4]   2> 546 T2185 oascc.ZkStateReader.createClusterStateWatchersAndUpdate Updating cluster state from ZooKeeper... 
[junit4:junit4]   2> 547 T2206 oasc.Overseer$ClusterStateUpdater.run Starting to work on the main queue
[junit4:junit4]   2> 551 T2185 oasc.CoreContainer.create Creating SolrCore 'collection1' using instanceDir: /usr/home/hudson/hudson-slave/workspace/Lucene-Solr-Tests-4.x-java7/solr/build/solr-core/test-files/solr/collection1
[junit4:junit4]   2> 552 T2185 oasc.ZkController.createCollectionZkNode Check for collection zkNode:control_collection
[junit4:junit4]   2> 552 T2185 oasc.ZkController.createCollectionZkNode Collection zkNode exists
[junit4:junit4]   2> 552 T2185 oasc.ZkController.readConfigName Load collection config from:/collections/control_collection
[junit4:junit4]   2> 553 T2185 oasc.SolrResourceLoader.<init> new SolrResourceLoader for directory: '/usr/home/hudson/hudson-slave/workspace/Lucene-Solr-Tests-4.x-java7/solr/build/solr-core/test-files/solr/collection1/'
[junit4:junit4]   2> 554 T2185 oasc.SolrResourceLoader.replaceClassLoader Adding 'file:/usr/home/hudson/hudson-slave/workspace/Lucene-Solr-Tests-4.x-java7/solr/build/solr-core/test-files/solr/collection1/lib/classes/' to classloader
[junit4:junit4]   2> 555 T2185 oasc.SolrResourceLoader.replaceClassLoader Adding 'file:/usr/home/hudson/hudson-slave/workspace/Lucene-Solr-Tests-4.x-java7/solr/build/solr-core/test-files/solr/collection1/lib/README' to classloader
[junit4:junit4]   2> 591 T2185 oasc.SolrConfig.<init> Using Lucene MatchVersion: LUCENE_40
[junit4:junit4]   2> 641 T2185 oasc.SolrConfig.<init> Loaded SolrConfig: solrconfig.xml
[junit4:junit4]   2> 742 T2185 oass.IndexSchema.readSchema Reading Solr Schema
[junit4:junit4]   2> 750 T2185 oass.IndexSchema.readSchema Schema name=test
[junit4:junit4]   2> 1390 T2185 oass.OpenExchangeRatesOrgProvider.init Initialized with rates=open-exchange-rates.json, refreshInterval=1440.
[junit4:junit4]   2> 1403 T2185 oass.IndexSchema.readSchema default search field in schema is text
[junit4:junit4]   2> 1408 T2185 oass.IndexSchema.readSchema unique key field: id
[junit4:junit4]   2> 1420 T2185 oass.FileExchangeRateProvider.reload Reloading exchange rates from file currency.xml
[junit4:junit4]   2> 1425 T2185 oass.FileExchangeRateProvider.reload Reloading exchange rates from file currency.xml
[junit4:junit4]   2> 1430 T2185 oass.OpenExchangeRatesOrgProvider.reload Reloading exchange rates from open-exchange-rates.json
[junit4:junit4]   2> 1431 T2185 oass.OpenExchangeRatesOrgProvider.reload Reloading exchange rates from open-exchange-rates.json
[junit4:junit4]   2> 1432 T2185 oasc.SolrCore.<init> [collection1] Opening new SolrCore at /usr/home/hudson/hudson-slave/workspace/Lucene-Solr-Tests-4.x-java7/solr/build/solr-core/test-files/solr/collection1/, dataDir=./org.apache.solr.cloud.BasicDistributedZk2Test-1347873884054/control/data/
[junit4:junit4]   2> 1433 T2185 oasc.JmxMonitoredMap.<init> JMX monitoring is enabled. Adding Solr mbeans to JMX Server: com.sun.jmx.mbeanserver.JmxMBeanServer@2c24be25
[junit4:junit4]   2> 1434 T2185 oasc.SolrCore.getNewIndexDir WARNING New index directory detected: old=null new=./org.apache.solr.cloud.BasicDistributedZk2Test-1347873884054/control/data/index/
[junit4:junit4]   2> 1436 T2185 oasc.SolrCore.initIndex WARNING [collection1] Solr index directory './org.apache.solr.cloud.BasicDistributedZk2Test-1347873884054/control/data/index' doesn't exist. Creating new index...
[junit4:junit4]   2> 1437 T2185 oasc.CachingDirectoryFactory.get return new directory for /usr/home/hudson/hudson-slave/workspace/Lucene-Solr-Tests-4.x-java7/solr/build/solr-core/test/J1/./org.apache.solr.cloud.BasicDistributedZk2Test-1347873884054/control/data/index forceNew:false
[junit4:junit4]   2> 1471 T2185 oasc.SolrDeletionPolicy.onCommit SolrDeletionPolicy.onCommit: commits:num=1
[junit4:junit4]   2> 		commit{dir=NRTCachingDirectory(org.apache.lucene.store.NIOFSDirectory@/usr/home/hudson/hudson-slave/workspace/Lucene-Solr-Tests-4.x-java7/solr/build/solr-core/test/J1/org.apache.solr.cloud.BasicDistributedZk2Test-1347873884054/control/data/index lockFactory=org.apache.lucene.store.NativeFSLockFactory@68a025f4; maxCacheMB=48.0 maxMergeSizeMB=4.0),segFN=segments_1,generation=1,filenames=[segments_1]
[junit4:junit4]   2> 1472 T2185 oasc.SolrDeletionPolicy.updateCommits newest commit = 1
[junit4:junit4]   2> 1473 T2185 oasc.SolrCore.initWriters created xml: solr.XMLResponseWriter
[junit4:junit4]   2> 1476 T2185 oasup.UpdateRequestProcessorChain.init inserting DistributedUpdateProcessorFactory into updateRequestProcessorChain "dedupe"
[junit4:junit4]   2> 1477 T2185 oasup.UpdateRequestProcessorChain.init inserting DistributedUpdateProcessorFactory into updateRequestProcessorChain "dedupe-allfields"
[junit4:junit4]   2> 1477 T2185 oasup.UpdateRequestProcessorChain.init inserting DistributedUpdateProcessorFactory into updateRequestProcessorChain "stored_sig"
[junit4:junit4]   2> 1478 T2185 oasup.UpdateRequestProcessorChain.init inserting DistributedUpdateProcessorFactory into updateRequestProcessorChain "uniq-fields"
[junit4:junit4]   2> 1479 T2185 oasup.UpdateRequestProcessorChain.init inserting DistributedUpdateProcessorFactory into updateRequestProcessorChain "distrib-dup-test-chain-implicit"
[junit4:junit4]   2> 1479 T2185 oasc.RequestHandlers.initHandlersFromConfig adding lazy requestHandler: solr.ReplicationHandler
[junit4:junit4]   2> 1480 T2185 oasc.RequestHandlers.initHandlersFromConfig created /replication: solr.ReplicationHandler
[junit4:junit4]   2> 1481 T2185 oasc.RequestHandlers.initHandlersFromConfig created standard: solr.StandardRequestHandler
[junit4:junit4]   2> 1482 T2185 oasc.RequestHandlers.initHandlersFromConfig created /get: solr.RealTimeGetHandler
[junit4:junit4]   2> 1483 T2185 oasc.RequestHandlers.initHandlersFromConfig created dismax: solr.SearchHandler
[junit4:junit4]   2> 1483 T2185 oasc.RequestHandlers.initHandlersFromConfig created mock: org.apache.solr.core.MockQuerySenderListenerReqHandler
[junit4:junit4]   2> 1484 T2185 oasc.RequestHandlers.initHandlersFromConfig created /admin/: org.apache.solr.handler.admin.AdminHandlers
[junit4:junit4]   2> 1485 T2185 oasc.RequestHandlers.initHandlersFromConfig created defaults: solr.StandardRequestHandler
[junit4:junit4]   2> 1485 T2185 oasc.RequestHandlers.initHandlersFromConfig adding lazy requestHandler: solr.StandardRequestHandler
[junit4:junit4]   2> 1486 T2185 oasc.RequestHandlers.initHandlersFromConfig created lazy: solr.StandardRequestHandler
[junit4:junit4]   2> 1487 T2185 oasc.RequestHandlers.initHandlersFromConfig created /update: solr.UpdateRequestHandler
[junit4:junit4]   2> 1488 T2185 oasc.RequestHandlers.initHandlersFromConfig created /terms: org.apache.solr.handler.component.SearchHandler
[junit4:junit4]   2> 1488 T2185 oasc.RequestHandlers.initHandlersFromConfig created spellCheckCompRH: org.apache.solr.handler.component.SearchHandler
[junit4:junit4]   2> 1489 T2185 oasc.RequestHandlers.initHandlersFromConfig created spellCheckCompRH_Direct: org.apache.solr.handler.component.SearchHandler
[junit4:junit4]   2> 1490 T2185 oasc.RequestHandlers.initHandlersFromConfig created spellCheckWithWordbreak: org.apache.solr.handler.component.SearchHandler
[junit4:junit4]   2> 1491 T2185 oasc.RequestHandlers.initHandlersFromConfig created spellCheckWithWordbreak_Direct: org.apache.solr.handler.component.SearchHandler
[junit4:junit4]   2> 1491 T2185 oasc.RequestHandlers.initHandlersFromConfig created spellCheckCompRH1: org.apache.solr.handler.component.SearchHandler
[junit4:junit4]   2> 1492 T2185 oasc.RequestHandlers.initHandlersFromConfig created tvrh: org.apache.solr.handler.component.SearchHandler
[junit4:junit4]   2> 1493 T2185 oasc.RequestHandlers.initHandlersFromConfig created /mlt: solr.MoreLikeThisHandler
[junit4:junit4]   2> 1494 T2185 oasc.RequestHandlers.initHandlersFromConfig created /debug/dump: solr.DumpRequestHandler
[junit4:junit4]   2> 1498 T2185 oashl.XMLLoader.init xsltCacheLifetimeSeconds=60
[junit4:junit4]   2> 1504 T2185 oasc.SolrCore.initDeprecatedSupport WARNING solrconfig.xml uses deprecated <admin/gettableFiles>, Please update your config to use the ShowFileRequestHandler.
[junit4:junit4]   2> 1505 T2185 oasc.SolrCore.initDeprecatedSupport WARNING adding ShowFileRequestHandler with hidden files: [SCHEMA.XML, OLD_SYNONYMS.TXT, STOPWORDS.TXT, PROTWORDS.TXT, OPEN-EXCHANGE-RATES.JSON, SYNONYMS.TXT, CURRENCY.XML, MAPPING-ISOLATIN1ACCENT.TXT]
[junit4:junit4]   2> 1510 T2185 oass.SolrIndexSearcher.<init> Opening Searcher@6a2ce12b main
[junit4:junit4]   2> 1512 T2185 oasu.CommitTracker.<init> Hard AutoCommit: disabled
[junit4:junit4]   2> 1513 T2185 oasu.CommitTracker.<init> Soft AutoCommit: disabled
[junit4:junit4]   2> 1513 T2185 oashc.SpellCheckComponent.inform Initializing spell checkers
[junit4:junit4]   2> 1530 T2185 oass.DirectSolrSpellChecker.init init: {name=direct,classname=DirectSolrSpellChecker,field=lowerfilt,minQueryLength=3}
[junit4:junit4]   2> 1586 T2208 oasc.SolrCore.registerSearcher [collection1] Registered new searcher Searcher@6a2ce12b main{StandardDirectoryReader(segments_1:1)}
[junit4:junit4]   2> 1592 T2190 oazs.PrepRequestProcessor.pRequest Got user-level KeeperException when processing sessionid:0x139d38b479a0002 type:create cxid:0x56 zxid:0xfffffffffffffffe txntype:unknown reqpath:n/a Error Path:/solr/overseer/queue Error:KeeperErrorCode = NoNode for /solr/overseer/queue
[junit4:junit4]   2> 1601 T2185 oasc.CoreContainer.register registering core: collection1
[junit4:junit4]   2> 1602 T2185 oasc.ZkController.register Register shard - core:collection1 address:http://127.0.0.1:39612/solr shardId:control_shard
[junit4:junit4]   2> 1603 T2185 oascc.SolrZkClient.makePath makePath: /collections/control_collection/leader_elect/control_shard/election
[junit4:junit4]   2> 1621 T2190 oazs.PrepRequestProcessor.pRequest Got user-level KeeperException when processing sessionid:0x139d38b479a0002 type:delete cxid:0x65 zxid:0xfffffffffffffffe txntype:unknown reqpath:n/a Error Path:/solr/collections/control_collection/leaders Error:KeeperErrorCode = NoNode for /solr/collections/control_collection/leaders
[junit4:junit4]   2> 1622 T2185 oasc.ShardLeaderElectionContext.runLeaderProcess Running the leader process.
[junit4:junit4]   2> 1623 T2190 oazs.PrepRequestProcessor.pRequest Got user-level KeeperException when processing sessionid:0x139d38b479a0002 type:create cxid:0x66 zxid:0xfffffffffffffffe txntype:unknown reqpath:n/a Error Path:/solr/overseer Error:KeeperErrorCode = NodeExists for /solr/overseer
[junit4:junit4]   2> 2054 T2206 oascc.ZkStateReader.updateClusterState Updating cloud state from ZooKeeper... 
[junit4:junit4]   2> 2054 T2190 oazs.PrepRequestProcessor.pRequest Got user-level KeeperException when processing sessionid:0x139d38b479a0002 type:create cxid:0x6d zxid:0xfffffffffffffffe txntype:unknown reqpath:n/a Error Path:/solr/overseer/queue-work Error:KeeperErrorCode = NoNode for /solr/overseer/queue-work
[junit4:junit4]   2> 2070 T2205 oascc.ZkStateReader$2.process A cluster state change has occurred - updating...
[junit4:junit4]   2> 2132 T2185 oasc.ShardLeaderElectionContext.waitForReplicasToComeUp Enough replicas found to continue.
[junit4:junit4]   2> 2132 T2185 oasc.ShardLeaderElectionContext.runLeaderProcess I may be the new leader - try and sync
[junit4:junit4]   2> 2133 T2185 oasc.SyncStrategy.sync Sync replicas to http://127.0.0.1:39612/solr/collection1/
[junit4:junit4]   2> 2133 T2185 oasc.SyncStrategy.syncReplicas Sync Success - now sync replicas to me
[junit4:junit4]   2> 2134 T2185 oasc.SyncStrategy.syncToMe http://127.0.0.1:39612/solr/collection1/ has no replicas
[junit4:junit4]   2> 2134 T2185 oasc.ShardLeaderElectionContext.runLeaderProcess I am the new leader: http://127.0.0.1:39612/solr/collection1/
[junit4:junit4]   2> 2134 T2185 oascc.SolrZkClient.makePath makePath: /collections/control_collection/leaders/control_shard
[junit4:junit4]   2> 2137 T2190 oazs.PrepRequestProcessor.pRequest Got user-level KeeperException when processing sessionid:0x139d38b479a0002 type:create cxid:0x8b zxid:0xfffffffffffffffe txntype:unknown reqpath:n/a Error Path:/solr/overseer Error:KeeperErrorCode = NodeExists for /solr/overseer
[junit4:junit4]   2> 2574 T2206 oascc.ZkStateReader.updateClusterState Updating cloud state from ZooKeeper... 
[junit4:junit4]   2> 2586 T2205 oascc.ZkStateReader$2.process A cluster state change has occurred - updating...
[junit4:junit4]   2> 2598 T2185 oasc.ZkController.register We are http://127.0.0.1:39612/solr/collection1/ and leader is http://127.0.0.1:39612/solr/collection1/
[junit4:junit4]   2> 2598 T2185 oasc.ZkController.register No LogReplay needed for core=collection1 baseURL=http://127.0.0.1:39612/solr
[junit4:junit4]   2> 2599 T2185 oasc.ZkController.checkRecovery I am the leader, no recovery necessary
[junit4:junit4]   2> 2600 T2185 oascc.ZkStateReader.updateClusterState Updating cloud state from ZooKeeper... 
[junit4:junit4]   2> 2600 T2185 oass.SolrDispatchFilter.init user.dir=/usr/home/hudson/hudson-slave/workspace/Lucene-Solr-Tests-4.x-java7/solr/build/solr-core/test/J1
[junit4:junit4]   2> 2601 T2185 oass.SolrDispatchFilter.init SolrDispatchFilter.init() done
[junit4:junit4]   2> 2601 T2185 oascsi.HttpClientUtil.createClient Creating new http client, config:maxConnections=128&maxConnectionsPerHost=32&followRedirects=false
[junit4:junit4]   2> 2957 T2185 oejs.Server.doStart jetty-8.1.2.v20120308
[junit4:junit4]   2> 2962 T2185 oejs.AbstractConnector.doStart Started SocketConnector@0.0.0.0:39618
[junit4:junit4]   2> 2962 T2185 oasc.SolrResourceLoader.locateSolrHome JNDI not configured for solr (NoInitialContextEx)
[junit4:junit4]   2> 2963 T2185 oasc.SolrResourceLoader.locateSolrHome using system property solr.solr.home: /usr/home/hudson/hudson-slave/workspace/Lucene-Solr-Tests-4.x-java7/solr/build/solr-core/test/J1/./solrtest-jetty1-1347873886659
[junit4:junit4]   2> 2963 T2185 oasc.SolrResourceLoader.<init> new SolrResourceLoader for deduced Solr Home: '/usr/home/hudson/hudson-slave/workspace/Lucene-Solr-Tests-4.x-java7/solr/build/solr-core/test/J1/./solrtest-jetty1-1347873886659/'
[junit4:junit4]   2> 3010 T2185 oass.SolrDispatchFilter.init SolrDispatchFilter.init()
[junit4:junit4]   2> 3011 T2185 oasc.SolrResourceLoader.locateSolrHome JNDI not configured for solr (NoInitialContextEx)
[junit4:junit4]   2> 3012 T2185 oasc.SolrResourceLoader.locateSolrHome using system property solr.solr.home: /usr/home/hudson/hudson-slave/workspace/Lucene-Solr-Tests-4.x-java7/solr/build/solr-core/test/J1/./solrtest-jetty1-1347873886659
[junit4:junit4]   2> 3012 T2185 oasc.CoreContainer$Initializer.initialize looking for solr.xml: /usr/home/hudson/hudson-slave/workspace/Lucene-Solr-Tests-4.x-java7/solr/build/solr-core/test/J1/./solrtest-jetty1-1347873886659/solr.xml
[junit4:junit4]   2> 3013 T2185 oasc.CoreContainer.<init> New CoreContainer 119848592
[junit4:junit4]   2> 3014 T2185 oasc.CoreContainer.load Loading CoreContainer using Solr Home: '/usr/home/hudson/hudson-slave/workspace/Lucene-Solr-Tests-4.x-java7/solr/build/solr-core/test/J1/./solrtest-jetty1-1347873886659/'
[junit4:junit4]   2> 3014 T2185 oasc.SolrResourceLoader.<init> new SolrResourceLoader for directory: '/usr/home/hudson/hudson-slave/workspace/Lucene-Solr-Tests-4.x-java7/solr/build/solr-core/test/J1/./solrtest-jetty1-1347873886659/'
[junit4:junit4]   2> 3052 T2185 oasc.CoreContainer.load Registering Log Listener
[junit4:junit4]   2> 3070 T2185 oasc.CoreContainer.initZooKeeper Zookeeper client=127.0.0.1:39608/solr
[junit4:junit4]   2> 3071 T2185 oaz.ZooKeeper.<init> Initiating client connection, connectString=127.0.0.1:39608/solr sessionTimeout=5000 watcher=org.apache.solr.common.cloud.ConnectionManager@2d3a799e
[junit4:junit4]   2> 3073 T2218 oaz.ClientCnxn$SendThread.startConnect Opening socket connection to server /127.0.0.1:39608
[junit4:junit4]   2> 3073 T2185 oascc.ConnectionManager.waitForConnected Waiting for client to connect to ZooKeeper
[junit4:junit4]   2> 3074 T2218 oaz.ClientCnxn$SendThread.primeConnection Socket connection established to localhost/127.0.0.1:39608, initiating session
[junit4:junit4]   2> 3074 T2187 oazs.NIOServerCnxn$Factory.run Accepted socket connection from /140.211.11.196:39619
[junit4:junit4]   2> 3074 T2187 oazs.NIOServerCnxn.readConnectRequest Client attempting to establish new session at /140.211.11.196:39619
[junit4:junit4]   2> 3076 T2189 oazs.NIOServerCnxn.finishSessionInit Established session 0x139d38b479a0003 with negotiated timeout 5000 for client /140.211.11.196:39619
[junit4:junit4]   2> 3076 T2218 oaz.ClientCnxn$SendThread.readConnectResult Session establishment complete on server localhost/127.0.0.1:39608, sessionid = 0x139d38b479a0003, negotiated timeout = 5000
[junit4:junit4]   2> 3076 T2219 oascc.ConnectionManager.process Watcher org.apache.solr.common.cloud.ConnectionManager@2d3a799e name:ZooKeeperConnection Watcher:127.0.0.1:39608/solr got event WatchedEvent state:SyncConnected type:None path:null path:null type:None
[junit4:junit4]   2> 3076 T2185 oascc.ConnectionManager.waitForConnected Client is connected to ZooKeeper
[junit4:junit4]   2> 3077 T2190 oazs.PrepRequestProcessor.pRequest Got user-level KeeperException when processing sessionid:0x139d38b479a0003 type:create cxid:0x1 zxid:0xfffffffffffffffe txntype:unknown reqpath:n/a Error Path:/solr/overseer Error:KeeperErrorCode = NodeExists for /solr/overseer
[junit4:junit4]   2> 3078 T2190 oazs.PrepRequestProcessor.pRequest Got user-level KeeperException when processing sessionid:0x139d38b479a0003 type:create cxid:0x2 zxid:0xfffffffffffffffe txntype:unknown reqpath:n/a Error Path:/solr/overseer Error:KeeperErrorCode = NodeExists for /solr/overseer
[junit4:junit4]   2> 3087 T2185 oasc.ZkController.createEphemeralLiveNode Register node as live in ZooKeeper:/live_nodes/127.0.0.1:39618_solr
[junit4:junit4]   2> 3088 T2190 oazs.PrepRequestProcessor.pRequest Got user-level KeeperException when processing sessionid:0x139d38b479a0003 type:delete cxid:0x4 zxid:0xfffffffffffffffe txntype:unknown reqpath:n/a Error Path:/solr/live_nodes/127.0.0.1:39618_solr Error:KeeperErrorCode = NoNode for /solr/live_nodes/127.0.0.1:39618_solr
[junit4:junit4]   2> 3089 T2206 oascc.ZkStateReader.updateClusterState Updating cloud state from ZooKeeper... 
[junit4:junit4]   2> 3089 T2185 oascc.SolrZkClient.makePath makePath: /live_nodes/127.0.0.1:39618_solr
[junit4:junit4]   2> 3093 T2205 oascc.ZkStateReader$3.process Updating live nodes
[junit4:junit4]   2> 3093 T2185 oashc.HttpShardHandlerFactory.getParameter Setting socketTimeout to: 0
[junit4:junit4]   2> 3094 T2185 oashc.HttpShardHandlerFactory.getParameter Setting urlScheme to: http://
[junit4:junit4]   2> 3095 T2185 oashc.HttpShardHandlerFactory.getParameter Setting connTimeout to: 0
[junit4:junit4]   2> 3095 T2185 oashc.HttpShardHandlerFactory.getParameter Setting maxConnectionsPerHost to: 20
[junit4:junit4]   2> 3096 T2185 oashc.HttpShardHandlerFactory.getParameter Setting corePoolSize to: 0
[junit4:junit4]   2> 3096 T2185 oashc.HttpShardHandlerFactory.getParameter Setting maximumPoolSize to: 2147483647
[junit4:junit4]   2> 3097 T2185 oashc.HttpShardHandlerFactory.getParameter Setting maxThreadIdleTime to: 5
[junit4:junit4]   2> 3097 T2185 oashc.HttpShardHandlerFactory.getParameter Setting sizeOfQueue to: -1
[junit4:junit4]   2> 3098 T2185 oashc.HttpShardHandlerFactory.getParameter Setting fairnessPolicy to: false
[junit4:junit4]   2> 3098 T2185 oascsi.HttpClientUtil.createClient Creating new http client, config:maxConnectionsPerHost=20&maxConnections=10000&socketTimeout=0&connTimeout=0&retry=false
[junit4:junit4]   2> 3107 T2205 oascc.ZkStateReader$2.process A cluster state change has occurred - updating...
[junit4:junit4]   2> 3115 T2185 oascc.ZkStateReader.createClusterStateWatchersAndUpdate Updating cluster state from ZooKeeper... 
[junit4:junit4]   2> 3122 T2185 oasc.CoreContainer.create Creating SolrCore 'collection1' using instanceDir: /usr/home/hudson/hudson-slave/workspace/Lucene-Solr-Tests-4.x-java7/solr/build/solr-core/test/J1/./solrtest-jetty1-1347873886659/collection1
[junit4:junit4]   2> 3123 T2185 oasc.ZkController.createCollectionZkNode Check for collection zkNode:collection1
[junit4:junit4]   2> 3124 T2185 oasc.ZkController.createCollectionZkNode Collection zkNode exists
[junit4:junit4]   2> 3124 T2185 oasc.ZkController.readConfigName Load collection config from:/collections/collection1
[junit4:junit4]   2> 3125 T2185 oasc.SolrResourceLoader.<init> new SolrResourceLoader for directory: '/usr/home/hudson/hudson-slave/workspace/Lucene-Solr-Tests-4.x-java7/solr/build/solr-core/test/J1/./solrtest-jetty1-1347873886659/collection1/'
[junit4:junit4]   2> 3127 T2185 oasc.SolrResourceLoader.replaceClassLoader Adding 'file:/usr/home/hudson/hudson-slave/workspace/Lucene-Solr-Tests-4.x-java7/solr/build/solr-core/test/J1/solrtest-jetty1-1347873886659/collection1/lib/classes/' to classloader
[junit4:junit4]   2> 3128 T2185 oasc.SolrResourceLoader.replaceClassLoader Adding 'file:/usr/home/hudson/hudson-slave/workspace/Lucene-Solr-Tests-4.x-java7/solr/build/solr-core/test/J1/solrtest-jetty1-1347873886659/collection1/lib/README' to classloader
[junit4:junit4]   2> 3208 T2185 oasc.SolrConfig.<init> Using Lucene MatchVersion: LUCENE_40
[junit4:junit4]   2> 3283 T2185 oasc.SolrConfig.<init> Loaded SolrConfig: solrconfig.xml
[junit4:junit4]   2> 3384 T2185 oass.IndexSchema.readSchema Reading Solr Schema
[junit4:junit4]   2> 3392 T2185 oass.IndexSchema.readSchema Schema name=test
[junit4:junit4]   2> 4081 T2185 oass.OpenExchangeRatesOrgProvider.init Initialized with rates=open-exchange-rates.json, refreshInterval=1440.
[junit4:junit4]   2> 4094 T2185 oass.IndexSchema.readSchema default search field in schema is text
[junit4:junit4]   2> 4099 T2185 oass.IndexSchema.readSchema unique key field: id
[junit4:junit4]   2> 4111 T2185 oass.FileExchangeRateProvider.reload Reloading exchange rates from file currency.xml
[junit4:junit4]   2> 4117 T2185 oass.FileExchangeRateProvider.reload Reloading exchange rates from file currency.xml
[junit4:junit4]   2> 4122 T2185 oass.OpenExchangeRatesOrgProvider.reload Reloading exchange rates from open-exchange-rates.json
[junit4:junit4]   2> 4124 T2185 oass.OpenExchangeRatesOrgProvider.reload Reloading exchange rates from open-exchange-rates.json
[junit4:junit4]   2> 4125 T2185 oasc.SolrCore.<init> [collection1] Opening new SolrCore at /usr/home/hudson/hudson-slave/workspace/Lucene-Solr-Tests-4.x-java7/solr/build/solr-core/test/J1/./solrtest-jetty1-1347873886659/collection1/, dataDir=./org.apache.solr.cloud.BasicDistributedZk2Test-1347873884054/jetty1/
[junit4:junit4]   2> 4125 T2185 oasc.JmxMonitoredMap.<init> JMX monitoring is enabled. Adding Solr mbeans to JMX Server: com.sun.jmx.mbeanserver.JmxMBeanServer@2c24be25
[junit4:junit4]   2> 4127 T2185 oasc.SolrCore.getNewIndexDir WARNING New index directory detected: old=null new=./org.apache.solr.cloud.BasicDistributedZk2Test-1347873884054/jetty1/index/
[junit4:junit4]   2> 4128 T2185 oasc.SolrCore.initIndex WARNING [collection1] Solr index directory './org.apache.solr.cloud.BasicDistributedZk2Test-1347873884054/jetty1/index' doesn't exist. Creating new index...
[junit4:junit4]   2> 4129 T2185 oasc.CachingDirectoryFactory.get return new directory for /usr/home/hudson/hudson-slave/workspace/Lucene-Solr-Tests-4.x-java7/solr/build/solr-core/test/J1/./org.apache.solr.cloud.BasicDistributedZk2Test-1347873884054/jetty1/index forceNew:false
[junit4:junit4]   2> 4136 T2185 oasc.SolrDeletionPolicy.onCommit SolrDeletionPolicy.onCommit: commits:num=1
[junit4:junit4]   2> 		commit{dir=NRTCachingDirectory(org.apache.lucene.store.NIOFSDirectory@/usr/home/hudson/hudson-slave/workspace/Lucene-Solr-Tests-4.x-java7/solr/build/solr-core/test/J1/org.apache.solr.cloud.BasicDistributedZk2Test-1347873884054/jetty1/index lockFactory=org.apache.lucene.store.NativeFSLockFactory@668a2c0b; maxCacheMB=48.0 maxMergeSizeMB=4.0),segFN=segments_1,generation=1,filenames=[segments_1]
[junit4:junit4]   2> 4137 T2185 oasc.SolrDeletionPolicy.updateCommits newest commit = 1
[junit4:junit4]   2> 4138 T2185 oasc.SolrCore.initWriters created xml: solr.XMLResponseWriter
[junit4:junit4]   2> 4141 T2185 oasup.UpdateRequestProcessorChain.init inserting DistributedUpdateProcessorFactory into updateRequestProcessorChain "dedupe"
[junit4:junit4]   2> 4142 T2185 oasup.UpdateRequestProcessorChain.init inserting DistributedUpdateProcessorFactory into updateRequestProcessorChain "dedupe-allfields"
[junit4:junit4]   2> 4143 T2185 oasup.UpdateRequestProcessorChain.init inserting DistributedUpdateProcessorFactory into updateRequestProcessorChain "stored_sig"
[junit4:junit4]   2> 4143 T2185 oasup.UpdateRequestProcessorChain.init inserting DistributedUpdateProcessorFactory into updateRequestProcessorChain "uniq-fields"
[junit4:junit4]   2> 4144 T2185 oasup.UpdateRequestProcessorChain.init inserting DistributedUpdateProcessorFactory into updateRequestProcessorChain "distrib-dup-test-chain-implicit"
[junit4:junit4]   2> 4145 T2185 oasc.RequestHandlers.initHandlersFromConfig adding lazy requestHandler: solr.ReplicationHandler
[junit4:junit4]   2> 4146 T2185 oasc.RequestHandlers.initHandlersFromConfig created /replication: solr.ReplicationHandler
[junit4:junit4]   2> 4146 T2185 oasc.RequestHandlers.initHandlersFromConfig created standard: solr.StandardRequestHandler
[junit4:junit4]   2> 4147 T2185 oasc.RequestHandlers.initHandlersFromConfig created /get: solr.RealTimeGetHandler
[junit4:junit4]   2> 4148 T2185 oasc.RequestHandlers.initHandlersFromConfig created dismax: solr.SearchHandler
[junit4:junit4]   2> 4149 T2185 oasc.RequestHandlers.initHandlersFromConfig created mock: org.apache.solr.core.MockQuerySenderListenerReqHandler
[junit4:junit4]   2> 4150 T2185 oasc.RequestHandlers.initHandlersFromConfig created /admin/: org.apache.solr.handler.admin.AdminHandlers
[junit4:junit4]   2> 4151 T2185 oasc.RequestHandlers.initHandlersFromConfig created defaults: solr.StandardRequestHandler
[junit4:junit4]   2> 4151 T2185 oasc.RequestHandlers.initHandlersFromConfig adding lazy requestHandler: solr.StandardRequestHandler
[junit4:junit4]   2> 4152 T2185 oasc.RequestHandlers.initHandlersFromConfig created lazy: solr.StandardRequestHandler
[junit4:junit4]   2> 4153 T2185 oasc.RequestHandlers.initHandlersFromConfig created /update: solr.UpdateRequestHandler
[junit4:junit4]   2> 4153 T2185 oasc.RequestHandlers.initHandlersFromConfig created /terms: org.apache.solr.handler.component.SearchHandler
[junit4:junit4]   2> 4154 T2185 oasc.RequestHandlers.initHandlersFromConfig created spellCheckCompRH: org.apache.solr.handler.component.SearchHandler
[junit4:junit4]   2> 4155 T2185 oasc.RequestHandlers.initHandlersFromConfig created spellCheckCompRH_Direct: org.apache.solr.handler.component.SearchHandler
[junit4:junit4]   2> 4156 T2185 oasc.RequestHandlers.initHandlersFromConfig created spellCheckWithWordbreak: org.apache.solr.handler.component.SearchHandler
[junit4:junit4]   2> 4157 T2185 oasc.RequestHandlers.initHandlersFromConfig created spellCheckWithWordbreak_Direct: org.apache.solr.handler.component.SearchHandler
[junit4:junit4]   2> 4157 T2185 oasc.RequestHandlers.initHandlersFromConfig created spellCheckCompRH1: org.apache.solr.handler.component.SearchHandler
[junit4:junit4]   2> 4158 T2185 oasc.RequestHandlers.initHandlersFromConfig created tvrh: org.apache.solr.handler.component.SearchHandler
[junit4:junit4]   2> 4159 T2185 oasc.RequestHandlers.initHandlersFromConfig created /mlt: solr.MoreLikeThisHandler
[junit4:junit4]   2> 4160 T2185 oasc.RequestHandlers.initHandlersFromConfig created /debug/dump: solr.DumpRequestHandler
[junit4:junit4]   2> 4164 T2185 oashl.XMLLoader.init xsltCacheLifetimeSeconds=60
[junit4:junit4]   2> 4170 T2185 oasc.SolrCore.initDeprecatedSupport WARNING solrconfig.xml uses deprecated <admin/gettableFiles>, Please update your config to use the ShowFileRequestHandler.
[junit4:junit4]   2> 4178 T2185 oasc.SolrCore.initDeprecatedSupport WARNING adding ShowFileRequestHandler with hidden files: [SCHEMA.XML, OLD_SYNONYMS.TXT, STOPWORDS.TXT, PROTWORDS.TXT, OPEN-EXCHANGE-RATES.JSON, SYNONYMS.TXT, CURRENCY.XML, MAPPING-ISOLATIN1ACCENT.TXT]
[junit4:junit4]   2> 4183 T2185 oass.SolrIndexSearcher.<init> Opening Searcher@63b6811e main
[junit4:junit4]   2> 4185 T2185 oasu.CommitTracker.<init> Hard AutoCommit: disabled
[junit4:junit4]   2> 4186 T2185 oasu.CommitTracker.<init> Soft AutoCommit: disabled
[junit4:junit4]   2> 4187 T2185 oashc.SpellCheckComponent.inform Initializing spell checkers
[junit4:junit4]   2> 4195 T2185 oass.DirectSolrSpellChecker.init init: {name=direct,classname=DirectSolrSpellChecker,field=lowerfilt,minQueryLength=3}
[junit4:junit4]   2> 4252 T2220 oasc.SolrCore.registerSearcher [collection1] Registered new searcher Searcher@63b6811e main{StandardDirectoryReader(segments_1:1)}
[junit4:junit4]   2> 4611 T2206 oascc.ZkStateReader.updateClusterState Updating cloud state from ZooKeeper... 
[junit4:junit4]   2> 4624 T2205 oascc.ZkStateReader$2.process A cluster state change has occurred - updating...
[junit4:junit4]   2> 4624 T2219 oascc.ZkStateReader$2.process A cluster state change has occurred - updating...
[junit4:junit4]   2> 4769 T2185 oasc.CoreContainer.register registering core: collection1
[junit4:junit4]   2> 4769 T2185 oasc.ZkController.register Register shard - core:collection1 address:http://127.0.0.1:39618/solr shardId:shard1
[junit4:junit4]   2> 4770 T2185 oascc.SolrZkClient.makePath makePath: /collections/collection1/leader_elect/shard1/election
[junit4:junit4]   2> 4801 T2190 oazs.PrepRequestProcessor.pRequest Got user-level KeeperException when processing sessionid:0x139d38b479a0003 type:delete cxid:0x42 zxid:0xfffffffffffffffe txntype:unknown reqpath:n/a Error Path:/solr/collections/collection1/leaders Error:KeeperErrorCode = NoNode for /solr/collections/collection1/leaders
[junit4:junit4]   2> 4834 T2185 oasc.ShardLeaderElectionContext.runLeaderProcess Running the leader process.
[junit4:junit4]   2> 4835 T2190 oazs.PrepRequestProcessor.pRequest Got user-level KeeperException when processing sessionid:0x139d38b479a0003 type:create cxid:0x43 zxid:0xfffffffffffffffe txntype:unknown reqpath:n/a Error Path:/solr/overseer Error:KeeperErrorCode = NodeExists for /solr/overseer
[junit4:junit4]   2> 4897 T2185 oasc.ShardLeaderElectionContext.waitForReplicasToComeUp Enough replicas found to continue.
[junit4:junit4]   2> 4898 T2185 oasc.ShardLeaderElectionContext.runLeaderProcess I may be the new leader - try and sync
[junit4:junit4]   2> 4898 T2185 oasc.SyncStrategy.sync Sync replicas to http://127.0.0.1:39618/solr/collection1/
[junit4:junit4]   2> 4899 T2185 oasc.SyncStrategy.syncReplicas Sync Success - now sync replicas to me
[junit4:junit4]   2> 4899 T2185 oasc.SyncStrategy.syncToMe http://127.0.0.1:39618/solr/collection1/ has no replicas
[junit4:junit4]   2> 4899 T2185 oasc.ShardLeaderElectionContext.runLeaderProcess I am the new leader: http://127.0.0.1:39618/solr/collection1/
[junit4:junit4]   2> 4900 T2185 oascc.SolrZkClient.makePath makePath: /collections/collection1/leaders/shard1
[junit4:junit4]   2> 4967 T2190 oazs.PrepRequestProcessor.pRequest Got user-level KeeperException when processing sessionid:0x139d38b479a0003 type:create cxid:0x4d zxid:0xfffffffffffffffe txntype:unknown reqpath:n/a Error Path:/solr/overseer Error:KeeperErrorCode = NodeExists for /solr/overseer
[junit4:junit4]   2> 5127 T2206 oascc.ZkStateReader.updateClusterState Updating cloud state from ZooKeeper... 
[junit4:junit4]   2> 5132 T2219 oascc.ZkStateReader$2.process A cluster state change has occurred - updating...
[junit4:junit4]   2> 5132 T2205 oascc.ZkStateReader$2.process A cluster state change has occurred - updating...
[junit4:junit4]   2> 5154 T2185 oasc.ZkController.register We are http://127.0.0.1:39618/solr/collection1/ and leader is http://127.0.0.1:39618/solr/collection1/
[junit4:junit4]   2> 5154 T2185 oasc.ZkController.register No LogReplay needed for core=collection1 baseURL=http://127.0.0.1:39618/solr
[junit4:junit4]   2> 5155 T2185 oasc.ZkController.checkRecovery I am the leader, no recovery necessary
[junit4:junit4]   2> 5156 T2185 oascc.ZkStateReader.updateClusterState Updating cloud state from ZooKeeper... 
[junit4:junit4]   2> 5156 T2185 oass.SolrDispatchFilter.init user.dir=/usr/home/hudson/hudson-slave/workspace/Lucene-Solr-Tests-4.x-java7/solr/build/solr-core/test/J1
[junit4:junit4]   2> 5157 T2185 oass.SolrDispatchFilter.init SolrDispatchFilter.init() done
[junit4:junit4]   2> 5157 T2185 oascsi.HttpClientUtil.createClient Creating new http client, config:maxConnections=128&maxConnectionsPerHost=32&followRedirects=false
[junit4:junit4]   2> 5501 T2185 oejs.Server.doStart jetty-8.1.2.v20120308
[junit4:junit4]   2> 5505 T2185 oejs.AbstractConnector.doStart Started SocketConnector@0.0.0.0:39623
[junit4:junit4]   2> 5505 T2185 oasc.SolrResourceLoader.locateSolrHome JNDI not configured for solr (NoInitialContextEx)
[junit4:junit4]   2> 5506 T2185 oasc.SolrResourceLoader.locateSolrHome using system property solr.solr.home: /usr/home/hudson/hudson-slave/workspace/Lucene-Solr-Tests-4.x-java7/solr/build/solr-core/test/J1/./solrtest-jetty2-1347873889216
[junit4:junit4]   2> 5506 T2185 oasc.SolrResourceLoader.<init> new SolrResourceLoader for deduced Solr Home: '/usr/home/hudson/hudson-slave/workspace/Lucene-Solr-Tests-4.x-java7/solr/build/solr-core/test/J1/./solrtest-jetty2-1347873889216/'
[junit4:junit4]   2> 5541 T2185 oass.SolrDispatchFilter.init SolrDispatchFilter.init()
[junit4:junit4]   2> 5541 T2185 oasc.SolrResourceLoader.locateSolrHome JNDI not configured for solr (NoInitialContextEx)
[junit4:junit4]   2> 5542 T2185 oasc.SolrResourceLoader.locateSolrHome using system property solr.solr.home: /usr/home/hudson/hudson-slave/workspace/Lucene-Solr-Tests-4.x-java7/solr/build/solr-core/test/J1/./solrtest-jetty2-1347873889216
[junit4:junit4]   2> 5542 T2185 oasc.CoreContainer$Initializer.initialize looking for solr.xml: /usr/home/hudson/hudson-slave/workspace/Lucene-Solr-Tests-4.x-java7/solr/build/solr-core/test/J1/./solrtest-jetty2-1347873889216/solr.xml
[junit4:junit4]   2> 5542 T2185 oasc.CoreContainer.<init> New CoreContainer 730433328
[junit4:junit4]   2> 5543 T2185 oasc.CoreContainer.load Loading CoreContainer using Solr Home: '/usr/home/hudson/hudson-slave/workspace/Lucene-Solr-Tests-4.x-java7/solr/build/solr-core/test/J1/./solrtest-jetty2-1347873889216/'
[junit4:junit4]   2> 5543 T2185 oasc.SolrResourceLoader.<init> new SolrResourceLoader for directory: '/usr/home/hudson/hudson-slave/workspace/Lucene-Solr-Tests-4.x-java7/solr/build/solr-core/test/J1/./solrtest-jetty2-1347873889216/'
[junit4:junit4]   2> 5571 T2185 oasc.CoreContainer.load Registering Log Listener
[junit4:junit4]   2> 5584 T2185 oasc.CoreContainer.initZooKeeper Zookeeper client=127.0.0.1:39608/solr
[junit4:junit4]   2> 5584 T2185 oaz.ZooKeeper.<init> Initiating client connection, connectString=127.0.0.1:39608/solr sessionTimeout=5000 watcher=org.apache.solr.common.cloud.ConnectionManager@7af9823
[junit4:junit4]   2> 5585 T2230 oaz.ClientCnxn$SendThread.startConnect Opening socket connection to server /127.0.0.1:39608
[junit4:junit4]   2> 5585 T2185 oascc.ConnectionManager.waitForConnected Waiting for client to connect to ZooKeeper
[junit4:junit4]   2> 5586 T2230 oaz.ClientCnxn$SendThread.primeConnection Socket connection established to localhost/127.0.0.1:39608, initiating session
[junit4:junit4]   2> 5587 T2187 oazs.NIOServerCnxn$Factory.run Accepted socket connection from /140.211.11.196:39624
[junit4:junit4]   2> 5587 T2187 oazs.NIOServerCnxn.readConnectRequest Client attempting to establish new session at /140.211.11.196:39624
[junit4:junit4]   2> 5591 T2189 oazs.NIOServerCnxn.finishSessionInit Established session 0x139d38b479a0004 with negotiated timeout 5000 for client /140.211.11.196:39624
[junit4:junit4]   2> 5591 T2230 oaz.ClientCnxn$SendThread.readConnectResult Session establishment complete on server localhost/127.0.0.1:39608, sessionid = 0x139d38b479a0004, negotiated timeout = 5000
[junit4:junit4]   2> 5592 T2231 oascc.ConnectionManager.process Watcher org.apache.solr.common.cloud.ConnectionManager@7af9823 name:ZooKeeperConnection Watcher:127.0.0.1:39608/solr got event WatchedEvent state:SyncConnected type:None path:null path:null type:None
[junit4:junit4]   2> 5592 T2185 oascc.ConnectionManager.waitForConnected Client is connected to ZooKeeper
[junit4:junit4]   2> 5593 T2190 oazs.PrepRequestProcessor.pRequest Got user-level KeeperException when processing sessionid:0x139d38b479a0004 type:create cxid:0x1 zxid:0xfffffffffffffffe txntype:unknown reqpath:n/a Error Path:/solr/overseer Error:KeeperErrorCode = NodeExists for /solr/overseer
[junit4:junit4]   2> 5610 T2190 oazs.PrepRequestProcessor.pRequest Got user-level KeeperException when processing sessionid:0x139d38b479a0004 type:create cxid:0x2 zxid:0xfffffffffffffffe txntype:unknown reqpath:n/a Error Path:/solr/overseer Error:KeeperErrorCode = NodeExists for /solr/overseer
[junit4:junit4]   2> 5611 T2185 oasc.ZkController.createEphemeralLiveNode Register node as live in ZooKeeper:/live_nodes/127.0.0.1:39623_solr
[junit4:junit4]   2> 5612 T2190 oazs.PrepRequestProcessor.pRequest Got user-level KeeperException when processing sessionid:0x139d38b479a0004 type:delete cxid:0x4 zxid:0xfffffffffffffffe txntype:unknown reqpath:n/a Error Path:/solr/live_nodes/127.0.0.1:39623_solr Error:KeeperErrorCode = NoNode for /solr/live_nodes/127.0.0.1:39623_solr
[junit4:junit4]   2> 5613 T2185 oascc.SolrZkClient.makePath makePath: /live_nodes/127.0.0.1:39623_solr
[junit4:junit4]   2> 5615 T2205 oascc.ZkStateReader$3.process Updating live nodes
[junit4:junit4]   2> 5615 T2219 oascc.ZkStateReader$3.process Updating live nodes
[junit4:junit4]   2> 5615 T2185 oashc.HttpShardHandlerFactory.getParameter Setting socketTimeout to: 0
[junit4:junit4]   2> 5615 T2185 oashc.HttpShardHandlerFactory.getParameter Setting urlScheme to: http://
[junit4:junit4]   2> 5616 T2185 oashc.HttpShardHandlerFactory.getParameter Setting connTimeout to: 0
[junit4:junit4]   2> 5616 T2185 oashc.HttpShardHandlerFactory.getParameter Setting maxConnectionsPerHost to: 20
[junit4:junit4]   2> 5616 T2185 oashc.HttpShardHandlerFactory.getParameter Setting corePoolSize to: 0
[junit4:junit4]   2> 5617 T2185 oashc.HttpShardHandlerFactory.getParameter Setting maximumPoolSize to: 2147483647
[junit4:junit4]   2> 5617 T2185 oashc.HttpShardHandlerFactory.getParameter Setting maxThreadIdleTime to: 5
[junit4:junit4]   2> 5617 T2185 oashc.HttpShardHandlerFactory.getParameter Setting sizeOfQueue to: -1
[junit4:junit4]   2> 5618 T2185 oashc.HttpShardHandlerFactory.getParameter Setting fairnessPolicy to: false
[junit4:junit4]   2> 5618 T2185 oascsi.HttpClientUtil.createClient Creating new http client, config:maxConnectionsPerHost=20&maxConnections=10000&socketTimeout=0&connTimeout=0&retry=false
[junit4:junit4]   2> 5630 T2185 oascc.ZkStateReader.createClusterStateWatchersAndUpdate Updating cluster state from ZooKeeper... 
[junit4:junit4]   2> 5635 T2206 oascc.ZkStateReader.updateClusterState Updating cloud state from ZooKeeper... 
[junit4:junit4]   2> 5636 T2185 oasc.CoreContainer.create Creating SolrCore 'collection1' using instanceDir: /usr/home/hudson/hudson-slave/workspace/Lucene-Solr-Tests-4.x-java7/solr/build/solr-core/test/J1/./solrtest-jetty2-1347873889216/collection1
[junit4:junit4]   2> 5637 T2185 oasc.ZkController.createCollectionZkNode Check for collection zkNode:collection1
[junit4:junit4]   2> 5638 T2185 oasc.ZkController.createCollectionZkNode Collection zkNode exists
[junit4:junit4]   2> 5638 T2185 oasc.ZkController.readConfigName Load collection config from:/collections/collection1
[junit4:junit4]   2> 5639 T2205 oascc.ZkStateReader$2.process A cluster state change has occurred - updating...
[junit4:junit4]   2> 5639 T2231 oascc.ZkStateReader$2.process A cluster state change has occurred - updating...
[junit4:junit4]   2> 5639 T2219 oascc.ZkStateReader$2.process A cluster state change has occurred - updating...
[junit4:junit4]   2> 5639 T2185 oasc.SolrResourceLoader.<init> new SolrResourceLoader for directory: '/usr/home/hudson/hudson-slave/workspace/Lucene-Solr-Tests-4.x-java7/solr/build/solr-core/test/J1/./solrtest-jetty2-1347873889216/collection1/'
[junit4:junit4]   2> 5640 T2185 oasc.SolrResourceLoader.replaceClassLoader Adding 'file:/usr/home/hudson/hudson-slave/workspace/Lucene-Solr-Tests-4.x-java7/solr/build/solr-core/test/J1/solrtest-jetty2-1347873889216/collection1/lib/classes/' to classloader
[junit4:junit4]   2> 5641 T2185 oasc.SolrResourceLoader.replaceClassLoader Adding 'file:/usr/home/hudson/hudson-slave/workspace/Lucene-Solr-Tests-4.x-java7/solr/build/solr-core/test/J1/solrtest-jetty2-1347873889216/collection1/lib/README' to classloader
[junit4:junit4]   2> 5682 T2185 oasc.SolrConfig.<init> Using Lucene MatchVersion: LUCENE_40
[junit4:junit4]   2> 5819 T2185 oasc.SolrConfig.<init> Loaded SolrConfig: solrconfig.xml
[junit4:junit4]   2> 5920 T2185 oass.IndexSchema.readSchema Reading Solr Schema
[junit4:junit4]   2> 5925 T2185 oass.IndexSchema.readSchema Schema name=test
[junit4:junit4]   2> 6379 T2185 oass.OpenExchangeRatesOrgProvider.init Initialized with rates=open-exchange-rates.json, refreshInterval=1440.
[junit4:junit4]   2> 6387 T2185 oass.IndexSchema.readSchema default search field in schema is text
[junit4:junit4]   2> 6390 T2185 oass.IndexSchema.readSchema unique key field: id
[junit4:junit4]   2> 6398 T2185 oass.FileExchangeRateProvider.reload Reloading exchange rates from file currency.xml
[junit4:junit4]   2> 6401 T2185 oass.FileExchangeRateProvider.reload Reloading exchange rates from file currency.xml
[junit4:junit4]   2> 6404 T2185 oass.OpenExchangeRatesOrgProvider.reload Reloading exchange rates from open-exchange-rates.json
[junit4:junit4]   2> 6405 T2185 oass.OpenExchangeRatesOrgProvider.reload Reloading exchange rates from open-exchange-rates.json
[junit4:junit4]   2> 6406 T2185 oasc.SolrCore.<init> [collection1] Opening new SolrCore at /usr/home/hudson/hudson-slave/workspace/Lucene-Solr-Tests-4.x-java7/solr/build/solr-core/test/J1/./solrtest-jetty2-1347873889216/collection1/, dataDir=./org.apache.solr.cloud.BasicDistributedZk2Test-1347873884054/jetty2/
[junit4:junit4]   2> 6406 T2185 oasc.JmxMonitoredMap.<init> JMX monitoring is enabled. Adding Solr mbeans to JMX Server: com.sun.jmx.mbeanserver.JmxMBeanServer@2c24be25
[junit4:junit4]   2> 6407 T2185 oasc.SolrCore.getNewIndexDir WARNING New index directory detected: old=null new=./org.apache.solr.cloud.BasicDistributedZk2Test-1347873884054/jetty2/index/
[junit4:junit4]   2> 6408 T2185 oasc.SolrCore.initIndex WARNING [collection1] Solr index directory './org.apache.solr.cloud.BasicDistributedZk2Test-1347873884054/jetty2/index' doesn't exist. Creating new index...
[junit4:junit4]   2> 6409 T2185 oasc.CachingDirectoryFactory.get return new directory for /usr/home/hudson/hudson-slave/workspace/Lucene-Solr-Tests-4.x-java7/solr/build/solr-core/test/J1/./org.apache.solr.cloud.BasicDistributedZk2Test-1347873884054/jetty2/index forceNew:false
[junit4:junit4]   2> 6414 T2185 oasc.SolrDeletionPolicy.onCommit SolrDeletionPolicy.onCommit: commits:num=1
[junit4:junit4]   2> 		commit{dir=NRTCachingDirectory(org.apache.lucene.store.NIOFSDirectory@/usr/home/hudson/hudson-slave/workspace/Lucene-Solr-Tests-4.x-java7/solr/build/solr-core/test/J1/org.apache.solr.cloud.BasicDistributedZk2Test-1347873884054/jetty2/index lockFactory=org.apache.lucene.store.NativeFSLockFactory@7391d9e2; maxCacheMB=48.0 maxMergeSizeMB=4.0),segFN=segments_1,generation=1,filenames=[segments_1]
[junit4:junit4]   2> 6414 T2185 oasc.SolrDeletionPolicy.updateCommits newest commit = 1
[junit4:junit4]   2> 6415 T2185 oasc.SolrCore.initWriters created xml: solr.XMLResponseWriter
[junit4:junit4]   2> 6417 T2185 oasup.UpdateRequestProcessorChain.init inserting DistributedUpdateProcessorFactory into updateRequestProcessorChain "dedupe"
[junit4:junit4]   2> 6417 T2185 oasup.UpdateRequestProcessorChain.init inserting DistributedUpdateProcessorFactory into updateRequestProcessorChain "dedupe-allfields"
[junit4:junit4]   2> 6418 T2185 oasup.UpdateRequestProcessorChain.init inserting DistributedUpdateProcessorFactory into updateRequestProcessorChain "stored_sig"
[junit4:junit4]   2> 6418 T2185 oasup.UpdateRequestProcessorChain.init inserting DistributedUpdateProcessorFactory into updateRequestProcessorChain "uniq-fields"
[junit4:junit4]   2> 6419 T2185 oasup.UpdateRequestProcessorChain.init inserting DistributedUpdateProcessorFactory into updateRequestProcessorChain "distrib-dup-test-chain-implicit"
[junit4:junit4]   2> 6419 T2185 oasc.RequestHandlers.initHandlersFromConfig adding lazy requestHandler: solr.ReplicationHandler
[junit4:junit4]   2> 6420 T2185 oasc.RequestHandlers.initHandlersFromConfig created /replication: solr.ReplicationHandler
[junit4:junit4]   2> 6420 T2185 oasc.RequestHandlers.initHandlersFromConfig created standard: solr.StandardRequestHandler
[junit4:junit4]   2> 6421 T2185 oasc.RequestHandlers.initHandlersFromConfig created /get: solr.RealTimeGetHandler
[junit4:junit4]   2> 6421 T2185 oasc.RequestHandlers.initHandlersFromConfig created dismax: solr.SearchHandler
[junit4:junit4]   2> 6422 T2185 oasc.RequestHandlers.initHandlersFromConfig created mock: org.apache.solr.core.MockQuerySenderListenerReqHandler
[junit4:junit4]   2> 6422 T2185 oasc.RequestHandlers.initHandlersFromConfig created /admin/: org.apache.solr.handler.admin.AdminHandlers
[junit4:junit4]   2> 6423 T2185 oasc.RequestHandlers.initHandlersFromConfig created defaults: solr.StandardRequestHandler
[junit4:junit4]   2> 6423 T2185 oasc.RequestHandlers.initHandlersFromConfig adding lazy requestHandler: solr.StandardRequestHandler
[junit4:junit4]   2> 6424 T2185 oasc.RequestHandlers.initHandlersFromConfig created lazy: solr.StandardRequestHandler
[junit4:junit4]   2> 6424 T2185 oasc.RequestHandlers.initHandlersFromConfig created /update: solr.UpdateRequestHandler
[junit4:junit4]   2> 6425 T2185 oasc.RequestHandlers.initHandlersFromConfig created /terms: org.apache.solr.handler.component.SearchHandler
[junit4:junit4]   2> 6425 T2185 oasc.RequestHandlers.initHandlersFromConfig created spellCheckCompRH: org.apache.solr.handler.component.SearchHandler
[junit4:junit4]   2> 6426 T2185 oasc.RequestHandlers.initHandlersFromConfig created spellCheckCompRH_Direct: org.apache.solr.handler.component.SearchHandler
[junit4:junit4]   2> 6426 T2185 oasc.RequestHandlers.initHandlersFromConfig created spellCheckWithWordbreak: org.apache.solr.handler.component.SearchHandler
[junit4:junit4]   2> 6427 T2185 oasc.RequestHandlers.initHandlersFromConfig created spellCheckWithWordbreak_Direct: org.apache.solr.handler.component.SearchHandler
[junit4:junit4]   2> 6427 T2185 oasc.RequestHandlers.initHandlersFromConfig created spellCheckCompRH1: org.apache.solr.handler.component.SearchHandler
[junit4:junit4]   2> 6428 T2185 oasc.RequestHandlers.initHandlersFromConfig created tvrh: org.apache.solr.handler.component.SearchHandler
[junit4:junit4]   2> 6429 T2185 oasc.RequestHandlers.initHandlersFromConfig created /mlt: solr.MoreLikeThisHandler
[junit4:junit4]   2> 6429 T2185 oasc.RequestHandlers.initHandlersFromConfig created /debug/dump: solr.DumpRequestHandler
[junit4:junit4]   2> 6432 T2185 oashl.XMLLoader.init xsltCacheLifetimeSeconds=60
[junit4:junit4]   2> 6435 T2185 oasc.SolrCore.initDeprecatedSupport WARNING solrconfig.xml uses deprecated <admin/gettableFiles>, Please update your config to use the ShowFileRequestHandler.
[junit4:junit4]   2> 6436 T2185 oasc.SolrCore.initDeprecatedSupport WARNING adding ShowFileRequestHandler with hidden files: [SCHEMA.XML, OLD_SYNONYMS.TXT, STOPWORDS.TXT, PROTWORDS.TXT, OPEN-EXCHANGE-RATES.JSON, SYNONYMS.TXT, CURRENCY.XML, MAPPING-ISOLATIN1ACCENT.TXT]
[junit4:junit4]   2> 6439 T2185 oass.SolrIndexSearcher.<init> Opening Searcher@20ef3432 main
[junit4:junit4]   2> 6440 T2185 oasu.CommitTracker.<init> Hard AutoCommit: disabled
[junit4:junit4]   2> 6440 T2185 oasu.CommitTracker.<init> Soft AutoCommit: disabled
[junit4:junit4]   2> 6441 T2185 oashc.SpellCheckComponent.inform Initializing spell checkers
[junit4:junit4]   2> 6456 T2185 oass.DirectSolrSpellChecker.init init: {name=direct,classname=DirectSolrSpellChecker,field=lowerfilt,minQueryLength=3}
[junit4:junit4]   2> 6502 T2232 oasc.SolrCore.registerSearcher [collection1] Registered new searcher Searcher@20ef3432 main{StandardDirectoryReader(segments_1:1)}
[junit4:junit4]   2> 6642 T2206 oascc.ZkStateReader.updateClusterState Updating cloud state from ZooKeeper... 
[junit4:junit4]   2> 6655 T2205 oascc.ZkStateReader$2.process A cluster state change has occurred - updating...
[junit4:junit4]   2> 6655 T2231 oascc.ZkStateReader$2.process A cluster state change has occurred - updating...
[junit4:junit4]   2> 6655 T2219 oascc.ZkStateReader$2.process A cluster state change has occurred - updating...
[junit4:junit4]   2> 7008 T2185 oasc.CoreContainer.register registering core: collection1
[junit4:junit4]   2> 7008 T2185 oasc.ZkController.register Register shard - core:collection1 address:http://127.0.0.1:39623/solr shardId:shard2
[junit4:junit4]   2> 7009 T2185 oascc.SolrZkClient.makePath makePath: /collections/collection1/leader_elect/shard2/election
[junit4:junit4]   2> 7022 T2190 oazs.PrepRequestProcessor.pRequest Got user-level KeeperException when processing sessionid:0x139d38b479a0004 type:delete cxid:0x42 zxid:0xfffffffffffffffe txntype:unknown reqpath:n/a Error Path:/solr/collections/collection1/leaders/shard2 Error:KeeperErrorCode = NoNode for /solr/collections/collection1/leaders/shard2
[junit4:junit4]   2> 7023 T2185 oasc.ShardLeaderElectionContext.runLeaderProcess Running the leader process.
[junit4:junit4]   2> 7023 T2190 oazs.PrepRequestProcessor.pRequest Got user-level KeeperException when processing sessionid:0x139d38b479a0004 type:create cxid:0x43 zxid:0xfffffffffffffffe txntype:unknown reqpath:n/a Error Path:/solr/overseer Error:KeeperErrorCode = NodeExists for /solr/overseer
[junit4:junit4]   2> 7033 T2185 oasc.ShardLeaderElectionContext.waitForReplicasToComeUp Enough replicas found to continue.
[junit4:junit4]   2> 7033 T2185 oasc.ShardLeaderElectionContext.runLeaderProcess I may be the new leader - try and sync
[junit4:junit4]   2> 7034 T2185 oasc.SyncStrategy.sync Sync replicas to http://127.0.0.1:39623/solr/collection1/
[junit4:junit4]   2> 7034 T2185 oasc.SyncStrategy.syncReplicas Sync Success - now sync replicas to me
[junit4:junit4]   2> 7034 T2185 oasc.SyncStrategy.syncToMe http://127.0.0.1:39623/solr/collection1/ has no replicas
[junit4:junit4]   2> 7035 T2185 oasc.ShardLeaderElectionContext.runLeaderProcess I am the new leader: http://127.0.0.1:39623/solr/collection1/
[junit4:junit4]   2> 7035 T2185 oascc.SolrZkClient.makePath makePath: /collections/collection1/leaders/shard2
[junit4:junit4]   2> 7037 T2190 oazs.PrepRequestProcessor.pRequest Got user-level KeeperException when processing sessionid:0x139d38b479a0004 type:create cxid:0x4c zxid:0xfffffffffffffffe txntype:unknown reqpath:n/a Error Path:/solr/overseer Error:KeeperErrorCode = NodeExists for /solr/overseer
[junit4:junit4]   2> 7158 T2206 oascc.ZkStateReader.updateClusterState Updating cloud state from ZooKeeper... 
[junit4:junit4]   2> 7172 T2231 oascc.ZkStateReader$2.process A cluster state change has occurred - updating...
[junit4:junit4]   2> 7172 T2219 oascc.ZkStateReader$2.process A cluster state change has occurred - updating...
[junit4:junit4]   2> 7172 T2205 oascc.ZkStateReader$2.process A cluster state change has occurred - updating...
[junit4:junit4]   2> 7201 T2185 oasc.ZkController.register We are http://127.0.0.1:39623/solr/collection1/ and leader is http://127.0.0.1:39623/solr/collection1/
[junit4:junit4]   2> 7201 T2185 oasc.ZkController.register No LogReplay needed for core=collection1 baseURL=http://127.0.0.1:39623/solr
[junit4:junit4]   2> 7202 T2185 oasc.ZkController.checkRecovery I am the leader, no recovery necessary
[junit4:junit4]   2> 7203 T2185 oascc.ZkStateReader.updateClusterState Updating cloud state from ZooKeeper... 
[junit4:junit4]   2> 7204 T2185 oass.SolrDispatchFilter.init user.dir=/usr/home/hudson/hudson-slave/workspace/Lucene-Solr-Tests-4.x-java7/solr/build/solr-core/test/J1
[junit4:junit4]   2> 7204 T2185 oass.SolrDispatchFilter.init SolrDispatchFilter.init() done
[junit4:junit4]   2> 7205 T2185 oascsi.HttpClientUtil.createClient Creating new http client, config:maxConnections=128&maxConnectionsPerHost=32&followRedirects=false
[junit4:junit4]   2> 7521 T2185 oejs.Server.doStart jetty-8.1.2.v20120308
[junit4:junit4]   2> 7525 T2185 oejs.AbstractConnector.doStart Started SocketConnector@0.0.0.0:39628
[junit4:junit4]   2> 7526 T2185 oasc.SolrResourceLoader.locateSolrHome JNDI not configured for solr (NoInitialContextEx)
[junit4:junit4]   2> 7526 T2185 oasc.SolrResourceLoader.locateSolrHome using system property solr.solr.home: /usr/home/hudson/hudson-slave/workspace/Lucene-Solr-Tests-4.x-java7/solr/build/solr-core/test/J1/./solrtest-jetty3-1347873891265
[junit4:junit4]   2> 7526 T2185 oasc.SolrResourceLoader.<init> new SolrResourceLoader for deduced Solr Home: '/usr/home/hudson/hudson-slave/workspace/Lucene-Solr-Tests-4.x-java7/solr/build/solr-core/test/J1/./solrtest-jetty3-1347873891265/'
[junit4:junit4]   2> 7556 T2185 oass.SolrDispatchFilter.init SolrDispatchFilter.init()
[junit4:junit4]   2> 7556 T2185 oasc.SolrResourceLoader.locateSolrHome JNDI not configured for solr (NoInitialContextEx)
[junit4:junit4]   2> 7557 T2185 oasc.SolrResourceLoader.locateSolrHome using system property solr.solr.home: /usr/home/hudson/hudson-slave/workspace/Lucene-Solr-Tests-4.x-java7/solr/build/solr-core/test/J1/./solrtest-jetty3-1347873891265
[junit4:junit4]   2> 7557 T2185 oasc.CoreContainer$Initializer.initialize looking for solr.xml: /usr/home/hudson/hudson-slave/workspace/Lucene-Solr-Tests-4.x-java7/solr/build/solr-core/test/J1/./solrtest-jetty3-1347873891265/solr.xml
[junit4:junit4]   2> 7557 T2185 oasc.CoreContainer.<init> New CoreContainer 516911196
[junit4:junit4]   2> 7558 T2185 oasc.CoreContainer.load Loading CoreContainer using Solr Home: '/usr/home/hudson/hudson-slave/workspace/Lucene-Solr-Tests-4.x-java7/solr/build/solr-core/test/J1/./solrtest-jetty3-1347873891265/'
[junit4:junit4]   2> 7558 T2185 oasc.SolrResourceLoader.<init> new SolrResourceLoader for directory: '/usr/home/hudson/hudson-slave/workspace/Lucene-Solr-Tests-4.x-java7/solr/build/solr-core/test/J1/./solrtest-jetty3-1347873891265/'
[junit4:junit4]   2> 7583 T2185 oasc.CoreContainer.load Registering Log Listener
[junit4:junit4]   2> 7594 T2185 oasc.CoreContainer.initZooKeeper Zookeeper client=127.0.0.1:39608/solr
[junit4:junit4]   2> 7595 T2185 oaz.ZooKeeper.<init> Initiating client connection, connectString=127.0.0.1:39608/solr sessionTimeout=5000 watcher=org.apache.solr.common.cloud.ConnectionManager@3aa9e7dc
[junit4:junit4]   2> 7596 T2242 oaz.ClientCnxn$SendThread.startConnect Opening socket connection to server /127.0.0.1:39608
[junit4:junit4]   2> 7596 T2185 oascc.ConnectionManager.waitForConnected Waiting for client to connect to ZooKeeper
[junit4:junit4]   2> 7597 T2242 oaz.ClientCnxn$SendThread.primeConnection Socket connection established to localhost/127.0.0.1:39608, initiating session
[junit4:junit4]   2> 7597 T2187 oazs.NIOServerCnxn$Factory.run Accepted socket connection from /140.211.11.196:39629
[junit4:junit4]   2> 7597 T2187 oazs.NIOServerCnxn.readConnectRequest Client attempting to establish new session at /140.211.11.196:39629
[junit4:junit4]   2> 7598 T2189 oazs.NIOServerCnxn.finishSessionInit Established session 0x139d38b479a0005 with negotiated timeout 5000 for client /140.211.11.196:39629
[junit4:junit4]   2> 7599 T2242 oaz.ClientCnxn$SendThread.readConnectResult Session establishment complete on server localhost/127.0.0.1:39608, sessionid = 0x139d38b479a0005, negotiated timeout = 5000
[junit4:junit4]   2> 7599 T2243 oascc.ConnectionManager.process Watcher org.apache.solr.common.cloud.ConnectionManager@3aa9e7dc name:ZooKeeperConnection Watcher:127.0.0.1:39608/solr got event WatchedEvent state:SyncConnected type:None path:null path:null type:None
[junit4:junit4]   2> 7599 T2185 oascc.ConnectionManager.waitForConnected Client is connected to ZooKeeper
[junit4:junit4]   2> 7600 T2190 oazs.PrepRequestProcessor.pRequest Got user-level KeeperException when processing sessionid:0x139d38b479a0005 type:create cxid:0x1 zxid:0xfffffffffffffffe txntype:unknown reqpath:n/a Error Path:/solr/overseer Error:KeeperErrorCode = NodeExists for /solr/overseer
[junit4:junit4]   2> 7601 T2190 oazs.PrepRequestProcessor.pRequest Got user-level KeeperException when processing sessionid:0x139d38b479a0005 type:create cxid:0x2 zxid:0xfffffffffffffffe txntype:unknown reqpath:n/a Error Path:/solr/overseer Error:KeeperErrorCode = NodeExists for /solr/overseer
[junit4:junit4]   2> 7608 T2185 oasc.ZkController.createEphemeralLiveNode Register node as live in ZooKeeper:/live_nodes/127.0.0.1:39628_solr
[junit4:junit4]   2> 7609 T2190 oazs.PrepRequestProcessor.pRequest Got user-level KeeperException when processing sessionid:0x139d38b479a0005 type:delete cxid:0x4 zxid:0xfffffffffffffffe txntype:unknown reqpath:n/a Error Path:/solr/live_nodes/127.0.0.1:39628_solr Error:KeeperErrorCode = NoNode for /solr/live_nodes/127.0.0.1:39628_solr
[junit4:junit4]   2> 7610 T2185 oascc.SolrZkClient.makePath makePath: /live_nodes/127.0.0.1:39628_solr
[junit4:junit4]   2> 7616 T2231 oascc.ZkStateReader$3.process Updating live nodes
[junit4:junit4]   2> 7616 T2219 oascc.ZkStateReader$3.process Updating live nodes
[junit4:junit4]   2> 7616 T2205 oascc.ZkStateReader$3.process Updating live nodes
[junit4:junit4]   2> 7616 T2185 oashc.HttpShardHandlerFactory.getParameter Setting socketTimeout to: 0
[junit4:junit4]   2> 7617 T2185 oashc.HttpShardHandlerFactory.getParameter Setting urlScheme to: http://
[junit4:junit4]   2> 7617 T2185 oashc.HttpShardHandlerFactory.getParameter Setting connTimeout to: 0
[junit4:junit4]   2> 7617 T2185 oashc.HttpShardHandlerFactory.getParameter Setting maxConnectionsPerHost to: 20
[junit4:junit4]   2> 7618 T2185 oashc.HttpShardHandlerFactory.getParameter Setting corePoolSize to: 0
[junit4:junit4]   2> 7618 T2185 oashc.HttpShardHandlerFactory.getParameter Setting maximumPoolSize to: 2147483647
[junit4:junit4]   2> 7618 T2185 oashc.HttpShardHandlerFactory.getParameter Setting maxThreadIdleTime to: 5
[junit4:junit4]   2> 7619 T2185 oashc.HttpShardHandlerFactory.getParameter Setting sizeOfQueue to: -1
[junit4:junit4]   2> 7619 T2185 oashc.HttpShardHandlerFactory.getParameter Setting fairnessPolicy to: false
[junit4:junit4]   2> 7619 T2185 oascsi.HttpClientUtil.createClient Creating new http client, config:maxConnectionsPerHost=20&maxConnections=10000&socketTimeout=0&connTimeout=0&retry=false
[junit4:junit4]   2> 7632 T2185 oascc.ZkStateReader.createClusterStateWatchersAndUpdate Updating cluster state from ZooKeeper... 
[junit4:junit4]   2> 7637 T2185 oasc.CoreContainer.create Creating SolrCore 'collection1' using instanceDir: /usr/home/hudson/hudson-slave/workspace/Lucene-Solr-Tests-4.x-java7/solr/build/solr-core/test/J1/./solrtest-jetty3-1347873891265/collection1
[junit4:junit4]   2> 7637 T2185 oasc.ZkController.createCollectionZkNode Check for collection zkNode:collection1
[junit4:junit4]   2> 7638 T2185 oasc.ZkController.createCollectionZkNode Collection zkNode exists
[junit4:junit4]   2> 7638 T2185 oasc.ZkController.readConfigName Load collection config from:/collections/collection1
[junit4:junit4]   2> 7639 T2185 oasc.SolrResourceLoader.<init> new SolrResourceLoader for directory: '/usr/home/hudson/hudson-slave/workspace/Lucene-Solr-Tests-4.x-java7/solr/build/solr-core/test/J1/./solrtest-jetty3-1347873891265/collection1/'
[junit4:junit4]   2> 7640 T2185 oasc.SolrResourceLoader.replaceClassLoader Adding 'file:/usr/home/hudson/hudson-slave/workspace/Lucene-Solr-Tests-4.x-java7/solr/build/solr-core/test/J1/solrtest-jetty3-1347873891265/collection1/lib/classes/' to classloader
[junit4:junit4]   2> 7641 T2185 oasc.SolrResourceLoader.replaceClassLoader Adding 'file:/usr/home/hudson/hudson-slave/workspace/Lucene-Solr-Tests-4.x-java7/solr/build/solr-core/test/J1/solrtest-jetty3-1347873891265/collection1/lib/README' to classloader
[junit4:junit4]   2> 7675 T2206 oascc.ZkStateReader.updateClusterState Updating cloud state from ZooKeeper... 
[junit4:junit4]   2> 7678 T2185 oasc.SolrConfig.<init> Using Lucene MatchVersion: LUCENE_40
[junit4:junit4]   2> 7688 T2231 oascc.ZkStateReader$2.process A cluster state change has occurred - updating...
[junit4:junit4]   2> 7688 T2205 oascc.ZkStateReader$2.process A cluster state change has occurred - updating...
[junit4:junit4]   2> 7688 T2219 oascc.ZkStateReader$2.process A cluster state change has occurred - updating...
[junit4:junit4]   2> 7688 T2243 oascc.ZkStateReader$2.process A cluster state change has occurred - updating...
[junit4:junit4]   2> 7727 T2185 oasc.SolrConfig.<init> Loaded SolrConfig: solrconfig.xml
[junit4:junit4]   2> 7828 T2185 oass.IndexSchema.readSchema Reading Solr Schema
[junit4:junit4]   2> 7833 T2185 oass.IndexSchema.readSchema Schema name=test
[junit4:junit4]   2> 8286 T2185 oass.OpenExchangeRatesOrgProvider.init Initialized with rates=open-exchange-rates.json, refreshInterval=1440.
[junit4:junit4]   2> 8294 T2185 oass.IndexSchema.readSchema default search field in schema is text
[junit4:junit4]   2> 8298 T2185 oass.IndexSchema.readSchema unique key field: id
[junit4:junit4]   2> 8306 T2185 oass.FileExchangeRateProvider.reload Reloading exchange rates from file currency.xml
[junit4:junit4]   2> 8309 T2185 oass.FileExchangeRateProvider.reload Reloading exchange rates from file currency.xml
[junit4:junit4]   2> 8313 T2185 oass.OpenExchangeRatesOrgProvider.reload Reloading exchange rates from open-exchange-rates.json
[junit4:junit4]   2> 8314 T2185 oass.OpenExchangeRatesOrgProvider.reload Reloading exchange rates from open-exchange-rates.json
[junit4:junit4]   2> 8315 T2185 oasc.SolrCore.<init> [collection1] Opening new SolrCore at /usr/home/hudson/hudson-slave/workspace/Lucene-Solr-Tests-4.x-java7/solr/build/solr-core/test/J1/./solrtest-jetty3-1347873891265/collection1/, dataDir=./org.apache.solr.cloud.BasicDistributedZk2Test-1347873884054/jetty3/
[junit4:junit4]   2> 8315 T2185 oasc.JmxMonitoredMap.<init> JMX monitoring is enabled. Adding Solr mbeans to JMX Server: com.sun.jmx.mbeanserver.JmxMBeanServer@2c24be25
[junit4:junit4]   2> 8316 T2185 oasc.SolrCore.getNewIndexDir WARNING New index directory detected: old=null new=./org.apache.solr.cloud.BasicDistributedZk2Test-1347873884054/jetty3/index/
[junit4:junit4]   2> 8317 T2185 oasc.SolrCore.initIndex WARNING [collection1] Solr index directory './org.apache.solr.cloud.BasicDistributedZk2Test-1347873884054/jetty3/index' doesn't exist. Creating new index...
[junit4:junit4]   2> 8318 T2185 oasc.CachingDirectoryFactory.get return new directory for /usr/home/hudson/hudson-slave/workspace/Lucene-Solr-Tests-4.x-java7/solr/build/solr-core/test/J1/./org.apache.solr.cloud.BasicDistributedZk2Test-1347873884054/jetty3/index forceNew:false
[junit4:junit4]   2> 8323 T2185 oasc.SolrDeletionPolicy.onCommit SolrDeletionPolicy.onCommit: commits:num=1
[junit4:junit4]   2> 		commit{dir=NRTCachingDirectory(org.apache.lucene.store.NIOFSDirectory@/usr/home/hudson/hudson-slave/workspace/Lucene-Solr-Tests-4.x-java7/solr/build/solr-core/test/J1/org.apache.solr.cloud.BasicDistributedZk2Test-1347873884054/jetty3/index lockFactory=org.apache.lucene.store.NativeFSLockFactory@38b380fc; maxCacheMB=48.0 maxMergeSizeMB=4.0),segFN=segments_1,generation=1,filenames=[segments_1]
[junit4:junit4]   2> 8323 T2185 oasc.SolrDeletionPolicy.updateCommits newest commit = 1
[junit4:junit4]   2> 8324 T2185 oasc.SolrCore.initWriters created xml: solr.XMLResponseWriter
[junit4:junit4]   2> 8326 T2185 oasup.UpdateRequestProcessorChain.init inserting DistributedUpdateProcessorFactory into updateRequestProcessorChain "dedupe"
[junit4:junit4]   2> 8327 T2185 oasup.UpdateRequestProcessorChain.init inserting DistributedUpdateProcessorFactory into updateRequestProcessorChain "dedupe-allfields"
[junit4:junit4]   2> 8327 T2185 oasup.UpdateRequestProcessorChain.init inserting DistributedUpdateProcessorFactory into updateRequestProcessorChain "stored_sig"
[junit4:junit4]   2> 8328 T2185 oasup.UpdateRequestProcessorChain.init inserting DistributedUpdateProcessorFactory into updateRequestProcessorChain "uniq-fields"
[junit4:junit4]   2> 8328 T2185 oasup.UpdateRequestProcessorChain.init inserting DistributedUpdateProcessorFactory into updateRequestProcessorChain "distrib-dup-test-chain-implicit"
[junit4:junit4]   2> 8329 T2185 oasc.RequestHandlers.initHandlersFromConfig adding lazy requestHandler: solr.ReplicationHandler
[junit4:junit4]   2> 8329 T2185 oasc.RequestHandlers.initHandlersFromConfig created /replication: solr.ReplicationHandler
[junit4:junit4]   2> 8330 T2185 oasc.RequestHandlers.initHandlersFromConfig created standard: solr.StandardRequestHandler
[junit4:junit4]   2> 8331 T2185 oasc.RequestHandlers.initHandlersFromConfig created /get: solr.RealTimeGetHandler
[junit4:junit4]   2> 8331 T2185 oasc.RequestHandlers.initHandlersFromConfig created dismax: solr.SearchHandler
[junit4:junit4]   2> 8332 T2185 oasc.RequestHandlers.initHandlersFromConfig created mock: org.apache.solr.core.MockQuerySenderListenerReqHandler
[junit4:junit4]   2> 8332 T2185 oasc.RequestHandlers.initHandlersFromConfig created /admin/: org.apache.solr.handler.admin.AdminHandlers
[junit4:junit4]   2> 8333 T2185 oasc.RequestHandlers.initHandlersFromConfig created defaults: solr.StandardRequestHandler
[junit4:junit4]   2> 8333 T2185 oasc.RequestHandlers.initHandlersFromConfig adding lazy requestHandler: solr.StandardRequestHandler
[junit4:junit4]   2> 8334 T2185 oasc.RequestHandlers.initHandlersFromConfig created lazy: solr.StandardRequestHandler
[junit4:junit4]   2> 8334 T2185 oasc.RequestHandlers.initHandlersFromConfig created /update: solr.UpdateRequestHandler
[junit4:junit4]   2> 8335 T2185 oasc.RequestHandlers.initHandlersFromConfig created /terms: org.apache.solr.handler.component.SearchHandler
[junit4:junit4]   2> 8335 T2185 oasc.RequestHandlers.initHandlersFromConfig created spellCheckCompRH: org.apache.solr.handler.component.SearchHandler
[junit4:junit4]   2> 8336 T2185 oasc.RequestHandlers.initHandlersFromConfig created spellCheckCompRH_Direct: org.apache.solr.handler.component.SearchHandler
[junit4:junit4]   2> 8336 T2185 oasc.RequestHandlers.initHandlersFromConfig created spellCheckWithWordbreak: org.apache.solr.handler.component.SearchHandler
[junit4:junit4]   2> 8337 T2185 oasc.RequestHandlers.initHandlersFromConfig created spellCheckWithWordbreak_Direct: org.apache.solr.handler.component.SearchHandler
[junit4:junit4]   2> 8338 T2185 oasc.RequestHandlers.initHandlersFromConfig created spellCheckCompRH1: org.apache.solr.handler.component.SearchHandler
[junit4:junit4]   2> 8338 T2185 oasc.RequestHandlers.initHandlersFromConfig created tvrh: org.apache.solr.handler.component.SearchHandler
[junit4:junit4]   2> 8339 T2185 oasc.RequestHandlers.initHandlersFromConfig created /mlt: solr.MoreLikeThisHandler
[junit4:junit4]   2> 8339 T2185 oasc.RequestHandlers.initHandlersFromConfig created /debug/dump: solr.DumpRequestHandler
[junit4:junit4]   2> 8342 T2185 oashl.XMLLoader.init xsltCacheLifetimeSeconds=60
[junit4:junit4]   2> 8346 T2185 oasc.SolrCore.initDeprecatedSupport WARNING solrconfig.xml uses deprecated <admin/gettableFiles>, Please update your config to use the ShowFileRequestHandler.
[junit4:junit4]   2> 8347 T2185 oasc.SolrCore.initDeprecatedSupport WARNING adding ShowFileRequestHandler with hidden files: [SCHEMA.XML, OLD_SYNONYMS.TXT, STOPWORDS.TXT, PROTWORDS.TXT, OPEN-EXCHANGE-RATES.JSON, SYNONYMS.TXT, CURRENCY.XML, MAPPING-ISOLATIN1ACCENT.TXT]
[junit4:junit4]   2> 8350 T2185 oass.SolrIndexSearcher.<init> Opening Searcher@4b477c2a main
[junit4:junit4]   2> 8351 T2185 oasu.CommitTracker.<init> Hard AutoCommit: disabled
[junit4:junit4]   2> 8352 T2185 oasu.CommitTracker.<init> Soft AutoCommit: disabled
[junit4:junit4]   2> 8352 T2185 oashc.SpellCheckComponent.inform Initializing spell checkers
[junit4:junit4]   2> 8358 T2185 oass.DirectSolrSpellChecker.init init: {name=direct,classname=DirectSolrSpellChecker,field=lowerfilt,minQueryLength=3}
[junit4:junit4]   2> 8426 T2244 oasc.SolrCore.registerSearcher [collection1] Registered new searcher Searcher@4b477c2a main{StandardDirectoryReader(segments_1:1)}
[junit4:junit4]   2> 8692 T2206 oascc.ZkStateReader.updateClusterState Updating cloud state from ZooKeeper... 
[junit4:junit4]   2> 8705 T2205 oascc.ZkStateReader$2.process A cluster state change has occurred - updating...
[junit4:junit4]   2> 8705 T2231 oascc.ZkStateReader$2.process A cluster state change has occurred - updating...
[junit4:junit4]   2> 8705 T2243 oascc.ZkStateReader$2.process A cluster state change has occurred - updating...
[junit4:junit4]   2> 8705 T2219 oascc.ZkStateReader$2.process A cluster state change has occurred - updating...
[junit4:junit4]   2> 8932 T2185 oasc.CoreContainer.register registering core: collection1
[junit4:junit4]   2> 8932 T2185 oasc.ZkController.register Register shard - core:collection1 address:http://127.0.0.1:39628/solr shardId:shard1
[junit4:junit4]   2> 8935 T2185 oasc.ZkController.register We are http://127.0.0.1:39628/solr/collection1/ and leader is http://127.0.0.1:39618/solr/collection1/
[junit4:junit4]   2> 8936 T2185 oasc.ZkController.register No LogReplay needed for core=collection1 baseURL=http://127.0.0.1:39628/solr
[junit4:junit4]   2> 8936 T2185 oasc.ZkController.checkRecovery Core needs to recover:collection1
[junit4:junit4]   2> 8937 T2185 oasu.DefaultSolrCoreState.doRecovery Running recovery - first canceling any ongoing recovery
[junit4:junit4]   2> ASYNC  NEW_CORE C172 name=collection1 org.apache.solr.core.SolrCore@4c35f8c url=http://127.0.0.1:39628/solr/collection1 node=127.0.0.1:39628_solr
[junit4:junit4]   2> 8939 T2245 C172 P39628 oasc.RecoveryStrategy.run Starting recovery process.  core=collection1 recoveringAfterStartup=true
[junit4:junit4]   2> 8939 T2185 oascc.ZkStateReader.updateClusterState Updating cloud state from ZooKeeper... 
[junit4:junit4]   2> 8940 T2245 C172 P39628 oasc.RecoveryStrategy.doRecovery ###### startupVersions=[]
[junit4:junit4]   2> 8940 T2185 oass.SolrDispatchFilter.init user.dir=/usr/home/hudson/hudson-slave/workspace/Lucene-Solr-Tests-4.x-java7/solr/build/solr-core/test/J1
[junit4:junit4]   2> 8941 T2185 oass.SolrDispatchFilter.init SolrDispatchFilter.init() done
[junit4:junit4]   2> 8941 T2245 C172 P39628 oasc.RecoveryStrategy.doRecovery Attempting to PeerSync from http://127.0.0.1:39618/solr/collection1/ core=collection1 - recoveringAfterStartup=true
[junit4:junit4]   2> 8942 T2245 C172 P39628 oasu.PeerSync.sync PeerSync: core=collection1 url=http://127.0.0.1:39628/solr START replicas=[http://127.0.0.1:39618/solr/collection1/] nUpdates=100
[junit4:junit4]   2> 8941 T2185 oascsi.HttpClientUtil.createClient Creating new http client, config:maxConnections=128&maxConnectionsPerHost=32&followRedirects=false
[junit4:junit4]   2> 8942 T2245 C172 P39628 oasu.PeerSync.sync WARNING no frame of reference to tell of we've missed updates
[junit4:junit4]   2> 8942 T2245 C172 P39628 oasc.RecoveryStrategy.doRecovery PeerSync Recovery was not successful - trying replication. core=collection1
[junit4:junit4]   2> 8942 T2245 C172 P39628 oasc.RecoveryStrategy.doRecovery Starting Replication Recovery. core=collection1
[junit4:junit4]   2> 8943 T2245 C172 P39628 oascsi.HttpClientUtil.createClient Creating new http client, config:maxConnections=128&maxConnectionsPerHost=32&followRedirects=false
[junit4:junit4]   2> ASYNC  NEW_CORE C173 name=collection1 org.apache.solr.core.SolrCore@6b280b62 url=http://127.0.0.1:39618/solr/collection1 node=127.0.0.1:39618_solr
[junit4:junit4]   2> 8951 T2211 C173 P39618 REQ /get {distrib=false&qt=/get&wt=javabin&version=2&getVersions=100} status=0 QTime=1 
[junit4:junit4]   2> 9208 T2206 oascc.ZkStateReader.updateClusterState Updating cloud state from ZooKeeper... 
[junit4:junit4]   2> 9220 T2205 oascc.ZkStateReader$2.process A cluster state change has occurred - updating...
[junit4:junit4]   2> 9220 T2219 oascc.ZkStateReader$2.process A cluster state change has occurred - updating...
[junit4:junit4]   2> 9220 T2243 oascc.ZkStateReader$2.process A cluster state change has occurred - updating...
[junit4:junit4]   2> 9220 T2231 oascc.ZkStateReader$2.process A cluster state change has occurred - updating...
[junit4:junit4]   2> 9431 T2185 oejs.Server.doStart jetty-8.1.2.v20120308
[junit4:junit4]   2> 9436 T2185 oejs.AbstractConnector.doStart Started SocketConnector@0.0.0.0:39633
[junit4:junit4]   2> 9437 T2185 oasc.SolrResourceLoader.locateSolrHome JNDI not configured for solr (NoInitialContextEx)
[junit4:junit4]   2> 9437 T2185 oasc.SolrResourceLoader.locateSolrHome using system property solr.solr.home: /usr/home/hudson/hudson-slave/workspace/Lucene-Solr-Tests-4.x-java7/solr/build/solr-core/test/J1/./solrtest-jetty4-1347873893009
[junit4:junit4]   2> 9438 T2185 oasc.SolrResourceLoader.<init> new SolrResourceLoader for deduced Solr Home: '/usr/home/hudson/hudson-slave/workspace/Lucene-Solr-Tests-4.x-java7/solr/build/solr-core/test/J1/./solrtest-jetty4-1347873893009/'
[junit4:junit4]   2> 9484 T2185 oass.SolrDispatchFilter.init SolrDispatchFilter.init()
[junit4:junit4]   2> 9485 T2185 oasc.SolrResourceLoader.locateSolrHome JNDI not configured for solr (NoInitialContextEx)
[junit4:junit4]   2> 9485 T2185 oasc.SolrResourceLoader.locateSolrHome using system property solr.solr.home: /usr/home/hudson/hudson-slave/workspace/Lucene-Solr-Tests-4.x-java7/solr/build/solr-core/test/J1/./solrtest-jetty4-1347873893009
[junit4:junit4]   2> 9486 T2185 oasc.CoreContainer$Initializer.initialize looking for solr.xml: /usr/home/hudson/hudson-slave/workspace/Lucene-Solr-Tests-4.x-java7/solr/build/solr-core/test/J1/./solrtest-jetty4-1347873893009/solr.xml
[junit4:junit4]   2> 9486 T2185 oasc.CoreContainer.<init> New CoreContainer 888029986
[junit4:junit4]   2> 9487 T2185 oasc.CoreContainer.load Loading CoreContainer using Solr Home: '/usr/home/hudson/hudson-slave/workspace/Lucene-Solr-Tests-4.x-java7/solr/build/solr-core/test/J1/./solrtest-jetty4-1347873893009/'
[junit4:junit4]   2> 9488 T2185 oasc.SolrResourceLoader.<init> new SolrResourceLoader for directory: '/usr/home/hudson/hudson-slave/workspace/Lucene-Solr-Tests-4.x-java7/solr/build/solr-core/test/J1/./solrtest-jetty4-1347873893009/'
[junit4:junit4]   2> 9523 T2185 oasc.CoreContainer.load Registering Log Listener
[junit4:junit4]   2> 9539 T2185 oasc.CoreContainer.initZooKeeper Zookeeper client=127.0.0.1:39608/solr
[junit4:junit4]   2> 9539 T2185 oaz.ZooKeeper.<init> Initiating client connection, connectString=127.0.0.1:39608/solr sessionTimeout=5000 watcher=org.apache.solr.common.cloud.ConnectionManager@22c48005
[junit4:junit4]   2> 9541 T2256 oaz.ClientCnxn$SendThread.startConnect Opening socket connection to server /127.0.0.1:39608
[junit4:junit4]   2> 9541 T2185 oascc.ConnectionManager.waitForConnected Waiting for client to connect to ZooKeeper
[junit4:junit4]   2> 9541 T2256 oaz.ClientCnxn$SendThread.primeConnection Socket connection established to localhost/127.0.0.1:39608, initiating session
[junit4:junit4]   2> 9542 T2187 oazs.NIOServerCnxn$Factory.run Accepted socket connection from /140.211.11.196:39634
[junit4:junit4]   2> 9542 T2187 oazs.NIOServerCnxn.readConnectRequest Client attempting to establish new session at /140.211.11.196:39634
[junit4:junit4]   2> 9543 T2189 oazs.NIOServerCnxn.finishSessionInit Established session 0x139d38b479a0006 with negotiated timeout 5000 for client /140.211.11.196:39634
[junit4:junit4]   2> 9543 T2256 oaz.ClientCnxn$SendThread.readConnectResult Session establishment complete on server localhost/127.0.0.1:39608, sessionid = 0x139d38b479a0006, negotiated timeout = 5000
[junit4:junit4]   2> 9544 T2257 oascc.ConnectionManager.process Watcher org.apache.solr.common.cloud.ConnectionManager@22c48005 name:ZooKeeperConnection Watcher:127.0.0.1:39608/solr got event WatchedEvent state:SyncConnected type:None path:null path:null type:None
[junit4:junit4]   2> 9544 T2185 oascc.ConnectionManager.waitForConnected Client is connected to ZooKeeper
[junit4:junit4]   2> 9545 T2190 oazs.PrepRequestProcessor.pRequest Got user-level KeeperException when processing sessionid:0x139d38b479a0006 type:create cxid:0x1 zxid:0xfffffffffffffffe txntype:unknown reqpath:n/a Error Path:/solr/overseer Error:KeeperErrorCode = NodeExists for /solr/overseer
[junit4:junit4]   2> 9546 T2190 oazs.PrepRequestProcessor.pRequest Got user-level KeeperException when processing sessionid:0x139d38b479a0006 type:create cxid:0x2 zxid:0xfffffffffffffffe txntype:unknown reqpath:n/a Error Path:/solr/overseer Error:KeeperErrorCode = NodeExists for /solr/overseer
[junit4:junit4]   2> 9555 T2185 oasc.ZkController.createEphemeralLiveNode Register node as live in ZooKeeper:/live_nodes/127.0.0.1:39633_solr
[junit4:junit4]   2> 9555 T2190 oazs.PrepRequestProcessor.pRequest Got user-level KeeperException when processing sessionid:0x139d38b479a0006 type:delete cxid:0x4 zxid:0xfffffffffffffffe txntype:unknown reqpath:n/a Error Path:/solr/live_nodes/127.0.0.1:39633_solr Error:KeeperErrorCode = NoNode for /solr/live_nodes/127.0.0.1:39633_solr
[junit4:junit4]   2> 9556 T2185 oascc.SolrZkClient.makePath makePath: /live_nodes/127.0.0.1:39633_solr
[junit4:junit4]   2> 9558 T2231 oascc.ZkStateReader$3.process Updating live nodes
[junit4:junit4]   2> 9558 T2205 oascc.ZkStateReader$3.process Updating live nodes
[junit4:junit4]   2> 9558 T2243 oascc.ZkStateReader$3.process Updating live nodes
[junit4:junit4]   2> 9558 T2219 oascc.ZkStateReader$3.process Updating live nodes
[junit4:junit4]   2> 9559 T2185 oashc.HttpShardHandlerFactory.getParameter Setting socketTimeout to: 0
[junit4:junit4]   2> 9559 T2185 oashc.HttpShardHandlerFactory.getParameter Setting urlScheme to: http://
[junit4:junit4]   2> 9560 T2185 oashc.HttpShardHandlerFactory.getParameter Setting connTimeout to: 0
[junit4:junit4]   2> 9560 T2185 oashc.HttpShardHandlerFactory.getParameter Setting maxConnectionsPerHost to: 20
[junit4:junit4]   2> 9561 T2185 oashc.HttpShardHandlerFactory.getParameter Setting corePoolSize to: 0
[junit4:junit4]   2> 9561 T2185 oashc.HttpShardHandlerFactory.getParameter Setting maximumPoolSize to: 2147483647
[junit4:junit4]   2> 9562 T2185 oashc.HttpShardHandlerFactory.getParameter Setting maxThreadIdleTime to: 5
[junit4:junit4]   2> 9562 T2185 oashc.HttpShardHandlerFactory.getParameter Setting sizeOfQueue to: -1
[junit4:junit4]   2> 9563 T2185 oashc.HttpShardHandlerFactory.getParameter Setting fairnessPolicy to: false
[junit4:junit4]   2> 9563 T2185 oascsi.HttpClientUtil.createClient Creating new http client, config:maxConnectionsPerHost=20&maxConnections=10000&socketTimeout=0&connTimeout=0&retry=false
[junit4:junit4]   2> 9579 T2185 oascc.ZkStateReader.createClusterStateWatchersAndUpdate Updating cluster state from ZooKeeper... 
[junit4:junit4]   2> 9586 T2185 oasc.CoreContainer.create Creating SolrCore 'collection1' using instanceDir: /usr/home/hudson/hudson-slave/workspace/Lucene-Solr-Tests-4.x-java7/solr/build/solr-core/test/J1/./solrtest-jetty4-1347873893009/collection1
[junit4:junit4]   2> 9586 T2185 oasc.ZkController.createCollectionZkNode Check for collection zkNode:collection1
[junit4:junit4]   2> 9587 T2185 oasc.ZkController.createCollectionZkNode Collection zkNode exists
[junit4:junit4]   2> 9587 T2185 oasc.ZkController.readConfigName Load collection config from:/collections/collection1
[junit4:junit4]   2> 9589 T2185 oasc.SolrResourceLoader.<init> new SolrResourceLoader for directory: '/usr/home/hudson/hudson-slave/workspace/Lucene-Solr-Tests-4.x-java7/solr/build/solr-core/test/J1/./solrtest-jetty4-1347873893009/collection1/'
[junit4:junit4]   2> 9590 T2185 oasc.SolrResourceLoader.replaceClassLoader Adding 'file:/usr/home/hudson/hudson-slave/workspace/Lucene-Solr-Tests-4.x-java7/solr/build/solr-core/test/J1/solrtest-jetty4-1347873893009/collection1/lib/README' to classloader
[junit4:junit4]   2> 9591 T2185 oasc.SolrResourceLoader.replaceClassLoader Adding 'file:/usr/home/hudson/hudson-slave/workspace/Lucene-Solr-Tests-4.x-java7/solr/build/solr-core/test/J1/solrtest-jetty4-1347873893009/collection1/lib/classes/' to classloader
[junit4:junit4]   2> 9656 T2185 oasc.SolrConfig.<init> Using Lucene MatchVersion: LUCENE_40
[junit4:junit4]   2> 9739 T2185 oasc.SolrConfig.<init> Loaded SolrConfig: solrconfig.xml
[junit4:junit4]   2> 9841 T2185 oass.IndexSchema.readSchema Reading Solr Schema
[junit4:junit4]   2> 9848 T2185 oass.IndexSchema.readSchema Schema name=test
[junit4:junit4]   2> 10480 T2185 oass.OpenExchangeRatesOrgProvider.init Initialized with rates=open-exchange-rates.json, refreshInterval=1440.
[junit4:junit4]   2> 10492 T2185 oass.IndexSchema.readSchema default search field in schema is text
[junit4:junit4]   2> 10497 T2185 oass.IndexSchema.readSchema unique key field: id
[junit4:junit4]   2> 10508 T2185 oass.FileExchangeRateProvider.reload Reloading exchange rates from file currency.xml
[junit4:junit4]   2> 10514 T2185 oass.FileExchangeRateProvider.reload Reloading exchange rates from file currency.xml
[junit4:junit4]   2> 10519 T2185 oass.OpenExchangeRatesOrgProvider.reload Reloading exchange rates from open-exchange-rates.json
[junit4:junit4]   2> 10520 T2185 oass.OpenExchangeRatesOrgProvider.reload Reloading exchange rates from open-exchange-rates.json
[junit4:junit4]   2> 10521 T2185 oasc.SolrCore.<init> [collection1] Opening new SolrCore at /usr/home/hudson/hudson-slave/workspace/Lucene-Solr-Tests-4.x-java7/solr/build/solr-core/test/J1/./solrtest-jetty4-1347873893009/collection1/, dataDir=./org.apache.solr.cloud.BasicDistributedZk2Test-1347873884054/jetty4/
[junit4:junit4]   2> 10522 T2185 oasc.JmxMonitoredMap.<init> JMX monitoring is enabled. Adding Solr mbeans to JMX Server: com.sun.jmx.mbeanserver.JmxMBeanServer@2c24be25
[junit4:junit4]   2> 10523 T2185 oasc.SolrCore.getNewIndexDir WARNING New index directory detected: old=null new=./org.apache.solr.cloud.BasicDistributedZk2Test-1347873884054/jetty4/index/
[junit4:junit4]   2> 10524 T2185 oasc.SolrCore.initIndex WARNING [collection1] Solr index directory './org.apache.solr.cloud.BasicDistributedZk2Test-1347873884054/jetty4/index' doesn't exist. Creating new index...
[junit4:junit4]   2> 10525 T2185 oasc.CachingDirectoryFactory.get return new directory for /usr/home/hudson/hudson-slave/workspace/Lucene-Solr-Tests-4.x-java7/solr/build/solr-core/test/J1/./org.apache.solr.cloud.BasicDistributedZk2Test-1347873884054/jetty4/index forceNew:false
[junit4:junit4]   2> 10532 T2185 oasc.SolrDeletionPolicy.onCommit SolrDeletionPolicy.onCommit: commits:num=1
[junit4:junit4]   2> 		commit{dir=NRTCachingDirectory(org.apache.lucene.store.NIOFSDirectory@/usr/home/hudson/hudson-slave/workspace/Lucene-Solr-Tests-4.x-java7/solr/build/solr-core/test/J1/org.apache.solr.cloud.BasicDistributedZk2Test-1347873884054/jetty4/index lockFactory=org.apache.lucene.store.NativeFSLockFactory@5f7871; maxCacheMB=48.0 maxMergeSizeMB=4.0),segFN=segments_1,generation=1,filenames=[segments_1]
[junit4:junit4]   2> 10533 T2185 oasc.SolrDeletionPolicy.updateCommits newest commit = 1
[junit4:junit4]   2> 10534 T2185 oasc.SolrCore.initWriters created xml: solr.XMLResponseWriter
[junit4:junit4]   2> 10537 T2185 oasup.UpdateRequestProcessorChain.init inserting DistributedUpdateProcessorFactory into updateRequestProcessorChain "dedupe"
[junit4:junit4]   2> 10538 T2185 oasup.UpdateRequestProcessorChain.init inserting DistributedUpdateProcessorFactory into updateRequestProcessorChain "dedupe-allfields"
[junit4:junit4]   2> 10538 T2185 oasup.UpdateRequestProcessorChain.init inserting DistributedUpdateProcessorFactory into updateRequestProcessorChain "stored_sig"
[junit4:junit4]   2> 10539 T2185 oasup.UpdateRequestProcessorChain.init inserting DistributedUpdateProcessorFactory into updateRequestProcessorChain "uniq-fields"
[junit4:junit4]   2> 10540 T2185 oasup.UpdateRequestProcessorChain.init inserting DistributedUpdateProcessorFactory into updateRequestProcessorChain "distrib-dup-test-chain-implicit"
[junit4:junit4]   2> 10540 T2185 oasc.RequestHandlers.initHandlersFromConfig adding lazy requestHandler: solr.ReplicationHandler
[junit4:junit4]   2> 10541 T2185 oasc.RequestHandlers.initHandlersFromConfig created /replication: solr.ReplicationHandler
[junit4:junit4]   2> 10542 T2185 oasc.RequestHandlers.initHandlersFromConfig created standard: solr.StandardRequestHandler
[junit4:junit4]   2> 10543 T2185 oasc.RequestHandlers.initHandlersFromConfig created /get: solr.RealTimeGetHandler
[junit4:junit4]   2> 10544 T2185 oasc.RequestHandlers.initHandlersFromConfig created dismax: solr.SearchHandler
[junit4:junit4]   2> 10545 T2185 oasc.RequestHandlers.initHandlersFromConfig created mock: org.apache.solr.core.MockQuerySenderListenerReqHandler
[junit4:junit4]   2> 10545 T2185 oasc.RequestHandlers.initHandlersFromConfig created /admin/: org.apache.solr.handler.admin.AdminHandlers
[junit4:junit4]   2> 10546 T2185 oasc.RequestHandlers.initHandlersFromConfig created defaults: solr.StandardRequestHandler
[junit4:junit4]   2> 10547 T2185 oasc.RequestHandlers.initHandlersFromConfig adding lazy requestHandler: solr.StandardRequestHandler
[junit4:junit4]   2> 10547 T2185 oasc.RequestHandlers.initHandlersFromConfig created lazy: solr.StandardRequestHandler
[junit4:junit4]   2> 10548 T2185 oasc.RequestHandlers.initHandlersFromConfig created /update: solr.UpdateRequestHandler
[junit4:junit4]   2> 10549 T2185 oasc.RequestHandlers.initHandlersFromConfig created /terms: org.apache.solr.handler.component.SearchHandler
[junit4:junit4]   2> 10550 T2185 oasc.RequestHandlers.initHandlersFromConfig created spellCheckCompRH: org.apache.solr.handler.component.SearchHandler
[junit4:junit4]   2> 10550 T2185 oasc.RequestHandlers.initHandlersFromConfig created spellCheckCompRH_Direct: org.apache.solr.handler.component.SearchHandler
[junit4:junit4]   2> 10551 T2185 oasc.RequestHandlers.initHandlersFromConfig created spellCheckWithWordbreak: org.apache.solr.handler.component.SearchHandler
[junit4:junit4]   2> 10552 T2185 oasc.RequestHandlers.initHandlersFromConfig created spellCheckWithWordbreak_Direct: org.apache.solr.handler.component.SearchHandler
[junit4:junit4]   2> 10553 T2185 oasc.RequestHandlers.initHandlersFromConfig created spellCheckCompRH1: org.apache.solr.handler.component.SearchHandler
[junit4:junit4]   2> 10554 T2185 oasc.RequestHandlers.initHandlersFromConfig created tvrh: org.apache.solr.handler.component.SearchHandler
[junit4:junit4]   2> 10555 T2185 oasc.RequestHandlers.initHandlersFromConfig created /mlt: solr.MoreLikeThisHandler
[junit4:junit4]   2> 10555 T2185 oasc.RequestHandlers.initHandlersFromConfig created /debug/dump: solr.DumpRequestHandler
[junit4:junit4]   2> 10560 T2185 oashl.XMLLoader.init xsltCacheLifetimeSeconds=60
[junit4:junit4]   2> 10565 T2185 oasc.SolrCore.initDeprecatedSupport WARNING solrconfig.xml uses deprecated <admin/gettableFiles>, Please update your config to use the ShowFileRequestHandler.
[junit4:junit4]   2> 10566 T2185 oasc.SolrCore.initDeprecatedSupport WARNING adding ShowFileRequestHandler with hidden files: [SCHEMA.XML, OLD_SYNONYMS.TXT, STOPWORDS.TXT, PROTWORDS.TXT, OPEN-EXCHANGE-RATES.JSON, SYNONYMS.TXT, CURRENCY.XML, MAPPING-ISOLATIN1ACCENT.TXT]
[junit4:junit4]   2> 10570 T2185 oass.SolrIndexSearcher.<init> Opening Searcher@1adf9884 main
[junit4:junit4]   2> 10572 T2185 oasu.CommitTracker.<init> Hard AutoCommit: disabled
[junit4:junit4]   2> 10573 T2185 oasu.CommitTracker.<init> Soft AutoCommit: disabled
[junit4:junit4]   2> 10573 T2185 oashc.SpellCheckComponent.inform Initializing spell checkers
[junit4:junit4]   2> 10582 T2185 oass.DirectSolrSpellChecker.init init: {name=direct,classname=DirectSolrSpellChecker,field=lowerfilt,minQueryLength=3}
[junit4:junit4]   2> 10645 T2258 oasc.SolrCore.registerSearcher [collection1] Registered new searcher Searcher@1adf9884 main{StandardDirectoryReader(segments_1:1)}
[junit4:junit4]   2> 10727 T2206 oascc.ZkStateReader.updateClusterState Updating cloud state from ZooKeeper... 
[junit4:junit4]   2> 10730 T2257 oascc.ZkStateReader$2.process A cluster state change has occurred - updating...
[junit4:junit4]   2> 10730 T2231 oascc.ZkStateReader$2.process A cluster state change has occurred - updating...
[junit4:junit4]   2> 10730 T2219 oascc.ZkStateReader$2.process A cluster state change has occurred - updating...
[junit4:junit4]   2> 10730 T2243 oascc.ZkStateReader$2.process A cluster state change has occurred - updating...
[junit4:junit4]   2> 10730 T2205 oascc.ZkStateReader$2.process A cluster state change has occurred - updating...
[junit4:junit4]   2> 11154 T2185 oasc.CoreContainer.register registering core: collection1
[junit4:junit4]   2> 11155 T2185 oasc.ZkController.register Register shard - core:collection1 address:http://127.0.0.1:39633/solr shardId:shard2
[junit4:junit4]   2> 11158 T2185 oasc.ZkController.register We are http://127.0.0.1:39633/solr/collection1/ and leader is http://127.0.0.1:39623/solr/collection1/
[junit4:junit4]   2> 11158 T2185 oasc.ZkController.register No LogReplay needed for core=collection1 baseURL=http://127.0.0.1:39633/solr
[junit4:junit4]   2> 11159 T2185 oasc.ZkController.checkRecovery Core needs to recover:collection1
[junit4:junit4]   2> 11159 T2185 oasu.DefaultSolrCoreState.doRecovery Running recovery - first canceling any ongoing recovery
[junit4:junit4]   2> ASYNC  NEW_CORE C174 name=collection1 org.apache.solr.core.SolrCore@4c0149db url=http://127.0.0.1:39633/solr/collection1 node=127.0.0.1:39633_solr
[junit4:junit4]   2> 11161 T2259 C174 P39633 oasc.RecoveryStrategy.run Starting recovery process.  core=collection1 recoveringAfterStartup=true
[junit4:junit4]   2> 11162 T2259 C174 P39633 oasc.RecoveryStrategy.doRecovery ###### startupVersions=[]
[junit4:junit4]   2> 11161 T2185 oascc.ZkStateReader.updateClusterState Updating cloud state from ZooKeeper... 
[junit4:junit4]   2> 11163 T2259 C174 P39633 oasc.RecoveryStrategy.doRecovery Attempting to PeerSync from http://127.0.0.1:39623/solr/collection1/ core=collection1 - recoveringAfterStartup=true
[junit4:junit4]   2> 11163 T2259 C174 P39633 oasu.PeerSync.sync PeerSync: core=collection1 url=http://127.0.0.1:39633/solr START replicas=[http://127.0.0.1:39623/solr/collection1/] nUpdates=100
[junit4:junit4]   2> 11163 T2185 oass.SolrDispatchFilter.init user.dir=/usr/home/hudson/hudson-slave/workspace/Lucene-Solr-Tests-4.x-java7/solr/build/solr-core/test/J1
[junit4:junit4]   2> 11164 T2259 C174 P39633 oasu.PeerSync.sync WARNING no frame of reference to tell of we've missed updates
[junit4:junit4]   2> 11164 T2259 C174 P39633 oasc.RecoveryStrategy.doRecovery PeerSync Recovery was not successful - trying replication. core=collection1
[junit4:junit4]   2> 11164 T2185 oass.SolrDispatchFilter.init SolrDispatchFilter.init() done
[junit4:junit4]   2> 11164 T2259 C174 P39633 oasc.RecoveryStrategy.doRecovery Starting Replication Recovery. core=collection1
[junit4:junit4]   2> 11164 T2259 C174 P39633 oascsi.HttpClientUtil.createClient Creating new http client, config:maxConnections=128&maxConnectionsPerHost=32&followRedirects=false
[junit4:junit4]   2> 11164 T2185 oascsi.HttpClientUtil.createClient Creating new http client, config:maxConnections=128&maxConnectionsPerHost=32&followRedirects=false
[junit4:junit4]   2> ASYNC  NEW_CORE C175 name=collection1 org.apache.solr.core.SolrCore@2a6d23cb url=http://127.0.0.1:39623/solr/collection1 node=127.0.0.1:39623_solr
[junit4:junit4]   2> 11172 T2223 C175 P39623 REQ /get {distrib=false&qt=/get&wt=javabin&version=2&getVersions=100} status=0 QTime=0 
[junit4:junit4]   2> 11183 T2185 oaz.ZooKeeper.<init> Initiating client connection, connectString=127.0.0.1:39608/solr sessionTimeout=10000 watcher=org.apache.solr.common.cloud.ConnectionManager@60ab270e
[junit4:junit4]   2> 11184 T2261 oaz.ClientCnxn$SendThread.startConnect Opening socket connection to server /127.0.0.1:39608
[junit4:junit4]   2> 11184 T2185 oascc.ConnectionManager.waitForConnected Waiting for client to connect to ZooKeeper
[junit4:junit4]   2> 11185 T2261 oaz.ClientCnxn$SendThread.primeConnection Socket connection established to localhost/127.0.0.1:39608, initiating session
[junit4:junit4]   2> 11185 T2187 oazs.NIOServerCnxn$Factory.run Accepted socket connection from /140.211.11.196:39643
[junit4:junit4]   2> 11186 T2187 oazs.NIOServerCnxn.readConnectRequest Client attempting to establish new session at /140.211.11.196:39643
[junit4:junit4]   2> 11187 T2261 oaz.ClientCnxn$SendThread.readConnectResult Session establishment complete on server localhost/127.0.0.1:39608, sessionid = 0x139d38b479a0007, negotiated timeout = 10000
[junit4:junit4]   2> 11187 T2189 oazs.NIOServerCnxn.finishSessionInit Established session 0x139d38b479a0007 with negotiated timeout 10000 for client /140.211.11.196:39643
[junit4:junit4]   2> 11187 T2262 oascc.ConnectionManager.process Watcher org.apache.solr.common.cloud.ConnectionManager@60ab270e name:ZooKeeperConnection Watcher:127.0.0.1:39608/solr got event WatchedEvent state:SyncConnected type:None path:null path:null type:None
[junit4:junit4]   2> 11188 T2185 oascc.ConnectionManager.waitForConnected Client is connected to ZooKeeper
[junit4:junit4]   2> 11188 T2185 oascc.ZkStateReader.createClusterStateWatchersAndUpdate Updating cluster state from ZooKeeper... 
[junit4:junit4]   2> 11190 T2185 oasc.ChaosMonkey.monkeyLog monkey: init - expire sessions:true cause connection loss:true
[junit4:junit4]   2> 11190 T2185 oascsi.HttpClientUtil.createClient Creating new http client, config:
[junit4:junit4]   2> 11200 T2185 oascc.ZkStateReader.updateClusterState Updating cloud state from ZooKeeper... 
[junit4:junit4]   2> ASYNC  NEW_CORE C176 name=collection1 org.apache.solr.core.SolrCore@2d72d3d7 url=http://127.0.0.1:39612/solr/collection1 node=127.0.0.1:39612_solr
[junit4:junit4]   2> 11214 T2197 C176 P39612 oasc.SolrDeletionPolicy.onInit SolrDeletionPolicy.onInit: commits:num=1
[junit4:junit4]   2> 		commit{dir=NRTCachingDirectory(org.apache.lucene.store.NIOFSDirectory@/usr/home/hudson/hudson-slave/workspace/Lucene-Solr-Tests-4.x-java7/solr/build/solr-core/test/J1/org.apache.solr.cloud.BasicDistributedZk2Test-1347873884054/control/data/index lockFactory=org.apache.lucene.store.NativeFSLockFactory@68a025f4; maxCacheMB=48.0 maxMergeSizeMB=4.0),segFN=segments_1,generation=1,filenames=[segments_1]
[junit4:junit4]   2> 11215 T2197 C176 P39612 oasc.SolrDeletionPolicy.updateCommits newest commit = 1
[junit4:junit4]   2> 11220 T2197 C176 P39612 /update {wt=javabin&version=2} {add=[1 (1413348217594052608)]} 0 11
[junit4:junit4]   2> 11221 T2185 oaz.ZooKeeper.<init> Initiating client connection, connectString=127.0.0.1:39608/solr sessionTimeout=10000 watcher=org.apache.solr.common.cloud.ConnectionManager@5e06dd93
[junit4:junit4]   2> 11222 T2263 oaz.ClientCnxn$SendThread.startConnect Opening socket connection to server /127.0.0.1:39608
[junit4:junit4]   2> 11222 T2185 oascc.ConnectionManager.waitForConnected Waiting for client to connect to ZooKeeper
[junit4:junit4]   2> 11223 T2263 oaz.ClientCnxn$SendThread.primeConnection Socket connection established to localhost/127.0.0.1:39608, initiating session
[junit4:junit4]   2> 11223 T2187 oazs.NIOServerCnxn$Factory.run Accepted socket connection from /140.211.11.196:39645
[junit4:junit4]   2> 11224 T2187 oazs.NIOServerCnxn.readConnectRequest Client attempting to establish new session at /140.211.11.196:39645
[junit4:junit4]   2> 11225 T2263 oaz.ClientCnxn$SendThread.readConnectResult Session establishment complete on server localhost/127.0.0.1:39608, sessionid = 0x139d38b479a0008, negotiated timeout = 10000
[junit4:junit4]   2> 11225 T2189 oazs.NIOServerCnxn.finishSessionInit Established session 0x139d38b479a0008 with negotiated timeout 10000 for client /140.211.11.196:39645
[junit4:junit4]   2> 11225 T2264 oascc.ConnectionManager.process Watcher org.apache.solr.common.cloud.ConnectionManager@5e06dd93 name:ZooKeeperConnection Watcher:127.0.0.1:39608/solr got event WatchedEvent state:SyncConnected type:None path:null path:null type:None
[junit4:junit4]   2> 11226 T2185 oascc.ConnectionManager.waitForConnected Client is connected to ZooKeeper
[junit4:junit4]   2> 11226 T2185 oascc.ZkStateReader.createClusterStateWatchersAndUpdate Updating cluster state from ZooKeeper... 
[junit4:junit4]   2> 11234 T2206 oascc.ZkStateReader.updateClusterState Updating cloud state from ZooKeeper... 
[junit4:junit4]   2> 11237 T2213 C173 P39618 oasc.SolrDeletionPolicy.onInit SolrDeletionPolicy.onInit: commits:num=1
[junit4:junit4]   2> 		commit{dir=NRTCachingDirectory(org.apache.lucene.store.NIOFSDirectory@/usr/home/hudson/hudson-slave/workspace/Lucene-Solr-Tests-4.x-java7/solr/build/solr-core/test/J1/org.apache.solr.cloud.BasicDistributedZk2Test-1347873884054/jetty1/index lockFactory=org.apache.lucene.store.NativeFSLockFactory@668a2c0b; maxCacheMB=48.0 maxMergeSizeMB=4.0),segFN=segments_1,generation=1,filenames=[segments_1]
[junit4:junit4]   2> 11237 T2213 C173 P39618 oasc.SolrDeletionPolicy.updateCommits newest commit = 1
[junit4:junit4]   2> 11247 T2205 oascc.ZkStateReader$2.process A cluster state change has occurred - updating...
[junit4:junit4]   2> 11247 T2257 oascc.ZkStateReader$2.process A cluster state change has occurred - updating...
[junit4:junit4]   2> 11247 T2219 oascc.ZkStateReader$2.process A cluster state change has occurred - updating...
[junit4:junit4]   2> 11247 T2262 oascc.ZkStateReader$2.process A cluster state change has occurred - updating...
[junit4:junit4]   2> 11247 T2231 oascc.ZkStateReader$2.process A cluster state change has occurred - updating...
[junit4:junit4]   2> 11247 T2243 oascc.ZkStateReader$2.process A cluster state change has occurred - updating...
[junit4:junit4]   2> 11247 T2264 oascc.ZkStateReader$2.process A cluster state change has occurred - updating...
[junit4:junit4]   2>  C172_STATE=coll:collection1 core:collection1 props:{shard=shard1, roles=null, state=recovering, core=collection1, collection=collection1, node_name=127.0.0.1:39628_solr, base_url=http://127.0.0.1:39628/solr}
[junit4:junit4]   2> 11253 T2235 C172 P39628 oasc.SolrDeletionPolicy.onInit SolrDeletionPolicy.onInit: commits:num=1
[junit4:junit4]   2> 		commit{dir=NRTCachingDirectory(org.apache.lucene.store.NIOFSDirectory@/usr/home/hudson/hudson-slave/workspace/Lucene-Solr-Tests-4.x-java7/solr/build/solr-core/test/J1/org.apache.solr.cloud.BasicDistributedZk2Test-1347873884054/jetty3/index lockFactory=org.apache.lucene.store.NativeFSLockFactory@38b380fc; maxCacheMB=48.0 maxMergeSizeMB=4.0),segFN=segments_1,generation=1,filenames=[segments_1]
[junit4:junit4]   2> 11254 T2235 C172 P39628 oasc.SolrDeletionPolicy.updateCommits newest commit = 1
[junit4:junit4]   2> 11257 T2235 C172 P39628 REQ /update {update.distrib=FROMLEADER&distrib.from=http://127.0.0.1:39618/solr/collection1/&wt=javabin&version=2} status=0 QTime=7 
[junit4:junit4]   2> 11258 T2213 C173 P39618 REQ /update {distrib.from=http://127.0.0.1:39623/solr/collection1/&update.distrib=TOLEADER&wt=javabin&version=2} status=0 QTime=26 
[junit4:junit4]   2> 11259 T2225 C175 P39623 /update {wt=javabin&version=2} {add=[1]} 0 29
[junit4:junit4]   2> 11259 T2185 oasc.AbstractDistribZkTestBase.waitForRecoveriesToFinish Wait for recoveries to finish - collection: collection1 failOnTimeout:true timeout (sec):1800
[junit4:junit4]   2> 11260 T2185 oascc.ZkStateReader.updateClusterState Updating cloud state from ZooKeeper... 
[junit4:junit4]   2> 11964 T2245 C172 P39628 oasc.RecoveryStrategy.doRecovery Begin buffering updates. core=collection1
[junit4:junit4]   2> 11964 T2245 C172 P39628 oasu.UpdateLog.bufferUpdates Starting to buffer updates. FSUpdateLog{state=ACTIVE, tlog=tlog{file=./org.apache.solr.cloud.BasicDistributedZk2Test-1347873884054/jetty3/tlog/tlog.0000000000000000000 refcount=1}}
[junit4:junit4]   2> 11964 T2245 C172 P39628 oasc.RecoveryStrategy.replicate Attempting to replicate from http://127.0.0.1:39618/solr/collection1/. core=collection1
[junit4:junit4]   2> 11964 T2245 C172 P39628 oascsi.HttpClientUtil.createClient Creating new http client, config:maxConnections=128&maxConnectionsPerHost=32&followRedirects=false
[junit4:junit4]   2> 11977 T2214 C173 P39618 oasu.DirectUpdateHandler2.commit start commit{flags=0,_version_=0,optimize=false,openSearcher=true,waitSearcher=true,expungeDeletes=false,softCommit=false}
[junit4:junit4]   2> 12024 T2214 C173 P39618 oasc.SolrDeletionPolicy.onCommit SolrDeletionPolicy.onCommit: commits:num=2
[junit4:junit4]   2> 		commit{dir=NRTCachingDirectory(org.apache.lucene.store.NIOFSDirectory@/usr/home/hudson/hudson-slave/workspace/Lucene-Solr-Tests-4.x-java7/solr/build/solr-core/test/J1/org.apache.solr.cloud.BasicDistributedZk2Test-1347873884054/jetty1/index lockFactory=org.apache.lucene.store.NativeFSLockFactory@668a2c0b; maxCacheMB=48.0 maxMergeSizeMB=4.0),segFN=segments_1,generation=1,filenames=[segments_1]
[junit4:junit4]   2> 		commit{dir=NRTCachingDirectory(org.apache.lucene.store.NIOFSDirectory@/usr/home/hudson/hudson-slave/workspace/Lucene-Solr-Tests-4.x-java7/solr/build/solr-core/test/J1/org.apache.solr.cloud.BasicDistributedZk2Test-1347873884054/jetty1/index lockFactory=org.apache.lucene.store.NativeFSLockFactory@668a2c0b; maxCacheMB=48.0 maxMergeSizeMB=4.0),segFN=segments_2,generation=2,filenames=[_0_Block_0.pos, _0_Block_0.tip, _0_Lucene40_0.tim, _0.fnm, _0_Block_0.doc, _0_Memory_0.ram, _0_Block_0.tim, _0_nrm.cfs, _0_Lucene40_0.prx, _0_Lucene40_0.tip, _0_Lucene40WithOrds_0.tii, _0_Lucene40WithOrds_0.frq, _0_Lucene40_0.frq, _0_nrm.cfe, segments_2, _0.fdx, _0_Lucene40WithOrds_0.prx, _0.si, _0_Lucene40WithOrds_0.tib, _0.fdt]
[junit4:junit4]   2> 12025 T2214 C173 P39618 oasc.SolrDeletionPolicy.updateCommits newest commit = 2
[junit4:junit4]   2> 12034 T2214 C173 P39618 oass.SolrIndexSearcher.<init> Opening Searcher@612e4c24 main
[junit4:junit4]   2> 12035 T2214 C173 P39618 oasu.DirectUpdateHandler2.commit end_commit_flush
[junit4:junit4]   2> 12036 T2220 oasc.SolrCore.registerSearcher [collection1] Registered new searcher Searcher@612e4c24 main{StandardDirectoryReader(segments_2:3 _0(4.0.0.2):C1)}
[junit4:junit4]   2> 12037 T2214 C173 P39618 /update {waitSearcher=true&commit=true&commit_end_point=true&wt=javabin&softCommit=false&version=2} {commit=} 0 61
[junit4:junit4]   2> 12038 T2245 C172 P39628 oash.ReplicationHandler.inform Commits will be reserved for  10000
[junit4:junit4]   2> 12038 T2245 C172 P39628 oash.SnapPuller.<init>  No value set for 'pollInterval'. Timer Task not started.
[junit4:junit4]   2> 12041 T2215 C173 P39618 oash.ReplicationHandler.inform Commits will be reserved for  10000
[junit4:junit4]   2> 12041 T2215 C173 P39618 REQ /replication {command=indexversion&wt=javabin&qt=/replication&version=2} status=0 QTime=1 
[junit4:junit4]   2> 12042 T2245 C172 P39628 oash.SnapPuller.fetchLatestIndex Master's generation: 2
[junit4:junit4]   2> 12042 T2245 C172 P39628 oash.SnapPuller.fetchLatestIndex Slave's generation: 1
[junit4:junit4]   2> 12042 T2245 C172 P39628 oash.SnapPuller.fetchLatestIndex Starting replication process
[junit4:junit4]   2> 12046 T2215 C173 P39618 REQ /replication {command=filelist&generation=2&wt=javabin&qt=/replication&version=2} status=0 QTime=2 
[junit4:junit4]   2> 12046 T2245 C172 P39628 oash.SnapPuller.fetchLatestIndex Number of files in latest index in master: 20
[junit4:junit4]   2> 12053 T2245 C172 P39628 oash.SnapPuller.fetchLatestIndex Starting download to ./org.apache.solr.cloud.BasicDistributedZk2Test-1347873884054/jetty3/index.20120917032456096 fullCopy=true
[junit4:junit4]   2> 12056 T2215 C173 P39618 REQ /replication {file=_0_Block_0.tip&command=filecontent&checksum=true&generation=2&qt=/replication&wt=filestream} status=0 QTime=0 
[junit4:junit4]   2> 12061 T2215 C173 P39618 REQ /replication {file=_0_Block_0.pos&command=filecontent&checksum=true&generation=2&qt=/replication&wt=filestream} status=0 QTime=0 
[junit4:junit4]   2> 12065 T2215 C173 P39618 REQ /replication {file=_0_Lucene40_0.tim&command=filecontent&checksum=true&generation=2&qt=/replication&wt=filestream} status=0 QTime=0 
[junit4:junit4]   2> 12069 T2215 C173 P39618 REQ /replication {file=_0_Block_0.doc&command=filecontent&checksum=true&generation=2&qt=/replication&wt=filestream} status=0 QTime=0 
[junit4:junit4]   2> 12073 T2215 C173 P39618 REQ /replication {file=_0.fnm&command=filecontent&checksum=true&generation=2&qt=/replication&wt=filestream} status=0 QTime=0 
[junit4:junit4]   2> 12077 T2215 C173 P39618 REQ /replication {file=_0_Block_0.tim&command=filecontent&checksum=true&generation=2&qt=/replication&wt=filestream} status=0 QTime=0 
[junit4:junit4]   2> 12081 T2215 C173 P39618 REQ /replication {file=_0_Memory_0.ram&command=filecontent&checksum=true&generation=2&qt=/replication&wt=filestream} status=0 QTime=0 
[junit4:junit4]   2> 12085 T2215 C173 P39618 REQ /replication {file=_0_nrm.cfs&command=filecontent&checksum=true&generation=2&qt=/replication&wt=filestream} status=0 QTime=0 
[junit4:junit4]   2> 12089 T2215 C173 P39618 REQ /replication {file=_0_Lucene40_0.prx&command=filecontent&checksum=true&generation=2&qt=/replication&wt=filestream} status=0 QTime=0 
[junit4:junit4]   2> 12093 T2215 C173 P39618 REQ /replication {file=_0_Lucene40_0.tip&command=filecontent&checksum=true&generation=2&qt=/replication&wt=filestream} status=0 QTime=0 
[junit4:junit4]   2> 12097 T2215 C173 P39618 REQ /replication {file=_0_Lucene40WithOrds_0.tii&command=filecontent&checksum=true&generation=2&qt=/replication&wt=filestream} status=0 QTime=0 
[junit4:junit4]   2> 12103 T2215 C173 P39618 REQ /replication {file=_0_Lucene40_0.frq&command=filecontent&checksum=true&generation=2&qt=/replication&wt=filestream} status=0 QTime=0 
[junit4:junit4]   2> 12108 T2215 C173 P39618 REQ /replication {file=_0_Lucene40WithOrds_0.frq&command=filecontent&checksum=true&generation=2&qt=/replication&wt=filestream} status=0 QTime=0 
[junit4:junit4]   2> 12113 T2215 C173 P39618 REQ /replication {file=_0_nrm.cfe&command=filecontent&checksum=true&generation=2&qt=/replication&wt=filestream} status=0 QTime=0 
[junit4:junit4]   2> 12118 T2215 C173 P39618 REQ /replication {file=segments_2&command=filecontent&checksum=true&generation=2&qt=/replication&wt=filestream} status=0 QTime=0 
[junit4:junit4]   2> 12123 T2215 C173 P39618 REQ /replication {file=_0.fdx&command=filecontent&checksum=true&generation=2&qt=/replication&wt=filestream} status=0 QTime=0 
[junit4:junit4]   2> 12128 T2215 C173 P39618 REQ /replication {file=_0_Lucene40WithOrds_0.prx&command=filecontent&checksum=true&generation=2&qt=/replication&wt=filestream} status=0 QTime=0 
[junit4:junit4]   2> 12134 T2215 C173 P39618 REQ /replication {file=_0.si&command=filecontent&checksum=true&generation=2&qt=/replication&wt=filestream} status=0 QTime=0 
[junit4:junit4]   2> 12139 T2215 C173 P39618 REQ /replication {file=_0_Lucene40WithOrds_0.tib&command=filecontent&checksum=true&generation=2&qt=/replication&wt=filestream} status=0 QTime=0 
[junit4:junit4]   2> 12145 T2215 C173 P39618 REQ /replication {file=_0.fdt&command=filecontent&checksum=true&generation=2&qt=/replication&wt=filestream} status=0 QTime=0 
[junit4:junit4]   2> 12147 T2245 C172 P39628 oash.SnapPuller.fetchLatestIndex Total time taken for download : 0 secs
[junit4:junit4]   2> 12148 T2245 C172 P39628 oash.SnapPuller.modifyIndexProps New index installed. Updating index properties... index=index.20120917032456096
[junit4:junit4]   2> 12149 T2245 C172 P39628 oasu.DefaultSolrCoreState.newIndexWriter Creating new IndexWriter...
[junit4:junit4]   2> 12149 T2245 C172 P39628 oasu.DefaultSolrCoreState.newIndexWriter Waiting until IndexWriter is unused... core=collection1
[junit4:junit4]   2> 12150 T2245 C172 P39628 oasu.DefaultSolrCoreState.newIndexWriter Rollback old IndexWriter... core=collection1
[junit4:junit4]   2> 12153 T2245 C172 P39628 oasc.SolrCore.getNewIndexDir WARNING New index directory detected: old=./org.apache.solr.cloud.BasicDistributedZk2Test-1347873884054/jetty3/index/ new=./org.apache.solr.cloud.BasicDistributedZk2Test-1347873884054/jetty3/index.20120917032456096
[junit4:junit4]   2> 12154 T2245 C172 P39628 oasc.CachingDirectoryFactory.get return new directory for /usr/home/hudson/hudson-slave/workspace/Lucene-Solr-Tests-4.x-java7/solr/build/solr-core/test/J1/./org.apache.solr.cloud.BasicDistributedZk2Test-1347873884054/jetty3/index.20120917032456096 forceNew:true
[junit4:junit4]   2> 12160 T2245 C172 P39628 oasc.SolrDeletionPolicy.onInit SolrDeletionPolicy.onInit: commits:num=1
[junit4:junit4]   2> 		commit{dir=NRTCachingDirectory(org.apache.lucene.store.NIOFSDirectory@/usr/home/hudson/hudson-slave/workspace/Lucene-Solr-Tests-4.x-java7/solr/build/solr-core/test/J1/org.apache.solr.cloud.BasicDistributedZk2Test-1347873884054/jetty3/index.20120917032456096 lockFactory=org.apache.lucene.store.NativeFSLockFactory@19db15fe; maxCacheMB=48.0 maxMergeSizeMB=4.0),segFN=segments_2,generation=2,filenames=[_0_Block_0.pos, _0_Block_0.tip, _0_Lucene40_0.tim, _0.fnm, _0_Block_0.doc, _0_Memory_0.ram, _0_Block_0.tim, _0_nrm.cfs, _0_Lucene40_0.prx, _0_Lucene40_0.tip, _0_Lucene40WithOrds_0.tii, _0_Lucene40_0.frq, _0_Lucene40WithOrds_0.frq, _0_nrm.cfe, segments_2, _0.fdx, _0_Lucene40WithOrds_0.prx, _0.si, _0_Lucene40WithOrds_0.tib, _0.fdt]
[junit4:junit4]   2> 12160 T2245 C172 P39628 oasc.SolrDeletionPolicy.updateCommits newest commit = 2
[junit4:junit4]   2> 12161 T2245 C172 P39628 oasu.DefaultSolrCoreState.newIndexWriter New IndexWriter is ready to be used.
[junit4:junit4]   2> 12163 T2245 C172 P39628 oass.SolrIndexSearcher.<init> Opening Searcher@3a3ad6c1 main
[junit4:junit4]   2> 12165 T2244 oasc.SolrCore.registerSearcher [collection1] Registered new searcher Searcher@3a3ad6c1 main{StandardDirectoryReader(segments_2:3:nrt _0(4.0.0.2):C1)}
[junit4:junit4]   2> 12165 T2244 oasc.CachingDirectoryFactory.close Closing directory:/usr/home/hudson/hudson-slave/workspace/Lucene-Solr-Tests-4.x-java7/solr/build/solr-core/test/J1/./org.apache.solr.cloud.BasicDistributedZk2Test-1347873884054/jetty3/index
[junit4:junit4]   2> 12165 T2244 oash.SnapPuller$2.onClose removing old index directory ./org.apache.solr.cloud.BasicDistributedZk2Test-1347873884054/jetty3/index
[junit4:junit4]   2> 12166 T2245 C172 P39628 oasu.DirectUpdateHandler2.commit start commit{flags=0,_version_=0,optimize=false,openSearcher=false,waitSearcher=false,expungeDeletes=false,softCommit=false}
[junit4:junit4]   2> 12167 T2245 C172 P39628 oasu.DirectUpdateHandler2.commit end_commit_flush
[junit4:junit4]   2> 12168 T2245 C172 P39628 oasc.RecoveryStrategy.replay Replaying buffered documents. core=collection1
[junit4:junit4]   2> 12168 T2268 C172 P39628 oasu.UpdateLog$LogReplayer.doReplay WARNING Starting log replay tlog{file=./org.apache.solr.cloud.BasicDistributedZk2Test-1347873884054/jetty3/tlog/tlog.0000000000000000000 refcount=2} active=true starting pos=435
[junit4:junit4]   2> 12168 T2268 C172 P39628 oasu.DirectUpdateHandler2.commit start commit{flags=2,_version_=0,optimize=false,openSearcher=true,waitSearcher=true,expungeDeletes=false,softCommit=false}
[junit4:junit4]   2> 12170 T2268 C172 P39628 oass.SolrIndexSearcher.<init> Opening Searcher@701a9697 main
[junit4:junit4]   2> 12170 T2268 C172 P39628 oasu.DirectUpdateHandler2.commit end_commit_flush
[junit4:junit4]   2> 12171 T2244 oasc.SolrCore.registerSearcher [collection1] Registered new searcher Searcher@701a9697 main{StandardDirectoryReader(segments_2:3:nrt _0(4.0.0.2):C1)}
[junit4:junit4]   2> 12171 T2268 C172 P39628 oasu.UpdateLog$LogReplayer.run WARNING Log replay finished. recoveryInfo=RecoveryInfo{adds=0 deletes=0 deleteByQuery=0 errors=0 positionOfStart=435}
[junit4:junit4]   2> 12171 T2245 C172 P39628 oasc.RecoveryStrategy.doRecovery Replication Recovery was successful - registering as Active. core=collection1
[junit4:junit4]   2> 12173 T2245 C172 P39628 oasc.RecoveryStrategy.doRecovery Finished recovery process. core=collection1
[junit4:junit4]   2> 12251 T2206 oascc.ZkStateReader.updateClusterState Updating cloud state from ZooKeeper... 
[junit4:junit4]   2> 12265 T2219 oascc.ZkStateReader$2.process A cluster state change has occurred - updating...
[junit4:junit4]   2> 12265 T2262 oascc.ZkStateReader$2.process A cluster state change has occurred - updating...
[junit4:junit4]   2> 12265 T2257 oascc.ZkStateReader$2.process A cluster state change has occurred - updating...
[junit4:junit4]   2> 12265 T2264 oascc.ZkStateReader$2.process A cluster state change has occurred - updating...
[junit4:junit4]   2> 12265 T2205 oascc.ZkStateReader$2.process A cluster state change has occurred - updating...
[junit4:junit4]   2> 12265 T2243 oascc.ZkStateReader$2.process A cluster state change has occurred - updating...
[junit4:junit4]   2> 12265 T2231 oascc.ZkStateReader$2.process A cluster state change has occurred - updating...
[junit4:junit4]   2> 12265 T2185 oascc.ZkStateReader.updateClusterState Updating cloud state from ZooKeeper... 
[junit4:junit4]   2> 13267 T2185 oascc.ZkStateReader.updateClusterState Updating cloud state from ZooKeeper... 
[junit4:junit4]   2>  C174_STATE=coll:collection1 core:collection1 props:{shard=shard2, roles=null, state=recovering, core=collection1, collection=collection1, node_name=127.0.0.1:39633_solr, base_url=http://127.0.0.1:39633/solr}
[junit4:junit4]   2> 14187 T2259 C174 P39633 oasc.RecoveryStrategy.doRecovery Begin buffering updates. core=collection1
[junit4:junit4]   2> 14187 T2259 C174 P39633 oasu.UpdateLog.bufferUpdates Starting to buffer updates. FSUpdateLog{state=ACTIVE, tlog=null}
[junit4:junit4]   2> 14187 T2259 C174 P39633 oasc.RecoveryStrategy.replicate Attempting to replicate from http://127.0.0.1:39623/solr/collection1/. core=collection1
[junit4:junit4]   2> 14187 T2259 C174 P39633 oascsi.HttpClientUtil.createClient Creating new http client, config:maxConnections=128&maxConnectionsPerHost=32&followRedirects=false
[junit4:junit4]   2> 14212 T2226 C175 P39623 oasu.DirectUpdateHandler2.commit start commit{flags=0,_version_=0,optimize=false,openSearcher=true,waitSearcher=true,expungeDeletes=false,softCommit=false}
[junit4:junit4]   2> 14217 T2226 C175 P39623 oasc.SolrDeletionPolicy.onInit SolrDeletionPolicy.onInit: commits:num=1
[junit4:junit4]   2> 		commit{dir=NRTCachingDirectory(org.apache.lucene.store.NIOFSDirectory@/usr/home/hudson/hudson-slave/workspace/Lucene-Solr-Tests-4.x-java7/solr/build/solr-core/test/J1/org.apache.solr.cloud.BasicDistributedZk2Test-1347873884054/jetty2/index lockFactory=org.apache.lucene.store.NativeFSLockFactory@7391d9e2; maxCacheMB=48.0 maxMergeSizeMB=4.0),segFN=segments_1,generation=1,filenames=[segments_1]
[junit4:junit4]   2> 14218 T2226 C175 P39623 oasc.SolrDeletionPolicy.updateCommits newest commit = 1
[junit4:junit4]   2> 14219 T2226 C175 P39623 oass.SolrIndexSearcher.<init> Opening Searcher@d7de862 main
[junit4:junit4]   2> 14220 T2226 C175 P39623 oasu.DirectUpdateHandler2.commit end_commit_flush
[junit4:junit4]   2> 14221 T2232 oasc.SolrCore.registerSearcher [collection1] Registered new searcher Searcher@d7de862 main{StandardDirectoryReader(segments_1:1)}
[junit4:junit4]   2> 14221 T2226 C175 P39623 /update {waitSearcher=true&commit=true&commit_end_point=true&wt=javabin&softCommit=false&version=2} {commit=} 0 9
[junit4:junit4]   2> 14222 T2259 C174 P39633 oash.ReplicationHandler.inform Commits will be reserved for  10000
[junit4:junit4]   2> 14223 T2259 C174 P39633 oash.SnapPuller.<init>  No value set for 'pollInterval'. Timer Task not started.
[junit4:junit4]   2> 14225 T2227 C175 P39623 oash.ReplicationHandler.inform Commits will be reserved for  10000
[junit4:junit4]   2> 14226 T2227 C175 P39623 REQ /replication {command=indexversion&wt=javabin&qt=/replication&version=2} status=0 QTime=2 
[junit4:junit4]   2> 14230 T2259 C174 P39633 oasc.SolrDeletionPolicy.onInit SolrDeletionPolicy.onInit: commits:num=1
[junit4:junit4]   2> 		commit{dir=NRTCachingDirectory(org.apache.lucene.store.NIOFSDirectory@/usr/home/hudson/hudson-slave/workspace/Lucene-Solr-Tests-4.x-java7/solr/build/solr-core/test/J1/org.apache.solr.cloud.BasicDistributedZk2Test-1347873884054/jetty4/index lockFactory=org.apache.lucene.store.NativeFSLockFactory@5f7871; maxCacheMB=48.0 maxMergeSizeMB=4.0),segFN=segments_1,generation=1,filenames=[segments_1]
[junit4:junit4]   2> 14231 T2259 C174 P39633 oasc.SolrDeletionPolicy.updateCommits newest commit = 1
[junit4:junit4]   2> 14231 T2259 C174 P39633 oasu.DirectUpdateHandler2.commit start commit{flags=0,_version_=0,optimize=false,openSearcher=true,waitSearcher=true,expungeDeletes=false,softCommit=false}
[junit4:junit4]   2> 14270 T2185 oascc.ZkStateReader.updateClusterState Updating cloud state from ZooKeeper... 
[junit4:junit4]   2> 14299 T2259 C174 P39633 oasc.SolrDeletionPolicy.onCommit SolrDeletionPolicy.onCommit: commits:num=2
[junit4:junit4]   2> 		commit{dir=NRTCachingDirectory(org.apache.lucene.store.NIOFSDirectory@/usr/home/hudson/hudson-slave/workspace/Lucene-Solr-Tests-4.x-java7/solr/build/solr-core/test/J1/org.apache.solr.cloud.BasicDistributedZk2Test-1347873884054/jetty4/index lockFactory=org.apache.lucene.store.NativeFSLockFactory@5f7871; maxCacheMB=48.0 maxMergeSizeMB=4.0),segFN=segments_1,generation=1,filenames=[segments_1]
[junit4:junit4]   2> 		commit{dir=NRTCachingDirectory(org.apache.lucene.store.NIOFSDirectory@/usr/home/hudson/hudson-slave/workspace/Lucene-Solr-Tests-4.x-java7/solr/build/solr-core/test/J1/org.apache.solr.cloud.BasicDistributedZk2Test-1347873884054/jetty4/index lockFactory=org.apache.lucene.store.NativeFSLockFactory@5f7871; maxCacheMB=48.0 maxMergeSizeMB=4.0),segFN=segments_2,generation=2,filenames=[segments_2]
[junit4:junit4]   2> 14300 T2259 C174 P39633 oasc.SolrDeletionPolicy.updateCommits newest commit = 2
[junit4:junit4]   2> 14305 T2259 C174 P39633 oass.SolrIndexSearcher.<init> Opening Searcher@2fce09ca main
[junit4:junit4]   2> 14306 T2259 C174 P39633 oasu.DirectUpdateHandler2.commit end_commit_flush
[junit4:junit4]   2> 14307 T2258 oasc.SolrCore.registerSearcher [collection1] Registered new searcher Searcher@2fce09ca main{StandardDirectoryReader(segments_2:2)}
[junit4:junit4]   2> 14308 T2259 C174 P39633 oasc.RecoveryStrategy.replay No replay needed. core=collection1
[junit4:junit4]   2> 14308 T2259 C174 P39633 oasc.RecoveryStrategy.doRecovery Replication Recovery was successful - registering as Active. core=collection1
[junit4:junit4]   2> 14405 T2259 C174 P39633 oasc.RecoveryStrategy.doRecovery Finished recovery process. core=collection1
[junit4:junit4]   2> 14773 T2206 oascc.ZkStateReader.updateClusterState Updating cloud state from ZooKeeper... 
[junit4:junit4]   2> 14821 T2257 oascc.ZkStateReader$2.process A cluster state change has occurred - updating...
[junit4:junit4]   2> 14821 T2231 oascc.ZkStateReader$2.process A cluster state change has occurred - updating...
[junit4:junit4]   2> 14821 T2264 oascc.ZkStateReader$2.process A cluster state change has occurred - updating...
[junit4:junit4]   2> 14821 T2205 oascc.ZkStateReader$2.process A cluster state change has occurred - updating...
[junit4:junit4]   2> 14821 T2262 oascc.ZkStateReader$2.process A cluster state change has occurred - updating...
[junit4:junit4]   2> 14821 T2243 oascc.ZkStateReader$2.process A cluster state change has occurred - updating...
[junit4:junit4]   2> 14821 T2219 oascc.ZkStateReader$2.process A cluster state change has occurred - updating...
[junit4:junit4]   2> 15272 T2185 oascc.ZkStateReader.updateClusterState Updating cloud state from ZooKeeper... 
[junit4:junit4]   2> 15275 T2197 C176 P39612 oasu.DirectUpdateHandler2.commit start commit{flags=0,_version_=0,optimize=false,openSearcher=true,waitSearcher=true,expungeDeletes=false,softCommit=false}
[junit4:junit4]   2> 15353 T2197 C176 P39612 oasc.SolrDeletionPolicy.onCommit SolrDeletionPolicy.onCommit: commits:num=2
[junit4:junit4]   2> 		commit{dir=NRTCachingDirectory(org.apache.lucene.store.NIOFSDirectory@/usr/home/hudson/hudson-slave/workspace/Lucene-Solr-Tests-4.x-java7/solr/build/solr-core/test/J1/org.apache.solr.cloud.BasicDistributedZk2Test-1347873884054/control/data/index lockFactory=org.apache.lucene.store.NativeFSLockFactory@68a025f4; maxCacheMB=48.0 maxMergeSizeMB=4.0),segFN=segments_1,generation=1,filenames=[segments_1]
[junit4:junit4]   2> 		commit{dir=NRTCachingDirectory(org.apache.lucene.store.NIOFSDirectory@/usr/home/hudson/hudson-slave/workspace/Lucene-Solr-Tests-4.x-java7/solr/build/solr-core/test/J1/org.apache.solr.cloud.BasicDistributedZk2Test-1347873884054/control/data/index lockFactory=org.apache.lucene.store.NativeFSLockFactory@68a025f4; maxCacheMB=48.0 maxMergeSizeMB=4.0),segFN=segments_2,generation=2,filenames=[_0_Block_0.pos, _0_Block_0.tip, _0_Lucene40_0.tim, _0.fnm, _0_Block_0.doc, _0_Memory_0.ram, _0_Block_0.tim, _0_nrm.cfs, _0_Lucene40_0.prx, _0_Lucene40_0.tip, _0_Lucene40WithOrds_0.tii, _0_Lucene40WithOrds_0.frq, _0_Lucene40_0.frq, _0_nrm.cfe, segments_2, _0.fdx, _0_Lucene40WithOrds_0.prx, _0.si, _0_Lucene40WithOrds_0.tib, _0.fdt]
[junit4:junit4]   2> 15354 T2197 C176 P39612 oasc.SolrDeletionPolicy.updateCommits newest commit = 2
[junit4:junit4]   2> 15365 T2197 C176 P39612 oass.SolrIndexSearcher.<init> Opening Searcher@2f67bc9c main
[junit4:junit4]   2> 15366 T2197 C176 P39612 oasu.DirectUpdateHandler2.commit end_commit_flush
[junit4:junit4]   2> 15367 T2208 oasc.SolrCore.registerSearcher [collection1] Registered new searcher Searcher@2f67bc9c main{StandardDirectoryReader(segments_2:3 _0(4.0.0.2):C1)}
[junit4:junit4]   2> 15368 T2197 C176 P39612 /update {waitSearcher=true&wt=javabin&commit=true&softCommit=false&version=2} {commit=} 0 93
[junit4:junit4]   2> 15369 T2225 C175 P39623 oasu.DirectUpdateHandler2.commit start commit{flags=0,_version_=0,optimize=false,openSearcher=true,waitSearcher=true,expungeDeletes=false,softCommit=false}
[junit4:junit4]   2> 15374 T2225 C175 P39623 oass.SolrIndexSearcher.<init> Opening Searcher@6e4924cb main
[junit4:junit4]   2> 15375 T2225 C175 P39623 oasu.DirectUpdateHandler2.commit end_commit_flush
[junit4:junit4]   2> 15376 T2232 oasc.SolrCore.registerSearcher [collection1] Registered new searcher Searcher@6e4924cb main{StandardDirectoryReader(segments_1:1)}
[junit4:junit4]   2> 15377 T2225 C175 P39623 oasu.SolrCmdDistributor.distribCommit Distrib commit to:[StdNode: http://127.0.0.1:39618/solr/collection1/, StdNode: http://127.0.0.1:39628/solr/collection1/, StdNode: http://127.0.0.1:39633/solr/collection1/]
[junit4:junit4]   2>  C172_STATE=coll:collection1 core:collection1 props:{shard=shard1, roles=null, state=active, core=collection1, collection=collection1, node_name=127.0.0.1:39628_solr, base_url=http://127.0.0.1:39628/solr}
[junit4:junit4]   2> 15379 T2235 C172 P39628 oasu.DirectUpdateHandler2.commit start commit{flags=0,_version_=0,optimize=false,openSearcher=true,waitSearcher=true,expungeDeletes=false,softCommit=false}
[junit4:junit4]   2> 15379 T2213 C173 P39618 oasu.DirectUpdateHandler2.commit start commit{flags=0,_version_=0,optimize=false,openSearcher=true,waitSearcher=true,expungeDeletes=false,softCommit=false}
[junit4:junit4]   2> 15382 T2235 C172 P39628 oass.SolrIndexSearcher.<init> Opening Searcher@6e341d9a main
[junit4:junit4]   2> 15383 T2235 C172 P39628 oasu.DirectUpdateHandler2.commit end_commit_flush
[junit4:junit4]   2> 15384 T2244 oasc.SolrCore.registerSearcher [collection1] Registered new searcher Searcher@6e341d9a main{StandardDirectoryReader(segments_2:3:nrt _0(4.0.0.2):C1)}
[junit4:junit4]   2> 15384 T2235 C172 P39628 /update {waitSearcher=true&commit=true&wt=javabin&commit_end_point=true&expungeDeletes=false&softCommit=false&version=2} {commit=} 0 5
[junit4:junit4]   2>  C174_STATE=coll:collection1 core:collection1 props:{shard=shard2, roles=null, state=active, core=collection1, collection=collection1, node_name=127.0.0.1:39633_solr, base_url=http://127.0.0.1:39633/solr}
[junit4:junit4]   2> 15391 T2249 C174 P39633 oasu.DirectUpdateHandler2.commit start commit{flags=0,_version_=0,optimize=false,openSearcher=true,waitSearcher=true,expungeDeletes=false,softCommit=false}
[junit4:junit4]   2> 15394 T2213 C173 P39618 oass.SolrIndexSearcher.<init> Opening Searcher@7f824243 main
[junit4:junit4]   2> 15395 T2213 C173 P39618 oasu.DirectUpdateHandler2.commit end_commit_flush
[junit4:junit4]   2> 15396 T2220 oasc.SolrCore.registerSearcher [collection1] Registered new searcher Searcher@7f824243 main{StandardDirectoryReader(segments_2:3 _0(4.0.0.2):C1)}
[junit4:junit4]   2> 15396 T2249 C174 P39633 oass.SolrIndexSearcher.<init> Opening Searcher@316b3fd9 main
[junit4:junit4]   2> 15396 T2213 C173 P39618 /update {waitSearcher=true&commit=true&wt=javabin&commit_end_point=true&expungeDeletes=false&softCommit=false&version=2} {commit=} 0 17
[junit4:junit4]   2> 15396 T2249 C174 P39633 oasu.DirectUpdateHandler2.commit end_commit_flush
[junit4:junit4]   2> 15398 T2258 oasc.SolrCore.registerSearcher [collection1] Registered new searcher Searcher@316b3fd9 main{StandardDirectoryReader(segments_2:2)}
[junit4:junit4]   2> 15398 T2249 C174 P39633 /update {waitSearcher=true&commit=true&wt=javabin&commit_end_point=true&expungeDeletes=false&softCommit=false&version=2} {commit=} 0 7
[junit4:junit4]   2> 15399 T2225 C175 P39623 /update {waitSearcher=true&wt=javabin&commit=true&softCommit=false&version=2} {commit=} 0 30
[junit4:junit4]   2> 15405 T2198 C176 P39612 REQ /select {fl=id,score&shard.url=127.0.0.1:39612/solr/collection1/&NOW=1347873899450&start=0&q=*:*&distrib=false&isShard=true&wt=javabin&fsv=true&rows=10&version=2} hits=1 status=0 QTime=0 
[junit4:junit4]   2> 15408 T2198 C176 P39612 REQ /select {shard.url=127.0.0.1:39612/solr/collection1/&NOW=1347873899450&q=*:*&ids=1&distrib=false&isShard=true&wt=javabin&version=2} status=0 QTime=0 
[junit4:junit4]   2> 15409 T2197 C176 P39612 REQ /select {wt=javabin&q=*:*&version=2} hits=1 status=0 QTime=8 
[junit4:junit4]   2> 15409 T2185 oaz.ZooKeeper.<init> Initiating client connection, connectString=127.0.0.1:39608/solr sessionTimeout=10000 watcher=org.apache.solr.common.cloud.ConnectionManager@45a532a
[junit4:junit4]   2> 15410 T2272 oaz.ClientCnxn$SendThread.startConnect Opening socket connection to server /127.0.0.1:39608
[junit4:junit4]   2> 15410 T2185 oascc.ConnectionManager.waitForConnected Waiting for client to connect to ZooKeeper
[junit4:junit4]   2> 15411 T2272 oaz.ClientCnxn$SendThread.primeConnection Socket connection established to localhost/127.0.0.1:39608, initiating session
[junit4:junit4]   2> 15411 T2187 oazs.NIOServerCnxn$Factory.run Accepted socket connection from /140.211.11.196:39661
[junit4:junit4]   2> 15412 T2187 oazs.NIOServerCnxn.readConnectRequest Client attempting to establish new session at /140.211.11.196:39661
[junit4:junit4]   2> 15413 T2189 oazs.NIOServerCnxn.finishSessionInit Established session 0x139d38b479a0009 with negotiated timeout 10000 for client /140.211.11.196:39661
[junit4:junit4]   2> 15413 T2272 oaz.ClientCnxn$SendThread.readConnectResult Session establishment complete on server localhost/127.0.0.1:39608, sessionid = 0x139d38b479a0009, negotiated timeout = 10000
[junit4:junit4]   2> 15413 T2273 oascc.ConnectionManager.process Watcher org.apache.solr.common.cloud.ConnectionManager@45a532a name:ZooKeeperConnection Watcher:127.0.0.1:39608/solr got event WatchedEvent state:SyncConnected type:None path:null path:null type:None
[junit4:junit4]   2> 15413 T2185 oascc.ConnectionManager.waitForConnected Client is connected to ZooKeeper
[junit4:junit4]   2> 15414 T2185 oascc.ZkStateReader.createClusterStateWatchersAndUpdate Updating cluster state from ZooKeeper... 
[junit4:junit4]   2> 15415 T2190 oazs.PrepRequestProcessor.pRequest Processed session termination for sessionid: 0x139d38b479a0009
[junit4:junit4]   2> 15416 T2273 oaz.ClientCnxn$EventThread.run EventThread shut down
[junit4:junit4]   2> 15416 T2187 oazs.NIOServerCnxn.closeSock Closed socket connection for client /140.211.11.196:39661 which had sessionid 0x139d38b479a0009
[junit4:junit4]   2> 15416 T2185 oaz.ZooKeeper.close Session: 0x139d38b479a0009 closed
[junit4:junit4]   2> 15418 T2216 C173 P39618 REQ /select {distrib=false&wt=javabin&q=*:*&version=2} hits=1 status=0 QTime=0 
[junit4:junit4]   2> 15420 T2228 C175 P39623 REQ /select {distrib=false&wt=javabin&q=*:*&version=2} hits=0 status=0 QTime=0 
[junit4:junit4]   2> 15426 T2236 C172 P39628 REQ /select {fl=id,score&shard.url=127.0.0.1:39618/solr/collection1/|127.0.0.1:39628/solr/collection1/&NOW=1347873899471&start=0&q=*:*&distrib=false&isShard=true&wt=javabin&fsv=true&rows=10&version=2} hits=1 status=0 QTime=0 
[junit4:junit4]   2> 15426 T2229 C175 P39623 REQ /select {fl=id,score&shard.url=127.0.0.1:39623/solr/collection1/|127.0.0.1:39633/solr/collection1/&NOW=1347873899471&start=0&q=*:*&distrib=false&isShard=true&wt=javabin&fsv=true&rows=10&version=2} hits=0 status=0 QTime=0 
[junit4:junit4]   2> 15429 T2236 C172 P39628 REQ /select {shard.url=127.0.0.1:39618/solr/collection1/|127.0.0.1:39628/solr/collection1/&NOW=1347873899471&q=*:*&ids=1&distrib=false&isShard=true&wt=javabin&version=2} status=0 QTime=0 
[junit4:junit4]   2> 15430 T2217 C173 P39618 REQ /select {wt=javabin&q=*:*&version=2} hits=1 status=0 QTime=8 
[junit4:junit4]   2> 15436 T2197 C176 P39612 /update {wt=javabin&version=2} {add=[2 (1413348222023237632)]} 0 3
[junit4:junit4]   2> 15448 T2249 C174 P39633 REQ /update {distrib.from=http://127.0.0.1:39623/solr/collection1/&update.distrib=FROMLEADER&wt=javabin&version=2} status=0 QTime=3 
[junit4:junit4]   2> 15449 T2225 C175 P39623 /update {wt=javabin&version=2} {add=[2 (1413348222029529088)]} 0 10
[junit4:junit4]   2> 15453 T2197 C176 P39612 /update {wt=javabin&version=2} {add=[3 (1413348222043160576)]} 0 1
[junit4:junit4]   2> 15463 T2249 C174 P39633 REQ /update {update.distrib=FROMLEADER&distrib.from=http://127.0.0.1:39623/solr/collection1/&wt=javabin&version=2} status=0 QTime=1 
[junit4:junit4]   2> 15464 T2224 C175 P39623 REQ /update {distrib.from=http://127.0.0.1:39618/solr/collection1/&update.distrib=TOLEADER&wt=javabin&version=2} status=0 QTime=6 
[junit4:junit4]   2> 15464 T2217 C173 P39618 /update {wt=javabin&version=2} {add=[3]} 0 8
[junit4:junit4]   2> 15468 T2197 C176 P39612 /update {wt=javabin&version=2} {add=[4 (1413348222058889216)]} 0 1
[junit4:junit4]   2> 15481 T2235 C172 P39628 REQ /update {distrib.from=http://127.0.0.1:39618/solr/collection1/&update.distrib=FROMLEADER&wt=javabin&version=2} status=0 QTime=4 
[junit4:junit4]   2> 15482 T2217 C173 P39618 /update {wt=javabin&version=2} {add=[4 (1413348222062034944)]} 0 12
[junit4:junit4]   2> 15486 T2197 C176 P39612 /update {wt=javabin&version=2} {add=[5 (1413348222077763584)]} 0 1
[junit4:junit4]   2> 15494 T2249 C174 P39633 REQ /update {distrib.from=http://127.0.0.1:39623/solr/collection1/&update.distrib=FROMLEADER&wt=javabin&version=2} status=0 QTime=1 
[junit4:junit4]   2> 15494 T2225 C175 P39623 /update {wt=javabin&version=2} {add=[5 (1413348222081957888)]} 0 5
[junit4:junit4]   2> 15498 T2197 C176 P39612 /update {wt=javabin&version=2} {add=[6 (1413348222090346496)]} 0 1
[junit4:junit4]   2> 15506 T2249 C174 P39633 REQ /update {distrib.from=http://127.0.0.1:39623/solr/collection1/&update.distrib=FROMLEADER&wt=javabin&version=2} status=0 QTime=1 
[junit4:junit4]   2> 15507 T2225 C175 P39623 /update {wt=javabin&version=2} {add=[6 (1413348222094540800)]} 0 6
[junit4:junit4]   2> 15512 T2197 C176 P39612 /update {wt=javabin&version=2} {add=[7 (1413348222103977984)]} 0 2
[junit4:junit4]   2> 15520 T2249 C174 P39633 REQ /update {update.distrib=FROMLEADER&distrib.from=http://127.0.0.1:39623/solr/collection1/&wt=javabin&version=2} status=0 QTime=1 
[junit4:junit4]   2> 15521 T2224 C175 P39623 REQ /update {distrib.from=http://127.0.0.1:39618/solr/collection1/&update.distrib=TOLEADER&wt=javabin&version=2} status=0 QTime=5 
[junit4:junit4]   2> 15521 T2217 C173 P39618 /update {wt=javabin&version=2} {add=[7]} 0 7
[junit4:junit4]   2> 15525 T2197 C176 P39612 /update {wt=javabin&version=2} {add=[8 (1413348222118658048)]} 0 1
[junit4:junit4]   2> 15533 T2235 C172 P39628 REQ /update {distrib.from=http://127.0.0.1:39618/solr/collection1/&update.distrib=FROMLEADER&wt=javabin&version=2} status=0 QTime=2 
[junit4:junit4]   2> 15533 T2217 C173 P39618 /update {wt=javabin&version=2} {add=[8 (1413348222122852352)]} 0 5
[junit4:junit4]   2> 15537 T2197 C176 P39612 /update {wt=javabin&version=2} {add=[9 (1413348222131240960)]} 0 1
[junit4:junit4]   2> 15544 T2249 C174 P39633 REQ /update {distrib.from=http://127.0.0.1:39623/solr/collection1/&update.distrib=FROMLEADER&wt=javabin&version=2} status=0 QTime=1 
[junit4:junit4]   2> 15545 T2225 C175 P39623 /update {wt=javabin&version=2} {add=[9 (1413348222135435264)]} 0 5
[junit4:junit4]   2> 15549 T2197 C176 P39612 /update {wt=javabin&version=2} {add=[10 (1413348222143823872)]} 0 1
[junit4:junit4]   2> 15558 T2235 C172 P39628 REQ /update {update.distrib=FROMLEADER&distrib.from=http://127.0.0.1:39618/solr/collection1/&wt=javabin&version=2} status=0 QTime=1 
[junit4:junit4]   2> 15559 T2213 C173 P39618 REQ /update {distrib.from=http://127.0.0.1:39623/solr/collection1/&update.distrib=TOLEADER&wt=javabin&version=2} status=0 QTime=5 
[junit4:junit4]   2> 15560 T2225 C175 P39623 /update {wt=javabin&version=2} {add=[10]} 0 8
[junit4:junit4]   2> 15574 T2197 C176 P39612 /update {wt=javabin&version=2} {add=[11 (1413348222158503936)]} 0 12
[junit4:junit4]   2> 15583 T2235 C172 P39628 REQ /update {distrib.from=http://127.0.0.1:39618/solr/collection1/&update.distrib=FROMLEADER&wt=javabin&version=2} status=0 QTime=2 
[junit4:junit4]   2> 15583 T2217 C173 P39618 /update {wt=javabin&version=2} {add=[11 (1413348222174232576)]} 0 6
[junit4:junit4]   2> 15589 T2197 C176 P39612 /update {wt=javabin&version=2} {add=[12 (1413348222183669760)]} 0 3
[junit4:junit4]   2> 15599 T2235 C172 P39628 REQ /update {update.distrib=FROMLEADER&distrib.from=http://127.0.0.1:39618/solr/collection1/&wt=javabin&version=2} status=0 QTime=2 
[junit4:junit4]   2> 15599 T2213 C173 P39618 REQ /update {distrib.from=http://127.0.0.1:39623/solr/collection1/&update.distrib=TOLEADER&wt=javabin&version=2} status=0 QTime=6 
[junit4:junit4]   2> 15600 T2225 C175 P39623 /update {wt=javabin&version=2} {add=[12]} 0 9
[junit4:junit4]   2> 15605 T2197 C176 P39612 /update {wt=javabin&version=2} {add=[13 (1413348222201495552)]} 0 2
[junit4:junit4]   2> 15615 T2235 C172 P39628 REQ /update {update.distrib=FROMLEADER&distrib.from=http://127.0.0.1:39618/solr/collection1/&wt=javabin&version=2} status=0 QTime=2 
[junit4:junit4]   2> 15615 T2213 C173 P39618 REQ /update {distrib.from=http://127.0.0.1:39623/solr/collection1/&update.distrib=TOLEADER&wt=javabin&version=2} status=0 QTime=6 
[junit4:junit4]   2> 15616 T2225 C175 P39623 /update {wt=javabin&version=2} {add=[13]} 0 9
[junit4:junit4]   2> 15620 T2197 C176 P39612 /update {wt=javabin&version=2} {add=[14 (1413348222218272768)]} 0 1
[junit4:junit4]   2> 15629 T2235 C172 P39628 REQ /update {distrib.from=http://127.0.0.1:39618/solr/collection1/&update.distrib=FROMLEADER&wt=javabin&version=2} status=0 QTime=2 
[junit4:junit4]   2> 15629 T2217 C173 P39618 /update {wt=javabin&version=2} {add=[14 (1413348222222467072)]} 0 6
[junit4:junit4]   2> 15633 T2197 C176 P39612 /update {wt=javabin&version=2} {add=[15 (1413348222231904256)]} 0 1
[junit4:junit4]   2> 15643 T2235 C172 P39628 REQ /update {distrib.from=http://127.0.0.1:39618/solr/collection1/&update.distrib=FROMLEADER&wt=javabin&version=2} status=0 QTime=2 
[junit4:junit4]   2> 15644 T2217 C173 P39618 /update {wt=javabin&version=2} {add=[15 (1413348222236098560)]} 0 8
[junit4:junit4]   2> 15648 T2197 C176 P39612 /update {wt=javabin&version=2} {add=[16 (1413348222247632896)]} 0 1
[junit4:junit4]   2> 15658 T2235 C172 P39628 REQ /update {update.distrib=FROMLEADER&distrib.from=http://127.0.0.1:39618/solr/collection1/&wt=javabin&version=2} status=0 QTime=1 
[junit4:junit4]   2> 15659 T2213 C173 P39618 REQ /update {distrib.from=http://127.0.0.1:39623/solr/collection1/&update.distrib=TOLEADER&wt=javabin&version=2} status=0 QTime=6 
[junit4:junit4]   2> 15660 T2225 C175 P39623 /update {wt=javabin&version=2} {add=[16]} 0 9
[junit4:junit4]   2> 15666 T2197 C176 P39612 /update {wt=javabin&version=2} {add=[17 (1413348222264410112)]} 0 3
[junit4:junit4]   2> 15680 T2249 C174 P39633 REQ /update {update.distrib=FROMLEADER&distrib.from=http://127.0.0.1:39623/solr/collection1/&wt=javabin&version=2} status=0 QTime=3 
[junit4:junit4]   2> 15681 T2224 C175 P39623 REQ /update {distrib.from=http://127.0.0.1:39618/solr/collection1/&update.distrib=TOLEADER&wt=javabin&version=2} status=0 QTime=10 
[junit4:junit4]   2> 15681 T2217 C173 P39618 /update {wt=javabin&version=2} {add=[17]} 0 13
[junit4:junit4]   2> 15685 T2197 C176 P39612 /update {wt=javabin&version=2} {add=[100 (1413348222286430208)]} 0 1
[junit4:junit4]   2> 15726 T2235 C172 P39628 REQ /update {update.distrib=FROMLEADER&distrib.from=http://127.0.0.1:39618/solr/collection1/&wt=javabin&version=2} status=0 QTime=15 
[junit4:junit4]   2> 15728 T2213 C173 P39618 REQ /update {distrib.from=http://127.0.0.1:39623/solr/collection1/&update.distrib=TOLEADER&wt=javabin&version=2} status=0 QTime=38 
[junit4:junit4]   2> 15729 T2225 C175 P39623 /update {wt=javabin&version=2} {add=[100]} 0 42
[junit4:junit4]   2> 15733 T2197 C176 P39612 /update {wt=javabin&version=2} {add=[101 (1413348222336761856)]} 0 1
[junit4:junit4]   2> 15749 T2235 C172 P39628 REQ /update {update.distrib=FROMLEADER&distrib.from=http://127.0.0.1:39618/solr/collection1/&wt=javabin&version=2} status=0 QTime=3 
[junit4:junit4]   2> 15750 T2213 C173 P39618 REQ /update {distrib.from=http://127.0.0.1:39623/solr/collection1/&update.distrib=TOLEADER&wt=javabin&version=2} status=0 QTime=11 
[junit4:junit4]   2> 15751 T2225 C175 P39623 /update {wt=javabin&version=2} {add=[101]} 0 15
[junit4:junit4]   2> 15755 T2197 C176 P39612 /update {wt=javabin&version=2} {add=[102 (1413348222359830528)]} 0 1
[junit4:junit4]   2> 15762 T2235 C172 P39628 REQ /update {distrib.from=http://127.0.0.1:39618/solr/collection1/&update.distrib=FROMLEADER&wt=javabin&version=2} status=0 QTime=1 
[junit4:junit4]   2> 15763 T2217 C173 P39618 /update {wt=javabin&version=2} {add=[102 (1413348222362976256)]} 0 6
[junit4:junit4]   2> 15779 T2197 C176 P39612 /update {wt=javabin&version=2} {add=[103 (1413348222372413440)]} 0 13
[junit4:junit4]   2> 15790 T2249 C174 P39633 REQ /update {update.distrib=FROMLEADER&distrib.from=http://127.0.0.1:39623/solr/collection1/&wt=javabin&version=2} status=0 QTime=1 
[junit4:junit4]   2> 15790 T2224 C175 P39623 REQ /update {distrib.from=http://127.0.0.1:39618/solr/collection1/&update.distrib=TOLEADER&wt=javabin&version=2} status=0 QTime=5 
[junit4:junit4]   2> 15791 T2217 C173 P39618 /update {wt=javabin&version=2} {add=[103]} 0 9
[junit4:junit4]   2> 15796 T2197 C176 P39612 /update {wt=javabin&version=2} {add=[104 (1413348222401773568)]} 0 2
[junit4:junit4]   2> 15807 T2249 C174 P39633 REQ /update {update.distrib=FROMLEADER&distrib.from=http://127.0.0.1:39623/solr/collection1/&wt=javabin&version=2} status=0 QTime=2 
[junit4:junit4]   2> 15808 T2224 C175 P39623 REQ /update {distrib.from=http://127.0.0.1:39618/solr/collection1/&update.distrib=TOLEADER&wt=javabin&version=2} status=0 QTime=6 
[junit4:junit4]   2> 15808 T2217 C173 P39618 /update {wt=javabin&version=2} {add=[104]} 0 9
[junit4:junit4]   2> 15812 T2197 C176 P39612 /update {wt=javabin&version=2} {add=[105 (1413348222419599360)]} 0 1
[junit4:junit4]   2> 15842 T2249 C174 P39633 REQ /update {update.distrib=FROMLEADER&distrib.from=http://127.0.0.1:39623/solr/collection1/&wt=javabin&version=2} status=0 QTime=13 
[junit4:junit4]   2> 15843 T2224 C175 P39623 REQ /update {distrib.from=http://127.0.0.1:39618/solr/collection1/&update.distrib=TOLEADER&wt=javabin&version=2} status=0 QTime=25 
[junit4:junit4]   2> 15843 T2217 C173 P39618 /update {wt=javabin&version=2} {add=[105]} 0 28
[junit4:junit4]   2> 15847 T2197 C176 P39612 /update {wt=javabin&version=2} {add=[106 (1413348222456299520)]} 0 1
[junit4:junit4]   2> 15921 T2249 C174 P39633 REQ /update {distrib.from=http://127.0.0.1:39623/solr/collection1/&update.distrib=FROMLEADER&wt=javabin&version=2} status=0 QTime=2 
[junit4:junit4]   2> 15922 T2225 C175 P39623 /update {wt=javabin&version=2} {add=[106 (1413348222460493824)]} 0 72
[junit4:junit4]   2> 15926 T2197 C176 P39612 /update {wt=javabin&version=2} {add=[107 (1413348222539137024)]} 0 1
[junit4:junit4]   2> 15936 T2235 C172 P39628 REQ /update {update.distrib=FROMLEADER&distrib.from=http://127.0.0.1:39618/solr/collection1/&wt=javabin&version=2} status=0 QTime=2 
[junit4:junit4]   2> 15936 T2213 C173 P39618 REQ /update {distrib.from=http://127.0.0.1:39623/solr/collection1/&update.distrib=TOLEADER&wt=javabin&version=2} status=0 QTime=5 
[junit4:junit4]   2> 15937 T2225 C175 P39623 /update {wt=javabin&version=2} {add=[107]} 0 8
[junit4:junit4]   2> 15941 T2197 C176 P39612 /update {wt=javabin&version=2} {add=[108 (1413348222554865664)]} 0 1
[junit4:junit4]   2> 15948 T2235 C172 P39628 REQ /update {distrib.from=http://127.0.0.1:39618/solr/collection1/&update.distrib=FROMLEADER&wt=javabin&version=2} status=0 QTime=1 
[junit4:junit4]   2> 15948 T2217 C173 P39618 /update {wt=javabin&version=2} {add=[108 (1413348222559059968)]} 0 4
[junit4:junit4]   2> 15952 T2197 C176 P39612 /update {wt=javabin&version=2} {add=[109 (1413348222566400000)]} 0 1
[junit4:junit4]   2> 15961 T2235 C172 P39628 REQ /update {update.distrib=FROMLEADER&distrib.from=http://127.0.0.1:39618/solr/collection1/&wt=javabin&version=2} status=0 QTime=1 
[junit4:junit4]   2> 15962 T2213 C173 P39618 REQ /update {distrib.from=http://127.0.0.1:39623/solr/collection1/&update.distrib=TOLEADER&wt=javabin&version=2} status=0 QTime=5 
[junit4:junit4]   2> 15962 T2225 C175 P39623 /update {wt=javabin&version=2} {add=[109]} 0 7
[junit4:junit4]   2> 15966 T2197 C176 P39612 /update {wt=javabin&version=2} {add=[110 (1413348222581080064)]} 0 1
[junit4:junit4]   2> 15972 T2235 C172 P39628 REQ /update {distrib.from=http://127.0.0.1:39618/solr/collection1/&update.distrib=FROMLEADER&wt=javabin&version=2} status=0 QTime=1 
[junit4:junit4]   2> 15972 T2217 C173 P39618 /update {wt=javabin&version=2} {add=[110 (1413348222584225792)]} 0 4
[junit4:junit4]   2> 15976 T2197 C176 P39612 /update {wt=javabin&version=2} {add=[111 (1413348222591565824)]} 0 1
[junit4:junit4]   2> 15985 T2235 C172 P39628 REQ /update {update.distrib=FROMLEADER&distrib.from=http://127.0.0.1:39618/solr/collection1/&wt=javabin&version=2} status=0 QTime=1 
[junit4:junit4]   2> 15985 T2213 C173 P39618 REQ /update {distrib.from=http://127.0.0.1:39623/solr/collection1/&update.distrib=TOLEADER&wt=javabin&version=2} status=0 QTime=4 
[junit4:junit4]   2> 15986 T2225 C175 P39623 /update {wt=javabin&version=2} {add=[111]} 0 7
[junit4:junit4]   2> 15990 T2197 C176 P39612 /update {wt=javabin&version=2} {add=[112 (1413348222606245888)]} 0 1
[junit4:junit4]   2> 15998 T2249 C174 P39633 REQ /update {update.distrib=FROMLEADER&distrib.from=http://127.0.0.1:39623/solr/collection1/&wt=javabin&version=2} status=0 QTime=1 
[junit4:junit4]   2> 15998 T2224 C175 P39623 REQ /update {distrib.from=http://127.0.0.1:39618/solr/collection1/&update.distrib=TOLEADER&wt=javabin&version=2} status=0 QTime=4 
[junit4:junit4]   2> 15999 T2217 C173 P39618 /update {wt=javabin&version=2} {add=[112]} 0 7
[junit4:junit4]   2> 16011 T2197 C176 P39612 /update {wt=javabin&version=2} {add=[113 (1413348222619877376)]} 0 9
[junit4:junit4]   2> 16019 T2235 C172 P39628 REQ /update {update.distrib=FROMLEADER&distrib.from=http://127.0.0.1:39618/solr/collection1/&wt=javabin&version=2} status=0 QTime=1 
[junit4:junit4]   2> 16020 T2213 C173 P39618 REQ /update {distrib.from=http://127.0.0.1:39623/solr/collection1/&update.distrib=TOLEADER&wt=javabin&version=2} status=0 QTime=5 
[junit4:junit4]   2> 16021 T2225 C175 P39623 /update {wt=javabin&version=2} {add=[113]} 0 8
[junit4:junit4]   2> 16024 T2197 C176 P39612 /update {wt=javabin&version=2} {add=[114 (1413348222641897472)]} 0 1
[junit4:junit4]   2> 16033 T2235 C172 P39628 REQ /update {update.distrib=FROMLEADER&distrib.from=http://127.0.0.1:39618/solr/collection1/&wt=javabin&version=2} status=0 QTime=1 
[junit4:junit4]   2> 16034 T2213 C173 P39618 REQ /update {distrib.from=http://127.0.0.1:39623/solr/collection1/&update.distrib=TOLEADER&wt=javabin&version=2} status=0 QTime=5 
[junit4:junit4]   2> 16035 T2225 C175 P39623 /update {wt=javabin&version=2} {add=[114]} 0 8
[junit4:junit4]   2> 16038 T2197 C176 P39612 /update {wt=javabin&version=2} {add=[115 (1413348222656577536)]} 0 1
[junit4:junit4]   2> 16044 T2249 C174 P39633 REQ /update {distrib.from=http://127.0.0.1:39623/solr/collection1/&update.distrib=FROMLEADER&wt=javabin&version=2} status=0 QTime=1 
[junit4:junit4]   2> 16044 T2225 C175 P39623 /update {wt=javabin&version=2} {add=[115 (1413348222659723264)]} 0 4
[junit4:junit4]   2> 16048 T2197 C176 P39612 /update {wt=javabin&version=2} {add=[116 (1413348222667063296)]} 0 1
[junit4:junit4]   2> 16054 T2249 C174 P39633 REQ /update {distrib.from=http://127.0.0.1:39623/solr/collection1/&update.distrib=FROMLEADER&wt=javabin&version=2} status=0 QTime=1 
[junit4:junit4]   2> 16054 T2225 C175 P39623 /update {wt=javabin&version=2} {add=[116 (1413348222670209024)]} 0 4
[junit4:junit4]   2> 16058 T2197 C176 P39612 /update {wt=javabin&version=2} {add=[117 (1413348222677549056)]} 0 1
[junit4:junit4]   2> 16064 T2249 C174 P39633 REQ /update {distrib.from=http://127.0.0.1:39623/solr/collection1/&update.distrib=FROMLEADER&wt=javabin&version=2} status=0 QTime=1 
[junit4:junit4]   2> 16064 T2225 C175 P39623 /update {wt=javabin&version=2} {add=[117 (1413348222680694784)]} 0 4
[junit4:junit4]   2> 16068 T2197 C176 P39612 /update {wt=javabin&version=2} {add=[118 (1413348222688034816)]} 0 1
[junit4:junit4]   2> 16091 T2235 C172 P39628 REQ /update {distrib.from=http://127.0.0.1:39618/solr/collection1/&update.distrib=FROMLEADER&wt=javabin&version=2} status=0 QTime=10 
[junit4:junit4]   2> 16092 T2217 C173 P39618 /update {wt=javabin&version=2} {add=[118 (1413348222691180544)]} 0 22
[junit4:junit4]   2> 16095 T2197 C176 P39612 /update {wt=javabin&version=2} {add=[119 (1413348222716346368)]} 0 1
[junit4:junit4]   2> 16102 T2249 C174 P39633 REQ /update {distrib.from=http://127.0.0.1:39623/solr/collection1/&update.distrib=FROMLEADER&wt=javabin&version=2} status=0 QTime=1 
[junit4:junit4]   2> 16102 T2225 C175 P39623 /update {wt=javabin&version=2} {add=[119 (1413348222720540672)]} 0 4
[junit4:junit4]   2> 16106 T2197 C176 P39612 /update {wt=javabin&version=2} {add=[120 (1413348222727880704)]} 0 1
[junit4:junit4]   2> 16114 T2249 C174 P39633 REQ /update {update.distrib=FROMLEADER&distrib.from=http://127.0.0.1:39623/solr/collection1/&wt=javabin&version=2} status=0 QTime=1 
[junit4:junit4]   2> 16114 T2224 C175 P39623 REQ /update {distrib.from=http://127.0.0.1:39618/solr/collection1/&update.distrib=TOLEADER&wt=javabin&version=2} status=0 QTime=4 
[junit4:junit4]   2> 16115 T2217 C173 P39618 /update {wt=javabin&version=2} {add=[120]} 0 7
[junit4:junit4]   2> 16117 T2197 C176 P39612 /update {wt=javabin&version=2} {add=[121 (1413348222740463616)]} 0 0
[junit4:junit4]   2> 16124 T2249 C174 P39633 REQ /update {distrib.from=http://127.0.0.1:39623/solr/collection1/&update.distrib=FROMLEADER&wt=javabin&version=2} status=0 QTime=1 
[junit4:junit4]   2> 16124 T2225 C175 P39623 /update {wt=javabin&version=2} {add=[121 (1413348222743609344)]} 0 4
[junit4:junit4]   2> 16128 T2197 C176 P39612 /update {wt=javabin&version=2} {add=[122 (1413348222750949376)]} 0 1
[junit4:junit4]   2> 16138 T2235 C172 P39628 REQ /update {update.distrib=FROMLEADER&distrib.from=http://127.0.0.1:39618/solr/collection1/&wt=javabin&version=2} status=0 QTime=2 
[junit4:junit4]   2> 16139 T2213 C173 P39618 REQ /update {distrib.from=http://127.0.0.1:39623/solr/collection1/&update.distrib=TOLEADER&wt=javabin&version=2} status=0 QTime=7 
[junit4:junit4]   2> 16139 T2225 C175 P39623 /update {wt=javabin&version=2} {add=[122]} 0 9
[junit4:junit4]   2> 16149 T2197 C176 P39612 /update {wt=javabin&version=2} {add=[123 (1413348222766678016)]} 0 7
[junit4:junit4]   2> 16157 T2235 C172 P39628 REQ /update {update.distrib=FROMLEADER&distrib.from=http://127.0.0.1:39618/solr/collection1/&wt=javabin&version=2} status=0 QTime=1 
[junit4:junit4]   2> 16157 T2213 C173 P39618 REQ /update {distrib.from=http://127.0.0.1:39623/solr/collection1/&update.distrib=TOLEADER&wt=javabin&version=2} status=0 QTime=4 
[junit4:junit4]   2> 16158 T2225 C175 P39623 /update {wt=javabin&version=2} {add=[123]} 0 7
[junit4:junit4]   2> 16162 T2197 C176 P39612 /update {wt=javabin&version=2} {add=[124 (1413348222786600960)]} 0 1
[junit4:junit4]   2> 16169 T2235 C172 P39628 REQ /update {distrib.from=http://127.0.0.1:39618/solr/collection1/&update.distrib=FROMLEADER&wt=javabin&version=2} status=0 QTime=1 
[junit4:junit4]   2> 16169 T2217 C173 P39618 /update {wt=javabin&version=2} {add=[124 (1413348222790795264)]} 0 4
[junit4:junit4]   2> 16172 T2197 C176 P39612 /update {wt=javabin&version=2} {add=[125 (1413348222798135296)]} 0 0
[junit4:junit4]   2> 16179 T2235 C172 P39628 REQ /update {distrib.from=http://127.0.0.1:39618/solr/collection1/&update.distrib=FROMLEADER&wt=javabin&version=2} status=0 QTime=1 
[junit4:junit4]   2> 16179 T2217 C173 P39618 /update {wt=javabin&version=2} {add=[125 (1413348222801281024)]} 0 4
[junit4:junit4]   2> 16182 T2197 C176 P39612 /update {wt=javabin&version=2} {add=[126 (1413348222808621056)]} 0 0
[junit4:junit4]   2> 16191 T2249 C174 P39633 REQ /update {update.distrib=FROMLEADER&distrib.from=http://127.0.0.1:39623/solr/collection1/&wt=javabin&version=2} status=0 QTime=1 
[junit4:junit4]   2> 16191 T2224 C175 P39623 REQ /update {distrib.from=http://127.0.0.1:39618/solr/collection1/&update.distrib=TOLEADER&wt=javabin&version=2} status=0 QTime=4 
[junit4:junit4]   2> 16192 T2217 C173 P39618 /update {wt=javabin&version=2} {add=[126]} 0 7
[junit4:junit4]   2> 16194 T2197 C176 P39612 /update {wt=javabin&version=2} {add=[127 (1413348222821203968)]} 0 0
[junit4:junit4]   2> 16217 T2249 C174 P39633 REQ /update {update.distrib=FROMLEADER&distrib.from=http://127.0.0.1:39623/solr/collection1/&wt=javabin&version=2} status=0 QTime=9 
[junit4:junit4]   2> 16218 T2224 C175 P39623 REQ /update {distrib.from=http://127.0.0.1:39618/solr/collection1/&update.distrib=TOLEADER&wt=javabin&version=2} status=0 QTime=19 
[junit4:junit4]   2> 16219 T2217 C173 P39618 /update {wt=javabin&version=2} {add=[127]} 0 22
[junit4:junit4]   2> 16222 T2197 C176 P39612 /update {wt=javabin&version=2} {add=[128 (1413348222849515520)]} 0 1
[junit4:junit4]   2> 16230 T2249 C174 P39633 REQ /update {distrib.from=http://127.0.0.1:39623/solr/collection1/&update.distrib=FROMLEADER&wt=javabin&version=2} status=0 QTime=2 
[junit4:junit4]   2> 16230 T2225 C175 P39623 /update {wt=javabin&version=2} {add=[128 (1413348222852661248)]} 0 6
[junit4:junit4]   2> 16234 T2197 C176 P39612 /update {wt=javabin&version=2} {add=[129 (1413348222862098432)]} 0 1
[junit4:junit4]   2> 16240 T2235 C172 P39628 REQ /update {distrib.from=http://127.0.0.1:39618/solr/collection1/&update.distrib=FROMLEADER&wt=javabin&version=2} status=0 QTime=1 
[junit4:junit4]   2> 16241 T2217 C173 P39618 /update {wt=javabin&version=2} {add=[129 (1413348222865244160)]} 0 5
[junit4:junit4]   2> 16243 T2197 C176 P39612 /update {wt=javabin&version=2} {add=[130 (1413348222872584192)]} 0 0
[junit4:junit4]   2> 16250 T2249 C174 P39633 REQ /update {distrib.from=http://127.0.0.1:39623/solr/collection1/&update.distrib=FROMLEADER&wt=javabin&version=2} status=0 QTime=1 
[junit4:junit4]   2> 16250 T2225 C175 P39623 /update {wt=javabin&version=2} {add=[130 (1413348222875729920)]} 0 4
[junit4:junit4]   2> 16253 T2197 C176 P39612 /update {wt=javabin&version=2} {add=[131 (1413348222883069952)]} 0 0
[junit4:junit4]   2> 16260 T2249 C174 P39633 REQ /update {distrib.from=http://127.0.0.1:39623/solr/collection1/&update.distrib=FROMLEADER&wt=javabin&version=2} status=0 QTime=1 
[junit4:junit4]   2> 16260 T2225 C175 P39623 /update {wt=javabin&version=2} {add=[131 (1413348222886215680)]} 0 4
[junit4:junit4]   2> 16264 T2197 C176 P39612 /update {wt=javabin&version=2} {add=[132 (1413348222893555712)]} 0 1
[junit4:junit4]   2> 16272 T2235 C172 P39628 REQ /update {update.distrib=FROMLEADER&distrib.from=http://127.0.0.1:39618/solr/collection1/&wt=javabin&version=2} status=0 QTime=1 
[junit4:junit4]   2> 16273 T2213 C173 P39618 REQ /update {distrib.from=http://127.0.0.1:39623/solr/collection1/&update.distrib=TOLEADER&wt=javabin&version=2} status=0 QTime=5 
[junit4:junit4]   2> 16273 T2225 C175 P39623 /update {wt=javabin&version=2} {add=[132]} 0 7
[junit4:junit4]   2> 16283 T2197 C176 P39612 /update {wt=javabin&version=2} {add=[133 (1413348222907187200)]} 0 7
[junit4:junit4]   2> 16291 T2235 C172 P39628 REQ /update {update.distrib=FROMLEADER&distrib.from=http://127.0.0.1:39618/solr/collection1/&wt=javabin&version=2} status=0 QTime=1 
[junit4:junit4]   2> 16292 T2213 C173 P39618 REQ /update {distrib.from=http://127.0.0.1:39623/solr/collection1/&update.distrib=TOLEADER&wt=javabin&version=2} status=0 QTime=5 
[junit4:junit4]   2> 16292 T2225 C175 P39623 /update {wt=javabin&version=2} {add=[133]} 0 7
[junit4:junit4]   2> 16296 T2197 C176 P39612 /update {wt=javabin&version=2} {add=[134 (1413348222927110144)]} 0 1
[junit4:junit4]   2> 16305 T2249 C174 P39633 REQ /update {update.distrib=FROMLEADER&distrib.from=http://127.0.0.1:39623/solr/collection1/&wt=javabin&version=2} status=0 QTime=1 
[junit4:junit4]   2> 16305 T2224 C175 P39623 REQ /update {distrib.from=http://127.0.0.1:39618/solr/collection1/&update.distrib=TOLEADER&wt=javabin&version=2} status=0 QTime=4 
[junit4:junit4]   2> 16306 T2217 C173 P39618 /update {wt=javabin&version=2} {add=[134]} 0 7
[junit4:junit4]   2> 16309 T2197 C176 P39612 /update {wt=javabin&version=2} {add=[135 (1413348222940741632)]} 0 1
[junit4:junit4]   2> 16317 T2235 C172 P39628 REQ /update {update.distrib=FROMLEADER&distrib.from=http://127.0.0.1:39618/solr/collection1/&wt=javabin&version=2} status=0 QTime=1 
[junit4:junit4]   2> 16317 T2213 C173 P39618 REQ /update {distrib.from=http://127.0.0.1:39623/solr/collection1/&update.distrib=TOLEADER&wt=javabin&version=2} status=0 QTime=4 
[junit4:junit4]   2> 16318 T2225 C175 P39623 /update {wt=javabin&version=2} {add=[135]} 0 7
[junit4:junit4]   2> 16321 T2197 C176 P39612 /update {wt=javabin&version=2} {add=[136 (1413348222954373120)]} 0 0
[junit4:junit4]   2> 16330 T2249 C174 P39633 REQ /update {update.distrib=FROMLEADER&distrib.from=http://127.0.0.1:39623/solr/collection1/&wt=javabin&version=2} status=0 QTime=1 
[junit4:junit4]   2> 16330 T2224 C175 P39623 REQ /update {distrib.from=http://127.0.0.1:39618/solr/collection1/&update.distrib=TOLEADER&wt=javabin&version=2} status=0 QTime=4 
[junit4:junit4]   2> 16331 T2217 C173 P39618 /update {wt=javabin&version=2} {add=[136]} 0 7
[junit4:junit4]   2> 16334 T2197 C176 P39612 /update {wt=javabin&version=2} {add=[137 (1413348222966956032)]} 0 1
[junit4:junit4]   2> 16342 T2249 C174 P39633 REQ /update {update.distrib=FROMLEADER&distrib.from=http://127.0.0.1:39623/solr/collection1/&wt=javabin&version=2} status=0 QTime=1 
[junit4:junit4]   2> 16342 T2224 C175 P39623 REQ /update {distrib.from=http://127.0.0.1:39618/solr/collection1/&update.distrib=TOLEADER&wt=javabin&version=2} status=0 QTime=4 
[junit4:junit4]   2> 16343 T2217 C173 P39618 /update {wt=javabin&version=2} {add=[137]} 0 7
[junit4:junit4]   2> 16346 T2197 C176 P39612 /update {wt=javabin&version=2} {add=[138 (1413348222979538944)]} 0 1
[junit4:junit4]   2> 16354 T2235 C172 P39628 REQ /update {update.distrib=FROMLEADER&distrib.from=http://127.0.0.1:39618/solr/collection1/&wt=javabin&version=2} status=0 QTime=1 
[junit4:junit4]   2> 16355 T2213 C173 P39618 REQ /update {distrib.from=http://127.0.0.1:39623/solr/collection1/&update.distrib=TOLEADER&wt=javabin&version=2} status=0 QTime=5 
[junit4:junit4]   2> 16355 T2225 C175 P39623 /update {wt=javabin&version=2} {add=[138]} 0 7
[junit4:junit4]   2> 16359 T2197 C176 P39612 /update {wt=javabin&version=2} {add=[139 (1413348222993170432)]} 0 1
[junit4:junit4]   2> 16365 T2249 C174 P39633 REQ /update {distrib.from=http://127.0.0.1:39623/solr/collection1/&update.distrib=FROMLEADER&wt=javabin&version=2} status=0 QTime=1 
[junit4:junit4]   2> 16365 T2225 C175 P39623 /update {wt=javabin&version=2} {add=[139 (1413348222996316160)]} 0 4
[junit4:junit4]   2> 16369 T2197 C176 P39612 /update {wt=javabin&version=2} {add=[140 (1413348223003656192)]} 0 1
[junit4:junit4]   2> 16377 T2249 C174 P39633 REQ /update {update.distrib=FROMLEADER&distrib.from=http://127.0.0.1:39623/solr/collection1/&wt=javabin&version=2} status=0 QTime=1 
[junit4:junit4]   2> 16377 T2224 C175 P39623 REQ /update {distrib.from=http://127.0.0.1:39618/solr/collection1/&update.distrib=TOLEADER&wt=javabin&version=2} status=0 QTime=4 
[junit4:junit4]   2> 16378 T2217 C173 P39618 /update {wt=javabin&version=2} {add=[140]} 0 7
[junit4:junit4]   2> 16382 T2197 C176 P39612 /update {wt=javabin&version=2} {add=[141 (1413348223017287680)]} 0 1
[junit4:junit4]   2> 16391 T2249 C174 P39633 REQ /update {update.distrib=FROMLEADER&distrib.from=http://127.0.0.1:39623/solr/collection1/&wt=javabin&version=2} status=0 QTime=1 
[junit4:junit4]   2> 16391 T2224 C175 P39623 REQ /update {distrib.from=http://127.0.0.1:39618/solr/collection1/&update.distrib=TOLEADER&wt=javabin&version=2} status=0 QTime=4 
[junit4:junit4]   2> 16392 T2217 C173 P39618 /update {wt=javabin&version=2} {add=[141]} 0 7
[junit4:junit4]   2> 16394 T2197 C176 P39612 /update {wt=javabin&version=2} {add=[142 (1413348223030919168)]} 0 0
[junit4:junit4]   2> 16421 T2249 C174 P39633 REQ /update {distrib.from=http://127.0.0.1:39623/solr/collection1/&update.distrib=FROMLEADER&wt=javabin&version=2} status=0 QTime=10 
[junit4:junit4]   2> 16422 T2225 C175 P39623 /update {wt=javabin&version=2} {add=[142 (1413348223034064896)]} 0 25
[junit4:junit4]   2> 16431 T2197 C176 P39612 /update {wt=javabin&version=2} {add=[143 (1413348223062376448)]} 0 7
[junit4:junit4]   2> 16442 T2249 C174 P39633 REQ /update {update.distrib=FROMLEADER&distrib.from=http://127.0.0.1:39623/solr/collection1/&wt=javabin&version=2} status=0 QTime=2 
[junit4:junit4]   2> 16442 T2224 C175 P39623 REQ /update {distrib.from=http://127.0.0.1:39618/solr/collection1/&update.distrib=TOLEADER&wt=javabin&version=2} status=0 QTime=6 
[junit4:junit4]   2> 16443 T2217 C173 P39618 /update {wt=javabin&version=2} {add=[143]} 0 9
[junit4:junit4]   2> 16447 T2197 C176 P39612 /update {wt=javabin&version=2} {add=[144 (1413348223085445120)]} 0 1
[junit4:junit4]   2> 16456 T2249 C174 P39633 REQ /update {update.distrib=FROMLEADER&distrib.from=http://127.0.0.1:39623/solr/collection1/&wt=javabin&version=2} status=0 QTime=1 
[junit4:junit4]   2> 16456 T2224 C175 P39623 REQ /update {distrib.from=http://127.0.0.1:39618/solr/collection1/&update.distrib=TOLEADER&wt=javabin&version=2} status=0 QTime=4 
[junit4:junit4]   2> 16457 T2217 C173 P39618 /update {wt=javabin&version=2} {add=[144]} 0 7
[junit4:junit4]   2> 16461 T2197 C176 P39612 /update {wt=javabin&version=2} {add=[145 (1413348223100125184)]} 0 1
[junit4:junit4]   2> 16469 T2249 C174 P39633 REQ /update {update.distrib=FROMLEADER&distrib.from=http://127.0.0.1:39623/solr/collection1/&wt=javabin&version=2} status=0 QTime=1 
[junit4:junit4]   2> 16469 T2224 C175 P39623 REQ /update {distrib.from=http://127.0.0.1:39618/solr/collection1/&update.distrib=TOLEADER&wt=javabin&version=2} status=0 QTime=4 
[junit4:junit4]   2> 16470 T2217 C173 P39618 /update {wt=javabin&version=2} {add=[145]} 0 7
[junit4:junit4]   2> 16474 T2197 C176 P39612 /update {wt=javabin&version=2} {add=[146 (1413348223113756672)]} 0 1
[junit4:junit4]   2> 16499 T2235 C172 P39628 REQ /update {distrib.from=http://127.0.0.1:39618/solr/collection1/&update.distrib=FROMLEADER&wt=javabin&version=2} status=0 QTime=11 
[junit4:junit4]   2> 16500 T2217 C173 P39618 /update {wt=javabin&version=2} {add=[146 (1413348223116902400)]} 0 24
[junit4:junit4]   2> 16504 T2197 C176 P39612 /update {wt=javabin&version=2} {add=[147 (1413348223145213952)]} 0 1
[junit4:junit4]   2> 16514 T2249 C174 P39633 REQ /update {update.distrib=FROMLEADER&distrib.from=http://127.0.0.1:39623/solr/collection1/&wt=javabin&version=2} status=0 QTime=1 
[junit4:junit4]   2> 16515 T2224 C175 P39623 REQ /update {distrib.from=http://127.0.0.1:39618/solr/collection1/&update.distrib=TOLEADER&wt=javabin&version=2} status=0 QTime=5 
[junit4:junit4]   2> 16515 T2217 C173 P39618 /update {wt=javabin&version=2} {add=[147]} 0 8
[junit4:junit4]   2> 16519 T2197 C176 P39612 /update {wt=javabin&version=2} {add=[148 (1413348223160942592)]} 0 1
[junit4:junit4]   2> 16529 T2235 C172 P39628 REQ /update {distrib.from=http://127.0.0.1:39618/solr/collection1/&update.distrib=FROMLEADER&wt=javabin&version=2} status=0 QTime=3 
[junit4:junit4]   2> 16529 T2217 C173 P39618 /update {wt=javabin&version=2} {add=[148 (1413348223165136896)]} 0 7
[junit4:junit4]   2> 16533 T2197 C176 P39612 /update {wt=javabin&version=2} {add=[149 (1413348223175622656)]} 0 1
[junit4:junit4]   2> 16539 T2249 C174 P39633 REQ /update {distrib.from=http://127.0.0.1:39623/solr/collection1/&update.distrib=FROMLEADER&wt=javabin&version=2} status=0 QTime=1 
[junit4:junit4]   2> 16540 T2225 C175 P39623 /update {wt=javabin&version=2} {add=[149 (1413348223178768384)]} 0 5
[junit4:junit4]   2> 16540 T2185 oasc.AbstractDistribZkTestBase.waitForRecoveriesToFinish Wait for recoveries to finish - collection: collection1 failOnTimeout:true timeout (sec):1800
[junit4:junit4]   2> 16541 T2185 oascc.ZkStateReader.updateClusterState Updating cloud state from ZooKeeper... 
[junit4:junit4]   2> 16544 T2197 C176 P39612 oasu.DirectUpdateHandler2.commit start commit{flags=0,_version_=0,optimize=false,openSearcher=true,waitSearcher=true,expungeDeletes=false,softCommit=false}
[junit4:junit4]   2> 16947 T2197 C176 P39612 oasc.SolrDeletionPolicy.onCommit SolrDeletionPolicy.onCommit: commits:num=2
[junit4:junit4]   2> 		commit{dir=NRTCachingDirectory(org.apache.lucene.store.NIOFSDirectory@/usr/home/hudson/hudson-slave/workspace/Lucene-Solr-Tests-4.x-java7/solr/build/solr-core/test/J1/org.apache.solr.cloud.BasicDistributedZk2Test-1347873884054/control/data/index lockFactory=org.apache.lucene.store.NativeFSLockFactory@68a025f4; maxCacheMB=48.0 maxMergeSizeMB=4.0),segFN=segments_2,generation=2,filenames=[_0_Block_0.pos, _0_Block_0.tip, _0_Lucene40_0.tim, _0.fnm, _0_Block_0.doc, _0_Memory_0.ram, _0_Block_0.tim, _0_nrm.cfs, _0_Lucene40_0.prx, _0_Lucene40_0.tip, _0_Lucene40WithOrds_0.tii, _0_Lucene40WithOrds_0.frq, _0_Lucene40_0.frq, _0_nrm.cfe, segments_2, _0.fdx, _0_Lucene40WithOrds_0.prx, _0.si, _0_Lucene40WithOrds_0.tib, _0.fdt]
[junit4:junit4]   2> 		commit{dir=NRTCachingDirectory(org.apache.lucene.store.NIOFSDirectory@/usr/home/hudson/hudson-slave/workspace/Lucene-Solr-Tests-4.x-java7/solr/build/solr-core/test/J1/org.apache.solr.cloud.BasicDistributedZk2Test-1347873884054/control/data/index lockFactory=org.apache.lucene.store.NativeFSLockFactory@68a025f4; maxCacheMB=48.0 maxMergeSizeMB=4.0),segFN=segments_3,generation=3,filenames=[_5_nrm.cfe, _2_Block_0.pos, _5_Memory_0.ram, _7.si, _3.fdt, _0_Lucene40_0.prx, _7_Memory_0.ram, _7.fnm, _6_Block_0.pos, _0_Lucene40WithOrds_0.tii, _3_Lucene40_0.frq, _0_Lucene40WithOrds_0.frq, _1_Lucene40WithOrds_0.tib, _1_Lucene40WithOrds_0.tii, _0_Lucene40WithOrds_0.tib, _1_Block_0.pos, _1_Block_0.tip, _1_Lucene40WithOrds_0.frq, _0_Lucene40_0.tim, _1_Block_0.tim, _0_Memory_0.ram, _2.fdt, _7.fdx, _2.fdx, _7.fdt, _0_Lucene40_0.tip, _3_Block_0.pos, _3_Block_0.doc, _1.fdx, _5_nrm.cfs, _1.fdt, _2_Lucene40_0.prx, _7_Block_0.pos, _3.si, _6.fdt, _6_Memory_0.ram, _2.si, _2_Block_0.tim, _6.fdx, _2_Block_0.tip, _1_Lucene40WithOrds_0.prx, _3.fnm, _5_Block_0.tim, _1_Memory_0.ram, _2_nrm.cfe, _5_Lucene40_0.tim, _5_Lucene40_0.tip, _0_Lucene40_0.frq, _7_Lucene40_0.tim, _2_nrm.cfs, _5_Block_0.doc, _7_Lucene40_0.tip, _4_Block_0.pos, _3_Block_0.tip, _3_Lucene40_0.tip, _3_Lucene40_0.tim, _4_Block_0.tip, _7_Lucene40_0.frq, _2_Lucene40WithOrds_0.frq, _1_Lucene40_0.frq, _2.fnm, _3.fdx, _2_Lucene40_0.frq, _1.si, _6.si, _6.fnm, _0_Lucene40WithOrds_0.prx, _5_Lucene40_0.prx, _1_Lucene40_0.tim, _3_nrm.cfe, _0_Block_0.tip, _5.fdt, _6_Lucene40_0.tim, _6_Lucene40_0.tip, _0_Block_0.tim, _7_Block_0.tim, _4.fnm, _4_nrm.cfe, _7_Block_0.tip, _1.fnm, _1_Lucene40_0.tip, _4.fdx, _2_Lucene40_0.tip, _3_Block_0.tim, _2_Lucene40_0.tim, _1_Block_0.doc, _5_Lucene40_0.frq, _0.fnm, _4_Block_0.tim, _6_Block_0.doc, _6_Lucene40_0.frq, _1_Lucene40_0.prx, _5.si, _3_nrm.cfs, _4_Memory_0.ram, _4_Lucene40_0.frq, _4_nrm.cfs, _6_Lucene40_0.prx, _5_Block_0.tip, _7_Lucene40_0.prx, _7_Block_0.doc, _0_Block_0.pos, _4_Block_0.doc, _6_nrm.cfs, _2_Lucene40WithOrds_0.prx, _7_nrm.cfs, _5_Block_0.pos, _3_Lucene40_0.prx, _4_Lucene40_0.tip, _2_Memory_0.ram, _0.si, _3_Memory_0.ram, _4_Lucene40_0.tim, _4_Lucene40_0.prx, _1_nrm.cfs, _5.fnm, _0_Block_0.doc, _7_nrm.cfe, _6_nrm.cfe, _0_nrm.cfs, _4.fdt, _4.si, _1_nrm.cfe, _2_Lucene40WithOrds_0.tii, _6_Block_0.tip, _0_nrm.cfe, _5.fdx, _0.fdx, _2_Lucene40WithOrds_0.tib, _6_Block_0.tim, _2_Block_0.doc, segments_3, _0.fdt]
[junit4:junit4]   2> 16948 T2197 C176 P39612 oasc.SolrDeletionPolicy.updateCommits newest commit = 3
[junit4:junit4]   2> 17007 T2197 C176 P39612 oass.SolrIndexSearcher.<init> Opening Searcher@59b7a875 main
[junit4:junit4]   2> 17008 T2197 C176 P39612 oasu.DirectUpdateHandler2.commit end_commit_flush
[junit4:junit4]   2> 17010 T2208 oasc.SolrCore.registerSearcher [collection1] Registered new searcher Searcher@59b7a875 main{StandardDirectoryReader(segments_3:17 _0(4.0.0.2):C1 _1(4.0.0.2):C10 _2(4.0.0.2):C10 _3(4.0.0.2):C10 _4(4.0.0.2):C10 _5(4.0.0.2):C10 _6(4.0.0.2):C10 _7(4.0.0.2):C6)}
[junit4:junit4]   2> 17010 T2197 C176 P39612 /update {waitSearcher=true&wt=javabin&commit=true&softCommit=false&version=2} {commit=} 0 466
[junit4:junit4]   2> 17013 T2217 C173 P39618 oasu.DirectUpdateHandler2.commit start commit{flags=0,_version_=0,optimize=false,openSearcher=true,waitSearcher=true,expungeDeletes=false,softCommit=false}
[junit4:junit4]   2> 17261 T2217 C173 P39618 oasc.SolrDeletionPolicy.onCommit SolrDeletionPolicy.onCommit: commits:num=2
[junit4:junit4]   2> 		commit{dir=NRTCachingDirectory(org.apache.lucene.store.NIOFSDirectory@/usr/home/hudson/hudson-slave/workspace/Lucene-Solr-Tests-4.x-java7/solr/build/solr-core/test/J1/org.apache.solr.cloud.BasicDistributedZk2Test-1347873884054/jetty1/index lockFactory=org.apache.lucene.store.NativeFSLockFactory@668a2c0b; maxCacheMB=48.0 maxMergeSizeMB=4.0),segFN=segments_2,generation=2,filenames=[_0_Block_0.pos, _0_Block_0.tip, _0_Lucene40_0.tim, _0.fnm, _0_Block_0.doc, _0_Memory_0.ram, _0_Block_0.tim, _0_nrm.cfs, _0_Lucene40_0.prx, _0_Lucene40_0.tip, _0_Lucene40WithOrds_0.tii, _0_Lucene40WithOrds_0.frq, _0_Lucene40_0.frq, _0_nrm.cfe, segments_2, _0.fdx, _0_Lucene40WithOrds_0.prx, _0.si, _0_Lucene40WithOrds_0.tib, _0.fdt]
[junit4:junit4]   2> 		commit{dir=NRTCachingDirectory(org.apache.lucene.store.NIOFSDirectory@/usr/home/hudson/hudson-slave/workspace/Lucene-Solr-Tests-4.x-java7/solr/build/solr-core/test/J1/org.apache.solr.cloud.BasicDistributedZk2Test-1347873884054/jetty1/index lockFactory=org.apache.lucene.store.NativeFSLockFactory@668a2c0b; maxCacheMB=48.0 maxMergeSizeMB=4.0),segFN=segments_3,generation=3,filenames=[_3_nrm.cfe, _1_Lucene40_0.tim, _0_Block_0.tip, _2_Block_0.pos, _0_Block_0.tim, _4_nrm.cfe, _4.fnm, _3.fdt, _0_Lucene40_0.prx, _1.fnm, _1_Lucene40_0.tip, _4.fdx, _2_Lucene40_0.tip, _3_Lucene40_0.frq, _0_Lucene40WithOrds_0.tii, _3_Block_0.tim, _0_Lucene40WithOrds_0.frq, _1_Lucene40WithOrds_0.tib, _2_Lucene40_0.tim, _1_Lucene40WithOrds_0.tii, _0_Lucene40WithOrds_0.tib, _1_Block_0.doc, _1_Block_0.tip, _1_Block_0.pos, _1_Lucene40Wit

[...truncated too long message...]

 	at org.apache.solr.core.JmxMonitoredMap.clear(JmxMonitoredMap.java:116)
[junit4:junit4]   2> 	at org.apache.solr.core.SolrCore.close(SolrCore.java:864)
[junit4:junit4]   2> 	at org.apache.solr.cloud.ShardLeaderElectionContext.runLeaderProcess(ElectionContext.java:213)
[junit4:junit4]   2> 	at org.apache.solr.cloud.LeaderElector.runIamLeaderProcess(LeaderElector.java:158)
[junit4:junit4]   2> 	at org.apache.solr.cloud.LeaderElector.checkIfIamLeader(LeaderElector.java:102)
[junit4:junit4]   2> 	at org.apache.solr.cloud.LeaderElector.access$000(LeaderElector.java:56)
[junit4:junit4]   2> 	at org.apache.solr.cloud.LeaderElector$1.process(LeaderElector.java:131)
[junit4:junit4]   2> 	at org.apache.zookeeper.ClientCnxn$EventThread.processEvent(ClientCnxn.java:526)
[junit4:junit4]   2> 	at org.apache.zookeeper.ClientCnxn$EventThread.run(ClientCnxn.java:502)
[junit4:junit4]   2> 
[junit4:junit4]   2> 309074 T2257 oasc.JmxMonitoredMap$SolrDynamicMBean.getMBeanInfo WARNING Could not getStatistics on info bean Lazy[solr.ReplicationHandler] java.lang.IllegalArgumentException: /usr/home/hudson/hudson-slave/workspace/Lucene-Solr-Tests-4.x-java7/solr/build/solr-core/test/J1/org.apache.solr.cloud.BasicDistributedZk2Test-1347873884054/jetty4/index does not exist
[junit4:junit4]   2> 	at org.apache.commons.io.FileUtils.sizeOfDirectory(FileUtils.java:2074)
[junit4:junit4]   2> 	at org.apache.solr.handler.ReplicationHandler.getIndexSize(ReplicationHandler.java:477)
[junit4:junit4]   2> 	at org.apache.solr.handler.ReplicationHandler.getStatistics(ReplicationHandler.java:525)
[junit4:junit4]   2> 	at org.apache.solr.core.RequestHandlers$LazyRequestHandlerWrapper.getStatistics(RequestHandlers.java:310)
[junit4:junit4]   2> 	at org.apache.solr.core.JmxMonitoredMap$SolrDynamicMBean.getMBeanInfo(JmxMonitoredMap.java:231)
[junit4:junit4]   2> 	at com.sun.jmx.interceptor.DefaultMBeanServerInterceptor.getClassName(DefaultMBeanServerInterceptor.java:1804)
[junit4:junit4]   2> 	at com.sun.jmx.interceptor.DefaultMBeanServerInterceptor.safeGetClassName(DefaultMBeanServerInterceptor.java:1595)
[junit4:junit4]   2> 	at com.sun.jmx.interceptor.DefaultMBeanServerInterceptor.checkMBeanPermission(DefaultMBeanServerInterceptor.java:1813)
[junit4:junit4]   2> 	at com.sun.jmx.interceptor.DefaultMBeanServerInterceptor.exclusiveUnregisterMBean(DefaultMBeanServerInterceptor.java:430)
[junit4:junit4]   2> 	at com.sun.jmx.interceptor.DefaultMBeanServerInterceptor.unregisterMBean(DefaultMBeanServerInterceptor.java:415)
[junit4:junit4]   2> 	at com.sun.jmx.mbeanserver.JmxMBeanServer.unregisterMBean(JmxMBeanServer.java:536)
[junit4:junit4]   2> 	at org.apache.solr.core.JmxMonitoredMap.unregister(JmxMonitoredMap.java:175)
[junit4:junit4]   2> 	at org.apache.solr.core.JmxMonitoredMap.clear(JmxMonitoredMap.java:116)
[junit4:junit4]   2> 	at org.apache.solr.core.SolrCore.close(SolrCore.java:864)
[junit4:junit4]   2> 	at org.apache.solr.cloud.ShardLeaderElectionContext.runLeaderProcess(ElectionContext.java:213)
[junit4:junit4]   2> 	at org.apache.solr.cloud.LeaderElector.runIamLeaderProcess(LeaderElector.java:158)
[junit4:junit4]   2> 	at org.apache.solr.cloud.LeaderElector.checkIfIamLeader(LeaderElector.java:102)
[junit4:junit4]   2> 	at org.apache.solr.cloud.LeaderElector.access$000(LeaderElector.java:56)
[junit4:junit4]   2> 	at org.apache.solr.cloud.LeaderElector$1.process(LeaderElector.java:131)
[junit4:junit4]   2> 	at org.apache.zookeeper.ClientCnxn$EventThread.processEvent(ClientCnxn.java:526)
[junit4:junit4]   2> 	at org.apache.zookeeper.ClientCnxn$EventThread.run(ClientCnxn.java:502)
[junit4:junit4]   2> 
[junit4:junit4]   2> 309079 T2257 oasc.SolrCore.closeSearcher [collection1] Closing main searcher on request.
[junit4:junit4]   2> 309081 T2257 oasu.DirectUpdateHandler2.close closing DirectUpdateHandler2{commits=5,autocommits=0,soft autocommits=0,optimizes=0,rollbacks=0,expungeDeletes=0,docsPending=0,adds=0,deletesById=0,deletesByQuery=0,errors=0,cumulative_adds=35,cumulative_deletesById=0,cumulative_deletesByQuery=0,cumulative_errors=0}
[junit4:junit4]   2> 309082 T2257 oasu.DefaultSolrCoreState.decref SolrCoreState ref count has reached 0 - closing IndexWriter
[junit4:junit4]   2> 309084 T2257 oasu.DefaultSolrCoreState.decref Closing SolrCoreState - canceling any ongoing recovery
[junit4:junit4]   2> 309084 T2257 oascc.ZkStateReader$3.process Updating live nodes
[junit4:junit4]   2> 309084 T2257 oascc.ZkStateReader$3.process WARNING ZooKeeper watch triggered, but Solr cannot talk to ZK
[junit4:junit4]   2> 309084 T2257 oascc.ZkStateReader$2.process A cluster state change has occurred - updating...
[junit4:junit4]   2> 309085 T2257 oascc.ZkStateReader$2.process WARNING ZooKeeper watch triggered, but Solr cannot talk to ZK
[junit4:junit4]   2> 309085 T2257 oascc.ConnectionManager.process Watcher org.apache.solr.common.cloud.ConnectionManager@22c48005 name:ZooKeeperConnection Watcher:127.0.0.1:39608/solr got event WatchedEvent state:Disconnected type:None path:null path:null type:None
[junit4:junit4]   2> 309085 T2257 oascc.ConnectionManager.process Client->ZooKeeper status change trigger but we are already closed
[junit4:junit4]   2> 309085 T2257 oaz.ClientCnxn$EventThread.run EventThread shut down
[junit4:junit4]   2> NOTE: test params are: codec=Lucene40: {n_f1=Lucene40(minBlockSize=19 maxBlockSize=40), foo_b=PostingsFormat(name=Lucene40WithOrds), foo_d=PostingsFormat(name=Memory doPackFST= true), foo_f=PostingsFormat(name=Lucene40WithOrds), n_tl1=Lucene40(minBlockSize=19 maxBlockSize=40), n_d1=Block(blocksize=128), rnd_b=PostingsFormat(name=Memory doPackFST= true), intDefault=Lucene40(minBlockSize=19 maxBlockSize=40), n_td1=Lucene40(minBlockSize=19 maxBlockSize=40), timestamp=Block(blocksize=128), id=PostingsFormat(name=Memory doPackFST= true), range_facet_sl=PostingsFormat(name=Memory doPackFST= true), range_facet_si=Block(blocksize=128), oddField_s=PostingsFormat(name=Memory doPackFST= true), multiDefault=Block(blocksize=128), n_tf1=Block(blocksize=128), n_dt1=Lucene40(minBlockSize=19 maxBlockSize=40), n_ti1=PostingsFormat(name=Memory doPackFST= true), range_facet_l=Block(blocksize=128), text=PostingsFormat(name=Lucene40WithOrds), _version_=Lucene40(minBlockSize=19 maxBlockSize=40), SubjectTerms_mfacet=Lucene40(minBlockSize=19 maxBlockSize=40), a_t=Block(blocksize=128), n_tdt1=Lucene40(minBlockSize=19 maxBlockSize=40), other_tl1=Lucene40(minBlockSize=19 maxBlockSize=40), n_l1=Block(blocksize=128), a_si=Lucene40(minBlockSize=19 maxBlockSize=40)}, sim=DefaultSimilarity, locale=ar_SD, timezone=America/Ojinaga
[junit4:junit4]   2> NOTE: FreeBSD 9.0-RELEASE amd64/Oracle Corporation 1.7.0_06 (64-bit)/cpus=16,threads=2,free=367451528,total=536870912
[junit4:junit4]   2> NOTE: All tests run in this JVM: [OutputWriterTest, TestBinaryField, OverseerTest, TestRemoteStreaming, TestSolrDeletionPolicy2, TestArbitraryIndexDir, TestDFRSimilarityFactory, DOMUtilTest, StatelessScriptUpdateProcessorFactoryTest, TestPropInjectDefaults, TestPropInject, BadIndexSchemaTest, TestReplicationHandler, SuggesterTest, DirectUpdateHandlerTest, TestUtils, TestCodecSupport, RequiredFieldsTest, TestMultiCoreConfBootstrap, TestStressRecovery, UUIDFieldTest, TimeZoneUtilsTest, HighlighterTest, PrimUtilsTest, FileUtilsTest, FullSolrCloudDistribCmdsTest, TestSurroundQueryParser, TestDistributedGrouping, ScriptEngineTest, OpenExchangeRatesOrgProviderTest, DisMaxRequestHandlerTest, RAMDirectoryFactoryTest, IndexSchemaTest, TestBM25SimilarityFactory, SignatureUpdateProcessorFactoryTest, PeerSyncTest, ReturnFieldsTest, FieldMutatingUpdateProcessorTest, TestReload, UpdateParamsTest, TestSolrXMLSerializer, PingRequestHandlerTest, TestValueSourceCache, TestMergePolicyConfig, XsltUpdateRequestHandlerTest, TestCSVLoader, TestCSVResponseWriter, StatsComponentTest, TestUpdate, MultiTermTest, BasicZkTest, SoftAutoCommitTest, TestPluginEnable, TestFunctionQuery, RecoveryZkTest, SpellCheckComponentTest, LeaderElectionTest, TestRealTimeGet, TestDistributedSearch, SpellCheckCollatorTest, AutoCommitTest, ZkSolrClientTest, TestHashPartitioner, DistributedTermsComponentTest, TestRecovery, TestJoin, CurrencyFieldTest, BinaryUpdateRequestHandlerTest, TermsComponentTest, MinimalSchemaTest, TestQueryTypes, XmlUpdateRequestHandlerTest, SuggesterWFSTTest, DirectUpdateHandlerOptimizeTest, SolrPluginUtilsTest, DebugComponentTest, TestOmitPositions, SuggesterFSTTest, SuggesterTSTTest, ShowFileRequestHandlerTest, NotRequiredUniqueKeyTest, TestFoldingMultitermQuery, TestSolrDeletionPolicy1, TestLuceneMatchVersion, TestIndexingPerformance, HighlighterConfigTest, DefaultValueUpdateProcessorTest, TestLFUCache, TestCollationField, SolrIndexConfigTest, IndexReaderFactoryTest, EchoParamsTest, SpellPossibilityIteratorTest, TestPerFieldSimilarity, DateMathParserTest, URLClassifyProcessorTest, SpellingQueryConverterTest, TestBadConfig, TestCharFilters, BasicDistributedZk2Test]
[junit4:junit4] Completed on J1 in 309.53s, 1 test, 1 failure <<< FAILURES!

[...truncated 5 lines...]
BUILD FAILED
/usr/home/hudson/hudson-slave/workspace/Lucene-Solr-Tests-4.x-java7/build.xml:32: The following error occurred while executing this line:
/usr/home/hudson/hudson-slave/workspace/Lucene-Solr-Tests-4.x-java7/solr/build.xml:146: The following error occurred while executing this line:
/usr/home/hudson/hudson-slave/workspace/Lucene-Solr-Tests-4.x-java7/lucene/module-build.xml:63: The following error occurred while executing this line:
/usr/home/hudson/hudson-slave/workspace/Lucene-Solr-Tests-4.x-java7/lucene/common-build.xml:1133: The following error occurred while executing this line:
/usr/home/hudson/hudson-slave/workspace/Lucene-Solr-Tests-4.x-java7/lucene/common-build.xml:810: There were test failures: 230 suites, 951 tests, 1 failure, 8 ignored (3 assumptions)

Total time: 32 minutes 33 seconds
Build step 'Invoke Ant' marked build as failure
Recording test results
Email was triggered for: Failure
Sending email for trigger: Failure



Mime
View raw message