lucene-dev mailing list archives

Site index · List index
Message view « Date » · « Thread »
Top « Date » · « Thread »
From Policeman Jenkins Server <jenk...@sd-datasolutions.de>
Subject [JENKINS] Lucene-Solr-trunk-Windows (32bit/jdk1.6.0_35) - Build # 975 - Failure!
Date Sat, 29 Sep 2012 16:41:09 GMT
Build: http://jenkins.sd-datasolutions.de/job/Lucene-Solr-trunk-Windows/975/
Java: 32bit/jdk1.6.0_35 -client -XX:+UseParallelGC

1 tests failed.
FAILED:  junit.framework.TestSuite.org.apache.lucene.index.TestPostingsFormat

Error Message:


Stack Trace:
java.lang.NullPointerException
	at __randomizedtesting.SeedInfo.seed([EDF27D871C0D7F2D]:0)
	at org.apache.lucene.index.BasePostingsFormatTestCase.createPostings(BasePostingsFormatTestCase.java:171)
	at sun.reflect.NativeMethodAccessorImpl.invoke0(Native Method)
	at sun.reflect.NativeMethodAccessorImpl.invoke(NativeMethodAccessorImpl.java:39)
	at sun.reflect.DelegatingMethodAccessorImpl.invoke(DelegatingMethodAccessorImpl.java:25)
	at java.lang.reflect.Method.invoke(Method.java:597)
	at com.carrotsearch.randomizedtesting.RandomizedRunner.invoke(RandomizedRunner.java:1559)
	at com.carrotsearch.randomizedtesting.RandomizedRunner.access$600(RandomizedRunner.java:79)
	at com.carrotsearch.randomizedtesting.RandomizedRunner$4.evaluate(RandomizedRunner.java:677)
	at com.carrotsearch.randomizedtesting.RandomizedRunner$5.evaluate(RandomizedRunner.java:693)
	at org.apache.lucene.util.AbstractBeforeAfterRule$1.evaluate(AbstractBeforeAfterRule.java:45)
	at org.apache.lucene.util.TestRuleStoreClassName$1.evaluate(TestRuleStoreClassName.java:42)
	at com.carrotsearch.randomizedtesting.rules.SystemPropertiesInvariantRule$1.evaluate(SystemPropertiesInvariantRule.java:55)
	at com.carrotsearch.randomizedtesting.rules.NoShadowingOrOverridesOnMethodsRule$1.evaluate(NoShadowingOrOverridesOnMethodsRule.java:39)
	at com.carrotsearch.randomizedtesting.rules.NoShadowingOrOverridesOnMethodsRule$1.evaluate(NoShadowingOrOverridesOnMethodsRule.java:39)
	at com.carrotsearch.randomizedtesting.rules.StatementAdapter.evaluate(StatementAdapter.java:36)
	at org.apache.lucene.util.TestRuleAssertionsRequired$1.evaluate(TestRuleAssertionsRequired.java:43)
	at org.apache.lucene.util.TestRuleMarkFailure$1.evaluate(TestRuleMarkFailure.java:48)
	at org.apache.lucene.util.TestRuleIgnoreAfterMaxFailures$1.evaluate(TestRuleIgnoreAfterMaxFailures.java:70)
	at org.apache.lucene.util.TestRuleIgnoreTestSuites$1.evaluate(TestRuleIgnoreTestSuites.java:55)
	at com.carrotsearch.randomizedtesting.rules.StatementAdapter.evaluate(StatementAdapter.java:36)
	at com.carrotsearch.randomizedtesting.ThreadLeakControl$StatementRunner.run(ThreadLeakControl.java:358)
	at java.lang.Thread.run(Thread.java:662)




Build Log:
[...truncated 1150 lines...]
[junit4:junit4] Suite: org.apache.lucene.index.TestPostingsFormat
[junit4:junit4]   2> NOTE: test params are: codec=Lucene40: {}, sim=DefaultSimilarity,
locale=es_CL, timezone=America/Argentina/San_Juan
[junit4:junit4]   2> NOTE: Windows 7 6.1 x86/Sun Microsystems Inc. 1.6.0_35 (32-bit)/cpus=2,threads=1,free=207123456,total=375259136
[junit4:junit4]   2> NOTE: All tests run in this JVM: [TestFieldCacheRangeFilter, TestGraphTokenizers,
TestSimpleExplanations, TestSloppyPhraseQuery, TestRamUsageEstimator, TestMergeSchedulerExternal,
TestRAMDirectory, TestCharsRef, TestPagedBytes, TestFuzzyQuery, TestDocsAndPositions, TestDocValuesIndexing,
TestMultiFields, TestCachingWrapperFilter, TestIndexWriterLockRelease, TestRecyclingByteBlockAllocator,
TestSegmentTermDocs, TestRamUsageEstimatorOnWildAnimals, TestSegmentReader, TestFSTs, TestIndexWriterMergePolicy,
TestByteBlockPool, TestDirectoryReader, TestOmitPositions, TestIndexWriterWithThreads, TestCrash,
TestAddIndexes, TestNeverDelete, TestStressIndexing2, TestIdentityHashSet, TestTimeLimitingCollector,
TestRollingUpdates, TestIndexWriterOnJRECrash, TestCachingTokenFilter, TestSubScorerFreqs,
TestNRTManager, TestRollback, TestIndexWriterReader, TestDocumentsWriterDeleteQueue, TestMaxTermFrequency,
TestTermVectors, TestMultiPhraseQuery, TestTermdocPerf, TestSearchAfter, TestAutomatonQueryUnicode,
TestPayloads, TestIOUtils, TestSameTokenSamePosition, MultiCollectorTest, TestCollectionUtil,
TestTerm, TestLucene40PostingsFormat, NestedSetupChain, NestedTeardownChain, TestBytesRefHash,
TestStressAdvance, TestUniqueTermCount, TestNRTReaderWithThreads, TestMixedCodecs, TestBooleanQueryVisitSubscorers,
TestWindowsMMap, TestLevenshteinAutomata, Test2BTerms, TestUTF32ToUTF8, TestFixedBitSet, TestVersion,
TestBitVector, TestConstantScoreQuery, TestDocIdSet, TestNot, TestParallelReaderEmptyIndex,
TestRegexpQuery, TestOmitNorms, Nested, TestDuelingCodecs, TestMultiValuedNumericRangeQuery,
TestNoDeletionPolicy, TestFieldCacheTermsFilter, TestDeterminizeLexicon, TestField, TestSpanExplanations,
TestNumericTokenStream, TestSegmentTermEnum, TestSpanSearchEquivalence, TestMinimize, TestTopDocsCollector,
TestNGramPhraseQuery, TestCopyBytes, TestBoolean2, TestBooleanQuery, TestMultiThreadTermVectors,
Nested, Nested, TestComplexExplanations, TestByteArrayDataInput, TestWildcardRandom, TestFilteredQuery,
TestDateSort, TestBooleanMinShouldMatch, TestIndexWriterNRTIsCurrent, Test2BDocs, TestPerFieldPostingsFormat2,
TestFlushByRamOrCountsPolicy, TestDocCount, TestBinaryDocument, TestSpanMultiTermQueryWrapper,
TestIndexWriterDelete, TestRandomStoredFields, TestWeakIdentityMap, TestFilterAtomicReader,
Nested1, Nested2, Nested3, TestMultiTermQueryRewrites, TestIndexCommit, TestMultiMMap, TestExternalCodecs,
TestFieldCacheRewriteMethod, Before3, Before3, Nested, Nested, Nested, Nested, Nested, Nested,
Nested, Nested, Nested, Nested, Nested, Nested, Nested, Nested, Nested, Nested, Nested, Nested,
Nested, Nested, Nested, TestBooleanOr, TestDocValues, TestPackedInts, TestIndexWriterUnicode,
TestFlex, TestLock, TestByteSlices, TestTransactions, TestLazyProxSkipping, TestSpansAdvanced,
TestSearchWithThreads, TestDoubleBarrelLRUCache, TestIndexableField, TestSpans, TestCompiledAutomaton,
TestFilteredSearch, TestAssertions, TestTwoPhaseCommitTool, TestFieldCache, TestPrefixFilter,
TestIndexFileDeleter, TestPhraseQuery, TestDateTools, TestStressIndexing, TestIndexWriterCommit,
TestTermRangeFilter, TestTermsEnum2, TestTermRangeQuery, TestScoreCachingWrappingScorer, TestIntsRef,
TestIsCurrent, TestExplanations, TestForTooMuchCloning, Nested, TestLookaheadTokenFilter,
TestPhrasePrefixQuery, TestSort, TestNorms, TestShardSearching, TestIndexWriterExceptions,
TestNumericRangeQuery64, TestSearcherManager, TestNumericRangeQuery32, TestNRTThreads, TestBasics,
TestDeletionPolicy, TestAtomicUpdate, TestTermsEnum, TestIndexWriter, TestIndexWriterMerging,
TestLucene40PostingsReader, TestOpenBitSet, TestTopDocsMerge, TestPersistentSnapshotDeletionPolicy,
TestBackwardsCompatibility, TestArrayUtil, TestDirectoryReaderReopen, TestBufferedIndexInput,
TestNRTCachingDirectory, TestIndexWriterForceMerge, TestLongPostings, TestToken, TestTypePromotion,
TestCompoundFile, TestCustomNorms, TestSnapshotDeletionPolicy, TestMockAnalyzer, TestDocumentsWriterStallControl,
TestRegexpRandom2, TestTieredMergePolicy, TestConcurrentMergeScheduler, TestHugeRamFile, TestSloppyPhraseQuery2,
TestStressNRT, TestConsistentFieldNumbers, TestLockFactory, TestCrashCausesCorruptIndex, TestNumericUtils,
TestDeterminism, TestCharTermAttributeImpl, TestFieldsReader, TestSegmentMerger, TestPostingsOffsets,
TestPrefixInBooleanQuery, TestThreadedForceMerge, TestPayloadSpans, TestCodecs, TestIndexWriterOnDiskFull,
TestReuseDocsEnum, TestIndexInput, TestCustomSearcherSort, TestParallelCompositeReader, TestSimilarityBase,
TestFieldCacheSanityChecker, TestScorerPerf, TestPayloadTermQuery, TestDoc, TestDocValuesTypeCompatibility,
TestOmitTf, TestDisjunctionMaxQuery, TestForceMergeForever, TestSimpleSearchEquivalence, TestFieldMaskingSpanQuery,
TestPayloadNearQuery, TestPrefixRandom, TestDocumentWriter, TestPayloadExplanations, TestQueryWrapperFilter,
TestPrefixCodedTerms, TestMultiTermConstantScore, TestTermVectorsWriter, TestUnicodeUtil,
TestTransactionRollback, TestSentinelIntSet, TestDocTermOrds, TestTermVectorsReader, TestSimilarity2,
TestAllFilesHaveCodecHeader, TestParallelAtomicReader, TestMultiLevelSkipList, TestBasicOperations,
TestRegexpRandom, TestSimpleExplanationsOfNonMatches, TestRollingBuffer, TestSpansAdvanced2,
InBeforeClass, InAfterClass, InTestMethod, NonStringProperties, TestWildcard, TestSizeBoundedForceMerge,
TestSpanExplanationsOfNonMatches, TestAutomatonQuery, TestComplexExplanationsOfNonMatches,
TestCheckIndex, TestNearSpansOrdered, TestSpecialOperations, TestSumDocFreq, TestSearchForDuplicates,
TestPerSegmentDeletes, TestSmallFloat, TestBinaryTerms, TestDocument, TestIndexWriterConfig,
TestSetOnce, TestDocValuesScoring, TestTermScorer, Test2BPostings, TestFieldValueFilter, TestFileSwitchDirectory,
TestDateFilter, ThrowInUncaught, TestBooleanScorer, TestPositionIncrement, TestDirectory,
Nested1, TestSearch, TestParallelTermEnum, TestReaderClosed, TestElevationComparator, TestMatchAllDocsQuery,
TestSimilarity, TestSimilarityProvider, TestAttributeSource, TestCachingCollector, TestDemo,
TestPrefixQuery, TestTopScoreDocCollector, TestSpanFirstQuery, TestBytesRef, TestPriorityQueue,
TestVirtualMethod, TestNoMergePolicy, TestDocBoost, TestNamedSPILoader, TestMockCharFilter,
TestFieldInfos, TestPositiveScoresOnlyCollector, TestBitUtil, TestCloseableThreadLocal, TestVersionComparator,
TestNewestSegment, TestNoMergeScheduler, TestSimpleAttributeImpl, TestWorstCaseTestBehavior,
TestCharFilter, TestPayloadsOnVectors, TestPostingsFormat]
[junit4:junit4]   2> NOTE: reproduce with: ant test  -Dtestcase=TestPostingsFormat -Dtests.seed=EDF27D871C0D7F2D
-Dtests.slow=true -Dtests.locale=es_CL -Dtests.timezone=America/Argentina/San_Juan -Dtests.file.encoding=UTF-8
[junit4:junit4] ERROR   0.00s | TestPostingsFormat (suite) <<<
[junit4:junit4]    > Throwable #1: java.lang.NullPointerException
[junit4:junit4]    > 	at __randomizedtesting.SeedInfo.seed([EDF27D871C0D7F2D]:0)
[junit4:junit4]    > 	at org.apache.lucene.index.BasePostingsFormatTestCase.createPostings(BasePostingsFormatTestCase.java:171)
[junit4:junit4]    > 	at sun.reflect.NativeMethodAccessorImpl.invoke0(Native Method)
[junit4:junit4]    > 	at sun.reflect.NativeMethodAccessorImpl.invoke(NativeMethodAccessorImpl.java:39)
[junit4:junit4]    > 	at sun.reflect.DelegatingMethodAccessorImpl.invoke(DelegatingMethodAccessorImpl.java:25)
[junit4:junit4]    > 	at java.lang.reflect.Method.invoke(Method.java:597)
[junit4:junit4]    > 	at com.carrotsearch.randomizedtesting.RandomizedRunner.invoke(RandomizedRunner.java:1559)
[junit4:junit4]    > 	at com.carrotsearch.randomizedtesting.RandomizedRunner.access$600(RandomizedRunner.java:79)
[junit4:junit4]    > 	at com.carrotsearch.randomizedtesting.RandomizedRunner$4.evaluate(RandomizedRunner.java:677)
[junit4:junit4]    > 	at com.carrotsearch.randomizedtesting.RandomizedRunner$5.evaluate(RandomizedRunner.java:693)
[junit4:junit4]    > 	at org.apache.lucene.util.AbstractBeforeAfterRule$1.evaluate(AbstractBeforeAfterRule.java:45)
[junit4:junit4]    > 	at org.apache.lucene.util.TestRuleStoreClassName$1.evaluate(TestRuleStoreClassName.java:42)
[junit4:junit4]    > 	at com.carrotsearch.randomizedtesting.rules.SystemPropertiesInvariantRule$1.evaluate(SystemPropertiesInvariantRule.java:55)
[junit4:junit4]    > 	at com.carrotsearch.randomizedtesting.rules.NoShadowingOrOverridesOnMethodsRule$1.evaluate(NoShadowingOrOverridesOnMethodsRule.java:39)
[junit4:junit4]    > 	at com.carrotsearch.randomizedtesting.rules.NoShadowingOrOverridesOnMethodsRule$1.evaluate(NoShadowingOrOverridesOnMethodsRule.java:39)
[junit4:junit4]    > 	at com.carrotsearch.randomizedtesting.rules.StatementAdapter.evaluate(StatementAdapter.java:36)
[junit4:junit4]    > 	at org.apache.lucene.util.TestRuleAssertionsRequired$1.evaluate(TestRuleAssertionsRequired.java:43)
[junit4:junit4]    > 	at org.apache.lucene.util.TestRuleMarkFailure$1.evaluate(TestRuleMarkFailure.java:48)
[junit4:junit4]    > 	at org.apache.lucene.util.TestRuleIgnoreAfterMaxFailures$1.evaluate(TestRuleIgnoreAfterMaxFailures.java:70)
[junit4:junit4]    > 	at org.apache.lucene.util.TestRuleIgnoreTestSuites$1.evaluate(TestRuleIgnoreTestSuites.java:55)
[junit4:junit4]    > 	at com.carrotsearch.randomizedtesting.rules.StatementAdapter.evaluate(StatementAdapter.java:36)
[junit4:junit4]    > 	at com.carrotsearch.randomizedtesting.ThreadLeakControl$StatementRunner.run(ThreadLeakControl.java:358)
[junit4:junit4]    > 	at java.lang.Thread.run(Thread.java:662)
[junit4:junit4] Completed in 0.03s, 0 tests, 1 error <<< FAILURES!

[...truncated 24 lines...]
BUILD FAILED
C:\Users\JenkinsSlave\workspace\Lucene-Solr-trunk-Windows\build.xml:38: The following error
occurred while executing this line:
C:\Users\JenkinsSlave\workspace\Lucene-Solr-trunk-Windows\lucene\build.xml:49: The following
error occurred while executing this line:
C:\Users\JenkinsSlave\workspace\Lucene-Solr-trunk-Windows\lucene\common-build.xml:1143: The
following error occurred while executing this line:
C:\Users\JenkinsSlave\workspace\Lucene-Solr-trunk-Windows\lucene\common-build.xml:816: There
were test failures: 306 suites, 1778 tests, 1 suite-level error, 20 ignored (12 assumptions)

Total time: 9 minutes 8 seconds
Build step 'Invoke Ant' marked build as failure
Recording test results
Description set: Java: 32bit/jdk1.6.0_35 -client -XX:+UseParallelGC
Email was triggered for: Failure
Sending email for trigger: Failure



Mime
View raw message