lucene-dev mailing list archives

Site index · List index
Message view « Date » · « Thread »
Top « Date » · « Thread »
From Apache Jenkins Server <jenk...@builds.apache.org>
Subject [JENKINS] Lucene-Solr-Tests-4.x-java7 - Build # 473 - Still Failing
Date Wed, 19 Sep 2012 19:51:03 GMT
Build: https://builds.apache.org/job/Lucene-Solr-Tests-4.x-java7/473/

2 tests failed.
REGRESSION:  org.apache.solr.cloud.SyncSliceTest.testDistribSearch

Error Message:
No live SolrServers available to handle this request

Stack Trace:
org.apache.solr.client.solrj.SolrServerException: No live SolrServers available to handle this request
	at __randomizedtesting.SeedInfo.seed([A9EC055772E5300F:280A8B4F05BA5033]:0)
	at org.apache.solr.client.solrj.impl.LBHttpSolrServer.request(LBHttpSolrServer.java:323)
	at org.apache.solr.client.solrj.impl.CloudSolrServer.request(CloudSolrServer.java:257)
	at org.apache.solr.client.solrj.request.QueryRequest.process(QueryRequest.java:90)
	at org.apache.solr.client.solrj.SolrServer.query(SolrServer.java:324)
	at org.apache.solr.cloud.AbstractFullDistribZkTestBase.checkShardConsistency(AbstractFullDistribZkTestBase.java:909)
	at org.apache.solr.cloud.SyncSliceTest.doTest(SyncSliceTest.java:226)
	at org.apache.solr.BaseDistributedSearchTestCase.testDistribSearch(BaseDistributedSearchTestCase.java:695)
	at sun.reflect.NativeMethodAccessorImpl.invoke0(Native Method)
	at sun.reflect.NativeMethodAccessorImpl.invoke(NativeMethodAccessorImpl.java:57)
	at sun.reflect.DelegatingMethodAccessorImpl.invoke(DelegatingMethodAccessorImpl.java:43)
	at java.lang.reflect.Method.invoke(Method.java:601)
	at com.carrotsearch.randomizedtesting.RandomizedRunner.invoke(RandomizedRunner.java:1559)
	at com.carrotsearch.randomizedtesting.RandomizedRunner.access$600(RandomizedRunner.java:79)
	at com.carrotsearch.randomizedtesting.RandomizedRunner$6.evaluate(RandomizedRunner.java:737)
	at com.carrotsearch.randomizedtesting.RandomizedRunner$7.evaluate(RandomizedRunner.java:773)
	at com.carrotsearch.randomizedtesting.RandomizedRunner$8.evaluate(RandomizedRunner.java:787)
	at com.carrotsearch.randomizedtesting.rules.SystemPropertiesRestoreRule$1.evaluate(SystemPropertiesRestoreRule.java:53)
	at org.apache.lucene.util.TestRuleSetupTeardownChained$1.evaluate(TestRuleSetupTeardownChained.java:50)
	at org.apache.lucene.util.TestRuleFieldCacheSanity$1.evaluate(TestRuleFieldCacheSanity.java:51)
	at org.apache.lucene.util.AbstractBeforeAfterRule$1.evaluate(AbstractBeforeAfterRule.java:45)
	at com.carrotsearch.randomizedtesting.rules.SystemPropertiesInvariantRule$1.evaluate(SystemPropertiesInvariantRule.java:55)
	at org.apache.lucene.util.TestRuleThreadAndTestName$1.evaluate(TestRuleThreadAndTestName.java:48)
	at org.apache.lucene.util.TestRuleIgnoreAfterMaxFailures$1.evaluate(TestRuleIgnoreAfterMaxFailures.java:70)
	at org.apache.lucene.util.TestRuleMarkFailure$1.evaluate(TestRuleMarkFailure.java:48)
	at com.carrotsearch.randomizedtesting.rules.StatementAdapter.evaluate(StatementAdapter.java:36)
	at com.carrotsearch.randomizedtesting.ThreadLeakControl$StatementRunner.run(ThreadLeakControl.java:358)
	at com.carrotsearch.randomizedtesting.ThreadLeakControl.forkTimeoutingTask(ThreadLeakControl.java:782)
	at com.carrotsearch.randomizedtesting.ThreadLeakControl$3.evaluate(ThreadLeakControl.java:442)
	at com.carrotsearch.randomizedtesting.RandomizedRunner.runSingleTest(RandomizedRunner.java:746)
	at com.carrotsearch.randomizedtesting.RandomizedRunner$3.evaluate(RandomizedRunner.java:648)
	at com.carrotsearch.randomizedtesting.RandomizedRunner$4.evaluate(RandomizedRunner.java:682)
	at com.carrotsearch.randomizedtesting.RandomizedRunner$5.evaluate(RandomizedRunner.java:693)
	at com.carrotsearch.randomizedtesting.rules.StatementAdapter.evaluate(StatementAdapter.java:36)
	at com.carrotsearch.randomizedtesting.rules.SystemPropertiesRestoreRule$1.evaluate(SystemPropertiesRestoreRule.java:53)
	at org.apache.lucene.util.AbstractBeforeAfterRule$1.evaluate(AbstractBeforeAfterRule.java:45)
	at org.apache.lucene.util.TestRuleStoreClassName$1.evaluate(TestRuleStoreClassName.java:42)
	at com.carrotsearch.randomizedtesting.rules.SystemPropertiesInvariantRule$1.evaluate(SystemPropertiesInvariantRule.java:55)
	at com.carrotsearch.randomizedtesting.rules.NoShadowingOrOverridesOnMethodsRule$1.evaluate(NoShadowingOrOverridesOnMethodsRule.java:39)
	at com.carrotsearch.randomizedtesting.rules.NoShadowingOrOverridesOnMethodsRule$1.evaluate(NoShadowingOrOverridesOnMethodsRule.java:39)
	at com.carrotsearch.randomizedtesting.rules.StatementAdapter.evaluate(StatementAdapter.java:36)
	at org.apache.lucene.util.TestRuleAssertionsRequired$1.evaluate(TestRuleAssertionsRequired.java:43)
	at org.apache.lucene.util.TestRuleMarkFailure$1.evaluate(TestRuleMarkFailure.java:48)
	at org.apache.lucene.util.TestRuleIgnoreAfterMaxFailures$1.evaluate(TestRuleIgnoreAfterMaxFailures.java:70)
	at org.apache.lucene.util.TestRuleIgnoreTestSuites$1.evaluate(TestRuleIgnoreTestSuites.java:55)
	at com.carrotsearch.randomizedtesting.rules.StatementAdapter.evaluate(StatementAdapter.java:36)
	at com.carrotsearch.randomizedtesting.ThreadLeakControl$StatementRunner.run(ThreadLeakControl.java:358)
	at java.lang.Thread.run(Thread.java:722)


FAILED:  org.apache.solr.cloud.BasicDistributedZk2Test.testDistribSearch

Error Message:
Shard still reported as live in zk

Stack Trace:
java.lang.AssertionError: Shard still reported as live in zk
	at __randomizedtesting.SeedInfo.seed([A9EC055772E5300F:280A8B4F05BA5033]:0)
	at org.junit.Assert.fail(Assert.java:93)
	at org.apache.solr.cloud.AbstractFullDistribZkTestBase.waitToSeeNotLive(AbstractFullDistribZkTestBase.java:1220)
	at org.apache.solr.cloud.BasicDistributedZk2Test.brindDownShardIndexSomeDocsAndRecover(BasicDistributedZk2Test.java:190)
	at org.apache.solr.cloud.BasicDistributedZk2Test.doTest(BasicDistributedZk2Test.java:83)
	at org.apache.solr.BaseDistributedSearchTestCase.testDistribSearch(BaseDistributedSearchTestCase.java:695)
	at sun.reflect.NativeMethodAccessorImpl.invoke0(Native Method)
	at sun.reflect.NativeMethodAccessorImpl.invoke(NativeMethodAccessorImpl.java:57)
	at sun.reflect.DelegatingMethodAccessorImpl.invoke(DelegatingMethodAccessorImpl.java:43)
	at java.lang.reflect.Method.invoke(Method.java:601)
	at com.carrotsearch.randomizedtesting.RandomizedRunner.invoke(RandomizedRunner.java:1559)
	at com.carrotsearch.randomizedtesting.RandomizedRunner.access$600(RandomizedRunner.java:79)
	at com.carrotsearch.randomizedtesting.RandomizedRunner$6.evaluate(RandomizedRunner.java:737)
	at com.carrotsearch.randomizedtesting.RandomizedRunner$7.evaluate(RandomizedRunner.java:773)
	at com.carrotsearch.randomizedtesting.RandomizedRunner$8.evaluate(RandomizedRunner.java:787)
	at com.carrotsearch.randomizedtesting.rules.SystemPropertiesRestoreRule$1.evaluate(SystemPropertiesRestoreRule.java:53)
	at org.apache.lucene.util.TestRuleSetupTeardownChained$1.evaluate(TestRuleSetupTeardownChained.java:50)
	at org.apache.lucene.util.TestRuleFieldCacheSanity$1.evaluate(TestRuleFieldCacheSanity.java:51)
	at org.apache.lucene.util.AbstractBeforeAfterRule$1.evaluate(AbstractBeforeAfterRule.java:45)
	at com.carrotsearch.randomizedtesting.rules.SystemPropertiesInvariantRule$1.evaluate(SystemPropertiesInvariantRule.java:55)
	at org.apache.lucene.util.TestRuleThreadAndTestName$1.evaluate(TestRuleThreadAndTestName.java:48)
	at org.apache.lucene.util.TestRuleIgnoreAfterMaxFailures$1.evaluate(TestRuleIgnoreAfterMaxFailures.java:70)
	at org.apache.lucene.util.TestRuleMarkFailure$1.evaluate(TestRuleMarkFailure.java:48)
	at com.carrotsearch.randomizedtesting.rules.StatementAdapter.evaluate(StatementAdapter.java:36)
	at com.carrotsearch.randomizedtesting.ThreadLeakControl$StatementRunner.run(ThreadLeakControl.java:358)
	at com.carrotsearch.randomizedtesting.ThreadLeakControl.forkTimeoutingTask(ThreadLeakControl.java:782)
	at com.carrotsearch.randomizedtesting.ThreadLeakControl$3.evaluate(ThreadLeakControl.java:442)
	at com.carrotsearch.randomizedtesting.RandomizedRunner.runSingleTest(RandomizedRunner.java:746)
	at com.carrotsearch.randomizedtesting.RandomizedRunner$3.evaluate(RandomizedRunner.java:648)
	at com.carrotsearch.randomizedtesting.RandomizedRunner$4.evaluate(RandomizedRunner.java:682)
	at com.carrotsearch.randomizedtesting.RandomizedRunner$5.evaluate(RandomizedRunner.java:693)
	at com.carrotsearch.randomizedtesting.rules.StatementAdapter.evaluate(StatementAdapter.java:36)
	at com.carrotsearch.randomizedtesting.rules.SystemPropertiesRestoreRule$1.evaluate(SystemPropertiesRestoreRule.java:53)
	at org.apache.lucene.util.AbstractBeforeAfterRule$1.evaluate(AbstractBeforeAfterRule.java:45)
	at org.apache.lucene.util.TestRuleStoreClassName$1.evaluate(TestRuleStoreClassName.java:42)
	at com.carrotsearch.randomizedtesting.rules.SystemPropertiesInvariantRule$1.evaluate(SystemPropertiesInvariantRule.java:55)
	at com.carrotsearch.randomizedtesting.rules.NoShadowingOrOverridesOnMethodsRule$1.evaluate(NoShadowingOrOverridesOnMethodsRule.java:39)
	at com.carrotsearch.randomizedtesting.rules.NoShadowingOrOverridesOnMethodsRule$1.evaluate(NoShadowingOrOverridesOnMethodsRule.java:39)
	at com.carrotsearch.randomizedtesting.rules.StatementAdapter.evaluate(StatementAdapter.java:36)
	at org.apache.lucene.util.TestRuleAssertionsRequired$1.evaluate(TestRuleAssertionsRequired.java:43)
	at org.apache.lucene.util.TestRuleMarkFailure$1.evaluate(TestRuleMarkFailure.java:48)
	at org.apache.lucene.util.TestRuleIgnoreAfterMaxFailures$1.evaluate(TestRuleIgnoreAfterMaxFailures.java:70)
	at org.apache.lucene.util.TestRuleIgnoreTestSuites$1.evaluate(TestRuleIgnoreTestSuites.java:55)
	at com.carrotsearch.randomizedtesting.rules.StatementAdapter.evaluate(StatementAdapter.java:36)
	at com.carrotsearch.randomizedtesting.ThreadLeakControl$StatementRunner.run(ThreadLeakControl.java:358)
	at java.lang.Thread.run(Thread.java:722)




Build Log:
[...truncated 7709 lines...]
[junit4:junit4] Suite: org.apache.solr.cloud.SyncSliceTest
[junit4:junit4]   2> 7 T30 oas.SolrTestCaseJ4.setUp ###Starting testDistribSearch
[junit4:junit4]   2> Creating dataDir: /usr/home/hudson/hudson-slave/workspace/Lucene-Solr-Tests-4.x-java7/solr/build/solr-core/test/J1/./solrtest-SyncSliceTest-1348083201433
[junit4:junit4]   2> 14 T30 oasc.ZkTestServer.run STARTING ZK TEST SERVER
[junit4:junit4]   2> 101 T31 oaz.Environment.logEnv Server environment:zookeeper.version=3.3.6-1366786, built on 07/29/2012 06:22 GMT
[junit4:junit4]   2> 102 T31 oaz.Environment.logEnv Server environment:host.name=lucene.zones.apache.org
[junit4:junit4]   2> 102 T31 oaz.Environment.logEnv Server environment:java.version=1.7.0_06
[junit4:junit4]   2> 102 T31 oaz.Environment.logEnv Server environment:java.vendor=Oracle Corporation
[junit4:junit4]   2> 102 T31 oaz.Environment.logEnv Server environment:java.home=/usr/local/openjdk7/jre
[junit4:junit4]   2> 103 T31 oaz.Environment.logEnv Server environment:java.class.path=/usr/home/hudson/hudson-slave/workspace/Lucene-Solr-Tests-4.x-java7/solr/build/solr-core/classes/test:/usr/home/hudson/hudson-slave/workspace/Lucene-Solr-Tests-4.x-java7/solr/build/solr-test-framework/classes/java:/usr/home/hudson/hudson-slave/workspace/Lucene-Solr-Tests-4.x-java7/solr/build/solr-core/test-files:/usr/home/hudson/hudson-slave/workspace/Lucene-Solr-Tests-4.x-java7/lucene/build/codecs/classes/java:/usr/home/hudson/hudson-slave/workspace/Lucene-Solr-Tests-4.x-java7/lucene/build/test-framework/classes/java:/usr/home/hudson/hudson-slave/workspace/Lucene-Solr-Tests-4.x-java7/solr/build/solr-solrj/classes/java:/usr/home/hudson/hudson-slave/workspace/Lucene-Solr-Tests-4.x-java7/solr/build/solr-core/classes/java:/usr/home/hudson/hudson-slave/workspace/Lucene-Solr-Tests-4.x-java7/lucene/build/analysis/common/lucene-analyzers-common-4.0-SNAPSHOT.jar:/usr/home/hudson/hudson-slave/workspace/Lucene-Solr-Tests-4.x-java7/lucene/build/analysis/kuromoji/lucene-analyzers-kuromoji-4.0-SNAPSHOT.jar:/usr/home/hudson/hudson-slave/workspace/Lucene-Solr-Tests-4.x-java7/lucene/build/analysis/phonetic/lucene-analyzers-phonetic-4.0-SNAPSHOT.jar:/usr/home/hudson/hudson-slave/workspace/Lucene-Solr-Tests-4.x-java7/lucene/build/highlighter/lucene-highlighter-4.0-SNAPSHOT.jar:/usr/home/hudson/hudson-slave/workspace/Lucene-Solr-Tests-4.x-java7/lucene/build/memory/lucene-memory-4.0-SNAPSHOT.jar:/usr/home/hudson/hudson-slave/workspace/Lucene-Solr-Tests-4.x-java7/lucene/build/misc/lucene-misc-4.0-SNAPSHOT.jar:/usr/home/hudson/hudson-slave/workspace/Lucene-Solr-Tests-4.x-java7/lucene/build/spatial/lucene-spatial-4.0-SNAPSHOT.jar:/usr/home/hudson/hudson-slave/workspace/Lucene-Solr-Tests-4.x-java7/lucene/build/suggest/lucene-suggest-4.0-SNAPSHOT.jar:/usr/home/hudson/hudson-slave/workspace/Lucene-Solr-Tests-4.x-java7/lucene/build/grouping/lucene-grouping-4.0-SNAPSHOT.jar:/usr/home/hudson/hudson-slave/workspace/Lucene-Solr-Tests-4.x-java7/lucene/build/queries/lucene-queries-4.0-SNAPSHOT.jar:/usr/home/hudson/hudson-slave/workspace/Lucene-Solr-Tests-4.x-java7/lucene/build/queryparser/lucene-queryparser-4.0-SNAPSHOT.jar:/usr/home/hudson/hudson-slave/workspace/Lucene-Solr-Tests-4.x-java7/solr/core/lib/commons-cli-1.2.jar:/usr/home/hudson/hudson-slave/workspace/Lucene-Solr-Tests-4.x-java7/solr/core/lib/commons-codec-1.7.jar:/usr/home/hudson/hudson-slave/workspace/Lucene-Solr-Tests-4.x-java7/solr/core/lib/commons-fileupload-1.2.1.jar:/usr/home/hudson/hudson-slave/workspace/Lucene-Solr-Tests-4.x-java7/solr/core/lib/commons-lang-2.6.jar:/usr/home/hudson/hudson-slave/workspace/Lucene-Solr-Tests-4.x-java7/solr/core/lib/easymock-2.2.jar:/usr/home/hudson/hudson-slave/workspace/Lucene-Solr-Tests-4.x-java7/solr/core/lib/guava-r05.jar:/usr/home/hudson/hudson-slave/workspace/Lucene-Solr-Tests-4.x-java7/solr/core/lib/javax.servlet-api-3.0.1.jar:/usr/home/hudson/hudson-slave/workspace/Lucene-Solr-Tests-4.x-java7/solr/core/lib/spatial4j-0.3.jar:/usr/home/hudson/hudson-slave/workspace/Lucene-Solr-Tests-4.x-java7/solr/solrj/lib/commons-io-2.1.jar:/usr/home/hudson/hudson-slave/workspace/Lucene-Solr-Tests-4.x-java7/solr/solrj/lib/httpclient-4.1.3.jar:/usr/home/hudson/hudson-slave/workspace/Lucene-Solr-Tests-4.x-java7/solr/solrj/lib/httpcore-4.1.4.jar:/usr/home/hudson/hudson-slave/workspace/Lucene-Solr-Tests-4.x-java7/solr/solrj/lib/httpmime-4.1.3.jar:/usr/home/hudson/hudson-slave/workspace/Lucene-Solr-Tests-4.x-java7/solr/solrj/lib/jcl-over-slf4j-1.6.4.jar:/usr/home/hudson/hudson-slave/workspace/Lucene-Solr-Tests-4.x-java7/solr/solrj/lib/log4j-over-slf4j-1.6.4.jar:/usr/home/hudson/hudson-slave/workspace/Lucene-Solr-Tests-4.x-java7/solr/solrj/lib/slf4j-api-1.6.4.jar:/usr/home/hudson/hudson-slave/workspace/Lucene-Solr-Tests-4.x-java7/solr/solrj/lib/slf4j-jdk14-1.6.4.jar:/usr/home/hudson/hudson-slave/workspace/Lucene-Solr-Tests-4.x-java7/solr/solrj/lib/wstx-asl-3.2.7.jar:/usr/home/hudson/hudson-slave/workspace/Lucene-Solr-Tests-4.x-java7/solr/solrj/lib/zookeeper-3.3.6.jar:/usr/home/hudson/hudson-slave/workspace/Lucene-Solr-Tests-4.x-java7/solr/example/lib/jetty-continuation-8.1.2.v20120308.jar:/usr/home/hudson/hudson-slave/workspace/Lucene-Solr-Tests-4.x-java7/solr/example/lib/jetty-deploy-8.1.2.v20120308.jar:/usr/home/hudson/hudson-slave/workspace/Lucene-Solr-Tests-4.x-java7/solr/example/lib/jetty-http-8.1.2.v20120308.jar:/usr/home/hudson/hudson-slave/workspace/Lucene-Solr-Tests-4.x-java7/solr/example/lib/jetty-io-8.1.2.v20120308.jar:/usr/home/hudson/hudson-slave/workspace/Lucene-Solr-Tests-4.x-java7/solr/example/lib/jetty-jmx-8.1.2.v20120308.jar:/usr/home/hudson/hudson-slave/workspace/Lucene-Solr-Tests-4.x-java7/solr/example/lib/jetty-security-8.1.2.v20120308.jar:/usr/home/hudson/hudson-slave/workspace/Lucene-Solr-Tests-4.x-java7/solr/example/lib/jetty-server-8.1.2.v20120308.jar:/usr/home/hudson/hudson-slave/workspace/Lucene-Solr-Tests-4.x-java7/solr/example/lib/jetty-servlet-8.1.2.v20120308.jar:/usr/home/hudson/hudson-slave/workspace/Lucene-Solr-Tests-4.x-java7/solr/example/lib/jetty-util-8.1.2.v20120308.jar:/usr/home/hudson/hudson-slave/workspace/Lucene-Solr-Tests-4.x-java7/solr/example/lib/jetty-webapp-8.1.2.v20120308.jar:/usr/home/hudson/hudson-slave/workspace/Lucene-Solr-Tests-4.x-java7/solr/example/lib/jetty-xml-8.1.2.v20120308.jar:/usr/home/hudson/hudson-slave/workspace/Lucene-Solr-Tests-4.x-java7/solr/example/lib/servlet-api-3.0.jar:/usr/home/hudson/hudson-slave/workspace/Lucene-Solr-Tests-4.x-java7/solr/example/example-DIH/solr/db/lib/hsqldb-1.8.0.10.jar:/usr/home/hudson/hudson-slave/workspace/Lucene-Solr-Tests-4.x-java7/lucene/build/core/classes/java:/usr/home/hudson/hudson-slave/workspace/Lucene-Solr-Tests-4.x-java7/lucene/test-framework/lib/junit-4.10.jar:/usr/home/hudson/hudson-slave/workspace/Lucene-Solr-Tests-4.x-java7/lucene/test-framework/lib/randomizedtesting-runner-2.0.1.jar:/home/hudson/hudson-slave/tools/Ant/ant-1.8.2/lib/ant-launcher.jar:/home/hudson/.ant/lib/ivy-2.2.0.jar:/home/hudson/hudson-slave/tools/Ant/ant-1.8.2/lib/ant-apache-regexp.jar:/home/hudson/hudson-slave/tools/Ant/ant-1.8.2/lib/ant-junit.jar:/home/hudson/hudson-slave/tools/Ant/ant-1.8.2/lib/ant-apache-bsf.jar:/home/hudson/hudson-slave/tools/Ant/ant-1.8.2/lib/ant-commons-net.jar:/home/hudson/hudson-slave/tools/Ant/ant-1.8.2/lib/ant-antlr.jar:/home/hudson/hudson-slave/tools/Ant/ant-1.8.2/lib/ant-apache-log4j.jar:/home/hudson/hudson-slave/tools/Ant/ant-1.8.2/lib/ant-commons-logging.jar:/home/hudson/hudson-slave/tools/Ant/ant-1.8.2/lib/ant-apache-xalan2.jar:/home/hudson/hudson-slave/tools/Ant/ant-1.8.2/lib/ant-apache-oro.jar:/home/hudson/hudson-slave/tools/Ant/ant-1.8.2/lib/ant-junit4.jar:/home/hudson/hudson-slave/tools/Ant/ant-1.8.2/lib/ant-netrexx.jar:/home/hudson/hudson-slave/tools/Ant/ant-1.8.2/lib/ant-swing.jar:/home/hudson/hudson-slave/tools/Ant/ant-1.8.2/lib/ant-javamail.jar:/home/hudson/hudson-slave/tools/Ant/ant-1.8.2/lib/ant-jsch.jar:/home/hudson/hudson-slave/tools/Ant/ant-1.8.2/lib/ant-jmf.jar:/home/hudson/hudson-slave/tools/Ant/ant-1.8.2/lib/ant.jar:/home/hudson/hudson-slave/tools/Ant/ant-1.8.2/lib/ant-apache-bcel.jar:/home/hudson/hudson-slave/tools/Ant/ant-1.8.2/lib/ant-jai.jar:/home/hudson/hudson-slave/tools/Ant/ant-1.8.2/lib/ant-testutil.jar:/home/hudson/hudson-slave/tools/Ant/ant-1.8.2/lib/ant-apache-resolver.jar:/home/hudson/hudson-slave/tools/Ant/ant-1.8.2/lib/ant-jdepend.jar:/usr/local/openjdk7/lib/tools.jar:/home/hudson/.ivy2/cache/com.carrotsearch.randomizedtesting/junit4-ant/jars/junit4-ant-2.0.1.jar
[junit4:junit4]   2> 104 T31 oaz.Environment.logEnv Server environment:java.library.path=/usr/local/openjdk7/jre/lib/amd64/server:/usr/local/openjdk7/jre/lib/amd64:/usr/local/openjdk7/jre/../lib/amd64:/usr/local/openjdk6/jre/lib/amd64/server:/usr/local/openjdk6/jre/lib/amd64:/usr/local/openjdk6/jre/../lib/amd64:/usr/java/packages/lib/amd64:/lib:/usr/lib:/usr/local/lib
[junit4:junit4]   2> 104 T31 oaz.Environment.logEnv Server environment:java.io.tmpdir=.
[junit4:junit4]   2> 104 T31 oaz.Environment.logEnv Server environment:java.compiler=<NA>
[junit4:junit4]   2> 104 T31 oaz.Environment.logEnv Server environment:os.name=FreeBSD
[junit4:junit4]   2> 105 T31 oaz.Environment.logEnv Server environment:os.arch=amd64
[junit4:junit4]   2> 107 T31 oaz.Environment.logEnv Server environment:os.version=9.0-RELEASE
[junit4:junit4]   2> 107 T31 oaz.Environment.logEnv Server environment:user.name=hudson
[junit4:junit4]   2> 107 T31 oaz.Environment.logEnv Server environment:user.home=/home/hudson
[junit4:junit4]   2> 108 T31 oaz.Environment.logEnv Server environment:user.dir=/usr/home/hudson/hudson-slave/workspace/Lucene-Solr-Tests-4.x-java7/solr/build/solr-core/test/J1
[junit4:junit4]   2> 142 T31 oazs.ZooKeeperServer.setTickTime tickTime set to 1000
[junit4:junit4]   2> 170 T31 oazs.NIOServerCnxn$Factory.<init> binding to port 0.0.0.0/0.0.0.0:0
[junit4:junit4]   2> 221 T30 oasc.ZkTestServer.run start zk server on port:26833
[junit4:junit4]   2> 222 T31 oazsp.FileTxnSnapLog.save Snapshotting: 0
[junit4:junit4]   2> 328 T30 oaz.Environment.logEnv Client environment:zookeeper.version=3.3.6-1366786, built on 07/29/2012 06:22 GMT
[junit4:junit4]   2> 329 T30 oaz.Environment.logEnv Client environment:host.name=lucene.zones.apache.org
[junit4:junit4]   2> 330 T30 oaz.Environment.logEnv Client environment:java.version=1.7.0_06
[junit4:junit4]   2> 330 T30 oaz.Environment.logEnv Client environment:java.vendor=Oracle Corporation
[junit4:junit4]   2> 331 T30 oaz.Environment.logEnv Client environment:java.home=/usr/local/openjdk7/jre
[junit4:junit4]   2> 331 T30 oaz.Environment.logEnv Client environment:java.class.path=/usr/home/hudson/hudson-slave/workspace/Lucene-Solr-Tests-4.x-java7/solr/build/solr-core/classes/test:/usr/home/hudson/hudson-slave/workspace/Lucene-Solr-Tests-4.x-java7/solr/build/solr-test-framework/classes/java:/usr/home/hudson/hudson-slave/workspace/Lucene-Solr-Tests-4.x-java7/solr/build/solr-core/test-files:/usr/home/hudson/hudson-slave/workspace/Lucene-Solr-Tests-4.x-java7/lucene/build/codecs/classes/java:/usr/home/hudson/hudson-slave/workspace/Lucene-Solr-Tests-4.x-java7/lucene/build/test-framework/classes/java:/usr/home/hudson/hudson-slave/workspace/Lucene-Solr-Tests-4.x-java7/solr/build/solr-solrj/classes/java:/usr/home/hudson/hudson-slave/workspace/Lucene-Solr-Tests-4.x-java7/solr/build/solr-core/classes/java:/usr/home/hudson/hudson-slave/workspace/Lucene-Solr-Tests-4.x-java7/lucene/build/analysis/common/lucene-analyzers-common-4.0-SNAPSHOT.jar:/usr/home/hudson/hudson-slave/workspace/Lucene-Solr-Tests-4.x-java7/lucene/build/analysis/kuromoji/lucene-analyzers-kuromoji-4.0-SNAPSHOT.jar:/usr/home/hudson/hudson-slave/workspace/Lucene-Solr-Tests-4.x-java7/lucene/build/analysis/phonetic/lucene-analyzers-phonetic-4.0-SNAPSHOT.jar:/usr/home/hudson/hudson-slave/workspace/Lucene-Solr-Tests-4.x-java7/lucene/build/highlighter/lucene-highlighter-4.0-SNAPSHOT.jar:/usr/home/hudson/hudson-slave/workspace/Lucene-Solr-Tests-4.x-java7/lucene/build/memory/lucene-memory-4.0-SNAPSHOT.jar:/usr/home/hudson/hudson-slave/workspace/Lucene-Solr-Tests-4.x-java7/lucene/build/misc/lucene-misc-4.0-SNAPSHOT.jar:/usr/home/hudson/hudson-slave/workspace/Lucene-Solr-Tests-4.x-java7/lucene/build/spatial/lucene-spatial-4.0-SNAPSHOT.jar:/usr/home/hudson/hudson-slave/workspace/Lucene-Solr-Tests-4.x-java7/lucene/build/suggest/lucene-suggest-4.0-SNAPSHOT.jar:/usr/home/hudson/hudson-slave/workspace/Lucene-Solr-Tests-4.x-java7/lucene/build/grouping/lucene-grouping-4.0-SNAPSHOT.jar:/usr/home/hudson/hudson-slave/workspace/Lucene-Solr-Tests-4.x-java7/lucene/build/queries/lucene-queries-4.0-SNAPSHOT.jar:/usr/home/hudson/hudson-slave/workspace/Lucene-Solr-Tests-4.x-java7/lucene/build/queryparser/lucene-queryparser-4.0-SNAPSHOT.jar:/usr/home/hudson/hudson-slave/workspace/Lucene-Solr-Tests-4.x-java7/solr/core/lib/commons-cli-1.2.jar:/usr/home/hudson/hudson-slave/workspace/Lucene-Solr-Tests-4.x-java7/solr/core/lib/commons-codec-1.7.jar:/usr/home/hudson/hudson-slave/workspace/Lucene-Solr-Tests-4.x-java7/solr/core/lib/commons-fileupload-1.2.1.jar:/usr/home/hudson/hudson-slave/workspace/Lucene-Solr-Tests-4.x-java7/solr/core/lib/commons-lang-2.6.jar:/usr/home/hudson/hudson-slave/workspace/Lucene-Solr-Tests-4.x-java7/solr/core/lib/easymock-2.2.jar:/usr/home/hudson/hudson-slave/workspace/Lucene-Solr-Tests-4.x-java7/solr/core/lib/guava-r05.jar:/usr/home/hudson/hudson-slave/workspace/Lucene-Solr-Tests-4.x-java7/solr/core/lib/javax.servlet-api-3.0.1.jar:/usr/home/hudson/hudson-slave/workspace/Lucene-Solr-Tests-4.x-java7/solr/core/lib/spatial4j-0.3.jar:/usr/home/hudson/hudson-slave/workspace/Lucene-Solr-Tests-4.x-java7/solr/solrj/lib/commons-io-2.1.jar:/usr/home/hudson/hudson-slave/workspace/Lucene-Solr-Tests-4.x-java7/solr/solrj/lib/httpclient-4.1.3.jar:/usr/home/hudson/hudson-slave/workspace/Lucene-Solr-Tests-4.x-java7/solr/solrj/lib/httpcore-4.1.4.jar:/usr/home/hudson/hudson-slave/workspace/Lucene-Solr-Tests-4.x-java7/solr/solrj/lib/httpmime-4.1.3.jar:/usr/home/hudson/hudson-slave/workspace/Lucene-Solr-Tests-4.x-java7/solr/solrj/lib/jcl-over-slf4j-1.6.4.jar:/usr/home/hudson/hudson-slave/workspace/Lucene-Solr-Tests-4.x-java7/solr/solrj/lib/log4j-over-slf4j-1.6.4.jar:/usr/home/hudson/hudson-slave/workspace/Lucene-Solr-Tests-4.x-java7/solr/solrj/lib/slf4j-api-1.6.4.jar:/usr/home/hudson/hudson-slave/workspace/Lucene-Solr-Tests-4.x-java7/solr/solrj/lib/slf4j-jdk14-1.6.4.jar:/usr/home/hudson/hudson-slave/workspace/Lucene-Solr-Tests-4.x-java7/solr/solrj/lib/wstx-asl-3.2.7.jar:/usr/home/hudson/hudson-slave/workspace/Lucene-Solr-Tests-4.x-java7/solr/solrj/lib/zookeeper-3.3.6.jar:/usr/home/hudson/hudson-slave/workspace/Lucene-Solr-Tests-4.x-java7/solr/example/lib/jetty-continuation-8.1.2.v20120308.jar:/usr/home/hudson/hudson-slave/workspace/Lucene-Solr-Tests-4.x-java7/solr/example/lib/jetty-deploy-8.1.2.v20120308.jar:/usr/home/hudson/hudson-slave/workspace/Lucene-Solr-Tests-4.x-java7/solr/example/lib/jetty-http-8.1.2.v20120308.jar:/usr/home/hudson/hudson-slave/workspace/Lucene-Solr-Tests-4.x-java7/solr/example/lib/jetty-io-8.1.2.v20120308.jar:/usr/home/hudson/hudson-slave/workspace/Lucene-Solr-Tests-4.x-java7/solr/example/lib/jetty-jmx-8.1.2.v20120308.jar:/usr/home/hudson/hudson-slave/workspace/Lucene-Solr-Tests-4.x-java7/solr/example/lib/jetty-security-8.1.2.v20120308.jar:/usr/home/hudson/hudson-slave/workspace/Lucene-Solr-Tests-4.x-java7/solr/example/lib/jetty-server-8.1.2.v20120308.jar:/usr/home/hudson/hudson-slave/workspace/Lucene-Solr-Tests-4.x-java7/solr/example/lib/jetty-servlet-8.1.2.v20120308.jar:/usr/home/hudson/hudson-slave/workspace/Lucene-Solr-Tests-4.x-java7/solr/example/lib/jetty-util-8.1.2.v20120308.jar:/usr/home/hudson/hudson-slave/workspace/Lucene-Solr-Tests-4.x-java7/solr/example/lib/jetty-webapp-8.1.2.v20120308.jar:/usr/home/hudson/hudson-slave/workspace/Lucene-Solr-Tests-4.x-java7/solr/example/lib/jetty-xml-8.1.2.v20120308.jar:/usr/home/hudson/hudson-slave/workspace/Lucene-Solr-Tests-4.x-java7/solr/example/lib/servlet-api-3.0.jar:/usr/home/hudson/hudson-slave/workspace/Lucene-Solr-Tests-4.x-java7/solr/example/example-DIH/solr/db/lib/hsqldb-1.8.0.10.jar:/usr/home/hudson/hudson-slave/workspace/Lucene-Solr-Tests-4.x-java7/lucene/build/core/classes/java:/usr/home/hudson/hudson-slave/workspace/Lucene-Solr-Tests-4.x-java7/lucene/test-framework/lib/junit-4.10.jar:/usr/home/hudson/hudson-slave/workspace/Lucene-Solr-Tests-4.x-java7/lucene/test-framework/lib/randomizedtesting-runner-2.0.1.jar:/home/hudson/hudson-slave/tools/Ant/ant-1.8.2/lib/ant-launcher.jar:/home/hudson/.ant/lib/ivy-2.2.0.jar:/home/hudson/hudson-slave/tools/Ant/ant-1.8.2/lib/ant-apache-regexp.jar:/home/hudson/hudson-slave/tools/Ant/ant-1.8.2/lib/ant-junit.jar:/home/hudson/hudson-slave/tools/Ant/ant-1.8.2/lib/ant-apache-bsf.jar:/home/hudson/hudson-slave/tools/Ant/ant-1.8.2/lib/ant-commons-net.jar:/home/hudson/hudson-slave/tools/Ant/ant-1.8.2/lib/ant-antlr.jar:/home/hudson/hudson-slave/tools/Ant/ant-1.8.2/lib/ant-apache-log4j.jar:/home/hudson/hudson-slave/tools/Ant/ant-1.8.2/lib/ant-commons-logging.jar:/home/hudson/hudson-slave/tools/Ant/ant-1.8.2/lib/ant-apache-xalan2.jar:/home/hudson/hudson-slave/tools/Ant/ant-1.8.2/lib/ant-apache-oro.jar:/home/hudson/hudson-slave/tools/Ant/ant-1.8.2/lib/ant-junit4.jar:/home/hudson/hudson-slave/tools/Ant/ant-1.8.2/lib/ant-netrexx.jar:/home/hudson/hudson-slave/tools/Ant/ant-1.8.2/lib/ant-swing.jar:/home/hudson/hudson-slave/tools/Ant/ant-1.8.2/lib/ant-javamail.jar:/home/hudson/hudson-slave/tools/Ant/ant-1.8.2/lib/ant-jsch.jar:/home/hudson/hudson-slave/tools/Ant/ant-1.8.2/lib/ant-jmf.jar:/home/hudson/hudson-slave/tools/Ant/ant-1.8.2/lib/ant.jar:/home/hudson/hudson-slave/tools/Ant/ant-1.8.2/lib/ant-apache-bcel.jar:/home/hudson/hudson-slave/tools/Ant/ant-1.8.2/lib/ant-jai.jar:/home/hudson/hudson-slave/tools/Ant/ant-1.8.2/lib/ant-testutil.jar:/home/hudson/hudson-slave/tools/Ant/ant-1.8.2/lib/ant-apache-resolver.jar:/home/hudson/hudson-slave/tools/Ant/ant-1.8.2/lib/ant-jdepend.jar:/usr/local/openjdk7/lib/tools.jar:/home/hudson/.ivy2/cache/com.carrotsearch.randomizedtesting/junit4-ant/jars/junit4-ant-2.0.1.jar
[junit4:junit4]   2> 333 T30 oaz.Environment.logEnv Client environment:java.library.path=/usr/local/openjdk7/jre/lib/amd64/server:/usr/local/openjdk7/jre/lib/amd64:/usr/local/openjdk7/jre/../lib/amd64:/usr/local/openjdk6/jre/lib/amd64/server:/usr/local/openjdk6/jre/lib/amd64:/usr/local/openjdk6/jre/../lib/amd64:/usr/java/packages/lib/amd64:/lib:/usr/lib:/usr/local/lib
[junit4:junit4]   2> 334 T30 oaz.Environment.logEnv Client environment:java.io.tmpdir=.
[junit4:junit4]   2> 334 T30 oaz.Environment.logEnv Client environment:java.compiler=<NA>
[junit4:junit4]   2> 335 T30 oaz.Environment.logEnv Client environment:os.name=FreeBSD
[junit4:junit4]   2> 335 T30 oaz.Environment.logEnv Client environment:os.arch=amd64
[junit4:junit4]   2> 336 T30 oaz.Environment.logEnv Client environment:os.version=9.0-RELEASE
[junit4:junit4]   2> 336 T30 oaz.Environment.logEnv Client environment:user.name=hudson
[junit4:junit4]   2> 337 T30 oaz.Environment.logEnv Client environment:user.home=/home/hudson
[junit4:junit4]   2> 337 T30 oaz.Environment.logEnv Client environment:user.dir=/usr/home/hudson/hudson-slave/workspace/Lucene-Solr-Tests-4.x-java7/solr/build/solr-core/test/J1
[junit4:junit4]   2> 343 T30 oaz.ZooKeeper.<init> Initiating client connection, connectString=127.0.0.1:26833 sessionTimeout=10000 watcher=org.apache.solr.common.cloud.ConnectionManager@42848dfb
[junit4:junit4]   2> 402 T36 oaz.ClientCnxn$SendThread.startConnect Opening socket connection to server /127.0.0.1:26833
[junit4:junit4]   2> 402 T30 oascc.ConnectionManager.waitForConnected Waiting for client to connect to ZooKeeper
[junit4:junit4]   2> 407 T36 oaz.ClientCnxn$SendThread.primeConnection Socket connection established to localhost/127.0.0.1:26833, initiating session
[junit4:junit4]   2> 408 T32 oazs.NIOServerCnxn$Factory.run Accepted socket connection from /140.211.11.196:12763
[junit4:junit4]   2> 431 T32 oazs.NIOServerCnxn.readConnectRequest Client attempting to establish new session at /140.211.11.196:12763
[junit4:junit4]   2> 448 T34 oazsp.FileTxnLog.append Creating new log file: log.1
[junit4:junit4]   2> 516 T34 oazs.NIOServerCnxn.finishSessionInit Established session 0x139e005369a0000 with negotiated timeout 10000 for client /140.211.11.196:12763
[junit4:junit4]   2> 517 T36 oaz.ClientCnxn$SendThread.readConnectResult Session establishment complete on server localhost/127.0.0.1:26833, sessionid = 0x139e005369a0000, negotiated timeout = 10000
[junit4:junit4]   2> 525 T37 oascc.ConnectionManager.process Watcher org.apache.solr.common.cloud.ConnectionManager@42848dfb name:ZooKeeperConnection Watcher:127.0.0.1:26833 got event WatchedEvent state:SyncConnected type:None path:null path:null type:None
[junit4:junit4]   2> 525 T30 oascc.ConnectionManager.waitForConnected Client is connected to ZooKeeper
[junit4:junit4]   2> 529 T30 oascc.SolrZkClient.makePath makePath: /solr
[junit4:junit4]   2> 640 T35 oazs.PrepRequestProcessor.pRequest Processed session termination for sessionid: 0x139e005369a0000
[junit4:junit4]   2> 641 T37 oaz.ClientCnxn$EventThread.run EventThread shut down
[junit4:junit4]   2> 641 T30 oaz.ZooKeeper.close Session: 0x139e005369a0000 closed
[junit4:junit4]   2> 642 T32 oazs.NIOServerCnxn.closeSock Closed socket connection for client /140.211.11.196:12763 which had sessionid 0x139e005369a0000
[junit4:junit4]   2> 642 T30 oaz.ZooKeeper.<init> Initiating client connection, connectString=127.0.0.1:26833/solr sessionTimeout=10000 watcher=org.apache.solr.common.cloud.ConnectionManager@6b547bae
[junit4:junit4]   2> 643 T38 oaz.ClientCnxn$SendThread.startConnect Opening socket connection to server /127.0.0.1:26833
[junit4:junit4]   2> 643 T30 oascc.ConnectionManager.waitForConnected Waiting for client to connect to ZooKeeper
[junit4:junit4]   2> 645 T38 oaz.ClientCnxn$SendThread.primeConnection Socket connection established to localhost/127.0.0.1:26833, initiating session
[junit4:junit4]   2> 645 T32 oazs.NIOServerCnxn$Factory.run Accepted socket connection from /140.211.11.196:63211
[junit4:junit4]   2> 645 T32 oazs.NIOServerCnxn.readConnectRequest Client attempting to establish new session at /140.211.11.196:63211
[junit4:junit4]   2> 647 T34 oazs.NIOServerCnxn.finishSessionInit Established session 0x139e005369a0001 with negotiated timeout 10000 for client /140.211.11.196:63211
[junit4:junit4]   2> 647 T38 oaz.ClientCnxn$SendThread.readConnectResult Session establishment complete on server localhost/127.0.0.1:26833, sessionid = 0x139e005369a0001, negotiated timeout = 10000
[junit4:junit4]   2> 648 T39 oascc.ConnectionManager.process Watcher org.apache.solr.common.cloud.ConnectionManager@6b547bae name:ZooKeeperConnection Watcher:127.0.0.1:26833/solr got event WatchedEvent state:SyncConnected type:None path:null path:null type:None
[junit4:junit4]   2> 648 T30 oascc.ConnectionManager.waitForConnected Client is connected to ZooKeeper
[junit4:junit4]   2> 657 T30 oascc.SolrZkClient.makePath makePath: /collections/collection1
[junit4:junit4]   2> 662 T30 oascc.SolrZkClient.makePath makePath: /collections/collection1/shards
[junit4:junit4]   2> 666 T30 oascc.SolrZkClient.makePath makePath: /collections/control_collection
[junit4:junit4]   2> 674 T30 oascc.SolrZkClient.makePath makePath: /collections/control_collection/shards
[junit4:junit4]   2> 678 T30 oasc.AbstractZkTestCase.putConfig put /usr/home/hudson/hudson-slave/workspace/Lucene-Solr-Tests-4.x-java7/solr/build/solr-core/test-files/solr/collection1/conf/solrconfig.xml to /configs/conf1/solrconfig.xml
[junit4:junit4]   2> 697 T30 oascc.SolrZkClient.makePath makePath: /configs/conf1/solrconfig.xml
[junit4:junit4]   2> 711 T30 oasc.AbstractZkTestCase.putConfig put /usr/home/hudson/hudson-slave/workspace/Lucene-Solr-Tests-4.x-java7/solr/build/solr-core/test-files/solr/collection1/conf/schema.xml to /configs/conf1/schema.xml
[junit4:junit4]   2> 712 T30 oascc.SolrZkClient.makePath makePath: /configs/conf1/schema.xml
[junit4:junit4]   2> 852 T30 oasc.AbstractZkTestCase.putConfig put /usr/home/hudson/hudson-slave/workspace/Lucene-Solr-Tests-4.x-java7/solr/build/solr-core/test-files/solr/collection1/conf/solrconfig.xml to /configs/conf1/solrconfig.xml
[junit4:junit4]   2> 853 T30 oascc.SolrZkClient.makePath makePath: /configs/conf1/solrconfig.xml
[junit4:junit4]   2> 870 T30 oasc.AbstractZkTestCase.putConfig put /usr/home/hudson/hudson-slave/workspace/Lucene-Solr-Tests-4.x-java7/solr/build/solr-core/test-files/solr/collection1/conf/stopwords.txt to /configs/conf1/stopwords.txt
[junit4:junit4]   2> 871 T30 oascc.SolrZkClient.makePath makePath: /configs/conf1/stopwords.txt
[junit4:junit4]   2> 875 T30 oasc.AbstractZkTestCase.putConfig put /usr/home/hudson/hudson-slave/workspace/Lucene-Solr-Tests-4.x-java7/solr/build/solr-core/test-files/solr/collection1/conf/protwords.txt to /configs/conf1/protwords.txt
[junit4:junit4]   2> 876 T30 oascc.SolrZkClient.makePath makePath: /configs/conf1/protwords.txt
[junit4:junit4]   2> 880 T30 oasc.AbstractZkTestCase.putConfig put /usr/home/hudson/hudson-slave/workspace/Lucene-Solr-Tests-4.x-java7/solr/build/solr-core/test-files/solr/collection1/conf/currency.xml to /configs/conf1/currency.xml
[junit4:junit4]   2> 881 T30 oascc.SolrZkClient.makePath makePath: /configs/conf1/currency.xml
[junit4:junit4]   2> 886 T30 oasc.AbstractZkTestCase.putConfig put /usr/home/hudson/hudson-slave/workspace/Lucene-Solr-Tests-4.x-java7/solr/build/solr-core/test-files/solr/collection1/conf/open-exchange-rates.json to /configs/conf1/open-exchange-rates.json
[junit4:junit4]   2> 886 T30 oascc.SolrZkClient.makePath makePath: /configs/conf1/open-exchange-rates.json
[junit4:junit4]   2> 891 T30 oasc.AbstractZkTestCase.putConfig put /usr/home/hudson/hudson-slave/workspace/Lucene-Solr-Tests-4.x-java7/solr/build/solr-core/test-files/solr/collection1/conf/mapping-ISOLatin1Accent.txt to /configs/conf1/mapping-ISOLatin1Accent.txt
[junit4:junit4]   2> 892 T30 oascc.SolrZkClient.makePath makePath: /configs/conf1/mapping-ISOLatin1Accent.txt
[junit4:junit4]   2> 896 T30 oasc.AbstractZkTestCase.putConfig put /usr/home/hudson/hudson-slave/workspace/Lucene-Solr-Tests-4.x-java7/solr/build/solr-core/test-files/solr/collection1/conf/old_synonyms.txt to /configs/conf1/old_synonyms.txt
[junit4:junit4]   2> 897 T30 oascc.SolrZkClient.makePath makePath: /configs/conf1/old_synonyms.txt
[junit4:junit4]   2> 901 T30 oasc.AbstractZkTestCase.putConfig put /usr/home/hudson/hudson-slave/workspace/Lucene-Solr-Tests-4.x-java7/solr/build/solr-core/test-files/solr/collection1/conf/synonyms.txt to /configs/conf1/synonyms.txt
[junit4:junit4]   2> 902 T30 oascc.SolrZkClient.makePath makePath: /configs/conf1/synonyms.txt
[junit4:junit4]   2> 906 T35 oazs.PrepRequestProcessor.pRequest Processed session termination for sessionid: 0x139e005369a0001
[junit4:junit4]   2> 907 T39 oaz.ClientCnxn$EventThread.run EventThread shut down
[junit4:junit4]   2> 908 T32 oazs.NIOServerCnxn.closeSock Closed socket connection for client /140.211.11.196:63211 which had sessionid 0x139e005369a0001
[junit4:junit4]   2> 907 T30 oaz.ZooKeeper.close Session: 0x139e005369a0001 closed
[junit4:junit4]   2> 1602 T30 oejs.Server.doStart jetty-8.1.2.v20120308
[junit4:junit4]   2> 1885 T30 oejs.AbstractConnector.doStart Started SocketConnector@0.0.0.0:31644
[junit4:junit4]   2> 1917 T30 oasc.SolrResourceLoader.locateSolrHome JNDI not configured for solr (NoInitialContextEx)
[junit4:junit4]   2> 1918 T30 oasc.SolrResourceLoader.locateSolrHome using system property solr.solr.home: /usr/home/hudson/hudson-slave/workspace/Lucene-Solr-Tests-4.x-java7/solr/build/solr-core/test-files/solr
[junit4:junit4]   2> 1919 T30 oasc.SolrResourceLoader.<init> new SolrResourceLoader for deduced Solr Home: '/usr/home/hudson/hudson-slave/workspace/Lucene-Solr-Tests-4.x-java7/solr/build/solr-core/test-files/solr/'
[junit4:junit4]   2> 1955 T30 oass.SolrDispatchFilter.init SolrDispatchFilter.init()
[junit4:junit4]   2> 1956 T30 oasc.SolrResourceLoader.locateSolrHome JNDI not configured for solr (NoInitialContextEx)
[junit4:junit4]   2> 1956 T30 oasc.SolrResourceLoader.locateSolrHome using system property solr.solr.home: /usr/home/hudson/hudson-slave/workspace/Lucene-Solr-Tests-4.x-java7/solr/build/solr-core/test-files/solr
[junit4:junit4]   2> 1957 T30 oasc.CoreContainer$Initializer.initialize looking for solr.xml: /usr/home/hudson/hudson-slave/workspace/Lucene-Solr-Tests-4.x-java7/solr/build/solr-core/test-files/solr/solr.xml
[junit4:junit4]   2> 1957 T30 oasc.CoreContainer.<init> New CoreContainer 832998454
[junit4:junit4]   2> 1958 T30 oasc.CoreContainer.load Loading CoreContainer using Solr Home: '/usr/home/hudson/hudson-slave/workspace/Lucene-Solr-Tests-4.x-java7/solr/build/solr-core/test-files/solr/'
[junit4:junit4]   2> 1959 T30 oasc.SolrResourceLoader.<init> new SolrResourceLoader for directory: '/usr/home/hudson/hudson-slave/workspace/Lucene-Solr-Tests-4.x-java7/solr/build/solr-core/test-files/solr/'
[junit4:junit4]   2> 1998 T30 oasc.CoreContainer.load Registering Log Listener
[junit4:junit4]   2> 2012 T30 oasc.CoreContainer.initZooKeeper Zookeeper client=127.0.0.1:26833/solr
[junit4:junit4]   2> 2037 T30 oaz.ZooKeeper.<init> Initiating client connection, connectString=127.0.0.1:26833/solr sessionTimeout=5000 watcher=org.apache.solr.common.cloud.ConnectionManager@283dfc56
[junit4:junit4]   2> 2038 T50 oaz.ClientCnxn$SendThread.startConnect Opening socket connection to server /127.0.0.1:26833
[junit4:junit4]   2> 2038 T30 oascc.ConnectionManager.waitForConnected Waiting for client to connect to ZooKeeper
[junit4:junit4]   2> 2040 T50 oaz.ClientCnxn$SendThread.primeConnection Socket connection established to localhost/127.0.0.1:26833, initiating session
[junit4:junit4]   2> 2040 T32 oazs.NIOServerCnxn$Factory.run Accepted socket connection from /140.211.11.196:13954
[junit4:junit4]   2> 2041 T32 oazs.NIOServerCnxn.readConnectRequest Client attempting to establish new session at /140.211.11.196:13954
[junit4:junit4]   2> 2043 T34 oazs.NIOServerCnxn.finishSessionInit Established session 0x139e005369a0002 with negotiated timeout 5000 for client /140.211.11.196:13954
[junit4:junit4]   2> 2043 T50 oaz.ClientCnxn$SendThread.readConnectResult Session establishment complete on server localhost/127.0.0.1:26833, sessionid = 0x139e005369a0002, negotiated timeout = 5000
[junit4:junit4]   2> 2043 T51 oascc.ConnectionManager.process Watcher org.apache.solr.common.cloud.ConnectionManager@283dfc56 name:ZooKeeperConnection Watcher:127.0.0.1:26833/solr got event WatchedEvent state:SyncConnected type:None path:null path:null type:None
[junit4:junit4]   2> 2043 T30 oascc.ConnectionManager.waitForConnected Client is connected to ZooKeeper
[junit4:junit4]   2> 2060 T35 oazs.PrepRequestProcessor.pRequest Got user-level KeeperException when processing sessionid:0x139e005369a0002 type:create cxid:0x2 zxid:0xfffffffffffffffe txntype:unknown reqpath:n/a Error Path:/solr/overseer Error:KeeperErrorCode = NodeExists for /solr/overseer
[junit4:junit4]   2> 2069 T30 oascc.SolrZkClient.makePath makePath: /live_nodes
[junit4:junit4]   2> 2071 T30 oasc.ZkController.createEphemeralLiveNode Register node as live in ZooKeeper:/live_nodes/127.0.0.1:31644_solr
[junit4:junit4]   2> 2076 T35 oazs.PrepRequestProcessor.pRequest Got user-level KeeperException when processing sessionid:0x139e005369a0002 type:delete cxid:0x7 zxid:0xfffffffffffffffe txntype:unknown reqpath:n/a Error Path:/solr/live_nodes/127.0.0.1:31644_solr Error:KeeperErrorCode = NoNode for /solr/live_nodes/127.0.0.1:31644_solr
[junit4:junit4]   2> 2077 T30 oascc.SolrZkClient.makePath makePath: /live_nodes/127.0.0.1:31644_solr
[junit4:junit4]   2> 2081 T30 oashc.HttpShardHandlerFactory.getParameter Setting socketTimeout to: 0
[junit4:junit4]   2> 2082 T30 oashc.HttpShardHandlerFactory.getParameter Setting urlScheme to: http://
[junit4:junit4]   2> 2082 T30 oashc.HttpShardHandlerFactory.getParameter Setting connTimeout to: 0
[junit4:junit4]   2> 2083 T30 oashc.HttpShardHandlerFactory.getParameter Setting maxConnectionsPerHost to: 20
[junit4:junit4]   2> 2083 T30 oashc.HttpShardHandlerFactory.getParameter Setting corePoolSize to: 0
[junit4:junit4]   2> 2083 T30 oashc.HttpShardHandlerFactory.getParameter Setting maximumPoolSize to: 2147483647
[junit4:junit4]   2> 2084 T30 oashc.HttpShardHandlerFactory.getParameter Setting maxThreadIdleTime to: 5
[junit4:junit4]   2> 2084 T30 oashc.HttpShardHandlerFactory.getParameter Setting sizeOfQueue to: -1
[junit4:junit4]   2> 2085 T30 oashc.HttpShardHandlerFactory.getParameter Setting fairnessPolicy to: false
[junit4:junit4]   2> 2085 T30 oascsi.HttpClientUtil.createClient Creating new http client, config:maxConnectionsPerHost=20&maxConnections=10000&socketTimeout=0&connTimeout=0&retry=false
[junit4:junit4]   2> 2099 T30 oascc.SolrZkClient.makePath makePath: /overseer_elect/election
[junit4:junit4]   2> 2117 T35 oazs.PrepRequestProcessor.pRequest Got user-level KeeperException when processing sessionid:0x139e005369a0002 type:delete cxid:0x15 zxid:0xfffffffffffffffe txntype:unknown reqpath:n/a Error Path:/solr/overseer_elect/leader Error:KeeperErrorCode = NoNode for /solr/overseer_elect/leader
[junit4:junit4]   2> 2119 T30 oascc.SolrZkClient.makePath makePath: /overseer_elect/leader
[junit4:junit4]   2> 2122 T30 oasc.Overseer.start Overseer (id=88347980705955842-127.0.0.1:31644_solr-n_0000000000) starting
[junit4:junit4]   2> 2123 T35 oazs.PrepRequestProcessor.pRequest Got user-level KeeperException when processing sessionid:0x139e005369a0002 type:create cxid:0x1a zxid:0xfffffffffffffffe txntype:unknown reqpath:n/a Error Path:/solr/overseer Error:KeeperErrorCode = NodeExists for /solr/overseer
[junit4:junit4]   2> 2140 T35 oazs.PrepRequestProcessor.pRequest Got user-level KeeperException when processing sessionid:0x139e005369a0002 type:create cxid:0x1b zxid:0xfffffffffffffffe txntype:unknown reqpath:n/a Error Path:/solr/overseer Error:KeeperErrorCode = NodeExists for /solr/overseer
[junit4:junit4]   2> 2142 T35 oazs.PrepRequestProcessor.pRequest Got user-level KeeperException when processing sessionid:0x139e005369a0002 type:create cxid:0x1c zxid:0xfffffffffffffffe txntype:unknown reqpath:n/a Error Path:/solr/overseer Error:KeeperErrorCode = NodeExists for /solr/overseer
[junit4:junit4]   2> 2153 T35 oazs.PrepRequestProcessor.pRequest Got user-level KeeperException when processing sessionid:0x139e005369a0002 type:create cxid:0x1d zxid:0xfffffffffffffffe txntype:unknown reqpath:n/a Error Path:/solr/overseer Error:KeeperErrorCode = NodeExists for /solr/overseer
[junit4:junit4]   2> 2154 T53 oasc.OverseerCollectionProcessor.run Process current queue of collection creations
[junit4:junit4]   2> 2157 T30 oascc.SolrZkClient.makePath makePath: /clusterstate.json
[junit4:junit4]   2> 2160 T30 oascc.ZkStateReader.createClusterStateWatchersAndUpdate Updating cluster state from ZooKeeper... 
[junit4:junit4]   2> 2181 T52 oasc.Overseer$ClusterStateUpdater.run Starting to work on the main queue
[junit4:junit4]   2> 2217 T30 oasc.CoreContainer.create Creating SolrCore 'collection1' using instanceDir: /usr/home/hudson/hudson-slave/workspace/Lucene-Solr-Tests-4.x-java7/solr/build/solr-core/test-files/solr/collection1
[junit4:junit4]   2> 2217 T30 oasc.ZkController.createCollectionZkNode Check for collection zkNode:control_collection
[junit4:junit4]   2> 2219 T30 oasc.ZkController.createCollectionZkNode Collection zkNode exists
[junit4:junit4]   2> 2219 T30 oasc.ZkController.readConfigName Load collection config from:/collections/control_collection
[junit4:junit4]   2> 2221 T30 oasc.SolrResourceLoader.<init> new SolrResourceLoader for directory: '/usr/home/hudson/hudson-slave/workspace/Lucene-Solr-Tests-4.x-java7/solr/build/solr-core/test-files/solr/collection1/'
[junit4:junit4]   2> 2223 T30 oasc.SolrResourceLoader.replaceClassLoader Adding 'file:/usr/home/hudson/hudson-slave/workspace/Lucene-Solr-Tests-4.x-java7/solr/build/solr-core/test-files/solr/collection1/lib/README' to classloader
[junit4:junit4]   2> 2223 T30 oasc.SolrResourceLoader.replaceClassLoader Adding 'file:/usr/home/hudson/hudson-slave/workspace/Lucene-Solr-Tests-4.x-java7/solr/build/solr-core/test-files/solr/collection1/lib/classes/' to classloader
[junit4:junit4]   2> 2302 T30 oasc.SolrConfig.<init> Using Lucene MatchVersion: LUCENE_40
[junit4:junit4]   2> 2359 T30 oasc.SolrConfig.<init> Loaded SolrConfig: solrconfig.xml
[junit4:junit4]   2> 2460 T30 oass.IndexSchema.readSchema Reading Solr Schema
[junit4:junit4]   2> 2472 T30 oass.IndexSchema.readSchema Schema name=test
[junit4:junit4]   2> 3047 T30 oass.OpenExchangeRatesOrgProvider.init Initialized with rates=open-exchange-rates.json, refreshInterval=1440.
[junit4:junit4]   2> 3059 T30 oass.IndexSchema.readSchema default search field in schema is text
[junit4:junit4]   2> 3062 T30 oass.IndexSchema.readSchema unique key field: id
[junit4:junit4]   2> 3085 T30 oass.FileExchangeRateProvider.reload Reloading exchange rates from file currency.xml
[junit4:junit4]   2> 3091 T30 oass.FileExchangeRateProvider.reload Reloading exchange rates from file currency.xml
[junit4:junit4]   2> 3096 T30 oass.OpenExchangeRatesOrgProvider.reload Reloading exchange rates from open-exchange-rates.json
[junit4:junit4]   2> 3100 T30 oass.OpenExchangeRatesOrgProvider.reload Reloading exchange rates from open-exchange-rates.json
[junit4:junit4]   2> 3104 T30 oasc.SolrCore.<init> [collection1] Opening new SolrCore at /usr/home/hudson/hudson-slave/workspace/Lucene-Solr-Tests-4.x-java7/solr/build/solr-core/test-files/solr/collection1/, dataDir=./org.apache.solr.cloud.SyncSliceTest-1348083201432/control/data/
[junit4:junit4]   2> 3104 T30 oasc.JmxMonitoredMap.<init> JMX monitoring is enabled. Adding Solr mbeans to JMX Server: com.sun.jmx.mbeanserver.JmxMBeanServer@334b4cb
[junit4:junit4]   2> 3129 T30 oasc.SolrCore.getNewIndexDir WARNING New index directory detected: old=null new=./org.apache.solr.cloud.SyncSliceTest-1348083201432/control/data/index/
[junit4:junit4]   2> 3131 T30 oasc.SolrCore.initIndex WARNING [collection1] Solr index directory './org.apache.solr.cloud.SyncSliceTest-1348083201432/control/data/index' doesn't exist. Creating new index...
[junit4:junit4]   2> 3132 T30 oasc.CachingDirectoryFactory.get return new directory for /usr/home/hudson/hudson-slave/workspace/Lucene-Solr-Tests-4.x-java7/solr/build/solr-core/test/J1/./org.apache.solr.cloud.SyncSliceTest-1348083201432/control/data/index forceNew:false
[junit4:junit4]   2> 3151 T30 oasc.SolrDeletionPolicy.onCommit SolrDeletionPolicy.onCommit: commits:num=1
[junit4:junit4]   2> 		commit{dir=NRTCachingDirectory(org.apache.lucene.store.NIOFSDirectory@/usr/home/hudson/hudson-slave/workspace/Lucene-Solr-Tests-4.x-java7/solr/build/solr-core/test/J1/org.apache.solr.cloud.SyncSliceTest-1348083201432/control/data/index lockFactory=org.apache.lucene.store.NativeFSLockFactory@3ec7195b; maxCacheMB=48.0 maxMergeSizeMB=4.0),segFN=segments_1,generation=1,filenames=[segments_1]
[junit4:junit4]   2> 3152 T30 oasc.SolrDeletionPolicy.updateCommits newest commit = 1
[junit4:junit4]   2> 3153 T30 oasc.SolrCore.initWriters created xml: solr.XMLResponseWriter
[junit4:junit4]   2> 3156 T30 oasup.UpdateRequestProcessorChain.init inserting DistributedUpdateProcessorFactory into updateRequestProcessorChain "dedupe"
[junit4:junit4]   2> 3156 T30 oasup.UpdateRequestProcessorChain.init inserting DistributedUpdateProcessorFactory into updateRequestProcessorChain "dedupe-allfields"
[junit4:junit4]   2> 3157 T30 oasup.UpdateRequestProcessorChain.init inserting DistributedUpdateProcessorFactory into updateRequestProcessorChain "stored_sig"
[junit4:junit4]   2> 3157 T30 oasup.UpdateRequestProcessorChain.init inserting DistributedUpdateProcessorFactory into updateRequestProcessorChain "uniq-fields"
[junit4:junit4]   2> 3158 T30 oasup.UpdateRequestProcessorChain.init inserting DistributedUpdateProcessorFactory into updateRequestProcessorChain "distrib-dup-test-chain-implicit"
[junit4:junit4]   2> 3159 T30 oasc.RequestHandlers.initHandlersFromConfig adding lazy requestHandler: solr.ReplicationHandler
[junit4:junit4]   2> 3160 T30 oasc.RequestHandlers.initHandlersFromConfig created /replication: solr.ReplicationHandler
[junit4:junit4]   2> 3160 T30 oasc.RequestHandlers.initHandlersFromConfig created standard: solr.StandardRequestHandler
[junit4:junit4]   2> 3161 T30 oasc.RequestHandlers.initHandlersFromConfig created /get: solr.RealTimeGetHandler
[junit4:junit4]   2> 3162 T30 oasc.RequestHandlers.initHandlersFromConfig created dismax: solr.SearchHandler
[junit4:junit4]   2> 3163 T30 oasc.RequestHandlers.initHandlersFromConfig created mock: org.apache.solr.core.MockQuerySenderListenerReqHandler
[junit4:junit4]   2> 3163 T30 oasc.RequestHandlers.initHandlersFromConfig created /admin/: org.apache.solr.handler.admin.AdminHandlers
[junit4:junit4]   2> 3164 T30 oasc.RequestHandlers.initHandlersFromConfig created defaults: solr.StandardRequestHandler
[junit4:junit4]   2> 3164 T30 oasc.RequestHandlers.initHandlersFromConfig adding lazy requestHandler: solr.StandardRequestHandler
[junit4:junit4]   2> 3165 T30 oasc.RequestHandlers.initHandlersFromConfig created lazy: solr.StandardRequestHandler
[junit4:junit4]   2> 3166 T30 oasc.RequestHandlers.initHandlersFromConfig created /update: solr.UpdateRequestHandler
[junit4:junit4]   2> 3166 T30 oasc.RequestHandlers.initHandlersFromConfig created /terms: org.apache.solr.handler.component.SearchHandler
[junit4:junit4]   2> 3167 T30 oasc.RequestHandlers.initHandlersFromConfig created spellCheckCompRH: org.apache.solr.handler.component.SearchHandler
[junit4:junit4]   2> 3168 T30 oasc.RequestHandlers.initHandlersFromConfig created spellCheckCompRH_Direct: org.apache.solr.handler.component.SearchHandler
[junit4:junit4]   2> 3169 T30 oasc.RequestHandlers.initHandlersFromConfig created spellCheckWithWordbreak: org.apache.solr.handler.component.SearchHandler
[junit4:junit4]   2> 3169 T30 oasc.RequestHandlers.initHandlersFromConfig created spellCheckWithWordbreak_Direct: org.apache.solr.handler.component.SearchHandler
[junit4:junit4]   2> 3170 T30 oasc.RequestHandlers.initHandlersFromConfig created spellCheckCompRH1: org.apache.solr.handler.component.SearchHandler
[junit4:junit4]   2> 3171 T30 oasc.RequestHandlers.initHandlersFromConfig created tvrh: org.apache.solr.handler.component.SearchHandler
[junit4:junit4]   2> 3171 T30 oasc.RequestHandlers.initHandlersFromConfig created /mlt: solr.MoreLikeThisHandler
[junit4:junit4]   2> 3172 T30 oasc.RequestHandlers.initHandlersFromConfig created /debug/dump: solr.DumpRequestHandler
[junit4:junit4]   2> 3175 T30 oashl.XMLLoader.init xsltCacheLifetimeSeconds=60
[junit4:junit4]   2> 3179 T30 oasc.SolrCore.initDeprecatedSupport WARNING solrconfig.xml uses deprecated <admin/gettableFiles>, Please update your config to use the ShowFileRequestHandler.
[junit4:junit4]   2> 3181 T30 oasc.SolrCore.initDeprecatedSupport WARNING adding ShowFileRequestHandler with hidden files: [SCHEMA.XML, OLD_SYNONYMS.TXT, STOPWORDS.TXT, PROTWORDS.TXT, OPEN-EXCHANGE-RATES.JSON, SYNONYMS.TXT, CURRENCY.XML, MAPPING-ISOLATIN1ACCENT.TXT]
[junit4:junit4]   2> 3184 T30 oass.SolrIndexSearcher.<init> Opening Searcher@2cb6e1d main
[junit4:junit4]   2> 3186 T30 oasu.CommitTracker.<init> Hard AutoCommit: disabled
[junit4:junit4]   2> 3186 T30 oasu.CommitTracker.<init> Soft AutoCommit: disabled
[junit4:junit4]   2> 3187 T30 oashc.SpellCheckComponent.inform Initializing spell checkers
[junit4:junit4]   2> 3193 T30 oass.DirectSolrSpellChecker.init init: {name=direct,classname=DirectSolrSpellChecker,field=lowerfilt,minQueryLength=3}
[junit4:junit4]   2> 3255 T54 oasc.SolrCore.registerSearcher [collection1] Registered new searcher Searcher@2cb6e1d main{StandardDirectoryReader(segments_1:1)}
[junit4:junit4]   2> 3262 T35 oazs.PrepRequestProcessor.pRequest Got user-level KeeperException when processing sessionid:0x139e005369a0002 type:create cxid:0x56 zxid:0xfffffffffffffffe txntype:unknown reqpath:n/a Error Path:/solr/overseer/queue Error:KeeperErrorCode = NoNode for /solr/overseer/queue
[junit4:junit4]   2> 3279 T30 oasc.CoreContainer.register registering core: collection1
[junit4:junit4]   2> 3280 T30 oasc.ZkController.register Register shard - core:collection1 address:http://127.0.0.1:31644/solr shardId:control_shard
[junit4:junit4]   2> 3292 T30 oascsi.HttpClientUtil.createClient Creating new http client, config:maxConnections=10000&maxConnectionsPerHost=20&connTimeout=30000&socketTimeout=30000&retry=false
[junit4:junit4]   2> 3305 T30 oascc.SolrZkClient.makePath makePath: /collections/control_collection/leader_elect/control_shard/election
[junit4:junit4]   2> 3321 T35 oazs.PrepRequestProcessor.pRequest Got user-level KeeperException when processing sessionid:0x139e005369a0002 type:delete cxid:0x65 zxid:0xfffffffffffffffe txntype:unknown reqpath:n/a Error Path:/solr/collections/control_collection/leaders Error:KeeperErrorCode = NoNode for /solr/collections/control_collection/leaders
[junit4:junit4]   2> 3322 T30 oasc.ShardLeaderElectionContext.runLeaderProcess Running the leader process.
[junit4:junit4]   2> 3323 T35 oazs.PrepRequestProcessor.pRequest Got user-level KeeperException when processing sessionid:0x139e005369a0002 type:create cxid:0x66 zxid:0xfffffffffffffffe txntype:unknown reqpath:n/a Error Path:/solr/overseer Error:KeeperErrorCode = NodeExists for /solr/overseer
[junit4:junit4]   2> 3691 T52 oascc.ZkStateReader.updateClusterState Updating cloud state from ZooKeeper... 
[junit4:junit4]   2> 3704 T35 oazs.PrepRequestProcessor.pRequest Got user-level KeeperException when processing sessionid:0x139e005369a0002 type:create cxid:0x6d zxid:0xfffffffffffffffe txntype:unknown reqpath:n/a Error Path:/solr/overseer/queue-work Error:KeeperErrorCode = NoNode for /solr/overseer/queue-work
[junit4:junit4]   2> 3758 T51 oascc.ZkStateReader$2.process A cluster state change has occurred - updating...
[junit4:junit4]   2> 3827 T30 oasc.ShardLeaderElectionContext.waitForReplicasToComeUp Enough replicas found to continue.
[junit4:junit4]   2> 3827 T30 oasc.ShardLeaderElectionContext.runLeaderProcess I may be the new leader - try and sync
[junit4:junit4]   2> 3828 T30 oasc.SyncStrategy.sync Sync replicas to http://127.0.0.1:31644/solr/collection1/
[junit4:junit4]   2> 3829 T30 oasc.SyncStrategy.syncReplicas Sync Success - now sync replicas to me
[junit4:junit4]   2> 3830 T30 oasc.SyncStrategy.syncToMe http://127.0.0.1:31644/solr/collection1/ has no replicas
[junit4:junit4]   2> 3830 T30 oasc.ShardLeaderElectionContext.runLeaderProcess I am the new leader: http://127.0.0.1:31644/solr/collection1/
[junit4:junit4]   2> 3831 T30 oascc.SolrZkClient.makePath makePath: /collections/control_collection/leaders/control_shard
[junit4:junit4]   2> 3842 T35 oazs.PrepRequestProcessor.pRequest Got user-level KeeperException when processing sessionid:0x139e005369a0002 type:create cxid:0x8b zxid:0xfffffffffffffffe txntype:unknown reqpath:n/a Error Path:/solr/overseer Error:KeeperErrorCode = NodeExists for /solr/overseer
[junit4:junit4]   2> 4270 T52 oascc.ZkStateReader.updateClusterState Updating cloud state from ZooKeeper... 
[junit4:junit4]   2> 4311 T51 oascc.ZkStateReader$2.process A cluster state change has occurred - updating...
[junit4:junit4]   2> 4361 T30 oasc.ZkController.register We are http://127.0.0.1:31644/solr/collection1/ and leader is http://127.0.0.1:31644/solr/collection1/
[junit4:junit4]   2> 4361 T30 oasc.ZkController.register No LogReplay needed for core=collection1 baseURL=http://127.0.0.1:31644/solr
[junit4:junit4]   2> 4362 T30 oasc.ZkController.checkRecovery I am the leader, no recovery necessary
[junit4:junit4]   2> 4365 T30 oascc.ZkStateReader.updateClusterState Updating cloud state from ZooKeeper... 
[junit4:junit4]   2> 4367 T30 oass.SolrDispatchFilter.init user.dir=/usr/home/hudson/hudson-slave/workspace/Lucene-Solr-Tests-4.x-java7/solr/build/solr-core/test/J1
[junit4:junit4]   2> 4367 T30 oass.SolrDispatchFilter.init SolrDispatchFilter.init() done
[junit4:junit4]   2> 4449 T30 oascsi.HttpClientUtil.createClient Creating new http client, config:maxConnections=128&maxConnectionsPerHost=32&followRedirects=false
[junit4:junit4]   2> 4674 T30 oejs.Server.doStart jetty-8.1.2.v20120308
[junit4:junit4]   2> 4677 T30 oejs.AbstractConnector.doStart Started SocketConnector@0.0.0.0:42619
[junit4:junit4]   2> 4678 T30 oasc.SolrResourceLoader.locateSolrHome JNDI not configured for solr (NoInitialContextEx)
[junit4:junit4]   2> 4679 T30 oasc.SolrResourceLoader.locateSolrHome using system property solr.solr.home: /usr/home/hudson/hudson-slave/workspace/Lucene-Solr-Tests-4.x-java7/solr/build/solr-core/test/J1/./solrtest-jetty1-1348083205901
[junit4:junit4]   2> 4679 T30 oasc.SolrResourceLoader.<init> new SolrResourceLoader for deduced Solr Home: '/usr/home/hudson/hudson-slave/workspace/Lucene-Solr-Tests-4.x-java7/solr/build/solr-core/test/J1/./solrtest-jetty1-1348083205901/'
[junit4:junit4]   2> 4740 T30 oass.SolrDispatchFilter.init SolrDispatchFilter.init()
[junit4:junit4]   2> 4741 T30 oasc.SolrResourceLoader.locateSolrHome JNDI not configured for solr (NoInitialContextEx)
[junit4:junit4]   2> 4741 T30 oasc.SolrResourceLoader.locateSolrHome using system property solr.solr.home: /usr/home/hudson/hudson-slave/workspace/Lucene-Solr-Tests-4.x-java7/solr/build/solr-core/test/J1/./solrtest-jetty1-1348083205901
[junit4:junit4]   2> 4742 T30 oasc.CoreContainer$Initializer.initialize looking for solr.xml: /usr/home/hudson/hudson-slave/workspace/Lucene-Solr-Tests-4.x-java7/solr/build/solr-core/test/J1/./solrtest-jetty1-1348083205901/solr.xml
[junit4:junit4]   2> 4742 T30 oasc.CoreContainer.<init> New CoreContainer 1079031704
[junit4:junit4]   2> 4743 T30 oasc.CoreContainer.load Loading CoreContainer using Solr Home: '/usr/home/hudson/hudson-slave/workspace/Lucene-Solr-Tests-4.x-java7/solr/build/solr-core/test/J1/./solrtest-jetty1-1348083205901/'
[junit4:junit4]   2> 4744 T30 oasc.SolrResourceLoader.<init> new SolrResourceLoader for directory: '/usr/home/hudson/hudson-slave/workspace/Lucene-Solr-Tests-4.x-java7/solr/build/solr-core/test/J1/./solrtest-jetty1-1348083205901/'
[junit4:junit4]   2> 4788 T30 oasc.CoreContainer.load Registering Log Listener
[junit4:junit4]   2> 4808 T30 oasc.CoreContainer.initZooKeeper Zookeeper client=127.0.0.1:26833/solr
[junit4:junit4]   2> 4809 T30 oaz.ZooKeeper.<init> Initiating client connection, connectString=127.0.0.1:26833/solr sessionTimeout=5000 watcher=org.apache.solr.common.cloud.ConnectionManager@1c9df04e
[junit4:junit4]   2> 4811 T64 oaz.ClientCnxn$SendThread.startConnect Opening socket connection to server /127.0.0.1:26833
[junit4:junit4]   2> 4811 T30 oascc.ConnectionManager.waitForConnected Waiting for client to connect to ZooKeeper
[junit4:junit4]   2> 4812 T64 oaz.ClientCnxn$SendThread.primeConnection Socket connection established to localhost/127.0.0.1:26833, initiating session
[junit4:junit4]   2> 4812 T32 oazs.NIOServerCnxn$Factory.run Accepted socket connection from /140.211.11.196:42568
[junit4:junit4]   2> 4813 T32 oazs.NIOServerCnxn.readConnectRequest Client attempting to establish new session at /140.211.11.196:42568
[junit4:junit4]   2> 4815 T34 oazs.NIOServerCnxn.finishSessionInit Established session 0x139e005369a0003 with negotiated timeout 5000 for client /140.211.11.196:42568
[junit4:junit4]   2> 4815 T64 oaz.ClientCnxn$SendThread.readConnectResult Session establishment complete on server localhost/127.0.0.1:26833, sessionid = 0x139e005369a0003, negotiated timeout = 5000
[junit4:junit4]   2> 4815 T65 oascc.ConnectionManager.process Watcher org.apache.solr.common.cloud.ConnectionManager@1c9df04e name:ZooKeeperConnection Watcher:127.0.0.1:26833/solr got event WatchedEvent state:SyncConnected type:None path:null path:null type:None
[junit4:junit4]   2> 4816 T30 oascc.ConnectionManager.waitForConnected Client is connected to ZooKeeper
[junit4:junit4]   2> 4817 T35 oazs.PrepRequestProcessor.pRequest Got user-level KeeperException when processing sessionid:0x139e005369a0003 type:create cxid:0x1 zxid:0xfffffffffffffffe txntype:unknown reqpath:n/a Error Path:/solr/overseer Error:KeeperErrorCode = NodeExists for /solr/overseer
[junit4:junit4]   2> 4818 T52 oascc.ZkStateReader.updateClusterState Updating cloud state from ZooKeeper... 
[junit4:junit4]   2> 4819 T35 oazs.PrepRequestProcessor.pRequest Got user-level KeeperException when processing sessionid:0x139e005369a0003 type:create cxid:0x2 zxid:0xfffffffffffffffe txntype:unknown reqpath:n/a Error Path:/solr/overseer Error:KeeperErrorCode = NodeExists for /solr/overseer
[junit4:junit4]   2> 4826 T30 oasc.ZkController.createEphemeralLiveNode Register node as live in ZooKeeper:/live_nodes/127.0.0.1:42619_solr
[junit4:junit4]   2> 4827 T35 oazs.PrepRequestProcessor.pRequest Got user-level KeeperException when processing sessionid:0x139e005369a0003 type:delete cxid:0x4 zxid:0xfffffffffffffffe txntype:unknown reqpath:n/a Error Path:/solr/live_nodes/127.0.0.1:42619_solr Error:KeeperErrorCode = NoNode for /solr/live_nodes/127.0.0.1:42619_solr
[junit4:junit4]   2> 4834 T30 oascc.SolrZkClient.makePath makePath: /live_nodes/127.0.0.1:42619_solr
[junit4:junit4]   2> 4838 T51 oascc.ZkStateReader$3.process Updating live nodes
[junit4:junit4]   2> 4847 T30 oashc.HttpShardHandlerFactory.getParameter Setting socketTimeout to: 0
[junit4:junit4]   2> 4848 T30 oashc.HttpShardHandlerFactory.getParameter Setting urlScheme to: http://
[junit4:junit4]   2> 4849 T30 oashc.HttpShardHandlerFactory.getParameter Setting connTimeout to: 0
[junit4:junit4]   2> 4849 T30 oashc.HttpShardHandlerFactory.getParameter Setting maxConnectionsPerHost to: 20
[junit4:junit4]   2> 4850 T30 oashc.HttpShardHandlerFactory.getParameter Setting corePoolSize to: 0
[junit4:junit4]   2> 4850 T51 oascc.ZkStateReader$2.process A cluster state change has occurred - updating...
[junit4:junit4]   2> 4850 T30 oashc.HttpShardHandlerFactory.getParameter Setting maximumPoolSize to: 2147483647
[junit4:junit4]   2> 4851 T30 oashc.HttpShardHandlerFactory.getParameter Setting maxThreadIdleTime to: 5
[junit4:junit4]   2> 4852 T30 oashc.HttpShardHandlerFactory.getParameter Setting sizeOfQueue to: -1
[junit4:junit4]   2> 4852 T30 oashc.HttpShardHandlerFactory.getParameter Setting fairnessPolicy to: false
[junit4:junit4]   2> 4853 T30 oascsi.HttpClientUtil.createClient Creating new http client, config:maxConnectionsPerHost=20&maxConnections=10000&socketTimeout=0&connTimeout=0&retry=false
[junit4:junit4]   2> 4883 T30 oascc.ZkStateReader.createClusterStateWatchersAndUpdate Updating cluster state from ZooKeeper... 
[junit4:junit4]   2> 4892 T30 oasc.CoreContainer.create Creating SolrCore 'collection1' using instanceDir: /usr/home/hudson/hudson-slave/workspace/Lucene-Solr-Tests-4.x-java7/solr/build/solr-core/test/J1/./solrtest-jetty1-1348083205901/collection1
[junit4:junit4]   2> 4892 T30 oasc.ZkController.createCollectionZkNode Check for collection zkNode:collection1
[junit4:junit4]   2> 4893 T30 oasc.ZkController.createCollectionZkNode Collection zkNode exists
[junit4:junit4]   2> 4894 T30 oasc.ZkController.readConfigName Load collection config from:/collections/collection1
[junit4:junit4]   2> 4896 T30 oasc.SolrResourceLoader.<init> new SolrResourceLoader for directory: '/usr/home/hudson/hudson-slave/workspace/Lucene-Solr-Tests-4.x-java7/solr/build/solr-core/test/J1/./solrtest-jetty1-1348083205901/collection1/'
[junit4:junit4]   2> 4898 T30 oasc.SolrResourceLoader.replaceClassLoader Adding 'file:/usr/home/hudson/hudson-slave/workspace/Lucene-Solr-Tests-4.x-java7/solr/build/solr-core/test/J1/solrtest-jetty1-1348083205901/collection1/lib/README' to classloader
[junit4:junit4]   2> 4899 T30 oasc.SolrResourceLoader.replaceClassLoader Adding 'file:/usr/home/hudson/hudson-slave/workspace/Lucene-Solr-Tests-4.x-java7/solr/build/solr-core/test/J1/solrtest-jetty1-1348083205901/collection1/lib/classes/' to classloader
[junit4:junit4]   2> 4966 T30 oasc.SolrConfig.<init> Using Lucene MatchVersion: LUCENE_40
[junit4:junit4]   2> 5054 T30 oasc.SolrConfig.<init> Loaded SolrConfig: solrconfig.xml
[junit4:junit4]   2> 5156 T30 oass.IndexSchema.readSchema Reading Solr Schema
[junit4:junit4]   2> 5169 T30 oass.IndexSchema.readSchema Schema name=test
[junit4:junit4]   2> 5861 T30 oass.OpenExchangeRatesOrgProvider.init Initialized with rates=open-exchange-rates.json, refreshInterval=1440.
[junit4:junit4]   2> 5873 T30 oass.IndexSchema.readSchema default search field in schema is text
[junit4:junit4]   2> 5877 T30 oass.IndexSchema.readSchema unique key field: id
[junit4:junit4]   2> 5896 T30 oass.FileExchangeRateProvider.reload Reloading exchange rates from file currency.xml
[junit4:junit4]   2> 5901 T30 oass.FileExchangeRateProvider.reload Reloading exchange rates from file currency.xml
[junit4:junit4]   2> 5906 T30 oass.OpenExchangeRatesOrgProvider.reload Reloading exchange rates from open-exchange-rates.json
[junit4:junit4]   2> 5908 T30 oass.OpenExchangeRatesOrgProvider.reload Reloading exchange rates from open-exchange-rates.json
[junit4:junit4]   2> 5911 T30 oasc.SolrCore.<init> [collection1] Opening new SolrCore at /usr/home/hudson/hudson-slave/workspace/Lucene-Solr-Tests-4.x-java7/solr/build/solr-core/test/J1/./solrtest-jetty1-1348083205901/collection1/, dataDir=./org.apache.solr.cloud.SyncSliceTest-1348083201432/jetty1/
[junit4:junit4]   2> 5911 T30 oasc.JmxMonitoredMap.<init> JMX monitoring is enabled. Adding Solr mbeans to JMX Server: com.sun.jmx.mbeanserver.JmxMBeanServer@334b4cb
[junit4:junit4]   2> 5913 T30 oasc.SolrCore.getNewIndexDir WARNING New index directory detected: old=null new=./org.apache.solr.cloud.SyncSliceTest-1348083201432/jetty1/index/
[junit4:junit4]   2> 5913 T30 oasc.SolrCore.initIndex WARNING [collection1] Solr index directory './org.apache.solr.cloud.SyncSliceTest-1348083201432/jetty1/index' doesn't exist. Creating new index...
[junit4:junit4]   2> 5914 T30 oasc.CachingDirectoryFactory.get return new directory for /usr/home/hudson/hudson-slave/workspace/Lucene-Solr-Tests-4.x-java7/solr/build/solr-core/test/J1/./org.apache.solr.cloud.SyncSliceTest-1348083201432/jetty1/index forceNew:false
[junit4:junit4]   2> 5920 T30 oasc.SolrDeletionPolicy.onCommit SolrDeletionPolicy.onCommit: commits:num=1
[junit4:junit4]   2> 		commit{dir=NRTCachingDirectory(org.apache.lucene.store.NIOFSDirectory@/usr/home/hudson/hudson-slave/workspace/Lucene-Solr-Tests-4.x-java7/solr/build/solr-core/test/J1/org.apache.solr.cloud.SyncSliceTest-1348083201432/jetty1/index lockFactory=org.apache.lucene.store.NativeFSLockFactory@517b4650; maxCacheMB=48.0 maxMergeSizeMB=4.0),segFN=segments_1,generation=1,filenames=[segments_1]
[junit4:junit4]   2> 5920 T30 oasc.SolrDeletionPolicy.updateCommits newest commit = 1
[junit4:junit4]   2> 5921 T30 oasc.SolrCore.initWriters created xml: solr.XMLResponseWriter
[junit4:junit4]   2> 5924 T30 oasup.UpdateRequestProcessorChain.init inserting DistributedUpdateProcessorFactory into updateRequestProcessorChain "dedupe"
[junit4:junit4]   2> 5925 T30 oasup.UpdateRequestProcessorChain.init inserting DistributedUpdateProcessorFactory into updateRequestProcessorChain "dedupe-allfields"
[junit4:junit4]   2> 5925 T30 oasup.UpdateRequestProcessorChain.init inserting DistributedUpdateProcessorFactory into updateRequestProcessorChain "stored_sig"
[junit4:junit4]   2> 5926 T30 oasup.UpdateRequestProcessorChain.init inserting DistributedUpdateProcessorFactory into updateRequestProcessorChain "uniq-fields"
[junit4:junit4]   2> 5927 T30 oasup.UpdateRequestProcessorChain.init inserting DistributedUpdateProcessorFactory into updateRequestProcessorChain "distrib-dup-test-chain-implicit"
[junit4:junit4]   2> 5927 T30 oasc.RequestHandlers.initHandlersFromConfig adding lazy requestHandler: solr.ReplicationHandler
[junit4:junit4]   2> 5928 T30 oasc.RequestHandlers.initHandlersFromConfig created /replication: solr.ReplicationHandler
[junit4:junit4]   2> 5929 T30 oasc.RequestHandlers.initHandlersFromConfig created standard: solr.StandardRequestHandler
[junit4:junit4]   2> 5930 T30 oasc.RequestHandlers.initHandlersFromConfig created /get: solr.RealTimeGetHandler
[junit4:junit4]   2> 5930 T30 oasc.RequestHandlers.initHandlersFromConfig created dismax: solr.SearchHandler
[junit4:junit4]   2> 5931 T30 oasc.RequestHandlers.initHandlersFromConfig created mock: org.apache.solr.core.MockQuerySenderListenerReqHandler
[junit4:junit4]   2> 5932 T30 oasc.RequestHandlers.initHandlersFromConfig created /admin/: org.apache.solr.handler.admin.AdminHandlers
[junit4:junit4]   2> 5933 T30 oasc.RequestHandlers.initHandlersFromConfig created defaults: solr.StandardRequestHandler
[junit4:junit4]   2> 5933 T30 oasc.RequestHandlers.initHandlersFromConfig adding lazy requestHandler: solr.StandardRequestHandler
[junit4:junit4]   2> 5934 T30 oasc.RequestHandlers.initHandlersFromConfig created lazy: solr.StandardRequestHandler
[junit4:junit4]   2> 5934 T30 oasc.RequestHandlers.initHandlersFromConfig created /update: solr.UpdateRequestHandler
[junit4:junit4]   2> 5935 T30 oasc.RequestHandlers.initHandlersFromConfig created /terms: org.apache.solr.handler.component.SearchHandler
[junit4:junit4]   2> 5936 T30 oasc.RequestHandlers.initHandlersFromConfig created spellCheckCompRH: org.apache.solr.handler.component.SearchHandler
[junit4:junit4]   2> 5936 T30 oasc.RequestHandlers.initHandlersFromConfig created spellCheckCompRH_Direct: org.apache.solr.handler.component.SearchHandler
[junit4:junit4]   2> 5937 T30 oasc.RequestHandlers.initHandlersFromConfig created spellCheckWithWordbreak: org.apache.solr.handler.component.SearchHandler
[junit4:junit4]   2> 5938 T30 oasc.RequestHandlers.initHandlersFromConfig created spellCheckWithWordbreak_Direct: org.apache.solr.handler.component.SearchHandler
[junit4:junit4]   2> 5939 T30 oasc.RequestHandlers.initHandlersFromConfig created spellCheckCompRH1: org.apache.solr.handler.component.SearchHandler
[junit4:junit4]   2> 5939 T30 oasc.RequestHandlers.initHandlersFromConfig created tvrh: org.apache.solr.handler.component.SearchHandler
[junit4:junit4]   2> 5940 T30 oasc.RequestHandlers.initHandlersFromConfig created /mlt: solr.MoreLikeThisHandler
[junit4:junit4]   2> 5941 T30 oasc.RequestHandlers.initHandlersFromConfig created /debug/dump: solr.DumpRequestHandler
[junit4:junit4]   2> 5944 T30 oashl.XMLLoader.init xsltCacheLifetimeSeconds=60
[junit4:junit4]   2> 5948 T30 oasc.SolrCore.initDeprecatedSupport WARNING solrconfig.xml uses deprecated <admin/gettableFiles>, Please update your config to use the ShowFileRequestHandler.
[junit4:junit4]   2> 5950 T30 oasc.SolrCore.initDeprecatedSupport WARNING adding ShowFileRequestHandler with hidden files: [SCHEMA.XML, OLD_SYNONYMS.TXT, STOPWORDS.TXT, PROTWORDS.TXT, OPEN-EXCHANGE-RATES.JSON, SYNONYMS.TXT, CURRENCY.XML, MAPPING-ISOLATIN1ACCENT.TXT]
[junit4:junit4]   2> 5953 T30 oass.SolrIndexSearcher.<init> Opening Searcher@19a04ff3 main
[junit4:junit4]   2> 5954 T30 oasu.CommitTracker.<init> Hard AutoCommit: disabled
[junit4:junit4]   2> 5955 T30 oasu.CommitTracker.<init> Soft AutoCommit: disabled
[junit4:junit4]   2> 5956 T30 oashc.SpellCheckComponent.inform Initializing spell checkers
[junit4:junit4]   2> 5962 T30 oass.DirectSolrSpellChecker.init init: {name=direct,classname=DirectSolrSpellChecker,field=lowerfilt,minQueryLength=3}
[junit4:junit4]   2> 6025 T66 oasc.SolrCore.registerSearcher [collection1] Registered new searcher Searcher@19a04ff3 main{StandardDirectoryReader(segments_1:1)}
[junit4:junit4]   2> 6357 T52 oascc.ZkStateReader.updateClusterState Updating cloud state from ZooKeeper... 
[junit4:junit4]   2> 6377 T65 oascc.ZkStateReader$2.process A cluster state change has occurred - updating...
[junit4:junit4]   2> 6377 T51 oascc.ZkStateReader$2.process A cluster state change has occurred - updating...
[junit4:junit4]   2> 6535 T30 oasc.CoreContainer.register registering core: collection1
[junit4:junit4]   2> 6535 T30 oasc.ZkController.register Register shard - core:collection1 address:http://127.0.0.1:42619/solr shardId:shard1
[junit4:junit4]   2> 6536 T30 oascc.SolrZkClient.makePath makePath: /collections/collection1/leader_elect/shard1/election
[junit4:junit4]   2> 6554 T35 oazs.PrepRequestProcessor.pRequest Got user-level KeeperException when processing sessionid:0x139e005369a0003 type:delete cxid:0x42 zxid:0xfffffffffffffffe txntype:unknown reqpath:n/a Error Path:/solr/collections/collection1/leaders Error:KeeperErrorCode = NoNode for /solr/collections/collection1/leaders
[junit4:junit4]   2> 6560 T30 oasc.ShardLeaderElectionContext.runLeaderProcess Running the leader process.
[junit4:junit4]   2> 6561 T35 oazs.PrepRequestProcessor.pRequest Got user-level KeeperException when processing sessionid:0x139e005369a0003 type:create cxid:0x43 zxid:0xfffffffffffffffe txntype:unknown reqpath:n/a Error Path:/solr/overseer Error:KeeperErrorCode = NodeExists for /solr/overseer
[junit4:junit4]   2> 6564 T30 oasc.ShardLeaderElectionContext.waitForReplicasToComeUp Enough replicas found to continue.
[junit4:junit4]   2> 6564 T30 oasc.ShardLeaderElectionContext.runLeaderProcess I may be the new leader - try and sync
[junit4:junit4]   2> 6565 T30 oasc.SyncStrategy.sync Sync replicas to http://127.0.0.1:42619/solr/collection1/
[junit4:junit4]   2> 6565 T30 oasc.SyncStrategy.syncReplicas Sync Success - now sync replicas to me
[junit4:junit4]   2> 6565 T30 oasc.SyncStrategy.syncToMe http://127.0.0.1:42619/solr/collection1/ has no replicas
[junit4:junit4]   2> 6566 T30 oasc.ShardLeaderElectionContext.runLeaderProcess I am the new leader: http://127.0.0.1:42619/solr/collection1/
[junit4:junit4]   2> 6566 T30 oascc.SolrZkClient.makePath makePath: /collections/collection1/leaders/shard1
[junit4:junit4]   2> 6577 T35 oazs.PrepRequestProcessor.pRequest Got user-level KeeperException when processing sessionid:0x139e005369a0003 type:create cxid:0x4d zxid:0xfffffffffffffffe txntype:unknown reqpath:n/a Error Path:/solr/overseer Error:KeeperErrorCode = NodeExists for /solr/overseer
[junit4:junit4]   2> 6882 T52 oascc.ZkStateReader.updateClusterState Updating cloud state from ZooKeeper... 
[junit4:junit4]   2> 6937 T65 oascc.ZkStateReader$2.process A cluster state change has occurred - updating...
[junit4:junit4]   2> 6937 T51 oascc.ZkStateReader$2.process A cluster state change has occurred - updating...
[junit4:junit4]   2> 6942 T30 oasc.ZkController.register We are http://127.0.0.1:42619/solr/collection1/ and leader is http://127.0.0.1:42619/solr/collection1/
[junit4:junit4]   2> 6942 T30 oasc.ZkController.register No LogReplay needed for core=collection1 baseURL=http://127.0.0.1:42619/solr
[junit4:junit4]   2> 6943 T30 oasc.ZkController.checkRecovery I am the leader, no recovery necessary
[junit4:junit4]   2> 6948 T30 oascc.ZkStateReader.updateClusterState Updating cloud state from ZooKeeper... 
[junit4:junit4]   2> 6954 T30 oass.SolrDispatchFilter.init user.dir=/usr/home/hudson/hudson-slave/workspace/Lucene-Solr-Tests-4.x-java7/solr/build/solr-core/test/J1
[junit4:junit4]   2> 6955 T30 oass.SolrDispatchFilter.init SolrDispatchFilter.init() done
[junit4:junit4]   2> 6956 T30 oascsi.HttpClientUtil.createClient Creating new http client, config:maxConnections=128&maxConnectionsPerHost=32&followRedirects=false
[junit4:junit4]   2> 7130 T30 oejs.Server.doStart jetty-8.1.2.v20120308
[junit4:junit4]   2> 7133 T30 oejs.AbstractConnector.doStart Started SocketConnector@0.0.0.0:14410
[junit4:junit4]   2> 7133 T30 oasc.SolrResourceLoader.locateSolrHome JNDI not configured for solr (NoInitialContextEx)
[junit4:junit4]   2> 7134 T30 oasc.SolrResourceLoader.locateSolrHome using system property solr.solr.home: /usr/home/hudson/hudson-slave/workspace/Lucene-Solr-Tests-4.x-java7/solr/build/solr-core/test/J1/./solrtest-jetty2-1348083208399
[junit4:junit4]   2> 7134 T30 oasc.SolrResourceLoader.<init> new SolrResourceLoader for deduced Solr Home: '/usr/home/hudson/hudson-slave/workspace/Lucene-Solr-Tests-4.x-java7/solr/build/solr-core/test/J1/./solrtest-jetty2-1348083208399/'
[junit4:junit4]   2> 7177 T30 oass.SolrDispatchFilter.init SolrDispatchFilter.init()
[junit4:junit4]   2> 7178 T30 oasc.SolrResourceLoader.locateSolrHome JNDI not configured for solr (NoInitialContextEx)
[junit4:junit4]   2> 7178 T30 oasc.SolrResourceLoader.locateSolrHome using system property solr.solr.home: /usr/home/hudson/hudson-slave/workspace/Lucene-Solr-Tests-4.x-java7/solr/build/solr-core/test/J1/./solrtest-jetty2-1348083208399
[junit4:junit4]   2> 7179 T30 oasc.CoreContainer$Initializer.initialize looking for solr.xml: /usr/home/hudson/hudson-slave/workspace/Lucene-Solr-Tests-4.x-java7/solr/build/solr-core/test/J1/./solrtest-jetty2-1348083208399/solr.xml
[junit4:junit4]   2> 7179 T30 oasc.CoreContainer.<init> New CoreContainer 500171771
[junit4:junit4]   2> 7180 T30 oasc.CoreContainer.load Loading CoreContainer using Solr Home: '/usr/home/hudson/hudson-slave/workspace/Lucene-Solr-Tests-4.x-java7/solr/build/solr-core/test/J1/./solrtest-jetty2-1348083208399/'
[junit4:junit4]   2> 7180 T30 oasc.SolrResourceLoader.<init> new SolrResourceLoader for directory: '/usr/home/hudson/hudson-slave/workspace/Lucene-Solr-Tests-4.x-java7/solr/build/solr-core/test/J1/./solrtest-jetty2-1348083208399/'
[junit4:junit4]   2> 7212 T30 oasc.CoreContainer.load Registering Log Listener
[junit4:junit4]   2> 7227 T30 oasc.CoreContainer.initZooKeeper Zookeeper client=127.0.0.1:26833/solr
[junit4:junit4]   2> 7228 T30 oaz.ZooKeeper.<init> Initiating client connection, connectString=127.0.0.1:26833/solr sessionTimeout=5000 watcher=org.apache.solr.common.cloud.ConnectionManager@6655b5b8
[junit4:junit4]   2> 7229 T76 oaz.ClientCnxn$SendThread.startConnect Opening socket connection to server /127.0.0.1:26833
[junit4:junit4]   2> 7229 T30 oascc.ConnectionManager.waitForConnected Waiting for client to connect to ZooKeeper
[junit4:junit4]   2> 7230 T76 oaz.ClientCnxn$SendThread.primeConnection Socket connection established to localhost/127.0.0.1:26833, initiating session
[junit4:junit4]   2> 7230 T32 oazs.NIOServerCnxn$Factory.run Accepted socket connection from /140.211.11.196:61603
[junit4:junit4]   2> 7231 T32 oazs.NIOServerCnxn.readConnectRequest Client attempting to establish new session at /140.211.11.196:61603
[junit4:junit4]   2> 7233 T34 oazs.NIOServerCnxn.finishSessionInit Established session 0x139e005369a0004 with negotiated timeout 5000 for client /140.211.11.196:61603
[junit4:junit4]   2> 7233 T76 oaz.ClientCnxn$SendThread.readConnectResult Session establishment complete on server localhost/127.0.0.1:26833, sessionid = 0x139e005369a0004, negotiated timeout = 5000
[junit4:junit4]   2> 7234 T77 oascc.ConnectionManager.process Watcher org.apache.solr.common.cloud.ConnectionManager@6655b5b8 name:ZooKeeperConnection Watcher:127.0.0.1:26833/solr got event WatchedEvent state:SyncConnected type:None path:null path:null type:None
[junit4:junit4]   2> 7234 T30 oascc.ConnectionManager.waitForConnected Client is connected to ZooKeeper
[junit4:junit4]   2> 7235 T35 oazs.PrepRequestProcessor.pRequest Got user-level KeeperException when processing sessionid:0x139e005369a0004 type:create cxid:0x1 zxid:0xfffffffffffffffe txntype:unknown reqpath:n/a Error Path:/solr/overseer Error:KeeperErrorCode = NodeExists for /solr/overseer
[junit4:junit4]   2> 7247 T35 oazs.PrepRequestProcessor.pRequest Got user-level KeeperException when processing sessionid:0x139e005369a0004 type:create cxid:0x2 zxid:0xfffffffffffffffe txntype:unknown reqpath:n/a Error Path:/solr/overseer Error:KeeperErrorCode = NodeExists for /solr/overseer
[junit4:junit4]   2> 7248 T30 oasc.ZkController.createEphemeralLiveNode Register node as live in ZooKeeper:/live_nodes/127.0.0.1:14410_solr
[junit4:junit4]   2> 7249 T35 oazs.PrepRequestProcessor.pRequest Got user-level KeeperException when processing sessionid:0x139e005369a0004 type:delete cxid:0x4 zxid:0xfffffffffffffffe txntype:unknown reqpath:n/a Error Path:/solr/live_nodes/127.0.0.1:14410_solr Error:KeeperErrorCode = NoNode for /solr/live_nodes/127.0.0.1:14410_solr
[junit4:junit4]   2> 7254 T30 oascc.SolrZkClient.makePath makePath: /live_nodes/127.0.0.1:14410_solr
[junit4:junit4]   2> 7257 T65 oascc.ZkStateReader$3.process Updating live nodes
[junit4:junit4]   2> 7257 T51 oascc.ZkStateReader$3.process Updating live nodes
[junit4:junit4]   2> 7257 T30 oashc.HttpShardHandlerFactory.getParameter Setting socketTimeout to: 0
[junit4:junit4]   2> 7258 T30 oashc.HttpShardHandlerFactory.getParameter Setting urlScheme to: http://
[junit4:junit4]   2> 7258 T30 oashc.HttpShardHandlerFactory.getParameter Setting connTimeout to: 0
[junit4:junit4]   2> 7259 T30 oashc.HttpShardHandlerFactory.getParameter Setting maxConnectionsPerHost to: 20
[junit4:junit4]   2> 7259 T30 oashc.HttpShardHandlerFactory.getParameter Setting corePoolSize to: 0
[junit4:junit4]   2> 7260 T30 oashc.HttpShardHandlerFactory.getParameter Setting maximumPoolSize to: 2147483647
[junit4:junit4]   2> 7260 T30 oashc.HttpShardHandlerFactory.getParameter Setting maxThreadIdleTime to: 5
[junit4:junit4]   2> 7261 T30 oashc.HttpShardHandlerFactory.getParameter Setting sizeOfQueue to: -1
[junit4:junit4]   2> 7261 T30 oashc.HttpShardHandlerFactory.getParameter Setting fairnessPolicy to: false
[junit4:junit4]   2> 7261 T30 oascsi.HttpClientUtil.createClient Creating new http client, config:maxConnectionsPerHost=20&maxConnections=10000&socketTimeout=0&connTimeout=0&retry=false
[junit4:junit4]   2> 7279 T30 oascc.ZkStateReader.createClusterStateWatchersAndUpdate Updating cluster state from ZooKeeper... 
[junit4:junit4]   2> 7292 T30 oasc.CoreContainer.create Creating SolrCore 'collection1' using instanceDir: /usr/home/hudson/hudson-slave/workspace/Lucene-Solr-Tests-4.x-java7/solr/build/solr-core/test/J1/./solrtest-jetty2-1348083208399/collection1
[junit4:junit4]   2> 7293 T30 oasc.ZkController.createCollectionZkNode Check for collection zkNode:collection1
[junit4:junit4]   2> 7294 T30 oasc.ZkController.createCollectionZkNode Collection zkNode exists
[junit4:junit4]   2> 7294 T30 oasc.ZkController.readConfigName Load collection config from:/collections/collection1
[junit4:junit4]   2> 7296 T30 oasc.SolrResourceLoader.<init> new SolrResourceLoader for directory: '/usr/home/hudson/hudson-slave/workspace/Lucene-Solr-Tests-4.x-java7/solr/build/solr-core/test/J1/./solrtest-jetty2-1348083208399/collection1/'
[junit4:junit4]   2> 7297 T30 oasc.SolrResourceLoader.replaceClassLoader Adding 'file:/usr/home/hudson/hudson-slave/workspace/Lucene-Solr-Tests-4.x-java7/solr/build/solr-core/test/J1/solrtest-jetty2-1348083208399/collection1/lib/README' to classloader
[junit4:junit4]   2> 7298 T30 oasc.SolrResourceLoader.replaceClassLoader Adding 'file:/usr/home/hudson/hudson-slave/workspace/Lucene-Solr-Tests-4.x-java7/solr/build/solr-core/test/J1/solrtest-jetty2-1348083208399/collection1/lib/classes/' to classloader
[junit4:junit4]   2> 7446 T30 oasc.SolrConfig.<init> Using Lucene MatchVersion: LUCENE_40
[junit4:junit4]   2> 7463 T52 oascc.ZkStateReader.updateClusterState Updating cloud state from ZooKeeper... 
[junit4:junit4]   2> 7479 T77 oascc.ZkStateReader$2.process A cluster state change has occurred - updating...
[junit4:junit4]   2> 7479 T65 oascc.ZkStateReader$2.process A cluster state change has occurred - updating...
[junit4:junit4]   2> 7479 T51 oascc.ZkStateReader$2.process A cluster state change has occurred - updating...
[junit4:junit4]   2> 7503 T30 oasc.SolrConfig.<init> Loaded SolrConfig: solrconfig.xml
[junit4:junit4]   2> 7604 T30 oass.IndexSchema.readSchema Reading Solr Schema
[junit4:junit4]   2> 7612 T30 oass.IndexSchema.readSchema Schema name=test
[junit4:junit4]   2> 8109 T30 oass.OpenExchangeRatesOrgProvider.init Initialized with rates=open-exchange-rates.json, refreshInterval=1440.
[junit4:junit4]   2> 8121 T30 oass.IndexSchema.readSchema default search field in schema is text
[junit4:junit4]   2> 8124 T30 oass.IndexSchema.readSchema unique key field: id
[junit4:junit4]   2> 8148 T30 oass.FileExchangeRateProvider.reload Reloading exchange rates from file currency.xml
[junit4:junit4]   2> 8154 T30 oass.FileExchangeRateProvider.reload Reloading exchange rates from file currency.xml
[junit4:junit4]   2> 8159 T30 oass.OpenExchangeRatesOrgProvider.reload Reloading exchange rates from open-exchange-rates.json
[junit4:junit4]   2> 8162 T30 oass.OpenExchangeRatesOrgProvider.reload Reloading exchange rates from open-exchange-rates.json
[junit4:junit4]   2> 8165 T30 oasc.SolrCore.<init> [collection1] Opening new SolrCore at /usr/home/hudson/hudson-slave/workspace/Lucene-Solr-Tests-4.x-java7/solr/build/solr-core/test/J1/./solrtest-jetty2-1348083208399/collection1/, dataDir=./org.apache.solr.cloud.SyncSliceTest-1348083201432/jetty2/
[junit4:junit4]   2> 8165 T30 oasc.JmxMonitoredMap.<init> JMX monitoring is enabled. Adding Solr mbeans to JMX Server: com.sun.jmx.mbeanserver.JmxMBeanServer@334b4cb
[junit4:junit4]   2> 8167 T30 oasc.SolrCore.getNewIndexDir WARNING New index directory detected: old=null new=./org.apache.solr.cloud.SyncSliceTest-1348083201432/jetty2/index/
[junit4:junit4]   2> 8167 T30 oasc.SolrCore.initIndex WARNING [collection1] Solr index directory './org.apache.solr.cloud.SyncSliceTest-1348083201432/jetty2/index' doesn't exist. Creating new index...
[junit4:junit4]   2> 8168 T30 oasc.CachingDirectoryFactory.get return new directory for /usr/home/hudson/hudson-slave/workspace/Lucene-Solr-Tests-4.x-java7/solr/build/solr-core/test/J1/./org.apache.solr.cloud.SyncSliceTest-1348083201432/jetty2/index forceNew:false
[junit4:junit4]   2> 8186 T30 oasc.SolrDeletionPolicy.onCommit SolrDeletionPolicy.onCommit: commits:num=1
[junit4:junit4]   2> 		commit{dir=NRTCachingDirectory(org.apache.lucene.store.NIOFSDirectory@/usr/home/hudson/hudson-slave/workspace/Lucene-Solr-Tests-4.x-java7/solr/build/solr-core/test/J1/org.apache.solr.cloud.SyncSliceTest-1348083201432/jetty2/index lockFactory=org.apache.lucene.store.NativeFSLockFactory@265b98b6; maxCacheMB=48.0 maxMergeSizeMB=4.0),segFN=segments_1,generation=1,filenames=[segments_1]
[junit4:junit4]   2> 8187 T30 oasc.SolrDeletionPolicy.updateCommits newest commit = 1
[junit4:junit4]   2> 8188 T30 oasc.SolrCore.initWriters created xml: solr.XMLResponseWriter
[junit4:junit4]   2> 8191 T30 oasup.UpdateRequestProcessorChain.init inserting DistributedUpdateProcessorFactory into updateRequestProcessorChain "dedupe"
[junit4:junit4]   2> 8191 T30 oasup.UpdateRequestProcessorChain.init inserting DistributedUpdateProcessorFactory into updateRequestProcessorChain "dedupe-allfields"
[junit4:junit4]   2> 8192 T30 oasup.UpdateRequestProcessorChain.init inserting DistributedUpdateProcessorFactory into updateRequestProcessorChain "stored_sig"
[junit4:junit4]   2> 8192 T30 oasup.UpdateRequestProcessorChain.init inserting DistributedUpdateProcessorFactory into updateRequestProcessorChain "uniq-fields"
[junit4:junit4]   2> 8193 T30 oasup.UpdateRequestProcessorChain.init inserting DistributedUpdateProcessorFactory into updateRequestProcessorChain "distrib-dup-test-chain-implicit"
[junit4:junit4]   2> 8193 T30 oasc.RequestHandlers.initHandlersFromConfig adding lazy requestHandler: solr.ReplicationHandler
[junit4:junit4]   2> 8194 T30 oasc.RequestHandlers.initHandlersFromConfig created /replication: solr.ReplicationHandler
[junit4:junit4]   2> 8195 T30 oasc.RequestHandlers.initHandlersFromConfig created standard: solr.StandardRequestHandler
[junit4:junit4]   2> 8196 T30 oasc.RequestHandlers.initHandlersFromConfig created /get: solr.RealTimeGetHandler
[junit4:junit4]   2> 8196 T30 oasc.RequestHandlers.initHandlersFromConfig created dismax: solr.SearchHandler
[junit4:junit4]   2> 8197 T30 oasc.RequestHandlers.initHandlersFromConfig created mock: org.apache.solr.core.MockQuerySenderListenerReqHandler
[junit4:junit4]   2> 8198 T30 oasc.RequestHandlers.initHandlersFromConfig created /admin/: org.apache.solr.handler.admin.AdminHandlers
[junit4:junit4]   2> 8198 T30 oasc.RequestHandlers.initHandlersFromConfig created defaults: solr.StandardRequestHandler
[junit4:junit4]   2> 8199 T30 oasc.RequestHandlers.initHandlersFromConfig adding lazy requestHandler: solr.StandardRequestHandler
[junit4:junit4]   2> 8199 T30 oasc.RequestHandlers.initHandlersFromConfig created lazy: solr.StandardRequestHandler
[junit4:junit4]   2> 8200 T30 oasc.RequestHandlers.initHandlersFromConfig created /update: solr.UpdateRequestHandler
[junit4:junit4]   2> 8201 T30 oasc.RequestHandlers.initHandlersFromConfig created /terms: org.apache.solr.handler.component.SearchHandler
[junit4:junit4]   2> 8202 T30 oasc.RequestHandlers.initHandlersFromConfig created spellCheckCompRH: org.apache.solr.handler.component.SearchHandler
[junit4:junit4]   2> 8202 T30 oasc.RequestHandlers.initHandlersFromConfig created spellCheckCompRH_Direct: org.apache.solr.handler.component.SearchHandler
[junit4:junit4]   2> 8203 T30 oasc.RequestHandlers.initHandlersFromConfig created spellCheckWithWordbreak: org.apache.solr.handler.component.SearchHandler
[junit4:junit4]   2> 8204 T30 oasc.RequestHandlers.initHandlersFromConfig created spellCheckWithWordbreak_Direct: org.apache.solr.handler.component.SearchHandler
[junit4:junit4]   2> 8205 T30 oasc.RequestHandlers.initHandlersFromConfig created spellCheckCompRH1: org.apache.solr.handler.component.SearchHandler
[junit4:junit4]   2> 8205 T30 oasc.RequestHandlers.initHandlersFromConfig created tvrh: org.apache.solr.handler.component.SearchHandler
[junit4:junit4]   2> 8206 T30 oasc.RequestHandlers.initHandlersFromConfig created /mlt: solr.MoreLikeThisHandler
[junit4:junit4]   2> 8207 T30 oasc.RequestHandlers.initHandlersFromConfig created /debug/dump: solr.DumpRequestHandler
[junit4:junit4]   2> 8210 T30 oashl.XMLLoader.init xsltCacheLifetimeSeconds=60
[junit4:junit4]   2> 8213 T30 oasc.SolrCore.initDeprecatedSupport WARNING solrconfig.xml uses deprecated <admin/gettableFiles>, Please update your config to use the ShowFileRequestHandler.
[junit4:junit4]   2> 8215 T30 oasc.SolrCore.initDeprecatedSupport WARNING adding ShowFileRequestHandler with hidden files: [SCHEMA.XML, OLD_SYNONYMS.TXT, STOPWORDS.TXT, PROTWORDS.TXT, OPEN-EXCHANGE-RATES.JSON, SYNONYMS.TXT, CURRENCY.XML, MAPPING-ISOLATIN1ACCENT.TXT]
[junit4:junit4]   2> 8218 T30 oass.SolrIndexSearcher.<init> Opening Searcher@6bc3e48b main
[junit4:junit4]   2> 8220 T30 oasu.CommitTracker.<init> Hard AutoCommit: disabled
[junit4:junit4]   2> 8220 T30 oasu.CommitTracker.<init> Soft AutoCommit: disabled
[junit4:junit4]   2> 8221 T30 oashc.SpellCheckComponent.inform Initializing spell checkers
[junit4:junit4]   2> 8228 T30 oass.DirectSolrSpellChecker.init init: {name=direct,classname=DirectSolrSpellChecker,field=lowerfilt,minQueryLength=3}
[junit4:junit4]   2> 8288 T78 oasc.SolrCore.registerSearcher [collection1] Registered new searcher Searcher@6bc3e48b main{StandardDirectoryReader(segments_1:1)}
[junit4:junit4]   2> 8489 T52 oascc.ZkStateReader.updateClusterState Updating cloud state from ZooKeeper... 
[junit4:junit4]   2> 8505 T65 oascc.ZkStateReader$2.process A cluster state change has occurred - updating...
[junit4:junit4]   2> 8506 T77 oascc.ZkStateReader$2.process A cluster state change has occurred - updating...
[junit4:junit4]   2> 8505 T51 oascc.ZkStateReader$2.process A cluster state change has occurred - updating...
[junit4:junit4]   2> 8805 T30 oasc.CoreContainer.register registering core: collection1
[junit4:junit4]   2> 8805 T30 oasc.ZkController.register Register shard - core:collection1 address:http://127.0.0.1:14410/solr shardId:shard1
[junit4:junit4]   2> 8814 T30 oasc.ZkController.register We are http://127.0.0.1:14410/solr/collection1/ and leader is http://127.0.0.1:42619/solr/collection1/
[junit4:junit4]   2> 8815 T30 oasc.ZkController.register No LogReplay needed for core=collection1 baseURL=http://127.0.0.1:14410/solr
[junit4:junit4]   2> 8815 T30 oasc.ZkController.checkRecovery Core needs to recover:collection1
[junit4:junit4]   2> 8816 T30 oasu.DefaultSolrCoreState.doRecovery Running recovery - first canceling any ongoing recovery
[junit4:junit4]   2> ASYNC  NEW_CORE C8 name=collection1 org.apache.solr.core.SolrCore@54689939 url=http://127.0.0.1:14410/solr/collection1 node=127.0.0.1:14410_solr
[junit4:junit4]   2> 8821 T79 C8 P14410 oasc.RecoveryStrategy.run Starting recovery process.  core=collection1 recoveringAfterStartup=true
[junit4:junit4]   2> 8822 T79 C8 P14410 oasc.RecoveryStrategy.doRecovery ###### startupVersions=[]
[junit4:junit4]   2> 8822 T30 oascc.ZkStateReader.updateClusterState Updating cloud state from ZooKeeper... 
[junit4:junit4]   2> 8836 T79 C8 P14410 oasc.RecoveryStrategy.doRecovery Attempting to PeerSync from http://127.0.0.1:42619/solr/collection1/ core=collection1 - recoveringAfterStartup=true
[junit4:junit4]   2> 8836 T30 oass.SolrDispatchFilter.init user.dir=/usr/home/hudson/hudson-slave/workspace/Lucene-Solr-Tests-4.x-java7/solr/build/solr-core/test/J1
[junit4:junit4]   2> 8837 T30 oass.SolrDispatchFilter.init SolrDispatchFilter.init() done
[junit4:junit4]   2> 8838 T30 oascsi.HttpClientUtil.createClient Creating new http client, config:maxConnections=128&maxConnectionsPerHost=32&followRedirects=false
[junit4:junit4]   2> 8845 T79 C8 P14410 oascsi.HttpClientUtil.createClient Creating new http client, config:maxConnectionsPerHost=20&maxConnections=10000&connTimeout=30000&socketTimeout=30000&retry=false
[junit4:junit4]   2> 8865 T79 C8 P14410 oasu.PeerSync.sync PeerSync: core=collection1 url=http://127.0.0.1:14410/solr START replicas=[http://127.0.0.1:42619/solr/collection1/] nUpdates=100
[junit4:junit4]   2> 8877 T79 C8 P14410 oasu.PeerSync.sync WARNING no frame of reference to tell of we've missed updates
[junit4:junit4]   2> 8877 T79 C8 P14410 oasc.RecoveryStrategy.doRecovery PeerSync Recovery was not successful - trying replication. core=collection1
[junit4:junit4]   2> 8878 T79 C8 P14410 oasc.RecoveryStrategy.doRecovery Starting Replication Recovery. core=collection1
[junit4:junit4]   2> 8878 T79 C8 P14410 oascsi.HttpClientUtil.createClient Creating new http client, config:maxConnections=128&maxConnectionsPerHost=32&followRedirects=false
[junit4:junit4]   2> 9010 T30 oejs.Server.doStart jetty-8.1.2.v20120308
[junit4:junit4]   2> 9012 T30 oejs.AbstractConnector.doStart Started SocketConnector@0.0.0.0:59599
[junit4:junit4]   2> 9013 T30 oasc.SolrResourceLoader.locateSolrHome JNDI not configured for solr (NoInitialContextEx)
[junit4:junit4]   2> 9013 T30 oasc.SolrResourceLoader.locateSolrHome using system property solr.solr.home: /usr/home/hudson/hudson-slave/workspace/Lucene-Solr-Tests-4.x-java7/solr/build/solr-core/test/J1/./solrtest-jetty3-1348083210276
[junit4:junit4]   2> 9014 T30 oasc.SolrResourceLoader.<init> new SolrResourceLoader for deduced Solr Home: '/usr/home/hudson/hudson-slave/workspace/Lucene-Solr-Tests-4.x-java7/solr/build/solr-core/test/J1/./solrtest-jetty3-1348083210276/'
[junit4:junit4]   2> 9029 T52 oascc.ZkStateReader.updateClusterState Updating cloud state from ZooKeeper... 
[junit4:junit4]   2> 9045 T77 oascc.ZkStateReader$2.process A cluster state change has occurred - updating...
[junit4:junit4]   2> 9045 T51 oascc.ZkStateReader$2.process A cluster state change has occurred - updating...
[junit4:junit4]   2> 9045 T65 oascc.ZkStateReader$2.process A cluster state change has occurred - updating...
[junit4:junit4]   2> 9048 T30 oass.SolrDispatchFilter.init SolrDispatchFilter.init()
[junit4:junit4]   2> 9049 T30 oasc.SolrResourceLoader.locateSolrHome JNDI not configured for solr (NoInitialContextEx)
[junit4:junit4]   2> 9049 T30 oasc.SolrResourceLoader.locateSolrHome using system property solr.solr.home: /usr/home/hudson/hudson-slave/workspace/Lucene-Solr-Tests-4.x-java7/solr/build/solr-core/test/J1/./solrtest-jetty3-1348083210276
[junit4:junit4]   2> 9049 T30 oasc.CoreContainer$Initializer.initialize looking for solr.xml: /usr/home/hudson/hudson-slave/workspace/Lucene-Solr-Tests-4.x-java7/solr/build/solr-core/test/J1/./solrtest-jetty3-1348083210276/solr.xml
[junit4:junit4]   2> 9050 T30 oasc.CoreContainer.<init> New CoreContainer 2048132024
[junit4:junit4]   2> 9050 T30 oasc.CoreContainer.load Loading CoreContainer using Solr Home: '/usr/home/hudson/hudson-slave/workspace/Lucene-Solr-Tests-4.x-java7/solr/build/solr-core/test/J1/./solrtest-jetty3-1348083210276/'
[junit4:junit4]   2> 9051 T30 oasc.SolrResourceLoader.<init> new SolrResourceLoader for directory: '/usr/home/hudson/hudson-slave/workspace/Lucene-Solr-Tests-4.x-java7/solr/build/solr-core/test/J1/./solrtest-jetty3-1348083210276/'
[junit4:junit4]   2> 9084 T30 oasc.CoreContainer.load Registering Log Listener
[junit4:junit4]   2> 9100 T30 oasc.CoreContainer.initZooKeeper Zookeeper client=127.0.0.1:26833/solr
[junit4:junit4]   2> 9101 T30 oaz.ZooKeeper.<init> Initiating client connection, connectString=127.0.0.1:26833/solr sessionTimeout=5000 watcher=org.apache.solr.common.cloud.ConnectionManager@2a7aa623
[junit4:junit4]   2> 9102 T90 oaz.ClientCnxn$SendThread.startConnect Opening socket connection to server /127.0.0.1:26833
[junit4:junit4]   2> 9102 T30 oascc.ConnectionManager.waitForConnected Waiting for client to connect to ZooKeeper
[junit4:junit4]   2> 9103 T90 oaz.ClientCnxn$SendThread.primeConnection Socket connection established to localhost/127.0.0.1:26833, initiating session
[junit4:junit4]   2> 9104 T32 oazs.NIOServerCnxn$Factory.run Accepted socket connection from /140.211.11.196:62812
[junit4:junit4]   2> 9104 T32 oazs.NIOServerCnxn.readConnectRequest Client attempting to establish new session at /140.211.11.196:62812
[junit4:junit4]   2> 9106 T34 oazs.NIOServerCnxn.finishSessionInit Established session 0x139e005369a0005 with negotiated timeout 5000 for client /140.211.11.196:62812
[junit4:junit4]   2> 9106 T90 oaz.ClientCnxn$SendThread.readConnectResult Session establishment complete on server localhost/127.0.0.1:26833, sessionid = 0x139e005369a0005, negotiated timeout = 5000
[junit4:junit4]   2> 9107 T91 oascc.ConnectionManager.process Watcher org.apache.solr.common.cloud.ConnectionManager@2a7aa623 name:ZooKeeperConnection Watcher:127.0.0.1:26833/solr got event WatchedEvent state:SyncConnected type:None path:null path:null type:None
[junit4:junit4]   2> 9107 T30 oascc.ConnectionManager.waitForConnected Client is connected to ZooKeeper
[junit4:junit4]   2> 9108 T35 oazs.PrepRequestProcessor.pRequest Got user-level KeeperException when processing sessionid:0x139e005369a0005 type:create cxid:0x1 zxid:0xfffffffffffffffe txntype:unknown reqpath:n/a Error Path:/solr/overseer Error:KeeperErrorCode = NodeExists for /solr/overseer
[junit4:junit4]   2> 9109 T35 oazs.PrepRequestProcessor.pRequest Got user-level KeeperException when processing sessionid:0x139e005369a0005 type:create cxid:0x2 zxid:0xfffffffffffffffe txntype:unknown reqpath:n/a Error Path:/solr/overseer Error:KeeperErrorCode = NodeExists for /solr/overseer
[junit4:junit4]   2> 9111 T30 oasc.ZkController.createEphemeralLiveNode Register node as live in ZooKeeper:/live_nodes/127.0.0.1:59599_solr
[junit4:junit4]   2> 9112 T35 oazs.PrepRequestProcessor.pRequest Got user-level KeeperException when processing sessionid:0x139e005369a0005 type:delete cxid:0x4 zxid:0xfffffffffffffffe txntype:unknown reqpath:n/a Error Path:/solr/live_nodes/127.0.0.1:59599_solr Error:KeeperErrorCode = NoNode for /solr/live_nodes/127.0.0.1:59599_solr
[junit4:junit4]   2> 9119 T30 oascc.SolrZkClient.makePath makePath: /live_nodes/127.0.0.1:59599_solr
[junit4:junit4]   2> 9122 T65 oascc.ZkStateReader$3.process Updating live nodes
[junit4:junit4]   2> 9122 T51 oascc.ZkStateReader$3.process Updating live nodes
[junit4:junit4]   2> 9122 T77 oascc.ZkStateReader$3.process Updating live nodes
[junit4:junit4]   2> 9123 T30 oashc.HttpShardHandlerFactory.getParameter Setting socketTimeout to: 0
[junit4:junit4]   2> 9124 T30 oashc.HttpShardHandlerFactory.getParameter Setting urlScheme to: http://
[junit4:junit4]   2> 9124 T30 oashc.HttpShardHandlerFactory.getParameter Setting connTimeout to: 0
[junit4:junit4]   2> 9125 T30 oashc.HttpShardHandlerFactory.getParameter Setting maxConnectionsPerHost to: 20
[junit4:junit4]   2> 9125 T30 oashc.HttpShardHandlerFactory.getParameter Setting corePoolSize to: 0
[junit4:junit4]   2> 9125 T30 oashc.HttpShardHandlerFactory.getParameter Setting maximumPoolSize to: 2147483647
[junit4:junit4]   2> 9126 T30 oashc.HttpShardHandlerFactory.getParameter Setting maxThreadIdleTime to: 5
[junit4:junit4]   2> 9126 T30 oashc.HttpShardHandlerFactory.getParameter Setting sizeOfQueue to: -1
[junit4:junit4]   2> 9127 T30 oashc.HttpShardHandlerFactory.getParameter Setting fairnessPolicy to: false
[junit4:junit4]   2> 9127 T30 oascsi.HttpClientUtil.createClient Creating new http client, config:maxConnectionsPerHost=20&maxConnections=10000&socketTimeout=0&connTimeout=0&retry=false
[junit4:junit4]   2> 9144 T30 oascc.ZkStateReader.createClusterStateWatchersAndUpdate Updating cluster state from ZooKeeper... 
[junit4:junit4]   2> 9152 T30 oasc.CoreContainer.create Creating SolrCore 'collection1' using instanceDir: /usr/home/hudson/hudson-slave/workspace/Lucene-Solr-Tests-4.x-java7/solr/build/solr-core/test/J1/./solrtest-jetty3-1348083210276/collection1
[junit4:junit4]   2> 9152 T30 oasc.ZkController.createCollectionZkNode Check for collection zkNode:collection1
[junit4:junit4]   2> 9153 T30 oasc.ZkController.createCollectionZkNode Collection zkNode exists
[junit4:junit4]   2> 9154 T30 oasc.ZkController.readConfigName Load collection config from:/collections/collection1
[junit4:junit4]   2> 9155 T30 oasc.SolrResourceLoader.<init> new SolrResourceLoader for directory: '/usr/home/hudson/hudson-slave/workspace/Lucene-Solr-Tests-4.x-java7/solr/build/solr-core/test/J1/./solrtest-jetty3-1348083210276/collection1/'
[junit4:junit4]   2> 9157 T30 oasc.SolrResourceLoader.replaceClassLoader Adding 'file:/usr/home/hudson/hudson-slave/workspace/Lucene-Solr-Tests-4.x-java7/solr/build/solr-core/test/J1/solrtest-jetty3-1348083210276/collection1/lib/classes/' to classloader
[junit4:junit4]   2> 9158 T30 oasc.SolrResourceLoader.replaceClassLoader Adding 'file:/usr/home/hudson/hudson-slave/workspace/Lucene-Solr-Tests-4.x-java7/solr/build/solr-core/test/J1/solrtest-jetty3-1348083210276/collection1/lib/README' to classloader
[junit4:junit4]   2> 9238 T30 oasc.SolrConfig.<init> Using Lucene MatchVersion: LUCENE_40
[junit4:junit4]   2> 9300 T30 oasc.SolrConfig.<init> Loaded SolrConfig: solrconfig.xml
[junit4:junit4]   2> 9401 T30 oass.IndexSchema.readSchema Reading Solr Schema
[junit4:junit4]   2> 9419 T30 oass.IndexSchema.readSchema Schema name=test
[junit4:junit4]   2> 10069 T30 oass.OpenExchangeRatesOrgProvider.init Initialized with rates=open-exchange-rates.json, refreshInterval=1440.
[junit4:junit4]   2> 10081 T30 oass.IndexSchema.readSchema default search field in schema is text
[junit4:junit4]   2> 10085 T30 oass.IndexSchema.readSchema unique key field: id
[junit4:junit4]   2> ASYNC  NEW_CORE C9 name=collection1 org.apache.solr.core.SolrCore@3b4b5923 url=http://127.0.0.1:42619/solr/collection1 node=127.0.0.1:42619_solr
[junit4:junit4]   2> 10099 T58 C9 P42619 REQ /get {distrib=false&qt=/get&wt=javabin&version=2&getVersions=100} status=0 QTime=17 
[junit4:junit4]   2> 10107 T30 oass.FileExchangeRateProvider.reload Reloading exchange rates from file currency.xml
[junit4:junit4]   2> 10121 T30 oass.FileExchangeRateProvider.reload Reloading exchange rates from file currency.xml
[junit4:junit4]   2> 10127 T30 oass.OpenExchangeRatesOrgProvider.reload Reloading exchange rates from open-exchange-rates.json
[junit4:junit4]   2> 10130 T30 oass.OpenExchangeRatesOrgProvider.reload Reloading exchange rates from open-exchange-rates.json
[junit4:junit4]   2> 10133 T30 oasc.SolrCore.<init> [collection1] Opening new SolrCore at /usr/home/hudson/hudson-slave/workspace/Lucene-Solr-Tests-4.x-java7/solr/build/solr-core/test/J1/./solrtest-jetty3-1348083210276/collection1/, dataDir=./org.apache.solr.cloud.SyncSliceTest-1348083201432/jetty3/
[junit4:junit4]   2> 10134 T30 oasc.JmxMonitoredMap.<init> JMX monitoring is enabled. Adding Solr mbeans to JMX Server: com.sun.jmx.mbeanserver.JmxMBeanServer@334b4cb
[junit4:junit4]   2> 10136 T30 oasc.SolrCore.getNewIndexDir WARNING New index directory detected: old=null new=./org.apache.solr.cloud.SyncSliceTest-1348083201432/jetty3/index/
[junit4:junit4]   2> 10137 T30 oasc.SolrCore.initIndex WARNING [collection1] Solr index directory './org.apache.solr.cloud.SyncSliceTest-1348083201432/jetty3/index' doesn't exist. Creating new index...
[junit4:junit4]   2> 10138 T30 oasc.CachingDirectoryFactory.get return new directory for /usr/home/hudson/hudson-slave/workspace/Lucene-Solr-Tests-4.x-java7/solr/build/solr-core/test/J1/./org.apache.solr.cloud.SyncSliceTest-1348083201432/jetty3/index forceNew:false
[junit4:junit4]   2> 10158 T30 oasc.SolrDeletionPolicy.onCommit SolrDeletionPolicy.onCommit: commits:num=1
[junit4:junit4]   2> 		commit{dir=NRTCachingDirectory(org.apache.lucene.store.NIOFSDirectory@/usr/home/hudson/hudson-slave/workspace/Lucene-Solr-Tests-4.x-java7/solr/build/solr-core/test/J1/org.apache.solr.cloud.SyncSliceTest-1348083201432/jetty3/index lockFactory=org.apache.lucene.store.NativeFSLockFactory@491a7bf0; maxCacheMB=48.0 maxMergeSizeMB=4.0),segFN=segments_1,generation=1,filenames=[segments_1]
[junit4:junit4]   2> 10158 T30 oasc.SolrDeletionPolicy.updateCommits newest commit = 1
[junit4:junit4]   2> 10159 T30 oasc.SolrCore.initWriters created xml: solr.XMLResponseWriter
[junit4:junit4]   2> 10162 T30 oasup.UpdateRequestProcessorChain.init inserting DistributedUpdateProcessorFactory into updateRequestProcessorChain "dedupe"
[junit4:junit4]   2> 10162 T30 oasup.UpdateRequestProcessorChain.init inserting DistributedUpdateProcessorFactory into updateRequestProcessorChain "dedupe-allfields"
[junit4:junit4]   2> 10163 T30 oasup.UpdateRequestProcessorChain.init inserting DistributedUpdateProcessorFactory into updateRequestProcessorChain "stored_sig"
[junit4:junit4]   2> 10163 T30 oasup.UpdateRequestProcessorChain.init inserting DistributedUpdateProcessorFactory into updateRequestProcessorChain "uniq-fields"
[junit4:junit4]   2> 10164 T30 oasup.UpdateRequestProcessorChain.init inserting DistributedUpdateProcessorFactory into updateRequestProcessorChain "distrib-dup-test-chain-implicit"
[junit4:junit4]   2> 10165 T30 oasc.RequestHandlers.initHandlersFromConfig adding lazy requestHandler: solr.ReplicationHandler
[junit4:junit4]   2> 10165 T30 oasc.RequestHandlers.initHandlersFromConfig created /replication: solr.ReplicationHandler
[junit4:junit4]   2> 10166 T30 oasc.RequestHandlers.initHandlersFromConfig created standard: solr.StandardRequestHandler
[junit4:junit4]   2> 10167 T30 oasc.RequestHandlers.initHandlersFromConfig created /get: solr.RealTimeGetHandler
[junit4:junit4]   2> 10167 T30 oasc.RequestHandlers.initHandlersFromConfig created dismax: solr.SearchHandler
[junit4:junit4]   2> 10168 T30 oasc.RequestHandlers.initHandlersFromConfig created mock: org.apache.solr.core.MockQuerySenderListenerReqHandler
[junit4:junit4]   2> 10169 T30 oasc.RequestHandlers.initHandlersFromConfig created /admin/: org.apache.solr.handler.admin.AdminHandlers
[junit4:junit4]   2> 10169 T30 oasc.RequestHandlers.initHandlersFromConfig created defaults: solr.StandardRequestHandler
[junit4:junit4]   2> 10170 T30 oasc.RequestHandlers.initHandlersFromConfig adding lazy requestHandler: solr.StandardRequestHandler
[junit4:junit4]   2> 10170 T30 oasc.RequestHandlers.initHandlersFromConfig created lazy: solr.StandardRequestHandler
[junit4:junit4]   2> 10171 T30 oasc.RequestHandlers.initHandlersFromConfig created /update: solr.UpdateRequestHandler
[junit4:junit4]   2> 10172 T30 oasc.RequestHandlers.initHandlersFromConfig created /terms: org.apache.solr.handler.component.SearchHandler
[junit4:junit4]   2> 10172 T30 oasc.RequestHandlers.initHandlersFromConfig created spellCheckCompRH: org.apache.solr.handler.component.SearchHandler
[junit4:junit4]   2> 10173 T30 oasc.RequestHandlers.initHandlersFromConfig created spellCheckCompRH_Direct: org.apache.solr.handler.component.SearchHandler
[junit4:junit4]   2> 10174 T30 oasc.RequestHandlers.initHandlersFromConfig created spellCheckWithWordbreak: org.apache.solr.handler.component.SearchHandler
[junit4:junit4]   2> 10174 T30 oasc.RequestHandlers.initHandlersFromConfig created spellCheckWithWordbreak_Direct: org.apache.solr.handler.component.SearchHandler
[junit4:junit4]   2> 10175 T30 oasc.RequestHandlers.initHandlersFromConfig created spellCheckCompRH1: org.apache.solr.handler.component.SearchHandler
[junit4:junit4]   2> 10176 T30 oasc.RequestHandlers.initHandlersFromConfig created tvrh: org.apache.solr.handler.component.SearchHandler
[junit4:junit4]   2> 10176 T30 oasc.RequestHandlers.initHandlersFromConfig created /mlt: solr.MoreLikeThisHandler
[junit4:junit4]   2> 10177 T30 oasc.RequestHandlers.initHandlersFromConfig created /debug/dump: solr.DumpRequestHandler
[junit4:junit4]   2> 10181 T30 oashl.XMLLoader.init xsltCacheLifetimeSeconds=60
[junit4:junit4]   2> 10188 T30 oasc.SolrCore.initDeprecatedSupport WARNING solrconfig.xml uses deprecated <admin/gettableFiles>, Please update your config to use the ShowFileRequestHandler.
[junit4:junit4]   2> 10189 T30 oasc.SolrCore.initDeprecatedSupport WARNING adding ShowFileRequestHandler with hidden files: [SCHEMA.XML, OLD_SYNONYMS.TXT, STOPWORDS.TXT, PROTWORDS.TXT, OPEN-EXCHANGE-RATES.JSON, SYNONYMS.TXT, CURRENCY.XML, MAPPING-ISOLATIN1ACCENT.TXT]
[junit4:junit4]   2> 10194 T30 oass.SolrIndexSearcher.<init> Opening Searcher@32b2ad39 main
[junit4:junit4]   2> 10196 T30 oasu.CommitTracker.<init> Hard AutoCommit: disabled
[junit4:junit4]   2> 10196 T30 oasu.CommitTracker.<init> Soft AutoCommit: disabled
[junit4:junit4]   2> 10197 T30 oashc.SpellCheckComponent.inform Initializing spell checkers
[junit4:junit4]   2> 10212 T30 oass.DirectSolrSpellChecker.init init: {name=direct,classname=DirectSolrSpellChecker,field=lowerfilt,minQueryLength=3}
[junit4:junit4]   2> 10264 T92 oasc.SolrCore.registerSearcher [collection1] Registered new searcher Searcher@32b2ad39 main{StandardDirectoryReader(segments_1:1)}
[junit4:junit4]   2> 10573 T52 oascc.ZkStateReader.updateClusterState Updating cloud state from ZooKeeper... 
[junit4:junit4]   2> 10587 T91 oascc.ZkStateReader$2.process A cluster state change has occurred - updating...
[junit4:junit4]   2> 10587 T77 oascc.ZkStateReader$2.process A cluster state change has occurred - updating...
[junit4:junit4]   2> 10587 T65 oascc.ZkStateReader$2.process A cluster state change has occurred - updating...
[junit4:junit4]   2> 10587 T51 oascc.ZkStateReader$2.process A cluster state change has occurred - updating...
[junit4:junit4]   2> 10772 T30 oasc.CoreContainer.register registering core: collection1
[junit4:junit4]   2> 10773 T30 oasc.ZkController.register Register shard - core:collection1 address:http://127.0.0.1:59599/solr shardId:shard1
[junit4:junit4]   2> 10777 T30 oasc.ZkController.register We are http://127.0.0.1:59599/solr/collection1/ and leader is http://127.0.0.1:42619/solr/collection1/
[junit4:junit4]   2> 10778 T30 oasc.ZkController.register No LogReplay needed for core=collection1 baseURL=http://127.0.0.1:59599/solr
[junit4:junit4]   2> 10779 T30 oasc.ZkController.checkRecovery Core needs to recover:collection1
[junit4:junit4]   2> 10779 T30 oasu.DefaultSolrCoreState.doRecovery Running recovery - first canceling any ongoing recovery
[junit4:junit4]   2> ASYNC  NEW_CORE C10 name=collection1 org.apache.solr.core.SolrCore@7c29a8c3 url=http://127.0.0.1:59599/solr/collection1 node=127.0.0.1:59599_solr
[junit4:junit4]   2> 10780 T93 C10 P59599 oasc.RecoveryStrategy.run Starting recovery process.  core=collection1 recoveringAfterStartup=true
[junit4:junit4]   2> 10781 T93 C10 P59599 oasc.RecoveryStrategy.doRecovery ###### startupVersions=[]
[junit4:junit4]   2> 10781 T30 oascc.ZkStateReader.updateClusterState Updating cloud state from ZooKeeper... 
[junit4:junit4]   2> 10783 T30 oass.SolrDispatchFilter.init user.dir=/usr/home/hudson/hudson-slave/workspace/Lucene-Solr-Tests-4.x-java7/solr/build/solr-core/test/J1
[junit4:junit4]   2> 10783 T93 C10 P59599 oasc.RecoveryStrategy.doRecovery Attempting to PeerSync from http://127.0.0.1:42619/solr/collection1/ core=collection1 - recoveringAfterStartup=true
[junit4:junit4]   2> 10784 T93 C10 P59599 oasu.PeerSync.sync PeerSync: core=collection1 url=http://127.0.0.1:59599/solr START replicas=[http://127.0.0.1:42619/solr/collection1/] nUpdates=100
[junit4:junit4]   2> 10785 T30 oass.SolrDispatchFilter.init SolrDispatchFilter.init() done
[junit4:junit4]   2> 10786 T30 oascsi.HttpClientUtil.createClient Creating new http client, config:maxConnections=128&maxConnectionsPerHost=32&followRedirects=false
[junit4:junit4]   2> 10807 T93 C10 P59599 oasu.PeerSync.sync WARNING no frame of reference to tell of we've missed updates
[junit4:junit4]   2> 10808 T93 C10 P59599 oasc.RecoveryStrategy.doRecovery PeerSync Recovery was not successful - trying replication. core=collection1
[junit4:junit4]   2> 10809 T93 C10 P59599 oasc.RecoveryStrategy.doRecovery Starting Replication Recovery. core=collection1
[junit4:junit4]   2> 10809 T93 C10 P59599 oascsi.HttpClientUtil.createClient Creating new http client, config:maxConnections=128&maxConnectionsPerHost=32&followRedirects=false
[junit4:junit4]   2> 10812 T58 C9 P42619 REQ /get {distrib=false&qt=/get&wt=javabin&version=2&getVersions=100} status=0 QTime=1 
[junit4:junit4]   2> 11002 T30 oejs.Server.doStart jetty-8.1.2.v20120308
[junit4:junit4]   2> 11005 T30 oejs.AbstractConnector.doStart Started SocketConnector@0.0.0.0:10752
[junit4:junit4]   2> 11006 T30 oasc.SolrResourceLoader.locateSolrHome JNDI not configured for solr (NoInitialContextEx)
[junit4:junit4]   2> 11007 T30 oasc.SolrResourceLoader.locateSolrHome using system property solr.solr.home: /usr/home/hudson/hudson-slave/workspace/Lucene-Solr-Tests-4.x-java7/solr/build/solr-core/test/J1/./solrtest-jetty4-1348083212240
[junit4:junit4]   2> 11008 T30 oasc.SolrResourceLoader.<init> new SolrResourceLoader for deduced Solr Home: '/usr/home/hudson/hudson-slave/workspace/Lucene-Solr-Tests-4.x-java7/solr/build/solr-core/test/J1/./solrtest-jetty4-1348083212240/'
[junit4:junit4]   2> 11055 T30 oass.SolrDispatchFilter.init SolrDispatchFilter.init()
[junit4:junit4]   2> 11056 T30 oasc.SolrResourceLoader.locateSolrHome JNDI not configured for solr (NoInitialContextEx)
[junit4:junit4]   2> 11057 T30 oasc.SolrResourceLoader.locateSolrHome using system property solr.solr.home: /usr/home/hudson/hudson-slave/workspace/Lucene-Solr-Tests-4.x-java7/solr/build/solr-core/test/J1/./solrtest-jetty4-1348083212240
[junit4:junit4]   2> 11057 T30 oasc.CoreContainer$Initializer.initialize looking for solr.xml: /usr/home/hudson/hudson-slave/workspace/Lucene-Solr-Tests-4.x-java7/solr/build/solr-core/test/J1/./solrtest-jetty4-1348083212240/solr.xml
[junit4:junit4]   2> 11058 T30 oasc.CoreContainer.<init> New CoreContainer 417900728
[junit4:junit4]   2> 11060 T30 oasc.CoreContainer.load Loading CoreContainer using Solr Home: '/usr/home/hudson/hudson-slave/workspace/Lucene-Solr-Tests-4.x-java7/solr/build/solr-core/test/J1/./solrtest-jetty4-1348083212240/'
[junit4:junit4]   2> 11061 T30 oasc.SolrResourceLoader.<init> new SolrResourceLoader for directory: '/usr/home/hudson/hudson-slave/workspace/Lucene-Solr-Tests-4.x-java7/solr/build/solr-core/test/J1/./solrtest-jetty4-1348083212240/'
[junit4:junit4]   2> 11094 T52 oascc.ZkStateReader.updateClusterState Updating cloud state from ZooKeeper... 
[junit4:junit4]   2> 11099 T30 oasc.CoreContainer.load Registering Log Listener
[junit4:junit4]   2> 11113 T65 oascc.ZkStateReader$2.process A cluster state change has occurred - updating...
[junit4:junit4]   2> 11113 T51 oascc.ZkStateReader$2.process A cluster state change has occurred - updating...
[junit4:junit4]   2> 11113 T77 oascc.ZkStateReader$2.process A cluster state change has occurred - updating...
[junit4:junit4]   2> 11113 T91 oascc.ZkStateReader$2.process A cluster state change has occurred - updating...
[junit4:junit4]   2> 11117 T30 oasc.CoreContainer.initZooKeeper Zookeeper client=127.0.0.1:26833/solr
[junit4:junit4]   2> 11118 T30 oaz.ZooKeeper.<init> Initiating client connection, connectString=127.0.0.1:26833/solr sessionTimeout=5000 watcher=org.apache.solr.common.cloud.ConnectionManager@53ee3434
[junit4:junit4]   2> 11120 T104 oaz.ClientCnxn$SendThread.startConnect Opening socket connection to server /127.0.0.1:26833
[junit4:junit4]   2> 11120 T30 oascc.ConnectionManager.waitForConnected Waiting for client to connect to ZooKeeper
[junit4:junit4]   2> 11121 T104 oaz.ClientCnxn$SendThread.primeConnection Socket connection established to localhost/127.0.0.1:26833, initiating session
[junit4:junit4]   2> 11121 T32 oazs.NIOServerCnxn$Factory.run Accepted socket connection from /140.211.11.196:36063
[junit4:junit4]   2> 11122 T32 oazs.NIOServerCnxn.readConnectRequest Client attempting to establish new session at /140.211.11.196:36063
[junit4:junit4]   2> 11124 T34 oazs.NIOServerCnxn.finishSessionInit Established session 0x139e005369a0006 with negotiated timeout 5000 for client /140.211.11.196:36063
[junit4:junit4]   2> 11124 T104 oaz.ClientCnxn$SendThread.readConnectResult Session establishment complete on server localhost/127.0.0.1:26833, sessionid = 0x139e005369a0006, negotiated timeout = 5000
[junit4:junit4]   2> 11124 T105 oascc.ConnectionManager.process Watcher org.apache.solr.common.cloud.ConnectionManager@53ee3434 name:ZooKeeperConnection Watcher:127.0.0.1:26833/solr got event WatchedEvent state:SyncConnected type:None path:null path:null type:None
[junit4:junit4]   2> 11125 T30 oascc.ConnectionManager.waitForConnected Client is connected to ZooKeeper
[junit4:junit4]   2> 11126 T35 oazs.PrepRequestProcessor.pRequest Got user-level KeeperException when processing sessionid:0x139e005369a0006 type:create cxid:0x1 zxid:0xfffffffffffffffe txntype:unknown reqpath:n/a Error Path:/solr/overseer Error:KeeperErrorCode = NodeExists for /solr/overseer
[junit4:junit4]   2> 11128 T35 oazs.PrepRequestProcessor.pRequest Got user-level KeeperException when processing sessionid:0x139e005369a0006 type:create cxid:0x2 zxid:0xfffffffffffffffe txntype:unknown reqpath:n/a Error Path:/solr/overseer Error:KeeperErrorCode = NodeExists for /solr/overseer
[junit4:junit4]   2> 11130 T30 oasc.ZkController.createEphemeralLiveNode Register node as live in ZooKeeper:/live_nodes/127.0.0.1:10752_solr
[junit4:junit4]   2> 11130 T35 oazs.PrepRequestProcessor.pRequest Got user-level KeeperException when processing sessionid:0x139e005369a0006 type:delete cxid:0x4 zxid:0xfffffffffffffffe txntype:unknown reqpath:n/a Error Path:/solr/live_nodes/127.0.0.1:10752_solr Error:KeeperErrorCode = NoNode for /solr/live_nodes/127.0.0.1:10752_solr
[junit4:junit4]   2> 11138 T30 oascc.SolrZkClient.makePath makePath: /live_nodes/127.0.0.1:10752_solr
[junit4:junit4]   2> 11141 T65 oascc.ZkStateReader$3.process Updating live nodes
[junit4:junit4]   2> 11142 T51 oascc.ZkStateReader$3.process Updating live nodes
[junit4:junit4]   2> 11142 T77 oascc.ZkStateReader$3.process Updating live nodes
[junit4:junit4]   2> 11142 T91 oascc.ZkStateReader$3.process Updating live nodes
[junit4:junit4]   2> 11143 T30 oashc.HttpShardHandlerFactory.getParameter Setting socketTimeout to: 0
[junit4:junit4]   2> 11144 T30 oashc.HttpShardHandlerFactory.getParameter Setting urlScheme to: http://
[junit4:junit4]   2> 11145 T30 oashc.HttpShardHandlerFactory.getParameter Setting connTimeout to: 0
[junit4:junit4]   2> 11146 T30 oashc.HttpShardHandlerFactory.getParameter Setting maxConnectionsPerHost to: 20
[junit4:junit4]   2> 11147 T30 oashc.HttpShardHandlerFactory.getParameter Setting corePoolSize to: 0
[junit4:junit4]   2> 11148 T30 oashc.HttpShardHandlerFactory.getParameter Setting maximumPoolSize to: 2147483647
[junit4:junit4]   2> 11149 T30 oashc.HttpShardHandlerFactory.getParameter Setting maxThreadIdleTime to: 5
[junit4:junit4]   2> 11150 T30 oashc.HttpShardHandlerFactory.getParameter Setting sizeOfQueue to: -1
[junit4:junit4]   2> 11151 T30 oashc.HttpShardHandlerFactory.getParameter Setting fairnessPolicy to: false
[junit4:junit4]   2> 11152 T30 oascsi.HttpClientUtil.createClient Creating new http client, config:maxConnectionsPerHost=20&maxConnections=10000&socketTimeout=0&connTimeout=0&retry=false
[junit4:junit4]   2> 11186 T30 oascc.ZkStateReader.createClusterStateWatchersAndUpdate Updating cluster state from ZooKeeper... 
[junit4:junit4]   2> 11195 T30 oasc.CoreContainer.create Creating SolrCore 'collection1' using instanceDir: /usr/home/hudson/hudson-slave/workspace/Lucene-Solr-Tests-4.x-java7/solr/build/solr-core/test/J1/./solrtest-jetty4-1348083212240/collection1
[junit4:junit4]   2> 11195 T30 oasc.ZkController.createCollectionZkNode Check for collection zkNode:collection1
[junit4:junit4]   2> 11197 T30 oasc.ZkController.createCollectionZkNode Collection zkNode exists
[junit4:junit4]   2> 11197 T30 oasc.ZkController.readConfigName Load collection config from:/collections/collection1
[junit4:junit4]   2> 11199 T30 oasc.SolrResourceLoader.<init> new SolrResourceLoader for directory: '/usr/home/hudson/hudson-slave/workspace/Lucene-Solr-Tests-4.x-java7/solr/build/solr-core/test/J1/./solrtest-jetty4-1348083212240/collection1/'
[junit4:junit4]   2> 11201 T30 oasc.SolrResourceLoader.replaceClassLoader Adding 'file:/usr/home/hudson/hudson-slave/workspace/Lucene-Solr-Tests-4.x-java7/solr/build/solr-core/test/J1/solrtest-jetty4-1348083212240/collection1/lib/README' to classloader
[junit4:junit4]   2> 11202 T30 oasc.SolrResourceLoader.replaceClassLoader Adding 'file:/usr/home/hudson/hudson-slave/workspace/Lucene-Solr-Tests-4.x-java7/solr/build/solr-core/test/J1/solrtest-jetty4-1348083212240/collection1/lib/classes/' to classloader
[junit4:junit4]   2> 11260 T30 oasc.SolrConfig.<init> Using Lucene MatchVersion: LUCENE_40
[junit4:junit4]   2> 11337 T30 oasc.SolrConfig.<init> Loaded SolrConfig: solrconfig.xml
[junit4:junit4]   2> 11438 T30 oass.IndexSchema.readSchema Reading Solr Schema
[junit4:junit4]   2> 11448 T30 oass.IndexSchema.readSchema Schema name=test
[junit4:junit4]   2>  C8_STATE=coll:collection1 core:collection1 props:{shard=shard1, roles=null, state=recovering, core=collection1, collection=collection1, node_name=127.0.0.1:14410_solr, base_url=http://127.0.0.1:14410/solr}
[junit4:junit4]   2> 12215 T79 C8 P14410 oasc.RecoveryStrategy.doRecovery Begin buffering updates. core=collection1
[junit4:junit4]   2> 12215 T79 C8 P14410 oasu.UpdateLog.bufferUpdates Starting to buffer updates. FSUpdateLog{state=ACTIVE, tlog=null}
[junit4:junit4]   2> 12215 T79 C8 P14410 oasc.RecoveryStrategy.replicate Attempting to replicate from http://127.0.0.1:42619/solr/collection1/. core=collection1
[junit4:junit4]   2> 12216 T79 C8 P14410 oascsi.HttpClientUtil.createClient Creating new http client, config:maxConnections=128&maxConnectionsPerHost=32&followRedirects=false
[junit4:junit4]   2> 12219 T30 oass.OpenExchangeRatesOrgProvider.init Initialized with rates=open-exchange-rates.json, refreshInterval=1440.
[junit4:junit4]   2> 12230 T30 oass.IndexSchema.readSchema default search field in schema is text
[junit4:junit4]   2> 12233 T30 oass.IndexSchema.readSchema unique key field: id
[junit4:junit4]   2> 12242 T60 C9 P42619 oascsi.HttpClientUtil.createClient Creating new http client, config:maxConnections=500&maxConnectionsPerHost=16
[junit4:junit4]   2> 12251 T30 oass.FileExchangeRateProvider.reload Reloading exchange rates from file currency.xml
[junit4:junit4]   2> 12253 T60 C9 P42619 oasu.DirectUpdateHandler2.commit start commit{flags=0,_version_=0,optimize=false,openSearcher=true,waitSearcher=true,expungeDeletes=false,softCommit=false}
[junit4:junit4]   2> 12256 T30 oass.FileExchangeRateProvider.reload Reloading exchange rates from file currency.xml
[junit4:junit4]   2> 12257 T60 C9 P42619 oasc.SolrDeletionPolicy.onInit SolrDeletionPolicy.onInit: commits:num=1
[junit4:junit4]   2> 		commit{dir=NRTCachingDirectory(org.apache.lucene.store.NIOFSDirectory@/usr/home/hudson/hudson-slave/workspace/Lucene-Solr-Tests-4.x-java7/solr/build/solr-core/test/J1/org.apache.solr.cloud.SyncSliceTest-1348083201432/jetty1/index lockFactory=org.apache.lucene.store.NativeFSLockFactory@517b4650; maxCacheMB=48.0 maxMergeSizeMB=4.0),segFN=segments_1,generation=1,filenames=[segments_1]
[junit4:junit4]   2> 12258 T60 C9 P42619 oasc.SolrDeletionPolicy.updateCommits newest commit = 1
[junit4:junit4]   2> 12259 T60 C9 P42619 oass.SolrIndexSearcher.<init> Opening Searcher@1eb0062e main
[junit4:junit4]   2> 12260 T60 C9 P42619 oasu.DirectUpdateHandler2.commit end_commit_flush
[junit4:junit4]   2> 12261 T30 oass.OpenExchangeRatesOrgProvider.reload Reloading exchange rates from open-exchange-rates.json
[junit4:junit4]   2> 12262 T66 oasc.SolrCore.registerSearcher [collection1] Registered new searcher Searcher@1eb0062e main{StandardDirectoryReader(segments_1:1)}
[junit4:junit4]   2> 12262 T60 C9 P42619 /update {waitSearcher=true&commit=true&commit_end_point=true&wt=javabin&softCommit=false&version=2} {commit=} 0 30
[junit4:junit4]   2> 12263 T30 oass.OpenExchangeRatesOrgProvider.reload Reloading exchange rates from open-exchange-rates.json
[junit4:junit4]   2> 12265 T30 oasc.SolrCore.<init> [collection1] Opening new SolrCore at /usr/home/hudson/hudson-slave/workspace/Lucene-Solr-Tests-4.x-java7/solr/build/solr-core/test/J1/./solrtest-jetty4-1348083212240/collection1/, dataDir=./org.apache.solr.cloud.SyncSliceTest-1348083201432/jetty4/
[junit4:junit4]   2> 12266 T30 oasc.JmxMonitoredMap.<init> JMX monitoring is enabled. Adding Solr mbeans to JMX Server: com.sun.jmx.mbeanserver.JmxMBeanServer@334b4cb
[junit4:junit4]   2> 12267 T30 oasc.SolrCore.getNewIndexDir WARNING New index directory detected: old=null new=./org.apache.solr.cloud.SyncSliceTest-1348083201432/jetty4/index/
[junit4:junit4]   2> 12268 T30 oasc.SolrCore.initIndex WARNING [collection1] Solr index directory './org.apache.solr.cloud.SyncSliceTest-1348083201432/jetty4/index' doesn't exist. Creating new index...
[junit4:junit4]   2> 12269 T30 oasc.CachingDirectoryFactory.get return new directory for /usr/home/hudson/hudson-slave/workspace/Lucene-Solr-Tests-4.x-java7/solr/build/solr-core/test/J1/./org.apache.solr.cloud.SyncSliceTest-1348083201432/jetty4/index forceNew:false
[junit4:junit4]   2> 12287 T30 oasc.SolrDeletionPolicy.onCommit SolrDeletionPolicy.onCommit: commits:num=1
[junit4:junit4]   2> 		commit{dir=NRTCachingDirectory(org.apache.lucene.store.NIOFSDirectory@/usr/home/hudson/hudson-slave/workspace/Lucene-Solr-Tests-4.x-java7/solr/build/solr-core/test/J1/org.apache.solr.cloud.SyncSliceTest-1348083201432/jetty4/index lockFactory=org.apache.lucene.store.NativeFSLockFactory@ce8b29d; maxCacheMB=48.0 maxMergeSizeMB=4.0),segFN=segments_1,generation=1,filenames=[segments_1]
[junit4:junit4]   2> 12287 T30 oasc.SolrDeletionPolicy.updateCommits newest commit = 1
[junit4:junit4]   2> 12288 T30 oasc.SolrCore.initWriters created xml: solr.XMLResponseWriter
[junit4:junit4]   2> 12290 T30 oasup.UpdateRequestProcessorChain.init inserting DistributedUpdateProcessorFactory into updateRequestProcessorChain "dedupe"
[junit4:junit4]   2> 12291 T30 oasup.UpdateRequestProcessorChain.init inserting DistributedUpdateProcessorFactory into updateRequestProcessorChain "dedupe-allfields"
[junit4:junit4]   2> 12291 T30 oasup.UpdateRequestProcessorChain.init inserting DistributedUpdateProcessorFactory into updateRequestProcessorChain "stored_sig"
[junit4:junit4]   2> 12292 T30 oasup.UpdateRequestProcessorChain.init inserting DistributedUpdateProcessorFactory into updateRequestProcessorChain "uniq-fields"
[junit4:junit4]   2> 12293 T30 oasup.UpdateRequestProcessorChain.init inserting DistributedUpdateProcessorFactory into updateRequestProcessorChain "distrib-dup-test-chain-implicit"
[junit4:junit4]   2> 12293 T30 oasc.RequestHandlers.initHandlersFromConfig adding lazy requestHandler: solr.ReplicationHandler
[junit4:junit4]   2> 12294 T30 oasc.RequestHandlers.initHandlersFromConfig created /replication: solr.ReplicationHandler
[junit4:junit4]   2> 12294 T30 oasc.RequestHandlers.initHandlersFromConfig created standard: solr.StandardRequestHandler
[junit4:junit4]   2> 12295 T30 oasc.RequestHandlers.initHandlersFromConfig created /get: solr.RealTimeGetHandler
[junit4:junit4]   2> 12296 T30 oasc.RequestHandlers.initHandlersFromConfig created dismax: solr.SearchHandler
[junit4:junit4]   2> 12297 T30 oasc.RequestHandlers.initHandlersFromConfig created mock: org.apache.solr.core.MockQuerySenderListenerReqHandler
[junit4:junit4]   2> 12297 T30 oasc.RequestHandlers.initHandlersFromConfig created /admin/: org.apache.solr.handler.admin.AdminHandlers
[junit4:junit4]   2> 12298 T30 oasc.RequestHandlers.initHandlersFromConfig created defaults: solr.StandardRequestHandler
[junit4:junit4]   2> 12298 T30 oasc.RequestHandlers.initHandlersFromConfig adding lazy requestHandler: solr.StandardRequestHandler
[junit4:junit4]   2> 12299 T30 oasc.RequestHandlers.initHandlersFromConfig created lazy: solr.StandardRequestHandler
[junit4:junit4]   2> 12300 T30 oasc.RequestHandlers.initHandlersFromConfig created /update: solr.UpdateRequestHandler
[junit4:junit4]   2> 12300 T30 oasc.RequestHandlers.initHandlersFromConfig created /terms: org.apache.solr.handler.component.SearchHandler
[junit4:junit4]   2> 12301 T30 oasc.RequestHandlers.initHandlersFromConfig created spellCheckCompRH: org.apache.solr.handler.component.SearchHandler
[junit4:junit4]   2> 12302 T30 oasc.RequestHandlers.initHandlersFromConfig created spellCheckCompRH_Direct: org.apache.solr.handler.component.SearchHandler
[junit4:junit4]   2> 12302 T30 oasc.RequestHandlers.initHandlersFromConfig created spellCheckWithWordbreak: org.apache.solr.handler.component.SearchHandler
[junit4:junit4]   2> 12303 T30 oasc.RequestHandlers.initHandlersFromConfig created spellCheckWithWordbreak_Direct: org.apache.solr.handler.component.SearchHandler
[junit4:junit4]   2> 12304 T30 oasc.RequestHandlers.initHandlersFromConfig created spellCheckCompRH1: org.apache.solr.handler.component.SearchHandler
[junit4:junit4]   2> 12304 T79 C8 P14410 oash.ReplicationHandler.inform Commits will be reserved for  10000
[junit4:junit4]   2> 12304 T30 oasc.RequestHandlers.initHandlersFromConfig created tvrh: org.apache.solr.handler.component.SearchHandler
[junit4:junit4]   2> 12304 T79 C8 P14410 oascsi.HttpClientUtil.createClient Creating new http client, config:connTimeout=5000&socketTimeout=20000&allowCompression=false&maxConnections=10000&maxConnectionsPerHost=10000
[junit4:junit4]   2> 12305 T30 oasc.RequestHandlers.initHandlersFromConfig created /mlt: solr.MoreLikeThisHandler
[junit4:junit4]   2> 12306 T30 oasc.RequestHandlers.initHandlersFromConfig created /debug/dump: solr.DumpRequestHandler
[junit4:junit4]   2> 12309 T30 oashl.XMLLoader.init xsltCacheLifetimeSeconds=60
[junit4:junit4]   2> 12313 T30 oasc.SolrCore.initDeprecatedSupport WARNING solrconfig.xml uses deprecated <admin/gettableFiles>, Please update your config to use the ShowFileRequestHandler.
[junit4:junit4]   2> 12314 T30 oasc.SolrCore.initDeprecatedSupport WARNING adding ShowFileRequestHandler with hidden files: [SCHEMA.XML, OLD_SYNONYMS.TXT, STOPWORDS.TXT, PROTWORDS.TXT, OPEN-EXCHANGE-RATES.JSON, SYNONYMS.TXT, CURRENCY.XML, MAPPING-ISOLATIN1ACCENT.TXT]
[junit4:junit4]   2> 12318 T30 oass.SolrIndexSearcher.<init> Opening Searcher@22889c88 main
[junit4:junit4]   2> 12319 T30 oasu.CommitTracker.<init> Hard AutoCommit: disabled
[junit4:junit4]   2> 12319 T30 oasu.CommitTracker.<init> Soft AutoCommit: disabled
[junit4:junit4]   2> 12320 T30 oashc.SpellCheckComponent.inform Initializing spell checkers
[junit4:junit4]   2> 12324 T79 C8 P14410 oash.SnapPuller.<init>  No value set for 'pollInterval'. Timer Task not started.
[junit4:junit4]   2> 12328 T30 oass.DirectSolrSpellChecker.init init: {name=direct,classname=DirectSolrSpellChecker,field=lowerfilt,minQueryLength=3}
[junit4:junit4]   2> 12382 T106 oasc.SolrCore.registerSearcher [collection1] Registered new searcher Searcher@22889c88 main{StandardDirectoryReader(segments_1:1)}
[junit4:junit4]   2> 12383 T61 C9 P42619 oash.ReplicationHandler.inform Commits will be reserved for  10000
[junit4:junit4]   2> 12384 T61 C9 P42619 REQ /replication {command=indexversion&wt=javabin&qt=/replication&version=2} status=0 QTime=57 
[junit4:junit4]   2> 12388 T79 C8 P14410 oasc.SolrDeletionPolicy.onInit SolrDeletionPolicy.onInit: commits:num=1
[junit4:junit4]   2> 		commit{dir=NRTCachingDirectory(org.apache.lucene.store.NIOFSDirectory@/usr/home/hudson/hudson-slave/workspace/Lucene-Solr-Tests-4.x-java7/solr/build/solr-core/test/J1/org.apache.solr.cloud.SyncSliceTest-1348083201432/jetty2/index lockFactory=org.apache.lucene.store.NativeFSLockFactory@265b98b6; maxCacheMB=48.0 maxMergeSizeMB=4.0),segFN=segments_1,generation=1,filenames=[segments_1]
[junit4:junit4]   2> 12388 T79 C8 P14410 oasc.SolrDeletionPolicy.updateCommits newest commit = 1
[junit4:junit4]   2> 12389 T79 C8 P14410 oasu.DirectUpdateHandler2.commit start commit{flags=0,_version_=0,optimize=false,openSearcher=true,waitSearcher=true,expungeDeletes=false,softCommit=false}
[junit4:junit4]   2> 12400 T79 C8 P14410 oasc.SolrDeletionPolicy.onCommit SolrDeletionPolicy.onCommit: commits:num=2
[junit4:junit4]   2> 		commit{dir=NRTCachingDirectory(org.apache.lucene.store.NIOFSDirectory@/usr/home/hudson/hudson-slave/workspace/Lucene-Solr-Tests-4.x-java7/solr/build/solr-core/test/J1/org.apache.solr.cloud.SyncSliceTest-1348083201432/jetty2/index lockFactory=org.apache.lucene.store.NativeFSLockFactory@265b98b6; maxCacheMB=48.0 maxMergeSizeMB=4.0),segFN=segments_1,generation=1,filenames=[segments_1]
[junit4:junit4]   2> 		commit{dir=NRTCachingDirectory(org.apache.lucene.store.NIOFSDirectory@/usr/home/hudson/hudson-slave/workspace/Lucene-Solr-Tests-4.x-java7/solr/build/solr-core/test/J1/org.apache.solr.cloud.SyncSliceTest-1348083201432/jetty2/index lockFactory=org.apache.lucene.store.NativeFSLockFactory@265b98b6; maxCacheMB=48.0 maxMergeSizeMB=4.0),segFN=segments_2,generation=2,filenames=[segments_2]
[junit4:junit4]   2> 12400 T79 C8 P14410 oasc.SolrDeletionPolicy.updateCommits newest commit = 2
[junit4:junit4]   2> 12403 T79 C8 P14410 oass.SolrIndexSearcher.<init> Opening Searcher@6bbcee8a main
[junit4:junit4]   2> 12404 T79 C8 P14410 oasu.DirectUpdateHandler2.commit end_commit_flush
[junit4:junit4]   2> 12407 T78 oasc.SolrCore.registerSearcher [collection1] Registered new searcher Searcher@6bbcee8a main{StandardDirectoryReader(segments_2:2)}
[junit4:junit4]   2> 12408 T79 C8 P14410 oasc.RecoveryStrategy.replay No replay needed. core=collection1
[junit4:junit4]   2> 12408 T79 C8 P14410 oasc.RecoveryStrategy.doRecovery Replication Recovery was successful - registering as Active. core=collection1
[junit4:junit4]   2> 12410 T79 C8 P14410 oasc.RecoveryStrategy.doRecovery Finished recovery process. core=collection1
[junit4:junit4]   2> 12627 T52 oascc.ZkStateReader.updateClusterState Updating cloud state from ZooKeeper... 
[junit4:junit4]   2> 12661 T65 oascc.ZkStateReader$2.process A cluster state change has occurred - updating...
[junit4:junit4]   2> 12662 T51 oascc.ZkStateReader$2.process A cluster state change has occurred - updating...
[junit4:junit4]   2> 12662 T105 oascc.ZkStateReader$2.process A cluster state change has occurred - updating...
[junit4:junit4]   2> 12662 T77 oascc.ZkStateReader$2.process A cluster state change has occurred - updating...
[junit4:junit4]   2> 12662 T91 oascc.ZkStateReader$2.process A cluster state change has occurred - updating...
[junit4:junit4]   2> 12890 T30 oasc.CoreContainer.register registering core: collection1
[junit4:junit4]   2> 12890 T30 oasc.ZkController.register Register shard - core:collection1 address:http://127.0.0.1:10752/solr shardId:shard1
[junit4:junit4]   2> 12911 T30 oasc.ZkController.register We are http://127.0.0.1:10752/solr/collection1/ and leader is http://127.0.0.1:42619/solr/collection1/
[junit4:junit4]   2> 12912 T30 oasc.ZkController.register No LogReplay needed for core=collection1 baseURL=http://127.0.0.1:10752/solr
[junit4:junit4]   2> 12912 T30 oasc.ZkController.checkRecovery Core needs to recover:collection1
[junit4:junit4]   2> 12912 T30 oasu.DefaultSolrCoreState.doRecovery Running recovery - first canceling any ongoing recovery
[junit4:junit4]   2> ASYNC  NEW_CORE C11 name=collection1 org.apache.solr.core.SolrCore@129425fe url=http://127.0.0.1:10752/solr/collection1 node=127.0.0.1:10752_solr
[junit4:junit4]   2> 12913 T107 C11 P10752 oasc.RecoveryStrategy.run Starting recovery process.  core=collection1 recoveringAfterStartup=true
[junit4:junit4]   2> 12914 T30 oascc.ZkStateReader.updateClusterState Updating cloud state from ZooKeeper... 
[junit4:junit4]   2> 12914 T107 C11 P10752 oasc.RecoveryStrategy.doRecovery ###### startupVersions=[]
[junit4:junit4]   2> 12915 T30 oass.SolrDispatchFilter.init user.dir=/usr/home/hudson/hudson-slave/workspace/Lucene-Solr-Tests-4.x-java7/solr/build/solr-core/test/J1
[junit4:junit4]   2> 12915 T30 oass.SolrDispatchFilter.init SolrDispatchFilter.init() done
[junit4:junit4]   2> 12916 T107 C11 P10752 oasc.RecoveryStrategy.doRecovery Attempting to PeerSync from http://127.0.0.1:42619/solr/collection1/ core=collection1 - recoveringAfterStartup=true
[junit4:junit4]   2> 12916 T30 oascsi.HttpClientUtil.createClient Creating new http client, config:maxConnections=128&maxConnectionsPerHost=32&followRedirects=false
[junit4:junit4]   2> 12916 T107 C11 P10752 oasu.PeerSync.sync PeerSync: core=collection1 url=http://127.0.0.1:10752/solr START replicas=[http://127.0.0.1:42619/solr/collection1/] nUpdates=100
[junit4:junit4]   2> 12917 T107 C11 P10752 oasu.PeerSync.sync WARNING no frame of reference to tell of we've missed updates
[junit4:junit4]   2> 12917 T107 C11 P10752 oasc.RecoveryStrategy.doRecovery PeerSync Recovery was not successful - trying replication. core=collection1
[junit4:junit4]   2> 12917 T107 C11 P10752 oasc.RecoveryStrategy.doRecovery Starting Replication Recovery. core=collection1
[junit4:junit4]   2> 12918 T107 C11 P10752 oascsi.HttpClientUtil.createClient Creating new http client, config:maxConnections=128&maxConnectionsPerHost=32&followRedirects=false
[junit4:junit4]   2> 12920 T58 C9 P42619 REQ /get {distrib=false&qt=/get&wt=javabin&version=2&getVersions=100} status=0 QTime=0 
[junit4:junit4]   2> 12937 T30 oaz.ZooKeeper.<init> Initiating client connection, connectString=127.0.0.1:26833/solr sessionTimeout=10000 watcher=org.apache.solr.common.cloud.ConnectionManager@8ddf7a4
[junit4:junit4]   2> 12938 T109 oaz.ClientCnxn$SendThread.startConnect Opening socket connection to server /127.0.0.1:26833
[junit4:junit4]   2> 12938 T30 oascc.ConnectionManager.waitForConnected Waiting for client to connect to ZooKeeper
[junit4:junit4]   2> 12939 T109 oaz.ClientCnxn$SendThread.primeConnection Socket connection established to localhost/127.0.0.1:26833, initiating session
[junit4:junit4]   2> 12939 T32 oazs.NIOServerCnxn$Factory.run Accepted socket connection from /140.211.11.196:45371
[junit4:junit4]   2> 12939 T32 oazs.NIOServerCnxn.readConnectRequest Client attempting to establish new session at /140.211.11.196:45371
[junit4:junit4]   2> 12941 T34 oazs.NIOServerCnxn.finishSessionInit Established session 0x139e005369a0007 with negotiated timeout 10000 for client /140.211.11.196:45371
[junit4:junit4]   2> 12941 T109 oaz.ClientCnxn$SendThread.readConnectResult Session establishment complete on server localhost/127.0.0.1:26833, sessionid = 0x139e005369a0007, negotiated timeout = 10000
[junit4:junit4]   2> 12941 T110 oascc.ConnectionManager.process Watcher org.apache.solr.common.cloud.ConnectionManager@8ddf7a4 name:ZooKeeperConnection Watcher:127.0.0.1:26833/solr got event WatchedEvent state:SyncConnected type:None path:null path:null type:None
[junit4:junit4]   2> 12942 T30 oascc.ConnectionManager.waitForConnected Client is connected to ZooKeeper
[junit4:junit4]   2> 12942 T30 oascc.ZkStateReader.createClusterStateWatchersAndUpdate Updating cluster state from ZooKeeper... 
[junit4:junit4]   2> 12947 T30 oasc.ChaosMonkey.monkeyLog monkey: init - expire sessions:true cause connection loss:true
[junit4:junit4]   2> 12948 T30 oascsi.HttpClientUtil.createClient Creating new http client, config:
[junit4:junit4]   2> 12961 T30 oascc.ZkStateReader.updateClusterState Updating cloud state from ZooKeeper... 
[junit4:junit4]   2> 12962 T30 oasc.AbstractFullDistribZkTestBase.waitForThingsToLevelOut Wait for recoveries to finish - wait 15 for each attempt
[junit4:junit4]   2> 12963 T30 oasc.AbstractDistribZkTestBase.waitForRecoveriesToFinish Wait for recoveries to finish - collection: collection1 failOnTimeout:true timeout (sec):15
[junit4:junit4]   2> 12964 T30 oascc.ZkStateReader.updateClusterState Updating cloud state from ZooKeeper... 
[junit4:junit4]   2> 13171 T52 oascc.ZkStateReader.updateClusterState Updating cloud state from ZooKeeper... 
[junit4:junit4]   2> 13191 T110 oascc.ZkStateReader$2.process A cluster state change has occurred - updating...
[junit4:junit4]   2> 13191 T105 oascc.ZkStateReader$2.process A cluster state change has occurred - updating...
[junit4:junit4]   2> 13191 T77 oascc.ZkStateReader$2.process A cluster state change has occurred - updating...
[junit4:junit4]   2> 13191 T51 oascc.ZkStateReader$2.process A cluster state change has occurred - updating...
[junit4:junit4]   2> 13191 T65 oascc.ZkStateReader$2.process A cluster state change has occurred - updating...
[junit4:junit4]   2> 13191 T91 oascc.ZkStateReader$2.process A cluster state change has occurred - updating...
[junit4:junit4]   2>  C10_STATE=coll:collection1 core:collection1 props:{shard=shard1, roles=null, state=recovering, core=collection1, collection=collection1, node_name=127.0.0.1:59599_solr, base_url=http://127.0.0.1:59599/solr}
[junit4:junit4]   2> 13836 T93 C10 P59599 oasc.RecoveryStrategy.doRecovery Begin buffering updates. core=collection1
[junit4:junit4]   2> 13836 T93 C10 P59599 oasu.UpdateLog.bufferUpdates Starting to buffer updates. FSUpdateLog{state=ACTIVE, tlog=null}
[junit4:junit4]   2> 13837 T93 C10 P59599 oasc.RecoveryStrategy.replicate Attempting to replicate from http://127.0.0.1:42619/solr/collection1/. core=collection1
[junit4:junit4]   2> 13837 T93 C10 P59599 oascsi.HttpClientUtil.createClient Creating new http client, config:maxConnections=128&maxConnectionsPerHost=32&followRedirects=false
[junit4:junit4]   2> 13854 T63 C9 P42619 oasu.DirectUpdateHandler2.commit start commit{flags=0,_version_=0,optimize=false,openSearcher=true,waitSearcher=true,expungeDeletes=false,softCommit=false}
[junit4:junit4]   2> 13859 T63 C9 P42619 oass.SolrIndexSearcher.<init> Opening Searcher@3c04b8b3 main
[junit4:junit4]   2> 13860 T63 C9 P42619 oasu.DirectUpdateHandler2.commit end_commit_flush
[junit4:junit4]   2> 13862 T66 oasc.SolrCore.registerSearcher [collection1] Registered new searcher Searcher@3c04b8b3 main{StandardDirectoryReader(segments_1:1)}
[junit4:junit4]   2> 13863 T63 C9 P42619 /update {waitSearcher=true&commit=true&commit_end_point=true&wt=javabin&softCommit=false&version=2} {commit=} 0 9
[junit4:junit4]   2> 13865 T93 C10 P59599 oash.ReplicationHandler.inform Commits will be reserved for  10000
[junit4:junit4]   2> 13865 T93 C10 P59599 oash.SnapPuller.<init>  No value set for 'pollInterval'. Timer Task not started.
[junit4:junit4]   2> 13869 T61 C9 P42619 REQ /replication {command=indexversion&wt=javabin&qt=/replication&version=2} status=0 QTime=0 
[junit4:junit4]   2> 13876 T93 C10 P59599 oasc.SolrDeletionPolicy.onInit SolrDeletionPolicy.onInit: commits:num=1
[junit4:junit4]   2> 		commit{dir=NRTCachingDirectory(org.apache.lucene.store.NIOFSDirectory@/usr/home/hudson/hudson-slave/workspace/Lucene-Solr-Tests-4.x-java7/solr/build/solr-core/test/J1/org.apache.solr.cloud.SyncSliceTest-1348083201432/jetty3/index lockFactory=org.apache.lucene.store.NativeFSLockFactory@491a7bf0; maxCacheMB=48.0 maxMergeSizeMB=4.0),segFN=segments_1,generation=1,filenames=[segments_1]
[junit4:junit4]   2> 13877 T93 C10 P59599 oasc.SolrDeletionPolicy.updateCommits newest commit = 1
[junit4:junit4]   2> 13878 T93 C10 P59599 oasu.DirectUpdateHandler2.commit start commit{flags=0,_version_=0,optimize=false,openSearcher=true,waitSearcher=true,expungeDeletes=false,softCommit=false}
[junit4:junit4]   2> 13885 T93 C10 P59599 oasc.SolrDeletionPolicy.onCommit SolrDeletionPolicy.onCommit: commits:num=2
[junit4:junit4]   2> 		commit{dir=NRTCachingDirectory(org.apache.lucene.store.NIOFSDirectory@/usr/home/hudson/hudson-slave/workspace/Lucene-Solr-Tests-4.x-java7/solr/build/solr-core/test/J1/org.apache.solr.cloud.SyncSliceTest-1348083201432/jetty3/index lockFactory=org.apache.lucene.store.NativeFSLockFactory@491a7bf0; maxCacheMB=48.0 maxMergeSizeMB=4.0),segFN=segments_1,generation=1,filenames=[segments_1]
[junit4:junit4]   2> 		commit{dir=NRTCachingDirectory(org.apache.lucene.store.NIOFSDirectory@/usr/home/hudson/hudson-slave/workspace/Lucene-Solr-Tests-4.x-java7/solr/build/solr-core/test/J1/org.apache.solr.cloud.SyncSliceTest-1348083201432/jetty3/index lockFactory=org.apache.lucene.store.NativeFSLockFactory@491a7bf0; maxCacheMB=48.0 maxMergeSizeMB=4.0),segFN=segments_2,generation=2,filenames=[segments_2]
[junit4:junit4]   2> 13885 T93 C10 P59599 oasc.SolrDeletionPolicy.updateCommits newest commit = 2
[junit4:junit4]   2> 13890 T93 C10 P59599 oass.SolrIndexSearcher.<init> Opening Searcher@3fc35fe1 main
[junit4:junit4]   2> 13890 T93 C10 P59599 oasu.DirectUpdateHandler2.commit end_commit_flush
[junit4:junit4]   2> 13893 T92 oasc.SolrCore.registerSearcher [collection1] Registered new searcher Searcher@3fc35fe1 main{StandardDirectoryReader(segments_2:2)}
[junit4:junit4]   2> 13894 T93 C10 P59599 oasc.RecoveryStrategy.replay No replay needed. core=collection1
[junit4:junit4]   2> 13894 T93 C10 P59599 oasc.RecoveryStrategy.doRecovery Replication Recovery was successful - registering as Active. core=collection1
[junit4:junit4]   2> 13896 T93 C10 P59599 oasc.RecoveryStrategy.doRecovery Finished recovery process. core=collection1
[junit4:junit4]   2> 13966 T30 oascc.ZkStateReader.updateClusterState Updating cloud state from ZooKeeper... 
[junit4:junit4]   2> 14205 T52 oascc.ZkStateReader.updateClusterState Updating cloud state from ZooKeeper... 
[junit4:junit4]   2> 14219 T65 oascc.ZkStateReader$2.process A cluster state change has occurred - updating...
[junit4:junit4]   2> 14219 T77 oascc.ZkStateReader$2.process A cluster state change has occurred - updating...
[junit4:junit4]   2> 14219 T105 oascc.ZkStateReader$2.process A cluster state change has occurred - updating...
[junit4:junit4]   2> 14219 T51 oascc.ZkStateReader$2.process A cluster state change has occurred - updating...
[junit4:junit4]   2> 14219 T91 oascc.ZkStateReader$2.process A cluster state change has occurred - updating...
[junit4:junit4]   2> 14219 T110 oascc.ZkStateReader$2.process A cluster state change has occurred - updating...
[junit4:junit4]   2> 14969 T30 oascc.ZkStateReader.updateClusterState Updating cloud state from ZooKeeper... 
[junit4:junit4]   2>  C11_STATE=coll:collection1 core:collection1 props:{shard=shard1, roles=null, state=recovering, core=collection1, collection=collection1, node_name=127.0.0.1:10752_solr, base_url=http://127.0.0.1:10752/solr}
[junit4:junit4]   2> 15937 T107 C11 P10752 oasc.RecoveryStrategy.doRecovery Begin buffering updates. core=collection1
[junit4:junit4]   2> 15937 T107 C11 P10752 oasu.UpdateLog.bufferUpdates Starting to buffer updates. FSUpdateLog{state=ACTIVE, tlog=null}
[junit4:junit4]   2> 15938 T107 C11 P10752 oasc.RecoveryStrategy.replicate Attempting to replicate from http://127.0.0.1:42619/solr/collection1/. core=collection1
[junit4:junit4]   2> 15938 T107 C11 P10752 oascsi.HttpClientUtil.createClient Creating new http client, config:maxConnections=128&maxConnectionsPerHost=32&followRedirects=false
[junit4:junit4]   2> 15957 T57 C9 P42619 oasu.DirectUpdateHandler2.commit start commit{flags=0,_version_=0,optimize=false,openSearcher=true,waitSearcher=true,expungeDeletes=false,softCommit=false}
[junit4:junit4]   2> 15960 T57 C9 P42619 oass.SolrIndexSearcher.<init> Opening Searcher@30620af1 main
[junit4:junit4]   2> 15961 T57 C9 P42619 oasu.DirectUpdateHandler2.commit end_commit_flush
[junit4:junit4]   2> 15964 T66 oasc.SolrCore.registerSearcher [collection1] Registered new searcher Searcher@30620af1 main{StandardDirectoryReader(segments_1:1)}
[junit4:junit4]   2> 15965 T57 C9 P42619 /update {waitSearcher=true&commit=true&commit_end_point=true&wt=javabin&softCommit=false&version=2} {commit=} 0 7
[junit4:junit4]   2> 15966 T107 C11 P10752 oash.ReplicationHandler.inform Commits will be reserved for  10000
[junit4:junit4]   2> 15966 T107 C11 P10752 oash.SnapPuller.<init>  No value set for 'pollInterval'. Timer Task not started.
[junit4:junit4]   2> 15970 T61 C9 P42619 REQ /replication {command=indexversion&wt=javabin&qt=/replication&version=2} status=0 QTime=1 
[junit4:junit4]   2> 15972 T30 oascc.ZkStateReader.updateClusterState Updating cloud state from ZooKeeper... 
[junit4:junit4]   2> 15975 T107 C11 P10752 oasc.SolrDeletionPolicy.onInit SolrDeletionPolicy.onInit: commits:num=1
[junit4:junit4]   2> 		commit{dir=NRTCachingDirectory(org.apache.lucene.store.NIOFSDirectory@/usr/home/hudson/hudson-slave/workspace/Lucene-Solr-Tests-4.x-java7/solr/build/solr-core/test/J1/org.apache.solr.cloud.SyncSliceTest-1348083201432/jetty4/index lockFactory=org.apache.lucene.store.NativeFSLockFactory@ce8b29d; maxCacheMB=48.0 maxMergeSizeMB=4.0),segFN=segments_1,generation=1,filenames=[segments_1]
[junit4:junit4]   2> 15976 T107 C11 P10752 oasc.SolrDeletionPolicy.updateCommits newest commit = 1
[junit4:junit4]   2> 15977 T107 C11 P10752 oasu.DirectUpdateHandler2.commit start commit{flags=0,_version_=0,optimize=false,openSearcher=true,waitSearcher=true,expungeDeletes=false,softCommit=false}
[junit4:junit4]   2> 15991 T107 C11 P10752 oasc.SolrDeletionPolicy.onCommit SolrDeletionPolicy.onCommit: commits:num=2
[junit4:junit4]   2> 		commit{dir=NRTCachingDirectory(org.apache.lucene.store.NIOFSDirectory@/usr/home/hudson/hudson-slave/workspace/Lucene-Solr-Tests-4.x-java7/solr/build/solr-core/test/J1/org.apache.solr.cloud.SyncSliceTest-1348083201432/jetty4/index lockFactory=org.apache.lucene.store.NativeFSLockFactory@ce8b29d; maxCacheMB=48.0 maxMergeSizeMB=4.0),segFN=segments_1,generation=1,filenames=[segments_1]
[junit4:junit4]   2> 		commit{dir=NRTCachingDirectory(org.apache.lucene.store.NIOFSDirectory@/usr/home/hudson/hudson-slave/workspace/Lucene-Solr-Tests-4.x-java7/solr/build/solr-core/test/J1/org.apache.solr.cloud.SyncSliceTest-1348083201432/jetty4/index lockFactory=org.apache.lucene.store.NativeFSLockFactory@ce8b29d; maxCacheMB=48.0 maxMergeSizeMB=4.0),segFN=segments_2,generation=2,filenames=[segments_2]
[junit4:junit4]   2> 15992 T107 C11 P10752 oasc.SolrDeletionPolicy.updateCommits newest commit = 2
[junit4:junit4]   2> 15995 T107 C11 P10752 oass.SolrIndexSearcher.<init> Opening Searcher@5416c6a6 main
[junit4:junit4]   2> 15996 T107 C11 P10752 oasu.DirectUpdateHandler2.commit end_commit_flush
[junit4:junit4]   2> 15999 T106 oasc.SolrCore.registerSearcher [collection1] Registered new searcher Searcher@5416c6a6 main{StandardDirectoryReader(segments_2:2)}
[junit4:junit4]   2> 16001 T107 C11 P10752 oasc.RecoveryStrategy.replay No replay needed. core=collection1
[junit4:junit4]   2> 16001 T107 C11 P10752 oasc.RecoveryStrategy.doRecovery Replication Recovery was successful - registering as Active. core=collection1
[junit4:junit4]   2> 16003 T107 C11 P10752 oasc.RecoveryStrategy.doRecovery Finished recovery process. core=collection1
[junit4:junit4]   2> 16232 T52 oascc.ZkStateReader.updateClusterState Updating cloud state from ZooKeeper... 
[junit4:junit4]   2> 16272 T110 oascc.ZkStateReader$2.process A cluster state change has occurred - updating...
[junit4:junit4]   2> 16272 T65 oascc.ZkStateReader$2.process A cluster state change has occurred - updating...
[junit4:junit4]   2> 16272 T91 oascc.ZkStateReader$2.process A cluster state change has occurred - updating...
[junit4:junit4]   2> 16273 T51 oascc.ZkStateReader$2.process A cluster state change has occurred - updating...
[junit4:junit4]   2> 16273 T105 oascc.ZkStateReader$2.process A cluster state change has occurred - updating...
[junit4:junit4]   2> 16273 T77 oascc.ZkStateReader$2.process A cluster state change has occurred - updating...
[junit4:junit4]   2> 16975 T30 oascc.ZkStateReader.updateClusterState Updating cloud state from ZooKeeper... 
[junit4:junit4]   2> ASYNC  NEW_CORE C12 name=collection1 org.apache.solr.core.SolrCore@2cf530f1 url=http://127.0.0.1:31644/solr/collection1 node=127.0.0.1:31644_solr
[junit4:junit4]   2> 16989 T43 C12 P31644 oasu.DirectUpdateHandler2.commit start commit{flags=0,_version_=0,optimize=false,openSearcher=true,waitSearcher=true,expungeDeletes=false,softCommit=false}
[junit4:junit4]   2> 16994 T43 C12 P31644 oasc.SolrDeletionPolicy.onInit SolrDeletionPolicy.onInit: commits:num=1
[junit4:junit4]   2> 		commit{dir=NRTCachingDirectory(org.apache.lucene.store.NIOFSDirectory@/usr/home/hudson/hudson-slave/workspace/Lucene-Solr-Tests-4.x-java7/solr/build/solr-core/test/J1/org.apache.solr.cloud.SyncSliceTest-1348083201432/control/data/index lockFactory=org.apache.lucene.store.NativeFSLockFactory@3ec7195b; maxCacheMB=48.0 maxMergeSizeMB=4.0),segFN=segments_1,generation=1,filenames=[segments_1]
[junit4:junit4]   2> 16995 T43 C12 P31644 oasc.SolrDeletionPolicy.updateCommits newest commit = 1
[junit4:junit4]   2> 16997 T43 C12 P31644 oass.SolrIndexSearcher.<init> Opening Searcher@20fb9a6c main
[junit4:junit4]   2> 16997 T43 C12 P31644 oasu.DirectUpdateHandler2.commit end_commit_flush
[junit4:junit4]   2> 17000 T54 oasc.SolrCore.registerSearcher [collection1] Registered new searcher Searcher@20fb9a6c main{StandardDirectoryReader(segments_1:1)}
[junit4:junit4]   2> 17001 T43 C12 P31644 /update {waitSearcher=true&wt=javabin&commit=true&softCommit=false&version=2} {commit=} 0 12
[junit4:junit4]   2> 17003 T30 oaz.ZooKeeper.<init> Initiating client connection, connectString=127.0.0.1:26833/solr sessionTimeout=10000 watcher=org.apache.solr.common.cloud.ConnectionManager@7d267d9d
[junit4:junit4]   2> 17004 T111 oaz.ClientCnxn$SendThread.startConnect Opening socket connection to server /127.0.0.1:26833
[junit4:junit4]   2> 17004 T30 oascc.ConnectionManager.waitForConnected Waiting for client to connect to ZooKeeper
[junit4:junit4]   2> 17005 T111 oaz.ClientCnxn$SendThread.primeConnection Socket connection established to localhost/127.0.0.1:26833, initiating session
[junit4:junit4]   2> 17005 T32 oazs.NIOServerCnxn$Factory.run Accepted socket connection from /140.211.11.196:35883
[junit4:junit4]   2> 17006 T32 oazs.NIOServerCnxn.readConnectRequest Client attempting to establish new session at /140.211.11.196:35883
[junit4:junit4]   2> 17008 T34 oazs.NIOServerCnxn.finishSessionInit Established session 0x139e005369a0008 with negotiated timeout 10000 for client /140.211.11.196:35883
[junit4:junit4]   2> 17008 T111 oaz.ClientCnxn$SendThread.readConnectResult Session establishment complete on server localhost/127.0.0.1:26833, sessionid = 0x139e005369a0008, negotiated timeout = 10000
[junit4:junit4]   2> 17009 T112 oascc.ConnectionManager.process Watcher org.apache.solr.common.cloud.ConnectionManager@7d267d9d name:ZooKeeperConnection Watcher:127.0.0.1:26833/solr got event WatchedEvent state:SyncConnected type:None path:null path:null type:None
[junit4:junit4]   2> 17009 T30 oascc.ConnectionManager.waitForConnected Client is connected to ZooKeeper
[junit4:junit4]   2> 17011 T30 oascc.ZkStateReader.createClusterStateWatchersAndUpdate Updating cluster state from ZooKeeper... 
[junit4:junit4]   2> 17029 T59 C9 P42619 oasu.DirectUpdateHandler2.commit start commit{flags=0,_version_=0,optimize=false,openSearcher=true,waitSearcher=true,expungeDeletes=false,softCommit=false}
[junit4:junit4]   2> 17032 T59 C9 P42619 oass.SolrIndexSearcher.<init> Opening Searcher@4de2dfad main
[junit4:junit4]   2> 17033 T59 C9 P42619 oasu.DirectUpdateHandler2.commit end_commit_flush
[junit4:junit4]   2> 17036 T66 oasc.SolrCore.registerSearcher [collection1] Registered new searcher Searcher@4de2dfad main{StandardDirectoryReader(segments_1:1)}
[junit4:junit4]   2> 17050 T59 C9 P42619 oasu.SolrCmdDistributor.distribCommit Distrib commit to:[StdNode: http://127.0.0.1:14410/solr/collection1/, StdNode: http://127.0.0.1:59599/solr/collection1/, StdNode: http://127.0.0.1:10752/solr/collection1/]
[junit4:junit4]   2>  C8_STATE=coll:collection1 core:collection1 props:{shard=shard1, roles=null, state=active, core=collection1, collection=collection1, node_name=127.0.0.1:14410_solr, base_url=http://127.0.0.1:14410/solr}
[junit4:junit4]   2> 17085 T69 C8 P14410 oasu.DirectUpdateHandler2.commit start commit{flags=0,_version_=0,optimize=false,openSearcher=true,waitSearcher=true,expungeDeletes=false,softCommit=false}
[junit4:junit4]   2>  C11_STATE=coll:collection1 core:collection1 props:{shard=shard1, roles=null, state=active, core=collection1, collection=collection1, node_name=127.0.0.1:10752_solr, base_url=http://127.0.0.1:10752/solr}
[junit4:junit4]   2> 17085 T97 C11 P10752 oasu.DirectUpdateHandler2.commit start commit{flags=0,_version_=0,optimize=false,openSearcher=true,waitSearcher=true,expungeDeletes=false,softCommit=false}
[junit4:junit4]   2>  C10_STATE=coll:collection1 core:collection1 props:{shard=shard1, roles=null, state=active, core=collection1, collection=collection1, node_name=127.0.0.1:59599_solr, base_url=http://127.0.0.1:59599/solr}
[junit4:junit4]   2> 17085 T83 C10 P59599 oasu.DirectUpdateHandler2.commit start commit{flags=0,_version_=0,optimize=false,openSearcher=true,waitSearcher=true,expungeDeletes=false,softCommit=false}
[junit4:junit4]   2> 17089 T97 C11 P10752 oass.SolrIndexSearcher.<init> Opening Searcher@24802f30 main
[junit4:junit4]   2> 17090 T69 C8 P14410 oass.SolrIndexSearcher.<init> Opening Searcher@5e4a6933 main
[junit4:junit4]   2> 17090 T97 C11 P10752 oasu.DirectUpdateHandler2.commit end_commit_flush
[junit4:junit4]   2> 17090 T69 C8 P14410 oasu.DirectUpdateHandler2.commit end_commit_flush
[junit4:junit4]   2> 17091 T83 C10 P59599 oass.SolrIndexSearcher.<init> Opening Searcher@6758cd8 main
[junit4:junit4]   2> 17092 T83 C10 P59599 oasu.DirectUpdateHandler2.commit end_commit_flush
[junit4:junit4]   2> 17092 T78 oasc.JmxMonitoredMap.put WARNING Failed to register info bean: fieldValueCache javax.management.InstanceAlreadyExistsException: solr/collection1:type=fieldValueCache,id=org.apache.solr.search.FastLRUCache
[junit4:junit4]   2> 	at com.sun.jmx.mbeanserver.Repository.addMBean(Repository.java:437)
[junit4:junit4]   2> 	at com.sun.jmx.interceptor.DefaultMBeanServerInterceptor.registerWithRepository(DefaultMBeanServerInterceptor.java:1898)
[junit4:junit4]   2> 	at com.sun.jmx.interceptor.DefaultMBeanServerInterceptor.registerDynamicMBean(DefaultMBeanServerInterceptor.java:966)
[junit4:junit4]   2> 	at com.sun.jmx.interceptor.DefaultMBeanServerInterceptor.registerObject(DefaultMBeanServerInterceptor.java:900)
[junit4:junit4]   2> 	at com.sun.jmx.interceptor.DefaultMBeanServerInterceptor.registerMBean(DefaultMBeanServerInterceptor.java:324)
[junit4:junit4]   2> 	at com.sun.jmx.mbeanserver.JmxMBeanServer.registerMBean(JmxMBeanServer.java:512)
[junit4:junit4]   2> 	at org.apache.solr.core.JmxMonitoredMap.put(JmxMonitoredMap.java:140)
[junit4:junit4]   2> 	at org.apache.solr.core.JmxMonitoredMap.put(JmxMonitoredMap.java:51)
[junit4:junit4]   2> 	at org.apache.solr.search.SolrIndexSearcher.register(SolrIndexSearcher.java:246)
[junit4:junit4]   2> 	at org.apache.solr.core.SolrCore.registerSearcher(SolrCore.java:1642)
[junit4:junit4]   2> 	at org.apache.solr.core.SolrCore.access$000(SolrCore.java:121)
[junit4:junit4]   2> 	at org.apache.solr.core.SolrCore$7.call(SolrCore.java:1519)
[junit4:junit4]   2> 	at java.util.concurrent.FutureTask$Sync.innerRun(FutureTask.java:334)
[junit4:junit4]   2> 	at java.util.concurrent.FutureTask.run(FutureTask.java:166)
[junit4:junit4]   2> 	at java.util.concurrent.ThreadPoolExecutor.runWorker(ThreadPoolExecutor.java:1110)
[junit4:junit4]   2> 	at java.util.concurrent.ThreadPoolExecutor$Worker.run(ThreadPoolExecutor.java:603)
[junit4:junit4]   2> 	at java.lang.Thread.run(Thread.java:722)
[junit4:junit4]   2> 
[junit4:junit4]   2> 17093 T106 oasc.SolrCore.registerSearcher [collection1] Registered new searcher Searcher@24802f30 main{StandardDirectoryReader(segments_2:2)}
[junit4:junit4]   2> 17095 T92 oasc.SolrCore.registerSearcher [collection1] Registered new searcher Searcher@6758cd8 main{StandardDirectoryReader(segments_2:2)}
[junit4:junit4]   2> 17095 T97 C11 P10752 /update {waitSearcher=true&commit=true&wt=javabin&commit_end_point=true&expungeDeletes=false&softCommit=false&version=2} {commit=} 0 10
[junit4:junit4]   2> 17096 T78 oasc.SolrCore.registerSearcher [collection1] Registered new searcher Searcher@5e4a6933 main{StandardDirectoryReader(segments_2:2)}
[junit4:junit4]   2> 17096 T83 C10 P59599 /update {waitSearcher=true&commit=true&wt=javabin&commit_end_point=true&expungeDeletes=false&softCommit=false&version=2} {commit=} 0 11
[junit4:junit4]   2> 17096 T69 C8 P14410 /update {waitSearcher=true&commit=true&wt=javabin&commit_end_point=true&expungeDeletes=false&softCommit=false&version=2} {commit=} 0 11
[junit4:junit4]   2> 17097 T59 C9 P42619 /update {waitSearcher=true&wt=javabin&commit=true&softCommit=false&version=2} {commit=} 0 68
[junit4:junit4]   2> 17099 T30 oascc.ZkStateReader.updateClusterState Updating cloud state from ZooKeeper... 
[junit4:junit4]   2> 17125 T60 C9 P42619 REQ /select {distrib=false&wt=javabin&q=*:*&version=2} hits=0 status=0 QTime=5 
[junit4:junit4]   2> 17129 T70 C8 P14410 REQ /select {distrib=false&wt=javabin&q=*:*&version=2} hits=0 status=0 QTime=1 
[junit4:junit4]   2> 17132 T84 C10 P59599 REQ /select {distrib=false&wt=javabin&q=*:*&version=2} hits=0 status=0 QTime=0 
[junit4:junit4]   2> 17136 T98 C11 P10752 REQ /select {distrib=false&wt=javabin&q=*:*&version=2} hits=0 status=0 QTime=0 
[junit4:junit4]   2> 19211 T43 C12 P31644 oass.SolrIndexSearcher.<init> Opening Searcher@5f238a57 realtime
[junit4:junit4]   2> 19212 T43 C12 P31644 /update {wt=javabin&version=2} {deleteByQuery=*:* (-1413567711160565760)} 0 22
[junit4:junit4]   2> 19218 T59 C9 P42619 oass.SolrIndexSearcher.<init> Opening Searcher@3f0a9e6c realtime
[junit4:junit4]   2> 19227 T83 C10 P59599 oass.SolrIndexSearcher.<init> Opening Searcher@5dbc51c realtime
[junit4:junit4]   2> 19227 T83 C10 P59599 REQ /update {update.distrib=FROMLEADER&_version_=-1413567711166857216&update.from=http://127.0.0.1:42619/solr/collection1/&wt=javabin&version=2} status=0 QTime=1 
[junit4:junit4]   2> 19227 T69 C8 P14410 oass.SolrIndexSearcher.<init> Opening Searcher@54ba2e1f realtime
[junit4:junit4]   2> 19228 T97 C11 P10752 oass.SolrIndexSearcher.<init> Opening Searcher@7ac7853b realtime
[junit4:junit4]   2> 19228 T69 C8 P14410 REQ /update {update.distrib=FROMLEADER&_version_=-1413567711166857216&update.from=http://127.0.0.1:42619/solr/collection1/&wt=javabin&version=2} status=0 QTime=2 
[junit4:junit4]   2> 19229 T97 C11 P10752 REQ /update {update.distrib=FROMLEADER&_version_=-1413567711166857216&update.from=http://127.0.0.1:42619/solr/collection1/&wt=javabin&version=2} status=0 QTime=3 
[junit4:junit4]   2> 19230 T59 C9 P42619 /update {wt=javabin&version=2} {deleteByQuery=*:* (-1413567711166857216)} 0 14
[junit4:junit4]   2> 19237 T43 C12 P31644 /update {wt=javabin&version=2} {add=[0 (1413567711185731584)]} 0 4
[junit4:junit4]   2> 19262 T83 C10 P59599 REQ /update {distrib.from=http://127.0.0.1:42619/solr/collection1/&update.distrib=FROMLEADER&wt=javabin&version=2} status=0 QTime=4 
[junit4:junit4]   2> 19263 T69 C8 P14410 REQ /update {distrib.from=http://127.0.0.1:42619/solr/collection1/&update.distrib=FROMLEADER&wt=javabin&version=2} status=0 QTime=5 
[junit4:junit4]   2> 19262 T97 C11 P10752 REQ /update {distrib.from=http://127.0.0.1:42619/solr/collection1/&update.distrib=FROMLEADER&wt=javabin&version=2} status=0 QTime=4 
[junit4:junit4]   2> 19264 T59 C9 P42619 /update {wt=javabin&version=2} {add=[0 (1413567711193071616)]} 0 23
[junit4:junit4]   2> 19271 T43 C12 P31644 /update {wt=javabin&version=2} {add=[1 (1413567711221383168)]} 0 3
[junit4:junit4]   2> 19283 T97 C11 P10752 REQ /update {distrib.from=http://127.0.0.1:42619/solr/collection1/&update.distrib=FROMLEADER&wt=javabin&version=2} status=0 QTime=2 
[junit4:junit4]   2> 19283 T83 C10 P59599 REQ /update {distrib.from=http://127.0.0.1:42619/solr/collection1/&update.distrib=FROMLEADER&wt=javabin&version=2} status=0 QTime=2 
[junit4:junit4]   2> 19284 T69 C8 P14410 REQ /update {distrib.from=http://127.0.0.1:42619/solr/collection1/&update.distrib=FROMLEADER&wt=javabin&version=2} status=0 QTime=3 
[junit4:junit4]   2> 19285 T59 C9 P42619 /update {wt=javabin&version=2} {add=[1 (1413567711228723200)]} 0 10
[junit4:junit4]   2> 19291 T43 C12 P31644 /update {wt=javabin&version=2} {add=[2 (1413567711243403264)]} 0 3
[junit4:junit4]   2> 19303 T83 C10 P59599 REQ /update {distrib.from=http://127.0.0.1:42619/solr/collection1/&update.distrib=FROMLEADER&test.distrib.skip.servers=http://127.0.0.1:14410/solr/collection1/&wt=javabin&version=2} status=0 QTime=2 
[junit4:junit4]   2> 19304 T97 C11 P10752 REQ /update {distrib.from=http://127.0.0.1:42619/solr/collection1/&update.distrib=FROMLEADER&test.distrib.skip.servers=http://127.0.0.1:14410/solr/collection1/&wt=javabin&version=2} status=0 QTime=3 
[junit4:junit4]   2> 19305 T59 C9 P42619 /update {test.distrib.skip.servers=http://127.0.0.1:14410/solr/collection1/&wt=javabin&version=2} {add=[2 (1413567711249694720)]} 0 10
[junit4:junit4]   2> 19311 T43 C12 P31644 /update {wt=javabin&version=2} {add=[3 (1413567711264374784)]} 0 3
[junit4:junit4]   2> 19325 T97 C11 P10752 REQ /update {distrib.from=http://127.0.0.1:42619/solr/collection1/&update.distrib=FROMLEADER&test.distrib.skip.servers=http://127.0.0.1:14410/solr/collection1/&test.distrib.skip.servers=http://127.0.0.1:59599/solr/collection1/&wt=javabin&version=2} status=0 QTime=3 
[junit4:junit4]   2> 19326 T59 C9 P42619 /update {test.distrib.skip.servers=http://127.0.0.1:14410/solr/collection1/&test.distrib.skip.servers=http://127.0.0.1:59599/solr/collection1/&wt=javabin&version=2} {add=[3 (1413567711271714816)]} 0 10
[junit4:junit4]   2> 19330 T43 C12 P31644 oasu.DirectUpdateHandler2.commit start commit{flags=0,_version_=0,optimize=false,openSearcher=true,waitSearcher=true,expungeDeletes=false,softCommit=false}
[junit4:junit4]   2> 19403 T43 C12 P31644 oasc.SolrDeletionPolicy.onCommit SolrDeletionPolicy.onCommit: commits:num=2
[junit4:junit4]   2> 		commit{dir=NRTCachingDirectory(org.apache.lucene.store.NIOFSDirectory@/usr/home/hudson/hudson-slave/workspace/Lucene-Solr-Tests-4.x-java7/solr/build/solr-core/test/J1/org.apache.solr.cloud.SyncSliceTest-1348083201432/control/data/index lockFactory=org.apache.lucene.store.NativeFSLockFactory@3ec7195b; maxCacheMB=48.0 maxMergeSizeMB=4.0),segFN=segments_1,generation=1,filenames=[segments_1]
[junit4:junit4]   2> 		commit{dir=NRTCachingDirectory(org.apache.lucene.store.NIOFSDirectory@/usr/home/hudson/hudson-slave/workspace/Lucene-Solr-Tests-4.x-java7/solr/build/solr-core/test/J1/org.apache.solr.cloud.SyncSliceTest-1348083201432/control/data/index lockFactory=org.apache.lucene.store.NativeFSLockFactory@3ec7195b; maxCacheMB=48.0 maxMergeSizeMB=4.0),segFN=segments_2,generation=2,filenames=[_0_4.len, _0_10.len, _0_3.len, _0_1.len, _0_6.len, _0_7.len, segments_2, _0.inf, _0_11.len, _0.si, _0.pst, _0.fld, _0_8.len]
[junit4:junit4]   2> 19404 T43 C12 P31644 oasc.SolrDeletionPolicy.updateCommits newest commit = 2
[junit4:junit4]   2> 19416 T43 C12 P31644 oass.SolrIndexSearcher.<init> Opening Searcher@7c0a7416 main
[junit4:junit4]   2> 19417 T43 C12 P31644 oasu.DirectUpdateHandler2.commit end_commit_flush
[junit4:junit4]   2> 19420 T54 oasc.SolrCore.registerSearcher [collection1] Registered new searcher Searcher@7c0a7416 main{StandardDirectoryReader(segments_2:3:nrt _0(4.0.0.2):C4)}
[junit4:junit4]   2> 19421 T43 C12 P31644 /update {waitSearcher=true&wt=javabin&commit=true&softCommit=false&version=2} {commit=} 0 91
[junit4:junit4]   2> 19426 T59 C9 P42619 oasu.DirectUpdateHandler2.commit start commit{flags=0,_version_=0,optimize=false,openSearcher=true,waitSearcher=true,expungeDeletes=false,softCommit=false}
[junit4:junit4]   2> 19483 T59 C9 P42619 oasc.SolrDeletionPolicy.onCommit SolrDeletionPolicy.onCommit: commits:num=2
[junit4:junit4]   2> 		commit{dir=NRTCachingDirectory(org.apache.lucene.store.NIOFSDirectory@/usr/home/hudson/hudson-slave/workspace/Lucene-Solr-Tests-4.x-java7/solr/build/solr-core/test/J1/org.apache.solr.cloud.SyncSliceTest-1348083201432/jetty1/index lockFactory=org.apache.lucene.store.NativeFSLockFactory@517b4650; maxCacheMB=48.0 maxMergeSizeMB=4.0),segFN=segments_1,generation=1,filenames=[segments_1]
[junit4:junit4]   2> 		commit{dir=NRTCachingDirectory(org.apache.lucene.store.NIOFSDirectory@/usr/home/hudson/hudson-slave/workspace/Lucene-Solr-Tests-4.x-java7/solr/build/solr-core/test/J1/org.apache.solr.cloud.SyncSliceTest-1348083201432/jetty1/index lockFactory=org.apache.lucene.store.NativeFSLockFactory@517b4650; maxCacheMB=48.0 maxMergeSizeMB=4.0),segFN=segments_2,generation=2,filenames=[_0_4.len, _0_10.len, _0_3.len, _0_1.len, _0_6.len, _0_7.len, segments_2, _0.inf, _0_11.len, _0.si, _0.pst, _0.fld, _0_8.len]
[junit4:junit4]   2> 19484 T59 C9 P42619 oasc.SolrDeletionPolicy.updateCommits newest commit = 2
[junit4:junit4]   2> 19492 T59 C9 P42619 oass.SolrIndexSearcher.<init> Opening Searcher@1fd2d699 main
[junit4:junit4]   2> 19493 T59 C9 P42619 oasu.DirectUpdateHandler2.commit end_commit_flush
[junit4:junit4]   2> 19494 T66 oasc.SolrCore.registerSearcher [collection1] Registered new searcher Searcher@1fd2d699 main{StandardDirectoryReader(segments_2:3:nrt _0(4.0.0.2):C4)}
[junit4:junit4]   2> 19495 T59 C9 P42619 oasu.SolrCmdDistributor.distribCommit Distrib commit to:[StdNode: http://127.0.0.1:14410/solr/collection1/, StdNode: http://127.0.0.1:59599/solr/collection1/, StdNode: http://127.0.0.1:10752/solr/collection1/]
[junit4:junit4]   2> 19499 T69 C8 P14410 oasu.DirectUpdateHandler2.commit start commit{flags=0,_version_=0,optimize=false,openSearcher=true,waitSearcher=true,expungeDeletes=false,softCommit=false}
[junit4:junit4]   2> 19499 T83 C10 P59599 oasu.DirectUpdateHandler2.commit start commit{flags=0,_version_=0,optimize=false,openSearcher=true,waitSearcher=true,expungeDeletes=false,softCommit=false}
[junit4:junit4]   2> 19499 T97 C11 P10752 oasu.DirectUpdateHandler2.commit start commit{flags=0,_version_=0,optimize=false,openSearcher=true,waitSearcher=true,expungeDeletes=false,softCommit=false}
[junit4:junit4]   2> 19617 T69 C8 P14410 oasc.SolrDeletionPolicy.onCommit SolrDeletionPolicy.onCommit: commits:num=2
[junit4:junit4]   2> 		commit{dir=NRTCachingDirectory(org.apache.lucene.store.NIOFSDirectory@/usr/home/hudson/hudson-slave/workspace/Lucene-Solr-Tests-4.x-java7/solr/build/solr-core/test/J1/org.apache.solr.cloud.SyncSliceTest-1348083201432/jetty2/index lockFactory=org.apache.lucene.store.NativeFSLockFactory@265b98b6; maxCacheMB=48.0 maxMergeSizeMB=4.0),segFN=segments_2,generation=2,filenames=[segments_2]
[junit4:junit4]   2> 		commit{dir=NRTCachingDirectory(org.apache.lucene.store.NIOFSDirectory@/usr/home/hudson/hudson-slave/workspace/Lucene-Solr-Tests-4.x-java7/solr/build/solr-core/test/J1/org.apache.solr.cloud.SyncSliceTest-1348083201432/jetty2/index lockFactory=org.apache.lucene.store.NativeFSLockFactory@265b98b6; maxCacheMB=48.0 maxMergeSizeMB=4.0),segFN=segments_3,generation=3,filenames=[_0_4.len, _0_10.len, _0_3.len, _0_1.len, _0_6.len, _0_7.len, _0.inf, _0_11.len, _0.si, _0.pst, _0.fld, segments_3, _0_8.len]
[junit4:junit4]   2> 19618 T69 C8 P14410 oasc.SolrDeletionPolicy.updateCommits newest commit = 3
[junit4:junit4]   2> 19618 T83 C10 P59599 oasc.SolrDeletionPolicy.onCommit SolrDeletionPolicy.onCommit: commits:num=2
[junit4:junit4]   2> 		commit{dir=NRTCachingDirectory(org.apache.lucene.store.NIOFSDirectory@/usr/home/hudson/hudson-slave/workspace/Lucene-Solr-Tests-4.x-java7/solr/build/solr-core/test/J1/org.apache.solr.cloud.SyncSliceTest-1348083201432/jetty3/index lockFactory=org.apache.lucene.store.NativeFSLockFactory@491a7bf0; maxCacheMB=48.0 maxMergeSizeMB=4.0),segFN=segments_2,generation=2,filenames=[segments_2]
[junit4:junit4]   2> 		commit{dir=NRTCachingDirectory(org.apache.lucene.store.NIOFSDirectory@/usr/home/hudson/hudson-slave/workspace/Lucene-Solr-Tests-4.x-java7/solr/build/solr-core/test/J1/org.apache.solr.cloud.SyncSliceTest-1348083201432/jetty3/index lockFactory=org.apache.lucene.store.NativeFSLockFactory@491a7bf0; maxCacheMB=48.0 maxMergeSizeMB=4.0),segFN=segments_3,generation=3,filenames=[_0_4.len, _0_10.len, _0_3.len, _0_1.len, _0_6.len, _0_7.len, _0.inf, _0_11.len, _0.si, _0.pst, _0.fld, segments_3, _0_8.len]
[junit4:junit4]   2> 19618 T97 C11 P10752 oasc.SolrDeletionPolicy.onCommit SolrDeletionPolicy.onCommit: commits:num=2
[junit4:junit4]   2> 		commit{dir=NRTCachingDirectory(org.apache.lucene.store.NIOFSDirectory@/usr/home/hudson/hudson-slave/workspace/Lucene-Solr-Tests-4.x-java7/solr/build/solr-core/test/J1/org.apache.solr.cloud.SyncSliceTest-1348083201432/jetty4/index lockFactory=org.apache.lucene.store.NativeFSLockFactory@ce8b29d; maxCacheMB=48.0 maxMergeSizeMB=4.0),segFN=segments_2,generation=2,filenames=[segments_2]
[junit4:junit4]   2> 		commit{dir=NRTCachingDirectory(org.apache.lucene.store.NIOFSDirectory@/usr/home/hudson/hudson-slave/workspace/Lucene-Solr-Tests-4.x-java7/solr/build/solr-core/test/J1/org.apache.solr.cloud.SyncSliceTest-1348083201432/jetty4/index lockFactory=org.apache.lucene.store.NativeFSLockFactory@ce8b29d; maxCacheMB=48.0 maxMergeSizeMB=4.0),segFN=segments_3,generation=3,filenames=[_0_4.len, _0_10.len, _0_3.len, _0_1.len, _0_6.len, _0_7.len, _0.inf, _0_11.len, _0.si, _0.pst, _0.fld, segments_3, _0_8.len]
[junit4:junit4]   2> 19618 T83 C10 P59599 oasc.SolrDeletionPolicy.updateCommits newest commit = 3
[junit4:junit4]   2> 19619 T97 C11 P10752 oasc.SolrDeletionPolicy.updateCommits newest commit = 3
[junit4:junit4]   2> 19624 T69 C8 P14410 oass.SolrIndexSearcher.<init> Opening Searcher@245eca5e main
[junit4:junit4]   2> 19625 T69 C8 P14410 oasu.DirectUpdateHandler2.commit end_commit_flush
[junit4:junit4]   2> 19625 T83 C10 P59599 oass.SolrIndexSearcher.<init> Opening Searcher@8fdfa17 main
[junit4:junit4]   2> 19626 T83 C10 P59599 oasu.DirectUpdateHandler2.commit end_commit_flush
[junit4:junit4]   2> 19626 T78 oasc.SolrCore.registerSearcher [collection1] Registered new searcher Searcher@245eca5e main{StandardDirectoryReader(segments_3:4:nrt _0(4.0.0.2):C2)}
[junit4:junit4]   2> 19627 T69 C8 P14410 /update {waitSearcher=true&commit=true&wt=javabin&commit_end_point=true&expungeDeletes=false&softCommit=false&version=2} {commit=} 0 128
[junit4:junit4]   2> 19628 T97 C11 P10752 oass.SolrIndexSearcher.<init> Opening Searcher@308cd450 main
[junit4:junit4]   2> 19628 T92 oasc.SolrCore.registerSearcher [collection1] Registered new searcher Searcher@8fdfa17 main{StandardDirectoryReader(segments_3:4:nrt _0(4.0.0.2):C3)}
[junit4:junit4]   2> 19629 T83 C10 P59599 /update {waitSearcher=true&commit=true&wt=javabin&commit_end_point=true&expungeDeletes=false&softCommit=false&version=2} {commit=} 0 130
[junit4:junit4]   2> 19629 T97 C11 P10752 oasu.DirectUpdateHandler2.commit end_commit_flush
[junit4:junit4]   2> 19632 T106 oasc.SolrCore.registerSearcher [collection1] Registered new searcher Searcher@308cd450 main{StandardDirectoryReader(segments_3:4:nrt _0(4.0.0.2):C4)}
[junit4:junit4]   2> 19632 T97 C11 P10752 /update {waitSearcher=true&commit=true&wt=javabin&commit_end_point=true&expungeDeletes=false&softCommit=false&version=2} {commit=} 0 133
[junit4:junit4]   2> 19633 T59 C9 P42619 /update {waitSearcher=true&wt=javabin&commit=true&softCommit=false&version=2} {commit=} 0 207
[junit4:junit4]   2> 19634 T30 oasc.AbstractDistribZkTestBase.waitForRecoveriesToFinish Wait for recoveries to finish - collection: collection1 failOnTimeout:true timeout (sec):1800
[junit4:junit4]   2> 19636 T30 oascc.ZkStateReader.updateClusterState Updating cloud state from ZooKeeper... 
[junit4:junit4]   2> check const of shard1
[junit4:junit4]   2> client0
[junit4:junit4]   2> PROPS:127.0.0.1:42619_solr_collection1:{"shard":"shard1","roles":null,"state":"active","core":"collection1","collection":"collection1","node_name":"127.0.0.1:42619_solr","base_url":"http://127.0.0.1:42619/solr","leader":"true"}
[junit4:junit4]   2> 19640 T60 C9 P42619 REQ /select {distrib=false&wt=javabin&q=*:*&version=2} hits=4 status=0 QTime=1 
[junit4:junit4]   2>  live:true
[junit4:junit4]   2>  num:4
[junit4:junit4]   2> 
[junit4:junit4]   2> client1
[junit4:junit4]   2> PROPS:127.0.0.1:14410_solr_collection1:{"shard":"shard1","roles":null,"state":"active","core":"collection1","collection":"collection1","node_name":"127.0.0.1:14410_solr","base_url":"http://127.0.0.1:14410/solr"}
[junit4:junit4]   2> 19647 T70 C8 P14410 REQ /select {distrib=false&wt=javabin&q=*:*&version=2} hits=2 status=0 QTime=1 
[junit4:junit4]   2>  live:true
[junit4:junit4]   2>  num:2
[junit4:junit4]   2> 
[junit4:junit4]   2> ######shard1 is not consistent.  Got 4 from http://127.0.0.1:42619/solr/collection1lastClient and got 2 from http://127.0.0.1:14410/solr/collection1
[junit4:junit4]   2> 19820 T60 C9 P42619 REQ /select {fl=id,_version_&sort=id+asc&q=*:*&distrib=false&wt=javabin&rows=1000&version=2} hits=4 status=0 QTime=169 
[junit4:junit4]   2> 19826 T70 C8 P14410 REQ /select {fl=id,_version_&sort=id+asc&q=*:*&distrib=false&wt=javabin&rows=1000&version=2} hits=2 status=0 QTime=1 
[junit4:junit4]   2> ######http://127.0.0.1:42619/solr/collection1: {numFound=4,start=0,docs=[SolrDocument{id=0, _version_=1413567711193071616}, SolrDocument{id=1, _version_=1413567711228723200}, SolrDocument{id=2, _version_=1413567711249694720}, SolrDocument{id=3, _version_=1413567711271714816}]}
[junit4:junit4]   2> ######http://127.0.0.1:14410/solr/collection1: {numFound=2,start=0,docs=[SolrDocument{id=0, _version_=1413567711193071616}, SolrDocument{id=1, _version_=1413567711228723200}]}
[junit4:junit4]   2> ###### sizes=4,2
[junit4:junit4]   2> ###### Only in http://127.0.0.1:42619/solr/collection1: [{id=2, _version_=1413567711249694720}, {id=3, _version_=1413567711271714816}]
[junit4:junit4]   2> client2
[junit4:junit4]   2> PROPS:127.0.0.1:59599_solr_collection1:{"shard":"shard1","roles":null,"state":"active","core":"collection1","collection":"collection1","node_name":"127.0.0.1:59599_solr","base_url":"http://127.0.0.1:59599/solr"}
[junit4:junit4]   2> 19831 T84 C10 P59599 REQ /select {distrib=false&wt=javabin&q=*:*&version=2} hits=3 status=0 QTime=1 
[junit4:junit4]   2>  live:true
[junit4:junit4]   2>  num:3
[junit4:junit4]   2> 
[junit4:junit4]   2> client3
[junit4:junit4]   2> PROPS:127.0.0.1:10752_solr_collection1:{"shard":"shard1","roles":null,"state":"active","core":"collection1","collection":"collection1","node_name":"127.0.0.1:10752_solr","base_url":"http://127.0.0.1:10752/solr"}
[junit4:junit4]   2> 19837 T98 C11 P10752 REQ /select {distrib=false&wt=javabin&q=*:*&version=2} hits=4 status=0 QTime=1 
[junit4:junit4]   2>  live:true
[junit4:junit4]   2>  num:4
[junit4:junit4]   2> 
[junit4:junit4]   2> 19845 T30 oascsi.HttpClientUtil.createClient Creating new http client, config:maxConnections=128&maxConnectionsPerHost=32&followRedirects=false
[junit4:junit4]   2> 19870 T85 oasha.CollectionsHandler.handleSyncShardAction Syncing shard : action=SYNCSHARD&collection=collection1&shard=shard1&wt=javabin&version=2
[junit4:junit4]   2> 19871 T85 oascsi.HttpClientUtil.createClient Creating new http client, config:maxConnections=128&maxConnectionsPerHost=32&followRedirects=false
[junit4:junit4]   2> 19887 T63 oasha.CoreAdminHandler.handleRequestSyncAction I have been requested to sync up my shard
[junit4:junit4]   2> 19888 T63 oasc.SyncStrategy.sync Sync replicas to http://127.0.0.1:42619/solr/collection1/
[junit4:junit4]   2> 19888 T63 oasu.PeerSync.sync PeerSync: core=collection1 url=http://127.0.0.1:42619/solr START replicas=[http://127.0.0.1:14410/solr/collection1/, http://127.0.0.1:59599/solr/collection1/, http://127.0.0.1:10752/solr/collection1/] nUpdates=100
[junit4:junit4]   2> 19902 T99 C11 P10752 REQ /get {distrib=false&qt=/get&wt=javabin&version=2&getVersions=100} status=0 QTime=9 
[junit4:junit4]   2> 19902 T71 C8 P14410 REQ /get {distrib=false&qt=/get&wt=javabin&version=2&getVersions=100} status=0 QTime=10 
[junit4:junit4]   2> 19902 T86 C10 P59599 REQ /get {distrib=false&qt=/get&wt=javabin&version=2&getVersions=100} status=0 QTime=10 
[junit4:junit4]   2> 19903 T63 oasu.PeerSync.handleVersions PeerSync: core=collection1 url=http://127.0.0.1:42619/solr  Received 5 versions from 127.0.0.1:10752/solr/collection1/
[junit4:junit4]   2> 19904 T63 oasu.PeerSync.handleVersions PeerSync: core=collection1 url=http://127.0.0.1:42619/solr  Our versions are newer. ourLowThreshold=1413567711166857216 otherHigh=1413567711249694720
[junit4:junit4]   2> 19904 T63 oasu.PeerSync.handleVersions PeerSync: core=collection1 url=http://127.0.0.1:42619/solr  Received 3 versions from 127.0.0.1:14410/solr/collection1/
[junit4:junit4]   2> 19905 T63 oasu.PeerSync.handleVersions PeerSync: core=collection1 url=http://127.0.0.1:42619/solr  Our versions are newer. ourLowThreshold=1413567711166857216 otherHigh=1413567711228723200
[junit4:junit4]   2> 19905 T63 oasu.PeerSync.handleVersions PeerSync: core=collection1 url=http://127.0.0.1:42619/solr  Received 4 versions from 127.0.0.1:59599/solr/collection1/
[junit4:junit4]   2> 19906 T63 oasu.PeerSync.handleVersions PeerSync: core=collection1 url=http://127.0.0.1:42619/solr  Our versions are newer. ourLowThreshold=1413567711166857216 otherHigh=1413567711249694720
[junit4:junit4]   2> 19906 T63 oasu.PeerSync.sync PeerSync: core=collection1 url=http://127.0.0.1:42619/solr DONE. sync succeeded
[junit4:junit4]   2> 19907 T63 oasc.SyncStrategy.syncReplicas Sync Success - now sync replicas to me
[junit4:junit4]   2> 19907 T63 oasc.SyncStrategy.syncToMe http://127.0.0.1:42619/solr/collection1/: try and ask http://127.0.0.1:14410/solr/collection1/ to sync
[junit4:junit4]   2> 19908 T63 oasc.SyncStrategy.syncToMe http://127.0.0.1:42619/solr/collection1/: try and ask http://127.0.0.1:59599/solr/collection1/ to sync
[junit4:junit4]   2> 19909 T63 oasc.SyncStrategy.syncToMe http://127.0.0.1:42619/solr/collection1/: try and ask http://127.0.0.1:10752/solr/collection1/ to sync
[junit4:junit4]   2> 19912 T72 C8 P14410 oasu.PeerSync.sync PeerSync: core=collection1 url=http://127.0.0.1:14410/solr START replicas=[http://127.0.0.1:42619/solr/collection1/] nUpdates=100
[junit4:junit4]   2> 19912 T87 C10 P59599 oasu.PeerSync.sync PeerSync: core=collection1 url=http://127.0.0.1:59599/solr START replicas=[http://127.0.0.1:42619/solr/collection1/] nUpdates=100
[junit4:junit4]   2> 19913 T100 C11 P10752 oasu.PeerSync.sync PeerSync: core=collection1 url=http://127.0.0.1:10752/solr START replicas=[http://127.0.0.1:42619/solr/collection1/] nUpdates=100
[junit4:junit4]   2> 19916 T62 C9 P42619 REQ /get {distrib=false&qt=/get&wt=javabin&version=2&getVersions=100} status=0 QTime=1 
[junit4:junit4]   2> 19917 T58 C9 P42619 REQ /get {distrib=false&qt=/get&wt=javabin&version=2&getVersions=100} status=0 QTime=0 
[junit4:junit4]   2> 19917 T57 C9 P42619 REQ /get {distrib=false&qt=/get&wt=javabin&version=2&getVersions=100} status=0 QTime=0 
[junit4:junit4]   2> 19917 T87 C10 P59599 oasu.PeerSync.handleVersions PeerSync: core=collection1 url=http://127.0.0.1:59599/solr  Received 5 versions from 127.0.0.1:42619/solr/collection1/
[junit4:junit4]   2> 19917 T72 C8 P14410 oasu.PeerSync.handleVersions PeerSync: core=collection1 url=http://127.0.0.1:14410/solr  Received 5 versions from 127.0.0.1:42619/solr/collection1/
[junit4:junit4]   2> 19918 T87 C10 P59599 oasu.PeerSync.requestUpdates PeerSync: core=collection1 url=http://127.0.0.1:59599/solr Requesting updates from 127.0.0.1:42619/solr/collection1/n=1 versions=[1413567711271714816]
[junit4:junit4]   2> 19918 T100 C11 P10752 oasu.PeerSync.handleVersions PeerSync: core=collection1 url=http://127.0.0.1:10752/solr  Received 5 versions from 127.0.0.1:42619/solr/collection1/
[junit4:junit4]   2> 19918 T72 C8 P14410 oasu.PeerSync.requestUpdates PeerSync: core=collection1 url=http://127.0.0.1:14410/solr Requesting updates from 127.0.0.1:42619/solr/collection1/n=2 versions=[1413567711271714816, 1413567711249694720]
[junit4:junit4]   2> 19919 T100 C11 P10752 oasu.PeerSync.handleVersions PeerSync: core=collection1 url=http://127.0.0.1:10752/solr  Our versions are newer. ourLowThreshold=1413567711166857216 otherHigh=1413567711249694720
[junit4:junit4]   2> 19920 T100 C11 P10752 oasu.PeerSync.sync PeerSync: core=collection1 url=http://127.0.0.1:10752/solr DONE. sync succeeded
[junit4:junit4]   2> 19921 T100 C11 P10752 REQ /get {sync=http://127.0.0.1:42619/solr/collection1/&getVersions=100&distrib=false&qt=/get&wt=javabin&version=2} status=0 QTime=8 
[junit4:junit4]   2> 19922 T63 oasc.SyncStrategy.syncToMe http://127.0.0.1:42619/solr/collection1/:  sync completed with http://127.0.0.1:10752/solr/collection1/
[junit4:junit4]   2> 19922 T57 C9 P42619 REQ /get {distrib=false&getUpdates=1413567711271714816&qt=/get&wt=javabin&version=2} status=0 QTime=0 
[junit4:junit4]   2> 19923 T58 C9 P42619 REQ /get {distrib=false&getUpdates=1413567711271714816,1413567711249694720&qt=/get&wt=javabin&version=2} status=0 QTime=0 
[junit4:junit4]   2> 19931 T87 C10 P59599 oasu.PeerSync.sync PeerSync: core=collection1 url=http://127.0.0.1:59599/solr DONE. sync succeeded
[junit4:junit4]   2> 19931 T87 C10 P59599 REQ /get {sync=http://127.0.0.1:42619/solr/collection1/&getVersions=100&distrib=false&qt=/get&wt=javabin&version=2} status=0 QTime=19 
[junit4:junit4]   2> 19932 T63 oasc.SyncStrategy.syncToMe http://127.0.0.1:42619/solr/collection1/:  sync completed with http://127.0.0.1:59599/solr/collection1/
[junit4:junit4]   2> 19933 T72 C8 P14410 oasu.PeerSync.sync PeerSync: core=collection1 url=http://127.0.0.1:14410/solr DONE. sync succeeded
[junit4:junit4]   2> 19934 T72 C8 P14410 REQ /get {sync=http://127.0.0.1:42619/solr/collection1/&getVersions=100&distrib=false&qt=/get&wt=javabin&version=2} status=0 QTime=23 
[junit4:junit4]   2> 19935 T63 oasc.SyncStrategy.syncToMe http://127.0.0.1:42619/solr/collection1/:  sync completed with http://127.0.0.1:14410/solr/collection1/
[junit4:junit4]   2> 19936 T30 oasc.AbstractFullDistribZkTestBase.waitForThingsToLevelOut Wait for recoveries to finish - wait 15 for each attempt
[junit4:junit4]   2> 19937 T30 oasc.AbstractDistribZkTestBase.waitForRecoveriesToFinish Wait for recoveries to finish - collection: collection1 failOnTimeout:true timeout (sec):15
[junit4:junit4]   2> 19938 T30 oascc.ZkStateReader.updateClusterState Updating cloud state from ZooKeeper... 
[junit4:junit4]   2> 19943 T43 C12 P31644 oasu.DirectUpdateHandler2.commit start commit{flags=0,_version_=0,optimize=false,openSearcher=true,waitSearcher=true,expungeDeletes=false,softCommit=false}
[junit4:junit4]   2> 19945 T43 C12 P31644 oass.SolrIndexSearcher.<init> Opening Searcher@47b67991 main
[junit4:junit4]   2> 19946 T43 C12 P31644 oasu.DirectUpdateHandler2.commit end_commit_flush
[junit4:junit4]   2> 19949 T54 oasc.SolrCore.registerSearcher [collection1] Registered new searcher Searcher@47b67991 main{StandardDirectoryReader(segments_2:3:nrt _0(4.0.0.2):C4)}
[junit4:junit4]   2> 19950 T43 C12 P31644 /update {waitSearcher=true&wt=javabin&commit=true&softCommit=false&version=2} {commit=} 0 7
[junit4:junit4]   2> 19955 T59 C9 P42619 oasu

[...truncated too long message...]

t4:junit4]   2> 	at org.apache.solr.cloud.LeaderElector.runIamLeaderProcess(LeaderElector.java:158)
[junit4:junit4]   2> 	at org.apache.solr.cloud.LeaderElector.checkIfIamLeader(LeaderElector.java:102)
[junit4:junit4]   2> 	at org.apache.solr.cloud.LeaderElector.access$000(LeaderElector.java:56)
[junit4:junit4]   2> 	at org.apache.solr.cloud.LeaderElector$1.process(LeaderElector.java:131)
[junit4:junit4]   2> 	at org.apache.zookeeper.ClientCnxn$EventThread.processEvent(ClientCnxn.java:526)
[junit4:junit4]   2> 	at org.apache.zookeeper.ClientCnxn$EventThread.run(ClientCnxn.java:502)
[junit4:junit4]   2> 
[junit4:junit4]   2> 308647 T1862 oasc.JmxMonitoredMap$SolrDynamicMBean.getMBeanInfo WARNING Could not getStatistics on info bean Lazy[solr.ReplicationHandler] java.lang.IllegalArgumentException: /usr/home/hudson/hudson-slave/workspace/Lucene-Solr-Tests-4.x-java7/solr/build/solr-core/test/J1/org.apache.solr.cloud.BasicDistributedZk2Test-1348083948314/jetty4/index does not exist
[junit4:junit4]   2> 	at org.apache.commons.io.FileUtils.sizeOfDirectory(FileUtils.java:2074)
[junit4:junit4]   2> 	at org.apache.solr.handler.ReplicationHandler.getIndexSize(ReplicationHandler.java:477)
[junit4:junit4]   2> 	at org.apache.solr.handler.ReplicationHandler.getStatistics(ReplicationHandler.java:525)
[junit4:junit4]   2> 	at org.apache.solr.core.RequestHandlers$LazyRequestHandlerWrapper.getStatistics(RequestHandlers.java:310)
[junit4:junit4]   2> 	at org.apache.solr.core.JmxMonitoredMap$SolrDynamicMBean.getMBeanInfo(JmxMonitoredMap.java:231)
[junit4:junit4]   2> 	at com.sun.jmx.interceptor.DefaultMBeanServerInterceptor.getClassName(DefaultMBeanServerInterceptor.java:1804)
[junit4:junit4]   2> 	at com.sun.jmx.interceptor.DefaultMBeanServerInterceptor.safeGetClassName(DefaultMBeanServerInterceptor.java:1595)
[junit4:junit4]   2> 	at com.sun.jmx.interceptor.DefaultMBeanServerInterceptor.checkMBeanPermission(DefaultMBeanServerInterceptor.java:1813)
[junit4:junit4]   2> 	at com.sun.jmx.interceptor.DefaultMBeanServerInterceptor.exclusiveUnregisterMBean(DefaultMBeanServerInterceptor.java:430)
[junit4:junit4]   2> 	at com.sun.jmx.interceptor.DefaultMBeanServerInterceptor.unregisterMBean(DefaultMBeanServerInterceptor.java:415)
[junit4:junit4]   2> 	at com.sun.jmx.mbeanserver.JmxMBeanServer.unregisterMBean(JmxMBeanServer.java:536)
[junit4:junit4]   2> 	at org.apache.solr.core.JmxMonitoredMap.unregister(JmxMonitoredMap.java:175)
[junit4:junit4]   2> 	at org.apache.solr.core.JmxMonitoredMap.clear(JmxMonitoredMap.java:116)
[junit4:junit4]   2> 	at org.apache.solr.core.SolrCore.close(SolrCore.java:864)
[junit4:junit4]   2> 	at org.apache.solr.cloud.ShardLeaderElectionContext.runLeaderProcess(ElectionContext.java:213)
[junit4:junit4]   2> 	at org.apache.solr.cloud.LeaderElector.runIamLeaderProcess(LeaderElector.java:158)
[junit4:junit4]   2> 	at org.apache.solr.cloud.LeaderElector.checkIfIamLeader(LeaderElector.java:102)
[junit4:junit4]   2> 	at org.apache.solr.cloud.LeaderElector.access$000(LeaderElector.java:56)
[junit4:junit4]   2> 	at org.apache.solr.cloud.LeaderElector$1.process(LeaderElector.java:131)
[junit4:junit4]   2> 	at org.apache.zookeeper.ClientCnxn$EventThread.processEvent(ClientCnxn.java:526)
[junit4:junit4]   2> 	at org.apache.zookeeper.ClientCnxn$EventThread.run(ClientCnxn.java:502)
[junit4:junit4]   2> 
[junit4:junit4]   2> 308654 T1862 oasc.SolrCore.closeSearcher [collection1] Closing main searcher on request.
[junit4:junit4]   2> 308656 T1862 oasu.DirectUpdateHandler2.close closing DirectUpdateHandler2{commits=5,autocommits=0,soft autocommits=0,optimizes=0,rollbacks=0,expungeDeletes=0,docsPending=0,adds=0,deletesById=0,deletesByQuery=0,errors=0,cumulative_adds=35,cumulative_deletesById=0,cumulative_deletesByQuery=0,cumulative_errors=0}
[junit4:junit4]   2> 308657 T1862 oasu.DefaultSolrCoreState.decref SolrCoreState ref count has reached 0 - closing IndexWriter
[junit4:junit4]   2> 308659 T1862 oasu.DefaultSolrCoreState.decref Closing SolrCoreState - canceling any ongoing recovery
[junit4:junit4]   2> 308659 T1862 oascc.ZkStateReader$3.process Updating live nodes
[junit4:junit4]   2> 308659 T1862 oascc.ZkStateReader$3.process WARNING ZooKeeper watch triggered, but Solr cannot talk to ZK
[junit4:junit4]   2> 308659 T1862 oascc.ZkStateReader$2.process A cluster state change has occurred - updating...
[junit4:junit4]   2> 308660 T1862 oascc.ZkStateReader$2.process WARNING ZooKeeper watch triggered, but Solr cannot talk to ZK
[junit4:junit4]   2> 308660 T1862 oascc.ConnectionManager.process Watcher org.apache.solr.common.cloud.ConnectionManager@51a2f9f0 name:ZooKeeperConnection Watcher:127.0.0.1:42636/solr got event WatchedEvent state:Disconnected type:None path:null path:null type:None
[junit4:junit4]   2> 308660 T1862 oascc.ConnectionManager.process Client->ZooKeeper status change trigger but we are already closed
[junit4:junit4]   2> 308660 T1862 oaz.ClientCnxn$EventThread.run EventThread shut down
[junit4:junit4]   2> NOTE: test params are: codec=Lucene40: {n_f1=PostingsFormat(name=Asserting), foo_b=Pulsing40(freqCutoff=10 minBlockSize=48 maxBlockSize=164), foo_d=PostingsFormat(name=Memory doPackFST= true), foo_f=Pulsing40(freqCutoff=10 minBlockSize=48 maxBlockSize=164), n_tl1=PostingsFormat(name=Asserting), n_d1=MockVariableIntBlock(baseBlockSize=31), rnd_b=PostingsFormat(name=Memory doPackFST= true), intDefault=PostingsFormat(name=Asserting), n_td1=PostingsFormat(name=Asserting), timestamp=MockVariableIntBlock(baseBlockSize=31), id=PostingsFormat(name=Memory doPackFST= true), range_facet_sl=PostingsFormat(name=Memory doPackFST= true), range_facet_si=MockVariableIntBlock(baseBlockSize=31), oddField_s=PostingsFormat(name=Memory doPackFST= true), multiDefault=MockVariableIntBlock(baseBlockSize=31), n_tf1=MockVariableIntBlock(baseBlockSize=31), n_dt1=PostingsFormat(name=Asserting), n_ti1=PostingsFormat(name=Memory doPackFST= true), range_facet_l=MockVariableIntBlock(baseBlockSize=31), text=Pulsing40(freqCutoff=10 minBlockSize=48 maxBlockSize=164), _version_=PostingsFormat(name=Asserting), SubjectTerms_mfacet=PostingsFormat(name=Asserting), a_t=MockVariableIntBlock(baseBlockSize=31), n_tdt1=PostingsFormat(name=Asserting), other_tl1=PostingsFormat(name=Asserting), n_l1=MockVariableIntBlock(baseBlockSize=31), a_si=PostingsFormat(name=Asserting)}, sim=DefaultSimilarity, locale=fr, timezone=America/St_Barthelemy
[junit4:junit4]   2> NOTE: FreeBSD 9.0-RELEASE amd64/Oracle Corporation 1.7.0_06 (64-bit)/cpus=16,threads=2,free=84225280,total=533725184
[junit4:junit4]   2> NOTE: All tests run in this JVM: [SuggesterTest, TestUpdate, TestSolrDeletionPolicy2, TestCodecSupport, LukeRequestHandlerTest, SyncSliceTest, TestRemoteStreaming, TestRTGBase, FullSolrCloudDistribCmdsTest, TestDocumentBuilder, UpdateParamsTest, TestBinaryField, TestRecovery, SolrInfoMBeanTest, OutputWriterTest, URLClassifyProcessorTest, ScriptEngineTest, DirectSolrSpellCheckerTest, RecoveryZkTest, TestFoldingMultitermQuery, SignatureUpdateProcessorFactoryTest, PolyFieldTest, TestWriterPerf, EchoParamsTest, TestPluginEnable, TestCSVResponseWriter, TestRealTimeGet, TestTrie, LeaderElectionTest, TermVectorComponentTest, SoftAutoCommitTest, MultiTermTest, TestDistributedGrouping, DirectUpdateHandlerTest, QueryEqualityTest, BasicZkTest, OpenExchangeRatesOrgProviderTest, RAMDirectoryFactoryTest, SolrCoreTest, TestQueryUtils, TimeZoneUtilsTest, PrimUtilsTest, TestStressLucene, BadIndexSchemaTest, TestSolrXMLSerializer, TestStressRecovery, TestQuerySenderListener, UUIDFieldTest, QueryParsingTest, PrimitiveFieldTypeTest, TestPropInjectDefaults, TestOmitPositions, TestDistributedSearch, FileUtilsTest, TestPhraseSuggestions, StatsComponentTest, TestRangeQuery, TestMultiCoreConfBootstrap, SimpleFacetsTest, TestSort, TestGroupingSearch, ConvertedLegacyTest, PeerSyncTest, QueryElevationComponentTest, BasicFunctionalityTest, TestBinaryResponseWriter, TestJmxIntegration, SampleTest, HighlighterTest, TestFunctionQuery, DirectSolrConnectionTest, CacheHeaderTest, MoreLikeThisHandlerTest, DistributedQueryElevationComponentTest, IndexSchemaTest, DistanceFunctionTest, StandardRequestHandlerTest, PingRequestHandlerTest, JsonLoaderTest, TestSurroundQueryParser, DocumentAnalysisRequestHandlerTest, TestSolrQueryParser, TestValueSourceCache, TestReversedWildcardFilterFactory, ReturnFieldsTest, RequiredFieldsTest, SuggesterFSTTest, LoggingHandlerTest, SolrCmdDistributorTest, UpdateRequestProcessorFactoryTest, FieldMutatingUpdateProcessorTest, DefaultValueUpdateProcessorTest, TestMergePolicyConfig, TestDocSet, SolrIndexConfigTest, IndexReaderFactoryTest, TestConfig, TestLMDirichletSimilarityFactory, LegacyHTMLStripCharFilterTest, TestDFRSimilarityFactory, DateMathParserTest, ResourceLoaderTest, DateFieldTest, TestSuggestSpellingConverter, TestLRUCache, TestUtils, ZkNodePropsTest, CircularListTest, TestCharFilters, BasicDistributedZk2Test]
[junit4:junit4] Completed on J1 in 309.09s, 1 test, 1 failure <<< FAILURES!

[...truncated 11 lines...]
BUILD FAILED
/usr/home/hudson/hudson-slave/workspace/Lucene-Solr-Tests-4.x-java7/build.xml:32: The following error occurred while executing this line:
/usr/home/hudson/hudson-slave/workspace/Lucene-Solr-Tests-4.x-java7/solr/build.xml:146: The following error occurred while executing this line:
/usr/home/hudson/hudson-slave/workspace/Lucene-Solr-Tests-4.x-java7/lucene/module-build.xml:63: The following error occurred while executing this line:
/usr/home/hudson/hudson-slave/workspace/Lucene-Solr-Tests-4.x-java7/lucene/common-build.xml:1140: The following error occurred while executing this line:
/usr/home/hudson/hudson-slave/workspace/Lucene-Solr-Tests-4.x-java7/lucene/common-build.xml:813: There were test failures: 230 suites, 951 tests, 1 error, 1 failure, 7 ignored (2 assumptions)

Total time: 38 minutes 3 seconds
Build step 'Invoke Ant' marked build as failure
Recording test results
Email was triggered for: Failure
Sending email for trigger: Failure



Mime
View raw message