lucene-dev mailing list archives

Site index · List index
Message view « Date » · « Thread »
Top « Date » · « Thread »
From Apache Jenkins Server <jenk...@builds.apache.org>
Subject [JENKINS] Lucene-Solr-Tests-4.x-java7 - Build # 488 - Failure
Date Sun, 23 Sep 2012 08:45:02 GMT
Build: https://builds.apache.org/job/Lucene-Solr-Tests-4.x-java7/488/

2 tests failed.
REGRESSION:  org.apache.solr.cloud.BasicDistributedZk2Test.testDistribSearch

Error Message:
Shard still reported as live in zk

Stack Trace:
java.lang.AssertionError: Shard still reported as live in zk
	at __randomizedtesting.SeedInfo.seed([778CBE7FFE1AF693:F66A3067894596AF]:0)
	at org.junit.Assert.fail(Assert.java:93)
	at org.apache.solr.cloud.AbstractFullDistribZkTestBase.waitToSeeNotLive(AbstractFullDistribZkTestBase.java:1220)
	at org.apache.solr.cloud.BasicDistributedZk2Test.brindDownShardIndexSomeDocsAndRecover(BasicDistributedZk2Test.java:190)
	at org.apache.solr.cloud.BasicDistributedZk2Test.doTest(BasicDistributedZk2Test.java:83)
	at org.apache.solr.BaseDistributedSearchTestCase.testDistribSearch(BaseDistributedSearchTestCase.java:695)
	at sun.reflect.NativeMethodAccessorImpl.invoke0(Native Method)
	at sun.reflect.NativeMethodAccessorImpl.invoke(NativeMethodAccessorImpl.java:57)
	at sun.reflect.DelegatingMethodAccessorImpl.invoke(DelegatingMethodAccessorImpl.java:43)
	at java.lang.reflect.Method.invoke(Method.java:601)
	at com.carrotsearch.randomizedtesting.RandomizedRunner.invoke(RandomizedRunner.java:1559)
	at com.carrotsearch.randomizedtesting.RandomizedRunner.access$600(RandomizedRunner.java:79)
	at com.carrotsearch.randomizedtesting.RandomizedRunner$6.evaluate(RandomizedRunner.java:737)
	at com.carrotsearch.randomizedtesting.RandomizedRunner$7.evaluate(RandomizedRunner.java:773)
	at com.carrotsearch.randomizedtesting.RandomizedRunner$8.evaluate(RandomizedRunner.java:787)
	at com.carrotsearch.randomizedtesting.rules.SystemPropertiesRestoreRule$1.evaluate(SystemPropertiesRestoreRule.java:53)
	at org.apache.lucene.util.TestRuleSetupTeardownChained$1.evaluate(TestRuleSetupTeardownChained.java:50)
	at org.apache.lucene.util.TestRuleFieldCacheSanity$1.evaluate(TestRuleFieldCacheSanity.java:51)
	at org.apache.lucene.util.AbstractBeforeAfterRule$1.evaluate(AbstractBeforeAfterRule.java:45)
	at com.carrotsearch.randomizedtesting.rules.SystemPropertiesInvariantRule$1.evaluate(SystemPropertiesInvariantRule.java:55)
	at org.apache.lucene.util.TestRuleThreadAndTestName$1.evaluate(TestRuleThreadAndTestName.java:48)
	at org.apache.lucene.util.TestRuleIgnoreAfterMaxFailures$1.evaluate(TestRuleIgnoreAfterMaxFailures.java:70)
	at org.apache.lucene.util.TestRuleMarkFailure$1.evaluate(TestRuleMarkFailure.java:48)
	at com.carrotsearch.randomizedtesting.rules.StatementAdapter.evaluate(StatementAdapter.java:36)
	at com.carrotsearch.randomizedtesting.ThreadLeakControl$StatementRunner.run(ThreadLeakControl.java:358)
	at com.carrotsearch.randomizedtesting.ThreadLeakControl.forkTimeoutingTask(ThreadLeakControl.java:782)
	at com.carrotsearch.randomizedtesting.ThreadLeakControl$3.evaluate(ThreadLeakControl.java:442)
	at com.carrotsearch.randomizedtesting.RandomizedRunner.runSingleTest(RandomizedRunner.java:746)
	at com.carrotsearch.randomizedtesting.RandomizedRunner$3.evaluate(RandomizedRunner.java:648)
	at com.carrotsearch.randomizedtesting.RandomizedRunner$4.evaluate(RandomizedRunner.java:682)
	at com.carrotsearch.randomizedtesting.RandomizedRunner$5.evaluate(RandomizedRunner.java:693)
	at com.carrotsearch.randomizedtesting.rules.StatementAdapter.evaluate(StatementAdapter.java:36)
	at com.carrotsearch.randomizedtesting.rules.SystemPropertiesRestoreRule$1.evaluate(SystemPropertiesRestoreRule.java:53)
	at org.apache.lucene.util.AbstractBeforeAfterRule$1.evaluate(AbstractBeforeAfterRule.java:45)
	at org.apache.lucene.util.TestRuleStoreClassName$1.evaluate(TestRuleStoreClassName.java:42)
	at com.carrotsearch.randomizedtesting.rules.SystemPropertiesInvariantRule$1.evaluate(SystemPropertiesInvariantRule.java:55)
	at com.carrotsearch.randomizedtesting.rules.NoShadowingOrOverridesOnMethodsRule$1.evaluate(NoShadowingOrOverridesOnMethodsRule.java:39)
	at com.carrotsearch.randomizedtesting.rules.NoShadowingOrOverridesOnMethodsRule$1.evaluate(NoShadowingOrOverridesOnMethodsRule.java:39)
	at com.carrotsearch.randomizedtesting.rules.StatementAdapter.evaluate(StatementAdapter.java:36)
	at org.apache.lucene.util.TestRuleAssertionsRequired$1.evaluate(TestRuleAssertionsRequired.java:43)
	at org.apache.lucene.util.TestRuleMarkFailure$1.evaluate(TestRuleMarkFailure.java:48)
	at org.apache.lucene.util.TestRuleIgnoreAfterMaxFailures$1.evaluate(TestRuleIgnoreAfterMaxFailures.java:70)
	at org.apache.lucene.util.TestRuleIgnoreTestSuites$1.evaluate(TestRuleIgnoreTestSuites.java:55)
	at com.carrotsearch.randomizedtesting.rules.StatementAdapter.evaluate(StatementAdapter.java:36)
	at com.carrotsearch.randomizedtesting.ThreadLeakControl$StatementRunner.run(ThreadLeakControl.java:358)
	at java.lang.Thread.run(Thread.java:722)


REGRESSION:  org.apache.solr.cloud.SyncSliceTest.testDistribSearch

Error Message:
There are still nodes recoverying

Stack Trace:
java.lang.AssertionError: There are still nodes recoverying
	at __randomizedtesting.SeedInfo.seed([778CBE7FFE1AF693:F66A3067894596AF]:0)
	at org.junit.Assert.fail(Assert.java:93)
	at org.apache.solr.cloud.AbstractDistribZkTestBase.waitForRecoveriesToFinish(AbstractDistribZkTestBase.java:154)
	at org.apache.solr.cloud.AbstractFullDistribZkTestBase.waitForRecoveriesToFinish(AbstractFullDistribZkTestBase.java:560)
	at org.apache.solr.cloud.AbstractFullDistribZkTestBase.waitForThingsToLevelOut(AbstractFullDistribZkTestBase.java:1135)
	at org.apache.solr.cloud.SyncSliceTest.doTest(SyncSliceTest.java:162)
	at org.apache.solr.BaseDistributedSearchTestCase.testDistribSearch(BaseDistributedSearchTestCase.java:695)
	at sun.reflect.NativeMethodAccessorImpl.invoke0(Native Method)
	at sun.reflect.NativeMethodAccessorImpl.invoke(NativeMethodAccessorImpl.java:57)
	at sun.reflect.DelegatingMethodAccessorImpl.invoke(DelegatingMethodAccessorImpl.java:43)
	at java.lang.reflect.Method.invoke(Method.java:601)
	at com.carrotsearch.randomizedtesting.RandomizedRunner.invoke(RandomizedRunner.java:1559)
	at com.carrotsearch.randomizedtesting.RandomizedRunner.access$600(RandomizedRunner.java:79)
	at com.carrotsearch.randomizedtesting.RandomizedRunner$6.evaluate(RandomizedRunner.java:737)
	at com.carrotsearch.randomizedtesting.RandomizedRunner$7.evaluate(RandomizedRunner.java:773)
	at com.carrotsearch.randomizedtesting.RandomizedRunner$8.evaluate(RandomizedRunner.java:787)
	at com.carrotsearch.randomizedtesting.rules.SystemPropertiesRestoreRule$1.evaluate(SystemPropertiesRestoreRule.java:53)
	at org.apache.lucene.util.TestRuleSetupTeardownChained$1.evaluate(TestRuleSetupTeardownChained.java:50)
	at org.apache.lucene.util.TestRuleFieldCacheSanity$1.evaluate(TestRuleFieldCacheSanity.java:51)
	at org.apache.lucene.util.AbstractBeforeAfterRule$1.evaluate(AbstractBeforeAfterRule.java:45)
	at com.carrotsearch.randomizedtesting.rules.SystemPropertiesInvariantRule$1.evaluate(SystemPropertiesInvariantRule.java:55)
	at org.apache.lucene.util.TestRuleThreadAndTestName$1.evaluate(TestRuleThreadAndTestName.java:48)
	at org.apache.lucene.util.TestRuleIgnoreAfterMaxFailures$1.evaluate(TestRuleIgnoreAfterMaxFailures.java:70)
	at org.apache.lucene.util.TestRuleMarkFailure$1.evaluate(TestRuleMarkFailure.java:48)
	at com.carrotsearch.randomizedtesting.rules.StatementAdapter.evaluate(StatementAdapter.java:36)
	at com.carrotsearch.randomizedtesting.ThreadLeakControl$StatementRunner.run(ThreadLeakControl.java:358)
	at com.carrotsearch.randomizedtesting.ThreadLeakControl.forkTimeoutingTask(ThreadLeakControl.java:782)
	at com.carrotsearch.randomizedtesting.ThreadLeakControl$3.evaluate(ThreadLeakControl.java:442)
	at com.carrotsearch.randomizedtesting.RandomizedRunner.runSingleTest(RandomizedRunner.java:746)
	at com.carrotsearch.randomizedtesting.RandomizedRunner$3.evaluate(RandomizedRunner.java:648)
	at com.carrotsearch.randomizedtesting.RandomizedRunner$4.evaluate(RandomizedRunner.java:682)
	at com.carrotsearch.randomizedtesting.RandomizedRunner$5.evaluate(RandomizedRunner.java:693)
	at com.carrotsearch.randomizedtesting.rules.StatementAdapter.evaluate(StatementAdapter.java:36)
	at com.carrotsearch.randomizedtesting.rules.SystemPropertiesRestoreRule$1.evaluate(SystemPropertiesRestoreRule.java:53)
	at org.apache.lucene.util.AbstractBeforeAfterRule$1.evaluate(AbstractBeforeAfterRule.java:45)
	at org.apache.lucene.util.TestRuleStoreClassName$1.evaluate(TestRuleStoreClassName.java:42)
	at com.carrotsearch.randomizedtesting.rules.SystemPropertiesInvariantRule$1.evaluate(SystemPropertiesInvariantRule.java:55)
	at com.carrotsearch.randomizedtesting.rules.NoShadowingOrOverridesOnMethodsRule$1.evaluate(NoShadowingOrOverridesOnMethodsRule.java:39)
	at com.carrotsearch.randomizedtesting.rules.NoShadowingOrOverridesOnMethodsRule$1.evaluate(NoShadowingOrOverridesOnMethodsRule.java:39)
	at com.carrotsearch.randomizedtesting.rules.StatementAdapter.evaluate(StatementAdapter.java:36)
	at org.apache.lucene.util.TestRuleAssertionsRequired$1.evaluate(TestRuleAssertionsRequired.java:43)
	at org.apache.lucene.util.TestRuleMarkFailure$1.evaluate(TestRuleMarkFailure.java:48)
	at org.apache.lucene.util.TestRuleIgnoreAfterMaxFailures$1.evaluate(TestRuleIgnoreAfterMaxFailures.java:70)
	at org.apache.lucene.util.TestRuleIgnoreTestSuites$1.evaluate(TestRuleIgnoreTestSuites.java:55)
	at com.carrotsearch.randomizedtesting.rules.StatementAdapter.evaluate(StatementAdapter.java:36)
	at com.carrotsearch.randomizedtesting.ThreadLeakControl$StatementRunner.run(ThreadLeakControl.java:358)
	at java.lang.Thread.run(Thread.java:722)




Build Log:
[...truncated 7691 lines...]
[junit4:junit4] Suite: org.apache.solr.cloud.BasicDistributedZk2Test
[junit4:junit4]   2> 324 T11 oas.SolrTestCaseJ4.setUp ###Starting testDistribSearch
[junit4:junit4]   2> Creating dataDir: /usr/home/hudson/hudson-slave/workspace/Lucene-Solr-Tests-4.x-java7/solr/build/solr-core/test/J1/./solrtest-BasicDistributedZk2Test-1348388955823
[junit4:junit4]   2> 341 T11 oasc.ZkTestServer.run STARTING ZK TEST SERVER
[junit4:junit4]   2> 500 T12 oaz.Environment.logEnv Server environment:zookeeper.version=3.3.6-1366786, built on 07/29/2012 06:22 GMT
[junit4:junit4]   2> 501 T12 oaz.Environment.logEnv Server environment:host.name=lucene.zones.apache.org
[junit4:junit4]   2> 502 T12 oaz.Environment.logEnv Server environment:java.version=1.7.0_06
[junit4:junit4]   2> 502 T12 oaz.Environment.logEnv Server environment:java.vendor=Oracle Corporation
[junit4:junit4]   2> 503 T12 oaz.Environment.logEnv Server environment:java.home=/usr/local/openjdk7/jre
[junit4:junit4]   2> 503 T12 oaz.Environment.logEnv Server environment:java.class.path=/usr/home/hudson/hudson-slave/workspace/Lucene-Solr-Tests-4.x-java7/solr/build/solr-core/classes/test:/usr/home/hudson/hudson-slave/workspace/Lucene-Solr-Tests-4.x-java7/solr/build/solr-test-framework/classes/java:/usr/home/hudson/hudson-slave/workspace/Lucene-Solr-Tests-4.x-java7/solr/build/solr-core/test-files:/usr/home/hudson/hudson-slave/workspace/Lucene-Solr-Tests-4.x-java7/lucene/build/codecs/classes/java:/usr/home/hudson/hudson-slave/workspace/Lucene-Solr-Tests-4.x-java7/lucene/build/test-framework/classes/java:/usr/home/hudson/hudson-slave/workspace/Lucene-Solr-Tests-4.x-java7/solr/build/solr-solrj/classes/java:/usr/home/hudson/hudson-slave/workspace/Lucene-Solr-Tests-4.x-java7/solr/build/solr-core/classes/java:/usr/home/hudson/hudson-slave/workspace/Lucene-Solr-Tests-4.x-java7/lucene/build/analysis/common/lucene-analyzers-common-4.1-SNAPSHOT.jar:/usr/home/hudson/hudson-slave/workspace/Lucene-Solr-Tests-4.x-java7/lucene/build/analysis/kuromoji/lucene-analyzers-kuromoji-4.1-SNAPSHOT.jar:/usr/home/hudson/hudson-slave/workspace/Lucene-Solr-Tests-4.x-java7/lucene/build/analysis/phonetic/lucene-analyzers-phonetic-4.1-SNAPSHOT.jar:/usr/home/hudson/hudson-slave/workspace/Lucene-Solr-Tests-4.x-java7/lucene/build/highlighter/lucene-highlighter-4.1-SNAPSHOT.jar:/usr/home/hudson/hudson-slave/workspace/Lucene-Solr-Tests-4.x-java7/lucene/build/memory/lucene-memory-4.1-SNAPSHOT.jar:/usr/home/hudson/hudson-slave/workspace/Lucene-Solr-Tests-4.x-java7/lucene/build/misc/lucene-misc-4.1-SNAPSHOT.jar:/usr/home/hudson/hudson-slave/workspace/Lucene-Solr-Tests-4.x-java7/lucene/build/spatial/lucene-spatial-4.1-SNAPSHOT.jar:/usr/home/hudson/hudson-slave/workspace/Lucene-Solr-Tests-4.x-java7/lucene/build/suggest/lucene-suggest-4.1-SNAPSHOT.jar:/usr/home/hudson/hudson-slave/workspace/Lucene-Solr-Tests-4.x-java7/lucene/build/grouping/lucene-grouping-4.1-SNAPSHOT.jar:/usr/home/hudson/hudson-slave/workspace/Lucene-Solr-Tests-4.x-java7/lucene/build/queries/lucene-queries-4.1-SNAPSHOT.jar:/usr/home/hudson/hudson-slave/workspace/Lucene-Solr-Tests-4.x-java7/lucene/build/queryparser/lucene-queryparser-4.1-SNAPSHOT.jar:/usr/home/hudson/hudson-slave/workspace/Lucene-Solr-Tests-4.x-java7/solr/core/lib/commons-cli-1.2.jar:/usr/home/hudson/hudson-slave/workspace/Lucene-Solr-Tests-4.x-java7/solr/core/lib/commons-codec-1.7.jar:/usr/home/hudson/hudson-slave/workspace/Lucene-Solr-Tests-4.x-java7/solr/core/lib/commons-fileupload-1.2.1.jar:/usr/home/hudson/hudson-slave/workspace/Lucene-Solr-Tests-4.x-java7/solr/core/lib/commons-lang-2.6.jar:/usr/home/hudson/hudson-slave/workspace/Lucene-Solr-Tests-4.x-java7/solr/core/lib/easymock-2.2.jar:/usr/home/hudson/hudson-slave/workspace/Lucene-Solr-Tests-4.x-java7/solr/core/lib/guava-r05.jar:/usr/home/hudson/hudson-slave/workspace/Lucene-Solr-Tests-4.x-java7/solr/core/lib/javax.servlet-api-3.0.1.jar:/usr/home/hudson/hudson-slave/workspace/Lucene-Solr-Tests-4.x-java7/solr/core/lib/spatial4j-0.3.jar:/usr/home/hudson/hudson-slave/workspace/Lucene-Solr-Tests-4.x-java7/solr/solrj/lib/commons-io-2.1.jar:/usr/home/hudson/hudson-slave/workspace/Lucene-Solr-Tests-4.x-java7/solr/solrj/lib/httpclient-4.1.3.jar:/usr/home/hudson/hudson-slave/workspace/Lucene-Solr-Tests-4.x-java7/solr/solrj/lib/httpcore-4.1.4.jar:/usr/home/hudson/hudson-slave/workspace/Lucene-Solr-Tests-4.x-java7/solr/solrj/lib/httpmime-4.1.3.jar:/usr/home/hudson/hudson-slave/workspace/Lucene-Solr-Tests-4.x-java7/solr/solrj/lib/jcl-over-slf4j-1.6.4.jar:/usr/home/hudson/hudson-slave/workspace/Lucene-Solr-Tests-4.x-java7/solr/solrj/lib/log4j-over-slf4j-1.6.4.jar:/usr/home/hudson/hudson-slave/workspace/Lucene-Solr-Tests-4.x-java7/solr/solrj/lib/slf4j-api-1.6.4.jar:/usr/home/hudson/hudson-slave/workspace/Lucene-Solr-Tests-4.x-java7/solr/solrj/lib/slf4j-jdk14-1.6.4.jar:/usr/home/hudson/hudson-slave/workspace/Lucene-Solr-Tests-4.x-java7/solr/solrj/lib/wstx-asl-3.2.7.jar:/usr/home/hudson/hudson-slave/workspace/Lucene-Solr-Tests-4.x-java7/solr/solrj/lib/zookeeper-3.3.6.jar:/usr/home/hudson/hudson-slave/workspace/Lucene-Solr-Tests-4.x-java7/solr/example/lib/jetty-continuation-8.1.2.v20120308.jar:/usr/home/hudson/hudson-slave/workspace/Lucene-Solr-Tests-4.x-java7/solr/example/lib/jetty-deploy-8.1.2.v20120308.jar:/usr/home/hudson/hudson-slave/workspace/Lucene-Solr-Tests-4.x-java7/solr/example/lib/jetty-http-8.1.2.v20120308.jar:/usr/home/hudson/hudson-slave/workspace/Lucene-Solr-Tests-4.x-java7/solr/example/lib/jetty-io-8.1.2.v20120308.jar:/usr/home/hudson/hudson-slave/workspace/Lucene-Solr-Tests-4.x-java7/solr/example/lib/jetty-jmx-8.1.2.v20120308.jar:/usr/home/hudson/hudson-slave/workspace/Lucene-Solr-Tests-4.x-java7/solr/example/lib/jetty-security-8.1.2.v20120308.jar:/usr/home/hudson/hudson-slave/workspace/Lucene-Solr-Tests-4.x-java7/solr/example/lib/jetty-server-8.1.2.v20120308.jar:/usr/home/hudson/hudson-slave/workspace/Lucene-Solr-Tests-4.x-java7/solr/example/lib/jetty-servlet-8.1.2.v20120308.jar:/usr/home/hudson/hudson-slave/workspace/Lucene-Solr-Tests-4.x-java7/solr/example/lib/jetty-util-8.1.2.v20120308.jar:/usr/home/hudson/hudson-slave/workspace/Lucene-Solr-Tests-4.x-java7/solr/example/lib/jetty-webapp-8.1.2.v20120308.jar:/usr/home/hudson/hudson-slave/workspace/Lucene-Solr-Tests-4.x-java7/solr/example/lib/jetty-xml-8.1.2.v20120308.jar:/usr/home/hudson/hudson-slave/workspace/Lucene-Solr-Tests-4.x-java7/solr/example/lib/servlet-api-3.0.jar:/usr/home/hudson/hudson-slave/workspace/Lucene-Solr-Tests-4.x-java7/solr/example/example-DIH/solr/db/lib/hsqldb-1.8.0.10.jar:/usr/home/hudson/hudson-slave/workspace/Lucene-Solr-Tests-4.x-java7/lucene/build/core/classes/java:/usr/home/hudson/hudson-slave/workspace/Lucene-Solr-Tests-4.x-java7/lucene/test-framework/lib/junit-4.10.jar:/usr/home/hudson/hudson-slave/workspace/Lucene-Solr-Tests-4.x-java7/lucene/test-framework/lib/randomizedtesting-runner-2.0.1.jar:/home/hudson/hudson-slave/tools/Ant/ant-1.8.2/lib/ant-launcher.jar:/home/hudson/.ant/lib/ivy-2.2.0.jar:/home/hudson/hudson-slave/tools/Ant/ant-1.8.2/lib/ant-apache-regexp.jar:/home/hudson/hudson-slave/tools/Ant/ant-1.8.2/lib/ant-junit.jar:/home/hudson/hudson-slave/tools/Ant/ant-1.8.2/lib/ant-apache-bsf.jar:/home/hudson/hudson-slave/tools/Ant/ant-1.8.2/lib/ant-commons-net.jar:/home/hudson/hudson-slave/tools/Ant/ant-1.8.2/lib/ant-antlr.jar:/home/hudson/hudson-slave/tools/Ant/ant-1.8.2/lib/ant-apache-log4j.jar:/home/hudson/hudson-slave/tools/Ant/ant-1.8.2/lib/ant-commons-logging.jar:/home/hudson/hudson-slave/tools/Ant/ant-1.8.2/lib/ant-apache-xalan2.jar:/home/hudson/hudson-slave/tools/Ant/ant-1.8.2/lib/ant-apache-oro.jar:/home/hudson/hudson-slave/tools/Ant/ant-1.8.2/lib/ant-junit4.jar:/home/hudson/hudson-slave/tools/Ant/ant-1.8.2/lib/ant-netrexx.jar:/home/hudson/hudson-slave/tools/Ant/ant-1.8.2/lib/ant-swing.jar:/home/hudson/hudson-slave/tools/Ant/ant-1.8.2/lib/ant-javamail.jar:/home/hudson/hudson-slave/tools/Ant/ant-1.8.2/lib/ant-jsch.jar:/home/hudson/hudson-slave/tools/Ant/ant-1.8.2/lib/ant-jmf.jar:/home/hudson/hudson-slave/tools/Ant/ant-1.8.2/lib/ant.jar:/home/hudson/hudson-slave/tools/Ant/ant-1.8.2/lib/ant-apache-bcel.jar:/home/hudson/hudson-slave/tools/Ant/ant-1.8.2/lib/ant-jai.jar:/home/hudson/hudson-slave/tools/Ant/ant-1.8.2/lib/ant-testutil.jar:/home/hudson/hudson-slave/tools/Ant/ant-1.8.2/lib/ant-apache-resolver.jar:/home/hudson/hudson-slave/tools/Ant/ant-1.8.2/lib/ant-jdepend.jar:/usr/local/openjdk7/lib/tools.jar:/home/hudson/.ivy2/cache/com.carrotsearch.randomizedtesting/junit4-ant/jars/junit4-ant-2.0.1.jar
[junit4:junit4]   2> 507 T12 oaz.Environment.logEnv Server environment:java.library.path=/usr/local/openjdk7/jre/lib/amd64/server:/usr/local/openjdk7/jre/lib/amd64:/usr/local/openjdk7/jre/../lib/amd64:/usr/local/openjdk6/jre/lib/amd64/server:/usr/local/openjdk6/jre/lib/amd64:/usr/local/openjdk6/jre/../lib/amd64:/usr/java/packages/lib/amd64:/lib:/usr/lib:/usr/local/lib
[junit4:junit4]   2> 508 T12 oaz.Environment.logEnv Server environment:java.io.tmpdir=.
[junit4:junit4]   2> 509 T12 oaz.Environment.logEnv Server environment:java.compiler=<NA>
[junit4:junit4]   2> 509 T12 oaz.Environment.logEnv Server environment:os.name=FreeBSD
[junit4:junit4]   2> 510 T12 oaz.Environment.logEnv Server environment:os.arch=amd64
[junit4:junit4]   2> 511 T12 oaz.Environment.logEnv Server environment:os.version=9.0-RELEASE
[junit4:junit4]   2> 511 T12 oaz.Environment.logEnv Server environment:user.name=hudson
[junit4:junit4]   2> 512 T12 oaz.Environment.logEnv Server environment:user.home=/home/hudson
[junit4:junit4]   2> 513 T12 oaz.Environment.logEnv Server environment:user.dir=/usr/home/hudson/hudson-slave/workspace/Lucene-Solr-Tests-4.x-java7/solr/build/solr-core/test/J1
[junit4:junit4]   2> 654 T12 oazs.ZooKeeperServer.setTickTime tickTime set to 1000
[junit4:junit4]   2> 710 T12 oazs.NIOServerCnxn$Factory.<init> binding to port 0.0.0.0/0.0.0.0:0
[junit4:junit4]   2> 753 T11 oasc.ZkTestServer.run start zk server on port:27313
[junit4:junit4]   2> 845 T12 oazsp.FileTxnSnapLog.save Snapshotting: 0
[junit4:junit4]   2> 849 T11 oaz.Environment.logEnv Client environment:zookeeper.version=3.3.6-1366786, built on 07/29/2012 06:22 GMT
[junit4:junit4]   2> 850 T11 oaz.Environment.logEnv Client environment:host.name=lucene.zones.apache.org
[junit4:junit4]   2> 850 T11 oaz.Environment.logEnv Client environment:java.version=1.7.0_06
[junit4:junit4]   2> 851 T11 oaz.Environment.logEnv Client environment:java.vendor=Oracle Corporation
[junit4:junit4]   2> 852 T11 oaz.Environment.logEnv Client environment:java.home=/usr/local/openjdk7/jre
[junit4:junit4]   2> 852 T11 oaz.Environment.logEnv Client environment:java.class.path=/usr/home/hudson/hudson-slave/workspace/Lucene-Solr-Tests-4.x-java7/solr/build/solr-core/classes/test:/usr/home/hudson/hudson-slave/workspace/Lucene-Solr-Tests-4.x-java7/solr/build/solr-test-framework/classes/java:/usr/home/hudson/hudson-slave/workspace/Lucene-Solr-Tests-4.x-java7/solr/build/solr-core/test-files:/usr/home/hudson/hudson-slave/workspace/Lucene-Solr-Tests-4.x-java7/lucene/build/codecs/classes/java:/usr/home/hudson/hudson-slave/workspace/Lucene-Solr-Tests-4.x-java7/lucene/build/test-framework/classes/java:/usr/home/hudson/hudson-slave/workspace/Lucene-Solr-Tests-4.x-java7/solr/build/solr-solrj/classes/java:/usr/home/hudson/hudson-slave/workspace/Lucene-Solr-Tests-4.x-java7/solr/build/solr-core/classes/java:/usr/home/hudson/hudson-slave/workspace/Lucene-Solr-Tests-4.x-java7/lucene/build/analysis/common/lucene-analyzers-common-4.1-SNAPSHOT.jar:/usr/home/hudson/hudson-slave/workspace/Lucene-Solr-Tests-4.x-java7/lucene/build/analysis/kuromoji/lucene-analyzers-kuromoji-4.1-SNAPSHOT.jar:/usr/home/hudson/hudson-slave/workspace/Lucene-Solr-Tests-4.x-java7/lucene/build/analysis/phonetic/lucene-analyzers-phonetic-4.1-SNAPSHOT.jar:/usr/home/hudson/hudson-slave/workspace/Lucene-Solr-Tests-4.x-java7/lucene/build/highlighter/lucene-highlighter-4.1-SNAPSHOT.jar:/usr/home/hudson/hudson-slave/workspace/Lucene-Solr-Tests-4.x-java7/lucene/build/memory/lucene-memory-4.1-SNAPSHOT.jar:/usr/home/hudson/hudson-slave/workspace/Lucene-Solr-Tests-4.x-java7/lucene/build/misc/lucene-misc-4.1-SNAPSHOT.jar:/usr/home/hudson/hudson-slave/workspace/Lucene-Solr-Tests-4.x-java7/lucene/build/spatial/lucene-spatial-4.1-SNAPSHOT.jar:/usr/home/hudson/hudson-slave/workspace/Lucene-Solr-Tests-4.x-java7/lucene/build/suggest/lucene-suggest-4.1-SNAPSHOT.jar:/usr/home/hudson/hudson-slave/workspace/Lucene-Solr-Tests-4.x-java7/lucene/build/grouping/lucene-grouping-4.1-SNAPSHOT.jar:/usr/home/hudson/hudson-slave/workspace/Lucene-Solr-Tests-4.x-java7/lucene/build/queries/lucene-queries-4.1-SNAPSHOT.jar:/usr/home/hudson/hudson-slave/workspace/Lucene-Solr-Tests-4.x-java7/lucene/build/queryparser/lucene-queryparser-4.1-SNAPSHOT.jar:/usr/home/hudson/hudson-slave/workspace/Lucene-Solr-Tests-4.x-java7/solr/core/lib/commons-cli-1.2.jar:/usr/home/hudson/hudson-slave/workspace/Lucene-Solr-Tests-4.x-java7/solr/core/lib/commons-codec-1.7.jar:/usr/home/hudson/hudson-slave/workspace/Lucene-Solr-Tests-4.x-java7/solr/core/lib/commons-fileupload-1.2.1.jar:/usr/home/hudson/hudson-slave/workspace/Lucene-Solr-Tests-4.x-java7/solr/core/lib/commons-lang-2.6.jar:/usr/home/hudson/hudson-slave/workspace/Lucene-Solr-Tests-4.x-java7/solr/core/lib/easymock-2.2.jar:/usr/home/hudson/hudson-slave/workspace/Lucene-Solr-Tests-4.x-java7/solr/core/lib/guava-r05.jar:/usr/home/hudson/hudson-slave/workspace/Lucene-Solr-Tests-4.x-java7/solr/core/lib/javax.servlet-api-3.0.1.jar:/usr/home/hudson/hudson-slave/workspace/Lucene-Solr-Tests-4.x-java7/solr/core/lib/spatial4j-0.3.jar:/usr/home/hudson/hudson-slave/workspace/Lucene-Solr-Tests-4.x-java7/solr/solrj/lib/commons-io-2.1.jar:/usr/home/hudson/hudson-slave/workspace/Lucene-Solr-Tests-4.x-java7/solr/solrj/lib/httpclient-4.1.3.jar:/usr/home/hudson/hudson-slave/workspace/Lucene-Solr-Tests-4.x-java7/solr/solrj/lib/httpcore-4.1.4.jar:/usr/home/hudson/hudson-slave/workspace/Lucene-Solr-Tests-4.x-java7/solr/solrj/lib/httpmime-4.1.3.jar:/usr/home/hudson/hudson-slave/workspace/Lucene-Solr-Tests-4.x-java7/solr/solrj/lib/jcl-over-slf4j-1.6.4.jar:/usr/home/hudson/hudson-slave/workspace/Lucene-Solr-Tests-4.x-java7/solr/solrj/lib/log4j-over-slf4j-1.6.4.jar:/usr/home/hudson/hudson-slave/workspace/Lucene-Solr-Tests-4.x-java7/solr/solrj/lib/slf4j-api-1.6.4.jar:/usr/home/hudson/hudson-slave/workspace/Lucene-Solr-Tests-4.x-java7/solr/solrj/lib/slf4j-jdk14-1.6.4.jar:/usr/home/hudson/hudson-slave/workspace/Lucene-Solr-Tests-4.x-java7/solr/solrj/lib/wstx-asl-3.2.7.jar:/usr/home/hudson/hudson-slave/workspace/Lucene-Solr-Tests-4.x-java7/solr/solrj/lib/zookeeper-3.3.6.jar:/usr/home/hudson/hudson-slave/workspace/Lucene-Solr-Tests-4.x-java7/solr/example/lib/jetty-continuation-8.1.2.v20120308.jar:/usr/home/hudson/hudson-slave/workspace/Lucene-Solr-Tests-4.x-java7/solr/example/lib/jetty-deploy-8.1.2.v20120308.jar:/usr/home/hudson/hudson-slave/workspace/Lucene-Solr-Tests-4.x-java7/solr/example/lib/jetty-http-8.1.2.v20120308.jar:/usr/home/hudson/hudson-slave/workspace/Lucene-Solr-Tests-4.x-java7/solr/example/lib/jetty-io-8.1.2.v20120308.jar:/usr/home/hudson/hudson-slave/workspace/Lucene-Solr-Tests-4.x-java7/solr/example/lib/jetty-jmx-8.1.2.v20120308.jar:/usr/home/hudson/hudson-slave/workspace/Lucene-Solr-Tests-4.x-java7/solr/example/lib/jetty-security-8.1.2.v20120308.jar:/usr/home/hudson/hudson-slave/workspace/Lucene-Solr-Tests-4.x-java7/solr/example/lib/jetty-server-8.1.2.v20120308.jar:/usr/home/hudson/hudson-slave/workspace/Lucene-Solr-Tests-4.x-java7/solr/example/lib/jetty-servlet-8.1.2.v20120308.jar:/usr/home/hudson/hudson-slave/workspace/Lucene-Solr-Tests-4.x-java7/solr/example/lib/jetty-util-8.1.2.v20120308.jar:/usr/home/hudson/hudson-slave/workspace/Lucene-Solr-Tests-4.x-java7/solr/example/lib/jetty-webapp-8.1.2.v20120308.jar:/usr/home/hudson/hudson-slave/workspace/Lucene-Solr-Tests-4.x-java7/solr/example/lib/jetty-xml-8.1.2.v20120308.jar:/usr/home/hudson/hudson-slave/workspace/Lucene-Solr-Tests-4.x-java7/solr/example/lib/servlet-api-3.0.jar:/usr/home/hudson/hudson-slave/workspace/Lucene-Solr-Tests-4.x-java7/solr/example/example-DIH/solr/db/lib/hsqldb-1.8.0.10.jar:/usr/home/hudson/hudson-slave/workspace/Lucene-Solr-Tests-4.x-java7/lucene/build/core/classes/java:/usr/home/hudson/hudson-slave/workspace/Lucene-Solr-Tests-4.x-java7/lucene/test-framework/lib/junit-4.10.jar:/usr/home/hudson/hudson-slave/workspace/Lucene-Solr-Tests-4.x-java7/lucene/test-framework/lib/randomizedtesting-runner-2.0.1.jar:/home/hudson/hudson-slave/tools/Ant/ant-1.8.2/lib/ant-launcher.jar:/home/hudson/.ant/lib/ivy-2.2.0.jar:/home/hudson/hudson-slave/tools/Ant/ant-1.8.2/lib/ant-apache-regexp.jar:/home/hudson/hudson-slave/tools/Ant/ant-1.8.2/lib/ant-junit.jar:/home/hudson/hudson-slave/tools/Ant/ant-1.8.2/lib/ant-apache-bsf.jar:/home/hudson/hudson-slave/tools/Ant/ant-1.8.2/lib/ant-commons-net.jar:/home/hudson/hudson-slave/tools/Ant/ant-1.8.2/lib/ant-antlr.jar:/home/hudson/hudson-slave/tools/Ant/ant-1.8.2/lib/ant-apache-log4j.jar:/home/hudson/hudson-slave/tools/Ant/ant-1.8.2/lib/ant-commons-logging.jar:/home/hudson/hudson-slave/tools/Ant/ant-1.8.2/lib/ant-apache-xalan2.jar:/home/hudson/hudson-slave/tools/Ant/ant-1.8.2/lib/ant-apache-oro.jar:/home/hudson/hudson-slave/tools/Ant/ant-1.8.2/lib/ant-junit4.jar:/home/hudson/hudson-slave/tools/Ant/ant-1.8.2/lib/ant-netrexx.jar:/home/hudson/hudson-slave/tools/Ant/ant-1.8.2/lib/ant-swing.jar:/home/hudson/hudson-slave/tools/Ant/ant-1.8.2/lib/ant-javamail.jar:/home/hudson/hudson-slave/tools/Ant/ant-1.8.2/lib/ant-jsch.jar:/home/hudson/hudson-slave/tools/Ant/ant-1.8.2/lib/ant-jmf.jar:/home/hudson/hudson-slave/tools/Ant/ant-1.8.2/lib/ant.jar:/home/hudson/hudson-slave/tools/Ant/ant-1.8.2/lib/ant-apache-bcel.jar:/home/hudson/hudson-slave/tools/Ant/ant-1.8.2/lib/ant-jai.jar:/home/hudson/hudson-slave/tools/Ant/ant-1.8.2/lib/ant-testutil.jar:/home/hudson/hudson-slave/tools/Ant/ant-1.8.2/lib/ant-apache-resolver.jar:/home/hudson/hudson-slave/tools/Ant/ant-1.8.2/lib/ant-jdepend.jar:/usr/local/openjdk7/lib/tools.jar:/home/hudson/.ivy2/cache/com.carrotsearch.randomizedtesting/junit4-ant/jars/junit4-ant-2.0.1.jar
[junit4:junit4]   2> 855 T11 oaz.Environment.logEnv Client environment:java.library.path=/usr/local/openjdk7/jre/lib/amd64/server:/usr/local/openjdk7/jre/lib/amd64:/usr/local/openjdk7/jre/../lib/amd64:/usr/local/openjdk6/jre/lib/amd64/server:/usr/local/openjdk6/jre/lib/amd64:/usr/local/openjdk6/jre/../lib/amd64:/usr/java/packages/lib/amd64:/lib:/usr/lib:/usr/local/lib
[junit4:junit4]   2> 855 T11 oaz.Environment.logEnv Client environment:java.io.tmpdir=.
[junit4:junit4]   2> 856 T11 oaz.Environment.logEnv Client environment:java.compiler=<NA>
[junit4:junit4]   2> 857 T11 oaz.Environment.logEnv Client environment:os.name=FreeBSD
[junit4:junit4]   2> 857 T11 oaz.Environment.logEnv Client environment:os.arch=amd64
[junit4:junit4]   2> 858 T11 oaz.Environment.logEnv Client environment:os.version=9.0-RELEASE
[junit4:junit4]   2> 859 T11 oaz.Environment.logEnv Client environment:user.name=hudson
[junit4:junit4]   2> 859 T11 oaz.Environment.logEnv Client environment:user.home=/home/hudson
[junit4:junit4]   2> 860 T11 oaz.Environment.logEnv Client environment:user.dir=/usr/home/hudson/hudson-slave/workspace/Lucene-Solr-Tests-4.x-java7/solr/build/solr-core/test/J1
[junit4:junit4]   2> 864 T11 oaz.ZooKeeper.<init> Initiating client connection, connectString=127.0.0.1:27313 sessionTimeout=10000 watcher=org.apache.solr.common.cloud.ConnectionManager@528a16d7
[junit4:junit4]   2> 910 T15 oaz.ClientCnxn$SendThread.startConnect Opening socket connection to server /127.0.0.1:27313
[junit4:junit4]   2> 910 T11 oascc.ConnectionManager.waitForConnected Waiting for client to connect to ZooKeeper
[junit4:junit4]   2> 915 T15 oaz.ClientCnxn$SendThread.primeConnection Socket connection established to localhost/127.0.0.1:27313, initiating session
[junit4:junit4]   2> 916 T13 oazs.NIOServerCnxn$Factory.run Accepted socket connection from /140.211.11.196:41232
[junit4:junit4]   2> 934 T13 oazs.NIOServerCnxn.doIO WARNING Exception causing close of session 0x0 due to java.io.IOException: ZooKeeperServer not running
[junit4:junit4]   2> 934 T13 oazs.NIOServerCnxn.closeSock Closed socket connection for client /140.211.11.196:41232 (no session established for client)
[junit4:junit4]   2> 935 T15 oaz.ClientCnxn$SendThread.run Unable to read additional data from server sessionid 0x0, likely server has closed socket, closing socket connection and attempting reconnect
[junit4:junit4]   2> 2290 T15 oaz.ClientCnxn$SendThread.startConnect Opening socket connection to server localhost/127.0.0.1:27313
[junit4:junit4]   2> 2291 T15 oaz.ClientCnxn$SendThread.primeConnection Socket connection established to localhost/127.0.0.1:27313, initiating session
[junit4:junit4]   2> 2291 T13 oazs.NIOServerCnxn$Factory.run Accepted socket connection from /140.211.11.196:46789
[junit4:junit4]   2> 2293 T13 oazs.NIOServerCnxn.readConnectRequest Client attempting to establish new session at /140.211.11.196:46789
[junit4:junit4]   2> 2315 T16 oazsp.FileTxnLog.append Creating new log file: log.1
[junit4:junit4]   2> 2377 T16 oazs.NIOServerCnxn.finishSessionInit Established session 0x139f23ea8d50000 with negotiated timeout 10000 for client /140.211.11.196:46789
[junit4:junit4]   2> 2378 T15 oaz.ClientCnxn$SendThread.readConnectResult Session establishment complete on server localhost/127.0.0.1:27313, sessionid = 0x139f23ea8d50000, negotiated timeout = 10000
[junit4:junit4]   2> 2411 T17 oascc.ConnectionManager.process Watcher org.apache.solr.common.cloud.ConnectionManager@528a16d7 name:ZooKeeperConnection Watcher:127.0.0.1:27313 got event WatchedEvent state:SyncConnected type:None path:null path:null type:None
[junit4:junit4]   2> 2412 T11 oascc.ConnectionManager.waitForConnected Client is connected to ZooKeeper
[junit4:junit4]   2> 2416 T11 oascc.SolrZkClient.makePath makePath: /solr
[junit4:junit4]   2> 2540 T18 oazs.PrepRequestProcessor.pRequest Processed session termination for sessionid: 0x139f23ea8d50000
[junit4:junit4]   2> 2542 T17 oaz.ClientCnxn$EventThread.run EventThread shut down
[junit4:junit4]   2> 2542 T11 oaz.ZooKeeper.close Session: 0x139f23ea8d50000 closed
[junit4:junit4]   2> 2544 T13 oazs.NIOServerCnxn.closeSock Closed socket connection for client /140.211.11.196:46789 which had sessionid 0x139f23ea8d50000
[junit4:junit4]   2> 2545 T11 oaz.ZooKeeper.<init> Initiating client connection, connectString=127.0.0.1:27313/solr sessionTimeout=10000 watcher=org.apache.solr.common.cloud.ConnectionManager@29a3a9db
[junit4:junit4]   2> 2546 T19 oaz.ClientCnxn$SendThread.startConnect Opening socket connection to server /127.0.0.1:27313
[junit4:junit4]   2> 2546 T11 oascc.ConnectionManager.waitForConnected Waiting for client to connect to ZooKeeper
[junit4:junit4]   2> 2548 T19 oaz.ClientCnxn$SendThread.primeConnection Socket connection established to localhost/127.0.0.1:27313, initiating session
[junit4:junit4]   2> 2549 T13 oazs.NIOServerCnxn$Factory.run Accepted socket connection from /140.211.11.196:39892
[junit4:junit4]   2> 2550 T13 oazs.NIOServerCnxn.readConnectRequest Client attempting to establish new session at /140.211.11.196:39892
[junit4:junit4]   2> 2553 T16 oazs.NIOServerCnxn.finishSessionInit Established session 0x139f23ea8d50001 with negotiated timeout 10000 for client /140.211.11.196:39892
[junit4:junit4]   2> 2554 T19 oaz.ClientCnxn$SendThread.readConnectResult Session establishment complete on server localhost/127.0.0.1:27313, sessionid = 0x139f23ea8d50001, negotiated timeout = 10000
[junit4:junit4]   2> 2555 T20 oascc.ConnectionManager.process Watcher org.apache.solr.common.cloud.ConnectionManager@29a3a9db name:ZooKeeperConnection Watcher:127.0.0.1:27313/solr got event WatchedEvent state:SyncConnected type:None path:null path:null type:None
[junit4:junit4]   2> 2555 T11 oascc.ConnectionManager.waitForConnected Client is connected to ZooKeeper
[junit4:junit4]   2> 2578 T11 oascc.SolrZkClient.makePath makePath: /collections/collection1
[junit4:junit4]   2> 2584 T11 oascc.SolrZkClient.makePath makePath: /collections/collection1/shards
[junit4:junit4]   2> 2589 T11 oascc.SolrZkClient.makePath makePath: /collections/control_collection
[junit4:junit4]   2> 2593 T11 oascc.SolrZkClient.makePath makePath: /collections/control_collection/shards
[junit4:junit4]   2> 2599 T11 oasc.AbstractZkTestCase.putConfig put /usr/home/hudson/hudson-slave/workspace/Lucene-Solr-Tests-4.x-java7/solr/build/solr-core/test-files/solr/collection1/conf/solrconfig.xml to /configs/conf1/solrconfig.xml
[junit4:junit4]   2> 2673 T11 oascc.SolrZkClient.makePath makePath: /configs/conf1/solrconfig.xml
[junit4:junit4]   2> 2701 T11 oasc.AbstractZkTestCase.putConfig put /usr/home/hudson/hudson-slave/workspace/Lucene-Solr-Tests-4.x-java7/solr/build/solr-core/test-files/solr/collection1/conf/schema.xml to /configs/conf1/schema.xml
[junit4:junit4]   2> 2703 T11 oascc.SolrZkClient.makePath makePath: /configs/conf1/schema.xml
[junit4:junit4]   2> 2809 T11 oasc.AbstractZkTestCase.putConfig put /usr/home/hudson/hudson-slave/workspace/Lucene-Solr-Tests-4.x-java7/solr/build/solr-core/test-files/solr/collection1/conf/solrconfig.xml to /configs/conf1/solrconfig.xml
[junit4:junit4]   2> 2812 T11 oascc.SolrZkClient.makePath makePath: /configs/conf1/solrconfig.xml
[junit4:junit4]   2> 2831 T11 oasc.AbstractZkTestCase.putConfig put /usr/home/hudson/hudson-slave/workspace/Lucene-Solr-Tests-4.x-java7/solr/build/solr-core/test-files/solr/collection1/conf/stopwords.txt to /configs/conf1/stopwords.txt
[junit4:junit4]   2> 2832 T11 oascc.SolrZkClient.makePath makePath: /configs/conf1/stopwords.txt
[junit4:junit4]   2> 2838 T11 oasc.AbstractZkTestCase.putConfig put /usr/home/hudson/hudson-slave/workspace/Lucene-Solr-Tests-4.x-java7/solr/build/solr-core/test-files/solr/collection1/conf/protwords.txt to /configs/conf1/protwords.txt
[junit4:junit4]   2> 2840 T11 oascc.SolrZkClient.makePath makePath: /configs/conf1/protwords.txt
[junit4:junit4]   2> 2845 T11 oasc.AbstractZkTestCase.putConfig put /usr/home/hudson/hudson-slave/workspace/Lucene-Solr-Tests-4.x-java7/solr/build/solr-core/test-files/solr/collection1/conf/currency.xml to /configs/conf1/currency.xml
[junit4:junit4]   2> 2847 T11 oascc.SolrZkClient.makePath makePath: /configs/conf1/currency.xml
[junit4:junit4]   2> 2852 T11 oasc.AbstractZkTestCase.putConfig put /usr/home/hudson/hudson-slave/workspace/Lucene-Solr-Tests-4.x-java7/solr/build/solr-core/test-files/solr/collection1/conf/open-exchange-rates.json to /configs/conf1/open-exchange-rates.json
[junit4:junit4]   2> 2854 T11 oascc.SolrZkClient.makePath makePath: /configs/conf1/open-exchange-rates.json
[junit4:junit4]   2> 2859 T11 oasc.AbstractZkTestCase.putConfig put /usr/home/hudson/hudson-slave/workspace/Lucene-Solr-Tests-4.x-java7/solr/build/solr-core/test-files/solr/collection1/conf/mapping-ISOLatin1Accent.txt to /configs/conf1/mapping-ISOLatin1Accent.txt
[junit4:junit4]   2> 2861 T11 oascc.SolrZkClient.makePath makePath: /configs/conf1/mapping-ISOLatin1Accent.txt
[junit4:junit4]   2> 2866 T11 oasc.AbstractZkTestCase.putConfig put /usr/home/hudson/hudson-slave/workspace/Lucene-Solr-Tests-4.x-java7/solr/build/solr-core/test-files/solr/collection1/conf/old_synonyms.txt to /configs/conf1/old_synonyms.txt
[junit4:junit4]   2> 2868 T11 oascc.SolrZkClient.makePath makePath: /configs/conf1/old_synonyms.txt
[junit4:junit4]   2> 2873 T11 oasc.AbstractZkTestCase.putConfig put /usr/home/hudson/hudson-slave/workspace/Lucene-Solr-Tests-4.x-java7/solr/build/solr-core/test-files/solr/collection1/conf/synonyms.txt to /configs/conf1/synonyms.txt
[junit4:junit4]   2> 2875 T11 oascc.SolrZkClient.makePath makePath: /configs/conf1/synonyms.txt
[junit4:junit4]   2> 2880 T18 oazs.PrepRequestProcessor.pRequest Processed session termination for sessionid: 0x139f23ea8d50001
[junit4:junit4]   2> 2882 T20 oaz.ClientCnxn$EventThread.run EventThread shut down
[junit4:junit4]   2> 2882 T13 oazs.NIOServerCnxn.closeSock Closed socket connection for client /140.211.11.196:39892 which had sessionid 0x139f23ea8d50001
[junit4:junit4]   2> 2882 T11 oaz.ZooKeeper.close Session: 0x139f23ea8d50001 closed
[junit4:junit4]   2> 3741 T11 oejs.Server.doStart jetty-8.1.2.v20120308
[junit4:junit4]   2> 4309 T11 oejs.AbstractConnector.doStart Started SocketConnector@0.0.0.0:14990
[junit4:junit4]   2> 4527 T11 oasc.SolrResourceLoader.locateSolrHome JNDI not configured for solr (NoInitialContextEx)
[junit4:junit4]   2> 4528 T11 oasc.SolrResourceLoader.locateSolrHome using system property solr.solr.home: /usr/home/hudson/hudson-slave/workspace/Lucene-Solr-Tests-4.x-java7/solr/build/solr-core/test-files/solr
[junit4:junit4]   2> 4529 T11 oasc.SolrResourceLoader.<init> new SolrResourceLoader for deduced Solr Home: '/usr/home/hudson/hudson-slave/workspace/Lucene-Solr-Tests-4.x-java7/solr/build/solr-core/test-files/solr/'
[junit4:junit4]   2> 5297 T11 oass.SolrDispatchFilter.init SolrDispatchFilter.init()
[junit4:junit4]   2> 5302 T11 oasc.SolrResourceLoader.locateSolrHome JNDI not configured for solr (NoInitialContextEx)
[junit4:junit4]   2> 5303 T11 oasc.SolrResourceLoader.locateSolrHome using system property solr.solr.home: /usr/home/hudson/hudson-slave/workspace/Lucene-Solr-Tests-4.x-java7/solr/build/solr-core/test-files/solr
[junit4:junit4]   2> 5411 T11 oasc.CoreContainer$Initializer.initialize looking for solr.xml: /usr/home/hudson/hudson-slave/workspace/Lucene-Solr-Tests-4.x-java7/solr/build/solr-core/test-files/solr/solr.xml
[junit4:junit4]   2> 5417 T11 oasc.CoreContainer.<init> New CoreContainer 1984255008
[junit4:junit4]   2> 5419 T11 oasc.CoreContainer.load Loading CoreContainer using Solr Home: '/usr/home/hudson/hudson-slave/workspace/Lucene-Solr-Tests-4.x-java7/solr/build/solr-core/test-files/solr/'
[junit4:junit4]   2> 5420 T11 oasc.SolrResourceLoader.<init> new SolrResourceLoader for directory: '/usr/home/hudson/hudson-slave/workspace/Lucene-Solr-Tests-4.x-java7/solr/build/solr-core/test-files/solr/'
[junit4:junit4]   2> 5538 T11 oasc.CoreContainer.load Registering Log Listener
[junit4:junit4]   2> 5587 T11 oasc.CoreContainer.initZooKeeper Zookeeper client=127.0.0.1:27313/solr
[junit4:junit4]   2> 5640 T11 oaz.ZooKeeper.<init> Initiating client connection, connectString=127.0.0.1:27313/solr sessionTimeout=5000 watcher=org.apache.solr.common.cloud.ConnectionManager@17df3aeb
[junit4:junit4]   2> 5642 T31 oaz.ClientCnxn$SendThread.startConnect Opening socket connection to server /127.0.0.1:27313
[junit4:junit4]   2> 5642 T11 oascc.ConnectionManager.waitForConnected Waiting for client to connect to ZooKeeper
[junit4:junit4]   2> 5645 T31 oaz.ClientCnxn$SendThread.primeConnection Socket connection established to localhost/127.0.0.1:27313, initiating session
[junit4:junit4]   2> 5646 T13 oazs.NIOServerCnxn$Factory.run Accepted socket connection from /140.211.11.196:31274
[junit4:junit4]   2> 5647 T13 oazs.NIOServerCnxn.readConnectRequest Client attempting to establish new session at /140.211.11.196:31274
[junit4:junit4]   2> 5651 T16 oazs.NIOServerCnxn.finishSessionInit Established session 0x139f23ea8d50002 with negotiated timeout 5000 for client /140.211.11.196:31274
[junit4:junit4]   2> 5651 T31 oaz.ClientCnxn$SendThread.readConnectResult Session establishment complete on server localhost/127.0.0.1:27313, sessionid = 0x139f23ea8d50002, negotiated timeout = 5000
[junit4:junit4]   2> 5652 T32 oascc.ConnectionManager.process Watcher org.apache.solr.common.cloud.ConnectionManager@17df3aeb name:ZooKeeperConnection Watcher:127.0.0.1:27313/solr got event WatchedEvent state:SyncConnected type:None path:null path:null type:None
[junit4:junit4]   2> 5653 T11 oascc.ConnectionManager.waitForConnected Client is connected to ZooKeeper
[junit4:junit4]   2> 5683 T18 oazs.PrepRequestProcessor.pRequest Got user-level KeeperException when processing sessionid:0x139f23ea8d50002 type:create cxid:0x2 zxid:0xfffffffffffffffe txntype:unknown reqpath:n/a Error Path:/solr/overseer Error:KeeperErrorCode = NodeExists for /solr/overseer
[junit4:junit4]   2> 5704 T11 oascc.SolrZkClient.makePath makePath: /live_nodes
[junit4:junit4]   2> 5708 T11 oasc.ZkController.createEphemeralLiveNode Register node as live in ZooKeeper:/live_nodes/127.0.0.1:14990_solr
[junit4:junit4]   2> 5718 T18 oazs.PrepRequestProcessor.pRequest Got user-level KeeperException when processing sessionid:0x139f23ea8d50002 type:delete cxid:0x7 zxid:0xfffffffffffffffe txntype:unknown reqpath:n/a Error Path:/solr/live_nodes/127.0.0.1:14990_solr Error:KeeperErrorCode = NoNode for /solr/live_nodes/127.0.0.1:14990_solr
[junit4:junit4]   2> 5728 T11 oascc.SolrZkClient.makePath makePath: /live_nodes/127.0.0.1:14990_solr
[junit4:junit4]   2> 5756 T11 oashc.HttpShardHandlerFactory.getParameter Setting socketTimeout to: 0
[junit4:junit4]   2> 5757 T11 oashc.HttpShardHandlerFactory.getParameter Setting urlScheme to: http://
[junit4:junit4]   2> 5758 T11 oashc.HttpShardHandlerFactory.getParameter Setting connTimeout to: 0
[junit4:junit4]   2> 5759 T11 oashc.HttpShardHandlerFactory.getParameter Setting maxConnectionsPerHost to: 20
[junit4:junit4]   2> 5760 T11 oashc.HttpShardHandlerFactory.getParameter Setting corePoolSize to: 0
[junit4:junit4]   2> 5761 T11 oashc.HttpShardHandlerFactory.getParameter Setting maximumPoolSize to: 2147483647
[junit4:junit4]   2> 5762 T11 oashc.HttpShardHandlerFactory.getParameter Setting maxThreadIdleTime to: 5
[junit4:junit4]   2> 5763 T11 oashc.HttpShardHandlerFactory.getParameter Setting sizeOfQueue to: -1
[junit4:junit4]   2> 5764 T11 oashc.HttpShardHandlerFactory.getParameter Setting fairnessPolicy to: false
[junit4:junit4]   2> 5862 T11 oascsi.HttpClientUtil.createClient Creating new http client, config:maxConnectionsPerHost=20&maxConnections=10000&socketTimeout=0&connTimeout=0&retry=false
[junit4:junit4]   2> 6686 T11 oascc.SolrZkClient.makePath makePath: /overseer_elect/election
[junit4:junit4]   2> 6723 T18 oazs.PrepRequestProcessor.pRequest Got user-level KeeperException when processing sessionid:0x139f23ea8d50002 type:delete cxid:0x15 zxid:0xfffffffffffffffe txntype:unknown reqpath:n/a Error Path:/solr/overseer_elect/leader Error:KeeperErrorCode = NoNode for /solr/overseer_elect/leader
[junit4:junit4]   2> 6724 T11 oascc.SolrZkClient.makePath makePath: /overseer_elect/leader
[junit4:junit4]   2> 6728 T11 oasc.Overseer.start Overseer (id=88368018644860930-127.0.0.1:14990_solr-n_0000000000) starting
[junit4:junit4]   2> 6729 T18 oazs.PrepRequestProcessor.pRequest Got user-level KeeperException when processing sessionid:0x139f23ea8d50002 type:create cxid:0x1a zxid:0xfffffffffffffffe txntype:unknown reqpath:n/a Error Path:/solr/overseer Error:KeeperErrorCode = NodeExists for /solr/overseer
[junit4:junit4]   2> 6746 T18 oazs.PrepRequestProcessor.pRequest Got user-level KeeperException when processing sessionid:0x139f23ea8d50002 type:create cxid:0x1b zxid:0xfffffffffffffffe txntype:unknown reqpath:n/a Error Path:/solr/overseer Error:KeeperErrorCode = NodeExists for /solr/overseer
[junit4:junit4]   2> 6747 T18 oazs.PrepRequestProcessor.pRequest Got user-level KeeperException when processing sessionid:0x139f23ea8d50002 type:create cxid:0x1c zxid:0xfffffffffffffffe txntype:unknown reqpath:n/a Error Path:/solr/overseer Error:KeeperErrorCode = NodeExists for /solr/overseer
[junit4:junit4]   2> 6753 T18 oazs.PrepRequestProcessor.pRequest Got user-level KeeperException when processing sessionid:0x139f23ea8d50002 type:create cxid:0x1d zxid:0xfffffffffffffffe txntype:unknown reqpath:n/a Error Path:/solr/overseer Error:KeeperErrorCode = NodeExists for /solr/overseer
[junit4:junit4]   2> 6755 T34 oasc.OverseerCollectionProcessor.run Process current queue of collection creations
[junit4:junit4]   2> 6755 T11 oascc.SolrZkClient.makePath makePath: /clusterstate.json
[junit4:junit4]   2> 6758 T11 oascc.ZkStateReader.createClusterStateWatchersAndUpdate Updating cluster state from ZooKeeper... 
[junit4:junit4]   2> 6785 T33 oasc.Overseer$ClusterStateUpdater.run Starting to work on the main queue
[junit4:junit4]   2> 6845 T11 oasc.CoreContainer.create Creating SolrCore 'collection1' using instanceDir: /usr/home/hudson/hudson-slave/workspace/Lucene-Solr-Tests-4.x-java7/solr/build/solr-core/test-files/solr/collection1
[junit4:junit4]   2> 6846 T11 oasc.ZkController.createCollectionZkNode Check for collection zkNode:control_collection
[junit4:junit4]   2> 6847 T11 oasc.ZkController.createCollectionZkNode Collection zkNode exists
[junit4:junit4]   2> 6848 T11 oasc.ZkController.readConfigName Load collection config from:/collections/control_collection
[junit4:junit4]   2> 6850 T11 oasc.SolrResourceLoader.<init> new SolrResourceLoader for directory: '/usr/home/hudson/hudson-slave/workspace/Lucene-Solr-Tests-4.x-java7/solr/build/solr-core/test-files/solr/collection1/'
[junit4:junit4]   2> 6852 T11 oasc.SolrResourceLoader.replaceClassLoader Adding 'file:/usr/home/hudson/hudson-slave/workspace/Lucene-Solr-Tests-4.x-java7/solr/build/solr-core/test-files/solr/collection1/lib/classes/' to classloader
[junit4:junit4]   2> 6853 T11 oasc.SolrResourceLoader.replaceClassLoader Adding 'file:/usr/home/hudson/hudson-slave/workspace/Lucene-Solr-Tests-4.x-java7/solr/build/solr-core/test-files/solr/collection1/lib/README' to classloader
[junit4:junit4]   2> 7067 T11 oasc.SolrConfig.<init> Using Lucene MatchVersion: LUCENE_41
[junit4:junit4]   2> 7290 T11 oasc.SolrConfig.<init> Loaded SolrConfig: solrconfig.xml
[junit4:junit4]   2> 7447 T11 oass.IndexSchema.readSchema Reading Solr Schema
[junit4:junit4]   2> 7561 T11 oass.IndexSchema.readSchema Schema name=test
[junit4:junit4]   2> 9609 T11 oass.OpenExchangeRatesOrgProvider.init Initialized with rates=open-exchange-rates.json, refreshInterval=1440.
[junit4:junit4]   2> 9632 T11 oass.IndexSchema.readSchema default search field in schema is text
[junit4:junit4]   2> 9636 T11 oass.IndexSchema.readSchema unique key field: id
[junit4:junit4]   2> 9998 T11 oass.FileExchangeRateProvider.reload Reloading exchange rates from file currency.xml
[junit4:junit4]   2> 10013 T11 oass.FileExchangeRateProvider.reload Reloading exchange rates from file currency.xml
[junit4:junit4]   2> 10019 T11 oass.OpenExchangeRatesOrgProvider.reload Reloading exchange rates from open-exchange-rates.json
[junit4:junit4]   2> 10039 T11 oass.OpenExchangeRatesOrgProvider.reload Reloading exchange rates from open-exchange-rates.json
[junit4:junit4]   2> 10135 T11 oasc.SolrCore.<init> [collection1] Opening new SolrCore at /usr/home/hudson/hudson-slave/workspace/Lucene-Solr-Tests-4.x-java7/solr/build/solr-core/test-files/solr/collection1/, dataDir=./org.apache.solr.cloud.BasicDistributedZk2Test-1348388955822/control/data/
[junit4:junit4]   2> 10142 T11 oasc.JmxMonitoredMap.<init> JMX monitoring is enabled. Adding Solr mbeans to JMX Server: com.sun.jmx.mbeanserver.JmxMBeanServer@457a3972
[junit4:junit4]   2> 10335 T11 oasc.SolrCore.getNewIndexDir WARNING New index directory detected: old=null new=./org.apache.solr.cloud.BasicDistributedZk2Test-1348388955822/control/data/index/
[junit4:junit4]   2> 10336 T11 oasc.SolrCore.initIndex WARNING [collection1] Solr index directory './org.apache.solr.cloud.BasicDistributedZk2Test-1348388955822/control/data/index' doesn't exist. Creating new index...
[junit4:junit4]   2> 10519 T11 oasc.CachingDirectoryFactory.get return new directory for /usr/home/hudson/hudson-slave/workspace/Lucene-Solr-Tests-4.x-java7/solr/build/solr-core/test/J1/./org.apache.solr.cloud.BasicDistributedZk2Test-1348388955822/control/data/index forceNew:false
[junit4:junit4]   2> 11197 T11 oasc.SolrDeletionPolicy.onCommit SolrDeletionPolicy.onCommit: commits:num=1
[junit4:junit4]   2> 		commit{dir=NRTCachingDirectory(org.apache.lucene.store.NIOFSDirectory@/usr/home/hudson/hudson-slave/workspace/Lucene-Solr-Tests-4.x-java7/solr/build/solr-core/test/J1/org.apache.solr.cloud.BasicDistributedZk2Test-1348388955822/control/data/index lockFactory=org.apache.lucene.store.NativeFSLockFactory@6771a12; maxCacheMB=48.0 maxMergeSizeMB=4.0),segFN=segments_1,generation=1,filenames=[segments_1]
[junit4:junit4]   2> 11197 T11 oasc.SolrDeletionPolicy.updateCommits newest commit = 1
[junit4:junit4]   2> 11227 T11 oasc.SolrCore.initWriters created xml: solr.XMLResponseWriter
[junit4:junit4]   2> 12101 T11 oasup.UpdateRequestProcessorChain.init inserting DistributedUpdateProcessorFactory into updateRequestProcessorChain "dedupe"
[junit4:junit4]   2> 12102 T11 oasup.UpdateRequestProcessorChain.init inserting DistributedUpdateProcessorFactory into updateRequestProcessorChain "dedupe-allfields"
[junit4:junit4]   2> 12102 T11 oasup.UpdateRequestProcessorChain.init inserting DistributedUpdateProcessorFactory into updateRequestProcessorChain "stored_sig"
[junit4:junit4]   2> 12109 T11 oasup.UpdateRequestProcessorChain.init inserting DistributedUpdateProcessorFactory into updateRequestProcessorChain "uniq-fields"
[junit4:junit4]   2> 12236 T11 oasup.UpdateRequestProcessorChain.init inserting DistributedUpdateProcessorFactory into updateRequestProcessorChain "distrib-dup-test-chain-implicit"
[junit4:junit4]   2> 12258 T11 oasc.RequestHandlers.initHandlersFromConfig adding lazy requestHandler: solr.ReplicationHandler
[junit4:junit4]   2> 12262 T11 oasc.RequestHandlers.initHandlersFromConfig created /replication: solr.ReplicationHandler
[junit4:junit4]   2> 12286 T11 oasc.RequestHandlers.initHandlersFromConfig created standard: solr.StandardRequestHandler
[junit4:junit4]   2> 12301 T11 oasc.RequestHandlers.initHandlersFromConfig created /get: solr.RealTimeGetHandler
[junit4:junit4]   2> 12347 T11 oasc.RequestHandlers.initHandlersFromConfig created dismax: solr.SearchHandler
[junit4:junit4]   2> 12349 T11 oasc.RequestHandlers.initHandlersFromConfig created mock: org.apache.solr.core.MockQuerySenderListenerReqHandler
[junit4:junit4]   2> 12354 T11 oasc.RequestHandlers.initHandlersFromConfig created /admin/: org.apache.solr.handler.admin.AdminHandlers
[junit4:junit4]   2> 12355 T11 oasc.RequestHandlers.initHandlersFromConfig created defaults: solr.StandardRequestHandler
[junit4:junit4]   2> 12355 T11 oasc.RequestHandlers.initHandlersFromConfig adding lazy requestHandler: solr.StandardRequestHandler
[junit4:junit4]   2> 12356 T11 oasc.RequestHandlers.initHandlersFromConfig created lazy: solr.StandardRequestHandler
[junit4:junit4]   2> 12382 T11 oasc.RequestHandlers.initHandlersFromConfig created /update: solr.UpdateRequestHandler
[junit4:junit4]   2> 12383 T11 oasc.RequestHandlers.initHandlersFromConfig created /terms: org.apache.solr.handler.component.SearchHandler
[junit4:junit4]   2> 12384 T11 oasc.RequestHandlers.initHandlersFromConfig created spellCheckCompRH: org.apache.solr.handler.component.SearchHandler
[junit4:junit4]   2> 12385 T11 oasc.RequestHandlers.initHandlersFromConfig created spellCheckCompRH_Direct: org.apache.solr.handler.component.SearchHandler
[junit4:junit4]   2> 12386 T11 oasc.RequestHandlers.initHandlersFromConfig created spellCheckWithWordbreak: org.apache.solr.handler.component.SearchHandler
[junit4:junit4]   2> 12387 T11 oasc.RequestHandlers.initHandlersFromConfig created spellCheckWithWordbreak_Direct: org.apache.solr.handler.component.SearchHandler
[junit4:junit4]   2> 12388 T11 oasc.RequestHandlers.initHandlersFromConfig created spellCheckCompRH1: org.apache.solr.handler.component.SearchHandler
[junit4:junit4]   2> 12390 T11 oasc.RequestHandlers.initHandlersFromConfig created tvrh: org.apache.solr.handler.component.SearchHandler
[junit4:junit4]   2> 12406 T11 oasc.RequestHandlers.initHandlersFromConfig created /mlt: solr.MoreLikeThisHandler
[junit4:junit4]   2> 12425 T11 oasc.RequestHandlers.initHandlersFromConfig created /debug/dump: solr.DumpRequestHandler
[junit4:junit4]   2> 12517 T11 oashl.XMLLoader.init xsltCacheLifetimeSeconds=60
[junit4:junit4]   2> 12543 T11 oasc.SolrCore.initDeprecatedSupport WARNING solrconfig.xml uses deprecated <admin/gettableFiles>, Please update your config to use the ShowFileRequestHandler.
[junit4:junit4]   2> 12549 T11 oasc.SolrCore.initDeprecatedSupport WARNING adding ShowFileRequestHandler with hidden files: [SCHEMA.XML, OLD_SYNONYMS.TXT, STOPWORDS.TXT, PROTWORDS.TXT, OPEN-EXCHANGE-RATES.JSON, SYNONYMS.TXT, CURRENCY.XML, MAPPING-ISOLATIN1ACCENT.TXT]
[junit4:junit4]   2> 12598 T11 oass.SolrIndexSearcher.<init> Opening Searcher@fa42550 main
[junit4:junit4]   2> 12765 T11 oasu.CommitTracker.<init> Hard AutoCommit: disabled
[junit4:junit4]   2> 12765 T11 oasu.CommitTracker.<init> Soft AutoCommit: disabled
[junit4:junit4]   2> 12767 T11 oashc.SpellCheckComponent.inform Initializing spell checkers
[junit4:junit4]   2> 12860 T11 oass.DirectSolrSpellChecker.init init: {name=direct,classname=DirectSolrSpellChecker,field=lowerfilt,minQueryLength=3}
[junit4:junit4]   2> 13247 T35 oasc.SolrCore.registerSearcher [collection1] Registered new searcher Searcher@fa42550 main{StandardDirectoryReader(segments_1:1)}
[junit4:junit4]   2> 13257 T18 oazs.PrepRequestProcessor.pRequest Got user-level KeeperException when processing sessionid:0x139f23ea8d50002 type:create cxid:0x74 zxid:0xfffffffffffffffe txntype:unknown reqpath:n/a Error Path:/solr/overseer/queue Error:KeeperErrorCode = NoNode for /solr/overseer/queue
[junit4:junit4]   2> 13289 T11 oasc.CoreContainer.register registering core: collection1
[junit4:junit4]   2> 13290 T11 oasc.ZkController.register Register shard - core:collection1 address:http://127.0.0.1:14990/solr shardId:control_shard
[junit4:junit4]   2> 13304 T11 oascsi.HttpClientUtil.createClient Creating new http client, config:maxConnections=10000&maxConnectionsPerHost=20&connTimeout=30000&socketTimeout=30000&retry=false
[junit4:junit4]   2> 13320 T11 oascc.SolrZkClient.makePath makePath: /collections/control_collection/leader_elect/control_shard/election
[junit4:junit4]   2> 13338 T18 oazs.PrepRequestProcessor.pRequest Got user-level KeeperException when processing sessionid:0x139f23ea8d50002 type:delete cxid:0x83 zxid:0xfffffffffffffffe txntype:unknown reqpath:n/a Error Path:/solr/collections/control_collection/leaders Error:KeeperErrorCode = NoNode for /solr/collections/control_collection/leaders
[junit4:junit4]   2> 13340 T11 oasc.ShardLeaderElectionContext.runLeaderProcess Running the leader process.
[junit4:junit4]   2> 13341 T18 oazs.PrepRequestProcessor.pRequest Got user-level KeeperException when processing sessionid:0x139f23ea8d50002 type:create cxid:0x84 zxid:0xfffffffffffffffe txntype:unknown reqpath:n/a Error Path:/solr/overseer Error:KeeperErrorCode = NodeExists for /solr/overseer
[junit4:junit4]   2> 13425 T33 oascc.ZkStateReader.updateClusterState Updating cloud state from ZooKeeper... 
[junit4:junit4]   2> 13448 T18 oazs.PrepRequestProcessor.pRequest Got user-level KeeperException when processing sessionid:0x139f23ea8d50002 type:create cxid:0x8b zxid:0xfffffffffffffffe txntype:unknown reqpath:n/a Error Path:/solr/overseer/queue-work Error:KeeperErrorCode = NoNode for /solr/overseer/queue-work
[junit4:junit4]   2> 13488 T32 oascc.ZkStateReader$2.process A cluster state change has occurred - updating...
[junit4:junit4]   2> 13851 T11 oasc.ShardLeaderElectionContext.waitForReplicasToComeUp Enough replicas found to continue.
[junit4:junit4]   2> 13852 T11 oasc.ShardLeaderElectionContext.runLeaderProcess I may be the new leader - try and sync
[junit4:junit4]   2> 13853 T11 oasc.SyncStrategy.sync Sync replicas to http://127.0.0.1:14990/solr/collection1/
[junit4:junit4]   2> 13854 T11 oasc.SyncStrategy.syncReplicas Sync Success - now sync replicas to me
[junit4:junit4]   2> 13855 T11 oasc.SyncStrategy.syncToMe http://127.0.0.1:14990/solr/collection1/ has no replicas
[junit4:junit4]   2> 13855 T11 oasc.ShardLeaderElectionContext.runLeaderProcess I am the new leader: http://127.0.0.1:14990/solr/collection1/
[junit4:junit4]   2> 13856 T11 oascc.SolrZkClient.makePath makePath: /collections/control_collection/leaders/control_shard
[junit4:junit4]   2> 13864 T18 oazs.PrepRequestProcessor.pRequest Got user-level KeeperException when processing sessionid:0x139f23ea8d50002 type:create cxid:0xa9 zxid:0xfffffffffffffffe txntype:unknown reqpath:n/a Error Path:/solr/overseer Error:KeeperErrorCode = NodeExists for /solr/overseer
[junit4:junit4]   2> 13997 T33 oascc.ZkStateReader.updateClusterState Updating cloud state from ZooKeeper... 
[junit4:junit4]   2> 14012 T32 oascc.ZkStateReader$2.process A cluster state change has occurred - updating...
[junit4:junit4]   2> 14027 T11 oasc.ZkController.register We are http://127.0.0.1:14990/solr/collection1/ and leader is http://127.0.0.1:14990/solr/collection1/
[junit4:junit4]   2> 14030 T11 oasc.ZkController.register No LogReplay needed for core=collection1 baseURL=http://127.0.0.1:14990/solr
[junit4:junit4]   2> 14031 T11 oasc.ZkController.checkRecovery I am the leader, no recovery necessary
[junit4:junit4]   2> 14033 T11 oascc.ZkStateReader.updateClusterState Updating cloud state from ZooKeeper... 
[junit4:junit4]   2> 14035 T11 oass.SolrDispatchFilter.init user.dir=/usr/home/hudson/hudson-slave/workspace/Lucene-Solr-Tests-4.x-java7/solr/build/solr-core/test/J1
[junit4:junit4]   2> 14036 T11 oass.SolrDispatchFilter.init SolrDispatchFilter.init() done
[junit4:junit4]   2> 14090 T11 oascsi.HttpClientUtil.createClient Creating new http client, config:maxConnections=128&maxConnectionsPerHost=32&followRedirects=false
[junit4:junit4]   2> 14321 T11 oejs.Server.doStart jetty-8.1.2.v20120308
[junit4:junit4]   2> 14324 T11 oejs.AbstractConnector.doStart Started SocketConnector@0.0.0.0:21077
[junit4:junit4]   2> 14325 T11 oasc.SolrResourceLoader.locateSolrHome JNDI not configured for solr (NoInitialContextEx)
[junit4:junit4]   2> 14326 T11 oasc.SolrResourceLoader.locateSolrHome using system property solr.solr.home: /usr/home/hudson/hudson-slave/workspace/Lucene-Solr-Tests-4.x-java7/solr/build/solr-core/test/J1/./solrtest-jetty1-1348388969600
[junit4:junit4]   2> 14326 T11 oasc.SolrResourceLoader.<init> new SolrResourceLoader for deduced Solr Home: '/usr/home/hudson/hudson-slave/workspace/Lucene-Solr-Tests-4.x-java7/solr/build/solr-core/test/J1/./solrtest-jetty1-1348388969600/'
[junit4:junit4]   2> 14361 T11 oass.SolrDispatchFilter.init SolrDispatchFilter.init()
[junit4:junit4]   2> 14362 T11 oasc.SolrResourceLoader.locateSolrHome JNDI not configured for solr (NoInitialContextEx)
[junit4:junit4]   2> 14363 T11 oasc.SolrResourceLoader.locateSolrHome using system property solr.solr.home: /usr/home/hudson/hudson-slave/workspace/Lucene-Solr-Tests-4.x-java7/solr/build/solr-core/test/J1/./solrtest-jetty1-1348388969600
[junit4:junit4]   2> 14363 T11 oasc.CoreContainer$Initializer.initialize looking for solr.xml: /usr/home/hudson/hudson-slave/workspace/Lucene-Solr-Tests-4.x-java7/solr/build/solr-core/test/J1/./solrtest-jetty1-1348388969600/solr.xml
[junit4:junit4]   2> 14364 T11 oasc.CoreContainer.<init> New CoreContainer 127922434
[junit4:junit4]   2> 14365 T11 oasc.CoreContainer.load Loading CoreContainer using Solr Home: '/usr/home/hudson/hudson-slave/workspace/Lucene-Solr-Tests-4.x-java7/solr/build/solr-core/test/J1/./solrtest-jetty1-1348388969600/'
[junit4:junit4]   2> 14365 T11 oasc.SolrResourceLoader.<init> new SolrResourceLoader for directory: '/usr/home/hudson/hudson-slave/workspace/Lucene-Solr-Tests-4.x-java7/solr/build/solr-core/test/J1/./solrtest-jetty1-1348388969600/'
[junit4:junit4]   2> 14395 T11 oasc.CoreContainer.load Registering Log Listener
[junit4:junit4]   2> 14414 T11 oasc.CoreContainer.initZooKeeper Zookeeper client=127.0.0.1:27313/solr
[junit4:junit4]   2> 14415 T11 oaz.ZooKeeper.<init> Initiating client connection, connectString=127.0.0.1:27313/solr sessionTimeout=5000 watcher=org.apache.solr.common.cloud.ConnectionManager@239e06d7
[junit4:junit4]   2> 14417 T45 oaz.ClientCnxn$SendThread.startConnect Opening socket connection to server /127.0.0.1:27313
[junit4:junit4]   2> 14417 T11 oascc.ConnectionManager.waitForConnected Waiting for client to connect to ZooKeeper
[junit4:junit4]   2> 14419 T45 oaz.ClientCnxn$SendThread.primeConnection Socket connection established to localhost/127.0.0.1:27313, initiating session
[junit4:junit4]   2> 14419 T13 oazs.NIOServerCnxn$Factory.run Accepted socket connection from /140.211.11.196:29940
[junit4:junit4]   2> 14420 T13 oazs.NIOServerCnxn.readConnectRequest Client attempting to establish new session at /140.211.11.196:29940
[junit4:junit4]   2> 14422 T16 oazs.NIOServerCnxn.finishSessionInit Established session 0x139f23ea8d50003 with negotiated timeout 5000 for client /140.211.11.196:29940
[junit4:junit4]   2> 14423 T45 oaz.ClientCnxn$SendThread.readConnectResult Session establishment complete on server localhost/127.0.0.1:27313, sessionid = 0x139f23ea8d50003, negotiated timeout = 5000
[junit4:junit4]   2> 14424 T46 oascc.ConnectionManager.process Watcher org.apache.solr.common.cloud.ConnectionManager@239e06d7 name:ZooKeeperConnection Watcher:127.0.0.1:27313/solr got event WatchedEvent state:SyncConnected type:None path:null path:null type:None
[junit4:junit4]   2> 14424 T11 oascc.ConnectionManager.waitForConnected Client is connected to ZooKeeper
[junit4:junit4]   2> 14426 T18 oazs.PrepRequestProcessor.pRequest Got user-level KeeperException when processing sessionid:0x139f23ea8d50003 type:create cxid:0x1 zxid:0xfffffffffffffffe txntype:unknown reqpath:n/a Error Path:/solr/overseer Error:KeeperErrorCode = NodeExists for /solr/overseer
[junit4:junit4]   2> 14439 T18 oazs.PrepRequestProcessor.pRequest Got user-level KeeperException when processing sessionid:0x139f23ea8d50003 type:create cxid:0x2 zxid:0xfffffffffffffffe txntype:unknown reqpath:n/a Error Path:/solr/overseer Error:KeeperErrorCode = NodeExists for /solr/overseer
[junit4:junit4]   2> 14441 T11 oasc.ZkController.createEphemeralLiveNode Register node as live in ZooKeeper:/live_nodes/127.0.0.1:21077_solr
[junit4:junit4]   2> 14442 T18 oazs.PrepRequestProcessor.pRequest Got user-level KeeperException when processing sessionid:0x139f23ea8d50003 type:delete cxid:0x4 zxid:0xfffffffffffffffe txntype:unknown reqpath:n/a Error Path:/solr/live_nodes/127.0.0.1:21077_solr Error:KeeperErrorCode = NoNode for /solr/live_nodes/127.0.0.1:21077_solr
[junit4:junit4]   2> 14444 T11 oascc.SolrZkClient.makePath makePath: /live_nodes/127.0.0.1:21077_solr
[junit4:junit4]   2> 14447 T32 oascc.ZkStateReader$3.process Updating live nodes
[junit4:junit4]   2> 14448 T11 oashc.HttpShardHandlerFactory.getParameter Setting socketTimeout to: 0
[junit4:junit4]   2> 14448 T11 oashc.HttpShardHandlerFactory.getParameter Setting urlScheme to: http://
[junit4:junit4]   2> 14449 T11 oashc.HttpShardHandlerFactory.getParameter Setting connTimeout to: 0
[junit4:junit4]   2> 14449 T11 oashc.HttpShardHandlerFactory.getParameter Setting maxConnectionsPerHost to: 20
[junit4:junit4]   2> 14450 T11 oashc.HttpShardHandlerFactory.getParameter Setting corePoolSize to: 0
[junit4:junit4]   2> 14450 T11 oashc.HttpShardHandlerFactory.getParameter Setting maximumPoolSize to: 2147483647
[junit4:junit4]   2> 14451 T11 oashc.HttpShardHandlerFactory.getParameter Setting maxThreadIdleTime to: 5
[junit4:junit4]   2> 14451 T11 oashc.HttpShardHandlerFactory.getParameter Setting sizeOfQueue to: -1
[junit4:junit4]   2> 14452 T11 oashc.HttpShardHandlerFactory.getParameter Setting fairnessPolicy to: false
[junit4:junit4]   2> 14453 T11 oascsi.HttpClientUtil.createClient Creating new http client, config:maxConnectionsPerHost=20&maxConnections=10000&socketTimeout=0&connTimeout=0&retry=false
[junit4:junit4]   2> 14473 T11 oascc.ZkStateReader.createClusterStateWatchersAndUpdate Updating cluster state from ZooKeeper... 
[junit4:junit4]   2> 14480 T11 oasc.CoreContainer.create Creating SolrCore 'collection1' using instanceDir: /usr/home/hudson/hudson-slave/workspace/Lucene-Solr-Tests-4.x-java7/solr/build/solr-core/test/J1/./solrtest-jetty1-1348388969600/collection1
[junit4:junit4]   2> 14480 T11 oasc.ZkController.createCollectionZkNode Check for collection zkNode:collection1
[junit4:junit4]   2> 14481 T11 oasc.ZkController.createCollectionZkNode Collection zkNode exists
[junit4:junit4]   2> 14482 T11 oasc.ZkController.readConfigName Load collection config from:/collections/collection1
[junit4:junit4]   2> 14484 T11 oasc.SolrResourceLoader.<init> new SolrResourceLoader for directory: '/usr/home/hudson/hudson-slave/workspace/Lucene-Solr-Tests-4.x-java7/solr/build/solr-core/test/J1/./solrtest-jetty1-1348388969600/collection1/'
[junit4:junit4]   2> 14485 T11 oasc.SolrResourceLoader.replaceClassLoader Adding 'file:/usr/home/hudson/hudson-slave/workspace/Lucene-Solr-Tests-4.x-java7/solr/build/solr-core/test/J1/solrtest-jetty1-1348388969600/collection1/lib/README' to classloader
[junit4:junit4]   2> 14486 T11 oasc.SolrResourceLoader.replaceClassLoader Adding 'file:/usr/home/hudson/hudson-slave/workspace/Lucene-Solr-Tests-4.x-java7/solr/build/solr-core/test/J1/solrtest-jetty1-1348388969600/collection1/lib/classes/' to classloader
[junit4:junit4]   2> 14518 T33 oascc.ZkStateReader.updateClusterState Updating cloud state from ZooKeeper... 
[junit4:junit4]   2> 14527 T46 oascc.ZkStateReader$2.process A cluster state change has occurred - updating...
[junit4:junit4]   2> 14527 T32 oascc.ZkStateReader$2.process A cluster state change has occurred - updating...
[junit4:junit4]   2> 14583 T11 oasc.SolrConfig.<init> Using Lucene MatchVersion: LUCENE_41
[junit4:junit4]   2> 14661 T11 oasc.SolrConfig.<init> Loaded SolrConfig: solrconfig.xml
[junit4:junit4]   2> 14762 T11 oass.IndexSchema.readSchema Reading Solr Schema
[junit4:junit4]   2> 14814 T11 oass.IndexSchema.readSchema Schema name=test
[junit4:junit4]   2> 15547 T11 oass.OpenExchangeRatesOrgProvider.init Initialized with rates=open-exchange-rates.json, refreshInterval=1440.
[junit4:junit4]   2> 15590 T11 oass.IndexSchema.readSchema default search field in schema is text
[junit4:junit4]   2> 15598 T11 oass.IndexSchema.readSchema unique key field: id
[junit4:junit4]   2> 15649 T11 oass.FileExchangeRateProvider.reload Reloading exchange rates from file currency.xml
[junit4:junit4]   2> 15658 T11 oass.FileExchangeRateProvider.reload Reloading exchange rates from file currency.xml
[junit4:junit4]   2> 15670 T11 oass.OpenExchangeRatesOrgProvider.reload Reloading exchange rates from open-exchange-rates.json
[junit4:junit4]   2> 15674 T11 oass.OpenExchangeRatesOrgProvider.reload Reloading exchange rates from open-exchange-rates.json
[junit4:junit4]   2> 15678 T11 oasc.SolrCore.<init> [collection1] Opening new SolrCore at /usr/home/hudson/hudson-slave/workspace/Lucene-Solr-Tests-4.x-java7/solr/build/solr-core/test/J1/./solrtest-jetty1-1348388969600/collection1/, dataDir=./org.apache.solr.cloud.BasicDistributedZk2Test-1348388955822/jetty1/
[junit4:junit4]   2> 15679 T11 oasc.JmxMonitoredMap.<init> JMX monitoring is enabled. Adding Solr mbeans to JMX Server: com.sun.jmx.mbeanserver.JmxMBeanServer@457a3972
[junit4:junit4]   2> 15681 T11 oasc.SolrCore.getNewIndexDir WARNING New index directory detected: old=null new=./org.apache.solr.cloud.BasicDistributedZk2Test-1348388955822/jetty1/index/
[junit4:junit4]   2> 15681 T11 oasc.SolrCore.initIndex WARNING [collection1] Solr index directory './org.apache.solr.cloud.BasicDistributedZk2Test-1348388955822/jetty1/index' doesn't exist. Creating new index...
[junit4:junit4]   2> 15682 T11 oasc.CachingDirectoryFactory.get return new directory for /usr/home/hudson/hudson-slave/workspace/Lucene-Solr-Tests-4.x-java7/solr/build/solr-core/test/J1/./org.apache.solr.cloud.BasicDistributedZk2Test-1348388955822/jetty1/index forceNew:false
[junit4:junit4]   2> 15709 T11 oasc.SolrDeletionPolicy.onCommit SolrDeletionPolicy.onCommit: commits:num=1
[junit4:junit4]   2> 		commit{dir=NRTCachingDirectory(org.apache.lucene.store.NIOFSDirectory@/usr/home/hudson/hudson-slave/workspace/Lucene-Solr-Tests-4.x-java7/solr/build/solr-core/test/J1/org.apache.solr.cloud.BasicDistributedZk2Test-1348388955822/jetty1/index lockFactory=org.apache.lucene.store.NativeFSLockFactory@b89a81a; maxCacheMB=48.0 maxMergeSizeMB=4.0),segFN=segments_1,generation=1,filenames=[segments_1]
[junit4:junit4]   2> 15710 T11 oasc.SolrDeletionPolicy.updateCommits newest commit = 1
[junit4:junit4]   2> 15711 T11 oasc.SolrCore.initWriters created xml: solr.XMLResponseWriter
[junit4:junit4]   2> 15714 T11 oasup.UpdateRequestProcessorChain.init inserting DistributedUpdateProcessorFactory into updateRequestProcessorChain "dedupe"
[junit4:junit4]   2> 15715 T11 oasup.UpdateRequestProcessorChain.init inserting DistributedUpdateProcessorFactory into updateRequestProcessorChain "dedupe-allfields"
[junit4:junit4]   2> 15716 T11 oasup.UpdateRequestProcessorChain.init inserting DistributedUpdateProcessorFactory into updateRequestProcessorChain "stored_sig"
[junit4:junit4]   2> 15716 T11 oasup.UpdateRequestProcessorChain.init inserting DistributedUpdateProcessorFactory into updateRequestProcessorChain "uniq-fields"
[junit4:junit4]   2> 15717 T11 oasup.UpdateRequestProcessorChain.init inserting DistributedUpdateProcessorFactory into updateRequestProcessorChain "distrib-dup-test-chain-implicit"
[junit4:junit4]   2> 15718 T11 oasc.RequestHandlers.initHandlersFromConfig adding lazy requestHandler: solr.ReplicationHandler
[junit4:junit4]   2> 15719 T11 oasc.RequestHandlers.initHandlersFromConfig created /replication: solr.ReplicationHandler
[junit4:junit4]   2> 15720 T11 oasc.RequestHandlers.initHandlersFromConfig created standard: solr.StandardRequestHandler
[junit4:junit4]   2> 15722 T11 oasc.RequestHandlers.initHandlersFromConfig created /get: solr.RealTimeGetHandler
[junit4:junit4]   2> 15724 T11 oasc.RequestHandlers.initHandlersFromConfig created dismax: solr.SearchHandler
[junit4:junit4]   2> 15725 T11 oasc.RequestHandlers.initHandlersFromConfig created mock: org.apache.solr.core.MockQuerySenderListenerReqHandler
[junit4:junit4]   2> 15726 T11 oasc.RequestHandlers.initHandlersFromConfig created /admin/: org.apache.solr.handler.admin.AdminHandlers
[junit4:junit4]   2> 15728 T11 oasc.RequestHandlers.initHandlersFromConfig created defaults: solr.StandardRequestHandler
[junit4:junit4]   2> 15728 T11 oasc.RequestHandlers.initHandlersFromConfig adding lazy requestHandler: solr.StandardRequestHandler
[junit4:junit4]   2> 15729 T11 oasc.RequestHandlers.initHandlersFromConfig created lazy: solr.StandardRequestHandler
[junit4:junit4]   2> 15730 T11 oasc.RequestHandlers.initHandlersFromConfig created /update: solr.UpdateRequestHandler
[junit4:junit4]   2> 15732 T11 oasc.RequestHandlers.initHandlersFromConfig created /terms: org.apache.solr.handler.component.SearchHandler
[junit4:junit4]   2> 15733 T11 oasc.RequestHandlers.initHandlersFromConfig created spellCheckCompRH: org.apache.solr.handler.component.SearchHandler
[junit4:junit4]   2> 15735 T11 oasc.RequestHandlers.initHandlersFromConfig created spellCheckCompRH_Direct: org.apache.solr.handler.component.SearchHandler
[junit4:junit4]   2> 15737 T11 oasc.RequestHandlers.initHandlersFromConfig created spellCheckWithWordbreak: org.apache.solr.handler.component.SearchHandler
[junit4:junit4]   2> 15738 T11 oasc.RequestHandlers.initHandlersFromConfig created spellCheckWithWordbreak_Direct: org.apache.solr.handler.component.SearchHandler
[junit4:junit4]   2> 15740 T11 oasc.RequestHandlers.initHandlersFromConfig created spellCheckCompRH1: org.apache.solr.handler.component.SearchHandler
[junit4:junit4]   2> 15742 T11 oasc.RequestHandlers.initHandlersFromConfig created tvrh: org.apache.solr.handler.component.SearchHandler
[junit4:junit4]   2> 15743 T11 oasc.RequestHandlers.initHandlersFromConfig created /mlt: solr.MoreLikeThisHandler
[junit4:junit4]   2> 15744 T11 oasc.RequestHandlers.initHandlersFromConfig created /debug/dump: solr.DumpRequestHandler
[junit4:junit4]   2> 15747 T11 oashl.XMLLoader.init xsltCacheLifetimeSeconds=60
[junit4:junit4]   2> 15751 T11 oasc.SolrCore.initDeprecatedSupport WARNING solrconfig.xml uses deprecated <admin/gettableFiles>, Please update your config to use the ShowFileRequestHandler.
[junit4:junit4]   2> 15753 T11 oasc.SolrCore.initDeprecatedSupport WARNING adding ShowFileRequestHandler with hidden files: [SCHEMA.XML, OLD_SYNONYMS.TXT, STOPWORDS.TXT, PROTWORDS.TXT, OPEN-EXCHANGE-RATES.JSON, SYNONYMS.TXT, CURRENCY.XML, MAPPING-ISOLATIN1ACCENT.TXT]
[junit4:junit4]   2> 15758 T11 oass.SolrIndexSearcher.<init> Opening Searcher@10e3eb78 main
[junit4:junit4]   2> 15759 T11 oasu.CommitTracker.<init> Hard AutoCommit: disabled
[junit4:junit4]   2> 15760 T11 oasu.CommitTracker.<init> Soft AutoCommit: disabled
[junit4:junit4]   2> 15762 T11 oashc.SpellCheckComponent.inform Initializing spell checkers
[junit4:junit4]   2> 15815 T11 oass.DirectSolrSpellChecker.init init: {name=direct,classname=DirectSolrSpellChecker,field=lowerfilt,minQueryLength=3}
[junit4:junit4]   2> 15953 T47 oasc.SolrCore.registerSearcher [collection1] Registered new searcher Searcher@10e3eb78 main{StandardDirectoryReader(segments_1:1)}
[junit4:junit4]   2> 16054 T33 oascc.ZkStateReader.updateClusterState Updating cloud state from ZooKeeper... 
[junit4:junit4]   2> 16081 T46 oascc.ZkStateReader$2.process A cluster state change has occurred - updating...
[junit4:junit4]   2> 16081 T32 oascc.ZkStateReader$2.process A cluster state change has occurred - updating...
[junit4:junit4]   2> 16467 T11 oasc.CoreContainer.register registering core: collection1
[junit4:junit4]   2> 16468 T11 oasc.ZkController.register Register shard - core:collection1 address:http://127.0.0.1:21077/solr shardId:shard1
[junit4:junit4]   2> 16469 T11 oascc.SolrZkClient.makePath makePath: /collections/collection1/leader_elect/shard1/election
[junit4:junit4]   2> 16494 T18 oazs.PrepRequestProcessor.pRequest Got user-level KeeperException when processing sessionid:0x139f23ea8d50003 type:delete cxid:0x43 zxid:0xfffffffffffffffe txntype:unknown reqpath:n/a Error Path:/solr/collections/collection1/leaders Error:KeeperErrorCode = NoNode for /solr/collections/collection1/leaders
[junit4:junit4]   2> 16495 T11 oasc.ShardLeaderElectionContext.runLeaderProcess Running the leader process.
[junit4:junit4]   2> 16497 T18 oazs.PrepRequestProcessor.pRequest Got user-level KeeperException when processing sessionid:0x139f23ea8d50003 type:create cxid:0x44 zxid:0xfffffffffffffffe txntype:unknown reqpath:n/a Error Path:/solr/overseer Error:KeeperErrorCode = NodeExists for /solr/overseer
[junit4:junit4]   2> 16500 T11 oasc.ShardLeaderElectionContext.waitForReplicasToComeUp Enough replicas found to continue.
[junit4:junit4]   2> 16501 T11 oasc.ShardLeaderElectionContext.runLeaderProcess I may be the new leader - try and sync
[junit4:junit4]   2> 16501 T11 oasc.SyncStrategy.sync Sync replicas to http://127.0.0.1:21077/solr/collection1/
[junit4:junit4]   2> 16502 T11 oasc.SyncStrategy.syncReplicas Sync Success - now sync replicas to me
[junit4:junit4]   2> 16503 T11 oasc.SyncStrategy.syncToMe http://127.0.0.1:21077/solr/collection1/ has no replicas
[junit4:junit4]   2> 16504 T11 oasc.ShardLeaderElectionContext.runLeaderProcess I am the new leader: http://127.0.0.1:21077/solr/collection1/
[junit4:junit4]   2> 16504 T11 oascc.SolrZkClient.makePath makePath: /collections/collection1/leaders/shard1
[junit4:junit4]   2> 16510 T18 oazs.PrepRequestProcessor.pRequest Got user-level KeeperException when processing sessionid:0x139f23ea8d50003 type:create cxid:0x4e zxid:0xfffffffffffffffe txntype:unknown reqpath:n/a Error Path:/solr/overseer Error:KeeperErrorCode = NodeExists for /solr/overseer
[junit4:junit4]   2> 16588 T33 oascc.ZkStateReader.updateClusterState Updating cloud state from ZooKeeper... 
[junit4:junit4]   2> 16617 T46 oascc.ZkStateReader$2.process A cluster state change has occurred - updating...
[junit4:junit4]   2> 16617 T32 oascc.ZkStateReader$2.process A cluster state change has occurred - updating...
[junit4:junit4]   2> 16666 T11 oasc.ZkController.register We are http://127.0.0.1:21077/solr/collection1/ and leader is http://127.0.0.1:21077/solr/collection1/
[junit4:junit4]   2> 16667 T11 oasc.ZkController.register No LogReplay needed for core=collection1 baseURL=http://127.0.0.1:21077/solr
[junit4:junit4]   2> 16667 T11 oasc.ZkController.checkRecovery I am the leader, no recovery necessary
[junit4:junit4]   2> 16670 T11 oascc.ZkStateReader.updateClusterState Updating cloud state from ZooKeeper... 
[junit4:junit4]   2> 16672 T11 oass.SolrDispatchFilter.init user.dir=/usr/home/hudson/hudson-slave/workspace/Lucene-Solr-Tests-4.x-java7/solr/build/solr-core/test/J1
[junit4:junit4]   2> 16673 T11 oass.SolrDispatchFilter.init SolrDispatchFilter.init() done
[junit4:junit4]   2> 16674 T11 oascsi.HttpClientUtil.createClient Creating new http client, config:maxConnections=128&maxConnectionsPerHost=32&followRedirects=false
[junit4:junit4]   2> 16865 T11 oejs.Server.doStart jetty-8.1.2.v20120308
[junit4:junit4]   2> 16869 T11 oejs.AbstractConnector.doStart Started SocketConnector@0.0.0.0:29088
[junit4:junit4]   2> 16870 T11 oasc.SolrResourceLoader.locateSolrHome JNDI not configured for solr (NoInitialContextEx)
[junit4:junit4]   2> 16871 T11 oasc.SolrResourceLoader.locateSolrHome using system property solr.solr.home: /usr/home/hudson/hudson-slave/workspace/Lucene-Solr-Tests-4.x-java7/solr/build/solr-core/test/J1/./solrtest-jetty2-1348388972184
[junit4:junit4]   2> 16871 T11 oasc.SolrResourceLoader.<init> new SolrResourceLoader for deduced Solr Home: '/usr/home/hudson/hudson-slave/workspace/Lucene-Solr-Tests-4.x-java7/solr/build/solr-core/test/J1/./solrtest-jetty2-1348388972184/'
[junit4:junit4]   2> 16921 T11 oass.SolrDispatchFilter.init SolrDispatchFilter.init()
[junit4:junit4]   2> 16922 T11 oasc.SolrResourceLoader.locateSolrHome JNDI not configured for solr (NoInitialContextEx)
[junit4:junit4]   2> 16922 T11 oasc.SolrResourceLoader.locateSolrHome using system property solr.solr.home: /usr/home/hudson/hudson-slave/workspace/Lucene-Solr-Tests-4.x-java7/solr/build/solr-core/test/J1/./solrtest-jetty2-1348388972184
[junit4:junit4]   2> 16923 T11 oasc.CoreContainer$Initializer.initialize looking for solr.xml: /usr/home/hudson/hudson-slave/workspace/Lucene-Solr-Tests-4.x-java7/solr/build/solr-core/test/J1/./solrtest-jetty2-1348388972184/solr.xml
[junit4:junit4]   2> 16924 T11 oasc.CoreContainer.<init> New CoreContainer 65950573
[junit4:junit4]   2> 16925 T11 oasc.CoreContainer.load Loading CoreContainer using Solr Home: '/usr/home/hudson/hudson-slave/workspace/Lucene-Solr-Tests-4.x-java7/solr/build/solr-core/test/J1/./solrtest-jetty2-1348388972184/'
[junit4:junit4]   2> 16926 T11 oasc.SolrResourceLoader.<init> new SolrResourceLoader for directory: '/usr/home/hudson/hudson-slave/workspace/Lucene-Solr-Tests-4.x-java7/solr/build/solr-core/test/J1/./solrtest-jetty2-1348388972184/'
[junit4:junit4]   2> 16970 T11 oasc.CoreContainer.load Registering Log Listener
[junit4:junit4]   2> 16993 T11 oasc.CoreContainer.initZooKeeper Zookeeper client=127.0.0.1:27313/solr
[junit4:junit4]   2> 16994 T11 oaz.ZooKeeper.<init> Initiating client connection, connectString=127.0.0.1:27313/solr sessionTimeout=5000 watcher=org.apache.solr.common.cloud.ConnectionManager@6eb6b89f
[junit4:junit4]   2> 16995 T57 oaz.ClientCnxn$SendThread.startConnect Opening socket connection to server /127.0.0.1:27313
[junit4:junit4]   2> 16995 T11 oascc.ConnectionManager.waitForConnected Waiting for client to connect to ZooKeeper
[junit4:junit4]   2> 16997 T57 oaz.ClientCnxn$SendThread.primeConnection Socket connection established to localhost/127.0.0.1:27313, initiating session
[junit4:junit4]   2> 16997 T13 oazs.NIOServerCnxn$Factory.run Accepted socket connection from /140.211.11.196:56026
[junit4:junit4]   2> 16998 T13 oazs.NIOServerCnxn.readConnectRequest Client attempting to establish new session at /140.211.11.196:56026
[junit4:junit4]   2> 17001 T16 oazs.NIOServerCnxn.finishSessionInit Established session 0x139f23ea8d50004 with negotiated timeout 5000 for client /140.211.11.196:56026
[junit4:junit4]   2> 17001 T57 oaz.ClientCnxn$SendThread.readConnectResult Session establishment complete on server localhost/127.0.0.1:27313, sessionid = 0x139f23ea8d50004, negotiated timeout = 5000
[junit4:junit4]   2> 17002 T58 oascc.ConnectionManager.process Watcher org.apache.solr.common.cloud.ConnectionManager@6eb6b89f name:ZooKeeperConnection Watcher:127.0.0.1:27313/solr got event WatchedEvent state:SyncConnected type:None path:null path:null type:None
[junit4:junit4]   2> 17003 T11 oascc.ConnectionManager.waitForConnected Client is connected to ZooKeeper
[junit4:junit4]   2> 17004 T18 oazs.PrepRequestProcessor.pRequest Got user-level KeeperException when processing sessionid:0x139f23ea8d50004 type:create cxid:0x1 zxid:0xfffffffffffffffe txntype:unknown reqpath:n/a Error Path:/solr/overseer Error:KeeperErrorCode = NodeExists for /solr/overseer
[junit4:junit4]   2> 17016 T18 oazs.PrepRequestProcessor.pRequest Got user-level KeeperException when processing sessionid:0x139f23ea8d50004 type:create cxid:0x2 zxid:0xfffffffffffffffe txntype:unknown reqpath:n/a Error Path:/solr/overseer Error:KeeperErrorCode = NodeExists for /solr/overseer
[junit4:junit4]   2> 17019 T11 oasc.ZkController.createEphemeralLiveNode Register node as live in ZooKeeper:/live_nodes/127.0.0.1:29088_solr
[junit4:junit4]   2> 17020 T18 oazs.PrepRequestProcessor.pRequest Got user-level KeeperException when processing sessionid:0x139f23ea8d50004 type:delete cxid:0x4 zxid:0xfffffffffffffffe txntype:unknown reqpath:n/a Error Path:/solr/live_nodes/127.0.0.1:29088_solr Error:KeeperErrorCode = NoNode for /solr/live_nodes/127.0.0.1:29088_solr
[junit4:junit4]   2> 17021 T11 oascc.SolrZkClient.makePath makePath: /live_nodes/127.0.0.1:29088_solr
[junit4:junit4]   2> 17029 T46 oascc.ZkStateReader$3.process Updating live nodes
[junit4:junit4]   2> 17029 T32 oascc.ZkStateReader$3.process Updating live nodes
[junit4:junit4]   2> 17030 T11 oashc.HttpShardHandlerFactory.getParameter Setting socketTimeout to: 0
[junit4:junit4]   2> 17031 T11 oashc.HttpShardHandlerFactory.getParameter Setting urlScheme to: http://
[junit4:junit4]   2> 17032 T11 oashc.HttpShardHandlerFactory.getParameter Setting connTimeout to: 0
[junit4:junit4]   2> 17032 T11 oashc.HttpShardHandlerFactory.getParameter Setting maxConnectionsPerHost to: 20
[junit4:junit4]   2> 17033 T11 oashc.HttpShardHandlerFactory.getParameter Setting corePoolSize to: 0
[junit4:junit4]   2> 17034 T11 oashc.HttpShardHandlerFactory.getParameter Setting maximumPoolSize to: 2147483647
[junit4:junit4]   2> 17035 T11 oashc.HttpShardHandlerFactory.getParameter Setting maxThreadIdleTime to: 5
[junit4:junit4]   2> 17035 T11 oashc.HttpShardHandlerFactory.getParameter Setting sizeOfQueue to: -1
[junit4:junit4]   2> 17036 T11 oashc.HttpShardHandlerFactory.getParameter Setting fairnessPolicy to: false
[junit4:junit4]   2> 17037 T11 oascsi.HttpClientUtil.createClient Creating new http client, config:maxConnectionsPerHost=20&maxConnections=10000&socketTimeout=0&connTimeout=0&retry=false
[junit4:junit4]   2> 17061 T11 oascc.ZkStateReader.createClusterStateWatchersAndUpdate Updating cluster state from ZooKeeper... 
[junit4:junit4]   2> 17070 T11 oasc.CoreContainer.create Creating SolrCore 'collection1' using instanceDir: /usr/home/hudson/hudson-slave/workspace/Lucene-Solr-Tests-4.x-java7/solr/build/solr-core/test/J1/./solrtest-jetty2-1348388972184/collection1
[junit4:junit4]   2> 17071 T11 oasc.ZkController.createCollectionZkNode Check for collection zkNode:collection1
[junit4:junit4]   2> 17072 T11 oasc.ZkController.createCollectionZkNode Collection zkNode exists
[junit4:junit4]   2> 17073 T11 oasc.ZkController.readConfigName Load collection config from:/collections/collection1
[junit4:junit4]   2> 17075 T11 oasc.SolrResourceLoader.<init> new SolrResourceLoader for directory: '/usr/home/hudson/hudson-slave/workspace/Lucene-Solr-Tests-4.x-java7/solr/build/solr-core/test/J1/./solrtest-jetty2-1348388972184/collection1/'
[junit4:junit4]   2> 17077 T11 oasc.SolrResourceLoader.replaceClassLoader Adding 'file:/usr/home/hudson/hudson-slave/workspace/Lucene-Solr-Tests-4.x-java7/solr/build/solr-core/test/J1/solrtest-jetty2-1348388972184/collection1/lib/classes/' to classloader
[junit4:junit4]   2> 17078 T11 oasc.SolrResourceLoader.replaceClassLoader Adding 'file:/usr/home/hudson/hudson-slave/workspace/Lucene-Solr-Tests-4.x-java7/solr/build/solr-core/test/J1/solrtest-jetty2-1348388972184/collection1/lib/README' to classloader
[junit4:junit4]   2> 17132 T33 oascc.ZkStateReader.updateClusterState Updating cloud state from ZooKeeper... 
[junit4:junit4]   2> 17138 T46 oascc.ZkStateReader$2.process A cluster state change has occurred - updating...
[junit4:junit4]   2> 17138 T58 oascc.ZkStateReader$2.process A cluster state change has occurred - updating...
[junit4:junit4]   2> 17138 T32 oascc.ZkStateReader$2.process A cluster state change has occurred - updating...
[junit4:junit4]   2> 17181 T11 oasc.SolrConfig.<init> Using Lucene MatchVersion: LUCENE_41
[junit4:junit4]   2> 17323 T11 oasc.SolrConfig.<init> Loaded SolrConfig: solrconfig.xml
[junit4:junit4]   2> 17425 T11 oass.IndexSchema.readSchema Reading Solr Schema
[junit4:junit4]   2> 17521 T11 oass.IndexSchema.readSchema Schema name=test
[junit4:junit4]   2> 18562 T11 oass.OpenExchangeRatesOrgProvider.init Initialized with rates=open-exchange-rates.json, refreshInterval=1440.
[junit4:junit4]   2> 18577 T11 oass.IndexSchema.readSchema default search field in schema is text
[junit4:junit4]   2> 18580 T11 oass.IndexSchema.readSchema unique key field: id
[junit4:junit4]   2> 18611 T11 oass.FileExchangeRateProvider.reload Reloading exchange rates from file currency.xml
[junit4:junit4]   2> 18620 T11 oass.FileExchangeRateProvider.reload Reloading exchange rates from file currency.xml
[junit4:junit4]   2> 18628 T11 oass.OpenExchangeRatesOrgProvider.reload Reloading exchange rates from open-exchange-rates.json
[junit4:junit4]   2> 18632 T11 oass.OpenExchangeRatesOrgProvider.reload Reloading exchange rates from open-exchange-rates.json
[junit4:junit4]   2> 18635 T11 oasc.SolrCore.<init> [collection1] Opening new SolrCore at /usr/home/hudson/hudson-slave/workspace/Lucene-Solr-Tests-4.x-java7/solr/build/solr-core/test/J1/./solrtest-jetty2-1348388972184/collection1/, dataDir=./org.apache.solr.cloud.BasicDistributedZk2Test-1348388955822/jetty2/
[junit4:junit4]   2> 18636 T11 oasc.JmxMonitoredMap.<init> JMX monitoring is enabled. Adding Solr mbeans to JMX Server: com.sun.jmx.mbeanserver.JmxMBeanServer@457a3972
[junit4:junit4]   2> 18637 T11 oasc.SolrCore.getNewIndexDir WARNING New index directory detected: old=null new=./org.apache.solr.cloud.BasicDistributedZk2Test-1348388955822/jetty2/index/
[junit4:junit4]   2> 18638 T11 oasc.SolrCore.initIndex WARNING [collection1] Solr index directory './org.apache.solr.cloud.BasicDistributedZk2Test-1348388955822/jetty2/index' doesn't exist. Creating new index...
[junit4:junit4]   2> 18640 T11 oasc.CachingDirectoryFactory.get return new directory for /usr/home/hudson/hudson-slave/workspace/Lucene-Solr-Tests-4.x-java7/solr/build/solr-core/test/J1/./org.apache.solr.cloud.BasicDistributedZk2Test-1348388955822/jetty2/index forceNew:false
[junit4:junit4]   2> 18647 T11 oasc.SolrDeletionPolicy.onCommit SolrDeletionPolicy.onCommit: commits:num=1
[junit4:junit4]   2> 		commit{dir=NRTCachingDirectory(org.apache.lucene.store.NIOFSDirectory@/usr/home/hudson/hudson-slave/workspace/Lucene-Solr-Tests-4.x-java7/solr/build/solr-core/test/J1/org.apache.solr.cloud.BasicDistributedZk2Test-1348388955822/jetty2/index lockFactory=org.apache.lucene.store.NativeFSLockFactory@46dcac12; maxCacheMB=48.0 maxMergeSizeMB=4.0),segFN=segments_1,generation=1,filenames=[segments_1]
[junit4:junit4]   2> 18648 T11 oasc.SolrDeletionPolicy.updateCommits newest commit = 1
[junit4:junit4]   2> 18650 T11 oasc.SolrCore.initWriters created xml: solr.XMLResponseWriter
[junit4:junit4]   2> 18654 T11 oasup.UpdateRequestProcessorChain.init inserting DistributedUpdateProcessorFactory into updateRequestProcessorChain "dedupe"
[junit4:junit4]   2> 18655 T11 oasup.UpdateRequestProcessorChain.init inserting DistributedUpdateProcessorFactory into updateRequestProcessorChain "dedupe-allfields"
[junit4:junit4]   2> 18656 T11 oasup.UpdateRequestProcessorChain.init inserting DistributedUpdateProcessorFactory into updateRequestProcessorChain "stored_sig"
[junit4:junit4]   2> 18658 T11 oasup.UpdateRequestProcessorChain.init inserting DistributedUpdateProcessorFactory into updateRequestProcessorChain "uniq-fields"
[junit4:junit4]   2> 18660 T11 oasup.UpdateRequestProcessorChain.init inserting DistributedUpdateProcessorFactory into updateRequestProcessorChain "distrib-dup-test-chain-implicit"
[junit4:junit4]   2> 18661 T11 oasc.RequestHandlers.initHandlersFromConfig adding lazy requestHandler: solr.ReplicationHandler
[junit4:junit4]   2> 18662 T11 oasc.RequestHandlers.initHandlersFromConfig created /replication: solr.ReplicationHandler
[junit4:junit4]   2> 18664 T11 oasc.RequestHandlers.initHandlersFromConfig created standard: solr.StandardRequestHandler
[junit4:junit4]   2> 18666 T11 oasc.RequestHandlers.initHandlersFromConfig created /get: solr.RealTimeGetHandler
[junit4:junit4]   2> 18668 T11 oasc.RequestHandlers.initHandlersFromConfig created dismax: solr.SearchHandler
[junit4:junit4]   2> 18670 T11 oasc.RequestHandlers.initHandlersFromConfig created mock: org.apache.solr.core.MockQuerySenderListenerReqHandler
[junit4:junit4]   2> 18671 T11 oasc.RequestHandlers.initHandlersFromConfig created /admin/: org.apache.solr.handler.admin.AdminHandlers
[junit4:junit4]   2> 18673 T11 oasc.RequestHandlers.initHandlersFromConfig created defaults: solr.StandardRequestHandler
[junit4:junit4]   2> 18674 T11 oasc.RequestHandlers.initHandlersFromConfig adding lazy requestHandler: solr.StandardRequestHandler
[junit4:junit4]   2> 18675 T11 oasc.RequestHandlers.initHandlersFromConfig created lazy: solr.StandardRequestHandler
[junit4:junit4]   2> 18677 T11 oasc.RequestHandlers.initHandlersFromConfig created /update: solr.UpdateRequestHandler
[junit4:junit4]   2> 18679 T11 oasc.RequestHandlers.initHandlersFromConfig created /terms: org.apache.solr.handler.component.SearchHandler
[junit4:junit4]   2> 18680 T11 oasc.RequestHandlers.initHandlersFromConfig created spellCheckCompRH: org.apache.solr.handler.component.SearchHandler
[junit4:junit4]   2> 18682 T11 oasc.RequestHandlers.initHandlersFromConfig created spellCheckCompRH_Direct: org.apache.solr.handler.component.SearchHandler
[junit4:junit4]   2> 18684 T11 oasc.RequestHandlers.initHandlersFromConfig created spellCheckWithWordbreak: org.apache.solr.handler.component.SearchHandler
[junit4:junit4]   2> 18686 T11 oasc.RequestHandlers.initHandlersFromConfig created spellCheckWithWordbreak_Direct: org.apache.solr.handler.component.SearchHandler
[junit4:junit4]   2> 18688 T11 oasc.RequestHandlers.initHandlersFromConfig created spellCheckCompRH1: org.apache.solr.handler.component.SearchHandler
[junit4:junit4]   2> 18690 T11 oasc.RequestHandlers.initHandlersFromConfig created tvrh: org.apache.solr.handler.component.SearchHandler
[junit4:junit4]   2> 18692 T11 oasc.RequestHandlers.initHandlersFromConfig created /mlt: solr.MoreLikeThisHandler
[junit4:junit4]   2> 18694 T11 oasc.RequestHandlers.initHandlersFromConfig created /debug/dump: solr.DumpRequestHandler
[junit4:junit4]   2> 18698 T11 oashl.XMLLoader.init xsltCacheLifetimeSeconds=60
[junit4:junit4]   2> 18705 T11 oasc.SolrCore.initDeprecatedSupport WARNING solrconfig.xml uses deprecated <admin/gettableFiles>, Please update your config to use the ShowFileRequestHandler.
[junit4:junit4]   2> 18707 T11 oasc.SolrCore.initDeprecatedSupport WARNING adding ShowFileRequestHandler with hidden files: [SCHEMA.XML, OLD_SYNONYMS.TXT, STOPWORDS.TXT, PROTWORDS.TXT, OPEN-EXCHANGE-RATES.JSON, SYNONYMS.TXT, CURRENCY.XML, MAPPING-ISOLATIN1ACCENT.TXT]
[junit4:junit4]   2> 18714 T11 oass.SolrIndexSearcher.<init> Opening Searcher@46bfd013 main
[junit4:junit4]   2> 18716 T11 oasu.CommitTracker.<init> Hard AutoCommit: disabled
[junit4:junit4]   2> 18717 T11 oasu.CommitTracker.<init> Soft AutoCommit: disabled
[junit4:junit4]   2> 18719 T11 oashc.SpellCheckComponent.inform Initializing spell checkers
[junit4:junit4]   2> 18728 T11 oass.DirectSolrSpellChecker.init init: {name=direct,classname=DirectSolrSpellChecker,field=lowerfilt,minQueryLength=3}
[junit4:junit4]   2> 18799 T59 oasc.SolrCore.registerSearcher [collection1] Registered new searcher Searcher@46bfd013 main{StandardDirectoryReader(segments_1:1)}
[junit4:junit4]   2> 19166 T33 oascc.ZkStateReader.updateClusterState Updating cloud state from ZooKeeper... 
[junit4:junit4]   2> 19175 T46 oascc.ZkStateReader$2.process A cluster state change has occurred - updating...
[junit4:junit4]   2> 19175 T32 oascc.ZkStateReader$2.process A cluster state change has occurred - updating...
[junit4:junit4]   2> 19175 T58 oascc.ZkStateReader$2.process A cluster state change has occurred - updating...
[junit4:junit4]   2> 19317 T11 oasc.CoreContainer.register registering core: collection1
[junit4:junit4]   2> 19317 T11 oasc.ZkController.register Register shard - core:collection1 address:http://127.0.0.1:29088/solr shardId:shard2
[junit4:junit4]   2> 19319 T11 oascc.SolrZkClient.makePath makePath: /collections/collection1/leader_elect/shard2/election
[junit4:junit4]   2> 19352 T18 oazs.PrepRequestProcessor.pRequest Got user-level KeeperException when processing sessionid:0x139f23ea8d50004 type:delete cxid:0x42 zxid:0xfffffffffffffffe txntype:unknown reqpath:n/a Error Path:/solr/collections/collection1/leaders/shard2 Error:KeeperErrorCode = NoNode for /solr/collections/collection1/leaders/shard2
[junit4:junit4]   2> 19354 T11 oasc.ShardLeaderElectionContext.runLeaderProcess Running the leader process.
[junit4:junit4]   2> 19355 T18 oazs.PrepRequestProcessor.pRequest Got user-level KeeperException when processing sessionid:0x139f23ea8d50004 type:create cxid:0x43 zxid:0xfffffffffffffffe txntype:unknown reqpath:n/a Error Path:/solr/overseer Error:KeeperErrorCode = NodeExists for /solr/overseer
[junit4:junit4]   2> 19363 T11 oasc.ShardLeaderElectionContext.waitForReplicasToComeUp Enough replicas found to continue.
[junit4:junit4]   2> 19365 T11 oasc.ShardLeaderElectionContext.runLeaderProcess I may be the new leader - try and sync
[junit4:junit4]   2> 19366 T11 oasc.SyncStrategy.sync Sync replicas to http://127.0.0.1:29088/solr/collection1/
[junit4:junit4]   2> 19367 T11 oasc.SyncStrategy.syncReplicas Sync Success - now sync replicas to me
[junit4:junit4]   2> 19368 T11 oasc.SyncStrategy.syncToMe http://127.0.0.1:29088/solr/collection1/ has no replicas
[junit4:junit4]   2> 19369 T11 oasc.ShardLeaderElectionContext.runLeaderProcess I am the new leader: http://127.0.0.1:29088/solr/collection1/
[junit4:junit4]   2> 19370 T11 oascc.SolrZkClient.makePath makePath: /collections/collection1/leaders/shard2
[junit4:junit4]   2> 19376 T18 oazs.PrepRequestProcessor.pRequest Got user-level KeeperException when processing sessionid:0x139f23ea8d50004 type:create cxid:0x4c zxid:0xfffffffffffffffe txntype:unknown reqpath:n/a Error Path:/solr/overseer Error:KeeperErrorCode = NodeExists for /solr/overseer
[junit4:junit4]   2> 19681 T33 oascc.ZkStateReader.updateClusterState Updating cloud state from ZooKeeper... 
[junit4:junit4]   2> 19713 T46 oascc.ZkStateReader$2.process A cluster state change has occurred - updating...
[junit4:junit4]   2> 19713 T58 oascc.ZkStateReader$2.process A cluster state change has occurred - updating...
[junit4:junit4]   2> 19713 T32 oascc.ZkStateReader$2.process A cluster state change has occurred - updating...
[junit4:junit4]   2> 19743 T11 oasc.ZkController.register We are http://127.0.0.1:29088/solr/collection1/ and leader is http://127.0.0.1:29088/solr/collection1/
[junit4:junit4]   2> 19744 T11 oasc.ZkController.register No LogReplay needed for core=collection1 baseURL=http://127.0.0.1:29088/solr
[junit4:junit4]   2> 19744 T11 oasc.ZkController.checkRecovery I am the leader, no recovery necessary
[junit4:junit4]   2> 19747 T11 oascc.ZkStateReader.updateClusterState Updating cloud state from ZooKeeper... 
[junit4:junit4]   2> 19749 T11 oass.SolrDispatchFilter.init user.dir=/usr/home/hudson/hudson-slave/workspace/Lucene-Solr-Tests-4.x-java7/solr/build/solr-core/test/J1
[junit4:junit4]   2> 19749 T11 oass.SolrDispatchFilter.init SolrDispatchFilter.init() done
[junit4:junit4]   2> 19750 T11 oascsi.HttpClientUtil.createClient Creating new http client, config:maxConnections=128&maxConnectionsPerHost=32&followRedirects=false
[junit4:junit4]   2> 19895 T11 oejs.Server.doStart jetty-8.1.2.v20120308
[junit4:junit4]   2> 19899 T11 oejs.AbstractConnector.doStart Started SocketConnector@0.0.0.0:20394
[junit4:junit4]   2> 19899 T11 oasc.SolrResourceLoader.locateSolrHome JNDI not configured for solr (NoInitialContextEx)
[junit4:junit4]   2> 19900 T11 oasc.SolrResourceLoader.locateSolrHome using system property solr.solr.home: /usr/home/hudson/hudson-slave/workspace/Lucene-Solr-Tests-4.x-java7/solr/build/solr-core/test/J1/./solrtest-jetty3-1348388975255
[junit4:junit4]   2> 19901 T11 oasc.SolrResourceLoader.<init> new SolrResourceLoader for deduced Solr Home: '/usr/home/hudson/hudson-slave/workspace/Lucene-Solr-Tests-4.x-java7/solr/build/solr-core/test/J1/./solrtest-jetty3-1348388975255/'
[junit4:junit4]   2> 19942 T11 oass.SolrDispatchFilter.init SolrDispatchFilter.init()
[junit4:junit4]   2> 19943 T11 oasc.SolrResourceLoader.locateSolrHome JNDI not configured for solr (NoInitialContextEx)
[junit4:junit4]   2> 19944 T11 oasc.SolrResourceLoader.locateSolrHome using system property solr.solr.home: /usr/home/hudson/hudson-slave/workspace/Lucene-Solr-Tests-4.x-java7/solr/build/solr-core/test/J1/./solrtest-jetty3-1348388975255
[junit4:junit4]   2> 19944 T11 oasc.CoreContainer$Initializer.initialize looking for solr.xml: /usr/home/hudson/hudson-slave/workspace/Lucene-Solr-Tests-4.x-java7/solr/build/solr-core/test/J1/./solrtest-jetty3-1348388975255/solr.xml
[junit4:junit4]   2> 19945 T11 oasc.CoreContainer.<init> New CoreContainer 554396753
[junit4:junit4]   2> 19946 T11 oasc.CoreContainer.load Loading CoreContainer using Solr Home: '/usr/home/hudson/hudson-slave/workspace/Lucene-Solr-Tests-4.x-java7/solr/build/solr-core/test/J1/./solrtest-jetty3-1348388975255/'
[junit4:junit4]   2> 19946 T11 oasc.SolrResourceLoader.<init> new SolrResourceLoader for directory: '/usr/home/hudson/hudson-slave/workspace/Lucene-Solr-Tests-4.x-java7/solr/build/solr-core/test/J1/./solrtest-jetty3-1348388975255/'
[junit4:junit4]   2> 19981 T11 oasc.CoreContainer.load Registering Log Listener
[junit4:junit4]   2> 19999 T11 oasc.CoreContainer.initZooKeeper Zookeeper client=127.0.0.1:27313/solr
[junit4:junit4]   2> 20000 T11 oaz.ZooKeeper.<init> Initiating client connection, connectString=127.0.0.1:27313/solr sessionTimeout=5000 watcher=org.apache.solr.common.cloud.ConnectionManager@1fce66ba
[junit4:junit4]   2> 20001 T69 oaz.ClientCnxn$SendThread.startConnect Opening socket connection to server /127.0.0.1:27313
[junit4:junit4]   2> 20001 T11 oascc.ConnectionManager.waitForConnected Waiting for client to connect to ZooKeeper
[junit4:junit4]   2> 20003 T69 oaz.ClientCnxn$SendThread.primeConnection Socket connection established to localhost/127.0.0.1:27313, initiating session
[junit4:junit4]   2> 20003 T13 oazs.NIOServerCnxn$Factory.run Accepted socket connection from /140.211.11.196:58382
[junit4:junit4]   2> 20004 T13 oazs.NIOServerCnxn.readConnectRequest Client attempting to establish new session at /140.211.11.196:58382
[junit4:junit4]   2> 20007 T16 oazs.NIOServerCnxn.finishSessionInit Established session 0x139f23ea8d50005 with negotiated timeout 5000 for client /140.211.11.196:58382
[junit4:junit4]   2> 20007 T69 oaz.ClientCnxn$SendThread.readConnectResult Session establishment complete on server localhost/127.0.0.1:27313, sessionid = 0x139f23ea8d50005, negotiated timeout = 5000
[junit4:junit4]   2> 20008 T70 oascc.ConnectionManager.process Watcher org.apache.solr.common.cloud.ConnectionManager@1fce66ba name:ZooKeeperConnection Watcher:127.0.0.1:27313/solr got event WatchedEvent state:SyncConnected type:None path:null path:null type:None
[junit4:junit4]   2> 20009 T11 oascc.ConnectionManager.waitForConnected Client is connected to ZooKeeper
[junit4:junit4]   2> 20010 T18 oazs.PrepRequestProcessor.pRequest Got user-level KeeperException when processing sessionid:0x139f23ea8d50005 type:create cxid:0x1 zxid:0xfffffffffffffffe txntype:unknown reqpath:n/a Error Path:/solr/overseer Error:KeeperErrorCode = NodeExists for /solr/overseer
[junit4:junit4]   2> 20021 T18 oazs.PrepRequestProcessor.pRequest Got user-level KeeperException when processing sessionid:0x139f23ea8d50005 type:create cxid:0x2 zxid:0xfffffffffffffffe txntype:unknown reqpath:n/a Error Path:/solr/overseer Error:KeeperErrorCode = NodeExists for /solr/overseer
[junit4:junit4]   2> 20023 T11 oasc.ZkController.createEphemeralLiveNode Register node as live in ZooKeeper:/live_nodes/127.0.0.1:20394_solr
[junit4:junit4]   2> 20024 T18 oazs.PrepRequestProcessor.pRequest Got user-level KeeperException when processing sessionid:0x139f23ea8d50005 type:delete cxid:0x4 zxid:0xfffffffffffffffe txntype:unknown reqpath:n/a Error Path:/solr/live_nodes/127.0.0.1:20394_solr Error:KeeperErrorCode = NoNode for /solr/live_nodes/127.0.0.1:20394_solr
[junit4:junit4]   2> 20030 T11 oascc.SolrZkClient.makePath makePath: /live_nodes/127.0.0.1:20394_solr
[junit4:junit4]   2> 20033 T58 oascc.ZkStateReader$3.process Updating live nodes
[junit4:junit4]   2> 20033 T46 oascc.ZkStateReader$3.process Updating live nodes
[junit4:junit4]   2> 20033 T32 oascc.ZkStateReader$3.process Updating live nodes
[junit4:junit4]   2> 20034 T11 oashc.HttpShardHandlerFactory.getParameter Setting socketTimeout to: 0
[junit4:junit4]   2> 20035 T11 oashc.HttpShardHandlerFactory.getParameter Setting urlScheme to: http://
[junit4:junit4]   2> 20035 T11 oashc.HttpShardHandlerFactory.getParameter Setting connTimeout to: 0
[junit4:junit4]   2> 20036 T11 oashc.HttpShardHandlerFactory.getParameter Setting maxConnectionsPerHost to: 20
[junit4:junit4]   2> 20037 T11 oashc.HttpShardHandlerFactory.getParameter Setting corePoolSize to: 0
[junit4:junit4]   2> 20037 T11 oashc.HttpShardHandlerFactory.getParameter Setting maximumPoolSize to: 2147483647
[junit4:junit4]   2> 20038 T11 oashc.HttpShardHandlerFactory.getParameter Setting maxThreadIdleTime to: 5
[junit4:junit4]   2> 20039 T11 oashc.HttpShardHandlerFactory.getParameter Setting sizeOfQueue to: -1
[junit4:junit4]   2> 20039 T11 oashc.HttpShardHandlerFactory.getParameter Setting fairnessPolicy to: false
[junit4:junit4]   2> 20040 T11 oascsi.HttpClientUtil.createClient Creating new http client, config:maxConnectionsPerHost=20&maxConnections=10000&socketTimeout=0&connTimeout=0&retry=false
[junit4:junit4]   2> 20061 T11 oascc.ZkStateReader.createClusterStateWatchersAndUpdate Updating cluster state from ZooKeeper... 
[junit4:junit4]   2> 20069 T11 oasc.CoreContainer.create Creating SolrCore 'collection1' using instanceDir: /usr/home/hudson/hudson-slave/workspace/Lucene-Solr-Tests-4.x-java7/solr/build/solr-core/test/J1/./solrtest-jetty3-1348388975255/collection1
[junit4:junit4]   2> 20070 T11 oasc.ZkController.createCollectionZkNode Check for collection zkNode:collection1
[junit4:junit4]   2> 20071 T11 oasc.ZkController.createCollectionZkNode Collection zkNode exists
[junit4:junit4]   2> 20072 T11 oasc.ZkController.readConfigName Load collection config from:/collections/collection1
[junit4:junit4]   2> 20074 T11 oasc.SolrResourceLoader.<init> new SolrResourceLoader for directory: '/usr/home/hudson/hudson-slave/workspace/Lucene-Solr-Tests-4.x-java7/solr/build/solr-core/test/J1/./solrtest-jetty3-1348388975255/collection1/'
[junit4:junit4]   2> 20076 T11 oasc.SolrResourceLoader.replaceClassLoader Adding 'file:/usr/home/hudson/hudson-slave/workspace/Lucene-Solr-Tests-4.x-java7/solr/build/solr-core/test/J1/solrtest-jetty3-1348388975255/collection1/lib/classes/' to classloader
[junit4:junit4]   2> 20078 T11 oasc.SolrResourceLoader.replaceClassLoader Adding 'file:/usr/home/hudson/hudson-slave/workspace/Lucene-Solr-Tests-4.x-java7/solr/build/solr-core/test/J1/solrtest-jetty3-1348388975255/collection1/lib/README' to classloader
[junit4:junit4]   2> 20153 T11 oasc.SolrConfig.<init> Using Lucene MatchVersion: LUCENE_41
[junit4:junit4]   2> 20226 T33 oascc.ZkStateReader.updateClusterState Updating cloud state from ZooKeeper... 
[junit4:junit4]   2> 20235 T11 oasc.SolrConfig.<init> Loaded SolrConfig: solrconfig.xml
[junit4:junit4]   2> 20241 T46 oascc.ZkStateReader$2.process A cluster state change has occurred - updating...
[junit4:junit4]   2> 20241 T70 oascc.ZkStateReader$2.process A cluster state change has occurred - updating...
[junit4:junit4]   2> 20241 T58 oascc.ZkStateReader$2.process A cluster state change has occurred - updating...
[junit4:junit4]   2> 20241 T32 oascc.ZkStateReader$2.process A cluster state change has occurred - updating...
[junit4:junit4]   2> 20241 T11 oass.IndexSchema.readSchema Reading Solr Schema
[junit4:junit4]   2> 20282 T11 oass.IndexSchema.readSchema Schema name=test
[junit4:junit4]   2> 20975 T11 oass.OpenExchangeRatesOrgProvider.init Initialized with rates=open-exchange-rates.json, refreshInterval=1440.
[junit4:junit4]   2> 20993 T11 oass.IndexSchema.readSchema default search field in schema is text
[junit4:junit4]   2> 20997 T11 oass.IndexSchema.readSchema unique key field: id
[junit4:junit4]   2> 21031 T11 oass.FileExchangeRateProvider.reload Reloading exchange rates from file currency.xml
[junit4:junit4]   2> 21039 T11 oass.FileExchangeRateProvider.reload Reloading exchange rates from file currency.xml
[junit4:junit4]   2> 21045 T11 oass.OpenExchangeRatesOrgProvider.reload Reloading exchange rates from open-exchange-rates.json
[junit4:junit4]   2> 21049 T11 oass.OpenExchangeRatesOrgProvider.reload Reloading exchange rates from open-exchange-rates.json
[junit4:junit4]   2> 21053 T11 oasc.SolrCore.<init> [collection1] Opening new SolrCore at /usr/home/hudson/hudson-slave/workspace/Lucene-Solr-Tests-4.x-java7/solr/build/solr-core/test/J1/./solrtest-jetty3-1348388975255/collection1/, dataDir=./org.apache.solr.cloud.BasicDistributedZk2Test-1348388955822/jetty3/
[junit4:junit4]   2> 21054 T11 oasc.JmxMonitoredMap.<init> JMX monitoring is enabled. Adding Solr mbeans to JMX Server: com.sun.jmx.mbeanserver.JmxMBeanServer@457a3972
[junit4:junit4]   2> 21056 T11 oasc.SolrCore.getNewIndexDir WARNING New index directory detected: old=null new=./org.apache.solr.cloud.BasicDistributedZk2Test-1348388955822/jetty3/index/
[junit4:junit4]   2> 21057 T11 oasc.SolrCore.initIndex WARNING [collection1] Solr index directory './org.apache.solr.cloud.BasicDistributedZk2Test-1348388955822/jetty3/index' doesn't exist. Creating new index...
[junit4:junit4]   2> 21058 T11 oasc.CachingDirectoryFactory.get return new directory for /usr/home/hudson/hudson-slave/workspace/Lucene-Solr-Tests-4.x-java7/solr/build/solr-core/test/J1/./org.apache.solr.cloud.BasicDistributedZk2Test-1348388955822/jetty3/index forceNew:false
[junit4:junit4]   2> 21066 T11 oasc.SolrDeletionPolicy.onCommit SolrDeletionPolicy.onCommit: commits:num=1
[junit4:junit4]   2> 		commit{dir=NRTCachingDirectory(org.apache.lucene.store.NIOFSDirectory@/usr/home/hudson/hudson-slave/workspace/Lucene-Solr-Tests-4.x-java7/solr/build/solr-core/test/J1/org.apache.solr.cloud.BasicDistributedZk2Test-1348388955822/jetty3/index lockFactory=org.apache.lucene.store.NativeFSLockFactory@1e1d1e05; maxCacheMB=48.0 maxMergeSizeMB=4.0),segFN=segments_1,generation=1,filenames=[segments_1]
[junit4:junit4]   2> 21067 T11 oasc.SolrDeletionPolicy.updateCommits newest commit = 1
[junit4:junit4]   2> 21068 T11 oasc.SolrCore.initWriters created xml: solr.XMLResponseWriter
[junit4:junit4]   2> 21072 T11 oasup.UpdateRequestProcessorChain.init inserting DistributedUpdateProcessorFactory into updateRequestProcessorChain "dedupe"
[junit4:junit4]   2> 21073 T11 oasup.UpdateRequestProcessorChain.init inserting DistributedUpdateProcessorFactory into updateRequestProcessorChain "dedupe-allfields"
[junit4:junit4]   2> 21074 T11 oasup.UpdateRequestProcessorChain.init inserting DistributedUpdateProcessorFactory into updateRequestProcessorChain "stored_sig"
[junit4:junit4]   2> 21075 T11 oasup.UpdateRequestProcessorChain.init inserting DistributedUpdateProcessorFactory into updateRequestProcessorChain "uniq-fields"
[junit4:junit4]   2> 21076 T11 oasup.UpdateRequestProcessorChain.init inserting DistributedUpdateProcessorFactory into updateRequestProcessorChain "distrib-dup-test-chain-implicit"
[junit4:junit4]   2> 21077 T11 oasc.RequestHandlers.initHandlersFromConfig adding lazy requestHandler: solr.ReplicationHandler
[junit4:junit4]   2> 21078 T11 oasc.RequestHandlers.initHandlersFromConfig created /replication: solr.ReplicationHandler
[junit4:junit4]   2> 21079 T11 oasc.RequestHandlers.initHandlersFromConfig created standard: solr.StandardRequestHandler
[junit4:junit4]   2> 21081 T11 oasc.RequestHandlers.initHandlersFromConfig created /get: solr.RealTimeGetHandler
[junit4:junit4]   2> 21082 T11 oasc.RequestHandlers.initHandlersFromConfig created dismax: solr.SearchHandler
[junit4:junit4]   2> 21083 T11 oasc.RequestHandlers.initHandlersFromConfig created mock: org.apache.solr.core.MockQuerySenderListenerReqHandler
[junit4:junit4]   2> 21084 T11 oasc.RequestHandlers.initHandlersFromConfig created /admin/: org.apache.solr.handler.admin.AdminHandlers
[junit4:junit4]   2> 21086 T11 oasc.RequestHandlers.initHandlersFromConfig created defaults: solr.StandardRequestHandler
[junit4:junit4]   2> 21086 T11 oasc.RequestHandlers.initHandlersFromConfig adding lazy requestHandler: solr.StandardRequestHandler
[junit4:junit4]   2> 21087 T11 oasc.RequestHandlers.initHandlersFromConfig created lazy: solr.StandardRequestHandler
[junit4:junit4]   2> 21089 T11 oasc.RequestHandlers.initHandlersFromConfig created /update: solr.UpdateRequestHandler
[junit4:junit4]   2> 21090 T11 oasc.RequestHandlers.initHandlersFromConfig created /terms: org.apache.solr.handler.component.SearchHandler
[junit4:junit4]   2> 21091 T11 oasc.RequestHandlers.initHandlersFromConfig created spellCheckCompRH: org.apache.solr.handler.component.SearchHandler
[junit4:junit4]   2> 21092 T11 oasc.RequestHandlers.initHandlersFromConfig created spellCheckCompRH_Direct: org.apache.solr.handler.component.SearchHandler
[junit4:junit4]   2> 21094 T11 oasc.RequestHandlers.initHandlersFromConfig created spellCheckWithWordbreak: org.apache.solr.handler.component.SearchHandler
[junit4:junit4]   2> 21095 T11 oasc.RequestHandlers.initHandlersFromConfig created spellCheckWithWordbreak_Direct: org.apache.solr.handler.component.SearchHandler
[junit4:junit4]   2> 21096 T11 oasc.RequestHandlers.initHandlersFromConfig created spellCheckCompRH1: org.apache.solr.handler.component.SearchHandler
[junit4:junit4]   2> 21098 T11 oasc.RequestHandlers.initHandlersFromConfig created tvrh: org.apache.solr.handler.component.SearchHandler
[junit4:junit4]   2> 21106 T11 oasc.RequestHandlers.initHandlersFromConfig created /mlt: solr.MoreLikeThisHandler
[junit4:junit4]   2> 21108 T11 oasc.RequestHandlers.initHandlersFromConfig created /debug/dump: solr.DumpRequestHandler
[junit4:junit4]   2> 21112 T11 oashl.XMLLoader.init xsltCacheLifetimeSeconds=60
[junit4:junit4]   2> 21117 T11 oasc.SolrCore.initDeprecatedSupport WARNING solrconfig.xml uses deprecated <admin/gettableFiles>, Please update your config to use the ShowFileRequestHandler.
[junit4:junit4]   2> 21120 T11 oasc.SolrCore.initDeprecatedSupport WARNING adding ShowFileRequestHandler with hidden files: [SCHEMA.XML, OLD_SYNONYMS.TXT, STOPWORDS.TXT, PROTWORDS.TXT, OPEN-EXCHANGE-RATES.JSON, SYNONYMS.TXT, CURRENCY.XML, MAPPING-ISOLATIN1ACCENT.TXT]
[junit4:junit4]   2> 21127 T11 oass.SolrIndexSearcher.<init> Opening Searcher@702b25c9 main
[junit4:junit4]   2> 21130 T11 oasu.CommitTracker.<init> Hard AutoCommit: disabled
[junit4:junit4]   2> 21131 T11 oasu.CommitTracker.<init> Soft AutoCommit: disabled
[junit4:junit4]   2> 21133 T11 oashc.SpellCheckComponent.inform Initializing spell checkers
[junit4:junit4]   2> 21173 T11 oass.DirectSolrSpellChecker.init init: {name=direct,classname=DirectSolrSpellChecker,field=lowerfilt,minQueryLength=3}
[junit4:junit4]   2> 21239 T71 oasc.SolrCore.registerSearcher [collection1] Registered new searcher Searcher@702b25c9 main{StandardDirectoryReader(segments_1:1)}
[junit4:junit4]   2> 21754 T33 oascc.ZkStateReader.updateClusterState Updating cloud state from ZooKeeper... 
[junit4:junit4]   2> 21770 T46 oascc.ZkStateReader$2.process A cluster state change has occurred - updating...
[junit4:junit4]   2> 21770 T58 oascc.ZkStateReader$2.process A cluster state change has occurred - updating...
[junit4:junit4]   2> 21771 T70 oascc.ZkStateReader$2.process A cluster state change has occurred - updating...
[junit4:junit4]   2> 21770 T32 oascc.ZkStateReader$2.process A cluster state change has occurred - updating...
[junit4:junit4]   2> 22264 T11 oasc.CoreContainer.register registering core: collection1
[junit4:junit4]   2> 22264 T11 oasc.ZkController.register Register shard - core:collection1 address:http://127.0.0.1:20394/solr shardId:shard1
[junit4:junit4]   2> 22269 T11 oasc.ZkController.register We are http://127.0.0.1:20394/solr/collection1/ and leader is http://127.0.0.1:21077/solr/collection1/
[junit4:junit4]   2> 22270 T11 oasc.ZkController.register No LogReplay needed for core=collection1 baseURL=http://127.0.0.1:20394/solr
[junit4:junit4]   2> 22270 T11 oasc.ZkController.checkRecovery Core needs to recover:collection1
[junit4:junit4]   2> 22271 T11 oasu.DefaultSolrCoreState.doRecovery Running recovery - first canceling any ongoing recovery
[junit4:junit4]   2> 22277 T11 oascc.ZkStateReader.updateClusterState Updating cloud state from ZooKeeper... 
[junit4:junit4]   2> 22278 T11 oass.SolrDispatchFilter.init user.dir=/usr/home/hudson/hudson-slave/workspace/Lucene-Solr-Tests-4.x-java7/solr/build/solr-core/test/J1
[junit4:junit4]   2> 22279 T11 oass.SolrDispatchFilter.init SolrDispatchFilter.init() done
[junit4:junit4]   2> 22279 T11 oascsi.HttpClientUtil.createClient Creating new http client, config:maxConnections=128&maxConnectionsPerHost=32&followRedirects=false
[junit4:junit4]   2> ASYNC  NEW_CORE C0 name=collection1 org.apache.solr.core.SolrCore@21fd44c0 url=http://127.0.0.1:20394/solr/collection1 node=127.0.0.1:20394_solr
[junit4:junit4]   2> 22285 T72 C0 P20394 oasc.RecoveryStrategy.run Starting recovery process.  core=collection1 recoveringAfterStartup=true
[junit4:junit4]   2> 22292 T72 C0 P20394 oasc.RecoveryStrategy.doRecovery ###### startupVersions=[]
[junit4:junit4]   2> 22295 T72 C0 P20394 oasc.RecoveryStrategy.doRecovery Attempting to PeerSync from http://127.0.0.1:21077/solr/collection1/ core=collection1 - recoveringAfterStartup=true
[junit4:junit4]   2> 22307 T72 C0 P20394 oascsi.HttpClientUtil.createClient Creating new http client, config:maxConnectionsPerHost=20&maxConnections=10000&connTimeout=30000&socketTimeout=30000&retry=false
[junit4:junit4]   2> 22337 T72 C0 P20394 oasu.PeerSync.sync PeerSync: core=collection1 url=http://127.0.0.1:20394/solr START replicas=[http://127.0.0.1:21077/solr/collection1/] nUpdates=100
[junit4:junit4]   2> 22360 T72 C0 P20394 oasu.PeerSync.sync WARNING no frame of reference to tell of we've missed updates
[junit4:junit4]   2> 22361 T72 C0 P20394 oasc.RecoveryStrategy.doRecovery PeerSync Recovery was not successful - trying replication. core=collection1
[junit4:junit4]   2> 22361 T72 C0 P20394 oasc.RecoveryStrategy.doRecovery Starting Replication Recovery. core=collection1
[junit4:junit4]   2> 22362 T72 C0 P20394 oascsi.HttpClientUtil.createClient Creating new http client, config:maxConnections=128&maxConnectionsPerHost=32&followRedirects=false
[junit4:junit4]   2> 22451 T11 oejs.Server.doStart jetty-8.1.2.v20120308
[junit4:junit4]   2> 22454 T11 oejs.AbstractConnector.doStart Started SocketConnector@0.0.0.0:12432
[junit4:junit4]   2> 22455 T11 oasc.SolrResourceLoader.locateSolrHome JNDI not configured for solr (NoInitialContextEx)
[junit4:junit4]   2> 22456 T11 oasc.SolrResourceLoader.locateSolrHome using system property solr.solr.home: /usr/home/hudson/hudson-slave/workspace/Lucene-Solr-Tests-4.x-java7/solr/build/solr-core/test/J1/./solrtest-jetty4-1348388977784
[junit4:junit4]   2> 22457 T11 oasc.SolrResourceLoader.<init> new SolrResourceLoader for deduced Solr Home: '/usr/home/hudson/hudson-slave/workspace/Lucene-Solr-Tests-4.x-java7/solr/build/solr-core/test/J1/./solrtest-jetty4-1348388977784/'
[junit4:junit4]   2> 22505 T11 oass.SolrDispatchFilter.init SolrDispatchFilter.init()
[junit4:junit4]   2> 22506 T11 oasc.SolrResourceLoader.locateSolrHome JNDI not configured for solr (NoInitialContextEx)
[junit4:junit4]   2> 22506 T11 oasc.SolrResourceLoader.locateSolrHome using system property solr.solr.home: /usr/home/hudson/hudson-slave/workspace/Lucene-Solr-Tests-4.x-java7/solr/build/solr-core/test/J1/./solrtest-jetty4-1348388977784
[junit4:junit4]   2> 22507 T11 oasc.CoreContainer$Initializer.initialize looking for solr.xml: /usr/home/hudson/hudson-slave/workspace/Lucene-Solr-Tests-4.x-java7/solr/build/solr-core/test/J1/./solrtest-jetty4-1348388977784/solr.xml
[junit4:junit4]   2> 22507 T11 oasc.CoreContainer.<init> New CoreContainer 163488507
[junit4:junit4]   2> 22508 T11 oasc.CoreContainer.load Loading CoreContainer using Solr Home: '/usr/home/hudson/hudson-slave/workspace/Lucene-Solr-Tests-4.x-java7/solr/build/solr-core/test/J1/./solrtest-jetty4-1348388977784/'
[junit4:junit4]   2> 22509 T11 oasc.SolrResourceLoader.<init> new SolrResourceLoader for directory: '/usr/home/hudson/hudson-slave/workspace/Lucene-Solr-Tests-4.x-java7/solr/build/solr-core/test/J1/./solrtest-jetty4-1348388977784/'
[junit4:junit4]   2> 22536 T11 oasc.CoreContainer.load Registering Log Listener
[junit4:junit4]   2> 22551 T11 oasc.CoreContainer.initZooKeeper Zookeeper client=127.0.0.1:27313/solr
[junit4:junit4]   2> 22552 T11 oaz.ZooKeeper.<init> Initiating client connection, connectString=127.0.0.1:27313/solr sessionTimeout=5000 watcher=org.apache.solr.common.cloud.ConnectionManager@43081490
[junit4:junit4]   2> 22553 T83 oaz.ClientCnxn$SendThread.startConnect Opening socket connection to server /127.0.0.1:27313
[junit4:junit4]   2> 22553 T11 oascc.ConnectionManager.waitForConnected Waiting for client to connect to ZooKeeper
[junit4:junit4]   2> 22555 T83 oaz.ClientCnxn$SendThread.primeConnection Socket connection established to localhost/127.0.0.1:27313, initiating session
[junit4:junit4]   2> 22555 T13 oazs.NIOServerCnxn$Factory.run Accepted socket connection from /140.211.11.196:39455
[junit4:junit4]   2> 22556 T13 oazs.NIOServerCnxn.readConnectRequest Client attempting to establish new session at /140.211.11.196:39455
[junit4:junit4]   2> 22558 T16 oazs.NIOServerCnxn.finishSessionInit Established session 0x139f23ea8d50006 with negotiated timeout 5000 for client /140.211.11.196:39455
[junit4:junit4]   2> 22558 T83 oaz.ClientCnxn$SendThread.readConnectResult Session establishment complete on server localhost/127.0.0.1:27313, sessionid = 0x139f23ea8d50006, negotiated timeout = 5000
[junit4:junit4]   2> 22559 T84 oascc.ConnectionManager.process Watcher org.apache.solr.common.cloud.ConnectionManager@43081490 name:ZooKeeperConnection Watcher:127.0.0.1:27313/solr got event WatchedEvent state:SyncConnected type:None path:null path:null type:None
[junit4:junit4]   2> 22560 T11 oascc.ConnectionManager.waitForConnected Client is connected to ZooKeeper
[junit4:junit4]   2> 22561 T18 oazs.PrepRequestProcessor.pRequest Got user-level KeeperException when processing sessionid:0x139f23ea8d50006 type:create cxid:0x1 zxid:0xfffffffffffffffe txntype:unknown reqpath:n/a Error Path:/solr/overseer Error:KeeperErrorCode = NodeExists for /solr/overseer
[junit4:junit4]   2> 22569 T18 oazs.PrepRequestProcessor.pRequest Got user-level KeeperException when processing sessionid:0x139f23ea8d50006 type:create cxid:0x2 zxid:0xfffffffffffffffe txntype:unknown reqpath:n/a Error Path:/solr/overseer Error:KeeperErrorCode = NodeExists for /solr/overseer
[junit4:junit4]   2> 22571 T11 oasc.ZkController.createEphemeralLiveNode Register node as live in ZooKeeper:/live_nodes/127.0.0.1:12432_solr
[junit4:junit4]   2> 22572 T18 oazs.PrepRequestProcessor.pRequest Got user-level KeeperException when processing sessionid:0x139f23ea8d50006 type:delete cxid:0x4 zxid:0xfffffffffffffffe txntype:unknown reqpath:n/a Error Path:/solr/live_nodes/127.0.0.1:12432_solr Error:KeeperErrorCode = NoNode for /solr/live_nodes/127.0.0.1:12432_solr
[junit4:junit4]   2> 22573 T11 oascc.SolrZkClient.makePath makePath: /live_nodes/127.0.0.1:12432_solr
[junit4:junit4]   2> 22581 T46 oascc.ZkStateReader$3.process Updating live nodes
[junit4:junit4]   2> 22581 T70 oascc.ZkStateReader$3.process Updating live nodes
[junit4:junit4]   2> 22581 T32 oascc.ZkStateReader$3.process Updating live nodes
[junit4:junit4]   2> 22581 T58 oascc.ZkStateReader$3.process Updating live nodes
[junit4:junit4]   2> 22582 T11 oashc.HttpShardHandlerFactory.getParameter Setting socketTimeout to: 0
[junit4:junit4]   2> 22583 T11 oashc.HttpShardHandlerFactory.getParameter Setting urlScheme to: http://
[junit4:junit4]   2> 22584 T11 oashc.HttpShardHandlerFactory.getParameter Setting connTimeout to: 0
[junit4:junit4]   2> 22584 T11 oashc.HttpShardHandlerFactory.getParameter Setting maxConnectionsPerHost to: 20
[junit4:junit4]   2> 22584 T11 oashc.HttpShardHandlerFactory.getParameter Setting corePoolSize to: 0
[junit4:junit4]   2> 22585 T11 oashc.HttpShardHandlerFactory.getParameter Setting maximumPoolSize to: 2147483647
[junit4:junit4]   2> 22585 T11 oashc.HttpShardHandlerFactory.getParameter Setting maxThreadIdleTime to: 5
[junit4:junit4]   2> 22586 T11 oashc.HttpShardHandlerFactory.getParameter Setting sizeOfQueue to: -1
[junit4:junit4]   2> 22586 T11 oashc.HttpShardHandlerFactory.getParameter Setting fairnessPolicy to: false
[junit4:junit4]   2> 22587 T11 oascsi.HttpClientUtil.createClient Creating new http client, config:maxConnectionsPerHost=20&maxConnections=10000&socketTimeout=0&connTimeout=0&retry=false
[junit4:junit4]   2> 22606 T11 oascc.ZkStateReader.createClusterStateWatchersAndUpdate Updating cluster state from ZooKeeper... 
[junit4:junit4]   2> 22616 T11 oasc.CoreContainer.create Creating SolrCore 'collection1' using instanceDir: /usr/home/hudson/hudson-slave/workspace/Lucene-Solr-Tests-4.x-java7/solr/build/solr-core/test/J1/./solrtest-jetty4-1348388977784/collection1
[junit4:junit4]   2> 22617 T11 oasc.ZkController.createCollectionZkNode Check for collection zkNode:collection1
[junit4:junit4]   2> 22618 T11 oasc.ZkController.createCollectionZkNode Collection zkNode exists
[junit4:junit4]   2> 22618 T11 oasc.ZkController.readConfigName Load collection config from:/collections/collection1
[junit4:junit4]   2> 22620 T11 oasc.SolrResourceLoader.<init> new SolrResourceLoader for directory: '/usr/home/hudson/hudson-slave/workspace/Lucene-Solr-Tests-4.x-java7/solr/build/solr-core/test/J1/./solrtest-jetty4-1348388977784/collection1/'
[junit4:junit4]   2> 22622 T11 oasc.SolrResourceLoader.replaceClassLoader Adding 'file:/usr/home/hudson/hudson-slave/workspace/Lucene-Solr-Tests-4.x-java7/solr/build/solr-core/test/J1/solrtest-jetty4-1348388977784/collection1/lib/classes/' to classloader
[junit4:junit4]   2> 22622 T11 oasc.SolrResourceLoader.replaceClassLoader Adding 'file:/usr/home/hudson/hudson-slave/workspace/Lucene-Solr-Tests-4.x-java7/solr/build/solr-core/test/J1/solrtest-jetty4-1348388977784/collection1/lib/README' to classloader
[junit4:junit4]   2> 22749 T11 oasc.SolrConfig.<init> Using Lucene MatchVersion: LUCENE_41
[junit4:junit4]   2> 22789 T33 oascc.ZkStateReader.updateClusterState Updating cloud state from ZooKeeper... 
[junit4:junit4]   2> 22805 T46 oascc.ZkStateReader$2.process A cluster state change has occurred - updating...
[junit4:junit4]   2> 22806 T84 oascc.ZkStateReader$2.process A cluster state change has occurred - updating...
[junit4:junit4]   2> 22805 T32 oascc.ZkStateReader$2.process A cluster state change has occurred - updating...
[junit4:junit4]   2> 22805 T58 oascc.ZkStateReader$2.process A cluster state change has occurred - updating...
[junit4:junit4]   2> 22807 T70 oascc.ZkStateReader$2.process A cluster state change has occurred - updating...
[junit4:junit4]   2> 22892 T11 oasc.SolrConfig.<init> Loaded SolrConfig: solrconfig.xml
[junit4:junit4]   2> 22994 T11 oass.IndexSchema.readSchema Reading Solr Schema
[junit4:junit4]   2> 23047 T11 oass.IndexSchema.readSchema Schema name=test
[junit4:junit4]   2> ASYNC  NEW_CORE C1 name=collection1 org.apache.solr.core.SolrCore@50cb14aa url=http://127.0.0.1:21077/solr/collection1 node=127.0.0.1:21077_solr
[junit4:junit4]   2> 23744 T38 C1 P21077 REQ /get {distrib=false&qt=/get&wt=javabin&version=2&getVersions=100} status=0 QTime=92 
[junit4:junit4]   2> 24131 T11 oass.OpenExchangeRatesOrgProvider.init Initialized with rates=open-exchange-rates.json, refreshInterval=1440.
[junit4:junit4]   2> 24146 T11 oass.IndexSchema.readSchema default search field in schema is text
[junit4:junit4]   2> 24150 T11 oass.IndexSchema.readSchema unique key field: id
[junit4:junit4]   2> 24175 T11 oass.FileExchangeRateProvider.reload Reloading exchange rates from file currency.xml
[junit4:junit4]   2> 24193 T11 oass.FileExchangeRateProvider.reload Reloading exchange rates from file currency.xml
[junit4:junit4]   2> 24199 T11 oass.OpenExchangeRatesOrgProvider.reload Reloading exchange rates from open-exchange-rates.json
[junit4:junit4]   2> 24201 T11 oass.OpenExchangeRatesOrgProvider.reload Reloading exchange rates from open-exchange-rates.json
[junit4:junit4]   2> 24203 T11 oasc.SolrCore.<init> [collection1] Opening new SolrCore at /usr/home/hudson/hudson-slave/workspace/Lucene-Solr-Tests-4.x-java7/solr/build/solr-core/test/J1/./solrtest-jetty4-1348388977784/collection1/, dataDir=./org.apache.solr.cloud.BasicDistributedZk2Test-1348388955822/jetty4/
[junit4:junit4]   2> 24204 T11 oasc.JmxMonitoredMap.<init> JMX monitoring is enabled. Adding Solr mbeans to JMX Server: com.sun.jmx.mbeanserver.JmxMBeanServer@457a3972
[junit4:junit4]   2> 24205 T11 oasc.SolrCore.getNewIndexDir WARNING New index directory detected: old=null new=./org.apache.solr.cloud.BasicDistributedZk2Test-1348388955822/jetty4/index/
[junit4:junit4]   2> 24206 T11 oasc.SolrCore.initIndex WARNING [collection1] Solr index directory './org.apache.solr.cloud.BasicDistributedZk2Test-1348388955822/jetty4/index' doesn't exist. Creating new index...
[junit4:junit4]   2> 24207 T11 oasc.CachingDirectoryFactory.get return new directory for /usr/home/hudson/hudson-slave/workspace/Lucene-Solr-Tests-4.x-java7/solr/build/solr-core/test/J1/./org.apache.solr.cloud.BasicDistributedZk2Test-1348388955822/jetty4/index forceNew:false
[junit4:junit4]   2> 24214 T11 oasc.SolrDeletionPolicy.onCommit SolrDeletionPolicy.onCommit: commits:num=1
[junit4:junit4]   2> 		commit{dir=NRTCachingDirectory(org.apache.lucene.store.NIOFSDirectory@/usr/home/hudson/hudson-slave/workspace/Lucene-Solr-Tests-4.x-java7/solr/build/solr-core/test/J1/org.apache.solr.cloud.BasicDistributedZk2Test-1348388955822/jetty4/index lockFactory=org.apache.lucene.store.NativeFSLockFactory@3ff92c98; maxCacheMB=48.0 maxMergeSizeMB=4.0),segFN=segments_1,generation=1,filenames=[segments_1]
[junit4:junit4]   2> 24215 T11 oasc.SolrDeletionPolicy.updateCommits newest commit = 1
[junit4:junit4]   2> 24216 T11 oasc.SolrCore.initWriters created xml: solr.XMLResponseWriter
[junit4:junit4]   2> 24221 T11 oasup.UpdateRequestProcessorChain.init inserting DistributedUpdateProcessorFactory into updateRequestProcessorChain "dedupe"
[junit4:junit4]   2> 24221 T11 oasup.UpdateRequestProcessorChain.init inserting DistributedUpdateProcessorFactory into updateRequestProcessorChain "dedupe-allfields"
[junit4:junit4]   2> 24222 T11 oasup.UpdateRequestProcessorChain.init inserting DistributedUpdateProcessorFactory into updateRequestProcessorChain "stored_sig"
[junit4:junit4]   2> 24223 T11 oasup.UpdateRequestProcessorChain.init inserting DistributedUpdateProcessorFactory into updateRequestProcessorChain "uniq-fields"
[junit4:junit4]   2> 24224 T11 oasup.UpdateRequestProcessorChain.init inserting DistributedUpdateProcessorFactory into updateRequestProcessorChain "distrib-dup-test-chain-implicit"
[junit4:junit4]   2> 24224 T11 oasc.RequestHandlers.initHandlersFromConfig adding lazy requestHandler: solr.ReplicationHandler
[junit4:junit4]   2> 24225 T11 oasc.RequestHandlers.initHandlersFromConfig created /replication: solr.ReplicationHandler
[junit4:junit4]   2> 24226 T11 oasc.RequestHandlers.initHandlersFromConfig created standard: solr.StandardRequestHandler
[junit4:junit4]   2> 24227 T11 oasc.RequestHandlers.initHandlersFromConfig created /get: solr.RealTimeGetHandler
[junit4:junit4]   2> 24228 T11 oasc.RequestHandlers.initHandlersFromConfig created dismax: solr.SearchHandler
[junit4:junit4]   2> 24229 T11 oasc.RequestHandlers.initHandlersFromConfig created mock: org.apache.solr.core.MockQuerySenderListenerReqHandler
[junit4:junit4]   2> 24229 T11 oasc.RequestHandlers.initHandlersFromConfig created /admin/: org.apache.solr.handler.admin.AdminHandlers
[junit4:junit4]   2> 24230 T11 oasc.RequestHandlers.initHandlersFromConfig created defaults: solr.StandardRequestHandler
[junit4:junit4]   2> 24231 T11 oasc.RequestHandlers.initHandlersFromConfig adding lazy requestHandler: solr.StandardRequestHandler
[junit4:junit4]   2> 24232 T11 oasc.RequestHandlers.initHandlersFromConfig created lazy: solr.StandardRequestHandler
[junit4:junit4]   2> 24232 T11 oasc.RequestHandlers.initHandlersFromConfig created /update: solr.UpdateRequestHandler
[junit4:junit4]   2> 24233 T11 oasc.RequestHandlers.initHandlersFromConfig created /terms: org.apache.solr.handler.component.SearchHandler
[junit4:junit4]   2> 24234 T11 oasc.RequestHandlers.initHandlersFromConfig created spellCheckCompRH: org.apache.solr.handler.component.SearchHandler
[junit4:junit4]   2> 24235 T11 oasc.RequestHandlers.initHandlersFromConfig created spellCheckCompRH_Direct: org.apache.solr.handler.component.SearchHandler
[junit4:junit4]   2> 24236 T11 oasc.RequestHandlers.initHandlersFromConfig created spellCheckWithWordbreak: org.apache.solr.handler.component.SearchHandler
[junit4:junit4]   2> 24237 T11 oasc.RequestHandlers.initHandlersFromConfig created spellCheckWithWordbreak_Direct: org.apache.solr.handler.component.SearchHandler
[junit4:junit4]   2> 24238 T11 oasc.RequestHandlers.initHandlersFromConfig created spellCheckCompRH1: org.apache.solr.handler.component.SearchHandler
[junit4:junit4]   2> 24239 T11 oasc.RequestHandlers.initHandlersFromConfig created tvrh: org.apache.solr.handler.component.SearchHandler
[junit4:junit4]   2> 24240 T11 oasc.RequestHandlers.initHandlersFromConfig created /mlt: solr.MoreLikeThisHandler
[junit4:junit4]   2> 24240 T11 oasc.RequestHandlers.initHandlersFromConfig created /debug/dump: solr.DumpRequestHandler
[junit4:junit4]   2> 24244 T11 oashl.XMLLoader.init xsltCacheLifetimeSeconds=60
[junit4:junit4]   2> 24249 T11 oasc.SolrCore.initDeprecatedSupport WARNING solrconfig.xml uses deprecated <admin/gettableFiles>, Please update your config to use the ShowFileRequestHandler.
[junit4:junit4]   2> 24251 T11 oasc.SolrCore.initDeprecatedSupport WARNING adding ShowFileRequestHandler with hidden files: [SCHEMA.XML, OLD_SYNONYMS.TXT, STOPWORDS.TXT, PROTWORDS.TXT, OPEN-EXCHANGE-RATES.JSON, SYNONYMS.TXT, CURRENCY.XML, MAPPING-ISOLATIN1ACCENT.TXT]
[junit4:junit4]   2> 24255 T11 oass.SolrIndexSearcher.<init> Opening Searcher@5c1f3d98 main
[junit4:junit4]   2> 24256 T11 oasu.CommitTracker.<init> Hard AutoCommit: disabled
[junit4:junit4]   2> 24257 T11 oasu.CommitTracker.<init> Soft AutoCommit: disabled
[junit4:junit4]   2> 24258 T11 oashc.SpellCheckComponent.inform Initializing spell checkers
[junit4:junit4]   2> 24266 T11 oass.DirectSolrSpellChecker.init init: {name=direct,classname=DirectSolrSpellChecker,field=lowerfilt,minQueryLength=3}
[junit4:junit4]   2> 24318 T85 oasc.SolrCore.registerSearcher [collection1] Registered new searcher Searcher@5c1f3d98 main{StandardDirectoryReader(segments_1:1)}
[junit4:junit4]   2> 24336 T33 oascc.ZkStateReader.updateClusterState Updating cloud state from ZooKeeper... 
[junit4:junit4]   2> 24348 T46 oascc.ZkStateReader$2.process A cluster state change has occurred - updating...
[junit4:junit4]   2> 24348 T84 oascc.ZkStateReader$2.process A cluster state change has occurred - updating...
[junit4:junit4]   2> 24348 T70 oascc.ZkStateReader$2.process A cluster state change has occurred - updating...
[junit4:junit4]   2> 24348 T32 oascc.ZkStateReader$2.process A cluster state change has occurred - updating...
[junit4:junit4]   2> 24348 T58 oascc.ZkStateReader$2.process A cluster state change has occurred - updating...
[junit4:junit4]   2> 24831 T11 oasc.CoreContainer.register registering core: collection1
[junit4:junit4]   2> 24831 T11 oasc.ZkController.register Register shard - core:collection1 address:http://127.0.0.1:12432/solr shardId:shard2
[junit4:junit4]   2> 24836 T11 oasc.ZkController.register We are http://127.0.0.1:12432/solr/collection1/ and leader is http://127.0.0.1:29088/solr/collection1/
[junit4:junit4]   2> 24836 T11 oasc.ZkController.register No LogReplay needed for core=collection1 baseURL=http://127.0.0.1:12432/solr
[junit4:junit4]   2> 24837 T11 oasc.ZkController.checkRecovery Core needs to recover:collection1
[junit4:junit4]   2> 24837 T11 oasu.DefaultSolrCoreState.doRecovery Running recovery - first canceling any ongoing recovery
[junit4:junit4]   2> ASYNC  NEW_CORE C2 name=collection1 org.apache.solr.core.SolrCore@90c8bbb url=http://127.0.0.1:12432/solr/collection1 node=127.0.0.1:12432_solr
[junit4:junit4]   2> 24838 T86 C2 P12432 oasc.RecoveryStrategy.run Starting recovery process.  core=collection1 recoveringAfterStartup=true
[junit4:junit4]   2> 24838 T11 oascc.ZkStateReader.updateClusterState Updating cloud state from ZooKeeper... 
[junit4:junit4]   2> 24839 T86 C2 P12432 oasc.RecoveryStrategy.doRecovery ###### startupVersions=[]
[junit4:junit4]   2> 24840 T11 oass.SolrDispatchFilter.init user.dir=/usr/home/hudson/hudson-slave/workspace/Lucene-Solr-Tests-4.x-java7/solr/build/solr-core/test/J1
[junit4:junit4]   2> 24840 T11 oass.SolrDispatchFilter.init SolrDispatchFilter.init() done
[junit4:junit4]   2> 24840 T86 C2 P12432 oasc.RecoveryStrategy.doRecovery Attempting to PeerSync from http://127.0.0.1:29088/solr/collection1/ core=collection1 - recoveringAfterStartup=true
[junit4:junit4]   2> 24841 T86 C2 P12432 oasu.PeerSync.sync PeerSync: core=collection1 url=http://127.0.0.1:12432/solr START replicas=[http://127.0.0.1:29088/solr/collection1/] nUpdates=100
[junit4:junit4]   2> 24841 T11 oascsi.HttpClientUtil.createClient Creating new http client, config:maxConnections=128&maxConnectionsPerHost=32&followRedirects=false
[junit4:junit4]   2> 24842 T86 C2 P12432 oasu.PeerSync.sync WARNING no frame of reference to tell of we've missed updates
[junit4:junit4]   2> 24842 T86 C2 P12432 oasc.RecoveryStrategy.doRecovery PeerSync Recovery was not successful - trying replication. core=collection1
[junit4:junit4]   2> 24842 T86 C2 P12432 oasc.RecoveryStrategy.doRecovery Starting Replication Recovery. core=collection1
[junit4:junit4]   2> 24843 T86 C2 P12432 oascsi.HttpClientUtil.createClient Creating new http client, config:maxConnections=128&maxConnectionsPerHost=32&followRedirects=false
[junit4:junit4]   2> ASYNC  NEW_CORE C3 name=collection1 org.apache.solr.core.SolrCore@d65f546 url=http://127.0.0.1:29088/solr/collection1 node=127.0.0.1:29088_solr
[junit4:junit4]   2> 24850 T50 C3 P29088 REQ /get {distrib=false&qt=/get&wt=javabin&version=2&getVersions=100} status=0 QTime=0 
[junit4:junit4]   2> 24855 T33 oascc.ZkStateReader.updateClusterState Updating cloud state from ZooKeeper... 
[junit4:junit4]   2> 24869 T11 oaz.ZooKeeper.<init> Initiating client connection, connectString=127.0.0.1:27313/solr sessionTimeout=10000 watcher=org.apache.solr.common.cloud.ConnectionManager@282e6ef4
[junit4:junit4]   2> 24871 T88 oaz.ClientCnxn$SendThread.startConnect Opening socket connection to server /127.0.0.1:27313
[junit4:junit4]   2> 24871 T11 oascc.ConnectionManager.waitForConnected Waiting for client to connect to ZooKeeper
[junit4:junit4]   2> 24872 T88 oaz.ClientCnxn$SendThread.primeConnection Socket connection established to localhost/127.0.0.1:27313, initiating session
[junit4:junit4]   2> 24873 T13 oazs.NIOServerCnxn$Factory.run Accepted socket connection from /140.211.11.196:54838
[junit4:junit4]   2> 24873 T84 oascc.ZkStateReader$2.process A cluster state change has occurred - updating...
[junit4:junit4]   2> 24873 T32 oascc.ZkStateReader$2.process A cluster state change has occurred - updating...
[junit4:junit4]   2> 24873 T13 oazs.NIOServerCnxn.readConnectRequest Client attempting to establish new session at /140.211.11.196:54838
[junit4:junit4]   2> 24873 T70 oascc.ZkStateReader$2.process A cluster state change has occurred - updating...
[junit4:junit4]   2> 24873 T58 oascc.ZkStateReader$2.process A cluster state change has occurred - updating...
[junit4:junit4]   2> 24873 T46 oascc.ZkStateReader$2.process A cluster state change has occurred - updating...
[junit4:junit4]   2> 24876 T16 oazs.NIOServerCnxn.finishSessionInit Established session 0x139f23ea8d50007 with negotiated timeout 10000 for client /140.211.11.196:54838
[junit4:junit4]   2> 24876 T88 oaz.ClientCnxn$SendThread.readConnectResult Session establishment complete on server localhost/127.0.0.1:27313, sessionid = 0x139f23ea8d50007, negotiated timeout = 10000
[junit4:junit4]   2> 24877 T89 oascc.ConnectionManager.process Watcher org.apache.solr.common.cloud.ConnectionManager@282e6ef4 name:ZooKeeperConnection Watcher:127.0.0.1:27313/solr got event WatchedEvent state:SyncConnected type:None path:null path:null type:None
[junit4:junit4]   2> 24877 T11 oascc.ConnectionManager.waitForConnected Client is connected to ZooKeeper
[junit4:junit4]   2> 24879 T11 oascc.ZkStateReader.createClusterStateWatchersAndUpdate Updating cluster state from ZooKeeper... 
[junit4:junit4]   2> 24883 T11 oasc.ChaosMonkey.monkeyLog monkey: init - expire sessions:true cause connection loss:true
[junit4:junit4]   2> 24884 T11 oascsi.HttpClientUtil.createClient Creating new http client, config:
[junit4:junit4]   2> 24895 T11 oascc.ZkStateReader.updateClusterState Updating cloud state from ZooKeeper... 
[junit4:junit4]   2> ASYNC  NEW_CORE C4 name=collection1 org.apache.solr.core.SolrCore@7eb6ec07 url=http://127.0.0.1:14990/solr/collection1 node=127.0.0.1:14990_solr
[junit4:junit4]   2> 24978 T24 C4 P14990 oascsi.HttpClientUtil.createClient Creating new http client, config:maxConnections=500&maxConnectionsPerHost=16
[junit4:junit4]   2> 25262 T24 C4 P14990 oasc.SolrDeletionPolicy.onInit SolrDeletionPolicy.onInit: commits:num=1
[junit4:junit4]   2> 		commit{dir=NRTCachingDirectory(org.apache.lucene.store.NIOFSDirectory@/usr/home/hudson/hudson-slave/workspace/Lucene-Solr-Tests-4.x-java7/solr/build/solr-core/test/J1/org.apache.solr.cloud.BasicDistributedZk2Test-1348388955822/control/data/index lockFactory=org.apache.lucene.store.NativeFSLockFactory@6771a12; maxCacheMB=48.0 maxMergeSizeMB=4.0),segFN=segments_1,generation=1,filenames=[segments_1]
[junit4:junit4]   2> 25263 T24 C4 P14990 oasc.SolrDeletionPolicy.updateCommits newest commit = 1
[junit4:junit4]   2> 25493 T24 C4 P14990 /update {wt=javabin&version=2} {add=[1 (1413888323875766272)]} 0 530
[junit4:junit4]   2> 25494 T11 oaz.ZooKeeper.<init> Initiating client connection, connectString=127.0.0.1:27313/solr sessionTimeout=10000 watcher=org.apache.solr.common.cloud.ConnectionManager@b684fed
[junit4:junit4]   2> 25495 T11 oascc.ConnectionManager.waitForConnected Waiting for client to connect to ZooKeeper
[junit4:junit4]   2> 25495 T90 oaz.ClientCnxn$SendThread.startConnect Opening socket connection to server /127.0.0.1:27313
[junit4:junit4]   2> 25498 T90 oaz.ClientCnxn$SendThread.primeConnection Socket connection established to localhost/127.0.0.1:27313, initiating session
[junit4:junit4]   2> 25498 T13 oazs.NIOServerCnxn$Factory.run Accepted socket connection from /140.211.11.196:17788
[junit4:junit4]   2> 25499 T13 oazs.NIOServerCnxn.readConnectRequest Client attempting to establish new session at /140.211.11.196:17788
[junit4:junit4]   2> 25500 T16 oazs.NIOServerCnxn.finishSessionInit Established session 0x139f23ea8d50008 with negotiated timeout 10000 for client /140.211.11.196:17788
[junit4:junit4]   2> 25501 T90 oaz.ClientCnxn$SendThread.readConnectResult Session establishment complete on server localhost/127.0.0.1:27313, sessionid = 0x139f23ea8d50008, negotiated timeout = 10000
[junit4:junit4]   2> 25501 T91 oascc.ConnectionManager.process Watcher org.apache.solr.common.cloud.ConnectionManager@b684fed name:ZooKeeperConnection Watcher:127.0.0.1:27313/solr got event WatchedEvent state:SyncConnected type:None path:null path:null type:None
[junit4:junit4]   2> 25502 T11 oascc.ConnectionManager.waitForConnected Client is connected to ZooKeeper
[junit4:junit4]   2> 25503 T11 oascc.ZkStateReader.createClusterStateWatchersAndUpdate Updating cluster state from ZooKeeper... 
[junit4:junit4]   2> 25535 T40 C1 P21077 oasc.SolrDeletionPolicy.onInit SolrDeletionPolicy.onInit: commits:num=1
[junit4:junit4]   2> 		commit{dir=NRTCachingDirectory(org.apache.lucene.store.NIOFSDirectory@/usr/home/hudson/hudson-slave/workspace/Lucene-Solr-Tests-4.x-java7/solr/build/solr-core/test/J1/org.apache.solr.cloud.BasicDistributedZk2Test-1348388955822/jetty1/index lockFactory=org.apache.lucene.store.NativeFSLockFactory@b89a81a; maxCacheMB=48.0 maxMergeSizeMB=4.0),segFN=segments_1,generation=1,filenames=[segments_1]
[junit4:junit4]   2> 25536 T40 C1 P21077 oasc.SolrDeletionPolicy.updateCommits newest commit = 1
[junit4:junit4]   2>  C0_STATE=coll:collection1 core:collection1 props:{shard=shard1, roles=null, state=recovering, core=collection1, collection=collection1, node_name=127.0.0.1:20394_solr, base_url=http://127.0.0.1:20394/solr}
[junit4:junit4]   2> 25615 T62 C0 P20394 oasc.SolrDeletionPolicy.onInit SolrDeletionPolicy.onInit: commits:num=1
[junit4:junit4]   2> 		commit{dir=NRTCachingDirectory(org.apache.lucene.store.NIOFSDirectory@/usr/home/hudson/hudson-slave/workspace/Lucene-Solr-Tests-4.x-java7/solr/build/solr-core/test/J1/org.apache.solr.cloud.BasicDistributedZk2Test-1348388955822/jetty3/index lockFactory=org.apache.lucene.store.NativeFSLockFactory@1e1d1e05; maxCacheMB=48.0 maxMergeSizeMB=4.0),segFN=segments_1,generation=1,filenames=[segments_1]
[junit4:junit4]   2> 25616 T62 C0 P20394 oasc.SolrDeletionPolicy.updateCommits newest commit = 1
[junit4:junit4]   2> 25628 T62 C0 P20394 REQ /update {distrib.from=http://127.0.0.1:21077/solr/collection1/&update.distrib=FROMLEADER&wt=javabin&version=2} status=0 QTime=20 
[junit4:junit4]   2> 25630 T40 C1 P21077 /update {wt=javabin&version=2} {add=[1 (1413888324162027520)]} 0 114
[junit4:junit4]   2> 25631 T11 oasc.AbstractDistribZkTestBase.waitForRecoveriesToFinish Wait for recoveries to finish - collection: collection1 failOnTimeout:true timeout (sec):1800
[junit4:junit4]   2> 25633 T11 oascc.ZkStateReader.updateClusterState Updating cloud state from ZooKeeper... 
[junit4:junit4]   2> 25905 T72 C0 P20394 oasc.RecoveryStrategy.doRecovery Begin buffering updates. core=collection1
[junit4:junit4]   2> 25905 T72 C0 P20394 oasu.UpdateLog.bufferUpdates Starting to buffer updates. FSUpdateLog{state=ACTIVE, tlog=tlog{file=./org.apache.solr.cloud.BasicDistributedZk2Test-1348388955822/jetty3/tlog/tlog.0000000000000000000 refcount=1}}
[junit4:junit4]   2> 25906 T72 C0 P20394 oasc.RecoveryStrategy.replicate Attempting to replicate from http://127.0.0.1:21077/solr/collection1/. core=collection1
[junit4:junit4]   2> 25907 T72 C0 P20394 oascsi.HttpClientUtil.createClient Creating new http client, config:maxConnections=128&maxConnectionsPerHost=32&followRedirects=false
[junit4:junit4]   2> 25939 T41 C1 P21077 oasu.DirectUpdateHandler2.commit start commit{flags=0,_version_=0,optimize=false,openSearcher=true,waitSearcher=true,expungeDeletes=false,softCommit=false}
[junit4:junit4]   2> 26113 T41 C1 P21077 oasc.SolrDeletionPolicy.onCommit SolrDeletionPolicy.onCommit: commits:num=2
[junit4:junit4]   2> 		commit{dir=NRTCachingDirectory(org.apache.lucene.store.NIOFSDirectory@/usr/home/hudson/hudson-slave/workspace/Lucene-Solr-Tests-4.x-java7/solr/build/solr-core/test/J1/org.apache.solr.cloud.BasicDistributedZk2Test-1348388955822/jetty1/index lockFactory=org.apache.lucene.store.NativeFSLockFactory@b89a81a; maxCacheMB=48.0 maxMergeSizeMB=4.0),segFN=segments_1,generation=1,filenames=[segments_1]
[junit4:junit4]   2> 		commit{dir=NRTCachingDirectory(org.apache.lucene.store.NIOFSDirectory@/usr/home/hudson/hudson-slave/workspace/Lucene-Solr-Tests-4.x-java7/solr/build/solr-core/test/J1/org.apache.solr.cloud.BasicDistributedZk2Test-1348388955822/jetty1/index lockFactory=org.apache.lucene.store.NativeFSLockFactory@b89a81a; maxCacheMB=48.0 maxMergeSizeMB=4.0),segFN=segments_2,generation=2,filenames=[_0_1.len, _0_6.len, _0_7.len, _0_11.len, _0.pst, _0.fld, _0_4.len, _0_3.len, _0_9.len, segments_2, _0_22.len, _0_23.len, _0.inf, _0.si, _0_19.len, _0_20.len]
[junit4:junit4]   2> 26114 T41 C1 P21077 oasc.SolrDeletionPolicy.updateCommits newest commit = 2
[junit4:junit4]   2> 26176 T41 C1 P21077 oass.SolrIndexSearcher.<init> Opening Searcher@2795cc92 main
[junit4:junit4]   2> 26181 T41 C1 P21077 oasu.DirectUpdateHandler2.commit end_commit_flush
[junit4:junit4]   2> 26191 T47 oasc.SolrCore.registerSearcher [collection1] Registered new searcher Searcher@2795cc92 main{StandardDirectoryReader(segments_2:3 _0(4.1):C1)}
[junit4:junit4]   2> 26193 T41 C1 P21077 /update {waitSearcher=true&commit=true&commit_end_point=true&wt=javabin&softCommit=false&version=2} {commit=} 0 257
[junit4:junit4]   2> 26257 T72 C0 P20394 oash.ReplicationHandler.inform Commits will be reserved for  10000
[junit4:junit4]   2> 26258 T72 C0 P20394 oascsi.HttpClientUtil.createClient Creating new http client, config:connTimeout=5000&socketTimeout=20000&allowCompression=false&maxConnections=10000&maxConnectionsPerHost=10000
[junit4:junit4]   2> 26290 T72 C0 P20394 oash.SnapPuller.<init>  No value set for 'pollInterval'. Timer Task not started.
[junit4:junit4]   2> 26332 T42 C1 P21077 oash.ReplicationHandler.inform Commits will be reserved for  10000
[junit4:junit4]   2> 26332 T42 C1 P21077 REQ /replication {command=indexversion&wt=javabin&qt=/replication&version=2} status=0 QTime=39 
[junit4:junit4]   2> 26334 T72 C0 P20394 oash.SnapPuller.fetchLatestIndex Master's generation: 2
[junit4:junit4]   2> 26335 T72 C0 P20394 oash.SnapPuller.fetchLatestIndex Slave's generation: 1
[junit4:junit4]   2> 26335 T72 C0 P20394 oash.SnapPuller.fetchLatestIndex Starting replication process
[junit4:junit4]   2> 26345 T42 C1 P21077 REQ /replication {command=filelist&generation=2&wt=javabin&qt=/replication&version=2} status=0 QTime=6 
[junit4:junit4]   2> 26347 T72 C0 P20394 oash.SnapPuller.fetchLatestIndex Number of files in latest index in master: 16
[junit4:junit4]   2> 26351 T72 C0 P20394 oash.SnapPuller.fetchLatestIndex Starting download to ./org.apache.solr.cloud.BasicDistributedZk2Test-1348388955822/jetty3/index.20120923112941838 fullCopy=true
[junit4:junit4]   2> 26366 T42 C1 P21077 REQ /replication {file=_0_1.len&command=filecontent&checksum=true&generation=2&qt=/replication&wt=filestream} status=0 QTime=8 
[junit4:junit4]   2> 26382 T42 C1 P21077 REQ /replication {file=_0_6.len&command=filecontent&checksum=true&generation=2&qt=/replication&wt=filestream} status=0 QTime=0 
[junit4:junit4]   2> 26388 T42 C1 P21077 REQ /replication {file=_0_7.len&command=filecontent&checksum=true&generation=2&qt=/replication&wt=filestream} status=0 QTime=1 
[junit4:junit4]   2> 26395 T42 C1 P21077 REQ /replication {file=_0_11.len&command=filecontent&checksum=true&generation=2&qt=/replication&wt=filestream} status=0 QTime=0 
[junit4:junit4]   2> 26401 T42 C1 P21077 REQ /replication {file=_0.pst&command=filecontent&checksum=true&generation=2&qt=/replication&wt=filestream} status=0 QTime=1 
[junit4:junit4]   2> 26407 T42 C1 P21077 REQ /replication {file=_0.fld&command=filecontent&checksum=true&generation=2&qt=/replication&wt=filestream} status=0 QTime=1 
[junit4:junit4]   2> 26412 T42 C1 P21077 REQ /replication {file=_0_4.len&command=filecontent&checksum=true&generation=2&qt=/replication&wt=filestream} status=0 QTime=1 
[junit4:junit4]   2> 26417 T42 C1 P21077 REQ /replication {file=_0_9.len&command=filecontent&checksum=true&generation=2&qt=/replication&wt=filestream} status=0 QTime=0 
[junit4:junit4]   2> 26425 T42 C1 P21077 REQ /replication {file=_0_3.len&command=filecontent&checksum=true&generation=2&qt=/replication&wt=filestream} status=0 QTime=1 
[junit4:junit4]   2> 26431 T42 C1 P21077 REQ /replication {file=_0_22.len&command=filecontent&checksum=true&generation=2&qt=/replication&wt=filestream} status=0 QTime=1 
[junit4:junit4]   2> 26437 T42 C1 P21077 REQ /replication {file=segments_2&command=filecontent&checksum=true&generation=2&qt=/replication&wt=filestream} status=0 QTime=0 
[junit4:junit4]   2> 26444 T42 C1 P21077 REQ /replication {file=_0.inf&command=filecontent&checksum=true&generation=2&qt=/replication&wt=filestream} status=0 QTime=1 
[junit4:junit4]   2> 26462 T42 C1 P21077 REQ /replication {file=_0_23.len&command=filecontent&checksum=true&generation=2&qt=/replication&wt=filestream} status=0 QTime=1 
[junit4:junit4]   2> 26466 T42 C1 P21077 REQ /replication {file=_0.si&command=filecontent&checksum=true&generation=2&qt=/replication&wt=filestream} status=0 QTime=0 
[junit4:junit4]   2> 26471 T42 C1 P21077 REQ /replication {file=_0_19.len&command=filecontent&checksum=true&generation=2&qt=/replication&wt=filestream} status=0 QTime=0 
[junit4:junit4]   2> 26484 T42 C1 P21077 REQ /replication {file=_0_20.len&command=filecontent&checksum=true&generation=2&qt=/replication&wt=filestream} status=0 QTime=0 
[junit4:junit4]   2> 26486 T72 C0 P20394 oash.SnapPuller.fetchLatestIndex Total time taken for download : 0 secs
[junit4:junit4]   2> 26498 T72 C0 P20394 oash.SnapPuller.modifyIndexProps New index installed. Updating index properties... index=index.20120923112941838
[junit4:junit4]   2> 26512 T72 C0 P20394 oasu.DefaultSolrCoreState.newIndexWriter Creating new IndexWriter...
[junit4:junit4]   2> 26512 T72 C0 P20394 oasu.DefaultSolrCoreState.newIndexWriter Waiting until IndexWriter is unused... core=collection1
[junit4:junit4]   2> 26513 T72 C0 P20394 oasu.DefaultSolrCoreState.newIndexWriter Rollback old IndexWriter... core=collection1
[junit4:junit4]   2> 26517 T72 C0 P20394 oasc.SolrCore.getNewIndexDir WARNING New index directory detected: old=./org.apache.solr.cloud.BasicDistributedZk2Test-1348388955822/jetty3/index/ new=./org.apache.solr.cloud.BasicDistributedZk2Test-1348388955822/jetty3/index.20120923112941838
[junit4:junit4]   2> 26518 T72 C0 P20394 oasc.CachingDirectoryFactory.get return new directory for /usr/home/hudson/hudson-slave/workspace/Lucene-Solr-Tests-4.x-java7/solr/build/solr-core/test/J1/./org.apache.solr.cloud.BasicDistributedZk2Test-1348388955822/jetty3/index.20120923112941838 forceNew:true
[junit4:junit4]   2> 26532 T72 C0 P20394 oasc.SolrDeletionPolicy.onInit SolrDeletionPolicy.onInit: commits:num=1
[junit4:junit4]   2> 		commit{dir=NRTCachingDirectory(org.apache.lucene.store.NIOFSDirectory@/usr/home/hudson/hudson-slave/workspace/Lucene-Solr-Tests-4.x-java7/solr/build/solr-core/test/J1/org.apache.solr.cloud.BasicDistributedZk2Test-1348388955822/jetty3/index.20120923112941838 lockFactory=org.apache.lucene.store.NativeFSLockFactory@5ef21bc4; maxCacheMB=48.0 maxMergeSizeMB=4.0),segFN=segments_2,generation=2,filenames=[_0_1.len, _0_6.len, _0_7.len, _0_11.len, _0.pst, _0.fld, _0_4.len, _0_3.len, _0_9.len, segments_2, _0_22.len, _0_23.len, _0.inf, _0.si, _0_19.len, _0_20.len]
[junit4:junit4]   2> 26533 T72 C0 P20394 oasc.SolrDeletionPolicy.updateCommits newest commit = 2
[junit4:junit4]   2> 26533 T72 C0 P20394 oasu.DefaultSolrCoreState.newIndexWriter New IndexWriter is ready to be used.
[junit4:junit4]   2> 26552 T72 C0 P20394 oass.SolrIndexSearcher.<init> Opening Searcher@39757f47 main
[junit4:junit4]   2> 26556 T71 oasc.SolrCore.registerSearcher [collection1] Registered new searcher Searcher@39757f47 main{StandardDirectoryReader(segments_2:3:nrt _0(4.1):C1)}
[junit4:junit4]   2> 26557 T71 oasc.CachingDirectoryFactory.close Closing directory:/usr/home/hudson/hudson-slave/workspace/Lucene-Solr-Tests-4.x-java7/solr/build/solr-core/test/J1/./org.apache.solr.cloud.BasicDistributedZk2Test-1348388955822/jetty3/index
[junit4:junit4]   2> 26558 T71 oash.SnapPuller$2.onClose removing old index directory ./org.apache.solr.cloud.BasicDistributedZk2Test-1348388955822/jetty3/index
[junit4:junit4]   2> 26559 T72 C0 P20394 oasu.DirectUpdateHandler2.commit start commit{flags=0,_version_=0,optimize=false,openSearcher=false,waitSearcher=false,expungeDeletes=false,softCommit=false}
[junit4:junit4]   2> 26561 T72 C0 P20394 oasu.DirectUpdateHandler2.commit end_commit_flush
[junit4:junit4]   2> 26569 T72 C0 P20394 oasc.RecoveryStrategy.replay Replaying buffered documents. core=collection1
[junit4:junit4]   2> 26569 T94 C0 P20394 oasu.UpdateLog$LogReplayer.doReplay WARNING Starting log replay tlog{file=./org.apache.solr.cloud.BasicDistributedZk2Test-1348388955822/jetty3/tlog/tlog.0000000000000000000 refcount=2} active=true starting pos=433
[junit4:junit4]   2> 26573 T94 C0 P20394 oasu.DirectUpdateHandler2.commit start commit{flags=2,_version_=0,optimize=false,openSearcher=true,waitSearcher=true,expungeDeletes=false,softCommit=false}
[junit4:junit4]   2> 26575 T94 C0 P20394 oass.SolrIndexSearcher.<init> Opening Searcher@56e1333c main
[junit4:junit4]   2> 26577 T94 C0 P20394 oasu.DirectUpdateHandler2.commit end_commit_flush
[junit4:junit4]   2> 26580 T71 oasc.SolrCore.registerSearcher [collection1] Registered new searcher Searcher@56e1333c main{StandardDirectoryReader(segments_2:3:nrt _0(4.1):C1)}
[junit4:junit4]   2> 26581 T94 C0 P20394 oasu.UpdateLog$LogReplayer.run WARNING Log replay finished. recoveryInfo=RecoveryInfo{adds=0 deletes=0 deleteByQuery=0 errors=0 positionOfStart=433}
[junit4:junit4]   2> 26581 T72 C0 P20394 oasc.RecoveryStrategy.doRecovery Replication Recovery was successful - registering as Active. core=collection1
[junit4:junit4]   2> 26584 T72 C0 P20394 oasc.RecoveryStrategy.doRecovery Finished recovery process. core=collection1
[junit4:junit4]   2> 26636 T11 oascc.ZkStateReader.updateClusterState Updating cloud state from ZooKeeper... 
[junit4:junit4]   2> 26891 T33 oascc.ZkStateReader.updateClusterState Updating cloud state from ZooKeeper... 
[junit4:junit4]   2> 26908 T70 oascc.ZkStateReader$2.process A cluster state change has occurred - updating...
[junit4:junit4]   2> 26908 T46 oascc.ZkStateReader$2.process A cluster state change has occurred - updating...
[junit4:junit4]   2> 26908 T91 oascc.ZkStateReader$2.process A cluster state change has occurred - updating...
[junit4:junit4]   2> 26908 T32 oascc.ZkStateReader$2.process A cluster state change has occurred - updating...
[junit4:junit4]   2> 26909 T84 oascc.ZkStateReader$2.process A cluster state change has occurred - updating...
[junit4:junit4]   2> 26908 T58 oascc.ZkStateReader$2.process A cluster state change has occurred - updating...
[junit4:junit4]   2> 26908 T89 oascc.ZkStateReader$2.process A cluster state change has occurred - updating...
[junit4:junit4]   2> 27639 T11 oascc.ZkStateReader.updateClusterState Updating cloud state from ZooKeeper... 
[junit4:junit4]   2>  C2_STATE=coll:collection1 core:collection1 props:{shard=shard2, roles=null, state=recovering, core=collection1, collection=collection1, node_name=127.0.0.1:12432_solr, base_url=http://127.0.0.1:12432/solr}
[junit4:junit4]   2> 27867 T86 C2 P12432 oasc.RecoveryStrategy.doRecovery Begin buffering updates. core=collection1
[junit4:junit4]   2> 27867 T86 C2 P12432 oasu.UpdateLog.bufferUpdates Starting to buffer updates. FSUpdateLog{state=ACTIVE, tlog=null}
[junit4:junit4]   2> 27868 T86 C2 P12432 oasc.RecoveryStrategy.replicate Attempting to replicate from http://127.0.0.1:29088/solr/collection1/. core=collection1
[junit4:junit4]   2> 27869 T86 C2 P12432 oascsi.HttpClientUtil.createClient Creating new http client, config:maxConnections=128&maxConnectionsPerHost=32&followRedirects=false
[junit4:junit4]   2> 27891 T52 C3 P29088 oasu.DirectUpdateHandler2.commit start commit{flags=0,_version_=0,optimize=false,openSearcher=true,waitSearcher=true,expungeDeletes=false,softCommit=false}
[junit4:junit4]   2> 27896 T52 C3 P29088 oasc.SolrDeletionPolicy.onInit SolrDeletionPolicy.onInit: commits:num=1
[junit4:junit4]   2> 		commit{dir=NRTCachingDirectory(org.apache.lucene.store.NIOFSDirectory@/usr/home/hudson/hudson-slave/workspace/Lucene-Solr-Tests-4.x-java7/solr/build/solr-core/test/J1/org.apache.solr.cloud.BasicDistributedZk2Test-1348388955822/jetty2/index lockFactory=org.apache.lucene.store.NativeFSLockFactory@46dcac12; maxCacheMB=48.0 maxMergeSizeMB=4.0),segFN=segments_1,generation=1,filenames=[segments_1]
[junit4:junit4]   2> 27897 T52 C3 P29088 oasc.SolrDeletionPolicy.updateCommits newest commit = 1
[junit4:junit4]   2> 27900 T52 C3 P29088 oass.SolrIndexSearcher.<init> Opening Searcher@4f0504f3 main
[junit4:junit4]   2> 27901 T52 C3 P29088 oasu.DirectUpdateHandler2.commit end_commit_flush
[junit4:junit4]   2> 27905 T59 oasc.SolrCore.registerSearcher [collection1] Registered new searcher Searcher@4f0504f3 main{StandardDirectoryReader(segments_1:1)}
[junit4:junit4]   2> 27906 T52 C3 P29088 /update {waitSearcher=true&commit=true&commit_end_point=true&wt=javabin&softCommit=false&version=2} {commit=} 0 16
[junit4:junit4]   2> 27908 T86 C2 P12432 oash.ReplicationHandler.inform Commits will be reserved for  10000
[junit4:junit4]   2> 27909 T86 C2 P12432 oash.SnapPuller.<init>  No value set for 'pollInterval'. Timer Task not started.
[junit4:junit4]   2> 27912 T53 C3 P29088 oash.ReplicationHandler.inform Commits will be reserved for  10000
[junit4:junit4]   2> 27913 T53 C3 P29088 REQ /replication {command=indexversion&wt=javabin&qt=/replication&version=2} status=0 QTime=2 
[junit4:junit4]   2> 27919 T86 C2 P12432 oasc.SolrDeletionPolicy.onInit SolrDeletionPolicy.onInit: commits:num=1
[junit4:junit4]   2> 		commit{dir=NRTCachingDirectory(org.apache.lucene.store.NIOFSDirectory@/usr/home/hudson/hudson-slave/workspace/Lucene-Solr-Tests-4.x-java7/solr/build/solr-core/test/J1/org.apache.solr.cloud.BasicDistributedZk2Test-1348388955822/jetty4/index lockFactory=org.apache.lucene.store.NativeFSLockFactory@3ff92c98; maxCacheMB=48.0 maxMergeSizeMB=4.0),segFN=segments_1,generation=1,filenames=[segments_1]
[junit4:junit4]   2> 27920 T86 C2 P12432 oasc.SolrDeletionPolicy.updateCommits newest commit = 1
[junit4:junit4]   2> 27921 T86 C2 P12432 oasu.DirectUpdateHandler2.commit start commit{flags=0,_version_=0,optimize=false,openSearcher=true,waitSearcher=true,expungeDeletes=false,softCommit=false}
[junit4:junit4]   2> 27955 T86 C2 P12432 oasc.SolrDeletionPolicy.onCommit SolrDeletionPolicy.onCommit: commits:num=2
[junit4:junit4]   2> 		commit{dir=NRTCachingDirectory(org.apache.lucene.store.NIOFSDirectory@/usr/home/hudson/hudson-slave/workspace/Lucene-Solr-Tests-4.x-java7/solr/build/solr-core/test/J1/org.apache.solr.cloud.BasicDistributedZk2Test-1348388955822/jetty4/index lockFactory=org.apache.lucene.store.NativeFSLockFactory@3ff92c98; maxCacheMB=48.0 maxMergeSizeMB=4.0),segFN=segments_1,generation=1,filenames=[segments_1]
[junit4:junit4]   2> 		commit{dir=NRTCachingDirectory(org.apache.lucene.store.NIOFSDirectory@/usr/home/hudson/hudson-slave/workspace/Lucene-Solr-Tests-4.x-java7/solr/build/solr-core/test/J1/org.apache.solr.cloud.BasicDistributedZk2Test-1348388955822/jetty4/index lockFactory=org.apache.lucene.store.NativeFSLockFactory@3ff92c98; maxCacheMB=48.0 maxMergeSizeMB=4.0),segFN=segments_2,generation=2,filenames=[segments_2]
[junit4:junit4]   2> 27955 T86 C2 P12432 oasc.SolrDeletionPolicy.updateCommits newest commit = 2
[junit4:junit4]   2> 27959 T86 C2 P12432 oass.SolrIndexSearcher.<init> Opening Searcher@31ce791 main
[junit4:junit4]   2> 27960 T86 C2 P12432 oasu.DirectUpdateHandler2.commit end_commit_flush
[junit4:junit4]   2> 27965 T85 oasc.SolrCore.registerSearcher [collection1] Registered new searcher Searcher@31ce791 main{StandardDirectoryReader(segments_2:2)}
[junit4:junit4]   2> 27966 T86 C2 P12432 oasc.RecoveryStrategy.replay No replay needed. core=collection1
[junit4:junit4]   2> 27966 T86 C2 P12432 oasc.RecoveryStrategy.doRecovery Replication Recovery was successful - registering as Active. core=collection1
[junit4:junit4]   2> 27969 T86 C2 P12432 oasc.RecoveryStrategy.doRecovery Finished recovery process. core=collection1
[junit4:junit4]   2> 28421 T33 oascc.ZkStateReader.updateClusterState Updating cloud state from ZooKeeper... 
[junit4:junit4]   2> 28451 T91 oascc.ZkStateReader$2.process A cluster state change has occurred - updating...
[junit4:junit4]   2> 28451 T32 oascc.ZkStateReader$2.process A cluster state change has occurred - updating...
[junit4:junit4]   2> 28452 T84 oascc.ZkStateReader$2.process A cluster state change has occurred - updating...
[junit4:junit4]   2> 28451 T89 oascc.ZkStateReader$2.process A cluster state change has occurred - updating...
[junit4:junit4]   2> 28452 T46 oascc.ZkStateReader$2.process A cluster state change has occurred - updating...
[junit4:junit4]   2> 28452 T58 oascc.ZkStateReader$2.process A cluster state change has occurred - updating...
[junit4:junit4]   2> 28451 T70 oascc.ZkStateReader$2.process A cluster state change has occurred - updating...
[junit4:junit4]   2> 28642 T11 oascc.ZkStateReader.updateClusterState Updating cloud state from ZooKeeper... 
[junit4:junit4]   2> 28649 T24 C4 P14990 oasu.DirectUpdateHandler2.commit start commit{flags=0,_version_=0,optimize=false,openSearcher=true,waitSearcher=true,expungeDeletes=false,softCommit=false}
[junit4:junit4]   2> 28738 T24 C4 P14990 oasc.SolrDeletionPolicy.onCommit SolrDeletionPolicy.onCommit: commits:num=2
[junit4:junit4]   2> 		commit{dir=NRTCachingDirectory(org.apache.lucene.store.NIOFSDirectory@/usr/home/hudson/hudson-slave/workspace/Lucene-Solr-Tests-4.x-java7/solr/build/solr-core/test/J1/org.apache.solr.cloud.BasicDistributedZk2Test-1348388955822/control/data/index lockFactory=org.apache.lucene.store.NativeFSLockFactory@6771a12; maxCacheMB=48.0 maxMergeSizeMB=4.0),segFN=segments_1,generation=1,filenames=[segments_1]
[junit4:junit4]   2> 		commit{dir=NRTCachingDirectory(org.apache.lucene.store.NIOFSDirectory@/usr/home/hudson/hudson-slave/workspace/Lucene-Solr-Tests-4.x-java7/solr/build/solr-core/test/J1/org.apache.solr.cloud.BasicDistributedZk2Test-1348388955822/control/data/index lockFactory=org.apache.lucene.store.NativeFSLockFactory@6771a12; maxCacheMB=48.0 maxMergeSizeMB=4.0),segFN=segments_2,generation=2,filenames=[_0_1.len, _0_6.len, _0_7.len, _0_11.len, _0.pst, _0.fld, _0_4.len, _0_3.len, _0_9.len, segments_2, _0_22.len, _0_23.len, _0.inf, _0.si, _0_19.len, _0_20.len]
[junit4:junit4]   2> 28739 T24 C4 P14990 oasc.SolrDeletionPolicy.updateCommits newest commit = 2
[junit4:junit4]   2> 28764 T24 C4 P14990 oass.SolrIndexSearcher.<init> Opening Searcher@10cb09c8 main
[junit4:junit4]   2> 28766 T24 C4 P14990 oasu.DirectUpdateHandler2.commit end_commit_flush
[junit4:junit4]   2> 28770 T35 oasc.SolrCore.registerSearcher [collection1] Registered new searcher Searcher@10cb09c8 main{StandardDirectoryReader(segments_2:3 _0(4.1):C1)}
[junit4:junit4]   2> 28772 T24 C4 P14990 /update {waitSearcher=true&wt=javabin&commit=true&softCommit=false&version=2} {commit=} 0 124
[junit4:junit4]   2> 28777 T40 C1 P21077 oasu.DirectUpdateHandler2.commit start commit{flags=0,_version_=0,optimize=false,openSearcher=true,waitSearcher=true,expungeDeletes=false,softCommit=false}
[junit4:junit4]   2> 28790 T40 C1 P21077 oass.SolrIndexSearcher.<init> Opening Searcher@2bfd3f69 main
[junit4:junit4]   2> 28792 T40 C1 P21077 oasu.DirectUpdateHandler2.commit end_commit_flush
[junit4:junit4]   2> 28799 T47 oasc.SolrCore.registerSearcher [collection1] Registered new searcher Searcher@2bfd3f69 main{StandardDirectoryReader(segments_2:3 _0(4.1):C1)}
[junit4:junit4]   2> 28801 T40 C1 P21077 oasu.SolrCmdDistributor.distribCommit Distrib commit to:[StdNode: http://127.0.0.1:20394/solr/collection1/, StdNode: http://127.0.0.1:29088/solr/collection1/, StdNode: http://127.0.0.1:12432/solr/collection1/]
[junit4:junit4]   2> 28805 T54 C3 P29088 oasu.DirectUpdateHandler2.commit start commit{flags=0,_version_=0,optimize=false,openSearcher=true,waitSearcher=true,expungeDeletes=false,softCommit=false}
[junit4:junit4]   2>  C0_STATE=coll:collection1 core:collection1 props:{shard=shard1, roles=null, state=active, core=collection1, collection=collection1, node_name=127.0.0.1:20394_solr, base_url=http://127.0.0.1:20394/solr}
[junit4:junit4]   2> 28806 T62 C0 P20394 oasu.DirectUpdateHandler2.commit start commit{flags=0,_version_=0,optimize=false,openSearcher=true,waitSearcher=true,expungeDeletes=false,softCommit=false}
[junit4:junit4]   2> 28809 T62 C0 P20394 oass.SolrIndexSearcher.<init> Opening Searcher@49f726d0 main
[junit4:junit4]   2> 28811 T62 C0 P20394 oasu.DirectUpdateHandler2.commit end_commit_flush
[junit4:junit4]   2> 28811 T54 C3 P29088 oass.SolrIndexSearcher.<init> Opening Searcher@1c1159ee main
[junit4:junit4]   2> 28812 T54 C3 P29088 oasu.DirectUpdateHandler2.commit end_commit_flush
[junit4:junit4]   2> 28815 T71 oasc.SolrCore.registerSearcher [collection1] Registered new searcher Searcher@49f726d0 main{StandardDirectoryReader(segments_2:3:nrt _0(4.1):C1)}
[junit4:junit4]   2> 28817 T59 oasc.SolrCore.registerSearcher [collection1] Registered new searcher Searcher@1c1159ee main{StandardDirectoryReader(segments_1:1)}
[junit4:junit4]   2> 28817 T62 C0 P20394 /update {waitSearcher=true&commit=true&wt=javabin&commit_end_point=true&expungeDeletes=false&softCommit=false&version=2} {commit=} 0 12
[junit4:junit4]   2>  C2_STATE=coll:collection1 core:collection1 props:{shard=shard2, roles=null, state=active, core=collection1, collection=collection1, node_name=127.0.0.1:12432_solr, base_url=http://127.0.0.1:12432/solr}
[junit4:junit4]   2> 28817 T76 C2 P12432 oasu.DirectUpdateHandler2.commit start commit{flags=0,_version_=0,optimize=false,openSearcher=true,waitSearcher=true,expungeDeletes=false,softCommit=false}
[junit4:junit4]   2> 28818 T54 C3 P29088 /update {waitSearcher=true&commit=true&wt=javabin&commit_end_point=true&expungeDeletes=false&softCommit=false&version=2} {commit=} 0 13
[junit4:junit4]   2> 28822 T76 C2 P12432 oass.SolrIndexSearcher.<init> Opening Searcher@22987efe main
[junit4:junit4]   2> 28823 T76 C2 P12432 oasu.DirectUpdateHandler2.commit end_commit_flush
[junit4:junit4]   2> 28829 T85 oasc.SolrCore.registerSearcher [collection1] Registered new searcher Searcher@22987efe main{StandardDirectoryReader(segments_2:2)}
[junit4:junit4]   2> 28831 T76 C2 P12432 /update {waitSearcher=true&commit=true&wt=javabin&commit_end_point=true&expungeDeletes=false&softCommit=false&version=2} {commit=} 0 14
[junit4:junit4]   2> 28832 T40 C1 P21077 /update {waitSearcher=true&wt=javabin&commit=true&softCommit=false&version=2} {commit=} 0 55
[junit4:junit4]   2> 29291 T25 C4 P14990 REQ /select {fl=id,score&shard.url=127.0.0.1:14990/solr/collection1/&NOW=1348388984348&start=0&q=*:*&distrib=false&isShard=true&wt=javabin&fsv=true&rows=10&version=2} hits=1 status=0 QTime=194 
[junit4:junit4]   2> 29419 T25 C4 P14990 REQ /select {shard.url=127.0.0.1:14990/solr/collection1/&NOW=1348388984348&q=*:*&ids=1&distrib=false&isShard=true&wt=javabin&version=2} status=0 QTime=63 
[junit4:junit4]   2> 29428 T24 C4 P14990 REQ /select {wt=javabin&q=*:*&version=2} hits=1 status=0 QTime=571 
[junit4:junit4]   2> 29429 T11 oaz.ZooKeeper.<init> Initiating client connection, connectString=127.0.0.1:27313/solr sessionTimeout=10000 watcher=org.apache.solr.common.cloud.ConnectionManager@50b56ef3
[junit4:junit4]   2> 29430 T98 oaz.ClientCnxn$SendThread.startConnect Opening socket connection to server /127.0.0.1:27313
[junit4:junit4]   2> 29430 T11 oascc.ConnectionManager.waitForConnected Waiting for client to connect to ZooKeeper
[junit4:junit4]   2> 29431 T98 oaz.ClientCnxn$SendThread.primeConnection Socket connection established to localhost/127.0.0.1:27313, initiating session
[junit4:junit4]   2> 29431 T13 oazs.NIOServerCnxn$Factory.run Accepted socket connection from /140.211.11.196:57616
[junit4:junit4]   2> 29432 T13 oazs.NIOServerCnxn.readConnectRequest Client attempting to establish new session at /140.211.11.196:57616
[junit4:junit4]   2> 29464 T16 oazs.NIOServerCnxn.finishSessionInit Established session 0x139f23ea8d50009 with negotiated timeout 10000 for client /140.211.11.196:57616
[junit4:junit4]   2> 29464 T98 oaz.ClientCnxn$SendThread.readConnectResult Session establishment complete on server localhost/127.0.0.1:27313, sessionid = 0x139f23ea8d50009, negotiated timeout = 10000
[junit4:junit4]   2> 29465 T99 oascc.ConnectionManager.process Watcher org.apache.solr.common.cloud.ConnectionManager@50b56ef3 name:ZooKeeperConnection Watcher:127.0.0.1:27313/solr got event WatchedEvent state:SyncConnected type:None path:null path:null type:None
[junit4:junit4]   2> 29465 T11 oascc.ConnectionManager.waitForConnected Client is connected to ZooKeeper
[junit4:junit4]   2> 29466 T11 oascc.ZkStateReader.createClusterStateWatchersAndUpdate Updating cluster state from ZooKeeper... 
[junit4:junit4]   2> 29469 T18 oazs.PrepRequestProcessor.pRequest Processed session termination for sessionid: 0x139f23ea8d50009
[junit4:junit4]   2> 29476 T99 oaz.ClientCnxn$EventThread.run EventThread shut down
[junit4:junit4]   2> 29476 T13 oazs.NIOServerCnxn.closeSock Closed socket connection for client /140.211.11.196:57616 which had sessionid 0x139f23ea8d50009
[junit4:junit4]   2> 29476 T11 oaz.ZooKeeper.close Session: 0x139f23ea8d50009 closed
[junit4:junit4]   2> 29480 T43 C1 P21077 REQ /select {distrib=false&wt=javabin&q=*:*&version=2} hits=1 status=0 QTime=1 
[junit4:junit4]   2> 29485 T55 C3 P29088 REQ /select {distrib=false&wt=javabin&q=*:*&version=2} hits=0 status=0 QTime=1 
[junit4:junit4]   2> 29492 T51 C3 P29088 REQ /select {fl=id,score&shard.url=127.0.0.1:29088/solr/collection1/|127.0.0.1:12432/solr/collection1/&NOW=1348388984978&start=0&q=*:*&distrib=false&isShard=true&wt=javabin&fsv=true&rows=10&version=2} hits=0 status=0 QTime=1 
[junit4:junit4]   2> 29492 T63 C0 P20394 REQ /select {fl=id,score&shard.url=127.0.0.1:21077/solr/collection1/|127.0.0.1:20394/solr/collection1/&NOW=1348388984978&start=0&q=*:*&distrib=false&isShard=true&wt=javabin&fsv=true&rows=10&version=2} hits=1 status=0 QTime=0 
[junit4:junit4]   2> 29499 T63 C0 P20394 REQ /select {shard.url=127.0.0.1:21077/solr/collection1/|127.0.0.1:20394/solr/collection1/&NOW=1348388984978&q=*:*&ids=1&distrib=false&isShard=true&wt=javabin&version=2} status=0 QTime=1 
[junit4:junit4]   2> 29502 T56 C3 P29088 REQ /select {wt=javabin&q=*:*&version=2} hits=1 status=0 QTime=15 
[junit4:junit4]   2> 29513 T24 C4 P14990 /update {wt=javabin&version=2} {add=[2 (1413888328333262848)]} 0 7
[junit4:junit4]   2> 29544 T76 C2 P12432 REQ /update {distrib.from=http://127.0.0.1:29088/solr/collection1/&update.distrib=FROMLEADER&wt=javabin&version=2} status=0 QTime=7 
[junit4:junit4]   2> 29545 T56 C3 P29088 /update {wt=javabin&version=2} {add=[2 (1413888328345845760)]} 0 28
[junit4:junit4]   2> 29557 T24 C4 P14990 /update {wt=javabin&version=2} {add=[3 (1413888328379400192)]} 0 7
[junit4:junit4]   2> 29576 T76 C2 P12432 REQ /update {distrib.from=http://127.0.0.1:29088/solr/collection1/&update.distrib=FROMLEADER&wt=javabin&version=2} status=0 QTime=5 
[junit4:junit4]   2> 29577 T56 C3 P29088 /update {wt=javabin&version=2} {add=[3 (1413888328390934528)]} 0 16
[junit4:junit4]   2> 29589 T24 C4 P14990 /update {wt=javabin&version=2} {add=[4 (1413888328411906048)]} 0 7
[junit4:junit4]   2> 29618 T62 C0 P20394 REQ /update {distrib.from=http://127.0.0.1:21077/solr/collection1/&update.distrib=FROMLEADER&wt=javabin&version=2} status=0 QTime=11 
[junit4:junit4]   2> 29619 T40 C1 P21077 /update {wt=javabin&version=2} {add=[4 (1413888328425537536)]} 0 25
[junit4:junit4]   2> 29632 T24 C4 P14990 /update {wt=javabin&version=2} {add=[5 (1413888328458043392)]} 0 7
[junit4:junit4]   2> 29663 T76 C2 P12432 REQ /update {update.distrib=FROMLEADER&distrib.from=http://127.0.0.1:29088/solr/collection1/&wt=javabin&version=2} status=0 QTime=7 
[junit4:junit4]   2> 29664 T54 C3 P29088 REQ /update {distrib.from=http://127.0.0.1:21077/solr/collection1/&update.distrib=TOLEADER&wt=javabin&version=2} status=0 QTime=17 
[junit4:junit4]   2> 29666 T40 C1 P21077 /update {wt=javabin&version=2} {add=[5]} 0 29
[junit4:junit4]   2> 29678 T24 C4 P14990 /update {wt=javabin&version=2} {add=[6 (1413888328506277888)]} 0 7
[junit4:junit4]   2> 29700 T76 C2 P12432 REQ /update {distrib.from=http://127.0.0.1:29088/solr/collection1/&update.distrib=FROMLEADER&wt=javabin&version=2} status=0 QTime=7 
[junit4:junit4]   2> 29701 T56 C3 P29088 /update {wt=javabin&version=2} {add=[6 (1413888328518860800)]} 0 18
[junit4:junit4]   2> 29713 T24 C4 P14990 /update {wt=javabin&version=2} {add=[7 (1413888328542978048)]} 0 7
[junit4:junit4]   2> 29739 T76 C2 P12432 REQ /update {update.distrib=FROMLEADER&distrib.from=http://127.0.0.1:29088/solr/collection1/&wt=javabin&version=2} status=0 QTime=7 
[junit4:junit4]   2> 29740 T54 C3 P29088 REQ /update {distrib.from=http://127.0.0.1:21077/solr/collection1/&update.distrib=TOLEADER&wt=javabin&version=2} status=0 QTime=18 
[junit4:junit4]   2> 29741 T40 C1 P21077 /update {wt=javabin&version=2} {add=[7]} 0 23
[junit4:junit4]   2> 29752 T24 C4 P14990 /update {wt=javabin&version=2} {add=[8 (1413888328583872512)]} 0 7
[junit4:junit4]   2> 29779 T62 C0 P20394 REQ /update {update.distrib=FROMLEADER&distrib.from=http://127.0.0.1:21077/solr/collection1/&wt=javabin&version=2} status=0 QTime=7 
[junit4:junit4]   2> 29780 T44 C1 P21077 REQ /update {distrib.from=http://127.0.0.1:29088/solr/collection1/&update.distrib=TOLEADER&wt=javabin&version=2} status=0 QTime=20 
[junit4:junit4]   2> 29781 T56 C3 P29088 /update {wt=javabin&version=2} {add=[8]} 0 24
[junit4:junit4]   2> 29792 T24 C4 P14990 /update {wt=javabin&version=2} {add=[9 (1413888328625815552)]} 0 6
[junit4:junit4]   2> 29817 T76 C2 P12432 REQ /update {distrib.from=http://127.0.0.1:29088/solr/collection1/&update.distrib=FROMLEADER&wt=javabin&version=2} status=0 QTime=6 
[junit4:junit4]   2> 29818 T56 C3 P29088 /update {wt=javabin&version=2} {add=[9 (1413888328638398464)]} 0 21
[junit4:junit4]   2> 29829 T24 C4 P14990 /update {wt=javabin&version=2} {add=[10 (1413888328664612864)]} 0 6
[junit4:junit4]   2> 29849 T62 C0 P20394 REQ /update {distrib.from=http://127.0.0.1:21077/solr/collection1/&update.distrib=FROMLEADER&wt=javabin&version=2} status=0 QTime=7 
[junit4:junit4]   2> 29850 T40 C1 P21077 /update {wt=javabin&version=2} {add=[10 (1413888328675098624)]} 0 17
[junit4:junit4]   2> 29888 T24 C4 P14990 /update {wt=javabin&version=2} {add=[11 (1413888328698167296)]} 0 34
[junit4:junit4]   2> 29910 T62 C0 P20394 REQ /update {distrib.from=http://127.0.0.1:21077/solr/collection1/&update.distrib=FROMLEADER&wt=javabin&version=2} status=0 QTime=7 
[junit4:junit4]   2> 29911 T40 C1 P21077 /update {wt=javabin&version=2} {add=[11 (1413888328739061760)]} 0 18
[junit4:junit4]   2> 29924 T24 C4 P14990 /update {wt=javabin&version=2} {add=[12 (1413888328763179008)]} 0 8
[junit4:junit4]   2> 29943 T62 C0 P20394 REQ /update {update.distrib=FROMLEADER&distrib.from=http://127.0.0.1:21077/solr/collection1/&wt=javabin&version=2} status=0 QTime=5 
[junit4:junit4]   2> 29944 T44 C1 P21077 REQ /update {distrib.from=http://127.0.0.1:29088/solr/collection1/&update.distrib=TOLEADER&wt=javabin&version=2} status=0 QTime=12 
[junit4:junit4]   2> 29944 T56 C3 P29088 /update {wt=javabin&version=2} {add=[12]} 0 16
[junit4:junit4]   2> 29955 T24 C4 P14990 /update {wt=javabin&version=2} {add=[13 (1413888328796733440)]} 0 7
[junit4:junit4]   2> 29976 T62 C0 P20394 REQ /update {update.distrib=FROMLEADER&distrib.from=http://127.0.0.1:21077/solr/collection1/&wt=javabin&version=2} status=0 QTime=4 
[junit4:junit4]   2> 29977 T44 C1 P21077 REQ /update {distrib.from=http://127.0.0.1:29088/solr/collection1/&update.distrib=TOLEADER&wt=javabin&version=2} status=0 QTime=14 
[junit4:junit4]   2> 29978 T56 C3 P29088 /update {wt=javabin&version=2} {add=[13]} 0 19
[junit4:junit4]   2> 29988 T24 C4 P14990 /update {wt=javabin&version=2} {add=[14 (1413888328833433600)]} 0 5
[junit4:junit4]   2> 30010 T62 C0 P20394 REQ /update {update.distrib=FROMLEADER&distrib.from=http://127.0.0.1:21077/solr/collection1/&wt=javabin&version=2} status=0 QTime=7 
[junit4:junit4]   2> 30011 T44 C1 P21077 REQ /update {distrib.from=http://127.0.0.1:29088/solr/collection1/&update.distrib=TOLEADER&wt=javabin&version=2} status=0 QTime=15 
[junit4:junit4]   2> 30012 T56 C3 P29088 /update {wt=javabin&version=2} {add=[14]} 0 19
[junit4:junit4]   2> 30022 T24 C4 P14990 /update {wt=javabin&version=2} {add=[15 (1413888328868036608)]} 0 6
[junit4:junit4]   2> 30042 T62 C0 P20394 REQ /update {distrib.from=http://127.0.0.1:21077/solr/collection1/&update.distrib=FROMLEADER&wt=javabin&version=2} status=0 QTime=4 
[junit4:junit4]   2> 30043 T40 C1 P21077 /update {wt=javabin&version=2} {add=[15 (1413888328878522368)]} 0 17
[junit4:junit4]   2> 30053 T24 C4 P14990 /update {wt=javabin&version=2} {add=[16 (1413888328900542464)]} 0 6
[junit4:junit4]   2> 30071 T62 C0 P20394 REQ /update {distrib.from=http://127.0.0.1:21077/solr/collection1/&update.distrib=FROMLEADER&wt=javabin&version=2} status=0 QTime=5 
[junit4:junit4]   2> 30073 T40 C1 P21077 /update {wt=javabin&version=2} {add=[16 (1413888328911028224)]} 0 16
[junit4:junit4]   2> 30098 T24 C4 P14990 /update {wt=javabin&version=2} {add=[17 (1413888328937242624)]} 0 20
[junit4:junit4]   2> 30163 T76 C2 P12432 REQ /update {update.distrib=FROMLEADER&distrib.from=http://127.0.0.1:29088/solr/collection1/&wt=javabin&version=2} status=0 QTime=34 
[junit4:junit4]   2> 30164 T54 C3 P29088 REQ /update {distrib.from=http://127.0.0.1:21077/solr/collection1/&update.distrib=TOLEADER&wt=javabin&version=2} status=0 QTime=52 
[junit4:junit4]   2> 30165 T40 C1 P21077 /update {wt=javabin&version=2} {add=[17]} 0 62
[junit4:junit4]   2> 30174 T24 C4 P14990 /update {wt=javabin&version=2} {add=[100 (1413888329028468736)]} 0 4
[junit4:junit4]   2> 30281 T62 C0 P20394 REQ /update {update.distrib=FROMLEADER&distrib.from=http://127.0.0.1:21077/solr/collection1/&wt=javabin&version=2} status=0 QTime=37 
[junit4:junit4]   2> 30283 T44 C1 P21077 REQ /update {distrib.from=http://127.0.0.1:29088/solr/collection1/&update.distrib=TOLEADER&wt=javabin&version=2} status=0 QTime=80 
[junit4:junit4]   2> 30284 T56 C3 P29088 /update {wt=javabin&version=2} {add=[100]} 0 106
[junit4:junit4]   2> 30292 T24 C4 P14990 /update {wt=javabin&version=2} {add=[101 (1413888329152200704)]} 0 4
[junit4:junit4]   2> 30311 T62 C0 P20394 REQ /update {distrib.from=http://127.0.0.1:21077/solr/collection1/&update.distrib=FROMLEADER&wt=javabin&version=2} status=0 QTime=5 
[junit4:junit4]   2> 30313 T40 C1 P21077 /update {wt=javabin&version=2} {add=[101 (1413888329161637888)]} 0 16
[junit4:junit4]   2> 30321 T24 C4 P14990 /update {wt=javabin&version=2} {add=[102 (1413888329182609408)]} 0 5
[junit4:junit4]   2> 30340 T62 C0 P20394 REQ /update {update.distrib=FROMLEADER&distrib.from=http://127.0.0.1:21077/solr/collection1/&wt=javabin&version=2} status=0 QTime=4 
[junit4:junit4]   2> 30341 T44 C1 P21077 REQ /update {distrib.from=http://127.0.0.1:29088/solr/collection1/&update.distrib=TOLEADER&wt=javabin&version=2} status=0 QTime=12 
[junit4:junit4]   2> 30342 T56 C3 P29088 /update {wt=javabin&version=2} {add=[102]} 0 17
[junit4:junit4]   2> 30369 T24 C4 P14990 /update {wt=javabin&version=2} {add=[103 (1413888329213018112)]} 0 23
[junit4:junit4]   2> 30382 T76 C2 P12432 REQ /update {distrib.from=http://127.0.0.1:29088/solr/collection1/&update.distrib=FROMLEADER&wt=javabin&version=2} status=0 QTime=3 
[junit4:junit4]   2> 30383 T56 C3 P29088 /update {wt=javabin&version=2} {add=[103 (1413888329241329664)]} 0 11
[junit4:junit4]   2> 30392 T24 C4 P14990 /update {wt=javabin&version=2} {add=[104 (1413888329257058304)]} 0 5
[junit4:junit4]   2> 30406 T76 C2 P12432 REQ /update {distrib.from=http://127.0.0.1:29088/solr/collection1/&update.distrib=FROMLEADER&wt=javabin&version=2} status=0 QTime=4 
[junit4:junit4]   2> 30407 T56 C3 P29088 /update {wt=javabin&version=2} {add=[104 (1413888329266495488)]} 0 11
[junit4:junit4]   2> 30414 T24 C4 P14990 /update {wt=javabin&version=2} {add=[105 (1413888329281175552)]} 0 4
[junit4:junit4]   2> 30458 T76 C2 P12432 REQ /update {distrib.from=http://127.0.0.1:29088/solr/collection1/&update.distrib=FROMLEADER&wt=javabin&version=2} status=0 QTime=17 
[junit4:junit4]   2> 30460 T56 C3 P29088 /update {wt=javabin&version=2} {add=[105 (1413888329288515584)]} 0 43
[junit4:junit4]   2> 30467 T24 C4 P14990 /update {wt=javabin&version=2} {add=[106 (1413888329336750080)]} 0 4
[junit4:junit4]   2> 30497 T76 C2 P12432 REQ /update {update.distrib=FROMLEADER&distrib.from=http://127.0.0.1:29088/solr/collection1/&wt=javabin&version=2} status=0 QTime=16 
[junit4:junit4]   2> 30498 T54 C3 P29088 REQ /update {distrib.from=http://127.0.0.1:21077/solr/collection1/&update.distrib=TOLEADER&wt=javabin&version=2} status=0 QTime=23 
[junit4:junit4]   2> 30499 T40 C1 P21077 /update {wt=javabin&version=2} {add=[106]} 0 28
[junit4:junit4]   2> 30507 T24 C4 P14990 /update {wt=javabin&version=2} {add=[107 (1413888329378693120)]} 0 3
[junit4:junit4]   2> 30525 T62 C0 P20394 REQ /update {update.distrib=FROMLEADER&distrib.from=http://127.0.0.1:21077/solr/collection1/&wt=javabin&version=2} status=0 QTime=4 
[junit4:junit4]   2> 30526 T44 C1 P21077 REQ /update {distrib.from=http://127.0.0.1:29088/solr/collection1/&update.distrib=TOLEADER&wt=javabin&version=2} status=0 QTime=11 
[junit4:junit4]   2> 30527 T56 C3 P29088 /update {wt=javabin&version=2} {add=[107]} 0 17
[junit4:junit4]   2> 30535 T24 C4 P14990 /update {wt=javabin&version=2} {add=[108 (1413888329408053248)]} 0 3
[junit4:junit4]   2> 30549 T62 C0 P20394 REQ /update {distrib.from=http://127.0.0.1:21077/solr/collection1/&update.distrib=FROMLEADER&wt=javabin&version=2} status=0 QTime=4 
[junit4:junit4]   2> 30550 T40 C1 P21077 /update {wt=javabin&version=2} {add=[108 (1413888329416441856)]} 0 11
[junit4:junit4]   2> 30557 T24 C4 P14990 /update {wt=javabin&version=2} {add=[109 (1413888329432170496)]} 0 3
[junit4:junit4]   2> 30575 T62 C0 P20394 REQ /update {update.distrib=FROMLEADER&distrib.from=http://127.0.0.1:21077/solr/collection1/&wt=javabin&version=2} status=0 QTime=5 
[junit4:junit4]   2> 30577 T44 C1 P21077 REQ /update {distrib.from=http://127.0.0.1:29088/solr/collection1/&update.distrib=TOLEADER&wt=javabin&version=2} status=0 QTime=14 
[junit4:junit4]   2> 30579 T56 C3 P29088 /update {wt=javabin&version=2} {add=[109]} 0 19
[junit4:junit4]   2> 30587 T24 C4 P14990 /update {wt=javabin&version=2} {add=[110 (1413888329462579200)]} 0 3
[junit4:junit4]   2> 30598 T62 C0 P20394 REQ /update {distrib.from=http://127.0.0.1:21077/solr/collection1/&update.distrib=FROMLEADER&wt=javabin&version=2} status=0 QTime=3 
[junit4:junit4]   2> 30599 T40 C1 P21077 /update {wt=javabin&version=2} {add=[110 (1413888329469919232)]} 0 9
[junit4:junit4]   2> 30605 T24 C4 P14990 /update {wt=javabin&version=2} {add=[111 (1413888329482502144)]} 0 3
[junit4:junit4]   2> 30622 T62 C0 P20394 REQ /update {update.distrib=FROMLEADER&distrib.from=http://127.0.0.1:21077/solr/collection1/&wt=javabin&version=2} status=0 QTime=4 
[junit4:junit4]   2> 30623 T44 C1 P21077 REQ /update {distrib.from=http://127.0.0.1:29088/solr/collection1/&update.distrib=TOLEADER&wt=javabin&version=2} status=0 QTime=11 
[junit4:junit4]   2> 30624 T56 C3 P29088 /update {wt=javabin&version=2} {add=[111]} 0 16
[junit4:junit4]   2> 30631 T24 C4 P14990 /update {wt=javabin&version=2} {add=[112 (1413888329508716544)]} 0 4
[junit4:junit4]   2> 30676 T76 C2 P12432 REQ /update {distrib.from=http://127.0.0.1:29088/solr/collection1/&update.distrib=FROMLEADER&wt=javabin&version=2} status=0 QTime=3 
[junit4:junit4]   2> 30677 T56 C3 P29088 /update {wt=javabin&version=2} {add=[112 (1413888329516056576)]} 0 43
[junit4:junit4]   2> 30697 T24 C4 P14990 /update {wt=javabin&version=2} {add=[113 (1413888329568485376)]} 0 13
[junit4:junit4]   2> 30713 T62 C0 P20394 REQ /update {distrib.from=http://127.0.0.1:21077/solr/collection1/&update.distrib=FROMLEADER&wt=javabin&version=2} status=0 QTime=3 
[junit4:junit4]   2> 30714 T40 C1 P21077 /update {wt=javabin&version=2} {add=[113 (1413888329589456896)]} 0 10
[junit4:junit4]   2> 30723 T24 C4 P14990 /update {wt=javabin&version=2} {add=[114 (1413888329605185536)]} 0 4
[junit4:junit4]   2> 30735 T62 C0 P20394 REQ /update {distrib.from=http://127.0.0.1:21077/solr/collection1/&update.distrib=FROMLEADER&wt=javabin&version=2} status=0 QTime=3 
[junit4:junit4]   2> 30736 T40 C1 P21077 /update {wt=javabin&version=2} {add=[114 (1413888329612525568)]} 0 10
[junit4:junit4]   2> 30743 T24 C4 P14990 /update {wt=javabin&version=2} {add=[115 (1413888329627205632)]} 0 3
[junit4:junit4]   2> 30757 T76 C2 P12432 REQ /update {update.distrib=FROMLEADER&distrib.from=http://127.0.0.1:29088/solr/collection1/&wt=javabin&version=2} status=0 QTime=3 
[junit4:junit4]   2> 30758 T54 C3 P29088 REQ /update {distrib.from=http://127.0.0.1:21077/solr/collection1/&update.distrib=TOLEADER&wt=javabin&version=2} status=0 QTime=9 
[junit4:junit4]   2> 30759 T40 C1 P21077 /update {wt=javabin&version=2} {add=[115]} 0 13
[junit4:junit4]   2> 30766 T24 C4 P14990 /update {wt=javabin&version=2} {add=[116 (1413888329650274304)]} 0 4
[junit4:junit4]   2> 30780 T76 C2 P12432 REQ /update {distrib.from=http://127.0.0.1:29088/solr/collection1/&update.distrib=FROMLEADER&wt=javabin&version=2} status=0 QTime=3 
[junit4:junit4]   2> 30782 T56 C3 P29088 /update {wt=javabin&version=2} {add=[116 (1413888329657614336)]} 0 13
[junit4:junit4]   2> 30789 T24 C4 P14990 /update {wt=javabin&version=2} {add=[117 (1413888329674391552)]} 0 4
[junit4:junit4]   2> 30802 T76 C2 P12432 REQ /update {distrib.from=http://127.0.0.1:29088/solr/collection1/&update.distrib=FROMLEADER&wt=javabin&version=2} status=0 QTime=4 
[junit4:junit4]   2> 30803 T56 C3 P29088 /update {wt=javabin&version=2} {add=[117 (1413888329681731584)]} 0 11
[junit4:junit4]   2> 30810 T24 C4 P14990 /update {wt=javabin&version=2} {add=[118 (1413888329696411648)]} 0 4
[junit4:junit4]   2> 30842 T62 C0 P20394 REQ /update {distrib.from=http://127.0.0.1:21077/solr/collection1/&update.distrib=FROMLEADER&wt=javabin&version=2} status=0 QTime=10 
[junit4:junit4]   2> 30843 T40 C1 P21077 /update {wt=javabin&version=2} {add=[118 (1413888329704800256)]} 0 29
[junit4:junit4]   2> 30850 T24 C4 P14990 /update {wt=javabin&version=2} {add=[119 (1413888329738354688)]} 0 4
[junit4:junit4]   2> 30867 T76 C2 P12432 REQ /update {update.distrib=FROMLEADER&distrib.from=http://127.0.0.1:29088/solr/collection1/&wt=javabin&version=2} status=0 QTime=4 
[junit4:junit4]   2> 30869 T54 C3 P29088 REQ /update {distrib.from=http://127.0.0.1:21077/solr/collection1/&update.distrib=TOLEADER&wt=javabin&version=2} status=0 QTime=12 
[junit4:junit4]   2> 30870 T40 C1 P21077 /update {wt=javabin&version=2} {add=[119]} 0 17
[junit4:junit4]   2> 30878 T24 C4 P14990 /update {wt=javabin&version=2} {add=[120 (1413888329767714816)]} 0 4
[junit4:junit4]   2> 30891 T76 C2 P12432 REQ /update {distrib.from=http://127.0.0.1:29088/solr/collection1/&update.distrib=FROMLEADER&wt=javabin&version=2} status=0 QTime=4 
[junit4:junit4]   2> 30893 T56 C3 P29088 /update {wt=javabin&version=2} {add=[120 (1413888329775054848)]} 0 11
[junit

[...truncated too long message...]

unit4:junit4]   2> 134910 T131 oaz.ZooKeeper.close Session: 0x139f24393160005 closed
[junit4:junit4]   2> 134913 T131 oejsh.ContextHandler.doStop stopped o.e.j.s.ServletContextHandler{/solr,null}
[junit4:junit4]   2> 134965 T131 oasc.ChaosMonkey.monkeyLog monkey: stop shard! 24912
[junit4:junit4]   2> 134965 T131 oasc.CoreContainer.shutdown Shutting down CoreContainer instance=1833698077
[junit4:junit4]   2> 134965 T131 oasc.RecoveryStrategy.close WARNING Stopping recovery for zkNodeName=127.0.0.1:24912_solr_collection1core=collection1
[junit4:junit4]   2> 134966 T131 oasc.SolrCore.close [collection1]  CLOSING SolrCore org.apache.solr.core.SolrCore@726eea32
[junit4:junit4]   2> 134994 T131 oasc.SolrCore.closeSearcher [collection1] Closing main searcher on request.
[junit4:junit4]   2> 134994 T131 oasu.DirectUpdateHandler2.close closing DirectUpdateHandler2{commits=6,autocommits=0,soft autocommits=0,optimizes=0,rollbacks=0,expungeDeletes=0,docsPending=0,adds=0,deletesById=0,deletesByQuery=0,errors=0,cumulative_adds=5,cumulative_deletesById=0,cumulative_deletesByQuery=1,cumulative_errors=0}
[junit4:junit4]   2> 134995 T131 oasu.DefaultSolrCoreState.decref SolrCoreState ref count has reached 0 - closing IndexWriter
[junit4:junit4]   2> 134997 T131 oasu.DefaultSolrCoreState.decref Closing SolrCoreState - canceling any ongoing recovery
[junit4:junit4]   2> 136148 T205 oaz.ClientCnxn$EventThread.run EventThread shut down
[junit4:junit4]   2> 136148 T131 oaz.ZooKeeper.close Session: 0x139f24393160006 closed
[junit4:junit4]   2> 136149 T131 oejsh.ContextHandler.doStop stopped o.e.j.s.ServletContextHandler{/solr,null}
[junit4:junit4]   2> 136378 T131 oas.SolrTestCaseJ4.tearDown ###Ending testDistribSearch
[junit4:junit4]   2> NOTE: reproduce with: ant test  -Dtestcase=SyncSliceTest -Dtests.method=testDistribSearch -Dtests.seed=778CBE7FFE1AF693 -Dtests.multiplier=3 -Dtests.slow=true -Dtests.locale=in -Dtests.timezone=Brazil/West -Dtests.file.encoding=UTF-8
[junit4:junit4] FAILURE  136s J1 | SyncSliceTest.testDistribSearch <<<
[junit4:junit4]    > Throwable #1: java.lang.AssertionError: There are still nodes recoverying
[junit4:junit4]    > 	at __randomizedtesting.SeedInfo.seed([778CBE7FFE1AF693:F66A3067894596AF]:0)
[junit4:junit4]    > 	at org.junit.Assert.fail(Assert.java:93)
[junit4:junit4]    > 	at org.apache.solr.cloud.AbstractDistribZkTestBase.waitForRecoveriesToFinish(AbstractDistribZkTestBase.java:154)
[junit4:junit4]    > 	at org.apache.solr.cloud.AbstractFullDistribZkTestBase.waitForRecoveriesToFinish(AbstractFullDistribZkTestBase.java:560)
[junit4:junit4]    > 	at org.apache.solr.cloud.AbstractFullDistribZkTestBase.waitForThingsToLevelOut(AbstractFullDistribZkTestBase.java:1135)
[junit4:junit4]    > 	at org.apache.solr.cloud.SyncSliceTest.doTest(SyncSliceTest.java:162)
[junit4:junit4]    > 	at org.apache.solr.BaseDistributedSearchTestCase.testDistribSearch(BaseDistributedSearchTestCase.java:695)
[junit4:junit4]    > 	at sun.reflect.NativeMethodAccessorImpl.invoke0(Native Method)
[junit4:junit4]    > 	at sun.reflect.NativeMethodAccessorImpl.invoke(NativeMethodAccessorImpl.java:57)
[junit4:junit4]    > 	at sun.reflect.DelegatingMethodAccessorImpl.invoke(DelegatingMethodAccessorImpl.java:43)
[junit4:junit4]    > 	at java.lang.reflect.Method.invoke(Method.java:601)
[junit4:junit4]    > 	at com.carrotsearch.randomizedtesting.RandomizedRunner.invoke(RandomizedRunner.java:1559)
[junit4:junit4]    > 	at com.carrotsearch.randomizedtesting.RandomizedRunner.access$600(RandomizedRunner.java:79)
[junit4:junit4]    > 	at com.carrotsearch.randomizedtesting.RandomizedRunner$6.evaluate(RandomizedRunner.java:737)
[junit4:junit4]    > 	at com.carrotsearch.randomizedtesting.RandomizedRunner$7.evaluate(RandomizedRunner.java:773)
[junit4:junit4]    > 	at com.carrotsearch.randomizedtesting.RandomizedRunner$8.evaluate(RandomizedRunner.java:787)
[junit4:junit4]    > 	at com.carrotsearch.randomizedtesting.rules.SystemPropertiesRestoreRule$1.evaluate(SystemPropertiesRestoreRule.java:53)
[junit4:junit4]    > 	at org.apache.lucene.util.TestRuleSetupTeardownChained$1.evaluate(TestRuleSetupTeardownChained.java:50)
[junit4:junit4]    > 	at org.apache.lucene.util.TestRuleFieldCacheSanity$1.evaluate(TestRuleFieldCacheSanity.java:51)
[junit4:junit4]    > 	at org.apache.lucene.util.AbstractBeforeAfterRule$1.evaluate(AbstractBeforeAfterRule.java:45)
[junit4:junit4]    > 	at com.carrotsearch.randomizedtesting.rules.SystemPropertiesInvariantRule$1.evaluate(SystemPropertiesInvariantRule.java:55)
[junit4:junit4]    > 	at org.apache.lucene.util.TestRuleThreadAndTestName$1.evaluate(TestRuleThreadAndTestName.java:48)
[junit4:junit4]    > 	at org.apache.lucene.util.TestRuleIgnoreAfterMaxFailures$1.evaluate(TestRuleIgnoreAfterMaxFailures.java:70)
[junit4:junit4]    > 	at org.apache.lucene.util.TestRuleMarkFailure$1.evaluate(TestRuleMarkFailure.java:48)
[junit4:junit4]    > 	at com.carrotsearch.randomizedtesting.rules.StatementAdapter.evaluate(StatementAdapter.java:36)
[junit4:junit4]    > 	at com.carrotsearch.randomizedtesting.ThreadLeakControl$StatementRunner.run(ThreadLeakControl.java:358)
[junit4:junit4]    > 	at com.carrotsearch.randomizedtesting.ThreadLeakControl.forkTimeoutingTask(ThreadLeakControl.java:782)
[junit4:junit4]    > 	at com.carrotsearch.randomizedtesting.ThreadLeakControl$3.evaluate(ThreadLeakControl.java:442)
[junit4:junit4]    > 	at com.carrotsearch.randomizedtesting.RandomizedRunner.runSingleTest(RandomizedRunner.java:746)
[junit4:junit4]    > 	at com.carrotsearch.randomizedtesting.RandomizedRunner$3.evaluate(RandomizedRunner.java:648)
[junit4:junit4]    > 	at com.carrotsearch.randomizedtesting.RandomizedRunner$4.evaluate(RandomizedRunner.java:682)
[junit4:junit4]    > 	at com.carrotsearch.randomizedtesting.RandomizedRunner$5.evaluate(RandomizedRunner.java:693)
[junit4:junit4]    > 	at com.carrotsearch.randomizedtesting.rules.StatementAdapter.evaluate(StatementAdapter.java:36)
[junit4:junit4]    > 	at com.carrotsearch.randomizedtesting.rules.SystemPropertiesRestoreRule$1.evaluate(SystemPropertiesRestoreRule.java:53)
[junit4:junit4]    > 	at org.apache.lucene.util.AbstractBeforeAfterRule$1.evaluate(AbstractBeforeAfterRule.java:45)
[junit4:junit4]    > 	at org.apache.lucene.util.TestRuleStoreClassName$1.evaluate(TestRuleStoreClassName.java:42)
[junit4:junit4]    > 	at com.carrotsearch.randomizedtesting.rules.SystemPropertiesInvariantRule$1.evaluate(SystemPropertiesInvariantRule.java:55)
[junit4:junit4]    > 	at com.carrotsearch.randomizedtesting.rules.NoShadowingOrOverridesOnMethodsRule$1.evaluate(NoShadowingOrOverridesOnMethodsRule.java:39)
[junit4:junit4]    > 	at com.carrotsearch.randomizedtesting.rules.NoShadowingOrOverridesOnMethodsRule$1.evaluate(NoShadowingOrOverridesOnMethodsRule.java:39)
[junit4:junit4]    > 	at com.carrotsearch.randomizedtesting.rules.StatementAdapter.evaluate(StatementAdapter.java:36)
[junit4:junit4]    > 	at org.apache.lucene.util.TestRuleAssertionsRequired$1.evaluate(TestRuleAssertionsRequired.java:43)
[junit4:junit4]    > 	at org.apache.lucene.util.TestRuleMarkFailure$1.evaluate(TestRuleMarkFailure.java:48)
[junit4:junit4]    > 	at org.apache.lucene.util.TestRuleIgnoreAfterMaxFailures$1.evaluate(TestRuleIgnoreAfterMaxFailures.java:70)
[junit4:junit4]    > 	at org.apache.lucene.util.TestRuleIgnoreTestSuites$1.evaluate(TestRuleIgnoreTestSuites.java:55)
[junit4:junit4]    > 	at com.carrotsearch.randomizedtesting.rules.StatementAdapter.evaluate(StatementAdapter.java:36)
[junit4:junit4]    > 	at com.carrotsearch.randomizedtesting.ThreadLeakControl$StatementRunner.run(ThreadLeakControl.java:358)
[junit4:junit4]    > 	at java.lang.Thread.run(Thread.java:722)
[junit4:junit4]   2> 136389 T131 oas.SolrTestCaseJ4.deleteCore ###deleteCore
[junit4:junit4]   2> NOTE: test params are: codec=Lucene40: {range_facet_l=Pulsing40(freqCutoff=6 minBlockSize=17 maxBlockSize=42), text=PostingsFormat(name=NestedPulsing), _version_=Pulsing40(freqCutoff=6 minBlockSize=17 maxBlockSize=42), rnd_b=PostingsFormat(name=TestBloomFilteredLucene40Postings), intDefault=Pulsing40(freqCutoff=6 minBlockSize=17 maxBlockSize=42), timestamp=Pulsing40(freqCutoff=6 minBlockSize=17 maxBlockSize=42), id=PostingsFormat(name=TestBloomFilteredLucene40Postings), a_t=Pulsing40(freqCutoff=6 minBlockSize=17 maxBlockSize=42), range_facet_sl=PostingsFormat(name=NestedPulsing), range_facet_si=PostingsFormat(name=Lucene40WithOrds), other_tl1=Pulsing40(freqCutoff=6 minBlockSize=17 maxBlockSize=42), multiDefault=PostingsFormat(name=Lucene40WithOrds), a_si=PostingsFormat(name=Lucene40WithOrds)}, sim=RandomSimilarityProvider(queryNorm=false,coord=crazy): {}, locale=in, timezone=Brazil/West
[junit4:junit4]   2> NOTE: FreeBSD 9.0-RELEASE amd64/Oracle Corporation 1.7.0_06 (64-bit)/cpus=16,threads=1,free=74877440,total=125829120
[junit4:junit4]   2> NOTE: All tests run in this JVM: [BasicDistributedZk2Test, SyncSliceTest]
[junit4:junit4] Completed on J1 in 136.49s, 1 test, 1 failure <<< FAILURES!

[...truncated 529 lines...]
BUILD FAILED
/usr/home/hudson/hudson-slave/workspace/Lucene-Solr-Tests-4.x-java7/build.xml:32: The following error occurred while executing this line:
/usr/home/hudson/hudson-slave/workspace/Lucene-Solr-Tests-4.x-java7/solr/build.xml:179: The following error occurred while executing this line:
/usr/home/hudson/hudson-slave/workspace/Lucene-Solr-Tests-4.x-java7/lucene/module-build.xml:63: The following error occurred while executing this line:
/usr/home/hudson/hudson-slave/workspace/Lucene-Solr-Tests-4.x-java7/lucene/common-build.xml:1141: The following error occurred while executing this line:
/usr/home/hudson/hudson-slave/workspace/Lucene-Solr-Tests-4.x-java7/lucene/common-build.xml:814: There were test failures: 231 suites, 954 tests, 2 failures, 21 ignored (3 assumptions)

Total time: 32 minutes 47 seconds
Build step 'Invoke Ant' marked build as failure
Recording test results
Email was triggered for: Failure
Sending email for trigger: Failure



Mime
View raw message