lucene-dev mailing list archives

Site index · List index
Message view « Date » · « Thread »
Top « Date » · « Thread »
From Apache Jenkins Server <jenk...@builds.apache.org>
Subject [JENKINS] Lucene-Solr-Tests-trunk-java7 - Build # 3206 - Still Failing
Date Sat, 15 Sep 2012 02:24:04 GMT
Build: https://builds.apache.org/job/Lucene-Solr-Tests-trunk-java7/3206/

2 tests failed.
REGRESSION:  org.apache.solr.cloud.SyncSliceTest.testDistribSearch

Error Message:
There are still nodes recoverying

Stack Trace:
java.lang.AssertionError: There are still nodes recoverying
	at __randomizedtesting.SeedInfo.seed([1380C11BD2E349BE:92664F03A5BC2982]:0)
	at org.junit.Assert.fail(Assert.java:93)
	at org.apache.solr.cloud.AbstractDistribZkTestBase.waitForRecoveriesToFinish(AbstractDistribZkTestBase.java:153)
	at org.apache.solr.cloud.AbstractFullDistribZkTestBase.waitForRecoveriesToFinish(AbstractFullDistribZkTestBase.java:555)
	at org.apache.solr.cloud.AbstractFullDistribZkTestBase.waitForThingsToLevelOut(AbstractFullDistribZkTestBase.java:1130)
	at org.apache.solr.cloud.SyncSliceTest.doTest(SyncSliceTest.java:162)
	at org.apache.solr.BaseDistributedSearchTestCase.testDistribSearch(BaseDistributedSearchTestCase.java:691)
	at sun.reflect.NativeMethodAccessorImpl.invoke0(Native Method)
	at sun.reflect.NativeMethodAccessorImpl.invoke(NativeMethodAccessorImpl.java:57)
	at sun.reflect.DelegatingMethodAccessorImpl.invoke(DelegatingMethodAccessorImpl.java:43)
	at java.lang.reflect.Method.invoke(Method.java:601)
	at com.carrotsearch.randomizedtesting.RandomizedRunner.invoke(RandomizedRunner.java:1559)
	at com.carrotsearch.randomizedtesting.RandomizedRunner.access$600(RandomizedRunner.java:79)
	at com.carrotsearch.randomizedtesting.RandomizedRunner$6.evaluate(RandomizedRunner.java:737)
	at com.carrotsearch.randomizedtesting.RandomizedRunner$7.evaluate(RandomizedRunner.java:773)
	at com.carrotsearch.randomizedtesting.RandomizedRunner$8.evaluate(RandomizedRunner.java:787)
	at com.carrotsearch.randomizedtesting.rules.SystemPropertiesRestoreRule$1.evaluate(SystemPropertiesRestoreRule.java:53)
	at org.apache.lucene.util.TestRuleSetupTeardownChained$1.evaluate(TestRuleSetupTeardownChained.java:50)
	at org.apache.lucene.util.TestRuleFieldCacheSanity$1.evaluate(TestRuleFieldCacheSanity.java:51)
	at org.apache.lucene.util.AbstractBeforeAfterRule$1.evaluate(AbstractBeforeAfterRule.java:45)
	at com.carrotsearch.randomizedtesting.rules.SystemPropertiesInvariantRule$1.evaluate(SystemPropertiesInvariantRule.java:55)
	at org.apache.lucene.util.TestRuleThreadAndTestName$1.evaluate(TestRuleThreadAndTestName.java:48)
	at org.apache.lucene.util.TestRuleIgnoreAfterMaxFailures$1.evaluate(TestRuleIgnoreAfterMaxFailures.java:70)
	at org.apache.lucene.util.TestRuleMarkFailure$1.evaluate(TestRuleMarkFailure.java:48)
	at com.carrotsearch.randomizedtesting.rules.StatementAdapter.evaluate(StatementAdapter.java:36)
	at com.carrotsearch.randomizedtesting.ThreadLeakControl$StatementRunner.run(ThreadLeakControl.java:358)
	at com.carrotsearch.randomizedtesting.ThreadLeakControl.forkTimeoutingTask(ThreadLeakControl.java:782)
	at com.carrotsearch.randomizedtesting.ThreadLeakControl$3.evaluate(ThreadLeakControl.java:442)
	at com.carrotsearch.randomizedtesting.RandomizedRunner.runSingleTest(RandomizedRunner.java:746)
	at com.carrotsearch.randomizedtesting.RandomizedRunner$3.evaluate(RandomizedRunner.java:648)
	at com.carrotsearch.randomizedtesting.RandomizedRunner$4.evaluate(RandomizedRunner.java:682)
	at com.carrotsearch.randomizedtesting.RandomizedRunner$5.evaluate(RandomizedRunner.java:693)
	at com.carrotsearch.randomizedtesting.rules.StatementAdapter.evaluate(StatementAdapter.java:36)
	at com.carrotsearch.randomizedtesting.rules.SystemPropertiesRestoreRule$1.evaluate(SystemPropertiesRestoreRule.java:53)
	at org.apache.lucene.util.AbstractBeforeAfterRule$1.evaluate(AbstractBeforeAfterRule.java:45)
	at org.apache.lucene.util.TestRuleStoreClassName$1.evaluate(TestRuleStoreClassName.java:42)
	at com.carrotsearch.randomizedtesting.rules.SystemPropertiesInvariantRule$1.evaluate(SystemPropertiesInvariantRule.java:55)
	at com.carrotsearch.randomizedtesting.rules.NoShadowingOrOverridesOnMethodsRule$1.evaluate(NoShadowingOrOverridesOnMethodsRule.java:39)
	at com.carrotsearch.randomizedtesting.rules.NoShadowingOrOverridesOnMethodsRule$1.evaluate(NoShadowingOrOverridesOnMethodsRule.java:39)
	at com.carrotsearch.randomizedtesting.rules.StatementAdapter.evaluate(StatementAdapter.java:36)
	at org.apache.lucene.util.TestRuleAssertionsRequired$1.evaluate(TestRuleAssertionsRequired.java:43)
	at org.apache.lucene.util.TestRuleMarkFailure$1.evaluate(TestRuleMarkFailure.java:48)
	at org.apache.lucene.util.TestRuleIgnoreAfterMaxFailures$1.evaluate(TestRuleIgnoreAfterMaxFailures.java:70)
	at org.apache.lucene.util.TestRuleIgnoreTestSuites$1.evaluate(TestRuleIgnoreTestSuites.java:55)
	at com.carrotsearch.randomizedtesting.rules.StatementAdapter.evaluate(StatementAdapter.java:36)
	at com.carrotsearch.randomizedtesting.ThreadLeakControl$StatementRunner.run(ThreadLeakControl.java:358)
	at java.lang.Thread.run(Thread.java:722)


FAILED:  org.apache.solr.update.SolrCmdDistributorTest.testDistribSearch

Error Message:
Task java.util.concurrent.ExecutorCompletionService$QueueingFuture@496a86b9 rejected from java.util.concurrent.ThreadPoolExecutor@781ceee7[Running, pool size = 80, active threads = 80, queued tasks = 0, completed tasks = 30]

Stack Trace:
java.util.concurrent.RejectedExecutionException: Task java.util.concurrent.ExecutorCompletionService$QueueingFuture@496a86b9 rejected from java.util.concurrent.ThreadPoolExecutor@781ceee7[Running, pool size = 80, active threads = 80, queued tasks = 0, completed tasks = 30]
	at __randomizedtesting.SeedInfo.seed([1380C11BD2E349BE:92664F03A5BC2982]:0)
	at java.util.concurrent.ThreadPoolExecutor$AbortPolicy.rejectedExecution(ThreadPoolExecutor.java:2013)
	at java.util.concurrent.ThreadPoolExecutor.reject(ThreadPoolExecutor.java:816)
	at java.util.concurrent.ThreadPoolExecutor.execute(ThreadPoolExecutor.java:1337)
	at java.util.concurrent.ExecutorCompletionService.submit(ExecutorCompletionService.java:181)
	at org.apache.solr.update.SolrCmdDistributor.submit(SolrCmdDistributor.java:356)
	at org.apache.solr.update.SolrCmdDistributor.submit(SolrCmdDistributor.java:301)
	at org.apache.solr.update.SolrCmdDistributor.flushAdds(SolrCmdDistributor.java:233)
	at org.apache.solr.update.SolrCmdDistributor.distribAdd(SolrCmdDistributor.java:147)
	at org.apache.solr.update.SolrCmdDistributorTest.doTest(SolrCmdDistributorTest.java:204)
	at org.apache.solr.BaseDistributedSearchTestCase.testDistribSearch(BaseDistributedSearchTestCase.java:691)
	at sun.reflect.NativeMethodAccessorImpl.invoke0(Native Method)
	at sun.reflect.NativeMethodAccessorImpl.invoke(NativeMethodAccessorImpl.java:57)
	at sun.reflect.DelegatingMethodAccessorImpl.invoke(DelegatingMethodAccessorImpl.java:43)
	at java.lang.reflect.Method.invoke(Method.java:601)
	at com.carrotsearch.randomizedtesting.RandomizedRunner.invoke(RandomizedRunner.java:1559)
	at com.carrotsearch.randomizedtesting.RandomizedRunner.access$600(RandomizedRunner.java:79)
	at com.carrotsearch.randomizedtesting.RandomizedRunner$6.evaluate(RandomizedRunner.java:737)
	at com.carrotsearch.randomizedtesting.RandomizedRunner$7.evaluate(RandomizedRunner.java:773)
	at com.carrotsearch.randomizedtesting.RandomizedRunner$8.evaluate(RandomizedRunner.java:787)
	at com.carrotsearch.randomizedtesting.rules.SystemPropertiesRestoreRule$1.evaluate(SystemPropertiesRestoreRule.java:53)
	at org.apache.lucene.util.TestRuleSetupTeardownChained$1.evaluate(TestRuleSetupTeardownChained.java:50)
	at org.apache.lucene.util.TestRuleFieldCacheSanity$1.evaluate(TestRuleFieldCacheSanity.java:51)
	at org.apache.lucene.util.AbstractBeforeAfterRule$1.evaluate(AbstractBeforeAfterRule.java:45)
	at com.carrotsearch.randomizedtesting.rules.SystemPropertiesInvariantRule$1.evaluate(SystemPropertiesInvariantRule.java:55)
	at org.apache.lucene.util.TestRuleThreadAndTestName$1.evaluate(TestRuleThreadAndTestName.java:48)
	at org.apache.lucene.util.TestRuleIgnoreAfterMaxFailures$1.evaluate(TestRuleIgnoreAfterMaxFailures.java:70)
	at org.apache.lucene.util.TestRuleMarkFailure$1.evaluate(TestRuleMarkFailure.java:48)
	at com.carrotsearch.randomizedtesting.rules.StatementAdapter.evaluate(StatementAdapter.java:36)
	at com.carrotsearch.randomizedtesting.ThreadLeakControl$StatementRunner.run(ThreadLeakControl.java:358)
	at com.carrotsearch.randomizedtesting.ThreadLeakControl.forkTimeoutingTask(ThreadLeakControl.java:782)
	at com.carrotsearch.randomizedtesting.ThreadLeakControl$3.evaluate(ThreadLeakControl.java:442)
	at com.carrotsearch.randomizedtesting.RandomizedRunner.runSingleTest(RandomizedRunner.java:746)
	at com.carrotsearch.randomizedtesting.RandomizedRunner$3.evaluate(RandomizedRunner.java:648)
	at com.carrotsearch.randomizedtesting.RandomizedRunner$4.evaluate(RandomizedRunner.java:682)
	at com.carrotsearch.randomizedtesting.RandomizedRunner$5.evaluate(RandomizedRunner.java:693)
	at com.carrotsearch.randomizedtesting.rules.StatementAdapter.evaluate(StatementAdapter.java:36)
	at com.carrotsearch.randomizedtesting.rules.SystemPropertiesRestoreRule$1.evaluate(SystemPropertiesRestoreRule.java:53)
	at org.apache.lucene.util.AbstractBeforeAfterRule$1.evaluate(AbstractBeforeAfterRule.java:45)
	at org.apache.lucene.util.TestRuleStoreClassName$1.evaluate(TestRuleStoreClassName.java:42)
	at com.carrotsearch.randomizedtesting.rules.SystemPropertiesInvariantRule$1.evaluate(SystemPropertiesInvariantRule.java:55)
	at com.carrotsearch.randomizedtesting.rules.NoShadowingOrOverridesOnMethodsRule$1.evaluate(NoShadowingOrOverridesOnMethodsRule.java:39)
	at com.carrotsearch.randomizedtesting.rules.NoShadowingOrOverridesOnMethodsRule$1.evaluate(NoShadowingOrOverridesOnMethodsRule.java:39)
	at com.carrotsearch.randomizedtesting.rules.StatementAdapter.evaluate(StatementAdapter.java:36)
	at org.apache.lucene.util.TestRuleAssertionsRequired$1.evaluate(TestRuleAssertionsRequired.java:43)
	at org.apache.lucene.util.TestRuleMarkFailure$1.evaluate(TestRuleMarkFailure.java:48)
	at org.apache.lucene.util.TestRuleIgnoreAfterMaxFailures$1.evaluate(TestRuleIgnoreAfterMaxFailures.java:70)
	at org.apache.lucene.util.TestRuleIgnoreTestSuites$1.evaluate(TestRuleIgnoreTestSuites.java:55)
	at com.carrotsearch.randomizedtesting.rules.StatementAdapter.evaluate(StatementAdapter.java:36)
	at com.carrotsearch.randomizedtesting.ThreadLeakControl$StatementRunner.run(ThreadLeakControl.java:358)
	at java.lang.Thread.run(Thread.java:722)




Build Log:
[...truncated 8134 lines...]
[junit4:junit4] Suite: org.apache.solr.update.SolrCmdDistributorTest
[junit4:junit4]   2> 2 T1805 oas.SolrTestCaseJ4.setUp ###Starting testDistribSearch
[junit4:junit4]   2> 4 T1805 oejs.Server.doStart jetty-8.1.2.v20120308
[junit4:junit4]   2> 8 T1805 oejs.AbstractConnector.doStart Started SocketConnector@0.0.0.0:53380
[junit4:junit4]   2> 8 T1805 oasc.SolrResourceLoader.locateSolrHome JNDI not configured for solr (NoInitialContextEx)
[junit4:junit4]   2> 9 T1805 oasc.SolrResourceLoader.locateSolrHome using system property solr.solr.home: /usr/home/hudson/hudson-slave/workspace/Lucene-Solr-Tests-trunk-java7/solr/build/solr-core/test-files/solr
[junit4:junit4]   2> 9 T1805 oasc.SolrResourceLoader.<init> new SolrResourceLoader for deduced Solr Home: '/usr/home/hudson/hudson-slave/workspace/Lucene-Solr-Tests-trunk-java7/solr/build/solr-core/test-files/solr/'
[junit4:junit4]   2> 39 T1805 oass.SolrDispatchFilter.init SolrDispatchFilter.init()
[junit4:junit4]   2> 39 T1805 oasc.SolrResourceLoader.locateSolrHome JNDI not configured for solr (NoInitialContextEx)
[junit4:junit4]   2> 40 T1805 oasc.SolrResourceLoader.locateSolrHome using system property solr.solr.home: /usr/home/hudson/hudson-slave/workspace/Lucene-Solr-Tests-trunk-java7/solr/build/solr-core/test-files/solr
[junit4:junit4]   2> 40 T1805 oasc.CoreContainer$Initializer.initialize looking for solr.xml: /usr/home/hudson/hudson-slave/workspace/Lucene-Solr-Tests-trunk-java7/solr/build/solr-core/test-files/solr/solr.xml
[junit4:junit4]   2> 40 T1805 oasc.CoreContainer.<init> New CoreContainer 260128061
[junit4:junit4]   2> 41 T1805 oasc.CoreContainer.load Loading CoreContainer using Solr Home: '/usr/home/hudson/hudson-slave/workspace/Lucene-Solr-Tests-trunk-java7/solr/build/solr-core/test-files/solr/'
[junit4:junit4]   2> 41 T1805 oasc.SolrResourceLoader.<init> new SolrResourceLoader for directory: '/usr/home/hudson/hudson-slave/workspace/Lucene-Solr-Tests-trunk-java7/solr/build/solr-core/test-files/solr/'
[junit4:junit4]   2> 65 T1805 oasc.CoreContainer.load Registering Log Listener
[junit4:junit4]   2> 80 T1805 oasc.CoreContainer.create Creating SolrCore 'collection1' using instanceDir: /usr/home/hudson/hudson-slave/workspace/Lucene-Solr-Tests-trunk-java7/solr/build/solr-core/test-files/solr/collection1
[junit4:junit4]   2> 81 T1805 oasc.SolrResourceLoader.<init> new SolrResourceLoader for directory: '/usr/home/hudson/hudson-slave/workspace/Lucene-Solr-Tests-trunk-java7/solr/build/solr-core/test-files/solr/collection1/'
[junit4:junit4]   2> 82 T1805 oasc.SolrResourceLoader.replaceClassLoader Adding 'file:/usr/home/hudson/hudson-slave/workspace/Lucene-Solr-Tests-trunk-java7/solr/build/solr-core/test-files/solr/collection1/lib/classes/' to classloader
[junit4:junit4]   2> 82 T1805 oasc.SolrResourceLoader.replaceClassLoader Adding 'file:/usr/home/hudson/hudson-slave/workspace/Lucene-Solr-Tests-trunk-java7/solr/build/solr-core/test-files/solr/collection1/lib/README' to classloader
[junit4:junit4]   2> 113 T1805 oasc.SolrConfig.<init> Using Lucene MatchVersion: LUCENE_50
[junit4:junit4]   2> 150 T1805 oasc.SolrConfig.<init> Loaded SolrConfig: solrconfig-tlog.xml
[junit4:junit4]   2> 151 T1805 oass.IndexSchema.readSchema Reading Solr Schema
[junit4:junit4]   2> 155 T1805 oass.IndexSchema.readSchema Schema name=test
[junit4:junit4]   2> 597 T1805 oass.OpenExchangeRatesOrgProvider.init Initialized with rates=open-exchange-rates.json, refreshInterval=1440.
[junit4:junit4]   2> 605 T1805 oass.IndexSchema.readSchema default search field in schema is text
[junit4:junit4]   2> 609 T1805 oass.IndexSchema.readSchema unique key field: id
[junit4:junit4]   2> 615 T1805 oass.FileExchangeRateProvider.reload Reloading exchange rates from file currency.xml
[junit4:junit4]   2> 619 T1805 oass.FileExchangeRateProvider.reload Reloading exchange rates from file currency.xml
[junit4:junit4]   2> 622 T1805 oass.OpenExchangeRatesOrgProvider.reload Reloading exchange rates from open-exchange-rates.json
[junit4:junit4]   2> 623 T1805 oass.OpenExchangeRatesOrgProvider.reload Reloading exchange rates from open-exchange-rates.json
[junit4:junit4]   2> 623 T1805 oasc.SolrCore.<init> [collection1] Opening new SolrCore at /usr/home/hudson/hudson-slave/workspace/Lucene-Solr-Tests-trunk-java7/solr/build/solr-core/test-files/solr/collection1/, dataDir=./org.apache.solr.update.SolrCmdDistributorTest-1347675669079/control/data/
[junit4:junit4]   2> 623 T1805 oasc.SolrCore.<init> JMX monitoring not detected for core: collection1
[junit4:junit4]   2> 624 T1805 oasc.SolrCore.getNewIndexDir WARNING New index directory detected: old=null new=./org.apache.solr.update.SolrCmdDistributorTest-1347675669079/control/data/index/
[junit4:junit4]   2> 625 T1805 oasc.SolrCore.initIndex WARNING [collection1] Solr index directory './org.apache.solr.update.SolrCmdDistributorTest-1347675669079/control/data/index' doesn't exist. Creating new index...
[junit4:junit4]   2> 626 T1805 oasc.CachingDirectoryFactory.get return new directory for /usr/home/hudson/hudson-slave/workspace/Lucene-Solr-Tests-trunk-java7/solr/build/solr-core/test/J1/./org.apache.solr.update.SolrCmdDistributorTest-1347675669079/control/data/index forceNew:false
[junit4:junit4]   2> 629 T1805 oasc.SolrDeletionPolicy.onCommit SolrDeletionPolicy.onCommit: commits:num=1
[junit4:junit4]   2> 		commit{dir=MockDirWrapper(org.apache.lucene.store.RAMDirectory@3097d494 lockFactory=org.apache.lucene.store.NativeFSLockFactory@1f34f61e),segFN=segments_1,generation=1,filenames=[segments_1]
[junit4:junit4]   2> 629 T1805 oasc.SolrDeletionPolicy.updateCommits newest commit = 1
[junit4:junit4]   2> 630 T1805 oasc.RequestHandlers.initHandlersFromConfig created standard: solr.StandardRequestHandler
[junit4:junit4]   2> 630 T1805 oasc.RequestHandlers.initHandlersFromConfig created /get: solr.RealTimeGetHandler
[junit4:junit4]   2> 631 T1805 oasc.RequestHandlers.initHandlersFromConfig created /update: solr.UpdateRequestHandler
[junit4:junit4]   2> 631 T1805 oasc.RequestHandlers.initHandlersFromConfig created /admin/: org.apache.solr.handler.admin.AdminHandlers
[junit4:junit4]   2> 634 T1805 oashl.XMLLoader.init xsltCacheLifetimeSeconds=60
[junit4:junit4]   2> 639 T1805 oass.SolrIndexSearcher.<init> Opening Searcher@91e7572 main
[junit4:junit4]   2> 640 T1805 oass.SolrIndexSearcher.getIndexDir WARNING WARNING: Directory impl does not support setting indexDir: org.apache.lucene.store.MockDirectoryWrapper
[junit4:junit4]   2> 641 T1805 oasu.CommitTracker.<init> Hard AutoCommit: disabled
[junit4:junit4]   2> 641 T1805 oasu.CommitTracker.<init> Soft AutoCommit: disabled
[junit4:junit4]   2> 641 T1805 oashc.HttpShardHandlerFactory.getParameter Setting socketTimeout to: 0
[junit4:junit4]   2> 642 T1805 oashc.HttpShardHandlerFactory.getParameter Setting urlScheme to: http://
[junit4:junit4]   2> 642 T1805 oashc.HttpShardHandlerFactory.getParameter Setting connTimeout to: 0
[junit4:junit4]   2> 642 T1805 oashc.HttpShardHandlerFactory.getParameter Setting maxConnectionsPerHost to: 20
[junit4:junit4]   2> 643 T1805 oashc.HttpShardHandlerFactory.getParameter Setting corePoolSize to: 0
[junit4:junit4]   2> 643 T1805 oashc.HttpShardHandlerFactory.getParameter Setting maximumPoolSize to: 2147483647
[junit4:junit4]   2> 643 T1805 oashc.HttpShardHandlerFactory.getParameter Setting maxThreadIdleTime to: 5
[junit4:junit4]   2> 644 T1805 oashc.HttpShardHandlerFactory.getParameter Setting sizeOfQueue to: -1
[junit4:junit4]   2> 644 T1805 oashc.HttpShardHandlerFactory.getParameter Setting fairnessPolicy to: false
[junit4:junit4]   2> 644 T1805 oascsi.HttpClientUtil.createClient Creating new http client, config:maxConnectionsPerHost=20&maxConnections=10000&socketTimeout=0&connTimeout=0&retry=false
[junit4:junit4]   2> 656 T1815 oasc.SolrCore.registerSearcher [collection1] Registered new searcher Searcher@91e7572 main{StandardDirectoryReader(segments_1:1)}
[junit4:junit4]   2> 656 T1805 oasc.CoreContainer.register registering core: collection1
[junit4:junit4]   2> 657 T1805 oass.SolrDispatchFilter.init user.dir=/usr/home/hudson/hudson-slave/workspace/Lucene-Solr-Tests-trunk-java7/solr/build/solr-core/test/J1
[junit4:junit4]   2> 657 T1805 oass.SolrDispatchFilter.init SolrDispatchFilter.init() done
[junit4:junit4]   2> 657 T1805 oascsi.HttpClientUtil.createClient Creating new http client, config:maxConnections=128&maxConnectionsPerHost=32&followRedirects=false
[junit4:junit4]   2> 666 T1805 oejs.Server.doStart jetty-8.1.2.v20120308
[junit4:junit4]   2> 668 T1805 oejs.AbstractConnector.doStart Started SocketConnector@0.0.0.0:47648
[junit4:junit4]   2> 669 T1805 oasc.SolrResourceLoader.locateSolrHome JNDI not configured for solr (NoInitialContextEx)
[junit4:junit4]   2> 669 T1805 oasc.SolrResourceLoader.locateSolrHome using system property solr.solr.home: /usr/home/hudson/hudson-slave/workspace/Lucene-Solr-Tests-trunk-java7/solr/build/solr-core/test-files/solr
[junit4:junit4]   2> 669 T1805 oasc.SolrResourceLoader.<init> new SolrResourceLoader for deduced Solr Home: '/usr/home/hudson/hudson-slave/workspace/Lucene-Solr-Tests-trunk-java7/solr/build/solr-core/test-files/solr/'
[junit4:junit4]   2> 696 T1805 oass.SolrDispatchFilter.init SolrDispatchFilter.init()
[junit4:junit4]   2> 696 T1805 oasc.SolrResourceLoader.locateSolrHome JNDI not configured for solr (NoInitialContextEx)
[junit4:junit4]   2> 697 T1805 oasc.SolrResourceLoader.locateSolrHome using system property solr.solr.home: /usr/home/hudson/hudson-slave/workspace/Lucene-Solr-Tests-trunk-java7/solr/build/solr-core/test-files/solr
[junit4:junit4]   2> 697 T1805 oasc.CoreContainer$Initializer.initialize looking for solr.xml: /usr/home/hudson/hudson-slave/workspace/Lucene-Solr-Tests-trunk-java7/solr/build/solr-core/test-files/solr/solr.xml
[junit4:junit4]   2> 697 T1805 oasc.CoreContainer.<init> New CoreContainer 987687126
[junit4:junit4]   2> 698 T1805 oasc.CoreContainer.load Loading CoreContainer using Solr Home: '/usr/home/hudson/hudson-slave/workspace/Lucene-Solr-Tests-trunk-java7/solr/build/solr-core/test-files/solr/'
[junit4:junit4]   2> 698 T1805 oasc.SolrResourceLoader.<init> new SolrResourceLoader for directory: '/usr/home/hudson/hudson-slave/workspace/Lucene-Solr-Tests-trunk-java7/solr/build/solr-core/test-files/solr/'
[junit4:junit4]   2> 722 T1805 oasc.CoreContainer.load Registering Log Listener
[junit4:junit4]   2> 736 T1805 oasc.CoreContainer.create Creating SolrCore 'collection1' using instanceDir: /usr/home/hudson/hudson-slave/workspace/Lucene-Solr-Tests-trunk-java7/solr/build/solr-core/test-files/solr/collection1
[junit4:junit4]   2> 737 T1805 oasc.SolrResourceLoader.<init> new SolrResourceLoader for directory: '/usr/home/hudson/hudson-slave/workspace/Lucene-Solr-Tests-trunk-java7/solr/build/solr-core/test-files/solr/collection1/'
[junit4:junit4]   2> 738 T1805 oasc.SolrResourceLoader.replaceClassLoader Adding 'file:/usr/home/hudson/hudson-slave/workspace/Lucene-Solr-Tests-trunk-java7/solr/build/solr-core/test-files/solr/collection1/lib/classes/' to classloader
[junit4:junit4]   2> 739 T1805 oasc.SolrResourceLoader.replaceClassLoader Adding 'file:/usr/home/hudson/hudson-slave/workspace/Lucene-Solr-Tests-trunk-java7/solr/build/solr-core/test-files/solr/collection1/lib/README' to classloader
[junit4:junit4]   2> 771 T1805 oasc.SolrConfig.<init> Using Lucene MatchVersion: LUCENE_50
[junit4:junit4]   2> 807 T1805 oasc.SolrConfig.<init> Loaded SolrConfig: solrconfig-tlog.xml
[junit4:junit4]   2> 808 T1805 oass.IndexSchema.readSchema Reading Solr Schema
[junit4:junit4]   2> 812 T1805 oass.IndexSchema.readSchema Schema name=test
[junit4:junit4]   2> 1293 T1805 oass.OpenExchangeRatesOrgProvider.init Initialized with rates=open-exchange-rates.json, refreshInterval=1440.
[junit4:junit4]   2> 1302 T1805 oass.IndexSchema.readSchema default search field in schema is text
[junit4:junit4]   2> 1321 T1805 oass.IndexSchema.readSchema unique key field: id
[junit4:junit4]   2> 1329 T1805 oass.FileExchangeRateProvider.reload Reloading exchange rates from file currency.xml
[junit4:junit4]   2> 1333 T1805 oass.FileExchangeRateProvider.reload Reloading exchange rates from file currency.xml
[junit4:junit4]   2> 1336 T1805 oass.OpenExchangeRatesOrgProvider.reload Reloading exchange rates from open-exchange-rates.json
[junit4:junit4]   2> 1337 T1805 oass.OpenExchangeRatesOrgProvider.reload Reloading exchange rates from open-exchange-rates.json
[junit4:junit4]   2> 1338 T1805 oasc.SolrCore.<init> [collection1] Opening new SolrCore at /usr/home/hudson/hudson-slave/workspace/Lucene-Solr-Tests-trunk-java7/solr/build/solr-core/test-files/solr/collection1/, dataDir=./org.apache.solr.update.SolrCmdDistributorTest-1347675669079/shard0/data/
[junit4:junit4]   2> 1338 T1805 oasc.SolrCore.<init> JMX monitoring not detected for core: collection1
[junit4:junit4]   2> 1339 T1805 oasc.SolrCore.getNewIndexDir WARNING New index directory detected: old=null new=./org.apache.solr.update.SolrCmdDistributorTest-1347675669079/shard0/data/index/
[junit4:junit4]   2> 1340 T1805 oasc.SolrCore.initIndex WARNING [collection1] Solr index directory './org.apache.solr.update.SolrCmdDistributorTest-1347675669079/shard0/data/index' doesn't exist. Creating new index...
[junit4:junit4]   2> 1340 T1805 oasc.CachingDirectoryFactory.get return new directory for /usr/home/hudson/hudson-slave/workspace/Lucene-Solr-Tests-trunk-java7/solr/build/solr-core/test/J1/./org.apache.solr.update.SolrCmdDistributorTest-1347675669079/shard0/data/index forceNew:false
[junit4:junit4]   2> 1343 T1805 oasc.SolrDeletionPolicy.onCommit SolrDeletionPolicy.onCommit: commits:num=1
[junit4:junit4]   2> 		commit{dir=MockDirWrapper(org.apache.lucene.store.RAMDirectory@4e8a7c88 lockFactory=org.apache.lucene.store.NativeFSLockFactory@749acf4b),segFN=segments_1,generation=1,filenames=[segments_1]
[junit4:junit4]   2> 1344 T1805 oasc.SolrDeletionPolicy.updateCommits newest commit = 1
[junit4:junit4]   2> 1345 T1805 oasc.RequestHandlers.initHandlersFromConfig created standard: solr.StandardRequestHandler
[junit4:junit4]   2> 1345 T1805 oasc.RequestHandlers.initHandlersFromConfig created /get: solr.RealTimeGetHandler
[junit4:junit4]   2> 1345 T1805 oasc.RequestHandlers.initHandlersFromConfig created /update: solr.UpdateRequestHandler
[junit4:junit4]   2> 1346 T1805 oasc.RequestHandlers.initHandlersFromConfig created /admin/: org.apache.solr.handler.admin.AdminHandlers
[junit4:junit4]   2> 1349 T1805 oashl.XMLLoader.init xsltCacheLifetimeSeconds=60
[junit4:junit4]   2> 1354 T1805 oass.SolrIndexSearcher.<init> Opening Searcher@774b9599 main
[junit4:junit4]   2> 1354 T1805 oass.SolrIndexSearcher.getIndexDir WARNING WARNING: Directory impl does not support setting indexDir: org.apache.lucene.store.MockDirectoryWrapper
[junit4:junit4]   2> 1355 T1805 oasu.CommitTracker.<init> Hard AutoCommit: disabled
[junit4:junit4]   2> 1356 T1805 oasu.CommitTracker.<init> Soft AutoCommit: disabled
[junit4:junit4]   2> 1356 T1805 oashc.HttpShardHandlerFactory.getParameter Setting socketTimeout to: 0
[junit4:junit4]   2> 1357 T1805 oashc.HttpShardHandlerFactory.getParameter Setting urlScheme to: http://
[junit4:junit4]   2> 1357 T1805 oashc.HttpShardHandlerFactory.getParameter Setting connTimeout to: 0
[junit4:junit4]   2> 1357 T1805 oashc.HttpShardHandlerFactory.getParameter Setting maxConnectionsPerHost to: 20
[junit4:junit4]   2> 1358 T1805 oashc.HttpShardHandlerFactory.getParameter Setting corePoolSize to: 0
[junit4:junit4]   2> 1358 T1805 oashc.HttpShardHandlerFactory.getParameter Setting maximumPoolSize to: 2147483647
[junit4:junit4]   2> 1358 T1805 oashc.HttpShardHandlerFactory.getParameter Setting maxThreadIdleTime to: 5
[junit4:junit4]   2> 1359 T1805 oashc.HttpShardHandlerFactory.getParameter Setting sizeOfQueue to: -1
[junit4:junit4]   2> 1359 T1805 oashc.HttpShardHandlerFactory.getParameter Setting fairnessPolicy to: false
[junit4:junit4]   2> 1359 T1805 oascsi.HttpClientUtil.createClient Creating new http client, config:maxConnectionsPerHost=20&maxConnections=10000&socketTimeout=0&connTimeout=0&retry=false
[junit4:junit4]   2> 1370 T1825 oasc.SolrCore.registerSearcher [collection1] Registered new searcher Searcher@774b9599 main{StandardDirectoryReader(segments_1:1)}
[junit4:junit4]   2> 1370 T1805 oasc.CoreContainer.register registering core: collection1
[junit4:junit4]   2> 1371 T1805 oass.SolrDispatchFilter.init user.dir=/usr/home/hudson/hudson-slave/workspace/Lucene-Solr-Tests-trunk-java7/solr/build/solr-core/test/J1
[junit4:junit4]   2> 1371 T1805 oass.SolrDispatchFilter.init SolrDispatchFilter.init() done
[junit4:junit4]   2> 1371 T1805 oascsi.HttpClientUtil.createClient Creating new http client, config:maxConnections=128&maxConnectionsPerHost=32&followRedirects=false
[junit4:junit4]   2> 1379 T1805 oejs.Server.doStart jetty-8.1.2.v20120308
[junit4:junit4]   2> 1381 T1805 oejs.AbstractConnector.doStart Started SocketConnector@0.0.0.0:50701
[junit4:junit4]   2> 1381 T1805 oasc.SolrResourceLoader.locateSolrHome JNDI not configured for solr (NoInitialContextEx)
[junit4:junit4]   2> 1382 T1805 oasc.SolrResourceLoader.locateSolrHome using system property solr.solr.home: /usr/home/hudson/hudson-slave/workspace/Lucene-Solr-Tests-trunk-java7/solr/build/solr-core/test-files/solr
[junit4:junit4]   2> 1382 T1805 oasc.SolrResourceLoader.<init> new SolrResourceLoader for deduced Solr Home: '/usr/home/hudson/hudson-slave/workspace/Lucene-Solr-Tests-trunk-java7/solr/build/solr-core/test-files/solr/'
[junit4:junit4]   2> 1415 T1805 oass.SolrDispatchFilter.init SolrDispatchFilter.init()
[junit4:junit4]   2> 1416 T1805 oasc.SolrResourceLoader.locateSolrHome JNDI not configured for solr (NoInitialContextEx)
[junit4:junit4]   2> 1416 T1805 oasc.SolrResourceLoader.locateSolrHome using system property solr.solr.home: /usr/home/hudson/hudson-slave/workspace/Lucene-Solr-Tests-trunk-java7/solr/build/solr-core/test-files/solr
[junit4:junit4]   2> 1416 T1805 oasc.CoreContainer$Initializer.initialize looking for solr.xml: /usr/home/hudson/hudson-slave/workspace/Lucene-Solr-Tests-trunk-java7/solr/build/solr-core/test-files/solr/solr.xml
[junit4:junit4]   2> 1417 T1805 oasc.CoreContainer.<init> New CoreContainer 1181956074
[junit4:junit4]   2> 1417 T1805 oasc.CoreContainer.load Loading CoreContainer using Solr Home: '/usr/home/hudson/hudson-slave/workspace/Lucene-Solr-Tests-trunk-java7/solr/build/solr-core/test-files/solr/'
[junit4:junit4]   2> 1418 T1805 oasc.SolrResourceLoader.<init> new SolrResourceLoader for directory: '/usr/home/hudson/hudson-slave/workspace/Lucene-Solr-Tests-trunk-java7/solr/build/solr-core/test-files/solr/'
[junit4:junit4]   2> 1444 T1805 oasc.CoreContainer.load Registering Log Listener
[junit4:junit4]   2> 1460 T1805 oasc.CoreContainer.create Creating SolrCore 'collection1' using instanceDir: /usr/home/hudson/hudson-slave/workspace/Lucene-Solr-Tests-trunk-java7/solr/build/solr-core/test-files/solr/collection1
[junit4:junit4]   2> 1461 T1805 oasc.SolrResourceLoader.<init> new SolrResourceLoader for directory: '/usr/home/hudson/hudson-slave/workspace/Lucene-Solr-Tests-trunk-java7/solr/build/solr-core/test-files/solr/collection1/'
[junit4:junit4]   2> 1462 T1805 oasc.SolrResourceLoader.replaceClassLoader Adding 'file:/usr/home/hudson/hudson-slave/workspace/Lucene-Solr-Tests-trunk-java7/solr/build/solr-core/test-files/solr/collection1/lib/classes/' to classloader
[junit4:junit4]   2> 1462 T1805 oasc.SolrResourceLoader.replaceClassLoader Adding 'file:/usr/home/hudson/hudson-slave/workspace/Lucene-Solr-Tests-trunk-java7/solr/build/solr-core/test-files/solr/collection1/lib/README' to classloader
[junit4:junit4]   2> 1496 T1805 oasc.SolrConfig.<init> Using Lucene MatchVersion: LUCENE_50
[junit4:junit4]   2> 1536 T1805 oasc.SolrConfig.<init> Loaded SolrConfig: solrconfig-tlog.xml
[junit4:junit4]   2> 1537 T1805 oass.IndexSchema.readSchema Reading Solr Schema
[junit4:junit4]   2> 1542 T1805 oass.IndexSchema.readSchema Schema name=test
[junit4:junit4]   2> 1977 T1805 oass.OpenExchangeRatesOrgProvider.init Initialized with rates=open-exchange-rates.json, refreshInterval=1440.
[junit4:junit4]   2> 1985 T1805 oass.IndexSchema.readSchema default search field in schema is text
[junit4:junit4]   2> 1988 T1805 oass.IndexSchema.readSchema unique key field: id
[junit4:junit4]   2> 1995 T1805 oass.FileExchangeRateProvider.reload Reloading exchange rates from file currency.xml
[junit4:junit4]   2> 1999 T1805 oass.FileExchangeRateProvider.reload Reloading exchange rates from file currency.xml
[junit4:junit4]   2> 2002 T1805 oass.OpenExchangeRatesOrgProvider.reload Reloading exchange rates from open-exchange-rates.json
[junit4:junit4]   2> 2003 T1805 oass.OpenExchangeRatesOrgProvider.reload Reloading exchange rates from open-exchange-rates.json
[junit4:junit4]   2> 2003 T1805 oasc.SolrCore.<init> [collection1] Opening new SolrCore at /usr/home/hudson/hudson-slave/workspace/Lucene-Solr-Tests-trunk-java7/solr/build/solr-core/test-files/solr/collection1/, dataDir=./org.apache.solr.update.SolrCmdDistributorTest-1347675669079/shard1/data/
[junit4:junit4]   2> 2004 T1805 oasc.SolrCore.<init> JMX monitoring not detected for core: collection1
[junit4:junit4]   2> 2004 T1805 oasc.SolrCore.getNewIndexDir WARNING New index directory detected: old=null new=./org.apache.solr.update.SolrCmdDistributorTest-1347675669079/shard1/data/index/
[junit4:junit4]   2> 2005 T1805 oasc.SolrCore.initIndex WARNING [collection1] Solr index directory './org.apache.solr.update.SolrCmdDistributorTest-1347675669079/shard1/data/index' doesn't exist. Creating new index...
[junit4:junit4]   2> 2006 T1805 oasc.CachingDirectoryFactory.get return new directory for /usr/home/hudson/hudson-slave/workspace/Lucene-Solr-Tests-trunk-java7/solr/build/solr-core/test/J1/./org.apache.solr.update.SolrCmdDistributorTest-1347675669079/shard1/data/index forceNew:false
[junit4:junit4]   2> 2008 T1805 oasc.SolrDeletionPolicy.onCommit SolrDeletionPolicy.onCommit: commits:num=1
[junit4:junit4]   2> 		commit{dir=MockDirWrapper(org.apache.lucene.store.RAMDirectory@7167a89c lockFactory=org.apache.lucene.store.NativeFSLockFactory@1bd576),segFN=segments_1,generation=1,filenames=[segments_1]
[junit4:junit4]   2> 2009 T1805 oasc.SolrDeletionPolicy.updateCommits newest commit = 1
[junit4:junit4]   2> 2010 T1805 oasc.RequestHandlers.initHandlersFromConfig created standard: solr.StandardRequestHandler
[junit4:junit4]   2> 2010 T1805 oasc.RequestHandlers.initHandlersFromConfig created /get: solr.RealTimeGetHandler
[junit4:junit4]   2> 2011 T1805 oasc.RequestHandlers.initHandlersFromConfig created /update: solr.UpdateRequestHandler
[junit4:junit4]   2> 2011 T1805 oasc.RequestHandlers.initHandlersFromConfig created /admin/: org.apache.solr.handler.admin.AdminHandlers
[junit4:junit4]   2> 2014 T1805 oashl.XMLLoader.init xsltCacheLifetimeSeconds=60
[junit4:junit4]   2> 2018 T1805 oass.SolrIndexSearcher.<init> Opening Searcher@54214c15 main
[junit4:junit4]   2> 2019 T1805 oass.SolrIndexSearcher.getIndexDir WARNING WARNING: Directory impl does not support setting indexDir: org.apache.lucene.store.MockDirectoryWrapper
[junit4:junit4]   2> 2020 T1805 oasu.CommitTracker.<init> Hard AutoCommit: disabled
[junit4:junit4]   2> 2020 T1805 oasu.CommitTracker.<init> Soft AutoCommit: disabled
[junit4:junit4]   2> 2020 T1805 oashc.HttpShardHandlerFactory.getParameter Setting socketTimeout to: 0
[junit4:junit4]   2> 2021 T1805 oashc.HttpShardHandlerFactory.getParameter Setting urlScheme to: http://
[junit4:junit4]   2> 2021 T1805 oashc.HttpShardHandlerFactory.getParameter Setting connTimeout to: 0
[junit4:junit4]   2> 2021 T1805 oashc.HttpShardHandlerFactory.getParameter Setting maxConnectionsPerHost to: 20
[junit4:junit4]   2> 2022 T1805 oashc.HttpShardHandlerFactory.getParameter Setting corePoolSize to: 0
[junit4:junit4]   2> 2022 T1805 oashc.HttpShardHandlerFactory.getParameter Setting maximumPoolSize to: 2147483647
[junit4:junit4]   2> 2022 T1805 oashc.HttpShardHandlerFactory.getParameter Setting maxThreadIdleTime to: 5
[junit4:junit4]   2> 2023 T1805 oashc.HttpShardHandlerFactory.getParameter Setting sizeOfQueue to: -1
[junit4:junit4]   2> 2023 T1805 oashc.HttpShardHandlerFactory.getParameter Setting fairnessPolicy to: false
[junit4:junit4]   2> 2023 T1805 oascsi.HttpClientUtil.createClient Creating new http client, config:maxConnectionsPerHost=20&maxConnections=10000&socketTimeout=0&connTimeout=0&retry=false
[junit4:junit4]   2> 2033 T1835 oasc.SolrCore.registerSearcher [collection1] Registered new searcher Searcher@54214c15 main{StandardDirectoryReader(segments_1:1)}
[junit4:junit4]   2> 2033 T1805 oasc.CoreContainer.register registering core: collection1
[junit4:junit4]   2> 2034 T1805 oass.SolrDispatchFilter.init user.dir=/usr/home/hudson/hudson-slave/workspace/Lucene-Solr-Tests-trunk-java7/solr/build/solr-core/test/J1
[junit4:junit4]   2> 2035 T1805 oass.SolrDispatchFilter.init SolrDispatchFilter.init() done
[junit4:junit4]   2> 2035 T1805 oascsi.HttpClientUtil.createClient Creating new http client, config:maxConnections=128&maxConnectionsPerHost=32&followRedirects=false
[junit4:junit4]   2> 2042 T1805 oejs.Server.doStart jetty-8.1.2.v20120308
[junit4:junit4]   2> 2045 T1805 oejs.AbstractConnector.doStart Started SocketConnector@0.0.0.0:41530
[junit4:junit4]   2> 2045 T1805 oasc.SolrResourceLoader.locateSolrHome JNDI not configured for solr (NoInitialContextEx)
[junit4:junit4]   2> 2046 T1805 oasc.SolrResourceLoader.locateSolrHome using system property solr.solr.home: /usr/home/hudson/hudson-slave/workspace/Lucene-Solr-Tests-trunk-java7/solr/build/solr-core/test-files/solr
[junit4:junit4]   2> 2046 T1805 oasc.SolrResourceLoader.<init> new SolrResourceLoader for deduced Solr Home: '/usr/home/hudson/hudson-slave/workspace/Lucene-Solr-Tests-trunk-java7/solr/build/solr-core/test-files/solr/'
[junit4:junit4]   2> 2074 T1805 oass.SolrDispatchFilter.init SolrDispatchFilter.init()
[junit4:junit4]   2> 2075 T1805 oasc.SolrResourceLoader.locateSolrHome JNDI not configured for solr (NoInitialContextEx)
[junit4:junit4]   2> 2075 T1805 oasc.SolrResourceLoader.locateSolrHome using system property solr.solr.home: /usr/home/hudson/hudson-slave/workspace/Lucene-Solr-Tests-trunk-java7/solr/build/solr-core/test-files/solr
[junit4:junit4]   2> 2075 T1805 oasc.CoreContainer$Initializer.initialize looking for solr.xml: /usr/home/hudson/hudson-slave/workspace/Lucene-Solr-Tests-trunk-java7/solr/build/solr-core/test-files/solr/solr.xml
[junit4:junit4]   2> 2075 T1805 oasc.CoreContainer.<init> New CoreContainer 1568880241
[junit4:junit4]   2> 2076 T1805 oasc.CoreContainer.load Loading CoreContainer using Solr Home: '/usr/home/hudson/hudson-slave/workspace/Lucene-Solr-Tests-trunk-java7/solr/build/solr-core/test-files/solr/'
[junit4:junit4]   2> 2076 T1805 oasc.SolrResourceLoader.<init> new SolrResourceLoader for directory: '/usr/home/hudson/hudson-slave/workspace/Lucene-Solr-Tests-trunk-java7/solr/build/solr-core/test-files/solr/'
[junit4:junit4]   2> 2101 T1805 oasc.CoreContainer.load Registering Log Listener
[junit4:junit4]   2> 2116 T1805 oasc.CoreContainer.create Creating SolrCore 'collection1' using instanceDir: /usr/home/hudson/hudson-slave/workspace/Lucene-Solr-Tests-trunk-java7/solr/build/solr-core/test-files/solr/collection1
[junit4:junit4]   2> 2116 T1805 oasc.SolrResourceLoader.<init> new SolrResourceLoader for directory: '/usr/home/hudson/hudson-slave/workspace/Lucene-Solr-Tests-trunk-java7/solr/build/solr-core/test-files/solr/collection1/'
[junit4:junit4]   2> 2117 T1805 oasc.SolrResourceLoader.replaceClassLoader Adding 'file:/usr/home/hudson/hudson-slave/workspace/Lucene-Solr-Tests-trunk-java7/solr/build/solr-core/test-files/solr/collection1/lib/classes/' to classloader
[junit4:junit4]   2> 2118 T1805 oasc.SolrResourceLoader.replaceClassLoader Adding 'file:/usr/home/hudson/hudson-slave/workspace/Lucene-Solr-Tests-trunk-java7/solr/build/solr-core/test-files/solr/collection1/lib/README' to classloader
[junit4:junit4]   2> 2149 T1805 oasc.SolrConfig.<init> Using Lucene MatchVersion: LUCENE_50
[junit4:junit4]   2> 2186 T1805 oasc.SolrConfig.<init> Loaded SolrConfig: solrconfig-tlog.xml
[junit4:junit4]   2> 2187 T1805 oass.IndexSchema.readSchema Reading Solr Schema
[junit4:junit4]   2> 2192 T1805 oass.IndexSchema.readSchema Schema name=test
[junit4:junit4]   2> 2654 T1805 oass.OpenExchangeRatesOrgProvider.init Initialized with rates=open-exchange-rates.json, refreshInterval=1440.
[junit4:junit4]   2> 2664 T1805 oass.IndexSchema.readSchema default search field in schema is text
[junit4:junit4]   2> 2667 T1805 oass.IndexSchema.readSchema unique key field: id
[junit4:junit4]   2> 2675 T1805 oass.FileExchangeRateProvider.reload Reloading exchange rates from file currency.xml
[junit4:junit4]   2> 2679 T1805 oass.FileExchangeRateProvider.reload Reloading exchange rates from file currency.xml
[junit4:junit4]   2> 2682 T1805 oass.OpenExchangeRatesOrgProvider.reload Reloading exchange rates from open-exchange-rates.json
[junit4:junit4]   2> 2683 T1805 oass.OpenExchangeRatesOrgProvider.reload Reloading exchange rates from open-exchange-rates.json
[junit4:junit4]   2> 2683 T1805 oasc.SolrCore.<init> [collection1] Opening new SolrCore at /usr/home/hudson/hudson-slave/workspace/Lucene-Solr-Tests-trunk-java7/solr/build/solr-core/test-files/solr/collection1/, dataDir=./org.apache.solr.update.SolrCmdDistributorTest-1347675669079/shard2/data/
[junit4:junit4]   2> 2684 T1805 oasc.SolrCore.<init> JMX monitoring not detected for core: collection1
[junit4:junit4]   2> 2684 T1805 oasc.SolrCore.getNewIndexDir WARNING New index directory detected: old=null new=./org.apache.solr.update.SolrCmdDistributorTest-1347675669079/shard2/data/index/
[junit4:junit4]   2> 2685 T1805 oasc.SolrCore.initIndex WARNING [collection1] Solr index directory './org.apache.solr.update.SolrCmdDistributorTest-1347675669079/shard2/data/index' doesn't exist. Creating new index...
[junit4:junit4]   2> 2686 T1805 oasc.CachingDirectoryFactory.get return new directory for /usr/home/hudson/hudson-slave/workspace/Lucene-Solr-Tests-trunk-java7/solr/build/solr-core/test/J1/./org.apache.solr.update.SolrCmdDistributorTest-1347675669079/shard2/data/index forceNew:false
[junit4:junit4]   2> 2689 T1805 oasc.SolrDeletionPolicy.onCommit SolrDeletionPolicy.onCommit: commits:num=1
[junit4:junit4]   2> 		commit{dir=MockDirWrapper(org.apache.lucene.store.RAMDirectory@621cc396 lockFactory=org.apache.lucene.store.NativeFSLockFactory@4dafe9ed),segFN=segments_1,generation=1,filenames=[segments_1]
[junit4:junit4]   2> 2689 T1805 oasc.SolrDeletionPolicy.updateCommits newest commit = 1
[junit4:junit4]   2> 2690 T1805 oasc.RequestHandlers.initHandlersFromConfig created standard: solr.StandardRequestHandler
[junit4:junit4]   2> 2690 T1805 oasc.RequestHandlers.initHandlersFromConfig created /get: solr.RealTimeGetHandler
[junit4:junit4]   2> 2691 T1805 oasc.RequestHandlers.initHandlersFromConfig created /update: solr.UpdateRequestHandler
[junit4:junit4]   2> 2691 T1805 oasc.RequestHandlers.initHandlersFromConfig created /admin/: org.apache.solr.handler.admin.AdminHandlers
[junit4:junit4]   2> 2696 T1805 oashl.XMLLoader.init xsltCacheLifetimeSeconds=60
[junit4:junit4]   2> 2700 T1805 oass.SolrIndexSearcher.<init> Opening Searcher@59fb6d76 main
[junit4:junit4]   2> 2701 T1805 oass.SolrIndexSearcher.getIndexDir WARNING WARNING: Directory impl does not support setting indexDir: org.apache.lucene.store.MockDirectoryWrapper
[junit4:junit4]   2> 2701 T1805 oasu.CommitTracker.<init> Hard AutoCommit: disabled
[junit4:junit4]   2> 2702 T1805 oasu.CommitTracker.<init> Soft AutoCommit: disabled
[junit4:junit4]   2> 2702 T1805 oashc.HttpShardHandlerFactory.getParameter Setting socketTimeout to: 0
[junit4:junit4]   2> 2703 T1805 oashc.HttpShardHandlerFactory.getParameter Setting urlScheme to: http://
[junit4:junit4]   2> 2703 T1805 oashc.HttpShardHandlerFactory.getParameter Setting connTimeout to: 0
[junit4:junit4]   2> 2703 T1805 oashc.HttpShardHandlerFactory.getParameter Setting maxConnectionsPerHost to: 20
[junit4:junit4]   2> 2704 T1805 oashc.HttpShardHandlerFactory.getParameter Setting corePoolSize to: 0
[junit4:junit4]   2> 2704 T1805 oashc.HttpShardHandlerFactory.getParameter Setting maximumPoolSize to: 2147483647
[junit4:junit4]   2> 2704 T1805 oashc.HttpShardHandlerFactory.getParameter Setting maxThreadIdleTime to: 5
[junit4:junit4]   2> 2705 T1805 oashc.HttpShardHandlerFactory.getParameter Setting sizeOfQueue to: -1
[junit4:junit4]   2> 2705 T1805 oashc.HttpShardHandlerFactory.getParameter Setting fairnessPolicy to: false
[junit4:junit4]   2> 2705 T1805 oascsi.HttpClientUtil.createClient Creating new http client, config:maxConnectionsPerHost=20&maxConnections=10000&socketTimeout=0&connTimeout=0&retry=false
[junit4:junit4]   2> 2717 T1845 oasc.SolrCore.registerSearcher [collection1] Registered new searcher Searcher@59fb6d76 main{StandardDirectoryReader(segments_1:1)}
[junit4:junit4]   2> 2717 T1805 oasc.CoreContainer.register registering core: collection1
[junit4:junit4]   2> 2718 T1805 oass.SolrDispatchFilter.init user.dir=/usr/home/hudson/hudson-slave/workspace/Lucene-Solr-Tests-trunk-java7/solr/build/solr-core/test/J1
[junit4:junit4]   2> 2719 T1805 oass.SolrDispatchFilter.init SolrDispatchFilter.init() done
[junit4:junit4]   2> 2719 T1805 oascsi.HttpClientUtil.createClient Creating new http client, config:maxConnections=128&maxConnectionsPerHost=32&followRedirects=false
[junit4:junit4]   2> 2726 T1805 oejs.Server.doStart jetty-8.1.2.v20120308
[junit4:junit4]   2> 2728 T1805 oejs.AbstractConnector.doStart Started SocketConnector@0.0.0.0:36138
[junit4:junit4]   2> 2729 T1805 oasc.SolrResourceLoader.locateSolrHome JNDI not configured for solr (NoInitialContextEx)
[junit4:junit4]   2> 2729 T1805 oasc.SolrResourceLoader.locateSolrHome using system property solr.solr.home: /usr/home/hudson/hudson-slave/workspace/Lucene-Solr-Tests-trunk-java7/solr/build/solr-core/test-files/solr
[junit4:junit4]   2> 2729 T1805 oasc.SolrResourceLoader.<init> new SolrResourceLoader for deduced Solr Home: '/usr/home/hudson/hudson-slave/workspace/Lucene-Solr-Tests-trunk-java7/solr/build/solr-core/test-files/solr/'
[junit4:junit4]   2> 2761 T1805 oass.SolrDispatchFilter.init SolrDispatchFilter.init()
[junit4:junit4]   2> 2762 T1805 oasc.SolrResourceLoader.locateSolrHome JNDI not configured for solr (NoInitialContextEx)
[junit4:junit4]   2> 2762 T1805 oasc.SolrResourceLoader.locateSolrHome using system property solr.solr.home: /usr/home/hudson/hudson-slave/workspace/Lucene-Solr-Tests-trunk-java7/solr/build/solr-core/test-files/solr
[junit4:junit4]   2> 2762 T1805 oasc.CoreContainer$Initializer.initialize looking for solr.xml: /usr/home/hudson/hudson-slave/workspace/Lucene-Solr-Tests-trunk-java7/solr/build/solr-core/test-files/solr/solr.xml
[junit4:junit4]   2> 2763 T1805 oasc.CoreContainer.<init> New CoreContainer 747151721
[junit4:junit4]   2> 2763 T1805 oasc.CoreContainer.load Loading CoreContainer using Solr Home: '/usr/home/hudson/hudson-slave/workspace/Lucene-Solr-Tests-trunk-java7/solr/build/solr-core/test-files/solr/'
[junit4:junit4]   2> 2764 T1805 oasc.SolrResourceLoader.<init> new SolrResourceLoader for directory: '/usr/home/hudson/hudson-slave/workspace/Lucene-Solr-Tests-trunk-java7/solr/build/solr-core/test-files/solr/'
[junit4:junit4]   2> 2788 T1805 oasc.CoreContainer.load Registering Log Listener
[junit4:junit4]   2> 2803 T1805 oasc.CoreContainer.create Creating SolrCore 'collection1' using instanceDir: /usr/home/hudson/hudson-slave/workspace/Lucene-Solr-Tests-trunk-java7/solr/build/solr-core/test-files/solr/collection1
[junit4:junit4]   2> 2804 T1805 oasc.SolrResourceLoader.<init> new SolrResourceLoader for directory: '/usr/home/hudson/hudson-slave/workspace/Lucene-Solr-Tests-trunk-java7/solr/build/solr-core/test-files/solr/collection1/'
[junit4:junit4]   2> 2805 T1805 oasc.SolrResourceLoader.replaceClassLoader Adding 'file:/usr/home/hudson/hudson-slave/workspace/Lucene-Solr-Tests-trunk-java7/solr/build/solr-core/test-files/solr/collection1/lib/classes/' to classloader
[junit4:junit4]   2> 2806 T1805 oasc.SolrResourceLoader.replaceClassLoader Adding 'file:/usr/home/hudson/hudson-slave/workspace/Lucene-Solr-Tests-trunk-java7/solr/build/solr-core/test-files/solr/collection1/lib/README' to classloader
[junit4:junit4]   2> 2839 T1805 oasc.SolrConfig.<init> Using Lucene MatchVersion: LUCENE_50
[junit4:junit4]   2> 2879 T1805 oasc.SolrConfig.<init> Loaded SolrConfig: solrconfig-tlog.xml
[junit4:junit4]   2> 2880 T1805 oass.IndexSchema.readSchema Reading Solr Schema
[junit4:junit4]   2> 2885 T1805 oass.IndexSchema.readSchema Schema name=test
[junit4:junit4]   2> 3376 T1805 oass.OpenExchangeRatesOrgProvider.init Initialized with rates=open-exchange-rates.json, refreshInterval=1440.
[junit4:junit4]   2> 3386 T1805 oass.IndexSchema.readSchema default search field in schema is text
[junit4:junit4]   2> 3390 T1805 oass.IndexSchema.readSchema unique key field: id
[junit4:junit4]   2> 3397 T1805 oass.FileExchangeRateProvider.reload Reloading exchange rates from file currency.xml
[junit4:junit4]   2> 3402 T1805 oass.FileExchangeRateProvider.reload Reloading exchange rates from file currency.xml
[junit4:junit4]   2> 3405 T1805 oass.OpenExchangeRatesOrgProvider.reload Reloading exchange rates from open-exchange-rates.json
[junit4:junit4]   2> 3406 T1805 oass.OpenExchangeRatesOrgProvider.reload Reloading exchange rates from open-exchange-rates.json
[junit4:junit4]   2> 3406 T1805 oasc.SolrCore.<init> [collection1] Opening new SolrCore at /usr/home/hudson/hudson-slave/workspace/Lucene-Solr-Tests-trunk-java7/solr/build/solr-core/test-files/solr/collection1/, dataDir=./org.apache.solr.update.SolrCmdDistributorTest-1347675669079/shard3/data/
[junit4:junit4]   2> 3407 T1805 oasc.SolrCore.<init> JMX monitoring not detected for core: collection1
[junit4:junit4]   2> 3408 T1805 oasc.SolrCore.getNewIndexDir WARNING New index directory detected: old=null new=./org.apache.solr.update.SolrCmdDistributorTest-1347675669079/shard3/data/index/
[junit4:junit4]   2> 3409 T1805 oasc.SolrCore.initIndex WARNING [collection1] Solr index directory './org.apache.solr.update.SolrCmdDistributorTest-1347675669079/shard3/data/index' doesn't exist. Creating new index...
[junit4:junit4]   2> 3410 T1805 oasc.CachingDirectoryFactory.get return new directory for /usr/home/hudson/hudson-slave/workspace/Lucene-Solr-Tests-trunk-java7/solr/build/solr-core/test/J1/./org.apache.solr.update.SolrCmdDistributorTest-1347675669079/shard3/data/index forceNew:false
[junit4:junit4]   2> 3412 T1805 oasc.SolrDeletionPolicy.onCommit SolrDeletionPolicy.onCommit: commits:num=1
[junit4:junit4]   2> 		commit{dir=MockDirWrapper(org.apache.lucene.store.RAMDirectory@11061cba lockFactory=org.apache.lucene.store.NativeFSLockFactory@efc70c0),segFN=segments_1,generation=1,filenames=[segments_1]
[junit4:junit4]   2> 3412 T1805 oasc.SolrDeletionPolicy.updateCommits newest commit = 1
[junit4:junit4]   2> 3413 T1805 oasc.RequestHandlers.initHandlersFromConfig created standard: solr.StandardRequestHandler
[junit4:junit4]   2> 3414 T1805 oasc.RequestHandlers.initHandlersFromConfig created /get: solr.RealTimeGetHandler
[junit4:junit4]   2> 3414 T1805 oasc.RequestHandlers.initHandlersFromConfig created /update: solr.UpdateRequestHandler
[junit4:junit4]   2> 3415 T1805 oasc.RequestHandlers.initHandlersFromConfig created /admin/: org.apache.solr.handler.admin.AdminHandlers
[junit4:junit4]   2> 3419 T1805 oashl.XMLLoader.init xsltCacheLifetimeSeconds=60
[junit4:junit4]   2> 3425 T1805 oass.SolrIndexSearcher.<init> Opening Searcher@75ecaf09 main
[junit4:junit4]   2> 3425 T1805 oass.SolrIndexSearcher.getIndexDir WARNING WARNING: Directory impl does not support setting indexDir: org.apache.lucene.store.MockDirectoryWrapper
[junit4:junit4]   2> 3426 T1805 oasu.CommitTracker.<init> Hard AutoCommit: disabled
[junit4:junit4]   2> 3426 T1805 oasu.CommitTracker.<init> Soft AutoCommit: disabled
[junit4:junit4]   2> 3427 T1805 oashc.HttpShardHandlerFactory.getParameter Setting socketTimeout to: 0
[junit4:junit4]   2> 3427 T1805 oashc.HttpShardHandlerFactory.getParameter Setting urlScheme to: http://
[junit4:junit4]   2> 3427 T1805 oashc.HttpShardHandlerFactory.getParameter Setting connTimeout to: 0
[junit4:junit4]   2> 3428 T1805 oashc.HttpShardHandlerFactory.getParameter Setting maxConnectionsPerHost to: 20
[junit4:junit4]   2> 3428 T1805 oashc.HttpShardHandlerFactory.getParameter Setting corePoolSize to: 0
[junit4:junit4]   2> 3428 T1805 oashc.HttpShardHandlerFactory.getParameter Setting maximumPoolSize to: 2147483647
[junit4:junit4]   2> 3429 T1805 oashc.HttpShardHandlerFactory.getParameter Setting maxThreadIdleTime to: 5
[junit4:junit4]   2> 3429 T1805 oashc.HttpShardHandlerFactory.getParameter Setting sizeOfQueue to: -1
[junit4:junit4]   2> 3429 T1805 oashc.HttpShardHandlerFactory.getParameter Setting fairnessPolicy to: false
[junit4:junit4]   2> 3430 T1805 oascsi.HttpClientUtil.createClient Creating new http client, config:maxConnectionsPerHost=20&maxConnections=10000&socketTimeout=0&connTimeout=0&retry=false
[junit4:junit4]   2> 3442 T1855 oasc.SolrCore.registerSearcher [collection1] Registered new searcher Searcher@75ecaf09 main{StandardDirectoryReader(segments_1:1)}
[junit4:junit4]   2> 3442 T1805 oasc.CoreContainer.register registering core: collection1
[junit4:junit4]   2> 3443 T1805 oass.SolrDispatchFilter.init user.dir=/usr/home/hudson/hudson-slave/workspace/Lucene-Solr-Tests-trunk-java7/solr/build/solr-core/test/J1
[junit4:junit4]   2> 3443 T1805 oass.SolrDispatchFilter.init SolrDispatchFilter.init() done
[junit4:junit4]   2> 3444 T1805 oascsi.HttpClientUtil.createClient Creating new http client, config:maxConnections=128&maxConnectionsPerHost=32&followRedirects=false
[junit4:junit4]   2> ASYNC  NEW_CORE C150 name=collection1 org.apache.solr.core.SolrCore@6e8190e
[junit4:junit4]   2> 3457 T1808 C150 oasc.SolrDeletionPolicy.onInit SolrDeletionPolicy.onInit: commits:num=1
[junit4:junit4]   2> 		commit{dir=MockDirWrapper(org.apache.lucene.store.RAMDirectory@3097d494 lockFactory=org.apache.lucene.store.NativeFSLockFactory@1f34f61e),segFN=segments_1,generation=1,filenames=[segments_1]
[junit4:junit4]   2> 3458 T1808 C150 oasc.SolrDeletionPolicy.updateCommits newest commit = 1
[junit4:junit4]   2> 3459 T1808 C150 oass.SolrIndexSearcher.<init> Opening Searcher@2de5fe4e realtime
[junit4:junit4]   2> 3460 T1808 C150 oass.SolrIndexSearcher.getIndexDir WARNING WARNING: Directory impl does not support setting indexDir: org.apache.lucene.store.MockDirectoryWrapper
[junit4:junit4]   2> 3461 T1808 C150 UPDATE [collection1] webapp=/solr path=/update params={wt=javabin&version=2} {deleteByQuery=*:* (-1413140366000914432)} 0 6
[junit4:junit4]   2> ASYNC  NEW_CORE C151 name=collection1 org.apache.solr.core.SolrCore@2390e7c3
[junit4:junit4]   2> 3468 T1818 C151 oasc.SolrDeletionPolicy.onInit SolrDeletionPolicy.onInit: commits:num=1
[junit4:junit4]   2> 		commit{dir=MockDirWrapper(org.apache.lucene.store.RAMDirectory@4e8a7c88 lockFactory=org.apache.lucene.store.NativeFSLockFactory@749acf4b),segFN=segments_1,generation=1,filenames=[segments_1]
[junit4:junit4]   2> 3468 T1818 C151 oasc.SolrDeletionPolicy.updateCommits newest commit = 1
[junit4:junit4]   2> 3470 T1818 C151 oass.SolrIndexSearcher.<init> Opening Searcher@46fa254f realtime
[junit4:junit4]   2> 3470 T1818 C151 oass.SolrIndexSearcher.getIndexDir WARNING WARNING: Directory impl does not support setting indexDir: org.apache.lucene.store.MockDirectoryWrapper
[junit4:junit4]   2> 3470 T1818 C151 UPDATE [collection1] webapp=/solr path=/update params={wt=javabin&version=2} {deleteByQuery=*:* (-1413140366012448768)} 0 4
[junit4:junit4]   2> ASYNC  NEW_CORE C152 name=collection1 org.apache.solr.core.SolrCore@2cc2021d
[junit4:junit4]   2> 3477 T1828 C152 oasc.SolrDeletionPolicy.onInit SolrDeletionPolicy.onInit: commits:num=1
[junit4:junit4]   2> 		commit{dir=MockDirWrapper(org.apache.lucene.store.RAMDirectory@7167a89c lockFactory=org.apache.lucene.store.NativeFSLockFactory@1bd576),segFN=segments_1,generation=1,filenames=[segments_1]
[junit4:junit4]   2> 3477 T1828 C152 oasc.SolrDeletionPolicy.updateCommits newest commit = 1
[junit4:junit4]   2> 3478 T1828 C152 oass.SolrIndexSearcher.<init> Opening Searcher@46eec640 realtime
[junit4:junit4]   2> 3479 T1828 C152 oass.SolrIndexSearcher.getIndexDir WARNING WARNING: Directory impl does not support setting indexDir: org.apache.lucene.store.MockDirectoryWrapper
[junit4:junit4]   2> 3479 T1828 C152 UPDATE [collection1] webapp=/solr path=/update params={wt=javabin&version=2} {deleteByQuery=*:* (-1413140366021885952)} 0 4
[junit4:junit4]   2> ASYNC  NEW_CORE C153 name=collection1 org.apache.solr.core.SolrCore@4dd5cce5
[junit4:junit4]   2> 3486 T1838 C153 oasc.SolrDeletionPolicy.onInit SolrDeletionPolicy.onInit: commits:num=1
[junit4:junit4]   2> 		commit{dir=MockDirWrapper(org.apache.lucene.store.RAMDirectory@621cc396 lockFactory=org.apache.lucene.store.NativeFSLockFactory@4dafe9ed),segFN=segments_1,generation=1,filenames=[segments_1]
[junit4:junit4]   2> 3486 T1838 C153 oasc.SolrDeletionPolicy.updateCommits newest commit = 1
[junit4:junit4]   2> 3487 T1838 C153 oass.SolrIndexSearcher.<init> Opening Searcher@2f96ca38 realtime
[junit4:junit4]   2> 3488 T1838 C153 oass.SolrIndexSearcher.getIndexDir WARNING WARNING: Directory impl does not support setting indexDir: org.apache.lucene.store.MockDirectoryWrapper
[junit4:junit4]   2> 3488 T1838 C153 UPDATE [collection1] webapp=/solr path=/update params={wt=javabin&version=2} {deleteByQuery=*:* (-1413140366031323136)} 0 4
[junit4:junit4]   2> ASYNC  NEW_CORE C154 name=collection1 org.apache.solr.core.SolrCore@7838b91c
[junit4:junit4]   2> 3494 T1848 C154 oasc.SolrDeletionPolicy.onInit SolrDeletionPolicy.onInit: commits:num=1
[junit4:junit4]   2> 		commit{dir=MockDirWrapper(org.apache.lucene.store.RAMDirectory@11061cba lockFactory=org.apache.lucene.store.NativeFSLockFactory@efc70c0),segFN=segments_1,generation=1,filenames=[segments_1]
[junit4:junit4]   2> 3494 T1848 C154 oasc.SolrDeletionPolicy.updateCommits newest commit = 1
[junit4:junit4]   2> 3495 T1848 C154 oass.SolrIndexSearcher.<init> Opening Searcher@204e355f realtime
[junit4:junit4]   2> 3495 T1848 C154 oass.SolrIndexSearcher.getIndexDir WARNING WARNING: Directory impl does not support setting indexDir: org.apache.lucene.store.MockDirectoryWrapper
[junit4:junit4]   2> 3496 T1848 C154 UPDATE [collection1] webapp=/solr path=/update params={wt=javabin&version=2} {deleteByQuery=*:* (-1413140366039711744)} 0 4
[junit4:junit4]   2> 3496 T1805 oasu.SolrCmdDistributor.distribCommit Distrib commit to:[StdNode: http://localhost:53380/solr/]
[junit4:junit4]   2> 3498 T1809 C150 oasu.DirectUpdateHandler2.commit start commit{flags=0,_version_=0,optimize=false,openSearcher=true,waitSearcher=true,expungeDeletes=false,softCommit=false}
[junit4:junit4]   2> 3499 T1809 C150 oass.SolrIndexSearcher.<init> Opening Searcher@6869a47b main
[junit4:junit4]   2> 3499 T1809 C150 oass.SolrIndexSearcher.getIndexDir WARNING WARNING: Directory impl does not support setting indexDir: org.apache.lucene.store.MockDirectoryWrapper
[junit4:junit4]   2> 3499 T1815 oasc.SolrCore.registerSearcher [collection1] Registered new searcher Searcher@6869a47b main{StandardDirectoryReader(segments_1:1:nrt)}
[junit4:junit4]   2> 3499 T1809 C150 oasu.DirectUpdateHandler2.commit end_commit_flush
[junit4:junit4]   2> 3500 T1809 C150 UPDATE [collection1] webapp=/solr path=/update params={waitSearcher=true&commit=true&expungeDeletes=false&wt=javabin&softCommit=false&version=2} {commit=} 0 2
[junit4:junit4]   2> 3503 T1809 C150 oasu.DirectUpdateHandler2.commit start commit{flags=0,_version_=0,optimize=false,openSearcher=true,waitSearcher=true,expungeDeletes=false,softCommit=false}
[junit4:junit4]   2> 3506 T1809 C150 oasc.SolrDeletionPolicy.onCommit SolrDeletionPolicy.onCommit: commits:num=2
[junit4:junit4]   2> 		commit{dir=MockDirWrapper(org.apache.lucene.store.RAMDirectory@3097d494 lockFactory=org.apache.lucene.store.NativeFSLockFactory@1f34f61e),segFN=segments_1,generation=1,filenames=[segments_1]
[junit4:junit4]   2> 		commit{dir=MockDirWrapper(org.apache.lucene.store.RAMDirectory@3097d494 lockFactory=org.apache.lucene.store.NativeFSLockFactory@1f34f61e),segFN=segments_2,generation=2,filenames=[_0_MockVariableIntBlock_0.doc, _0_MockVariableIntBlock_0.skp, _0_NestedPulsing_0.tip, _0_MockFixedIntBlock_0.tib, _0_NestedPulsing_0.tim, _0_MockVariableIntBlock_0.pyl, _0_Lucene40WithOrds_0.tii, _0_MockFixedIntBlock_0.pyl, _0_MockFixedIntBlock_0.skp, _0_Lucene40WithOrds_0.frq, _0_MockVariableIntBlock_0.tib, _0_MockFixedIntBlock_0.tii, _0_MockVariableIntBlock_0.pos, _0.si, _0_Lucene40WithOrds_0.tib, _0_MockVariableIntBlock_0.tii, _0.fnm, _0_NestedPulsing_0.frq, _0_MockFixedIntBlock_0.pos, _0_nrm.cfs, _0_NestedPulsing_0.prx, _0_MockFixedIntBlock_0.frq, _0_MockFixedIntBlock_0.doc, _0_MockVariableIntBlock_0.frq, _0_nrm.cfe, segments_2, _0.fdx, _0_Lucene40WithOrds_0.prx, _0.fdt]
[junit4:junit4]   2> 3506 T1809 C150 oasc.SolrDeletionPolicy.updateCommits newest commit = 2
[junit4:junit4]   2> 3507 T1809 C150 oass.SolrIndexSearcher.<init> Opening Searcher@12316ee3 main
[junit4:junit4]   2> 3508 T1809 C150 oass.SolrIndexSearcher.getIndexDir WARNING WARNING: Directory impl does not support setting indexDir: org.apache.lucene.store.MockDirectoryWrapper
[junit4:junit4]   2> 3508 T1815 oasc.SolrCore.registerSearcher [collection1] Registered new searcher Searcher@12316ee3 main{StandardDirectoryReader(segments_2:3:nrt _0(5.0):C1)}
[junit4:junit4]   2> 3508 T1809 C150 oasu.DirectUpdateHandler2.commit end_commit_flush
[junit4:junit4]   2> 3508 T1809 C150 UPDATE [collection1] webapp=/solr path=/update params={waitSearcher=true&commit=true&wt=javabin&expungeDeletes=false&version=2&softCommit=false} {add=[1 (1413140366050197504)],commit=} 0 6
[junit4:junit4]   2> 3512 T1808 C150 REQ [collection1] webapp=/solr path=/select params={wt=javabin&q=*:*&version=2} hits=1 status=0 QTime=1 
[junit4:junit4]   2> 3512 T1805 oasu.SolrCmdDistributor.distribCommit Distrib commit to:[StdNode: http://localhost:53380/solr/, StdNode: http://localhost:47648/solr/]
[junit4:junit4]   2> 3514 T1819 C151 oasu.DirectUpdateHandler2.commit start commit{flags=0,_version_=0,optimize=false,openSearcher=true,waitSearcher=true,expungeDeletes=false,softCommit=false}
[junit4:junit4]   2> 3515 T1819 C151 oass.SolrIndexSearcher.<init> Opening Searcher@2de519d3 main
[junit4:junit4]   2> 3515 T1809 C150 oasu.DirectUpdateHandler2.commit start commit{flags=0,_version_=0,optimize=false,openSearcher=true,waitSearcher=true,expungeDeletes=false,softCommit=false}
[junit4:junit4]   2> 3515 T1819 C151 oass.SolrIndexSearcher.getIndexDir WARNING WARNING: Directory impl does not support setting indexDir: org.apache.lucene.store.MockDirectoryWrapper
[junit4:junit4]   2> 3515 T1809 C150 oass.SolrIndexSearcher.<init> Opening Searcher@68f29106 main
[junit4:junit4]   2> 3516 T1825 oasc.SolrCore.registerSearcher [collection1] Registered new searcher Searcher@2de519d3 main{StandardDirectoryReader(segments_1:1:nrt)}
[junit4:junit4]   2> 3516 T1809 C150 oass.SolrIndexSearcher.getIndexDir WARNING WARNING: Directory impl does not support setting indexDir: org.apache.lucene.store.MockDirectoryWrapper
[junit4:junit4]   2> 3516 T1819 C151 oasu.DirectUpdateHandler2.commit end_commit_flush
[junit4:junit4]   2> 3516 T1809 C150 oasu.DirectUpdateHandler2.commit end_commit_flush
[junit4:junit4]   2> 3516 T1819 C151 UPDATE [collection1] webapp=/solr path=/update params={waitSearcher=true&commit=true&expungeDeletes=false&wt=javabin&softCommit=false&version=2} {commit=} 0 2
[junit4:junit4]   2> 3516 T1815 oasc.SolrCore.registerSearcher [collection1] Registered new searcher Searcher@68f29106 main{StandardDirectoryReader(segments_2:3:nrt _0(5.0):C1)}
[junit4:junit4]   2> 3517 T1809 C150 UPDATE [collection1] webapp=/solr path=/update params={waitSearcher=true&commit=true&expungeDeletes=false&wt=javabin&softCommit=false&version=2} {commit=} 0 2
[junit4:junit4]   2> 3521 T1809 C150 oasu.DirectUpdateHandler2.commit start commit{flags=0,_version_=0,optimize=false,openSearcher=true,waitSearcher=true,expungeDeletes=false,softCommit=false}
[junit4:junit4]   2> 3523 T1819 C151 oasu.DirectUpdateHandler2.commit start commit{flags=0,_version_=0,optimize=false,openSearcher=true,waitSearcher=true,expungeDeletes=false,softCommit=false}
[junit4:junit4]   2> 3524 T1809 C150 oasc.SolrDeletionPolicy.onCommit SolrDeletionPolicy.onCommit: commits:num=2
[junit4:junit4]   2> 		commit{dir=MockDirWrapper(org.apache.lucene.store.RAMDirectory@3097d494 lockFactory=org.apache.lucene.store.NativeFSLockFactory@1f34f61e),segFN=segments_2,generation=2,filenames=[_0_MockVariableIntBlock_0.doc, _0_MockVariableIntBlock_0.skp, _0_NestedPulsing_0.tip, _0_MockFixedIntBlock_0.tib, _0_NestedPulsing_0.tim, _0_MockVariableIntBlock_0.pyl, _0_Lucene40WithOrds_0.tii, _0_MockFixedIntBlock_0.pyl, _0_MockFixedIntBlock_0.skp, _0_Lucene40WithOrds_0.frq, _0_MockVariableIntBlock_0.tib, _0_MockFixedIntBlock_0.tii, _0_MockVariableIntBlock_0.pos, _0.si, _0_Lucene40WithOrds_0.tib, _0_MockVariableIntBlock_0.tii, _0.fnm, _0_NestedPulsing_0.frq, _0_MockFixedIntBlock_0.pos, _0_nrm.cfs, _0_NestedPulsing_0.prx, _0_MockFixedIntBlock_0.frq, _0_MockFixedIntBlock_0.doc, _0_MockVariableIntBlock_0.frq, _0_nrm.cfe, segments_2, _0.fdx, _0_Lucene40WithOrds_0.prx, _0.fdt]
[junit4:junit4]   2> 		commit{dir=MockDirWrapper(org.apache.lucene.store.RAMDirectory@3097d494 lockFactory=org.apache.lucene.store.NativeFSLockFactory@1f34f61e),segFN=segments_3,generation=3,filenames=[_1_NestedPulsing_0.tip, _1_MockFixedIntBlock_0.pyl, _0_MockVariableIntBlock_0.skp, _0_MockFixedIntBlock_0.tib, _1.fnm, _0_Lucene40WithOrds_0.tii, _0_Lucene40WithOrds_0.frq, _1_Lucene40WithOrds_0.tib, _0_MockFixedIntBlock_0.tii, _1_Lucene40WithOrds_0.tii, _1_NestedPulsing_0.tim, _0_Lucene40WithOrds_0.tib, _1_Lucene40WithOrds_0.frq, _0.fnm, _1_MockFixedIntBlock_0.frq, _1_MockVariableIntBlock_0.tii, _0_MockFixedIntBlock_0.pos, _1_MockVariableIntBlock_0.tib, _1.fdx, _1_MockFixedIntBlock_0.skp, _1.fdt, _0_MockVariableIntBlock_0.frq, _1_MockFixedIntBlock_0.pos, _1_MockVariableIntBlock_0.skp, _1_NestedPulsing_0.prx, _0_MockVariableIntBlock_0.doc, _1_MockFixedIntBlock_0.doc, _1_Lucene40WithOrds_0.prx, _1_MockVariableIntBlock_0.pyl, _0_NestedPulsing_0.tip, _0_NestedPulsing_0.tim, _0_MockVariableIntBlock_0.pyl, _0_MockFixedIntBlock_0.skp, _0_MockFixedIntBlock_0.pyl, _0_MockVariableIntBlock_0.tib, _1_MockVariableIntBlock_0.doc, _0_MockVariableIntBlock_0.pos, _0.si, _0_MockVariableIntBlock_0.tii, _1_nrm.cfs, _1_MockFixedIntBlock_0.tii, _1_MockVariableIntBlock_0.pos, _0_NestedPulsing_0.frq, _0_nrm.cfs, _0_NestedPulsing_0.prx, _1_nrm.cfe, _0_MockFixedIntBlock_0.frq, _1_MockVariableIntBlock_0.frq, _1_NestedPulsing_0.frq, _0_MockFixedIntBlock_0.doc, _1.si, _0_nrm.cfe, _1_MockFixedIntBlock_0.tib, _0.fdx, _0_Lucene40WithOrds_0.prx, segments_3, _0.fdt]
[junit4:junit4]   2> 3524 T1809 C150 oasc.SolrDeletionPolicy.updateCommits newest commit = 3
[junit4:junit4]   2> 3525 T1809 C150 oass.SolrIndexSearcher.<init> Opening Searcher@7b8e8aa9 main
[junit4:junit4]   2> 3526 T1809 C150 oass.SolrIndexSearcher.getIndexDir WARNING WARNING: Directory impl does not support setting indexDir: org.apache.lucene.store.MockDirectoryWrapper
[junit4:junit4]   2> 3526 T1815 oasc.SolrCore.registerSearcher [collection1] Registered new searcher Searcher@7b8e8aa9 main{StandardDirectoryReader(segments_3:5:nrt _0(5.0):C1 _1(5.0):C2)}
[junit4:junit4]   2> 3526 T1809 C150 oasu.DirectUpdateHandler2.commit end_commit_flush
[junit4:junit4]   2> 3526 T1809 C150 UPDATE [collection1] webapp=/solr path=/update params={waitSearcher=true&commit=true&wt=javabin&expungeDeletes=false&version=2&softCommit=false} {add=[2 (1413140366068023296), 3 (1413140366069071872)],commit=} 0 7
[junit4:junit4]   2> 3527 T1819 C151 oasc.SolrDeletionPolicy.onCommit SolrDeletionPolicy.onCommit: commits:num=2
[junit4:junit4]   2> 		commit{dir=MockDirWrapper(org.apache.lucene.store.RAMDirectory@4e8a7c88 lockFactory=org.apache.lucene.store.NativeFSLockFactory@749acf4b),segFN=segments_1,generation=1,filenames=[segments_1]
[junit4:junit4]   2> 		commit{dir=MockDirWrapper(org.apache.lucene.store.RAMDirectory@4e8a7c88 lockFactory=org.apache.lucene.store.NativeFSLockFactory@749acf4b),segFN=segments_2,generation=2,filenames=[_0_MockVariableIntBlock_0.doc, _0_MockVariableIntBlock_0.skp, _0_NestedPulsing_0.tip, _0_MockFixedIntBlock_0.tib, _0_NestedPulsing_0.tim, _0_MockVariableIntBlock_0.pyl, _0_Lucene40WithOrds_0.tii, _0_MockFixedIntBlock_0.pyl, _0_MockFixedIntBlock_0.skp, _0_Lucene40WithOrds_0.frq, _0_MockVariableIntBlock_0.tib, _0_MockFixedIntBlock_0.tii, _0_MockVariableIntBlock_0.pos, _0.si, _0_Lucene40WithOrds_0.tib, _0_MockVariableIntBlock_0.tii, _0.fnm, _0_NestedPulsing_0.frq, _0_MockFixedIntBlock_0.pos, _0_nrm.cfs, _0_NestedPulsing_0.prx, _0_MockFixedIntBlock_0.frq, _0_MockFixedIntBlock_0.doc, _0_MockVariableIntBlock_0.frq, _0_nrm.cfe, segments_2, _0.fdx, _0_Lucene40WithOrds_0.prx, _0.fdt]
[junit4:junit4]   2> 3527 T1819 C151 oasc.SolrDeletionPolicy.updateCommits newest commit = 2
[junit4:junit4]   2> 3529 T1819 C151 oass.SolrIndexSearcher.<init> Opening Searcher@7f604085 main
[junit4:junit4]   2> 3529 T1819 C151 oass.SolrIndexSearcher.getIndexDir WARNING WARNING: Directory impl does not support setting indexDir: org.apache.lucene.store.MockDirectoryWrapper
[junit4:junit4]   2> 3530 T1825 oasc.SolrCore.registerSearcher [collection1] Registered new searcher Searcher@7f604085 main{StandardDirectoryReader(segments_2:3:nrt _0(5.0):C3)}
[junit4:junit4]   2> 3530 T1819 C151 oasu.DirectUpdateHandler2.commit end_commit_flush
[junit4:junit4]   2> 3530 T1819 C151 UPDATE [collection1] webapp=/solr path=/update params={waitSearcher=true&commit=true&wt=javabin&expungeDeletes=false&version=2&softCommit=false} {add=[2 (1413140366069071872), 3 (1413140366071169024), 4 (1413140366071169025)],commit=} 0 10
[junit4:junit4]   2> 3533 T1808 C150 REQ [collection1] webapp=/solr path=/select params={wt=javabin&q=*:*&version=2} hits=3 status=0 QTime=0 
[junit4:junit4]   2> 3536 T1818 C151 REQ [collection1] webapp=/solr path=/select params={wt=javabin&q=*:*&version=2} hits=3 status=0 QTime=0 
[junit4:junit4]   2> 3537 T1805 oasu.SolrCmdDistributor.distribCommit Distrib commit to:[StdNode: http://localhost:53380/solr/, StdNode: http://localhost:47648/solr/]
[junit4:junit4]   2> 3539 T1809 C150 oasu.DirectUpdateHandler2.commit start commit{flags=0,_version_=0,optimize=false,openSearcher=true,waitSearcher=true,expungeDeletes=false,softCommit=false}
[junit4:junit4]   2> 3539 T1819 C151 oasu.DirectUpdateHandler2.commit start commit{flags=0,_version_=0,optimize=false,openSearcher=true,waitSearcher=true,expungeDeletes=false,softCommit=false}
[junit4:junit4]   2> 3539 T1809 C150 oass.SolrIndexSearcher.<init> Opening Searcher@6e517246 main
[junit4:junit4]   2> 3539 T1819 C151 oass.SolrIndexSearcher.<init> Opening Searcher@43974126 main
[junit4:junit4]   2> 3540 T1809 C150 oass.SolrIndexSearcher.getIndexDir WARNING WARNING: Directory impl does not support setting indexDir: org.apache.lucene.store.MockDirectoryWrapper
[junit4:junit4]   2> 3540 T1819 C151 oass.SolrIndexSearcher.getIndexDir WARNING WARNING: Directory impl does not support setting indexDir: org.apache.lucene.store.MockDirectoryWrapper
[junit4:junit4]   2> 3540 T1809 C150 oasu.DirectUpdateHandler2.commit end_commit_flush
[junit4:junit4]   2> 3540 T1819 C151 oasu.DirectUpdateHandler2.commit end_commit_flush
[junit4:junit4]   2> 3540 T1825 oasc.SolrCore.registerSearcher [collection1] Registered new searcher Searcher@43974126 main{StandardDirectoryReader(segments_2:3:nrt _0(5.0):C3)}
[junit4:junit4]   2> 3540 T1815 oasc.SolrCore.registerSearcher [collection1] Registered new searcher Searcher@6e517246 main{StandardDirectoryReader(segments_3:5:nrt _0(5.0):C1 _1(5.0):C2)}
[junit4:junit4]   2> 3540 T1819 C151 UPDATE [collection1] webapp=/solr path=/update params={waitSearcher=true&commit=true&expungeDeletes=false&wt=javabin&softCommit=false&version=2} {commit=} 0 1
[junit4:junit4]   2> 3541 T1809 C150 UPDATE [collection1] webapp=/solr path=/update params={waitSearcher=true&commit=true&expungeDeletes=false&wt=javabin&softCommit=false&version=2} {commit=} 0 2
[junit4:junit4]   2> 3544 T1809 C150 oasu.DirectUpdateHandler2.commit start commit{flags=0,_version_=0,optimize=false,openSearcher=true,waitSearcher=true,expungeDeletes=false,softCommit=false}
[junit4:junit4]   2> 3544 T1819 C151 oasu.DirectUpdateHandler2.commit start commit{flags=0,_version_=0,optimize=false,openSearcher=true,waitSearcher=true,expungeDeletes=false,softCommit=false}
[junit4:junit4]   2> 3545 T1819 C151 oasc.SolrDeletionPolicy.onCommit SolrDeletionPolicy.onCommit: commits:num=2
[junit4:junit4]   2> 		commit{dir=MockDirWrapper(org.apache.lucene.store.RAMDirectory@4e8a7c88 lockFactory=org.apache.lucene.store.NativeFSLockFactory@749acf4b),segFN=segments_2,generation=2,filenames=[_0_MockVariableIntBlock_0.doc, _0_MockVariableIntBlock_0.skp, _0_NestedPulsing_0.tip, _0_MockFixedIntBlock_0.tib, _0_NestedPulsing_0.tim, _0_MockVariableIntBlock_0.pyl, _0_Lucene40WithOrds_0.tii, _0_MockFixedIntBlock_0.pyl, _0_MockFixedIntBlock_0.skp, _0_Lucene40WithOrds_0.frq, _0_MockVariableIntBlock_0.tib, _0_MockFixedIntBlock_0.tii, _0_MockVariableIntBlock_0.pos, _0.si, _0_Lucene40WithOrds_0.tib, _0_MockVariableIntBlock_0.tii, _0.fnm, _0_NestedPulsing_0.frq, _0_MockFixedIntBlock_0.pos, _0_nrm.cfs, _0_NestedPulsing_0.prx, _0_MockFixedIntBlock_0.frq, _0_MockFixedIntBlock_0.doc, _0_MockVariableIntBlock_0.frq, _0_nrm.cfe, segments_2, _0.fdx, _0_Lucene40WithOrds_0.prx, _0.fdt]
[junit4:junit4]   2> 		commit{dir=MockDirWrapper(org.apache.lucene.store.RAMDirectory@4e8a7c88 lockFactory=org.apache.lucene.store.NativeFSLockFactory@749acf4b),segFN=segments_3,generation=3,filenames=[_0_MockVariableIntBlock_0.doc, _0_MockVariableIntBlock_0.skp, _0_NestedPulsing_0.tip, _0_MockFixedIntBlock_0.tib, _0_NestedPulsing_0.tim, _0_MockVariableIntBlock_0.pyl, _0_Lucene40WithOrds_0.tii, _0_MockFixedIntBlock_0.pyl, _0_MockFixedIntBlock_0.skp, _0_Lucene40WithOrds_0.frq, _0_MockVariableIntBlock_0.tib, _0_MockFixedIntBlock_0.tii, _0_MockVariableIntBlock_0.pos, _0.si, _0_Lucene40WithOrds_0.tib, _0_MockVariableIntBlock_0.tii, _0.fnm, _0_1.del, _0_NestedPulsing_0.frq, _0_MockFixedIntBlock_0.pos, _0_nrm.cfs, _0_NestedPulsing_0.prx, _0_MockFixedIntBlock_0.frq, _0_MockFixedIntBlock_0.doc, _0_MockVariableIntBlock_0.frq, _0_nrm.cfe, _0.fdx, _0_Lucene40WithOrds_0.prx, _0.fdt, segments_3]
[junit4:junit4]   2> 3545 T1809 C150 oasc.SolrDeletionPolicy.onCommit SolrDeletionPolicy.onCommit: commits:num=2
[junit4:junit4]   2> 		commit{dir=MockDirWrapper(org.apache.lucene.store.RAMDirectory@3097d494 lockFactory=org.apache.lucene.store.NativeFSLockFactory@1f34f61e),segFN=segments_3,generation=3,filenames=[_1_NestedPulsing_0.tip, _1_MockFixedIntBlock_0.pyl, _0_MockVariableIntBlock_0.skp, _0_MockFixedIntBlock_0.tib, _1.fnm, _0_Lucene40WithOrds_0.tii, _0_Lucene40WithOrds_0.frq, _1_Lucene40WithOrds_0.tib, _0_MockFixedIntBlock_0.tii, _1_Lucene40WithOrds_0.tii, _1_NestedPulsing_0.tim, _0_Lucene40WithOrds_0.tib, _1_Lucene40WithOrds_0.frq, _0.fnm, _1_MockFixedIntBlock_0.frq, _1_MockVariableIntBlock_0.tii, _0_MockFixedIntBlock_0.pos, _1_MockVariableIntBlock_0.tib, _1.fdx, _1_MockFixedIntBlock_0.skp, _1.fdt, _0_MockVariableIntBlock_0.frq, _1_MockFixedIntBlock_0.pos, _1_MockVariableIntBlock_0.skp, _1_NestedPulsing_0.prx, _0_MockVariableIntBlock_0.doc, _1_MockFixedIntBlock_0.doc, _1_Lucene40WithOrds_0.prx, _1_MockVariableIntBlock_0.pyl, _0_NestedPulsing_0.tip, _0_NestedPulsing_0.tim, _0_MockVariableIntBlock_0.pyl, _0_MockFixedIntBlock_0.skp, _0_MockFixedIntBlock_0.pyl, _0_MockVariableIntBlock_0.tib, _1_MockVariableIntBlock_0.doc, _0_MockVariableIntBlock_0.pos, _0.si, _0_MockVariableIntBlock_0.tii, _1_nrm.cfs, _1_MockFixedIntBlock_0.tii, _1_MockVariableIntBlock_0.pos, _0_NestedPulsing_0.frq, _0_nrm.cfs, _0_NestedPulsing_0.prx, _1_nrm.cfe, _0_MockFixedIntBlock_0.frq, _1_MockVariableIntBlock_0.frq, _1_NestedPulsing_0.frq, _0_MockFixedIntBlock_0.doc, _1.si, _0_nrm.cfe, _1_MockFixedIntBlock_0.tib, _0.fdx, _0_Lucene40WithOrds_0.prx, segments_3, _0.fdt]
[junit4:junit4]   2> 		commit{dir=MockDirWrapper(org.apache.lucene.store.RAMDirectory@3097d494 lockFactory=org.apache.lucene.store.NativeFSLockFactory@1f34f61e),segFN=segments_4,generation=4,filenames=[_1_NestedPulsing_0.tip, _1_MockFixedIntBlock_0.pyl, _0_MockVariableIntBlock_0.skp, _0_MockFixedIntBlock_0.tib, _1.fnm, _0_Lucene40WithOrds_0.tii, _0_Lucene40WithOrds_0.frq, _1_Lucene40WithOrds_0.tib, _0_MockFixedIntBlock_0.tii, _1_Lucene40WithOrds_0.tii, _1_NestedPulsing_0.tim, _0_Lucene40WithOrds_0.tib, _1_Lucene40WithOrds_0.frq, _0.fnm, _1_MockFixedIntBlock_0.frq, _1_MockVariableIntBlock_0.tii, _0_MockFixedIntBlock_0.pos, _1_MockVariableIntBlock_0.tib, _1.fdx, _1_MockFixedIntBlock_0.skp, _1.fdt, _0_MockVariableIntBlock_0.frq, _1_MockFixedIntBlock_0.pos, _1_MockVariableIntBlock_0.skp, _1_NestedPulsing_0.prx, _0_MockVariableIntBlock_0.doc, _1_MockFixedIntBlock_0.doc, _1_Lucene40WithOrds_0.prx, _1_MockVariableIntBlock_0.pyl, _0_NestedPulsing_0.tip, _0_NestedPulsing_0.tim, _0_MockVariableIntBlock_0.pyl, _0_MockFixedIntBlock_0.skp, _0_MockFixedIntBlock_0.pyl, _0_MockVariableIntBlock_0.tib, _1_MockVariableIntBlock_0.doc, _0_MockVariableIntBlock_0.pos, _0.si, _0_MockVariableIntBlock_0.tii, _1_nrm.cfs, _1_MockFixedIntBlock_0.tii, _1_MockVariableIntBlock_0.pos, _0_NestedPulsing_0.frq, _0_nrm.cfs, _1_1.del, _0_NestedPulsing_0.prx, _1_nrm.cfe, _0_MockFixedIntBlock_0.frq, _1_MockVariableIntBlock_0.frq, _1_NestedPulsing_0.frq, _0_MockFixedIntBlock_0.doc, _1.si, _0_nrm.cfe, _1_MockFixedIntBlock_0.tib, _0.fdx, _0_Lucene40WithOrds_0.prx, _0.fdt, segments_4]
[junit4:junit4]   2> 3545 T1819 C151 oasc.SolrDeletionPolicy.updateCommits newest commit = 3
[junit4:junit4]   2> 3545 T1809 C150 oasc.SolrDeletionPolicy.updateCommits newest commit = 4
[junit4:junit4]   2> 3546 T1819 C151 oass.SolrIndexSearcher.<init> Opening Searcher@69ad1413 main
[junit4:junit4]   2> 3546 T1809 C150 oass.SolrIndexSearcher.<init> Opening Searcher@26a13b50 main
[junit4:junit4]   2> 3546 T1819 C151 oass.SolrIndexSearcher.getIndexDir WARNING WARNING: Directory impl does not support setting indexDir: org.apache.lucene.store.MockDirectoryWrapper
[junit4:junit4]   2> 3546 T1809 C150 oass.SolrIndexSearcher.getIndexDir WARNING WARNING: Directory impl does not support setting indexDir: org.apache.lucene.store.MockDirectoryWrapper
[junit4:junit4]   2> 3546 T1825 oasc.SolrCore.registerSearcher [collection1] Registered new searcher Searcher@69ad1413 main{StandardDirectoryReader(segments_3:4:nrt _0(5.0):C3/1)}
[junit4:junit4]   2> 3546 T1819 C151 oasu.DirectUpdateHandler2.commit end_commit_flush
[junit4:junit4]   2> 3546 T1815 oasc.SolrCore.registerSearcher [collection1] Registered new searcher Searcher@26a13b50 main{StandardDirectoryReader(segments_4:6:nrt _0(5.0):C1 _1(5.0):C2/1)}
[junit4:junit4]   2> 3547 T1819 C151 UPDATE [collection1] webapp=/solr path=/update params={waitSearcher=true&commit=true&wt=javabin&expungeDeletes=false&version=2&softCommit=false} {delete=[2 (-1413140366093189120)],commit=} 0 4
[junit4:junit4]   2> 3546 T1809 C150 oasu.DirectUpdateHandler2.commit end_commit_flush
[junit4:junit4]   2> 3547 T1809 C150 UPDATE [collection1] webapp=/solr path=/update params={waitSearcher=true&commit=true&wt=javabin&expungeDeletes=false&version=2&softCommit=false} {delete=[2 (-1413140366093189120)],commit=} 0 4
[junit4:junit4]   2> 3549 T1808 C150 REQ [collection1] webapp=/solr path=/select params={wt=javabin&q=*:*&version=2} hits=2 status=0 QTime=0 
[junit4:junit4]   2> 3552 T1818 C151 REQ [collection1] webapp=/solr path=/select params={wt=javabin&q=*:*&version=2} hits=2 status=0 QTime=0 
[junit4:junit4]   2> 3555 T1818 C151 oasu.DirectUpdateHandler2.commit start commit{flags=0,_version_=0,optimize=true,openSearcher=true,waitSearcher=true,expungeDeletes=false,softCommit=false}
[junit4:junit4]   2> 3559 T1818 C151 oasc.SolrDeletionPolicy.onCommit SolrDeletionPolicy.onCommit: commits:num=2
[junit4:junit4]   2> 		commit{dir=MockDirWrapper(org.apache.lucene.store.RAMDirectory@4e8a7c88 lockFactory=org.apache.lucene.store.NativeFSLockFactory@749acf4b),segFN=segments_3,generation=3,filenames=[_0_MockVariableIntBlock_0.doc, _0_MockVariableIntBlock_0.skp, _0_NestedPulsing_0.tip, _0_MockFixedIntBlock_0.tib, _0_NestedPulsing_0.tim, _0_MockVariableIntBlock_0.pyl, _0_Lucene40WithOrds_0.tii, _0_MockFixedIntBlock_0.pyl, _0_MockFixedIntBlock_0.skp, _0_Lucene40WithOrds_0.frq, _0_MockVariableIntBlock_0.tib, _0_MockFixedIntBlock_0.tii, _0_MockVariableIntBlock_0.pos, _0.si, _0_Lucene40WithOrds_0.tib, _0_MockVariableIntBlock_0.tii, _0.fnm, _0_1.del, _0_NestedPulsing_0.frq, _0_MockFixedIntBlock_0.pos, _0_nrm.cfs, _0_NestedPulsing_0.prx, _0_MockFixedIntBlock_0.frq, _0_MockFixedIntBlock_0.doc, _0_MockVariableIntBlock_0.frq, _0_nrm.cfe, _0.fdx, _0_Lucene40WithOrds_0.prx, _0.fdt, segments_3]
[junit4:junit4]   2> 		commit{dir=MockDirWrapper(org.apache.lucene.store.RAMDirectory@4e8a7c88 lockFactory=org.apache.lucene.store.NativeFSLockFactory@749acf4b),segFN=segments_4,generation=4,filenames=[_1_MockVariableIntBlock_0.skp, _1_NestedPulsing_0.tip, _1_NestedPulsing_0.prx, _1_MockFixedIntBlock_0.doc, _1_Lucene40WithOrds_0.prx, _1_MockFixedIntBlock_0.pyl, _1_MockVariableIntBlock_0.pyl, _1.fnm, _1_Lucene40WithOrds_0.tib, _1_MockVariableIntBlock_0.doc, _1_Lucene40WithOrds_0.tii, _1_NestedPulsing_0.tim, _1_nrm.cfs, _1_MockFixedIntBlock_0.tii, _1_Lucene40WithOrds_0.frq, _1_MockFixedIntBlock_0.frq, _1_MockVariableIntBlock_0.tii, _1_MockVariableIntBlock_0.pos, _1_nrm.cfe, _1_MockVariableIntBlock_0.tib, _1.fdx, _1_MockVariableIntBlock_0.frq, _1_NestedPulsing_0.frq, _1_MockFixedIntBlock_0.skp, _1.fdt, _1.si, _1_MockFixedIntBlock_0.tib, _1_MockFixedIntBlock_0.pos, segments_4]
[junit4:junit4]   2> 3560 T1818 C151 oasc.SolrDeletionPolicy.updateCommits newest commit = 4
[junit4:junit4]   2> 3561 T1818 C151 oass.SolrIndexSearcher.<init> Opening Searcher@21830052 main
[junit4:junit4]   2> 3561 T1818 C151 oass.SolrIndexSearcher.getIndexDir WARNING WARNING: Directory impl does not support setting indexDir: org.apache.lucene.store.MockDirectoryWrapper
[junit4:junit4]   2> 3562 T1825 oasc.SolrCore.registerSearcher [collection1] Registered new searcher Searcher@21830052 main{StandardDirectoryReader(segments_4:6:nrt _1(5.0):C2)}
[junit4:junit4]   2> 3562 T1818 C151 oasu.DirectUpdateHandler2.commit end_commit_flush
[junit4:junit4]   2> 3562 T1818 C151 UPDATE [collection1] webapp=/solr path=/update params={optimize=true&maxSegments=1&waitSearcher=true&wt=javabin&version=2} {optimize=} 0 7
[junit4:junit4]   2> 3565 T1828 C152 oasu.DirectUpdateHandler2.commit start commit{flags=0,_version_=0,optimize=true,openSearcher=true,waitSearcher=true,expungeDeletes=false,softCommit=false}
[junit4:junit4]   2> 3566 T1828 C152 oass.SolrIndexSearcher.<init> Opening Searcher@235a57af main
[junit4:junit4]   2> 3566 T1828 C152 oass.SolrIndexSearcher.getIndexDir WARNING WARNING: Directory impl does not support setting indexDir: org.apache.lucene.store.MockDirectoryWrapper
[junit4:junit4]   2> 3567 T1835 oasc.SolrCore.registerSearcher [collection1] Registered new searcher Searcher@235a57af main{StandardDirectoryReader(segments_1:1:nrt)}
[junit4:junit4]   2> 3567 T1828 C152 oasu.DirectUpdateHandler2.commit end_commit_flush
[junit4:junit4]   2> 3567 T1828 C152 UPDATE [collection1] webapp=/solr path=/update params={optimize=true&maxSegments=1&waitSearcher=true&wt=javabin&version=2} {optimize=} 0 2
[junit4:junit4]   2> 3570 T1838 C153 oasu.DirectUpdateHandler2.commit start commit{flags=0,_version_=0,optimize=true,openSearcher=true,waitSearcher=true,expungeDeletes=false,softCommit=false}
[junit4:junit4]   2> 3570 T1838 C153 oass.SolrIndexSearcher.<init> Opening Searcher@daa807 main
[junit4:junit4]   2> 3571 T1838 C153 oass.SolrIndexSearcher.getIndexDir WARNING WARNING: Directory impl does not support setting indexDir: org.apache.lucene.store.MockDirectoryWrapper
[junit4:junit4]   2> 3571 T1845 oasc.SolrCore.registerSearcher [collection1] Registered new searcher Searcher@daa807 main{StandardDirectoryReader(segments_1:1:nrt)}
[junit4:junit4]   2> 3571 T1838 C153 oasu.DirectUpdateHandler2.commit end_commit_flush
[junit4:junit4]   2> 3571 T1838 C153 UPDATE [collection1] webapp=/solr path=/update params={optimize=true&maxSegments=1&waitSearcher=true&wt=javabin&version=2} {optimize=} 0 1
[junit4:junit4]   2> 3574 T1848 C154 oasu.DirectUpdateHandler2.commit start commit{flags=0,_version_=0,optimize=true,openSearcher=true,waitSearcher=true,expungeDeletes=false,softCommit=false}
[junit4:junit4]   2> 3574 T1848 C154 oass.SolrIndexSearcher.<init> Opening Searcher@3de0878d main
[junit4:junit4]   2> 3575 T1848 C154 oass.SolrIndexSearcher.getIndexDir WARNING WARNING: Directory impl does not support setting indexDir: org.apache.lucene.store.MockDirectoryWrapper
[junit4:junit4]   2> 3575 T1855 oasc.SolrCore.registerSearcher [collection1] Registered new searcher Searcher@3de0878d main{StandardDirectoryReader(segments_1:1:nrt)}
[junit4:junit4]   2> 3575 T1848 C154 oasu.DirectUpdateHandler2.commit end_commit_flush
[junit4:junit4]   2> 3575 T1848 C154 UPDATE [collection1] webapp=/solr path=/update params={optimize=true&maxSegments=1&waitSearcher=true&wt=javabin&version=2} {optimize=} 0 1
[junit4:junit4]   2> 3705 T1840 C153 oasu.DirectUpdateHandler2.commit start commit{flags=0,_version_=0,optimize=false,openSearcher=true,waitSearcher=true,expungeDeletes=false,softCommit=false}
[junit4:junit4]   2> 3705 T1849 C154 oasu.DirectUpdateHandler2.commit start commit{flags=0,_version_=0,optimize=false,openSearcher=true,waitSearcher=true,expungeDeletes=false,softCommit=false}
[junit4:junit4]   2> 3705 T1820 C151 oasu.DirectUpdateHandler2.commit start commit{flags=0,_version_=0,optimize=false,openSearcher=true,waitSearcher=true,expungeDeletes=false,softCommit=false}
[junit4:junit4]   2> 3707 T1829 C152 oasu.DirectUpdateHandler2.commit start commit{flags=0,_version_=0,optimize=false,openSearcher=true,waitSearcher=true,expungeDeletes=false,softCommit=false}
[junit4:junit4]   2> 3718 T1820 C151 oasc.SolrDeletionPolicy.onCommit SolrDeletionPolicy.onCommit: commits:num=2
[junit4:junit4]   2> 		commit{dir=MockDirWrapper(org.apache.lucene.store.RAMDirectory@4e8a7c88 lockFactory=org.apache.lucene.store.NativeFSLockFactory@749acf4b),segFN=segments_4,generation=4,filenames=[_1_MockVariableIntBlock_0.skp, _1_NestedPulsing_0.tip, _1_NestedPulsing_0.prx, _1_MockFixedIntBlock_0.doc, _1_Lucene40WithOrds_0.prx, _1_MockFixedIntBlock_0.pyl, _1_MockVariableIntBlock_0.pyl, _1.fnm, _1_Lucene40WithOrds_0.tib, _1_MockVariableIntBlock_0.doc, _1_Lucene40WithOrds_0.tii, _1_NestedPulsing_0.tim, _1_nrm.cfs, _1_MockFixedIntBlock_0.tii, _1_Lucene40WithOrds_0.frq, _1_MockFixedIntBlock_0.frq, _1_MockVariableIntBlock_0.tii, _1_MockVariableIntBlock_0.pos, _1_nrm.cfe, _1_MockVariableIntBlock_0.tib, _1.fdx, _1_MockVariableIntBlock_0.frq, _1_NestedPulsing_0.frq, _1_MockFixedIntBlock_0.skp, _1.fdt, _1.si, _1_MockFixedIntBlock_0.tib, _1_MockFixedIntBlock_0.pos, segments_4]
[junit4:junit4]   2> 		commit{dir=MockDirWrapper(org.apache.lucene.store.RAMDirectory@4e8a7c88 lockFactory=org.apache.lucene.store.NativeFSLockFactory@749acf4b),segFN=segments_5,generation=5,filenames=[_3_nrm.cfe, _1_NestedPulsing_0.tip, _2_NestedPulsing_0.tim, _3_MockFixedIntBlock_0.skp, _3_MockVariableIntBlock_0.frq, _3_Lucene40WithOrds_0.tii, _1_MockFixedIntBlock_0.pyl, _3.fdt, _3_NestedPulsing_0.prx, _1.fnm, _2_MockFixedIntBlock_0.tii, _3_Lucene40WithOrds_0.tib, _3_MockFixedIntBlock_0.pyl, _2_MockFixedIntBlock_0.tib, _2_MockFixedIntBlock_0.pyl, _1_Lucene40WithOrds_0.tib, _2_MockFixedIntBlock_0.frq, _1_NestedPulsing_0.tim, _1_Lucene40WithOrds_0.tii, _2_NestedPulsing_0.tip, _2_MockVariableIntBlock_0.pos, _1_Lucene40WithOrds_0.frq, _1_MockFixedIntBlock_0.frq, _1_MockVariableIntBlock_0.tii, _3_MockVariableIntBlock_0.doc, _3_NestedPulsing_0.tim, _2.fdt, _2.fdx, _1_MockVariableIntBlock_0.tib, _3_nrm.cfs, _1.fdx, _3_NestedPulsing_0.frq, _1_MockFixedIntBlock_0.skp, _3_NestedPulsing_0.tip, _2_MockFixedIntBlock_0.pos, _1.fdt, _3_MockVariableIntBlock_0.tib, _3.si, _2_MockFixedIntBlock_0.doc, _1_MockFixedIntBlock_0.pos, _2_MockVariableIntBlock_0.skp, _1_MockVariableIntBlock_0.skp, _2.si, _1_NestedPulsing_0.prx, _2_MockVariableIntBlock_0.pyl, _3_MockFixedIntBlock_0.frq, _1_MockFixedIntBlock_0.doc, _1_Lucene40WithOrds_0.prx, _2_MockFixedIntBlock_0.skp, _3_MockFixedIntBlock_0.doc, _1_MockVariableIntBlock_0.pyl, _2_MockVariableIntBlock_0.frq, _3.fnm, _3_MockVariableIntBlock_0.tii, _2_MockVariableIntBlock_0.doc, _2_nrm.cfe, _2_Lucene40WithOrds_0.prx, _1_MockVariableIntBlock_0.doc, _2_nrm.cfs, _1_MockFixedIntBlock_0.tii, _1_nrm.cfs, _2_MockVariableIntBlock_0.tii, _2_Lucene40WithOrds_0.frq, _2_MockVariableIntBlock_0.tib, _3_MockFixedIntBlock_0.tib, _1_MockVariableIntBlock_0.pos, _2_NestedPulsing_0.prx, _3_Lucene40WithOrds_0.frq, _3_MockFixedIntBlock_0.pos, _2.fnm, _1_nrm.cfe, _3.fdx, _2_Lucene40WithOrds_0.tii, _1_MockVariableIntBlock_0.frq, _1_NestedPulsing_0.frq, _1.si, _2_NestedPulsing_0.frq, _3_MockVariableIntBlock_0.pyl, _1_MockFixedIntBlock_0.tib, _2_Lucene40WithOrds_0.tib, _3_Lucene40WithOrds_0.prx, segments_5, _3_MockVariableIntBlock_0.skp, _3_MockVariableIntBlock_0.pos, _3_MockFixedIntBlock_0.tii]
[junit4:junit4]   2> 3720 T1820 C151 oasc.SolrDeletionPolicy.updateCommits newest commit = 5
[junit4:junit4]   2> 3725 T1840 C153 oasc.SolrDeletionPolicy.onCommit SolrDeletionPolicy.onCommit: commits:num=2
[junit4:junit4]   2> 		commit{dir=MockDirWrapper(org.apache.lucene.store.RAMDirectory@621cc396 lockFactory=org.apache.lucene.store.NativeFSLockFactory@4dafe9ed),segFN=segments_1,generation=1,filenames=[segments_1]
[junit4:junit4]   2> 		commit{dir=MockDirWrapper(org.apache.lucene.store.RAMDirectory@621cc396 lockFactory=org.apache.lucene.store.NativeFSLockFactory@4dafe9ed),segFN=segments_2,generation=2,filenames=[_1_NestedPulsing_0.tip, _2_NestedPulsing_0.tim, _1_MockFixedIntBlock_0.pyl, _0_MockVariableIntBlock_0.skp, _0_MockFixedIntBlock_0.tib, _1.fnm, _2_MockFixedIntBlock_0.tii, _0_Lucene40WithOrds_0.tii, _2_MockFixedIntBlock_0.tib, _2_MockFixedIntBlock_0.pyl, _0_Lucene40WithOrds_0.frq, _1_Lucene40WithOrds_0.tib, _0_MockFixedIntBlock_0.tii, _2_MockFixedIntBlock_0.frq, _1_NestedPulsing_0.tim, _1_Lucene40WithOrds_0.tii, _0_Lucene40WithOrds_0.tib, _2_NestedPulsing_0.tip, _2_MockVariableIntBlock_0.pos, _1_Lucene40WithOrds_0.frq, _0.fnm, _1_MockFixedIntBlock_0.frq, _1_MockVariableIntBlock_0.tii, _2.fdt, _0_MockFixedIntBlock_0.pos, _2.fdx, _1_MockVariableIntBlock_0.tib, _1.fdx, _1_MockFixedIntBlock_0.skp, _1.fdt, _2_MockFixedIntBlock_0.pos, _0_MockVariableIntBlock_0.frq, _2_MockFixedIntBlock_0.doc, _1_MockFixedIntBlock_0.pos, _2_MockVariableIntBlock_0.skp, _1_MockVariableIntBlock_0.skp, _2.si, _1_NestedPulsing_0.prx, _2_MockVariableIntBlock_0.pyl, _1_MockFixedIntBlock_0.doc, _0_MockVariableIntBlock_0.doc, _1_Lucene40WithOrds_0.prx, _2_MockFixedIntBlock_0.skp, _1_MockVariableIntBlock_0.pyl, _2_MockVariableIntBlock_0.frq, _0_NestedPulsing_0.tip, _2_MockVariableIntBlock_0.doc, _0_NestedPulsing_0.tim, _0_MockVariableIntBlock_0.pyl, _2_nrm.cfe, _0_MockFixedIntBlock_0.skp, _0_MockFixedIntBlock_0.pyl, _2_Lucene40WithOrds_0.prx, _0_MockVariableIntBlock_0.tib, _1_MockVariableIntBlock_0.doc, _0_MockVariableIntBlock_0.pos, _2_nrm.cfs, _0.si, _0_MockVariableIntBlock_0.tii, _1_MockFixedIntBlock_0.tii, _1_nrm.cfs, _2_MockVariableIntBlock_0.tii, _2_Lucene40WithOrds_0.frq, _2_MockVariableIntBlock_0.tib, _1_MockVariableIntBlock_0.pos, _2_NestedPulsing_0.prx, _0_NestedPulsing_0.frq, _0_nrm.cfs, _0_NestedPulsing_0.prx, _1_nrm.cfe, _2.fnm, _0_MockFixedIntBlock_0.frq, _1_MockVariableIntBlock_0.frq, _2_Lucene40WithOrds_0.tii, _1_NestedPulsing_0.frq, _0_MockFixedIntBlock_0.doc, _1.si, _0_nrm.cfe, _2_NestedPulsing_0.frq, _1_MockFixedIntBlock_0.tib, segments_2, _0.fdx, _2_Lucene40WithOrds_0.tib, _0_Lucene40WithOrds_0.prx, _0.fdt]
[junit4:junit4]   2> 3725 T1849 C154 oasc.SolrDeletionPolicy.onCommit SolrDeletionPolicy.onCommit: commits:num=2
[junit4:junit4]   2> 		commit{dir=MockDirWrapper(org.apache.lucene.store.RAMDirectory@11061cba lockFactory=org.apache.lucene.store.NativeFSLockFactory@efc70c0),segFN=segments_1,generation=1,filenames=[segments_1]
[junit4:junit4]   2> 		commit{dir=MockDirWrapper(org.apache.lucene.store.RAMDirectory@11061cba lockFactory=org.apache.lucene.store.NativeFSLockFactory@efc70c0),segFN=segments_2,generation=2,filenames=[_2_NestedPulsing_0.tim, _1_NestedPulsing_0.tip, _1_MockFixedIntBlock_0.pyl, _0_MockVariableIntBlock_0.skp, _0_MockFixedIntBlock_0.tib, _2_MockFixedIntBlock_0.tii, _1.fnm, _0_Lucene40WithOrds_0.tii, _2_MockFixedIntBlock_0.tib, _2_MockFixedIntBlock_0.pyl, _0_Lucene40WithOrds_0.frq, _1_Lucene40WithOrds_0.tib, _0_MockFixedIntBlock_0.tii, _2_MockFixedIntBlock_0.frq, _1_Lucene40WithOrds_0.tii, _1_NestedPulsing_0.tim, _0_Lucene40WithOrds_0.tib, _2_NestedPulsing_0.tip, _2_MockVariableIntBlock_0.pos, _1_Lucene40WithOrds_0.frq, _0.fnm, _1_MockFixedIntBlock_0.frq, _1_MockVariableIntBlock_0.tii, _2.fdt, _0_MockFixedIntBlock_0.pos, _2.fdx, _1_MockVariableIntBlock_0.tib, _1.fdx, _1_MockFixedIntBlock_0.skp, _2_MockFixedIntBlock_0.pos, _1.fdt, _0_MockVariableIntBlock_0.frq, _2_MockFixedIntBlock_0.doc, _1_MockFixedIntBlock_0.pos, _2_MockVariableIntBlock_0.skp, _2.si, _1_MockVariableIntBlock_0.skp, _2_MockVariableIntBlock_0.pyl, _1_NestedPulsing_0.prx, _0_MockVariableIntBlock_0.doc, _1_MockFixedIntBlock_0.doc, _2_MockFixedIntBlock_0.skp, _1_Lucene40WithOrds_0.prx, _2_MockVariableIntBlock_0.frq, _1_MockVariableIntBlock_0.pyl, _0_NestedPulsing_0.tip, _2_MockVariableIntBlock_0.doc, _0_NestedPulsing_0.tim, _0_MockVariableIntBlock_0.pyl, _2_nrm.cfe, _0_MockFixedIntBlock_0.skp, _0_MockFixedIntBlock_0.pyl, _2_Lucene40WithOrds_0.prx, _0_MockVariableIntBlock_0.tib, _1_MockVariableIntBlock_0.doc, _0_MockVariableIntBlock_0.pos, _2_nrm.cfs, _0.si, _0_MockVariableIntBlock_0.tii, _2_MockVariableIntBlock_0.tii, _1_nrm.cfs, _1_MockFixedIntBlock_0.tii, _2_Lucene40WithOrds_0.frq, _2_MockVariableIntBlock_0.tib, _2_NestedPulsing_0.prx, _1_MockVariableIntBlock_0.pos, _0_NestedPulsing_0.frq, _0_nrm.cfs, _0_NestedPulsing_0.prx, _2.fnm, _1_nrm.cfe, _0_MockFixedIntBlock_0.frq, _2_Lucene40WithOrds_0.tii, _1_MockVariableIntBlock_0.frq, _1_NestedPulsing_0.frq, _0_MockFixedIntBlock_0.doc, _1.si, _2_NestedPulsing_0.frq, _0_nrm.cfe, _1_MockFixedIntBlock_0.tib, segments_2, _2_Lucene40WithOrds_0.tib, _0.fdx, _0_Lucene40WithOrds_0.prx, _0.fdt]
[junit4:junit4]   2> 3727 T1840 C153 oasc.SolrDeletionPolicy.updateCommits newest commit = 2
[junit4:junit4]   2> 3729 T1829 C152 oasc.SolrDeletionPolicy.onCommit SolrDeletionPolicy.onCommit: commits:num=2
[junit4:junit4]   2> 		commit{dir=MockDirWrapper(org.apache.lucene.store.RAMDirectory@7167a89c lockFactory=org.apache.lucene.store.NativeFSLockFactory@1bd576),segFN=segments_1,generation=1,filenames=[segments_1]
[junit4:junit4]   2> 		commit{dir=MockDirWrapper(org.apache.lucene.store.RAMDirectory@7167a89c lockFactory=org.apache.lucene.store.NativeFSLockFactory@1bd576),segFN=segments_2,generation=2,filenames=[_2_NestedPulsing_0.tim, _1_NestedPulsing_0.tip, _1_MockFixedIntBlock_0.pyl, _0_MockVariableIntBlock_0.skp, _0_MockFixedIntBlock_0.tib, _2_MockFixedIntBlock_0.tii, _1.fnm, _0_Lucene40WithOrds_0.tii, _2_MockFixedIntBlock_0.tib, _2_MockFixedIntBlock_0.pyl, _0_Lucene40WithOrds_0.frq, _1_Lucene40WithOrds_0.tib, _0_MockFixedIntBlock_0.tii, _2_MockFixedIntBlock_0.frq, _1_NestedPulsing_0.tim, _1_Lucene40WithOrds_0.tii, _0_Lucene40WithOrds_0.tib, _2_NestedPulsing_0.tip, _2_MockVariableIntBlock_0.pos, _1_Lucene40WithOrds_0.frq, _0.fnm, _1_MockFixedIntBlock_0.frq, _1_MockVariableIntBlock_0.tii, _2.fdt, _0_MockFixedIntBlock_0.pos, _2.fdx, _1_MockVariableIntBlock_0.tib, _1.fdx, _1_MockFixedIntBlock_0.skp, _2_MockFixedIntBlock_0.pos, _1.fdt, _0_MockVariableIntBlock_0.frq, _2_MockFixedIntBlock_0.doc, _1_MockFixedIntBlock_0.pos, _2_MockVariableIntBlock_0.skp, _2.si, _1_MockVariableIntBlock_0.skp, _2_MockVariableIntBlock_0.pyl, _1_NestedPulsing_0.prx, _1_MockFixedIntBlock_0.doc, _0_MockVariableIntBlock_0.doc, _2_MockFixedIntBlock_0.skp, _1_Lucene40WithOrds_0.prx, _2_MockVariableIntBlock_0.frq, _1_MockVariableIntBlock_0.pyl, _0_NestedPulsing_0.tip, _2_MockVariableIntBlock_0.doc, _0_NestedPulsing_0.tim, _0_MockVariableIntBlock_0.pyl, _2_nrm.cfe, _0_MockFixedIntBlock_0.skp, _0_MockFixedIntBlock_0.pyl, _2_Lucene40WithOrds_0.prx, _0_MockVariableIntBlock_0.tib, _1_MockVariableIntBlock_0.doc, _0_MockVariableIntBlock_0.pos, _2_nrm.cfs, _0.si, _0_MockVariableIntBlock_0.tii, _2_MockVariableIntBlock_0.tii, _1_MockFixedIntBlock_0.tii, _1_nrm.cfs, _2_Lucene40WithOrds_0.frq, _2_MockVariableIntBlock_0.tib, _2_NestedPulsing_0.prx, _1_MockVariableIntBlock_0.pos, _0_NestedPulsing_0.frq, _0_nrm.cfs, _0_NestedPulsing_0.prx, _2.fnm, _1_nrm.cfe, _0_MockFixedIntBlock_0.frq, _2_Lucene40WithOrds_0.tii, _1_MockVariableIntBlock_0.frq, _1_NestedPulsing_0.frq, _0_MockFixedIntBlock_0.doc, _1.si, _2_NestedPulsing_0.frq, _0_nrm.cfe, segments_2, _1_MockFixedIntBlock_0.tib, _2_Lucene40WithOrds_0.tib, _0.fdx, _0_Lucene40WithOrds_0.prx, _0.fdt]
[junit4:junit4]   2> 3728 T1849 C154 oasc.SolrDeletionPolicy.updateCommits newest commit = 2
[junit4:junit4]   2> 3735 T1829 C152 oasc.SolrDeletionPolicy.updateCommits newest commit = 2
[junit4:junit4]   2> 3736 T1820 C151 oass.SolrIndexSearcher.<init> Opening Searcher@2a6c8137 main
[junit4:junit4]   2> 3736 T1820 C151 oass.SolrIndexSearcher.getIndexDir WARNING WARNING: Directory impl does not support setting indexDir: org.apache.lucene.store.MockDirectoryWrapper
[junit4:junit4]   2> 3737 T1825 oasc.SolrCore.registerSearcher [collection1] Registered new searcher Searcher@2a6c8137 main{StandardDirectoryReader(segments_5:17:nrt _1(5.0):C2 _2(5.0):C18 _3(5.0):C7 _4(5.0):C14 _5(5.0):C5)}
[junit4:junit4]   2> 3737 T1820 C151 oasu.DirectUpdateHandler2.commit end_commit_flush
[junit4:junit4]   2> 3738 T1820 C151 UPDATE [collection1] webapp=/solr path=/update params={waitSearcher=true&commit=true&wt=javabin&expungeDeletes=false&version=2&softCommit=false} {add=[27 (1413140366131986432), 28 (1413140366133035009), 29 (1413140366134083584), 30 (1413140366135132161), 31 (1413140366136180737), 33 (1413140366259912704), 36 (1413140366260961280), 39 (1413140366262009856), 41 (1413140366262009859), 42 (1413140366263058433)],commit=} 0 158
[junit4:junit4]   2> 3738 T1819 C151 oasu.DirectUpdateHandler2.commit start commit{flags=0,_version_=0,optimize=false,openSearcher=true,waitSearcher=true,expungeDeletes=false,softCommit=false}
[junit4:junit4]   2> 3747 T1819 C151 oasc.SolrDeletionPolicy.onCommit SolrDeletionPolicy.onCommit: commits:num=2
[junit4:junit4]   2> 		commit{dir=MockDirWrapper(org.apache.lucene.store.RAMDirectory@4e8a7c88 lockFactory=org.apache.lucene.store.NativeFSLockFactory@749acf4b),segFN=segments_5,generation=5,filenames=[_3_nrm.cfe, _1_NestedPulsing_0.tip, _2_NestedPulsing_0.tim, _3_MockFixedIntBlock_0.skp, _3_MockVariableIntBlock_0.frq, _3_Lucene40WithOrds_0.tii, _1_MockFixedIntBlock_0.pyl, _3.fdt, _3_NestedPulsing_0.prx, _1.fnm, _2_MockFixedIntBlock_0.tii, _3_Lucene40WithOrds_0.tib, _3_MockFixedIntBlock_0.pyl, _2_MockFixedIntBlock_0.tib, _2_MockFixedIntBlock_0.pyl, _1_Lucene40WithOrds_0.tib, _2_MockFixedIntBlock_0.frq, _1_NestedPulsing_0.tim, _1_Lucene40WithOrds_0.tii, _2_NestedPulsing_0.tip, _2_MockVariableIntBlock_0.pos, _1_Lucene40WithOrds_0.frq, _1_MockFixedIntBlock_0.frq, _1_MockVariableIntBlock_0.tii, _3_MockVariableIntBlock_0.doc, _3_NestedPulsing_0.tim, _2.fdt, _2.fdx, _1_MockVariableIntBlock_0.tib, _3_nrm.cfs, _1.fdx, _3_NestedPulsing_0.frq, _1_MockFixedIntBlock_0.skp, _3_NestedPulsing_0.tip, _2_MockFixedIntBlock_0.pos, _1.fdt, _3_MockVariableIntBlock_0.tib, _3.si, _2_MockFixedIntBlock_0.doc, _1_MockFixedIntBlock_0.pos, _2_MockVariableIntBlock_0.skp, _1_MockVariableIntBlock_0.skp, _2.si, _1_NestedPulsing_0.prx, _2_MockVariableIntBlock_0.pyl, _3_MockFixedIntBlock_0.frq, _1_MockFixedIntBlock_0.doc, _1_Lucene40WithOrds_0.prx, _2_MockFixedIntBlock_0.skp, _3_MockFixedIntBlock_0.doc, _1_MockVariableIntBlock_0.pyl, _2_MockVariableIntBlock_0.frq, _3.fnm, _3_MockVariableIntBlock_0.tii, _2_MockVariableIntBlock_0.doc, _2_nrm.cfe, _2_Lucene40WithOrds_0.prx, _1_MockVariableIntBlock_0.doc, _2_nrm.cfs, _1_MockFixedIntBlock_0.tii, _1_nrm.cfs, _2_MockVariableIntBlock_0.tii, _2_Lucene40WithOrds_0.frq, _2_MockVariableIntBlock_0.tib, _3_MockFixedIntBlock_0.tib, _1_MockVariableIntBlock_0.pos, _2_NestedPulsing_0.prx, _3_Lucene40WithOrds_0.frq, _3_MockFixedIntBlock_0.pos, _2.fnm, _1_nrm.cfe, _3.fdx, _2_Lucene40WithOrds_0.tii, _1_MockVariableIntBlock_0.frq, _1_NestedPulsing_0.frq, _1.si, _2_NestedPulsing_0.frq, _3_MockVariableIntBlock_0.pyl, _1_MockFixedIntBlock_0.tib, _2_Lucene40WithOrds_0.tib, _3_Lucene40WithOrds_0.prx, segments_5, _3_MockVariableIntBlock_0.skp, _3_MockVariableIntBlock_0.pos, _3_MockFixedIntBlock_0.tii]
[junit4:junit4]   2> 		commit{dir=MockDirWrapper(org.apache.lucene.store.RAMDirectory@4e8a7c88 lockFactory=org.apache.lucene.store.NativeFSLockFactory@749acf4b),segFN=segments_6,generation=6,filenames=[_1_NestedPulsing_0.tip, _5_nrm.cfe, _5_NestedPulsing_0.tip, _8_MockFixedIntBlock_0.tii, _6_MockFixedIntBlock_0.pyl, _5_NestedPulsing_0.tim, _8_MockFixedIntBlock_0.pyl, _3_MockVariableIntBlock_0.frq, _8_MockFixedIntBlock_0.tib, _3.fdt, _4_MockVariableIntBlock_0.tii, _5_Lucene40WithOrds_0.tib, _6_MockFixedIntBlock_0.skp, _7.fnm, _7_NestedPulsing_0.frq, _5_Lucene40WithOrds_0.tii, _1_Lucene40WithOrds_0.tib, _1_NestedPulsing_0.tim, _1_Lucene40WithOrds_0.tii, _7_MockFixedIntBlock_0.pos, _6_MockVariableIntBlock_0.tii, _7_MockFixedIntBlock_0.skp, _1_Lucene40WithOrds_0.frq, _6_MockVariableIntBlock_0.tib, _4_MockFixedIntBlock_0.pos, _1_MockVariableIntBlock_0.tii, _3_NestedPulsing_0.tim, _1_MockVariableIntBlock_0.tib, _1.fdx, _4_MockVariableIntBlock_0.tib, _3_NestedPulsing_0.tip, _1.fdt, _5_nrm.cfs, _4_MockFixedIntBlock_0.frq, _7_NestedPulsing_0.tim, _1_MockFixedIntBlock_0.pos, _8_MockVariableIntBlock_0.skp, _6.fdt, _7_NestedPulsing_0.tip, _5_Lucene40WithOrds_0.prx, _1_MockVariableIntBlock_0.skp, _2.si, _7_MockVariableIntBlock_0.pos, _3_MockFixedIntBlock_0.frq, _6.fdx, _1_Lucene40WithOrds_0.prx, _1_MockVariableIntBlock_0.pyl, _6_MockFixedIntBlock_0.tib, _6_MockFixedIntBlock_0.tii, _3_MockVariableIntBlock_0.tii, _2_nrm.cfe, _8_MockFixedIntBlock_0.frq, _2_nrm.cfs, _7_MockVariableIntBlock_0.skp, _6_MockFixedIntBlock_0.doc, _5_MockFixedIntBlock_0.frq, _5_MockFixedIntBlock_0.tib, _2_NestedPulsing_0.prx, _4_MockVariableIntBlock_0.frq, _7_MockFixedIntBlock_0.doc, _2.fnm, _5_MockVariableIntBlock_0.frq, _3.fdx, _8_MockVariableIntBlock_0.pos, _1.si, _6_NestedPulsing_0.tip, _8_NestedPulsing_0.tip, _6_NestedPulsing_0.tim, _5_MockFixedIntBlock_0.tii, _8_NestedPulsing_0.tim, _3_MockVariableIntBlock_0.pos, _3_nrm.cfe, _8_MockVariableIntBlock_0.frq, _8_nrm.cfe, _4_MockFixedIntBlock_0.tib, _3_MockFixedIntBlock_0.skp, _5_MockVariableIntBlock_0.pyl, _3_Lucene40WithOrds_0.tii, _1_MockFixedIntBlock_0.pyl, _6_Lucene40WithOrds_0.prx, _4_nrm.cfe, _8_Lucene40WithOrds_0.tib, _3_Lucene40WithOrds_0.tib, _4.fdx, _8_Lucene40WithOrds_0.frq, _8_Lucene40WithOrds_0.tii, _4_MockFixedIntBlock_0.tii, _2_MockFixedIntBlock_0.frq, _7_MockVariableIntBlock_0.tii, _6_MockVariableIntBlock_0.frq, _3_MockVariableIntBlock_0.doc, _7_Lucene40WithOrds_0.tib, _5.si, _8_nrm.cfs, _3_nrm.cfs, _6_MockFixedIntBlock_0.pos, _7_Lucene40WithOrds_0.tii, _4_MockVariableIntBlock_0.pyl, _5_MockFixedIntBlock_0.skp, _1_MockFixedIntBlock_0.skp, _4_Lucene40WithOrds_0.prx, _4_MockFixedIntBlock_0.doc, _4_nrm.cfs, _3_MockVariableIntBlock_0.tib, _5_MockVariableIntBlock_0.doc, _1_NestedPulsing_0.prx, _6_MockVariableIntBlock_0.pyl, _1_MockFixedIntBlock_0.doc, _8_MockVariableIntBlock_0.tib, _8_MockFixedIntBlock_0.skp, _3_MockFixedIntBlock_0.doc, _2_MockVariableIntBlock_0.frq, _6_nrm.cfs, _7_MockFixedIntBlock_0.tib, _2_Lucene40WithOrds_0.prx, _7_nrm.cfs, _7_MockFixedIntBlock_0.tii, _8_MockVariableIntBlock_0.doc, _4_MockFixedIntBlock_0.pyl, _1_MockFixedIntBlock_0.tii, _1_nrm.cfs, _5.fnm, _7_nrm.cfe, _7_NestedPulsing_0.prx, _6_nrm.cfe, _5_MockFixedIntBlock_0.pos, _5_MockFixedIntBlock_0.doc, _7_MockFixedIntBlock_0.pyl, _3_Lucene40WithOrds_0.frq, _4.fdt, _4.si, _1_nrm.cfe, _5_NestedPulsing_0.prx, _1_MockFixedIntBlock_0.tib, _8.fdx, _8_MockFixedIntBlock_0.pos, _8_MockVariableIntBlock_0.tii, _8.fdt, _2_NestedPulsing_0.tim, _6_MockFixedIntBlock_0.frq, _7.si, _3_NestedPulsing_0.prx, _8.si, _6_NestedPulsing_0.prx, _8_MockVariableIntBlock_0.pyl, _7_Lucene40WithOrds_0.frq, _5_MockVariableIntBlock_0.tii, _8_NestedPulsing_0.prx, _2_NestedPulsing_0.tip, _4_MockVariableIntBlock_0.doc, _2.fdt, _7.fdx, _7_MockVariableIntBlock_0.frq, _2.fdx, _8_NestedPulsing_0.frq, _7.fdt, _3.si, _2_MockFixedIntBlock_0.doc, _4_NestedPulsing_0.frq, _2_MockVariableIntBlock_0.skp, _6_NestedPulsing_0.frq, _4_Lucene40WithOrds_0.tib, _4_Lucene40WithOrds_0.tii, _2_MockVariableIntBlock_0.pyl, _2_MockFixedIntBlock_0.skp, _3.fnm, _2_MockVariableIntBlock_0.doc, _1_MockVariableIntBlock_0.doc, _4_NestedPulsing_0.tip, _4_NestedPulsing_0.tim, _2_MockVariableIntBlock_0.tii, _7_MockVariableIntBlock_0.pyl, _2_Lucene40WithOrds_0.frq, _5_MockVariableIntBlock_0.tib, _2_MockVariableIntBlock_0.tib, _1_MockVariableIntBlock_0.pos, _3_MockFixedIntBlock_0.pos, _1_NestedPulsing_0.frq, _5_NestedPulsing_0.frq, _2_NestedPulsing_0.frq, _3_MockVariableIntBlock_0.pyl, _6.si, _6.fnm, _3_Lucene40WithOrds_0.prx, _7_MockVariableIntBlock_0.tib, _5.fdt, _4.fnm, _1.fnm, _2_MockFixedIntBlock_0.tii, _7_MockVariableIntBlock_0.doc, _3_MockFixedIntBlock_0.pyl, _2_MockFixedIntBlock_0.tib, _2_MockFixedIntBlock_0.pyl, _4_NestedPulsing_0.prx, _6_MockVariableIntBlock_0.doc, _2_MockVariableIntBlock_0.pos, _6_Lucene40WithOrds_0.frq, _5_MockVariableIntBlock_0.pos, _1_MockFixedIntBlock_0.frq, _5_MockFixedIntBlock_0.pyl, _4_MockFixedIntBlock_0.skp, _6_Lucene40WithOrds_0.tii, _5_Lucene40WithOrds_0.frq, _3_NestedPulsing_0.frq, _8.fnm, _2_MockFixedIntBlock_0.pos, _6_Lucene40WithOrds_0.tib, _8_MockFixedIntBlock_0.doc, _4_Lucene40WithOrds_0.frq, _7_MockFixedIntBlock_0.frq, _4_MockVariableIntBlock_0.skp, _5_MockVariableIntBlock_0.skp, _6_MockVariableIntBlock_0.pos, _4_MockVariableIntBlock_0.pos, _7_Lucene40WithOrds_0.prx, _3_MockFixedIntBlock_0.tib, _6_MockVariableIntBlock_0.skp, _2_Lucene40WithOrds_0.tii, _1_MockVariableIntBlock_0.frq, _5.fdx, _2_Lucene40WithOrds_0.tib, _8_Lucene40WithOrds_0.prx, _3_MockVariableIntBlock_0.skp, segments_6, _3_MockFixedIntBlock_0.tii]
[junit4:junit4]   2> 3749 T1819 C151 oasc.SolrDeletionPolicy.updateCommits newest commit = 6
[junit4:junit4]   2> 3753 T1849 C154 oass.SolrIndexSearcher.<init> Opening Searcher@47e788f5 main
[junit4:junit4]   2> 3754 T1849 C154 oass.SolrIndexSearcher.getIndexDir WARNING WARNING: Directory impl does not support setting indexDir: org.apache.lucene.store.MockDirectoryWrapper
[junit4:junit4]   2> 3754 T1855 oasc.SolrCore.registerSearcher [collection1] Registered new searcher Searcher@47e788f5 main{StandardDirectoryReader(segments_2:15:nrt _0(5.0):C18 _1(5.0):C10 _2(5.0):C4 _5(5.0):C11 _4(5.0):C3 _3(5.0):C27)}
[junit4:junit4]   2> 3754 T1849 C154 oasu.DirectUpdateHandler2.commit end_commit_flush
[junit4:junit4]   2> 3755 T1849 C154 UPDATE [collection1] webapp=/solr path=/update params={waitSearcher=true&commit=true&wt=javabin&expungeDeletes=false&version=2&softCommit=false} {add=[5 (1413140366130937856), 7 (1413140366131986432), 11 (1413140366131986433), 14 (1413140366133035009), 16 (1413140366135132160), 18 (1413140366136180736), 19 (1413140366259912705), 20 (1413140366260961282), 21 (1413140366262009856), 25 (1413140366263058433)],commit=} 0 177
[junit4:junit4]   2> 3755 T1852 C154 oasu.DirectUpdateHandler2.commit start commit{flags=0,_version_=0,optimize=false,openSearcher=true,waitSearcher=true,expungeDeletes=false,softCommit=false}
[junit4:junit4]   2> 3757 T1819 C151 oass.SolrIndexSearcher.<init> Opening Searcher@32637c21 main
[junit4:junit4]   2> 3757 T1829 C152 oass.SolrIndexSearcher.<init> Opening Searcher@7f611e81 main
[junit4:junit4]   2> 3757 T1819 C151 oass.SolrIndexSearcher.getIndexDir WARNING WARNING: Directory impl does not support setting indexDir: org.apache.lucene.store.MockDirectoryWrapper
[junit4:junit4]   2> 3757 T1829 C152 oass.SolrIndexSearcher.getIndexDir WARNING WARNING: Directory impl does not support setting indexDir: org.apache.lucene.store.MockDirectoryWrapper
[junit4:junit4]   2> 3757 T1825 oasc.SolrCore.registerSearcher [collection1] Registered new searcher Searcher@32637c21 main{StandardDirectoryReader(segments_6:22:nrt _1(5.0):C2 _2(5.0):C18 _3(5.0):C7 _4(5.0):C14 _5(5.0):C5 _7(5.0):C22 _8(5.0):C3 _6(5.0):C4 _9(5.0):C7)}
[junit4:junit4]   2> 3757 T1819 C151 oasu.DirectUpdateHandler2.commit end_commit_flush
[junit4:junit4]   2> 3758 T1835 oasc.SolrCore.registerSearcher [collection1] Registered new searcher Searcher@7f611e81 main{StandardDirectoryReader(segments_2:16:nrt _1(5.0):C13 _0(5.0):C21 _2(5.0):C3 _3(5.0):C13 _5(5.0):C2 _4(5.0):C31)}
[junit4:junit4]   2> 3758 T1829 C152 oasu.DirectUpdateHandler2.commit end_commit_flush
[junit4:junit4]   2> 3758 T1823 C151 oasu.DirectUpdateHandler2.commit start commit{flags=0,_version_=0,optimize=false,openSearcher=true,waitSearcher=true,expungeDeletes=false,softCommit=false}
[junit4:junit4]   2> 3758 T1819 C151 UPDATE [collection1] webapp=/solr path=/update params={waitSearcher=true&commit=true&wt=javabin&expungeDeletes=false&version=2&softCommit=false} {add=[5 (1413140366130937856), 6 (1413140366133035008), 9 (1413140366133035010), 10 (1413140366135132160), 12 (1413140366135132162), 14 (1413140366258864128), 15 (1413140366262009857), 17 (1413140366263058432), 22 (1413140366263058434), 24 (1413140366263058436)],commit=} 0 179
[junit4:junit4]   2> 3758 T1829 C152 UPDATE [collection1] webapp=/solr path=/update params={waitSearcher=true&commit=true&wt=javabin&expungeDeletes=false&version=2&softCommit=false} {add=[8 (1413140366129889280), 13 (1413140366131986432), 14 (1413140366133035008), 16 (1413140366133035010), 17 (1413140366135132160), 19 (1413140366258864128), 20 (1413140366259912706), 22 (1413140366260961283), 23 (1413140366262009857), 24 (1413140366263058433)],commit=} 0 180
[junit4:junit4]   2> 3758 T1831 C152 oasu.DirectUpdateHandler2.commit start commit{flags=0,_version_=0,optimize=false,openSearcher=true,waitSearcher=true,expungeDeletes=false,softCommit=false}
[junit4:junit4]   2> 3760 T1823 C151 oasc.SolrDeletionPolicy.onCommit SolrDeletionPolicy.onCommit: commits:num=2
[junit4:junit4]   2> 		commit{dir=MockDirWrapper(org.apache.lucene.store.RAMDirectory@4e8a7c88 lockFactory=org.apache.lucene.store.NativeFSLockFactory@749acf4b),segFN=segments_6,generation=6,filenames=[_1_NestedPulsing_0.tip, _5_nrm.cfe, _5_NestedPulsing_0.tip, _8_MockFixedIntBlock_0.tii, _6_MockFixedIntBlock_0.pyl, _5_NestedPulsing_0.tim, _8_MockFixedIntBlock_0.pyl, _3_MockVariableIntBlock_0.frq, _8_MockFixedIntBlock_0.tib, _3.fdt, _4_MockVariableIntBlock_0.tii, _5_Lucene40WithOrds_0.tib, _6_MockFixedIntBlock_0.skp, _7.fnm, _7_NestedPulsing_0.frq, _5_Lucene40WithOrds_0.tii, _1_Lucene40WithOrds_0.tib, _1_NestedPulsing_0.tim, _1_Lucene40WithOrds_0.tii, _7_MockFixedIntBlock_0.pos, _6_MockVariableIntBlock_0.tii, _7_MockFixedIntBlock_0.skp, _1_Lucene40WithOrds_0.frq, _6_MockVariableIntBlock_0.tib, _4_MockFixedIntBlock_0.pos, _1_MockVariableIntBlock_0.tii, _3_NestedPulsing_0.tim, _1_MockVariableIntBlock_0.tib, _1.fdx, _4_MockVariableIntBlock_0.tib, _3_NestedPulsing_0.tip, _1.fdt, _5_nrm.cfs, _4_MockFixedIntBlock_0.frq, _7_NestedPulsing_0.tim, _1_MockFixedIntBlock_0.pos, _8_MockVariableIntBlock_0.skp, _6.fdt, _7_NestedPulsing_0.tip, _5_Lucene40WithOrds_0.prx, _1_MockVariableIntBlock_0.skp, _2.si, _7_MockVariableIntBlock_0.pos, _3_MockFixedIntBlock_0.frq, _6.fdx, _1_Lucene40WithOrds_0.prx, _1_MockVariableIntBlock_0.pyl, _6_MockFixedIntBlock_0.tib, _6_MockFixedIntBlock_0.tii, _3_MockVariableIntBlock_0.tii, _2_nrm.cfe, _8_MockFixedIntBlock_0.frq, _2_nrm.cfs, _7_MockVariableIntBlock_0.skp, _6_MockFixedIntBlock_0.doc, _5_MockFixedIntBlock_0.frq, _5_MockFixedIntBlock_0.tib, _2_NestedPulsing_0.prx, _4_MockVariableIntBlock_0.frq, _7_MockFixedIntBlock_0.doc, _2.fnm, _5_MockVariableIntBlock_0.frq, _3.fdx, _8_MockVariableIntBlock_0.pos, _1.si, _6_NestedPulsing_0.tip, _8_NestedPulsing_0.tip, _6_NestedPulsing_0.tim, _5_MockFixedIntBlock_0.tii, _8_NestedPulsing_0.tim, _3_MockVariableIntBlock_0.pos, _3_nrm.cfe, _8_MockVariableIntBlock_0.frq, _8_nrm.cfe, _4_MockFixedIntBlock_0.tib, _3_MockFixedIntBlock_0.skp, _5_MockVariableIntBlock_0.pyl, _3_Lucene40WithOrds_0.tii, _1_MockFixedIntBlock_0.pyl, _6_Lucene40WithOrds_0.prx, _4_nrm.cfe, _8_Lucene40WithOrds_0.tib, _3_Lucene40WithOrds_0.tib, _4.fdx, _8_Lucene40WithOrds_0.frq, _8_Lucene40WithOrds_0.tii, _4_MockFixedIntBlock_0.tii, _2_MockFixedIntBlock_0.frq, _7_MockVariableIntBlock_0.tii, _6_MockVariableIntBlock_0.frq, _3_MockVariableIntBlock_0.doc, _7_Lucene40WithOrds_0.tib, _5.si, _8_nrm.cfs, _3_nrm.cfs, _6_MockFixedIntBlock_0.pos, _7_Lucene40WithOrds_0.tii, _4_MockVariableIntBlock_0.pyl, _5_MockFixedIntBlock_0.skp, _1_MockFixedIntBlock_0.skp, _4_Lucene40WithOrds_0.prx, _4_MockFixedIntBlock_0.doc, _4_nrm.cfs, _3_MockVariableIntBlock_0.tib, _5_MockVariableIntBlock_0.doc, _1_NestedPulsing_0.prx, _6_MockVariableIntBlock_0.pyl, _1_MockFixedIntBlock_0.doc, _8_MockVariableIntBlock_0.tib, _8_MockFixedIntBlock_0.skp, _3_MockFixedIntBlock_0.doc, _2_MockVariableIntBlock_0.frq, _6_nrm.cfs, _7_MockFixedIntBlock_0.tib, _2_Lucene40WithOrds_0.prx, _7_nrm.cfs, _7_MockFixedIntBlock_0.tii, _8_MockVariableIntBlock_0.doc, _4_MockFixedIntBlock_0.pyl, _1_MockFixedIntBlock_0.tii, _1_nrm.cfs, _5.fnm, _7_nrm.cfe, _7_NestedPulsing_0.prx, _6_nrm.cfe, _5_MockFixedIntBlock_0.pos, _5_MockFixedIntBlock_0.doc, _7_MockFixedIntBlock_0.pyl, _3_Lucene40WithOrds_0.frq, _4.fdt, _4.si, _1_nrm.cfe, _5_NestedPulsing_0.prx, _1_MockFixedIntBlock_0.tib, _8.fdx, _8_MockFixedIntBlock_0.pos, _8_MockVariableIntBlock_0.tii, _8.fdt, _2_NestedPulsing_0.tim, _6_MockFixedIntBlock_0.frq, _7.si, _3_NestedPulsing_0.prx, _8.si, _6_NestedPulsing_0.prx, _8_MockVariableIntBlock_0.pyl, _7_Lucene40WithOrds_0.frq, _5_MockVariableIntBlock_0.tii, _8_NestedPulsing_0.prx, _2_NestedPulsing_0.tip, _4_MockVariableIntBlock_0.doc, _2.fdt, _7.fdx, _7_MockVariableIntBlock_0.frq, _2.fdx, _8_NestedPulsing_0.frq, _7.fdt, _3.si, _2_MockFixedIntBlock_0.doc, _4_NestedPulsing_0.frq, _2_MockVariableIntBlock_0.skp, _6_NestedPulsing_0.frq, _4_Lucene40WithOrds_0.tib, _4_Lucene40WithOrds_0.tii, _2_MockVariableIntBlock_0.pyl, _2_MockFixedIntBlock_0.skp, _3.fnm, _2_MockVariableIntBlock_0.doc, _1_MockVariableIntBlock_0.doc, _4_NestedPulsing_0.tip, _4_NestedPulsing_0.tim, _2_MockVariableIntBlock_0.tii, _7_MockVariableIntBlock_0.pyl, _2_Lucene40WithOrds_0.frq, _5_MockVariableIntBlock_0.tib, _2_MockVariableIntBlock_0.tib, _1_MockVariableIntBlock_0.pos, _3_MockFixedIntBlock_0.pos, _1_NestedPulsing_0.frq, _5_NestedPulsing_0.frq, _2_NestedPulsing_0.frq, _3_MockVariableIntBlock_0.pyl, _6.si, _6.fnm, _3_Lucene40WithOrds_0.prx, _7_MockVariableIntBlock_0.tib, _5.fdt, _4.fnm, _1.fnm, _2_MockFixedIntBlock_0.tii, _7_MockVariableIntBlock_0.doc, _3_MockFixedIntBlock_0.pyl, _2_MockFixedIntBlock_0.tib, _2_MockFixedIntBlock_0.pyl, _4_NestedPulsing_0.prx, _6_MockVariableIntBlock_0.doc, _2_MockVariableIntBlock_0.pos, _6_Lucene40WithOrds_0.frq, _5_MockVariableIntBlock_0.pos, _1_MockFixedIntBlock_0.frq, _5_MockFixedIntBlock_0.pyl, _4_MockFixedIntBlock_0.skp, _6_Lucene40WithOrds_0.tii, _5_Lucene40WithOrds_0.frq, _3_NestedPulsing_0.frq, _8.fnm, _2_MockFixedIntBlock_0.pos, _6_Lucene40WithOrds_0.tib, _8_MockFixedIntBlock_0.doc, _4_Lucene40WithOrds_0.frq, _7_MockFixedIntBlock_0.frq, _4_MockVariableIntBlock_0.skp, _5_MockVariableIntBlock_0.skp, _6_MockVariableIntBlock_0.pos, _4_MockVariableIntBlock_0.pos, _7_Lucene40WithOrds_0.prx, _3_MockFixedIntBlock_0.tib, _6_MockVariableIntBlock_0.skp, _2_Lucene40WithOrds_0.tii, _1_MockVariableIntBlock_0.frq, _5.fdx, _2_Lucene40WithOrds_0.tib, _8_Lucene40WithOrds_0.prx, _3_MockVariableIntBlock_0.skp, segments_6, _3_MockFixedIntBlock_0.tii]
[junit4:junit4]   2> 		commit{dir=MockDirWrapper(org.apache.lucene.store.RAMDirectory@4e8a7c88 lockFactory=org.apache.lucene.store.NativeFSLockFactory@749acf4b),segFN=segments_7,generation=7,filenames=[_1_NestedPulsing_0.tip, _5_nrm.cfe, _5_NestedPulsing_0.tip, _8_MockFixedIntBlock_0.tii, _6_MockFixedIntBlock_0.pyl, _5_NestedPulsing_0.tim, _8_MockFixedIntBlock_0.pyl, _3_MockVariableIntBlock_0.frq, _8_MockFixedIntBlock_0.tib, _3.fdt, _4_MockVariableIntBlock_0.tii, _5_Lucene40WithOrds_0.tib, _6_MockFixedIntBlock_0.skp, _7.fnm, _7_NestedPulsing_0.frq, _5_Lucene40WithOrds_0.tii, _1_Lucene40WithOrds_0.tib, _1_NestedPulsing_0.tim, _1_Lucene40WithOrds_0.tii, _7_MockFixedIntBlock_0.pos, _6_MockVariableIntBlock_0.tii, _7_MockFixedIntBlock_0.skp, _1_Lucene40WithOrds_0.frq, _6_MockVariableIntBlock_0.tib, _4_MockFixedIntBlock_0.pos, _1_MockVariableIntBlock_0.tii, _9.fdt, _3_NestedPulsing_0.tim, _9.fdx, _1_MockVariableIntBlock_0.tib, _1.fdx, _4_MockVariableIntBlock_0.tib, _3_NestedPulsing_0.tip, _1.fdt, _5_nrm.cfs, _4_MockFixedIntBlock_0.frq, _7_NestedPulsing_0.tim, _1_MockFixedIntBlock_0.pos, _8_MockVariableIntBlock_0.skp, _6.fdt, _7_NestedPulsing_0.tip, _5_Lucene40WithOrds_0.prx, _1_MockVariableIntBlock_0.skp, _2.si, _7_MockVariableIntBlock_0.pos, _3_MockFixedIntBlock_0.frq, _6.fdx, _1_Lucene40WithOrds_0.prx, _1_MockVariableIntBlock_0.pyl, _6_MockFixedIntBlock_0.tib, _6_MockFixedIntBlock_0.tii, _3_MockVariableIntBlock_0.tii, _2_nrm.cfe, _8_MockFixedIntBlock_0.frq, _2_nrm.cfs, _7_MockVariableIntBlock_0.skp, _9_MockVariableIntBlock_0.frq, _6_MockFixedIntBlock_0.doc, _5_MockFixedIntBlock_0.frq, _5_MockFixedIntBlock_0.tib, _2_NestedPulsing_0.prx, _4_MockVariableIntBlock_0.frq, _7_MockFixedIntBlock_0.doc, _2.fnm, _5_MockVariableIntBlock_0.frq, _3.fdx, _8_MockVariableIntBlock_0.pos, _1.si, _6_NestedPulsing_0.tip, _8_NestedPulsing_0.tip, _6_NestedPulsing_0.tim, _5_MockFixedIntBlock_0.tii, _8_NestedPulsing_0.tim, _3_MockVariableIntBlock_0.pos, _9_MockVariableIntBlock_0.pyl, _3_nrm.cfe, _8_MockVariableIntBlock_0.frq, _9_MockFixedIntBlock_0.skp, _8_nrm.cfe, _4_MockFixedIntBlock_0.tib, _3_MockFixedIntBlock_0.skp, _5_MockVariableIntBlock_0.pyl, _3_Lucene40WithOrds_0.tii, _1_MockFixedIntBlock_0.pyl, _6_Lucene40WithOrds_0.prx, _4_nrm.cfe, _8_Lucene40WithOrds_0.tib, _3_Lucene40WithOrds_0.tib, _4.fdx, _8_Lucene40WithOrds_0.frq, _8_Lucene40WithOrds_0.tii, _4_MockFixedIntBlock_0.tii, _2_MockFixedIntBlock_0.frq, _7_MockVariableIntBlock_0.tii, _9.si, _6_MockVariableIntBlock_0.frq, _3_MockVariableIntBlock_0.doc, _7_Lucene40WithOrds_0.tib, _5.si, _8_nrm.cfs, _3_nrm.cfs, _6_MockFixedIntBlock_0.pos, _7_Lucene40WithOrds_0.tii, _4_MockVariableIntBlock_0.pyl, _5_MockFixedIntBlock_0.skp, _1_MockFixedIntBlock_0.skp, _4_Lucene40WithOrds_0.prx, _4_MockFixedIntBlock_0.doc, _4_nrm.cfs, _3_MockVariableIntBlock_0.tib, _5_MockVariableIntBlock_0.doc, _1_NestedPulsing_0.prx, _6_MockVariableIntBlock_0.pyl, _1_MockFixedIntBlock_0.doc, _8_MockVariableIntBlock_0.tib, _8_MockFixedIntBlock_0.skp, _3_MockFixedIntBlock_0.doc, _2_MockVariableIntBlock_0.frq, _6_nrm.cfs, _7_MockFixedIntBlock_0.tib, _2_Lucene40WithOrds_0.prx, _9_Lucene40WithOrds_0.frq, _7_nrm.cfs, _7_MockFixedIntBlock_0.tii, _8_MockVariableIntBlock_0.doc, _4_MockFixedIntBlock_0.pyl, _1_MockFixedIntBlock_0.tii, _1_nrm.cfs, _5.fnm, _7_nrm.cfe, _7_NestedPulsing_0.prx, _6_nrm.cfe, _5_MockFixedIntBlock_0.pos, _9_MockVariableIntBlock_0.skp, _5_MockFixedIntBlock_0.doc, _7_MockFixedIntBlock_0.pyl, _3_Lucene40WithOrds_0.frq, _4.fdt, _4.si, _1_nrm.cfe, _9_NestedPulsing_0.prx, _5_NestedPulsing_0.prx, _9_MockVariableIntBlock_0.doc, _1_MockFixedIntBlock_0.tib, _8.fdx, _8_MockFixedIntBlock_0.pos, _8_MockVariableIntBlock_0.tii, _8.fdt, _2_NestedPulsing_0.tim, _6_MockFixedIntBlock_0.frq, _9_NestedPulsing_0.frq, _7.si, _3_NestedPulsing_0.prx, _8.si, _6_NestedPulsing_0.prx, _9_MockFixedIntBlock_0.frq, _8_MockVariableIntBlock_0.pyl, _7_Lucene40WithOrds_0.frq, _5_MockVariableIntBlock_0.tii, _8_NestedPulsing_0.prx, _2_NestedPulsing_0.tip, _9_MockVariableIntBlock_0.tib, _4_MockVariableIntBlock_0.doc, _2.fdt, _7.fdx, _7_MockVariableIntBlock_0.frq, _2.fdx, _8_NestedPulsing_0.frq, _7.fdt, _9_MockFixedIntBlock_0.pos, _3.si, _2_MockFixedIntBlock_0.doc, _4_NestedPulsing_0.frq, _2_MockVariableIntBlock_0.skp, _6_NestedPulsing_0.frq, _4_Lucene40WithOrds_0.tib, _4_Lucene40WithOrds_0.tii, _2_MockVariableIntBlock_0.pyl, _2_MockFixedIntBlock_0.skp, _3.fnm, _2_MockVariableIntBlock_0.doc, _1_MockVariableIntBlock_0.doc, _4_NestedPulsing_0.tip, _4_NestedPulsing_0.tim, _9_MockVariableIntBlock_0.tii, _2_MockVariableIntBlock_0.tii, _7_MockVariableIntBlock_0.pyl, _2_Lucene40WithOrds_0.frq, _5_MockVariableIntBlock_0.tib, _2_MockVariableIntBlock_0.tib, _9.fnm, _1_MockVariableIntBlock_0.pos, _3_MockFixedIntBlock_0.pos, _1_NestedPulsing_0.frq, _5_NestedPulsing_0.frq, _2_NestedPulsing_0.frq, _3_MockVariableIntBlock_0.pyl, _6.si, _6.fnm, _3_Lucene40WithOrds_0.prx, _7_MockVariableIntBlock_0.tib, _5.fdt, _4.fnm, _1.fnm, _2_MockFixedIntBlock_0.tii, _7_MockVariableIntBlock_0.doc, _9_MockFixedIntBlock_0.doc, _3_MockFixedIntBlock_0.pyl, _2_MockFixedIntBlock_0.tib, _9_NestedPulsing_0.tip, _2_MockFixedIntBlock_0.pyl, _9_nrm.cfs, _9_NestedPulsing_0.tim, _9_MockVariableIntBlock_0.pos, _4_NestedPulsing_0.prx, _9_MockFixedIntBlock_0.pyl, _6_MockVariableIntBlock_0.doc, _2_MockVariableIntBlock_0.pos, _6_Lucene40WithOrds_0.frq, _5_MockVariableIntBlock_0.pos, _9_nrm.cfe, _1_MockFixedIntBlock_0.frq, _5_MockFixedIntBlock_0.pyl, _4_MockFixedIntBlock_0.skp, _6_Lucene40WithOrds_0.tii, _5_Lucene40WithOrds_0.frq, _3_NestedPulsing_0.frq, _8.fnm, _2_MockFixedIntBlock_0.pos, _6_Lucene40WithOrds_0.tib, _9_MockFixedIntBlock_0.tii, _8_MockFixedIntBlock_0.doc, _9_MockFixedIntBlock_0.tib, _4_Lucene40WithOrds_0.frq, _7_MockFixedIntBlock_0.frq, _4_MockVariableIntBlock_0.skp, _9_Lucene40WithOrds_0.prx, _5_MockVariableIntBlock_0.skp, _6_MockVariableIntBlock_0.pos, _4_MockVariableIntBlock_0.pos, _7_Lucene40WithOrds_0.prx, _3_MockFixedIntBlock_0.tib, _6_MockVariableIntBlock_0.skp, _9_Lucene40WithOrds_0.tii, _2_Lucene40WithOrds_0.tii, _1_MockVariableIntBlock_0.frq, segments_7, _9_Lucene40WithOrds_0.tib, _5.fdx, _2_Lucene40WithOrds_0.tib, _8_Lucene40WithOrds_0.prx, _3_MockVariableIntBlock_0.skp, _3_MockFixedIntBlock_0.tii]
[junit4:junit4]   2> 3761 T1823 C151 oasc.SolrDeletionPolicy.updateCommits newest commit = 7
[junit4:junit4]   2> 3761 T1840 C153 oass.SolrIndexSearcher.<init> Opening Searcher@d8be76f main
[junit4:junit4]   2> 3762 T1823 C151 oass.SolrIndexSearcher.<init> Opening Searcher@87f251b main
[junit4:junit4]   2> 3762 T1840 C153 oass.SolrIndexSearcher.getIndexDir WARNING WARNING: Directory impl does not support setting indexDir: org.apache.lucene.store.MockDirectoryWrapper
[junit4:junit4]   2> 3762 T1823 C151 oass.SolrIndexSearcher.getIndexDir WARNING WARNING: Directory impl does not support setting indexDir: org.apache.lucene.store.MockDirectoryWrapper
[junit4:junit4]   2> 3763 T1845 oasc.SolrCore.registerSearcher [collection1] Registered new searcher Searcher@d8be76f main{StandardDirectoryReader(segments_2:19:nrt _2(5.0):C5 _0(5.0):C14 _1(5.0):C12 _6(5.0):C3 _5(5.0):C8 _3(5.0):C6 _4(5.0):C17)}
[junit4:junit4]   2> 3763 T1825 oasc.SolrCore.registerSearcher [collection1] Registered new searcher Searcher@87f251b main{StandardDirectoryReader(segments_6:22:nrt _1(5.0):C2 _2(5.0):C18 _3(5.0):C7 _4(5.0):C14 _5(5.0):C5 _7(5.0):C22 _8(5.0):C3 _6(5.0):C4 _9(5.0):C7)}
[junit4:junit4]   2> 3763 T1823 C151 oasu.DirectUpdateHandler2.commit end_commit_flush
[junit4:junit4]   2> 3763 T1840 C153 oasu.DirectUpdateHandler2.commit end_commit_flush
[junit4:junit4]   2> 3763 T1823 C151 UPDATE [collection1] webapp=/solr path=/update params={waitSearcher=true&commit=true&wt=javabin&expungeDeletes=false&version=2&softCommit=false} {add=[94 (1413140366269349888), 95 (1413140366270398464), 97 (1413140366271447040), 98 (1413140366272495616), 99 (1413140366272495617), 101 (1413140366273544192), 104 (1413140366274592768), 105 (1413140366275641344), 109 (1413140366276689921), 110 (1413140366277738497)],commit=} 0 52
[junit4:junit4]   2> 3763 T1840 C153 UPDATE [collection1] webapp=/solr path=/update params={waitSearcher=true&commit=true&wt=javabin&expungeDeletes=false&version=2&softCommit=false} {add=[23 (1413140366131986432), 24 (1413140366133035010), 26 (1413140366135132161), 27 (1413140366135132162), 33 (1413140366258864128), 34 (1413140366259912705), 35 (1413140366259912707), 37 (1413140366260961281), 38 (1413140366262009856), 40 (1413140366262009860)],commit=} 0 183
[junit4:junit4]   2> 3763 T1841 C153 oasu.DirectUpdateHandler2.commit start commit{flags=0,_version_=0,optimize=false,openSearcher=true,waitSearcher=true,expungeDeletes=false,softCommit=false}
[junit4:junit4]   2> 3763 T1824 C151 oasu.DirectUpdateHandler2.commit start commit{flags=0,_version_=0,optimize=false,openSearcher=true,waitSearcher=true,expungeDeletes=false,softCommit=false}
[junit4:junit4]   2> 3764 T1852 C154 oasc.SolrDeletionPolicy.onCommit SolrDeletionPolicy.onCommit: commits:num=2
[junit4:junit4]   2> 		commit{dir=MockDirWrapper(org.apache.lucene.store.RAMDirectory@11061cba lockFactory=org.apache.lucene.store.NativeFSLockFactory@efc70c0),segFN=segments_2,generation=2,filenames=[_2_NestedPulsing_0.tim, _1_NestedPulsing_0.tip, _1_MockFixedIntBlock_0.pyl, _0_MockVariableIntBlock_0.skp, _0_MockFixedIntBlock_0.tib, _2_MockFixedIntBlock_0.tii, _1.fnm, _0_Lucene40WithOrds_0.tii, _2_MockFixedIntBlock_0.tib, _2_MockFixedIntBlock_0.pyl, _0_Lucene40WithOrds_0.frq, _1_Lucene40WithOrds_0.tib, _0_MockFixedIntBlock_0.tii, _2_MockFixedIntBlock_0.frq, _1_Lucene40WithOrds_0.tii, _1_NestedPulsing_0.tim, _0_Lucene40WithOrds_0.tib, _2_NestedPulsing_0.tip, _2_MockVariableIntBlock_0.pos, _1_Lucene40WithOrds_0.frq, _0.fnm, _1_MockFixedIntBlock_0.frq, _1_MockVariableIntBlock_0.tii, _2.fdt, _0_MockFixedIntBlock_0.pos, _2.fdx, _1_MockVariableIntBlock_0.tib, _1.fdx, _1_MockFixedIntBlock_0.skp, _2_MockFixedIntBlock_0.pos, _1.fdt, _0_MockVariableIntBlock_0.frq, _2_MockFixedIntBlock_0.doc, _1_MockFixedIntBlock_0.pos, _2_MockVariableIntBlock_0.skp, _2.si, _1_MockVariableIntBlock_0.skp, _2_MockVariableIntBlock_0.pyl, _1_NestedPulsing_0.prx, _0_MockVariableIntBlock_0.doc, _1_MockFixedIntBlock_0.doc, _2_MockFixedIntBlock_0.skp, _1_Lucene40WithOrds_0.prx, _2_MockVariableIntBlock_0.frq, _1_MockVariableIntBlock_0.pyl, _0_NestedPulsing_0.tip, _2_MockVariableIntBlock_0.doc, _0_NestedPulsing_0.tim, _0_MockVariableIntBlock_0.pyl, _2_nrm.cfe, _0_MockFixedIntBlock_0.skp, _0_MockFixedIntBlock_0.pyl, _2_Lucene40WithOrds_0.prx, _0_MockVariableIntBlock_0.tib, _1_MockVariableIntBlock_0.doc, _0_MockVariableIntBlock_0.pos, _2_nrm.cfs, _0.si, _0_MockVariableIntBlock_0.tii, _2_MockVariableIntBlock_0.tii, _1_nrm.cfs, _1_MockFixedIntBlock_0.tii, _2_Lucene40WithOrds_0.frq, _2_MockVariableIntBlock_0.tib, _2_NestedPulsing_0.prx, _1_MockVariableIntBlock_0.pos, _0_NestedPulsing_0.frq, _0_nrm.cfs, _0_NestedPulsing_0.prx, _2.fnm, _1_nrm.cfe, _0_MockFixedIntBlock_0.frq, _2_Lucene40WithOrds_0.tii, _1_MockVariableIntBlock_0.frq, _1_NestedPulsing_0.frq, _0_MockFixedIntBlock_0.doc, _1.si, _2_NestedPulsing_0.frq, _0_nrm.cfe, _1_MockFixedIntBlock_0.tib, segments_2, _2_Lucene40WithOrds_0.tib, _0.fdx, _0_Lucene40WithOrds_0.prx, _0.fdt]
[junit4:junit4]   2> 		commit{dir=MockDirWrapper(org.apache.lucene.store.RAMDirectory@11061cba lockFactory=org.apache.lucene.store.NativeFSLockFactory@efc70c0),segFN=segments_3,generation=3,filenames=[_5_nrm.cfe, _1_NestedPulsing_0.tip, _5_NestedPulsing_0.tip, _6_MockFixedIntBlock_0.pyl, _5_NestedPulsing_0.tim, _3_MockVariableIntBlock_0.frq, _3.fdt, _5_Lucene40WithOrds_0.tib, _4_MockVariableIntBlock_0.tii, _6_MockFixedIntBlock_0.skp, _7.fnm, _7_NestedPulsing_0.frq, _5_Lucene40WithOrds_0.tii, _0_Lucene40WithOrds_0.frq, _1_Lucene40WithOrds_0.tib, _1_Lucene40WithOrds_0.tii, _1_NestedPulsing_0.tim, _7_MockFixedIntBlock_0.pos, _6_MockVariableIntBlock_0.tii, _7_MockFixedIntBlock_0.skp, _1_Lucene40WithOrds_0.frq, _6_MockVariableIntBlock_0.tib, _4_MockFixedIntBlock_0.pos, _1_MockVariableIntBlock_0.tii, _3_NestedPulsing_0.tim, _1_MockVariableIntBlock_0.tib, _1.fdx, _4_MockVariableIntBlock_0.tib, _1.fdt, _5_nrm.cfs, _3_NestedPulsing_0.tip, _7_NestedPulsing_0.tim, _0_MockVariableIntBlock_0.frq, _4_MockFixedIntBlock_0.frq, _1_MockFixedIntBlock_0.pos, _6.fdt, _7_NestedPulsing_0.tip, _5_Lucene40WithOrds_0.prx, _2.si, _1_MockVariableIntBlock_0.skp, _7_MockVariableIntBlock_0.pos, _3_MockFixedIntBlock_0.frq, _0_MockVariableIntBlock_0.doc, _6.fdx, _1_Lucene40WithOrds_0.prx, _1_MockVariableIntBlock_0.pyl, _6_MockFixedIntBlock_0.tib, _6_MockFixedIntBlock_0.tii, _3_MockVariableIntBlock_0.tii, _2_nrm.cfe, _0_MockVariableIntBlock_0.pos, _2_nrm.cfs, _7_MockVariableIntBlock_0.skp, _6_MockFixedIntBlock_0.doc, _5_MockFixedIntBlock_0.frq, _5_MockFixedIntBlock_0.tib, _2_NestedPulsing_0.prx, _4_MockVariableIntBlock_0.frq, _0_NestedPulsing_0.frq, _7_MockFixedIntBlock_0.doc, _0_NestedPulsing_0.prx, _2.fnm, _5_MockVariableIntBlock_0.frq, _3.fdx, _1.si, _6_NestedPulsing_0.tip, _0_Lucene40WithOrds_0.prx, _6_NestedPulsing_0.tim, _5_MockFixedIntBlock_0.tii, _3_MockVariableIntBlock_0.pos, _3_nrm.cfe, _4_MockFixedIntBlock_0.tib, _3_MockFixedIntBlock_0.skp, _5_MockVariableIntBlock_0.pyl, _3_Lucene40WithOrds_0.tii, _1_MockFixedIntBlock_0.pyl, _6_Lucene40WithOrds_0.prx, _4_nrm.cfe, _3_Lucene40WithOrds_0.tib, _4.fdx, _2_MockFixedIntBlock_0.frq, _4_MockFixedIntBlock_0.tii, _7_MockVariableIntBlock_0.tii, _6_MockVariableIntBlock_0.frq, _3_MockVariableIntBlock_0.doc, _7_Lucene40WithOrds_0.tib, _5.si, _3_nrm.cfs, _6_MockFixedIntBlock_0.pos, _7_Lucene40WithOrds_0.tii, _5_MockFixedIntBlock_0.skp, _4_MockVariableIntBlock_0.pyl, _1_MockFixedIntBlock_0.skp, _4_Lucene40WithOrds_0.prx, _4_MockFixedIntBlock_0.doc, _4_nrm.cfs, _3_MockVariableIntBlock_0.tib, _5_MockVariableIntBlock_0.doc, _1_NestedPulsing_0.prx, _6_MockVariableIntBlock_0.pyl, _1_MockFixedIntBlock_0.doc, _2_MockVariableIntBlock_0.frq, _3_MockFixedIntBlock_0.doc, _6_nrm.cfs, _7_MockFixedIntBlock_0.tib, _2_Lucene40WithOrds_0.prx, _7_nrm.cfs, _7_MockFixedIntBlock_0.tii, _4_MockFixedIntBlock_0.pyl, _1_nrm.cfs, _1_MockFixedIntBlock_0.tii, _5.fnm, _7_nrm.cfe, _7_NestedPulsing_0.prx, _6_nrm.cfe, _5_MockFixedIntBlock_0.pos, _5_MockFixedIntBlock_0.doc, _7_MockFixedIntBlock_0.pyl, _4.fdt, _4.si, _3_Lucene40WithOrds_0.frq, _1_nrm.cfe, _5_NestedPulsing_0.prx, _1_MockFixedIntBlock_0.tib, _2_NestedPulsing_0.tim, _6_MockFixedIntBlock_0.frq, _7.si, _0_MockFixedIntBlock_0.tib, _3_NestedPulsing_0.prx, _0_Lucene40WithOrds_0.tii, _6_NestedPulsing_0.prx, _0_MockFixedIntBlock_0.tii, _7_Lucene40WithOrds_0.frq, _5_MockVariableIntBlock_0.tii, _0_Lucene40WithOrds_0.tib, _2_NestedPulsing_0.tip, _4_MockVariableIntBlock_0.doc, _2.fdt, _7.fdx, _7_MockVariableIntBlock_0.frq, _2.fdx, _7.fdt, _2_MockFixedIntBlock_0.doc, _3.si, _4_NestedPulsing_0.frq, _2_MockVariableIntBlock_0.skp, _6_NestedPulsing_0.frq, _4_Lucene40WithOrds_0.tib, _2_MockVariableIntBlock_0.pyl, _4_Lucene40WithOrds_0.tii, _2_MockFixedIntBlock_0.skp, _3.fnm, _0_NestedPulsing_0.tip, _2_MockVariableIntBlock_0.doc, _0_NestedPulsing_0.tim, _0_MockVariableIntBlock_0.pyl, _0_MockFixedIntBlock_0.pyl, _1_MockVariableIntBlock_0.doc, _4_NestedPulsing_0.tip, _4_NestedPulsing_0.tim, _2_MockVariableIntBlock_0.tii, _7_MockVariableIntBlock_0.pyl, _2_Lucene40WithOrds_0.frq, _5_MockVariableIntBlock_0.tib, _2_MockVariableIntBlock_0.tib, _1_MockVariableIntBlock_0.pos, _3_MockFixedIntBlock_0.pos, _1_NestedPulsing_0.frq, _5_NestedPulsing_0.frq, _0_MockFixedIntBlock_0.doc, _2_NestedPulsing_0.frq, _3_MockVariableIntBlock_0.pyl, _6.si, _6.fnm, _7_MockVariableIntBlock_0.tib, _3_Lucene40WithOrds_0.prx, _5.fdt, _4.fnm, _0_MockVariableIntBlock_0.skp, _2_MockFixedIntBlock_0.tii, _1.fnm, _7_MockVariableIntBlock_0.doc, _3_MockFixedIntBlock_0.pyl, _2_MockFixedIntBlock_0.tib, _2_MockFixedIntBlock_0.pyl, _4_NestedPulsing_0.prx, _6_MockVariableIntBlock_0.doc, _2_MockVariableIntBlock_0.pos, _6_Lucene40WithOrds_0.frq, _0.fnm, _5_MockVariableIntBlock_0.pos, _1_MockFixedIntBlock_0.frq, _5_MockFixedIntBlock_0.pyl, _4_MockFixedIntBlock_0.skp, _0_MockFixedIntBlock_0.pos, _6_Lucene40WithOrds_0.tii, _5_Lucene40WithOrds_0.frq, _3_NestedPulsing_0.frq, _2_MockFixedIntBlock_0.pos, _6_Lucene40WithOrds_0.tib, _4_Lucene40WithOrds_0.frq, _7_MockFixedIntBlock_0.frq, _0_MockFixedIntBlock_0.skp, _4_MockVariableIntBlock_0.skp, _0_MockVariableIntBlock_0.tib, _5_MockVariableIntBlock_0.skp, _6_MockVariableIntBlock_0.pos, _4_MockVariableIntBlock_0.pos, _7_Lucene40WithOrds_0.prx, _0.si, _0_MockVariableIntBlock_0.tii, _3_MockFixedIntBlock_0.tib, _0_nrm.cfs, _6_MockVariableIntBlock_0.skp, _0_MockFixedIntBlock_0.frq, _2_Lucene40WithOrds_0.tii, _1_MockVariableIntBlock_0.frq, _0_nrm.cfe, _5.fdx, _2_Lucene40WithOrds_0.tib, _0.fdx, _3_MockVariableIntBlock_0.skp, segments_3, _0.fdt, _3_MockFixedIntBlock_0.tii]
[junit4:junit4]   2> 3765 T1824 C151 oass.SolrIndexSearcher.<init> Opening Searcher@2ecd1b04 main
[junit4:junit4]   2> 3766 T1852 C154 oasc.SolrDeletionPolicy.updateCommits newest commit = 3
[junit4:junit4]   2> 3766 T1824 C151 oass.SolrIndexSearcher.getIndexDir WARNING WARNING: Directory impl does not support setting indexDir: org.apache.lucene.store.MockDirectoryWrapper
[junit4:junit4]   2> 3767 T1825 oasc.SolrCore.registerSearcher [collection1] Registered new searcher Searcher@2ecd1b04 main{StandardDirectoryReader(segments_6:22:nrt _1(5.0):C2 _2(5.0):C18 _3(5.0):C7 _4(5.0):C14 _5(5.0):C5 _7(5.0):C22 _8(5.0):C3 _6(5.0):C4 _9(5.0):C7)}
[junit4:junit4]   2> 3767 T1824 C151 oasu.DirectUpdateHandler2.commit end_commit_flush
[junit4:junit4]   2> 3767 T1831 C152 oasc.SolrDeletionPolicy.onCommit SolrDeletionPolicy.onCommit: commits:num=2
[junit4:junit4]   2> 		commit{dir=MockDirWrapper(org.apache.lucene.store.RAMDirectory@7167a89c lockFactory=org.apache.lucene.store.NativeFSLockFactory@1bd576),segFN=segments_2,generation=2,filenames=[_2_NestedPulsing_0.tim, _1_NestedPulsing_0.tip, _1_MockFixedIntBlock_0.pyl, _0_MockVariableIntBlock_0.skp, _0_MockFixedIntBlock_0.tib, _2_MockFixedIntBlock_0.tii, _1.fnm, _0_Lucene40WithOrds_0.tii, _2_MockFixedIntBlock_0.tib, _2_MockFixedIntBlock_0.pyl, _0_Lucene40WithOrds_0.frq, _1_Lucene40WithOrds_0.tib, _0_MockFixedIntBlock_0.tii, _2_MockFixedIntBlock_0.frq, _1_NestedPulsing_0.tim, _1_Lucene40WithOrds_0.tii, _0_Lucene40WithOrds_0.tib, _2_NestedPulsing_0.tip, _2_MockVariableIntBlock_0.pos, _1_Lucene40WithOrds_0.frq, _0.fnm, _1_MockFixedIntBlock_0.frq, _1_MockVariableIntBlock_0.tii, _2.fdt, _0_MockFixedIntBlock_0.pos, _2.fdx, _1_MockVariableIntBlock_0.tib, _1.fdx, _1_MockFixedIntBlock_0.skp, _2_MockFixedIntBlock_0.pos, _1.fdt, _0_MockVariableIntBlock_0.frq, _2_MockFixedIntBlock_0.doc, _1_MockFixedIntBlock_0.pos, _2_MockVariableIntBlock_0.skp, _2.si, _1_MockVariableIntBlock_0.skp, _2_MockVariableIntBlock_0.pyl, _1_NestedPulsing_0.prx, _1_MockFixedIntBlock_0.doc, _0_MockVariableIntBlock_0.doc, _2_MockFixedIntBlock_0.skp, _1_Lucene40WithOrds_0.prx, _2_MockVariableIntBlock_0.frq, _1_MockVariableIntBlock_0.pyl, _0_NestedPulsing_0.tip, _2_MockVariableIntBlock_0.doc, _0_NestedPulsing_0.tim, _0_MockVariableIntBlock_0.pyl, _2_nrm.cfe, _0_MockFixedIntBlock_0.skp, _0_MockFixedIntBlock_0.pyl, _2_Lucene40WithOrds_0.prx, _0_MockVariableIntBlock_0.tib, _1_MockVariableIntBlock_0.doc, _0_MockVariableIntBlock_0.pos, _2_nrm.cfs, _0.si, _0_MockVariableIntBlock_0.tii, _2_MockVariableIntBlock_0.tii, _1_MockFixedIntBlock_0.tii, _1_nrm.cfs, _2_Lucene40WithOrds_0.frq, _2_MockVariableIntBlock_0.tib, _2_NestedPulsing_0.prx, _1_MockVariableIntBlock_0.pos, _0_NestedPulsing_0.frq, _0_nrm.cfs, _0_NestedPulsing_0.prx, _2.fnm, _1_nrm.cfe, _0_MockFixedIntBlock_0.frq, _2_Lucene40WithOrds_0.tii, _1_MockVariableIntBlock_0.frq, _1_NestedPulsing_0.frq, _0_MockFixedIntBlock_0.doc, _1.si, _2_NestedPulsing_0.frq, _0_nrm.cfe, segments_2, _1_MockFixedIntBlock_0.tib, _2_Lucene40WithOrds_0.tib, _0.fdx, _0_Lucene40WithOrds_0.prx, _0.fdt]
[junit4:junit4]   2> 		commit{dir=MockDirWrapper(org.apache.lucene.store.RAMDirectory@7167a89c lockFactory=org.apache.lucene.store.NativeFSLockFactory@1bd576),segFN=segments_3,generation=3,filenames=[_1_NestedPulsing_0.tip, _5_nrm.cfe, _5_NestedPulsing_0.tip, _8_MockFixedIntBlock_0.tii, _6_MockFixedIntBlock_0.pyl, _5_NestedPulsing_0.tim, _8_MockFixedIntBlock_0.pyl, _3_MockVariableIntBlock_0.frq, _8_MockFixedIntBlock_0.tib, _3.fdt, _5_Lucene40WithOrds_0.tib, _4_MockVariableIntBlock_0.tii, _7.fnm, _6_MockFixedIntBlock_0.skp, _7_NestedPulsing_0.frq, _0_Lucene40WithOrds_0.frq, _5_Lucene40WithOrds_0.tii, _1_Lucene40WithOrds_0.tib, _1_NestedPulsing_0.tim, _1_Lucene40WithOrds_0.tii, _7_MockFixedIntBlock_0.pos, _7_MockFixedIntBlock_0.skp, _6_MockVariableIntBlock_0.tii, _1_Lucene40WithOrds_0.frq, _6_MockVariableIntBlock_0.tib, _4_MockFixedIntBlock_0.pos, _1_MockVariableIntBlock_0.tii, _3_NestedPulsing_0.tim, _1_MockVariableIntBlock_0.tib, _1.fdx, _4_MockVariableIntBlock_0.tib, _1.fdt, _3_NestedPulsing_0.tip, _5_nrm.cfs, _7_NestedPulsing_0.tim, _0_MockVariableIntBlock_0.frq, _4_MockFixedIntBlock_0.frq, _1_MockFixedIntBlock_0.pos, _8_MockVariableIntBlock_0.skp, _6.fdt, _7_NestedPulsing_0.tip, _5_Lucene40WithOrds_0.prx, _2.si, _1_MockVariableIntBlock_0.skp, _7_MockVariableIntBlock_0.pos, _3_MockFixedIntBlock_0.frq, _0_MockVariableIntBlock_0.doc, _6.fdx, _1_Lucene40WithOrds_0.prx, _1_MockVariableIntBlock_0.pyl, _6_MockFixedIntBlock_0.tib, _6_MockFixedIntBlock_0.tii, _3_MockVariableIntBlock_0.tii, _2_nrm.cfe, _8_MockFixedIntBlock_0.frq, _0_MockVariableIntBlock_0.pos, _7_MockVariableIntBlock_0.skp, _2_nrm.cfs, _6_MockFixedIntBlock_0.doc, _5_MockFixedIntBlock_0.frq, _5_MockFixedIntBlock_0.tib, _2_NestedPulsing_0.prx, _4_MockVariableIntBlock_0.frq, _0_NestedPulsing_0.frq, _7_MockFixedIntBlock_0.doc, _0_NestedPulsing_0.prx, _2.fnm, _5_MockVariableIntBlock_0.frq, _3.fdx, _8_MockVariableIntBlock_0.pos, _1.si, _6_NestedPulsing_0.tip, _0_Lucene40WithOrds_0.prx, _8_NestedPulsing_0.tip, _6_NestedPulsing_0.tim, _5_MockFixedIntBlock_0.tii, _8_NestedPulsing_0.tim, _3_MockVariableIntBlock_0.pos, _3_nrm.cfe, _8_MockVariableIntBlock_0.frq, _8_nrm.cfe, _3_MockFixedIntBlock_0.skp, _4_MockFixedIntBlock_0.tib, _5_MockVariableIntBlock_0.pyl, _3_Lucene40WithOrds_0.tii, _1_MockFixedIntBlock_0.pyl, _6_Lucene40WithOrds_0.prx, _4_nrm.cfe, _8_Lucene40WithOrds_0.tib, _3_Lucene40WithOrds_0.tib, _4.fdx, _8_Lucene40WithOrds_0.frq, _8_Lucene40WithOrds_0.tii, _7_MockVariableIntBlock_0.tii, _2_MockFixedIntBlock_0.frq, _4_MockFixedIntBlock_0.tii, _6_MockVariableIntBlock_0.frq, _3_MockVariableIntBlock_0.doc, _7_Lucene40WithOrds_0.tib, _5.si, _8_nrm.cfs, _3_nrm.cfs, _7_Lucene40WithOrds_0.tii, _6_MockFixedIntBlock_0.pos, _5_MockFixedIntBlock_0.skp, _4_MockVariableIntBlock_0.pyl, _1_MockFixedIntBlock_0.skp, _4_Lucene40WithOrds_0.prx, _4_MockFixedIntBlock_0.doc, _4_nrm.cfs, _3_MockVariableIntBlock_0.tib, _5_MockVariableIntBlock_0.doc, _1_NestedPulsing_0.prx, _6_MockVariableIntBlock_0.pyl, _1_MockFixedIntBlock_0.doc, _8_MockVariableIntBlock_0.tib, _8_MockFixedIntBlock_0.skp, _3_MockFixedIntBlock_0.doc, _2_MockVariableIntBlock_0.frq, _7_MockFixedIntBlock_0.tib, _6_nrm.cfs, _2_Lucene40WithOrds_0.prx, _7_nrm.cfs, _7_MockFixedIntBlock_0.tii, _8_MockVariableIntBlock_0.doc, _4_MockFixedIntBlock_0.pyl, _1_MockFixedIntBlock_0.tii, _1_nrm.cfs, _5.fnm, _7_NestedPulsing_0.prx, _7_nrm.cfe, _6_nrm.cfe, _5_MockFixedIntBlock_0.pos, _5_MockFixedIntBlock_0.doc, _7_MockFixedIntBlock_0.pyl, _3_Lucene40WithOrds_0.frq, _4.fdt, _4.si, _1_nrm.cfe, _5_NestedPulsing_0.prx, _1_MockFixedIntBlock_0.tib, _8.fdx, _8_MockFixedIntBlock_0.pos, _8_MockVariableIntBlock_0.tii, _8.fdt, _2_NestedPulsing_0.tim, _6_MockFixedIntBlock_0.frq, _7.si, _3_NestedPulsing_0.prx, _0_MockFixedIntBlock_0.tib, _8.si, _0_Lucene40WithOrds_0.tii, _6_NestedPulsing_0.prx, _8_MockVariableIntBlock_0.pyl, _0_MockFixedIntBlock_0.tii, _7_Lucene40WithOrds_0.frq, _5_MockVariableIntBlock_0.tii, _8_NestedPulsing_0.prx, _0_Lucene40WithOrds_0.tib, _2_NestedPulsing_0.tip, _4_MockVariableIntBlock_0.doc, _2.fdt, _7.fdx, _7_MockVariableIntBlock_0.frq, _2.fdx, _8_NestedPulsing_0.frq, _7.fdt, _2_MockFixedIntBlock_0.doc, _3.si, _4_NestedPulsing_0.frq, _2_MockVariableIntBlock_0.skp, _6_NestedPulsing_0.frq, _4_Lucene40WithOrds_0.tib, _2_MockVariableIntBlock_0.pyl, _4_Lucene40WithOrds_0.tii, _2_MockFixedIntBlock_0.skp, _3.fnm, _0_NestedPulsing_0.tip, _2_MockVariableIntBlock_0.doc, _0_NestedPulsing_0.tim, _0_MockVariableIntBlock_0.pyl, _0_MockFixedIntBlock_0.pyl, _1_MockVariableIntBlock_0.doc, _4_NestedPulsing_0.tip, _4_NestedPulsing_0.tim, _7_MockVariableIntBlock_0.pyl, _2_MockVariableIntBlock_0.tii, _2_Lucene40WithOrds_0.frq, _5_MockVariableIntBlock_0.tib, _2_MockVariableIntBlock_0.tib, _1_MockVariableIntBlock_0.pos, _3_MockFixedIntBlock_0.pos, _1_NestedPulsing_0.frq, _5_NestedPulsing_0.frq, _0_MockFixedIntBlock_0.doc, _2_NestedPulsing_0.frq, _3_MockVariableIntBlock_0.pyl, _6.si, _6.fnm, _7_MockVariableIntBlock_0.tib, _3_Lucene40WithOrds_0.prx, _5.fdt, _4.fnm, _0_MockVariableIntBlock_0.skp, _7_MockVariableIntBlock_0.doc, _2_MockFixedIntBlock_0.tii, _1.fnm, _3_MockFixedIntBlock_0.pyl, _2_MockFixedIntBlock_0.tib, _2_MockFixedIntBlock_0.pyl, _4_NestedPulsing_0.prx, _6_MockVariableIntBlock_0.doc, _2_MockVariableIntBlock_0.pos, _6_Lucene40WithOrds_0.frq, _0.fnm, _5_MockVariableIntBlock_0.pos, _1_MockFixedIntBlock_0.frq, _5_MockFixedIntBlock_0.pyl, _4_MockFixedIntBlock_0.skp, _0_MockFixedIntBlock_0.pos, _6_Lucene40WithOrds_0.tii, _5_Lucene40WithOrds_0.frq, _3_NestedPulsing_0.frq, _8.fnm, _2_MockFixedIntBlock_0.pos, _6_Lucene40WithOrds_0.tib, _8_MockFixedIntBlock_0.doc, _7_MockFixedIntBlock_0.frq, _4_Lucene40WithOrds_0.frq, _0_MockFixedIntBlock_0.skp, _4_MockVariableIntBlock_0.skp, _0_MockVariableIntBlock_0.tib, _5_MockVariableIntBlock_0.skp, _6_MockVariableIntBlock_0.pos, _4_MockVariableIntBlock_0.pos, _7_Lucene40WithOrds_0.prx, _0.si, _0_MockVariableIntBlock_0.tii, _3_MockFixedIntBlock_0.tib, _0_nrm.cfs, _6_MockVariableIntBlock_0.skp, _0_MockFixedIntBlock_0.frq, _2_Lucene40WithOrds_0.tii, _1_MockVariableIntBlock_0.frq, _0_nrm.cfe, _5.fdx, _2_Lucene40WithOrds_0.tib, _0.fdx, _8_Lucene40WithOrds_0.prx, _3_MockVariableIntBlock_0.skp, _0.fdt, segments_3, _3_MockFixedIntBlock_0.tii]
[junit4:junit4]   2> 3767 T1822 C151 oasu.DirectUpdateHandler2.commit start commit{flags=0,_version_=0,optimize=false,openSearcher=true,waitSearcher=true,expungeDeletes=false,softCommit=false}
[junit4:junit4]   2> 3767 T1824 C151 UPDATE [collection1] webapp=/solr path=/update params={waitSearcher=true&commit=true&wt=javabin&expungeDeletes=false&version=2&softCommit=false} {add=[111 (1413140366274592770), 113 (1413140366276689920), 122 (1413140366278787072), 123 (1413140366280884224), 124 (1413140366282981376), 130 (1413140366284029952), 131 (1413140366285078528), 135 (1413140366285078529), 138 (1413140366287175682), 141 (1413140366288224257)],commit=} 0 51
[junit4:junit4]   2> 3768 T1831 C152 oasc.SolrDeletionPolicy.updateCommits newest commit = 3
[junit4:junit4]   2> 3769 T1852 C154 oass.SolrIndexSearcher.<init> Opening Searcher@57bd524d main
[junit4:junit4]   2> 3769 T1822 C151 oass.SolrIndexSearcher.<init> Opening Searcher@728a8c5c main
[junit4:junit4]   2> 3769 T1852 C154 oass.SolrIndexSearcher.getIndexDir WARNING WARNING: Directory impl does not support setting indexDir: org.apache.lucene.store.MockDirectoryWrapper
[junit4:junit4]   2> 3769 T1822 C151 oass.SolrIndexSearcher.getIndexDir WARNING WARNING: Directory impl does not support setting indexDir: org.apache.lucene.store.MockDirectoryWrapper
[junit4:junit4]   2> 3770 T1855 oasc.SolrCore.registerSearcher [collection1] Registered new searcher Searcher@57bd524d main{StandardDirectoryReader(segments_3:17:nrt _0(5.0):C18 _1(5.0):C10 _2(5.0):C4 _5(5.0):C11 _4(5.0):C3 _3(5.0):C27 _7(5.0):C10 _6(5.0):C4)}
[junit4:junit4]   2> 3770 T1852 C154 oasu.DirectUpdateHandler2.commit end_commit_flush
[junit4:junit4]   2> 3770 T1822 C151 oasu.DirectUpdateHandler2.commit end_commit_flush
[junit4:junit4]   2> 3770 T1825 oasc.SolrCore.registerSearcher [collection1] Registered new searcher Searcher@728a8c5c main{StandardDirectoryReader(segments_6:22:nrt _1(5.0):C2 _2(5.0):C18 _3(5.0):C7 _4(5.0):C14 _5(5.0):C5 _7(5.0):C22 _8(5.0):C3 _6(5.0):C4 _9(5.0):C7)}
[junit4:junit4]   2> 3770 T1850 C154 oasu.DirectUpdateHandler2.commit start commit{flags=0,_version_=0,optimize=false,openSearcher=true,waitSearcher=true,expungeDeletes=false,softCommit=false}
[junit4:junit4]   2> 3770 T1852 C154 UPDATE [collection1] webapp=/solr path=/update params={waitSearcher=true&commit=true&wt=javabin&expungeDeletes=false&version=2&softCommit=false} {add=[69 (1413140366260961280), 70 (1413140366260961283), 71 (1413140366262009858), 72 (1413140366263058434), 73 (1413140366264107008), 77 (1413140366265155585), 78 (1413140366266204161), 79 (1413140366269349888), 81 (1413140366271447040), 86 (1413140366272495617)],commit=} 0 68
[junit4:junit4]   2> 3770 T1899 C151 oasu.DirectUpdateHandler2.commit start commit{flags=0,_version_=0,optimize=false,openSearcher=true,waitSearcher=true,expungeDeletes=false,softCommit=false}
[junit4:junit4]   2> 3771 T1822 C151 UPDATE [collection1] webapp=/solr path=/update params={waitSearcher=true&commit=true&wt=javabin&expungeDeletes=false&version=2&softCommit=false} {add=[72 (1413140366263058435), 73 (1413140366265155584), 75 (1413140366268301312), 78 (1413140366274592769), 80 (1413140366275641345), 81 (1413140366277738496), 84 (1413140366279835649), 85 (1413140366287175681), 87 (1413140366290321409), 89 (1413140366290321410)],commit=} 0 66
[junit4:junit4]   2> 3771 T1850 C154 oass.SolrIndexSearcher.<init> Opening Searcher@71c44c92 main
[junit4:junit4]   2> 3772 T1850 C154 oass.SolrIndexSearcher.getIndexDir WARNING WARNING: Directory impl does not support setting indexDir: org.apache.lucene.store.MockDirectoryWrapper
[junit4:junit4]   2> 3772 T1899 C151 oass.SolrIndexSearcher.<init> Opening Searcher@71223c1f main
[junit4:junit4]   2> 3772 T1855 oasc.SolrCore.registerSearcher [collection1] Registered new searcher Searcher@71c44c92 main{StandardDirectoryReader(segments_3:17:nrt _0(5.0):C18 _1(5.0):C10 _2(5.0):C4 _5(5.0):C11 _4(5.0):C3 _3(5.0):C27 _7(5.0):C10 _6(5.0):C4)}
[junit4:junit4]   2> 3772 T1850 C154 oasu.DirectUpdateHandler2.commit end_commit_flush
[junit4:junit4]   2> 3772 T1899 C151 oass.SolrIndexSearcher.getIndexDir WARNING WARNING: Directory impl does not support setting indexDir: org.apache.lucene.store.MockDirectoryWrapper
[junit4:junit4]   2> 3773 T1850 C154 UPDATE [collection1] webapp=/solr path=/update params={waitSearcher=true&commit=true&wt=javabin&expungeDeletes=false&version=2&softCommit=false} {add=[28 (1413140366133035008), 30 (1413140366134083584), 34 (1413140366259912706), 35 (1413140366260961281), 36 (1413140366262009857), 37 (1413140366263058432), 38 (1413140366264107009), 39 (1413140366266204162), 45 (1413140366269349889), 46 (1413140366279835648)],commit=} 0 192
[junit4:junit4]   2> 3773 T1853 C154 oasu.DirectUpdateHandler2.commit start commit{flags=0,_version_=0,optimize=false,openSearcher=true,waitSearcher=true,expungeDeletes=false,softCommit=false}
[junit4:junit4]   2> 3773 T1899 C151 oasu.DirectUpdateHandler2.commit end_commit_flush
[junit4:junit4]   2> 3773 T1825 oasc.SolrCore.registerSearcher [collection1] Registered new searcher Searcher@71223c1f main{StandardDirectoryReader(segments_6:22:nrt _1(5.0):C2 _2(5.0):C18 _3(5.0):C7 _4(5.0):C14 _5(5.0):C5 _7(5.0):C22 _8(5.0):C3 _6(5.0):C4 _9(5.0):C7)}
[junit4:junit4]   2> 3773 T1821 C151 oasu.DirectUpdateHandler2.commit start commit{flags=0,_version_=0,optimize=false,openSearcher=true,waitSearcher=true,expungeDeletes=false,softCommit=false}
[junit4:junit4]   2> 3774 T1899 C151 UPDATE [collection1] webapp=/solr path=/update params={waitSearcher=true&commit=true&wt=javabin&expungeDeletes=false&version=2&softCommit=false} {add=[142 (1413140366287175680), 144 (1413140366288224256), 145 (1413140366288224258), 146 (1413140366290321408), 147 (1413140366290321411), 150 (1413140366291369984), 158 (1413140366292418560), 160 (1413140366292418561), 161 (1413140366293467136), 165 (1413140366295564288)],commit=} 0 47
[junit4:junit4]   2> 3774 T1853 C154 oass.SolrIndexSearcher.<init> Opening Searcher@7db98b49 main
[junit4:junit4]   2> 3774 T1853 C154 oass.SolrIndexSearcher.getIndexDir WARNING WARNING: Directory impl does not support setting indexDir: org.apache.lucene.store.MockDirectoryWrapper
[junit4:junit4]   2> 3774 T1821 C151 oass.SolrIndexSearcher.<init> Opening Searcher@78afa4c8 main
[junit4:junit4]   2> 3775 T1853 C154 oasu.DirectUpdateHandler2.commit end_commit_flush
[junit4:junit4]   2> 3775 T1855 oasc.SolrCore.registerSearcher [collection1] Registered new searcher Searcher@7db98b49 main{StandardDirectoryReader(segments_3:17:nrt _0(5.0):C18 _1(5.0):C10 _2(5.0):C4 _5(5.0):C11 _4(5.0):C3 _3(5.0):C27 _7(5.0):C10 _6(5.0):C4)}
[junit4:junit4]   2> 3775 T1851 C154 oasu.DirectUpdateHandler2.commit start commit{flags=0,_version_=0,optimize=false,openSearcher=true,waitSearcher=true,expungeDeletes=false,softCommit=false}
[junit4:junit4]   2> 3775 T1821 C151 oass.SolrIndexSearcher.getIndexDir WARNING WARNING: Directory impl does not support setting indexDir: org.apache.lucene.store.MockDirectoryWrapper
[junit4:junit4]   2> 3775 T1853 C154 UPDATE [collection1] webapp=/solr path=/update params={waitSearcher=true&commit=true&wt=javabin&expungeDeletes=false&version=2&softCommit=false} {add=[87 (1413140366272495616), 91 (1413140366273544193), 95 (1413140366275641344), 96 (1413140366276689920), 97 (1413140366276689921), 98 (1413140366277738496), 103 (1413140366278787072), 107 (1413140366279835649), 110 (1413140366280884224), 112 (1413140366280884225)],commit=} 0 61
[junit4:junit4]   2> 3775 T1821 C151 oasu.DirectUpdateHandler2.commit end_commit_flush
[junit4:junit4]   2> 3775 T1851 C154 oass.SolrIndexSearcher.<init> Opening Searcher@5c804a69 main
[junit4:junit4]   2> 3775 T1825 oasc.SolrCore.registerSearcher [collection1] Registered new searcher Searcher@78afa4c8 main{StandardDirectoryReader(segments_6:22:nrt _1(5.0):C2 _2(5.0):C18 _3(5.0):C7 _4(5.0):C14 _5(5.0):C5 _7(5.0):C22 _8(5.0):C3 _6(5.0):C4 _9(5.0):C7)}
[junit4:junit4]   2> 3776 T1903 C151 oasu.DirectUpdateHandler2.commit start commit{flags=0,_version_=0,optimize=false,openSearcher=true,waitSearcher=true,expungeDeletes=false,softCommit=false}
[junit4:junit4]   2> 3776 T1821 C151 UPDATE [collection1] webapp=/solr path=/update params={waitSearcher=true&commit=true&wt=javabin&expungeDeletes=false&version=2&softCommit=false} {add=[47 (1413140366136180736), 51 (1413140366259912705), 54 (1413140366262009858), 57 (1413140366266204160), 61 (1413140366268301313), 62 (1413140366279835648), 63 (1413140366279835650), 66 (1413140366295564290), 68 (1413140366296612864), 71 (1413140366296612866)],commit=} 0 193
[junit4:junit4]   2> 3776 T1851 C154 oass.SolrIndexSearcher.getIndexDir WARNING WARNING: Directory impl does not support setting indexDir: org.apache.lucene.store.MockDirectoryWrapper
[junit4:junit4]   2> 3776 T1851 C154 oasu.DirectUpdateHandler2.commit end_commit_flush
[junit4:junit4]   2> 3776 T1855 oasc.SolrCore.registerSearcher [collection1] Registered new searcher Searcher@5c804a69 main{StandardDirectoryReader(segments_3:17:nrt _0(5.0):C18 _1(5.0):C10 _2(5.0):C4 _5(5.0):C11 _4(5.0):C3 _3(5.0):C27 _7(5.0):C10 _6(5.0):C4)}
[junit4:junit4]   2> 3777 T1903 C151 oass.SolrIndexSearcher.<init> Opening Searcher@7592b13a main
[junit4:junit4]   2> 3777 T1851 C154 UPDATE [collection1] webapp=/solr path=/update params={waitSearcher=true&commit=true&wt=javabin&expungeDeletes=false&version=2&softCommit=false} {add=[48 (1413140366135132161), 50 (1413140366259912704), 51 (1413140366259912707), 52 (1413140366260961284), 56 (1413140366262009859), 57 (1413140366265155584), 61 (1413140366266204160), 62 (1413140366267252736), 64 (1413140366282981377), 66 (1413140366284029952)],commit=} 0 194
[junit4:junit4]   2> 3777 T1854 C154 oasu.DirectUpdateHandler2.commit start commit{flags=0,_version_=0,optimize=false,openSearcher=true,waitSearcher=true,expungeDeletes=false,softCommit=false}
[junit4:junit4]   2> 3777 T1903 C151 oass.SolrIndexSearcher.getIndexDir WARNING WARNING: Directory impl does not support setting indexDir: org.apache.lucene.store.MockDirectoryWrapper
[junit4:junit4]   2> 3778 T1825 oasc.SolrCore.registerSearcher [collection1] Registered new searcher Searcher@7592b13a main{StandardDirectoryReader(segments_6:22:nrt _1(5.0):C2 _2(5.0):C18 _3(5.0):C7 _4(5.0):C14 _5(5.0):C5 _7(5.0):C22 _8(5.0):C3 _6(5.0):C4 _9(5.0):C7)}
[junit4:junit4]   2> 3778 T1854 C154 oass.SolrIndexSearcher.<init> Opening Searcher@41331925 main
[junit4:junit4]   2> 3778 T1903 C151 oasu.DirectUpdateHandler2.commit end_commit_flush
[junit4:junit4]   2> 3778 T1854 C154 oass.SolrIndexSearcher.getIndexDir WARNING WARNING: Directory impl does not support setting indexDir: org.apache.lucene.store.MockDirectoryWrapper
[junit4:junit4]   2> 3778 T1903 C151 UPDATE [collection1] webapp=/solr path=/update params={waitSearcher=true&commit=true&wt=javabin&expungeDeletes=false&version=2&softCommit=false} {add=[167 (1413140366295564289), 169 (1413140366296612865), 175 (1413140366297661440), 176 (1413140366298710016), 177 (1413140366306050048), 179 (1413140366307098624), 180 (1413140366308147200), 181 (1413140366308147201), 182 (1413140366309195776), 184 (1413140366309195777)],commit=} 0 42
[junit4:junit4]   2> 3779 T1854 C154 oasu.DirectUpdateHandler2.commit end_commit_flush
[junit4:junit4]   2> 3779 T1855 oasc.SolrCore.registerSearcher [collection1] Registered new searcher Searcher@41331925 main{StandardDirectoryReader(segments_3:17:nrt _0(5.0):C18 _1(5.0):C10 _2(5.0):C4 _5(5.0):C11 _4(5.0):C3 _3(5.0):C27 _7(5.0):C10 _6(5.0):C4)}
[junit4:junit4]   2> 3779 T1898 C154 oasu.DirectUpdateHandler2.commit start commit{flags=0,_version_=0,optimize=false,openSearcher=true,waitSearcher=true,expungeDeletes=false,softCommit=false}
[junit4:junit4]   2> 3779 T1854 C154 UPDATE [collection1] webapp=/solr path=/update params={waitSearcher=true&commit=true&wt=javabin&expungeDeletes=false&version=2&softCommit=false} {add=[114 (1413140366273544192), 115 (1413140366282981376), 118 (1413140366284029953), 120 (1413140366285078528), 121 (1413140366285078529), 122 (1413140366287175680), 123 (1413140366288224256), 124 (1413140366289272832), 126 (1413140366291369984), 132 (1413140366292418561)],commit=} 0 64
[junit4:junit4]   2> 3780 T1898 C154 oass.SolrIndexSearcher.<init> Opening Searcher@524e906d main
[junit4:junit4]   2> 3780 T1898 C154 oass.SolrIndexSearcher.getIndexDir WARNING WARNING: Directory impl does not support setting indexDir: org.apache.lucene.store.MockDirectoryWrapper
[junit4:junit4]   2> 3780 T1898 C154 oasu.DirectUpdateHandler2.commit end_commit_flush
[junit4:junit4]   2> 3780 T1855 oasc.SolrCore.registerSearcher [collection1] Registered new searcher Searcher@524e906d main{StandardDirectoryReader(segments_3:17:nrt _0(5.0):C18 _1(5.0):C10 _2(5.0):C4 _5(5.0):C11 _4(5.0):C3 _3(5.0):C27 _7(5.0):C10 _6(5.0):C4)}
[junit4:junit4]   2> 3781 T1898 C154 UPDATE [collection1] webapp=/solr path=/update params={waitSearcher=true&commit=true&wt=javabin&expungeDeletes=false&version=2&softCommit=false} {add=[156 (1413140366288224258), 158 (1413140366289272833), 159 (1413140366290321408), 160 (1413140366291369985), 162 (1413140366292418560), 166 (1413140366293467136), 167 (1413140366293467137), 169 (1413140366296612864), 170 (1413140366313390080), 174 (1413140366314438656)],commit=} 0 52
[junit4:junit4]   2> 3860 T1831 C152 oass.SolrIndexSearcher.<init> Opening Searcher@39d9f727 main
[junit4:junit4]   2> 3861 T1831 C152 oass.SolrIndexSearcher.getIndexDir WARNING WARNING: Directory impl does not support setting indexDir: org.apache.lucene.store.MockDirectoryWrapper
[junit4:junit4]   2> 3861 T1835 oasc.SolrCore.registerSearcher [collection1] Registered new searcher Searcher@39d9f727 main{StandardDirectoryReader(segments_3:21:nrt _1(5.0):C13 _0(5.0):C21 _2(5.0):C3 _3(5.0):C13 _5(5.0):C2 _4(5.0):C31 _8(5.0):C9 _6(5.0):C1 _7(5.0):C5 _9(5.0):C2)}
[junit4:junit4]   2> 3861 T1831 C152 oasu.DirectUpdateHandler2.commit end_commit_flush
[junit4:junit4]   2> 3862 T1889 C154 oasu.DirectUpdateHandler2.commit start commit{flags=0,_version_=0,optimize=false,openSearcher=true,waitSearcher=true,expungeDeletes=false,softCommit=false}
[junit4:junit4]   2> 3862 T1831 C152 UPDATE [collection1] webapp=/solr path=/update params={waitSearcher=true&commit=true&wt=javabin&expungeDeletes=false&version=2&softCommit=false} {add=[46 (1413140366133035011), 47 (1413140366135132161), 49 (1413140366258864129), 50 (1413140366259912705), 52 (1413140366260961280), 53 (1413140366260961284), 55 (1413140366262009859), 56 (1413140366263058436), 58 (1413140366265155585), 59 (1413140366266204162)],commit=} 0 281
[junit4:junit4]   2> 3862 T1830 C152 oasu.DirectUpdateHandler2.commit start commit{flags=0,_version_=0,optimize=false,openSearcher=true,waitSearcher=true,expungeDeletes=false,softCommit=false}
[junit4:junit4]   2> 3864 T1841 C153 oasc.SolrDeletionPolicy.onCommit SolrDeletionPolicy.onCommit: commits:num=2
[junit4:junit4]   2> 		commit{dir=MockDirWrapper(org.apache.lucene.store.RAMDirectory@621cc396 lockFactory=org.apache.lucene.store.NativeFSLockFactory@4dafe9ed),segFN=segments_2,generation=2,filenames=[_1_NestedPulsing_0.tip, _2_NestedPulsing_0.tim, _1_MockFixedIntBlock_0.pyl, _0_MockVariableIntBlock_0.skp, _0_MockFixedIntBlock_0.tib, _1.fnm, _2_MockFixedIntBlock_0.tii, _0_Lucene40WithOrds_0.tii, _2_MockFixedIntBlock_0.tib, _2_MockFixedIntBlock_0.pyl, _0_Lucene40WithOrds_0.frq, _1_Lucene40WithOrds_0.tib, _0_MockFixedIntBlock_0.tii, _2_MockFixedIntBlock_0.frq, _1_NestedPulsing_0.tim, _1_Lucene40WithOrds_0.tii, _0_Lucene40WithOrds_0.tib, _2_NestedPulsing_0.tip, _2_MockVariableIntBlock_0.pos, _1_Lucene40WithOrds_0.frq, _0.fnm, _1_MockFixedIntBlock_0.frq, _1_MockVariableIntBlock_0.tii, _2.fdt, _0_MockFixedIntBlock_0.pos, _2.fdx, _1_MockVariableIntBlock_0.tib, _1.fdx, _1_MockFixedIntBlock_0.skp, _1.fdt, _2_MockFixedIntBlock_0.pos, _0_MockVariableIntBlock_0.frq, _2_MockFixedIntBlock_0.doc, _1_MockFixedIntBlock_0.pos, _2_MockVariableIntBlock_0.skp, _1_MockVariableIntBlock_0.skp, _2.si, _1_NestedPulsing_0.prx, _2_MockVariableIntBlock_0.pyl, _1_MockFixedIntBlock_0.doc, _0_MockVariableIntBlock_0.doc, _1_Lucene40WithOrds_0.prx, _2_MockFixedIntBlock_0.skp, _1_MockVariableIntBlock_0.pyl, _2_MockVariableIntBlock_0.frq, _0_NestedPulsing_0.tip, _2_MockVariableIntBlock_0.doc, _0_NestedPulsing_0.tim, _0_MockVariableIntBlock_0.pyl, _2_nrm.cfe, _0_MockFixedIntBlock_0.skp, _0_MockFixedIntBlock_0.pyl, _2_Lucene40WithOrds_0.prx, _0_MockVariableIntBlock_0.tib, _1_MockVariableIntBlock_0.doc, _0_MockVariableIntBlock_0.pos, _2_nrm.cfs, _0.si, _0_MockVariableIntBlock_0.tii, _1_MockFixedIntBlock_0.tii, _1_nrm.cfs, _2_MockVariableIntBlock_0.tii, _2_Lucene40WithOrds_0.frq, _2_MockVariableIntBlock_0.tib, _1_MockVariableIntBlock_0.pos, _2_NestedPulsing_0.prx, _0_NestedPulsing_0.frq, _0_nrm.cfs, _0_NestedPulsing_0.prx, _1_nrm.cfe, _2.fnm, _0_MockFixedIntBlock_0.frq, _1_MockVariableIntBlock_0.frq, _2_Lucene40WithOrds_0.tii, _1_NestedPulsing_0.frq, _0_MockFixedIntBlock_0.doc, _1.si, _0_nrm.cfe, _2_NestedPulsing_0.frq, _1_MockFixedIntBlock_0.tib, segments_2, _0.fdx, _2_Lucene40WithOrds_0.tib, _0_Lucene40WithOrds_0.prx, _0.fdt]
[junit4:junit4]   2> 		commit{dir=MockDirWrapper(org.apache.lucene.store.RAMDirectory@621cc396 lockFactory=org.apache.lucene.store.NativeFSLockFactory@4dafe9ed),segFN=segments_3,generation=3,filenames=[_1_NestedPulsing_0.tip, _5_nrm.cfe, _5_NestedPulsing_0.tip, _8_MockFixedIntBlock_0.tii, _a_MockFixedIntBlock_0.pos, _6_MockFixedIntBlock_0.pyl, _5_NestedPulsing_0.tim, _8_MockFixedIntBlock_0.pyl, _3_MockVariableIntBlock_0.frq, _a_MockVariableIntBlock_0.frq, _8_MockFixedIntBlock_0.tib, _3.fdt, _5_Lucene40WithOrds_0.tib, _4_MockVariableIntBlock_0.tii, _7.fnm, _6_MockFixedIntBlock_0.skp, _7_NestedPulsing_0.frq, _0_Lucene40WithOrds_0.frq, _5_Lucene40WithOrds_0.tii, _1_Lucene40WithOrds_0.tib, _1_NestedPulsing_0.tim, _1_Lucene40WithOrds_0.tii, _7_MockFixedIntBlock_0.pos, _7_MockFixedIntBlock_0.skp, _6_MockVariableIntBlock_0.tii, _1_Lucene40WithOrds_0.frq, _6_MockVariableIntBlock_0.tib, _4_MockFixedIntBlock_0.pos, _1_MockVariableIntBlock_0.tii, _9.fdt, _3_NestedPulsing_0.tim, _9.fdx, _1_MockVariableIntBlock_0.tib, _1.fdx, _4_MockVariableIntBlock_0.tib, _1.fdt, _5_nrm.cfs, _3_NestedPulsing_0.tip, _7_NestedPulsing_0.tim, _4_MockFixedIntBlock_0.frq, _0_MockVariableIntBlock_0.frq, _8_MockVariableIntBlock_0.skp, _1_MockFixedIntBlock_0.pos, _6.fdt, _7_NestedPulsing_0.tip, _a.fnm, _5_Lucene40WithOrds_0.prx, _1_MockVariableIntBlock_0.skp, _2.si, _a_NestedPulsing_0.frq, _7_MockVariableIntBlock_0.pos, _3_MockFixedIntBlock_0.frq, _0_MockVariableIntBlock_0.doc, _6.fdx, _1_Lucene40WithOrds_0.prx, _a_Lucene40WithOrds_0.frq, _1_MockVariableIntBlock_0.pyl, _6_MockFixedIntBlock_0.tib, _6_MockFixedIntBlock_0.tii, _3_MockVariableIntBlock_0.tii, _2_nrm.cfe, _8_MockFixedIntBlock_0.frq, _0_MockVariableIntBlock_0.pos, _7_MockVariableIntBlock_0.skp, _2_nrm.cfs, _9_MockVariableIntBlock_0.frq, _6_MockFixedIntBlock_0.doc, _5_MockFixedIntBlock_0.frq, _5_MockFixedIntBlock_0.tib, _2_NestedPulsing_0.prx, _4_MockVariableIntBlock_0.frq, _0_NestedPulsing_0.frq, _7_MockFixedIntBlock_0.doc, _0_NestedPulsing_0.prx, _2.fnm, _5_MockVariableIntBlock_0.frq, _3.fdx, _8_MockVariableIntBlock_0.pos, _1.si, _6_NestedPulsing_0.tip, _0_Lucene40WithOrds_0.prx, _8_NestedPulsing_0.tip, _6_NestedPulsing_0.tim, _5_MockFixedIntBlock_0.tii, _8_NestedPulsing_0.tim, _3_MockVariableIntBlock_0.pos, _8_MockVariableIntBlock_0.frq, _9_MockVariableIntBlock_0.pyl, _3_nrm.cfe, _8_nrm.cfe, _9_MockFixedIntBlock_0.skp, _a_NestedPulsing_0.tim, _3_MockFixedIntBlock_0.skp, _4_MockFixedIntBlock_0.tib, _5_MockVariableIntBlock_0.pyl, _3_Lucene40WithOrds_0.tii, _1_MockFixedIntBlock_0.pyl, _6_Lucene40WithOrds_0.prx, _4_nrm.cfe, _8_Lucene40WithOrds_0.tib, _a_MockVariableIntBlock_0.doc, _3_Lucene40WithOrds_0.tib, _8_Lucene40WithOrds_0.frq, _4.fdx, _a_MockVariableIntBlock_0.skp, _8_Lucene40WithOrds_0.tii, _7_MockVariableIntBlock_0.tii, _a_MockFixedIntBlock_0.doc, _2_MockFixedIntBlock_0.frq, _4_MockFixedIntBlock_0.tii, _9.si, _6_MockVariableIntBlock_0.frq, _3_MockVariableIntBlock_0.doc, _7_Lucene40WithOrds_0.tib, _8_nrm.cfs, _5.si, _3_nrm.cfs, _7_Lucene40WithOrds_0.tii, _6_MockFixedIntBlock_0.pos, _5_MockFixedIntBlock_0.skp, _4_MockVariableIntBlock_0.pyl, _a_MockVariableIntBlock_0.pyl, _1_MockFixedIntBlock_0.skp, _4_Lucene40WithOrds_0.prx, _4_MockFixedIntBlock_0.doc, _4_nrm.cfs, _3_MockVariableIntBlock_0.tib, _5_MockVariableIntBlock_0.doc, _1_NestedPulsing_0.prx, _8_MockVariableIntBlock_0.tib, _6_MockVariableIntBlock_0.pyl, _1_MockFixedIntBlock_0.doc, _8_MockFixedIntBlock_0.skp, _2_MockVariableIntBlock_0.frq, _3_MockFixedIntBlock_0.doc, _a.fdt, _a.fdx, _7_MockFixedIntBlock_0.tib, _6_nrm.cfs, _2_Lucene40WithOrds_0.prx, _7_nrm.cfs, _9_Lucene40WithOrds_0.frq, _7_MockFixedIntBlock_0.tii, _8_MockVariableIntBlock_0.doc, _4_MockFixedIntBlock_0.pyl, _1_MockFixedIntBlock_0.tii, _1_nrm.cfs, _5.fnm, _7_NestedPulsing_0.prx, _7_nrm.cfe, _a_Lucene40WithOrds_0.tii, _a_MockFixedIntBlock_0.frq, _6_nrm.cfe, _5_MockFixedIntBlock_0.pos, _9_MockVariableIntBlock_0.skp, _5_MockFixedIntBlock_0.doc, _7_MockFixedIntBlock_0.pyl, _3_Lucene40WithOrds_0.frq, _4.fdt, _4.si, _a_Lucene40WithOrds_0.tib, _1_nrm.cfe, _9_NestedPulsing_0.prx, _5_NestedPulsing_0.prx, _a_MockVariableIntBlock_0.tii, _9_MockVariableIntBlock_0.doc, _a_NestedPulsing_0.tip, _1_MockFixedIntBlock_0.tib, _8.fdx, _8_MockFixedIntBlock_0.pos, _a_MockVariableIntBlock_0.tib, _8_MockVariableIntBlock_0.tii, _8.fdt, _2_NestedPulsing_0.tim, _a_MockFixedIntBlock_0.tii, _6_MockFixedIntBlock_0.frq, _a_MockFixedIntBlock_0.pyl, _7.si, _9_NestedPulsing_0.frq, _0_MockFixedIntBlock_0.tib, _3_NestedPulsing_0.prx, _8.si, _0_Lucene40WithOrds_0.tii, _6_NestedPulsing_0.prx, _9_MockFixedIntBlock_0.frq, _8_MockVariableIntBlock_0.pyl, _0_MockFixedIntBlock_0.tii, _7_Lucene40WithOrds_0.frq, _5_MockVariableIntBlock_0.tii, _8_NestedPulsing_0.prx, _0_Lucene40WithOrds_0.tib, _2_NestedPulsing_0.tip, _9_MockVariableIntBlock_0.tib, _4_MockVariableIntBlock_0.doc, _2.fdt, _7.fdx, _7_MockVariableIntBlock_0.frq, _8_NestedPulsing_0.frq, _2.fdx, _7.fdt, _9_MockFixedIntBlock_0.pos, _2_MockFixedIntBlock_0.doc, _3.si, _a_MockFixedIntBlock_0.tib, _4_NestedPulsing_0.frq, _2_MockVariableIntBlock_0.skp, _a_NestedPulsing_0.prx, _6_NestedPulsing_0.frq, _4_Lucene40WithOrds_0.tib, _2_MockVariableIntBlock_0.pyl, _4_Lucene40WithOrds_0.tii, _2_MockFixedIntBlock_0.skp, _3.fnm, _0_NestedPulsing_0.tip, _2_MockVariableIntBlock_0.doc, _0_NestedPulsing_0.tim, _0_MockVariableIntBlock_0.pyl, _0_MockFixedIntBlock_0.pyl, _a_MockFixedIntBlock_0.skp, _1_MockVariableIntBlock_0.doc, _4_NestedPulsing_0.tip, _4_NestedPulsing_0.tim, _9_MockVariableIntBlock_0.tii, _7_MockVariableIntBlock_0.pyl, _2_MockVariableIntBlock_0.tii, _2_Lucene40WithOrds_0.frq, _5_MockVariableIntBlock_0.tib, _2_MockVariableIntBlock_0.tib, _9.fnm, _1_MockVariableIntBlock_0.pos, _3_MockFixedIntBlock_0.pos, _1_NestedPulsing_0.frq, _a_MockVariableIntBlock_0.pos, _5_NestedPulsing_0.frq, _0_MockFixedIntBlock_0.doc, _2_NestedPulsing_0.frq, _3_MockVariableIntBlock_0.pyl, _6.fnm, _6.si, _7_MockVariableIntBlock_0.tib, _3_Lucene40WithOrds_0.prx, _5.fdt, _4.fnm, _0_MockVariableIntBlock_0.skp, _7_MockVariableIntBlock_0.doc, _a_Lucene40WithOrds_0.prx, _1.fnm, _2_MockFixedIntBlock_0.tii, _9_MockFixedIntBlock_0.doc, _3_MockFixedIntBlock_0.pyl, _2_MockFixedIntBlock_0.tib, _9_NestedPulsing_0.tip, _2_MockFixedIntBlock_0.pyl, _9_nrm.cfs, _9_NestedPulsing_0.tim, _9_MockVariableIntBlock_0.pos, _4_NestedPulsing_0.prx, _9_MockFixedIntBlock_0.pyl, _6_MockVariableIntBlock_0.doc, _2_MockVariableIntBlock_0.pos, _a_nrm.cfe, _0.fnm, _6_Lucene40WithOrds_0.frq, _5_MockVariableIntBlock_0.pos, _9_nrm.cfe, _1_MockFixedIntBlock_0.frq, _5_MockFixedIntBlock_0.pyl, _4_MockFixedIntBlock_0.skp, _0_MockFixedIntBlock_0.pos, _a.si, _a_nrm.cfs, _6_Lucene40WithOrds_0.tii, _5_Lucene40WithOrds_0.frq, _8.fnm, _3_NestedPulsing_0.frq, _2_MockFixedIntBlock_0.pos, _6_Lucene40WithOrds_0.tib, _9_MockFixedIntBlock_0.tii, _8_MockFixedIntBlock_0.doc, _9_MockFixedIntBlock_0.tib, _7_MockFixedIntBlock_0.frq, _4_Lucene40WithOrds_0.frq, _0_MockFixedIntBlock_0.skp, _4_MockVariableIntBlock_0.skp, _9_Lucene40WithOrds_0.prx, _0_MockVariableIntBlock_0.tib, _5_MockVariableIntBlock_0.skp, _6_MockVariableIntBlock_0.pos, _4_MockVariableIntBlock_0.pos, _7_Lucene40WithOrds_0.prx, _0.si, _0_MockVariableIntBlock_0.tii, _3_MockFixedIntBlock_0.tib, _0_nrm.cfs, _6_MockVariableIntBlock_0.skp, _9_Lucene40WithOrds_0.tii, _0_MockFixedIntBlock_0.frq, _1_MockVariableIntBlock_0.frq, _2_Lucene40WithOrds_0.tii, _9_Lucene40WithOrds_0.tib, _0_nrm.cfe, _5.fdx, _0.fdx, _2_Lucene40WithOrds_0.tib, _8_Lucene40WithOrds_0.prx, _3_MockVariableIntBlock_0.skp, _0.fdt, segments_3, _3_MockFixedIntBlock_0.tii]
[junit4:junit4]   2> 3868 T1841 C153 oasc.SolrDeletionPolicy.updateCommits newest commit = 3
[junit4:junit4]   2> 3876 T1889 C154 oasc.SolrDeletionPolicy.onCommit SolrDeletionPolicy.onCommit: commits:num=2
[junit4:junit4]   2> 		commit{dir=MockDirWrapper(org.apache.lucene.store.RAMDirectory@11061cba lockFactory=org.apache.lucene.store.NativeFSLockFactory@efc70c0),segFN=segments_3,generation=3,filenames=[_5_nrm.cfe, _1_NestedPulsing_0.tip, _5_NestedPulsing_0.tip, _6_MockFixedIntBlock_0.pyl, _5_NestedPulsing_0.tim, _3_MockVariableIntBlock_0.frq, _3.fdt, _5_Lucene40WithOrds_0.tib, _4_MockVariableIntBlock_0.tii, _6_MockFixedIntBlock_0.skp, _7.fnm, _7_NestedPulsing_0.frq, _5_Lucene40WithOrds_0.tii, _0_Lucene40WithOrds_0.frq, _1_Lucene40WithOrds_0.tib, _1_Lucene40WithOrds_0.tii, _1_NestedPulsing_0.tim, _7_MockFixedIntBlock_0.pos, _6_MockVariableIntBlock_0.tii, _7_MockFixedIntBlock_0.skp, _1_Lucene40WithOrds_0.frq, _6_MockVariableIntBlock_0.tib, _4_MockFixedIntBlock_0.pos, _1_MockVariableIntBlock_0.tii, _3_NestedPulsing_0.tim, _1_MockVariableIntBlock_0.tib, _1.fdx, _4_MockVariableIntBlock_0.tib, _1.fdt, _5_nrm.cfs, _3_NestedPulsing_0.tip, _7_NestedPulsing_0.tim, _0_MockVariableIntBlock_0.frq, _4_MockFixedIntBlock_0.frq, _1_MockFixedIntBlock_0.pos, _6.fdt, _7_NestedPulsing_0.tip, _5_Lucene40WithOrds_0.prx, _2.si, _1_MockVariableIntBlock_0.skp, _7_MockVariableIntBlock_0.pos, _3_MockFixedIntBlock_0.frq, _0_MockVariableIntBlock_0.doc, _6.fdx, _1_Lucene40WithOrds_0.prx, _1_MockVariableIntBlock_0.pyl, _6_MockFixedIntBlock_0.tib, _6_MockFixedIntBlock_0.tii, _3_MockVariableIntBlock_0.tii, _2_nrm.cfe, _0_MockVariableIntBlock_0.pos, _2_nrm.cfs, _7_MockVariableIntBlock_0.skp, _6_MockFixedIntBlock_0.doc, _5_MockFixedIntBlock_0.frq, _5_MockFixedIntBlock_0.tib, _2_NestedPulsing_0.prx, _4_MockVariableIntBlock_0.frq, _0_NestedPulsing_0.frq, _7_MockFixedIntBlock_0.doc, _0_NestedPulsing_0.prx, _2.fnm, _5_MockVariableIntBlock_0.frq, _3.fdx, _1.si, _6_NestedPulsing_0.tip, _0_Lucene40WithOrds_0.prx, _6_NestedPulsing_0.tim, _5_MockFixedIntBlock_0.tii, _3_MockVariableIntBlock_0.pos, _3_nrm.cfe, _4_MockFixedIntBlock_0.tib, _3_MockFixedIntBlock_0.skp, _5_MockVariableIntBlock_0.pyl, _3_Lucene40WithOrds_0.tii, _1_MockFixedIntBlock_0.pyl, _6_Lucene40WithOrds_0.prx, _4_nrm.cfe, _3_Lucene40WithOrds_0.tib, _4.fdx, _2_MockFixedIntBlock_0.frq, _4_MockFixedIntBlock_0.tii, _7_MockVariableIntBlock_0.tii, _6_MockVariableIntBlock_0.frq, _3_MockVariableIntBlock_0.doc, _7_Lucene40WithOrds_0.tib, _5.si, _3_nrm.cfs, _6_MockFixedIntBlock_0.pos, _7_Lucene40WithOrds_0.tii, _5_MockFixedIntBlock_0.skp, _4_MockVariableIntBlock_0.pyl, _1_MockFixedIntBlock_0.skp, _4_Lucene40WithOrds_0.prx, _4_MockFixedIntBlock_0.doc, _4_nrm.cfs, _3_MockVariableIntBlock_0.tib, _5_MockVariableIntBlock_0.doc, _1_NestedPulsing_0.prx, _6_MockVariableIntBlock_0.pyl, _1_MockFixedIntBlock_0.doc, _2_MockVariableIntBlock_0.frq, _3_MockFixedIntBlock_0.doc, _6_nrm.cfs, _7_MockFixedIntBlock_0.tib, _2_Lucene40WithOrds_0.prx, _7_nrm.cfs, _7_MockFixedIntBlock_0.tii, _4_MockFixedIntBlock_0.pyl, _1_nrm.cfs, _1_MockFixedIntBlock_0.tii, _5.fnm, _7_nrm.cfe, _7_NestedPulsing_0.prx, _6_nrm.cfe, _5_MockFixedIntBlock_0.pos, _5_MockFixedIntBlock_0.doc, _7_MockFixedIntBlock_0.pyl, _4.fdt, _4.si, _3_Lucene40WithOrds_0.frq, _1_nrm.cfe, _5_NestedPulsing_0.prx, _1_MockFixedIntBlock_0.tib, _2_NestedPulsing_0.tim, _6_MockFixedIntBlock_0.frq, _7.si, _0_MockFixedIntBlock_0.tib, _3_NestedPulsing_0.prx, _0_Lucene40WithOrds_0.tii, _6_NestedPulsing_0.prx, _0_MockFixedIntBlock_0.tii, _7_Lucene40WithOrds_0.frq, _5_MockVariableIntBlock_0.tii, _0_Lucene40WithOrds_0.tib, _2_NestedPulsing_0.tip, _4_MockVariableIntBlock_0.doc, _2.fdt, _7.fdx, _7_MockVariableIntBlock_0.frq, _2.fdx, _7.fdt, _2_MockFixedIntBlock_0.doc, _3.si, _4_NestedPulsing_0.frq, _2_MockVariableIntBlock_0.skp, _6_NestedPulsing_0.frq, _4_Lucene40WithOrds_0.tib, _2_MockVariableIntBlock_0.pyl, _4_Lucene40WithOrds_0.tii, _2_MockFixedIntBlock_0.skp, _3.fnm, _0_NestedPulsing_0.tip, _2_MockVariableIntBlock_0.doc, _0_NestedPulsing_0.tim, _0_MockVariableIntBlock_0.pyl, _0_MockFixedIntBlock_0.pyl, _1_MockVariableIntBlock_0.doc, _4_NestedPulsing_0.tip, _4_NestedPulsing_0.tim, _2_MockVariableIntBlock_0.tii, _7_MockVariableIntBlock_0.pyl, _2_Lucene40WithOrds_0.frq, _5_MockVariableIntBlock_0.tib, _2_MockVariableIntBlock_0.tib, _1_MockVariableIntBlock_0.pos, _3_MockFixedIntBlock_0.pos, _1_NestedPulsing_0.frq, _5_NestedPulsing_0.frq, _0_MockFixedIntBlock_0.doc, _2_NestedPulsing_0.frq, _3_MockVariableIntBlock_0.pyl, _6.si, _6.fnm, _7_MockVariableIntBlock_0.tib, _3_Lucene40WithOrds_0.prx, _5.fdt, _4.fnm, _0_MockVariableIntBlock_0.skp, _2_MockFixedIntBlock_0.tii, _1.fnm, _7_MockVariableIntBlock_0.doc, _3_MockFixedIntBlock_0.pyl, _2_MockFixedIntBlock_0.tib, _2_MockFixedIntBlock_0.pyl, _4_NestedPulsing_0.prx, _6_MockVariableIntBlock_0.doc, _2_MockVariableIntBlock_0.pos, _6_Lucene40WithOrds_0.frq, _0.fnm, _5_MockVariableIntBlock_0.pos, _1_MockFixedIntBlock_0.frq, _5_MockFixedIntBlock_0.pyl, _4_MockFixedIntBlock_0.skp, _0_MockFixedIntBlock_0.pos, _6_Lucene40WithOrds_0.tii, _5_Lucene40WithOrds_0.frq, _3_NestedPulsing_0.frq, _2_MockFixedIntBlock_0.pos, _6_Lucene40WithOrds_0.tib, _4_Lucene40WithOrds_0.frq, _7_MockFixedIntBlock_0.frq, _0_MockFixedIntBlock_0.skp, _4_MockVariableIntBlock_0.skp, _0_MockVariableIntBlock_0.tib, _5_MockVariableIntBlock_0.skp, _6_MockVariableIntBlock_0.pos, _4_MockVariableIntBlock_0.pos, _7_Lucene40WithOrds_0.prx, _0.si, _0_MockVariableIntBlock_0.tii, _3_MockFixedIntBlock_0.tib, _0_nrm.cfs, _6_MockVariableIntBlock_0.skp, _0_MockFixedIntBlock_0.frq, _2_Lucene40WithOrds_0.tii, _1_MockVariableIntBlock_0.frq, _0_nrm.cfe, _5.fdx, _2_Lucene40WithOrds_0.tib, _0.fdx, _3_MockVariableIntBlock_0.skp, segments_3, _0.fdt, _3_MockFixedIntBlock_0.tii]
[junit4:junit4]   2> 		commit{dir=MockDirWrapper(org.apache.lucene.store.RAMDirectory@11061cba lockFactory=org.apache.lucene.store.NativeFSLockFactory@efc70c0),segFN=segments_4,generation=4,filenames=[_5_nrm.cfe, _1_NestedPulsing_0.tip, _5_NestedPulsing_0.tip, _8_MockFixedIntBlock_0.tii, _6_MockFixedIntBlock_0.pyl, _5_NestedPulsing_0.tim, _8_MockFixedIntBlock_0.pyl, _3_MockVariableIntBlock_0.frq, _8_MockFixedIntBlock_0.tib, _3.fdt, _5_Lucene40WithOrds_0.tib, _4_MockVariableIntBlock_0.tii, _6_MockFixedIntBlock_0.skp, _7.fnm, _7_NestedPulsing_0.frq, _5_Lucene40WithOrds_0.tii, _0_Lucene40WithOrds_0.frq, _1_Lucene40WithOrds_0.tib, _1_Lucene40WithOrds_0.tii, _1_NestedPulsing_0.tim, _7_MockFixedIntBlock_0.pos, _6_MockVariableIntBlock_0.tii, _7_MockFixedIntBlock_0.skp, _1_Lucene40WithOrds_0.frq, _6_MockVariableIntBlock_0.tib, _4_MockFixedIntBlock_0.pos, _1_MockVariableIntBlock_0.tii, _3_NestedPulsing_0.tim, _1_MockVariableIntBlock_0.tib, _1.fdx, _4_MockVariableIntBlock_0.tib, _1.fdt, _5_nrm.cfs, _3_NestedPulsing_0.tip, _7_NestedPulsing_0.tim, _0_MockVariableIntBlock_0.frq, _4_MockFixedIntBlock_0.frq, _8_MockVariableIntBlock_0.skp, _1_MockFixedIntBlock_0.pos, _6.fdt, _7_NestedPulsing_0.tip, _5_Lucene40WithOrds_0.prx, _2.si, _1_MockVariableIntBlock_0.skp, _7_MockVariableIntBlock_0.pos, _3_MockFixedIntBlock_0.frq, _0_MockVariableIntBlock_0.doc, _6.fdx, _1_Lucene40WithOrds_0.prx, _1_MockVariableIntBlock_0.pyl, _6_MockFixedIntBlock_0.tib, _6_MockFixedIntBlock_0.tii, _3_MockVariableIntBlock_0.tii, _2_nrm.cfe, _8_MockFixedIntBlock_0.frq, _0_MockVariableIntBlock_0.pos, _2_nrm.cfs, _7_MockVariableIntBlock_0.skp, _6_MockFixedIntBlock_0.doc, _5_MockFixedIntBlock_0.frq, _5_MockFixedIntBlock_0.tib, _2_NestedPulsing_0.prx, _4_MockVariableIntBlock_0.frq, _0_NestedPulsing_0.frq, _7_MockFixedIntBlock_0.doc, _0_NestedPulsing_0.prx, _2.fnm, _5_MockVariableIntBlock_0.frq, _3.fdx, _8_MockVariableIntBlock_0.pos, _1.si, _6_NestedPulsing_0.tip, _0_Lucene40WithOrds_0.prx, _8_NestedPulsing_0.tip, _6_NestedPulsing_0.tim, _5_MockFixedIntBlock_0.tii, _8_NestedPulsing_0.tim, _3_MockVariableIntBlock_0.pos, _8_MockVariableIntBlock_0.frq, _3_nrm.cfe, _8_nrm.cfe, _4_MockFixedIntBlock_0.tib, _3_MockFixedIntBlock_0.skp, _5_MockVariableIntBlock_0.pyl, _3_Lucene40WithOrds_0.tii, _1_MockFixedIntBlock_0.pyl, _6_Lucene40WithOrds_0.prx, _4_nrm.cfe, _8_Lucene40WithOrds_0.tib, _3_Lucene40WithOrds_0.tib, _8_Lucene40WithOrds_0.frq, _4.fdx, _8_Lucene40WithOrds_0.tii, _2_MockFixedIntBlock_0.frq, _4_MockFixedIntBlock_0.tii, _7_MockVariableIntBlock_0.tii, _6_MockVariableIntBlock_0.frq, _3_MockVariableIntBlock_0.doc, _7_Lucene40WithOrds_0.tib, _8_nrm.cfs, _5.si, _3_nrm.cfs, _6_MockFixedIntBlock_0.pos, _7_Lucene40WithOrds_0.tii, _5_MockFixedIntBlock_0.skp, _4_MockVariableIntBlock_0.pyl, _1_MockFixedIntBlock_0.skp, _4_Lucene40WithOrds_0.prx, _4_MockFixedIntBlock_0.doc, _4_nrm.cfs, _3_MockVariableIntBlock_0.tib, _5_MockVariableIntBlock_0.doc, _1_NestedPulsing_0.prx, _8_MockVariableIntBlock_0.tib, _6_MockVariableIntBlock_0.pyl, _1_MockFixedIntBlock_0.doc, _8_MockFixedIntBlock_0.skp, _2_MockVariableIntBlock_0.frq, _3_MockFixedIntBlock_0.doc, _6_nrm.cfs, _7_MockFixedIntBlock_0.tib, _2_Lucene40WithOrds_0.prx, _7_nrm.cfs, _8_MockVariableIntBlock_0.doc, _7_MockFixedIntBlock_0.tii, _4_MockFixedIntBlock_0.pyl, _1_nrm.cfs, _1_MockFixedIntBlock_0.tii, _5.fnm, _7_nrm.cfe, _7_NestedPulsing_0.prx, _6_nrm.cfe, _5_MockFixedIntBlock_0.pos, _5_MockFixedIntBlock_0.doc, _7_MockFixedIntBlock_0.pyl, _4.fdt, _4.si, _3_Lucene40WithOrds_0.frq, _1_nrm.cfe, _5_NestedPulsing_0.prx, _1_MockFixedIntBlock_0.tib, _8.fdx, _8_MockFixedIntBlock_0.pos, _8_MockVariableIntBlock_0.tii, _8.fdt, _2_NestedPulsing_0.tim, _6_MockFixedIntBlock_0.frq, _7.si, _0_MockFixedIntBlock_0.tib, _3_NestedPulsing_0.prx, _8.si, _0_Lucene40WithOrds_0.tii, _6_NestedPulsing_0.prx, _8_MockVariableIntBlock_0.pyl, _0_MockFixedIntBlock_0.tii, _7_Lucene40WithOrds_0.frq, _5_MockVariableIntBlock_0.tii, _8_NestedPulsing_0.prx, _0_Lucene40WithOrds_0.tib, _2_NestedPulsing_0.tip, _4_MockVariableIntBlock_0.doc, _2.fdt, _7.fdx, _7_MockVariableIntBlock_0.frq, _8_NestedPulsing_0.frq, _2.fdx, _7.fdt, _2_MockFixedIntBlock_0.doc, _3.si, _4_NestedPulsing_0.frq, _2_MockVariableIntBlock_0.skp, _6_NestedPulsing_0.frq, _4_Lucene40WithOrds_0.tib, _2_MockVariableIntBlock_0.pyl, _4_Lucene40WithOrds_0.tii, _2_MockFixedIntBlock_0.skp, _3.fnm, _0_NestedPulsing_0.tip, _2_MockVariableIntBlock_0.doc, _0_NestedPulsing_0.tim, _0_MockVariableIntBlock_0.pyl, _0_MockFixedIntBlock_0.pyl, _1_MockVariableIntBlock_0.doc, _4_NestedPulsing_0.tip, _4_NestedPulsing_0.tim, _2_MockVariableIntBlock_0.tii, _7_MockVariableIntBlock_0.pyl, _2_Lucene40WithOrds_0.frq, _5_MockVariableIntBlock_0.tib, _2_MockVariableIntBlock_0.tib, _1_MockVariableIntBlock_0.pos, _3_MockFixedIntBlock_0.pos, _1_NestedPulsing_0.frq, _5_NestedPulsing_0.frq, _0_MockFixedIntBlock_0.doc, _2_NestedPulsing_0.frq, _3_MockVariableIntBlock_0.pyl, _6.si, _6.fnm, _7_MockVariableIntBlock_0.tib, _3_Lucene40WithOrds_0.prx, _5.fdt, _4.fnm, _0_MockVariableIntBlock_0.skp, _2_MockFixedIntBlock_0.tii, _1.fnm, _7_MockVariableIntBlock_0.doc, _3_MockFixedIntBlock_0.pyl, _2_MockFixedIntBlock_0.tib, _2_MockFixedIntBlock_0.pyl, _4_NestedPulsing_0.prx, _6_MockVariableIntBlock_0.doc, _2_MockVariableIntBlock_0.pos, _6_Lucene40WithOrds_0.frq, _0.fnm, _5_MockVariableIntBlock_0.pos, _1_MockFixedIntBlock_0.frq, _5_MockFixedIntBlock_0.pyl, _4_MockFixedIntBlock_0.skp, _0_MockFixedIntBlock_0.pos, _6_Lucene40WithOrds_0.tii, _5_Lucene40WithOrds_0.frq, _8.fnm, _3_NestedPulsing_0.frq, _2_MockFixedIntBlock_0.pos, _6_Lucene40WithOrds_0.tib, _8_MockFixedIntBlock_0.doc, _4_Lucene40WithOrds_0.frq, _7_MockFixedIntBlock_0.frq, _0_MockFixedIntBlock_0.skp, _4_MockVariableIntBlock_0.skp, _0_MockVariableIntBlock_0.tib, _5_MockVariableIntBlock_0.skp, _6_MockVariableIntBlock_0.pos, _4_MockVariableIntBlock_0.pos, _7_Lucene40WithOrds_0.prx, _0.si, _0_MockVariableIntBlock_0.tii, _3_MockFixedIntBlock_0.tib, _0_nrm.cfs, _6_MockVariableIntBlock_0.skp, _0_MockFixedIntBlock_0.frq, _2_Lucene40WithOrds_0.tii, _1_MockVariableIntBlock_0.frq, _0_nrm.cfe, _5.fdx, _2_Lucene40WithOrds_0.tib, _0.fdx, _8_Lucene40WithOrds_0.prx, _3_MockVariableIntBlock_0.skp, _0.fdt, segments_4, _3_MockFixedIntBlock_0.tii]
[junit4:junit4]   2> 3878 T1903 C151 oasu.DirectUpdateHandler2.commit start commit{flags=0,_version_=0,optimize=false,openSearcher=true,waitSearcher=true,expungeDeletes=false,softCommit=false}
[junit4:junit4]   2> 3879 T1830 C152 oasc.SolrDeletionPolicy.onCommit SolrDeletionPolicy.onCommit: commits:num=2
[junit4:junit4]   2> 		commit{dir=MockDirWrapper(org.apache.lucene.store.RAMDirectory@7167a89c lockFactory=org.apache.lucene.store.NativeFSLockFactory@1bd576),segFN=segments_3,generation=3,filenames=[_1_NestedPulsing_0.tip, _5_nrm.cfe, _5_NestedPulsing_0.tip, _8_MockFixedIntBlock_0.tii, _6_MockFixedIntBlock_0.pyl, _5_NestedPulsing_0.tim, _8_MockFixedIntBlock_0.pyl, _3_MockVariableIntBlock_0.frq, _8_MockFixedIntBlock_0.tib, _3.fdt, _5_Lucene40WithOrds_0.tib, _4_MockVariableIntBlock_0.tii, _7.fnm, _6_MockFixedIntBlock_0.skp, _7_NestedPulsing_0.frq, _0_Lucene40WithOrds_0.frq, _5_Lucene40WithOrds_0.tii, _1_Lucene40WithOrds_0.tib, _1_NestedPulsing_0.tim, _1_Lucene40WithOrds_0.tii, _7_MockFixedIntBlock_0.pos, _7_MockFixedIntBlock_0.skp, _6_MockVariableIntBlock_0.tii, _1_Lucene40WithOrds_0.frq, _6_MockVariableIntBlock_0.tib, _4_MockFixedIntBlock_0.pos, _1_MockVariableIntBlock_0.tii, _3_NestedPulsing_0.tim, _1_MockVariableIntBlock_0.tib, _1.fdx, _4_MockVariableIntBlock_0.tib, _1.fdt, _3_NestedPulsing_0.tip, _5_nrm.cfs, _7_NestedPulsing_0.tim, _0_MockVariableIntBlock_0.frq, _4_MockFixedIntBlock_0.frq, _1_MockFixedIntBlock_0.pos, _8_MockVariableIntBlock_0.skp, _6.fdt, _7_NestedPulsing_0.tip, _5_Lucene40WithOrds_0.prx, _2.si, _1_MockVariableIntBlock_0.skp, _7_MockVariableIntBlock_0.pos, _3_MockFixedIntBlock_0.frq, _0_MockVariableIntBlock_0.doc, _6.fdx, _1_Lucene40WithOrds_0.prx, _1_MockVariableIntBlock_0.pyl, _6_MockFixedIntBlock_0.tib, _6_MockFixedIntBlock_0.tii, _3_MockVariableIntBlock_0.tii, _2_nrm.cfe, _8_MockFixedIntBlock_0.frq, _0_MockVariableIntBlock_0.pos, _7_MockVariableIntBlock_0.skp, _2_nrm.cfs, _6_MockFixedIntBlock_0.doc, _5_MockFixedIntBlock_0.frq, _5_MockFixedIntBlock_0.tib, _2_NestedPulsing_0.prx, _4_MockVariableIntBlock_0.frq, _0_NestedPulsing_0.frq, _7_MockFixedIntBlock_0.doc, _0_NestedPulsing_0.prx, _2.fnm, _5_MockVariableIntBlock_0.frq, _3.fdx, _8_MockVariableIntBlock_0.pos, _1.si, _6_NestedPulsing_0.tip, _0_Lucene40WithOrds_0.prx, _8_NestedPulsing_0.tip, _6_NestedPulsing_0.tim, _5_MockFixedIntBlock_0.tii, _8_NestedPulsing_0.tim, _3_MockVariableIntBlock_0.pos, _3_nrm.cfe, _8_MockVariableIntBlock_0.frq, _8_nrm.cfe, _3_MockFixedIntBlock_0.skp, _4_MockFixedIntBlock_0.tib, _5_MockVariableIntBlock_0.pyl, _3_Lucene40WithOrds_0.tii, _1_MockFixedIntBlock_0.pyl, _6_Lucene40WithOrds_0.prx, _4_nrm.cfe, _8_Lucene40WithOrds_0.tib, _3_Lucene40WithOrds_0.tib, _4.fdx, _8_Lucene40WithOrds_0.frq, _8_Lucene40WithOrds_0.tii, _7_MockVariableIntBlock_0.tii, _2_MockFixedIntBlock_0.frq, _4_MockFixedIntBlock_0.tii, _6_MockVariableIntBlock_0.frq, _3_MockVariableIntBlock_0.doc, _7_Lucene40WithOrds_0.tib, _5.si, _8_nrm.cfs, _3_nrm.cfs, _7_Lucene40WithOrds_0.tii, _6_MockFixedIntBlock_0.pos, _5_MockFixedIntBlock_0.skp, _4_MockVariableIntBlock_0.pyl, _1_MockFixedIntBlock_0.skp, _4_Lucene40WithOrds_0.prx, _4_MockFixedIntBlock_0.doc, _4_nrm.cfs, _3_MockVariableIntBlock_0.tib, _5_MockVariableIntBlock_0.doc, _1_NestedPulsing_0.prx, _6_MockVariableIntBlock_0.pyl, _1_MockFixedIntBlock_0.doc, _8_MockVariableIntBlock_0.tib, _8_MockFixedIntBlock_0.skp, _3_MockFixedIntBlock_0.doc, _2_MockVariableIntBlock_0.frq, _7_MockFixedIntBlock_0.tib, _6_nrm.cfs, _2_Lucene40WithOrds_0.prx, _7_nrm.cfs, _7_MockFixedIntBlock_0.tii, _8_MockVariableIntBlock_0.doc, _4_MockFixedIntBlock_0.pyl, _1_MockFixedIntBlock_0.tii, _1_nrm.cfs, _5.fnm, _7_NestedPulsing_0.prx, _7_nrm.cfe, _6_nrm.cfe, _5_MockFixedIntBlock_0.pos, _5_MockFixedIntBlock_0.doc, _7_MockFixedIntBlock_0.pyl, _3_Lucene40WithOrds_0.frq, _4.fdt, _4.si, _1_nrm.cfe, _5_NestedPulsing_0.prx, _1_MockFixedIntBlock_0.tib, _8.fdx, _8_MockFixedIntBlock_0.pos, _8_MockVariableIntBlock_0.tii, _8.fdt, _2_NestedPulsing_0.tim, _6_MockFixedIntBlock_0.frq, _7.si, _3_NestedPulsing_0.prx, _0_MockFixedIntBlock_0.tib, _8.si, _0_Lucene40WithOrds_0.tii, _6_NestedPulsing_0.prx, _8_MockVariableIntBlock_0.pyl, _0_MockFixedIntBlock_0.tii, _7_Lucene40WithOrds_0.frq, _5_MockVariableIntBlock_0.tii, _8_NestedPulsing_0.prx, _0_Lucene40WithOrds_0.tib, _2_NestedPulsing_0.tip, _4_MockVariableIntBlock_0.doc, _2.fdt, _7.fdx, _7_MockVariableIntBlock_0.frq, _2.fdx, _8_NestedPulsing_0.frq, _7.fdt, _2_MockFixedIntBlock_0.doc, _3.si, _4_NestedPulsing_0.frq, _2_MockVariableIntBlock_0.skp, _6_NestedPulsing_0.frq, _4_Lucene40WithOrds_0.tib, _2_MockVariableIntBlock_0.pyl, _4_Lucene40WithOrds_0.tii, _2_MockFixedIntBlock_0.skp, _3.fnm, _0_NestedPulsing_0.tip, _2_MockVariableIntBlock_0.doc, _0_NestedPulsing_0.tim, _0_MockVariableIntBlock_0.pyl, _0_MockFixedIntBlock_0.pyl, _1_MockVariableIntBlock_0.doc, _4_NestedPulsing_0.tip, _4_NestedPulsing_0.tim, _7_MockVariableIntBlock_0.pyl, _2_MockVariableIntBlock_0.tii, _2_Lucene40WithOrds_0.frq, _5_MockVariableIntBlock_0.tib, _2_MockVariableIntBlock_0.tib, _1_MockVariableIntBlock_0.pos, _3_MockFixedIntBlock_0.pos, _1_NestedPulsing_0.frq, _5_NestedPulsing_0.frq, _0_MockFixedIntBlock_0.doc, _2_NestedPulsing_0.frq, _3_MockVariableIntBlock_0.pyl, _6.si, _6.fnm, _7_MockVariableIntBlock_0.tib, _3_Lucene40WithOrds_0.prx, _5.fdt, _4.fnm, _0_MockVariableIntBlock_0.skp, _7_MockVariableIntBlock_0.doc, _2_MockFixedIntBlock_0.tii, _1.fnm, _3_MockFixedIntBlock_0.pyl, _2_MockFixedIntBlock_0.tib, _2_MockFixedIntBlock_0.pyl, _4_NestedPulsing_0.prx, _6_MockVariableIntBlock_0.doc, _2_MockVariableIntBlock_0.pos, _6_Lucene40WithOrds_0.frq, _0.fnm, _5_MockVariableIntBlock_0.pos, _1_MockFixedIntBlock_0.frq, _5_MockFixedIntBlock_0.pyl, _4_MockFixedIntBlock_0.skp, _0_MockFixedIntBlock_0.pos, _6_Lucene40WithOrds_0.tii, _5_Lucene40WithOrds_0.frq, _3_NestedPulsing_0.frq, _8.fnm, _2_MockFixedIntBlock_0.pos, _6_Lucene40WithOrds_0.tib, _8_MockFixedIntBlock_0.doc, _7_MockFixedIntBlock_0.frq, _4_Lucene40WithOrds_0.frq, _0_MockFixedIntBlock_0.skp, _4_MockVariableIntBlock_0.skp, _0_MockVariableIntBlock_0.tib, _5_MockVariableIntBlock_0.skp, _6_MockVariableIntBlock_0.pos, _4_MockVariableIntBlock_0.pos, _7_Lucene40WithOrds_0.prx, _0.si, _0_MockVariableIntBlock_0.tii, _3_MockFixedIntBlock_0.tib, _0_nrm.cfs, _6_MockVariableIntBlock_0.skp, _0_MockFixedIntBlock_0.frq, _2_Lucene40WithOrds_0.tii, _1_MockVariableIntBlock_0.frq, _0_nrm.cfe, _5.fdx, _2_Lucene40WithOrds_0.tib, _0.fdx, _8_Lucene40WithOrds_0.prx, _3_MockVariableIntBlock_0.skp, _0.fdt, segments_3, _3_MockFixedIntBlock_0.tii]
[junit4:junit4]   2> 		commit{dir=MockDirWrapper(org.apache.lucene.store.RAMDirectory@7167a89c lockFactory=org.apache.lucene.store.NativeFSLockFactory@1bd576),segFN=segments_4,generation=4,filenames=[_1_NestedPulsing_0.tip, _5_nrm.cfe, _5_NestedPulsing_0.tip, _8_MockFixedIntBlock_0.tii, _6_MockFixedIntBlock_0.pyl, _5_NestedPulsing_0.tim, _8_MockFixedIntBlock_0.pyl, _3_MockVariableIntBlock_0.frq, _8_MockFixedIntBlock_0.tib, _3.fdt, _5_Lucene40WithOrds_0.tib, _4_MockVariableIntBlock_0.tii, _7.fnm, _6_MockFixedIntBlock_0.skp, _7_NestedPulsing_0.frq, _0_Lucene40WithOrds_0.frq, _5_Lucene40WithOrds_0.tii, _1_Lucene40WithOrds_0.tib, _1_NestedPulsing_0.tim, _1_Lucene40WithOrds_0.tii, _7_MockFixedIntBlock_0.pos, _7_MockFixedIntBlock_0.skp, _6_MockVariableIntBlock_0.tii, _1_Lucene40WithOrds_0.frq, _6_MockVariableIntBlock_0.tib, _4_MockFixedIntBlock_0.pos, _1_MockVariableIntBlock_0.tii, _9.fdt, _3_NestedPulsing_0.tim, _9.fdx, _1_MockVariableIntBlock_0.tib, _1.fdx, _b_NestedPulsing_0.tip, _4_MockVariableIntBlock_0.tib, _1.fdt, _3_NestedPulsing_0.tip, _5_nrm.cfs, _7_NestedPulsing_0.tim, _0_MockVariableIntBlock_0.frq, _4_MockFixedIntBlock_0.frq, _1_MockFixedIntBlock_0.pos, _8_MockVariableIntBlock_0.skp, _6.fdt, _7_NestedPulsing_0.tip, _5_Lucene40WithOrds_0.prx, _2.si, _1_MockVariableIntBlock_0.skp, _7_MockVariableIntBlock_0.pos, _3_MockFixedIntBlock_0.frq, _b_Lucene40WithOrds_0.prx, _0_MockVariableIntBlock_0.doc, _6.fdx, _1_Lucene40WithOrds_0.prx, _1_MockVariableIntBlock_0.pyl, _b_NestedPulsing_0.tim, _6_MockFixedIntBlock_0.tib, _6_MockFixedIntBlock_0.tii, _3_MockVariableIntBlock_0.tii, _2_nrm.cfe, _b_NestedPulsing_0.frq, _8_MockFixedIntBlock_0.frq, _0_MockVariableIntBlock_0.pos, _b_MockVariableIntBlock_0.skp, _7_MockVariableIntBlock_0.skp, _2_nrm.cfs, _9_MockVariableIntBlock_0.frq, _6_MockFixedIntBlock_0.doc, _5_MockFixedIntBlock_0.frq, _5_MockFixedIntBlock_0.tib, _2_NestedPulsing_0.prx, _4_MockVariableIntBlock_0.frq, _0_NestedPulsing_0.frq, _7_MockFixedIntBlock_0.doc, _0_NestedPulsing_0.prx, _2.fnm, _5_MockVariableIntBlock_0.frq, _b_MockVariableIntBlock_0.pos, _3.fdx, _8_MockVariableIntBlock_0.pos, _1.si, _6_NestedPulsing_0.tip, _0_Lucene40WithOrds_0.prx, _8_NestedPulsing_0.tip, _6_NestedPulsing_0.tim, _5_MockFixedIntBlock_0.tii, _8_NestedPulsing_0.tim, _3_MockVariableIntBlock_0.pos, _9_MockVariableIntBlock_0.pyl, _3_nrm.cfe, _8_MockVariableIntBlock_0.frq, _9_MockFixedIntBlock_0.skp, _8_nrm.cfe, _3_MockFixedIntBlock_0.skp, _4_MockFixedIntBlock_0.tib, _5_MockVariableIntBlock_0.pyl, _3_Lucene40WithOrds_0.tii, _1_MockFixedIntBlock_0.pyl, _6_Lucene40WithOrds_0.prx, _4_nrm.cfe, _8_Lucene40WithOrds_0.tib, _3_Lucene40WithOrds_0.tib, _4.fdx, _8_Lucene40WithOrds_0.frq, _8_Lucene40WithOrds_0.tii, _7_MockVariableIntBlock_0.tii, _2_MockFixedIntBlock_0.frq, _4_MockFixedIntBlock_0.tii, _9.si, _6_MockVariableIntBlock_0.frq, _3_MockVariableIntBlock_0.doc, _7_Lucene40WithOrds_0.tib, _5.si, _8_nrm.cfs, _3_nrm.cfs, _7_Lucene40WithOrds_0.tii, _6_MockFixedIntBlock_0.pos, _5_MockFixedIntBlock_0.skp, _4_MockVariableIntBlock_0.pyl, _1_MockFixedIntBlock_0.skp, _4_Lucene40WithOrds_0.prx, _4_MockFixedIntBlock_0.doc, _4_nrm.cfs, _3_MockVariableIntBlock_0.tib, _5_MockVariableIntBlock_0.doc, _b_MockFixedIntBlock_0.pos, _1_NestedPulsing_0.prx, _6_MockVariableIntBlock_0.pyl, _1_MockFixedIntBlock_0.doc, _8_MockVariableIntBlock_0.tib, _8_MockFixedIntBlock_0.skp, _3_MockFixedIntBlock_0.doc, _2_MockVariableIntBlock_0.frq, _7_MockFixedIntBlock_0.tib, _6_nrm.cfs, _2_Lucene40WithOrds_0.prx, _9_Lucene40WithOrds_0.frq, _7_nrm.cfs, _7_MockFixedIntBlock_0.tii, _8_MockVariableIntBlock_0.doc, _4_MockFixedIntBlock_0.pyl, _1_MockFixedIntBlock_0.tii, _1_nrm.cfs, _5.fnm, _7_NestedPulsing_0.prx, _7_nrm.cfe, _6_nrm.cfe, _5_MockFixedIntBlock_0.pos, _9_MockVariableIntBlock_0.skp, _5_MockFixedIntBlock_0.doc, _7_MockFixedIntBlock_0.pyl, _3_Lucene40WithOrds_0.frq, _4.fdt, _4.si, _b_MockFixedIntBlock_0.frq, _1_nrm.cfe, _9_NestedPulsing_0.prx, _5_NestedPulsing_0.prx, _9_MockVariableIntBlock_0.doc, _b.fnm, _1_MockFixedIntBlock_0.tib, _b.fdt, _8.fdx, _8_MockFixedIntBlock_0.pos, _b.fdx, _8_MockVariableIntBlock_0.tii, _8.fdt, _2_NestedPulsing_0.tim, _6_MockFixedIntBlock_0.frq, _9_NestedPulsing_0.frq, _7.si, _3_NestedPulsing_0.prx, _0_MockFixedIntBlock_0.tib, _8.si, _0_Lucene40WithOrds_0.tii, _6_NestedPulsing_0.prx, _9_MockFixedIntBlock_0.frq, _8_MockVariableIntBlock_0.pyl, _0_MockFixedIntBlock_0.tii, _7_Lucene40WithOrds_0.frq, _5_MockVariableIntBlock_0.tii, _8_NestedPulsing_0.prx, _0_Lucene40WithOrds_0.tib, _2_NestedPulsing_0.tip, _9_MockVariableIntBlock_0.tib, _b_Lucene40WithOrds_0.tib, _4_MockVariableIntBlock_0.doc, _2.fdt, _7.fdx, _7_MockVariableIntBlock_0.frq, _b_Lucene40WithOrds_0.tii, _2.fdx, _8_NestedPulsing_0.frq, _7.fdt, _9_MockFixedIntBlock_0.pos, _b_MockVariableIntBlock_0.tii, _b_MockVariableIntBlock_0.tib, _2_MockFixedIntBlock_0.doc, _3.si, _4_NestedPulsing_0.frq, _2_MockVariableIntBlock_0.skp, _6_NestedPulsing_0.frq, _4_Lucene40WithOrds_0.tib, _2_MockVariableIntBlock_0.pyl, _4_Lucene40WithOrds_0.tii, _2_MockFixedIntBlock_0.skp, _3.fnm, _0_NestedPulsing_0.tip, _2_MockVariableIntBlock_0.doc, _0_NestedPulsing_0.tim, _0_MockVariableIntBlock_0.pyl, _b.si, _0_MockFixedIntBlock_0.pyl, _1_MockVariableIntBlock_0.doc, _4_NestedPulsing_0.tip, _b_MockVariableIntBlock_0.pyl, _b_MockFixedIntBlock_0.tii, _4_NestedPulsing_0.tim, _9_MockVariableIntBlock_0.tii, _7_MockVariableIntBlock_0.pyl, _2_MockVariableIntBlock_0.tii, _2_Lucene40WithOrds_0.frq, _5_MockVariableIntBlock_0.tib, _b_MockFixedIntBlock_0.tib, _2_MockVariableIntBlock_0.tib, _9.fnm, _1_M

[...truncated too long message...]

] FAILURE  137s J0 | SyncSliceTest.testDistribSearch <<<
[junit4:junit4]    > Throwable #1: java.lang.AssertionError: There are still nodes recoverying
[junit4:junit4]    > 	at __randomizedtesting.SeedInfo.seed([1380C11BD2E349BE:92664F03A5BC2982]:0)
[junit4:junit4]    > 	at org.junit.Assert.fail(Assert.java:93)
[junit4:junit4]    > 	at org.apache.solr.cloud.AbstractDistribZkTestBase.waitForRecoveriesToFinish(AbstractDistribZkTestBase.java:153)
[junit4:junit4]    > 	at org.apache.solr.cloud.AbstractFullDistribZkTestBase.waitForRecoveriesToFinish(AbstractFullDistribZkTestBase.java:555)
[junit4:junit4]    > 	at org.apache.solr.cloud.AbstractFullDistribZkTestBase.waitForThingsToLevelOut(AbstractFullDistribZkTestBase.java:1130)
[junit4:junit4]    > 	at org.apache.solr.cloud.SyncSliceTest.doTest(SyncSliceTest.java:162)
[junit4:junit4]    > 	at org.apache.solr.BaseDistributedSearchTestCase.testDistribSearch(BaseDistributedSearchTestCase.java:691)
[junit4:junit4]    > 	at sun.reflect.NativeMethodAccessorImpl.invoke0(Native Method)
[junit4:junit4]    > 	at sun.reflect.NativeMethodAccessorImpl.invoke(NativeMethodAccessorImpl.java:57)
[junit4:junit4]    > 	at sun.reflect.DelegatingMethodAccessorImpl.invoke(DelegatingMethodAccessorImpl.java:43)
[junit4:junit4]    > 	at java.lang.reflect.Method.invoke(Method.java:601)
[junit4:junit4]    > 	at com.carrotsearch.randomizedtesting.RandomizedRunner.invoke(RandomizedRunner.java:1559)
[junit4:junit4]    > 	at com.carrotsearch.randomizedtesting.RandomizedRunner.access$600(RandomizedRunner.java:79)
[junit4:junit4]    > 	at com.carrotsearch.randomizedtesting.RandomizedRunner$6.evaluate(RandomizedRunner.java:737)
[junit4:junit4]    > 	at com.carrotsearch.randomizedtesting.RandomizedRunner$7.evaluate(RandomizedRunner.java:773)
[junit4:junit4]    > 	at com.carrotsearch.randomizedtesting.RandomizedRunner$8.evaluate(RandomizedRunner.java:787)
[junit4:junit4]    > 	at com.carrotsearch.randomizedtesting.rules.SystemPropertiesRestoreRule$1.evaluate(SystemPropertiesRestoreRule.java:53)
[junit4:junit4]    > 	at org.apache.lucene.util.TestRuleSetupTeardownChained$1.evaluate(TestRuleSetupTeardownChained.java:50)
[junit4:junit4]    > 	at org.apache.lucene.util.TestRuleFieldCacheSanity$1.evaluate(TestRuleFieldCacheSanity.java:51)
[junit4:junit4]    > 	at org.apache.lucene.util.AbstractBeforeAfterRule$1.evaluate(AbstractBeforeAfterRule.java:45)
[junit4:junit4]    > 	at com.carrotsearch.randomizedtesting.rules.SystemPropertiesInvariantRule$1.evaluate(SystemPropertiesInvariantRule.java:55)
[junit4:junit4]    > 	at org.apache.lucene.util.TestRuleThreadAndTestName$1.evaluate(TestRuleThreadAndTestName.java:48)
[junit4:junit4]    > 	at org.apache.lucene.util.TestRuleIgnoreAfterMaxFailures$1.evaluate(TestRuleIgnoreAfterMaxFailures.java:70)
[junit4:junit4]    > 	at org.apache.lucene.util.TestRuleMarkFailure$1.evaluate(TestRuleMarkFailure.java:48)
[junit4:junit4]    > 	at com.carrotsearch.randomizedtesting.rules.StatementAdapter.evaluate(StatementAdapter.java:36)
[junit4:junit4]    > 	at com.carrotsearch.randomizedtesting.ThreadLeakControl$StatementRunner.run(ThreadLeakControl.java:358)
[junit4:junit4]    > 	at com.carrotsearch.randomizedtesting.ThreadLeakControl.forkTimeoutingTask(ThreadLeakControl.java:782)
[junit4:junit4]    > 	at com.carrotsearch.randomizedtesting.ThreadLeakControl$3.evaluate(ThreadLeakControl.java:442)
[junit4:junit4]    > 	at com.carrotsearch.randomizedtesting.RandomizedRunner.runSingleTest(RandomizedRunner.java:746)
[junit4:junit4]    > 	at com.carrotsearch.randomizedtesting.RandomizedRunner$3.evaluate(RandomizedRunner.java:648)
[junit4:junit4]    > 	at com.carrotsearch.randomizedtesting.RandomizedRunner$4.evaluate(RandomizedRunner.java:682)
[junit4:junit4]    > 	at com.carrotsearch.randomizedtesting.RandomizedRunner$5.evaluate(RandomizedRunner.java:693)
[junit4:junit4]    > 	at com.carrotsearch.randomizedtesting.rules.StatementAdapter.evaluate(StatementAdapter.java:36)
[junit4:junit4]    > 	at com.carrotsearch.randomizedtesting.rules.SystemPropertiesRestoreRule$1.evaluate(SystemPropertiesRestoreRule.java:53)
[junit4:junit4]    > 	at org.apache.lucene.util.AbstractBeforeAfterRule$1.evaluate(AbstractBeforeAfterRule.java:45)
[junit4:junit4]    > 	at org.apache.lucene.util.TestRuleStoreClassName$1.evaluate(TestRuleStoreClassName.java:42)
[junit4:junit4]    > 	at com.carrotsearch.randomizedtesting.rules.SystemPropertiesInvariantRule$1.evaluate(SystemPropertiesInvariantRule.java:55)
[junit4:junit4]    > 	at com.carrotsearch.randomizedtesting.rules.NoShadowingOrOverridesOnMethodsRule$1.evaluate(NoShadowingOrOverridesOnMethodsRule.java:39)
[junit4:junit4]    > 	at com.carrotsearch.randomizedtesting.rules.NoShadowingOrOverridesOnMethodsRule$1.evaluate(NoShadowingOrOverridesOnMethodsRule.java:39)
[junit4:junit4]    > 	at com.carrotsearch.randomizedtesting.rules.StatementAdapter.evaluate(StatementAdapter.java:36)
[junit4:junit4]    > 	at org.apache.lucene.util.TestRuleAssertionsRequired$1.evaluate(TestRuleAssertionsRequired.java:43)
[junit4:junit4]    > 	at org.apache.lucene.util.TestRuleMarkFailure$1.evaluate(TestRuleMarkFailure.java:48)
[junit4:junit4]    > 	at org.apache.lucene.util.TestRuleIgnoreAfterMaxFailures$1.evaluate(TestRuleIgnoreAfterMaxFailures.java:70)
[junit4:junit4]    > 	at org.apache.lucene.util.TestRuleIgnoreTestSuites$1.evaluate(TestRuleIgnoreTestSuites.java:55)
[junit4:junit4]    > 	at com.carrotsearch.randomizedtesting.rules.StatementAdapter.evaluate(StatementAdapter.java:36)
[junit4:junit4]    > 	at com.carrotsearch.randomizedtesting.ThreadLeakControl$StatementRunner.run(ThreadLeakControl.java:358)
[junit4:junit4]    > 	at java.lang.Thread.run(Thread.java:722)
[junit4:junit4]   2> 137094 T1769 oas.SolrTestCaseJ4.deleteCore ###deleteCore
[junit4:junit4]   2> NOTE: test params are: codec=Lucene40: {range_facet_l=Lucene40(minBlockSize=47 maxBlockSize=186), text=MockVariableIntBlock(baseBlockSize=65), _version_=PostingsFormat(name=Lucene40WithOrds), rnd_b=PostingsFormat(name=NestedPulsing), intDefault=PostingsFormat(name=Lucene40WithOrds), timestamp=Lucene40(minBlockSize=47 maxBlockSize=186), id=PostingsFormat(name=NestedPulsing), a_t=Lucene40(minBlockSize=47 maxBlockSize=186), range_facet_sl=PostingsFormat(name=NestedPulsing), range_facet_si=Lucene40(minBlockSize=47 maxBlockSize=186), other_tl1=PostingsFormat(name=Lucene40WithOrds), multiDefault=Lucene40(minBlockSize=47 maxBlockSize=186), a_si=PostingsFormat(name=Lucene40WithOrds)}, sim=RandomSimilarityProvider(queryNorm=true,coord=crazy): {}, locale=el, timezone=Asia/Hong_Kong
[junit4:junit4]   2> NOTE: FreeBSD 9.0-RELEASE amd64/Oracle Corporation 1.7.0_06 (64-bit)/cpus=16,threads=1,free=168018864,total=364904448
[junit4:junit4]   2> NOTE: All tests run in this JVM: [SpellCheckCollatorTest, TestIndexSearcher, TestIBSimilarityFactory, CSVRequestHandlerTest, TestSystemIdResolver, BadComponentTest, CacheHeaderTest, DateMathParserTest, TestFastLRUCache, SampleTest, TestGroupingSearch, JsonLoaderTest, RequestHandlersTest, TermsComponentTest, TestExtendedDismaxParser, ZkControllerTest, MinimalSchemaTest, TestIndexingPerformance, DistanceFunctionTest, ZkCLITest, TestCollationField, TestFiltering, FastVectorHighlighterTest, CircularListTest, TestSearchPerf, CurrencyFieldTest, DateFieldTest, IndexBasedSpellCheckerTest, SolrPluginUtilsTest, SimplePostToolTest, PluginInfoTest, MBeansHandlerTest, NotRequiredUniqueKeyTest, SpellCheckComponentTest, QueryElevationComponentTest, TestSuggestSpellingConverter, DistributedTermsComponentTest, UniqFieldsUpdateProcessorFactoryTest, TestBadConfig, TestLMDirichletSimilarityFactory, TestFaceting, TestPseudoReturnFields, AlternateDirectoryTest, FieldAnalysisRequestHandlerTest, TestStressReorder, TestCoreContainer, ResourceLoaderTest, PreAnalyzedFieldTest, JSONWriterTest, DirectSolrConnectionTest, TestRandomFaceting, TestSolrQueryParser, AutoCommitTest, BasicDistributedZkTest, TestReplicationHandler, LeaderElectionIntegrationTest, DistributedSpellCheckComponentTest, WordBreakSolrSpellCheckerTest, TestJoin, CoreAdminHandlerTest, TestFunctionQuery, SolrRequestParserTest, TestCSVLoader, SpatialFilterTest, DisMaxRequestHandlerTest, SolrInfoMBeanTest, TestPHPSerializedResponseWriter, PingRequestHandlerTest, SuggesterWFSTTest, DirectUpdateHandlerOptimizeTest, TestValueSourceCache, RequiredFieldsTest, CopyFieldTest, TestQueryUtils, SuggesterTSTTest, UpdateParamsTest, ShowFileRequestHandlerTest, BadIndexSchemaTest, SolrCoreCheckLockOnStartupTest, TestWriterPerf, FieldMutatingUpdateProcessorTest, SOLR749Test, DefaultValueUpdateProcessorTest, TestXIncludeConfig, NumericFieldsTest, TestJmxMonitoredMap, SpellPossibilityIteratorTest, TestBM25SimilarityFactory, TestPluginEnable, TestCodecSupport, OpenExchangeRatesOrgProviderTest, UUIDFieldTest, SystemInfoHandlerTest, AnalysisAfterCoreReloadTest, ClusterStateTest, ClusterStateUpdateTest, SyncSliceTest]
[junit4:junit4] Completed on J0 in 137.12s, 1 test, 1 failure <<< FAILURES!

[...truncated 5 lines...]
BUILD FAILED
/usr/home/hudson/hudson-slave/workspace/Lucene-Solr-Tests-trunk-java7/build.xml:29: The following error occurred while executing this line:
/usr/home/hudson/hudson-slave/workspace/Lucene-Solr-Tests-trunk-java7/solr/build.xml:146: The following error occurred while executing this line:
/usr/home/hudson/hudson-slave/workspace/Lucene-Solr-Tests-trunk-java7/lucene/module-build.xml:63: The following error occurred while executing this line:
/usr/home/hudson/hudson-slave/workspace/Lucene-Solr-Tests-trunk-java7/lucene/common-build.xml:1133: The following error occurred while executing this line:
/usr/home/hudson/hudson-slave/workspace/Lucene-Solr-Tests-trunk-java7/lucene/common-build.xml:810: There were test failures: 228 suites, 923 tests, 1 error, 1 failure, 6 ignored (1 assumption)

Total time: 29 minutes 10 seconds
Build step 'Invoke Ant' marked build as failure
Recording test results
Email was triggered for: Failure
Sending email for trigger: Failure



Mime
View raw message