lucene-dev mailing list archives

Site index · List index
Message view « Date » · « Thread »
Top « Date » · « Thread »
From Apache Jenkins Server <jenk...@builds.apache.org>
Subject [JENKINS-MAVEN] Lucene-Solr-Maven-trunk #598: POMs out of sync
Date Mon, 03 Sep 2012 04:26:21 GMT
Build: https://builds.apache.org/job/Lucene-Solr-Maven-trunk/598/

No tests ran.

Build Log:
[...truncated 3549 lines...]
92 T3 oasc.SolrCore.finalize SEVERE REFCOUNT ERROR: unreferenced org.apache.solr.core.SolrCore@57b0fd63 (col_bad) has a reference count of 1
Tests run: 1, Failures: 0, Errors: 0, Skipped: 0, Time elapsed: 0.573 sec
Running org.apache.solr.response.TestPHPSerializedResponseWriter
Creating dataDir: /usr/home/hudson/hudson-slave/workspace/Lucene-Solr-Maven-trunk/maven-build/solr/core/target/test/./solrtest-TestPHPSerializedResponseWriter-1346644527815
Tests run: 2, Failures: 0, Errors: 0, Skipped: 0, Time elapsed: 0.538 sec
Running org.apache.solr.handler.JsonLoaderTest
Creating dataDir: /usr/home/hudson/hudson-slave/workspace/Lucene-Solr-Maven-trunk/maven-build/solr/core/target/test/./solrtest-JsonLoaderTest-1346644528357
Tests run: 6, Failures: 0, Errors: 0, Skipped: 0, Time elapsed: 0.572 sec
Running org.apache.solr.handler.BinaryUpdateRequestHandlerTest
Creating dataDir: /usr/home/hudson/hudson-slave/workspace/Lucene-Solr-Maven-trunk/maven-build/solr/core/target/test/./solrtest-BinaryUpdateRequestHandlerTest-1346644528929
null
Tests run: 1, Failures: 0, Errors: 0, Skipped: 0, Time elapsed: 0.887 sec
Running org.apache.solr.internal.csv.CSVUtilsTest
Tests run: 14, Failures: 0, Errors: 0, Skipped: 0, Time elapsed: 0.001 sec
Running org.apache.solr.cloud.TestHashPartitioner
Tests run: 1, Failures: 0, Errors: 0, Skipped: 0, Time elapsed: 0.478 sec
Running org.apache.solr.search.TestQueryUtils
Tests run: 1, Failures: 0, Errors: 0, Skipped: 0, Time elapsed: 0.719 sec
Running org.apache.solr.handler.TestReplicationHandler
replicate slave to master
25661 T512 oasc.SolrException.log SEVERE SnapPull failed :org.apache.solr.common.SolrException: Unable to download _8_nrm.cfe completely. Downloaded 0!=87
		at org.apache.solr.handler.SnapPuller$FileFetcher.cleanup(SnapPuller.java:1129)
		at org.apache.solr.handler.SnapPuller$FileFetcher.fetchFile(SnapPuller.java:1013)
		at org.apache.solr.handler.SnapPuller.downloadIndexFiles(SnapPuller.java:629)
		at org.apache.solr.handler.SnapPuller.fetchLatestIndex(SnapPuller.java:333)
		at org.apache.solr.handler.ReplicationHandler.doFetch(ReplicationHandler.java:297)
		at org.apache.solr.handler.ReplicationHandler$1.run(ReplicationHandler.java:178)
	
32967 T590 oash.SnapPuller.fetchLatestIndex SEVERE Master at: http://localhost:21455/solr is not available. Index fetch failed. Exception: org.apache.solr.client.solrj.SolrServerException: IOException occured when talking to server at: http://localhost:21455/solr
Tests run: 1, Failures: 0, Errors: 0, Skipped: 0, Time elapsed: 33.016 sec
Running org.apache.solr.spelling.WordBreakSolrSpellCheckerTest
Creating dataDir: /usr/home/hudson/hudson-slave/workspace/Lucene-Solr-Maven-trunk/maven-build/solr/core/target/test/./solrtest-WordBreakSolrSpellCheckerTest-1346644564044
Tests run: 3, Failures: 0, Errors: 0, Skipped: 0, Time elapsed: 1.603 sec
Running org.apache.solr.core.TestCodecSupport
Creating dataDir: /usr/home/hudson/hudson-slave/workspace/Lucene-Solr-Maven-trunk/maven-build/solr/core/target/test/./solrtest-TestCodecSupport-1346644565666
Tests run: 3, Failures: 0, Errors: 0, Skipped: 0, Time elapsed: 0.107 sec
Running org.apache.solr.update.processor.ScriptEngineTest
Tests run: 6, Failures: 0, Errors: 0, Skipped: 1, Time elapsed: 0.236 sec
Running org.apache.solr.search.similarities.TestLMDirichletSimilarityFactory
Creating dataDir: /usr/home/hudson/hudson-slave/workspace/Lucene-Solr-Maven-trunk/maven-build/solr/core/target/test/./solrtest-TestLMDirichletSimilarityFactory-1346644566010
Tests run: 2, Failures: 0, Errors: 0, Skipped: 0, Time elapsed: 0.112 sec
Running org.apache.solr.schema.RequiredFieldsTest
Creating dataDir: /usr/home/hudson/hudson-slave/workspace/Lucene-Solr-Maven-trunk/maven-build/solr/core/target/test/./solrtest-RequiredFieldsTest-1346644566130
Tests run: 3, Failures: 0, Errors: 0, Skipped: 0, Time elapsed: 0.5 sec
Running org.apache.solr.core.TestXIncludeConfig
Tests run: 1, Failures: 0, Errors: 0, Skipped: 0, Time elapsed: 0.407 sec
Running org.apache.solr.spelling.suggest.SuggesterTest
Creating dataDir: /usr/home/hudson/hudson-slave/workspace/Lucene-Solr-Maven-trunk/maven-build/solr/core/target/test/./solrtest-SuggesterTest-1346644567031
NOTE: per solr.test.leavedatadir, dataDir will not be removed: /usr/home/hudson/hudson-slave/workspace/Lucene-Solr-Maven-trunk/maven-build/solr/core/target/test/./solrtest-SuggesterTest-1346644567031
Tests run: 4, Failures: 0, Errors: 0, Skipped: 0, Time elapsed: 1.054 sec
Running org.apache.solr.update.processor.UniqFieldsUpdateProcessorFactoryTest
Creating dataDir: /usr/home/hudson/hudson-slave/workspace/Lucene-Solr-Maven-trunk/maven-build/solr/core/target/test/./solrtest-UniqFieldsUpdateProcessorFactoryTest-1346644568086
Tests run: 1, Failures: 0, Errors: 0, Skipped: 0, Time elapsed: 0.501 sec
Running org.apache.solr.search.similarities.TestPerFieldSimilarity
Creating dataDir: /usr/home/hudson/hudson-slave/workspace/Lucene-Solr-Maven-trunk/maven-build/solr/core/target/test/./solrtest-TestPerFieldSimilarity-1346644568606
Tests run: 7, Failures: 0, Errors: 0, Skipped: 0, Time elapsed: 0.12 sec
Running org.apache.solr.TestDistributedSearch
Tests run: 1, Failures: 0, Errors: 0, Skipped: 0, Time elapsed: 89.366 sec
Running org.apache.solr.handler.StandardRequestHandlerTest
Tests run: 1, Failures: 0, Errors: 0, Skipped: 0, Time elapsed: 0.537 sec
Running org.apache.solr.update.PeerSyncTest
Tests run: 1, Failures: 0, Errors: 0, Skipped: 0, Time elapsed: 2.168 sec
Running org.apache.solr.search.SpatialFilterTest
Creating dataDir: /usr/home/hudson/hudson-slave/workspace/Lucene-Solr-Maven-trunk/maven-build/solr/core/target/test/./solrtest-SpatialFilterTest-1346644660807
Tests run: 3, Failures: 0, Errors: 0, Skipped: 0, Time elapsed: 0.67 sec
Running org.apache.solr.request.JSONWriterTest
Creating dataDir: /usr/home/hudson/hudson-slave/workspace/Lucene-Solr-Maven-trunk/maven-build/solr/core/target/test/./solrtest-JSONWriterTest-1346644661478
Tests run: 3, Failures: 0, Errors: 0, Skipped: 0, Time elapsed: 0.433 sec
Running org.apache.solr.search.function.TestFunctionQuery
Creating dataDir: /usr/home/hudson/hudson-slave/workspace/Lucene-Solr-Maven-trunk/maven-build/solr/core/target/test/./solrtest-TestFunctionQuery-1346644661918
ASYNC  NEW_CORE C0 name=collection1 org.apache.solr.core.SolrCore@5ca14a5f
598 T824 C0 oassf.FileFloatSource.getFloats SEVERE Error loading external value source + fileName + java.lang.NumberFormatException: For input string: ""
Tests run: 14, Failures: 0, Errors: 0, Skipped: 0, Time elapsed: 1.62 sec
Running org.apache.solr.TestGroupingSearch
Creating dataDir: /usr/home/hudson/hudson-slave/workspace/Lucene-Solr-Maven-trunk/maven-build/solr/core/target/test/./solrtest-TestGroupingSearch-1346644663546
Tests run: 12, Failures: 0, Errors: 0, Skipped: 0, Time elapsed: 2.862 sec
Running org.apache.solr.util.DOMUtilTest
Tests run: 1, Failures: 0, Errors: 0, Skipped: 0, Time elapsed: 0.019 sec
Running org.apache.solr.handler.component.DistributedTermsComponentTest
Tests run: 1, Failures: 0, Errors: 0, Skipped: 0, Time elapsed: 4.787 sec
Running org.apache.solr.update.DocumentBuilderTest
Creating dataDir: /usr/home/hudson/hudson-slave/workspace/Lucene-Solr-Maven-trunk/maven-build/solr/core/target/test/./solrtest-DocumentBuilderTest-1346644671223
Tests run: 11, Failures: 0, Errors: 0, Skipped: 0, Time elapsed: 0.529 sec
Running org.apache.solr.search.TestSurroundQueryParser
Tests run: 1, Failures: 0, Errors: 0, Skipped: 0, Time elapsed: 0.581 sec
Running org.apache.solr.core.IndexReaderFactoryTest
Tests run: 1, Failures: 0, Errors: 0, Skipped: 0, Time elapsed: 0.304 sec
Running org.apache.solr.cloud.ChaosMonkeyNothingIsSafeTest
Tests run: 1, Failures: 0, Errors: 0, Skipped: 1, Time elapsed: 0.001 sec
Running org.apache.solr.update.DirectUpdateHandlerTest
Creating dataDir: /usr/home/hudson/hudson-slave/workspace/Lucene-Solr-Maven-trunk/maven-build/solr/core/target/test/./solrtest-DirectUpdateHandlerTest-1346644672672
Creating dataDir: /usr/home/hudson/hudson-slave/workspace/Lucene-Solr-Maven-trunk/maven-build/solr/core/target/test/./solrtest-DirectUpdateHandlerTest-1346644673362
Creating dataDir: /usr/home/hudson/hudson-slave/workspace/Lucene-Solr-Maven-trunk/maven-build/solr/core/target/test/./solrtest-DirectUpdateHandlerTest-1346644674065
Tests run: 6, Failures: 0, Errors: 0, Skipped: 0, Time elapsed: 1.956 sec
Running org.apache.solr.request.TestRemoteStreaming
Creating dataDir: /usr/home/hudson/hudson-slave/workspace/Lucene-Solr-Maven-trunk/maven-build/solr/core/target/test/./solrtest-TestRemoteStreaming-1346644674629
Tests run: 4, Failures: 0, Errors: 0, Skipped: 0, Time elapsed: 0.7 sec
Running org.apache.solr.handler.admin.CoreAdminHandlerTest
Creating dataDir: /usr/home/hudson/hudson-slave/workspace/Lucene-Solr-Maven-trunk/maven-build/solr/core/target/test/./solrtest-CoreAdminHandlerTest-1346644675332
Tests run: 1, Failures: 0, Errors: 0, Skipped: 0, Time elapsed: 1.101 sec
Running org.apache.solr.update.processor.SignatureUpdateProcessorFactoryTest
Creating dataDir: /usr/home/hudson/hudson-slave/workspace/Lucene-Solr-Maven-trunk/maven-build/solr/core/target/test/./solrtest-SignatureUpdateProcessorFactoryTest-1346644676438
Tests run: 6, Failures: 0, Errors: 0, Skipped: 0, Time elapsed: 1.26 sec
Running org.apache.solr.spelling.TestSuggestSpellingConverter
Tests run: 2, Failures: 0, Errors: 0, Skipped: 0, Time elapsed: 0.046 sec
Running org.apache.solr.spelling.SpellPossibilityIteratorTest
Tests run: 3, Failures: 0, Errors: 0, Skipped: 0, Time elapsed: 0.352 sec
Running org.apache.solr.handler.MoreLikeThisHandlerTest
Creating dataDir: /usr/home/hudson/hudson-slave/workspace/Lucene-Solr-Maven-trunk/maven-build/solr/core/target/test/./solrtest-MoreLikeThisHandlerTest-1346644678102
Tests run: 1, Failures: 0, Errors: 0, Skipped: 0, Time elapsed: 0.761 sec
Running org.apache.solr.core.TestQuerySenderNoQuery
Creating dataDir: /usr/home/hudson/hudson-slave/workspace/Lucene-Solr-Maven-trunk/maven-build/solr/core/target/test/./solrtest-TestQuerySenderNoQuery-1346644678868
Tests run: 3, Failures: 0, Errors: 0, Skipped: 0, Time elapsed: 0.417 sec
Running org.apache.solr.TestDocumentBuilder
doc1: SolrInputDocument[field1=value1, field2=value1, field3=value2, field4=15, field5=[45, 33, 20]]
clone: SolrInputDocument[field1=value1, field2=value1, field3=value2, field4=15, field5=[45, 33, 20]]
Tests run: 1, Failures: 0, Errors: 0, Skipped: 0, Time elapsed: 0.015 sec
Running org.apache.solr.core.TestSolrDeletionPolicy2
Creating dataDir: /usr/home/hudson/hudson-slave/workspace/Lucene-Solr-Maven-trunk/maven-build/solr/core/target/test/./solrtest-TestSolrDeletionPolicy2-1346644679298
Tests run: 1, Failures: 0, Errors: 0, Skipped: 0, Time elapsed: 0.45 sec
Running org.apache.solr.util.TestSystemIdResolver
Tests run: 1, Failures: 0, Errors: 0, Skipped: 0, Time elapsed: 0.026 sec
Running org.apache.solr.search.TestValueSourceCache
Creating dataDir: /usr/home/hudson/hudson-slave/workspace/Lucene-Solr-Maven-trunk/maven-build/solr/core/target/test/./solrtest-TestValueSourceCache-1346644679776
Tests run: 2, Failures: 0, Errors: 0, Skipped: 0, Time elapsed: 0.624 sec
Running org.apache.solr.search.function.distance.DistanceFunctionTest
Creating dataDir: /usr/home/hudson/hudson-slave/workspace/Lucene-Solr-Maven-trunk/maven-build/solr/core/target/test/./solrtest-DistanceFunctionTest-1346644680400
Tests run: 3, Failures: 0, Errors: 0, Skipped: 0, Time elapsed: 0.611 sec
Running org.apache.solr.update.processor.StatelessScriptUpdateProcessorFactoryTest
Creating dataDir: /usr/home/hudson/hudson-slave/workspace/Lucene-Solr-Maven-trunk/maven-build/solr/core/target/test/./solrtest-StatelessScriptUpdateProcessorFactoryTest-1346644681020
Tests run: 7, Failures: 0, Errors: 0, Skipped: 0, Time elapsed: 1.196 sec
Running org.apache.solr.schema.TestOmitPositions
Creating dataDir: /usr/home/hudson/hudson-slave/workspace/Lucene-Solr-Maven-trunk/maven-build/solr/core/target/test/./solrtest-TestOmitPositions-1346644682206
Tests run: 2, Failures: 0, Errors: 0, Skipped: 0, Time elapsed: 0.637 sec
Running org.apache.solr.internal.csv.CSVStrategyTest
Tests run: 5, Failures: 0, Errors: 0, Skipped: 0, Time elapsed: 0.001 sec
Running org.apache.solr.update.UpdateParamsTest
Tests run: 1, Failures: 0, Errors: 0, Skipped: 0, Time elapsed: 0.521 sec
Running org.apache.solr.handler.admin.MBeansHandlerTest
Creating dataDir: /usr/home/hudson/hudson-slave/workspace/Lucene-Solr-Maven-trunk/maven-build/solr/core/target/test/./solrtest-MBeansHandlerTest-1346644683380
Tests run: 1, Failures: 0, Errors: 0, Skipped: 0, Time elapsed: 0.512 sec
Running org.apache.solr.core.TestBadConfig
Creating dataDir: /usr/home/hudson/hudson-slave/workspace/Lucene-Solr-Maven-trunk/maven-build/solr/core/target/test/./solrtest-TestBadConfig-1346644683909
391 T1031 oasup.StatelessScriptUpdateProcessorFactory.inform SEVERE Unable to initialize scripts: Unable to evaluate script: a-file-name-that-does-not-exist.js Ignoring exception matching \Qa-file-name-that-does-not-exist.js\E
Creating dataDir: /usr/home/hudson/hudson-slave/workspace/Lucene-Solr-Maven-trunk/maven-build/solr/core/target/test/./solrtest-TestBadConfig-1346644684297
457 T3 oasc.CoreContainer.finalize SEVERE CoreContainer was not shutdown prior to finalize(), indicates a bug -- POSSIBLE RESOURCE LEAK!!!  instance=1741375860
Creating dataDir: /usr/home/hudson/hudson-slave/workspace/Lucene-Solr-Maven-trunk/maven-build/solr/core/target/test/./solrtest-TestBadConfig-1346644684671
1161 T1031 oasup.StatelessScriptUpdateProcessorFactory.inform SEVERE Unable to initialize scripts: No ScriptEngine found by name: giberish -- supported names: js, rhino, JavaScript, javascript, ECMAScript, ecmascript Ignoring exception matching \Qgiberish\E
Creating dataDir: /usr/home/hudson/hudson-slave/workspace/Lucene-Solr-Maven-trunk/maven-build/solr/core/target/test/./solrtest-TestBadConfig-1346644685066
Creating dataDir: /usr/home/hudson/hudson-slave/workspace/Lucene-Solr-Maven-trunk/maven-build/solr/core/target/test/./solrtest-TestBadConfig-1346644685087
1251 T3 oasc.CoreContainer.finalize SEVERE CoreContainer was not shutdown prior to finalize(), indicates a bug -- POSSIBLE RESOURCE LEAK!!!  instance=451450080
1561 T1031 oasup.StatelessScriptUpdateProcessorFactory.inform SEVERE Unable to initialize scripts: Unable to evaluate script: currency.xml Ignoring exception matching \Qcurrency.xml\E
Tests run: 5, Failures: 0, Errors: 0, Skipped: 0, Time elapsed: 1.591 sec
Running org.apache.solr.update.processor.URLClassifyProcessorTest
Tests run: 7, Failures: 0, Errors: 0, Skipped: 0, Time elapsed: 0.201 sec
Running org.apache.solr.schema.TestCollationField
201 T3 oasc.CoreContainer.finalize SEVERE CoreContainer was not shutdown prior to finalize(), indicates a bug -- POSSIBLE RESOURCE LEAK!!!  instance=2117266632
Creating dataDir: /usr/home/hudson/hudson-slave/workspace/Lucene-Solr-Maven-trunk/maven-build/solr/core/target/test/./solrtest-TestCollationField-1346644685736
Tests run: 8, Failures: 0, Errors: 0, Skipped: 0, Time elapsed: 0.374 sec
Running org.apache.solr.cloud.BasicDistributedZk2Test
Creating dataDir: /usr/home/hudson/hudson-slave/workspace/Lucene-Solr-Maven-trunk/maven-build/solr/core/target/test/./solrtest-BasicDistributedZk2Test-1346644686090
4979 T3 oasc.CoreContainer.finalize SEVERE CoreContainer was not shutdown prior to finalize(), indicates a bug -- POSSIBLE RESOURCE LEAK!!!  instance=912437122
51883 T1113 oasc.SolrException.log SEVERE Sync request error: org.apache.solr.client.solrj.SolrServerException: IOException occured when talking to server at: http://127.0.0.1:60109/solr/collection1
96898 T1113 oasc.SolrException.log SEVERE http://127.0.0.1:60113/solr/collection1/: Could not tell a replica to recover:org.apache.solr.client.solrj.SolrServerException: IOException occured when talking to server at: http://127.0.0.1:60109/solr
		at org.apache.solr.client.solrj.impl.HttpSolrServer.request(HttpSolrServer.java:414)
		at org.apache.solr.client.solrj.impl.HttpSolrServer.request(HttpSolrServer.java:182)
		at org.apache.solr.cloud.SyncStrategy.requestRecovery(SyncStrategy.java:282)
		at org.apache.solr.cloud.SyncStrategy.syncToMe(SyncStrategy.java:226)
		at org.apache.solr.cloud.SyncStrategy.syncReplicas(SyncStrategy.java:119)
		at org.apache.solr.cloud.SyncStrategy.sync(SyncStrategy.java:85)
		at org.apache.solr.cloud.ShardLeaderElectionContext.runLeaderProcess(ElectionContext.java:177)
		at org.apache.solr.cloud.LeaderElector.runIamLeaderProcess(LeaderElector.java:159)
		at org.apache.solr.cloud.LeaderElector.checkIfIamLeader(LeaderElector.java:103)
		at org.apache.solr.cloud.LeaderElector.access$000(LeaderElector.java:57)
		at org.apache.solr.cloud.LeaderElector$1.process(LeaderElector.java:132)
		at org.apache.zookeeper.ClientCnxn$EventThread.processEvent(ClientCnxn.java:526)
		at org.apache.zookeeper.ClientCnxn$EventThread.run(ClientCnxn.java:502)
	Caused by: org.apache.http.conn.ConnectTimeoutException: Connect to 127.0.0.1:60109 timed out
		at org.apache.http.conn.scheme.PlainSocketFactory.connectSocket(PlainSocketFactory.java:125)
		at org.apache.http.impl.conn.DefaultClientConnectionOperator.openConnection(DefaultClientConnectionOperator.java:148)
		at org.apache.http.impl.conn.AbstractPoolEntry.open(AbstractPoolEntry.java:150)
		at org.apache.http.impl.conn.AbstractPooledConnAdapter.open(AbstractPooledConnAdapter.java:121)
		at org.apache.http.impl.client.DefaultRequestDirector.tryConnect(DefaultRequestDirector.java:575)
		at org.apache.http.impl.client.DefaultRequestDirector.execute(DefaultRequestDirector.java:425)
		at org.apache.http.impl.client.AbstractHttpClient.execute(AbstractHttpClient.java:820)
		at org.apache.http.impl.client.AbstractHttpClient.execute(AbstractHttpClient.java:754)
		at org.apache.http.impl.client.AbstractHttpClient.execute(AbstractHttpClient.java:732)
		at org.apache.solr.client.solrj.impl.HttpSolrServer.request(HttpSolrServer.java:353)
		... 12 more
	
ASYNC  NEW_CORE C1 name=collection1 org.apache.solr.core.SolrCore@657585e9 url=http://127.0.0.1:60101/solr/collection1 node=127.0.0.1:60101_solr
143376 T1054 C1 P60101 oasc.SolrException.log SEVERE org.apache.solr.common.SolrException: Document is missing mandatory uniqueKey field: id
		at org.apache.solr.update.AddUpdateCommand.getHashableId(AddUpdateCommand.java:132)
		at org.apache.solr.update.processor.DistributedUpdateProcessor.hash(DistributedUpdateProcessor.java:1067)
		at org.apache.solr.update.processor.DistributedUpdateProcessor.processAdd(DistributedUpdateProcessor.java:332)
		at org.apache.solr.handler.loader.XMLLoader.processUpdate(XMLLoader.java:230)
		at org.apache.solr.handler.loader.XMLLoader.load(XMLLoader.java:157)
		at org.apache.solr.handler.UpdateRequestHandler$1.load(UpdateRequestHandler.java:92)
		at org.apache.solr.handler.ContentStreamHandlerBase.handleRequestBody(ContentStreamHandlerBase.java:74)
		at org.apache.solr.handler.RequestHandlerBase.handleRequest(RequestHandlerBase.java:129)
		at org.apache.solr.core.SolrCore.execute(SolrCore.java:1692)
		at org.apache.solr.servlet.SolrDispatchFilter.execute(SolrDispatchFilter.java:454)
		at org.apache.solr.servlet.SolrDispatchFilter.doFilter(SolrDispatchFilter.java:275)
		at org.eclipse.jetty.servlet.ServletHandler$CachedChain.doFilter(ServletHandler.java:1337)
		at org.eclipse.jetty.servlet.ServletHandler.doHandle(ServletHandler.java:484)
		at org.eclipse.jetty.server.session.SessionHandler.doHandle(SessionHandler.java:231)
		at org.eclipse.jetty.server.handler.ScopedHandler.handle(ScopedHandler.java:119)
		at org.eclipse.jetty.server.handler.GzipHandler.handle(GzipHandler.java:267)
		at org.eclipse.jetty.server.handler.ContextHandler.doHandle(ContextHandler.java:1067)
		at org.eclipse.jetty.servlet.ServletHandler.doScope(ServletHandler.java:413)
		at org.eclipse.jetty.server.session.SessionHandler.doScope(SessionHandler.java:192)
		at org.eclipse.jetty.server.handler.ContextHandler.doScope(ContextHandler.java:999)
		at org.eclipse.jetty.server.handler.ScopedHandler.handle(ScopedHandler.java:117)
		at org.eclipse.jetty.server.handler.HandlerWrapper.handle(HandlerWrapper.java:111)
		at org.eclipse.jetty.server.Server.handle(Server.java:351)
		at org.eclipse.jetty.server.AbstractHttpConnection.handleRequest(AbstractHttpConnection.java:454)
		at org.eclipse.jetty.server.BlockingHttpConnection.handleRequest(BlockingHttpConnection.java:47)
		at org.eclipse.jetty.server.AbstractHttpConnection.content(AbstractHttpConnection.java:900)
		at org.eclipse.jetty.server.AbstractHttpConnection$RequestHandler.content(AbstractHttpConnection.java:954)
		at org.eclipse.jetty.http.HttpParser.parseNext(HttpParser.java:952)
		at org.eclipse.jetty.http.HttpParser.parseAvailable(HttpParser.java:235)
		at org.eclipse.jetty.server.BlockingHttpConnection.handle(BlockingHttpConnection.java:66)
		at org.eclipse.jetty.server.bio.SocketConnector$ConnectorEndPoint.run(SocketConnector.java:254)
		at org.eclipse.jetty.util.thread.QueuedThreadPool.runJob(QueuedThreadPool.java:599)
		at org.eclipse.jetty.util.thread.QueuedThreadPool$3.run(QueuedThreadPool.java:534)
		at java.lang.Thread.run(Thread.java:679)
	
143501 T1100 oasc.SolrException.log SEVERE Sync Failed
145266 T1229 oasc.SolrException.log SEVERE java.lang.InterruptedException: sleep interrupted
		at java.lang.Thread.sleep(Native Method)
		at org.apache.solr.handler.admin.CoreAdminHandler.handleWaitForStateAction(CoreAdminHandler.java:896)
		at org.apache.solr.handler.admin.CoreAdminHandler.handleRequestBody(CoreAdminHandler.java:185)
		at org.apache.solr.handler.RequestHandlerBase.handleRequest(RequestHandlerBase.java:129)
		at org.apache.solr.servlet.SolrDispatchFilter.handleAdminRequest(SolrDispatchFilter.java:371)
		at org.apache.solr.servlet.SolrDispatchFilter.doFilter(SolrDispatchFilter.java:180)
		at org.eclipse.jetty.servlet.ServletHandler$CachedChain.doFilter(ServletHandler.java:1337)
		at org.eclipse.jetty.servlet.ServletHandler.doHandle(ServletHandler.java:484)
		at org.eclipse.jetty.server.session.SessionHandler.doHandle(SessionHandler.java:231)
		at org.eclipse.jetty.server.handler.ScopedHandler.handle(ScopedHandler.java:119)
		at org.eclipse.jetty.server.handler.GzipHandler.handle(GzipHandler.java:267)
		at org.eclipse.jetty.server.handler.ContextHandler.doHandle(ContextHandler.java:1067)
		at org.eclipse.jetty.servlet.ServletHandler.doScope(ServletHandler.java:413)
		at org.eclipse.jetty.server.session.SessionHandler.doScope(SessionHandler.java:192)
		at org.eclipse.jetty.server.handler.ContextHandler.doScope(ContextHandler.java:999)
		at org.eclipse.jetty.server.handler.ScopedHandler.handle(ScopedHandler.java:117)
		at org.eclipse.jetty.server.handler.HandlerWrapper.handle(HandlerWrapper.java:111)
		at org.eclipse.jetty.server.Server.handle(Server.java:351)
		at org.eclipse.jetty.server.AbstractHttpConnection.handleRequest(AbstractHttpConnection.java:454)
		at org.eclipse.jetty.server.BlockingHttpConnection.handleRequest(BlockingHttpConnection.java:47)
		at org.eclipse.jetty.server.AbstractHttpConnection.headerComplete(AbstractHttpConnection.java:890)
		at org.eclipse.jetty.server.AbstractHttpConnection$RequestHandler.headerComplete(AbstractHttpConnection.java:944)
		at org.eclipse.jetty.http.HttpParser.parseNext(HttpParser.java:634)
		at org.eclipse.jetty.http.HttpParser.parseAvailable(HttpParser.java:230)
		at org.eclipse.jetty.server.BlockingHttpConnection.handle(BlockingHttpConnection.java:66)
		at org.eclipse.jetty.server.bio.SocketConnector$ConnectorEndPoint.run(SocketConnector.java:254)
		at org.eclipse.jetty.util.thread.QueuedThreadPool.runJob(QueuedThreadPool.java:599)
		at org.eclipse.jetty.util.thread.QueuedThreadPool$3.run(QueuedThreadPool.java:534)
		at java.lang.Thread.run(Thread.java:679)
	
145267 T1229 oasc.SolrException.log SEVERE null:java.lang.InterruptedException: sleep interrupted
		at java.lang.Thread.sleep(Native Method)
		at org.apache.solr.handler.admin.CoreAdminHandler.handleWaitForStateAction(CoreAdminHandler.java:896)
		at org.apache.solr.handler.admin.CoreAdminHandler.handleRequestBody(CoreAdminHandler.java:185)
		at org.apache.solr.handler.RequestHandlerBase.handleRequest(RequestHandlerBase.java:129)
		at org.apache.solr.servlet.SolrDispatchFilter.handleAdminRequest(SolrDispatchFilter.java:371)
		at org.apache.solr.servlet.SolrDispatchFilter.doFilter(SolrDispatchFilter.java:180)
		at org.eclipse.jetty.servlet.ServletHandler$CachedChain.doFilter(ServletHandler.java:1337)
		at org.eclipse.jetty.servlet.ServletHandler.doHandle(ServletHandler.java:484)
		at org.eclipse.jetty.server.session.SessionHandler.doHandle(SessionHandler.java:231)
		at org.eclipse.jetty.server.handler.ScopedHandler.handle(ScopedHandler.java:119)
		at org.eclipse.jetty.server.handler.GzipHandler.handle(GzipHandler.java:267)
		at org.eclipse.jetty.server.handler.ContextHandler.doHandle(ContextHandler.java:1067)
		at org.eclipse.jetty.servlet.ServletHandler.doScope(ServletHandler.java:413)
		at org.eclipse.jetty.server.session.SessionHandler.doScope(SessionHandler.java:192)
		at org.eclipse.jetty.server.handler.ContextHandler.doScope(ContextHandler.java:999)
		at org.eclipse.jetty.server.handler.ScopedHandler.handle(ScopedHandler.java:117)
		at org.eclipse.jetty.server.handler.HandlerWrapper.handle(HandlerWrapper.java:111)
		at org.eclipse.jetty.server.Server.handle(Server.java:351)
		at org.eclipse.jetty.server.AbstractHttpConnection.handleRequest(AbstractHttpConnection.java:454)
		at org.eclipse.jetty.server.BlockingHttpConnection.handleRequest(BlockingHttpConnection.java:47)
		at org.eclipse.jetty.server.AbstractHttpConnection.headerComplete(AbstractHttpConnection.java:890)
		at org.eclipse.jetty.server.AbstractHttpConnection$RequestHandler.headerComplete(AbstractHttpConnection.java:944)
		at org.eclipse.jetty.http.HttpParser.parseNext(HttpParser.java:634)
		at org.eclipse.jetty.http.HttpParser.parseAvailable(HttpParser.java:230)
		at org.eclipse.jetty.server.BlockingHttpConnection.handle(BlockingHttpConnection.java:66)
		at org.eclipse.jetty.server.bio.SocketConnector$ConnectorEndPoint.run(SocketConnector.java:254)
		at org.eclipse.jetty.util.thread.QueuedThreadPool.runJob(QueuedThreadPool.java:599)
		at org.eclipse.jetty.util.thread.QueuedThreadPool$3.run(QueuedThreadPool.java:534)
		at java.lang.Thread.run(Thread.java:679)
	
145268 T1229 oasc.SolrException.log SEVERE null:org.eclipse.jetty.io.EofException
		at org.eclipse.jetty.server.HttpOutput.write(HttpOutput.java:154)
		at org.eclipse.jetty.server.HttpOutput.write(HttpOutput.java:101)
		at org.apache.solr.common.util.FastOutputStream.flush(FastOutputStream.java:204)
		at org.apache.solr.common.util.FastOutputStream.flushBuffer(FastOutputStream.java:197)
		at org.apache.solr.common.util.JavaBinCodec.marshal(JavaBinCodec.java:94)
		at org.apache.solr.response.BinaryResponseWriter.write(BinaryResponseWriter.java:51)
		at org.apache.solr.servlet.SolrDispatchFilter.writeResponse(SolrDispatchFilter.java:403)
		at org.apache.solr.servlet.SolrDispatchFilter.handleAdminRequest(SolrDispatchFilter.java:381)
		at org.apache.solr.servlet.SolrDispatchFilter.doFilter(SolrDispatchFilter.java:180)
		at org.eclipse.jetty.servlet.ServletHandler$CachedChain.doFilter(ServletHandler.java:1337)
		at org.eclipse.jetty.servlet.ServletHandler.doHandle(ServletHandler.java:484)
		at org.eclipse.jetty.server.session.SessionHandler.doHandle(SessionHandler.java:231)
		at org.eclipse.jetty.server.handler.ScopedHandler.handle(ScopedHandler.java:119)
		at org.eclipse.jetty.server.handler.GzipHandler.handle(GzipHandler.java:267)
		at org.eclipse.jetty.server.handler.ContextHandler.doHandle(ContextHandler.java:1067)
		at org.eclipse.jetty.servlet.ServletHandler.doScope(ServletHandler.java:413)
		at org.eclipse.jetty.server.session.SessionHandler.doScope(SessionHandler.java:192)
		at org.eclipse.jetty.server.handler.ContextHandler.doScope(ContextHandler.java:999)
		at org.eclipse.jetty.server.handler.ScopedHandler.handle(ScopedHandler.java:117)
		at org.eclipse.jetty.server.handler.HandlerWrapper.handle(HandlerWrapper.java:111)
		at org.eclipse.jetty.server.Server.handle(Server.java:351)
		at org.eclipse.jetty.server.AbstractHttpConnection.handleRequest(AbstractHttpConnection.java:454)
		at org.eclipse.jetty.server.BlockingHttpConnection.handleRequest(BlockingHttpConnection.java:47)
		at org.eclipse.jetty.server.AbstractHttpConnection.headerComplete(AbstractHttpConnection.java:890)
		at org.eclipse.jetty.server.AbstractHttpConnection$RequestHandler.headerComplete(AbstractHttpConnection.java:944)
		at org.eclipse.jetty.http.HttpParser.parseNext(HttpParser.java:634)
		at org.eclipse.jetty.http.HttpParser.parseAvailable(HttpParser.java:230)
		at org.eclipse.jetty.server.BlockingHttpConnection.handle(BlockingHttpConnection.java:66)
		at org.eclipse.jetty.server.bio.SocketConnector$ConnectorEndPoint.run(SocketConnector.java:254)
		at org.eclipse.jetty.util.thread.QueuedThreadPool.runJob(QueuedThreadPool.java:599)
		at org.eclipse.jetty.util.thread.QueuedThreadPool$3.run(QueuedThreadPool.java:534)
		at java.lang.Thread.run(Thread.java:679)
	
188590 T1224 oasc.SolrException.log SEVERE http://127.0.0.1:41481/solr/collection1/: Could not tell a replica to recover:org.apache.solr.client.solrj.SolrServerException: Timeout occured while waiting response from server at: http://127.0.0.1:60111/solr
		at org.apache.solr.client.solrj.impl.HttpSolrServer.request(HttpSolrServer.java:410)
		at org.apache.solr.client.solrj.impl.HttpSolrServer.request(HttpSolrServer.java:182)
		at org.apache.solr.cloud.SyncStrategy.requestRecovery(SyncStrategy.java:282)
		at org.apache.solr.cloud.SyncStrategy.syncToMe(SyncStrategy.java:226)
		at org.apache.solr.cloud.SyncStrategy.syncReplicas(SyncStrategy.java:119)
		at org.apache.solr.cloud.SyncStrategy.sync(SyncStrategy.java:85)
		at org.apache.solr.cloud.ShardLeaderElectionContext.runLeaderProcess(ElectionContext.java:177)
		at org.apache.solr.cloud.LeaderElector.runIamLeaderProcess(LeaderElector.java:159)
		at org.apache.solr.cloud.LeaderElector.checkIfIamLeader(LeaderElector.java:103)
		at org.apache.solr.cloud.LeaderElector.access$000(LeaderElector.java:57)
		at org.apache.solr.cloud.LeaderElector$1.process(LeaderElector.java:132)
		at org.apache.zookeeper.ClientCnxn$EventThread.processEvent(ClientCnxn.java:526)
		at org.apache.zookeeper.ClientCnxn$EventThread.run(ClientCnxn.java:502)
	Caused by: java.net.SocketTimeoutException: Read timed out
		at java.net.SocketInputStream.socketRead0(Native Method)
		at java.net.SocketInputStream.read(SocketInputStream.java:146)
		at org.apache.http.impl.io.AbstractSessionInputBuffer.fillBuffer(AbstractSessionInputBuffer.java:149)
		at org.apache.http.impl.io.SocketInputBuffer.fillBuffer(SocketInputBuffer.java:111)
		at org.apache.http.impl.io.AbstractSessionInputBuffer.readLine(AbstractSessionInputBuffer.java:264)
		at org.apache.http.impl.conn.DefaultResponseParser.parseHead(DefaultResponseParser.java:98)
		at org.apache.http.impl.io.AbstractMessageParser.parse(AbstractMessageParser.java:252)
		at org.apache.http.impl.AbstractHttpClientConnection.receiveResponseHeader(AbstractHttpClientConnection.java:282)
		at org.apache.http.impl.conn.DefaultClientConnection.receiveResponseHeader(DefaultClientConnection.java:247)
		at org.apache.http.impl.conn.AbstractClientConnAdapter.receiveResponseHeader(AbstractClientConnAdapter.java:216)
		at org.apache.http.protocol.HttpRequestExecutor.doReceiveResponse(HttpRequestExecutor.java:298)
		at org.apache.http.protocol.HttpRequestExecutor.execute(HttpRequestExecutor.java:125)
		at org.apache.http.impl.client.DefaultRequestDirector.tryExecute(DefaultRequestDirector.java:647)
		at org.apache.http.impl.client.DefaultRequestDirector.execute(DefaultRequestDirector.java:464)
		at org.apache.http.impl.client.AbstractHttpClient.execute(AbstractHttpClient.java:820)
		at org.apache.http.impl.client.AbstractHttpClient.execute(AbstractHttpClient.java:754)
		at org.apache.http.impl.client.AbstractHttpClient.execute(AbstractHttpClient.java:732)
		at org.apache.solr.client.solrj.impl.HttpSolrServer.request(HttpSolrServer.java:353)
		... 12 more
	
ASYNC  NEW_CORE C2 name=collection1 org.apache.solr.core.SolrCore@ed11c1 url=http://127.0.0.1:60111/solr/collection1 node=127.0.0.1:60111_solr
190218 T1244 C2 P60111 oasc.SolrException.log SEVERE Error while trying to recover. core=collection1:org.apache.solr.client.solrj.SolrServerException: IOException occured when talking to server at: http://127.0.0.1:60107/solr
		at org.apache.solr.client.solrj.impl.HttpSolrServer.request(HttpSolrServer.java:414)
		at org.apache.solr.client.solrj.impl.HttpSolrServer.request(HttpSolrServer.java:182)
		at org.apache.solr.cloud.RecoveryStrategy.sendPrepRecoveryCmd(RecoveryStrategy.java:191)
		at org.apache.solr.cloud.RecoveryStrategy.doRecovery(RecoveryStrategy.java:320)
		at org.apache.solr.cloud.RecoveryStrategy.run(RecoveryStrategy.java:212)
	Caused by: org.apache.http.conn.ConnectTimeoutException: Connect to 127.0.0.1:60107 timed out
		at org.apache.http.conn.scheme.PlainSocketFactory.connectSocket(PlainSocketFactory.java:125)
		at org.apache.http.impl.conn.DefaultClientConnectionOperator.openConnection(DefaultClientConnectionOperator.java:148)
		at org.apache.http.impl.conn.AbstractPoolEntry.open(AbstractPoolEntry.java:150)
		at org.apache.http.impl.conn.AbstractPooledConnAdapter.open(AbstractPooledConnAdapter.java:121)
		at org.apache.http.impl.client.DefaultRequestDirector.tryExecute(DefaultRequestDirector.java:636)
		at org.apache.http.impl.client.DefaultRequestDirector.execute(DefaultRequestDirector.java:464)
		at org.apache.http.impl.client.AbstractHttpClient.execute(AbstractHttpClient.java:820)
		at org.apache.http.impl.client.AbstractHttpClient.execute(AbstractHttpClient.java:754)
		at org.apache.http.impl.client.AbstractHttpClient.execute(AbstractHttpClient.java:732)
		at org.apache.solr.client.solrj.impl.HttpSolrServer.request(HttpSolrServer.java:353)
		... 4 more
	
190219 T1244 C2 P60111 oasc.RecoveryStrategy.doRecovery SEVERE Recovery failed - trying again... core=collection1
Tests run: 1, Failures: 0, Errors: 0, Skipped: 0, Time elapsed: 192.12 sec
Running org.apache.solr.search.TestFiltering
Creating dataDir: /usr/home/hudson/hudson-slave/workspace/Lucene-Solr-Maven-trunk/maven-build/solr/core/target/test/./solrtest-TestFiltering-1346644878189
Tests run: 2, Failures: 0, Errors: 0, Skipped: 0, Time elapsed: 2.104 sec
Running org.apache.solr.core.TestMergePolicyConfig
Creating dataDir: /usr/home/hudson/hudson-slave/workspace/Lucene-Solr-Maven-trunk/maven-build/solr/core/target/test/./solrtest-TestMergePolicyConfig-1346644880305
Tests run: 1, Failures: 0, Errors: 0, Skipped: 0, Time elapsed: 0.271 sec
Running org.apache.solr.servlet.CacheHeaderTest
Creating dataDir: /usr/home/hudson/hudson-slave/workspace/Lucene-Solr-Maven-trunk/maven-build/solr/core/target/test/./solrtest-CacheHeaderTest-1346644880578
Tests run: 5, Failures: 0, Errors: 0, Skipped: 0, Time elapsed: 0.582 sec
Running org.apache.solr.util.TestFastWriter
Tests run: 1, Failures: 0, Errors: 0, Skipped: 0, Time elapsed: 0.172 sec
Running org.apache.solr.core.AlternateDirectoryTest
Creating dataDir: /usr/home/hudson/hudson-slave/workspace/Lucene-Solr-Maven-trunk/maven-build/solr/core/target/test/./solrtest-AlternateDirectoryTest-1346644881333
Tests run: 1, Failures: 0, Errors: 0, Skipped: 0, Time elapsed: 0.402 sec
Running org.apache.solr.util.TestFastOutputStream
Tests run: 1, Failures: 0, Errors: 0, Skipped: 0, Time elapsed: 0.146 sec
Running org.apache.solr.MinimalSchemaTest
Creating dataDir: /usr/home/hudson/hudson-slave/workspace/Lucene-Solr-Maven-trunk/maven-build/solr/core/target/test/./solrtest-MinimalSchemaTest-1346644881888
Tests run: 3, Failures: 0, Errors: 0, Skipped: 0, Time elapsed: 0.655 sec
Running org.apache.solr.schema.PreAnalyzedFieldTest
Tests run: 3, Failures: 0, Errors: 0, Skipped: 0, Time elapsed: 0.012 sec
Running org.apache.solr.search.QueryParsingTest
Creating dataDir: /usr/home/hudson/hudson-slave/workspace/Lucene-Solr-Maven-trunk/maven-build/solr/core/target/test/./solrtest-QueryParsingTest-1346644882609
Tests run: 4, Failures: 0, Errors: 0, Skipped: 0, Time elapsed: 0.66 sec
Running org.apache.solr.highlight.HighlighterConfigTest
Tests run: 1, Failures: 0, Errors: 0, Skipped: 0, Time elapsed: 0.408 sec
Running org.apache.solr.util.CircularListTest
Tests run: 1, Failures: 0, Errors: 0, Skipped: 0, Time elapsed: 0.016 sec
Running org.apache.solr.servlet.DirectSolrConnectionTest
Tests run: 2, Failures: 0, Errors: 0, Skipped: 0, Time elapsed: 0.434 sec
Running org.apache.solr.update.AutoCommitTest
Tests run: 3, Failures: 0, Errors: 0, Skipped: 0, Time elapsed: 9.058 sec
Running org.apache.solr.cloud.BasicZkTest
azt beforeclass
Creating dataDir: /usr/home/hudson/hudson-slave/workspace/Lucene-Solr-Maven-trunk/maven-build/solr/core/target/test/./solrtest-BasicZkTest-1346644893171
Tests run: 1, Failures: 0, Errors: 0, Skipped: 0, Time elapsed: 13.875 sec
Running org.apache.solr.search.similarities.TestDefaultSimilarityFactory
Creating dataDir: /usr/home/hudson/hudson-slave/workspace/Lucene-Solr-Maven-trunk/maven-build/solr/core/target/test/./solrtest-TestDefaultSimilarityFactory-1346644907046
Tests run: 2, Failures: 0, Errors: 0, Skipped: 0, Time elapsed: 0.079 sec
Running org.apache.solr.search.TestRecovery
Creating dataDir: /usr/home/hudson/hudson-slave/workspace/Lucene-Solr-Maven-trunk/maven-build/solr/core/target/test/./solrtest-TestRecovery-1346644907136
Tests run: 9, Failures: 0, Errors: 0, Skipped: 0, Time elapsed: 6.044 sec
Running org.apache.solr.request.TestBinaryResponseWriter
Tests run: 2, Failures: 0, Errors: 0, Skipped: 0, Time elapsed: 0.923 sec
Running org.apache.solr.TestTrie
Creating dataDir: /usr/home/hudson/hudson-slave/workspace/Lucene-Solr-Maven-trunk/maven-build/solr/core/target/test/./solrtest-TestTrie-1346644914125
Tests run: 8, Failures: 0, Errors: 0, Skipped: 0, Time elapsed: 1.042 sec
Running org.apache.solr.analysis.PathHierarchyTokenizerFactoryTest
Creating dataDir: /usr/home/hudson/hudson-slave/workspace/Lucene-Solr-Maven-trunk/maven-build/solr/core/target/test/./solrtest-PathHierarchyTokenizerFactoryTest-1346644915166
Tests run: 2, Failures: 0, Errors: 0, Skipped: 0, Time elapsed: 0.718 sec
Running org.apache.solr.cloud.ChaosMonkeySafeLeaderTest
Tests run: 1, Failures: 0, Errors: 0, Skipped: 1, Time elapsed: 0.001 sec
Running org.apache.solr.search.TestSolrJ
Tests run: 1, Failures: 0, Errors: 0, Skipped: 0, Time elapsed: 0.012 sec
Running org.apache.solr.spelling.DirectSolrSpellCheckerTest
Creating dataDir: /usr/home/hudson/hudson-slave/workspace/Lucene-Solr-Maven-trunk/maven-build/solr/core/target/test/./solrtest-DirectSolrSpellCheckerTest-1346644915897
Tests run: 2, Failures: 0, Errors: 0, Skipped: 0, Time elapsed: 0.944 sec
Running org.apache.solr.search.TestExtendedDismaxParser
Tests run: 10, Failures: 0, Errors: 0, Skipped: 0, Time elapsed: 7.061 sec
Running org.apache.solr.search.TestLRUCache
Tests run: 3, Failures: 0, Errors: 0, Skipped: 0, Time elapsed: 0.015 sec
Running org.apache.solr.core.TestJmxMonitoredMap
Tests run: 2, Failures: 0, Errors: 0, Skipped: 0, Time elapsed: 0.148 sec
Running org.apache.solr.handler.component.TermVectorComponentDistributedTest
Tests run: 1, Failures: 0, Errors: 0, Skipped: 0, Time elapsed: 6.508 sec
Running org.apache.solr.request.SimpleFacetsTest
Creating dataDir: /usr/home/hudson/hudson-slave/workspace/Lucene-Solr-Maven-trunk/maven-build/solr/core/target/test/./solrtest-SimpleFacetsTest-1346644930630
ASYNC  NEW_CORE C3 name=collection1 org.apache.solr.core.SolrCore@404590de
2652 T1520 C3 oasc.SolrException.log SEVERE org.apache.solr.common.SolrException: Specify the group.field as parameter or local parameter
		at org.apache.solr.request.SimpleFacets.getGroupedCounts(SimpleFacets.java:360)
		at org.apache.solr.request.SimpleFacets.getTermCounts(SimpleFacets.java:319)
		at org.apache.solr.request.SimpleFacets.getFacetFieldCounts(SimpleFacets.java:423)
		at org.apache.solr.request.SimpleFacets.getFacetCounts(SimpleFacets.java:206)
		at org.apache.solr.handler.component.FacetComponent.process(FacetComponent.java:87)
		at org.apache.solr.handler.component.SearchHandler.handleRequestBody(SearchHandler.java:206)
		at org.apache.solr.handler.RequestHandlerBase.handleRequest(RequestHandlerBase.java:129)
		at org.apache.solr.core.SolrCore.execute(SolrCore.java:1692)
		at org.apache.solr.util.TestHarness.query(TestHarness.java:351)
		at org.apache.solr.util.TestHarness.query(TestHarness.java:333)
		at org.apache.solr.request.SimpleFacetsTest.testSimpleGroupedFacets(SimpleFacetsTest.java:211)
		at sun.reflect.NativeMethodAccessorImpl.invoke0(Native Method)
		at sun.reflect.NativeMethodAccessorImpl.invoke(NativeMethodAccessorImpl.java:57)
		at sun.reflect.DelegatingMethodAccessorImpl.invoke(DelegatingMethodAccessorImpl.java:43)
		at java.lang.reflect.Method.invoke(Method.java:616)
		at com.carrotsearch.randomizedtesting.RandomizedRunner.invoke(RandomizedRunner.java:1559)
		at com.carrotsearch.randomizedtesting.RandomizedRunner.access$600(RandomizedRunner.java:79)
		at com.carrotsearch.randomizedtesting.RandomizedRunner$6.evaluate(RandomizedRunner.java:737)
		at com.carrotsearch.randomizedtesting.RandomizedRunner$7.evaluate(RandomizedRunner.java:773)
		at com.carrotsearch.randomizedtesting.RandomizedRunner$8.evaluate(RandomizedRunner.java:787)
		at com.carrotsearch.randomizedtesting.rules.SystemPropertiesRestoreRule$1.evaluate(SystemPropertiesRestoreRule.java:53)
		at org.apache.lucene.util.TestRuleSetupTeardownChained$1.evaluate(TestRuleSetupTeardownChained.java:50)
		at org.apache.lucene.util.TestRuleFieldCacheSanity$1.evaluate(TestRuleFieldCacheSanity.java:51)
		at org.apache.lucene.util.AbstractBeforeAfterRule$1.evaluate(AbstractBeforeAfterRule.java:45)
		at com.carrotsearch.randomizedtesting.rules.SystemPropertiesInvariantRule$1.evaluate(SystemPropertiesInvariantRule.java:55)
		at org.apache.lucene.util.TestRuleThreadAndTestName$1.evaluate(TestRuleThreadAndTestName.java:48)
		at org.apache.lucene.util.TestRuleIgnoreAfterMaxFailures$1.evaluate(TestRuleIgnoreAfterMaxFailures.java:70)
		at org.apache.lucene.util.TestRuleMarkFailure$1.evaluate(TestRuleMarkFailure.java:48)
		at com.carrotsearch.randomizedtesting.rules.StatementAdapter.evaluate(StatementAdapter.java:36)
		at com.carrotsearch.randomizedtesting.ThreadLeakControl$StatementRunner.run(ThreadLeakControl.java:345)
		at com.carrotsearch.randomizedtesting.ThreadLeakControl.forkTimeoutingTask(ThreadLeakControl.java:769)
		at com.carrotsearch.randomizedtesting.ThreadLeakControl$3.evaluate(ThreadLeakControl.java:429)
		at com.carrotsearch.randomizedtesting.RandomizedRunner.runSingleTest(RandomizedRunner.java:746)
		at com.carrotsearch.randomizedtesting.RandomizedRunner$3.evaluate(RandomizedRunner.java:648)
		at com.carrotsearch.randomizedtesting.RandomizedRunner$4.evaluate(RandomizedRunner.java:682)
		at com.carrotsearch.randomizedtesting.RandomizedRunner$5.evaluate(RandomizedRunner.java:693)
		at com.carrotsearch.randomizedtesting.rules.StatementAdapter.evaluate(StatementAdapter.java:36)
		at com.carrotsearch.randomizedtesting.rules.SystemPropertiesRestoreRule$1.evaluate(SystemPropertiesRestoreRule.java:53)
		at org.apache.lucene.util.AbstractBeforeAfterRule$1.evaluate(AbstractBeforeAfterRule.java:45)
		at org.apache.lucene.util.TestRuleStoreClassName$1.evaluate(TestRuleStoreClassName.java:42)
		at com.carrotsearch.randomizedtesting.rules.SystemPropertiesInvariantRule$1.evaluate(SystemPropertiesInvariantRule.java:55)
		at com.carrotsearch.randomizedtesting.rules.NoShadowingOrOverridesOnMethodsRule$1.evaluate(NoShadowingOrOverridesOnMethodsRule.java:39)
		at com.carrotsearch.randomizedtesting.rules.NoShadowingOrOverridesOnMethodsRule$1.evaluate(NoShadowingOrOverridesOnMethodsRule.java:39)
		at org.apache.lucene.util.TestRuleAssertionsRequired$1.evaluate(TestRuleAssertionsRequired.java:40)
		at org.apache.lucene.util.TestRuleMarkFailure$1.evaluate(TestRuleMarkFailure.java:48)
		at org.apache.lucene.util.TestRuleIgnoreAfterMaxFailures$1.evaluate(TestRuleIgnoreAfterMaxFailures.java:70)
		at org.apache.lucene.util.TestRuleIgnoreTestSuites$1.evaluate(TestRuleIgnoreTestSuites.java:55)
		at com.carrotsearch.randomizedtesting.rules.StatementAdapter.evaluate(StatementAdapter.java:36)
		at com.carrotsearch.randomizedtesting.ThreadLeakControl$StatementRunner.run(ThreadLeakControl.java:345)
		at java.lang.Thread.run(Thread.java:679)
	
3319 T1520 C3 oasc.SolrException.log SEVERE org.apache.solr.common.SolrException: range facet infinite loop: gap is either zero, or too small relative start/end and caused underflow: 23.0 + 0 = 23.0
		at org.apache.solr.request.SimpleFacets.getFacetRangeCounts(SimpleFacets.java:1122)
		at org.apache.solr.request.SimpleFacets.getFacetRangeCounts(SimpleFacets.java:1074)
		at org.apache.solr.request.SimpleFacets.getFacetRangeCounts(SimpleFacets.java:1018)
		at org.apache.solr.request.SimpleFacets.getFacetCounts(SimpleFacets.java:208)
		at org.apache.solr.handler.component.FacetComponent.process(FacetComponent.java:87)
		at org.apache.solr.handler.component.SearchHandler.handleRequestBody(SearchHandler.java:206)
		at org.apache.solr.handler.RequestHandlerBase.handleRequest(RequestHandlerBase.java:129)
		at org.apache.solr.core.SolrCore.execute(SolrCore.java:1692)
		at org.apache.solr.util.TestHarness.query(TestHarness.java:351)
		at org.apache.solr.util.TestHarness.query(TestHarness.java:333)
		at org.apache.solr.SolrTestCaseJ4.assertQEx(SolrTestCaseJ4.java:601)
		at org.apache.solr.request.SimpleFacetsTest.testRangeFacetInfiniteLoopDetection(SimpleFacetsTest.java:2018)
		at sun.reflect.NativeMethodAccessorImpl.invoke0(Native Method)
		at sun.reflect.NativeMethodAccessorImpl.invoke(NativeMethodAccessorImpl.java:57)
		at sun.reflect.DelegatingMethodAccessorImpl.invoke(DelegatingMethodAccessorImpl.java:43)
		at java.lang.reflect.Method.invoke(Method.java:616)
		at com.carrotsearch.randomizedtesting.RandomizedRunner.invoke(RandomizedRunner.java:1559)
		at com.carrotsearch.randomizedtesting.RandomizedRunner.access$600(RandomizedRunner.java:79)
		at com.carrotsearch.randomizedtesting.RandomizedRunner$6.evaluate(RandomizedRunner.java:737)
		at com.carrotsearch.randomizedtesting.RandomizedRunner$7.evaluate(RandomizedRunner.java:773)
		at com.carrotsearch.randomizedtesting.RandomizedRunner$8.evaluate(RandomizedRunner.java:787)
		at com.carrotsearch.randomizedtesting.rules.SystemPropertiesRestoreRule$1.evaluate(SystemPropertiesRestoreRule.java:53)
		at org.apache.lucene.util.TestRuleSetupTeardownChained$1.evaluate(TestRuleSetupTeardownChained.java:50)
		at org.apache.lucene.util.TestRuleFieldCacheSanity$1.evaluate(TestRuleFieldCacheSanity.java:51)
		at org.apache.lucene.util.AbstractBeforeAfterRule$1.evaluate(AbstractBeforeAfterRule.java:45)
		at com.carrotsearch.randomizedtesting.rules.SystemPropertiesInvariantRule$1.evaluate(SystemPropertiesInvariantRule.java:55)
		at org.apache.lucene.util.TestRuleThreadAndTestName$1.evaluate(TestRuleThreadAndTestName.java:48)
		at org.apache.lucene.util.TestRuleIgnoreAfterMaxFailures$1.evaluate(TestRuleIgnoreAfterMaxFailures.java:70)
		at org.apache.lucene.util.TestRuleMarkFailure$1.evaluate(TestRuleMarkFailure.java:48)
		at com.carrotsearch.randomizedtesting.rules.StatementAdapter.evaluate(StatementAdapter.java:36)
		at com.carrotsearch.randomizedtesting.ThreadLeakControl$StatementRunner.run(ThreadLeakControl.java:345)
		at com.carrotsearch.randomizedtesting.ThreadLeakControl.forkTimeoutingTask(ThreadLeakControl.java:769)
		at com.carrotsearch.randomizedtesting.ThreadLeakControl$3.evaluate(ThreadLeakControl.java:429)
		at com.carrotsearch.randomizedtesting.RandomizedRunner.runSingleTest(RandomizedRunner.java:746)
		at com.carrotsearch.randomizedtesting.RandomizedRunner$3.evaluate(RandomizedRunner.java:648)
		at com.carrotsearch.randomizedtesting.RandomizedRunner$4.evaluate(RandomizedRunner.java:682)
		at com.carrotsearch.randomizedtesting.RandomizedRunner$5.evaluate(RandomizedRunner.java:693)
		at com.carrotsearch.randomizedtesting.rules.StatementAdapter.evaluate(StatementAdapter.java:36)
		at com.carrotsearch.randomizedtesting.rules.SystemPropertiesRestoreRule$1.evaluate(SystemPropertiesRestoreRule.java:53)
		at org.apache.lucene.util.AbstractBeforeAfterRule$1.evaluate(AbstractBeforeAfterRule.java:45)
		at org.apache.lucene.util.TestRuleStoreClassName$1.evaluate(TestRuleStoreClassName.java:42)
		at com.carrotsearch.randomizedtesting.rules.SystemPropertiesInvariantRule$1.evaluate(SystemPropertiesInvariantRule.java:55)
		at com.carrotsearch.randomizedtesting.rules.NoShadowingOrOverridesOnMethodsRule$1.evaluate(NoShadowingOrOverridesOnMethodsRule.java:39)
		at com.carrotsearch.randomizedtesting.rules.NoShadowingOrOverridesOnMethodsRule$1.evaluate(NoShadowingOrOverridesOnMethodsRule.java:39)
		at org.apache.lucene.util.TestRuleAssertionsRequired$1.evaluate(TestRuleAssertionsRequired.java:40)
		at org.apache.lucene.util.TestRuleMarkFailure$1.evaluate(TestRuleMarkFailure.java:48)
		at org.apache.lucene.util.TestRuleIgnoreAfterMaxFailures$1.evaluate(TestRuleIgnoreAfterMaxFailures.java:70)
		at org.apache.lucene.util.TestRuleIgnoreTestSuites$1.evaluate(TestRuleIgnoreTestSuites.java:55)
		at com.carrotsearch.randomizedtesting.rules.StatementAdapter.evaluate(StatementAdapter.java:36)
		at com.carrotsearch.randomizedtesting.ThreadLeakControl$StatementRunner.run(ThreadLeakControl.java:345)
		at java.lang.Thread.run(Thread.java:679)
	
3320 T1520 C3 oasc.SolrException.log SEVERE org.apache.solr.common.SolrException: range facet infinite loop: gap is either zero, or too small relative start/end and caused underflow: 23.0 + 0 = 23.0
		at org.apache.solr.request.SimpleFacets.getFacetRangeCounts(SimpleFacets.java:1122)
		at org.apache.solr.request.SimpleFacets.getFacetRangeCounts(SimpleFacets.java:1074)
		at org.apache.solr.request.SimpleFacets.getFacetRangeCounts(SimpleFacets.java:1018)
		at org.apache.solr.request.SimpleFacets.getFacetCounts(SimpleFacets.java:208)
		at org.apache.solr.handler.component.FacetComponent.process(FacetComponent.java:87)
		at org.apache.solr.handler.component.SearchHandler.handleRequestBody(SearchHandler.java:206)
		at org.apache.solr.handler.RequestHandlerBase.handleRequest(RequestHandlerBase.java:129)
		at org.apache.solr.core.SolrCore.execute(SolrCore.java:1692)
		at org.apache.solr.util.TestHarness.query(TestHarness.java:351)
		at org.apache.solr.util.TestHarness.query(TestHarness.java:333)
		at org.apache.solr.SolrTestCaseJ4.assertQEx(SolrTestCaseJ4.java:601)
		at org.apache.solr.request.SimpleFacetsTest.testRangeFacetInfiniteLoopDetection(SimpleFacetsTest.java:2018)
		at sun.reflect.NativeMethodAccessorImpl.invoke0(Native Method)
		at sun.reflect.NativeMethodAccessorImpl.invoke(NativeMethodAccessorImpl.java:57)
		at sun.reflect.DelegatingMethodAccessorImpl.invoke(DelegatingMethodAccessorImpl.java:43)
		at java.lang.reflect.Method.invoke(Method.java:616)
		at com.carrotsearch.randomizedtesting.RandomizedRunner.invoke(RandomizedRunner.java:1559)
		at com.carrotsearch.randomizedtesting.RandomizedRunner.access$600(RandomizedRunner.java:79)
		at com.carrotsearch.randomizedtesting.RandomizedRunner$6.evaluate(RandomizedRunner.java:737)
		at com.carrotsearch.randomizedtesting.RandomizedRunner$7.evaluate(RandomizedRunner.java:773)
		at com.carrotsearch.randomizedtesting.RandomizedRunner$8.evaluate(RandomizedRunner.java:787)
		at com.carrotsearch.randomizedtesting.rules.SystemPropertiesRestoreRule$1.evaluate(SystemPropertiesRestoreRule.java:53)
		at org.apache.lucene.util.TestRuleSetupTeardownChained$1.evaluate(TestRuleSetupTeardownChained.java:50)
		at org.apache.lucene.util.TestRuleFieldCacheSanity$1.evaluate(TestRuleFieldCacheSanity.java:51)
		at org.apache.lucene.util.AbstractBeforeAfterRule$1.evaluate(AbstractBeforeAfterRule.java:45)
		at com.carrotsearch.randomizedtesting.rules.SystemPropertiesInvariantRule$1.evaluate(SystemPropertiesInvariantRule.java:55)
		at org.apache.lucene.util.TestRuleThreadAndTestName$1.evaluate(TestRuleThreadAndTestName.java:48)
		at org.apache.lucene.util.TestRuleIgnoreAfterMaxFailures$1.evaluate(TestRuleIgnoreAfterMaxFailures.java:70)
		at org.apache.lucene.util.TestRuleMarkFailure$1.evaluate(TestRuleMarkFailure.java:48)
		at com.carrotsearch.randomizedtesting.rules.StatementAdapter.evaluate(StatementAdapter.java:36)
		at com.carrotsearch.randomizedtesting.ThreadLeakControl$StatementRunner.run(ThreadLeakControl.java:345)
		at com.carrotsearch.randomizedtesting.ThreadLeakControl.forkTimeoutingTask(ThreadLeakControl.java:769)
		at com.carrotsearch.randomizedtesting.ThreadLeakControl$3.evaluate(ThreadLeakControl.java:429)
		at com.carrotsearch.randomizedtesting.RandomizedRunner.runSingleTest(RandomizedRunner.java:746)
		at com.carrotsearch.randomizedtesting.RandomizedRunner$3.evaluate(RandomizedRunner.java:648)
		at com.carrotsearch.randomizedtesting.RandomizedRunner$4.evaluate(RandomizedRunner.java:682)
		at com.carrotsearch.randomizedtesting.RandomizedRunner$5.evaluate(RandomizedRunner.java:693)
		at com.carrotsearch.randomizedtesting.rules.StatementAdapter.evaluate(StatementAdapter.java:36)
		at com.carrotsearch.randomizedtesting.rules.SystemPropertiesRestoreRule$1.evaluate(SystemPropertiesRestoreRule.java:53)
		at org.apache.lucene.util.AbstractBeforeAfterRule$1.evaluate(AbstractBeforeAfterRule.java:45)
		at org.apache.lucene.util.TestRuleStoreClassName$1.evaluate(TestRuleStoreClassName.java:42)
		at com.carrotsearch.randomizedtesting.rules.SystemPropertiesInvariantRule$1.evaluate(SystemPropertiesInvariantRule.java:55)
		at com.carrotsearch.randomizedtesting.rules.NoShadowingOrOverridesOnMethodsRule$1.evaluate(NoShadowingOrOverridesOnMethodsRule.java:39)
		at com.carrotsearch.randomizedtesting.rules.NoShadowingOrOverridesOnMethodsRule$1.evaluate(NoShadowingOrOverridesOnMethodsRule.java:39)
		at org.apache.lucene.util.TestRuleAssertionsRequired$1.evaluate(TestRuleAssertionsRequired.java:40)
		at org.apache.lucene.util.TestRuleMarkFailure$1.evaluate(TestRuleMarkFailure.java:48)
		at org.apache.lucene.util.TestRuleIgnoreAfterMaxFailures$1.evaluate(TestRuleIgnoreAfterMaxFailures.java:70)
		at org.apache.lucene.util.TestRuleIgnoreTestSuites$1.evaluate(TestRuleIgnoreTestSuites.java:55)
		at com.carrotsearch.randomizedtesting.rules.StatementAdapter.evaluate(StatementAdapter.java:36)
		at com.carrotsearch.randomizedtesting.ThreadLeakControl$StatementRunner.run(ThreadLeakControl.java:345)
		at java.lang.Thread.run(Thread.java:679)
	
3321 T1520 C3 oasc.SolrException.log SEVERE org.apache.solr.common.SolrException: range facet infinite loop: gap is either zero, or too small relative start/end and caused underflow: 23.0 + 0 = 23.0
		at org.apache.solr.request.SimpleFacets.getFacetRangeCounts(SimpleFacets.java:1122)
		at org.apache.solr.request.SimpleFacets.getFacetRangeCounts(SimpleFacets.java:1074)
		at org.apache.solr.request.SimpleFacets.getFacetRangeCounts(SimpleFacets.java:1018)
		at org.apache.solr.request.SimpleFacets.getFacetCounts(SimpleFacets.java:208)
		at org.apache.solr.handler.component.FacetComponent.process(FacetComponent.java:87)
		at org.apache.solr.handler.component.SearchHandler.handleRequestBody(SearchHandler.java:206)
		at org.apache.solr.handler.RequestHandlerBase.handleRequest(RequestHandlerBase.java:129)
		at org.apache.solr.core.SolrCore.execute(SolrCore.java:1692)
		at org.apache.solr.util.TestHarness.query(TestHarness.java:351)
		at org.apache.solr.util.TestHarness.query(TestHarness.java:333)
		at org.apache.solr.SolrTestCaseJ4.assertQEx(SolrTestCaseJ4.java:601)
		at org.apache.solr.request.SimpleFacetsTest.testRangeFacetInfiniteLoopDetection(SimpleFacetsTest.java:2018)
		at sun.reflect.NativeMethodAccessorImpl.invoke0(Native Method)
		at sun.reflect.NativeMethodAccessorImpl.invoke(NativeMethodAccessorImpl.java:57)
		at sun.reflect.DelegatingMethodAccessorImpl.invoke(DelegatingMethodAccessorImpl.java:43)
		at java.lang.reflect.Method.invoke(Method.java:616)
		at com.carrotsearch.randomizedtesting.RandomizedRunner.invoke(RandomizedRunner.java:1559)
		at com.carrotsearch.randomizedtesting.RandomizedRunner.access$600(RandomizedRunner.java:79)
		at com.carrotsearch.randomizedtesting.RandomizedRunner$6.evaluate(RandomizedRunner.java:737)
		at com.carrotsearch.randomizedtesting.RandomizedRunner$7.evaluate(RandomizedRunner.java:773)
		at com.carrotsearch.randomizedtesting.RandomizedRunner$8.evaluate(RandomizedRunner.java:787)
		at com.carrotsearch.randomizedtesting.rules.SystemPropertiesRestoreRule$1.evaluate(SystemPropertiesRestoreRule.java:53)
		at org.apache.lucene.util.TestRuleSetupTeardownChained$1.evaluate(TestRuleSetupTeardownChained.java:50)
		at org.apache.lucene.util.TestRuleFieldCacheSanity$1.evaluate(TestRuleFieldCacheSanity.java:51)
		at org.apache.lucene.util.AbstractBeforeAfterRule$1.evaluate(AbstractBeforeAfterRule.java:45)
		at com.carrotsearch.randomizedtesting.rules.SystemPropertiesInvariantRule$1.evaluate(SystemPropertiesInvariantRule.java:55)
		at org.apache.lucene.util.TestRuleThreadAndTestName$1.evaluate(TestRuleThreadAndTestName.java:48)
		at org.apache.lucene.util.TestRuleIgnoreAfterMaxFailures$1.evaluate(TestRuleIgnoreAfterMaxFailures.java:70)
		at org.apache.lucene.util.TestRuleMarkFailure$1.evaluate(TestRuleMarkFailure.java:48)
		at com.carrotsearch.randomizedtesting.rules.StatementAdapter.evaluate(StatementAdapter.java:36)
		at com.carrotsearch.randomizedtesting.ThreadLeakControl$StatementRunner.run(ThreadLeakControl.java:345)
		at com.carrotsearch.randomizedtesting.ThreadLeakControl.forkTimeoutingTask(ThreadLeakControl.java:769)
		at com.carrotsearch.randomizedtesting.ThreadLeakControl$3.evaluate(ThreadLeakControl.java:429)
		at com.carrotsearch.randomizedtesting.RandomizedRunner.runSingleTest(RandomizedRunner.java:746)
		at com.carrotsearch.randomizedtesting.RandomizedRunner$3.evaluate(RandomizedRunner.java:648)
		at com.carrotsearch.randomizedtesting.RandomizedRunner$4.evaluate(RandomizedRunner.java:682)
		at com.carrotsearch.randomizedtesting.RandomizedRunner$5.evaluate(RandomizedRunner.java:693)
		at com.carrotsearch.randomizedtesting.rules.StatementAdapter.evaluate(StatementAdapter.java:36)
		at com.carrotsearch.randomizedtesting.rules.SystemPropertiesRestoreRule$1.evaluate(SystemPropertiesRestoreRule.java:53)
		at org.apache.lucene.util.AbstractBeforeAfterRule$1.evaluate(AbstractBeforeAfterRule.java:45)
		at org.apache.lucene.util.TestRuleStoreClassName$1.evaluate(TestRuleStoreClassName.java:42)
		at com.carrotsearch.randomizedtesting.rules.SystemPropertiesInvariantRule$1.evaluate(SystemPropertiesInvariantRule.java:55)
		at com.carrotsearch.randomizedtesting.rules.NoShadowingOrOverridesOnMethodsRule$1.evaluate(NoShadowingOrOverridesOnMethodsRule.java:39)
		at com.carrotsearch.randomizedtesting.rules.NoShadowingOrOverridesOnMethodsRule$1.evaluate(NoShadowingOrOverridesOnMethodsRule.java:39)
		at org.apache.lucene.util.TestRuleAssertionsRequired$1.evaluate(TestRuleAssertionsRequired.java:40)
		at org.apache.lucene.util.TestRuleMarkFailure$1.evaluate(TestRuleMarkFailure.java:48)
		at org.apache.lucene.util.TestRuleIgnoreAfterMaxFailures$1.evaluate(TestRuleIgnoreAfterMaxFailures.java:70)
		at org.apache.lucene.util.TestRuleIgnoreTestSuites$1.evaluate(TestRuleIgnoreTestSuites.java:55)
		at com.carrotsearch.randomizedtesting.rules.StatementAdapter.evaluate(StatementAdapter.java:36)
		at com.carrotsearch.randomizedtesting.ThreadLeakControl$StatementRunner.run(ThreadLeakControl.java:345)
		at java.lang.Thread.run(Thread.java:679)
	
3322 T1520 C3 oasc.SolrException.log SEVERE org.apache.solr.common.SolrException: range facet infinite loop: gap is either zero, or too small relative start/end and caused underflow: 23.0 + 0 = 23.0
		at org.apache.solr.request.SimpleFacets.getFacetRangeCounts(SimpleFacets.java:1122)
		at org.apache.solr.request.SimpleFacets.getFacetRangeCounts(SimpleFacets.java:1074)
		at org.apache.solr.request.SimpleFacets.getFacetRangeCounts(SimpleFacets.java:1018)
		at org.apache.solr.request.SimpleFacets.getFacetCounts(SimpleFacets.java:208)
		at org.apache.solr.handler.component.FacetComponent.process(FacetComponent.java:87)
		at org.apache.solr.handler.component.SearchHandler.handleRequestBody(SearchHandler.java:206)
		at org.apache.solr.handler.RequestHandlerBase.handleRequest(RequestHandlerBase.java:129)
		at org.apache.solr.core.SolrCore.execute(SolrCore.java:1692)
		at org.apache.solr.util.TestHarness.query(TestHarness.java:351)
		at org.apache.solr.util.TestHarness.query(TestHarness.java:333)
		at org.apache.solr.SolrTestCaseJ4.assertQEx(SolrTestCaseJ4.java:601)
		at org.apache.solr.request.SimpleFacetsTest.testRangeFacetInfiniteLoopDetection(SimpleFacetsTest.java:2018)
		at sun.reflect.NativeMethodAccessorImpl.invoke0(Native Method)
		at sun.reflect.NativeMethodAccessorImpl.invoke(NativeMethodAccessorImpl.java:57)
		at sun.reflect.DelegatingMethodAccessorImpl.invoke(DelegatingMethodAccessorImpl.java:43)
		at java.lang.reflect.Method.invoke(Method.java:616)
		at com.carrotsearch.randomizedtesting.RandomizedRunner.invoke(RandomizedRunner.java:1559)
		at com.carrotsearch.randomizedtesting.RandomizedRunner.access$600(RandomizedRunner.java:79)
		at com.carrotsearch.randomizedtesting.RandomizedRunner$6.evaluate(RandomizedRunner.java:737)
		at com.carrotsearch.randomizedtesting.RandomizedRunner$7.evaluate(RandomizedRunner.java:773)
		at com.carrotsearch.randomizedtesting.RandomizedRunner$8.evaluate(RandomizedRunner.java:787)
		at com.carrotsearch.randomizedtesting.rules.SystemPropertiesRestoreRule$1.evaluate(SystemPropertiesRestoreRule.java:53)
		at org.apache.lucene.util.TestRuleSetupTeardownChained$1.evaluate(TestRuleSetupTeardownChained.java:50)
		at org.apache.lucene.util.TestRuleFieldCacheSanity$1.evaluate(TestRuleFieldCacheSanity.java:51)
		at org.apache.lucene.util.AbstractBeforeAfterRule$1.evaluate(AbstractBeforeAfterRule.java:45)
		at com.carrotsearch.randomizedtesting.rules.SystemPropertiesInvariantRule$1.evaluate(SystemPropertiesInvariantRule.java:55)
		at org.apache.lucene.util.TestRuleThreadAndTestName$1.evaluate(TestRuleThreadAndTestName.java:48)
		at org.apache.lucene.util.TestRuleIgnoreAfterMaxFailures$1.evaluate(TestRuleIgnoreAfterMaxFailures.java:70)
		at org.apache.lucene.util.TestRuleMarkFailure$1.evaluate(TestRuleMarkFailure.java:48)
		at com.carrotsearch.randomizedtesting.rules.StatementAdapter.evaluate(StatementAdapter.java:36)
		at com.carrotsearch.randomizedtesting.ThreadLeakControl$StatementRunner.run(ThreadLeakControl.java:345)
		at com.carrotsearch.randomizedtesting.ThreadLeakControl.forkTimeoutingTask(ThreadLeakControl.java:769)
		at com.carrotsearch.randomizedtesting.ThreadLeakControl$3.evaluate(ThreadLeakControl.java:429)
		at com.carrotsearch.randomizedtesting.RandomizedRunner.runSingleTest(RandomizedRunner.java:746)
		at com.carrotsearch.randomizedtesting.RandomizedRunner$3.evaluate(RandomizedRunner.java:648)
		at com.carrotsearch.randomizedtesting.RandomizedRunner$4.evaluate(RandomizedRunner.java:682)
		at com.carrotsearch.randomizedtesting.RandomizedRunner$5.evaluate(RandomizedRunner.java:693)
		at com.carrotsearch.randomizedtesting.rules.StatementAdapter.evaluate(StatementAdapter.java:36)
		at com.carrotsearch.randomizedtesting.rules.SystemPropertiesRestoreRule$1.evaluate(SystemPropertiesRestoreRule.java:53)
		at org.apache.lucene.util.AbstractBeforeAfterRule$1.evaluate(AbstractBeforeAfterRule.java:45)
		at org.apache.lucene.util.TestRuleStoreClassName$1.evaluate(TestRuleStoreClassName.java:42)
		at com.carrotsearch.randomizedtesting.rules.SystemPropertiesInvariantRule$1.evaluate(SystemPropertiesInvariantRule.java:55)
		at com.carrotsearch.randomizedtesting.rules.NoShadowingOrOverridesOnMethodsRule$1.evaluate(NoShadowingOrOverridesOnMethodsRule.java:39)
		at com.carrotsearch.randomizedtesting.rules.NoShadowingOrOverridesOnMethodsRule$1.evaluate(NoShadowingOrOverridesOnMethodsRule.java:39)
		at org.apache.lucene.util.TestRuleAssertionsRequired$1.evaluate(TestRuleAssertionsRequired.java:40)
		at org.apache.lucene.util.TestRuleMarkFailure$1.evaluate(TestRuleMarkFailure.java:48)
		at org.apache.lucene.util.TestRuleIgnoreAfterMaxFailures$1.evaluate(TestRuleIgnoreAfterMaxFailures.java:70)
		at org.apache.lucene.util.TestRuleIgnoreTestSuites$1.evaluate(TestRuleIgnoreTestSuites.java:55)
		at com.carrotsearch.randomizedtesting.rules.StatementAdapter.evaluate(StatementAdapter.java:36)
		at com.carrotsearch.randomizedtesting.ThreadLeakControl$StatementRunner.run(ThreadLeakControl.java:345)
		at java.lang.Thread.run(Thread.java:679)
	
3323 T1520 C3 oasc.SolrException.log SEVERE org.apache.solr.common.SolrException: range facet infinite loop: gap is either zero, or too small relative start/end and caused underflow: 23 + 0 = 23
		at org.apache.solr.request.SimpleFacets.getFacetRangeCounts(SimpleFacets.java:1122)
		at org.apache.solr.request.SimpleFacets.getFacetRangeCounts(SimpleFacets.java:1074)
		at org.apache.solr.request.SimpleFacets.getFacetRangeCounts(SimpleFacets.java:1018)
		at org.apache.solr.request.SimpleFacets.getFacetCounts(SimpleFacets.java:208)
		at org.apache.solr.handler.component.FacetComponent.process(FacetComponent.java:87)
		at org.apache.solr.handler.component.SearchHandler.handleRequestBody(SearchHandler.java:206)
		at org.apache.solr.handler.RequestHandlerBase.handleRequest(RequestHandlerBase.java:129)
		at org.apache.solr.core.SolrCore.execute(SolrCore.java:1692)
		at org.apache.solr.util.TestHarness.query(TestHarness.java:351)
		at org.apache.solr.util.TestHarness.query(TestHarness.java:333)
		at org.apache.solr.SolrTestCaseJ4.assertQEx(SolrTestCaseJ4.java:601)
		at org.apache.solr.request.SimpleFacetsTest.testRangeFacetInfiniteLoopDetection(SimpleFacetsTest.java:2018)
		at sun.reflect.NativeMethodAccessorImpl.invoke0(Native Method)
		at sun.reflect.NativeMethodAccessorImpl.invoke(NativeMethodAccessorImpl.java:57)
		at sun.reflect.DelegatingMethodAccessorImpl.invoke(DelegatingMethodAccessorImpl.java:43)
		at java.lang.reflect.Method.invoke(Method.java:616)
		at com.carrotsearch.randomizedtesting.RandomizedRunner.invoke(RandomizedRunner.java:1559)
		at com.carrotsearch.randomizedtesting.RandomizedRunner.access$600(RandomizedRunner.java:79)
		at com.carrotsearch.randomizedtesting.RandomizedRunner$6.evaluate(RandomizedRunner.java:737)
		at com.carrotsearch.randomizedtesting.RandomizedRunner$7.evaluate(RandomizedRunner.java:773)
		at com.carrotsearch.randomizedtesting.RandomizedRunner$8.evaluate(RandomizedRunner.java:787)
		at com.carrotsearch.randomizedtesting.rules.SystemPropertiesRestoreRule$1.evaluate(SystemPropertiesRestoreRule.java:53)
		at org.apache.lucene.util.TestRuleSetupTeardownChained$1.evaluate(TestRuleSetupTeardownChained.java:50)
		at org.apache.lucene.util.TestRuleFieldCacheSanity$1.evaluate(TestRuleFieldCacheSanity.java:51)
		at org.apache.lucene.util.AbstractBeforeAfterRule$1.evaluate(AbstractBeforeAfterRule.java:45)
		at com.carrotsearch.randomizedtesting.rules.SystemPropertiesInvariantRule$1.evaluate(SystemPropertiesInvariantRule.java:55)
		at org.apache.lucene.util.TestRuleThreadAndTestName$1.evaluate(TestRuleThreadAndTestName.java:48)
		at org.apache.lucene.util.TestRuleIgnoreAfterMaxFailures$1.evaluate(TestRuleIgnoreAfterMaxFailures.java:70)
		at org.apache.lucene.util.TestRuleMarkFailure$1.evaluate(TestRuleMarkFailure.java:48)
		at com.carrotsearch.randomizedtesting.rules.StatementAdapter.evaluate(StatementAdapter.java:36)
		at com.carrotsearch.randomizedtesting.ThreadLeakControl$StatementRunner.run(ThreadLeakControl.java:345)
		at com.carrotsearch.randomizedtesting.ThreadLeakControl.forkTimeoutingTask(ThreadLeakControl.java:769)
		at com.carrotsearch.randomizedtesting.ThreadLeakControl$3.evaluate(ThreadLeakControl.java:429)
		at com.carrotsearch.randomizedtesting.RandomizedRunner.runSingleTest(RandomizedRunner.java:746)
		at com.carrotsearch.randomizedtesting.RandomizedRunner$3.evaluate(RandomizedRunner.java:648)
		at com.carrotsearch.randomizedtesting.RandomizedRunner$4.evaluate(RandomizedRunner.java:682)
		at com.carrotsearch.randomizedtesting.RandomizedRunner$5.evaluate(RandomizedRunner.java:693)
		at com.carrotsearch.randomizedtesting.rules.StatementAdapter.evaluate(StatementAdapter.java:36)
		at com.carrotsearch.randomizedtesting.rules.SystemPropertiesRestoreRule$1.evaluate(SystemPropertiesRestoreRule.java:53)
		at org.apache.lucene.util.AbstractBeforeAfterRule$1.evaluate(AbstractBeforeAfterRule.java:45)
		at org.apache.lucene.util.TestRuleStoreClassName$1.evaluate(TestRuleStoreClassName.java:42)
		at com.carrotsearch.randomizedtesting.rules.SystemPropertiesInvariantRule$1.evaluate(SystemPropertiesInvariantRule.java:55)
		at com.carrotsearch.randomizedtesting.rules.NoShadowingOrOverridesOnMethodsRule$1.evaluate(NoShadowingOrOverridesOnMethodsRule.java:39)
		at com.carrotsearch.randomizedtesting.rules.NoShadowingOrOverridesOnMethodsRule$1.evaluate(NoShadowingOrOverridesOnMethodsRule.java:39)
		at org.apache.lucene.util.TestRuleAssertionsRequired$1.evaluate(TestRuleAssertionsRequired.java:40)
		at org.apache.lucene.util.TestRuleMarkFailure$1.evaluate(TestRuleMarkFailure.java:48)
		at org.apache.lucene.util.TestRuleIgnoreAfterMaxFailures$1.evaluate(TestRuleIgnoreAfterMaxFailures.java:70)
		at org.apache.lucene.util.TestRuleIgnoreTestSuites$1.evaluate(TestRuleIgnoreTestSuites.java:55)
		at com.carrotsearch.randomizedtesting.rules.StatementAdapter.evaluate(StatementAdapter.java:36)
		at com.carrotsearch.randomizedtesting.ThreadLeakControl$StatementRunner.run(ThreadLeakControl.java:345)
		at java.lang.Thread.run(Thread.java:679)
	
3324 T1520 C3 oasc.SolrException.log SEVERE org.apache.solr.common.SolrException: range facet infinite loop: gap is either zero, or too small relative start/end and caused underflow: 23 + 0 = 23
		at org.apache.solr.request.SimpleFacets.getFacetRangeCounts(SimpleFacets.java:1122)
		at org.apache.solr.request.SimpleFacets.getFacetRangeCounts(SimpleFacets.java:1074)
		at org.apache.solr.request.SimpleFacets.getFacetRangeCounts(SimpleFacets.java:1018)
		at org.apache.solr.request.SimpleFacets.getFacetCounts(SimpleFacets.java:208)
		at org.apache.solr.handler.component.FacetComponent.process(FacetComponent.java:87)
		at org.apache.solr.handler.component.SearchHandler.handleRequestBody(SearchHandler.java:206)
		at org.apache.solr.handler.RequestHandlerBase.handleRequest(RequestHandlerBase.java:129)
		at org.apache.solr.core.SolrCore.execute(SolrCore.java:1692)
		at org.apache.solr.util.TestHarness.query(TestHarness.java:351)
		at org.apache.solr.util.TestHarness.query(TestHarness.java:333)
		at org.apache.solr.SolrTestCaseJ4.assertQEx(SolrTestCaseJ4.java:601)
		at org.apache.solr.request.SimpleFacetsTest.testRangeFacetInfiniteLoopDetection(SimpleFacetsTest.java:2018)
		at sun.reflect.NativeMethodAccessorImpl.invoke0(Native Method)
		at sun.reflect.NativeMethodAccessorImpl.invoke(NativeMethodAccessorImpl.java:57)
		at sun.reflect.DelegatingMethodAccessorImpl.invoke(DelegatingMethodAccessorImpl.java:43)
		at java.lang.reflect.Method.invoke(Method.java:616)
		at com.carrotsearch.randomizedtesting.RandomizedRunner.invoke(RandomizedRunner.java:1559)
		at com.carrotsearch.randomizedtesting.RandomizedRunner.access$600(RandomizedRunner.java:79)
		at com.carrotsearch.randomizedtesting.RandomizedRunner$6.evaluate(RandomizedRunner.java:737)
		at com.carrotsearch.randomizedtesting.RandomizedRunner$7.evaluate(RandomizedRunner.java:773)
		at com.carrotsearch.randomizedtesting.RandomizedRunner$8.evaluate(RandomizedRunner.java:787)
		at com.carrotsearch.randomizedtesting.rules.SystemPropertiesRestoreRule$1.evaluate(SystemPropertiesRestoreRule.java:53)
		at org.apache.lucene.util.TestRuleSetupTeardownChained$1.evaluate(TestRuleSetupTeardownChained.java:50)
		at org.apache.lucene.util.TestRuleFieldCacheSanity$1.evaluate(TestRuleFieldCacheSanity.java:51)
		at org.apache.lucene.util.AbstractBeforeAfterRule$1.evaluate(AbstractBeforeAfterRule.java:45)
		at com.carrotsearch.randomizedtesting.rules.SystemPropertiesInvariantRule$1.evaluate(SystemPropertiesInvariantRule.java:55)
		at org.apache.lucene.util.TestRuleThreadAndTestName$1.evaluate(TestRuleThreadAndTestName.java:48)
		at org.apache.lucene.util.TestRuleIgnoreAfterMaxFailures$1.evaluate(TestRuleIgnoreAfterMaxFailures.java:70)
		at org.apache.lucene.util.TestRuleMarkFailure$1.evaluate(TestRuleMarkFailure.java:48)
		at com.carrotsearch.randomizedtesting.rules.StatementAdapter.evaluate(StatementAdapter.java:36)
		at com.carrotsearch.randomizedtesting.ThreadLeakControl$StatementRunner.run(ThreadLeakControl.java:345)
		at com.carrotsearch.randomizedtesting.ThreadLeakControl.forkTimeoutingTask(ThreadLeakControl.java:769)
		at com.carrotsearch.randomizedtesting.ThreadLeakControl$3.evaluate(ThreadLeakControl.java:429)
		at com.carrotsearch.randomizedtesting.RandomizedRunner.runSingleTest(RandomizedRunner.java:746)
		at com.carrotsearch.randomizedtesting.RandomizedRunner$3.evaluate(RandomizedRunner.java:648)
		at com.carrotsearch.randomizedtesting.RandomizedRunner$4.evaluate(RandomizedRunner.java:682)
		at com.carrotsearch.randomizedtesting.RandomizedRunner$5.evaluate(RandomizedRunner.java:693)
		at com.carrotsearch.randomizedtesting.rules.StatementAdapter.evaluate(StatementAdapter.java:36)
		at com.carrotsearch.randomizedtesting.rules.SystemPropertiesRestoreRule$1.evaluate(SystemPropertiesRestoreRule.java:53)
		at org.apache.lucene.util.AbstractBeforeAfterRule$1.evaluate(AbstractBeforeAfterRule.java:45)
		at org.apache.lucene.util.TestRuleStoreClassName$1.evaluate(TestRuleStoreClassName.java:42)
		at com.carrotsearch.randomizedtesting.rules.SystemPropertiesInvariantRule$1.evaluate(SystemPropertiesInvariantRule.java:55)
		at com.carrotsearch.randomizedtesting.rules.NoShadowingOrOverridesOnMethodsRule$1.evaluate(NoShadowingOrOverridesOnMethodsRule.java:39)
		at com.carrotsearch.randomizedtesting.rules.NoShadowingOrOverridesOnMethodsRule$1.evaluate(NoShadowingOrOverridesOnMethodsRule.java:39)
		at org.apache.lucene.util.TestRuleAssertionsRequired$1.evaluate(TestRuleAssertionsRequired.java:40)
		at org.apache.lucene.util.TestRuleMarkFailure$1.evaluate(TestRuleMarkFailure.java:48)
		at org.apache.lucene.util.TestRuleIgnoreAfterMaxFailures$1.evaluate(TestRuleIgnoreAfterMaxFailures.java:70)
		at org.apache.lucene.util.TestRuleIgnoreTestSuites$1.evaluate(TestRuleIgnoreTestSuites.java:55)
		at com.carrotsearch.randomizedtesting.rules.StatementAdapter.evaluate(StatementAdapter.java:36)
		at com.carrotsearch.randomizedtesting.ThreadLeakControl$StatementRunner.run(ThreadLeakControl.java:345)
		at java.lang.Thread.run(Thread.java:679)
	
3326 T1520 C3 oasc.SolrException.log SEVERE org.apache.solr.common.SolrException: date facet infinite loop: gap is effectively zero
		at org.apache.solr.request.SimpleFacets.getFacetDateCounts(SimpleFacets.java:928)
		at org.apache.solr.request.SimpleFacets.getFacetDateCounts(SimpleFacets.java:837)
		at org.apache.solr.request.SimpleFacets.getFacetCounts(SimpleFacets.java:207)
		at org.apache.solr.handler.component.FacetComponent.process(FacetComponent.java:87)
		at org.apache.solr.handler.component.SearchHandler.handleRequestBody(SearchHandler.java:206)
		at org.apache.solr.handler.RequestHandlerBase.handleRequest(RequestHandlerBase.java:129)
		at org.apache.solr.core.SolrCore.execute(SolrCore.java:1692)
		at org.apache.solr.util.TestHarness.query(TestHarness.java:351)
		at org.apache.solr.util.TestHarness.query(TestHarness.java:333)
		at org.apache.solr.SolrTestCaseJ4.assertQEx(SolrTestCaseJ4.java:601)
		at org.apache.solr.request.SimpleFacetsTest.testRangeFacetInfiniteLoopDetection(SimpleFacetsTest.java:2029)
		at sun.reflect.NativeMethodAccessorImpl.invoke0(Native Method)
		at sun.reflect.NativeMethodAccessorImpl.invoke(NativeMethodAccessorImpl.java:57)
		at sun.reflect.DelegatingMethodAccessorImpl.invoke(DelegatingMethodAccessorImpl.java:43)
		at java.lang.reflect.Method.invoke(Method.java:616)
		at com.carrotsearch.randomizedtesting.RandomizedRunner.invoke(RandomizedRunner.java:1559)
		at com.carrotsearch.randomizedtesting.RandomizedRunner.access$600(RandomizedRunner.java:79)
		at com.carrotsearch.randomizedtesting.RandomizedRunner$6.evaluate(RandomizedRunner.java:737)
		at com.carrotsearch.randomizedtesting.RandomizedRunner$7.evaluate(RandomizedRunner.java:773)
		at com.carrotsearch.randomizedtesting.RandomizedRunner$8.evaluate(RandomizedRunner.java:787)
		at com.carrotsearch.randomizedtesting.rules.SystemPropertiesRestoreRule$1.evaluate(SystemPropertiesRestoreRule.java:53)
		at org.apache.lucene.util.TestRuleSetupTeardownChained$1.evaluate(TestRuleSetupTeardownChained.java:50)
		at org.apache.lucene.util.TestRuleFieldCacheSanity$1.evaluate(TestRuleFieldCacheSanity.java:51)
		at org.apache.lucene.util.AbstractBeforeAfterRule$1.evaluate(AbstractBeforeAfterRule.java:45)
		at com.carrotsearch.randomizedtesting.rules.SystemPropertiesInvariantRule$1.evaluate(SystemPropertiesInvariantRule.java:55)
		at org.apache.lucene.util.TestRuleThreadAndTestName$1.evaluate(TestRuleThreadAndTestName.java:48)
		at org.apache.lucene.util.TestRuleIgnoreAfterMaxFailures$1.evaluate(TestRuleIgnoreAfterMaxFailures.java:70)
		at org.apache.lucene.util.TestRuleMarkFailure$1.evaluate(TestRuleMarkFailure.java:48)
		at com.carrotsearch.randomizedtesting.rules.StatementAdapter.evaluate(StatementAdapter.java:36)
		at com.carrotsearch.randomizedtesting.ThreadLeakControl$StatementRunner.run(ThreadLeakControl.java:345)
		at com.carrotsearch.randomizedtesting.ThreadLeakControl.forkTimeoutingTask(ThreadLeakControl.java:769)
		at com.carrotsearch.randomizedtesting.ThreadLeakControl$3.evaluate(ThreadLeakControl.java:429)
		at com.carrotsearch.randomizedtesting.RandomizedRunner.runSingleTest(RandomizedRunner.java:746)
		at com.carrotsearch.randomizedtesting.RandomizedRunner$3.evaluate(RandomizedRunner.java:648)
		at com.carrotsearch.randomizedtesting.RandomizedRunner$4.evaluate(RandomizedRunner.java:682)
		at com.carrotsearch.randomizedtesting.RandomizedRunner$5.evaluate(RandomizedRunner.java:693)
		at com.carrotsearch.randomizedtesting.rules.StatementAdapter.evaluate(StatementAdapter.java:36)
		at com.carrotsearch.randomizedtesting.rules.SystemPropertiesRestoreRule$1.evaluate(SystemPropertiesRestoreRule.java:53)
		at org.apache.lucene.util.AbstractBeforeAfterRule$1.evaluate(AbstractBeforeAfterRule.java:45)
		at org.apache.lucene.util.TestRuleStoreClassName$1.evaluate(TestRuleStoreClassName.java:42)
		at com.carrotsearch.randomizedtesting.rules.SystemPropertiesInvariantRule$1.evaluate(SystemPropertiesInvariantRule.java:55)
		at com.carrotsearch.randomizedtesting.rules.NoShadowingOrOverridesOnMethodsRule$1.evaluate(NoShadowingOrOverridesOnMethodsRule.java:39)
		at com.carrotsearch.randomizedtesting.rules.NoShadowingOrOverridesOnMethodsRule$1.evaluate(NoShadowingOrOverridesOnMethodsRule.java:39)
		at org.apache.lucene.util.TestRuleAssertionsRequired$1.evaluate(TestRuleAssertionsRequired.java:40)
		at org.apache.lucene.util.TestRuleMarkFailure$1.evaluate(TestRuleMarkFailure.java:48)
		at org.apache.lucene.util.TestRuleIgnoreAfterMaxFailures$1.evaluate(TestRuleIgnoreAfterMaxFailures.java:70)
		at org.apache.lucene.util.TestRuleIgnoreTestSuites$1.evaluate(TestRuleIgnoreTestSuites.java:55)
		at com.carrotsearch.randomizedtesting.rules.StatementAdapter.evaluate(StatementAdapter.java:36)
		at com.carrotsearch.randomizedtesting.ThreadLeakControl$StatementRunner.run(ThreadLeakControl.java:345)
		at java.lang.Thread.run(Thread.java:679)
	
3327 T1520 C3 oasc.SolrException.log SEVERE org.apache.solr.common.SolrException: range facet infinite loop: gap is either zero, or too small relative start/end and caused underflow: Mon Sep 03 12:47:13 CWST 2012 + +0DAYS = Mon Sep 03 12:47:13 CWST 2012
		at org.apache.solr.request.SimpleFacets.getFacetRangeCounts(SimpleFacets.java:1122)
		at org.apache.solr.request.SimpleFacets.getFacetRangeCounts(SimpleFacets.java:1074)
		at org.apache.solr.request.SimpleFacets.getFacetRangeCounts(SimpleFacets.java:1018)
		at org.apache.solr.request.SimpleFacets.getFacetCounts(SimpleFacets.java:208)
		at org.apache.solr.handler.component.FacetComponent.process(FacetComponent.java:87)
		at org.apache.solr.handler.component.SearchHandler.handleRequestBody(SearchHandler.java:206)
		at org.apache.solr.handler.RequestHandlerBase.handleRequest(RequestHandlerBase.java:129)
		at org.apache.solr.core.SolrCore.execute(SolrCore.java:1692)
		at org.apache.solr.util.TestHarness.query(TestHarness.java:351)
		at org.apache.solr.util.TestHarness.query(TestHarness.java:333)
		at org.apache.solr.SolrTestCaseJ4.assertQEx(SolrTestCaseJ4.java:601)
		at org.apache.solr.request.SimpleFacetsTest.testRangeFacetInfiniteLoopDetection(SimpleFacetsTest.java:2029)
		at sun.reflect.NativeMethodAccessorImpl.invoke0(Native Method)
		at sun.reflect.NativeMethodAccessorImpl.invoke(NativeMethodAccessorImpl.java:57)
		at sun.reflect.DelegatingMethodAccessorImpl.invoke(DelegatingMethodAccessorImpl.java:43)
		at java.lang.reflect.Method.invoke(Method.java:616)
		at com.carrotsearch.randomizedtesting.RandomizedRunner.invoke(RandomizedRunner.java:1559)
		at com.carrotsearch.randomizedtesting.RandomizedRunner.access$600(RandomizedRunner.java:79)
		at com.carrotsearch.randomizedtesting.RandomizedRunner$6.evaluate(RandomizedRunner.java:737)
		at com.carrotsearch.randomizedtesting.RandomizedRunner$7.evaluate(RandomizedRunner.java:773)
		at com.carrotsearch.randomizedtesting.RandomizedRunner$8.evaluate(RandomizedRunner.java:787)
		at com.carrotsearch.randomizedtesting.rules.SystemPropertiesRestoreRule$1.evaluate(SystemPropertiesRestoreRule.java:53)
		at org.apache.lucene.util.TestRuleSetupTeardownChained$1.evaluate(TestRuleSetupTeardownChained.java:50)
		at org.apache.lucene.util.TestRuleFieldCacheSanity$1.evaluate(TestRuleFieldCacheSanity.java:51)
		at org.apache.lucene.util.AbstractBeforeAfterRule$1.evaluate(AbstractBeforeAfterRule.java:45)
		at com.carrotsearch.randomizedtesting.rules.SystemPropertiesInvariantRule$1.evaluate(SystemPropertiesInvariantRule.java:55)
		at org.apache.lucene.util.TestRuleThreadAndTestName$1.evaluate(TestRuleThreadAndTestName.java:48)
		at org.apache.lucene.util.TestRuleIgnoreAfterMaxFailures$1.evaluate(TestRuleIgnoreAfterMaxFailures.java:70)
		at org.apache.lucene.util.TestRuleMarkFailure$1.evaluate(TestRuleMarkFailure.java:48)
		at com.carrotsearch.randomizedtesting.rules.StatementAdapter.evaluate(StatementAdapter.java:36)
		at com.carrotsearch.randomizedtesting.ThreadLeakControl$StatementRunner.run(ThreadLeakControl.java:345)
		at com.carrotsearch.randomizedtesting.ThreadLeakControl.forkTimeoutingTask(ThreadLeakControl.java:769)
		at com.carrotsearch.randomizedtesting.ThreadLeakControl$3.evaluate(ThreadLeakControl.java:429)
		at com.carrotsearch.randomizedtesting.RandomizedRunner.runSingleTest(RandomizedRunner.java:746)
		at com.carrotsearch.randomizedtesting.RandomizedRunner$3.evaluate(RandomizedRunner.java:648)
		at com.carrotsearch.randomizedtesting.RandomizedRunner$4.evaluate(RandomizedRunner.java:682)
		at com.carrotsearch.randomizedtesting.RandomizedRunner$5.evaluate(RandomizedRunner.java:693)
		at com.carrotsearch.randomizedtesting.rules.StatementAdapter.evaluate(StatementAdapter.java:36)
		at com.carrotsearch.randomizedtesting.rules.SystemPropertiesRestoreRule$1.evaluate(SystemPropertiesRestoreRule.java:53)
		at org.apache.lucene.util.AbstractBeforeAfterRule$1.evaluate(AbstractBeforeAfterRule.java:45)
		at org.apache.lucene.util.TestRuleStoreClassName$1.evaluate(TestRuleStoreClassName.java:42)
		at com.carrotsearch.randomizedtesting.rules.SystemPropertiesInvariantRule$1.evaluate(SystemPropertiesInvariantRule.java:55)
		at com.carrotsearch.randomizedtesting.rules.NoShadowingOrOverridesOnMethodsRule$1.evaluate(NoShadowingOrOverridesOnMethodsRule.java:39)
		at com.carrotsearch.randomizedtesting.rules.NoShadowingOrOverridesOnMethodsRule$1.evaluate(NoShadowingOrOverridesOnMethodsRule.java:39)
		at org.apache.lucene.util.TestRuleAssertionsRequired$1.evaluate(TestRuleAssertionsRequired.java:40)
		at org.apache.lucene.util.TestRuleMarkFailure$1.evaluate(TestRuleMarkFailure.java:48)
		at org.apache.lucene.util.TestRuleIgnoreAfterMaxFailures$1.evaluate(TestRuleIgnoreAfterMaxFailures.java:70)
		at org.apache.lucene.util.TestRuleIgnoreTestSuites$1.evaluate(TestRuleIgnoreTestSuites.java:55)
		at com.carrotsearch.randomizedtesting.rules.StatementAdapter.evaluate(StatementAdapter.java:36)
		at com.carrotsearch.randomizedtesting.ThreadLeakControl$StatementRunner.run(ThreadLeakControl.java:345)
		at java.lang.Thread.run(Thread.java:679)
	
3328 T1520 C3 oasc.SolrException.log SEVERE org.apache.solr.common.SolrException: date facet infinite loop: gap is effectively zero
		at org.apache.solr.request.SimpleFacets.getFacetDateCounts(SimpleFacets.java:928)
		at org.apache.solr.request.SimpleFacets.getFacetDateCounts(SimpleFacets.java:837)
		at org.apache.solr.request.SimpleFacets.getFacetCounts(SimpleFacets.java:207)
		at org.apache.solr.handler.component.FacetComponent.process(FacetComponent.java:87)
		at org.apache.solr.handler.component.SearchHandler.handleRequestBody(SearchHandler.java:206)
		at org.apache.solr.handler.RequestHandlerBase.handleRequest(RequestHandlerBase.java:129)
		at org.apache.solr.core.SolrCore.execute(SolrCore.java:1692)
		at org.apache.solr.util.TestHarness.query(TestHarness.java:351)
		at org.apache.solr.util.TestHarness.query(TestHarness.java:333)
		at org.apache.solr.SolrTestCaseJ4.assertQEx(SolrTestCaseJ4.java:601)
		at org.apache.solr.request.SimpleFacetsTest.testRangeFacetInfiniteLoopDetection(SimpleFacetsTest.java:2029)
		at sun.reflect.NativeMethodAccessorImpl.invoke0(Native Method)
		at sun.reflect.NativeMethodAccessorImpl.invoke(NativeMethodAccessorImpl.java:57)
		at sun.reflect.DelegatingMethodAccessorImpl.invoke(DelegatingMethodAccessorImpl.java:43)
		at java.lang.reflect.Method.invoke(Method.java:616)
		at com.carrotsearch.randomizedtesting.RandomizedRunner.invoke(RandomizedRunner.java:1559)
		at com.carrotsearch.randomizedtesting.RandomizedRunner.access$600(RandomizedRunner.java:79)
		at com.carrotsearch.randomizedtesting.RandomizedRunner$6.evaluate(RandomizedRunner.java:737)
		at com.carrotsearch.randomizedtesting.RandomizedRunner$7.evaluate(RandomizedRunner.java:773)
		at com.carrotsearch.randomizedtesting.RandomizedRunner$8.evaluate(RandomizedRunner.java:787)
		at com.carrotsearch.randomizedtesting.rules.SystemPropertiesRestoreRule$1.evaluate(SystemPropertiesRestoreRule.java:53)
		at org.apache.lucene.util.TestRuleSetupTeardownChained$1.evaluate(TestRuleSetupTeardownChained.java:50)
		at org.apache.lucene.util.TestRuleFieldCacheSanity$1.evaluate(TestRuleFieldCacheSanity.java:51)
		at org.apache.lucene.util.AbstractBeforeAfterRule$1.evaluate(AbstractBeforeAfterRule.java:45)
		at com.carrotsearch.randomizedtesting.rules.SystemPropertiesInvariantRule$1.evaluate(SystemPropertiesInvariantRule.java:55)
		at org.apache.lucene.util.TestRuleThreadAndTestName$1.evaluate(TestRuleThreadAndTestName.java:48)
		at org.apache.lucene.util.TestRuleIgnoreAfterMaxFailures$1.evaluate(TestRuleIgnoreAfterMaxFailures.java:70)
		at org.apache.lucene.util.TestRuleMarkFailure$1.evaluate(TestRuleMarkFailure.java:48)
		at com.carrotsearch.randomizedtesting.rules.StatementAdapter.evaluate(StatementAdapter.java:36)
		at com.carrotsearch.randomizedtesting.ThreadLeakControl$StatementRunner.run(ThreadLeakControl.java:345)
		at com.carrotsearch.randomizedtesting.ThreadLeakControl.forkTimeoutingTask(ThreadLeakControl.java:769)
		at com.carrotsearch.randomizedtesting.ThreadLeakControl$3.evaluate(ThreadLeakControl.java:429)
		at com.carrotsearch.randomizedtesting.RandomizedRunner.runSingleTest(RandomizedRunner.java:746)
		at com.carrotsearch.randomizedtesting.RandomizedRunner$3.evaluate(RandomizedRunner.java:648)
		at com.carrotsearch.randomizedtesting.RandomizedRunner$4.evaluate(RandomizedRunner.java:682)
		at com.carrotsearch.randomizedtesting.RandomizedRunner$5.evaluate(RandomizedRunner.java:693)
		at com.carrotsearch.randomizedtesting.rules.StatementAdapter.evaluate(StatementAdapter.java:36)
		at com.carrotsearch.randomizedtesting.rules.SystemPropertiesRestoreRule$1.evaluate(SystemPropertiesRestoreRule.java:53)
		at org.apache.lucene.util.AbstractBeforeAfterRule$1.evaluate(AbstractBeforeAfterRule.java:45)
		at org.apache.lucene.util.TestRuleStoreClassName$1.evaluate(TestRuleStoreClassName.java:42)
		at com.carrotsearch.randomizedtesting.rules.SystemPropertiesInvariantRule$1.evaluate(SystemPropertiesInvariantRule.java:55)
		at com.carrotsearch.randomizedtesting.rules.NoShadowingOrOverridesOnMethodsRule$1.evaluate(NoShadowingOrOverridesOnMethodsRule.java:39)
		at com.carrotsearch.randomizedtesting.rules.NoShadowingOrOverridesOnMethodsRule$1.evaluate(NoShadowingOrOverridesOnMethodsRule.java:39)
		at org.apache.lucene.util.TestRuleAssertionsRequired$1.evaluate(TestRuleAssertionsRequired.java:40)
		at org.apache.lucene.util.TestRuleMarkFailure$1.evaluate(TestRuleMarkFailure.java:48)
		at org.apache.lucene.util.TestRuleIgnoreAfterMaxFailures$1.evaluate(TestRuleIgnoreAfterMaxFailures.java:70)
		at org.apache.lucene.util.TestRuleIgnoreTestSuites$1.evaluate(TestRuleIgnoreTestSuites.java:55)
		at com.carrotsearch.randomizedtesting.rules.StatementAdapter.evaluate(StatementAdapter.java:36)
		at com.carrotsearch.randomizedtesting.ThreadLeakControl$StatementRunner.run(ThreadLeakControl.java:345)
		at java.lang.Thread.run(Thread.java:679)
	
3329 T1520 C3 oasc.SolrException.log SEVERE org.apache.solr.common.SolrException: range facet infinite loop: gap is either zero, or too small relative start/end and caused underflow: Mon Sep 03 12:47:13 CWST 2012 + +0DAYS = Mon Sep 03 12:47:13 CWST 2012
		at org.apache.solr.request.SimpleFacets.getFacetRangeCounts(SimpleFacets.java:1122)
		at org.apache.solr.request.SimpleFacets.getFacetRangeCounts(SimpleFacets.java:1074)
		at org.apache.solr.request.SimpleFacets.getFacetRangeCounts(SimpleFacets.java:1018)
		at org.apache.solr.request.SimpleFacets.getFacetCounts(SimpleFacets.java:208)
		at org.apache.solr.handler.component.FacetComponent.process(FacetComponent.java:87)
		at org.apache.solr.handler.component.SearchHandler.handleRequestBody(SearchHandler.java:206)
		at org.apache.solr.handler.RequestHandlerBase.handleRequest(RequestHandlerBase.java:129)
		at org.apache.solr.core.SolrCore.execute(SolrCore.java:1692)
		at org.apache.solr.util.TestHarness.query(TestHarness.java:351)
		at org.apache.solr.util.TestHarness.query(TestHarness.java:333)
		at org.apache.solr.SolrTestCaseJ4.assertQEx(SolrTestCaseJ4.java:601)
		at org.apache.solr.request.SimpleFacetsTest.testRangeFacetInfiniteLoopDetection(SimpleFacetsTest.java:2029)
		at sun.reflect.NativeMethodAccessorImpl.invoke0(Native Method)
		at sun.reflect.NativeMethodAccessorImpl.invoke(NativeMethodAccessorImpl.java:57)
		at sun.reflect.DelegatingMethodAccessorImpl.invoke(DelegatingMethodAccessorImpl.java:43)
		at java.lang.reflect.Method.invoke(Method.java:616)
		at com.carrotsearch.randomizedtesting.RandomizedRunner.invoke(RandomizedRunner.java:1559)
		at com.carrotsearch.randomizedtesting.RandomizedRunner.access$600(RandomizedRunner.java:79)
		at com.carrotsearch.randomizedtesting.RandomizedRunner$6.evaluate(RandomizedRunner.java:737)
		at com.carrotsearch.randomizedtesting.RandomizedRunner$7.evaluate(RandomizedRunner.java:773)
		at com.carrotsearch.randomizedtesting.RandomizedRunner$8.evaluate(RandomizedRunner.java:787)
		at com.carrotsearch.randomizedtesting.rules.SystemPropertiesRestoreRule$1.evaluate(SystemPropertiesRestoreRule.java:53)
		at org.apache.lucene.util.TestRuleSetupTeardownChained$1.evaluate(TestRuleSetupTeardownChained.java:50)
		at org.apache.lucene.util.TestRuleFieldCacheSanity$1.evaluate(TestRuleFieldCacheSanity.java:51)
		at org.apache.lucene.util.AbstractBeforeAfterRule$1.evaluate(AbstractBeforeAfterRule.java:45)
		at com.carrotsearch.randomizedtesting.rules.SystemPropertiesInvariantRule$1.evaluate(SystemPropertiesInvariantRule.java:55)
		at org.apache.lucene.util.TestRuleThreadAndTestName$1.evaluate(TestRuleThreadAndTestName.java:48)
		at org.apache.lucene.util.TestRuleIgnoreAfterMaxFailures$1.evaluate(TestRuleIgnoreAfterMaxFailures.java:70)
		at org.apache.lucene.util.TestRuleMarkFailure$1.evaluate(TestRuleMarkFailure.java:48)
		at com.carrotsearch.randomizedtesting.rules.StatementAdapter.evaluate(StatementAdapter.java:36)
		at com.carrotsearch.randomizedtesting.ThreadLeakControl$StatementRunner.run(ThreadLeakControl.java:345)
		at com.carrotsearch.randomizedtesting.ThreadLeakControl.forkTimeoutingTask(ThreadLeakControl.java:769)
		at com.carrotsearch.randomizedtesting.ThreadLeakControl$3.evaluate(ThreadLeakControl.java:429)
		at com.carrotsearch.randomizedtesting.RandomizedRunner.runSingleTest(RandomizedRunner.java:746)
		at com.carrotsearch.randomizedtesting.RandomizedRunner$3.evaluate(RandomizedRunner.java:648)
		at com.carrotsearch.randomizedtesting.RandomizedRunner$4.evaluate(RandomizedRunner.java:682)
		at com.carrotsearch.randomizedtesting.RandomizedRunner$5.evaluate(RandomizedRunner.java:693)
		at com.carrotsearch.randomizedtesting.rules.StatementAdapter.evaluate(StatementAdapter.java:36)
		at com.carrotsearch.randomizedtesting.rules.SystemPropertiesRestoreRule$1.evaluate(SystemPropertiesRestoreRule.java:53)
		at org.apache.lucene.util.AbstractBeforeAfterRule$1.evaluate(AbstractBeforeAfterRule.java:45)
		at org.apache.lucene.util.TestRuleStoreClassName$1.evaluate(TestRuleStoreClassName.java:42)
		at com.carrotsearch.randomizedtesting.rules.SystemPropertiesInvariantRule$1.evaluate(SystemPropertiesInvariantRule.java:55)
		at com.carrotsearch.randomizedtesting.rules.NoShadowingOrOverridesOnMethodsRule$1.evaluate(NoShadowingOrOverridesOnMethodsRule.java:39)
		at com.carrotsearch.randomizedtesting.rules.NoShadowingOrOverridesOnMethodsRule$1.evaluate(NoShadowingOrOverridesOnMethodsRule.java:39)
		at org.apache.lucene.util.TestRuleAssertionsRequired$1.evaluate(TestRuleAssertionsRequired.java:40)
		at org.apache.lucene.util.TestRuleMarkFailure$1.evaluate(TestRuleMarkFailure.java:48)
		at org.apache.lucene.util.TestRuleIgnoreAfterMaxFailures$1.evaluate(TestRuleIgnoreAfterMaxFailures.java:70)
		at org.apache.lucene.util.TestRuleIgnoreTestSuites$1.evaluate(TestRuleIgnoreTestSuites.java:55)
		at com.carrotsearch.randomizedtesting.rules.StatementAdapter.evaluate(StatementAdapter.java:36)
		at com.carrotsearch.randomizedtesting.ThreadLeakControl$StatementRunner.run(ThreadLeakControl.java:345)
		at java.lang.Thread.run(Thread.java:679)
	
3331 T1520 C3 oasc.SolrException.log SEVERE org.apache.solr.common.SolrException: range facet infinite loop: gap is either zero, or too small relative start/end and caused underflow: 9.9999998E10 + 2160 = 9.9999998E10
		at org.apache.solr.request.SimpleFacets.getFacetRangeCounts(SimpleFacets.java:1122)
		at org.apache.solr.request.SimpleFacets.getFacetRangeCounts(SimpleFacets.java:1074)
		at org.apache.solr.request.SimpleFacets.getFacetRangeCounts(SimpleFacets.java:1018)
		at org.apache.solr.request.SimpleFacets.getFacetCounts(SimpleFacets.java:208)
		at org.apache.solr.handler.component.FacetComponent.process(FacetComponent.java:87)
		at org.apache.solr.handler.component.SearchHandler.handleRequestBody(SearchHandler.java:206)
		at org.apache.solr.handler.RequestHandlerBase.handleRequest(RequestHandlerBase.java:129)
		at org.apache.solr.core.SolrCore.execute(SolrCore.java:1692)
		at org.apache.solr.util.TestHarness.query(TestHarness.java:351)
		at org.apache.solr.util.TestHarness.query(TestHarness.java:333)
		at org.apache.solr.SolrTestCaseJ4.assertQEx(SolrTestCaseJ4.java:601)
		at org.apache.solr.request.SimpleFacetsTest.testRangeFacetInfiniteLoopDetection(SimpleFacetsTest.java:2041)
		at sun.reflect.NativeMethodAccessorImpl.invoke0(Native Method)
		at sun.reflect.NativeMethodAccessorImpl.invoke(NativeMethodAccessorImpl.java:57)
		at sun.reflect.DelegatingMethodAccessorImpl.invoke(DelegatingMethodAccessorImpl.java:43)
		at java.lang.reflect.Method.invoke(Method.java:616)
		at com.carrotsearch.randomizedtesting.RandomizedRunner.invoke(RandomizedRunner.java:1559)
		at com.carrotsearch.randomizedtesting.RandomizedRunner.access$600(RandomizedRunner.java:79)
		at com.carrotsearch.randomizedtesting.RandomizedRunner$6.evaluate(RandomizedRunner.java:737)
		at com.carrotsearch.randomizedtesting.RandomizedRunner$7.evaluate(RandomizedRunner.java:773)
		at com.carrotsearch.randomizedtesting.RandomizedRunner$8.evaluate(RandomizedRunner.java:787)
		at com.carrotsearch.randomizedtesting.rules.SystemPropertiesRestoreRule$1.evaluate(SystemPropertiesRestoreRule.java:53)
		at org.apache.lucene.util.TestRuleSetupTeardownChained$1.evaluate(TestRuleSetupTeardownChained.java:50)
		at org.apache.lucene.util.TestRuleFieldCacheSanity$1.evaluate(TestRuleFieldCacheSanity.java:51)
		at org.apache.lucene.util.AbstractBeforeAfterRule$1.evaluate(AbstractBeforeAfterRule.java:45)
		at com.carrotsearch.randomizedtesting.rules.SystemPropertiesInvariantRule$1.evaluate(SystemPropertiesInvariantRule.java:55)
		at org.apache.lucene.util.TestRuleThreadAndTestName$1.evaluate(TestRuleThreadAndTestName.java:48)
		at org.apache.lucene.util.TestRuleIgnoreAfterMaxFailures$1.evaluate(TestRuleIgnoreAfterMaxFailures.java:70)
		at org.apache.lucene.util.TestRuleMarkFailure$1.evaluate(TestRuleMarkFailure.java:48)
		at com.carrotsearch.randomizedtesting.rules.StatementAdapter.evaluate(StatementAdapter.java:36)
		at com.carrotsearch.randomizedtesting.ThreadLeakControl$StatementRunner.run(ThreadLeakControl.java:345)
		at com.carrotsearch.randomizedtesting.ThreadLeakControl.forkTimeoutingTask(ThreadLeakControl.java:769)
		at com.carrotsearch.randomizedtesting.ThreadLeakControl$3.evaluate(ThreadLeakControl.java:429)
		at com.carrotsearch.randomizedtesting.RandomizedRunner.runSingleTest(RandomizedRunner.java:746)
		at com.carrotsearch.randomizedtesting.RandomizedRunner$3.evaluate(RandomizedRunner.java:648)
		at com.carrotsearch.randomizedtesting.RandomizedRunner$4.evaluate(RandomizedRunner.java:682)
		at com.carrotsearch.randomizedtesting.RandomizedRunner$5.evaluate(RandomizedRunner.java:693)
		at com.carrotsearch.randomizedtesting.rules.StatementAdapter.evaluate(StatementAdapter.java:36)
		at com.carrotsearch.randomizedtesting.rules.SystemPropertiesRestoreRule$1.evaluate(SystemPropertiesRestoreRule.java:53)
		at org.apache.lucene.util.AbstractBeforeAfterRule$1.evaluate(AbstractBeforeAfterRule.java:45)
		at org.apache.lucene.util.TestRuleStoreClassName$1.evaluate(TestRuleStoreClassName.java:42)
		at com.carrotsearch.randomizedtesting.rules.SystemPropertiesInvariantRule$1.evaluate(SystemPropertiesInvariantRule.java:55)
		at com.carrotsearch.randomizedtesting.rules.NoShadowingOrOverridesOnMethodsRule$1.evaluate(NoShadowingOrOverridesOnMethodsRule.java:39)
		at com.carrotsearch.randomizedtesting.rules.NoShadowingOrOverridesOnMethodsRule$1.evaluate(NoShadowingOrOverridesOnMethodsRule.java:39)
		at org.apache.lucene.util.TestRuleAssertionsRequired$1.evaluate(TestRuleAssertionsRequired.java:40)
		at org.apache.lucene.util.TestRuleMarkFailure$1.evaluate(TestRuleMarkFailure.java:48)
		at org.apache.lucene.util.TestRuleIgnoreAfterMaxFailures$1.evaluate(TestRuleIgnoreAfterMaxFailures.java:70)
		at org.apache.lucene.util.TestRuleIgnoreTestSuites$1.evaluate(TestRuleIgnoreTestSuites.java:55)
		at com.carrotsearch.randomizedtesting.rules.StatementAdapter.evaluate(StatementAdapter.java:36)
		at com.carrotsearch.randomizedtesting.ThreadLeakControl$StatementRunner.run(ThreadLeakControl.java:345)
		at java.lang.Thread.run(Thread.java:679)
	
3332 T1520 C3 oasc.SolrException.log SEVERE org.apache.solr.common.SolrException: range facet infinite loop: gap is either zero, or too small relative start/end and caused underflow: 9.9999998E10 + 2160 = 9.9999998E10
		at org.apache.solr.request.SimpleFacets.getFacetRangeCounts(SimpleFacets.java:1122)
		at org.apache.solr.request.SimpleFacets.getFacetRangeCounts(SimpleFacets.java:1074)
		at org.apache.solr.request.SimpleFacets.getFacetRangeCounts(SimpleFacets.java:1018)
		at org.apache.solr.request.SimpleFacets.getFacetCounts(SimpleFacets.java:208)
		at org.apache.solr.handler.component.FacetComponent.process(FacetComponent.java:87)
		at org.apache.solr.handler.component.SearchHandler.handleRequestBody(SearchHandler.java:206)
		at org.apache.solr.handler.RequestHandlerBase.handleRequest(RequestHandlerBase.java:129)
		at org.apache.solr.core.SolrCore.execute(SolrCore.java:1692)
		at org.apache.solr.util.TestHarness.query(TestHarness.java:351)
		at org.apache.solr.util.TestHarness.query(TestHarness.java:333)
		at org.apache.solr.SolrTestCaseJ4.assertQEx(SolrTestCaseJ4.java:601)
		at org.apache.solr.request.SimpleFacetsTest.testRangeFacetInfiniteLoopDetection(SimpleFacetsTest.java:2041)
		at sun.reflect.NativeMethodAccessorImpl.invoke0(Native Method)
		at sun.reflect.NativeMethodAccessorImpl.invoke(NativeMethodAccessorImpl.java:57)
		at sun.reflect.DelegatingMethodAccessorImpl.invoke(DelegatingMethodAccessorImpl.java:43)
		at java.lang.reflect.Method.invoke(Method.java:616)
		at com.carrotsearch.randomizedtesting.RandomizedRunner.invoke(RandomizedRunner.java:1559)
		at com.carrotsearch.randomizedtesting.RandomizedRunner.access$600(RandomizedRunner.java:79)
		at com.carrotsearch.randomizedtesting.RandomizedRunner$6.evaluate(RandomizedRunner.java:737)
		at com.carrotsearch.randomizedtesting.RandomizedRunner$7.evaluate(RandomizedRunner.java:773)
		at com.carrotsearch.randomizedtesting.RandomizedRunner$8.evaluate(RandomizedRunner.java:787)
		at com.carrotsearch.randomizedtesting.rules.SystemPropertiesRestoreRule$1.evaluate(SystemPropertiesRestoreRule.java:53)
		at org.apache.lucene.util.TestRuleSetupTeardownChained$1.evaluate(TestRuleSetupTeardownChained.java:50)
		at org.apache.lucene.util.TestRuleFieldCacheSanity$1.evaluate(TestRuleFieldCacheSanity.java:51)
		at org.apache.lucene.util.AbstractBeforeAfterRule$1.evaluate(AbstractBeforeAfterRule.java:45)
		at com.carrotsearch.randomizedtesting.rules.SystemPropertiesInvariantRule$1.evaluate(SystemPropertiesInvariantRule.java:55)
		at org.apache.lucene.util.TestRuleThreadAndTestName$1.evaluate(TestRuleThreadAndTestName.java:48)
		at org.apache.lucene.util.TestRuleIgnoreAfterMaxFailures$1.evaluate(TestRuleIgnoreAfterMaxFailures.java:70)
		at org.apache.lucene.util.TestRuleMarkFailure$1.evaluate(TestRuleMarkFailure.java:48)
		at com.carrotsearch.randomizedtesting.rules.StatementAdapter.evaluate(StatementAdapter.java:36)
		at com.carrotsearch.randomizedtesting.ThreadLeakControl$StatementRunner.run(ThreadLeakControl.java:345)
		at com.carrotsearch.randomizedtesting.ThreadLeakControl.forkTimeoutingTask(ThreadLeakControl.java:769)
		at com.carrotsearch.randomizedtesting.ThreadLeakControl$3.evaluate(ThreadLeakControl.java:429)
		at com.carrotsearch.randomizedtesting.RandomizedRunner.runSingleTest(RandomizedRunner.java:746)
		at com.carrotsearch.randomizedtesting.RandomizedRunner$3.evaluate(RandomizedRunner.java:648)
		at com.carrotsearch.randomizedtesting.RandomizedRunner$4.evaluate(RandomizedRunner.java:682)
		at com.carrotsearch.randomizedtesting.RandomizedRunner$5.evaluate(RandomizedRunner.java:693)
		at com.carrotsearch.randomizedtesting.rules.StatementAdapter.evaluate(StatementAdapter.java:36)
		at com.carrotsearch.randomizedtesting.rules.SystemPropertiesRestoreRule$1.evaluate(SystemPropertiesRestoreRule.java:53)
		at org.apache.lucene.util.AbstractBeforeAfterRule$1.evaluate(AbstractBeforeAfterRule.java:45)
		at org.apache.lucene.util.TestRuleStoreClassName$1.evaluate(TestRuleStoreClassName.java:42)
		at com.carrotsearch.randomizedtesting.rules.SystemPropertiesInvariantRule$1.evaluate(SystemPropertiesInvariantRule.java:55)
		at com.carrotsearch.randomizedtesting.rules.NoShadowingOrOverridesOnMethodsRule$1.evaluate(NoShadowingOrOverridesOnMethodsRule.java:39)
		at com.carrotsearch.randomizedtesting.rules.NoShadowingOrOverridesOnMethodsRule$1.evaluate(NoShadowingOrOverridesOnMethodsRule.java:39)
		at org.apache.lucene.util.TestRuleAssertionsRequired$1.evaluate(TestRuleAssertionsRequired.java:40)
		at org.apache.lucene.util.TestRuleMarkFailure$1.evaluate(TestRuleMarkFailure.java:48)
		at org.apache.lucene.util.TestRuleIgnoreAfterMaxFailures$1.evaluate(TestRuleIgnoreAfterMaxFailures.java:70)
		at org.apache.lucene.util.TestRuleIgnoreTestSuites$1.evaluate(TestRuleIgnoreTestSuites.java:55)
		at com.carrotsearch.randomizedtesting.rules.StatementAdapter.evaluate(StatementAdapter.java:36)
		at com.carrotsearch.randomizedtesting.ThreadLeakControl$StatementRunner.run(ThreadLeakControl.java:345)
		at java.lang.Thread.run(Thread.java:679)
	
3333 T1520 C3 oasc.SolrException.log SEVERE org.apache.solr.common.SolrException: range facet infinite loop: gap is either zero, or too small relative start/end and caused underflow: 9.9E12 + 0.0003 = 9.9E12
		at org.apache.solr.request.SimpleFacets.getFacetRangeCounts(SimpleFacets.java:1122)
		at org.apache.solr.request.SimpleFacets.getFacetRangeCounts(SimpleFacets.java:1074)
		at org.apache.solr.request.SimpleFacets.getFacetRangeCounts(SimpleFacets.java:1018)
		at org.apache.solr.request.SimpleFacets.getFacetCounts(SimpleFacets.java:208)
		at org.apache.solr.handler.component.FacetComponent.process(FacetComponent.java:87)
		at org.apache.solr.handler.component.SearchHandler.handleRequestBody(SearchHandler.java:206)
		at org.apache.solr.handler.RequestHandlerBase.handleRequest(RequestHandlerBase.java:129)
		at org.apache.solr.core.SolrCore.execute(SolrCore.java:1692)
		at org.apache.solr.util.TestHarness.query(TestHarness.java:351)
		at org.apache.solr.util.TestHarness.query(TestHarness.java:333)
		at org.apache.solr.SolrTestCaseJ4.assertQEx(SolrTestCaseJ4.java:601)
		at org.apache.solr.request.SimpleFacetsTest.testRangeFacetInfiniteLoopDetection(SimpleFacetsTest.java:2052)
		at sun.reflect.NativeMethodAccessorImpl.invoke0(Native Method)
		at sun.reflect.NativeMethodAccessorImpl.invoke(NativeMethodAccessorImpl.java:57)
		at sun.reflect.DelegatingMethodAccessorImpl.invoke(DelegatingMethodAccessorImpl.java:43)
		at java.lang.reflect.Method.invoke(Method.java:616)
		at com.carrotsearch.randomizedtesting.RandomizedRunner.invoke(RandomizedRunner.java:1559)
		at com.carrotsearch.randomizedtesting.RandomizedRunner.access$600(RandomizedRunner.java:79)
		at com.carrotsearch.randomizedtesting.RandomizedRunner$6.evaluate(RandomizedRunner.java:737)
		at com.carrotsearch.randomizedtesting.RandomizedRunner$7.evaluate(RandomizedRunner.java:773)
		at com.carrotsearch.randomizedtesting.RandomizedRunner$8.evaluate(RandomizedRunner.java:787)
		at com.carrotsearch.randomizedtesting.rules.SystemPropertiesRestoreRule$1.evaluate(SystemPropertiesRestoreRule.java:53)
		at org.apache.lucene.util.TestRuleSetupTeardownChained$1.evaluate(TestRuleSetupTeardownChained.java:50)
		at org.apache.lucene.util.TestRuleFieldCacheSanity$1.evaluate(TestRuleFieldCacheSanity.java:51)
		at org.apache.lucene.util.AbstractBeforeAfterRule$1.evaluate(AbstractBeforeAfterRule.java:45)
		at com.carrotsearch.randomizedtesting.rules.SystemPropertiesInvariantRule$1.evaluate(SystemPropertiesInvariantRule.java:55)
		at org.apache.lucene.util.TestRuleThreadAndTestName$1.evaluate(TestRuleThreadAndTestName.java:48)
		at org.apache.lucene.util.TestRuleIgnoreAfterMaxFailures$1.evaluate(TestRuleIgnoreAfterMaxFailures.java:70)
		at org.apache.lucene.util.TestRuleMarkFailure$1.evaluate(TestRuleMarkFailure.java:48)
		at com.carrotsearch.randomizedtesting.rules.StatementAdapter.evaluate(StatementAdapter.java:36)
		at com.carrotsearch.randomizedtesting.ThreadLeakControl$StatementRunner.run(ThreadLeakControl.java:345)
		at com.carrotsearch.randomizedtesting.ThreadLeakControl.forkTimeoutingTask(ThreadLeakControl.java:769)
		at com.carrotsearch.randomizedtesting.ThreadLeakControl$3.evaluate(ThreadLeakControl.java:429)
		at com.carrotsearch.randomizedtesting.RandomizedRunner.runSingleTest(RandomizedRunner.java:746)
		at com.carrotsearch.randomizedtesting.RandomizedRunner$3.evaluate(RandomizedRunner.java:648)
		at com.carrotsearch.randomizedtesting.RandomizedRunner$4.evaluate(RandomizedRunner.java:682)
		at com.carrotsearch.randomizedtesting.RandomizedRunner$5.evaluate(RandomizedRunner.java:693)
		at com.carrotsearch.randomizedtesting.rules.StatementAdapter.evaluate(StatementAdapter.java:36)
		at com.carrotsearch.randomizedtesting.rules.SystemPropertiesRestoreRule$1.evaluate(SystemPropertiesRestoreRule.java:53)
		at org.apache.lucene.util.AbstractBeforeAfterRule$1.evaluate(AbstractBeforeAfterRule.java:45)
		at org.apache.lucene.util.TestRuleStoreClassName$1.evaluate(TestRuleStoreClassName.java:42)
		at com.carrotsearch.randomizedtesting.rules.SystemPropertiesInvariantRule$1.evaluate(SystemPropertiesInvariantRule.java:55)
		at com.carrotsearch.randomizedtesting.rules.NoShadowingOrOverridesOnMethodsRule$1.evaluate(NoShadowingOrOverridesOnMethodsRule.java:39)
		at com.carrotsearch.randomizedtesting.rules.NoShadowingOrOverridesOnMethodsRule$1.evaluate(NoShadowingOrOverridesOnMethodsRule.java:39)
		at org.apache.lucene.util.TestRuleAssertionsRequired$1.evaluate(TestRuleAssertionsRequired.java:40)
		at org.apache.lucene.util.TestRuleMarkFailure$1.evaluate(TestRuleMarkFailure.java:48)
		at org.apache.lucene.util.TestRuleIgnoreAfterMaxFailures$1.evaluate(TestRuleIgnoreAfterMaxFailures.java:70)
		at org.apache.lucene.util.TestRuleIgnoreTestSuites$1.evaluate(TestRuleIgnoreTestSuites.java:55)
		at com.carrotsearch.randomizedtesting.rules.StatementAdapter.evaluate(StatementAdapter.java:36)
		at com.carrotsearch.randomizedtesting.ThreadLeakControl$StatementRunner.run(ThreadLeakControl.java:345)
		at java.lang.Thread.run(Thread.java:679)
	
3334 T1520 C3 oasc.SolrException.log SEVERE org.apache.solr.common.SolrException: range facet infinite loop: gap is either zero, or too small relative start/end and caused underflow: 9.9E12 + 0.0003 = 9.9E12
		at org.apache.solr.request.SimpleFacets.getFacetRangeCounts(SimpleFacets.java:1122)
		at org.apache.solr.request.SimpleFacets.getFacetRangeCounts(SimpleFacets.java:1074)
		at org.apache.solr.request.SimpleFacets.getFacetRangeCounts(SimpleFacets.java:1018)
		at org.apache.solr.request.SimpleFacets.getFacetCounts(SimpleFacets.java:208)
		at org.apache.solr.handler.component.FacetComponent.process(FacetComponent.java:87)
		at org.apache.solr.handler.component.SearchHandler.handleRequestBody(SearchHandler.java:206)
		at org.apache.solr.handler.RequestHandlerBase.handleRequest(RequestHandlerBase.java:129)
		at org.apache.solr.core.SolrCore.execute(SolrCore.java:1692)
		at org.apache.solr.util.TestHarness.query(TestHarness.java:351)
		at org.apache.solr.util.TestHarness.query(TestHarness.java:333)
		at org.apache.solr.SolrTestCaseJ4.assertQEx(SolrTestCaseJ4.java:601)
		at org.apache.solr.request.SimpleFacetsTest.testRangeFacetInfiniteLoopDetection(SimpleFacetsTest.java:2052)
		at sun.reflect.NativeMethodAccessorImpl.invoke0(Native Method)
		at sun.reflect.NativeMethodAccessorImpl.invoke(NativeMethodAccessorImpl.java:57)
		at sun.reflect.DelegatingMethodAccessorImpl.invoke(DelegatingMethodAccessorImpl.java:43)
		at java.lang.reflect.Method.invoke(Method.java:616)
		at com.carrotsearch.randomizedtesting.RandomizedRunner.invoke(RandomizedRunner.java:1559)
		at com.carrotsearch.randomizedtesting.RandomizedRunner.access$600(RandomizedRunner.java:79)
		at com.carrotsearch.randomizedtesting.RandomizedRunner$6.evaluate(RandomizedRunner.java:737)
		at com.carrotsearch.randomizedtesting.RandomizedRunner$7.evaluate(RandomizedRunner.java:773)
		at com.carrotsearch.randomizedtesting.RandomizedRunner$8.evaluate(RandomizedRunner.java:787)
		at com.carrotsearch.randomizedtesting.rules.SystemPropertiesRestoreRule$1.evaluate(SystemPropertiesRestoreRule.java:53)
		at org.apache.lucene.util.TestRuleSetupTeardownChained$1.evaluate(TestRuleSetupTeardownChained.java:50)
		at org.apache.lucene.util.TestRuleFieldCacheSanity$1.evaluate(TestRuleFieldCacheSanity.java:51)
		at org.apache.lucene.util.AbstractBeforeAfterRule$1.evaluate(AbstractBeforeAfterRule.java:45)
		at com.carrotsearch.randomizedtesting.rules.SystemPropertiesInvariantRule$1.evaluate(SystemPropertiesInvariantRule.java:55)
		at org.apache.lucene.util.TestRuleThreadAndTestName$1.evaluate(TestRuleThreadAndTestName.java:48)
		at org.apache.lucene.util.TestRuleIgnoreAfterMaxFailures$1.evaluate(TestRuleIgnoreAfterMaxFailures.java:70)
		at org.apache.lucene.util.TestRuleMarkFailure$1.evaluate(TestRuleMarkFailure.java:48)
		at com.carrotsearch.randomizedtesting.rules.StatementAdapter.evaluate(StatementAdapter.java:36)
		at com.carrotsearch.randomizedtesting.ThreadLeakControl$StatementRunner.run(ThreadLeakControl.java:345)
		at com.carrotsearch.randomizedtesting.ThreadLeakControl.forkTimeoutingTask(ThreadLeakControl.java:769)
		at com.carrotsearch.randomizedtesting.ThreadLeakControl$3.evaluate(ThreadLeakControl.java:429)
		at com.carrotsearch.randomizedtesting.RandomizedRunner.runSingleTest(RandomizedRunner.java:746)
		at com.carrotsearch.randomizedtesting.RandomizedRunner$3.evaluate(RandomizedRunner.java:648)
		at com.carrotsearch.randomizedtesting.RandomizedRunner$4.evaluate(RandomizedRunner.java:682)
		at com.carrotsearch.randomizedtesting.RandomizedRunner$5.evaluate(RandomizedRunner.java:693)
		at com.carrotsearch.randomizedtesting.rules.StatementAdapter.evaluate(StatementAdapter.java:36)
		at com.carrotsearch.randomizedtesting.rules.SystemPropertiesRestoreRule$1.evaluate(SystemPropertiesRestoreRule.java:53)
		at org.apache.lucene.util.AbstractBeforeAfterRule$1.evaluate(AbstractBeforeAfterRule.java:45)
		at org.apache.lucene.util.TestRuleStoreClassName$1.evaluate(TestRuleStoreClassName.java:42)
		at com.carrotsearch.randomizedtesting.rules.SystemPropertiesInvariantRule$1.evaluate(SystemPropertiesInvariantRule.java:55)
		at com.carrotsearch.randomizedtesting.rules.NoShadowingOrOverridesOnMethodsRule$1.evaluate(NoShadowingOrOverridesOnMethodsRule.java:39)
		at com.carrotsearch.randomizedtesting.rules.NoShadowingOrOverridesOnMethodsRule$1.evaluate(NoShadowingOrOverridesOnMethodsRule.java:39)
		at org.apache.lucene.util.TestRuleAssertionsRequired$1.evaluate(TestRuleAssertionsRequired.java:40)
		at org.apache.lucene.util.TestRuleMarkFailure$1.evaluate(TestRuleMarkFailure.java:48)
		at org.apache.lucene.util.TestRuleIgnoreAfterMaxFailures$1.evaluate(TestRuleIgnoreAfterMaxFailures.java:70)
		at org.apache.lucene.util.TestRuleIgnoreTestSuites$1.evaluate(TestRuleIgnoreTestSuites.java:55)
		at com.carrotsearch.randomizedtesting.rules.StatementAdapter.evaluate(StatementAdapter.java:36)
		at com.carrotsearch.randomizedtesting.ThreadLeakControl$StatementRunner.run(ThreadLeakControl.java:345)
		at java.lang.Thread.run(Thread.java:679)
	
Tests run: 31, Failures: 0, Errors: 0, Skipped: 0, Time elapsed: 3.752 sec
Running org.apache.solr.servlet.NoCacheHeaderTest
Creating dataDir: /usr/home/hudson/hudson-slave/workspace/Lucene-Solr-Maven-trunk/maven-build/solr/core/target/test/./solrtest-NoCacheHeaderTest-1346644934404
Tests run: 3, Failures: 0, Errors: 0, Skipped: 0, Time elapsed: 0.511 sec
Running org.apache.solr.update.DirectUpdateHandlerOptimizeTest
Tests run: 1, Failures: 0, Errors: 0, Skipped: 0, Time elapsed: 0.604 sec
Running org.apache.solr.core.SolrCoreTest
Creating dataDir: /usr/home/hudson/hudson-slave/workspace/Lucene-Solr-Maven-trunk/maven-build/solr/core/target/test/./solrtest-SolrCoreTest-1346644935541
Creating dataDir: /usr/home/hudson/hudson-slave/workspace/Lucene-Solr-Maven-trunk/maven-build/solr/core/target/test/./solrtest-SolrCoreTest-1346644937229
Creating dataDir: /usr/home/hudson/hudson-slave/workspace/Lucene-Solr-Maven-trunk/maven-build/solr/core/target/test/./solrtest-SolrCoreTest-1346644937917
Creating dataDir: /usr/home/hudson/hudson-slave/workspace/Lucene-Solr-Maven-trunk/maven-build/solr/core/target/test/./solrtest-SolrCoreTest-1346644938454
Creating dataDir: /usr/home/hudson/hudson-slave/workspace/Lucene-Solr-Maven-trunk/maven-build/solr/core/target/test/./solrtest-SolrCoreTest-1346644938964
Creating dataDir: /usr/home/hudson/hudson-slave/workspace/Lucene-Solr-Maven-trunk/maven-build/solr/core/target/test/./solrtest-SolrCoreTest-1346644939739
Tests run: 6, Failures: 0, Errors: 0, Skipped: 0, Time elapsed: 4.712 sec
Running org.apache.solr.core.PluginInfoTest
Tests run: 9, Failures: 0, Errors: 0, Skipped: 0, Time elapsed: 0.457 sec
Running org.apache.solr.schema.BadIndexSchemaTest
Creating dataDir: /usr/home/hudson/hudson-slave/workspace/Lucene-Solr-Maven-trunk/maven-build/solr/core/target/test/./solrtest-BadIndexSchemaTest-1346644940732
87 T1579 oasc.SolrCore.initCodec SEVERE FieldType 'pulsing1' is configured with a postings format, but the codec does not support it: class org.apache.solr.core.SolrCore$3
Creating dataDir: /usr/home/hudson/hudson-slave/workspace/Lucene-Solr-Maven-trunk/maven-build/solr/core/target/test/./solrtest-BadIndexSchemaTest-1346644940821
143 T1579 oass.IndexSchema.readSchema SEVERE FieldType 'sim1' is configured with a similarity, but the global similarity does not support it: class org.apache.solr.search.similarities.DefaultSimilarityFactory
Creating dataDir: /usr/home/hudson/hudson-slave/workspace/Lucene-Solr-Maven-trunk/maven-build/solr/core/target/test/./solrtest-BadIndexSchemaTest-1346644940875
Creating dataDir: /usr/home/hudson/hudson-slave/workspace/Lucene-Solr-Maven-trunk/maven-build/solr/core/target/test/./solrtest-BadIndexSchemaTest-1346644940925
Creating dataDir: /usr/home/hudson/hudson-slave/workspace/Lucene-Solr-Maven-trunk/maven-build/solr/core/target/test/./solrtest-BadIndexSchemaTest-1346644940978
Creating dataDir: /usr/home/hudson/hudson-slave/workspace/Lucene-Solr-Maven-trunk/maven-build/solr/core/target/test/./solrtest-BadIndexSchemaTest-1346644941034
326 T3 oasc.CoreContainer.finalize SEVERE CoreContainer was not shutdown prior to finalize(), indicates a bug -- POSSIBLE RESOURCE LEAK!!!  instance=682722078
326 T3 oasc.SolrCore.finalize SEVERE REFCOUNT ERROR: unreferenced org.apache.solr.core.SolrCore@1e173b71 (collection1) has a reference count of 1
Creating dataDir: /usr/home/hudson/hudson-slave/workspace/Lucene-Solr-Maven-trunk/maven-build/solr/core/target/test/./solrtest-BadIndexSchemaTest-1346644941114
Creating dataDir: /usr/home/hudson/hudson-slave/workspace/Lucene-Solr-Maven-trunk/maven-build/solr/core/target/test/./solrtest-BadIndexSchemaTest-1346644941169
492 T1579 oass.IndexSchema.readSchema SEVERE uniqueKey field (id) can not be the dest of a copyField (src=XXX)
Creating dataDir: /usr/home/hudson/hudson-slave/workspace/Lucene-Solr-Maven-trunk/maven-build/solr/core/target/test/./solrtest-BadIndexSchemaTest-1346644941222
554 T1579 oass.IndexSchema.readSchema SEVERE uniqueKey field (null) can not be configured with a default value (XXX)
Creating dataDir: /usr/home/hudson/hudson-slave/workspace/Lucene-Solr-Maven-trunk/maven-build/solr/core/target/test/./solrtest-BadIndexSchemaTest-1346644941284
619 T1579 oass.IndexSchema.readSchema SEVERE uniqueKey field (null) can not be configured to be multivalued
Creating dataDir: /usr/home/hudson/hudson-slave/workspace/Lucene-Solr-Maven-trunk/maven-build/solr/core/target/test/./solrtest-BadIndexSchemaTest-1346644941353
Creating dataDir: /usr/home/hudson/hudson-slave/workspace/Lucene-Solr-Maven-trunk/maven-build/solr/core/target/test/./solrtest-BadIndexSchemaTest-1346644941424
Creating dataDir: /usr/home/hudson/hudson-slave/workspace/Lucene-Solr-Maven-trunk/maven-build/solr/core/target/test/./solrtest-BadIndexSchemaTest-1346644941482
Creating dataDir: /usr/home/hudson/hudson-slave/workspace/Lucene-Solr-Maven-trunk/maven-build/solr/core/target/test/./solrtest-BadIndexSchemaTest-1346644941531
Creating dataDir: /usr/home/hudson/hudson-slave/workspace/Lucene-Solr-Maven-trunk/maven-build/solr/core/target/test/./solrtest-BadIndexSchemaTest-1346644941592
Tests run: 9, Failures: 0, Errors: 0, Skipped: 0, Time elapsed: 0.929 sec
Running org.apache.solr.handler.component.DistributedSpellCheckComponentTest
Tests run: 1, Failures: 0, Errors: 0, Skipped: 0, Time elapsed: 10.012 sec
Running org.apache.solr.handler.DocumentAnalysisRequestHandlerTest
Creating dataDir: /usr/home/hudson/hudson-slave/workspace/Lucene-Solr-Maven-trunk/maven-build/solr/core/target/test/./solrtest-DocumentAnalysisRequestHandlerTest-1346644951694
Tests run: 4, Failures: 0, Errors: 0, Skipped: 0, Time elapsed: 0.793 sec
Running org.apache.solr.schema.IndexSchemaRuntimeFieldTest
Creating dataDir: /usr/home/hudson/hudson-slave/workspace/Lucene-Solr-Maven-trunk/maven-build/solr/core/target/test/./solrtest-IndexSchemaRuntimeFieldTest-1346644952478
Tests run: 1, Failures: 0, Errors: 0, Skipped: 0, Time elapsed: 0.507 sec
Running org.apache.solr.search.similarities.TestDFRSimilarityFactory
Creating dataDir: /usr/home/hudson/hudson-slave/workspace/Lucene-Solr-Maven-trunk/maven-build/solr/core/target/test/./solrtest-TestDFRSimilarityFactory-1346644953011
Tests run: 3, Failures: 0, Errors: 0, Skipped: 0, Time elapsed: 0.106 sec
Running org.apache.solr.search.similarities.TestLMJelinekMercerSimilarityFactory
Creating dataDir: /usr/home/hudson/hudson-slave/workspace/Lucene-Solr-Maven-trunk/maven-build/solr/core/target/test/./solrtest-TestLMJelinekMercerSimilarityFactory-1346644953117
Tests run: 2, Failures: 0, Errors: 0, Skipped: 0, Time elapsed: 0.107 sec
Running org.apache.solr.cloud.RecoveryZkTest
Creating dataDir: /usr/home/hudson/hudson-slave/workspace/Lucene-Solr-Maven-trunk/maven-build/solr/core/target/test/./solrtest-RecoveryZkTest-1346644953247
ASYNC  NEW_CORE C4 name=collection1 org.apache.solr.core.SolrCore@7ce0d250 url=http://127.0.0.1:10430/solr/collection1 node=127.0.0.1:10430_solr
16149 T1730 C4 P10430 oasc.SolrException.log SEVERE shard update error StdNode: http://127.0.0.1:10433/solr/collection1/:org.apache.solr.client.solrj.SolrServerException: IOException occured when talking to server at: http://127.0.0.1:10433/solr/collection1
		at org.apache.solr.client.solrj.impl.HttpSolrServer.request(HttpSolrServer.java:414)
		at org.apache.solr.client.solrj.impl.HttpSolrServer.request(HttpSolrServer.java:182)
		at org.apache.solr.update.SolrCmdDistributor$1.call(SolrCmdDistributor.java:331)
		at org.apache.solr.update.SolrCmdDistributor$1.call(SolrCmdDistributor.java:312)
		at java.util.concurrent.FutureTask$Sync.innerRun(FutureTask.java:334)
		at java.util.concurrent.FutureTask.run(FutureTask.java:166)
		at java.util.concurrent.Executors$RunnableAdapter.call(Executors.java:471)
		at java.util.concurrent.FutureTask$Sync.innerRun(FutureTask.java:334)
		at java.util.concurrent.FutureTask.run(FutureTask.java:166)
		at java.util.concurrent.ThreadPoolExecutor.runWorker(ThreadPoolExecutor.java:1110)
		at java.util.concurrent.ThreadPoolExecutor$Worker.run(ThreadPoolExecutor.java:603)
		at java.lang.Thread.run(Thread.java:679)
	Caused by: org.apache.http.NoHttpResponseException: The target server failed to respond
		at org.apache.http.impl.conn.DefaultResponseParser.parseHead(DefaultResponseParser.java:101)
		at org.apache.http.impl.io.AbstractMessageParser.parse(AbstractMessageParser.java:252)
		at org.apache.http.impl.AbstractHttpClientConnection.receiveResponseHeader(AbstractHttpClientConnection.java:282)
		at org.apache.http.impl.conn.DefaultClientConnection.receiveResponseHeader(DefaultClientConnection.java:247)
		at org.apache.http.impl.conn.AbstractClientConnAdapter.receiveResponseHeader(AbstractClientConnAdapter.java:216)
		at org.apache.http.protocol.HttpRequestExecutor.doReceiveResponse(HttpRequestExecutor.java:298)
		at org.apache.http.protocol.HttpRequestExecutor.execute(HttpRequestExecutor.java:125)
		at org.apache.http.impl.client.DefaultRequestDirector.tryExecute(DefaultRequestDirector.java:647)
		at org.apache.http.impl.client.DefaultRequestDirector.execute(DefaultRequestDirector.java:464)
		at org.apache.http.impl.client.AbstractHttpClient.execute(AbstractHttpClient.java:820)
		at org.apache.http.impl.client.AbstractHttpClient.execute(AbstractHttpClient.java:754)
		at org.apache.http.impl.client.AbstractHttpClient.execute(AbstractHttpClient.java:732)
		at org.apache.solr.client.solrj.impl.HttpSolrServer.request(HttpSolrServer.java:353)
		... 11 more
	
16149 T1731 C4 P10430 oasc.SolrException.log SEVERE shard update error StdNode: http://127.0.0.1:10433/solr/collection1/:org.apache.solr.client.solrj.SolrServerException: IOException occured when talking to server at: http://127.0.0.1:10433/solr/collection1
		at org.apache.solr.client.solrj.impl.HttpSolrServer.request(HttpSolrServer.java:414)
		at org.apache.solr.client.solrj.impl.HttpSolrServer.request(HttpSolrServer.java:182)
		at org.apache.solr.update.SolrCmdDistributor$1.call(SolrCmdDistributor.java:331)
		at org.apache.solr.update.SolrCmdDistributor$1.call(SolrCmdDistributor.java:312)
		at java.util.concurrent.FutureTask$Sync.innerRun(FutureTask.java:334)
		at java.util.concurrent.FutureTask.run(FutureTask.java:166)
		at java.util.concurrent.Executors$RunnableAdapter.call(Executors.java:471)
		at java.util.concurrent.FutureTask$Sync.innerRun(FutureTask.java:334)
		at java.util.concurrent.FutureTask.run(FutureTask.java:166)
		at java.util.concurrent.ThreadPoolExecutor.runWorker(ThreadPoolExecutor.java:1110)
		at java.util.concurrent.ThreadPoolExecutor$Worker.run(ThreadPoolExecutor.java:603)
		at java.lang.Thread.run(Thread.java:679)
	Caused by: org.apache.http.NoHttpResponseException: The target server failed to respond
		at org.apache.http.impl.conn.DefaultResponseParser.parseHead(DefaultResponseParser.java:101)
		at org.apache.http.impl.io.AbstractMessageParser.parse(AbstractMessageParser.java:252)
		at org.apache.http.impl.AbstractHttpClientConnection.receiveResponseHeader(AbstractHttpClientConnection.java:282)
		at org.apache.http.impl.conn.DefaultClientConnection.receiveResponseHeader(DefaultClientConnection.java:247)
		at org.apache.http.impl.conn.AbstractClientConnAdapter.receiveResponseHeader(AbstractClientConnAdapter.java:216)
		at org.apache.http.protocol.HttpRequestExecutor.doReceiveResponse(HttpRequestExecutor.java:298)
		at org.apache.http.protocol.HttpRequestExecutor.execute(HttpRequestExecutor.java:125)
		at org.apache.http.impl.client.DefaultRequestDirector.tryExecute(DefaultRequestDirector.java:647)
		at org.apache.http.impl.client.DefaultRequestDirector.execute(DefaultRequestDirector.java:464)
		at org.apache.http.impl.client.AbstractHttpClient.execute(AbstractHttpClient.java:820)
		at org.apache.http.impl.client.AbstractHttpClient.execute(AbstractHttpClient.java:754)
		at org.apache.http.impl.client.AbstractHttpClient.execute(AbstractHttpClient.java:732)
		at org.apache.solr.client.solrj.impl.HttpSolrServer.request(HttpSolrServer.java:353)
		... 11 more
	
19222 T1730 C4 P10430 oasc.SolrException.log SEVERE shard update error StdNode: http://127.0.0.1:10433/solr/collection1/:org.apache.solr.common.SolrException: Server at http://127.0.0.1:10433/solr/collection1 returned non ok status:403, message:Server is shutting down
		at org.apache.solr.client.solrj.impl.HttpSolrServer.request(HttpSolrServer.java:373)
		at org.apache.solr.client.solrj.impl.HttpSolrServer.request(HttpSolrServer.java:182)
		at org.apache.solr.update.SolrCmdDistributor$1.call(SolrCmdDistributor.java:331)
		at org.apache.solr.update.SolrCmdDistributor$1.call(SolrCmdDistributor.java:312)
		at java.util.concurrent.FutureTask$Sync.innerRun(FutureTask.java:334)
		at java.util.concurrent.FutureTask.run(FutureTask.java:166)
		at java.util.concurrent.Executors$RunnableAdapter.call(Executors.java:471)
		at java.util.concurrent.FutureTask$Sync.innerRun(FutureTask.java:334)
		at java.util.concurrent.FutureTask.run(FutureTask.java:166)
		at java.util.concurrent.ThreadPoolExecutor.runWorker(ThreadPoolExecutor.java:1110)
		at java.util.concurrent.ThreadPoolExecutor$Worker.run(ThreadPoolExecutor.java:603)
		at java.lang.Thread.run(Thread.java:679)
	
19233 T1731 C4 P10430 oasc.SolrException.log SEVERE shard update error StdNode: http://127.0.0.1:10433/solr/collection1/:org.apache.solr.common.SolrException: Server at http://127.0.0.1:10433/solr/collection1 returned non ok status:403, message:Server is shutting down
		at org.apache.solr.client.solrj.impl.HttpSolrServer.request(HttpSolrServer.java:373)
		at org.apache.solr.client.solrj.impl.HttpSolrServer.request(HttpSolrServer.java:182)
		at org.apache.solr.update.SolrCmdDistributor$1.call(SolrCmdDistributor.java:331)
		at org.apache.solr.update.SolrCmdDistributor$1.call(SolrCmdDistributor.java:312)
		at java.util.concurrent.FutureTask$Sync.innerRun(FutureTask.java:334)
		at java.util.concurrent.FutureTask.run(FutureTask.java:166)
		at java.util.concurrent.Executors$RunnableAdapter.call(Executors.java:471)
		at java.util.concurrent.FutureTask$Sync.innerRun(FutureTask.java:334)
		at java.util.concurrent.FutureTask.run(FutureTask.java:166)
		at java.util.concurrent.ThreadPoolExecutor.runWorker(ThreadPoolExecutor.java:1110)
		at java.util.concurrent.ThreadPoolExecutor$Worker.run(ThreadPoolExecutor.java:603)
		at java.lang.Thread.run(Thread.java:679)
	
19237 T1730 C4 P10430 oasc.SolrException.log SEVERE shard update error StdNode: http://127.0.0.1:10433/solr/collection1/:org.apache.solr.common.SolrException: Server at http://127.0.0.1:10433/solr/collection1 returned non ok status:403, message:Server is shutting down
		at org.apache.solr.client.solrj.impl.HttpSolrServer.request(HttpSolrServer.java:373)
		at org.apache.solr.client.solrj.impl.HttpSolrServer.request(HttpSolrServer.java:182)
		at org.apache.solr.update.SolrCmdDistributor$1.call(SolrCmdDistributor.java:331)
		at org.apache.solr.update.SolrCmdDistributor$1.call(SolrCmdDistributor.java:312)
		at java.util.concurrent.FutureTask$Sync.innerRun(FutureTask.java:334)
		at java.util.concurrent.FutureTask.run(FutureTask.java:166)
		at java.util.concurrent.Executors$RunnableAdapter.call(Executors.java:471)
		at java.util.concurrent.FutureTask$Sync.innerRun(FutureTask.java:334)
		at java.util.concurrent.FutureTask.run(FutureTask.java:166)
		at java.util.concurrent.ThreadPoolExecutor.runWorker(ThreadPoolExecutor.java:1110)
		at java.util.concurrent.ThreadPoolExecutor$Worker.run(ThreadPoolExecutor.java:603)
		at java.lang.Thread.run(Thread.java:679)
	
19243 T1731 C4 P10430 oasc.SolrException.log SEVERE shard update error StdNode: http://127.0.0.1:10433/solr/collection1/:org.apache.solr.common.SolrException: Server at http://127.0.0.1:10433/solr/collection1 returned non ok status:403, message:Server is shutting down
		at org.apache.solr.client.solrj.impl.HttpSolrServer.request(HttpSolrServer.java:373)
		at org.apache.solr.client.solrj.impl.HttpSolrServer.request(HttpSolrServer.java:182)
		at org.apache.solr.update.SolrCmdDistributor$1.call(SolrCmdDistributor.java:331)
		at org.apache.solr.update.SolrCmdDistributor$1.call(SolrCmdDistributor.java:312)
		at java.util.concurrent.FutureTask$Sync.innerRun(FutureTask.java:334)
		at java.util.concurrent.FutureTask.run(FutureTask.java:166)
		at java.util.concurrent.Executors$RunnableAdapter.call(Executors.java:471)
		at java.util.concurrent.FutureTask$Sync.innerRun(FutureTask.java:334)
		at java.util.concurrent.FutureTask.run(FutureTask.java:166)
		at java.util.concurrent.ThreadPoolExecutor.runWorker(ThreadPoolExecutor.java:1110)
		at java.util.concurrent.ThreadPoolExecutor$Worker.run(ThreadPoolExecutor.java:603)
		at java.lang.Thread.run(Thread.java:679)
	
19243 T1730 C4 P10430 oasc.SolrException.log SEVERE shard update error StdNode: http://127.0.0.1:10433/solr/collection1/:org.apache.solr.common.SolrException: Server at http://127.0.0.1:10433/solr/collection1 returned non ok status:403, message:Server is shutting down
		at org.apache.solr.client.solrj.impl.HttpSolrServer.request(HttpSolrServer.java:373)
		at org.apache.solr.client.solrj.impl.HttpSolrServer.request(HttpSolrServer.java:182)
		at org.apache.solr.update.SolrCmdDistributor$1.call(SolrCmdDistributor.java:331)
		at org.apache.solr.update.SolrCmdDistributor$1.call(SolrCmdDistributor.java:312)
		at java.util.concurrent.FutureTask$Sync.innerRun(FutureTask.java:334)
		at java.util.concurrent.FutureTask.run(FutureTask.java:166)
		at java.util.concurrent.Executors$RunnableAdapter.call(Executors.java:471)
		at java.util.concurrent.FutureTask$Sync.innerRun(FutureTask.java:334)
		at java.util.concurrent.FutureTask.run(FutureTask.java:166)
		at java.util.concurrent.ThreadPoolExecutor.runWorker(ThreadPoolExecutor.java:1110)
		at java.util.concurrent.ThreadPoolExecutor$Worker.run(ThreadPoolExecutor.java:603)
		at java.lang.Thread.run(Thread.java:679)
	
19253 T1730 C4 P10430 oasc.SolrException.log SEVERE shard update error StdNode: http://127.0.0.1:10433/solr/collection1/:org.apache.solr.common.SolrException: Server at http://127.0.0.1:10433/solr/collection1 returned non ok status:403, message:Server is shutting down
		at org.apache.solr.client.solrj.impl.HttpSolrServer.request(HttpSolrServer.java:373)
		at org.apache.solr.client.solrj.impl.HttpSolrServer.request(HttpSolrServer.java:182)
		at org.apache.solr.update.SolrCmdDistributor$1.call(SolrCmdDistributor.java:331)
		at org.apache.solr.update.SolrCmdDistributor$1.call(SolrCmdDistributor.java:312)
		at java.util.concurrent.FutureTask$Sync.innerRun(FutureTask.java:334)
		at java.util.concurrent.FutureTask.run(FutureTask.java:166)
		at java.util.concurrent.Executors$RunnableAdapter.call(Executors.java:471)
		at java.util.concurrent.FutureTask$Sync.innerRun(FutureTask.java:334)
		at java.util.concurrent.FutureTask.run(FutureTask.java:166)
		at java.util.concurrent.ThreadPoolExecutor.runWorker(ThreadPoolExecutor.java:1110)
		at java.util.concurrent.ThreadPoolExecutor$Worker.run(ThreadPoolExecutor.java:603)
		at java.lang.Thread.run(Thread.java:679)
	
19253 T1731 C4 P10430 oasc.SolrException.log SEVERE shard update error StdNode: http://127.0.0.1:10433/solr/collection1/:org.apache.solr.common.SolrException: Server at http://127.0.0.1:10433/solr/collection1 returned non ok status:403, message:Server is shutting down
		at org.apache.solr.client.solrj.impl.HttpSolrServer.request(HttpSolrServer.java:373)
		at org.apache.solr.client.solrj.impl.HttpSolrServer.request(HttpSolrServer.java:182)
		at org.apache.solr.update.SolrCmdDistributor$1.call(SolrCmdDistributor.java:331)
		at org.apache.solr.update.SolrCmdDistributor$1.call(SolrCmdDistributor.java:312)
		at java.util.concurrent.FutureTask$Sync.innerRun(FutureTask.java:334)
		at java.util.concurrent.FutureTask.run(FutureTask.java:166)
		at java.util.concurrent.Executors$RunnableAdapter.call(Executors.java:471)
		at java.util.concurrent.FutureTask$Sync.innerRun(FutureTask.java:334)
		at java.util.concurrent.FutureTask.run(FutureTask.java:166)
		at java.util.concurrent.ThreadPoolExecutor.runWorker(ThreadPoolExecutor.java:1110)
		at java.util.concurrent.ThreadPoolExecutor$Worker.run(ThreadPoolExecutor.java:603)
		at java.lang.Thread.run(Thread.java:679)
	
19262 T1731 C4 P10430 oasc.SolrException.log SEVERE shard update error StdNode: http://127.0.0.1:10433/solr/collection1/:org.apache.solr.common.SolrException: Server at http://127.0.0.1:10433/solr/collection1 returned non ok status:403, message:Server is shutting down
		at org.apache.solr.client.solrj.impl.HttpSolrServer.request(HttpSolrServer.java:373)
		at org.apache.solr.client.solrj.impl.HttpSolrServer.request(HttpSolrServer.java:182)
		at org.apache.solr.update.SolrCmdDistributor$1.call(SolrCmdDistributor.java:331)
		at org.apache.solr.update.SolrCmdDistributor$1.call(SolrCmdDistributor.java:312)
		at java.util.concurrent.FutureTask$Sync.innerRun(FutureTask.java:334)
		at java.util.concurrent.FutureTask.run(FutureTask.java:166)
		at java.util.concurrent.Executors$RunnableAdapter.call(Executors.java:471)
		at java.util.concurrent.FutureTask$Sync.innerRun(FutureTask.java:334)
		at java.util.concurrent.FutureTask.run(FutureTask.java:166)
		at java.util.concurrent.ThreadPoolExecutor.runWorker(ThreadPoolExecutor.java:1110)
		at java.util.concurrent.ThreadPoolExecutor$Worker.run(ThreadPoolExecutor.java:603)
		at java.lang.Thread.run(Thread.java:679)
	
19262 T1730 C4 P10430 oasc.SolrException.log SEVERE shard update error StdNode: http://127.0.0.1:10433/solr/collection1/:org.apache.solr.common.SolrException: Server at http://127.0.0.1:10433/solr/collection1 returned non ok status:403, message:Server is shutting down
		at org.apache.solr.client.solrj.impl.HttpSolrServer.request(HttpSolrServer.java:373)
		at org.apache.solr.client.solrj.impl.HttpSolrServer.request(HttpSolrServer.java:182)
		at org.apache.solr.update.SolrCmdDistributor$1.call(SolrCmdDistributor.java:331)
		at org.apache.solr.update.SolrCmdDistributor$1.call(SolrCmdDistributor.java:312)
		at java.util.concurrent.FutureTask$Sync.innerRun(FutureTask.java:334)
		at java.util.concurrent.FutureTask.run(FutureTask.java:166)
		at java.util.concurrent.Executors$RunnableAdapter.call(Executors.java:471)
		at java.util.concurrent.FutureTask$Sync.innerRun(FutureTask.java:334)
		at java.util.concurrent.FutureTask.run(FutureTask.java:166)
		at java.util.concurrent.ThreadPoolExecutor.runWorker(ThreadPoolExecutor.java:1110)
		at java.util.concurrent.ThreadPoolExecutor$Worker.run(ThreadPoolExecutor.java:603)
		at java.lang.Thread.run(Thread.java:679)
	
19271 T1730 C4 P10430 oasc.SolrException.log SEVERE shard update error StdNode: http://127.0.0.1:10433/solr/collection1/:org.apache.solr.common.SolrException: Server at http://127.0.0.1:10433/solr/collection1 returned non ok status:403, message:Server is shutting down
		at org.apache.solr.client.solrj.impl.HttpSolrServer.request(HttpSolrServer.java:373)
		at org.apache.solr.client.solrj.impl.HttpSolrServer.request(HttpSolrServer.java:182)
		at org.apache.solr.update.SolrCmdDistributor$1.call(SolrCmdDistributor.java:331)
		at org.apache.solr.update.SolrCmdDistributor$1.call(SolrCmdDistributor.java:312)
		at java.util.concurrent.FutureTask$Sync.innerRun(FutureTask.java:334)
		at java.util.concurrent.FutureTask.run(FutureTask.java:166)
		at java.util.concurrent.Executors$RunnableAdapter.call(Executors.java:471)
		at java.util.concurrent.FutureTask$Sync.innerRun(FutureTask.java:334)
		at java.util.concurrent.FutureTask.run(FutureTask.java:166)
		at java.util.concurrent.ThreadPoolExecutor.runWorker(ThreadPoolExecutor.java:1110)
		at java.util.concurrent.ThreadPoolExecutor$Worker.run(ThreadPoolExecutor.java:603)
		at java.lang.Thread.run(Thread.java:679)
	
19271 T1731 C4 P10430 oasc.SolrException.log SEVERE shard update error StdNode: http://127.0.0.1:10433/solr/collection1/:org.apache.solr.common.SolrException: Server at http://127.0.0.1:10433/solr/collection1 returned non ok status:403, message:Server is shutting down
		at org.apache.solr.client.solrj.impl.HttpSolrServer.request(HttpSolrServer.java:373)
		at org.apache.solr.client.solrj.impl.HttpSolrServer.request(HttpSolrServer.java:182)
		at org.apache.solr.update.SolrCmdDistributor$1.call(SolrCmdDistributor.java:331)
		at org.apache.solr.update.SolrCmdDistributor$1.call(SolrCmdDistributor.java:312)
		at java.util.concurrent.FutureTask$Sync.innerRun(FutureTask.java:334)
		at java.util.concurrent.FutureTask.run(FutureTask.java:166)
		at java.util.concurrent.Executors$RunnableAdapter.call(Executors.java:471)
		at java.util.concurrent.FutureTask$Sync.innerRun(FutureTask.java:334)
		at java.util.concurrent.FutureTask.run(FutureTask.java:166)
		at java.util.concurrent.ThreadPoolExecutor.runWorker(ThreadPoolExecutor.java:1110)
		at java.util.concurrent.ThreadPoolExecutor$Worker.run(ThreadPoolExecutor.java:603)
		at java.lang.Thread.run(Thread.java:679)
	
19279 T1731 C4 P10430 oasc.SolrException.log SEVERE shard update error StdNode: http://127.0.0.1:10433/solr/collection1/:org.apache.solr.common.SolrException: Server at http://127.0.0.1:10433/solr/collection1 returned non ok status:403, message:Server is shutting down
		at org.apache.solr.client.solrj.impl.HttpSolrServer.request(HttpSolrServer.java:373)
		at org.apache.solr.client.solrj.impl.HttpSolrServer.request(HttpSolrServer.java:182)
		at org.apache.solr.update.SolrCmdDistributor$1.call(SolrCmdDistributor.java:331)
		at org.apache.solr.update.SolrCmdDistributor$1.call(SolrCmdDistributor.java:312)
		at java.util.concurrent.FutureTask$Sync.innerRun(FutureTask.java:334)
		at java.util.concurrent.FutureTask.run(FutureTask.java:166)
		at java.util.concurrent.Executors$RunnableAdapter.call(Executors.java:471)
		at java.util.concurrent.FutureTask$Sync.innerRun(FutureTask.java:334)
		at java.util.concurrent.FutureTask.run(FutureTask.java:166)
		at java.util.concurrent.ThreadPoolExecutor.runWorker(ThreadPoolExecutor.java:1110)
		at java.util.concurrent.ThreadPoolExecutor$Worker.run(ThreadPoolExecutor.java:603)
		at java.lang.Thread.run(Thread.java:679)
	
19280 T1730 C4 P10430 oasc.SolrException.log SEVERE shard update error StdNode: http://127.0.0.1:10433/solr/collection1/:org.apache.solr.common.SolrException: Server at http://127.0.0.1:10433/solr/collection1 returned non ok status:403, message:Server is shutting down
		at org.apache.solr.client.solrj.impl.HttpSolrServer.request(HttpSolrServer.java:373)
		at org.apache.solr.client.solrj.impl.HttpSolrServer.request(HttpSolrServer.java:182)
		at org.apache.solr.update.SolrCmdDistributor$1.call(SolrCmdDistributor.java:331)
		at org.apache.solr.update.SolrCmdDistributor$1.call(SolrCmdDistributor.java:312)
		at java.util.concurrent.FutureTask$Sync.innerRun(FutureTask.java:334)
		at java.util.concurrent.FutureTask.run(FutureTask.java:166)
		at java.util.concurrent.Executors$RunnableAdapter.call(Executors.java:471)
		at java.util.concurrent.FutureTask$Sync.innerRun(FutureTask.java:334)
		at java.util.concurrent.FutureTask.run(FutureTask.java:166)
		at java.util.concurrent.ThreadPoolExecutor.runWorker(ThreadPoolExecutor.java:1110)
		at java.util.concurrent.ThreadPoolExecutor$Worker.run(ThreadPoolExecutor.java:603)
		at java.lang.Thread.run(Thread.java:679)
	
19287 T1731 C4 P10430 oasc.SolrException.log SEVERE shard update error StdNode: http://127.0.0.1:10433/solr/collection1/:org.apache.solr.common.SolrException: Server at http://127.0.0.1:10433/solr/collection1 returned non ok status:403, message:Server is shutting down
		at org.apache.solr.client.solrj.impl.HttpSolrServer.request(HttpSolrServer.java:373)
		at org.apache.solr.client.solrj.impl.HttpSolrServer.request(HttpSolrServer.java:182)
		at org.apache.solr.update.SolrCmdDistributor$1.call(SolrCmdDistributor.java:331)
		at org.apache.solr.update.SolrCmdDistributor$1.call(SolrCmdDistributor.java:312)
		at java.util.concurrent.FutureTask$Sync.innerRun(FutureTask.java:334)
		at java.util.concurrent.FutureTask.run(FutureTask.java:166)
		at java.util.concurrent.Executors$RunnableAdapter.call(Executors.java:471)
		at java.util.concurrent.FutureTask$Sync.innerRun(FutureTask.java:334)
		at java.util.concurrent.FutureTask.run(FutureTask.java:166)
		at java.util.concurrent.ThreadPoolExecutor.runWorker(ThreadPoolExecutor.java:1110)
		at java.util.concurrent.ThreadPoolExecutor$Worker.run(ThreadPoolExecutor.java:603)
		at java.lang.Thread.run(Thread.java:679)
	
19294 T1730 C4 P10430 oasc.SolrException.log SEVERE shard update error StdNode: http://127.0.0.1:10433/solr/collection1/:org.apache.solr.common.SolrException: Server at http://127.0.0.1:10433/solr/collection1 returned non ok status:403, message:Server is shutting down
		at org.apache.solr.client.solrj.impl.HttpSolrServer.request(HttpSolrServer.java:373)
		at org.apache.solr.client.solrj.impl.HttpSolrServer.request(HttpSolrServer.java:182)
		at org.apache.solr.update.SolrCmdDistributor$1.call(SolrCmdDistributor.java:331)
		at org.apache.solr.update.SolrCmdDistributor$1.call(SolrCmdDistributor.java:312)
		at java.util.concurrent.FutureTask$Sync.innerRun(FutureTask.java:334)
		at java.util.concurrent.FutureTask.run(FutureTask.java:166)
		at java.util.concurrent.Executors$RunnableAdapter.call(Executors.java:471)
		at java.util.concurrent.FutureTask$Sync.innerRun(FutureTask.java:334)
		at java.util.concurrent.FutureTask.run(FutureTask.java:166)
		at java.util.concurrent.ThreadPoolExecutor.runWorker(ThreadPoolExecutor.java:1110)
		at java.util.concurrent.ThreadPoolExecutor$Worker.run(ThreadPoolExecutor.java:603)
		at java.lang.Thread.run(Thread.java:679)
	
19300 T1730 C4 P10430 oasc.SolrException.log SEVERE shard update error StdNode: http://127.0.0.1:10433/solr/collection1/:org.apache.solr.common.SolrException: Server at http://127.0.0.1:10433/solr/collection1 returned non ok status:403, message:Server is shutting down
		at org.apache.solr.client.solrj.impl.HttpSolrServer.request(HttpSolrServer.java:373)
		at org.apache.solr.client.solrj.impl.HttpSolrServer.request(HttpSolrServer.java:182)
		at org.apache.solr.update.SolrCmdDistributor$1.call(SolrCmdDistributor.java:331)
		at org.apache.solr.update.SolrCmdDistributor$1.call(SolrCmdDistributor.java:312)
		at java.util.concurrent.FutureTask$Sync.innerRun(FutureTask.java:334)
		at java.util.concurrent.FutureTask.run(FutureTask.java:166)
		at java.util.concurrent.Executors$RunnableAdapter.call(Executors.java:471)
		at java.util.concurrent.FutureTask$Sync.innerRun(FutureTask.java:334)
		at java.util.concurrent.FutureTask.run(FutureTask.java:166)
		at java.util.concurrent.ThreadPoolExecutor.runWorker(ThreadPoolExecutor.java:1110)
		at java.util.concurrent.ThreadPoolExecutor$Worker.run(ThreadPoolExecutor.java:603)
		at java.lang.Thread.run(Thread.java:679)
	
19302 T1731 C4 P10430 oasc.SolrException.log SEVERE shard update error StdNode: http://127.0.0.1:10433/solr/collection1/:org.apache.solr.common.SolrException: Server at http://127.0.0.1:10433/solr/collection1 returned non ok status:403, message:Server is shutting down
		at org.apache.solr.client.solrj.impl.HttpSolrServer.request(HttpSolrServer.java:373)
		at org.apache.solr.client.solrj.impl.HttpSolrServer.request(HttpSolrServer.java:182)
		at org.apache.solr.update.SolrCmdDistributor$1.call(SolrCmdDistributor.java:331)
		at org.apache.solr.update.SolrCmdDistributor$1.call(SolrCmdDistributor.java:312)
		at java.util.concurrent.FutureTask$Sync.innerRun(FutureTask.java:334)
		at java.util.concurrent.FutureTask.run(FutureTask.java:166)
		at java.util.concurrent.Executors$RunnableAdapter.call(Executors.java:471)
		at java.util.concurrent.FutureTask$Sync.innerRun(FutureTask.java:334)
		at java.util.concurrent.FutureTask.run(FutureTask.java:166)
		at java.util.concurrent.ThreadPoolExecutor.runWorker(ThreadPoolExecutor.java:1110)
		at java.util.concurrent.ThreadPoolExecutor$Worker.run(ThreadPoolExecutor.java:603)
		at java.lang.Thread.run(Thread.java:679)
	
19312 T1730 C4 P10430 oasc.SolrException.log SEVERE shard update error StdNode: http://127.0.0.1:10433/solr/collection1/:org.apache.solr.common.SolrException: Server at http://127.0.0.1:10433/solr/collection1 returned non ok status:403, message:Server is shutting down
		at org.apache.solr.client.solrj.impl.HttpSolrServer.request(HttpSolrServer.java:373)
		at org.apache.solr.client.solrj.impl.HttpSolrServer.request(HttpSolrServer.java:182)
		at org.apache.solr.update.SolrCmdDistributor$1.call(SolrCmdDistributor.java:331)
		at org.apache.solr.update.SolrCmdDistributor$1.call(SolrCmdDistributor.java:312)
		at java.util.concurrent.FutureTask$Sync.innerRun(FutureTask.java:334)
		at java.util.concurrent.FutureTask.run(FutureTask.java:166)
		at java.util.concurrent.Executors$RunnableAdapter.call(Executors.java:471)
		at java.util.concurrent.FutureTask$Sync.innerRun(FutureTask.java:334)
		at java.util.concurrent.FutureTask.run(FutureTask.java:166)
		at java.util.concurrent.ThreadPoolExecutor.runWorker(ThreadPoolExecutor.java:1110)
		at java.util.concurrent.ThreadPoolExecutor$Worker.run(ThreadPoolExecutor.java:603)
		at java.lang.Thread.run(Thread.java:679)
	
19314 T1731 C4 P10430 oasc.SolrException.log SEVERE shard update error StdNode: http://127.0.0.1:10433/solr/collection1/:org.apache.solr.common.SolrException: Server at http://127.0.0.1:10433/solr/collection1 returned non ok status:403, message:Server is shutting down
		at org.apache.solr.client.solrj.impl.HttpSolrServer.request(HttpSolrServer.java:373)
		at org.apache.solr.client.solrj.impl.HttpSolrServer.request(HttpSolrServer.java:182)
		at org.apache.solr.update.SolrCmdDistributor$1.call(SolrCmdDistributor.java:331)
		at org.apache.solr.update.SolrCmdDistributor$1.call(SolrCmdDistributor.java:312)
		at java.util.concurrent.FutureTask$Sync.innerRun(FutureTask.java:334)
		at java.util.concurrent.FutureTask.run(FutureTask.java:166)
		at java.util.concurrent.Executors$RunnableAdapter.call(Executors.java:471)
		at java.util.concurrent.FutureTask$Sync.innerRun(FutureTask.java:334)
		at java.util.concurrent.FutureTask.run(FutureTask.java:166)
		at java.util.concurrent.ThreadPoolExecutor.runWorker(ThreadPoolExecutor.java:1110)
		at java.util.concurrent.ThreadPoolExecutor$Worker.run(ThreadPoolExecutor.java:603)
		at java.lang.Thread.run(Thread.java:679)
	
19320 T1731 C4 P10430 oasc.SolrException.log SEVERE shard update error StdNode: http://127.0.0.1:10433/solr/collection1/:org.apache.solr.common.SolrException: Server at http://127.0.0.1:10433/solr/collection1 returned non ok status:403, message:Server is shutting down
		at org.apache.solr.client.solrj.impl.HttpSolrServer.request(HttpSolrServer.java:373)
		at org.apache.solr.client.solrj.impl.HttpSolrServer.request(HttpSolrServer.java:182)
		at org.apache.solr.update.SolrCmdDistributor$1.call(SolrCmdDistributor.java:331)
		at org.apache.solr.update.SolrCmdDistributor$1.call(SolrCmdDistributor.java:312)
		at java.util.concurrent.FutureTask$Sync.innerRun(FutureTask.java:334)
		at java.util.concurrent.FutureTask.run(FutureTask.java:166)
		at java.util.concurrent.Executors$RunnableAdapter.call(Executors.java:471)
		at java.util.concurrent.FutureTask$Sync.innerRun(FutureTask.java:334)
		at java.util.concurrent.FutureTask.run(FutureTask.java:166)
		at java.util.concurrent.ThreadPoolExecutor.runWorker(ThreadPoolExecutor.java:1110)
		at java.util.concurrent.ThreadPoolExecutor$Worker.run(ThreadPoolExecutor.java:603)
		at java.lang.Thread.run(Thread.java:679)
	
19324 T1730 C4 P10430 oasc.SolrException.log SEVERE shard update error StdNode: http://127.0.0.1:10433/solr/collection1/:org.apache.solr.common.SolrException: Server at http://127.0.0.1:10433/solr/collection1 returned non ok status:403, message:Server is shutting down
		at org.apache.solr.client.solrj.impl.HttpSolrServer.request(HttpSolrServer.java:373)
		at org.apache.solr.client.solrj.impl.HttpSolrServer.request(HttpSolrServer.java:182)
		at org.apache.solr.update.SolrCmdDistributor$1.call(SolrCmdDistributor.java:331)
		at org.apache.solr.update.SolrCmdDistributor$1.call(SolrCmdDistributor.java:312)
		at java.util.concurrent.FutureTask$Sync.innerRun(FutureTask.java:334)
		at java.util.concurrent.FutureTask.run(FutureTask.java:166)
		at java.util.concurrent.Executors$RunnableAdapter.call(Executors.java:471)
		at java.util.concurrent.FutureTask$Sync.innerRun(FutureTask.java:334)
		at java.util.concurrent.FutureTask.run(FutureTask.java:166)
		at java.util.concurrent.ThreadPoolExecutor.runWorker(ThreadPoolExecutor.java:1110)
		at java.util.concurrent.ThreadPoolExecutor$Worker.run(ThreadPoolExecutor.java:603)
		at java.lang.Thread.run(Thread.java:679)
	
19334 T1731 C4 P10430 oasc.SolrException.log SEVERE shard update error StdNode: http://127.0.0.1:10433/solr/collection1/:org.apache.solr.common.SolrException: Server at http://127.0.0.1:10433/solr/collection1 returned non ok status:403, message:Server is shutting down
		at org.apache.solr.client.solrj.impl.HttpSolrServer.request(HttpSolrServer.java:373)
		at org.apache.solr.client.solrj.impl.HttpSolrServer.request(HttpSolrServer.java:182)
		at org.apache.solr.update.SolrCmdDistributor$1.call(SolrCmdDistributor.java:331)
		at org.apache.solr.update.SolrCmdDistributor$1.call(SolrCmdDistributor.java:312)
		at java.util.concurrent.FutureTask$Sync.innerRun(FutureTask.java:334)
		at java.util.concurrent.FutureTask.run(FutureTask.java:166)
		at java.util.concurrent.Executors$RunnableAdapter.call(Executors.java:471)
		at java.util.concurrent.FutureTask$Sync.innerRun(FutureTask.java:334)
		at java.util.concurrent.FutureTask.run(FutureTask.java:166)
		at java.util.concurrent.ThreadPoolExecutor.runWorker(ThreadPoolExecutor.java:1110)
		at java.util.concurrent.ThreadPoolExecutor$Worker.run(ThreadPoolExecutor.java:603)
		at java.lang.Thread.run(Thread.java:679)
	
19335 T1730 C4 P10430 oasc.SolrException.log SEVERE shard update error StdNode: http://127.0.0.1:10433/solr/collection1/:org.apache.solr.common.SolrException: Server at http://127.0.0.1:10433/solr/collection1 returned non ok status:403, message:Server is shutting down
		at org.apache.solr.client.solrj.impl.HttpSolrServer.request(HttpSolrServer.java:373)
		at org.apache.solr.client.solrj.impl.HttpSolrServer.request(HttpSolrServer.java:182)
		at org.apache.solr.update.SolrCmdDistributor$1.call(SolrCmdDistributor.java:331)
		at org.apache.solr.update.SolrCmdDistributor$1.call(SolrCmdDistributor.java:312)
		at java.util.concurrent.FutureTask$Sync.innerRun(FutureTask.java:334)
		at java.util.concurrent.FutureTask.run(FutureTask.java:166)
		at java.util.concurrent.Executors$RunnableAdapter.call(Executors.java:471)
		at java.util.concurrent.FutureTask$Sync.innerRun(FutureTask.java:334)
		at java.util.concurrent.FutureTask.run(FutureTask.java:166)
		at java.util.concurrent.ThreadPoolExecutor.runWorker(ThreadPoolExecutor.java:1110)
		at java.util.concurrent.ThreadPoolExecutor$Worker.run(ThreadPoolExecutor.java:603)
		at java.lang.Thread.run(Thread.java:679)
	
19344 T1730 C4 P10430 oasc.SolrException.log SEVERE shard update error StdNode: http://127.0.0.1:10433/solr/collection1/:org.apache.solr.common.SolrException: Server at http://127.0.0.1:10433/solr/collection1 returned non ok status:403, message:Server is shutting down
		at org.apache.solr.client.solrj.impl.HttpSolrServer.request(HttpSolrServer.java:373)
		at org.apache.solr.client.solrj.impl.HttpSolrServer.request(HttpSolrServer.java:182)
		at org.apache.solr.update.SolrCmdDistributor$1.call(SolrCmdDistributor.java:331)
		at org.apache.solr.update.SolrCmdDistributor$1.call(SolrCmdDistributor.java:312)
		at java.util.concurrent.FutureTask$Sync.innerRun(FutureTask.java:334)
		at java.util.concurrent.FutureTask.run(FutureTask.java:166)
		at java.util.concurrent.Executors$RunnableAdapter.call(Executors.java:471)
		at java.util.concurrent.FutureTask$Sync.innerRun(FutureTask.java:334)
		at java.util.concurrent.FutureTask.run(FutureTask.java:166)
		at java.util.concurrent.ThreadPoolExecutor.runWorker(ThreadPoolExecutor.java:1110)
		at java.util.concurrent.ThreadPoolExecutor$Worker.run(ThreadPoolExecutor.java:603)
		at java.lang.Thread.run(Thread.java:679)
	
19347 T1731 C4 P10430 oasc.SolrException.log SEVERE shard update error StdNode: http://127.0.0.1:10433/solr/collection1/:org.apache.solr.common.SolrException: Server at http://127.0.0.1:10433/solr/collection1 returned non ok status:403, message:Server is shutting down
		at org.apache.solr.client.solrj.impl.HttpSolrServer.request(HttpSolrServer.java:373)
		at org.apache.solr.client.solrj.impl.HttpSolrServer.request(HttpSolrServer.java:182)
		at org.apache.solr.update.SolrCmdDistributor$1.call(SolrCmdDistributor.java:331)
		at org.apache.solr.update.SolrCmdDistributor$1.call(SolrCmdDistributor.java:312)
		at java.util.concurrent.FutureTask$Sync.innerRun(FutureTask.java:334)
		at java.util.concurrent.FutureTask.run(FutureTask.java:166)
		at java.util.concurrent.Executors$RunnableAdapter.call(Executors.java:471)
		at java.util.concurrent.FutureTask$Sync.innerRun(FutureTask.java:334)
		at java.util.concurrent.FutureTask.run(FutureTask.java:166)
		at java.util.concurrent.ThreadPoolExecutor.runWorker(ThreadPoolExecutor.java:1110)
		at java.util.concurrent.ThreadPoolExecutor$Worker.run(ThreadPoolExecutor.java:603)
		at java.lang.Thread.run(Thread.java:679)
	
19353 T1731 C4 P10430 oasc.SolrException.log SEVERE shard update error StdNode: http://127.0.0.1:10433/solr/collection1/:org.apache.solr.common.SolrException: Server at http://127.0.0.1:10433/solr/collection1 returned non ok status:403, message:Server is shutting down
		at org.apache.solr.client.solrj.impl.HttpSolrServer.request(HttpSolrServer.java:373)
		at org.apache.solr.client.solrj.impl.HttpSolrServer.request(HttpSolrServer.java:182)
		at org.apache.solr.update.SolrCmdDistributor$1.call(SolrCmdDistributor.java:331)
		at org.apache.solr.update.SolrCmdDistributor$1.call(SolrCmdDistributor.java:312)
		at java.util.concurrent.FutureTask$Sync.innerRun(FutureTask.java:334)
		at java.util.concurrent.FutureTask.run(FutureTask.java:166)
		at java.util.concurrent.Executors$RunnableAdapter.call(Executors.java:471)
		at java.util.concurrent.FutureTask$Sync.innerRun(FutureTask.java:334)
		at java.util.concurrent.FutureTask.run(FutureTask.java:166)
		at java.util.concurrent.ThreadPoolExecutor.runWorker(ThreadPoolExecutor.java:1110)
		at java.util.concurrent.ThreadPoolExecutor$Worker.run(ThreadPoolExecutor.java:603)
		at java.lang.Thread.run(Thread.java:679)
	
19356 T1730 C4 P10430 oasc.SolrException.log SEVERE shard update error StdNode: http://127.0.0.1:10433/solr/collection1/:org.apache.solr.common.SolrException: Server at http://127.0.0.1:10433/solr/collection1 returned non ok status:403, message:Server is shutting down
		at org.apache.solr.client.solrj.impl.HttpSolrServer.request(HttpSolrServer.java:373)
		at org.apache.solr.client.solrj.impl.HttpSolrServer.request(HttpSolrServer.java:182)
		at org.apache.solr.update.SolrCmdDistributor$1.call(SolrCmdDistributor.java:331)
		at org.apache.solr.update.SolrCmdDistributor$1.call(SolrCmdDistributor.java:312)
		at java.util.concurrent.FutureTask$Sync.innerRun(FutureTask.java:334)
		at java.util.concurrent.FutureTask.run(FutureTask.java:166)
		at java.util.concurrent.Executors$RunnableAdapter.call(Executors.java:471)
		at java.util.concurrent.FutureTask$Sync.innerRun(FutureTask.java:334)
		at java.util.concurrent.FutureTask.run(FutureTask.java:166)
		at java.util.concurrent.ThreadPoolExecutor.runWorker(ThreadPoolExecutor.java:1110)
		at java.util.concurrent.ThreadPoolExecutor$Worker.run(ThreadPoolExecutor.java:603)
		at java.lang.Thread.run(Thread.java:679)
	
19365 T1730 C4 P10430 oasc.SolrException.log SEVERE shard update error StdNode: http://127.0.0.1:10433/solr/collection1/:org.apache.solr.common.SolrException: Server at http://127.0.0.1:10433/solr/collection1 returned non ok status:403, message:Server is shutting down
		at org.apache.solr.client.solrj.impl.HttpSolrServer.request(HttpSolrServer.java:373)
		at org.apache.solr.client.solrj.impl.HttpSolrServer.request(HttpSolrServer.java:182)
		at org.apache.solr.update.SolrCmdDistributor$1.call(SolrCmdDistributor.java:331)
		at org.apache.solr.update.SolrCmdDistributor$1.call(SolrCmdDistributor.java:312)
		at java.util.concurrent.FutureTask$Sync.innerRun(FutureTask.java:334)
		at java.util.concurrent.FutureTask.run(FutureTask.java:166)
		at java.util.concurrent.Executors$RunnableAdapter.call(Executors.java:471)
		at java.util.concurrent.FutureTask$Sync.innerRun(FutureTask.java:334)
		at java.util.concurrent.FutureTask.run(FutureTask.java:166)
		at java.util.concurrent.ThreadPoolExecutor.runWorker(ThreadPoolExecutor.java:1110)
		at java.util.concurrent.ThreadPoolExecutor$Worker.run(ThreadPoolExecutor.java:603)
		at java.lang.Thread.run(Thread.java:679)
	
19366 T1731 C4 P10430 oasc.SolrException.log SEVERE shard update error StdNode: http://127.0.0.1:10433/solr/collection1/:org.apache.solr.common.SolrException: Server at http://127.0.0.1:10433/solr/collection1 returned non ok status:403, message:Server is shutting down
		at org.apache.solr.client.solrj.impl.HttpSolrServer.request(HttpSolrServer.java:373)
		at org.apache.solr.client.solrj.impl.HttpSolrServer.request(HttpSolrServer.java:182)
		at org.apache.solr.update.SolrCmdDistributor$1.call(SolrCmdDistributor.java:331)
		at org.apache.solr.update.SolrCmdDistributor$1.call(SolrCmdDistributor.java:312)
		at java.util.concurrent.FutureTask$Sync.innerRun(FutureTask.java:334)
		at java.util.concurrent.FutureTask.run(FutureTask.java:166)
		at java.util.concurrent.Executors$RunnableAdapter.call(Executors.java:471)
		at java.util.concurrent.FutureTask$Sync.innerRun(FutureTask.java:334)
		at java.util.concurrent.FutureTask.run(FutureTask.java:166)
		at java.util.concurrent.ThreadPoolExecutor.runWorker(ThreadPoolExecutor.java:1110)
		at java.util.concurrent.ThreadPoolExecutor$Worker.run(ThreadPoolExecutor.java:603)
		at java.lang.Thread.run(Thread.java:679)
	
19372 T1731 C4 P10430 oasc.SolrException.log SEVERE shard update error StdNode: http://127.0.0.1:10433/solr/collection1/:org.apache.solr.common.SolrException: Server at http://127.0.0.1:10433/solr/collection1 returned non ok status:403, message:Server is shutting down
		at org.apache.solr.client.solrj.impl.HttpSolrServer.request(HttpSolrServer.java:373)
		at org.apache.solr.client.solrj.impl.HttpSolrServer.request(HttpSolrServer.java:182)
		at org.apache.solr.update.SolrCmdDistributor$1.call(SolrCmdDistributor.java:331)
		at org.apache.solr.update.SolrCmdDistributor$1.call(SolrCmdDistributor.java:312)
		at java.util.concurrent.FutureTask$Sync.innerRun(FutureTask.java:334)
		at java.util.concurrent.FutureTask.run(FutureTask.java:166)
		at java.util.concurrent.Executors$RunnableAdapter.call(Executors.java:471)
		at java.util.concurrent.FutureTask$Sync.innerRun(FutureTask.java:334)
		at java.util.concurrent.FutureTask.run(FutureTask.java:166)
		at java.util.concurrent.ThreadPoolExecutor.runWorker(ThreadPoolExecutor.java:1110)
		at java.util.concurrent.ThreadPoolExecutor$Worker.run(ThreadPoolExecutor.java:603)
		at java.lang.Thread.run(Thread.java:679)
	
19373 T1730 C4 P10430 oasc.SolrException.log SEVERE shard update error StdNode: http://127.0.0.1:10433/solr/collection1/:org.apache.solr.common.SolrException: Server at http://127.0.0.1:10433/solr/collection1 returned non ok status:403, message:Server is shutting down
		at org.apache.solr.client.solrj.impl.HttpSolrServer.request(HttpSolrServer.java:373)
		at org.apache.solr.client.solrj.impl.HttpSolrServer.request(HttpSolrServer.java:182)
		at org.apache.solr.update.SolrCmdDistributor$1.call(SolrCmdDistributor.java:331)
		at org.apache.solr.update.SolrCmdDistributor$1.call(SolrCmdDistributor.java:312)
		at java.util.concurrent.FutureTask$Sync.innerRun(FutureTask.java:334)
		at java.util.concurrent.FutureTask.run(FutureTask.java:166)
		at java.util.concurrent.Executors$RunnableAdapter.call(Executors.java:471)
		at java.util.concurrent.FutureTask$Sync.innerRun(FutureTask.java:334)
		at java.util.concurrent.FutureTask.run(FutureTask.java:166)
		at java.util.concurrent.ThreadPoolExecutor.runWorker(ThreadPoolExecutor.java:1110)
		at java.util.concurrent.ThreadPoolExecutor$Worker.run(ThreadPoolExecutor.java:603)
		at java.lang.Thread.run(Thread.java:679)
	
19382 T1730 C4 P10430 oasc.SolrException.log SEVERE shard update error StdNode: http://127.0.0.1:10433/solr/collection1/:org.apache.solr.common.SolrException: Server at http://127.0.0.1:10433/solr/collection1 returned non ok status:403, message:Server is shutting down
		at org.apache.solr.client.solrj.impl.HttpSolrServer.request(HttpSolrServer.java:373)
		at org.apache.solr.client.solrj.impl.HttpSolrServer.request(HttpSolrServer.java:182)
		at org.apache.solr.update.SolrCmdDistributor$1.call(SolrCmdDistributor.java:331)
		at org.apache.solr.update.SolrCmdDistributor$1.call(SolrCmdDistributor.java:312)
		at java.util.concurrent.FutureTask$Sync.innerRun(FutureTask.java:334)
		at java.util.concurrent.FutureTask.run(FutureTask.java:166)
		at java.util.concurrent.Executors$RunnableAdapter.call(Executors.java:471)
		at java.util.concurrent.FutureTask$Sync.innerRun(FutureTask.java:334)
		at java.util.concurrent.FutureTask.run(FutureTask.java:166)
		at java.util.concurrent.ThreadPoolExecutor.runWorker(ThreadPoolExecutor.java:1110)
		at java.util.concurrent.ThreadPoolExecutor$Worker.run(ThreadPoolExecutor.java:603)
		at java.lang.Thread.run(Thread.java:679)
	
19382 T1731 C4 P10430 oasc.SolrException.log SEVERE shard update error StdNode: http://127.0.0.1:10433/solr/collection1/:org.apache.solr.common.SolrException: Server at http://127.0.0.1:10433/solr/collection1 returned non ok status:403, message:Server is shutting down
		at org.apache.solr.client.solrj.impl.HttpSolrServer.request(HttpSolrServer.java:373)
		at org.apache.solr.client.solrj.impl.HttpSolrServer.request(HttpSolrServer.java:182)
		at org.apache.solr.update.SolrCmdDistributor$1.call(SolrCmdDistributor.java:331)
		at org.apache.solr.update.SolrCmdDistributor$1.call(SolrCmdDistributor.java:312)
		at java.util.concurrent.FutureTask$Sync.innerRun(FutureTask.java:334)
		at java.util.concurrent.FutureTask.run(FutureTask.java:166)
		at java.util.concurrent.Executors$RunnableAdapter.call(Executors.java:471)
		at java.util.concurrent.FutureTask$Sync.innerRun(FutureTask.java:334)
		at java.util.concurrent.FutureTask.run(FutureTask.java:166)
		at java.util.concurrent.ThreadPoolExecutor.runWorker(ThreadPoolExecutor.java:1110)
		at java.util.concurrent.ThreadPoolExecutor$Worker.run(ThreadPoolExecutor.java:603)
		at java.lang.Thread.run(Thread.java:679)
	
19391 T1730 C4 P10430 oasc.SolrException.log SEVERE shard update error StdNode: http://127.0.0.1:10433/solr/collection1/:org.apache.solr.common.SolrException: Server at http://127.0.0.1:10433/solr/collection1 returned non ok status:403, message:Server is shutting down
		at org.apache.solr.client.solrj.impl.HttpSolrServer.request(HttpSolrServer.java:373)
		at org.apache.solr.client.solrj.impl.HttpSolrServer.request(HttpSolrServer.java:182)
		at org.apache.solr.update.SolrCmdDistributor$1.call(SolrCmdDistributor.java:331)
		at org.apache.solr.update.SolrCmdDistributor$1.call(SolrCmdDistributor.java:312)
		at java.util.concurrent.FutureTask$Sync.innerRun(FutureTask.java:334)
		at java.util.concurrent.FutureTask.run(FutureTask.java:166)
		at java.util.concurrent.Executors$RunnableAdapter.call(Executors.java:471)
		at java.util.concurrent.FutureTask$Sync.innerRun(FutureTask.java:334)
		at java.util.concurrent.FutureTask.run(FutureTask.java:166)
		at java.util.concurrent.ThreadPoolExecutor.runWorker(ThreadPoolExecutor.java:1110)
		at java.util.concurrent.ThreadPoolExecutor$Worker.run(ThreadPoolExecutor.java:603)
		at java.lang.Thread.run(Thread.java:679)
	
19391 T1731 C4 P10430 oasc.SolrException.log SEVERE shard update error StdNode: http://127.0.0.1:10433/solr/collection1/:org.apache.solr.common.SolrException: Server at http://127.0.0.1:10433/solr/collection1 returned non ok status:403, message:Server is shutting down
		at org.apache.solr.client.solrj.impl.HttpSolrServer.request(HttpSolrServer.java:373)
		at org.apache.solr.client.solrj.impl.HttpSolrServer.request(HttpSolrServer.java:182)
		at org.apache.solr.update.SolrCmdDistributor$1.call(SolrCmdDistributor.java:331)
		at org.apache.solr.update.SolrCmdDistributor$1.call(SolrCmdDistributor.java:312)
		at java.util.concurrent.FutureTask$Sync.innerRun(FutureTask.java:334)
		at java.util.concurrent.FutureTask.run(FutureTask.java:166)
		at java.util.concurrent.Executors$RunnableAdapter.call(Executors.java:471)
		at java.util.concurrent.FutureTask$Sync.innerRun(FutureTask.java:334)
		at java.util.concurrent.FutureTask.run(FutureTask.java:166)
		at java.util.concurrent.ThreadPoolExecutor.runWorker(ThreadPoolExecutor.java:1110)
		at java.util.concurrent.ThreadPoolExecutor$Worker.run(ThreadPoolExecutor.java:603)
		at java.lang.Thread.run(Thread.java:679)
	
19415 T1730 C4 P10430 oasc.SolrException.log SEVERE shard update error StdNode: http://127.0.0.1:10433/solr/collection1/:org.apache.solr.common.SolrException: Server at http://127.0.0.1:10433/solr/collection1 returned non ok status:403, message:Server is shutting down
		at org.apache.solr.client.solrj.impl.HttpSolrServer.request(HttpSolrServer.java:373)
		at org.apache.solr.client.solrj.impl.HttpSolrServer.request(HttpSolrServer.java:182)
		at org.apache.solr.update.SolrCmdDistributor$1.call(SolrCmdDistributor.java:331)
		at org.apache.solr.update.SolrCmdDistributor$1.call(SolrCmdDistributor.java:312)
		at java.util.concurrent.FutureTask$Sync.innerRun(FutureTask.java:334)
		at java.util.concurrent.FutureTask.run(FutureTask.java:166)
		at java.util.concurrent.Executors$RunnableAdapter.call(Executors.java:471)
		at java.util.concurrent.FutureTask$Sync.innerRun(FutureTask.java:334)
		at java.util.concurrent.FutureTask.run(FutureTask.java:166)
		at java.util.concurrent.ThreadPoolExecutor.runWorker(ThreadPoolExecutor.java:1110)
		at java.util.concurrent.ThreadPoolExecutor$Worker.run(ThreadPoolExecutor.java:603)
		at java.lang.Thread.run(Thread.java:679)
	
19417 T1731 C4 P10430 oasc.SolrException.log SEVERE shard update error StdNode: http://127.0.0.1:10433/solr/collection1/:org.apache.solr.common.SolrException: Server at http://127.0.0.1:10433/solr/collection1 returned non ok status:403, message:Server is shutting down
		at org.apache.solr.client.solrj.impl.HttpSolrServer.request(HttpSolrServer.java:373)
		at org.apache.solr.client.solrj.impl.HttpSolrServer.request(HttpSolrServer.java:182)
		at org.apache.solr.update.SolrCmdDistributor$1.call(SolrCmdDistributor.java:331)
		at org.apache.solr.update.SolrCmdDistributor$1.call(SolrCmdDistributor.java:312)
		at java.util.concurrent.FutureTask$Sync.innerRun(FutureTask.java:334)
		at java.util.concurrent.FutureTask.run(FutureTask.java:166)
		at java.util.concurrent.Executors$RunnableAdapter.call(Executors.java:471)
		at java.util.concurrent.FutureTask$Sync.innerRun(FutureTask.java:334)
		at java.util.concurrent.FutureTask.run(FutureTask.java:166)
		at java.util.concurrent.ThreadPoolExecutor.runWorker(ThreadPoolExecutor.java:1110)
		at java.util.concurrent.ThreadPoolExecutor$Worker.run(ThreadPoolExecutor.java:603)
		at java.lang.Thread.run(Thread.java:679)
	
19423 T1731 C4 P10430 oasc.SolrException.log SEVERE shard update error StdNode: http://127.0.0.1:10433/solr/collection1/:org.apache.solr.common.SolrException: Server at http://127.0.0.1:10433/solr/collection1 returned non ok status:403, message:Server is shutting down
		at org.apache.solr.client.solrj.impl.HttpSolrServer.request(HttpSolrServer.java:373)
		at org.apache.solr.client.solrj.impl.HttpSolrServer.request(HttpSolrServer.java:182)
		at org.apache.solr.update.SolrCmdDistributor$1.call(SolrCmdDistributor.java:331)
		at org.apache.solr.update.SolrCmdDistributor$1.call(SolrCmdDistributor.java:312)
		at java.util.concurrent.FutureTask$Sync.innerRun(FutureTask.java:334)
		at java.util.concurrent.FutureTask.run(FutureTask.java:166)
		at java.util.concurrent.Executors$RunnableAdapter.call(Executors.java:471)
		at java.util.concurrent.FutureTask$Sync.innerRun(FutureTask.java:334)
		at java.util.concurrent.FutureTask.run(FutureTask.java:166)
		at java.util.concurrent.ThreadPoolExecutor.runWorker(ThreadPoolExecutor.java:1110)
		at java.util.concurrent.ThreadPoolExecutor$Worker.run(ThreadPoolExecutor.java:603)
		at java.lang.Thread.run(Thread.java:679)
	
19424 T1730 C4 P10430 oasc.SolrException.log SEVERE shard update error StdNode: http://127.0.0.1:10433/solr/collection1/:org.apache.solr.common.SolrException: Server at http://127.0.0.1:10433/solr/collection1 returned non ok status:403, message:Server is shutting down
		at org.apache.solr.client.solrj.impl.HttpSolrServer.request(HttpSolrServer.java:373)
		at org.apache.solr.client.solrj.impl.HttpSolrServer.request(HttpSolrServer.java:182)
		at org.apache.solr.update.SolrCmdDistributor$1.call(SolrCmdDistributor.java:331)
		at org.apache.solr.update.SolrCmdDistributor$1.call(SolrCmdDistributor.java:312)
		at java.util.concurrent.FutureTask$Sync.innerRun(FutureTask.java:334)
		at java.util.concurrent.FutureTask.run(FutureTask.java:166)
		at java.util.concurrent.Executors$RunnableAdapter.call(Executors.java:471)
		at java.util.concurrent.FutureTask$Sync.innerRun(FutureTask.java:334)
		at java.util.concurrent.FutureTask.run(FutureTask.java:166)
		at java.util.concurrent.ThreadPoolExecutor.runWorker(ThreadPoolExecutor.java:1110)
		at java.util.concurrent.ThreadPoolExecutor$Worker.run(ThreadPoolExecutor.java:603)
		at java.lang.Thread.run(Thread.java:679)
	
19433 T1730 C4 P10430 oasc.SolrException.log SEVERE shard update error StdNode: http://127.0.0.1:10433/solr/collection1/:org.apache.solr.common.SolrException: Server at http://127.0.0.1:10433/solr/collection1 returned non ok status:403, message:Server is shutting down
		at org.apache.solr.client.solrj.impl.HttpSolrServer.request(HttpSolrServer.java:373)
		at org.apache.solr.client.solrj.impl.HttpSolrServer.request(HttpSolrServer.java:182)
		at org.apache.solr.update.SolrCmdDistributor$1.call(SolrCmdDistributor.java:331)
		at org.apache.solr.update.SolrCmdDistributor$1.call(SolrCmdDistributor.java:312)
		at java.util.concurrent.FutureTask$Sync.innerRun(FutureTask.java:334)
		at java.util.concurrent.FutureTask.run(FutureTask.java:166)
		at java.util.concurrent.Executors$RunnableAdapter.call(Executors.java:471)
		at java.util.concurrent.FutureTask$Sync.innerRun(FutureTask.java:334)
		at java.util.concurrent.FutureTask.run(FutureTask.java:166)
		at java.util.concurrent.ThreadPoolExecutor.runWorker(ThreadPoolExecutor.java:1110)
		at java.util.concurrent.ThreadPoolExecutor$Worker.run(ThreadPoolExecutor.java:603)
		at java.lang.Thread.run(Thread.java:679)
	
19436 T1731 C4 P10430 oasc.SolrException.log SEVERE shard update error StdNode: http://127.0.0.1:10433/solr/collection1/:org.apache.solr.common.SolrException: Server at http://127.0.0.1:10433/solr/collection1 returned non ok status:403, message:Server is shutting down
		at org.apache.solr.client.solrj.impl.HttpSolrServer.request(HttpSolrServer.java:373)
		at org.apache.solr.client.solrj.impl.HttpSolrServer.request(HttpSolrServer.java:182)
		at org.apache.solr.update.SolrCmdDistributor$1.call(SolrCmdDistributor.java:331)
		at org.apache.solr.update.SolrCmdDistributor$1.call(SolrCmdDistributor.java:312)
		at java.util.concurrent.FutureTask$Sync.innerRun(FutureTask.java:334)
		at java.util.concurrent.FutureTask.run(FutureTask.java:166)
		at java.util.concurrent.Executors$RunnableAdapter.call(Executors.java:471)
		at java.util.concurrent.FutureTask$Sync.innerRun(FutureTask.java:334)
		at java.util.concurrent.FutureTask.run(FutureTask.java:166)
		at java.util.concurrent.ThreadPoolExecutor.runWorker(ThreadPoolExecutor.java:1110)
		at java.util.concurrent.ThreadPoolExecutor$Worker.run(ThreadPoolExecutor.java:603)
		at java.lang.Thread.run(Thread.java:679)
	
19441 T1730 C4 P10430 oasc.SolrException.log SEVERE shard update error StdNode: http://127.0.0.1:10433/solr/collection1/:org.apache.solr.common.SolrException: Server at http://127.0.0.1:10433/solr/collection1 returned non ok status:403, message:Server is shutting down
		at org.apache.solr.client.solrj.impl.HttpSolrServer.request(HttpSolrServer.java:373)
		at org.apache.solr.client.solrj.impl.HttpSolrServer.request(HttpSolrServer.java:182)
		at org.apache.solr.update.SolrCmdDistributor$1.call(SolrCmdDistributor.java:331)
		at org.apache.solr.update.SolrCmdDistributor$1.call(SolrCmdDistributor.java:312)
		at java.util.concurrent.FutureTask$Sync.innerRun(FutureTask.java:334)
		at java.util.concurrent.FutureTask.run(FutureTask.java:166)
		at java.util.concurrent.Executors$RunnableAdapter.call(Executors.java:471)
		at java.util.concurrent.FutureTask$Sync.innerRun(FutureTask.java:334)
		at java.util.concurrent.FutureTask.run(FutureTask.java:166)
		at java.util.concurrent.ThreadPoolExecutor.runWorker(ThreadPoolExecutor.java:1110)
		at java.util.concurrent.ThreadPoolExecutor$Worker.run(ThreadPoolExecutor.java:603)
		at java.lang.Thread.run(Thread.java:679)
	
19445 T1731 C4 P10430 oasc.SolrException.log SEVERE shard update error StdNode: http://127.0.0.1:10433/solr/collection1/:org.apache.solr.common.SolrException: Server at http://127.0.0.1:10433/solr/collection1 returned non ok status:403, message:Server is shutting down
		at org.apache.solr.client.solrj.impl.HttpSolrServer.request(HttpSolrServer.java:373)
		at org.apache.solr.client.solrj.impl.HttpSolrServer.request(HttpSolrServer.java:182)
		at org.apache.solr.update.SolrCmdDistributor$1.call(SolrCmdDistributor.java:331)
		at org.apache.solr.update.SolrCmdDistributor$1.call(SolrCmdDistributor.java:312)
		at java.util.concurrent.FutureTask$Sync.innerRun(FutureTask.java:334)
		at java.util.concurrent.FutureTask.run(FutureTask.java:166)
		at java.util.concurrent.Executors$RunnableAdapter.call(Executors.java:471)
		at java.util.concurrent.FutureTask$Sync.innerRun(FutureTask.java:334)
		at java.util.concurrent.FutureTask.run(FutureTask.java:166)
		at java.util.concurrent.ThreadPoolExecutor.runWorker(ThreadPoolExecutor.java:1110)
		at java.util.concurrent.ThreadPoolExecutor$Worker.run(ThreadPoolExecutor.java:603)
		at java.lang.Thread.run(Thread.java:679)
	
19449 T1730 C4 P10430 oasc.SolrException.log SEVERE shard update error StdNode: http://127.0.0.1:10433/solr/collection1/:org.apache.solr.common.SolrException: Server at http://127.0.0.1:10433/solr/collection1 returned non ok status:403, message:Server is shutting down
		at org.apache.solr.client.solrj.impl.HttpSolrServer.request(HttpSolrServer.java:373)
		at org.apache.solr.client.solrj.impl.HttpSolrServer.request(HttpSolrServer.java:182)
		at org.apache.solr.update.SolrCmdDistributor$1.call(SolrCmdDistributor.java:331)
		at org.apache.solr.update.SolrCmdDistributor$1.call(SolrCmdDistributor.java:312)
		at java.util.concurrent.FutureTask$Sync.innerRun(FutureTask.java:334)
		at java.util.concurrent.FutureTask.run(FutureTask.java:166)
		at java.util.concurrent.Executors$RunnableAdapter.call(Executors.java:471)
		at java.util.concurrent.FutureTask$Sync.innerRun(FutureTask.java:334)
		at java.util.concurrent.FutureTask.run(FutureTask.java:166)
		at java.util.concurrent.ThreadPoolExecutor.runWorker(ThreadPoolExecutor.java:1110)
		at java.util.concurrent.ThreadPoolExecutor$Worker.run(ThreadPoolExecutor.java:603)
		at java.lang.Thread.run(Thread.java:679)
	
19453 T1731 C4 P10430 oasc.SolrException.log SEVERE shard update error StdNode: http://127.0.0.1:10433/solr/collection1/:org.apache.solr.common.SolrException: Server at http://127.0.0.1:10433/solr/collection1 returned non ok status:403, message:Server is shutting down
		at org.apache.solr.client.solrj.impl.HttpSolrServer.request(HttpSolrServer.java:373)
		at org.apache.solr.client.solrj.impl.HttpSolrServer.request(HttpSolrServer.java:182)
		at org.apache.solr.update.SolrCmdDistributor$1.call(SolrCmdDistributor.java:331)
		at org.apache.solr.update.SolrCmdDistributor$1.call(SolrCmdDistributor.java:312)
		at java.util.concurrent.FutureTask$Sync.innerRun(FutureTask.java:334)
		at java.util.concurrent.FutureTask.run(FutureTask.java:166)
		at java.util.concurrent.Executors$RunnableAdapter.call(Executors.java:471)
		at java.util.concurrent.FutureTask$Sync.innerRun(FutureTask.java:334)
		at java.util.concurrent.FutureTask.run(FutureTask.java:166)
		at java.util.concurrent.ThreadPoolExecutor.runWorker(ThreadPoolExecutor.java:1110)
		at java.util.concurrent.ThreadPoolExecutor$Worker.run(ThreadPoolExecutor.java:603)
		at java.lang.Thread.run(Thread.java:679)
	
19456 T1730 C4 P10430 oasc.SolrException.log SEVERE shard update error StdNode: http://127.0.0.1:10433/solr/collection1/:org.apache.solr.common.SolrException: Server at http://127.0.0.1:10433/solr/collection1 returned non ok status:403, message:Server is shutting down
		at org.apache.solr.client.solrj.impl.HttpSolrServer.request(HttpSolrServer.java:373)
		at org.apache.solr.client.solrj.impl.HttpSolrServer.request(HttpSolrServer.java:182)
		at org.apache.solr.update.SolrCmdDistributor$1.call(SolrCmdDistributor.java:331)
		at org.apache.solr.update.SolrCmdDistributor$1.call(SolrCmdDistributor.java:312)
		at java.util.concurrent.FutureTask$Sync.innerRun(FutureTask.java:334)
		at java.util.concurrent.FutureTask.run(FutureTask.java:166)
		at java.util.concurrent.Executors$RunnableAdapter.call(Executors.java:471)
		at java.util.concurrent.FutureTask$Sync.innerRun(FutureTask.java:334)
		at java.util.concurrent.FutureTask.run(FutureTask.java:166)
		at java.util.concurrent.ThreadPoolExecutor.runWorker(ThreadPoolExecutor.java:1110)
		at java.util.concurrent.ThreadPoolExecutor$Worker.run(ThreadPoolExecutor.java:603)
		at java.lang.Thread.run(Thread.java:679)
	
19460 T1731 C4 P10430 oasc.SolrException.log SEVERE shard update error StdNode: http://127.0.0.1:10433/solr/collection1/:org.apache.solr.common.SolrException: Server at http://127.0.0.1:10433/solr/collection1 returned non ok status:403, message:Server is shutting down
		at org.apache.solr.client.solrj.impl.HttpSolrServer.request(HttpSolrServer.java:373)
		at org.apache.solr.client.solrj.impl.HttpSolrServer.request(HttpSolrServer.java:182)
		at org.apache.solr.update.SolrCmdDistributor$1.call(SolrCmdDistributor.java:331)
		at org.apache.solr.update.SolrCmdDistributor$1.call(SolrCmdDistributor.java:312)
		at java.util.concurrent.FutureTask$Sync.innerRun(FutureTask.java:334)
		at java.util.concurrent.FutureTask.run(FutureTask.java:166)
		at java.util.concurrent.Executors$RunnableAdapter.call(Executors.java:471)
		at java.util.concurrent.FutureTask$Sync.innerRun(FutureTask.java:334)
		at java.util.concurrent.FutureTask.run(FutureTask.java:166)
		at java.util.concurrent.ThreadPoolExecutor.runWorker(ThreadPoolExecutor.java:1110)
		at java.util.concurrent.ThreadPoolExecutor$Worker.run(ThreadPoolExecutor.java:603)
		at java.lang.Thread.run(Thread.java:679)
	
19467 T1731 C4 P10430 oasc.SolrException.log SEVERE shard update error StdNode: http://127.0.0.1:10433/solr/collection1/:org.apache.solr.common.SolrException: Server at http://127.0.0.1:10433/solr/collection1 returned non ok status:403, message:Server is shutting down
		at org.apache.solr.client.solrj.impl.HttpSolrServer.request(HttpSolrServer.java:373)
		at org.apache.solr.client.solrj.impl.HttpSolrServer.request(HttpSolrServer.java:182)
		at org.apache.solr.update.SolrCmdDistributor$1.call(SolrCmdDistributor.java:331)
		at org.apache.solr.update.SolrCmdDistributor$1.call(SolrCmdDistributor.java:312)
		at java.util.concurrent.FutureTask$Sync.innerRun(FutureTask.java:334)
		at java.util.concurrent.FutureTask.run(FutureTask.java:166)
		at java.util.concurrent.Executors$RunnableAdapter.call(Executors.java:471)
		at java.util.concurrent.FutureTask$Sync.innerRun(FutureTask.java:334)
		at java.util.concurrent.FutureTask.run(FutureTask.java:166)
		at java.util.concurrent.ThreadPoolExecutor.runWorker(ThreadPoolExecutor.java:1110)
		at java.util.concurrent.ThreadPoolExecutor$Worker.run(ThreadPoolExecutor.java:603)
		at java.lang.Thread.run(Thread.java:679)
	
19468 T1730 C4 P10430 oasc.SolrException.log SEVERE shard update error StdNode: http://127.0.0.1:10433/solr/collection1/:org.apache.solr.common.SolrException: Server at http://127.0.0.1:10433/solr/collection1 returned non ok status:403, message:Server is shutting down
		at org.apache.solr.client.solrj.impl.HttpSolrServer.request(HttpSolrServer.java:373)
		at org.apache.solr.client.solrj.impl.HttpSolrServer.request(HttpSolrServer.java:182)
		at org.apache.solr.update.SolrCmdDistributor$1.call(SolrCmdDistributor.java:331)
		at org.apache.solr.update.SolrCmdDistributor$1.call(SolrCmdDistributor.java:312)
		at java.util.concurrent.FutureTask$Sync.innerRun(FutureTask.java:334)
		at java.util.concurrent.FutureTask.run(FutureTask.java:166)
		at java.util.concurrent.Executors$RunnableAdapter.call(Executors.java:471)
		at java.util.concurrent.FutureTask$Sync.innerRun(FutureTask.java:334)
		at java.util.concurrent.FutureTask.run(FutureTask.java:166)
		at java.util.concurrent.ThreadPoolExecutor.runWorker(ThreadPoolExecutor.java:1110)
		at java.util.concurrent.ThreadPoolExecutor$Worker.run(ThreadPoolExecutor.java:603)
		at java.lang.Thread.run(Thread.java:679)
	
19474 T1730 C4 P10430 oasc.SolrException.log SEVERE shard update error StdNode: http://127.0.0.1:10433/solr/collection1/:org.apache.solr.common.SolrException: Server at http://127.0.0.1:10433/solr/collection1 returned non ok status:403, message:Server is shutting down
		at org.apache.solr.client.solrj.impl.HttpSolrServer.request(HttpSolrServer.java:373)
		at org.apache.solr.client.solrj.impl.HttpSolrServer.request(HttpSolrServer.java:182)
		at org.apache.solr.update.SolrCmdDistributor$1.call(SolrCmdDistributor.java:331)
		at org.apache.solr.update.SolrCmdDistributor$1.call(SolrCmdDistributor.java:312)
		at java.util.concurrent.FutureTask$Sync.innerRun(FutureTask.java:334)
		at java.util.concurrent.FutureTask.run(FutureTask.java:166)
		at java.util.concurrent.Executors$RunnableAdapter.call(Executors.java:471)
		at java.util.concurrent.FutureTask$Sync.innerRun(FutureTask.java:334)
		at java.util.concurrent.FutureTask.run(FutureTask.java:166)
		at java.util.concurrent.ThreadPoolExecutor.runWorker(ThreadPoolExecutor.java:1110)
		at java.util.concurrent.ThreadPoolExecutor$Worker.run(ThreadPoolExecutor.java:603)
		at java.lang.Thread.run(Thread.java:679)
	
19477 T1731 C4 P10430 oasc.SolrException.log SEVERE shard update error StdNode: http://127.0.0.1:10433/solr/collection1/:org.apache.solr.common.SolrException: Server at http://127.0.0.1:10433/solr/collection1 returned non ok status:403, message:Server is shutting down
		at org.apache.solr.client.solrj.impl.HttpSolrServer.request(HttpSolrServer.java:373)
		at org.apache.solr.client.solrj.impl.HttpSolrServer.request(HttpSolrServer.java:182)
		at org.apache.solr.update.SolrCmdDistributor$1.call(SolrCmdDistributor.java:331)
		at org.apache.solr.update.SolrCmdDistributor$1.call(SolrCmdDistributor.java:312)
		at java.util.concurrent.FutureTask$Sync.innerRun(FutureTask.java:334)
		at java.util.concurrent.FutureTask.run(FutureTask.java:166)
		at java.util.concurrent.Executors$RunnableAdapter.call(Executors.java:471)
		at java.util.concurrent.FutureTask$Sync.innerRun(FutureTask.java:334)
		at java.util.concurrent.FutureTask.run(FutureTask.java:166)
		at java.util.concurrent.ThreadPoolExecutor.runWorker(ThreadPoolExecutor.java:1110)
		at java.util.concurrent.ThreadPoolExecutor$Worker.run(ThreadPoolExecutor.java:603)
		at java.lang.Thread.run(Thread.java:679)
	
19481 T1730 C4 P10430 oasc.SolrException.log SEVERE shard update error StdNode: http://127.0.0.1:10433/solr/collection1/:org.apache.solr.common.SolrException: Server at http://127.0.0.1:10433/solr/collection1 returned non ok status:403, message:Server is shutting down
		at org.apache.solr.client.solrj.impl.HttpSolrServer.request(HttpSolrServer.java:373)
		at org.apache.solr.client.solrj.impl.HttpSolrServer.request(HttpSolrServer.java:182)
		at org.apache.solr.update.SolrCmdDistributor$1.call(SolrCmdDistributor.java:331)
		at org.apache.solr.update.SolrCmdDistributor$1.call(SolrCmdDistributor.java:312)
		at java.util.concurrent.FutureTask$Sync.innerRun(FutureTask.java:334)
		at java.util.concurrent.FutureTask.run(FutureTask.java:166)
		at java.util.concurrent.Executors$RunnableAdapter.call(Executors.java:471)
		at java.util.concurrent.FutureTask$Sync.innerRun(FutureTask.java:334)
		at java.util.concurrent.FutureTask.run(FutureTask.java:166)
		at java.util.concurrent.ThreadPoolExecutor.runWorker(ThreadPoolExecutor.java:1110)
		at java.util.concurrent.ThreadPoolExecutor$Worker.run(ThreadPoolExecutor.java:603)
		at java.lang.Thread.run(Thread.java:679)
	
19485 T1731 C4 P10430 oasc.SolrException.log SEVERE shard update error StdNode: http://127.0.0.1:10433/solr/collection1/:org.apache.solr.common.SolrException: Server at http://127.0.0.1:10433/solr/collection1 returned non ok status:403, message:Server is shutting down
		at org.apache.solr.client.solrj.impl.HttpSolrServer.request(HttpSolrServer.java:373)
		at org.apache.solr.client.solrj.impl.HttpSolrServer.request(HttpSolrServer.java:182)
		at org.apache.solr.update.SolrCmdDistributor$1.call(SolrCmdDistributor.java:331)
		at org.apache.solr.update.SolrCmdDistributor$1.call(SolrCmdDistributor.java:312)
		at java.util.concurrent.FutureTask$Sync.innerRun(FutureTask.java:334)
		at java.util.concurrent.FutureTask.run(FutureTask.java:166)
		at java.util.concurrent.Executors$RunnableAdapter.call(Executors.java:471)
		at java.util.concurrent.FutureTask$Sync.innerRun(FutureTask.java:334)
		at java.util.concurrent.FutureTask.run(FutureTask.java:166)
		at java.util.concurrent.ThreadPoolExecutor.runWorker(ThreadPoolExecutor.java:1110)
		at java.util.concurrent.ThreadPoolExecutor$Worker.run(ThreadPoolExecutor.java:603)
		at java.lang.Thread.run(Thread.java:679)
	
19489 T1730 C4 P10430 oasc.SolrException.log SEVERE shard update error StdNode: http://127.0.0.1:10433/solr/collection1/:org.apache.solr.common.SolrException: Server at http://127.0.0.1:10433/solr/collection1 returned non ok status:403, message:Server is shutting down
		at org.apache.solr.client.solrj.impl.HttpSolrServer.request(HttpSolrServer.java:373)
		at org.apache.solr.client.solrj.impl.HttpSolrServer.request(HttpSolrServer.java:182)
		at org.apache.solr.update.SolrCmdDistributor$1.call(SolrCmdDistributor.java:331)
		at org.apache.solr.update.SolrCmdDistributor$1.call(SolrCmdDistributor.java:312)
		at java.util.concurrent.FutureTask$Sync.innerRun(FutureTask.java:334)
		at java.util.concurrent.FutureTask.run(FutureTask.java:166)
		at java.util.concurrent.Executors$Runnabl

[...truncated too long message...]

o https://repository.apache.org/content/repositories/snapshots
[artifact:deploy] [INFO] Retrieving previous build number from apache.snapshots.https
[artifact:deploy] Uploading: org/apache/lucene/lucene-parent/5.0-SNAPSHOT/lucene-parent-5.0-20120903.042410-1087.pom to repository apache.snapshots.https at https://repository.apache.org/content/repositories/snapshots
[artifact:deploy] Transferring 2K from apache.snapshots.https
[artifact:deploy] Uploaded 2K
[artifact:deploy] [INFO] Retrieving previous metadata from apache.snapshots.https
[artifact:deploy] [INFO] Uploading repository metadata for: 'artifact org.apache.lucene:lucene-parent'
[artifact:deploy] [INFO] Retrieving previous metadata from apache.snapshots.https
[artifact:deploy] [INFO] Uploading repository metadata for: 'snapshot org.apache.lucene:lucene-parent:5.0-SNAPSHOT'

check-analyzers-common-uptodate:

jar-analyzers-common:

resolve:

common.init:

compile-lucene-core:

init:

-clover.disable:

-clover.setup:

clover:

common.compile-core:

compile-core:

jar-core:
      [jar] Building jar: /usr/home/hudson/hudson-slave/workspace/Lucene-Solr-Maven-trunk/lucene/build/analysis/morfologik/lucene-analyzers-morfologik-5.0-SNAPSHOT.jar

jar-src:
      [jar] Building jar: /usr/home/hudson/hudson-slave/workspace/Lucene-Solr-Maven-trunk/lucene/build/analysis/morfologik/lucene-analyzers-morfologik-5.0-SNAPSHOT-src.jar

check-analyzers-common-javadocs-uptodate:

javadocs-analyzers-common:

javadocs:
     [echo] Building analyzers-morfologik...

download-java6-javadoc-packagelist:
   [delete] Deleting: /usr/home/hudson/hudson-slave/workspace/Lucene-Solr-Maven-trunk/lucene/build/docs/analyzers-morfologik/stylesheet.css
  [javadoc] Generating Javadoc
  [javadoc] Javadoc execution
  [javadoc] Loading source files for package org.apache.lucene.analysis.morfologik...
  [javadoc] Constructing Javadoc information...
  [javadoc] Standard Doclet version 1.6.0_32
  [javadoc] Building tree for all the packages and classes...
  [javadoc] Building index for all the packages and classes...
  [javadoc] Building index for all classes...
  [javadoc] Generating /usr/home/hudson/hudson-slave/workspace/Lucene-Solr-Maven-trunk/lucene/build/docs/analyzers-morfologik/stylesheet.css...
  [javadoc] Note: Custom tags that were not seen:  @lucene.internal, @lucene.experimental
      [jar] Building jar: /usr/home/hudson/hudson-slave/workspace/Lucene-Solr-Maven-trunk/lucene/build/analysis/morfologik/lucene-analyzers-morfologik-5.0-SNAPSHOT-javadoc.jar

dist-maven-common:
[artifact:install-provider] Installing provider: org.apache.maven.wagon:wagon-ssh:jar:1.0-beta-7:runtime
[artifact:deploy] Deploying to https://repository.apache.org/content/repositories/snapshots
[artifact:deploy] [INFO] Retrieving previous build number from apache.snapshots.https
[artifact:deploy] Uploading: org/apache/lucene/lucene-analyzers-morfologik/5.0-SNAPSHOT/lucene-analyzers-morfologik-5.0-20120903.042410-48.jar to repository apache.snapshots.https at https://repository.apache.org/content/repositories/snapshots
[artifact:deploy] Transferring 20K from apache.snapshots.https
[artifact:deploy] Uploaded 20K
[artifact:deploy] [INFO] Retrieving previous metadata from apache.snapshots.https
[artifact:deploy] [INFO] Uploading repository metadata for: 'snapshot org.apache.lucene:lucene-analyzers-morfologik:5.0-SNAPSHOT'
[artifact:deploy] [INFO] Retrieving previous metadata from apache.snapshots.https
[artifact:deploy] [INFO] Uploading repository metadata for: 'artifact org.apache.lucene:lucene-analyzers-morfologik'
[artifact:deploy] [INFO] Uploading project information for lucene-analyzers-morfologik 5.0-20120903.042410-48
[artifact:deploy] [INFO] Retrieving previous build number from apache.snapshots.https
[artifact:deploy] Uploading: org/apache/lucene/lucene-analyzers-morfologik/5.0-SNAPSHOT/lucene-analyzers-morfologik-5.0-20120903.042410-48-sources.jar to repository apache.snapshots.https at https://repository.apache.org/content/repositories/snapshots
[artifact:deploy] Transferring 22K from apache.snapshots.https
[artifact:deploy] Uploaded 22K
[artifact:deploy] [INFO] Retrieving previous build number from apache.snapshots.https
[artifact:deploy] Uploading: org/apache/lucene/lucene-analyzers-morfologik/5.0-SNAPSHOT/lucene-analyzers-morfologik-5.0-20120903.042410-48-javadoc.jar to repository apache.snapshots.https at https://repository.apache.org/content/repositories/snapshots
[artifact:deploy] Transferring 64K from apache.snapshots.https
[artifact:deploy] Uploaded 64K

dist-maven:
     [echo] Building analyzers-phonetic...

filter-pom-templates:

ivy-availability-check:

ivy-fail:

ivy-configure:
[ivy:configure] :: loading settings :: file = /usr/home/hudson/hudson-slave/workspace/Lucene-Solr-Maven-trunk/lucene/ivy-settings.xml

install-maven-tasks:

m2-deploy-grandparent-pom:
[artifact:install-provider] Installing provider: org.apache.maven.wagon:wagon-ssh:jar:1.0-beta-7:runtime
[artifact:deploy] Deploying to https://repository.apache.org/content/repositories/snapshots
[artifact:deploy] [INFO] Retrieving previous build number from apache.snapshots.https
[artifact:deploy] Uploading: org/apache/lucene/lucene-solr-grandparent/5.0-SNAPSHOT/lucene-solr-grandparent-5.0-20120903.042418-1088.pom to repository apache.snapshots.https at https://repository.apache.org/content/repositories/snapshots
[artifact:deploy] Transferring 25K from apache.snapshots.https
[artifact:deploy] Uploaded 25K
[artifact:deploy] [INFO] Retrieving previous metadata from apache.snapshots.https
[artifact:deploy] [INFO] Uploading repository metadata for: 'artifact org.apache.lucene:lucene-solr-grandparent'
[artifact:deploy] [INFO] Retrieving previous metadata from apache.snapshots.https
[artifact:deploy] [INFO] Uploading repository metadata for: 'snapshot org.apache.lucene:lucene-solr-grandparent:5.0-SNAPSHOT'

m2-deploy-lucene-parent-pom:
[artifact:install-provider] Installing provider: org.apache.maven.wagon:wagon-ssh:jar:1.0-beta-7:runtime
[artifact:deploy] Deploying to https://repository.apache.org/content/repositories/snapshots
[artifact:deploy] [INFO] Retrieving previous build number from apache.snapshots.https
[artifact:deploy] Uploading: org/apache/lucene/lucene-parent/5.0-SNAPSHOT/lucene-parent-5.0-20120903.042418-1088.pom to repository apache.snapshots.https at https://repository.apache.org/content/repositories/snapshots
[artifact:deploy] Transferring 2K from apache.snapshots.https
[artifact:deploy] Uploaded 2K
[artifact:deploy] [INFO] Retrieving previous metadata from apache.snapshots.https
[artifact:deploy] [INFO] Uploading repository metadata for: 'artifact org.apache.lucene:lucene-parent'
[artifact:deploy] [INFO] Retrieving previous metadata from apache.snapshots.https
[artifact:deploy] [INFO] Uploading repository metadata for: 'snapshot org.apache.lucene:lucene-parent:5.0-SNAPSHOT'

check-analyzers-common-uptodate:

jar-analyzers-common:

resolve:

common.init:

compile-lucene-core:

init:

-clover.disable:

-clover.setup:

clover:

common.compile-core:

compile-core:

jar-core:
      [jar] Building jar: /usr/home/hudson/hudson-slave/workspace/Lucene-Solr-Maven-trunk/lucene/build/analysis/phonetic/lucene-analyzers-phonetic-5.0-SNAPSHOT.jar

jar-src:
      [jar] Building jar: /usr/home/hudson/hudson-slave/workspace/Lucene-Solr-Maven-trunk/lucene/build/analysis/phonetic/lucene-analyzers-phonetic-5.0-SNAPSHOT-src.jar

check-analyzers-common-javadocs-uptodate:

javadocs-analyzers-common:

javadocs:
     [echo] Building analyzers-phonetic...

download-java6-javadoc-packagelist:
   [delete] Deleting: /usr/home/hudson/hudson-slave/workspace/Lucene-Solr-Maven-trunk/lucene/build/docs/analyzers-phonetic/stylesheet.css
  [javadoc] Generating Javadoc
  [javadoc] Javadoc execution
FATAL: hudson.remoting.RequestAbortedException: java.io.IOException: Unexpected termination of the channel
hudson.remoting.RequestAbortedException: hudson.remoting.RequestAbortedException: java.io.IOException: Unexpected termination of the channel
	at hudson.remoting.Request.call(Request.java:174)
	at hudson.remoting.Channel.call(Channel.java:663)
	at hudson.remoting.RemoteInvocationHandler.invoke(RemoteInvocationHandler.java:158)
	at $Proxy38.join(Unknown Source)
	at hudson.Launcher$RemoteLauncher$ProcImpl.join(Launcher.java:861)
	at hudson.Launcher$ProcStarter.join(Launcher.java:345)
	at hudson.tasks.Ant.perform(Ant.java:217)
	at hudson.tasks.BuildStepMonitor$1.perform(BuildStepMonitor.java:19)
	at hudson.model.AbstractBuild$AbstractBuildExecution.perform(AbstractBuild.java:717)
	at hudson.model.Build$BuildExecution.build(Build.java:199)
	at hudson.model.Build$BuildExecution.doRun(Build.java:160)
	at hudson.model.AbstractBuild$AbstractBuildExecution.run(AbstractBuild.java:499)
	at hudson.model.Run.execute(Run.java:1502)
	at hudson.model.FreeStyleBuild.run(FreeStyleBuild.java:46)
	at hudson.model.ResourceController.execute(ResourceController.java:88)
	at hudson.model.Executor.run(Executor.java:236)
Caused by: hudson.remoting.RequestAbortedException: java.io.IOException: Unexpected termination of the channel
	at hudson.remoting.Request.abort(Request.java:299)
	at hudson.remoting.Channel.terminate(Channel.java:719)
	at hudson.remoting.SynchronousCommandTransport$ReaderThread.run(SynchronousCommandTransport.java:69)
Caused by: java.io.IOException: Unexpected termination of the channel
	at hudson.remoting.SynchronousCommandTransport$ReaderThread.run(SynchronousCommandTransport.java:50)
Caused by: java.io.EOFException
	at java.io.ObjectInputStream$BlockDataInputStream.peekByte(ObjectInputStream.java:2571)
	at java.io.ObjectInputStream.readObject0(ObjectInputStream.java:1315)
	at java.io.ObjectInputStream.readObject(ObjectInputStream.java:369)
	at hudson.remoting.Command.readFrom(Command.java:90)
	at hudson.remoting.ClassicCommandTransport.read(ClassicCommandTransport.java:59)
	at hudson.remoting.SynchronousCommandTransport$ReaderThread.run(SynchronousCommandTransport.java:48)




Mime
View raw message