lucene-dev mailing list archives

Site index · List index
Message view « Date » · « Thread »
Top « Date » · « Thread »
From Apache Jenkins Server <jenk...@builds.apache.org>
Subject [JENKINS] Lucene-Solr-Tests-4.x-Java6 - Build # 685 - Failure
Date Fri, 21 Sep 2012 09:30:32 GMT
Build: https://builds.apache.org/job/Lucene-Solr-Tests-4.x-Java6/685/

1 tests failed.
REGRESSION:  org.apache.solr.cloud.BasicDistributedZk2Test.testDistribSearch

Error Message:
Shard still reported as live in zk

Stack Trace:
java.lang.AssertionError: Shard still reported as live in zk
	at __randomizedtesting.SeedInfo.seed([1AA22F2C6CA5D7A1:9B44A1341BFAB79D]:0)
	at org.junit.Assert.fail(Assert.java:93)
	at org.apache.solr.cloud.AbstractFullDistribZkTestBase.waitToSeeNotLive(AbstractFullDistribZkTestBase.java:1220)
	at org.apache.solr.cloud.BasicDistributedZk2Test.brindDownShardIndexSomeDocsAndRecover(BasicDistributedZk2Test.java:190)
	at org.apache.solr.cloud.BasicDistributedZk2Test.doTest(BasicDistributedZk2Test.java:83)
	at org.apache.solr.BaseDistributedSearchTestCase.testDistribSearch(BaseDistributedSearchTestCase.java:695)
	at sun.reflect.NativeMethodAccessorImpl.invoke0(Native Method)
	at sun.reflect.NativeMethodAccessorImpl.invoke(NativeMethodAccessorImpl.java:57)
	at sun.reflect.DelegatingMethodAccessorImpl.invoke(DelegatingMethodAccessorImpl.java:43)
	at java.lang.reflect.Method.invoke(Method.java:616)
	at com.carrotsearch.randomizedtesting.RandomizedRunner.invoke(RandomizedRunner.java:1559)
	at com.carrotsearch.randomizedtesting.RandomizedRunner.access$600(RandomizedRunner.java:79)
	at com.carrotsearch.randomizedtesting.RandomizedRunner$6.evaluate(RandomizedRunner.java:737)
	at com.carrotsearch.randomizedtesting.RandomizedRunner$7.evaluate(RandomizedRunner.java:773)
	at com.carrotsearch.randomizedtesting.RandomizedRunner$8.evaluate(RandomizedRunner.java:787)
	at com.carrotsearch.randomizedtesting.rules.SystemPropertiesRestoreRule$1.evaluate(SystemPropertiesRestoreRule.java:53)
	at org.apache.lucene.util.TestRuleSetupTeardownChained$1.evaluate(TestRuleSetupTeardownChained.java:50)
	at org.apache.lucene.util.TestRuleFieldCacheSanity$1.evaluate(TestRuleFieldCacheSanity.java:51)
	at org.apache.lucene.util.AbstractBeforeAfterRule$1.evaluate(AbstractBeforeAfterRule.java:45)
	at com.carrotsearch.randomizedtesting.rules.SystemPropertiesInvariantRule$1.evaluate(SystemPropertiesInvariantRule.java:55)
	at org.apache.lucene.util.TestRuleThreadAndTestName$1.evaluate(TestRuleThreadAndTestName.java:48)
	at org.apache.lucene.util.TestRuleIgnoreAfterMaxFailures$1.evaluate(TestRuleIgnoreAfterMaxFailures.java:70)
	at org.apache.lucene.util.TestRuleMarkFailure$1.evaluate(TestRuleMarkFailure.java:48)
	at com.carrotsearch.randomizedtesting.rules.StatementAdapter.evaluate(StatementAdapter.java:36)
	at com.carrotsearch.randomizedtesting.ThreadLeakControl$StatementRunner.run(ThreadLeakControl.java:358)
	at com.carrotsearch.randomizedtesting.ThreadLeakControl.forkTimeoutingTask(ThreadLeakControl.java:782)
	at com.carrotsearch.randomizedtesting.ThreadLeakControl$3.evaluate(ThreadLeakControl.java:442)
	at com.carrotsearch.randomizedtesting.RandomizedRunner.runSingleTest(RandomizedRunner.java:746)
	at com.carrotsearch.randomizedtesting.RandomizedRunner$3.evaluate(RandomizedRunner.java:648)
	at com.carrotsearch.randomizedtesting.RandomizedRunner$4.evaluate(RandomizedRunner.java:682)
	at com.carrotsearch.randomizedtesting.RandomizedRunner$5.evaluate(RandomizedRunner.java:693)
	at com.carrotsearch.randomizedtesting.rules.StatementAdapter.evaluate(StatementAdapter.java:36)
	at com.carrotsearch.randomizedtesting.rules.SystemPropertiesRestoreRule$1.evaluate(SystemPropertiesRestoreRule.java:53)
	at org.apache.lucene.util.AbstractBeforeAfterRule$1.evaluate(AbstractBeforeAfterRule.java:45)
	at org.apache.lucene.util.TestRuleStoreClassName$1.evaluate(TestRuleStoreClassName.java:42)
	at com.carrotsearch.randomizedtesting.rules.SystemPropertiesInvariantRule$1.evaluate(SystemPropertiesInvariantRule.java:55)
	at com.carrotsearch.randomizedtesting.rules.NoShadowingOrOverridesOnMethodsRule$1.evaluate(NoShadowingOrOverridesOnMethodsRule.java:39)
	at com.carrotsearch.randomizedtesting.rules.NoShadowingOrOverridesOnMethodsRule$1.evaluate(NoShadowingOrOverridesOnMethodsRule.java:39)
	at com.carrotsearch.randomizedtesting.rules.StatementAdapter.evaluate(StatementAdapter.java:36)
	at org.apache.lucene.util.TestRuleAssertionsRequired$1.evaluate(TestRuleAssertionsRequired.java:43)
	at org.apache.lucene.util.TestRuleMarkFailure$1.evaluate(TestRuleMarkFailure.java:48)
	at org.apache.lucene.util.TestRuleIgnoreAfterMaxFailures$1.evaluate(TestRuleIgnoreAfterMaxFailures.java:70)
	at org.apache.lucene.util.TestRuleIgnoreTestSuites$1.evaluate(TestRuleIgnoreTestSuites.java:55)
	at com.carrotsearch.randomizedtesting.rules.StatementAdapter.evaluate(StatementAdapter.java:36)
	at com.carrotsearch.randomizedtesting.ThreadLeakControl$StatementRunner.run(ThreadLeakControl.java:358)
	at java.lang.Thread.run(Thread.java:679)




Build Log:
[...truncated 7195 lines...]
[junit4:junit4] Suite: org.apache.solr.cloud.BasicDistributedZk2Test
[junit4:junit4]   2> 5 T963 oas.SolrTestCaseJ4.setUp ###Starting testDistribSearch
[junit4:junit4]   2> Creating dataDir: /usr/home/hudson/hudson-slave/workspace/Lucene-Solr-Tests-4.x-Java6/solr/build/solr-core/test/J1/./solrtest-BasicDistributedZk2Test-1348219180664
[junit4:junit4]   2> 7 T963 oasc.ZkTestServer.run STARTING ZK TEST SERVER
[junit4:junit4]   2> 9 T964 oazs.ZooKeeperServer.setTickTime tickTime set to 1000
[junit4:junit4]   2> 9 T964 oazs.NIOServerCnxn$Factory.<init> binding to port 0.0.0.0/0.0.0.0:0
[junit4:junit4]   2> 10 T964 oazsp.FileTxnSnapLog.save Snapshotting: 0
[junit4:junit4]   2> 108 T963 oasc.ZkTestServer.run start zk server on port:11507
[junit4:junit4]   2> 108 T963 oaz.ZooKeeper.<init> Initiating client connection, connectString=127.0.0.1:11507 sessionTimeout=10000 watcher=org.apache.solr.common.cloud.ConnectionManager@3c43352b
[junit4:junit4]   2> 109 T969 oaz.ClientCnxn$SendThread.startConnect Opening socket connection to server /127.0.0.1:11507
[junit4:junit4]   2> 109 T963 oascc.ConnectionManager.waitForConnected Waiting for client to connect to ZooKeeper
[junit4:junit4]   2> 110 T969 oaz.ClientCnxn$SendThread.primeConnection Socket connection established to localhost/127.0.0.1:11507, initiating session
[junit4:junit4]   2> 110 T965 oazs.NIOServerCnxn$Factory.run Accepted socket connection from /140.211.11.196:15295
[junit4:junit4]   2> 111 T965 oazs.NIOServerCnxn.readConnectRequest Client attempting to establish new session at /140.211.11.196:15295
[junit4:junit4]   2> 111 T967 oazsp.FileTxnLog.append Creating new log file: log.1
[junit4:junit4]   2> 115 T967 oazs.NIOServerCnxn.finishSessionInit Established session 0x139e820167c0000 with negotiated timeout 10000 for client /140.211.11.196:15295
[junit4:junit4]   2> 115 T969 oaz.ClientCnxn$SendThread.readConnectResult Session establishment complete on server localhost/127.0.0.1:11507, sessionid = 0x139e820167c0000, negotiated timeout = 10000
[junit4:junit4]   2> 115 T970 oascc.ConnectionManager.process Watcher org.apache.solr.common.cloud.ConnectionManager@3c43352b name:ZooKeeperConnection Watcher:127.0.0.1:11507 got event WatchedEvent state:SyncConnected type:None path:null path:null type:None
[junit4:junit4]   2> 115 T963 oascc.ConnectionManager.waitForConnected Client is connected to ZooKeeper
[junit4:junit4]   2> 116 T963 oascc.SolrZkClient.makePath makePath: /solr
[junit4:junit4]   2> 130 T968 oazs.PrepRequestProcessor.pRequest Processed session termination for sessionid: 0x139e820167c0000
[junit4:junit4]   2> 164 T970 oaz.ClientCnxn$EventThread.run EventThread shut down
[junit4:junit4]   2> 164 T963 oaz.ZooKeeper.close Session: 0x139e820167c0000 closed
[junit4:junit4]   2> 165 T965 oazs.NIOServerCnxn.closeSock Closed socket connection for client /140.211.11.196:15295 which had sessionid 0x139e820167c0000
[junit4:junit4]   2> 165 T963 oaz.ZooKeeper.<init> Initiating client connection, connectString=127.0.0.1:11507/solr sessionTimeout=10000 watcher=org.apache.solr.common.cloud.ConnectionManager@66dd2175
[junit4:junit4]   2> 166 T971 oaz.ClientCnxn$SendThread.startConnect Opening socket connection to server /127.0.0.1:11507
[junit4:junit4]   2> 166 T963 oascc.ConnectionManager.waitForConnected Waiting for client to connect to ZooKeeper
[junit4:junit4]   2> 166 T971 oaz.ClientCnxn$SendThread.primeConnection Socket connection established to localhost/127.0.0.1:11507, initiating session
[junit4:junit4]   2> 167 T965 oazs.NIOServerCnxn$Factory.run Accepted socket connection from /140.211.11.196:57203
[junit4:junit4]   2> 167 T965 oazs.NIOServerCnxn.readConnectRequest Client attempting to establish new session at /140.211.11.196:57203
[junit4:junit4]   2> 168 T967 oazs.NIOServerCnxn.finishSessionInit Established session 0x139e820167c0001 with negotiated timeout 10000 for client /140.211.11.196:57203
[junit4:junit4]   2> 168 T971 oaz.ClientCnxn$SendThread.readConnectResult Session establishment complete on server localhost/127.0.0.1:11507, sessionid = 0x139e820167c0001, negotiated timeout = 10000
[junit4:junit4]   2> 169 T972 oascc.ConnectionManager.process Watcher org.apache.solr.common.cloud.ConnectionManager@66dd2175 name:ZooKeeperConnection Watcher:127.0.0.1:11507/solr got event WatchedEvent state:SyncConnected type:None path:null path:null type:None
[junit4:junit4]   2> 169 T963 oascc.ConnectionManager.waitForConnected Client is connected to ZooKeeper
[junit4:junit4]   2> 169 T963 oascc.SolrZkClient.makePath makePath: /collections/collection1
[junit4:junit4]   2> 191 T963 oascc.SolrZkClient.makePath makePath: /collections/collection1/shards
[junit4:junit4]   2> 194 T963 oascc.SolrZkClient.makePath makePath: /collections/control_collection
[junit4:junit4]   2> 227 T963 oascc.SolrZkClient.makePath makePath: /collections/control_collection/shards
[junit4:junit4]   2> 232 T963 oasc.AbstractZkTestCase.putConfig put /usr/home/hudson/hudson-slave/workspace/Lucene-Solr-Tests-4.x-Java6/solr/build/solr-core/test-files/solr/collection1/conf/solrconfig.xml to /configs/conf1/solrconfig.xml
[junit4:junit4]   2> 233 T963 oascc.SolrZkClient.makePath makePath: /configs/conf1/solrconfig.xml
[junit4:junit4]   2> 272 T963 oasc.AbstractZkTestCase.putConfig put /usr/home/hudson/hudson-slave/workspace/Lucene-Solr-Tests-4.x-Java6/solr/build/solr-core/test-files/solr/collection1/conf/schema.xml to /configs/conf1/schema.xml
[junit4:junit4]   2> 273 T963 oascc.SolrZkClient.makePath makePath: /configs/conf1/schema.xml
[junit4:junit4]   2> 379 T963 oasc.AbstractZkTestCase.putConfig put /usr/home/hudson/hudson-slave/workspace/Lucene-Solr-Tests-4.x-Java6/solr/build/solr-core/test-files/solr/collection1/conf/solrconfig.xml to /configs/conf1/solrconfig.xml
[junit4:junit4]   2> 379 T963 oascc.SolrZkClient.makePath makePath: /configs/conf1/solrconfig.xml
[junit4:junit4]   2> 382 T963 oasc.AbstractZkTestCase.putConfig put /usr/home/hudson/hudson-slave/workspace/Lucene-Solr-Tests-4.x-Java6/solr/build/solr-core/test-files/solr/collection1/conf/stopwords.txt to /configs/conf1/stopwords.txt
[junit4:junit4]   2> 383 T963 oascc.SolrZkClient.makePath makePath: /configs/conf1/stopwords.txt
[junit4:junit4]   2> 394 T963 oasc.AbstractZkTestCase.putConfig put /usr/home/hudson/hudson-slave/workspace/Lucene-Solr-Tests-4.x-Java6/solr/build/solr-core/test-files/solr/collection1/conf/protwords.txt to /configs/conf1/protwords.txt
[junit4:junit4]   2> 395 T963 oascc.SolrZkClient.makePath makePath: /configs/conf1/protwords.txt
[junit4:junit4]   2> 397 T963 oasc.AbstractZkTestCase.putConfig put /usr/home/hudson/hudson-slave/workspace/Lucene-Solr-Tests-4.x-Java6/solr/build/solr-core/test-files/solr/collection1/conf/currency.xml to /configs/conf1/currency.xml
[junit4:junit4]   2> 398 T963 oascc.SolrZkClient.makePath makePath: /configs/conf1/currency.xml
[junit4:junit4]   2> 401 T963 oasc.AbstractZkTestCase.putConfig put /usr/home/hudson/hudson-slave/workspace/Lucene-Solr-Tests-4.x-Java6/solr/build/solr-core/test-files/solr/collection1/conf/open-exchange-rates.json to /configs/conf1/open-exchange-rates.json
[junit4:junit4]   2> 402 T963 oascc.SolrZkClient.makePath makePath: /configs/conf1/open-exchange-rates.json
[junit4:junit4]   2> 404 T963 oasc.AbstractZkTestCase.putConfig put /usr/home/hudson/hudson-slave/workspace/Lucene-Solr-Tests-4.x-Java6/solr/build/solr-core/test-files/solr/collection1/conf/mapping-ISOLatin1Accent.txt to /configs/conf1/mapping-ISOLatin1Accent.txt
[junit4:junit4]   2> 405 T963 oascc.SolrZkClient.makePath makePath: /configs/conf1/mapping-ISOLatin1Accent.txt
[junit4:junit4]   2> 407 T963 oasc.AbstractZkTestCase.putConfig put /usr/home/hudson/hudson-slave/workspace/Lucene-Solr-Tests-4.x-Java6/solr/build/solr-core/test-files/solr/collection1/conf/old_synonyms.txt to /configs/conf1/old_synonyms.txt
[junit4:junit4]   2> 408 T963 oascc.SolrZkClient.makePath makePath: /configs/conf1/old_synonyms.txt
[junit4:junit4]   2> 416 T963 oasc.AbstractZkTestCase.putConfig put /usr/home/hudson/hudson-slave/workspace/Lucene-Solr-Tests-4.x-Java6/solr/build/solr-core/test-files/solr/collection1/conf/synonyms.txt to /configs/conf1/synonyms.txt
[junit4:junit4]   2> 416 T963 oascc.SolrZkClient.makePath makePath: /configs/conf1/synonyms.txt
[junit4:junit4]   2> 419 T968 oazs.PrepRequestProcessor.pRequest Processed session termination for sessionid: 0x139e820167c0001
[junit4:junit4]   2> 420 T972 oaz.ClientCnxn$EventThread.run EventThread shut down
[junit4:junit4]   2> 420 T963 oaz.ZooKeeper.close Session: 0x139e820167c0001 closed
[junit4:junit4]   2> 421 T965 oazs.NIOServerCnxn.closeSock Closed socket connection for client /140.211.11.196:57203 which had sessionid 0x139e820167c0001
[junit4:junit4]   2> 422 T963 oejs.Server.doStart jetty-8.1.2.v20120308
[junit4:junit4]   2> 426 T963 oejs.AbstractConnector.doStart Started SocketConnector@0.0.0.0:62552
[junit4:junit4]   2> 427 T963 oasc.SolrResourceLoader.locateSolrHome JNDI not configured for solr (NoInitialContextEx)
[junit4:junit4]   2> 427 T963 oasc.SolrResourceLoader.locateSolrHome using system property solr.solr.home: /usr/home/hudson/hudson-slave/workspace/Lucene-Solr-Tests-4.x-Java6/solr/build/solr-core/test-files/solr
[junit4:junit4]   2> 428 T963 oasc.SolrResourceLoader.<init> new SolrResourceLoader for deduced Solr Home: '/usr/home/hudson/hudson-slave/workspace/Lucene-Solr-Tests-4.x-Java6/solr/build/solr-core/test-files/solr/'
[junit4:junit4]   2> 462 T963 oass.SolrDispatchFilter.init SolrDispatchFilter.init()
[junit4:junit4]   2> 463 T963 oasc.SolrResourceLoader.locateSolrHome JNDI not configured for solr (NoInitialContextEx)
[junit4:junit4]   2> 463 T963 oasc.SolrResourceLoader.locateSolrHome using system property solr.solr.home: /usr/home/hudson/hudson-slave/workspace/Lucene-Solr-Tests-4.x-Java6/solr/build/solr-core/test-files/solr
[junit4:junit4]   2> 463 T963 oasc.CoreContainer$Initializer.initialize looking for solr.xml: /usr/home/hudson/hudson-slave/workspace/Lucene-Solr-Tests-4.x-Java6/solr/build/solr-core/test-files/solr/solr.xml
[junit4:junit4]   2> 464 T963 oasc.CoreContainer.<init> New CoreContainer 1625195017
[junit4:junit4]   2> 464 T963 oasc.CoreContainer.load Loading CoreContainer using Solr Home: '/usr/home/hudson/hudson-slave/workspace/Lucene-Solr-Tests-4.x-Java6/solr/build/solr-core/test-files/solr/'
[junit4:junit4]   2> 465 T963 oasc.SolrResourceLoader.<init> new SolrResourceLoader for directory: '/usr/home/hudson/hudson-slave/workspace/Lucene-Solr-Tests-4.x-Java6/solr/build/solr-core/test-files/solr/'
[junit4:junit4]   2> 516 T963 oasc.CoreContainer.load Registering Log Listener
[junit4:junit4]   2> 535 T963 oasc.CoreContainer.initZooKeeper Zookeeper client=127.0.0.1:11507/solr
[junit4:junit4]   2> 536 T963 oaz.ZooKeeper.<init> Initiating client connection, connectString=127.0.0.1:11507/solr sessionTimeout=5000 watcher=org.apache.solr.common.cloud.ConnectionManager@6b326556
[junit4:junit4]   2> 542 T982 oaz.ClientCnxn$SendThread.startConnect Opening socket connection to server /127.0.0.1:11507
[junit4:junit4]   2> 537 T963 oascc.ConnectionManager.waitForConnected Waiting for client to connect to ZooKeeper
[junit4:junit4]   2> 543 T982 oaz.ClientCnxn$SendThread.primeConnection Socket connection established to localhost/127.0.0.1:11507, initiating session
[junit4:junit4]   2> 544 T965 oazs.NIOServerCnxn$Factory.run Accepted socket connection from /140.211.11.196:27282
[junit4:junit4]   2> 544 T965 oazs.NIOServerCnxn.readConnectRequest Client attempting to establish new session at /140.211.11.196:27282
[junit4:junit4]   2> 549 T967 oazs.NIOServerCnxn.finishSessionInit Established session 0x139e820167c0002 with negotiated timeout 5000 for client /140.211.11.196:27282
[junit4:junit4]   2> 549 T982 oaz.ClientCnxn$SendThread.readConnectResult Session establishment complete on server localhost/127.0.0.1:11507, sessionid = 0x139e820167c0002, negotiated timeout = 5000
[junit4:junit4]   2> 550 T983 oascc.ConnectionManager.process Watcher org.apache.solr.common.cloud.ConnectionManager@6b326556 name:ZooKeeperConnection Watcher:127.0.0.1:11507/solr got event WatchedEvent state:SyncConnected type:None path:null path:null type:None
[junit4:junit4]   2> 550 T963 oascc.ConnectionManager.waitForConnected Client is connected to ZooKeeper
[junit4:junit4]   2> 552 T968 oazs.PrepRequestProcessor.pRequest Got user-level KeeperException when processing sessionid:0x139e820167c0002 type:create cxid:0x2 zxid:0xfffffffffffffffe txntype:unknown reqpath:n/a Error Path:/solr/overseer Error:KeeperErrorCode = NodeExists for /solr/overseer
[junit4:junit4]   2> 560 T963 oascc.SolrZkClient.makePath makePath: /live_nodes
[junit4:junit4]   2> 562 T963 oasc.ZkController.createEphemeralLiveNode Register node as live in ZooKeeper:/live_nodes/127.0.0.1:62552_solr
[junit4:junit4]   2> 563 T968 oazs.PrepRequestProcessor.pRequest Got user-level KeeperException when processing sessionid:0x139e820167c0002 type:delete cxid:0x7 zxid:0xfffffffffffffffe txntype:unknown reqpath:n/a Error Path:/solr/live_nodes/127.0.0.1:62552_solr Error:KeeperErrorCode = NoNode for /solr/live_nodes/127.0.0.1:62552_solr
[junit4:junit4]   2> 564 T963 oascc.SolrZkClient.makePath makePath: /live_nodes/127.0.0.1:62552_solr
[junit4:junit4]   2> 573 T963 oashc.HttpShardHandlerFactory.getParameter Setting socketTimeout to: 0
[junit4:junit4]   2> 574 T963 oashc.HttpShardHandlerFactory.getParameter Setting urlScheme to: http://
[junit4:junit4]   2> 574 T963 oashc.HttpShardHandlerFactory.getParameter Setting connTimeout to: 0
[junit4:junit4]   2> 574 T963 oashc.HttpShardHandlerFactory.getParameter Setting maxConnectionsPerHost to: 20
[junit4:junit4]   2> 575 T963 oashc.HttpShardHandlerFactory.getParameter Setting corePoolSize to: 0
[junit4:junit4]   2> 575 T963 oashc.HttpShardHandlerFactory.getParameter Setting maximumPoolSize to: 2147483647
[junit4:junit4]   2> 576 T963 oashc.HttpShardHandlerFactory.getParameter Setting maxThreadIdleTime to: 5
[junit4:junit4]   2> 576 T963 oashc.HttpShardHandlerFactory.getParameter Setting sizeOfQueue to: -1
[junit4:junit4]   2> 577 T963 oashc.HttpShardHandlerFactory.getParameter Setting fairnessPolicy to: false
[junit4:junit4]   2> 577 T963 oascsi.HttpClientUtil.createClient Creating new http client, config:maxConnectionsPerHost=20&maxConnections=10000&socketTimeout=0&connTimeout=0&retry=false
[junit4:junit4]   2> 592 T963 oascc.SolrZkClient.makePath makePath: /overseer_elect/election
[junit4:junit4]   2> 603 T968 oazs.PrepRequestProcessor.pRequest Got user-level KeeperException when processing sessionid:0x139e820167c0002 type:delete cxid:0x15 zxid:0xfffffffffffffffe txntype:unknown reqpath:n/a Error Path:/solr/overseer_elect/leader Error:KeeperErrorCode = NoNode for /solr/overseer_elect/leader
[junit4:junit4]   2> 604 T963 oascc.SolrZkClient.makePath makePath: /overseer_elect/leader
[junit4:junit4]   2> 614 T963 oasc.Overseer.start Overseer (id=88356892224258050-127.0.0.1:62552_solr-n_0000000000) starting
[junit4:junit4]   2> 615 T968 oazs.PrepRequestProcessor.pRequest Got user-level KeeperException when processing sessionid:0x139e820167c0002 type:create cxid:0x1a zxid:0xfffffffffffffffe txntype:unknown reqpath:n/a Error Path:/solr/overseer Error:KeeperErrorCode = NodeExists for /solr/overseer
[junit4:junit4]   2> 616 T968 oazs.PrepRequestProcessor.pRequest Got user-level KeeperException when processing sessionid:0x139e820167c0002 type:create cxid:0x1b zxid:0xfffffffffffffffe txntype:unknown reqpath:n/a Error Path:/solr/overseer Error:KeeperErrorCode = NodeExists for /solr/overseer
[junit4:junit4]   2> 618 T968 oazs.PrepRequestProcessor.pRequest Got user-level KeeperException when processing sessionid:0x139e820167c0002 type:create cxid:0x1c zxid:0xfffffffffffffffe txntype:unknown reqpath:n/a Error Path:/solr/overseer Error:KeeperErrorCode = NodeExists for /solr/overseer
[junit4:junit4]   2> 619 T968 oazs.PrepRequestProcessor.pRequest Got user-level KeeperException when processing sessionid:0x139e820167c0002 type:create cxid:0x1d zxid:0xfffffffffffffffe txntype:unknown reqpath:n/a Error Path:/solr/overseer Error:KeeperErrorCode = NodeExists for /solr/overseer
[junit4:junit4]   2> 620 T985 oasc.OverseerCollectionProcessor.run Process current queue of collection creations
[junit4:junit4]   2> 621 T963 oascc.SolrZkClient.makePath makePath: /clusterstate.json
[junit4:junit4]   2> 630 T963 oascc.ZkStateReader.createClusterStateWatchersAndUpdate Updating cluster state from ZooKeeper... 
[junit4:junit4]   2> 637 T963 oasc.CoreContainer.create Creating SolrCore 'collection1' using instanceDir: /usr/home/hudson/hudson-slave/workspace/Lucene-Solr-Tests-4.x-Java6/solr/build/solr-core/test-files/solr/collection1
[junit4:junit4]   2> 637 T963 oasc.ZkController.createCollectionZkNode Check for collection zkNode:control_collection
[junit4:junit4]   2> 638 T984 oasc.Overseer$ClusterStateUpdater.run Starting to work on the main queue
[junit4:junit4]   2> 638 T963 oasc.ZkController.createCollectionZkNode Collection zkNode exists
[junit4:junit4]   2> 638 T963 oasc.ZkController.readConfigName Load collection config from:/collections/control_collection
[junit4:junit4]   2> 640 T963 oasc.SolrResourceLoader.<init> new SolrResourceLoader for directory: '/usr/home/hudson/hudson-slave/workspace/Lucene-Solr-Tests-4.x-Java6/solr/build/solr-core/test-files/solr/collection1/'
[junit4:junit4]   2> 641 T963 oasc.SolrResourceLoader.replaceClassLoader Adding 'file:/usr/home/hudson/hudson-slave/workspace/Lucene-Solr-Tests-4.x-Java6/solr/build/solr-core/test-files/solr/collection1/lib/classes/' to classloader
[junit4:junit4]   2> 642 T963 oasc.SolrResourceLoader.replaceClassLoader Adding 'file:/usr/home/hudson/hudson-slave/workspace/Lucene-Solr-Tests-4.x-Java6/solr/build/solr-core/test-files/solr/collection1/lib/README' to classloader
[junit4:junit4]   2> 690 T963 oasc.SolrConfig.<init> Using Lucene MatchVersion: LUCENE_40
[junit4:junit4]   2> 757 T963 oasc.SolrConfig.<init> Loaded SolrConfig: solrconfig.xml
[junit4:junit4]   2> 859 T963 oass.IndexSchema.readSchema Reading Solr Schema
[junit4:junit4]   2> 865 T963 oass.IndexSchema.readSchema Schema name=test
[junit4:junit4]   2> 1456 T963 oass.OpenExchangeRatesOrgProvider.init Initialized with rates=open-exchange-rates.json, refreshInterval=1440.
[junit4:junit4]   2> 1468 T963 oass.IndexSchema.readSchema default search field in schema is text
[junit4:junit4]   2> 1472 T963 oass.IndexSchema.readSchema unique key field: id
[junit4:junit4]   2> 1486 T963 oass.FileExchangeRateProvider.reload Reloading exchange rates from file currency.xml
[junit4:junit4]   2> 1491 T963 oass.FileExchangeRateProvider.reload Reloading exchange rates from file currency.xml
[junit4:junit4]   2> 1495 T963 oass.OpenExchangeRatesOrgProvider.reload Reloading exchange rates from open-exchange-rates.json
[junit4:junit4]   2> 1497 T963 oass.OpenExchangeRatesOrgProvider.reload Reloading exchange rates from open-exchange-rates.json
[junit4:junit4]   2> 1498 T963 oasc.SolrCore.<init> [collection1] Opening new SolrCore at /usr/home/hudson/hudson-slave/workspace/Lucene-Solr-Tests-4.x-Java6/solr/build/solr-core/test-files/solr/collection1/, dataDir=./org.apache.solr.cloud.BasicDistributedZk2Test-1348219180664/control/data/
[junit4:junit4]   2> 1498 T963 oasc.JmxMonitoredMap.<init> JMX monitoring is enabled. Adding Solr mbeans to JMX Server: com.sun.jmx.mbeanserver.JmxMBeanServer@6910b640
[junit4:junit4]   2> 1499 T963 oasc.SolrCore.getNewIndexDir WARNING New index directory detected: old=null new=./org.apache.solr.cloud.BasicDistributedZk2Test-1348219180664/control/data/index/
[junit4:junit4]   2> 1501 T963 oasc.SolrCore.initIndex WARNING [collection1] Solr index directory './org.apache.solr.cloud.BasicDistributedZk2Test-1348219180664/control/data/index' doesn't exist. Creating new index...
[junit4:junit4]   2> 1502 T963 oasc.CachingDirectoryFactory.get return new directory for /usr/home/hudson/hudson-slave/workspace/Lucene-Solr-Tests-4.x-Java6/solr/build/solr-core/test/J1/./org.apache.solr.cloud.BasicDistributedZk2Test-1348219180664/control/data/index forceNew:false
[junit4:junit4]   2> 1534 T963 oasc.SolrDeletionPolicy.onCommit SolrDeletionPolicy.onCommit: commits:num=1
[junit4:junit4]   2> 		commit{dir=NRTCachingDirectory(org.apache.lucene.store.NIOFSDirectory@/usr/home/hudson/hudson-slave/workspace/Lucene-Solr-Tests-4.x-Java6/solr/build/solr-core/test/J1/org.apache.solr.cloud.BasicDistributedZk2Test-1348219180664/control/data/index lockFactory=org.apache.lucene.store.NativeFSLockFactory@646a91fd; maxCacheMB=48.0 maxMergeSizeMB=4.0),segFN=segments_1,generation=1,filenames=[segments_1]
[junit4:junit4]   2> 1535 T963 oasc.SolrDeletionPolicy.updateCommits newest commit = 1
[junit4:junit4]   2> 1536 T963 oasc.SolrCore.initWriters created xml: solr.XMLResponseWriter
[junit4:junit4]   2> 1538 T963 oasup.UpdateRequestProcessorChain.init inserting DistributedUpdateProcessorFactory into updateRequestProcessorChain "dedupe"
[junit4:junit4]   2> 1538 T963 oasup.UpdateRequestProcessorChain.init inserting DistributedUpdateProcessorFactory into updateRequestProcessorChain "dedupe-allfields"
[junit4:junit4]   2> 1539 T963 oasup.UpdateRequestProcessorChain.init inserting DistributedUpdateProcessorFactory into updateRequestProcessorChain "stored_sig"
[junit4:junit4]   2> 1539 T963 oasup.UpdateRequestProcessorChain.init inserting DistributedUpdateProcessorFactory into updateRequestProcessorChain "uniq-fields"
[junit4:junit4]   2> 1540 T963 oasup.UpdateRequestProcessorChain.init inserting DistributedUpdateProcessorFactory into updateRequestProcessorChain "distrib-dup-test-chain-implicit"
[junit4:junit4]   2> 1540 T963 oasc.RequestHandlers.initHandlersFromConfig adding lazy requestHandler: solr.ReplicationHandler
[junit4:junit4]   2> 1541 T963 oasc.RequestHandlers.initHandlersFromConfig created /replication: solr.ReplicationHandler
[junit4:junit4]   2> 1541 T963 oasc.RequestHandlers.initHandlersFromConfig created standard: solr.StandardRequestHandler
[junit4:junit4]   2> 1542 T963 oasc.RequestHandlers.initHandlersFromConfig created /get: solr.RealTimeGetHandler
[junit4:junit4]   2> 1542 T963 oasc.RequestHandlers.initHandlersFromConfig created dismax: solr.SearchHandler
[junit4:junit4]   2> 1543 T963 oasc.RequestHandlers.initHandlersFromConfig created mock: org.apache.solr.core.MockQuerySenderListenerReqHandler
[junit4:junit4]   2> 1544 T963 oasc.RequestHandlers.initHandlersFromConfig created /admin/: org.apache.solr.handler.admin.AdminHandlers
[junit4:junit4]   2> 1544 T963 oasc.RequestHandlers.initHandlersFromConfig created defaults: solr.StandardRequestHandler
[junit4:junit4]   2> 1545 T963 oasc.RequestHandlers.initHandlersFromConfig adding lazy requestHandler: solr.StandardRequestHandler
[junit4:junit4]   2> 1545 T963 oasc.RequestHandlers.initHandlersFromConfig created lazy: solr.StandardRequestHandler
[junit4:junit4]   2> 1546 T963 oasc.RequestHandlers.initHandlersFromConfig created /update: solr.UpdateRequestHandler
[junit4:junit4]   2> 1546 T963 oasc.RequestHandlers.initHandlersFromConfig created /terms: org.apache.solr.handler.component.SearchHandler
[junit4:junit4]   2> 1547 T963 oasc.RequestHandlers.initHandlersFromConfig created spellCheckCompRH: org.apache.solr.handler.component.SearchHandler
[junit4:junit4]   2> 1547 T963 oasc.RequestHandlers.initHandlersFromConfig created spellCheckCompRH_Direct: org.apache.solr.handler.component.SearchHandler
[junit4:junit4]   2> 1548 T963 oasc.RequestHandlers.initHandlersFromConfig created spellCheckWithWordbreak: org.apache.solr.handler.component.SearchHandler
[junit4:junit4]   2> 1548 T963 oasc.RequestHandlers.initHandlersFromConfig created spellCheckWithWordbreak_Direct: org.apache.solr.handler.component.SearchHandler
[junit4:junit4]   2> 1549 T963 oasc.RequestHandlers.initHandlersFromConfig created spellCheckCompRH1: org.apache.solr.handler.component.SearchHandler
[junit4:junit4]   2> 1550 T963 oasc.RequestHandlers.initHandlersFromConfig created tvrh: org.apache.solr.handler.component.SearchHandler
[junit4:junit4]   2> 1550 T963 oasc.RequestHandlers.initHandlersFromConfig created /mlt: solr.MoreLikeThisHandler
[junit4:junit4]   2> 1551 T963 oasc.RequestHandlers.initHandlersFromConfig created /debug/dump: solr.DumpRequestHandler
[junit4:junit4]   2> 1554 T963 oashl.XMLLoader.init xsltCacheLifetimeSeconds=60
[junit4:junit4]   2> 1559 T963 oasc.SolrCore.initDeprecatedSupport WARNING solrconfig.xml uses deprecated <admin/gettableFiles>, Please update your config to use the ShowFileRequestHandler.
[junit4:junit4]   2> 1560 T963 oasc.SolrCore.initDeprecatedSupport WARNING adding ShowFileRequestHandler with hidden files: [SCHEMA.XML, OLD_SYNONYMS.TXT, STOPWORDS.TXT, PROTWORDS.TXT, OPEN-EXCHANGE-RATES.JSON, SYNONYMS.TXT, CURRENCY.XML, MAPPING-ISOLATIN1ACCENT.TXT]
[junit4:junit4]   2> 1564 T963 oass.SolrIndexSearcher.<init> Opening Searcher@7b7f8db5 main
[junit4:junit4]   2> 1565 T963 oasu.CommitTracker.<init> Hard AutoCommit: disabled
[junit4:junit4]   2> 1565 T963 oasu.CommitTracker.<init> Soft AutoCommit: disabled
[junit4:junit4]   2> 1566 T963 oashc.SpellCheckComponent.inform Initializing spell checkers
[junit4:junit4]   2> 1583 T963 oass.DirectSolrSpellChecker.init init: {name=direct,classname=DirectSolrSpellChecker,field=lowerfilt,minQueryLength=3}
[junit4:junit4]   2> 1639 T986 oasc.SolrCore.registerSearcher [collection1] Registered new searcher Searcher@7b7f8db5 main{StandardDirectoryReader(segments_1:1)}
[junit4:junit4]   2> 1643 T968 oazs.PrepRequestProcessor.pRequest Got user-level KeeperException when processing sessionid:0x139e820167c0002 type:create cxid:0x53 zxid:0xfffffffffffffffe txntype:unknown reqpath:n/a Error Path:/solr/overseer/queue Error:KeeperErrorCode = NoNode for /solr/overseer/queue
[junit4:junit4]   2> 1655 T963 oasc.CoreContainer.register registering core: collection1
[junit4:junit4]   2> 1655 T963 oasc.ZkController.register Register shard - core:collection1 address:http://127.0.0.1:62552/solr shardId:control_shard
[junit4:junit4]   2> 1656 T984 oascc.ZkStateReader.updateClusterState Updating cloud state from ZooKeeper... 
[junit4:junit4]   2> 1656 T963 oascc.SolrZkClient.makePath makePath: /collections/control_collection/leader_elect/control_shard/election
[junit4:junit4]   2> 1657 T968 oazs.PrepRequestProcessor.pRequest Got user-level KeeperException when processing sessionid:0x139e820167c0002 type:create cxid:0x5c zxid:0xfffffffffffffffe txntype:unknown reqpath:n/a Error Path:/solr/overseer/queue-work Error:KeeperErrorCode = NoNode for /solr/overseer/queue-work
[junit4:junit4]   2> 1674 T983 oascc.ZkStateReader$2.process A cluster state change has occurred - updating...
[junit4:junit4]   2> 1685 T968 oazs.PrepRequestProcessor.pRequest Got user-level KeeperException when processing sessionid:0x139e820167c0002 type:delete cxid:0x73 zxid:0xfffffffffffffffe txntype:unknown reqpath:n/a Error Path:/solr/collections/control_collection/leaders Error:KeeperErrorCode = NoNode for /solr/collections/control_collection/leaders
[junit4:junit4]   2> 1686 T963 oasc.ShardLeaderElectionContext.runLeaderProcess Running the leader process.
[junit4:junit4]   2> 1686 T968 oazs.PrepRequestProcessor.pRequest Got user-level KeeperException when processing sessionid:0x139e820167c0002 type:create cxid:0x75 zxid:0xfffffffffffffffe txntype:unknown reqpath:n/a Error Path:/solr/overseer Error:KeeperErrorCode = NodeExists for /solr/overseer
[junit4:junit4]   2> 1697 T963 oasc.ShardLeaderElectionContext.waitForReplicasToComeUp Enough replicas found to continue.
[junit4:junit4]   2> 1698 T963 oasc.ShardLeaderElectionContext.runLeaderProcess I may be the new leader - try and sync
[junit4:junit4]   2> 1698 T963 oasc.SyncStrategy.sync Sync replicas to http://127.0.0.1:62552/solr/collection1/
[junit4:junit4]   2> 1698 T963 oasc.SyncStrategy.syncReplicas Sync Success - now sync replicas to me
[junit4:junit4]   2> 1699 T963 oasc.SyncStrategy.syncToMe http://127.0.0.1:62552/solr/collection1/ has no replicas
[junit4:junit4]   2> 1699 T963 oasc.ShardLeaderElectionContext.runLeaderProcess I am the new leader: http://127.0.0.1:62552/solr/collection1/
[junit4:junit4]   2> 1700 T963 oascc.SolrZkClient.makePath makePath: /collections/control_collection/leaders/control_shard
[junit4:junit4]   2> 1704 T968 oazs.PrepRequestProcessor.pRequest Got user-level KeeperException when processing sessionid:0x139e820167c0002 type:create cxid:0x7f zxid:0xfffffffffffffffe txntype:unknown reqpath:n/a Error Path:/solr/overseer Error:KeeperErrorCode = NodeExists for /solr/overseer
[junit4:junit4]   2> 2187 T984 oascc.ZkStateReader.updateClusterState Updating cloud state from ZooKeeper... 
[junit4:junit4]   2> 2208 T983 oascc.ZkStateReader$2.process A cluster state change has occurred - updating...
[junit4:junit4]   2> 2226 T963 oasc.ZkController.register We are http://127.0.0.1:62552/solr/collection1/ and leader is http://127.0.0.1:62552/solr/collection1/
[junit4:junit4]   2> 2226 T963 oasc.ZkController.register No LogReplay needed for core=collection1 baseURL=http://127.0.0.1:62552/solr
[junit4:junit4]   2> 2227 T963 oasc.ZkController.checkRecovery I am the leader, no recovery necessary
[junit4:junit4]   2> 2228 T963 oascc.ZkStateReader.updateClusterState Updating cloud state from ZooKeeper... 
[junit4:junit4]   2> 2229 T963 oass.SolrDispatchFilter.init user.dir=/usr/home/hudson/hudson-slave/workspace/Lucene-Solr-Tests-4.x-Java6/solr/build/solr-core/test/J1
[junit4:junit4]   2> 2229 T963 oass.SolrDispatchFilter.init SolrDispatchFilter.init() done
[junit4:junit4]   2> 2230 T963 oascsi.HttpClientUtil.createClient Creating new http client, config:maxConnections=128&maxConnectionsPerHost=32&followRedirects=false
[junit4:junit4]   2> 2684 T963 oejs.Server.doStart jetty-8.1.2.v20120308
[junit4:junit4]   2> 2687 T963 oejs.AbstractConnector.doStart Started SocketConnector@0.0.0.0:26068
[junit4:junit4]   2> 2688 T963 oasc.SolrResourceLoader.locateSolrHome JNDI not configured for solr (NoInitialContextEx)
[junit4:junit4]   2> 2688 T963 oasc.SolrResourceLoader.locateSolrHome using system property solr.solr.home: /usr/home/hudson/hudson-slave/workspace/Lucene-Solr-Tests-4.x-Java6/solr/build/solr-core/test/J1/./solrtest-jetty1-1348219182899
[junit4:junit4]   2> 2689 T963 oasc.SolrResourceLoader.<init> new SolrResourceLoader for deduced Solr Home: '/usr/home/hudson/hudson-slave/workspace/Lucene-Solr-Tests-4.x-Java6/solr/build/solr-core/test/J1/./solrtest-jetty1-1348219182899/'
[junit4:junit4]   2> 2720 T984 oascc.ZkStateReader.updateClusterState Updating cloud state from ZooKeeper... 
[junit4:junit4]   2> 2723 T963 oass.SolrDispatchFilter.init SolrDispatchFilter.init()
[junit4:junit4]   2> 2724 T963 oasc.SolrResourceLoader.locateSolrHome JNDI not configured for solr (NoInitialContextEx)
[junit4:junit4]   2> 2724 T963 oasc.SolrResourceLoader.locateSolrHome using system property solr.solr.home: /usr/home/hudson/hudson-slave/workspace/Lucene-Solr-Tests-4.x-Java6/solr/build/solr-core/test/J1/./solrtest-jetty1-1348219182899
[junit4:junit4]   2> 2725 T963 oasc.CoreContainer$Initializer.initialize looking for solr.xml: /usr/home/hudson/hudson-slave/workspace/Lucene-Solr-Tests-4.x-Java6/solr/build/solr-core/test/J1/./solrtest-jetty1-1348219182899/solr.xml
[junit4:junit4]   2> 2725 T963 oasc.CoreContainer.<init> New CoreContainer 560054298
[junit4:junit4]   2> 2726 T963 oasc.CoreContainer.load Loading CoreContainer using Solr Home: '/usr/home/hudson/hudson-slave/workspace/Lucene-Solr-Tests-4.x-Java6/solr/build/solr-core/test/J1/./solrtest-jetty1-1348219182899/'
[junit4:junit4]   2> 2726 T963 oasc.SolrResourceLoader.<init> new SolrResourceLoader for directory: '/usr/home/hudson/hudson-slave/workspace/Lucene-Solr-Tests-4.x-Java6/solr/build/solr-core/test/J1/./solrtest-jetty1-1348219182899/'
[junit4:junit4]   2> 2740 T983 oascc.ZkStateReader$2.process A cluster state change has occurred - updating...
[junit4:junit4]   2> 2750 T963 oasc.CoreContainer.load Registering Log Listener
[junit4:junit4]   2> 2765 T963 oasc.CoreContainer.initZooKeeper Zookeeper client=127.0.0.1:11507/solr
[junit4:junit4]   2> 2765 T963 oaz.ZooKeeper.<init> Initiating client connection, connectString=127.0.0.1:11507/solr sessionTimeout=5000 watcher=org.apache.solr.common.cloud.ConnectionManager@4cabd349
[junit4:junit4]   2> 2766 T996 oaz.ClientCnxn$SendThread.startConnect Opening socket connection to server /127.0.0.1:11507
[junit4:junit4]   2> 2766 T963 oascc.ConnectionManager.waitForConnected Waiting for client to connect to ZooKeeper
[junit4:junit4]   2> 2768 T996 oaz.ClientCnxn$SendThread.primeConnection Socket connection established to localhost/127.0.0.1:11507, initiating session
[junit4:junit4]   2> 2768 T965 oazs.NIOServerCnxn$Factory.run Accepted socket connection from /140.211.11.196:22512
[junit4:junit4]   2> 2768 T965 oazs.NIOServerCnxn.readConnectRequest Client attempting to establish new session at /140.211.11.196:22512
[junit4:junit4]   2> 2770 T967 oazs.NIOServerCnxn.finishSessionInit Established session 0x139e820167c0003 with negotiated timeout 5000 for client /140.211.11.196:22512
[junit4:junit4]   2> 2770 T996 oaz.ClientCnxn$SendThread.readConnectResult Session establishment complete on server localhost/127.0.0.1:11507, sessionid = 0x139e820167c0003, negotiated timeout = 5000
[junit4:junit4]   2> 2770 T997 oascc.ConnectionManager.process Watcher org.apache.solr.common.cloud.ConnectionManager@4cabd349 name:ZooKeeperConnection Watcher:127.0.0.1:11507/solr got event WatchedEvent state:SyncConnected type:None path:null path:null type:None
[junit4:junit4]   2> 2770 T963 oascc.ConnectionManager.waitForConnected Client is connected to ZooKeeper
[junit4:junit4]   2> 2771 T968 oazs.PrepRequestProcessor.pRequest Got user-level KeeperException when processing sessionid:0x139e820167c0003 type:create cxid:0x1 zxid:0xfffffffffffffffe txntype:unknown reqpath:n/a Error Path:/solr/overseer Error:KeeperErrorCode = NodeExists for /solr/overseer
[junit4:junit4]   2> 2773 T968 oazs.PrepRequestProcessor.pRequest Got user-level KeeperException when processing sessionid:0x139e820167c0003 type:create cxid:0x2 zxid:0xfffffffffffffffe txntype:unknown reqpath:n/a Error Path:/solr/overseer Error:KeeperErrorCode = NodeExists for /solr/overseer
[junit4:junit4]   2> 2774 T963 oasc.ZkController.createEphemeralLiveNode Register node as live in ZooKeeper:/live_nodes/127.0.0.1:26068_solr
[junit4:junit4]   2> 2775 T968 oazs.PrepRequestProcessor.pRequest Got user-level KeeperException when processing sessionid:0x139e820167c0003 type:delete cxid:0x4 zxid:0xfffffffffffffffe txntype:unknown reqpath:n/a Error Path:/solr/live_nodes/127.0.0.1:26068_solr Error:KeeperErrorCode = NoNode for /solr/live_nodes/127.0.0.1:26068_solr
[junit4:junit4]   2> 2776 T963 oascc.SolrZkClient.makePath makePath: /live_nodes/127.0.0.1:26068_solr
[junit4:junit4]   2> 2785 T983 oascc.ZkStateReader$3.process Updating live nodes
[junit4:junit4]   2> 2786 T963 oashc.HttpShardHandlerFactory.getParameter Setting socketTimeout to: 0
[junit4:junit4]   2> 2786 T963 oashc.HttpShardHandlerFactory.getParameter Setting urlScheme to: http://
[junit4:junit4]   2> 2786 T963 oashc.HttpShardHandlerFactory.getParameter Setting connTimeout to: 0
[junit4:junit4]   2> 2787 T963 oashc.HttpShardHandlerFactory.getParameter Setting maxConnectionsPerHost to: 20
[junit4:junit4]   2> 2787 T963 oashc.HttpShardHandlerFactory.getParameter Setting corePoolSize to: 0
[junit4:junit4]   2> 2788 T963 oashc.HttpShardHandlerFactory.getParameter Setting maximumPoolSize to: 2147483647
[junit4:junit4]   2> 2788 T963 oashc.HttpShardHandlerFactory.getParameter Setting maxThreadIdleTime to: 5
[junit4:junit4]   2> 2788 T963 oashc.HttpShardHandlerFactory.getParameter Setting sizeOfQueue to: -1
[junit4:junit4]   2> 2789 T963 oashc.HttpShardHandlerFactory.getParameter Setting fairnessPolicy to: false
[junit4:junit4]   2> 2789 T963 oascsi.HttpClientUtil.createClient Creating new http client, config:maxConnectionsPerHost=20&maxConnections=10000&socketTimeout=0&connTimeout=0&retry=false
[junit4:junit4]   2> 2805 T963 oascc.ZkStateReader.createClusterStateWatchersAndUpdate Updating cluster state from ZooKeeper... 
[junit4:junit4]   2> 2811 T963 oasc.CoreContainer.create Creating SolrCore 'collection1' using instanceDir: /usr/home/hudson/hudson-slave/workspace/Lucene-Solr-Tests-4.x-Java6/solr/build/solr-core/test/J1/./solrtest-jetty1-1348219182899/collection1
[junit4:junit4]   2> 2811 T963 oasc.ZkController.createCollectionZkNode Check for collection zkNode:collection1
[junit4:junit4]   2> 2812 T963 oasc.ZkController.createCollectionZkNode Collection zkNode exists
[junit4:junit4]   2> 2812 T963 oasc.ZkController.readConfigName Load collection config from:/collections/collection1
[junit4:junit4]   2> 2814 T963 oasc.SolrResourceLoader.<init> new SolrResourceLoader for directory: '/usr/home/hudson/hudson-slave/workspace/Lucene-Solr-Tests-4.x-Java6/solr/build/solr-core/test/J1/./solrtest-jetty1-1348219182899/collection1/'
[junit4:junit4]   2> 2815 T963 oasc.SolrResourceLoader.replaceClassLoader Adding 'file:/usr/home/hudson/hudson-slave/workspace/Lucene-Solr-Tests-4.x-Java6/solr/build/solr-core/test/J1/solrtest-jetty1-1348219182899/collection1/lib/README' to classloader
[junit4:junit4]   2> 2816 T963 oasc.SolrResourceLoader.replaceClassLoader Adding 'file:/usr/home/hudson/hudson-slave/workspace/Lucene-Solr-Tests-4.x-Java6/solr/build/solr-core/test/J1/solrtest-jetty1-1348219182899/collection1/lib/classes/' to classloader
[junit4:junit4]   2> 2864 T963 oasc.SolrConfig.<init> Using Lucene MatchVersion: LUCENE_40
[junit4:junit4]   2> 2933 T963 oasc.SolrConfig.<init> Loaded SolrConfig: solrconfig.xml
[junit4:junit4]   2> 3034 T963 oass.IndexSchema.readSchema Reading Solr Schema
[junit4:junit4]   2> 3040 T963 oass.IndexSchema.readSchema Schema name=test
[junit4:junit4]   2> 3637 T963 oass.OpenExchangeRatesOrgProvider.init Initialized with rates=open-exchange-rates.json, refreshInterval=1440.
[junit4:junit4]   2> 3650 T963 oass.IndexSchema.readSchema default search field in schema is text
[junit4:junit4]   2> 3654 T963 oass.IndexSchema.readSchema unique key field: id
[junit4:junit4]   2> 3668 T963 oass.FileExchangeRateProvider.reload Reloading exchange rates from file currency.xml
[junit4:junit4]   2> 3673 T963 oass.FileExchangeRateProvider.reload Reloading exchange rates from file currency.xml
[junit4:junit4]   2> 3678 T963 oass.OpenExchangeRatesOrgProvider.reload Reloading exchange rates from open-exchange-rates.json
[junit4:junit4]   2> 3679 T963 oass.OpenExchangeRatesOrgProvider.reload Reloading exchange rates from open-exchange-rates.json
[junit4:junit4]   2> 3680 T963 oasc.SolrCore.<init> [collection1] Opening new SolrCore at /usr/home/hudson/hudson-slave/workspace/Lucene-Solr-Tests-4.x-Java6/solr/build/solr-core/test/J1/./solrtest-jetty1-1348219182899/collection1/, dataDir=./org.apache.solr.cloud.BasicDistributedZk2Test-1348219180664/jetty1/
[junit4:junit4]   2> 3681 T963 oasc.JmxMonitoredMap.<init> JMX monitoring is enabled. Adding Solr mbeans to JMX Server: com.sun.jmx.mbeanserver.JmxMBeanServer@6910b640
[junit4:junit4]   2> 3682 T963 oasc.SolrCore.getNewIndexDir WARNING New index directory detected: old=null new=./org.apache.solr.cloud.BasicDistributedZk2Test-1348219180664/jetty1/index/
[junit4:junit4]   2> 3683 T963 oasc.SolrCore.initIndex WARNING [collection1] Solr index directory './org.apache.solr.cloud.BasicDistributedZk2Test-1348219180664/jetty1/index' doesn't exist. Creating new index...
[junit4:junit4]   2> 3684 T963 oasc.CachingDirectoryFactory.get return new directory for /usr/home/hudson/hudson-slave/workspace/Lucene-Solr-Tests-4.x-Java6/solr/build/solr-core/test/J1/./org.apache.solr.cloud.BasicDistributedZk2Test-1348219180664/jetty1/index forceNew:false
[junit4:junit4]   2> 3718 T963 oasc.SolrDeletionPolicy.onCommit SolrDeletionPolicy.onCommit: commits:num=1
[junit4:junit4]   2> 		commit{dir=NRTCachingDirectory(org.apache.lucene.store.NIOFSDirectory@/usr/home/hudson/hudson-slave/workspace/Lucene-Solr-Tests-4.x-Java6/solr/build/solr-core/test/J1/org.apache.solr.cloud.BasicDistributedZk2Test-1348219180664/jetty1/index lockFactory=org.apache.lucene.store.NativeFSLockFactory@131cf3a3; maxCacheMB=48.0 maxMergeSizeMB=4.0),segFN=segments_1,generation=1,filenames=[segments_1]
[junit4:junit4]   2> 3719 T963 oasc.SolrDeletionPolicy.updateCommits newest commit = 1
[junit4:junit4]   2> 3720 T963 oasc.SolrCore.initWriters created xml: solr.XMLResponseWriter
[junit4:junit4]   2> 3722 T963 oasup.UpdateRequestProcessorChain.init inserting DistributedUpdateProcessorFactory into updateRequestProcessorChain "dedupe"
[junit4:junit4]   2> 3723 T963 oasup.UpdateRequestProcessorChain.init inserting DistributedUpdateProcessorFactory into updateRequestProcessorChain "dedupe-allfields"
[junit4:junit4]   2> 3723 T963 oasup.UpdateRequestProcessorChain.init inserting DistributedUpdateProcessorFactory into updateRequestProcessorChain "stored_sig"
[junit4:junit4]   2> 3724 T963 oasup.UpdateRequestProcessorChain.init inserting DistributedUpdateProcessorFactory into updateRequestProcessorChain "uniq-fields"
[junit4:junit4]   2> 3725 T963 oasup.UpdateRequestProcessorChain.init inserting DistributedUpdateProcessorFactory into updateRequestProcessorChain "distrib-dup-test-chain-implicit"
[junit4:junit4]   2> 3725 T963 oasc.RequestHandlers.initHandlersFromConfig adding lazy requestHandler: solr.ReplicationHandler
[junit4:junit4]   2> 3726 T963 oasc.RequestHandlers.initHandlersFromConfig created /replication: solr.ReplicationHandler
[junit4:junit4]   2> 3727 T963 oasc.RequestHandlers.initHandlersFromConfig created standard: solr.StandardRequestHandler
[junit4:junit4]   2> 3727 T963 oasc.RequestHandlers.initHandlersFromConfig created /get: solr.RealTimeGetHandler
[junit4:junit4]   2> 3728 T963 oasc.RequestHandlers.initHandlersFromConfig created dismax: solr.SearchHandler
[junit4:junit4]   2> 3729 T963 oasc.RequestHandlers.initHandlersFromConfig created mock: org.apache.solr.core.MockQuerySenderListenerReqHandler
[junit4:junit4]   2> 3729 T963 oasc.RequestHandlers.initHandlersFromConfig created /admin/: org.apache.solr.handler.admin.AdminHandlers
[junit4:junit4]   2> 3730 T963 oasc.RequestHandlers.initHandlersFromConfig created defaults: solr.StandardRequestHandler
[junit4:junit4]   2> 3731 T963 oasc.RequestHandlers.initHandlersFromConfig adding lazy requestHandler: solr.StandardRequestHandler
[junit4:junit4]   2> 3731 T963 oasc.RequestHandlers.initHandlersFromConfig created lazy: solr.StandardRequestHandler
[junit4:junit4]   2> 3732 T963 oasc.RequestHandlers.initHandlersFromConfig created /update: solr.UpdateRequestHandler
[junit4:junit4]   2> 3732 T963 oasc.RequestHandlers.initHandlersFromConfig created /terms: org.apache.solr.handler.component.SearchHandler
[junit4:junit4]   2> 3733 T963 oasc.RequestHandlers.initHandlersFromConfig created spellCheckCompRH: org.apache.solr.handler.component.SearchHandler
[junit4:junit4]   2> 3734 T963 oasc.RequestHandlers.initHandlersFromConfig created spellCheckCompRH_Direct: org.apache.solr.handler.component.SearchHandler
[junit4:junit4]   2> 3735 T963 oasc.RequestHandlers.initHandlersFromConfig created spellCheckWithWordbreak: org.apache.solr.handler.component.SearchHandler
[junit4:junit4]   2> 3735 T963 oasc.RequestHandlers.initHandlersFromConfig created spellCheckWithWordbreak_Direct: org.apache.solr.handler.component.SearchHandler
[junit4:junit4]   2> 3736 T963 oasc.RequestHandlers.initHandlersFromConfig created spellCheckCompRH1: org.apache.solr.handler.component.SearchHandler
[junit4:junit4]   2> 3737 T963 oasc.RequestHandlers.initHandlersFromConfig created tvrh: org.apache.solr.handler.component.SearchHandler
[junit4:junit4]   2> 3737 T963 oasc.RequestHandlers.initHandlersFromConfig created /mlt: solr.MoreLikeThisHandler
[junit4:junit4]   2> 3738 T963 oasc.RequestHandlers.initHandlersFromConfig created /debug/dump: solr.DumpRequestHandler
[junit4:junit4]   2> 3742 T963 oashl.XMLLoader.init xsltCacheLifetimeSeconds=60
[junit4:junit4]   2> 3747 T963 oasc.SolrCore.initDeprecatedSupport WARNING solrconfig.xml uses deprecated <admin/gettableFiles>, Please update your config to use the ShowFileRequestHandler.
[junit4:junit4]   2> 3748 T963 oasc.SolrCore.initDeprecatedSupport WARNING adding ShowFileRequestHandler with hidden files: [SCHEMA.XML, OLD_SYNONYMS.TXT, STOPWORDS.TXT, PROTWORDS.TXT, OPEN-EXCHANGE-RATES.JSON, SYNONYMS.TXT, CURRENCY.XML, MAPPING-ISOLATIN1ACCENT.TXT]
[junit4:junit4]   2> 3752 T963 oass.SolrIndexSearcher.<init> Opening Searcher@45ead7e0 main
[junit4:junit4]   2> 3753 T963 oasu.CommitTracker.<init> Hard AutoCommit: disabled
[junit4:junit4]   2> 3753 T963 oasu.CommitTracker.<init> Soft AutoCommit: disabled
[junit4:junit4]   2> 3754 T963 oashc.SpellCheckComponent.inform Initializing spell checkers
[junit4:junit4]   2> 3762 T963 oass.DirectSolrSpellChecker.init init: {name=direct,classname=DirectSolrSpellChecker,field=lowerfilt,minQueryLength=3}
[junit4:junit4]   2> 3820 T998 oasc.SolrCore.registerSearcher [collection1] Registered new searcher Searcher@45ead7e0 main{StandardDirectoryReader(segments_1:1)}
[junit4:junit4]   2> 4248 T984 oascc.ZkStateReader.updateClusterState Updating cloud state from ZooKeeper... 
[junit4:junit4]   2> 4262 T983 oascc.ZkStateReader$2.process A cluster state change has occurred - updating...
[junit4:junit4]   2> 4262 T997 oascc.ZkStateReader$2.process A cluster state change has occurred - updating...
[junit4:junit4]   2> 4328 T963 oasc.CoreContainer.register registering core: collection1
[junit4:junit4]   2> 4328 T963 oasc.ZkController.register Register shard - core:collection1 address:http://127.0.0.1:26068/solr shardId:shard1
[junit4:junit4]   2> 4329 T963 oascc.SolrZkClient.makePath makePath: /collections/collection1/leader_elect/shard1/election
[junit4:junit4]   2> 4346 T968 oazs.PrepRequestProcessor.pRequest Got user-level KeeperException when processing sessionid:0x139e820167c0003 type:delete cxid:0x42 zxid:0xfffffffffffffffe txntype:unknown reqpath:n/a Error Path:/solr/collections/collection1/leaders Error:KeeperErrorCode = NoNode for /solr/collections/collection1/leaders
[junit4:junit4]   2> 4347 T963 oasc.ShardLeaderElectionContext.runLeaderProcess Running the leader process.
[junit4:junit4]   2> 4347 T968 oazs.PrepRequestProcessor.pRequest Got user-level KeeperException when processing sessionid:0x139e820167c0003 type:create cxid:0x43 zxid:0xfffffffffffffffe txntype:unknown reqpath:n/a Error Path:/solr/overseer Error:KeeperErrorCode = NodeExists for /solr/overseer
[junit4:junit4]   2> 4360 T963 oasc.ShardLeaderElectionContext.waitForReplicasToComeUp Enough replicas found to continue.
[junit4:junit4]   2> 4360 T963 oasc.ShardLeaderElectionContext.runLeaderProcess I may be the new leader - try and sync
[junit4:junit4]   2> 4361 T963 oasc.SyncStrategy.sync Sync replicas to http://127.0.0.1:26068/solr/collection1/
[junit4:junit4]   2> 4361 T963 oasc.SyncStrategy.syncReplicas Sync Success - now sync replicas to me
[junit4:junit4]   2> 4361 T963 oasc.SyncStrategy.syncToMe http://127.0.0.1:26068/solr/collection1/ has no replicas
[junit4:junit4]   2> 4362 T963 oasc.ShardLeaderElectionContext.runLeaderProcess I am the new leader: http://127.0.0.1:26068/solr/collection1/
[junit4:junit4]   2> 4362 T963 oascc.SolrZkClient.makePath makePath: /collections/collection1/leaders/shard1
[junit4:junit4]   2> 4372 T968 oazs.PrepRequestProcessor.pRequest Got user-level KeeperException when processing sessionid:0x139e820167c0003 type:create cxid:0x4d zxid:0xfffffffffffffffe txntype:unknown reqpath:n/a Error Path:/solr/overseer Error:KeeperErrorCode = NodeExists for /solr/overseer
[junit4:junit4]   2> 4766 T984 oascc.ZkStateReader.updateClusterState Updating cloud state from ZooKeeper... 
[junit4:junit4]   2> 4783 T983 oascc.ZkStateReader$2.process A cluster state change has occurred - updating...
[junit4:junit4]   2> 4783 T997 oascc.ZkStateReader$2.process A cluster state change has occurred - updating...
[junit4:junit4]   2> 4833 T963 oasc.ZkController.register We are http://127.0.0.1:26068/solr/collection1/ and leader is http://127.0.0.1:26068/solr/collection1/
[junit4:junit4]   2> 4833 T963 oasc.ZkController.register No LogReplay needed for core=collection1 baseURL=http://127.0.0.1:26068/solr
[junit4:junit4]   2> 4834 T963 oasc.ZkController.checkRecovery I am the leader, no recovery necessary
[junit4:junit4]   2> 4836 T963 oascc.ZkStateReader.updateClusterState Updating cloud state from ZooKeeper... 
[junit4:junit4]   2> 4837 T963 oass.SolrDispatchFilter.init user.dir=/usr/home/hudson/hudson-slave/workspace/Lucene-Solr-Tests-4.x-Java6/solr/build/solr-core/test/J1
[junit4:junit4]   2> 4838 T963 oass.SolrDispatchFilter.init SolrDispatchFilter.init() done
[junit4:junit4]   2> 4838 T963 oascsi.HttpClientUtil.createClient Creating new http client, config:maxConnections=128&maxConnectionsPerHost=32&followRedirects=false
[junit4:junit4]   2> 5296 T984 oascc.ZkStateReader.updateClusterState Updating cloud state from ZooKeeper... 
[junit4:junit4]   2> 5319 T997 oascc.ZkStateReader$2.process A cluster state change has occurred - updating...
[junit4:junit4]   2> 5320 T983 oascc.ZkStateReader$2.process A cluster state change has occurred - updating...
[junit4:junit4]   2> 5387 T963 oejs.Server.doStart jetty-8.1.2.v20120308
[junit4:junit4]   2> 5390 T963 oejs.AbstractConnector.doStart Started SocketConnector@0.0.0.0:43614
[junit4:junit4]   2> 5390 T963 oasc.SolrResourceLoader.locateSolrHome JNDI not configured for solr (NoInitialContextEx)
[junit4:junit4]   2> 5391 T963 oasc.SolrResourceLoader.locateSolrHome using system property solr.solr.home: /usr/home/hudson/hudson-slave/workspace/Lucene-Solr-Tests-4.x-Java6/solr/build/solr-core/test/J1/./solrtest-jetty2-1348219185509
[junit4:junit4]   2> 5391 T963 oasc.SolrResourceLoader.<init> new SolrResourceLoader for deduced Solr Home: '/usr/home/hudson/hudson-slave/workspace/Lucene-Solr-Tests-4.x-Java6/solr/build/solr-core/test/J1/./solrtest-jetty2-1348219185509/'
[junit4:junit4]   2> 5426 T963 oass.SolrDispatchFilter.init SolrDispatchFilter.init()
[junit4:junit4]   2> 5426 T963 oasc.SolrResourceLoader.locateSolrHome JNDI not configured for solr (NoInitialContextEx)
[junit4:junit4]   2> 5427 T963 oasc.SolrResourceLoader.locateSolrHome using system property solr.solr.home: /usr/home/hudson/hudson-slave/workspace/Lucene-Solr-Tests-4.x-Java6/solr/build/solr-core/test/J1/./solrtest-jetty2-1348219185509
[junit4:junit4]   2> 5427 T963 oasc.CoreContainer$Initializer.initialize looking for solr.xml: /usr/home/hudson/hudson-slave/workspace/Lucene-Solr-Tests-4.x-Java6/solr/build/solr-core/test/J1/./solrtest-jetty2-1348219185509/solr.xml
[junit4:junit4]   2> 5428 T963 oasc.CoreContainer.<init> New CoreContainer 952682771
[junit4:junit4]   2> 5428 T963 oasc.CoreContainer.load Loading CoreContainer using Solr Home: '/usr/home/hudson/hudson-slave/workspace/Lucene-Solr-Tests-4.x-Java6/solr/build/solr-core/test/J1/./solrtest-jetty2-1348219185509/'
[junit4:junit4]   2> 5429 T963 oasc.SolrResourceLoader.<init> new SolrResourceLoader for directory: '/usr/home/hudson/hudson-slave/workspace/Lucene-Solr-Tests-4.x-Java6/solr/build/solr-core/test/J1/./solrtest-jetty2-1348219185509/'
[junit4:junit4]   2> 5453 T963 oasc.CoreContainer.load Registering Log Listener
[junit4:junit4]   2> 5468 T963 oasc.CoreContainer.initZooKeeper Zookeeper client=127.0.0.1:11507/solr
[junit4:junit4]   2> 5469 T963 oaz.ZooKeeper.<init> Initiating client connection, connectString=127.0.0.1:11507/solr sessionTimeout=5000 watcher=org.apache.solr.common.cloud.ConnectionManager@3fedbbdb
[junit4:junit4]   2> 5470 T1008 oaz.ClientCnxn$SendThread.startConnect Opening socket connection to server /127.0.0.1:11507
[junit4:junit4]   2> 5470 T963 oascc.ConnectionManager.waitForConnected Waiting for client to connect to ZooKeeper
[junit4:junit4]   2> 5471 T1008 oaz.ClientCnxn$SendThread.primeConnection Socket connection established to localhost/127.0.0.1:11507, initiating session
[junit4:junit4]   2> 5471 T965 oazs.NIOServerCnxn$Factory.run Accepted socket connection from /140.211.11.196:29158
[junit4:junit4]   2> 5472 T965 oazs.NIOServerCnxn.readConnectRequest Client attempting to establish new session at /140.211.11.196:29158
[junit4:junit4]   2> 5478 T967 oazs.NIOServerCnxn.finishSessionInit Established session 0x139e820167c0004 with negotiated timeout 5000 for client /140.211.11.196:29158
[junit4:junit4]   2> 5478 T1008 oaz.ClientCnxn$SendThread.readConnectResult Session establishment complete on server localhost/127.0.0.1:11507, sessionid = 0x139e820167c0004, negotiated timeout = 5000
[junit4:junit4]   2> 5479 T1009 oascc.ConnectionManager.process Watcher org.apache.solr.common.cloud.ConnectionManager@3fedbbdb name:ZooKeeperConnection Watcher:127.0.0.1:11507/solr got event WatchedEvent state:SyncConnected type:None path:null path:null type:None
[junit4:junit4]   2> 5479 T963 oascc.ConnectionManager.waitForConnected Client is connected to ZooKeeper
[junit4:junit4]   2> 5480 T968 oazs.PrepRequestProcessor.pRequest Got user-level KeeperException when processing sessionid:0x139e820167c0004 type:create cxid:0x1 zxid:0xfffffffffffffffe txntype:unknown reqpath:n/a Error Path:/solr/overseer Error:KeeperErrorCode = NodeExists for /solr/overseer
[junit4:junit4]   2> 5481 T968 oazs.PrepRequestProcessor.pRequest Got user-level KeeperException when processing sessionid:0x139e820167c0004 type:create cxid:0x2 zxid:0xfffffffffffffffe txntype:unknown reqpath:n/a Error Path:/solr/overseer Error:KeeperErrorCode = NodeExists for /solr/overseer
[junit4:junit4]   2> 5492 T963 oasc.ZkController.createEphemeralLiveNode Register node as live in ZooKeeper:/live_nodes/127.0.0.1:43614_solr
[junit4:junit4]   2> 5493 T968 oazs.PrepRequestProcessor.pRequest Got user-level KeeperException when processing sessionid:0x139e820167c0004 type:delete cxid:0x4 zxid:0xfffffffffffffffe txntype:unknown reqpath:n/a Error Path:/solr/live_nodes/127.0.0.1:43614_solr Error:KeeperErrorCode = NoNode for /solr/live_nodes/127.0.0.1:43614_solr
[junit4:junit4]   2> 5494 T963 oascc.SolrZkClient.makePath makePath: /live_nodes/127.0.0.1:43614_solr
[junit4:junit4]   2> 5496 T997 oascc.ZkStateReader$3.process Updating live nodes
[junit4:junit4]   2> 5496 T983 oascc.ZkStateReader$3.process Updating live nodes
[junit4:junit4]   2> 5497 T963 oashc.HttpShardHandlerFactory.getParameter Setting socketTimeout to: 0
[junit4:junit4]   2> 5498 T963 oashc.HttpShardHandlerFactory.getParameter Setting urlScheme to: http://
[junit4:junit4]   2> 5498 T963 oashc.HttpShardHandlerFactory.getParameter Setting connTimeout to: 0
[junit4:junit4]   2> 5499 T963 oashc.HttpShardHandlerFactory.getParameter Setting maxConnectionsPerHost to: 20
[junit4:junit4]   2> 5499 T963 oashc.HttpShardHandlerFactory.getParameter Setting corePoolSize to: 0
[junit4:junit4]   2> 5499 T963 oashc.HttpShardHandlerFactory.getParameter Setting maximumPoolSize to: 2147483647
[junit4:junit4]   2> 5500 T963 oashc.HttpShardHandlerFactory.getParameter Setting maxThreadIdleTime to: 5
[junit4:junit4]   2> 5500 T963 oashc.HttpShardHandlerFactory.getParameter Setting sizeOfQueue to: -1
[junit4:junit4]   2> 5501 T963 oashc.HttpShardHandlerFactory.getParameter Setting fairnessPolicy to: false
[junit4:junit4]   2> 5501 T963 oascsi.HttpClientUtil.createClient Creating new http client, config:maxConnectionsPerHost=20&maxConnections=10000&socketTimeout=0&connTimeout=0&retry=false
[junit4:junit4]   2> 5519 T963 oascc.ZkStateReader.createClusterStateWatchersAndUpdate Updating cluster state from ZooKeeper... 
[junit4:junit4]   2> 5526 T963 oasc.CoreContainer.create Creating SolrCore 'collection1' using instanceDir: /usr/home/hudson/hudson-slave/workspace/Lucene-Solr-Tests-4.x-Java6/solr/build/solr-core/test/J1/./solrtest-jetty2-1348219185509/collection1
[junit4:junit4]   2> 5526 T963 oasc.ZkController.createCollectionZkNode Check for collection zkNode:collection1
[junit4:junit4]   2> 5527 T963 oasc.ZkController.createCollectionZkNode Collection zkNode exists
[junit4:junit4]   2> 5527 T963 oasc.ZkController.readConfigName Load collection config from:/collections/collection1
[junit4:junit4]   2> 5529 T963 oasc.SolrResourceLoader.<init> new SolrResourceLoader for directory: '/usr/home/hudson/hudson-slave/workspace/Lucene-Solr-Tests-4.x-Java6/solr/build/solr-core/test/J1/./solrtest-jetty2-1348219185509/collection1/'
[junit4:junit4]   2> 5530 T963 oasc.SolrResourceLoader.replaceClassLoader Adding 'file:/usr/home/hudson/hudson-slave/workspace/Lucene-Solr-Tests-4.x-Java6/solr/build/solr-core/test/J1/solrtest-jetty2-1348219185509/collection1/lib/classes/' to classloader
[junit4:junit4]   2> 5531 T963 oasc.SolrResourceLoader.replaceClassLoader Adding 'file:/usr/home/hudson/hudson-slave/workspace/Lucene-Solr-Tests-4.x-Java6/solr/build/solr-core/test/J1/solrtest-jetty2-1348219185509/collection1/lib/README' to classloader
[junit4:junit4]   2> 5585 T963 oasc.SolrConfig.<init> Using Lucene MatchVersion: LUCENE_40
[junit4:junit4]   2> 5654 T963 oasc.SolrConfig.<init> Loaded SolrConfig: solrconfig.xml
[junit4:junit4]   2> 5755 T963 oass.IndexSchema.readSchema Reading Solr Schema
[junit4:junit4]   2> 5761 T963 oass.IndexSchema.readSchema Schema name=test
[junit4:junit4]   2> 6359 T963 oass.OpenExchangeRatesOrgProvider.init Initialized with rates=open-exchange-rates.json, refreshInterval=1440.
[junit4:junit4]   2> 6371 T963 oass.IndexSchema.readSchema default search field in schema is text
[junit4:junit4]   2> 6376 T963 oass.IndexSchema.readSchema unique key field: id
[junit4:junit4]   2> 6389 T963 oass.FileExchangeRateProvider.reload Reloading exchange rates from file currency.xml
[junit4:junit4]   2> 6394 T963 oass.FileExchangeRateProvider.reload Reloading exchange rates from file currency.xml
[junit4:junit4]   2> 6398 T963 oass.OpenExchangeRatesOrgProvider.reload Reloading exchange rates from open-exchange-rates.json
[junit4:junit4]   2> 6399 T963 oass.OpenExchangeRatesOrgProvider.reload Reloading exchange rates from open-exchange-rates.json
[junit4:junit4]   2> 6401 T963 oasc.SolrCore.<init> [collection1] Opening new SolrCore at /usr/home/hudson/hudson-slave/workspace/Lucene-Solr-Tests-4.x-Java6/solr/build/solr-core/test/J1/./solrtest-jetty2-1348219185509/collection1/, dataDir=./org.apache.solr.cloud.BasicDistributedZk2Test-1348219180664/jetty2/
[junit4:junit4]   2> 6401 T963 oasc.JmxMonitoredMap.<init> JMX monitoring is enabled. Adding Solr mbeans to JMX Server: com.sun.jmx.mbeanserver.JmxMBeanServer@6910b640
[junit4:junit4]   2> 6403 T963 oasc.SolrCore.getNewIndexDir WARNING New index directory detected: old=null new=./org.apache.solr.cloud.BasicDistributedZk2Test-1348219180664/jetty2/index/
[junit4:junit4]   2> 6403 T963 oasc.SolrCore.initIndex WARNING [collection1] Solr index directory './org.apache.solr.cloud.BasicDistributedZk2Test-1348219180664/jetty2/index' doesn't exist. Creating new index...
[junit4:junit4]   2> 6404 T963 oasc.CachingDirectoryFactory.get return new directory for /usr/home/hudson/hudson-slave/workspace/Lucene-Solr-Tests-4.x-Java6/solr/build/solr-core/test/J1/./org.apache.solr.cloud.BasicDistributedZk2Test-1348219180664/jetty2/index forceNew:false
[junit4:junit4]   2> 6417 T963 oasc.SolrDeletionPolicy.onCommit SolrDeletionPolicy.onCommit: commits:num=1
[junit4:junit4]   2> 		commit{dir=NRTCachingDirectory(org.apache.lucene.store.NIOFSDirectory@/usr/home/hudson/hudson-slave/workspace/Lucene-Solr-Tests-4.x-Java6/solr/build/solr-core/test/J1/org.apache.solr.cloud.BasicDistributedZk2Test-1348219180664/jetty2/index lockFactory=org.apache.lucene.store.NativeFSLockFactory@78970e4; maxCacheMB=48.0 maxMergeSizeMB=4.0),segFN=segments_1,generation=1,filenames=[segments_1]
[junit4:junit4]   2> 6418 T963 oasc.SolrDeletionPolicy.updateCommits newest commit = 1
[junit4:junit4]   2> 6419 T963 oasc.SolrCore.initWriters created xml: solr.XMLResponseWriter
[junit4:junit4]   2> 6421 T963 oasup.UpdateRequestProcessorChain.init inserting DistributedUpdateProcessorFactory into updateRequestProcessorChain "dedupe"
[junit4:junit4]   2> 6422 T963 oasup.UpdateRequestProcessorChain.init inserting DistributedUpdateProcessorFactory into updateRequestProcessorChain "dedupe-allfields"
[junit4:junit4]   2> 6422 T963 oasup.UpdateRequestProcessorChain.init inserting DistributedUpdateProcessorFactory into updateRequestProcessorChain "stored_sig"
[junit4:junit4]   2> 6423 T963 oasup.UpdateRequestProcessorChain.init inserting DistributedUpdateProcessorFactory into updateRequestProcessorChain "uniq-fields"
[junit4:junit4]   2> 6424 T963 oasup.UpdateRequestProcessorChain.init inserting DistributedUpdateProcessorFactory into updateRequestProcessorChain "distrib-dup-test-chain-implicit"
[junit4:junit4]   2> 6424 T963 oasc.RequestHandlers.initHandlersFromConfig adding lazy requestHandler: solr.ReplicationHandler
[junit4:junit4]   2> 6425 T963 oasc.RequestHandlers.initHandlersFromConfig created /replication: solr.ReplicationHandler
[junit4:junit4]   2> 6425 T963 oasc.RequestHandlers.initHandlersFromConfig created standard: solr.StandardRequestHandler
[junit4:junit4]   2> 6426 T963 oasc.RequestHandlers.initHandlersFromConfig created /get: solr.RealTimeGetHandler
[junit4:junit4]   2> 6427 T963 oasc.RequestHandlers.initHandlersFromConfig created dismax: solr.SearchHandler
[junit4:junit4]   2> 6428 T963 oasc.RequestHandlers.initHandlersFromConfig created mock: org.apache.solr.core.MockQuerySenderListenerReqHandler
[junit4:junit4]   2> 6428 T963 oasc.RequestHandlers.initHandlersFromConfig created /admin/: org.apache.solr.handler.admin.AdminHandlers
[junit4:junit4]   2> 6429 T963 oasc.RequestHandlers.initHandlersFromConfig created defaults: solr.StandardRequestHandler
[junit4:junit4]   2> 6429 T963 oasc.RequestHandlers.initHandlersFromConfig adding lazy requestHandler: solr.StandardRequestHandler
[junit4:junit4]   2> 6430 T963 oasc.RequestHandlers.initHandlersFromConfig created lazy: solr.StandardRequestHandler
[junit4:junit4]   2> 6431 T963 oasc.RequestHandlers.initHandlersFromConfig created /update: solr.UpdateRequestHandler
[junit4:junit4]   2> 6431 T963 oasc.RequestHandlers.initHandlersFromConfig created /terms: org.apache.solr.handler.component.SearchHandler
[junit4:junit4]   2> 6432 T963 oasc.RequestHandlers.initHandlersFromConfig created spellCheckCompRH: org.apache.solr.handler.component.SearchHandler
[junit4:junit4]   2> 6433 T963 oasc.RequestHandlers.initHandlersFromConfig created spellCheckCompRH_Direct: org.apache.solr.handler.component.SearchHandler
[junit4:junit4]   2> 6433 T963 oasc.RequestHandlers.initHandlersFromConfig created spellCheckWithWordbreak: org.apache.solr.handler.component.SearchHandler
[junit4:junit4]   2> 6434 T963 oasc.RequestHandlers.initHandlersFromConfig created spellCheckWithWordbreak_Direct: org.apache.solr.handler.component.SearchHandler
[junit4:junit4]   2> 6435 T963 oasc.RequestHandlers.initHandlersFromConfig created spellCheckCompRH1: org.apache.solr.handler.component.SearchHandler
[junit4:junit4]   2> 6436 T963 oasc.RequestHandlers.initHandlersFromConfig created tvrh: org.apache.solr.handler.component.SearchHandler
[junit4:junit4]   2> 6436 T963 oasc.RequestHandlers.initHandlersFromConfig created /mlt: solr.MoreLikeThisHandler
[junit4:junit4]   2> 6437 T963 oasc.RequestHandlers.initHandlersFromConfig created /debug/dump: solr.DumpRequestHandler
[junit4:junit4]   2> 6441 T963 oashl.XMLLoader.init xsltCacheLifetimeSeconds=60
[junit4:junit4]   2> 6446 T963 oasc.SolrCore.initDeprecatedSupport WARNING solrconfig.xml uses deprecated <admin/gettableFiles>, Please update your config to use the ShowFileRequestHandler.
[junit4:junit4]   2> 6447 T963 oasc.SolrCore.initDeprecatedSupport WARNING adding ShowFileRequestHandler with hidden files: [SCHEMA.XML, OLD_SYNONYMS.TXT, STOPWORDS.TXT, PROTWORDS.TXT, OPEN-EXCHANGE-RATES.JSON, SYNONYMS.TXT, CURRENCY.XML, MAPPING-ISOLATIN1ACCENT.TXT]
[junit4:junit4]   2> 6451 T963 oass.SolrIndexSearcher.<init> Opening Searcher@5e5e395c main
[junit4:junit4]   2> 6452 T963 oasu.CommitTracker.<init> Hard AutoCommit: disabled
[junit4:junit4]   2> 6453 T963 oasu.CommitTracker.<init> Soft AutoCommit: disabled
[junit4:junit4]   2> 6453 T963 oashc.SpellCheckComponent.inform Initializing spell checkers
[junit4:junit4]   2> 6461 T963 oass.DirectSolrSpellChecker.init init: {name=direct,classname=DirectSolrSpellChecker,field=lowerfilt,minQueryLength=3}
[junit4:junit4]   2> 6520 T1010 oasc.SolrCore.registerSearcher [collection1] Registered new searcher Searcher@5e5e395c main{StandardDirectoryReader(segments_1:1)}
[junit4:junit4]   2> 6855 T984 oascc.ZkStateReader.updateClusterState Updating cloud state from ZooKeeper... 
[junit4:junit4]   2> 6869 T997 oascc.ZkStateReader$2.process A cluster state change has occurred - updating...
[junit4:junit4]   2> 6869 T1009 oascc.ZkStateReader$2.process A cluster state change has occurred - updating...
[junit4:junit4]   2> 6869 T983 oascc.ZkStateReader$2.process A cluster state change has occurred - updating...
[junit4:junit4]   2> 7028 T963 oasc.CoreContainer.register registering core: collection1
[junit4:junit4]   2> 7028 T963 oasc.ZkController.register Register shard - core:collection1 address:http://127.0.0.1:43614/solr shardId:shard2
[junit4:junit4]   2> 7029 T963 oascc.SolrZkClient.makePath makePath: /collections/collection1/leader_elect/shard2/election
[junit4:junit4]   2> 7044 T968 oazs.PrepRequestProcessor.pRequest Got user-level KeeperException when processing sessionid:0x139e820167c0004 type:delete cxid:0x41 zxid:0xfffffffffffffffe txntype:unknown reqpath:n/a Error Path:/solr/collections/collection1/leaders/shard2 Error:KeeperErrorCode = NoNode for /solr/collections/collection1/leaders/shard2
[junit4:junit4]   2> 7045 T963 oasc.ShardLeaderElectionContext.runLeaderProcess Running the leader process.
[junit4:junit4]   2> 7046 T968 oazs.PrepRequestProcessor.pRequest Got user-level KeeperException when processing sessionid:0x139e820167c0004 type:create cxid:0x42 zxid:0xfffffffffffffffe txntype:unknown reqpath:n/a Error Path:/solr/overseer Error:KeeperErrorCode = NodeExists for /solr/overseer
[junit4:junit4]   2> 7048 T963 oasc.ShardLeaderElectionContext.waitForReplicasToComeUp Enough replicas found to continue.
[junit4:junit4]   2> 7048 T963 oasc.ShardLeaderElectionContext.runLeaderProcess I may be the new leader - try and sync
[junit4:junit4]   2> 7049 T963 oasc.SyncStrategy.sync Sync replicas to http://127.0.0.1:43614/solr/collection1/
[junit4:junit4]   2> 7049 T963 oasc.SyncStrategy.syncReplicas Sync Success - now sync replicas to me
[junit4:junit4]   2> 7049 T963 oasc.SyncStrategy.syncToMe http://127.0.0.1:43614/solr/collection1/ has no replicas
[junit4:junit4]   2> 7050 T963 oasc.ShardLeaderElectionContext.runLeaderProcess I am the new leader: http://127.0.0.1:43614/solr/collection1/
[junit4:junit4]   2> 7050 T963 oascc.SolrZkClient.makePath makePath: /collections/collection1/leaders/shard2
[junit4:junit4]   2> 7053 T968 oazs.PrepRequestProcessor.pRequest Got user-level KeeperException when processing sessionid:0x139e820167c0004 type:create cxid:0x4b zxid:0xfffffffffffffffe txntype:unknown reqpath:n/a Error Path:/solr/overseer Error:KeeperErrorCode = NodeExists for /solr/overseer
[junit4:junit4]   2> 7374 T984 oascc.ZkStateReader.updateClusterState Updating cloud state from ZooKeeper... 
[junit4:junit4]   2> 7390 T983 oascc.ZkStateReader$2.process A cluster state change has occurred - updating...
[junit4:junit4]   2> 7390 T1009 oascc.ZkStateReader$2.process A cluster state change has occurred - updating...
[junit4:junit4]   2> 7390 T997 oascc.ZkStateReader$2.process A cluster state change has occurred - updating...
[junit4:junit4]   2> 7412 T963 oasc.ZkController.register We are http://127.0.0.1:43614/solr/collection1/ and leader is http://127.0.0.1:43614/solr/collection1/
[junit4:junit4]   2> 7412 T963 oasc.ZkController.register No LogReplay needed for core=collection1 baseURL=http://127.0.0.1:43614/solr
[junit4:junit4]   2> 7413 T963 oasc.ZkController.checkRecovery I am the leader, no recovery necessary
[junit4:junit4]   2> 7415 T963 oascc.ZkStateReader.updateClusterState Updating cloud state from ZooKeeper... 
[junit4:junit4]   2> 7416 T963 oass.SolrDispatchFilter.init user.dir=/usr/home/hudson/hudson-slave/workspace/Lucene-Solr-Tests-4.x-Java6/solr/build/solr-core/test/J1
[junit4:junit4]   2> 7416 T963 oass.SolrDispatchFilter.init SolrDispatchFilter.init() done
[junit4:junit4]   2> 7416 T963 oascsi.HttpClientUtil.createClient Creating new http client, config:maxConnections=128&maxConnectionsPerHost=32&followRedirects=false
[junit4:junit4]   2> 7887 T963 oejs.Server.doStart jetty-8.1.2.v20120308
[junit4:junit4]   2> 7890 T963 oejs.AbstractConnector.doStart Started SocketConnector@0.0.0.0:26902
[junit4:junit4]   2> 7891 T963 oasc.SolrResourceLoader.locateSolrHome JNDI not configured for solr (NoInitialContextEx)
[junit4:junit4]   2> 7891 T963 oasc.SolrResourceLoader.locateSolrHome using system property solr.solr.home: /usr/home/hudson/hudson-slave/workspace/Lucene-Solr-Tests-4.x-Java6/solr/build/solr-core/test/J1/./solrtest-jetty3-1348219188089
[junit4:junit4]   2> 7892 T963 oasc.SolrResourceLoader.<init> new SolrResourceLoader for deduced Solr Home: '/usr/home/hudson/hudson-slave/workspace/Lucene-Solr-Tests-4.x-Java6/solr/build/solr-core/test/J1/./solrtest-jetty3-1348219188089/'
[junit4:junit4]   2> 7904 T984 oascc.ZkStateReader.updateClusterState Updating cloud state from ZooKeeper... 
[junit4:junit4]   2> 7925 T963 oass.SolrDispatchFilter.init SolrDispatchFilter.init()
[junit4:junit4]   2> 7926 T963 oasc.SolrResourceLoader.locateSolrHome JNDI not configured for solr (NoInitialContextEx)
[junit4:junit4]   2> 7926 T963 oasc.SolrResourceLoader.locateSolrHome using system property solr.solr.home: /usr/home/hudson/hudson-slave/workspace/Lucene-Solr-Tests-4.x-Java6/solr/build/solr-core/test/J1/./solrtest-jetty3-1348219188089
[junit4:junit4]   2> 7927 T963 oasc.CoreContainer$Initializer.initialize looking for solr.xml: /usr/home/hudson/hudson-slave/workspace/Lucene-Solr-Tests-4.x-Java6/solr/build/solr-core/test/J1/./solrtest-jetty3-1348219188089/solr.xml
[junit4:junit4]   2> 7927 T963 oasc.CoreContainer.<init> New CoreContainer 2125897876
[junit4:junit4]   2> 7928 T963 oasc.CoreContainer.load Loading CoreContainer using Solr Home: '/usr/home/hudson/hudson-slave/workspace/Lucene-Solr-Tests-4.x-Java6/solr/build/solr-core/test/J1/./solrtest-jetty3-1348219188089/'
[junit4:junit4]   2> 7928 T963 oasc.SolrResourceLoader.<init> new SolrResourceLoader for directory: '/usr/home/hudson/hudson-slave/workspace/Lucene-Solr-Tests-4.x-Java6/solr/build/solr-core/test/J1/./solrtest-jetty3-1348219188089/'
[junit4:junit4]   2> 7929 T1009 oascc.ZkStateReader$2.process A cluster state change has occurred - updating...
[junit4:junit4]   2> 7929 T983 oascc.ZkStateReader$2.process A cluster state change has occurred - updating...
[junit4:junit4]   2> 7929 T997 oascc.ZkStateReader$2.process A cluster state change has occurred - updating...
[junit4:junit4]   2> 7953 T963 oasc.CoreContainer.load Registering Log Listener
[junit4:junit4]   2> 7967 T963 oasc.CoreContainer.initZooKeeper Zookeeper client=127.0.0.1:11507/solr
[junit4:junit4]   2> 7968 T963 oaz.ZooKeeper.<init> Initiating client connection, connectString=127.0.0.1:11507/solr sessionTimeout=5000 watcher=org.apache.solr.common.cloud.ConnectionManager@36b19b14
[junit4:junit4]   2> 7969 T1020 oaz.ClientCnxn$SendThread.startConnect Opening socket connection to server /127.0.0.1:11507
[junit4:junit4]   2> 7969 T963 oascc.ConnectionManager.waitForConnected Waiting for client to connect to ZooKeeper
[junit4:junit4]   2> 7970 T1020 oaz.ClientCnxn$SendThread.primeConnection Socket connection established to localhost/127.0.0.1:11507, initiating session
[junit4:junit4]   2> 7971 T965 oazs.NIOServerCnxn$Factory.run Accepted socket connection from /140.211.11.196:42948
[junit4:junit4]   2> 7971 T965 oazs.NIOServerCnxn.readConnectRequest Client attempting to establish new session at /140.211.11.196:42948
[junit4:junit4]   2> 7973 T967 oazs.NIOServerCnxn.finishSessionInit Established session 0x139e820167c0005 with negotiated timeout 5000 for client /140.211.11.196:42948
[junit4:junit4]   2> 7973 T1020 oaz.ClientCnxn$SendThread.readConnectResult Session establishment complete on server localhost/127.0.0.1:11507, sessionid = 0x139e820167c0005, negotiated timeout = 5000
[junit4:junit4]   2> 7973 T1021 oascc.ConnectionManager.process Watcher org.apache.solr.common.cloud.ConnectionManager@36b19b14 name:ZooKeeperConnection Watcher:127.0.0.1:11507/solr got event WatchedEvent state:SyncConnected type:None path:null path:null type:None
[junit4:junit4]   2> 7973 T963 oascc.ConnectionManager.waitForConnected Client is connected to ZooKeeper
[junit4:junit4]   2> 7974 T968 oazs.PrepRequestProcessor.pRequest Got user-level KeeperException when processing sessionid:0x139e820167c0005 type:create cxid:0x1 zxid:0xfffffffffffffffe txntype:unknown reqpath:n/a Error Path:/solr/overseer Error:KeeperErrorCode = NodeExists for /solr/overseer
[junit4:junit4]   2> 7976 T968 oazs.PrepRequestProcessor.pRequest Got user-level KeeperException when processing sessionid:0x139e820167c0005 type:create cxid:0x2 zxid:0xfffffffffffffffe txntype:unknown reqpath:n/a Error Path:/solr/overseer Error:KeeperErrorCode = NodeExists for /solr/overseer
[junit4:junit4]   2> 7977 T963 oasc.ZkController.createEphemeralLiveNode Register node as live in ZooKeeper:/live_nodes/127.0.0.1:26902_solr
[junit4:junit4]   2> 7978 T968 oazs.PrepRequestProcessor.pRequest Got user-level KeeperException when processing sessionid:0x139e820167c0005 type:delete cxid:0x4 zxid:0xfffffffffffffffe txntype:unknown reqpath:n/a Error Path:/solr/live_nodes/127.0.0.1:26902_solr Error:KeeperErrorCode = NoNode for /solr/live_nodes/127.0.0.1:26902_solr
[junit4:junit4]   2> 7986 T963 oascc.SolrZkClient.makePath makePath: /live_nodes/127.0.0.1:26902_solr
[junit4:junit4]   2> 7988 T997 oascc.ZkStateReader$3.process Updating live nodes
[junit4:junit4]   2> 7989 T1009 oascc.ZkStateReader$3.process Updating live nodes
[junit4:junit4]   2> 7989 T983 oascc.ZkStateReader$3.process Updating live nodes
[junit4:junit4]   2> 7989 T963 oashc.HttpShardHandlerFactory.getParameter Setting socketTimeout to: 0
[junit4:junit4]   2> 7990 T963 oashc.HttpShardHandlerFactory.getParameter Setting urlScheme to: http://
[junit4:junit4]   2> 7990 T963 oashc.HttpShardHandlerFactory.getParameter Setting connTimeout to: 0
[junit4:junit4]   2> 7991 T963 oashc.HttpShardHandlerFactory.getParameter Setting maxConnectionsPerHost to: 20
[junit4:junit4]   2> 7991 T963 oashc.HttpShardHandlerFactory.getParameter Setting corePoolSize to: 0
[junit4:junit4]   2> 7992 T963 oashc.HttpShardHandlerFactory.getParameter Setting maximumPoolSize to: 2147483647
[junit4:junit4]   2> 7992 T963 oashc.HttpShardHandlerFactory.getParameter Setting maxThreadIdleTime to: 5
[junit4:junit4]   2> 7992 T963 oashc.HttpShardHandlerFactory.getParameter Setting sizeOfQueue to: -1
[junit4:junit4]   2> 7993 T963 oashc.HttpShardHandlerFactory.getParameter Setting fairnessPolicy to: false
[junit4:junit4]   2> 7993 T963 oascsi.HttpClientUtil.createClient Creating new http client, config:maxConnectionsPerHost=20&maxConnections=10000&socketTimeout=0&connTimeout=0&retry=false
[junit4:junit4]   2> 8009 T963 oascc.ZkStateReader.createClusterStateWatchersAndUpdate Updating cluster state from ZooKeeper... 
[junit4:junit4]   2> 8015 T963 oasc.CoreContainer.create Creating SolrCore 'collection1' using instanceDir: /usr/home/hudson/hudson-slave/workspace/Lucene-Solr-Tests-4.x-Java6/solr/build/solr-core/test/J1/./solrtest-jetty3-1348219188089/collection1
[junit4:junit4]   2> 8015 T963 oasc.ZkController.createCollectionZkNode Check for collection zkNode:collection1
[junit4:junit4]   2> 8016 T963 oasc.ZkController.createCollectionZkNode Collection zkNode exists
[junit4:junit4]   2> 8016 T963 oasc.ZkController.readConfigName Load collection config from:/collections/collection1
[junit4:junit4]   2> 8018 T963 oasc.SolrResourceLoader.<init> new SolrResourceLoader for directory: '/usr/home/hudson/hudson-slave/workspace/Lucene-Solr-Tests-4.x-Java6/solr/build/solr-core/test/J1/./solrtest-jetty3-1348219188089/collection1/'
[junit4:junit4]   2> 8019 T963 oasc.SolrResourceLoader.replaceClassLoader Adding 'file:/usr/home/hudson/hudson-slave/workspace/Lucene-Solr-Tests-4.x-Java6/solr/build/solr-core/test/J1/solrtest-jetty3-1348219188089/collection1/lib/README' to classloader
[junit4:junit4]   2> 8020 T963 oasc.SolrResourceLoader.replaceClassLoader Adding 'file:/usr/home/hudson/hudson-slave/workspace/Lucene-Solr-Tests-4.x-Java6/solr/build/solr-core/test/J1/solrtest-jetty3-1348219188089/collection1/lib/classes/' to classloader
[junit4:junit4]   2> 8064 T963 oasc.SolrConfig.<init> Using Lucene MatchVersion: LUCENE_40
[junit4:junit4]   2> 8127 T963 oasc.SolrConfig.<init> Loaded SolrConfig: solrconfig.xml
[junit4:junit4]   2> 8228 T963 oass.IndexSchema.readSchema Reading Solr Schema
[junit4:junit4]   2> 8233 T963 oass.IndexSchema.readSchema Schema name=test
[junit4:junit4]   2> 8786 T963 oass.OpenExchangeRatesOrgProvider.init Initialized with rates=open-exchange-rates.json, refreshInterval=1440.
[junit4:junit4]   2> 8797 T963 oass.IndexSchema.readSchema default search field in schema is text
[junit4:junit4]   2> 8801 T963 oass.IndexSchema.readSchema unique key field: id
[junit4:junit4]   2> 8813 T963 oass.FileExchangeRateProvider.reload Reloading exchange rates from file currency.xml
[junit4:junit4]   2> 8818 T963 oass.FileExchangeRateProvider.reload Reloading exchange rates from file currency.xml
[junit4:junit4]   2> 8822 T963 oass.OpenExchangeRatesOrgProvider.reload Reloading exchange rates from open-exchange-rates.json
[junit4:junit4]   2> 8823 T963 oass.OpenExchangeRatesOrgProvider.reload Reloading exchange rates from open-exchange-rates.json
[junit4:junit4]   2> 8825 T963 oasc.SolrCore.<init> [collection1] Opening new SolrCore at /usr/home/hudson/hudson-slave/workspace/Lucene-Solr-Tests-4.x-Java6/solr/build/solr-core/test/J1/./solrtest-jetty3-1348219188089/collection1/, dataDir=./org.apache.solr.cloud.BasicDistributedZk2Test-1348219180664/jetty3/
[junit4:junit4]   2> 8825 T963 oasc.JmxMonitoredMap.<init> JMX monitoring is enabled. Adding Solr mbeans to JMX Server: com.sun.jmx.mbeanserver.JmxMBeanServer@6910b640
[junit4:junit4]   2> 8826 T963 oasc.SolrCore.getNewIndexDir WARNING New index directory detected: old=null new=./org.apache.solr.cloud.BasicDistributedZk2Test-1348219180664/jetty3/index/
[junit4:junit4]   2> 8827 T963 oasc.SolrCore.initIndex WARNING [collection1] Solr index directory './org.apache.solr.cloud.BasicDistributedZk2Test-1348219180664/jetty3/index' doesn't exist. Creating new index...
[junit4:junit4]   2> 8828 T963 oasc.CachingDirectoryFactory.get return new directory for /usr/home/hudson/hudson-slave/workspace/Lucene-Solr-Tests-4.x-Java6/solr/build/solr-core/test/J1/./org.apache.solr.cloud.BasicDistributedZk2Test-1348219180664/jetty3/index forceNew:false
[junit4:junit4]   2> 8859 T963 oasc.SolrDeletionPolicy.onCommit SolrDeletionPolicy.onCommit: commits:num=1
[junit4:junit4]   2> 		commit{dir=NRTCachingDirectory(org.apache.lucene.store.NIOFSDirectory@/usr/home/hudson/hudson-slave/workspace/Lucene-Solr-Tests-4.x-Java6/solr/build/solr-core/test/J1/org.apache.solr.cloud.BasicDistributedZk2Test-1348219180664/jetty3/index lockFactory=org.apache.lucene.store.NativeFSLockFactory@434d54de; maxCacheMB=48.0 maxMergeSizeMB=4.0),segFN=segments_1,generation=1,filenames=[segments_1]
[junit4:junit4]   2> 8860 T963 oasc.SolrDeletionPolicy.updateCommits newest commit = 1
[junit4:junit4]   2> 8861 T963 oasc.SolrCore.initWriters created xml: solr.XMLResponseWriter
[junit4:junit4]   2> 8863 T963 oasup.UpdateRequestProcessorChain.init inserting DistributedUpdateProcessorFactory into updateRequestProcessorChain "dedupe"
[junit4:junit4]   2> 8864 T963 oasup.UpdateRequestProcessorChain.init inserting DistributedUpdateProcessorFactory into updateRequestProcessorChain "dedupe-allfields"
[junit4:junit4]   2> 8864 T963 oasup.UpdateRequestProcessorChain.init inserting DistributedUpdateProcessorFactory into updateRequestProcessorChain "stored_sig"
[junit4:junit4]   2> 8865 T963 oasup.UpdateRequestProcessorChain.init inserting DistributedUpdateProcessorFactory into updateRequestProcessorChain "uniq-fields"
[junit4:junit4]   2> 8865 T963 oasup.UpdateRequestProcessorChain.init inserting DistributedUpdateProcessorFactory into updateRequestProcessorChain "distrib-dup-test-chain-implicit"
[junit4:junit4]   2> 8866 T963 oasc.RequestHandlers.initHandlersFromConfig adding lazy requestHandler: solr.ReplicationHandler
[junit4:junit4]   2> 8866 T963 oasc.RequestHandlers.initHandlersFromConfig created /replication: solr.ReplicationHandler
[junit4:junit4]   2> 8867 T963 oasc.RequestHandlers.initHandlersFromConfig created standard: solr.StandardRequestHandler
[junit4:junit4]   2> 8868 T963 oasc.RequestHandlers.initHandlersFromConfig created /get: solr.RealTimeGetHandler
[junit4:junit4]   2> 8868 T963 oasc.RequestHandlers.initHandlersFromConfig created dismax: solr.SearchHandler
[junit4:junit4]   2> 8869 T963 oasc.RequestHandlers.initHandlersFromConfig created mock: org.apache.solr.core.MockQuerySenderListenerReqHandler
[junit4:junit4]   2> 8870 T963 oasc.RequestHandlers.initHandlersFromConfig created /admin/: org.apache.solr.handler.admin.AdminHandlers
[junit4:junit4]   2> 8870 T963 oasc.RequestHandlers.initHandlersFromConfig created defaults: solr.StandardRequestHandler
[junit4:junit4]   2> 8871 T963 oasc.RequestHandlers.initHandlersFromConfig adding lazy requestHandler: solr.StandardRequestHandler
[junit4:junit4]   2> 8871 T963 oasc.RequestHandlers.initHandlersFromConfig created lazy: solr.StandardRequestHandler
[junit4:junit4]   2> 8872 T963 oasc.RequestHandlers.initHandlersFromConfig created /update: solr.UpdateRequestHandler
[junit4:junit4]   2> 8872 T963 oasc.RequestHandlers.initHandlersFromConfig created /terms: org.apache.solr.handler.component.SearchHandler
[junit4:junit4]   2> 8873 T963 oasc.RequestHandlers.initHandlersFromConfig created spellCheckCompRH: org.apache.solr.handler.component.SearchHandler
[junit4:junit4]   2> 8874 T963 oasc.RequestHandlers.initHandlersFromConfig created spellCheckCompRH_Direct: org.apache.solr.handler.component.SearchHandler
[junit4:junit4]   2> 8874 T963 oasc.RequestHandlers.initHandlersFromConfig created spellCheckWithWordbreak: org.apache.solr.handler.component.SearchHandler
[junit4:junit4]   2> 8875 T963 oasc.RequestHandlers.initHandlersFromConfig created spellCheckWithWordbreak_Direct: org.apache.solr.handler.component.SearchHandler
[junit4:junit4]   2> 8876 T963 oasc.RequestHandlers.initHandlersFromConfig created spellCheckCompRH1: org.apache.solr.handler.component.SearchHandler
[junit4:junit4]   2> 8876 T963 oasc.RequestHandlers.initHandlersFromConfig created tvrh: org.apache.solr.handler.component.SearchHandler
[junit4:junit4]   2> 8877 T963 oasc.RequestHandlers.initHandlersFromConfig created /mlt: solr.MoreLikeThisHandler
[junit4:junit4]   2> 8878 T963 oasc.RequestHandlers.initHandlersFromConfig created /debug/dump: solr.DumpRequestHandler
[junit4:junit4]   2> 8881 T963 oashl.XMLLoader.init xsltCacheLifetimeSeconds=60
[junit4:junit4]   2> 8885 T963 oasc.SolrCore.initDeprecatedSupport WARNING solrconfig.xml uses deprecated <admin/gettableFiles>, Please update your config to use the ShowFileRequestHandler.
[junit4:junit4]   2> 8887 T963 oasc.SolrCore.initDeprecatedSupport WARNING adding ShowFileRequestHandler with hidden files: [SCHEMA.XML, OLD_SYNONYMS.TXT, STOPWORDS.TXT, PROTWORDS.TXT, OPEN-EXCHANGE-RATES.JSON, SYNONYMS.TXT, CURRENCY.XML, MAPPING-ISOLATIN1ACCENT.TXT]
[junit4:junit4]   2> 8890 T963 oass.SolrIndexSearcher.<init> Opening Searcher@3305fed5 main
[junit4:junit4]   2> 8891 T963 oasu.CommitTracker.<init> Hard AutoCommit: disabled
[junit4:junit4]   2> 8892 T963 oasu.CommitTracker.<init> Soft AutoCommit: disabled
[junit4:junit4]   2> 8892 T963 oashc.SpellCheckComponent.inform Initializing spell checkers
[junit4:junit4]   2> 8900 T963 oass.DirectSolrSpellChecker.init init: {name=direct,classname=DirectSolrSpellChecker,field=lowerfilt,minQueryLength=3}
[junit4:junit4]   2> 8957 T1022 oasc.SolrCore.registerSearcher [collection1] Registered new searcher Searcher@3305fed5 main{StandardDirectoryReader(segments_1:1)}
[junit4:junit4]   2> 9444 T984 oascc.ZkStateReader.updateClusterState Updating cloud state from ZooKeeper... 
[junit4:junit4]   2> 9455 T983 oascc.ZkStateReader$2.process A cluster state change has occurred - updating...
[junit4:junit4]   2> 9455 T1021 oascc.ZkStateReader$2.process A cluster state change has occurred - updating...
[junit4:junit4]   2> 9455 T1009 oascc.ZkStateReader$2.process A cluster state change has occurred - updating...
[junit4:junit4]   2> 9455 T997 oascc.ZkStateReader$2.process A cluster state change has occurred - updating...
[junit4:junit4]   2> 9464 T963 oasc.CoreContainer.register registering core: collection1
[junit4:junit4]   2> 9464 T963 oasc.ZkController.register Register shard - core:collection1 address:http://127.0.0.1:26902/solr shardId:shard1
[junit4:junit4]   2> 9467 T963 oasc.ZkController.register We are http://127.0.0.1:26902/solr/collection1/ and leader is http://127.0.0.1:26068/solr/collection1/
[junit4:junit4]   2> 9468 T963 oasc.ZkController.register No LogReplay needed for core=collection1 baseURL=http://127.0.0.1:26902/solr
[junit4:junit4]   2> 9468 T963 oasc.ZkController.checkRecovery Core needs to recover:collection1
[junit4:junit4]   2> 9469 T963 oasu.DefaultSolrCoreState.doRecovery Running recovery - first canceling any ongoing recovery
[junit4:junit4]   2> ASYNC  NEW_CORE C77 name=collection1 org.apache.solr.core.SolrCore@3befbe79 url=http://127.0.0.1:26902/solr/collection1 node=127.0.0.1:26902_solr
[junit4:junit4]   2> 9469 T1023 C77 P26902 oasc.RecoveryStrategy.run Starting recovery process.  core=collection1 recoveringAfterStartup=true
[junit4:junit4]   2> 9470 T1023 C77 P26902 oasc.RecoveryStrategy.doRecovery ###### startupVersions=[]
[junit4:junit4]   2> 9470 T963 oascc.ZkStateReader.updateClusterState Updating cloud state from ZooKeeper... 
[junit4:junit4]   2> 9471 T1023 C77 P26902 oasc.RecoveryStrategy.doRecovery Attempting to PeerSync from http://127.0.0.1:26068/solr/collection1/ core=collection1 - recoveringAfterStartup=true
[junit4:junit4]   2> 9471 T1023 C77 P26902 oasu.PeerSync.sync PeerSync: core=collection1 url=http://127.0.0.1:26902/solr START replicas=[http://127.0.0.1:26068/solr/collection1/] nUpdates=100
[junit4:junit4]   2> 9471 T963 oass.SolrDispatchFilter.init user.dir=/usr/home/hudson/hudson-slave/workspace/Lucene-Solr-Tests-4.x-Java6/solr/build/solr-core/test/J1
[junit4:junit4]   2> 9472 T1023 C77 P26902 oasu.PeerSync.sync WARNING no frame of reference to tell of we've missed updates
[junit4:junit4]   2> 9472 T963 oass.SolrDispatchFilter.init SolrDispatchFilter.init() done
[junit4:junit4]   2> 9473 T1023 C77 P26902 oasc.RecoveryStrategy.doRecovery PeerSync Recovery was not successful - trying replication. core=collection1
[junit4:junit4]   2> 9473 T1023 C77 P26902 oasc.RecoveryStrategy.doRecovery Starting Replication Recovery. core=collection1
[junit4:junit4]   2> 9473 T963 oascsi.HttpClientUtil.createClient Creating new http client, config:maxConnections=128&maxConnectionsPerHost=32&followRedirects=false
[junit4:junit4]   2> 9473 T1023 C77 P26902 oascsi.HttpClientUtil.createClient Creating new http client, config:maxConnections=128&maxConnectionsPerHost=32&followRedirects=false
[junit4:junit4]   2> ASYNC  NEW_CORE C78 name=collection1 org.apache.solr.core.SolrCore@65ce0806 url=http://127.0.0.1:26068/solr/collection1 node=127.0.0.1:26068_solr
[junit4:junit4]   2> 9482 T989 C78 P26068 REQ /get {distrib=false&qt=/get&wt=javabin&version=2&getVersions=100} status=0 QTime=1 
[junit4:junit4]   2> 9950 T963 oejs.Server.doStart jetty-8.1.2.v20120308
[junit4:junit4]   2> 9953 T963 oejs.AbstractConnector.doStart Started SocketConnector@0.0.0.0:37575
[junit4:junit4]   2> 9953 T963 oasc.SolrResourceLoader.locateSolrHome JNDI not configured for solr (NoInitialContextEx)
[junit4:junit4]   2> 9954 T963 oasc.SolrResourceLoader.locateSolrHome using system property solr.solr.home: /usr/home/hudson/hudson-slave/workspace/Lucene-Solr-Tests-4.x-Java6/solr/build/solr-core/test/J1/./solrtest-jetty4-1348219190153
[junit4:junit4]   2> 9954 T963 oasc.SolrResourceLoader.<init> new SolrResourceLoader for deduced Solr Home: '/usr/home/hudson/hudson-slave/workspace/Lucene-Solr-Tests-4.x-Java6/solr/build/solr-core/test/J1/./solrtest-jetty4-1348219190153/'
[junit4:junit4]   2> 9960 T984 oascc.ZkStateReader.updateClusterState Updating cloud state from ZooKeeper... 
[junit4:junit4]   2> 9983 T983 oascc.ZkStateReader$2.process A cluster state change has occurred - updating...
[junit4:junit4]   2> 9983 T1021 oascc.ZkStateReader$2.process A cluster state change has occurred - updating...
[junit4:junit4]   2> 9983 T1009 oascc.ZkStateReader$2.process A cluster state change has occurred - updating...
[junit4:junit4]   2> 9983 T997 oascc.ZkStateReader$2.process A cluster state change has occurred - updating...
[junit4:junit4]   2> 9989 T963 oass.SolrDispatchFilter.init SolrDispatchFilter.init()
[junit4:junit4]   2> 9990 T963 oasc.SolrResourceLoader.locateSolrHome JNDI not configured for solr (NoInitialContextEx)
[junit4:junit4]   2> 9990 T963 oasc.SolrResourceLoader.locateSolrHome using system property solr.solr.home: /usr/home/hudson/hudson-slave/workspace/Lucene-Solr-Tests-4.x-Java6/solr/build/solr-core/test/J1/./solrtest-jetty4-1348219190153
[junit4:junit4]   2> 9991 T963 oasc.CoreContainer$Initializer.initialize looking for solr.xml: /usr/home/hudson/hudson-slave/workspace/Lucene-Solr-Tests-4.x-Java6/solr/build/solr-core/test/J1/./solrtest-jetty4-1348219190153/solr.xml
[junit4:junit4]   2> 9991 T963 oasc.CoreContainer.<init> New CoreContainer 1095082952
[junit4:junit4]   2> 9992 T963 oasc.CoreContainer.load Loading CoreContainer using Solr Home: '/usr/home/hudson/hudson-slave/workspace/Lucene-Solr-Tests-4.x-Java6/solr/build/solr-core/test/J1/./solrtest-jetty4-1348219190153/'
[junit4:junit4]   2> 9992 T963 oasc.SolrResourceLoader.<init> new SolrResourceLoader for directory: '/usr/home/hudson/hudson-slave/workspace/Lucene-Solr-Tests-4.x-Java6/solr/build/solr-core/test/J1/./solrtest-jetty4-1348219190153/'
[junit4:junit4]   2> 10016 T963 oasc.CoreContainer.load Registering Log Listener
[junit4:junit4]   2> 10031 T963 oasc.CoreContainer.initZooKeeper Zookeeper client=127.0.0.1:11507/solr
[junit4:junit4]   2> 10032 T963 oaz.ZooKeeper.<init> Initiating client connection, connectString=127.0.0.1:11507/solr sessionTimeout=5000 watcher=org.apache.solr.common.cloud.ConnectionManager@2b70723d
[junit4:junit4]   2> 10032 T1034 oaz.ClientCnxn$SendThread.startConnect Opening socket connection to server /127.0.0.1:11507
[junit4:junit4]   2> 10032 T963 oascc.ConnectionManager.waitForConnected Waiting for client to connect to ZooKeeper
[junit4:junit4]   2> 10034 T1034 oaz.ClientCnxn$SendThread.primeConnection Socket connection established to localhost/127.0.0.1:11507, initiating session
[junit4:junit4]   2> 10034 T965 oazs.NIOServerCnxn$Factory.run Accepted socket connection from /140.211.11.196:50625
[junit4:junit4]   2> 10034 T965 oazs.NIOServerCnxn.readConnectRequest Client attempting to establish new session at /140.211.11.196:50625
[junit4:junit4]   2> 10036 T967 oazs.NIOServerCnxn.finishSessionInit Established session 0x139e820167c0006 with negotiated timeout 5000 for client /140.211.11.196:50625
[junit4:junit4]   2> 10036 T1034 oaz.ClientCnxn$SendThread.readConnectResult Session establishment complete on server localhost/127.0.0.1:11507, sessionid = 0x139e820167c0006, negotiated timeout = 5000
[junit4:junit4]   2> 10036 T1035 oascc.ConnectionManager.process Watcher org.apache.solr.common.cloud.ConnectionManager@2b70723d name:ZooKeeperConnection Watcher:127.0.0.1:11507/solr got event WatchedEvent state:SyncConnected type:None path:null path:null type:None
[junit4:junit4]   2> 10037 T963 oascc.ConnectionManager.waitForConnected Client is connected to ZooKeeper
[junit4:junit4]   2> 10037 T968 oazs.PrepRequestProcessor.pRequest Got user-level KeeperException when processing sessionid:0x139e820167c0006 type:create cxid:0x1 zxid:0xfffffffffffffffe txntype:unknown reqpath:n/a Error Path:/solr/overseer Error:KeeperErrorCode = NodeExists for /solr/overseer
[junit4:junit4]   2> 10039 T968 oazs.PrepRequestProcessor.pRequest Got user-level KeeperException when processing sessionid:0x139e820167c0006 type:create cxid:0x2 zxid:0xfffffffffffffffe txntype:unknown reqpath:n/a Error Path:/solr/overseer Error:KeeperErrorCode = NodeExists for /solr/overseer
[junit4:junit4]   2> 10040 T963 oasc.ZkController.createEphemeralLiveNode Register node as live in ZooKeeper:/live_nodes/127.0.0.1:37575_solr
[junit4:junit4]   2> 10041 T968 oazs.PrepRequestProcessor.pRequest Got user-level KeeperException when processing sessionid:0x139e820167c0006 type:delete cxid:0x4 zxid:0xfffffffffffffffe txntype:unknown reqpath:n/a Error Path:/solr/live_nodes/127.0.0.1:37575_solr Error:KeeperErrorCode = NoNode for /solr/live_nodes/127.0.0.1:37575_solr
[junit4:junit4]   2> 10042 T963 oascc.SolrZkClient.makePath makePath: /live_nodes/127.0.0.1:37575_solr
[junit4:junit4]   2> 10044 T983 oascc.ZkStateReader$3.process Updating live nodes
[junit4:junit4]   2> 10044 T997 oascc.ZkStateReader$3.process Updating live nodes
[junit4:junit4]   2> 10044 T1009 oascc.ZkStateReader$3.process Updating live nodes
[junit4:junit4]   2> 10044 T1021 oascc.ZkStateReader$3.process Updating live nodes
[junit4:junit4]   2> 10045 T963 oashc.HttpShardHandlerFactory.getParameter Setting socketTimeout to: 0
[junit4:junit4]   2> 10046 T963 oashc.HttpShardHandlerFactory.getParameter Setting urlScheme to: http://
[junit4:junit4]   2> 10046 T963 oashc.HttpShardHandlerFactory.getParameter Setting connTimeout to: 0
[junit4:junit4]   2> 10046 T963 oashc.HttpShardHandlerFactory.getParameter Setting maxConnectionsPerHost to: 20
[junit4:junit4]   2> 10047 T963 oashc.HttpShardHandlerFactory.getParameter Setting corePoolSize to: 0
[junit4:junit4]   2> 10047 T963 oashc.HttpShardHandlerFactory.getParameter Setting maximumPoolSize to: 2147483647
[junit4:junit4]   2> 10048 T963 oashc.HttpShardHandlerFactory.getParameter Setting maxThreadIdleTime to: 5
[junit4:junit4]   2> 10048 T963 oashc.HttpShardHandlerFactory.getParameter Setting sizeOfQueue to: -1
[junit4:junit4]   2> 10049 T963 oashc.HttpShardHandlerFactory.getParameter Setting fairnessPolicy to: false
[junit4:junit4]   2> 10049 T963 oascsi.HttpClientUtil.createClient Creating new http client, config:maxConnectionsPerHost=20&maxConnections=10000&socketTimeout=0&connTimeout=0&retry=false
[junit4:junit4]   2> 10144 T963 oascc.ZkStateReader.createClusterStateWatchersAndUpdate Updating cluster state from ZooKeeper... 
[junit4:junit4]   2> 10151 T963 oasc.CoreContainer.create Creating SolrCore 'collection1' using instanceDir: /usr/home/hudson/hudson-slave/workspace/Lucene-Solr-Tests-4.x-Java6/solr/build/solr-core/test/J1/./solrtest-jetty4-1348219190153/collection1
[junit4:junit4]   2> 10151 T963 oasc.ZkController.createCollectionZkNode Check for collection zkNode:collection1
[junit4:junit4]   2> 10152 T963 oasc.ZkController.createCollectionZkNode Collection zkNode exists
[junit4:junit4]   2> 10152 T963 oasc.ZkController.readConfigName Load collection config from:/collections/collection1
[junit4:junit4]   2> 10154 T963 oasc.SolrResourceLoader.<init> new SolrResourceLoader for directory: '/usr/home/hudson/hudson-slave/workspace/Lucene-Solr-Tests-4.x-Java6/solr/build/solr-core/test/J1/./solrtest-jetty4-1348219190153/collection1/'
[junit4:junit4]   2> 10155 T963 oasc.SolrResourceLoader.replaceClassLoader Adding 'file:/usr/home/hudson/hudson-slave/workspace/Lucene-Solr-Tests-4.x-Java6/solr/build/solr-core/test/J1/solrtest-jetty4-1348219190153/collection1/lib/classes/' to classloader
[junit4:junit4]   2> 10156 T963 oasc.SolrResourceLoader.replaceClassLoader Adding 'file:/usr/home/hudson/hudson-slave/workspace/Lucene-Solr-Tests-4.x-Java6/solr/build/solr-core/test/J1/solrtest-jetty4-1348219190153/collection1/lib/README' to classloader
[junit4:junit4]   2> 10205 T963 oasc.SolrConfig.<init> Using Lucene MatchVersion: LUCENE_40
[junit4:junit4]   2> 10280 T963 oasc.SolrConfig.<init> Loaded SolrConfig: solrconfig.xml
[junit4:junit4]   2> 10381 T963 oass.IndexSchema.readSchema Reading Solr Schema
[junit4:junit4]   2> 10387 T963 oass.IndexSchema.readSchema Schema name=test
[junit4:junit4]   2> 10981 T963 oass.OpenExchangeRatesOrgProvider.init Initialized with rates=open-exchange-rates.json, refreshInterval=1440.
[junit4:junit4]   2> 10993 T963 oass.IndexSchema.readSchema default search field in schema is text
[junit4:junit4]   2> 10996 T963 oass.IndexSchema.readSchema unique key field: id
[junit4:junit4]   2> 11006 T963 oass.FileExchangeRateProvider.reload Reloading exchange rates from file currency.xml
[junit4:junit4]   2> 11009 T963 oass.FileExchangeRateProvider.reload Reloading exchange rates from file currency.xml
[junit4:junit4]   2> 11012 T963 oass.OpenExchangeRatesOrgProvider.reload Reloading exchange rates from open-exchange-rates.json
[junit4:junit4]   2> 11013 T963 oass.OpenExchangeRatesOrgProvider.reload Reloading exchange rates from open-exchange-rates.json
[junit4:junit4]   2> 11014 T963 oasc.SolrCore.<init> [collection1] Opening new SolrCore at /usr/home/hudson/hudson-slave/workspace/Lucene-Solr-Tests-4.x-Java6/solr/build/solr-core/test/J1/./solrtest-jetty4-1348219190153/collection1/, dataDir=./org.apache.solr.cloud.BasicDistributedZk2Test-1348219180664/jetty4/
[junit4:junit4]   2> 11015 T963 oasc.JmxMonitoredMap.<init> JMX monitoring is enabled. Adding Solr mbeans to JMX Server: com.sun.jmx.mbeanserver.JmxMBeanServer@6910b640
[junit4:junit4]   2> 11015 T963 oasc.SolrCore.getNewIndexDir WARNING New index directory detected: old=null new=./org.apache.solr.cloud.BasicDistributedZk2Test-1348219180664/jetty4/index/
[junit4:junit4]   2> 11016 T963 oasc.SolrCore.initIndex WARNING [collection1] Solr index directory './org.apache.solr.cloud.BasicDistributedZk2Test-1348219180664/jetty4/index' doesn't exist. Creating new index...
[junit4:junit4]   2> 11017 T963 oasc.CachingDirectoryFactory.get return new directory for /usr/home/hudson/hudson-slave/workspace/Lucene-Solr-Tests-4.x-Java6/solr/build/solr-core/test/J1/./org.apache.solr.cloud.BasicDistributedZk2Test-1348219180664/jetty4/index forceNew:false
[junit4:junit4]   2> 11022 T963 oasc.SolrDeletionPolicy.onCommit SolrDeletionPolicy.onCommit: commits:num=1
[junit4:junit4]   2> 		commit{dir=NRTCachingDirectory(org.apache.lucene.store.NIOFSDirectory@/usr/home/hudson/hudson-slave/workspace/Lucene-Solr-Tests-4.x-Java6/solr/build/solr-core/test/J1/org.apache.solr.cloud.BasicDistributedZk2Test-1348219180664/jetty4/index lockFactory=org.apache.lucene.store.NativeFSLockFactory@4c60f78a; maxCacheMB=48.0 maxMergeSizeMB=4.0),segFN=segments_1,generation=1,filenames=[segments_1]
[junit4:junit4]   2> 11022 T963 oasc.SolrDeletionPolicy.updateCommits newest commit = 1
[junit4:junit4]   2> 11023 T963 oasc.SolrCore.initWriters created xml: solr.XMLResponseWriter
[junit4:junit4]   2> 11025 T963 oasup.UpdateRequestProcessorChain.init inserting DistributedUpdateProcessorFactory into updateRequestProcessorChain "dedupe"
[junit4:junit4]   2> 11025 T963 oasup.UpdateRequestProcessorChain.init inserting DistributedUpdateProcessorFactory into updateRequestProcessorChain "dedupe-allfields"
[junit4:junit4]   2> 11025 T963 oasup.UpdateRequestProcessorChain.init inserting DistributedUpdateProcessorFactory into updateRequestProcessorChain "stored_sig"
[junit4:junit4]   2> 11026 T963 oasup.UpdateRequestProcessorChain.init inserting DistributedUpdateProcessorFactory into updateRequestProcessorChain "uniq-fields"
[junit4:junit4]   2> 11026 T963 oasup.UpdateRequestProcessorChain.init inserting DistributedUpdateProcessorFactory into updateRequestProcessorChain "distrib-dup-test-chain-implicit"
[junit4:junit4]   2> 11027 T963 oasc.RequestHandlers.initHandlersFromConfig adding lazy requestHandler: solr.ReplicationHandler
[junit4:junit4]   2> 11027 T963 oasc.RequestHandlers.initHandlersFromConfig created /replication: solr.ReplicationHandler
[junit4:junit4]   2> 11027 T963 oasc.RequestHandlers.initHandlersFromConfig created standard: solr.StandardRequestHandler
[junit4:junit4]   2> 11028 T963 oasc.RequestHandlers.initHandlersFromConfig created /get: solr.RealTimeGetHandler
[junit4:junit4]   2> 11028 T963 oasc.RequestHandlers.initHandlersFromConfig created dismax: solr.SearchHandler
[junit4:junit4]   2> 11029 T963 oasc.RequestHandlers.initHandlersFromConfig created mock: org.apache.solr.core.MockQuerySenderListenerReqHandler
[junit4:junit4]   2> 11029 T963 oasc.RequestHandlers.initHandlersFromConfig created /admin/: org.apache.solr.handler.admin.AdminHandlers
[junit4:junit4]   2> 11030 T963 oasc.RequestHandlers.initHandlersFromConfig created defaults: solr.StandardRequestHandler
[junit4:junit4]   2> 11030 T963 oasc.RequestHandlers.initHandlersFromConfig adding lazy requestHandler: solr.StandardRequestHandler
[junit4:junit4]   2> 11030 T963 oasc.RequestHandlers.initHandlersFromConfig created lazy: solr.StandardRequestHandler
[junit4:junit4]   2> 11031 T963 oasc.RequestHandlers.initHandlersFromConfig created /update: solr.UpdateRequestHandler
[junit4:junit4]   2> 11031 T963 oasc.RequestHandlers.initHandlersFromConfig created /terms: org.apache.solr.handler.component.SearchHandler
[junit4:junit4]   2> 11032 T963 oasc.RequestHandlers.initHandlersFromConfig created spellCheckCompRH: org.apache.solr.handler.component.SearchHandler
[junit4:junit4]   2> 11032 T963 oasc.RequestHandlers.initHandlersFromConfig created spellCheckCompRH_Direct: org.apache.solr.handler.component.SearchHandler
[junit4:junit4]   2> 11033 T963 oasc.RequestHandlers.initHandlersFromConfig created spellCheckWithWordbreak: org.apache.solr.handler.component.SearchHandler
[junit4:junit4]   2> 11033 T963 oasc.RequestHandlers.initHandlersFromConfig created spellCheckWithWordbreak_Direct: org.apache.solr.handler.component.SearchHandler
[junit4:junit4]   2> 11034 T963 oasc.RequestHandlers.initHandlersFromConfig created spellCheckCompRH1: org.apache.solr.handler.component.SearchHandler
[junit4:junit4]   2> 11034 T963 oasc.RequestHandlers.initHandlersFromConfig created tvrh: org.apache.solr.handler.component.SearchHandler
[junit4:junit4]   2> 11035 T963 oasc.RequestHandlers.initHandlersFromConfig created /mlt: solr.MoreLikeThisHandler
[junit4:junit4]   2> 11035 T963 oasc.RequestHandlers.initHandlersFromConfig created /debug/dump: solr.DumpRequestHandler
[junit4:junit4]   2> 11038 T963 oashl.XMLLoader.init xsltCacheLifetimeSeconds=60
[junit4:junit4]   2> 11041 T963 oasc.SolrCore.initDeprecatedSupport WARNING solrconfig.xml uses deprecated <admin/gettableFiles>, Please update your config to use the ShowFileRequestHandler.
[junit4:junit4]   2> 11042 T963 oasc.SolrCore.initDeprecatedSupport WARNING adding ShowFileRequestHandler with hidden files: [SCHEMA.XML, OLD_SYNONYMS.TXT, STOPWORDS.TXT, PROTWORDS.TXT, OPEN-EXCHANGE-RATES.JSON, SYNONYMS.TXT, CURRENCY.XML, MAPPING-ISOLATIN1ACCENT.TXT]
[junit4:junit4]   2> 11044 T963 oass.SolrIndexSearcher.<init> Opening Searcher@464d8ef7 main
[junit4:junit4]   2> 11045 T963 oasu.CommitTracker.<init> Hard AutoCommit: disabled
[junit4:junit4]   2> 11045 T963 oasu.CommitTracker.<init> Soft AutoCommit: disabled
[junit4:junit4]   2> 11046 T963 oashc.SpellCheckComponent.inform Initializing spell checkers
[junit4:junit4]   2> 11052 T963 oass.DirectSolrSpellChecker.init init: {name=direct,classname=DirectSolrSpellChecker,field=lowerfilt,minQueryLength=3}
[junit4:junit4]   2> 11104 T1036 oasc.SolrCore.registerSearcher [collection1] Registered new searcher Searcher@464d8ef7 main{StandardDirectoryReader(segments_1:1)}
[junit4:junit4]   2> 11491 T984 oascc.ZkStateReader.updateClusterState Updating cloud state from ZooKeeper... 
[junit4:junit4]   2> 11505 T983 oascc.ZkStateReader$2.process A cluster state change has occurred - updating...
[junit4:junit4]   2> 11505 T1009 oascc.ZkStateReader$2.process A cluster state change has occurred - updating...
[junit4:junit4]   2> 11505 T1021 oascc.ZkStateReader$2.process A cluster state change has occurred - updating...
[junit4:junit4]   2> 11505 T997 oascc.ZkStateReader$2.process A cluster state change has occurred - updating...
[junit4:junit4]   2> 11506 T1035 oascc.ZkStateReader$2.process A cluster state change has occurred - updating...
[junit4:junit4]   2> 11609 T963 oasc.CoreContainer.register registering core: collection1
[junit4:junit4]   2> 11609 T963 oasc.ZkController.register Register shard - core:collection1 address:http://127.0.0.1:37575/solr shardId:shard2
[junit4:junit4]   2> 11612 T963 oasc.ZkController.register We are http://127.0.0.1:37575/solr/collection1/ and leader is http://127.0.0.1:43614/solr/collection1/
[junit4:junit4]   2> 11613 T963 oasc.ZkController.register No LogReplay needed for core=collection1 baseURL=http://127.0.0.1:37575/solr
[junit4:junit4]   2> 11613 T963 oasc.ZkController.checkRecovery Core needs to recover:collection1
[junit4:junit4]   2> 11614 T963 oasu.DefaultSolrCoreState.doRecovery Running recovery - first canceling any ongoing recovery
[junit4:junit4]   2> ASYNC  NEW_CORE C79 name=collection1 org.apache.solr.core.SolrCore@47b6030c url=http://127.0.0.1:37575/solr/collection1 node=127.0.0.1:37575_solr
[junit4:junit4]   2> 11615 T1037 C79 P37575 oasc.RecoveryStrategy.run Starting recovery process.  core=collection1 recoveringAfterStartup=true
[junit4:junit4]   2> 11615 T1037 C79 P37575 oasc.RecoveryStrategy.doRecovery ###### startupVersions=[]
[junit4:junit4]   2> 11615 T963 oascc.ZkStateReader.updateClusterState Updating cloud state from ZooKeeper... 
[junit4:junit4]   2> 11617 T1037 C79 P37575 oasc.RecoveryStrategy.doRecovery Attempting to PeerSync from http://127.0.0.1:43614/solr/collection1/ core=collection1 - recoveringAfterStartup=true
[junit4:junit4]   2> 11617 T1037 C79 P37575 oasu.PeerSync.sync PeerSync: core=collection1 url=http://127.0.0.1:37575/solr START replicas=[http://127.0.0.1:43614/solr/collection1/] nUpdates=100
[junit4:junit4]   2> 11617 T963 oass.SolrDispatchFilter.init user.dir=/usr/home/hudson/hudson-slave/workspace/Lucene-Solr-Tests-4.x-Java6/solr/build/solr-core/test/J1
[junit4:junit4]   2> 11617 T1037 C79 P37575 oasu.PeerSync.sync WARNING no frame of reference to tell of we've missed updates
[junit4:junit4]   2> 11617 T963 oass.SolrDispatchFilter.init SolrDispatchFilter.init() done
[junit4:junit4]   2> 11618 T1037 C79 P37575 oasc.RecoveryStrategy.doRecovery PeerSync Recovery was not successful - trying replication. core=collection1
[junit4:junit4]   2> 11618 T963 oascsi.HttpClientUtil.createClient Creating new http client, config:maxConnections=128&maxConnectionsPerHost=32&followRedirects=false
[junit4:junit4]   2> 11619 T1037 C79 P37575 oasc.RecoveryStrategy.doRecovery Starting Replication Recovery. core=collection1
[junit4:junit4]   2> 11620 T1037 C79 P37575 oascsi.HttpClientUtil.createClient Creating new http client, config:maxConnections=128&maxConnectionsPerHost=32&followRedirects=false
[junit4:junit4]   2> ASYNC  NEW_CORE C80 name=collection1 org.apache.solr.core.SolrCore@32e8a91b url=http://127.0.0.1:43614/solr/collection1 node=127.0.0.1:43614_solr
[junit4:junit4]   2> 11625 T1001 C80 P43614 REQ /get {distrib=false&qt=/get&wt=javabin&version=2&getVersions=100} status=0 QTime=0 
[junit4:junit4]   2> 11635 T963 oaz.ZooKeeper.<init> Initiating client connection, connectString=127.0.0.1:11507/solr sessionTimeout=10000 watcher=org.apache.solr.common.cloud.ConnectionManager@7ffea86a
[junit4:junit4]   2> 11636 T1039 oaz.ClientCnxn$SendThread.startConnect Opening socket connection to server /127.0.0.1:11507
[junit4:junit4]   2> 11636 T963 oascc.ConnectionManager.waitForConnected Waiting for client to connect to ZooKeeper
[junit4:junit4]   2> 11637 T1039 oaz.ClientCnxn$SendThread.primeConnection Socket connection established to localhost/127.0.0.1:11507, initiating session
[junit4:junit4]   2> 11637 T965 oazs.NIOServerCnxn$Factory.run Accepted socket connection from /140.211.11.196:58331
[junit4:junit4]   2> 11638 T965 oazs.NIOServerCnxn.readConnectRequest Client attempting to establish new session at /140.211.11.196:58331
[junit4:junit4]   2> 11639 T967 oazs.NIOServerCnxn.finishSessionInit Established session 0x139e820167c0007 with negotiated timeout 10000 for client /140.211.11.196:58331
[junit4:junit4]   2> 11639 T1039 oaz.ClientCnxn$SendThread.readConnectResult Session establishment complete on server localhost/127.0.0.1:11507, sessionid = 0x139e820167c0007, negotiated timeout = 10000
[junit4:junit4]   2> 11639 T1040 oascc.ConnectionManager.process Watcher org.apache.solr.common.cloud.ConnectionManager@7ffea86a name:ZooKeeperConnection Watcher:127.0.0.1:11507/solr got event WatchedEvent state:SyncConnected type:None path:null path:null type:None
[junit4:junit4]   2> 11639 T963 oascc.ConnectionManager.waitForConnected Client is connected to ZooKeeper
[junit4:junit4]   2> 11640 T963 oascc.ZkStateReader.createClusterStateWatchersAndUpdate Updating cluster state from ZooKeeper... 
[junit4:junit4]   2> 11642 T963 oasc.ChaosMonkey.monkeyLog monkey: init - expire sessions:true cause connection loss:true
[junit4:junit4]   2> 11642 T963 oascsi.HttpClientUtil.createClient Creating new http client, config:
[junit4:junit4]   2> 11653 T963 oascc.ZkStateReader.updateClusterState Updating cloud state from ZooKeeper... 
[junit4:junit4]   2> ASYNC  NEW_CORE C81 name=collection1 org.apache.solr.core.SolrCore@7863940f url=http://127.0.0.1:62552/solr/collection1 node=127.0.0.1:62552_solr
[junit4:junit4]   2> 11665 T975 C81 P62552 oasc.SolrDeletionPolicy.onInit SolrDeletionPolicy.onInit: commits:num=1
[junit4:junit4]   2> 		commit{dir=NRTCachingDirectory(org.apache.lucene.store.NIOFSDirectory@/usr/home/hudson/hudson-slave/workspace/Lucene-Solr-Tests-4.x-Java6/solr/build/solr-core/test/J1/org.apache.solr.cloud.BasicDistributedZk2Test-1348219180664/control/data/index lockFactory=org.apache.lucene.store.NativeFSLockFactory@646a91fd; maxCacheMB=48.0 maxMergeSizeMB=4.0),segFN=segments_1,generation=1,filenames=[segments_1]
[junit4:junit4]   2> 11665 T975 C81 P62552 oasc.SolrDeletionPolicy.updateCommits newest commit = 1
[junit4:junit4]   2> 11669 T975 C81 P62552 /update {wt=javabin&version=2} {add=[1 (1413710287804039168)]} 0 9
[junit4:junit4]   2> 11670 T963 oaz.ZooKeeper.<init> Initiating client connection, connectString=127.0.0.1:11507/solr sessionTimeout=10000 watcher=org.apache.solr.common.cloud.ConnectionManager@390bf60e
[junit4:junit4]   2> 11671 T1041 oaz.ClientCnxn$SendThread.startConnect Opening socket connection to server /127.0.0.1:11507
[junit4:junit4]   2> 11671 T963 oascc.ConnectionManager.waitForConnected Waiting for client to connect to ZooKeeper
[junit4:junit4]   2> 11671 T1041 oaz.ClientCnxn$SendThread.primeConnection Socket connection established to localhost/127.0.0.1:11507, initiating session
[junit4:junit4]   2> 11672 T965 oazs.NIOServerCnxn$Factory.run Accepted socket connection from /140.211.11.196:53810
[junit4:junit4]   2> 11672 T965 oazs.NIOServerCnxn.readConnectRequest Client attempting to establish new session at /140.211.11.196:53810
[junit4:junit4]   2> 11673 T967 oazs.NIOServerCnxn.finishSessionInit Established session 0x139e820167c0008 with negotiated timeout 10000 for client /140.211.11.196:53810
[junit4:junit4]   2> 11673 T1041 oaz.ClientCnxn$SendThread.readConnectResult Session establishment complete on server localhost/127.0.0.1:11507, sessionid = 0x139e820167c0008, negotiated timeout = 10000
[junit4:junit4]   2> 11673 T1042 oascc.ConnectionManager.process Watcher org.apache.solr.common.cloud.ConnectionManager@390bf60e name:ZooKeeperConnection Watcher:127.0.0.1:11507/solr got event WatchedEvent state:SyncConnected type:None path:null path:null type:None
[junit4:junit4]   2> 11674 T963 oascc.ConnectionManager.waitForConnected Client is connected to ZooKeeper
[junit4:junit4]   2> 11674 T963 oascc.ZkStateReader.createClusterStateWatchersAndUpdate Updating cluster state from ZooKeeper... 
[junit4:junit4]   2> 11682 T991 C78 P26068 oasc.SolrDeletionPolicy.onInit SolrDeletionPolicy.onInit: commits:num=1
[junit4:junit4]   2> 		commit{dir=NRTCachingDirectory(org.apache.lucene.store.NIOFSDirectory@/usr/home/hudson/hudson-slave/workspace/Lucene-Solr-Tests-4.x-Java6/solr/build/solr-core/test/J1/org.apache.solr.cloud.BasicDistributedZk2Test-1348219180664/jetty1/index lockFactory=org.apache.lucene.store.NativeFSLockFactory@131cf3a3; maxCacheMB=48.0 maxMergeSizeMB=4.0),segFN=segments_1,generation=1,filenames=[segments_1]
[junit4:junit4]   2> 11683 T991 C78 P26068 oasc.SolrDeletionPolicy.updateCommits newest commit = 1
[junit4:junit4]   2>  C77_STATE=coll:collection1 core:collection1 props:{shard=shard1, roles=null, state=recovering, core=collection1, collection=collection1, node_name=127.0.0.1:26902_solr, base_url=http://127.0.0.1:26902/solr}
[junit4:junit4]   2> 11700 T1013 C77 P26902 oasc.SolrDeletionPolicy.onInit SolrDeletionPolicy.onInit: commits:num=1
[junit4:junit4]   2> 		commit{dir=NRTCachingDirectory(org.apache.lucene.store.NIOFSDirectory@/usr/home/hudson/hudson-slave/workspace/Lucene-Solr-Tests-4.x-Java6/solr/build/solr-core/test/J1/org.apache.solr.cloud.BasicDistributedZk2Test-1348219180664/jetty3/index lockFactory=org.apache.lucene.store.NativeFSLockFactory@434d54de; maxCacheMB=48.0 maxMergeSizeMB=4.0),segFN=segments_1,generation=1,filenames=[segments_1]
[junit4:junit4]   2> 11700 T1013 C77 P26902 oasc.SolrDeletionPolicy.updateCommits newest commit = 1
[junit4:junit4]   2> 11704 T1013 C77 P26902 REQ /update {update.distrib=FROMLEADER&distrib.from=http://127.0.0.1:26068/solr/collection1/&wt=javabin&version=2} status=0 QTime=9 
[junit4:junit4]   2> 11704 T991 C78 P26068 REQ /update {distrib.from=http://127.0.0.1:43614/solr/collection1/&update.distrib=TOLEADER&wt=javabin&version=2} status=0 QTime=26 
[junit4:junit4]   2> 11705 T1003 C80 P43614 /update {wt=javabin&version=2} {add=[1]} 0 28
[junit4:junit4]   2> 11705 T963 oasc.AbstractDistribZkTestBase.waitForRecoveriesToFinish Wait for recoveries to finish - collection: collection1 failOnTimeout:true timeout (sec):1800
[junit4:junit4]   2> 11706 T963 oascc.ZkStateReader.updateClusterState Updating cloud state from ZooKeeper... 
[junit4:junit4]   2> 12010 T984 oascc.ZkStateReader.updateClusterState Updating cloud state from ZooKeeper... 
[junit4:junit4]   2> 12024 T997 oascc.ZkStateReader$2.process A cluster state change has occurred - updating...
[junit4:junit4]   2> 12024 T1035 oascc.ZkStateReader$2.process A cluster state change has occurred - updating...
[junit4:junit4]   2> 12024 T1042 oascc.ZkStateReader$2.process A cluster state change has occurred - updating...
[junit4:junit4]   2> 12024 T1021 oascc.ZkStateReader$2.process A cluster state change has occurred - updating...
[junit4:junit4]   2> 12024 T1009 oascc.ZkStateReader$2.process A cluster state change has occurred - updating...
[junit4:junit4]   2> 12024 T983 oascc.ZkStateReader$2.process A cluster state change has occurred - updating...
[junit4:junit4]   2> 12024 T1040 oascc.ZkStateReader$2.process A cluster state change has occurred - updating...
[junit4:junit4]   2> 12498 T1023 C77 P26902 oasc.RecoveryStrategy.doRecovery Begin buffering updates. core=collection1
[junit4:junit4]   2> 12498 T1023 C77 P26902 oasu.UpdateLog.bufferUpdates Starting to buffer updates. FSUpdateLog{state=ACTIVE, tlog=tlog{file=./org.apache.solr.cloud.BasicDistributedZk2Test-1348219180664/jetty3/tlog/tlog.0000000000000000000 refcount=1}}
[junit4:junit4]   2> 12498 T1023 C77 P26902 oasc.RecoveryStrategy.replicate Attempting to replicate from http://127.0.0.1:26068/solr/collection1/. core=collection1
[junit4:junit4]   2> 12498 T1023 C77 P26902 oascsi.HttpClientUtil.createClient Creating new http client, config:maxConnections=128&maxConnectionsPerHost=32&followRedirects=false
[junit4:junit4]   2> 12513 T992 C78 P26068 oasu.DirectUpdateHandler2.commit start commit{flags=0,_version_=0,optimize=false,openSearcher=true,waitSearcher=true,expungeDeletes=false,softCommit=false}
[junit4:junit4]   2> 12574 T992 C78 P26068 oasc.SolrDeletionPolicy.onCommit SolrDeletionPolicy.onCommit: commits:num=2
[junit4:junit4]   2> 		commit{dir=NRTCachingDirectory(org.apache.lucene.store.NIOFSDirectory@/usr/home/hudson/hudson-slave/workspace/Lucene-Solr-Tests-4.x-Java6/solr/build/solr-core/test/J1/org.apache.solr.cloud.BasicDistributedZk2Test-1348219180664/jetty1/index lockFactory=org.apache.lucene.store.NativeFSLockFactory@131cf3a3; maxCacheMB=48.0 maxMergeSizeMB=4.0),segFN=segments_1,generation=1,filenames=[segments_1]
[junit4:junit4]   2> 		commit{dir=NRTCachingDirectory(org.apache.lucene.store.NIOFSDirectory@/usr/home/hudson/hudson-slave/workspace/Lucene-Solr-Tests-4.x-Java6/solr/build/solr-core/test/J1/org.apache.solr.cloud.BasicDistributedZk2Test-1348219180664/jetty1/index lockFactory=org.apache.lucene.store.NativeFSLockFactory@131cf3a3; maxCacheMB=48.0 maxMergeSizeMB=4.0),segFN=segments_2,generation=2,filenames=[_0_Asserting_0.tim, _0_Block_0.tip, _0_Block_0.pos, _0_Asserting_0.tip, _0_MockVariableIntBlock_0.doc, _0_Block_0.tim, _0_MockVariableIntBlock_0.skp, _0_Asserting_0.prx, _0_MockVariableIntBlock_0.pyl, _0_Lucene40WithOrds_0.tii, _0_Lucene40WithOrds_0.frq, _0_MockVariableIntBlock_0.tib, _0_MockVariableIntBlock_0.pos, _0.si, _0_Lucene40WithOrds_0.tib, _0_MockVariableIntBlock_0.tii, _0.fnm, _0_Block_0.doc, _0_nrm.cfs, _0_Asserting_0.frq, _0_nrm.cfe, _0_MockVariableIntBlock_0.frq, segments_2, _0.fdx, _0_Lucene40WithOrds_0.prx, _0.fdt]
[junit4:junit4]   2> 12575 T992 C78 P26068 oasc.SolrDeletionPolicy.updateCommits newest commit = 2
[junit4:junit4]   2> 12591 T992 C78 P26068 oass.SolrIndexSearcher.<init> Opening Searcher@6fe46b9d main
[junit4:junit4]   2> 12592 T992 C78 P26068 oasu.DirectUpdateHandler2.commit end_commit_flush
[junit4:junit4]   2> 12593 T998 oasc.SolrCore.registerSearcher [collection1] Registered new searcher Searcher@6fe46b9d main{StandardDirectoryReader(segments_2:3 _0(4.0.0.2):C1)}
[junit4:junit4]   2> 12594 T992 C78 P26068 /update {waitSearcher=true&commit=true&commit_end_point=true&wt=javabin&softCommit=false&version=2} {commit=} 0 81
[junit4:junit4]   2> 12595 T1023 C77 P26902 oash.ReplicationHandler.inform Commits will be reserved for  10000
[junit4:junit4]   2> 12595 T1023 C77 P26902 oash.SnapPuller.<init>  No value set for 'pollInterval'. Timer Task not started.
[junit4:junit4]   2> 12597 T993 C78 P26068 oash.ReplicationHandler.inform Commits will be reserved for  10000
[junit4:junit4]   2> 12597 T993 C78 P26068 REQ /replication {command=indexversion&wt=javabin&qt=/replication&version=2} status=0 QTime=1 
[junit4:junit4]   2> 12598 T1023 C77 P26902 oash.SnapPuller.fetchLatestIndex Master's generation: 2
[junit4:junit4]   2> 12598 T1023 C77 P26902 oash.SnapPuller.fetchLatestIndex Slave's generation: 1
[junit4:junit4]   2> 12598 T1023 C77 P26902 oash.SnapPuller.fetchLatestIndex Starting replication process
[junit4:junit4]   2> 12602 T993 C78 P26068 REQ /replication {command=filelist&generation=2&wt=javabin&qt=/replication&version=2} status=0 QTime=2 
[junit4:junit4]   2> 12602 T1023 C77 P26902 oash.SnapPuller.fetchLatestIndex Number of files in latest index in master: 26
[junit4:junit4]   2> 12610 T1023 C77 P26902 oash.SnapPuller.fetchLatestIndex Starting download to ./org.apache.solr.cloud.BasicDistributedZk2Test-1348219180664/jetty3/index.20120921191953261 fullCopy=true
[junit4:junit4]   2> 12613 T993 C78 P26068 REQ /replication {file=_0_Asserting_0.tim&command=filecontent&checksum=true&generation=2&qt=/replication&wt=filestream} status=0 QTime=0 
[junit4:junit4]   2> 12617 T993 C78 P26068 REQ /replication {file=_0_Block_0.pos&command=filecontent&checksum=true&generation=2&qt=/replication&wt=filestream} status=0 QTime=0 
[junit4:junit4]   2> 12620 T993 C78 P26068 REQ /replication {file=_0_Block_0.tip&command=filecontent&checksum=true&generation=2&qt=/replication&wt=filestream} status=0 QTime=0 
[junit4:junit4]   2> 12624 T993 C78 P26068 REQ /replication {file=_0_Asserting_0.tip&command=filecontent&checksum=true&generation=2&qt=/replication&wt=filestream} status=0 QTime=0 
[junit4:junit4]   2> 12628 T993 C78 P26068 REQ /replication {file=_0_Block_0.tim&command=filecontent&checksum=true&generation=2&qt=/replication&wt=filestream} status=0 QTime=0 
[junit4:junit4]   2> 12632 T993 C78 P26068 REQ /replication {file=_0_MockVariableIntBlock_0.doc&command=filecontent&checksum=true&generation=2&qt=/replication&wt=filestream} status=0 QTime=0 
[junit4:junit4]   2> 12636 T993 C78 P26068 REQ /replication {file=_0_MockVariableIntBlock_0.skp&command=filecontent&checksum=true&generation=2&qt=/replication&wt=filestream} status=0 QTime=0 
[junit4:junit4]   2> 12637 T1023 C77 P26902 oash.SnapPuller$FileFetcher.fetchPackets WARNING No content recieved for file: {name=_0_MockVariableIntBlock_0.skp, lastmodified=1348219193000, size=0}
[junit4:junit4]   2> 12640 T993 C78 P26068 REQ /replication {file=_0_Asserting_0.prx&command=filecontent&checksum=true&generation=2&qt=/replication&wt=filestream} status=0 QTime=0 
[junit4:junit4]   2> 12644 T993 C78 P26068 REQ /replication {file=_0_MockVariableIntBlock_0.pyl&command=filecontent&checksum=true&generation=2&qt=/replication&wt=filestream} status=0 QTime=0 
[junit4:junit4]   2> 12645 T1023 C77 P26902 oash.SnapPuller$FileFetcher.fetchPackets WARNING No content recieved for file: {name=_0_MockVariableIntBlock_0.pyl, lastmodified=1348219193000, size=0}
[junit4:junit4]   2> 12648 T993 C78 P26068 REQ /replication {file=_0_Lucene40WithOrds_0.tii&command=filecontent&checksum=true&generation=2&qt=/replication&wt=filestream} status=0 QTime=0 
[junit4:junit4]   2> 12651 T993 C78 P26068 REQ /replication {file=_0_Lucene40WithOrds_0.frq&command=filecontent&checksum=true&generation=2&qt=/replication&wt=filestream} status=0 QTime=0 
[junit4:junit4]   2> 12655 T993 C78 P26068 REQ /replication {file=_0_MockVariableIntBlock_0.tib&command=filecontent&checksum=true&generation=2&qt=/replication&wt=filestream} status=0 QTime=0 
[junit4:junit4]   2> 12659 T993 C78 P26068 REQ /replication {file=_0_MockVariableIntBlock_0.pos&command=filecontent&checksum=true&generation=2&qt=/replication&wt=filestream} status=0 QTime=0 
[junit4:junit4]   2> 12663 T993 C78 P26068 REQ /replication {file=_0.si&command=filecontent&checksum=true&generation=2&qt=/replication&wt=filestream} status=0 QTime=0 
[junit4:junit4]   2> 12667 T993 C78 P26068 REQ /replication {file=_0_Lucene40WithOrds_0.tib&command=filecontent&checksum=true&generation=2&qt=/replication&wt=filestream} status=0 QTime=0 
[junit4:junit4]   2> 12671 T993 C78 P26068 REQ /replication {file=_0_MockVariableIntBlock_0.tii&command=filecontent&checksum=true&generation=2&qt=/replication&wt=filestream} status=0 QTime=0 
[junit4:junit4]   2> 12675 T993 C78 P26068 REQ /replication {file=_0_Block_0.doc&command=filecontent&checksum=true&generation=2&qt=/replication&wt=filestream} status=0 QTime=0 
[junit4:junit4]   2> 12679 T993 C78 P26068 REQ /replication {file=_0.fnm&command=filecontent&checksum=true&generation=2&qt=/replication&wt=filestream} status=0 QTime=0 
[junit4:junit4]   2> 12683 T993 C78 P26068 REQ /replication {file=_0_nrm.cfs&command=filecontent&checksum=true&generation=2&qt=/replication&wt=filestream} status=0 QTime=0 
[junit4:junit4]   2> 12686 T993 C78 P26068 REQ /replication {file=_0_Asserting_0.frq&command=filecontent&checksum=true&generation=2&qt=/replication&wt=filestream} status=0 QTime=0 
[junit4:junit4]   2> 12690 T993 C78 P26068 REQ /replication {file=_0_MockVariableIntBlock_0.frq&command=filecontent&checksum=true&generation=2&qt=/replication&wt=filestream} status=0 QTime=0 
[junit4:junit4]   2> 12693 T993 C78 P26068 REQ /replication {file=_0_nrm.cfe&command=filecontent&checksum=true&generation=2&qt=/replication&wt=filestream} status=0 QTime=0 
[junit4:junit4]   2> 12697 T993 C78 P26068 REQ /replication {file=segments_2&command=filecontent&checksum=true&generation=2&qt=/replication&wt=filestream} status=0 QTime=0 
[junit4:junit4]   2> 12700 T993 C78 P26068 REQ /replication {file=_0.fdx&command=filecontent&checksum=true&generation=2&qt=/replication&wt=filestream} status=0 QTime=0 
[junit4:junit4]   2> 12704 T993 C78 P26068 REQ /replication {file=_0_Lucene40WithOrds_0.prx&command=filecontent&checksum=true&generation=2&qt=/replication&wt=filestream} status=0 QTime=0 
[junit4:junit4]   2> 12708 T993 C78 P26068 REQ /replication {file=_0.fdt&command=filecontent&checksum=true&generation=2&qt=/replication&wt=filestream} status=0 QTime=0 
[junit4:junit4]   2> 12708 T963 oascc.ZkStateReader.updateClusterState Updating cloud state from ZooKeeper... 
[junit4:junit4]   2> 12709 T1023 C77 P26902 oash.SnapPuller.fetchLatestIndex Total time taken for download : 0 secs
[junit4:junit4]   2> 12715 T1023 C77 P26902 oash.SnapPuller.modifyIndexProps New index installed. Updating index properties... index=index.20120921191953261
[junit4:junit4]   2> 12716 T1023 C77 P26902 oasu.DefaultSolrCoreState.newIndexWriter Creating new IndexWriter...
[junit4:junit4]   2> 12716 T1023 C77 P26902 oasu.DefaultSolrCoreState.newIndexWriter Waiting until IndexWriter is unused... core=collection1
[junit4:junit4]   2> 12716 T1023 C77 P26902 oasu.DefaultSolrCoreState.newIndexWriter Rollback old IndexWriter... core=collection1
[junit4:junit4]   2> 12719 T1023 C77 P26902 oasc.SolrCore.getNewIndexDir WARNING New index directory detected: old=./org.apache.solr.cloud.BasicDistributedZk2Test-1348219180664/jetty3/index/ new=./org.apache.solr.cloud.BasicDistributedZk2Test-1348219180664/jetty3/index.20120921191953261
[junit4:junit4]   2> 12720 T1023 C77 P26902 oasc.CachingDirectoryFactory.get return new directory for /usr/home/hudson/hudson-slave/workspace/Lucene-Solr-Tests-4.x-Java6/solr/build/solr-core/test/J1/./org.apache.solr.cloud.BasicDistributedZk2Test-1348219180664/jetty3/index.20120921191953261 forceNew:true
[junit4:junit4]   2> 12732 T1023 C77 P26902 oasc.SolrDeletionPolicy.onInit SolrDeletionPolicy.onInit: commits:num=1
[junit4:junit4]   2> 		commit{dir=NRTCachingDirectory(org.apache.lucene.store.NIOFSDirectory@/usr/home/hudson/hudson-slave/workspace/Lucene-Solr-Tests-4.x-Java6/solr/build/solr-core/test/J1/org.apache.solr.cloud.BasicDistributedZk2Test-1348219180664/jetty3/index.20120921191953261 lockFactory=org.apache.lucene.store.NativeFSLockFactory@377f6927; maxCacheMB=48.0 maxMergeSizeMB=4.0),segFN=segments_2,generation=2,filenames=[_0_Asserting_0.tim, _0_Block_0.pos, _0_Block_0.tip, _0_Asserting_0.tip, _0_Block_0.tim, _0_MockVariableIntBlock_0.doc, _0_MockVariableIntBlock_0.skp, _0_Asserting_0.prx, _0_MockVariableIntBlock_0.pyl, _0_Lucene40WithOrds_0.tii, _0_Lucene40WithOrds_0.frq, _0_MockVariableIntBlock_0.tib, _0_MockVariableIntBlock_0.pos, _0.si, _0_Lucene40WithOrds_0.tib, _0_MockVariableIntBlock_0.tii, _0.fnm, _0_Block_0.doc, _0_nrm.cfs, _0_Asserting_0.frq, _0_nrm.cfe, _0_MockVariableIntBlock_0.frq, segments_2, _0.fdx, _0_Lucene40WithOrds_0.prx, _0.fdt]
[junit4:junit4]   2> 12732 T1023 C77 P26902 oasc.SolrDeletionPolicy.updateCommits newest commit = 2
[junit4:junit4]   2> 12732 T1023 C77 P26902 oasu.DefaultSolrCoreState.newIndexWriter New IndexWriter is ready to be used.
[junit4:junit4]   2> 12735 T1023 C77 P26902 oass.SolrIndexSearcher.<init> Opening Searcher@de35f6e main
[junit4:junit4]   2> 12737 T1022 oasc.SolrCore.registerSearcher [collection1] Registered new searcher Searcher@de35f6e main{StandardDirectoryReader(segments_2:3:nrt _0(4.0.0.2):C1)}
[junit4:junit4]   2> 12737 T1022 oasc.CachingDirectoryFactory.close Closing directory:/usr/home/hudson/hudson-slave/workspace/Lucene-Solr-Tests-4.x-Java6/solr/build/solr-core/test/J1/./org.apache.solr.cloud.BasicDistributedZk2Test-1348219180664/jetty3/index
[junit4:junit4]   2> 12737 T1022 oash.SnapPuller$2.onClose removing old index directory ./org.apache.solr.cloud.BasicDistributedZk2Test-1348219180664/jetty3/index
[junit4:junit4]   2> 12738 T1023 C77 P26902 oasu.DirectUpdateHandler2.commit start commit{flags=0,_version_=0,optimize=false,openSearcher=false,waitSearcher=false,expungeDeletes=false,softCommit=false}
[junit4:junit4]   2> 12739 T1023 C77 P26902 oasu.DirectUpdateHandler2.commit end_commit_flush
[junit4:junit4]   2> 12739 T1023 C77 P26902 oasc.RecoveryStrategy.replay Replaying buffered documents. core=collection1
[junit4:junit4]   2> 12739 T1046 C77 P26902 oasu.UpdateLog$LogReplayer.doReplay WARNING Starting log replay tlog{file=./org.apache.solr.cloud.BasicDistributedZk2Test-1348219180664/jetty3/tlog/tlog.0000000000000000000 refcount=2} active=true starting pos=429
[junit4:junit4]   2> 12740 T1046 C77 P26902 oasu.DirectUpdateHandler2.commit start commit{flags=2,_version_=0,optimize=false,openSearcher=true,waitSearcher=true,expungeDeletes=false,softCommit=false}
[junit4:junit4]   2> 12741 T1046 C77 P26902 oass.SolrIndexSearcher.<init> Opening Searcher@4894cbaa main
[junit4:junit4]   2> 12741 T1046 C77 P26902 oasu.DirectUpdateHandler2.commit end_commit_flush
[junit4:junit4]   2> 12742 T1022 oasc.SolrCore.registerSearcher [collection1] Registered new searcher Searcher@4894cbaa main{StandardDirectoryReader(segments_2:3:nrt _0(4.0.0.2):C1)}
[junit4:junit4]   2> 12743 T1046 C77 P26902 oasu.UpdateLog$LogReplayer.run WARNING Log replay finished. recoveryInfo=RecoveryInfo{adds=0 deletes=0 deleteByQuery=0 errors=0 positionOfStart=429}
[junit4:junit4]   2> 12743 T1023 C77 P26902 oasc.RecoveryStrategy.doRecovery Replication Recovery was successful - registering as Active. core=collection1
[junit4:junit4]   2> 12744 T1023 C77 P26902 oasc.RecoveryStrategy.doRecovery Finished recovery process. core=collection1
[junit4:junit4]   2> 13030 T984 oascc.ZkStateReader.updateClusterState Updating cloud state from ZooKeeper... 
[junit4:junit4]   2> 13044 T997 oascc.ZkStateReader$2.process A cluster state change has occurred - updating...
[junit4:junit4]   2> 13044 T1035 oascc.ZkStateReader$2.process A cluster state change has occurred - updating...
[junit4:junit4]   2> 13044 T1009 oascc.ZkStateReader$2.process A cluster state change has occurred - updating...
[junit4:junit4]   2> 13044 T1042 oascc.ZkStateReader$2.process A cluster state change has occurred - updating...
[junit4:junit4]   2> 13044 T1021 oascc.ZkStateReader$2.process A cluster state change has occurred - updating...
[junit4:junit4]   2> 13044 T983 oascc.ZkStateReader$2.process A cluster state change has occurred - updating...
[junit4:junit4]   2> 13044 T1040 oascc.ZkStateReader$2.process A cluster state change has occurred - updating...
[junit4:junit4]   2> 13710 T963 oascc.ZkStateReader.updateClusterState Updating cloud state from ZooKeeper... 
[junit4:junit4]   2>  C79_STATE=coll:collection1 core:collection1 props:{shard=shard2, roles=null, state=recovering, core=collection1, collection=collection1, node_name=127.0.0.1:37575_solr, base_url=http://127.0.0.1:37575/solr}
[junit4:junit4]   2> 14640 T1037 C79 P37575 oasc.RecoveryStrategy.doRecovery Begin buffering updates. core=collection1
[junit4:junit4]   2> 14640 T1037 C79 P37575 oasu.UpdateLog.bufferUpdates Starting to buffer updates. FSUpdateLog{state=ACTIVE, tlog=null}
[junit4:junit4]   2> 14640 T1037 C79 P37575 oasc.RecoveryStrategy.replicate Attempting to replicate from http://127.0.0.1:43614/solr/collection1/. core=collection1
[junit4:junit4]   2> 14640 T1037 C79 P37575 oascsi.HttpClientUtil.createClient Creating new http client, config:maxConnections=128&maxConnectionsPerHost=32&followRedirects=false
[junit4:junit4]   2> 14654 T1004 C80 P43614 oasu.DirectUpdateHandler2.commit start commit{flags=0,_version_=0,optimize=false,openSearcher=true,waitSearcher=true,expungeDeletes=false,softCommit=false}
[junit4:junit4]   2> 14659 T1004 C80 P43614 oasc.SolrDeletionPolicy.onInit SolrDeletionPolicy.onInit: commits:num=1
[junit4:junit4]   2> 		commit{dir=NRTCachingDirectory(org.apache.lucene.store.NIOFSDirectory@/usr/home/hudson/hudson-slave/workspace/Lucene-Solr-Tests-4.x-Java6/solr/build/solr-core/test/J1/org.apache.solr.cloud.BasicDistributedZk2Test-1348219180664/jetty2/index lockFactory=org.apache.lucene.store.NativeFSLockFactory@78970e4; maxCacheMB=48.0 maxMergeSizeMB=4.0),segFN=segments_1,generation=1,filenames=[segments_1]
[junit4:junit4]   2> 14659 T1004 C80 P43614 oasc.SolrDeletionPolicy.updateCommits newest commit = 1
[junit4:junit4]   2> 14661 T1004 C80 P43614 oass.SolrIndexSearcher.<init> Opening Searcher@404043cb main
[junit4:junit4]   2> 14661 T1004 C80 P43614 oasu.DirectUpdateHandler2.commit end_commit_flush
[junit4:junit4]   2> 14663 T1010 oasc.SolrCore.registerSearcher [collection1] Registered new searcher Searcher@404043cb main{StandardDirectoryReader(segments_1:1)}
[junit4:junit4]   2> 14663 T1004 C80 P43614 /update {waitSearcher=true&commit=true&commit_end_point=true&wt=javabin&softCommit=false&version=2} {commit=} 0 9
[junit4:junit4]   2> 14664 T1037 C79 P37575 oash.ReplicationHandler.inform Commits will be reserved for  10000
[junit4:junit4]   2> 14664 T1037 C79 P37575 oash.SnapPuller.<init>  No value set for 'pollInterval'. Timer Task not started.
[junit4:junit4]   2> 14666 T1005 C80 P43614 oash.ReplicationHandler.inform Commits will be reserved for  10000
[junit4:junit4]   2> 14666 T1005 C80 P43614 REQ /replication {command=indexversion&wt=javabin&qt=/replication&version=2} status=0 QTime=1 
[junit4:junit4]   2> 14670 T1037 C79 P37575 oasc.SolrDeletionPolicy.onInit SolrDeletionPolicy.onInit: commits:num=1
[junit4:junit4]   2> 		commit{dir=NRTCachingDirectory(org.apache.lucene.store.NIOFSDirectory@/usr/home/hudson/hudson-slave/workspace/Lucene-Solr-Tests-4.x-Java6/solr/build/solr-core/test/J1/org.apache.solr.cloud.BasicDistributedZk2Test-1348219180664/jetty4/index lockFactory=org.apache.lucene.store.NativeFSLockFactory@4c60f78a; maxCacheMB=48.0 maxMergeSizeMB=4.0),segFN=segments_1,generation=1,filenames=[segments_1]
[junit4:junit4]   2> 14671 T1037 C79 P37575 oasc.SolrDeletionPolicy.updateCommits newest commit = 1
[junit4:junit4]   2> 14671 T1037 C79 P37575 oasu.DirectUpdateHandler2.commit start commit{flags=0,_version_=0,optimize=false,openSearcher=true,waitSearcher=true,expungeDeletes=false,softCommit=false}
[junit4:junit4]   2> 14692 T1037 C79 P37575 oasc.SolrDeletionPolicy.onCommit SolrDeletionPolicy.onCommit: commits:num=2
[junit4:junit4]   2> 		commit{dir=NRTCachingDirectory(org.apache.lucene.store.NIOFSDirectory@/usr/home/hudson/hudson-slave/workspace/Lucene-Solr-Tests-4.x-Java6/solr/build/solr-core/test/J1/org.apache.solr.cloud.BasicDistributedZk2Test-1348219180664/jetty4/index lockFactory=org.apache.lucene.store.NativeFSLockFactory@4c60f78a; maxCacheMB=48.0 maxMergeSizeMB=4.0),segFN=segments_1,generation=1,filenames=[segments_1]
[junit4:junit4]   2> 		commit{dir=NRTCachingDirectory(org.apache.lucene.store.NIOFSDirectory@/usr/home/hudson/hudson-slave/workspace/Lucene-Solr-Tests-4.x-Java6/solr/build/solr-core/test/J1/org.apache.solr.cloud.BasicDistributedZk2Test-1348219180664/jetty4/index lockFactory=org.apache.lucene.store.NativeFSLockFactory@4c60f78a; maxCacheMB=48.0 maxMergeSizeMB=4.0),segFN=segments_2,generation=2,filenames=[segments_2]
[junit4:junit4]   2> 14692 T1037 C79 P37575 oasc.SolrDeletionPolicy.updateCommits newest commit = 2
[junit4:junit4]   2> 14695 T1037 C79 P37575 oass.SolrIndexSearcher.<init> Opening Searcher@44c35441 main
[junit4:junit4]   2> 14696 T1037 C79 P37575 oasu.DirectUpdateHandler2.commit end_commit_flush
[junit4:junit4]   2> 14697 T1036 oasc.SolrCore.registerSearcher [collection1] Registered new searcher Searcher@44c35441 main{StandardDirectoryReader(segments_2:2)}
[junit4:junit4]   2> 14698 T1037 C79 P37575 oasc.RecoveryStrategy.replay No replay needed. core=collection1
[junit4:junit4]   2> 14698 T1037 C79 P37575 oasc.RecoveryStrategy.doRecovery Replication Recovery was successful - registering as Active. core=collection1
[junit4:junit4]   2> 14699 T1037 C79 P37575 oasc.RecoveryStrategy.doRecovery Finished recovery process. core=collection1
[junit4:junit4]   2> 14712 T963 oascc.ZkStateReader.updateClusterState Updating cloud state from ZooKeeper... 
[junit4:junit4]   2> 15055 T984 oascc.ZkStateReader.updateClusterState Updating cloud state from ZooKeeper... 
[junit4:junit4]   2> 15147 T1035 oascc.ZkStateReader$2.process A cluster state change has occurred - updating...
[junit4:junit4]   2> 15147 T997 oascc.ZkStateReader$2.process A cluster state change has occurred - updating...
[junit4:junit4]   2> 15148 T1021 oascc.ZkStateReader$2.process A cluster state change has occurred - updating...
[junit4:junit4]   2> 15148 T1042 oascc.ZkStateReader$2.process A cluster state change has occurred - updating...
[junit4:junit4]   2> 15148 T1009 oascc.ZkStateReader$2.process A cluster state change has occurred - updating...
[junit4:junit4]   2> 15147 T1040 oascc.ZkStateReader$2.process A cluster state change has occurred - updating...
[junit4:junit4]   2> 15147 T983 oascc.ZkStateReader$2.process A cluster state change has occurred - updating...
[junit4:junit4]   2> 15714 T963 oascc.ZkStateReader.updateClusterState Updating cloud state from ZooKeeper... 
[junit4:junit4]   2> 15717 T975 C81 P62552 oasu.DirectUpdateHandler2.commit start commit{flags=0,_version_=0,optimize=false,openSearcher=true,waitSearcher=true,expungeDeletes=false,softCommit=false}
[junit4:junit4]   2> 15805 T975 C81 P62552 oasc.SolrDeletionPolicy.onCommit SolrDeletionPolicy.onCommit: commits:num=2
[junit4:junit4]   2> 		commit{dir=NRTCachingDirectory(org.apache.lucene.store.NIOFSDirectory@/usr/home/hudson/hudson-slave/workspace/Lucene-Solr-Tests-4.x-Java6/solr/build/solr-core/test/J1/org.apache.solr.cloud.BasicDistributedZk2Test-1348219180664/control/data/index lockFactory=org.apache.lucene.store.NativeFSLockFactory@646a91fd; maxCacheMB=48.0 maxMergeSizeMB=4.0),segFN=segments_1,generation=1,filenames=[segments_1]
[junit4:junit4]   2> 		commit{dir=NRTCachingDirectory(org.apache.lucene.store.NIOFSDirectory@/usr/home/hudson/hudson-slave/workspace/Lucene-Solr-Tests-4.x-Java6/solr/build/solr-core/test/J1/org.apache.solr.cloud.BasicDistributedZk2Test-1348219180664/control/data/index lockFactory=org.apache.lucene.store.NativeFSLockFactory@646a91fd; maxCacheMB=48.0 maxMergeSizeMB=4.0),segFN=segments_2,generation=2,filenames=[_0_Asserting_0.tim, _0_Block_0.tip, _0_Block_0.pos, _0_Asserting_0.tip, _0_MockVariableIntBlock_0.doc, _0_Block_0.tim, _0_MockVariableIntBlock_0.skp, _0_Asserting_0.prx, _0_MockVariableIntBlock_0.pyl, _0_Lucene40WithOrds_0.tii, _0_Lucene40WithOrds_0.frq, _0_MockVariableIntBlock_0.tib, _0_MockVariableIntBlock_0.pos, _0.si, _0_Lucene40WithOrds_0.tib, _0_MockVariableIntBlock_0.tii, _0.fnm, _0_Block_0.doc, _0_nrm.cfs, _0_Asserting_0.frq, _0_nrm.cfe, _0_MockVariableIntBlock_0.frq, segments_2, _0.fdx, _0_Lucene40WithOrds_0.prx, _0.fdt]
[junit4:junit4]   2> 15806 T975 C81 P62552 oasc.SolrDeletionPolicy.updateCommits newest commit = 2
[junit4:junit4]   2> 15824 T975 C81 P62552 oass.SolrIndexSearcher.<init> Opening Searcher@57656923 main
[junit4:junit4]   2> 15825 T975 C81 P62552 oasu.DirectUpdateHandler2.commit end_commit_flush
[junit4:junit4]   2> 15826 T986 oasc.SolrCore.registerSearcher [collection1] Registered new searcher Searcher@57656923 main{StandardDirectoryReader(segments_2:3 _0(4.0.0.2):C1)}
[junit4:junit4]   2> 15826 T975 C81 P62552 /update {waitSearcher=true&wt=javabin&commit=true&softCommit=false&version=2} {commit=} 0 109
[junit4:junit4]   2> 15828 T994 C78 P26068 oasu.DirectUpdateHandler2.commit start commit{flags=0,_version_=0,optimize=false,openSearcher=true,waitSearcher=true,expungeDeletes=false,softCommit=false}
[junit4:junit4]   2> 15839 T994 C78 P26068 oass.SolrIndexSearcher.<init> Opening Searcher@476f1e97 main
[junit4:junit4]   2> 15840 T994 C78 P26068 oasu.DirectUpdateHandler2.commit end_commit_flush
[junit4:junit4]   2> 15841 T998 oasc.SolrCore.registerSearcher [collection1] Registered new searcher Searcher@476f1e97 main{StandardDirectoryReader(segments_2:3 _0(4.0.0.2):C1)}
[junit4:junit4]   2> 15842 T994 C78 P26068 oasu.SolrCmdDistributor.distribCommit Distrib commit to:[StdNode: http://127.0.0.1:26902/solr/collection1/, StdNode: http://127.0.0.1:43614/solr/collection1/, StdNode: http://127.0.0.1:37575/solr/collection1/]
[junit4:junit4]   2> 15844 T1006 C80 P43614 oasu.DirectUpdateHandler2.commit start commit{flags=0,_version_=0,optimize=false,openSearcher=true,waitSearcher=true,expungeDeletes=false,softCommit=false}
[junit4:junit4]   2>  C77_STATE=coll:collection1 core:collection1 props:{shard=shard1, roles=null, state=active, core=collection1, collection=collection1, node_name=127.0.0.1:26902_solr, base_url=http://127.0.0.1:26902/solr}
[junit4:junit4]   2> 15844 T1013 C77 P26902 oasu.DirectUpdateHandler2.commit start commit{flags=0,_version_=0,optimize=false,openSearcher=true,waitSearcher=true,expungeDeletes=false,softCommit=false}
[junit4:junit4]   2> 15848 T1013 C77 P26902 oass.SolrIndexSearcher.<init> Opening Searcher@836006d main
[junit4:junit4]   2> 15848 T1013 C77 P26902 oasu.DirectUpdateHandler2.commit end_commit_flush
[junit4:junit4]   2> 15848 T1006 C80 P43614 oass.SolrIndexSearcher.<init> Opening Searcher@232196bb main
[junit4:junit4]   2> 15849 T1006 C80 P43614 oasu.DirectUpdateHandler2.commit end_commit_flush
[junit4:junit4]   2> 15850 T1022 oasc.SolrCore.registerSearcher [collection1] Registered new searcher Searcher@836006d main{StandardDirectoryReader(segments_2:3:nrt _0(4.0.0.2):C1)}
[junit4:junit4]   2> 15850 T1013 C77 P26902 /update {waitSearcher=true&commit=true&wt=javabin&commit_end_point=true&expungeDeletes=false&softCommit=false&version=2} {commit=} 0 6
[junit4:junit4]   2> 15850 T1010 oasc.SolrCore.registerSearcher [collection1] Registered new searcher Searcher@232196bb main{StandardDirectoryReader(segments_1:1)}
[junit4:junit4]   2> 15851 T1006 C80 P43614 /update {waitSearcher=true&commit=true&wt=javabin&commit_end_point=true&expungeDeletes=false&softCommit=false&version=2} {commit=} 0 7
[junit4:junit4]   2>  C79_STATE=coll:collection1 core:collection1 props:{shard=shard2, roles=null, state=active, core=collection1, collection=collection1, node_name=127.0.0.1:37575_solr, base_url=http://127.0.0.1:37575/solr}
[junit4:junit4]   2> 15852 T1027 C79 P37575 oasu.DirectUpdateHandler2.commit start commit{flags=0,_version_=0,optimize=false,openSearcher=true,waitSearcher=true,expungeDeletes=false,softCommit=false}
[junit4:junit4]   2> 15922 T1027 C79 P37575 oass.SolrIndexSearcher.<init> Opening Searcher@48c08ea5 main
[junit4:junit4]   2> 15923 T1027 C79 P37575 oasu.DirectUpdateHandler2.commit end_commit_flush
[junit4:junit4]   2> 15924 T1036 oasc.SolrCore.registerSearcher [collection1] Registered new searcher Searcher@48c08ea5 main{StandardDirectoryReader(segments_2:2)}
[junit4:junit4]   2> 15925 T1027 C79 P37575 /update {waitSearcher=true&commit=true&wt=javabin&commit_end_point=true&expungeDeletes=false&softCommit=false&version=2} {commit=} 0 73
[junit4:junit4]   2> 15926 T994 C78 P26068 /update {waitSearcher=true&wt=javabin&commit=true&softCommit=false&version=2} {commit=} 0 98
[junit4:junit4]   2> 15931 T976 C81 P62552 REQ /select {fl=id,score&shard.url=127.0.0.1:62552/solr/collection1/&NOW=1348219196586&start=0&q=*:*&distrib=false&isShard=true&wt=javabin&fsv=true&rows=10&version=2} hits=1 status=0 QTime=0 
[junit4:junit4]   2> 15934 T976 C81 P62552 REQ /select {shard.url=127.0.0.1:62552/solr/collection1/&NOW=1348219196586&q=*:*&ids=1&distrib=false&isShard=true&wt=javabin&version=2} status=0 QTime=0 
[junit4:junit4]   2> 15935 T975 C81 P62552 REQ /select {wt=javabin&q=*:*&version=2} hits=1 status=0 QTime=7 
[junit4:junit4]   2> 15936 T963 oaz.ZooKeeper.<init> Initiating client connection, connectString=127.0.0.1:11507/solr sessionTimeout=10000 watcher=org.apache.solr.common.cloud.ConnectionManager@33baf8cf
[junit4:junit4]   2> 15937 T1050 oaz.ClientCnxn$SendThread.startConnect Opening socket connection to server /127.0.0.1:11507
[junit4:junit4]   2> 15937 T963 oascc.ConnectionManager.waitForConnected Waiting for client to connect to ZooKeeper
[junit4:junit4]   2> 15938 T1050 oaz.ClientCnxn$SendThread.primeConnection Socket connection established to localhost/127.0.0.1:11507, initiating session
[junit4:junit4]   2> 15938 T965 oazs.NIOServerCnxn$Factory.run Accepted socket connection from /140.211.11.196:59314
[junit4:junit4]   2> 15939 T965 oazs.NIOServerCnxn.readConnectRequest Client attempting to establish new session at /140.211.11.196:59314
[junit4:junit4]   2> 15940 T967 oazs.NIOServerCnxn.finishSessionInit Established session 0x139e820167c0009 with negotiated timeout 10000 for client /140.211.11.196:59314
[junit4:junit4]   2> 15941 T1050 oaz.ClientCnxn$SendThread.readConnectResult Session establishment complete on server localhost/127.0.0.1:11507, sessionid = 0x139e820167c0009, negotiated timeout = 10000
[junit4:junit4]   2> 15941 T1051 oascc.ConnectionManager.process Watcher org.apache.solr.common.cloud.ConnectionManager@33baf8cf name:ZooKeeperConnection Watcher:127.0.0.1:11507/solr got event WatchedEvent state:SyncConnected type:None path:null path:null type:None
[junit4:junit4]   2> 15941 T963 oascc.ConnectionManager.waitForConnected Client is connected to ZooKeeper
[junit4:junit4]   2> 15942 T963 oascc.ZkStateReader.createClusterStateWatchersAndUpdate Updating cluster state from ZooKeeper... 
[junit4:junit4]   2> 15944 T968 oazs.PrepRequestProcessor.pRequest Processed session termination for sessionid: 0x139e820167c0009
[junit4:junit4]   2> 15953 T1051 oaz.ClientCnxn$EventThread.run EventThread shut down
[junit4:junit4]   2> 15953 T965 oazs.NIOServerCnxn.closeSock Closed socket connection for client /140.211.11.196:59314 which had sessionid 0x139e820167c0009
[junit4:junit4]   2> 15952 T963 oaz.ZooKeeper.close Session: 0x139e820167c0009 closed
[junit4:junit4]   2> 15955 T995 C78 P26068 REQ /select {distrib=false&wt=javabin&q=*:*&version=2} hits=1 status=0 QTime=0 
[junit4:junit4]   2> 15957 T1007 C80 P43614 REQ /select {distrib=false&wt=javabin&q=*:*&version=2} hits=0 status=0 QTime=0 
[junit4:junit4]   2> 15963 T1014 C77 P26902 REQ /select {fl=id,score&shard.url=127.0.0.1:26068/solr/collection1/|127.0.0.1:26902/solr/collection1/&NOW=1348219196618&start=0&q=*:*&distrib=false&isShard=true&wt=javabin&fsv=true&rows=10&version=2} hits=1 status=0 QTime=0 
[junit4:junit4]   2> 15963 T1002 C80 P43614 REQ /select {fl=id,score&shard.url=127.0.0.1:43614/solr/collection1/|127.0.0.1:37575/solr/collection1/&NOW=1348219196618&start=0&q=*:*&distrib=false&isShard=true&wt=javabin&fsv=true&rows=10&version=2} hits=0 status=0 QTime=0 
[junit4:junit4]   2> 15966 T1014 C77 P26902 REQ /select {shard.url=127.0.0.1:26068/solr/collection1/|127.0.0.1:26902/solr/collection1/&NOW=1348219196618&q=*:*&ids=1&distrib=false&isShard=true&wt=javabin&version=2} status=0 QTime=0 
[junit4:junit4]   2> 15967 T994 C78 P26068 REQ /select {wt=javabin&q=*:*&version=2} hits=1 status=0 QTime=7 
[junit4:junit4]   2> 15973 T975 C81 P62552 /update {wt=javabin&version=2} {add=[2 (1413710292323401728)]} 0 3
[junit4:junit4]   2> 15986 T1027 C79 P37575 REQ /update {update.distrib=FROMLEADER&distrib.from=http://127.0.0.1:43614/solr/collection1/&wt=javabin&version=2} status=0 QTime=3 
[junit4:junit4]   2> 15987 T1006 C80 P43614 REQ /update {distrib.from=http://127.0.0.1:26068/solr/collection1/&update.distrib=TOLEADER&wt=javabin&version=2} status=0 QTime=9 
[junit4:junit4]   2> 15987 T994 C78 P26068 /update {wt=javabin&version=2} {add=[2]} 0 11
[junit4:junit4]   2> 15991 T975 C81 P62552 /update {wt=javabin&version=2} {add=[3 (1413710292344373248)]} 0 1
[junit4:junit4]   2> 15997 T1027 C79 P37575 REQ /update {distrib.from=http://127.0.0.1:43614/solr/collection1/&update.distrib=FROMLEADER&wt=javabin&version=2} status=0 QTime=1 
[junit4:junit4]   2> 15997 T1003 C80 P43614 /update {wt=javabin&version=2} {add=[3 (1413710292347518976)]} 0 4
[junit4:junit4]   2> 16001 T975 C81 P62552 /update {wt=javabin&version=2} {add=[4 (1413710292354859008)]} 0 1
[junit4:junit4]   2> 16012 T1013 C77 P26902 REQ /update {distrib.from=http://127.0.0.1:26068/solr/collection1/&update.distrib=FROMLEADER&wt=javabin&version=2} status=0 QTime=3 
[junit4:junit4]   2> 16012 T994 C78 P26068 /update {wt=javabin&version=2} {add=[4 (1413710292359053312)]} 0 8
[junit4:junit4]   2> 16016 T975 C81 P62552 /update {wt=javabin&version=2} {add=[5 (1413710292370587648)]} 0 1
[junit4:junit4]   2> 16025 T1027 C79 P37575 REQ /update {update.distrib=FROMLEADER&distrib.from=http://127.0.0.1:43614/solr/collection1/&wt=javabin&version=2} status=0 QTime=1 
[junit4:junit4]   2> 16026 T1006 C80 P43614 REQ /update {distrib.from=http://127.0.0.1:26068/solr/collection1/&update.distrib=TOLEADER&wt=javabin&version=2} status=0 QTime=6 
[junit4:junit4]   2> 16026 T994 C78 P26068 /update {wt=javabin&version=2} {add=[5]} 0 8
[junit4:junit4]   2> 16030 T975 C81 P62552 /update {wt=javabin&version=2} {add=[6 (1413710292385267712)]} 0 1
[junit4:junit4]   2> 16037 T1027 C79 P37575 REQ /update {distrib.from=http://127.0.0.1:43614/solr/collection1/&update.distrib=FROMLEADER&wt=javabin&version=2} status=0 QTime=1 
[junit4:junit4]   2> 16037 T1003 C80 P43614 /update {wt=javabin&version=2} {add=[6 (1413710292389462016)]} 0 4
[junit4:junit4]   2> 16041 T975 C81 P62552 /update {wt=javabin&version=2} {add=[7 (1413710292396802048)]} 0 1
[junit4:junit4]   2> 16050 T1027 C79 P37575 REQ /update {update.distrib=FROMLEADER&distrib.from=http://127.0.0.1:43614/solr/collection1/&wt=javabin&version=2} status=0 QTime=1 
[junit4:junit4]   2> 16050 T1006 C80 P43614 REQ /update {distrib.from=http://127.0.0.1:26068/solr/collection1/&update.distrib=TOLEADER&wt=javabin&version=2} status=0 QTime=4 
[junit4:junit4]   2> 16051 T994 C78 P26068 /update {wt=javabin&version=2} {add=[7]} 0 7
[junit4:junit4]   2> 16056 T975 C81 P62552 /update {wt=javabin&version=2} {add=[8 (1413710292411482112)]} 0 2
[junit4:junit4]   2> 16062 T1013 C77 P26902 REQ /update {distrib.from=http://127.0.0.1:26068/solr/collection1/&update.distrib=FROMLEADER&wt=javabin&version=2} status=0 QTime=1 
[junit4:junit4]   2> 16063 T994 C78 P26068 /update {wt=javabin&version=2} {add=[8 (1413710292415676416)]} 0 5
[junit4:junit4]   2> 16066 T975 C81 P62552 /update {wt=javabin&version=2} {add=[9 (1413710292423016448)]} 0 1
[junit4:junit4]   2> 16073 T1027 C79 P37575 REQ /update {distrib.from=http://127.0.0.1:43614/solr/collection1/&update.distrib=FROMLEADER&wt=javabin&version=2} status=0 QTime=1 
[junit4:junit4]   2> 16073 T1003 C80 P43614 /update {wt=javabin&version=2} {add=[9 (1413710292427210752)]} 0 4
[junit4:junit4]   2> 16077 T975 C81 P62552 /update {wt=javabin&version=2} {add=[10 (1413710292434550784)]} 0 1
[junit4:junit4]   2> 16086 T1013 C77 P26902 REQ /update {update.distrib=FROMLEADER&distrib.from=http://127.0.0.1:26068/solr/collection1/&wt=javabin&version=2} status=0 QTime=1 
[junit4:junit4]   2> 16087 T991 C78 P26068 REQ /update {distrib.from=http://127.0.0.1:43614/solr/collection1/&update.distrib=TOLEADER&wt=javabin&version=2} status=0 QTime=6 
[junit4:junit4]   2> 16087 T1003 C80 P43614 /update {wt=javabin&version=2} {add=[10]} 0 8
[junit4:junit4]   2> 16106 T975 C81 P62552 /update {wt=javabin&version=2} {add=[11 (1413710292449230848)]} 0 16
[junit4:junit4]   2> 16113 T1013 C77 P26902 REQ /update {distrib.from=http://127.0.0.1:26068/solr/collection1/&update.distrib=FROMLEADER&wt=javabin&version=2} status=0 QTime=1 
[junit4:junit4]   2> 16114 T994 C78 P26068 /update {wt=javabin&version=2} {add=[11 (1413710292469153792)]} 0 5
[junit4:junit4]   2> 16118 T975 C81 P62552 /update {wt=javabin&version=2} {add=[12 (1413710292476493824)]} 0 2
[junit4:junit4]   2> 16125 T1013 C77 P26902 REQ /update {distrib.from=http://127.0.0.1:26068/solr/collection1/&update.distrib=FROMLEADER&wt=javabin&version=2} status=0 QTime=1 
[junit4:junit4]   2> 16126 T994 C78 P26068 /update {wt=javabin&version=2} {add=[12 (1413710292481736704)]} 0 5
[junit4:junit4]   2> 16129 T975 C81 P62552 /update {wt=javabin&version=2} {add=[13 (1413710292489076736)]} 0 1
[junit4:junit4]   2> 16139 T1013 C77 P26902 REQ /update {update.distrib=FROMLEADER&distrib.from=http://127.0.0.1:26068/solr/collection1/&wt=javabin&version=2} status=0 QTime=1 
[junit4:junit4]   2> 16140 T991 C78 P26068 REQ /update {distrib.from=http://127.0.0.1:43614/solr/collection1/&update.distrib=TOLEADER&wt=javabin&version=2} status=0 QTime=6 
[junit4:junit4]   2> 16141 T1003 C80 P43614 /update {wt=javabin&version=2} {add=[13]} 0 9
[junit4:junit4]   2> 16145 T975 C81 P62552 /update {wt=javabin&version=2} {add=[14 (1413710292505853952)]} 0 1
[junit4:junit4]   2> 16154 T1013 C77 P26902 REQ /update {update.distrib=FROMLEADER&distrib.from=http://127.0.0.1:26068/solr/collection1/&wt=javabin&version=2} status=0 QTime=1 
[junit4:junit4]   2> 16155 T991 C78 P26068 REQ /update {distrib.from=http://127.0.0.1:43614/solr/collection1/&update.distrib=TOLEADER&wt=javabin&version=2} status=0 QTime=5 
[junit4:junit4]   2> 16155 T1003 C80 P43614 /update {wt=javabin&version=2} {add=[14]} 0 8
[junit4:junit4]   2> 16159 T975 C81 P62552 /update {wt=javabin&version=2} {add=[15 (1413710292520534016)]} 0 1
[junit4:junit4]   2> 16167 T1013 C77 P26902 REQ /update {update.distrib=FROMLEADER&distrib.from=http://127.0.0.1:26068/solr/collection1/&wt=javabin&version=2} status=0 QTime=1 
[junit4:junit4]   2> 16168 T991 C78 P26068 REQ /update {distrib.from=http://127.0.0.1:43614/solr/collection1/&update.distrib=TOLEADER&wt=javabin&version=2} status=0 QTime=5 
[junit4:junit4]   2> 16168 T1003 C80 P43614 /update {wt=javabin&version=2} {add=[15]} 0 7
[junit4:junit4]   2> 16172 T975 C81 P62552 /update {wt=javabin&version=2} {add=[16 (1413710292534165504)]} 0 1
[junit4:junit4]   2> 16180 T1013 C77 P26902 REQ /update {update.distrib=FROMLEADER&distrib.from=http://127.0.0.1:26068/solr/collection1/&wt=javabin&version=2} status=0 QTime=1 
[junit4:junit4]   2> 16180 T991 C78 P26068 REQ /update {distrib.from=http://127.0.0.1:43614/solr/collection1/&update.distrib=TOLEADER&wt=javabin&version=2} status=0 QTime=4 
[junit4:junit4]   2> 16181 T1003 C80 P43614 /update {wt=javabin&version=2} {add=[16]} 0 7
[junit4:junit4]   2> 16186 T975 C81 P62552 /update {wt=javabin&version=2} {add=[17 (1413710292547796992)]} 0 2
[junit4:junit4]   2> 16195 T1027 C79 P37575 REQ /update {distrib.from=http://127.0.0.1:43614/solr/collection1/&update.distrib=FROMLEADER&wt=javabin&version=2} status=0 QTime=2 
[junit4:junit4]   2> 16196 T1003 C80 P43614 /update {wt=javabin&version=2} {add=[17 (1413710292553039872)]} 0 7
[junit4:junit4]   2> 16199 T975 C81 P62552 /update {wt=javabin&version=2} {add=[100 (1413710292562477056)]} 0 1
[junit4:junit4]   2> 16236 T1013 C77 P26902 REQ /update {update.distrib=FROMLEADER&distrib.from=http://127.0.0.1:26068/solr/collection1/&wt=javabin&version=2} status=0 QTime=15 
[junit4:junit4]   2> 16237 T991 C78 P26068 REQ /update {distrib.from=http://127.0.0.1:43614/solr/collection1/&update.distrib=TOLEADER&wt=javabin&version=2} status=0 QTime=34 
[junit4:junit4]   2> 16238 T1003 C80 P43614 /update {wt=javabin&version=2} {add=[100]} 0 37
[junit4:junit4]   2> 16242 T975 C81 P62552 /update {wt=javabin&version=2} {add=[101 (1413710292607565824)]} 0 1
[junit4:junit4]   2> 16253 T1013 C77 P26902 REQ /update {update.distrib=FROMLEADER&distrib.from=http://127.0.0.1:26068/solr/collection1/&wt=javabin&version=2} status=0 QTime=2 
[junit4:junit4]   2> 16253 T991 C78 P26068 REQ /update {distrib.from=http://127.0.0.1:43614/solr/collection1/&update.distrib=TOLEADER&wt=javabin&version=2} status=0 QTime=6 
[junit4:junit4]   2> 16254 T1003 C80 P43614 /update {wt=javabin&version=2} {add=[101]} 0 9
[junit4:junit4]   2> 16258 T975 C81 P62552 /update {wt=javabin&version=2} {add=[102 (1413710292624343040)]} 0 1
[junit4:junit4]   2> 16266 T1013 C77 P26902 REQ /update {update.distrib=FROMLEADER&distrib.from=http://127.0.0.1:26068/solr/collection1/&wt=javabin&version=2} status=0 QTime=1 
[junit4:junit4]   2> 16267 T991 C78 P26068 REQ /update {distrib.from=http://127.0.0.1:43614/solr/collection1/&update.distrib=TOLEADER&wt=javabin&version=2} status=0 QTime=5 
[junit4:junit4]   2> 16267 T1003 C80 P43614 /update {wt=javabin&version=2} {add=[102]} 0 7
[junit4:junit4]   2> 16287 T975 C81 P62552 /update {wt=javabin&version=2} {add=[103 (1413710292637974528)]} 0 17
[junit4:junit4]   2> 16296 T1027 C79 P37575 REQ /update {update.distrib=FROMLEADER&distrib.from=http://127.0.0.1:43614/solr/collection1/&wt=javabin&version=2} status=0 QTime=1 
[junit4:junit4]   2> 16297 T1006 C80 P43614 REQ /update {distrib.from=http://127.0.0.1:26068/solr/collection1/&update.distrib=TOLEADER&wt=javabin&version=2} status=0 QTime=6 
[junit4:junit4]   2> 16298 T994 C78 P26068 /update {wt=javabin&version=2} {add=[103]} 0 9
[junit4:junit4]   2> 16302 T975 C81 P62552 /update {wt=javabin&version=2} {add=[104 (1413710292669431808)]} 0 2
[junit4:junit4]   2> 16308 T1027 C79 P37575 REQ /update {distrib.from=http://127.0.0.1:43614/solr/collection1/&update.distrib=FROMLEADER&wt=javabin&version=2} status=0 QTime=1 
[junit4:junit4]   2> 16308 T1003 C80 P43614 /update {wt=javabin&version=2} {add=[104 (1413710292673626112)]} 0 4
[junit4:junit4]   2> 16312 T975 C81 P62552 /update {wt=javabin&version=2} {add=[105 (1413710292680966144)]} 0 1
[junit4:junit4]   2> 16361 T1027 C79 P37575 REQ /update {update.distrib=FROMLEADER&distrib.from=http://127.0.0.1:43614/solr/collection1/&wt=javabin&version=2} status=0 QTime=17 
[junit4:junit4]   2> 16362 T1006 C80 P43614 REQ /update {distrib.from=http://127.0.0.1:26068/solr/collection1/&update.distrib=TOLEADER&wt=javabin&version=2} status=0 QTime=45 
[junit4:junit4]   2> 16363 T994 C78 P26068 /update {wt=javabin&version=2} {add=[105]} 0 49
[junit4:junit4]   2> 16366 T975 C81 P62552 /update {wt=javabin&version=2} {add=[106 (1413710292737589248)]} 0 1
[junit4:junit4]   2> 16375 T1027 C79 P37575 REQ /update {distrib.from=http://127.0.0.1:43614/solr/collection1/&update.distrib=FROMLEADER&wt=javabin&version=2} status=0 QTime=2 
[junit4:junit4]   2> 16375 T1003 C80 P43614 /update {wt=javabin&version=2} {add=[106 (1413710292741783552)]} 0 6
[junit4:junit4]   2> 16379 T975 C81 P62552 /update {wt=javabin&version=2} {add=[107 (1413710292751220736)]} 0 1
[junit4:junit4]   2> 16387 T1013 C77 P26902 REQ /update {update.distrib=FROMLEADER&distrib.from=http://127.0.0.1:26068/solr/collection1/&wt=javabin&version=2} status=0 QTime=1 
[junit4:junit4]   2> 16388 T991 C78 P26068 REQ /update {distrib.from=http://127.0.0.1:43614/solr/collection1/&update.distrib=TOLEADER&wt=javabin&version=2} status=0 QTime=5 
[junit4:junit4]   2> 16388 T1003 C80 P43614 /update {wt=javabin&version=2} {add=[107]} 0 7
[junit4:junit4]   2> 16392 T975 C81 P62552 /update {wt=javabin&version=2} {add=[108 (1413710292764852224)]} 0 1
[junit4:junit4]   2> 16398 T1013 C77 P26902 REQ /update {distrib.from=http://127.0.0.1:26068/solr/collection1/&update.distrib=FROMLEADER&wt=javabin&version=2} status=0 QTime=1 
[junit4:junit4]   2> 16399 T994 C78 P26068 /update {wt=javabin&version=2} {add=[108 (1413710292767997952)]} 0 5
[junit4:junit4]   2> 16402 T975 C81 P62552 /update {wt=javabin&version=2} {add=[109 (1413710292775337984)]} 0 1
[junit4:junit4]   2> 16408 T1013 C77 P26902 REQ /update {distrib.from=http://127.0.0.1:26068/solr/collection1/&update.distrib=FROMLEADER&wt=javabin&version=2} status=0 QTime=1 
[junit4:junit4]   2> 16408 T994 C78 P26068 /update {wt=javabin&version=2} {add=[109 (1413710292778483712)]} 0 4
[junit4:junit4]   2> 16412 T975 C81 P62552 /update {wt=javabin&version=2} {add=[110 (1413710292785823744)]} 0 1
[junit4:junit4]   2> 16420 T1013 C77 P26902 REQ /update {update.distrib=FROMLEADER&distrib.from=http://127.0.0.1:26068/solr/collection1/&wt=javabin&version=2} status=0 QTime=1 
[junit4:junit4]   2> 16421 T991 C78 P26068 REQ /update {distrib.from=http://127.0.0.1:43614/solr/collection1/&update.distrib=TOLEADER&wt=javabin&version=2} status=0 QTime=5 
[junit4:junit4]   2> 16421 T1003 C80 P43614 /update {wt=javabin&version=2} {add=[110]} 0 7
[junit4:junit4]   2> 16425 T975 C81 P62552 /update {wt=javabin&version=2} {add=[111 (1413710292799455232)]} 0 1
[junit4:junit4]   2> 16434 T1013 C77 P26902 REQ /update {update.distrib=FROMLEADER&distrib.from=http://127.0.0.1:26068/solr/collection1/&wt=javabin&version=2} status=0 QTime=1 
[junit4:junit4]   2> 16435 T991 C78 P26068 REQ /update {distrib.from=http://127.0.0.1:43614/solr/collection1/&update.distrib=TOLEADER&wt=javabin&version=2} status=0 QTime=5 
[junit4:junit4]   2> 16435 T1003 C80 P43614 /update {wt=javabin&version=2} {add=[111]} 0 7
[junit4:junit4]   2> 16439 T975 C81 P62552 /update {wt=javabin&version=2} {add=[112 (1413710292814135296)]} 0 1
[junit4:junit4]   2> 16447 T1027 C79 P37575 REQ /update {update.distrib=FROMLEADER&distrib.from=http://127.0.0.1:43614/solr/collection1/&wt=javabin&version=2} status=0 QTime=1 
[junit4:junit4]   2> 16447 T1006 C80 P43614 REQ /update {distrib.from=http://127.0.0.1:26068/solr/collection1/&update.distrib=TOLEADER&wt=javabin&version=2} status=0 QTime=4 
[junit4:junit4]   2> 16448 T994 C78 P26068 /update {wt=javabin&version=2} {add=[112]} 0 7
[junit4:junit4]   2> 16465 T975 C81 P62552 /update {wt=javabin&version=2} {add=[113 (1413710292826718208)]} 0 15
[junit4:junit4]   2> 16473 T1013 C77 P26902 REQ /update {update.distrib=FROMLEADER&distrib.from=http://127.0.0.1:26068/solr/collection1/&wt=javabin&version=2} status=0 QTime=1 
[junit4:junit4]   2> 16474 T991 C78 P26068 REQ /update {distrib.from=http://127.0.0.1:43614/solr/collection1/&update.distrib=TOLEADER&wt=javabin&version=2} status=0 QTime=5 
[junit4:junit4]   2> 16474 T1003 C80 P43614 /update {wt=javabin&version=2} {add=[113]} 0 7
[junit4:junit4]   2> 16479 T975 C81 P62552 /update {wt=javabin&version=2} {add=[114 (1413710292855029760)]} 0 2
[junit4:junit4]   2> 16487 T1013 C77 P26902 REQ /update {update.distrib=FROMLEADER&distrib.from=http://127.0.0.1:26068/solr/collection1/&wt=javabin&version=2} status=0 QTime=1 
[junit4:junit4]   2> 16487 T991 C78 P26068 REQ /update {distrib.from=http://127.0.0.1:43614/solr/collection1/&update.distrib=TOLEADER&wt=javabin&version=2} status=0 QTime=4 
[junit4:junit4]   2> 16488 T1003 C80 P43614 /update {wt=javabin&version=2} {add=[114]} 0 7
[junit4:junit4]   2> 16492 T975 C81 P62552 /update {wt=javabin&version=2} {add=[115 (1413710292869709824)]} 0 1
[junit4:junit4]   2> 16498 T1027 C79 P37575 REQ /update {distrib.from=http://127.0.0.1:43614/solr/collection1/&update.distrib=FROMLEADER&wt=javabin&version=2} status=0 QTime=1 
[junit4:junit4]   2> 16498 T1003 C80 P43614 /update {wt=javabin&version=2} {add=[115 (1413710292872855552)]} 0 4
[junit4:junit4]   2> 16502 T975 C81 P62552 /update {wt=javabin&version=2} {add=[116 (1413710292880195584)]} 0 1
[junit4:junit4]   2> 16508 T1027 C79 P37575 REQ /update {distrib.from=http://127.0.0.1:43614/solr/collection1/&update.distrib=FROMLEADER&wt=javabin&version=2} status=0 QTime=1 
[junit4:junit4]   2> 16508 T1003 C80 P43614 /update {wt=javabin&version=2} {add=[116 (1413710292883341312)]} 0 4
[junit4:junit4]   2> 16512 T975 C81 P62552 /update {wt=javabin&version=2} {add=[117 (1413710292890681344)]} 0 1
[junit4:junit4]   2> 16541 T1027 C79 P37575 REQ /update {distrib.from=http://127.0.0.1:43614/solr/collection1/&update.distrib=FROMLEADER&wt=javabin&version=2} status=0 QTime=1 
[junit4:junit4]   2> 16542 T1003 C80 P43614 /update {wt=javabin&version=2} {add=[117 (1413710292917944320)]} 0 5
[junit4:junit4]   2> 16545 T975 C81 P62552 /update {wt=javabin&version=2} {add=[118 (1413710292925284352)]} 0 1
[junit4:junit4]   2> 16577 T1013 C77 P26902 REQ /update {distrib.from=http://127.0.0.1:26068/solr/collection1/&update.distrib=FROMLEADER&wt=javabin&version=2} status=0 QTime=14 
[junit4:junit4]   2> 16578 T994 C78 P26068 /update {wt=javabin&version=2} {add=[118 (1413710292928430080)]} 0 31
[junit4:junit4]   2> 16582 T975 C81 P62552 /update {wt=javabin&version=2} {add=[119 (1413710292964081664)]} 0 1
[junit4:junit4]   2> 16589 T1027 C79 P37575 REQ /update {distrib.from=http://127.0.0.1:43614/solr/collection1/&update.distrib=FROMLEADER&wt=javabin&version=2} status=0 QTime=1 
[junit4:junit4]   2> 16589 T1003 C80 P43614 /update {wt=javabin&version=2} {add=[119 (1413710292968275968)]} 0 4
[junit4:junit4]   2> 16593 T975 C81 P62552 /update {wt=javabin&version=2} {add=[120 (1413710292975616000)]} 0 1
[junit4:junit4]   2> 16601 T1027 C79 P37575 REQ /update {update.distrib=FROMLEADER&distrib.from=http://127.0.0.1:43614/solr/collection1/&wt=javabin&version=2} status=0 QTime=1 
[junit4:junit4]   2> 16601 T1006 C80 P43614 REQ /update {distrib.from=http://127.0.0.1:26068/solr/collection1/&update.distrib=TOLEADER&wt=javabin&version=2} status=0 QTime=4 
[junit4:junit4]   2> 16602 T994 C78 P26068 /update {wt=javabin&version=2} {add=[120]} 0 7
[junit4:junit4]   2> 16605 T975 C81 P62552 /update {wt=javabin&version=2} {add=[121 (1413710292988198912)]} 0 1
[junit4:junit4]   2> 16613 T1027 C79 P37575 REQ /update {update.distrib=FROMLEADER&distrib.from=http://127.0.0.1:43614/solr/collection1/&wt=javabin&version=2} status=0 QTime=1 
[junit4:junit4]   2> 16613 T1006 C80 P43614 REQ /update {distrib.from=http://127.0.0.1:26068/solr/collection1/&update.distrib=TOLEADER&wt=javabin&version=2} status=0 QTime=4 
[junit4:junit4]   2> 16614 T994 C78 P26068 /update {wt=javabin&version=2} {add=[121]} 0 7
[junit4:junit4]   2> 16617 T975 C81 P62552 /update {wt=javabin&version=2} {add=[122 (1413710293000781824)]} 0 1
[junit4:junit4]   2> 16627 T1013 C77 P26902 REQ /update {update.distrib=FROMLEADER&distrib.from=http://127.0.0.1:26068/solr/collection1/&wt=javabin&version=2} status=0 QTime=2 
[junit4:junit4]   2> 16628 T991 C78 P26068 REQ /update {distrib.from=http://127.0.0.1:43614/solr/collection1/&update.distrib=TOLEADER&wt=javabin&version=2} status=0 QTime=7 
[junit4:junit4]   2> 16628 T1003 C80 P43614 /update {wt=javabin&version=2} {add=[122]} 0 9
[junit4:junit4]   2> 16647 T975 C81 P62552 /update {wt=javabin&version=2} {add=[123 (1413710293016510464)]} 0 16
[junit4:junit4]   2> 16655 T1013 C77 P26902 REQ /update {update.distrib=FROMLEADER&distrib.from=http://127.0.0.1:26068/solr/collection1/&wt=javabin&version=2} status=0 QTime=1 
[junit4:junit4]   2> 16655 T991 C78 P26068 REQ /update {distrib.from=http://127.0.0.1:43614/solr/collection1/&update.distrib=TOLEADER&wt=javabin&version=2} status=0 QTime=4 
[junit4:junit4]   2> 16656 T1003 C80 P43614 /update {wt=javabin&version=2} {add=[123]} 0 7
[junit4:junit4]   2> 16661 T975 C81 P62552 /update {wt=javabin&version=2} {add=[124 (1413710293045870592)]} 0 2
[junit4:junit4]   2> 16669 T1013 C77 P26902 REQ /update {update.distrib=FROMLEADER&distrib.from=http://127.0.0.1:26068/solr/collection1/&wt=javabin&version=2} status=0 QTime=1 
[junit4:junit4]   2> 16669 T991 C78 P26068 REQ /update {distrib.from=http://127.0.0.1:43614/solr/collection1/&update.distrib=TOLEADER&wt=javabin&version=2} status=0 QTime=4 
[junit4:junit4]   2> 16670 T1003 C80 P43614 /update {wt=javabin&version=2} {add=[124]} 0 7
[junit4:junit4]   2> 16674 T975 C81 P62552 /update {wt=javabin&version=2} {add=[125 (1413710293060550656)]} 0 1
[junit4:junit4]   2> 16680 T1013 C77 P26902 REQ /update {distrib.from=http://127.0.0.1:26068/solr/collection1/&update.distrib=FROMLEADER&wt=javabin&version=2} status=0 QTime=1 
[junit4:junit4]   2> 16680 T994 C78 P26068 /update {wt=javabin&version=2} {add=[125 (1413710293063696384)]} 0 4
[junit4:junit4]   2> 16684 T975 C81 P62552 /update {wt=javabin&version=2} {add=[126 (1413710293071036416)]} 0 1
[junit4:junit4]   2> 16690 T1027 C79 P37575 REQ /update {distrib.from=http://127.0.0.1:43614/solr/collection1/&update.distrib=FROMLEADER&wt=javabin&version=2} status=0 QTime=1 
[junit4:junit4]   2> 16690 T1003 C80 P43614 /update {wt=javabin&version=2} {add=[126 (1413710293074182144)]} 0 4
[junit4:junit4]   2> 16694 T975 C81 P62552 /update {wt=javabin&version=2} {add=[127 (1413710293081522176)]} 0 1
[junit4:junit4]   2> 16728 T1027 C79 P37575 REQ /update {update.distrib=FROMLEADER&distrib.from=http://127.0.0.1:43614/solr/collection1/&wt=javabin&version=2} status=0 QTime=14 
[junit4:junit4]   2> 16729 T1006 C80 P43614 REQ /update {distrib.from=http://127.0.0.1:26068/solr/collection1/&update.distrib=TOLEADER&wt=javabin&version=2} status=0 QTime=31 
[junit4:junit4]   2> 16729 T994 C78 P26068 /update {wt=javabin&version=2} {add=[127]} 0 33
[junit4:junit4]   2> 16733 T975 C81 P62552 /update {wt=javabin&version=2} {add=[128 (1413710293122416640)]} 0 1
[junit4:junit4]   2> 16743 T1027 C79 P37575 REQ /update {update.distrib=FROMLEADER&distrib.from=http://127.0.0.1:43614/solr/collection1/&wt=javabin&version=2} status=0 QTime=2 
[junit4:junit4]   2> 16743 T1006 C80 P43614 REQ /update {distrib.from=http://127.0.0.1:26068/solr/collection1/&update.distrib=TOLEADER&wt=javabin&version=2} status=0 QTime=6 
[junit4:junit4]   2> 16744 T994 C78 P26068 /update {wt=javabin&version=2} {add=[128]} 0 9
[junit4:junit4]   2> 16748 T975 C81 P62552 /update {wt=javabin&version=2} {add=[129 (1413710293138145280)]} 0 1
[junit4:junit4]   2> 16756 T1013 C77 P26902 REQ /update {update.distrib=FROMLEADER&distrib.from=http://127.0.0.1:26068/solr/collection1/&wt=javabin&version=2} status=0 QTime=1 
[junit4:junit4]   2> 16756 T991 C78 P26068 REQ /update {distrib.from=http://127.0.0.1:43614/solr/collection1/&update.distrib=TOLEADER&wt=javabin&version=2} status=0 QTime=4 
[junit4:junit4]   2> 16757 T1003 C80 P43614 /update {wt=javabin&version=2} {add=[129]} 0 7
[junit4:junit4]   2> 16760 T975 C81 P62552 /update {wt=javabin&version=2} {add=[130 (1413710293150728192)]} 0 1
[junit4:junit4]   2> 16768 T1027 C79 P37575 REQ /update {update.distrib=FROMLEADER&distrib.from=http://127.0.0.1:43614/solr/collection1/&wt=javabin&version=2} status=0 QTime=1 
[junit4:junit4]   2> 16768 T1006 C80 P43614 REQ /update {distrib.from=http://127.0.0.1:26068/solr/collection1/&update.distrib=TOLEADER&wt=javabin&version=2} status=0 QTime=4 
[junit4:junit4]   2> 16769 T994 C78 P26068 /update {wt=javabin&version=2} {add=[130]} 0 7
[junit4:junit4]   2> 16772 T975 C81 P62552 /update {wt=javabin&version=2} {add=[131 (1413710293163311104)]} 0 1
[junit4:junit4]   2> 16780 T1027 C79 P37575 REQ /update {update.distrib=FROMLEADER&distrib.from=http://127.0.0.1:43614/solr/collection1/&wt=javabin&version=2} status=0 QTime=1 
[junit4:junit4]   2> 16780 T1006 C80 P43614 REQ /update {distrib.from=http://127.0.0.1:26068/solr/collection1/&update.distrib=TOLEADER&wt=javabin&version=2} status=0 QTime=4 
[junit4:junit4]   2> 16781 T994 C78 P26068 /update {wt=javabin&version=2} {add=[131]} 0 7
[junit4:junit4]   2> 16784 T975 C81 P62552 /update {wt=javabin&version=2} {add=[132 (1413710293175894016)]} 0 1
[junit4:junit4]   2> 16796 T1013 C77 P26902 REQ /update {distrib.from=http://127.0.0.1:26068/solr/collection1/&update.distrib=FROMLEADER&wt=javabin&version=2} status=0 QTime=1 
[junit4:junit4]   2> 16797 T994 C78 P26068 /update {wt=javabin&version=2} {add=[132 (1413710293179039744)]} 0 11
[junit4:junit4]   2> 16815 T975 C81 P62552 /update {wt=javabin&version=2} {add=[133 (1413710293193719808)]} 0 15
[junit4:junit4]   2> 16821 T1013 C77 P26902 REQ /update {distrib.from=http://127.0.0.1:26068/solr/collection1/&update.distrib=FROMLEADER&wt=javabin&version=2} status=0 QTime=1 
[junit4:junit4]   2> 16822 T994 C78 P26068 /update {wt=javabin&version=2} {add=[133 (1413710293211545600)]} 0 5
[junit4:junit4]   2> 16826 T975 C81 P62552 /update {wt=javabin&version=2} {add=[134 (1413710293218885632)]} 0 2
[junit4:junit4]   2> 16832 T1027 C79 P37575 REQ /update {distrib.from=http://127.0.0.1:43614/solr/collection1/&update.distrib=FROMLEADER&wt=javabin&version=2} status=0 QTime=1 
[junit4:junit4]   2> 16832 T1003 C80 P43614 /update {wt=javabin&version=2} {add=[134 (1413710293223079936)]} 0 4
[junit4:junit4]   2> 16836 T975 C81 P62552 /update {wt=javabin&version=2} {add=[135 (1413710293230419968)]} 0 1
[junit4:junit4]   2> 16842 T1013 C77 P26902 REQ /update {distrib.from=http://127.0.0.1:26068/solr/collection1/&update.distrib=FROMLEADER&wt=javabin&version=2} status=0 QTime=1 
[junit4:junit4]   2> 16842 T994 C78 P26068 /update {wt=javabin&version=2} {add=[135 (1413710293233565696)]} 0 4
[junit4:junit4]   2> 16846 T975 C81 P62552 /update {wt=javabin&version=2} {add=[136 (1413710293240905728)]} 0 1
[junit4:junit4]   2> 16852 T1027 C79 P37575 REQ /update {distrib.from=http://127.0.0.1:43614/solr/collection1/&update.distrib=FROMLEADER&wt=javabin&version=2} status=0 QTime=1 
[junit4:junit4]   2> 16852 T1003 C80 P43614 /update {wt=javabin&version=2} {add=[136 (1413710293244051456)]} 0 4
[junit4:junit4]   2> 16856 T975 C81 P62552 /update {wt=javabin&version=2} {add=[137 (1413710293251391488)]} 0 1
[junit4:junit4]   2> 16864 T1027 C79 P37575 REQ /update {update.distrib=FROMLEADER&distrib.from=http://127.0.0.1:43614/solr/collection1/&wt=javabin&version=2} status=0 QTime=1 
[junit4:junit4]   2> 16864 T1006 C80 P43614 REQ /update {distrib.from=http://127.0.0.1:26068/solr/collection1/&update.distrib=TOLEADER&wt=javabin&version=2} status=0 QTime=4 
[junit4:junit4]   2> 16865 T994 C78 P26068 /update {wt=javabin&version=2} {add=[137]} 0 7
[junit4:junit4]   2> 16869 T975 C81 P62552 /update {wt=javabin&version=2} {add=[138 (1413710293265022976)]} 0 1
[junit4:junit4]   2> 16877 T1013 C77 P26902 REQ /update {update.distrib=FROMLEADER&distrib.from=http://127.0.0.1:26068/solr/collection1/&wt=javabin&version=2} status=0 QTime=1 
[junit4:junit4]   2> 16877 T991 C78 P26068 REQ /update {distrib.from=http://127.0.0.1:43614/solr/collection1/&update.distrib=TOLEADER&wt=javabin&version=2} status=0 QTime=4 
[junit4:junit4]   2> 16878 T1003 C80 P43614 /update {wt=javabin&version=2} {add=[138]} 0 7
[junit4:junit4]   2> 16881 T975 C81 P62552 /update {wt=javabin&version=2} {add=[139 (1413710293277605888)]} 0 1
[junit4:junit4]   2> 16889 T1027 C79 P37575 REQ /update {update.distrib=FROMLEADER&distrib.from=http://127.0.0.1:43614/solr/collection1/&wt=javabin&version=2} status=0 QTime=1 
[junit4:junit4]   2> 16889 T1006 C80 P43614 REQ /update {distrib.from=http://127.0.0.1:26068/solr/collection1/&update.distrib=TOLEADER&wt=javabin&version=2} status=0 QTime=4 
[junit4:junit4]   2> 16890 T994 C78 P26068 /update {wt=javabin&version=2} {add=[139]} 0 7
[junit4:junit4]   2> 16894 T975 C81 P62552 /update {wt=javabin&version=2} {add=[140 (1413710293291237376)]} 0 1
[junit4:junit4]   2> 16900 T1027 C79 P37575 REQ /update {distrib.from=http://127.0.0.1:43614/solr/collection1/&update.distrib=FROMLEADER&wt=javabin&version=2} status=0 QTime=1 
[junit4:junit4]   2> 16901 T1003 C80 P43614 /update {wt=javabin&version=2} {add=[140 (1413710293294383104)]} 0 5
[junit4:junit4]   2> 16904 T975 C81 P62552 /update {wt=javabin&version=2} {add=[141 (1413710293301723136)]} 0 1
[junit4:junit4]   2> 16910 T1027 C79 P37575 REQ /update {distrib.from=http://127.0.0.1:43614/solr/collection1/&update.distrib=FROMLEADER&wt=javabin&version=2} status=0 QTime=1 
[junit4:junit4]   2> 16910 T1003 C80 P43614 /update {wt=javabin&version=2} {add=[141 (1413710293304868864)]} 0 4
[junit4:junit4]   2> 16914 T975 C81 P62552 /update {wt=javabin&version=2} {add=[142 (1413710293312208896)]} 0 1
[junit4:junit4]   2> 16946 T1027 C79 P37575 REQ /update {distrib.from=http://127.0.0.1:43614/solr/collection1/&update.distrib=FROMLEADER&wt=javabin&version=2} status=0 QTime=13 
[junit4:junit4]   2> 16947 T1003 C80 P43614 /update {wt=javabin&version=2} {add=[142 (1413710293315354624)]} 0 31
[junit4:junit4]   2> 16964 T975 C81 P62552 /update {wt=javabin&version=2} {add=[143 (1413710293351006208)]} 0 14
[junit4:junit4]   2> 16973 T1027 C79 P37575 REQ /update {distrib.from=http://127.0.0.1:43614/solr/collection1/&update.distrib=FROMLEADER&wt=javabin&version=2} status=0 QTime=2 
[junit4:junit4]   2> 16973 T1003 C80 P43614 /update {wt=javabin&version=2} {add=[143 (1413710293368832000)]} 0 6
[junit4:junit4]   2> 16978 T975 C81 P62552 /update {wt=javabin&version=2} {add=[144 (1413710293378269184)]} 0 2
[junit4:junit4]   2> 16986 T1027 C79 P37575 REQ /update {update.distrib=FROMLEADER&distrib.from=http://127.0.0.1:43614/solr/collection1/&wt=javabin&version=2} status=0 QTime=1 
[junit4:junit4]   2> 16987 T1006 C80 P43614 REQ /update {distrib.from=http://127.0.0.1:26068/solr/collection1/&update.distrib=TOLEADER&wt=javabin&version=2} status=0 QTime=5 
[junit4:junit4]   2> 16987 T994 C78 P26068 /update {wt=javabin&version=2} {add=[144]} 0 7
[junit4:junit4]   2> 16991 T975 C81 P62552 /update {wt=javabin&version=2} {add=[145 (1413710293392949248)]} 0 1
[junit4:junit4]   2> 16995 T1027 C79 P37575 REQ /update {distrib.from=http://127.0.0.1:43614/solr/collection1/&update.distrib=FROMLEADER&wt=javabin&version=2} status=0 QTime=0 
[junit4:junit4]   2> 16996 T1003 C80 P43614 /update {wt=javabin&version=2} {add=[145 (1413710293396094976)]} 0 3
[junit4:junit4]   2> 16998 T975 C81 P62552 /update {wt=javabin&version=2} {add=[146 (1413710293401337856)]} 0 0
[junit4:junit4]   2> 17027 T1013 C77 P26902 REQ /update {distrib.from=http://127.0.0.1:26068/solr/collection1/&update.distrib=FROMLEADER&wt=javabin&version=2} status=0 QTime=15 
[junit4:junit4]   2> 17027 T994 C78 P26068 /update {wt=javabin&version=2} {add=[146 (1413710293404483584)]} 0 26
[junit4:junit4]   2> 17031 T975 C81 P62552 /update {wt=javabin&version=2} {add=[147 (1413710293434892288)]} 0 1
[junit4:junit4]   2> 17036 T1027 C79 P37575 REQ /update {distrib.from=http://127.0.0.1:43614/solr/collection1/&update.distrib=FROMLEADER&wt=javabin&version=2} status=0 QTime=0 
[junit4:junit4]   2> 17037 T1003 C80 P43614 /update {wt=javabin&version=2} {add=[147 (1413710293438038016)]} 0 4
[junit4:junit4]   2> 17039 T975 C81 P62552 /update {wt=javabin&version=2} {add=[148 (1413710293444329472)]} 0 0
[junit4:junit4]   2> 17046 T1013 C77 P26902 REQ /update {distrib.from=http://127.0.0.1:26068/solr/collection1/&update.distrib=FROMLEADER&wt=javabin&version=2} status=0 QTime=1 
[junit4:junit4]   2> 17046 T994 C78 P26068 /update {wt=javabin&version=2} {add=[148 (1413710293447475200)]} 0 4
[junit4:junit4]   2> 17049 T975 C81 P62552 /update {wt=javabin&version=2} {add=[149 (1413710293454815232)]} 0 0
[junit4:junit4]   2> 17056 T1027 C79 P37575 REQ /update {distrib.from=http://127.0.0.1:43614/solr/collection1/&update.distrib=FROMLEADER&wt=javabin&version=2} status=0 QTime=1 
[junit4:junit4]   2> 17057 T1003 C80 P43614 /update {wt=javabin&version=2} {add=[149 (1413710293457960960)]} 0 5
[junit4:junit4]   2> 17057 T963 oasc.AbstractDistribZkTestBase.waitForRecoveriesToFinish Wait for recoveries to finish - collection: collection1 failOnTimeout:true timeout (sec):1800
[junit4:junit4]   2> 17058 T963 oascc.ZkStateReader.updateClusterState Updating cloud state from ZooKeeper... 
[junit4:junit4]   2> 17061 T975 C81 P62552 oasu.DirectUpdateHandler2.commit start commit{flags=0,_version_=0,optimize=false,openSearcher=true,waitSearcher=true,expungeDeletes=false,softCommit=false}
[junit4:junit4]   2> 17516 T975 C81 P62552 oasc.SolrDeletionPolicy.onCommit SolrDeletionPolicy.onCommit: commits:num=2
[junit4:junit4]   2> 		commit{dir=NRTCachingDirectory(org.apache.lucene.store.NIOFSDirectory@/usr/home/hudson/hudson-slave/workspace/Lucene-Solr-Tests-4.x-Java6/solr/build/solr-core/test/J1/org.apache.solr.cloud.BasicDistributedZk2Test-1348219180664/control/data/index lockFactory=org.apache.lucene.store.NativeFSLockFactory@646a91fd; maxCacheMB=48.0 maxMergeSizeMB=4.0),segFN=segments_2,generation=2,filenames=[_0_Asserting_0.tim, _0_Block_0.tip, _0_Block_0.pos, _0_Asserting_0.tip, _0_MockVariableIntBlock_0.doc, _0_Block_0.tim, _0_MockVariableIntBlock_0.skp, _0_Asserting_0.prx, _0_MockVariableIntBlock_0.pyl, _0_Lucene40WithOrds_0.tii, _0_Lucene40WithOrds_0.frq, _0_MockVariableIntBlock_0.tib, _0_MockVariableIntBlock_0.pos, _0.si, _0_Lucene40WithOrds_0.tib, _0_MockVariableIntBlock_0.tii, _0.fnm, _0_Block_0.doc, _0_nrm.cfs, _0_Asserting_0.frq, _0_nrm.cfe, _0_MockVariableIntBlock_0.frq, segments_2, _0.fdx, _0_Lucene40WithOrds_0.prx, _0.fdt]
[junit4:junit4]   2> 		commit{dir=NRTCachingDirectory(org.apache.lucene.store.NIOFSDirectory@/usr/home/hudson/hudson-slave/workspace/Lucene-Solr-Tests-4.x-Java6/solr/build/solr-core/test/J1/org.apache.solr.cloud.BasicDistributedZk2Test-1348219180664/control/data/index lockFactory=org.apache.lucene.store.NativeFSLockFactory@646a91fd; maxCacheMB=48.0 maxMergeSizeMB=4.0),segFN=segments_3,generation=3,filenames=[_5_nrm.cfe, _3_MockVariableIntBlock_0.frq, _6_Asserting_0.frq, _3.fdt, _4_MockVariableIntBlock_0.tii, _5_Lucene40WithOrds_0.tib, _1_Asserting_0.tim, _7.fnm, _6_Block_0.pos, _0_Lucene40WithOrds_0.frq, _5_Lucene40WithOrds_0.tii, _1_Lucene40WithOrds_0.tib, _1_Asserting_0.tip, _1_Lucene40WithOrds_0.tii, _6_MockVariableIntBlock_0.tii, _1_Block_0.pos, _1_Lucene40WithOrds_0.frq, _6_MockVariableIntBlock_0.tib, _1_MockVariableIntBlock_0.tii, _1_MockVariableIntBlock_0.tib, _1.fdx, _4_MockVariableIntBlock_0.tib, _1.fdt, _5_nrm.cfs, _0_MockVariableIntBlock_0.frq, _6.fdt, _5_Lucene40WithOrds_0.prx, _2.si, _1_MockVariableIntBlock_0.skp, _7_MockVariableIntBlock_0.pos, _2_Block_0.tim, _0_MockVariableIntBlock_0.doc, _2_Block_0.tip, _6.fdx, _1_Lucene40WithOrds_0.prx, _1_MockVariableIntBlock_0.pyl, _5_Block_0.tim, _3_MockVariableIntBlock_0.tii, _7_Asserting_0.frq, _2_nrm.cfe, _0_MockVariableIntBlock_0.pos, _2_nrm.cfs, _7_MockVariableIntBlock_0.skp, _4_Block_0.tip, _4_MockVariableIntBlock_0.frq, _2.fnm, _5_MockVariableIntBlock_0.frq, _3.fdx, _1.si, _0_Lucene40WithOrds_0.prx, _3_MockVariableIntBlock_0.pos, _3_nrm.cfe, _0_Block_0.tip, _5_MockVariableIntBlock_0.pyl, _0_Block_0.tim, _3_Lucene40WithOrds_0.tii, _4_nrm.cfe, _6_Lucene40WithOrds_0.prx, _7_Block_0.tim, _7_Block_0.tip, _3_Lucene40WithOrds_0.tib, _4.fdx, _3_Asserting_0.prx, _7_MockVariableIntBlock_0.tii, _2_Asserting_0.prx, _1_Block_0.doc, _6_MockVariableIntBlock_0.frq, _3_MockVariableIntBlock_0.doc, _7_Lucene40WithOrds_0.tib, _5.si, _3_nrm.cfs, _7_Lucene40WithOrds_0.tii, _4_MockVariableIntBlock_0.pyl, _4_Lucene40WithOrds_0.prx, _4_nrm.cfs, _3_MockVariableIntBlock_0.tib, _5_Block_0.tip, _5_Asserting_0.prx, _5_MockVariableIntBlock_0.doc, _7_Block_0.doc, _6_MockVariableIntBlock_0.pyl, _2_MockVariableIntBlock_0.frq, _6_Asserting_0.tim, _6_nrm.cfs, _6_Asserting_0.tip, _2_Lucene40WithOrds_0.prx, _7_nrm.cfs, _2_Asserting_0.frq, _5_Block_0.pos, _5_Asserting_0.frq, _1_nrm.cfs, _5.fnm, _0_Block_0.doc, _7_nrm.cfe, _7_Asserting_0.prx, _6_nrm.cfe, _3_Lucene40WithOrds_0.frq, _4.fdt, _4.si, _1_nrm.cfe, _3_Asserting_0.frq, _6_Block_0.tip, _6_Block_0.tim, _2_Block_0.pos, _7.si, _0_Lucene40WithOrds_0.tii, _7_Lucene40WithOrds_0.frq, _5_MockVariableIntBlock_0.tii, _0_Lucene40WithOrds_0.tib, _4_Asserting_0.frq, _1_Block_0.tip, _1_Block_0.tim, _4_MockVariableIntBlock_0.doc, _2.fdt, _7.fdx, _7_MockVariableIntBlock_0.frq, _2.fdx, _7.fdt, _3_Block_0.pos, _3_Block_0.doc, _2_Asserting_0.tim, _0_Asserting_0.frq, _2_Asserting_0.tip, _7_Block_0.pos, _3.si, _2_MockVariableIntBlock_0.skp, _0_Asserting_0.tim, _4_Lucene40WithOrds_0.tib, _2_MockVariableIntBlock_0.pyl, _4_Lucene40WithOrds_0.tii, _0_Asserting_0.tip, _4_Asserting_0.tip, _3.fnm, _2_MockVariableIntBlock_0.doc, _0_MockVariableIntBlock_0.pyl, _4_Asserting_0.prx, _4_Asserting_0.tim, _1_MockVariableIntBlock_0.doc, _5_Block_0.doc, _4_Block_0.pos, _3_Block_0.tip, _2_MockVariableIntBlock_0.tii, _7_MockVariableIntBlock_0.pyl, _6_Asserting_0.prx, _2_Lucene40WithOrds_0.frq, _5_MockVariableIntBlock_0.tib, _2_MockVariableIntBlock_0.tib, _1_MockVariableIntBlock_0.pos, _1_Asserting_0.frq, _1_Asserting_0.prx, _3_MockVariableIntBlock_0.pyl, _6.fnm, _6.si, _7_MockVariableIntBlock_0.tib, _3_Lucene40WithOrds_0.prx, _5.fdt, _4.fnm, _0_MockVariableIntBlock_0.skp, _1.fnm, _7_MockVariableIntBlock_0.doc, _0_Asserting_0.prx, _3_Block_0.tim, _7_Asserting_0.tip, _6_MockVariableIntBlock_0.doc, _2_MockVariableIntBlock_0.pos, _7_Asserting_0.tim, _0.fnm, _4_Block_0.tim, _5_MockVariableIntBlock_0.pos, _6_Lucene40WithOrds_0.frq, _5_Asserting_0.tim, _6_Block_0.doc, _6_Lucene40WithOrds_0.tii, _5_Lucene40WithOrds_0.frq, _6_Lucene40WithOrds_0.tib, _5_Asserting_0.tip, _0_Block_0.pos, _4_Lucene40WithOrds_0.frq, _4_Block_0.doc, _4_MockVariableIntBlock_0.skp, _0_MockVariableIntBlock_0.tib, _5_MockVariableIntBlock_0.skp, _4_MockVariableIntBlock_0.pos, _6_MockVariableIntBlock_0.pos, _7_Lucene40WithOrds_0.prx, _0.si, _0_MockVariableIntBlock_0.tii, _0_nrm.cfs, _6_MockVariableIntBlock_0.skp, _2_Lucene40WithOrds_0.tii, _1_MockVariableIntBlock_0.frq, _3_Asserting_0.tim, _3_Asserting_0.tip, _0_nrm.cfe, _5.fdx, _2_Lucene40WithOrds_0.tib, _0.fdx, _2_Block_0.doc, _3_MockVariableIntBlock_0.skp, segmen

[...truncated too long message...]

19180664/jetty4/index does not exist
[junit4:junit4]   2> 	at org.apache.commons.io.FileUtils.sizeOfDirectory(FileUtils.java:2074)
[junit4:junit4]   2> 	at org.apache.solr.handler.ReplicationHandler.getIndexSize(ReplicationHandler.java:477)
[junit4:junit4]   2> 	at org.apache.solr.handler.ReplicationHandler.getStatistics(ReplicationHandler.java:525)
[junit4:junit4]   2> 	at org.apache.solr.core.RequestHandlers$LazyRequestHandlerWrapper.getStatistics(RequestHandlers.java:310)
[junit4:junit4]   2> 	at org.apache.solr.core.JmxMonitoredMap$SolrDynamicMBean.getMBeanInfo(JmxMonitoredMap.java:231)
[junit4:junit4]   2> 	at com.sun.jmx.interceptor.DefaultMBeanServerInterceptor.getClassName(DefaultMBeanServerInterceptor.java:1824)
[junit4:junit4]   2> 	at com.sun.jmx.interceptor.DefaultMBeanServerInterceptor.safeGetClassName(DefaultMBeanServerInterceptor.java:1661)
[junit4:junit4]   2> 	at com.sun.jmx.interceptor.DefaultMBeanServerInterceptor.checkMBeanPermission(DefaultMBeanServerInterceptor.java:1833)
[junit4:junit4]   2> 	at com.sun.jmx.interceptor.DefaultMBeanServerInterceptor.getAttribute(DefaultMBeanServerInterceptor.java:680)
[junit4:junit4]   2> 	at com.sun.jmx.mbeanserver.JmxMBeanServer.getAttribute(JmxMBeanServer.java:672)
[junit4:junit4]   2> 	at org.apache.solr.core.JmxMonitoredMap.unregister(JmxMonitoredMap.java:174)
[junit4:junit4]   2> 	at org.apache.solr.core.JmxMonitoredMap.clear(JmxMonitoredMap.java:116)
[junit4:junit4]   2> 	at org.apache.solr.core.SolrCore.close(SolrCore.java:864)
[junit4:junit4]   2> 	at org.apache.solr.cloud.ShardLeaderElectionContext.runLeaderProcess(ElectionContext.java:213)
[junit4:junit4]   2> 	at org.apache.solr.cloud.LeaderElector.runIamLeaderProcess(LeaderElector.java:158)
[junit4:junit4]   2> 	at org.apache.solr.cloud.LeaderElector.checkIfIamLeader(LeaderElector.java:102)
[junit4:junit4]   2> 	at org.apache.solr.cloud.LeaderElector.access$000(LeaderElector.java:56)
[junit4:junit4]   2> 	at org.apache.solr.cloud.LeaderElector$1.process(LeaderElector.java:131)
[junit4:junit4]   2> 	at org.apache.zookeeper.ClientCnxn$EventThread.processEvent(ClientCnxn.java:526)
[junit4:junit4]   2> 	at org.apache.zookeeper.ClientCnxn$EventThread.run(ClientCnxn.java:502)
[junit4:junit4]   2> 
[junit4:junit4]   2> 308801 T1035 oasc.JmxMonitoredMap$SolrDynamicMBean.getMBeanInfo WARNING Could not getStatistics on info bean Lazy[solr.ReplicationHandler] java.lang.IllegalArgumentException: /usr/home/hudson/hudson-slave/workspace/Lucene-Solr-Tests-4.x-Java6/solr/build/solr-core/test/J1/org.apache.solr.cloud.BasicDistributedZk2Test-1348219180664/jetty4/index does not exist
[junit4:junit4]   2> 	at org.apache.commons.io.FileUtils.sizeOfDirectory(FileUtils.java:2074)
[junit4:junit4]   2> 	at org.apache.solr.handler.ReplicationHandler.getIndexSize(ReplicationHandler.java:477)
[junit4:junit4]   2> 	at org.apache.solr.handler.ReplicationHandler.getStatistics(ReplicationHandler.java:525)
[junit4:junit4]   2> 	at org.apache.solr.core.RequestHandlers$LazyRequestHandlerWrapper.getStatistics(RequestHandlers.java:310)
[junit4:junit4]   2> 	at org.apache.solr.core.JmxMonitoredMap$SolrDynamicMBean.getMBeanInfo(JmxMonitoredMap.java:231)
[junit4:junit4]   2> 	at com.sun.jmx.interceptor.DefaultMBeanServerInterceptor.getClassName(DefaultMBeanServerInterceptor.java:1824)
[junit4:junit4]   2> 	at com.sun.jmx.interceptor.DefaultMBeanServerInterceptor.safeGetClassName(DefaultMBeanServerInterceptor.java:1661)
[junit4:junit4]   2> 	at com.sun.jmx.interceptor.DefaultMBeanServerInterceptor.checkMBeanPermission(DefaultMBeanServerInterceptor.java:1833)
[junit4:junit4]   2> 	at com.sun.jmx.interceptor.DefaultMBeanServerInterceptor.exclusiveUnregisterMBean(DefaultMBeanServerInterceptor.java:436)
[junit4:junit4]   2> 	at com.sun.jmx.interceptor.DefaultMBeanServerInterceptor.unregisterMBean(DefaultMBeanServerInterceptor.java:421)
[junit4:junit4]   2> 	at com.sun.jmx.mbeanserver.JmxMBeanServer.unregisterMBean(JmxMBeanServer.java:540)
[junit4:junit4]   2> 	at org.apache.solr.core.JmxMonitoredMap.unregister(JmxMonitoredMap.java:175)
[junit4:junit4]   2> 	at org.apache.solr.core.JmxMonitoredMap.clear(JmxMonitoredMap.java:116)
[junit4:junit4]   2> 	at org.apache.solr.core.SolrCore.close(SolrCore.java:864)
[junit4:junit4]   2> 	at org.apache.solr.cloud.ShardLeaderElectionContext.runLeaderProcess(ElectionContext.java:213)
[junit4:junit4]   2> 	at org.apache.solr.cloud.LeaderElector.runIamLeaderProcess(LeaderElector.java:158)
[junit4:junit4]   2> 	at org.apache.solr.cloud.LeaderElector.checkIfIamLeader(LeaderElector.java:102)
[junit4:junit4]   2> 	at org.apache.solr.cloud.LeaderElector.access$000(LeaderElector.java:56)
[junit4:junit4]   2> 	at org.apache.solr.cloud.LeaderElector$1.process(LeaderElector.java:131)
[junit4:junit4]   2> 	at org.apache.zookeeper.ClientCnxn$EventThread.processEvent(ClientCnxn.java:526)
[junit4:junit4]   2> 	at org.apache.zookeeper.ClientCnxn$EventThread.run(ClientCnxn.java:502)
[junit4:junit4]   2> 
[junit4:junit4]   2> 308805 T1035 oasc.SolrCore.closeSearcher [collection1] Closing main searcher on request.
[junit4:junit4]   2> 308809 T1035 oasu.DirectUpdateHandler2.close closing DirectUpdateHandler2{commits=5,autocommits=0,soft autocommits=0,optimizes=0,rollbacks=0,expungeDeletes=0,docsPending=0,adds=0,deletesById=0,deletesByQuery=0,errors=0,cumulative_adds=35,cumulative_deletesById=0,cumulative_deletesByQuery=0,cumulative_errors=0}
[junit4:junit4]   2> 308809 T1035 oasu.DefaultSolrCoreState.decref SolrCoreState ref count has reached 0 - closing IndexWriter
[junit4:junit4]   2> 308811 T1035 oasu.DefaultSolrCoreState.decref Closing SolrCoreState - canceling any ongoing recovery
[junit4:junit4]   2> 308811 T1035 oascc.ZkStateReader$3.process Updating live nodes
[junit4:junit4]   2> 308811 T1035 oascc.ZkStateReader$3.process WARNING ZooKeeper watch triggered, but Solr cannot talk to ZK
[junit4:junit4]   2> 308812 T1035 oascc.ZkStateReader$2.process A cluster state change has occurred - updating...
[junit4:junit4]   2> 308812 T1035 oascc.ZkStateReader$2.process WARNING ZooKeeper watch triggered, but Solr cannot talk to ZK
[junit4:junit4]   2> 308812 T1035 oascc.ConnectionManager.process Watcher org.apache.solr.common.cloud.ConnectionManager@2b70723d name:ZooKeeperConnection Watcher:127.0.0.1:11507/solr got event WatchedEvent state:Disconnected type:None path:null path:null type:None
[junit4:junit4]   2> 308812 T1035 oascc.ConnectionManager.process Client->ZooKeeper status change trigger but we are already closed
[junit4:junit4]   2> 308812 T1035 oaz.ClientCnxn$EventThread.run EventThread shut down
[junit4:junit4]   2> NOTE: test params are: codec=Lucene40: {n_f1=PostingsFormat(name=Lucene40WithOrds), foo_b=MockVariableIntBlock(baseBlockSize=73), foo_d=PostingsFormat(name=Asserting), foo_f=MockVariableIntBlock(baseBlockSize=73), n_tl1=PostingsFormat(name=Lucene40WithOrds), n_d1=Block(blocksize=128), rnd_b=PostingsFormat(name=Asserting), intDefault=Block(blocksize=128), n_td1=PostingsFormat(name=Lucene40WithOrds), id=PostingsFormat(name=Asserting), timestamp=Block(blocksize=128), range_facet_sl=MockVariableIntBlock(baseBlockSize=73), range_facet_si=PostingsFormat(name=Lucene40WithOrds), oddField_s=MockVariableIntBlock(baseBlockSize=73), multiDefault=PostingsFormat(name=Lucene40WithOrds), n_tf1=Block(blocksize=128), n_dt1=PostingsFormat(name=Lucene40WithOrds), n_ti1=PostingsFormat(name=Asserting), range_facet_l=Block(blocksize=128), text=MockVariableIntBlock(baseBlockSize=73), _version_=Block(blocksize=128), SubjectTerms_mfacet=Block(blocksize=128), a_t=Block(blocksize=128), n_tdt1=Block(blocksize=128), other_tl1=Block(blocksize=128), n_l1=Block(blocksize=128), a_si=PostingsFormat(name=Lucene40WithOrds)}, sim=DefaultSimilarity, locale=sq_AL, timezone=Australia/Sydney
[junit4:junit4]   2> NOTE: FreeBSD 9.0-RELEASE amd64/Sun Microsystems Inc. 1.6.0_32 (64-bit)/cpus=16,threads=2,free=26780992,total=236388352
[junit4:junit4]   2> NOTE: All tests run in this JVM: [TestSort, IndexReaderFactoryTest, TestCodecSupport, TestHashPartitioner, IndexSchemaRuntimeFieldTest, DocumentBuilderTest, LukeRequestHandlerTest, TestRecovery, SignatureUpdateProcessorFactoryTest, TestDistributedGrouping, DebugComponentTest, DocumentAnalysisRequestHandlerTest, FileUtilsTest, ClusterStateUpdateTest, OpenExchangeRatesOrgProviderTest, TestOmitPositions, ZkNodePropsTest, SolrCoreTest, TestCSVLoader, TestDocSet, DOMUtilTest, FieldMutatingUpdateProcessorTest, TestReversedWildcardFilterFactory, TestRealTimeGet, TestCSVResponseWriter, ScriptEngineTest, PeerSyncTest, TestSurroundQueryParser, PolyFieldTest, TestFunctionQuery, EchoParamsTest, RecoveryZkTest, TestLRUCache, FullSolrCloudDistribCmdsTest, TestPropInjectDefaults, TestReplicationHandler, TestValueSourceCache, IndexSchemaTest, TestCollationKeyRangeQueries, UpdateParamsTest, TestSolrDeletionPolicy2, DirectSolrSpellCheckerTest, BasicDistributedZk2Test]
[junit4:junit4] Completed on J1 in 309.30s, 1 test, 1 failure <<< FAILURES!

[...truncated 381 lines...]
BUILD FAILED
/usr/home/hudson/hudson-slave/workspace/Lucene-Solr-Tests-4.x-Java6/build.xml:32: The following error occurred while executing this line:
/usr/home/hudson/hudson-slave/workspace/Lucene-Solr-Tests-4.x-Java6/solr/build.xml:179: The following error occurred while executing this line:
/usr/home/hudson/hudson-slave/workspace/Lucene-Solr-Tests-4.x-Java6/lucene/module-build.xml:63: The following error occurred while executing this line:
/usr/home/hudson/hudson-slave/workspace/Lucene-Solr-Tests-4.x-Java6/lucene/common-build.xml:1140: The following error occurred while executing this line:
/usr/home/hudson/hudson-slave/workspace/Lucene-Solr-Tests-4.x-Java6/lucene/common-build.xml:813: There were test failures: 231 suites, 954 tests, 1 failure, 7 ignored (2 assumptions)

Total time: 32 minutes 29 seconds
Build step 'Invoke Ant' marked build as failure
Recording test results
Email was triggered for: Failure
Sending email for trigger: Failure



Mime
View raw message