lucene-dev mailing list archives

Site index · List index
Message view « Date » · « Thread »
Top « Date » · « Thread »
From Apache Jenkins Server <jenk...@builds.apache.org>
Subject [JENKINS] Lucene-Solr-Tests-trunk-Java6 - Build # 15261 - Failure
Date Tue, 18 Sep 2012 20:46:56 GMT
Build: https://builds.apache.org/job/Lucene-Solr-Tests-trunk-Java6/15261/

1 tests failed.
REGRESSION:  org.apache.solr.cloud.BasicDistributedZk2Test.testDistribSearch

Error Message:
Shard still reported as live in zk

Stack Trace:
java.lang.AssertionError: Shard still reported as live in zk
	at __randomizedtesting.SeedInfo.seed([E5142CF4DC007F97:64F2A2ECAB5F1FAB]:0)
	at org.junit.Assert.fail(Assert.java:93)
	at org.apache.solr.cloud.AbstractFullDistribZkTestBase.waitToSeeNotLive(AbstractFullDistribZkTestBase.java:1220)
	at org.apache.solr.cloud.BasicDistributedZk2Test.brindDownShardIndexSomeDocsAndRecover(BasicDistributedZk2Test.java:190)
	at org.apache.solr.cloud.BasicDistributedZk2Test.doTest(BasicDistributedZk2Test.java:83)
	at org.apache.solr.BaseDistributedSearchTestCase.testDistribSearch(BaseDistributedSearchTestCase.java:695)
	at sun.reflect.NativeMethodAccessorImpl.invoke0(Native Method)
	at sun.reflect.NativeMethodAccessorImpl.invoke(NativeMethodAccessorImpl.java:57)
	at sun.reflect.DelegatingMethodAccessorImpl.invoke(DelegatingMethodAccessorImpl.java:43)
	at java.lang.reflect.Method.invoke(Method.java:616)
	at com.carrotsearch.randomizedtesting.RandomizedRunner.invoke(RandomizedRunner.java:1559)
	at com.carrotsearch.randomizedtesting.RandomizedRunner.access$600(RandomizedRunner.java:79)
	at com.carrotsearch.randomizedtesting.RandomizedRunner$6.evaluate(RandomizedRunner.java:737)
	at com.carrotsearch.randomizedtesting.RandomizedRunner$7.evaluate(RandomizedRunner.java:773)
	at com.carrotsearch.randomizedtesting.RandomizedRunner$8.evaluate(RandomizedRunner.java:787)
	at com.carrotsearch.randomizedtesting.rules.SystemPropertiesRestoreRule$1.evaluate(SystemPropertiesRestoreRule.java:53)
	at org.apache.lucene.util.TestRuleSetupTeardownChained$1.evaluate(TestRuleSetupTeardownChained.java:50)
	at org.apache.lucene.util.TestRuleFieldCacheSanity$1.evaluate(TestRuleFieldCacheSanity.java:51)
	at org.apache.lucene.util.AbstractBeforeAfterRule$1.evaluate(AbstractBeforeAfterRule.java:45)
	at com.carrotsearch.randomizedtesting.rules.SystemPropertiesInvariantRule$1.evaluate(SystemPropertiesInvariantRule.java:55)
	at org.apache.lucene.util.TestRuleThreadAndTestName$1.evaluate(TestRuleThreadAndTestName.java:48)
	at org.apache.lucene.util.TestRuleIgnoreAfterMaxFailures$1.evaluate(TestRuleIgnoreAfterMaxFailures.java:70)
	at org.apache.lucene.util.TestRuleMarkFailure$1.evaluate(TestRuleMarkFailure.java:48)
	at com.carrotsearch.randomizedtesting.rules.StatementAdapter.evaluate(StatementAdapter.java:36)
	at com.carrotsearch.randomizedtesting.ThreadLeakControl$StatementRunner.run(ThreadLeakControl.java:358)
	at com.carrotsearch.randomizedtesting.ThreadLeakControl.forkTimeoutingTask(ThreadLeakControl.java:782)
	at com.carrotsearch.randomizedtesting.ThreadLeakControl$3.evaluate(ThreadLeakControl.java:442)
	at com.carrotsearch.randomizedtesting.RandomizedRunner.runSingleTest(RandomizedRunner.java:746)
	at com.carrotsearch.randomizedtesting.RandomizedRunner$3.evaluate(RandomizedRunner.java:648)
	at com.carrotsearch.randomizedtesting.RandomizedRunner$4.evaluate(RandomizedRunner.java:682)
	at com.carrotsearch.randomizedtesting.RandomizedRunner$5.evaluate(RandomizedRunner.java:693)
	at com.carrotsearch.randomizedtesting.rules.StatementAdapter.evaluate(StatementAdapter.java:36)
	at com.carrotsearch.randomizedtesting.rules.SystemPropertiesRestoreRule$1.evaluate(SystemPropertiesRestoreRule.java:53)
	at org.apache.lucene.util.AbstractBeforeAfterRule$1.evaluate(AbstractBeforeAfterRule.java:45)
	at org.apache.lucene.util.TestRuleStoreClassName$1.evaluate(TestRuleStoreClassName.java:42)
	at com.carrotsearch.randomizedtesting.rules.SystemPropertiesInvariantRule$1.evaluate(SystemPropertiesInvariantRule.java:55)
	at com.carrotsearch.randomizedtesting.rules.NoShadowingOrOverridesOnMethodsRule$1.evaluate(NoShadowingOrOverridesOnMethodsRule.java:39)
	at com.carrotsearch.randomizedtesting.rules.NoShadowingOrOverridesOnMethodsRule$1.evaluate(NoShadowingOrOverridesOnMethodsRule.java:39)
	at com.carrotsearch.randomizedtesting.rules.StatementAdapter.evaluate(StatementAdapter.java:36)
	at org.apache.lucene.util.TestRuleAssertionsRequired$1.evaluate(TestRuleAssertionsRequired.java:43)
	at org.apache.lucene.util.TestRuleMarkFailure$1.evaluate(TestRuleMarkFailure.java:48)
	at org.apache.lucene.util.TestRuleIgnoreAfterMaxFailures$1.evaluate(TestRuleIgnoreAfterMaxFailures.java:70)
	at org.apache.lucene.util.TestRuleIgnoreTestSuites$1.evaluate(TestRuleIgnoreTestSuites.java:55)
	at com.carrotsearch.randomizedtesting.rules.StatementAdapter.evaluate(StatementAdapter.java:36)
	at com.carrotsearch.randomizedtesting.ThreadLeakControl$StatementRunner.run(ThreadLeakControl.java:358)
	at java.lang.Thread.run(Thread.java:679)




Build Log:
[...truncated 7296 lines...]
[junit4:junit4] Suite: org.apache.solr.cloud.BasicDistributedZk2Test
[junit4:junit4]   2> 3 T419 oas.SolrTestCaseJ4.setUp ###Starting testDistribSearch
[junit4:junit4]   2> Creating dataDir: /usr/home/hudson/hudson-slave/workspace/Lucene-Solr-Tests-trunk-Java6/solr/build/solr-core/test/J1/./solrtest-BasicDistributedZk2Test-1348000535501
[junit4:junit4]   2> 4 T419 oasc.ZkTestServer.run STARTING ZK TEST SERVER
[junit4:junit4]   2> 8 T420 oazs.ZooKeeperServer.setTickTime tickTime set to 1000
[junit4:junit4]   2> 8 T420 oazs.NIOServerCnxn$Factory.<init> binding to port 0.0.0.0/0.0.0.0:0
[junit4:junit4]   2> 9 T420 oazsp.FileTxnSnapLog.save Snapshotting: 0
[junit4:junit4]   2> 106 T419 oasc.ZkTestServer.run start zk server on port:57077
[junit4:junit4]   2> 106 T419 oaz.ZooKeeper.<init> Initiating client connection, connectString=127.0.0.1:57077 sessionTimeout=10000 watcher=org.apache.solr.common.cloud.ConnectionManager@250cf510
[junit4:junit4]   2> 107 T425 oaz.ClientCnxn$SendThread.startConnect Opening socket connection to server /127.0.0.1:57077
[junit4:junit4]   2> 109 T421 oazs.NIOServerCnxn$Factory.run Accepted socket connection from /140.211.11.196:30729
[junit4:junit4]   2> 133 T425 oaz.ClientCnxn$SendThread.primeConnection Socket connection established to localhost/127.0.0.1:57077, initiating session
[junit4:junit4]   2> 133 T419 oascc.ConnectionManager.waitForConnected Waiting for client to connect to ZooKeeper
[junit4:junit4]   2> 133 T421 oazs.NIOServerCnxn.readConnectRequest Client attempting to establish new session at /140.211.11.196:30729
[junit4:junit4]   2> 134 T423 oazsp.FileTxnLog.append Creating new log file: log.1
[junit4:junit4]   2> 162 T423 oazs.NIOServerCnxn.finishSessionInit Established session 0x139db17d3d30000 with negotiated timeout 10000 for client /140.211.11.196:30729
[junit4:junit4]   2> 162 T425 oaz.ClientCnxn$SendThread.readConnectResult Session establishment complete on server localhost/127.0.0.1:57077, sessionid = 0x139db17d3d30000, negotiated timeout = 10000
[junit4:junit4]   2> 162 T426 oascc.ConnectionManager.process Watcher org.apache.solr.common.cloud.ConnectionManager@250cf510 name:ZooKeeperConnection Watcher:127.0.0.1:57077 got event WatchedEvent state:SyncConnected type:None path:null path:null type:None
[junit4:junit4]   2> 163 T419 oascc.ConnectionManager.waitForConnected Client is connected to ZooKeeper
[junit4:junit4]   2> 163 T419 oascc.SolrZkClient.makePath makePath: /solr
[junit4:junit4]   2> 254 T424 oazs.PrepRequestProcessor.pRequest Processed session termination for sessionid: 0x139db17d3d30000
[junit4:junit4]   2> 304 T426 oaz.ClientCnxn$EventThread.run EventThread shut down
[junit4:junit4]   2> 304 T421 oazs.NIOServerCnxn.closeSock Closed socket connection for client /140.211.11.196:30729 which had sessionid 0x139db17d3d30000
[junit4:junit4]   2> 304 T419 oaz.ZooKeeper.close Session: 0x139db17d3d30000 closed
[junit4:junit4]   2> 305 T419 oaz.ZooKeeper.<init> Initiating client connection, connectString=127.0.0.1:57077/solr sessionTimeout=10000 watcher=org.apache.solr.common.cloud.ConnectionManager@35d1b58e
[junit4:junit4]   2> 306 T427 oaz.ClientCnxn$SendThread.startConnect Opening socket connection to server /127.0.0.1:57077
[junit4:junit4]   2> 306 T419 oascc.ConnectionManager.waitForConnected Waiting for client to connect to ZooKeeper
[junit4:junit4]   2> 307 T427 oaz.ClientCnxn$SendThread.primeConnection Socket connection established to localhost/127.0.0.1:57077, initiating session
[junit4:junit4]   2> 307 T421 oazs.NIOServerCnxn$Factory.run Accepted socket connection from /140.211.11.196:60241
[junit4:junit4]   2> 308 T421 oazs.NIOServerCnxn.readConnectRequest Client attempting to establish new session at /140.211.11.196:60241
[junit4:junit4]   2> 355 T423 oazs.NIOServerCnxn.finishSessionInit Established session 0x139db17d3d30001 with negotiated timeout 10000 for client /140.211.11.196:60241
[junit4:junit4]   2> 355 T427 oaz.ClientCnxn$SendThread.readConnectResult Session establishment complete on server localhost/127.0.0.1:57077, sessionid = 0x139db17d3d30001, negotiated timeout = 10000
[junit4:junit4]   2> 356 T428 oascc.ConnectionManager.process Watcher org.apache.solr.common.cloud.ConnectionManager@35d1b58e name:ZooKeeperConnection Watcher:127.0.0.1:57077/solr got event WatchedEvent state:SyncConnected type:None path:null path:null type:None
[junit4:junit4]   2> 356 T419 oascc.ConnectionManager.waitForConnected Client is connected to ZooKeeper
[junit4:junit4]   2> 357 T419 oascc.SolrZkClient.makePath makePath: /collections/collection1
[junit4:junit4]   2> 361 T419 oascc.SolrZkClient.makePath makePath: /collections/collection1/shards
[junit4:junit4]   2> 397 T419 oascc.SolrZkClient.makePath makePath: /collections/control_collection
[junit4:junit4]   2> 400 T419 oascc.SolrZkClient.makePath makePath: /collections/control_collection/shards
[junit4:junit4]   2> 403 T419 oasc.AbstractZkTestCase.putConfig put /usr/home/hudson/hudson-slave/workspace/Lucene-Solr-Tests-trunk-Java6/solr/build/solr-core/test-files/solr/collection1/conf/solrconfig.xml to /configs/conf1/solrconfig.xml
[junit4:junit4]   2> 404 T419 oascc.SolrZkClient.makePath makePath: /configs/conf1/solrconfig.xml
[junit4:junit4]   2> 426 T419 oasc.AbstractZkTestCase.putConfig put /usr/home/hudson/hudson-slave/workspace/Lucene-Solr-Tests-trunk-Java6/solr/build/solr-core/test-files/solr/collection1/conf/schema.xml to /configs/conf1/schema.xml
[junit4:junit4]   2> 427 T419 oascc.SolrZkClient.makePath makePath: /configs/conf1/schema.xml
[junit4:junit4]   2> 542 T419 oasc.AbstractZkTestCase.putConfig put /usr/home/hudson/hudson-slave/workspace/Lucene-Solr-Tests-trunk-Java6/solr/build/solr-core/test-files/solr/collection1/conf/solrconfig.xml to /configs/conf1/solrconfig.xml
[junit4:junit4]   2> 543 T419 oascc.SolrZkClient.makePath makePath: /configs/conf1/solrconfig.xml
[junit4:junit4]   2> 556 T419 oasc.AbstractZkTestCase.putConfig put /usr/home/hudson/hudson-slave/workspace/Lucene-Solr-Tests-trunk-Java6/solr/build/solr-core/test-files/solr/collection1/conf/stopwords.txt to /configs/conf1/stopwords.txt
[junit4:junit4]   2> 557 T419 oascc.SolrZkClient.makePath makePath: /configs/conf1/stopwords.txt
[junit4:junit4]   2> 567 T419 oasc.AbstractZkTestCase.putConfig put /usr/home/hudson/hudson-slave/workspace/Lucene-Solr-Tests-trunk-Java6/solr/build/solr-core/test-files/solr/collection1/conf/protwords.txt to /configs/conf1/protwords.txt
[junit4:junit4]   2> 567 T419 oascc.SolrZkClient.makePath makePath: /configs/conf1/protwords.txt
[junit4:junit4]   2> 573 T419 oasc.AbstractZkTestCase.putConfig put /usr/home/hudson/hudson-slave/workspace/Lucene-Solr-Tests-trunk-Java6/solr/build/solr-core/test-files/solr/collection1/conf/currency.xml to /configs/conf1/currency.xml
[junit4:junit4]   2> 573 T419 oascc.SolrZkClient.makePath makePath: /configs/conf1/currency.xml
[junit4:junit4]   2> 581 T419 oasc.AbstractZkTestCase.putConfig put /usr/home/hudson/hudson-slave/workspace/Lucene-Solr-Tests-trunk-Java6/solr/build/solr-core/test-files/solr/collection1/conf/open-exchange-rates.json to /configs/conf1/open-exchange-rates.json
[junit4:junit4]   2> 581 T419 oascc.SolrZkClient.makePath makePath: /configs/conf1/open-exchange-rates.json
[junit4:junit4]   2> 588 T419 oasc.AbstractZkTestCase.putConfig put /usr/home/hudson/hudson-slave/workspace/Lucene-Solr-Tests-trunk-Java6/solr/build/solr-core/test-files/solr/collection1/conf/mapping-ISOLatin1Accent.txt to /configs/conf1/mapping-ISOLatin1Accent.txt
[junit4:junit4]   2> 589 T419 oascc.SolrZkClient.makePath makePath: /configs/conf1/mapping-ISOLatin1Accent.txt
[junit4:junit4]   2> 599 T419 oasc.AbstractZkTestCase.putConfig put /usr/home/hudson/hudson-slave/workspace/Lucene-Solr-Tests-trunk-Java6/solr/build/solr-core/test-files/solr/collection1/conf/old_synonyms.txt to /configs/conf1/old_synonyms.txt
[junit4:junit4]   2> 600 T419 oascc.SolrZkClient.makePath makePath: /configs/conf1/old_synonyms.txt
[junit4:junit4]   2> 609 T419 oasc.AbstractZkTestCase.putConfig put /usr/home/hudson/hudson-slave/workspace/Lucene-Solr-Tests-trunk-Java6/solr/build/solr-core/test-files/solr/collection1/conf/synonyms.txt to /configs/conf1/synonyms.txt
[junit4:junit4]   2> 609 T419 oascc.SolrZkClient.makePath makePath: /configs/conf1/synonyms.txt
[junit4:junit4]   2> 617 T424 oazs.PrepRequestProcessor.pRequest Processed session termination for sessionid: 0x139db17d3d30001
[junit4:junit4]   2> 628 T428 oaz.ClientCnxn$EventThread.run EventThread shut down
[junit4:junit4]   2> 628 T419 oaz.ZooKeeper.close Session: 0x139db17d3d30001 closed
[junit4:junit4]   2> 628 T421 oazs.NIOServerCnxn.closeSock Closed socket connection for client /140.211.11.196:60241 which had sessionid 0x139db17d3d30001
[junit4:junit4]   2> 631 T419 oejs.Server.doStart jetty-8.1.2.v20120308
[junit4:junit4]   2> 634 T419 oejs.AbstractConnector.doStart Started SocketConnector@0.0.0.0:61533
[junit4:junit4]   2> 635 T419 oasc.SolrResourceLoader.locateSolrHome JNDI not configured for solr (NoInitialContextEx)
[junit4:junit4]   2> 636 T419 oasc.SolrResourceLoader.locateSolrHome using system property solr.solr.home: /usr/home/hudson/hudson-slave/workspace/Lucene-Solr-Tests-trunk-Java6/solr/build/solr-core/test-files/solr
[junit4:junit4]   2> 636 T419 oasc.SolrResourceLoader.<init> new SolrResourceLoader for deduced Solr Home: '/usr/home/hudson/hudson-slave/workspace/Lucene-Solr-Tests-trunk-Java6/solr/build/solr-core/test-files/solr/'
[junit4:junit4]   2> 665 T419 oass.SolrDispatchFilter.init SolrDispatchFilter.init()
[junit4:junit4]   2> 665 T419 oasc.SolrResourceLoader.locateSolrHome JNDI not configured for solr (NoInitialContextEx)
[junit4:junit4]   2> 666 T419 oasc.SolrResourceLoader.locateSolrHome using system property solr.solr.home: /usr/home/hudson/hudson-slave/workspace/Lucene-Solr-Tests-trunk-Java6/solr/build/solr-core/test-files/solr
[junit4:junit4]   2> 666 T419 oasc.CoreContainer$Initializer.initialize looking for solr.xml: /usr/home/hudson/hudson-slave/workspace/Lucene-Solr-Tests-trunk-Java6/solr/build/solr-core/test-files/solr/solr.xml
[junit4:junit4]   2> 667 T419 oasc.CoreContainer.<init> New CoreContainer 648924468
[junit4:junit4]   2> 667 T419 oasc.CoreContainer.load Loading CoreContainer using Solr Home: '/usr/home/hudson/hudson-slave/workspace/Lucene-Solr-Tests-trunk-Java6/solr/build/solr-core/test-files/solr/'
[junit4:junit4]   2> 668 T419 oasc.SolrResourceLoader.<init> new SolrResourceLoader for directory: '/usr/home/hudson/hudson-slave/workspace/Lucene-Solr-Tests-trunk-Java6/solr/build/solr-core/test-files/solr/'
[junit4:junit4]   2> 694 T419 oasc.CoreContainer.load Registering Log Listener
[junit4:junit4]   2> 710 T419 oasc.CoreContainer.initZooKeeper Zookeeper client=127.0.0.1:57077/solr
[junit4:junit4]   2> 710 T419 oaz.ZooKeeper.<init> Initiating client connection, connectString=127.0.0.1:57077/solr sessionTimeout=5000 watcher=org.apache.solr.common.cloud.ConnectionManager@18aa6bfd
[junit4:junit4]   2> 711 T438 oaz.ClientCnxn$SendThread.startConnect Opening socket connection to server /127.0.0.1:57077
[junit4:junit4]   2> 711 T419 oascc.ConnectionManager.waitForConnected Waiting for client to connect to ZooKeeper
[junit4:junit4]   2> 713 T438 oaz.ClientCnxn$SendThread.primeConnection Socket connection established to localhost/127.0.0.1:57077, initiating session
[junit4:junit4]   2> 713 T421 oazs.NIOServerCnxn$Factory.run Accepted socket connection from /140.211.11.196:61200
[junit4:junit4]   2> 713 T421 oazs.NIOServerCnxn.readConnectRequest Client attempting to establish new session at /140.211.11.196:61200
[junit4:junit4]   2> 716 T423 oazs.NIOServerCnxn.finishSessionInit Established session 0x139db17d3d30002 with negotiated timeout 5000 for client /140.211.11.196:61200
[junit4:junit4]   2> 716 T438 oaz.ClientCnxn$SendThread.readConnectResult Session establishment complete on server localhost/127.0.0.1:57077, sessionid = 0x139db17d3d30002, negotiated timeout = 5000
[junit4:junit4]   2> 716 T439 oascc.ConnectionManager.process Watcher org.apache.solr.common.cloud.ConnectionManager@18aa6bfd name:ZooKeeperConnection Watcher:127.0.0.1:57077/solr got event WatchedEvent state:SyncConnected type:None path:null path:null type:None
[junit4:junit4]   2> 716 T419 oascc.ConnectionManager.waitForConnected Client is connected to ZooKeeper
[junit4:junit4]   2> 730 T424 oazs.PrepRequestProcessor.pRequest Got user-level KeeperException when processing sessionid:0x139db17d3d30002 type:create cxid:0x2 zxid:0xfffffffffffffffe txntype:unknown reqpath:n/a Error Path:/solr/overseer Error:KeeperErrorCode = NodeExists for /solr/overseer
[junit4:junit4]   2> 732 T419 oascc.SolrZkClient.makePath makePath: /live_nodes
[junit4:junit4]   2> 734 T419 oasc.ZkController.createEphemeralLiveNode Register node as live in ZooKeeper:/live_nodes/127.0.0.1:61533_solr
[junit4:junit4]   2> 735 T424 oazs.PrepRequestProcessor.pRequest Got user-level KeeperException when processing sessionid:0x139db17d3d30002 type:delete cxid:0x7 zxid:0xfffffffffffffffe txntype:unknown reqpath:n/a Error Path:/solr/live_nodes/127.0.0.1:61533_solr Error:KeeperErrorCode = NoNode for /solr/live_nodes/127.0.0.1:61533_solr
[junit4:junit4]   2> 736 T419 oascc.SolrZkClient.makePath makePath: /live_nodes/127.0.0.1:61533_solr
[junit4:junit4]   2> 746 T419 oashc.HttpShardHandlerFactory.getParameter Setting socketTimeout to: 0
[junit4:junit4]   2> 747 T419 oashc.HttpShardHandlerFactory.getParameter Setting urlScheme to: http://
[junit4:junit4]   2> 747 T419 oashc.HttpShardHandlerFactory.getParameter Setting connTimeout to: 0
[junit4:junit4]   2> 748 T419 oashc.HttpShardHandlerFactory.getParameter Setting maxConnectionsPerHost to: 20
[junit4:junit4]   2> 748 T419 oashc.HttpShardHandlerFactory.getParameter Setting corePoolSize to: 0
[junit4:junit4]   2> 749 T419 oashc.HttpShardHandlerFactory.getParameter Setting maximumPoolSize to: 2147483647
[junit4:junit4]   2> 749 T419 oashc.HttpShardHandlerFactory.getParameter Setting maxThreadIdleTime to: 5
[junit4:junit4]   2> 750 T419 oashc.HttpShardHandlerFactory.getParameter Setting sizeOfQueue to: -1
[junit4:junit4]   2> 750 T419 oashc.HttpShardHandlerFactory.getParameter Setting fairnessPolicy to: false
[junit4:junit4]   2> 751 T419 oascsi.HttpClientUtil.createClient Creating new http client, config:maxConnectionsPerHost=20&maxConnections=10000&socketTimeout=0&connTimeout=0&retry=false
[junit4:junit4]   2> 771 T419 oascc.SolrZkClient.makePath makePath: /overseer_elect/election
[junit4:junit4]   2> 781 T424 oazs.PrepRequestProcessor.pRequest Got user-level KeeperException when processing sessionid:0x139db17d3d30002 type:delete cxid:0x15 zxid:0xfffffffffffffffe txntype:unknown reqpath:n/a Error Path:/solr/overseer_elect/leader Error:KeeperErrorCode = NoNode for /solr/overseer_elect/leader
[junit4:junit4]   2> 788 T419 oascc.SolrZkClient.makePath makePath: /overseer_elect/leader
[junit4:junit4]   2> 790 T419 oasc.Overseer.start Overseer (id=88342563094986754-127.0.0.1:61533_solr-n_0000000000) starting
[junit4:junit4]   2> 791 T424 oazs.PrepRequestProcessor.pRequest Got user-level KeeperException when processing sessionid:0x139db17d3d30002 type:create cxid:0x1a zxid:0xfffffffffffffffe txntype:unknown reqpath:n/a Error Path:/solr/overseer Error:KeeperErrorCode = NodeExists for /solr/overseer
[junit4:junit4]   2> 793 T424 oazs.PrepRequestProcessor.pRequest Got user-level KeeperException when processing sessionid:0x139db17d3d30002 type:create cxid:0x1b zxid:0xfffffffffffffffe txntype:unknown reqpath:n/a Error Path:/solr/overseer Error:KeeperErrorCode = NodeExists for /solr/overseer
[junit4:junit4]   2> 799 T424 oazs.PrepRequestProcessor.pRequest Got user-level KeeperException when processing sessionid:0x139db17d3d30002 type:create cxid:0x1c zxid:0xfffffffffffffffe txntype:unknown reqpath:n/a Error Path:/solr/overseer Error:KeeperErrorCode = NodeExists for /solr/overseer
[junit4:junit4]   2> 801 T424 oazs.PrepRequestProcessor.pRequest Got user-level KeeperException when processing sessionid:0x139db17d3d30002 type:create cxid:0x1d zxid:0xfffffffffffffffe txntype:unknown reqpath:n/a Error Path:/solr/overseer Error:KeeperErrorCode = NodeExists for /solr/overseer
[junit4:junit4]   2> 808 T441 oasc.OverseerCollectionProcessor.run Process current queue of collection creations
[junit4:junit4]   2> 808 T419 oascc.SolrZkClient.makePath makePath: /clusterstate.json
[junit4:junit4]   2> 812 T419 oascc.ZkStateReader.createClusterStateWatchersAndUpdate Updating cluster state from ZooKeeper... 
[junit4:junit4]   2> 814 T440 oasc.Overseer$ClusterStateUpdater.run Starting to work on the main queue
[junit4:junit4]   2> 819 T419 oasc.CoreContainer.create Creating SolrCore 'collection1' using instanceDir: /usr/home/hudson/hudson-slave/workspace/Lucene-Solr-Tests-trunk-Java6/solr/build/solr-core/test-files/solr/collection1
[junit4:junit4]   2> 820 T419 oasc.ZkController.createCollectionZkNode Check for collection zkNode:control_collection
[junit4:junit4]   2> 821 T419 oasc.ZkController.createCollectionZkNode Collection zkNode exists
[junit4:junit4]   2> 821 T419 oasc.ZkController.readConfigName Load collection config from:/collections/control_collection
[junit4:junit4]   2> 823 T419 oasc.SolrResourceLoader.<init> new SolrResourceLoader for directory: '/usr/home/hudson/hudson-slave/workspace/Lucene-Solr-Tests-trunk-Java6/solr/build/solr-core/test-files/solr/collection1/'
[junit4:junit4]   2> 824 T419 oasc.SolrResourceLoader.replaceClassLoader Adding 'file:/usr/home/hudson/hudson-slave/workspace/Lucene-Solr-Tests-trunk-Java6/solr/build/solr-core/test-files/solr/collection1/lib/classes/' to classloader
[junit4:junit4]   2> 825 T419 oasc.SolrResourceLoader.replaceClassLoader Adding 'file:/usr/home/hudson/hudson-slave/workspace/Lucene-Solr-Tests-trunk-Java6/solr/build/solr-core/test-files/solr/collection1/lib/README' to classloader
[junit4:junit4]   2> 885 T419 oasc.SolrConfig.<init> Using Lucene MatchVersion: LUCENE_50
[junit4:junit4]   2> 958 T419 oasc.SolrConfig.<init> Loaded SolrConfig: solrconfig.xml
[junit4:junit4]   2> 1059 T419 oass.IndexSchema.readSchema Reading Solr Schema
[junit4:junit4]   2> 1065 T419 oass.IndexSchema.readSchema Schema name=test
[junit4:junit4]   2> 1704 T419 oass.OpenExchangeRatesOrgProvider.init Initialized with rates=open-exchange-rates.json, refreshInterval=1440.
[junit4:junit4]   2> 1715 T419 oass.IndexSchema.readSchema default search field in schema is text
[junit4:junit4]   2> 1720 T419 oass.IndexSchema.readSchema unique key field: id
[junit4:junit4]   2> 1734 T419 oass.FileExchangeRateProvider.reload Reloading exchange rates from file currency.xml
[junit4:junit4]   2> 1739 T419 oass.FileExchangeRateProvider.reload Reloading exchange rates from file currency.xml
[junit4:junit4]   2> 1743 T419 oass.OpenExchangeRatesOrgProvider.reload Reloading exchange rates from open-exchange-rates.json
[junit4:junit4]   2> 1745 T419 oass.OpenExchangeRatesOrgProvider.reload Reloading exchange rates from open-exchange-rates.json
[junit4:junit4]   2> 1746 T419 oasc.SolrCore.<init> [collection1] Opening new SolrCore at /usr/home/hudson/hudson-slave/workspace/Lucene-Solr-Tests-trunk-Java6/solr/build/solr-core/test-files/solr/collection1/, dataDir=./org.apache.solr.cloud.BasicDistributedZk2Test-1348000535500/control/data/
[junit4:junit4]   2> 1747 T419 oasc.JmxMonitoredMap.<init> JMX monitoring is enabled. Adding Solr mbeans to JMX Server: com.sun.jmx.mbeanserver.JmxMBeanServer@7219d6af
[junit4:junit4]   2> 1781 T419 oasc.SolrCore.getNewIndexDir WARNING New index directory detected: old=null new=./org.apache.solr.cloud.BasicDistributedZk2Test-1348000535500/control/data/index/
[junit4:junit4]   2> 1782 T419 oasc.SolrCore.initIndex WARNING [collection1] Solr index directory './org.apache.solr.cloud.BasicDistributedZk2Test-1348000535500/control/data/index' doesn't exist. Creating new index...
[junit4:junit4]   2> 1783 T419 oasc.CachingDirectoryFactory.get return new directory for /usr/home/hudson/hudson-slave/workspace/Lucene-Solr-Tests-trunk-Java6/solr/build/solr-core/test/J1/./org.apache.solr.cloud.BasicDistributedZk2Test-1348000535500/control/data/index forceNew:false
[junit4:junit4]   2> 1795 T419 oasc.SolrDeletionPolicy.onCommit SolrDeletionPolicy.onCommit: commits:num=1
[junit4:junit4]   2> 		commit{dir=NRTCachingDirectory(org.apache.lucene.store.NIOFSDirectory@/usr/home/hudson/hudson-slave/workspace/Lucene-Solr-Tests-trunk-Java6/solr/build/solr-core/test/J1/org.apache.solr.cloud.BasicDistributedZk2Test-1348000535500/control/data/index lockFactory=org.apache.lucene.store.NativeFSLockFactory@19676aa8; maxCacheMB=48.0 maxMergeSizeMB=4.0),segFN=segments_1,generation=1,filenames=[segments_1]
[junit4:junit4]   2> 1795 T419 oasc.SolrDeletionPolicy.updateCommits newest commit = 1
[junit4:junit4]   2> 1796 T419 oasc.SolrCore.initWriters created xml: solr.XMLResponseWriter
[junit4:junit4]   2> 1799 T419 oasup.UpdateRequestProcessorChain.init inserting DistributedUpdateProcessorFactory into updateRequestProcessorChain "dedupe"
[junit4:junit4]   2> 1799 T419 oasup.UpdateRequestProcessorChain.init inserting DistributedUpdateProcessorFactory into updateRequestProcessorChain "dedupe-allfields"
[junit4:junit4]   2> 1800 T419 oasup.UpdateRequestProcessorChain.init inserting DistributedUpdateProcessorFactory into updateRequestProcessorChain "stored_sig"
[junit4:junit4]   2> 1800 T419 oasup.UpdateRequestProcessorChain.init inserting DistributedUpdateProcessorFactory into updateRequestProcessorChain "uniq-fields"
[junit4:junit4]   2> 1801 T419 oasup.UpdateRequestProcessorChain.init inserting DistributedUpdateProcessorFactory into updateRequestProcessorChain "distrib-dup-test-chain-implicit"
[junit4:junit4]   2> 1801 T419 oasc.RequestHandlers.initHandlersFromConfig adding lazy requestHandler: solr.ReplicationHandler
[junit4:junit4]   2> 1802 T419 oasc.RequestHandlers.initHandlersFromConfig created /replication: solr.ReplicationHandler
[junit4:junit4]   2> 1803 T419 oasc.RequestHandlers.initHandlersFromConfig created standard: solr.StandardRequestHandler
[junit4:junit4]   2> 1803 T419 oasc.RequestHandlers.initHandlersFromConfig created /get: solr.RealTimeGetHandler
[junit4:junit4]   2> 1804 T419 oasc.RequestHandlers.initHandlersFromConfig created dismax: solr.SearchHandler
[junit4:junit4]   2> 1805 T419 oasc.RequestHandlers.initHandlersFromConfig created mock: org.apache.solr.core.MockQuerySenderListenerReqHandler
[junit4:junit4]   2> 1805 T419 oasc.RequestHandlers.initHandlersFromConfig created /admin/: org.apache.solr.handler.admin.AdminHandlers
[junit4:junit4]   2> 1806 T419 oasc.RequestHandlers.initHandlersFromConfig created defaults: solr.StandardRequestHandler
[junit4:junit4]   2> 1806 T419 oasc.RequestHandlers.initHandlersFromConfig adding lazy requestHandler: solr.StandardRequestHandler
[junit4:junit4]   2> 1807 T419 oasc.RequestHandlers.initHandlersFromConfig created lazy: solr.StandardRequestHandler
[junit4:junit4]   2> 1807 T419 oasc.RequestHandlers.initHandlersFromConfig created /update: solr.UpdateRequestHandler
[junit4:junit4]   2> 1808 T419 oasc.RequestHandlers.initHandlersFromConfig created /terms: org.apache.solr.handler.component.SearchHandler
[junit4:junit4]   2> 1809 T419 oasc.RequestHandlers.initHandlersFromConfig created spellCheckCompRH: org.apache.solr.handler.component.SearchHandler
[junit4:junit4]   2> 1809 T419 oasc.RequestHandlers.initHandlersFromConfig created spellCheckCompRH_Direct: org.apache.solr.handler.component.SearchHandler
[junit4:junit4]   2> 1810 T419 oasc.RequestHandlers.initHandlersFromConfig created spellCheckWithWordbreak: org.apache.solr.handler.component.SearchHandler
[junit4:junit4]   2> 1811 T419 oasc.RequestHandlers.initHandlersFromConfig created spellCheckWithWordbreak_Direct: org.apache.solr.handler.component.SearchHandler
[junit4:junit4]   2> 1811 T419 oasc.RequestHandlers.initHandlersFromConfig created spellCheckCompRH1: org.apache.solr.handler.component.SearchHandler
[junit4:junit4]   2> 1812 T419 oasc.RequestHandlers.initHandlersFromConfig created tvrh: org.apache.solr.handler.component.SearchHandler
[junit4:junit4]   2> 1812 T419 oasc.RequestHandlers.initHandlersFromConfig created /mlt: solr.MoreLikeThisHandler
[junit4:junit4]   2> 1813 T419 oasc.RequestHandlers.initHandlersFromConfig created /debug/dump: solr.DumpRequestHandler
[junit4:junit4]   2> 1817 T419 oashl.XMLLoader.init xsltCacheLifetimeSeconds=60
[junit4:junit4]   2> 1822 T419 oasc.SolrCore.initDeprecatedSupport WARNING solrconfig.xml uses deprecated <admin/gettableFiles>, Please update your config to use the ShowFileRequestHandler.
[junit4:junit4]   2> 1823 T419 oasc.SolrCore.initDeprecatedSupport WARNING adding ShowFileRequestHandler with hidden files: [SCHEMA.XML, OLD_SYNONYMS.TXT, STOPWORDS.TXT, PROTWORDS.TXT, OPEN-EXCHANGE-RATES.JSON, SYNONYMS.TXT, CURRENCY.XML, MAPPING-ISOLATIN1ACCENT.TXT]
[junit4:junit4]   2> 1827 T419 oass.SolrIndexSearcher.<init> Opening Searcher@5551516b main
[junit4:junit4]   2> 1829 T419 oasu.CommitTracker.<init> Hard AutoCommit: disabled
[junit4:junit4]   2> 1829 T419 oasu.CommitTracker.<init> Soft AutoCommit: disabled
[junit4:junit4]   2> 1830 T419 oashc.SpellCheckComponent.inform Initializing spell checkers
[junit4:junit4]   2> 1847 T419 oass.DirectSolrSpellChecker.init init: {name=direct,classname=DirectSolrSpellChecker,field=lowerfilt,minQueryLength=3}
[junit4:junit4]   2> 1926 T442 oasc.SolrCore.registerSearcher [collection1] Registered new searcher Searcher@5551516b main{StandardDirectoryReader(segments_1:1)}
[junit4:junit4]   2> 1931 T424 oazs.PrepRequestProcessor.pRequest Got user-level KeeperException when processing sessionid:0x139db17d3d30002 type:create cxid:0x56 zxid:0xfffffffffffffffe txntype:unknown reqpath:n/a Error Path:/solr/overseer/queue Error:KeeperErrorCode = NoNode for /solr/overseer/queue
[junit4:junit4]   2> 1934 T419 oasc.CoreContainer.register registering core: collection1
[junit4:junit4]   2> 1935 T419 oasc.ZkController.register Register shard - core:collection1 address:http://127.0.0.1:61533/solr shardId:control_shard
[junit4:junit4]   2> 1936 T419 oascc.SolrZkClient.makePath makePath: /collections/control_collection/leader_elect/control_shard/election
[junit4:junit4]   2> 1953 T424 oazs.PrepRequestProcessor.pRequest Got user-level KeeperException when processing sessionid:0x139db17d3d30002 type:delete cxid:0x65 zxid:0xfffffffffffffffe txntype:unknown reqpath:n/a Error Path:/solr/collections/control_collection/leaders Error:KeeperErrorCode = NoNode for /solr/collections/control_collection/leaders
[junit4:junit4]   2> 1954 T419 oasc.ShardLeaderElectionContext.runLeaderProcess Running the leader process.
[junit4:junit4]   2> 1954 T424 oazs.PrepRequestProcessor.pRequest Got user-level KeeperException when processing sessionid:0x139db17d3d30002 type:create cxid:0x66 zxid:0xfffffffffffffffe txntype:unknown reqpath:n/a Error Path:/solr/overseer Error:KeeperErrorCode = NodeExists for /solr/overseer
[junit4:junit4]   2> 2321 T440 oascc.ZkStateReader.updateClusterState Updating cloud state from ZooKeeper... 
[junit4:junit4]   2> 2322 T424 oazs.PrepRequestProcessor.pRequest Got user-level KeeperException when processing sessionid:0x139db17d3d30002 type:create cxid:0x6d zxid:0xfffffffffffffffe txntype:unknown reqpath:n/a Error Path:/solr/overseer/queue-work Error:KeeperErrorCode = NoNode for /solr/overseer/queue-work
[junit4:junit4]   2> 2361 T439 oascc.ZkStateReader$2.process A cluster state change has occurred - updating...
[junit4:junit4]   2> 2465 T419 oasc.ShardLeaderElectionContext.waitForReplicasToComeUp Enough replicas found to continue.
[junit4:junit4]   2> 2466 T419 oasc.ShardLeaderElectionContext.runLeaderProcess I may be the new leader - try and sync
[junit4:junit4]   2> 2466 T419 oasc.SyncStrategy.sync Sync replicas to http://127.0.0.1:61533/solr/collection1/
[junit4:junit4]   2> 2467 T419 oasc.SyncStrategy.syncReplicas Sync Success - now sync replicas to me
[junit4:junit4]   2> 2467 T419 oasc.SyncStrategy.syncToMe http://127.0.0.1:61533/solr/collection1/ has no replicas
[junit4:junit4]   2> 2468 T419 oasc.ShardLeaderElectionContext.runLeaderProcess I am the new leader: http://127.0.0.1:61533/solr/collection1/
[junit4:junit4]   2> 2468 T419 oascc.SolrZkClient.makePath makePath: /collections/control_collection/leaders/control_shard
[junit4:junit4]   2> 2485 T424 oazs.PrepRequestProcessor.pRequest Got user-level KeeperException when processing sessionid:0x139db17d3d30002 type:create cxid:0x8b zxid:0xfffffffffffffffe txntype:unknown reqpath:n/a Error Path:/solr/overseer Error:KeeperErrorCode = NodeExists for /solr/overseer
[junit4:junit4]   2> 2868 T440 oascc.ZkStateReader.updateClusterState Updating cloud state from ZooKeeper... 
[junit4:junit4]   2> 2872 T439 oascc.ZkStateReader$2.process A cluster state change has occurred - updating...
[junit4:junit4]   2> 2909 T419 oasc.ZkController.register We are http://127.0.0.1:61533/solr/collection1/ and leader is http://127.0.0.1:61533/solr/collection1/
[junit4:junit4]   2> 2909 T419 oasc.ZkController.register No LogReplay needed for core=collection1 baseURL=http://127.0.0.1:61533/solr
[junit4:junit4]   2> 2910 T419 oasc.ZkController.checkRecovery I am the leader, no recovery necessary
[junit4:junit4]   2> 2912 T419 oascc.ZkStateReader.updateClusterState Updating cloud state from ZooKeeper... 
[junit4:junit4]   2> 2913 T419 oass.SolrDispatchFilter.init user.dir=/usr/home/hudson/hudson-slave/workspace/Lucene-Solr-Tests-trunk-Java6/solr/build/solr-core/test/J1
[junit4:junit4]   2> 2914 T419 oass.SolrDispatchFilter.init SolrDispatchFilter.init() done
[junit4:junit4]   2> 2914 T419 oascsi.HttpClientUtil.createClient Creating new http client, config:maxConnections=128&maxConnectionsPerHost=32&followRedirects=false
[junit4:junit4]   2> 3093 T419 oejs.Server.doStart jetty-8.1.2.v20120308
[junit4:junit4]   2> 3096 T419 oejs.AbstractConnector.doStart Started SocketConnector@0.0.0.0:42000
[junit4:junit4]   2> 3097 T419 oasc.SolrResourceLoader.locateSolrHome JNDI not configured for solr (NoInitialContextEx)
[junit4:junit4]   2> 3097 T419 oasc.SolrResourceLoader.locateSolrHome using system property solr.solr.home: /usr/home/hudson/hudson-slave/workspace/Lucene-Solr-Tests-trunk-Java6/solr/build/solr-core/test/J1/./solrtest-jetty1-1348000538427
[junit4:junit4]   2> 3098 T419 oasc.SolrResourceLoader.<init> new SolrResourceLoader for deduced Solr Home: '/usr/home/hudson/hudson-slave/workspace/Lucene-Solr-Tests-trunk-Java6/solr/build/solr-core/test/J1/./solrtest-jetty1-1348000538427/'
[junit4:junit4]   2> 3136 T419 oass.SolrDispatchFilter.init SolrDispatchFilter.init()
[junit4:junit4]   2> 3137 T419 oasc.SolrResourceLoader.locateSolrHome JNDI not configured for solr (NoInitialContextEx)
[junit4:junit4]   2> 3137 T419 oasc.SolrResourceLoader.locateSolrHome using system property solr.solr.home: /usr/home/hudson/hudson-slave/workspace/Lucene-Solr-Tests-trunk-Java6/solr/build/solr-core/test/J1/./solrtest-jetty1-1348000538427
[junit4:junit4]   2> 3138 T419 oasc.CoreContainer$Initializer.initialize looking for solr.xml: /usr/home/hudson/hudson-slave/workspace/Lucene-Solr-Tests-trunk-Java6/solr/build/solr-core/test/J1/./solrtest-jetty1-1348000538427/solr.xml
[junit4:junit4]   2> 3138 T419 oasc.CoreContainer.<init> New CoreContainer 1778018115
[junit4:junit4]   2> 3139 T419 oasc.CoreContainer.load Loading CoreContainer using Solr Home: '/usr/home/hudson/hudson-slave/workspace/Lucene-Solr-Tests-trunk-Java6/solr/build/solr-core/test/J1/./solrtest-jetty1-1348000538427/'
[junit4:junit4]   2> 3140 T419 oasc.SolrResourceLoader.<init> new SolrResourceLoader for directory: '/usr/home/hudson/hudson-slave/workspace/Lucene-Solr-Tests-trunk-Java6/solr/build/solr-core/test/J1/./solrtest-jetty1-1348000538427/'
[junit4:junit4]   2> 3165 T419 oasc.CoreContainer.load Registering Log Listener
[junit4:junit4]   2> 3181 T419 oasc.CoreContainer.initZooKeeper Zookeeper client=127.0.0.1:57077/solr
[junit4:junit4]   2> 3181 T419 oaz.ZooKeeper.<init> Initiating client connection, connectString=127.0.0.1:57077/solr sessionTimeout=5000 watcher=org.apache.solr.common.cloud.ConnectionManager@1013106d
[junit4:junit4]   2> 3182 T452 oaz.ClientCnxn$SendThread.startConnect Opening socket connection to server /127.0.0.1:57077
[junit4:junit4]   2> 3182 T419 oascc.ConnectionManager.waitForConnected Waiting for client to connect to ZooKeeper
[junit4:junit4]   2> 3184 T452 oaz.ClientCnxn$SendThread.primeConnection Socket connection established to localhost/127.0.0.1:57077, initiating session
[junit4:junit4]   2> 3184 T421 oazs.NIOServerCnxn$Factory.run Accepted socket connection from /140.211.11.196:61865
[junit4:junit4]   2> 3184 T421 oazs.NIOServerCnxn.readConnectRequest Client attempting to establish new session at /140.211.11.196:61865
[junit4:junit4]   2> 3195 T423 oazs.NIOServerCnxn.finishSessionInit Established session 0x139db17d3d30003 with negotiated timeout 5000 for client /140.211.11.196:61865
[junit4:junit4]   2> 3195 T452 oaz.ClientCnxn$SendThread.readConnectResult Session establishment complete on server localhost/127.0.0.1:57077, sessionid = 0x139db17d3d30003, negotiated timeout = 5000
[junit4:junit4]   2> 3195 T453 oascc.ConnectionManager.process Watcher org.apache.solr.common.cloud.ConnectionManager@1013106d name:ZooKeeperConnection Watcher:127.0.0.1:57077/solr got event WatchedEvent state:SyncConnected type:None path:null path:null type:None
[junit4:junit4]   2> 3195 T419 oascc.ConnectionManager.waitForConnected Client is connected to ZooKeeper
[junit4:junit4]   2> 3196 T424 oazs.PrepRequestProcessor.pRequest Got user-level KeeperException when processing sessionid:0x139db17d3d30003 type:create cxid:0x1 zxid:0xfffffffffffffffe txntype:unknown reqpath:n/a Error Path:/solr/overseer Error:KeeperErrorCode = NodeExists for /solr/overseer
[junit4:junit4]   2> 3203 T424 oazs.PrepRequestProcessor.pRequest Got user-level KeeperException when processing sessionid:0x139db17d3d30003 type:create cxid:0x2 zxid:0xfffffffffffffffe txntype:unknown reqpath:n/a Error Path:/solr/overseer Error:KeeperErrorCode = NodeExists for /solr/overseer
[junit4:junit4]   2> 3205 T419 oasc.ZkController.createEphemeralLiveNode Register node as live in ZooKeeper:/live_nodes/127.0.0.1:42000_solr
[junit4:junit4]   2> 3205 T424 oazs.PrepRequestProcessor.pRequest Got user-level KeeperException when processing sessionid:0x139db17d3d30003 type:delete cxid:0x4 zxid:0xfffffffffffffffe txntype:unknown reqpath:n/a Error Path:/solr/live_nodes/127.0.0.1:42000_solr Error:KeeperErrorCode = NoNode for /solr/live_nodes/127.0.0.1:42000_solr
[junit4:junit4]   2> 3216 T419 oascc.SolrZkClient.makePath makePath: /live_nodes/127.0.0.1:42000_solr
[junit4:junit4]   2> 3225 T439 oascc.ZkStateReader$3.process Updating live nodes
[junit4:junit4]   2> 3226 T419 oashc.HttpShardHandlerFactory.getParameter Setting socketTimeout to: 0
[junit4:junit4]   2> 3227 T419 oashc.HttpShardHandlerFactory.getParameter Setting urlScheme to: http://
[junit4:junit4]   2> 3227 T419 oashc.HttpShardHandlerFactory.getParameter Setting connTimeout to: 0
[junit4:junit4]   2> 3228 T419 oashc.HttpShardHandlerFactory.getParameter Setting maxConnectionsPerHost to: 20
[junit4:junit4]   2> 3228 T419 oashc.HttpShardHandlerFactory.getParameter Setting corePoolSize to: 0
[junit4:junit4]   2> 3228 T419 oashc.HttpShardHandlerFactory.getParameter Setting maximumPoolSize to: 2147483647
[junit4:junit4]   2> 3229 T419 oashc.HttpShardHandlerFactory.getParameter Setting maxThreadIdleTime to: 5
[junit4:junit4]   2> 3229 T419 oashc.HttpShardHandlerFactory.getParameter Setting sizeOfQueue to: -1
[junit4:junit4]   2> 3230 T419 oashc.HttpShardHandlerFactory.getParameter Setting fairnessPolicy to: false
[junit4:junit4]   2> 3230 T419 oascsi.HttpClientUtil.createClient Creating new http client, config:maxConnectionsPerHost=20&maxConnections=10000&socketTimeout=0&connTimeout=0&retry=false
[junit4:junit4]   2> 3258 T419 oascc.ZkStateReader.createClusterStateWatchersAndUpdate Updating cluster state from ZooKeeper... 
[junit4:junit4]   2> 3264 T419 oasc.CoreContainer.create Creating SolrCore 'collection1' using instanceDir: /usr/home/hudson/hudson-slave/workspace/Lucene-Solr-Tests-trunk-Java6/solr/build/solr-core/test/J1/./solrtest-jetty1-1348000538427/collection1
[junit4:junit4]   2> 3265 T419 oasc.ZkController.createCollectionZkNode Check for collection zkNode:collection1
[junit4:junit4]   2> 3265 T419 oasc.ZkController.createCollectionZkNode Collection zkNode exists
[junit4:junit4]   2> 3266 T419 oasc.ZkController.readConfigName Load collection config from:/collections/collection1
[junit4:junit4]   2> 3267 T419 oasc.SolrResourceLoader.<init> new SolrResourceLoader for directory: '/usr/home/hudson/hudson-slave/workspace/Lucene-Solr-Tests-trunk-Java6/solr/build/solr-core/test/J1/./solrtest-jetty1-1348000538427/collection1/'
[junit4:junit4]   2> 3269 T419 oasc.SolrResourceLoader.replaceClassLoader Adding 'file:/usr/home/hudson/hudson-slave/workspace/Lucene-Solr-Tests-trunk-Java6/solr/build/solr-core/test/J1/solrtest-jetty1-1348000538427/collection1/lib/classes/' to classloader
[junit4:junit4]   2> 3270 T419 oasc.SolrResourceLoader.replaceClassLoader Adding 'file:/usr/home/hudson/hudson-slave/workspace/Lucene-Solr-Tests-trunk-Java6/solr/build/solr-core/test/J1/solrtest-jetty1-1348000538427/collection1/lib/README' to classloader
[junit4:junit4]   2> 3322 T419 oasc.SolrConfig.<init> Using Lucene MatchVersion: LUCENE_50
[junit4:junit4]   2> 3377 T440 oascc.ZkStateReader.updateClusterState Updating cloud state from ZooKeeper... 
[junit4:junit4]   2> 3393 T453 oascc.ZkStateReader$2.process A cluster state change has occurred - updating...
[junit4:junit4]   2> 3393 T439 oascc.ZkStateReader$2.process A cluster state change has occurred - updating...
[junit4:junit4]   2> 3406 T419 oasc.SolrConfig.<init> Loaded SolrConfig: solrconfig.xml
[junit4:junit4]   2> 3507 T419 oass.IndexSchema.readSchema Reading Solr Schema
[junit4:junit4]   2> 3513 T419 oass.IndexSchema.readSchema Schema name=test
[junit4:junit4]   2> 4142 T419 oass.OpenExchangeRatesOrgProvider.init Initialized with rates=open-exchange-rates.json, refreshInterval=1440.
[junit4:junit4]   2> 4154 T419 oass.IndexSchema.readSchema default search field in schema is text
[junit4:junit4]   2> 4158 T419 oass.IndexSchema.readSchema unique key field: id
[junit4:junit4]   2> 4173 T419 oass.FileExchangeRateProvider.reload Reloading exchange rates from file currency.xml
[junit4:junit4]   2> 4178 T419 oass.FileExchangeRateProvider.reload Reloading exchange rates from file currency.xml
[junit4:junit4]   2> 4183 T419 oass.OpenExchangeRatesOrgProvider.reload Reloading exchange rates from open-exchange-rates.json
[junit4:junit4]   2> 4184 T419 oass.OpenExchangeRatesOrgProvider.reload Reloading exchange rates from open-exchange-rates.json
[junit4:junit4]   2> 4186 T419 oasc.SolrCore.<init> [collection1] Opening new SolrCore at /usr/home/hudson/hudson-slave/workspace/Lucene-Solr-Tests-trunk-Java6/solr/build/solr-core/test/J1/./solrtest-jetty1-1348000538427/collection1/, dataDir=./org.apache.solr.cloud.BasicDistributedZk2Test-1348000535500/jetty1/
[junit4:junit4]   2> 4186 T419 oasc.JmxMonitoredMap.<init> JMX monitoring is enabled. Adding Solr mbeans to JMX Server: com.sun.jmx.mbeanserver.JmxMBeanServer@7219d6af
[junit4:junit4]   2> 4188 T419 oasc.SolrCore.getNewIndexDir WARNING New index directory detected: old=null new=./org.apache.solr.cloud.BasicDistributedZk2Test-1348000535500/jetty1/index/
[junit4:junit4]   2> 4189 T419 oasc.SolrCore.initIndex WARNING [collection1] Solr index directory './org.apache.solr.cloud.BasicDistributedZk2Test-1348000535500/jetty1/index' doesn't exist. Creating new index...
[junit4:junit4]   2> 4189 T419 oasc.CachingDirectoryFactory.get return new directory for /usr/home/hudson/hudson-slave/workspace/Lucene-Solr-Tests-trunk-Java6/solr/build/solr-core/test/J1/./org.apache.solr.cloud.BasicDistributedZk2Test-1348000535500/jetty1/index forceNew:false
[junit4:junit4]   2> 4203 T419 oasc.SolrDeletionPolicy.onCommit SolrDeletionPolicy.onCommit: commits:num=1
[junit4:junit4]   2> 		commit{dir=NRTCachingDirectory(org.apache.lucene.store.NIOFSDirectory@/usr/home/hudson/hudson-slave/workspace/Lucene-Solr-Tests-trunk-Java6/solr/build/solr-core/test/J1/org.apache.solr.cloud.BasicDistributedZk2Test-1348000535500/jetty1/index lockFactory=org.apache.lucene.store.NativeFSLockFactory@5c9282ca; maxCacheMB=48.0 maxMergeSizeMB=4.0),segFN=segments_1,generation=1,filenames=[segments_1]
[junit4:junit4]   2> 4203 T419 oasc.SolrDeletionPolicy.updateCommits newest commit = 1
[junit4:junit4]   2> 4204 T419 oasc.SolrCore.initWriters created xml: solr.XMLResponseWriter
[junit4:junit4]   2> 4207 T419 oasup.UpdateRequestProcessorChain.init inserting DistributedUpdateProcessorFactory into updateRequestProcessorChain "dedupe"
[junit4:junit4]   2> 4207 T419 oasup.UpdateRequestProcessorChain.init inserting DistributedUpdateProcessorFactory into updateRequestProcessorChain "dedupe-allfields"
[junit4:junit4]   2> 4208 T419 oasup.UpdateRequestProcessorChain.init inserting DistributedUpdateProcessorFactory into updateRequestProcessorChain "stored_sig"
[junit4:junit4]   2> 4209 T419 oasup.UpdateRequestProcessorChain.init inserting DistributedUpdateProcessorFactory into updateRequestProcessorChain "uniq-fields"
[junit4:junit4]   2> 4210 T419 oasup.UpdateRequestProcessorChain.init inserting DistributedUpdateProcessorFactory into updateRequestProcessorChain "distrib-dup-test-chain-implicit"
[junit4:junit4]   2> 4210 T419 oasc.RequestHandlers.initHandlersFromConfig adding lazy requestHandler: solr.ReplicationHandler
[junit4:junit4]   2> 4211 T419 oasc.RequestHandlers.initHandlersFromConfig created /replication: solr.ReplicationHandler
[junit4:junit4]   2> 4211 T419 oasc.RequestHandlers.initHandlersFromConfig created standard: solr.StandardRequestHandler
[junit4:junit4]   2> 4212 T419 oasc.RequestHandlers.initHandlersFromConfig created /get: solr.RealTimeGetHandler
[junit4:junit4]   2> 4213 T419 oasc.RequestHandlers.initHandlersFromConfig created dismax: solr.SearchHandler
[junit4:junit4]   2> 4214 T419 oasc.RequestHandlers.initHandlersFromConfig created mock: org.apache.solr.core.MockQuerySenderListenerReqHandler
[junit4:junit4]   2> 4215 T419 oasc.RequestHandlers.initHandlersFromConfig created /admin/: org.apache.solr.handler.admin.AdminHandlers
[junit4:junit4]   2> 4215 T419 oasc.RequestHandlers.initHandlersFromConfig created defaults: solr.StandardRequestHandler
[junit4:junit4]   2> 4216 T419 oasc.RequestHandlers.initHandlersFromConfig adding lazy requestHandler: solr.StandardRequestHandler
[junit4:junit4]   2> 4216 T419 oasc.RequestHandlers.initHandlersFromConfig created lazy: solr.StandardRequestHandler
[junit4:junit4]   2> 4217 T419 oasc.RequestHandlers.initHandlersFromConfig created /update: solr.UpdateRequestHandler
[junit4:junit4]   2> 4218 T419 oasc.RequestHandlers.initHandlersFromConfig created /terms: org.apache.solr.handler.component.SearchHandler
[junit4:junit4]   2> 4219 T419 oasc.RequestHandlers.initHandlersFromConfig created spellCheckCompRH: org.apache.solr.handler.component.SearchHandler
[junit4:junit4]   2> 4220 T419 oasc.RequestHandlers.initHandlersFromConfig created spellCheckCompRH_Direct: org.apache.solr.handler.component.SearchHandler
[junit4:junit4]   2> 4220 T419 oasc.RequestHandlers.initHandlersFromConfig created spellCheckWithWordbreak: org.apache.solr.handler.component.SearchHandler
[junit4:junit4]   2> 4221 T419 oasc.RequestHandlers.initHandlersFromConfig created spellCheckWithWordbreak_Direct: org.apache.solr.handler.component.SearchHandler
[junit4:junit4]   2> 4222 T419 oasc.RequestHandlers.initHandlersFromConfig created spellCheckCompRH1: org.apache.solr.handler.component.SearchHandler
[junit4:junit4]   2> 4223 T419 oasc.RequestHandlers.initHandlersFromConfig created tvrh: org.apache.solr.handler.component.SearchHandler
[junit4:junit4]   2> 4223 T419 oasc.RequestHandlers.initHandlersFromConfig created /mlt: solr.MoreLikeThisHandler
[junit4:junit4]   2> 4224 T419 oasc.RequestHandlers.initHandlersFromConfig created /debug/dump: solr.DumpRequestHandler
[junit4:junit4]   2> 4228 T419 oashl.XMLLoader.init xsltCacheLifetimeSeconds=60
[junit4:junit4]   2> 4234 T419 oasc.SolrCore.initDeprecatedSupport WARNING solrconfig.xml uses deprecated <admin/gettableFiles>, Please update your config to use the ShowFileRequestHandler.
[junit4:junit4]   2> 4235 T419 oasc.SolrCore.initDeprecatedSupport WARNING adding ShowFileRequestHandler with hidden files: [SCHEMA.XML, OLD_SYNONYMS.TXT, STOPWORDS.TXT, PROTWORDS.TXT, OPEN-EXCHANGE-RATES.JSON, SYNONYMS.TXT, CURRENCY.XML, MAPPING-ISOLATIN1ACCENT.TXT]
[junit4:junit4]   2> 4240 T419 oass.SolrIndexSearcher.<init> Opening Searcher@5af2318d main
[junit4:junit4]   2> 4241 T419 oasu.CommitTracker.<init> Hard AutoCommit: disabled
[junit4:junit4]   2> 4241 T419 oasu.CommitTracker.<init> Soft AutoCommit: disabled
[junit4:junit4]   2> 4242 T419 oashc.SpellCheckComponent.inform Initializing spell checkers
[junit4:junit4]   2> 4263 T419 oass.DirectSolrSpellChecker.init init: {name=direct,classname=DirectSolrSpellChecker,field=lowerfilt,minQueryLength=3}
[junit4:junit4]   2> 4339 T454 oasc.SolrCore.registerSearcher [collection1] Registered new searcher Searcher@5af2318d main{StandardDirectoryReader(segments_1:1)}
[junit4:junit4]   2> 4404 T440 oascc.ZkStateReader.updateClusterState Updating cloud state from ZooKeeper... 
[junit4:junit4]   2> 4425 T453 oascc.ZkStateReader$2.process A cluster state change has occurred - updating...
[junit4:junit4]   2> 4425 T439 oascc.ZkStateReader$2.process A cluster state change has occurred - updating...
[junit4:junit4]   2> 4847 T419 oasc.CoreContainer.register registering core: collection1
[junit4:junit4]   2> 4848 T419 oasc.ZkController.register Register shard - core:collection1 address:http://127.0.0.1:42000/solr shardId:shard1
[junit4:junit4]   2> 4849 T419 oascc.SolrZkClient.makePath makePath: /collections/collection1/leader_elect/shard1/election
[junit4:junit4]   2> 4926 T424 oazs.PrepRequestProcessor.pRequest Got user-level KeeperException when processing sessionid:0x139db17d3d30003 type:delete cxid:0x43 zxid:0xfffffffffffffffe txntype:unknown reqpath:n/a Error Path:/solr/collections/collection1/leaders Error:KeeperErrorCode = NoNode for /solr/collections/collection1/leaders
[junit4:junit4]   2> 4929 T419 oasc.ShardLeaderElectionContext.runLeaderProcess Running the leader process.
[junit4:junit4]   2> 4930 T424 oazs.PrepRequestProcessor.pRequest Got user-level KeeperException when processing sessionid:0x139db17d3d30003 type:create cxid:0x44 zxid:0xfffffffffffffffe txntype:unknown reqpath:n/a Error Path:/solr/overseer Error:KeeperErrorCode = NodeExists for /solr/overseer
[junit4:junit4]   2> 4998 T419 oasc.ShardLeaderElectionContext.waitForReplicasToComeUp Enough replicas found to continue.
[junit4:junit4]   2> 4999 T440 oascc.ZkStateReader.updateClusterState Updating cloud state from ZooKeeper... 
[junit4:junit4]   2> 4999 T419 oasc.ShardLeaderElectionContext.runLeaderProcess I may be the new leader - try and sync
[junit4:junit4]   2> 4999 T419 oasc.SyncStrategy.sync Sync replicas to http://127.0.0.1:42000/solr/collection1/
[junit4:junit4]   2> 5000 T419 oasc.SyncStrategy.syncReplicas Sync Success - now sync replicas to me
[junit4:junit4]   2> 5000 T419 oasc.SyncStrategy.syncToMe http://127.0.0.1:42000/solr/collection1/ has no replicas
[junit4:junit4]   2> 5001 T419 oasc.ShardLeaderElectionContext.runLeaderProcess I am the new leader: http://127.0.0.1:42000/solr/collection1/
[junit4:junit4]   2> 5001 T419 oascc.SolrZkClient.makePath makePath: /collections/collection1/leaders/shard1
[junit4:junit4]   2> 5163 T439 oascc.ZkStateReader$2.process A cluster state change has occurred - updating...
[junit4:junit4]   2> 5163 T453 oascc.ZkStateReader$2.process A cluster state change has occurred - updating...
[junit4:junit4]   2> 5165 T424 oazs.PrepRequestProcessor.pRequest Got user-level KeeperException when processing sessionid:0x139db17d3d30003 type:create cxid:0x4f zxid:0xfffffffffffffffe txntype:unknown reqpath:n/a Error Path:/solr/overseer Error:KeeperErrorCode = NodeExists for /solr/overseer
[junit4:junit4]   2> 5693 T440 oascc.ZkStateReader.updateClusterState Updating cloud state from ZooKeeper... 
[junit4:junit4]   2> 5715 T439 oascc.ZkStateReader$2.process A cluster state change has occurred - updating...
[junit4:junit4]   2> 5715 T453 oascc.ZkStateReader$2.process A cluster state change has occurred - updating...
[junit4:junit4]   2> 5752 T419 oasc.ZkController.register We are http://127.0.0.1:42000/solr/collection1/ and leader is http://127.0.0.1:42000/solr/collection1/
[junit4:junit4]   2> 5752 T419 oasc.ZkController.register No LogReplay needed for core=collection1 baseURL=http://127.0.0.1:42000/solr
[junit4:junit4]   2> 5753 T419 oasc.ZkController.checkRecovery I am the leader, no recovery necessary
[junit4:junit4]   2> 5755 T419 oascc.ZkStateReader.updateClusterState Updating cloud state from ZooKeeper... 
[junit4:junit4]   2> 5756 T419 oass.SolrDispatchFilter.init user.dir=/usr/home/hudson/hudson-slave/workspace/Lucene-Solr-Tests-trunk-Java6/solr/build/solr-core/test/J1
[junit4:junit4]   2> 5756 T419 oass.SolrDispatchFilter.init SolrDispatchFilter.init() done
[junit4:junit4]   2> 5757 T419 oascsi.HttpClientUtil.createClient Creating new http client, config:maxConnections=128&maxConnectionsPerHost=32&followRedirects=false
[junit4:junit4]   2> 5933 T419 oejs.Server.doStart jetty-8.1.2.v20120308
[junit4:junit4]   2> 5936 T419 oejs.AbstractConnector.doStart Started SocketConnector@0.0.0.0:29767
[junit4:junit4]   2> 5937 T419 oasc.SolrResourceLoader.locateSolrHome JNDI not configured for solr (NoInitialContextEx)
[junit4:junit4]   2> 5937 T419 oasc.SolrResourceLoader.locateSolrHome using system property solr.solr.home: /usr/home/hudson/hudson-slave/workspace/Lucene-Solr-Tests-trunk-Java6/solr/build/solr-core/test/J1/./solrtest-jetty2-1348000541271
[junit4:junit4]   2> 5938 T419 oasc.SolrResourceLoader.<init> new SolrResourceLoader for deduced Solr Home: '/usr/home/hudson/hudson-slave/workspace/Lucene-Solr-Tests-trunk-Java6/solr/build/solr-core/test/J1/./solrtest-jetty2-1348000541271/'
[junit4:junit4]   2> 5994 T419 oass.SolrDispatchFilter.init SolrDispatchFilter.init()
[junit4:junit4]   2> 5995 T419 oasc.SolrResourceLoader.locateSolrHome JNDI not configured for solr (NoInitialContextEx)
[junit4:junit4]   2> 5996 T419 oasc.SolrResourceLoader.locateSolrHome using system property solr.solr.home: /usr/home/hudson/hudson-slave/workspace/Lucene-Solr-Tests-trunk-Java6/solr/build/solr-core/test/J1/./solrtest-jetty2-1348000541271
[junit4:junit4]   2> 5996 T419 oasc.CoreContainer$Initializer.initialize looking for solr.xml: /usr/home/hudson/hudson-slave/workspace/Lucene-Solr-Tests-trunk-Java6/solr/build/solr-core/test/J1/./solrtest-jetty2-1348000541271/solr.xml
[junit4:junit4]   2> 5997 T419 oasc.CoreContainer.<init> New CoreContainer 421276693
[junit4:junit4]   2> 5998 T419 oasc.CoreContainer.load Loading CoreContainer using Solr Home: '/usr/home/hudson/hudson-slave/workspace/Lucene-Solr-Tests-trunk-Java6/solr/build/solr-core/test/J1/./solrtest-jetty2-1348000541271/'
[junit4:junit4]   2> 5999 T419 oasc.SolrResourceLoader.<init> new SolrResourceLoader for directory: '/usr/home/hudson/hudson-slave/workspace/Lucene-Solr-Tests-trunk-Java6/solr/build/solr-core/test/J1/./solrtest-jetty2-1348000541271/'
[junit4:junit4]   2> 6026 T419 oasc.CoreContainer.load Registering Log Listener
[junit4:junit4]   2> 6041 T419 oasc.CoreContainer.initZooKeeper Zookeeper client=127.0.0.1:57077/solr
[junit4:junit4]   2> 6042 T419 oaz.ZooKeeper.<init> Initiating client connection, connectString=127.0.0.1:57077/solr sessionTimeout=5000 watcher=org.apache.solr.common.cloud.ConnectionManager@325dcdf1
[junit4:junit4]   2> 6043 T464 oaz.ClientCnxn$SendThread.startConnect Opening socket connection to server /127.0.0.1:57077
[junit4:junit4]   2> 6043 T419 oascc.ConnectionManager.waitForConnected Waiting for client to connect to ZooKeeper
[junit4:junit4]   2> 6044 T464 oaz.ClientCnxn$SendThread.primeConnection Socket connection established to localhost/127.0.0.1:57077, initiating session
[junit4:junit4]   2> 6044 T421 oazs.NIOServerCnxn$Factory.run Accepted socket connection from /140.211.11.196:17660
[junit4:junit4]   2> 6045 T421 oazs.NIOServerCnxn.readConnectRequest Client attempting to establish new session at /140.211.11.196:17660
[junit4:junit4]   2> 6053 T423 oazs.NIOServerCnxn.finishSessionInit Established session 0x139db17d3d30004 with negotiated timeout 5000 for client /140.211.11.196:17660
[junit4:junit4]   2> 6053 T464 oaz.ClientCnxn$SendThread.readConnectResult Session establishment complete on server localhost/127.0.0.1:57077, sessionid = 0x139db17d3d30004, negotiated timeout = 5000
[junit4:junit4]   2> 6053 T465 oascc.ConnectionManager.process Watcher org.apache.solr.common.cloud.ConnectionManager@325dcdf1 name:ZooKeeperConnection Watcher:127.0.0.1:57077/solr got event WatchedEvent state:SyncConnected type:None path:null path:null type:None
[junit4:junit4]   2> 6054 T419 oascc.ConnectionManager.waitForConnected Client is connected to ZooKeeper
[junit4:junit4]   2> 6055 T424 oazs.PrepRequestProcessor.pRequest Got user-level KeeperException when processing sessionid:0x139db17d3d30004 type:create cxid:0x1 zxid:0xfffffffffffffffe txntype:unknown reqpath:n/a Error Path:/solr/overseer Error:KeeperErrorCode = NodeExists for /solr/overseer
[junit4:junit4]   2> 6061 T424 oazs.PrepRequestProcessor.pRequest Got user-level KeeperException when processing sessionid:0x139db17d3d30004 type:create cxid:0x2 zxid:0xfffffffffffffffe txntype:unknown reqpath:n/a Error Path:/solr/overseer Error:KeeperErrorCode = NodeExists for /solr/overseer
[junit4:junit4]   2> 6071 T419 oasc.ZkController.createEphemeralLiveNode Register node as live in ZooKeeper:/live_nodes/127.0.0.1:29767_solr
[junit4:junit4]   2> 6071 T424 oazs.PrepRequestProcessor.pRequest Got user-level KeeperException when processing sessionid:0x139db17d3d30004 type:delete cxid:0x4 zxid:0xfffffffffffffffe txntype:unknown reqpath:n/a Error Path:/solr/live_nodes/127.0.0.1:29767_solr Error:KeeperErrorCode = NoNode for /solr/live_nodes/127.0.0.1:29767_solr
[junit4:junit4]   2> 6079 T419 oascc.SolrZkClient.makePath makePath: /live_nodes/127.0.0.1:29767_solr
[junit4:junit4]   2> 6091 T439 oascc.ZkStateReader$3.process Updating live nodes
[junit4:junit4]   2> 6091 T453 oascc.ZkStateReader$3.process Updating live nodes
[junit4:junit4]   2> 6092 T419 oashc.HttpShardHandlerFactory.getParameter Setting socketTimeout to: 0
[junit4:junit4]   2> 6092 T419 oashc.HttpShardHandlerFactory.getParameter Setting urlScheme to: http://
[junit4:junit4]   2> 6093 T419 oashc.HttpShardHandlerFactory.getParameter Setting connTimeout to: 0
[junit4:junit4]   2> 6093 T419 oashc.HttpShardHandlerFactory.getParameter Setting maxConnectionsPerHost to: 20
[junit4:junit4]   2> 6094 T419 oashc.HttpShardHandlerFactory.getParameter Setting corePoolSize to: 0
[junit4:junit4]   2> 6094 T419 oashc.HttpShardHandlerFactory.getParameter Setting maximumPoolSize to: 2147483647
[junit4:junit4]   2> 6095 T419 oashc.HttpShardHandlerFactory.getParameter Setting maxThreadIdleTime to: 5
[junit4:junit4]   2> 6095 T419 oashc.HttpShardHandlerFactory.getParameter Setting sizeOfQueue to: -1
[junit4:junit4]   2> 6096 T419 oashc.HttpShardHandlerFactory.getParameter Setting fairnessPolicy to: false
[junit4:junit4]   2> 6096 T419 oascsi.HttpClientUtil.createClient Creating new http client, config:maxConnectionsPerHost=20&maxConnections=10000&socketTimeout=0&connTimeout=0&retry=false
[junit4:junit4]   2> 6114 T419 oascc.ZkStateReader.createClusterStateWatchersAndUpdate Updating cluster state from ZooKeeper... 
[junit4:junit4]   2> 6121 T419 oasc.CoreContainer.create Creating SolrCore 'collection1' using instanceDir: /usr/home/hudson/hudson-slave/workspace/Lucene-Solr-Tests-trunk-Java6/solr/build/solr-core/test/J1/./solrtest-jetty2-1348000541271/collection1
[junit4:junit4]   2> 6121 T419 oasc.ZkController.createCollectionZkNode Check for collection zkNode:collection1
[junit4:junit4]   2> 6122 T419 oasc.ZkController.createCollectionZkNode Collection zkNode exists
[junit4:junit4]   2> 6123 T419 oasc.ZkController.readConfigName Load collection config from:/collections/collection1
[junit4:junit4]   2> 6124 T419 oasc.SolrResourceLoader.<init> new SolrResourceLoader for directory: '/usr/home/hudson/hudson-slave/workspace/Lucene-Solr-Tests-trunk-Java6/solr/build/solr-core/test/J1/./solrtest-jetty2-1348000541271/collection1/'
[junit4:junit4]   2> 6126 T419 oasc.SolrResourceLoader.replaceClassLoader Adding 'file:/usr/home/hudson/hudson-slave/workspace/Lucene-Solr-Tests-trunk-Java6/solr/build/solr-core/test/J1/solrtest-jetty2-1348000541271/collection1/lib/classes/' to classloader
[junit4:junit4]   2> 6127 T419 oasc.SolrResourceLoader.replaceClassLoader Adding 'file:/usr/home/hudson/hudson-slave/workspace/Lucene-Solr-Tests-trunk-Java6/solr/build/solr-core/test/J1/solrtest-jetty2-1348000541271/collection1/lib/README' to classloader
[junit4:junit4]   2> 6181 T419 oasc.SolrConfig.<init> Using Lucene MatchVersion: LUCENE_50
[junit4:junit4]   2> 6228 T440 oascc.ZkStateReader.updateClusterState Updating cloud state from ZooKeeper... 
[junit4:junit4]   2> 6256 T439 oascc.ZkStateReader$2.process A cluster state change has occurred - updating...
[junit4:junit4]   2> 6256 T465 oascc.ZkStateReader$2.process A cluster state change has occurred - updating...
[junit4:junit4]   2> 6256 T453 oascc.ZkStateReader$2.process A cluster state change has occurred - updating...
[junit4:junit4]   2> 6258 T419 oasc.SolrConfig.<init> Loaded SolrConfig: solrconfig.xml
[junit4:junit4]   2> 6365 T419 oass.IndexSchema.readSchema Reading Solr Schema
[junit4:junit4]   2> 6372 T419 oass.IndexSchema.readSchema Schema name=test
[junit4:junit4]   2> 6995 T419 oass.OpenExchangeRatesOrgProvider.init Initialized with rates=open-exchange-rates.json, refreshInterval=1440.
[junit4:junit4]   2> 7006 T419 oass.IndexSchema.readSchema default search field in schema is text
[junit4:junit4]   2> 7011 T419 oass.IndexSchema.readSchema unique key field: id
[junit4:junit4]   2> 7024 T419 oass.FileExchangeRateProvider.reload Reloading exchange rates from file currency.xml
[junit4:junit4]   2> 7029 T419 oass.FileExchangeRateProvider.reload Reloading exchange rates from file currency.xml
[junit4:junit4]   2> 7034 T419 oass.OpenExchangeRatesOrgProvider.reload Reloading exchange rates from open-exchange-rates.json
[junit4:junit4]   2> 7036 T419 oass.OpenExchangeRatesOrgProvider.reload Reloading exchange rates from open-exchange-rates.json
[junit4:junit4]   2> 7037 T419 oasc.SolrCore.<init> [collection1] Opening new SolrCore at /usr/home/hudson/hudson-slave/workspace/Lucene-Solr-Tests-trunk-Java6/solr/build/solr-core/test/J1/./solrtest-jetty2-1348000541271/collection1/, dataDir=./org.apache.solr.cloud.BasicDistributedZk2Test-1348000535500/jetty2/
[junit4:junit4]   2> 7038 T419 oasc.JmxMonitoredMap.<init> JMX monitoring is enabled. Adding Solr mbeans to JMX Server: com.sun.jmx.mbeanserver.JmxMBeanServer@7219d6af
[junit4:junit4]   2> 7039 T419 oasc.SolrCore.getNewIndexDir WARNING New index directory detected: old=null new=./org.apache.solr.cloud.BasicDistributedZk2Test-1348000535500/jetty2/index/
[junit4:junit4]   2> 7040 T419 oasc.SolrCore.initIndex WARNING [collection1] Solr index directory './org.apache.solr.cloud.BasicDistributedZk2Test-1348000535500/jetty2/index' doesn't exist. Creating new index...
[junit4:junit4]   2> 7041 T419 oasc.CachingDirectoryFactory.get return new directory for /usr/home/hudson/hudson-slave/workspace/Lucene-Solr-Tests-trunk-Java6/solr/build/solr-core/test/J1/./org.apache.solr.cloud.BasicDistributedZk2Test-1348000535500/jetty2/index forceNew:false
[junit4:junit4]   2> 7061 T419 oasc.SolrDeletionPolicy.onCommit SolrDeletionPolicy.onCommit: commits:num=1
[junit4:junit4]   2> 		commit{dir=NRTCachingDirectory(org.apache.lucene.store.NIOFSDirectory@/usr/home/hudson/hudson-slave/workspace/Lucene-Solr-Tests-trunk-Java6/solr/build/solr-core/test/J1/org.apache.solr.cloud.BasicDistributedZk2Test-1348000535500/jetty2/index lockFactory=org.apache.lucene.store.NativeFSLockFactory@31f32e51; maxCacheMB=48.0 maxMergeSizeMB=4.0),segFN=segments_1,generation=1,filenames=[segments_1]
[junit4:junit4]   2> 7062 T419 oasc.SolrDeletionPolicy.updateCommits newest commit = 1
[junit4:junit4]   2> 7063 T419 oasc.SolrCore.initWriters created xml: solr.XMLResponseWriter
[junit4:junit4]   2> 7065 T419 oasup.UpdateRequestProcessorChain.init inserting DistributedUpdateProcessorFactory into updateRequestProcessorChain "dedupe"
[junit4:junit4]   2> 7066 T419 oasup.UpdateRequestProcessorChain.init inserting DistributedUpdateProcessorFactory into updateRequestProcessorChain "dedupe-allfields"
[junit4:junit4]   2> 7066 T419 oasup.UpdateRequestProcessorChain.init inserting DistributedUpdateProcessorFactory into updateRequestProcessorChain "stored_sig"
[junit4:junit4]   2> 7067 T419 oasup.UpdateRequestProcessorChain.init inserting DistributedUpdateProcessorFactory into updateRequestProcessorChain "uniq-fields"
[junit4:junit4]   2> 7068 T419 oasup.UpdateRequestProcessorChain.init inserting DistributedUpdateProcessorFactory into updateRequestProcessorChain "distrib-dup-test-chain-implicit"
[junit4:junit4]   2> 7068 T419 oasc.RequestHandlers.initHandlersFromConfig adding lazy requestHandler: solr.ReplicationHandler
[junit4:junit4]   2> 7069 T419 oasc.RequestHandlers.initHandlersFromConfig created /replication: solr.ReplicationHandler
[junit4:junit4]   2> 7070 T419 oasc.RequestHandlers.initHandlersFromConfig created standard: solr.StandardRequestHandler
[junit4:junit4]   2> 7071 T419 oasc.RequestHandlers.initHandlersFromConfig created /get: solr.RealTimeGetHandler
[junit4:junit4]   2> 7072 T419 oasc.RequestHandlers.initHandlersFromConfig created dismax: solr.SearchHandler
[junit4:junit4]   2> 7072 T419 oasc.RequestHandlers.initHandlersFromConfig created mock: org.apache.solr.core.MockQuerySenderListenerReqHandler
[junit4:junit4]   2> 7073 T419 oasc.RequestHandlers.initHandlersFromConfig created /admin/: org.apache.solr.handler.admin.AdminHandlers
[junit4:junit4]   2> 7074 T419 oasc.RequestHandlers.initHandlersFromConfig created defaults: solr.StandardRequestHandler
[junit4:junit4]   2> 7074 T419 oasc.RequestHandlers.initHandlersFromConfig adding lazy requestHandler: solr.StandardRequestHandler
[junit4:junit4]   2> 7075 T419 oasc.RequestHandlers.initHandlersFromConfig created lazy: solr.StandardRequestHandler
[junit4:junit4]   2> 7076 T419 oasc.RequestHandlers.initHandlersFromConfig created /update: solr.UpdateRequestHandler
[junit4:junit4]   2> 7076 T419 oasc.RequestHandlers.initHandlersFromConfig created /terms: org.apache.solr.handler.component.SearchHandler
[junit4:junit4]   2> 7077 T419 oasc.RequestHandlers.initHandlersFromConfig created spellCheckCompRH: org.apache.solr.handler.component.SearchHandler
[junit4:junit4]   2> 7078 T419 oasc.RequestHandlers.initHandlersFromConfig created spellCheckCompRH_Direct: org.apache.solr.handler.component.SearchHandler
[junit4:junit4]   2> 7079 T419 oasc.RequestHandlers.initHandlersFromConfig created spellCheckWithWordbreak: org.apache.solr.handler.component.SearchHandler
[junit4:junit4]   2> 7079 T419 oasc.RequestHandlers.initHandlersFromConfig created spellCheckWithWordbreak_Direct: org.apache.solr.handler.component.SearchHandler
[junit4:junit4]   2> 7080 T419 oasc.RequestHandlers.initHandlersFromConfig created spellCheckCompRH1: org.apache.solr.handler.component.SearchHandler
[junit4:junit4]   2> 7081 T419 oasc.RequestHandlers.initHandlersFromConfig created tvrh: org.apache.solr.handler.component.SearchHandler
[junit4:junit4]   2> 7082 T419 oasc.RequestHandlers.initHandlersFromConfig created /mlt: solr.MoreLikeThisHandler
[junit4:junit4]   2> 7083 T419 oasc.RequestHandlers.initHandlersFromConfig created /debug/dump: solr.DumpRequestHandler
[junit4:junit4]   2> 7087 T419 oashl.XMLLoader.init xsltCacheLifetimeSeconds=60
[junit4:junit4]   2> 7091 T419 oasc.SolrCore.initDeprecatedSupport WARNING solrconfig.xml uses deprecated <admin/gettableFiles>, Please update your config to use the ShowFileRequestHandler.
[junit4:junit4]   2> 7093 T419 oasc.SolrCore.initDeprecatedSupport WARNING adding ShowFileRequestHandler with hidden files: [SCHEMA.XML, OLD_SYNONYMS.TXT, STOPWORDS.TXT, PROTWORDS.TXT, OPEN-EXCHANGE-RATES.JSON, SYNONYMS.TXT, CURRENCY.XML, MAPPING-ISOLATIN1ACCENT.TXT]
[junit4:junit4]   2> 7097 T419 oass.SolrIndexSearcher.<init> Opening Searcher@30f78b7d main
[junit4:junit4]   2> 7099 T419 oasu.CommitTracker.<init> Hard AutoCommit: disabled
[junit4:junit4]   2> 7099 T419 oasu.CommitTracker.<init> Soft AutoCommit: disabled
[junit4:junit4]   2> 7100 T419 oashc.SpellCheckComponent.inform Initializing spell checkers
[junit4:junit4]   2> 7109 T419 oass.DirectSolrSpellChecker.init init: {name=direct,classname=DirectSolrSpellChecker,field=lowerfilt,minQueryLength=3}
[junit4:junit4]   2> 7161 T466 oasc.SolrCore.registerSearcher [collection1] Registered new searcher Searcher@30f78b7d main{StandardDirectoryReader(segments_1:1)}
[junit4:junit4]   2> 7269 T440 oascc.ZkStateReader.updateClusterState Updating cloud state from ZooKeeper... 
[junit4:junit4]   2> 7292 T439 oascc.ZkStateReader$2.process A cluster state change has occurred - updating...
[junit4:junit4]   2> 7292 T453 oascc.ZkStateReader$2.process A cluster state change has occurred - updating...
[junit4:junit4]   2> 7292 T465 oascc.ZkStateReader$2.process A cluster state change has occurred - updating...
[junit4:junit4]   2> 7670 T419 oasc.CoreContainer.register registering core: collection1
[junit4:junit4]   2> 7670 T419 oasc.ZkController.register Register shard - core:collection1 address:http://127.0.0.1:29767/solr shardId:shard2
[junit4:junit4]   2> 7672 T419 oascc.SolrZkClient.makePath makePath: /collections/collection1/leader_elect/shard2/election
[junit4:junit4]   2> 7687 T424 oazs.PrepRequestProcessor.pRequest Got user-level KeeperException when processing sessionid:0x139db17d3d30004 type:delete cxid:0x42 zxid:0xfffffffffffffffe txntype:unknown reqpath:n/a Error Path:/solr/collections/collection1/leaders/shard2 Error:KeeperErrorCode = NoNode for /solr/collections/collection1/leaders/shard2
[junit4:junit4]   2> 7693 T419 oasc.ShardLeaderElectionContext.runLeaderProcess Running the leader process.
[junit4:junit4]   2> 7694 T424 oazs.PrepRequestProcessor.pRequest Got user-level KeeperException when processing sessionid:0x139db17d3d30004 type:create cxid:0x43 zxid:0xfffffffffffffffe txntype:unknown reqpath:n/a Error Path:/solr/overseer Error:KeeperErrorCode = NodeExists for /solr/overseer
[junit4:junit4]   2> 7696 T419 oasc.ShardLeaderElectionContext.waitForReplicasToComeUp Enough replicas found to continue.
[junit4:junit4]   2> 7697 T419 oasc.ShardLeaderElectionContext.runLeaderProcess I may be the new leader - try and sync
[junit4:junit4]   2> 7697 T419 oasc.SyncStrategy.sync Sync replicas to http://127.0.0.1:29767/solr/collection1/
[junit4:junit4]   2> 7698 T419 oasc.SyncStrategy.syncReplicas Sync Success - now sync replicas to me
[junit4:junit4]   2> 7698 T419 oasc.SyncStrategy.syncToMe http://127.0.0.1:29767/solr/collection1/ has no replicas
[junit4:junit4]   2> 7699 T419 oasc.ShardLeaderElectionContext.runLeaderProcess I am the new leader: http://127.0.0.1:29767/solr/collection1/
[junit4:junit4]   2> 7699 T419 oascc.SolrZkClient.makePath makePath: /collections/collection1/leaders/shard2
[junit4:junit4]   2> 7702 T424 oazs.PrepRequestProcessor.pRequest Got user-level KeeperException when processing sessionid:0x139db17d3d30004 type:create cxid:0x4c zxid:0xfffffffffffffffe txntype:unknown reqpath:n/a Error Path:/solr/overseer Error:KeeperErrorCode = NodeExists for /solr/overseer
[junit4:junit4]   2> 7805 T440 oascc.ZkStateReader.updateClusterState Updating cloud state from ZooKeeper... 
[junit4:junit4]   2> 7846 T439 oascc.ZkStateReader$2.process A cluster state change has occurred - updating...
[junit4:junit4]   2> 7846 T465 oascc.ZkStateReader$2.process A cluster state change has occurred - updating...
[junit4:junit4]   2> 7846 T453 oascc.ZkStateReader$2.process A cluster state change has occurred - updating...
[junit4:junit4]   2> 7863 T419 oasc.ZkController.register We are http://127.0.0.1:29767/solr/collection1/ and leader is http://127.0.0.1:29767/solr/collection1/
[junit4:junit4]   2> 7863 T419 oasc.ZkController.register No LogReplay needed for core=collection1 baseURL=http://127.0.0.1:29767/solr
[junit4:junit4]   2> 7864 T419 oasc.ZkController.checkRecovery I am the leader, no recovery necessary
[junit4:junit4]   2> 7873 T419 oascc.ZkStateReader.updateClusterState Updating cloud state from ZooKeeper... 
[junit4:junit4]   2> 7874 T419 oass.SolrDispatchFilter.init user.dir=/usr/home/hudson/hudson-slave/workspace/Lucene-Solr-Tests-trunk-Java6/solr/build/solr-core/test/J1
[junit4:junit4]   2> 7874 T419 oass.SolrDispatchFilter.init SolrDispatchFilter.init() done
[junit4:junit4]   2> 7875 T419 oascsi.HttpClientUtil.createClient Creating new http client, config:maxConnections=128&maxConnectionsPerHost=32&followRedirects=false
[junit4:junit4]   2> 8048 T419 oejs.Server.doStart jetty-8.1.2.v20120308
[junit4:junit4]   2> 8051 T419 oejs.AbstractConnector.doStart Started SocketConnector@0.0.0.0:33700
[junit4:junit4]   2> 8052 T419 oasc.SolrResourceLoader.locateSolrHome JNDI not configured for solr (NoInitialContextEx)
[junit4:junit4]   2> 8052 T419 oasc.SolrResourceLoader.locateSolrHome using system property solr.solr.home: /usr/home/hudson/hudson-slave/workspace/Lucene-Solr-Tests-trunk-Java6/solr/build/solr-core/test/J1/./solrtest-jetty3-1348000543386
[junit4:junit4]   2> 8053 T419 oasc.SolrResourceLoader.<init> new SolrResourceLoader for deduced Solr Home: '/usr/home/hudson/hudson-slave/workspace/Lucene-Solr-Tests-trunk-Java6/solr/build/solr-core/test/J1/./solrtest-jetty3-1348000543386/'
[junit4:junit4]   2> 8090 T419 oass.SolrDispatchFilter.init SolrDispatchFilter.init()
[junit4:junit4]   2> 8091 T419 oasc.SolrResourceLoader.locateSolrHome JNDI not configured for solr (NoInitialContextEx)
[junit4:junit4]   2> 8091 T419 oasc.SolrResourceLoader.locateSolrHome using system property solr.solr.home: /usr/home/hudson/hudson-slave/workspace/Lucene-Solr-Tests-trunk-Java6/solr/build/solr-core/test/J1/./solrtest-jetty3-1348000543386
[junit4:junit4]   2> 8092 T419 oasc.CoreContainer$Initializer.initialize looking for solr.xml: /usr/home/hudson/hudson-slave/workspace/Lucene-Solr-Tests-trunk-Java6/solr/build/solr-core/test/J1/./solrtest-jetty3-1348000543386/solr.xml
[junit4:junit4]   2> 8092 T419 oasc.CoreContainer.<init> New CoreContainer 1402213964
[junit4:junit4]   2> 8093 T419 oasc.CoreContainer.load Loading CoreContainer using Solr Home: '/usr/home/hudson/hudson-slave/workspace/Lucene-Solr-Tests-trunk-Java6/solr/build/solr-core/test/J1/./solrtest-jetty3-1348000543386/'
[junit4:junit4]   2> 8093 T419 oasc.SolrResourceLoader.<init> new SolrResourceLoader for directory: '/usr/home/hudson/hudson-slave/workspace/Lucene-Solr-Tests-trunk-Java6/solr/build/solr-core/test/J1/./solrtest-jetty3-1348000543386/'
[junit4:junit4]   2> 8118 T419 oasc.CoreContainer.load Registering Log Listener
[junit4:junit4]   2> 8135 T419 oasc.CoreContainer.initZooKeeper Zookeeper client=127.0.0.1:57077/solr
[junit4:junit4]   2> 8136 T419 oaz.ZooKeeper.<init> Initiating client connection, connectString=127.0.0.1:57077/solr sessionTimeout=5000 watcher=org.apache.solr.common.cloud.ConnectionManager@496889eb
[junit4:junit4]   2> 8137 T476 oaz.ClientCnxn$SendThread.startConnect Opening socket connection to server /127.0.0.1:57077
[junit4:junit4]   2> 8136 T419 oascc.ConnectionManager.waitForConnected Waiting for client to connect to ZooKeeper
[junit4:junit4]   2> 8138 T476 oaz.ClientCnxn$SendThread.primeConnection Socket connection established to localhost/127.0.0.1:57077, initiating session
[junit4:junit4]   2> 8138 T421 oazs.NIOServerCnxn$Factory.run Accepted socket connection from /140.211.11.196:21476
[junit4:junit4]   2> 8138 T421 oazs.NIOServerCnxn.readConnectRequest Client attempting to establish new session at /140.211.11.196:21476
[junit4:junit4]   2> 8141 T423 oazs.NIOServerCnxn.finishSessionInit Established session 0x139db17d3d30005 with negotiated timeout 5000 for client /140.211.11.196:21476
[junit4:junit4]   2> 8141 T476 oaz.ClientCnxn$SendThread.readConnectResult Session establishment complete on server localhost/127.0.0.1:57077, sessionid = 0x139db17d3d30005, negotiated timeout = 5000
[junit4:junit4]   2> 8141 T477 oascc.ConnectionManager.process Watcher org.apache.solr.common.cloud.ConnectionManager@496889eb name:ZooKeeperConnection Watcher:127.0.0.1:57077/solr got event WatchedEvent state:SyncConnected type:None path:null path:null type:None
[junit4:junit4]   2> 8141 T419 oascc.ConnectionManager.waitForConnected Client is connected to ZooKeeper
[junit4:junit4]   2> 8143 T424 oazs.PrepRequestProcessor.pRequest Got user-level KeeperException when processing sessionid:0x139db17d3d30005 type:create cxid:0x1 zxid:0xfffffffffffffffe txntype:unknown reqpath:n/a Error Path:/solr/overseer Error:KeeperErrorCode = NodeExists for /solr/overseer
[junit4:junit4]   2> 8144 T424 oazs.PrepRequestProcessor.pRequest Got user-level KeeperException when processing sessionid:0x139db17d3d30005 type:create cxid:0x2 zxid:0xfffffffffffffffe txntype:unknown reqpath:n/a Error Path:/solr/overseer Error:KeeperErrorCode = NodeExists for /solr/overseer
[junit4:junit4]   2> 8155 T419 oasc.ZkController.createEphemeralLiveNode Register node as live in ZooKeeper:/live_nodes/127.0.0.1:33700_solr
[junit4:junit4]   2> 8156 T424 oazs.PrepRequestProcessor.pRequest Got user-level KeeperException when processing sessionid:0x139db17d3d30005 type:delete cxid:0x4 zxid:0xfffffffffffffffe txntype:unknown reqpath:n/a Error Path:/solr/live_nodes/127.0.0.1:33700_solr Error:KeeperErrorCode = NoNode for /solr/live_nodes/127.0.0.1:33700_solr
[junit4:junit4]   2> 8157 T419 oascc.SolrZkClient.makePath makePath: /live_nodes/127.0.0.1:33700_solr
[junit4:junit4]   2> 8160 T439 oascc.ZkStateReader$3.process Updating live nodes
[junit4:junit4]   2> 8160 T453 oascc.ZkStateReader$3.process Updating live nodes
[junit4:junit4]   2> 8160 T465 oascc.ZkStateReader$3.process Updating live nodes
[junit4:junit4]   2> 8161 T419 oashc.HttpShardHandlerFactory.getParameter Setting socketTimeout to: 0
[junit4:junit4]   2> 8162 T419 oashc.HttpShardHandlerFactory.getParameter Setting urlScheme to: http://
[junit4:junit4]   2> 8162 T419 oashc.HttpShardHandlerFactory.getParameter Setting connTimeout to: 0
[junit4:junit4]   2> 8162 T419 oashc.HttpShardHandlerFactory.getParameter Setting maxConnectionsPerHost to: 20
[junit4:junit4]   2> 8163 T419 oashc.HttpShardHandlerFactory.getParameter Setting corePoolSize to: 0
[junit4:junit4]   2> 8163 T419 oashc.HttpShardHandlerFactory.getParameter Setting maximumPoolSize to: 2147483647
[junit4:junit4]   2> 8164 T419 oashc.HttpShardHandlerFactory.getParameter Setting maxThreadIdleTime to: 5
[junit4:junit4]   2> 8164 T419 oashc.HttpShardHandlerFactory.getParameter Setting sizeOfQueue to: -1
[junit4:junit4]   2> 8165 T419 oashc.HttpShardHandlerFactory.getParameter Setting fairnessPolicy to: false
[junit4:junit4]   2> 8165 T419 oascsi.HttpClientUtil.createClient Creating new http client, config:maxConnectionsPerHost=20&maxConnections=10000&socketTimeout=0&connTimeout=0&retry=false
[junit4:junit4]   2> 8185 T419 oascc.ZkStateReader.createClusterStateWatchersAndUpdate Updating cluster state from ZooKeeper... 
[junit4:junit4]   2> 8193 T419 oasc.CoreContainer.create Creating SolrCore 'collection1' using instanceDir: /usr/home/hudson/hudson-slave/workspace/Lucene-Solr-Tests-trunk-Java6/solr/build/solr-core/test/J1/./solrtest-jetty3-1348000543386/collection1
[junit4:junit4]   2> 8193 T419 oasc.ZkController.createCollectionZkNode Check for collection zkNode:collection1
[junit4:junit4]   2> 8194 T419 oasc.ZkController.createCollectionZkNode Collection zkNode exists
[junit4:junit4]   2> 8194 T419 oasc.ZkController.readConfigName Load collection config from:/collections/collection1
[junit4:junit4]   2> 8196 T419 oasc.SolrResourceLoader.<init> new SolrResourceLoader for directory: '/usr/home/hudson/hudson-slave/workspace/Lucene-Solr-Tests-trunk-Java6/solr/build/solr-core/test/J1/./solrtest-jetty3-1348000543386/collection1/'
[junit4:junit4]   2> 8197 T419 oasc.SolrResourceLoader.replaceClassLoader Adding 'file:/usr/home/hudson/hudson-slave/workspace/Lucene-Solr-Tests-trunk-Java6/solr/build/solr-core/test/J1/solrtest-jetty3-1348000543386/collection1/lib/README' to classloader
[junit4:junit4]   2> 8198 T419 oasc.SolrResourceLoader.replaceClassLoader Adding 'file:/usr/home/hudson/hudson-slave/workspace/Lucene-Solr-Tests-trunk-Java6/solr/build/solr-core/test/J1/solrtest-jetty3-1348000543386/collection1/lib/classes/' to classloader
[junit4:junit4]   2> 8247 T419 oasc.SolrConfig.<init> Using Lucene MatchVersion: LUCENE_50
[junit4:junit4]   2> 8322 T419 oasc.SolrConfig.<init> Loaded SolrConfig: solrconfig.xml
[junit4:junit4]   2> 8375 T440 oascc.ZkStateReader.updateClusterState Updating cloud state from ZooKeeper... 
[junit4:junit4]   2> 8396 T439 oascc.ZkStateReader$2.process A cluster state change has occurred - updating...
[junit4:junit4]   2> 8396 T453 oascc.ZkStateReader$2.process A cluster state change has occurred - updating...
[junit4:junit4]   2> 8396 T465 oascc.ZkStateReader$2.process A cluster state change has occurred - updating...
[junit4:junit4]   2> 8423 T477 oascc.ZkStateReader$2.process A cluster state change has occurred - updating...
[junit4:junit4]   2> 8423 T419 oass.IndexSchema.readSchema Reading Solr Schema
[junit4:junit4]   2> 8430 T419 oass.IndexSchema.readSchema Schema name=test
[junit4:junit4]   2> 9091 T419 oass.OpenExchangeRatesOrgProvider.init Initialized with rates=open-exchange-rates.json, refreshInterval=1440.
[junit4:junit4]   2> 9110 T419 oass.IndexSchema.readSchema default search field in schema is text
[junit4:junit4]   2> 9117 T419 oass.IndexSchema.readSchema unique key field: id
[junit4:junit4]   2> 9134 T419 oass.FileExchangeRateProvider.reload Reloading exchange rates from file currency.xml
[junit4:junit4]   2> 9142 T419 oass.FileExchangeRateProvider.reload Reloading exchange rates from file currency.xml
[junit4:junit4]   2> 9149 T419 oass.OpenExchangeRatesOrgProvider.reload Reloading exchange rates from open-exchange-rates.json
[junit4:junit4]   2> 9151 T419 oass.OpenExchangeRatesOrgProvider.reload Reloading exchange rates from open-exchange-rates.json
[junit4:junit4]   2> 9153 T419 oasc.SolrCore.<init> [collection1] Opening new SolrCore at /usr/home/hudson/hudson-slave/workspace/Lucene-Solr-Tests-trunk-Java6/solr/build/solr-core/test/J1/./solrtest-jetty3-1348000543386/collection1/, dataDir=./org.apache.solr.cloud.BasicDistributedZk2Test-1348000535500/jetty3/
[junit4:junit4]   2> 9154 T419 oasc.JmxMonitoredMap.<init> JMX monitoring is enabled. Adding Solr mbeans to JMX Server: com.sun.jmx.mbeanserver.JmxMBeanServer@7219d6af
[junit4:junit4]   2> 9156 T419 oasc.SolrCore.getNewIndexDir WARNING New index directory detected: old=null new=./org.apache.solr.cloud.BasicDistributedZk2Test-1348000535500/jetty3/index/
[junit4:junit4]   2> 9158 T419 oasc.SolrCore.initIndex WARNING [collection1] Solr index directory './org.apache.solr.cloud.BasicDistributedZk2Test-1348000535500/jetty3/index' doesn't exist. Creating new index...
[junit4:junit4]   2> 9159 T419 oasc.CachingDirectoryFactory.get return new directory for /usr/home/hudson/hudson-slave/workspace/Lucene-Solr-Tests-trunk-Java6/solr/build/solr-core/test/J1/./org.apache.solr.cloud.BasicDistributedZk2Test-1348000535500/jetty3/index forceNew:false
[junit4:junit4]   2> 9180 T419 oasc.SolrDeletionPolicy.onCommit SolrDeletionPolicy.onCommit: commits:num=1
[junit4:junit4]   2> 		commit{dir=NRTCachingDirectory(org.apache.lucene.store.NIOFSDirectory@/usr/home/hudson/hudson-slave/workspace/Lucene-Solr-Tests-trunk-Java6/solr/build/solr-core/test/J1/org.apache.solr.cloud.BasicDistributedZk2Test-1348000535500/jetty3/index lockFactory=org.apache.lucene.store.NativeFSLockFactory@5dac9e07; maxCacheMB=48.0 maxMergeSizeMB=4.0),segFN=segments_1,generation=1,filenames=[segments_1]
[junit4:junit4]   2> 9181 T419 oasc.SolrDeletionPolicy.updateCommits newest commit = 1
[junit4:junit4]   2> 9182 T419 oasc.SolrCore.initWriters created xml: solr.XMLResponseWriter
[junit4:junit4]   2> 9185 T419 oasup.UpdateRequestProcessorChain.init inserting DistributedUpdateProcessorFactory into updateRequestProcessorChain "dedupe"
[junit4:junit4]   2> 9186 T419 oasup.UpdateRequestProcessorChain.init inserting DistributedUpdateProcessorFactory into updateRequestProcessorChain "dedupe-allfields"
[junit4:junit4]   2> 9186 T419 oasup.UpdateRequestProcessorChain.init inserting DistributedUpdateProcessorFactory into updateRequestProcessorChain "stored_sig"
[junit4:junit4]   2> 9187 T419 oasup.UpdateRequestProcessorChain.init inserting DistributedUpdateProcessorFactory into updateRequestProcessorChain "uniq-fields"
[junit4:junit4]   2> 9188 T419 oasup.UpdateRequestProcessorChain.init inserting DistributedUpdateProcessorFactory into updateRequestProcessorChain "distrib-dup-test-chain-implicit"
[junit4:junit4]   2> 9188 T419 oasc.RequestHandlers.initHandlersFromConfig adding lazy requestHandler: solr.ReplicationHandler
[junit4:junit4]   2> 9189 T419 oasc.RequestHandlers.initHandlersFromConfig created /replication: solr.ReplicationHandler
[junit4:junit4]   2> 9190 T419 oasc.RequestHandlers.initHandlersFromConfig created standard: solr.StandardRequestHandler
[junit4:junit4]   2> 9191 T419 oasc.RequestHandlers.initHandlersFromConfig created /get: solr.RealTimeGetHandler
[junit4:junit4]   2> 9192 T419 oasc.RequestHandlers.initHandlersFromConfig created dismax: solr.SearchHandler
[junit4:junit4]   2> 9192 T419 oasc.RequestHandlers.initHandlersFromConfig created mock: org.apache.solr.core.MockQuerySenderListenerReqHandler
[junit4:junit4]   2> 9193 T419 oasc.RequestHandlers.initHandlersFromConfig created /admin/: org.apache.solr.handler.admin.AdminHandlers
[junit4:junit4]   2> 9194 T419 oasc.RequestHandlers.initHandlersFromConfig created defaults: solr.StandardRequestHandler
[junit4:junit4]   2> 9194 T419 oasc.RequestHandlers.initHandlersFromConfig adding lazy requestHandler: solr.StandardRequestHandler
[junit4:junit4]   2> 9195 T419 oasc.RequestHandlers.initHandlersFromConfig created lazy: solr.StandardRequestHandler
[junit4:junit4]   2> 9196 T419 oasc.RequestHandlers.initHandlersFromConfig created /update: solr.UpdateRequestHandler
[junit4:junit4]   2> 9197 T419 oasc.RequestHandlers.initHandlersFromConfig created /terms: org.apache.solr.handler.component.SearchHandler
[junit4:junit4]   2> 9197 T419 oasc.RequestHandlers.initHandlersFromConfig created spellCheckCompRH: org.apache.solr.handler.component.SearchHandler
[junit4:junit4]   2> 9198 T419 oasc.RequestHandlers.initHandlersFromConfig created spellCheckCompRH_Direct: org.apache.solr.handler.component.SearchHandler
[junit4:junit4]   2> 9199 T419 oasc.RequestHandlers.initHandlersFromConfig created spellCheckWithWordbreak: org.apache.solr.handler.component.SearchHandler
[junit4:junit4]   2> 9200 T419 oasc.RequestHandlers.initHandlersFromConfig created spellCheckWithWordbreak_Direct: org.apache.solr.handler.component.SearchHandler
[junit4:junit4]   2> 9201 T419 oasc.RequestHandlers.initHandlersFromConfig created spellCheckCompRH1: org.apache.solr.handler.component.SearchHandler
[junit4:junit4]   2> 9201 T419 oasc.RequestHandlers.initHandlersFromConfig created tvrh: org.apache.solr.handler.component.SearchHandler
[junit4:junit4]   2> 9202 T419 oasc.RequestHandlers.initHandlersFromConfig created /mlt: solr.MoreLikeThisHandler
[junit4:junit4]   2> 9203 T419 oasc.RequestHandlers.initHandlersFromConfig created /debug/dump: solr.DumpRequestHandler
[junit4:junit4]   2> 9207 T419 oashl.XMLLoader.init xsltCacheLifetimeSeconds=60
[junit4:junit4]   2> 9212 T419 oasc.SolrCore.initDeprecatedSupport WARNING solrconfig.xml uses deprecated <admin/gettableFiles>, Please update your config to use the ShowFileRequestHandler.
[junit4:junit4]   2> 9214 T419 oasc.SolrCore.initDeprecatedSupport WARNING adding ShowFileRequestHandler with hidden files: [SCHEMA.XML, OLD_SYNONYMS.TXT, STOPWORDS.TXT, PROTWORDS.TXT, OPEN-EXCHANGE-RATES.JSON, SYNONYMS.TXT, CURRENCY.XML, MAPPING-ISOLATIN1ACCENT.TXT]
[junit4:junit4]   2> 9218 T419 oass.SolrIndexSearcher.<init> Opening Searcher@76fd5428 main
[junit4:junit4]   2> 9220 T419 oasu.CommitTracker.<init> Hard AutoCommit: disabled
[junit4:junit4]   2> 9220 T419 oasu.CommitTracker.<init> Soft AutoCommit: disabled
[junit4:junit4]   2> 9221 T419 oashc.SpellCheckComponent.inform Initializing spell checkers
[junit4:junit4]   2> 9243 T419 oass.DirectSolrSpellChecker.init init: {name=direct,classname=DirectSolrSpellChecker,field=lowerfilt,minQueryLength=3}
[junit4:junit4]   2> 9332 T478 oasc.SolrCore.registerSearcher [collection1] Registered new searcher Searcher@76fd5428 main{StandardDirectoryReader(segments_1:1)}
[junit4:junit4]   2> 9413 T440 oascc.ZkStateReader.updateClusterState Updating cloud state from ZooKeeper... 
[junit4:junit4]   2> 9441 T439 oascc.ZkStateReader$2.process A cluster state change has occurred - updating...
[junit4:junit4]   2> 9441 T453 oascc.ZkStateReader$2.process A cluster state change has occurred - updating...
[junit4:junit4]   2> 9441 T477 oascc.ZkStateReader$2.process A cluster state change has occurred - updating...
[junit4:junit4]   2> 9441 T465 oascc.ZkStateReader$2.process A cluster state change has occurred - updating...
[junit4:junit4]   2> 9840 T419 oasc.CoreContainer.register registering core: collection1
[junit4:junit4]   2> 9841 T419 oasc.ZkController.register Register shard - core:collection1 address:http://127.0.0.1:33700/solr shardId:shard1
[junit4:junit4]   2> 9889 T419 oasc.ZkController.register We are http://127.0.0.1:33700/solr/collection1/ and leader is http://127.0.0.1:42000/solr/collection1/
[junit4:junit4]   2> 9890 T419 oasc.ZkController.register No LogReplay needed for core=collection1 baseURL=http://127.0.0.1:33700/solr
[junit4:junit4]   2> 9890 T419 oasc.ZkController.checkRecovery Core needs to recover:collection1
[junit4:junit4]   2> 9891 T419 oasu.DefaultSolrCoreState.doRecovery Running recovery - first canceling any ongoing recovery
[junit4:junit4]   2> ASYNC  NEW_CORE C46 name=collection1 org.apache.solr.core.SolrCore@6fb3cd4a url=http://127.0.0.1:33700/solr/collection1 node=127.0.0.1:33700_solr
[junit4:junit4]   2> 9892 T479 C46 P33700 oasc.RecoveryStrategy.run Starting recovery process.  core=collection1 recoveringAfterStartup=true
[junit4:junit4]   2> 9892 T419 oascc.ZkStateReader.updateClusterState Updating cloud state from ZooKeeper... 
[junit4:junit4]   2> 9893 T479 C46 P33700 oasc.RecoveryStrategy.doRecovery ###### startupVersions=[]
[junit4:junit4]   2> 9894 T419 oass.SolrDispatchFilter.init user.dir=/usr/home/hudson/hudson-slave/workspace/Lucene-Solr-Tests-trunk-Java6/solr/build/solr-core/test/J1
[junit4:junit4]   2> 9894 T419 oass.SolrDispatchFilter.init SolrDispatchFilter.init() done
[junit4:junit4]   2> 9895 T419 oascsi.HttpClientUtil.createClient Creating new http client, config:maxConnections=128&maxConnectionsPerHost=32&followRedirects=false
[junit4:junit4]   2> 9936 T479 C46 P33700 oasc.RecoveryStrategy.doRecovery Attempting to PeerSync from http://127.0.0.1:42000/solr/collection1/ core=collection1 - recoveringAfterStartup=true
[junit4:junit4]   2> 9937 T479 C46 P33700 oasu.PeerSync.sync PeerSync: core=collection1 url=http://127.0.0.1:33700/solr START replicas=[http://127.0.0.1:42000/solr/collection1/] nUpdates=100
[junit4:junit4]   2> 9937 T479 C46 P33700 oasu.PeerSync.sync WARNING no frame of reference to tell of we've missed updates
[junit4:junit4]   2> 9938 T479 C46 P33700 oasc.RecoveryStrategy.doRecovery PeerSync Recovery was not successful - trying replication. core=collection1
[junit4:junit4]   2> 9938 T479 C46 P33700 oasc.RecoveryStrategy.doRecovery Starting Replication Recovery. core=collection1
[junit4:junit4]   2> 9938 T479 C46 P33700 oascsi.HttpClientUtil.createClient Creating new http client, config:maxConnections=128&maxConnectionsPerHost=32&followRedirects=false
[junit4:junit4]   2> ASYNC  NEW_CORE C47 name=collection1 org.apache.solr.core.SolrCore@55813ee4 url=http://127.0.0.1:42000/solr/collection1 node=127.0.0.1:42000_solr
[junit4:junit4]   2> 9948 T445 C47 P42000 REQ /get {distrib=false&qt=/get&wt=javabin&version=2&getVersions=100} status=0 QTime=0 
[junit4:junit4]   2> 9956 T440 oascc.ZkStateReader.updateClusterState Updating cloud state from ZooKeeper... 
[junit4:junit4]   2> 10055 T419 oejs.Server.doStart jetty-8.1.2.v20120308
[junit4:junit4]   2> 10057 T419 oejs.AbstractConnector.doStart Started SocketConnector@0.0.0.0:51287
[junit4:junit4]   2> 10058 T419 oasc.SolrResourceLoader.locateSolrHome JNDI not configured for solr (NoInitialContextEx)
[junit4:junit4]   2> 10059 T419 oasc.SolrResourceLoader.locateSolrHome using system property solr.solr.home: /usr/home/hudson/hudson-slave/workspace/Lucene-Solr-Tests-trunk-Java6/solr/build/solr-core/test/J1/./solrtest-jetty4-1348000545408
[junit4:junit4]   2> 10060 T419 oasc.SolrResourceLoader.<init> new SolrResourceLoader for deduced Solr Home: '/usr/home/hudson/hudson-slave/workspace/Lucene-Solr-Tests-trunk-Java6/solr/build/solr-core/test/J1/./solrtest-jetty4-1348000545408/'
[junit4:junit4]   2> 10088 T439 oascc.ZkStateReader$2.process A cluster state change has occurred - updating...
[junit4:junit4]   2> 10088 T477 oascc.ZkStateReader$2.process A cluster state change has occurred - updating...
[junit4:junit4]   2> 10088 T465 oascc.ZkStateReader$2.process A cluster state change has occurred - updating...
[junit4:junit4]   2> 10088 T453 oascc.ZkStateReader$2.process A cluster state change has occurred - updating...
[junit4:junit4]   2> 10095 T419 oass.SolrDispatchFilter.init SolrDispatchFilter.init()
[junit4:junit4]   2> 10095 T419 oasc.SolrResourceLoader.locateSolrHome JNDI not configured for solr (NoInitialContextEx)
[junit4:junit4]   2> 10096 T419 oasc.SolrResourceLoader.locateSolrHome using system property solr.solr.home: /usr/home/hudson/hudson-slave/workspace/Lucene-Solr-Tests-trunk-Java6/solr/build/solr-core/test/J1/./solrtest-jetty4-1348000545408
[junit4:junit4]   2> 10096 T419 oasc.CoreContainer$Initializer.initialize looking for solr.xml: /usr/home/hudson/hudson-slave/workspace/Lucene-Solr-Tests-trunk-Java6/solr/build/solr-core/test/J1/./solrtest-jetty4-1348000545408/solr.xml
[junit4:junit4]   2> 10097 T419 oasc.CoreContainer.<init> New CoreContainer 592091386
[junit4:junit4]   2> 10097 T419 oasc.CoreContainer.load Loading CoreContainer using Solr Home: '/usr/home/hudson/hudson-slave/workspace/Lucene-Solr-Tests-trunk-Java6/solr/build/solr-core/test/J1/./solrtest-jetty4-1348000545408/'
[junit4:junit4]   2> 10098 T419 oasc.SolrResourceLoader.<init> new SolrResourceLoader for directory: '/usr/home/hudson/hudson-slave/workspace/Lucene-Solr-Tests-trunk-Java6/solr/build/solr-core/test/J1/./solrtest-jetty4-1348000545408/'
[junit4:junit4]   2> 10122 T419 oasc.CoreContainer.load Registering Log Listener
[junit4:junit4]   2> 10137 T419 oasc.CoreContainer.initZooKeeper Zookeeper client=127.0.0.1:57077/solr
[junit4:junit4]   2> 10138 T419 oaz.ZooKeeper.<init> Initiating client connection, connectString=127.0.0.1:57077/solr sessionTimeout=5000 watcher=org.apache.solr.common.cloud.ConnectionManager@25830b71
[junit4:junit4]   2> 10139 T490 oaz.ClientCnxn$SendThread.startConnect Opening socket connection to server /127.0.0.1:57077
[junit4:junit4]   2> 10139 T419 oascc.ConnectionManager.waitForConnected Waiting for client to connect to ZooKeeper
[junit4:junit4]   2> 10140 T490 oaz.ClientCnxn$SendThread.primeConnection Socket connection established to localhost/127.0.0.1:57077, initiating session
[junit4:junit4]   2> 10140 T421 oazs.NIOServerCnxn$Factory.run Accepted socket connection from /140.211.11.196:28896
[junit4:junit4]   2> 10140 T421 oazs.NIOServerCnxn.readConnectRequest Client attempting to establish new session at /140.211.11.196:28896
[junit4:junit4]   2> 10174 T423 oazs.NIOServerCnxn.finishSessionInit Established session 0x139db17d3d30006 with negotiated timeout 5000 for client /140.211.11.196:28896
[junit4:junit4]   2> 10174 T490 oaz.ClientCnxn$SendThread.readConnectResult Session establishment complete on server localhost/127.0.0.1:57077, sessionid = 0x139db17d3d30006, negotiated timeout = 5000
[junit4:junit4]   2> 10174 T491 oascc.ConnectionManager.process Watcher org.apache.solr.common.cloud.ConnectionManager@25830b71 name:ZooKeeperConnection Watcher:127.0.0.1:57077/solr got event WatchedEvent state:SyncConnected type:None path:null path:null type:None
[junit4:junit4]   2> 10175 T419 oascc.ConnectionManager.waitForConnected Client is connected to ZooKeeper
[junit4:junit4]   2> 10176 T424 oazs.PrepRequestProcessor.pRequest Got user-level KeeperException when processing sessionid:0x139db17d3d30006 type:create cxid:0x1 zxid:0xfffffffffffffffe txntype:unknown reqpath:n/a Error Path:/solr/overseer Error:KeeperErrorCode = NodeExists for /solr/overseer
[junit4:junit4]   2> 10230 T424 oazs.PrepRequestProcessor.pRequest Got user-level KeeperException when processing sessionid:0x139db17d3d30006 type:create cxid:0x2 zxid:0xfffffffffffffffe txntype:unknown reqpath:n/a Error Path:/solr/overseer Error:KeeperErrorCode = NodeExists for /solr/overseer
[junit4:junit4]   2> 10253 T419 oasc.ZkController.createEphemeralLiveNode Register node as live in ZooKeeper:/live_nodes/127.0.0.1:51287_solr
[junit4:junit4]   2> 10254 T424 oazs.PrepRequestProcessor.pRequest Got user-level KeeperException when processing sessionid:0x139db17d3d30006 type:delete cxid:0x4 zxid:0xfffffffffffffffe txntype:unknown reqpath:n/a Error Path:/solr/live_nodes/127.0.0.1:51287_solr Error:KeeperErrorCode = NoNode for /solr/live_nodes/127.0.0.1:51287_solr
[junit4:junit4]   2> 10302 T419 oascc.SolrZkClient.makePath makePath: /live_nodes/127.0.0.1:51287_solr
[junit4:junit4]   2> 10342 T439 oascc.ZkStateReader$3.process Updating live nodes
[junit4:junit4]   2> 10342 T465 oascc.ZkStateReader$3.process Updating live nodes
[junit4:junit4]   2> 10342 T453 oascc.ZkStateReader$3.process Updating live nodes
[junit4:junit4]   2> 10342 T477 oascc.ZkStateReader$3.process Updating live nodes
[junit4:junit4]   2> 10343 T419 oashc.HttpShardHandlerFactory.getParameter Setting socketTimeout to: 0
[junit4:junit4]   2> 10344 T419 oashc.HttpShardHandlerFactory.getParameter Setting urlScheme to: http://
[junit4:junit4]   2> 10344 T419 oashc.HttpShardHandlerFactory.getParameter Setting connTimeout to: 0
[junit4:junit4]   2> 10345 T419 oashc.HttpShardHandlerFactory.getParameter Setting maxConnectionsPerHost to: 20
[junit4:junit4]   2> 10345 T419 oashc.HttpShardHandlerFactory.getParameter Setting corePoolSize to: 0
[junit4:junit4]   2> 10346 T419 oashc.HttpShardHandlerFactory.getParameter Setting maximumPoolSize to: 2147483647
[junit4:junit4]   2> 10346 T419 oashc.HttpShardHandlerFactory.getParameter Setting maxThreadIdleTime to: 5
[junit4:junit4]   2> 10347 T419 oashc.HttpShardHandlerFactory.getParameter Setting sizeOfQueue to: -1
[junit4:junit4]   2> 10347 T419 oashc.HttpShardHandlerFactory.getParameter Setting fairnessPolicy to: false
[junit4:junit4]   2> 10348 T419 oascsi.HttpClientUtil.createClient Creating new http client, config:maxConnectionsPerHost=20&maxConnections=10000&socketTimeout=0&connTimeout=0&retry=false
[junit4:junit4]   2> 10368 T419 oascc.ZkStateReader.createClusterStateWatchersAndUpdate Updating cluster state from ZooKeeper... 
[junit4:junit4]   2> 10374 T419 oasc.CoreContainer.create Creating SolrCore 'collection1' using instanceDir: /usr/home/hudson/hudson-slave/workspace/Lucene-Solr-Tests-trunk-Java6/solr/build/solr-core/test/J1/./solrtest-jetty4-1348000545408/collection1
[junit4:junit4]   2> 10375 T419 oasc.ZkController.createCollectionZkNode Check for collection zkNode:collection1
[junit4:junit4]   2> 10376 T419 oasc.ZkController.createCollectionZkNode Collection zkNode exists
[junit4:junit4]   2> 10376 T419 oasc.ZkController.readConfigName Load collection config from:/collections/collection1
[junit4:junit4]   2> 10378 T419 oasc.SolrResourceLoader.<init> new SolrResourceLoader for directory: '/usr/home/hudson/hudson-slave/workspace/Lucene-Solr-Tests-trunk-Java6/solr/build/solr-core/test/J1/./solrtest-jetty4-1348000545408/collection1/'
[junit4:junit4]   2> 10379 T419 oasc.SolrResourceLoader.replaceClassLoader Adding 'file:/usr/home/hudson/hudson-slave/workspace/Lucene-Solr-Tests-trunk-Java6/solr/build/solr-core/test/J1/solrtest-jetty4-1348000545408/collection1/lib/README' to classloader
[junit4:junit4]   2> 10380 T419 oasc.SolrResourceLoader.replaceClassLoader Adding 'file:/usr/home/hudson/hudson-slave/workspace/Lucene-Solr-Tests-trunk-Java6/solr/build/solr-core/test/J1/solrtest-jetty4-1348000545408/collection1/lib/classes/' to classloader
[junit4:junit4]   2> 10430 T419 oasc.SolrConfig.<init> Using Lucene MatchVersion: LUCENE_50
[junit4:junit4]   2> 10506 T419 oasc.SolrConfig.<init> Loaded SolrConfig: solrconfig.xml
[junit4:junit4]   2> 10607 T419 oass.IndexSchema.readSchema Reading Solr Schema
[junit4:junit4]   2> 10614 T419 oass.IndexSchema.readSchema Schema name=test
[junit4:junit4]   2> 11229 T419 oass.OpenExchangeRatesOrgProvider.init Initialized with rates=open-exchange-rates.json, refreshInterval=1440.
[junit4:junit4]   2> 11241 T419 oass.IndexSchema.readSchema default search field in schema is text
[junit4:junit4]   2> 11245 T419 oass.IndexSchema.readSchema unique key field: id
[junit4:junit4]   2> 11259 T419 oass.FileExchangeRateProvider.reload Reloading exchange rates from file currency.xml
[junit4:junit4]   2> 11263 T419 oass.FileExchangeRateProvider.reload Reloading exchange rates from file currency.xml
[junit4:junit4]   2> 11268 T419 oass.OpenExchangeRatesOrgProvider.reload Reloading exchange rates from open-exchange-rates.json
[junit4:junit4]   2> 11270 T419 oass.OpenExchangeRatesOrgProvider.reload Reloading exchange rates from open-exchange-rates.json
[junit4:junit4]   2> 11271 T419 oasc.SolrCore.<init> [collection1] Opening new SolrCore at /usr/home/hudson/hudson-slave/workspace/Lucene-Solr-Tests-trunk-Java6/solr/build/solr-core/test/J1/./solrtest-jetty4-1348000545408/collection1/, dataDir=./org.apache.solr.cloud.BasicDistributedZk2Test-1348000535500/jetty4/
[junit4:junit4]   2> 11272 T419 oasc.JmxMonitoredMap.<init> JMX monitoring is enabled. Adding Solr mbeans to JMX Server: com.sun.jmx.mbeanserver.JmxMBeanServer@7219d6af
[junit4:junit4]   2> 11273 T419 oasc.SolrCore.getNewIndexDir WARNING New index directory detected: old=null new=./org.apache.solr.cloud.BasicDistributedZk2Test-1348000535500/jetty4/index/
[junit4:junit4]   2> 11274 T419 oasc.SolrCore.initIndex WARNING [collection1] Solr index directory './org.apache.solr.cloud.BasicDistributedZk2Test-1348000535500/jetty4/index' doesn't exist. Creating new index...
[junit4:junit4]   2> 11275 T419 oasc.CachingDirectoryFactory.get return new directory for /usr/home/hudson/hudson-slave/workspace/Lucene-Solr-Tests-trunk-Java6/solr/build/solr-core/test/J1/./org.apache.solr.cloud.BasicDistributedZk2Test-1348000535500/jetty4/index forceNew:false
[junit4:junit4]   2> 11282 T419 oasc.SolrDeletionPolicy.onCommit SolrDeletionPolicy.onCommit: commits:num=1
[junit4:junit4]   2> 		commit{dir=NRTCachingDirectory(org.apache.lucene.store.NIOFSDirectory@/usr/home/hudson/hudson-slave/workspace/Lucene-Solr-Tests-trunk-Java6/solr/build/solr-core/test/J1/org.apache.solr.cloud.BasicDistributedZk2Test-1348000535500/jetty4/index lockFactory=org.apache.lucene.store.NativeFSLockFactory@c4dc1e4; maxCacheMB=48.0 maxMergeSizeMB=4.0),segFN=segments_1,generation=1,filenames=[segments_1]
[junit4:junit4]   2> 11282 T419 oasc.SolrDeletionPolicy.updateCommits newest commit = 1
[junit4:junit4]   2> 11283 T419 oasc.SolrCore.initWriters created xml: solr.XMLResponseWriter
[junit4:junit4]   2> 11286 T419 oasup.UpdateRequestProcessorChain.init inserting DistributedUpdateProcessorFactory into updateRequestProcessorChain "dedupe"
[junit4:junit4]   2> 11286 T419 oasup.UpdateRequestProcessorChain.init inserting DistributedUpdateProcessorFactory into updateRequestProcessorChain "dedupe-allfields"
[junit4:junit4]   2> 11287 T419 oasup.UpdateRequestProcessorChain.init inserting DistributedUpdateProcessorFactory into updateRequestProcessorChain "stored_sig"
[junit4:junit4]   2> 11287 T419 oasup.UpdateRequestProcessorChain.init inserting DistributedUpdateProcessorFactory into updateRequestProcessorChain "uniq-fields"
[junit4:junit4]   2> 11288 T419 oasup.UpdateRequestProcessorChain.init inserting DistributedUpdateProcessorFactory into updateRequestProcessorChain "distrib-dup-test-chain-implicit"
[junit4:junit4]   2> 11289 T419 oasc.RequestHandlers.initHandlersFromConfig adding lazy requestHandler: solr.ReplicationHandler
[junit4:junit4]   2> 11289 T419 oasc.RequestHandlers.initHandlersFromConfig created /replication: solr.ReplicationHandler
[junit4:junit4]   2> 11290 T419 oasc.RequestHandlers.initHandlersFromConfig created standard: solr.StandardRequestHandler
[junit4:junit4]   2> 11291 T419 oasc.RequestHandlers.initHandlersFromConfig created /get: solr.RealTimeGetHandler
[junit4:junit4]   2> 11291 T419 oasc.RequestHandlers.initHandlersFromConfig created dismax: solr.SearchHandler
[junit4:junit4]   2> 11292 T419 oasc.RequestHandlers.initHandlersFromConfig created mock: org.apache.solr.core.MockQuerySenderListenerReqHandler
[junit4:junit4]   2> 11293 T419 oasc.RequestHandlers.initHandlersFromConfig created /admin/: org.apache.solr.handler.admin.AdminHandlers
[junit4:junit4]   2> 11294 T419 oasc.RequestHandlers.initHandlersFromConfig created defaults: solr.StandardRequestHandler
[junit4:junit4]   2> 11294 T419 oasc.RequestHandlers.initHandlersFromConfig adding lazy requestHandler: solr.StandardRequestHandler
[junit4:junit4]   2> 11295 T419 oasc.RequestHandlers.initHandlersFromConfig created lazy: solr.StandardRequestHandler
[junit4:junit4]   2> 11295 T419 oasc.RequestHandlers.initHandlersFromConfig created /update: solr.UpdateRequestHandler
[junit4:junit4]   2> 11296 T419 oasc.RequestHandlers.initHandlersFromConfig created /terms: org.apache.solr.handler.component.SearchHandler
[junit4:junit4]   2> 11297 T419 oasc.RequestHandlers.initHandlersFromConfig created spellCheckCompRH: org.apache.solr.handler.component.SearchHandler
[junit4:junit4]   2> 11297 T419 oasc.RequestHandlers.initHandlersFromConfig created spellCheckCompRH_Direct: org.apache.solr.handler.component.SearchHandler
[junit4:junit4]   2> 11298 T419 oasc.RequestHandlers.initHandlersFromConfig created spellCheckWithWordbreak: org.apache.solr.handler.component.SearchHandler
[junit4:junit4]   2> 11299 T419 oasc.RequestHandlers.initHandlersFromConfig created spellCheckWithWordbreak_Direct: org.apache.solr.handler.component.SearchHandler
[junit4:junit4]   2> 11299 T419 oasc.RequestHandlers.initHandlersFromConfig created spellCheckCompRH1: org.apache.solr.handler.component.SearchHandler
[junit4:junit4]   2> 11300 T419 oasc.RequestHandlers.initHandlersFromConfig created tvrh: org.apache.solr.handler.component.SearchHandler
[junit4:junit4]   2> 11301 T419 oasc.RequestHandlers.initHandlersFromConfig created /mlt: solr.MoreLikeThisHandler
[junit4:junit4]   2> 11302 T419 oasc.RequestHandlers.initHandlersFromConfig created /debug/dump: solr.DumpRequestHandler
[junit4:junit4]   2> 11305 T419 oashl.XMLLoader.init xsltCacheLifetimeSeconds=60
[junit4:junit4]   2> 11310 T419 oasc.SolrCore.initDeprecatedSupport WARNING solrconfig.xml uses deprecated <admin/gettableFiles>, Please update your config to use the ShowFileRequestHandler.
[junit4:junit4]   2> 11311 T419 oasc.SolrCore.initDeprecatedSupport WARNING adding ShowFileRequestHandler with hidden files: [SCHEMA.XML, OLD_SYNONYMS.TXT, STOPWORDS.TXT, PROTWORDS.TXT, OPEN-EXCHANGE-RATES.JSON, SYNONYMS.TXT, CURRENCY.XML, MAPPING-ISOLATIN1ACCENT.TXT]
[junit4:junit4]   2> 11316 T419 oass.SolrIndexSearcher.<init> Opening Searcher@2a9e3ba7 main
[junit4:junit4]   2> 11317 T419 oasu.CommitTracker.<init> Hard AutoCommit: disabled
[junit4:junit4]   2> 11318 T419 oasu.CommitTracker.<init> Soft AutoCommit: disabled
[junit4:junit4]   2> 11318 T419 oashc.SpellCheckComponent.inform Initializing spell checkers
[junit4:junit4]   2> 11340 T419 oass.DirectSolrSpellChecker.init init: {name=direct,classname=DirectSolrSpellChecker,field=lowerfilt,minQueryLength=3}
[junit4:junit4]   2> 11442 T492 oasc.SolrCore.registerSearcher [collection1] Registered new searcher Searcher@2a9e3ba7 main{StandardDirectoryReader(segments_1:1)}
[junit4:junit4]   2> 11641 T440 oascc.ZkStateReader.updateClusterState Updating cloud state from ZooKeeper... 
[junit4:junit4]   2> 11652 T439 oascc.ZkStateReader$2.process A cluster state change has occurred - updating...
[junit4:junit4]   2> 11652 T477 oascc.ZkStateReader$2.process A cluster state change has occurred - updating...
[junit4:junit4]   2> 11652 T453 oascc.ZkStateReader$2.process A cluster state change has occurred - updating...
[junit4:junit4]   2> 11652 T491 oascc.ZkStateReader$2.process A cluster state change has occurred - updating...
[junit4:junit4]   2> 11652 T465 oascc.ZkStateReader$2.process A cluster state change has occurred - updating...
[junit4:junit4]   2> 11957 T419 oasc.CoreContainer.register registering core: collection1
[junit4:junit4]   2> 11957 T419 oasc.ZkController.register Register shard - core:collection1 address:http://127.0.0.1:51287/solr shardId:shard2
[junit4:junit4]   2> 11964 T419 oasc.ZkController.register We are http://127.0.0.1:51287/solr/collection1/ and leader is http://127.0.0.1:29767/solr/collection1/
[junit4:junit4]   2> 11965 T419 oasc.ZkController.register No LogReplay needed for core=collection1 baseURL=http://127.0.0.1:51287/solr
[junit4:junit4]   2> 11965 T419 oasc.ZkController.checkRecovery Core needs to recover:collection1
[junit4:junit4]   2> 11965 T419 oasu.DefaultSolrCoreState.doRecovery Running recovery - first canceling any ongoing recovery
[junit4:junit4]   2> ASYNC  NEW_CORE C48 name=collection1 org.apache.solr.core.SolrCore@4e280ec url=http://127.0.0.1:51287/solr/collection1 node=127.0.0.1:51287_solr
[junit4:junit4]   2> 11966 T493 C48 P51287 oasc.RecoveryStrategy.run Starting recovery process.  core=collection1 recoveringAfterStartup=true
[junit4:junit4]   2> 11967 T493 C48 P51287 oasc.RecoveryStrategy.doRecovery ###### startupVersions=[]
[junit4:junit4]   2> 11967 T419 oascc.ZkStateReader.updateClusterState Updating cloud state from ZooKeeper... 
[junit4:junit4]   2> 11968 T419 oass.SolrDispatchFilter.init user.dir=/usr/home/hudson/hudson-slave/workspace/Lucene-Solr-Tests-trunk-Java6/solr/build/solr-core/test/J1
[junit4:junit4]   2> 11968 T419 oass.SolrDispatchFilter.init SolrDispatchFilter.init() done
[junit4:junit4]   2> 11969 T419 oascsi.HttpClientUtil.createClient Creating new http client, config:maxConnections=128&maxConnectionsPerHost=32&followRedirects=false
[junit4:junit4]   2> 11970 T493 C48 P51287 oasc.RecoveryStrategy.doRecovery Attempting to PeerSync from http://127.0.0.1:29767/solr/collection1/ core=collection1 - recoveringAfterStartup=true
[junit4:junit4]   2> 11971 T493 C48 P51287 oasu.PeerSync.sync PeerSync: core=collection1 url=http://127.0.0.1:51287/solr START replicas=[http://127.0.0.1:29767/solr/collection1/] nUpdates=100
[junit4:junit4]   2> 11971 T493 C48 P51287 oasu.PeerSync.sync WARNING no frame of reference to tell of we've missed updates
[junit4:junit4]   2> 11971 T493 C48 P51287 oasc.RecoveryStrategy.doRecovery PeerSync Recovery was not successful - trying replication. core=collection1
[junit4:junit4]   2> 11972 T493 C48 P51287 oasc.RecoveryStrategy.doRecovery Starting Replication Recovery. core=collection1
[junit4:junit4]   2> 11972 T493 C48 P51287 oascsi.HttpClientUtil.createClient Creating new http client, config:maxConnections=128&maxConnectionsPerHost=32&followRedirects=false
[junit4:junit4]   2> ASYNC  NEW_CORE C49 name=collection1 org.apache.solr.core.SolrCore@1b45fed7 url=http://127.0.0.1:29767/solr/collection1 node=127.0.0.1:29767_solr
[junit4:junit4]   2> 11982 T457 C49 P29767 REQ /get {distrib=false&qt=/get&wt=javabin&version=2&getVersions=100} status=0 QTime=1 
[junit4:junit4]   2> 11985 T419 oaz.ZooKeeper.<init> Initiating client connection, connectString=127.0.0.1:57077/solr sessionTimeout=10000 watcher=org.apache.solr.common.cloud.ConnectionManager@4c41a09
[junit4:junit4]   2> 12111 T495 oaz.ClientCnxn$SendThread.startConnect Opening socket connection to server /127.0.0.1:57077
[junit4:junit4]   2> 12111 T419 oascc.ConnectionManager.waitForConnected Waiting for client to connect to ZooKeeper
[junit4:junit4]   2> 12113 T495 oaz.ClientCnxn$SendThread.primeConnection Socket connection established to localhost/127.0.0.1:57077, initiating session
[junit4:junit4]   2> 12113 T421 oazs.NIOServerCnxn$Factory.run Accepted socket connection from /140.211.11.196:31519
[junit4:junit4]   2> 12113 T421 oazs.NIOServerCnxn.readConnectRequest Client attempting to establish new session at /140.211.11.196:31519
[junit4:junit4]   2> 12121 T423 oazs.NIOServerCnxn.finishSessionInit Established session 0x139db17d3d30007 with negotiated timeout 10000 for client /140.211.11.196:31519
[junit4:junit4]   2> 12122 T495 oaz.ClientCnxn$SendThread.readConnectResult Session establishment complete on server localhost/127.0.0.1:57077, sessionid = 0x139db17d3d30007, negotiated timeout = 10000
[junit4:junit4]   2> 12122 T496 oascc.ConnectionManager.process Watcher org.apache.solr.common.cloud.ConnectionManager@4c41a09 name:ZooKeeperConnection Watcher:127.0.0.1:57077/solr got event WatchedEvent state:SyncConnected type:None path:null path:null type:None
[junit4:junit4]   2> 12122 T419 oascc.ConnectionManager.waitForConnected Client is connected to ZooKeeper
[junit4:junit4]   2> 12123 T419 oascc.ZkStateReader.createClusterStateWatchersAndUpdate Updating cluster state from ZooKeeper... 
[junit4:junit4]   2> 12125 T419 oasc.ChaosMonkey.monkeyLog monkey: init - expire sessions:true cause connection loss:true
[junit4:junit4]   2> 12126 T419 oascsi.HttpClientUtil.createClient Creating new http client, config:
[junit4:junit4]   2> 12135 T419 oascc.ZkStateReader.updateClusterState Updating cloud state from ZooKeeper... 
[junit4:junit4]   2> ASYNC  NEW_CORE C50 name=collection1 org.apache.solr.core.SolrCore@350510c7 url=http://127.0.0.1:61533/solr/collection1 node=127.0.0.1:61533_solr
[junit4:junit4]   2> 12148 T431 C50 P61533 oasc.SolrDeletionPolicy.onInit SolrDeletionPolicy.onInit: commits:num=1
[junit4:junit4]   2> 		commit{dir=NRTCachingDirectory(org.apache.lucene.store.NIOFSDirectory@/usr/home/hudson/hudson-slave/workspace/Lucene-Solr-Tests-trunk-Java6/solr/build/solr-core/test/J1/org.apache.solr.cloud.BasicDistributedZk2Test-1348000535500/control/data/index lockFactory=org.apache.lucene.store.NativeFSLockFactory@19676aa8; maxCacheMB=48.0 maxMergeSizeMB=4.0),segFN=segments_1,generation=1,filenames=[segments_1]
[junit4:junit4]   2> 12149 T431 C50 P61533 oasc.SolrDeletionPolicy.updateCommits newest commit = 1
[junit4:junit4]   2> 12153 T431 C50 P61533 /update {wt=javabin&version=2} {add=[1 (1413481022242160640)]} 0 10
[junit4:junit4]   2> 12154 T419 oaz.ZooKeeper.<init> Initiating client connection, connectString=127.0.0.1:57077/solr sessionTimeout=10000 watcher=org.apache.solr.common.cloud.ConnectionManager@2d3acc3f
[junit4:junit4]   2> 12155 T497 oaz.ClientCnxn$SendThread.startConnect Opening socket connection to server /127.0.0.1:57077
[junit4:junit4]   2> 12155 T419 oascc.ConnectionManager.waitForConnected Waiting for client to connect to ZooKeeper
[junit4:junit4]   2> 12157 T497 oaz.ClientCnxn$SendThread.primeConnection Socket connection established to localhost/127.0.0.1:57077, initiating session
[junit4:junit4]   2> 12157 T421 oazs.NIOServerCnxn$Factory.run Accepted socket connection from /140.211.11.196:41913
[junit4:junit4]   2> 12157 T421 oazs.NIOServerCnxn.readConnectRequest Client attempting to establish new session at /140.211.11.196:41913
[junit4:junit4]   2> 12166 T423 oazs.NIOServerCnxn.finishSessionInit Established session 0x139db17d3d30008 with negotiated timeout 10000 for client /140.211.11.196:41913
[junit4:junit4]   2> 12166 T497 oaz.ClientCnxn$SendThread.readConnectResult Session establishment complete on server localhost/127.0.0.1:57077, sessionid = 0x139db17d3d30008, negotiated timeout = 10000
[junit4:junit4]   2> 12167 T498 oascc.ConnectionManager.process Watcher org.apache.solr.common.cloud.ConnectionManager@2d3acc3f name:ZooKeeperConnection Watcher:127.0.0.1:57077/solr got event WatchedEvent state:SyncConnected type:None path:null path:null type:None
[junit4:junit4]   2> 12167 T440 oascc.ZkStateReader.updateClusterState Updating cloud state from ZooKeeper... 
[junit4:junit4]   2> 12167 T419 oascc.ConnectionManager.waitForConnected Client is connected to ZooKeeper
[junit4:junit4]   2> 12168 T419 oascc.ZkStateReader.createClusterStateWatchersAndUpdate Updating cluster state from ZooKeeper... 
[junit4:junit4]   2> 12180 T447 C47 P42000 oasc.SolrDeletionPolicy.onInit SolrDeletionPolicy.onInit: commits:num=1
[junit4:junit4]   2> 		commit{dir=NRTCachingDirectory(org.apache.lucene.store.NIOFSDirectory@/usr/home/hudson/hudson-slave/workspace/Lucene-Solr-Tests-trunk-Java6/solr/build/solr-core/test/J1/org.apache.solr.cloud.BasicDistributedZk2Test-1348000535500/jetty1/index lockFactory=org.apache.lucene.store.NativeFSLockFactory@5c9282ca; maxCacheMB=48.0 maxMergeSizeMB=4.0),segFN=segments_1,generation=1,filenames=[segments_1]
[junit4:junit4]   2> 12181 T447 C47 P42000 oasc.SolrDeletionPolicy.updateCommits newest commit = 1
[junit4:junit4]   2> 12197 T439 oascc.ZkStateReader$2.process A cluster state change has occurred - updating...
[junit4:junit4]   2> 12197 T496 oascc.ZkStateReader$2.process A cluster state change has occurred - updating...
[junit4:junit4]   2> 12197 T498 oascc.ZkStateReader$2.process A cluster state change has occurred - updating...
[junit4:junit4]   2> 12197 T477 oascc.ZkStateReader$2.process A cluster state change has occurred - updating...
[junit4:junit4]   2> 12197 T491 oascc.ZkStateReader$2.process A cluster state change has occurred - updating...
[junit4:junit4]   2> 12197 T465 oascc.ZkStateReader$2.process A cluster state change has occurred - updating...
[junit4:junit4]   2> 12197 T453 oascc.ZkStateReader$2.process A cluster state change has occurred - updating...
[junit4:junit4]   2>  C46_STATE=coll:collection1 core:collection1 props:{shard=shard1, roles=null, state=recovering, core=collection1, collection=collection1, node_name=127.0.0.1:33700_solr, base_url=http://127.0.0.1:33700/solr}
[junit4:junit4]   2> 12230 T469 C46 P33700 oasc.SolrDeletionPolicy.onInit SolrDeletionPolicy.onInit: commits:num=1
[junit4:junit4]   2> 		commit{dir=NRTCachingDirectory(org.apache.lucene.store.NIOFSDirectory@/usr/home/hudson/hudson-slave/workspace/Lucene-Solr-Tests-trunk-Java6/solr/build/solr-core/test/J1/org.apache.solr.cloud.BasicDistributedZk2Test-1348000535500/jetty3/index lockFactory=org.apache.lucene.store.NativeFSLockFactory@5dac9e07; maxCacheMB=48.0 maxMergeSizeMB=4.0),segFN=segments_1,generation=1,filenames=[segments_1]
[junit4:junit4]   2> 12231 T469 C46 P33700 oasc.SolrDeletionPolicy.updateCommits newest commit = 1
[junit4:junit4]   2> 12235 T469 C46 P33700 REQ /update {distrib.from=http://127.0.0.1:42000/solr/collection1/&update.distrib=FROMLEADER&wt=javabin&version=2} status=0 QTime=41 
[junit4:junit4]   2> 12236 T447 C47 P42000 /update {wt=javabin&version=2} {add=[1 (1413481022276763648)]} 0 60
[junit4:junit4]   2> 12237 T419 oasc.AbstractDistribZkTestBase.waitForRecoveriesToFinish Wait for recoveries to finish - collection: collection1 failOnTimeout:true timeout (sec):1800
[junit4:junit4]   2> 12238 T419 oascc.ZkStateReader.updateClusterState Updating cloud state from ZooKeeper... 
[junit4:junit4]   2> 12957 T479 C46 P33700 oasc.RecoveryStrategy.doRecovery Begin buffering updates. core=collection1
[junit4:junit4]   2> 12957 T479 C46 P33700 oasu.UpdateLog.bufferUpdates Starting to buffer updates. FSUpdateLog{state=ACTIVE, tlog=tlog{file=./org.apache.solr.cloud.BasicDistributedZk2Test-1348000535500/jetty3/tlog/tlog.0000000000000000000 refcount=1}}
[junit4:junit4]   2> 12958 T479 C46 P33700 oasc.RecoveryStrategy.replicate Attempting to replicate from http://127.0.0.1:42000/solr/collection1/. core=collection1
[junit4:junit4]   2> 12958 T479 C46 P33700 oascsi.HttpClientUtil.createClient Creating new http client, config:maxConnections=128&maxConnectionsPerHost=32&followRedirects=false
[junit4:junit4]   2> 12974 T448 C47 P42000 oasu.DirectUpdateHandler2.commit start commit{flags=0,_version_=0,optimize=false,openSearcher=true,waitSearcher=true,expungeDeletes=false,softCommit=false}
[junit4:junit4]   2> 13102 T448 C47 P42000 oasc.SolrDeletionPolicy.onCommit SolrDeletionPolicy.onCommit: commits:num=2
[junit4:junit4]   2> 		commit{dir=NRTCachingDirectory(org.apache.lucene.store.NIOFSDirectory@/usr/home/hudson/hudson-slave/workspace/Lucene-Solr-Tests-trunk-Java6/solr/build/solr-core/test/J1/org.apache.solr.cloud.BasicDistributedZk2Test-1348000535500/jetty1/index lockFactory=org.apache.lucene.store.NativeFSLockFactory@5c9282ca; maxCacheMB=48.0 maxMergeSizeMB=4.0),segFN=segments_1,generation=1,filenames=[segments_1]
[junit4:junit4]   2> 		commit{dir=NRTCachingDirectory(org.apache.lucene.store.NIOFSDirectory@/usr/home/hudson/hudson-slave/workspace/Lucene-Solr-Tests-trunk-Java6/solr/build/solr-core/test/J1/org.apache.solr.cloud.BasicDistributedZk2Test-1348000535500/jetty1/index lockFactory=org.apache.lucene.store.NativeFSLockFactory@5c9282ca; maxCacheMB=48.0 maxMergeSizeMB=4.0),segFN=segments_2,generation=2,filenames=[_0_TestBloomFilteredLucene40Postings_0.prx, _0_MockFixedIntBlock_0.tib, _0_NestedPulsing_0.tip, _0_Pulsing40_0.prx, _0_Pulsing40_0.frq, _0_NestedPulsing_0.tim, _0_MockFixedIntBlock_0.skp, _0_MockFixedIntBlock_0.pyl, _0_MockFixedIntBlock_0.tii, _0_Pulsing40_0.tip, _0_TestBloomFilteredLucene40Postings_0.frq, _0.si, _0_TestBloomFilteredLucene40Postings_0.tim, _0_TestBloomFilteredLucene40Postings_0.tip, _0_TestBloomFilteredLucene40Postings_0.blm, _0_Pulsing40_0.tim, _0.fnm, _0_NestedPulsing_0.frq, _0_MockFixedIntBlock_0.pos, _0_nrm.cfs, _0_NestedPulsing_0.prx, _0_MockFixedIntBlock_0.frq, _0_MockFixedIntBlock_0.doc, _0_nrm.cfe, segments_2, _0.fdx, _0.fdt]
[junit4:junit4]   2> 13103 T448 C47 P42000 oasc.SolrDeletionPolicy.updateCommits newest commit = 2
[junit4:junit4]   2> 13121 T448 C47 P42000 oass.SolrIndexSearcher.<init> Opening Searcher@69d2bdc3 main
[junit4:junit4]   2> 13122 T448 C47 P42000 oasu.DirectUpdateHandler2.commit end_commit_flush
[junit4:junit4]   2> 13123 T454 oasc.SolrCore.registerSearcher [collection1] Registered new searcher Searcher@69d2bdc3 main{StandardDirectoryReader(segments_2:3 _0(5.0):C1)}
[junit4:junit4]   2> 13124 T448 C47 P42000 /update {waitSearcher=true&commit=true&commit_end_point=true&wt=javabin&softCommit=false&version=2} {commit=} 0 150
[junit4:junit4]   2> 13125 T479 C46 P33700 oash.ReplicationHandler.inform Commits will be reserved for  10000
[junit4:junit4]   2> 13125 T479 C46 P33700 oash.SnapPuller.<init>  No value set for 'pollInterval'. Timer Task not started.
[junit4:junit4]   2> 13127 T449 C47 P42000 oash.ReplicationHandler.inform Commits will be reserved for  10000
[junit4:junit4]   2> 13128 T449 C47 P42000 REQ /replication {command=indexversion&wt=javabin&qt=/replication&version=2} status=0 QTime=1 
[junit4:junit4]   2> 13129 T479 C46 P33700 oash.SnapPuller.fetchLatestIndex Master's generation: 2
[junit4:junit4]   2> 13129 T479 C46 P33700 oash.SnapPuller.fetchLatestIndex Slave's generation: 1
[junit4:junit4]   2> 13129 T479 C46 P33700 oash.SnapPuller.fetchLatestIndex Starting replication process
[junit4:junit4]   2> 13135 T449 C47 P42000 REQ /replication {command=filelist&generation=2&wt=javabin&qt=/replication&version=2} status=0 QTime=3 
[junit4:junit4]   2> 13136 T479 C46 P33700 oash.SnapPuller.fetchLatestIndex Number of files in latest index in master: 27
[junit4:junit4]   2> 13147 T479 C46 P33700 oash.SnapPuller.fetchLatestIndex Starting download to ./org.apache.solr.cloud.BasicDistributedZk2Test-1348000535500/jetty3/index.20120918163548634 fullCopy=true
[junit4:junit4]   2> 13151 T449 C47 P42000 REQ /replication {file=_0_TestBloomFilteredLucene40Postings_0.prx&command=filecontent&checksum=true&generation=2&qt=/replication&wt=filestream} status=0 QTime=0 
[junit4:junit4]   2> 13157 T449 C47 P42000 REQ /replication {file=_0_Pulsing40_0.prx&command=filecontent&checksum=true&generation=2&qt=/replication&wt=filestream} status=0 QTime=0 
[junit4:junit4]   2> 13161 T449 C47 P42000 REQ /replication {file=_0_NestedPulsing_0.tip&command=filecontent&checksum=true&generation=2&qt=/replication&wt=filestream} status=0 QTime=0 
[junit4:junit4]   2> 13165 T449 C47 P42000 REQ /replication {file=_0_MockFixedIntBlock_0.tib&command=filecontent&checksum=true&generation=2&qt=/replication&wt=filestream} status=0 QTime=0 
[junit4:junit4]   2> 13169 T449 C47 P42000 REQ /replication {file=_0_Pulsing40_0.frq&command=filecontent&checksum=true&generation=2&qt=/replication&wt=filestream} status=0 QTime=0 
[junit4:junit4]   2> 13174 T449 C47 P42000 REQ /replication {file=_0_NestedPulsing_0.tim&command=filecontent&checksum=true&generation=2&qt=/replication&wt=filestream} status=0 QTime=0 
[junit4:junit4]   2> 13178 T449 C47 P42000 REQ /replication {file=_0_MockFixedIntBlock_0.pyl&command=filecontent&checksum=true&generation=2&qt=/replication&wt=filestream} status=0 QTime=0 
[junit4:junit4]   2> 13180 T479 C46 P33700 oash.SnapPuller$FileFetcher.fetchPackets WARNING No content recieved for file: {name=_0_MockFixedIntBlock_0.pyl, lastmodified=1348000548000, size=0}
[junit4:junit4]   2> 13183 T449 C47 P42000 REQ /replication {file=_0_MockFixedIntBlock_0.skp&command=filecontent&checksum=true&generation=2&qt=/replication&wt=filestream} status=0 QTime=0 
[junit4:junit4]   2> 13184 T479 C46 P33700 oash.SnapPuller$FileFetcher.fetchPackets WARNING No content recieved for file: {name=_0_MockFixedIntBlock_0.skp, lastmodified=1348000548000, size=0}
[junit4:junit4]   2> 13188 T449 C47 P42000 REQ /replication {file=_0_MockFixedIntBlock_0.tii&command=filecontent&checksum=true&generation=2&qt=/replication&wt=filestream} status=0 QTime=0 
[junit4:junit4]   2> 13193 T449 C47 P42000 REQ /replication {file=_0_Pulsing40_0.tip&command=filecontent&checksum=true&generation=2&qt=/replication&wt=filestream} status=0 QTime=0 
[junit4:junit4]   2> 13197 T449 C47 P42000 REQ /replication {file=_0_TestBloomFilteredLucene40Postings_0.frq&command=filecontent&checksum=true&generation=2&qt=/replication&wt=filestream} status=0 QTime=0 
[junit4:junit4]   2> 13201 T449 C47 P42000 REQ /replication {file=_0.si&command=filecontent&checksum=true&generation=2&qt=/replication&wt=filestream} status=0 QTime=0 
[junit4:junit4]   2> 13205 T449 C47 P42000 REQ /replication {file=_0_TestBloomFilteredLucene40Postings_0.tim&command=filecontent&checksum=true&generation=2&qt=/replication&wt=filestream} status=0 QTime=0 
[junit4:junit4]   2> 13209 T449 C47 P42000 REQ /replication {file=_0_TestBloomFilteredLucene40Postings_0.blm&command=filecontent&checksum=true&generation=2&qt=/replication&wt=filestream} status=0 QTime=0 
[junit4:junit4]   2> 13213 T449 C47 P42000 REQ /replication {file=_0_TestBloomFilteredLucene40Postings_0.tip&command=filecontent&checksum=true&generation=2&qt=/replication&wt=filestream} status=0 QTime=0 
[junit4:junit4]   2> 13217 T449 C47 P42000 REQ /replication {file=_0.fnm&command=filecontent&checksum=true&generation=2&qt=/replication&wt=filestream} status=0 QTime=0 
[junit4:junit4]   2> 13221 T449 C47 P42000 REQ /replication {file=_0_Pulsing40_0.tim&command=filecontent&checksum=true&generation=2&qt=/replication&wt=filestream} status=0 QTime=0 
[junit4:junit4]   2> 13225 T449 C47 P42000 REQ /replication {file=_0_NestedPulsing_0.frq&command=filecontent&checksum=true&generation=2&qt=/replication&wt=filestream} status=0 QTime=0 
[junit4:junit4]   2> 13229 T449 C47 P42000 REQ /replication {file=_0_MockFixedIntBlock_0.pos&command=filecontent&checksum=true&generation=2&qt=/replication&wt=filestream} status=0 QTime=0 
[junit4:junit4]   2> 13233 T449 C47 P42000 REQ /replication {file=_0_nrm.cfs&command=filecontent&checksum=true&generation=2&qt=/replication&wt=filestream} status=0 QTime=0 
[junit4:junit4]   2> 13238 T449 C47 P42000 REQ /replication {file=_0_NestedPulsing_0.prx&command=filecontent&checksum=true&generation=2&qt=/replication&wt=filestream} status=0 QTime=0 
[junit4:junit4]   2> 13240 T419 oascc.ZkStateReader.updateClusterState Updating cloud state from ZooKeeper... 
[junit4:junit4]   2> 13243 T449 C47 P42000 REQ /replication {file=_0_MockFixedIntBlock_0.frq&command=filecontent&checksum=true&generation=2&qt=/replication&wt=filestream} status=0 QTime=0 
[junit4:junit4]   2> 13247 T449 C47 P42000 REQ /replication {file=_0_MockFixedIntBlock_0.doc&command=filecontent&checksum=true&generation=2&qt=/replication&wt=filestream} status=0 QTime=0 
[junit4:junit4]   2> 13251 T449 C47 P42000 REQ /replication {file=_0_nrm.cfe&command=filecontent&checksum=true&generation=2&qt=/replication&wt=filestream} status=0 QTime=0 
[junit4:junit4]   2> 13255 T449 C47 P42000 REQ /replication {file=segments_2&command=filecontent&checksum=true&generation=2&qt=/replication&wt=filestream} status=0 QTime=0 
[junit4:junit4]   2> 13259 T449 C47 P42000 REQ /replication {file=_0.fdx&command=filecontent&checksum=true&generation=2&qt=/replication&wt=filestream} status=0 QTime=0 
[junit4:junit4]   2> 13263 T449 C47 P42000 REQ /replication {file=_0.fdt&command=filecontent&checksum=true&generation=2&qt=/replication&wt=filestream} status=0 QTime=0 
[junit4:junit4]   2> 13265 T479 C46 P33700 oash.SnapPuller.fetchLatestIndex Total time taken for download : 0 secs
[junit4:junit4]   2> 13265 T479 C46 P33700 oash.SnapPuller.modifyIndexProps New index installed. Updating index properties... index=index.20120918163548634
[junit4:junit4]   2> 13267 T479 C46 P33700 oasu.DefaultSolrCoreState.newIndexWriter Creating new IndexWriter...
[junit4:junit4]   2> 13267 T479 C46 P33700 oasu.DefaultSolrCoreState.newIndexWriter Waiting until IndexWriter is unused... core=collection1
[junit4:junit4]   2> 13267 T479 C46 P33700 oasu.DefaultSolrCoreState.newIndexWriter Rollback old IndexWriter... core=collection1
[junit4:junit4]   2> 13272 T479 C46 P33700 oasc.SolrCore.getNewIndexDir WARNING New index directory detected: old=./org.apache.solr.cloud.BasicDistributedZk2Test-1348000535500/jetty3/index/ new=./org.apache.solr.cloud.BasicDistributedZk2Test-1348000535500/jetty3/index.20120918163548634
[junit4:junit4]   2> 13273 T479 C46 P33700 oasc.CachingDirectoryFactory.get return new directory for /usr/home/hudson/hudson-slave/workspace/Lucene-Solr-Tests-trunk-Java6/solr/build/solr-core/test/J1/./org.apache.solr.cloud.BasicDistributedZk2Test-1348000535500/jetty3/index.20120918163548634 forceNew:true
[junit4:junit4]   2> 13287 T479 C46 P33700 oasc.SolrDeletionPolicy.onInit SolrDeletionPolicy.onInit: commits:num=1
[junit4:junit4]   2> 		commit{dir=NRTCachingDirectory(org.apache.lucene.store.NIOFSDirectory@/usr/home/hudson/hudson-slave/workspace/Lucene-Solr-Tests-trunk-Java6/solr/build/solr-core/test/J1/org.apache.solr.cloud.BasicDistributedZk2Test-1348000535500/jetty3/index.20120918163548634 lockFactory=org.apache.lucene.store.NativeFSLockFactory@5c47e1f4; maxCacheMB=48.0 maxMergeSizeMB=4.0),segFN=segments_2,generation=2,filenames=[_0_TestBloomFilteredLucene40Postings_0.prx, _0_Pulsing40_0.prx, _0_NestedPulsing_0.tip, _0_MockFixedIntBlock_0.tib, _0_Pulsing40_0.frq, _0_NestedPulsing_0.tim, _0_MockFixedIntBlock_0.pyl, _0_MockFixedIntBlock_0.skp, _0_MockFixedIntBlock_0.tii, _0_Pulsing40_0.tip, _0_TestBloomFilteredLucene40Postings_0.frq, _0.si, _0_TestBloomFilteredLucene40Postings_0.tim, _0_TestBloomFilteredLucene40Postings_0.tip, _0_TestBloomFilteredLucene40Postings_0.blm, _0_Pulsing40_0.tim, _0.fnm, _0_NestedPulsing_0.frq, _0_MockFixedIntBlock_0.pos, _0_nrm.cfs, _0_NestedPulsing_0.prx, _0_MockFixedIntBlock_0.frq, _0_MockFixedIntBlock_0.doc, _0_nrm.cfe, segments_2, _0.fdx, _0.fdt]
[junit4:junit4]   2> 13287 T479 C46 P33700 oasc.SolrDeletionPolicy.updateCommits newest commit = 2
[junit4:junit4]   2> 13288 T479 C46 P33700 oasu.DefaultSolrCoreState.newIndexWriter New IndexWriter is ready to be used.
[junit4:junit4]   2> 13292 T479 C46 P33700 oass.SolrIndexSearcher.<init> Opening Searcher@a978d36 main
[junit4:junit4]   2> 13294 T478 oasc.SolrCore.registerSearcher [collection1] Registered new searcher Searcher@a978d36 main{StandardDirectoryReader(segments_2:3:nrt _0(5.0):C1)}
[junit4:junit4]   2> 13295 T478 oasc.CachingDirectoryFactory.close Closing directory:/usr/home/hudson/hudson-slave/workspace/Lucene-Solr-Tests-trunk-Java6/solr/build/solr-core/test/J1/./org.apache.solr.cloud.BasicDistributedZk2Test-1348000535500/jetty3/index
[junit4:junit4]   2> 13295 T478 oash.SnapPuller$2.onClose removing old index directory ./org.apache.solr.cloud.BasicDistributedZk2Test-1348000535500/jetty3/index
[junit4:junit4]   2> 13297 T479 C46 P33700 oasu.DirectUpdateHandler2.commit start commit{flags=0,_version_=0,optimize=false,openSearcher=false,waitSearcher=false,expungeDeletes=false,softCommit=false}
[junit4:junit4]   2> 13298 T479 C46 P33700 oasu.DirectUpdateHandler2.commit end_commit_flush
[junit4:junit4]   2> 13299 T479 C46 P33700 oasc.RecoveryStrategy.replay Replaying buffered documents. core=collection1
[junit4:junit4]   2> 13299 T501 C46 P33700 oasu.UpdateLog$LogReplayer.doReplay WARNING Starting log replay tlog{file=./org.apache.solr.cloud.BasicDistributedZk2Test-1348000535500/jetty3/tlog/tlog.0000000000000000000 refcount=2} active=true starting pos=432
[junit4:junit4]   2> 13299 T501 C46 P33700 oasu.DirectUpdateHandler2.commit start commit{flags=2,_version_=0,optimize=false,openSearcher=true,waitSearcher=true,expungeDeletes=false,softCommit=false}
[junit4:junit4]   2> 13308 T501 C46 P33700 oass.SolrIndexSearcher.<init> Opening Searcher@6c0a9ec main
[junit4:junit4]   2> 13309 T501 C46 P33700 oasu.DirectUpdateHandler2.commit end_commit_flush
[junit4:junit4]   2> 13310 T478 oasc.SolrCore.registerSearcher [collection1] Registered new searcher Searcher@6c0a9ec main{StandardDirectoryReader(segments_2:3:nrt _0(5.0):C1)}
[junit4:junit4]   2> 13311 T501 C46 P33700 oasu.UpdateLog$LogReplayer.run WARNING Log replay finished. recoveryInfo=RecoveryInfo{adds=0 deletes=0 deleteByQuery=0 errors=0 positionOfStart=432}
[junit4:junit4]   2> 13311 T479 C46 P33700 oasc.RecoveryStrategy.doRecovery Replication Recovery was successful - registering as Active. core=collection1
[junit4:junit4]   2> 13314 T479 C46 P33700 oasc.RecoveryStrategy.doRecovery Finished recovery process. core=collection1
[junit4:junit4]   2> 13738 T440 oascc.ZkStateReader.updateClusterState Updating cloud state from ZooKeeper... 
[junit4:junit4]   2> 13767 T439 oascc.ZkStateReader$2.process A cluster state change has occurred - updating...
[junit4:junit4]   2> 13768 T496 oascc.ZkStateReader$2.process A cluster state change has occurred - updating...
[junit4:junit4]   2> 13768 T491 oascc.ZkStateReader$2.process A cluster state change has occurred - updating...
[junit4:junit4]   2> 13768 T498 oascc.ZkStateReader$2.process A cluster state change has occurred - updating...
[junit4:junit4]   2> 13768 T477 oascc.ZkStateReader$2.process A cluster state change has occurred - updating...
[junit4:junit4]   2> 13768 T465 oascc.ZkStateReader$2.process A cluster state change has occurred - updating...
[junit4:junit4]   2> 13768 T453 oascc.ZkStateReader$2.process A cluster state change has occurred - updating...
[junit4:junit4]   2> 14242 T419 oascc.ZkStateReader.updateClusterState Updating cloud state from ZooKeeper... 
[junit4:junit4]   2>  C48_STATE=coll:collection1 core:collection1 props:{shard=shard2, roles=null, state=recovering, core=collection1, collection=collection1, node_name=127.0.0.1:51287_solr, base_url=http://127.0.0.1:51287/solr}
[junit4:junit4]   2> 15114 T493 C48 P51287 oasc.RecoveryStrategy.doRecovery Begin buffering updates. core=collection1
[junit4:junit4]   2> 15114 T493 C48 P51287 oasu.UpdateLog.bufferUpdates Starting to buffer updates. FSUpdateLog{state=ACTIVE, tlog=null}
[junit4:junit4]   2> 15114 T493 C48 P51287 oasc.RecoveryStrategy.replicate Attempting to replicate from http://127.0.0.1:29767/solr/collection1/. core=collection1
[junit4:junit4]   2> 15115 T493 C48 P51287 oascsi.HttpClientUtil.createClient Creating new http client, config:maxConnections=128&maxConnectionsPerHost=32&followRedirects=false
[junit4:junit4]   2> 15131 T459 C49 P29767 oasu.DirectUpdateHandler2.commit start commit{flags=0,_version_=0,optimize=false,openSearcher=true,waitSearcher=true,expungeDeletes=false,softCommit=false}
[junit4:junit4]   2> 15136 T459 C49 P29767 oasc.SolrDeletionPolicy.onInit SolrDeletionPolicy.onInit: commits:num=1
[junit4:junit4]   2> 		commit{dir=NRTCachingDirectory(org.apache.lucene.store.NIOFSDirectory@/usr/home/hudson/hudson-slave/workspace/Lucene-Solr-Tests-trunk-Java6/solr/build/solr-core/test/J1/org.apache.solr.cloud.BasicDistributedZk2Test-1348000535500/jetty2/index lockFactory=org.apache.lucene.store.NativeFSLockFactory@31f32e51; maxCacheMB=48.0 maxMergeSizeMB=4.0),segFN=segments_1,generation=1,filenames=[segments_1]
[junit4:junit4]   2> 15137 T459 C49 P29767 oasc.SolrDeletionPolicy.updateCommits newest commit = 1
[junit4:junit4]   2> 15138 T459 C49 P29767 oass.SolrIndexSearcher.<init> Opening Searcher@201a9109 main
[junit4:junit4]   2> 15139 T459 C49 P29767 oasu.DirectUpdateHandler2.commit end_commit_flush
[junit4:junit4]   2> 15140 T466 oasc.SolrCore.registerSearcher [collection1] Registered new searcher Searcher@201a9109 main{StandardDirectoryReader(segments_1:1)}
[junit4:junit4]   2> 15141 T459 C49 P29767 /update {waitSearcher=true&commit=true&commit_end_point=true&wt=javabin&softCommit=false&version=2} {commit=} 0 10
[junit4:junit4]   2> 15142 T493 C48 P51287 oash.ReplicationHandler.inform Commits will be reserved for  10000
[junit4:junit4]   2> 15142 T493 C48 P51287 oash.SnapPuller.<init>  No value set for 'pollInterval'. Timer Task not started.
[junit4:junit4]   2> 15144 T460 C49 P29767 oash.ReplicationHandler.inform Commits will be reserved for  10000
[junit4:junit4]   2> 15144 T460 C49 P29767 REQ /replication {command=indexversion&wt=javabin&qt=/replication&version=2} status=0 QTime=0 
[junit4:junit4]   2> 15149 T493 C48 P51287 oasc.SolrDeletionPolicy.onInit SolrDeletionPolicy.onInit: commits:num=1
[junit4:junit4]   2> 		commit{dir=NRTCachingDirectory(org.apache.lucene.store.NIOFSDirectory@/usr/home/hudson/hudson-slave/workspace/Lucene-Solr-Tests-trunk-Java6/solr/build/solr-core/test/J1/org.apache.solr.cloud.BasicDistributedZk2Test-1348000535500/jetty4/index lockFactory=org.apache.lucene.store.NativeFSLockFactory@c4dc1e4; maxCacheMB=48.0 maxMergeSizeMB=4.0),segFN=segments_1,generation=1,filenames=[segments_1]
[junit4:junit4]   2> 15149 T493 C48 P51287 oasc.SolrDeletionPolicy.updateCommits newest commit = 1
[junit4:junit4]   2> 15150 T493 C48 P51287 oasu.DirectUpdateHandler2.commit start commit{flags=0,_version_=0,optimize=false,openSearcher=true,waitSearcher=true,expungeDeletes=false,softCommit=false}
[junit4:junit4]   2> 15219 T493 C48 P51287 oasc.SolrDeletionPolicy.onCommit SolrDeletionPolicy.onCommit: commits:num=2
[junit4:junit4]   2> 		commit{dir=NRTCachingDirectory(org.apache.lucene.store.NIOFSDirectory@/usr/home/hudson/hudson-slave/workspace/Lucene-Solr-Tests-trunk-Java6/solr/build/solr-core/test/J1/org.apache.solr.cloud.BasicDistributedZk2Test-1348000535500/jetty4/index lockFactory=org.apache.lucene.store.NativeFSLockFactory@c4dc1e4; maxCacheMB=48.0 maxMergeSizeMB=4.0),segFN=segments_1,generation=1,filenames=[segments_1]
[junit4:junit4]   2> 		commit{dir=NRTCachingDirectory(org.apache.lucene.store.NIOFSDirectory@/usr/home/hudson/hudson-slave/workspace/Lucene-Solr-Tests-trunk-Java6/solr/build/solr-core/test/J1/org.apache.solr.cloud.BasicDistributedZk2Test-1348000535500/jetty4/index lockFactory=org.apache.lucene.store.NativeFSLockFactory@c4dc1e4; maxCacheMB=48.0 maxMergeSizeMB=4.0),segFN=segments_2,generation=2,filenames=[segments_2]
[junit4:junit4]   2> 15219 T493 C48 P51287 oasc.SolrDeletionPolicy.updateCommits newest commit = 2
[junit4:junit4]   2> 15223 T493 C48 P51287 oass.SolrIndexSearcher.<init> Opening Searcher@5f8d0141 main
[junit4:junit4]   2> 15223 T493 C48 P51287 oasu.DirectUpdateHandler2.commit end_commit_flush
[junit4:junit4]   2> 15225 T492 oasc.SolrCore.registerSearcher [collection1] Registered new searcher Searcher@5f8d0141 main{StandardDirectoryReader(segments_2:2)}
[junit4:junit4]   2> 15225 T493 C48 P51287 oasc.RecoveryStrategy.replay No replay needed. core=collection1
[junit4:junit4]   2> 15226 T493 C48 P51287 oasc.RecoveryStrategy.doRecovery Replication Recovery was successful - registering as Active. core=collection1
[junit4:junit4]   2> 15258 T493 C48 P51287 oasc.RecoveryStrategy.doRecovery Finished recovery process. core=collection1
[junit4:junit4]   2> 15258 T419 oascc.ZkStateReader.updateClusterState Updating cloud state from ZooKeeper... 
[junit4:junit4]   2> 15283 T440 oascc.ZkStateReader.updateClusterState Updating cloud state from ZooKeeper... 
[junit4:junit4]   2> 15342 T496 oascc.ZkStateReader$2.process A cluster state change has occurred - updating...
[junit4:junit4]   2> 15342 T491 oascc.ZkStateReader$2.process A cluster state change has occurred - updating...
[junit4:junit4]   2> 15342 T439 oascc.ZkStateReader$2.process A cluster state change has occurred - updating...
[junit4:junit4]   2> 15343 T498 oascc.ZkStateReader$2.process A cluster state change has occurred - updating...
[junit4:junit4]   2> 15343 T477 oascc.ZkStateReader$2.process A cluster state change has occurred - updating...
[junit4:junit4]   2> 15343 T465 oascc.ZkStateReader$2.process A cluster state change has occurred - updating...
[junit4:junit4]   2> 15342 T453 oascc.ZkStateReader$2.process A cluster state change has occurred - updating...
[junit4:junit4]   2> 16260 T419 oascc.ZkStateReader.updateClusterState Updating cloud state from ZooKeeper... 
[junit4:junit4]   2> 16264 T431 C50 P61533 oasu.DirectUpdateHandler2.commit start commit{flags=0,_version_=0,optimize=false,openSearcher=true,waitSearcher=true,expungeDeletes=false,softCommit=false}
[junit4:junit4]   2> 16405 T431 C50 P61533 oasc.SolrDeletionPolicy.onCommit SolrDeletionPolicy.onCommit: commits:num=2
[junit4:junit4]   2> 		commit{dir=NRTCachingDirectory(org.apache.lucene.store.NIOFSDirectory@/usr/home/hudson/hudson-slave/workspace/Lucene-Solr-Tests-trunk-Java6/solr/build/solr-core/test/J1/org.apache.solr.cloud.BasicDistributedZk2Test-1348000535500/control/data/index lockFactory=org.apache.lucene.store.NativeFSLockFactory@19676aa8; maxCacheMB=48.0 maxMergeSizeMB=4.0),segFN=segments_1,generation=1,filenames=[segments_1]
[junit4:junit4]   2> 		commit{dir=NRTCachingDirectory(org.apache.lucene.store.NIOFSDirectory@/usr/home/hudson/hudson-slave/workspace/Lucene-Solr-Tests-trunk-Java6/solr/build/solr-core/test/J1/org.apache.solr.cloud.BasicDistributedZk2Test-1348000535500/control/data/index lockFactory=org.apache.lucene.store.NativeFSLockFactory@19676aa8; maxCacheMB=48.0 maxMergeSizeMB=4.0),segFN=segments_2,generation=2,filenames=[_0_TestBloomFilteredLucene40Postings_0.prx, _0_MockFixedIntBlock_0.tib, _0_NestedPulsing_0.tip, _0_Pulsing40_0.prx, _0_Pulsing40_0.frq, _0_NestedPulsing_0.tim, _0_MockFixedIntBlock_0.skp, _0_MockFixedIntBlock_0.pyl, _0_MockFixedIntBlock_0.tii, _0_Pulsing40_0.tip, _0_TestBloomFilteredLucene40Postings_0.frq, _0.si, _0_TestBloomFilteredLucene40Postings_0.tim, _0_TestBloomFilteredLucene40Postings_0.tip, _0_TestBloomFilteredLucene40Postings_0.blm, _0_Pulsing40_0.tim, _0.fnm, _0_NestedPulsing_0.frq, _0_MockFixedIntBlock_0.pos, _0_nrm.cfs, _0_NestedPulsing_0.prx, _0_MockFixedIntBlock_0.frq, _0_MockFixedIntBlock_0.doc, _0_nrm.cfe, segments_2, _0.fdx, _0.fdt]
[junit4:junit4]   2> 16406 T431 C50 P61533 oasc.SolrDeletionPolicy.updateCommits newest commit = 2
[junit4:junit4]   2> 16422 T431 C50 P61533 oass.SolrIndexSearcher.<init> Opening Searcher@33442e06 main
[junit4:junit4]   2> 16423 T431 C50 P61533 oasu.DirectUpdateHandler2.commit end_commit_flush
[junit4:junit4]   2> 16425 T442 oasc.SolrCore.registerSearcher [collection1] Registered new searcher Searcher@33442e06 main{StandardDirectoryReader(segments_2:3 _0(5.0):C1)}
[junit4:junit4]   2> 16425 T431 C50 P61533 /update {waitSearcher=true&wt=javabin&commit=true&softCommit=false&version=2} {commit=} 0 161
[junit4:junit4]   2> 16428 T461 C49 P29767 oasu.DirectUpdateHandler2.commit start commit{flags=0,_version_=0,optimize=false,openSearcher=true,waitSearcher=true,expungeDeletes=false,softCommit=false}
[junit4:junit4]   2> 16432 T461 C49 P29767 oass.SolrIndexSearcher.<init> Opening Searcher@71fd03ab main
[junit4:junit4]   2> 16433 T461 C49 P29767 oasu.DirectUpdateHandler2.commit end_commit_flush
[junit4:junit4]   2> 16434 T466 oasc.SolrCore.registerSearcher [collection1] Registered new searcher Searcher@71fd03ab main{StandardDirectoryReader(segments_1:1)}
[junit4:junit4]   2> 16435 T461 C49 P29767 oasu.SolrCmdDistributor.distribCommit Distrib commit to:[StdNode: http://127.0.0.1:42000/solr/collection1/, StdNode: http://127.0.0.1:33700/solr/collection1/, StdNode: http://127.0.0.1:51287/solr/collection1/]
[junit4:junit4]   2> 16437 T450 C47 P42000 oasu.DirectUpdateHandler2.commit start commit{flags=0,_version_=0,optimize=false,openSearcher=true,waitSearcher=true,expungeDeletes=false,softCommit=false}
[junit4:junit4]   2>  C46_STATE=coll:collection1 core:collection1 props:{shard=shard1, roles=null, state=active, core=collection1, collection=collection1, node_name=127.0.0.1:33700_solr, base_url=http://127.0.0.1:33700/solr}
[junit4:junit4]   2> 16438 T469 C46 P33700 oasu.DirectUpdateHandler2.commit start commit{flags=0,_version_=0,optimize=false,openSearcher=true,waitSearcher=true,expungeDeletes=false,softCommit=false}
[junit4:junit4]   2> 16440 T469 C46 P33700 oass.SolrIndexSearcher.<init> Opening Searcher@75c7ff93 main
[junit4:junit4]   2> 16441 T469 C46 P33700 oasu.DirectUpdateHandler2.commit end_commit_flush
[junit4:junit4]   2> 16447 T478 oasc.SolrCore.registerSearcher [collection1] Registered new searcher Searcher@75c7ff93 main{StandardDirectoryReader(segments_2:3:nrt _0(5.0):C1)}
[junit4:junit4]   2> 16447 T469 C46 P33700 /update {waitSearcher=true&commit=true&wt=javabin&commit_end_point=true&expungeDeletes=false&softCommit=false&version=2} {commit=} 0 9
[junit4:junit4]   2>  C48_STATE=coll:collection1 core:collection1 props:{shard=shard2, roles=null, state=active, core=collection1, collection=collection1, node_name=127.0.0.1:51287_solr, base_url=http://127.0.0.1:51287/solr}
[junit4:junit4]   2> 16450 T483 C48 P51287 oasu.DirectUpdateHandler2.commit start commit{flags=0,_version_=0,optimize=false,openSearcher=true,waitSearcher=true,expungeDeletes=false,softCommit=false}
[junit4:junit4]   2> 16452 T450 C47 P42000 oass.SolrIndexSearcher.<init> Opening Searcher@7cc88db2 main
[junit4:junit4]   2> 16453 T450 C47 P42000 oasu.DirectUpdateHandler2.commit end_commit_flush
[junit4:junit4]   2> 16453 T483 C48 P51287 oass.SolrIndexSearcher.<init> Opening Searcher@c1da30b main
[junit4:junit4]   2> 16454 T483 C48 P51287 oasu.DirectUpdateHandler2.commit end_commit_flush
[junit4:junit4]   2> 16454 T454 oasc.SolrCore.registerSearcher [collection1] Registered new searcher Searcher@7cc88db2 main{StandardDirectoryReader(segments_2:3 _0(5.0):C1)}
[junit4:junit4]   2> 16455 T450 C47 P42000 /update {waitSearcher=true&commit=true&wt=javabin&commit_end_point=true&expungeDeletes=false&softCommit=false&version=2} {commit=} 0 18
[junit4:junit4]   2> 16455 T492 oasc.SolrCore.registerSearcher [collection1] Registered new searcher Searcher@c1da30b main{StandardDirectoryReader(segments_2:2)}
[junit4:junit4]   2> 16456 T483 C48 P51287 /update {waitSearcher=true&commit=true&wt=javabin&commit_end_point=true&expungeDeletes=false&softCommit=false&version=2} {commit=} 0 6
[junit4:junit4]   2> 16457 T461 C49 P29767 /update {waitSearcher=true&wt=javabin&commit=true&softCommit=false&version=2} {commit=} 0 29
[junit4:junit4]   2> 16463 T432 C50 P61533 REQ /select {fl=id,score&shard.url=127.0.0.1:61533/solr/collection1/&NOW=1348000551956&start=0&q=*:*&distrib=false&isShard=true&wt=javabin&fsv=true&rows=10&version=2} hits=1 status=0 QTime=0 
[junit4:junit4]   2> 16466 T432 C50 P61533 REQ /select {shard.url=127.0.0.1:61533/solr/collection1/&NOW=1348000551956&q=*:*&ids=1&distrib=false&isShard=true&wt=javabin&version=2} status=0 QTime=0 
[junit4:junit4]   2> 16468 T431 C50 P61533 REQ /select {wt=javabin&q=*:*&version=2} hits=1 status=0 QTime=9 
[junit4:junit4]   2> 16469 T419 oaz.ZooKeeper.<init> Initiating client connection, connectString=127.0.0.1:57077/solr sessionTimeout=10000 watcher=org.apache.solr.common.cloud.ConnectionManager@6cfed27b
[junit4:junit4]   2> 16470 T506 oaz.ClientCnxn$SendThread.startConnect Opening socket connection to server /127.0.0.1:57077
[junit4:junit4]   2> 16470 T419 oascc.ConnectionManager.waitForConnected Waiting for client to connect to ZooKeeper
[junit4:junit4]   2> 16471 T506 oaz.ClientCnxn$SendThread.primeConnection Socket connection established to localhost/127.0.0.1:57077, initiating session
[junit4:junit4]   2> 16471 T421 oazs.NIOServerCnxn$Factory.run Accepted socket connection from /140.211.11.196:44560
[junit4:junit4]   2> 16472 T421 oazs.NIOServerCnxn.readConnectRequest Client attempting to establish new session at /140.211.11.196:44560
[junit4:junit4]   2> 16483 T423 oazs.NIOServerCnxn.finishSessionInit Established session 0x139db17d3d30009 with negotiated timeout 10000 for client /140.211.11.196:44560
[junit4:junit4]   2> 16484 T506 oaz.ClientCnxn$SendThread.readConnectResult Session establishment complete on server localhost/127.0.0.1:57077, sessionid = 0x139db17d3d30009, negotiated timeout = 10000
[junit4:junit4]   2> 16484 T507 oascc.ConnectionManager.process Watcher org.apache.solr.common.cloud.ConnectionManager@6cfed27b name:ZooKeeperConnection Watcher:127.0.0.1:57077/solr got event WatchedEvent state:SyncConnected type:None path:null path:null type:None
[junit4:junit4]   2> 16484 T419 oascc.ConnectionManager.waitForConnected Client is connected to ZooKeeper
[junit4:junit4]   2> 16485 T419 oascc.ZkStateReader.createClusterStateWatchersAndUpdate Updating cluster state from ZooKeeper... 
[junit4:junit4]   2> 16487 T424 oazs.PrepRequestProcessor.pRequest Processed session termination for sessionid: 0x139db17d3d30009
[junit4:junit4]   2> 16491 T507 oaz.ClientCnxn$EventThread.run EventThread shut down
[junit4:junit4]   2> 16491 T419 oaz.ZooKeeper.close Session: 0x139db17d3d30009 closed
[junit4:junit4]   2> 16491 T421 oazs.NIOServerCnxn.closeSock Closed socket connection for client /140.211.11.196:44560 which had sessionid 0x139db17d3d30009
[junit4:junit4]   2> 16493 T451 C47 P42000 REQ /select {distrib=false&wt=javabin&q=*:*&version=2} hits=1 status=0 QTime=0 
[junit4:junit4]   2> 16496 T462 C49 P29767 REQ /select {distrib=false&wt=javabin&q=*:*&version=2} hits=0 status=0 QTime=0 
[junit4:junit4]   2> 16502 T446 C47 P42000 REQ /select {fl=id,score&shard.url=127.0.0.1:42000/solr/collection1/|127.0.0.1:33700/solr/collection1/&NOW=1348000551996&start=0&q=*:*&distrib=false&isShard=true&wt=javabin&fsv=true&rows=10&version=2} hits=1 status=0 QTime=0 
[junit4:junit4]   2> 16502 T484 C48 P51287 REQ /select {fl=id,score&shard.url=127.0.0.1:29767/solr/collection1/|127.0.0.1:51287/solr/collection1/&NOW=1348000551996&start=0&q=*:*&distrib=false&isShard=true&wt=javabin&fsv=true&rows=10&version=2} hits=0 status=0 QTime=0 
[junit4:junit4]   2> 16507 T446 C47 P42000 REQ /select {shard.url=127.0.0.1:42000/solr/collection1/|127.0.0.1:33700/solr/collection1/&NOW=1348000551996&q=*:*&ids=1&distrib=false&isShard=true&wt=javabin&version=2} status=0 QTime=1 
[junit4:junit4]   2> 16508 T447 C47 P42000 REQ /select {wt=javabin&q=*:*&version=2} hits=1 status=0 QTime=9 
[junit4:junit4]   2> 16515 T431 C50 P61533 /update {wt=javabin&version=2} {add=[2 (1413481026822340608)]} 0 4
[junit4:junit4]   2> 16530 T483 C48 P51287 REQ /update {distrib.from=http://127.0.0.1:29767/solr/collection1/&update.distrib=FROMLEADER&wt=javabin&version=2} status=0 QTime=5 
[junit4:junit4]   2> 16531 T461 C49 P29767 /update {wt=javabin&version=2} {add=[2 (1413481026829680640)]} 0 13
[junit4:junit4]   2> 16536 T431 C50 P61533 /update {wt=javabin&version=2} {add=[3 (1413481026846457856)]} 0 2
[junit4:junit4]   2> 16555 T483 C48 P51287 REQ /update {update.distrib=FROMLEADER&distrib.from=http://127.0.0.1:29767/solr/collection1/&wt=javabin&version=2} status=0 QTime=2 
[junit4:junit4]   2> 16555 T463 C49 P29767 REQ /update {distrib.from=http://127.0.0.1:42000/solr/collection1/&update.distrib=TOLEADER&wt=javabin&version=2} status=0 QTime=7 
[junit4:junit4]   2> 16556 T447 C47 P42000 /update {wt=javabin&version=2} {add=[3]} 0 17
[junit4:junit4]   2> 16561 T431 C50 P61533 /update {wt=javabin&version=2} {add=[4 (1413481026872672256)]} 0 2
[junit4:junit4]   2> 16578 T469 C46 P33700 REQ /update {update.distrib=FROMLEADER&distrib.from=http://127.0.0.1:42000/solr/collection1/&wt=javabin&version=2} status=0 QTime=4 
[junit4:junit4]   2> 16579 T450 C47 P42000 REQ /update {distrib.from=http://127.0.0.1:29767/solr/collection1/&update.distrib=TOLEADER&wt=javabin&version=2} status=0 QTime=12 
[junit4:junit4]   2> 16580 T461 C49 P29767 /update {wt=javabin&version=2} {add=[4]} 0 16
[junit4:junit4]   2> 16585 T431 C50 P61533 /update {wt=javabin&version=2} {add=[5 (1413481026897838080)]} 0 2
[junit4:junit4]   2> 16597 T483 C48 P51287 REQ /update {update.distrib=FROMLEADER&distrib.from=http://127.0.0.1:29767/solr/collection1/&wt=javabin&version=2} status=0 QTime=2 
[junit4:junit4]   2> 16598 T463 C49 P29767 REQ /update {distrib.from=http://127.0.0.1:42000/solr/collection1/&update.distrib=TOLEADER&wt=javabin&version=2} status=0 QTime=7 
[junit4:junit4]   2> 16598 T447 C47 P42000 /update {wt=javabin&version=2} {add=[5]} 0 10
[junit4:junit4]   2> 16604 T431 C50 P61533 /update {wt=javabin&version=2} {add=[6 (1413481026917761024)]} 0 2
[junit4:junit4]   2> 16616 T483 C48 P51287 REQ /update {update.distrib=FROMLEADER&distrib.from=http://127.0.0.1:29767/solr/collection1/&wt=javabin&version=2} status=0 QTime=2 
[junit4:junit4]   2> 16616 T463 C49 P29767 REQ /update {distrib.from=http://127.0.0.1:42000/solr/collection1/&update.distrib=TOLEADER&wt=javabin&version=2} status=0 QTime=6 
[junit4:junit4]   2> 16617 T447 C47 P42000 /update {wt=javabin&version=2} {add=[6]} 0 10
[junit4:junit4]   2> 16622 T431 C50 P61533 /update {wt=javabin&version=2} {add=[7 (1413481026936635392)]} 0 2
[junit4:junit4]   2> 16631 T483 C48 P51287 REQ /update {distrib.from=http://127.0.0.1:29767/solr/collection1/&update.distrib=FROMLEADER&wt=javabin&version=2} status=0 QTime=2 
[junit4:junit4]   2> 16631 T461 C49 P29767 /update {wt=javabin&version=2} {add=[7 (1413481026941878272)]} 0 6
[junit4:junit4]   2> 16636 T431 C50 P61533 /update {wt=javabin&version=2} {add=[8 (1413481026951315456)]} 0 2
[junit4:junit4]   2> 16646 T469 C46 P33700 REQ /update {distrib.from=http://127.0.0.1:42000/solr/collection1/&update.distrib=FROMLEADER&wt=javabin&version=2} status=0 QTime=2 
[junit4:junit4]   2> 16647 T447 C47 P42000 /update {wt=javabin&version=2} {add=[8 (1413481026956558336)]} 0 8
[junit4:junit4]   2> 16652 T431 C50 P61533 /update {wt=javabin&version=2} {add=[9 (1413481026968092672)]} 0 2
[junit4:junit4]   2> 16660 T483 C48 P51287 REQ /update {distrib.from=http://127.0.0.1:29767/solr/collection1/&update.distrib=FROMLEADER&wt=javabin&version=2} status=0 QTime=2 
[junit4:junit4]   2> 16660 T461 C49 P29767 /update {wt=javabin&version=2} {add=[9 (1413481026972286976)]} 0 6
[junit4:junit4]   2> 16665 T431 C50 P61533 /update {wt=javabin&version=2} {add=[10 (1413481026981724160)]} 0 2
[junit4:junit4]   2> 16675 T469 C46 P33700 REQ /update {update.distrib=FROMLEADER&distrib.from=http://127.0.0.1:42000/solr/collection1/&wt=javabin&version=2} status=0 QTime=2 
[junit4:junit4]   2> 16676 T450 C47 P42000 REQ /update {distrib.from=http://127.0.0.1:29767/solr/collection1/&update.distrib=TOLEADER&wt=javabin&version=2} status=0 QTime=7 
[junit4:junit4]   2> 16676 T461 C49 P29767 /update {wt=javabin&version=2} {add=[10]} 0 9
[junit4:junit4]   2> 16694 T431 C50 P61533 /update {wt=javabin&version=2} {add=[11 (1413481026998501376)]} 0 15
[junit4:junit4]   2> 16703 T469 C46 P33700 REQ /update {distrib.from=http://127.0.0.1:42000/solr/collection1/&update.distrib=FROMLEADER&wt=javabin&version=2} status=0 QTime=2 
[junit4:junit4]   2> 16703 T447 C47 P42000 /update {wt=javabin&version=2} {add=[11 (1413481027017375744)]} 0 6
[junit4:junit4]   2> 16709 T431 C50 P61533 /update {wt=javabin&version=2} {add=[12 (1413481027026812928)]} 0 3
[junit4:junit4]   2> 16718 T469 C46 P33700 REQ /update {distrib.from=http://127.0.0.1:42000/solr/collection1/&update.distrib=FROMLEADER&wt=javabin&version=2} status=0 QTime=2 
[junit4:junit4]   2> 16718 T447 C47 P42000 /update {wt=javabin&version=2} {add=[12 (1413481027033104384)]} 0 6
[junit4:junit4]   2> 16723 T431 C50 P61533 /update {wt=javabin&version=2} {add=[13 (1413481027042541568)]} 0 2
[junit4:junit4]   2> 16732 T469 C46 P33700 REQ /update {distrib.from=http://127.0.0.1:42000/solr/collection1/&update.distrib=FROMLEADER&wt=javabin&version=2} status=0 QTime=2 
[junit4:junit4]   2> 16733 T447 C47 P42000 /update {wt=javabin&version=2} {add=[13 (1413481027047784448)]} 0 7
[junit4:junit4]   2> 16738 T431 C50 P61533 /update {wt=javabin&version=2} {add=[14 (1413481027058270208)]} 0 2
[junit4:junit4]   2> 16750 T469 C46 P33700 REQ /update {update.distrib=FROMLEADER&distrib.from=http://127.0.0.1:42000/solr/collection1/&wt=javabin&version=2} status=0 QTime=2 
[junit4:junit4]   2> 16751 T450 C47 P42000 REQ /update {distrib.from=http://127.0.0.1:29767/solr/collection1/&update.distrib=TOLEADER&wt=javabin&version=2} status=0 QTime=7 
[junit4:junit4]   2> 16751 T461 C49 P29767 /update {wt=javabin&version=2} {add=[14]} 0 10
[junit4:junit4]   2> 16757 T431 C50 P61533 /update {wt=javabin&version=2} {add=[15 (1413481027078193152)]} 0 2
[junit4:junit4]   2> 16769 T469 C46 P33700 REQ /update {update.distrib=FROMLEADER&distrib.from=http://127.0.0.1:42000/solr/collection1/&wt=javabin&version=2} status=0 QTime=2 
[junit4:junit4]   2> 16769 T450 C47 P42000 REQ /update {distrib.from=http://127.0.0.1:29767/solr/collection1/&update.distrib=TOLEADER&wt=javabin&version=2} status=0 QTime=6 
[junit4:junit4]   2> 16770 T461 C49 P29767 /update {wt=javabin&version=2} {add=[15]} 0 10
[junit4:junit4]   2> 16775 T431 C50 P61533 /update {wt=javabin&version=2} {add=[16 (1413481027097067520)]} 0 2
[junit4:junit4]   2> 16786 T469 C46 P33700 REQ /update {update.distrib=FROMLEADER&distrib.from=http://127.0.0.1:42000/solr/collection1/&wt=javabin&version=2} status=0 QTime=2 
[junit4:junit4]   2> 16786 T450 C47 P42000 REQ /update {distrib.from=http://127.0.0.1:29767/solr/collection1/&update.distrib=TOLEADER&wt=javabin&version=2} status=0 QTime=6 
[junit4:junit4]   2> 16787 T461 C49 P29767 /update {wt=javabin&version=2} {add=[16]} 0 10
[junit4:junit4]   2> 16794 T431 C50 P61533 /update {wt=javabin&version=2} {add=[17 (1413481027115941888)]} 0 4
[junit4:junit4]   2> 16807 T483 C48 P51287 REQ /update {distrib.from=http://127.0.0.1:29767/solr/collection1/&update.distrib=FROMLEADER&wt=javabin&version=2} status=0 QTime=4 
[junit4:junit4]   2> 16808 T461 C49 P29767 /update {wt=javabin&version=2} {add=[17 (1413481027123281920)]} 0 11
[junit4:junit4]   2> 16812 T431 C50 P61533 /update {wt=javabin&version=2} {add=[100 (1413481027136913408)]} 0 1
[junit4:junit4]   2> 16851 T469 C46 P33700 REQ /update {update.distrib=FROMLEADER&distrib.from=http://127.0.0.1:42000/solr/collection1/&wt=javabin&version=2} status=0 QTime=15 
[junit4:junit4]   2> 16852 T450 C47 P42000 REQ /update {distrib.from=http://127.0.0.1:29767/solr/collection1/&update.distrib=TOLEADER&wt=javabin&version=2} status=0 QTime=34 
[junit4:junit4]   2> 16852 T461 C49 P29767 /update {wt=javabin&version=2} {add=[100]} 0 37
[junit4:junit4]   2> 16857 T431 C50 P61533 /update {wt=javabin&version=2} {add=[101 (1413481027183050752)]} 0 2
[junit4:junit4]   2> 16867 T469 C46 P33700 REQ /update {distrib.from=http://127.0.0.1:42000/solr/collection1/&update.distrib=FROMLEADER&wt=javabin&version=2} status=0 QTime=3 
[junit4:junit4]   2> 16868 T447 C47 P42000 /update {wt=javabin&version=2} {add=[101 (1413481027187245056)]} 0 9
[junit4:junit4]   2> 16871 T431 C50 P61533 /update {wt=javabin&version=2} {add=[102 (1413481027198779392)]} 0 1
[junit4:junit4]   2> 16882 T469 C46 P33700 REQ /update {update.distrib=FROMLEADER&distrib.from=http://127.0.0.1:42000/solr/collection1/&wt=javabin&version=2} status=0 QTime=1 
[junit4:junit4]   2> 16883 T450 C47 P42000 REQ /update {distrib.from=http://127.0.0.1:29767/solr/collection1/&update.distrib=TOLEADER&wt=javabin&version=2} status=0 QTime=6 
[junit4:junit4]   2> 16884 T461 C49 P29767 /update {wt=javabin&version=2} {add=[102]} 0 10
[junit4:junit4]   2> 16902 T431 C50 P61533 /update {wt=javabin&version=2} {add=[103 (1413481027216605184)]} 0 15
[junit4:junit4]   2> 16910 T483 C48 P51287 REQ /update {distrib.from=http://127.0.0.1:29767/solr/collection1/&update.distrib=FROMLEADER&wt=javabin&version=2} status=0 QTime=1 
[junit4:junit4]   2> 16911 T461 C49 P29767 /update {wt=javabin&version=2} {add=[103 (1413481027235479552)]} 0 6
[junit4:junit4]   2> 16917 T431 C50 P61533 /update {wt=javabin&version=2} {add=[104 (1413481027244916736)]} 0 3
[junit4:junit4]   2> 16926 T483 C48 P51287 REQ /update {distrib.from=http://127.0.0.1:29767/solr/collection1/&update.distrib=FROMLEADER&wt=javabin&version=2} status=0 QTime=2 
[junit4:junit4]   2> 16927 T461 C49 P29767 /update {wt=javabin&version=2} {add=[104 (1413481027251208192)]} 0 7
[junit4:junit4]   2> 16932 T431 C50 P61533 /update {wt=javabin&version=2} {add=[105 (1413481027262742528)]} 0 2
[junit4:junit4]   2> 16972 T483 C48 P51287 REQ /update {update.distrib=FROMLEADER&distrib.from=http://127.0.0.1:29767/solr/collection1/&wt=javabin&version=2} status=0 QTime=14 
[junit4:junit4]   2> 16973 T463 C49 P29767 REQ /update {distrib.from=http://127.0.0.1:42000/solr/collection1/&update.distrib=TOLEADER&wt=javabin&version=2} status=0 QTime=35 
[junit4:junit4]   2> 16974 T447 C47 P42000 /update {wt=javabin&version=2} {add=[105]} 0 39
[junit4:junit4]   2> 16979 T431 C50 P61533 /update {wt=javabin&version=2} {add=[106 (1413481027310977024)]} 0 2
[junit4:junit4]   2> 16988 T483 C48 P51287 REQ /update {distrib.from=http://127.0.0.1:29767/solr/collection1/&update.distrib=FROMLEADER&wt=javabin&version=2} status=0 QTime=2 
[junit4:junit4]   2> 16989 T461 C49 P29767 /update {wt=javabin&version=2} {add=[106 (1413481027315171328)]} 0 8
[junit4:junit4]   2> 16993 T431 C50 P61533 /update {wt=javabin&version=2} {add=[107 (1413481027326705664)]} 0 1
[junit4:junit4]   2> 17004 T469 C46 P33700 REQ /update {update.distrib=FROMLEADER&distrib.from=http://127.0.0.1:42000/solr/collection1/&wt=javabin&version=2} status=0 QTime=2 
[junit4:junit4]   2> 17004 T450 C47 P42000 REQ /update {distrib.from=http://127.0.0.1:29767/solr/collection1/&update.distrib=TOLEADER&wt=javabin&version=2} status=0 QTime=6 
[junit4:junit4]   2> 17005 T461 C49 P29767 /update {wt=javabin&version=2} {add=[107]} 0 9
[junit4:junit4]   2> 17010 T431 C50 P61533 /update {wt=javabin&version=2} {add=[108 (1413481027343482880)]} 0 1
[junit4:junit4]   2> 17018 T469 C46 P33700 REQ /update {distrib.from=http://127.0.0.1:42000/solr/collection1/&update.distrib=FROMLEADER&wt=javabin&version=2} status=0 QTime=2 
[junit4:junit4]   2> 17019 T447 C47 P42000 /update {wt=javabin&version=2} {add=[108 (1413481027348725760)]} 0 7
[junit4:junit4]   2> 17023 T431 C50 P61533 /update {wt=javabin&version=2} {add=[109 (1413481027358162944)]} 0 1
[junit4:junit4]   2> 17034 T469 C46 P33700 REQ /update {update.distrib=FROMLEADER&distrib.from=http://127.0.0.1:42000/solr/collection1/&wt=javabin&version=2} status=0 QTime=1 
[junit4:junit4]   2> 17035 T450 C47 P42000 REQ /update {distrib.from=http://127.0.0.1:29767/solr/collection1/&update.distrib=TOLEADER&wt=javabin&version=2} status=0 QTime=6 
[junit4:junit4]   2> 17036 T461 C49 P29767 /update {wt=javabin&version=2} {add=[109]} 0 10
[junit4:junit4]   2> 17040 T431 C50 P61533 /update {wt=javabin&version=2} {add=[110 (1413481027375988736)]} 0 1
[junit4:junit4]   2> 17051 T469 C46 P33700 REQ /update {update.distrib=FROMLEADER&distrib.from=http://127.0.0.1:42000/solr/collection1/&wt=javabin&version=2} status=0 QTime=1 
[junit4:junit4]   2> 17052 T450 C47 P42000 REQ /update {distrib.from=http://127.0.0.1:29767/solr/collection1/&update.distrib=TOLEADER&wt=javabin&version=2} status=0 QTime=6 
[junit4:junit4]   2> 17053 T461 C49 P29767 /update {wt=javabin&version=2} {add=[110]} 0 10
[junit4:junit4]   2> 17057 T431 C50 P61533 /update {wt=javabin&version=2} {add=[111 (1413481027393814528)]} 0 1
[junit4:junit4]   2> 17068 T469 C46 P33700 REQ /update {update.distrib=FROMLEADER&distrib.from=http://127.0.0.1:42000/solr/collection1/&wt=javabin&version=2} status=0 QTime=2 
[junit4:junit4]   2> 17068 T450 C47 P42000 REQ /update {distrib.from=http://127.0.0.1:29767/solr/collection1/&update.distrib=TOLEADER&wt=javabin&version=2} status=0 QTime=6 
[junit4:junit4]   2> 17069 T461 C49 P29767 /update {wt=javabin&version=2} {add=[111]} 0 9
[junit4:junit4]   2> 17073 T431 C50 P61533 /update {wt=javabin&version=2} {add=[112 (1413481027410591744)]} 0 1
[junit4:junit4]   2> 17087 T483 C48 P51287 REQ /update {update.distrib=FROMLEADER&distrib.from=http://127.0.0.1:29767/solr/collection1/&wt=javabin&version=2} status=0 QTime=2 
[junit4:junit4]   2> 17088 T463 C49 P29767 REQ /update {distrib.from=http://127.0.0.1:42000/solr/collection1/&update.distrib=TOLEADER&wt=javabin&version=2} status=0 QTime=10 
[junit4:junit4]   2> 17089 T447 C47 P42000 /update {wt=javabin&version=2} {add=[112]} 0 13
[junit4:junit4]   2> 17105 T431 C50 P61533 /update {wt=javabin&version=2} {add=[113 (1413481027431563264)]} 0 13
[junit4:junit4]   2> 17114 T469 C46 P33700 REQ /update {distrib.from=http://127.0.0.1:42000/solr/collection1/&update.distrib=FROMLEADER&wt=javabin&version=2} status=0 QTime=2 
[junit4:junit4]   2> 17114 T447 C47 P42000 /update {wt=javabin&version=2} {add=[113 (1413481027448340480)]} 0 6
[junit4:junit4]   2> 17120 T431 C50 P61533 /update {wt=javabin&version=2} {add=[114 (1413481027457777664)]} 0 3
[junit4:junit4]   2> 17130 T469 C46 P33700 REQ /update {update.distrib=FROMLEADER&distrib.from=http://127.0.0.1:42000/solr/collection1/&wt=javabin&version=2} status=0 QTime=1 
[junit4:junit4]   2> 17131 T450 C47 P42000 REQ /update {distrib.from=http://127.0.0.1:29767/solr/collection1/&update.distrib=TOLEADER&wt=javabin&version=2} status=0 QTime=6 
[junit4:junit4]   2> 17132 T461 C49 P29767 /update {wt=javabin&version=2} {add=[114]} 0 9
[junit4:junit4]   2> 17136 T431 C50 P61533 /update {wt=javabin&version=2} {add=[115 (1413481027476652032)]} 0 1
[junit4:junit4]   2> 17145 T483 C48 P51287 REQ /update {distrib.from=http://127.0.0.1:29767/solr/collection1/&update.distrib=FROMLEADER&wt=javabin&version=2} status=0 QTime=1 
[junit4:junit4]   2> 17145 T461 C49 P29767 /update {wt=javabin&version=2} {add=[115 (1413481027480846336)]} 0 6
[junit4:junit4]   2> 17149 T431 C50 P61533 /update {wt=javabin&version=2} {add=[116 (1413481027490283520)]} 0 1
[junit4:junit4]   2> 17158 T483 C48 P51287 REQ /update {update.distrib=FROMLEADER&distrib.from=http://127.0.0.1:29767/solr/collection1/&wt=javabin&version=2} status=0 QTime=1 
[junit4:junit4]   2> 17159 T463 C49 P29767 REQ /update {distrib.from=http://127.0.0.1:42000/solr/collection1/&update.distrib=TOLEADER&wt=javabin&version=2} status=0 QTime=5 
[junit4:junit4]   2> 17160 T447 C47 P42000 /update {wt=javabin&version=2} {add=[116]} 0 8
[junit4:junit4]   2> 17163 T431 C50 P61533 /update {wt=javabin&version=2} {add=[117 (1413481027504963584)]} 0 1
[junit4:junit4]   2> 17170 T483 C48 P51287 REQ /update {distrib.from=http://127.0.0.1:29767/solr/collection1/&update.distrib=FROMLEADER&wt=javabin&version=2} status=0 QTime=1 
[junit4:junit4]   2> 17171 T461 C49 P29767 /update {wt=javabin&version=2} {add=[117 (1413481027509157888)]} 0 5
[junit4:junit4]   2> 17175 T431 C50 P61533 /update {wt=javabin&version=2} {add=[118 (1413481027517546496)]} 0 1
[junit4:junit4]   2> 17210 T469 C46 P33700 REQ /update {distrib.from=http://127.0.0.1:42000/solr/collection1/&update.distrib=FROMLEADER&wt=javabin&version=2} status=0 QTime=17 
[junit4:junit4]   2> 17211 T447 C47 P42000 /update {wt=javabin&version=2} {add=[118 (1413481027521740800)]} 0 33
[junit4:junit4]   2> 17216 T431 C50 P61533 /update {wt=javabin&version=2} {add=[119 (1413481027559489536)]} 0 2
[junit4:junit4]   2> 17224 T483 C48 P51287 REQ /update {distrib.from=http://127.0.0.1:29767/solr/collection1/&update.distrib=FROMLEADER&wt=javabin&version=2} status=0 QTime=2 
[junit4:junit4]   2> 17224 T461 C49 P29767 /update {wt=javabin&version=2} {add=[119 (1413481027563683840)]} 0 6
[junit4:junit4]   2> 17229 T431 C50 P61533 /update {wt=javabin&version=2} {add=[120 (1413481027573121024)]} 0 2
[junit4:junit4]   2> 17240 T483 C48 P51287 REQ /update {update.distrib=FROMLEADER&distrib.from=http://127.0.0.1:29767/solr/collection1/&wt=javabin&version=2} status=0 QTime=2 
[junit4:junit4]   2> 17240 T463 C49 P29767 REQ /update {distrib.from=http://127.0.0.1:42000/solr/collection1/&update.distrib=TOLEADER&wt=javabin&version=2} status=0 QTime=6 
[junit4:junit4]   2> 17241 T447 C47 P42000 /update {wt=javabin&version=2} {add=[120]} 0 9
[junit4:junit4]   2> 17245 T431 C50 P61533 /update {wt=javabin&version=2} {add=[121 (1413481027590946816)]} 0 1
[junit4:junit4]   2> 17256 T483 C48 P51287 REQ /update {update.distrib=FROMLEADER&distrib.from=http://127.0.0.1:29767/solr/collection1/&wt=javabin&version=2} status=0 QTime=1 
[junit4:junit4]   2> 17257 T463 C49 P29767 REQ /update {distrib.from=http://127.0.0.1:42000/solr/collection1/&update.distrib=TOLEADER&wt=javabin&version=2} status=0 QTime=6 
[junit4:junit4]   2> 17258 T447 C47 P42000 /update {wt=javabin&version=2} {add=[121]} 0 10
[junit4:junit4]   2> 17262 T431 C50 P61533 /update {wt=javabin&version=2} {add=[122 (1413481027608772608)]} 0 1
[junit4:junit4]   2> 17274 T469 C46 P33700 REQ /update {update.distrib=FROMLEADER&distrib.from=http://127.0.0.1:42000/solr/collection1/&wt=javabin&version=2} status=0 QTime=2 
[junit4:junit4]   2> 17275 T450 C47 P42000 REQ /update {distrib.from=http://127.0.0.1:29767/solr/collection1/&update.distrib=TOLEADER&wt=javabin&version=2} status=0 QTime=8 
[junit4:junit4]   2> 17276 T461 C49 P29767 /update {wt=javabin&version=2} {add=[122]} 0 11
[junit4:junit4]   2> 17291 T431 C50 P61533 /update {wt=javabin&version=2} {add=[123 (1413481027627646976)]} 0 12
[junit4:junit4]   2> 17303 T469 C46 P33700 REQ /update {update.distrib=FROMLEADER&distrib.from=http://127.0.0.1:42000/solr/collection1/&wt=javabin&version=2} status=0 QTime=2 
[junit4:junit4]   2> 17303 T450 C47 P42000 REQ /update {distrib.from=http://127.0.0.1:29767/solr/collection1/&update.distrib=TOLEADER&wt=javabin&version=2} status=0 QTime=6 
[junit4:junit4]   2> 17304 T461 C49 P29767 /update {wt=javabin&version=2} {add=[123]} 0 10
[junit4:junit4]   2> 17310 T431 C50 P61533 /update {wt=javabin&version=2} {add=[124 (1413481027657007104)]} 0 3
[junit4:junit4]   2> 17318 T469 C46 P33700 REQ /update {distrib.from=http://127.0.0.1:42000/solr/collection1/&update.distrib=FROMLEADER&wt=javabin&version=2} status=0 QTime=1 
[junit4:junit4]   2> 17319 T447 C47 P42000 /update {wt=javabin&version=2} {add=[124 (1413481027663298560)]} 0 6
[junit4:junit4]   2> 17323 T431 C50 P61533 /update {wt=javabin&version=2} {add=[125 (1413481027672735744)]} 0 1
[junit4:junit4]   2> 17335 T469 C46 P33700 REQ /update {update.distrib=FROMLEADER&distrib.from=http://127.0.0.1:42000/solr/collection1/&wt=javabin&version=2} status=0 QTime=2 
[junit4:junit4]   2> 17335 T450 C47 P42000 REQ /update {distrib.from=http://127.0.0.1:29767/solr/collection1/&update.distrib=TOLEADER&wt=javabin&version=2} status=0 QTime=6 
[junit4:junit4]   2> 17336 T461 C49 P29767 /update {wt=javabin&version=2} {add=[125]} 0 10
[junit4:junit4]   2> 17340 T431 C50 P61533 /update {wt=javabin&version=2} {add=[126 (1413481027690561536)]} 0 1
[junit4:junit4]   2> 17351 T483 C48 P51287 REQ /update {update.distrib=FROMLEADER&distrib.from=http://127.0.0.1:29767/solr/collection1/&wt=javabin&version=2} status=0 QTime=2 
[junit4:junit4]   2> 17352 T463 C49 P29767 REQ /update {distrib.from=http://127.0.0.1:42000/solr/collection1/&update.distrib=TOLEADER&wt=javabin&version=2} status=0 QTime=7 
[junit4:junit4]   2> 17353 T447 C47 P42000 /update {wt=javabin&version=2} {add=[126]} 0 10
[junit4:junit4]   2> 17357 T431 C50 P61533 /update {wt=javabin&version=2} {add=[127 (1413481027708387328)]} 0 1
[junit4:junit4]   2> 17389 T483 C48 P51287 REQ /update {update.distrib=FROMLEADER&distrib.from=http://127.0.0.1:29767/solr/collection1/&wt=javabin&version=2} status=0 QTime=12 
[junit4:junit4]   2> 17390 T463 C49 P29767 REQ /update {distrib.from=http://127.0.0.1:42000/solr/collection1/&update.distrib=TOLEADER&wt=javabin&version=2} status=0 QTime=28 
[junit4:junit4]   2> 17391 T447 C47 P42000 /update {wt=javabin&version=2} {add=[127]} 0 31
[junit4:junit4]   2> 17396 T431 C50 P61533 /update {wt=javabin&version=2} {add=[128 (1413481027748233216)]} 0 2
[junit4:junit4]   2> 17412 T483 C48 P51287 REQ /update {update.distrib=FROMLEADER&distrib.from=http://127.0.0.1:29767/solr/collection1/&wt=javabin&version=2} status=0 QTime=3 
[junit4:junit4]   2> 17413 T463 C49 P29767 REQ /update {distrib.from=http://127.0.0.1:42000/solr/collection1/&update.distrib=TOLEADER&wt=javabin&version=2} status=0 QTime=11 
[junit4:junit4]   2> 17414 T447 C47 P42000 /update {wt=javabin&version=2} {add=[128]} 0 15
[junit4:junit4]   2> 17419 T431 C50 P61533 /update {wt=javabin&version=2} {add=[129 (1413481027772350464)]} 0 2
[junit4:junit4]   2> 17431 T469 C46 P33700 REQ /update {update.distrib=FROMLEADER&distrib.from=http://127.0.0.1:42000/solr/collection1/&wt=javabin&version=2} status=0 QTime=2 
[junit4:junit4]   2> 17432 T450 C47 P42000 REQ /update {distrib.from=http://127.0.0.1:29767/solr/collection1/&update.distrib=TOLEADER&wt=javabin&version=2} status=0 QTime=7 
[junit4:junit4]   2> 17433 T461 C49 P29767 /update {wt=javabin&version=2} {add=[129]} 0 11
[junit4:junit4]   2> 17438 T431 C50 P61533 /update {wt=javabin&version=2} {add=[130 (1413481027792273408)]} 0 2
[junit4:junit4]   2> 17451 T483 C48 P51287 REQ /update {update.distrib=FROMLEADER&distrib.from=http://127.0.0.1:29767/solr/collection1/&wt=javabin&version=2} status=0 QTime=2 
[junit4:junit4]   2> 17452 T463 C49 P29767 REQ /update {distrib.from=http://127.0.0.1:42000/solr/collection1/&update.distrib=TOLEADER&wt=javabin&version=2} status=0 QTime=9 
[junit4:junit4]   2> 17453 T447 C47 P42000 /update {wt=javabin&version=2} {add=[130]} 0 12
[junit4:junit4]   2> 17457 T431 C50 P61533 /update {wt=javabin&version=2} {add=[131 (1413481027813244928)]} 0 1
[junit4:junit4]   2> 17467 T483 C48 P51287 REQ /update {distrib.from=http://127.0.0.1:29767/solr/collection1/&update.distrib=FROMLEADER&wt=javabin&version=2} status=0 QTime=2 
[junit4:junit4]   2> 17467 T461 C49 P29767 /update {wt=javabin&version=2} {add=[131 (1413481027817439232)]} 0 7
[junit4:junit4]   2> 17471 T431 C50 P61533 /update {wt=javabin&version=2} {add=[132 (1413481027827924992)]} 0 1
[junit4:junit4]   2> 17482 T469 C46 P33700 REQ /update {update.distrib=FROMLEADER&distrib.from=http://127.0.0.1:42000/solr/collection1/&wt=javabin&version=2} status=0 QTime=2 
[junit4:junit4]   2> 17482 T450 C47 P42000 REQ /update {distrib.from=http://127.0.0.1:29767/solr/collection1/&update.distrib=TOLEADER&wt=javabin&version=2} status=0 QTime=6 
[junit4:junit4]   2> 17483 T461 C49 P29767 /update {wt=javabin&version=2} {add=[132]} 0 9
[junit4:junit4]   2> 17499 T431 C50 P61533 /update {wt=javabin&version=2} {add=[133 (1413481027844702208)]} 0 13
[junit4:junit4]   2> 17511 T469 C46 P33700 REQ /update {distrib.from=http://127.0.0.1:42000/solr/collection1/&update.distrib=FROMLEADER&wt=javabin&version=2} status=0 QTime=2 
[junit4:junit4]   2> 17512 T447 C47 P42000 /update {wt=javabin&version=2} {add=[133 (1413481027863576576)]} 0 9
[junit4:junit4]   2> 17519 T431 C50 P61533 /update {wt=javabin&version=2} {add=[134 (1413481027876159488)]} 0 3
[junit4:junit4]   2> 17530 T483 C48 P51287 REQ /update {update.distrib=FROMLEADER&distrib.from=http://127.0.0.1:29767/solr/collection1/&wt=javabin&version=2} status=0 QTime=2 
[junit4:junit4]   2> 17530 T463 C49 P29767 REQ /update {distrib.from=http://127.0.0.1:42000/solr/collection1/&update.distrib=TOLEADER&wt=javabin&version=2} status=0 QTime=6 
[junit4:junit4]   2> 17531 T447 C47 P42000 /update {wt=javabin&version=2} {add=[134]} 0 9
[junit4:junit4]   2> 17535 T431 C50 P61533 /update {wt=javabin&version=2} {add=[135 (1413481027895033856)]} 0 1
[junit4:junit4]   2> 17546 T469 C46 P33700 REQ /update {update.distrib=FROMLEADER&distrib.from=http://127.0.0.1:42000/solr/collection1/&wt=javabin&version=2} status=0 QTime=2 
[junit4:junit4]   2> 17546 T450 C47 P42000 REQ /update {distrib.from=http://127.0.0.1:29767/solr/collection1/&update.distrib=TOLEADER&wt=javabin&version=2} status=0 QTime=6 
[junit4:junit4]   2> 17547 T461 C49 P29767 /update {wt=javabin&version=2} {add=[135]} 0 9
[junit4:junit4]   2> 17551 T431 C50 P61533 /update {wt=javabin&version=2} {add=[136 (1413481027911811072)]} 0 1
[junit4:junit4]   2> 17559 T483 C48 P51287 REQ /update {distrib.from=http://127.0.0.1:29767/solr/collection1/&update.distrib=FROMLEADER&wt=javabin&version=2} status=0 QTime=1 
[junit4:junit4]   2> 17560 T461 C49 P29767 /update {wt=javabin&version=2} {add=[136 (1413481027916005376)]} 0 6
[junit4:junit4]   2> 17564 T431 C50 P61533 /update {wt=javabin&version=2} {add=[137 (1413481027925442560)]} 0 1
[junit4:junit4]   2> 17574 T483 C48 P51287 REQ /update {update.distrib=FROMLEADER&distrib.from=http://127.0.0.1:29767/solr/collection1/&wt=javabin&version=2} status=0 QTime=1 
[junit4:junit4]   2> 17575 T463 C49 P29767 REQ /update {distrib.from=http://127.0.0.1:42000/solr/collection1/&update.distrib=TOLEADER&wt=javabin&version=2} status=0 QTime=6 
[junit4:junit4]   2> 17576 T447 C47 P42000 /update {wt=javabin&version=2} {add=[137]} 0 9
[junit4:junit4]   2> 17580 T431 C50 P61533 /update {wt=javabin&version=2} {add=[138 (1413481027942219776)]} 0 1
[junit4:junit4]   2> 17588 T469 C46 P33700 REQ /update {distrib.from=http://127.0.0.1:42000/solr/collection1/&update.distrib=FROMLEADER&wt=javabin&version=2} status=0 QTime=2 
[junit4:junit4]   2> 17588 T447 C47 P42000 /update {wt=javabin&version=2} {add=[138 (1413481027946414080)]} 0 5
[junit4:junit4]   2> 17592 T431 C50 P61533 /update {wt=javabin&version=2} {add=[139 (1413481027954802688)]} 0 1
[junit4:junit4]   2> 17600 T483 C48 P51287 REQ /update {distrib.from=http://127.0.0.1:29767/solr/collection1/&update.distrib=FROMLEADER&wt=javabin&version=2} status=0 QTime=1 
[junit4:junit4]   2> 17601 T461 C49 P29767 /update {wt=javabin&version=2} {add=[139 (1413481027958996992)]} 0 6
[junit4:junit4]   2> 17605 T431 C50 P61533 /update {wt=javabin&version=2} {add=[140 (1413481027968434176)]} 0 1
[junit4:junit4]   2> 17619 T483 C48 P51287 REQ /update {update.distrib=FROMLEADER&distrib.from=http://127.0.0.1:29767/solr/collection1/&wt=javabin&version=2} status=0 QTime=2 
[junit4:junit4]   2> 17620 T463 C49 P29767 REQ /update {distrib.from=http://127.0.0.1:42000/solr/collection1/&update.distrib=TOLEADER&wt=javabin&version=2} status=0 QTime=6 
[junit4:junit4]   2> 17620 T447 C47 P42000 /update {wt=javabin&version=2} {add=[140]} 0 10
[junit4:junit4]   2> 17625 T431 C50 P61533 /update {wt=javabin&version=2} {add=[141 (1413481027989405696)]} 0 1
[junit4:junit4]   2> 17633 T483 C48 P51287 REQ /update {distrib.from=http://127.0.0.1:29767/solr/collection1/&update.distrib=FROMLEADER&wt=javabin&version=2} status=0 QTime=1 
[junit4:junit4]   2> 17634 T461 C49 P29767 /update {wt=javabin&version=2} {add=[141 (1413481027993600000)]} 0 6
[junit4:junit4]   2> 17638 T431 C50 P61533 /update {wt=javabin&version=2} {add=[142 (1413481028003037184)]} 0 1
[junit4:junit4]   2> 17672 T483 C48 P51287 REQ /update {update.distrib=FROMLEADER&distrib.from=http://127.0.0.1:29767/solr/collection1/&wt=javabin&version=2} status=0 QTime=13 
[junit4:junit4]   2> 17673 T463 C49 P29767 REQ /update {distrib.from=http://127.0.0.1:42000/solr/collection1/&update.distrib=TOLEADER&wt=javabin&version=2} status=0 QTime=29 
[junit4:junit4]   2> 17673 T447 C47 P42000 /update {wt=javabin&version=2} {add=[142]} 0 32
[junit4:junit4]   2> 17689 T431 C50 P61533 /update {wt=javabin&version=2} {add=[143 (1413481028044980224)]} 0 12
[junit4:junit4]   2> 17700 T483 C48 P51287 REQ /update {update.distrib=FROMLEADER&distrib.from=http://127.0.0.1:29767/solr/collection1/&wt=javabin&version=2} status=0 QTime=2 
[junit4:junit4]   2> 17701 T463 C49 P29767 REQ /update {distrib.from=http://127.0.0.1:42000/solr/collection1/&update.distrib=TOLEADER&wt=javabin&version=2} status=0 QTime=7 
[junit4:junit4]   2> 17702 T447 C47 P42000 /update {wt=javabin&version=2} {add=[143]} 0 10
[junit4:junit4]   2> 17707 T431 C50 P61533 /update {wt=javabin&version=2} {add=[144 (1413481028074340352)]} 0 2
[junit4:junit4]   2> 17717 T483 C48 P51287 REQ /update {update.distrib=FROMLEADER&distrib.from=http://127.0.0.1:29767/solr/collection1/&wt=javabin&version=2} status=0 QTime=1 
[junit4:junit4]   2> 17718 T463 C49 P29767 REQ /update {distrib.from=http://127.0.0.1:42000/solr/collection1/&update.distrib=TOLEADER&wt=javabin&version=2} status=0 QTime=6 
[junit4:junit4]   2> 17719 T447 C47 P42000 /update {wt=javabin&version=2} {add=[144]} 0 9
[junit4:junit4]   2> 17723 T431 C50 P61533 /update {wt=javabin&version=2} {add=[145 (1413481028092166144)]} 0 1
[junit4:junit4]   2> 17733 T483 C48 P51287 REQ /update {update.distrib=FROMLEADER&distrib.from=http://127.0.0.1:29767/solr/collection1/&wt=javabin&version=2} status=0 QTime=1 
[junit4:junit4]   2> 17734 T463 C49 P29767 REQ /update {distrib.from=http://127.0.0.1:42000/solr/collection1/&update.distrib=TOLEADER&wt=javabin&version=2} status=0 QTime=6 
[junit4:junit4]   2> 17735 T447 C47 P42000 /update {wt=javabin&version=2} {add=[145]} 0 9
[junit4:junit4]   2> 17739 T431 C50 P61533 /update {wt=javabin&version=2} {add=[146 (1413481028108943360)]} 0 1
[junit4:junit4]   2> 17770 T469 C46 P33700 REQ /update {update.distrib=FROMLEADER&distrib.from=http://127.0.0.1:42000/solr/collection1/&wt=javabin&version=2} status=0 QTime=12 
[junit4:junit4]   2> 17771 T450 C47 P42000 REQ /update {distrib.from=http://127.0.0.1:29767/solr/collection1/&update.distrib=TOLEADER&wt=javabin&version=2} status=0 QTime=27 
[junit4:junit4]   2> 17771 T461 C49 P29767 /update {wt=javabin&version=2} {add=[146]} 0 29
[junit4:junit4]   2> 17776 T431 C50 P61533 /update {wt=javabin&version=2} {add=[147 (1413481028146692096)]} 0 2
[junit4:junit4]   2> 17785 T483 C48 P51287 REQ /update {distrib.from=http://127.0.0.1:29767/solr/collection1/&update.distrib=FROMLEADER&wt=javabin&version=2} status=0 QTime=2 
[junit4:junit4]   2> 17785 T461 C49 P29767 /update {wt=javabin&version=2} {add=[147 (1413481028151934976)]} 0 6
[junit4:junit4]   2> 17789 T431 C50 P61533 /update {wt=javabin&version=2} {add=[148 (1413481028161372160)]} 0 1
[junit4:junit4]   2> 17800 T469 C46 P33700 REQ /update {distrib.from=http://127.0.0.1:42000/solr/collection1/&update.distrib=FROMLEADER&wt=javabin&version=2} status=0 QTime=3 
[junit4:junit4]   2> 17800 T447 C47 P42000 /update {wt=javabin&version=2} {add=[148 (1413481028165566464)]} 0 8
[junit4:junit4]   2> 17804 T431 C50 P61533 /update {wt=javabin&version=2} {add=[149 (1413481028177100800)]} 0 1
[junit4:junit4]   2> 17812 T483 C48 P51287 REQ /update {distrib.from=http://127.0.0.1:29767/solr/collection1/&update.distrib=FROMLEADER&wt=javabin&version=2} status=0 QTime=1 
[junit4:junit4]   2> 17813 T461 C49 P29767 /update {wt=javabin&version=2} {add=[149 (1413481028181295104)]} 0 6
[junit4:junit4]   2> 17814 T419 oasc.AbstractDistribZkTestBase.waitForRecoveriesToFinish Wait for recoveries to finish - collection: collection1 failOnTimeout:true timeout (sec):1800
[junit4:junit4]   2> 17815 T419 oascc.ZkStateReader.updateClusterState Updating cloud state from ZooKeeper... 
[junit4:junit4]   2> 17818 T431 C50 P61533 oasu.DirectUpdateHandler2.commit start commit{flags=0,_version_=0,optimize=false,openSearcher=true,waitSearcher=true,expungeDeletes=false,softCommit=false}
[junit4:junit4]   2> 18592 T431 C50 P61533 oasc.SolrDeletionPolicy.onCommit SolrDeletionPolicy.onCommit: commits:num=2
[junit4:junit4]   2> 		commit{dir=NRTCachingDirectory(org.apache.lucene.store.NIOFSDirectory@/usr/home/hudson/hudson-slave/workspace/Lucene-Solr-Tests-trunk-Java6/solr/build/solr-core/test/J1/org.apache.solr.cloud.BasicDistributedZk2Test-1348000535500/control/data/index lockFactory=org.apache.lucene.store.NativeFSLockFactory@19676aa8; maxCacheMB=48.0 maxMergeSizeMB=4.0),segFN=segments_2,generation=2,filenames=[_0_TestBloomFilteredLucene40Postings_0.prx, _0_MockFixedIntBlock_0.tib, _0_NestedPulsing_0.tip, _0_Pulsing40_0.prx, _0_Pulsing40_0.frq, _0_NestedPulsing_0.tim, _0_MockFixedIntBlock_0.skp, _0_MockFixedIntBlock_0.pyl, _0_MockFixedIntBlock_0.tii, _0_Pulsing40_0.tip, _0_TestBloomFilteredLucene40Postings_0.frq, _0.si, _0_TestBloomFilteredLucene40Postings_0.tim, _0_TestBloomFilteredLucene40Postings_0.tip, _0_TestBloomFilteredLucene40Postings_0.blm, _0_Pulsing40_0.tim, _0.fnm, _0_NestedPulsing_0.frq, _0_MockFixedIntBlock_0.pos, _0_nrm.cfs, _0_NestedPulsing_0.prx, _0_MockFixedIntBlock_0.frq, _0_MockFixedIntBlock_0.doc, _0_nrm.cfe, segments_2, _0.fdx, _0.fdt]
[junit4:junit4]   2> 		commit{dir=NRTCachingDirectory(org.apache.lucene.store.NIOFSDirectory@/usr/home/hudson/hudson-slave/workspace/Lucene-Solr-Tests-trunk-Java6/solr/build/solr-core/test/J1/org.apache.solr.cloud.BasicDistributedZk2Test-1348000535500/control/data/index lockFactory=org.apache.lucene.store.NativeFSLockFactory@19676aa8; maxCacheMB=48.0 maxMergeSizeMB=4.0),segFN=segments_3,generation=3,filenames=[_5_nrm.cfe, _4_TestBloomFilteredLucene40Postings_0.frq, _1_NestedPulsing_0.tip, _2_NestedPulsing_0.tim, _5_NestedPulsing_0.tip, _6_MockFixedIntBlock_0.pyl, _5_NestedPulsing_0.tim, _3_TestBloomFilteredLucene40Postings_0.prx, _6_MockFixedIntBlock_0.frq, _2_TestBloomFilteredLucene40Postings_0.blm, _7.si, _7_TestBloomFilteredLucene40Postings_0.tip, _3.fdt, _0_MockFixedIntBlock_0.tib, _3_NestedPulsing_0.prx, _0_Pulsing40_0.frq, _7_TestBloomFilteredLucene40Postings_0.tim, _7.fnm, _6_MockFixedIntBlock_0.skp, _7_NestedPulsing_0.frq, _6_NestedPulsing_0.prx, _0_MockFixedIntBlock_0.tii, _0_TestBloomFilteredLucene40Postings_0.frq, _1_NestedPulsing_0.tim, _3_TestBloomFilteredLucene40Postings_0.frq, _7_MockFixedIntBlock_0.pos, _2_NestedPulsing_0.tip, _7_MockFixedIntBlock_0.skp, _3_TestBloomFilteredLucene40Postings_0.tim, _0_TestBloomFilteredLucene40Postings_0.blm, _0_Pulsing40_0.tim, _4_MockFixedIntBlock_0.pos, _2.fdt, _3_NestedPulsing_0.tim, _7.fdx, _3_TestBloomFilteredLucene40Postings_0.tip, _2.fdx, _7.fdt, _5_TestBloomFilteredLucene40Postings_0.frq, _1.fdx, _5_nrm.cfs, _1.fdt, _3_NestedPulsing_0.tip, _7_NestedPulsing_0.tim, _4_MockFixedIntBlock_0.frq, _3.si, _2_MockFixedIntBlock_0.doc, _4_NestedPulsing_0.frq, _1_MockFixedIntBlock_0.pos, _6.fdt, _3_TestBloomFilteredLucene40Postings_0.blm, _7_NestedPulsing_0.tip, _2.si, _6_NestedPulsing_0.frq, _2_Pulsing40_0.tim, _3_MockFixedIntBlock_0.frq, _6.fdx, _2_Pulsing40_0.tip, _2_MockFixedIntBlock_0.skp, _6_MockFixedIntBlock_0.tib, _3.fnm, _6_MockFixedIntBlock_0.tii, _0_NestedPulsing_0.tip, _4_TestBloomFilteredLucene40Postings_0.prx, _0_NestedPulsing_0.tim, _2_nrm.cfe, _0_MockFixedIntBlock_0.pyl, _5_TestBloomFilteredLucene40Postings_0.blm, _4_NestedPulsing_0.tip, _0_Pulsing40_0.tip, _4_NestedPulsing_0.tim, _2_nrm.cfs, _2_TestBloomFilteredLucene40Postings_0.frq, _6_MockFixedIntBlock_0.doc, _4_TestBloomFilteredLucene40Postings_0.blm, _5_MockFixedIntBlock_0.frq, _5_MockFixedIntBlock_0.tib, _2_NestedPulsing_0.prx, _0_NestedPulsing_0.frq, _7_MockFixedIntBlock_0.doc, _3_MockFixedIntBlock_0.pos, _0_NestedPulsing_0.prx, _2.fnm, _3.fdx, _1_NestedPulsing_0.frq, _5_NestedPulsing_0.frq, _0_MockFixedIntBlock_0.doc, _1.si, _4_TestBloomFilteredLucene40Postings_0

[...truncated too long message...]

stics(ReplicationHandler.java:525)
[junit4:junit4]   2> 	at org.apache.solr.core.RequestHandlers$LazyRequestHandlerWrapper.getStatistics(RequestHandlers.java:310)
[junit4:junit4]   2> 	at org.apache.solr.core.JmxMonitoredMap$SolrDynamicMBean.getMBeanInfo(JmxMonitoredMap.java:231)
[junit4:junit4]   2> 	at com.sun.jmx.interceptor.DefaultMBeanServerInterceptor.getClassName(DefaultMBeanServerInterceptor.java:1824)
[junit4:junit4]   2> 	at com.sun.jmx.interceptor.DefaultMBeanServerInterceptor.safeGetClassName(DefaultMBeanServerInterceptor.java:1661)
[junit4:junit4]   2> 	at com.sun.jmx.interceptor.DefaultMBeanServerInterceptor.checkMBeanPermission(DefaultMBeanServerInterceptor.java:1833)
[junit4:junit4]   2> 	at com.sun.jmx.interceptor.DefaultMBeanServerInterceptor.getAttribute(DefaultMBeanServerInterceptor.java:680)
[junit4:junit4]   2> 	at com.sun.jmx.mbeanserver.JmxMBeanServer.getAttribute(JmxMBeanServer.java:672)
[junit4:junit4]   2> 	at org.apache.solr.core.JmxMonitoredMap.unregister(JmxMonitoredMap.java:174)
[junit4:junit4]   2> 	at org.apache.solr.core.JmxMonitoredMap.clear(JmxMonitoredMap.java:116)
[junit4:junit4]   2> 	at org.apache.solr.core.SolrCore.close(SolrCore.java:864)
[junit4:junit4]   2> 	at org.apache.solr.cloud.ShardLeaderElectionContext.runLeaderProcess(ElectionContext.java:213)
[junit4:junit4]   2> 	at org.apache.solr.cloud.LeaderElector.runIamLeaderProcess(LeaderElector.java:158)
[junit4:junit4]   2> 	at org.apache.solr.cloud.LeaderElector.checkIfIamLeader(LeaderElector.java:102)
[junit4:junit4]   2> 	at org.apache.solr.cloud.LeaderElector.access$000(LeaderElector.java:56)
[junit4:junit4]   2> 	at org.apache.solr.cloud.LeaderElector$1.process(LeaderElector.java:131)
[junit4:junit4]   2> 	at org.apache.zookeeper.ClientCnxn$EventThread.processEvent(ClientCnxn.java:526)
[junit4:junit4]   2> 	at org.apache.zookeeper.ClientCnxn$EventThread.run(ClientCnxn.java:502)
[junit4:junit4]   2> 
[junit4:junit4]   2> 310001 T491 oasc.JmxMonitoredMap$SolrDynamicMBean.getMBeanInfo WARNING Could not getStatistics on info bean Lazy[solr.ReplicationHandler] java.lang.IllegalArgumentException: /usr/home/hudson/hudson-slave/workspace/Lucene-Solr-Tests-trunk-Java6/solr/build/solr-core/test/J1/org.apache.solr.cloud.BasicDistributedZk2Test-1348000535500/jetty4/index does not exist
[junit4:junit4]   2> 	at org.apache.commons.io.FileUtils.sizeOfDirectory(FileUtils.java:2074)
[junit4:junit4]   2> 	at org.apache.solr.handler.ReplicationHandler.getIndexSize(ReplicationHandler.java:477)
[junit4:junit4]   2> 	at org.apache.solr.handler.ReplicationHandler.getStatistics(ReplicationHandler.java:525)
[junit4:junit4]   2> 	at org.apache.solr.core.RequestHandlers$LazyRequestHandlerWrapper.getStatistics(RequestHandlers.java:310)
[junit4:junit4]   2> 	at org.apache.solr.core.JmxMonitoredMap$SolrDynamicMBean.getMBeanInfo(JmxMonitoredMap.java:231)
[junit4:junit4]   2> 	at com.sun.jmx.interceptor.DefaultMBeanServerInterceptor.getClassName(DefaultMBeanServerInterceptor.java:1824)
[junit4:junit4]   2> 	at com.sun.jmx.interceptor.DefaultMBeanServerInterceptor.safeGetClassName(DefaultMBeanServerInterceptor.java:1661)
[junit4:junit4]   2> 	at com.sun.jmx.interceptor.DefaultMBeanServerInterceptor.checkMBeanPermission(DefaultMBeanServerInterceptor.java:1833)
[junit4:junit4]   2> 	at com.sun.jmx.interceptor.DefaultMBeanServerInterceptor.exclusiveUnregisterMBean(DefaultMBeanServerInterceptor.java:436)
[junit4:junit4]   2> 	at com.sun.jmx.interceptor.DefaultMBeanServerInterceptor.unregisterMBean(DefaultMBeanServerInterceptor.java:421)
[junit4:junit4]   2> 	at com.sun.jmx.mbeanserver.JmxMBeanServer.unregisterMBean(JmxMBeanServer.java:540)
[junit4:junit4]   2> 	at org.apache.solr.core.JmxMonitoredMap.unregister(JmxMonitoredMap.java:175)
[junit4:junit4]   2> 	at org.apache.solr.core.JmxMonitoredMap.clear(JmxMonitoredMap.java:116)
[junit4:junit4]   2> 	at org.apache.solr.core.SolrCore.close(SolrCore.java:864)
[junit4:junit4]   2> 	at org.apache.solr.cloud.ShardLeaderElectionContext.runLeaderProcess(ElectionContext.java:213)
[junit4:junit4]   2> 	at org.apache.solr.cloud.LeaderElector.runIamLeaderProcess(LeaderElector.java:158)
[junit4:junit4]   2> 	at org.apache.solr.cloud.LeaderElector.checkIfIamLeader(LeaderElector.java:102)
[junit4:junit4]   2> 	at org.apache.solr.cloud.LeaderElector.access$000(LeaderElector.java:56)
[junit4:junit4]   2> 	at org.apache.solr.cloud.LeaderElector$1.process(LeaderElector.java:131)
[junit4:junit4]   2> 	at org.apache.zookeeper.ClientCnxn$EventThread.processEvent(ClientCnxn.java:526)
[junit4:junit4]   2> 	at org.apache.zookeeper.ClientCnxn$EventThread.run(ClientCnxn.java:502)
[junit4:junit4]   2> 
[junit4:junit4]   2> 310006 T491 oasc.SolrCore.closeSearcher [collection1] Closing main searcher on request.
[junit4:junit4]   2> 310010 T491 oasu.DirectUpdateHandler2.close closing DirectUpdateHandler2{commits=5,autocommits=0,soft autocommits=0,optimizes=0,rollbacks=0,expungeDeletes=0,docsPending=0,adds=0,deletesById=0,deletesByQuery=0,errors=0,cumulative_adds=35,cumulative_deletesById=0,cumulative_deletesByQuery=0,cumulative_errors=0}
[junit4:junit4]   2> 310010 T491 oasu.DefaultSolrCoreState.decref SolrCoreState ref count has reached 0 - closing IndexWriter
[junit4:junit4]   2> 310013 T491 oasu.DefaultSolrCoreState.decref Closing SolrCoreState - canceling any ongoing recovery
[junit4:junit4]   2> 310013 T491 oascc.ZkStateReader$3.process Updating live nodes
[junit4:junit4]   2> 310013 T491 oascc.ZkStateReader$3.process WARNING ZooKeeper watch triggered, but Solr cannot talk to ZK
[junit4:junit4]   2> 310013 T491 oascc.ZkStateReader$2.process A cluster state change has occurred - updating...
[junit4:junit4]   2> 310014 T491 oascc.ZkStateReader$2.process WARNING ZooKeeper watch triggered, but Solr cannot talk to ZK
[junit4:junit4]   2> 310014 T491 oascc.ConnectionManager.process Watcher org.apache.solr.common.cloud.ConnectionManager@25830b71 name:ZooKeeperConnection Watcher:127.0.0.1:57077/solr got event WatchedEvent state:Disconnected type:None path:null path:null type:None
[junit4:junit4]   2> 310014 T491 oascc.ConnectionManager.process Client->ZooKeeper status change trigger but we are already closed
[junit4:junit4]   2> 310014 T491 oaz.ClientCnxn$EventThread.run EventThread shut down
[junit4:junit4]   2> NOTE: test params are: codec=Lucene40: {n_f1=PostingsFormat(name=TestBloomFilteredLucene40Postings), foo_b=Pulsing40(freqCutoff=11 minBlockSize=14 maxBlockSize=53), foo_d=MockFixedIntBlock(blockSize=1988), foo_f=Pulsing40(freqCutoff=11 minBlockSize=14 maxBlockSize=53), n_tl1=PostingsFormat(name=TestBloomFilteredLucene40Postings), n_d1=PostingsFormat(name=NestedPulsing), rnd_b=MockFixedIntBlock(blockSize=1988), intDefault=PostingsFormat(name=TestBloomFilteredLucene40Postings), n_td1=PostingsFormat(name=TestBloomFilteredLucene40Postings), id=MockFixedIntBlock(blockSize=1988), timestamp=PostingsFormat(name=NestedPulsing), range_facet_sl=MockFixedIntBlock(blockSize=1988), range_facet_si=PostingsFormat(name=NestedPulsing), oddField_s=MockFixedIntBlock(blockSize=1988), multiDefault=PostingsFormat(name=NestedPulsing), n_tf1=PostingsFormat(name=NestedPulsing), n_dt1=PostingsFormat(name=TestBloomFilteredLucene40Postings), n_ti1=MockFixedIntBlock(blockSize=1988), range_facet_l=PostingsFormat(name=NestedPulsing), text=Pulsing40(freqCutoff=11 minBlockSize=14 maxBlockSize=53), _version_=PostingsFormat(name=TestBloomFilteredLucene40Postings), SubjectTerms_mfacet=PostingsFormat(name=TestBloomFilteredLucene40Postings), a_t=PostingsFormat(name=NestedPulsing), n_tdt1=PostingsFormat(name=TestBloomFilteredLucene40Postings), other_tl1=PostingsFormat(name=TestBloomFilteredLucene40Postings), n_l1=PostingsFormat(name=NestedPulsing), a_si=PostingsFormat(name=TestBloomFilteredLucene40Postings)}, sim=DefaultSimilarity, locale=fr_CH, timezone=America/Curacao
[junit4:junit4]   2> NOTE: FreeBSD 9.0-RELEASE amd64/Sun Microsystems Inc. 1.6.0_32 (64-bit)/cpus=16,threads=2,free=55412776,total=168165376
[junit4:junit4]   2> NOTE: All tests run in this JVM: [TestPhraseSuggestions, UUIDFieldTest, PrimitiveFieldTypeTest, TestUtils, ScriptEngineTest, TestFunctionQuery, TestQueryUtils, TestArbitraryIndexDir, TestCSVResponseWriter, SolrInfoMBeanTest, URLClassifyProcessorTest, ZkSolrClientTest, TestCharFilters, TestSolrDeletionPolicy2, TestMergePolicyConfig, IndexSchemaRuntimeFieldTest, PeerSyncTest, SpellingQueryConverterTest, PolyFieldTest, PingRequestHandlerTest, TestCodecSupport, TestValueSourceCache, DirectSolrSpellCheckerTest, LukeRequestHandlerTest, TermVectorComponentTest, LegacyHTMLStripCharFilterTest, HighlighterTest, TestMultiCoreConfBootstrap, TestCSVLoader, OpenExchangeRatesOrgProviderTest, TestRecovery, DirectUpdateHandlerTest, TestBinaryField, TestSort, RAMDirectoryFactoryTest, XmlUpdateRequestHandlerTest, SyncSliceTest, DocumentAnalysisRequestHandlerTest, DOMUtilTest, BasicDistributedZk2Test]
[junit4:junit4] Completed on J1 in 310.56s, 1 test, 1 failure <<< FAILURES!

[...truncated 396 lines...]
BUILD FAILED
/usr/home/hudson/hudson-slave/workspace/Lucene-Solr-Tests-trunk-Java6/build.xml:32: The following error occurred while executing this line:
/usr/home/hudson/hudson-slave/workspace/Lucene-Solr-Tests-trunk-Java6/solr/build.xml:146: The following error occurred while executing this line:
/usr/home/hudson/hudson-slave/workspace/Lucene-Solr-Tests-trunk-Java6/lucene/module-build.xml:63: The following error occurred while executing this line:
/usr/home/hudson/hudson-slave/workspace/Lucene-Solr-Tests-trunk-Java6/lucene/common-build.xml:1136: The following error occurred while executing this line:
/usr/home/hudson/hudson-slave/workspace/Lucene-Solr-Tests-trunk-Java6/lucene/common-build.xml:810: There were test failures: 230 suites, 950 tests, 1 failure, 7 ignored (2 assumptions)

Total time: 34 minutes 0 seconds
Build step 'Invoke Ant' marked build as failure
Recording test results
Email was triggered for: Failure
Sending email for trigger: Failure



Mime
View raw message