lucene-dev mailing list archives

Site index · List index
Message view « Date » · « Thread »
Top « Date » · « Thread »
From Apache Jenkins Server <jenk...@builds.apache.org>
Subject [JENKINS] Lucene-Solr-Tests-4.x-Java6 - Build # 690 - Failure
Date Sat, 22 Sep 2012 05:41:41 GMT
Build: https://builds.apache.org/job/Lucene-Solr-Tests-4.x-Java6/690/

1 tests failed.
REGRESSION:  org.apache.solr.cloud.BasicDistributedZk2Test.testDistribSearch

Error Message:
Shard still reported as live in zk

Stack Trace:
java.lang.AssertionError: Shard still reported as live in zk
	at __randomizedtesting.SeedInfo.seed([5838438CDEB4CB1B:D9DECD94A9EBAB27]:0)
	at org.junit.Assert.fail(Assert.java:93)
	at org.apache.solr.cloud.AbstractFullDistribZkTestBase.waitToSeeNotLive(AbstractFullDistribZkTestBase.java:1220)
	at org.apache.solr.cloud.BasicDistributedZk2Test.brindDownShardIndexSomeDocsAndRecover(BasicDistributedZk2Test.java:190)
	at org.apache.solr.cloud.BasicDistributedZk2Test.doTest(BasicDistributedZk2Test.java:83)
	at org.apache.solr.BaseDistributedSearchTestCase.testDistribSearch(BaseDistributedSearchTestCase.java:695)
	at sun.reflect.NativeMethodAccessorImpl.invoke0(Native Method)
	at sun.reflect.NativeMethodAccessorImpl.invoke(NativeMethodAccessorImpl.java:57)
	at sun.reflect.DelegatingMethodAccessorImpl.invoke(DelegatingMethodAccessorImpl.java:43)
	at java.lang.reflect.Method.invoke(Method.java:616)
	at com.carrotsearch.randomizedtesting.RandomizedRunner.invoke(RandomizedRunner.java:1559)
	at com.carrotsearch.randomizedtesting.RandomizedRunner.access$600(RandomizedRunner.java:79)
	at com.carrotsearch.randomizedtesting.RandomizedRunner$6.evaluate(RandomizedRunner.java:737)
	at com.carrotsearch.randomizedtesting.RandomizedRunner$7.evaluate(RandomizedRunner.java:773)
	at com.carrotsearch.randomizedtesting.RandomizedRunner$8.evaluate(RandomizedRunner.java:787)
	at com.carrotsearch.randomizedtesting.rules.SystemPropertiesRestoreRule$1.evaluate(SystemPropertiesRestoreRule.java:53)
	at org.apache.lucene.util.TestRuleSetupTeardownChained$1.evaluate(TestRuleSetupTeardownChained.java:50)
	at org.apache.lucene.util.TestRuleFieldCacheSanity$1.evaluate(TestRuleFieldCacheSanity.java:51)
	at org.apache.lucene.util.AbstractBeforeAfterRule$1.evaluate(AbstractBeforeAfterRule.java:45)
	at com.carrotsearch.randomizedtesting.rules.SystemPropertiesInvariantRule$1.evaluate(SystemPropertiesInvariantRule.java:55)
	at org.apache.lucene.util.TestRuleThreadAndTestName$1.evaluate(TestRuleThreadAndTestName.java:48)
	at org.apache.lucene.util.TestRuleIgnoreAfterMaxFailures$1.evaluate(TestRuleIgnoreAfterMaxFailures.java:70)
	at org.apache.lucene.util.TestRuleMarkFailure$1.evaluate(TestRuleMarkFailure.java:48)
	at com.carrotsearch.randomizedtesting.rules.StatementAdapter.evaluate(StatementAdapter.java:36)
	at com.carrotsearch.randomizedtesting.ThreadLeakControl$StatementRunner.run(ThreadLeakControl.java:358)
	at com.carrotsearch.randomizedtesting.ThreadLeakControl.forkTimeoutingTask(ThreadLeakControl.java:782)
	at com.carrotsearch.randomizedtesting.ThreadLeakControl$3.evaluate(ThreadLeakControl.java:442)
	at com.carrotsearch.randomizedtesting.RandomizedRunner.runSingleTest(RandomizedRunner.java:746)
	at com.carrotsearch.randomizedtesting.RandomizedRunner$3.evaluate(RandomizedRunner.java:648)
	at com.carrotsearch.randomizedtesting.RandomizedRunner$4.evaluate(RandomizedRunner.java:682)
	at com.carrotsearch.randomizedtesting.RandomizedRunner$5.evaluate(RandomizedRunner.java:693)
	at com.carrotsearch.randomizedtesting.rules.StatementAdapter.evaluate(StatementAdapter.java:36)
	at com.carrotsearch.randomizedtesting.rules.SystemPropertiesRestoreRule$1.evaluate(SystemPropertiesRestoreRule.java:53)
	at org.apache.lucene.util.AbstractBeforeAfterRule$1.evaluate(AbstractBeforeAfterRule.java:45)
	at org.apache.lucene.util.TestRuleStoreClassName$1.evaluate(TestRuleStoreClassName.java:42)
	at com.carrotsearch.randomizedtesting.rules.SystemPropertiesInvariantRule$1.evaluate(SystemPropertiesInvariantRule.java:55)
	at com.carrotsearch.randomizedtesting.rules.NoShadowingOrOverridesOnMethodsRule$1.evaluate(NoShadowingOrOverridesOnMethodsRule.java:39)
	at com.carrotsearch.randomizedtesting.rules.NoShadowingOrOverridesOnMethodsRule$1.evaluate(NoShadowingOrOverridesOnMethodsRule.java:39)
	at com.carrotsearch.randomizedtesting.rules.StatementAdapter.evaluate(StatementAdapter.java:36)
	at org.apache.lucene.util.TestRuleAssertionsRequired$1.evaluate(TestRuleAssertionsRequired.java:43)
	at org.apache.lucene.util.TestRuleMarkFailure$1.evaluate(TestRuleMarkFailure.java:48)
	at org.apache.lucene.util.TestRuleIgnoreAfterMaxFailures$1.evaluate(TestRuleIgnoreAfterMaxFailures.java:70)
	at org.apache.lucene.util.TestRuleIgnoreTestSuites$1.evaluate(TestRuleIgnoreTestSuites.java:55)
	at com.carrotsearch.randomizedtesting.rules.StatementAdapter.evaluate(StatementAdapter.java:36)
	at com.carrotsearch.randomizedtesting.ThreadLeakControl$StatementRunner.run(ThreadLeakControl.java:358)
	at java.lang.Thread.run(Thread.java:679)




Build Log:
[...truncated 7542 lines...]
[junit4:junit4] Suite: org.apache.solr.cloud.BasicDistributedZk2Test
[junit4:junit4]   2> 3 T2307 oas.SolrTestCaseJ4.setUp ###Starting testDistribSearch
[junit4:junit4]   2> Creating dataDir: /usr/home/hudson/hudson-slave/workspace/Lucene-Solr-Tests-4.x-Java6/solr/build/solr-core/test/J1/./solrtest-BasicDistributedZk2Test-1348291999324
[junit4:junit4]   2> 4 T2307 oasc.ZkTestServer.run STARTING ZK TEST SERVER
[junit4:junit4]   2> 8 T2308 oazs.ZooKeeperServer.setTickTime tickTime set to 1000
[junit4:junit4]   2> 8 T2308 oazs.NIOServerCnxn$Factory.<init> binding to port 0.0.0.0/0.0.0.0:0
[junit4:junit4]   2> 9 T2308 oazsp.FileTxnSnapLog.save Snapshotting: 0
[junit4:junit4]   2> 106 T2307 oasc.ZkTestServer.run start zk server on port:29943
[junit4:junit4]   2> 106 T2307 oaz.ZooKeeper.<init> Initiating client connection, connectString=127.0.0.1:29943 sessionTimeout=10000 watcher=org.apache.solr.common.cloud.ConnectionManager@620bde49
[junit4:junit4]   2> 107 T2313 oaz.ClientCnxn$SendThread.startConnect Opening socket connection to server /127.0.0.1:29943
[junit4:junit4]   2> 107 T2307 oascc.ConnectionManager.waitForConnected Waiting for client to connect to ZooKeeper
[junit4:junit4]   2> 108 T2313 oaz.ClientCnxn$SendThread.primeConnection Socket connection established to localhost/127.0.0.1:29943, initiating session
[junit4:junit4]   2> 108 T2309 oazs.NIOServerCnxn$Factory.run Accepted socket connection from /140.211.11.196:29944
[junit4:junit4]   2> 109 T2309 oazs.NIOServerCnxn.readConnectRequest Client attempting to establish new session at /140.211.11.196:29944
[junit4:junit4]   2> 109 T2311 oazsp.FileTxnLog.append Creating new log file: log.1
[junit4:junit4]   2> 113 T2311 oazs.NIOServerCnxn.finishSessionInit Established session 0x139ec7736620000 with negotiated timeout 10000 for client /140.211.11.196:29944
[junit4:junit4]   2> 113 T2313 oaz.ClientCnxn$SendThread.readConnectResult Session establishment complete on server localhost/127.0.0.1:29943, sessionid = 0x139ec7736620000, negotiated timeout = 10000
[junit4:junit4]   2> 113 T2314 oascc.ConnectionManager.process Watcher org.apache.solr.common.cloud.ConnectionManager@620bde49 name:ZooKeeperConnection Watcher:127.0.0.1:29943 got event WatchedEvent state:SyncConnected type:None path:null path:null type:None
[junit4:junit4]   2> 114 T2307 oascc.ConnectionManager.waitForConnected Client is connected to ZooKeeper
[junit4:junit4]   2> 114 T2307 oascc.SolrZkClient.makePath makePath: /solr
[junit4:junit4]   2> 117 T2312 oazs.PrepRequestProcessor.pRequest Processed session termination for sessionid: 0x139ec7736620000
[junit4:junit4]   2> 118 T2314 oaz.ClientCnxn$EventThread.run EventThread shut down
[junit4:junit4]   2> 119 T2309 oazs.NIOServerCnxn.closeSock Closed socket connection for client /140.211.11.196:29944 which had sessionid 0x139ec7736620000
[junit4:junit4]   2> 118 T2307 oaz.ZooKeeper.close Session: 0x139ec7736620000 closed
[junit4:junit4]   2> 119 T2307 oaz.ZooKeeper.<init> Initiating client connection, connectString=127.0.0.1:29943/solr sessionTimeout=10000 watcher=org.apache.solr.common.cloud.ConnectionManager@401cd0d5
[junit4:junit4]   2> 120 T2315 oaz.ClientCnxn$SendThread.startConnect Opening socket connection to server /127.0.0.1:29943
[junit4:junit4]   2> 120 T2307 oascc.ConnectionManager.waitForConnected Waiting for client to connect to ZooKeeper
[junit4:junit4]   2> 121 T2315 oaz.ClientCnxn$SendThread.primeConnection Socket connection established to localhost/127.0.0.1:29943, initiating session
[junit4:junit4]   2> 121 T2309 oazs.NIOServerCnxn$Factory.run Accepted socket connection from /140.211.11.196:29945
[junit4:junit4]   2> 121 T2309 oazs.NIOServerCnxn.readConnectRequest Client attempting to establish new session at /140.211.11.196:29945
[junit4:junit4]   2> 128 T2311 oazs.NIOServerCnxn.finishSessionInit Established session 0x139ec7736620001 with negotiated timeout 10000 for client /140.211.11.196:29945
[junit4:junit4]   2> 128 T2315 oaz.ClientCnxn$SendThread.readConnectResult Session establishment complete on server localhost/127.0.0.1:29943, sessionid = 0x139ec7736620001, negotiated timeout = 10000
[junit4:junit4]   2> 128 T2316 oascc.ConnectionManager.process Watcher org.apache.solr.common.cloud.ConnectionManager@401cd0d5 name:ZooKeeperConnection Watcher:127.0.0.1:29943/solr got event WatchedEvent state:SyncConnected type:None path:null path:null type:None
[junit4:junit4]   2> 128 T2307 oascc.ConnectionManager.waitForConnected Client is connected to ZooKeeper
[junit4:junit4]   2> 129 T2307 oascc.SolrZkClient.makePath makePath: /collections/collection1
[junit4:junit4]   2> 132 T2307 oascc.SolrZkClient.makePath makePath: /collections/collection1/shards
[junit4:junit4]   2> 142 T2307 oascc.SolrZkClient.makePath makePath: /collections/control_collection
[junit4:junit4]   2> 144 T2307 oascc.SolrZkClient.makePath makePath: /collections/control_collection/shards
[junit4:junit4]   2> 150 T2307 oasc.AbstractZkTestCase.putConfig put /usr/home/hudson/hudson-slave/workspace/Lucene-Solr-Tests-4.x-Java6/solr/build/solr-core/test-files/solr/collection1/conf/solrconfig.xml to /configs/conf1/solrconfig.xml
[junit4:junit4]   2> 151 T2307 oascc.SolrZkClient.makePath makePath: /configs/conf1/solrconfig.xml
[junit4:junit4]   2> 156 T2307 oasc.AbstractZkTestCase.putConfig put /usr/home/hudson/hudson-slave/workspace/Lucene-Solr-Tests-4.x-Java6/solr/build/solr-core/test-files/solr/collection1/conf/schema.xml to /configs/conf1/schema.xml
[junit4:junit4]   2> 157 T2307 oascc.SolrZkClient.makePath makePath: /configs/conf1/schema.xml
[junit4:junit4]   2> 260 T2307 oasc.AbstractZkTestCase.putConfig put /usr/home/hudson/hudson-slave/workspace/Lucene-Solr-Tests-4.x-Java6/solr/build/solr-core/test-files/solr/collection1/conf/solrconfig.xml to /configs/conf1/solrconfig.xml
[junit4:junit4]   2> 261 T2307 oascc.SolrZkClient.makePath makePath: /configs/conf1/solrconfig.xml
[junit4:junit4]   2> 263 T2307 oasc.AbstractZkTestCase.putConfig put /usr/home/hudson/hudson-slave/workspace/Lucene-Solr-Tests-4.x-Java6/solr/build/solr-core/test-files/solr/collection1/conf/stopwords.txt to /configs/conf1/stopwords.txt
[junit4:junit4]   2> 264 T2307 oascc.SolrZkClient.makePath makePath: /configs/conf1/stopwords.txt
[junit4:junit4]   2> 266 T2307 oasc.AbstractZkTestCase.putConfig put /usr/home/hudson/hudson-slave/workspace/Lucene-Solr-Tests-4.x-Java6/solr/build/solr-core/test-files/solr/collection1/conf/protwords.txt to /configs/conf1/protwords.txt
[junit4:junit4]   2> 267 T2307 oascc.SolrZkClient.makePath makePath: /configs/conf1/protwords.txt
[junit4:junit4]   2> 278 T2307 oasc.AbstractZkTestCase.putConfig put /usr/home/hudson/hudson-slave/workspace/Lucene-Solr-Tests-4.x-Java6/solr/build/solr-core/test-files/solr/collection1/conf/currency.xml to /configs/conf1/currency.xml
[junit4:junit4]   2> 278 T2307 oascc.SolrZkClient.makePath makePath: /configs/conf1/currency.xml
[junit4:junit4]   2> 280 T2307 oasc.AbstractZkTestCase.putConfig put /usr/home/hudson/hudson-slave/workspace/Lucene-Solr-Tests-4.x-Java6/solr/build/solr-core/test-files/solr/collection1/conf/open-exchange-rates.json to /configs/conf1/open-exchange-rates.json
[junit4:junit4]   2> 281 T2307 oascc.SolrZkClient.makePath makePath: /configs/conf1/open-exchange-rates.json
[junit4:junit4]   2> 283 T2307 oasc.AbstractZkTestCase.putConfig put /usr/home/hudson/hudson-slave/workspace/Lucene-Solr-Tests-4.x-Java6/solr/build/solr-core/test-files/solr/collection1/conf/mapping-ISOLatin1Accent.txt to /configs/conf1/mapping-ISOLatin1Accent.txt
[junit4:junit4]   2> 284 T2307 oascc.SolrZkClient.makePath makePath: /configs/conf1/mapping-ISOLatin1Accent.txt
[junit4:junit4]   2> 287 T2307 oasc.AbstractZkTestCase.putConfig put /usr/home/hudson/hudson-slave/workspace/Lucene-Solr-Tests-4.x-Java6/solr/build/solr-core/test-files/solr/collection1/conf/old_synonyms.txt to /configs/conf1/old_synonyms.txt
[junit4:junit4]   2> 288 T2307 oascc.SolrZkClient.makePath makePath: /configs/conf1/old_synonyms.txt
[junit4:junit4]   2> 294 T2307 oasc.AbstractZkTestCase.putConfig put /usr/home/hudson/hudson-slave/workspace/Lucene-Solr-Tests-4.x-Java6/solr/build/solr-core/test-files/solr/collection1/conf/synonyms.txt to /configs/conf1/synonyms.txt
[junit4:junit4]   2> 295 T2307 oascc.SolrZkClient.makePath makePath: /configs/conf1/synonyms.txt
[junit4:junit4]   2> 297 T2312 oazs.PrepRequestProcessor.pRequest Processed session termination for sessionid: 0x139ec7736620001
[junit4:junit4]   2> 298 T2316 oaz.ClientCnxn$EventThread.run EventThread shut down
[junit4:junit4]   2> 298 T2307 oaz.ZooKeeper.close Session: 0x139ec7736620001 closed
[junit4:junit4]   2> 298 T2309 oazs.NIOServerCnxn.closeSock Closed socket connection for client /140.211.11.196:29945 which had sessionid 0x139ec7736620001
[junit4:junit4]   2> 300 T2307 oejs.Server.doStart jetty-8.1.2.v20120308
[junit4:junit4]   2> 304 T2307 oejs.AbstractConnector.doStart Started SocketConnector@0.0.0.0:29946
[junit4:junit4]   2> 305 T2307 oasc.SolrResourceLoader.locateSolrHome JNDI not configured for solr (NoInitialContextEx)
[junit4:junit4]   2> 305 T2307 oasc.SolrResourceLoader.locateSolrHome using system property solr.solr.home: /usr/home/hudson/hudson-slave/workspace/Lucene-Solr-Tests-4.x-Java6/solr/build/solr-core/test-files/solr
[junit4:junit4]   2> 306 T2307 oasc.SolrResourceLoader.<init> new SolrResourceLoader for deduced Solr Home: '/usr/home/hudson/hudson-slave/workspace/Lucene-Solr-Tests-4.x-Java6/solr/build/solr-core/test-files/solr/'
[junit4:junit4]   2> 338 T2307 oass.SolrDispatchFilter.init SolrDispatchFilter.init()
[junit4:junit4]   2> 339 T2307 oasc.SolrResourceLoader.locateSolrHome JNDI not configured for solr (NoInitialContextEx)
[junit4:junit4]   2> 339 T2307 oasc.SolrResourceLoader.locateSolrHome using system property solr.solr.home: /usr/home/hudson/hudson-slave/workspace/Lucene-Solr-Tests-4.x-Java6/solr/build/solr-core/test-files/solr
[junit4:junit4]   2> 340 T2307 oasc.CoreContainer$Initializer.initialize looking for solr.xml: /usr/home/hudson/hudson-slave/workspace/Lucene-Solr-Tests-4.x-Java6/solr/build/solr-core/test-files/solr/solr.xml
[junit4:junit4]   2> 340 T2307 oasc.CoreContainer.<init> New CoreContainer 783048300
[junit4:junit4]   2> 341 T2307 oasc.CoreContainer.load Loading CoreContainer using Solr Home: '/usr/home/hudson/hudson-slave/workspace/Lucene-Solr-Tests-4.x-Java6/solr/build/solr-core/test-files/solr/'
[junit4:junit4]   2> 341 T2307 oasc.SolrResourceLoader.<init> new SolrResourceLoader for directory: '/usr/home/hudson/hudson-slave/workspace/Lucene-Solr-Tests-4.x-Java6/solr/build/solr-core/test-files/solr/'
[junit4:junit4]   2> 364 T2307 oasc.CoreContainer.load Registering Log Listener
[junit4:junit4]   2> 379 T2307 oasc.CoreContainer.initZooKeeper Zookeeper client=127.0.0.1:29943/solr
[junit4:junit4]   2> 379 T2307 oaz.ZooKeeper.<init> Initiating client connection, connectString=127.0.0.1:29943/solr sessionTimeout=5000 watcher=org.apache.solr.common.cloud.ConnectionManager@32150525
[junit4:junit4]   2> 380 T2326 oaz.ClientCnxn$SendThread.startConnect Opening socket connection to server /127.0.0.1:29943
[junit4:junit4]   2> 380 T2307 oascc.ConnectionManager.waitForConnected Waiting for client to connect to ZooKeeper
[junit4:junit4]   2> 381 T2326 oaz.ClientCnxn$SendThread.primeConnection Socket connection established to localhost/127.0.0.1:29943, initiating session
[junit4:junit4]   2> 381 T2309 oazs.NIOServerCnxn$Factory.run Accepted socket connection from /140.211.11.196:29947
[junit4:junit4]   2> 382 T2309 oazs.NIOServerCnxn.readConnectRequest Client attempting to establish new session at /140.211.11.196:29947
[junit4:junit4]   2> 383 T2311 oazs.NIOServerCnxn.finishSessionInit Established session 0x139ec7736620002 with negotiated timeout 5000 for client /140.211.11.196:29947
[junit4:junit4]   2> 383 T2326 oaz.ClientCnxn$SendThread.readConnectResult Session establishment complete on server localhost/127.0.0.1:29943, sessionid = 0x139ec7736620002, negotiated timeout = 5000
[junit4:junit4]   2> 383 T2327 oascc.ConnectionManager.process Watcher org.apache.solr.common.cloud.ConnectionManager@32150525 name:ZooKeeperConnection Watcher:127.0.0.1:29943/solr got event WatchedEvent state:SyncConnected type:None path:null path:null type:None
[junit4:junit4]   2> 384 T2307 oascc.ConnectionManager.waitForConnected Client is connected to ZooKeeper
[junit4:junit4]   2> 385 T2312 oazs.PrepRequestProcessor.pRequest Got user-level KeeperException when processing sessionid:0x139ec7736620002 type:create cxid:0x2 zxid:0xfffffffffffffffe txntype:unknown reqpath:n/a Error Path:/solr/overseer Error:KeeperErrorCode = NodeExists for /solr/overseer
[junit4:junit4]   2> 393 T2307 oascc.SolrZkClient.makePath makePath: /live_nodes
[junit4:junit4]   2> 395 T2307 oasc.ZkController.createEphemeralLiveNode Register node as live in ZooKeeper:/live_nodes/127.0.0.1:29946_solr
[junit4:junit4]   2> 396 T2312 oazs.PrepRequestProcessor.pRequest Got user-level KeeperException when processing sessionid:0x139ec7736620002 type:delete cxid:0x7 zxid:0xfffffffffffffffe txntype:unknown reqpath:n/a Error Path:/solr/live_nodes/127.0.0.1:29946_solr Error:KeeperErrorCode = NoNode for /solr/live_nodes/127.0.0.1:29946_solr
[junit4:junit4]   2> 397 T2307 oascc.SolrZkClient.makePath makePath: /live_nodes/127.0.0.1:29946_solr
[junit4:junit4]   2> 404 T2307 oashc.HttpShardHandlerFactory.getParameter Setting socketTimeout to: 0
[junit4:junit4]   2> 404 T2307 oashc.HttpShardHandlerFactory.getParameter Setting urlScheme to: http://
[junit4:junit4]   2> 405 T2307 oashc.HttpShardHandlerFactory.getParameter Setting connTimeout to: 0
[junit4:junit4]   2> 405 T2307 oashc.HttpShardHandlerFactory.getParameter Setting maxConnectionsPerHost to: 20
[junit4:junit4]   2> 406 T2307 oashc.HttpShardHandlerFactory.getParameter Setting corePoolSize to: 0
[junit4:junit4]   2> 406 T2307 oashc.HttpShardHandlerFactory.getParameter Setting maximumPoolSize to: 2147483647
[junit4:junit4]   2> 406 T2307 oashc.HttpShardHandlerFactory.getParameter Setting maxThreadIdleTime to: 5
[junit4:junit4]   2> 407 T2307 oashc.HttpShardHandlerFactory.getParameter Setting sizeOfQueue to: -1
[junit4:junit4]   2> 407 T2307 oashc.HttpShardHandlerFactory.getParameter Setting fairnessPolicy to: false
[junit4:junit4]   2> 408 T2307 oascsi.HttpClientUtil.createClient Creating new http client, config:maxConnectionsPerHost=20&maxConnections=10000&socketTimeout=0&connTimeout=0&retry=false
[junit4:junit4]   2> 422 T2307 oascc.SolrZkClient.makePath makePath: /overseer_elect/election
[junit4:junit4]   2> 426 T2312 oazs.PrepRequestProcessor.pRequest Got user-level KeeperException when processing sessionid:0x139ec7736620002 type:delete cxid:0x15 zxid:0xfffffffffffffffe txntype:unknown reqpath:n/a Error Path:/solr/overseer_elect/leader Error:KeeperErrorCode = NoNode for /solr/overseer_elect/leader
[junit4:junit4]   2> 427 T2307 oascc.SolrZkClient.makePath makePath: /overseer_elect/leader
[junit4:junit4]   2> 441 T2307 oasc.Overseer.start Overseer (id=88361664468090882-127.0.0.1:29946_solr-n_0000000000) starting
[junit4:junit4]   2> 442 T2312 oazs.PrepRequestProcessor.pRequest Got user-level KeeperException when processing sessionid:0x139ec7736620002 type:create cxid:0x1a zxid:0xfffffffffffffffe txntype:unknown reqpath:n/a Error Path:/solr/overseer Error:KeeperErrorCode = NodeExists for /solr/overseer
[junit4:junit4]   2> 443 T2312 oazs.PrepRequestProcessor.pRequest Got user-level KeeperException when processing sessionid:0x139ec7736620002 type:create cxid:0x1b zxid:0xfffffffffffffffe txntype:unknown reqpath:n/a Error Path:/solr/overseer Error:KeeperErrorCode = NodeExists for /solr/overseer
[junit4:junit4]   2> 444 T2312 oazs.PrepRequestProcessor.pRequest Got user-level KeeperException when processing sessionid:0x139ec7736620002 type:create cxid:0x1c zxid:0xfffffffffffffffe txntype:unknown reqpath:n/a Error Path:/solr/overseer Error:KeeperErrorCode = NodeExists for /solr/overseer
[junit4:junit4]   2> 453 T2312 oazs.PrepRequestProcessor.pRequest Got user-level KeeperException when processing sessionid:0x139ec7736620002 type:create cxid:0x1d zxid:0xfffffffffffffffe txntype:unknown reqpath:n/a Error Path:/solr/overseer Error:KeeperErrorCode = NodeExists for /solr/overseer
[junit4:junit4]   2> 455 T2329 oasc.OverseerCollectionProcessor.run Process current queue of collection creations
[junit4:junit4]   2> 455 T2307 oascc.SolrZkClient.makePath makePath: /clusterstate.json
[junit4:junit4]   2> 465 T2307 oascc.ZkStateReader.createClusterStateWatchersAndUpdate Updating cluster state from ZooKeeper... 
[junit4:junit4]   2> 466 T2328 oasc.Overseer$ClusterStateUpdater.run Starting to work on the main queue
[junit4:junit4]   2> 471 T2307 oasc.CoreContainer.create Creating SolrCore 'collection1' using instanceDir: /usr/home/hudson/hudson-slave/workspace/Lucene-Solr-Tests-4.x-Java6/solr/build/solr-core/test-files/solr/collection1
[junit4:junit4]   2> 471 T2307 oasc.ZkController.createCollectionZkNode Check for collection zkNode:control_collection
[junit4:junit4]   2> 472 T2307 oasc.ZkController.createCollectionZkNode Collection zkNode exists
[junit4:junit4]   2> 472 T2307 oasc.ZkController.readConfigName Load collection config from:/collections/control_collection
[junit4:junit4]   2> 473 T2307 oasc.SolrResourceLoader.<init> new SolrResourceLoader for directory: '/usr/home/hudson/hudson-slave/workspace/Lucene-Solr-Tests-4.x-Java6/solr/build/solr-core/test-files/solr/collection1/'
[junit4:junit4]   2> 475 T2307 oasc.SolrResourceLoader.replaceClassLoader Adding 'file:/usr/home/hudson/hudson-slave/workspace/Lucene-Solr-Tests-4.x-Java6/solr/build/solr-core/test-files/solr/collection1/lib/classes/' to classloader
[junit4:junit4]   2> 475 T2307 oasc.SolrResourceLoader.replaceClassLoader Adding 'file:/usr/home/hudson/hudson-slave/workspace/Lucene-Solr-Tests-4.x-Java6/solr/build/solr-core/test-files/solr/collection1/lib/README' to classloader
[junit4:junit4]   2> 524 T2307 oasc.SolrConfig.<init> Using Lucene MatchVersion: LUCENE_40
[junit4:junit4]   2> 590 T2307 oasc.SolrConfig.<init> Loaded SolrConfig: solrconfig.xml
[junit4:junit4]   2> 691 T2307 oass.IndexSchema.readSchema Reading Solr Schema
[junit4:junit4]   2> 699 T2307 oass.IndexSchema.readSchema Schema name=test
[junit4:junit4]   2> 1344 T2307 oass.OpenExchangeRatesOrgProvider.init Initialized with rates=open-exchange-rates.json, refreshInterval=1440.
[junit4:junit4]   2> 1356 T2307 oass.IndexSchema.readSchema default search field in schema is text
[junit4:junit4]   2> 1362 T2307 oass.IndexSchema.readSchema unique key field: id
[junit4:junit4]   2> 1374 T2307 oass.FileExchangeRateProvider.reload Reloading exchange rates from file currency.xml
[junit4:junit4]   2> 1380 T2307 oass.FileExchangeRateProvider.reload Reloading exchange rates from file currency.xml
[junit4:junit4]   2> 1386 T2307 oass.OpenExchangeRatesOrgProvider.reload Reloading exchange rates from open-exchange-rates.json
[junit4:junit4]   2> 1387 T2307 oass.OpenExchangeRatesOrgProvider.reload Reloading exchange rates from open-exchange-rates.json
[junit4:junit4]   2> 1389 T2307 oasc.SolrCore.<init> [collection1] Opening new SolrCore at /usr/home/hudson/hudson-slave/workspace/Lucene-Solr-Tests-4.x-Java6/solr/build/solr-core/test-files/solr/collection1/, dataDir=./org.apache.solr.cloud.BasicDistributedZk2Test-1348291999324/control/data/
[junit4:junit4]   2> 1389 T2307 oasc.JmxMonitoredMap.<init> JMX monitoring is enabled. Adding Solr mbeans to JMX Server: com.sun.jmx.mbeanserver.JmxMBeanServer@25a41cc7
[junit4:junit4]   2> 1391 T2307 oasc.SolrCore.getNewIndexDir WARNING New index directory detected: old=null new=./org.apache.solr.cloud.BasicDistributedZk2Test-1348291999324/control/data/index/
[junit4:junit4]   2> 1392 T2307 oasc.SolrCore.initIndex WARNING [collection1] Solr index directory './org.apache.solr.cloud.BasicDistributedZk2Test-1348291999324/control/data/index' doesn't exist. Creating new index...
[junit4:junit4]   2> 1393 T2307 oasc.CachingDirectoryFactory.get return new directory for /usr/home/hudson/hudson-slave/workspace/Lucene-Solr-Tests-4.x-Java6/solr/build/solr-core/test/J1/./org.apache.solr.cloud.BasicDistributedZk2Test-1348291999324/control/data/index forceNew:false
[junit4:junit4]   2> 1429 T2307 oasc.SolrDeletionPolicy.onCommit SolrDeletionPolicy.onCommit: commits:num=1
[junit4:junit4]   2> 		commit{dir=NRTCachingDirectory(org.apache.lucene.store.NIOFSDirectory@/usr/home/hudson/hudson-slave/workspace/Lucene-Solr-Tests-4.x-Java6/solr/build/solr-core/test/J1/org.apache.solr.cloud.BasicDistributedZk2Test-1348291999324/control/data/index lockFactory=org.apache.lucene.store.NativeFSLockFactory@26fe0b1a; maxCacheMB=48.0 maxMergeSizeMB=4.0),segFN=segments_1,generation=1,filenames=[segments_1]
[junit4:junit4]   2> 1430 T2307 oasc.SolrDeletionPolicy.updateCommits newest commit = 1
[junit4:junit4]   2> 1431 T2307 oasc.SolrCore.initWriters created xml: solr.XMLResponseWriter
[junit4:junit4]   2> 1434 T2307 oasup.UpdateRequestProcessorChain.init inserting DistributedUpdateProcessorFactory into updateRequestProcessorChain "dedupe"
[junit4:junit4]   2> 1434 T2307 oasup.UpdateRequestProcessorChain.init inserting DistributedUpdateProcessorFactory into updateRequestProcessorChain "dedupe-allfields"
[junit4:junit4]   2> 1435 T2307 oasup.UpdateRequestProcessorChain.init inserting DistributedUpdateProcessorFactory into updateRequestProcessorChain "stored_sig"
[junit4:junit4]   2> 1435 T2307 oasup.UpdateRequestProcessorChain.init inserting DistributedUpdateProcessorFactory into updateRequestProcessorChain "uniq-fields"
[junit4:junit4]   2> 1436 T2307 oasup.UpdateRequestProcessorChain.init inserting DistributedUpdateProcessorFactory into updateRequestProcessorChain "distrib-dup-test-chain-implicit"
[junit4:junit4]   2> 1437 T2307 oasc.RequestHandlers.initHandlersFromConfig adding lazy requestHandler: solr.ReplicationHandler
[junit4:junit4]   2> 1437 T2307 oasc.RequestHandlers.initHandlersFromConfig created /replication: solr.ReplicationHandler
[junit4:junit4]   2> 1438 T2307 oasc.RequestHandlers.initHandlersFromConfig created standard: solr.StandardRequestHandler
[junit4:junit4]   2> 1439 T2307 oasc.RequestHandlers.initHandlersFromConfig created /get: solr.RealTimeGetHandler
[junit4:junit4]   2> 1440 T2307 oasc.RequestHandlers.initHandlersFromConfig created dismax: solr.SearchHandler
[junit4:junit4]   2> 1440 T2307 oasc.RequestHandlers.initHandlersFromConfig created mock: org.apache.solr.core.MockQuerySenderListenerReqHandler
[junit4:junit4]   2> 1441 T2307 oasc.RequestHandlers.initHandlersFromConfig created /admin/: org.apache.solr.handler.admin.AdminHandlers
[junit4:junit4]   2> 1442 T2307 oasc.RequestHandlers.initHandlersFromConfig created defaults: solr.StandardRequestHandler
[junit4:junit4]   2> 1442 T2307 oasc.RequestHandlers.initHandlersFromConfig adding lazy requestHandler: solr.StandardRequestHandler
[junit4:junit4]   2> 1443 T2307 oasc.RequestHandlers.initHandlersFromConfig created lazy: solr.StandardRequestHandler
[junit4:junit4]   2> 1443 T2307 oasc.RequestHandlers.initHandlersFromConfig created /update: solr.UpdateRequestHandler
[junit4:junit4]   2> 1444 T2307 oasc.RequestHandlers.initHandlersFromConfig created /terms: org.apache.solr.handler.component.SearchHandler
[junit4:junit4]   2> 1445 T2307 oasc.RequestHandlers.initHandlersFromConfig created spellCheckCompRH: org.apache.solr.handler.component.SearchHandler
[junit4:junit4]   2> 1446 T2307 oasc.RequestHandlers.initHandlersFromConfig created spellCheckCompRH_Direct: org.apache.solr.handler.component.SearchHandler
[junit4:junit4]   2> 1446 T2307 oasc.RequestHandlers.initHandlersFromConfig created spellCheckWithWordbreak: org.apache.solr.handler.component.SearchHandler
[junit4:junit4]   2> 1447 T2307 oasc.RequestHandlers.initHandlersFromConfig created spellCheckWithWordbreak_Direct: org.apache.solr.handler.component.SearchHandler
[junit4:junit4]   2> 1448 T2307 oasc.RequestHandlers.initHandlersFromConfig created spellCheckCompRH1: org.apache.solr.handler.component.SearchHandler
[junit4:junit4]   2> 1448 T2307 oasc.RequestHandlers.initHandlersFromConfig created tvrh: org.apache.solr.handler.component.SearchHandler
[junit4:junit4]   2> 1449 T2307 oasc.RequestHandlers.initHandlersFromConfig created /mlt: solr.MoreLikeThisHandler
[junit4:junit4]   2> 1450 T2307 oasc.RequestHandlers.initHandlersFromConfig created /debug/dump: solr.DumpRequestHandler
[junit4:junit4]   2> 1454 T2307 oashl.XMLLoader.init xsltCacheLifetimeSeconds=60
[junit4:junit4]   2> 1459 T2307 oasc.SolrCore.initDeprecatedSupport WARNING solrconfig.xml uses deprecated <admin/gettableFiles>, Please update your config to use the ShowFileRequestHandler.
[junit4:junit4]   2> 1461 T2307 oasc.SolrCore.initDeprecatedSupport WARNING adding ShowFileRequestHandler with hidden files: [SCHEMA.XML, OLD_SYNONYMS.TXT, STOPWORDS.TXT, PROTWORDS.TXT, OPEN-EXCHANGE-RATES.JSON, SYNONYMS.TXT, CURRENCY.XML, MAPPING-ISOLATIN1ACCENT.TXT]
[junit4:junit4]   2> 1465 T2307 oass.SolrIndexSearcher.<init> Opening Searcher@77b4fdcf main
[junit4:junit4]   2> 1467 T2307 oasu.CommitTracker.<init> Hard AutoCommit: disabled
[junit4:junit4]   2> 1467 T2307 oasu.CommitTracker.<init> Soft AutoCommit: disabled
[junit4:junit4]   2> 1468 T2307 oashc.SpellCheckComponent.inform Initializing spell checkers
[junit4:junit4]   2> 1506 T2307 oass.DirectSolrSpellChecker.init init: {name=direct,classname=DirectSolrSpellChecker,field=lowerfilt,minQueryLength=3}
[junit4:junit4]   2> 1591 T2330 oasc.SolrCore.registerSearcher [collection1] Registered new searcher Searcher@77b4fdcf main{StandardDirectoryReader(segments_1:1)}
[junit4:junit4]   2> 1597 T2312 oazs.PrepRequestProcessor.pRequest Got user-level KeeperException when processing sessionid:0x139ec7736620002 type:create cxid:0x56 zxid:0xfffffffffffffffe txntype:unknown reqpath:n/a Error Path:/solr/overseer/queue Error:KeeperErrorCode = NoNode for /solr/overseer/queue
[junit4:junit4]   2> 1606 T2307 oasc.CoreContainer.register registering core: collection1
[junit4:junit4]   2> 1607 T2307 oasc.ZkController.register Register shard - core:collection1 address:http://127.0.0.1:29946/solr shardId:control_shard
[junit4:junit4]   2> 1608 T2307 oascc.SolrZkClient.makePath makePath: /collections/control_collection/leader_elect/control_shard/election
[junit4:junit4]   2> 1625 T2312 oazs.PrepRequestProcessor.pRequest Got user-level KeeperException when processing sessionid:0x139ec7736620002 type:delete cxid:0x65 zxid:0xfffffffffffffffe txntype:unknown reqpath:n/a Error Path:/solr/collections/control_collection/leaders Error:KeeperErrorCode = NoNode for /solr/collections/control_collection/leaders
[junit4:junit4]   2> 1626 T2307 oasc.ShardLeaderElectionContext.runLeaderProcess Running the leader process.
[junit4:junit4]   2> 1627 T2312 oazs.PrepRequestProcessor.pRequest Got user-level KeeperException when processing sessionid:0x139ec7736620002 type:create cxid:0x66 zxid:0xfffffffffffffffe txntype:unknown reqpath:n/a Error Path:/solr/overseer Error:KeeperErrorCode = NodeExists for /solr/overseer
[junit4:junit4]   2> 1972 T2328 oascc.ZkStateReader.updateClusterState Updating cloud state from ZooKeeper... 
[junit4:junit4]   2> 1973 T2312 oazs.PrepRequestProcessor.pRequest Got user-level KeeperException when processing sessionid:0x139ec7736620002 type:create cxid:0x6d zxid:0xfffffffffffffffe txntype:unknown reqpath:n/a Error Path:/solr/overseer/queue-work Error:KeeperErrorCode = NoNode for /solr/overseer/queue-work
[junit4:junit4]   2> 2031 T2327 oascc.ZkStateReader$2.process A cluster state change has occurred - updating...
[junit4:junit4]   2> 2137 T2307 oasc.ShardLeaderElectionContext.waitForReplicasToComeUp Enough replicas found to continue.
[junit4:junit4]   2> 2138 T2307 oasc.ShardLeaderElectionContext.runLeaderProcess I may be the new leader - try and sync
[junit4:junit4]   2> 2138 T2307 oasc.SyncStrategy.sync Sync replicas to http://127.0.0.1:29946/solr/collection1/
[junit4:junit4]   2> 2139 T2307 oasc.SyncStrategy.syncReplicas Sync Success - now sync replicas to me
[junit4:junit4]   2> 2139 T2307 oasc.SyncStrategy.syncToMe http://127.0.0.1:29946/solr/collection1/ has no replicas
[junit4:junit4]   2> 2140 T2307 oasc.ShardLeaderElectionContext.runLeaderProcess I am the new leader: http://127.0.0.1:29946/solr/collection1/
[junit4:junit4]   2> 2140 T2307 oascc.SolrZkClient.makePath makePath: /collections/control_collection/leaders/control_shard
[junit4:junit4]   2> 2144 T2312 oazs.PrepRequestProcessor.pRequest Got user-level KeeperException when processing sessionid:0x139ec7736620002 type:create cxid:0x8b zxid:0xfffffffffffffffe txntype:unknown reqpath:n/a Error Path:/solr/overseer Error:KeeperErrorCode = NodeExists for /solr/overseer
[junit4:junit4]   2> 2542 T2328 oascc.ZkStateReader.updateClusterState Updating cloud state from ZooKeeper... 
[junit4:junit4]   2> 2561 T2327 oascc.ZkStateReader$2.process A cluster state change has occurred - updating...
[junit4:junit4]   2> 2564 T2307 oasc.ZkController.register We are http://127.0.0.1:29946/solr/collection1/ and leader is http://127.0.0.1:29946/solr/collection1/
[junit4:junit4]   2> 2564 T2307 oasc.ZkController.register No LogReplay needed for core=collection1 baseURL=http://127.0.0.1:29946/solr
[junit4:junit4]   2> 2565 T2307 oasc.ZkController.checkRecovery I am the leader, no recovery necessary
[junit4:junit4]   2> 2566 T2307 oascc.ZkStateReader.updateClusterState Updating cloud state from ZooKeeper... 
[junit4:junit4]   2> 2567 T2307 oass.SolrDispatchFilter.init user.dir=/usr/home/hudson/hudson-slave/workspace/Lucene-Solr-Tests-4.x-Java6/solr/build/solr-core/test/J1
[junit4:junit4]   2> 2567 T2307 oass.SolrDispatchFilter.init SolrDispatchFilter.init() done
[junit4:junit4]   2> 2568 T2307 oascsi.HttpClientUtil.createClient Creating new http client, config:maxConnections=128&maxConnectionsPerHost=32&followRedirects=false
[junit4:junit4]   2> 2981 T2307 oejs.Server.doStart jetty-8.1.2.v20120308
[junit4:junit4]   2> 2984 T2307 oejs.AbstractConnector.doStart Started SocketConnector@0.0.0.0:29949
[junit4:junit4]   2> 2985 T2307 oasc.SolrResourceLoader.locateSolrHome JNDI not configured for solr (NoInitialContextEx)
[junit4:junit4]   2> 2986 T2307 oasc.SolrResourceLoader.locateSolrHome using system property solr.solr.home: /usr/home/hudson/hudson-slave/workspace/Lucene-Solr-Tests-4.x-Java6/solr/build/solr-core/test/J1/./solrtest-jetty1-1348292001901
[junit4:junit4]   2> 2986 T2307 oasc.SolrResourceLoader.<init> new SolrResourceLoader for deduced Solr Home: '/usr/home/hudson/hudson-slave/workspace/Lucene-Solr-Tests-4.x-Java6/solr/build/solr-core/test/J1/./solrtest-jetty1-1348292001901/'
[junit4:junit4]   2> 3022 T2307 oass.SolrDispatchFilter.init SolrDispatchFilter.init()
[junit4:junit4]   2> 3022 T2307 oasc.SolrResourceLoader.locateSolrHome JNDI not configured for solr (NoInitialContextEx)
[junit4:junit4]   2> 3023 T2307 oasc.SolrResourceLoader.locateSolrHome using system property solr.solr.home: /usr/home/hudson/hudson-slave/workspace/Lucene-Solr-Tests-4.x-Java6/solr/build/solr-core/test/J1/./solrtest-jetty1-1348292001901
[junit4:junit4]   2> 3023 T2307 oasc.CoreContainer$Initializer.initialize looking for solr.xml: /usr/home/hudson/hudson-slave/workspace/Lucene-Solr-Tests-4.x-Java6/solr/build/solr-core/test/J1/./solrtest-jetty1-1348292001901/solr.xml
[junit4:junit4]   2> 3024 T2307 oasc.CoreContainer.<init> New CoreContainer 1399364592
[junit4:junit4]   2> 3024 T2307 oasc.CoreContainer.load Loading CoreContainer using Solr Home: '/usr/home/hudson/hudson-slave/workspace/Lucene-Solr-Tests-4.x-Java6/solr/build/solr-core/test/J1/./solrtest-jetty1-1348292001901/'
[junit4:junit4]   2> 3025 T2307 oasc.SolrResourceLoader.<init> new SolrResourceLoader for directory: '/usr/home/hudson/hudson-slave/workspace/Lucene-Solr-Tests-4.x-Java6/solr/build/solr-core/test/J1/./solrtest-jetty1-1348292001901/'
[junit4:junit4]   2> 3050 T2307 oasc.CoreContainer.load Registering Log Listener
[junit4:junit4]   2> 3065 T2328 oascc.ZkStateReader.updateClusterState Updating cloud state from ZooKeeper... 
[junit4:junit4]   2> 3066 T2307 oasc.CoreContainer.initZooKeeper Zookeeper client=127.0.0.1:29943/solr
[junit4:junit4]   2> 3067 T2307 oaz.ZooKeeper.<init> Initiating client connection, connectString=127.0.0.1:29943/solr sessionTimeout=5000 watcher=org.apache.solr.common.cloud.ConnectionManager@1e67d9bb
[junit4:junit4]   2> 3068 T2340 oaz.ClientCnxn$SendThread.startConnect Opening socket connection to server /127.0.0.1:29943
[junit4:junit4]   2> 3068 T2307 oascc.ConnectionManager.waitForConnected Waiting for client to connect to ZooKeeper
[junit4:junit4]   2> 3069 T2340 oaz.ClientCnxn$SendThread.primeConnection Socket connection established to localhost/127.0.0.1:29943, initiating session
[junit4:junit4]   2> 3069 T2309 oazs.NIOServerCnxn$Factory.run Accepted socket connection from /140.211.11.196:29951
[junit4:junit4]   2> 3069 T2309 oazs.NIOServerCnxn.readConnectRequest Client attempting to establish new session at /140.211.11.196:29951
[junit4:junit4]   2> 3071 T2311 oazs.NIOServerCnxn.finishSessionInit Established session 0x139ec7736620003 with negotiated timeout 5000 for client /140.211.11.196:29951
[junit4:junit4]   2> 3071 T2340 oaz.ClientCnxn$SendThread.readConnectResult Session establishment complete on server localhost/127.0.0.1:29943, sessionid = 0x139ec7736620003, negotiated timeout = 5000
[junit4:junit4]   2> 3072 T2341 oascc.ConnectionManager.process Watcher org.apache.solr.common.cloud.ConnectionManager@1e67d9bb name:ZooKeeperConnection Watcher:127.0.0.1:29943/solr got event WatchedEvent state:SyncConnected type:None path:null path:null type:None
[junit4:junit4]   2> 3072 T2307 oascc.ConnectionManager.waitForConnected Client is connected to ZooKeeper
[junit4:junit4]   2> 3072 T2312 oazs.PrepRequestProcessor.pRequest Got user-level KeeperException when processing sessionid:0x139ec7736620003 type:create cxid:0x1 zxid:0xfffffffffffffffe txntype:unknown reqpath:n/a Error Path:/solr/overseer Error:KeeperErrorCode = NodeExists for /solr/overseer
[junit4:junit4]   2> 3093 T2327 oascc.ZkStateReader$2.process A cluster state change has occurred - updating...
[junit4:junit4]   2> 3094 T2312 oazs.PrepRequestProcessor.pRequest Got user-level KeeperException when processing sessionid:0x139ec7736620003 type:create cxid:0x2 zxid:0xfffffffffffffffe txntype:unknown reqpath:n/a Error Path:/solr/overseer Error:KeeperErrorCode = NodeExists for /solr/overseer
[junit4:junit4]   2> 3096 T2307 oasc.ZkController.createEphemeralLiveNode Register node as live in ZooKeeper:/live_nodes/127.0.0.1:29949_solr
[junit4:junit4]   2> 3097 T2312 oazs.PrepRequestProcessor.pRequest Got user-level KeeperException when processing sessionid:0x139ec7736620003 type:delete cxid:0x4 zxid:0xfffffffffffffffe txntype:unknown reqpath:n/a Error Path:/solr/live_nodes/127.0.0.1:29949_solr Error:KeeperErrorCode = NoNode for /solr/live_nodes/127.0.0.1:29949_solr
[junit4:junit4]   2> 3098 T2307 oascc.SolrZkClient.makePath makePath: /live_nodes/127.0.0.1:29949_solr
[junit4:junit4]   2> 3100 T2327 oascc.ZkStateReader$3.process Updating live nodes
[junit4:junit4]   2> 3101 T2307 oashc.HttpShardHandlerFactory.getParameter Setting socketTimeout to: 0
[junit4:junit4]   2> 3101 T2307 oashc.HttpShardHandlerFactory.getParameter Setting urlScheme to: http://
[junit4:junit4]   2> 3102 T2307 oashc.HttpShardHandlerFactory.getParameter Setting connTimeout to: 0
[junit4:junit4]   2> 3102 T2307 oashc.HttpShardHandlerFactory.getParameter Setting maxConnectionsPerHost to: 20
[junit4:junit4]   2> 3103 T2307 oashc.HttpShardHandlerFactory.getParameter Setting corePoolSize to: 0
[junit4:junit4]   2> 3103 T2307 oashc.HttpShardHandlerFactory.getParameter Setting maximumPoolSize to: 2147483647
[junit4:junit4]   2> 3104 T2307 oashc.HttpShardHandlerFactory.getParameter Setting maxThreadIdleTime to: 5
[junit4:junit4]   2> 3104 T2307 oashc.HttpShardHandlerFactory.getParameter Setting sizeOfQueue to: -1
[junit4:junit4]   2> 3105 T2307 oashc.HttpShardHandlerFactory.getParameter Setting fairnessPolicy to: false
[junit4:junit4]   2> 3105 T2307 oascsi.HttpClientUtil.createClient Creating new http client, config:maxConnectionsPerHost=20&maxConnections=10000&socketTimeout=0&connTimeout=0&retry=false
[junit4:junit4]   2> 3120 T2307 oascc.ZkStateReader.createClusterStateWatchersAndUpdate Updating cluster state from ZooKeeper... 
[junit4:junit4]   2> 3126 T2307 oasc.CoreContainer.create Creating SolrCore 'collection1' using instanceDir: /usr/home/hudson/hudson-slave/workspace/Lucene-Solr-Tests-4.x-Java6/solr/build/solr-core/test/J1/./solrtest-jetty1-1348292001901/collection1
[junit4:junit4]   2> 3126 T2307 oasc.ZkController.createCollectionZkNode Check for collection zkNode:collection1
[junit4:junit4]   2> 3127 T2307 oasc.ZkController.createCollectionZkNode Collection zkNode exists
[junit4:junit4]   2> 3127 T2307 oasc.ZkController.readConfigName Load collection config from:/collections/collection1
[junit4:junit4]   2> 3128 T2307 oasc.SolrResourceLoader.<init> new SolrResourceLoader for directory: '/usr/home/hudson/hudson-slave/workspace/Lucene-Solr-Tests-4.x-Java6/solr/build/solr-core/test/J1/./solrtest-jetty1-1348292001901/collection1/'
[junit4:junit4]   2> 3129 T2307 oasc.SolrResourceLoader.replaceClassLoader Adding 'file:/usr/home/hudson/hudson-slave/workspace/Lucene-Solr-Tests-4.x-Java6/solr/build/solr-core/test/J1/solrtest-jetty1-1348292001901/collection1/lib/README' to classloader
[junit4:junit4]   2> 3129 T2307 oasc.SolrResourceLoader.replaceClassLoader Adding 'file:/usr/home/hudson/hudson-slave/workspace/Lucene-Solr-Tests-4.x-Java6/solr/build/solr-core/test/J1/solrtest-jetty1-1348292001901/collection1/lib/classes/' to classloader
[junit4:junit4]   2> 3164 T2307 oasc.SolrConfig.<init> Using Lucene MatchVersion: LUCENE_40
[junit4:junit4]   2> 3212 T2307 oasc.SolrConfig.<init> Loaded SolrConfig: solrconfig.xml
[junit4:junit4]   2> 3313 T2307 oass.IndexSchema.readSchema Reading Solr Schema
[junit4:junit4]   2> 3319 T2307 oass.IndexSchema.readSchema Schema name=test
[junit4:junit4]   2> 3978 T2307 oass.OpenExchangeRatesOrgProvider.init Initialized with rates=open-exchange-rates.json, refreshInterval=1440.
[junit4:junit4]   2> 3985 T2307 oass.IndexSchema.readSchema default search field in schema is text
[junit4:junit4]   2> 3988 T2307 oass.IndexSchema.readSchema unique key field: id
[junit4:junit4]   2> 3997 T2307 oass.FileExchangeRateProvider.reload Reloading exchange rates from file currency.xml
[junit4:junit4]   2> 4000 T2307 oass.FileExchangeRateProvider.reload Reloading exchange rates from file currency.xml
[junit4:junit4]   2> 4003 T2307 oass.OpenExchangeRatesOrgProvider.reload Reloading exchange rates from open-exchange-rates.json
[junit4:junit4]   2> 4004 T2307 oass.OpenExchangeRatesOrgProvider.reload Reloading exchange rates from open-exchange-rates.json
[junit4:junit4]   2> 4005 T2307 oasc.SolrCore.<init> [collection1] Opening new SolrCore at /usr/home/hudson/hudson-slave/workspace/Lucene-Solr-Tests-4.x-Java6/solr/build/solr-core/test/J1/./solrtest-jetty1-1348292001901/collection1/, dataDir=./org.apache.solr.cloud.BasicDistributedZk2Test-1348291999324/jetty1/
[junit4:junit4]   2> 4005 T2307 oasc.JmxMonitoredMap.<init> JMX monitoring is enabled. Adding Solr mbeans to JMX Server: com.sun.jmx.mbeanserver.JmxMBeanServer@25a41cc7
[junit4:junit4]   2> 4006 T2307 oasc.SolrCore.getNewIndexDir WARNING New index directory detected: old=null new=./org.apache.solr.cloud.BasicDistributedZk2Test-1348291999324/jetty1/index/
[junit4:junit4]   2> 4007 T2307 oasc.SolrCore.initIndex WARNING [collection1] Solr index directory './org.apache.solr.cloud.BasicDistributedZk2Test-1348291999324/jetty1/index' doesn't exist. Creating new index...
[junit4:junit4]   2> 4007 T2307 oasc.CachingDirectoryFactory.get return new directory for /usr/home/hudson/hudson-slave/workspace/Lucene-Solr-Tests-4.x-Java6/solr/build/solr-core/test/J1/./org.apache.solr.cloud.BasicDistributedZk2Test-1348291999324/jetty1/index forceNew:false
[junit4:junit4]   2> 4040 T2307 oasc.SolrDeletionPolicy.onCommit SolrDeletionPolicy.onCommit: commits:num=1
[junit4:junit4]   2> 		commit{dir=NRTCachingDirectory(org.apache.lucene.store.NIOFSDirectory@/usr/home/hudson/hudson-slave/workspace/Lucene-Solr-Tests-4.x-Java6/solr/build/solr-core/test/J1/org.apache.solr.cloud.BasicDistributedZk2Test-1348291999324/jetty1/index lockFactory=org.apache.lucene.store.NativeFSLockFactory@77e2ce72; maxCacheMB=48.0 maxMergeSizeMB=4.0),segFN=segments_1,generation=1,filenames=[segments_1]
[junit4:junit4]   2> 4040 T2307 oasc.SolrDeletionPolicy.updateCommits newest commit = 1
[junit4:junit4]   2> 4041 T2307 oasc.SolrCore.initWriters created xml: solr.XMLResponseWriter
[junit4:junit4]   2> 4043 T2307 oasup.UpdateRequestProcessorChain.init inserting DistributedUpdateProcessorFactory into updateRequestProcessorChain "dedupe"
[junit4:junit4]   2> 4043 T2307 oasup.UpdateRequestProcessorChain.init inserting DistributedUpdateProcessorFactory into updateRequestProcessorChain "dedupe-allfields"
[junit4:junit4]   2> 4044 T2307 oasup.UpdateRequestProcessorChain.init inserting DistributedUpdateProcessorFactory into updateRequestProcessorChain "stored_sig"
[junit4:junit4]   2> 4044 T2307 oasup.UpdateRequestProcessorChain.init inserting DistributedUpdateProcessorFactory into updateRequestProcessorChain "uniq-fields"
[junit4:junit4]   2> 4045 T2307 oasup.UpdateRequestProcessorChain.init inserting DistributedUpdateProcessorFactory into updateRequestProcessorChain "distrib-dup-test-chain-implicit"
[junit4:junit4]   2> 4045 T2307 oasc.RequestHandlers.initHandlersFromConfig adding lazy requestHandler: solr.ReplicationHandler
[junit4:junit4]   2> 4045 T2307 oasc.RequestHandlers.initHandlersFromConfig created /replication: solr.ReplicationHandler
[junit4:junit4]   2> 4046 T2307 oasc.RequestHandlers.initHandlersFromConfig created standard: solr.StandardRequestHandler
[junit4:junit4]   2> 4047 T2307 oasc.RequestHandlers.initHandlersFromConfig created /get: solr.RealTimeGetHandler
[junit4:junit4]   2> 4047 T2307 oasc.RequestHandlers.initHandlersFromConfig created dismax: solr.SearchHandler
[junit4:junit4]   2> 4048 T2307 oasc.RequestHandlers.initHandlersFromConfig created mock: org.apache.solr.core.MockQuerySenderListenerReqHandler
[junit4:junit4]   2> 4048 T2307 oasc.RequestHandlers.initHandlersFromConfig created /admin/: org.apache.solr.handler.admin.AdminHandlers
[junit4:junit4]   2> 4049 T2307 oasc.RequestHandlers.initHandlersFromConfig created defaults: solr.StandardRequestHandler
[junit4:junit4]   2> 4049 T2307 oasc.RequestHandlers.initHandlersFromConfig adding lazy requestHandler: solr.StandardRequestHandler
[junit4:junit4]   2> 4049 T2307 oasc.RequestHandlers.initHandlersFromConfig created lazy: solr.StandardRequestHandler
[junit4:junit4]   2> 4050 T2307 oasc.RequestHandlers.initHandlersFromConfig created /update: solr.UpdateRequestHandler
[junit4:junit4]   2> 4050 T2307 oasc.RequestHandlers.initHandlersFromConfig created /terms: org.apache.solr.handler.component.SearchHandler
[junit4:junit4]   2> 4051 T2307 oasc.RequestHandlers.initHandlersFromConfig created spellCheckCompRH: org.apache.solr.handler.component.SearchHandler
[junit4:junit4]   2> 4051 T2307 oasc.RequestHandlers.initHandlersFromConfig created spellCheckCompRH_Direct: org.apache.solr.handler.component.SearchHandler
[junit4:junit4]   2> 4052 T2307 oasc.RequestHandlers.initHandlersFromConfig created spellCheckWithWordbreak: org.apache.solr.handler.component.SearchHandler
[junit4:junit4]   2> 4053 T2307 oasc.RequestHandlers.initHandlersFromConfig created spellCheckWithWordbreak_Direct: org.apache.solr.handler.component.SearchHandler
[junit4:junit4]   2> 4053 T2307 oasc.RequestHandlers.initHandlersFromConfig created spellCheckCompRH1: org.apache.solr.handler.component.SearchHandler
[junit4:junit4]   2> 4054 T2307 oasc.RequestHandlers.initHandlersFromConfig created tvrh: org.apache.solr.handler.component.SearchHandler
[junit4:junit4]   2> 4054 T2307 oasc.RequestHandlers.initHandlersFromConfig created /mlt: solr.MoreLikeThisHandler
[junit4:junit4]   2> 4055 T2307 oasc.RequestHandlers.initHandlersFromConfig created /debug/dump: solr.DumpRequestHandler
[junit4:junit4]   2> 4057 T2307 oashl.XMLLoader.init xsltCacheLifetimeSeconds=60
[junit4:junit4]   2> 4061 T2307 oasc.SolrCore.initDeprecatedSupport WARNING solrconfig.xml uses deprecated <admin/gettableFiles>, Please update your config to use the ShowFileRequestHandler.
[junit4:junit4]   2> 4062 T2307 oasc.SolrCore.initDeprecatedSupport WARNING adding ShowFileRequestHandler with hidden files: [SCHEMA.XML, OLD_SYNONYMS.TXT, STOPWORDS.TXT, PROTWORDS.TXT, OPEN-EXCHANGE-RATES.JSON, SYNONYMS.TXT, CURRENCY.XML, MAPPING-ISOLATIN1ACCENT.TXT]
[junit4:junit4]   2> 4065 T2307 oass.SolrIndexSearcher.<init> Opening Searcher@45c1c6e4 main
[junit4:junit4]   2> 4066 T2307 oasu.CommitTracker.<init> Hard AutoCommit: disabled
[junit4:junit4]   2> 4067 T2307 oasu.CommitTracker.<init> Soft AutoCommit: disabled
[junit4:junit4]   2> 4068 T2307 oashc.SpellCheckComponent.inform Initializing spell checkers
[junit4:junit4]   2> 4076 T2307 oass.DirectSolrSpellChecker.init init: {name=direct,classname=DirectSolrSpellChecker,field=lowerfilt,minQueryLength=3}
[junit4:junit4]   2> 4135 T2342 oasc.SolrCore.registerSearcher [collection1] Registered new searcher Searcher@45c1c6e4 main{StandardDirectoryReader(segments_1:1)}
[junit4:junit4]   2> 4601 T2328 oascc.ZkStateReader.updateClusterState Updating cloud state from ZooKeeper... 
[junit4:junit4]   2> 4615 T2341 oascc.ZkStateReader$2.process A cluster state change has occurred - updating...
[junit4:junit4]   2> 4615 T2327 oascc.ZkStateReader$2.process A cluster state change has occurred - updating...
[junit4:junit4]   2> 4642 T2307 oasc.CoreContainer.register registering core: collection1
[junit4:junit4]   2> 4642 T2307 oasc.ZkController.register Register shard - core:collection1 address:http://127.0.0.1:29949/solr shardId:shard1
[junit4:junit4]   2> 4643 T2307 oascc.SolrZkClient.makePath makePath: /collections/collection1/leader_elect/shard1/election
[junit4:junit4]   2> 4658 T2312 oazs.PrepRequestProcessor.pRequest Got user-level KeeperException when processing sessionid:0x139ec7736620003 type:delete cxid:0x42 zxid:0xfffffffffffffffe txntype:unknown reqpath:n/a Error Path:/solr/collections/collection1/leaders Error:KeeperErrorCode = NoNode for /solr/collections/collection1/leaders
[junit4:junit4]   2> 4659 T2307 oasc.ShardLeaderElectionContext.runLeaderProcess Running the leader process.
[junit4:junit4]   2> 4660 T2312 oazs.PrepRequestProcessor.pRequest Got user-level KeeperException when processing sessionid:0x139ec7736620003 type:create cxid:0x43 zxid:0xfffffffffffffffe txntype:unknown reqpath:n/a Error Path:/solr/overseer Error:KeeperErrorCode = NodeExists for /solr/overseer
[junit4:junit4]   2> 4661 T2307 oasc.ShardLeaderElectionContext.waitForReplicasToComeUp Enough replicas found to continue.
[junit4:junit4]   2> 4662 T2307 oasc.ShardLeaderElectionContext.runLeaderProcess I may be the new leader - try and sync
[junit4:junit4]   2> 4662 T2307 oasc.SyncStrategy.sync Sync replicas to http://127.0.0.1:29949/solr/collection1/
[junit4:junit4]   2> 4663 T2307 oasc.SyncStrategy.syncReplicas Sync Success - now sync replicas to me
[junit4:junit4]   2> 4663 T2307 oasc.SyncStrategy.syncToMe http://127.0.0.1:29949/solr/collection1/ has no replicas
[junit4:junit4]   2> 4664 T2307 oasc.ShardLeaderElectionContext.runLeaderProcess I am the new leader: http://127.0.0.1:29949/solr/collection1/
[junit4:junit4]   2> 4664 T2307 oascc.SolrZkClient.makePath makePath: /collections/collection1/leaders/shard1
[junit4:junit4]   2> 4667 T2312 oazs.PrepRequestProcessor.pRequest Got user-level KeeperException when processing sessionid:0x139ec7736620003 type:create cxid:0x4d zxid:0xfffffffffffffffe txntype:unknown reqpath:n/a Error Path:/solr/overseer Error:KeeperErrorCode = NodeExists for /solr/overseer
[junit4:junit4]   2> 5119 T2328 oascc.ZkStateReader.updateClusterState Updating cloud state from ZooKeeper... 
[junit4:junit4]   2> 5135 T2327 oascc.ZkStateReader$2.process A cluster state change has occurred - updating...
[junit4:junit4]   2> 5135 T2341 oascc.ZkStateReader$2.process A cluster state change has occurred - updating...
[junit4:junit4]   2> 5178 T2307 oasc.ZkController.register We are http://127.0.0.1:29949/solr/collection1/ and leader is http://127.0.0.1:29949/solr/collection1/
[junit4:junit4]   2> 5178 T2307 oasc.ZkController.register No LogReplay needed for core=collection1 baseURL=http://127.0.0.1:29949/solr
[junit4:junit4]   2> 5179 T2307 oasc.ZkController.checkRecovery I am the leader, no recovery necessary
[junit4:junit4]   2> 5181 T2307 oascc.ZkStateReader.updateClusterState Updating cloud state from ZooKeeper... 
[junit4:junit4]   2> 5181 T2307 oass.SolrDispatchFilter.init user.dir=/usr/home/hudson/hudson-slave/workspace/Lucene-Solr-Tests-4.x-Java6/solr/build/solr-core/test/J1
[junit4:junit4]   2> 5182 T2307 oass.SolrDispatchFilter.init SolrDispatchFilter.init() done
[junit4:junit4]   2> 5182 T2307 oascsi.HttpClientUtil.createClient Creating new http client, config:maxConnections=128&maxConnectionsPerHost=32&followRedirects=false
[junit4:junit4]   2> 5603 T2307 oejs.Server.doStart jetty-8.1.2.v20120308
[junit4:junit4]   2> 5606 T2307 oejs.AbstractConnector.doStart Started SocketConnector@0.0.0.0:29953
[junit4:junit4]   2> 5606 T2307 oasc.SolrResourceLoader.locateSolrHome JNDI not configured for solr (NoInitialContextEx)
[junit4:junit4]   2> 5607 T2307 oasc.SolrResourceLoader.locateSolrHome using system property solr.solr.home: /usr/home/hudson/hudson-slave/workspace/Lucene-Solr-Tests-4.x-Java6/solr/build/solr-core/test/J1/./solrtest-jetty2-1348292004516
[junit4:junit4]   2> 5607 T2307 oasc.SolrResourceLoader.<init> new SolrResourceLoader for deduced Solr Home: '/usr/home/hudson/hudson-slave/workspace/Lucene-Solr-Tests-4.x-Java6/solr/build/solr-core/test/J1/./solrtest-jetty2-1348292004516/'
[junit4:junit4]   2> 5643 T2307 oass.SolrDispatchFilter.init SolrDispatchFilter.init()
[junit4:junit4]   2> 5643 T2307 oasc.SolrResourceLoader.locateSolrHome JNDI not configured for solr (NoInitialContextEx)
[junit4:junit4]   2> 5644 T2307 oasc.SolrResourceLoader.locateSolrHome using system property solr.solr.home: /usr/home/hudson/hudson-slave/workspace/Lucene-Solr-Tests-4.x-Java6/solr/build/solr-core/test/J1/./solrtest-jetty2-1348292004516
[junit4:junit4]   2> 5644 T2307 oasc.CoreContainer$Initializer.initialize looking for solr.xml: /usr/home/hudson/hudson-slave/workspace/Lucene-Solr-Tests-4.x-Java6/solr/build/solr-core/test/J1/./solrtest-jetty2-1348292004516/solr.xml
[junit4:junit4]   2> 5645 T2307 oasc.CoreContainer.<init> New CoreContainer 2110475884
[junit4:junit4]   2> 5646 T2307 oasc.CoreContainer.load Loading CoreContainer using Solr Home: '/usr/home/hudson/hudson-slave/workspace/Lucene-Solr-Tests-4.x-Java6/solr/build/solr-core/test/J1/./solrtest-jetty2-1348292004516/'
[junit4:junit4]   2> 5646 T2307 oasc.SolrResourceLoader.<init> new SolrResourceLoader for directory: '/usr/home/hudson/hudson-slave/workspace/Lucene-Solr-Tests-4.x-Java6/solr/build/solr-core/test/J1/./solrtest-jetty2-1348292004516/'
[junit4:junit4]   2> 5648 T2328 oascc.ZkStateReader.updateClusterState Updating cloud state from ZooKeeper... 
[junit4:junit4]   2> 5669 T2327 oascc.ZkStateReader$2.process A cluster state change has occurred - updating...
[junit4:junit4]   2> 5669 T2341 oascc.ZkStateReader$2.process A cluster state change has occurred - updating...
[junit4:junit4]   2> 5672 T2307 oasc.CoreContainer.load Registering Log Listener
[junit4:junit4]   2> 5687 T2307 oasc.CoreContainer.initZooKeeper Zookeeper client=127.0.0.1:29943/solr
[junit4:junit4]   2> 5688 T2307 oaz.ZooKeeper.<init> Initiating client connection, connectString=127.0.0.1:29943/solr sessionTimeout=5000 watcher=org.apache.solr.common.cloud.ConnectionManager@5afd3f4d
[junit4:junit4]   2> 5689 T2352 oaz.ClientCnxn$SendThread.startConnect Opening socket connection to server /127.0.0.1:29943
[junit4:junit4]   2> 5689 T2307 oascc.ConnectionManager.waitForConnected Waiting for client to connect to ZooKeeper
[junit4:junit4]   2> 5690 T2352 oaz.ClientCnxn$SendThread.primeConnection Socket connection established to localhost/127.0.0.1:29943, initiating session
[junit4:junit4]   2> 5690 T2309 oazs.NIOServerCnxn$Factory.run Accepted socket connection from /140.211.11.196:29954
[junit4:junit4]   2> 5690 T2309 oazs.NIOServerCnxn.readConnectRequest Client attempting to establish new session at /140.211.11.196:29954
[junit4:junit4]   2> 5692 T2311 oazs.NIOServerCnxn.finishSessionInit Established session 0x139ec7736620004 with negotiated timeout 5000 for client /140.211.11.196:29954
[junit4:junit4]   2> 5692 T2352 oaz.ClientCnxn$SendThread.readConnectResult Session establishment complete on server localhost/127.0.0.1:29943, sessionid = 0x139ec7736620004, negotiated timeout = 5000
[junit4:junit4]   2> 5692 T2353 oascc.ConnectionManager.process Watcher org.apache.solr.common.cloud.ConnectionManager@5afd3f4d name:ZooKeeperConnection Watcher:127.0.0.1:29943/solr got event WatchedEvent state:SyncConnected type:None path:null path:null type:None
[junit4:junit4]   2> 5693 T2307 oascc.ConnectionManager.waitForConnected Client is connected to ZooKeeper
[junit4:junit4]   2> 5693 T2312 oazs.PrepRequestProcessor.pRequest Got user-level KeeperException when processing sessionid:0x139ec7736620004 type:create cxid:0x1 zxid:0xfffffffffffffffe txntype:unknown reqpath:n/a Error Path:/solr/overseer Error:KeeperErrorCode = NodeExists for /solr/overseer
[junit4:junit4]   2> 5694 T2312 oazs.PrepRequestProcessor.pRequest Got user-level KeeperException when processing sessionid:0x139ec7736620004 type:create cxid:0x2 zxid:0xfffffffffffffffe txntype:unknown reqpath:n/a Error Path:/solr/overseer Error:KeeperErrorCode = NodeExists for /solr/overseer
[junit4:junit4]   2> 5696 T2307 oasc.ZkController.createEphemeralLiveNode Register node as live in ZooKeeper:/live_nodes/127.0.0.1:29953_solr
[junit4:junit4]   2> 5697 T2312 oazs.PrepRequestProcessor.pRequest Got user-level KeeperException when processing sessionid:0x139ec7736620004 type:delete cxid:0x4 zxid:0xfffffffffffffffe txntype:unknown reqpath:n/a Error Path:/solr/live_nodes/127.0.0.1:29953_solr Error:KeeperErrorCode = NoNode for /solr/live_nodes/127.0.0.1:29953_solr
[junit4:junit4]   2> 5705 T2307 oascc.SolrZkClient.makePath makePath: /live_nodes/127.0.0.1:29953_solr
[junit4:junit4]   2> 5707 T2327 oascc.ZkStateReader$3.process Updating live nodes
[junit4:junit4]   2> 5707 T2341 oascc.ZkStateReader$3.process Updating live nodes
[junit4:junit4]   2> 5708 T2307 oashc.HttpShardHandlerFactory.getParameter Setting socketTimeout to: 0
[junit4:junit4]   2> 5708 T2307 oashc.HttpShardHandlerFactory.getParameter Setting urlScheme to: http://
[junit4:junit4]   2> 5709 T2307 oashc.HttpShardHandlerFactory.getParameter Setting connTimeout to: 0
[junit4:junit4]   2> 5709 T2307 oashc.HttpShardHandlerFactory.getParameter Setting maxConnectionsPerHost to: 20
[junit4:junit4]   2> 5710 T2307 oashc.HttpShardHandlerFactory.getParameter Setting corePoolSize to: 0
[junit4:junit4]   2> 5711 T2307 oashc.HttpShardHandlerFactory.getParameter Setting maximumPoolSize to: 2147483647
[junit4:junit4]   2> 5711 T2307 oashc.HttpShardHandlerFactory.getParameter Setting maxThreadIdleTime to: 5
[junit4:junit4]   2> 5712 T2307 oashc.HttpShardHandlerFactory.getParameter Setting sizeOfQueue to: -1
[junit4:junit4]   2> 5712 T2307 oashc.HttpShardHandlerFactory.getParameter Setting fairnessPolicy to: false
[junit4:junit4]   2> 5713 T2307 oascsi.HttpClientUtil.createClient Creating new http client, config:maxConnectionsPerHost=20&maxConnections=10000&socketTimeout=0&connTimeout=0&retry=false
[junit4:junit4]   2> 5738 T2307 oascc.ZkStateReader.createClusterStateWatchersAndUpdate Updating cluster state from ZooKeeper... 
[junit4:junit4]   2> 5748 T2307 oasc.CoreContainer.create Creating SolrCore 'collection1' using instanceDir: /usr/home/hudson/hudson-slave/workspace/Lucene-Solr-Tests-4.x-Java6/solr/build/solr-core/test/J1/./solrtest-jetty2-1348292004516/collection1
[junit4:junit4]   2> 5749 T2307 oasc.ZkController.createCollectionZkNode Check for collection zkNode:collection1
[junit4:junit4]   2> 5750 T2307 oasc.ZkController.createCollectionZkNode Collection zkNode exists
[junit4:junit4]   2> 5750 T2307 oasc.ZkController.readConfigName Load collection config from:/collections/collection1
[junit4:junit4]   2> 5752 T2307 oasc.SolrResourceLoader.<init> new SolrResourceLoader for directory: '/usr/home/hudson/hudson-slave/workspace/Lucene-Solr-Tests-4.x-Java6/solr/build/solr-core/test/J1/./solrtest-jetty2-1348292004516/collection1/'
[junit4:junit4]   2> 5754 T2307 oasc.SolrResourceLoader.replaceClassLoader Adding 'file:/usr/home/hudson/hudson-slave/workspace/Lucene-Solr-Tests-4.x-Java6/solr/build/solr-core/test/J1/solrtest-jetty2-1348292004516/collection1/lib/classes/' to classloader
[junit4:junit4]   2> 5755 T2307 oasc.SolrResourceLoader.replaceClassLoader Adding 'file:/usr/home/hudson/hudson-slave/workspace/Lucene-Solr-Tests-4.x-Java6/solr/build/solr-core/test/J1/solrtest-jetty2-1348292004516/collection1/lib/README' to classloader
[junit4:junit4]   2> 5831 T2307 oasc.SolrConfig.<init> Using Lucene MatchVersion: LUCENE_40
[junit4:junit4]   2> 5940 T2307 oasc.SolrConfig.<init> Loaded SolrConfig: solrconfig.xml
[junit4:junit4]   2> 6041 T2307 oass.IndexSchema.readSchema Reading Solr Schema
[junit4:junit4]   2> 6052 T2307 oass.IndexSchema.readSchema Schema name=test
[junit4:junit4]   2> 6756 T2307 oass.OpenExchangeRatesOrgProvider.init Initialized with rates=open-exchange-rates.json, refreshInterval=1440.
[junit4:junit4]   2> 6768 T2307 oass.IndexSchema.readSchema default search field in schema is text
[junit4:junit4]   2> 6772 T2307 oass.IndexSchema.readSchema unique key field: id
[junit4:junit4]   2> 6782 T2307 oass.FileExchangeRateProvider.reload Reloading exchange rates from file currency.xml
[junit4:junit4]   2> 6787 T2307 oass.FileExchangeRateProvider.reload Reloading exchange rates from file currency.xml
[junit4:junit4]   2> 6793 T2307 oass.OpenExchangeRatesOrgProvider.reload Reloading exchange rates from open-exchange-rates.json
[junit4:junit4]   2> 6794 T2307 oass.OpenExchangeRatesOrgProvider.reload Reloading exchange rates from open-exchange-rates.json
[junit4:junit4]   2> 6795 T2307 oasc.SolrCore.<init> [collection1] Opening new SolrCore at /usr/home/hudson/hudson-slave/workspace/Lucene-Solr-Tests-4.x-Java6/solr/build/solr-core/test/J1/./solrtest-jetty2-1348292004516/collection1/, dataDir=./org.apache.solr.cloud.BasicDistributedZk2Test-1348291999324/jetty2/
[junit4:junit4]   2> 6796 T2307 oasc.JmxMonitoredMap.<init> JMX monitoring is enabled. Adding Solr mbeans to JMX Server: com.sun.jmx.mbeanserver.JmxMBeanServer@25a41cc7
[junit4:junit4]   2> 6797 T2307 oasc.SolrCore.getNewIndexDir WARNING New index directory detected: old=null new=./org.apache.solr.cloud.BasicDistributedZk2Test-1348291999324/jetty2/index/
[junit4:junit4]   2> 6798 T2307 oasc.SolrCore.initIndex WARNING [collection1] Solr index directory './org.apache.solr.cloud.BasicDistributedZk2Test-1348291999324/jetty2/index' doesn't exist. Creating new index...
[junit4:junit4]   2> 6799 T2307 oasc.CachingDirectoryFactory.get return new directory for /usr/home/hudson/hudson-slave/workspace/Lucene-Solr-Tests-4.x-Java6/solr/build/solr-core/test/J1/./org.apache.solr.cloud.BasicDistributedZk2Test-1348291999324/jetty2/index forceNew:false
[junit4:junit4]   2> 6806 T2307 oasc.SolrDeletionPolicy.onCommit SolrDeletionPolicy.onCommit: commits:num=1
[junit4:junit4]   2> 		commit{dir=NRTCachingDirectory(org.apache.lucene.store.NIOFSDirectory@/usr/home/hudson/hudson-slave/workspace/Lucene-Solr-Tests-4.x-Java6/solr/build/solr-core/test/J1/org.apache.solr.cloud.BasicDistributedZk2Test-1348291999324/jetty2/index lockFactory=org.apache.lucene.store.NativeFSLockFactory@33a0269d; maxCacheMB=48.0 maxMergeSizeMB=4.0),segFN=segments_1,generation=1,filenames=[segments_1]
[junit4:junit4]   2> 6807 T2307 oasc.SolrDeletionPolicy.updateCommits newest commit = 1
[junit4:junit4]   2> 6808 T2307 oasc.SolrCore.initWriters created xml: solr.XMLResponseWriter
[junit4:junit4]   2> 6810 T2307 oasup.UpdateRequestProcessorChain.init inserting DistributedUpdateProcessorFactory into updateRequestProcessorChain "dedupe"
[junit4:junit4]   2> 6811 T2307 oasup.UpdateRequestProcessorChain.init inserting DistributedUpdateProcessorFactory into updateRequestProcessorChain "dedupe-allfields"
[junit4:junit4]   2> 6811 T2307 oasup.UpdateRequestProcessorChain.init inserting DistributedUpdateProcessorFactory into updateRequestProcessorChain "stored_sig"
[junit4:junit4]   2> 6812 T2307 oasup.UpdateRequestProcessorChain.init inserting DistributedUpdateProcessorFactory into updateRequestProcessorChain "uniq-fields"
[junit4:junit4]   2> 6813 T2307 oasup.UpdateRequestProcessorChain.init inserting DistributedUpdateProcessorFactory into updateRequestProcessorChain "distrib-dup-test-chain-implicit"
[junit4:junit4]   2> 6813 T2307 oasc.RequestHandlers.initHandlersFromConfig adding lazy requestHandler: solr.ReplicationHandler
[junit4:junit4]   2> 6814 T2307 oasc.RequestHandlers.initHandlersFromConfig created /replication: solr.ReplicationHandler
[junit4:junit4]   2> 6815 T2307 oasc.RequestHandlers.initHandlersFromConfig created standard: solr.StandardRequestHandler
[junit4:junit4]   2> 6815 T2307 oasc.RequestHandlers.initHandlersFromConfig created /get: solr.RealTimeGetHandler
[junit4:junit4]   2> 6816 T2307 oasc.RequestHandlers.initHandlersFromConfig created dismax: solr.SearchHandler
[junit4:junit4]   2> 6817 T2307 oasc.RequestHandlers.initHandlersFromConfig created mock: org.apache.solr.core.MockQuerySenderListenerReqHandler
[junit4:junit4]   2> 6817 T2307 oasc.RequestHandlers.initHandlersFromConfig created /admin/: org.apache.solr.handler.admin.AdminHandlers
[junit4:junit4]   2> 6818 T2307 oasc.RequestHandlers.initHandlersFromConfig created defaults: solr.StandardRequestHandler
[junit4:junit4]   2> 6819 T2307 oasc.RequestHandlers.initHandlersFromConfig adding lazy requestHandler: solr.StandardRequestHandler
[junit4:junit4]   2> 6819 T2307 oasc.RequestHandlers.initHandlersFromConfig created lazy: solr.StandardRequestHandler
[junit4:junit4]   2> 6820 T2307 oasc.RequestHandlers.initHandlersFromConfig created /update: solr.UpdateRequestHandler
[junit4:junit4]   2> 6821 T2307 oasc.RequestHandlers.initHandlersFromConfig created /terms: org.apache.solr.handler.component.SearchHandler
[junit4:junit4]   2> 6821 T2307 oasc.RequestHandlers.initHandlersFromConfig created spellCheckCompRH: org.apache.solr.handler.component.SearchHandler
[junit4:junit4]   2> 6822 T2307 oasc.RequestHandlers.initHandlersFromConfig created spellCheckCompRH_Direct: org.apache.solr.handler.component.SearchHandler
[junit4:junit4]   2> 6823 T2307 oasc.RequestHandlers.initHandlersFromConfig created spellCheckWithWordbreak: org.apache.solr.handler.component.SearchHandler
[junit4:junit4]   2> 6824 T2307 oasc.RequestHandlers.initHandlersFromConfig created spellCheckWithWordbreak_Direct: org.apache.solr.handler.component.SearchHandler
[junit4:junit4]   2> 6824 T2307 oasc.RequestHandlers.initHandlersFromConfig created spellCheckCompRH1: org.apache.solr.handler.component.SearchHandler
[junit4:junit4]   2> 6825 T2307 oasc.RequestHandlers.initHandlersFromConfig created tvrh: org.apache.solr.handler.component.SearchHandler
[junit4:junit4]   2> 6826 T2307 oasc.RequestHandlers.initHandlersFromConfig created /mlt: solr.MoreLikeThisHandler
[junit4:junit4]   2> 6827 T2307 oasc.RequestHandlers.initHandlersFromConfig created /debug/dump: solr.DumpRequestHandler
[junit4:junit4]   2> 6831 T2307 oashl.XMLLoader.init xsltCacheLifetimeSeconds=60
[junit4:junit4]   2> 6836 T2307 oasc.SolrCore.initDeprecatedSupport WARNING solrconfig.xml uses deprecated <admin/gettableFiles>, Please update your config to use the ShowFileRequestHandler.
[junit4:junit4]   2> 6837 T2307 oasc.SolrCore.initDeprecatedSupport WARNING adding ShowFileRequestHandler with hidden files: [SCHEMA.XML, OLD_SYNONYMS.TXT, STOPWORDS.TXT, PROTWORDS.TXT, OPEN-EXCHANGE-RATES.JSON, SYNONYMS.TXT, CURRENCY.XML, MAPPING-ISOLATIN1ACCENT.TXT]
[junit4:junit4]   2> 6841 T2307 oass.SolrIndexSearcher.<init> Opening Searcher@40d8ca10 main
[junit4:junit4]   2> 6843 T2307 oasu.CommitTracker.<init> Hard AutoCommit: disabled
[junit4:junit4]   2> 6843 T2307 oasu.CommitTracker.<init> Soft AutoCommit: disabled
[junit4:junit4]   2> 6844 T2307 oashc.SpellCheckComponent.inform Initializing spell checkers
[junit4:junit4]   2> 6854 T2307 oass.DirectSolrSpellChecker.init init: {name=direct,classname=DirectSolrSpellChecker,field=lowerfilt,minQueryLength=3}
[junit4:junit4]   2> 6903 T2354 oasc.SolrCore.registerSearcher [collection1] Registered new searcher Searcher@40d8ca10 main{StandardDirectoryReader(segments_1:1)}
[junit4:junit4]   2> 7175 T2328 oascc.ZkStateReader.updateClusterState Updating cloud state from ZooKeeper... 
[junit4:junit4]   2> 7193 T2327 oascc.ZkStateReader$2.process A cluster state change has occurred - updating...
[junit4:junit4]   2> 7194 T2341 oascc.ZkStateReader$2.process A cluster state change has occurred - updating...
[junit4:junit4]   2> 7194 T2353 oascc.ZkStateReader$2.process A cluster state change has occurred - updating...
[junit4:junit4]   2> 7411 T2307 oasc.CoreContainer.register registering core: collection1
[junit4:junit4]   2> 7411 T2307 oasc.ZkController.register Register shard - core:collection1 address:http://127.0.0.1:29953/solr shardId:shard2
[junit4:junit4]   2> 7412 T2307 oascc.SolrZkClient.makePath makePath: /collections/collection1/leader_elect/shard2/election
[junit4:junit4]   2> 7428 T2312 oazs.PrepRequestProcessor.pRequest Got user-level KeeperException when processing sessionid:0x139ec7736620004 type:delete cxid:0x41 zxid:0xfffffffffffffffe txntype:unknown reqpath:n/a Error Path:/solr/collections/collection1/leaders/shard2 Error:KeeperErrorCode = NoNode for /solr/collections/collection1/leaders/shard2
[junit4:junit4]   2> 7429 T2307 oasc.ShardLeaderElectionContext.runLeaderProcess Running the leader process.
[junit4:junit4]   2> 7430 T2312 oazs.PrepRequestProcessor.pRequest Got user-level KeeperException when processing sessionid:0x139ec7736620004 type:create cxid:0x42 zxid:0xfffffffffffffffe txntype:unknown reqpath:n/a Error Path:/solr/overseer Error:KeeperErrorCode = NodeExists for /solr/overseer
[junit4:junit4]   2> 7431 T2307 oasc.ShardLeaderElectionContext.waitForReplicasToComeUp Enough replicas found to continue.
[junit4:junit4]   2> 7431 T2307 oasc.ShardLeaderElectionContext.runLeaderProcess I may be the new leader - try and sync
[junit4:junit4]   2> 7432 T2307 oasc.SyncStrategy.sync Sync replicas to http://127.0.0.1:29953/solr/collection1/
[junit4:junit4]   2> 7432 T2307 oasc.SyncStrategy.syncReplicas Sync Success - now sync replicas to me
[junit4:junit4]   2> 7432 T2307 oasc.SyncStrategy.syncToMe http://127.0.0.1:29953/solr/collection1/ has no replicas
[junit4:junit4]   2> 7433 T2307 oasc.ShardLeaderElectionContext.runLeaderProcess I am the new leader: http://127.0.0.1:29953/solr/collection1/
[junit4:junit4]   2> 7433 T2307 oascc.SolrZkClient.makePath makePath: /collections/collection1/leaders/shard2
[junit4:junit4]   2> 7435 T2312 oazs.PrepRequestProcessor.pRequest Got user-level KeeperException when processing sessionid:0x139ec7736620004 type:create cxid:0x4b zxid:0xfffffffffffffffe txntype:unknown reqpath:n/a Error Path:/solr/overseer Error:KeeperErrorCode = NodeExists for /solr/overseer
[junit4:junit4]   2> 7697 T2328 oascc.ZkStateReader.updateClusterState Updating cloud state from ZooKeeper... 
[junit4:junit4]   2> 7712 T2353 oascc.ZkStateReader$2.process A cluster state change has occurred - updating...
[junit4:junit4]   2> 7712 T2327 oascc.ZkStateReader$2.process A cluster state change has occurred - updating...
[junit4:junit4]   2> 7712 T2341 oascc.ZkStateReader$2.process A cluster state change has occurred - updating...
[junit4:junit4]   2> 7742 T2307 oasc.ZkController.register We are http://127.0.0.1:29953/solr/collection1/ and leader is http://127.0.0.1:29953/solr/collection1/
[junit4:junit4]   2> 7742 T2307 oasc.ZkController.register No LogReplay needed for core=collection1 baseURL=http://127.0.0.1:29953/solr
[junit4:junit4]   2> 7743 T2307 oasc.ZkController.checkRecovery I am the leader, no recovery necessary
[junit4:junit4]   2> 7744 T2307 oascc.ZkStateReader.updateClusterState Updating cloud state from ZooKeeper... 
[junit4:junit4]   2> 7745 T2307 oass.SolrDispatchFilter.init user.dir=/usr/home/hudson/hudson-slave/workspace/Lucene-Solr-Tests-4.x-Java6/solr/build/solr-core/test/J1
[junit4:junit4]   2> 7745 T2307 oass.SolrDispatchFilter.init SolrDispatchFilter.init() done
[junit4:junit4]   2> 7746 T2307 oascsi.HttpClientUtil.createClient Creating new http client, config:maxConnections=128&maxConnectionsPerHost=32&followRedirects=false
[junit4:junit4]   2> 8134 T2307 oejs.Server.doStart jetty-8.1.2.v20120308
[junit4:junit4]   2> 8137 T2307 oejs.AbstractConnector.doStart Started SocketConnector@0.0.0.0:29959
[junit4:junit4]   2> 8138 T2307 oasc.SolrResourceLoader.locateSolrHome JNDI not configured for solr (NoInitialContextEx)
[junit4:junit4]   2> 8138 T2307 oasc.SolrResourceLoader.locateSolrHome using system property solr.solr.home: /usr/home/hudson/hudson-slave/workspace/Lucene-Solr-Tests-4.x-Java6/solr/build/solr-core/test/J1/./solrtest-jetty3-1348292007079
[junit4:junit4]   2> 8139 T2307 oasc.SolrResourceLoader.<init> new SolrResourceLoader for deduced Solr Home: '/usr/home/hudson/hudson-slave/workspace/Lucene-Solr-Tests-4.x-Java6/solr/build/solr-core/test/J1/./solrtest-jetty3-1348292007079/'
[junit4:junit4]   2> 8171 T2307 oass.SolrDispatchFilter.init SolrDispatchFilter.init()
[junit4:junit4]   2> 8172 T2307 oasc.SolrResourceLoader.locateSolrHome JNDI not configured for solr (NoInitialContextEx)
[junit4:junit4]   2> 8172 T2307 oasc.SolrResourceLoader.locateSolrHome using system property solr.solr.home: /usr/home/hudson/hudson-slave/workspace/Lucene-Solr-Tests-4.x-Java6/solr/build/solr-core/test/J1/./solrtest-jetty3-1348292007079
[junit4:junit4]   2> 8173 T2307 oasc.CoreContainer$Initializer.initialize looking for solr.xml: /usr/home/hudson/hudson-slave/workspace/Lucene-Solr-Tests-4.x-Java6/solr/build/solr-core/test/J1/./solrtest-jetty3-1348292007079/solr.xml
[junit4:junit4]   2> 8173 T2307 oasc.CoreContainer.<init> New CoreContainer 1701004281
[junit4:junit4]   2> 8174 T2307 oasc.CoreContainer.load Loading CoreContainer using Solr Home: '/usr/home/hudson/hudson-slave/workspace/Lucene-Solr-Tests-4.x-Java6/solr/build/solr-core/test/J1/./solrtest-jetty3-1348292007079/'
[junit4:junit4]   2> 8174 T2307 oasc.SolrResourceLoader.<init> new SolrResourceLoader for directory: '/usr/home/hudson/hudson-slave/workspace/Lucene-Solr-Tests-4.x-Java6/solr/build/solr-core/test/J1/./solrtest-jetty3-1348292007079/'
[junit4:junit4]   2> 8198 T2307 oasc.CoreContainer.load Registering Log Listener
[junit4:junit4]   2> 8212 T2307 oasc.CoreContainer.initZooKeeper Zookeeper client=127.0.0.1:29943/solr
[junit4:junit4]   2> 8213 T2307 oaz.ZooKeeper.<init> Initiating client connection, connectString=127.0.0.1:29943/solr sessionTimeout=5000 watcher=org.apache.solr.common.cloud.ConnectionManager@5f55808d
[junit4:junit4]   2> 8214 T2364 oaz.ClientCnxn$SendThread.startConnect Opening socket connection to server /127.0.0.1:29943
[junit4:junit4]   2> 8214 T2307 oascc.ConnectionManager.waitForConnected Waiting for client to connect to ZooKeeper
[junit4:junit4]   2> 8215 T2364 oaz.ClientCnxn$SendThread.primeConnection Socket connection established to localhost/127.0.0.1:29943, initiating session
[junit4:junit4]   2> 8215 T2309 oazs.NIOServerCnxn$Factory.run Accepted socket connection from /140.211.11.196:29960
[junit4:junit4]   2> 8215 T2309 oazs.NIOServerCnxn.readConnectRequest Client attempting to establish new session at /140.211.11.196:29960
[junit4:junit4]   2> 8217 T2311 oazs.NIOServerCnxn.finishSessionInit Established session 0x139ec7736620005 with negotiated timeout 5000 for client /140.211.11.196:29960
[junit4:junit4]   2> 8218 T2364 oaz.ClientCnxn$SendThread.readConnectResult Session establishment complete on server localhost/127.0.0.1:29943, sessionid = 0x139ec7736620005, negotiated timeout = 5000
[junit4:junit4]   2> 8218 T2365 oascc.ConnectionManager.process Watcher org.apache.solr.common.cloud.ConnectionManager@5f55808d name:ZooKeeperConnection Watcher:127.0.0.1:29943/solr got event WatchedEvent state:SyncConnected type:None path:null path:null type:None
[junit4:junit4]   2> 8218 T2328 oascc.ZkStateReader.updateClusterState Updating cloud state from ZooKeeper... 
[junit4:junit4]   2> 8218 T2307 oascc.ConnectionManager.waitForConnected Client is connected to ZooKeeper
[junit4:junit4]   2> 8219 T2312 oazs.PrepRequestProcessor.pRequest Got user-level KeeperException when processing sessionid:0x139ec7736620005 type:create cxid:0x1 zxid:0xfffffffffffffffe txntype:unknown reqpath:n/a Error Path:/solr/overseer Error:KeeperErrorCode = NodeExists for /solr/overseer
[junit4:junit4]   2> 8238 T2312 oazs.PrepRequestProcessor.pRequest Got user-level KeeperException when processing sessionid:0x139ec7736620005 type:create cxid:0x2 zxid:0xfffffffffffffffe txntype:unknown reqpath:n/a Error Path:/solr/overseer Error:KeeperErrorCode = NodeExists for /solr/overseer
[junit4:junit4]   2> 8240 T2307 oasc.ZkController.createEphemeralLiveNode Register node as live in ZooKeeper:/live_nodes/127.0.0.1:29959_solr
[junit4:junit4]   2> 8240 T2312 oazs.PrepRequestProcessor.pRequest Got user-level KeeperException when processing sessionid:0x139ec7736620005 type:delete cxid:0x4 zxid:0xfffffffffffffffe txntype:unknown reqpath:n/a Error Path:/solr/live_nodes/127.0.0.1:29959_solr Error:KeeperErrorCode = NoNode for /solr/live_nodes/127.0.0.1:29959_solr
[junit4:junit4]   2> 8241 T2327 oascc.ZkStateReader$2.process A cluster state change has occurred - updating...
[junit4:junit4]   2> 8241 T2353 oascc.ZkStateReader$2.process A cluster state change has occurred - updating...
[junit4:junit4]   2> 8241 T2341 oascc.ZkStateReader$2.process A cluster state change has occurred - updating...
[junit4:junit4]   2> 8252 T2307 oascc.SolrZkClient.makePath makePath: /live_nodes/127.0.0.1:29959_solr
[junit4:junit4]   2> 8255 T2341 oascc.ZkStateReader$3.process Updating live nodes
[junit4:junit4]   2> 8255 T2353 oascc.ZkStateReader$3.process Updating live nodes
[junit4:junit4]   2> 8255 T2327 oascc.ZkStateReader$3.process Updating live nodes
[junit4:junit4]   2> 8255 T2307 oashc.HttpShardHandlerFactory.getParameter Setting socketTimeout to: 0
[junit4:junit4]   2> 8256 T2307 oashc.HttpShardHandlerFactory.getParameter Setting urlScheme to: http://
[junit4:junit4]   2> 8256 T2307 oashc.HttpShardHandlerFactory.getParameter Setting connTimeout to: 0
[junit4:junit4]   2> 8256 T2307 oashc.HttpShardHandlerFactory.getParameter Setting maxConnectionsPerHost to: 20
[junit4:junit4]   2> 8257 T2307 oashc.HttpShardHandlerFactory.getParameter Setting corePoolSize to: 0
[junit4:junit4]   2> 8257 T2307 oashc.HttpShardHandlerFactory.getParameter Setting maximumPoolSize to: 2147483647
[junit4:junit4]   2> 8257 T2307 oashc.HttpShardHandlerFactory.getParameter Setting maxThreadIdleTime to: 5
[junit4:junit4]   2> 8257 T2307 oashc.HttpShardHandlerFactory.getParameter Setting sizeOfQueue to: -1
[junit4:junit4]   2> 8258 T2307 oashc.HttpShardHandlerFactory.getParameter Setting fairnessPolicy to: false
[junit4:junit4]   2> 8258 T2307 oascsi.HttpClientUtil.createClient Creating new http client, config:maxConnectionsPerHost=20&maxConnections=10000&socketTimeout=0&connTimeout=0&retry=false
[junit4:junit4]   2> 8269 T2307 oascc.ZkStateReader.createClusterStateWatchersAndUpdate Updating cluster state from ZooKeeper... 
[junit4:junit4]   2> 8274 T2307 oasc.CoreContainer.create Creating SolrCore 'collection1' using instanceDir: /usr/home/hudson/hudson-slave/workspace/Lucene-Solr-Tests-4.x-Java6/solr/build/solr-core/test/J1/./solrtest-jetty3-1348292007079/collection1
[junit4:junit4]   2> 8274 T2307 oasc.ZkController.createCollectionZkNode Check for collection zkNode:collection1
[junit4:junit4]   2> 8275 T2307 oasc.ZkController.createCollectionZkNode Collection zkNode exists
[junit4:junit4]   2> 8275 T2307 oasc.ZkController.readConfigName Load collection config from:/collections/collection1
[junit4:junit4]   2> 8276 T2307 oasc.SolrResourceLoader.<init> new SolrResourceLoader for directory: '/usr/home/hudson/hudson-slave/workspace/Lucene-Solr-Tests-4.x-Java6/solr/build/solr-core/test/J1/./solrtest-jetty3-1348292007079/collection1/'
[junit4:junit4]   2> 8277 T2307 oasc.SolrResourceLoader.replaceClassLoader Adding 'file:/usr/home/hudson/hudson-slave/workspace/Lucene-Solr-Tests-4.x-Java6/solr/build/solr-core/test/J1/solrtest-jetty3-1348292007079/collection1/lib/classes/' to classloader
[junit4:junit4]   2> 8277 T2307 oasc.SolrResourceLoader.replaceClassLoader Adding 'file:/usr/home/hudson/hudson-slave/workspace/Lucene-Solr-Tests-4.x-Java6/solr/build/solr-core/test/J1/solrtest-jetty3-1348292007079/collection1/lib/README' to classloader
[junit4:junit4]   2> 8312 T2307 oasc.SolrConfig.<init> Using Lucene MatchVersion: LUCENE_40
[junit4:junit4]   2> 8360 T2307 oasc.SolrConfig.<init> Loaded SolrConfig: solrconfig.xml
[junit4:junit4]   2> 8461 T2307 oass.IndexSchema.readSchema Reading Solr Schema
[junit4:junit4]   2> 8467 T2307 oass.IndexSchema.readSchema Schema name=test
[junit4:junit4]   2> 8910 T2307 oass.OpenExchangeRatesOrgProvider.init Initialized with rates=open-exchange-rates.json, refreshInterval=1440.
[junit4:junit4]   2> 8921 T2307 oass.IndexSchema.readSchema default search field in schema is text
[junit4:junit4]   2> 8924 T2307 oass.IndexSchema.readSchema unique key field: id
[junit4:junit4]   2> 8933 T2307 oass.FileExchangeRateProvider.reload Reloading exchange rates from file currency.xml
[junit4:junit4]   2> 8937 T2307 oass.FileExchangeRateProvider.reload Reloading exchange rates from file currency.xml
[junit4:junit4]   2> 8940 T2307 oass.OpenExchangeRatesOrgProvider.reload Reloading exchange rates from open-exchange-rates.json
[junit4:junit4]   2> 8940 T2307 oass.OpenExchangeRatesOrgProvider.reload Reloading exchange rates from open-exchange-rates.json
[junit4:junit4]   2> 8941 T2307 oasc.SolrCore.<init> [collection1] Opening new SolrCore at /usr/home/hudson/hudson-slave/workspace/Lucene-Solr-Tests-4.x-Java6/solr/build/solr-core/test/J1/./solrtest-jetty3-1348292007079/collection1/, dataDir=./org.apache.solr.cloud.BasicDistributedZk2Test-1348291999324/jetty3/
[junit4:junit4]   2> 8942 T2307 oasc.JmxMonitoredMap.<init> JMX monitoring is enabled. Adding Solr mbeans to JMX Server: com.sun.jmx.mbeanserver.JmxMBeanServer@25a41cc7
[junit4:junit4]   2> 8943 T2307 oasc.SolrCore.getNewIndexDir WARNING New index directory detected: old=null new=./org.apache.solr.cloud.BasicDistributedZk2Test-1348291999324/jetty3/index/
[junit4:junit4]   2> 8943 T2307 oasc.SolrCore.initIndex WARNING [collection1] Solr index directory './org.apache.solr.cloud.BasicDistributedZk2Test-1348291999324/jetty3/index' doesn't exist. Creating new index...
[junit4:junit4]   2> 8944 T2307 oasc.CachingDirectoryFactory.get return new directory for /usr/home/hudson/hudson-slave/workspace/Lucene-Solr-Tests-4.x-Java6/solr/build/solr-core/test/J1/./org.apache.solr.cloud.BasicDistributedZk2Test-1348291999324/jetty3/index forceNew:false
[junit4:junit4]   2> 8975 T2307 oasc.SolrDeletionPolicy.onCommit SolrDeletionPolicy.onCommit: commits:num=1
[junit4:junit4]   2> 		commit{dir=NRTCachingDirectory(org.apache.lucene.store.NIOFSDirectory@/usr/home/hudson/hudson-slave/workspace/Lucene-Solr-Tests-4.x-Java6/solr/build/solr-core/test/J1/org.apache.solr.cloud.BasicDistributedZk2Test-1348291999324/jetty3/index lockFactory=org.apache.lucene.store.NativeFSLockFactory@3e5386fe; maxCacheMB=48.0 maxMergeSizeMB=4.0),segFN=segments_1,generation=1,filenames=[segments_1]
[junit4:junit4]   2> 8975 T2307 oasc.SolrDeletionPolicy.updateCommits newest commit = 1
[junit4:junit4]   2> 8976 T2307 oasc.SolrCore.initWriters created xml: solr.XMLResponseWriter
[junit4:junit4]   2> 8978 T2307 oasup.UpdateRequestProcessorChain.init inserting DistributedUpdateProcessorFactory into updateRequestProcessorChain "dedupe"
[junit4:junit4]   2> 8978 T2307 oasup.UpdateRequestProcessorChain.init inserting DistributedUpdateProcessorFactory into updateRequestProcessorChain "dedupe-allfields"
[junit4:junit4]   2> 8978 T2307 oasup.UpdateRequestProcessorChain.init inserting DistributedUpdateProcessorFactory into updateRequestProcessorChain "stored_sig"
[junit4:junit4]   2> 8979 T2307 oasup.UpdateRequestProcessorChain.init inserting DistributedUpdateProcessorFactory into updateRequestProcessorChain "uniq-fields"
[junit4:junit4]   2> 8979 T2307 oasup.UpdateRequestProcessorChain.init inserting DistributedUpdateProcessorFactory into updateRequestProcessorChain "distrib-dup-test-chain-implicit"
[junit4:junit4]   2> 8980 T2307 oasc.RequestHandlers.initHandlersFromConfig adding lazy requestHandler: solr.ReplicationHandler
[junit4:junit4]   2> 8980 T2307 oasc.RequestHandlers.initHandlersFromConfig created /replication: solr.ReplicationHandler
[junit4:junit4]   2> 8981 T2307 oasc.RequestHandlers.initHandlersFromConfig created standard: solr.StandardRequestHandler
[junit4:junit4]   2> 8981 T2307 oasc.RequestHandlers.initHandlersFromConfig created /get: solr.RealTimeGetHandler
[junit4:junit4]   2> 8982 T2307 oasc.RequestHandlers.initHandlersFromConfig created dismax: solr.SearchHandler
[junit4:junit4]   2> 8982 T2307 oasc.RequestHandlers.initHandlersFromConfig created mock: org.apache.solr.core.MockQuerySenderListenerReqHandler
[junit4:junit4]   2> 8983 T2307 oasc.RequestHandlers.initHandlersFromConfig created /admin/: org.apache.solr.handler.admin.AdminHandlers
[junit4:junit4]   2> 8983 T2307 oasc.RequestHandlers.initHandlersFromConfig created defaults: solr.StandardRequestHandler
[junit4:junit4]   2> 8984 T2307 oasc.RequestHandlers.initHandlersFromConfig adding lazy requestHandler: solr.StandardRequestHandler
[junit4:junit4]   2> 8984 T2307 oasc.RequestHandlers.initHandlersFromConfig created lazy: solr.StandardRequestHandler
[junit4:junit4]   2> 8985 T2307 oasc.RequestHandlers.initHandlersFromConfig created /update: solr.UpdateRequestHandler
[junit4:junit4]   2> 8985 T2307 oasc.RequestHandlers.initHandlersFromConfig created /terms: org.apache.solr.handler.component.SearchHandler
[junit4:junit4]   2> 8986 T2307 oasc.RequestHandlers.initHandlersFromConfig created spellCheckCompRH: org.apache.solr.handler.component.SearchHandler
[junit4:junit4]   2> 8987 T2307 oasc.RequestHandlers.initHandlersFromConfig created spellCheckCompRH_Direct: org.apache.solr.handler.component.SearchHandler
[junit4:junit4]   2> 8987 T2307 oasc.RequestHandlers.initHandlersFromConfig created spellCheckWithWordbreak: org.apache.solr.handler.component.SearchHandler
[junit4:junit4]   2> 8988 T2307 oasc.RequestHandlers.initHandlersFromConfig created spellCheckWithWordbreak_Direct: org.apache.solr.handler.component.SearchHandler
[junit4:junit4]   2> 8989 T2307 oasc.RequestHandlers.initHandlersFromConfig created spellCheckCompRH1: org.apache.solr.handler.component.SearchHandler
[junit4:junit4]   2> 8989 T2307 oasc.RequestHandlers.initHandlersFromConfig created tvrh: org.apache.solr.handler.component.SearchHandler
[junit4:junit4]   2> 8990 T2307 oasc.RequestHandlers.initHandlersFromConfig created /mlt: solr.MoreLikeThisHandler
[junit4:junit4]   2> 8991 T2307 oasc.RequestHandlers.initHandlersFromConfig created /debug/dump: solr.DumpRequestHandler
[junit4:junit4]   2> 8993 T2307 oashl.XMLLoader.init xsltCacheLifetimeSeconds=60
[junit4:junit4]   2> 8997 T2307 oasc.SolrCore.initDeprecatedSupport WARNING solrconfig.xml uses deprecated <admin/gettableFiles>, Please update your config to use the ShowFileRequestHandler.
[junit4:junit4]   2> 8998 T2307 oasc.SolrCore.initDeprecatedSupport WARNING adding ShowFileRequestHandler with hidden files: [SCHEMA.XML, OLD_SYNONYMS.TXT, STOPWORDS.TXT, PROTWORDS.TXT, OPEN-EXCHANGE-RATES.JSON, SYNONYMS.TXT, CURRENCY.XML, MAPPING-ISOLATIN1ACCENT.TXT]
[junit4:junit4]   2> 9000 T2307 oass.SolrIndexSearcher.<init> Opening Searcher@5bb27d1 main
[junit4:junit4]   2> 9001 T2307 oasu.CommitTracker.<init> Hard AutoCommit: disabled
[junit4:junit4]   2> 9002 T2307 oasu.CommitTracker.<init> Soft AutoCommit: disabled
[junit4:junit4]   2> 9002 T2307 oashc.SpellCheckComponent.inform Initializing spell checkers
[junit4:junit4]   2> 9008 T2307 oass.DirectSolrSpellChecker.init init: {name=direct,classname=DirectSolrSpellChecker,field=lowerfilt,minQueryLength=3}
[junit4:junit4]   2> 9058 T2366 oasc.SolrCore.registerSearcher [collection1] Registered new searcher Searcher@5bb27d1 main{StandardDirectoryReader(segments_1:1)}
[junit4:junit4]   2> 9258 T2328 oascc.ZkStateReader.updateClusterState Updating cloud state from ZooKeeper... 
[junit4:junit4]   2> 9271 T2327 oascc.ZkStateReader$2.process A cluster state change has occurred - updating...
[junit4:junit4]   2> 9271 T2365 oascc.ZkStateReader$2.process A cluster state change has occurred - updating...
[junit4:junit4]   2> 9271 T2353 oascc.ZkStateReader$2.process A cluster state change has occurred - updating...
[junit4:junit4]   2> 9271 T2341 oascc.ZkStateReader$2.process A cluster state change has occurred - updating...
[junit4:junit4]   2> 9565 T2307 oasc.CoreContainer.register registering core: collection1
[junit4:junit4]   2> 9565 T2307 oasc.ZkController.register Register shard - core:collection1 address:http://127.0.0.1:29959/solr shardId:shard1
[junit4:junit4]   2> 9568 T2307 oasc.ZkController.register We are http://127.0.0.1:29959/solr/collection1/ and leader is http://127.0.0.1:29949/solr/collection1/
[junit4:junit4]   2> 9568 T2307 oasc.ZkController.register No LogReplay needed for core=collection1 baseURL=http://127.0.0.1:29959/solr
[junit4:junit4]   2> 9569 T2307 oasc.ZkController.checkRecovery Core needs to recover:collection1
[junit4:junit4]   2> 9569 T2307 oasu.DefaultSolrCoreState.doRecovery Running recovery - first canceling any ongoing recovery
[junit4:junit4]   2> ASYNC  NEW_CORE C131 name=collection1 org.apache.solr.core.SolrCore@7c68abbf url=http://127.0.0.1:29959/solr/collection1 node=127.0.0.1:29959_solr
[junit4:junit4]   2> 9570 T2367 C131 P29959 oasc.RecoveryStrategy.run Starting recovery process.  core=collection1 recoveringAfterStartup=true
[junit4:junit4]   2> 9570 T2307 oascc.ZkStateReader.updateClusterState Updating cloud state from ZooKeeper... 
[junit4:junit4]   2> 9572 T2367 C131 P29959 oasc.RecoveryStrategy.doRecovery ###### startupVersions=[]
[junit4:junit4]   2> 9573 T2307 oass.SolrDispatchFilter.init user.dir=/usr/home/hudson/hudson-slave/workspace/Lucene-Solr-Tests-4.x-Java6/solr/build/solr-core/test/J1
[junit4:junit4]   2> 9574 T2307 oass.SolrDispatchFilter.init SolrDispatchFilter.init() done
[junit4:junit4]   2> 9574 T2367 C131 P29959 oasc.RecoveryStrategy.doRecovery Attempting to PeerSync from http://127.0.0.1:29949/solr/collection1/ core=collection1 - recoveringAfterStartup=true
[junit4:junit4]   2> 9574 T2367 C131 P29959 oasu.PeerSync.sync PeerSync: core=collection1 url=http://127.0.0.1:29959/solr START replicas=[http://127.0.0.1:29949/solr/collection1/] nUpdates=100
[junit4:junit4]   2> 9574 T2307 oascsi.HttpClientUtil.createClient Creating new http client, config:maxConnections=128&maxConnectionsPerHost=32&followRedirects=false
[junit4:junit4]   2> 9574 T2367 C131 P29959 oasu.PeerSync.sync WARNING no frame of reference to tell of we've missed updates
[junit4:junit4]   2> 9574 T2367 C131 P29959 oasc.RecoveryStrategy.doRecovery PeerSync Recovery was not successful - trying replication. core=collection1
[junit4:junit4]   2> 9575 T2367 C131 P29959 oasc.RecoveryStrategy.doRecovery Starting Replication Recovery. core=collection1
[junit4:junit4]   2> 9575 T2367 C131 P29959 oascsi.HttpClientUtil.createClient Creating new http client, config:maxConnections=128&maxConnectionsPerHost=32&followRedirects=false
[junit4:junit4]   2> ASYNC  NEW_CORE C132 name=collection1 org.apache.solr.core.SolrCore@3199f020 url=http://127.0.0.1:29949/solr/collection1 node=127.0.0.1:29949_solr
[junit4:junit4]   2> 9586 T2333 C132 P29949 REQ /get {distrib=false&qt=/get&wt=javabin&version=2&getVersions=100} status=0 QTime=1 
[junit4:junit4]   2> 9774 T2328 oascc.ZkStateReader.updateClusterState Updating cloud state from ZooKeeper... 
[junit4:junit4]   2> 9799 T2353 oascc.ZkStateReader$2.process A cluster state change has occurred - updating...
[junit4:junit4]   2> 9799 T2365 oascc.ZkStateReader$2.process A cluster state change has occurred - updating...
[junit4:junit4]   2> 9799 T2341 oascc.ZkStateReader$2.process A cluster state change has occurred - updating...
[junit4:junit4]   2> 9799 T2327 oascc.ZkStateReader$2.process A cluster state change has occurred - updating...
[junit4:junit4]   2> 9860 T2307 oejs.Server.doStart jetty-8.1.2.v20120308
[junit4:junit4]   2> 9863 T2307 oejs.AbstractConnector.doStart Started SocketConnector@0.0.0.0:29963
[junit4:junit4]   2> 9863 T2307 oasc.SolrResourceLoader.locateSolrHome JNDI not configured for solr (NoInitialContextEx)
[junit4:junit4]   2> 9863 T2307 oasc.SolrResourceLoader.locateSolrHome using system property solr.solr.home: /usr/home/hudson/hudson-slave/workspace/Lucene-Solr-Tests-4.x-Java6/solr/build/solr-core/test/J1/./solrtest-jetty4-1348292008905
[junit4:junit4]   2> 9864 T2307 oasc.SolrResourceLoader.<init> new SolrResourceLoader for deduced Solr Home: '/usr/home/hudson/hudson-slave/workspace/Lucene-Solr-Tests-4.x-Java6/solr/build/solr-core/test/J1/./solrtest-jetty4-1348292008905/'
[junit4:junit4]   2> 9887 T2307 oass.SolrDispatchFilter.init SolrDispatchFilter.init()
[junit4:junit4]   2> 9888 T2307 oasc.SolrResourceLoader.locateSolrHome JNDI not configured for solr (NoInitialContextEx)
[junit4:junit4]   2> 9888 T2307 oasc.SolrResourceLoader.locateSolrHome using system property solr.solr.home: /usr/home/hudson/hudson-slave/workspace/Lucene-Solr-Tests-4.x-Java6/solr/build/solr-core/test/J1/./solrtest-jetty4-1348292008905
[junit4:junit4]   2> 9888 T2307 oasc.CoreContainer$Initializer.initialize looking for solr.xml: /usr/home/hudson/hudson-slave/workspace/Lucene-Solr-Tests-4.x-Java6/solr/build/solr-core/test/J1/./solrtest-jetty4-1348292008905/solr.xml
[junit4:junit4]   2> 9888 T2307 oasc.CoreContainer.<init> New CoreContainer 1003810483
[junit4:junit4]   2> 9889 T2307 oasc.CoreContainer.load Loading CoreContainer using Solr Home: '/usr/home/hudson/hudson-slave/workspace/Lucene-Solr-Tests-4.x-Java6/solr/build/solr-core/test/J1/./solrtest-jetty4-1348292008905/'
[junit4:junit4]   2> 9889 T2307 oasc.SolrResourceLoader.<init> new SolrResourceLoader for directory: '/usr/home/hudson/hudson-slave/workspace/Lucene-Solr-Tests-4.x-Java6/solr/build/solr-core/test/J1/./solrtest-jetty4-1348292008905/'
[junit4:junit4]   2> 9907 T2307 oasc.CoreContainer.load Registering Log Listener
[junit4:junit4]   2> 9917 T2307 oasc.CoreContainer.initZooKeeper Zookeeper client=127.0.0.1:29943/solr
[junit4:junit4]   2> 9918 T2307 oaz.ZooKeeper.<init> Initiating client connection, connectString=127.0.0.1:29943/solr sessionTimeout=5000 watcher=org.apache.solr.common.cloud.ConnectionManager@530a05e5
[junit4:junit4]   2> 9919 T2378 oaz.ClientCnxn$SendThread.startConnect Opening socket connection to server /127.0.0.1:29943
[junit4:junit4]   2> 9919 T2307 oascc.ConnectionManager.waitForConnected Waiting for client to connect to ZooKeeper
[junit4:junit4]   2> 9920 T2378 oaz.ClientCnxn$SendThread.primeConnection Socket connection established to localhost/127.0.0.1:29943, initiating session
[junit4:junit4]   2> 9920 T2309 oazs.NIOServerCnxn$Factory.run Accepted socket connection from /140.211.11.196:29964
[junit4:junit4]   2> 9920 T2309 oazs.NIOServerCnxn.readConnectRequest Client attempting to establish new session at /140.211.11.196:29964
[junit4:junit4]   2> 9921 T2311 oazs.NIOServerCnxn.finishSessionInit Established session 0x139ec7736620006 with negotiated timeout 5000 for client /140.211.11.196:29964
[junit4:junit4]   2> 9921 T2378 oaz.ClientCnxn$SendThread.readConnectResult Session establishment complete on server localhost/127.0.0.1:29943, sessionid = 0x139ec7736620006, negotiated timeout = 5000
[junit4:junit4]   2> 9922 T2379 oascc.ConnectionManager.process Watcher org.apache.solr.common.cloud.ConnectionManager@530a05e5 name:ZooKeeperConnection Watcher:127.0.0.1:29943/solr got event WatchedEvent state:SyncConnected type:None path:null path:null type:None
[junit4:junit4]   2> 9922 T2307 oascc.ConnectionManager.waitForConnected Client is connected to ZooKeeper
[junit4:junit4]   2> 9922 T2312 oazs.PrepRequestProcessor.pRequest Got user-level KeeperException when processing sessionid:0x139ec7736620006 type:create cxid:0x1 zxid:0xfffffffffffffffe txntype:unknown reqpath:n/a Error Path:/solr/overseer Error:KeeperErrorCode = NodeExists for /solr/overseer
[junit4:junit4]   2> 9923 T2312 oazs.PrepRequestProcessor.pRequest Got user-level KeeperException when processing sessionid:0x139ec7736620006 type:create cxid:0x2 zxid:0xfffffffffffffffe txntype:unknown reqpath:n/a Error Path:/solr/overseer Error:KeeperErrorCode = NodeExists for /solr/overseer
[junit4:junit4]   2> 9925 T2307 oasc.ZkController.createEphemeralLiveNode Register node as live in ZooKeeper:/live_nodes/127.0.0.1:29963_solr
[junit4:junit4]   2> 9925 T2312 oazs.PrepRequestProcessor.pRequest Got user-level KeeperException when processing sessionid:0x139ec7736620006 type:delete cxid:0x4 zxid:0xfffffffffffffffe txntype:unknown reqpath:n/a Error Path:/solr/live_nodes/127.0.0.1:29963_solr Error:KeeperErrorCode = NoNode for /solr/live_nodes/127.0.0.1:29963_solr
[junit4:junit4]   2> 9934 T2307 oascc.SolrZkClient.makePath makePath: /live_nodes/127.0.0.1:29963_solr
[junit4:junit4]   2> 9936 T2341 oascc.ZkStateReader$3.process Updating live nodes
[junit4:junit4]   2> 9936 T2365 oascc.ZkStateReader$3.process Updating live nodes
[junit4:junit4]   2> 9936 T2327 oascc.ZkStateReader$3.process Updating live nodes
[junit4:junit4]   2> 9936 T2353 oascc.ZkStateReader$3.process Updating live nodes
[junit4:junit4]   2> 9937 T2307 oashc.HttpShardHandlerFactory.getParameter Setting socketTimeout to: 0
[junit4:junit4]   2> 9937 T2307 oashc.HttpShardHandlerFactory.getParameter Setting urlScheme to: http://
[junit4:junit4]   2> 9937 T2307 oashc.HttpShardHandlerFactory.getParameter Setting connTimeout to: 0
[junit4:junit4]   2> 9938 T2307 oashc.HttpShardHandlerFactory.getParameter Setting maxConnectionsPerHost to: 20
[junit4:junit4]   2> 9938 T2307 oashc.HttpShardHandlerFactory.getParameter Setting corePoolSize to: 0
[junit4:junit4]   2> 9938 T2307 oashc.HttpShardHandlerFactory.getParameter Setting maximumPoolSize to: 2147483647
[junit4:junit4]   2> 9938 T2307 oashc.HttpShardHandlerFactory.getParameter Setting maxThreadIdleTime to: 5
[junit4:junit4]   2> 9939 T2307 oashc.HttpShardHandlerFactory.getParameter Setting sizeOfQueue to: -1
[junit4:junit4]   2> 9939 T2307 oashc.HttpShardHandlerFactory.getParameter Setting fairnessPolicy to: false
[junit4:junit4]   2> 9939 T2307 oascsi.HttpClientUtil.createClient Creating new http client, config:maxConnectionsPerHost=20&maxConnections=10000&socketTimeout=0&connTimeout=0&retry=false
[junit4:junit4]   2> 9951 T2307 oascc.ZkStateReader.createClusterStateWatchersAndUpdate Updating cluster state from ZooKeeper... 
[junit4:junit4]   2> 9955 T2307 oasc.CoreContainer.create Creating SolrCore 'collection1' using instanceDir: /usr/home/hudson/hudson-slave/workspace/Lucene-Solr-Tests-4.x-Java6/solr/build/solr-core/test/J1/./solrtest-jetty4-1348292008905/collection1
[junit4:junit4]   2> 9956 T2307 oasc.ZkController.createCollectionZkNode Check for collection zkNode:collection1
[junit4:junit4]   2> 9956 T2307 oasc.ZkController.createCollectionZkNode Collection zkNode exists
[junit4:junit4]   2> 9957 T2307 oasc.ZkController.readConfigName Load collection config from:/collections/collection1
[junit4:junit4]   2> 9958 T2307 oasc.SolrResourceLoader.<init> new SolrResourceLoader for directory: '/usr/home/hudson/hudson-slave/workspace/Lucene-Solr-Tests-4.x-Java6/solr/build/solr-core/test/J1/./solrtest-jetty4-1348292008905/collection1/'
[junit4:junit4]   2> 9959 T2307 oasc.SolrResourceLoader.replaceClassLoader Adding 'file:/usr/home/hudson/hudson-slave/workspace/Lucene-Solr-Tests-4.x-Java6/solr/build/solr-core/test/J1/solrtest-jetty4-1348292008905/collection1/lib/README' to classloader
[junit4:junit4]   2> 9959 T2307 oasc.SolrResourceLoader.replaceClassLoader Adding 'file:/usr/home/hudson/hudson-slave/workspace/Lucene-Solr-Tests-4.x-Java6/solr/build/solr-core/test/J1/solrtest-jetty4-1348292008905/collection1/lib/classes/' to classloader
[junit4:junit4]   2> 9994 T2307 oasc.SolrConfig.<init> Using Lucene MatchVersion: LUCENE_40
[junit4:junit4]   2> 10043 T2307 oasc.SolrConfig.<init> Loaded SolrConfig: solrconfig.xml
[junit4:junit4]   2> 10144 T2307 oass.IndexSchema.readSchema Reading Solr Schema
[junit4:junit4]   2> 10150 T2307 oass.IndexSchema.readSchema Schema name=test
[junit4:junit4]   2> 10584 T2307 oass.OpenExchangeRatesOrgProvider.init Initialized with rates=open-exchange-rates.json, refreshInterval=1440.
[junit4:junit4]   2> 10592 T2307 oass.IndexSchema.readSchema default search field in schema is text
[junit4:junit4]   2> 10595 T2307 oass.IndexSchema.readSchema unique key field: id
[junit4:junit4]   2> 10603 T2307 oass.FileExchangeRateProvider.reload Reloading exchange rates from file currency.xml
[junit4:junit4]   2> 10607 T2307 oass.FileExchangeRateProvider.reload Reloading exchange rates from file currency.xml
[junit4:junit4]   2> 10610 T2307 oass.OpenExchangeRatesOrgProvider.reload Reloading exchange rates from open-exchange-rates.json
[junit4:junit4]   2> 10611 T2307 oass.OpenExchangeRatesOrgProvider.reload Reloading exchange rates from open-exchange-rates.json
[junit4:junit4]   2> 10612 T2307 oasc.SolrCore.<init> [collection1] Opening new SolrCore at /usr/home/hudson/hudson-slave/workspace/Lucene-Solr-Tests-4.x-Java6/solr/build/solr-core/test/J1/./solrtest-jetty4-1348292008905/collection1/, dataDir=./org.apache.solr.cloud.BasicDistributedZk2Test-1348291999324/jetty4/
[junit4:junit4]   2> 10612 T2307 oasc.JmxMonitoredMap.<init> JMX monitoring is enabled. Adding Solr mbeans to JMX Server: com.sun.jmx.mbeanserver.JmxMBeanServer@25a41cc7
[junit4:junit4]   2> 10613 T2307 oasc.SolrCore.getNewIndexDir WARNING New index directory detected: old=null new=./org.apache.solr.cloud.BasicDistributedZk2Test-1348291999324/jetty4/index/
[junit4:junit4]   2> 10614 T2307 oasc.SolrCore.initIndex WARNING [collection1] Solr index directory './org.apache.solr.cloud.BasicDistributedZk2Test-1348291999324/jetty4/index' doesn't exist. Creating new index...
[junit4:junit4]   2> 10615 T2307 oasc.CachingDirectoryFactory.get return new directory for /usr/home/hudson/hudson-slave/workspace/Lucene-Solr-Tests-4.x-Java6/solr/build/solr-core/test/J1/./org.apache.solr.cloud.BasicDistributedZk2Test-1348291999324/jetty4/index forceNew:false
[junit4:junit4]   2> 10636 T2307 oasc.SolrDeletionPolicy.onCommit SolrDeletionPolicy.onCommit: commits:num=1
[junit4:junit4]   2> 		commit{dir=NRTCachingDirectory(org.apache.lucene.store.NIOFSDirectory@/usr/home/hudson/hudson-slave/workspace/Lucene-Solr-Tests-4.x-Java6/solr/build/solr-core/test/J1/org.apache.solr.cloud.BasicDistributedZk2Test-1348291999324/jetty4/index lockFactory=org.apache.lucene.store.NativeFSLockFactory@3a6d9ce9; maxCacheMB=48.0 maxMergeSizeMB=4.0),segFN=segments_1,generation=1,filenames=[segments_1]
[junit4:junit4]   2> 10637 T2307 oasc.SolrDeletionPolicy.updateCommits newest commit = 1
[junit4:junit4]   2> 10637 T2307 oasc.SolrCore.initWriters created xml: solr.XMLResponseWriter
[junit4:junit4]   2> 10639 T2307 oasup.UpdateRequestProcessorChain.init inserting DistributedUpdateProcessorFactory into updateRequestProcessorChain "dedupe"
[junit4:junit4]   2> 10639 T2307 oasup.UpdateRequestProcessorChain.init inserting DistributedUpdateProcessorFactory into updateRequestProcessorChain "dedupe-allfields"
[junit4:junit4]   2> 10640 T2307 oasup.UpdateRequestProcessorChain.init inserting DistributedUpdateProcessorFactory into updateRequestProcessorChain "stored_sig"
[junit4:junit4]   2> 10640 T2307 oasup.UpdateRequestProcessorChain.init inserting DistributedUpdateProcessorFactory into updateRequestProcessorChain "uniq-fields"
[junit4:junit4]   2> 10641 T2307 oasup.UpdateRequestProcessorChain.init inserting DistributedUpdateProcessorFactory into updateRequestProcessorChain "distrib-dup-test-chain-implicit"
[junit4:junit4]   2> 10641 T2307 oasc.RequestHandlers.initHandlersFromConfig adding lazy requestHandler: solr.ReplicationHandler
[junit4:junit4]   2> 10641 T2307 oasc.RequestHandlers.initHandlersFromConfig created /replication: solr.ReplicationHandler
[junit4:junit4]   2> 10642 T2307 oasc.RequestHandlers.initHandlersFromConfig created standard: solr.StandardRequestHandler
[junit4:junit4]   2> 10642 T2307 oasc.RequestHandlers.initHandlersFromConfig created /get: solr.RealTimeGetHandler
[junit4:junit4]   2> 10643 T2307 oasc.RequestHandlers.initHandlersFromConfig created dismax: solr.SearchHandler
[junit4:junit4]   2> 10643 T2307 oasc.RequestHandlers.initHandlersFromConfig created mock: org.apache.solr.core.MockQuerySenderListenerReqHandler
[junit4:junit4]   2> 10644 T2307 oasc.RequestHandlers.initHandlersFromConfig created /admin/: org.apache.solr.handler.admin.AdminHandlers
[junit4:junit4]   2> 10644 T2307 oasc.RequestHandlers.initHandlersFromConfig created defaults: solr.StandardRequestHandler
[junit4:junit4]   2> 10645 T2307 oasc.RequestHandlers.initHandlersFromConfig adding lazy requestHandler: solr.StandardRequestHandler
[junit4:junit4]   2> 10645 T2307 oasc.RequestHandlers.initHandlersFromConfig created lazy: solr.StandardRequestHandler
[junit4:junit4]   2> 10646 T2307 oasc.RequestHandlers.initHandlersFromConfig created /update: solr.UpdateRequestHandler
[junit4:junit4]   2> 10646 T2307 oasc.RequestHandlers.initHandlersFromConfig created /terms: org.apache.solr.handler.component.SearchHandler
[junit4:junit4]   2> 10647 T2307 oasc.RequestHandlers.initHandlersFromConfig created spellCheckCompRH: org.apache.solr.handler.component.SearchHandler
[junit4:junit4]   2> 10647 T2307 oasc.RequestHandlers.initHandlersFromConfig created spellCheckCompRH_Direct: org.apache.solr.handler.component.SearchHandler
[junit4:junit4]   2> 10647 T2307 oasc.RequestHandlers.initHandlersFromConfig created spellCheckWithWordbreak: org.apache.solr.handler.component.SearchHandler
[junit4:junit4]   2> 10648 T2307 oasc.RequestHandlers.initHandlersFromConfig created spellCheckWithWordbreak_Direct: org.apache.solr.handler.component.SearchHandler
[junit4:junit4]   2> 10648 T2307 oasc.RequestHandlers.initHandlersFromConfig created spellCheckCompRH1: org.apache.solr.handler.component.SearchHandler
[junit4:junit4]   2> 10649 T2307 oasc.RequestHandlers.initHandlersFromConfig created tvrh: org.apache.solr.handler.component.SearchHandler
[junit4:junit4]   2> 10649 T2307 oasc.RequestHandlers.initHandlersFromConfig created /mlt: solr.MoreLikeThisHandler
[junit4:junit4]   2> 10650 T2307 oasc.RequestHandlers.initHandlersFromConfig created /debug/dump: solr.DumpRequestHandler
[junit4:junit4]   2> 10652 T2307 oashl.XMLLoader.init xsltCacheLifetimeSeconds=60
[junit4:junit4]   2> 10656 T2307 oasc.SolrCore.initDeprecatedSupport WARNING solrconfig.xml uses deprecated <admin/gettableFiles>, Please update your config to use the ShowFileRequestHandler.
[junit4:junit4]   2> 10656 T2307 oasc.SolrCore.initDeprecatedSupport WARNING adding ShowFileRequestHandler with hidden files: [SCHEMA.XML, OLD_SYNONYMS.TXT, STOPWORDS.TXT, PROTWORDS.TXT, OPEN-EXCHANGE-RATES.JSON, SYNONYMS.TXT, CURRENCY.XML, MAPPING-ISOLATIN1ACCENT.TXT]
[junit4:junit4]   2> 10659 T2307 oass.SolrIndexSearcher.<init> Opening Searcher@638baf70 main
[junit4:junit4]   2> 10660 T2307 oasu.CommitTracker.<init> Hard AutoCommit: disabled
[junit4:junit4]   2> 10661 T2307 oasu.CommitTracker.<init> Soft AutoCommit: disabled
[junit4:junit4]   2> 10661 T2307 oashc.SpellCheckComponent.inform Initializing spell checkers
[junit4:junit4]   2> 10667 T2307 oass.DirectSolrSpellChecker.init init: {name=direct,classname=DirectSolrSpellChecker,field=lowerfilt,minQueryLength=3}
[junit4:junit4]   2> 10708 T2380 oasc.SolrCore.registerSearcher [collection1] Registered new searcher Searcher@638baf70 main{StandardDirectoryReader(segments_1:1)}
[junit4:junit4]   2> 10805 T2328 oascc.ZkStateReader.updateClusterState Updating cloud state from ZooKeeper... 
[junit4:junit4]   2> 10817 T2341 oascc.ZkStateReader$2.process A cluster state change has occurred - updating...
[junit4:junit4]   2> 10817 T2365 oascc.ZkStateReader$2.process A cluster state change has occurred - updating...
[junit4:junit4]   2> 10817 T2327 oascc.ZkStateReader$2.process A cluster state change has occurred - updating...
[junit4:junit4]   2> 10817 T2353 oascc.ZkStateReader$2.process A cluster state change has occurred - updating...
[junit4:junit4]   2> 10817 T2379 oascc.ZkStateReader$2.process A cluster state change has occurred - updating...
[junit4:junit4]   2> 11214 T2307 oasc.CoreContainer.register registering core: collection1
[junit4:junit4]   2> 11214 T2307 oasc.ZkController.register Register shard - core:collection1 address:http://127.0.0.1:29963/solr shardId:shard2
[junit4:junit4]   2> 11251 T2307 oasc.ZkController.register We are http://127.0.0.1:29963/solr/collection1/ and leader is http://127.0.0.1:29953/solr/collection1/
[junit4:junit4]   2> 11252 T2307 oasc.ZkController.register No LogReplay needed for core=collection1 baseURL=http://127.0.0.1:29963/solr
[junit4:junit4]   2> 11252 T2307 oasc.ZkController.checkRecovery Core needs to recover:collection1
[junit4:junit4]   2> 11252 T2307 oasu.DefaultSolrCoreState.doRecovery Running recovery - first canceling any ongoing recovery
[junit4:junit4]   2> ASYNC  NEW_CORE C133 name=collection1 org.apache.solr.core.SolrCore@1a798ece url=http://127.0.0.1:29963/solr/collection1 node=127.0.0.1:29963_solr
[junit4:junit4]   2> 11254 T2381 C133 P29963 oasc.RecoveryStrategy.run Starting recovery process.  core=collection1 recoveringAfterStartup=true
[junit4:junit4]   2> 11254 T2307 oascc.ZkStateReader.updateClusterState Updating cloud state from ZooKeeper... 
[junit4:junit4]   2> 11255 T2381 C133 P29963 oasc.RecoveryStrategy.doRecovery ###### startupVersions=[]
[junit4:junit4]   2> 11255 T2307 oass.SolrDispatchFilter.init user.dir=/usr/home/hudson/hudson-slave/workspace/Lucene-Solr-Tests-4.x-Java6/solr/build/solr-core/test/J1
[junit4:junit4]   2> 11255 T2307 oass.SolrDispatchFilter.init SolrDispatchFilter.init() done
[junit4:junit4]   2> 11256 T2307 oascsi.HttpClientUtil.createClient Creating new http client, config:maxConnections=128&maxConnectionsPerHost=32&followRedirects=false
[junit4:junit4]   2> 11264 T2307 oaz.ZooKeeper.<init> Initiating client connection, connectString=127.0.0.1:29943/solr sessionTimeout=10000 watcher=org.apache.solr.common.cloud.ConnectionManager@3b4ac250
[junit4:junit4]   2> 11265 T2382 oaz.ClientCnxn$SendThread.startConnect Opening socket connection to server /127.0.0.1:29943
[junit4:junit4]   2> 11265 T2307 oascc.ConnectionManager.waitForConnected Waiting for client to connect to ZooKeeper
[junit4:junit4]   2> 11265 T2381 C133 P29963 oasc.RecoveryStrategy.doRecovery Attempting to PeerSync from http://127.0.0.1:29953/solr/collection1/ core=collection1 - recoveringAfterStartup=true
[junit4:junit4]   2> 11266 T2381 C133 P29963 oasu.PeerSync.sync PeerSync: core=collection1 url=http://127.0.0.1:29963/solr START replicas=[http://127.0.0.1:29953/solr/collection1/] nUpdates=100
[junit4:junit4]   2> 11266 T2381 C133 P29963 oasu.PeerSync.sync WARNING no frame of reference to tell of we've missed updates
[junit4:junit4]   2> 11266 T2382 oaz.ClientCnxn$SendThread.primeConnection Socket connection established to localhost/127.0.0.1:29943, initiating session
[junit4:junit4]   2> 11266 T2309 oazs.NIOServerCnxn$Factory.run Accepted socket connection from /140.211.11.196:29970
[junit4:junit4]   2> 11266 T2381 C133 P29963 oasc.RecoveryStrategy.doRecovery PeerSync Recovery was not successful - trying replication. core=collection1
[junit4:junit4]   2> 11266 T2309 oazs.NIOServerCnxn.readConnectRequest Client attempting to establish new session at /140.211.11.196:29970
[junit4:junit4]   2> 11267 T2381 C133 P29963 oasc.RecoveryStrategy.doRecovery Starting Replication Recovery. core=collection1
[junit4:junit4]   2> 11267 T2381 C133 P29963 oascsi.HttpClientUtil.createClient Creating new http client, config:maxConnections=128&maxConnectionsPerHost=32&followRedirects=false
[junit4:junit4]   2> ASYNC  NEW_CORE C134 name=collection1 org.apache.solr.core.SolrCore@20f97729 url=http://127.0.0.1:29953/solr/collection1 node=127.0.0.1:29953_solr
[junit4:junit4]   2> 11276 T2345 C134 P29953 REQ /get {distrib=false&qt=/get&wt=javabin&version=2&getVersions=100} status=0 QTime=0 
[junit4:junit4]   2> 11294 T2311 oazs.NIOServerCnxn.finishSessionInit Established session 0x139ec7736620007 with negotiated timeout 10000 for client /140.211.11.196:29970
[junit4:junit4]   2> 11294 T2382 oaz.ClientCnxn$SendThread.readConnectResult Session establishment complete on server localhost/127.0.0.1:29943, sessionid = 0x139ec7736620007, negotiated timeout = 10000
[junit4:junit4]   2> 11295 T2383 oascc.ConnectionManager.process Watcher org.apache.solr.common.cloud.ConnectionManager@3b4ac250 name:ZooKeeperConnection Watcher:127.0.0.1:29943/solr got event WatchedEvent state:SyncConnected type:None path:null path:null type:None
[junit4:junit4]   2> 11295 T2307 oascc.ConnectionManager.waitForConnected Client is connected to ZooKeeper
[junit4:junit4]   2> 11296 T2307 oascc.ZkStateReader.createClusterStateWatchersAndUpdate Updating cluster state from ZooKeeper... 
[junit4:junit4]   2> 11297 T2307 oasc.ChaosMonkey.monkeyLog monkey: init - expire sessions:true cause connection loss:true
[junit4:junit4]   2> 11297 T2307 oascsi.HttpClientUtil.createClient Creating new http client, config:
[junit4:junit4]   2> 11303 T2307 oascc.ZkStateReader.updateClusterState Updating cloud state from ZooKeeper... 
[junit4:junit4]   2> ASYNC  NEW_CORE C135 name=collection1 org.apache.solr.core.SolrCore@7d4bf07f url=http://127.0.0.1:29946/solr/collection1 node=127.0.0.1:29946_solr
[junit4:junit4]   2> 11314 T2319 C135 P29946 oasc.SolrDeletionPolicy.onInit SolrDeletionPolicy.onInit: commits:num=1
[junit4:junit4]   2> 		commit{dir=NRTCachingDirectory(org.apache.lucene.store.NIOFSDirectory@/usr/home/hudson/hudson-slave/workspace/Lucene-Solr-Tests-4.x-Java6/solr/build/solr-core/test/J1/org.apache.solr.cloud.BasicDistributedZk2Test-1348291999324/control/data/index lockFactory=org.apache.lucene.store.NativeFSLockFactory@26fe0b1a; maxCacheMB=48.0 maxMergeSizeMB=4.0),segFN=segments_1,generation=1,filenames=[segments_1]
[junit4:junit4]   2> 11315 T2319 C135 P29946 oasc.SolrDeletionPolicy.updateCommits newest commit = 1
[junit4:junit4]   2> 11319 T2319 C135 P29946 /update {wt=javabin&version=2} {add=[1 (1413786643338362880)]} 0 9
[junit4:junit4]   2> 11319 T2307 oaz.ZooKeeper.<init> Initiating client connection, connectString=127.0.0.1:29943/solr sessionTimeout=10000 watcher=org.apache.solr.common.cloud.ConnectionManager@712d7124
[junit4:junit4]   2> 11320 T2385 oaz.ClientCnxn$SendThread.startConnect Opening socket connection to server /127.0.0.1:29943
[junit4:junit4]   2> 11320 T2307 oascc.ConnectionManager.waitForConnected Waiting for client to connect to ZooKeeper
[junit4:junit4]   2> 11321 T2385 oaz.ClientCnxn$SendThread.primeConnection Socket connection established to localhost/127.0.0.1:29943, initiating session
[junit4:junit4]   2> 11321 T2309 oazs.NIOServerCnxn$Factory.run Accepted socket connection from /140.211.11.196:29974
[junit4:junit4]   2> 11321 T2309 oazs.NIOServerCnxn.readConnectRequest Client attempting to establish new session at /140.211.11.196:29974
[junit4:junit4]   2> 11323 T2311 oazs.NIOServerCnxn.finishSessionInit Established session 0x139ec7736620008 with negotiated timeout 10000 for client /140.211.11.196:29974
[junit4:junit4]   2> 11323 T2385 oaz.ClientCnxn$SendThread.readConnectResult Session establishment complete on server localhost/127.0.0.1:29943, sessionid = 0x139ec7736620008, negotiated timeout = 10000
[junit4:junit4]   2> 11323 T2386 oascc.ConnectionManager.process Watcher org.apache.solr.common.cloud.ConnectionManager@712d7124 name:ZooKeeperConnection Watcher:127.0.0.1:29943/solr got event WatchedEvent state:SyncConnected type:None path:null path:null type:None
[junit4:junit4]   2> 11324 T2307 oascc.ConnectionManager.waitForConnected Client is connected to ZooKeeper
[junit4:junit4]   2> 11324 T2307 oascc.ZkStateReader.createClusterStateWatchersAndUpdate Updating cluster state from ZooKeeper... 
[junit4:junit4]   2> 11325 T2328 oascc.ZkStateReader.updateClusterState Updating cloud state from ZooKeeper... 
[junit4:junit4]   2> 11331 T2335 C132 P29949 oasc.SolrDeletionPolicy.onInit SolrDeletionPolicy.onInit: commits:num=1
[junit4:junit4]   2> 		commit{dir=NRTCachingDirectory(org.apache.lucene.store.NIOFSDirectory@/usr/home/hudson/hudson-slave/workspace/Lucene-Solr-Tests-4.x-Java6/solr/build/solr-core/test/J1/org.apache.solr.cloud.BasicDistributedZk2Test-1348291999324/jetty1/index lockFactory=org.apache.lucene.store.NativeFSLockFactory@77e2ce72; maxCacheMB=48.0 maxMergeSizeMB=4.0),segFN=segments_1,generation=1,filenames=[segments_1]
[junit4:junit4]   2> 11331 T2335 C132 P29949 oasc.SolrDeletionPolicy.updateCommits newest commit = 1
[junit4:junit4]   2> 11348 T2341 oascc.ZkStateReader$2.process A cluster state change has occurred - updating...
[junit4:junit4]   2> 11348 T2365 oascc.ZkStateReader$2.process A cluster state change has occurred - updating...
[junit4:junit4]   2> 11348 T2353 oascc.ZkStateReader$2.process A cluster state change has occurred - updating...
[junit4:junit4]   2> 11348 T2386 oascc.ZkStateReader$2.process A cluster state change has occurred - updating...
[junit4:junit4]   2> 11348 T2327 oascc.ZkStateReader$2.process A cluster state change has occurred - updating...
[junit4:junit4]   2> 11348 T2383 oascc.ZkStateReader$2.process A cluster state change has occurred - updating...
[junit4:junit4]   2> 11348 T2379 oascc.ZkStateReader$2.process A cluster state change has occurred - updating...
[junit4:junit4]   2>  C131_STATE=coll:collection1 core:collection1 props:{shard=shard1, roles=null, state=recovering, core=collection1, collection=collection1, node_name=127.0.0.1:29959_solr, base_url=http://127.0.0.1:29959/solr}
[junit4:junit4]   2> 11349 T2357 C131 P29959 oasc.SolrDeletionPolicy.onInit SolrDeletionPolicy.onInit: commits:num=1
[junit4:junit4]   2> 		commit{dir=NRTCachingDirectory(org.apache.lucene.store.NIOFSDirectory@/usr/home/hudson/hudson-slave/workspace/Lucene-Solr-Tests-4.x-Java6/solr/build/solr-core/test/J1/org.apache.solr.cloud.BasicDistributedZk2Test-1348291999324/jetty3/index lockFactory=org.apache.lucene.store.NativeFSLockFactory@3e5386fe; maxCacheMB=48.0 maxMergeSizeMB=4.0),segFN=segments_1,generation=1,filenames=[segments_1]
[junit4:junit4]   2> 11350 T2357 C131 P29959 oasc.SolrDeletionPolicy.updateCommits newest commit = 1
[junit4:junit4]   2> 11354 T2357 C131 P29959 REQ /update {distrib.from=http://127.0.0.1:29949/solr/collection1/&update.distrib=FROMLEADER&wt=javabin&version=2} status=0 QTime=10 
[junit4:junit4]   2> 11354 T2335 C132 P29949 /update {wt=javabin&version=2} {add=[1 (1413786643356188672)]} 0 28
[junit4:junit4]   2> 11355 T2307 oasc.AbstractDistribZkTestBase.waitForRecoveriesToFinish Wait for recoveries to finish - collection: collection1 failOnTimeout:true timeout (sec):1800
[junit4:junit4]   2> 11434 T2307 oascc.ZkStateReader.updateClusterState Updating cloud state from ZooKeeper... 
[junit4:junit4]   2> 12436 T2307 oascc.ZkStateReader.updateClusterState Updating cloud state from ZooKeeper... 
[junit4:junit4]   2> 12589 T2367 C131 P29959 oasc.RecoveryStrategy.doRecovery Begin buffering updates. core=collection1
[junit4:junit4]   2> 12589 T2367 C131 P29959 oasu.UpdateLog.bufferUpdates Starting to buffer updates. FSUpdateLog{state=ACTIVE, tlog=tlog{file=./org.apache.solr.cloud.BasicDistributedZk2Test-1348291999324/jetty3/tlog/tlog.0000000000000000000 refcount=1}}
[junit4:junit4]   2> 12589 T2367 C131 P29959 oasc.RecoveryStrategy.replicate Attempting to replicate from http://127.0.0.1:29949/solr/collection1/. core=collection1
[junit4:junit4]   2> 12590 T2367 C131 P29959 oascsi.HttpClientUtil.createClient Creating new http client, config:maxConnections=128&maxConnectionsPerHost=32&followRedirects=false
[junit4:junit4]   2> 12604 T2336 C132 P29949 oasu.DirectUpdateHandler2.commit start commit{flags=0,_version_=0,optimize=false,openSearcher=true,waitSearcher=true,expungeDeletes=false,softCommit=false}
[junit4:junit4]   2> 12739 T2336 C132 P29949 oasc.SolrDeletionPolicy.onCommit SolrDeletionPolicy.onCommit: commits:num=2
[junit4:junit4]   2> 		commit{dir=NRTCachingDirectory(org.apache.lucene.store.NIOFSDirectory@/usr/home/hudson/hudson-slave/workspace/Lucene-Solr-Tests-4.x-Java6/solr/build/solr-core/test/J1/org.apache.solr.cloud.BasicDistributedZk2Test-1348291999324/jetty1/index lockFactory=org.apache.lucene.store.NativeFSLockFactory@77e2ce72; maxCacheMB=48.0 maxMergeSizeMB=4.0),segFN=segments_1,generation=1,filenames=[segments_1]
[junit4:junit4]   2> 		commit{dir=NRTCachingDirectory(org.apache.lucene.store.NIOFSDirectory@/usr/home/hudson/hudson-slave/workspace/Lucene-Solr-Tests-4.x-Java6/solr/build/solr-core/test/J1/org.apache.solr.cloud.BasicDistributedZk2Test-1348291999324/jetty1/index lockFactory=org.apache.lucene.store.NativeFSLockFactory@77e2ce72; maxCacheMB=48.0 maxMergeSizeMB=4.0),segFN=segments_2,generation=2,filenames=[_0_Asserting_0.tim, _0_Asserting_0.tip, _0_MockVariableIntBlock_0.doc, _0_TestBloomFilteredLucene40Postings_0.prx, _0_MockVariableIntBlock_0.skp, _0_NestedPulsing_0.tip, _0_NestedPulsing_0.tim, _0_Asserting_0.prx, _0_MockVariableIntBlock_0.pyl, _0_MockVariableIntBlock_0.tib, _0_MockVariableIntBlock_0.pos, _0_TestBloomFilteredLucene40Postings_0.frq, _0.si, _0_MockVariableIntBlock_0.tii, _0_TestBloomFilteredLucene40Postings_0.tim, _0_TestBloomFilteredLucene40Postings_0.tip, _0_TestBloomFilteredLucene40Postings_0.blm, _0.fnm, _0_NestedPulsing_0.frq, _0_nrm.cfs, _0_NestedPulsing_0.prx, _0_Asserting_0.frq, _0_MockVariableIntBlock_0.frq, _0_nrm.cfe, segments_2, _0.fdx, _0.fdt]
[junit4:junit4]   2> 12739 T2336 C132 P29949 oasc.SolrDeletionPolicy.updateCommits newest commit = 2
[junit4:junit4]   2> 12755 T2336 C132 P29949 oass.SolrIndexSearcher.<init> Opening Searcher@7a746c3d main
[junit4:junit4]   2> 12756 T2336 C132 P29949 oasu.DirectUpdateHandler2.commit end_commit_flush
[junit4:junit4]   2> 12757 T2342 oasc.SolrCore.registerSearcher [collection1] Registered new searcher Searcher@7a746c3d main{StandardDirectoryReader(segments_2:3 _0(4.0.0.2):C1)}
[junit4:junit4]   2> 12758 T2336 C132 P29949 /update {waitSearcher=true&commit=true&commit_end_point=true&wt=javabin&softCommit=false&version=2} {commit=} 0 154
[junit4:junit4]   2> 12758 T2367 C131 P29959 oash.ReplicationHandler.inform Commits will be reserved for  10000
[junit4:junit4]   2> 12759 T2367 C131 P29959 oash.SnapPuller.<init>  No value set for 'pollInterval'. Timer Task not started.
[junit4:junit4]   2> 12761 T2337 C132 P29949 oash.ReplicationHandler.inform Commits will be reserved for  10000
[junit4:junit4]   2> 12761 T2337 C132 P29949 REQ /replication {command=indexversion&wt=javabin&qt=/replication&version=2} status=0 QTime=1 
[junit4:junit4]   2> 12761 T2367 C131 P29959 oash.SnapPuller.fetchLatestIndex Master's generation: 2
[junit4:junit4]   2> 12762 T2367 C131 P29959 oash.SnapPuller.fetchLatestIndex Slave's generation: 1
[junit4:junit4]   2> 12762 T2367 C131 P29959 oash.SnapPuller.fetchLatestIndex Starting replication process
[junit4:junit4]   2> 12767 T2337 C132 P29949 REQ /replication {command=filelist&generation=2&wt=javabin&qt=/replication&version=2} status=0 QTime=3 
[junit4:junit4]   2> 12767 T2367 C131 P29959 oash.SnapPuller.fetchLatestIndex Number of files in latest index in master: 27
[junit4:junit4]   2> 12773 T2367 C131 P29959 oash.SnapPuller.fetchLatestIndex Starting download to ./org.apache.solr.cloud.BasicDistributedZk2Test-1348291999324/jetty3/index.20120922133332088 fullCopy=true
[junit4:junit4]   2> 12775 T2337 C132 P29949 REQ /replication {file=_0_Asserting_0.tim&command=filecontent&checksum=true&generation=2&qt=/replication&wt=filestream} status=0 QTime=0 
[junit4:junit4]   2> 12780 T2337 C132 P29949 REQ /replication {file=_0_Asserting_0.tip&command=filecontent&checksum=true&generation=2&qt=/replication&wt=filestream} status=0 QTime=0 
[junit4:junit4]   2> 12784 T2337 C132 P29949 REQ /replication {file=_0_MockVariableIntBlock_0.doc&command=filecontent&checksum=true&generation=2&qt=/replication&wt=filestream} status=0 QTime=0 
[junit4:junit4]   2> 12788 T2337 C132 P29949 REQ /replication {file=_0_TestBloomFilteredLucene40Postings_0.prx&command=filecontent&checksum=true&generation=2&qt=/replication&wt=filestream} status=0 QTime=0 
[junit4:junit4]   2> 12792 T2337 C132 P29949 REQ /replication {file=_0_MockVariableIntBlock_0.skp&command=filecontent&checksum=true&generation=2&qt=/replication&wt=filestream} status=0 QTime=0 
[junit4:junit4]   2> 12793 T2367 C131 P29959 oash.SnapPuller$FileFetcher.fetchPackets WARNING No content recieved for file: {name=_0_MockVariableIntBlock_0.skp, lastmodified=1348292011000, size=0}
[junit4:junit4]   2> 12796 T2337 C132 P29949 REQ /replication {file=_0_NestedPulsing_0.tip&command=filecontent&checksum=true&generation=2&qt=/replication&wt=filestream} status=0 QTime=0 
[junit4:junit4]   2> 12804 T2337 C132 P29949 REQ /replication {file=_0_NestedPulsing_0.tim&command=filecontent&checksum=true&generation=2&qt=/replication&wt=filestream} status=0 QTime=0 
[junit4:junit4]   2> 12808 T2337 C132 P29949 REQ /replication {file=_0_Asserting_0.prx&command=filecontent&checksum=true&generation=2&qt=/replication&wt=filestream} status=0 QTime=0 
[junit4:junit4]   2> 12812 T2337 C132 P29949 REQ /replication {file=_0_MockVariableIntBlock_0.pyl&command=filecontent&checksum=true&generation=2&qt=/replication&wt=filestream} status=0 QTime=0 
[junit4:junit4]   2> 12813 T2367 C131 P29959 oash.SnapPuller$FileFetcher.fetchPackets WARNING No content recieved for file: {name=_0_MockVariableIntBlock_0.pyl, lastmodified=1348292011000, size=0}
[junit4:junit4]   2> 12816 T2337 C132 P29949 REQ /replication {file=_0_MockVariableIntBlock_0.tib&command=filecontent&checksum=true&generation=2&qt=/replication&wt=filestream} status=0 QTime=0 
[junit4:junit4]   2> 12820 T2337 C132 P29949 REQ /replication {file=_0_MockVariableIntBlock_0.pos&command=filecontent&checksum=true&generation=2&qt=/replication&wt=filestream} status=0 QTime=0 
[junit4:junit4]   2> 12824 T2337 C132 P29949 REQ /replication {file=_0_TestBloomFilteredLucene40Postings_0.frq&command=filecontent&checksum=true&generation=2&qt=/replication&wt=filestream} status=0 QTime=0 
[junit4:junit4]   2> 12828 T2337 C132 P29949 REQ /replication {file=_0.si&command=filecontent&checksum=true&generation=2&qt=/replication&wt=filestream} status=0 QTime=0 
[junit4:junit4]   2> 12832 T2337 C132 P29949 REQ /replication {file=_0_MockVariableIntBlock_0.tii&command=filecontent&checksum=true&generation=2&qt=/replication&wt=filestream} status=0 QTime=0 
[junit4:junit4]   2> 12836 T2337 C132 P29949 REQ /replication {file=_0_TestBloomFilteredLucene40Postings_0.tim&command=filecontent&checksum=true&generation=2&qt=/replication&wt=filestream} status=0 QTime=0 
[junit4:junit4]   2> 12840 T2337 C132 P29949 REQ /replication {file=_0_TestBloomFilteredLucene40Postings_0.blm&command=filecontent&checksum=true&generation=2&qt=/replication&wt=filestream} status=0 QTime=0 
[junit4:junit4]   2> 12844 T2337 C132 P29949 REQ /replication {file=_0_TestBloomFilteredLucene40Postings_0.tip&command=filecontent&checksum=true&generation=2&qt=/replication&wt=filestream} status=0 QTime=0 
[junit4:junit4]   2> 12848 T2337 C132 P29949 REQ /replication {file=_0.fnm&command=filecontent&checksum=true&generation=2&qt=/replication&wt=filestream} status=0 QTime=0 
[junit4:junit4]   2> 12852 T2337 C132 P29949 REQ /replication {file=_0_NestedPulsing_0.frq&command=filecontent&checksum=true&generation=2&qt=/replication&wt=filestream} status=0 QTime=0 
[junit4:junit4]   2> 12856 T2337 C132 P29949 REQ /replication {file=_0_nrm.cfs&command=filecontent&checksum=true&generation=2&qt=/replication&wt=filestream} status=0 QTime=0 
[junit4:junit4]   2> 12860 T2337 C132 P29949 REQ /replication {file=_0_NestedPulsing_0.prx&command=filecontent&checksum=true&generation=2&qt=/replication&wt=filestream} status=0 QTime=0 
[junit4:junit4]   2> 12864 T2337 C132 P29949 REQ /replication {file=_0_Asserting_0.frq&command=filecontent&checksum=true&generation=2&qt=/replication&wt=filestream} status=0 QTime=0 
[junit4:junit4]   2> 12868 T2337 C132 P29949 REQ /replication {file=_0_nrm.cfe&command=filecontent&checksum=true&generation=2&qt=/replication&wt=filestream} status=0 QTime=0 
[junit4:junit4]   2> 12872 T2337 C132 P29949 REQ /replication {file=_0_MockVariableIntBlock_0.frq&command=filecontent&checksum=true&generation=2&qt=/replication&wt=filestream} status=0 QTime=0 
[junit4:junit4]   2> 12876 T2337 C132 P29949 REQ /replication {file=segments_2&command=filecontent&checksum=true&generation=2&qt=/replication&wt=filestream} status=0 QTime=0 
[junit4:junit4]   2> 12880 T2337 C132 P29949 REQ /replication {file=_0.fdx&command=filecontent&checksum=true&generation=2&qt=/replication&wt=filestream} status=0 QTime=0 
[junit4:junit4]   2> 12884 T2337 C132 P29949 REQ /replication {file=_0.fdt&command=filecontent&checksum=true&generation=2&qt=/replication&wt=filestream} status=0 QTime=0 
[junit4:junit4]   2> 12885 T2367 C131 P29959 oash.SnapPuller.fetchLatestIndex Total time taken for download : 0 secs
[junit4:junit4]   2> 12886 T2367 C131 P29959 oash.SnapPuller.modifyIndexProps New index installed. Updating index properties... index=index.20120922133332088
[junit4:junit4]   2> 12888 T2367 C131 P29959 oasu.DefaultSolrCoreState.newIndexWriter Creating new IndexWriter...
[junit4:junit4]   2> 12888 T2367 C131 P29959 oasu.DefaultSolrCoreState.newIndexWriter Waiting until IndexWriter is unused... core=collection1
[junit4:junit4]   2> 12888 T2367 C131 P29959 oasu.DefaultSolrCoreState.newIndexWriter Rollback old IndexWriter... core=collection1
[junit4:junit4]   2> 12893 T2367 C131 P29959 oasc.SolrCore.getNewIndexDir WARNING New index directory detected: old=./org.apache.solr.cloud.BasicDistributedZk2Test-1348291999324/jetty3/index/ new=./org.apache.solr.cloud.BasicDistributedZk2Test-1348291999324/jetty3/index.20120922133332088
[junit4:junit4]   2> 12893 T2367 C131 P29959 oasc.CachingDirectoryFactory.get return new directory for /usr/home/hudson/hudson-slave/workspace/Lucene-Solr-Tests-4.x-Java6/solr/build/solr-core/test/J1/./org.apache.solr.cloud.BasicDistributedZk2Test-1348291999324/jetty3/index.20120922133332088 forceNew:true
[junit4:junit4]   2> 12905 T2367 C131 P29959 oasc.SolrDeletionPolicy.onInit SolrDeletionPolicy.onInit: commits:num=1
[junit4:junit4]   2> 		commit{dir=NRTCachingDirectory(org.apache.lucene.store.NIOFSDirectory@/usr/home/hudson/hudson-slave/workspace/Lucene-Solr-Tests-4.x-Java6/solr/build/solr-core/test/J1/org.apache.solr.cloud.BasicDistributedZk2Test-1348291999324/jetty3/index.20120922133332088 lockFactory=org.apache.lucene.store.NativeFSLockFactory@6f479515; maxCacheMB=48.0 maxMergeSizeMB=4.0),segFN=segments_2,generation=2,filenames=[_0_Asserting_0.tim, _0_Asserting_0.tip, _0_MockVariableIntBlock_0.doc, _0_TestBloomFilteredLucene40Postings_0.prx, _0_MockVariableIntBlock_0.skp, _0_NestedPulsing_0.tip, _0_NestedPulsing_0.tim, _0_Asserting_0.prx, _0_MockVariableIntBlock_0.pyl, _0_MockVariableIntBlock_0.tib, _0_MockVariableIntBlock_0.pos, _0_TestBloomFilteredLucene40Postings_0.frq, _0.si, _0_MockVariableIntBlock_0.tii, _0_TestBloomFilteredLucene40Postings_0.tim, _0_TestBloomFilteredLucene40Postings_0.tip, _0_TestBloomFilteredLucene40Postings_0.blm, _0.fnm, _0_NestedPulsing_0.frq, _0_nrm.cfs, _0_NestedPulsing_0.prx, _0_Asserting_0.frq, _0_MockVariableIntBlock_0.frq, _0_nrm.cfe, segments_2, _0.fdx, _0.fdt]
[junit4:junit4]   2> 12905 T2367 C131 P29959 oasc.SolrDeletionPolicy.updateCommits newest commit = 2
[junit4:junit4]   2> 12906 T2367 C131 P29959 oasu.DefaultSolrCoreState.newIndexWriter New IndexWriter is ready to be used.
[junit4:junit4]   2> 12910 T2367 C131 P29959 oass.SolrIndexSearcher.<init> Opening Searcher@20a162a5 main
[junit4:junit4]   2> 12911 T2366 oasc.SolrCore.registerSearcher [collection1] Registered new searcher Searcher@20a162a5 main{StandardDirectoryReader(segments_2:3:nrt _0(4.0.0.2):C1)}
[junit4:junit4]   2> 12912 T2366 oasc.CachingDirectoryFactory.close Closing directory:/usr/home/hudson/hudson-slave/workspace/Lucene-Solr-Tests-4.x-Java6/solr/build/solr-core/test/J1/./org.apache.solr.cloud.BasicDistributedZk2Test-1348291999324/jetty3/index
[junit4:junit4]   2> 12912 T2366 oash.SnapPuller$2.onClose removing old index directory ./org.apache.solr.cloud.BasicDistributedZk2Test-1348291999324/jetty3/index
[junit4:junit4]   2> 12914 T2367 C131 P29959 oasu.DirectUpdateHandler2.commit start commit{flags=0,_version_=0,optimize=false,openSearcher=false,waitSearcher=false,expungeDeletes=false,softCommit=false}
[junit4:junit4]   2> 12915 T2367 C131 P29959 oasu.DirectUpdateHandler2.commit end_commit_flush
[junit4:junit4]   2> 12915 T2367 C131 P29959 oasc.RecoveryStrategy.replay Replaying buffered documents. core=collection1
[junit4:junit4]   2> 12915 T2389 C131 P29959 oasu.UpdateLog$LogReplayer.doReplay WARNING Starting log replay tlog{file=./org.apache.solr.cloud.BasicDistributedZk2Test-1348291999324/jetty3/tlog/tlog.0000000000000000000 refcount=2} active=true starting pos=434
[junit4:junit4]   2> 12916 T2389 C131 P29959 oasu.DirectUpdateHandler2.commit start commit{flags=2,_version_=0,optimize=false,openSearcher=true,waitSearcher=true,expungeDeletes=false,softCommit=false}
[junit4:junit4]   2> 12917 T2389 C131 P29959 oass.SolrIndexSearcher.<init> Opening Searcher@59a4bc8f main
[junit4:junit4]   2> 12918 T2389 C131 P29959 oasu.DirectUpdateHandler2.commit end_commit_flush
[junit4:junit4]   2> 12919 T2366 oasc.SolrCore.registerSearcher [collection1] Registered new searcher Searcher@59a4bc8f main{StandardDirectoryReader(segments_2:3:nrt _0(4.0.0.2):C1)}
[junit4:junit4]   2> 12919 T2389 C131 P29959 oasu.UpdateLog$LogReplayer.run WARNING Log replay finished. recoveryInfo=RecoveryInfo{adds=0 deletes=0 deleteByQuery=0 errors=0 positionOfStart=434}
[junit4:junit4]   2> 12920 T2367 C131 P29959 oasc.RecoveryStrategy.doRecovery Replication Recovery was successful - registering as Active. core=collection1
[junit4:junit4]   2> 12921 T2367 C131 P29959 oasc.RecoveryStrategy.doRecovery Finished recovery process. core=collection1
[junit4:junit4]   2> 12939 T2328 oascc.ZkStateReader.updateClusterState Updating cloud state from ZooKeeper... 
[junit4:junit4]   2> 12951 T2341 oascc.ZkStateReader$2.process A cluster state change has occurred - updating...
[junit4:junit4]   2> 12951 T2386 oascc.ZkStateReader$2.process A cluster state change has occurred - updating...
[junit4:junit4]   2> 12951 T2353 oascc.ZkStateReader$2.process A cluster state change has occurred - updating...
[junit4:junit4]   2> 12951 T2383 oascc.ZkStateReader$2.process A cluster state change has occurred - updating...
[junit4:junit4]   2> 12951 T2379 oascc.ZkStateReader$2.process A cluster state change has occurred - updating...
[junit4:junit4]   2> 12951 T2365 oascc.ZkStateReader$2.process A cluster state change has occurred - updating...
[junit4:junit4]   2> 12951 T2327 oascc.ZkStateReader$2.process A cluster state change has occurred - updating...
[junit4:junit4]   2> 13438 T2307 oascc.ZkStateReader.updateClusterState Updating cloud state from ZooKeeper... 
[junit4:junit4]   2>  C133_STATE=coll:collection1 core:collection1 props:{shard=shard2, roles=null, state=recovering, core=collection1, collection=collection1, node_name=127.0.0.1:29963_solr, base_url=http://127.0.0.1:29963/solr}
[junit4:junit4]   2> 14277 T2381 C133 P29963 oasc.RecoveryStrategy.doRecovery Begin buffering updates. core=collection1
[junit4:junit4]   2> 14277 T2381 C133 P29963 oasu.UpdateLog.bufferUpdates Starting to buffer updates. FSUpdateLog{state=ACTIVE, tlog=null}
[junit4:junit4]   2> 14277 T2381 C133 P29963 oasc.RecoveryStrategy.replicate Attempting to replicate from http://127.0.0.1:29953/solr/collection1/. core=collection1
[junit4:junit4]   2> 14278 T2381 C133 P29963 oascsi.HttpClientUtil.createClient Creating new http client, config:maxConnections=128&maxConnectionsPerHost=32&followRedirects=false
[junit4:junit4]   2> 14292 T2347 C134 P29953 oasu.DirectUpdateHandler2.commit start commit{flags=0,_version_=0,optimize=false,openSearcher=true,waitSearcher=true,expungeDeletes=false,softCommit=false}
[junit4:junit4]   2> 14296 T2347 C134 P29953 oasc.SolrDeletionPolicy.onInit SolrDeletionPolicy.onInit: commits:num=1
[junit4:junit4]   2> 		commit{dir=NRTCachingDirectory(org.apache.lucene.store.NIOFSDirectory@/usr/home/hudson/hudson-slave/workspace/Lucene-Solr-Tests-4.x-Java6/solr/build/solr-core/test/J1/org.apache.solr.cloud.BasicDistributedZk2Test-1348291999324/jetty2/index lockFactory=org.apache.lucene.store.NativeFSLockFactory@33a0269d; maxCacheMB=48.0 maxMergeSizeMB=4.0),segFN=segments_1,generation=1,filenames=[segments_1]
[junit4:junit4]   2> 14297 T2347 C134 P29953 oasc.SolrDeletionPolicy.updateCommits newest commit = 1
[junit4:junit4]   2> 14299 T2347 C134 P29953 oass.SolrIndexSearcher.<init> Opening Searcher@743febe8 main
[junit4:junit4]   2> 14299 T2347 C134 P29953 oasu.DirectUpdateHandler2.commit end_commit_flush
[junit4:junit4]   2> 14301 T2354 oasc.SolrCore.registerSearcher [collection1] Registered new searcher Searcher@743febe8 main{StandardDirectoryReader(segments_1:1)}
[junit4:junit4]   2> 14301 T2347 C134 P29953 /update {waitSearcher=true&commit=true&commit_end_point=true&wt=javabin&softCommit=false&version=2} {commit=} 0 9
[junit4:junit4]   2> 14302 T2381 C133 P29963 oash.ReplicationHandler.inform Commits will be reserved for  10000
[junit4:junit4]   2> 14302 T2381 C133 P29963 oash.SnapPuller.<init>  No value set for 'pollInterval'. Timer Task not started.
[junit4:junit4]   2> 14304 T2348 C134 P29953 oash.ReplicationHandler.inform Commits will be reserved for  10000
[junit4:junit4]   2> 14304 T2348 C134 P29953 REQ /replication {command=indexversion&wt=javabin&qt=/replication&version=2} status=0 QTime=1 
[junit4:junit4]   2> 14307 T2381 C133 P29963 oasc.SolrDeletionPolicy.onInit SolrDeletionPolicy.onInit: commits:num=1
[junit4:junit4]   2> 		commit{dir=NRTCachingDirectory(org.apache.lucene.store.NIOFSDirectory@/usr/home/hudson/hudson-slave/workspace/Lucene-Solr-Tests-4.x-Java6/solr/build/solr-core/test/J1/org.apache.solr.cloud.BasicDistributedZk2Test-1348291999324/jetty4/index lockFactory=org.apache.lucene.store.NativeFSLockFactory@3a6d9ce9; maxCacheMB=48.0 maxMergeSizeMB=4.0),segFN=segments_1,generation=1,filenames=[segments_1]
[junit4:junit4]   2> 14308 T2381 C133 P29963 oasc.SolrDeletionPolicy.updateCommits newest commit = 1
[junit4:junit4]   2> 14308 T2381 C133 P29963 oasu.DirectUpdateHandler2.commit start commit{flags=0,_version_=0,optimize=false,openSearcher=true,waitSearcher=true,expungeDeletes=false,softCommit=false}
[junit4:junit4]   2> 14311 T2381 C133 P29963 oasc.SolrDeletionPolicy.onCommit SolrDeletionPolicy.onCommit: commits:num=2
[junit4:junit4]   2> 		commit{dir=NRTCachingDirectory(org.apache.lucene.store.NIOFSDirectory@/usr/home/hudson/hudson-slave/workspace/Lucene-Solr-Tests-4.x-Java6/solr/build/solr-core/test/J1/org.apache.solr.cloud.BasicDistributedZk2Test-1348291999324/jetty4/index lockFactory=org.apache.lucene.store.NativeFSLockFactory@3a6d9ce9; maxCacheMB=48.0 maxMergeSizeMB=4.0),segFN=segments_1,generation=1,filenames=[segments_1]
[junit4:junit4]   2> 		commit{dir=NRTCachingDirectory(org.apache.lucene.store.NIOFSDirectory@/usr/home/hudson/hudson-slave/workspace/Lucene-Solr-Tests-4.x-Java6/solr/build/solr-core/test/J1/org.apache.solr.cloud.BasicDistributedZk2Test-1348291999324/jetty4/index lockFactory=org.apache.lucene.store.NativeFSLockFactory@3a6d9ce9; maxCacheMB=48.0 maxMergeSizeMB=4.0),segFN=segments_2,generation=2,filenames=[segments_2]
[junit4:junit4]   2> 14311 T2381 C133 P29963 oasc.SolrDeletionPolicy.updateCommits newest commit = 2
[junit4:junit4]   2> 14313 T2381 C133 P29963 oass.SolrIndexSearcher.<init> Opening Searcher@5c2a2e1f main
[junit4:junit4]   2> 14313 T2381 C133 P29963 oasu.DirectUpdateHandler2.commit end_commit_flush
[junit4:junit4]   2> 14315 T2380 oasc.SolrCore.registerSearcher [collection1] Registered new searcher Searcher@5c2a2e1f main{StandardDirectoryReader(segments_2:2)}
[junit4:junit4]   2> 14316 T2381 C133 P29963 oasc.RecoveryStrategy.replay No replay needed. core=collection1
[junit4:junit4]   2> 14316 T2381 C133 P29963 oasc.RecoveryStrategy.doRecovery Replication Recovery was successful - registering as Active. core=collection1
[junit4:junit4]   2> 14327 T2381 C133 P29963 oasc.RecoveryStrategy.doRecovery Finished recovery process. core=collection1
[junit4:junit4]   2> 14440 T2307 oascc.ZkStateReader.updateClusterState Updating cloud state from ZooKeeper... 
[junit4:junit4]   2> 14458 T2328 oascc.ZkStateReader.updateClusterState Updating cloud state from ZooKeeper... 
[junit4:junit4]   2> 14474 T2341 oascc.ZkStateReader$2.process A cluster state change has occurred - updating...
[junit4:junit4]   2> 14474 T2365 oascc.ZkStateReader$2.process A cluster state change has occurred - updating...
[junit4:junit4]   2> 14474 T2386 oascc.ZkStateReader$2.process A cluster state change has occurred - updating...
[junit4:junit4]   2> 14474 T2327 oascc.ZkStateReader$2.process A cluster state change has occurred - updating...
[junit4:junit4]   2> 14474 T2353 oascc.ZkStateReader$2.process A cluster state change has occurred - updating...
[junit4:junit4]   2> 14474 T2379 oascc.ZkStateReader$2.process A cluster state change has occurred - updating...
[junit4:junit4]   2> 14474 T2383 oascc.ZkStateReader$2.process A cluster state change has occurred - updating...
[junit4:junit4]   2> 15442 T2307 oascc.ZkStateReader.updateClusterState Updating cloud state from ZooKeeper... 
[junit4:junit4]   2> 15445 T2319 C135 P29946 oasu.DirectUpdateHandler2.commit start commit{flags=0,_version_=0,optimize=false,openSearcher=true,waitSearcher=true,expungeDeletes=false,softCommit=false}
[junit4:junit4]   2> 15598 T2319 C135 P29946 oasc.SolrDeletionPolicy.onCommit SolrDeletionPolicy.onCommit: commits:num=2
[junit4:junit4]   2> 		commit{dir=NRTCachingDirectory(org.apache.lucene.store.NIOFSDirectory@/usr/home/hudson/hudson-slave/workspace/Lucene-Solr-Tests-4.x-Java6/solr/build/solr-core/test/J1/org.apache.solr.cloud.BasicDistributedZk2Test-1348291999324/control/data/index lockFactory=org.apache.lucene.store.NativeFSLockFactory@26fe0b1a; maxCacheMB=48.0 maxMergeSizeMB=4.0),segFN=segments_1,generation=1,filenames=[segments_1]
[junit4:junit4]   2> 		commit{dir=NRTCachingDirectory(org.apache.lucene.store.NIOFSDirectory@/usr/home/hudson/hudson-slave/workspace/Lucene-Solr-Tests-4.x-Java6/solr/build/solr-core/test/J1/org.apache.solr.cloud.BasicDistributedZk2Test-1348291999324/control/data/index lockFactory=org.apache.lucene.store.NativeFSLockFactory@26fe0b1a; maxCacheMB=48.0 maxMergeSizeMB=4.0),segFN=segments_2,generation=2,filenames=[_0_Asserting_0.tim, _0_Asserting_0.tip, _0_MockVariableIntBlock_0.doc, _0_TestBloomFilteredLucene40Postings_0.prx, _0_MockVariableIntBlock_0.skp, _0_NestedPulsing_0.tip, _0_NestedPulsing_0.tim, _0_Asserting_0.prx, _0_MockVariableIntBlock_0.pyl, _0_MockVariableIntBlock_0.tib, _0_MockVariableIntBlock_0.pos, _0_TestBloomFilteredLucene40Postings_0.frq, _0.si, _0_MockVariableIntBlock_0.tii, _0_TestBloomFilteredLucene40Postings_0.tim, _0_TestBloomFilteredLucene40Postings_0.tip, _0_TestBloomFilteredLucene40Postings_0.blm, _0.fnm, _0_NestedPulsing_0.frq, _0_nrm.cfs, _0_NestedPulsing_0.prx, _0_Asserting_0.frq, _0_MockVariableIntBlock_0.frq, _0_nrm.cfe, segments_2, _0.fdx, _0.fdt]
[junit4:junit4]   2> 15598 T2319 C135 P29946 oasc.SolrDeletionPolicy.updateCommits newest commit = 2
[junit4:junit4]   2> 15615 T2319 C135 P29946 oass.SolrIndexSearcher.<init> Opening Searcher@5e7f4b7b main
[junit4:junit4]   2> 15616 T2319 C135 P29946 oasu.DirectUpdateHandler2.commit end_commit_flush
[junit4:junit4]   2> 15617 T2330 oasc.SolrCore.registerSearcher [collection1] Registered new searcher Searcher@5e7f4b7b main{StandardDirectoryReader(segments_2:3 _0(4.0.0.2):C1)}
[junit4:junit4]   2> 15618 T2319 C135 P29946 /update {waitSearcher=true&wt=javabin&commit=true&softCommit=false&version=2} {commit=} 0 173
[junit4:junit4]   2> 15621 T2335 C132 P29949 oasu.DirectUpdateHandler2.commit start commit{flags=0,_version_=0,optimize=false,openSearcher=true,waitSearcher=true,expungeDeletes=false,softCommit=false}
[junit4:junit4]   2> 15633 T2335 C132 P29949 oass.SolrIndexSearcher.<init> Opening Searcher@5321d4de main
[junit4:junit4]   2> 15633 T2335 C132 P29949 oasu.DirectUpdateHandler2.commit end_commit_flush
[junit4:junit4]   2> 15634 T2342 oasc.SolrCore.registerSearcher [collection1] Registered new searcher Searcher@5321d4de main{StandardDirectoryReader(segments_2:3 _0(4.0.0.2):C1)}
[junit4:junit4]   2> 15635 T2335 C132 P29949 oasu.SolrCmdDistributor.distribCommit Distrib commit to:[StdNode: http://127.0.0.1:29959/solr/collection1/, StdNode: http://127.0.0.1:29953/solr/collection1/, StdNode: http://127.0.0.1:29963/solr/collection1/]
[junit4:junit4]   2> 15637 T2349 C134 P29953 oasu.DirectUpdateHandler2.commit start commit{flags=0,_version_=0,optimize=false,openSearcher=true,waitSearcher=true,expungeDeletes=false,softCommit=false}
[junit4:junit4]   2>  C131_STATE=coll:collection1 core:collection1 props:{shard=shard1, roles=null, state=active, core=collection1, collection=collection1, node_name=127.0.0.1:29959_solr, base_url=http://127.0.0.1:29959/solr}
[junit4:junit4]   2> 15637 T2357 C131 P29959 oasu.DirectUpdateHandler2.commit start commit{flags=0,_version_=0,optimize=false,openSearcher=true,waitSearcher=true,expungeDeletes=false,softCommit=false}
[junit4:junit4]   2> 15641 T2357 C131 P29959 oass.SolrIndexSearcher.<init> Opening Searcher@308ad14b main
[junit4:junit4]   2> 15641 T2357 C131 P29959 oasu.DirectUpdateHandler2.commit end_commit_flush
[junit4:junit4]   2> 15642 T2349 C134 P29953 oass.SolrIndexSearcher.<init> Opening Searcher@512e9e34 main
[junit4:junit4]   2> 15642 T2349 C134 P29953 oasu.DirectUpdateHandler2.commit end_commit_flush
[junit4:junit4]   2> 15642 T2366 oasc.SolrCore.registerSearcher [collection1] Registered new searcher Searcher@308ad14b main{StandardDirectoryReader(segments_2:3:nrt _0(4.0.0.2):C1)}
[junit4:junit4]   2> 15643 T2357 C131 P29959 /update {waitSearcher=true&commit=true&wt=javabin&commit_end_point=true&expungeDeletes=false&softCommit=false&version=2} {commit=} 0 6
[junit4:junit4]   2> 15643 T2354 oasc.SolrCore.registerSearcher [collection1] Registered new searcher Searcher@512e9e34 main{StandardDirectoryReader(segments_1:1)}
[junit4:junit4]   2> 15644 T2349 C134 P29953 /update {waitSearcher=true&commit=true&wt=javabin&commit_end_point=true&expungeDeletes=false&softCommit=false&version=2} {commit=} 0 8
[junit4:junit4]   2>  C133_STATE=coll:collection1 core:collection1 props:{shard=shard2, roles=null, state=active, core=collection1, collection=collection1, node_name=127.0.0.1:29963_solr, base_url=http://127.0.0.1:29963/solr}
[junit4:junit4]   2> 15646 T2371 C133 P29963 oasu.DirectUpdateHandler2.commit start commit{flags=0,_version_=0,optimize=false,openSearcher=true,waitSearcher=true,expungeDeletes=false,softCommit=false}
[junit4:junit4]   2> 15650 T2371 C133 P29963 oass.SolrIndexSearcher.<init> Opening Searcher@16226c2d main
[junit4:junit4]   2> 15651 T2371 C133 P29963 oasu.DirectUpdateHandler2.commit end_commit_flush
[junit4:junit4]   2> 15652 T2380 oasc.SolrCore.registerSearcher [collection1] Registered new searcher Searcher@16226c2d main{StandardDirectoryReader(segments_2:2)}
[junit4:junit4]   2> 15652 T2371 C133 P29963 /update {waitSearcher=true&commit=true&wt=javabin&commit_end_point=true&expungeDeletes=false&softCommit=false&version=2} {commit=} 0 6
[junit4:junit4]   2> 15653 T2335 C132 P29949 /update {waitSearcher=true&wt=javabin&commit=true&softCommit=false&version=2} {commit=} 0 32
[junit4:junit4]   2> 15657 T2320 C135 P29946 REQ /select {fl=id,score&shard.url=127.0.0.1:29946/solr/collection1/&NOW=1348292014975&start=0&q=*:*&distrib=false&isShard=true&wt=javabin&fsv=true&rows=10&version=2} hits=1 status=0 QTime=0 
[junit4:junit4]   2> 15660 T2320 C135 P29946 REQ /select {shard.url=127.0.0.1:29946/solr/collection1/&NOW=1348292014975&q=*:*&ids=1&distrib=false&isShard=true&wt=javabin&version=2} status=0 QTime=0 
[junit4:junit4]   2> 15661 T2319 C135 P29946 REQ /select {wt=javabin&q=*:*&version=2} hits=1 status=0 QTime=6 
[junit4:junit4]   2> 15662 T2307 oaz.ZooKeeper.<init> Initiating client connection, connectString=127.0.0.1:29943/solr sessionTimeout=10000 watcher=org.apache.solr.common.cloud.ConnectionManager@789ec0fa
[junit4:junit4]   2> 15663 T2393 oaz.ClientCnxn$SendThread.startConnect Opening socket connection to server /127.0.0.1:29943
[junit4:junit4]   2> 15663 T2307 oascc.ConnectionManager.waitForConnected Waiting for client to connect to ZooKeeper
[junit4:junit4]   2> 15663 T2393 oaz.ClientCnxn$SendThread.primeConnection Socket connection established to localhost/127.0.0.1:29943, initiating session
[junit4:junit4]   2> 15664 T2309 oazs.NIOServerCnxn$Factory.run Accepted socket connection from /140.211.11.196:29988
[junit4:junit4]   2> 15664 T2309 oazs.NIOServerCnxn.readConnectRequest Client attempting to establish new session at /140.211.11.196:29988
[junit4:junit4]   2> 15665 T2311 oazs.NIOServerCnxn.finishSessionInit Established session 0x139ec7736620009 with negotiated timeout 10000 for client /140.211.11.196:29988
[junit4:junit4]   2> 15665 T2393 oaz.ClientCnxn$SendThread.readConnectResult Session establishment complete on server localhost/127.0.0.1:29943, sessionid = 0x139ec7736620009, negotiated timeout = 10000
[junit4:junit4]   2> 15666 T2394 oascc.ConnectionManager.process Watcher org.apache.solr.common.cloud.ConnectionManager@789ec0fa name:ZooKeeperConnection Watcher:127.0.0.1:29943/solr got event WatchedEvent state:SyncConnected type:None path:null path:null type:None
[junit4:junit4]   2> 15666 T2307 oascc.ConnectionManager.waitForConnected Client is connected to ZooKeeper
[junit4:junit4]   2> 15667 T2307 oascc.ZkStateReader.createClusterStateWatchersAndUpdate Updating cluster state from ZooKeeper... 
[junit4:junit4]   2> 15668 T2312 oazs.PrepRequestProcessor.pRequest Processed session termination for sessionid: 0x139ec7736620009
[junit4:junit4]   2> 15669 T2394 oaz.ClientCnxn$EventThread.run EventThread shut down
[junit4:junit4]   2> 15669 T2307 oaz.ZooKeeper.close Session: 0x139ec7736620009 closed
[junit4:junit4]   2> 15669 T2309 oazs.NIOServerCnxn.closeSock Closed socket connection for client /140.211.11.196:29988 which had sessionid 0x139ec7736620009
[junit4:junit4]   2> 15671 T2338 C132 P29949 REQ /select {distrib=false&wt=javabin&q=*:*&version=2} hits=1 status=0 QTime=1 
[junit4:junit4]   2> 15673 T2350 C134 P29953 REQ /select {distrib=false&wt=javabin&q=*:*&version=2} hits=0 status=0 QTime=1 
[junit4:junit4]   2> 15677 T2339 C132 P29949 REQ /select {fl=id,score&shard.url=127.0.0.1:29949/solr/collection1/|127.0.0.1:29959/solr/collection1/&NOW=1348292014994&start=0&q=*:*&distrib=false&isShard=true&wt=javabin&fsv=true&rows=10&version=2} hits=1 status=0 QTime=1 
[junit4:junit4]   2> 15677 T2373 C133 P29963 REQ /select {fl=id,score&shard.url=127.0.0.1:29953/solr/collection1/|127.0.0.1:29963/solr/collection1/&NOW=1348292014994&start=0&q=*:*&distrib=false&isShard=true&wt=javabin&fsv=true&rows=10&version=2} hits=0 status=0 QTime=0 
[junit4:junit4]   2> 15680 T2339 C132 P29949 REQ /select {shard.url=127.0.0.1:29949/solr/collection1/|127.0.0.1:29959/solr/collection1/&NOW=1348292014994&q=*:*&ids=1&distrib=false&isShard=true&wt=javabin&version=2} status=0 QTime=0 
[junit4:junit4]   2> 15681 T2372 C133 P29963 REQ /select {wt=javabin&q=*:*&version=2} hits=1 status=0 QTime=7 
[junit4:junit4]   2> 15687 T2319 C135 P29946 /update {wt=javabin&version=2} {add=[2 (1413786647924834304)]} 0 3
[junit4:junit4]   2> 15700 T2371 C133 P29963 REQ /update {update.distrib=FROMLEADER&distrib.from=http://127.0.0.1:29953/solr/collection1/&wt=javabin&version=2} status=0 QTime=3 
[junit4:junit4]   2> 15700 T2349 C134 P29953 REQ /update {distrib.from=http://127.0.0.1:29949/solr/collection1/&update.distrib=TOLEADER&wt=javabin&version=2} status=0 QTime=8 
[junit4:junit4]   2> 15701 T2335 C132 P29949 /update {wt=javabin&version=2} {add=[2]} 0 11
[junit4:junit4]   2> 15705 T2319 C135 P29946 /update {wt=javabin&version=2} {add=[3 (1413786647945805824)]} 0 1
[junit4:junit4]   2> 15714 T2371 C133 P29963 REQ /update {update.distrib=FROMLEADER&distrib.from=http://127.0.0.1:29953/solr/collection1/&wt=javabin&version=2} status=0 QTime=1 
[junit4:junit4]   2> 15715 T2349 C134 P29953 REQ /update {distrib.from=http://127.0.0.1:29949/solr/collection1/&update.distrib=TOLEADER&wt=javabin&version=2} status=0 QTime=5 
[junit4:junit4]   2> 15715 T2335 C132 P29949 /update {wt=javabin&version=2} {add=[3]} 0 7
[junit4:junit4]   2> 15719 T2319 C135 P29946 /update {wt=javabin&version=2} {add=[4 (1413786647960485888)]} 0 1
[junit4:junit4]   2> 15730 T2357 C131 P29959 REQ /update {distrib.from=http://127.0.0.1:29949/solr/collection1/&update.distrib=FROMLEADER&wt=javabin&version=2} status=0 QTime=3 
[junit4:junit4]   2> 15731 T2335 C132 P29949 /update {wt=javabin&version=2} {add=[4 (1413786647964680192)]} 0 9
[junit4:junit4]   2> 15735 T2319 C135 P29946 /update {wt=javabin&version=2} {add=[5 (1413786647977263104)]} 0 1
[junit4:junit4]   2> 15744 T2371 C133 P29963 REQ /update {update.distrib=FROMLEADER&distrib.from=http://127.0.0.1:29953/solr/collection1/&wt=javabin&version=2} status=0 QTime=1 
[junit4:junit4]   2> 15745 T2349 C134 P29953 REQ /update {distrib.from=http://127.0.0.1:29949/solr/collection1/&update.distrib=TOLEADER&wt=javabin&version=2} status=0 QTime=5 
[junit4:junit4]   2> 15745 T2335 C132 P29949 /update {wt=javabin&version=2} {add=[5]} 0 7
[junit4:junit4]   2> 15749 T2319 C135 P29946 /update {wt=javabin&version=2} {add=[6 (1413786647991943168)]} 0 1
[junit4:junit4]   2> 15755 T2371 C133 P29963 REQ /update {distrib.from=http://127.0.0.1:29953/solr/collection1/&update.distrib=FROMLEADER&wt=javabin&version=2} status=0 QTime=1 
[junit4:junit4]   2> 15756 T2351 C134 P29953 /update {wt=javabin&version=2} {add=[6 (1413786647995088896)]} 0 5
[junit4:junit4]   2> 15760 T2319 C135 P29946 /update {wt=javabin&version=2} {add=[7 (1413786648002428928)]} 0 2
[junit4:junit4]   2> 15767 T2371 C133 P29963 REQ /update {distrib.from=http://127.0.0.1:29953/solr/collection1/&update.distrib=FROMLEADER&wt=javabin&version=2} status=0 QTime=1 
[junit4:junit4]   2> 15768 T2351 C134 P29953 /update {wt=javabin&version=2} {add=[7 (1413786648007671808)]} 0 5
[junit4:junit4]   2> 15773 T2319 C135 P29946 /update {wt=javabin&version=2} {add=[8 (1413786648016060416)]} 0 2
[junit4:junit4]   2> 15782 T2357 C131 P29959 REQ /update {update.distrib=FROMLEADER&distrib.from=http://127.0.0.1:29949/solr/collection1/&wt=javabin&version=2} status=0 QTime=1 
[junit4:junit4]   2> 15783 T2334 C132 P29949 REQ /update {distrib.from=http://127.0.0.1:29953/solr/collection1/&update.distrib=TOLEADER&wt=javabin&version=2} status=0 QTime=6 
[junit4:junit4]   2> 15784 T2351 C134 P29953 /update {wt=javabin&version=2} {add=[8]} 0 8
[junit4:junit4]   2> 15787 T2319 C135 P29946 /update {wt=javabin&version=2} {add=[9 (1413786648031789056)]} 0 1
[junit4:junit4]   2> 15794 T2371 C133 P29963 REQ /update {distrib.from=http://127.0.0.1:29953/solr/collection1/&update.distrib=FROMLEADER&wt=javabin&version=2} status=0 QTime=1 
[junit4:junit4]   2> 15795 T2351 C134 P29953 /update {wt=javabin&version=2} {add=[9 (1413786648035983360)]} 0 5
[junit4:junit4]   2> 15798 T2319 C135 P29946 /update {wt=javabin&version=2} {add=[10 (1413786648043323392)]} 0 1
[junit4:junit4]   2> 15804 T2357 C131 P29959 REQ /update {distrib.from=http://127.0.0.1:29949/solr/collection1/&update.distrib=FROMLEADER&wt=javabin&version=2} status=0 QTime=1 
[junit4:junit4]   2> 15805 T2335 C132 P29949 /update {wt=javabin&version=2} {add=[10 (1413786648046469120)]} 0 5
[junit4:junit4]   2> 15820 T2319 C135 P29946 /update {wt=javabin&version=2} {add=[11 (1413786648053809152)]} 0 13
[junit4:junit4]   2> 15828 T2357 C131 P29959 REQ /update {update.distrib=FROMLEADER&distrib.from=http://127.0.0.1:29949/solr/collection1/&wt=javabin&version=2} status=0 QTime=1 
[junit4:junit4]   2> 15829 T2334 C132 P29949 REQ /update {distrib.from=http://127.0.0.1:29953/solr/collection1/&update.distrib=TOLEADER&wt=javabin&version=2} status=0 QTime=5 
[junit4:junit4]   2> 15829 T2351 C134 P29953 /update {wt=javabin&version=2} {add=[11]} 0 7
[junit4:junit4]   2> 15835 T2319 C135 P29946 /update {wt=javabin&version=2} {add=[12 (1413786648080023552)]} 0 3
[junit4:junit4]   2> 15843 T2357 C131 P29959 REQ /update {update.distrib=FROMLEADER&distrib.from=http://127.0.0.1:29949/solr/collection1/&wt=javabin&version=2} status=0 QTime=1 
[junit4:junit4]   2> 15843 T2334 C132 P29949 REQ /update {distrib.from=http://127.0.0.1:29953/solr/collection1/&update.distrib=TOLEADER&wt=javabin&version=2} status=0 QTime=4 
[junit4:junit4]   2> 15844 T2351 C134 P29953 /update {wt=javabin&version=2} {add=[12]} 0 7
[junit4:junit4]   2> 15847 T2319 C135 P29946 /update {wt=javabin&version=2} {add=[13 (1413786648094703616)]} 0 1
[junit4:junit4]   2> 15857 T2357 C131 P29959 REQ /update {update.distrib=FROMLEADER&distrib.from=http://127.0.0.1:29949/solr/collection1/&wt=javabin&version=2} status=0 QTime=1 
[junit4:junit4]   2> 15858 T2334 C132 P29949 REQ /update {distrib.from=http://127.0.0.1:29953/solr/collection1/&update.distrib=TOLEADER&wt=javabin&version=2} status=0 QTime=6 
[junit4:junit4]   2> 15858 T2351 C134 P29953 /update {wt=javabin&version=2} {add=[13]} 0 8
[junit4:junit4]   2> 15863 T2319 C135 P29946 /update {wt=javabin&version=2} {add=[14 (1413786648110432256)]} 0 2
[junit4:junit4]   2> 15872 T2357 C131 P29959 REQ /update {update.distrib=FROMLEADER&distrib.from=http://127.0.0.1:29949/solr/collection1/&wt=javabin&version=2} status=0 QTime=1 
[junit4:junit4]   2> 15873 T2334 C132 P29949 REQ /update {distrib.from=http://127.0.0.1:29953/solr/collection1/&update.distrib=TOLEADER&wt=javabin&version=2} status=0 QTime=5 
[junit4:junit4]   2> 15873 T2351 C134 P29953 /update {wt=javabin&version=2} {add=[14]} 0 7
[junit4:junit4]   2> 15878 T2319 C135 P29946 /update {wt=javabin&version=2} {add=[15 (1413786648126160896)]} 0 2
[junit4:junit4]   2> 15884 T2357 C131 P29959 REQ /update {distrib.from=http://127.0.0.1:29949/solr/collection1/&update.distrib=FROMLEADER&wt=javabin&version=2} status=0 QTime=1 
[junit4:junit4]   2> 15885 T2335 C132 P29949 /update {wt=javabin&version=2} {add=[15 (1413786648130355200)]} 0 5
[junit4:junit4]   2> 15889 T2319 C135 P29946 /update {wt=javabin&version=2} {add=[16 (1413786648137695232)]} 0 2
[junit4:junit4]   2> 15895 T2357 C131 P29959 REQ /update {distrib.from=http://127.0.0.1:29949/solr/collection1/&update.distrib=FROMLEADER&wt=javabin&version=2} status=0 QTime=1 
[junit4:junit4]   2> 15896 T2335 C132 P29949 /update {wt=javabin&version=2} {add=[16 (1413786648141889536)]} 0 5
[junit4:junit4]   2> 15901 T2319 C135 P29946 /update {wt=javabin&version=2} {add=[17 (1413786648150278144)]} 0 2
[junit4:junit4]   2> 15915 T2371 C133 P29963 REQ /update {update.distrib=FROMLEADER&distrib.from=http://127.0.0.1:29953/solr/collection1/&wt=javabin&version=2} status=0 QTime=3 
[junit4:junit4]   2> 15916 T2349 C134 P29953 REQ /update {distrib.from=http://127.0.0.1:29949/solr/collection1/&update.distrib=TOLEADER&wt=javabin&version=2} status=0 QTime=9 
[junit4:junit4]   2> 15916 T2335 C132 P29949 /update {wt=javabin&version=2} {add=[17]} 0 12
[junit4:junit4]   2> 15920 T2319 C135 P29946 /update {wt=javabin&version=2} {add=[100 (1413786648171249664)]} 0 1
[junit4:junit4]   2> 15951 T2357 C131 P29959 REQ /update {update.distrib=FROMLEADER&distrib.from=http://127.0.0.1:29949/solr/collection1/&wt=javabin&version=2} status=0 QTime=12 
[junit4:junit4]   2> 15952 T2334 C132 P29949 REQ /update {distrib.from=http://127.0.0.1:29953/solr/collection1/&update.distrib=TOLEADER&wt=javabin&version=2} status=0 QTime=28 
[junit4:junit4]   2> 15953 T2351 C134 P29953 /update {wt=javabin&version=2} {add=[100]} 0 31
[junit4:junit4]   2> 15956 T2319 C135 P29946 /update {wt=javabin&version=2} {add=[101 (1413786648208998400)]} 0 1
[junit4:junit4]   2> 15965 T2357 C131 P29959 REQ /update {distrib.from=http://127.0.0.1:29949/solr/collection1/&update.distrib=FROMLEADER&wt=javabin&version=2} status=0 QTime=1 
[junit4:junit4]   2> 15966 T2335 C132 P29949 /update {wt=javabin&version=2} {add=[101 (1413786648213192704)]} 0 7
[junit4:junit4]   2> 15970 T2319 C135 P29946 /update {wt=javabin&version=2} {add=[102 (1413786648223678464)]} 0 1
[junit4:junit4]   2> 15977 T2357 C131 P29959 REQ /update {distrib.from=http://127.0.0.1:29949/solr/collection1/&update.distrib=FROMLEADER&wt=javabin&version=2} status=0 QTime=1 
[junit4:junit4]   2> 15977 T2335 C132 P29949 /update {wt=javabin&version=2} {add=[102 (1413786648226824192)]} 0 5
[junit4:junit4]   2> 15988 T2319 C135 P29946 /update {wt=javabin&version=2} {add=[103 (1413786648235212800)]} 0 8
[junit4:junit4]   2> 15997 T2371 C133 P29963 REQ /update {update.distrib=FROMLEADER&distrib.from=http://127.0.0.1:29953/solr/collection1/&wt=javabin&version=2} status=0 QTime=1 
[junit4:junit4]   2> 15998 T2349 C134 P29953 REQ /update {distrib.from=http://127.0.0.1:29949/solr/collection1/&update.distrib=TOLEADER&wt=javabin&version=2} status=0 QTime=5 
[junit4:junit4]   2> 15998 T2335 C132 P29949 /update {wt=javabin&version=2} {add=[103]} 0 7
[junit4:junit4]   2> 16003 T2319 C135 P29946 /update {wt=javabin&version=2} {add=[104 (1413786648257232896)]} 0 2
[junit4:junit4]   2> 16011 T2371 C133 P29963 REQ /update {update.distrib=FROMLEADER&distrib.from=http://127.0.0.1:29953/solr/collection1/&wt=javabin&version=2} status=0 QTime=1 
[junit4:junit4]   2> 16012 T2349 C134 P29953 REQ /update {distrib.from=http://127.0.0.1:29949/solr/collection1/&update.distrib=TOLEADER&wt=javabin&version=2} status=0 QTime=5 
[junit4:junit4]   2> 16012 T2335 C132 P29949 /update {wt=javabin&version=2} {add=[104]} 0 7
[junit4:junit4]   2> 16016 T2319 C135 P29946 /update {wt=javabin&version=2} {add=[105 (1413786648271912960)]} 0 1
[junit4:junit4]   2> 16042 T2371 C133 P29963 REQ /update {distrib.from=http://127.0.0.1:29953/solr/collection1/&update.distrib=FROMLEADER&wt=javabin&version=2} status=0 QTime=8 
[junit4:junit4]   2> 16043 T2351 C134 P29953 /update {wt=javabin&version=2} {add=[105 (1413786648276107264)]} 0 24
[junit4:junit4]   2> 16047 T2319 C135 P29946 /update {wt=javabin&version=2} {add=[106 (1413786648304418816)]} 0 1
[junit4:junit4]   2> 16059 T2371 C133 P29963 REQ /update {update.distrib=FROMLEADER&distrib.from=http://127.0.0.1:29953/solr/collection1/&wt=javabin&version=2} status=0 QTime=2 
[junit4:junit4]   2> 16060 T2349 C134 P29953 REQ /update {distrib.from=http://127.0.0.1:29949/solr/collection1/&update.distrib=TOLEADER&wt=javabin&version=2} status=0 QTime=8 
[junit4:junit4]   2> 16060 T2335 C132 P29949 /update {wt=javabin&version=2} {add=[106]} 0 10
[junit4:junit4]   2> 16064 T2319 C135 P29946 /update {wt=javabin&version=2} {add=[107 (1413786648322244608)]} 0 1
[junit4:junit4]   2> 16070 T2357 C131 P29959 REQ /update {distrib.from=http://127.0.0.1:29949/solr/collection1/&update.distrib=FROMLEADER&wt=javabin&version=2} status=0 QTime=1 
[junit4:junit4]   2> 16070 T2335 C132 P29949 /update {wt=javabin&version=2} {add=[107 (1413786648325390336)]} 0 4
[junit4:junit4]   2> 16074 T2319 C135 P29946 /update {wt=javabin&version=2} {add=[108 (1413786648332730368)]} 0 1
[junit4:junit4]   2> 16080 T2357 C131 P29959 REQ /update {distrib.from=http://127.0.0.1:29949/solr/collection1/&update.distrib=FROMLEADER&wt=javabin&version=2} status=0 QTime=1 
[junit4:junit4]   2> 16080 T2335 C132 P29949 /update {wt=javabin&version=2} {add=[108 (1413786648335876096)]} 0 4
[junit4:junit4]   2> 16084 T2319 C135 P29946 /update {wt=javabin&version=2} {add=[109 (1413786648343216128)]} 0 1
[junit4:junit4]   2> 16093 T2357 C131 P29959 REQ /update {update.distrib=FROMLEADER&distrib.from=http://127.0.0.1:29949/solr/collection1/&wt=javabin&version=2} status=0 QTime=1 
[junit4:junit4]   2> 16094 T2334 C132 P29949 REQ /update {distrib.from=http://127.0.0.1:29953/solr/collection1/&update.distrib=TOLEADER&wt=javabin&version=2} status=0 QTime=5 
[junit4:junit4]   2> 16095 T2351 C134 P29953 /update {wt=javabin&version=2} {add=[109]} 0 8
[junit4:junit4]   2> 16099 T2319 C135 P29946 /update {wt=javabin&version=2} {add=[110 (1413786648358944768)]} 0 1
[junit4:junit4]   2> 16108 T2357 C131 P29959 REQ /update {update.distrib=FROMLEADER&distrib.from=http://127.0.0.1:29949/solr/collection1/&wt=javabin&version=2} status=0 QTime=1 
[junit4:junit4]   2> 16109 T2334 C132 P29949 REQ /update {distrib.from=http://127.0.0.1:29953/solr/collection1/&update.distrib=TOLEADER&wt=javabin&version=2} status=0 QTime=5 
[junit4:junit4]   2> 16110 T2351 C134 P29953 /update {wt=javabin&version=2} {add=[110]} 0 8
[junit4:junit4]   2> 16114 T2319 C135 P29946 /update {wt=javabin&version=2} {add=[111 (1413786648374673408)]} 0 1
[junit4:junit4]   2> 16122 T2357 C131 P29959 REQ /update {distrib.from=http://127.0.0.1:29949/solr/collection1/&update.distrib=FROMLEADER&wt=javabin&version=2} status=0 QTime=2 
[junit4:junit4]   2> 16122 T2335 C132 P29949 /update {wt=javabin&version=2} {add=[111 (1413786648378867712)]} 0 5
[junit4:junit4]   2> 16126 T2319 C135 P29946 /update {wt=javabin&version=2} {add=[112 (1413786648387256320)]} 0 1
[junit4:junit4]   2> 16134 T2371 C133 P29963 REQ /update {update.distrib=FROMLEADER&distrib.from=http://127.0.0.1:29953/solr/collection1/&wt=javabin&version=2} status=0 QTime=1 
[junit4:junit4]   2> 16135 T2349 C134 P29953 REQ /update {distrib.from=http://127.0.0.1:29949/solr/collection1/&update.distrib=TOLEADER&wt=javabin&version=2} status=0 QTime=5 
[junit4:junit4]   2> 16135 T2335 C132 P29949 /update {wt=javabin&version=2} {add=[112]} 0 7
[junit4:junit4]   2> 16149 T2319 C135 P29946 /update {wt=javabin&version=2} {add=[113 (1413786648400887808)]} 0 11
[junit4:junit4]   2> 16157 T2357 C131 P29959 REQ /update {update.distrib=FROMLEADER&distrib.from=http://127.0.0.1:29949/solr/collection1/&wt=javabin&version=2} status=0 QTime=1 
[junit4:junit4]   2> 16158 T2334 C132 P29949 REQ /update {distrib.from=http://127.0.0.1:29953/solr/collection1/&update.distrib=TOLEADER&wt=javabin&version=2} status=0 QTime=5 
[junit4:junit4]   2> 16158 T2351 C134 P29953 /update {wt=javabin&version=2} {add=[113]} 0 7
[junit4:junit4]   2> 16163 T2319 C135 P29946 /update {wt=javabin&version=2} {add=[114 (1413786648425005056)]} 0 2
[junit4:junit4]   2> 16169 T2357 C131 P29959 REQ /update {distrib.from=http://127.0.0.1:29949/solr/collection1/&update.distrib=FROMLEADER&wt=javabin&version=2} status=0 QTime=1 
[junit4:junit4]   2> 16169 T2335 C132 P29949 /update {wt=javabin&version=2} {add=[114 (1413786648429199360)]} 0 4
[junit4:junit4]   2> 16173 T2319 C135 P29946 /update {wt=javabin&version=2} {add=[115 (1413786648436539392)]} 0 1
[junit4:junit4]   2> 16179 T2371 C133 P29963 REQ /update {distrib.from=http://127.0.0.1:29953/solr/collection1/&update.distrib=FROMLEADER&wt=javabin&version=2} status=0 QTime=1 
[junit4:junit4]   2> 16179 T2351 C134 P29953 /update {wt=javabin&version=2} {add=[115 (1413786648439685120)]} 0 4
[junit4:junit4]   2> 16183 T2319 C135 P29946 /update {wt=javabin&version=2} {add=[116 (1413786648447025152)]} 0 1
[junit4:junit4]   2> 16190 T2371 C133 P29963 REQ /update {distrib.from=http://127.0.0.1:29953/solr/collection1/&update.distrib=FROMLEADER&wt=javabin&version=2} status=0 QTime=2 
[junit4:junit4]   2> 16191 T2351 C134 P29953 /update {wt=javabin&version=2} {add=[116 (1413786648450170880)]} 0 6
[junit4:junit4]   2> 16197 T2319 C135 P29946 /update {wt=javabin&version=2} {add=[117 (1413786648460656640)]} 0 3
[junit4:junit4]   2> 16210 T2371 C133 P29963 REQ /update {update.distrib=FROMLEADER&distrib.from=http://127.0.0.1:29953/solr/collection1/&wt=javabin&version=2} status=0 QTime=2 
[junit4:junit4]   2> 16211 T2349 C134 P29953 REQ /update {distrib.from=http://127.0.0.1:29949/solr/collection1/&update.distrib=TOLEADER&wt=javabin&version=2} status=0 QTime=7 
[junit4:junit4]   2> 16212 T2335 C132 P29949 /update {wt=javabin&version=2} {add=[117]} 0 11
[junit4:junit4]   2> 16216 T2319 C135 P29946 /update {wt=javabin&version=2} {add=[118 (1413786648481628160)]} 0 1
[junit4:junit4]   2> 16249 T2357 C131 P29959 REQ /update {update.distrib=FROMLEADER&distrib.from=http://127.0.0.1:29949/solr/collection1/&wt=javabin&version=2} status=0 QTime=16 
[junit4:junit4]   2> 16250 T2334 C132 P29949 REQ /update {distrib.from=http://127.0.0.1:29953/solr/collection1/&update.distrib=TOLEADER&wt=javabin&version=2} status=0 QTime=29 
[junit4:junit4]   2> 16251 T2351 C134 P29953 /update {wt=javabin&version=2} {add=[118]} 0 32
[junit4:junit4]   2> 16256 T2319 C135 P29946 /update {wt=javabin&version=2} {add=[119 (1413786648522522624)]} 0 2
[junit4:junit4]   2> 16266 T2371 C133 P29963 REQ /update {update.distrib=FROMLEADER&distrib.from=http://127.0.0.1:29953/solr/collection1/&wt=javabin&version=2} status=0 QTime=1 
[junit4:junit4]   2> 16267 T2349 C134 P29953 REQ /update {distrib.from=http://127.0.0.1:29949/solr/collection1/&update.distrib=TOLEADER&wt=javabin&version=2} status=0 QTime=6 
[junit4:junit4]   2> 16268 T2335 C132 P29949 /update {wt=javabin&version=2} {add=[119]} 0 9
[junit4:junit4]   2> 16273 T2319 C135 P29946 /update {wt=javabin&version=2} {add=[120 (1413786648540348416)]} 0 2
[junit4:junit4]   2> 16284 T2371 C133 P29963 REQ /update {update.distrib=FROMLEADER&distrib.from=http://127.0.0.1:29953/solr/collection1/&wt=javabin&version=2} status=0 QTime=2 
[junit4:junit4]   2> 16285 T2349 C134 P29953 REQ /update {distrib.from=http://127.0.0.1:29949/solr/collection1/&update.distrib=TOLEADER&wt=javabin&version=2} status=0 QTime=7 
[junit4:junit4]   2> 16286 T2335 C132 P29949 /update {wt=javabin&version=2} {add=[120]} 0 10
[junit4:junit4]   2> 16290 T2319 C135 P29946 /update {wt=javabin&version=2} {add=[121 (1413786648558174208)]} 0 2
[junit4:junit4]   2> 16298 T2371 C133 P29963 REQ /update {distrib.from=http://127.0.0.1:29953/solr/collection1/&update.distrib=FROMLEADER&wt=javabin&version=2} status=0 QTime=1 
[junit4:junit4]   2> 16299 T2351 C134 P29953 /update {wt=javabin&version=2} {add=[121 (1413786648562368512)]} 0 7
[junit4:junit4]   2> 16304 T2319 C135 P29946 /update {wt=javabin&version=2} {add=[122 (1413786648572854272)]} 0 2
[junit4:junit4]   2> 16316 T2357 C131 P29959 REQ /update {update.distrib=FROMLEADER&distrib.from=http://127.0.0.1:29949/solr/collection1/&wt=javabin&version=2} status=0 QTime=2 
[junit4:junit4]   2> 16317 T2334 C132 P29949 REQ /update {distrib.from=http://127.0.0.1:29953/solr/collection1/&update.distrib=TOLEADER&wt=javabin&version=2} status=0 QTime=8 
[junit4:junit4]   2> 16318 T2351 C134 P29953 /update {wt=javabin&version=2} {add=[122]} 0 11
[junit4:junit4]   2> 16338 T2319 C135 P29946 /update {wt=javabin&version=2} {add=[123 (1413786648592777216)]} 0 17
[junit4:junit4]   2> 16346 T2357 C131 P29959 REQ /update {distrib.from=http://127.0.0.1:29949/solr/collection1/&update.distrib=FROMLEADER&wt=javabin&version=2} status=0 QTime=1 
[junit4:junit4]   2> 16347 T2335 C132 P29949 /update {wt=javabin&version=2} {add=[123 (1413786648613748736)]} 0 6
[junit4:junit4]   2> 16353 T2319 C135 P29946 /update {wt=javabin&version=2} {add=[124 (1413786648623185920)]} 0 3
[junit4:junit4]   2> 16361 T2357 C131 P29959 REQ /update {distrib.from=http://127.0.0.1:29949/solr/collection1/&update.distrib=FROMLEADER&wt=javabin&version=2} status=0 QTime=1 
[junit4:junit4]   2> 16362 T2335 C132 P29949 /update {wt=javabin&version=2} {add=[124 (1413786648629477376)]} 0 6
[junit4:junit4]   2> 16367 T2319 C135 P29946 /update {wt=javabin&version=2} {add=[125 (1413786648638914560)]} 0 2
[junit4:junit4]   2> 16376 T2357 C131 P29959 REQ /update {update.distrib=FROMLEADER&distrib.from=http://127.0.0.1:29949/solr/collection1/&wt=javabin&version=2} status=0 QTime=1 
[junit4:junit4]   2> 16377 T2334 C132 P29949 REQ /update {distrib.from=http://127.0.0.1:29953/solr/collection1/&update.distrib=TOLEADER&wt=javabin&version=2} status=0 QTime=5 
[junit4:junit4]   2> 16378 T2351 C134 P29953 /update {wt=javabin&version=2} {add=[125]} 0 8
[junit4:junit4]   2> 16383 T2319 C135 P29946 /update {wt=javabin&version=2} {add=[126 (1413786648655691776)]} 0 2
[junit4:junit4]   2> 16390 T2371 C133 P29963 REQ /update {distrib.from=http://127.0.0.1:29953/solr/collection1/&update.distrib=FROMLEADER&wt=javabin&version=2} status=0 QTime=1 
[junit4:junit4]   2> 16391 T2351 C134 P29953 /update {wt=javabin&version=2} {add=[126 (1413786648660934656)]} 0 5
[junit4:junit4]   2> 16395 T2319 C135 P29946 /update {wt=javabin&version=2} {add=[127 (1413786648669323264)]} 0 1
[junit4:junit4]   2> 16430 T2371 C133 P29963 REQ /update {update.distrib=FROMLEADER&distrib.from=http://127.0.0.1:29953/solr/collection1/&wt=javabin&version=2} status=0 QTime=11 
[junit4:junit4]   2> 16431 T2349 C134 P29953 REQ /update {distrib.from=http://127.0.0.1:29949/solr/collection1/&update.distrib=TOLEADER&wt=javabin&version=2} status=0 QTime=30 
[junit4:junit4]   2> 16432 T2335 C132 P29949 /update {wt=javabin&version=2} {add=[127]} 0 33
[junit4:junit4]   2> 16436 T2319 C135 P29946 /update {wt=javabin&version=2} {add=[128 (1413786648712314880)]} 0 1
[junit4:junit4]   2> 16449 T2371 C133 P29963 REQ /update {update.distrib=FROMLEADER&distrib.from=http://127.0.0.1:29953/solr/collection1/&wt=javabin&version=2} status=0 QTime=2 
[junit4:junit4]   2> 16450 T2349 C134 P29953 REQ /update {distrib.from=http://127.0.0.1:29949/solr/collection1/&update.distrib=TOLEADER&wt=javabin&version=2} status=0 QTime=8 
[junit4:junit4]   2> 16451 T2335 C132 P29949 /update {wt=javabin&version=2} {add=[128]} 0 12
[junit4:junit4]   2> 16455 T2319 C135 P29946 /update {wt=javabin&version=2} {add=[129 (1413786648732237824)]} 0 1
[junit4:junit4]   2> 16464 T2357 C131 P29959 REQ /update {update.distrib=FROMLEADER&distrib.from=http://127.0.0.1:29949/solr/collection1/&wt=javabin&version=2} status=0 QTime=1 
[junit4:junit4]   2> 16465 T2334 C132 P29949 REQ /update {distrib.from=http://127.0.0.1:29953/solr/collection1/&update.distrib=TOLEADER&wt=javabin&version=2} status=0 QTime=5 
[junit4:junit4]   2> 16465 T2351 C134 P29953 /update {wt=javabin&version=2} {add=[129]} 0 7
[junit4:junit4]   2> 16469 T2319 C135 P29946 /update {wt=javabin&version=2} {add=[130 (1413786648746917888)]} 0 1
[junit4:junit4]   2> 16479 T2371 C133 P29963 REQ /update {update.distrib=FROMLEADER&distrib.from=http://127.0.0.1:29953/solr/collection1/&wt=javabin&version=2} status=0 QTime=1 
[junit4:junit4]   2> 16480 T2349 C134 P29953 REQ /update {distrib.from=http://127.0.0.1:29949/solr/collection1/&update.distrib=TOLEADER&wt=javabin&version=2} status=0 QTime=6 
[junit4:junit4]   2> 16481 T2335 C132 P29949 /update {wt=javabin&version=2} {add=[130]} 0 9
[junit4:junit4]   2> 16485 T2319 C135 P29946 /update {wt=javabin&version=2} {add=[131 (1413786648763695104)]} 0 1
[junit4:junit4]   2> 16495 T2371 C133 P29963 REQ /update {update.distrib=FROMLEADER&distrib.from=http://127.0.0.1:29953/solr/collection1/&wt=javabin&version=2} status=0 QTime=1 
[junit4:junit4]   2> 16496 T2349 C134 P29953 REQ /update {distrib.from=http://127.0.0.1:29949/solr/collection1/&update.distrib=TOLEADER&wt=javabin&version=2} status=0 QTime=6 
[junit4:junit4]   2> 16496 T2335 C132 P29949 /update {wt=javabin&version=2} {add=[131]} 0 8
[junit4:junit4]   2> 16500 T2319 C135 P29946 /update {wt=javabin&version=2} {add=[132 (1413786648779423744)]} 0 1
[junit4:junit4]   2> 16507 T2357 C131 P29959 REQ /update {distrib.from=http://127.0.0.1:29949/solr/collection1/&update.distrib=FROMLEADER&wt=javabin&version=2} status=0 QTime=1 
[junit4:junit4]   2> 16507 T2335 C132 P29949 /update {wt=javabin&version=2} {add=[132 (1413786648783618048)]} 0 4
[junit4:junit4]   2> 16520 T2319 C135 P29946 /update {wt=javabin&version=2} {add=[133 (1413786648790958080)]} 0 10
[junit4:junit4]   2> 16530 T2357 C131 P29959 REQ /update {update.distrib=FROMLEADER&distrib.from=http://127.0.0.1:29949/solr/collection1/&wt=javabin&version=2} status=0 QTime=1 
[junit4:junit4]   2> 16531 T2334 C132 P29949 REQ /update {distrib.from=http://127.0.0.1:29953/solr/collection1/&update.distrib=TOLEADER&wt=javabin&version=2} status=0 QTime=5 
[junit4:junit4]   2> 16531 T2351 C134 P29953 /update {wt=javabin&version=2} {add=[133]} 0 8
[junit4:junit4]   2> 16536 T2319 C135 P29946 /update {wt=javabin&version=2} {add=[134 (1413786648816123904)]} 0 2
[junit4:junit4]   2> 16544 T2371 C133 P29963 REQ /update {update.distrib=FROMLEADER&distrib.from=http://127.0.0.1:29953/solr/collection1/&wt=javabin&version=2} status=0 QTime=1 
[junit4:junit4]   2> 16544 T2349 C134 P29953 REQ /update {distrib.from=http://127.0.0.1:29949/solr/collection1/&update.distrib=TOLEADER&wt=javabin&version=2} status=0 QTime=4 
[junit4:junit4]   2> 16545 T2335 C132 P29949 /update {wt=javabin&version=2} {add=[134]} 0 7
[junit4:junit4]   2> 16549 T2319 C135 P29946 /update {wt=javabin&version=2} {add=[135 (1413786648830803968)]} 0 1
[junit4:junit4]   2> 16558 T2357 C131 P29959 REQ /update {update.distrib=FROMLEADER&distrib.from=http://127.0.0.1:29949/solr/collection1/&wt=javabin&version=2} status=0 QTime=1 
[junit4:junit4]   2> 16559 T2334 C132 P29949 REQ /update {distrib.from=http://127.0.0.1:29953/solr/collection1/&update.distrib=TOLEADER&wt=javabin&version=2} status=0 QTime=5 
[junit4:junit4]   2> 16560 T2351 C134 P29953 /update {wt=javabin&version=2} {add=[135]} 0 7
[junit4:junit4]   2> 16563 T2319 C135 P29946 /update {wt=javabin&version=2} {add=[136 (1413786648845484032)]} 0 1
[junit4:junit4]   2> 16571 T2371 C133 P29963 REQ /update {update.distrib=FROMLEADER&distrib.from=http://127.0.0.1:29953/solr/collection1/&wt=javabin&version=2} status=0 QTime=1 
[junit4:junit4]   2> 16571 T2349 C134 P29953 REQ /update {distrib.from=http://127.0.0.1:29949/solr/collection1/&update.distrib=TOLEADER&wt=javabin&version=2} status=0 QTime=4 
[junit4:junit4]   2> 16572 T2335 C132 P29949 /update {wt=javabin&version=2} {add=[136]} 0 7
[junit4:junit4]   2> 16576 T2319 C135 P29946 /update {wt=javabin&version=2} {add=[137 (1413786648859115520)]} 0 1
[junit4:junit4]   2> 16583 T2371 C133 P29963 REQ /update {update.distrib=FROMLEADER&distrib.from=http://127.0.0.1:29953/solr/collection1/&wt=javabin&version=2} status=0 QTime=0 
[junit4:junit4]   2> 16584 T2349 C134 P29953 REQ /update {distrib.from=http://127.0.0.1:29949/solr/collection1/&update.distrib=TOLEADER&wt=javabin&version=2} status=0 QTime=4 
[junit4:junit4]   2> 16584 T2335 C132 P29949 /update {wt=javabin&version=2} {add=[137]} 0 6
[junit4:junit4]   2> 16588 T2319 C135 P29946 /update {wt=javabin&version=2} {add=[138 (1413786648871698432)]} 0 1
[junit4:junit4]   2> 16594 T2357 C131 P29959 REQ /update {distrib.from=http://127.0.0.1:29949/solr/collection1/&update.distrib=FROMLEADER&wt=javabin&version=2} status=0 QTime=1 
[junit4:junit4]   2> 16594 T2335 C132 P29949 /update {wt=javabin&version=2} {add=[138 (1413786648874844160)]} 0 4
[junit4:junit4]   2> 16598 T2319 C135 P29946 /update {wt=javabin&version=2} {add=[139 (1413786648882184192)]} 0 1
[junit4:junit4]   2> 16605 T2371 C133 P29963 REQ /update {update.distrib=FROMLEADER&distrib.from=http://127.0.0.1:29953/solr/collection1/&wt=javabin&version=2} status=0 QTime=0 
[junit4:junit4]   2> 16606 T2349 C134 P29953 REQ /update {distrib.from=http://127.0.0.1:29949/solr/collection1/&update.distrib=TOLEADER&wt=javabin&version=2} status=0 QTime=4 
[junit4:junit4]   2> 16606 T2335 C132 P29949 /update {wt=javabin&version=2} {add=[139]} 0 6
[junit4:junit4]   2> 16610 T2319 C135 P29946 /update {wt=javabin&version=2} {add=[140 (1413786648894767104)]} 0 1
[junit4:junit4]   2> 16617 T2371 C133 P29963 REQ /update {update.distrib=FROMLEADER&distrib.from=http://127.0.0.1:29953/solr/collection1/&wt=javabin&version=2} status=0 QTime=0 
[junit4:junit4]   2> 16618 T2349 C134 P29953 REQ /update {distrib.from=http://127.0.0.1:29949/solr/collection1/&update.distrib=TOLEADER&wt=javabin&version=2} status=0 QTime=4 
[junit4:junit4]   2> 16618 T2335 C132 P29949 /update {wt=javabin&version=2} {add=[140]} 0 6
[junit4:junit4]   2> 16622 T2319 C135 P29946 /update {wt=javabin&version=2} {add=[141 (1413786648907350016)]} 0 1
[junit4:junit4]   2> 16628 T2371 C133 P29963 REQ /update {update.distrib=FROMLEADER&distrib.from=http://127.0.0.1:29953/solr/collection1/&wt=javabin&version=2} status=0 QTime=0 
[junit4:junit4]   2> 16629 T2349 C134 P29953 REQ /update {distrib.from=http://127.0.0.1:29949/solr/collection1/&update.distrib=TOLEADER&wt=javabin&version=2} status=0 QTime=3 
[junit4:junit4]   2> 16629 T2335 C132 P29949 /update {wt=javabin&version=2} {add=[141]} 0 5
[junit4:junit4]   2> 16633 T2319 C135 P29946 /update {wt=javabin&version=2} {add=[142 (1413786648918884352)]} 0 1
[junit4:junit4]   2> 16655 T2371 C133 P29963 REQ /update {update.distrib=FROMLEADER&distrib.from=http://127.0.0.1:29953/solr/collection1/&wt=javabin&version=2} status=0 QTime=10 
[junit4:junit4]   2> 16655 T2349 C134 P29953 REQ /update {distrib.from=http://127.0.0.1:29949/solr/collection1/&update.distrib=TOLEADER&wt=javabin&version=2} status=0 QTime=18 
[junit4:junit4]   2> 16656 T2335 C132 P29949 /update {wt=javabin&version=2} {add=[142]} 0 21
[junit4:junit4]   2> 16669 T2319 C135 P29946 /update {wt=javabin&version=2} {add=[143 (1413786648947195904)]} 0 10
[junit4:junit4]   2> 16679 T2371 C133 P29963 REQ /update {distrib.from=http://127.0.0.1:29953/solr/collection1/&update.distrib=FROMLEADER&wt=javabin&version=2} status=0 QTime=2 
[junit4:junit4]   2> 16679 T2351 C134 P29953 /update {wt=javabin&version=2} {add=[143 (1413786648960827392)]} 0 7
[junit4:junit4]   2> 16684 T2319 C135 P29946 /update {wt=javabin&version=2} {add=[144 (1413786648971313152)]} 0 2
[junit4:junit4]   2> 16693 T2371 C133 P29963 REQ /update {update.distrib=FROMLEADER&distrib.from=http://127.0.0.1:29953/solr/collection1/&wt=javabin&version=2} status=0 QTime=1 
[junit4:junit4]   2> 16694 T2349 C134 P29953 REQ /update {distrib.from=http://127.0.0.1:29949/solr/collection1/&update.distrib=TOLEADER&wt=javabin&version=2} status=0 QTime=5 
[junit4:junit4]   2> 16694 T2335 C132 P29949 /update {wt=javabin&version=2} {add=[144]} 0 7
[junit4:junit4]   2> 16698 T2319 C135 P29946 /update {wt=javabin&version=2} {add=[145 (1413786648987041792)]} 0 1
[junit4:junit4]   2> 16705 T2371 C133 P29963 REQ /update {distrib.from=http://127.0.0.1:29953/solr/collection1/&update.distrib=FROMLEADER&wt=javabin&version=2} status=0 QTime=1 
[junit4:junit4]   2> 16706 T2351 C134 P29953 /update {wt=javabin&version=2} {add=[145 (1413786648991236096)]} 0 4
[junit4:junit4]   2> 16709 T2319 C135 P29946 /update {wt=javabin&version=2} {add=[146 (1413786648998576128)]} 0 1
[junit4:junit4]   2> 16734 T2357 C131 P29959 REQ /update {distrib.from=http://127.0.0.1:29949/solr/collection1/&update.distrib=FROMLEADER&wt=javabin&version=2} status=0 QTime=9 
[junit4:junit4]   2> 16735 T2335 C132 P29949 /update {wt=javabin&version=2} {add=[146 (1413786649002770432)]} 0 23
[junit4:junit4]   2> 16739 T2319 C135 P29946 /update {wt=javabin&version=2} {add=[147 (1413786649030033408)]} 0 1
[junit4:junit4]   2> 16746 T2371 C133 P29963 REQ /update {distrib.from=http://127.0.0.1:29953/solr/collection1/&update.distrib=FROMLEADER&wt=javabin&version=2} status=0 QTime=1 
[junit4:junit4]   2> 16746 T2351 C134 P29953 /update {wt=javabin&version=2} {add=[147 (1413786649034227712)]} 0 4
[junit4:junit4]   2> 16750 T2319 C135 P29946 /update {wt=javabin&version=2} {add=[148 (1413786649041567744)]} 0 1
[junit4:junit4]   2> 16758 T2357 C131 P29959 REQ /update {distrib.from=http://127.0.0.1:29949/solr/collection1/&update.distrib=FROMLEADER&wt=javabin&version=2} status=0 QTime=1 
[junit4:junit4]   2> 16759 T2335 C132 P29949 /update {wt=javabin&version=2} {add=[148 (1413786649045762048)]} 0 6
[junit4:junit4]   2> 16763 T2319 C135 P29946 /update {wt=javabin&version=2} {add=[149 (1413786649055199232)]} 0 1
[junit4:junit4]   2> 16772 T2371 C133 P29963 REQ /update {update.distrib=FROMLEADER&distrib.from=http://127.0.0.1:29953/solr/collection1/&wt=javabin&version=2} status=0 QTime=1 
[junit4:junit4]   2> 16773 T2349 C134 P29953 REQ /update {distrib.from=http://127.0.0.1:29949/solr/collection1/&update.distrib=TOLEADER&wt=javabin&version=2} status=0 QTime=5 
[junit4:junit4]   2> 16773 T2335 C132 P29949 /update {wt=javabin&version=2} {add=[149]} 0 7
[junit4:junit4]   2> 16774 T2307 oasc.AbstractDistribZkTestBase.waitForRecoveriesToFinish Wait for recoveries to finish - collection: collection1 failOnTimeout:true timeout (sec):1800
[junit4:junit4]   2> 16774 T2307 oascc.ZkStateReader.updateClusterState Updating cloud state from ZooKeeper... 
[junit4:junit4]   2> 16777 T2319 C135 P29946 oasu.DirectUpdateHandler2.commit start commit{flags=0,_version_=0,optimize=false,openSearcher=true,waitSearcher=true,expungeDeletes=false,softCommit=false}
[junit4:junit4]   2> 17346 T2319 C135 P29946 oasc.SolrDeletionPolicy.onCommit SolrDeletionPolicy.onCommit: commits:num=2
[junit4:junit4]   2> 		commit{dir=NRTCachingDirectory(org.apache.lucene.store.NIOFSDirectory@/usr/home/hudson/hudson-slave/workspace/Lucene-Solr-Tests-4.x-Java6/solr/build/solr-core/test/J1/org.apache.solr.cloud.BasicDistributedZk2Test-1348291999324/control/data/index lockFactory=org.apache.lucene.store.NativeFSLockFactory@26fe0b1a; maxCacheMB=48.0 maxMergeSizeMB=4.0),segFN=segments_2,generation=2,filenames=[_0_Asserting_0.tim, _0_Asserting_0.tip, _0_MockVariableIntBlock_0.doc, _0_TestBloomFilteredLucene40Postings_0.prx, _0_MockVariableIntBlock_0.skp, _0_NestedPulsing_0.tip, _0_NestedPulsing_0.tim, _0_Asserting_0.prx, _0_MockVariableIntBlock_0.pyl, _0_MockVariableIntBlock_0.tib, _0_MockVariableIntBlock_0.pos, _0_TestBloomFilteredLucene40Postings_0.frq, _0.si, _0_MockVariableIntBlock_0.tii, _0_TestBloomFilteredLucene40Postings_0.tim, _0_TestBloomFilteredLucene40Postings_0.tip, _0_TestBloomFilteredLucene40Postings_0.blm, _0.fnm, _0_NestedPulsing_0.frq, _0_nrm.cfs, _0_NestedPulsing_0.prx, _0_Asserting_0.frq, _0_MockVariableIntBlock_0.frq, _0_nrm.cfe, segments_2, _0.fdx, _0.fdt]
[junit4:junit4]   2> 		commit{dir=NRTCachingDirectory(org.apache.lucene.store.NIOFSDirectory@/usr/home/hudson/hudson-slave/workspace/Lucene-Solr-Tests-4.x-Java6/solr/build/solr-core/test/J1/org.apache.solr.cloud.BasicDistributedZk2Test-1348291999324/control/data/index lockFactory=org.apache.lucene.store.NativeFSLockFactory@26fe0b1a; maxCacheMB=48.0 maxMergeSizeMB=4.0),segFN=segments_3,generation=3,filenames=[_5_nrm.cfe, _4_TestBloomFilteredLucene40Postings_0.frq, _1_NestedPulsing_0.tip, _2_NestedPulsing_0.tim, _5_NestedPulsing_0.tip, _5_NestedPulsing_0.tim, _3_TestBloomFilteredLucene40Postings_0.prx, _3_MockVariableIntBlock_0.frq, _2_TestBloomFilteredLucene40Postings_0.blm, _7.si, _7_TestBloomFilteredLucene40Postings_0.tip, _3.fdt, _4_MockVariableIntBlock_0.tii, _3_NestedPulsing_0.prx, _7_TestBloomFilteredLucene40Postings_0.tim, _7.fnm, _1_Asserting_0.tim, _7_NestedPulsing_0.frq, _6_NestedPulsing_0.prx, _1_Asserting_0.tip, _0_TestBloomFilteredLucene40Postings_0.frq, _5_MockVariableIntBlock_0.tii, _1_NestedPulsing_0.tim, _3_TestBloomFilteredLucene40Postings_0.frq, _2_NestedPulsing_0.tip, _6_MockVariableIntBlock_0.tii, _3_TestBloomFilteredLucene40Postings_0.tim, _0_TestBloomFilteredLucene40Postings_0.blm, _6_MockVariableIntBlock_0.tib, _1_MockVariableIntBlock_0.tii, _4_MockVariableIntBlock_0.doc, _2.fdt, _3_NestedPulsing_0.tim, _7.fdx, _7_MockVariableIntBlock_0.frq, _3_TestBloomFilteredLucene40Postings_0.tip, _2.fdx, _7.fdt, _1_MockVariableIntBlock_0.tib, _5_TestBloomFilteredLucene40Postings_0.frq, _1.fdx, _2_Asserting_0.tim, _0_Asserting_0.frq, _4_MockVariableIntBlock_0.tib, _2_Asserting_0.tip, _5_nrm.cfs, _1.fdt, _3_NestedPulsing_0.tip, _7_NestedPulsing_0.tim

[...truncated too long message...]

hudson-slave/workspace/Lucene-Solr-Tests-4.x-Java6/solr/build/solr-core/test/J1/org.apache.solr.cloud.BasicDistributedZk2Test-1348291999324/jetty4/index does not exist
[junit4:junit4]   2> 	at org.apache.commons.io.FileUtils.sizeOfDirectory(FileUtils.java:2074)
[junit4:junit4]   2> 	at org.apache.solr.handler.ReplicationHandler.getIndexSize(ReplicationHandler.java:477)
[junit4:junit4]   2> 	at org.apache.solr.handler.ReplicationHandler.getStatistics(ReplicationHandler.java:525)
[junit4:junit4]   2> 	at org.apache.solr.core.RequestHandlers$LazyRequestHandlerWrapper.getStatistics(RequestHandlers.java:310)
[junit4:junit4]   2> 	at org.apache.solr.core.JmxMonitoredMap$SolrDynamicMBean.getMBeanInfo(JmxMonitoredMap.java:231)
[junit4:junit4]   2> 	at com.sun.jmx.interceptor.DefaultMBeanServerInterceptor.getClassName(DefaultMBeanServerInterceptor.java:1824)
[junit4:junit4]   2> 	at com.sun.jmx.interceptor.DefaultMBeanServerInterceptor.safeGetClassName(DefaultMBeanServerInterceptor.java:1661)
[junit4:junit4]   2> 	at com.sun.jmx.interceptor.DefaultMBeanServerInterceptor.checkMBeanPermission(DefaultMBeanServerInterceptor.java:1833)
[junit4:junit4]   2> 	at com.sun.jmx.interceptor.DefaultMBeanServerInterceptor.exclusiveUnregisterMBean(DefaultMBeanServerInterceptor.java:436)
[junit4:junit4]   2> 	at com.sun.jmx.interceptor.DefaultMBeanServerInterceptor.unregisterMBean(DefaultMBeanServerInterceptor.java:421)
[junit4:junit4]   2> 	at com.sun.jmx.mbeanserver.JmxMBeanServer.unregisterMBean(JmxMBeanServer.java:540)
[junit4:junit4]   2> 	at org.apache.solr.core.JmxMonitoredMap.unregister(JmxMonitoredMap.java:175)
[junit4:junit4]   2> 	at org.apache.solr.core.JmxMonitoredMap.clear(JmxMonitoredMap.java:116)
[junit4:junit4]   2> 	at org.apache.solr.core.SolrCore.close(SolrCore.java:864)
[junit4:junit4]   2> 	at org.apache.solr.cloud.ShardLeaderElectionContext.runLeaderProcess(ElectionContext.java:213)
[junit4:junit4]   2> 	at org.apache.solr.cloud.LeaderElector.runIamLeaderProcess(LeaderElector.java:158)
[junit4:junit4]   2> 	at org.apache.solr.cloud.LeaderElector.checkIfIamLeader(LeaderElector.java:102)
[junit4:junit4]   2> 	at org.apache.solr.cloud.LeaderElector.access$000(LeaderElector.java:56)
[junit4:junit4]   2> 	at org.apache.solr.cloud.LeaderElector$1.process(LeaderElector.java:131)
[junit4:junit4]   2> 	at org.apache.zookeeper.ClientCnxn$EventThread.processEvent(ClientCnxn.java:526)
[junit4:junit4]   2> 	at org.apache.zookeeper.ClientCnxn$EventThread.run(ClientCnxn.java:502)
[junit4:junit4]   2> 
[junit4:junit4]   2> 307167 T2379 oasc.SolrCore.closeSearcher [collection1] Closing main searcher on request.
[junit4:junit4]   2> 307171 T2379 oasu.DirectUpdateHandler2.close closing DirectUpdateHandler2{commits=5,autocommits=0,soft autocommits=0,optimizes=0,rollbacks=0,expungeDeletes=0,docsPending=0,adds=0,deletesById=0,deletesByQuery=0,errors=0,cumulative_adds=35,cumulative_deletesById=0,cumulative_deletesByQuery=0,cumulative_errors=0}
[junit4:junit4]   2> 307172 T2379 oasu.DefaultSolrCoreState.decref SolrCoreState ref count has reached 0 - closing IndexWriter
[junit4:junit4]   2> 307175 T2379 oasu.DefaultSolrCoreState.decref Closing SolrCoreState - canceling any ongoing recovery
[junit4:junit4]   2> 307175 T2379 oascc.ZkStateReader$3.process Updating live nodes
[junit4:junit4]   2> 307175 T2379 oascc.ZkStateReader$3.process WARNING ZooKeeper watch triggered, but Solr cannot talk to ZK
[junit4:junit4]   2> 307175 T2379 oascc.ZkStateReader$2.process A cluster state change has occurred - updating...
[junit4:junit4]   2> 307175 T2379 oascc.ZkStateReader$2.process WARNING ZooKeeper watch triggered, but Solr cannot talk to ZK
[junit4:junit4]   2> 307176 T2379 oascc.ConnectionManager.process Watcher org.apache.solr.common.cloud.ConnectionManager@530a05e5 name:ZooKeeperConnection Watcher:127.0.0.1:29943/solr got event WatchedEvent state:Disconnected type:None path:null path:null type:None
[junit4:junit4]   2> 307176 T2379 oascc.ConnectionManager.process Client->ZooKeeper status change trigger but we are already closed
[junit4:junit4]   2> 307176 T2379 oaz.ClientCnxn$EventThread.run EventThread shut down
[junit4:junit4]   2> NOTE: test params are: codec=Lucene40: {n_f1=PostingsFormat(name=NestedPulsing), foo_b=PostingsFormat(name=Asserting), foo_d=MockVariableIntBlock(baseBlockSize=31), foo_f=PostingsFormat(name=Asserting), n_tl1=PostingsFormat(name=NestedPulsing), n_d1=PostingsFormat(name=TestBloomFilteredLucene40Postings), rnd_b=MockVariableIntBlock(baseBlockSize=31), intDefault=PostingsFormat(name=NestedPulsing), n_td1=PostingsFormat(name=NestedPulsing), id=MockVariableIntBlock(baseBlockSize=31), timestamp=PostingsFormat(name=TestBloomFilteredLucene40Postings), range_facet_sl=MockVariableIntBlock(baseBlockSize=31), range_facet_si=PostingsFormat(name=TestBloomFilteredLucene40Postings), oddField_s=MockVariableIntBlock(baseBlockSize=31), multiDefault=PostingsFormat(name=TestBloomFilteredLucene40Postings), n_tf1=PostingsFormat(name=TestBloomFilteredLucene40Postings), n_dt1=PostingsFormat(name=NestedPulsing), n_ti1=MockVariableIntBlock(baseBlockSize=31), range_facet_l=PostingsFormat(name=TestBloomFilteredLucene40Postings), text=PostingsFormat(name=Asserting), _version_=PostingsFormat(name=NestedPulsing), SubjectTerms_mfacet=PostingsFormat(name=NestedPulsing), a_t=PostingsFormat(name=TestBloomFilteredLucene40Postings), n_tdt1=PostingsFormat(name=NestedPulsing), other_tl1=PostingsFormat(name=NestedPulsing), n_l1=PostingsFormat(name=TestBloomFilteredLucene40Postings), a_si=PostingsFormat(name=NestedPulsing)}, sim=RandomSimilarityProvider(queryNorm=false,coord=crazy): {}, locale=et, timezone=Singapore
[junit4:junit4]   2> NOTE: FreeBSD 9.0-RELEASE amd64/Sun Microsystems Inc. 1.6.0_32 (64-bit)/cpus=16,threads=2,free=50421792,total=226361344
[junit4:junit4]   2> NOTE: All tests run in this JVM: [TestPhraseSuggestions, TestDistributedSearch, ZkNodePropsTest, IndexReaderFactoryTest, EchoParamsTest, StandardRequestHandlerTest, TestPluginEnable, TestPropInject, TestCharFilters, TestSort, DOMUtilTest, TestSolrXMLSerializer, TestQueryUtils, TestReversedWildcardFilterFactory, TestUpdate, TimeZoneUtilsTest, TestStressRecovery, TestFoldingMultitermQuery, OverseerTest, QueryParsingTest, TestMultiCoreConfBootstrap, DirectUpdateHandlerTest, XsltUpdateRequestHandlerTest, FileUtilsTest, TestUtils, TestCSVLoader, QueryEqualityTest, IndexSchemaTest, TestHashPartitioner, SuggesterTSTTest, SolrCoreTest, RAMDirectoryFactoryTest, PingRequestHandlerTest, TestMergePolicyConfig, TestCSVResponseWriter, URLClassifyProcessorTest, DistributedQueryElevationComponentTest, OpenExchangeRatesOrgProviderTest, TestJmxIntegration, TestDocumentBuilder, ConvertedLegacyTest, TestLRUCache, SuggesterTest, TestCollationKeyRangeQueries, ShowFileRequestHandlerTest, TestWriterPerf, FullSolrCloudDistribCmdsTest, PeerSyncTest, PolyFieldTest, LeaderElectionTest, BadIndexSchemaTest, ReturnFieldsTest, TestFunctionQuery, StatsComponentTest, RecoveryZkTest, DistributedSpellCheckComponentTest, TestDistributedGrouping, BasicZkTest, TestFaceting, TestJoin, FileBasedSpellCheckerTest, QueryElevationComponentTest, SortByFunctionTest, BasicFunctionalityTest, SignatureUpdateProcessorFactoryTest, HighlighterTest, TestIndexSearcher, TestTrie, TestRemoteStreaming, SpatialFilterTest, DocumentBuilderTest, CurrencyFieldTest, TestPseudoReturnFields, DisMaxRequestHandlerTest, BinaryUpdateRequestHandlerTest, DistanceFunctionTest, SolrInfoMBeanTest, MinimalSchemaTest, TestPHPSerializedResponseWriter, XmlUpdateRequestHandlerTest, FieldAnalysisRequestHandlerTest, TermVectorComponentTest, TestSurroundQueryParser, DocumentAnalysisRequestHandlerTest, IndexSchemaRuntimeFieldTest, TestSolrQueryParser, TestValueSourceCache, FastVectorHighlighterTest, DebugComponentTest, JSONWriterTest, RequestHandlersTest, RequiredFieldsTest, TestOmitPositions, CopyFieldTest, TestArbitraryIndexDir, LoggingHandlerTest, SolrCmdDistributorTest, UpdateParamsTest, CSVRequestHandlerTest, SolrCoreCheckLockOnStartupTest, TestSolrDeletionPolicy1, NoCacheHeaderTest, PrimitiveFieldTypeTest, FieldMutatingUpdateProcessorTest, BadComponentTest, TestBinaryField, TestSolrDeletionPolicy2, SOLR749Test, TestPropInjectDefaults, DefaultValueUpdateProcessorTest, TestDocSet, TestQuerySenderListener, TestCollationField, SolrIndexConfigTest, TestQuerySenderNoQuery, NumericFieldsTest, OutputWriterTest, TestNumberUtils, MultiTermTest, TestSolrCoreProperties, TestJmxMonitoredMap, TestBM25SimilarityFactory, TestLMDirichletSimilarityFactory, TestPerFieldSimilarity, LegacyHTMLStripCharFilterTest, TestLMJelinekMercerSimilarityFactory, TestDFRSimilarityFactory, TestCodecSupport, TestDefaultSimilarityFactory, DateMathParserTest, PrimUtilsTest, TestSystemIdResolver, DateFieldTest, SpellingQueryConverterTest, UUIDFieldTest, SystemInfoHandlerTest, PreAnalyzedFieldTest, PathHierarchyTokenizerFactoryTest, BasicDistributedZk2Test]
[junit4:junit4] Completed on J1 in 307.61s, 1 test, 1 failure <<< FAILURES!

[...truncated 52 lines...]
BUILD FAILED
/usr/home/hudson/hudson-slave/workspace/Lucene-Solr-Tests-4.x-Java6/build.xml:32: The following error occurred while executing this line:
/usr/home/hudson/hudson-slave/workspace/Lucene-Solr-Tests-4.x-Java6/solr/build.xml:179: The following error occurred while executing this line:
/usr/home/hudson/hudson-slave/workspace/Lucene-Solr-Tests-4.x-Java6/lucene/module-build.xml:63: The following error occurred while executing this line:
/usr/home/hudson/hudson-slave/workspace/Lucene-Solr-Tests-4.x-Java6/lucene/common-build.xml:1140: The following error occurred while executing this line:
/usr/home/hudson/hudson-slave/workspace/Lucene-Solr-Tests-4.x-Java6/lucene/common-build.xml:813: There were test failures: 231 suites, 954 tests, 1 failure, 7 ignored (2 assumptions)

Total time: 35 minutes 8 seconds
Build step 'Invoke Ant' marked build as failure
Recording test results
Email was triggered for: Failure
Sending email for trigger: Failure



Mime
View raw message